##TITLE=Analysis number 327459
Compound Code km 00448
Book Reference 234718
Project Code adrs  flro3
Chemist Name jom
##JCAMPDX= 6.0         $$ Bruker NMR JCAMP-DX V2.0
##DATA TYPE= NMR SPECTRUM
##DATA CLASS= NTUPLES
##ORIGIN= Bruker BioSpin GmbH
##OWNER= nmr
$$ XWIN-NMR		Version 3.5
$$ Mon Mar 26 16:23:23 2007 GMT Daylight Time (UT+1h)  MAYBRIDGE\nmr@NMR_250MHZ
##.OBSERVE FREQUENCY= 250.131544655141
##.OBSERVE NUCLEUS= ^1H
##.ACQUISITION MODE= SIMULTANEOUS (DQD)
##.ACQUISITION SCHEME= undefined
##.AVERAGES= 16
##.DIGITISER RES= 18
##SPECTROMETER/DATA SYSTEM= dpx250
##.PULSE SEQUENCE= zg30
##.SOLVENT NAME= DMSO
##.SHIFT REFERENCE= (INTERNAL, DMSO, 0, 16.522)
##AUDIT TRAIL= $$ (NUMBER, WHEN, WHO, WHERE, WHAT)
$$ ##TITLE= Audit trail, XWIN-NMR		Version 3.5
$$ ##JCAMPDX= 5.01
$$ ##ORIGIN= Bruker BioSpin GmbH
$$ ##OWNER= nmr
$$ C:\u/data/dgb/nmr/ADRS/2030/pdata/1/auditp.txt
$$ ##AUDIT TRAIL=  $$ (NUMBER, WHEN, WHO, WHERE, WHAT)
(   1,<2007-03-26 16:22:58.13 +100>,<MAYBRIDGE\nmr>,<NMR_250MHZ>,
      <created by zg, POWCHK disabled, PULCHK disabled
       configuration hash MD5:
       49 4B E0 1D 92 C2 6B 37 9F E6 65 BC 52 41 86 1D
       data hash MD5: 64K
       BD A3 06 6F EC 66 FE 62 E8 9A 6A EA 78 22 BE 91>)
(   2,<2007-03-26 16:23:12.25 +100>,<MAYBRIDGE\nmr>,<NMR_250MHZ>,
      <Start of raw data processing
       ef LB = 0.3 FT_mod = 6 PKNL = 1 SI = 32K 
       data hash MD5: 32K
       A3 53 69 2B 81 88 30 5F 23 B8 EC F1 51 95 85 C6>)
(   3,<2007-03-26 16:23:13.88 +100>,<MAYBRIDGE\nmr>,<NMR_250MHZ>,
      <apk 
       data hash MD5: 32K
       F0 61 E9 32 A5 D4 41 55 46 17 02 AF 48 CF AF 4B>)
(   4,<2007-03-26 16:23:14.58 +100>,<MAYBRIDGE\nmr>,<NMR_250MHZ>,
      <abs ABSG = 5 
       data hash MD5: 32K
       CE 88 34 D4 1F FE 8A 6D CA EE 15 D2 BD 6F EF FD>)
$$ ##END=
$$ 
$$ hash MD5
$$ C7 30 FC DE EA DA A9 B5 F2 E4 B9 3B 77 74 98 33
##$RELAX= 
##$RELAX= 
##$RELAX= 
##$RELAX= 
##$RELAX= 
##$RELAX= 
##$RELAX= 
$$ Bruker specific parameters
$$ --------------------------
##$DU= <C:\u>
##$EXPNO= 2030
##$NAME= <ADRS>
##$PROCNO= 1
##$TYPE= <nmr>
##$USER= <dgb>
##$AMP= (0..31)
100 100 100 100 100 100 100 100 100 100 100 100 100 100 100 100 100 100 
100 100 100 100 100 100 100 100 100 100 100 100 100 100 
##$AQSEQ= 0
##$AQ_mod= 3
##$AUNM= <au_zg>
##$AUTOPOS= <52 >
##$BF1= 250.13
##$BF2= 250.13
##$BF3= 250.13
##$BF4= 250.13
##$BF5= 500.13
##$BF6= 500.13
##$BF7= 500.13
##$BF8= 500.13
##$BYTORDA= 1
##$CFDGTYP= 0
##$CFRGTYP= 5
##$CHEMSTR= <none>
##$CNST= (0..31)
1 1 145 1 1 1 1 1 1 1 1 1 1 1 1 1 1 1 1 1 1 1 1 1 1 1 1 1 1 1 1 1 
##$CPDPRG= <>
##$CPDPRG1= <>
##$CPDPRG2= <>
##$CPDPRG3= <>
##$CPDPRG4= <mlev>
##$CPDPRG5= <mlev>
##$CPDPRG6= <mlev>
##$CPDPRG7= <mlev>
##$CPDPRG8= <mlev>
##$CPDPRGB= <>
##$CPDPRGT= <>
##$D= (0..31)
0 1 0 0 0 0 0 0 0 0.06 0 0 0 0 0 0 0.0002 0 0 0 0 0 0 0 0 0 0 0 0 0 0 
0 
##$DATE= 1174922577
##$DBL= (0..7)
120 120 120 120 120 120 120 120 
##$DBP= (0..7)
150 150 150 150 150 150 150 150 
##$DBP07= 0
##$DBPNAM0= <>
##$DBPNAM1= <>
$$ [...]
##$SUBNAM7= <"">
##$SUBNAM8= <"">
##$SUBNAM9= <"">
##$SW= 20.6930455092707
##$SWIBOX= (0..15)
0 0 3 0 0 0 0 0 0 0 0 0 0 0 0 0 
##$SW_h= 5175.983436853
##$TD= 65536
##$TD0= 1
##$TE= 683.16
##$TE2= 300
##$TE3= 300
##$TEG= 300
##$TL= (0..7)
0 120 120 120 120 120 120 120 
##$TP= (0..7)
150 150 150 150 150 150 150 150 
##$TP07= 0
##$TPNAME0= <>
##$TPNAME1= <>
##$TPNAME2= <>
##$TPNAME3= <>
##$TPNAME4= <>
##$TPNAME5= <>
##$TPNAME6= <>
##$TPNAME7= <>
##$TPOAL= (0..7)
0.5 0.5 0.5 0.5 0.5 0.5 0.5 0.5 
##$TPOFFS= (0..7)
0 0 0 0 0 0 0 0 
##$TUNHIN= 0
##$TUNHOUT= 0
##$TUNXOUT= 0
##$USERA1= <user>
##$USERA2= <user>
##$USERA3= <user>
##$USERA4= <user>
##$USERA5= <user>
##$V9= 5
##$VALIST= <valist>
##$VCLIST= <CCCCCCCCCCCCCCC>
##$VD= 0
##$VDLIST= <DDDDDDDDDDDDDDD>
##$VPLIST= <PPPPPPPPPPPPPPP>
##$VTLIST= <TTTTTTTTTTTTTTT>
##$WBST= 1024
##$WBSW= 4
##$XGAIN= (0..3)
0 0 0 0 
##$XL= 0
##$YL= 0
##$YMAX_a= 270058
##$YMIN_a= -263512
##$ZGOPTNS= <>
##$ZL1= 120
##$ZL2= 120
##$ZL3= 120
##$ZL4= 120
##$ABSF1= 16.522
##$ABSF2= -4.171173
##$ABSG= 5
##$ABSL= 3
##$ALPHA= 0
##$AQORDER= 0
##$ASSFAC= 0
##$ASSFACI= 0
##$ASSFACX= 0
##$ASSWID= 0
##$AUNMP= <proc_1d>
##$AZFE= 0.1
##$AZFW= 0.1
##$BCFW= 0
##$BC_mod= 0
##$BYTORDP= 0
##$COROFFS= 0
##$CY= 12.5
##$DATMOD= 1
##$DC= 0
##$DFILT= <>
##$DTYPP= 0
##$F1P= 14.0000005364418
##$F2P= -0.99999901652339
##$FCOR= 0.5
##$FTSIZE= 32768
##$FT_mod= 6
##$GAMMA= 0
##$GB= 0
##$INTBC= 1
##$INTSCL= 1
##$ISEN= 128
##$LB= 0.3
##$LEV0= 0
##$LPBIN= 0
##$MAXI= 10000
##$MC2= 0
##$MEAN= 0
##$ME_mod= 0
##$MI= 0
##$NCOEF= 0
##$NC_proc= -3
##$NLEV= 6
##$NOISF1= 0
##$NOISF2= 0
##$NSP= 0
##$NTH_PI= 0
##$NZP= 0
##$OFFSET= 16.522
##$PC= 1
##$PHC0= 219.4079
##$PHC1= 5.152948
##$PH_mod= 1
##$PKNL= yes
##$PPARMOD= 0
##$PSCAL= 4
##$PSIGN= 0
##$REVERSE= no
##$SF= 250.13
##$SI= 32768
##$SIGF1= 0
##$SIGF2= 0
##$SINO= 400
##$SIOLD= 32768
##$SREGLST= <1H.DMSO>
##$SSB= 0
##$STSI= 32768
##$STSR= 0
##$SW_p= 5175.98343685301
##$SYMM= 0
##$S_DEV= 0
##$TDeff= 65536
##$TDoff= 0
##$TI= <Analysis number 999999
Compound Code 99
Book Reference 9
Project Code 9>
##$TILT= no
##$TM1= 0
##$TM2= 0
##$TOPLEV= 0
##$USERP1= <user>
##$USERP2= <user>
##$USERP3= <user>
##$USERP4= <user>
##$USERP5= <user>
##$WDW= 1
##$XDIM= 32768
##$YMAX_p= 435474238
##$YMIN_p= -184506
$$ End of Bruker specific parameters
$$ ---------------------------------
##NTUPLES= NMR SPECTRUM
##VAR_NAME=  FREQUENCY,     SPECTRUM/REAL,   SPECTRUM/IMAG
##SYMBOL=    X,             R,               I
##VAR_TYPE=  INDEPENDENT,   DEPENDENT,       DEPENDENT
##VAR_FORM=  AFFN,          ASDF,            ASDF
##VAR_DIM=   32768,         32768,           32768
##UNITS=     HZ,            ARBITRARY UNITS, ARBITRARY UNITS
##FACTOR=    0.157963299565203, 1,           1
##FIRST=     4132.6476996994, 0,             0
##LAST=      -1043.33573715361, 0,           0
##MIN=       -1043.33573715361, -184506,     0
##MAX=       4132.6476996994, 435474238,     0
$$ Real data points
##PAGE= N=1
##DATA TABLE= (X++(R..R)), XYDATA
$$ [...]
$$ plain form
18520 -50864 -26805 -18065 -51682 -89651 -80130 -54586 -57750 -60492 -33508 -137 -2311 -21965 -40296
18507 -40296 -59999 -49344 -76793 -46405 -4242 -16172 -2510 -22766 -7764 -21711 -51010 -36135
18495 -36135 -14143 -7246 3788 -2704 14542 30168 40096 15860 -10177 -42305 -525 30162
18483 30162 24630 567 -42358 -33419 -26091 -70218 -79244 -31727 -12248 15964 6091 -14860 -5169
18470 -5169 -27688 -38388 -6538 5503 8214 11533 -4203 -39093 -40023 -31843 -56630 -20095 -21321
18457 -21321 -3574 10051 -23152 -25494 -14726 -22617 -63180 -63227 -48193 -30817 -29546 -43932 -49902
18444 -49902 -56601 -27217 -28354 -45054 -42676 -40692 -29963 -12955 14273 25441 -8556 -43412
18432 -43412 -29467 -13010 -456 -6599 24640 62097 45052 -4135 -7541 -29643 -49942 -69086
$$ packed form
18520e0864K4059Q740l3617l7969R521K5544l164k742K6984L3371k174j9654j8331
18507d0296j9703J0655k7449L0388M2163j1930J3662k0256J5002j3947k9299J4875
18495c6135K1992O897J1034o492J7246J5626R928k4236k6037l2128M1780L0687
18483C0162n532k4063m2925Q939P328m4127r026M7517J9479K8212r873k0951R691
18470e169k2519j0700L1850J2041K711L319j5736l4890r30Q180k4787L6535j226
18457b1321J7747J3625l3203k342J0768p891m0563m7J5034J7376J271j4386n970
18444d9902o699K9384j137j6700K378J984J0729J7008K7228J1168l3997l4856
18432d3412J3945J6457J2554o143L1239L7457j7045m9187l406k2102k0299j9144
$$ plain form
18420 -69086 -85038 -58565 -46337 -59153 -47446 -20134 -20942 -19133 -33684 -42611 -40972 -33786 -28615
18407 -28615 6076 -7481 -16522 -38392 -24797 10391 24117 28886 582 -35214 -32947 -92135
18395 -92135 -106105 -74508 -64229 -57873 -62609 -26725 -17524 1038 12278 -11308 -2182 1402 22067
18382 22067 15000 -13133 -29353 12369 24974 18585 4296 -11454 -29921 -9588 17645 -121
18370 -121 -20691 12367 14535 4798 3499 -6837 -25118 -25931 -24263 -25904 -31219 -2461 -13801 -15054
18356 -15054 -4760 4793 18547 -11737 -17976 -2557 16268 12324 5410 -2307 -13685 -14712 9458
18343 9458 -2878 -3088 -31125 -6386 27252 30618 19938 24115 25589 26967 31615 7836 -6173
18330 -6173 -11865 -19576 -16493 -10064 3945 5786 9983 -22594 -62611 -91878 -56455 -1718 -1791 4945
$$ packed form
18420f9086j5952K6473J2228j2816J1707K7312q08J809j4551q927J639P186N171
18407b8615L4691j3557r041k1870J3595L5188J3726M769k8304l5796K267n9188
18395i2135j3970L1597J0279O356m736L5884R201J8562J1240k3586R126L584K0665
18382B2067p067k8133j6220M1722J2605o389j4289j5750j8467K0333K7233j7766
18370a21k0570L3058K168r737j299j0336j8281q13J668j641n315K8758j1340j253
18356a5054J0294R553J3754l0284o239J5419J8825l944o914p717j1378j027K4170
18343I458j2336k10k8037K4739L3638L366j0680M177J474J378M648k3779j4009
18330f173n692p711L083O429J4009J841M197l2577m0017k9267L5423N4737p3O736
$$ plain form
18316 4945 -4121 10857 4810 -1452 -21015 -42090 -51880 -41417 -37824 -14581 -10373 -6152 -38333
18303 -38333 -67820 -76595 -96381 -98227 -42315 -5978 896 -17363 -25852 -33690 -43345 -8597 1229
18290 1229 -21446 -34346 -9209 -4848 9623 -14872 -50064 -28127 -15788 -29659 -38272 -49620
18278 -49620 -77917 -97888 -58305 -18538 -34305 -27196 -15797 -12157 -29617 -8855 -13123 -12162 -4047
18265 -4047 -10257 -11453 -8355 -5271 5056 26559 21241 -2321 -16235 -19153 -27390 -3181 31832
18252 31832 1227 -4753 16529 37388 34863 28499 28547 11110 -40287 -54094 -10030 -13723 1774
18239 1774 3047 -31269 -45948 -35657 -44322 -28789 -21131 909 13679 -8469 2444 -58 322
18226 322 4269 14667 29219 33497 24042 26540 14465 6209 -3947 28124 49439 30898 37409
$$ packed form
18316D945r066J4978o047o262j9563k1075r790J0463L593K3243M208M221l2181
18303c8333k9487q775j9786j846N5912L6337O874j8259q489p838r655L4748R826
18290A229k2675j2900K5137M361J4471k4495l5192K1937J2339j3871q613j1348
18278d9620k8297j9971L9583L9767j5767P109J1399L640j7460K0762m268R61Q115
18265d047o210j196L098L084J0327K1503n318k3562j3914k918q237K4209L5013
18252C1832l0605n980K1282K0859k525o364M8j7437n1397j3807M4064l693J5497
18239A774J273l4316j4679J0291q665J5533P658K2040J2770k2148J0913k502L80
18226C22L947J0398J4552M278r455K498j2075q256j0156L2071K1315j8541O511
$$ plain form
18213 37409 45142 48435 32028 115 12447 2848 -5740 -27598 6870 8754 12193 -9830 8426
18200 8426 -1337 -16157 -10844 -23840 -35077 -25265 -7541 7238 -8286 -41866 -50818 -74774 -48953
18187 -48953 -2593 12511 34306 49195 11195 -30597 -48453 -44885 -28481 -32379 1092 -6089
18175 -6089 -11784 -13676 -8880 -1572 -26168 -34261 -48084 -57993 -40817 -25886 -18964 -7966 -14692
18162 -14692 -33050 -75067 -66371 -50927 -39042 28260 45241 27411 4393 -25827 -35452 -50220
18150 -50220 -37991 9722 -4137 -42359 -45589 -72405 -67365 -53622 -48243 -31989 -53457 -50695
18138 -50695 -19201 3765 -15373 -54778 -74897 -75851 -78200 -12033 19635 -9624 -40355 -25427
18126 -25427 -3576 -513 -4948 -12021 22749 17644 8756 -15229 -39791 -66437 -47088 -31959 -26702
$$ packed form
18213C7409P733L293j6407l1913J2332r599q588k1858L4468J884L439k2023J8256
18200H426r763j4820N313j2996j1237R812J7724J4779j5524l3580q952k3956K5821
18187d8953M6360J5104K1795J4889l8000m1792j7856L568J6404l898L3471p181
18175f089n695j892M796P308k4596q093j3823r909J7176J4931O922J0998o726
18162a4692j8358m2017Q696J5444J1885O7302J6981j7830k3018l0220r625j4768
18150e0220J2229M7713j3859l8222l230k6816N040J3743N379J6254k1468K762
18138e0695L1494K2966j9138l9405k0119r54k349O6167L1668k9259l0731J4928
18126b5427K1851L063m435p073L4770n105q888k3985k4562k6646J9349J5129N257
$$ plain form
18113 -26702 -23518 -30217 28636 28814 -15444 -9029 -26902 -33401 -47986 -59398 -29932 11908 39292
18100 39292 52359 45303 25475 7484 7613 2099 -2379 -8253 -26746 -53258 -48725 -36198 -51
18087 -51 -7462 -7780 -9427 -10119 14891 29527 33125 44212 43936 34862 31482 30277 19649 -10323 325
18072 325 38058 29420 12942 22094 45864 20204 1090 -31991 -56835 -79636 -89309 -84713 -83308
18059 -83308 -88401 -60794 -29384 -14057 -14659 -29976 -19308 -36707 -20060 18418 35717 22324
18047 22324 -34954 -45201 -35270 -33434 -2457 -900 -16924 -22801 -33778 -51012 -36170 -8952
18035 -8952 -28467 -46444 -49466 -45285 -25950 -36956 -25566 6238 -2907 5360 10177 -16821 -13291
18022 -13291 -2168 22458 64590 73729 16701 -15363 2685 -3750 -15121 -108 14916 10018
$$ packed form
18113b6702L184o699N8853J78m4258O415j7873o499j4585j1412K9466M1840K7384
18100C9292J3067p056j9828j7991J29n514m478n874j8493k6512M533J2527L6147
18087e1p411l18j647o92K5010J4636L598J1087k76r074l380j205j0628k9972J0648
18072C25L7733q638j6478R152K3770k5660j9114l3081k4844k2801r673M596J405
18059h3308n093K7607L1410J5327o02j5317J0668j7399J6647L8478J7299j3393
18047B2324n7278j0247R931J836L0977J557j6024n877j0977j7234J4842K7218
18035h952j9515j7977l022M181J9335j1006J1390L1804r145Q267M817k6998L530
18022a3291J1123K4626M2132R139n7028l2064J8048o435j1371J5013J5024m898
$$ plain form
18010 10018 -4791 -12682 17669 8742 3929 16857 50761 82100 64365 22475 -2385 12113
17998 12113 23019 12304 -10460 2511 -10485 -23136 -9323 474 7331 -708 5738 -7182
17986 -7182 -20340 -38480 -57083 -64976 -78714 -78334 -75211 -45439 -6031 30648 38549 10246 -20132
17973 -20132 -9143 23420 -853 -23056 -17346 -32574 -20777 -6938 -21699 -29959 -11941 3658
17961 3658 8696 20969 17430 7586 -4926 -24143 -44875 -58091 -48908 -41107 -39760 -37970 -52233
17948 -52233 -35935 -16595 -17375 -12639 31085 57393 9677 7017 19115 31570 27510 2798 -16298
17935 -16298 -32925 -52974 -42549 -13959 -13530 -6122 5521 -19186 -18324 -6524 -1192 -15054 -26680
17922 -26680 -30341 -31120 -32508 -42405 -30752 -30243 -9993 29104 22918 16083 -5199 35439 54363
$$ packed form
18010A0018j4809p891L0351q927m813J2928L3904L1339j7735m1890k4860J4498
17998A2113J0906j0715k2764J2971j2996j2651J3813R797O857q039O446j2920
17986g182j3158j8140j8603p893j3738L80L123K9772L9408L6679P901k8303l0378
17973b0132J0989L2563k4273k2203N710j5228J1797J3839j4761q260J8018J5599
17961C658N038J2273l539r844j2512j9217k0732j3216R183P801J347J790j4263
17948e2233J6298J9340p80M736M3724K6308m7716k660J2098J2455m060k4712j9096
17935a6298j6627k0049J0425K8590M29P408J1643k4707Q62J1800N332j3862j1626
17922b6680l661p79j388r897J1653N09K0250L9097o186o835k1282M0638J8924
$$ plain form
17909 54363 37529 27548 17520 24987 -4918 -15669 -13027 -10534 18995 18775 13431 22986 -4412
17896 -4412 3383 25558 13777 -4138 6296 5314 -20557 -35951 -39788 -5257 32595 18021 -8805
17883 -8805 20 4373 -4794 -19381 31126 55979 37619 53579 26205 16420 10091 13353 25846
17870 25846 11289 16083 16555 25244 36895 27665 5576 4936 28840 1069 -40368 -29279 -33481
17857 -33481 -45888 -38852 -5219 -8147 99 38697 70581 73716 55909 8708 -8913 -5596 -17890
17844 -17890 -21365 6237 18895 19029 40380 24669 6291 23185 13580 24733 17706 21572 10411
17831 10411 23413 23718 4283 -966 -5958 2455 14534 8138 20607 14837 -4890 -42971 -54189
17818 -54189 -36589 -24792 -24574 -19008 30414 35227 18045 -705 3169 -2211 12959 27584 25110
$$ packed form
17909E4363j6834r981j0028P467k9905j0751K642K493K9529k20n344R555k7398
17896d412P795K2175j1781j7915J0434r82k5871j5394l837L4531L7852j4574k6826
17883h805Q825M353r167j4587N0507K4853j8360J5960k7374r785o329L262J2493
17870B5846j4557M794M72Q689J1651r230k2089o40K3904k7771m1437J1089m202
17857c3481j2407P036L3633k928Q246L8598L1884L135j7807m7201j7621L317j2294
17844a7890l475K7602J2658J34K1351j5711j8378J6894r605J1153p027L866j1161
17831A0411J3002L05j9435n249m992Q413J2079o396J2469n770j9727l8081j1218
17818e4189J7600J1797K18N566M9422M813j7182j8750L874n380J5170J4625k474
$$ plain form
17805 25110 37469 84124 131711 196031 261164 295732 269655 205844 154065 139439 112276 99193
17793 99193 108436 109536 89463 64789 94397 126859 131912 134228 90313 94149 98101 122485 154780
17780 154780 189902 267393 314880 316686 253989 184959 120174 88561 62028 28870 27876 35560
17768 35560 7059 17598 11088 5355 12070 18094 41494 50779 30884 8423 -18477 -6453 18506
17755 18506 19663 -9984 -33557 -13385 -6886 -5329 14612 24015 32913 28586 -7720 -3075 -23915
17742 -23915 -34310 5116 2359 -4462 -684 30689 -13 -28791 -28744 -36545 -52562 -36930 -14660
17729 -14660 -7472 -405 -13759 -17346 8284 13709 23685 9013 -9819 -3443 21546 21756 -25286
17716 -25286 -41086 -20103 -8216 -6749 -7933 5310 22684 39509 59694 25515 45513 30803
$$ packed form
17805B5110J2359M6655M7587O4320O5133L4568k6077o3811n1779j4626k7163j3083
17793I9193R243J100k0073k4674K9608L2462N053K316m3915L836L952K4384L2295
17780A54780L5122P7491M7487J806o2697o9030o4785l1613k6533l3158r94P684
17768C5560k8501J0539o510n733O715O024K3400R285j9895k2461k6900J2024K4959
17755A8506J157k9647k3573K0172O499J557J9941R403Q898m327l6306M645k0840
17742b3915j0395L9426k757o821L778L1373l0702k8778M7p801j6017J5632K2270
17729a4660P188P067j3354l587K5630N425R976j4672j8832O376K4989K10m7042
17716b5286j5800K0983J1887J467j184J3243J7374J6825K0185l4179J9998j4710
$$ plain form
17704 30803 8814 21836 29926 16591 32591 29765 29241 34224 53995 28005 22582 27944 36040
17691 36040 62640 37017 8277 -38989 -45747 -36049 -12286 28006 2753 4943 28283 15100
17679 15100 -27311 -49512 -24443 11729 33957 38560 43705 21875 -5436 18297 42516 37358
17667 37358 44236 63325 62491 88338 101853 71521 37044 14588 12634 39088 55799 37734
17655 37734 16834 23976 34249 41680 56462 80622 68392 71547 84767 17861 -5962 8464
17643 8464 7863 15859 22898 5412 -17643 9536 47426 21008 -10305 -1622 12517 23735 -6721
17630 -6721 -15481 13026 14068 -3435 -11793 -29594 -26507 -44633 -31366 -36329 -27339 -4522 16486
17617 16486 39277 11707 -3353 -12879 -5604 24026 38378 17936 32860 43356 60453 57562
$$ packed form
17704C0803k1989J3022Q090j3335J6000k826n24M983J9771k5990n423N362Q096
17691C6040K6600k5623k8740m7266o758R698K3763M0292k5253K190K3340j3183
17679A5100m2411k2201K5069L6172K2228M603N145k1830k7311K3733K4219n158
17667C7358O878J9089q34K5847J3515l0332l4477k2456j954K6454J6711j8065
17655C7734k0900P142J0273P431J4782K4160j2230L155J3220o6906k3823J4426
17643H464o01P996P039j7486k3055K7179L7890k6418l1313Q683J4139J1218l0456
17630f721q760K8507J042j7503q358j7801L087j8126J3267m963Q990K2817K1008
17617A6486K2791k7570j5060r526P275K9630J4352k0442J4924J0496J7097k891
$$ plain form
17605 57562 31485 17603 -6091 2354 22144 45034 21199 25192 34363 10287 12716 27054
17593 27054 82302 89957 87120 36193 5017 3313 23677 36725 56769 69365 84085 88879
17581 88879 82397 45234 3989 9105 40134 33052 -8492 -23747 -11185 14577 32344 29902
17569 29902 10086 6503 -952 17438 25399 53132 50171 42932 48076 55393 878 -36896 -56911
17556 -56911 -50603 -45424 -33988 -55049 -23865 -18587 -21742 -42705 -33166 -9671 41425 47751 54773
17543 54773 47852 29670 41261 61644 66577 72859 72232 68356 54009 16027 -11394 -3971 -57970
17530 -57970 -49504 -28791 -17229 4942 5147 1669 27635 60763 56901 58766 62185 76681 48484
17517 48484 50557 47859 47907 67136 54772 36496 26306 6553 -15870 -15579 -2802 5323 9653
$$ packed form
17605E7562k6077j3882k3694Q445J9790K2890k3835L993R171k4076K429J4338
17593B7054N5248P655k837n0927l1176j704K0364J3048K0044J2596J4720M794
17581H8879o482l7163m1245N116L1029p082m1544j5255J2562K5762J7767k442
17569B9902j9816l583p455J8390P961K7733k961p239N144P317n4515l7774k0015
17556e6911O308N179J1436k1061L1184N278l155k0963R539K3495N1096O326P022
17543E4773o921j8182J1591K0383M933O282o27l876j4347l7982k7421P423n3999
17530e7970Q466K0713J1562K2171K05l478K5966L3128l862J865L419J4496k8197
17517D8484K073k698M8J9229j2364j8276j0190j9753k2423K91J2777Q125M330
$$ plain form
17504 9653 9496 1656 3043 18394 30782 29427 35915 38607 52836 52861 47032 1505 -479 34176
17490 34176 20900 -17626 -31139 -16461 -128 25121 39685 16225 10788 11717 -854 19025
17478 19025 8770 267 -14437 -23300 10789 36263 42672 26418 12854 12473 31000 54927 43342
17465 43342 49209 58634 66680 52389 45084 17087 9349 -7607 13395 30320 21461 41817 29261
17452 29261 -2621 -14557 -6951 2589 1507 -2136 8678 36208 30645 49433 16899 643 21832
17439 21832 46586 41374 6388 17609 38190 61394 62588 53917 46949 48793 29631 -2040 -39232
17426 -39232 -40570 -6141 -1414 -4977 6842 -7101 -35716 -56891 -59793 -45871 -38950 -59959 -47840
17413 -47840 -6720 9464 32498 13651 -2083 986 5943 14921 -11262 1416 33567 58139
$$ packed form
17504I653j57p840J387J5351J2388j355O488K692J4229K5n829m5527j984L4655
17490C4176j3276l8526j3513J4678J6333K5249J4564k3460n437R29j2571J9879
17478A9025j0255q503j4704q863L4089K5474O409j6254j3564l81J8527K3927j1585
17465D3342N867R425Q046j4291p305k7997p738j6956K1002J6925q859K0356j2556
17452B9261l1882j1936P606R540j082l643J0814K7530n563J8788l2534j6256K1189
17439B1832K4754n212l4986J1221K0581K3204J194q671o968J844j9162l1671l7192
17426c9232j338L4429M727l563J1819j3943k8615k1175k902J3922O921k1009J2119
17413d7840M1120J6184K3034j8847j5734L069M957Q978k6183J2678L2151K4572
$$ plain form
17401 58139 48265 -4513 -34430 -33207 -31021 24154 55577 37413 46403 65405 48285 3957
17389 3957 3898 37863 16135 -32234 -21351 -14262 -16079 10693 47711 59958 50907 36373 22318
17376 22318 21157 23180 70634 69157 69189 57588 33947 38433 48407 56535 60441 38076 44564 26809
17362 26809 9266 14615 15971 12292 34467 36818 365 -14514 -22323 -6367 33233 64543 81896
17349 81896 69701 34948 56175 67989 87906 96049 73985 46780 66196 81323 59606 58087
17337 58087 80759 49252 4121 -23574 -9534 22732 39005 29934 23992 42526 64479 71966
17325 71966 64753 46237 63848 81583 92840 114493 141398 149445 156503 119523 83445 53756
17313 53756 751 -63137 -71918 -45605 -36302 -9540 -5169 10498 11510 37193 38325 10376 -26526
$$ packed form
17401E8139r874n2778k9917J223K186N5175L1423j8164Q990J9002j7120m4328
17389C957n9L3965k1728m8369J0883P089j817K6772L7018J2247r051j4534j4055
17376B2318j161K023M7454j477L2j1601k3641M486R974Q128L906k2365O488j7755
17362B6809j7543N349J356l679K2175K351l6453j4879p809J5956L9600L1310J7353
17349H1896j2195l4753K1227J1814J9917Q143k2064k7205J9416J5127k1717j519
17337E8087K2672l1507m5131k7695J4040L2266J6273r071n942J8534K1953P487
17325G1966p213j8516J7611J7735J1257K1653K6905Q047P058l6980l6078k9689
17313E3756n3005o3888q781K6313R303K6762M371J5667J012K5683J132k7949l6902
$$ plain form
17300 -26526 -34503 734 28222 46600 44162 50924 45131 40069 81871 82647 55112 24831 33806
17287 33806 28824 29380 32651 34853 49660 72547 78469 66783 60758 92590 128143 124894 122046
17274 122046 104060 99786 128046 107411 67105 104885 123545 118397 139753 188334 210507 220109
17262 220109 209290 179495 160034 165109 189262 263109 322103 326631 306921 277016 275471 288212
17250 288212 303441 328566 367520 403312 430182 425574 425875 468393 540349 601171 646392 717438
17238 717438 810530 935714 1086164 1285122 1362653 1281844 1188597 1223962 1351817 1501336
17228 1501336 1706739 1819368 1924829 2039336 2212369 2523361 2937601 3477315 4191011
17219 4191011 5252791 6780819 9113531 12836522 19039295 29225602 44737798 66226717
$$ packed form
17300b6526p977L5237K7488J8378k438O762n793n062M1802P76k7535l0281Q975
17287C3806m982N56L271K202J4807K2887N922j1686o025L1832L5553l249k848
17274A22046j7986m274K8260k0635m0306L7780J8660n148K1356M8581K2173R602
17262B20109j0819k9795j9461N075K4153P3847N8994M528j9710k9905j545J2741
17250B88212J5229K5125L8954L5792K6870m608L01M2518P1956O0822M5221P1046
17238G17438R3092J25184J50450J98958P7531q0809r3247L5365J27855J49519
17228A501336K05403J12629J05461J14507J73033L10992M14240N39714P13696
17219D191011J061780J528028K332712L722991O202773J0186307J5512196K1488919
$$ plain form
17211 66226717 88576645 90965972 66783188 41676064 26691376 18518724 13797905
17204 13797905 10864593 8906684 7534681 6641208 6164780 6041138 6210752 6686267 7652167
17195 7652167 9317899 12097560 16784986 24672283 37154952 55364380 78214495 92245512
17187 92245512 77939317 50584152 31164414 20295527 14137400 10456296 8100762
17180 8100762 6382887 5111082 4202752 3522606 3029669 2648069 2335492 2084839 1927663
17171 1927663 1836114 1765963 1679351 1525197 1384566 1317755 1309708 1276043 1136871 925220 730570
17160 730570 600180 548834 511146 480353 479428 465150 415306 325175 264253 268665 286735 294097
17148 294097 282563 271872 267320 289054 286878 261778 227450 210834 210408 196731 178828 177666
$$ packed form
17211F6226717K2349928K389327k4182784k5107124j4984688q172652m720819
17204A3797905k933312j957909j372003q93473m76428j23642J69614M75515R65900
17195G652167J665732K779661M687426P887297J2482669J8209428K2850115J4031017
17187I2245512j4306195k7355165j9419738j0868887o158127l681104k355534
17180H100762j717875j271805r08330o80146m92937l81600l12577k50653j57176
17171A927663r1549p0151q6612j54154j40631o6811q047l3665j39172k11651j94650
17160G30570j30390n1346l7688l0793r25j4278m9844r0131o0922M412J8070P362
17148B94097j1534j0691m552K1734k176k5100l4328j6616m26j3677j7903j162
$$ plain form
17136 177666 194278 187569 194251 163091 155331 173362 159927 157328 128790 75219 81260 102265
17124 102265 113987 123760 92548 91654 104533 129226 104192 72550 81653 82005 81353 99237 77384
17111 77384 54083 69422 75724 86856 79467 42285 43504 150 -9478 24684 24047 19466 31507
17098 31507 34356 59855 91401 69589 48709 79568 85458 49873 96949 116192 119829 155810
17086 155810 147472 132974 75566 65811 72740 50650 32582 65686 118484 127719 70485 77148
17074 77148 92724 87462 70793 46211 57934 51993 58598 61025 64441 54075 107016 135489 99821
17061 99821 53137 56419 65669 55307 48466 36043 21622 10603 -20712 -17429 -21523 -30590 -30066
17048 -30066 -12862 10144 21489 -1754 -7277 -4155 -1762 -36607 -47472 10798 45107 50811
$$ packed form
17136A77666J6612o709O682l1160p760J8031j3435k599k8538n3571O041K1005
17124A02265J1722R773l1212q94J2879K4693k5034l1642R103L52o52J7884k1853
17111G7384k3301J5339O302J1132p389l7182J219m3354r628L4162o37m581J2041
17098C1507K849K5499L1546k1812k0880L0859N890l5585M7076J9243L637L5981
17086A55810q338j4498n7408r755O929k2090j8068L3104N2798R235n7234O663
17074G7148J5576n262j6669k4582J1723n941O605K427L416j0366N2941K8473l5668
17061I9821m6684L282R250j0362o841j2423j4421j1019l1315L283m094r067N24
17048c0066J7204K3006J1345k3243n523L122K393l4845j0865N8270L4309N704
$$ plain form
17036 50811 62336 19890 -2015 -20081 -10259 -715 23441 24444 -4692 -13719 -22774 -4739 10416
17023 10416 -25503 -36364 -53194 -58242 -37477 -7899 14374 -206 39313 69811 67057 54339
17011 54339 8162 18489 16707 42623 9296 -6573 -18674 -5160 5167 25321 16808 20120
16999 20120 48269 39887 46416 51322 55255 68251 80090 68032 48292 39142 43505 55820 38493
16986 38493 21462 -2002 -35094 -55739 -48931 -46332 -18972 -3989 1427 -23609 -10147 -9676 -16057
16973 -16057 8888 5722 -18438 -38495 9802 42846 4257 -24068 -9574 -24089 -27663 -38384
16961 -38384 -49704 -36044 -8925 835 -2142 -3065 19625 33637 8470 -35105 -51710 -39267
16949 -39267 -25870 -9233 -4005 -2304 -1406 10407 43785 46980 31652 33362 4659 -17906 -36524
$$ packed form
17036E0811J1525m2446k1905j8066R822R544K4156J003k9136r027r055J8035J5155
17023A0416l5919j0861j6830n048K0765K9578K2273j4580L9519L0498k754j2718
17011E4339m6177J0327j782K5916l3327j5869j2101J3514J0327K0154q513L312
16999B0120K8149q382O529M906L933J2996J1839j2058j9740r150M363J2315j7327
16986C8493j7031k3464l3092k0645O808K599K7360J4983N416k5036J3462M71o381
16973a6057K4945l166k4160k0057M8297L3044l8589k8325J4494j4515l574j0721
16961c8384j1320J3660K7119R760k977r23K2690J4012k5167m3575j6605J2443
16949c9267J3397J6637N228J701Q98J1813L3378L195j5328J710k8703k2565j8618
$$ plain form
16936 -36524 -24760 -12274 15592 10252 5443 13955 5652 2318 18677 6764 -25061 -23035 -3602
16923 -3602 -369 26037 26323 -15148 -26262 -17879 -29843 -52463 -41017 -1778 26332 18672 -5378
16910 -5378 -39211 -55864 -13857 17038 -4630 -15171 -3085 11697 5359 -10627 21146 9938
16898 9938 7192 18147 1232 -19316 -46943 -17234 6228 6393 8469 4329 -10687 -55042 -76095
16885 -76095 -67290 -44128 -27251 -43253 -4496 7002 -8092 -11218 -26970 -34525 -45906 -46029 -66759
16872 -66759 -89388 -94678 -59299 -40368 -24794 -16075 8964 -2736 2522 18623 19222 25393 6258
16859 6258 -1802 -3101 -36809 -63738 -94277 -86291 -91167 -59280 -55299 -72141 -73755 -70349 -74981
16846 -74981 -46767 -30832 -37227 -75596 -90187 -70045 -69786 -20755 -20107 -63592 -97734 -104354 -76082
$$ packed form
16936c6524J1764J2486K7866n340m809Q512q303l334J6359j1913l1825K026J9433
16923c602L233K6406K86m1471j1114Q383j1964k2620J1446L9239K8110p660k4050
16910e378l3833j6653M2007L0895k1668j0541J2086J4782o338j5986L1773j1208
16898I938k746J0955j6915k0548k7627K9709K3462J65K076m140j5016m4355k1053
16885g6095Q805K3162J6877j6002L8757J1498j5094l126j5752p555j1381j23k0730
16872f6759k2629n290L5379J8931J5574Q719K5039j1700N258J6101N99O171j9135
16859F258q060j299l3708k6929l0539P986m876L1887L981j6842j614L406m632
16846g4981K8214J5935o395l8369j4591K0142K59M9031O48m3485l4142o620K8272
$$ plain form
16833 -76082 -37958 -40641 -21190 10356 17040 -85 40451 47827 45614 59071 52714 24651 42117
16820 42117 43455 25359 18634 11366 -11043 -31483 6428 31747 29682 15004 -33086 -31377 -31329
16807 -31329 -38819 -45781 -24048 -891 11635 22658 18102 -13240 -31453 -29921 -42003 -17768
16795 -17768 -34548 -29420 -4761 13460 -6475 -41776 -40822 -26462 4396 20522 21119 -2077 -39706
16782 -39706 -63808 -43770 -55942 -31649 -20587 -10968 13411 -5350 7432 29802 30695 32234
16770 32234 6350 13869 23830 -3795 -7963 -4041 -260 -2597 -14354 -15344 -14111 6485 10620 2178
16756 2178 35109 71899 56618 48377 32431 11137 27616 36389 26204 9819 13945 30619
16744 30619 41613 45320 29212 19574 28287 26250 2382 -42755 -81959 -58277 -3938 9968
$$ packed form
16833g6082L8124k683J9451L1546O684j7125M0536P376k213J3457o357k8063J7466
16820D2117J338j8096o725p268k2409k0440L7911K5319k065j4678m8090J709M8
16807c1329p490o962K1733K3157J2526J1023m556l1342j8213J532j2082K4235
16795a7768j6780N128K4659J8221j9935l5301R54J4360L0858J6126N97k3196l7629
16782c9706k4102K0038j2172K4293J1062R619K4379j8761J2782K2370Q93J539
16770C2234k5884P519R961k7625m168L922L781k337j1757r90J233K0596M135q442
16756B178L2931L6790j5281q241j5946k1294J6479Q773j0185j6385M126J6674
16744C0619J0994L707j6108r638Q713k037k3868m5137l9204K3682N4339J3906
$$ plain form
16732 9968 11070 -6906 -12520 -29659 -13419 -518 -15756 -13534 -8463 -29492 8884 18606 13662
16719 13662 17852 -39253 -53031 -9588 -21801 -52339 -79663 -61736 -48681 -36590 -44818 -49270
16707 -49270 -44338 -51573 -52252 -61672 -48357 -34246 -28853 -28469 -35696 -57962 -70270 -90472 -54908
16694 -54908 -45370 -37061 -46139 -43863 -23583 -22175 -16390 -18828 -28149 -42482 -39258 -24908 -9725
16681 -9725 -46697 -43126 -35686 -43861 -34091 -21991 -17836 973 11492 640 -7754 -2092 12780
16668 12780 -24116 -45622 -28330 -12331 18627 20378 34363 43285 57660 44392 28396 36703
16656 36703 6315 -37194 -41761 -38193 -30599 -17591 1326 -31786 -75445 -38509 -10965 -54
16644 -54 -16708 -33071 -41801 -55626 -50305 -15118 9836 21506 41275 51952 33912 30572 38561
$$ packed form
16732I968J102j7976n614j7139J6240J2901j5238K222N071k1029L8376R722m944
16719A3662M190n7105j3778M3443j2213l0538k7324J7927J3055J2091q228m452
16707d9270M932p235o79r420J3315J4111N393L84p227k2266j2308k0202L5564
16694e4908R538Q309r078K276K0280J408N785k438r321j4333L224J4350J5183
16681i725l6972L571P440q175R770J2100M155J8809J0519j0852q394N662J4872
16668A2780l6896k1506J7292J5999L0958J751J3985Q922J4375j3268j5996Q307
16656C6703l0388m3509m567L568P594J3008J8917l3112m3659L6936K7544J0911
16644e4j6654j6363q730j3825N321L5187K4954J1670J9769J0677j8040l340P989
$$ plain form
16631 38561 35033 23447 42838 56716 57624 78051 88387 71816 25897 39649 58546 31675
16619 31675 42993 127663 200561 258030 330565 361643 333753 272217 198955 144876 75872 53702
16607 53702 89818 105146 105599 76332 73741 99372 90838 59338 70330 106967 122237 153782
16595 153782 200426 245127 301275 327125 294716 237487 167184 104904 78379 60372 31679
16584 31679 51316 67390 29646 12123 -2970 16777 29666 15268 9865 -17067 -14700 -6974
16572 -6974 -4250 17694 572 -21165 -37031 -4543 9318 -15941 -28631 -6058 1455 -1240
16560 -1240 22505 32457 8536 -21910 -33671 -20404 -20288 -18034 -4020 11758 41689 47020 2161
16547 2161 -27833 -21453 -27284 -9438 9064 4583 -26937 -14101 -3360 7364 7499 -3879 2033
$$ packed form
16631C8561l528j1586J9391J3878R08K0427J0336j6571m5919J3752J8897k6871
16619C1675J1318Q4670P2898N7469P2535L1078k7890o1536p3262n4079o9004k2170
16607E3702L6116J5328M53k9267k591K5631q534l1500J0992L6637J5270L1545
16595A53782M6644M4701N6148K5850l2409n7229p0303o2280k6525j8007k8693
16584C1679J9637J6074l7744j7523j5093J9747J2889j4398n403k6932K367P726
16572f974K724K1944j7122k1737j5866L2488J3861k5259j2690K2573P513k695
16560a240K3745R952k3921l0446j1761J3267J16K254J4014J5778K9931N331m4859
16547B161k9994O380n831J7846J8502m481l1520J2836J0741J0724J35j1378N912
$$ plain form
16534 2033 11918 17487 6566 -18368 -47322 -52089 -51565 -52252 -75913 -49171 -47127 -63520 -57193 -45049
16520 -45049 -39303 -22546 -8409 -2159 11787 618 -37771 -51085 -44048 -70771 -49638 -26962
16508 -26962 -29176 -25883 -32481 -34171 -32772 -17772 -15874 -22674 -12081 -25094 -16141 -37035 -56022
16495 -56022 -64129 -45839 -17878 -68793 -92294 -85611 -44426 -9423 -17355 -11832 -51902 -46837 -6486
16482 -6486 -13024 -33395 -58323 -94776 -74079 -46892 -808 -27796 -53202 -55002 -35849 -11124
16470 -11124 -6769 7794 6657 -6329 -27016 -48014 -38101 -6814 4717 -3791 -31395 -21095
16458 -21095 -24141 -46949 -58617 -67438 -42073 -65115 -57043 -26914 -7088 -4416 -9511 14 -26692
16445 -26692 -50044 -18577 -327 -43085 -42124 -33180 -47955 -55163 -22571 -7076 5005 30485
$$ packed form
16534B033R885N569j0921k4934k8954m767N24o87k3661K6742K044j6393O327J2144
16520d5049N746J6757J4137O250J3946j1169l8389j3314P037k6723K1133K2676
16508b6962k214L293o598j690J399J5000J898o800J0593j3013Q953k0894j8987
16495e6022q107J8290K7961n0915k3501O683M1185L5003p932N523m0070N065M0351
16482f486o538k0371k4928l6453K0697K7187M6084k6988k5406j800J9153K4725
16470a1124M355J4563j137j2986k0687k0998R913L1287J1531q508k7604J0300
16458b1095l046k2808j1668q821K5365k3042Q072L0129J9826K672n095R525k6706
16445b6692k3352L1467J8250m2758R61Q944j4775p208L2592J5495J2081K5480
$$ plain form
16433 30485 18731 -25986 -51894 -70597 -50102 -22876 -14782 -18655 -43821 -51844 -48290 -26525
16421 -26525 -5389 3472 29443 15232 -41604 -42918 -59793 -64608 -53853 -16482 -15584 -25062 -7532
16408 -7532 19951 22124 23584 48133 60152 27317 -18475 -32658 -19338 -21174 -5776 -30167
16396 -30167 -55528 -35259 -37489 -81242 -77424 -100838 -87463 -34363 12161 24416 43713 50773
16384 50773 15597 -34956 -44382 -49654 -29191 -21367 -33519 -51420 -26206 -23312 -28374 -19525 -17456
16371 -17456 -31375 -25437 -55388 -83683 -73542 -45337 -32038 -26730 -40255 -22505 -49601 -65818
16359 -65818 -62766 -53818 -62059 -47104 -33615 -46619 -27625 4847 -17040 -20430 -20921 -24372 -152
16346 -152 -3085 8108 22153 21765 15134 26430 -5634 -24950 -36934 -41706 -7920 -29305 -19042
$$ packed form
16433C0485j1754m4717k5908j8703K0495K7226Q094l873k5166q023L554K1765
16421b6525K1136Q861K5971j4211n6836j314j6875m815J0755L7371Q98r478J7530
16408g532K7483K173J460K4549J2019l2835m5792j4183J3320j836J5398k4391
16396c0167k5361K0269k230m3753L818k3414J3375N3100M6524J2255J9297P060
16384E0773l5176n0553r426n272K0463P824j2152j7901K5214K894n062Q849K069
16371a7456j3919N938k9951k8295J0141K8205J3299N308j3525J7750k7096j6217
16359f5818L052Q948q241J4955J3489j3004J8994L2472k1887l390m91l451K4220
16346a52k933J1193J4045l88o631J1296l2064j9316j1984m772L3786k1385J0263
$$ plain form
16333 -19042 2836 -32964 -35303 -23736 -2613 9410 -22537 -48912 -40350 2009 40061 57163
16321 57163 46082 30499 42879 33247 49139 32621 -2943 -54711 -65539 -30316 9344 -865
16309 -865 11679 26473 35742 38077 26701 -5232 2029 44666 23266 13294 -10082 18330 38650
16296 38650 25257 -16983 -17697 -11519 -21522 -20979 -4991 -27021 -44488 -27314 2208 36276 42139
16283 42139 12046 14051 25874 8720 11868 21214 18156 23993 5470 59 -43768 -43894 -18540
16270 -18540 437 28859 25261 -24427 -8469 4827 -19376 -51666 -42582 -38284 -41351 -41886 -19276
16257 -19276 -15266 -15837 -10214 -5543 -5866 -26102 -62764 -59317 -81381 -61823 -55025 -66701 -38711
16244 -38711 -7939 -31010 -59435 -55061 -48086 -19837 -18643 -27030 -46349 -52189 -50106 -11651 5628
$$ packed form
16333a9042K1878l5800k339J1567K1123J2023l1947k6375Q562M2359L8052J7102
16321E7163j1081j5583J2380r632J5892j6518l5564n1768j0828L5223L9660j0209
16309h65J2544J4794R269K335j1376l1933P261M2637k1400r972k3376K8412K0320
16296C8650j3393m2240p14O178j0003N43J5988k2030j7467J7174K9522L4068N863
16283D2139l0093K005J1823j7154L148R346l058N837j8523n411m3827j26K5354
16270a8540J8977K8422l598m9688J5958J3296k4203l2290R084M298l067n35K2610
16257a9276M010n71N623M671l23k0236l6662L447k2064J9558O798j1676K7990
16244c8711L0772k3071k8425M374O975K8249J194q387j9319n840K083L8455J7279
$$ plain form
16231 5628 -3895 -9248 -13158 -26963 -40314 -20641 -9928 -15629 -25302 -38753 -56676 -44049 -5508
16218 -5508 2100 -6167 -43066 -21858 -5726 23960 13059 -9282 -1282 6285 -11620 14505 39700
16205 39700 5564 -25773 -19438 -26381 -34800 -20707 -30843 -48614 -26377 -27775 -23384 -31983 -23752
16192 -23752 4034 -17418 -17347 -27140 -68582 -87942 -57464 -13214 -7421 -33532 -47596 -39439 -35164
16179 -35164 -30038 -61490 -38604 -34178 -45997 -39481 -39008 -1277 11389 -29634 -41366 4357 18161
16166 18161 -774 2521 -1192 -16802 -18516 -21259 -35466 -44355 -36611 -45811 -56614 -15611 -44822
16153 -44822 -34518 -10765 -36959 -23719 -21298 -6679 6273 14657 432 -27578 -16153 -16742
16141 -16742 -20971 -2606 3234 -5273 -15914 -25805 -12233 12624 12970 28203 26754 38272 25617
$$ packed form
16231E628r523n353l910j3805j3351J9673J0713n701r673j3451j7923J2627L8541
16218e508P608q267l6899K1208J6132K9686j0901k2341Q000P567j7905K6125K5195
16205C9700l4136l1337O335o943q419J4093j0136j7771K2237j398M391q599Q231
16192b3752K7786k1452P1r793m1442j9360L0478M4250N793k6111j4064Q157M275
16179c5164N126l1452K2886M426j1819O516M73L7731J2666m1023j1732M5723J3804
16166A8161j8935L295l713j5610j714k743j4207q889P744r200j0803M1003k9211
16153d4822J0304K3753k6194J3240K421J4619J2952Q384j4225k8010J1425n89
16141a6742m229J8365N840q507j0641r891J3572K4857L46J5233j449J1518j2655
$$ plain form
16128 25617 23460 32996 25555 29676 -5503 -1680 20983 -5206 -6075 -4209 42117 38290 40290 31255
16114 31255 16116 17643 50892 57112 53554 44667 26116 12906 -14659 -81159 -64556 -49340
16102 -49340 -16179 27813 29606 32302 5627 -2721 -5629 16519 -12539 -32627 -35086 -56330 -42354
16089 -42354 -31770 -32187 -18837 -13821 -17851 2743 32681 60351 43990 37605 4361 11655 1839
16076 1839 6343 22582 16259 -6012 -16778 -6161 13704 9251 11986 31077 50294 -6625 -42771
16063 -42771 -31867 -16222 -20061 -21239 -26927 -22459 -24198 -36042 -33764 -30178 -13381 -2883 -12453
16050 -12453 -11746 -32487 -4633 14846 -8419 4931 17077 17413 -10859 -10127 -26716 -20719 -32999
16037 -32999 -34777 -20434 -44408 -22201 8930 26323 24967 22760 15266 3002 -6342 25 5212
$$ packed form
16128B5617k157R536p441M121l5179L823K2663k6189q69J866M6326l827K000r035
16114C1255j5139J527L3249O220l558q887j8551j3210k7565o6500J6603J5216
16102d9340L3161M3992J793K696k6675q348k908K2148k9058k0088k459k1244J3976
16089d2354J0584m17J3350N016m030K0594K9938K7670j6361o385l3244P294r816
16076A839M504J6239o323k2271j0766J0617J9865m453K735J9091J9217n6919l6146
16063d2771J0904J5645l839j178n688M468j739j1844K278L586J6797J0498r570
16050a2453P07k0741K7854J9479k3265J3350J2146L36k8272P32j6589N997j2280
16037c2999j778J4343k3974K2207L1131J7393j356k207p494j2264r344O367N187
$$ plain form
16024 5212 -19314 -25200 18431 23847 17389 -5594 -1513 39180 51426 53671 40490 6703 -14100
16011 -14100 -7665 5514 5824 40215 47095 23052 14036 9682 -6316 -31749 -14575 -16213 16439
15998 16439 41506 37358 26453 -19036 -6587 23940 27297 31585 10671 7577 39780 53062
15986 53062 65319 85042 90010 71825 50458 40656 41160 18671 21198 21613 -8624 19885 49231
15973 49231 21552 21050 4882 -40350 -23679 12641 6256 -6319 -12654 7323 24977 37524
15961 37524 12997 15618 7804 -32405 -52681 -43142 8544 50469 45533 18670 14950 31833 19172
15948 19172 12271 1514 -10821 2189 3539 -4842 -6446 6773 10470 35364 26873 -20443 -40799
15935 -40799 -19645 -11491 -9636 24292 48162 23308 19090 886 1723 -6139 -1716 5871 -11974
$$ packed form
16024E212k4526n886M3631N416o458k2983M081M0693J2246K245j3181l3787k0803
16011a4100O435J3179L10L4391O880k4043r016m354j5998k5433J7174j638L2652
15998A6439K5067m148j0905m5489J2449L0527L357M288k0914l094L2203J3282
15986E3062J2257J9723M968j8185k1367r802N04k2489K527M15l0237K8509K9346
15973D9231k7679n02j6168m5232J6671L6320o385j2575o335J9977J7654J2547
15961C7524k4527K621p814m0209k0276R539N1686M1925m936k6863l720J6883j2661
15948A9172o901j0757j2335J3010J350q381j604J3219L697K4894q491m7316k0356
15935d0799K1154Q154J855L3928K3870k4854m218j8204Q37p862M423P587j7845
$$ plain form
15922 -11974 -38203 -33490 13142 31232 37346 10348 -38246 -77948 -87641 -71522 -56080 -31670
15910 -31670 -1591 1366 -20230 -18313 -26193 -2749 -5687 -12849 17091 66834 78605 61038 39083
15897 39083 55593 77531 60182 65835 86937 106487 109204 73435 24380 2484 13039 40790
15885 40790 60376 28498 28682 35278 15566 5744 618 26900 3793 -2422 -39704 -40211 -30645
15872 -30645 -24863 -27110 -14407 1821 25322 32824 29878 14187 -6305 -52134 -35765 -24805
15860 -24805 -2297 -8825 -46460 -45494 -22925 -13902 -48695 -55989 -42962 -19860 3331 26433 10409
15847 10409 -235 -4834 15955 10352 189 -6554 15905 -2564 -17636 -4808 -1882 -17870
15835 -17870 -36723 -18024 12341 25269 10892 -23403 -38604 -48496 -43960 -8173 32589 32292
$$ packed form
15922a1974k6229M713M6632J8090O114k6998m8594l9702r693J6119J5442K4410
15910c1670L0079K957k1596J917p880K3444k938p162K9940M9743J1771j7567k1955
15897C9083J6510K1938j7349N653K1102J9550K717l5769m9055k1896J0555K7751
15885D0790J9586l1878J84O596j9712r822n126K6282k3107o215l7282n07R566
15872c0645N782k247J2703J6228K3501P502k946j5691k0492m5829J6369J0960
15860b4805K2508o528l7635R66K2569R023l4793p294J3027K3102K3191K3102j6024
15847A0409j0644m599K0789n603j0163o743K2459j8469j5072J2828K926j5988
15835a7870j8853J8699L0365J2928j4377l4295j5201r892M536L5787M0762k97
$$ plain form
15823 32292 28417 8442 -36187 -38252 -6951 37591 76878 69544 8983 -13608 -38308 -69451
15811 -69451 -48416 -35218 -48913 -35734 -8973 -23292 -37688 -43660 -53666 -31785 -25295 -7307
15799 -7307 8295 -18682 -1838 27951 22138 21597 23301 43745 77547 66517 13945 -17759 -14729
15786 -14729 -6162 42826 41373 7406 -38094 -34289 -35349 -10504 4074 12724 17095 23163 48868
15773 48868 52750 30596 26999 61729 83042 84987 98175 110554 70790 57545 86712 109080
15761 109080 165760 229093 290568 378860 491107 638563 846202 1150992 1626562 2537112
15751 2537112 4168276 6797830 10753660 14888181 13323670 7827027 4359689 2669163
15743 2669163 1796497 1324038 978987 769983 618663 478572 406138 370808 321579 270841
$$ packed form
15823C2292l875j9975m4629k065L1301M4542L9287p334o0561k2591k4700l1143
15811f9451K1035J3198j3695J3179K6761j4319j4396n972j0006K1881O490J7988
15799g307J5602k6977J6844K9789n813n41J704K0444L3802j1030n2572l1704L030
15786a4729Q567M8988j453l3967m5500L805j060K4845J4578Q650M371O068K5705
15773D8868L882k2154l597L4730K1313J945J3188J2379l9764j3245K9167K2368
15761A09080N6680O3333O1475Q8292J12247J47456K07639L04790M75570R10550
15751B537112J631164K629554L955830M134521j564511n496643l467338j690526
15743B669163q72666m72459l45051k09004j51320j40091p2434l5330m9229n0738
$$ plain form
15733 270841 240882 195850 151211 139233 139175 110641 120446 110679 141293 144321 102948 86646 81279
15720 81279 52408 43498 36618 24229 54748 4835 -29695 -22601 -11087 -2714 5242 -14172 -23813
15707 -23813 -922 28317 27925 8984 -11135 -18313 -48209 -43161 -11780 16127 35248 53090
15695 53090 41493 1077 24017 48910 13488 -37430 -43089 -31963 -35212 -34975 -829 -35268
15683 -35268 -26796 2044 29074 17528 -3526 -19655 -39843 -18194 16329 -14402 -19171 -23705
15671 -23705 -25981 -26662 -8243 9793 1217 -5343 -54021 -33715 -15503 -14940 -9249 9699 746
15658 746 -65647 -79724 -62244 -42539 -57901 -74571 -67478 -63471 -77642 -98796 -78563 -49303
15646 -49303 -35893 -27426 -38398 -46692 -26599 -16593 4846 48134 36117 -3435 -13647 -12087
$$ packed form
15733B70841k9959m5032m4639j1978n8k8534R805r767L0614L028m1373j6302n367
15720H1279k8871q910o880j2389L0519m9913l4530P094J1514Q373P956j9414r641
15707b3813K2891K9239l92j8941k0119p178k9896N048L1381K7907J9121J7842
15695E3090j1597m0416K2940K4893l5422n0918n659J1126l249K37L4146l4439
15683c5268Q472K8840K7030j1546k1054j6129k0188K1649L4523l0731m769m534
15671b3705k276o81J8419J8036q576o560m8678K0306J8212N63N691J8948q953
15658G46o6393j4077J7480J9705j5362j6670P093M007j4171k1154K0233K9260
15646d9303J3410Q467j0972q294K0093J0006K1439M3288j2017l9552j0212J560
$$ plain form
15634 -12087 -8861 2440 2918 -12753 -10729 26965 21755 23312 34430 9246 12662 33404 48088
15621 48088 66150 29554 -4672 -93 -2817 -16155 -13209 -14627 9533 4959 -18089 -25279 -32907
15608 -32907 -27641 -5899 -13684 -43908 -47300 -60796 -72080 -34275 -37845 -65283 -86081 -60659
15596 -60659 -36084 -59496 -49367 -14594 19305 1411 -2537 -37105 -35089 -25639 32375 54261
15584 54261 58837 8313 -2128 23899 -801 -6602 -29697 -23474 -38815 -41420 -10903 -1810 -7838
15571 -7838 32470 1904 -13908 -6246 -22152 -43786 -27124 -38147 -16496 -39018 -61784 -75472
15559 -75472 -58555 -13453 1570 -6486 23513 24740 11617 -2680 -42002 -98377 -90671 -64277
15547 -64277 -78541 -67059 -57031 -39925 -22363 -11884 3814 16682 -12200 -60809 -58357 -28470
$$ packed form
15634a2087L226J1301M78j5671K024L7694n210J557J1118k5184L416K0742J4684
15621D8088J8062l6596l4226M579k724j3338K946j418K4160m574k3048p190p628
15608c2907N266K1742p785l0224l392j3496j1284L7805l570k7438k0798K5422
15596f0659K4575k3412J0129L4773L3899j7894l948l4568K016R450N8014K1886
15584E4261M576n0524j0441K6027k4700n801k3095O223j5341k605L0517R093o028
15571g838M0308l0566j5812P662j5906k1634J6662j1023K1651k2522k2766j3688
15559g5472J6917M5102J5023q056K9999J227j3123j4297l9322n6375P706K6394
15547f4277j4264J1482J0028J7106J7562J0479J5698J2868k8882m8609K452K9887
$$ plain form
15535 -28470 -3771 26437 26630 25329 10902 -28451 -59868 -44814 -41721 -20678 6553 30450
15523 30450 38289 18619 -6670 -10641 -25558 -25740 -25055 -29665 -60430 -68826 -23139 -780 12929
15510 12929 5621 12998 15035 -15593 -8345 2434 21496 6499 -16462 -7594 -1276 -31610 1784
15497 1784 23657 18452 -18231 12361 5581 665 4581 26752 40621 18582 34803 59960 40054
15484 40054 6595 -19641 -34558 -34674 -68616 -61261 -47356 -35920 7770 29342 -3045 -34766
15472 -34766 -38586 -26780 -25543 3761 14180 -15642 -20709 -5773 37386 52905 39620 16119
15460 16119 7373 -22375 -26388 17159 33657 52130 59049 45618 24558 2312 -18688 -13278
15448 -13278 55546 66570 35648 29640 11450 -3875 786 8688 -22791 -41191 -12891 17474
$$ packed form
15535b8470K4699L0208J93j301j4427l9353l1417J5054L093K1043K7231K3897
15523C0450P839j9670k5289l971j4917j82O85m610l0765q396M5687K2359J3709
15510A2929p308P377K037l0628P248J0779J9062j4997k2961Q868O318l0334L3394
15497A784K1873n205l6683L0592o780m916L916K2171J3869k2039J6221K5157j9906
15484D0054l3459k6236j4917j16l3942P355J3905J1436M3690K1572l2387l1721
15472c4766l820J1806J237K9304J0419k9822n067J4936M3159J5519j3285k3501
15460A6119q746k9748m013M3547J6498J8473O919j3431k1060k2246k1000N410
15448a3278O8824J1024l0922o008j8190j5325M661P902l1479j8400K8300L0365
$$ plain form
15436 17474 12082 6452 -17965 -49852 -51662 -61422 -61915 -42471 -5195 13356 -14675 -12444 -37599
15423 -37599 -20352 -23460 14482 54297 29675 -14529 3216 -15229 -43071 -22079 12440 -36809
15411 -36809 -49269 -53000 -60046 -49552 -40359 -16144 -12811 2870 14825 25107 -9291 -14187 -18788
15398 -18788 -16461 -11116 8119 -11157 4516 8582 -4176 -23071 -18872 -22722 -35526 -20294 -4767
15385 -4767 -3410 -5018 -1003 8957 -27919 -48681 -33986 -40279 -31783 -10111 15156 14534 41527
15372 41527 34712 15552 -8099 -7370 -20882 350 -3450 3923 5863 6376 -26379 -47037 -57334
15359 -57334 -83826 -59516 -94034 -93440 -77156 -34012 15204 61040 33813 -7754 -10103 -17998
15347 -17998 -27978 -27870 -2794 12421 11698 15363 13729 -12054 -4285 -818 -2040 1241 -4117 15337
$$ packed form
15436A7474n392n630k4417l1887j810r760m93J9444L7276J8551k8031K231k5155
15423c7599J7247l108L7942L9815k4622m4204J7745j8445k7842K0992L4519m9249
15411c6809j2460l731p046J0494R193K4215L333J5681J1955J0282l4398m896m601
15398a8788K327N345J9235j9276J5673M066j2758j8895M199l850j2804J5232J5527
15385d767J357j608M015R960l6876k0762J4695o293Q496K1672K5267o22K6993
15372D1527o815j9160k3651P29j3512K1232l800P373J940N13l2755k0658j0297
15359e7334k6492K4310l4518N94J6284M3144M9216M5836k7227m1567k349p895
15347a7998r980J08K5076J5215p23L665j634k5783P769L467j222L281n358J9454
$$ plain form
15333 15337 30093 30836 35013 36844 31378 53240 45623 18504 19654 15717 5014 23377 11079
15320 11079 5141 -2895 -33319 -38141 -19730 -24634 -31709 -25914 13416 33787 15081 12705 7361
15307 7361 23953 -12294 -35629 -9315 2779 -6209 -21149 -30314 -9426 26392 37923 5211
15295 5211 27741 59139 36215 -21444 -4249 32064 52519 38930 35273 18772 11249 3420
15283 3420 -5907 12544 61076 56031 43800 10050 -4636 -62204 -46293 -24633 -45096 -45044 -31602
15270 -31602 -29722 -31611 -34377 -35712 -25562 -25303 -43881 -72371 -71914 -51489 -22265 -16403 -19973 -3158
15256 -3158 -14389 -58247 -91478 -76561 -45822 -50196 -40198 6516 -2452 -24481 -56101 -82605
15244 -82605 -57610 -9569 -9145 -6927 9033 4665 -6647 8893 16798 -9374 2988 8430 3277
$$ packed form
15333A5337J4756P43M177J831n466K1862p617k7119J150l937j0703J8363j2298
15320A1079n938q036l0424m822J8411m904p075N795L9330K0371j8706k376n344
15307G361J6592l6247k3335K6314J2094q988j4940r165K0888L5818J1531l2712
15295E211K2530L1398k2924n7659J7195L6313K0455j3589l657j6501p523p829
15283C420r327J8451M8532n045j2231l3750j4686n7568J5911K1660k0463N2J3442
15270c1602J880j889k766j335J0150K59j8578k8490M57K0425K9224N862l570J6815
15256c158j1231m3858l3231J4917L0739m374R998M6714q968k2029l1620k6504
15244h2605K4995M8041M24K218J5960m368j1312J5540P905k6172J2362N442n153
$$ plain form
15231 3277 -44115 -48513 -39594 -63305 -41147 -15466 -23013 -39009 -31747 -1128 15856 24723 37026
15218 37026 16032 -6800 -8447 28538 25889 8249 32301 49737 44137 29084 28129 62040 69775
15205 69775 61191 17528 12871 10131 -23298 -30886 -31118 -37794 -46204 -59171 -57149 -47848 -49892 -25783
15191 -25783 5863 48649 27260 8365 -5676 -13289 7323 13426 41384 49524 58577 73813
15179 73813 55995 21286 2979 -12772 -19672 -5478 -21189 -41441 -10956 31641 22891 -19629
15167 -19629 -55656 -60987 -53404 -12377 -2276 4743 19422 29344 -8947 -21463 -5930 -20063
15155 -20063 -44453 -23454 -10454 1786 37812 45010 29539 -4986 -26555 4375 20733 11446
15143 11446 -14673 -36401 -22425 -9556 13696 37550 17476 -2870 -15315 349 -3579 4436
$$ packed form
15231C277m7392m398Q919k3711K2158K5681p547j5996P262L0619J6984Q867J2303
15218C7026k0994k2832j647L6985k649j7640K4052J7436n600j5053r55L3911P735
15205F9775q584m3663m657k740l3429p588k32o676q410j2967K022R301k044K4109
15191b5783L1646M2786k1389j8895j4041p613K0612O103K7958Q140R053J5236
15179G3813j7818l4709j8307j5751o900J4194j5711k0252L0485M2597q750m2520
15167a9629l6027n331P583M1027J0101P019J4679R922l8291j2516J5533j4133
15155b0063k4390K0999J3000J2240L6026P198j5471l4525k1569L0930J6358r287
15143A1446k6119k1728J3976J2869K3252K3854k0074k0346j2445J5664l928Q015
$$ plain form
15131 4436 -10793 -18368 -8509 26872 14114 6137 -17234 -39519 -48783 -40302 -27615 -40782 -15060
15118 -15060 -40513 -56337 -45389 -15371 4031 16820 28870 6436 5749 7432 -17750 -32334
15106 -32334 -47409 -55413 -23661 -36075 -35743 -30118 -23668 -46800 -31054 -31994 -8008 -11856 -468
15093 -468 41453 33153 17477 22668 22208 -8009 922 -381 35000 43152 43079 5160 -19162 -34030
15079 -34030 -57276 -68344 -43692 -22707 -12338 5560 27235 30734 38450 34474 28704 4955
15067 4955 -12674 -32311 -56288 -64929 -70767 -58458 -40316 -9878 4247 -7884 11240 23013
15055 23013 13015 24182 18386 -9821 -24597 -24344 -35827 -36145 -33857 -44640 10963 55834 54919
15042 54919 41698 25544 33899 8076 -15797 6066 8093 19087 20116 -9997 31292 75891
$$ packed form
15131D436j5229p575R859L5381j2758p977k3371k2285r264Q481J2687j3167K5722
15118a5060k5453j5824J0948L0018J9402J2789J2050k2434o87J683k5182j4584
15106c2334j5075q004L1752j2414L32N625O450k3132J5746r40K3986l848J1388
15093d68M1921q300j5676N191m60l0217Q931j303L5381Q152p3l7919k4322j4868
15079c4030k3246j1068K4652K0985J0369J7898K1675L499P716l976n770k3749
15067D955j7629j9637k3977q641n838J2309J8142L0438J4125j2131J9124J1773
15055B3013r998J1167n796k8207j4776K53j1483l18K288j0783N5603M4871r15
15042E4919j3221j6154Q355k5823k3873K1863K027J0994J029l0113M1289M4599
$$ plain form
15030 75891 42610 -17965 -25478 4208 37685 19425 26056 33312 38220 62019 70180 80251 45870
15017 45870 10878 -14698 -1943 30717 41518 8184 -14051 -19694 -15013 14642 40558 16456
15005 16456 26006 24053 15442 6352 3021 12173 47923 87861 121605 107504 36994 -11787 -31132
14992 -31132 -59836 -69670 -46636 -39850 -17626 -11679 -4697 -7535 -16 -2228 -38313 -22086 3732
14979 3732 45404 67439 71913 26208 18670 14238 -13706 -53162 -19614 -17382 -14696 -33904 -45631
14966 -45631 -42552 -34881 -17784 14490 8159 1554 1736 5786 -5113 -39607 -47280 -51848 -73620
14953 -73620 -56992 -44907 -27450 -9478 20932 12146 14362 30046 61620 93087 85559 64259
14941 64259 68258 49098 47045 29381 7093 487 -923 13554 8929 2878 -8582 -2030 -23576
$$ packed form
15030G5891l3281o0575p513K9686L3477j8260O631P256M908K3799Q161J0071l4381
15017D5870l4992k5576J2755L2660J0801l3334k2235n643M681K9655K5916k4102
15005A6456R550j953q611r090l331R152L5750L9938L3744j4101p0510m8781j9345
14992c1132k8704r834K3034O786K2224N947O982k838P519k212l6085J6227K5818
14979C732M1672K2035M474m5705p538m432k7944l9456L3548K232K686j9208j1727
14966d5631L079P671J7097L2274o331o605J82M050j0899l4494p673m568k1772
14953g3620J6628J2085J7457J7972L0410q786K216J5684L1574L1467p528k1300
14941F4259L999j9160k053j7664k2288o606j410J4477m625o051j1460O552k1546
$$ plain form
14928 -23576 -38420 -12794 3735 -7072 -19714 26777 19958 -12884 -11568 10992 8648 3732
14916 3732 -710 -10743 -43912 -41546 -21305 -32670 -29884 -12063 16831 24662 11088 -247 7320
14903 7320 31839 39136 50424 48869 21383 13310 -1249 -18363 8126 15933 20425 4751 4403
14890 4403 -40239 -66126 -80674 -88801 -54977 -26843 -24163 -27155 -1 32657 10100 1965 37113
14877 37113 28867 5663 -7371 -57228 -94344 -77352 -24776 36613 41485 12019 -509 -16030
14865 -16030 -4308 6515 3313 -14128 723 5612 -12370 -21496 -9720 11135 34955 33643
14853 33643 19489 2452 -10747 22691 18081 21981 35358 44169 12994 -4536 18476 23538
14841 23538 8258 -16723 15461 14409 24388 39335 24916 5929 -6425 6882 7388 29871
$$ packed form
14928b3576j4844K5626J6529j0807j2642M6491o819l2842J316K2560k344m916
14916C732m442j0033l3169K366K0241j1365K786J7821K8894P831j3574j1335P567
14903G320K4519P297J1288j555k7486q073j4559j7114K6489P807M492j5674l48
14890D403m4642k5887j4548q127L3824K8134K680k992K7154L2658k2557q135L5148
14877C7113q246k3204j3034m9857l7116J6992N2576O1389M872k9466j2528j5521
14865a6030J1722J0823l202j7441J4851M889j7982r126J1776K0855K3820j312
14853C3643j4154j7037j3199L3438m610L900J3377Q811l1175j7530K3012N062
14841B3538j5280k4981L2184j052R979J4947j4419j8987j2354J3307N06K2483
$$ plain form
14829 29871 46306 23130 -14474 3576 19778 16386 12553 11517 -13194 -12376 -8540 19019 53595
14816 53595 88468 88311 47819 14194 11032 200 14614 22353 26680 -12956 23473 53280 64167
14803 64167 46944 55323 61978 29974 -2264 16487 35573 47182 36068 22679 10624 -40508
14791 -40508 -22783 -30977 10778 58587 52069 12622 -6122 -21292 -42680 4991 20672 7574
14779 7574 -5638 -27929 -39643 -22874 -6510 419 -2534 -29883 -49163 -42538 -54778 -79358
14767 -79358 -16403 3058 18367 32339 36116 9532 11434 33564 40142 586 -38657 -29709
14755 -29709 -18138 -17365 -7540 -8396 -29095 -57893 -45207 -8849 -9104 -24868 -3230 15172 -2295
14742 -2295 1286 12732 -3879 9241 15297 -18714 -4160 -9679 -37692 -35904 -40153 -8438 24007
$$ packed form
14829B9871J6435k3176l7604J8050J6202l392l833j036k4711Q18L836K7559L4576
14816E3595L4873j57m0492l3625l162j0832J4414P739M327l9636L6429K9807J0887
14803F4167j7223Q379O655l2004l2238J8751J9086J1609j1114j3389j2055n1132
14791d0508J7725q194M1755M7809o518l9447j8744j5170k1388M7671J5681j3098
14779G574j3212k2291j1714J6769J6364O929k953k7349j9280O625j2240k4580
14767g9358O2955J9461J5309J3972L777k6584J902K2130O578l9556l9243Q948
14755b9709J1571P73R825q56k0699k8798J2686L6358k55j5764K1638J8402j7467
14742b295L581J1446j6611J3120O056l4011J4554n519k8013J788m249L1715L2445
$$ plain form
14729 24007 17200 -4035 10082 35913 7970 -2279 -16863 -8184 22605 29156 40271 38280
14717 38280 46907 38611 26586 16555 9087 42510 64693 38495 -18499 -41040 -46843 -21008
14705 -21008 -4456 11175 18851 37079 46473 68933 71759 72845 87508 56597 12705 1045
14693 1045 5411 -15675 -25100 22753 14449 9637 33609 28550 26854 31708 64922 91229 60713
14680 60713 25373 -4028 -30734 -24707 -27564 -23345 -5452 -24237 -40673 -15317 -6693 14445
14668 14445 -1369 -2672 -7783 10962 11501 5422 -6530 -7802 -20284 -24307 -44494 -38053 -1424
14655 -1424 -16459 -49523 -77489 -66478 -13938 32564 37377 -16749 -18579 12005 39439 29635
14643 29635 33996 17505 19777 12491 25634 30933 15561 12979 321 -4884 4906 -12477 -2547
$$ packed form
14729B4007o807k1235J4117K5831k7943j0249j4584Q679L0789O551J1115j991
14717C8280Q627q296j2025j0031p468L3423K2183k6198n6994k2541n803K5835
14705b1008J6552J5631P676J8228R394K2460K826J086J4663l0911m3892j1660
14693A045M366k1086r425M7853q304m812K3972n059j696M854L3214K6307l0516
14680F0713l5340k9401k6706O027k857M219J7893j8785j6436K5356Q624K1138
14668A4445j5814j303n111J8745N39o079j1952j272j2482m023k0187O441L6629
14655a424j5035l3064k7966J1011N2540M6502M813n4126j830L0584K7434r804
14643B9635M361j6491K272p286J3143N299j5372k582j2658n205R790j7383R930
$$ plain form
14630 -2547 -11680 -42164 -34625 -29499 -39692 -52066 -10793 -8602 -8313 -11410 -49297 -58907 -5340
14617 -5340 -8303 2835 -3819 -24232 11724 18684 2479 -4022 20914 41547 16397 1954 21153
14604 21153 28352 38944 28405 7581 2609 -1583 10603 24546 10246 11891 23348 34050
14592 34050 39514 67746 64715 24249 44557 44154 49148 48375 16501 -13480 -35225 -71690 -72804
14579 -72804 -68013 -42580 -25743 2761 18085 -9798 -30613 -5927 -249 -51387 -31060 16048
14567 16048 38154 5992 -22337 -29862 8300 29188 25309 25732 17005 11280 44833 45120 39427
14554 39427 20036 576 -5033 -20670 -46912 -55749 -7940 2981 9594 3437 -746 1838 -12683
14541 -12683 -46665 -45656 -39554 -17689 -1051 -395 13227 21191 1806 -15935 -20519 -30714 -24755
$$ packed form
14630b547r133l0484P539N126j0193j2374M1273K191K89l097l7887r610N3567
14617e340k963J1138o654k0413L5956O960j6205o501K4936K0633k5150j4443J9199
14604B1153P199J0592j0539k0824m972m192J2186J3943j4300J645J1457J0702
14592C4050N464K8232l031m0466K0308m03M994p73l1874k9981k1745l6465j114
14579g2804M791K5433J6837K8504J5324k7883k0815K4686N678n1138K0327M7108
14567A6048K2106l2162k8329p525L8162K0888l879M23q727n725L3553K87n693
14554C9427j9391j9460n609j5637k6242q837M7809J0921O613o157m183K584j4521
14541a2683l3982J009O102K1865J6638O56J3622P964j9385j7741m584j0195N959
$$ plain form
14528 -24755 -13783 -27336 -58746 -61135 -55531 -38748 -35530 -78014 -84980 -64846 -38394 -12531
14516 -12531 12527 6596 11954 53244 46604 23926 -17844 -7284 -6742 7345 10574 13346 -924
14503 -924 -20379 -15061 -36319 -34037 -4792 -18637 -34936 -4464 38071 36861 44795 52084 40467
14490 40467 15272 13115 43555 33985 13911 14398 -5895 -9687 -22035 -41004 -58997 -53870 -20292
14477 -20292 3111 -2075 11084 13694 14828 18423 7591 -1737 -30910 -51908 -61625 -56765 -5239
14464 -5239 29393 27554 25245 16858 -8730 10572 18455 14099 -9119 -21121 -21493 -27099 -12436
14451 -12436 3702 -8615 -5274 -7592 21076 342 -19658 -7366 -10479 -6629 -29799 -29637 -6668
14438 -6668 12708 14194 9463 8262 -18350 -24422 -1400 -6826 7958 13392 -12874 -31573 -13914
$$ packed form
14528b4755J0972j3553l1410k389N604J6783L218m2484o966K0134K6452K5863
14516a2531K5058n931N358M1290o640k2678m1770J0560N42J4087L229K772j4270
14503i24j9455N318k1258K282K9245j3845j6299L0472M2535j210P934P289j1617
14490D0467k5195k157L0440r570k0074M87k0293l792j2348j8969j7993N127L3578
14477b0292K3403n186J3159K610J134L595j0832r328k9173k0998r717M860N1526
14464e239L4632j839k309q387k5588J9302P883m356k3218j2002l72n606J4663
14451a2436J6138j2317L341k318K8668k0734k0000J2292l113L850k3170J62K2969
14438f668J9376J486m731j201k6612o072K3022n426J4784N434k6266j8699J7659
$$ plain form
14425 -13914 -203 -4329 -15063 -23310 -27053 -52188 -40813 -12437 12201 13096 -13640 -26627 7648
14412 7648 -5631 -29712 -25283 11519 38155 50711 30570 7598 -16808 -16849 -13136 -15583 5731
14399 5731 8730 25997 13012 -9115 -36202 -36908 -25193 -48997 -56582 -32665 -3274 12297 996
14386 996 28023 61686 38490 -1770 -8887 -3340 -6296 -1407 -661 -34534 -64431 -63538 -77066 -52169
14372 -52169 -49530 -27593 29027 21030 -20308 -42046 -67018 -62167 -10987 32983 26732 11243
14360 11243 -18751 -5650 -10286 -31118 -34335 -14404 15393 24052 19473 3276 3734 20697 72227
14347 72227 78484 45982 19959 1916 -12785 7097 1496 -26554 -34021 -39532 -43616 -30116 -9632
14334 -9632 -16450 -29469 -1931 15357 24311 -15487 -25785 7684 23157 62311 45017 5912
$$ packed form
14425a3914J3711m126j0734q247l743k5135J1375K8376K4638Q95k6736j2987L4275
14412G648j3279k4081M429L6802K6636J2556k0141k2972k4406m1L713k447K1314
14399E731K999J7267j2985k2127k7087p06J1715k3804p585K3917K9391J5571j1301
14386I96K7027L3663k3196m0260p117N547k956M889P46l3873k9897Q93j3528K4897
14372e2169K639K1937N6620p997m1338k1738k4972M851N1180M3970o251j5489
14360A1243k9994J3101m636k0832l217J9931K9797Q659m579j6197M58J6963N1530
14347G2227O257l2502k6023j8043j4701J9882n601k8050p467n511m084J3500K0484
14334i632o818j3019K7538J7288Q954l9798j0298L3469J5473L9154j7294l9105
$$ plain form
14322 5912 -7839 7899 12019 41510 48681 26799 32357 35908 32913 28482 20072 5451 -5577
14309 -5577 -20290 -7908 -7976 -25535 -13453 35052 15789 5766 22561 -18459 -45900 9051
14297 9051 21518 -12050 -46499 -27581 3697 1922 1493 4025 15981 -44366 -44734 -28440 -2491
14284 -2491 29240 59927 63740 72216 43012 7223 13695 7429 -5244 3248 29948 23306 -13152
14271 -13152 -40177 -44144 -16012 51984 90736 77751 44803 46667 61612 57558 37701 53883
14259 53883 63300 36205 35552 39208 24072 -11362 -32033 -26641 -8092 -9870 -28335 -23542 2610
14246 2610 -3294 23748 68922 70649 73519 74566 53847 30739 -651 -22548 -25958 -24607 -9755
14233 -9755 24571 36213 57035 69262 31697 49402 39085 22445 19812 67 -5846 -10808
$$ packed form
14322E912j3751J5738M120K9491P171k1882N558L551k995m431q410j4621j1028
14309e577j4713J2382o8j7559J2082M8505j9263j0023J6795m1020k7441N4951
14297I051J2467l3568l4449J8918L1278j775m29K532J1956o0347l68J6294K5949
14284b491L1731L0687L813Q476k9204l5789O472o266j2673Q492K6700o642l6458
14271a3152k7025l967K8132O7996L8752j2985l2948J864J4945m054j9857J6182
14259E3883R417k7095o53L656j5136l5434k0671N392J8549j778j8465M793K6152
14246B610n904K7042M5174J727K870J047k0719k3108l1390k1897l410J351J4852
14233i755L4326J1642K0822J2227l7565J7705j0317j6640k633j9745n913m962
$$ plain form
14221 -10808 -21482 -1331 46129 57635 47939 58772 58609 50245 32969 9256 26189 24645 -4705
14208 -4705 -3699 -29268 -1531 12974 40012 51628 46163 33842 39764 21821 -12527 22637
14196 22637 38446 32125 37938 39642 30397 9054 5295 -2420 -2497 -43085 -86542 -68208 -10694
14183 -10694 -3099 -1745 -726 33980 19518 11244 -6634 -17149 -2784 5356 -19761 -12352 -17783
14170 -17783 12913 42230 24799 28428 23724 3760 -1914 -25861 -10797 -10275 -5912 17434 -8328
14157 -8328 -8748 -6816 -14132 2898 -3282 1584 15308 35499 12894 15431 17367 29595 -15877
14144 -15877 -65518 -28518 -30456 -27181 -14728 29734 30161 23353 49811 36504 23733 22968 35732
14131 35732 41567 23259 491 -15272 -14283 -713 14232 10165 -12819 -40026 -37993 -49406 -38626
$$ packed form
14221a0808j0674K0151M7460J1506r696J0833j63q364j7276k3713J6933j544k9350
14208d705J006k5569K7737J4505K7038J1616n465j2321N922j7943l4348L5164
14196B2637J5809o321N813J704r245k1343l759p715p7m0588m3457J8334N7514
14183a0694P595J354J019L4706j4462q274j7878j0515J4365Q140k5117P409n431
14170a7783L0696K9317j7431L629m704j9964n674k3947J5064N22M363K3346k5762
14157h328m20J932p316J7030o180M866J3724K0191k2605K537J936J2228m5472
14144a5877m9641L7000j938L275J2453M4462M27o808K6458j3307j2771p65J2764
14131C5732N835j8308k2768j5763R89J3570J4945m067k2984k7207K033j1413J0780
$$ plain form
14118 -38626 -47897 -13776 41039 36778 19642 32575 29401 16295 25623 6037 -353 -33080 -36980
14105 -36980 -33324 -25960 -17865 12204 28747 19457 14584 -23757 -19819 -10124 -6510 -15323 -28848
14092 -28848 -29973 -8999 18250 17520 39647 49170 17739 -28459 -33331 -25009 -22842 -8071 22516
14079 22516 24417 27515 47966 57143 54838 28647 1128 -17654 27391 43380 61109 80973
14067 80973 49133 22180 28995 9035 10405 33074 13034 -14292 -29943 8105 12094 2668
14055 2668 31590 25259 19254 5798 11090 -21334 -7840 3561 3896 4417 14358 34526 22249
14042 22249 18643 41540 31295 2818 3397 -7043 -32005 -19977 -1559 -388 6030 7987 24
14029 24 -11464 5362 23810 2928 13729 42957 81091 102819 94300 93984 64286 14258 6258
$$ packed form
14118c8626r271L4121N4815m261j7136J2933l174j3106R328j9586o390l2727l900
14105c6980L656P364Q095L0069J6543r290m873l8341L938R695L614q813j3525
14092b8848j125K0974K7249p30K2127R523l1431m6198m872Q322K167J4771L0587
14079B2516J901L098K0451R177k305k6191k7519j8782M5045J5989J7729J9864
14067H0973l1840k6953O815j9960J370K2669k0040k7326j5651L8048L989r426
14055B668K8922o331o005j3456N292l2424J3494J1401L35N21R941K0168j2277
14042B2249l606K2897j0245k8477N79j0440k4962J2028J8418J171O418J957p963
14029B4j1488J6826J8448k0882J0801K9228L8134K1728q519l16k9698n0028q000
$$ plain form
14016 6258 9708 4158 4315 -2518 -2184 11826 6608 -2659 -424 5781 -20889 2414 23561 27607
14002 27607 16901 2265 41145 50795 43453 26174 2418 -34246 -51860 -39843 -852 4637
13990 4637 35280 55238 59176 36661 21294 1913 -32682 -27063 3350 11128 18848 28571 51888
13977 51888 40481 34506 38140 46940 66219 26922 -17546 -22777 -8277 2309 -21944 -44005
13965 -44005 -23860 -71 379 136 10320 1123 -25602 -22143 -3729 -6542 -1910 20500 33245
13952 33245 49970 81795 61223 33819 27116 32857 30651 67029 74042 67188 51456 14006 -33216
13939 -33216 -31087 -26859 -15879 -23367 -13647 -11159 281 20998 49492 54081 6028 -31980 -3190
13926 -3190 39204 46593 30368 -13712 -41063 -52807 -51605 -35187 14489 42035 15172 1630
$$ packed form
14016F258L450n550J57o833L34J4010n218r267K235O205k6670K3303K1147M046
14002B7607j0706j4636L8880R650p342j7279k3756l6664j7614J2017L8991N489
13990D637L0643J9958L938k2515j5367j9381l4595N619L0413P778P720R723K3317
13977E1888j1407n975L634Q800J9279l9297m4468n231J4500J0586k4253k2061
13965d4005K0145K3789M50k43J0184r197k6725L459J8414k813M632K2410J2745
13952C3245J6725L1825k0572k7404o703N741k206L6378P013o854j5732l7450m7222
13939c3216K129M228J0980p488R720K488J1440K0717K8494M589m8053l8008K8790
13926c190M2394P389j6225m4080k7351j1744J202J6418M9676K7546k6863j3542
$$ plain form
13914 1630 -7506 27578 45657 34999 174 -3723 29759 33691 28629 -2657 -17138 -23268 8020
13901 8020 46495 80902 98449 99196 94645 88661 98293 55409 51007 39446 477 31509 56639
13888 56639 48173 40087 28744 2522 -3118 -1904 -25263 -34944 -21613 -22869 -22837 -10375 28540
13875 28540 66583 85295 48979 29336 31006 22244 7530 -8269 17087 29172 -5554 -22913
13863 -22913 -1254 7122 29020 18998 17061 50605 54210 19618 28570 30338 30505 61241 40286
13850 40286 -19691 2752 20146 38585 69356 76370 62109 39900 43722 27964 17639 21709
13838 21709 25860 18410 35434 35390 10132 -30163 -13289 3000 5691 -7909 -8276 -10411 -48831
13825 -48831 -17643 -4760 5221 20112 57777 20871 -23610 18635 57813 49056 43681 30851
$$ packed form
13914A630r136L5084J8079j0658l4825l897L3482L932n062l1286j4481o130L1288
13901H020L8475L4407J7547P47m551n984R632m2884m402j1561l8969L1032K5130
13888E6639q466q086j1343k6222n640J214k3359r681J3331j256L2J2462L8915
13875B8540L8043J8712l6316j9643J670q762j4714j5799K5356J2085l4726j7359
13863b2913K1659Q376K1898j0022j937L3544L605l4592Q952J768J67L0736k0955
13850D0286n9977K2443J7394J8439L0771P014j4261k2209L822j5758j0325M070
13838B1709M151p450J7024m4k5258m0295J6874J6289K691j3600l67k135l8420
13825d8831L1188J2883R981J4891L7665l6906m4481M2245L9178q757n375j2830
$$ plain form
13813 30851 25710 31399 43615 50845 21693 6856 -26368 683 38928 16853 -12352 -4631
13801 -4631 42765 34732 -4921 -26555 -39062 -44570 -33108 -31878 -13901 -4237 2723 2821 13030
13788 13030 8234 18757 33589 57299 38388 33153 26021 15723 2550 -22850 10321 8407
13776 8407 21810 -4768 -4285 -18011 -6346 18074 39633 76894 62544 45557 42004 41961 40441
13763 40441 13059 44715 83059 84367 89636 67351 48542 180 -40842 -45212 -22743 -15430
13751 -15430 -51273 -49982 -48409 -6447 37644 11426 -6370 -10677 1616 33802 14208 14970 10913
13738 10913 10697 15738 18718 22852 6761 4374 -1583 -25438 -24557 -17801 -25879 -8580 27614 25724
13724 25724 9365 -15238 6656 9598 -25126 14278 40073 58803 43824 18983 11280 21748
$$ packed form
13813C0851n141N689J2216P230k9152j4837l3224K7051L8245k2075k9205P721
13801d631M7396q033l9653k1634j2507n508J1462J230J7977R664O960R8J0209
13788A3030m796J0523J4832K3710j8911n235p132j0298j3173k5400L3171j914
13776H407J3403k6578M83j3726J1665K4420K1559L7261j4350j6987l553m3j520
13763D0441k7382L1656L8344J308N269k2285j8809m8362m1022m370K2469P313
13751a5430l5843J291J573M1962M4091k6218j7796m307J2293L2186j9594P62m057
13738A0913k16N041K980M134j6091k387n957k3855Q81O756q078J7299L6194j890
13724B5724j6359k4603K1894K942l4724L9404K5795J8730j4979k4841p703J0468
$$ plain form
13712 21748 15304 42090 22646 4688 6033 22132 33752 58604 100698 99099 43936 31470
13700 31470 44882 38702 52897 55739 62946 54189 9322 -4103 14024 14683 13889 -2596 11184
13687 11184 8144 -11367 6646 9863 -13869 -28176 -38090 -53760 -30740 -15614 -3716 -7817
13675 -7817 26209 46859 60070 34305 19613 16137 12038 43795 73121 57004 23277 29227
13663 29227 29408 28070 40536 33841 14582 59813 62908 74864 55786 55862 47286 16696 -2936
13650 -2936 -32124 457 67432 105668 114809 94230 56456 31984 18758 24302 63304 40480
13638 40480 8789 10717 19548 29351 43297 57027 35912 -9836 -12513 -13416 -14343 11144 7944
13625 7944 17437 4597 -11707 -22087 -8404 -23491 -13287 3561 39471 39477 15584 3841 18135
$$ packed form
13712B1748o444K6786j9444j7958J345J6099J1620K4852M2094j599n5163j2466
13700C1470J3412o180J4195K842P207q757m4867j3425J8127O59p94j6485J3780
13687A1184l040j9511J8013L217k3732j4307r914j5670K3020J5126J1898m101
13675g817L4026K0650J3211k5765j4692l476m099L1757K9326j6117l3727N950
13663B9227J81j338J2466o695j9259M5231L095J1956j9078P6q576l0590j9632
13650b936k9188L2581O6975L8236R141k0579l7774k4472j3226N544L9002k2824
13638D0480l1691J928Q831R803J3946J3730k1115m5748k677r03r27K5487l200
13625G944R493j2840j6304j0380J3683j5087J0204J6848L5910Ok3893j1743J4294
$$ plain form
13612 18135 7632 8202 36675 31980 8516 22156 15752 27 16941 41149 39093 26831 -3342
13599 -3342 -14097 -2687 -15465 -31453 -24769 -5972 18283 13706 37107 47447 69692 81328
13587 81328 39208 6972 24155 39466 13686 36057 38202 23737 30488 38844 61748 93086
13575 93086 61102 37575 14347 21693 31702 39666 50757 48771 19706 -7362 16179 45856
13563 45856 45465 33143 13787 32282 62454 78725 48174 -5321 6730 30972 19776 24145
13551 24145 28688 48832 48710 23883 -10775 41974 47498 32326 47498 89498 120968 116002 88306
13538 88306 83828 79864 84274 60060 40277 25683 24992 29450 22106 20512 -1934 1760 29139
13525 29139 8630 21885 26486 48148 66370 82287 73840 80989 103086 118893 94474 82468
$$ packed form
13612A8135j0503N70K8473m695k3464J3640o404j5725J6914K4208k056j2262l0173
13599c342j0755J1410j2778j5988O684J8797K4255m577K3401J0340K2245J1636
13587H1328m2120l2236J7183J5311k5780K2371K145j4465O751Q356K2904L1338
13575I3086l1984k3527k3228P346J0009P964J1091j986k9065k7068K3541K9677
13563D5856l91j2322j9356J8495L0172J6271l0551n3495J2051K4242j1196M369
13551B4145M543K0144j22k4827l4658N2749N524j5172J5172M2000L1470m966k7696
13538H8306m478l964M410k4214j9783j4594o91M458p344j594k2446L694K7379
13525B9139k0509J3255M601K1662J8222J5917q447P149K2097J5807k4419j2006
$$ plain form
13513 82468 92862 68347 16197 7140 -803 11720 62291 65584 46241 20896 70639 59001
13501 59001 40797 50386 46836 27434 16791 32305 73486 64783 28499 20304 452 17676
13489 17676 34562 56719 74250 60588 54508 55049 33301 -14910 -4806 10140 17659 41525
13477 41525 56175 90019 78695 57076 42036 68100 63150 62569 67412 36210 27552 58011 75840
13464 75840 83224 96650 96418 92644 79019 22154 9772 16352 20711 12531 23147 54776 76595
13451 76595 46154 58316 104854 88794 104753 156506 137771 89081 84526 54104 33142 -6158
13439 -6158 -31761 -51369 -64801 -66101 -37722 -27774 19511 47887 39919 24987 36117 27606 41601
13426 41601 56065 52281 51219 47545 48328 49915 52932 52061 53004 53454 31350 51947 55379 41484
$$ packed form
13513H2468J0394k4515n2150r057p943J2523N0571L293j9343k5345M9743j1638
13501E9001j8204R589l550j9402j0643J5514M1181q703l6284q195j9852J7224
13489A7676J6886K2157J7531j3662o080N41k1748m8211J0104J4946P519K3866
13477D1525J4650L3844j1324k1619j5040K6064m950n81M843l1202q658L0459J7829
13464G5840P384J3426k32l774j3625n6865j2382O580M359q180J0616L1629K1819
13451G6595l0441J2162M6538j6060J5959N1753j8735m8690m555l0422k0962l9300
13439f158k5603j9608j3432j300K8379R948M7285K8376p968j4932J1130q511J3995
13426D1601J4464l784j062l674P83J587L017q71R43M50k2104K0597L432j3895
$$ plain form
13412 41484 12106 4726 27014 27526 41225 34448 40407 82670 94638 93143 89964 62396 52195
13399 52195 61431 51477 41978 26397 32916 35536 17773 14169 21939 19761 17989 22966 35809 -868
13385 -868 -267 20271 34028 32607 -5656 -13604 38233 71302 65067 57044 72805 93436 92928 81233
13371 81233 54519 47652 82878 117540 138628 149380 125200 89462 57761 47773 24423 23499
13359 23499 52121 31661 28697 48772 57065 80275 113045 84803 39442 6659 5425 15420
13347 15420 -7234 -4221 25854 47120 64254 73429 35314 45428 41634 49506 38076 402
13335 402 -3520 20471 60446 70271 82012 86371 121278 110908 84777 64047 33457 -5433 -34287
13322 -34287 -41958 31 35060 58764 58543 75265 71336 58456 43377 11144 4694 3490 12369
$$ packed form
13412D1484k9378p380K2288N12J3699o777N959M2263J1968j495l179k7568j0201
13399E2195R236r954r499j5581O519K620j7763l604P770k178j772M977J2843l6677
13385h68O01K0538J3757j421l8263p948N1837L3069o235q023J5761K0631n08j1695
13371H1233k6714o867L5226L4662K1088J0752k4180l5738l1701r988k3350r24
13359B3499K8622k0460k964K0075Q293K3210L2770k8242m5361l2783j234R995
13347A5420k2654L013L0075K1266J7134R175l8115J0114l794P872j1430l7674
13335D02l922K3991L9975R825J1741M359L4907j0370k6131k0730l0590l8890k8854
13322c4287p671M1989L5029K3704k21J6722l929j2880j5079l2233o450j204Q879
$$ plain form
13309 12369 17514 2940 27483 38941 54317 45003 26749 14491 40425 43130 47645 54002 59487
13296 59487 83649 55802 23568 14476 2389 19702 38124 38502 67983 67121 92162 93351 72724
13283 72724 38095 29395 43324 54910 67654 60055 64812 57392 76139 104563 91893 84775 70815
13270 70815 66602 82854 50834 39248 56158 83120 104571 91072 74282 73711 36581 52280
13258 52280 60738 26156 1082 -28760 -41922 -13046 22375 38019 84772 117699 137361 105671
13246 105671 89647 70123 67009 70996 48638 -6550 -22561 21373 50126 45622 46398 27594
13234 27594 2179 16268 14335 -589 9581 45255 53058 43851 56135 54897 69789 73357 67913
13221 67913 57092 69893 73857 90418 67064 50423 57471 66038 50700 49578 62222 64252 53740
$$ packed form
13309A2369N145j4574K4543J1458J5376r314j8254j2258K5934K705M515O357N485
13296E9487K4162k7847l2234r092j2087J7313J8422L78K9481q62K5041J189k0627
13283G2724l4629q700J3929J1586J2744p599M757p420J8747K8424j2670p118j3960
13270G0815m213J6252l2020j1586J6910K6962K1451j3499j6790n71l7130J5699
13258E2280Q458l4582k5074k9842j3162K8876L5421J5644M6753L2927J9662l1690
13246A05671j6024j9524l114L987k2358n5188j6011M3934K8753m504P76j8804
13234B7594k5415J4089j933j4924J0170L5674P803r207J2284j238J4892L568n444
13221F7913j0821J2801L964J6561k3354j6641P048Q567j5338j122J2644K030j0512
$$ plain form
13208 53740 37806 60612 80405 48035 2639 -15758 10453 43975 80703 108349 68354 4307
13196 4307 9076 41715 84610 103957 101897 88347 71133 98050 108936 91256 74291 58033
13184 58033 44313 33559 6875 -23563 -2041 32328 51422 33329 -18624 -1628 44173 67998
13172 67998 57672 73493 86659 75298 76007 96468 88345 101682 111453 119151 109248 69285 63152
13159 63152 66966 24829 17465 22935 50227 80720 79514 45597 48140 47364 27863 36821 52478
13146 52478 52511 28660 24474 -7827 3686 69002 101153 77685 62682 84205 72700 58853
13134 58853 54651 58407 79810 64598 63576 51743 57630 53974 38292 45059 56626 57555 51539
13121 51539 39788 43904 39742 24080 31253 43990 80080 102863 71297 95197 122653 115042
$$ packed form
13208E3740j5934K2806J9793l2370m5396j8397K6211L3522L6728K7646l9995o4047
13196D307M769L2639M2895J9347k060j3550j7214K6917J0886j7680j6965j6258
13184E8033j3720j0754k6684l0438K1522L4369J9094j8093n1953J6996M5801K3825
13172F7998j0326J5821J3166j1361P09K0461q123J3337R771P698r903l9963o133
13159F3152L814m2137p364N470K7292L0493j206l3917K543p76j9501Q958J5657
13146E2478L3k3851m186l2301J1513O5316L2151k3468j5003K1523j1505j3847
13134E8853m202L756K1403j5212j022j1833N887l656j5682O767J1567R29o016
13121E1539j1751M116m162j5662P173J2737L6090K2783l1566K3900K7456p611
$$ plain form
13109 115042 87929 50597 52521 69236 71124 69065 95460 99754 73134 57013 78886 45171
13097 45171 57804 79199 89299 77745 61417 68058 87399 132029 131084 102473 70675 44609
13085 44609 37433 79975 107495 104866 122941 142135 117201 69704 33357 42925 89182 126837
13073 126837 151783 152813 137710 121748 123489 115554 104483 119171 139199 159212 167296 171678
13061 171678 153767 125302 136678 154353 160924 187592 223252 271018 289115 302193 307346 343863
13049 343863 404433 516121 650388 828869 1087047 1417219 1759100 2011063 2005656 1729139
13039 1729139 1343827 948691 687236 512344 400147 316126 267555 280277 248255 218272
13029 218272 215557 204596 179903 171442 173776 183747 198946 181613 128193 108384 93832 79755
$$ packed form
13109A15042k7113l7332J924J6715J888k059K6395M294k6620j6121K1873l3715
13097D5171J2633K1395J0100j1554j6328O641J9341M4630r45k8611l1798k6066
13085D4609p176M2542K7520k629J8075J9194k4934m7497l6347R568M6257L7655
13073A26837K4946J030j5103j5962J741p935j1071J4688K0028K0013Q084M382
13061A71678j7911k8465J1376J7675O571K6668L5660M7766J8097J3078N153L6517
13049C43863O0570J11688J34267J78481K58178L30172L41881K51963n407k76517
13039A729139l85312l95136k61455j74892j12197q4021m8571J2722l2022k9983
13029B18272k715j0961k4693q461K334R971J5199j7333n3420j9809j4552j4077
$$ plain form
13017 79755 69532 53191 80695 104907 108142 127929 99676 85205 82133 79691 83000 73700 25222
13004 25222 43085 48678 47698 30014 45160 94192 106242 87051 92393 105066 77308 42251
12992 42251 30998 27211 35418 14822 23277 75399 87050 117360 170115 160493 149316 123666
12980 123666 72002 73018 89622 121157 142934 117720 110517 101859 79496 96158 101901 76332
12968 76332 71816 76288 87089 71256 90134 119614 118383 110434 59285 78650 112068 80463
12956 80463 47089 69546 91430 97554 72670 62203 53468 53599 49738 52684 65182 78015 87329
12943 87329 61635 72852 99305 133230 136533 145056 129211 131112 130428 117433 110342 99395 95522
12930 95522 84187 75155 82140 72329 62781 39785 66771 103989 113152 123305 106841 84963 54450
$$ packed form
13017G9755j0223j6341K7504K4212L235J9787k8253j4471l072k442L309r300m8478
13004B5222J7863N593r80j7684J5146M9032J2050j9191N342J2673k7758l5057
12992D2251j1253l787Q207k0596Q455N2122J1651L0310N2755r622j1177k5650
12980A23666n1664J016J6604L1535K1777k5214p203q658k2363J6662N743k5569
12968G6332m516M472J0801j5833J8878K9480j231p949n1149J9365L3418l1605
12956H0463l3374K2457K1884O124k4884j0467q735J31l861K946J2498J2833R314
12943H7329k5694J1217K6453L3925L303Q523j5845J901o84j2995p091j0947l873
12930I5522j1335r032O985r811r548k2996K6986L7218R163J0153j6464k1878l0513
$$ plain form
12917 54450 46097 40054 58296 74177 87691 88692 104787 101546 123718 125427 115507 108843 115930
12904 115930 138614 159911 164561 155132 184264 221173 199824 194629 205142 211268 195105 151627
12892 151627 137374 91031 50759 36938 70283 133331 152873 146674 107113 108349 119352 123757
12880 123757 109867 100292 109077 109337 114500 144235 102890 74358 85305 109833 123440 127146 139113
12867 139113 144168 145627 110156 89780 113754 100745 105202 140826 119995 83543 77883 125113
12855 125113 154176 176106 202519 185310 197078 249862 274996 311739 345042 323482 320462 318179
12843 318179 297849 253886 247348 256656 286756 315671 329348 329752 309585 288378 248939 212564
12831 212564 221323 205449 175661 184195 204787 200581 207785 153978 142483 179302 207982 219856
$$ packed form
12917E4450q353o043J8242J5881J3514J001J6095l241K2172J709r920o664P087
12904A15930K2684K1297M650r429K9132L6909k1349n195J0513O126j6163m3478
12892A51627j4253m6343m0272j3821L3345O3048J9542o199l9561J236J1003M405
12880A23757j3890r575Q785K60N163K9735m1345k8532J0947K4528J3607L706J1967
12867A39113N055J459l5471k0376K3974j3009M457L5624k0831l6452n660M7230
12855A25113K9063K1930K6413j7209J1768N2784K5134L6743L3303k1560l020k283
12843C18179k0330m3963o538R308L0100K8915J3677M04k0167k1207l9439l6375
12831B12564Q759j5874k9788Q534K0592m206P204n3807j1495L6819K8680J1874
$$ plain form
12819 219856 205294 147382 128987 175916 195243 184076 162494 143704 171282 154790 151021 161000
12807 161000 144459 163507 194532 219019 186256 156643 174639 179565 190184 209578 196737 231969
12795 231969 228411 202887 195958 204169 171127 148232 125355 36721 -9474 231 13725 40829
12783 40829 83258 100946 123910 151289 194882 213266 203905 189455 183445 184034 183389 179999 218145
12770 218145 234723 255805 243338 231869 264052 293090 300715 282324 288904 274910 267236 276762
12758 276762 302945 284459 260229 275459 275008 280209 262279 302221 332055 334324 345962 306965
12746 306965 317968 311575 286872 277886 322719 365379 347402 309896 323613 328417 331349 333016
12734 333016 315625 312999 322944 367766 397402 408843 413219 390680 385897 387104 400985 448473
$$ packed form
12819B19856j4562n7912j8395M6929J9327j1167k1582j8790K7578j6492l769R979
12807A61000j6541J9048L1025K4487l2763k9613J7996M926J0619J9394j2841L5232
12795B31969l558k5524o929Q211l3042k2895k2877q8634m6195R705J3494K7104
12783D0829M2429J7688K2964K7379M3593J8384r361j4450o010N89o45l390L8146
12770B18145J6578K1082j2467j1469L2183K9038P625j8391O580j3994p674R526
12758B76762K6183j8486k4230J5230m51N201j7930L9942K9834K269J1638l8997
12746C06965J1003o393k4703q986M4833M2660j7977l7506J3717M804K932J667
12734C33016j7391k626R945M4822K9636J1441M376k2539m783J207J3881M7488
$$ plain form
12722 448473 501621 515131 526186 521142 579173 596001 537188 430146 278213 79298 -123369
12711 -123369 -184506 -115540 -24351 30987 98817 152830 196584 214193 216802 226888 249945 293926
12699 293926 325795 326836 305441 319655 298903 302333 313023 315046 326131 330099 301532 316854
12687 316854 350049 397947 433614 390584 367173 422066 454728 444748 475460 463269 441544 455536
12675 455536 495905 499040 483478 530731 536795 556495 551979 529773 571112 618376 645704 645410
12663 645410 654360 667416 702165 747150 726471 723827 767357 819555 850257 883026 921026 945240
12651 945240 968409 992746 1047176 1068381 1118624 1165278 1198980 1242827 1265025 1281506 1309881
12640 1309881 1343392 1359109 1406936 1458689 1514371 1536179 1583595 1632322 1724523 1823178 1925370
$$ packed form
12722D48473N3148J3510J1055n044N8031J6828n8813j07042j51933j98915k02667
12711a23369o1137O8966R1189N5338O7830N4013M3754J7609K609J0086K3057M3981
12699B93926L1869J041k1395J4214k0752L430J0690K023J1085L968k8567J5322
12687C16854L3195M7898L5667m3030k3411N4893L2662r980L0712j2191k1725J3992
12675D55536M0369L135j5562M7253O064J9700m516k2206M1339M7264K7328k94
12663F45410Q950J3056L4749M4985k0679k644M3530N2198L0702L2769L8000K4214
12651I45240K3169K4337N4430K1205N0243M6654L3702M3847K2198J6481K8375
12640A309881L3511J5717M7827N1753N5682K1808M7416M8727R2201R8655J02192
$$ plain form
12629 1925370 2029330 2146564 2234626 2348194 2492568 2605063 2690485 2827174 3002133 3198653
12619 3198653 3428273 3713335 3978069 4210744 4500246 4795395 5166510 5562842 6015260
12610 6015260 6562591 7151139 7820639 8643218 9735993 11133018 12825723 14783393 16848520
12601 16848520 18879268 21240748 24380603 28777265 34902321 43499339 55801067 73927722
12593 73927722 101294794 142884669 203871160 285615313 376604233 435474238 410842845
12586 410842845 318095473 221978703 153263574 109003866 80524365 61590905 48538012
12579 48538012 39273811 32438937 27324095 23610105 20853715 18788706 16985071 15072097
12571 15072097 13091706 11376054 10007574 8868542 7858019 6988440 6304658 5714292
$$ packed form
12629A925370J03960J17234Q8062J13568J44374J12495Q5422J36689J74959J96520
12619C198653K29620K85062K64734K32675K89502K95149L71115L96332M52418
12610F015260N47331N88548O69500Q22579J092775J397025J692705J957670K065127
12601A6848520K030748K361480L139855M396662O125056Q597018J2301728J8126655
12593G3927722K7367072M1589875O0986491Q1744153R0988920N8870005k4631393
12586D10842845r2747372r6116770o8715129m4259708k8479501j8933460j3052893
12579D8538012r264201o834874n114842l713990k756390k065009j803635j912974
12571A5072097j980391j715652j368480j139032j010523q69579o83782n90366
$$ plain form
12563 5714292 5142085 4677777 4265822 3907133 3588362 3312467 3108737 2981392 2843397
12554 2843397 2717001 2602374 2481926 2334857 2168507 2050409 1962401 1853025 1706422 1632920
12544 1632920 1585529 1527542 1488127 1427195 1350511 1299569 1239025 1154788 1063431 1015684 977073
12533 977073 952095 944576 903091 823344 797833 795421 793976 790832 732725 705935 686952 671068
12521 671068 680231 652017 642927 636687 619936 606450 591424 614399 615430 591706 608412 593171
12509 593171 563483 588249 599711 587814 576972 529986 486365 448640 417524 396992 414472
12498 414472 425180 450071 440005 433155 428963 427897 418897 422894 419675 428380 384931 351731 369779
12485 369779 376085 362863 372002 396190 397906 404906 380139 352145 352718 352108 378641 434337 447834
$$ packed form
12563E714292n72207m64308m11955l58689l18771k75895k03730j27345j37995
12554B843397j26396j14627j20448j47069j66350j18098q8008j09376j46603p3502
12544A632920m7391n7987l9415o0932p6684n0942o0544q4237r1357m7747l8611
12533I77073k4978p519m1485p9747k5511k412j445l144n8107k6790j8983j5884
12521F71068R163k8214r090o240j6751j3486j5026K2975J031k3724J6706j5241
12509E93171k9688K4766J1462j1897j0842m6986m3621l7725l1116k0532J7480
12498D14472J0708K4891j0066o850m192j066r000L997l219Q705m3449l3200J8048
12485C69779O306j3222R139K4188J716P000k4767k7994N73o10K6533N5696J3497
$$ plain form
12472 447834 482177 470067 492909 529120 599429 694200 787455 849982 938110 916313 799452
12461 799452 623526 492460 410016 362809 349395 340068 299328 267130 267008 264561 263707 254346
12449 254346 234826 250391 260977 249528 226684 212506 194576 184969 191694 228311 269435 264051
12437 264051 255907 211893 210528 211664 216457 244390 254483 235387 229299 201095 186900 176857
12425 176857 185199 196867 194649 168619 145968 144950 159586 191599 184721 158081 148042 132613
12413 132613 144266 147419 132649 135614 176740 178927 142284 150443 166499 156004 156777 154986 178847
12400 178847 199195 214850 203326 207472 242184 245512 255501 305974 296931 287334 280038 282054 291299
12387 291299 286730 256740 225576 203606 217981 186469 155354 168762 226955 242126 203919 161039
$$ packed form
12472D47834L4343j2110K2842L6211P0309R4771R3255O2527Q8128k1797j16861
12461G99452j75926j31066q2444m7207j3414r327m0740l2198j22k447q54r361
12449B54346j9520J5565J0586j1449k2844j4178j7930r607O725L6617M1124n384
12437B64051q144m4014j365J136M793K7933J0093j9096o088k8204j4195j0043
12425A76857Q342J1668k218k6030k2651j018J4636L2013o878k6640j0039j5429
12413A32613J1653L153j4770K965M1126K187l6643Q159J6056j0495P73j791K3861
12400A78847K0348J5655j1524M146L4712L328R989N0473r043r597p296K016R245
12387B91299m569k9990l1164k1970J4375l1512l1115J3408N8193J5171l8207m2880
$$ plain form
12375 161039 171194 189423 190068 161321 112099 124427 145176 186854 177706 194051 204799 189097
12363 189097 186039 186929 198074 214286 194779 175712 180861 190866 207145 203844 200358 211693 215171
12350 215171 178198 157903 166406 164862 158242 140245 171450 169294 157136 171680 168592 196185
12338 196185 222342 218190 212541 219181 200097 210059 214252 213695 218119 220416 239209 236033 234664 234696
12324 234696 243590 239699 209879 201456 178567 177207 242109 265570 233693 207665 233949 249199
12312 249199 214540 195930 233783 247310 260190 268963 272305 251444 224074 199905 208570 218925
12300 218925 197880 193153 168377 161799 183039 218885 212060 210502 212609 215776 239520 219870 186562
12287 186562 153949 179062 202931 204261 214631 232697 269337 255589 262603 252909 243858 248461
$$ packed form
12375A61039J0155J8229O45k8747m9222J2328K0749M1678r148J6345J0748j5702
12363A89097l058Q90J1145J6212j9507j9067N149J0005J6279l301l486J1335L478
12350B15171l6973k0295Q503j544o620j7997L1205k156j2158J4544l088K7593
12338A96185K6157m152n649O640j9084R962M193n57M424K297J8793l176j369L2
12324B34696Q894l891k9820q423k2889j360O4902K3461l1877k6028K6284J5250
12312B49199l4659j8610L7853J3527J2880Q773L342k0861k7370k4169Q665J0355
12300B18925k1045m727k4776o578K1240L5846o825j558K107L167K3744j9650l3308
12287A86562l2613K5113K3869J330J0370J8066L6640j3748P014r694r051M603
$$ plain form
12275 248461 270835 288230 260947 267373 292468 241379 230354 255483 253483 243534 213193 199699
12263 199699 191016 169815 157683 151997 178853 208947 195437 204997 210086 249907 225266 188198
12251 188198 198291 205779 269236 279269 267972 274883 283851 310759 293056 270077 266821 278422
12239 278422 262794 296266 308439 265291 255665 287148 301537 286726 297025 322932 323381 325804
12227 325804 372688 362931 336118 322815 329591 320492 363486 374032 359753 335201 338612 338449 331876
12214 331876 325143 323802 314242 354878 393388 366073 304511 298085 311712 307067 298331 326556 329438
12201 329438 326398 340091 351884 375819 386733 393856 401231 384160 412878 435964 363577 318651
12189 318651 335859 341233 361169 376333 407720 413945 387209 412940 415619 408895 412942 384607
$$ packed form
12275B48461K2374J7395k7283O426K5095n1089j1025K5129k000r949l0341j3494
12263A99699q683k1201j2132n686K6856L0094j3510R560N089L9821k4641l7068
12251A88198J0093P488O3457J0033j1297O911Q968K6908j7703k2979l256J1601
12239B78422j5628L3472J2173m3148r626L1483J4389j4811J0299K5907M49K423
12227C25804M6884r757k6813j3303O776r099M2994J0546j4279k4552L411j63o573
12214C31876o733j341r560M0636L8510k7315o1562o426J3627m645q736K8225K882
12201C29438l040J3693J1793K3935J0914P123P375j7071K8718K3086p2387m4926
12189C18651J7208N374J9936J5164L1387O225k6736K5731K679o724M047k8335
$$ plain form
12177 384607 357385 374107 415430 459440 478290 448272 422570 402103 390392 415151 421509 431458
12165 431458 461485 455195 434815 458149 482552 455867 439488 474946 508813 524247 552764 573642
12153 573642 568953 556386 536856 530744 536959 516745 538202 530563 505510 559535 593510 637507
12141 637507 664342 646210 661545 695617 706824 742960 803516 847868 937828 1078134 1264878
12130 1264878 1522293 1837462 2202078 2513542 2604705 2382634 1982821 1594424 1325955 1165999
12120 1165999 1045827 960417 906569 850447 796140 770247 797903 816311 791990 785500 759933
12109 759933 735134 747379 780132 780856 784482 787464 805601 811998 799528 801283 787156 796032 836305
12096 836305 818593 816875 874740 878466 827361 806989 834370 877614 916239 918971 907696 939302
$$ packed form
12177C84607k7222J6722M1323M4010J8850l0018k5702k0467j1711K4759O358R949
12165D31458L0027o290k0380K3334K4403k6685j6379L5458L3867J5434K8517K0878
12153E73642m689j2567j9530o112O215k0214K1457p639k5053N4025L3975M3997
12141F37507K6835j8132J5335L4072J1207L6136O0556M4352Q9960J40306J86744
12130A264878K57415L15169L64616L11464R1163k22071l99813l88397k68469j59956
12120A165999j20172q5410n3848n6122n4307k5893K7656J8408k4321o490k5567
12109G59933k4799J2245L2753P24L626K982J8137O397j2470J755j4127Q876M0273
12096H36305j7712j718N7865L726n1105k0372K7381M3244L8625K732j1275L1606
$$ plain form
12084 939302 925994 911425 937147 933577 898685 910585 928691 989762 1011524 1011134 1013616 1010820
12072 1010820 1047708 1081664 1112437 1126265 1130948 1150310 1145681 1137331 1137926 1156456 1181384 1209000
12060 1209000 1217234 1216642 1199070 1204614 1229513 1243173 1259892 1270008 1308990 1352539 1382696 1382269
12048 1382269 1406823 1442136 1452317 1467087 1472972 1508643 1513074 1526986 1571601 1564753 1561520 1606114
12036 1606114 1666313 1678911 1701886 1727490 1771925 1778642 1766850 1791024 1824485 1845410 1869075
12025 1869075 1911453 1960995 2005513 2018355 2057024 2093322 2132527 2128036 2176727 2240857 2227535
12014 2227535 2270688 2308964 2343035 2370599 2362003 2393409 2446245 2517563 2566447 2575914 2622049 2697058
12002 2697058 2751409 2789106 2827621 2900053 2961919 2987591 3044463 3111344 3171087 3220705 3256759
$$ packed form
12084I39302j3308j4569K5722l570l4892J1900J8106O1071K1762l90K482k796
12072A010820L6888L3956L0773J3828M683J9362m629q350N95J8530K4928K7616
12060A209000Q234n92j7572N544K4899J3660J6719J0116L8982M3549L0157m27
12048A382269K4554L5313J0181J4770N885L5671M431J3912M4615o848l233M4594
12036A606114O0199J2598K2975K5604M4435O717j1792K4174L3461K0925K3665
12025A869075M2378M9542M4518J2842L8669L6298L9205m491M8691O4130j3322
12014B227535M3153L8276L4071K7564q596L1406N2836P1318M8884R467M6135P5009
12002B697058N4351L7697L8515P2432O1866K5672N6872O6881N9743M9618L6054
$$ plain form
11991 3256759 3285289 3363153 3460298 3563523 3624841 3680348 3733889 3791815 3844072 3938959 4033691
11980 4033691 4097383 4193995 4279427 4353989 4460866 4542232 4646391 4743110 4818120 4898567 4969636
11969 4969636 5036022 5137747 5246167 5358751 5485333 5571956 5681779 5792327 5923782 6040345
11959 6040345 6144697 6234644 6367707 6484571 6577848 6683351 6811883 6917110 7044619 7183472
11949 7183472 7316912 7455538 7599663 7709185 7846269 7960030 8071073 8169970 8286111 8408265
11939 8408265 8531397 8623075 8717935 8791315 8909544 9020125 9097044 9188406 9290676 9410991
11929 9410991 9506887 9540416 9576517 9605173 9659521 9716925 9774154 9809909 9844397 9863782 9900424
11918 9900424 9899439 9869134 9851692 9855776 9854157 9832769 9805816 9771901 9714741 9644381 9576019 9510230
$$ packed form
11991C256759K8530P7864R7145J03225O1318N5507N3541N7926N2257R4887R4732
11980D033691O3692R6612Q5432P4562J06877Q1366J04159R6719P5010Q0447P1069
11969D969636O6386J01725J08420J12584J26582Q6623J09823J10548J31455J16563
11959F040345J04352Q9947J33063J16864R3277J05503J28532J05227J27509J38853
11949G183472J33440J38626J44125J09522J37084J13761J11043R8897J16141J22154
11939H408265J23132R1678R4860P3380J18229J10581P6919R1362J02270J20315
11929I410991R5896L3529L6101K8656N4348N7404N7229L5755L4488J9385L6642
11918I900424r85l0305j7442M084j619k1388k6953l3915n7160p0360o8362o5789
$$ plain form
11906 9510230 9431302 9348077 9279600 9186741 9091812 9004302 8920868 8791626 8652925 8552558 8403540
11895 8403540 8296374 8197110 8106551 8009662 7871142 7757077 7654722 7516133 7364465 7243288
11885 7243288 7129679 7019819 6924287 6790108 6642671 6543076 6435307 6284861 6145442 6014968
11875 6014968 5920726 5830148 5732547 5623499 5493887 5383646 5327044 5212284 5112087 5073312
11865 5073312 5013382 4905753 4775862 4675648 4563003 4482066 4387708 4309418 4227305 4165673
11855 4165673 4105606 4020927 3925397 3790531 3682691 3622936 3578269 3569057 3521555 3460112 3388476
11844 3388476 3313217 3249407 3181491 3154943 3120356 3041655 2959395 2957757 2891317 2802012 2743872
11833 2743872 2691786 2659579 2645075 2563771 2522062 2485745 2440660 2430287 2411199 2353138 2312895
$$ packed form
11906I510230p8928q3225o8477r2859r4929q7510q3434j29242j38701j00367j49018
11895H403540j07166r9264r0559r6889j38520j14065j02355j38589j51668j21177
11885G243288j13609j09860r5532j34179j47437r9595j07769j50446j39419j30474
11875F014968r4242r0578r7601j09048j29612j10241n6602j14760j00197l8775
11865E073312n9930j07629j29891j00214j12645q0937r4358p8290q2113o1632
11855D165673o0067q4679r5530j34866j07840n9755m4667r212m7502o1443p1636
11844C388476p5259o3810o7916k6548l4587p8701q2260j638o6440q9305n8140
11833B743872n2086l2207j4504q1304m1709l6317m5085j0373j9088n8061m0243
$$ plain form
11822 2312895 2279087 2232677 2228501 2205399 2191862 2145793 2057458 1995182 1947982 1928469 1915450
11811 1915450 1881582 1857630 1823219 1775295 1740980 1746272 1769828 1757670 1735057 1682697 1626213
11800 1626213 1577931 1552269 1549511 1539428 1537639 1509525 1468601 1453755 1428962 1431011 1468663 1446269
11788 1446269 1400008 1345844 1303196 1310620 1294613 1270417 1258799 1256283 1211793 1206181 1221456 1213722
11776 1213722 1171383 1133113 1131923 1099314 1070975 1077713 1054318 1009938 984722 1003162 987865 1003394
11764 1003394 1009571 1001150 964526 973983 976636 955292 940545 929671 917595 922405 924136 928219 911223
11751 911223 927304 915739 849458 810818 793446 806437 824568 841565 855045 838755 827658
11740 827658 805885 768449 755511 744682 712164 697889 691755 673009 681942 675034 660680 667685
$$ packed form
11822B312895l3808m6410m176k3102j3537m6069q8335o2276m7200j9513j3019
11811A915450l3868k3952l4411m7924l4315N292K3556j2158k2613n2360n6484
11800A626213m8282k5662k758j0083j789k8114m0924j4846k4793K049L7652k2394
11788A446269m6261n4164m2648P424j6007k4196j1618k516m4490n612J5275p734
11776A213722m2339l8270j190l2609k8339O738k3395m4380k5216J8440j5297J5529
11764A003394O177q421l6624R457K653k1344j4747j0874j2076M810J731M083j6996
11751I11223J6081j1565o6281l8640j7372J2991J8131J6997J3480j6290j1097
11740H27658k1773l7436j2938j0829l2518j4275o134j8746Q933o908j4354P005
$$ plain form
11728 667685 650287 617438 624027 624424 644588 630801 629604 632662 636190 610273 590621 582893 573591
11715 573591 586503 606591 603574 595948 582124 575609 552951 556645 538568 524691 538039 512596
11703 512596 511363 528378 532815 503217 500537 469335 459109 447850 432392 456316 442753 426529
11691 426529 467629 487887 480610 486460 484099 495084 505998 493695 504282 500912 483803 453939
11679 453939 439020 428076 419058 412276 397852 377152 407446 408121 413137 424191 433041 411920 389525
11666 389525 395668 406912 416020 406818 343575 324374 332639 347315 335320 350306 344642 309866
11654 309866 300899 289935 308339 306760 317180 353389 364928 375141 366418 358134 364296 349646
11642 349646 349475 365014 374293 343840 321120 298625 293498 267945 265739 285253 278060 295953 277313
$$ packed form
11728F67685j7398l2849O589L97K0164j3787j197L058L528k5917j9652p728r302
11715E73591J2912K0088l017p626j3824o515k2658L694j8077j3877J3348k5443
11703E12596j233J7015M437k9598k680l1202j0226j1259j5458K3924j3563j6224
11691D26529M1100K0258p277N850k361J0985J0914j2303J0587l370j7109k9864
11679D53939j4919j0944r018o782j4424k0700L0294O75N016J1054Q850k1121k2395
11666C89525O143J1244R108r202o3243j9201Q265J4676j1995J4986n664l4776
11654C09866q967j0964J8404j579J0420L6209J1539J0213q723q284O162j4650
11642C49646j71J5539R279l0453k2720k2495n127k5553k206J9514p193J7893j8640
$$ plain form
11629 277313 240664 225783 252221 306144 304756 295549 277597 278228 267426 240646 238472 292217
11617 292217 297396 283111 286518 274425 260804 234261 194757 207208 206778 231561 249646 287583
11605 287583 310372 283489 247373 252666 263518 259387 241490 207074 199681 221256 244239 244683
11593 244683 212057 210318 190282 197033 184440 215710 215607 177021 179836 175259 183240 212563 234426
11580 234426 216898 221107 203402 219053 240658 228554 211853 190500 217223 252569 249575 267868
11568 267868 283467 236038 182260 184544 196849 217608 223513 213340 231440 243025 228739 220311
11556 220311 196691 190761 192239 182323 175753 167654 160751 174710 179761 193854 199969 174472 172982
11543 172982 189603 178520 145909 121326 154458 166204 165694 163067 188721 145019 159967 204024
$$ packed form
11629B77313l6649j4881K6438N3923j388r207j7952O31j0802k6780k174N3745
11617B92217N179j4285L407j2093j3621k6543l9504J2451m30K4783J8085L7937
11605B87583K2789k6883l6116N293J0852m131j7897l4416p393K1575K2983M44
11593B44683l2626j739k0036O751j2593L1270j03l8586K815m577P981K9323K1863
11580B34426j7528M209j7705J5651K1605j2104j6701k1353K6723L5346k994J8293
11568B67868J5599m7429n3778K284J2305K0759N905j0173J8100J1585j4286q428
11556B20311k3620n930J478r916o570q099o903J3959N051J4093O115k5497j490
11543A72982J6621j1083l2611k4583L3132J1746n10k627K5654m3702J4948M4057
$$ plain form
11531 204024 195360 182250 145085 140764 144333 152129 178351 161221 134747 127618 124598 140570 161361
11518 161361 168278 138346 138248 131235 142767 151135 161945 188118 173815 159252 154973 127822 103858
11505 103858 105503 115489 108898 76937 69781 123776 164893 133799 123228 167204 161286 105114
11493 105114 119429 150395 146783 147611 176012 155342 123456 142806 132307 95939 85023 84129
11481 84129 82973 109551 130457 117493 122430 154203 150121 121867 120564 103422 87278 118173
11469 118173 119885 129655 143990 113978 125971 119598 105898 103500 128792 110407 101985 84263
11457 84263 96807 124065 123613 101420 90489 69585 115297 121693 121682 118795 95373 76036 71410
11444 71410 102589 105895 91243 83493 91078 98226 53846 47063 27110 26768 31560 61601 99321
$$ packed form
11531B04024q664j3110l7165m321L569P796K6222j7130k6474p129l020J5972K0791
11518A61361O917k9932r8p013J1532Q368J0810K6173j4303j4563m279k7151k3964
11505A03858J645R986o591l1961p156N3995M1117l1094j0571M3976n918n6172
11493A05114J4315L0966l612Q28K8401k0670l1886J9350j0499l6368j0916q94
11481H4129j156K6578K0906j2964M937L1773m082k8254j303j7142j6144L0895
11469A18173J712R770J4335l0012J1993o373j3700k398K5292j8385q422j7722
11457H4263J2544K7258m52k2193j0931k0904M5712O396j1k887k3422j9337m626
11444G1410L1179L306j4652p750P585P148m4380o783j9953l42M792L0041L7720
$$ plain form
11431 99321 109431 106224 92237 77922 68933 70211 125070 118267 96424 121060 106496 76762
11419 76762 70144 80541 92687 105369 138841 115253 67164 16440 2894 16543 15583 16084 32633
11406 32633 53940 68762 67998 69465 71798 93229 75624 64187 87350 85553 82777 68070 40217
11393 40217 27760 51877 75402 88420 108597 119042 110444 90762 91055 59438 43838 39853
11381 39853 45411 64110 83071 58126 97571 139972 122356 103285 83790 96267 77828 69905
11369 69905 76959 65957 34638 9423 -9530 -18195 -36350 -42872 19582 59675 62102 14311
11357 14311 14061 43415 70497 44276 15589 -3922 35712 44318 49367 50596 63218 51886 52400
11344 52400 58367 53455 39502 32691 45222 24879 36460 68349 51824 38509 65620 66364 60209
$$ packed form
11431I9321J0110l207j3987j4315q989J278N4859o803k1843K4636j4564k9734
11419G6762o618J0397J2146J2682L3472k3588m8089n0724j3546J3649r60N01J6549
11406C2633K1307J4822p64J467K333K1431j7605j1437K3163j797k776j4707k7853
11393D0217j2457K4117K3525J3018K0177J0445q598j9682K93l1617j5600l985
11381C9853N558J8699J8961k4945L9445M2401j7616j9071j9495J2477j8439p923
11369F9905P054j1002l1319k5215j8953q665j8155o522O2454M0093K427m7791
11357A4311k50K9354K7082k6221k8687j9511L9634Q606N049J229J2622j1332N14
11344E2400N967m912j3953o811J2531k0343J1581L1889j6525j3315K7111P44o155
$$ plain form
11331 60209 98331 90037 61486 61412 69696 49576 3898 2732 5043 51643 39153 53841 57578
11318 57578 43204 65687 87572 86973 101791 95349 132431 124580 92143 80368 100147 95992 91092
11305 91092 82347 74407 85082 86845 87674 86104 80897 92780 85041 95611 87509 87342 76055 91204
11291 91204 78713 60772 104233 91827 75185 76919 68139 55612 19796 -16537 -3647 23973
11279 23973 46578 73049 82172 53128 32046 45296 50115 42493 48471 59076 64181 71688 87958
11266 87958 61637 41562 43000 32293 35100 47530 55715 44523 32819 28492 42387 22109
11254 22109 30398 58465 46152 76802 52063 49345 66317 27273 11373 -15585 -12609 -2621
11242 -2621 -1395 19095 34307 44173 23210 22090 6028 28413 64627 67186 87938 94644 41956
$$ packed form
11331F0209L8122q294k8551p4Q284k0120m5678j166K311M6600j2490J4688L737
11318E7578j4374K2483K1885n99J4818o442L7082p851l2437j1775J9779m155m900
11305I1092q745p940J0675J763Q29j570n207J1883p739J0570q102j67j1287J5149
11291I1204j2491j7941M3461j2406j6642J734q780j2527l5816l6333J2890K7620
11279B3973K2605K6471R123k9044k1082J3250M819p622N978J0605N105P507J6270
11266H7958k6321k0075J438j0707K807J2430Q185j1192j1704m327J3895k0278
11254B2109Q289K8067j2313L0650k4739k718J6972l9044j5900k6958K976R988
11242b621J226K0490J5212R866k0963j120j6062K2385L6214K559K0752O706n2688
$$ plain form
11229 41956 23863 20981 7691 10601 35155 55832 80480 102507 99605 54349 11809 4681
11217 4681 -694 31212 22964 608 -30917 -19401 22693 48302 81839 89369 92081 78528 52298
11204 52298 28582 30213 39153 48677 80407 92865 94304 93206 77930 90994 83722 101462 139804
11191 139804 108802 78565 52167 62513 28736 33053 64911 76846 60705 29860 14571 17945
11179 17945 -12733 -27405 -21216 -14752 17088 14786 29075 41116 28186 19573 40330 42272 49198
11166 49198 44145 85880 84341 68177 57374 39184 15577 7581 -1339 -2773 40722 59469 53594
11153 53594 49210 45694 31295 32379 53297 35792 44716 71927 59078 30172 42943 33624 31789
11140 31789 43300 48572 44790 51690 57604 36529 30413 50317 72923 86447 94361 59693 57641
$$ packed form
11229D1956j8093k882j3290K910K4554K0677K4648K2027k902m5256m2540p128
11217D681n375L1906q248k2356l1525J1516M2094K5609L3537P530K712j3553k6230
11204E2298k3716J631Q940R524L1730J2458J439j098j5276J3064p272J7740L8342
11191A39804l1002l0237k6398J0346l3777M317L1858J1935j6141l0845j5289L374
11179A7945l0678j4672O189O464L1840k302J4289J2041j2930q613K0757J942O926
11166D9198n053M1735j539j6164j0803j8190k3607p996q920j434M3495J8747n875
11153E3594m384l516j4399J084K0918j7505Q924K7211j2849k8906J2771r319j835
11140C1789J1511N272l782O900N914k1075o116J9904K2606J3524P914l4668k052
$$ plain form
11127 57641 71853 71932 90504 94779 81773 67371 30604 -4884 -5704 4142 24830 35821 49706
11114 49706 65090 42260 39613 50801 53805 43223 27316 17926 1808 10629 39835 61335
11102 61335 60891 40570 18897 16739 31927 53857 46925 40927 33579 48092 55002 75560 85372
11089 85372 65891 41148 31911 41868 68344 85347 81466 62606 63477 44057 41651 95511 110695
11076 110695 95404 81499 103183 65245 44255 49723 44595 39926 31358 49341 65016 48035
11064 48035 37332 23534 49409 50667 43512 59075 72494 51065 57198 8822 4342 14584
11052 14584 5453 475 24632 71241 135601 166149 156806 151151 159543 213465 229817 170912 184785
11039 184785 220768 247172 247076 231289 284041 358945 408725 436685 422626 367974 357580 331348
$$ packed form
11127E7641J4212P9J8572M275j3006j4402l6767l5488q20R846K0688J0991J3885
11114D9706J5384k2830k647J1188L004j0582j5907r390j6118Q821K9206K1500
11102F1335m44k0321k1673k158J5188K1930o932n998p348J4513O910K0558R812
11089H5372j9481k4743r237R957K6476J7003l881j8860Q71j9420k406N3860J5184
11076A10695j5291j3905K1684l7938k0990N468n128m669q568J7983J5675j6981
11064D8035j0703j3798K5875J258p155J5563J3419k1429O133m8376m480J0242
11052A4584r131m978K4157M6609O4360L0548r343n655Q392N3922J6352n8905J3873
11039A84785L5983K6404r6j5787N2752P4904M9780K7960j4059n4652j0394k6232
$$ plain form
11027 331348 316450 305134 305439 338720 406938 474795 519675 534522 504558 474109 435128 348678
11015 348678 339398 327144 305090 320489 335816 359616 408633 428296 390451 327180 285196 225808
11003 225808 215644 217983 204640 225328 220880 195457 184990 202193 184136 115903 87287 115883
10991 115883 88893 59181 56232 81831 92644 73488 55699 56031 60197 63991 54965 51658 20789
10978 20789 -9988 -20964 -14400 19807 38004 61496 73181 67718 40333 2963 15214 41021
10966 41021 59170 48781 55128 42659 26407 32996 45397 77873 69686 59049 89343 90287 65167
10953 65167 84422 44969 24862 43970 49955 63470 59596 54754 24770 8698 35321 55449
10941 55449 67135 68507 32439 -8051 -4224 26002 68061 83468 67264 68925 58788 43326
$$ packed form
11027C31348j4898j1316L05L3281O8218O7857M4880J4847k9964l0449l8981q6450
11015C48678r280j2254k2054J5399J5327K3800M9017J9663l7845o3271m1984n9388
11003B25808j0164K339j3343K0688m448k5423j0467J7203j8057o8233k8616K8596
10991A15883k6990k9712k949K5599J0813j9156j7789L32M166L794r026l307l0869
10978B0789l0777j0976O564L4207J8197K3492J1685n463k7385l7370J2251K5807
10966D1021J8149j0389O347j2469j6252O589J2401L2476q187j0637L0294R44k5120
10953F5167J9255l9453k0107J9108N985J3515l874m842k9984j6072K6623K0128
10941E5449J1686J372l6068m0490L827L0226M2059J5407j6204J661j0137j5462
$$ plain form
10929 43326 27858 54136 89204 89555 36906 28480 43374 36369 31823 62849 61300 38255 32410
10916 32410 59539 75836 72943 21478 14053 47746 45906 71018 60369 25380 28286 6337
10904 6337 3764 6820 35716 46995 34412 42317 54479 68503 49179 44223 52430 49035 35372
10891 35372 29902 47453 36808 12994 16197 48209 55339 43189 63729 68228 63962 73567 82180
10878 82180 76830 77468 82106 90794 77443 62464 63384 48094 63156 58473 95853 83490 60187
10865 60187 94329 111532 95050 86729 75680 66737 67055 84299 112700 119919 114406 90221 104594
10852 104594 130534 162138 141354 120927 131528 129952 127522 95224 72042 73915 82204 88074
10840 88074 96779 101852 96457 119324 137898 140956 128268 124339 113753 102310 112825 134454 125385
$$ packed form
10929D3326j5468K6278L5068L51n2649q426J4894p005m546L1026j549k3045n845
10916C2410K7129J6297k893n1465p425L3693j840K5112j0649l4989K906k1949
10904F337k573L056K8896J1279j2583P905J2162J4024j9324m956Q207l395j3663
10891C5372n470J7551j0645k3814L203L2012P130j2150K0540M499m266R605Q613
10878H2180n350O38M638Q688j3351j4979R20j5290J5062m683L7380j2363k3303
10865F0187L4142J7203j6482q321j1049q943L18J7244K8401P219n513k4185J4373
10852A04594K5940L1604k0784k0427J0601j576k430l2298k3182J873Q289N870
10840H8074Q705N073n395K2867J8574L058j2688l929j0586j1443J0515K1629r069
$$ plain form
10827 125385 126859 92504 81397 76311 74562 63059 27516 38448 40660 33537 45145 30266
10815 30266 37097 80795 107152 83628 61325 30644 41183 33349 35791 46136 66848 67658 81937
10802 81937 89207 99898 55491 48389 75926 89141 72723 54913 72903 80187 90463 97249
10790 97249 80779 101347 130835 106967 121781 113798 90051 98415 62856 26879 12241 36067
10778 36067 34015 11995 22306 60779 58654 76903 76206 81760 91568 116149 133738 124450 131205
10765 131205 105001 91168 93415 100041 103587 95788 107059 119735 136063 170444 149046 100893
10753 100893 88504 94501 116717 131565 117949 134449 154520 129453 95048 102745 99822 103891
10741 103891 138876 147321 151038 105627 91523 66189 82425 113168 109515 113632 124688 142860
$$ packed form
10827A25385J474l4355j1107n086j749j1503l5543J0932K212p123J1608j4879
10815C0266O831M3698K6357k3524k2303l0681J0539p834K442J0345K0712Q10J4279
10802H1937P270J0691m4407p102K7537J3215j6418j7810J7990P284J0276O786
10790I7249j6470K0568K9488k3868J4814p983k3747Q364l5559l5977j4638K3826
10778C6067k052k2020J0311L8473k125J8249o97N554R808K4581J7589r288O755
10765A31205k6204j3833K247O626L546p799J1271J2676J6328L4381k1398m8153
10753A00893j2389N997K2216J4848j3616J6500K0071k5067l4405P697k923M069
10741A03891L4985Q445L717m5411j4104k5334J6236L0743l653M117J1056J8172
$$ plain form
10729 142860 157600 146207 103515 72009 90836 93737 117767 148685 179466 200870 214416 207805
10717 207805 168343 124810 130120 125794 110990 116595 85972 104367 128789 123608 143626 115887
10705 115887 89241 105571 109737 90101 82908 104457 106782 103575 97945 91117 85208 73096 103083
10692 103083 117459 111126 159579 181155 190657 196218 199145 193873 171165 145784 133287 170247
10680 170247 212157 240606 236786 183623 183049 206752 227312 232443 247202 277721 271952 272806 295062
10667 295062 281551 277309 294994 335406 389722 402316 411675 402313 405273 448829 484876 493574
10655 493574 543702 596107 685674 757744 709693 608973 599553 637618 656720 676505 707861
10644 707861 728105 760938 797344 851751 927981 967517 1024286 1113183 1192092 1299890 1447673
$$ packed form
10729A42860J4740j1393m2692l1506J8827K901K4030L0918L0781K1404J3546o611
10717B07805l9462m3533N310m326j4804N605l0623J8395K4422n181K0018k7739
10705A15887k6646J6330M166j9636p193K1549K325l207n630o828n909j2112K9987
10692A03083J4376o333M8453K1576R502N561K927n272k2708k5381j2497L6960
10680A70247M1910K8449l820n3163n74K3703K0560N131J4759L0519n769Q54K2256
10667B95062j3511m242J7685M0412N4316J2594R359r362K960M3556L6047Q698
10655D93574N0128N2405Q9567P2070m8051j00720r420L8065J9102J9785L1356
10644G07861K0244L2833L6406N4407P6230L9536N6769Q8897P8909J07798J47783
$$ plain form
10633 1447673 1611370 1797107 2020135 2247782 2410182 2549205 2783138 3066487 3400077
10624 3400077 3873494 4510532 5379186 6580742 8222688 10501184 13524665 17380753 22012623
10615 22012623 26731731 30271388 31445511 30324979 28329806 26796113 26440333 27639943
10607 27639943 30670787 35839064 43300304 52660882 62173198 68296783 68017958 62241056
10599 62241056 55067644 49496127 46701081 46989593 50380877 57058577 66977288 79029609
10591 79029609 90364215 95908608 91689116 80040063 67135454 56880035 50276237
10584 50276237 47102485 47012327 49800203 55016464 61576282 67168238 68324309 62954756
10576 62954756 53157159 43172109 35449612 30355099 27470267 26433329 26808007 28190392
$$ packed form
10633A447673J63697J85737K23028K27647J62400J39023K33933K83349L33590
10624C400077M73417O37038Q68654J201556J641946K278496L023481L856088M631870
10615B2012623M719108L539657J174123j120532j995173j533693l55780J199610
10607B7639943L030844N168277P461240R360578R512316O123585k78825n776902
10599F2241056p173412n571517k795046K88512L391284O677700R918711J2052321
10591G9029609J1334606N544393m219492j1649053j2904609j0255419o603798
10584E0276237l173752r0158K787876N216261O559818N591956J156071n369553
10576F2954756r797597r985050p722497n094513k884832j036938L74678J382385
$$ plain form
10568 28190392 29926209 31004833 30180620 26868725 22010911 17176124 13179789 10169889
10560 10169889 7962167 6368555 5235968 4410830 3760282 3253564 2806788 2462319 2202718
10551 2202718 1962904 1760290 1562774 1400371 1256062 1128987 1018316 927251 824993 742301
10541 742301 676795 644255 632479 600220 579083 556080 537930 504046 471574 466513 455541 407911
10529 407911 350186 327089 357089 347643 313515 279846 288847 306911 320485 306401 294064 240971
10517 240971 217616 221729 241920 272153 241656 187023 178243 138043 141962 137638 156561 156688 152827
10504 152827 135033 131234 143157 121508 117424 151022 182635 164809 152229 153892 149773 169517
10492 169517 158031 162354 167371 162296 155427 151096 132837 118110 102106 114625 123851 132486 185284
$$ packed form
10568B8190392J735817J078624q24213l311895m857814m834787l996335l009900
10560A0169889k207722j593612j132587q25138o50548n06718m46776l44469k59601
10551B202718k39814k02614j97516j62403j44309j27075j10671r1065j02258q2692
10541G42301o5506l2540j1776l2259k1137k3003j8150l3884l2472n061j0972m7630
10529D07911n7725k3097L0000r446l4128l3669R001J8064J3574j4084j2337n3093
10517B40971k3355M113K0191L0233l0497n4633q780m0200L919m324J8923J27l861
10504A52827j7794l799J1923k1649m084L3598L1613j7826j2580J663m119J9744
10492A69517j1486M323N017n075o869m331j8259j4727j6004J2519R226Q635N2798
$$ plain form
10479 185284 190520 172834 152925 124577 90055 95564 98309 115684 164518 190526 199371 229319
10467 229319 230432 205643 193555 151723 101480 110593 132128 153629 154969 124926 103246 95223
10455 95223 93677 99652 96494 87137 78653 83772 94725 77420 85192 110628 103304 70760 39953
10442 39953 25217 13207 22922 3284 -23880 -6314 3951 -13246 -4733 10306 16040 11451
10430 11451 22704 18861 14446 8050 -12985 -14405 -230 -6804 -9395 7322 12005 29180 3098
10417 3098 -18996 -50454 -55813 -14673 2815 -11735 -35017 -52416 -37418 -24531 -54995 -42928
10405 -42928 -29784 6864 22269 24185 19272 24682 18623 34110 13673 24952 32593 14239 54972
10392 54972 75222 40030 36033 35320 11795 14876 -208 89 -5845 -43275 -28882 -8469 -5927
$$ packed form
10479A85284N236j7686j9909k8348l4522N509K745J7375M8834K6008Q845K9948
10467B29319J113k4789j2088m1832n0243R113K1535K1501J340l0043k1680q023
10455I5223j546N975l158r357q484N119J0953j7305P772K5436p324l2544l0807
10442C9953j4736j2010R715j9638k7164J7566J0265j7197Q513J5039N734m589
10430A1451J1253l843m415o396k1035j420J4175o574k591J6717M683J7175k6082
10417C098k2094l1458n359M1140J7488j4550k3282j7399J4998J2887l0464J2067
10405d2928J3144L6648J5405J916m913N410o059J5487k0437J1279P641j8354M0733
10392E4972K0250l5192l997p13k3525L081j5084K97n934l7430J4393K0413K542
$$ plain form
10379 -5927 -18408 -14343 1394 16067 -20792 -82935 -69078 -35840 -29203 -19352 5442 20136
10367 20136 22077 -6229 -16952 1919 23874 -664 -11968 -14140 8398 13583 4129 -11074
10355 -11074 -18121 -5579 20267 34091 38924 30647 32567 47895 21769 -12648 -5935 -2211 28873
10342 28873 20742 23013 30923 41358 39416 4983 -44650 -57862 -60866 -40198 -37106 -63348 -66829
10329 -66829 -36710 -37023 -35222 -39053 -29086 -17108 -8431 -5853 -22280 -29914 -44838 -15596 -3310
10316 -3310 -15990 27245 34321 17555 34523 11479 15953 -7757 -8385 -13815 -53089 -40394 -31465
10303 -31465 -37747 -31834 -30224 -26986 -10241 -17448 -9282 -18317 -10694 6612 14373 5328 -21954 -41364
10289 -41364 -26683 -39815 -43302 -5773 -9969 -17309 -8999 7899 -7495 -15520 -39161 -58232 -50855
$$ packed form
10379e927j2481M065J5737J4673l6859o2143J3857L3238O637R851K4794J4694
10367B0136J941k8306j0723J8871K1955k4538j1304k172K2538N185r454j5203
10355a1074p047J2542K5846J3824M833q277J920J5328k6126l4417O713L724L1084
10342B8873q131K271P910J0435j942l4433m9633j3212l004K0668L092k6242l481
10329f6829L0119l13J801l831R967J1978Q677K578j6427p634j4924K9242J2286
10316c310j2680M3235P076j6766J6968k3044M474k3710o28n430l9274J2695Q929
10303c1465o282N913J610L238J6745p207Q166r035P623J7306P761r045k7282j9410
10289d1364J4681j3132l487L7529m196p340Q310J6898j5394q025k3641j9071P377
$$ plain form
10276 -50855 -16313 -5845 -22850 -67780 -101041 -97773 -51546 -31566 -12766 -20526 -38284 1916
10264 1916 9982 30071 11917 -22866 -473 10091 20454 24674 -539 15281 14369 31919 26740
10251 26740 14195 -8477 -24611 -49732 -46385 -29692 -23733 -26147 -16512 -13926 -30404 -45677 -16224
10238 -16224 -22321 -3570 34188 49457 42733 59851 -10176 -52788 -36442 -9805 28396 50901
10226 50901 39075 26595 6781 -30429 -54955 -28331 -32448 -28079 -37204 -42489 -41673 -41967 -25844
10213 -25844 -2076 -12198 15604 -1587 -27205 -25624 -56991 -100911 -96088 -39133 11473 18341
10201 18341 -34846 -32894 -15528 -6758 32430 16443 -13757 -7431 -19003 -22876 -5149 -8838 -44220
10188 -44220 -37119 -38103 -4661 -5 -9493 -18510 57124 94193 110535 110460 130157 157550 163884 156111
$$ packed form
10276e0855L4542J0468j7005m4930l3261L268M6227J9980J8800p760j7758M0200
10264A916Q066K0089j8154l4783K2393J0564J0363M220k5213J5820r12J7550n179
10251B6740j2545k2672j6134k5121L347J6693N959k414R635K586j6478j5273K9453
10238a6224o097J8751L7758J5269o724J7118p0027m2612J6346K6637L8201K2505
10226E0901j1826j2480j9814l7210k4526K6624m117M369r125n285Q16k94J6123
10213b5844K3768j0122K7802j7191k5618J581l1367m3920M823N6955N0606O868
10201A8341n3187J952J7366Q770L9188j5987l0200O326j1572l873J7727l689l5382
10188d4220P101r84L3442M656r488r017P5634L7069J6342p5J9697K7393O334p773
$$ plain form
10174 156111 152023 151082 155099 134242 130592 157923 209492 294778 352545 359630 328069 271610 239212
10161 239212 247589 256208 243142 231418 298019 379980 473329 514674 520809 497460 433731 359263
10149 359263 290829 225692 216163 222556 204655 245258 321734 367628 402933 349283 298680 194506
10137 194506 152599 144309 141541 113759 122884 118652 122127 124845 129667 105754 61611 46149 24040
10124 24040 -10120 -27366 -53280 -50489 -45350 -14899 -20024 -46111 -37328 -22216 -22657 -26386 -47523
10111 -47523 -68215 -84608 -101237 -135111 -105552 -75740 -57138 -49718 -29804 -48523 -69906 -70310
10099 -70310 -67689 -49820 -41008 -45373 -62250 -68192 -80792 -83091 -35195 -18079 -19515 -6536 -22110
10086 -22110 -24871 -14271 -10767 13266 12597 11002 30610 48399 22542 17541 -13642 -55290 -59856
$$ packed form
10174A56111m088r41M017k0857l650K7331N1569Q5286N7767P085l1561n6459l2398
10161B39212Q377Q619j3066j1724O6601Q1961R3349M1345O135k3349o3729p4468
10149C59263o8434o5137r529O393j7901M0603P6476M5894L5305n3650n0603j04174
10137A94506m1907q290k768k7782R125m232L475K718M822k3913m4143j5462k2109
10124B4040l4160j7246k5914K791N139L0451n125k6087Q783J5112m41l729k1137
10111d7523k0692j6393j6629l3874K9559K9812J8602P420J9914j8719k1383m04
10099g0310K621J7869Q812m365j6877n942j2600k299M7896J7116j436J2979j5574
10086b2110k761J0600L504K4033o69j595J9608J7789k5857n001l1183m1648m566
$$ plain form
10073 -59856 -22930 -14321 7171 5398 -27738 -6688 16203 -13229 -38274 -51002 -16497 -29407
10061 -29407 -39697 -51220 -40201 -48614 -33681 -29960 -50044 -30541 -4907 17406 29405 3029
10049 3029 2160 6732 -7057 -17883 3281 -6872 -35838 -61709 -36431 -23929 -25582 -18729 -21511
10036 -21511 -21662 8408 30470 55200 31926 31243 7380 -24282 -46502 -38555 -63497 -91722 -101907
10023 -101907 -89092 -92152 -92888 -104861 -79741 -86005 -74647 -79481 -68981 -45808 -3172 31677
10011 31677 6879 -4409 -4958 -6946 -4801 -9881 -14395 -18460 -7066 -11270 -6411 -19924 -7152
9998 -7152 -21624 -43334 -43844 -12588 -23345 -33384 -38113 -15633 -4204 9561 10932 18481 -23
9985 -23 -22535 -38504 -19944 -21470 -44059 -22649 -8766 -23173 -18732 -6323 -12605 -1853 3264
$$ packed form
10073e9856L6926Q609K1492j773l3136K1050K2891k9432k5045j2728L4505j2910
10061b9407j0290j1523J1019q413J4933L721k0084J9503K5634K2313J1999k6376
10049C029q69M572j3789j0826K1164j0153k8966k5871K5278J2502j653O853k782
10036b1511j51L0070K2062K4730k3274o83k3863l1662k2220P947k4942k8225j0185
10023a01907J2815l060p36j1973K5120o264J1358m834J0500K3173M2636L4849
10011C1677k4798j1288n49j988K145n080m514m065J1394m204M859j3513J2772
9998g152j4472k1710n10L1256j0757j0039m729K2480J1429J3765J371P549j8504
9985b3k2512j5969J8560j526k2589K1410J3883j4407M441J2409o282J0752N117
$$ plain form
9972 3264 -5931 24025 21457 -31582 -44569 -58166 -65048 -80282 -81098 -48546 -45583 -83507 -82929 -76543
9958 -76543 -62021 -78439 -59094 -31917 -12802 18135 25250 19155 26882 18950 9788 6890 -16261
9945 -16261 -27153 11966 17612 14049 -6289 18151 27304 31464 19494 -429 -36056 -45313 -6377
9932 -6377 99447 181348 242998 296795 211403 82747 51189 30508 16814 9195 -17399 -20544
9920 -20544 -41489 -25394 -29113 -16470 -11720 10217 -2638 -38757 -37542 -28728 -32698 -19011 7543
9907 7543 431 -36553 -33088 -6306 -34415 -49194 -224 10107 9530 9754 -2222 -25298 -9376
9894 -9376 189 18562 -20698 -37529 -25097 -5322 9222 -3182 -18160 -17368 4094 -15543 -4088
9881 -4088 30114 35687 13142 -8889 -12821 -23687 -23806 12262 11887 12968 -32254 -41560 -20133 -20711
$$ packed form
9972C264r195K9956k568n3039j2987j3597o882j5234q16L2552K963l7924N78O386
9958g6543J4522j6418J9345K7177J9115L0937P115o095P727p932r162k898k3151
9945a6261j0892L9119N646l563k0338K4440R153M160j1970j9923l5627r257L8936
9932f377J05824Q1901O1650N3797q5392j28656l1558k0681j3694p619k6594l145
9920b0544k0945J6095l719J2643M750K1937j2855l6119J215Q814l970J3687K6554
9907G543p112l6984L465K6782k8109j4779M8970J0331n77K24j1976k3076J5922
9894i376R565J8373l9260j6831J2432J9775J4544j2404j4978P92K1462j9637J1455
9881d088L4202N573k2545k2031l932j0866j19L6068l75J081m5222r306K1427n78
$$ plain form
9867 -20711 3188 -3662 -4717 -14652 -15914 -6001 3151 -114 -26894 -45813 -35714 -32421 -7656
9854 -7656 -15478 -31797 -47574 -46860 -42611 -54559 -63640 -58837 -38198 -17090 -17146 -4217 -12582 -11972
9840 -11972 200 -28080 -52188 -47005 -41395 -18971 -11235 -25525 -24467 -8791 2638 20992 10403
9827 10403 -11044 -27069 -43209 -30605 -42961 -40792 -40066 -28362 -37913 -56177 -50648 -43420 -26711
9814 -26711 -4108 3949 17992 9529 -24964 -34606 -45858 -40154 -19132 -6436 8577 21008 34259
9801 34259 12580 -15045 -16274 -7726 26074 32103 -6903 -8701 -21726 -18450 33141 16490 -17731
9788 -17731 -23736 -14505 -26036 -43345 -46846 -81281 -91855 -68117 -50370 -48478 -35625 -23785 -22993
9775 -22993 9974 -6254 -10428 -46551 -44849 -29850 -24646 -68693 -82811 -55439 -11531 27307
$$ packed form
9867b0711K3899o850j055r935j262R913R152l265k6780j8919J0099L293K4765
9854g656p822j6319j5777P14M249j1948r081M803K0639K1108n6J2929q365O10
9840a1972J2172k8280k4108N183N610K2424P736j4290J058J5676J1429J8354j0589
9827A0403k1447j6025j6140J2604j2356K169P26J1704r551j8264N529P228J6709
9814b6711K2603Q057J4043q463l4493r642j1252N704K1022J2696J5013J2431J3251
9801C4259k1679k7625j229Q548L3800O029l9006j798j3025L276N1591j6651l4221
9788a7731o005R231j1531j7309l501l4435j0574K3738J7747J892J2853J1840P92
9775b2993L2967j6228m174l6123J702J4999N204m4047j4118K7372M3908L8838
$$ plain form
9763 27307 42273 33476 28568 31304 18208 17840 10316 -13138 -12908 -6893 17208 8069 2297 13512
9749 13512 16667 2280 12938 36386 21231 -24889 -4247 -4992 -50271 -23914 -6202 5431
9737 5431 9185 -12912 -30125 12543 36125 25447 2961 -18818 4249 -12940 -16507 -25436 -25035
9724 -25035 -3627 5815 21247 16338 12568 15105 -11522 -32450 -43648 -45862 -41733 -30901 -19342
9711 -19342 -23368 -24758 -33676 -16042 8803 -16766 -33919 1244 32360 -493 -25100 -7715
9699 -7715 28340 54402 50066 25894 6846 27215 29732 -2954 1228 3923 5364 21873 28099
9686 28099 34595 14565 10195 -18184 -62917 -61003 -26909 -22102 -50047 -21956 2686 2904 -8671
9673 -8671 -51580 -45006 3109 18545 20332 3465 -46273 -66000 -28366 19809 46034 39388 59172
$$ packed form
9763B7307J4966q797m908K736j3096l68p524k3454K30O015K4101r139n772J1215
9749A3512L155j4387J0658K3448j5155m6120K0642p45m5279K6357J7712J1633
9737E431L754k2097j7213M2668K3582j0678k2486k1779K3067j7189l567q929M01
9724b5035K1408R442J5432m909l770K537k6627k0928j1198k214M129J0832J1559
9711a9342m026j390q918J7634K4845k5569j7153L5163L1116l2853k4607J7385
9699g715L6055K6062m336k4172j9048K0369K517l2686M182K695J441J6509O226
9686B8099O496k0030m370k8379m4733J914L4094M807k7945K8091K4642K18j1575
9673h671m2909O574M8115J5436J787j6867m9738j9727L7634M8175K6225o646J9784
$$ plain form
9660 59172 47861 55509 36313 -4982 -1132 24389 95712 216129 353626 466034 395474 243047
9648 243047 126086 95481 88011 63896 45160 36739 37171 63746 87889 92959 73375 51626
9636 51626 18424 1363 -8291 -23441 -22030 -14441 -1916 25425 11022 1701 -4902 -30353 -67148
9623 -67148 -67624 -64104 -55052 -46954 -43530 -17898 2538 9679 16540 -6037 -38532 -37952 -47889 -43644
9609 -43644 -46594 -33377 -443 14516 -9513 -26268 12387 -4950 -38290 -17725 -20297 -620
9597 -620 -6082 -29556 16319 30999 10388 16752 28531 14283 3357 -10681 -10944 -10998 12277 23392
9583 23392 16138 22069 28000 -8187 9098 10160 9168 1276 5353 -18681 -18917 30106 62635 43238
9569 43238 -404 -2388 28109 39109 -2401 -34213 -59331 -48587 -30938 -20341 -31898 -28203
$$ packed form
9660E9172j1311P648j9196m1295L850K5521P1323J20417J37497J12408p0560j52427
9648B43047j16961l0605p470k4115j8736q421M32K6575K4143N070j9584k1749
9636E1626l3202j7061r654j5150J411P589J2525K7341j4403r321o603k5451l6795
9623f7148m76L520R052Q098L424K5632K0436P141O861k2577l2495N80r937M245
9609d3644k950J3217L2934J4959k4029j6755L8655j7337l3340K0565k572J9677
9597f20n462k3474M5875J4680k0611O364J1779j4248j0926j4038k63n4K3275J1115
9583B3392p254N931N931l6187J7285J062r92p892M077k4034k36M9023L2529j9397
9569D3238m3642j984L0497J1000m1510l1812k5118J0744J7649J0597j1557L695
$$ plain form
9557 -28203 -36418 -43325 -53884 -62530 -57672 -34253 -27483 -13645 2911 22665 57569 75281 56444
9544 56444 15152 30169 30200 60062 110174 118587 86527 91925 103342 83002 46843 26721 42577
9531 42577 40350 51746 77926 69511 80917 51796 32391 2318 -14415 -21659 3524 31382
9519 31382 74814 85488 69925 60996 32998 -850 -29881 -17717 -21504 -30420 -18869 -18538 -2752
9506 -2752 -22867 -16851 3389 12155 7388 1799 9410 8767 25322 26727 12924 -29084 -31543 -9278
9492 -9278 -15655 -18893 -23452 12276 62067 70910 36739 -29682 -35822 -2410 23065 17591 23842
9479 23842 25225 27314 18944 11478 19097 -330 -32584 -14074 -42405 -57624 -60930 -56384 -17821
9466 -17821 14911 7802 -17758 972 32711 37926 27695 27837 18357 7245 -8378 3645 -3538
$$ packed form
9557b8203q215o907j0559q646M858K3419O770J3838J6556J9754L4904J7712j8837
9544E6444m1292J5017L1K9862N0112Q413l2060N398J1417k0340l6159k0122J5856
9531D2577k227J1396K6180q415J1406k9121j9405l0073j6733p244K5183K7858
9519C1382M3432J0674j5563q929k7998l3848k9031J2164l787q916J1551L31J5786
9506b752k0115O016K0240Q766m767n589P611o43J6555J405j3803m2008k459K2265
9492i278o377l238m559L5728M9791Q843l4171o6421o140L3412K5475n474O251
9479B3842J383K089q370p466P619j9427l2254J8510k8331j5219l306M546L8563
9466a7821L2732p109k5560J8730L1739N215j0231J42r480j1112j5623J2023p183
$$ plain form
9453 -3538 -33121 -29223 4527 15808 17170 23364 16374 10881 -7881 -41601 -38515 -50748 -52411
9440 -52411 -46399 -69583 -91268 -78695 -68644 -56212 -25332 -9267 31353 39097 40368 19450
9428 19450 4578 -23114 -33680 -57638 -78854 -59040 -54804 -32672 -20672 -1067 23761 14199
9416 14199 -27221 -15081 -12896 -4062 -57 16817 23518 123 16475 16763 -2805 4539 10504
9403 10504 36653 62078 65297 40780 50952 15479 322 -13605 -13101 4183 7705 7032 35192
9390 35192 74328 82769 51737 34905 52052 67588 59947 63595 50406 -1955 1985 11968 4912
9377 4912 -8083 26766 16075 -13497 -3614 -3546 21832 27853 -14354 -16 -19192 6657 20287
9364 20287 23369 10702 -7811 -4705 -20470 -12166 1428 -19984 7982 11558 19592 6350 -662
$$ packed form
9453c538k9583L898L3750J1281J362O194o990n493j8762l3720L086j2233j663
9440e2411O012k3184k1685J2573J0051J2432L0880J6065M0620P744J271k0918
9428A9450j4872k7692j0566k3958k1216J9814M236K2132J2000J9605K4828r562
9416A4199m1420J2140K185Q834M005J6874O701k3395J6352K88j9568P344N965
9403A0504K6149K5425L219k4517J0172l5473j5157j3927N04J7284L522o73K8160
9390C5192L9136Q441l1032j6832J7147J5536p641L648j3189n2361L940R983p056
9377D912j2995L4849j0691k9572R883O8K5378O021m2207J4338j9176K5849J3630
9364B0287L082j2667j8513L106j5765Q304J3594k1412K7966L576Q034j3242p012
$$ plain form
9351 -662 -17297 -37104 -28606 21529 52338 36971 42176 62129 57174 46249 13702 21996 43248
9338 43248 73390 83231 90801 86642 80419 52508 46178 53016 28395 15767 22139 35170 59349
9325 59349 45909 45989 17302 -25189 -40006 -23231 -24395 25202 34952 37994 46031 19385 12760
9312 12760 29059 7770 33253 30978 39807 15049 8119 24845 33080 28313 28330 18255 10489 24529
9298 24529 30983 -1968 867 4122 4662 19791 17470 23378 38978 43815 31563 8156 5469 3695
9284 3695 -14419 -22056 8961 57363 62907 62560 56642 45043 39916 25058 31031 54606 67305
9271 67305 55977 49406 15004 35432 36085 29174 39478 30322 53517 73028 70280 71951 82782
9258 82782 82346 74725 67772 68179 32394 7015 11838 35446 23014 -8146 -5018 -12805 722 482
$$ packed form
9351f62j6635j9807Q498N0135L0809j5367N205J9953m955j0925l2547Q294K1252
9338D3248L0142R841P570m159o223k7911o330O838k4621j2628O372J3031K4179
9325E9349j3440Q0k8687m2491j4817J6775j164M9597R750L042Q037k6646o625
9312A2760J6299k1289K5483k275Q829k4758o930J6726Q235m767J7j0075p766J4040
9298B4529O454l2951K835L255N40J5129k321N908J5600M837j2252k3407k687j774
9284C695j8114p637L1017M8402N544l47n918j1599n127j4858N973K3575J2699
9271F7305j1328o571l4402K0428O53o911J0304r156K3195J9511k748J671J0831
9258H2782m36p621o953M07l5785k5379M823K3608j2432l1160L128p787J3527k40
$$ plain form
9244 482 20084 65871 61019 55925 64990 72024 70283 65706 80553 71902 43104 25623 27510 47671
9230 47671 43991 9830 -1250 17434 19627 21041 17963 7336 25595 56335 63453 55272 -10453
9217 -10453 -32593 -28320 -42590 -38518 -4114 4710 -9655 -7561 28471 54266 30294 26103 10711
9204 10711 -17558 -35800 -49002 -24670 15034 19089 17193 12526 -6854 -5357 -22135 26864 81610
9191 81610 97377 104449 97374 111180 81726 32612 11644 18147 -18105 -10495 -23434 -27700 19162
9178 19162 29147 7860 4352 41389 30219 23790 23905 9780 -1082 -12076 214 8949 26933
9165 26933 15058 7893 18259 46819 43184 37341 57878 61923 55567 27284 -12533 -2659 13545
9152 13545 25175 30999 8155 8759 25057 46934 58263 76042 66977 74584 84393 61319 86303
$$ packed form
9244D82J9602M5787m852n094R065P034j741m577J4847q651k8798j7481J887K0161
9230D7671l680l4161j1080J8684K193J414l078j0627J8259L0740P118q181o5725
9217a0453k2140M273j4270M072L4404Q824j4365K094L6032K5795k3972m191j5392
9204A0711k8269j8242j3202K4332L9704M055j896m667j9380J497j6778M8999N4746
9191H1610J5767P072p075J3806k9454m9114k0968O503l6252P610j2939m266M6862
9178A9162R985k1287l508L7037j1170o429J15j4125j0862j0994J2290Q735J7984
9165B6933j1875p165J0366K8560l635n843K0537M045o356k8283l9817R874J6204
9152A3545J1630N824k2844O04J6298K1877J1329J7779r065P607R809k3074K4984
$$ plain form
9139 86303 112025 97554 54076 26945 42385 41581 43906 83614 91648 77438 66465 61147 40043
9126 40043 -3800 -15506 31375 32824 6296 18649 44842 52836 46501 26535 3129 5328 -6918
9113 -6918 992 40961 44930 19797 44326 37477 33851 31925 26674 14889 26410 44287 84920
9100 84920 116207 106143 51707 38443 49373 40842 63698 71651 69301 55830 54258 58721 88091
9087 88091 93941 76404 47361 42088 89066 91142 82038 75943 73421 115219 140169 133896 160188
9074 160188 123768 91588 118923 118343 94046 61328 26999 56372 53439 35781 43087 68335
9062 68335 80997 72465 72299 88979 96511 87610 66002 85645 86576 102482 107827 100670 50471 2600
9048 2600 20563 70176 119045 111763 67988 42891 35620 50581 71769 118239 107440 99252 112345
$$ packed form
9139H6303K5722j4471m3478k7131J5440q04K325L9708Q034j4210j0973n318k1104
9126D0043m3843j1706M6881J449k6528J2353K6193P994o335j9966k3406K199j2246
9113f918P910L9969L969k5133K4529o849l626j926n251j1785J1521J7877M0633
9100H4920L1287j0064n4436j3264J0930q531K2856P953k350j3471j572M463K9370
9087H8091N850j7537k9043n273M6978K076r104o095k522M1798K4950o273K6292
9074A60188l6420l2180K7335n80k4297l2718l4329K9373k933j7658P306K5248
9062F8335J2662q532j66J6680P532q901k1608J9643R31J5906N345p157n0199m7871
9048B600J7963M9613M8869p282m3775k5097p271J4961K1188M6470j0799q188J3093
$$ plain form
9035 112345 144246 149946 131269 131302 112013 106313 85041 53594 26921 51208 65596 73671 74025
9022 74025 95715 88748 87526 81781 94276 90982 84894 79477 71885 37568 43579 32257 61015
9009 61015 75378 75238 89376 97952 91678 67072 61273 79408 78686 61540 67737 76109 84014 114296
8995 114296 108983 110713 125556 130730 134608 149091 148582 148856 102387 89027 86740 67162 44296
8982 44296 44564 47872 40140 40631 48645 49283 39033 33581 73968 89194 85522 71327 61466 48931
8968 48931 57687 61140 73218 73368 47966 19616 35707 25401 -5834 -28036 13039 54103 96264
8955 96264 92064 80994 71635 56986 70035 83952 98281 104691 120655 109189 70628 88815
8943 88815 75001 53950 30904 50962 42107 28785 39720 74555 87492 80308 47405 42678
$$ packed form
9035A12345L1901N700j8677L3j9289n700k1272l1447k6673K4287J4388Q075L54
9022G4025K1690o967j222n745J2495l294o088n417p592l4317O011j1322K8758
9009F1015J4363j40J4138Q576o274k4606n799J8135p22j7146O197Q372P905L0282
8995A14296n313J730J4843N174L878J4483n09K74m6469j3360k287j9578k2866
8982D4296K68L308p732M91Q014O38j0250n452M0387J5226l672j4195r861j2535
8968D8931Q756L453J2078J50k5402k8350J6091j0306l1235k2202M1075M1064M2161
8955I6264m200j1070r359j4649J3049J3917J4329O410J5964j1466l8561J8187
8943H8815j3814k1051k3046K0058q855j3322J0935L4835J2937p184l2903m727
$$ plain form
8931 42678 -2777 -52882 -39750 -29625 -56399 -37193 9890 24275 31378 50727 10682 -20659
8919 -20659 -7451 27049 50996 69802 64990 58243 60159 75586 98845 83639 85728 97117 73706
8906 73706 79789 72829 70667 51300 29838 33148 73851 76140 72329 58734 37689 7135 -6957
8893 -6957 5853 32406 48270 68461 91765 69902 52041 49002 51822 53606 59530 45791 32871
8880 32871 30136 35357 34470 31351 21378 29542 39316 45458 39570 45653 36883 45669 68102 46426
8866 46426 29387 45207 61557 33065 14928 33420 78035 105975 100859 68757 77573 102393
8854 102393 124553 149436 201419 225715 251574 254532 238909 259294 333034 400826 494728 686095
8842 686095 931620 1244812 1781047 2617367 3790299 5226523 6325389 5825787 4150140
$$ packed form
8931D2678m5455n0105J3132J0125k6774J9206M7083J4385P103J9349m0045l1341
8919b0659J3208L4500K3947J8806m812o747J916J5427K3259j5206K089J1389k3411
8906G3706O083o960k162j9367k1462L310M0703K289l811j3595k1045l0554j4092
8893f957J2810K6553J5864K0191K3304k1863j7861l039K820J784N924j3739j2920
8880C2871k735N221q87l119r973Q164R774O142n888O083q770Q786K2433k1676
8866D6426j7039J5820J6350k8492j8137J8492M4615K7940n116l2102Q816K4820
8854A02393K2160K4883N1983K4296K5859K958j5623K0385P3740O7792R3902J91367
8842F86095K45525L13192N36235Q36320J172932J436224J098866m99602j675647
$$ plain form
8833 4150140 2725910 1844213 1344039 1012484 781682 612072 491486 406344 335392 291344
8823 291344 266537 249272 217241 181785 188908 172474 143943 134282 116532 97273 83160 52856
8811 52856 53409 63774 72080 52395 26659 33092 29920 20531 39595 26676 42689 75077 85455
8798 85455 68725 68066 29951 3945 5076 33852 30793 3225 -10687 5259 -12352 -5572 37132
8785 37132 64059 83738 76025 50624 29158 25568 13830 21025 -11831 -30021 13451 42609
8773 42609 -5509 -25057 3139 9695 11545 16577 27184 60468 49670 2393 -20892 -34582
8761 -34582 -15732 35235 69781 28049 13151 4603 2267 20169 15157 11245 40775 36185 13457
8748 13457 11163 30461 35615 38403 84377 54105 24381 53319 33422 24519 45603 95246 99485
$$ packed form
8833D150140j424230q81697n00174l31555k30802j69610j20586q5142p0952m4048
8823B91344k4807j7265l2031l5456P123j6434k8531r661j7750j9259j4113l0304
8811E2856N53J0365Q306j9685k5736O433l172r389J9064j2919J6013L2388J0378
8798H5455j6730o59l8115k6006J131K8776l059k7568j3912J5946j7611O780M2704
8785C7132K6927J9679p713k5401k1466l590j1738P195l2856j8190M3472K9158
8773D2609m8118j9548K8196O556J850N032J0607L3284j0798m7277k3285j3690
8761c4582J8850N0967L4546m1732j4898q548k336J7902n012l912K9530m590k2728
8748A3457k294J9298N154K788M5974l0272k9724K8938j9897q903K1084M9643M239
$$ plain form
8735 99485 74615 55386 69895 110034 114549 115210 111614 118874 113851 131687 146839 162608 163101
8722 163101 208012 220657 179857 147574 123322 112654 113085 129510 171940 162408 178165 217730
8710 217730 220084 213636 228254 225424 255703 268705 288149 284223 249317 259722 254319 230751 248804
8697 248804 258090 255515 247654 248225 238460 225074 215404 238634 259654 292988 282550 231803 212936
8684 212936 184401 204755 262409 286828 280638 279357 288279 312736 365209 390089 388751 375686
8672 375686 376593 384762 411267 450912 481687 522551 543266 535469 545926 554899 572522 586933 605518
8659 605518 630197 636375 611088 594667 596166 620785 625280 654927 668127 678112 679284 649137 628131
8646 628131 623865 606867 595705 593448 601634 632082 653959 679401 671771 667458 697753 781380 814136
$$ packed form
8735I9485k4870j9229J4509M0139M515O61l596P260n023J7836J5152J5769M93
8722A63101M4911J2645m0800l2283k4252j0668M31J6425M2430r532J5757L9565
8710B17730K354o448J4618k830L0279J3002J9444l926l4906J0405n403k3568J8053
8697B48804R286k575p861N71r765j3386r670K3230K1020L3334j0438n0747j8867
8684B12936k8535K0354N7654K4419o190j281Q922K4457N2473K4880j338j3065
8672C75686R07Q169K6505L9645L0775M0864K0715p797J0457Q973J7623J4411J8585
8659F05518K4679O178k5287j6421J499K4619M495K9647J3200R985J172l0147k1006
8646F28131m266j6998j1162k257Q186L0448K1877K5442p630m313L0295Q3627L2756
$$ plain form
8633 814136 854438 929749 994516 1070565 1102333 1124612 1124513 1089138 1103563 1147656 1188564 1229557
8621 1229557 1264939 1281060 1339799 1327377 1302705 1319127 1323606 1359544 1462256 1589628 1753403
8610 1753403 1960837 2186940 2353578 2546658 2781394 3007930 3144512 3325940 3535855 3729971
8600 3729971 3925791 4026053 4065628 4003215 3896750 3775557 3596912 3412215 3238592 3052746
8590 3052746 2829776 2632401 2506326 2358631 2270373 2229135 2192401 2114179 2058642 1986052 1881493
8579 1881493 1808018 1710162 1623305 1563462 1481777 1386687 1321910 1261215 1166340 1079583 986006
8568 986006 898674 848294 809520 745534 708161 690480 665233 618538 575448 531008 505813 501707
8556 501707 455564 409461 377296 346374 351550 320520 295646 249297 239081 274437 275407 274617 259628
$$ packed form
8633H14136M0302P5311O4767P6049L1768K2279r9l5375J4425M4093M0908M0993
8621A229557L5382J6121N8739j2422k4672J6422M479L5938J02712J27372J63775
8610A753403K07434K26103J66638J93080K34736K26536J36582J81428K09915J94116
8600C729971J95820J00262L9575o2413j06465j21193j78645j84697j73623j85846
8590C052746k22970j97375j26075j47695q8258m1238l6734p8222n5537p2590j04559
8579A881493p3475r7856q6857n9843q1685r5090o4777o0695r4875q6757r3577
8568I86006q7332n0380l8774o3986l7373j7681k5247m6695m3090m4440k5195m106
8556E01707m6143m6103l2165l0922N176l1030k4874m6349j0216L5356R70p90j4989
$$ plain form
8543 259628 260266 233127 212900 199786 174827 199493 218484 187656 159944 158379 158773 184205 141182
8530 141182 136925 131666 147135 143430 126590 127808 133356 153967 155023 118345 77597 86890 104772
8517 104772 104748 70962 56753 79202 98873 107110 120801 137429 116956 78481 53442 56666 77689
8504 77689 99804 104546 71052 58561 70024 73496 59617 49476 48874 40924 19273 464 5513
8491 5513 23575 34843 75440 71487 33699 55585 39238 71998 91929 69869 17529 6690
8479 6690 35536 51755 104618 108461 85181 59551 43058 96295 111398 140704 146037 126560
8467 126560 158941 162426 161450 121950 86647 75435 73409 43439 10933 23779 56629 102514
8455 102514 102460 96297 116851 94712 83689 111364 98137 96631 72132 45780 68674 107753 140736
$$ packed form
8543B59628O38k7139k0227j3114k4959K4666J8991l0828k7712j565L94K5432m3023
8530A41182m257n259J5469l705j6840J218N548K0611J056l6678m0748R293J7882
8517A04772k4l3786j4209K2449J9671Q237J3691J6628k0473l8475k5039L224K1023
8504G7689K2115M742l3494j2491J1463L472j3879j0141o02p950k1651j8809N049
8491E513J8062J1268M0597l953l7788K1886j6347L2760J9931k2060n2340j0839
8479F690K8846J6219N2863L843k3280k5630j6493N3237J5103K9306N333j9477
8467A26560L2381L485r76l9500l5303j1212k026k9970l2506J2846L2850M5885
8455A02514n4o163K0554k2139j1023K7675j3227j506k4499k6352K2894L9079L2983
$$ plain form
8442 140736 118885 116965 134195 127810 140094 106715 90712 116402 118375 114205 126445 143928
8430 143928 176773 212008 198098 192425 188033 144778 151485 156930 115151 102873 80977 45868
8418 45868 20815 53469 79296 109072 158940 144182 102969 93492 86950 55458 39962 72847
8406 72847 86667 118273 152001 147297 99335 78663 80030 54465 59877 59736 37077 35170 51946
8393 51946 32067 9238 38266 50186 53810 10845 -21616 -22042 9650 75271 146103 162945
8381 162945 133356 126547 118896 110575 74365 73623 104252 111139 93911 126913 173780 175762 134435
8368 134435 101599 75557 75494 93609 63942 37295 23548 35834 23238 47063 56760 20609
8356 20609 3737 -7486 11151 10250 1383 -613 29925 31902 -2291 11508 63058 72496 51981
$$ packed form
8442A40736k1851j920J7230o385J2284l3379j6003K5690J973m170J2240J7483
8430A43928L2845L5235j3910n673m392m3255O707N445m1779j2278k1896l5109
8418D5868k5053L2654K5827K9776M9868j4758m1213r477o542l1492j5496L2885
8406G2847J3820L1606L3728m704m7962k0672J367k5565N412j41k2659j907J6776
8393E1946j9879k2829K9028J1920L624m2965l2461m26L1692O5621P0832J6842
8381A62945k9589o809p651q321l6210p42L0629O887j7228L3002M6867J982m1327
8368A34435l2836k6042o3J8115k9667k6647j3747J2286j2596K3825R697l6151
8356B0609j6872j1223J8637r01q867j996L0538J977l4193J3799N1550R438k0515
$$ plain form
8343 51981 54718 67447 84216 120005 99882 91770 84109 87693 83833 89165 84991 55286 23667
8330 23667 -6925 19821 76307 90952 84090 66776 39573 40145 32542 8616 30093 47209 74707
8317 74707 69439 49958 25406 38718 53191 12218 22796 31998 17397 13615 33239 37435 42093
8304 42093 23268 -4444 23121 46903 54395 51483 52768 41665 43474 58511 70036 52382 49249
8291 49249 20976 9379 34933 73843 93234 129335 122983 94163 77739 68639 54986 60111
8279 60111 45496 48106 66951 77310 90891 93249 78127 65558 60125 60907 89270 96619 98066
8266 98066 76043 39307 25068 29038 66534 70220 41960 56962 82681 75665 55771 29691
8254 29691 22898 30130 67376 80440 86544 96391 60667 35812 39450 28203 31619 42608 31654
$$ packed form
8343E1981K737J2729J6769L5789k0123q112p661L584l860N332m174k9705l1619
8330B3667l0592K6746N6486J4645o862j7314k7203N72p603k3926K1477J7116K7498
8317G4707n268j9481k4552J3312J4473m0973J0578R202j4601l782J9624M196M658
8304D2093j8825k7712K7565K3782P492k912J285j1103J809J5037J1525j7654l133
8291D9249k8273j1597K5554L8910J9391L6101o352k8820j6424r100j3653N125
8279F0111j4615K610J8845J0359J3581K358j5122j2569n433P82K8363P349J447
8266I8066k2023l6736j4239L970L7496L686k8260J5002K5719p016j9894k6080
8254B9691o793P232L7246J3064O104R847l5724k4855L638j1247L416J0989j0954
$$ plain form
8241 31654 24751 50593 70290 69240 47055 53332 65724 73401 85754 98680 83597 75511 111315
8228 111315 118027 98588 78020 92688 99992 99697 92194 58312 53722 83513 94262 100550 101105
8215 101105 101084 84110 77825 53890 23453 -49431 -48534 -5503 35205 67456 71257 55137 34821
8202 34821 51679 31007 13446 52176 59672 37372 35400 48274 49780 58499 47740 17869 481
8189 481 18697 40385 -1315 -40695 -37082 -26493 1112 40974 33294 21927 38181 51750 46325
8176 46325 33892 15631 8450 12166 10610 35287 20978 1654 23950 18685 -18300 -2872 -9317
8163 -9317 -10724 -2125 -35 31602 55066 48239 6536 31608 55831 30158 16432 14574 55310
8150 55310 56768 62788 127944 218080 342293 532287 820509 984305 835674 540183 323569
$$ packed form
8241C1654o903K5842J9697j050k2185O277J2392P677J2353J2926j5083q086L5804
8228A11315O712j9439k0568J4668P304k95p503l3882m590K9791J0749O288N55
8215A01105k1j6974o285k3935l0437p2884Q97M3031M0708L2251L801j6120k0316
8202C4821J6858k0672j7561L8730P496k2300j972J2874J506Q719j0759k9871j7388
8189D81J8216K1688m1700l9380L613J0589K7605L9862p680j1367J6254J3569n425
8176D6325j2433j8261p181L716j556K4677j4309j9324K2296n265l6985J5428o445
8163i317j407Q599K090L1637K3464o827m1703K5072K4223k5673j3726j858M0736
8150E5310J458O020O5156R0136J24213J89994K88222J63796j48631k95491k16614
$$ plain form
8139 323569 190158 75257 64603 104974 103447 104381 76807 59724 71253 68146 66387 76457
8127 76457 66785 33848 3468 -7016 19917 23104 8632 31928 -1467 23796 53179 63483
8115 63483 95108 79600 47088 44219 59950 40706 57515 104761 171323 236767 329464 501551
8103 501551 669447 779068 749138 607077 432557 290150 175147 135395 135576 117376 78895
8092 78895 46828 31452 24055 -4751 17634 25485 -478 27500 36990 28784 -4851 -2648 33103
8079 33103 55338 43314 75441 94284 83897 70552 47643 36346 38344 72213 91275 77115
8067 77115 69450 87541 92673 116060 117865 97043 75314 73673 99478 99851 123166 151413 158307
8054 158307 141246 158496 172422 148404 141276 128346 157555 198350 213966 245030 263001 301931
$$ packed form
8139C23569j33411j14901j0654M0371j527R34k7574j7083J1529l107j759J0070
8127G6457r672l2937l0380j0484K6933L187j4472K3296l3395K5263K9383J0304
8115F3483L1625j5508l2512k869J5731j9244J6809M7246O6562O5444R2697J72087
8103E01551J67896J09621k9930j42061j74520j42407j15003l9752J81j8200l8481
8092G8895l2067j5376p397k8806K2385P851k5963K7978R490q206l3635K203L5751
8079C3103K2235j2024L2127J8843j0387j3345k2909j1297J998L3869J9062j4160
8067G7115p665J8091N132K3387J805k0822k1729j641K5805L73K3315K8247O894
8054A58307j7061J7250J3926k4018p128j2930K9209M0795J5616L1064J7971L8930
$$ plain form
8042 301931 348933 403815 423704 419237 459080 497885 532696 590447 691254 774093 861276 939321
8030 939321 1049073 1159963 1242728 1255067 1240446 1262415 1287879 1259255 1254848 1279761 1320034
8019 1320034 1337566 1359751 1332962 1270812 1215318 1155221 1126978 1121048 1078989 1035519 996126 955249
8007 955249 985264 1009224 984003 993301 1008468 1017458 1038322 1055659 1061754 1093487 1114055 1155063
7995 1155063 1265813 1411365 1577816 1861476 2258950 2811365 3600643 4697839 6000665
7986 6000665 6827468 6570613 5435355 4139266 3144851 2515896 2106554 1878594 1781320
7977 1781320 1710306 1727293 1760117 1764478 1639817 1442064 1240726 1147183 1105928 1104747 1123407
7966 1123407 1063712 957182 861857 771034 735040 727516 768283 800543 790636 765021 715294 740562
$$ packed form
8042C01931M7002N4882J9889m467L9843L8805L4811N7751J00807Q2839Q7183P8045
8030I39321J09752J10890Q2765J2339j4621K1969K5464k8624m407K4913M0273
8019A320034J7532K2185k6789o2150n5494o0097k8243n930m2059m3470l9393m0877
8007I55249L0015K3960k5221R298J5167Q990K0864J7337O095L1733K0568M1008
7995A155063J10750J45552J66451K83660L97474N52415P89278J097196J302826
7986F000665Q26803k56855j135258j296089r94415o28955m09342k27960r7274
7977A781320p1014J6987L2824M361j24661j97753k01338r3543m1255j181J8660
7966A123407n9695j06530r5325r0823l5994p524M0767L2260r907k5615m9727K5268
$$ plain form
7954 740562 801593 901240 986775 1077613 1177430 1322272 1529091 1863906 2373679 2916851 3387071
7943 3387071 3529554 3185308 2602585 2089399 1697862 1426563 1268236 1142938 1049175 952724
7933 952724 825125 743957 744028 773381 800444 815453 809629 801705 739921 622862 444115 336168
7921 336168 258382 222625 222835 216764 195433 164973 159624 160460 194378 252016 275041 252744 263091
7908 263091 243644 203562 156426 128653 124889 180573 168217 154045 146330 146809 152655 200523 239489
7895 239489 256262 227162 204059 183003 142212 112048 118840 102014 105568 109272 78831 33175
7883 33175 -6443 5162 26955 22450 -5602 -32012 -44589 -3280 -189 28049 33299 -6512
7871 -6512 -11017 6321 20118 18341 9898 17450 25709 32754 34518 34666 21893 30557 12662 4408
$$ packed form
7954G40562O1031R9647Q5535R0838R9817J44842K06819L34815N09773N43172M70220
7943C387071J42483l44246n82723n13186l91537k71299j58327j25298r3763r6451
7933I52724j27599q1168P1K9353K7063J5009n824p924o1784j17059j78747j07947
7921C36168p7786l5757K10o071k1331l0460n349Q36L3918N7638K3025k2297J0347
7908B63091j9447m0082m7136k7773l764N5684j2356j4172p715M79N846M7868L8966
7895B39489J6773k9100k3103k1056m0791l0164O792j6826L554L704l0441m5656
7883C3175l9618J1605K1793m505k8052k6410j2577M1309L091K8238N250l9811
7871f512m505J7338J3797j777q443P552Q259P045J764J48j2773Q664j7895q254
$$ plain form
7857 4408 6922 495 -11285 -36552 -43268 -24483 -494 18901 27686 -25469 -12709 -4372 -32054
7844 -32054 -46515 -25667 -28234 -7720 23062 14112 28678 61826 63886 22711 14510 28022 21896
7831 21896 17110 32163 2237 -10158 -6624 -22990 5245 37728 23466 -4620 -21074 -9444
7819 -9444 -24415 -28091 -17530 4115 29187 27024 38779 29023 10611 2856 13807 16141 17157
7806 17157 10222 12692 -10940 -46563 -36369 -36854 -33062 -22561 -41998 -68921 -64466 -30079 6494
7793 6494 12152 -14457 -42711 -78003 -104603 -95426 -90181 -72146 -18498 2205 7836 -3640 -10052
7780 -10052 -49250 -42477 -13798 -13299 -21401 -2304 -17047 -51199 -44603 -39464 -38138 -11584 17209
7767 17209 11932 -20528 -20233 -4444 5735 5002 -14962 -12484 37984 29486 8183 -6888 20440
$$ packed form
7857D408K514o427j1780k5267o716J8785K3989J9395Q785n3155J2760Q337k7682
7844c2054j4461K0848k567K0514L0782q950J4566L3148K060m1175q201J3512o126
7831B1896m786J5053k9926j2395L534j6366K8235L2483j4262k8086j6454J1630
7819i444j4971l676J0561K1645K5072k163J1755r756j8412p755J0951K334J016
7806A7157o935K470k3632l5623J0194m85L792J0501j9437k6923M455L4387L6573
7793F494N658k6609k8254l5292k6600R177N245J8035N3648K0703N631j1476o412
7780a0052l9198O773K8679M99q102J9097j4743l4152O596N139J326K6554K8793
7767A7209n277l2460K95J5789J0179p33j9964K478N0468q498k1303j5071K7328
$$ plain form
7754 20440 7499 -25587 -52294 -48796 -7969 6683 -6510 -37231 -82299 -45339 3645 26234
7742 26234 39123 60058 40573 4813 -3127 17080 9951 13497 3590 -12608 -20446 -15142 -35650
7729 -35650 -72471 -44522 -37215 -48897 -36510 -5224 -9468 4093 -1087 -12521 -6942 13485 11221
7716 11221 -9453 -12750 -11715 -19424 -15258 -13304 1081 8116 -23569 -39710 -67537 -64049 -63808 -35292
7702 -35292 -690 16355 20574 10058 256 14390 8311 6735 12879 20220 5195 -43327 -64978
7689 -64978 -52643 -15532 -27610 -50510 -42868 -19365 15787 20201 23312 6415 -28591 -31222 -35874
7676 -35874 -38543 -40991 -19477 20465 26241 -1846 -46362 -60120 -46803 -20275 -4263 22565
7664 22565 3562 2884 -6493 -3787 -17020 -20436 -12109 -10408 -29887 -12312 -15946 -32314 -35046 -19957
$$ packed form
7754B0440j2941l3086k6707L498M0827J4652j3193l0721m5068L6960M8984K2589
7742B6234J2889K0935j9485l5760p940K0207p129L546r907j6198p838N304k0508
7729c5650l6821K7949P307j1682J2387L1286m244J3561n180j1434N579K0427k264
7716A1221k0674l297J035p709M166J954J4385P035l1685j6141k7827L488K41K8516
7702c5292L4602J7045M219j0516r802J4134o079j576O144P341j5025m8522k1651
7689f4978J2335L7111j2078k2900P642K3503L5152M414L111j6897l5006k631m652
7676c5874k669k448K1514L9942N776k8087m4516j3758J3317K6528J6012K6828
7664B2565j9003o78r377K706j3233l416Q327J701j9479J7575l634j6368k732J5089
$$ plain form
7650 -19957 123 -755 -5143 -8243 -23559 -30247 1773 -6691 -24568 -21650 1484 2226 15967 30174
7636 30174 -12858 -23155 -36628 -30552 -31287 -38225 -37453 -56535 -72755 -64662 -45431 -46219 -62731 -47938
7622 -47938 -14875 -7686 1578 -19374 -43349 -20643 16089 -27640 -22106 6281 13028 37699 41260
7609 41260 27779 -6169 -22431 -4264 11935 22892 15976 35957 17404 -18090 -2515 34063
7597 34063 26438 14943 5486 -585 -13118 -5546 -32770 -50709 -30548 -10732 1236 -15711 -17639
7584 -17639 1830 26156 32309 29986 11463 4309 9979 5739 -34506 -38736 1311 16822 33054
7571 33054 7140 -28767 -17659 -18650 27 14244 20654 30947 31823 -32367 -26325 -9788 11283
7558 11283 18353 14039 11458 17154 -1031 11215 865 -7714 41579 36936 40230 35625 52828
$$ packed form
7650a9957K0080q78m388l100j5316o688L2020q464j7877K918K3134P42J3741J4207
7636C0174m3032j0297j3473O076p35o938P72j9082j6220Q093J9231p88j6512J4793
7622d7938L3063P189R264k0952k3975K2706L6732m3729N534K8387O747K4671L561
7609D1260j3481l3948j6262J8167J6199J0957o916J9981j8553l5494J5575L6578
7597C4063p625j1495r457o071j2533P572k7224j7939K0161J9816J1968j6947j928
7584a7639J9469K4326O153k323j8523p154N670m240m0245m230M0047J5511J6232
7571C3054k5914l5907J1108r91J8677J4217O410J0293Q76o4190O042J6537K1071
7558A1283P070m314k581N696j8185J2246j0350q579M9293m643L294m605J7203
$$ plain form
7545 52828 38986 48012 47373 12648 8291 26683 32126 38564 7725 -28323 -20887 8580 22214
7532 22214 -14232 -44445 -42627 -40505 -43007 -8193 18394 -20110 -29177 -5214 -5546 -39262 -35995
7519 -35995 -29332 -25615 -26842 -37183 -29789 2441 27085 4843 -27113 -55120 -48588 -41320 -63006
7506 -63006 -60704 -29741 -30816 -45989 -42857 -39084 -30394 -71744 -51698 -30669 -29610 -8869 -52983
7493 -52983 -53317 -40863 -33773 -46709 -42305 -14985 -15947 -4375 -16808 -13679 -17341 -30678 -2809
7480 -2809 -12271 -34587 -52836 -56062 -39595 -29471 -38133 -39480 -36351 -48550 -14224 19161 10649
7467 10649 30647 6315 -4199 3484 19466 -3961 -25926 -32241 -30240 -15537 -13061 -10537 10951
7454 10951 11019 -4755 -2580 3961 13044 3086 -4492 -21602 -8281 -3960 -31897 -30898 -1465 -15158
$$ packed form
7545E2828j3842R026o39l4725m357J8392N443O438l0839l6048P436K9467J3634
7532B2214l6446l0213J818K122k502L4814K6587l8504r067K3963l32l3716L267
7519c5995O663L717j227j0341P394L2230K4644k2242l1956k8007O532P268k1686
7506f3006K302L0963j075j5173L132L773Q690m1350K0046K1029J059K0741m4114
7493e2983l34J2454P090j2936M404K7320r62J1572j2433L129l662j3337K7869
7480b809r462k2316j8249l226J6467J0124q662j347L129j2199L4326L3385q512
7467A0649J9998k4332j0514P683J5982k3427k1965o315K001J4703K476K524K1488
7454A0951O8j5774K175O541R083r958p578j7110J3321M321k7937R99K9433j3693
$$ plain form
7440 -15158 -16884 -3552 -34780 -51435 -37567 -16202 -48488 -48588 -32970 -9343 4707 28656
7428 28656 38923 25166 43227 34599 28869 9459 -23904 -10563 22915 14142 -2193 -19449
7416 -19449 -4774 895 -5793 -32806 -17488 3476 -2862 -27074 -23847 -14464 -1676 -2944 -15062
7403 -15062 1709 31099 8150 10495 39640 35817 35622 42698 31478 -15016 -54060 -45239 -42815
7390 -42815 -309 14744 11437 30907 38501 17787 12953 7490 6046 -14703 -40701 -14867 2940
7377 2940 -18114 -15917 -1321 -29063 -36885 -63275 -80499 -50676 39 56967 44323 18382
7365 18382 18484 22426 -37264 -61979 -42707 -8490 29832 19314 22438 18956 -940 18751 58813
7352 58813 32923 36844 21295 1079 -15121 -25645 -34144 -31628 -44313 -49906 -34954 -33273 -8192
$$ packed form
7440a5158j726J3332l1228j6655J3868K1365l2286j00J5618K3627J4050K3949
7428B8656J0267j3757J8061q628n730j9410l3363J3341L3478q773j6335j7256
7416a9449J4675N669o688k7013J5318K0964o338k4212L227R383J2788j268j2118
7403a5062J6771K9390k2949K345K9145l823j95P076j1220m6494l9044Q821K424
7390d2815M2506J5053l307J9470P594k0714m834n463j444k0749k5998K5834J7807
7377B940k1054K197J4596k7742p822k6390j7224K9823N0715N6928j2644k5941
7365A8382J02L942n9690k4715J9272L4217L8322j0518L124l482j9896J9691M0062
7352E8813k5890L921j5549k0216j6200j0524q499K516j2685n593J4952J681K5081
$$ plain form
7339 -8192 -12333 -11374 4424 24522 10768 -1515 -54141 -73112 -66087 -52766 -15111 -1088 -22545
7326 -22545 -26622 -10702 29801 86353 54128 42152 46099 45835 59118 44826 6234 -39366 -76135
7313 -76135 -66410 -57774 -37483 -20869 -39770 -74321 -85910 -58157 -51048 -45095 -56481 -51305 -57120
7300 -57120 -38971 -5541 -15098 -28326 -39762 -57830 -33883 -37673 -21753 -45106 -34267 4086
7288 4086 32366 17514 -10014 -57723 -63275 -51777 -64716 -63684 -32560 -24110 -32283 -36236 -33449
7275 -33449 -30619 -30383 -37649 -35122 -15485 -38782 903 -20556 -42908 -14172 -7571 -7816 12150
7262 12150 7109 1354 -11307 -5397 16403 6061 14291 17770 -7057 25260 34809 32479 21068
7249 21068 10296 -2281 4288 10174 -2868 6933 19864 3244 -1136 6456 -30285 -58554 -43447
$$ packed form
7339h192m141R59J5798K0098j3754j2283n2626j8971P025J3321L7655J4023k1457
7326b2545m077J5920M0503N6552l2225j1976L947k64J3283j4292l8592m5600l6769
7313g6135R725Q636K0291J6614j8901l4551j1589K7753P109N953j1386N176n815
7300e7120J8149L3430r557j3228j1436j8068K3947l790J5920k3353J0839L8353
7288D086K8280j4852k7528m7709n552J1498j2939J032L1124Q450q173l953K787
7275c3449K830K36p266K527J9637k3297L9685k1459k2352K8736O601k45J9966
7262A2150n041n755j2661N910K1800j0342Q230L479k4827L2317R549k330j1411
7249B1068j0772j2577O569N886j3042R801J2931j6620m380P592l6741k8269J5107
$$ plain form
7236 -43447 -17874 -350 -9334 -30239 -11490 -12147 -31961 -29275 -49253 -84451 -83627 -47255 -8584
7223 -8584 -18241 -37726 -41962 -31276 -49519 -34514 18842 26583 -4045 -70 15875 7102 18288
7210 18288 -6842 -45402 -52705 -51508 -33844 -24058 -34766 -10671 -2860 6229 2875 4771 6500
7197 6500 -14301 -32157 -26580 -9954 -30947 -41088 -18944 -40886 -64013 -51883 -49648 -73279
7185 -73279 -84125 -42014 -13804 -3736 -25736 -30946 -35897 -52963 -51033 -52049 -32949 -26512 -31215
7172 -31215 -11528 1487 7284 3402 7186 -23641 -10690 23424 27815 -7378 -36775 -30227 -31192
7159 -31192 -17504 4776 9567 3408 -14188 -30383 -4486 9790 -8300 -19055 -43686 -97846
7147 -97846 -107350 -90626 -88355 -70057 -51098 -46895 -27367 -27599 -36398 -45973 -43230 -12203 16373
$$ packed form
7236d3447K5573J7524q984k0905J8749o57j9814K686j9978l5198Q24L6372L8671
7223h584r657j9485m236J0686j8243J5005N3356P741l0628L975J5945q773J1186
7210A8288k5130l8560p303J197J7664R786j0708K4095P811R089l354J896J729
7197F500k0801j7856N577J6626k0993j0141K2144k1942k3127J2130K235k3631
7185g3279j0846M2111K8210J0068k2000n210m951j7066J930j016J9100O437m703
7172c1215J9687J3015N797l882L784l0827J2951L4114M391l5193k9397O548r65
7159c1192J3688K2280M791o159j7596j6195K5897J4276j8090j0755k4631n4160
7147i7846r504J6724K271J8298J8959M203J9528k32q799r575K743L1027K8576
$$ plain form
7134 16373 57919 45391 22207 1322 27197 24870 5824 8368 -10325 -17141 -20351 -8660 6127
7121 6127 35976 29760 -28068 -30161 -31585 -29119 -63509 -85332 -57220 -25274 -13321 -28301 -26078
7108 -26078 -15317 1122 6528 37463 38838 4103 -9248 -14912 -9134 -9691 34649 54965 16838
7095 16838 -32606 -53535 -58286 -59299 -74222 -61132 -68462 -70740 -53093 -31321 -25949 -46973 -60356
7082 -60356 -26509 -2493 16501 707 -8708 -6379 22329 40248 20095 12183 5945 15768 10242
7069 10242 6632 -32525 -54852 -35354 -32446 -29938 -24730 4027 6229 21640 5872 -25891 -25198
7056 -25198 -53294 -36314 -17542 12930 23241 2480 -47124 -75399 -106897 -67182 -12943 -8395
7044 -8395 -10382 -41117 -50277 -16780 -5035 -15178 -12672 4413 4183 -14507 -10374 7144 10490
$$ packed form
7134A6373M1546j2528k3184k0885K5875k327j9046K544j8693o816l210J1691J4787
7121F127K9849o216n7828k093j424K466l4390k1823K8112L1946J1953j4980K223
7108b6078J0761J6439N406L0935J375l4735j3351n664N778n57M4340K0316l8127
7095A6838m9444k0929m751j013j4923J3090p330k278J7647K1772N372k1024j3383
7082f0356L3847K4016J8994j5794r415K329K8708J7919k0153p912o238R823n526
7069A0242l610l9157k2327J9498K908K508N208K8757K202J5411j5768l1763O93
7056b5198k8096J6980J8772L0472J0311k0761m9604k8275l1498L9715N4239M548
7044h395j987l0735r160L3497J1745j0143K506J7085k30j8690M133J7518L346
$$ plain form
7031 10490 36520 30172 26703 41325 16635 -41708 -39787 -57392 -67120 -67008 -53565 -68913 -65433
7018 -65433 -45355 -55272 -42573 -26391 -18981 -4159 -2296 20827 8013 -28675 -66344 -65006 -22218
7005 -22218 -22836 -5403 -25811 -46387 -33353 -44478 -36961 -11535 5786 -31211 -97195 -64154
6993 -64154 -28854 -37083 -10836 29756 40977 36828 27193 8429 -35301 -39723 -30021 -22588 -16669
6980 -16669 -26791 -1792 38236 89065 94803 53411 7527 -34500 -39452 -55537 -11449 7518
6968 7518 8478 8894 1913 8816 6884 -2334 -22125 -4618 13902 10627 -24008 -11179 21412 -1693
6954 -1693 -19211 -45260 -37274 -5716 4604 10436 -6807 -21677 -21495 -40956 -39246 -26076 -8830
6941 -8830 -20207 -25103 -33346 -45710 -86001 -93144 -56348 -44288 -60895 -44212 -29934 -20357 -19601
$$ packed form
7031A0490K6030o348l469J4622k4690n8343J921j7605r728J12J3443j5348L480
7018f5433K0078r917J2699J6182P410J4822J863K3123j2814l6688l7669J338M2788
7005b2218o18J7433k0408k0576J3034j1125P517K5426J7321l6997o5984L3041
6993f4154L5300q229K6247M0592J1221m149r635j8764m3730m422R702P433N919
6980a6669j0122K4999M0028N0829N738m1392m5884m2027m952j6085M4088J8967
6968G518R60M16o981O903j932r218j9791J7507J8520l275l4635J2829L2591k3105
6954a693j7518k6049P986L1558J0320N832j7243j4870J82j9461J710J3170J7246
6941h830j1377m896q243j2364m0291p143L6796J2060j6607J6683J4278R577P56
$$ plain form
6928 -19601 -51154 -76850 -59007 -26216 3991 -1304 16584 -5343 -34296 -28617 -45441 -44510 -39916
6915 -39916 -44104 -50276 -33449 -13084 5666 -14868 -30823 -30121 -1065 24196 49816 45375 17097
6902 17097 -656 -169 8763 1373 -22175 -41797 -26453 -23171 -39541 -68539 -32207 9495 -7279
6889 -7279 -17859 -18115 -725 -18391 -18597 -12839 -22453 -29258 -34857 -8780 -12482 16510 2528 -23698
6875 -23698 -52623 -25269 5627 -10054 1000 39780 36396 7523 7610 7355 1139 -12264 -34904
6862 -34904 -48849 -56753 -73573 -103358 -122407 -109853 -67198 -61613 -39650 -26660 -21858 -22568 -35527
6849 -35527 -34753 -63817 -96374 -66838 -50076 -53997 -82144 -85242 -75500 -71324 -69912 -39752 -23771
6836 -23771 -17415 -32855 -48591 -27324 -47985 -45250 -28791 -20173 10218 44579 35805 15573 -5529
$$ packed form
6928a9601l1553k5696J7843L2791L0207n295J7888k1927k8953N679j6824R31M594
6915c9916m188o172J6827K0365J8750k0534j5955P02K9056K5261K5620m441k8278
6902A7097j7753M87Q932p390k3548j9622J5344L282j6370k8998L6332M1702j6774
6889g279j0580k56J7390j7666k06N758r614o805n599K6077l702K8992j3982k6226
6875b3698k8925K7354L0896j5681J1054L8780l384k8873Q7k55o216j3403k2640
6862c4904j3945p904j6820k9785j9049J2554M2655N585K1963J2990M802p10j2959
6849c5527P74k9064l2557K9536J6762l921k8147l098R742M176J412L0160J5981
6836b3771O356j5440j5736K1267k0661K735J6459Q618L0391L4361q774k0232k1102
$$ plain form
6823 -5529 -1831 3775 -12985 -5866 -14083 -17858 -16348 3891 23068 35645 46363 62413 31315
6810 31315 -26091 -26413 -17934 -10009 -25403 -37185 -10932 -7674 -17052 -3092 -4598 -26470 -27430 -16236
6796 -16236 -40191 -16631 -11768 -8394 -10707 -13548 -32965 -63299 -46083 -10594 -1905 -35645 -53242
6783 -53242 -42294 -53092 -44879 -24215 11120 27367 32682 27077 -6792 -25971 -1676 -156 -23383
6770 -23383 -31700 -87101 -92767 -80968 -76965 -59652 -33036 -42579 -5919 16879 -2462 -57387 -51982
6757 -51982 -49774 -57320 -62470 -45645 -25888 2192 42331 46246 16510 17334 29472 -5123 -50354
6744 -50354 -35308 -42713 -19007 31031 27372 43427 57618 56367 6904 21117 31105 23167 22219
6731 22219 9104 -7543 -6428 -15478 -4899 22097 63563 65678 40891 10637 -659 11700
$$ packed form
6823e529L698N606j6760P119q217l775J510K0239J9177J2577J0718J6050l1098
6810C1315n7406l22Q479P925j5394j1782K6253L258r378J3960j506k1872r60J1194
6796a6236k3955K3560M863L374k313k841j9417l0334J7216L5489Q689l3740j7597
6783e3242J0948j0798Q213K0664L5335J6247N315n605l3869j9179K4295J520k3227
6770b3383q317n5401n666J1799M003J7313K6616r543L6660K2798j9341n4925N405
6757e1982K208p546n150J6825J9757K8080M0139L915k9736Q24J2138l4595m5231
6744e0354J5046p405K3706N0038l659J6055J4191j251m9463J4213R988p938r48
6731B2219j3115j6647J115r050J0579K6996M1466K115k4787l0254j1296J2359
$$ plain form
6719 11700 18170 -136 -25459 -42124 -43074 806 39425 42063 12882 -21 -31736 -35067 -26314
6706 -26314 -17166 -38111 -52063 -48490 -40136 -49811 -37794 -11846 8143 18048 17345 23364 27729 48021
6692 48021 34737 20124 45348 27914 26173 16546 31392 37387 43418 26639 3306 -34206 -24864
$$ packed form
6719A1700O470j8306k5323j6665r50M3880L8619K638k9181j2903l1715l331Q753
6706b6314R148k0945j3952L573Q354r675J2017K5948J9989R905p03O019M365K0292
6692D8021j3284j4613K5224j7434j741r627J4846N995O031j6779k3333l7512R342
$$ [...]
##END NTUPLES=NMR SPECTRUM
##END=
