##TITLE=Analysis number 327824
Compound Code km 03442
Book Reference 57168
Project Code adrs flro3
Chemist Name jom
##JCAMPDX= 6.0         $$ Bruker NMR JCAMP-DX V2.0
##DATA TYPE= NMR SPECTRUM
##DATA CLASS= NTUPLES
##ORIGIN= Bruker BioSpin GmbH
##OWNER= nmr
$$ XWIN-NMR		Version 3.5
$$ Wed Apr 11 16:06:44 2007 GMT Daylight Time (UT+1h)  MAYBRIDGE\nmr@NMR_250MHZ
##.OBSERVE FREQUENCY= 250.131544655141
##.OBSERVE NUCLEUS= ^1H
##.ACQUISITION MODE= SIMULTANEOUS (DQD)
##.ACQUISITION SCHEME= undefined
##.AVERAGES= 16
##.DIGITISER RES= 18
##SPECTROMETER/DATA SYSTEM= dpx250
##.PULSE SEQUENCE= zg30
##.SOLVENT NAME= CDCl3
##.SHIFT REFERENCE= (INTERNAL, CDCl3, 0, 16.522)
##AUDIT TRAIL= $$ (NUMBER, WHEN, WHO, WHERE, WHAT)
$$ ##TITLE= Audit trail, XWIN-NMR		Version 3.5
$$ ##JCAMPDX= 5.01
$$ ##ORIGIN= Bruker BioSpin GmbH
$$ ##OWNER= nmr
$$ C:\u/data/dgb/nmr/ADRS/1010/pdata/1/auditp.txt
$$ ##AUDIT TRAIL=  $$ (NUMBER, WHEN, WHO, WHERE, WHAT)
(   1,<2007-04-11 16:06:22.41 +100>,<MAYBRIDGE\nmr>,<NMR_250MHZ>,
      <created by zg, POWCHK disabled, PULCHK disabled
       configuration hash MD5:
       49 4B E0 1D 92 C2 6B 37 9F E6 65 BC 52 41 86 1D
       data hash MD5: 64K
       A9 5F 55 DF 81 28 92 FA 77 99 7C 75 01 BF CD 9F>)
(   2,<2007-04-11 16:06:33.89 +100>,<MAYBRIDGE\nmr>,<NMR_250MHZ>,
      <Start of raw data processing
       ef LB = 0.3 FT_mod = 6 PKNL = 1 SI = 32K 
       data hash MD5: 32K
       B0 47 46 0E 4F C1 14 F5 C6 2B A9 4F F4 4C BD 07>)
(   3,<2007-04-11 16:06:35.63 +100>,<MAYBRIDGE\nmr>,<NMR_250MHZ>,
      <apk 
       data hash MD5: 32K
       FD A3 68 14 76 4B 26 F6 0F 10 D2 8C CD 09 DF E1>)
(   4,<2007-04-11 16:06:36.35 +100>,<MAYBRIDGE\nmr>,<NMR_250MHZ>,
      <abs ABSG = 5 
       data hash MD5: 32K
       72 63 39 3E 0C 91 B0 80 C8 3B 73 B3 6E 40 8C 5D>)
$$ ##END=
$$ 
$$ hash MD5
$$ 41 DB 5E 27 63 E9 B4 5F 6B 7C 12 24 D4 D5 1C 82
##$RELAX= 
##$RELAX= 
##$RELAX= 
##$RELAX= 
##$RELAX= 
##$RELAX= 
##$RELAX= 
$$ Bruker specific parameters
$$ --------------------------
##$DU= <C:\u>
##$EXPNO= 1010
##$NAME= <ADRS>
##$PROCNO= 1
##$TYPE= <nmr>
##$USER= <dgb>
##$AMP= (0..31)
100 100 100 100 100 100 100 100 100 100 100 100 100 100 100 100 100 100 
100 100 100 100 100 100 100 100 100 100 100 100 100 100 
##$AQSEQ= 0
##$AQ_mod= 3
##$AUNM= <au_zg>
##$AUTOPOS= <41 >
##$BF1= 250.13
##$BF2= 250.13
##$BF3= 250.13
##$BF4= 250.13
##$BF5= 500.13
##$BF6= 500.13
##$BF7= 500.13
##$BF8= 500.13
##$BYTORDA= 1
##$CFDGTYP= 0
##$CFRGTYP= 5
##$CHEMSTR= <none>
##$CNST= (0..31)
1 1 145 1 1 1 1 1 1 1 1 1 1 1 1 1 1 1 1 1 1 1 1 1 1 1 1 1 1 1 1 1 
##$CPDPRG= <>
##$CPDPRG1= <>
##$CPDPRG2= <>
##$CPDPRG3= <>
##$CPDPRG4= <mlev>
##$CPDPRG5= <mlev>
##$CPDPRG6= <mlev>
##$CPDPRG7= <mlev>
##$CPDPRG8= <mlev>
##$CPDPRGB= <>
##$CPDPRGT= <>
##$D= (0..31)
0 1 0 0 0 0 0 0 0 0.06 0 0 0 0 0 0 0.0002 0 0 0 0 0 0 0 0 0 0 0 0 0 0 
0 
##$DATE= 1176303981
##$DBL= (0..7)
120 120 120 120 120 120 120 120 
##$DBP= (0..7)
150 150 150 150 150 150 150 150 
##$DBP07= 0
##$DBPNAM0= <>
##$DBPNAM1= <>
$$ [...]
##$SUBNAM7= <"">
##$SUBNAM8= <"">
##$SUBNAM9= <"">
##$SW= 20.6930455092707
##$SWIBOX= (0..15)
0 0 3 0 0 0 0 0 0 0 0 0 0 0 0 0 
##$SW_h= 5175.983436853
##$TD= 65536
##$TD0= 1
##$TE= 683.16
##$TE2= 300
##$TE3= 300
##$TEG= 300
##$TL= (0..7)
0 120 120 120 120 120 120 120 
##$TP= (0..7)
150 150 150 150 150 150 150 150 
##$TP07= 0
##$TPNAME0= <>
##$TPNAME1= <>
##$TPNAME2= <>
##$TPNAME3= <>
##$TPNAME4= <>
##$TPNAME5= <>
##$TPNAME6= <>
##$TPNAME7= <>
##$TPOAL= (0..7)
0.5 0.5 0.5 0.5 0.5 0.5 0.5 0.5 
##$TPOFFS= (0..7)
0 0 0 0 0 0 0 0 
##$TUNHIN= 0
##$TUNHOUT= 0
##$TUNXOUT= 0
##$USERA1= <user>
##$USERA2= <user>
##$USERA3= <user>
##$USERA4= <user>
##$USERA5= <user>
##$V9= 5
##$VALIST= <valist>
##$VCLIST= <CCCCCCCCCCCCCCC>
##$VD= 0
##$VDLIST= <DDDDDDDDDDDDDDD>
##$VPLIST= <PPPPPPPPPPPPPPP>
##$VTLIST= <TTTTTTTTTTTTTTT>
##$WBST= 1024
##$WBSW= 4
##$XGAIN= (0..3)
0 0 0 0 
##$XL= 0
##$YL= 0
##$YMAX_a= 293543
##$YMIN_a= -355818
##$ZGOPTNS= <>
##$ZL1= 120
##$ZL2= 120
##$ZL3= 120
##$ZL4= 120
##$ABSF1= 16.522
##$ABSF2= -4.171173
##$ABSG= 5
##$ABSL= 3
##$ALPHA= 0
##$AQORDER= 0
##$ASSFAC= 0
##$ASSFACI= 0
##$ASSFACX= 0
##$ASSWID= 0
##$AUNMP= <proc_1d>
##$AZFE= 0.1
##$AZFW= 0.1
##$BCFW= 0
##$BC_mod= 0
##$BYTORDP= 0
##$COROFFS= 0
##$CY= 12.5
##$DATMOD= 1
##$DC= 0
##$DFILT= <>
##$DTYPP= 0
##$F1P= 14.0000005364418
##$F2P= -0.99999901652339
##$FCOR= 0.5
##$FTSIZE= 32768
##$FT_mod= 6
##$GAMMA= 0
##$GB= 0
##$INTBC= 1
##$INTSCL= 1
##$ISEN= 128
##$LB= 0.3
##$LEV0= 0
##$LPBIN= 0
##$MAXI= 10000
##$MC2= 0
##$MEAN= 0
##$ME_mod= 0
##$MI= 0
##$NCOEF= 0
##$NC_proc= -4
##$NLEV= 6
##$NOISF1= 0
##$NOISF2= 0
##$NSP= 0
##$NTH_PI= 0
##$NZP= 0
##$OFFSET= 16.522
##$PC= 1
##$PHC0= 234.8952
##$PHC1= 8.816702
##$PH_mod= 1
##$PKNL= yes
##$PPARMOD= 0
##$PSCAL= 4
##$PSIGN= 0
##$REVERSE= no
##$SF= 250.13
##$SI= 32768
##$SIGF1= 0
##$SIGF2= 0
##$SINO= 400
##$SIOLD= 32768
##$SREGLST= <1H.CDCl3>
##$SSB= 0
##$STSI= 32768
##$STSR= 0
##$SW_p= 5175.98343685301
##$SYMM= 0
##$S_DEV= 0
##$TDeff= 65536
##$TDoff= 0
##$TI= <Analysis number 999999
Compound Code 99
Book Reference 9
Project Code 9>
##$TILT= no
##$TM1= 0
##$TM2= 0
##$TOPLEV= 0
##$USERP1= <user>
##$USERP2= <user>
##$USERP3= <user>
##$USERP4= <user>
##$USERP5= <user>
##$WDW= 1
##$XDIM= 32768
##$YMAX_p= 428113248
##$YMIN_p= -322079
$$ End of Bruker specific parameters
$$ ---------------------------------
##NTUPLES= NMR SPECTRUM
##VAR_NAME=  FREQUENCY,     SPECTRUM/REAL,   SPECTRUM/IMAG
##SYMBOL=    X,             R,               I
##VAR_TYPE=  INDEPENDENT,   DEPENDENT,       DEPENDENT
##VAR_FORM=  AFFN,          ASDF,            ASDF
##VAR_DIM=   32768,         32768,           32768
##UNITS=     HZ,            ARBITRARY UNITS, ARBITRARY UNITS
##FACTOR=    0.157963299565203, 1,           1
##FIRST=     4132.6476996994, 0,             0
##LAST=      -1043.33573715361, 0,           0
##MIN=       -1043.33573715361, -322079,     0
##MAX=       4132.6476996994, 428113248,     0
$$ Real data points
##PAGE= N=1
##DATA TABLE= (X++(R..R)), XYDATA
$$ [...]
16649e5199k8601K4130J0037n6023n910Q9696l6513l8455K6809J1518L5251m4968
16637f8228J2587K3824k0600p2151j5496n1245L3272J5250K4749l0936L1182J25335
16625G543O0407J3418O3861J2709j02228k9073K2598k449Q894K0145r6675l1480
16613e2330K2972N2562J13173k796l3144q0672j03402P4217Q0403L0215l1755
16602F9443j07470k3775J0288L8489l3964j487K3966q71K5609K8115l3402O0310
16590E5251J3277j49467M5346M7814n086l2045n1028J9650O6628k3489K445r08
16578a1612P292P4495P8759J2376J3723m1073n07O1751n0915k5506K1045m0295
16566I9533p7457o9939N5638O0931j52n2836k2101k7572p0891J8038L6789j00368
$$ plain form
16649 -55199 -83800 -59670 -49633 -105656 -111566 -21870 -58383 -96838 -70029 -58511 -23260 -68228
16637 -68228 -55641 -31817 -52417 -124568 -140064 -191309 -158037 -142787 -118038 -148974 -117792 7543
16625 7543 67950 81368 145229 157938 55710 26637 49235 46786 55680 75825 -20850 -52330
16613 -52330 -29358 23204 136377 133581 100437 19765 -83637 -9420 70983 101198 69443
16602 69443 -38027 -61802 -51514 -13025 -46989 -48476 -24510 -25381 228 28343 -5059 55251
16590 55251 68528 -80939 -35593 12221 7135 -24910 -75938 -56288 10340 -13149 -10704 -11612
16578 -11612 -4320 70175 148934 161310 175033 133960 133453 195204 144289 118783 139828 99533
16566 99533 22076 -47863 7775 68706 68554 15718 -6383 -33955 -104846 -86808 -50019 -150387
16554a50387N714R7057O1735k2676k3694o9118J1776N8187O8540Q6780J8708N34
16542A43156J7229q0797j17647m4537O0288J5830j3577j767k1936J9050J08124
16531H3416L0350L6498K6864l5679j5240r7320m2628l3379M9877l0281k9936Q0333
16519B2875R0112k7781j48042k6057J3409N6911K6771n0359m8079p926R7033o41
16507a774j5146o5574l7405J6375k1206L2667j6168J9774m539j4310j0028O2301
16495e5033j0784j7319O416L7426j8208o1877L2895M1285L5907M2511K3660r9993
16483d3114n4579O1765O2620R0932Q0512j58816j29046l4230M3289M9819K2379
16472h469l7320k0627M0548q418L7261O1416L105r522j0704p0048J8268k2137
$$ plain form
16554 -150387 -144673 -47616 14119 -8557 -32251 -101369 -89593 -31406 37134 123914 142622 143156
16542 143156 160385 79588 -38059 -82596 -22308 -6478 -20055 -21822 -43758 -24708 83416
16531 83416 113766 150264 177128 141449 126209 28889 -13739 -47118 2759 -27522 -57458 22875
16519 22875 112987 85206 -62836 -88893 -75484 -18573 8198 -42161 -90240 -98166 -1133 -1774
16507 -1774 -16920 -82494 -119899 -103524 -124730 -92063 -108231 -88457 -92996 -107306 -117334 -55033
16495 -55033 -65817 -83136 -76720 -39294 -57502 -119379 -86484 -45199 -9292 33219 56879 -43114
16483 -43114 -97693 -35928 26692 117624 198136 39320 -89726 -123956 -80667 -30848 -8469
16472 -8469 -45789 -66416 -25868 -34286 2975 64391 67496 57974 47270 -22778 -4510 -26647
16460b6647k7425k6209K5222M149j3993M954m8877L8650K5528o6619K6843j4054
16448i8478K9999O4310M5438l9583N0382M2511M25m2468n7821L4288n6213p7844
16436a05054K4468J11410P3370K59p9242R122K4414k3659o2352P2598J19275k684
16424A61925n3097q8157o900J00717n1815j05359K9706J2314m1783J2586l4495
16413f4358K8087l9526m0446K3172l3607N8749M0663N7662L3192q7023j4732P1863
16401C3696j7027k8467m3130M7713j2458M7699J1709k7174O8908J4491o8402p048
16389B0510l6604K0838m3584K0570j00951n7488O6074J2272l2475k7320L781j4155
16377a68532R9231P9619q3098j5828M0259j4708j0900P3167j6583L512J08l1677
$$ plain form
16460 -26647 -54072 -80281 -55059 -50910 -64903 -59949 -108826 -70176 -44648 -111267 -84424 -98478
16448 -98478 -68479 -4169 41269 1686 52068 94579 95004 52536 -5285 29003 -27210 -105054
16436 -105054 -80586 30824 104194 104453 25211 34333 58747 35088 -27264 45334 164609 161925
16424 161925 108828 20671 13771 114488 62673 -42686 -12980 -666 -42449 -29863 -64358
16413 -64358 -36271 -75797 -116243 -93071 -126678 -67929 -27266 30396 63588 -23435 -38167 33696
16401 33696 16669 -11798 -54928 -7215 -19673 28026 39735 12561 81469 95960 27558 20510
16389 20510 -16094 4744 -38840 -18270 -119221 -176709 -110635 -98363 -130838 -158158 -154377 -168532
16377 -168532 -69301 10318 -72780 -88608 -48349 -63057 -73957 -790 -17373 -13861 -13753 -45430
16365d5430J5166L862k5141N765k124o7793j2856r456K9919J5501N9794J9352
16353a3441n6834P286P3729Q6372l5685k7103O0017m2888M5254j1846r4511n0566
16341f0216J8150n9882k9855k5779P4251K5256O2778Q6421k3425n413n0812o1512
16329e0038q8764O1563L9195m882O9035K6728K3009N3657p1861m3329j3390n5934
16317e5011q961M4069K4524o588M9708P4450k777n939o1358n481l1413J0896K8942
16304E5061K7169j6390k5393L486o1450m5164k3432m6435L9039l0172n8490M6037
16292a36134N0692J17979J5646k7075K2214j3470l5952J6544j4702J2514l3451
16281b5195l8741m9097O6296M4724k1794M1724M8462j06214m1238L3902L5103
$$ plain form
16365 -45430 -30264 -26402 -51543 -45778 -47902 -115695 -128551 -138007 -108088 -92587 -32793 -13441
16353 -13441 -70275 -62989 10740 97112 61427 34324 94341 51453 96707 84861 -9650 -60216
16341 -60216 -42066 -101948 -131803 -157582 -83331 -58075 4703 91124 67699 62286 11474 -50038
16329 -50038 -138802 -77239 -38044 -42926 26109 52837 75846 129503 57642 14313 923 -55011
16317 -55011 -63972 -19903 4621 -1967 47741 122191 119414 113475 52117 46636 15223 26119 55061
16304 55061 82230 65840 40447 43933 -17517 -62681 -86113 -132548 -93509 -123681 -182171 -136134
16292 -136134 -85442 32537 48183 21108 43322 29852 -6100 10444 -4258 8256 -25195
16281 -25195 -63936 -113033 -46737 -2013 -23807 17917 66379 -39835 -81073 -47171 -12068
16270a2068K1255J4319L8363l2563K4072l516j1029m3182k6285l9650P2179r577
16258g682o1359M9773R8248o4121j0928j9140P3979j793r2744l7642p842L729
16246g7522M2215M6734L0966L6837M7299m8429l2251j795l5003j2966J9394j06299
16234i0820l308P1231P255O4535J7732o9927N974K3746m4676o532k7082n4886
16222a06758n141l629q0K1562j3215l6664m8272j2070j8903j5674L4833L0937
16210a73074k6345K1869R1673l6240K3621L9244p1924p3429L1290R2265j8558
16199i9608l9176J394m688kO1337j3555o0427J7917M019K0706N0042J03161P7778
16186A18898N5536o792n6248m1066l3167n7264m9409n6304K2140J5629O646J265
$$ plain form
16270 -12068 9187 23506 61869 29306 53378 49862 38833 -4349 -30634 -70284 1895 -7682
16258 -7682 -69041 -19268 78980 14859 3931 -15209 58770 56977 -35767 -73409 -81251 -77522
16246 -77522 -35307 11427 42393 79230 126529 78100 45849 44054 9051 -3915 15479 -90820
16234 -90820 -94128 -22897 -15642 48893 66625 -3302 2672 26418 -18258 -24790 -51872 -106758
16222 -106758 -111899 -115528 -115608 -94046 -107261 -143925 -192197 -204267 -223170 -238844 -204011 -173074
16210 -173074 -199419 -177550 -85877 -122117 -98496 -59252 -131176 -204605 -173315 -81050 -99608
16199 -99608 -138784 -137390 -142078 -142080 -80743 -94298 -154725 -136808 -132789 -112083 -62041 41120 118898
16186 118898 174434 167642 111394 70328 37161 -20103 -69512 -125816 -103676 -88047 -81401 -80136
16174h0136Q9725J1003m9442P9462N8513m8402r9900O358O1271N0588k0360N27
16162E9207k3941o0932l5308L8562K2435L2740j630q661J8727P8775q7663q8059
16150e5748N2587K8976n748k5125J7289k6313l902k1411L0571J0194m2261p5626
16138a16517R5096N0843N1443j6747l2350M4086n5949o6877l862m9088o111M3829
16126f2204M7577j15595k5375J02961J18011j8459q9637j00148N4601Q3350R547
16115D629o9714N225j5583l8678L2682O7904M6309J8817O7149l8132n9090o5048
16103d3530J8948J215m0859J9985o2867O95M6541j0809J9618m77j2450r50j2204
16090g7144l2432M2301J6922L631j8537k8769P5426K9822q057L8586r9816q5510
$$ plain form
16174 -80136 9589 20592 -28850 50612 109125 60723 -39177 -32819 28452 79040 58680 59207
16162 59207 35266 -25666 -60974 -22412 23 32763 31133 22472 41199 119974 32311 -55748
16150 -55748 -3161 25815 20067 -5058 12231 -14082 -17984 -39395 -8824 1370 -40891 -116517
16138 -116517 -21421 29422 80865 64118 31768 75854 19905 -46972 -50834 -99922 -106033 -62204
16126 -62204 -14627 -130222 -155597 -52636 65375 46916 -42721 -142869 -88268 -4918 4629
16115 4629 -65085 -59860 -75443 -114121 -81439 -13535 32774 51591 118740 80608 21518 -43530
16103 -43530 -24582 -23367 -64226 -44241 -107108 -106413 -59872 -70681 -51063 -51540 -63990 -64940 -77144
16090 -77144 -109576 -67275 -50353 -46722 -65259 -94028 -18602 11220 3163 41749 -58067 -143577
16078a43577k5164J3196N4215O080K2361J5429k7798K5747M6485m7367o6308J17815
16066h886L6331N4580j2155N363j1675k7587p6705l6280O6263k7074k6908m7959
16054a12692K6257J03488j4444K0841l0620j1955n442J0299k4841M0978L8273
16043D0142K7355J1859m956l5204p2524J1707K8426Q8563J7779L5564l2022l6152
16031H0537k1562o7334k1784L7644O1638k6607q8502r010l3422Q3220Q5597p215
16019G3200j39194N9431K9815j33232l8180o4301M4522J00211n0940J18311P9096
16008G8739l7993k8752L2944J0697m3113m1274l1750M0659P1326P6244K6930p3966
15996H0691p4226k0236M8414R8701p651n7209k1260m7646J9980r257q0186r113
$$ plain form
16078 -143577 -168741 -155545 -101330 -95250 -72889 -57460 -85258 -59511 -13026 -60393 -126701 -8886
16066 -8886 27445 82025 69870 75233 63558 35971 -40734 -77014 -10751 -37825 -64733 -112692
16054 -112692 -86435 17053 2609 23450 -7170 -19125 -24567 -14268 -39109 1869 40142
16043 40142 67497 79356 74400 39196 -33328 -21621 6805 95368 113147 148711 116689 80537
16031 80537 58975 -8359 -30143 7501 69139 42532 -45970 -54980 -88402 -5182 80415 73200
16019 73200 -65994 -6563 23252 -109980 -148160 -212461 -167939 -67728 -118668 -357 78739
16008 78739 40746 11994 44938 55635 12522 -28752 -60502 -19843 51483 127727 154657 80691
15996 80691 6465 -13771 34643 133344 125693 68484 47224 -422 19558 10301 -69885 -78998
15984g8998J02116n12n7516N7907M5845k0862k3027m6102j3986K188k5863M2654
15972a6156J03958m1369j1107Q0570L0806j3548j16973n0960L5556K6391q3154
15961e5986q9681J1652j6500J0614K1755m9941k5037P1107J05881K9566j5570
15950b140p1129k8832J0339K920L448N0638M0086l9053j8903L6111J02022l5343
15938E0164P530k637n5298M033j5692Q559m7033m5521N4492k485k0426q7851m2661
15925a94826N4845J26292N2662r3919R172k6402L1402J0018r531j03596k4271
15914a68154K3671O3984R7736O2290l8421k5310q4892n9613j4373K8739Q8923
15903b5420N273J6286r4069n0698L8146R3094N1930j1217j9785j4642O694N4936
$$ plain form
15984 -78998 23118 22606 -34910 22997 68842 47980 24953 -21149 -35135 -32947 -58810 -16156
15972 -16156 87802 46433 35326 115896 146702 133154 16181 -34779 777 27168 -55986
15961 -55986 -145667 -134015 -150515 -139901 -118146 -168087 -193124 -122017 -16136 13430 -2140
15950 -2140 -73269 -102101 -91762 -88842 -85394 -34756 5330 -33723 -52626 -16515 85507 50164
15938 50164 57694 55057 -241 3792 -11900 -3341 -50374 -95895 -41403 -43888 -64314 -152165 -194826
15925 -194826 -139981 -13689 38973 -54946 -45774 -72176 -40774 -30756 -40287 -143883 -168154
15914 -168154 -144483 -80499 17237 79527 41106 15796 -69096 -128709 -143082 -114343 -25420
15903 -25420 -20147 -3861 -97930 -148628 -110482 -17388 34542 23325 3540 -11102 -4408 50528
15891E0528j1559m5745m4910J1758N6566J37165o463n9113J3618l4294l7623n6235
15879b6307K4768L2978K2099P2781J4444M1355q6649j34292K6643M3296P9069
15868A10185Q28j03102r7063j9J00601O8893j1981n5932k1599P9943l9786n6438
15856b5470J02619K2510k7137o5737o1023p2421O2281L2469K073k0510p501J9731
15844c8116j8776o5056n0063J272r472M7006m2386n7601O476M8689M7838O5855
15832f4334M8195j0011m3522M2909j5099k4136L2848M1487J2913p8609p0723J5907
15820a12175L8622J09817j2924l9182j588j8244p2656K1407J00596R0435j3606
15809I0502l4972k6529l096j9227j7265N47j3697m2103M1535J6198P231j15899
$$ plain form
15891 50528 38969 -6776 -51686 -39928 16638 153803 147340 88227 101845 67551 29928 -26307
15879 -26307 -1539 31439 53538 126319 140763 182118 95469 -38823 -12180 31116 110185
15868 110185 111013 7911 -89152 -89171 11430 80323 68342 12410 -9189 70754 30968 -25470
15856 -25470 77149 99659 72522 6785 -54238 -126659 -64378 -31909 -29836 -50346 -57847 -38116
15844 -38116 -56892 -121948 -172011 -170739 -180211 -133205 -175591 -233192 -226716 -178027 -130189 -64334
15832 -64334 -16139 -26150 -69672 -26763 -41862 -65998 -33150 8337 21250 -57359 -128082 -112175
15820 -112175 -73553 36264 23340 -15842 -17430 -35674 -108330 -86923 13673 104108 90502
15809 90502 55530 29001 25905 6678 -10587 -10040 -23737 -65840 -24305 -8107 -876 -116775
15797a16775O241O0168P5319O6530o5473r2156M0338l1907l7746L8168J7756O1989
15785B2452k9351Q8K5135K4240L5211n1134j3859Q6858N8613k7708k2467O915
15773A14993l5424n8576M0660P5687l4569n6640m9481o788K3162J7639P1725M0717
15761A43105l0051q297l885J2899k4727q747n1631j28525n4114J02270O2071q1258
15749g0890R263J8470O0987J8259J2644J1922K6659k0095J01053P9678q0816o6169
15737A00965l0986l2970m7803O3169l2101j0373Q0703K1835Q506r5905o1620L7037
15725D57K8993m945k7805n866J9911O7992k2098p8042N7472J3631o2685l6141
15713d9126r2964o417M4862L3323k5776N3531k5790m5037K3455J5634l080P6957
$$ plain form
15797 -116775 -110534 -50366 24953 91483 26010 -66146 -25808 -57715 -95461 -57293 -39537 22452
15785 22452 -6899 -6811 18324 42564 77775 26641 12782 99640 158253 130545 108078 114993
15773 114993 79569 20993 61653 137340 102771 46131 -3350 -10138 13024 30663 102388 143105
15761 143105 113054 104757 100872 113771 89044 80297 28666 -99859 -153973 -51703 10368 -70890
15749 -70890 -61627 -43157 17830 36089 48733 60655 87314 67219 168272 247950 167134 100965
15737 100965 69979 37009 -10794 52375 20274 9901 90604 112439 120945 25040 -36580 457
15725 457 29450 24505 -3300 -9166 10745 78737 56639 -21403 36069 49700 -12985 -49126
15713 -49126 -142090 -148507 -103645 -70322 -96098 -42567 -68357 -113394 -89939 -74305 -77385 -428
15701d28Q3525j786o6897m6646N6276K1177p5356J6185N3657L9754M9670m8355
15689H0776k856j29629l0820J2314k5087K6542J7931J5364K4325q6079k2177j7712
15677a37108M8831N0320k8738m3907P8273R2573J6661m5499K4209P5315r362L0144
15665A51712o4234n7328l8788N6869K82q9987k5077K4778K9014P008J1443Q2417
15653H8109k2548j7644J565n1242j976j5732J1492K5696m9312k0243Q1071R2749
15641A21985o1411j14012r5329j8685N4203R1243O7255o89K3153j0651K8661q8192
15629b469j26780m1926O901j5345L3376M895J02586J45327Q393q3926o4810o2819
15617i6597N1060J5860K4581J7222K5696k2321r0233k6743N297N407J9326J6945
$$ plain form
15701 -428 83097 81311 14414 -32232 24044 45221 -30135 -13950 39707 79461 129131 80776
15689 80776 77920 -51709 -82529 -70215 -95302 -68760 -50829 -35465 -11140 -97219 -119396 -137108
15677 -137108 -88277 -37957 -66695 -110602 -32329 60244 76905 31406 55615 130930 121568 151712
15665 151712 87478 30150 -8638 48231 48513 -41474 -66551 -41773 -12759 -5751 5692 88109
15653 88109 65561 47917 49482 -1760 -3736 -19468 -7976 17720 -31592 -51835 29236 121985
15641 121985 60574 -53438 -148767 -167452 -113249 -22006 45249 44560 67713 57062 85723 -2469
15629 -2469 -129249 -171175 -164274 -179619 -146243 -141348 -38762 106565 114958 31032 -33778 -96597
15617 -96597 -45537 -29677 -5096 12126 37822 15501 -74732 -101475 -96178 -90771 -71445 -54500
15605e4500L2888r576N9033L0599q3680m1274N2065O5885m0950K2232j0511r1617
15593f9406l3127J357q5149k2793J00216J60065P3841m8559r2690J4137j01J8768
15581A6559l383o527J3551P0849m6967j20333o6178M3223l7015P9513j03l895
15569f0706O1536L7543k2871l6461q495l2089n312Q7266m8963j6857O0231k4848
15557a0026J6467q6766m7823J1487k4709L2308m1168M5346J33242L2981k4658
15546C6681j2714k2132j724K4392Q170L900J8651P0196j3832m7127k1872j761
15534D0828J1328j6111m0894L4919R872o720l3991J8413O6640j0578m5015o7388
15522c8697l2698O1118J20850N4747m811k644n2662l6653p9904q2192p4063P2337
$$ plain form
15605 -54500 -21612 -31188 27845 58444 -25236 -66510 -14445 51440 10490 32722 22211 -69406
15593 -69406 -102533 -101176 -186325 -209118 -108902 51163 125004 76445 -16245 -2108 -2209 16559
15581 16559 13176 6649 20200 91049 44082 -76251 -142429 -99206 -136221 -56708 -56811 -60706
15569 -60706 830 38373 15502 -20959 -29454 -61543 -66855 20411 -28552 -45409 14822 -10026
15557 -10026 6441 -80325 -128148 -116661 -141370 -109062 -150230 -104884 28358 61339 36681
15546 36681 23967 1835 111 24503 32673 36573 55224 125420 111588 64461 42589 40828
15534 40828 52156 36045 -4849 30070 39942 33222 -769 17644 84284 73706 28691 -38697
15522 -38697 -71395 -10277 110573 165320 160509 157865 105203 68550 -11354 -93546 -167609 -95272
15510i5272R2229m2899J2770J6484m1038M484q01q280P7241L2714o1073K443J04194
15497I3196Q527K5624K8783p6756l2109n8300n9240n5480O7842j9692L4004R7416
15485E3815l036j19116k7226O9589l4796M3550Q662J9704M2770L5545k0363j0541
15473E8557J175n3684L516J7695l4218O515O6407L8452o2116N1925l2421k0587
15461D1216o688J5683M3335n9631m0189j07990r5745L434J07647M5953N1418Q988
15449G431L7327j5655k3909p3426k916P0473j6486N1258N0967j2562q5106q0008
15437i2612K4390K3166m9899m8270Q5112R3716R356K1590q3850r738O8629K0121
15425F1711n8891n1294k9451R174M6634K092K294M1166r9505o9866L8740K6993
$$ plain form
15510 -95272 -3043 -45942 -33172 -16688 -57726 -53242 -54043 -62323 14918 47632 -13441 -10998 93196
15497 93196 101723 127347 156130 79374 47265 -11035 -70275 -125755 -57913 -77605 -43601 53815
15485 53815 50779 -68337 -95563 -25974 -60770 -17220 -8558 11146 53916 89461 69098 58557
15473 58557 59732 6048 9564 27259 -6959 -444 65963 104415 42299 94224 61803 41216
15461 41216 34528 50211 93546 33915 -6274 -114264 -210009 -206575 -98928 -52975 -1557 7431
15449 7431 44758 29103 5194 -68232 -71148 -675 -17161 34097 85064 72502 -12604 -92612
15437 -92612 -68222 -45056 -94955 -143225 -58113 35603 44959 66549 -17301 -27039 41590 61711
15425 61711 2820 -48474 -77925 -68751 -22117 -20025 -17731 23435 -76070 -145936 -107196 -80203
15413h0203M29K7116j9738l933Q11K6731L0105M3992J0808p5186j1004j2608k8856
15400i1536k95K7467L2271j6316k7032l9948K5644J4667o264M4617k2653r6157
15388a55535J6865M2084N8122M0025p6707M5221J3407L1849P747j426J8301k6899
15376A3054K923O0751r1942l8941o4215p68p247N6808o601r0501J00390n230N7351
15363a4168l1177P550m6088k9080q851Q8879P5603K2721Q2330N6407q74j06563
15351I6689j14959N911p503R640P0182M6005m5802r6006q2464j7846L3015J2705
15339i0433l210Q7623O2151k4814j621k0654p7580L6606m4420P3448J63798n8469
15327A02425q9086Q801n8839q2484m9881L1131K8759j20728P3977P8214J6233
$$ plain form
15413 -80203 -79774 -52658 -72396 -76329 -75518 -48787 -18682 25310 36118 -39068 -50072 -62680 -91536
15400 -91536 -91831 -64364 -32093 -48409 -75441 -115389 -89745 -75078 -81342 -36725 -59378 -155535
15388 -155535 -138670 -96586 -38464 1561 -75146 -29925 -16518 15331 23078 21652 39953 13054
15376 13054 15977 76728 -15214 -54155 -118370 -119138 -126385 -69577 -76178 -166679 -66289 -71519 -14168
15363 -14168 -45345 -37795 -83883 -112963 -121814 -32935 42668 65389 147719 204126 203252 96689
15351 96689 -18270 -12359 -19862 -10222 59960 105965 60163 -35843 -118307 -136153 -103138 -90433
15339 -90433 -93643 -6020 56131 31317 29696 9042 -68538 -31932 -76352 -2904 160894 102425
15327 102425 13339 22140 -36699 -119183 -169064 -137933 -109174 -229902 -155925 -77711 -61478
15316f1478J01934O8585P32j21844k3874o6812L3192k5707J9880N7658j3323K3298
15304g759k5111j3233P3209l6486n7077m1968J01757K8319K1406m0385k0612j1753
15292b9693L211O893M896J3729n159k8647J02461R0160k3627r6279r1904N9228
15280E269P4620j7176q5438n437N9538K1988n3822k0884J0979Q012k707k7386
15268c2444N5412j5264q1510l6232K3527P039L7405M4318n6688J3540M7515n8810
15256e2192O744j8100m4893j9153J9396k3170Q6511N4768l1389l3273L7818J624
15244a5309K1j09006M7578O6452J4447l8034O2088R0826J3997n3874k6099j21922
15232f8835K2234m1748P5862R7599k2527j7193R073l3891k0253o6799k3970j2078
$$ plain form
15316 -61478 40456 109041 109773 -12071 -35945 -102757 -69565 -95272 -75392 -17734 -31057 -7759
15304 -7759 -32870 -46103 27106 -9380 -66457 -108425 -6668 21651 43057 2672 -17940 -29693
15292 -29693 -26482 -19589 -14693 -964 -6123 -34770 67691 157851 134224 37945 -53959 5269
15280 5269 79889 62713 -22725 -28162 31376 53364 -458 -21342 -10363 -2351 -5058 -32444
15268 -32444 22968 7704 -73806 -110038 -86511 -79472 -42067 2251 -54437 -40897 6618 -52192
15256 -52192 -45448 -63548 -108441 -127594 -108198 -131368 -44857 9911 -21478 -54751 -16933 -15309
15244 -15309 -15288 -124294 -76716 -10264 4183 -33851 28237 119063 133060 79186 53087 -68835
15232 -68835 -46601 -88349 -12487 85112 62585 45392 54465 20574 321 -66478 -90448 -102526
15220a02526L6600K2610p3523l6896J25441k4158j16985J9040P2401M8717J1837
15209a7442L8304k8441L7195J6539n4476r5099n9597J0080P0925j5355r7085m7677
15197b42129N9588J8736P3106P9312L6900q7039n6344o3151J10439R8137l7505
15186i950o637k5603m451j5284L9563O2784K6916l7535p654L7652L4382p3783
15174B0400q0011r9014p5084k5405N0183R6970O3637j6641n2769m0395n9268L127
15162b14270N6288o119Q9308O4377K3337j0053m7090n0527k4247m4976J5282K885
15150a45805l1120L062o426J5155K7667L7457l0542O7579P3869N1189N1713n8915
15138E4883j43513k6217K9981R652N9978N7401j3856J3540K6034n1604K445L8547
$$ plain form
15220 -102526 -65926 -43316 -116839 -153735 -28294 -52452 -169437 -150397 -77996 -29279 -17442
15209 -17442 20862 -7579 29616 46155 -8321 -103420 -163017 -152937 -82012 -97367 -194452 -242129
15197 -242129 -182541 -163805 -90699 -11387 25513 -61526 -117870 -181021 -70582 27555 -9950
15186 -9950 -16587 -42190 -46641 -61925 -22362 40422 67338 29803 22149 59801 94183 20400
15174 20400 -59611 -158625 -233709 -259114 -208931 -111961 -48324 -64965 -117734 -158129 -217397 -214270
15162 -214270 -157982 -164101 -74793 -10416 12921 2868 -44222 -94749 -118996 -163972 -148690 -145805
15150 -145805 -176925 -173863 -180289 -165134 -137467 -100010 -130552 -62973 10896 62085 113798 54883
15138 54883 -88630 -114847 -84866 -75214 -15236 42165 28309 41849 67883 16279 18724 57271
15126E7271M796O8577J9963l0819n3834k8382m291k1673K0248m3120n7830L1009
15114c8085J31157L7943j29599j9431N4803l1483j09165j4564M3003l5686O0951
15103e0156Q5200J1216L1446J1520q266n6491o4793M3856M3779q869J9471P7215
15091A35128L4221R155p0995l7103N6450O4201K4006n6750j73556j17538j4701
15080a47482R4173m6125J08100P6801o3211O133M4696n6870m4571j4167p1349
15069a13872m1339L3178l6991M9213M8706p4163l3865L9836R295L7027R8552Q6821
15057A02398l1695l2881j9585L7064m7522r0466L1511J94082o9540j20302k5575
15046g2511L8568J3861j8875O635P40J3588N938l8430k7473P746K5303l216M1798
$$ plain form
15126 57271 62067 130644 150607 119788 65954 37572 33281 11608 31856 -11264 -69094 -38085
15114 -38085 93072 131015 1416 -18015 36788 5305 -103860 -118424 -75421 -111107 -50156
15103 -50156 35044 46260 77706 89226 80960 24469 -40324 3532 47311 38442 57913 135128
15091 135128 169349 178504 107509 70406 126856 191057 215063 158313 -15243 -132781 -147482
15080 -147482 -53309 -99434 8666 85467 22256 28389 73085 16215 -28356 -42523 -113872
15069 -113872 -155211 -122033 -159024 -109811 -61105 -135268 -169133 -129297 -120002 -82975 15577 102398
15057 102398 70703 37822 18237 55301 7779 -82687 -51176 142906 73366 -46936 -72511
15046 -72511 -33943 -20082 -38957 -32322 -31582 -17994 -12056 -50486 -77959 -70213 -44910 -48126 -6328
15033f328N0000L5817O191l4507K4805N094L1452l7512L9104m7582l2577m0965
15021g008l9981J0687J21945K5070p8063l8658N1697l8880K2697K452M6919J9033
15009I7910m5060r276K7424n2902p7923M791j7902L9980R7936r559R850j4644
14997E0625L1428K361P173q354K680l0144j395J8437J2006l8653j2125j7534L207
14984A9712k1799M4756j2030k5864m380q1658j18645N5791P6106O7666M4580K7971
14972G2206l7323m5375m7517j8355N5676N2265q854K2029o6374k8436J8261j1115
14960d2912o3266R303L4994j799M1179N2361R94k4426j440J5241n6582m3732p1541
14947a51626L4494J1993J5547Q321J2866L4603L8367n3927M6186k5574l318N3576
$$ plain form
15033 -6328 43672 79489 85680 51173 75978 81072 112524 75012 114116 66534 33957 -7008
15021 -7008 -46989 -36302 85643 110713 32650 -6008 45689 6809 29506 31958 78877 97910
15009 97910 52850 43574 70998 18096 -59827 -55036 -72938 -32958 64978 55419 65269 50625
14997 50625 82053 84414 91587 83233 85913 55769 54374 72811 84817 46164 34039 16505 19712
14984 19712 -2087 42669 30639 4775 395 -81263 -199908 -144117 -68011 -345 44235 72206
14972 72206 34883 -10492 -58009 -76364 -20688 31577 22723 44752 -21622 -50058 -31797 -42912
14960 -42912 -106178 -96875 -61881 -63680 -22501 29860 30854 6428 4988 20229 -36353 -80085 -151626
14947 -151626 -117132 -105139 -89592 -81271 -68405 -33802 4565 -49362 -3176 -28750 -32068 21508
14935B1508N5784l8493k848r66m6341p2722q2890J0081L1630M3029M0723j085
14923d2590N1447o650p9970L2952J19936k2070j8043n3857l6022o5655M2915R2336
14911A4729k5180l3708J00946m046p537J01735M2769l7843k8521l4041o0779m1107
14899a2583k8165L8738k6487J6094m8786j3805M2461J23130O128p3144n8852m0864
14887g6135l3554M4626K9059M2508M8978j2132n7346P59J4399K7791O639o1264
14875b5672O8288N9678k7472p1386k9422k9071O1175P8429l7028j38305n3390
14864a44176j1276P6939L9093j6804l4647M5840O9231l1757m9745O8409l7274
14853b6167Q054J16594K8475j51614J2654J8375m8660l1459j6375k3072Q2162
$$ plain form
14935 21508 77292 38799 35951 34985 -11356 -84078 -166968 -156887 -125257 -82228 -41505 -42590
14923 -42590 8857 2207 -77763 -44811 75125 53055 35012 -18845 -54867 -120522 -77607 14729
14911 14729 -10451 -44159 56787 52741 45204 146939 189708 151865 123344 89303 28524 -12583
14899 -12583 -40748 -2010 -28497 -12403 -61189 -74994 -32533 90597 96725 23581 -35271 -76135
14887 -76135 -109689 -65063 -36004 6504 55482 43350 -13996 -13237 1162 28953 35592 -25672
14875 -25672 42616 102294 74822 3436 -25986 -55057 6118 84547 47519 -90786 -144176
14864 -144176 -155452 -78513 -39420 -56224 -90871 -45031 24200 -7557 -57302 11107 -26167
14853 -26167 -18113 98481 126956 -24658 -12004 6371 -42289 -73748 -90123 -113195 -31033
14842c1033L4465O1688L7146m5341N796m3450o2319n5662k3956L7035K4362L652
14830e7617l8807l4905K0064R8934M5250L8812q25j12397p7491m2277N7277O8327
14818c5655O4674K1135k1312l4481j4975Q7598K4492k7513l0336k3273k0205k0180
14806c0031o928j367P0740K1526j2839R946o4288m915R1320m4661k4048J9272
14794B3727l2109Q8816j3333j03657q9313O4513K0008k8033M0649L4720J2618
14783A8606L9218k8043p206J3760n3950o838N6849l739K6721L2257n4256j4321
14771A9058k0243N791r780l2455L0774L5542l1250N197P269J8881L8969Q037K3651
14758I9441L5303k7454q0496o7094j4628R5048m0178R947p965n3897n2541N3221
$$ plain form
14842 -31033 3432 65120 102266 56925 62721 19271 -43048 -98710 -122666 -85631 -61269 -57617
14830 -57617 -96424 -131329 -111265 -12331 32919 71731 70906 -41491 -118982 -161259 -103982 -35655
14818 -35655 29019 50154 28842 -5639 -20614 66984 91476 63963 33627 10354 -9851 -30031
14806 -30031 -36959 -38326 32414 53940 41101 51047 -13241 -18156 73164 28503 4455 23727
14794 23727 -8382 80434 67101 -36556 -125869 -61356 -41348 -69381 -28732 5988 18606
14783 18606 57824 29781 22575 36335 -17615 -24453 32396 28657 55378 87635 33379 19058
14771 19058 -1185 4606 -5174 -37629 -6855 28687 -2563 2634 9903 28784 67753 75790 99441
14758 99441 134744 107290 26794 -40300 -54928 40120 -58 9889 1924 -51973 -104514 -51293
14746e1293O7440M1907k8029n0621k3582R6134J7911j83n1929m5832j39413n7000
14734b24490O3768J02540J16591k1601j9365N5466J1352l1142N18o4106p2339
14723h2808K3096P4396R6743n0301l7572j889p6399L3235O2144M8863k0807l4286
14711C4415o4061L2119K6511n25n2729L9899O1472j1630m7515J7274m321l2393
14699a484L9350l9595k5402k5798m3853r126Q3261P3571K2378j0163n0352q10
14687A1977Q3483K6960p1471l0938k0458L5718m9518r3857k4201K8922K9934N1270
14675b2179J38774k2620r2686M6447N0348j2426j2193l5538K527j1126l9031k3835
14663c3538k9120M9234j6309K580K3566J4585L314O8183K7535q7166o0446O706
$$ plain form
14746 -51293 16147 58054 30025 -20596 -44178 51956 69867 69684 17755 -28077 -167490 -224490
14734 -224490 -160722 -58182 58409 36808 17443 72909 84261 53119 53637 -10469 -82808
14723 -82808 -59712 14684 111427 61126 23554 21665 -54734 -21499 40645 89508 68701 34415
14711 34415 -29646 2473 28984 28459 -24270 15629 77101 65471 17956 35230 30909 -1484
14699 -1484 37866 -1729 -27131 -52929 -96782 -105908 -22647 50924 73302 63139 12787 11977
14687 11977 95460 122420 50949 20011 -447 35271 -14247 -108104 -132305 -103383 -73449 -22179
14675 -22179 116595 93975 1289 47736 98084 85658 73465 37927 40454 29328 -9703 -33538
14663 -33538 -62658 -13424 -29733 -27153 -3587 10998 14312 82495 110030 22864 -37582 -30876
14651c0876R937l2149p8301L9437N6374P6829N1306n0381K3970J5778j6735K6346
14639I1535J0238N463m9247j0989l5416k6528L3531o8607j12714M2105J07298
14628a3331J41511m088j17473j33083K0025K1804N2546O4969q864J8874R206l0765
14616B1331p8721k4037J56623M2071r1202m5755P44k6310J03055N070p9227L3078
14604A6720L1665K2659L7259R6627l0913K3058P789j6423Q976r4166q9001r1836
14592g7586m552P3197K0430j7921K9910P2474M99p9898n4881J5600Q1649K5185
14580H4106N0365L0120p4792q9294j0891J2173L671M6684J0061l16N7001n9190
14568E9698m5544r327k8023K3184o860k7008J4641k691l6309M7398O3170l4060
$$ plain form
14651 -30876 -20939 -53088 -131389 -91952 -35578 41251 92557 42176 66146 81924 65189 91535
14639 91535 101773 107236 57989 47000 11584 -14944 18587 -50020 -162734 -120629 -13331
14628 -13331 128180 124092 6619 -126464 -106439 -84635 -32089 32880 24016 42890 52096 21331
14616 21331 -57390 -81427 75196 117267 26065 -19690 -18946 -45256 57799 62869 -16358 16720
14604 16720 48385 71044 108303 204930 174017 197075 204864 188441 197417 103251 14250 -77586
14592 -77586 -82138 -8941 11489 -6432 23478 95952 96451 16553 -38328 -22728 58921 84106
14580 84106 134471 164591 89799 505 -10386 1787 5458 52142 62203 61887 118888 59698
14568 59698 14154 4827 -23196 -12 -6872 -33880 -19239 -21930 -58239 -10841 52329 18269
14556A8269m3519O2886m3352o1416O7843J7825j8951p3883m3796J8211L664K5274
14544g0945m351O0143J51063n7519q1445O172K9234L0327N9835m973m0618R0114
14532A67037l4469j3913n293N467j16787m8172N7535k1238R894Q3369j2827q2975
14520a2372l5485N802n2676k664J7074O5179o9148l0636J0262J24412J08509m0745
14508H7512q2967J4971Q0178n0979n7878r5846l8102l3634k7678m411N4051P8001
14496g6782R6586N0389j3227j16355N0513n389m2861J9314k7074j2536K6290Q8763
14484C7631K0152k034j3167K6664l8604r0175l2754R5705J193r7676l8909R32
14472a31042K5940J4066K7552k5750j070M8184k4287j5836L1710j3769K5891j658
$$ plain form
14556 18269 -25250 37636 -5716 -67132 711 18536 -415 -74298 -118094 -99883 -96219 -70945
14544 -70945 -75296 -15153 135910 78391 -3054 3118 32352 62679 122514 117541 76923 167037
14532 167037 132568 118655 113362 118829 2042 -46130 11405 -9833 61 83430 70603 -12372
14520 -12372 -47857 -42055 -94731 -97395 -80321 -15142 -84290 -114926 -104664 19748 128257 87512
14508 87512 4545 19516 99694 48715 -9163 -105009 -143111 -176745 -204423 -208834 -154783 -76782
14496 -76782 19804 70193 56966 -59389 -8876 -14265 -57126 -37812 -64886 -77422 -51132 37631
14484 37631 57783 55749 42582 69246 30642 -59533 -92287 3418 4611 -93065 -131974 -131042
14472 -131042 -105102 -91036 -63484 -89234 -90304 -42120 -66407 -82243 -50533 -64302 -38411 -40069
14460d0069j6126J04055o5329k4531K7289m7690P281L0997Q6331M1566J04857
14449B08631M2418k1165p9637l6596j4230N1614K9630M5445q369q3426m1430j6955
14437G5930n6769m0706j2313k9701J39423J07886l8578M5430K8499n0326o9053
14426I9722o7972L4566J08088m1330j11313p9960K5975L3306N5674n3538p8123
14415g4905J40514M8247r1904o9659J0131M6870j0909n6278o3718K7354j610O233
14403h9634N3673L3428M13p6012n0645J02068N8816J0337j3923l5789o3521N1862
14391a8927J5292m1516k060J9245R0247O9356q872j2807p2888K443n4550l9861
14379e4898l9480K5925l986Q3322R3305K4922m3259o8157j03199m0078Q4532M9531
$$ plain form
14460 -40069 -56195 47860 -17469 -42000 -14711 -62401 -55120 -24123 62208 103774 208631
14449 208631 251049 229884 150247 113651 99421 151035 180665 226110 217741 134315 92885 75930
14437 75930 19161 -21545 -33858 -63559 75864 183750 145172 190602 219101 168775 99722
14426 99722 31750 66316 174404 133074 21761 -58199 -32224 1082 56756 3218 -74905
14415 -74905 65609 113856 21952 -47707 -37576 9294 -1615 -57893 -121611 -94257 -95867 -89634
14403 -89634 -35961 -2533 -2120 -78132 -128777 -26709 32107 42444 28521 -7268 -70789 -18927
14391 -18927 -3635 -45151 -47211 -27966 62281 131637 122765 109958 37070 39513 -15037 -54898
14379 -54898 -94378 -68453 -72439 10883 104188 129110 85851 17694 -85505 -125583 -41051 8480
14367H480l4739k4521K7082O6038M476q624j09614q1271m435o100Q125j8680K5912
14354a47871N4285k7727P814M8989O3864P9562p952K0526L7534r0919k9211k6237
14342a7343P887N6720p576l2483R925N328J8961N7961J474M4433p0656j39727
14330f5096Q3120L1893J1090q0077n9242O6022L0528L0566o3230j93102n3123
14319b60651J89868J40189L7413j2381n4971n7007o1015m3801Q860r526l4075
14308a57097j2579l9106O1270j4234Q2439J6450Q8975p46m7213j2531K5091l8383
14296d7664M2052K7835k7765K8360k4189m7810o146J44269l4767k7226j3510k3981
14284a0542O629K0365M9247M6885l5586k1443M6425J4637n7078o5977O3167P624
$$ plain form
14367 8480 -26259 -50780 -23698 42340 46816 38192 -71422 -152693 -157128 -163228 -155103 -173783 -147871
14354 -147871 -93586 -121313 -113499 -64510 -646 78916 70964 91490 129024 38105 8894 -17343
14342 -17343 -9456 47264 39688 7205 17130 22458 41419 99380 100854 145287 74631 -65096
14330 -65096 18024 49917 61007 -19070 -78312 -12290 18238 48804 -14426 -207528 -260651
14319 -260651 -70783 69406 106819 94438 39467 -17540 -78555 -122356 -113496 -123022 -157097
14308 -157097 -169676 -208782 -147512 -161746 -79307 -62857 26118 25372 -21841 -34372 -9281 -47664
14296 -47664 -5612 22223 -5542 22818 -1371 -49181 -55327 88942 54175 26949 13439 -10542
14284 -10542 -3913 16452 65699 112584 76998 55555 101980 116617 59539 -6438 56729 64353
14272F4353p6698m1066Q8229J60198M3232p2470j21234l6965P2388o4766j01271
14261h6070K2364K9236k1232M7671M0914l2603n5280k8462M4662N6932L7511K6416
14249H2059n5419o7437L9189Q1383K9780L3039L2350p9244k9796l4347O2170O8427
14237A62154k9352q6645j06026K1335N2798M327N7181O760J9420n9352j07904
14226f5304K6316O8930m3168L1329J2224j131J401l2649o917K7680P6045K5410
14214A20166K8641k199n476p6982k9664Q841P1304n984k7113L5074k9621o1781
14202B5206O8221O0168J7327M7429q2288n2910l285M4640p4671j30262q8293K291
14190a66427O5269J04426q129l3919L3283N662O148K7467o691q7920j8421j1383
$$ plain form
14272 64353 -12345 -53411 34818 195016 238248 165778 44544 7579 79967 15201 -86070
14261 -86070 -63706 -34470 -55702 -8031 32883 280 -55000 -83462 -38800 18132 55643 82059
14249 82059 26640 -40797 -1608 79775 109555 142594 174944 95700 65904 31557 93727 162154
14237 162154 132802 46157 -59869 -38534 14264 18591 75772 82532 101952 42600 -65304
14226 -65304 -38988 29942 -13226 18103 30327 29196 30597 -2052 -8969 18711 94756 120166
14214 120166 148807 146608 141132 64150 34486 43327 114631 108647 81534 116608 86987 25206
14202 25206 93427 153595 170922 218351 136063 83153 79868 124508 49837 -80425 -168718 -166427
14190 -166427 -101158 3268 -4861 -38780 -5497 165 6313 33780 27089 -60831 -79252 -90635
14178i0635P9833j1873r361K9724q0211R775L0707n242O159M052M2047Q2675M6216
14165A33866J9839p3730m7060p3880l8415j5029N3238L4192j3430M1959O4041
14154H5591k1292m7286p8593l3340k37N6734j0663Q340p728J664P5718l8806O100
14141c798J9154N6663j2126n4486q773l3801j0829l4343K5559M2451R631M3861
14129C9163N2135j04403q9211j6073J02400L7534p3170O756O6398k887j5780k4313
14117b1451J0701R3894J3243J728P3121m3161q6213k8398N3193K5046j08669r6042
14105a13008K8964R3380O9426J0993o9119n3807P9316O6190n9806J6506N9943
14094A28978p144k3513n4566m7623N1185k1913J0273K3310n6399P0778Q5194k0038
$$ plain form
14178 -90635 -10802 -22675 -32036 -2312 -82523 -72748 -42041 -47283 -41124 -37072 4975 87650 133866
14165 133866 153705 79975 32915 -40965 -79380 -94409 -41171 -6979 -20409 21550 85591
14154 85591 64299 17013 -61580 -94920 -95157 -38423 -49086 -40746 -48474 -46810 28908 -9898 -3798
14141 -3798 15356 72019 59893 5407 -3366 -37167 -47996 -82339 -56780 -14329 -4698 39163
14129 39163 91298 -13105 -102316 -118389 -15989 21545 -51625 -44869 21529 18642 2862 -21451
14117 -21451 -10750 83144 96387 98115 171236 128075 41862 13464 66657 91703 -16966 -113008
14105 -113008 -84044 9336 78762 89755 20636 -33171 46145 112335 52529 69035 128978
14094 128978 121834 98321 43755 -3868 47317 25404 35677 58987 2588 73366 158560 138522
14082A38522j34151j04511K873J05633M7979j8021O4897k9073k6540k8189P5986
14071I5405O8847m5600m2748o9053J9313L4837J04416O9208K3797N6630L5348
14060C50400p7791l8448j09041n1552J3411l3808o5390L882l7688m7351O9941
14049b3435M4747O1065K9758q9897L3467j537l1034P9494N4986J6960k2141K9393
14037A81826l8263o5487O708n0070N7760n431o7677N1318J18300N2382r6014n6518
14025H8834J3553J6007M2084j5597M7956R0348Q8475J7718P9622O3906o6700j73881
14013B92325n5105r2811j4762K3255j3468R777l5508J647m2003o072J5356L4369
14001A17000J6809Q3164q4451p7317P8082J6451j438J7230j7978M8539k4344j17472
$$ plain form
14082 138522 4371 -100140 -97267 8366 56345 38324 103221 74148 47608 19419 95405
14071 95405 164252 118652 75904 6851 26164 61001 165417 234625 258422 315052 350400
14060 350400 272609 234161 125120 73568 86979 53171 -12219 -8337 -46025 -93376 -23435
14049 -23435 21312 82377 112135 22238 55705 54168 23134 102628 157614 174574 152433 181826
14037 181826 143563 78076 84784 34714 92474 87043 19366 70684 188984 241366 145352 88834
14025 88834 102387 118394 160478 144881 192837 283185 371660 389378 469000 532906 466206 292325
14013 292325 237220 144409 129647 152902 139434 149211 113703 115350 73347 67275 82631 117000
14001 117000 133809 216973 132522 55205 133287 149738 148300 165530 147552 196091 171747 54275
13989E4275J4609M8156J00503J8019j6653l5048o4257L9891j2144j637j201l3994
13977A10519M8053J15321N3486J10445J50560l8306K393j8275o0788j75484j24291
13966A73633P907J8640m7328m0659l3951m5900l0238k5609j3680j8002R9631N6853
13954A01297P328j7219l695n332p8870k8056j3586L0072m1710K9000N1218r479
13942B0968K8139J3672q8125M1198K4006j01300K2429N7424Q5638O5479p362k4944
13930A37222Q1645R343o0297N5299P7456m2895r3184m5845j0462o4862P4018L2251
13918A49689l8852j56518m2939K8411L4141r19P0307M9043Q2336m40r6127j14601
13906c6469l6834j1006r596l6823Q4176P7592j831j3142M9439j8481J3474K7284
$$ plain form
13989 54275 68884 117040 217543 235562 218909 183861 119604 159495 147351 145714 144513 110519
13977 110519 158572 273893 327379 437824 588384 550078 552471 534196 473408 297924 173633
13966 173633 181540 200180 152852 112193 78242 32342 2104 -23505 -37185 -55187 44444 101297
13954 101297 108625 91406 87711 82379 3509 -24547 -38133 -8061 -49771 -20771 30447 20968
13942 20968 49107 62779 -25346 15852 39858 -61442 -39013 18411 104049 169528 162166 137222
13930 137222 218867 228210 167913 223212 300668 257773 164589 118744 108282 43420 117438 149689
13918 149689 110837 -45681 -88620 -60209 -26068 -26987 43320 92363 174699 174259 78132 -36469
13906 -36469 -73303 -84309 -93905 -130728 -46552 31040 29209 16067 65506 47025 60499 87783
13894H7783j6727j3712l895P9763Q5323j09426l2145m843M1294m542j7330M5553
13882A37096L7419l5380J2598j3148k9624O656J2174o9213R125l6349j2024L6197
13870E5527J0621J03724J2949l4143m1887m6817p6694N6675P0677L6727j41689
13859E670r9049N7444J3694n9711N9264J1387O828J3900l8198n1147O177M1685
13847c2056K6469K2307J9348Q0597K212r7210o7592Q2357K2951m2661r2795K449
13835g3624Q8901P5134n7940r6281J6272l2346J31Q9282Q2904l729o6997M819
13823B6526J25476N4701q3177l6557L4454l8511O5132P148k5598K6576N4829k0553
13811A90446n0572R481M0004k2851r1490j2687M2779J9539J18803K0021m5823
$$ plain form
13894 87783 71056 57344 53449 133212 218535 109109 76964 72121 113415 108873 91543 137096
13882 137096 174515 139135 151733 138585 108961 115617 127791 58578 67703 31354 19330 55527
13870 55527 66148 169872 182821 148678 106791 59974 -16720 39955 110632 147359 5670
13859 5670 -93379 -35935 -22241 -81952 -22688 -11301 -4473 9427 -28771 -79918 -73741 -32056
13847 -32056 -5587 16720 36068 116665 118877 21667 -45925 36432 59383 16722 -76073 -73624
13835 -73624 15277 90411 32471 -63810 -47538 -79884 -79753 9529 92433 88704 21707 26526
13823 26526 152002 206703 123526 86969 121423 82912 148044 155192 129594 156170 210999 190446
13811 190446 139874 149355 189359 166508 75018 62331 105110 124649 243452 263473 217650
13800B17650k9601q7000J4795P7254m1400J8201q5055o2047m347K5555J6429K6415
13788H6849n0581K828Q0069J2922m9830m7611O8322Q3822Q716n5651o6394j6559
13776E6902J09766P5596K9670o1422o061r7346l7770O3503J0331L6137N1008j9151
13764B11163j44079p9787J2293M9969M7954L3806o371m1091J0125K6451k8392
13753I2041l0917m395m3578o3139r6244o746J03958J41875N1385o301O888L2371
13741A77198m1735o2063M0909M8504n5362n635k0581L969j180R639n2112L263
13729D4814J6267M296K0702J02456K4666r5487m1279K7491l7202j014P9593L4150
13717A79453k53j5745o3589p0928K9812K5902J0979J3188l02J9342J5228N9239
$$ plain form
13800 217650 188049 101049 115844 193098 151698 169899 84844 22797 18450 44005 60434 86849
13788 86849 36268 39096 119165 132087 82257 34646 102968 186790 195506 139855 73461 56902
13776 56902 166668 242264 271934 210512 204451 107105 69335 132838 143169 179306 230314 211163
13764 211163 67084 -12703 -410 49559 97513 131319 124948 83857 93982 120433 92041
13753 92041 61124 56729 13151 -49988 -146232 -152978 -49020 92855 144240 137939 144827 177198
13741 177198 135463 73400 114309 162813 107451 101816 81235 85204 84024 93663 41551 44814
13729 44814 61081 65377 86079 188535 213201 117714 76435 103926 66724 65710 145303 179453
13717 179453 179200 163455 99866 28938 58750 84652 95631 108819 108517 127859 143087 202326
13705B02326J6651p0461l5416J06892K2566L9113j0238K0798O2842Q0031P4156
13694E09260l8091J593o5375j5372j8658j7329O457j7276K2598k5106l1984l4691
13682B76026Q1005P1520k3905k3885l0108M4936k2608q9603l3689O9870K0920
13671C40479o0584J0195m5281j01010n641J0756Q0328J08401k4398m2599k4161
13660B46485J6757J78546J31716L6081r8416n5824q76o628P0574K7264L5046K4546
13648F05271K2951K5276l7839l7180O8378K4570m850r9478n9691j1759R4391R9382
13636F89422L3134o5544m3561m1287N7155R9597L9754j3028P1116M3014J8101
13625H87873M1490K2001N7680l1198l0410K1097J49366R2487P0199J69064J80688
$$ plain form
13705 202326 218977 148516 113100 219992 242558 281671 271433 292231 355073 435104 509260
13694 509260 471169 472762 407387 392015 373357 356028 362485 345209 367807 342701 310717 276026
13682 276026 357031 428551 404646 380761 350653 395589 372981 283378 249689 319559 340479
13671 340479 279895 290090 244809 143799 138158 148914 229242 337643 313245 270646 246485
13660 246485 263242 441788 573504 609585 511169 455345 454469 447841 518415 545679 580725 605271
13648 605271 628222 653498 615659 578479 646857 671427 666577 567099 507408 495649 590040 689422
13636 689422 722556 657012 613451 572164 629319 728916 768670 755642 826758 869772 887873
13625 887873 929363 951364 1009044 977846 947436 968533 1117899 1210386 1280585 1449649 1630337
13614A630337J81056K59704K30836L53452M77633N37885N82968O54900J008632
13605E917403J267665J541877K289867L180743M333172N005213M526535L038395
13597C1100870J045541j510690m563047o173235n176190l407698k089936j353645
13589G871970q97136n88254m92405k94464k10216k35317j53565j49258n3780N8970
13579D856545K08894O2913J7608P9177K64452K23219K40839K71667L34728M18534
13569F978576N07640O52946O55135P65602J034627J345441J643624K130259K716414
13560A8430264L420980M577575O542112R372600J2747572J5680090J5620679J0720173
13552I7112045L998635l136258j3361901k1149850j8110559j1598283p144621
$$ plain form
13614 1630337 1811393 2071097 2301933 2655385 3133018 3670903 4253871 4908771 5917403
13605 5917403 7185068 8726945 11016812 14197555 18530727 23535940 28062475 31100870
13597 31100870 32146411 30635721 26072674 19899439 14723249 11315551 9225615 7871970
13589 7871970 6974834 6386580 5894175 5599711 5389495 5154178 5000613 4851355 4797575 4856545
13579 4856545 5065439 5128352 5145960 5225137 5489589 5712808 5953647 6225314 6560042 6978576
13569 6978576 7486216 8139162 8794297 9559899 10594526 11939967 13583591 15713850 18430264
13560 18430264 21851244 26428819 32970931 42343531 55091103 70771193 86391872 97112045
13552 97112045 101110680 97974422 84612521 63462671 45352112 33753829 26609208
13545B6609208m404774k817431j930571j409038j106182q66571q05221n77846
13537A2691574k78273k74689j06198n2736L7674J70921J97298K10069L01454K27125
13527A3124219K13890J81741J58180K20741K92709M47139N00155Q05795J087714
13518A7032283J493147J961403K450636L195763M487483O312213Q901349J2367135
13510E8201412J5549201J5970868J1679060M733786k304921j2332349k1480834
13503G0016223j9622328j2705380p608497m805347l235352k200588j466909j258439
13495A7113383j033664r29958p80747n39624k85886k57590j81972L4128P7350
13486A3215420Q2541M2184J22545J2323l0269j69046k25689k21881j55805j67829
$$ plain form
13545 26609208 22204434 19387003 17456432 16047394 14941212 14074641 13269420 12691574
13537 12691574 12413301 12138612 12032414 11979678 12017352 12188273 12385571 12595640 12897094 13124219
13527 13124219 13338109 13519850 13678030 13898771 14191480 14638619 15138774 15944569 17032283
13518 17032283 18525430 20486833 22937469 26133232 30620715 36932928 45834277 58201412
13510 58201412 73750613 89721481 101400541 106134327 103829406 91497057 70016223
13503 70016223 50393895 37688515 30080018 25274671 22039319 19838731 18371822 17113383
13495 17113383 16079719 15149761 14369014 13829390 13543504 13285914 13103942 13138070 13215420
13486 13215420 13297961 13340145 13462690 13475013 13444744 13275698 13050009 12828128 12672323 12504494
13476A2504494j37317P889J79398L53032N35929O94289R59112J232928J851360
13467A8181114K851304L971514M834553M915624L679592J603578p35208l783044
13459C5519027o530824o521047m647341k927348j812460j289918r82695o63683
13451A0143711n39077m84418m11919l47207k82752k51042j56925j72898j20642
13442G376831K3955J0641j33015q6184j44849j48057n6722q5985k00960l02247
13432F253408k01812q6143j61350j18407j34911j44248j92656j09727j35089l4380
13422D934685n8827l2139O0865l684j35334j52804n1214r8740j63823j94287j78247
13411C926451j83102j18295n3770p7296n1915j28603j02205r4082n5961j02599
$$ plain form
13476 12504494 12367177 12375066 12554464 12907496 13443425 14137714 15096826 16329754 18181114
13467 18181114 21032418 25003932 29838485 34754109 38433701 40037279 39302071 35519027
13459 35519027 28988203 22467156 17819815 14892467 13080007 11790089 10807394 10143711
13451 10143711 9604634 9120216 8708297 8361090 8078338 7827296 7670371 7497473 7376831
13442 7376831 7400786 7411427 7278412 7192228 7047379 6899322 6842600 6756615 6555655 6253408
13432 6253408 6051596 5965453 5804103 5685696 5550785 5406537 5213881 5104154 4969065 4934685
13422 4934685 4875858 4843719 4904584 4900900 4765566 4612762 4561548 4462808 4298985 4104698 3926451
13411 3926451 3743349 3625054 3571284 3493988 3442073 3313470 3211265 3117183 3061222 2958623
13401B958623l9749l1874o6205j28018j38242p8989k0784l7696J5552L8233p0577
13390B400274p3259p5374n6993k1763o4032o9971k1421J2418l4372n4470m4766
13379A896271k7210n3413m391k927n7220m3439l9561m0587q0109j23119n0890
13368A373405p4510j951j1006M3586m6756o4596m9006m1139K2449p5497n4836
13357A020143L697n288M04M2641R186m6582k703k2770n4210p2824P1775r900q1511
13344H52058j5708n2302p673j9217J094n0886m7799l6045j1558k9211L4424O848
13332F24025L8154m4065k819m3037p5224j05488l9435J4593P9418N6210j5373
13321D86959K2441J7373k2665m6269j2084m5859L2820l91j8567k2272R6956j0343
$$ plain form
13401 2958623 2918874 2887000 2820795 2692777 2554535 2475546 2454762 2417066 2432618 2470851 2400274
13390 2400274 2327015 2251641 2194648 2172885 2108853 2038882 2017461 2029879 1995507 1941037 1896271
13379 1896271 1869061 1815648 1811257 1808330 1751110 1707671 1668110 1627523 1547414 1424295 1373405
13368 1373405 1298895 1296944 1285938 1329524 1282768 1218172 1169166 1128027 1150476 1074979 1020143
13357 1020143 1023840 1018552 1018956 1061597 1070783 1024201 1021498 998728 944518 871694 943469 933569 852058
13344 852058 836350 784048 776375 757158 758252 707366 659567 623522 611964 582753 617177 624025
13332 624025 662179 618114 615295 572258 497034 391546 352111 366704 446122 502332 486959
13321 486959 509400 526773 504108 457839 445755 399896 432716 432325 413758 391486 488442 478099
13309D78099o9929p526j7293l3856R2849O4778K7588j2704r6835m6052k6567j3219
13297C39333R848P649L0307K3606o1646n0448n4880L0272P564N6567l0708m4593
13285B62871P7907J17596q4940m6251J9845p9339m8034q691P9501j2679o978r7526
13273A73282p2894Q7584j3603N2808J26608M8070k8610k102L6864J1152p5287
13262C43872l7784J8573J2812n2800m7893Q6127O8818n2425j337j3077l7096Q9847
13250C77637L2536k8668L8147l8557r3051L8138j4292q984l4452O491p299q3807
13238A83839l0598N1843Q1928K1955l1781K3568J7715L396m3602M7230m8804L7930
13226C14619Q0016o3480q6871M8542N1131l1719p1608l4108J4840N2127J2137
$$ plain form
13309 478099 408170 400644 383351 349495 442344 507122 534710 522006 425171 379119 352552 339333
13297 339333 349181 356830 387137 410743 349097 298649 243769 274041 281605 338172 307464 262871
13285 262871 340778 458374 373434 327183 347028 267689 219655 210964 290465 277786 270808 173282
13273 173282 100388 187972 174369 227177 353785 401855 373245 371143 408007 419159 343872
13262 343872 306088 324661 337473 284673 236780 322907 391725 339300 337963 324886 287790 377637
13250 377637 410173 381505 419652 381095 288044 326182 311890 302906 268454 274945 267646 183839
13238 183839 153241 205084 287012 308967 277186 300754 318469 321865 278263 325493 276689 314619
13226 314619 394635 331155 244284 292826 343957 312238 240630 206522 221362 273489 285626
13215B85626l1391j83060m8706N5909R6357M237J0666k5837J9285M3093M3853
13204B70032q0641j17528o1163L0717J02902Q7882l3386p9598o6090N5367R8001
13193B06495P7194l0252l6579J1077l2057o3100k3753J6536Q5053L3621p7809
13182A66426j2708J3880j2303m407l735K5873m574l5206L9572J7133o4949o651
13170A18351L9974K3970K5556m118j2168R668L1593Q920K0978L4963l5228n0917
13158B11542o134k1143J5117p4479r7082J4907K6677J1756L6983m333L6302K6496
13146A76609L5522l9798L8469J407m4364l6639M7988p0051q7474K2872j5331l595
13134B5615L7238M3586M2727n6381n0083R439J50837J00378M617J06797Q77j13766
$$ plain form
13215 285626 254235 71175 22469 78378 174735 178972 189638 163801 183086 226179 270032
13204 270032 189391 71863 10700 41417 144319 232201 198815 119217 53127 108494 206495
13193 206495 283689 253437 216858 227935 195878 132778 109025 125561 210614 244235 166426
13182 166426 153718 167598 155295 150888 147153 173026 168452 133246 172818 189951 125002 118351
13170 118351 158325 182295 207851 203733 191565 201233 232826 241746 262724 297687 262459 211542
13158 211542 205408 184265 199382 124903 27821 42728 69405 81161 118144 113811 150113 176609
13146 176609 212131 172333 210802 212209 167845 131206 179194 109143 21669 44541 29210 25615
13134 25615 62853 106439 149166 92785 42702 52141 202978 303356 307973 414770 415647 301881
13122C01881k7815o039n7135j4075n1895j08628J830O9869J6090K9719Q59n1600
13110A03061o5826k4947Q0977Q0560J2772L4192M7928N1062j00113r4221k1892
13099A03553m7096Q922P346M4525n95r1381k8082k9004P9747J25570J9577R5805
13087B88887r751r1177k3244L9482Q0226J45757J2149J4972M8210K8278L2923
13076E66712o4005j06564p2939p278K6714k5060k9769l1236M4973j8224m7826
13065B35498r6402J2294L135K8885l6516o4913p6348r483k2944Q8268J09867J05131
13053B76472K9054K2294m8464n3429o7205k0378k9823n5493l886J08826L3612
13042A91580J0787O1043O4278j0828J9132J06781J10032O4935j2821q8096j29711
$$ plain form
13122 301881 274066 268027 210892 196817 144922 36294 38124 107993 124083 153802 154661 103061
13110 103061 37235 12288 93265 173825 186597 220789 268717 319779 219666 125445 103553
13099 103553 56457 65379 72725 117250 116655 25274 -2808 -31812 47935 173505 193082 288887
13087 288887 279136 187959 164715 204197 284423 430180 442329 457301 505511 533789 566712
13076 566712 502707 396143 323204 315926 342640 317580 287811 256575 301548 283324 235498
13065 235498 139096 151390 154525 183410 146894 81981 5633 -3850 -26794 61474 171341 276472
13053 276472 305526 327820 279356 225927 158722 138344 108521 53028 49142 157968 191580
13042 191580 202367 263410 327688 316860 335992 442773 552805 617740 604919 516823 387112
13031C87112r9050o2703j0597N5683O859j12220K1694J39055j6221j38761j44511
13020B6340N882J8003J0106M2796K7429j0290J6330P0083o9921k4004J1049J2106
13008A35909j9609m9349l7969l5416O9706N6882n592m2749K6507N4722o8511J7399
12996A01930m2593K0108Q227P6891N4376m4208R888J4179l9195n0069m0765J6542
12984H5311m6210j0966J1589M0140M1701n0269l5624K4856j3848k6526o498J08908
12972A22564j5406k0434n4388O1299j5351r966K9824k1579P4561L6214M2295K3498
12960B53131P508l7491r5255r2080J3029m6114k5943J9961L3547N5280L381j6560
12948G2394l4563m1446L8692Q6853J2599o0296O5627l2704n6102K5492K3120O1487
$$ plain form
13031 387112 288062 225359 214762 270445 277304 165084 186778 325833 309612 170851 26340
13020 26340 32222 50225 60331 103127 130556 120266 136596 206679 136758 112754 123803 135909
13008 135909 116300 66951 28982 -6434 63272 120154 114562 71813 98320 153042 84531 101930
12996 101930 59337 79445 87672 164563 218939 174731 184619 198798 159603 109534 68769 85311
12984 85311 39101 28135 39724 79864 121565 71296 35672 60528 46680 20154 13656 122564
12972 122564 107158 86724 32336 93635 78284 68318 98142 76563 151124 187338 229633 253131
12960 253131 260639 223148 127893 35813 48842 2728 -23215 -3254 30293 85573 88954 72394
12948 72394 37831 -3615 35077 121930 134529 74233 139860 107156 51054 76546 99666 161153
12936A61153l166k6973m1946o6047N8433M1838o7170r3345j3667K4074Q056N7637
12924C8877J23149L6682q4574o7321n4449O3404M5599j6970m1274j0476k5604
12913G043r1942m0191L3806P3527O1985M5425Q2576l0555j40593l6704l5500p1241
12901a42364J18311J25053m3162l2535R33m6383P0458L3125n3060K1628J7384
12890F9388Q7l4982k8733m0062M2974K7229l4961K5364l687MP8976K2807J4496
12877A38900l7015q6631k5677o7723l6177N9086J6271k0195q425o4895j349L7110
12865i6720L7438j2801N120M1404R0668k8650M3067M1312K6969P5484o7029j1853
12853A44409j0345M5153L5902l0069r0295q0932l0191J5224K5234O0002N4510
$$ plain form
12936 161153 157987 131014 89068 23021 81454 123292 56122 -37223 -50890 -26816 -18760 38877
12924 38877 162026 198708 114134 46813 -7636 55768 101367 84397 43123 32647 7043
12913 7043 -84899 -125090 -91284 -17757 44228 89653 172229 141674 1081 -35623 -71123 -142364
12901 -142364 -24053 101000 57838 25303 26236 -20147 50311 83436 30376 52004 69388
12890 69388 69475 34493 5760 -34302 8672 35901 940 26304 22617 22621 101597 124404 138900
12877 138900 101885 15254 -10423 -78146 -114323 -55237 -38966 -59161 -67586 -132481 -133830 -96720
12865 -96720 -59282 -72083 -66963 -25559 65109 36459 79526 120838 147807 223291 156262 144409
12853 144409 134064 179217 215119 185050 94755 13823 -16368 -1144 24090 84092 138602
12842A38602j13301m7262m061O8036j8094j7803J2237J036L1609l8980k8578N9135
12830D2576J3874k3717R129J3432m3954k1198L2760P472n926K4360N257N8286
12818A12351k5124j0195o2925m2397L7612N244P5010Q421N6372L6057l8327L417
12806A55516m2404O3085J8933j1462J787k4087j0103N0591L7374R4542N9667K4357
12794D17796J5041l6581j74107m6398k8180o348r632m7625n3386K752l8464L4092
12782B8960M3562M0561M8123n4258j9323J15826M3391r4433q1349P6361n442j00004
12770D1975m784N3959N8176L6190L1247O9914p9972j44699j02356k2216R4712
12759C2146R1772R8225k8275j07108o2378l2439l5167j4357K084P8834J3660n0558
$$ plain form
12842 138602 25301 -21961 -26022 42014 23920 6117 18354 19390 50999 12019 -16559 42576
12830 42576 56450 32733 41862 55294 11340 -9858 22902 30374 24448 48808 54065 112351
12818 112351 87227 77032 14107 -28290 9322 14566 89576 97997 154369 190426 152099 155516
12806 155516 113112 176197 195130 183668 185455 161368 151265 201856 239230 333772 393439 417796
12794 417796 432837 396256 222149 175751 147571 141223 131591 83966 30580 33332 -5132 28960
12782 28960 72522 113083 161206 106948 87625 203451 246842 152409 71060 147421 141979 41975
12770 41975 37191 91150 149326 185516 216763 286677 206705 62006 -40350 -62566 32146
12759 32146 123918 222143 193868 86760 24382 -8057 -43224 -57581 -55497 23337 36997 -13561
12747a3561K3007M3979O9336L4486q838n6797j4872q059K6675m6879P570L8251
12735I4298J1477L7450m6908k6561m0337n1057O283R0919q372k3781P666o7334
12723a6257k9701K8181j2826L6813j6677j6186M3490P8510O605j4558p8861l691
12711D842r9839J5499m1380N9223L9042k7554J8561J6974L1444O3659n703p4197
12699E71n6351j4084N412L7602L5865M7942M5734N194M1128L3331j11483j28141
12687e7280O131O4554n0298l6867J20039M5859k6304q1855j04646Q7863J37222
12676A04418J4781l4568n0341l1124m6782p443k1250k2346J2180K7085O5247M9183
12664E9040o6790o8067N9609P2801n746Q0821R0464p5605J2023l8613m1781L5569
$$ plain form
12747 -13561 9446 53425 122761 157247 148409 91612 76740 68681 95356 48477 56047 94298
12735 94298 105775 143225 96317 69756 29419 -21638 -15355 75564 67192 43411 51077 -16257
12723 -16257 -45958 -17777 -30603 6210 -10467 -26653 16837 95347 101952 87394 8533 4842
12711 4842 -94997 -79498 -120878 -61655 -22613 -50167 -31606 -14632 16812 80471 74768 571
12699 571 -55780 -69864 -64452 -26850 9015 56957 102691 107885 149013 182344 70861 -57280
12687 -57280 -51149 13405 -36893 -73760 46279 92138 65834 -16021 -120667 -32804 104418
12676 104418 119199 84631 34290 3166 -43616 -51059 -72309 -94655 -82475 -55390 9857 59040
12664 59040 -7750 -75817 -16208 56593 50847 131668 222132 146527 158550 119937 78156 113725
12652A13725K0537k2477r115m6487r795M2336k4712k4686m5982j07005R6004o950
12640b4607j70520p070N1612l599j5299O5783P7022R74j2111N3448p366j10899
12628a02632k4382N0960L2091o248j0093n0080K8276J12986O7028p3359n0312
12617b5765n2921j4487J09469L8969J6018k9525J568n7018p1932J618N5794K1190
12605g022j02574m819L1669j6611l0439R127K5473k9008n76J132o2071k7863N2168
12592a61414L8394j0535j4454K140n4821M8292M4401l6025l320O2556L7115K4118
12580b3553K4977J7304N8371j2701j18158l635J175n9803J9455O9921P087j2205
12568c1765M4168O1422l9914o4912k1382n8453l4881j7332m6316j1089O0445j2888
$$ plain form
12652 113725 134262 111785 102670 56183 46388 88724 64012 39326 -6656 -113661 -17657 -24607
12640 -24607 -195127 -202197 -150585 -154184 -169483 -103700 -26678 -25704 -37815 15633 8267 -102632
12628 -102632 -127014 -76054 -43963 -50211 -60304 -110384 -82108 30878 97906 24547 -25765
12617 -25765 -78686 -93173 16296 55265 71283 41758 43326 -13692 -85624 -84006 -28212 -7022
12605 -7022 -109596 -114415 -82746 -99357 -129796 -120669 -95196 -124204 -124780 -123648 -185719 -213582 -161414
12592 -161414 -123020 -133555 -148009 -145869 -200690 -152398 -107997 -144022 -147342 -84786 -47671 -23553
12580 -23553 1424 18728 77099 64398 -53760 -57395 -56220 -116023 -96568 -26647 -19560 -31765
12568 -31765 12403 73825 33911 -31001 -52383 -110836 -145717 -163049 -209365 -220454 -160009 -172897
12556a72897O9576J765m8497M7697J5843J0110j6944L9896J9277L9722j226q6035
12544h1713j4109J7937J4768L7986j5702n1686m3312M8548j0193P6030J04648
12533H3202K9440K5043n9854q1762J6743N7641k4141l6206k0294j5163L2737J5865
12521B3251r2531M7296M4351l3723K5038K1783M5418q2551M9740k373m7563J641
12509b23l0596K1947L4784K1962m8189m0434N8251q351L2143J7355l1159L5755
12497F3245P5226o8010q5556l0927O1970M3183m5792m7141K4063J6717o8083k8246
12485h9351N9745O0899l6198n0033O8142O4840k9121j2640p9687m7400n962N7458
12473c9308M6714J1373m0938L9354l391l1516J4580M0740K9117l6703k1918k5954
$$ plain form
12556 -172897 -103321 -101556 -150053 -102356 -86513 -76403 -93347 -53451 -34174 5548 4322 -81713
12544 -81713 -95822 -77885 -63117 -25131 -40833 -92519 -135831 -87283 -97476 -21446 83202
12533 83202 112642 137685 77831 -3931 12812 70453 46312 10106 -10188 -25351 7386 23251
12521 23251 -69280 -21984 22367 -11356 13682 35465 80883 -1668 48072 45699 -1864 -223
12509 -223 -30819 -8872 25912 47874 -315 -40749 17502 9151 41294 58649 27490 63245
12497 63245 138471 70461 -15095 -46022 15948 59131 13339 -33802 -9739 6978 -61105 -89351
12485 -89351 -29606 31293 -4905 -54938 13204 78044 48923 36283 -43404 -90804 -96766 -39308
12473 -39308 7406 18779 -22159 17195 13804 -17712 -3132 37608 66725 30022 8104 -17850
12461a7850l6177j6140N6590J5577l3390M4138L1018L7419k1883l7977J7329q7339
12449d8685m3690l9595N2290O2830j2564m6825J6891L6119Q1674R824j8901j105
12437D8263O0255p790j2265J2000j10143j03452P4165j4829j6102K7302j0179
12426e2775n4433p0581O2340J60772J1808r0049k6154l7230J9719N1709K4649
12415b25j15774j9517j4966J03634M5770o7060N6824o6914j3174L034n6036M1849
12403a02555O6868M5559j2404l7858m2142p2889n5624O4339J00358J14389L5015
12392A03056j3396l3788P02k0372m5313o5706P3577j069l9253n9433K1339J45902
12380F6246J57682O0041j32690n6385q504o2639Q939p210l541r7114q239l4541
$$ plain form
12461 -17850 -54027 -70167 -13577 2000 -31390 12748 43766 81185 59302 21325 38654 -48685
12449 -48685 -92375 -131970 -79680 -16850 -29414 -76239 -59348 -23229 58445 68269 49368 48263
12437 48263 108518 100728 88463 100463 -9680 -113132 -38967 -53796 -69898 -42596 -52775
12426 -52775 -107208 -177789 -115449 45323 57131 -32918 -59072 -96302 -76583 -24874 -225
12415 -225 -115999 -135516 -150482 -46848 -1078 -68138 -11314 -78228 -91402 -88368 -144404 -102555
12403 -102555 -35687 9872 -2532 -40390 -82532 -155421 -211045 -146706 -46348 68041 103056
12392 103056 89660 55872 56574 36202 -9111 -74817 -1240 -2309 -41562 -100995 -79656 66246
12380 66246 223928 283969 151279 94894 86390 23751 32690 25480 21939 -75175 -83414 -117955
12368a17955R0386L8129K3845m811O931K856O5578Q7609n2554r2428m25N3346
12356A00507K1822o6859k6238O173o038o7288k7822K450l4426j7126P570K0862
12344h6413k4927J7206J3913O2612Q080L0401K6276m3470n8226nj9351Q0365J35493
12331A41954m2461j16464k4205J0843j3945K2996n915Q57j3591J4134m1066j9389
12319h6252L1550K3769Q681M3920J7948n6176j3519J12068m249q7957l7173j8047
12307f5437N9774R1354k7369j00008l8652O2436J24574L406m9355J06164l0796
12296A36091j07211K4117j048j7709N945J7211J8879l676o5897J9509Q5645j6455
12284I5401n2993M3443J62m4764j34625p1092j5464j7980M4295Q7207j4871n2493
$$ plain form
12368 -117955 -27569 10560 34405 29594 36525 39381 104959 192568 140014 47586 47161 100507
12356 100507 122329 55470 29232 35405 29367 -37921 -65743 -63293 -97719 -114845 -107275 -86413
12344 -86413 -111340 -94134 -80221 -17609 -9529 20872 47148 3678 -54548 -54553 -73904 6461 141954
12331 141954 99493 -16971 -41176 -30333 -44278 -21282 -27197 -26340 -39931 -25797 -66863 -86252
12319 -86252 -54702 -30933 -22252 21668 39616 -16560 -30079 81989 77740 -10217 -47390 -65437
12307 -65437 -5663 85691 58322 -41686 -80338 -17902 106672 110078 60723 166887 136091
12296 136091 28880 52997 51949 34240 40185 57396 76275 72599 6702 26211 111856 95401
12284 95401 42408 85851 86013 41249 -93376 -164468 -179932 -197912 -153617 -66410 -81281 -133774
12272a33774N5081M115p3999l3600K2258J30951M6089r75o9285L7189L3229J1609
12260B8888L6892l5297j107q142k0365j945l0200k0478N9193J5283L3580j243
12248E5059N852N3752k0342r1481q7184O0442K8599n7709j08213L1241R4749K313
12236c2922j6711r726J1866M366L05K3045K8315J32828l8395j08834N897o425
12224f391j3886j2292j7943l0585j0380L2067N3638K4438m9468K3786J1441n7417
12212e2992k2992k4287j4082M2424n4681O999P5658J04002o998K6171P3075k9070
12200A23227r702O158j53031O9989L1899K0664n0576r087j6996m0366m860m4267
12188g6948N7865m7021J8084K7983K4880p2513K452j6328q1300O5720k5970j7965
$$ plain form
12272 -133774 -78693 -74578 -148577 -182177 -159919 -28968 17121 16146 -53139 -15950 17279 28888
12260 28888 65780 30483 29376 21234 869 -1076 -31276 -51754 7439 22722 56302 55059
12248 55059 60911 114663 94321 2840 -84344 -23902 4697 -53012 -161225 -129984 -35235 -32922
12236 -32922 -49633 -59359 -47493 -43127 -42822 -19777 8538 141366 102971 -5863 34 -6391
12224 -6391 -20277 -32569 -50512 -81097 -91477 -59410 -5772 18666 -30802 -7016 4425 -52992
12212 -52992 -75984 -100271 -114353 -71929 -126610 -119611 -43953 60049 53051 79222 152297 123227
12200 123227 113525 119683 -33348 36641 68540 89204 38628 29541 12545 -27821 -32681 -76948
12188 -76948 -19083 -66104 -48020 -20037 4843 -67670 -65218 -81546 -162846 -97126 -123096 -141061
12176a41061O3108J383M516J05303L6230L863k730k7324K697L0263k2093j22563
12164f8408J4988k4550l7501Q7710N1944q1133l2023k0845K891R3666L5912Q260
12152C0911L5161L4288q1877j5576J7707m6564J272j8551L1183K5466J3970l8101
12140a0711K7155L2609j8073l3721n8885j8164N9329L0904k0903m1751J6929k8311
12128f3593n4470K3227P7834p030m7428O3463L1746r3350Q640M5043M639L4433
12116B3154M7995k3925j8954l3502k0994j2300J5752L2193J2916l4141m2499L2272
12104b2033J8770l32J7754j9272j2509q824m26O7322L3610k5274m5774j8871m6051
12091f1910N5342O6353L7424n7101n7715o2638j2875O53P9012L1862n0996M399
$$ plain form
12176 -141061 -77953 -76570 -72054 33249 69479 73342 70612 43288 45985 76248 54155 -68408
12164 -68408 -53420 -77970 -115471 -27761 24183 -56950 -88973 -109818 -106927 -13261 22651 30911
12152 30911 66072 100360 18483 2907 20614 -25950 -24678 -43229 -12046 13420 27390 -10711
12140 -10711 16444 49053 30980 -2741 -61626 -79790 -20461 10443 -10460 -52211 -35282 -63593
12128 -63593 -118063 -94836 -17002 -24032 -71460 -7997 23749 -69601 -60961 -15918 -11279 23154
12116 23154 71149 47224 28270 -5232 -26226 -38526 -22774 9419 22335 -11806 -54305 -22033
12104 -22033 -3263 -3595 14159 -5113 -17622 -26446 -26872 40450 74060 48786 3012 -15859 -61910
12091 -61910 -6568 59785 97209 40108 -17607 -80245 -93120 -92467 -13455 18407 -32589 -28190
12079b8190n9077n7182J00116P1306l8389o2269n4302J1968J20022P0791K3049
12068I7843p8816o8368N8495J1275q9906k2710N6775O5304Q245J0211P2856r780
12056A11424k5768m1826m437l0941k6164K4508M2025m4699q0664p497R5363l8203
12044b6879k1318J2539k4315P767j6652M4348L6631K0756N1268p5186j33347o050
12032a30438J01899L3290L1382L2139K2915m9340N0401k1786o9082N8089M9970
12021A09439R3342k7272q1750k3479k9984l3884n6114r2340K1762J15255O9717
12010F4692o93p5811o1008m5136K9382K9565j4222j280j5650M4326J33120o9473
11998A7812q5744j7036J6516q769N2146O5618J6816j14238n2679L7909N6200K8689
$$ plain form
12079 -28190 -87267 -144449 -44333 26973 -11416 -73685 -127987 -116019 4003 74794 97843
12068 97843 19027 -49341 9154 20429 -69477 -92187 -35412 29892 38137 48348 121204 111424
12056 111424 85656 43830 39393 8452 -17712 6796 48821 4122 -76542 -84039 11324 -26879
12044 -26879 -48197 -35658 -59973 -52206 -68858 -24510 12121 32877 84145 8959 -124388 -130438
12032 -130438 -28539 4751 36133 68272 91187 41847 92248 70462 1380 59469 109439
12021 109439 202781 175509 93759 70280 40296 6412 -49702 -142042 -120280 -5025 64692
12010 64692 63999 -11812 -72820 -117956 -88574 -59009 -73231 -74511 -90161 -45835 87285 17812
11998 17812 -67932 -84968 -68452 -77221 -25075 40543 57359 -56879 -109558 -71649 -15449 13240
11986A3240j4048m2876l6230q839J3114o037j4581J0231M4118R117j2357N6491
11974A1343k6616n8015m5996n8283p7283L2152R2523N1127Q0384l5100J7181M5342
11962B8759k094n5160j8615p3444j7068R2205N2208j4728l8964N4910N4898P3076
11950A35983q3402m7724Q837R6009m5840p3156k2239j6568J3864L2124L8286P0680
11938A06854n6602n6602n8034m3229n6340K3342J19872J6131L309k9811K4155
11927f955m7947m667J2508p273R6693k4014p4169O1437K6733m5634l0251l9550
11915h3089O3383O9857j639j1389j17274l4218O323R3625P7282r8726l4780P6286
11903E641O5966k0800k6358m0664p6224P4238M7924p302l4857k8862j2254J3829
$$ plain form
11986 13240 -808 -43684 -79914 -88753 -75639 -81676 -96257 -86026 -41908 -32791 -45148 11343
11974 11343 -15273 -73288 -119284 -177567 -254850 -222698 -130175 -79048 1336 -33764 -16583 28759
11962 28759 26665 -28495 -47110 -120554 -137622 -45417 6791 -7937 -46901 8009 62907 135983
11950 135983 52581 4857 13694 109703 63863 -9293 -31532 -48100 -34236 -2112 36174 106854
11938 106854 50252 -6350 -64384 -107613 -163953 -140611 -20739 -4608 -1299 -31110 -6955
11927 -6955 -54902 -59569 -47061 -54334 42359 18345 -55824 5613 32346 -13288 -43539 -83089
11915 -83089 -19706 50151 48512 37123 -80151 -114369 -108046 -14421 62861 -35865 -70645 5641
11903 5641 71607 50807 24449 -16215 -92439 -18201 29723 22421 -12436 -41298 -53552 -39723
11891c9723j1310l0499k9345m3627m3357J2505O5828J33723N6846o5352M5745
11880E1434k9992n885Q2679L0289M4585k3795j5867O3342k4558m2955l1048P439
11868A05668n0277q9993J08226K7177L5964m1770j00576r2274r769L8654L973
11857f4997J7238q6808j8762L2991R5502q101k0011l7118p804P7257P6081m671
11845E0797l1168j4018P9403K7208J8314m9921l0624l7702K2499l8045J07831
11834A04574K0666n1393o2605o2517k3905L7111J19089J06349m9117o2111m9595
11823B6546j4897J06237M1360o9190p0709p0558N7673J9558n0428m1835k9838
11812i6081k5847J2368J02066l6112p0039Q1483r0752o0261K9275j4087k7145
$$ plain form
11891 -39723 -51033 -81532 -110877 -154504 -197861 -185356 -119528 14195 71041 5689 51434
11880 51434 21442 15557 98236 128525 173110 149315 133448 196790 172232 129277 98229 105668
11868 105668 55391 -34602 73624 100801 136765 94995 -5581 -97855 -107624 -68970 -64997
11857 -64997 -47759 -134567 -153329 -120338 -24836 -32937 -52948 -90066 -97870 -20613 55468 50797
11845 50797 19629 5611 85014 112222 130536 80615 49991 12289 34788 -3257 104574
11834 104574 125240 73847 11242 -51275 -75180 -38069 81020 187369 138252 76141 26546
11823 26546 11649 117886 159246 90056 19347 -51211 6462 26020 -24408 -66243 -96081
11812 -96081 -121928 -109560 -7494 -43606 -113645 -32162 -122914 -183175 -153900 -167987 -195132
11801a95132O0402M2760L888M0898Q6739j0870L2604O2362j5085k0301p1805m6916
11789c0456j0844R9446k9100r892J727n7730k7702m782R033L469o4555J2735M357
11776a04294L9794L2654K965j45M1575q9295j5173P1481R052j7777J6117j9741
11764c2787N5756J2450j1462k5028J1769n2732n6368K8189L4767O0199K1029L9132
11752H4914n4756l1203p0733K3811K074R0997O0982Q9699r520j01843p2311k369
11740I742J0719p2314k4746J9399q228M3284r870R888M0983m2342p843J7241r4894
11727a08981L275J9445N9589L6834o2430O2548M012q080P926j4357J1135P600
11715A8516l1718n618J9576p706R0647k5848j16177j11907J4754N7689K2783K346
$$ plain form
11801 -195132 -134730 -91970 -88082 -47184 39555 28685 61289 123651 108566 88265 16460 -30456
11789 -30456 -41300 58146 29046 19154 20881 -36849 -64551 -69333 -60300 -56831 -121386 -108651 -104294
11776 -104294 -64500 -31846 -28881 -29026 12549 -76746 -91919 -20438 -11386 -29163 -13046 -32787
11764 -32787 22969 35419 23957 -1071 10698 -42034 -98402 -70213 -35446 24753 45782 84914
11752 84914 30158 -1045 -71778 -47967 -45893 45104 106086 195785 186265 84422 12111 9742
11740 9742 20461 -51853 -76599 -57200 -65428 -22144 -32014 -22126 18857 -23485 -31328 -14087 -108981
11727 -108981 -105706 -86261 -26672 10162 -52268 10280 14292 6212 14138 -219 10916 18516
11715 18516 -13202 -18820 756 -6950 83697 57849 -58328 -170235 -155481 -97792 -75009 -72663
11703g2663q5800L7208J04464O4197Q3938k7614n3235m1629j06875L7493P9603
11692A9087N2471n8034q8874K3090R8289Q1348j2555o4166n3034L8378J881J598
11680C9479K8254J5140J988J5817p5375j17125p4409O3076r752O8964J11841Q612
11668G6510O783R917m1519r2821j9932m29j1367n1724k5489K6970J03441j065
11656b0725J0668J3530o3011o4953N9257P7129M5305O6995n2666L4106Q127Q420
11644A22182q0530j13886N6108J44370N0672n3816j08720J3115j4584M0131L1777
11633H6819o7429m9300q4588L2001O2480L6401L5298P3170N159j35577k2257m7045
11621g4868K5186J8861Q8964Q2055n9801p101o5318l0174o1966k6520M495J9841
$$ plain form
11703 -72663 -158463 -121255 -16791 47406 131344 103730 50495 8866 -98009 -60516 19087
11692 19087 71558 13524 -75350 -52260 46029 127377 114822 50656 -2378 36000 37881 39479
11680 39479 67733 82873 84861 100678 25303 -91822 -166231 -103155 -112907 -43943 67898 76510
11668 76510 83293 93210 51691 -41130 -61062 -61491 -72858 -124582 -150071 -123101 -19660 -20725
11656 -20725 -10057 3473 -59538 -124491 -65234 11895 57200 124195 71529 105635 113762 122182
11644 122182 41652 -72234 -16126 128244 178916 125100 16380 29495 14911 55042 86819
11633 86819 19390 -29910 -114498 -82497 -20017 16384 51682 124852 130011 -5566 -27823 -74868
11621 -74868 -49682 -30821 58143 140198 80397 73296 7978 -22196 -84162 -110682 -106187 -86346
11609h6346O6073L645j8199l4923o764o938m4796R9038J43634N273p5633j51161
11597a07097o1348O8782N5122Q584j0654n680N1641p215j0238K8909P9349N6030
11585A46185l7343k0295J2513n3105k1484o0793L7682l7831k5891N3977K2871
11574A6486j1693L4274N1349L6225L1152m6920q9091o5539l1033L9129Q1034l243
11562D2130j8233P777M337j05440K6308N7135Q9292O508p6355o1217k6881q670
11550f3309j04382N0970R3848K5823K4610j2299O0643L3905p0132l806M2342j1259
11538F6954p1186k8096M1732J4915p5030M2268P5585Q8536j8307m2671q257n269
11526H1174J1296O749P4558O8994O1343j1999N515P6512R4163K05291K61407L61913
$$ plain form
11609 -86346 -20273 -16628 -34827 -69750 -76514 -83452 -128248 -29210 114424 119697 44064 -107097
11597 -107097 -168445 -99663 -44541 -35957 -46611 -52291 -650 -7865 -18103 10806 90155 146185
11585 146185 108842 88547 101060 47955 26471 -34322 3360 -34471 -60362 -6385 16486
11574 16486 4793 39067 90416 126641 157793 110873 21782 -43757 -74790 -35661 45373 42130
11562 42130 23897 31674 36011 -69429 -43121 14014 103306 109814 33459 -27758 -54639 -63309
11550 -63309 -167691 -116721 -22873 2950 27560 15261 75904 109809 39677 35871 78213 66954
11538 66954 -4232 -32328 9404 24319 -50711 -8443 67142 155678 137371 94700 86443 81174
11526 81174 92470 99219 173777 242771 304114 292115 297630 374142 468305 673596 935003 1296916
11514A296916L09275L40866K48919J73414j08045m74219n42603k76569k18448
11505G49506k47819j56254r3820r6115m7615K470P8969Q6735K8572n6414Q2420
11494C30635o7373j0202J1534k7763k9336J2369M6689j922o1831j10736r7577
11483e513J4651J47171j6708j29529R305R1086P6505O547k8832m1941J9921l6015
11471A06648O4258j9820r444k5437L3568q104o0512N9899J04405m1205q120l2747
11459A63389o4645o6639m0952J1362k2860j2815q557k5862J6291O209m204r474
11447e8757P4509O0913q2049r6896J3600P4490M6588L3000O5289L7390N0115q5376
11435A32816q4434P6001L8259n6278p7663k3164j1145M8466K2911o1365J3247
$$ plain form
11514 1296916 1606191 1947057 2195976 2369390 2261345 1787126 1244523 967954 749506
11505 749506 501687 345433 251613 155498 107883 110353 189322 276057 304629 248215 330635
11494 330635 263262 253060 264594 236831 207495 219864 266553 264631 202800 92064 -5513
11483 -5513 9138 156309 139601 10072 19377 110463 186968 193515 164683 122742 142663 106648
11471 106648 170906 151086 141642 116205 149773 141669 81157 141056 245461 204256 196136 163389
11459 163389 98744 32105 -8847 2515 -20345 -33160 -41717 -67579 -51288 -45079 -49283 -58757
11447 -58757 15752 76665 -5384 -102280 -88680 -14190 32398 65398 130687 168077 218192 132816
11435 132816 48382 124383 162642 106364 28701 5537 -5608 42858 65769 4404 17651
11424A7651l4324j9173J20692j0210k3586L5925N2663J8390m5351o0596m3429
11413H652L410J3851J6318J25242R233K1279p076K6130m153j6844n8020p8123
11401E9899N8609p8270J258N8705o4397l4345J4259L2340k3794P0399L2925l7157
11389I0431K8308M1723N3286m3863l7994p5962J6554l5415L0050M2812m1760m3644
11377B4526P1547O093N0461L2623k8232n437J9073n84k3554k4678K6089M5802
11365A93729q448o5389k9617K8893J1454N0161j3913M1826P884j48539j09471
11354d1430M882Q8078l9928j40004j3286k7153L1205R0920L5282r959N0889n3204
11342b3708k971M6563j977O6245p2520k0063Q0737R3589J7046l737N4298l2692
$$ plain form
11424 17651 -16673 -35846 84846 74636 51050 86975 139638 158028 112677 52081 8652
11413 8652 12062 25913 42231 167473 176706 197985 190909 217039 212886 196042 138022 59899
11401 59899 118508 40238 41496 100201 35804 1459 15718 48058 24264 94663 127588 90431
11389 90431 118739 160462 213748 169885 131891 55929 72483 37068 67118 109930 68170 24526
11377 24526 96073 102166 152627 185250 157018 151581 170654 170070 146516 121838 147927 193729
11365 193729 185281 119892 90275 119168 130622 180783 166870 208696 216580 68041 -41430
11354 -41430 -36548 51530 11602 -128402 -141688 -168841 -137636 -46716 -11434 -21393 29496 -23708
11342 -23708 -26679 19884 17907 84152 11632 -8431 72306 165895 182941 179204 233502 200810
11330B00810n8542N0480Q5156K9306p2527j2947O0897n5853m0481q211J2750m7550
11318A43288L4689J08463N8331L361J27949K05823K00186J35163K38154M14736
11308A670143L20371K07847J24421j25571m12066m42733l49575k15877j87655
11299E89305j66606n1060o4316r09p6885j5843J7598R6082J06504q7940o5465
11288B80465N4167k4302K2779p2217m6123L8103m0416k8102k7328J9627p1122
11277A05531m2759o4468K2886K5571L2335R3433L2119K0589O367m843l5435K5926
11265B17252J792O6157Q5045K6621K9693J3549m2351q6385k7089P2836P8843J4970
11253D50933L0707Q5995P1911R5133R1083K07701R2964M6577k3564l2698L5444
$$ plain form
11330 200810 142268 192748 277904 307210 234683 221736 282633 226780 186299 178088 190838 143288
11318 143288 177977 286440 344771 348132 476081 681904 882090 1017253 1255407 1670143
11308 1670143 1990514 2198361 2322782 2197211 1785145 1342412 992837 776960 589305
11299 589305 422699 371639 307323 306414 229529 213686 231284 327366 433870 345930 280465
11288 280465 334632 310330 333109 260892 214769 252872 212456 184354 157026 176653 105531
11277 105531 62772 -1696 21190 46761 79096 172529 204648 225237 231604 226761 191326 217252
11265 217252 219044 285201 370246 396867 426560 440109 397758 311373 284284 357120 435963 450933
11253 450933 481640 567635 639546 734679 825762 1033463 1126427 1173004 1149440 1116742 1152186
11242A152186l3812p2461m833j34698j04832J9615L6391N1561R8203M607m0055
11231I71872j957m2195L4726K6187r8974j8107M455l9625j7231k6736m3626n7180
11219F91609q3387o9736J6799M1106o6167o5723R0720L0076o4653K8534l0287
11208E18891O0049K2795l3825k9371n5739j081n1585l8600O5625j2227p0636J6471
11196C90767p270M4935J6063L2855M4056O7508l1269r362j5581m865m8789K9241
11184E08289j5931N8864P0679N4159l4349K8801K2039n051R3185J01249K5644
11173I07578n8935L6770J39976J69496K67680L10892L64646M62927M10610J80490
11163C192130L1461l7241l21273m94380k96813k04187j11588q3286J8049J40224
$$ plain form
11242 1152186 1118374 1045913 1041080 906382 801550 821165 857556 909117 1007320 1011927 971872
11231 971872 969915 927720 962446 988633 889659 871552 876007 836382 819151 792415 748789 691609
11219 691609 608222 538486 555285 596391 530224 464501 555221 585297 520644 549178 518891
11208 518891 578940 601735 567910 538539 482800 481719 430134 391534 457159 444932 374296 390767
11196 390767 383497 428432 444495 477350 521406 588914 557645 548283 532702 527837 479048 508289
11184 508289 492358 551222 621901 676060 641711 670512 692551 687500 780685 881934 907578
11173 907578 848643 885413 1025389 1194885 1462565 1773457 2138103 2601030 3011640 3192130
11163 3192130 3223591 3186350 2865077 2370697 2073884 1869697 1758109 1674823 1692872 1833096
11153A833096J01103L331J8590P5734j585R5095R9440O7869J07712K12740J56613
11142B769738K21593J65652J61874J10441K59873K92708L15182K20460J61997
11133D679518K57013M30003N05680O11425P38676Q35138R57645J216228J327418
11124A1558744J463184J542474J578510J642174K048826K584459K963067L115160
11116B8496598L749338M832207O131683Q043085J1103025J5322309K1647107L2124722
11108A31450074M7479177O5735754P7557683O5353787L3244632P292141l1005184
11101C97108064r3738113j00817252o4058132l6614422k1859025j3655720q805084
11094E7560316n754619l775867k553370j862565j490521j258000j209138j076180
$$ plain form
11153 1833096 1934199 1937530 1956120 2031854 2030269 2125364 2224804 2292673 2400385 2613125 2769738
11142 2769738 2991331 3156983 3318857 3429298 3689171 3981879 4297061 4517521 4679518
11133 4679518 4936531 5366534 5872214 6483639 7222315 8057453 9015098 10231326 11558744
11124 11558744 13021928 14564402 16142912 17785086 19833912 22418371 25381438 28496598
11116 28496598 32245936 37078143 43209826 51252911 62355936 77678245 99325352 131450074
11108 131450074 178929251 244665005 322222688 387576475 420821107 428113248 397108064
11101 397108064 303369951 202552699 138494567 101880145 80021120 66365400 57560316
11094 57560316 51805697 48029830 45476460 43613895 42123374 40865374 39656236 38580056
11086C8580056o73372m76650k58737P6467J13086K7718k66297p57197j133803
11077C5231271j157114j220559j405640j452840j683884j642909j434921j168899
11069B4064505j039501r09525q20823o36724o09613o67264n60717m46198n06378
11060A7867762m35083l97908l84953n29693m68219k69507m20262l80136l59143
11051A4222858k64651k08285j24569j21411q4064j53979j93403j83924m3355K8665
11041A2873882j59815r0086k23929j69798j83474k05699j85918j64085N314p0631
11031A1425761j36786j53395n4646K2749n0748q1330n3808j13824q1398q3896
11021A0638679M0727R4626J08943R2576J08773r6343j51575l23673l07856k31088
$$ plain form
11086 38580056 37906684 37430034 37171297 37247764 37360850 37388568 37122271 36365074 35231271
11077 35231271 34074157 32853598 31447958 29995118 28311234 26668325 25233404 24064505
11069 24064505 23025004 22115479 21294656 20657932 20048319 19381055 18820338 18374140 17867762
11060 17867762 17432679 17034771 16649818 16120125 15651906 15382399 14962137 14582001 14222858
11051 14222858 13958207 13749922 13625353 13503942 13419878 13265899 13072496 12888572 12845217 12873882
11041 12873882 12714067 12623981 12400052 12230254 12046780 11841081 11655163 11491078 11496392 11425761
11031 11425761 11288975 11135580 11080934 11103683 11052935 10971605 10917797 10803973 10722575 10638679
11021 10638679 10679406 10774032 10882975 10975551 11084324 10987981 10836406 10512733 10204877 9973789
11011I973789k82518j74799k69184k56666k68414k78750k60142l42824l44463
11002G496029l79891k44115j18734j75404k03984l20202j22665j07785j57376
10993E665873j27238j37557j01915j43880k10625r5454j2405r1975j93185j36527
10983D415112j59466j49012q9438J5691J2330L6166q5865j29202q0835m2426o1933
10972C681122j02333p4823p558P0464p2567j88498p5221n625j71176j73033o9340
10961B811412K9484O1018l2747q7057K182P7956L3999N8520J3884l2674M476j1559
10949B928894r975k6018l1321n3312P4001J42711N0239M6728J6490J884N3811
10938C194132J72209K28066K30258J90928O0200J08317K22746K69636L54662M14507
$$ plain form
11011 9973789 9691271 9516472 9247288 8990622 8722208 8443458 8183316 7840492 7496029
11002 7496029 7116138 6872023 6753289 6577885 6373901 6053699 5931034 5823249 5665873
10993 5665873 5538635 5401078 5299163 5155283 4944658 4849204 4836799 4744824 4551639 4415112
10983 4415112 4255646 4106634 4017196 4032887 4045217 4081383 3995518 3866316 3785481 3743055 3681122
10972 3681122 3578789 3503966 3496408 3566872 3494305 3305807 3230586 3224961 3053785 2880752 2811412
10961 2811412 2840896 2901914 2869167 2782110 2784292 2862248 2896247 2954767 2968651 2935977 2940453 2928894
10949 2928894 2918919 2892901 2861580 2808268 2882269 3024980 3075219 3121947 3138437 3140321 3194132
10938 3194132 3366341 3594407 3824665 4015593 4075793 4184110 4406856 4676492 5031154 5445661
10928E445661L63790M08225N95461N99386P89367R57595J276903J339488J336799
10919A3112675J261648J200432Q59381P55611J320374K071358K902923L709584
10911B7193986M617043N408566O775804Q482992J0931367J4997726K1391542L1380624
10903A31179650M5959253O3749764P5761141O5188184L4054959Q302813k7551322
10896C96644442q8777188r9810217o4928573l7372964k2406713j4190450r170067
10889E9988270o180285m310018l135593k435409k076276j860167j225937o49004
10881C8115581O3913Q70289J362537J493122J225882N75407m70517j425000j974527
10872C9836687k300180k163454j862636j777540j771721j682022j544006j312572
$$ plain form
10928 5445661 5809451 6217676 6813137 7412523 8201890 9159485 10436388 11775876 13112675
10919 13112675 14374323 15574755 16434136 17189747 18510121 20581479 23484402 27193986
10911 27193986 31811029 37219595 43995399 52478391 63409758 78407484 99799026 131179650
10903 131179650 177138903 240888667 316649808 381837992 415892951 424195764 396644442
10896 396644442 307867254 208057037 143128464 105755500 83348787 69158337 59988270
10889 59988270 53807985 49497967 46362374 43926965 41850689 39990522 38764585 38115581
10881 38115581 38179494 39049783 40412320 41905442 43131324 43706731 43236214 41811214 39836687
10872 39836687 37536507 35373053 33510417 31732877 29961156 28279134 26735128 25422556
10864B5422556j137251j015778r14003p45982n82590m96361l71987m73987n05688
10855A9178929n04947n92387m43512l94639m73988m11038m62633l77216l33795
10846A5184774k39229k77244l73334l26401k39434j66676j35703j82377l07154
10837A2937222k84979j25548q1941k21648j43593j26760j19261j33474j45857
10828A1554161j04114j82127j60085o1934k7137j41421j21886p0107j18053l3605
10818A0533692l2226o5025L1161P8302J99219J40208O0662m8688j09210k89154
10808A0498941l11210j87395k92751m43588k24577k22691k82550k29535k51279
10799H053365k45872k82951l16676k69494k00653k01052k58176j96135j84625
$$ plain form
10864 25422556 24285305 23269527 22355524 21609542 21026952 20530591 20158604 19684617 19178929
10855 19178929 18673982 18081595 17638083 17243444 16769456 16358418 15895785 15518569 15184774
10846 15184774 14945545 14668301 14294967 13968566 13729132 13562456 13426753 13244376 12937222
10837 12937222 12652243 12526695 12444754 12223106 12079513 11952753 11833492 11700018 11554161
10828 11554161 11450047 11267920 11107835 11045901 11018764 10877343 10755457 10685350 10567297 10533692
10818 10533692 10501466 10436441 10467602 10545904 10745123 10885331 10945993 10897305 10788095 10498941
10808 10498941 10187731 10000336 9707585 9263997 9039420 8816729 8534179 8304644 8053365
10799 8053365 7807493 7524542 7207866 6938372 6737719 6536667 6278491 6082356 5897731
10790E897731j90778j03233j32215j43677j63920j59133j35996j38088j45731
10781D584960j25865j96858j28067N119k6444p0024j42685j37752o6113m8162
10771C648109j06965r3127m6235m4773L392N841o9839n8887p012k04831k13162
10760B812511p1161j48244k09455p4778r1972j34781l1626N7905n1216j91407
10750A865776n9098K3054l7105J5900k1385r2043j8891j5422n5050l7260m5081
10739A523395p3370o5325o3878m082q0902l9896k0471L0742l5265j61205o8358
10728I41385k3418n1938m8038l4981r1229l493J0890q27l9881j3039k8290O1022
10716F78163l7077j03201J17686J3260l859N3745r7418o1400K0254K1904r109
$$ plain form
10790 5897731 5706953 5603720 5471505 5327828 5163908 5004775 4868779 4730691 4584960
10781 4584960 4459095 4262237 4134170 4139289 4112845 4042821 3900136 3762384 3696271 3648109
10771 3648109 3541144 3448017 3401782 3357009 3360401 3366242 3296403 3237516 3230504 3025673 2812511
10760 2812511 2741350 2593106 2383651 2308873 2216901 2082120 2050494 2108399 2057183 1865776
10750 1865776 1806678 1829732 1792627 1808527 1787142 1695099 1676208 1660786 1605736 1568476 1523395
10739 1523395 1450025 1384700 1320822 1316740 1235838 1195942 1175471 1206213 1170948 1009743 941385
10728 941385 917967 866029 817991 783010 691781 688288 699178 698351 658470 645431 617141 678163
10716 678163 641086 537885 655571 668831 664972 718717 621299 559899 580153 602057 592948
10705E92948j50620r4801J10610J09092J35310J73584O4539R5278J23709J49236
10695A308885K62272K90262M09812M50155K24374J6110j35796l59519m64557l70531
10685A631467l27927k34370j32010j28071N1151Q4135Q000O8819K5940J0000O1856
10674A118990l7891j17738K2932M3251N1579n0171K2119P6178K5793o8392L421
10663A090071K2470l0131m2954K087P3191L6058n9316m770l6228m8957o9145o796
10651I25580J28761O1474j0033j3588m209l6630O9086J3860k4489k9491j37848
10640I42473q7978k9140j7041O8789l8127o3015L8415l1479L2287r3249r4049
10629F27886l3055j9319n674L1167K0961P4359M925m8649p261N3959j3510j0560
$$ plain form
10705 592948 442328 347527 458137 567229 702539 876123 940662 1035940 1159649 1308885
10695 1308885 1571157 1861419 2271231 2721386 2945760 2961870 2826074 2466555 2001998 1631467
10685 1631467 1303540 1069170 937160 809089 860240 944375 952375 1021194 1047134 1057134 1118990
10674 1118990 1081099 963361 986293 1029544 1081123 1030952 1053071 1129249 1155042 1086650 1090071
10663 1090071 1112541 1082410 1039456 1041543 1114734 1150792 1091476 1086706 1050478 1001521 932376 925580
10651 925580 1054341 1115815 1105782 1092194 1087985 1051355 1120441 1134301 1109812 1080321 942473
10640 942473 854495 825355 808314 877103 838976 775961 814376 782897 815184 721935 627886
10629 627886 594831 575512 569838 601005 621966 696325 701250 652601 645340 699299 685789 675229
10617F75229J6119K3503j40925r756k9374O0222J4714r374O0109m0166j46595
10606D73706N123M5590o6485j05655p4802L16M9112J7304o3257l7584R926m0556
10594B12738o7962K0645J12158R1261J8748n942l654q0981l7142l6084q260N8749
10582B74274q9087j32551j904O0560J06428M6212l625n0547N310K3k9261O8593
10570B54425K2672r4775j06666P9759K7131P2323l6317L9523J3776Q2420N7595
10559D11866N8772n6358n1315J7075o5854j21212p1511k3745P9219j8711L6101
10548A94327j9842P3732L0603l9484k6506L5754J1686m0872O8101J7476k6645
10537B78330l5839o8974K6214L1974J76778j5696j4030K18J825r3487j00739J10755
$$ plain form
10617 675229 691348 714851 573926 564170 534796 595018 609732 600358 660467 620301 473706
10606 473706 478829 524419 457934 352279 277477 277793 326905 344209 280952 243368 253294 212738
10594 212738 144776 165421 277579 368840 387588 381646 377992 297011 259869 223785 215525 274274
10582 274274 185187 52636 50732 111292 217720 263932 260307 209760 215070 215093 185832 254425
10570 254425 277097 182322 75656 155415 182546 254869 218552 258075 271851 354271 411866
10559 411866 470638 414280 362965 380040 314186 192974 121463 97718 176937 158226 194327
10548 194327 174485 248217 278820 239336 212830 248584 260270 219398 287499 304975 278330
10537 278330 242491 173517 199731 231705 408483 392787 378757 378975 380800 287313 186574 297329
10525B97329R4466o8166p9174l6738m9915P972Q3448r0956J0452O0293j0694M6832
10513B65149k9030q891N8911P1489M0871m6245K4550m3534r3298j9270K9563J19623
10501C69888R1314M2734J8390k6108K8602r741L0392P4205J23477Q0253J16432
10490I39838K56585K74901K92551L22076J82800J08339o7072k78562n10821m29956
10480A090679k43384p129j32546j71195O334n0429J8531J9087J2086q9023q8692
10469C64319R232Q0494K8424K5502j27866l7180L1153O6839K9077k6033K112O5526
10457E11599j1367k4416k2315j632L140N0590o4864j06890L3483R9628R68K2402
10445D90326j1316l2247j418p2423r2677l1298n643j9339m998j6617k4429n207
$$ plain form
10525 297329 391795 323629 244455 207717 157802 165774 249222 158266 168718 229011 218317 265149
10513 265149 236119 227228 286139 357628 398499 352254 376804 333270 239972 220702 250265 369888
10501 369888 461202 503936 522326 496218 524820 515079 545471 619676 743153 823406 939838
10490 939838 1196423 1471324 1763875 2085951 2268751 2377090 2310018 2031456 1520635 1090679
10480 1090679 847295 840166 707620 536425 542759 492330 510861 529948 542034 453011 364319
10469 364319 373551 454045 482469 507971 380105 342925 374078 440917 469994 443961 446073 511599
10457 511599 500232 475816 453501 451869 455009 505599 440735 333845 367328 466956 467924 490326
10445 490326 479010 446763 445345 372922 280245 248947 243304 223965 218967 202350 177921 172714
10433A72714q718j03515n0679J25278Q6449l9073J5827N1860M0390q3877j9447
10422A87209k5241N482m4503M8029J01008l9255p922j0301l7167k5064o716J09111
10410B54670M9134k3110L2974K404j8198r7786N4365K7810l7435q0015n5126J2424
10398A22111J1075L5936j0629l1847J4273j5208m9028M2158K8128k8913m1362
10387G6694M888n4710q104j0818N6435Q7453M4067Q8168j7924o0596L606J8347
10375B27506k3450j00657N016J08449N7243r9964J3519J9460j37984J4332Q4074
10364A67544j393L5905l1847K4784m66r4882k6908M6045P7500n8391k5669l2223
10352G9999K4243N2770j73k349K0656m0880j5200J16614J37034N1552p5044J4889
$$ plain form
10433 172714 163996 60481 9802 135080 221529 182456 198283 250143 290533 206656 187209
10422 187209 161968 167450 122947 170976 271984 232729 224807 214506 177339 152275 145559 254670
10410 254670 303804 280694 313668 316072 297874 200088 254453 282263 244828 164813 109687 122111
10398 122111 133186 169122 158493 126646 140919 125711 76683 118841 146969 118056 76694
10387 76694 81582 26872 18768 7950 64385 151838 195905 284073 266149 205553 209159 227506
10375 227506 204056 103399 108415 216864 274107 174143 187662 207122 69138 83470 167544
10364 167544 166151 202056 170209 194993 194527 99645 72737 118782 196282 137891 112222 79999
10352 79999 104242 157012 156839 154490 175146 134266 119066 235680 372714 424266 349222 364111
10340C64111O8823J2987j40967J3141J02852l0270n7031q683o4644J3612o5967
10329B07964j20755r846J2307Q5235N1114k9465m6475j2439j0541J7353M6815
10318A91267M3872q5761n4329K2674j8197L9823k5975p2127k5738m3768O5789
10307C7530J04665J1805l8360o7569L13N4062K6329j4763j4279Q268j7335j7806
10295G2860K9568L3300k1982m5245n4241J9080j5711Q524J51801L1889j04206
10284A05637m5341L0473J8507J5711O0039o553p9793l0149q820j6688J7979O8686
10272A29688r1455p9620k1976l6910p666N5506l2854P3321P3216P1697R561l8854
10260A03654K7533Q33J4876K0630q160n8430o7385k6213N1815n2871m4074j5582
$$ plain form
10340 364111 432934 445921 304954 318095 420947 390677 333646 324963 260319 273931 207964
10329 207964 87209 77363 89670 174905 226019 196554 150079 137640 127099 144452 191267
10318 191267 235139 149378 95049 117723 99526 139349 113374 41247 15509 -28259 37530
10307 37530 142195 154000 115640 48071 48384 102446 128775 114012 99733 108001 90666 72860
10295 72860 102428 135728 113746 68501 14260 33340 17629 26153 177954 209843 105637
10284 105637 60296 90769 109276 124987 185026 178473 98680 68531 59711 43023 61002 129688
10272 129688 38233 -41387 -63363 -100273 -107939 -52433 -85287 -11966 61250 132947 142508 103654
10260 103654 131187 132020 146896 167526 159366 100936 33551 7338 59153 6282 -37792 -53374
10248e3374O9206n8251o96K6597O2163K221P7119K122m9825j8820K858M9758O7900
10235A78978k4158j6701j03454j3731m8429J4261Q1865K2478M0839j9602m2416
10224F9930K2249Q9002q4902j00952P7054R7230K333n8881j27092M2601L7908
10213F6480m6126L2977J7174J4867K358R239j1249m8935o0622k0244P5893N3843
10201H5655M4488o9677r560j0865j0369n2770p1053N1162R9873O891J8717j6056
10189F6436k730j0731k9849Q046o1566J6364p008L6986n5935o0730N334P3717
10177b1666K0752N983m0771j7248R0216O5227N717k8100M1759K5744j6927l1510
10165I9176m2596o532L2516L7919l109k8242l7677l5641k4150j1085M2561n0304
$$ plain form
10248 -53374 15832 -42419 -43115 -16518 45645 47866 124985 127107 77282 58462 61320 111078 178978
10235 178978 154820 138119 34665 20934 -27495 -13234 68631 91109 131948 112346 69930
10224 69930 92179 181181 96279 -4673 72381 169611 171944 113063 -14029 28572 66480
10213 66480 20354 53331 70505 85372 87730 96969 85720 36785 -23837 -44081 31812 85655
10201 85655 130143 60466 50906 40041 29672 -23098 -94151 -42989 56884 63775 82492 66436
10189 66436 63706 52975 23126 31172 -30394 -14030 -21038 15948 -39987 -100717 -95383 -21666
10177 -21666 -914 5069 -35702 -52950 37266 102493 108210 80110 121869 147613 130686 99176
10165 99176 56580 50048 82564 120483 117374 89132 51455 15814 -8336 -19421 23140 -27164
10153b7164m3189O4859Q7767M057o00L2131Q6747P343M0470o8521n4174l4198
10141I5528j5852o3969o9883m1054L5007O5961L8173L6730M7980o0013k8628O7068
10129A07048M6152l9570n1988O1221j5710l0241J5510k2469K9314l1298p2076
10118d107n8055O5061m1194k7211M4075J36182N8309l7453p283M2278j640p0171
10106I8791N0453L3715r6744r3541j7880r3482O3240P7826P4171l7197J3330R3
10094G2775k0554o4684O2411M5970J9126J4117K0019n2628j4032q9701k9111M5246
10082H954M899N4987N7346p7780j716J3907j2087R326K1083o8201m6569R214j1278
10069c7915N8024L1186n6711p681N1383Q8760l1986K3584O6885j4285p5269j6348
$$ plain form
10153 -27164 -70353 -5494 82273 86330 85730 117861 204608 211951 252421 183900 129726 95528
10141 95528 79676 15707 -54176 -95230 -60223 5738 43911 80641 128621 68608 39980 107048
10129 107048 153200 113630 61642 122863 107153 76912 92422 69953 99267 67969 -4107
10118 -4107 -62162 2899 -38295 -65506 -21431 114751 173060 135607 128324 170602 168962 98791
10106 98791 149244 182959 86215 -7326 -25206 -118688 -55448 22378 96549 59352 72682 72775
10094 72775 52221 -12463 49948 95918 115044 129161 149180 96552 82520 -7181 -36292 8954
10082 8954 13853 68840 126186 48406 46690 60597 48510 57836 78919 10718 -35851 -26637 -37915
10069 -37915 20109 51295 -5416 -13097 38286 127046 95060 118644 185529 171244 95975 79627
10057G9627K6082J4030l9184k8234J8223j4022m6225L6427j06920O982Q3769p226
10045B3329k7965n589j4980R2905O1867k3067o5412m6955J942k519M9016O5774
10033A08346P827r1161K1484P9611J0021m8882k0797j8696j1708o1023J9535J6927
10021A1484K53O160L0638p330l6367O8915m329n1934m9588K1913L3869L314K3479
10008E0477M2413O3251K9239p1229p9438k6021j3658K2753N3363j6624J6043k1959
9996D8610M739p1305o7661J11689O8785o7725k0091N3764p914j10101n0120j399
9984a08729N0465n7178J8955N6291l1768K7358M1731N9205P3622o0291j57813
9973h8152l9161o383r3687L5115J8142N3680o6469l3495P1036J00365J1267k877
$$ plain form
10057 79627 105709 119739 80555 52321 70544 56522 10297 46724 -60196 -53214 30555 23329
10045 23329 -4636 -10225 -25205 67700 129567 106500 41088 -5867 -3925 -6444 42572 108346
10033 108346 116173 25012 46496 126107 136128 87246 66449 47753 36045 -24978 -5443 11484
10021 11484 11737 17897 48535 41205 4838 73753 69424 17490 -32098 -10185 23684 26998 50477
10008 50477 92890 156141 185380 114151 34713 8692 -4966 17787 71150 54526 70569 48610
9996 48610 53349 -17956 -85617 26072 94857 27132 7041 60805 52891 -57210 -107330 -108729
9984 -108729 -58264 -115442 -96487 -40196 -71964 -44606 -2875 56330 129952 69661 -88152
9973 -88152 -127313 -133696 -227383 -192268 -174126 -120446 -186915 -220410 -149374 -49009 -37742 -40619
9961d0619j5338j5237K8034r1072n288J4692K7603M1241Q9891M1642m6967j00288
9949g1706N8969k8980j6002p338o0811P635N6144M9952n6703p7824M9743n31O7445
9936c0007O7942J2314K2123O3228K1521q7433m0355n9356k0521P7767n0407k0749
9924d3933j6571j7657o6108O0648q0139P4765Q3108L0611K3881k8071N722p5121
9912d8865j02124M5247J06732J796N9774O7956p5050l9452J3845L4721k2498k519
9900C9563P2805P6121j0555n6450j2818O7119J001j4785N0994j8647n4544L702
9888A43506n910q7666p8320j1387q1670o3718Q0870Q8455J09298N8874q6001p2322
9876e991L258O5544P592l0668m9621N6054q6719n8800J04985J6864l117m7228
$$ plain form
9961 -40619 -55957 -71194 -43160 -134232 -139520 -124828 -97225 -55984 33907 75549 28582 -71706
9949 -71706 -12737 -41717 -57719 -65057 -125868 -118233 -62089 -12137 -68840 -146664 -96921 -97452 -30007
9936 -30007 37935 50249 72372 135600 157121 69688 29333 -30023 -50544 27223 -23184 -43933
9924 -43933 -60504 -78161 -144269 -83621 -163760 -88995 -5887 24724 48605 20534 26256 -48865
9912 -48865 -150989 -105742 990 2786 62560 130516 55466 16014 29859 64580 42082 39563
9900 39563 112368 188489 177934 121484 108666 175785 176786 162001 212995 194348 139804 143506
9888 143506 137596 49930 -28390 -39777 -121447 -185165 -104295 -15840 93458 152332 66331 -5991
9876 -5991 -2733 62811 70403 39735 -9886 46168 -40551 -99351 5634 22498 19381 -27847
9864b7847n0871n955O1576N5841L5461p1192K6913N2423k1316L3048m8272M6319
9852H6128L7746m1958l3386N0583J5965j5315L7046N2381j7477N684m0138q5794
9840E1465j36851j6138K9284O92N389q998j7758P8076L7009m3712r556M8797o341
9827A1358M0603l220o0498l8494k2038M3327N3162j582j12832L7828Q0273R1364
9815A19251o593J3893q191M6977N3691n9590p9763Q832J2525O3656J242l2314
9803A33616J4687n0038R70L0132k84K3322j63407j06895N3712O8569l9139R635
9791b5120Q8210L3782m8865L8279O8002m0477k6172k3716j03021j5348N3840o3161
9779f3767Q62J5277K4665J0676o4800p2884j7066r405k2182M4934M985N0222R3145
$$ plain form
9864 -27847 -78718 -84673 -23097 32744 68205 -2987 23926 76349 55033 88081 39809 86128
9852 86128 123874 81916 48530 99113 115078 99763 136809 189190 171713 177397 137259 51465
9840 51465 -85386 -101524 -72240 -71548 -66159 -75157 -92915 -14839 22170 -21542 -31098 17699 11358
9827 11358 51961 48741 -11757 -50251 -72289 -28962 24200 22618 -90214 -52386 27887 119251
9815 119251 112658 126551 118360 165337 219028 159438 79675 88507 101032 164688 165930 133616
9803 133616 148303 98265 99235 129367 129083 152405 -11002 -117897 -64185 4384 -34755 -25120
9791 -25120 63090 96872 48007 86286 154288 113811 87639 63923 -39098 -54446 -606 -63767
9779 -63767 -62905 -47628 -22963 -12287 -77087 -149971 -167037 -176442 -198624 -153690 -148705 -98483 -5338
9766e338J3169L9723m474K0125L6783M1939r2017M5662L1958p0368p3634Q9833
9754G3361J5464q9076n6303O1679J1133k9643M5917J27289k9143l4023p1517r2792
9742f7654N7994L7352M003o6790l2731m5390O1082P6940M6919p6331l4942o304
9730d5852O2347P549K1147k4980n4923Q8475M8531n7874o0873M2885K9456K770
9718E8658p9755Q074K4119K7240l882r2987j04589N427N7438J01466O747j4359
9706f403M8393m6566O6554J1447K0377o1462o9524L1649J4814j7141m4000J9289
9694c2573J6176l7480J17950O6678l9867n6787q307M675J7087J3649p0039n9018
9682f7856n2990L4005J5870L9835M1131J6448n0528N058P3151N675p8180P695
$$ plain form
9766 -5338 7831 47554 43080 63205 99988 141927 49910 95572 127530 57162 -16472 73361
9754 73361 88825 -251 -56554 5125 16258 -13385 32532 159821 130678 96655 25138 -67654
9742 -67654 -9660 27692 31695 -35095 -67826 -113216 -52134 24806 71725 -4606 -39548 -45852
9730 -45852 16495 24044 45191 20211 -34712 53763 102294 44420 -16453 26432 55888 58658
9718 58658 -21097 -13023 11096 38336 34454 -58533 -163122 -157695 -100257 1209 7956 -6403
9706 -6403 41990 -4576 61978 73425 93802 32340 -37184 -5535 9279 -7862 -51862 -32573
9694 -32573 -16397 -53877 64073 130751 90884 34097 25790 30465 47552 61201 -8838 -67856
9682 -67856 -120846 -86841 -70971 -31136 9995 26443 -24085 -19027 54124 59799 -18381 -10686
9670a0686n5229m926K2278n6914R244M6639L3377k8186N3640q905k8206P9315
9658E1441j3732q7383l3290J2149K4304J06105J02356n346j00121o1963l123M06
9646h197K5909m395o4799o0262L4174N8772n6455q339O3620k4499j6827J03522
9634D2224L4386l3984J2317O2388o4308n186q608L1834J0721l3921m1378o6484
9622e9999j4331o072N9083L4375k8235L0421o4826m2579M8693Q81L6685M3558
9610C7654n2320K6356L8622j658r4732k5110Q0201P8727M8778j0864l0276j7804
9598G7574K1018L4253L9522m4075m1432n682n1684L5414p0395j7503J20919Q6976
9586A84905M8062n6183j60772n8033K800O5932j4643K1479k6581l9540L169j1798
$$ plain form
9670 -10686 -65915 -70841 -48563 -105477 -96233 -49594 -16217 -44403 9237 332 -27874 51441
9658 51441 37709 -49674 -82964 -70815 -46511 59594 161950 156604 56483 -5480 -8603 -8197
9646 -8197 17712 13317 -51482 -111744 -77570 -18798 -75253 -83592 -19972 -44471 -61298 42224
9634 42224 76610 42626 54943 117331 53023 47837 39229 71063 81784 47863 6485 -59999
9622 -59999 -74330 -80402 -21319 13056 -15179 15242 -49584 -92163 -43470 -42589 -5904 37654
9610 37654 -14666 11690 50312 48654 -46078 -71188 9013 87740 136518 125654 95378 77574
9598 77574 98592 132845 172367 128292 86860 81178 29494 64908 -5487 -22990 97929 184905
9586 184905 232967 176784 16012 -42021 -39221 26711 12068 33547 6966 -32574 -29405 -41203
9574d1203K628K8083K5088J4416P374o9127K3262K2049Q1801j14744o7300J8962
9562f8711K2450R1929P51p6206m7287L7884J3156p070J7432M0333k8121k8306
9550c1766K9773R1168Q660n167l2527l6226K8583j4833n3757l3390r432J25416
9538F6502O8758p8423m073J8540l6884O216Q3896p0846j01063j5787M1522O0431
9526C8789k0309j908q1880K0050P6735M3406N973l0713j5992M7055n3533p3158
9514d5485k5661n9196J7037O4315J17756M2593l1751o7020k6149J31869K4973
9503A43281q0036j19518o8950n3752M8771l121N9269P8195M9389P988l4796K6
9491B6746O5007L4296j06962j42310j7316M7335N616k4689L7052Q3042k0740J2426
$$ plain form
9574 -41203 -38575 -10492 14596 29012 36386 -32741 -9479 12570 94371 -20373 -87673 -68711
9562 -68711 -46261 45668 46419 -29787 -77074 -39190 -26034 -33104 -15672 24661 -3460 -31766
9550 -31766 -1993 89175 97835 92668 60141 23915 52498 37665 -16092 -49482 -58914 66502
9538 66502 135260 56837 52764 71304 34420 40636 124532 53686 -47377 -63164 -21642 38789
9526 38789 18480 16572 -65308 -45258 31477 74883 80856 50143 34151 81206 27673 -45485
9514 -45485 -71146 -130342 -113305 -48990 68766 111359 79608 12588 -13561 118308 143281
9503 143281 63245 -56273 -125223 -178975 -130204 -133325 -74056 4139 53528 61516 26720 26746
9491 26746 91753 126049 19087 -123223 -140539 -93204 -87588 -112277 -75225 7817 -12923 -497
9479d97J4418N8907l6022k9437O5329p507m9913K9352K7787j2049P9656P0097
9467B10121m5180q2983l3985j7147J7734k6455l5380k1890L9790L9466o3535J2563
9455f881j1957L8094J14880k7841j02381l7349j5097n5450k4599P2228K1147L4067
9443a139N1590M9659K5435m3838k2409J5791r6005k9473L683k6549O5073M247
9431c935p800K3265n3585j560J5215O8068L080j55945O6209L7572p781L7524o471
9418A3856J5664K934p1405j21605L5605J08843j4842l3006j1989j4129P2769Q963
9406h342m7584j0407M5487Q049N2920N0871k5605m4966q0372N2385J24973j3103
9394A04306j43776m8011l6665M1686L0169n0166J3714l4839N9872O2900O073P066
$$ plain form
9479 -497 13921 72828 36806 7369 72698 65191 15278 44630 72417 60368 140024 210121
9467 210121 164941 81958 47973 30826 48560 22105 -13275 -35165 4625 44091 -19444 -6881
9455 -6881 -18838 19256 134136 106295 3914 -33435 -48532 -103982 -128581 -56353 -35206 -1139
9443 -1139 50451 100110 125545 81707 59298 75089 -20916 -50389 -46706 -73255 -8182 -3935
9431 -3935 -11735 11530 -42055 -43615 -28400 39668 42748 -113197 -46988 -9416 -17197 20327 13856
9418 13856 29520 32454 -38951 -160556 -124951 -16108 -30950 -63956 -75945 -90074 -17305 -8342
9406 -8342 -55926 -66333 -20846 -12797 40123 90994 65389 20423 -59949 -7564 117409 104306
9394 104306 -39470 -87481 -124146 -82460 -52291 -102457 -88743 -123582 -63710 -810 5263 12329
9382A2329J9460m7428r9814L2313J44763M3859l5095M106n5134k352k3233L001
9370c225J8646q682m6212m7618q5933q2224r494Q4709P0120L1014K1500m1774
9358i9173O0202M7608M9644K334m274L3758m63J3472J0163l8719o6230n8988M6225
9345d441L6778q9115j7505N5343P1184M609l0439q40l3990j1175p63Q4125j1987
9332E1784m1360M4620j3720n823q378l945L0928n9861p4055p5994N7982L7909
9320e9913l0831J15740J6222p9834m0191k536K4445P5734Q8212j05644l7130N6283
9308B0557p4734m5212L2838M503l805O4527k4226m7391j748O4025l6529J0960
9296c6235J14667K5586k2397J8479O5436n575l7779j15978j3259R6109k571K4780
$$ plain form
9382 12329 31789 -15639 -115453 -83140 61623 105482 70387 74493 19359 17007 -6226 -3225
9370 -3225 15421 6739 -39473 -87091 -173024 -255248 -264742 -180033 -109913 -78899 -57399 -99173
9358 -99173 -38971 8637 58281 60615 56341 90099 89636 103108 113271 74552 8322 -50666 -4441
9345 -4441 32337 -56778 -74283 -18940 52244 56853 26414 25574 -8416 -19591 -20354 63771 51784
9332 51784 10424 55044 41324 35501 27123 23178 54106 -5755 -79810 -155804 -97822 -59913
9320 -59913 -90744 24996 41218 -38616 -78807 -81343 -56898 18836 107048 1404 -35726 20557
9308 20557 -54177 -99389 -66551 -62048 -65853 -1326 -25552 -72943 -74691 -10666 -47195 -36235
9296 -36235 78432 104018 81621 100100 165536 159961 122182 6204 -7055 89054 86483 111263
9284A11263q9237j0634M0632K9337j3238K7130m0830j6760o700l5233L0565n2202
9272b5907J8064m1103K8386Q4380L9758O5612M1305R0594Q1155J35535m91k9530
9260D87758n9420j26796j05956j22543m3728J16787L3249l2587k4125J1681K6525
9249A60845o6611o2215o2211M634K4051m8854r347L8908l9366Q5114P2713m5324
9237E2337k9557K7976K1990n549k8053m6820J3246m1873n5642P9667J25306P3839
9225A86867N3034J28951m775J16945K30939K44467K10508O6249J6176m4281j97440
9214A007640k50191k23576k02181r9440K662K4157l1431o9743k5184q404j6888
9203A07421l7103M5371Q2671L3838L7716p5474j07376q8885l8481N3655q585o9126
$$ plain form
9284 111263 22026 11392 52024 81361 68123 95253 54423 37663 30963 -4270 26295 -25907
9272 -25907 -7843 -48946 -20560 63820 103578 169190 210495 301089 382244 517779 517288 487758
9260 487758 428338 301542 195586 73043 29315 146102 179351 146764 122639 134320 160845
9249 160845 94234 32019 -30192 -25558 -1507 -50361 -59708 -20800 -60166 24948 97661 52337
9237 52337 22780 50756 72746 67197 39144 -7676 5570 -36303 -91945 -12278 113028 186867
9225 186867 239901 368852 364077 481022 711961 956428 1166936 1233185 1249361 1205080 1007640
9214 1007640 757449 533873 331692 232252 234914 259071 227640 157897 132713 124309 107421
9203 107421 70318 115689 198360 232198 269914 194440 87064 -1821 -40302 13353 4768 -64358
9191f4358L6700R6135J741R2744J25774j38292o5864p4425L0686P4702K0968M4951
9179A81462M3860P1800J06510P7688P7687P7550P5045n830k4280j02195r1014
9168D88283j36171l5559Q726m4851p5018m093l5994J4188p725R254n6316n5386
9156F9338K0437M5988k5375J858l0065J8565j9579j0954p3142J0502M5593O1958
9144A15124m8638K1443q495K2108j672r8259o3135R139O0129O5737O1874K9786
9132A65141l640k313p2964j5480L3175q959k8667l194M8464j756J883j3771O1675
9119A59594J1696o6424r460J07779j639Q772Q9479l6997m8931j1092J9545k0788
9107B01534L9923O7380m0389p265Q4772P2851K9859n5707j4509M8191J20637K18326
$$ plain form
9191 -64358 -27658 68477 70218 162962 288736 150444 84580 10155 40841 115543 136511 181462
9179 181462 225322 297122 403632 481320 559007 636557 711602 705772 681492 579297 488283
9168 488283 352112 316553 325279 280428 205410 201317 165323 179511 171786 181040 124724 69338
9156 69338 89775 135763 110388 112246 82181 100746 81167 70213 -2929 7573 53166 115124
9144 115124 66486 87929 79434 101542 99870 1611 -61524 -52385 7744 73481 135355 165141
9132 165141 161501 159188 86224 70744 103919 94960 66293 63099 111563 109807 111690 97919 159594
9119 159594 171290 104866 95406 203185 201546 210318 299797 262800 213869 202777 222322 201534
9107 201534 241457 308837 268448 261183 345955 418806 448665 392958 378449 426640 547277 765603
9095G65603J80228J26513R7584K03263L05209M15165M53712N65403P62611J153315
9085E028606J696828K481117L784880M905399M526347K238927P83594j154049
9077B4291649n783435o835661l998849k158224j222046p54553m70308l16236j51296
9068B601041o0036j44923j61345j40491r7660r0424r4639r2312N9296J01546M9971
9057A930024m7256n025L29J7022p840o3366p1386j15562j13244j14013o2236j06851
9045A240596m3032n8325L5172P4872m4004L487n1221n0754m6712j11461o1187
9034H87431N64M8126O9497q1064j10709m7691l6761m859O3919K7587P5629M4739
9022I36408j6384m2498o8748j03003q0757L883L9680Q2628j4439p1876K9735O2860
$$ plain form
9095 765603 945831 1072344 1169928 1373191 1678400 2093565 2547277 3112680 3875291 5028606
9085 5028606 6725434 9206551 12991431 17896830 22423177 24662104 25445698 24291649
9077 24291649 18508214 11672553 7673704 5515480 4293434 3538881 3068573 2752337 2601041
9068 2601041 2541005 2396082 2234737 2094246 1996586 1906162 1811523 1719211 1778507 1880053 1930024
9057 1930024 1882768 1877743 1878072 1895094 1887254 1823888 1752502 1636940 1523696 1409683 1347447 1240596
9045 1240596 1197564 1139239 1174411 1249283 1205279 1208766 1157545 1106791 1060079 948618 887431
9034 887431 887995 936121 1005618 924554 813845 766154 729393 724534 788453 816040 891669 936408
9022 936408 920024 877526 808778 705775 625018 628901 668581 751209 736770 664894 694629 757489
9010G57489J05874O8059j3223Q4377j8939n3259M4493J3311o9730n3184o143K7514
8998H86639L834m4313m1593n7098q832o998l6315O2407m6065o131l5680J9156
8986F89011N760O5823K5484q8928J8199J170r2471k5707j5614j1438L6314q7608
8974E19995j08008j1323k1450r238j0909P1863P1155k4252J4689P0286J13868
8963F76676M9284m9315l4447k2933M8393Q8820J20635J07860j09783j00593n8406
8952G16191n3452o0166R6635M9093l1356l4091k4400m5628N4293Q0697O1407j6540
8940G92683l3581o2278k5641m0564n3329K2465J9167j31423N470J27430P6636
8929F97035l9542J4085n3409q1834q600R6040P0085J392n898K3703k3596L2814
$$ plain form
9010 757489 863363 931422 918199 1002576 983637 930378 974871 988182 918452 865268 859125 886639
8998 886639 890473 846160 804567 747469 738637 731639 695324 757731 711666 705535 669855 689011
8986 689011 694771 760594 786078 697150 715349 716519 624048 598341 582727 571289 607603 519995
8974 519995 411987 400664 379214 369976 359067 430930 502085 477833 492522 562808 676676
8963 676676 725960 676645 642198 619265 667658 756478 877113 984973 875190 774597 716191
8952 716191 662739 602573 699208 748301 716945 682854 658454 612826 667119 747816 809223 792683
8940 792683 759102 696824 671183 630619 577290 599755 618922 487499 492969 620399 697035
8929 697035 657493 671578 618169 536335 527735 623775 693860 695252 689354 713057 689461 722275
8917G22275J6239N7686j2257O1590N0520j7779m1882k4805m4989P1098L5916K4632
8905H98244Q6064l7597m8446J18129N2961N211p543J0570N4978J41699Q1528P2053
8893A427851N6628L1345J21331M2436J31312J05521J8622M3200J43959J89762
8883B311967K55265L42258M75911N78104O97785P69440Q24656Q63348J126371
8874H245105J346093J630703K107523K735229L559907M817995O987235J0202369
8866D1632159J4015375J7111973J6848364J1398449M501765l332888j5279844
8859H6895353k2807209j8599723j1676094p058787m479926k955382j902228j371838
8851A6044166r83691o44143n17630n21026l75547j49617j23544q1463J09459J30532
$$ plain form
8917 722275 738514 796200 783943 845533 896053 878274 836392 811587 766598 837696 873612 898244
8905 898244 984308 946711 898265 1016394 1069355 1074566 1067023 1077593 1132571 1274270 1355798 1427851
8893 1427851 1484479 1515824 1637155 1679591 1810903 1916424 1935046 1978246 2122205 2311967
8883 2311967 2567232 2909490 3385401 3963505 4661290 5430730 6255386 7118734 8245105
8874 8245105 9591198 11221901 13329424 16064653 19624560 24442555 31429790 41632159
8866 41632159 55647534 72759507 89607871 101006320 105508085 102175197 86895353
8859 86895353 64088144 45488421 33812327 26753540 22273614 19318232 17416004 16044166
8851 16044166 15060475 14416332 13898702 13377676 13002129 12852512 12728968 12647505 12756964 12887496
8841A2887496K49071L21736M32089M57887M73044O42655P25785P62915Q59782
8832A7812460J147017J407416J765643K096900K590907L448211M717774O478204
8824D1464532Q888917J2841001J9103516K7323503L5207410L6209124K4515580
8817B05553583J0433970l300442l0167069n0088693m0002693k4533705j4650907
8810E3244044r076519n943111m041801k938522k000837j456861j173726j007645
8802B5605022q01817n74154m82263m03444k41063p6001J51277J05374N1378J29460
8792B3463769N6228J2479o9930k24605j48080J11533J99800L13687O08411Q04089
8782B5127381J338466J964437K827495M085831N980225Q660357J2156395J5505718
$$ plain form
8841 12887496 13136567 13458303 13890392 14348279 14821323 15463978 16189763 16952678 17812460
8832 17812460 18959477 20366893 22132536 24229436 26820343 30268554 34986328 41464532
8824 41464532 50353449 63194450 82297966 109621469 144828879 181038003 205553583
8817 205553583 215987553 212687111 182520042 132431349 92428656 67894951 53244044
8810 53244044 44167525 38224414 34182613 31244091 29243254 27786393 26612667 25605022
8802 25605022 24803205 24229051 23746788 23343344 23102281 23026280 23177557 23282931 23334309 23463769
8792 23463769 23519997 23532476 23462546 23237941 23089861 23201394 23401194 23714881 24323292 25127381
8782 25127381 26465847 28430284 31257779 35343610 41323835 49984192 62140587 77646305
8774G7646305J6328692J1962318N177787j527443j1925969k1880828k0184247
8767E5596615j3154846q048350n102847l357931k331847j700341j308812r44338
8759A9647303p12442o31865n98704n45826l97095l27038l55672k05821m5259j33826
8749A5693755k02192j48201j97924k81397k67693l18178l15823m35951m61726
8740A3064670m40174l59077l58139l57355k39818j42406j13967n3942j24906j75072
8730A0699814j64995j50735j72622k60466k40112k38801k81502l55218l07572
8721H527791k03573j96351j80991k42692j57829j22974j91284k65703j73780j14904
8711F677710j14946j39729p3197k11125k03857k11137m2105j52866j56448p6280
$$ plain form
8774 77646305 93974997 105937315 111115102 109587659 97661690 75780862 55596615
8767 55596615 42441769 34393419 29290572 25932641 23600794 21900453 20591641 19647303
8759 19647303 18934861 18302996 17704292 17158466 16761371 16434333 16078661 15872840 15827581 15693755
8749 15693755 15491563 15343362 15145438 14864041 14596348 14278170 13962347 13526396 13064670
8740 13064670 12624496 12265419 11907280 11549925 11310107 11167701 11053734 10999792 10874886 10699814
8730 10699814 10534819 10384084 10211462 9950996 9710884 9472083 9190581 8835363 8527791
8721 8527791 8324218 8127867 7946876 7704184 7546355 7423381 7232097 6966394 6792614 6677710
8711 6677710 6562764 6423035 6349838 6138713 5934856 5723719 5681614 5528748 5372300 5296020
8701E296020o3894j34135o9252q6935j15752r8832p4922o2263m2567o6872n7838
8690D422758o8344J8414j1004J7034j6003o4466l6468J9232j30738k51449k03425
8679C695541j16486q2561p6629j16001j41986j40705m9701n1252m4148q4198j44514
8668B647360j66539N1064N2905m0364q2727j08712m6009p0352j60781p8335o4842
8657A932668o8335j13910m7258R7746j7769j29199m8392j3781p3255j12141o9756
8646A336618n6338N674L5767r219k3587l6307l7726k0007O1215l6657j13631m9864
8634A055938p1889l6970k9677j0010J04958n0807j25961j3819K6412L9801R6741
8623I84717K2025n1230K3520o2452p7899q0222L0597L0439M5677k3941m4092L2070
$$ plain form
8701 5296020 5232126 5097991 5028739 4941804 4826052 4727220 4652298 4590035 4547468 4480596 4422758
8690 4422758 4354414 4372828 4361824 4378858 4362855 4298389 4261921 4281153 4150415 3898966 3695541
8679 3695541 3579055 3496494 3419865 3303864 3161878 3021173 2971472 2920220 2876072 2791874 2647360
8668 2647360 2480821 2531885 2584790 2544426 2461699 2352987 2306978 2236626 2075845 1997510 1932668
8657 1932668 1864333 1750423 1703165 1800911 1783142 1653943 1605551 1591770 1518515 1406374 1336618
8646 1336618 1280280 1285954 1321721 1312502 1288915 1252608 1214882 1194875 1256090 1219433 1105802 1055938
8634 1055938 984049 947079 917402 907392 1012350 961543 835582 821763 848175 887976 984717
8623 984717 1006742 955512 979032 916580 838681 758459 789056 819495 865172 841231 797139 829209
8611H29209J8611j12428r4014o482L5790J12022p548p4772m0336O6912j4222o2380
8599F50362o0364K663L5133K1149K0832K4749K8250Q408l4727l0960j4765N2587
8587G03317Q063p0092n3008N4876M7607n0269l9130P4042K1152K1982P3609m2438
8575G49711p4433o0163j20841P1081R1736O5780k584l4779j2866l1341L0651K4396
8563F96348j6748k2761p166o7177n3490n1722R4468k1621n1938o2271L6626l2374
8551D40174m4187Q085k1297m7072P2278N1732M9366J34K3937N4215K9572N1375
8539F68312k3352j00967k1147l0248p707K5449l2168m9778j4133m7045K2377M9875
8527D39468Q0577L1416o343k0703r8117m7330l9065O0439N0558Q370j3785n2246
$$ plain form
8611 829209 847820 735392 641378 634896 670686 782708 775160 700388 660052 726964 712742 650362
8599 650362 589998 592661 627794 648943 669775 694524 722774 731182 696455 665495 650730 703317
8587 703317 711380 641288 588280 643156 690763 640494 601364 675406 696558 718540 792149 749711
8575 749711 675278 615115 494274 565355 657091 722871 720287 685508 672642 641301 671952 696348
8563 696348 679600 656839 649673 582496 529006 477284 571752 550131 498193 435922 472548 440174
8551 440174 395987 404072 382775 335703 407981 459713 509079 509213 533150 587365 616937 668312
8539 668312 644960 543993 522846 492598 484891 510340 478172 428394 414261 367216 389593 439468
8527 439468 520045 551461 545118 524415 426298 378968 339903 400342 450900 459270 445485 393239
8515C93239j06259m033j0254M987L6725k0820n6445J8177L8792M3275n1489n9218
8503B26677p9598J51J26639q806K2246P1672J1471r044r593Q3660p757m4576o204
8490C76938m5658m0819j4942M8113O8266k337J2141J9916o3630N8207n1311j02684
8478B62200o7092l4487r026P357Q5271P2895M1550J1996r4801q6069P197J8522
8466B15513k6594m7766N5989K6720O3696Q0886J42181J39852O0284k6774P0575
8455G54562m4596m5720j3748p2918n8935m0298m1574j7911j6949K4207o0102p2976
8443B93042j6551k1635P0818J05007m3852p7225K8755l5581l5975O2459L0146
8432C59408o5655N5515O9873j5286q433p3762q6924K727P3703K9417J5379m0768
$$ plain form
8515 393239 286980 282947 272693 277680 314405 293585 237140 255317 294109 337384 285895 226677
8503 226677 147079 147230 273869 265063 287309 358981 370452 361408 351815 435475 427718 383142 376938
8490 376938 331280 290461 275519 323632 391898 389561 401702 421618 357988 416195 364884 262200
8478 262200 195108 160621 151595 158952 244223 317118 358668 370664 275863 189794 196991 215513
8466 215513 188919 141153 197142 223862 287558 368444 510625 650477 710761 683987 754562
8455 754562 709966 664246 650498 577580 518645 478347 436773 418862 401913 426120 366018 293042
8443 293042 276491 254856 325674 430681 386829 309604 338359 302778 266803 329262 359408
8432 359408 293753 349268 419141 403855 395422 321660 234736 237463 311166 340583 355962 315194
8420C15194M0262P7659R3268M0634J17224K07284J39309R6400J12236Q8757j5771
8409A312456j99839k74157j52426j02348m5581n3452n2442q8509o2529p727N191
8398B78637J4123K0508m6027K7979K3655K450j6254M3284l5782J206L4905k939
8386C45745p2409n1807M7017P3180M547p1094L8552K2495k373o6952l5340Q1469
8374C13030L0247L9814P7234R0274J4164R3613J05779K6341K3968L376q4913j21734
8362F11193j62283n0012J2556o5521l2921n7436j13409l9440M6132P9586n8063
8351A70382M0628L4804M2926l1118p1053J5936l1379K2900j6142o1414M6451O0722
8339B23643J7106n8510l5665n0996M897J9566Q5269r78l9968L7917k8785L1956
$$ plain form
8420 315194 355456 433115 526383 567017 684241 891525 1030834 1127234 1239470 1328227 1312456
8409 1312456 1112617 838460 686034 583686 538105 484653 432211 343702 281173 273446 278637
8398 278637 292760 313268 267241 295220 318875 321325 305071 348355 312573 313779 348684 345745
8386 345745 273336 221529 268546 341726 346273 275179 313731 336226 333853 266901 231561 313030
8374 313030 343277 383091 460325 550599 564763 658376 764155 790496 814464 817840 732927 611193
8362 611193 448910 398898 411454 345933 313012 255576 142167 102727 148859 228445 170382
8351 170382 211010 245814 288740 257622 186569 202505 171126 194026 177884 116470 162921 223643
8339 223643 240749 182239 146574 95578 100475 120041 205310 204332 164364 202281 173496 205452
8327B05452J5325q400j4436P8930o6082K0058l4460k6954K8706j7141j8809j02213
8315E9976N2246P7915N4053r1891l2890l630J2558M1888P2909j072n2099j9024
8303A70939K1858n7794k3284k206L6905j0936l5415o1727k2738L2790J0082M9614
8291A08088l8291L0279K9275P1199Q4287l4632m2318j9858j7401j03627r8596
8280c1595K652K5825p376K1961O002O3853K5286o8632K0151P0458P7837j7093
8268A89329j12409m8693N6619M760M9132M0100m9996r938N7807k1735p1237m2473
8256D1266n461R9445N2325K1873m233j7208l5247p0476o1457K7903J28871M3467
8244B21068m1399M9377m3411p0881j02743K6235M2172p0990L4638M3634O9621
$$ plain form
8327 205452 220777 212377 197941 276871 210789 230847 196387 169433 198139 180998 162189 59976
8315 59976 112222 190137 244190 152299 119409 115779 128337 170225 243134 242062 189963 170939
8303 170939 192797 135003 111719 109513 146418 135482 100067 38340 15602 48392 58474 108088
8291 108088 69797 100076 129351 200550 284837 250205 207887 188029 170628 67001 -31595
8280 -31595 -28943 -3118 -10494 11467 17469 81322 106608 37976 58127 128585 206422 189329
8268 189329 76920 28227 84846 89606 138738 178838 128842 118904 176711 154976 83739 41266
8256 41266 35805 135250 187575 209448 205215 188007 152760 82284 20827 48730 177601 221068
8244 221068 179669 229046 185635 114754 12011 38246 80418 9428 44066 87700 157321
8233A57321N0485k752L1321m3643k9858o8942j25079O1321L2521l5631L9560k2205
8221D4419l6578k754P8818R445k1813m5727o7100k2547K8106R7456R4816k2980
8209A33561j9218N12O018R4288K2507o2308q0755j19712m1107Q4845J3868K0044
8197E2543p0992j731K232J9361N3841n5768p0784N5235K0478M4133R3378M9762
8185A91688o5288l6009N5819r2826j9332n355q772j6332n3597j6379j693J00822
8173C2746J26045P1898o9299o1128m6909r9336O316M2411o9485j0111P475k403
8161g1780k6342j7966J663N8971j1876M8065k391J7327m403k2292p602J03436
8149F4810k8918N4065O3317m6548q784L6786n6422m8866l3281J736N2230K8487
$$ plain form
8233 157321 207806 205054 236375 192732 162874 93932 -31147 30174 62695 27064 66624 44419
8221 44419 7841 5087 83905 93350 71537 25810 -41290 -63837 -35731 61725 156541 133561
8209 133561 114343 114855 120873 215161 237668 175360 94605 -25107 -66214 18631 32499 52543
8197 52543 -18449 -20180 -17948 1413 55254 -514 -71298 -16063 4415 48548 141926 191688
8185 191688 126400 90391 146210 53384 34052 28697 19925 3593 -50004 -66383 -68076 32746
8173 32746 158791 230689 161390 100262 53353 -45983 -39667 2744 -66741 -76852 -69377 -71780
8161 -71780 -98122 -116088 -114425 -55454 -67330 -19265 -21656 -4329 -8732 -31024 -38626 64810
8149 64810 35892 89957 153274 106726 97942 134728 78306 29440 -3841 -2105 50125 78612
8137G8612J2723q6226j0560J16074O9812j4960j07822k9152R960M4866O7916k8690
8125A22553j189m2498m2181m0997l665J6614P3831L8947l5434k3600j0927r1334
8113c9880k8156m7082m8836R3919M4338R4141n751r1699k0725M4162L4011K8148
8101E6590O4001j2397l8665L930J1630r6738k2598j7712K8907J3677N4165J1663
8089E6453M2894o4459n6288l2780R503O485J00079R836k2562J6580j1576l283
8077E0882j8257M2950k6192J609m0290j6291J16832O3933P0847N406n2781j09859
8065H8789r413M2105m2703p7381r4281J560J1627p0906L4918M3501L633J1582
8053e6969Q8935M0980p5619r986P647J1991k2062K78l0548N0490Q7399K5012r6913
$$ plain form
8137 78612 91335 5109 -5451 110623 180435 165475 57653 28501 38461 83327 151243 122553
8125 122553 121364 78866 36685 -4312 -7977 8637 82468 121415 85981 62381 51454 -39880
8113 -39880 -68036 -115118 -163954 -70035 -25697 68444 62693 -29006 -49731 -5569 28442 56590
8101 56590 120591 108194 69529 73459 85089 -11649 -34247 -51959 -23052 -9375 44790 56453
8089 56453 99347 34888 -21400 -54180 -44677 -38192 61887 71723 49161 65741 54165 50882
8077 50882 32625 75575 49383 50992 10702 -5589 111243 175176 246023 251429 198648 88789
8065 88789 79376 121481 78778 1397 -92884 -91324 -79697 -150603 -115685 -72184 -68551 -56969
8053 -56969 31966 72946 -2673 -12659 -5012 6979 -15083 -14805 -45353 5137 92536 117548 20635
8040B0635k2501J4519J1021K070L402J3353Q1789k2160j44738o3601O6639j2418
8028e1990r1658J26225J36711k2079N329l900Q0948L4286m6257m2577j32828l6661
8016d4451N8073J5337n7054P4916k889J1211k9786J7637L5759k8159k6575O4739
8004H8758J03336K7464n0262p3242r1134m6742j0162N2301R1372P2539O2287l345
7992B23170j43845n1681o578K8911P0070k4630J6656j6812m359N4543o221j23663
7980A5561Q491r617q555Q1219k8451J899N6120J3420l7608j05746J3217P8899
7968G8849P818l7866p2498o040j480K3737J2410Q019j0841J25388j6011j74865
7956f3380o5391J14945J85428R7230p7201r3790j28912q4386N6882N7295K2510
$$ plain form
8040 20635 -1866 12653 23674 25744 29146 42499 124288 102128 -42610 -106211 -39572 -51990
8028 -51990 -143648 -17423 119288 97209 102538 98638 179586 213872 167615 125038 -7790 -44451
8016 -44451 13622 28959 -28095 46821 43932 55143 25357 42994 78753 50594 24019 88758
8004 88758 192094 219558 169296 96054 4920 -41822 -51984 317 91689 164228 226515 223170
7992 223170 79325 27644 21066 49977 120047 95417 112073 95261 90902 145445 139224 15561
7980 15561 24052 14435 5880 87099 58648 60547 116667 130087 92479 -13267 -50 78849
7968 78849 86667 48801 -23697 -29737 -31217 -7480 4930 12949 2108 127496 111485 -63380
7956 -63380 -128771 -13826 171602 268832 191631 97841 -31071 -115457 -58575 -1280 21230
7945B1230K1344n913l0383J797O5220o3835o6915j1508J7002l5391M9770k6047
7933f3629j6657k4680L688R6576K4628m4312q665L1737J5605L1094L0583k1027
7921E4941Q446N1361q801q6265L3093l2543m7467R4981K6502m3359R915N4400
7909A15204o135k9147n1351M7383J8536O990m8385o4980j4827M6067n9919n0289
7897i0853R5921J49631J8939q3096j1339M2995M5347m0535m0399j4674J1279p6940
7885F276k9243Q76J9970k5916n531P956L7504L0903M1283L2409R611p6529M6842
7872I6411l2857j07491j1768K0968J4695K4704K8554n9238o4901k6206L1094M1839
7860d4196k2531n0846Q1445J24307L2519n8732n0693K6760O8577l3282o0251M3347
$$ plain form
7945 21230 42574 36661 6278 8075 73295 9460 -57455 -68963 -51961 -87352 -37582 -63629
7933 -63629 -80286 -104966 -101278 -4702 19926 -24386 -33051 -1314 14291 45385 75968 54941
7921 54941 63387 114748 105947 19682 52775 20232 -27235 67746 94248 50889 60804 115204
7909 115204 109069 79922 28571 75954 94490 101480 53095 -11885 -26712 19355 -40564 -90853
7897 -90853 5068 154699 173638 90542 79203 122198 167545 127010 86611 71937 83216 6276
7885 6276 -22967 -22091 -2121 -28037 -33568 -25612 11892 42795 84078 116487 126098 49569 96411
7872 96411 63554 -43937 -55705 -34737 -20042 4662 33216 -26022 -90923 -117129 -86035 -44196
7860 -44196 -66727 -117573 -36128 88179 120698 61966 11273 38033 106610 73328 13077 56424
7848E6424k3935o0997L3625k6095j8222P3585L1062M4501l3101n6910K5125N5495
7836A00557l8842L6204m595K2415l3777o6431L4156l2630k0444Q0537L1535L1175
7824A39860N100n5753o2778K2324N0204N1718K8066j3232j751m8109j14070k4896
7812b3317N3315l4072j15001q697J06799o940p470J5537j9370L9247j9614Q3599
7800F4016J02125j18271k3989k1349j8141L5716Q2316O6877K636j02024q6241
7789a6329K2916j066M2401p2613m1523R0272M2753r7651m6900Q913M3250k6814
7777e2391L0598L1476N5689K2384o731j2689O5441P466m0453l6007r0977J8621
7765g573r347O105o198q1660K0597K3775o1979J39296R2470L3076j7701o0365
$$ plain form
7848 56424 32489 -28508 5117 -20978 -39200 34385 65447 109948 76847 19937 45062 100557
7836 100557 61715 97919 93324 115739 81962 15531 49687 17057 -3387 77150 108685 139860
7824 139860 144960 89207 26429 48753 98957 150675 178741 165509 163758 115649 1579 -23317
7812 -23317 29998 -4074 -119075 -127772 -20973 -27913 -35383 -19846 -39216 31 -19583 64016
7800 64016 166141 47870 23881 2532 -15609 20107 102423 169300 171936 69912 -16329
7789 -16329 6587 5521 47922 -24691 -66214 24058 66811 -30840 -77740 -68827 -25577 -52391
7777 -52391 -21793 9683 65372 87756 81025 68336 133777 141243 100790 64783 -26194 -7573
7765 -7573 -16920 -10815 -17013 -98673 -78076 -54301 -116280 23016 115486 148562 130861 70496
7753G0496o3110j695Q026L2201N2188J9949r3717l0786M1938j3639p1752l0597
7741h0498M1387k9025K9286O9745Q9619N205n6217k2965P446J5151o6123j7761
7729a4750K874k4499k01K106K4688L5501K3674L1943L4140L447q2349k9711O1973
7716F8836l1034j6199P027l1641k1624J0753o180p6382M2596K1690j714L2999
7704h73N8161L5368j2851k7064j2842l8736l9262L4389P0299M629q6680J0736
7692d726J3356n0299k3150J4505O1189p5769l900M8694L6296M2575J17537k3509
7680A52799l1539j04985J5927Q5352l1767M9577N1188k6714p5238m8533n8745
7669b2678m7267j1609m4345M9279P6485k1339m8034K9845L8247k4393P3223l8296
$$ plain form
7753 70496 7386 5691 13717 45918 98106 118055 24338 -6448 35490 21851 -49901 -80498
7741 -80498 -39111 -68136 -38850 30895 120514 125719 69502 46537 53983 69134 3011 -14750
7729 -14750 -11876 -36375 -36576 -34470 -9782 25719 49393 81336 115476 118923 36574 6863 68836
7716 68836 37802 21603 28630 -3011 -24635 -13882 -20062 -96444 -53848 -32158 -33872 -873
7704 -873 57288 92656 79805 52741 39899 1163 -38099 -3710 66589 71218 -15462 -4726
7692 -4726 8630 -41669 -64819 -50314 10875 -64894 -68794 -20100 16196 58771 176308 152799
7680 152799 121260 16275 32202 117554 85787 135364 186552 159838 84600 36067 -22678
7669 -22678 -69945 -81554 -125899 -76620 -135 -21474 -69508 -39663 -1416 -25809 47414 9118
7657I118r9593K7816O235k00L0281J3008r0767J3743j5221j0904j2302j5740O8668
7644g5858J1631R7374Q0795l0845o2870n7505o396L5790M5377n9679q1010J7663
7632h5533l5883o0274K4407J70789J4355K6280m4834k0394K7129L8666R273R5051
7620A59032m7289j21439r8112n9208P1564N7139j808N444J0014L4830R646L784
7608B3597K5322J6348l0868j15549j14401L5824Q1109L9047j52o263n0277P0184
7596b6079J9094j1911k0567M161N8699N1363l9858l5295M7476K7397p7424j10777
7584a13721J6074R4617O7142L4783l0927L9527j5596m7897N299r671J5769K4894
7572H0293o427O4316P6665l8052n6140j3454n696L4169l8658M6360q9323K0125
$$ plain form
7657 9118 -90475 -62659 -56424 -56624 -26343 -13335 -104102 -90359 -105580 -116484 -128786 -144526 -75858
7644 -75858 -64227 33147 113942 83097 20227 -37278 -43674 -7884 37493 -22186 -103196 -85533
7632 -85533 -121416 -181690 -157283 13506 27861 54141 9307 -11087 16042 54708 63981 159032
7620 159032 111743 -9696 -107808 -167016 -95452 -38313 -40121 -34677 -24663 10167 19813 23597
7608 23597 48919 65267 34399 -81150 -195551 -159727 -78618 -39571 -39723 -45986 -96263 -26079
7596 -26079 -6985 -18896 -39463 -35302 23397 74760 34902 -393 47083 74480 -2944 -113721
7584 -113721 -97647 -3030 64112 98895 67968 107495 91899 44002 49301 39630 55399 80293
7572 80293 73866 138182 214847 176795 120655 107201 101505 135674 97016 143376 54053 74178
7560G4178M2276m4056j0005M1386p6079j17937n9794J32308J09893l2078L2226
7549I2318l0602r1344M272K1594M2421O103m8832j294M8866n1809k2797r371R5201
7536E4726P6473m2790o1456m250m518j090j2461L1309n2399l7879N1174L2412
7524B9251k7046k0642L622n2717k5841O420k365K5783k7725L8246n249M6026N644
7511f593o067j7483J6961Q431p2594l2503j4958m912M0916n8923m3450K1398J26151
7498d3626N8146j0149O316L7432k8475L7712k2332q6894M363J16420O6675M2436
7486A78024n2285r7872m395k6392l0145N7739q2793L4854j2047l2996O0362O3691
7474E5745Q1058o187n9045m552K0951o3824j6214L5604N9979m6491m3718l550
$$ plain form
7560 74178 116454 72398 62393 103779 27700 -90237 -150031 -17723 92170 60092 92318
7549 92318 61716 -29628 -25356 -3762 38659 44762 -4070 -5364 43502 -8307 -31104 -40475 54726
7536 54726 131199 88409 26953 22703 18185 17095 4634 35943 -16456 -54335 -3161 29251
7524 29251 2205 -18437 -14815 -67532 -93373 -86953 -89318 -63535 -91260 -53014 -58263 -12237 -6593
7511 -6593 -12660 -30143 -13182 -4751 -77345 -109848 -124806 -129718 -88802 -147725 -191175 -169777 -43626
7498 -43626 14520 4371 10687 48119 19644 57356 35024 -51870 -47507 68913 135588 178024
7486 178024 125739 27867 23472 -2920 -33065 24674 -58119 -23265 -35312 -68308 -7946 55745
7474 55745 136803 130616 71571 67019 87970 24146 7932 43536 103515 57024 13306 9756
7462I756J4767L5116N9031p4136l6822j8122o0378M2361M8104l8167K319N738
7450a0433j0804K0837N1570Q4940L4392l9543r2238q0270K5183L2588p4226n5018
7438a13022P5964L3976l8960l2909r3520k0262N0820Q4299K6280k0167m2312Q8992
7426h21N4923j2046l1077O825M0246J18504M842n0448r7857O4328L9974L6141
7414A73534m7534q4992o5216k6336K8089q2276k7418J09155Q7343j14577r2118
7403a42346M9527P4507K8048k3412m0664p417j8362K837O629L3112K8976L2162
7391B3597r5581L816M6914j7418J7403J8498l2756N9931J04960j3390n0118r7870
7379c2014J3721l3450m5146J1987J4020l9051k7396n21L3751R0530K6592L3296
$$ plain form
7462 9756 24523 59639 118670 44534 7712 -10410 -70788 -28427 19677 -18490 -16171 -10433
7450 -10433 -21237 -400 51170 136110 170502 130959 38721 -41549 -16366 16222 -58004 -113022
7438 -113022 -37058 -3082 -42042 -74951 -168471 -188733 -137913 -53614 -27334 -47501 -89813 -821
7426 -821 54102 42056 10979 17804 58050 176554 181396 130948 33091 97419 137393 173534
7414 173534 126000 41008 -24208 -50544 -22455 -104731 -132149 -22994 64349 -50228 -142346
7403 -142346 -92819 -18312 9736 -13676 -54340 -61757 -80119 -77282 -70653 -37541 -8565 23597
7391 23597 -71984 -68168 -21254 -38672 -21269 -2771 -35527 24404 129364 115974 65856 -32014
7379 -32014 -18293 -51743 -96889 -84902 -70882 -109933 -137329 -137850 -104099 -13569 13023 46319
7367D6319J15005k5543q6711l2685n9106k2908N581J5375k8115O4323K5879k2672
7355e258j2534P2593k8566p5215O9981M9888K0295m3110l8455J623r1381M3816
7343c6323P0178q9536j5254R9583J2586n5962p4541L5358R5598l3328P2533q589
7331G2303K8219K448m9653k6289J03723m6311p4148M9408K68n6748p9227n7096
7319a33103N9547M2883J39825J9938j09098m1920J5494O979J5255M4934l8864
7308B1870m2611M3896o068j5921l5356n2242L2015k7153m8750M4529O9354J1037
7296e400Q21j154L724o254K0046k8554K2431M21P0403N7719J9787P6586P262n8657
7282A79181m3757r6681m4493o813k9374L4248l0796o1104o22L8212Q3463O903
$$ plain form
7367 46319 161324 135781 49070 16385 -42721 -65629 -60048 -44673 -72788 -8465 17414 -5258
7355 -5258 -17792 54801 26235 -48980 21001 70889 91184 48074 9619 11242 -80139 -36323
7343 -36323 33855 -55681 -70935 28648 41234 -14728 -89269 -53911 41687 8359 80892 72303
7331 72303 100522 102970 53317 27028 130751 84440 10292 59700 59968 3220 -76007 -133103
7319 -133103 -73556 -30673 109152 129090 19992 -21928 -6434 545 15800 60734 21870
7308 21870 -20741 23155 17087 1166 -34190 -86432 -54417 -81570 -130320 -85791 -16437 -5400
7296 -5400 -4579 -5733 -2009 -8263 11783 -16771 5660 6081 76484 134203 153990 230576 237838 179181
7282 179181 135424 38743 -5750 -12563 -41937 -7689 -38485 -99589 -100211 -61999 21464 28367
7270B8367K6139L2776l2081k6014j4753p4516o1877P2552K9540m6733L4091j682
7258c4191L8507l9944n0120K8112l6816J0824L4110J01899O4843p3371j12047
7247f8194p0965j3708O0974J02838R1558k2027L0924J5948m960J6147l0662o0
7235A07813O39j5377p6164o3683j6322J14126P7330m2210m0508J9134Q5536K9044
7223A79358q0605n1784L4929k6471q2849L3252R706j0270R8844p727m1476p412
7211D7495o2745m5365J9464J5795O574P7922L4855o3219J3664K3987J07361K8507
7199B04295o3981p2944n0141j0047N2882p2157q5960n964P8767N9211J0853M992
7187D9806L4934n9457J9685j2228r4171l4975J5946O0626J30207m3082r9485o5250
$$ plain form
7270 28367 54506 87282 55201 29187 14434 -60082 -121959 -49407 -19867 -66600 -32509 -34191
7258 -34191 4316 -35628 -85748 -57636 -94452 -83628 -49518 52381 117224 43853 -68194
7247 -68194 -139159 -152867 -91893 10945 102503 80476 111400 127348 122388 138535 107873 107813
7235 107813 108452 93075 16911 -46772 -63094 51032 128362 86152 45644 64778 150314 179358
7223 179358 98753 46969 81898 55427 -27422 5830 15536 5266 104110 96383 54907 47495
7211 47495 -15250 -60615 -41151 -25356 -18782 59140 93995 30776 44440 68427 175788 204295
7199 204295 140314 67370 17229 7182 60064 -12093 -98053 -104017 -25250 33961 44814 49806
7187 49806 84740 25283 44968 32740 -61431 -96406 -80460 -19834 110373 67291 -32194 -97444
7175i7444J6434M1328K0244L8585n634O4216N5805L9236j7620J4204n7014o935
7163A05405j4842k9910P254o4910N2704J5507n8612j5922M9575L9317J202m0715
7151D6053k4873q380k7008k5619n70l4777n5159Q8830J40967P39j4504r1528m7855
7138e3684K5245k9943M0752j1355m5510J9280R7016Q0988r1200p3653J4583Q028
7126a9453m3273j3197L5187L7875Q3706K2500l3307m0295l1841r5222m4629j2817
7114a54766k6048k547N3469M9387K9813j1804N7571P1321k4106l910P7424K5748
7102A41552q511n6746J54k481n641p071L4816k176K160k3338l2357L1114k1507
7089D9968l8313j7371M4594P718j5444J4434k3323N7671J162o4720M3725M464
$$ plain form
7175 -97444 -81010 -39682 -19438 19147 13513 77729 133534 172770 155150 169354 112340 105405
7163 105405 90563 60653 67907 2997 55701 71208 12596 -3326 46249 85566 86768 46053
7151 46053 21180 12800 -14208 -39827 -40397 -75174 -130333 -41503 99464 100203 85699 -5829 -53684
7138 -53684 -28439 -58382 -17630 -28985 -74495 -55215 41801 122789 31589 -42064 -27481 -19453
7126 -19453 -62726 -75923 -40736 -2861 80845 103345 70038 29743 -2098 -97320 -141949 -154766
7114 -154766 -180814 -183361 -129892 -80505 -50692 -62496 -4925 66396 42290 38380 115804 141552
7102 141552 133041 76295 76449 73968 68327 61256 96072 93896 96056 72718 40361 71475 49968
7089 49968 11655 -5716 38878 46596 31152 45586 22263 79934 81096 16376 60101 64565
7077F4565j71773o7826R9906O9521O3112q85o8222p7453J2008P4947M7029J1717
7065E6646j01491M0138J7540L4622l2519o2049J2939j5384m473l0800M7373L054
7053c4404L6559o6842o3080J6173Q0277L6166p7901p9518J7534L9170j3814j2037
7041a21717o8971k1977M6443Q4487j142K798Q162J2111m8137L0808K8539K6093
7029b2503J9111o084o857r567L3246K1691k924j4609J5382l1324k3462Q1268M0899
7016I4267m4194q9859L0455l5558M5833K358l3544p7137M0077Q1243M855M8262
7004F7058l1548l9229J1089L1823M6744K9732n7237k9221L599j0385o4644m4465
6992h6684P9117o9908M866J17618L3735l2593n6353j21047L4015O0368L7236K5243
$$ plain form
7077 64565 -107208 -175034 -75128 -5607 57505 56620 -11602 -89055 -77047 -2100 44929 56646
7065 56646 -44845 -4707 12833 47455 14936 -47113 -34174 -49558 -54031 -84831 -37458 -34404
7053 -34404 2155 -64687 -127767 -111594 -31317 4849 -73052 -152570 -135036 -95866 -109680 -121717
7041 -121717 -190688 -212665 -166222 -81735 -82877 -80079 -71917 -59806 -107943 -77135 -48596 -22503
7029 -22503 -3392 -9476 -16333 -25900 7346 29037 26113 11504 26886 -4438 -27900 53368 94267
7016 94267 50073 -39786 -9331 -44889 944 3302 -30242 -107379 -67302 13941 18796 67058
7004 67058 35510 -3719 7370 39193 85937 115669 58432 29211 32810 22425 -42219 -86684
6992 -86684 -7567 -77475 -72609 45009 78744 46151 -10202 -131249 -97234 -36866 370 25613
6980B5613K9760j5394l9584R026M105j03655L661K6670P9621N1986l9423p8291
6968d5905M518L9301K0685R941l8403N1466m5365n9297N2195P9993p503k7974
6956C3652N9883P4928o6368m4599N221K4292J0321j5843j5504R4482l4215p8971
6944D7279m13J442n2149m6982J5479J9417L4152q548o0704L4184R0486K5985j3473
6931H6155K770n3719n1500J6381j9590k7337q750J8598N9641j9925J3412J6441
6919C2577n5699o385J4966J7031M7240L955m0350q209o2666O171R9343m660o5164
6906b1850m9923r4601N9744J05203O4773k5697j2811l3343p17K3356L7571L8356
6894I0061k8593o2928L7017K2597l7904J4462O6575n9124j7658M3080M6837k4862
$$ plain form
6980 25613 55373 39979 395 9421 13526 -90129 -86468 -59798 19823 71809 32386 -45905
6968 -45905 -41387 -2086 18599 28540 -9863 41603 -3762 -63059 -10864 69129 61626 33652
6956 33652 93535 168463 102095 57496 62717 87009 97330 81487 65983 160465 126250 47279
6944 47279 46866 48308 -3841 -50823 -35344 -15927 18225 9677 -51027 -16843 73643 99628 86155
6931 86155 88925 35206 -16294 87 -19503 -46840 -55590 -36992 22649 2724 16136 32577
6919 32577 -23122 -29507 -14541 2490 49730 53685 13335 5126 -57540 -51369 47974 43314 -21850
6906 -21850 -71773 -166374 -106630 -1427 63346 37649 24838 -8505 -9222 14134 51705 90061
6894 90061 61468 -1460 35557 58154 20250 34712 101287 42163 24505 67585 114422 89560
6882H9560j22860j8742M2383O0173N7651r336o4590n5527m7970k2660K5225J7989
6870d8704p7754M2056J5624K7935o8546j29511K9350P9452O9730M2046j206N0875
6858C1347K0887n3074n3217l1385M8422j3410k4152N6414J30531j5390l1413O3081
6846A28641k6180K2323l7020j11012n4659O444N7616L7655J9816j0107M486J04550
6834A42553K2596J5470k8495n1137l7888j8282j7459N9367l9178l5431J8311m7265
6822a6838n6833M8884Q06o9438N5456J45455n9471j36741l8823K1993L3042J728
6810g0780L7789o1806r39R1606O4407n748n0086K7432m2952m0872O7117L6111
6798E1279K5594p6033K0462j108n0302j8608l6434p637L2877K765m5524k1509
$$ plain form
6882 89560 -33300 -52042 -9659 50514 108165 98829 34239 -21288 -69258 -91918 -66693 -48704
6870 -48704 -126458 -84402 -68778 -40843 -109389 -238900 -209550 -130098 -60368 -18322 -19528 31347
6858 31347 52234 -840 -54057 -85442 -37020 -50430 -74582 -18168 112363 96973 65560 128641
6846 128641 102461 124784 87764 -23248 -77907 -71463 -13847 23808 43624 33517 38003 142553
6834 142553 165149 180619 152124 100987 63099 44817 27358 86725 47547 12116 30427 -16838
6822 -16838 -73671 -24787 -23981 -93419 -37963 107492 48021 -88720 -127543 -105550 -72508 -70780
6810 -70780 -32991 -94797 -95736 -4130 60277 54529 4443 31875 -11077 -51949 15168 51279
6798 51279 76873 840 21302 20194 -30108 -48716 -85150 -92787 -59910 -57145 -102669 -124178
6786a24178L5313J13450O7744l7234P11M0853j04476l9052K7805N0321k2386l3443
6774b4572m3513j3036m467M5939j3800l5002R161L2147N5555N1313J5182j6814
6762E8093l3217j12038N185R0522L0228p2176O8516n8496K2016J6454k4753k6710
6750c6376q1384P3105J9513N0141N0642r5968p0160k9621O9061N9419N6301K492
6738F7165k7415M4161l3449q432j5834n586J5595M7871N2404q2625K0187r078
6726F4964k2424L0445m3576m0428M2780K0737l2097m6207l6775O941n64o5912
6714a22116M814L1628o1037K7263n7189J7117M6476L766J21992J4925r6631O9888
6702H96M1641j3899k7666j6274l4277K1254P1550L8982K3913o4979j6441M7167
$$ plain form
6786 -124178 -88865 24585 92329 55095 55806 96659 -7817 -46869 -19064 31257 8871 -24572
6774 -24572 -68085 -81121 -85588 -39649 -53449 -88451 -79290 -47143 8412 59725 74907 58093
6762 58093 24876 -87162 -81977 8545 38773 -33403 35113 -23383 -1367 15087 -9666 -36376
6750 -36376 -117760 -44655 -25142 24999 75641 -20327 -90487 -120108 -51047 8372 64673 67165
6738 67165 39750 83911 50462 42030 26196 20610 36205 84076 136480 53855 74042 64964
6726 64964 42540 72985 29409 -11019 31761 52498 20401 -25806 -62581 -55640 -56204 -122116
6714 -122116 -117302 -85674 -146711 -119448 -176637 -159520 -113044 -109278 12714 27639 -68992 896
6702 896 42537 28638 972 -15302 -49579 -28325 43225 82207 106120 41141 24700 71867
6690G1867k2923l7734N139L8612Q104L6483N1188J5001n0953j00298Q6341J0757
6678A11584q7518k7520J6168K0949K3142j8611m4146J9341M8004M380l8445n6729
6666b9401j6026k2333l3189r411K8305P4829J39763L5088k8326j37094l1536M2025
6654A2694J03264j1279o0181j3047O3237l4713M9274m2530l8514L9666q7373p5932
6642i5434J958p233l0433r020M8070M9523J23P640R8895J29405K082l8291l8482
6629A18803m1202K9917k8476j34520j9224L0169k6868o2448J2734J11367q438
6618a8186M498m8460j742N389p4343l2331l3428K1359Q5682q933j0568O7033L6672
6605g358j1953o8078k5586K5081J01713N3294n491N4460J00467j3384q2509j5105
$$ plain form
6690 71867 48944 11210 16349 54961 63065 99548 150736 165737 114784 14486 100827 111584
6678 111584 24066 -3454 12714 33663 56805 38194 -5952 13389 61393 65773 27328 -29401
6666 -29401 -45427 -67760 -100949 -110360 -82055 -7226 132537 167625 139299 2205 -29331 12694
6654 12694 115958 104679 44498 31451 94688 59975 109249 66719 28205 67871 -19502 -95434
6642 -95434 -93476 -100709 -131142 -140162 -92092 -42569 -42446 -34806 64089 193494 195576 157285 118803
6629 118803 77601 107518 79042 -55478 -74702 -44533 -71401 -133849 -121115 -9748 -18186
6618 -18186 -13688 -62148 -63890 -58501 -132844 -165175 -198603 -177244 -91562 -100495 -111063 -44030 -7358
6605 -7358 -19311 -87389 -112975 -87894 13819 67113 61622 116082 216549 203165 120656 105551
6593A05551J9629k2181M6709N501k8122n5104l0205k5313l8142m9524k1917J27807
6581C4689l7571p791N063k5105n675N4642j0621K6775k6432r2571l5146j2151
6569a31894N1556M3854n3212O3947P526k4785Q7544n2592M320o034j2515L7745
6557A5460K0566k6778o398j17570p6454J11462O100k2491M8796j3933J7099Q6456
6545D2315l4237J52m1094K6057p4694k8559J3994m3094N7623P4452O3207M523
6533F0645o8359j5299l5172o9125L4252J32126N5305p2221j4785K8532n0621l8351
6521e3073J5529j9242n3378j4653p3553J2948N0137J72481L5656j6898j24035
6510f8081K2559k259M2073K678o6299N3521l4625k8673m2747L03K4441J12737
$$ plain form
6593 105551 125180 102999 149708 155209 127087 71983 41778 16465 -21677 -71201 -93118 34689
6581 34689 -2882 -10673 -5610 -30715 -36390 18252 7631 34406 7974 -84597 -119743 -131894
6569 -131894 -80338 -36484 -89696 -25749 -18223 -43008 44536 -8056 -3736 -9770 -22285 15460
6557 15460 36026 9248 2850 -114720 -191174 -79712 -73612 -96103 -47307 -61240 -44141 42315
6545 42315 8078 8230 -32864 -6807 -81501 -110060 -96066 -139160 -81537 -7085 56122 60645
6533 60645 -7714 -23013 -58185 -127310 -93058 39068 94373 22152 7367 35899 -14722 -53073
6521 -53073 -37544 -56786 -110164 -124817 -198370 -185422 -135285 37196 72852 55954 -68081
6510 -68081 -45522 -47781 -5708 -3030 -69329 -15808 -50433 -79106 -121853 -121550 -97109 15628
6498A5628k6907P5234k7643q6855L1276l6220j8574L9180j9864k1102k750n0254
6486a28851p5666K8568J04238J17568m463n6059l3719K0509L4936n1542l7426
6475h1907M6139L7528n6867J3166K3108Q1184L3574r9465k2115j3092N143J084
6463c2520Q49R103j4361L5911K5230j60097J0604P5162j9392l0452N0067J4582
6451c5314J8796o3167k43l1042K8866J00283m4412j34726j7258K6204K8996r5
6439a23112m084P7903k3987k5427m069L0365K9498n3521k4633N080K3781l1261
6427a23467l7636L8843o0821K881J9055J7347R853Q816N8857k3426K2795J18931
6415E2028J19743m326l5204p646J0536n1491n4603k2322l3465J8419O2095K9617
$$ plain form
6498 15628 -11279 63955 36312 -50543 -19267 -55487 -74061 -34881 -54745 -75847 -78597 -128851
6486 -128851 -204517 -175949 -71711 45857 41394 -14665 -48384 -27875 7061 -44481 -81907
6475 -81907 -35768 1760 -55107 -41941 -18833 62351 95925 -3540 -25655 -38747 -33604 -32520
6463 -32520 -31671 -22568 -36929 -1018 24212 -135885 -125281 -50119 -69511 -99963 -49896 -35314
6451 -35314 -16518 -79685 -79928 -110970 -82104 18179 -26233 -160959 -178217 -152013 -123017 -123112
6439 -123112 -127196 -49293 -73280 -98707 -102776 -72411 -42913 -96434 -121067 -115987 -92206 -123467
6427 -123467 -161103 -122260 -183081 -180200 -161145 -143798 -133945 -125129 -66272 -89698 -66903 52028
6415 52028 171771 167445 132241 124595 135131 83640 29037 6715 -26750 -8331 53764 83381
6403H3381n9662l5013k2132J3068K2737m5394k8721N8634J0585J9184K4155O781
6391D7603J6439L5131L536k7450m1768m1573Q1945k2708o6692j2858K2583m779
6379a0591l8713m85J4039k068R309k3733K8530N8299k6132r5775k8475J6753l9891
6366a38933Q6207J20744n239r2816l1390j4325J8643J4694k0241N3780P5375j5502
6354E0997M2603J1439k8598q511o58o4361J5684o7666r6757n8669M0081J0382
6342a54034M3455K9245L7715n364n4421M6908J31611K6297j14039J1040P6786
6331G5199l7609n1233K349j2816n5240k7600k6351n411J965L6563Q870o0688Q5386
6318f6616K8185O1007N3152l9805O46J4215N0603o306j03510o4527l3758O780
$$ plain form
6403 83381 23719 -11294 -33426 -20358 2379 -43015 -71736 -13102 -2517 16667 40822 47603
6391 47603 64042 99173 102709 75259 33491 -8082 73863 51155 -15537 -28395 -5812 -10591
6379 -10591 -49304 -49789 -35750 -37818 -28509 -52242 -23712 34587 8455 -87320 -115795 -99042 -138933
6366 -138933 -52726 68018 62779 -30037 -61427 -75752 -57109 -42415 -62656 -8876 66499 50997
6354 50997 93600 105039 76441 67930 67272 2911 18595 -49071 -145828 -204497 -164416 -154034
6342 -154034 -110579 -81334 -43619 -48983 -103404 -56496 75115 101412 -12627 -1587 75199
6331 75199 37590 -13643 -11294 -24110 -79350 -106950 -133301 -138712 -136747 -100184 -91314 -152002 -66616
6318 -66616 -38431 22576 75728 35923 36569 50784 101387 95081 -8429 -72956 -106714 -99934
6306i9934j3661J5534K1857O0683M2888l8405N5618O8241r826r5692o4611J02818
6294D5510K9595p015m9263r4576J47k7470M0671J8499L0530n626m6997J16374
6282E0379j4432o9376p4971p773j7094n3993l5708N9034J09098J19696l5315n5796
6270b6251j05722m8781L6868M6306J34517q796p4292j186P6803l703N4959L8321
6258A19043L2859p6039l2810k569j909n4573K0355K8384j5033j7155m7179P718
6246c8908K5883J2277q3892L6730m8586m0088J0963m4300J05531N5795k5079q1391
6234a15065n6414O7984K9176L1785k1935L8186J6588R7644K9274J2346R0964p458
6222B13075o7647r8514j02869O1786J04352j7259k4125m1981q0196L5844K2533
$$ plain form
6306 -99934 -113595 -98061 -76204 -15521 27367 -11038 44580 112821 102995 7303 -57308 45510
6294 45510 75105 68090 18827 -75749 -75602 -103072 -62401 -43902 -13372 -18998 -65995 50379
6282 50379 35947 -33429 -108400 -116173 -133267 -187260 -222968 -163934 -54836 64860 29545 -26251
6270 -26251 -131973 -180754 -143886 -97580 36937 28141 -46151 -47337 29466 25763 80722 119043
6258 119043 151902 75863 43053 40484 38575 -15998 4357 32741 17708 553 -46626 -38908
6246 -38908 -13025 -748 -84640 -47910 -96496 -136584 -125621 -169921 -64390 -8595 -33674 -115065
6234 -115065 -171479 -103495 -74319 -42534 -64469 -26283 -9695 87949 117223 129569 220533 213075
6222 213075 145428 46914 -55955 5831 110183 92924 68799 26818 -53378 -17534 4999
6211D999L3438p4340m7466J5871O6148l5589q4048k9295J4809M9960M2853O2407
6199A9747K8101o739J3456l7041r8830K53L8218J3467L7261l031n5400J4592N9335
6186B3389M9114K6801j7129m2367n377L6886O635P5777N7559k5667k22283m1010
6174g7672P8750K8192j2424l1684O7950o1p6398R7853K1672j3309m0023q0433
6162c7587O4126l3879l7954m691N1612l2508j0347Q4555M529m346J02294p384
6150A38420l4138J03171J5828p1387k6321M3468M9580n7194j11309j13863j0239
6139g3984N8368k3269j24581R233O5197N4575K9856N2587m580K7609L6503o0342
6127D7172j3060K7949R854n5405n8218M0245j4955l986J7082n947P696O2203p4417
$$ plain form
6211 4999 38437 -35903 -83369 -67498 -1350 -36939 -120987 -150282 -135473 -85513 -42660 19747
6199 19747 47848 41109 54565 17524 -81306 -81053 -42835 -29368 7893 4862 -50538 -35946 23389
6186 23389 72503 99304 82175 39808 34431 71317 77952 153729 211288 185621 -36662 -77672
6174 -77672 1078 29270 16846 -14838 53112 53051 -23347 74506 96178 82869 42846 -37587
6162 -37587 26539 -7340 -45294 -49985 1627 -30881 -41228 43327 47856 43510 145804 138420
6150 138420 104282 207453 223281 151894 125573 169041 218621 161427 50118 -63745 -73984
6139 -73984 -15616 -38885 -163466 -154233 -89036 -34461 -4605 47982 43402 71011 107514 47172
6127 47172 34112 62061 71915 16510 -41708 -1463 -16418 -20404 -3322 -9269 -1573 60630 -13787
6114a3787o1355L6160K058L5638L2188P206J9632K7793l9786m8479K5723n060
6102A7931m1561K9077L1678r692k099m125N4530K7650l6474m6623k9032N693L4125
6089C1078p4031p254N9134M108j0472Q368k7512l105N8012p3264k5607k6201m6276
6076a33022l2005N6257K2272o7286J0099P3550j5675L6177r637q1939K8341P4141
6064c8727j8457l3501p0386K6748O5889Q5368N546N4004j1134q2484K188l1108
6052d6054j7268Q8102J2544q9368l5093L2341q708k0785L9037K168L928k1614
6040f0770l3427j359J7979L3187Q46m6744o380N8177Q991p9263J5590n060j2777
6027a11010l8807N5526R6109R6310J17334J1559p9200j34013j06643j1855q1581
$$ plain form
6114 -13787 -75142 -38982 -36924 -1286 30902 38108 57740 85533 45747 -2732 22991 17931
6102 17931 -23630 5447 37125 27433 25334 21209 75739 103389 66915 20292 -8740 -3047 31078
6089 31078 -42953 -50207 8927 13035 2563 10931 -16581 -19686 38326 -34938 -60545 -86746 -133022
6076 -133022 -165027 -108770 -86498 -153784 -143685 -70135 -85810 -49633 -59270 -141209 -112868 -38727
6064 -38727 -57184 -90685 -161071 -134323 -68434 16934 22480 76484 65350 -17134 -14946 -46054
6052 -46054 -63322 24780 37324 -52044 -87137 -54796 -63504 -84289 -45252 -43084 -39156 -60770
6040 -60770 -94197 -95556 -77577 -44390 -43544 -90288 -96668 -38491 -29500 -108763 -93173 -98233 -111010
6027 -111010 -149817 -94291 1818 98128 215462 227021 147821 13808 -92835 -104690 -186271
6016a86271j1545J15689J03622r659K7906J1519N0996j8248j38894n1355O2472
6005d3768N6072O557j584o32L6135Q2661K1218j25540p8392J7907M6802K6544
5993D3980l0543l2822J5913n7564M0947O8171N5095j5752j03153q3290O5864L7616
5981D462j7884L4931L9148j482m2343q1985R2368K9491r4282p0463P1937J5855
5969b0247k6664R2430o475m2705N0491n3899o1631L2350k2607m3212l4454L9939
5957i6684L708K7639P4657l7938K7294n9478J7855J3991m0856j6356K6299K4397
5945c5472P0415J12751m2819M0297J4340n6325j12811l6544j9988p7353k8223
5934a71732K7761L8715O9476J9412L5582q819l4572k2855L4737L0797j1619k8848
$$ plain form
6016 -186271 -197816 -82127 21495 11836 39742 51261 102257 84009 -54885 -106240 -43768
6005 -43768 12304 18861 17277 16645 52780 135441 156659 31119 -47273 -29366 17436 43980
5993 43980 13437 -19385 -3472 -61036 -20089 48082 103177 87425 -15728 -99018 -33154 4462
5981 4462 -13422 21509 60657 59175 16832 -65153 27215 56706 -37576 -108039 -36102 -20247
5969 -20247 -46911 45519 39044 -3661 46830 -7069 -68700 -36350 -58957 -102169 -136623 -96684
5957 -96684 -92976 -65337 9320 -28618 -1324 -60802 -42947 -28956 -69812 -86168 -59869 -35472
5945 -35472 34943 147694 104875 145172 159512 103187 -9624 -46168 -66156 -143509 -171732
5934 -171732 -143971 -105256 -35780 -16368 19214 10395 -24177 -47032 -12295 18502 6883 -21965
5922b1965O0718L4300Q500k2175k8310P29j22789j5857N7660O7790k339O473l298
5909A9437K2845j4685l8741K4589r548L3543l930p6459L579k352o2743O1799L3207
5896i459j780J0876L2392N9827k5619l4329j23842j7571J10904m274k4718K6778
5884h15P045l2435k2849k00j4108l6088M1298L5593J4004p299J8755j3962N2945
5871D1884J3341l8667L8230m0363K5780J2152J3271o3368O847l1067j8607J9298
5859b1269n5500p1826J00007k1137J0095L3947L9581n914J9261l1808q7926p5449
5847a67938P830J11702J7739j8407N9224J5855m7546q564j5770J1423O430K5428
5835b594J7401o493l2212K0836l0204k0254L9956j2346L6776m415K6837j0822
$$ plain form
5922 -21965 38753 73053 81553 59378 31068 31797 -90992 -106849 -49189 18601 16262 22735 19437
5909 19437 42282 27597 -11144 13445 3897 37440 33510 -42949 -39370 -41722 -104465 -42666 -9459
5896 -9459 -11239 -363 32029 91856 66237 31908 -91934 -109505 1399 -2875 -27593 -815
5884 -815 6230 -26205 -49054 -49254 -63362 -99450 -58152 -22559 -8555 -15854 2901 -11061 41884
5871 41884 55225 16558 54788 14425 40205 52357 65628 2260 9107 -21960 -40567 -21269
5859 -21269 -76769 -148595 -48588 -69725 -59630 -25683 13898 7984 27245 -4563 -92489 -167938
5847 -167938 -160108 -48406 -30667 -49074 10150 26005 -21541 -30105 -45875 -34452 -28022 -2594
5835 -2594 14807 8314 -23898 -3062 -33266 -53520 -13564 -25910 10866 6451 33288 22466
5823B2466L8353M7584l7238k760k7089N412r1413n3489R590N2104L0229k5308
5811c1559K0075m6487n6644m777J9836o5764J8271R0208J7484m1796K5244K2193
5799c3716m4171k9979K9235q1709j1911L2625O9877O1365L2166p5934n6429J9922
5787h8659k8734J9689J1682K3546O1812k9741M5269J708m3367k7654j0178m886
5775f9513l3818q109K7806Q4671L1479R673L1389J5758n8829n8572J42199Q1845
5763A95979o0993l5017k2674N7216j7806r4629q2782J03688l1107p1974m2930
5752a03029K0272r321j4380L9636k6537l2573J6366L194m2318P4625J3856O7194
5740F985o535p829L5330k26J2966l8171r740K8048N2992N1794K785J9574k6779
$$ plain form
5823 22466 60819 108403 71165 68405 41316 46728 -44685 -98174 -88584 -36480 -6251 -31559
5811 -31559 -11484 -57971 -114615 -119392 -99556 -165320 -147049 -56841 -39357 -81153 -55909 -33716
5799 -33716 -77887 -107866 -78631 -160340 -172251 -139626 -69749 -8384 23782 -52152 -108581 -88659
5787 -88659 -117393 -97704 -86022 -62476 -664 -30405 14864 16572 -26795 -54449 -64627 -69513
5775 -69513 -103331 -111440 -83634 1037 32516 42189 73578 89336 30507 -28065 114134 195979
5763 195979 134986 99969 77295 134511 116705 22076 -60706 42982 11875 -60099 -103029
5752 -103029 -82757 -92078 -106458 -66822 -93359 -125932 -109566 -106372 -148690 -74065 -60209 6985
5740 6985 450 -7379 27951 27725 40691 2520 -7220 20828 73820 125614 128399 147973 121194
5727A21194m0871k237R498K4295l3811k3978O4639J1755K0674m3978j4623O10
5715I3167l7854l1240k8992p7754j0376N9294l5411j9583L9363n9327M8954R8367
5703C8608K1726l9397q3094l448k5989l5845J46354j5950n0914l9307K0148K6221
5691d0887Q2430P3069n3763J7110j751r182J1840P4863j11985j23746O3958j01136
5679a19180l0870Q8417m600k0466M4295N1108L1951K5257j9188m3487Q9020l9359
5667E2898p7444m6423K0650j2103M3508M7521J8089Q248o455j7410n7613K8008
5655A474k8785J7281R1086Q3974m6786j6559q5255k7615J28952O0425k2676n5326
5643A00190m3509o4654l2148J0403N9230k9254Q483J641J7104M750l4334M20L9172
$$ plain form
5727 121194 80323 78086 87584 111879 78068 54090 118729 130484 151158 107180 92557 93167
5715 93167 55313 24073 -4919 -82673 -93049 -33755 -69166 -88749 -49386 -108713 -59759 38608
5703 38608 60334 20937 -62157 -65605 -91594 -127439 18915 2965 -47949 -87256 -67108 -40887
5691 -40887 41543 114612 60849 77959 76208 67026 78866 153729 41744 -82002 -18044 -119180
5679 -119180 -150050 -61633 -66233 -86699 -42404 8704 40655 65912 46724 3237 92257 52898
5667 52898 -24546 -70969 -50319 -62422 -18914 28607 46696 54944 48489 31079 -26534 1474
5655 1474 -27311 -10030 81056 165030 118244 101685 16430 -11185 117767 178192 155516 100190
5643 100190 56681 -7973 -40121 -29718 29512 258 8741 10382 27486 32236 -2098 -1678 37494
5630C7494n2993O5490N8470p0863o9009k8328L0290M7691O1375j6639r3411K435
5618b7998Q5717M9248n8964l1622O820K1559L8915m0859p4001n4652q9118J544
5606a73411J08591N4699m9723J3739O8960O12k5897L4480N0252k5611q6966p2369
5594a02644k9443m4374J9307o9379N4614J53383J9668l5742p0634Q386K3068J13109
5582C9319K4018m8189J6474J0410o46M1241K6351j12099p1004M2519J7252j3981
5570b8335k2287o2900k0077J317P5625m3569J4540J09881N4442l6207n6184M8721
$$ plain form
5630 37494 -15499 49991 108461 37598 -31411 -59739 -29449 18242 79617 62978 -30433 -27998
5618 -27998 57719 106967 48003 16381 23201 44760 83675 42816 -31185 -85837 -174955 -173411
5606 -173411 -64820 -10121 -59844 -46105 22855 23467 -2430 32050 82302 56691 -30275 -102644
5594 -102644 -132087 -176461 -157154 -226533 -171919 -18536 1132 -34610 -105244 -96858 -73790 39319
5582 39319 63337 15148 31622 42032 41386 82627 108978 -3121 -74125 -31606 -14354 -28335
5570 -28335 -50622 -113522 -133599 -132282 -56657 -100226 -85686 24195 78637 42430 -13754 34967
$$ [...]
##END NTUPLES=NMR SPECTRUM
##END=
