##TITLE=Analysis number 327674
Compound Code km 04597
Book Reference 149543
Project Code adrs flro3
Chemist Name jom
##JCAMPDX= 6.0         $$ Bruker NMR JCAMP-DX V2.0
##DATA TYPE= NMR SPECTRUM
##DATA CLASS= NTUPLES
##ORIGIN= Bruker BioSpin GmbH
##OWNER= nmr
$$ XWIN-NMR		Version 3.5
$$ Fri Mar 30 10:34:12 2007 GMT Daylight Time (UT+1h)  MAYBRIDGE\nmr@NMR_250MHZ
##.OBSERVE FREQUENCY= 250.131544655141
##.OBSERVE NUCLEUS= ^1H
##.ACQUISITION MODE= SIMULTANEOUS (DQD)
##.ACQUISITION SCHEME= undefined
##.AVERAGES= 16
##.DIGITISER RES= 18
##SPECTROMETER/DATA SYSTEM= dpx250
##.PULSE SEQUENCE= zg30
##.SOLVENT NAME= CDCl3
##.SHIFT REFERENCE= (INTERNAL, CDCl3, 0, 16.522)
##AUDIT TRAIL= $$ (NUMBER, WHEN, WHO, WHERE, WHAT)
$$ ##TITLE= Audit trail, XWIN-NMR		Version 3.5
$$ ##JCAMPDX= 5.01
$$ ##ORIGIN= Bruker BioSpin GmbH
$$ ##OWNER= nmr
$$ C:\u/data/dgb/nmr/ADRS/2710/pdata/1/auditp.txt
$$ ##AUDIT TRAIL=  $$ (NUMBER, WHEN, WHO, WHERE, WHAT)
(   1,<2007-03-30 10:33:49.42 +100>,<MAYBRIDGE\nmr>,<NMR_250MHZ>,
      <created by zg, POWCHK disabled, PULCHK disabled
       configuration hash MD5:
       49 4B E0 1D 92 C2 6B 37 9F E6 65 BC 52 41 86 1D
       data hash MD5: 64K
       DB 7C FA 53 4A E4 FC 20 C3 C5 2F B6 A4 A5 43 01>)
(   2,<2007-03-30 10:34:02.40 +100>,<MAYBRIDGE\nmr>,<NMR_250MHZ>,
      <Start of raw data processing
       ef LB = 0.3 FT_mod = 6 PKNL = 1 SI = 32K 
       data hash MD5: 32K
       A7 B5 FF DB D6 8F 7C C3 16 A3 B3 52 B9 B2 1D F5>)
(   3,<2007-03-30 10:34:04.12 +100>,<MAYBRIDGE\nmr>,<NMR_250MHZ>,
      <apk 
       data hash MD5: 32K
       73 2B E5 A5 34 05 E9 AB 47 F2 78 9A DC D9 4C 3D>)
(   4,<2007-03-30 10:34:04.87 +100>,<MAYBRIDGE\nmr>,<NMR_250MHZ>,
      <abs ABSG = 5 
       data hash MD5: 32K
       B0 8D 51 F2 16 79 23 29 DC C9 41 5F 43 64 D9 50>)
$$ ##END=
$$ 
$$ hash MD5
$$ B0 A8 74 3D 4A 73 56 CA B9 00 BE 66 74 AB AA 6E
##$RELAX= 
##$RELAX= 
##$RELAX= 
##$RELAX= 
##$RELAX= 
##$RELAX= 
##$RELAX= 
$$ Bruker specific parameters
$$ --------------------------
##$DU= <C:\u>
##$EXPNO= 2710
##$NAME= <ADRS>
##$PROCNO= 1
##$TYPE= <nmr>
##$USER= <dgb>
##$AMP= (0..31)
100 100 100 100 100 100 100 100 100 100 100 100 100 100 100 100 100 100 
100 100 100 100 100 100 100 100 100 100 100 100 100 100 
##$AQSEQ= 0
##$AQ_mod= 3
##$AUNM= <au_zg>
##$AUTOPOS= <56 >
##$BF1= 250.13
##$BF2= 250.13
##$BF3= 250.13
##$BF4= 250.13
##$BF5= 500.13
##$BF6= 500.13
##$BF7= 500.13
##$BF8= 500.13
##$BYTORDA= 1
##$CFDGTYP= 0
##$CFRGTYP= 5
##$CHEMSTR= <none>
##$CNST= (0..31)
1 1 145 1 1 1 1 1 1 1 1 1 1 1 1 1 1 1 1 1 1 1 1 1 1 1 1 1 1 1 1 1 
##$CPDPRG= <>
##$CPDPRG1= <>
##$CPDPRG2= <>
##$CPDPRG3= <>
##$CPDPRG4= <mlev>
##$CPDPRG5= <mlev>
##$CPDPRG6= <mlev>
##$CPDPRG7= <mlev>
##$CPDPRG8= <mlev>
##$CPDPRGB= <>
##$CPDPRGT= <>
##$D= (0..31)
0 1 0 0 0 0 0 0 0 0.06 0 0 0 0 0 0 0.0002 0 0 0 0 0 0 0 0 0 0 0 0 0 0 
0 
##$DATE= 1175247228
##$DBL= (0..7)
120 120 120 120 120 120 120 120 
##$DBP= (0..7)
150 150 150 150 150 150 150 150 
##$DBP07= 0
##$DBPNAM0= <>
##$DBPNAM1= <>
$$ [...]
##$SUBNAM7= <"">
##$SUBNAM8= <"">
##$SUBNAM9= <"">
##$SW= 20.6930455092707
##$SWIBOX= (0..15)
0 0 3 0 0 0 0 0 0 0 0 0 0 0 0 0 
##$SW_h= 5175.983436853
##$TD= 65536
##$TD0= 1
##$TE= 683.16
##$TE2= 300
##$TE3= 300
##$TEG= 300
##$TL= (0..7)
0 120 120 120 120 120 120 120 
##$TP= (0..7)
150 150 150 150 150 150 150 150 
##$TP07= 0
##$TPNAME0= <>
##$TPNAME1= <>
##$TPNAME2= <>
##$TPNAME3= <>
##$TPNAME4= <>
##$TPNAME5= <>
##$TPNAME6= <>
##$TPNAME7= <>
##$TPOAL= (0..7)
0.5 0.5 0.5 0.5 0.5 0.5 0.5 0.5 
##$TPOFFS= (0..7)
0 0 0 0 0 0 0 0 
##$TUNHIN= 0
##$TUNHOUT= 0
##$TUNXOUT= 0
##$USERA1= <user>
##$USERA2= <user>
##$USERA3= <user>
##$USERA4= <user>
##$USERA5= <user>
##$V9= 5
##$VALIST= <valist>
##$VCLIST= <CCCCCCCCCCCCCCC>
##$VD= 0
##$VDLIST= <DDDDDDDDDDDDDDD>
##$VPLIST= <PPPPPPPPPPPPPPP>
##$VTLIST= <TTTTTTTTTTTTTTT>
##$WBST= 1024
##$WBSW= 4
##$XGAIN= (0..3)
0 0 0 0 
##$XL= 0
##$YL= 0
##$YMAX_a= 608581
##$YMIN_a= -661136
##$ZGOPTNS= <>
##$ZL1= 120
##$ZL2= 120
##$ZL3= 120
##$ZL4= 120
##$ABSF1= 16.522
##$ABSF2= -4.171173
##$ABSG= 5
##$ABSL= 3
##$ALPHA= 0
##$AQORDER= 0
##$ASSFAC= 0
##$ASSFACI= 0
##$ASSFACX= 0
##$ASSWID= 0
##$AUNMP= <proc_1d>
##$AZFE= 0.1
##$AZFW= 0.1
##$BCFW= 0
##$BC_mod= 0
##$BYTORDP= 0
##$COROFFS= 0
##$CY= 12.5
##$DATMOD= 1
##$DC= 0
##$DFILT= <>
##$DTYPP= 0
##$F1P= 14.0000005364418
##$F2P= -0.99999901652339
##$FCOR= 0.5
##$FTSIZE= 32768
##$FT_mod= 6
##$GAMMA= 0
##$GB= 0
##$INTBC= 1
##$INTSCL= 1
##$ISEN= 128
##$LB= 0.3
##$LEV0= 0
##$LPBIN= 0
##$MAXI= 10000
##$MC2= 0
##$MEAN= 0
##$ME_mod= 0
##$MI= 0
##$NCOEF= 0
##$NC_proc= -3
##$NLEV= 6
##$NOISF1= 0
##$NOISF2= 0
##$NSP= 0
##$NTH_PI= 0
##$NZP= 0
##$OFFSET= 16.522
##$PC= 1
##$PHC0= 234.4897
##$PHC1= 1.252254
##$PH_mod= 1
##$PKNL= yes
##$PPARMOD= 0
##$PSCAL= 4
##$PSIGN= 0
##$REVERSE= no
##$SF= 250.13
##$SI= 32768
##$SIGF1= 0
##$SIGF2= 0
##$SINO= 400
##$SIOLD= 32768
##$SREGLST= <1H.CDCl3>
##$SSB= 0
##$STSI= 32768
##$STSR= 0
##$SW_p= 5175.98343685301
##$SYMM= 0
##$S_DEV= 0
##$TDeff= 65536
##$TDoff= 0
##$TI= <Analysis number 999999
Compound Code 99
Book Reference 9
Project Code 9>
##$TILT= no
##$TM1= 0
##$TM2= 0
##$TOPLEV= 0
##$USERP1= <user>
##$USERP2= <user>
##$USERP3= <user>
##$USERP4= <user>
##$USERP5= <user>
##$WDW= 1
##$XDIM= 32768
##$YMAX_p= 296375238
##$YMIN_p= -58177
$$ End of Bruker specific parameters
$$ ---------------------------------
##NTUPLES= NMR SPECTRUM
##VAR_NAME=  FREQUENCY,     SPECTRUM/REAL,   SPECTRUM/IMAG
##SYMBOL=    X,             R,               I
##VAR_TYPE=  INDEPENDENT,   DEPENDENT,       DEPENDENT
##VAR_FORM=  AFFN,          ASDF,            ASDF
##VAR_DIM=   32768,         32768,           32768
##UNITS=     HZ,            ARBITRARY UNITS, ARBITRARY UNITS
##FACTOR=    0.157963299565203, 1,           1
##FIRST=     4132.6476996994, 0,             0
##LAST=      -1043.33573715361, 0,           0
##MIN=       -1043.33573715361, -58177,      0
##MAX=       4132.6476996994, 296375238,     0
$$ Real data points
##PAGE= N=1
##DATA TABLE= (X++(R..R)), XYDATA
$$ [...]
24388a922n35J5743l542n166k060m48l636P946M183o668O906k778k489p021J382
24373a05q744j4475p136J1028J0980L888N864J0008n96p111j6165j9400J2003
24360a9961K1037O531k740m462J231p619L299J042m554l681O267O220o86k028
24346a04j2048M844O584J4913k401j5350j7579p050J1420L188l76l448N983J2260
24332H36J7609P283N774J519k228j2101j8913k487q076o029O433n554m117M73
24318a9578R894q62O36L594M339k730J3356m369j7371j2355o026j119O768Q365
24304a7458J4006J3673p841j1855J246l749J157O497K0049L818p931j3644j2592
24291a4624J0892P250m439n4k218M520j0217p745Q807K771L000o667J787q661
$$ y = [-1922, -2457, 13286, 9744, 4578, 2518, 2070, -1566, 6380, 10563, 3895, 10801, 8023, 5534, -1487, -105, -8849, -23324, -30460, -19432, -8452, -4564, 1300, 11308, 10712, 3601, -12564, -31964, -19961, 1076, 7607, 4867, 405, 1636, -5983, -2684, -1642, -6196, -9877, -3610, 2610, 1924, -104, -12152, -7308, -724, 14189, 11788, -3562, -21141, -28191, -16771, -13583, -13959, -17407, -11424, 836, 18445, 25728, 31502, 33021, 30793, 18692, -221, -2708, -10784, -16813, -10380, -15934, -20051, -19578, -9684, -10546, -9910, -6316, -1977, -4707, 8649, 4280, -13091, -25446, -31472, -32591, -25823, -17458, -3452, 10221, 2380, -9475, -8229, -11978, -10821, -4324, 15725, 19543, 11612, -2032, -14624, -3732, 3518, -921, -975, -3193, 1327, -8890, -16635, -7828, -5057, -2057, -8724, -6937, -15598]
24277a5598r585J8423R03J003n21j02r902p336R137O630o23J1003L212j919O628
24262A1353j895o979j3371L65J5118O562l411r186j3812J1162J6193j308j0162
24249F29j1933j212P318k525K133R329N37j2418k974Q835m793o379K600m677K557
24234a2973R903j515J1417J4198n204q428k5804m876M113J1997k799r77J2526
24221A578l648k869p807P288k783k308J3603O498K304p286q862K736j906j892
24207e354r44o64n33R473J2273L08M117p539J804L054j1669P582o102j7637O318
24192e513O640P400N580n618Q191j128j514k687j3720m507J1471N26o103K997
24178B015P125M674L548J605k536m414J956q02j7120K94R103R049q276R46J604
$$ y = [-15598, -25183, -6760, -5857, -4854, -5375, -5477, -15379, -22715, -13578, -6948, -7571, 3432, 6644, 4725, 11353, 9458, 2479, -10892, -10527, 4591, 11153, 7742, -1444, -15256, -4094, 12099, 10791, 629, -11304, -12516, -5198, -7723, -5590, 3739, 4276, -8142, -11116, -2281, -7074, -13453, -10853, -15530, -12973, -3070, -4585, 6832, 21030, 15826, 7398, -18406, -23282, -19169, -7172, -9971, -10948, 1578, -2070, -4939, -12746, -5458, -8241, -10549, 3054, 9552, 11856, 4570, -4292, -1556, -3462, -5354, -6298, -6962, -7495, 1978, 14251, 14559, 18676, 11137, 12941, 15995, 4326, 11908, 5806, -11831, -5513, 1127, 8527, 14107, 8489, 16680, 15552, 14038, 11351, -2369, -6876, 4595, 5121, -982, 2015, 9140, 13814, 17362, 18967, 16431, 12017, 13973, 13171, -3949, -3655, 5448, 14497, 6221, 7167, 8771]
24163H771N12J596j389j5977j0912R158J464k041l910R252P083L102r929N646
24149B426O165k054j0391p875M129J670L959k774k812O33R755j2140m26p350k064
24134a9149P644j52J2818R753J1158r660o968j5957j0580M086n742O884j0003
24121b5868L647M157j039j477J907J629j3424J859J3483R341P371n632J303M79
24107b264N441q93q588q351P413R128j437n02K447n409m319m746p87J9082L90
24092F605j3122k768p739m403J142J8498J4696K699Q048n324q943M535l028N893
24078A6789L364p25J3244O120m123p967j3996o800j9395n716J0267J0094K37r422
24064h029j5706j38J1004Q815l044q788J775k279j1636O139R881m079p659K770
$$ y = [8771, 9283, 10879, 9490, -6487, -17399, -8241, -6777, -8818, -12728, -3476, 3607, 6709, -3220, 2426, 8591, 6537, -3854, -11729, -7600, -5930, -1971, -4745, -7557, -6924, 2831, -9309, -9735, -17085, -19149, -11505, -11657, 1161, 10914, 22072, 12412, 5444, -10513, -21093, -17007, -22749, -15865, -25868, -22221, -18064, -19103, -20580, -18673, -17044, -30468, -28609, -15126, -5785, 1586, -4046, -2743, -2264, 3177, 2284, -6304, -14655, -7242, 1886, 449, -53, 2394, -3015, -7334, -12080, -12867, 6215, 6605, -6517, -9285, -17024, -21427, -20285, -1787, 12909, 15608, 23656, 18332, 9389, 13924, 10896, 16789, 20153, 19428, 32672, 38792, 34669, 26702, 12706, 5906, -13489, -19205, -8938, 1156, 1393, -8029, -23735, -23873, -12869, -4054, -7098, -15886, -14111, -16390, -28026, -21887, -12006, -16085, -23744, -20974]
24050b0974m891P886N01J0187N17j936n502q941N249o291L688J0779n096o300
24036b1124M644J502K04K255L3J4148P120n799l174m583n981k971p491N619N230
24021a0368o117J0552R647P868p798k2650o226N641K689M424l05p83N043J4129
24007E746k052j453j5169o557K672j924q262K1118R289J568j110j0488K676o556
23993a0502J918p065n039J036Q419K789q699q27o868m144L933K422K1581J3336
23979A2290J507k949l29n703p239r630J0032j733J484Q961J0632M244j8578j9901
23965a6912j606j013l164Q808j1926k912R836n044k562k733J372M691J4859o118
23951a4424q250M915J250j303O664n086p243P618Q118M815r337M004o728N621
$$ y = [-20974, -25865, -17979, -17478, -7291, -6774, -8710, -14212, -23153, -17904, -24195, -20507, -9728, -14824, -21124, -16480, -14978, -14774, -12519, -12486, 1662, 8782, 2983, -191, -4774, -10755, -13726, -21217, -15598, -10368, -16485, -5933, 3714, 11582, 3784, -18866, -25092, -19451, -16762, -12338, -12643, -13426, -8383, 5746, 3694, 2241, -12928, -19485, -16813, -18737, -26999, -5881, 3408, 4976, 3866, -6622, -3946, -10502, -8584, -15649, -20688, -19652, -11233, -8444, -17143, -17970, -24838, -28982, -25049, -22627, -1046, 12290, 13797, 10848, 10519, 4816, -2423, -12053, -2021, -3754, -2270, 6691, 17323, 21567, 2989, -16912, -18518, -19531, -22695, -13887, -25813, -28725, -18889, -23933, -26495, -29228, -27856, -23165, -8306, -14424, -22674, -17759, -16509, -17812, -11148, -16234, -23477, -15859, -7741, -2926, -12263, -8259, -14987, -9366]
23937i366J0662O474N718J395N568K283q603n68j6790o469l573q427j901l337
23923b6934m959P313j223J203m028M019M793j1127Q301J9196j409R189P785M206
23909A6325J431o684p367j7950O99j152p112j884J3314J3173j4217m33J2671k4472
23895b3658l062P790m578K706J0016j384k049J0349J5016J4653J484j1127r978
23882F178m709j0692r144J3441N270L396P310q357M692q91j1170j1635j2665K143
23868b6833M108O028N186k257M66J0719o1p621k06l831j311J0393j0072j0353
23854b5645K02Q485P876k433R559P064k113k549O57P870N620q571n396k0283M88
23839a9169Q712P052L909l278J854r516r998j0744P770P094J976J03O89P663N355
$$ y = [-9366, 1296, 7770, 13488, 14883, 20451, 22734, 14131, 13563, -3227, -9696, -13269, -21696, -23597, -26934, -31893, -24580, -25803, -24600, -28628, -24609, -19816, -30943, -22642, -3446, -4855, 4334, 12119, 16325, 17756, 11072, 3705, -14245, -13546, -14698, -21810, -23694, -10380, 2793, -11424, -11857, 814, -23658, -26720, -18930, -23508, -20802, -10786, -12170, -14219, -3870, 11146, 25799, 27283, 16156, 6178, 1469, -9223, -18367, -4926, 344, 3740, 11050, 2693, 7385, 6494, -4676, -16311, -28976, -26833, -22725, -16697, -11511, -13768, -13302, -2583, -2644, -10265, -10471, -14302, -15613, -5220, -15292, -25645, -25443, -16958, -9082, -11515, -1956, 5108, 2995, 446, 1103, 8973, 14593, 6022, 626, -19657, -19169, -10457, -3405, 504, -2774, -920, -10436, -20434, -31178, -23408, -16314, -14338, -14235, -13546, -5883, -528]
23824e28K90j46L376j1984R299J2828n350j5311j1593o456M996P597Q491l842
23810h333j9457R946N959k065K1p395J6553J5565Q181j0119j5606P396Q152j2084
23796c286r688n926M383J2111K950k016j7723K368J8469L687j1506m31R80J644
23782c984N82R690K458j0624R455N246r480j6088j1642O329N325K472j5128K855
23768b2534k451J5179P837l516j0381J1911J4174o041Q814P108k2292p740K59
23755i673J161P059L556k628k308k871P569j266M545r221m567K103k810j2236
23741b1587M636J1939l171J091j382N065J0083j0862j5384r306j710j94K404j4559
23727d2937J460L620p999R574R137J3255Q615J2700J341j1474m94m451K879j1141
$$ y = [-528, -238, -384, 2992, -8992, 307, 13135, 7785, -7526, -19119, -25575, -20579, -12982, -4491, -8333, -27790, -17844, -11885, -13950, -13929, -21324, -4771, 10794, 18975, 8856, -6750, 646, 8798, -3286, -12974, -18900, -14517, -2406, 544, -1472, -19195, -16827, 1642, 5329, -6177, -6608, -5628, -3984, -3402, 6288, 8746, -1878, 7577, 12823, 3343, -12745, -24387, -18058, -12733, -10261, -25389, -22534, -24985, -9806, -1969, -5485, -15866, -3955, 10219, 4178, 12992, 20100, -2192, -9932, -9673, -8512, -1453, 2103, -525, -2833, -5704, 1865, 599, 5144, -4077, -8644, -6541, -9351, -21587, -16951, -5012, -8183, -7092, -8474, -3409, 6674, -4188, -19572, -28878, -30588, -30782, -28378, -42937, -41477, -37857, -45856, -36282, -27145, -13890, -5275, 7425, 8766, -2708, -3202, -7653, -4774, -15915]
23713a5915k0372l590M491J6146J3954M458M461m578J80p713j760j529n623M162
23699a3228J333L911J4714l691n609J2131j2196K369N504r61o884o170m305m557
23685a7639m882R205N860j1704n367R069q84J0752k641Q41O598J0160p002l725
23671a359m609n006J9442J9644k598j1762j0876k917O050j708J2001M661k1224
23658b61k996J590J6395q467j2036n934k174J3940N926o26m521j1983p602R648
23644i101O320M390K927p019P995j2457n768J4982K085j0376k937j0321Q325L689
23630g266k690L552r65J899p139q250K968R369O568J1414m825j5872j570L095
23616i712j243J5176j297j0414N104K093J731m886m829J4371L136j6297J80j930
$$ y = [-15915, -36287, -39877, -35386, -19240, -5286, -828, 3633, -945, -765, -8478, -10238, -11767, -17390, -13228, -11895, -7984, 6730, 3039, -2570, 9561, -2635, -266, 5238, 4277, -2607, -8777, -13082, -17639, -22521, -13316, -7456, -19160, -24527, -15458, -16342, -5590, -8231, -7390, -792, 9368, 2366, -1359, -5968, -10974, 8468, 28112, 25514, 13752, 2876, -41, 6009, 4301, 16302, 20963, -261, -3257, -1667, 14728, 6261, -5775, -11709, -13883, 57, 5983, 5357, 836, -11147, -18749, -9101, -2781, 1609, 4536, -2483, 5512, -6945, -12713, 2269, 4354, -6022, -8959, -19280, -10955, -7266, -9956, -6404, -7369, -5470, -12609, -20859, -17891, -8522, -1954, 9460, 4635, -11237, -12807, -9712, -10955, 4221, 2924, -7490, -2386, -293, 1438, -3448, -8277, 6094, 9230, -7067, -6887, -8817]
23602h817J1293l935j5242l633N245L086k590m718J206N962J450J1869J7642J376
23588B0194k293j5258k222J1285Q049q718L700K452j5962j2264J2541r024r820
23575a7340n248K5450P826m725N106J1700j1444q186j0617p239L153j3890m795
23562c0249M488O25N766O566J7241K1894Q317k7352j7886j240p612Q347p03n156
23548a6954L912M798J1244R112m362M511L314j879j7001p601k887j5901K818K473
23534b4403q395N363J0464J0923P756j250R567Q517j0919m206M286l340j0961
23521f598L904O373J1572J142k069L982J669m455j5344j1821J0537o975j1894
23508a9977j900L85n420J2076M195L887M184j4733K546j295N964J8018J1662j1837
$$ y = [-8817, 2476, -1459, -16701, -20334, -15089, -12003, -14593, -19311, -18105, -12143, -10693, 1176, 18818, 20194, 17901, 2643, 421, 11706, 19755, 11037, 14737, 17189, 1227, -11037, 1504, -7520, -17340, -22588, 2862, 10688, 5963, 11069, 22769, 11325, 3139, -7478, -14717, -11564, -25454, -30249, -25761, -25136, -19370, -12804, 4437, 26331, 34648, 7296, -10590, -11830, -19442, -11095, -11798, -16954, -13042, -8244, 3000, 12112, 7750, 12261, 15575, 13696, -3305, -10906, -13793, -29694, -26876, -24403, -32798, -27435, -16971, -6048, 1708, 458, 10025, 18542, 7623, 3417, 7703, 4363, -6598, -2694, 3679, 15251, 16393, 14324, 18306, 19975, 15520, 176, -11645, -1108, -8083, -19977, -21877, -21492, -26912, -14836, -10641, -6754, -2570, -17303, -14757, -16052, -10088, 7930, 19592, 7755]
23494G755k4399q980R629L537m622N893j50M452J1657N066r888j7923l565m205
23480b5743R662L454P244J4198o977j3423j8520P596L923Q005P211r475j104j657
23466a5606N407P288l84j0122j4872M377k34J1006k336K418N156N104k704q672
23452a4174j3659J962Q157J3562R738N199J27q480l303k333n480k0834J1782R26
23438a6810j381L142M532l961n157O095M830J030m783L890J7789J5886J533j7518
23424I117q337j7M665R442j0177j3380O435N612N638R469p582r762j3122k857
23410a4856J1828l604l176J118J5944N33M902m604K32l808P576R320n835K311
23396A7881M160j1716j403R02M461j0790l017j1L236q117L782J128L871Q677R284
$$ y = [7755, -16644, -25624, -15995, -12458, -17080, -11187, -11337, -6885, 4772, 9838, -50, -17973, -21538, -25743, -16081, -12627, -5383, 8815, 1838, -11585, -30105, -22509, -18586, -10581, -3370, -12845, -13949, -15606, -10199, -2911, -3295, -13417, -28289, -23912, -24146, -13140, -15476, -13058, -7902, -2798, -5502, -14174, -27833, -25871, -17714, -4152, 5586, 10785, 10912, 2432, -871, -3204, -8684, -29518, -17736, -16810, -18191, -15049, -10517, -14478, -19635, -13540, -8710, -7680, -12463, -8573, 9216, 25102, 26635, 9117, 780, 763, 5428, 14870, 4693, -8687, -2252, 3360, 8998, 18467, 10885, 1123, -11999, -14856, -3028, -6632, -9808, -8690, 7254, 7787, 12689, 8085, 8317, 4509, 12085, 21405, 15570, 17881, 22041, 10325, 8922, 9824, 14285, 3495, 478, 467, 3703, -4414, -632, 496, 4367, 13044, 22328]
23381B2328j4837p861k985M942j904l94J075J1492o445j0738N050Q929q214R506
23367I944J8738m188l0716j0918j24K746j517L426N392R126K0315k511o925K345
23353A5133Q373k204l742l566o226j145K579l665j0664k2961J0590J4063Q06O69
23339a960K801J048j4500r267P719m016J5307k956l458O439P711j3035l20M547
23325c940P963J6662n446n429j2384j965P83P672k69j180Q12q921l34j2747J708
23310a7015j948K947j1348R733L36q155O447R185Q447l441j172K807l687p434
23296a4298Q190J0583J488o194l328j0O354M586r710p261l736m436l221K655j256
23281a9594P650K460M898j960j5150j874Q080J1110J8036m774j7242k460P556
$$ y = [22328, 7491, -370, -3355, 1587, -317, -711, 364, 11856, 5411, -5327, -277, 8652, 438, 9944, 28682, 24494, -6222, -17140, -17264, -14518, -16035, -12609, -7217, 1909, 22224, 19713, 12788, 15133, 23506, 21302, 17560, 13994, 7768, 6623, 9202, 5537, -5127, -28088, -17498, -3435, -2629, -1960, 841, 1889, -12611, -21878, -14159, -18175, -2868, -5824, -9282, -2843, 4868, -8167, -8487, -3940, 4023, 20685, 15239, 9810, -2574, -4539, -3756, 3916, 3647, 2467, 3279, -5642, -5976, -18723, -17015, -18963, -16016, -27364, -17631, -17295, -25450, -19003, -9818, -1371, -4812, -5984, -3177, -6864, -14298, -6108, 4475, 5963, -231, -3559, -3569, 2785, 7371, -2339, -9600, -13336, -17772, -20993, -18338, -19594, -11944, -9484, -4586, -6546, -21696, -23570, -15490, -4380, 13656, 8882, -8360, -10820, -3264]
23268c264O835k218q060K279O613L580J265K781p039o022R671N970o902o999J592
23253H2p227l613R95P571j757n036k250q338n107N56N618J4005L934n199J1557
23238E791Q163J6044k939j6056j9545P761j633r476k1976j3998J3305J5485K415
23225a6659J1222J5762m47j9489q261j992J4880J1039l456m776J0755k490l860
23212B228Q431K243j4653j6312p943L029N59o640J64P592o485J267J0438K0183
23198D101j3182j263R208Q205q24r832o065k655NM018O719q87K890j374M129m774
23182a581m710p309j442p290r314J6164K2984J3755Q391j8351n798n609N136K456
23168G482Q5j3269j3312L092J3996P579k165o656Q731l70J7506Q649M218l177
$$ y = [-3264, 3571, 1353, -6707, -4428, 2185, 5765, 7030, 9811, 2772, -3250, 6421, 12391, 5489, -1510, 82, -7145, -10758, -9763, -2192, -3949, -8985, -11235, -19573, -24680, -24124, -18506, -4501, -567, -5766, 5791, 13954, 29998, 27059, 11003, -8542, -781, -2414, -11890, -33866, -47864, -34559, -19074, -16659, -5437, 10325, 9878, -9611, -17872, -19864, -4984, 6055, 2599, -2177, 8578, 6088, 2228, 10659, 12902, -1751, -18063, -26006, -22977, -22418, -29058, -28894, -21302, -27787, -26520, -16082, 4101, -9081, -10344, -1136, 7069, 6245, -3587, -9652, -12307, -12302, -8284, -1565, -2452, 438, -936, 3193, -1581, -6291, -13600, -15042, -22332, -31646, -15482, 7502, 21257, 29648, 11297, 5499, -110, 5026, 7482, 7567, -5702, -19014, -15922, -1926, 5653, 3488, -3168, 5563, 5193, 22699, 31348, 35566, 32389]
23154C2389j0874N987j5279l905j21j6251j3204Q669J2748j8826j2881K078J2198
23141a7272Q240L159O616m825j6635j7308J11J1369j69j1205J7903J6396M094
23128D74l139K210M744K366j3801j3776J1806L093o680N544J9796j4510j9211
23115b1084k214L897n57r034R380J0532o603q935m473J0115r11K290R977Q985
23101A365k388j1369Q691J236k760q897j1272m108J4080J1047o144J647n420P869
23087f423J0078r328m530j113L593P121Q415L351j0539m609o112R819K096j2568
23073a0749K370J1907L073K428M251J653j001j0756k284m266k106Q663k134L114
23059D163j5352j0605Q319J5029K0726K721k0612k245O914k454m4L419o467r514
$$ y = [32389, 21515, 27502, 12223, 8318, 8197, -8054, -21258, -12589, 159, -18667, -31548, -29470, -17272, -9032, -5873, 743, -4082, -20717, -38025, -37914, -26545, -26714, -37919, -20016, -3620, 474, -2665, -455, 4289, 6655, -7146, -20922, -9116, -6023, -12703, -7159, 12637, -1873, -21084, -23298, -19401, -19958, -28992, -19612, -9080, -15683, -24618, -29091, -18976, -19887, -17597, -7620, 1365, -1023, -12392, -3701, -2465, -5225, -14122, -25394, -29502, -15422, -4375, -10519, -8872, -14292, -6423, 3655, -5673, -10203, -11316, -7723, -602, 7813, 11164, 625, -3984, -10096, -277, 1819, -10749, -8379, 3528, 6601, 9029, 13280, 14933, 13932, 3176, 892, -3374, -5480, 3183, 1049, 4163, -11189, -21794, -13475, 1554, 22280, 25001, 4389, 2144, 9058, 6604, 6560, 9979, 3512, -6002]
23045f002N660J827o869j0406j6211R960J1278Q488o94l127n792j473J0290j1736
23031a4807J286J7980O976j299j5454l337m301o068L653n951K052R33Q706L486
23017f145o337q028Q057j510o034O889k582j2425L332P612N106R346o157p271
23003a6147R843o375J2318M199l215M551P098p623K183K949J256n830Q844J350
22989A5401j4562j8791n133O498K246l752J260j080J0006J671n574l265L94R273
22975e408J0150M362j466j934M900k191j0467M243m853q837l748R95R767O073
22961A586j7123l013p651J427J5730R187O144p429J2258N463j1028p856o249J140
22947g414l512N438p45l274J0500q705m635P022l982J4831Q065n520n496R782
$$ y = [-6002, -342, 1485, -5384, -15790, -32001, -22041, -10763, -2275, -2969, -6096, -11888, -13361, -3071, -14807, -13521, 4459, 11435, 10136, -5318, -8655, -12956, -19024, -15371, -21322, -19270, -18337, -9631, -6145, -12482, -20510, -12453, -13963, -19997, -13108, -15690, -28115, -24783, -17171, -12065, -2719, -8876, -16147, -6304, -12679, -361, 3838, 623, 5174, 12272, 4649, 6832, 9781, 11037, 5207, 14051, 15401, 839, -17952, -23085, -16587, -14341, -18093, -16833, -17913, -7907, -6236, -11810, -15075, -14681, -5408, 4742, 9104, 7638, 5704, 10604, 8413, -2054, 2189, -2664, -11501, -15249, -14254, -4487, 1586, -15537, -18550, -26201, -24774, -9044, 143, 6287, -1142, 11116, 16579, 5551, -2305, -8554, -7414, -10926, -5488, -6233, -9507, 993, -7712, -12347, -5325, -9307, 5524, 13589, 8069, 2573, 12355]
22933A2355q270j6770l502Q801o738l827N461J4397o90m290k020j1617P362J1070
22919A722K790p610k452m888j156N763j0101j7438p917M161J5765J1987R529P821
22905G976r789j5091r081J5101J5433O036j6015j5552J3136J1237j374q188j0616
22892a6787l055j0022k235J6303J1151o179m609n03n113J12J5475J6836n88l61
22878A0425K452Q111n373j6190n30N735J34j9601M933R987j3619o901L409Q506
22864h522K0818q221k2513J517J4739K2223q363o864j4707r75P796j373N293O152
22850G000m479j6798o99P975J7036O748k792j9142o084J7935L44j2098k379L870
22836c563n070J1505K6j4330O568K2136k533j4991j5609r894n759P651j479j3116
$$ y = [12355, 4085, -12685, -16187, -7386, -14124, -17951, -12490, 1907, 1217, -3073, -5093, -16710, -9348, 1722, 4512, -3098, -5550, -10438, -11594, -5831, -15932, -33370, -41287, -37126, -21361, -9374, 155, 7976, -1813, -16904, -25985, -10884, 4549, 10585, -5430, -20982, -7846, 3391, 2017, -6171, -16787, -19842, -29864, -32099, -15796, -4645, -10824, -15433, -15936, -21049, -20937, -5462, 11374, 10786, 10425, 12877, 20988, 15615, -575, -1105, 4630, 4764, -14837, -9904, 83, -13536, -20437, -17028, -8522, 12296, 4075, -18438, -16921, -2182, 20041, 11678, 4814, -9893, -10868, -3072, -4445, 848, 7000, 2521, -14277, -14976, -7001, 10035, 16783, 13991, -5151, -11235, 6700, 7044, -5054, -7433, -3563, -8633, 2872, 2898, -11432, -4864, 17272, 14739, -252, -15861, -25755, -31514, -23863, -25342, -38458]
22822c8458O274O431P228o05O0Q209J26k111q321N191Q765J1589P680l173p60
22807H125J957K488j9909j9110q560o989J0490q55N222J274l743K871j0867r83
22793c8589O434J2237M895j468n505J5152L867n174K235J2057O710n373j4778
22780g300o317N247N572m663p62m486l499j1666o537P903P046J2783L576K402
22766g01O098L547O497o517j1755j4837L643J6481p57q128j779M751N41j0P821
22751D895q833l846K947m245j934J862M244l146N15j193L933p260J526Q286J1333
22736I084L299o323o743R260K47j0674j4852j0715J2954J740M274n909n063L809
22722a5612P708J691p827P069j750L081l270n934k164k911p471j146J2286N467
$$ y = [-38458, -32184, -25753, -18525, -19130, -19070, -10861, -10735, -12846, -21167, -15976, -7211, 4378, 12058, 8885, 8125, 10082, 12570, -7339, -26449, -35009, -41998, -31508, -32363, -27141, -25867, -29610, -26739, -37606, -38589, -32155, -19918, -15023, -16491, -21996, -6844, -2977, -8151, -5916, 6141, 12851, 7478, -7300, -13617, -8370, -2798, -7461, -8223, -12709, -16208, -27874, -34411, -26508, -19462, -6679, -3103, -701, 5397, 8944, 15441, 8924, -2831, -17668, -14025, 2456, 1699, -6429, -8208, -3457, -2916, -2926, 4895, -3938, -7784, -4837, -9082, -11016, -9154, -4910, -8056, -7541, -8734, -4801, -12061, -10535, -2249, 9084, 12383, 6060, -683, 8577, 8824, -1850, -16702, -27417, -14463, -12723, -8449, -14358, -19421, -15612, -7904, -6213, -14040, -6971, -8721, -5640, -8910, -14844, -17008, -19919, -27390, -28536, -16250, -10783]
22708a0783M91P652R777q743Q725N596p908q727j2027l825O709j241Q557Q843
22694C096N280l902K293l652P533J385o203k871o245n644l542R231m933Q714j001
22679d61J336M970m817j1563l610m43n687O68J2274M912k940N469n267p665Q509
22664d315p923o332P128Q301J552p131Q92N796R18M433j2914L176J1625O703k195
22649I714p521j6574q547n009K152K1005O958j0938O949M450p512L952n091p37
22635f749k581M447J1394j4455j3983Q204P695j6232K267Q421n923o891P80J2639
22621a0967P685n441J1816K2142n607k1870j3973n689L881l36k641m298M948J8180
22607b170j593J868j1930q65n087L880K720J6292N082p641n236M500N903j3660
$$ y = [-10783, -10292, -2640, 7137, -1606, 7119, 12715, 4807, -3920, -15947, -19772, -13063, -14304, -5747, 3096, 8376, 4474, 6767, 3115, 10648, 12033, 5830, 2959, -3286, -8930, -12472, -3241, -8174, 540, -461, 875, 5845, 1028, -10535, -14145, -14588, -20275, -19607, -7333, -2421, -5361, 108, -5159, -12824, -4315, -12238, -18570, -11442, -3141, -1589, -8720, -7828, -2032, -1114, 3319, -9595, -6419, 5206, 11909, 9714, 2193, -14381, -22928, -27937, -25785, -4780, 2178, -8760, -1811, 2639, -4873, -921, -6012, -6749, -9330, -4883, 6511, -7944, -21927, -13723, -6028, -22260, -19993, -11572, -17495, -24386, -23606, -10967, -3282, -8723, 3093, 25235, 19628, -2242, -16215, -21904, -18023, -18359, -21000, -25298, -20350, -2170, -3763, -1895, -13825, -14690, -19777, -15897, -13177, 3115, 8197, 556, -4680, -180, 5723, -7937]
22593g937p876k337N911J9299M584j0474j4361Q131k470j1584l589o284J803P175
22579b0009O385l445J3558J0167O578O810k708p260K735n568n531j1340l467R664
22565c431J1164m13o106J535l228J0170J2679j03n599k5629j3385p418R55J1723
22551a7086L038J336K033P2j01J1080J18k422J3305q33j279P28l550r821l917
22536g299M482l679J169r002J0349O226L678N080n386n314q253j76j1806q131
22522b8062K746P103j387P833L783L767K640Q790J703j184j9199p679J1578q952
22508a6520k348N481J0697K0974l353q768k1811j2124J1191J2965p034J634N809
22495c207Q070P072m139n824P787k204r514l711J9466J2590l999Q89J1380j6691
$$ y = [-7937, -15813, -18150, -12239, 7060, 11644, 1170, -13191, -5060, -7530, -19114, -22703, -28987, -27184, -20009, -13624, -17069, -3511, 6656, 13234, 20044, 17336, 10076, 12811, 7243, 1712, -9628, -13095, -3431, 7733, 7320, 1214, 2749, -479, 9691, 22370, 22267, 16668, -8961, -22346, -29764, -28809, -17086, -14048, -12712, -10679, -10607, -10708, 372, 490, -1932, 11373, 10540, 9261, 9989, 6439, -3382, -7299, -2817, -6496, -5327, -14329, -3980, 2246, 5924, 11004, 5618, 304, -7949, -8125, -19931, -28062, -25316, -18213, -19600, -11767, -7984, -4217, -1577, 7213, 8916, 7732, -11467, -19146, -7568, -16520, -18868, -13387, -2690, 18284, 14931, 6163, -15648, -27772, -16581, -3616, -10650, -9016, -3207, 4863, 11935, 7796, 1972, 9759, 7555, -1959, -5670, 13796, 26386, 22387, 23276, 34656, 17965]
22481A7965j1359n562m608O245J3432K073r52j1194q019j3400j067O25R605K5072
22467A8856Q371l0533n518N127k96o19M519J580n032N223J2979J180o765r761
22453f89j1093Q531J0365k277k446r40m960J767J2136O319n03P44j3897L271j2060
22438e732q711N903M053L002Q629O359l625q367M988m689o510K536K16M2q719
22423a0625K009P158p211N82J286O55K270p445j904N00P584J3142N39l748J2713
22408A7505p590j6262q433o407J1929M996J33N172R515j5321r876m021J0727j1257
22394a9190j3665J5454J4076j0851m065O740M404K268P13N724m009j9516j1774
22381c3691J0660K414j396q737l209l436J881J5237j504r337J7288L305P246M481
$$ y = [17965, 6606, 1044, -3564, 2681, 16113, 18186, 17234, 6040, -1979, -15379, -16446, -15821, -6216, 18856, 27227, -3306, -8824, -3697, -3993, -4612, -93, 1487, -3545, 1678, 14657, 15837, 9072, -689, -11782, -3251, 7114, 4837, 2391, 1451, -3509, -1742, 10394, 16713, 16210, 16954, 3057, 6328, -5732, -14443, -8540, -4487, -1485, 7144, 13503, 9878, 1511, 6499, 1810, -4700, -2164, -1948, -1906, -10625, -8616, -1458, -8669, -8087, -6801, -6146, -3876, -11321, -13225, -12725, -5141, 8001, 8540, 4792, 17505, 9915, -6347, -14780, -21187, -9258, -4262, -4129, 1043, 10558, -4763, -14639, -18660, -7933, -19190, -32855, -17401, -3325, -14176, -18241, -11501, -7097, -4829, -4116, 1608, -2401, -21917, -33691, -23031, -20617, -22013, -30750, -33959, -37395, -35514, -20277, -21781, -31118, -13830, -10525, -3279, 1202]
22367A202M717M543J394q602k275J7241j384m989j1589k452Q930k021r712J0126
22353E129j346o778M127k388P177Q306J331o949m17P050p493o983n970K381q31
22338c654K55M409n458l937J0603J7062L895j1139r354j472L668N104M702l742
22324A0942l263n471j1292n238n036Q244M92J1806k198o355L951m415m43j1046
22310a9322q889J712O228J508o4R138J6298j1733q476N760O594L306J917N140
22296I117n340j0940R774q073p577n393M629J7014P260q651j1814o020Q665K870
22282d479N07j1444n681P894K0433M403k2959p461K0904J0001j7555m540M995
22269d982o253j029l41N699L537k061j989K31o188R767J133J2033J889k1872j0985
$$ y = [1202, 5919, 10462, 11856, 3254, 979, 18220, 16836, 11847, 258, -2194, 6736, 4715, -4997, 5129, 3783, -2995, 1132, -1256, 5921, 14227, 15558, 8609, 8192, 15242, 7749, 766, -5204, -2823, -3654, -3399, 1010, -4448, -8385, 2218, 19280, 23175, 12036, 2682, 1210, 4878, 9982, 14684, 10942, 7679, 2208, -9084, -14322, -19358, -11114, -10622, 1184, -1014, -7369, -3418, -7833, -8276, -19322, -28211, -26499, -20271, -18763, -18827, -9689, 6609, -5124, -13600, -7840, -1246, 2060, 3977, 9117, 3777, -7163, 2611, -5462, -13039, -18432, -13803, 3211, 10471, 1820, -9994, -16014, -7349, -4479, -3972, -15416, -21097, -13203, 7230, 11633, -11326, -18787, 2117, 12118, -5437, -9977, -4982, -11235, -12264, -12605, -6906, -3369, -5430, -7419, -7188, -13376, -3609, -2476, 9557, 11446, -10426, -21411]
22254b1411J967L779J0531J0180r887q020Q129Q9k164N635J1223n268q492P909
22240D200l864j3978o992j904N38J3673o231q027Q556J3161J0423n664l183q19
22226a11j292j1972J065M025j914M055P814O873m586K606K744Q769o174m648l852
22211C402J419P483J165l460l27l425p140j162k442o783j0560M499m08J0538Q753
22196A552J021j0631q876Q754j2690o730J0957Q593P741K478p612O050J2036L887
22182A6530o388n858K54J0405p847j1245j17P05o886R416P037j4384j3021P345
22168a4054P841J1029J2232k456p342r185j3390L112q764j424L680N523M526K161
22154f511O677N313r899o203M273O177k912J138O647o690j1197J048J0854J232
$$ y = [-21411, -19444, -15665, -5134, 5046, -4841, -12861, -4732, -4643, -6807, -1172, 10051, 4783, -3709, 4200, 336, -13642, -20634, -22538, -22000, -8327, -14558, -22585, -14029, -868, 9555, 3891, 708, -111, -1403, -13375, -12310, -8285, -10199, -6144, 1670, 8543, 3957, 6563, 9307, 18076, 11902, 7254, 3402, 4821, 12304, 13469, 10009, 9682, 6257, -883, -2045, -4487, -11270, -21830, -17331, -17739, -7201, 1552, 2573, -8058, -16934, -8180, -20870, -27600, -16643, -8050, -309, 2169, -5443, 607, 12643, 16530, 10142, 4284, 4538, 14943, 7096, -4149, -4266, -3561, -10447, -1031, 6006, -8378, -21399, -14054, -6213, 4816, 17048, 14592, 7250, -1935, -15325, -12213, -20977, -22401, -18721, -13198, -8672, -6511, 166, 5479, -4420, -10623, -6350, -173, -3085, -1947, 4700, -1990, -13187, -12139, -1285, -53]
22140e3J282j7639j5437O249Q148J2753j530M983J041J253J8824K066j2916j5769
22126f745n480J7620J0728o982r396M177p600j0341O768J0457k369p588l045P021
22112b775J4608Q547p012j6803J25j530j0247j546M561O487J1872J160n036O424
22098H835J7875M85p429m887q386j0993R445J5603l151k970j4729j4569J2246
22085b625k047O383R514n671n230j31r363q561Q04r407O606k751l725J5550L205
22070g449k494o580j521L410j5486Q896O484k309j0980q818J7833J2476R015J326
22056C803j5596R651j0604j0797j2031l853J7300P919j4610o663J1583J2790n084
22043a6192l91J3887J1795o488J666K262m503o608p547m918R696L120M65P438
$$ y = [-53, 1229, -16410, -31847, -25598, -17450, -4697, -6227, -1244, -203, 1050, 19874, 21940, 9024, -6745, -12225, 5395, 16123, 9141, -255, 3922, -3678, -14019, -7251, 3206, 837, -6751, -9796, -2775, 11833, 20380, 13368, -3435, -3310, -4840, -15087, -16633, -12072, -5585, 6287, 7447, 2411, 8835, 26710, 27195, 19766, 14879, 6493, -4500, 4945, 20548, 17397, 14427, -302, -14871, -2625, -4672, 1711, 11225, 5554, 324, 193, -9170, -17731, -16927, -26334, -19728, -22479, -26204, -10654, -7449, -9943, -16523, -18044, -14634, -30120, -21224, -14740, -17049, -28029, -36847, -19014, -6538, 2477, 3803, -11793, -2142, -12746, -23543, -35574, -39427, -22127, -14208, -28818, -35481, -23898, -11108, -16192, -16583, -2696, 9099, 2611, 4277, 6539, 2036, -4572, -12119, -17037, -7341, -4221, -3756, 3682]
22029C682K425p439j2562j4500n322M338J2749K2009M525j1197j5223n61K9972
22016A2896m739j9497K08m491Q121k532k621j21p467m07J2633N435m263j8094
22002b4939j070O003K311L471n426p425M385P276l319k730Q782j910P355J2599
21988E363j026K157L033j1410M31n613l812j0359R396J2505K5058o77J517j377
21974B5186n149k1041k684J0209o12P495k038j3328p864K262p965J0453O157j556
21960d75m268N209J3856L508j6301m376O440l253L823l84m392k2883K031M927
21946a6538J381J3507M547O855L488l894J286O843j6649q664m896m320Q988M215
21932c851l250L826o166l875M148j784k490L562n780J089o393N991P262J2221
$$ y = [3682, 6107, -1332, -13894, -28394, -33716, -29378, -16629, 5380, 9905, -1292, -16515, -17076, 12896, 8157, -11340, -11132, -15623, -7502, -10034, -12655, -12776, -20243, -20650, -8017, -2582, -6845, -24939, -26009, -20006, -17695, -14224, -19650, -27075, -22690, -15414, -18733, -21463, -12681, -14591, -7236, 5363, 4337, 6494, 9527, -1883, -1452, -7065, -10877, -21236, -11840, 665, 25723, 25046, 26563, 25186, 20037, -1004, -3688, 6521, 5909, 13404, 11366, -1962, -9826, -7564, -15529, -5076, 1081, -475, -4743, 466, 14322, 17830, 1529, -2847, 3593, 340, 4163, 3779, -613, -23496, -21465, -16538, -15157, -1650, 2897, 9752, 13240, 9346, 10632, 17475, 826, -7838, -12734, -17054, -8066, -3851, -7101, -3275, -9441, -13316, -9168, -10952, -13442, -9880, -15660, -14571, -20964, -14973, -7711, 4510]
21918D510q289j4783k425J2297K3758K601j6352j6842q581o351J5665P375j2857
21905b0274q801Q181L236O913M054q836l887J9854l649j0722k492Q66L099O231
21891f227R194l303j3052q740J0870m25n985l175K2837p110l927J1505J89m542
21877a891N368q284J948m005j344K507l64m061m82m073j1314P409K232j0890m480
21862c1724J899O232J3578J1952l203r029o415o471j1329J0327J0380O666j1025
21849a8162L143J6047M226j7141k537m287P710N904M216l901l06M2j2159R932
21835g273o784n11n211k374O503Q500K408j0335j254M447J2288Q631j2380j3861
21821a7206M045J0754k321j8021O162K300p078r22Q556J150j306m245q34m437
$$ y = [4510, -3779, -18562, -20987, -8690, 15068, 17669, 1317, -15525, -24106, -30457, -14792, -7417, -20274, -29075, -20894, -17658, -10745, -6691, -15527, -19414, 440, -3209, -13931, -16423, -15557, -12458, -6227, 2967, -336, -13388, -22128, -11258, -11683, -17668, -20843, 1994, -5116, -9043, 2462, 2651, -1891, 3477, -4807, -2859, -6864, -8208, -5701, -6065, -10126, -10608, -14681, -25995, -18586, -16354, -27244, -31724, -29825, -23593, -10015, 1937, -1266, -10295, -16710, -23181, -34510, -24183, -13803, -7137, -18162, -15019, 1028, 5254, -11887, -14424, -18711, -11001, -5097, -881, -4782, -5088, -5046, -17205, -7273, -14057, -14568, -19779, -22153, -15650, -7150, -4742, -15077, -16331, -11884, 404, 9035, -3345, -17206, -13161, -2407, -4728, -22749, -16587, -14287, -21365, -22287, -13731, -12581, -13887, -18132, -18966, -23403]
21807b3403J1461m796j1273o532J1844Q645O331j969P48j0116K891N667J2234
21794A732K091p224o079k0445J3057K6367r994n972K836r86j2566J574J3538j370
21780c441l141o09K804j034j0394r336Q123L531n449K574m206n097J2549Q857
21766d269M40K836L719k671m100M802m697J576k17J0675j845m260p595N506K378
21751B278J0990j706p825j8805o179J0890J269j92j061m124n244J973P161l935
21737a4510l666l205p000J7455J6103j243r860k44J5886M636l615j539J553r745
21723A006r906j959o805q544N031P540Q69J796J847j640j400j728O870Q865R898
21708A1740q649K620n34q081Q53N969j2677j9470L569m853l029L059M647k929
$$ y = [-23403, -11942, -16738, -28011, -34543, -22699, -14054, -7723, -9692, -8944, -19060, -16169, -10502, 1732, 3823, -3401, -9480, -29925, -16868, 9499, -495, -6467, -3631, -4617, -17183, -15609, -2071, -3441, -6582, -7191, -4387, -5421, -15815, -25151, -17028, -13497, -18946, -16372, -20578, -25675, -13126, -4269, -3829, -993, 2726, 55, -4045, 757, -3940, -2364, -2581, 8094, 6249, 1989, -5606, -100, 2278, 13268, 11562, 3737, -15068, -21247, -10357, -9088, -9280, -10341, -14465, -19709, -17736, -10575, -14510, -18176, -21381, -28381, -10926, 5177, 3934, -5926, -6170, 9716, 14352, 10737, 9198, 10751, 1006, -8900, -10859, -17664, -26208, -21177, -13637, -12768, -10972, -9125, -10765, -12165, -13893, -7023, 1842, 11740, 3091, 5711, 5177, -2904, -2051, 3918, -8759, -28229, -24660, -29513, -32542, -29483, -24836, -27765]
21694b7765K414J1461O975M343r050M105M109J474K139Q126m15j7915n210K186
21680a3023J0234M428J845J1783r045j8389q472j2005r460L148N742M006R729
21667a9479M386R31K361L003J119M035q824M451J8141J4426j3112k995j916k290
21653D237K790J674O136p302j4079j5851m733K1221L418K538q104q811J2745R534
21639E413k410M719L209K63j0637r950r700J228Q736J9282o994o848l14J788q380
21624a0595j3022l251o035j213L113O999L826J893l816J4541J3619m535l88p973
21610f837r715o877k801O023K762o28N825M479L182k114j5992J2555J4295j985
21596B172N543k965k044K534j9770q561O566J0456l257o771J56O233n484j307
$$ y = [-27765, -25351, -13890, -6915, -2572, -11622, -7517, -3408, -1934, 205, 8331, 7916, -9999, -15209, -13023, -2789, 1639, 3484, 15267, 6222, -12167, -20639, -32644, -42104, -38956, -33214, -29208, -19479, -15093, -14162, -11801, -8798, -7679, -3644, -12468, -8017, 10124, 24550, 11438, 8443, 6527, 4237, 7027, 8701, 14837, 7535, -6544, -22395, -27128, -5907, -2489, 49, -8055, -16866, -4121, 5413, 3003, 7722, 10931, 11194, 557, -9393, -19093, -17865, -9129, 10153, 3159, -3689, -4003, -2215, -10595, -23617, -26868, -32903, -34116, -31003, -24004, -20178, -18285, -22101, -7560, 6059, 1524, 1136, -6837, -16552, -23429, -26230, -20207, -17445, -18073, -12248, -7769, -4587, -6701, -22693, -10138, 4157, 2172, 7715, 4750, 2706, 5240, -14530, -23091, -16525, -6069, -9326, -16097, -15941, -9708, -15192, -16499]
21582a6499J6460L571p112n625j0898L04K2218j684n944n607j173N463r539R406
21568f659o284j930m963p806R432M209n073j1171J5167J1046J043O848l707p032
21554f880L067j641p530J728J32l716N024K635R097O851o17o486k751n274j0154
21539a6515l481N324k195j4264M7J588N982J0124P4J2801J7702N6j4576j5903
21525a3236j0387O823J2751j0484m226M751K0473P483K372L260m123K248j21l356
21511A4228j1993j0596J797j100r605L550l762P322J7669J1844P995r559J165
21498A8955K536p723k521r827r953J930K280j88M861K983r452q324K373O286M038
21483a746M39r312j1610j0212p412J4716P838p754O258Q084J1926l100j4140J920
$$ y = [-16499, -39, 3532, -3580, -9205, -20103, -19799, 2419, 735, -5209, -10816, -11989, -6526, -16065, -6659, -12943, -14873, -19836, -27642, -18210, -14001, -19074, -30245, -15078, -4032, -2989, 3859, 152, -6880, -3813, -5454, -12984, -11256, -11124, -14840, -9816, -7181, 1916, 8767, 8150, 1664, -1087, -6361, -16515, -19996, -14672, -16867, -31131, -31084, -29496, -23514, -13390, -13316, -515, 17187, 17243, 2667, -13236, -23623, -16800, -4049, -14533, -18759, -14008, 6465, 13948, 16320, 19580, 15457, 17705, 17584, 14228, 2235, -8361, -6564, -7664, -17269, -13719, -17481, -10159, 7510, 19354, 27349, 17790, 18955, 21491, 13768, 11247, 1420, -8533, -6603, -4323, -4511, 350, 3333, -6119, -14443, -12070, -5784, -1746, -1307, -10619, -22229, -32441, -39853, -25137, -17299, -25053, -18795, -10711, 1215, -1885, -16025, -14105]
21469a4105K2731L975N4k1641j7095N94J684J303j60Q93P563q173o587L158Q531
21454a7275o123J876K4767J5910n323j0366J2857j1182l1685j4512O986J7641
21442a6429n073R068Q471m969k3186p219J5750J3263J0925N30l833k922n660j1150
21428b2434K681j793Q03N331j181J1722K244P4p52M474k346P801l049j8929j31
21413a5485n24p536J235Q251R328n400J4831O294O814j905q628j4964p649o884
21399b2222l840K236O847p690R53P806L840o822j0910M665K2454K0150j5462l574
21385a569m839Q763P201m532p581p67R102j013j3671j4509o934O198M327l783
21371b3607j028L754N843m304k058M642J1955J0026J786j1011j9499j1765J1724
$$ y = [-14105, 8626, 12601, 12655, -8986, -26081, -25487, -23803, -22500, -22660, -21767, -14204, -22377, -28964, -25806, -17275, -23398, -21522, 3245, 19155, 13832, 3466, 16323, 5141, -26544, -41056, -34070, -16429, -21502, -12434, -3963, -8932, -32118, -39337, -23587, -10324, 601, 1131, -2702, -5624, -11284, -22434, -19753, -21546, -20743, -15412, -16593, -4871, -2627, -2553, -3305, 1169, -1177, 6624, 3575, -15354, -15485, -16009, -23545, -22310, -14059, -4731, -10131, 4700, 10994, 17808, 15903, 7275, -7689, -15338, -22222, -26062, -23826, -16979, -24669, -23716, -15910, -12070, -18892, -29802, -25137, -2683, 17467, 2005, -1569, -6408, 2355, 9556, 5024, -2557, -3324, 5778, 4765, -8906, -23415, -30349, -24151, -19824, -23607, -24635, -20881, -15038, -19342, -21400, -16758, -4803, 5223, 7009, -4002, -23501, -35266, -23542]
21358b3542J4084l636q221R26M936q458m296P244j162n568m098O2J1248J1833
21344h648l481N902J612m820m434J0681M663j9340O558O826rk117O971p725j5366
21329b2727o461N894m819K680J0535P11o006o104L341L271K005O351J2878n593
21315d044J3239K752q223r332L977O413Q620N515l738j6606N910o912n888j2785
21301b1102N876J0078P180L850l2L13j0616j655N982m935J337J320o340j6509
21287b5253l489N793K344J602P004k376l89R989M18N179r33L402r216L693r356
21272a1588K358k9O908r432k699n94K819j072n338J0019Q591J0237N328n781p176
21257B551Q061O863m848m802M938j0905q65O210P116n902M507m428J652J8900
$$ y = [-23542, -9458, -13094, -21315, -20389, -15453, -23911, -28207, -20963, -22125, -27693, -31791, -31729, -20481, -8648, -12129, -6227, -4615, -9435, -13869, -3188, 1475, -17865, -11307, -4481, -4490, -6607, 364, -7361, -22727, -29188, -23294, -28113, -25433, -14898, -14187, -20193, -26297, -22956, -19685, -17680, -11329, 1549, -4044, 9195, 11947, 3724, -5608, -1631, 4782, 13402, 18917, 15179, -1427, 4483, -2429, -8317, -21102, -15226, -5148, 2032, 5882, 5850, 6163, -4453, -6108, -126, -5061, -3724, -2404, -8744, -25253, -28742, -22949, -20605, -19003, -11999, -14375, -14764, -4775, -4357, 822, -111, 3291, -5925, -2232, -11588, -9230, -9259, -2351, -11783, -14482, -15076, -12257, -13329, -18667, -8648, -57, 10180, 15508, 9727, 2551, 10612, 17475, 12627, 7825, 12763, 1858, 993, 7203, 14319, 8417, 12924, 8496, 10148, 29048]
21243B9048l251R00j8449n116R974K387j2368o16k333m171L414P697J3565l300
21229A7381k0637k4067L517J2306J1056p71O84j3483j3342P472Q877Q901l812
21216e918j2824o388J9812J3100o356K079L388j1811j5746Q168J992j2147L682
21203a8969J1961l441m121J6441m082P32j2312j5622P296J7161N613n719K223
21190b839M854J0905J0093O15q007k491p960N475j1181r887k484M719m370n668
21176a8226l82J3735O111j115J708j4229j38K1945o425L902o335j4144J945L236
21162h412p316k097K950p941k725l432p6K207J3382J4041M353N709M112o261J965
21147A0459L239O044M103j0845M470R429o806j6638o095n019L313j3021j0740
$$ y = [29048, 25797, 26697, 8248, 3132, 13106, 15493, 3125, 2509, 176, -3995, -581, 7116, 20681, 17381, -3256, -27323, -23806, -11500, -444, -1215, -531, -14014, -27356, -19884, -11007, -2106, -5918, -18742, -25130, -5318, 7782, 1426, 3505, 6893, -4918, -20664, -12496, -10504, -22651, -18969, -7008, -10449, -14570, 1871, -2211, -1479, -13791, -29413, -22117, -4956, 657, -5062, -2839, 2015, 12920, 23013, 23628, 15621, 13130, 5170, 10645, -536, -10423, -12907, -8188, -12558, -18226, -18608, -4873, 1238, 123, 1831, -12398, -12536, 9409, 2984, 6886, 551, -13593, -11648, -8412, -15728, -17825, -14875, -22816, -25541, -28973, -29049, -26842, -13460, 581, 4934, 10643, 14755, 8494, 10459, 13698, 19742, 23845, 13000, 17470, 26899, 20093, 3455, -2640, -7659, -4346, -17367, -28107]
21134b8107J9624J474J1970P817p059M957m786q653j1976q735O831K042O13J2048
21120a940p28m347L979j614m653O029K825l964P216j216m853p889J646O745l259
21105f023p042K189O907j1821N908O417n377k516l703R417j9K49M397R29Q479
21090H391R521K540o4N682Q006m758k164j1079j6805j3842k01R7m673q246j2489
21075d0084J0117Q720L565J0581O40l621K903N221m810k802k857M520L685Q294
21061D072j0840j0129N302K0139l021o957j1168m412J3628J7697J1580n411j1099
21048I381q849k279m761L970n475j6821p862P946J0063J6671R924k425m622r934
21034e073L178m333p684r616j0764J4638J3494R880p197j2455p962Q427L440o603
$$ y = [-28107, -8483, -7009, 4961, 12778, 5719, 10676, 5890, -2763, -14739, -23474, -16643, -14601, -13988, -1940, -2668, -7015, -3036, -4650, -9303, -3274, -449, -4413, 2803, 1587, -3266, -11155, -9509, -2764, -6023, -13065, -10876, -3969, -15790, -9882, -3465, -8842, -11358, -15061, -5644, -5663, -5414, -1017, -88, 8391, 17912, 20452, 20388, 26070, 34076, 29318, 27154, 16075, -730, -14572, -14773, -14676, -19349, -27595, -40084, -29967, -21247, -17682, -7101, -6461, -10082, -7179, -1958, -6768, -9570, -12427, -7907, -4222, 4072, -6768, -16897, -11595, 8544, 5523, -1434, -12602, -17014, -3386, 14311, 25891, 20480, 9381, 532, -1747, -6508, -2538, -8013, -24834, -32696, -24750, -14687, 1984, 11908, 9483, 4861, -5073, -1895, -6228, -13912, -23528, -34292, -19654, -6160, 3720, -3477, -15932, -23894, -15467, -12027, -18630]
21020a8630p679j1481J6959N713q695M098J3375n57j0033j596n892M325Q849L234
21006h010o778p962P991j779j4054p232K298L468J0584Q720J7914j6612j9438
20993c0890m890J959K3417L446l3J1442j051r877k951m466j285J2762L478Lk127
20978a063j0441m880q867J5345J5285j586o21n558k504J203j9284j4390P093J722
20964b8546M368Q279P590J3459J527J452l686k633j2933K933J4247k598j3909
20951a0450M98k04L761O935K694J992j448j7590j513n14m485Q270O809J0223j621
20936C357q953N078m750n165m315j668l517N148J4174Q676J4612M532k820o488
20922A7901n555j1064p985p055K526k757j5836J998K4094P159o310j4210l981
$$ y = [-18630, -26309, -37790, -20831, -15118, -23813, -19715, -6340, -6897, -16930, -18526, -24418, -20093, -11244, -8010, -14788, -22750, -14759, -16538, -30592, -37824, -35526, -32058, -21474, -12754, 5160, -11452, -30890, -35780, -33821, -10404, -6958, -6991, 4451, 3400, -6477, -9428, -13894, -15179, -2417, 1061, 1064, -1063, -11504, -16384, -25251, -9906, 5379, 3793, 3172, -2386, -4890, -3687, -22971, -37361, -30268, -28546, -24178, -15899, -8309, 5150, 6677, 8129, 4443, 1810, -11123, -8190, 6057, 3459, -10450, -9952, -10156, -6395, 540, 3234, 5226, 3778, -13812, -15325, -15839, -20324, -12054, -5245, 4978, 3357, -5596, -518, -5268, -10433, -14748, -16416, -19933, -14785, -611, 8065, 22677, 27209, 24389, 17901, 12346, 1282, -6703, -13758, -11232, -13989, -29825, -27827, -3733, 3426, -2884, -17094, -21075]
20909b1075O917Q750l434j352J583N531l452P642J7998K038j5195j0664K120q523
20895a1116m883l575K0520K2012N152j6506k1857m008P061P005l608J5884R452
20882B1533j6284j0764q113L064r288Q53o532Q088J7813M548n745r175N87K68
20868i147m914M824j009K600k255k17J272j2234l169J3348Q732j1419o585L315
20854a6858O819K0624J2459O555j3006j4610L042N439N818P60j354m432k781N572
20840A4047n446r377n698q702J2267N836J873m858j3738N394k542m809J2914J6340
20826A3501L87J300n387j691p324j0818J254l990k105N749J5795q896O686J836
20812F297K256j0054L991j0844k392J4530J3495Q268j4666j4288L770n124O268
$$ y = [-21075, -14158, -5408, -8842, -10194, -8611, -3080, -6532, 1110, 19108, 21146, 5951, -4713, -2593, -11116, -15999, -19574, 946, 22958, 28110, 11604, -10253, -14261, -7200, -195, -3803, 12081, 21533, 5249, -5515, -13628, -10564, -19852, -18999, -25531, -17443, 370, 4918, -827, -10002, -9415, -9147, -14061, -9237, -10246, -7646, -9901, -10118, -8846, -21080, -24249, -10901, -2169, -13588, -20173, -16858, -10039, 10585, 23044, 29599, 16593, 1983, 5025, 10464, 16282, 17042, 15688, 11256, 8475, 14047, 8601, -776, -6474, -15176, -2909, 2927, 4800, -58, -13796, -8402, -10944, -15753, -2839, 13501, 13888, 15188, 9801, 8110, 786, -10032, -8778, -12768, -14873, -9124, 6671, -2225, 4461, 6297, 8553, -1501, 2490, -8354, -10746, 3784, 17279, 25547, 10881, -3407, 363, -4761, 1507]
20799A507n111n111p829N229J8566o796k3491o237k973J3244K3110J395m6N561
20785A1018j5070j1048j0002J1182J554o011q40n329M269L203J000m17q102L141
20771b1452R582j3136K757Q124p50K852R520j63j8787j8246R237K4562J8675j1360
20757A415j3669j5372O996J8589P169l563q452P846K242j4101J13J5208m259j0129
20743i967J3072J0255m464K481j8842n912J1395M058k901K01k131j0160l779J5198
20729a496O250j0334j836j2404Q611N064P182q685j5592L405J2340J4606J2681
20716A9792K006r783n290j0738K986P25N227O774M633o794q66j1350o312m541
20702a3531J101K26O392L540M32o249k999k46L613P33L560J650J398L244J0912
$$ y = [1507, -3604, -8715, -16544, -11315, 7251, 455, -23036, -29273, -32246, -19002, 4108, 5503, 5457, 11018, -4052, -15100, -25102, -13920, -12366, -18377, -19217, -24546, -20277, -17074, -16074, -16491, -24593, -21452, -11870, -25006, -22249, -14125, -14875, -12023, -2503, -2666, -21453, -39699, -30462, -5900, 12775, 1415, -12254, -27626, -20630, -2041, 5128, 1565, -6887, 959, 3201, -10900, -10787, 4421, 162, -9967, 3105, 13360, 8896, 11377, -7465, -13377, -1982, 2076, -825, -624, -2755, -12915, -16694, -1496, 4754, -5580, -7416, -19820, -11209, -6145, 1037, -7648, -23240, -19835, -7495, 7111, 19792, 21798, 12015, 6725, -4013, -1027, -302, 4925, 11699, 16332, 9538, 8672, -2678, -8990, -13531, -12430, -12204, -5812, -2272, -1840, -8089, -11088, -11334, -7721, -6988, -3428, -1778, -380, 2864, 13776]
20687A3776J156m729j7339p232J4864K2180J748k1315k919p017l834J206Q080
20674a375j1608j580R081m078n480l186J0450J3576K248n502m454j1640p532M015
20660a7065N053R175J5818J1621j285l209j5535q651m69R794Q801M254o451j1848
20646CK274j587o074m324q099m974P335J6192Q538R218m910k0137K483m496j2756
20631b1314j760J0883J6209J4079j3668J848n094M419Q856o905r863K911K806
20618C407O372l850R11K19m713j0492N942o844m449L35M96P427p308o354J0232
20603h669O010J0249J3936j3957q723P958O172k720j3730j917l079j753L804P214
20589G95N749N414q286j1060j1666l986J9285j162o097K685Q40J0441L032n48
$$ y = [13776, 14932, 10203, -7136, -14368, 496, 22676, 24424, 3109, 190, -6827, -10661, -9455, -1375, -12983, -14563, -5482, -9560, -15040, -18226, -7776, 5800, 8048, 2546, -1908, -13548, -21080, -17065, -12012, -2837, 12981, 24602, 23317, 20108, 4573, -4078, -4547, 5247, 14048, 18302, 11851, 3, 2277, 690, -5384, -9708, -17807, -22781, -15446, 746, 9284, 18502, 13592, -6545, -4062, -8558, -21314, -23074, -12191, 4018, 18097, 4429, 6277, 1183, 5602, 14458, 7553, -2310, 601, 3407, 9779, 5929, 6840, 7059, 2346, -8146, -2204, -9048, -13497, -13162, -12666, -5239, -12547, -18901, -8669, -2659, 7590, 21526, 7569, -1154, 6804, 12976, 10256, -3474, -5391, -8470, -10223, -6419, 795, 6544, 11958, 3672, -7388, -19054, -23040, -3755, -4917, -11014, -8329, -7489, 2952, 5984, 5436]
20575E436j3108k64O517r561p470J5615O861J0594M140q262P45l118k0236J138
20561a0973r761l456N090J0672o71k619J5831M281k1310j0512N669j069P389P302
20547d137N06m71m387l325L101O152M755J3195j5492r289Q174J4318J6545n371
20533B4274k1635K701N111R362j8653p38K3374k939j0731m274m967j104j2136
20520a2355L475J4657r073q770n222j547K350N634O958J019j243J1001J1602M434
20506B2920k053j4288r817J0656K075k143r321q841l860M53M454n053N944P5N448
20491c351Q251n999j6989o74J5526M27m652o255k684L681o026r995K420J4255
20477a2065N584o035k642J544K27l126N762Q510Q686K895k379p604k423N095N076
$$ y = [5436, -7672, -7936, -1419, -10980, -18450, -2835, 4026, 14620, 18760, 10498, 11243, 8125, -12111, -10973, -20734, -24190, -19100, -8428, -9099, -11718, 4113, 8394, -12916, -23428, -17759, -18828, -11439, -4137, -3631, -4102, -8489, -11814, -8713, -2561, 2194, 15389, -103, -9392, -1218, 13100, 29645, 24274, 2639, 5340, 10451, 19813, 1160, 422, 23796, 20857, 10126, 5852, 885, -219, -12355, -8880, 5777, -3296, -12066, -17288, -18835, -16485, -10851, -3893, -2874, -4117, 6884, 18486, 22920, 20867, 6579, -3238, 7418, 9493, 7350, -1971, -10812, -14672, -14219, -9765, -14818, -8874, -8799, -3351, 4900, -1099, -18088, -18762, -3236, -2809, -7461, -13716, -16400, -12719, -18745, -28740, -26320, -12065, -6481, -12516, -15158, -13614, -13387, -16513, -10751, -2241, 6445, 9340, 6961, -643, -3066, 2029, 7105]
20462G105K345J1827r726m246P303J1948m376j7788j1592j616J021O328K200O505
20448G238J6302j6344k5116j3412p652J0326O627L0160J5722n684o543j021r586
20435A017j294Q941m990L409M588L893O578r374p020j374j337O159L208k0465
20421h061q867Q013K846p548o582Q045O374J1016K871j2043J2756J1019m760r921
20407E158j3745M46R067J1248r656K669J3042m362j1793o225l198Q440m12J139
20393A818Q554q8K396o448j0026O376n546o546j612N461Q530l724M722J150J085
20378F102j7924j1686O755Q571p69m182R453p264l979J2446M525L363M002L730
20364A3143O746J311j2098j2486K252N946O58l438r704q724J1931L480P205J0625
$$ y = [7105, 9450, 21277, 11551, 7305, 14608, 26556, 22180, 4392, -7200, -8816, -7795, -1467, 733, 7238, 23540, 7196, -17920, -31332, -38984, -28658, -22031, 8129, 23851, 18167, 11624, 10603, 1017, -277, 8664, 3674, 7083, 11671, 15564, 22142, 12768, 5748, 4374, 3037, 9196, 12404, -8061, -16928, -8915, -6069, -13617, -20199, -12154, -5780, 5236, 8107, -3936, 8820, 19839, 15079, 5158, -8587, -8141, 926, 12174, 2518, 5187, 18229, 13867, 2074, -4151, -7349, 1091, 679, 1818, 10372, 10284, 12680, 6232, -3794, 2582, -2964, -9510, -11122, -5661, 2869, -855, 3867, 5017, 6102, -11822, -23508, -16753, -8182, -8951, -13133, -3680, -10944, -14923, -2477, 2048, 5411, 9413, 13143, 19889, 21200, 9102, -3384, -1132, 4814, 5472, 2034, -7670, -16394, -4463, -983, 6222, 16847]
20350A6847j1189j7181k320M375J703p392p921J7541N927j0320m55N97K980J2197
20336E389m586O084m118q098r535m195P27o872P161j872j169J1338P665j1408
20322a3489j1516l617l843K739J834R886r08K851r68O374O23K947O707j1150K991
20307h539J117J1652P831N434P109m974k2787r019J933l453O314L302J165m780
20293g695K716J185K116N356R151l185j0486o512m264P802J120o06M190n753p291
20278a2156R664R805K158q743p773M908K0521K794l0080j3268J2592m95o891N153
20264a1811J0547k457j959J2251m301N443Q277L722l753N822q151j4497p600J0846
20250B379N22j4018j3561P994J0005M663R665m337r85o545j1366J0092K1900p083
$$ y = [16847, 5658, -11523, -13843, -9468, -7765, -15157, -23078, -5537, 390, -9930, -10385, -9788, -6808, 5389, 803, 6887, 2769, -5329, -14864, -19059, -18332, -25204, -18043, -19915, -21084, -9746, -2081, -13489, -25005, -28622, -32465, -29726, -27892, -18006, -18914, -16063, -17031, -10657, -10034, -7087, -380, -11530, -8539, -7422, 4230, 12061, 17495, 24604, 19630, -3157, -12176, -10243, -13696, -7382, -4080, -2915, -7695, -4979, -3794, -1678, 3678, 12829, 9644, -842, -7354, -11618, -3816, -2696, -3302, 888, -4865, -12156, -2492, 7313, 9471, 728, -7045, -2137, 18384, 21178, -8902, -22170, -9578, -10073, -16964, -11811, -1264, -3721, -5680, 6571, 2270, 7713, 15990, 19712, 15959, 21781, 13630, -867, -8467, 2379, 2901, -11117, -24678, -16684, -6679, -2016, 7649, 3312, 2327, -4218, -15584, -5492, 16408, 9325]
20236I325L185J541O335O757Q1n277l040q942K019L810j671r965k153Q411o806
20221C610k099P16K869P497O871J681l272n05m66N813k320j5000j0237j3260J2426
20206e676L009j3564J3355J082k03j357k319L734l78m684R764J5085j573k035
20192A4240n54p848Q267O759K895j0177Q340r957j5486j6558n686J1656M721K148
20178g240J4854Q499p029r659q846l549L621R452J3667m070q809K009j6065j2635
20164b5800J018O178Q077J0180N414J3900K01r562J2758J3148l497o987o839j3673
20150D516J0423k459m189P350o11o618j2086R65J557Q502p518J5662r49j0688
20136C857r061j1064N012k090p417J5900J6245K131o965m414j0658m204J0103
$$ y = [9325, 12510, 14051, 20386, 27143, 27224, 21947, 18907, 9965, 11984, 15794, 14123, 4158, 2005, 10416, 3610, 1511, 2227, 5096, 12593, 19464, 21145, 17873, 17368, 16902, 22715, 20395, 5395, -4842, -18102, -5676, -2667, -16231, -2876, -1794, -1997, -3354, -5673, -1939, -2317, -7001, 2763, 17848, 16275, 14240, 13686, 5838, 14105, 20864, 23759, 13582, 21922, 11965, -3521, -20079, -25765, -14109, -9388, -7240, 7614, 16113, 9084, -575, -9421, -12970, -9349, 103, 13770, 9700, 891, 2900, -13165, -25800, -24782, -18604, -10527, -347, 5067, 18967, 19168, 9606, 22364, 35512, 32015, 25028, 18189, 4516, 14939, 12480, 8291, 15641, 15030, 8412, -3674, -2709, -1152, 7350, -168, 15494, 14545, 3857, -5204, -16268, -11256, -13346, -20763, -4863, 11382, 13513, 6548, 2134, -8524, -12728, -2625]
20123b625m428l595l700j56J3491P744J067l901p914Q79J2897J614p57k420P968
20108A6164q664n232p194n96J669j0147N952O121j3379m106k575j1476J8197J9829
20094D563j432J873j78j0768q212O706J892R38j757j433j662J3042J8243n632
20080A6183r387J3088m445q268j6242r313L416K0144K079k1773j718P963J6809
20067H536J4954l125p554J512j659m356k417n288n591p289r082J1626N863j2804
20053a6674L450J0396l938J3517N665n885j972r72p216j53J013M981j1063j391
20039a0242Q82N633M146n537K753J2796J2780P31r627q971K830l038p769J0412
20025G779L56p514P776M318p25p890P88Q132p903m579m024J355p577K034J608
$$ y = [-2625, -7053, -10648, -14348, -14504, -1013, 6731, 7798, 3897, -4017, -3138, 9759, 11373, 10616, 8196, 16164, 7500, 2268, -4926, -5522, -3853, -14000, -8048, -1927, -15306, -19412, -21987, -33463, -15266, 4563, 3131, 5004, 4826, -5942, -14154, -7448, -5556, -4618, -6375, -7808, -9470, 3572, 21815, 16183, 6796, 19884, 15439, 7171, -9071, -18384, -14968, 5176, 7255, -14518, -16236, -8273, 8536, 23490, 20365, 12811, 14323, 12664, 8308, 5891, 603, -4988, -12277, -21359, -9733, -3870, -16674, -13224, -2828, -6766, 6751, 12416, 6531, 4559, 3587, -3629, -3782, -2769, 2212, -8851, -10242, -9360, -3727, 419, -5118, -2365, 10431, 23211, 23942, 14315, 5344, 8174, 5136, -2633, 7779, 8135, 621, 8397, 12715, 11990, 4100, 4888, 13020, 5117, 538, -3486, -2131, -9708, -7674, -6066]
20010f066j0454J226Q573P855p625N797R89N265P73j9199M641p381J983J5247
19996A624J163l811j36l021l818J5731N212n682j874q29j554k118L130J75p634
19981c442r894M343J0173l153J3201N62r734J601P173J5667j0234j7947l731N084
19967c31N999q965J2798M887k798k0091q226n776M829J044O488m262m720M068
19953a5056L647J025J3211k659n118J0369o055n284M516j742K1603J2834n96j2089
19939A8606j386j417j145r919k670P396J0485o433j0934j26J2395K900m468m497
19925H787q290K412M574k854k0994O808K4600N872n148R06q889J431O346j575
19911A3986j0809j204P168N05J3273M420p646k864O943J4o597Q809n400j1294
$$ y = [-6066, -16520, -15294, -6721, 1134, -6491, -694, 295, 5560, 6333, -12866, -8225, -15606, -13623, 1624, 2787, -1024, -1160, -4181, -7999, 7732, 12944, 7262, 5388, 4559, 3005, 887, 4017, 4192, -3442, -13336, -8993, 1180, -1973, 11228, 11790, 2056, 3657, 10830, 26497, 16263, -1684, -5415, -331, 5668, -3297, 9501, 14388, 11590, -8501, -16727, -22503, -17674, -16630, -10142, -14404, -19124, -15056, -11409, -10384, 2827, 168, -4950, 5419, -636, -5920, -1404, -3146, 18457, 31291, 30695, 18606, 17220, 15803, 14658, 4739, 2069, 9465, 19950, 13517, 2583, 2457, 14852, 17752, 13284, 8787, 497, 2909, 7483, 4629, -16365, -9557, 15043, 20915, 15767, 16673, 7784, 9215, 15561, 13986, 3177, 1973, 9141, 9646, 22919, 27339, 19693, 16829, 23772, 23786, 17189, 25998, 20598, 9304]
19897I304n751k923L830l290R109J9055j2617j6734j1187m753M050J0273N588
19884C954N663j0813l667l345k732J6387J7497o003r003j1196l328l803J3588
19871C199K1797p564o082J3886N596n60q80k045r784p212K831p945j498r382P684
19856B041P872j0335M70o667N84K380q402l935J252o756L317R820Q235J028N212
19841F116k673n02j17Q997J3261J513n050k475N4k3321p685K51J1745K4602J504
19826B6220j1778j1115O65J436o285R062J718j175J3148p973j6619j2678q624
19813b3998J6724J4081n404k769P642N086q324M104P880J7452J294j2790j829
19800A9149p276p598j0473K823J4487m788o090l434J547k049P929J977P561P486
$$ y = [9304, 3553, 630, 4460, 1170, 10279, 29334, 16717, -17, -11204, -15957, -11907, -1634, 3954, 9617, -1196, -4863, -8208, -10940, 5447, 22944, 16941, 7938, -3258, -6586, -10389, 3199, 24996, 17432, 11350, 25236, 30832, 30272, 29392, 27347, 17563, 10351, 13182, 5237, 3739, -5643, 2041, 9913, -422, 48, -6619, -6035, -3655, -12057, -15992, -14740, -21496, -18179, -8359, -124, 904, 6116, 3443, 2941, 2824, 11821, 25082, 26595, 21545, 19070, 19124, -4197, -11882, -11631, 114, 24716, 26220, 14442, 3327, 3992, 5428, -857, 8205, 9923, 8748, 21896, 13923, -2696, -15374, -23998, -7274, 6807, 1403, -1366, 6276, 11362, 3038, 7142, 15022, 32474, 33768, 20978, 19149, 11873, 4275, -6198, -3375, 11112, 6324, 234, -3200, -1653, -3702, 4227, 6204, 13765, 21251]
19786B1251k218j87p794J174J1289K145j2149j2765j0949M75R633R612j544K253
19772A0226r007k993K150L31L138l228J63M030Q374J2326o216j3842J6542O769
19758B8763l351r258l22o801k024K243m02M067J0502k465M641o292P135o880l67
19743A9189K726Ko627P500k1215L240J049j882P582J3089j0241l123K563J4433
19729B8285J1951j488K020O474q61j5673Q232J1340j2720k5454j0847K329M314
19716G902q734R811J5190N485j0465l763j2674j498J0831L743o1j7441P054J597
19702F977Q301n70k966O167k118r893n902j3140r973M478J9729J0734P10r54o550
19687E030N456J0651O542n270P420p226j2324L64J2023K561R733p573q427j4527
$$ y = [21251, 19033, 18846, 11052, 12226, 23515, 25660, 13511, 746, -10203, -9728, -95, 9517, 7973, 10226, 1219, -1774, 376, 707, 3845, 617, 780, 4810, 13184, 25510, 19294, 5452, 21994, 28763, 25412, 16154, 15832, 9031, 7007, 9250, 8848, 12915, 23417, 20952, 25593, 19301, 26436, 19556, 19189, 21915, 21917, 15290, 22790, 1575, 4815, 5864, 3982, 11564, 24653, 14412, 11289, 13852, 28285, 40236, 38748, 40768, 47242, 46381, 30708, 38940, 50280, 37560, 12106, 1259, 3588, 7902, -832, 8979, 24169, 29654, 19189, 15426, 2752, 1254, 12085, 15828, 15767, -1674, 5380, 6977, 15278, 14708, 11742, 17909, 15791, 5898, -4, -13144, -23117, -18639, 1090, 11824, 12534, 11580, 5030, 10486, 21137, 27679, 22409, 29829, 22603, 10279, 10643, 22666, 25227, 34960, 27387, 18960, 4433]
19673D433K71J1887Q084p188j2486O575K828j6240P661J715K588J707M717K837
19659A9389o018m907L362K858K71P535m302k906m885R369M564M163j1873l033
19645A3587K567q826j5498J8244J9675M18o137j0845l965k634jm507J3377P107
19631B2562k233m587j1245j1978Q825r318J6829J2715q741j6281j3107J0159J6469
19618A0069J2225j4341j0267J1397J426J3070j5859j0395J4697J4919k560j2667
19606A1714r031Q804R732m465r265N344N669j361n516m844r905O800K0013p369
19592A6320j6956q02J950P507R475M234o472R818N554q613O821J5220p553l733
19578C2770M540n000k4791j3522K399J4335K864Q16j319n150n955p761R976P793
$$ y = [4433, 4704, 16591, 24675, 17487, 5001, 11576, 14404, -1836, 5825, 7540, 10128, 11835, 16552, 19389, 13371, 8464, 11826, 14684, 14955, 22490, 18188, 15282, 10397, 19766, 24330, 28493, 16620, 13587, 16154, 7328, -8170, 10074, 29749, 30167, 24030, 13185, 9220, 6586, 6585, 2078, 15455, 22562, 20329, 15742, 4497, -7481, 1344, -7974, 8855, 21570, 12829, -3452, -16559, -6400, 10069, 22294, 7953, -2314, 9083, 10509, 23579, 7720, -2675, 12022, 26941, 24381, 11714, 2683, 11487, 21219, 16754, 7489, 12833, 18502, 17141, 11625, 6781, -3124, 3676, 23689, 16320, -636, -1438, 512, 8019, 17494, 21728, 15256, 25074, 30628, 22015, 28836, 44056, 36503, 32770, 37310, 32310, 7519, -6003, -3604, 10731, 13595, 14411, 13092, 7942, 1987, -5774, 4202, 11995]
19564A1995j0490m008K5378L066k395r93j2705L536K061M13m746Q51P396j552
19550A7807j127m895l522O882Q893O62m969J0354j0601j5487P431O622O871p628
19536A7293q624j523L146Q215n305l255j682J949K955o117l86N649N743n47J3374
19521C0885k797j3225j795Q166P551k715j2249q630O075n17L390J0297m685R08
19507B0659J2934J840o528l363j2427r425j3191J1201P752P915J239K510j6127
19494D989r007P172K048j422J814J748j599P017J7696R529r270j8591J473J0827
19480B4424l440N564N748k0697l506O299K586m196K263L879P513p646n609R946
19466B3128M141j4047p474J594O620r587j0092M087J6170R87o826O101j868J655
$$ y = [11995, 1505, -2503, 22875, 25941, 23546, 22553, 9848, 13384, 15445, 15858, 11112, 11963, 19359, 17807, 16680, 11785, 8263, 15145, 24038, 24700, 19731, 30085, 19484, 3997, 11428, 18050, 24921, 17293, 8669, 7146, 10292, 18507, 13202, 9947, 8265, 10214, 13169, 7052, 6666, 12315, 18058, 17511, 30885, 28088, 14863, 13068, 21234, 28785, 26070, 13821, 5191, 11266, 10749, 14139, 24436, 19751, 20659, 33593, 35433, 28905, 25542, 13115, 3690, -9501, 1700, 9452, 17367, 18606, 21116, 4989, -4018, 3154, 5202, 3780, 5594, 7342, 5743, 12760, 30456, 39985, 30715, 12124, 13597, 24424, 20984, 26548, 32296, 11599, 8093, 14392, 16978, 12782, 15045, 18924, 26437, 18791, 13182, 23128, 27269, 13222, 5748, 7342, 13962, 4375, -5717, -1630, 14540, 15527, 8701, 14802, 12934, 14589]
19452A4589M842n649j600r767J1510J4447K770k851o535j0158k29P602Q050P048
19438C4069j5449j244p090o045j073m847K885P742J0998P014j4291P892P233O843
19424C4637l226n597P32m035J2597N533J179N031j5640m7J4705j5666j5051Q06
19410A5958J4267N530N04r763p894j122J1670J7508o74j9318O381M820J1509N447
19396E4823j2742p172J097k4149j6792M391P614k527o595N183J6184J8031n24
19383C6822l700l295k0409j4088J0543J2343J8223R359L750p553j9189r661j4078
19370i33j0351j918O529J1587N278J1236J1527Q718n429k020j0826j2421R415
19357B0392J3481j5988P942R042j427L31M093j547r342K697r572j535Q916J6325
$$ y = [14589, 19431, 13782, 12182, 2415, 13925, 28372, 31142, 28291, 21756, 11598, 11369, 18971, 27021, 34069, 18620, 17376, 10286, 4241, 3168, -1679, 1206, 8948, 19946, 26960, 12669, 20561, 27794, 34637, 31411, 25814, 26546, 22511, 35108, 40641, 41820, 46851, 31211, 31164, 45869, 30203, 15152, 15958, 30225, 35755, 36259, 26496, 18602, 17480, 29150, 46658, 45984, 26666, 33047, 37867, 49376, 54823, 42081, 34909, 36006, 11857, -4935, -544, 7070, 4543, -2052, 3131, 19315, 37346, 36822, 33122, 29827, 9418, -4670, 5873, 18216, 36439, 45798, 49548, 41995, 22806, 13145, -933, -11284, -13202, -6673, 4914, 10192, 21428, 32955, 41673, 36244, 34224, 23398, 10977, 20392, 33873, 17885, 25827, 34869, 33442, 33773, 37866, 36319, 26977, 29674, 20102, 18567, 27483, 43808]
19343D3808n339M12J2458j3322j1364q069J4133j4839o558K700J3118J6373j2960
19330C0551j5913l735O045K660p77L485K752L005j3457j683J0480J0848M635j0580
19316B8316l158j078Q137m533k1060J905k856J0901o012j1000k310J3013J1030
19303B1295m146P230Q917j1190q048j673R79R477N502P201J350l348p377k742
19289B3427J058L467O897n536J2359P606q969N090O97j2802k4624K088J4537N311
19275C0606J912l64N965l812J249n153l926j324N696M018o067j4596R674J6073
19261C9951o26q467o627o660m401j084M112m356n843O502J0696n05l842Q128k018
19246B4960J942j339r865O011J3855P659Q336o794l563j1089j7190N222R52R947
$$ y = [43808, 38469, 38881, 51339, 38017, 26653, 18584, 32717, 17878, 11320, 14020, 27138, 43511, 30551, 14638, 10903, 16948, 19608, 18831, 22316, 25068, 28073, 14616, 12933, 23413, 34261, 38896, 28316, 25158, 24080, 32217, 27684, 6624, 8529, 5673, 16574, 10562, -438, -2748, 10265, 21295, 17149, 24379, 33296, 22106, 14058, 12385, 13364, 22841, 28343, 35544, 36894, 33546, 26169, 23427, 24485, 27952, 34849, 29313, 41672, 49278, 40309, 45399, 46096, 33294, 8670, 10758, 25295, 30606, 32518, 32154, 38119, 34307, 35556, 30403, 26477, 25153, 30849, 34867, 28800, 14204, 23878, 39951, 39325, 30858, 24231, 17571, 13170, 12086, 16198, 11842, 5999, 12501, 23197, 22692, 18850, 26978, 24960, 26902, 25563, 15698, 21709, 35564, 43223, 51559, 44765, 41202, 30113, 12923, 18145, 19097, 29044]
19232B9044J2535o473n057o225j2203O728J2762P534q941K84J2095n301j0174
19219B6608L622m114P252O61J21K931p952j073L812J654j821j0072j011m487Q647
19204B4778N725j0207O725R046M165N379j1633n550o217J0017R201N55R192j7377
19190C3799p83M968n774o980o29m820n917R969N386O783q095p236Q713Q845J2782
19175E1011J4736q917k2622j2223L980L05J3633J944p751j4204Q380J6358L538
19162D8168m789k481K341N217l205J166K361l302j2282j726O890o930r75K08J24
19147C0785K92l471o86J0287N153J934M816j406p704J0610k904o460o229j7778
19133A7239J5L607p52R660J846R503K757q843j171j46Q817Q737J0287k575r006
$$ y = [29044, 41579, 35106, 30049, 23824, 11621, 18349, 31111, 38645, 29704, 29988, 42083, 36782, 26608, 30230, 26116, 33368, 34029, 34150, 37081, 29129, 28056, 31868, 33522, 31701, 21629, 20618, 16131, 24778, 30503, 20296, 27021, 36067, 40232, 45611, 33978, 28428, 22211, 32228, 41429, 41984, 51176, 33799, 33016, 37984, 32210, 25230, 24601, 19781, 13864, 23833, 29219, 36002, 27907, 20671, 29384, 38229, 51011, 65747, 56830, 34208, 21985, 25965, 26270, 39903, 41847, 34096, 19892, 28272, 44630, 48168, 43379, 40898, 43239, 48456, 45251, 46417, 48778, 45476, 33194, 31468, 38358, 31428, 30453, 30661, 30785, 31077, 27606, 26920, 37207, 42360, 44294, 49110, 47704, 40000, 50610, 47706, 41246, 35017, 17239, 17254, 20861, 20109, 29769, 31615, 41118, 43875, 35032, 33861, 33715, 42532, 51269, 61556, 58981, 49975]
19118D9975j2550P18j85M82p290o68j0438m019J1659n542j265P178J4594j622
19104D1027P604n686j3327l610J1100K039N7J5948L316j8762r662J384L825k257
19090C2996P646r935l700j999J1459j0074r817L794L726q234J1368J3113j806
19077C8537L099n42K17o917J1732r442P447P550l927J2035j259K489Q780n453
19063F4346q001n655k035J0229n704N84J1800O419j607p208j4363N974J4377J859
19049G1015L204J982m793q581q880P06O990k468n242n803k353l611m702j4318
19035B3146j218r84L353p249J025O560M130K463j12r03J1778J0697L909r287q212
19020C9096K1J7807O429l663J708N724J177l180L964o542j3962O396k385l157
$$ y = [49975, 37425, 38143, 37958, 38440, 31150, 30482, 20044, 16025, 27684, 22142, 20877, 28055, 42649, 41027, 48631, 42945, 29618, 26008, 37108, 39147, 39204, 55152, 58468, 39706, 30044, 31428, 35253, 32996, 40642, 30707, 27007, 25008, 36467, 26393, 16576, 20370, 24096, 15862, 27230, 40343, 38537, 41636, 41094, 41311, 34394, 46126, 36684, 44131, 51681, 47754, 59789, 58530, 61019, 69799, 64346, 56345, 50690, 48655, 58884, 53180, 53764, 65564, 71983, 70376, 63168, 48805, 54779, 69156, 71015, 74219, 76201, 71408, 62827, 53947, 54653, 61643, 59175, 53933, 48130, 45777, 42166, 37464, 23146, 21928, 20944, 24297, 17048, 18073, 24633, 28763, 31226, 31114, 30211, 41989, 52686, 56595, 47308, 39096, 39117, 56924, 63353, 59690, 61398, 67122, 68299, 65119, 69083, 62541, 48579, 54975, 52590, 49433]
19006D9433R454N314K120j211M741j043p317j1950O953J7554N738j1378m484k0733
18992D3191m431j996O351N989o212j975Q092N297k523r466m280p913L720O795
18978D0639O947j0326q941J2360J6023J4550j3582q056J0033O860l641r421j3643
18965C9802L567J0960J9853J1261K225j3471j3753P95L901J372Q781O469M035
18952H5797K497Q71o237o144r872Q830R881J1358p371J5815L9646K4105N3737
18939B22913J36723J76386N3630j04780j21090p0761l869L9369J02895J75920
18929F07336O0885j43039j58157o9533m204K5325O6430J42575K06536J22856M6278
18918I03288k0610j94862j83804j02999m8879P966Q7566J77733J10617j35743
$$ y = [49433, 58887, 64201, 66321, 65110, 69851, 68808, 61491, 49541, 56494, 74048, 79786, 68408, 63924, 43191, 38760, 36764, 43115, 49104, 42892, 40917, 49009, 54306, 51783, 42317, 38037, 30124, 33844, 40639, 47586, 37260, 28319, 40679, 56702, 71252, 57670, 49614, 59647, 66507, 62866, 53445, 39802, 43369, 54329, 74182, 85443, 87668, 74197, 60444, 61239, 65140, 66512, 75293, 81762, 85797, 88294, 89165, 82928, 76784, 66912, 75742, 85623, 96981, 89610, 105425, 145071, 169176, 222913, 359636, 536022, 589652, 484872, 363782, 293021, 289152, 328521, 431416, 607336, 668221, 525182, 367025, 297492, 293288, 318613, 385043, 527618, 734154, 857010, 903288, 882678, 687816, 504012, 401013, 352134, 360100, 447666, 625399, 736016, 600273]
18908F00273j70041q6478m9385j7K9376R8012J81116Q4984j43890j63705r0451
18897B89794m6755l9686j3760n146J3946L9827P7612J68850J50680p4739j65059
18886C95564j27552o9966l8213k3438j9616n223j1177J2153J0679J6711L508M36
18874A43866J1872L5441P8234J65122K01064p375j77048j56576r7970m1286k7578
18863A27766k5646K550O280o574j5042q123q385Q96o51n203j890R23o13p011q117
18848E1160r669N777J4832Q077p097R255j00q956o43J1088O365J7900R191N583
18834A12763J794k8265k3180M852k305n893J1317N129l658J709J292O073j1351
18821G0277l0415j4080O695O617J9848J1822J0295M706l918O819L448J1758p067
$$ y = [600273, 430232, 343754, 294369, 294352, 323728, 421740, 602856, 687840, 543950, 380245, 289794, 243039, 203353, 189593, 184447, 198393, 238220, 315832, 484682, 635362, 560623, 395564, 268012, 198046, 159833, 136395, 116779, 111556, 100379, 112532, 123211, 139922, 143430, 143866, 155738, 191179, 269413, 434535, 635599, 628224, 451176, 294600, 196630, 155344, 127766, 102120, 104670, 110950, 104376, 89334, 81211, 72826, 73722, 73071, 67868, 65978, 66901, 66288, 59277, 51160, 41491, 47268, 62100, 70177, 63080, 72335, 72235, 63279, 62636, 73724, 80089, 97989, 107180, 112763, 114557, 86292, 63112, 67964, 65659, 59766, 71083, 76212, 72554, 74263, 75555, 81628, 70277, 39862, 25782, 32477, 39094, 58942, 70764, 81059, 85765, 81847, 88666, 92114, 103872, 96805]
18808I6805j6358P154o51k265l287q658K68j6r951q28j0713j3605J0630R672m943
18793E3254L987J9456P539m470j1978l458K321R479J017J1690p831o432N442L798
18779H3814L326l252L758j679k0040O639J0544J3234Q981J3766K0024L8678P1077
18766B48870N2638m3321o2736j9224p179q18j1570j9523j7130j0065m132j1901
18754I3909l025J804K58L997L633M88P997J2230p951j1982q995p692o250J8882
18740I7303L657l392J2658J4943J448l491q619j5676j5115n294O881J0632K2691
18727A18626K2782L547p890j3430O307N006J0837K820l46K989L1757J4293l82
18714A96916J5737J3951j4469j9910k1759j4340k097K0376J6974M4534O0589J9374
$$ y = [96805, 80447, 87601, 86950, 84685, 81398, 72740, 73008, 72992, 63041, 62213, 51500, 37895, 48525, 58197, 53254, 57241, 76697, 84236, 79766, 67788, 64330, 66651, 76130, 77147, 88837, 81006, 74574, 80016, 83814, 87140, 83888, 87646, 85967, 65927, 72566, 83110, 96344, 105325, 119091, 139115, 177793, 248870, 301508, 258187, 195451, 176227, 169048, 168230, 156660, 137137, 120007, 109942, 105810, 93909, 90884, 92688, 92946, 96943, 100576, 101064, 109061, 121291, 113340, 101358, 92363, 84671, 78421, 97303, 100960, 97568, 110226, 125169, 126617, 123126, 114507, 98831, 83716, 78422, 85303, 95935, 118626, 141408, 144955, 137065, 123635, 129942, 134948, 145785, 148605, 148259, 151248, 183005, 197298, 196916, 212653, 226604, 212135, 192225, 170466, 156126, 154029, 174405, 191379, 235913, 296502, 315876]
18702C15876l5236m1752k1690n322j8295j8128Q500K3929M6033P4309J12742O4428
18690E05394o0807q2601n4796m0254k6521J489J2081L2466O4688M5533l1724m4097
18678C20851L145J6269J0686K9965J0104j8245l2014k6616j4581j8584J2594K1390
18666C14964J2126k6643n1334k582L3792L4743K4851j908n031j0430o645L828
18654C19731K6071M2095N1244L2930j0243j3569L5026Q3142K7585o4425q7667
18643D41920l6642l1862O9K7654P1633J46027J78709J06365k3604r0856j02774
18632F86639q8005l4986M6272R0352M6408k1976j08432j32728r9890o2327k0279
18621C01048m574L7904M3095M0921K7315M366q437K7983O7031J8859l7268j5463
$$ y = [315876, 280640, 238888, 217198, 211876, 193581, 175453, 183953, 207882, 253915, 328224, 440966, 505394, 444587, 361986, 307190, 266936, 240415, 241904, 253985, 286451, 351139, 396672, 364948, 320851, 323996, 340265, 350951, 380916, 391020, 372775, 340761, 314145, 299564, 280980, 293574, 314964, 327090, 300447, 249113, 246531, 280323, 315066, 339917, 338009, 332978, 322548, 315903, 319731, 345802, 387897, 439141, 472071, 461828, 448259, 483285, 566427, 594012, 529587, 441920, 405278, 373416, 373485, 401139, 472772, 618799, 797508, 903873, 880269, 789413, 686639, 598634, 563648, 609920, 700272, 746680, 724704, 616272, 483544, 383654, 321327, 301048, 296474, 334378, 377473, 418394, 445709, 450075, 441638, 469621, 536652, 555511, 518243, 502780]
18609E02780M9972N4898J0990o826M601j0992p66N2078J03670K8198q1748q6733
18597F20122l5722R586R121m703M1183Q4732O3952j3788n5184j5689O771m6393
18585F63988p8806p189Q8072J07898Q0139m5966j23010j29268r4697o2516j8046
18574C80599K9140L8381O0597N1036N7476M6601r592j4113M1195J34371K12766
18563A028457J66845J5583n167J37158K63723J76618J16366L74799N39328K5818
18553B839528m16868l70252k18874j32864M1260L21938O66653Q09401K70259l17320
18543C492861m29848m33632m29860m80201l97686k53083j39754n6329K8532J10306
18533A011306J71573J17604r9843k11460j57540o3527k7879k7592n1643n3783
$$ y = [502780, 552752, 607650, 618640, 611814, 616415, 605423, 604657, 656735, 760405, 788603, 706855, 620122, 584400, 593986, 603107, 598404, 639587, 724319, 788271, 774483, 719299, 703610, 710381, 663988, 585182, 577993, 666065, 773963, 854102, 808136, 685126, 555858, 461161, 398645, 380599, 409739, 448120, 508717, 559753, 617229, 663830, 654238, 640125, 681320, 815691, 1028457, 1195302, 1210885, 1205718, 1342876, 1606599, 1783217, 1899583, 2274382, 2813710, 2839528, 2422660, 2052408, 1833534, 1700670, 1741930, 2063868, 2730521, 3539922, 3810181, 3492861, 3063013, 2629381, 2199521, 1719320, 1321634, 1068551, 928797, 872468, 901000, 1011306, 1182879, 1300483, 1200640, 989180, 831640, 768113, 740234, 712642, 660999, 607216]
18523F07216M740M0223L6128j852L298M8833Q7735R0480J22265K60724M38203
18512A737993L25980j02377k29565j1547J60550J1065j32480j307L37634Q03458
18502B899404J018178J14999o02388m37637k05905M340K00797M56425O50770L6301
18492D135284r07588r33293n32000k77842j37086l9856P989K908j52572j85420
18482I80524o9035k5985m6260J4979N2902j8639j30753j20270p3072l2284j6864
18471E15243r498k5223q805L549K1193M0005N0270M7745M4594J2454J3940J00677
18459H06144J10085q2140j29589m9976O258M9754Q6625J52829J17795p7395j24509
18448H65881r9309q8798o9543m0229p684M115K074K5492K8999j1895k7815m460
$$ y = [607216, 611956, 652179, 688307, 686455, 689753, 738586, 826321, 916801, 1039066, 1299790, 1737993, 2063973, 1961596, 1732031, 1720484, 1881034, 1892099, 1759619, 1758312, 2095946, 2899404, 3917582, 4032581, 3430193, 2992556, 2786651, 2790991, 2991788, 3448213, 4098983, 4135284, 3227696, 2294403, 1762403, 1484561, 1347475, 1307619, 1315608, 1318516, 1165944, 980524, 911489, 885504, 839244, 854223, 907125, 888486, 757733, 637463, 564391, 532107, 515243, 505745, 480522, 471717, 475266, 496459, 536464, 586734, 634479, 679073, 691527, 705467, 806144, 916229, 834089, 704500, 654524, 660782, 710536, 797161, 949990, 1067785, 990390, 865881, 766572, 677774, 608231, 568002, 560318, 564433, 566507, 591999, 620998, 609103, 581288, 576828]
18436E76828O164L2290L6490j6406m1945m3713r875K266l875m908J7776L8126
18424E89218L9152P560k8746k0706j6103j0695l735L1462J8188j4336l0005r709
18412E51545J020L6650M1858J1219k0886j6342N996K2133O069j4671j530J7655
18400F40716L4304M0788J9371J540J0020Q80p027p139Q901L3961N2352N9675N9397
18387I47739N2858J3984r725k5423l0521j8978j0778K9608M2923M6759P943L9163
18375A085552J23842J78071Q0582n8688o1661K0214K2800L6166L5593M7225R1354
18364A601050J54342K32313L19276M19471L71803K98946J19853m3525J51964N51261
18354D176754Q85157Q57795R82378J994231M234265M638463q34174k980090j613150
$$ y = [576828, 582992, 615282, 651772, 635366, 593421, 549708, 539833, 542099, 538224, 533316, 551092, 589218, 628370, 635930, 607184, 586478, 570375, 559680, 555945, 587407, 605595, 591259, 561254, 551545, 552565, 589215, 631073, 642292, 621406, 605064, 611060, 633193, 639262, 624591, 623061, 640716, 675020, 715808, 735179, 736719, 746739, 747619, 740592, 733453, 742354, 776315, 828667, 888342, 947739, 1000597, 1014581, 1004856, 979433, 948912, 929934, 919156, 948764, 991687, 1038446, 1046389, 1085552, 1209394, 1387465, 1468047, 1409359, 1347698, 1367912, 1390712, 1426878, 1462471, 1509696, 1601050, 1755392, 1987705, 2306981, 2726452, 3098255, 3397201, 3517054, 3473529, 3625493, 4176754, 5061911, 5919706, 6902084, 8896315, 13130580, 17769043, 16934869, 13954779, 12341629]
18345A2341629r62080k09862R89589K485237M500201Q465358J5969060J8798010
18337F2377142j268131j3375548o625689L217675J2695299K7708713N7506545
18330A42236006Q6194466M4771896P668671j9525344p3970164o7398814l6789025
18323H3187692j5418381k357640J0882761L1638326N0802861Q999207m7253127
18316A20481699m4335969k4882018j2877627p356182m372089k180679P1167K853549
18308B7401851L462155j605371l731112j760852J166458M734775J0135242K0981673
18300F0784819M2417251N5011920k564712n0870995m0783373k1154294j1050431
18293C1790185o986573m804289l300998k307062j604694j016349p16732m61465
$$ y = [12341629, 11379549, 11169687, 12159276, 14644513, 19144714, 27610072, 43579132, 62377142, 61109011, 47733463, 41107774, 44325449, 57020748, 84729461, 142236006, 228430472, 273202368, 280871039, 261345695, 187375531, 119976717, 83187692, 67769311, 65411671, 76294432, 107932758, 158735619, 167734826, 120481699, 76145730, 51263712, 38386085, 31029903, 26657814, 24477135, 24548302, 27401851, 30864006, 29258635, 25527523, 23766671, 24933129, 29667904, 39803146, 60784819, 103202070, 158213990, 155649278, 104778283, 63994910, 42840616, 31790185, 24803612, 19999323, 16698325, 14391263, 12786569, 11770220, 11053488, 10592023]
18285A0592023J57127J196860K856716N920594J2114700J9855370P192835j6108730
18277D3777495j6476170r072994m636472k772160j782334j155188q23937o50897
18269F407343m51353l60089n04439m65358j48975J31530O6453q9765k01756j69006
18259D214585j22231p2179j03543l800N067n5840r5532k04300j83224J5955q897
18248C386061j09320n1401j56249j23193j01114l01812l44347k31880j72945j29750
18238A664050j6078J16165J28513p2992j57206p5719j8788p8327r1515l5943J6709
18227A378869L5116L0299M8982Q1563J10789K13014K34950R9260m8134o6390L4023
18216B152341J72978K61930L26707K53153J84460M33163P97997O42984J36441
$$ y = [10592023, 10749150, 11946010, 14802726, 20723320, 32838020, 52693390, 59886225, 43777495, 27301325, 18228331, 13591859, 10819699, 9037365, 7882177, 7058240, 6407343, 5955990, 5595901, 5091462, 4626104, 4477129, 4608659, 4675112, 4585347, 4383591, 4214585, 4092354, 4020175, 3916632, 3912832, 3917899, 3862059, 3766527, 3562227, 3379003, 3394958, 3386061, 3276741, 3225340, 3069091, 2945898, 2844784, 2542972, 2198625, 1966745, 1793800, 1664050, 1647972, 1764137, 1892650, 1819658, 1662452, 1586733, 1567945, 1489618, 1398103, 1362160, 1378869, 1413985, 1444284, 1493266, 1574829, 1685618, 1898632, 2133582, 2232842, 2184708, 2118318, 2152341, 2325319, 2587249, 2913956, 3167109, 3351569, 3784732, 4582729, 5225713, 5362154]
18207E362154P9700N54623J020391P08475m59494j061982o21543J42472R65075
18198F689871K251696M648344O930689K672776m367327m723588k036346J32086
18190A2198201J630743M422175Q774692Q009704l304445r537777o974298l616659
18182A1602336j953356j125174l60531N13213J732415L270308K684030j708017
18174A4655224l583165k514180j347334o21108j49124K46248L67930K44951n1816
18165G247626l57378k78807J36325O58106J325541K209488K724735K410580K810176
18156A8886392L526701K375768K583455L647807M391582L914714j048557m069574
18148C4208288k407302J184477M390487O985412P941533M570173j67554N212344
$$ y = [5362154, 5441854, 5996477, 7016868, 7725343, 7265849, 6203867, 5582324, 5724796, 6689871, 8941567, 13589911, 20520600, 23193376, 18826049, 14102461, 12066115, 12198201, 13828944, 18251119, 27025811, 35035515, 31731070, 22193293, 15218995, 11602336, 9648980, 8523806, 8163275, 8676488, 10408903, 13679211, 16363241, 14655224, 11072059, 8557879, 7210545, 6589437, 6440313, 6686561, 7054491, 7299442, 7247626, 6890248, 6611441, 6747766, 7405872, 8731413, 10940901, 13665636, 16076216, 18886392, 22413093, 24788861, 27372316, 31020123, 35411705, 39326419, 38277862, 34208288, 31800986, 32985463, 37375950, 44361362, 52302895, 56873068, 56705514, 61917858]
18140F1917858J0643605K223970o250176n157674n995445k363727P650585J8834717
18132H1503713K0335932l078561k6481876k3840551j3701834p289089m247912
18125B3199822k603652j557210q44346k47485O76478K218341M151026M714564
18117B9707538Q79265l877540m082213j988092O7212J456745K817982O002624
18109C0983521J1752452J1574542l778736q246957k112639M775873J2033013K3497278
18101H0478347M2484695N7586262M0068616J6998911K3635128K6876519Q246760
18094B96375238k9172237m2359974j7158253N69048j6916992l4743598k9342361
18087A27250871j1020703R364335K9735683M1767305M0843138K0322879p218893
$$ y = [61917858, 72561463, 74785433, 68535257, 63377583, 57382138, 55018411, 62668996, 81503713, 101839645, 98761084, 72279208, 48438657, 34736823, 27447734, 23199822, 20596170, 19038960, 18194614, 17947129, 18623607, 20841948, 24992974, 29707538, 30586803, 26709263, 22627050, 20638958, 20706170, 22162915, 24980897, 30983521, 42735973, 54310515, 50531779, 42284822, 40172183, 44948056, 56981069, 80478347, 122963042, 180549304, 220617920, 237616831, 261251959, 288128478, 296375238, 267203001, 224843027, 207684774, 208253822, 191336830, 156593232, 127250871, 116230168, 125594503, 155330186, 197097491, 237940629, 258263508, 251044615]
18080B51044615j4306776j242796P24279l8325918n6621009m2195755k4890804
18073G4185836j4785407r887020p204037n584937m531973l749410k924320k090921
18065B3427811j449416q81282j61558P79085K109708L049541J012944k394209
18057B5492624k909721j349336O27742K767990N882018J1090687J3858865P640525
18049F3101394n06438p444417j0246224q351299m383447q3420M967323J1992154
18041D9045626K2721104L0897152K2648942q379063k9364260k5024266j3177189
18034D9368046n437822k386556R25916N845129R564135J195436q707635o306941
18026D4059708j842229l003883m068363l7939L332327j088297o794290o593786
$$ y = [251044615, 236737839, 235495043, 236219322, 197893404, 141272395, 99076640, 74185836, 59400429, 49513409, 42309372, 36724435, 32192462, 28443052, 25518732, 23427811, 21978395, 21097113, 20935555, 21714640, 23824348, 26873889, 27886833, 25492624, 22582903, 21233567, 21861309, 24629299, 30511317, 41602004, 55460869, 63101394, 62594956, 55150539, 44904315, 36553016, 32169569, 32086149, 37053472, 49045626, 71766730, 102663882, 125312824, 116933761, 87569501, 62545235, 49368046, 43930224, 41543668, 42469584, 48314713, 57878848, 59074284, 50366649, 44059708, 42217479, 39213596, 35145233, 35107294, 38439621, 37351324, 30557034, 23963248]
18018B3963248m017733k183363j164511j27841J171468J118047j106297k129938
18010A5523080j107185P48601K759779M089818M359615O279813M434711n366691
18002C1721541q408212n390138k224758K88385K679028K758007j322461l134706
17994A6966686j566955O60063K817019M577652M845066P106739J1004544J0932107
17986E7342921P544007o60514r221581q779426p005175r647286q689231n561881
17978A5321834l244595j931688j265715r89944q20355o04893l85953j89633P4186
17969E963244L91328P64663J476744K640526L727813K149423j263907j202273
17961A4647561J705996L031985j840025m660097l474850j964620j047829m46882
$$ y = [23963248, 19945515, 17762152, 16597641, 16469800, 17641268, 18759315, 17653018, 15523080, 14415895, 15164496, 17924275, 22014093, 26373708, 32653521, 37088232, 31721541, 23313329, 17923191, 15698433, 15986818, 18665846, 21423853, 20101392, 16966686, 15399731, 16059794, 18876813, 23454465, 28299531, 35406270, 46410814, 57342921, 64886928, 64226414, 55004833, 46225407, 39220232, 29572946, 20883715, 15321834, 12077239, 10145551, 8879836, 7889892, 7069537, 6464644, 6078691, 5889058, 5963244, 6354572, 7119235, 8595979, 11236505, 14964318, 17113741, 15849834, 14647561, 16353557, 19385542, 17545517, 12885420, 9410570, 7445950, 6398121, 5951239]
17953E951239o4998n8447r1033K18642R03722J929588L766607O940714O605298
17944B6101332k859821p463773n342441k761143j315401o95587n13711k60450
17936D889005K07977R29106K123124L285919J012388k799299l041554j868563
17928D738103j079072p13983m76131l12362j63686n1461K0075l9462j21299j25548
17918A675174j04591o1366j11380j45550j06583n7292l1329J5819N9106R6502
17908A228510M9191j01410j52202j15415p5063n4309m1148k9820l1437J647K8444
17897G06988L7238O4283J37963J44683o0993j73652j44395p5815l8109j3130j2546
17886E72515P19j916P020J7023M1592P8952O9984l7846p3852l8993l168L9979
$$ y = [5951239, 5886241, 5827794, 5736761, 5955403, 6859125, 8788713, 12555320, 19496034, 26101332, 23241511, 15777738, 10435297, 7674154, 6358753, 5663166, 5149455, 4889005, 5096982, 6026088, 8149212, 11435131, 12447519, 9648220, 6606666, 4738103, 3659031, 2945048, 2468917, 2156555, 1992869, 1941408, 1961483, 1922021, 1800722, 1675174, 1570583, 1509217, 1397837, 1252287, 1145704, 1088412, 1057083, 1072902, 1132008, 1228510, 1277701, 1176291, 1024089, 908674, 833611, 779302, 738154, 708334, 676897, 678544, 706988, 744226, 808509, 946472, 1091155, 1030162, 856510, 712115, 636300, 598191, 585061, 572515, 573234, 571318, 578338, 595361, 636953, 715905, 785889, 748043, 674191, 635198, 632030, 672009]
17874F72009J10257J98135J60971r9949k00296j45314o5522k3436q225o172K0645
17863F13103N1086K9420Q157j899J9141R022R09L1283O3981P9277R6164J65628
17851A165272K85201M06192K07524j76787j73506L0158K12079J33472N0872J40080
17841B280557K21041K04888M28681O36005O82383R46207J784794K854015J750119
17832A1788690j374360j834456n94933O80268K106854M134008P586452J5118777
17824C7611300L0506275L8923705k450017l4663926k6867335j3304066n898609
17817B3857327k247104O79218M274166J0794475K3826783L4656828L768725l0331290
17809F9279128k6640822j4709211p532883m067100k327784j551797r01935k71454
$$ y = [672009, 782266, 980401, 1141372, 1041423, 841127, 695813, 630291, 606855, 598630, 592458, 613103, 664189, 693609, 701766, 699867, 719008, 728030, 728939, 760222, 824203, 903480, 999644, 1165272, 1450473, 1856665, 2064189, 1887402, 1713896, 1744054, 1956133, 2089605, 2140477, 2280557, 2501598, 2706486, 3135167, 3771172, 4453555, 5399762, 7184556, 10038571, 11788690, 10414330, 8579874, 7984941, 8665209, 10772063, 14906071, 22492523, 37611300, 68117575, 107041280, 104591263, 69927337, 43060002, 29755936, 23857327, 21610223, 22289441, 26563607, 37358082, 61184865, 95841693, 99610418, 69279128, 42638306, 27929095, 20396212, 16329112, 14001328, 12449531, 11547596, 11276142]
17801A1276142L12189R75550K093402M182997Q135619J6402087K9256702K1377854
17793I4012542j6640300k7211199j7148321q148835l422706o81034J951528O123010
17785B8834685J4550365K9095793K6974961j5329941l1538610k0717737j0228390
17778B1641126n302679l196534j932127q85950L92922J471146N8042k054311k003877
17769H187758j561216j214715p52629l56569k26509l40814k43227p5124j63735
17760C253220k72780j72891m7510p8933k93184l36014k84256k24236j60159j10528
17750A272729o6233l7030n3073o9061m4572j3793N1511J14070J85120K5825j97679
17739A167814j68932o9961L2096J04421J60080L11563K78166j46386l71263k92796
$$ y = [11276142, 11588331, 12563881, 14657283, 18840280, 26975899, 43377986, 72634688, 94012542, 77372242, 50161043, 33012722, 24863887, 21441181, 20760147, 22711675, 28834685, 43385050, 72480843, 99455804, 84125863, 52587253, 31869516, 21641126, 16338447, 13141913, 11209786, 10323836, 10716758, 12187904, 12245946, 10191635, 8187758, 6626542, 5411827, 4659198, 4302629, 4076120, 3735306, 3492079, 3416955, 3253220, 2980440, 2807549, 2760039, 2681106, 2387922, 2051908, 1767652, 1543416, 1383257, 1272729, 1206496, 1169466, 1116393, 1047332, 1002760, 988967, 1040478, 1154548, 1339668, 1365493, 1167814, 998882, 928921, 961017, 1065438, 1225518, 1537081, 1815247, 1668861, 1297598, 1004802]
17729A004802j52725p0801p4450o1262L005J02327J72458P4101j38782j55240
17719G03433p4031m642P4990J93017L33342K59097k10333l75401k43111j20375
17709E35986o9137m4108m1616m690M4476K8933M984N5777P5813m4267r1142n1636
17697C99373J1837L02l6800m2045m4478k1891q292K2871J3472L643K942K052L0322
17684C33308O2318J08179L7246q2653p2908l9415k1193R660K9346O5971J19969
17673E49828J34560P438j46615j24053o9183j5905L2055N5545M8693P2871P5722
17662F20956q862o3513r6576q6709l6820j2471J4824J9432J5048K7222j5599n7508
17650C19424n5695k7683k1765r092r020m125N422j0498j8999L323j4978K383J4776
$$ y = [1004802, 852077, 781276, 706826, 645564, 648569, 750896, 923354, 997455, 858673, 703433, 629402, 624760, 699750, 892767, 1226109, 1485206, 1274873, 899472, 656361, 535986, 466849, 422741, 381125, 376435, 420911, 449844, 454828, 510605, 586418, 542151, 451009, 399373, 411210, 411512, 374712, 332667, 288189, 266298, 258006, 280877, 294349, 297992, 300934, 302986, 333308, 395626, 503805, 541051, 458398, 385490, 346075, 324882, 334542, 363888, 429859, 549828, 684388, 691826, 545211, 421158, 351975, 336070, 368125, 423670, 472363, 545234, 620956, 612094, 548581, 452005, 365296, 328476, 316005, 330829, 350261, 365309, 392531, 376932, 319424, 263729, 236046, 214281, 205189, 196169, 192044, 197466, 186968, 167969, 171292, 156314, 158697, 173473]
17637A73473L300j9385j186O157J8368Q402L0406O7724N0051O9022J02418M6287
17625E55037j7216n6284q0444l5332M8440J28302J96674J45725l7551j75981j76019
17614D95351j20179o4397k0991m940K5339R2818J34896M4796p2182j00532q7045
17603C22934n7292l3075k8278k4412j4876j4775m409Q637N171K0051M2088P2841
17591B94605Q8962P3628L1035j8220L157L8107r84n4953l8417K7677O4523L2989
17579E42109K0828Q3622J38337J13444K3608j4551j7198m8329m3820P580J338
17568H06968p5142j27692j12001o2035k2001J2122q942p0294o8188n0437l7218
17557A85140k0446m290j637n08J1276L03J0720N527j184o17K1796K6480K2690
$$ y = [173473, 176773, 157388, 156202, 162359, 180727, 189129, 219535, 287259, 337310, 406332, 508750, 555037, 537821, 481537, 401093, 365761, 414201, 542503, 739177, 884902, 847351, 671370, 495351, 375172, 310775, 289784, 284844, 310183, 403001, 537897, 582693, 510511, 409979, 322934, 265642, 232567, 204289, 179877, 165001, 150226, 145817, 154454, 159625, 179676, 221764, 294605, 383567, 457195, 488230, 470010, 473167, 511274, 510290, 455337, 416920, 444597, 509120, 542109, 562937, 646559, 784896, 898340, 921948, 907397, 890199, 841870, 798050, 805630, 806968, 731826, 604134, 492133, 430098, 408097, 420219, 411277, 340983, 272795, 222358, 185140, 164694, 160404, 158767, 158259, 169535, 169838, 180558, 186085, 184901, 184284, 206080, 232560, 255250]
17544B55250L365J7064P2935R1929L3527O458J3196P5778O8714J4157k9003p9959
17532E43411q6689n0458K4955J17745J58925L5618l6460j4428j0123q2371j34654
17521D65471r8474p3262k0856M8538R0828J16541P2881o5926j31375q9689o0527
17510B54150m6697m4392l3195r000j943k896j5092j0025j3171j099N827J4674
17498I7141K878o894J5786M1956N0321M2984J0156O900k0491m6687l6081j5252
17486A42717j377N761K8882R5108J23780N0382k9963o4098q3298p1840l0580j766
17474A63708r37K3783j992j5896l671R143j0272j6948k7576k5267n691k5438N483
17461F8429k476l6945Q68J537n076p508J430M919O761J9298J8980M0356L0348
$$ y = [255250, 258615, 275679, 348614, 440543, 474070, 480528, 493724, 569502, 638216, 652373, 623370, 543411, 456722, 406264, 431219, 548964, 707889, 743507, 707047, 692619, 682496, 600125, 465471, 366997, 293735, 272879, 321417, 412245, 528786, 601667, 535741, 404366, 314677, 254150, 207453, 163061, 129866, 120866, 118923, 116027, 100935, 90910, 77739, 76640, 82467, 97141, 100019, 93125, 108911, 150867, 201188, 244172, 254328, 261228, 240737, 194050, 157969, 142717, 141340, 147101, 175983, 271091, 394871, 445253, 415290, 351192, 267894, 196054, 165474, 163708, 162771, 186554, 184562, 168666, 164995, 174138, 163866, 146918, 119342, 94075, 88384, 62946, 68429, 65953, 29008, 29876, 31413, 26337, 18829, 20259, 25178, 31939, 51237, 70217, 110573, 140921]
17448A40921M361k3092l4587r193P815N5313Q9682L418n4868P86M0096L6724k4660
17435B32716o9255n5948l0107j4445N25N027K5151K5151K3481R634k5166k6492
17423A00272k1591k5747p486k163j5924q084Q510M676r342K742L061o203R418
17410C2139J4858Q21r525j0610k2726j7720J4785P085N959l576O517M580M389
17397B6976J445r849n658J0752p181j5810N79J445J777L140L094m010N728K747
17383A5175q555q049L227l441R652Q989r904p181j3855L727J2157R571J2660l021
17369B1152q894P984O324n200q896p025j1294O531K417j578j3070n901J4228J1362
17355H140j0180j0121j974J2852K210q184j0553j4839l820M667L151j616L616
$$ y = [140921, 145282, 122190, 87603, 78410, 86225, 141538, 231220, 234638, 179770, 180556, 220652, 257376, 232716, 163461, 107513, 77406, 62961, 63486, 68513, 93664, 118815, 142296, 151930, 126764, 100272, 78681, 52934, 45448, 43285, 27361, 19277, 27787, 32463, 23121, 25863, 28924, 22721, 32139, 46997, 47818, 38293, 27683, 4957, -12763, 2022, 9107, 15066, 11490, 18007, 22587, 26976, 28421, 18572, 12914, 23666, 16485, 675, 1254, 2699, 4476, 7616, 10710, 6700, 12428, 15175, 6620, -1429, 1798, -1643, 8009, 16998, 7094, -87, -13942, -10215, 1942, 11513, 24173, 21152, 12258, 20242, 26566, 21366, 12470, 5445, -5849, 682, 3099, 1521, -11549, -17450, -3222, 8140, -2040, -12161, -14135, -1283, 927, -7257, -17810, -32649, -36469, -31802, -28651, -30267, -26651]
17342b6651K6736J5341k559r575J492N112r70K042J315j86k909Q180j583J3687
17328B9472j2195n199O383j0098m664l0K05r188j2844p370J5380R099m911J652
17314d308P783N132P776j5919j609J9233O460J255n520L295n91q551j618N635
17300A8453q146j3693l871J048K507j3205P779K0866N368J369k294K907K989J8400
17286D0477M096q433K0054K7657M4135K2093L0231R1609J45406J47896m0277j70114
17274C54830j52717p2811k4174q857p905j203J9394J6988K6302P6116J34531J07937
17262D68431o5075j33951q7465m8443l3807m009l450L0560L6160O2433J07287
17251C28671J13572l3493j24009q2167n2870k2049q710k2418l908J0497K1208
$$ y = [-26651, 85, 15426, 12867, 3292, 4784, 9896, 8926, 10968, 12283, 12097, 9188, 17368, 15785, 29472, 17277, 12078, 18461, 8363, 3699, 3669, 3874, -5314, -18158, -25528, -10148, -1049, -5960, -4308, 3475, 8607, 16383, 464, -1145, 18088, 24548, 25803, 20283, 23578, 22987, 14436, 12818, 18453, 10307, -3386, -7257, -6209, -3702, -16907, -9128, 11738, 17106, 18475, 16181, 19088, 22077, 40477, 44573, 36140, 56194, 83851, 127986, 150079, 180310, 271919, 417325, 565221, 524944, 354830, 202113, 129302, 105128, 96271, 88366, 87163, 106557, 123545, 149847, 225963, 360494, 468431, 403356, 269405, 181940, 133497, 99690, 95681, 92231, 122791, 158951, 221384, 328671, 442243, 408750, 284741, 202574, 149704, 127655, 118945, 96527, 92619, 103116, 124324]
17240A24324N2856J04778J55941J13166q4104j56362r2095m6665j6196l2156l4757
17229H8730k0942k3042j5267j695o676k981P523l103o028M325J095o466j2168
17216C305m970O057m488k854J179L545M15j4227K258J6776J1781J1586M336m202
17202C0497j947j1872k763j64q963q340J2254J229J816R810O52r210j0892L130
17188E237O94J1004J695l555k173n599p9m728L028j424j482l822o086Q110m600
17173c780k983O57j08J0K986l354O35K029L310J640o165o695O703J1136P538j1594
17157A965o410P427k299k007j342j294l993K104L895K841J252j1274j2803J5498
17143f440R372Q884M040J687n163j0561l205Q30j3111L955O780m898j1531n842
$$ y = [124324, 177180, 281958, 437899, 551065, 466961, 310599, 218504, 171839, 155643, 123487, 88730, 67788, 44746, 29479, 27784, 21108, 18127, 25650, 22547, 16519, 20844, 21939, 15473, 3305, -1665, 4392, -96, -2950, -1771, 1774, 2189, -12038, -9780, 6996, 18777, 30363, 34699, 30497, 28550, 16678, 13915, 13751, 4788, -3552, 8702, 9931, 11747, 21557, 22209, 12999, 2107, 5237, 5931, 16935, 18630, 15075, 12902, 7303, 7224, 2496, 5524, 4100, 2618, -1204, -7290, 820, -3780, -6763, -6106, -6214, -6204, -3218, -6572, -5937, -3908, -598, 1042, -5123, -11818, -5115, 6021, 13559, 1965, -4445, 2982, 683, -1324, -2666, -3960, -7953, -5849, -1954, 887, 2139, -9135, -21938, -6440, 2932, 11816, 15856, 17543, 12380, 1819, -1386, -556, -13667, -9712, -2932, -7830, -19361, -25203]
17129b5203R125R4J0349K2313O046r888k162k558J539o940j6932r007l391K6730
17115A15K0900q549o776N757M569k932j817n981j125m17J993O799K721k372j1804
17100A081m822n987k0J3957N026q809k105o482M785k894q237m71P163l515k084
17085a3414J1443J19j138R448r893j0662P622J60K888J3503j2543j2982N890j004
17071a0563j1149P951O91n312q697p008M07L271J6258N281P784K128l113R110
17057G039M140Q253l038o91j3120k182j0437j1121J1075J1949P336M649k2313
17044h461q275O85O511r63l132j7588l423K5073J0763M082R763q243k2537o440
17030b2185M893k48P611J3254j584P43j397r091K362K953n24m061J5083M071n99
$$ y = [-25203, -16078, -15984, -5635, 16678, 22724, 12836, 10674, 8116, 9655, 2715, -14217, -23224, -26615, 115, 21015, 12466, 5690, 11447, 16016, 13084, 11267, 5286, 4161, 3744, 5737, 12536, 15257, 12885, 1081, -3741, -9728, -9748, 4209, 9235, 426, -1679, -8161, -3376, -6270, -14507, -14978, -7815, -11330, -13414, -1971, -1852, -2990, 6458, -3435, -14097, -6475, -6315, -3427, 10076, -2467, -15449, -9559, -10563, -21712, -13761, -13070, -18382, -27079, -34087, -33680, -30409, -14151, -8870, -1086, 1042, -2071, 7039, 11179, 19432, 16394, 15703, 2583, 401, -10036, -21157, -10082, 1867, 9203, 13852, -8461, -16736, -16051, -9540, -10503, -13635, -31223, -34646, -9573, 1190, 5272, 15035, 6792, -15745, -22185, -17292, -17540, -9929, 3325, 1741, 2484, 1087, -8004, -5642, -2689, -3213, -7274, 7809, 11880, 11281]
17015A1281r119J5334R521j7287j1515K97p265l682J0058n021q260J036j447j5079
17001c1148j0684j072J7548N613J8761J4685j1855r625m83P178q767J4618j698
16988C071M729J1070j0612l742J325M64L26j2956n443P192N253O141J1678j3701
16974D795j1635m865k807J38N212J2398q289r494Q366l839n904l257n506k107
16960b6794o265Q101J9567Q271n30p42m396p450j7366R190J8553q207k843N871
16946e040O183r690p704P182k891j1422n291Q12J1783J430J2901k802r340L598
16932a0291J4194m528M167j5831j0632J5108M940J049p058N7l086M484r320o481
16918b3228l343R986J6542m787n701M272P058o353o656P618n206L324N552N487
$$ y = [11281, 2162, 17496, 27017, 9730, -1785, -1488, -8753, -12435, -2377, -7398, -15658, -14622, -16069, -31148, -41832, -42904, -25356, -19743, -982, 13703, 1848, -7777, -8260, -1082, -9849, 4769, 3071, 7800, 18870, 8258, 4516, 5841, 6305, 6631, -6325, -11768, -4576, 677, 6818, 18496, 4795, -6840, -11705, -14512, -14374, -9162, 3236, -5053, -14547, -6181, -10020, -15924, -19181, -24687, -26794, -33059, -24958, -5391, 2880, 2350, 1608, -2788, -10238, -27604, -18414, 139, -8068, -10911, -5040, 1143, -8547, -16251, -9069, -11960, -23382, -28673, -27861, -16078, -14648, -1747, -4549, -13889, -10291, 3903, -625, 3542, -12289, -22921, -7813, -2873, -1824, -8882, -8825, -11911, -7427, -16747, -23228, -26571, -16585, -43, -4830, -10531, -6259, 799, -5554, -12210, -4592, -9798, -6474, -922, 4565]
16904D565j784j2178K773J0332J7693p654k5247q306P921J1528J9694j0087j2705
16891c455j2211N373o167p290J0460M701j552J2793K62L875K447J539J5726j69
16877B6332r546l013K670k0711j2307j4498j114K453J6771J1746l895j784k155
16864i051n976R610J4055l733j1709L417R972n371j0357j1951j4134l506J8331
16851b0403J3688P861N866j4436J781N773L813N239l921j0051o42j970O408J3340
16837A2346Q18O735M58Q173l064L986j0154j2177k893M690j3395m783M282l32
16823e310j926p114N503J6958n660j6019j3501N994K839J313L851K21Q817Q282
16809D248k098n610o058l308n354q259J1254O673j6168K100J2939n317P184K403
$$ y = [4565, 2781, -9397, -6624, 3708, 21401, 13747, -11500, -19806, -11885, -357, 19337, 9250, -3455, -15666, -10293, -16460, -23750, -13290, -8589, -10141, 2652, 2914, 6789, 9236, 10775, 26501, 26332, 16786, 13773, 16443, -4268, -16575, -31073, -32187, -29734, -12963, -1217, -5112, -6896, -9051, -15027, -5417, 8638, 4905, -6804, -3387, 6585, 1214, -9143, -21094, -35228, -38734, -20403, -6715, 1146, 7012, -7424, -5643, 130, 3943, 9182, 5261, -4790, -5432, -7402, -994, 12346, 13164, 19899, 20357, 28530, 25466, 29452, 19298, 7121, 4228, 8918, -4477, -9260, -4978, -5310, -7236, -14350, -8847, 8111, 2451, -13568, -27069, -21075, -18236, -16923, -13072, -12851, -4034, 4248, 2150, -3460, -9518, -12826, -18180, -26439, -15185, -8512, -24680, -22580, -9641, -14958, -7774, -5371]
16795e371r242k772O279m168m912J5430J2643j2093j2223j8422M375R029R046
16782a2401j4796O203Q80l630m875j592K865J0472J3698j4485N612M797r40m740
16768a2932n062M885J3546J2935L038m721R18m078n230N311J0630J1173n689j3938
16754A0786n601o579R42J8258J7592M511M327n338j6962j075q658k1163O393J2515
16740I948k316Q714O375j2368j8605M857J820q192O106k946P645L438m416Q020
16726H080J8241j1398j3161n534K262n402j7425M247J5627P204L856o466j0289
16713a0158j9528j445J0689K0232J688j4113K002P773m632N159n07p605j249J2594
16699I00J3456o471l239j4619j6875n704m365K336Q667n595P829L486N034P399
$$ y = [-5371, -14613, -17385, -11106, -15274, -20186, -4756, 7887, -4206, -16429, -34851, -30476, -21447, -12401, -27197, -20994, -20114, -23744, -28619, -30211, -27346, -16874, -3176, -17661, -12049, -7252, -8192, -12932, -17994, -13109, 437, 13372, 16410, 11689, 12607, 8529, 3299, 8610, 19240, 30413, 24724, 10786, 5185, -1394, -452, 17806, 35398, 39909, 44236, 38898, 21936, 20861, 12203, -8960, -2567, 9948, 7632, 16346, 22721, 10353, -8252, -3395, -1575, -9767, -3661, -6607, 1038, 4476, 60, 8080, 26321, 14923, 1762, -3772, -1510, -6912, -24337, -20090, -4463, 2741, 6597, 131, -10158, -29686, -31131, -20442, -210, 1478, -12635, -10633, -2860, -7492, -2333, -2840, -10445, -11694, 900, 14356, 7885, 4646, -9973, -26848, -32552, -36917, -34581, -25914, -31509, -23680, -20194, -15160, -7761]
16685g761j1108j1084k493J0354J225k07R225j021K3467Q85j278R183n569j9889
16671f071j2215k782L531N415M058o044R956Q53P304q602k403J2862k604K966
16657F224M905k38L643r283p122j4899j152N771L394R349R257j4946j3355Q81
16643a7571N596R286L604L750n646M128K272n567N758L162L361N591j4019r136
16629e431M663J4576k919q60J096j0866n230N807o115r024p852l634J0652J7054
16615A917N793R886J865r689r012J0733Q182m832p443J252O834K844j4829r665
16601f164J7488O345m403r039o419K943N844j014J722l925r059J2236J4472m32
16587B0595j1791p140K432n479j2117o812O380P862Q029j519r285j802p035m794
$$ y = [-7761, -18869, -29953, -32446, -22092, -20867, -21074, -11849, -12870, 10597, 11482, 10204, 19387, 13818, -6071, -18286, -21068, -17537, -12122, -8064, -14108, -4152, -3299, 4005, -4597, -7000, 5862, 3258, 6224, 11129, 10891, 14534, 5251, -1871, -16770, -17922, -12151, -8757, 592, 9849, -5097, -18452, -17571, -11975, -2689, 915, 4665, -981, 3147, 5419, -148, 5610, 8772, 12133, 17724, 3705, -5431, -768, 13808, 10889, 10029, 11125, 259, -4971, 836, -5279, -14303, -22155, -25789, -15137, 1917, 7710, 17596, 19461, 9772, 760, 11493, 19675, 14843, 7400, 8652, 15486, 18330, 3501, -6164, 11324, 17669, 13266, 4227, -2192, 751, 6595, 5581, 7303, 3378, -5681, 6555, 21027, 20595, 8804, 1664, 4096, -1383, -13500, -20312, -13932, -6070, 1959, 440, -8845, -10647, -17682, -22476]
16573b2476P037J1466J0408J7575j220j7090r393j725J1474J3167m271q848j7907
16560a1803L601P857K381J2242L633l896q536q879k0118l427J094L879N977J3546
16546b449k407j5111O346N215R267R709j0039M96M509k096k09l531n834N137O465
16531E468J5228P247j9502p863j9079j4880M589N736J9654j610j1904m693Q741
16518a2868J1340K448q316o132O055l742j4552M705J6221M011k143j1297j5061
16505b9331Q359J4617L546O269J0426J645l101J021j3206j0431j2119l871J1279
16492a4897j1636L986J8421m114q487R188O237M653k766j814j700R146L637J813
16478A1667k416J279q67j820j6663p621M366K661J093O568l646O06Q594J487K37
$$ y = [-22476, -15439, -3973, 6435, 24010, 22790, 5700, -3693, -5418, 6056, 19223, 14952, 6104, -11803, -8202, -345, 2036, 14278, 17911, 14015, 5479, -3400, -23518, -26945, -25851, -21972, -15995, -2449, -4856, -19967, -13621, -8406, 861, 10570, 531, 1027, 5536, 3440, 3231, -300, -6134, -997, 5468, 20696, 27943, 8441, 578, -18501, -33381, -28792, -23056, -3402, -5012, -16916, -21609, -12868, -1528, 920, -7396, -13528, -7473, -11215, -25767, -21062, -4841, -830, -2973, -14270, -29331, -20972, -6355, -2809, 3460, 13886, 15531, 12430, 13451, 245, -10186, -22305, -26176, -14897, -26533, -22547, -4126, -8240, -16727, -7539, -1302, 3351, 585, -1229, -2929, 6217, 9854, 11667, 9251, 10530, 9663, 7843, -8820, -16441, -12075, -9414, -8321, -1753, -5399, -4793, 3801, 5288, 5525]
16463E525o060n439K150J7626m952j6065J41l481j1319o890J0926j27J7534J0322
16449I891J5011j685q435j0993j1097R139Q91K518k826L112M210K980k0930j934
16435a0148r79L709L707L965r748r093M198J4165Q997K890N952J49j3670j7180
16421a3086M276J0671J8484j2852k3624m831k338P764P356N922K415J257L065
16408D479k561O95p272J0715j289J621o29n679p300Q355j0595j0661l71n316Q550
16393a7258M833j211K36N224O674M75J6697J2309J037n10q939k0211K377N97l586
16378a256j4470p804O067K1748m992n146L978q991j3762R203J793k081k201j362
16364a9276m076O37L247Q817P170P996O771n058M22l444r682j3909m124J0362
$$ y = [5525, -535, -5974, -3824, 13802, 8850, -7215, -7074, -10555, -21874, -28764, -17838, -17965, -431, 9891, 24902, 23217, 14782, 3789, -7308, 1831, 2722, 5240, 2414, 5526, 9736, 12716, -8214, -10148, -11127, -7418, -3711, 254, -9494, -18587, -14389, -224, 8773, 11663, 17615, 17764, 4094, -13086, -8810, 1861, 20345, 7493, -16131, -20962, -23300, -15536, -8180, -2258, 157, 1414, 4479, 1918, 2613, -4659, 6056, 4767, 6388, 5759, 80, -7220, 1135, -9460, -20121, -20492, -25808, -17258, -12425, -13636, -13400, -8176, -1502, -1027, 15670, 27979, 29016, 28506, 19567, -644, 1733, 2330, -1256, -15726, -23530, -17463, 4285, -707, -5853, -1875, -10866, -24628, -15425, -13632, -15713, -17914, -19276, -23352, -22715, -19468, -10651, -3481, 4515, 11286, 6228, 6650, 3206, -6476, -20385, -24509, -14147]
16350a4147K3428N714r426Q882j5232j6126o30J1384J557J4526P350N526M189
16337B6995L500O128j0831r036m613l386r588j304o369J717q641M989m852k245
16323a7536J0838O928N036j268j287K202R452m995o63J815M526m983j0013j4836
16309a4784p960O092K861J2381r440k910k148M713J3111R74q249r703p205o697
16295b8964p806J1489J0777K693L424K207j1122p960J3257R645L689l589k594
16282d854j321M120R014K768r312Q411K364j2748j3216j0744j41q650J574J2961
16268a9774M953j41J2306k819L235m451J665O647O454q439J0306k85o538R260
16254A2379M186j0995k5343j4228P072K1132L112P827j6638j6910L224J3534J3487
$$ y = [-14147, 9281, 14995, 5569, 14451, -781, -16907, -17537, -6153, -4596, 9930, 17280, 22806, 26995, 30495, 36623, 25792, 16756, 12143, 8757, -831, -2135, -8504, -6787, -15428, -10439, -15291, -17536, -6698, 230, 5266, 3998, 2711, 4913, 14365, 9370, 8707, 10522, 15048, 10065, 52, -14784, -22744, -16652, -13791, -1410, -10850, -13760, -15908, -11195, 1916, 2890, -5359, -15062, -22267, -28964, -36770, -25281, -14504, -11811, -8387, -6180, -17302, -25262, -12005, -2360, 1329, -2260, -4854, -6175, -2055, 6959, 9727, 415, 8826, 11190, -1558, -14774, -25518, -25659, -34309, -32735, -19774, -14821, -14962, -2656, -5475, -2240, -6691, -5026, 1621, 8075, -364, 9942, 9657, 3119, 12379, 16565, 5570, -19773, -34001, -26929, -5797, -2685, 5142, -11496, -28406, -25182, -11648, 1839]
16241A839Q686q146q493q169J2932J5515k040j0984l544P289O216N206J2353N325
16227C3985r492r887j9936k975j242j539J0529R444k096n062j4493R15J4898K815
16213E864j6328r701r64p744J7144L322j558J6165N829j5609o386P012q928N234
16199f648k426J514m576l27Q581p41q727K065l121p671m189J5168K3725O30j238
16184A2019j4755p353K520K014j72n050k377o070N642J1241L59j763P634Q389
16170A2278j5179o675J3191r629j6613J1253j767Q278J4249J1368r591k0364r817
16157a9018K2425R06n2m346n057o27J3606P817Q9r557o569o77R770J634j9707
16142i363j128n198R391J7036M828m491q070o421K49Q650l937R417N163M087p665
$$ y = [1839, 10525, 2379, -6114, -14283, -1351, 14164, 12124, 1140, -2404, 4885, 11101, 16307, 28660, 33985, 24493, 14606, -5330, -8305, -9547, -11086, -557, 8887, 6791, 1729, -12764, -11849, 3049, 5864, -10464, -20165, -21129, -28873, -11729, -8407, -9965, 6200, 12029, -3580, -9966, -2954, -11882, -6648, -9074, -7560, -12136, -12463, -3882, -4623, -13350, -11285, -14406, -22077, -26266, -11098, 12627, 13257, 12019, -2736, -10089, -7569, -5555, -5727, -10777, -13154, -19224, -13582, -2341, -1982, -3745, 3889, 12278, -2901, -9576, 3615, -6014, -22627, -11374, -13141, -4863, 9386, 20754, 11163, -9201, -19018, 3407, 4313, 4261, -85, -5142, -5769, 7837, 15654, 15743, 6186, -383, -1060, 8710, 10344, -9363, -10491, -15689, -6298, 10738, 15566, 11075, 3005, -3416, -3167, 5483, 1546, 10963, 16126, 20213, 12548]
16127A2548p597j542L032l560J076r928j4653J6299P47n961J0388J547o403M687
16113F80J6879p324k858L493o602m364J5298J0849J091j314r331j0588p007L511
16099B413P021P878j3052p893Rm414K645L790j783N105q516l260r28j154q42L695
16083i286L562L235P625L732k384N925J6457p609j2155O995K784j941p248r973
16069b81q200m539M582J2577n738m874n880N303j145P488j961p994Q35j510J0671
16054f66J803n53J1005R582n921m958r588M683P687l365m806J66k488N326J0923
16039A8830k160j4831j5515R56L083L302q868q458J5194J8748j612l421n341M958
16025D865J0934l5l894j6685l979K33j3133J6337O429j0914K026o19l450J8464
$$ y = [12548, 4951, 3409, 6441, 2881, 3957, -5971, -20624, -4325, -3578, -9539, 849, 2396, -4007, 680, 17559, 10235, 7377, 10870, 4268, -96, 15202, 26051, 27142, 25828, 16497, 5909, -1098, 2413, 9434, 17312, 4260, -3633, -3624, -8038, -5393, -1603, -3386, 1719, -6797, -10057, -10985, -12139, -12981, -9286, -5724, -2489, 5136, 8868, 6484, 12409, 28866, 21257, 9102, 16097, 18881, 16940, 9692, -281, -8481, -13020, -8438, 4139, -1599, -6473, -12353, -7050, -8195, -707, -2668, -10662, -9827, -11337, -666, 1137, 584, 11589, 21171, 15250, 10292, 704, 5387, 13074, 9709, 4903, 5069, 2581, 7907, 18830, 16670, 1839, -13676, -12720, -9637, -6335, -15203, -23661, -8467, 10281, 8669, 5248, -93, 4865, 15799, 15764, 11870, -4815, -8794, -8561, -21694, -5357, 1072, -9842, -7816, -8435, -11885, 6579]
16011F579O543j2376o071q8N834j784j058q095o538r447P956N552o555R773J7302
15996G527O157j0201j4291l763L213O743J3511J6670K377l962j6856p994L412
15983B543J238k141O611K040r894q548m043l373l38O92J603o605N39Q994R843
15968h39j2810o937L758J2817N194l169m479j153J0439M316q328k335M940O857
15954H271l106n455J524J016r261Q875K992o381N095N333j2809K164M002P873
15940A0133J445M169k660n706J0055O39M675m922j0689k99j989N539r26J2397
15926B1861mj1078J4381O855l444j1409p567M091M464M323q484o597J979o761
15912B610o080k827J6269L682j1907n598l385n538j435M734N012M658K185j4078
$$ y = [6579, 13122, 746, -5325, -5413, 421, -1363, -2421, -10516, -17054, -26501, -18545, -12993, -19548, -9775, 7527, 13684, 3483, -10808, -14571, -11358, -4615, 8896, 25566, 27943, 23981, 7125, -869, 2543, 3781, 1640, 8251, 10291, 397, -8151, -12194, -15567, -15905, -15213, -13610, -20215, -19676, -10682, -839, -13649, -20586, -16828, -4011, 1183, -1986, -6465, -7618, 2821, 7137, -1191, -3526, 1414, 8271, 5165, -290, 1234, 2250, -7011, 1864, 4856, -1525, 3570, 8903, -3906, -1742, 2260, 10133, 11578, 15747, 13087, 7381, 17436, 18075, 22750, 17828, 7139, 6840, 4851, 10390, 9464, 21861, 21857, 10779, 25160, 32015, 28571, 17162, 9595, 13686, 18150, 22473, 13989, 7392, 9371, 2610, -3470, -6297, 9972, 13654, 1747, -3851, -7236, -12774, -14209, -9475, -4463, 195, 2380, -11698]
15898a1698j4528J784n714N583J0640J1294l555P765O809l804j6310M294R839
15885B399J4747K946j3483J302p435j2354Q044o690o209K851R30J1126O179O533
15871A0886l954M089J2591r852j8047k053n375J428L859K430Q07n427m92J3437
15857D327k25n747L657O216k965r037j1711q469O234K709k253L951M010K372P675
15842G44k486o075p280j2426J7521J0732R027j772N915j5705j4238J3270J5253
15829A2480p200j0859R968R474R98j9790o273j974J1218l288M38M462J6653k867
15815A3440j7444r725N079K2822J0596q750n598N7m840P932N036j1164o981j043
15801e83Q993k982j1941o352J919o73j407j325J1584M808r472j992O103j18J162
$$ y = [-11698, -26226, -24442, -30156, -24573, -13933, -2639, -6194, 1571, 8380, 4576, -11734, -7440, 2399, 17146, 20092, 6609, 7911, 476, -11878, -3834, -10524, -16733, -13882, -12952, -1826, 4353, 10886, 6932, 11021, 23612, 13760, -4287, -6340, -11715, -10287, -6428, -3998, -3191, -8618, -9110, 4327, 4102, -1645, 2012, 8228, 5263, -3774, -15485, -23954, -17720, -15011, -17264, -13313, -9303, -6931, 744, -1742, -7817, -15097, -27523, -10002, 730, 9757, 7985, 13900, -1805, -16043, -2773, 12480, 5280, -5579, 4389, 13863, 14861, -4929, -11202, -13176, -1958, -5246, -4808, -346, 16307, 13440, -4004, -13729, -8650, 14172, 24768, 16018, 10420, 10477, 5637, 13569, 18605, 7441, 460, -583, 8410, 5428, -6513, -12865, -10946, -11619, -13026, -14351, -2767, 2041, -7431, -9423, -3320, -3438, -2276]
15786b276n026n621N015l486N00K364j314L780M750J151j310M98m248J0101R531
15771A4409o674k8006j5868K122l88P073O384J1362N953j610N88J0902Q938J319
15757A6504J217j5554j7203M710J3965m345m599L016j505K707K32j8017M976J4790
15743H94Q568O609J2787j6870k4678L323J985j5408m638J2089J819J506l369m900
15729b0283J38J8805J0626m538j1704J532L190J4575J0419J2241j6136j3250p958
15716b343k401J511J6057n28l192L592j726J121J5525j1292k1183o982J4438J745
15702D342j1418N766K659l642m250J0345N777L826P874n436j8003j1844M742Q243
15688a019L580j97Q709K210q732j3808j3467M547q87O892N418q20j5072J3934
$$ y = [-2276, -7302, -12923, -7908, -11394, -10894, -8530, -9844, -6064, -1314, -163, -1473, -975, -5223, 4878, 14409, 7735, -20271, -36139, -34017, -34405, -27332, -20948, -9586, -3633, -5243, -4655, 6247, 15185, 16504, 17721, 2167, -15036, -10326, 3639, -706, -5305, -2289, -3794, -1087, -855, -18872, -13896, 894, 9462, 16071, 28858, 11988, -12690, -9367, -7382, -22790, -27428, -15339, -13520, -12014, -15383, -20283, -20145, -1340, 9286, 4748, -6956, -5424, -2234, 12341, 22760, 35001, 18865, 5615, -2343, -4744, -3233, 12824, 12296, 9104, 12696, 10970, 12091, 27616, 16324, -4859, -11841, 2597, 4342, -7076, -1310, 1349, -2293, -6543, 3802, 9579, 13405, 21279, 15843, -2160, -14004, -9262, -1019, 2561, 2364, 11073, 13283, 4551, -9257, -22724, -18177, -19064, -12172, -6754, -7574, -22646, -8712]
15674h712L286r533O361R810n672j1097r273L990J0249k381J5023J7769r20j4399
15660D501j1062k41O948J5828k939j615q913k1252O72J1816P610Q436l136j4460
15646g807k0744j3188K794Q513J9794J2806o316r431q493L444K3297Q753j7103
15633c681j650n267j2514k73K1424k336j067J0388P145j860K080R213K629j4215
15619A0016k3232J2201L724j1981L09k0756r954L836K42k388R872P383J4995M510
15605a223j3189n411J0646J8052M969K951j0052p63R738P927L210r895n909j600
15591I451J1699m652j0171j3765j3904p960J1235M959J0918m122o560L25j182
15578a3729K032K18Q324P722J0901p646p786M399J0825R868P298k988j6134o19
$$ y = [-8712, -5426, -14959, -8598, 1212, -4460, -15557, -24830, -20840, -10591, -12972, 2051, 19820, 18900, 4501, -6561, -6802, 146, 15974, 13035, 11420, 2507, -18745, -18073, -6257, 1353, 9789, 6653, -7807, -28551, -41739, -38945, -30432, -10638, 2168, -4148, -13579, -22072, -18628, 4669, 13422, -3681, -5331, -10598, -23112, -23385, -1961, -4297, -5364, 5024, 12169, 10309, 12389, 21602, 24231, 10016, -13216, -1015, 2709, -9272, -8963, -29719, -39673, -35837, -35595, -37983, -28111, -20728, -5733, -1223, -14412, -19823, -9177, 8875, 13844, 16795, 6743, 5980, 15718, 23645, 26855, 16960, 11051, 9451, 21150, 16498, 6327, -7438, -21342, -29302, -18067, -13108, -2190, -6312, -12872, -12547, -13729, -11697, -11479, -3155, 4567, 15468, 7822, 36, 4435, 15260, 25128, 32426, 29438, 13304, 12685]
15564A2685l767p398l527m11j1211L973R122k671m269j3585j5510Q663J5073M150
15550h683K004J48M345O268M705P181K600J2474o083j1860k1742j1877J0034P287
15536c199j534j05P531o716r3Q768o585j1032o984K974K933j1350J4894J718L338
15521e442J2182N622p701p777p13L825q316j956M556N104J6648L459M42j0911
15507I022k45N981K915j3814m685K061K653J8713k408j1136N255p183l465K961
15493F625j558K974K186k237m022l358n874J7105O138l587j5214r948P480Q976
15479E686k160Q248j0675j9204J2127J077J1293J0640k295Q85m422m107o827Q442
15465H708J4161p859p613m297J060n495j2936J7690j899j1788j4168J0262J0797
$$ y = [12685, 8918, 1520, -2007, -2418, -13629, -9656, -534, -3205, -7474, -21059, -36569, -27906, -12833, -8683, -6679, -6531, -2186, 4082, 8787, 15968, 18568, 31042, 24959, 13099, -8643, -20520, -10486, -3199, -4733, -4838, 2693, -4023, -4116, 4652, -1933, -12965, -19949, -16975, -14042, -25392, -10498, -8780, -5442, 6740, 12362, 4661, -3116, -3829, -4, -8320, -10276, -5720, -616, 16032, 19491, 19933, 9022, 8777, 14758, 17673, 3859, -826, 1235, 3888, 22601, 20193, 9057, 14312, 7129, 3664, 6625, 5067, 8041, 10227, 7990, 3968, 610, -5264, 11841, 17979, 14392, -822, -10770, -3290, 5686, 3526, 11774, 1099, -18105, -5978, -4901, 6392, 17032, 14737, 15622, 11200, 7093, 266, 8708, 22869, 15010, 7397, 3100, 4160, -1335, -14271, 3419, 1520, -10268, -24436, -14174, -3377]
15452c377m638n290o457j147K657O397L895j216n410P445N531J943p741J620N222
15437e66m794q869o45J0182Q11M937m977n840Q40M72Q376p104J648j1322j0630
15422b7481l06J2730Q290n331j3435J6K878p469l621K477M03P037k433J2950Q30
15407a2465j2585m076J1738K2528M432O081p461L351j347j1134j7398l309J2943
15394h702R284O21Q702R123j4753r141k440P656J2621r521j4077k882R914j337
15380d932N446Q292L259L458J0805N048j2498r347o720R322O138p684j530m827
15366D230j4318O60K44m75K795L893J2075J3540j5453j2466L614J7308J5527j9050
15352A2124j1527j9534J0078Q470j6100l061J2008M900R489o461l167p6n852M274
$$ y = [-3377, -8015, -13305, -19762, -20909, -18252, -11855, -7960, -9176, -14586, -7141, -1610, 333, -7408, -5788, -566, -5360, -14229, -14874, -4692, -3881, 1056, -3921, -9761, -8921, -8449, -73, -7177, -5529, -16851, -27481, -27787, -15057, -6767, -12098, -25533, -25517, -22639, -30108, -33729, -31252, -30849, -23812, -26245, -13295, -12465, -25050, -29126, -17388, 5140, 9572, 15653, 8192, 11543, 10196, -938, -18336, -21645, -8702, 582, 1203, 9905, 19028, 4275, -4866, -7306, 350, 12971, 3450, -10627, -13509, -3595, -4932, 514, 8806, 12065, 15523, 26328, 31376, 18878, 9531, 2811, 12133, 18271, 10587, 9057, 4230, -10088, -9428, -9184, -9659, -6864, -2971, 9104, 22644, 7191, -5275, -1661, 15647, 31174, 12124, 597, -18937, -8859, -389, -16489, -19550, -7542, -2642, 6847, 386, -2781, -2857, -8709, -4435]
15338d435J4654o44o346o261j619k227l253L207J5324J0701N484n43j0897m616
15324H529N63k81K993P745Q061p732k312o338L529m605j2164n008j6480j412Q134
15309a6778N563O760p219l533J4754j484m661K773l299N918j689q61J021R934
15295G199M847q581l856k164l286m575r474j420M141P613N592j0813P387K1353
15281A3963j3592k4166M42J5159K4086K131j0216k0525q016M562J7988k39q752
15268g175J3813P693M131j912n643j4590j1467J1187L030j616K835J5168q840
15255F614o539j5068J2601J9298o271Q864r522k1290q186j2805r714J5354P474
15242a9190P760m296R43J8008R371k902j1389N38M87j585J3811N78j7503n024
$$ y = [-4435, 10219, 9575, 3229, -3032, -4651, -6878, -10131, -6924, 8400, 19101, 24585, 24042, 13145, 8529, 9092, 8811, 11804, 19549, 27610, 19878, 17566, 11228, 14757, 10152, -2012, -7020, -23500, -24912, -16778, -11215, -4455, -11674, -15207, -453, -1937, -6598, -3825, -7124, -1206, -2895, -3756, -2735, 7199, 12046, 3465, -391, -2555, -5841, -10416, -19890, -21310, -17169, -9556, -3964, -14777, -7390, 13963, 371, -23795, -23353, -8194, 15892, 18023, 7807, -12718, -20734, -16172, 1816, 1577, -7175, 6638, 14331, 18462, 16550, 10907, -3683, -15150, -3963, -933, -2549, 286, 15454, 6614, 75, -14993, -2392, 16906, 10635, 19499, 9977, -11313, -19499, -32304, -42018, -26664, -19190, -11430, -15726, -14783, 3225, 12596, 9694, -1695, -1157, -670, -2255, 11556, 12134, -5369, -10393]
15228a0393P890P837j1639q363J1627N932M534J1746k19j8980o067M223O085n79
15214C634l027r076o851J3768J1624L42k228o30J012L0k095M650K16k2673j3908
15199b5212O939K002j931J9525L296J4839J1237M26j4509j0578j217r543r519
15186a4245j8431P676J8134l145n136K383K0818M087q561o433p094j1600R399
15173a2148O177o004k965J0845J141q261q949J444M259J3229N148o475j1357m802
15159a8718k835j958K0017L428N439M989n62r262j1148j9926j1068J6216J4638
15146a0750j2185o730k46N670J2403K0362P317o701p070M079j0501K762P676J204
15132G290J0920o809j2536K69L38p998p531m689Q185J4179O461L03N34q500j4676
$$ y = [-10393, -2503, 5334, -6305, -14668, -3041, 2891, 7425, 19171, 18952, -28, -6095, -1872, 4213, 3634, 607, -8469, -15320, -1552, 10072, 10414, 8186, 7556, 8568, 8598, 6503, 11153, 11369, -11304, -25212, -18273, -16271, -18202, 1323, 4619, 19458, 30695, 31121, 16612, 6034, 4817, -4726, -14245, -32676, -25000, -6866, -10011, -15147, -12764, 8054, 12141, 3580, -2853, -9947, -21547, -12148, -5971, -11975, -14940, -4095, -2954, -11215, -20164, -18720, -14461, -1232, 3916, -2559, -13916, -18718, -21553, -23511, -3494, -66, 5373, 10362, 9800, 538, -10610, -30536, -41604, -25388, -10750, -22935, -29665, -29911, -24241, -11838, 8524, 15841, 9140, 2070, 6149, -4352, -1590, 6086, 7290, 18210, 11401, -1135, -866, -528, -8526, -16057, -20746, -12561, 1618, 8079, 8382, 8916, 416, -14260]
15117a4260k6917J3262K6429Q773O90m905J960J2695O751j9252r659q546P889
15104e090j0089o989J8898J3020P114k2164j0199J9303O634j1245M257J0803j1060
15091C193j8411O832K798L355P675q691q680j418M087J1810J5393K437l995k3
15077A6362o081q294p792J804P335j902l022l789R8R560J0170p440j5462Q537
15063H4L426j3435p423l796J181J4241K780O85J706j7475P52J3063M263p802L391
15048d359j891P159J1690r680q58l795m90L802L59J096j2348k407P573n275K735
15033f689q201k571j045M192M112j720j0644R712M399N640l986l14P61J194J796
15018c364K529j056j585p024q624L507k737Q971J3231j4776j5656M816J1733l886
$$ y = [-14260, -41177, -27915, -1486, 7287, 7977, 3072, 5032, 17727, 24478, 5226, -4433, -12979, -5090, -15179, -22168, -3270, 9750, 16864, -5300, -15499, 3804, 10438, -807, 3450, 14253, 3193, -15218, -8386, -5588, -2233, 5442, -3249, -11929, -13347, -9260, 2550, 17943, 20380, 16385, 16362, 10281, 1987, -5805, -4001, 3334, 1432, -1590, -5379, -5281, 4279, 14449, 7009, -8453, 84, 3510, -9925, -17348, -21144, -19963, -5722, -2942, -2257, -551, -18026, -17274, -4211, 52, -7750, -4359, -6250, 909, 12599, 2919, 2061, -1734, -2224, 1578, 1937, 3033, -9315, -11722, -4149, -9424, -6689, -14890, -17461, -18506, -14314, -10202, -11922, -22566, -12854, -8455, -2815, -6801, -7115, -6354, -5160, -3364, -835, -1891, -3476, -10500, -19124, -15617, -18354, -9383, 3848, -10928, -26584, -21768, -10035, -13921]
15004a3921L717J488m165P9J3101O079j1664k333J0593M335p416q183k471M12
14990a0349O641L301j3403r253J6342J5754n531k176j0258j6774P64R903N990
14977i049O957N836L896m205j884j236O257o40M362K035Q097j4069j5832J16O304
14962c055o895Q784N524m749j519L026L744Q652K691p690J302m82r086n408q294
14947a3455q973n472O882K2869Q336k764o061j5936r569K045l053J3643P418q147
14933a2237L091J0540J1659J6387M149j1976r830j3123p653o872J8795R042o759
14920E213q412J0582J5404o881j4367k8509M98K2515Q948j238j104J420O637M365
14906A5071M780j9153k1710J386J8964J3183j67j526P638k2929l846N223J2413
$$ y = [-13921, -10204, -8716, -12881, -12802, 299, 6378, -5286, -7619, 2974, 7309, -107, -8290, -10761, -10349, -3708, -407, -13810, -23063, -6721, 9033, 3502, 1326, -8932, -25706, -24942, -15039, -9049, -2092, 3744, 7640, 3435, 1551, 315, 6572, 5932, 10294, 12329, 20426, 6357, -9475, -9359, -3055, -9950, -1166, 4358, -391, -1910, 1116, 4860, 13512, 16203, 8513, 9815, 9333, 247, -5161, -13455, -22428, -27900, -21018, 1851, 10187, 7423, 1362, -14574, -24143, -22098, -25151, -11508, -4090, -12237, -9146, 1394, 13053, 29440, 33589, 21613, 11783, -1340, -8993, -15865, 2930, 11972, 5213, -3199, 7383, 22787, 15906, 1539, -26970, -26472, -3957, 4991, 3753, 2649, 4069, 10706, 15071, 19851, 698, -21012, -19626, -662, 12521, 12354, 10828, 18466, -4463, -8309, -3086, 9327]
14893I327J6108p625j4532j5958o866M789M605o091j213J180J3339m553q941J1993
14879d438J2256K251m305K542j0714k827n738j7031j96J0910O501J6839J2976
14866A9026k017j0079o590j1161j5828r975R63J3588O031K33k139J0453j52P71
14852f876O417n974O744k017J2012J5318p122j0369m585Q355n468o441O885K284
14838I163j8695r980Q721Q876L726P079R355R251R321m420j4996j5547O523K0365
14824B8742L89m242k238n535m093Q187j4083j7116r359R336Q949J734j3181J463
14810a1047O491Q815j0144K093K84j912J279J179K950L056l766k023L04n10L879
14795I28J0250k940J557O745j0336j0911J1335L109j1036j648P547J670J2162
$$ y = [9327, 25435, 17810, 3278, -12680, -19546, -14757, -10152, -16243, -17456, -16276, -2937, -7490, -16431, -4438, 7818, 10069, 5764, 8306, -2408, -5235, -10973, -28004, -28200, -17290, -10789, 6050, 19026, 17009, 6930, 340, -10821, -26649, -36624, -35661, -22073, -16042, -15809, -17948, -7495, -7647, -6876, -459, -6433, 311, -1706, 10306, 25624, 18502, 8133, 3548, 11903, 6435, -6, 6879, 9163, -9532, -19512, -10791, -1915, 1811, 8890, 18245, 27496, 36817, 32397, 17401, 1854, 8377, 28742, 29131, 24889, 22651, 17116, 13023, 21210, 7127, -9989, -19348, -10012, -1063, 671, -12510, -11047, -4556, 4259, -5885, -3792, -3508, -5420, -4141, -2962, -12, 3044, -722, -2745, -2441, -2951, 928, 11178, 8238, 9795, 16540, 6204, -4707, 6628, 9737, -1299, -2947, 4600, 6270, 18432]
14782A8432n600M43p834k1659j0682L203k984J3537K6972J0603p101j0626J2222
14769A8926O341j0278L536l913p957J0890o293j0350J0746J116j7296o830N334
14756f028o422J894K32P973J9448L116j2120j1623R7J0752n784j0956j1845p202
14742b8468K0385L245p670q50J4701J117J302M00J078j805m101j5948l889O103
14728a4400M805Q158k210j831j1943k0005O787J7820J4101R724Q947M770l965
14715B0758l812J0631N567j6712r957k236J5828J0855p166q241j469j1076m586
14702a616M558L96R21J566N319N164l429M273n689j3219p014p859Q883J6040J09
14687H403r69J5583N590j3111l419N689j1050l752R558M619o678L557N171R496
$$ y = [18432, 12832, 13275, 5441, -16218, -26900, -23697, -26681, -13144, 13828, 24431, 17330, 6704, 18926, 25267, 14989, 18525, 14612, 6655, 17545, 11252, 902, 11648, 12764, -4532, -11362, -6028, -12450, -10556, -10324, -2351, 17097, 20213, 8093, -3530, -3433, 7319, 1535, -9421, -21266, -28468, -8083, -4838, -12508, -13358, 1343, 2460, 3762, 4162, 5240, 3435, -666, -16614, -20503, -14400, -9595, -1437, -3647, -5478, -17421, -37426, -30639, -12819, 1282, 11006, 19953, 24723, 20758, 16946, 27577, 33144, 16432, 6475, 4239, 20067, 30922, 23756, 15515, 14046, 2970, -1616, 2942, 3338, 4259, 5825, 11144, 16308, 12879, 17152, 11463, -1756, -8770, -16629, -7746, 8294, 8403, 7434, 23017, 28607, 15496, 12077, 17766, 6716, 2964, 12522, 17141, 10463, 14020, 19191, 28687]
14673B8687N98j3964q258K115J1403r498o821J326j895N142l81Q628l188j1559
14659B335L420m654J208m145Q138k092q57P388j706n383j1057j8852l116N082
14645b4291J0146L171J0840Q342l012q537m388J074L998P805P431m737Q676K9
14631A6547n888m239l082p699k003l628n326p478J1478K0161R731J599j3488l284
14617C401k919O838L882r000k391l937N551J4658Q64K720m887j7037L725J2128
14603A3596j6813k043Q534R845l167R208K081r678j4088Q498j008j860P677o779
14589D003j3339N837K916m878L117K722P92J4297m435N179Q463p5j7198j5293
14575g892M453N793j543P341N300n175r346k238J5752q09o535q79R312o950p646
$$ y = [28687, 29285, 15321, 7063, 9178, 20581, 11083, 4262, 5588, 3693, 8835, 8454, 17082, 13894, 2335, 5755, 1101, 2309, -1836, 6302, 4210, 3353, 10741, 9035, 3652, -7405, -26257, -29373, -24291, -14145, -10974, -134, 8208, 5196, -3341, -7729, -6655, -2657, 5148, 12579, 7842, 16518, 16547, 10659, 6420, 3338, -4361, -6364, -9992, -15318, -22796, -11318, 8843, 18574, 20173, 6685, 3401, 482, 7320, 11202, 2202, -189, -4126, 1425, 16083, 16947, 19667, 14780, -2257, 1468, 13596, -3217, -5260, 3274, 13119, 9952, 19160, 21241, 11563, -2525, 5973, 4965, 3105, 10782, 4003, -9336, -3499, -583, -5461, -2344, 378, 1170, 15467, 11032, 16211, 24674, 24599, 7401, -7892, -3439, 2354, 811, 8152, 13452, 8277, -1069, -3307, 12445, 11636, 5101, 4222, 13534, 6584, -1062]
14560a062L485q72j359j4963J425o64J3205O353j8400J073J2630r157M884O488
14546C066J342M569R931m880r328m98M526Q313j9966p396J5104k768J593L878
14532G486k599o542j7935L813J3389M914k657K212l211k185l441P373K413j442
14518A588k145o918o607J5174J5490P938r481l037L683P413j0223n619j0044k117
14504d905L616o371m898M701J1145K127N6K548J1468p313j3228J1386Q447M342
14490B3121o72m576j2181q879O75P810J1534P943j0317r299J10K800L728P125
14476A8922J453j1625l097J923l768P912J9320r342j8580m808K458K792R452j4289
14462a277j1980L462R702J999m903n893J684n531m121p160Q490J4707K3102m594
$$ y = [-1062, 2423, 1551, 192, -14771, -13346, -14010, -805, 5548, -12852, -11779, 851, -8306, -3422, 3066, 4408, 8977, 18908, 14028, 4700, 4202, 8728, 17041, -2925, -10321, 4783, 2015, 3608, 7486, 4887, -1655, -19590, -15777, -2388, 2526, -131, 2081, -1130, -3315, -6756, 617, 3030, 1588, -557, -7475, -14082, 1092, 16582, 24520, 15039, 12002, 15685, 23098, 12875, 7256, -2788, -4905, -1289, -7660, -12558, -7857, 3288, 5415, 5471, 8019, 19487, 12174, -1054, 10332, 18779, 23121, 22449, 17873, 5692, -3187, -2512, 5298, 16832, 24775, 14458, 5159, 5269, 8069, 11797, 18922, 20375, 8750, 5653, 7576, 3808, 11720, 31040, 21698, 3118, -1690, 768, 3560, 13012, -1277, -13257, -9795, -93, 1906, -2997, -8890, -7206, -12737, -16858, -24018, -15528, -821, 22281, 17687]
14448A7687j8725k3622k622L720J954J0888o84P033J5327K466m395O613P956q773
14434A4823p432j8435p701J1017K0241Q654n485K261J979P13j0705p663N771P960
14420A5998K632m093l090m953j4157j2329L628J3196j637m426K156J0212O107
14407I244k460P635r898j1158K753M921J9423m691l641R879Q93o933N580K026
14393B3573r775j7661l173N088L121K966J9262q812j2300o666k622J1867N702
14380A0570q343O219j819l213p545m254m174P353L091q17l253J8760L475j6395
14366c45j2406N15Q082q09J2540m581r747P717M880n932j691l313J1643L214K036
14351A1803o12L04K292p81O655L228Q40j1718p557q68j606M029O201L905P694
$$ y = [17687, -1038, -24660, -27282, -23562, -21608, -10720, -11404, -4371, 10956, 13422, 9027, 15640, 23596, 14823, 7391, -11044, -18745, -7728, 12513, 21167, 15682, 17943, 19922, 20635, 9930, 2267, 8038, 15998, 18630, 14537, 11447, 6494, -7663, -19992, -16364, -3168, -4805, -9231, -7075, 3137, 9244, 6784, 14419, 4521, -6637, -3884, 1037, 20460, 15769, 12128, 22007, 22900, 15967, 21547, 23573, 13798, -3863, -7036, -1948, 1173, 4139, 23401, 14589, 2289, -4377, -6999, 4868, 10570, 2227, 8446, 6627, 3414, -4131, -8385, -12559, -5206, -2115, -2932, -6185, 12575, 16050, -345, -12751, -12236, -4154, -4963, 7577, 2996, -6751, 966, 5846, -86, -1777, -5090, 6553, 9767, 11803, 11191, 11495, 13787, 13006, 19661, 22889, 23729, 12011, 4454, 3586, 1980, 6009, 12210, 16115, 23809]
14336B3809l508j17n778j0029o866N080K650J929n916N045j785j5808Q19j929
14322a2404J5981R962k478j6182m036M019R903k10j484q740K1121J2281r026j0164
14308H543N582k0311m578j457k129L842k558L134p496N696J0344J742k472R724
14294G606p02J1285J1457j2619m252L305j2514M573R516P09J430j1997K890M291
14280A4978J0416K452j942n290n693L496K751n469j290j1288n655M459n177k071
14266e323J1027k699K061k022j5597r573J7068J9350o963o447n832N46p796j0107
14252b2307O378P751L038j0183n45J4842N766r59N267J802j7166L786J128l917
14238e319L50J969o788M679O712J1578n970m062J2044M953j670j752j160j4969
$$ y = [23809, 20301, 20184, 14406, 4377, -2489, 2591, 5241, 7170, 1254, 6299, 4514, -11294, -10475, -12404, 3577, 13539, 11061, -5121, -9157, -5138, 4765, 4555, 3071, -5669, 15452, 27733, 18707, 8543, 14125, -6186, -10764, -12221, -14350, -10508, -13066, -9932, -17428, -11732, -1388, 354, -2118, 7606, 6904, 18189, 29646, 17027, 12775, 16080, 3566, 8139, 17655, 18364, 19794, 7797, 10687, 14978, 25394, 27846, 25904, 20614, 14921, 18417, 21168, 15699, 14409, 3121, -2534, 1925, -3252, -5323, 5704, 3005, 5066, 3044, -12553, -22126, -5058, 14292, 7329, 882, -4950, -4404, -12200, -22307, -15929, -8178, -5140, -15323, -15868, -1026, 4740, 3781, 9048, 10850, -6316, -2530, -1402, -5319, -4969, -3000, -9788, -5109, 1603, 13181, 7211, 3149, 15193, 20146, 18476, 16724, 15564, 595]
14224E95q291k197l26R828N560r69P797j5998j6546Q61J4379L246q338p931O827
14209a1503J319N434L324J773N808O268j711q092m269P769N61j6238l475r795
14195b2827J4910k463l133R885J2553j4828j0992R011M732L778n906L456K338
14182E14N5J1443K950j1031Q42o548K397j966P339O654M824p134j2138M505P284
14167I990j5062m22N719k018j757k78P877L746j591K316o275m875P351J709m896
14152A534N011K369J497q112j203P890P078r311q966q050J775J4654O451j857
14138A0760j888j682m464K736R010m229j3159j3954N378J4448N253P192J912n203
14124A2110n21j1519o075N401J2379O060m233j7188M050N102r766Q019K014r38
$$ y = [595, -7696, -9893, -10219, -391, 5169, 4200, 11997, -4001, -20547, -19686, -5307, -2061, -10399, -18330, -11503, -10184, -4750, -1426, 347, 6155, 12423, 10712, 2620, -1649, 6120, 6681, -9557, -13032, -22827, -7917, -10380, -13513, -3628, 8925, -5903, -16895, -7884, -3152, 626, -5280, -1824, 514, 569, 12012, 14962, 3931, 4773, -1775, 622, -1344, 5995, 12649, 17473, 10339, -1799, 2706, 9990, -5072, -5494, 225, -1793, -3550, -3828, 4049, 7795, 6204, 8520, 2245, -2630, 4721, 6430, 1534, 6545, 8914, 10411, 2299, 1096, 8986, 16064, 6753, -2213, -10263, -8488, 6166, 12617, 10760, 8872, 7190, 2726, 5462, 14472, 10243, -2916, -16870, -11492, 2956, 8209, 15401, 17313, 12110, 11589, 70, -6005, -604, 11775, 17835, 13602, -3586, 464, 5566, -4200, 3819, 5833, 4895]
14110D895J667l752j9006q358P687J2140J4679J27n595J515k138r259o575m597
14096a6570j1235J1685L950O932J198J132R214m407J0121L681L59o494k3829j924
14082a6187R092J927O652K012n291J2683M999q631r301N932o095m351j312J3431
14068E560J643L643J951o52j751r523q336J2452J699k3492p717l512J6371N770
14054e894O849O730m730N537k115j2214j0819N502o480O5j50m55l208n4J7178
14039d258N767P473J0610l081n180M607J506r119p035j910K165o444K551Q60p394
14024h882K010J6311L732j351J1063p084k0207j1635M701J1592N876Q451k883
14011A1694j1796m570o61j217K880J039L407l601K502l318J041J0139j4244j7419
$$ y = [4895, 6562, 2810, -16196, -24554, -16867, -4727, 9952, 10079, 4484, 5999, 3861, -5398, -11973, -16570, -27805, -16120, -12170, -5238, -4040, -2908, 6306, 1899, 12020, 15701, 16060, 9566, -14263, -16187, -7095, -5168, 1484, 3496, -1795, 10888, 15887, 7256, -2045, 3887, -2208, -6559, -7871, 5560, 7203, 10846, 12797, 12145, 10394, 871, -7465, 4987, 6686, -16806, -24523, -28035, -11664, -5894, 955, 7685, 2955, 8492, 6377, -5837, -16656, -11154, -17634, -17569, -17719, -18174, -21382, -21436, -4258, 1509, 8982, 19592, 16511, 11331, 15938, 17444, 8325, 1290, -620, 1545, -4899, -2348, -1488, -8882, -6872, 9439, 13171, 11820, 22883, 15799, -4408, -16043, -11342, 250, 6126, 14577, 11694, -102, -4672, -5333, -6550, -3670, -2631, 776, -2825, -323, -3641, -2600, 7539, -6705, -24124]
13997b4124j473K1939J6629j214J3290j0236l598N811p79n924q481P757j3195
13984c598J0082k574O743L286P56m895m644j5386j784n898J2575Q21k132J572
13970e076r5j360l119N671m17K113J4536L777O028L848n327j6857j7581m347P910
13955a0296K51n553j146n381K880P445J600R762M17r824l033M020p088p550J726
13940b1770R673J751N008J5245q690q462O727K31m025Q521J6850O762o620L281
13926B4482j19m813K235o695l534j5130p093L775N950l136J680o210J291M87m099
13911a0929K301P021R053R981k009m045j4531m123J3354q77r186J870l407N284
13897b43K612n868j6220O78P508J1581n127n608q45J1600J0680P455p61j4986
$$ y = [-24124, -25597, -3658, 12971, 11757, 25047, 14811, 11213, 17024, 16245, 10321, 1840, 9597, -3598, 6484, 3910, 10653, 13939, 14695, 9800, 5156, -10230, -12014, -17912, -5337, -4516, -6648, -5076, -5171, -6531, -9650, -3979, -4396, -2283, 12253, 16030, 22058, 25906, 20579, 3722, -13859, -18206, -10296, -10045, -15598, -16744, -22125, -19245, -11800, -10200, -438, -21, -9845, -12878, -8858, -15946, -23496, -21770, -12097, -10346, -5338, 9907, 1217, -7245, -518, -287, -4312, 4209, 21059, 27821, 21201, 24482, 24363, 19550, 21785, 15090, 11556, -3574, -10667, -6892, -942, -4078, -2398, -8608, -7317, -6830, -10929, -8628, -1607, 7446, 17427, 15418, 11373, -3158, -7281, 6073, 5196, -3990, -2120, -5527, -243, 2369, -3499, -19719, -19041, -11533, 48, -5079, -10687, -11532, 68, 10748, 18203, 17442, 2456]
13883B456L338P442l568n406n628l937j4158J0896K669J0710j1685j3891o527
13870b7289J3613N636q939Q102R901J6342R150p007N528j463j4383k2723m853
13857a8385q686M573J3286K294J4572L449P182j329k1729o323K650j156J3995
13844D393J6909p549l546O087N174Q466j735j1269j7649r861J387N860K307l373
13830d399p103O728p242O932J6828M95J1734K1857Q158O123k61p092j4095o969
13816C1694o668j932q950n573J3013J4708o311k4149j3044l513k600j3310j1505
13803c8140O806O632R951J4379M706m62l869J2103J5134l523j1176n402k864J346
13789E621L404l42P734P760K542L275j9532k9810J0670J6946r581l908O984n85
$$ y = [2456, 5794, 13236, 9668, 4262, -1366, -5303, -19461, -8565, -5896, 4814, -6871, -20762, -27289, -13676, -8040, -16979, -8877, 1024, 17366, 26516, 19509, 25037, 23574, 9191, -13532, -18385, -27071, -22498, -9212, -6918, 7654, 11103, 18285, 16956, -4773, -11096, -8446, -9602, 4393, 21302, 13753, 10207, 16294, 21468, 29934, 28199, 16930, -719, -10580, -9193, -3333, -1026, -4399, -11502, -4774, -12016, -5084, 11744, 12239, 23973, 45830, 53988, 60111, 59850, 52758, 38663, 31694, 25026, 23094, 14144, 8571, 21584, 36292, 29981, 5832, -7212, -10725, -13325, -26635, -38140, -31334, -24702, -14751, -372, 4334, 3872, 3, 12106, 27240, 23717, 12541, 7139, 4275, 5621, 9025, 8683, 16417, 24177, 26719, 29994, 10462, -19348, -8678, 8268, -1313, -5221, 1763, 1178]
13775A178p711Q24M499J5897P231j0234o913O159K962K836r984K964J0108n268
13761A4548j2910o108L612J4811l054J778J4708m046j2091j4687k673L191p90
13748c711q124O797N290N348j654K386M793l245n507m933q924J489K588J4412
13734G005J0008L118p797o214j8389n143J8751J3527Q065K556j0551k923K108
13721A4121p553j8057N610K4637k264l898O117l050q69J1776k0256p234J986l114
13707b048K02R048k1258j0980K689J4580Q725O685J986Q087J5353J0652j5149
13694B8572j4383N535p915r146r918O051l538m384J1575J2499n27k991p004j2397
13680g971l821k718p936M245M998P422J3907j0419m369r706R935r333k493J581
$$ y = [1178, -6533, -5709, -1210, 14687, 21918, 11684, 4771, 10930, 13892, 16728, 6744, 9708, 19816, 14548, 1638, -4470, -858, 13953, 10899, 12677, 27385, 23339, 11248, -3439, -6112, -2921, -3711, -11835, -5038, 252, 5600, 3946, 6332, 11125, 7880, 2373, -2560, -11484, -9995, -7407, 7005, 17013, 20131, 12334, 6120, -12269, -17412, 1339, 14866, 22931, 25487, 14936, 12013, 14121, 6568, -11489, -5879, 18758, 16494, 12596, 18713, 15663, 14794, 26570, 6314, -920, 1066, -2048, -1846, 7202, -14056, -25036, -22347, -7767, 958, 7643, 9629, 17716, 33069, 43721, 28572, 14189, 19724, 11809, 2663, -7255, -1204, -4742, -9126, 2449, 14948, 14421, 11430, 4426, -7971, -11792, -14510, -22446, -18201, -13203, -5781, 8126, -2293, -6662, -16368, -6433, -15766, -18259, -16678]
13666a6678j755L744P52j0220K810O757K825M15J3715j0345l873j0690n259J2570
13652a5232P921J0728j308O513R553q441L301o401P187N837m318o663j5130M424
13638b029L933o191m686M18J7903O850j5182n544J56K729O093l941k10Q098Q91
13623I288k3701j0184N025J0243J8962N205r608l633k070n678R12J4054M537J361
13609A4713j1949l814m494o298P6P908k58k570O304o944R349J2077r32j1055j307
13594H06l622j0579k684J698Q725J4923N059k685j0162J389k400J759O391Q893
13580A7511l098q848m740L098j1972j573K669J2153j277O535p597r733r302m775
13566b0949M699O126J447l309L90M962j5205j487R127l964m26N393M214M771J165
$$ y = [-16678, -18433, -14689, -13937, -24157, -21347, -14590, -11765, -11350, 2365, -7980, -11853, -22543, -27802, -15232, -7311, 3417, 2109, 8622, 18175, 9734, 13035, 6634, 13821, 19658, 15340, 8677, -6453, -2029, 1904, -4287, -8973, -8555, 9348, 16198, 1016, -4528, -4372, -1643, 4450, 509, 299, 8397, 9288, -14413, -24597, -19572, -9329, 9633, 14838, 5230, 1597, -473, -6151, -5239, 8815, 13352, 14713, 2764, -1050, -5544, -11842, -11766, -3858, -4116, -6686, -382, -7326, 2023, 14100, 13168, 2113, 806, -2816, -13395, -16079, -14381, -5656, 9267, 14326, 11641, 1479, 2868, 468, 2227, 8618, 17511, 14413, 5565, 825, 3923, -8049, -9622, -6953, 5200, 3923, 10458, 2861, -6872, -16174, -20949, -16250, -10124, -8677, -11986, -11596, -6634, -21839, -23326, -14199, -18163, -18589, -13196, -8982, -4211, -3046]
13551c046J1367J0857j1534q127j4969L157K0843P820J550j2642j130q340k01
13538d395p688J250M852k534J1339J6944N346K5947L6581O6905P8306N069o0989
13525A76933o7004m0156k8176j2048m511J537q854K006l554N260K271r183P31
13512A5252J0080O78o788q149m121m27k086q223j2869m343J288N956P227M480
13498b045m420R792J4528J898M843q856j3646L559J5204j0183k2198m441J210
13485a4755O771j2419q102K1124J2422n634Q482J2471P761j357M944L466R7n537
13471B9734j4817k3295N571O949j2919N893K471J096M406m596q540k82O050O596
13457D317r384J236P033j369j3411l043p600n940K3333L165O437r23Q069P960
$$ y = [-3046, 8321, 19178, 7644, -483, -15452, -12295, 8548, 16368, 17918, 5276, 4146, -4194, -4395, -12083, -10833, -5981, -8515, 2824, 19768, 25114, 51061, 87642, 154547, 232853, 237922, 176933, 109929, 69773, 41597, 29549, 25038, 26575, 17721, 19727, 16173, 21433, 23704, 14521, 15252, 25332, 26010, 19222, 11073, 6952, 6525, 4439, -3784, -16653, -20996, -19708, -13752, -6525, -2045, -6465, 3327, 17855, 19753, 24596, 15740, 2094, 5653, 20857, 10674, -11524, -15965, -14755, -7984, -20403, -28505, -7381, 5041, -593, 7889, 20360, 28121, 26764, 31708, 35174, 35271, 29734, 14917, -8378, -2807, 4142, -8777, -2884, -413, 683, 5089, 493, -8047, -8329, -2279, 4317, -5067, -3831, 3202, 1833, -11578, -14621, -22221, -28161, -4828, -1663, 4774, 3851, 11920, 19880]
13443A9880N541l090j6571M179J2251j2700J705O567p740j689n851m336J489N267
13429D902M715J2763O370j0043k6532k3521k75R28J8185K0372k198k7795K749
13416a9380O145K394J1409k333q493J0449Q031k837N934L127L40J2059p016j0375
13402I454P248n98j0745k2135q444J6256J5326M111J204j620q352m412J4259M16
13388A1968K780J14j4321j1407N588N486o283k735r576p184K37J0373R607K2450
13374A7097N630n006o754j3542q332J316J724N400j532l449K178J502l868Q520
13360H84Q446K575p34m892j508J534L629j258j5310j8156L578J6992K091L432
13346A303J2857L592o781j0937J4257K521O375r855j2268j2560n806J0757N221
$$ y = [19880, 25421, 22331, 5760, 9939, 22190, 9490, 11195, 17762, 10022, 8333, 2482, -1854, -365, 4902, 9617, 22380, 28750, 18707, -7825, -31346, -31621, -30693, -12508, 7864, 5666, -22129, -19380, -13235, -10841, 568, -1765, -10258, 191, 8222, 5385, 11319, 14446, 14786, 26845, 19829, 9454, 16702, 16104, 5359, -16776, -25220, -8964, 6362, 10473, 11677, 10057, 1705, -2707, 11552, 11968, 14748, 14862, 541, -10866, -5278, 208, -6075, -8810, -18386, -25570, -25333, -14960, -5353, 17097, 22727, 17721, 10967, -2575, -10907, -9591, -7867, -2467, -3999, -7448, -5270, -3768, -7636, 884, 9330, 11905, 11171, 6279, 4771, 6305, 9934, 8676, -6634, -24790, -21212, -4220, -2129, 1303, 14160, 17752, 10971, 34, 14291, 16812, 23187, 13332, 1064, -11496, -17302, -6545, -1324]
13333a324M693J1642M175p559n34J5780o839o276o833j6804l697J664k543J000
13319a3455J909O512J531J373j879K574k923n537J0928j092K507l005o606K85
13305f878j077j864l35j3635r490P518Q799J0746o299j4146L40O677J3246Q905
13291B507j601R424P696r815q007J0948l677j0995J6160k534P38L504k4739j7575
13277b7966L721J3119n245l535K372J7258R888l289J2712J0362p826r235N139
13264A7475j247j0391j515n461p511l307q899k079J7098K0777o795l470M469K918
13250A2062n746L079j6855P09N692Q921N834l935k955p044j3286p182O229K063
13236a2414J4807N803P25L33P992k898l64j2868q312o786Q572R599l410J571n93
$$ y = [-1324, 3369, 15011, 19186, 11627, 11093, 26873, 20034, 13758, 6925, -9879, -13576, -11912, -14455, -13455, -11546, -5034, -3503, -2130, -4009, -1435, -4358, -9895, 1033, -59, 2448, -557, -7163, -6878, -7955, -9819, -10154, -23789, -33279, -25761, -16962, -6216, -12515, -26661, -26321, -19644, -6398, 2507, 906, 10330, 18026, 8211, 204, 11152, 7475, -3520, 12640, 10106, 10844, 14348, -10391, -27966, -24245, -11126, -16371, -19906, -17534, -276, 9612, 6323, 19035, 29397, 21571, 12336, 17475, 16228, 5837, 4322, -1139, -8650, -11957, -20856, -22935, -5837, 14940, 8145, 4675, 9144, 12062, 6316, 9395, -7460, -6751, -1059, 7862, 13696, 9761, 6806, -238, -13524, -20706, -14477, -12414, 2393, 8196, 8921, 9254, 17246, 14348, 13984, 1116, -7196, -13982, -5410, 4189, 779, 2350, 1757]
13221A757p831J1388R806J89J511j4096r622K797R417j8653L125P743L073m880
13207d276J1190K92o088O849k651o294q309j0374K5949P985k0935j3553R986K722
13193g507n038l334j5995r763L506J16J1546J5967J5541j615K619n868n567n142
13179a0534M248K0497n861j5148O63J3120l419n438n847R02M260k923j706J6641
13165I455J0649p19K296K137o92o459p321n450p577p968J6707J3996l814Q140
13151B3380l608j6945j3042o359K778M739J2685N548L64O193p380o18j648J831
13137G918J0777M11k2898J821P619l650J0192O14L148K700j3657j2413l125q22
13123a1365L712O707m842q38M931p697k404J3542L211P690R244N000j2335j1860
$$ y = [1757, -6074, 5314, 15120, 15309, 16820, 2724, -6898, -4101, 5316, -13337, -10212, -2469, 604, -4276, 6914, 7206, 1118, 7967, 5316, -978, -9287, -19661, 6288, 14273, -6662, -20215, -10229, -7507, -12545, -15879, -31874, -41637, -38131, -38015, -26469, -10502, 5039, 3424, 6043, 175, -5392, -10534, -6286, 14211, 8350, -6798, -6135, 6985, 3566, -1872, -7719, -6817, -2557, -5480, -7186, 9455, 20104, 19385, 21681, 23818, 23126, 16667, 9346, 3896, -3681, -11649, 5058, 19054, 15240, 23380, 19772, 2827, -10215, -16574, -13796, -9057, 3628, 9176, 9540, 15733, 8353, 7735, 6087, 7918, 18695, 19106, -3792, -1971, 5648, 1998, 12190, 12804, 15952, 18652, 4995, -7418, -10543, -11365, -7653, -946, -5788, -6626, -1695, -9392, -11796, 1746, 4957, 12647, 21891, 26891, 14556, 2696]
13109B696J7769j5577k357J7335P75q547j4190M96L122L786j573K501J2126j0506
13095G856k910J9229N777m026j1151j2636m853J167j806K461p615j626K0147l217
13081F797k5039J3194J6283q378l884k546k884M454R505m286p637j0029m62K011
13067a2901j3334p746J9750J6333J2438j970N53p902n538o338J438R651n887n736
13053g189K431K257m080j2199j818L274P617J931R330j00R251P941N2r519m441
13038D738m073j223l691p89L389Q066o867l206r016l38K023p827J9768K98j4985
13023a3733J278j3916R512M739L128p661J4178J2301q006j3680o65M048q548K670
13009a4355L0264m354k2345K496L114j263O585J5498j236Q72j5459j5069Q463
$$ y = [2696, 20465, 4888, 2531, 19866, 20641, 12094, -2096, -1600, 1522, 5308, 3735, 6236, 18362, 7856, 4946, 24175, 29952, 25926, 14775, 2139, -2714, -1547, -3353, -892, -8507, -10133, 10014, 6797, -18242, -5048, 11235, 2857, -1027, -3573, -6457, -2003, 7502, 3216, -4421, -14450, -14912, -12901, -26235, -33981, -14231, 2102, 14540, 12570, 13123, 5221, -317, -6655, -5217, 4434, -1453, -7189, -4758, -2501, -6581, -18780, -20598, -17324, -9707, -7776, 1554, 1454, 10705, 18646, 18698, 9179, 4738, 665, -558, -4249, -5038, -1649, 6417, -450, -3656, -12672, -13010, -10987, -18814, 954, 1252, -13733, -12455, -26371, -16859, -12120, -8992, -16653, -2475, 9826, 1820, -11860, -12525, -8477, -17025, -14355, 15909, 11555, -10790, -8294, -5180, -6443, 142, 15640, 14404, 15276, -183, -15252, -6789]
12996f789J315O119J8301l50o093p351r628p286j991L067R989k842l139L490r254
12981a2442o755M747J6145j1104j746M435K4069J4635q361j0781K061o534K576
12968A0945l788k915n601J3448m130L26j4903r164Q046m377j1488J1286J1775
12955e40J0182R337R22Q59r87N401r488j1967j504K5233q630j1991L247J0030
12941B0104O328k2212j0999k706Q516n767Q312O626j220P125o805k3Q826r69L908
12926A9044r591j7775O002J0399n309K896n400j3369p522M892J0281o096r946
12913b1494O559L298J65L2L704o213q183O511K493M504R082J0055N950L966n4
12898B0375k0045j4921K436K0218P325n446q96j7296q169J3462J9362O460k007
$$ y = [-6789, -5474, 645, 18946, 18596, 12503, 5152, -4476, -11762, -13753, -10686, -697, -3539, -6678, -3188, -12442, -19197, -14450, 1695, -9409, -11155, -6720, 17349, 31984, 23623, 12842, 14903, 8369, 10945, 7157, 4242, -1359, 12089, 7959, 8285, -6618, -15782, -7736, -12113, -23601, -12315, -540, 9642, 18979, 19901, 20760, 19773, 25174, 15686, 3719, 2215, 27448, 18818, 6827, 10074, 20104, 26432, 4220, -6779, -9485, -969, -6736, 1576, 8202, 6982, 14107, 7302, 7279, 16105, 15136, 19044, 9453, -8322, -2320, 8079, 2770, 5666, 266, -13103, -20625, -15733, -5452, -11548, -21494, -14935, -11637, -11472, -11440, -7736, -13949, -22132, -15621, -13128, -8624, 458, 10513, 16463, 20429, 20375, 330, -14591, -12155, 8063, 15388, 9942, 9046, -8250, -16419, -2957, 16405, 22865, 20858]
12885B0858p613r508L982L014j3006P181j6442k7J5910P94j711J1792r74K469
12871A6719O316r764j6210R01M650J616p139q839J994o155j5884J843P45o594
12857c5801K078J5273J0685O38N207o052o190M734J2054L149j237q646m989n317
12843a4414j439n544P031J8511O240M49j0575m959Q27j5786j0895l612K1884P408
12829d874j2163R37R193J0420j857p135l010k405J6053K793r891L224N173k2127
12815a5669J522N156J328J4599L736Q095J3319K7461L9063L5770J8511l4451m3014
12802G5426j3342K07M197o722j6552k3957j1920l588R462j7645j334O853j0714
12789i629j9687J8476K1440K92n194j1381O734M693L010q44K117j006L665K376
$$ y = [20858, 13245, 3737, 7719, 10733, -2273, 4908, -11534, -11561, 4349, 5143, 3432, 15224, 14250, 16719, 23035, 13271, -2939, -2038, 2612, 4228, -2911, -11750, -9756, -15911, -31795, -29952, -29207, -35801, -33723, -18450, -7765, -7127, -1920, -7972, -14162, -9428, 2626, 5775, 4538, -4108, -9097, -14414, -15853, -21397, -14366, 4145, 10385, 10834, 259, -4700, -3873, -19659, -30554, -34166, -12282, -4874, -17037, -16100, -6907, 3513, 1656, -5479, -8489, -10894, 5159, 7952, -1939, 1285, 6458, -15669, -14147, -8991, -7663, 6936, 10672, 18767, 32086, 59547, 98610, 134380, 152891, 118440, 75426, 62084, 62291, 66488, 59766, 43214, 19257, 7337, 3749, 13211, -4434, -5768, 1085, -9629, -29316, -10840, 10600, 10892, 5698, -5683, 1051, 5744, 8754, 7910, 10027, 9021, 12686, 15062]
12775A5062J270l313j7940l08J6552N4q474K568j347K198M864q237J0018M894
12761A7861P012p779j4619l132Q299p822o512n04J5435p629l264pJ5340K5848
12747C8527L1206L3234L9364K3002l3085n0197l2175j8591L494j0861M993r92
12735B7919n269j0705p716o38J4860p15o380l764Q747k637q346j1294l845R034
12721g49L582k040j1626J231J0296J729N092n702j5194J314Q129L927Q541o063
12707B467r221Q983L670j0458Q480R019M776n615o963k379J876j0137j0046J7668
12693B120J0746o543k135n083r582l529J6720J4357R847O257j1381j7053j1390
12680f649r678L673K3944m411j2933K778J4495n829J89l13K603J3195j339q622
$$ y = [15062, 16332, 13019, -4921, -5229, 11323, 11377, 2903, 5471, 4124, 6322, 11186, 2949, 12967, 17861, 24873, 17094, 2475, -657, 7642, -180, -6692, -7196, 8239, 610, -2654, -2661, 12679, 38527, 69733, 102967, 142331, 165333, 132248, 82051, 49876, 31285, 34779, 23918, 28911, 27919, 22650, 11945, 4229, 3591, 18451, 17736, 11356, 7592, 16339, 13702, 5356, -5938, -9783, -749, 2833, 793, -10833, -9602, 694, 2423, 7515, 1813, -13381, -12067, -3938, -11, 8530, 2467, -6754, 2229, 5899, -4559, 3921, 12940, 17716, 12101, 5138, 2759, 4635, -5502, -15548, 2120, 12866, 6323, 4188, -895, -10477, -14006, 2714, 17071, 26918, 33175, 21794, 4741, -6649, -16327, -12654, 11290, 6879, -6054, -3276, 11219, 5390, 5579, 5266, 7869, 21064, 19725, 11103]
12666A1103o497l853N556L214M081j0769j3988j640J2701q20m898J563q342M232
12652h357Q052j825o144M05Q936R997L498p148j3957J052J4966J8860j147j5967
12638A1221j615o146j1540j2162J4747J1497l881K216k746o340k603Q4m821k50
12624a2339M621q387J2127J6081m846L774k913r2R528J7886o134k8443j2650K668
12610i119q981K75J9328J0211J105Q475L137j1053j7862j3656Q438J2642L429
12597F369J2731P204o503J999l998j4954k0454N301O11R0j288Q74J747k522m392
12582a7185k351N37r96O819R043L59P074j607K740J6421j1499k097K28j2937j1753
12567a7204K751N825M868O187q065j1877o449Q627J7021L74k736N17O236N447
$$ y = [11103, 4606, 753, 6309, 9523, 13604, 2835, -11153, -12793, -92, -912, -5810, -4247, -12589, -8357, -305, -2130, -8274, -7869, 1067, 11064, 14562, 7414, -6543, -5491, 9475, 28335, 27188, 11221, 9606, 3460, -8080, -20242, -5495, 6002, 2121, 4337, 1591, -4749, -7352, -7268, -12089, -12339, -7718, -16105, -3978, 12103, 7257, 11031, 8118, 8026, 17554, 35440, 29306, 863, -11787, -9119, -18100, -17825, 1503, 11714, 12819, 21294, 24431, 13378, -4484, -18140, -9702, 2940, 6369, 19100, 26304, 19801, 21800, 17802, 2848, -17606, -12305, -11694, -11604, -12892, -12018, -10271, -12793, -17185, -19536, -18999, -19995, -13176, -4133, -3774, 3300, 1693, 4433, 20854, 9355, 7258, 7486, -5451, -17204, -14453, -8628, -3760, 2427, -5638, -17515, -23964, -15337, 1684, 2058, -678, -161, 6075, 11522]
12553A1522r885m978K88P748K538l761p484L859j1987K381M937o193j5968K3652
12539c331J8757j1664m431J884q365l882n2P31L383J7715R272J6527j8256j1045
12525G243o921m667L533n086l644K917j904N792l048J520j965M028j2740O020
12511h922N832j0376O12P200j397k458J471J5875p641K680k846j2240q50Q340
12497d720P75l849o29O667k287j877k712J089L775r92j313M204M290j133j3842
12482a2554k075J5595J974o474m42M991L249J7290L177r056n528m717J668p970
12468h72m994J981m124Q449k613q172n044N31j2913r531R344J3559K1923P968
12454A5492q415p385L80n70K698O490r827k16p294L566L13k398K934j083j0831
$$ y = [11522, 1637, -3341, -3053, 4695, 7233, 3472, -4012, -153, -12140, -9759, -4822, -11015, -26983, -3331, 15426, 3762, -669, 1215, -7150, -11032, -11084, -10353, -6970, 10745, 20017, 36544, 18288, 7243, 322, -4345, -812, -5898, -9542, -6625, -8529, -2737, -5785, -4265, -6230, -2202, -14942, -8922, -3090, -13466, -12854, -5654, -7051, -9509, -8038, 7837, 196, 2876, 30, -12210, -13060, -4720, -3945, -7794, -8423, -1756, -4043, -5920, -8632, -7543, -3768, -4760, -6073, -1869, 2421, 1288, -12554, -14629, 966, 2940, -3534, -3976, 1015, 4264, 21554, 24731, 15675, 10147, 5430, 7098, -872, -5866, -3885, -8009, 440, -2173, -10345, -15389, -14858, -27771, -37302, -27958, -14399, 7524, 15492, 7077, -308, 72, -498, 2200, 8690, -1137, -1353, -8647, -5081, -4768, -7166, -4232, -5315, -16146]
12439a6146j1583L788J0879J6733K89o652n959j2400q790K392K5029J647q545
12426i318p978l251O333J5066J5089j568p167j6363m214J7067J7270k2452j7035
12413a8521K524QR553J7413o298J4794k101l28j962o96r602K122k037r719m61
12398e311R638J1735N804M231j0840l970j41j1647K812P666J0887N465M626l887
12384B7068r783q368O597L902R955r098k4705n596m622j0920r687K979R142R023
12370a4113K844N955n306r686O668j0341P898L570O559l323M982L447O876P383
12356A3413n787m492m385Q203l85k250j2863j3570K541l669m527J9852Q943j1046
12342a0022N740R773J0234p020n906O325k643L155r746k73o431N272K437L107
$$ y = [-16146, -27729, -23941, -13062, 3671, 3960, -2692, -8651, -21051, -29841, -27449, -2420, -773, -9318, -17296, -20547, -14214, 852, 15941, 14373, 7206, -9157, -13371, 3696, 20966, -1486, -18521, -15997, -15989, -6436, 10977, 4679, 19473, 17372, 17044, 15082, 14386, 4784, 6906, 4869, -4850, -5311, 4327, 16062, 21866, 26097, 15257, 11287, 11146, -501, 2311, 9977, 20864, 26329, 30955, 27068, 17285, 8917, 15514, 19416, 29371, 20273, -4432, -10028, -14650, -25570, -35257, -32278, -23136, -14113, -11269, -5314, -10620, -20306, -13638, -23979, -16081, -12511, -5952, -9275, -4293, -846, 6030, 13413, 7626, 3134, -1251, 6952, 6567, 4317, -8546, -22116, -19575, -23244, -27771, -7919, 1024, -10022, -4282, 5491, 15725, 8705, 2799, 9124, 6481, 9636, -110, -383, -6814, -1542, 895, 4002]
12328D002j0057Q97K570J1495J3003Q127O726j0247q998n738j7675n492J0744
12315f43o108P968P447P915M338J1189j755m490Q19k779n547q299j3797n748M156
12300e334Q773N457P550L706P559K201j3764j4456j0803O438O168n274K921o555
12286e413n846J1531k118p00m100L592J6379M060p741l886P291j2035j8189r928
12272b7103J0456J2863O029n751j0811J0644O674j1449M674P919j217l709j0409
12259a1190R046M951j983R136K880L347O859n282j1850q646p54l536k492Q881
12245f33K520L102n608p638r9q728p632J075Q607R183M915o898j5606j5325L455
12230c5310O855J2738P408M607N067k714q305R95J4795k911J614n495l682L240
$$ y = [4002, -6055, -5158, -2588, 8907, 21910, 30037, 36763, 26516, 17518, 11780, -5895, -11387, -643, -6751, 1217, 8664, 16579, 20917, 32106, 30351, 25861, 26680, 23901, 18354, 10055, -3742, -9490, -5334, 3439, 8896, 16446, 20152, 27711, 29912, 16148, 1692, -9111, -2673, 3495, -1779, 1142, -5413, -11259, 272, -1846, -2546, -6646, -3054, 13325, 17385, 9644, 5758, 13049, 1014, -17175, -27103, -16647, -3784, 2245, -3506, -14317, -3673, 3001, -8448, -3774, 4145, 2928, -781, -11190, -2144, 2807, 824, 9960, 12840, 16187, 23046, 17764, 5914, -2732, -3486, -7022, -9514, -633, 1887, 4989, -619, -8257, -8356, -17084, -24716, -23641, -15034, -5851, -936, -7834, -23440, -38765, -35310, -28455, -15717, -8309, -3702, 1365, -1349, -9654, -8659, 6136, 3225, 4839, -656, -4338, -1098]
12216a098m010J0456P003m709r105p258j1604j87N31N280l552j1078m999J3028
12202b1302J6153J7168N517k780l962j4345M450L708J4058k945n889n133O967
12189A1665J2297r964n343o212p193n902L175K92k678o626O940Q498k850N778
12175A877j2635o598j475o272K7980J3435M704j1845m048n234n310j330j2473
12162a9224J3680J5149o928o094R68K069j7707o702J2349J074J1693l287p238
12149a0198k570q278j1811J305P382O924m912j1689J6548j953j314J1047J8069
12136H550k05O948M068L608o811m842j2216j1160Q434R375K909m32J68j332p529
12121d67n09m691j4485K895J3735K765q275R14J2776J1202r757N572l065p501
$$ y = [-1098, -5108, 5348, 12351, 7642, -1463, -8721, -20325, -20512, -19981, -14701, -18253, -29331, -34330, -21302, -5149, 12019, 17536, 14756, 10794, -3551, 899, 4607, 18665, 15720, 9831, 4698, 11665, 23962, 13998, 8655, 2443, -4750, -10652, -7477, -7185, -9863, -16489, -9549, -1051, -3901, 1877, -10758, -17356, -18831, -25103, 2877, 16312, 21016, 9171, 5123, -111, -5421, -6751, -19224, -5544, 9605, 2677, -3417, -2449, -380, -18087, -24789, -12440, -11366, 327, -2960, -10198, -12768, -21046, -32857, -31552, -24170, -17246, -22158, -33847, -17299, -19252, -20566, -9519, 8550, 8345, 15293, 19361, 22969, 16158, 11316, -900, -12060, -3626, 5749, 8658, 8226, 8394, 7062, -467, -976, -5667, -20152, -17257, -3522, -757, -9032, -8118, 4658, 15860, 6103, 11675, 8610, 1109]
12107A109N148k436M476Q272n226m885Q373m2o885m518j245L436r294j0821N526
12092i012N055N64q49p67J464K260J987q204M530n446p764R950j823p438m184
12077a9677R683J6207J239o2N291J870p568l639O234M978j7534j2014P44J7229
12063B981J1097j3126j0632r939N027o633j1526L661J8188N311p689n190J3120
12050e350M694l403K842N891L223q0k760r207J829O547l232m479J2276J094K597
12035A2482k706j3166j3268k314R280O850R57M027M101K742p23k498j4653K973
12021e916O431J3678Q729l046j3469r809k858K992J1437K81j7168J235o130n397
12007a9010j3186L692J7796K3271P508m914j4836j9380O225J0426m926m471N97
$$ y = [1109, 6257, 3821, 8297, 16569, 11343, 6458, 14831, 14789, 7904, 3386, 2141, 5577, -3717, -14538, -9012, -3957, -3393, -4242, -5009, -3545, -1285, 702, -7502, -2972, -8418, -16182, -6232, -8055, -15493, -19677, -9994, 6213, 7452, 7390, 12681, 14551, 6983, 3344, 9578, 14556, -2978, -14992, -14248, 2981, 14078, 952, -9680, -19619, -14592, -21225, -32751, -29090, -10902, -5591, -13280, -18470, -5350, -656, -4059, -1217, 4674, 7897, 7817, 5057, -4150, -2321, 4226, 994, -3485, 8791, 9885, 12482, 9776, -3390, -16658, -18972, -9692, -2842, -1885, 2142, 6243, 8985, 8262, 5764, -8889, -5916, 515, 14193, 22922, 19876, 6407, -3402, -6260, -3268, 8169, 8450, -8718, -7483, -13613, -19010, -32196, -28504, -10708, 12563, 20071, 15157, 321, -19059, -12834, -2408, -7334, -11805, -11208]
11994a1208Q437k597j6960m065J1578K9602O800r574j2720J0055r193j2500P127
11981e218J2419r011j0423M390L975J0486q654o784K041Q899r234J232Q915j525
11967A508k208K801N869O993O190q834j1487M955K0704K046k4170L055N930k424
11953A0928l917l595o14q013p567O119R830l835P42j646r865m244p611p282M228
11938b6342J4495l669n596n322O508J4561M640j096m758L741p587M292J6283k978
11924G172K540J801l011j7227j0515k739O4J6322K1057l064j4909j0206J805J7177
11910F267J5993j936j8408k769M257r689r509n10R276P417P317r755k869j115
11896f033m072Q408M975q582p951k278m382l449R564K160J7519P356O59j1132
$$ y = [-11208, -2771, -5368, -22328, -26393, -14815, 14787, 21587, 12013, -707, 9348, 155, -12345, -5218, 7201, -1810, -12233, -7843, -3868, 6618, -2036, -8820, -6779, 2120, -7114, -5882, 3033, 1508, -700, 2101, 7970, 14963, 21153, 12319, 832, 5787, 26491, 28537, 4367, 7422, 13352, 10928, 7011, 3416, 2802, -5211, -12778, -6659, 3171, -664, 78, -1568, -11433, -15677, -23288, -30570, -26342, -11847, -15516, -21112, -26434, -19926, -5365, -725, -1821, -6579, -2838, -10425, -6133, 10150, 7172, 9712, 11513, 8502, -8725, -19240, -21979, -21915, -5593, 15464, 12400, -2509, -12715, -10910, 6267, 22260, 20324, 1916, -853, 3404, -6285, -15794, -16304, -7028, 389, 7706, -2049, -4918, -6033, -10105, -1697, 3278, -5304, -13255, -15533, -19915, -23364, -13800, -11640, 5879, 13235, 13894, 2762]
11882B762j6447J0448K606K397k670q237m327K37N49l163k062K637J900J2426
11868i44N663n944m103J886J345p560N907n01j5477k774K1597J2269o816j3043
11854h495n428K1787J3344o560q437k495j213m893J650M216l116j0301J0964N236
11840F259O73J556J603k778q232l800j468O091Q37k0770K645R994Q778N692R191
11825A6271j5518l986J953N178L994q286j16J503p374L936q59R302R485l244N370
11810A7609l27j9642p044k428O580K0784j45l349j3996J46R034L835r842p454
$$ y = [2762, -13685, -3237, -631, 1766, -904, -9141, -13468, -13231, -12682, -15845, -17907, -15270, -13370, -944, 4719, -1225, -5328, -3442, -2097, -9657, -3750, -4251, -19728, -22502, -905, 11364, 4548, -8495, -13923, 7864, 21208, 14648, 6211, 3716, 2503, -2390, -740, 3476, 360, -9941, 1023, 6259, 6932, 8488, 10091, 7313, -919, -4719, -6187, -96, 741, -20029, -17384, -7390, 1388, 7080, 16271, 753, -3233, -1280, 3898, 7892, -394, -510, 993, -6381, -2445, -3304, 5998, 15483, 12239, 17609, 17282, -2360, -9404, -11832, -5252, 15532, 15387, 12038, -1958, -1812, 7222, 11057, 1215, -6239]
$$ [...]
##END NTUPLES=NMR SPECTRUM
##END=
