##TITLE=Analysis number 327864
Compound Code km 05539
Book Reference 182182 a
Project Code qc fl
Chemist Name jom
##JCAMPDX= 6.0         $$ Bruker NMR JCAMP-DX V2.0
##DATA TYPE= NMR SPECTRUM
##DATA CLASS= NTUPLES
##ORIGIN= Bruker BioSpin GmbH
##OWNER= nmr
$$ XWIN-NMR		Version 3.5
$$ Fri Apr 13 09:33:35 2007 GMT Daylight Time (UT+1h)  MAYBRIDGE\nmr@NMR_250MHZ
##.OBSERVE FREQUENCY= 250.131544655141
##.OBSERVE NUCLEUS= ^1H
##.ACQUISITION MODE= SIMULTANEOUS (DQD)
##.ACQUISITION SCHEME= undefined
##.AVERAGES= 16
##.DIGITISER RES= 18
##SPECTROMETER/DATA SYSTEM= dpx250
##.PULSE SEQUENCE= zg30
##.SOLVENT NAME= DMSO
##.SHIFT REFERENCE= (INTERNAL, DMSO, 0, 16.522)
##AUDIT TRAIL= $$ (NUMBER, WHEN, WHO, WHERE, WHAT)
$$ ##TITLE= Audit trail, XWIN-NMR		Version 3.5
$$ ##JCAMPDX= 5.01
$$ ##ORIGIN= Bruker BioSpin GmbH
$$ ##OWNER= nmr
$$ C:\u/data/dgb/nmr/ADRS/1370/pdata/1/auditp.txt
$$ ##AUDIT TRAIL=  $$ (NUMBER, WHEN, WHO, WHERE, WHAT)
(   1,<2007-04-13 09:33:06.59 +100>,<MAYBRIDGE\nmr>,<NMR_250MHZ>,
      <created by zg, POWCHK disabled, PULCHK disabled
       configuration hash MD5:
       49 4B E0 1D 92 C2 6B 37 9F E6 65 BC 52 41 86 1D
       data hash MD5: 64K
       F2 25 80 84 A6 5E 7F 72 46 1E 2E 26 14 CC 75 4C>)
(   2,<2007-04-13 09:33:24.40 +100>,<MAYBRIDGE\nmr>,<NMR_250MHZ>,
      <Start of raw data processing
       ef LB = 0.3 FT_mod = 6 PKNL = 1 SI = 32K 
       data hash MD5: 32K
       C8 A2 D1 14 A6 38 9A E2 03 C2 AA E2 07 89 FE 95>)
(   3,<2007-04-13 09:33:29.20 +100>,<MAYBRIDGE\nmr>,<NMR_250MHZ>,
      <apk 
       data hash MD5: 32K
       78 84 F1 0E EB 85 83 14 8C E2 44 B3 4C EB 61 8C>)
(   4,<2007-04-13 09:33:30.23 +100>,<MAYBRIDGE\nmr>,<NMR_250MHZ>,
      <abs ABSG = 5 
       data hash MD5: 32K
       8C 6D 24 18 46 46 42 8A D8 67 90 B4 01 D7 58 9F>)
$$ ##END=
$$ 
$$ hash MD5
$$ EC CD 04 69 1D 6F A9 1C C9 79 D4 1D DE DF AD 32
##$RELAX= 
##$RELAX= 
##$RELAX= 
##$RELAX= 
##$RELAX= 
##$RELAX= 
##$RELAX= 
$$ Bruker specific parameters
$$ --------------------------
##$DU= <C:\u>
##$EXPNO= 1370
##$NAME= <ADRS>
##$PROCNO= 1
##$TYPE= <nmr>
##$USER= <dgb>
##$AMP= (0..31)
100 100 100 100 100 100 100 100 100 100 100 100 100 100 100 100 100 100 
100 100 100 100 100 100 100 100 100 100 100 100 100 100 
##$AQSEQ= 0
##$AQ_mod= 3
##$AUNM= <au_zg>
##$AUTOPOS= <58 >
##$BF1= 250.13
##$BF2= 250.13
##$BF3= 250.13
##$BF4= 250.13
##$BF5= 500.13
##$BF6= 500.13
##$BF7= 500.13
##$BF8= 500.13
##$BYTORDA= 1
##$CFDGTYP= 0
##$CFRGTYP= 5
##$CHEMSTR= <none>
##$CNST= (0..31)
1 1 145 1 1 1 1 1 1 1 1 1 1 1 1 1 1 1 1 1 1 1 1 1 1 1 1 1 1 1 1 1 
##$CPDPRG= <>
##$CPDPRG1= <>
##$CPDPRG2= <>
##$CPDPRG3= <>
##$CPDPRG4= <mlev>
##$CPDPRG5= <mlev>
##$CPDPRG6= <mlev>
##$CPDPRG7= <mlev>
##$CPDPRG8= <mlev>
##$CPDPRGB= <>
##$CPDPRGT= <>
##$D= (0..31)
0 1 0 0 0 0 0 0 0 0.06 0 0 0 0 0 0 0.0002 0 0 0 0 0 0 0 0 0 0 0 0 0 0 
0 
##$DATE= 1176453185
##$DBL= (0..7)
120 120 120 120 120 120 120 120 
##$DBP= (0..7)
150 150 150 150 150 150 150 150 
##$DBP07= 0
##$DBPNAM0= <>
##$DBPNAM1= <>
$$ [...]
##$SUBNAM7= <"">
##$SUBNAM8= <"">
##$SUBNAM9= <"">
##$SW= 20.6930455092707
##$SWIBOX= (0..15)
0 0 3 0 0 0 0 0 0 0 0 0 0 0 0 0 
##$SW_h= 5175.983436853
##$TD= 65536
##$TD0= 1
##$TE= 683.16
##$TE2= 300
##$TE3= 300
##$TEG= 300
##$TL= (0..7)
0 120 120 120 120 120 120 120 
##$TP= (0..7)
150 150 150 150 150 150 150 150 
##$TP07= 0
##$TPNAME0= <>
##$TPNAME1= <>
##$TPNAME2= <>
##$TPNAME3= <>
##$TPNAME4= <>
##$TPNAME5= <>
##$TPNAME6= <>
##$TPNAME7= <>
##$TPOAL= (0..7)
0.5 0.5 0.5 0.5 0.5 0.5 0.5 0.5 
##$TPOFFS= (0..7)
0 0 0 0 0 0 0 0 
##$TUNHIN= 0
##$TUNHOUT= 0
##$TUNXOUT= 0
##$USERA1= <user>
##$USERA2= <user>
##$USERA3= <user>
##$USERA4= <user>
##$USERA5= <user>
##$V9= 5
##$VALIST= <valist>
##$VCLIST= <CCCCCCCCCCCCCCC>
##$VD= 0
##$VDLIST= <DDDDDDDDDDDDDDD>
##$VPLIST= <PPPPPPPPPPPPPPP>
##$VTLIST= <TTTTTTTTTTTTTTT>
##$WBST= 1024
##$WBSW= 4
##$XGAIN= (0..3)
0 0 0 0 
##$XL= 0
##$YL= 0
##$YMAX_a= 263917
##$YMIN_a= -372893
##$ZGOPTNS= <>
##$ZL1= 120
##$ZL2= 120
##$ZL3= 120
##$ZL4= 120
##$ABSF1= 16.522
##$ABSF2= -4.171173
##$ABSG= 5
##$ABSL= 3
##$ALPHA= 0
##$AQORDER= 0
##$ASSFAC= 0
##$ASSFACI= 0
##$ASSFACX= 0
##$ASSWID= 0
##$AUNMP= <proc_1d>
##$AZFE= 0.1
##$AZFW= 0.1
##$BCFW= 0
##$BC_mod= 0
##$BYTORDP= 0
##$COROFFS= 0
##$CY= 12.5
##$DATMOD= 1
##$DC= 0
##$DFILT= <>
##$DTYPP= 0
##$F1P= 14.0000005364418
##$F2P= -0.99999901652339
##$FCOR= 0.5
##$FTSIZE= 32768
##$FT_mod= 6
##$GAMMA= 0
##$GB= 0
##$INTBC= 1
##$INTSCL= 1
##$ISEN= 128
##$LB= 0.3
##$LEV0= 0
##$LPBIN= 0
##$MAXI= 10000
##$MC2= 0
##$MEAN= 0
##$ME_mod= 0
##$MI= 0
##$NCOEF= 0
##$NC_proc= -4
##$NLEV= 6
##$NOISF1= 0
##$NOISF2= 0
##$NSP= 0
##$NTH_PI= 0
##$NZP= 0
##$OFFSET= 16.522
##$PC= 1
##$PHC0= 201.9972
##$PHC1= 38.76381
##$PH_mod= 1
##$PKNL= yes
##$PPARMOD= 0
##$PSCAL= 4
##$PSIGN= 0
##$REVERSE= no
##$SF= 250.13
##$SI= 32768
##$SIGF1= 0
##$SIGF2= 0
##$SINO= 400
##$SIOLD= 32768
##$SREGLST= <1H.DMSO>
##$SSB= 0
##$STSI= 32768
##$STSR= 0
##$SW_p= 5175.98343685301
##$SYMM= 0
##$S_DEV= 0
##$TDeff= 65536
##$TDoff= 0
##$TI= <Analysis number 999999
Compound Code 99
Book Reference 9
Project Code 9>
##$TILT= no
##$TM1= 0
##$TM2= 0
##$TOPLEV= 0
##$USERP1= <user>
##$USERP2= <user>
##$USERP3= <user>
##$USERP4= <user>
##$USERP5= <user>
##$WDW= 1
##$XDIM= 32768
##$YMAX_p= 425480781
##$YMIN_p= -644530
$$ End of Bruker specific parameters
$$ ---------------------------------
##NTUPLES= NMR SPECTRUM
##VAR_NAME=  FREQUENCY,     SPECTRUM/REAL,   SPECTRUM/IMAG
##SYMBOL=    X,             R,               I
##VAR_TYPE=  INDEPENDENT,   DEPENDENT,       DEPENDENT
##VAR_FORM=  AFFN,          ASDF,            ASDF
##VAR_DIM=   32768,         32768,           32768
##UNITS=     HZ,            ARBITRARY UNITS, ARBITRARY UNITS
##FACTOR=    0.157963299565203, 1,           1
##FIRST=     4132.6476996994, 0,             0
##LAST=      -1043.33573715361, 0,           0
##MIN=       -1043.33573715361, -644530,     0
##MAX=       4132.6476996994, 425480781,     0
$$ Real data points
##PAGE= N=1
##DATA TABLE= (X++(R..R)), XYDATA
$$ [...]
19827A208925q865O773k209M1086n091J6781J408m1337L7184M5272m2451K8710
$$ 1208925 1200060 1206833 1204624 1245710 1240619 1257400 1258808 1217471 1254655 1299927 1257476 1286186
19815A286186L4783k2547k6213l8439L857J3587N3855M3476p707j1924O7470K8731
$$ 1286186 1320969 1298422 1272209 1233770 1237627 1251214 1305069 1348545 1340838 1328914 1396384 1425115
19803A425115K489o9973K382j1471p2672k8305M6736O7088k5049L5692L2958j8695
$$ 1425115 1427604 1357631 1360013 1348542 1275870 1247565 1294301 1361389 1336340 1372032 1404990 1386295
19791A386295l4873j9677l6951j28R090j3877J0463O7991n0529l2097r761l6259
$$ 1386295 1351422 1331745 1294794 1294666 1303756 1289879 1300342 1368333 1317804 1285707 1275946 1239687
19779A239687L0466J8082K2662J2100m9142K8718O7012l4103K5753P001K852J2509
$$ 1239687 1270153 1288235 1310897 1322997 1273855 1302573 1369585 1335482 1361235 1368236 1371088 1383597
19767A383597R006k2688n319K6582l2249j0996l2743P511M5490O86m5219k0044
$$ 1383597 1392603 1369915 1364596 1391178 1358929 1347933 1315190 1322701 1368191 1368877 1323658 1303614
19755A303614K6639M4156J5506K5202M6117J197o3778l9723j069R4j6339L0727
$$ 1303614 1330253 1374409 1389915 1415117 1461234 1462431 1398653 1358930 1357861 1357955 1341616 1372343
19743A372343L381K8754n060N6428O7706k2617j641r4k7593k3135J3434K6820
$$ 1372343 1375724 1404478 1399418 1455846 1523552 1500935 1499294 1499200 1471607 1448472 1461906 1488726
19731A488726k8813L216k0240n9086j3493k6347j5458M5050K8142J4313P1413
$$ 1488726 1459913 1463129 1442889 1383803 1370310 1343963 1328505 1373555 1401697 1416010 1487423
19720A487423K8549L0132k0170j10693k9787O7735m067L0429M2549l3769K5145
$$ 1487423 1515972 1546104 1525934 1415241 1385454 1453189 1449122 1479551 1522100 1488331 1513476
19709A513476m2638k2023J7325k2134j5557K5044l623k5535Q912k5903q116O6666
$$ 1513476 1470838 1448815 1466140 1444006 1428449 1453493 1449870 1424335 1433247 1407344 1399228 1465894
19697A465894J326K9333K927l4407J844r14o996R40R17L8007M5935p789M711k9400
$$ 1465894 1467220 1496553 1499480 1465073 1466917 1466003 1459007 1459947 1460864 1498871 1544806 1537017 1541728 1512328
19683A512328l5243m3452r701K9352N9683K9812m1697m843J3670L7520o456k6872
$$ 1512328 1477085 1433633 1423932 1453284 1512967 1542779 1501082 1496239 1509909 1547429 1540973 1514101
19671A514101k6788J2683L3651M0544J4940k5378n4332o423K375J1524o2265k1335
$$ 1514101 1487313 1499996 1533647 1574191 1589131 1563753 1509421 1502998 1505373 1516897 1454632 1433297
19659A433297J4163M1917J7031k584l8744N1075l2459l0877K3920J2501L0499
$$ 1433297 1447460 1489377 1506408 1503824 1465080 1516155 1483696 1452819 1476739 1489240 1519739
19648A519739K5520K691m3068J31K1548K6770K5966Q481O9338L22r4586j3007
$$ 1519739 1545259 1547950 1504882 1505013 1526561 1553331 1579297 1587778 1657116 1657438 1562852 1549845
19636A549845P2743M3031p59J966j027j9783m2638o5191k0075K6757N3944L5129
$$ 1549845 1622588 1665619 1664860 1666826 1665799 1646016 1603378 1538187 1518112 1544869 1598813 1633942
19624A633942j144k0441p1970k4341M5189J6524l914j430K8368J9274J8497J6848
$$ 1633942 1632798 1612357 1540387 1516046 1561235 1577759 1573845 1572415 1600783 1620057 1638554 1655402
19612A655402J5258j1022p5433J7050L6952J3822Q918p608j5552J1367r908j4181
$$ 1655402 1670660 1659638 1584205 1601255 1638207 1652029 1660947 1653339 1637787 1649154 1639246 1625065
19600A625065p88n4775l1544M6003R222K3322j5178L038l3849P196K0485J9239
$$ 1625065 1624277 1569502 1537958 1583961 1593183 1616505 1601327 1604365 1570516 1577712 1598197 1617436
19588A617436J1661M2931L3909N513l1121n8177J7231K1882L2675J3006J2376
$$ 1617436 1629097 1672028 1705937 1711450 1680329 1622152 1639383 1661265 1693940 1706946 1719322
19577A719322l4874o4985L7037L914j9935J0307m7542J7991N1442J6324r449K1018
$$ 1719322 1684448 1619463 1656500 1660414 1640479 1650786 1603244 1621235 1672677 1689001 1679552 1700570
19565A700570n489L4984j9398l1628L8075L1047p923l1819l4597j962j6446j3011
$$ 1700570 1695081 1730065 1710667 1679039 1717114 1748161 1740238 1708419 1673822 1671860 1655414 1642403
19553A642403O0345J960l9515J950K0272k6956j9917L0443Q321M0598j1147j5040
$$ 1642403 1702748 1704708 1665193 1667143 1687415 1660459 1640542 1670985 1679306 1719904 1708757 1693717
19541A693717N2251R431P169l7274N824j4684o9561p306L202N773K1593j4821
$$ 1693717 1745968 1755399 1762568 1725294 1731118 1716434 1646873 1639567 1642769 1648542 1670135 1655314
19529A655314P023J526N3669L1974O149k4224K2112N011P172M2299N4615N4483
$$ 1655314 1662337 1663863 1717532 1749506 1755655 1731431 1753543 1758554 1765726 1808025 1862640 1917123
19517A917123j2327l8344m5341j6681N905N8244L4913k1916k4148j5212L5488
$$ 1917123 1904796 1866452 1821111 1804430 1810335 1868579 1903492 1881576 1857428 1842216 1877704
19506A877704l4894m5871P154K0290M2061J8695P5439K4416n2120l7876J4328
$$ 1877704 1842810 1796939 1804093 1824383 1866444 1885139 1960578 1984994 1932874 1894998 1909326
19495A909326Q025P560j1157q3551p0733J2298M1370K4575m1727J3503O4059L7696
$$ 1909326 1917351 1924911 1913754 1830203 1759470 1771768 1813138 1837713 1795986 1809489 1873548 1911244
19483A911244K0234K6325o3764L6865M3392j7252M4297L7113n515r3422m2593
$$ 1911244 1931478 1957803 1894039 1930904 1974296 1957044 2001341 2038454 2032939 1939517 1896924
19472A896924K3013j1662r4520m8255k8370l9918k423N5202O0672j6350q4897
$$ 1896924 1919937 1908275 1813755 1765500 1737130 1697212 1694789 1749991 1810663 1794313 1709416
19461A709416J3651M7559J3147P234m4632r93K7359M0227o716K6707J5373k952
$$ 1709416 1723067 1770626 1783773 1791007 1746375 1745382 1772741 1812968 1806252 1832959 1848332 1845380
19449A845380K8276J8498j6042p304J7028m1884L7086M4744k6414n3988j0924
$$ 1845380 1873656 1892154 1876112 1868808 1885836 1843952 1881038 1925782 1899368 1845380 1834456
19438A834456O5683M8832j596o7993m4704J6700J9161o0193M7385L3190L011k2564
$$ 1834456 1900139 1948971 1947375 1879382 1834678 1851378 1870539 1810346 1857731 1890921 1893932 1871368
19426A871368K8624N3882O125o448m3083m8557p338r112L320J2501j9133p9075
$$ 1871368 1899992 1953874 1959999 1953551 1910468 1861911 1854573 1845461 1848781 1861282 1842149 1763074
19414A763074L5700L5159j123J5083K0910J2587n5919m3688K2688N5311J3495
$$ 1763074 1798774 1833933 1832810 1847893 1868803 1881390 1825471 1781783 1804471 1859782 1873277
19403A873277O4532N6743r938k4283Q569M2317m1248L655J175J3576o7969k7039
$$ 1873277 1937809 1994552 1984614 1960331 1968900 2011217 1969969 1973624 1974799 1988375 1920406 1893367
19391A893367l115P268l5185k9895N3045J4974r645L5557l5353L2311j2581J9885
$$ 1893367 1890252 1897520 1862335 1832440 1885485 1900459 1890814 1926371 1891018 1923329 1910748 1930633
19379A930633Q6000j6554o7663m6665k4788j1074m882N4861K7940n133o5294p267
$$ 1930633 2016633 2000079 1932416 1885751 1860963 1849889 1845007 1899868 1927808 1922675 1857381 1850114
19367A850114O6352M0809j4743k4486J676j130M4665L71j0231n8431k0930k607
$$ 1850114 1916466 1957275 1942532 1918046 1919722 1918592 1963257 1963628 1953397 1894966 1874036 1871429
19355A871429Q152L0897K4015l2438J2840R009J3814N4449Q097K4862k2854l2444
$$ 1871429 1879581 1910478 1934493 1902055 1914895 1923904 1937718 1992167 2000264 2025126 2002272 1969828
19343A969828n533M227o4442l1483L1981L0073L8485J3090J6792j4446K9977N314
$$ 1969828 1964295 1968522 1904080 1872597 1904578 1934651 1973136 1986226 2003018 1988572 2018549 2023863
19331B023863l2802J6362l3436M3951n9057k0645p711k2165r228n9679K9082P9536
$$ 2023863 1991061 2007423 1973987 2017938 1958881 1938236 1930525 1908360 1899132 1839453 1868535 1948071
19319A948071J8058j327j4563P20L6875K6972o609j8669l9590l863M7509J00317
$$ 1948071 1966129 1964802 1950239 1950959 1987834 2014806 2008197 1989528 1949938 1946075 1993584 2093901
19307B093901M7494j9292j5495N342J9877K4106l6198n4524j6560l2595k2044
$$ 2093901 2141395 2122103 2106608 2111950 2131827 2155933 2119735 2065211 2048651 2016056 1994012
19296A994012M11O6351L1170k9720J3590l4202N3971M282R420J6409k1808k193
$$ 1994012 1994423 2060774 2091944 2062224 2075814 2041612 2095583 2099865 2109285 2125694 2103886 2101693
19284B101693K687m3596p1012l2732P340k9829N2494P4332K7362j0560p372m369
$$ 2101693 2104380 2060784 1989772 1957040 1964380 1934551 1987045 2061377 2088739 2078179 2070807 2066438
19272B066438m4554p070P5115m1135p0013R788N2227K3904l2098K5457K2746K1948
$$ 2066438 2021884 2014814 2089929 2048794 1978781 1988569 2040796 2064700 2032602 2058059 2080805 2102753
19260B102753K7398K2545k7693n373M7955K0005m7605o3932o002l902K037j546
$$ 2102753 2130151 2152696 2125003 2119630 2167585 2187590 2139985 2076053 2070051 2066149 2068186 2066640
19248B066640l7471J687J7855L4330J5096J5432j8204j7365K8733l2709m9032
$$ 2066640 2029169 2030856 2048711 2083041 2098137 2113569 2095365 2078000 2106733 2074024 2024992
19237B024992Q976J8892L1706K6959J1662J2254J8864m1513l1338J6895k4948
$$ 2024992 2033968 2052860 2084566 2111525 2123187 2135441 2154305 2112792 2081454 2098349 2073401
19226B073401j9175N7220M500J9214K3254k6301o5279n0040j0064O0070K2800
$$ 2073401 2054226 2111446 2115946 2135160 2158414 2132113 2066834 2016794 2006730 2066800 2089600
19215B089600j4208L3492K0883O493N983m3284L3791L5743q24K4760o7161q014
$$ 2089600 2075392 2108884 2129767 2136260 2142243 2098959 2132750 2168493 2167669 2192429 2125268 2117254
19203B117254J4524j7633K3986J9318k3502r206o910j803L5681m9685k6424N9790
$$ 2117254 2131778 2114145 2138131 2157449 2133947 2124741 2117831 2116028 2151709 2102024 2075600 2135390
19191B135390o515o4043K1111k9962J2891K5476K2683L7513l6956J2128N1280
$$ 2135390 2128875 2064832 2085943 2055981 2068872 2094348 2117031 2154544 2117588 2129716 2180996
19180B180996k9684n8396K7827J4311M043j0595j8360J0141k5838K0629l0290
$$ 2180996 2151312 2092916 2120743 2135054 2139097 2128502 2110142 2120283 2094445 2115074 2084784
19169B084784k2621L0560N8255L1129J6107j6415Q641l3677o450l5895l1432m0274
$$ 2084784 2062163 2092723 2150978 2182107 2198214 2181799 2190440 2156763 2150313 2114418 2082986 2042712
19157B042712M9169O6099p26j6069l9232k2673N3752K0167l0650j3166P879Q535
$$ 2042712 2091881 2157980 2157254 2141185 2101953 2079280 2133032 2153199 2122549 2109383 2117262 2125797
19145B125797l5403j637M8310k1142K877p890k8786N4866L8027k1970q0330p8360
$$ 2125797 2090394 2088757 2137067 2115925 2118802 2110912 2082126 2136992 2175019 2153049 2072719 1994359
19133A994359L8127P4243L5653L1966j9109k1177P198j1345Q225J215J0852J5950
$$ 1994359 2032486 2106729 2142382 2174348 2155239 2134062 2141260 2129915 2138140 2139355 2150207 2166157
19121B166157n947l0665K7268o792j1338k6057N2768P3139k8903R562j294J6185
$$ 2166157 2160210 2129545 2156813 2150021 2138683 2112626 2165394 2238533 2209630 2219192 2217898 2234083
19109B234083N366R802J5101n4991n3009j6058R096L4411O7344l1990p6855O360
$$ 2234083 2239449 2249251 2264352 2209361 2156352 2140294 2149390 2183801 2251145 2219155 2142300 2148660
19097B148660L3133L0874r509n7611n450N0432l000L786j3724j433L7386m7622
$$ 2148660 2181793 2212667 2203158 2145547 2140097 2190529 2187529 2191315 2177591 2176158 2213544 2165922
19085B165922j7232Q045n059m2640J8779J6637M527M9242n2022M969K1018n0340
$$ 2165922 2148690 2156735 2151676 2109036 2127815 2144452 2148979 2198221 2146199 2151168 2172186 2121846
19073B121846m3580J4201K6144p017J3727M586j2390K5199L3751k041N0684N3089
$$ 2121846 2078266 2092467 2118611 2111594 2125321 2129907 2117517 2142716 2176467 2174426 2225110 2278199
19061B278199l4711n0032N962r93M0706j2964o7054K3646L1752l4024r351K7813
$$ 2278199 2243488 2193456 2199418 2198425 2239131 2226167 2159113 2182759 2214511 2180487 2171136 2198949
19049B198949P141k5251J7214K4311l250k8290Q702M1421j6659o1631N1817L7101
$$ 2198949 2206090 2180839 2198053 2222364 2219114 2190824 2199526 2240947 2224288 2162657 2214474 2251575
19037B251575k1638m5063l1776O2296m6237k8682k4608L8309P3560M1937J0016
$$ 2251575 2229937 2184874 2153098 2215394 2169157 2140475 2115867 2154176 2227736 2269673 2279689
19026B279689q167k7895p1987o1356K78M9965L9278k012J5912L5445K4154l8423
$$ 2279689 2271522 2243627 2171640 2110284 2110562 2160527 2199805 2197793 2213705 2249150 2273304 2234881
19014B234881J5213J1272L4708O002j3877k0471k7105Q570l3948K4555l150L5752
$$ 2234881 2250094 2261366 2296074 2302076 2288199 2267728 2240623 2249193 2215245 2239800 2236650 2272402
19002B272402K6534j4387l7990k700m86l094k4283P758J9001m7676k5766k5985
$$ 2272402 2298936 2284549 2246559 2243859 2243373 2240279 2215996 2223754 2242755 2195079 2169313 2143328
18990B143328j3237M3783J1969k2871j2326j1519N39Q2952o07l6895L360K9738
$$ 2143328 2130091 2173874 2185843 2162972 2150646 2139127 2139666 2222618 2222011 2185116 2188476 2218214
18978B218214l04j6721j1865j3331N2791J8772l8397K2362P766N5236m0314J2987
$$ 2218214 2217910 2201189 2189324 2175993 2228784 2247556 2209159 2231521 2239287 2294523 2254209 2267196
18966B267196M3411n3041m87l5755K4819M3109l2901J210l1109N762R516k8064
$$ 2267196 2310607 2257566 2257079 2221324 2246143 2289252 2256351 2257561 2226452 2232214 2241730 2213666
18954B213666m0083L9133L3031l3259J445m011l4195J9759N1930K5247M9519k8756
$$ 2213666 2173583 2212716 2245747 2212488 2213933 2209922 2175727 2195486 2247416 2272663 2322182 2293426
18942B293426l6750m4320m0767r493M1752J7011p510r167k1348k7514j4829m4688
$$ 2293426 2256676 2212356 2171589 2162096 2203848 2220859 2213349 2204182 2182834 2155320 2140491 2095803
18930B095803L0501N1897K1916K0673m3565m5070l4297K0208K8724J5144o326
$$ 2095803 2126304 2178201 2200117 2220790 2177225 2132155 2097858 2118066 2146790 2161934 2155608
18919B155608L1680L7108J6304Q540J7934K9769j2093N776J3270l6186j6854l0340
$$ 2155608 2187288 2224396 2240700 2249240 2267174 2296943 2284850 2290626 2303896 2267710 2250856 2220516
18907B220516l1338O0544m15k772l1101n9365L9513J373J7568M202K5021k7730
$$ 2220516 2189178 2249722 2249307 2246535 2215434 2156069 2195582 2196955 2214523 2218725 2243746 2216016
18895B216016j4040q126k5730l4864K7151J6805k1131m626J5324L9122o318l4837
$$ 2216016 2201976 2193850 2168120 2133256 2160407 2177212 2156081 2151455 2166779 2205901 2199583 2164746
18883B164746M175k000m239k1302q946r770M7790L2933j0055k4917K1384L2302
$$ 2164746 2168921 2166921 2162682 2141380 2132434 2122664 2170454 2203387 2193332 2168415 2189799 2222101
18871B222101J8526k0702m3284k0033j3584J0878m2872N4476J4468p4349L3062
$$ 2222101 2240627 2219925 2176641 2156608 2143024 2153902 2111030 2165506 2179974 2105625 2138687
18860B138687J4112n3477m5640m0286m4064L9798N3504k6736l4999N7095O0111
$$ 2138687 2152799 2099322 2053682 2013396 1969332 2009130 2062634 2035898 2000899 2057994 2118105
18849B118105L8059j9488m8182M268k6630R460J08799k4884m0726L2082p435j098
$$ 2118105 2156164 2136676 2088494 2092762 2066132 2075592 2184391 2159507 2118781 2150863 2143428 2142330
18837B142330K5520n4358l279J0388m2056N1822J6609m1381L4629L2618j3047
$$ 2142330 2167850 2113492 2110213 2120601 2078545 2130367 2146976 2105595 2140224 2172842 2159795
18826B159795J4132J7634o2261k415J2034k1291j399N9114R325j1936j3325n3639
$$ 2159795 2173927 2191561 2129300 2126885 2138919 2117628 2116229 2175343 2184668 2172732 2159407 2105768
18814B105768m4101J3709L9229p220L2720k0436k4504k5807j8217J4467j6130
$$ 2105768 2061667 2075376 2114605 2107385 2140105 2119669 2095165 2069358 2051141 2065608 2049478
18803B049478N8723K4801n185j5064L609M8419o7337o0624j6220j7630P1356O4309
$$ 2049478 2108201 2133002 2127817 2112753 2116362 2164781 2097444 2036820 2020600 2002970 2074326 2138635
18791B138635q714n4654j4287Q319K6138n134O3362M3409j1500m1503j6073N832
$$ 2138635 2129921 2075267 2060980 2069299 2095437 2090303 2153665 2197074 2185574 2144071 2127998 2133830
18779B133830K2445K7909k9987k839k774r267K3687J2154J1887j6640m3271K1146
$$ 2133830 2156275 2184184 2154197 2151358 2148584 2139317 2163004 2175158 2187045 2170405 2127134 2148280
18767B148280K5345K1081n4665L6908k464n171O0657k971m483k1638R378p189
$$ 2148280 2173625 2194706 2140041 2176949 2174485 2169314 2229971 2227000 2222517 2200879 2210257 2203068
18755B203068l0515J6134k2139o4261l2100J8127M8149L1882J5899m5204n2665
$$ 2203068 2172553 2188687 2166548 2102287 2070187 2088314 2136463 2168345 2184244 2139040 2086375
18744B086375J7532M8826k7928o0900m2880K2129J1711N7747M257m1906K3453
$$ 2086375 2103907 2152733 2124805 2063905 2021025 2043154 2054865 2112612 2116869 2074963 2098416
18733B098416O3348l114j7703o214N5658m3010k7833m3112j9787J0593k1589m654
$$ 2098416 2161764 2158650 2140947 2134733 2190391 2147381 2119548 2076436 2056649 2067242 2045653 2040999
18721B040999N2399o580m3056k5177K6275J4281L2137O208k265J8207J3821k9973
$$ 2040999 2093398 2086818 2043762 2018585 2044860 2059141 2091278 2097486 2095221 2113428 2127249 2097276
18709B097276j6565P239O632k8110O04k7530J7025N844L2920J7506n1781k4788
$$ 2097276 2080711 2087950 2094582 2066472 2067076 2039546 2056571 2062415 2095335 2112841 2061060 2036272
18697B036272l4523k7975K4900O3332n244J5862L1417j1643K4982m086k0617m2154
$$ 2036272 2001749 1973774 1998674 2062006 2056762 2072624 2104041 2092398 2117380 2113294 2092677 2050523
18685B050523k3850l5193J2497J4273M2010l3408m6762k6867N7449J9722k6104
$$ 2050523 2026673 1991480 2003977 2018250 2060260 2026852 1980090 1953223 2010672 2030394 2004290
18674B004290k6620J699Q7349L4363l2750j1431k7344q46k0236K630J0583k4486
$$ 2004290 1977670 1979369 2066718 2101081 2068331 2056900 2029556 2028710 2008474 2011104 2021687 1997201
18662A997201k3587M3595O634l0372j4427j6201k6620K2620M3896j3345K394m1548
$$ 1997201 1973614 2017209 2023843 1993471 1979044 1962843 1936223 1958843 2002739 1989394 1991788 1950240
18650A950240k0553n884R414N8180M672k303J3817l0278L6092M4282L0401k4379
$$ 1950240 1929687 1923803 1933217 1991397 1996069 1993766 2007583 1977305 2013397 2057679 2088080 2063701
18638B063701p6324k2522j8704k3039p860L1333L1579N186L3585p216n6951p885
$$ 2063701 1987377 1964855 1946151 1923112 1915252 1946585 1978164 1983350 2016935 2009719 1952768 1944883
18626A944883L579o828J6700n641q2721k7881m049p85N8268M5650P988j5122J5866
$$ 1944883 1948462 1941634 1958334 1952693 1869972 1842091 1838042 1837257 1895525 1941175 1949163 1934041 1949907
18613A949907j0801l815j7711l2221o191J5388l054q66J9149P776M3339k0315
$$ 1949907 1939106 1935291 1917580 1885359 1879168 1894556 1891502 1890636 1909785 1917561 1960900 1940585
18601A940585j7651j5515M5942k683j1638O0805M0551k2365n3856j114o4722o907
$$ 1940585 1922934 1907419 1953361 1950678 1939040 1999845 2040396 2018031 1964175 1963061 1898339 1891432
18589A891432J0178j5758k0510j1221M4294P399J9665L0428j2702n8646M277K5338
$$ 1891432 1901610 1885852 1865342 1854121 1898415 1905814 1925479 1955907 1943205 1884559 1888836 1914174
18577A914174J3671k2061J5901J9K117k1420Q331j4066k0373J2479k5774K9829
$$ 1914174 1927845 1905784 1921685 1921704 1923821 1902401 1910732 1896666 1876293 1888772 1862998 1892827
18565A892827j3373O153P4154L5152m9748o9714r656M4629L0432J529K4952j7819
$$ 1892827 1879454 1885607 1959761 1994913 1945165 1875451 1865795 1910424 1940856 1942385 1967337 1949518
18553A949518k0246N090J357Q408k6051j11571l5233l1751K3771Q7979K6468j6384
$$ 1949518 1929272 1934362 1935719 1944127 1918076 1806505 1771272 1739521 1763292 1851271 1877739 1861355
18541A861355k8842j4141L3092O051l023J3105M330m2409K387L6584Q05K1231
$$ 1861355 1832513 1818372 1851464 1857515 1854492 1867597 1871927 1829518 1831905 1868489 1869294 1890525
18529A890525O3799K526l2980p1432K9320N4419o9063l8686n6343n2943P6038
$$ 1890525 1954324 1956850 1923870 1852438 1881758 1936177 1867114 1828428 1772085 1719142 1795180
18518A795180J01580N738n7197J475M526k9194k0691M9996N6386j8121r005J2448
$$ 1795180 1896760 1902498 1845301 1846776 1851302 1822108 1801417 1851413 1907799 1889678 1880673 1893121
18506A893121Q432o4482j8568L632j5892O5287K3516l4714j7701j6127J0538J8331
$$ 1893121 1901553 1837071 1818503 1822135 1806243 1871530 1895046 1860332 1842631 1826504 1837042 1855373
18494A855373j2472l435j0183k4457m8765j6909k7362M0574l642o1391O871M6563
$$ 1855373 1842901 1839466 1829283 1804826 1756061 1739152 1711790 1752364 1748722 1687331 1694202 1740765
18482A740765L849K9658J3921M812k2295M226J8425l6939P0902L0739L3011k0942
$$ 1740765 1744614 1774272 1788193 1793005 1770710 1774936 1793361 1756422 1827324 1858063 1891074 1870132
18470A870132k9358m6997k4962K8480n1149L692J0959k3634k9885q065j255J4312
$$ 1870132 1840774 1793777 1768815 1797295 1746146 1749838 1760797 1737163 1707278 1699213 1697958 1712270
18458A712270O9776J2321j7217n814j8989M361K577j543l3567j9437J785l1279
$$ 1712270 1782046 1794367 1777150 1771336 1752347 1756708 1759285 1757742 1724175 1704738 1706523 1675244
18446A675244l1573k242J5049Q209M2974J5279K7655N907n3493L125J6224j7313
$$ 1675244 1643671 1641429 1656478 1664687 1707661 1722940 1750595 1756502 1703009 1706134 1722358 1705045
18434A705045J9663K4990m0572j1795j0708P943N5410L0047j8261k4518m1839
$$ 1705045 1724708 1749698 1709126 1697331 1686623 1694566 1749976 1780023 1761762 1737244 1695405
18423A695405o626J4139o207k7328N7884j2079p7343K2446M5392K5583L861l0586
$$ 1695405 1688779 1702918 1696711 1669383 1727267 1715188 1637845 1660291 1705683 1731266 1735127 1704541
18411A704541l0335l1297j4785L78L3747P6544N3927m1558o6359j523L1165l3846
$$ 1704541 1674206 1642909 1628124 1628502 1662249 1738793 1792720 1751162 1684803 1683280 1714445 1680599
18399A680599k9480q1457J3872N6053l6346J1118L1274j063O9Q180J773J6265
$$ 1680599 1651119 1569662 1583534 1639587 1603241 1614359 1645633 1644570 1644639 1652819 1654592 1670857
18387A670857L704j7229l0773N734L1866K4497j8597j0189N0033l994r9235p838
$$ 1670857 1674561 1657332 1626559 1632293 1664159 1688656 1670059 1659870 1709903 1705909 1606674 1598836
18375A598836O1855l275O44M5219j3526k7849K0537P3777J1400l908o0512n5522
$$ 1598836 1660691 1657416 1658060 1703279 1689753 1661904 1682441 1756218 1767618 1763710 1703198 1647676
18363A647676k4886J9222p469K0959R0549K4063r799K7561j4022k8164j2768p7182
$$ 1647676 1622790 1642012 1634543 1655502 1746051 1770114 1760315 1787876 1773854 1745690 1732922 1655740
18351A655740m2444P78j347N6955N899m1812j1590j7140L7070j8752j5265j0835
$$ 1655740 1613296 1614074 1612727 1669682 1675581 1633769 1622179 1605039 1642109 1623357 1608092 1597257
18339A597257O6253O9521n1544k0553J2676m921L8518K6523J7102K2495m1712
$$ 1597257 1663510 1733031 1681487 1660934 1673610 1668689 1707207 1733730 1750832 1773327 1731615
18328A731615m4221l7432l5344j8209l28K7695N6256O2308L0654j0146K3744k6813
$$ 1731615 1687394 1649962 1614618 1596409 1596081 1623776 1680032 1742340 1772994 1762848 1786592 1759779
18316A759779n1161o0974j2598M429r931k6784J9569K9655p066n2289l8162l8058
$$ 1759779 1708618 1647644 1635046 1639475 1629544 1602760 1622329 1651984 1644918 1592629 1554467 1516409
18304A516409N918R44j1747J6453P622J6581K4004j3110m0058P625J3915m410
$$ 1516409 1522327 1523271 1511524 1527977 1535599 1552180 1576184 1563074 1523016 1530641 1544556 1540146
18292A540146P151n59M2315J0145k1223K7148N4265l5864k8501j9345J104k3625
$$ 1540146 1547297 1546738 1589053 1599198 1577975 1605123 1659388 1623524 1595023 1575678 1576782 1553157
18280A553157o067q186J2692j1676m8115m8479J0653O1421l3285r444J810r495
$$ 1553157 1547090 1538904 1551596 1539920 1491805 1443326 1453979 1515400 1482115 1472671 1474481 1464986
18268A464986o016K2046N975k1406J9179r232j5872J4704K8725J5078j2653K1937
$$ 1464986 1458970 1481016 1486991 1465585 1484764 1475532 1459660 1474364 1503089 1518167 1505514 1527451
18256A527451K2086o315L4626l6046m435m049l1226o1392N497P0630l777R122
$$ 1527451 1549537 1543222 1577848 1541802 1537367 1533318 1502092 1440700 1446197 1516827 1513050 1522172
18244A522172o335J5088M592L4565l4875M84J4145K928o6768n1712l6823K8672
$$ 1522172 1515837 1530925 1535517 1570082 1535207 1535691 1549836 1552764 1485996 1434284 1397461 1426133
18232A426133P057j5848O7462K4061o188k534l4388k6709o613J4898M7923n5696
$$ 1426133 1433190 1417342 1484804 1508865 1502677 1500143 1465755 1439046 1432433 1447331 1495254 1439558
18220A439558l75M1698o7406l8680n869R869L2092J3199l279J3221k7984j8912
$$ 1439558 1439183 1480881 1413475 1374795 1368926 1378795 1410887 1424086 1420807 1434028 1406044 1387132
18208A387132j8076j3926L2117P737m6865J8219m9010J0138J3907Q715R208M8400
$$ 1387132 1369056 1355130 1387247 1394984 1348119 1366338 1317328 1327466 1341373 1350088 1359296 1407696
18196A407696N364m536m4688m498M6363O8093J9780l795p186n7273n15k6135n7608
$$ 1407696 1413060 1408524 1363836 1359338 1405701 1473794 1493574 1489779 1482593 1425320 1424805 1398670 1341062
18183A341062K0576J02494O1303k3747k4378m0968j1138m2433r62R34l6556o8999
$$ 1341062 1361638 1464132 1525435 1501688 1477310 1436342 1425204 1382771 1381809 1382743 1346187 1277188
18171A277188l7862L3832K5073j9674K4109L115J9896L1238J0822p891J034M7496
$$ 1277188 1239326 1273158 1298231 1278557 1302666 1305781 1325677 1356915 1367737 1359846 1360880 1408376
18159A408376j1978K4157l3042k4527o6098O457P5925J0898j7570K7942j7392
$$ 1408376 1396398 1420555 1387513 1362986 1296888 1303345 1379270 1390168 1372598 1400540 1383148
18148A383148k5309l9762J4390J2213j8329K3932Q923m6088l7743K9411J9198
$$ 1383148 1357839 1318077 1332467 1344680 1326351 1350283 1359206 1313118 1275375 1304786 1323984
18137A323984J8769K1188O7105M5177k0502n6602n1664K9326K0909j294p382J8872
$$ 1323984 1342753 1363941 1431046 1476223 1455721 1399119 1347455 1376781 1397690 1396396 1389014 1407886
18125A407886p556j7764o1546l8110l0095O923K3459l8070K022L1062l9965q102
$$ 1407886 1400330 1382566 1321020 1282910 1252815 1259738 1283197 1245127 1247149 1278211 1238246 1230144
18113A230144L6806m167L3162J9052m116l1733L7424J4572p348M0916l5151O638
$$ 1230144 1266950 1262783 1295945 1314997 1310881 1279148 1316572 1331144 1323796 1364712 1329561 1336199
18101A336199O853m1912j7852N570l962j8579o9974l6458K8811j0076K6330P3359
$$ 1336199 1343052 1301140 1283288 1288858 1284896 1266317 1196343 1159885 1188696 1178620 1204950 1278309
18089A278309j2202k2578L8344m992J7572K1236l8499j9223l2112j2040k486R3098
$$ 1278309 1266107 1243529 1281873 1276881 1294453 1315689 1277190 1257967 1225855 1213815 1211329 1304427
18077A304427L6406n3689n346K8879j2753k1873p029j1032K0256l9202l3875k4997
$$ 1304427 1340833 1287144 1281798 1310677 1297924 1276051 1269022 1257990 1278246 1239044 1205169 1180172
18065A180172j5629K6492J5361K0650J275k6086L4766J151k8514P166n4789N524
$$ 1180172 1164543 1191035 1206396 1227046 1228321 1202235 1237001 1238152 1209638 1216804 1162015 1167539
18053A167539K2853K8614J5188K2654k4736l0981o3515J7525M1935L2853L2500
$$ 1167539 1190392 1219006 1234194 1256848 1232112 1201131 1137616 1155141 1197076 1229929 1262429
18042A262429l7024m9912J0053L4977m66J434j0340l4717k9429K0890L1935l4361
$$ 1262429 1225405 1175493 1185546 1220523 1220057 1221491 1211151 1176434 1147005 1167895 1199830 1165469
18030A165469o711M1120M6466k7115j8405m5478o272N6657M3220J1222l2153k0476
$$ 1165469 1158758 1199878 1246344 1219229 1200824 1155346 1149074 1205731 1248951 1260173 1228020 1207544
18018A207544n5427j5458J6392J9160n7374K4150Q9908O1534j02803q9197Q4192
$$ 1207544 1152117 1136659 1153051 1172211 1114837 1138987 1228895 1290429 1187626 1098429 1182621
18007A182621M7913R950l8707j8256l4777L66N8240o2593p5845J8340M8849K2415
$$ 1182621 1230534 1240484 1201777 1183521 1148744 1149110 1207350 1144757 1068912 1087252 1136101 1158516
17995A158516L5535R15o6324r048J2536K9462j5938J5278L839N7681j0935o9709
$$ 1158516 1194051 1194966 1128642 1119594 1132130 1161592 1145654 1160932 1164771 1222452 1211517 1141808
17983A141808l6189K849J6009l5818J5856K8761K7113L0620K5160j4844K0878
$$ 1141808 1105619 1108468 1124477 1088659 1104515 1133276 1160389 1191009 1216169 1201325 1222203
17972A222203l5190n180J5392n9450k6363L5348L451l0579L6803M112n2923k1928
$$ 1222203 1187013 1181833 1197225 1137775 1111412 1146760 1150211 1119632 1156435 1160547 1107624 1085696
17960A085696p0964l3591j3395K9498O5262j4930J9556P7621K7529j1261o6563
$$ 1085696 1014732 981141 967746 997244 1062506 1047576 1067132 1144753 1172282 1161021 1094458
17949A094458M596k1781m4936O293J671O7468O6451K2593l5106m2375p7279l7608
$$ 1094458 1099054 1077273 1032337 1038630 1040301 1107769 1174220 1196813 1161707 1119332 1042053 1004445
17937A004445o674l7439m705L3549L9064M1170m5009m3441j4251r210P1937K3460
$$ 1004445 997771 960332 955627 989176 1028240 1069410 1024401 980960 966709 957499 1029436 1052896
17925A052896j1986O075Q086J0309n566l3154J2740j2296j0959K8560l367j4116
$$ 1052896 1040910 1046985 1055071 1065380 1059814 1026660 1039400 1027104 1016145 1044705 1041338 1027222
17913A027222K859L0006n728J809O337L1755l4387l2133n161l7947J9397K0401
$$ 1027222 1030081 1060087 1054359 1056168 1062505 1094260 1059873 1027740 1022579 984632 1004029 1024430
17901A024430N9703M2275j2238j3976j4741Q615j6328k643O488M0624l7283n6718
$$ 1024430 1084133 1126408 1114170 1100194 1085453 1094068 1077740 1075097 1081585 1122209 1084926 1028208
17889A028208J812j176k93r638m0486J4734N0065K3193K973J0573q7171l5062
$$ 1028208 1030020 1028844 1028551 1018913 978427 993161 1043226 1066419 1069392 1079965 992794 957732
17877I57732l4160k411P9601J3464K3223j5232p647m3225Q763M2748r694p91R18
$$ 957732 923572 921161 1000762 1014226 1037449 1022217 1014570 971345 980108 1022856 1013162 1012371 1013289
17864A013289k0744L7782J3443K565n331L5890j0406j7768K659q412K3943q714
$$ 1013289 992545 1030327 1043770 1046335 1041004 1076894 1066488 1048720 1051379 1042967 1066910 1058196
17852A058196m207k6549k8899m9494k0133J3592J5809p9818j1306N6011L3496
$$ 1058196 1053989 1027440 998541 949047 928914 942506 958315 878497 867191 923202 956698
17841I56698r366J0537p707M0330k7976N423M1580k5037K1130R5683J5831j25240
$$ 956698 947332 957869 950162 990492 962516 967939 1009519 984482 1005612 1101295 1117126 991886
17829I91886q5955J0745N4516K818J8117L3539k4182j4622k0731J7568L9409n198
$$ 991886 905931 916676 971192 974010 992127 1025666 1001484 986862 966131 983699 1023108 1017910
17817A017910q978o796j9805p3721j0907J063j6779j1855O9144O4295K3243l121
$$ 1017910 1008932 1002136 982331 908610 897703 898766 881987 870132 939276 1003571 1026814 1023693
17805A023693m4822j7183J2198N859L3907K3752n5501k1099j7843K5836L4836
$$ 1023693 978871 961688 973886 979745 1013652 1037404 981903 960804 942961 968797 1003633
17794A003633n2047n7556L6598N899K9292j0914k1970K5363k7217m489k476k669
$$ 1003633 951586 894030 930628 936527 965819 954905 932935 958298 931081 926592 924116 921447
17782I21447N3926j119l4661J278J0163K6023n466m9754k5211K3477L0108L4969
$$ 921447 975373 974254 939593 940871 951034 977057 971591 921837 896626 920103 950211 985180
17770I85180l3042n965Q070K470M864o631l4070j173O5021q3584o6540K9775K1609
$$ 985180 952138 946173 954243 956713 961577 954946 920876 919703 984724 901140 834600 864375 885984
17757H85984L0518j7648J1730J060j9221j4037J7352J4573L2290k075m8775k1323
$$ 885984 916502 898854 910584 911644 892423 878386 895738 910311 942601 940526 891751 870428
17745H70428L3656q373k449k9224p647l2768n1899n95P346K3869j4728L3714K6575
$$ 870428 904084 895711 893262 864038 856391 823623 771724 771129 778475 802344 787616 821330 847905
17732H47905L2275j7025K7375K0579M5795K1006n7855j06234k2302K3589l8112
$$ 847905 880180 863155 890530 911109 956904 977910 920055 813821 791519 815108 776996
17721G76996p617K6230L7298l2216N443L1891M0347r127j6796J3123O88j0995
$$ 776996 769379 795609 832907 800691 806134 838025 878372 869245 852449 865572 866260 855265
17709H55265O119L6776K3034o5737O098p523J0509M457K8539M254m0366o767M55
$$ 855265 861384 898160 921194 855457 861555 854032 864541 868998 897537 901791 861425 854658 855113
17696H55113k6844O3215L9651j6859l731L0259m442K5138j2170n4086p2961k2773
$$ 855113 828269 891484 931135 914276 910545 940804 936362 961500 949330 895244 822283 799510
17684G99510J7480L2644J9283N3498J8075l6642J8881k4235q7526n4460k1352
$$ 799510 816990 849634 868917 922415 940490 903848 922729 898494 810968 756508 735156
17673G35156J4603J0089R572k0908j2418O4789p841m998o506l9100k0517M2675
$$ 735156 749759 759848 769420 748512 736094 800883 793042 788044 781538 742438 721921 764596
17661G64596L0768K0481M447n8021K5011j4396J8688J5313m0468J058P429L714
$$ 764596 795364 815845 820292 762271 787282 772886 791574 806887 766419 767477 774906 778620
17649G78620j5150k0636l6287j3024Q912K3921J385J3717l0252j3980L1575p480
$$ 778620 763470 742834 706547 693523 702435 726356 727741 741458 711206 697226 728801 721321
17637G21321M1122K0900K3549k6512R4046l169o7729m2984J7940M9743P041l7643
$$ 721321 762443 783343 806892 780380 874426 871257 803528 760544 778484 828227 835268 797625
17625G97625J407r454j4797J2604O126n675K8852k0633J4688P80m4162J61k5670
$$ 797625 799032 789578 774781 787385 793511 787836 816688 796055 810743 811523 767361 767522 741852
17612G41852j3714K0816O89n971L9897L2444L8041o175n4990j5703o9184p0817
$$ 741852 728138 748954 749643 743672 783569 816013 854054 847879 792889 777186 708002 637185
17600F37185n2284M2972k6196q988M3842K6205l0709J0347J4319L0512k7880l0851
$$ 637185 584901 627873 601677 592689 636531 662736 632027 642374 656693 687205 659325 628474
17588F28474K4162R369P447M9822J738j3639o96Q785M6209k1195j4295p0842o7336
$$ 628474 652636 662005 669452 719274 721012 707373 706677 715462 761671 740476 726181 655339 588003
17575E88003K6883L9209l600M210N4106m231O067k180p0807p113K2019p444j3428
$$ 588003 614886 654095 650495 654705 708811 704580 710647 708467 637660 630547 652566 645122 631694
17562F31694K630O0041L5680J6323m9517l976J5947j8271r7343k3786K2467J3247
$$ 631694 634324 694365 730045 746368 696851 692875 708822 690551 593208 569422 591889 605136
17550F05136n6202J9558O0261P8537J2162n5400N843O301N343l4682l3941L3794
$$ 605136 548934 568492 628753 707290 719452 664052 669895 676196 681539 646857 612916 646710
17538F46710M3169K7425R011J829k3101p4203Q51R065J0933j0611j4673l747k4387
$$ 646710 689879 717304 726315 728144 705043 630840 631691 640756 651689 641078 626405 622658 598271
17525E98271j126Q442M6849L5361L1627j2547p3473J6414O098l398j1189k8193
$$ 598271 597145 605587 652436 687797 719424 706877 633404 649818 655916 652518 641329 613136
17513F13136K4214J3935r046J9746j1431M0962j427L351K5995l3917l708P500
$$ 613136 637350 651285 642239 661985 650554 691516 690089 693440 719435 685518 681810 689310
17501F89310k1054k7467J8632l637l4560k3900J2509j0767J9176k2618k1989K1577
$$ 689310 668256 640789 659421 655784 621224 597324 609833 599066 618242 595624 573635 595212
17489E95212K6314k5749n7461J5349P8737L2850N4614p606m7851Q819L0959k9786
$$ 595212 621526 595777 538316 553665 632402 665252 719866 712260 664409 673228 704187 674401
17477F74401L7689M7758m7520m0641L469j8035L4607l1057P038K223l5978l3577
$$ 674401 712090 759848 712328 671687 675156 657121 691728 660671 667709 669932 633954 600377
17465F00377L11j8922M322K765j4247L6134M148k4250q586j4049K560l5842l6551
$$ 600377 600688 581766 586088 588853 574606 610740 614888 590638 582052 568003 570563 534721 498170
17452D98170N668M9494P2017P3605J9275l267r3683M5943N623o9332o4409j4332
$$ 498170 503838 553332 625349 698954 718229 714962 621279 667222 672845 603513 539104 524772
17440E24772L0799J6530L1444L7750M244k2816N6544K0603l3980l4822k088K8120
$$ 524772 555571 572101 603545 641295 645539 622723 679267 699870 665890 631068 628980 657100
17428F57100j2748n1358M046r502k0052j4569n128N3560J238R83N340r615J5554
$$ 657100 644352 592994 597040 587538 567486 552917 547789 601349 602587 603570 608910 599295 614849
17415F14849l3816j2778N2725k1598j8458N0414k742l8925R497j9645m2726K0076
$$ 614849 581033 568255 620980 599382 580924 631338 628596 589671 599168 579523 536797 556873
17403E56873k7254l4863k0590O7450Q6461K0943k4237o998J7196J4146n683k7687
$$ 556873 529619 494756 474166 541616 628077 649020 624783 617785 634981 649127 643444 615757
17391F15757k5604p29O4066k0205p069j1105N576L6097M109n1649l6069P328R393
$$ 615757 590153 589424 653490 633285 626216 615111 620687 656784 660893 609244 573175 580503 589896
17378E89896j2457m736q351J256K1791j1519k2813K9579Q5171k8225k8722j7348
$$ 589896 577439 572703 564352 565608 587399 575880 553067 582646 667817 639592 610870 593522
17366E93522o6840o344m2607L6435N8302N169K9052P9569K4378q9117n9860r572
$$ 593522 526682 520338 477731 514166 572468 577637 606689 686258 710636 621519 561659 552087
17354E52087m591J2377O738O849j0648K6297P194k4507J9536k0470l7884m9854
$$ 552087 547496 559873 566611 573460 562812 589109 596303 571796 591332 570862 532978 483124
17342D83124l720Q723m1768Q427N2953N4115o675p779M873o4162l0663K4074j9044
$$ 483124 479404 488127 446359 454786 507739 561854 555179 547400 552273 488111 457448 481522 462478
17329D62478O3188M0274P816k3481Q214J8943O425r9266L5399j5545J4258L6271
$$ 462478 525666 565940 573756 550275 558489 577432 583857 484591 519990 504445 518703 554974
17317E54974j0783j6326K1137L7278J0882j1252l8058k2635O054k596m282o8094
$$ 554974 544191 527865 549002 586280 597162 585910 547852 525217 531271 528675 524393 456299
17305D56299p5046N695M8970L1459j6013k5324m092L5458J631L5424K2156j3397
$$ 456299 381253 386948 435918 467377 451364 426040 421948 457406 459037 494461 516617 503220
17293E03220k2332J7620L5422o93l8733k1724O2751k3123k1103P008L2082N1980
$$ 503220 480888 498508 533930 533237 494504 472780 535531 512408 491305 498313 530395 582375
17281E82375k0079j6312j1679k9840k9307O5357N8738m2942o2928Q252n50J8352
$$ 582375 562296 545984 534305 504465 475158 540515 599253 556311 493383 501635 501085 519437
17269E19437m3848l2343o00J8401j9393K9331M8048L2700K6836K3507n9567k8228
$$ 519437 475589 443246 442646 461047 441654 470985 519033 551733 578569 602076 542509 514281
17257E14281P3938N0240k5951l4014l594J5793l5796m1379J9044j8217l5181k1507
$$ 514281 588219 638459 612508 578494 574900 590693 554897 513518 532562 514345 479164 457657
17245D57657m9506J3692K005l346L8414M3750J6932P750k1448j4399m386o2613
$$ 457657 408151 421843 423848 420502 458916 502666 519598 527348 505900 491501 487115 424502
17233D24502l2672L9296k655l277K1793K425O5702J8388m7429k7404O960J878
$$ 424502 391830 431126 428471 425194 446987 449412 515114 533502 486073 458669 465629 467507
17221D67507L2797M6297M0634j2228m9418q1846n8726q801O682N389M8515N1156
$$ 467507 500304 546601 587235 575007 525589 443743 385017 376216 382898 388287 436802 487958
17209D87958N2750Q801j7106l537p329k4133j8360L5440j0435q2281k5205K2483
$$ 487958 540708 549509 532403 528866 521537 497404 479044 514484 504049 421768 396563 419046
17197D19046J9881P959j3067l9635M9410K2888p602j3258J1725K1955k2757J7002
$$ 419046 438927 446886 433819 394184 443594 466482 458880 445622 457347 479302 456545 473547
17185D73547R105q51K0478O0270m1922o8244j3627L4187m7361k8388L037K6683
$$ 473547 482652 481801 502279 562549 520627 452383 438756 472943 425582 397194 400231 426914
17173D26914J4978J5951j2973r42K6991M4821J166n495K5378k1744j9617N66L9796
$$ 426914 441892 457843 444870 443928 470919 515740 516906 511411 536789 515045 495428 495994 535790
17160E35790J0280j9090k6976p2426l6111K1345K5503J4190L3497J6582o973m1151
$$ 535790 546070 526980 500004 427578 391467 412812 438315 452505 486002 502584 495611 454460
17148D54460o864J7227j0580K9854L3582m7436p3387l1239O6961O3989l147j548
$$ 454460 447596 464823 454243 484097 517679 470243 396856 365617 432578 496567 493420 491872
17136D91872J460k3271k670l3828m0230K7491R850R454J5906L4407l1969o340
$$ 491872 493332 470061 467391 433563 393333 420824 430674 440128 456034 490441 458472 452132
17124D52132M8277J8107o5966k8443J3032l2557J0428O3542K7885l5392k5833
$$ 452132 500409 518516 452550 424107 437139 404582 415010 478552 506437 471045 445212
17113D45212R277j7829n5436o746r691J5084K5082K427j7979O757J0363j4701
$$ 445212 454489 436660 381224 374478 364787 379871 404953 407380 389401 396158 406521 391820
17101C91820N663L5218J6683J0859J445L7563k8498j3554p193l0139k6257k7609
$$ 391820 397483 432701 449384 460243 461688 499251 470753 457199 450006 419867 393610 366001
17089C66001K9289J020k923m4835m4625J2621P9024J5207k8786J3291k2206l4985
$$ 366001 395290 396310 393387 348552 303927 316548 395572 410779 381993 395284 373078 338093
17077C38093M0776m7684k3932P108J4691J7418j9494J8349O7331o090l8034p173
$$ 338093 378869 331185 307253 314361 329052 346470 326976 345325 412656 406566 368532 361359
17065C61359j1647j0180K0238K2996j0575k5105Q42j4214P701j9634P3489K211
$$ 361359 349712 339532 359770 382766 372191 347086 347928 333714 341415 321781 395270 397481
17053C97481j954k0638K0531j5042j7295K0402K333j6729K6082K0978M8261j1507
$$ 397481 395527 374889 395420 380378 363083 383485 385818 369089 395171 416149 464410 452903
17041D52903n6103L4786r402n0753j8334J7030O7301o216L086K9736j9062j9169
$$ 452903 396800 431586 422184 371431 353097 370127 437428 431212 434298 464034 444972 425803
17029D25803j1865J3770n629j3958j4556n815o316M553M3562j0165J1560P0815
$$ 425803 413938 427708 422079 408121 393565 387750 381434 385987 429549 419384 430944 501759
17017E01759j5760l9287j2029l0798l880j9006o7041m7540J0456Q9167R6418n5862
$$ 501759 485999 446712 434683 403885 400005 380999 313958 266418 276874 366041 462459 406597
17005D06597j9387J9206k4832j1758J3679l7031N2174M1909l2902m4871K2120
$$ 406597 387210 406416 381584 369826 383505 346474 398648 440557 407655 362784 384904
16994C84904O102o3061J0788J817p558P6466L8411m3703n2082n305l505k4520
$$ 384904 391006 327945 338733 340550 332992 409458 447869 404166 352084 346779 343274 318754
16982C18754j2916P0667n252k6938K7367L2117J6473L347J5056k1820J3304j945
$$ 318754 305838 376505 371253 344315 371682 403799 420272 423619 438675 416855 430159 428214
16970D28214l5290l8848k7188K3444N0622K6877q481n6274k9952m4502o622n396
$$ 428214 392924 354076 326888 350332 400954 427831 419350 363076 333124 288622 282000 276604
16958B76604L3338J763R792O7036L362k1052J9090k973J3246k0937j4590l9590
$$ 276604 309942 311705 321497 388533 391895 370843 389933 386960 400206 379269 364679 325089
16946C25089O526M022L4980O629l1615M968j658m267p370l1261L9102K0582l0419
$$ 325089 331615 335637 370617 377246 345631 350599 348941 344674 337304 306043 345145 365727 335308
16933C35308k5288M065m618L2735m10M455J0834K2039L595K193J946m4626o8761
$$ 335308 310020 314085 309467 342202 341792 346247 357081 379120 382715 384908 386854 342228 273467
16920B73467j0550L7944K6914j1505k4616j1836K6369O0601K4654l1691k1859
$$ 273467 262917 300861 327775 316270 291654 279818 306187 366788 391442 359751 337892
16909C37892M6294K9627n0087l8878J3029J7814K5233l9766R28m170M5098K7021
$$ 337892 384186 413813 363726 324848 337877 355691 380924 341158 342086 337916 383014 410035
16897D10035q0519r5138R132o862n1326k9198P9823M2656L5230L1492k3272j4346
$$ 410035 329516 234378 243510 236648 185322 156124 235947 278603 313833 345325 322053 307707
16885C07707J2880k3765J8309j8743j0843J2432M1575O7333k3344l0833k0663
$$ 307707 320587 296822 315131 296388 285545 297977 339552 406885 383541 352708 332045
16874C32045j6570p8611K48N1449J7049L4919L8700o4142m4524M8114N1143M7459
$$ 332045 315475 236864 237112 288561 305610 340529 379229 315087 270563 318677 369820 417279
16862D17279j9945m9443l4236M6488q806m609N1692k0862m5812k5480k5286O246
$$ 417279 397334 347891 313655 360143 351337 346728 398420 377558 331746 306266 280980 287226
16850B87226P337M8198k3227n142Q658m7748o698R8879P2877k3515n5110o3341
$$ 287226 294563 342761 319534 314392 323050 275302 268604 367483 440360 416845 361735 298394
16838B98394m8821k4088K0415k691J387J0668k5558m3610K8958P6419j6437R121
$$ 298394 249573 225485 245900 243209 244596 255264 229706 186096 215054 291473 275036 284157
16826B84157K149l258o6538j274K4467O8444k5036M9828N3381J586k8954J6158
$$ 284157 286306 283048 216510 215236 239703 308147 283111 332939 386320 387906 358952 375110
16814C75110O7824k0809n9544n0462p3373m8892O8225P2041K1648J6464j9873
$$ 375110 442934 422125 362581 312119 238746 189854 258079 330120 351768 368232 348359
16803C48359n479k1989j7369J6439k4566K2127K4788L0816q5980l1388L5706n5513
$$ 348359 342880 320891 303522 319961 295395 317522 342310 373126 287146 255758 291464 235951
16791B35951l0485M8991K8128q709m9580L8332N0711J2034n3170J8387J9813J9466
$$ 235951 205466 254457 282585 273876 224296 262628 313339 325373 272203 290590 310403 329869
16779C29869k1796m284M558l863M8776R158n427n736o656n4020j2186m613K1181
$$ 329869 308073 303789 308347 304484 353260 362418 356991 351255 344599 290579 278393 273780 294961
16766B94961j720r765k5454K2165M9120J9045r935m9151k2169J2927P4416N9040
$$ 294961 293241 283476 258022 280187 329307 348352 338417 289266 267097 280024 354440 413480
16754D13480j0271k8214l7240n7856o4805m52O8060K5933M1556J3884L1527n860
$$ 413480 403209 374995 337755 279899 215094 214642 282702 308635 350191 364075 395602 389742
16742C89742k5438L041k3961j1205j4415O257K1797n5204L0924O3998j4655m2738
$$ 389742 364304 367345 343384 332179 317764 324021 345818 290614 321538 385536 370881 328143
16730C28143p7636j5162L3611J8308l3276l5162q514m688K8145J8050M333k0916
$$ 328143 250507 235345 268956 287264 253988 218826 210312 205624 233769 251819 256152 235236
16718B35236N396q643R925M713k7197K9600L4787J6257p528j1876k6465j3549
$$ 235236 240632 231989 241914 246627 219430 249030 283817 300074 292546 280670 254205 240656
16706B40656M0651K1355K6686J1373j1089m0514N899J6559l2894k0660p2066l2095
$$ 240656 281307 302662 329348 340721 329632 289118 295017 311576 278682 258022 185956 153861
16694A53861J7597L6972J6581J0147N2959m69m792j6269L8838J5587l0092j9724
$$ 153861 171458 208430 225011 235158 288117 287648 282856 266587 305425 321012 290920 271196
16682B71196J413p663m9676M689J7241j9515o85k2983n167L8760O2909p864p1034
$$ 271196 272609 264946 215270 219959 237200 217685 217000 194017 188850 227610 290519 282655 211621
16669B11621L2845J0164J628k852k0334K0267j8550R100L7863J2922R81j7209
$$ 211621 244466 254630 256258 253406 233072 253339 234789 243889 281752 294674 295655 278446
16657B78446J9415m492k1360L0816K8669J179p4043j6539J7617K2724K2776J2847
$$ 278446 297861 293369 272009 302825 331494 332673 258630 242091 259708 282432 305208 318055
16645C18055M993j6245k1555L9441p003n8879j9897j1030M0634l6699o1857L459
$$ 318055 323048 306803 285248 324689 317686 258807 238910 227880 268514 231815 169958 173417
16633A73417L4524L7546n5122M921K9838l6056k9404M5288J7667L3605R779O392
$$ 173417 207941 245487 190365 195286 225124 189068 159664 204952 222619 256224 266003 272395
16621B72395j577k4496m8079L8461k2366j3018J414J7334J5968n399k0109M9861
$$ 272395 270818 246322 198243 236704 214338 201320 202734 220068 236036 230637 210528 260389
16609B60389K4496j4025N9998J7280l0838r0691j7280l309m710K6881O1380l5695
$$ 260389 284885 270860 330858 348138 317300 226609 209329 206020 201310 228191 289571 253876
16597B53876k896Q713k3152M0501J9307k585p212l1965o9998l3500m6139K1227
$$ 253876 250980 259693 236541 277042 296349 293764 286552 254587 184589 151089 104950 126177
16585A26177J6143M0121L1821R457O132j566Q368J4976k6581m2193M6049n737
$$ 126177 142320 182441 214262 223719 229851 228285 236653 251629 225048 182855 228904 223167
16573B23167l593R318J7626J0624k3580k9465Q471j559N369p632J3235j260K5878
$$ 223167 219574 228892 246518 257142 233562 204097 212568 211009 216378 208746 221981 220721 246599
16560B46599J6351L9254n998N943M5244n9023o7162n8200n056L7055L3762l1906
$$ 246599 262950 302204 296206 302149 347393 288370 221208 163008 157952 195007 228769 196863
16548A96863N598m675j1591J5560L5154J5533J4957L1054O107j7499q44k6534
$$ 196863 202461 197786 186195 201755 236909 252442 267399 298453 304560 287061 286217 259683
16536B59683j8621j3789j6590n4879J2119O8304K9008K3596j7931K325j3239o322
$$ 259683 241062 227273 210683 155804 167923 236227 265235 288831 270900 273225 259986 253664
16524B53664l4383J3488L5124l341l4641k6444K286J2050m2895K1600J7117l4925
$$ 253664 219281 232769 267893 264552 229911 203467 205753 217803 174908 196508 213625 178700
16512A78700j09612j3723Q4685M5287J65n8257k241N8232L3048j6220m5930J8189
$$ 178700 69088 55365 140050 185337 185502 127245 125004 183236 216284 200064 154134 172323
16500A72323j6222J4212J6274k4751l5847L9419n375p38m7586M91M5990O780p024
$$ 172323 156101 170313 186587 161836 125989 165408 160033 159295 111709 112200 158190 164970 157946
16487A57946j4458k3426N5389L8519l3507J7471K6513J023j0908j0778L6974J281
$$ 157946 143488 120062 175451 213970 180463 197934 224447 225470 214562 203784 240758 242039
16475B42039k8880k4351M4216k3415m537P82j9081k4166L6480L6920J2250l8865
$$ 242039 213159 188808 233024 209609 205072 205854 186773 162607 199087 236007 248257 209392
16463B09392j5049j9541O0169J5269M9548k2385r5368n7528k7805k324P861J8628
$$ 209392 194343 174802 234971 250240 299788 277403 182035 124507 96702 94378 102239 120867
16451A20867O604J0355O1758M5559p235k2912n3761J0855N9688n2212m4699P5525
$$ 120867 127471 137826 199584 245143 237908 214996 161235 172090 231778 179566 134867 210392
16439B10392O344K9134m7894J853j6349L3572p281m41M7615L2353m3861J3808
$$ 210392 216736 245870 197976 199829 183480 217052 209771 209330 256945 289298 245437 259245
16427B59245n1034m4130k4729J7472P372R333j3709p9610k4240R5572K62m5459
$$ 259245 208211 164081 139352 156824 164196 173529 159820 80210 55970 151542 151804 106345
16415A06345l0549Q701R997P111M4010K9887l2583P857L3532L392m1566n7473
$$ 106345 75796 84497 94494 101605 145615 175502 142919 150776 184308 187700 146134 88661
16403H8661L9636O7820J1637j9864l2443P096M2515r912j8041k4000M5709O0853
$$ 88661 128297 196117 207754 187890 155447 162543 205058 195146 177105 153105 198814 259667
16391B59667k5651o7060l3503J6098O4970J5600k6924k4924n3541l0086N0680
$$ 259667 234016 166956 133453 149551 214521 230121 203197 178273 124732 94646 145326
16380A45326O4175j830p9456j7125J3487L4965K4521j5634m4277o7917J9692Q3484
$$ 145326 209501 207671 128215 111090 124577 159542 184063 168429 124152 56235 75927 159411
16368A59411K2978m6432M0121m663J3176m426j2389j814k4996j8561J4510m4214
$$ 159411 182389 135957 176078 171415 184591 180165 167776 165962 140966 122405 136915 92701
16356I2701P054P4471J9043l0026n1007J9872r576l219m4346j8703J2129K878
$$ 92701 99755 174226 193269 163243 112236 132108 122532 119313 74967 56264 68393 71271
16344G1271j6054p904M5083Q3432M2277K7388J2281n5625n5836j2166K4326J0927
$$ 71271 55217 47313 92396 175828 218105 245493 257774 202149 146313 134147 158473 169400
16332A69400n302r485o3334J5554J99L6100L2446q9610m47P7649J1737J3922m3378
$$ 169400 164098 154613 91279 106833 107032 143132 175578 85968 85521 163170 174907 188829 145451
16319A45451k8116J1951L5339J1798m099k241k1878m593k932L619K5111j9467
$$ 145451 117335 129286 164625 176423 172324 170083 148205 143612 140680 144299 169410 149943
16307A49943j1684j0309L4445K5588Q704j8546m1114M4500J7928l6892J8631j2566
$$ 149943 138259 127950 162395 187983 196687 178141 137027 181527 199455 162563 181194 168628
16295A68628j8757K9565k651J9323m5486j7277L3547Q8709l4678r1103p9942K8626
$$ 168628 149871 179436 176785 196108 150622 133345 166892 255601 220923 129820 49878 78504
16283G8504O9674M1062l1415K2341K2515r857j0330n144j9418p396M3353P002
$$ 78504 148178 189240 157825 180166 202681 192824 182494 177350 157932 150536 193889 200891
16271B00891n6714l967N6425M0018n4766j7662K4658k7548k7660M195Q801l2420
$$ 200891 144177 140210 196635 236653 181887 164225 188883 161335 133675 137870 146671 114251
16259A14251J9601m3951k8508o4148o85L1751P7362J8600L8112J0807m2391m7927
$$ 114251 133852 89901 61393 -2755 -3440 28311 105673 124273 162385 173192 130801 82874
16247H2874j8914N8205N5498q515l7822n1278O073J0943J5363J4534l7590l438
$$ 82874 63960 122165 177663 169148 131326 80048 86121 97064 112427 126961 89371 85933
16235H5933K5329N2664L8356l7405k2994R998k9221n469K5488L1076k2280r168
$$ 85933 111262 163926 202282 164877 141883 151881 122660 117191 142679 173755 151475 142307
16223A42307k1754j8659N1083K0978n2314n8616K0917M6321j4091k8998M1348
$$ 142307 120553 101894 152977 173955 121641 63025 83942 130263 116172 87174 128522
16212A28522K6897L9685k3623o8447j3747N0432j8153m4677K4077l410l1534m105
$$ 128522 155419 195104 171481 103034 89287 139719 121566 76889 100966 97556 66022 61917
16200F1917j5915J0812J8066q80J2450K7134K0405j5054K1222P5414r538l4800
$$ 61917 46002 56814 74880 74000 86450 113584 133989 118935 140157 215571 206033 171233
16188A71233R614K2742n5261M5533R292l6479m2225l5262j7710L9062J5835M6364
$$ 171233 180847 203589 148328 193861 203153 166674 124449 89187 71477 110539 126374 172738
16176A72738j8247L8720p889k005k6816k9774P4791j1531l9451j0466n0025k6588
$$ 172738 154491 193211 185322 183317 156501 126727 201518 189987 150536 140070 90045 63457
16164F3457Q951K8734M932K3669k6401j949k1757K0103Q550k1822k8501K3987
$$ 63457 72408 101142 106074 129743 103342 101393 79636 99739 108289 86467 57966 81953
16152H1953k0802j9244J7220L746K6095N0240k4705K0627O0114j9576l2700n3490
$$ 81953 61151 41907 59127 62873 88968 139208 114503 135130 195244 175668 142968 89478
16140H9478K5401N2335o88j2995J4117K4822q518l3976m1284K1247p821M008n3418
$$ 89478 114879 167214 166526 153531 167648 192470 183952 149976 108692 129939 122118 126126 72708
16127G2708K903O5036M7907j7836n7373l0488J1008l2876M061M3239J6630M029
$$ 72708 75611 140647 188554 170718 113345 82857 93865 60989 65050 108289 124919 128948
16115A28948R842j9426m640J144o67l0365o913N0902J9083o0120O921M6281o957
$$ 128948 138790 119364 114724 115868 115201 84836 77923 128825 147908 87788 94709 140990 134033
16102A34033K6215k0359p5050J5371K4999R27l1225p581j0766K6606L2917q19
$$ 134033 160248 139889 64839 80210 105209 106136 74911 67330 56564 83170 116087 115268
16090A15268j9341o2760j84K3468K522l860m306N1699L2495j4602m5490m7921
$$ 115268 95927 33167 32983 56451 58973 55113 50807 102506 135001 120399 74909 26988
16078B6988k3652m6076J905R3063P0440L2792l6705o1337l6397m976J7746M7791
$$ 26988 3336 -42740 -40835 52228 122668 155460 118755 57418 21021 16045 33791 81582
16066H1582j3599l1720M4805l137j1645N306K4810m0209j9419k8592L272J7849
$$ 81582 67983 36263 81068 77931 66286 71592 96402 56193 36774 8182 11454 29303
16054B9303N0109J5168Q104j3452o085j261o462K3786K3220o779k9009N829k1182
$$ 29303 79412 94580 102684 89232 83147 81886 75424 99210 122430 115651 86642 92471 71289
16041G1289j2760J8130J4001n045k3793k0132m1068M9967O4155l8448m0363O0082
$$ 71289 58529 76659 90660 85615 61822 41690 622 50589 114744 76296 35933 96015
16029I6015M322j3318J2170j0864J2752o242K0182m88L9906M338l2029k3575m758
$$ 96015 100337 87019 99189 88325 101077 94835 115017 114529 154435 158773 126744 103169 98411
16016I8411L494j2835j6924j7177q448J6263q19L724m4610q0289J9662N3767Q3498
$$ 98411 101905 89070 72146 54969 46521 62784 61965 65689 21079 -59210 -39548 14219 97717
16003I7717N1681k1105m4569L4455O8632j4949m6708p1586l4909Q934N8092J9039
$$ 97717 149398 128293 83724 118179 186811 171862 125154 53568 18659 27593 85685 104724
15991A04724K4870j194n107l0683n0288n4649K3396K4088N1153m913n696J4804
$$ 104724 129594 128400 123293 92610 42322 -12327 11069 35157 86310 81397 75701 90505
15979I0505N284O558k0630K0587k7431J9461K3411k063l038j8608n1524k5167
$$ 90505 95789 102347 81717 102304 74873 94334 117745 115682 112644 94036 42512 17345
15967A7345K0443n4593j5556k087N1785L2917K3112m6935j3977O6507m758m2086
$$ 17345 37788 -16805 -32361 -34448 17337 50254 73366 26431 12454 78961 74203 32117
15955C2117M461j1540L0013O1828N3867J1012r0309j1055K5940m2945j540Q716
$$ 32117 36578 25038 55051 116879 170746 181758 91449 80394 106334 63389 61849 70565
15943G0565l759l4817j7165K7791K5889o877L525N483m5179l0560K8883N8915
$$ 70565 66806 31989 14824 42615 68504 61627 65152 70635 25456 -5104 23779 82694
15931H2694O2908n847n2354p2851R350N7607M103L1604j5597m5040R211j4028
$$ 82694 145602 139755 87401 14550 23900 81507 85610 117214 101617 56577 65788 51760
15919E1760O227J3017m5703j6937R157N8214J3637l9502L990N760o7714L2322
$$ 51760 57987 71004 25301 8364 17521 75735 89372 49870 53860 59620 -8094 24228
15907B4228O1518J4767l5042L0235l0043j3847k8793L3134o4940l917k638L2951
$$ 24228 85746 100513 65471 95706 65663 51816 23023 56157 -8783 -12700 -15338 17613
15895A7613K449K801j0672m2538k8060j3608L4538J04621N7337m1047K2756j0714
$$ 17613 20062 22863 12191 -30347 -58407 -72015 -37477 67144 124481 83434 106190 95476
15883I5476j3435l7460l190k2130M4632P3664j3618l9086p342P0158M6610j8902
$$ 95476 82041 44581 41391 19261 63893 137557 123939 84853 77511 147669 194279 175377
15871A75377l3238n4090o8522L2927n723P6370K5325j2932l5115n0654j9474K4338
$$ 175377 142139 88049 19527 52454 46731 123101 148426 135494 100379 49725 30251 54589
15859E4589K2533N2483k5395l182k1034j2006l9506K2935O7125J4811r8679l4409
$$ 54589 77122 129605 104210 101028 79994 67988 28482 51417 118542 133353 34674 265
15847B65O500l165K1985J6481r424k7768M0828L4501k5166m1911O1846r461n5186
$$ 265 6765 3600 25585 42066 32642 4874 45702 80203 55037 13126 74972 65511 10325
15834A0325j380L9682p411o249l3314k6631J9270O83n031r812Q0420L9880K5657
$$ 10325 8945 48627 41216 34967 1653 -24978 -5708 -5025 -10056 -19868 60552 100432 126089
15821A26089j0829n7837J8185K1889n6746n6322j7072j2389r329M8949K8490L5153
$$ 126089 115260 57423 75608 97497 40751 -15571 -32643 -45032 -54361 -5412 23078 58231
15809E8231L2220J5576j2797m4594J5378L7239L4765l7056J3680L7888j5680j02573
$$ 58231 90451 106027 93230 48636 64014 101253 136018 98962 112642 150530 134850 32277
15797C2277j3068P8233N4089l6339l9569k107M952j5872k4100M111L669J3379
$$ 32277 19209 97442 151531 115192 75623 73516 78468 62596 38496 42607 46276 59655
15785E9655o673K2042L1600j4216K8093M2556J2011r2803l9564j4700K2622L911
$$ 59655 52982 75024 106624 92408 120501 163057 175068 82265 42701 28001 50623 54534
15773E4534o2357j2503M4531K1871k2321N308l6355J4053M8526n680l7132J5817
$$ 54534 -7823 -20326 24205 46076 23755 29063 -7292 6761 55287 49607 12475 28292
15761B8292M6958r061m3461J0002l2143j462N1363m041R141r024J4434P612M5050
$$ 28292 75250 66189 22728 32730 587 -875 50488 46447 55588 46564 60998 68610 113660
15748A13660N6733n1457p3663o748j8502m9147L7603M7218n8149k4312O3552M8152
$$ 113660 170393 118936 45273 38525 20023 -29124 8479 55697 -2452 -26764 36788 84940
15736H4940k6129p3497k2348k1066Q831Q721N8963K1743K531K4031j6262p7240
$$ 84940 58811 -14686 -37034 -58100 -49269 -40548 18415 40158 42689 66720 50458 -26782
15724b6782k2043n294N3895J9413J01822K3893k5692r4588j1289K1017m1098j7261
$$ -26782 -48825 -54119 -224 19189 121011 144904 119212 24624 13335 34352 -6746 -24007
15712b4007k6119L8479L2491P3925J6243j7435j5325m4298m2301L5181L4639N103
$$ -24007 -50126 -11647 20844 94769 111012 93577 78252 33954 -8347 26834 61473 66576
15700F6576j7962n5293K5472K8359J57L0701N7379J8206o1402k7877o099k496
$$ 66576 48614 -6679 18793 47152 47309 78010 135389 153595 92193 64316 58217 55721
15688E5721n558k5640j7086k0809J0439k3808m9210N96R8763N6178K9260r329
$$ 55721 50163 24523 7437 -13372 -2933 -26741 -75951 -75355 23408 79586 108846 99517
15676I9517j1320l3882k9328k769K566J5441K4964k2124j1970j1357k8444m563
$$ 99517 88197 54315 24987 22218 24784 40225 65189 43065 31095 19738 -8706 -13269
15664a3269N672j5949k023O0871L6304K7639p291j6057K0397K2742J707k7537
$$ -13269 -7597 -23546 -25569 35302 71606 99245 91954 75897 96294 119036 120743 93206
15652I3206m5518J297k2305Q726L4739n29p2512L9200N8157n3929m880O8715O4682
$$ 93206 47688 48985 26680 35406 70145 69616 -2896 36304 94461 40532 35652 104367 169049
15639A69049R547k0925m8560o450l7160l9581j9075M5l4663N526M6667O0393m3337
$$ 169049 178596 157671 109111 102661 65501 25920 6845 6890 -27773 -22247 24420 84813 41476
15626D1476J9946K3946n8626m0591J5231M1680K2451n224J6776P781l4332K1703
$$ 41476 61422 85368 26742 -13849 1382 43062 65513 60289 77065 84846 50514 72217
15614G2217J5914L1197m1495L2377L7287J425k3997k6314j7444K370n116O25k1814
$$ 72217 88131 119328 77833 110210 147497 148922 124925 98611 81167 83537 78421 79046 57232
15601E7232k3323K2295L0405N789J2430j5117l0431J8015Q049p368o8771m024
$$ 57232 33909 56204 86609 92398 104828 89711 59280 77295 85344 77976 9205 5181
15589E181N0746m270J1977K807j2884k330l6692l0863R199J580J6308N4314L5617
$$ 5181 55927 51657 63634 66441 53557 51227 14535 -16328 -7129 -5549 10759 65073 100690
15576A00690k0041m6531l597J9290m0745j6506M5729L1876j327j306J4753L0017
$$ 100690 80649 34118 30521 49811 9066 -7440 38289 70165 68838 67532 82285 112302
15564A12302l4326o4546l6885l207N930m211L6568L8143J1336k1075k6576j7816
$$ 112302 77976 13430 -23455 -26662 -20732 -24943 11625 49768 61104 40029 13453 -4363
15552d363m720k858j443J1040j4587J7426l6576K2590P5614O570m0901l494K8740
$$ -4363 -9083 -11941 -13384 -2344 -16931 495 -36081 -13491 62123 68693 27792 24298 53038
15539E3038K5746n5544p9663P633N5205L9580j7963l1266j7072k7512k2809K586
$$ 53038 78784 23240 -56423 -48790 6415 45995 28032 -3234 -20306 -47818 -70627 -68041
15527f8041L7061N0562K9480p46K6650J0244J7065k9777J2709l1012m1023o802
$$ -68041 -30980 19582 49062 48316 74966 85210 102275 72498 85207 54195 13172 6370
15515F370P081J4305n6979j9879M2846N7471j7500n6105k3182P4286k3997j7009
$$ 6370 13451 27756 -29223 -49102 -6256 51215 33715 -22390 -45572 28714 4717 -12292
15503a2292K3331R599K9016N1006J550l9062J9922j0646k0055J4011l5036m0104
$$ -12292 11039 20638 49654 100660 102210 63148 83070 72424 52369 66380 31344 -8760
15491h760l9284M9280M5937M5446j6303j6709Q368j2621k0892K1336R579K1237
$$ -8760 -48044 1236 47173 92619 76316 59607 67975 55354 34462 55798 65377 86614
15479H6614l1900m4347J3260L0135m554j5358P429k765n2143n2622m5135J9631
$$ 86614 54714 10367 23627 53762 49208 33850 41279 38514 -13629 -66251 -111386 -91755
15467i1755O4368L4146R846k5584o5301O407K1552l437J5687L5431l0642l2046
$$ -91755 -27387 6759 16605 -8979 -74280 -67873 -46321 -49758 -34071 1360 -29282 -61328
15455f1328n4237k498N4709N3393J5195L7106K1979L0964k4499l6392j0139L554
$$ -61328 -115565 -118063 -63354 -9961 5234 42340 64319 95283 70784 34392 24253 27807
15443B7807O939q546J3173J1027L781K4250j5591k9959l2393M3060k0356j540
$$ 27807 34746 26200 39373 50400 54181 78431 62840 32881 488 43548 23192 21652
15431B1652k841K3950O1330J5443k2637j3918k6341q1614n2948j8549J7616M2870
$$ 21652 18811 42761 104091 119534 96897 82979 56638 -24976 -77924 -96473 -78857 -35987
15419c5987J6121O8529p68K6499L3258k1570o9680j3022L4506R05R388P83n8269
$$ -35987 -19866 48663 47895 74394 107652 86082 16402 3380 37886 38791 48179 48962 -9307
15406i307j6736n924J076N272j4286J5653M3483k2901j9292k293L5468m772j365
$$ -9307 -26043 -31967 -30891 -25619 -39905 -24252 19231 -3670 -22962 -25255 10213 5441 4076
15393D076K3272K0705Q852R297n580l8521J389Q328Q978j5495o6769k035M7398
$$ 4076 27348 48053 56905 66202 60622 22101 23490 31818 40796 25301 -41468 -43503 3895
15380C895j3673o889K4631n53R636K5147k6561k7342K6265j2257k4267q253M696
$$ 3895 -9778 -16667 7964 7411 17047 42194 15633 -11709 14556 2299 -21968 -30221 -25525
15367b5525l0798P331M1075P725J0046M2100l2864j661j0200k3266J3233M6490
$$ -25525 -56323 -48992 -7917 -192 9854 51954 19090 17429 7229 -16037 -2804 43686
15355D3686K6826P10j6580l8386n4834j942n2751k6818O7346J6158N476L6900
$$ 43686 70512 71222 54642 16256 -38578 -40520 -93271 -120089 -52743 -36585 -31109 5791
15343E791O690l7149j657K1646J8423J3882J8242N536j4077j06923J5744K6353
$$ 5791 12481 -24668 -26325 -4679 13744 27626 45868 51404 37327 -69596 -53852 -27499
15331b7499K8145j4506k2955k7110K151k6860M2729L2447k9886j3524K0967r730
$$ -27499 646 -13860 -36815 -63925 -61774 -88634 -45905 -13458 -43344 -56868 -35901 -45631
15319d5631k1621R886K6680K2579O4123K2687q1173n9134K403L3710L5332r517
$$ -45631 -67252 -57366 -30686 -8107 56016 78703 -2470 -61604 -59201 -25491 9841 324
15307C24k1059j522k6200n569J2170J3183M7409K2070J0019l7650k3294o12L3187
$$ 324 -20735 -22257 -48457 -54026 -41856 -28673 18736 40806 50825 13175 -10119 -10731 22456
15294B2456L969k8399K8404N842j2029n4040K7994M0121r1520m962L4841L1295
$$ 22456 26425 -1974 26430 32272 20243 -33797 -5803 34318 -57202 -62164 -27323 3972
15282C972K2227N980J6369l5941k7140R975p58K433J7780Q642J2354l2441o8166
$$ 3972 26199 32179 48548 12607 -14533 -4558 -5316 -2883 14897 23539 35893 3452 -64714
15269f4714J5340m917K531J8084K5078K2327k6017L4382k028M2259k1068J666
$$ -64714 -49374 -54291 -51760 -33676 -8598 13729 -12288 22094 20066 62325 41257 42923
15257D2923l584o15n5241K2605M0648o2695m5069J3485M8302R50n6913k4086K1035
$$ 42923 39339 38724 -16517 6088 46736 -15959 -61028 -47543 759 1709 -55204 -79290 -58255
15244e8255L4042K1626K4704k39K1142L8166j4477k2108j01414o1298M3084O2276
$$ -58255 -24213 -2587 22117 21878 43020 81186 66709 44601 -56813 -118111 -75027 -12751
15232a2751N2427l2802j3541J19j0347J3172k1202L0624j5072j2934K1050K5465
$$ -12751 39676 6874 -6667 -6548 -16895 -3723 -24925 5699 -9373 -22307 -1257 24208
15220B4208n3352k3759M4796P4007L2653o7563m7359l2m0264n9452L9097k5037
$$ 24208 -29144 -52903 -8107 65900 98553 30990 -16369 -16401 -56665 -116117 -77020 -102057
15208a02057K0226K9448P294k9169k5115O010M3491M6984L9870o869m0572j6673
$$ -102057 -81831 -52383 -45089 -74258 -99373 -93363 -49872 -2888 36982 30113 -10459 -27132
15196b7132k2812R733Q636m1993J2371L4804L0810L4502R290K2367j3445m3342
$$ -27132 -49944 -40211 -31575 -73568 -61197 -26393 4417 38919 48209 70576 57131 13789
15184A3789j840j0938l7823j5149k7425j2898l1653q21N5718j981L3017l8682
$$ 13789 11949 1011 -36812 -51961 -79386 -92284 -123937 -124758 -69040 -71021 -38004 -76686
15172g6686q165m135j7079L4680L1915N6365J5515k0171J876J6742M534N489J1442
$$ -76686 -84851 -88986 -106065 -71385 -39470 16895 32410 12239 14115 30857 35391 40880 52322
15159E2322j2097l0262n7948J0011J6522l634L1851N7573M516L3203J3829l9301
$$ 52322 40225 9963 -47985 -37974 -21452 -25086 6765 64338 68854 102057 115886 76585
15147G6585j4097K5664j8856O303J0138p4310n4506L2223P2227K2984l5142j6132
$$ 76585 62488 88152 69296 75599 85737 11427 -43079 -10856 61371 84355 49213 33081
15135C3081K2029k1929L4764k6678m4605J1577P950o094j30M0069k6641p708J5279
$$ 33081 55110 33181 67945 41267 -3338 8239 16189 10095 9965 50034 23393 15685 30964
15122C0964L2119J4538n0924l6143l073J1112p62j707k4332k2017J5412K9174
$$ 30964 63083 77621 26697 -9446 -12519 -1407 -2169 -3876 -28208 -50225 -34813 -5639
15110e639m0825k3726j982J1585O194k4057l4281O0148K1218L7093k1741m1117
$$ -5639 -46464 -70190 -72172 -60587 -54393 -78450 -112731 -52583 -31365 5728 -16013 -57130
15098e7130p40k5111j0198j3366M5127M6657j0295j4946J1466l0285Q956J8984
$$ -57130 -57870 -82981 -93179 -106545 -61418 -14761 -25056 -40002 -28536 -58821 -49865 -30881
15086c0881J3999K9242J8819j3038j7699j5658q749l653k4945O383J1679N32l874
$$ -30881 -16882 12360 31179 18141 442 -15216 -23965 -27618 -52563 -46180 -34501 -33969 -37843
15073c7843j6374j5300j1042n42N1644j1535k7967K3803L3277j9042K4978j387
$$ -37843 -54217 -69517 -80559 -81101 -29457 -40992 -68959 -45156 -11879 -30921 -5943 -7330
15061g330l4313l2033j4714K7980K3809l3516o341J6797j3123k314J1644N0752
$$ -7330 -41643 -73676 -88390 -60410 -36601 -70117 -76458 -59661 -72784 -75098 -63454 -12702
15049a2702L6813J6781K7297n6423m4502l7343J6730N6006J4021L1511J1369k3899
$$ -12702 24111 40892 68189 11766 -32736 -70079 -53349 2657 16678 48189 59558 35659
15037C5659k3731L8049l5383j934l4974k0906Q070m8691l8404L8435J4638N396
$$ 35659 11928 49977 14594 12660 -22314 -43220 -35150 -83841 -122245 -83810 -69172 -63776
15025f3776P9369K2725m5608j8747n382K8552K7337L0344l8990m6746k2876l792
$$ -63776 15593 38318 -7290 -26037 -31419 -2867 24470 54814 15824 -30922 -53798 -57590
15013e7590M149j6526L254m0603M4902O3350J6573M411l7585k2107K3521q233
$$ -57590 -53441 -69967 -66713 -107316 -62414 936 17509 21920 -15665 -37772 -14251 -22484
15001b2484o698N0465N5996P617l7096p3233M226N836j7858k9206o992K5814k0567
$$ -22484 -29182 21283 77279 84896 47800 -25433 -21207 -15371 -33229 -62435 -69427 -43613 -64180
14988f4180N0331J8534j3249n2449j4388J5155L757l6743K089L3736o737O3031
$$ -64180 -13849 4685 -8564 -61013 -75401 -60246 -56489 -93232 -91143 -57407 -64144 -1113
14976a113L8072M864m243L688R943p8792m905K9388K0532R831n3809k8166j8493
$$ -1113 36959 41823 37580 41268 51211 -27581 -32486 -3098 17434 27265 -26544 -54710 -73203
14963g3203k9976O8431K919j1819q501j6465q071m749L618N0201l2338l1356L6141
$$ -73203 -103179 -34748 -31829 -43648 -52149 -68614 -76685 -81434 -77816 -27615 -59953 -91309 -55168
14950e5168K2328L7719K5779L9036K449m3433L5710j1289p2522Q84J4339l0480
$$ -55168 -32840 4879 30658 69694 72143 28710 64420 53131 -19391 -18507 -4168 -34648
14938c4648J4868N8037m7239p3987l0860M1278J8214J2099M0110j3729l0126j6085
$$ -34648 -19780 38257 -8982 -82969 -113829 -72551 -54337 -42238 -2128 -15857 -45983 -62068
14926f2068K4288M789P456N6627m2120J1780J0859l1256K6877n030n896n3010
$$ -62068 -37780 -32991 -25535 31092 -11028 752 11611 -19645 7232 2202 -3694 -56704
14914e6704m4640P414K0492l5473K2410J00042k5594m2401R429N0095j6078J629
$$ -56704 -101344 -93930 -73438 -108911 -86501 13541 -12053 -54454 -45025 5070 -11008 -9379
14902i379L9419L5580J7818k4216J0404K9772m1616J0372j6163l1621l9469n5331
$$ -9379 30040 65620 83438 59222 69626 99398 57782 68154 51991 20370 -19099 -74430
14890g4430m1410J5758j1362l5978K3956J785L3002N5174J7248J9627Q605j5344
$$ -74430 -115840 -100082 -111444 -147422 -123466 -121681 -88679 -33505 -16257 3370 11975 -3369
14878c369k5395K3025J6142j9380K5350j6471k8240K4259K7058K7162J2282m6241
$$ -3369 -28764 -5739 10403 -8977 16373 -98 -28338 -4079 22979 50141 62423 16182
14866A6182m640M2374o1725k7333K2804j3400j4105k0136K8842L6159o759P459
$$ 16182 11542 53916 -7809 -35142 -12338 -25738 -39843 -59979 -31137 5022 -1737 5722
14854E722K6990k5674k6680m011J13M2874J439q808j0868j9590j5156k7641K3657
$$ 5722 32712 7038 -19642 -23653 -23540 19334 20773 11965 1097 -18493 -33649 -61290 -37633
14841c7633O3230p513n4862j1967j2645k3878K2179L3711J9133l0828j9339L160
$$ -37633 25597 18084 -36778 -48745 -61390 -85268 -63089 -29378 -10245 -41073 -60412 -57252
14829e7252M7356K4274P979P1203N253j4258k0390j2498P41n1506k7167K583k3729
$$ -57252 -9896 14378 22357 93560 98813 84555 64165 51667 52408 902 -26265 -23682 -47411
14816d7411k8213J8926n5392o8718m1535P3940J08410P8727L3187n1640p6145
$$ -47411 -75624 -56698 -112090 -180808 -222343 -148403 -39993 38734 71921 20281 -55864
14805e5864N0877l3625m9687l8872j7031Q2441K4449P843K7966N5802M5178L2615
$$ -55864 -4987 -38612 -88299 -127171 -144202 -61761 -37312 -29469 -1503 54299 99477 132092
14793A32092P867J7533K6640N5319N2876J11271J34042K01139L06646L87779L23430
$$ 132092 139959 157492 184132 239451 292327 403598 537640 738779 1045425 1433204 1756634
14782A756634J59342K5641q4599k74718l16495l18102k53472j87543j78609j31267
$$ 1756634 1915976 1941617 1857018 1582300 1265805 947703 694231 506688 328079 196812
14772A96812j43783l1776m069L6361K4265O483M4190m039M333n8571m7154k4495
$$ 196812 53029 21253 17184 53545 77810 84293 128483 124444 128777 70206 23052 -1443
14760a443j7059J0520J6486n370k5888o8483L3578M9035J8264n5035n4541J2349
$$ -1443 -18502 -7982 8504 3134 -22754 -91237 -57659 -8624 9640 -45395 -99936 -87587
14748h7587j364J9888K328K0517Q0709K9949N3060j4677M2942L8751m1760j06975
$$ -87587 -88951 -69063 -66735 -46218 34491 64440 117500 102823 145765 184516 142756 35781
14736C5781k1052p062j5327j3280m119o000j7301K5344n554K1025j7537j9027
$$ 35781 14729 7667 -7660 -20940 -25059 -31059 -48360 -23016 -28570 -7545 -25082 -44109
14724d4109J3227p542j6891j3015l5224P7609K370n5803k1044J2770j801M0121
$$ -44109 -30882 -38424 -55315 -68330 -103554 -25945 -23575 -79378 -100422 -87652 -89453 -49332
14712d9332K9350p5382m1333J0577L0298L9519N8045o387l428l9677n4270n8696
$$ -49332 -19982 -95364 -136697 -126120 -95822 -56303 1742 -4645 -8073 -47750 -102020 -160716
14700a60716J5029M8642K4205k8496R873L2565j1168J8848K0875P457k2705j7559
$$ -160716 -145687 -97045 -72840 -101336 -91463 -58898 -70066 -51218 -30343 -22886 -45591 -63150
14688f3150M7084K8457j2215j0530P386k3924l8357M2331n8357M437K943M3246
$$ -63150 -16066 12391 176 -10354 -2968 -26892 -65249 -22918 -81275 -76838 -73895 -30649
14676c0649K6594j4358m859l2781J8375L1825L9574L247l4563k5525o6454k9948
$$ -30649 -4055 -18413 -23272 -56053 -37678 -5853 33721 36968 2405 -23120 -89574 -119522
14664a19522K0127o851n3565J4792R928k9881R733M9247O0500m01N072K1417J4865
$$ -119522 -99395 -106246 -159811 -145019 -135091 -164972 -155239 -105992 -45492 -45893 -40821 -19404 -4539
14651d539J0446l2029n369L025n9073P079M7595J7783N1318j7036l5263K7408
$$ -4539 5907 -26122 -31491 -28466 -87539 -80460 -32865 -15082 36236 19200 -16063 11345
14639A1345M5307j2293k8066L4681J2179j27470N313L042m964L7849K6747p3287
$$ 11345 56652 44359 16293 50974 63153 -64317 -59004 -55962 -60926 -23077 3670 -69617
14627f9617n1928N4980O2194k252o4204m059L1721J3777j712K0428J5183O310
$$ -69617 -121545 -66565 -4371 -6623 -70827 -74886 -43165 -29388 -31100 -10672 4511 10821
14615A0821l9967J3365O0400j0895l2236n598L681o9063P527j4400J9527J4983
$$ 10821 -29146 -15781 44619 33724 1488 -4110 -429 -69492 -61965 -76365 -56838 -41855
14603d1855J6406J4263j9790n1768m6980N5179J4531o69p603N8308K054l5361
$$ -41855 -25449 -11186 -30976 -82744 -129724 -74545 -60014 -60683 -68286 -9978 -7924 -43285
14591d3285m4399j8204R664j377Q127R369m103R877M0638M6671K8346O018K123
$$ -43285 -87684 -105888 -96224 -97601 -89474 -80105 -84208 -74331 -33693 12978 41324 47342 49465
14578D9465m9495k8572l8494k7657K1733L1983Q825n5263m5138j9036p502O4012
$$ 49465 -30 -28602 -67096 -94753 -73020 -41037 -32212 -87475 -132613 -151649 -159151 -95139
14566i5139K1728j3902r012K3641L7673K1913r51L604K5570m3825L2505k3263
$$ -95139 -73411 -87313 -96325 -72684 -35011 -13098 -14049 -10445 15125 -28700 3805 -19458
14554a9458L2278j647J5437j2932J8704L7637J9832l3374j6005n666J6790j2715
$$ -19458 12820 11173 26610 13678 32382 70019 89851 56477 40472 34806 51596 38881
14542C8881K4844k1241J9000L9894k6765k3452K999l7036j2021L2730J1496J2653
$$ 38881 63725 42484 61484 101378 74613 51161 54160 17124 5103 37833 49329 61982
14530F1982l0492l3676N3840k436m0467j4772J864K1547J2105o73p8499l7540
$$ 61982 31490 -2186 51654 49218 8751 -6021 -4157 17390 29495 28822 -49677 -87217
14518h7217p703k3293L1354j0576J778J6416M4102J9259Q550l121m1432m6796
$$ -87217 -94920 -118213 -86859 -97435 -95657 -79241 -35139 -15880 -7330 -10451 -51883 -98679
14506i8679N1457R2049L2987l7906M768n2806Q586L658l3966l6837L886k768l6658
$$ -98679 -47222 44827 77814 39908 44676 -8130 456 4114 -29852 -66689 -62803 -65571 -102229
14493a02229j4805M5163O3418K4830l406n3924M08j2205J7575M8118k673j38L9858
$$ -102229 -117034 -71871 -8453 16377 12971 -40953 -40545 -52750 -35175 12943 10270 10132 49990
14480D9990j0673o4965l1860j9861L6941K6179O3644L9870q658p080o894n4943
$$ 49990 39317 -25648 -57508 -77369 -40428 -14249 49395 89265 80607 73527 66633 11690
14468A1690o9571p4683l7551n2050n156K5383k1908m450K1779l8788J4878K7429
$$ 11690 -57881 -132564 -170115 -222165 -227321 -201938 -223846 -228296 -206517 -245305 -230427 -202998
14456b02998R918R869L2766N4023M7685L5867L8452O5639o4714q6159K8052K28
$$ -202998 -193080 -183211 -150445 -96422 -48737 -12870 25582 91221 26507 -59652 -31600 -31372
14444c1372L2776N3126M9752j4095j0841p7392p4613L6674M9379m896L457K5718
$$ -31372 1404 54530 104282 90187 79346 1954 -72659 -35985 13394 8498 11955 37673
14432C7673J7876l5615n8369j8809J0597j7671n529p168Q825j1695M8892j782
$$ 37673 55549 19934 -38435 -57244 -46647 -64318 -69847 -77015 -68190 -79885 -30993 -32775
14420c2775L2245j7503M4566j3522k3685j4721m2823n860R330L6854j4386m9471
$$ -32775 -530 -18033 26533 13011 -10674 -25395 -68218 -74078 -64748 -27894 -42280 -91751
14408i1751r6890n4555k5428k2837N7033L9692L1990k7564n6901j9419M2034K0973
$$ -91751 -188641 -243196 -268624 -291461 -234428 -194736 -162746 -190310 -247211 -266630 -224596 -203623
14396b03623j5078J5389J4060M9073K4326N5341n36o1751j7223J6065J7587K7513
$$ -203623 -218701 -203312 -189252 -140179 -115853 -60512 -61048 -122799 -140022 -123957 -106370 -78857
14384g8857j3609O367k1129k0894k6592N9698M3888O173l6045K3323J6450n178
$$ -78857 -92466 -86099 -107228 -128122 -154714 -95016 -51128 -44955 -81000 -57677 -41227 -46405
14372d6405J5425j7994k9465j8624O866M8797K3377n0639p730N185K1448n1850
$$ -46405 -30980 -48974 -78439 -97063 -90197 -41400 -18023 -68662 -76392 -71207 -49759 -101609
14360a01609M078L181L1418O7819J5655j0928M74K421J9091p490K0266m7400J4714
$$ -101609 -97531 -94350 -62932 4887 20542 9614 10088 12509 31600 24110 44376 -3024 11690
14347A1690J360K6317K4550K3347k4555J4579M6554l2224R367k6783k876J9941
$$ 11690 13050 39367 63917 87264 62709 77288 123842 91618 100985 74202 71326 91267
14335I1267L3693M1814K2195L5742K4282l2680l0902K8048N1466n2184m0084J04901
$$ 91267 124960 166774 188969 224711 248993 216313 185411 213459 264925 212741 172657 277558
14323B77558Q3171J3199O073J5037n3231j7396L3052J42027Q8591P1400J18033
$$ 277558 360729 373928 380001 395038 341807 324411 357463 499490 588081 659481 777514
14312G77514J05421O5665L1247O9929J34343J51097J47212J44623J66387J10504
$$ 777514 882935 948600 979847 1049776 1184119 1335216 1482428 1627051 1793438 1903942
14302A903942J07199K35015K69176L04040K91482L54159N91475P36645R20774
$$ 1903942 2011141 2246156 2515332 2819372 3110854 3465013 4056488 4793133 5713907
14293E713907J083631J376201J766878K337284L099781M163606N481074P528074
$$ 5713907 6797538 8173739 9940617 12277901 15377682 19541288 25022362 32550436
14285C2550436J1060827J7189899K7609785M4381831O6803799Q5225620Q1337539
$$ 32550436 43611263 60801162 88410947 132792778 199596577 284822197 366159736
14278C66159736M9748848R572197k7761865o4475268q5886002p7848269n4333158
$$ 366159736 415908584 425480781 397718916 333243648 247357646 169509377 115176219
14271A15176219l3782371k0677754j3186716q975210o703967n374031m587979
$$ 115176219 81393848 60716094 47529378 38554168 31850201 26476170 21888191
14264B1888191l862361l036192k276702j711280j275448j018613q73684p36350
$$ 21888191 18025830 14989638 12712936 11001656 9726208 8707595 7833911 7097561
14256G097561o25682o11957n55687m36358l93167m07265k64978k71725k26205
$$ 7097561 6471879 5859922 5304235 4867877 4474710 4067445 3802467 3530742 3304537
14247C304537j93633k06539j16095q8950j11337j65259p1838r7526p3515o9978
$$ 3304537 3110904 2904365 2788270 2699320 2587983 2422724 2350886 2253360 2179845 2109867
14237B109867r2518r0491p1321j08909j30408p3209o7826j03117n0987m3255l1904
$$ 2109867 2017349 1926858 1855537 1746628 1616220 1543011 1475185 1372068 1321081 1277826 1245922
14226A245922k8733P968J6697m8251j03743l0748O717n9538n3611r0418m6308
$$ 1245922 1217189 1225157 1241854 1193603 1089860 1059112 1065829 1006291 952680 862262 815954
14215H15954j211Q977R117n5525l8128L2464K675j9420K1177l1843m3107l8151
$$ 815954 814743 823720 832837 777312 739184 771648 774323 754903 776080 744237 701130 662979
14203F62979o726J3071J2504j4606J1598M1125K4541J6140N8395L3940k0835m8462
$$ 662979 656253 669324 681828 667222 678820 719945 744486 760626 819021 852961 832126 783664
14191G83664m0384O239l8689p8648k3629m0697k3686k4871J5991O570m352m7221
$$ 783664 743280 749519 710830 632182 608553 567856 544170 519299 535290 541860 537508 490287
14179D90287q1503n0271M8053K6670m7986n2483J1703M1901J5063j5448l7365
$$ 490287 408784 358513 406566 433236 385250 332767 344470 386371 401434 385986 348621
14168C48621N0664M1675j286j0883l4177p5539l2932J7001N9764P5502O5082J7529
$$ 348621 399285 440960 439674 428791 394614 319075 286143 303144 362908 438410 503492 521021
14156E21021L2838M2604O4869O6067M2126J7210l4255l4463m1644K2226K4928
$$ 521021 553859 596463 661332 727399 769525 786735 752480 718017 676373 698599 723527
14145G23527j3994m2853k777Q214m240l1053n1819j03936p6154o1632l4962J118
$$ 723527 709533 666680 663903 672117 667877 636824 585005 481069 404915 343283 308321 309439
14133C09439q856J8864j4981p4263j1151O285m4483K1823r127m1260j6865N495
$$ 309439 300583 319447 304466 230203 219052 225337 180854 202677 193550 152290 135425 140920
14121A40920J15048L717r738j5538j7448k4547j4309J3989m1200K179M0729O875
$$ 140920 255968 259685 249947 234409 216961 192414 178105 192094 150894 153073 193802 200677
14109B00677k8594L1154k4567p842M4031K8215j2740j0791N2624K3587l0791r429
$$ 200677 172083 203237 178670 170828 214859 243074 230334 219543 272167 295754 264963 255534
14097B55534L1951O7996N648J3415k9969j4793o5639j06049q5147k7730l2876
$$ 255534 287485 355481 361129 374544 344575 329782 264143 158094 72947 45217 12341
14086A2341r473J683J3183M4107n0367q518L0817Q370M6285Q8557l4903o9154
$$ 12341 2868 4551 17734 61841 11474 2956 33773 42143 88428 176985 142082 72928
14074G2928k9520M5733J368j8552L5448L2870k850k9000l031O5520M5163k0714
$$ 72928 43408 89141 90509 71957 107405 140275 137425 108425 105394 170914 216077 195363
14062A95363l8520m685L9330j4819j4590m8078Q257j6405k3882l7714n2176l6446
$$ 195363 156843 152158 191488 176669 162079 114001 122258 105853 81971 44257 -7919 -44365
14050d4365L4899M5342O461l3260M5651o341p704k681K1705K4730j031J1331J9319
$$ -44365 -9466 35876 42337 9077 54728 48387 40683 38002 59707 84437 83406 94737 114056
14037A14056M1911K4526N421k9548n2027L771M1005K7671N6525j878k4324J6212
$$ 114056 155967 180493 185914 156366 104339 108110 149115 176786 233311 231433 207109 223321
14025B23321n3775J0337L8047q816l3195j9219m0291k0343k8689m1234m723K9626
$$ 223321 169546 179883 217930 209114 175919 156700 116409 96066 67377 26143 21420 51046
14013E1046O6666R861m6984l1211L2326k2797k1213l3715L3122l1818j769l3446
$$ 51046 117712 127573 80589 49378 81704 58907 37694 3979 37101 5283 3514 -29932
14001b9932K2292J20641N2440O70j8370R429N359J2884j0329k6835n2425N993
$$ -29932 -7640 113001 165441 166111 147741 157170 162529 175413 165084 138249 85824 91817
13989I1817k5858m7342j8829J8341o668K4768j0535L5551N9226m0387j8175P549
$$ 91817 65959 18617 -212 18129 11461 36229 25694 61245 120471 80084 61909 69458
13977F9458J7408J864l4946j2940J0493l2585L8452j7094j9667J2171R818j4833
$$ 69458 86866 88730 53784 40844 51337 18752 57204 40110 20443 32614 42432 27599
13965B7599k6994j5255N8270L9440r408j7707J0338J7185J8181m375p189K2423
$$ 27599 605 -14650 43620 83060 73652 55945 66283 83468 101649 97274 90085 112508
13953A12508j9721l4575m2558j6148N1301l037o6271N948L3120O762N126M3386
$$ 112508 92787 58212 15654 -494 50807 47770 -18501 -12553 20567 27329 32455 75841
13941G5841K4053k5528l1620l89O6307O447o579m8279l1718L4187K1904n4972
$$ 75841 99894 74366 42746 42357 108664 115111 108532 60253 28535 62722 84626 29654
13929B9654k113J5092m672p5432n6048J4499R2657j499j6169q89L0534l3755j3939
$$ 29654 27541 42633 37961 -37471 -93519 -79020 13637 12138 -4031 -4920 25614 -8141 -22080
13916b2080L7230J2387K5391Q3933l5335j8085l714m0869J4799n4901J1641j8092
$$ -22080 15150 27537 52928 136861 101526 83441 79727 38858 53657 -1244 10397 -7695
13904g695j7066M9153K2458j3454k5699k140J1855P056Q758L4379J8547M3038
$$ -7695 -24761 24392 46850 33396 7697 5557 17412 24468 33226 67605 86152 129190
13892A29190J1656L737n673p995l5966n02j9050k7451L5262J7922o5885l7285
$$ 129190 140846 144583 138910 130915 94949 94447 75397 47946 83208 101130 35245 -2040
13880b040L7632k118n0192J1152J2849K123o920L0551J3458j1778L304l713k3953
$$ -2040 35592 33474 -16718 -5566 7283 9406 2486 33037 46495 34717 38021 34308 10355
13867A0355n415q352n214L9835K0897P587j6983J0406j1975J4447M3804j3523
$$ 10355 4940 -3412 -8626 31209 52106 59693 42710 53116 41141 55588 99392 85869
13855H5869n3430p3660m120J0159J747L0495k0162N4570P0009L5928r572m0771
$$ 85869 32439 -41221 -45341 -35182 -33435 -2940 -23102 31468 101477 137405 127833 87062
13843H7062J2726r043l7398o2341K6061L1703q195k6590j6887J3805J7938K3349
$$ 87062 99788 90745 53347 -8994 17067 48770 40575 13985 -2902 10903 28841 52190
13831E2190n698j868j0347M9350j4330j2054J0388k373k4454j5605O3656N5355
$$ 52190 46492 44624 34277 83627 69297 57243 67631 65258 40804 25199 88855 144210
13819A44210n1508l5365j1208m8386j1523l330L6037r652j8363j8659o9110l8864
$$ 144210 92702 57337 46129 -2257 -13780 -17110 18927 9275 -9088 -27747 -96857 -135721
13807a35721P1195Q5596L9693m2595P234M184m0831O651j2684j0873Q2666m122
$$ -135721 -64526 21070 60763 18168 25402 29586 -11245 -4594 -17278 -28151 54515 50393
13795E0393P052J83j5227l199k2015K9487k1883j2991P726l4962J3358K4143M0838
$$ 50393 57445 57628 42401 39202 17187 46674 24791 11800 19526 -15436 -2078 22065 62903
13782F2903l3975K7532L7865K3899N1892j2214K6137P6608K5166P2458J40245
$$ 62903 28928 56460 94325 118224 170116 157902 184039 260647 285813 358271 498516
13771D98516J73669L63280M38895L49292K02201O2160j07313k58375l81363l33734
$$ 498516 672185 1035465 1474360 1823652 2025853 2088013 1980700 1722325 1340962 1007228
13761A007228k67420k05137p3623m9428r1034p8467m5117n3880j5134J5415N966
$$ 1007228 739808 534671 461048 411620 320586 242119 197002 143122 127988 143403 149369
13750A49369l9162n6358P020N4535o2367o0363j2665r689L5577P5578o0877l9634
$$ 149369 110207 53849 60869 115404 53037 -7326 -19991 -29680 5897 81475 20598 -19036
13738a9036N3025J9895j2821j8800j6947J4353P511P331n018K0440K8727K008
$$ -19036 33989 53884 41063 22263 5316 19669 27180 34511 29493 49933 78660 80668
13726H0668k7034m2745l2630r41k6993o327L7235R002k5501J6494N4023n0958
$$ 80668 53634 10889 -21741 -22682 -49675 -56002 -18767 -9765 -35266 -18772 35251 -15707
13714a5707J0162N4860K6946O429N8280l2135r6639n1728k1105k4591N3161J4734
$$ -15707 -5545 49315 76261 82690 140970 108835 12196 -39532 -60637 -85228 -32067 -17333
13702a7333k5426K1659N0189J2054L1223l886L5502K9911n0111m7370m8384k6831
$$ -17333 -42759 -21100 29089 41143 72366 68480 103982 133893 83782 36412 -11972 -38803
13690c8803L0574J4404L5789K7890l3244m8500n7147K0542L6345L793l5365J8950
$$ -38803 -8229 6175 41964 69854 36610 -11890 -69037 -48495 -12150 -8357 -43722 -24772
13678b4772J5164K6698K3163k5283k7272k0941L048N592J5615R090O4267K1731
$$ -24772 -9608 17090 40253 14970 -12302 -33243 -30195 -24603 -8988 102 64369 86100
13666H6100m5167l0643J8784n707k4221M3401K537o701k3995J8830N685m8248
$$ 86100 40933 10290 29074 23367 -854 42547 45084 38383 14388 33218 38903 -9345
13654i345k8637M9797m1575M3979J3872m3671K1140M3925L6615j3059j013j5751
$$ -9345 -37982 11815 -29760 14219 28091 -15580 5560 49485 86100 73041 72028 56277
13642E6277m4635l9125j6059M482J6127O3855K4263J7468J5130l0478m5733P597
$$ 56277 11642 -27483 -43542 -39060 -22933 40922 65185 82653 97783 67305 21572 29169
13630B9169J9245M518J1988K6001k3753m9366J651k1046L1747L336m8144l0020
$$ 29169 48414 52932 64920 90921 67168 17802 19453 -1593 30154 33490 -14654 -44674
13618d4674N5942k650l1920k1918O664J1972K8958K2475K2559k0406n6124j3609
$$ -44674 11268 8618 -23302 -45220 -38556 -26584 2374 24849 47408 27002 -29122 -42731
13606d2731j752M9125m39L9599K4377l4678N1963l1752j0040L7482k6687j8045
$$ -42731 -44483 4642 4203 43802 68179 33501 85464 53712 43672 81154 54467 36422
13594C6422K9602L1826n4203r3098O245Q798l5545J2187N6385L5930m0068n6960
$$ 36422 66024 97850 43647 -49451 -43206 -34408 -69953 -57766 -1381 34549 -5519 -62479
13582f2479L3224K7974r751L0384L6399n6027l2395J6917j815o119O228m555K38
$$ -62479 -29255 -1281 -11032 19352 55751 -276 -32671 -15754 -17569 -23688 -17460 -22015 -21777
13569b1777J8825n5487m3712J3451l490O5960K5171k3723k6071J1138j4968j0046
$$ -21777 -2952 -58439 -102151 -88700 -92190 -26230 -1059 -24782 -50853 -39715 -54683 -64729
13557f4729n889Q087J8903J3708J5096L1022R440L8977j0628o629o091P387j4013
$$ -64729 -70618 -62531 -43628 -29920 -14824 16198 25638 64615 53987 47358 41267 48654 34641
13544C4641j3391k1564j39J7045k8290K2147k4602o212n2969J4994M2350J7453
$$ 34641 21250 -314 -453 16592 -11698 10449 -14153 -20365 -73334 -58340 -15990 1463
13532A463k6572j9070j8152j0656M3585L6154j9819Q981M9962P060L6727k4924
$$ 1463 -25109 -44179 -62331 -72987 -29402 6752 -13067 -4086 45876 52936 89663 64739
13520F4739m8939j504Q288j8461j8191k4274L411K5854M0651n859n0353L1994
$$ 64739 15800 14296 22584 4123 -14068 -38342 -34931 -9077 31574 25715 -24638 7356
13508G356N9253M7773J825O348j5213p4103L3194L599m5736o623k6685L3288j8755
$$ 7356 66609 114382 116207 122555 107342 33239 66433 70032 24296 17673 -9012 24276 5521
13495E521j2007j7550n6941p098R249p719N3867R1135L5351o046l0039J0649N939
$$ 5521 -6486 -24036 -80977 -88075 -78826 -86545 -32678 58457 93808 87762 57723 68372 74311
13482G4311j689j4222J3591J3194J6830j2383j4812J4188j7595n7386l8102j1309
$$ 74311 72622 58400 71991 85185 102015 89632 74820 89008 71413 14027 -24075 -35384
13470c5384q952j4865K2893j07k0610j4890k868K8392J3276K0896j7145j2621
$$ -35384 -44336 -59201 -36308 -36415 -57025 -71915 -74783 -46391 -33115 -12219 -29364 -41985
13458d1985N8751K1315j3887Q91j9290J2383j4072j4732M9117Q587l702R613O222
$$ -41985 16766 38081 24194 25085 5795 18178 4106 -10626 38491 47078 43376 52989 59211
13445E9211J2898J6176k3832n3829j0102q951k3926J9993K0249M7996J9498k0797
$$ 59211 72109 88285 64453 10624 522 -8429 -32355 -12362 7887 55883 75381 54584
13433E4584l8883K3099N6240k4270k4489K0071L5410L7069k0199m0975K878n2017
$$ 54584 15701 38800 95040 70770 46281 66352 101762 138831 118632 77657 80535 28518
13421B8518j8649k8353J4246J3226j4828R110j7738k4179m6219J6002J30J5094
$$ 28518 9869 -18484 -4238 8988 -5840 3270 -14468 -38647 -84866 -68864 -68734 -53640
13409e3640k1641L3296Q364k7471J77n342M6988k0778k9953K4581K712K294J7176
$$ -53640 -75281 -41985 -33621 -61092 -60915 -66257 -19269 -40047 -70000 -45419 -42707 -40413 -23237
13396b3237M3859Q437n355j7079n651J2175O301o440k281L9874l4141l817K5331
$$ -23237 20622 29059 23704 6625 974 13149 19450 13010 10729 50603 16462 12645 37976
13383C7976n0631K9024j4283n4207R720J3160l1426J4798J4103K4047N8804M0804
$$ 37976 -12655 16369 2086 -52121 -42401 -29241 -60667 -45869 -31766 -7719 51085 91889
13371I1889K9946K957n9367p7803l2637m123k3240j3238J0993K0852R7892K3192
$$ 91889 121835 124792 65425 -12378 -45015 -49138 -72378 -85616 -74623 -53771 44121 67313
13359F7313r115L055l3884j719q919o0935j8891j374P640L599k2417K8223Q6674
$$ 67313 58198 61253 27369 25650 16731 -44204 -63095 -64469 -56829 -53230 -75647 -47424 39250
13346C9250l3125l7924o009r442M0364L91M3190M9407l5468j3853k643m9402j171
$$ 39250 6125 -31799 -37808 -47250 -6886 -6495 36695 86102 50634 36781 34138 -15264 -16435
13333a6435J9747m6395p160K0415Q828j0723O798O112L5858j3324L5547L4158
$$ -16435 3312 -43083 -50243 -29828 -21000 -31723 -24925 -18813 17045 3721 39268 73426
13321G3426l554r455j249l6144Q158M225j5655Q656K7819k3541o7811o773L9528
$$ 73426 69872 60417 59168 23024 31182 35407 19752 28408 56227 32686 -35125 -41898 -2370
13308b370Q996J688Q282j4403j4100k9401m0563N5771Q276J917P991N3849p409
$$ -2370 6626 8314 16596 2193 -11907 -41308 -81871 -26100 -17824 -15907 -7916 45933 38524
13295C8524l3571J8220r480m0856K5278K173N2963K8282j8656k5804L915j8019
$$ 38524 4953 23173 13693 -27163 -1885 288 53251 81533 62877 37073 40988 22969
13283B2969j477J6636l7049j4234R858l5778N33J3617M4152J6645r1J2953l429
$$ 22969 21492 38128 1079 -13155 -3297 -39075 -38542 -24925 19227 35872 35781 48734 45305
13270D5305k6877o3093R301N3847j1911K84L1754J1427J1859K6831L4289q793
$$ 45305 18428 -44665 -35364 18483 6572 6856 38610 50037 61896 88727 123016 114223
13258A14223j0665M5670Q0167k1828m6771m0042j02156l1985L0505M6355K1801
$$ 114223 103558 149228 229395 207567 160796 120754 18598 -13387 17118 63473 85274
13247H5274M2154L5360k664r446j9441j5169R499J4838j0653l4514m8772J764
$$ 85274 127428 162788 160124 150678 131237 116068 125567 140405 129752 95238 46466 48230
13235D8230k8857k4890k4454K9880L9276M4628p624k2215k9235k0101J6571j560
$$ 48230 19373 -5517 -29971 -91 39185 83813 76189 53974 24739 4638 21209 19649
13223A9649l8605j2267K6181J6527k3164n585J7546L041K1491K1498r3470m8215
$$ 19649 -18956 -31223 -5042 11485 -11679 -17264 282 3323 24814 46312 -47158 -95373
13211i5373N328P5632L7012j1211l2627j2851O6293P6723J02074P5944J6000j07575
$$ -95373 -90045 -14413 22599 11388 -21239 -34090 32203 108926 211000 286944 302944 195369
13199A95369k0883M519m6642j7725l7970l9886o6852j3570N9362M4611J10283
$$ 195369 174486 179005 132363 114638 76668 36782 -30070 -43640 15722 60333 170616
13188A70616Q1995K4579j4555l7577o6600k6284k3348m0335k1392L2197M6667
$$ 170616 252611 277190 262635 225058 158458 132174 108826 68491 47099 79296 125963
13177A25963N1408o325M6476k1469p7965o5726J5806j9504k2630L5089L6525K7298
$$ 125963 177371 171046 217522 196053 118088 52362 68168 48664 26034 61123 97648 124946
13165A24946L2661k895k461l9997p5124k3109l4572J1532R9832k1067q6002k2675
$$ 124946 157607 154712 152251 112254 37130 14021 -20551 -9019 90813 69746 -16256 -38931
13153c8931Q093M1919j1403k2790q77K8054O6504M5105K3935j6079l4796n9877
$$ -38931 -30838 11081 -322 -23112 -23989 4065 70569 115674 139609 123530 88734 28857
13141B8857k3155K9860r561k7144j4526j9052P4584Q0832K9242O855q234m6553
$$ 28857 5702 35562 26001 -1143 -15669 -34721 39863 120695 149937 156792 148558 102005
13129A02005l9105m0179k4100K2586j783l8017r082j233P077K2920L5616l581
$$ 102005 62900 22721 -1379 21207 19424 -18593 -27675 -28908 -21831 1089 36705 33124
13117C3124k9108j6374l7367j8052m7963L1979N4199j7168r21K7762Q997K826
$$ 33124 4016 -12358 -49725 -67777 -115740 -83761 -29562 -46730 -47651 -19889 -10892 -8066
13105h066j3135M760n5648K8823K9233r45J6317l6994j2159Q940L9372j7307O4698
$$ -8066 -21201 -16441 -72089 -43266 -14033 -14978 1339 -35655 -47814 -38874 498 -16809 47889
13092D7889k3222m7857k7560j7598M0442J9581j4357j419J2920j2878m0855K2142
$$ 47889 24667 -23190 -50750 -68348 -27906 -8325 -22682 -24101 -11181 -24059 -64914 -42772
13080d2772K8910j0595O860j652l0340j551L1347N2488m8386m1841N8104k4255
$$ -42772 -13862 -24457 -17597 -19249 -49589 -51140 -19793 32695 -15691 -57532 572 -23683
13068b3683O496M2991N4301j7116p9589l1056N4353M1643l2153m6184j9205K2845
$$ -23683 -17187 25804 80105 62989 -16600 -47656 6697 48340 16187 -29997 -49202 -26357
13056b6357j8334p1447j9114P4684N519J550O7562L2042k545k5083m2983k3702
$$ -26357 -44691 -116138 -135252 -60568 -55049 -53499 14063 46105 43560 18477 -24506 -48208
13044d8208k5950J7881N4250K222k0070q284l2113L1792k1836j5007j6371L4714
$$ -48208 -74158 -56277 -2027 195 -19875 -28159 -60272 -28480 -50316 -65323 -81694 -46980
13032d6980O4649J1226p2409N348k5053q766J9290K161K6923j9304m7816m7511
$$ -46980 17669 28895 -43514 -38166 -63219 -71985 -52695 -50534 -23611 -42915 -90731 -138242
13020a38242K041R668J7303J3147r758M3527M0766J2970K6670Q396Q064l1093
$$ -138242 -136201 -126533 -109230 -96083 -105841 -62314 -21548 -8578 18092 26488 34552 3459
13008C459l9030L3730k5747j5211N24K1844L8363K3354Q474l5710k4750o261j0837
$$ 3459 -35571 -1841 -27588 -42799 -42275 -20431 17932 41286 49760 14050 -10700 -16961 -27798
12995b7798l6085k5848j8236J6427P6763r624m3062m7362j9045O9919Q8735J1396
$$ -27798 -63883 -89731 -107967 -91540 -14777 -24401 -67463 -114825 -133870 -63951 24784 36180
12983C6180N117L330j3953J8552o365K1357k7916n3823j4189K7938L9970n8061
$$ 36180 41297 44627 30674 49226 42861 64218 36302 -17521 -31710 -3772 36198 -21863
12971b1863k8545K1357M0224q344k4360J0622L4842J9503j3641j5726l1277j2039
$$ -21863 -50408 -29051 11173 2829 -21531 -10909 23933 43436 29795 14069 -17208 -29247
12959b9247L5997L2252j9531L1401L1023j2762l8194J3332K6618m4079m1982L6741
$$ -29247 6750 39002 19471 50872 81895 69133 30939 44271 70889 26810 -15172 21569
12947B1569N369o5317j8840l49Q107M8951o2052l2998J8009M5555K6778j3877
$$ 21569 26938 -38379 -57219 -57568 -49461 -510 -62562 -95560 -77551 -31996 -5218 -19095
12935a9095l2029m3808K5770J4653j6044j3325N8940J1510j07J4040J9049l223
$$ -19095 -51124 -94932 -69162 -54509 -70553 -83878 -24938 -13428 -13535 505 19554 16331
12923A6331m8961K8807k0307M0561m252P607q704m416J7071j8801k009n450m880
$$ 16331 -32630 -3823 -24130 16431 12179 19786 11082 6666 23737 4936 2927 -2523 -7403
12910g403k0276m2503r873K5298K7569M5028l3472l6706m2124k7793J9023q588
$$ -7403 -27679 -70182 -80055 -54757 -27188 17840 -15632 -52338 -94462 -122255 -103232 -111820
12898a11820k2204L5450Q5884J7637k333p369Q660K310J5110J2100k8712m1348
$$ -111820 -134024 -98574 -12690 4947 2614 -4755 3905 6215 21325 33425 4713 -36635
12886c6635J6003L8106j5016j2601K8593M0596M6155P0214J20383J03635J1131
$$ -36635 -20632 17474 2458 -10143 18450 59046 105201 175415 295798 399433 410564
12875D10564k4172p3046m0896n0189r7704n1662l7044k0721l6440k0998O4940
$$ 410564 386392 313346 272450 222261 124557 72895 35851 15130 -21310 -42308 22632
12864B2632L0550O1759l9402j3639l3277J8765j2808l7857j6626p385L9999J5356
$$ 22632 53182 114941 75539 61900 28623 47388 34580 -3277 -19903 -27288 12711 28067
12852B8067o1659r7032q20K0936M0537j286J2416M0498J3699k5003R30M0517J8725
$$ 28067 -33592 -130624 -131444 -110508 -69971 -71257 -58841 -18343 -4644 -29647 -28717 11800 30525
12839C0525N508j4329j7958K0506N758p8281m5284Q969M3973m711J1189J9079
$$ 30525 36033 21704 3746 24252 30010 -48271 -93555 -84586 -40613 -45324 -34135 -15056
12827a5056j818j7593k0086m5322K6117L7097J2027k0861j3431K2271N7967k1009
$$ -15056 -16874 -34467 -54553 -99875 -73758 -36661 -24634 -45495 -58926 -36655 21312 303
12815C03l5508n5197m4560L930j9967L566Q8255L3825m1093l4355q405l9636k1071
$$ 303 -35205 -90402 -134962 -131032 -150999 -147433 -59178 -25353 -66446 -100801 -109206 -148842 -169913
12802a69913P1045M0066j5213R131M3653J664l4126J2406K7957n7571q823L1156
$$ -169913 -98868 -58802 -74015 -64884 -21231 -19567 -53693 -41287 -13330 -70901 -79724 -48568
12790d8568k8100q631J7801J3353J0340j218m289K7346J1830J1589M380m5277
$$ -48568 -76668 -85299 -67498 -54145 -43805 -45023 -49312 -21966 -10136 1453 5833 -39444
12778c9444l8245R042L4925J6534R00r635J524l4527N808J4652P485J2668J7750
$$ -39444 -77689 -68647 -33722 -17188 -16288 -25923 -24399 -58926 -53118 -38466 -30981 -18313 -563
12765e63o4491l265K4814M0463k2374j7073M3377J5010K3890M3167j9160N794
$$ -563 -65054 -68319 -43505 -3042 -25416 -42489 888 15898 39788 82955 63795 69589
12753F9589k9638M144K2972m0853k2364J8505p186J976l4113l9731K1643O3570
$$ 69589 39951 44095 67067 26214 3850 22355 15169 17145 -16968 -56699 -35056 28514
12741B8514k5783q1536J9497K749m96l9422K851k974K0064K5134k0104M7964j027
$$ 28514 2731 -78805 -59308 -56559 -57055 -96477 -93626 -96600 -76536 -51402 -71506 -23542 -24569
12728b4569J6167J1132N096l9720J728k2096L2907l0899j1701J6737K9693m5145
$$ -24569 -8402 2730 7826 -31894 -30166 -52262 -19355 -50254 -61955 -45218 -15525 -60670
12716f0670m4745R226k6641N3030L7067l786k9180J7868k072J630J6770p1603
$$ -60670 -105415 -96189 -122830 -69800 -32733 -36519 -65699 -47831 -49903 -48273 -31503 -103106
12704a03106k8897J9514L8374K1913j0550j2922J2845j1950k1640j3943J7637
$$ -103106 -132003 -112489 -74115 -52202 -62752 -75674 -62829 -74779 -96419 -110362 -92725
12693i2725p400J2653p04l0352k4473J9963K5044N69K4215R523n0954n0008j6720
$$ -92725 -100125 -87472 -88176 -118528 -143001 -123038 -97994 -97425 -73210 -63687 -114641 -164649 -181369
12680a81369K4877K6464K5257k04J499l631N1731O2632m2965p6358l5399L3301
$$ -181369 -156492 -130028 -104771 -104975 -103476 -107107 -55376 7256 -35709 -112067 -147466 -114165
12668a14165M0988r619j505K0305M90j9268j6253N9661O0802n8436m2279J6583
$$ -114165 -73177 -82796 -84301 -63996 -63506 -82774 -99027 -39366 21436 -37000 -79279 -62696
12656f2696j7293L5364K387L0802j4733l2425J1300k2943j4940L6846M7804J3715
$$ -62696 -79989 -44625 -42238 -11436 -26169 -58594 -47294 -70237 -85177 -48331 -527 13188
12644A3188m64p1740k6172m934M8395O4700o2525p4027l1091M2055L4599M7282
$$ 13188 12724 -59016 -85188 -90122 -41727 22973 -39552 -113579 -144670 -102615 -68016 -20734
12632b0734j7794m3829O3704k8734j2816J7131K3090J0992k78k4307J7723k5652
$$ -20734 -38528 -82357 -18653 -47387 -60203 -43072 -19982 -8990 -9268 -33575 -15852 -41504
12620d1504q9820M6180Q302J1272J3076j5372r65l5889k2919L292m8655k6060
$$ -41504 -131324 -85144 -76842 -65570 -52494 -67866 -68831 -104720 -127639 -124347 -173002 -199062
12608a99062P1116P7549J2887n3400m6666M5142M854k1157m5135J4463R2343m685
$$ -199062 -127946 -50397 -37510 -90910 -137576 -92434 -87580 -108737 -153872 -139409 -47066 -51751
12596e1751Q687n0839n7808K551N7325R660j6662L5015R481m4563n107K873J4160
$$ -51751 -43064 -93903 -151711 -149160 -91835 -82175 -98837 -63822 -54341 -98904 -104011 -101138 -86978
12583h6978L4745n6440l168l4179n5864M4580L9780l0084L6050K8388J4715j6951
$$ -86978 -52233 -108673 -111841 -146020 -201884 -157304 -117524 -147608 -111558 -83170 -68455 -85406
12571h5406M355M3957J681m7530q3445r629L7109M4485M784l7380Q167L6747J4868
$$ -85406 -81051 -37094 -35413 -82943 -166388 -176017 -138908 -94423 -89639 -127019 -118852 -82105 -67237
12558f7237j7342m7880k684K3015N0222l8487q1999m5258L7416K8548J7853J9408
$$ -67237 -84579 -132459 -135143 -112128 -61906 -100393 -182392 -227650 -190234 -161686 -143833 -124425
12546a24425K513j3303K1242j4222j6177L3181M4056O2991k4607r2246k3831J8900
$$ -124425 -121912 -135215 -113973 -128195 -144372 -111191 -67135 -4144 -28751 -120997 -144828 -125928
12534a25928K2489l550k3641l8880l3153q804K1334M765k0689J0882J0174l3308
$$ -125928 -103439 -106989 -130630 -169510 -202663 -211467 -190133 -185368 -206057 -195175 -185001 -218309
12522b18309N414L8755L2M6103q832L0648N0775k6591k2746k1231o3468L1230
$$ -218309 -212895 -174140 -174108 -128005 -136837 -106189 -55414 -82005 -104751 -125982 -189450 -158220
12510a58220O9055L043o752r129j8124P15L8515N498n1668k5263n732L0825K1529
$$ -158220 -89165 -86122 -92874 -102003 -120127 -119412 -80897 -75399 -127067 -152330 -158062 -127237 -105708
12497a05708j2032R638K9390R286j1033j7137N2045j0334N879J5686L467m6192
$$ -105708 -117740 -108102 -78712 -69426 -80459 -97596 -45551 -55885 -50006 -34320 -30853 -77045
12485g7045l1738J1216J2072p865R05K0146o060j7587J6031P12o200j1970K1121
$$ -77045 -108783 -97567 -85495 -93360 -92455 -72309 -78369 -95956 -79925 -79213 -85413 -97383 -76262
12472g6262M194j3690N915n6921k0152j6890L4315J7343J1424J1566O7952J6259
$$ -76262 -72068 -85758 -79843 -136764 -156916 -173806 -139491 -122148 -110724 -99158 -31206 -14947
12460a4947q114J8546K0434j8475n281k8817j3466k2195K9111K1460M2738J1888
$$ -14947 -23061 -4515 15919 -2556 -7837 -36654 -50120 -72315 -43204 -21744 20994 32882
12448C2882M438k1718n4005o4713m3230m672o642J8506K239k3685O3594K4885
$$ 32882 37320 15602 -38403 -103116 -146346 -151018 -157660 -139154 -136915 -160600 -97006 -72121
12436g2121j1835j1701M7334L0911L2631J20237p498n4544R892O6374L9488l8969
$$ -72121 -83956 -95657 -48323 -17412 15219 135456 127958 73414 83306 149680 189168 150199
12424A50199n3870m3782l1706O323K9498n0312p5559p1420j1747M9187J3212K2882
$$ 150199 96329 52547 20841 27164 56662 6350 -69209 -140629 -152376 -103189 -89977 -67095
12412f7095l2761O68K3105L2041r285n1257r427K4205j297k3425N1001k9745q958
$$ -67095 -99856 -99188 -76083 -44042 -53327 -104584 -114011 -89806 -91103 -114528 -63527 -93272 -102230
12399a02230k216k6273L1783K6907R4669O2175o237N2415O421k4826p470P318
$$ -102230 -104446 -130719 -98936 -72029 22640 84815 78578 130993 137414 112588 105118 112436
12387A12436o58j780L2281l5091n6632k0976l5129l9737l7075k2945K8116K7915
$$ 112436 111778 109998 142279 107188 50556 29580 -5549 -45286 -82361 -105306 -77190 -49275
12375d9275m5641j9365K703K0399P0360L5971l3673l7122l512J9823L5555l2274
$$ -49275 -94916 -114281 -111578 -91179 -20819 15152 -18521 -55643 -59155 -39332 -3777 -36051
12363c6051p9901M512J4118q721O0506P1391Q5121R9975J1013Q9270J27149Q1325
$$ -36051 -115952 -111440 -97322 -106043 -45537 25854 110975 210950 221963 311233 438382 519707
12351E19707J24j33774j17734k4164l9164o5085q0305M5859L954o8135n1610l1471
$$ 519707 519831 386057 268323 244159 204995 139910 59605 105464 109418 41283 -10327 -41798
12339d1798j9335o0706p5393K7637Q8431Q804K6238K1319k4052m0207l8200p209
$$ -41798 -61133 -121839 -197232 -169595 -81164 -72360 -46122 -24803 -48855 -89062 -127262 -134471
12327a34471j085J4606P0890q777l7384k1186J2316O8544J1106J9275N8465K2292
$$ -134471 -135556 -120950 -50060 -58837 -96221 -117407 -105091 -36547 -25441 -6166 52299 74591
12315G4591n2233k8151j7578n4659j2899k50j6114k4964l6487l6590n0013Q000
$$ 74591 22358 -5793 -23371 -78030 -90929 -91179 -107293 -132257 -168744 -205334 -255347 -247347
12303b47347J5957j003L5105j3847k1143N7995M580n7763k2895N3401P7774L714
$$ -247347 -231390 -232393 -197288 -211135 -232278 -174283 -169703 -227466 -250361 -196960 -119186 -115472
12291a15472k4525k3081q845O344J1443j1003n8339p1732L2678M1179K9582L1027
$$ -115472 -139997 -163078 -171923 -165579 -154136 -165139 -223478 -295210 -262532 -221353 -191771 -160744
12279a60744M8259K5638j3841o8183m5500j8180K3827O4895k9166j6797m3806
$$ -160744 -112485 -86847 -100688 -168871 -214371 -232551 -208724 -143829 -172995 -189792 -233598
12268b33598N4284L6691r540M8366k0499m6952o1562L91L2745k700j187K7954
$$ -233598 -179314 -142623 -152163 -103797 -124296 -171248 -232810 -232419 -199674 -202374 -203561 -175607
12256a75607k4870k3284m3074L819O3941K7028R303K5870o4142J344o973K4242
$$ -175607 -200477 -223761 -266835 -263016 -199075 -172047 -162744 -136874 -201016 -199672 -206645 -182403
12244a82403k1509j8165K5908K1826K8208J5551k2712N919j4178l5825k5427K7303
$$ -182403 -203912 -222077 -196169 -174343 -146135 -130584 -153296 -147377 -161555 -197380 -222807 -195504
12232a95504N0178k4110j0566l4735j0446l6651k7873M0566p726Q546K5232j1956
$$ -195504 -145326 -169436 -180002 -214737 -225183 -261834 -289707 -249141 -256867 -248321 -223089 -235045
12220b35045K8685J1068O686j6423l3608J2245l5996m2739N8179M7687L7081k6199
$$ -235045 -206360 -195292 -188606 -205029 -238637 -226392 -262388 -305127 -246948 -199261 -162180 -188379
12208a88379m6646J8296k5247l7075k1038R529k0435m2459l5054K2315j9086K4500
$$ -188379 -235025 -216729 -241976 -279051 -300089 -290560 -310995 -353454 -388508 -366193 -385279 -360779
12196c60779K7141j5332L1583K69N0397L5695q7164l0686J8877N1972k2414r572
$$ -360779 -333638 -348970 -317387 -317118 -266721 -231026 -318190 -348876 -329999 -278027 -300441 -310013
12184c10013m607K8423L0322J6539l5897j2219K13L9060K8557K5368J8662k5983
$$ -310013 -314620 -286197 -255875 -239336 -275233 -287452 -287239 -248179 -219622 -194254 -175592 -201575
12172b01575j0162k9269M8091J3366m3163l5100J4513o337j2314J0733R000l036
$$ -201575 -211737 -241006 -192915 -179549 -222712 -257812 -243299 -249636 -261950 -251217 -242217 -245253
12160b45253j2465k1114K8584j2625p5459j9285L9676N836J6125q6991L191M0036
$$ -245253 -257718 -278832 -250248 -262873 -338332 -357617 -317941 -312105 -295980 -382971 -379780 -339744
12148c39744J2013l0436r255k8056o964n446K984L1507N0323L1490n1434M6309
$$ -339744 -327731 -358167 -367422 -395478 -402442 -407888 -404904 -373397 -323074 -291584 -343018 -296709
12136b96709N9023n836o5229j234k9961K3514K5883o5786k0761J6353Q082J5574
$$ -296709 -237686 -243522 -308751 -309985 -339946 -316432 -290549 -356335 -377096 -360743 -352661 -337087
12124c37087J2526o426K8564j8964m3944o855l7885M504O57q3990J6383L6358
$$ -337087 -324561 -330987 -302423 -321387 -365331 -372186 -410071 -405567 -404910 -488900 -472517 -436159
12112d36159N0254k5367j4024R967P265Q697r6910o4629j8105m459N3018j1654
$$ -436159 -385905 -411272 -425296 -415329 -408064 -399367 -496277 -560906 -579011 -583470 -530452 -542106
12100e42106j141J16291J11476K2351J6872M7873k4977l2786k8317l4382N873
$$ -542106 -543247 -426956 -315480 -293129 -276257 -228384 -253361 -286147 -314464 -348846 -342973
12089c42973m169J1241k0089n2309m1572K8569J5051K7690l8292q1570m7085K4553
$$ -342973 -347142 -335901 -355990 -408299 -449871 -421302 -406251 -378561 -416853 -498423 -545508 -520955
12077e20955k2403j2419M8776n08K43N98p487R524K3294k4158l3737K9233O1368
$$ -520955 -543358 -555777 -507001 -507509 -507266 -506668 -514155 -504631 -481337 -505495 -539232 -509999 -448631
12064d48631m53k9321j8524J9551L7802M8116j63m9499O566K1481l280N093K8726
$$ -448631 -449084 -478405 -496929 -477378 -439576 -391460 -391623 -441122 -434556 -413075 -416355 -411262 -382536
12051c82536L9575K0805K5657J1004k234J6123J3933p833K2130k7265M674K6477
$$ -382536 -342961 -322156 -296499 -285495 -287729 -271606 -257673 -265506 -243376 -270641 -265967 -239490
12039b39490J06029N3843l0344M4612O4186K4273N5970J33376J41434J74919J72062
$$ -239490 -133461 -79618 -109962 -65350 -1164 23109 79079 212455 353889 528808 700870
12028G00870K50782L30171M36043O47735Q62146J175764J699592K477822L458985
$$ 700870 951652 1281823 1717866 2365601 3227747 4403511 6103103 8580925 12039910
12019A2039910M575814N339737N028128L326426J442724k20072k239359m192157
$$ 12039910 16615724 21955461 26983589 30310015 31752739 31532667 29293308 25101151
12011B5101151n008207m462539l430266k580390j846381j258219q92782o99124
$$ 25101151 20092944 15630405 12200139 9619749 7773368 6515149 5622367 4923243
12003D923243n16932l15971k38110k14679j57718o2486M4579J66865K36476L82662
$$ 4923243 4406311 4090340 3852230 3637551 3479833 3417347 3461926 3628791 3865267 4247929
11993D247929N86075Q09674J131201J675117K445863L488153M907919O471592
$$ 4247929 4834004 5643678 6774879 8449996 10895859 14384012 19291931 25763523
11985B5763523P738262P961219P426899P250869O802126L744206j476041m712701
$$ 25763523 33501785 41463004 48889903 56140772 62942898 66687104 65211063 60498362
11977F0498362n817979p792781r651308q954806o778959m743366l312463k275037
$$ 60498362 54680383 46887602 37236294 28281488 21502529 16759163 13446700 11171663
11969A1171663j660180j282062r17591o45144m36847l02595k55796j72722o1573
$$ 11171663 9511483 8229421 7311830 6666686 6229839 5927244 5671448 5498726 5437153
11960E437153P6136J91847L39108M98812O81880R46718J419295K094296K975134
$$ 5437153 5513289 5705136 6044244 6543056 7224936 8171654 9590949 11685245 14660379
11951A4660379M201091N769673P161110P652453O649624N084955M197401L505104
$$ 14660379 18861470 24631143 31792253 39444706 46094330 51179285 55376686 58881790
11943E8881790K041480J82170j611371k884354l858023n529094p270385p653248
$$ 58881790 60923270 61105440 59494069 56609715 52751692 47222598 39952213 32298965
11935C2298965o565694n028496l731748k747689j990910j436110j078755q37356
$$ 32298965 25733271 20704775 16973027 14225338 12234428 10798318 9719563 8882207
11927H882207o52473n46337l57470j71198j26892K1747J20247K93794N86946Q73403
$$ 8882207 8229734 7683397 7325927 7154729 7027837 7049584 7169831 7463625 8050571 8923974
11917H923974J272571J848950K674253L891198N440265P320045Q895725R128857
$$ 8923974 10196545 12045495 14719748 18610946 24051211 31371256 40266981 49395838
11909D9395838P949829O857990O725927N840682K576975j890731m880967n960691
$$ 49395838 57345667 64203657 70929584 76770266 79347241 77456510 72575543 66614852
11901F6614852p798941j0292519j0571194q632870o227490m378295l125099k290395
$$ 66614852 58815911 48523392 37952198 29319328 23091838 18713543 15588444 13298049
11893A3298049j730255j268835q98597p06497n46671l61530k74648j37243P325
$$ 13298049 11567794 10298959 9400362 8693865 8147194 7785664 7511016 7373773 7381098
11884G381098J63087L72893N35726P88231J218869J748771K547031L737781N152780
$$ 7381098 7544185 7917078 8452804 9241035 10459904 12208675 14755706 18493487 23646267
11875B3646267O650828P564605O783662M136896J079888j378357l962896o483866
$$ 23646267 30297095 37861700 44645362 48782258 49862146 48483789 44520893 38037027
11867C8037027p380364o578743n179847l886999k875119k079500j537425j083484
$$ 38037027 30656663 24077920 18898073 15011074 12135955 10056455 8519030 7435546
11859G435546r52500p79244n76516m76151m02599l36354k09978j83777k15957
$$ 7435546 6483046 5703802 5127286 4651135 4248536 3912182 3702204 3518427 3302470
11850C302470j81459o8714p8004k36432j69384r0623j21454j13732q9614q561
$$ 3302470 3121011 3052297 2974293 2737861 2568477 2477854 2356400 2242668 2153054 2144493
11840B144493O259l8376j8267m4155j03231n0592p1579p9045j22049j13462j02275
$$ 2144493 2150752 2112376 2094109 2049954 1946723 1896131 1824552 1745507 1623458 1509996 1407721
11829A407721m9820n5203q3595j3595m9249k1265q293m3936M341q968o4570j9503
$$ 1407721 1357901 1302698 1219103 1205508 1156259 1134994 1126701 1082765 1087106 1078138 1013568 994065
11817I94065r17m8505k1043K7826m8783J8980L7802m2202j9179n3110j142M6731
$$ 994065 993148 944643 923600 951426 902643 921623 959425 917223 898044 844934 843792 890523
11805H90523K5834k6726K5950L2722j8103J0641M9855l3059M1766J3954r9872
$$ 890523 916357 889631 915581 948303 930200 940841 990696 957637 999403 1013357 913485
11794I13485j49536j02053p6085m668M6031J0927l336r8043n9690J9076K3777
$$ 913485 763949 661896 585811 581143 627174 638101 634765 536722 477032 496108 519885
11783E19885k7884l9210J9201M7057k886n4698M4037K1642k3822j0872j1365K3236
$$ 519885 492001 452791 471992 519049 516163 461465 505502 527144 503322 492450 481085 504321
11771E04321O4361M1927q796K1199j0929k9115K9241j2666J9696m6K8998k2411
$$ 504321 568682 610609 601813 623012 612083 582968 612209 599543 619239 619193 648191 625780
11759F25780l9963l0105o9967o1994k1822n7785k4033n1535p980p910K5502J9117
$$ 625780 585817 555712 485745 423751 401929 344144 320111 268576 260596 252686 278188 297305
11747B97305L714L2282K6136N0799O6930P845J6425l8237k1373j401o1154o9192
$$ 297305 301019 333301 359437 410236 477166 485011 501436 463199 441826 440425 379271 310079
11735C10079q3750o307l6032M751J5396j1667L8986R666K78J6825R0209j2211
$$ 310079 226329 220022 183990 188741 204137 192470 231456 241122 241400 258225 348434 336223
11723C36223Q995j7794j8898j6471k5945r6406o1066n975J2526r0529l6847L1745
$$ 336223 345218 327424 308526 292055 266110 169704 108638 102663 115189 24660 -12187 19558
11711A9558N1127L1849k799K34J5526o3414j22159j9844L1870L8512K7544Q5m121
$$ 19558 70685 102534 99735 99969 115495 52081 -70078 -89922 -58052 -19540 8004 8089 3968
11698C968P381N660N9244M9991o64Q113n6263j269Q378L6956J00373J05070Q7850
$$ 3968 11349 17009 76253 126244 125580 133693 77430 76161 84539 121495 221868 326938 414788
11685D14788J17991m0411j59388j24788r0785j8779q773o691L0377N6290k8171
$$ 414788 532779 492368 332980 208192 117407 98628 89855 83164 113541 169831 141660
11674A41660k0942l8799p176P2052m994m6261J5845P1484N5008Q739j6371m0745
$$ 141660 120718 81919 74743 146795 141801 95540 111385 182869 237877 246616 230245 189500
11662A89500p7104l3993m0012n9396l0682j500L30n0762n200J1214l4342j8914
$$ 189500 112396 78403 38391 -21005 -51687 -53187 -52857 -103619 -108819 -97605 -131947 -150861
11650a50861r05J7944k6293m1497O1963L6230r299M2967n028J5503k6556K0523
$$ -150861 -151766 -133822 -160115 -201612 -139649 -103419 -112718 -69751 -74779 -59276 -85832 -65309
11638f5309l5377m1106N3411k4445O4273J12194Q0006J3714l7440p714n6291p4911
$$ -65309 -100686 -141792 -88381 -112826 -48553 63641 143647 157361 119921 112207 55916 -18995
11626a8995p648O20k0167j7088M5392K6181n9407r6272k7219K4592m675K3191
$$ -18995 -26643 -26023 -46190 -63278 -17886 8295 -51112 -147384 -174603 -150011 -154686 -131495
11614a31495l9532m3562j6303n3316K8474m0084k9167P6269L7516l4425n787j3393
$$ -131495 -171027 -214589 -230892 -284208 -255734 -295818 -324985 -248716 -211200 -245625 -251412 -264805
11602b64805L1886Q6K978j102O6954L2904k4577m1784J2892m310n5741k6406q29
$$ -264805 -232919 -232833 -229855 -230957 -164003 -131099 -155676 -197460 -184568 -188878 -244619 -271025 -271854
11589b71854M5815r061n068k9523k5922L9784O9865J2691n1871p5102L404J730
$$ -271854 -226039 -235100 -240168 -269691 -295613 -255829 -185964 -173273 -225144 -300246 -296842 -295112
11577b95112k1843k8214j187P954q447n319M648O4456l9451j8508O0932O2288
$$ -295112 -316955 -345169 -346356 -338402 -346849 -352168 -347520 -283064 -322515 -341023 -280091 -217803
11565b17803o629K347R003o0246j3211K4435M7748K0392l8244Q117K8113o129
$$ -217803 -224432 -222085 -213082 -273328 -286539 -262104 -214356 -193964 -232208 -224091 -195978 -202107
11553b02107K5248J7409j6890k8238k0262N7564O0420R848m3346J472K5238q670
$$ -202107 -176859 -159450 -176340 -204578 -224840 -167276 -106856 -97008 -140354 -138882 -113644 -122314
11541a22314K2947L584L8284k2148p6436o0983J5161Q9829N1832J727Q304L2280
$$ -122314 -99367 -95783 -57499 -79647 -156083 -217066 -201905 -112076 -60244 -58517 -50213 -17933
11529a7933J01474J25590r447j900P635o8130o0726o6830m7669p470k2065l7985
$$ -17933 83541 209131 199684 197784 205419 137289 76563 9733 -37936 -45406 -67471 -105456
11517a05456m7250l7538m8902o086q085k4388J9127N326j19287p3397M9284O1264
$$ -105456 -152706 -190244 -239146 -245232 -253317 -277705 -258578 -253252 -372539 -445936 -396652 -335388
11505c35388L7277M0242k8436J6563N0723O4736J15021Q8495Q5565O9918M8913
$$ -335388 -298111 -257869 -286305 -269742 -219019 -154283 -39262 49233 134798 204716 253629
11494B53629Q6483J22926R3283Q4382M3875n2725o5851j85126k09370j66522p5197
$$ 253629 340112 463038 556321 640703 684578 631853 566002 380876 171506 4984 -70213
11483g0213m6754q2122m6152m5560l47l8597n0997Q1382P2171K9418M5424K7046
$$ -70213 -116967 -199089 -245241 -290801 -291148 -329745 -380742 -299360 -227189 -197771 -152347 -125301
11471a25301O045o53N8381k0233m4902l4277O4701K0827M6996J39951J27499J23939
$$ -125301 -119256 -119909 -61528 -81761 -126663 -160940 -96239 -75412 -28416 111535 239034 362973
11459C62973J44180J30008M9658M5725Q1497O9672Q4300J73739J59186K32892
$$ 362973 507153 637161 686819 732544 814041 883713 968013 1141752 1300938 1533830
11449A533830K97651M19265O00298P87089J203953J763526K535730L636818N172223
$$ 1533830 1831481 2250746 2851044 3638133 4842086 6605612 9141342 12778160 17950383
11440A7950383O828824P853702O700818K415397l256768o689232o955252n751455
$$ 17950383 24779207 32632909 39333727 41749124 38492356 31803124 24847872 19096417
11432A9096417m322289l141048k254082j691703j239883r37473o97671n10062
$$ 19096417 14774128 11633080 9378998 7687295 6447412 5509939 4812268 4302206
11424D302206l47090k49590k53339k03781j58748m2341J576Q2438J26254J65005
$$ 4302206 3955116 3705526 3452187 3248406 3089658 3047317 3048893 3131331 3257585 3422590
11414C422590K10047L74112L73222N30457P92678J221929J664517K341727L360967
$$ 3422590 3632637 4006749 4379971 4910428 5703106 6925035 8589552 10931279 14292246
11405A4292246M840731O935152R396269J1356894J0673369N949189l78237l064697
$$ 14292246 19132977 26068129 35464398 46821292 57494661 63443850 63065613 60000916
11397F0000916l91208M427723P308396L898375n615268j3150292j3775154j0720369
$$ 60000916 59609708 64037431 71345827 75244202 69628934 56478642 42703488 31983119
11389C1983119p511067n183296l605461k553032j889365j362274j095574q98233
$$ 31983119 24472052 19288756 15683295 13130263 11240898 9878624 8783050 7884817
11381G884817o51194m81252l69285j98497j48331j01073N0072J75506L68095N34617
$$ 7884817 7233623 6752371 6383086 6184589 6036258 5935185 5985257 6160763 6528858 7063475
11371G063475P45173J072416J541659K337273L415564M935030O848108Q423174
$$ 7063475 7808648 8881064 10422723 12759996 16175560 21110590 27958698 36381872
11363C6381872Q334621O069710L680788M003628O477328P591937L832592m291877
$$ 36381872 44716493 50786203 54466991 58470619 64947947 72539884 76372476 72080599
11355G2080599j1155065j2796984j0970848q216004n936386m289269l077054k268108
$$ 72080599 60925534 48128550 37157702 28941698 23005312 18716043 15638989 13370881
11347A3370881j821888j375982j043339p73311n27266m07524k98816k51704k63722
$$ 13370881 11548993 10173011 9129672 8356361 7829095 7421571 7122755 6871051 6607329
11338F607329j24570J59732L66874N35962Q79101J411029K127922L093388M462817
$$ 6607329 6482759 6642491 7009365 7545327 8424428 9835457 11963379 15056767 19519584
11329A9519584O225324P855606P941408M903751k59202l540073k942052M86999
$$ 19519584 25744908 33600514 41541922 46445673 46186471 42646398 39704346 40191345
11321D0191345M817452Q064262O617281j705585j0035633j1694655r237283o449168
$$ 40191345 45008797 53073059 59690340 57984755 47949122 36254467 27017184 20568016
11313B0568016m273075k899468k081502j480037j185439r79100p51135n80274
$$ 20568016 16294941 13395473 11313971 9833934 8648495 7669395 6918260 6337986
11305F337986m38119l38910l16205k47162j74363q8488o4531j3395N5347J59096
$$ 6337986 5899867 5560957 5244752 4997590 4823227 4734739 4670208 4656813 4712160 4871256
11295D871256K25642L25491M94835P01012R98870J525395K277357L294132M775462
$$ 4871256 5096898 5422389 5917224 6618236 7617106 9142501 11419858 14713990 19489452
11286A9489452O801217R071745J0595325R253200L333847m717593r650050j0004321
$$ 19489452 26290669 35362414 45957739 55210939 58544786 53827193 44177143 34172822
11278C4172822q080063n897574m204538l025923k230747j655198j246944j032244
$$ 34172822 26092759 20195185 15990647 12964724 10733977 9078779 7831835 6799591
11270F799591p73180n80025n01536m64962m14236l51755k98911l04154k41608
$$ 6799591 6026411 5446386 4944850 4479888 4065652 3713897 3414986 3110832 2869224
11261B869224k21254k17285k15118j54382j04705q5402q2859j25801j18635o8590
$$ 2869224 2647970 2430685 2215567 2061185 1956480 1871078 1788219 1662418 1543783 1475193
11251A475193N70p4643p4987o1661m0633p3607n5791m9852p2902j9355k7426p0779
$$ 1475193 1475763 1401120 1326133 1264472 1223839 1150232 1094441 1044589 971687 952332 924906 854127
11239H54127J0228l0081o0070p0008j0121p4510o2001K842O8067j3656n3065l4038
$$ 854127 864355 834274 774204 704196 694075 619565 557564 560406 628473 614817 561752 527714
11227E27714M2522k2947k1516n5712r4154j06964k4583K0336M7659K5085J7523
$$ 527714 570236 547289 525773 470061 375907 268943 244360 264696 312355 337440 354963
11216C54963J1803q1217r1184p2837m9419n242j7078L0320L70n4361L902j0305
$$ 354963 366766 285549 194365 121528 72109 66867 49789 80109 80479 26118 30020 19715
11204A9715q4136j2862j7574j7889j5639O732M3414m8468m1342J3071N3236K8108
$$ 19715 -64421 -77283 -94857 -112746 -128385 -121653 -78239 -126707 -168049 -154978 -101742 -73634
11192g3634p807M988l1194p9692j7923L131p615j9189l4717j5394j1309R792k1018
$$ -73634 -81441 -76453 -107647 -187339 -205262 -202131 -209746 -228935 -263652 -279046 -290355 -280563 -301581
11179c01581q5297n7714Q822l1818J8327N9766R751p2222k9821n342j7533j4068
$$ -301581 -386878 -444592 -435770 -467588 -449261 -389495 -379744 -451966 -481787 -487129 -504662 -518730
11167e18730j2711m0542n4391j8156L0249J8516P128J1834O7716J14985L1202
$$ -518730 -531441 -571983 -626374 -644530 -614281 -595765 -588637 -576803 -509087 -394102 -362900
11156c62900j4049O3013J29210J63890K05492K91805M03687N81176Q42544J248570
$$ -362900 -376949 -313936 -184726 -20836 184656 476461 880148 1461324 2303868 3552438
11146C552438J660693J711872J103717j52062j213741j615738j455387j026526
$$ 3552438 5213131 6925003 8028720 7876658 6662917 5047179 3591792 2565266
11138B565266p14952n29863m01643l21510k58921j61135o7545n5726q8162j05674
$$ 2565266 1850314 1320451 918808 597298 338377 177242 109697 53971 -34191 -139865
11128a39865m6335j9865j1647L3298R5060P9363R5854J66142K29126L28477N46913
$$ -139865 -186200 -206065 -217712 -184414 -89354 -9991 85863 252005 481131 809608 1356521
11117A356521P92242J196550J753420K340431K555703J893416O83090k00230l99517
$$ 1356521 2148763 3345313 5098733 7439164 9994867 11888283 12571373 12371143 11971626
11108A1971626k99667p97303j590271j939492j578871j025526n39508j98756M0630
$$ 11971626 11671959 10874656 9284385 7344893 5766022 4740496 4200988 4002232 4042862
11099D042862L05109M97730O03364Q22266J160590J609312K180488L006062M224977
$$ 4042862 4347971 4845701 5449065 6271331 7431921 9041233 11221721 14227783 18452760
11090A8452760O004516Q581164J1930311J5955477J9363808J9513534J4111453
$$ 18452760 24457276 33038440 44968751 60924228 80288036 99801570 113913023
11083A13913023M828422k687626l597689J371724P616692R543585L346286q308935
$$ 113913023 118741445 116053819 112456130 113827854 121444546 130988131 134334417 126025482
11075A26025482j7274481j9676226j7654496j4149176j0580983p694223n609988
$$ 126025482 108751001 89074775 71420279 57271103 46690120 38995897 33385909
11068C3385909m159638l103685k313099j613268r95514l37975L24598J112442
$$ 33385909 29226271 26122586 23809487 22196219 21200705 20862730 21187328 22299770
11060B2299770K016684L272156N061011P737492J1422933J6218424K1277222K3786660
$$ 22299770 24316454 27588610 32649621 40387113 51810046 68028470 89305692 113092352
11052A13092352K0249773J1619022L884112P44421j169944o171042j2141918j2958984
$$ 113092352 133342125 144961147 148845259 149589680 148419736 142248694 130106776 117147792
11044A17147792o983506K386672J0902864J3595580O012026p288542j4069810
$$ 117147792 110164286 112550958 123453822 137049402 143061428 135772886 121703076
11037A21703076j0577549k355956N028121O326845j695681j3327073j8854770
$$ 121703076 111125527 108769571 113797692 120124537 118428856 105101783 86247013
11030H6247013j7186391j3037569r167369o204255m142893k561898j250817J06627
$$ 86247013 69060622 56023053 46855684 40651429 36508536 33946638 32695821 32802448
11022C2802448J538618L310952N483315Q128773J0408949J1245623R392356M340923
$$ 32802448 34341066 37652018 43135333 51264106 61673055 72918678 82311034 86651957
11014H6651957k879944r210396j2021095j1336347q973707o490605m392555k822539
$$ 86651957 83772013 74561617 62540522 51204175 42230468 35739863 31347308 28524769
11006B8524769j565272m06953P25529K220980M017715O349079R230727J1738085
$$ 28524769 26959497 26552544 27278073 29499053 33516768 39865847 49096574 60834659
10998F0834659J1916461O913094k468703j0508899j2915304j1281772q570835
$$ 60834659 72751120 79664214 77195511 66686612 53771308 42489536 33918701
10991C3918701o226186m382100l113992k301722j692192j176585n86730Q8646
$$ 33918701 27692515 23310415 20196423 17894701 16202509 15025924 14439194 14527840
10983A4527840Q20301J502726J820508Q95463r44716j860372j402421l36032O21783
$$ 14527840 15348141 16850867 18671375 19566838 18622122 16761750 15359329 15023297 15645080
10974A5645080Q16807l29813j813846k290127j878163j352195r24817p06183n18199
$$ 15645080 16461887 16132074 14318228 12028101 10149938 8797743 7872926 7166743 6648544
10965F648544m83616l66253k26635k08465j59112j55943j77160k38531j23871
$$ 6648544 6164928 5798675 5572040 5363575 5204463 5048520 4871360 4632829 4508958
10956D508958q6600p7968k1200m7977m7206k4628J7016n4081l9789J6014N4426
$$ 4508958 4422358 4344390 4323190 4275213 4228007 4203379 4220395 4166314 4126525 4142539 4196965
10945D196965J04080J52400K76396N09393P12459J073682J460086J583461J042227
$$ 4196965 4301045 4453445 4729841 5239234 5951693 7025375 8485461 10068922 11111149
10936A1111149k38473j367377j595014j239608r77669p42906m81493l33296k20154
$$ 11111149 10872676 9505299 7910285 6670677 5693008 4950102 4468609 4135313 3915159
10927C915159j91987k13235k08274j41399l3991r2937p9222r5032p7745k4525
$$ 3915159 3723172 3509937 3301663 3160264 3126273 3033336 2954114 2859082 2781337 2756812
10917B756812n2888K857k6988l2318J0011n0946l0656o870o087K9265K1333L1340
$$ 2756812 2703924 2706781 2679793 2647475 2657486 2606540 2575884 2569014 2562927 2592192 2613525 2644865
10905B644865O7292K4986q2125o6519o8094m5518l4712J8431R317n6844l07o7045
$$ 2644865 2712157 2737143 2655018 2588499 2520405 2474887 2440175 2458606 2467923 2411079 2410772 2343727
10893B343727q3296r0289j13564o9274q0091o9596k1326n5963j5167k9049j5863
$$ 2343727 2260431 2170142 2056578 1987304 1907213 1837617 1816291 1760328 1745161 1716112 1700249
10882A700249k9086n327l915k5144j2142n6868r794L3797N6785M3163L6778M3000
$$ 1700249 1671163 1665836 1661921 1636777 1624635 1567767 1557973 1591770 1648555 1691718 1728496 1771496
10870A771496L7824Q9094M9751J223n1919o068J8023N8919j6676n3447q4705n8211
$$ 1771496 1809320 1898414 1948165 1949388 1897469 1891401 1909424 1968343 1951667 1898220 1813515 1755304
10858A755304p258l9326k9479j5798L2118L7045N262l0554l0770p0160m6455m8959
$$ 1755304 1748046 1708720 1679241 1663443 1695561 1732606 1737868 1707314 1676544 1606384 1559929 1510970
10846A510970j8546o1642m5066R821L9988r3754p5857j3213L6055o324K2458o574
$$ 1510970 1492424 1430782 1385716 1395537 1435525 1341771 1265914 1252701 1288756 1282432 1304890 1298316
10834A298316j6380p315J8839n0235n2808k5132O355M526k8787j1773m2642R033
$$ 1298316 1281936 1274621 1293460 1243225 1190417 1165285 1171640 1176166 1147379 1135606 1092964 1101997
10822A101997M9461k6763m6141l7743n300K7515l1210l4614r622M1567N3658K2523
$$ 1101997 1151458 1124695 1078554 1040811 1035511 1063026 1031816 997202 987580 1029147 1082805 1105328
10810A105328m3577m2271k4027k519K6078J9882l6823n6174j8761J2386K14o5389
$$ 1105328 1061751 1019480 995453 992934 1019012 1038894 1002071 945897 927136 939522 939736 874347
10798H74347n4381N936K3827N850j2153j8210L5560K709n8410l4718k4074l5498
$$ 874347 819966 825902 849729 855579 843426 825216 860776 863485 805075 770357 746283 710785
10786G10785J4033P1413M0697N351q462p7294q5981k8228M157k7336P647L8179
$$ 710785 724818 796231 836928 842279 833817 756523 670542 642314 646471 619135 626782 664961
10774F64961O964n5362j9562j9926K2823j1072J457k0551m9099n9296M400N3871
$$ 664961 671925 616563 597001 577075 599898 588826 590283 569732 520633 461337 465737 519608
10762E19608P4244l3601k7488J4060N7594q173q0460m0922N0747L5950n3451K0006
$$ 519608 593852 560251 532763 546823 604417 596244 515784 474862 525609 561559 508108 528114
10750E28114J8242L1427M3189j6210l988j4167m0816m4098n7230q548L0933J0778
$$ 528114 546356 577783 620972 604762 600774 586607 545791 501693 444463 435915 466848 477626
10738D77626L5496K8975p4041q4220K2255L494o955l7958q846P078k0921j5713
$$ 477626 513122 542097 468056 383836 406091 409585 402630 364672 355826 362904 341983 326270
10726C26270k7034n8880q727J9709k175j35L863L2074q752l2504k9062k5244j3271
$$ 326270 299236 240356 231629 251338 249163 249028 252891 284965 276213 243709 214647 189403 176132
10713A76132k6867r291m6933m260K0675l0153K7856J3086m5928J5681j6784J513
$$ 176132 149265 139974 93041 88781 109456 79303 107159 120245 74317 89998 73214 74727
10701G4727L5135N6144k7437J7344J01759n2142o1259n8270l9006o454K391L7244
$$ 74727 109862 166006 138569 155913 257672 205530 144271 86001 46995 40541 42932 80176
10689H0176l44k6045k8371n647l837J4815k8312k4870P560O499n332L568Q966
$$ 80176 79832 53787 25416 19769 15932 30747 2435 -22435 -14875 -8376 -13708 -10140 -1174
10676a174K7194m7773j6739k3205l1524k7930N4517N1658o2149m1885Q802J0373
$$ -1174 26020 -21753 -38492 -61697 -93221 -121151 -66634 -14976 -77125 -119010 -110208 -99835
10664i9835l3609J0113N0227l7512q1988k8139K2229K2662M8232L7838J8263j5509
$$ -99835 -133444 -123331 -73104 -110616 -192604 -220743 -198514 -175852 -127620 -89782 -71519 -87028
10652h7028R608M677K1273O0197O8828j8042p2120j28979j51209o2629O7703O2930
$$ -87028 -77420 -72743 -51470 8727 77555 59513 -12607 -141586 -292795 -355424 -287721 -224791
10640b24791j5285l8108P8538Q8657O2228R0953R5490J89321K55371K04039K07282
$$ -224791 -240076 -278184 -199646 -110989 -48761 42192 137682 327003 582374 786413 993695
10629I93695J03767N400K9782J58729K90901M07493N47797P86000J278209J799411
$$ 993695 1097462 1102862 1132644 1291373 1582274 1989767 2537564 3323564 4601773 6401184
10619F401184K450830L221552M178795M989495N051261L671472J261483r91691
$$ 6401184 8852014 12073566 16252361 21241856 26293117 29964589 31226072 30234381
10611C0234381j984123j575661l70473J254748L247919N746023Q402736J0514082
$$ 30234381 28250258 26674597 26304124 27558872 30806791 36552814 44955550 55469632
10603E5469632J0482050O538505r0282n414159p016054n705195l044543K57790
$$ 55469632 65951682 72490187 72399905 66985746 59969692 54264497 51219954 51477744
10595E1477744L706110P522695J1305417J3802068J2563529N879031m133294j1526177
$$ 51477744 55183854 62706549 74011966 87814034 100377563 106256594 102123300 90597123
10587I0597123j3165371j0915308p267813l685010k33284L074049N885207P441515
$$ 90597123 77431752 66516444 59248631 55563621 55330337 58404386 64289593 71731108
10579G1731108O032888R43302n615254r888700j0363852q435665n851139l441281
$$ 71731108 77763996 78707298 73092044 63203344 52839492 44403827 38552688 35111407
10571C5111407j393664J88501J477819J888503J058004j075148l561028n033086
$$ 35111407 33717743 33906244 35384063 37272566 38330570 37255422 33694394 28661308
10563B8661308n077003m305826l374912k514482j931119j492031j116133q91607
$$ 28661308 23584305 19278479 15903567 13389085 11457966 9965935 8849802 7958195
10555G958195p52485o62930n37747l78736l45520l48094l01267k15205j90268
$$ 7958195 7205710 6542780 6005033 5626297 5280777 4932683 4631416 4416211 4225943
10546D225943k02664j58409j02882q9049j12489j05512n9714r7331j20235j66534
$$ 4225943 4023279 3864870 3761988 3672939 3560450 3454938 3395224 3297893 3177658 3011124
10536C011124j52938m7731n4945j10608j13365p1820o2742J9668J2273j7095k2071
$$ 3011124 2858186 2810455 2755510 2644902 2531537 2459717 2396975 2416643 2428916 2411821 2389750
10525B389750n3111m0961l8814q3448m3207j2660J6778j4739m1452l9534n9999
$$ 2389750 2336639 2295678 2256864 2173416 2130209 2117549 2134327 2119588 2078136 2038602 1978603
10514A978603o5267m8234l9419M3404k46l6745q0261j6309K0527K8803k7903n8059
$$ 1978603 1913336 1865102 1825683 1869087 1868841 1832096 1751835 1735526 1756053 1784856 1756953 1698894
10502A698894n0844J9097l289L8642N0872l6722n5398o0907m9762l5490M1220
$$ 1698894 1648050 1667147 1663858 1702500 1753372 1716650 1661252 1600345 1550583 1515093 1556313
10491A556313m2907K891J2000n583k6166l0040k2747L4657J1417j0836j497j6506
$$ 1556313 1513406 1516297 1528297 1522714 1496548 1466508 1443761 1478418 1489835 1478999 1477502 1460996
10479A460996j6605n8914L4467L8600r3823n1066J1478O9337K5696k1491l8873
$$ 1460996 1444391 1385477 1419944 1458544 1364721 1313655 1325133 1394470 1420166 1398675 1359802
10468A359802K4035n360M1308j9237m1807n0469j2849J5853m253j1901l4380k5220
$$ 1359802 1383837 1378477 1419785 1400548 1358741 1308272 1295423 1311276 1307023 1295122 1260742 1235522
10456A235522J9900l366o056m3239K3369r955k3447m0137m9619O4J1530L4602
$$ 1235522 1255422 1252056 1246000 1202761 1226130 1216175 1192728 1152591 1102972 1103036 1114566 1149168
10444A149168L2788M037l7777n3910n4359o867J4106L6365K8707j5687K0341m0903
$$ 1149168 1181956 1185993 1148216 1094306 1039947 1033080 1047186 1083551 1112258 1096571 1116912 1076009
10432A076009j334k6717K3384L4059m3734q1412K2022P799j4432r355k869k3172
$$ 1076009 1074675 1047958 1071342 1105401 1061667 980255 1002277 1010076 995644 986289 983420 960248
10420I60248J3024j3288j7395p3520m9849K8687L0986L7081L8100j8512p62n585
$$ 960248 973272 959984 942589 869069 819220 847907 878893 915974 954074 935562 934800 929215
10408I29215k1540K5633L187L942n2682K9896J4779k5239o6844p6350k6859P6170
$$ 929215 907675 933308 936495 940437 887755 917651 932430 907191 840347 763997 737138 813308
10396H13308L8673j9453l766j6863K8639L6168j8886k3635L6921K7981p6531q8261
$$ 813308 851981 832528 828762 811899 840538 876706 857820 834185 871106 899087 822556 734295
10384G34295J6691R2857J5231m9945k958J970l194N3423k1783K4100O1276j0055
$$ 734295 750986 843843 859074 809129 806171 808141 804947 858370 836587 860687 921963 911908
10372I11908j5842j600k9926q5239n8173J3675j9192M6906N726n2251m832M0042
$$ 911908 896066 894466 864540 779301 721128 734803 715611 762517 768243 715992 711160 751202
10360G51202P759l9178k904K0563L1527K951o595r28j4821L4133l5652o2041m2996
$$ 751202 758961 719783 716879 737442 768969 771920 765325 764397 749576 783709 748057 686016 643020
10347F43020K2565P396K7344M0157q640q452L3031K1768p0481k6518L4593P138
$$ 643020 665585 672981 700325 740482 731842 723390 756421 778189 707708 681190 715783 722921
10335G22921o7263l3376N7957P1442k6670k6395k7291l8470j4672P2734L1330
$$ 722921 655658 622282 680239 751681 725011 698616 671325 632855 618183 690917 722247
10324G22247k5014k0057M3160K9931n887P11K5869Q257q9892j5052K8577o4051
$$ 722247 697233 677176 720336 750267 744380 745091 770960 779217 689325 674273 702850 638799
10312F38799o5803n6578K6333P3205M9515K6212j5519l0067k0307Q677R218l4916
$$ 638799 572996 516418 542751 615956 665471 691683 676164 646097 625790 634467 643685 608769
10300F08769P120R4849M9065k3600n3026o5007p2285n053M4190N1748J4971k3964
$$ 608769 615889 710738 759803 736203 683177 618170 545885 540832 585022 636770 651741 627777
10288F27777o0983M3223N0413M396j6532m7002K0890j5127M8039k9847n0766o3542
$$ 627777 566794 610017 660430 664826 648294 601292 622182 607055 655094 625247 574481 510939
10276E10939L5145O6702K961K042m1049j17157J8903M767m3855K7186M2261K2790
$$ 510939 546084 612786 615747 617789 576740 459583 478486 483253 439398 466584 508845 531635
10264E31635P361O886j2081j5343K3701M250K3425n083N922j4924O836k8627J8537
$$ 531635 538996 545882 533801 518458 542159 546409 569834 564751 570673 555749 562585 533958 552495
10251E52495L3408J6705k0978l9089K8471k6441N0204l7700p4905N772j1250o8956
$$ 552495 585903 602608 581630 542541 571012 544571 594775 557075 482170 487942 476692 407736
10239D07736M0659M6712K2897j3511Q406Q567O2586L9364n5264o5713k7378L8457
$$ 407736 448395 495107 518004 504493 512899 521466 584052 623416 568152 502439 475061 513518
10227E13518k1304m5062K1892j8884m1499j198P1848O3070L6514k3591m9114m4512
$$ 513518 492214 447152 469044 450160 408661 407463 479311 542381 578895 555304 506190 461678
10215D61678P426R638j0960l5650Q1213j094O868m7159j0109j7651j4348k689
$$ 461678 469104 478742 467782 432132 513345 512251 519119 471960 461851 444200 429852 427163
10203D27163L7751Q707p433k2017k9595K7347J0155K7879P5718o3308r7188j4915
$$ 427163 464914 473621 466188 444171 414576 441923 452078 479957 555675 492367 395179 380264
10191C80264k764K7450K7986J9470r939O359K3997J1259j1331O5808M6662J1970
$$ 380264 377500 404950 432936 452406 442467 448826 472823 484082 472751 538559 585221 597191
10179E97191N5468K4897n1735m4036J3066L0570j4551J0687L5310L9680k6803
$$ 597191 652659 677556 625821 581785 594851 625421 610870 621557 656867 696547 669744
10168F69744M9261O5767R2472L0300k8416o9671m8708m7149j2195n750K6766P8636
$$ 669744 719005 784772 877244 907544 879128 809457 760749 713600 701405 695655 722421 801057
10156H01057N9571R2626J14282L5526j20864j05394K053o6332j36416k5352O9379
$$ 801057 860628 953254 1067536 1103062 982198 876804 878857 812525 676109 650757 720136
10145G20136J3928M5845K0513L2809j994m3651p1226q2174m8300m318k8768k2543
$$ 720136 734064 779909 800422 833231 831237 787586 716360 634186 585886 581568 552800 530257
10133E30257O3003K3413O639Q2159l1655j04969p460k6547n4123m8195M198k7405
$$ 530257 593260 616673 623312 705471 673816 568847 561387 534840 480717 432522 436720 409315
10121D09315l798K9945M8575M1339K180p2394k1549l7252k6715L3973M792l3053
$$ 409315 405517 435462 484037 525376 527556 455162 433613 396361 369646 403619 408411 375358
10109C75358M994k3349N858L9164L041M199L0452j2792l8638K2711M8903j5629
$$ 375358 380352 357003 362861 402025 405066 409265 439717 426925 388287 410998 459901 444272
10097D44272k5158K2702J2035K1539l4236l1436r041J9257J0761l5284m6069j5882
$$ 444272 419114 441816 453851 475390 441154 409718 400677 419934 430695 395411 349342 333460
10085C33460L6124n6487l1356O969O798K1775O705N1580M0952J8458J6265j1316
$$ 333460 369584 313097 281741 288710 295508 317283 323988 375568 416520 434978 451243 439927
10073D39927m5162n5721M0929L9928l214M9382M4101m0285m7459n5161m1315j9265
$$ 439927 394765 339044 379973 419901 416687 466069 510170 469885 422426 367265 325950 306685
10061C06685L4894j6232p345K219o404O1909P1382j1802P712J5840L621j1466
$$ 306685 341579 325347 318002 320221 313817 375726 447108 435306 443018 458858 462479 451013
10049D51013j6801m7122l8323J6238J220j2902j5414K0758K3008j1485j3881R954
$$ 451013 434212 387090 348767 365005 366225 353323 337909 358667 381675 370190 356309 366263
10037C66263k4416l6349P5158O9109l7184k7669m3174n563j1730l4266R151M3668
$$ 366263 341847 305498 380656 449765 412581 384912 341738 336175 324445 290179 299330 342998
10025C42998K6944m955k5806K7971N6262M7738k2292p3782k8029J2491N4718m6901
$$ 342998 369942 364987 339181 367152 423414 471152 448860 375078 347049 359540 414258 367357
10013C67357k2246l5260m7333L1925K7018j3444N676J6607o53q2357k5168O2520
$$ 367357 345111 309851 262518 294443 321461 308017 313693 330300 329647 247290 222122 284642
10001B84642P3358k7073j103n2347n772K8467N6181R590k040q719l8933q8471
$$ 284642 358000 330927 329824 277477 271705 300172 356353 365943 363903 355184 316251 227780
9989B27780J0236Q3341J3580l1559m1767L0424j3876J6956Q308L4797L7890K2591
$$ 227780 238016 321357 334937 303378 261611 292035 278159 295115 303423 338220 376110 398701
9977C98701J1033r296p0212l6502J3665M6726l3040m3774J894J8340J4437K2671
$$ 398701 409734 400438 330226 293724 307389 354115 321075 277301 279195 297535 311972 334643
9965C34643j3258L1745R796l434k0029q8944J6430L9627n2011j2977K4843J9737
$$ 334643 321385 353130 362926 359492 339463 250519 266949 306576 254565 241588 266431 286168
9953B86168N1189L9099m3129j6616k137J7267M04n5885P825L6839J3041J8835
$$ 286168 337357 376456 333327 316711 314574 331841 332245 276360 284185 321024 334065 352900
9941C52900m6590m9023J9672r202K2967K8784k0773l1178K3006Q0745O4734R658
$$ 352900 306310 257287 276959 267757 290724 319508 298735 267557 290563 371308 436042 445700
9929D45700m1570l6136l0227j0092K2004J2137K6677n8798o2853J9492P1357k4176
$$ 445700 404130 367994 337767 327675 349679 361816 388493 329695 266842 286334 357691 333515
9917C33515k5277l5749m1609M6985N2863l8339L454k0829j4295o3926N3404O8382
$$ 333515 308238 272489 230880 277865 330728 292389 295843 275014 260719 196793 250197 318579
9905C18579K9009J1280k6284l2475n562P585K9892K2779k6076l2172p0227n5832
$$ 318579 347588 358868 332584 300109 294547 302132 332024 354803 328727 296555 226328 170496
9893A70496N87m2J9894l4578n1631J832P4278O3501j1334n586j4133k4174K1990
$$ 170496 171083 171041 190935 156357 104726 106558 180836 244337 233003 227417 213284 189110 211100
9880B11100J2967j6694L9031J404m2110M850J0742M8064j0221q111m9180N992
$$ 211100 224067 207373 246404 247808 205698 210548 221290 269354 259133 251022 201842 207834
9868B07834J7750j0371k9599L8955O6843j9233l6011l4738P520K6201L5394M5122
$$ 207834 225584 215213 185614 224569 291412 272179 236168 201430 208950 235151 270545 315667
9856C15667m3942m211K7153l7045n2113K5396M2474J7106k8946j717M6258K3945
$$ 315667 271725 267514 294667 257622 205509 230905 273379 290485 261539 259822 306080 330025
9844C30025p6214k0419k8458Q628r526J63L9655J9599Q603l9778p942P024J9536
$$ 330025 253811 233392 204934 213562 204036 204199 243854 263453 272056 232278 224336 231360 250896
9831B50896J7298k8259j5094L0908Q152l1210L1445K2817l6822j3692j364k5797
$$ 250896 268194 239935 224841 255749 263901 232691 264136 286953 250131 236439 235075 209278
9819B09278k6904l2084q112K2959k0373P096M153J0286r15K4981j7199j835J2908
$$ 209278 182374 150290 142178 165137 144764 151860 156013 166299 165384 190365 173166 171331 184239
9806A84239K1360K7586j4977m2752l7367K6140J7740N740l1347J3702K677O3236
$$ 184239 205599 233185 218208 175456 138089 164229 181969 187709 156362 170064 172741 235977
9794B35977K7049l4136k8764j5197L2298N0260L8519l627L1072l797l2925l0479
$$ 235977 263026 228890 200126 184929 217227 267487 306006 302379 333451 329654 296729 266250
9782B66250o0200j6895j4650K8096L526k7626k1041O0962N391l2109K3441L1731
$$ 266250 206050 189155 174505 202601 206127 178501 157460 218422 223813 191704 215145 246876
9770B46876J8658k3958k1618l5548j0524j6014k105L0538j3873k001M0009n57
$$ 246876 265534 241576 219958 184410 173886 157872 155767 186305 172432 170431 210440 209883
9758B09883J7058N9124N3327l7607l3162n1440o863j6286L350j4957J7188Q544
$$ 209883 226941 286065 339392 301785 268623 217183 210320 194034 197384 182427 199615 208159
9746B08159j350o9233K7639J3448l4308J4524J0196j2353M770j7007N2765L3099
$$ 208159 206809 137576 165215 178663 144355 158879 169075 156722 161492 144485 197250 230349
9734B30349L5959k4602j727K267J6753k7700p0463m033M9496J8645k0660N0254
$$ 230349 266308 241706 239979 242246 258999 231299 160836 156803 206299 224944 204284 254538
9722B54538K0332j2535o2878l7608j926J3371L2736J3009K5409n5811n770M7070
$$ 254538 274870 262335 199457 161849 159923 173294 206030 219039 244448 188637 182867 229937
9710B29937m807K8338o0323o5685l1424k7417L2941K4134M1101j0571k8349l5585
$$ 229937 225130 253468 193145 127460 96036 68619 101560 125694 166795 156224 127875 92290
9698I2290k1952k7510P7047R2446J969p371K1435O738p811M2979K7740m6129r056
$$ 92290 70338 42828 119875 212321 214290 206919 228354 235092 227281 270260 298000 251871 242815
9685B42815l9204j4117N484J1813L4819j4147l402j1221L7443K7285n5246m5051
$$ 242815 203611 189494 194978 206791 241610 227463 224061 212840 250283 277568 222322 177271
9673A77271L3268j4453p0634l8718M40j8017o746J04481R4787N9632M0634j129
$$ 177271 210539 196086 125452 86734 87174 69157 62411 166892 261679 321311 361945 360816
9661C60816p6617q3791l9097J2654K4797J5063p621K4963P6165J08723J54111
$$ 360816 284199 200408 161311 173965 198762 213825 206204 231167 307332 416055 570166
9650E70166K06886M5926j21379j07447j10087p9220p2847L952j2498K5340j6698
$$ 570166 777052 822978 701599 594152 484065 404845 331998 335950 323452 348792 332094
9639C32094n333o7075l4525K5258j726k2242k8857o714k7922K8142o96l0133K975
$$ 332094 326761 259686 225161 250419 248693 226451 197594 190880 162958 191100 190404 160271 163246
9626A63246J0816N0461J70k6492K498J9213l4786j7336j674r301k0367j8976J5087
$$ 163246 174062 224523 224693 198201 200699 219912 185126 167790 166116 156815 136448 117472 132559
9613A32559K8979O2645l860l1543o427K8619j8009O97K0721l320l2366K8437J2205
$$ 132559 161538 224183 220323 188780 182353 210972 192963 193660 214381 211061 178695 207132 219337
9600B19337j8427r6844J3062N4800J7231k3052L4020k2972k7627k4992k5235L9562
$$ 219337 200910 104066 117128 171928 189159 166107 200127 177155 149528 124536 99301 138863
9588A38863L4451p922k5726l1658j5673L6875q769K0333L4114j1090n1009J6602
$$ 138863 173314 165392 139666 108008 92335 129210 120441 140774 174888 163798 112789 129391
9576A29391L1725L821K52l4986j095M0405J8137l4137k7324K0744j5185m8363
$$ 129391 161116 164937 165189 130203 129108 169513 187650 153513 126189 146933 131748 83385
9564H3385K5870L5765j0350J2147j372J2019N478k6346K95L0310L0170O686l3923
$$ 83385 109255 145020 134670 146817 145445 157464 162942 136596 136891 167201 197371 204057 170134
9551A70134K7179K6361j823l4195j7964k8288M2712m2520n0882j3220J8324M5280
$$ 170134 197313 223674 221851 187656 169692 141404 184116 141596 90714 77494 95818 141098
9539A41098N8816r070j0354q9862k1475n1766L5733P3228J0969l916L1478j5603
$$ 141098 199914 190844 180490 90628 69153 17387 53120 126348 137317 133401 164879 149276
9527A49276j3030j5053P9450J2605j5872O862p129j0519o6247o5834Q5K298K5533
$$ 149276 136246 121193 200643 213248 197376 204238 197109 186590 120343 54509 54594 56892 82425
9514H2425O006j1094L0570P491J8274K7306K924m7183p7892M4044L1675J6055
$$ 82425 88431 77337 107907 115398 133672 160978 163902 116719 38827 82871 114546 130601
9502A30601O2077M6326m4140M074P743q66J1879J5261q538j7043j9991m0463R739
$$ 130601 192678 239004 194864 198938 206681 205815 217694 232955 224417 207374 187383 146920 156659
9489A56659j2913j0276J0133n660k017k2956l0293L8469J6614n1545L6695M0627
$$ 156659 143746 133470 143603 137943 135926 112970 82677 121146 137760 86215 122910 163537
9477A63537K9049L2160k4269n1743j9095M3460M5395k8133m0685N039L6495K3333
$$ 163537 192586 224746 200477 148734 129639 173099 218494 190361 149676 154715 191210 214543
9465B14543l301o3296r971P301k6232m5062M7353N2886K3510R648m8235J6564
$$ 214543 211242 147946 137975 145276 119044 73982 121335 174221 197731 207379 159144 175708
9453A75708j4071n0508J8930L8607l1868L6305J758k8053L9784J0901P196R031
$$ 175708 161637 111129 130059 168666 136798 173103 174861 146808 186592 197493 204689 213720
9441B13720m0882n0133m037J5667m4692j3028l1424j3614J5755o270M2293M5753
$$ 213720 172838 122705 118668 134335 89643 76615 45191 31577 47332 41062 83355 129108
9429A29108J6638K7957j631l4912m914R59m5206Q528k583q398l2348R419m5752
$$ 129108 145746 173703 172072 137160 132246 133205 87999 96527 93944 85546 53198 62617 16865
9416A6865J0309R839K1306R854m4294J632M2671M5838r09j9431M1312M3972K65
$$ 16865 27174 37013 58319 68173 23879 25511 68182 114020 113111 93680 134992 178964 179229
9403A79229q930j4413J4719N682l5619j1770M8650j2947n6754l21L0176k8425
$$ 179229 170299 155886 170605 176287 140668 128898 177548 164601 107847 107526 137702 109277
9391A09277j1610O5602L3065l2228l3037p0244J8740j8199o326L5350J0503J8635
$$ 109277 97667 163269 196334 164106 131069 60825 79565 61366 55040 90390 100893 119528
9379A19528l9893j9346N1202O7551n9901L7064o897l7303k2612J4407p38J5166
$$ 119528 79635 60289 111491 179042 119141 156205 149308 112005 89393 103800 103062 118228
9367A18228Q2036J0601m7230M369j4118q609l0142n778N087L0468M027l2500k0062
$$ 118228 200264 210865 163635 168004 153886 145277 115135 109357 114444 144912 148939 116439 96377
9354I6377P7207l3297n0482j4436J3541M4575J5070J7787R673J9433L9303p2808
$$ 96377 173584 140287 89805 75369 88910 133485 148555 166342 176015 195448 234751 161943
9342A61943l3270j7433n6694Q063M8609M7853L1321m3889n731l865N204j7859
$$ 161943 128673 111240 54546 62609 111218 159071 190392 146503 140772 136907 142111 124252
9330A24252O612l1846l2259K4040K024K4295J9127K294j486K7365J2684L2116
$$ 124252 130864 99018 66759 90799 92823 117118 136245 138539 137053 164418 177102 209218
9318B09218j919l6904n6375m8206J2256K4966k0480J7257j125l9783j1793K1703
$$ 209218 207299 170395 114020 65814 78070 103036 82556 99813 98688 58905 47112 68815
9306F8815l4040j6714Q0575L8740l0887L1044M6441r306n963L9167q717l6525
$$ 68815 34775 18061 98636 137376 106489 137533 183974 174668 168705 207872 199155 162630
9294A62630l6970j197n810j3265l6459l9897o665L8802K2756N657J2918m7724
$$ 162630 125660 124463 118653 105388 68929 29032 22367 61169 83925 89582 102500 54776
9282E4776j357L0865L5518Q817l1685j9743R673j5086k3115j3739Q800k2318J4563
$$ 54776 53419 84284 119802 128619 96934 77191 86864 71778 48663 34924 43724 21406 35969
9269C5969K5625K7708N7720k585k2484m1328m587m1111J5224L0002M1578j9192
$$ 35969 61594 89302 147022 144437 121953 80625 76038 34927 50151 80153 121731 102539
9257A02539Q682l1447m669K1166p685m278K778l4235j0618L6936K4204j5327K0551
$$ 102539 111221 79774 75105 96271 88586 84308 87086 52851 42233 79169 103373 88046 108597
9244A08597m6802r30k0746o612r269j569K4945Q4274N8593m7833p6263l0124j194
$$ 108597 61795 60865 40119 33507 24238 22669 47614 131888 190481 142648 66385 36261 35067
9231C5067J860m221K7752R443m0634K2086M559L1731L3256M3151N4247l3268k1285
$$ 35067 36927 32706 60458 69901 29267 51353 55912 87643 120899 164050 218297 185029 163744
9218A63744r080m6847j0889n727o80L9562J6381J2442j6678j1982j5354K5690
$$ 163744 154664 107817 96928 91201 90521 130083 146464 158906 142228 130246 114892 140582
9206A40582M7115R353n7987m428p4302k8933O9377L3763m1223m6016J3790N1290
$$ 140582 187697 197050 139063 134635 60333 31400 100777 134540 93317 47301 61091 112381
9194A12381k9766K2965N9719o1404m0759j4030N334K1080j6042K376K1737p74
$$ 112381 82615 105580 165299 103895 63136 49106 54440 75520 59478 61854 83591 82817
9182H2817Q288L3275l8051j1906J0613k5099K1235N0014j6152K7581j4036m1959
$$ 82817 91105 124380 86329 74423 85036 59937 81172 131186 115034 142615 128579 86620
9170H6620k3033q2617l0962L5927L0902P576l5146M0466O5438K2554k5396M480
$$ 86620 63587 -19030 -49992 -14065 16837 24413 -10733 29733 95171 117725 92329 96809
9158I6809k4912k24M114m3047M1375L8591p139J5839k2448m1270j0216M6092P3534
$$ 96809 71897 71673 75787 32740 74115 112706 105567 121406 98958 57688 47472 93564 167098
9145A67098l6808r294P917J0928m3764l8800k0108K7k7777Q403P0704N6812k6470
$$ 167098 130290 120996 128913 139841 96077 57277 37169 37196 9419 17822 88526 145338 118868
9132A18868n9214j0588k805O014j0302r981j4189K0264L761l9082N953M3115j7405
$$ 118868 59654 49066 46261 52275 41973 31992 17803 38067 41828 2746 8699 51814 34409
9119C4409m2957j2592M5723J2918j528O9237j0208j9058n531j667O183p070n1482
$$ 34409 -8548 -21140 24583 37501 35973 105210 95002 75944 70413 68746 74929 67859 16377
9106A6377M000O5098k282M822L4829O744n0474J3009n034L0814l4371k2921l1763
$$ 16377 20377 85475 83193 88015 122844 129588 79114 92123 87089 117903 83532 60611 28848
9093B8848L8477L4276N3275j8889m5606l0560j5158p667O160O764o786J9001N8206
$$ 28848 67325 101601 154876 135987 90381 59821 44663 36996 43156 49920 43134 62135 120341
9080A20341J3587l8408r711j1358K625j126l230M481m0931k6547n8976K5597O9769
$$ 120341 133928 95520 85809 74451 77076 75950 72720 77201 36270 9723 -49253 -23656 46113
9067D6113N559l8086K778r312j3494P6189N5625k7129k8689K2623k174k6218q518
$$ 46113 51672 13586 16364 7052 -6442 69747 125372 98243 69554 92177 90003 63785 55267
9054E5267K1564k9278K3442K9483k5769m8312j2037J0492N5266K376m0662o073
$$ 55267 76831 47553 70995 100478 74709 26397 14360 24852 80118 82494 41832 35759
9042C5759j934j8368m4277K802J09261K3808J536m6770k0595J8619M6414k235
$$ 35759 33825 15457 -28820 -26018 83243 107051 108587 61817 41222 59841 106255 104020
9030A04020M5441j2000l9056m3181k3005o9676l676Q7043j2209p2418K8362O9332
$$ 104020 149461 137461 98405 55224 32219 -37457 -41133 45910 33701 -38717 -10355 58977
9018E8977j9283k9486J9155J7157J5554L4970j8868m2392n410J3153K1512l2486
$$ 58977 39694 10208 29363 46520 62074 97044 78176 35784 30374 43527 65039 32553
9006C2553J8300N371r501L2967L8043o109j8527j2582m5249R700K2028N8142k45
$$ 32553 50853 56224 46723 79690 117733 111624 93097 80515 35266 44966 66994 125136 124891
8993A24891j1145M1356j8342l0113m9185J6778m372n7829l5763K9357J292Q083
$$ 124891 113746 155102 136760 106647 57462 74240 69868 12039 -23724 5633 6925 15008
$$ [...]
##END NTUPLES=NMR SPECTRUM
##END=
