##TITLE=Analysis number 327681
Compound Code km 08350
Book Reference b
Project Code adrs
Chemist Name stores
##JCAMPDX= 6.0         $$ Bruker NMR JCAMP-DX V2.0
##DATA TYPE= NMR SPECTRUM
##DATA CLASS= NTUPLES
##ORIGIN= Bruker BioSpin GmbH
##OWNER= nmr
$$ XWIN-NMR		Version 3.5
$$ Fri Mar 30 12:11:10 2007 GMT Daylight Time (UT+1h)  MAYBRIDGE\nmr@NMR_250MHZ
##.OBSERVE FREQUENCY= 250.131544655141
##.OBSERVE NUCLEUS= ^1H
##.ACQUISITION MODE= SIMULTANEOUS (DQD)
##.ACQUISITION SCHEME= undefined
##.AVERAGES= 16
##.DIGITISER RES= 18
##SPECTROMETER/DATA SYSTEM= dpx250
##.PULSE SEQUENCE= zg30
##.SOLVENT NAME= DMSO
##.SHIFT REFERENCE= (INTERNAL, DMSO, 0, 16.522)
##AUDIT TRAIL= $$ (NUMBER, WHEN, WHO, WHERE, WHAT)
$$ ##TITLE= Audit trail, XWIN-NMR		Version 3.5
$$ ##JCAMPDX= 5.01
$$ ##ORIGIN= Bruker BioSpin GmbH
$$ ##OWNER= nmr
$$ C:\u/data/dgb/nmr/ADRS/2770/pdata/1/auditp.txt
$$ ##AUDIT TRAIL=  $$ (NUMBER, WHEN, WHO, WHERE, WHAT)
(   1,<2007-03-30 12:10:45.86 +100>,<MAYBRIDGE\nmr>,<NMR_250MHZ>,
      <created by zg, POWCHK disabled, PULCHK disabled
       configuration hash MD5:
       49 4B E0 1D 92 C2 6B 37 9F E6 65 BC 52 41 86 1D
       data hash MD5: 64K
       72 CA D6 59 37 BB 43 AF A1 61 51 C5 61 76 90 AB>)
(   2,<2007-03-30 12:11:00.32 +100>,<MAYBRIDGE\nmr>,<NMR_250MHZ>,
      <Start of raw data processing
       ef LB = 0.3 FT_mod = 6 PKNL = 1 SI = 32K 
       data hash MD5: 32K
       BA 1F 2F 4E 4D 53 E0 1A 4E 32 4F E5 52 88 90 BA>)
(   3,<2007-03-30 12:11:01.90 +100>,<MAYBRIDGE\nmr>,<NMR_250MHZ>,
      <apk 
       data hash MD5: 32K
       58 8B 76 CF 90 66 6C 59 86 B0 D3 D2 60 C5 4C 66>)
(   4,<2007-03-30 12:11:02.71 +100>,<MAYBRIDGE\nmr>,<NMR_250MHZ>,
      <abs ABSG = 5 
       data hash MD5: 32K
       91 26 F5 DC E4 1A A5 34 73 C4 49 68 58 26 0D E5>)
$$ ##END=
$$ 
$$ hash MD5
$$ E3 09 CB 73 18 61 FA 1D 15 53 DF 37 FE E6 7F 7C
##$RELAX= 
##$RELAX= 
##$RELAX= 
##$RELAX= 
##$RELAX= 
##$RELAX= 
##$RELAX= 
$$ Bruker specific parameters
$$ --------------------------
##$DU= <C:\u>
##$EXPNO= 2770
##$NAME= <ADRS>
##$PROCNO= 1
##$TYPE= <nmr>
##$USER= <dgb>
##$AMP= (0..31)
100 100 100 100 100 100 100 100 100 100 100 100 100 100 100 100 100 100 
100 100 100 100 100 100 100 100 100 100 100 100 100 100 
##$AQSEQ= 0
##$AQ_mod= 3
##$AUNM= <au_zg>
##$AUTOPOS= <8 >
##$BF1= 250.13
##$BF2= 250.13
##$BF3= 250.13
##$BF4= 250.13
##$BF5= 500.13
##$BF6= 500.13
##$BF7= 500.13
##$BF8= 500.13
##$BYTORDA= 1
##$CFDGTYP= 0
##$CFRGTYP= 5
##$CHEMSTR= <none>
##$CNST= (0..31)
1 1 145 1 1 1 1 1 1 1 1 1 1 1 1 1 1 1 1 1 1 1 1 1 1 1 1 1 1 1 1 1 
##$CPDPRG= <>
##$CPDPRG1= <>
##$CPDPRG2= <>
##$CPDPRG3= <>
##$CPDPRG4= <mlev>
##$CPDPRG5= <mlev>
##$CPDPRG6= <mlev>
##$CPDPRG7= <mlev>
##$CPDPRG8= <mlev>
##$CPDPRGB= <>
##$CPDPRGT= <>
##$D= (0..31)
0 1 0 0 0 0 0 0 0 0.06 0 0 0 0 0 0 0.0002 0 0 0 0 0 0 0 0 0 0 0 0 0 0 
0 
##$DATE= 1175253044
##$DBL= (0..7)
120 120 120 120 120 120 120 120 
##$DBP= (0..7)
150 150 150 150 150 150 150 150 
##$DBP07= 0
##$DBPNAM0= <>
##$DBPNAM1= <>
$$ [...]
##$SUBNAM7= <"">
##$SUBNAM8= <"">
##$SUBNAM9= <"">
##$SW= 20.6930455092707
##$SWIBOX= (0..15)
0 0 3 0 0 0 0 0 0 0 0 0 0 0 0 0 
##$SW_h= 5175.983436853
##$TD= 65536
##$TD0= 1
##$TE= 683.16
##$TE2= 300
##$TE3= 300
##$TEG= 300
##$TL= (0..7)
0 120 120 120 120 120 120 120 
##$TP= (0..7)
150 150 150 150 150 150 150 150 
##$TP07= 0
##$TPNAME0= <>
##$TPNAME1= <>
##$TPNAME2= <>
##$TPNAME3= <>
##$TPNAME4= <>
##$TPNAME5= <>
##$TPNAME6= <>
##$TPNAME7= <>
##$TPOAL= (0..7)
0.5 0.5 0.5 0.5 0.5 0.5 0.5 0.5 
##$TPOFFS= (0..7)
0 0 0 0 0 0 0 0 
##$TUNHIN= 0
##$TUNHOUT= 0
##$TUNXOUT= 0
##$USERA1= <user>
##$USERA2= <user>
##$USERA3= <user>
##$USERA4= <user>
##$USERA5= <user>
##$V9= 5
##$VALIST= <valist>
##$VCLIST= <CCCCCCCCCCCCCCC>
##$VD= 0
##$VDLIST= <DDDDDDDDDDDDDDD>
##$VPLIST= <PPPPPPPPPPPPPPP>
##$VTLIST= <TTTTTTTTTTTTTTT>
##$WBST= 1024
##$WBSW= 4
##$XGAIN= (0..3)
0 0 0 0 
##$XL= 0
##$YL= 0
##$YMAX_a= 397768
##$YMIN_a= -461706
##$ZGOPTNS= <>
##$ZL1= 120
##$ZL2= 120
##$ZL3= 120
##$ZL4= 120
##$ABSF1= 16.522
##$ABSF2= -4.171173
##$ABSG= 5
##$ABSL= 3
##$ALPHA= 0
##$AQORDER= 0
##$ASSFAC= 0
##$ASSFACI= 0
##$ASSFACX= 0
##$ASSWID= 0
##$AUNMP= <proc_1d>
##$AZFE= 0.1
##$AZFW= 0.1
##$BCFW= 0
##$BC_mod= 0
##$BYTORDP= 0
##$COROFFS= 0
##$CY= 12.5
##$DATMOD= 1
##$DC= 0
##$DFILT= <>
##$DTYPP= 0
##$F1P= 14.0000005364418
##$F2P= -0.99999901652339
##$FCOR= 0.5
##$FTSIZE= 32768
##$FT_mod= 6
##$GAMMA= 0
##$GB= 0
##$INTBC= 1
##$INTSCL= 1
##$ISEN= 128
##$LB= 0.3
##$LEV0= 0
##$LPBIN= 0
##$MAXI= 10000
##$MC2= 0
##$MEAN= 0
##$ME_mod= 0
##$MI= 0
##$NCOEF= 0
##$NC_proc= -3
##$NLEV= 6
##$NOISF1= 0
##$NOISF2= 0
##$NSP= 0
##$NTH_PI= 0
##$NZP= 0
##$OFFSET= 16.522
##$PC= 1
##$PHC0= 221.7977
##$PHC1= 6.332049
##$PH_mod= 1
##$PKNL= yes
##$PPARMOD= 0
##$PSCAL= 4
##$PSIGN= 0
##$REVERSE= no
##$SF= 250.13
##$SI= 32768
##$SIGF1= 0
##$SIGF2= 0
##$SINO= 400
##$SIOLD= 32768
##$SREGLST= <1H.DMSO>
##$SSB= 0
##$STSI= 32768
##$STSR= 0
##$SW_p= 5175.98343685301
##$SYMM= 0
##$S_DEV= 0
##$TDeff= 65536
##$TDoff= 0
##$TI= <Analysis number 999999
Compound Code 99
Book Reference 9
Project Code 9>
##$TILT= no
##$TM1= 0
##$TM2= 0
##$TOPLEV= 0
##$USERP1= <user>
##$USERP2= <user>
##$USERP3= <user>
##$USERP4= <user>
##$USERP5= <user>
##$WDW= 1
##$XDIM= 32768
##$YMAX_p= 529369507
##$YMIN_p= -173281
$$ End of Bruker specific parameters
$$ ---------------------------------
##NTUPLES= NMR SPECTRUM
##VAR_NAME=  FREQUENCY,     SPECTRUM/REAL,   SPECTRUM/IMAG
##SYMBOL=    X,             R,               I
##VAR_TYPE=  INDEPENDENT,   DEPENDENT,       DEPENDENT
##VAR_FORM=  AFFN,          ASDF,            ASDF
##VAR_DIM=   32768,         32768,           32768
##UNITS=     HZ,            ARBITRARY UNITS, ARBITRARY UNITS
##FACTOR=    0.157963299565203, 1,           1
##FIRST=     4132.6476996994, 0,             0
##LAST=      -1043.33573715361, 0,           0
##MIN=       -1043.33573715361, -173281,     0
##MAX=       4132.6476996994, 529369507,     0
$$ Real data points
##PAGE= N=1
##DATA TABLE= (X++(R..R)), XYDATA
$$ [...]
$$ plain form
17948 -56001 -36808 -17817 -11824 -21856 -53848 -53531 -42598 -45575 -51653 -57845 -49892 -37744 -18203
17935 -18203 -2647 15221 35886 -5042 -31930 -28521 -22752 -19865 -31291 -30722 -33861 -33837 -25152 -26317
17921 -26317 -26135 -38870 -31777 -7957 20572 21513 28459 33222 9580 -18568 -14071 -10944 -17997 -15326
17907 -15326 -21453 -14514 -6979 542 -7154 -2863 10941 11090 13557 -3187 -18965 -11104 -1611 -17774
17893 -17774 1014 26780 55846 49143 18441 62 -15001 11305 12845 7924 5254 9418 -15834
17880 -15834 -14120 -25336 -13126 -6132 19456 28114 38575 44720 37917 13792 -7716 -13814 -8929
17867 -8929 -9705 -8100 -21975 -40207 -30542 1333 5045 -2843 -3096 12602 17802 -19080 -41982 -49481
17853 -49481 -40486 -28505 -7675 -10773 -3173 -18865 -21704 -27786 -11877 -11452 -38427 -45987 -27181
$$ packed form
17948e6001J9193J8991N993j0032l1992L17J0933k977o078o192P953J2148J9541
17935a8203J5556J7868K0665m0928k6888L409N769K887j1426N69l139K4Q685j165
17921b6317J82j2735P093K3820K8529R41O946M763k3642k8148M497L127p053K671
17907a5326o127O939P535P521p696M291J3804J49K467j6744j5778P861R493j6163
17893a7774J8788K5766K9066o703l0702j8379j5063K6306J540m921k670M164k5252
17880a5834J714j1216J2210O994K5588Q658J0461O145o803k4125k1508o098M885
17867h929p76J605j3875j8232R665L1875L712p888k53J5698N200l6882k2902p499
17853d9481Q995J1981K0830l098P600j5692k839o082J5909M25k6975p560J8806
$$ plain form
17840 -27181 -38101 -50962 -51955 -41376 -25362 -44580 -41877 -24412 -32207 -22834 -27054 -32604 -17399
17827 -17399 -8592 -26373 -40406 -66529 -61154 -21959 -13071 -33110 -60812 -51247 -60420 -51093 -35897
17814 -35897 -20144 12849 6056 -19562 -31313 -32148 -38501 -33066 -6986 9137 12149 22137 10418
17801 10418 18496 12349 10488 35188 32370 11248 26120 48937 -1819 -73209 -77238 -79800 -83391
17788 -83391 -48028 -16171 -22926 -35947 -29420 -25763 -22769 -14999 -26847 -45922 -52933 -22497 -19108
17775 -19108 -39150 -42875 -33003 -6556 10891 9323 -13821 -47359 -45980 -16802 -12555 -38656 -38052
17762 -38052 -34401 -24062 -5530 2993 7909 14129 35041 47078 29432 21823 25206 -180 6525
17749 6525 2641 -16722 4921 17554 -4254 -24097 -8840 31122 34882 13883 -8408 -21855
$$ packed form
17840b7181j0920j2861r93J0579J6014j9218K703J7465p795R373m220n550J5205
17827a7399Q807j7781j4033k6123N375L9195Q888k0039k7702R565r173R327J5196
17814c5897J5753L2993o793k5618j1751q35o353N435K6080J6123L012R988j1719
17801A0418Q078o147j861K4700k818k1122J4872K2817n0756p1390m029k562l591
17788h3391L5363L1857o755j3021O527L657K994P770j1848j9075p011L0436L389
17775a9108k0042l725R872K6447J7447j568k3144l3538J379K9178M247k6101O04
17762c8052L651J0339J8532Q523M916O220K0912J2037j7646p609L383k5386O705
17749F525l884j9363K1643J2633k1808j9843J5257L9962L760k0999k2291j3447
$$ plain form
17737 -21855 -44703 -52651 -34684 -16462 -34148 -52061 -37038 -22552 -10406 -41220 -43946 -38580
17725 -38580 -25449 -38762 -30018 -4164 12170 2034 -19402 -46570 -47799 -30451 -31485 -30306
17713 -30306 -26171 -7199 -6184 -8355 -15206 -27437 -28445 -33129 -11582 -23568 -24966 -45037 -50532
17700 -50532 -57055 -63228 -77942 -73831 -47013 -51634 -33013 -22250 -24456 -31033 -3693 11091 229
17687 229 -13785 -10702 -13962 -878 -19273 -29018 -37969 -16692 8363 25315 -794 -21380 -8331
17674 -8331 -7091 -9762 -18110 -23716 3803 3924 -824 -1492 -16817 -26662 1237 37753 54182 40831
17660 40831 13558 -12149 -47567 -20624 12371 26121 28663 24711 18448 11633 -3672 -30067
17648 -30067 -27435 -19566 -41067 -45786 -49449 -49329 -36436 -54466 -38356 -8037 10375 -9553 -44083
$$ packed form
17737b1855k2848p948J7967J8222j7686j7913J5023J4486J2146l0814k726N366
17725c8580J3131j3313Q744K5854J6334j0136k1436k7168j229J7348j034J179
17713c0306M135J8972J015k171o851j2231j008m684K1547j1986j398k0071n495
17700e0532o523o173j4714M111K6818m621J8621J0763k206o577K7340J4784j0862
17687B29j4014L083l260J3084j8395r745q951K1277K5055J6952k6109k0586J3049
17674h331J240k671q348n606K7519J21m748o68j5325r845K7899L6516J6429j3351
17660D0831k7273k5707l5418K6943L2995J3750K542l952o263o815j5305k6395
17648c0067K632P869k1501m719l663J20J2893j8030J6110L0319J8412j9928l4530
$$ plain form
17635 -44083 -24893 -86 1805 -47712 -51087 -35759 -21301 -10870 -38145 -36271 -39459 -15872
17623 -15872 4369 6953 -20438 -57754 -55430 -33365 -7339 -2835 -9799 -5535 -23897 -19018 -22629
17610 -22629 -11644 -13475 -34304 -32192 -34831 -35582 -44833 -26184 -13782 -5978 2936 18866 -5441
17597 -5441 -26825 -32728 -10318 7737 11325 5092 5694 4658 -11856 -52567 -65500 -47526 -5675
17584 -5675 -8408 -21615 -14841 -12045 -33473 -23385 -6280 -1159 -3724 -2725 10071 -1303 3510
17571 3510 21453 49631 31595 4211 -49781 -35496 -35272 -29755 -25314 -9592 -8083 -7280 -7849 13772
17557 13772 15008 18934 23839 26501 23616 25431 8697 16884 -12660 -37274 -20850 -6354 -18853
17544 -18853 -26049 -28642 -35068 -46874 -55396 -49715 -30274 8127 20605 33833 39977 42577 25613
$$ packed form
17635d4083J9190K4807J891m9517l375J5328J4458J0431k7275J874l188K3587
17623a5872K0241K584k7391l7316K324K2065K6026M504o964M264j8362M879l611
17610b2629J0985j831k0829K112k639p51r251J8649J2402P804Q914J5930k4307
17597e441k1384n903K2410J8055L588o233O02j036j6514m0711j2933J7974M1851
17584e675k733j3207O774K796k1428J0088J7105N121k565R99J2796j1374M813
17571C510J7943K8178j8036k7384n3992J4285K24N517M441J5722J509Q03n69K1621
17557A3772J236L926M905K662k885J815j6734Q187k9544k4614J6424J4496j2499
17544a8853p196k593o426j1806q522N681J9441L8401J2478J3228O144K600j6964
$$ plain form
17531 25613 38827 34267 -858 -1922 11594 16440 -19837 -36604 -24101 -17261 -15209 -16396 17673
17518 17673 37483 31174 -8211 -33914 -25216 -20818 -22842 -5014 -2539 -15108 -12616 -21299 -41273
17505 -41273 -46129 -35057 -32486 -26059 -14471 7419 5349 2212 7504 -13936 -33624 -20482 -12065
17492 -12065 -13858 -38985 -50900 -20864 12588 30895 27781 30980 22992 16623 -3861 -33016 -36293
17479 -36293 -24919 -26551 -37825 -22607 -796 15856 21290 19055 20982 24695 15539 2869 -15064
17466 -15064 -18608 -20573 -32573 -32124 -41754 -60637 -48959 -14356 -13599 -9355 2400 17382 -10269
17453 -10269 -15657 -14140 1925 9385 -4461 8833 2166 9609 -5348 -26908 -42024 -13585 10993
17440 10993 -22098 -33637 -44913 -44017 -63898 -29040 21132 12028 5899 -2668 -9828 8227 18579
$$ packed form
17531B5613J3214m560l5125j064J3516M846l6277j6767J2503O840K052j187L4069
17518A7673J9810o309l9385k5703Q698M398k024J7828K475j2569K492q683j9974
17505d1273m856J1072K571O427J1588K1890k070l137N292k1440j9688J3142Q417
17492a2065j793k5127j1915L0036L3452J8307l114L199p988o369k0484k9155l277
17479c6293J1374j632j1274J5218K1811J6652N434k235J927L713r156j2670j7933
17466a5064l544j965j2000M49r630j8883J1678L4603P57M244J1755J4982k7651
17453a0269n388J517J6065P460j3846J3294o667P443j4957k1560j5116K8439K4578
17440A0993l3091j1539j1276Q96j9881L4858N0172r104o129q567p160J8055J0352
$$ plain form
17427 18579 25125 -1657 5994 32404 44728 10459 -22577 417 2583 11646 8817 361 -29343
17414 -29343 -9641 -16569 -21585 -12189 -19403 -36088 -16059 36598 55451 44500 32768 -2092
17402 -2092 -4068 6659 5046 -14919 -26206 -30610 -28415 -34797 -47040 -53037 -35424 -22953 -32080
17389 -32080 -29485 -19546 -9525 -8585 -31114 -49278 -36893 -21349 -34717 -38758 -18572 3221 -9520
17376 -9520 -25609 -51417 -24051 19537 15943 18278 17699 16438 4538 8315 11306 -1324 7853
17363 7853 19418 -8603 -697 20166 20483 27803 17902 13577 -11669 -7081 -5895 -15187 448 10271
17349 10271 12091 2419 -6145 12863 15970 9021 10567 8770 2082 -14539 -3121 23463 -11734
17336 -11734 -41178 -37302 -2692 23654 5735 8047 23804 13141 20919 8129 -6497 -19633
$$ packed form
17427A8579O546k6782P651K6410J2324l4269l3036K2994K166R063k829q456k9704
17414b9343J9702o928n016R396p214j6685K0029N2657J8853j0951j1732l4860
17402b092j976J0727j613j9965j1287m404K195o382j2243n997J7613J2471r127
17389c2080K595R939J0021R40k2529j8164J2385J5544j3368m041K0186K1793j2741
17376i520j6089k5808K7366M3588l594K335n79j261j1900L777K991j2630R177
17363G853J1565k8021P906K0863L17P320r901m325k5246M588J186r292J5635R823
17349A0271J820r672q564J9008L107o949J546j797o688j6621J1418K6584l5197
17336a1734k9444L876L4610K6346j7919K312J5757j0663P778j2790j4626j3136
$$ plain form
17324 -19633 -30517 -29749 -20207 -30918 -31050 -35322 -7280 -9585 -35475 -14420 9815 5824 -325
17311 -325 -2985 10001 4495 -23320 -35594 -35702 -25427 -21838 -17585 -18868 -14277 -4764 -14989 -26927
17297 -26927 -29623 -35720 -25214 -10674 -632 14306 3360 4485 7663 -1827 5953 22392 6450
17284 6450 -1800 8528 34369 36811 15272 -3995 -12729 11628 14394 -15531 -21849 -1878 -9112
17271 -9112 -1804 -10670 -47791 -68429 -87288 -89288 -58173 -38655 -22941 3359 10185 -13665 -26948
17258 -26948 -40211 -37512 -34204 -39731 -65056 -75111 -59251 -58102 -59466 -48900 -20820 -1759 -2140
17245 -2140 -19534 -18566 -9751 -9920 -9775 -8599 -23885 -12912 -10574 -20344 -8242 -7506 -12179 -5735 -16195
17230 -16195 -23844 -10911 10635 -13633 -41027 -67128 -38035 -9627 -32050 -21166 -7127 -7443
$$ packed form
17324a9633j0884P68R542j0711j32m272K8042k305k5890K1055K4235l991o149
17311c25k660J2986n506k7815j2274j08J0275L589M253j283M591R513j0225j1938
17297b6927k696o097J0506J4540J0042J4938j0946J125L178r490P780J6439j5942
17284F450q250J0328K5841K442k1539j9267q734K4357K766k9925o318J9971p234
17271i112P308q866l7121k0638j8859k000L1115J9518J5714K6300O826k3850j3283
17258b6948j3263K699L308n527k5325j0055J5860J149j364J0566K8080J9061l81
17245b140j7394R68Q815j69J45J176j5286J0973K338r770J2102P36m673O444j0460
17230a6195p649J2933K1546k4268k7394k6101K9093K8408k2423J0884J4039l16
$$ plain form
17218 -7443 -42835 -44840 -13058 -26949 -44015 -54457 -44186 -17590 -22173 -33138 -35933 -44405 -68881
17205 -68881 -56910 -25165 -38586 -34194 -25508 -23939 -22852 -9112 13573 5849 -41289 -57918 -38372
17192 -38372 -11090 9308 35026 27230 -18703 -40562 -26035 -44940 -36580 -18165 -10533 -11779
17180 -11779 -3611 1388 -6079 -32538 -33408 -21668 -11491 -11910 -29377 -43552 -46081 -57933 -44950
17167 -44950 -41034 -57967 -73093 -37434 -1076 6386 -6750 -1733 -20104 -18963 11845 24166
17155 24166 29637 9659 -2150 -13945 -38775 -13637 -16155 -48572 -34675 -28540 -38807 -37783
17143 -37783 -12983 4939 3939 -13775 -12032 3090 -11770 -12151 -28555 -26356 -41265 -43555 -32809
17130 -32809 -13786 -21270 -28043 -16213 -1174 -9280 -20441 -14540 -23253 -12378 -13898 -35242 -40598
$$ packed form
17218g443l5392k005L1782j3891j7066j0442J0271K6596m583j0965k795q472k4476
17205f8881J1971L1745j3421M392Q686J569J087J3740K2685p724m7138j6629J9546
17192c8372K7282K0398K5718p796m5933k1859J4527j8905Q360J8415P632j246
17180a1779Q168M999p467k6459q70J1740J0177m19j7467j4175k529j1852J2983
17167d4950L916j6933j5126L5659L6358P462j3136N017j8371J141L0808J2321
17155B4166N471j9978j1809j1795k4830K5138k518l2417J3897O135j0267J024
17143c7783K4800J7922j000j7714J743J5122j4860l81j6404K199j4909k290J0746
17130c2809J9023p484o773J1830J5039q106j1161N901q713J0875j520k1344n356
$$ plain form
17117 -40598 -31920 -18646 -11753 -28292 -29671 -45350 -35972 -29546 -35318 -21159 -1147 -9550 -17691
17104 -17691 -26190 -24629 -39766 -39714 -12944 2984 19004 5869 -20822 -20872 -24294 -33430 -24995 -27403
17090 -27403 -7299 13301 25287 28945 25990 24754 16232 7369 20012 7253 -19660 -23965 -13682
17077 -13682 -6273 21432 41251 16434 9873 -5744 -13398 -22342 -18333 -11986 -10142 -7073 24299
17064 24299 31107 28146 42637 35880 1816 -29110 -35235 -43908 -13869 -1842 -24210 -37302 -50612
17051 -50612 -58291 -59525 -48113 -39065 -57018 -46314 -39982 -39253 -43272 -46243 -7431 27884 19100
17038 19100 -4326 -18391 -17463 -41320 -27947 11289 31795 21902 23400 -7317 -15171 -13399 -24386
17025 -24386 -15210 -4872 -728 6452 536 -12370 37114 58535 19179 8962 -23475 -37879
$$ packed form
17117d0598Q678J3274O893j6539j379j5679R378O426n772J4159K0012q403q141
17104a7691q499J561j5137N2K6770J5928J6020j3135k6691n0l422r136Q435k408
17090b7403K0104K0600J1986L658k955j236q522q863J2643j2759k6913m305J0283
17077a3682P409K7705J9819k4817o561j5617p654q944M009O347J844L069L1372
17064B4299O808k961J4491o757l4064l0926o125q673L0039J2027k2368j3092j3310
17051e0612p679j234J1412R048j7953J0704O332P29m019k971L8812L5315q784
17038A9100k3426j4065R28k3857J3373L9236K0506r893J498l0717p854J772j0987
17025b4386R176J0338M144P180n916j2906M9484K1421l9356j0217l2437j4404
$$ plain form
17013 -37879 -16881 2780 -2558 -12203 -23899 -28024 -6273 -24052 -29397 -4323 19955 7462
17001 7462 -11711 -23535 -38717 -62692 -93303 -82993 -49272 -31879 -26501 -18761 2385 -16950
16989 -16950 -23902 -40191 -45055 -37892 -24895 -22685 -16534 12179 12302 5954 -5673 -41996 -34850
16976 -34850 -5140 4312 -321 4801 -9685 -5353 -7755 -21917 -22531 -6435 3211 -12316 -10679
16963 -10679 3310 16304 9930 8308 5406 30081 2858 -14005 -22398 -18973 -28649 -23501 3514
16950 3514 28004 32156 29915 28621 2452 4248 1931 -1025 -8913 -1344 10876 4640 7837 30431
16936 30431 45455 19191 32494 40952 51383 54080 47393 26478 -9061 7894 4368 2215 -17294
16923 -17294 -52659 -59638 -28886 -10495 8851 -8965 -29548 -20483 -8560 24715 45281 54393
$$ packed form
17013c7879K0998J9661n338r645j1696m125K1751j7779n345K5074K4278j2493
17001G462j9173j1824j5182k3975l0611J0310L3721J7393N378P740K1146j9335
16989a6950o952j6289m864P163J2997K210O151K8713J23o348j1627l6323P146
16976c4850K9710R452m633N122j4486M332k402j4162o14J6096R646j5527J637
16963a0679J3989J2994o374j622k902K4675k7223j6863q393L425r676N148K7015
16950C514K4490M152k241j294k6169J796k317k956p888P569J2220o236L197K2594
16936C0431J5024k6264J3303Q458J0431K697o687k0915l5539J6955l526k153j9509
16923a7294l5365o979L0752J8391J9346j7816k0583R065J1923L3275K0566R112
$$ plain form
16911 54393 38373 14756 9146 23356 13919 -21122 -10010 10346 30434 48310 61421 45954
16899 45954 5571 -191 3487 4910 56 4451 -4419 -30082 -29660 4478 -24 -31104 -30429 -12455
16885 -12455 -26250 -36692 -33065 -41470 -19051 9926 24716 2436 1637 -2192 -21667 -35990 -34491
16872 -34491 -33979 -16854 -2664 8892 -3243 3843 25852 8554 1068 -7071 19179 -17466 -11943
16859 -11943 -7017 -3120 29439 12214 5957 -7594 1645 -18947 -38631 -31856 -10038 -2536 -4099
16846 -4099 1674 9157 3160 -6631 -13670 -7824 26840 22905 9133 2661 8580 -505 3189 -3558
16832 -3558 -7039 -5690 -23303 -35549 -9844 5933 7634 -22974 -48687 -52776 -35102 -34705 -31156
16819 -31156 -20319 -23990 -26593 -25956 -36475 -41496 -45689 -29082 -9080 -20283 -47487 -62488 -52715
$$ packed form
16911E4393j6020k3617n610J4210r437l5041J1112K0356K0088J7876J3111j5467
16899D5954m0383n762L678J423m854M395q870k5663M22L4138m502l1080O75J7974
16885a2455j3795j0442L627q405K2419K8977J4790k2280p99l829j9475j4323J499
16872c4491N12J7125J4190J1556j2135P086K2009j7298p486q139K6250l6645N523
16859a1943M926L897L2559j7225o257j3551R239k0592j9684O775K1818P502j563
16846d099N773P483n997r791p039N846L4664l935j3772o472N919r085L694o747
16832c558l481J349j7613j2246K5705J5777J701l0608k5713m089J7674L97L549
16819c1156J0837l671k603O37j0519n021m193J6607K0002j1203k7204j5001R773
$$ plain form
16806 -52715 -43646 -19410 -3721 -10131 -18299 -12444 -3584 -2962 6691 -26672 -46333 -41953 -42646 -44283
16792 -44283 -38879 -29292 -12010 5019 14341 -3717 1098 11516 28925 40129 62569 51079
16780 51079 22917 9370 22822 20822 11298 6048 1182 -8467 -16508 -28067 -10017 -10895 -6681
16767 -6681 10979 14121 32371 24044 -1159 3604 15669 4221 2628 12770 12301 -4899 -6068
16754 -6068 -19407 -36667 -16545 -6108 18481 11108 -6390 -7354 -10378 -7697 11853 -8115 -29576
16741 -29576 -23449 -584 1834 -4737 -13599 -22579 -10054 -6223 -32746 -6551 -25602 2455 25011
16728 25011 17015 -7455 -6676 -10114 4346 1206 -2615 -14322 849 -4499 -5740 -15013 -13749 -10094
16714 -10094 -43 27483 31791 19651 221 4331 -3904 4238 11028 8680 -456 -4175 -11196
$$ packed form
16806e2715R069K4236J5689o410q168N855Q860O22R653l3363j9661M380o93j637
16792d4283N404R587J7282J7029R322j8058M815J0418J7409J1204K2440j1490
16780E1079k8162j3547J3452k000r524n250m866r649q041j1559J8050q78M214
16767f681J7660L142J8250q327k5203M763J2065j1448j593J0142m69j7200j169
16754f068j3339j7260K0122J0437K4589p373j7498r64l024K681J9550j9968k1461
16741b9576O127K2865K418o571q862q980J2525L831k6523K6195j9051K8057K2556
16728B5011p996k4470P79l438J4460l140l821j1707J5171n348j241r273J264L655
16714a0094J0051K7526M308j2140j9430M110q235Q142O790k348r136l719p021
$$ plain form
16701 -11196 -17971 8642 20181 13522 2797 -2442 -6506 -3345 12672 35026 27930 22837 13810
16688 13810 958 4164 3218 2681 -2097 -1017 -16280 -14924 -1616 -14660 -6779 29902 47964
16675 47964 33089 25912 32610 47685 22850 5080 11380 5794 20271 5392 804 10930 7127
16662 7127 -21264 -17317 13314 27515 8256 -19517 -30918 -9120 4817 6883 10118 1107 7793
16649 7793 23931 24813 5008 944 9202 16943 18177 9297 8985 6097 3735 7962 -4360 1172
16635 1172 10456 17984 19705 -14295 -23091 -36141 -39611 -32872 -31863 -22893 -11138 -15682 -11101 -7261
16621 -7261 -16932 -20453 5606 -2906 2062 30619 44168 8643 3406 15308 35855 13404 2285
16608 2285 7789 22148 38826 29416 10255 25082 7111 16480 -1702 12210 47048 56580 53489
$$ packed form
16701a1196o775K6613J1539o659j0725n239m064L161J6017K2354p096n093r027
16688A3810j2852L206r46n37m778J080j5263J356J3308j3044P881L6681J8062
16675D7964j4875p177O698J5075k4835j7770O300n586J4477j4879m588J0126l803
16662G127k8391L947L0631J4201j9259k7773j1401K1798J3937K066L235r011O686
16649G793J6138Q82j9805m064Q258P741J234q880l12k888k362M227j2322N532
16635A172R284P528J721l4000q796j3050l470O739J009Q970J1755m544M581L840
16621g261r671l521K6059q512M968K8557J3549l5525n237J1902K0547k2451j1119
16608B285N504J4359J6678r410j9161J4827j7971R369j8182J3912L4838R532l091
$$ plain form
16595 53489 51466 32532 11539 20304 134 8041 38087 41982 42946 23365 4349 -1025 20151
16582 20151 17883 -31030 -60108 -31073 -9031 1838 177 -64 -9865 20711 21390 20356 -56
16569 -56 -31046 -38758 -14029 5992 -19454 -32018 -39381 1123 18214 3586 -3332 -17398 -27065
16556 -27065 -56885 -75024 -56787 -30780 -14929 -2091 929 -29951 -46821 -35865 -10343 2126
16544 2126 38727 47589 27565 2603 11138 -11662 -4025 21289 32123 33385 11323 16338 14725
16531 14725 -12078 -15029 3425 10513 16736 -9050 -5863 25532 15219 11341 -4479 -27986 -44861
16518 -44861 -58335 -59739 -69577 -55596 -22481 -17007 -15329 -11437 570 -24292 -40929 -34098 -11812
16505 -11812 -25054 -24122 -4140 -14603 -28380 -33495 -38117 -30009 15411 19590 787 -18564 -35613
$$ packed form
16595E3489k023j8934k0993Q765k0170P907L0046L895R64j9581j9016n374K1176
16582B0151k268m8913k9078K9035K2042J0869j661k41r801L0576O79j034k0412
16569e6l0990p712K4729K0021k5446j2564p363M0504J7091j4628o918j4066r667
16556b7065k9820j8139J8237K6007J5851J2838L020l0880j6870J0956K5522J2469
16544B126L6601Q862k0024k4962Q535k2800P637K5314J0834J262k2062N015j613
16531A4725k6803k951J8454P088O223k5786L187L1395j0313l878j5820k3507j6875
16518d4861j3474j404r838J3981L3115N474J678L892J2007k4862j6637O831K2286
16505a1812j3242R32J9982j0463j3777n115m622Q108M5420M179j8803j9351j7049
$$ plain form
16492 -35613 -26358 10265 20574 11637 -13287 -24226 -23599 -4307 37482 59121 34643 10802
16480 10802 -8117 8171 21538 654 -5213 7860 19873 14274 5304 -709 -12831 -22558 -43968
16467 -43968 -28902 -35128 -20579 -14628 -12073 6345 -8327 -28285 -30076 -31567 1819 15281 7327
16454 7327 5129 -10489 -31053 -47608 -33047 -32463 -17561 1086 23672 34030 13277 6148 1304
16441 1304 7423 -18101 -25614 -9379 7686 24381 24375 44750 35153 40532 36621 15198 10343 37555
16427 37555 38165 58726 47651 27909 31663 31200 4800 -14540 -8678 -21767 -15378 532 11294
16414 11294 31962 39020 7577 -18897 -11227 -13360 -7317 7333 8851 16844 39693 36760 -1128
16401 -1128 -3483 14915 19986 20117 25982 38760 32249 10022 4558 8297 9989 1673 -5069 -11062
$$ packed form
16492c5613R255L6623J0309q937k4924j0939O27J9292M1789K1639k4478k3841
16480A0802j8919J6288J3367k0884n867J3073J2013n599q970o013j2122r727k1410
16467d3968J5066o226J4549N951K555J8418j4672j9958j791j491L3386J3462p954
16454G327k198j5618k0564j6555J4561N84J4902J8647K2586J0358k0753p129m844
16441A304O119k5524p513J6235J7065J6695oK0375r597N379l911k1423m855K7212
16427C7555O10K0561j1075j9742L754m63k6400j9340N862j3089O389J5910J0762
16414A1294K0668P058l1443k6474P670k133O043J4650J518P993K2849k933l7888
16401a128k355J8398N071J31N865J2778o511k2227n464L739J692q316o742n993
$$ plain form
16387 -11062 -18250 -6606 -9897 -32657 -34448 -1764 17230 27854 45227 17054 -24082 12226
16375 12226 41397 -1165 -10323 -27670 -39987 -22163 -8891 -4934 8572 24230 12438 -16315
16363 -16315 -7684 -2608 -10391 -1626 7900 3843 -18601 -17698 -11231 568 1066 16756 2833 11213
16349 11213 7386 -12836 -37094 -21835 -8233 4417 31055 34079 30524 18919 19416 4028 6697
16336 6697 888 -41905 -44413 -15021 20566 44059 35321 44907 14734 4862 -3820 9173 21295
16323 21295 23984 33601 8541 -51953 -50252 -35092 -19234 -3849 -14147 -36201 -62360 -51834
16311 -51834 -41762 -37289 -5368 16980 28857 44381 48821 19955 -207 333 19066 35793
16299 35793 31023 14856 33889 42244 28562 9233 -13281 -22782 -42386 -17563 7343 -10719
$$ packed form
16387a1062p188J1644l291k2760j791L2684J8994J0624J7373k8173m1136L6308
16375A2226K9171m2562r158j7347j2317J7824J3272L957J3506J5658j1792k8753
16363a6315Q631N076p783Q765R526m057k2444R03O467J1799M98J5690j3923Q380
16349A1213l827k0222k4258J5259J3602J2650K6638L024l555j1605M97j5388K669
16336F697n809m2793k508K9392L5587K3493q738R586l0173r872q682J2993J2122
16323B1295K689R617k5060o0494J701J5160J5858J5385j0298k2054k6159J0526
16311e1834J0072M473L1921K2348J1877J5524M440k8866k0162N40J8733J6727
16299C5793m770j6167J9033Q355j3682j9329k2514r501j9604K4823K4906j8062
$$ plain form
16287 -10719 -6880 2715 -628 22130 16809 -1639 -10473 -14191 -8241 -15483 -6318 26559 10413
16274 10413 -2676 2942 33525 30244 4661 -16649 -6688 33570 25258 34792 37450 32553 3171
16261 3171 -838 -26907 -37129 -31163 -6921 7871 3486 22476 2778 920 9170 6282 20112
16248 20112 6743 -38284 -54506 -24112 8168 32113 7273 -21719 -25998 -19921 -17948 -7313
16236 -7313 -7405 13027 37311 15350 19406 -18056 -44420 -10155 1040 1276 2199 38417 53062
16223 53062 25704 4790 4323 24479 58972 74617 50457 31730 32832 24080 -1979 117 21388
16210 21388 37864 18649 14107 -12883 -4630 17569 35966 29201 44077 25956 16093 -963
16198 -963 -2892 11894 35543 37300 14312 11089 25178 16926 5582 4654 12186 33701 40711 44399
$$ packed form
16287a0719L839R595l343K2758n321j8448q834l718N950p242R165L2877j6146
16274A0413j3089N618L0583l281k5583k1310R961M0258q312R534K658m897k9382
16261C171m009k6069j0222N966K4242J4792m385J8990j9698j858Q250k888J3830
16248B0112j3369m5027j6222L0394L2280K3945k4840k8992m279O077J973J0635
16236g313r2K0432K4284k1961M056l7462k6364L4265J1195K36R23L6218J4645
16223E3062k7358k0914m67K0156L4493J5645k4160j8727J102q752k6059K096K1271
16210B1388J6476j9215m542k6990Q253K2199J8397o765J4876j8121r863j7056
16198i63j929J4786K3649J757k2988l223J4089q252j1344r28P532K1515P010L688
$$ plain form
16184 44399 17575 -420 -14912 -5709 2183 3368 4012 -9527 -8057 7759 1878 -2556 -17793
16171 -17793 -12440 9295 10033 -2703 -5203 28428 33070 15434 30547 21846 19591 17041 8915
16158 8915 25515 28074 34154 5293 5349 2572 13884 25407 3134 3786 28109 31084 24941 44335
16144 44335 62016 62762 60507 61815 27081 11527 -8366 5533 8982 9330 14945 19880 43538
16131 43538 59383 59768 54517 55097 61524 61096 36585 -9680 -29860 -22301 -2970 -7814 6990 23643
16117 23643 15708 -3084 -5960 -2050 13139 22644 21104 41800 71877 63465 34632 23577 15449
16104 15449 43247 38790 40837 32970 -2401 -10903 -7050 4184 5989 -30248 -41369 7687 29221
16091 29221 8689 354 25570 53282 23620 4801 5597 23787 20804 -1641 -5021 25300 38316
$$ packed form
16184D4399k6824j7995j4492R203P892J185O44j3539J470J5816n881m434j5237
16171a7793N353K1735P38j2736k500L3631M642j7636J5113q701k255k550q126
16158H915J6600K559O080k8861N6k777J1312J1523k2273O52K4323K975o143J9394
16144D4335J7681P46k255J308l4734j5554j9893J3899L449L48N615M935K3658
16131D3538J5845L85n251N80O427m28k4511m6265k0180P559J9331m844J4804J6653
16117B3643p935j8792k876L910J5189R505j540K0696L0077q412k8833j1055q128
16104A5449K7798m457K047p867l5371q502L853J1234J805l6237j1121M9056K1534
16091B9221k0532q335K5216K7712k9662j8819P96J8190k983k2445l380L0321J3016
$$ plain form
16078 38316 34269 1517 -17109 -42566 -9960 16792 14904 18071 20241 42012 51593 46917 28456
16065 28456 24 -4308 -7797 11995 29151 36872 55285 76724 54826 30942 21724 1883
16053 1883 -648 12783 15833 31454 43321 35258 21859 24493 1436 10176 38543 44214 45428
16040 45428 28315 10805 15645 41277 67649 55773 48735 64138 62713 47538 54317 54803 44274
16027 44274 53189 66605 75627 83366 87096 65663 52306 29117 32092 19126 22219 56014 51358
16014 51358 20943 22504 10372 31732 36261 26124 31253 48678 42769 20788 32654 33017 13468
16001 13468 -17627 -1765 24550 35644 48729 29332 11836 -30161 -33779 -22967 -1607 11677
15989 11677 5835 9008 24679 33516 12947 18359 28441 35683 52950 34803 38087 42694 32256
$$ packed form
16078C8316m047l2752j8626k5457L2606K6752j888L167K170K1771R581m676j8461
16065B8456k8432m332l489J9792J7156P721J8413K1439k1898k3884r218j9841
16053A883k531J3431L050J5621J1867q063j3399K634k3057Q740K8367N671J214
16040D5428j7113j7510M840K5632K6372j1876p038J5403j425j5175O779M86j0529
16027D4274Q915J3416R022P739L730k1433j3357k3189K975j2966L093L3795m656
16014E1358l0415J561j2132K1360M529j0137N129J7425n909k1981J1866L63j9549
16001A3468l1095J5862K6315J1094J3085j9397j7496m1997l618J0812K1360J3284
15989A1677n842L173J5671Q837k0569N412J0082P242J7267j8147L284M607j0438
$$ plain form
15976 32256 18719 68994 103470 102966 86973 65885 54759 61274 59795 77468 66742 85235
15964 85235 85519 73256 87590 96293 63969 55116 65112 93639 74551 80874 119381 159616 159580
15951 159580 160423 164048 171450 201295 230431 294247 356383 413685 514959 626464 747782 936175
15939 936175 1086484 1212964 1307423 1326298 1318560 1276178 1211531 1142167 1033362 900584 755944
15928 755944 616468 479971 380304 293128 225777 180249 164056 152714 137890 126455 120892
15917 120892 92290 83425 102241 133803 140611 124318 102323 124217 133770 136454 147770 135783
15905 135783 116190 134812 140301 133250 112874 108542 98122 114813 110307 80459 90057 112179
15893 112179 87975 29446 5892 30558 63737 72314 80218 100958 127669 112546 80837 52420
$$ packed form
15976C2256j3537N0275L4476n04j5993k1088j1126O515j479J7673j0726J8493
15964H5235K84j2263J4334Q703l2324q853R996K8527j9088O323L8507M0235l6
15951A59580Q43L625P402K9845K9136O3816O2136N7302J01274J11505J21318J88393
15939I36175J50309J26480R4459J8875p738m2382o4647o9364j08805j32778j44640
15928G55944j39476j36497r9667q7176o7351m5528j6193j1342j4824j1435n563
15917A20892k8602q865J8816L1562O808j6293k1995K1894R553K684J1316j1987
15905A35783j9593J8622N489p051k0376m332j0420J6691m506k9848R598K2122
15893A12179k4204n8529k3554K4666L3179Q577P904K0740K6711j5123l1709k8417
$$ plain form
15881 52420 49773 72304 55516 54079 83638 104376 92809 98680 128558 124689 105860 70410
15869 70410 79720 97079 61153 69667 98379 85825 74845 48832 70042 72957 48103 51695
15857 51695 79002 98739 108144 102079 83640 72253 95655 96366 97072 92074 95796 105876 74267
15844 74267 48267 72067 83429 75635 92539 100941 118441 110196 128934 125977 100627 84441
15832 84441 81967 84434 98038 113035 120859 128019 114818 127982 147919 155355 162454 172101 195144
15819 195144 218534 230814 248846 267311 334796 384876 419011 456590 552637 631448 783031
15808 783031 1008637 1309309 1714685 2175429 2560775 2879448 3151704 3336990 3388707 3283914
15798 3283914 3053729 2777324 2423715 2018627 1582236 1212407 967997 805828 667213
$$ packed form
15881E2420k647K2531j6788j437K9559K0738j1567N871K9878l869j8829l5450
15869G0410R310J7359l5926Q514K8712j2554j0980k6013K1210K915k4854L592
15857E1695K7307J9737R405o065j8439j1387K3402P11P06m998L722J0080l1609
15844G4267k6000K3800J1362p794J6904Q402J7500q245J8738k957k5350j6186
15832H4441k474K467J3604J4997P824P160j3201J3164J9937P436P099R647K3043
15819A95144K3390J2280J8032J8465O7485N0080L4135L7579R6047P8811J51583
15808G83031K25606L00672M05376M60744L85346L18673K72256J85286N1717j04793
15798C283914k30185k76405l53609m05088m36391l69829k44410j62169j38615
$$ plain form
15789 667213 568070 489146 422365 344406 301787 261406 234750 228464 204123 156114 125584 143399
15777 143399 141432 118085 124817 121080 109439 125834 135536 130180 121767 127829 130271 155529 157532
15764 157532 142112 140171 108642 118643 141088 143744 135755 126252 141561 142132 127932 145228 147998
15751 147998 123250 98745 98715 63763 61987 94224 105995 110319 105211 121780 139128 191987 243071
15738 243071 231552 174224 154938 146986 101292 78762 86346 82422 106163 111646 112722 97995
15726 97995 88894 77356 68850 89949 99928 102514 90042 127637 122211 105713 81933 86642 123124
15713 123124 150437 155686 175741 151139 179743 211959 209691 226492 265624 265511 264975 255691 285905
15700 285905 293657 270492 246259 237481 238202 213207 192226 174826 129936 109196 81480 61527
$$ packed form
15789F67213r9143p8924o6781p7959m2619m0381k6656o286k4341m8009l0530J7815
15777A43399j967k3347O732l737j1641J6395R702n356q413O062K442K5258K003
15764A57532j5420j941l1529J0001K2445K656p989r503J5309N71j4200J7296K770
15751A47998k4748k4505l0l4952j776L2237J1771M324n108J6569J7348N2859N1084
15738B43071j1519n7328j9286p952m5694k2530P584l924K3741N483J076j4727
15726I7995r101j1538q506K1099R979K586j2472L7595n426j6498k3780M709L6482
15713A23124K7313N249K0055k4602K8604L2216k268J6801L9132j13n36r284L0214
15700B85905P752k3165k4233q778P21k4995k0981j7400m4890k0740k7716j9953
$$ plain form
15688 61527 68603 81581 80685 83148 96311 122832 113175 79891 70876 83826 105609 91764 85852
15675 85852 109240 141310 167232 132451 104403 107388 124981 112890 101847 104284 116828 118278
15663 118278 124873 121365 98127 77277 66462 56925 62059 92577 105643 89493 86346 92690 76863
15650 76863 75977 96140 122536 109366 112994 104719 93451 101306 113570 121277 113378 107593 110804
15637 110804 120279 127563 139837 140847 139228 126763 153250 142421 146096 162857 176449 193635
15625 193635 206155 188080 183336 187483 186371 179971 158152 144365 147799 148967 166040 159943 174378
15612 174378 199644 179496 160557 175897 183801 172932 155175 139909 111680 85138 89781 95426
15600 95426 98151 114698 127473 121257 127542 147915 139052 150063 176352 182607 160994 173778 186794
$$ packed form
15688F1527P076J2978q96K463J3163K6521r657l3284r015J2950K1783j3845n912
15675H5852K3388L2070K5922l4781k8048K985J7593j2091j1043K437J2544J450
15663A18278O595l508k3238k0850j0815r537N134L0518J3066j6150l147O344j5827
15650G6863q86K0163K6396j3170L628q275j1268P855J2264P707p899n785L211
15637A10804R475P284J2274J010j619j2465K6487j0829L675J6761J3592J7186
15625A93635J2520j8075m744M147j112o400k1819j3787L434J168J7073o097J4435
15612A74378K5266k0148j8939J5340P904j0869j7757j5266k8229k6542M643N645
15600I5426K725J6547J2775o216O285K0373q863J1011K6289O255k1613J2784J3016
$$ plain form
15587 186794 192850 213557 206902 199453 236221 253533 259279 301086 378841 434638 522918 620341
15575 620341 678120 750497 808183 868964 884240 859243 843105 820244 786603 713063 644768
15564 644768 603564 557830 517075 484198 458571 451450 442270 452332 451627 452832 466024 478426
15552 478426 479418 492281 526794 532854 509330 514432 530728 537733 528061 505099 502270 518793 548500
15539 548500 578398 576685 575089 607245 606191 604825 621684 628351 614665 609339 646062 673141 698649
15526 698649 706867 709794 750337 764292 796490 810106 812933 830778 860303 872503 891743 911445
15514 911445 938715 980518 1021134 1038664 1069879 1086741 1081340 1139179 1218684 1240098 1270516 1327458
15502 1327458 1358967 1377298 1409824 1440631 1482916 1538967 1616906 1702675 1789964 1860883 1920171
$$ packed form
15587A86794O056K0707o655p449L6768J7312N746M1807P7755N5797Q8280R7423
15575F20341N7779P2377N7686O0781J5276k4997j6138k2861l3641p3540o8295
15564F44768m1204m5734m0755l2877k5627p121r180J0062p05J205J3192J2402
15552D78426R92J2863L4513O060k3524N102J6296P005r672k2962k829J6523K9707
15539E48500K9898j713j596L2156j054j366J6859O667j3686n326L6723K7079K5508
15526F98649Q218K927M0543J3955L2198J3616K827J7845K9525J2200J9240J9702
15514I11445K7270M1803M0616J7530L1215J6862n401N7839P9505K1414L0418N6942
15502A327458L1509J8331L2526L0807M2285N6051P7939Q5769Q7289P0919N9288
$$ plain form
15491 1920171 1963969 2048441 2155674 2243766 2333589 2438988 2565293 2702274 2857573 3031103
15481 3031103 3205575 3430455 3641780 3885882 4141676 4398464 4680455 5035224 5423371
15472 5423371 5836027 6306651 6838190 7458391 8182806 9036464 10100307 11361438 12788150
15463 12788150 14427639 16366269 18771132 21764095 25535366 30373217 36768366 45387957
15455 45387957 57351096 74308749 98206174 130159900 167664574 202147953 227512184
15448 227512184 246583438 263068740 273949739 274079372 262543377 244522561 223866146
15441 223866146 199232877 166695204 129542067 97522253 74799592 59271298 48231473
15434 48231473 40114675 33929979 29133604 25361582 22269216 19701326 17581433 15789623
$$ packed form
15491A920171M3798Q4472J07233Q8092Q9823J05399J26305J36981J55299J73530
15481C031103J74472K24880K11325K44102K55794K56788K81991L54769L88147
15472E423371M12656M70624N31539O20201P24415Q53658J063843J261131J426712
15463A2788150J639489J938630K404863K992963L771271M837851O395149Q619591
15455D5387957J1963139J6957653K3897425L1953726L7504674L4483379K5364231
15448B27512184J9071254J6485302J0880999J29633j1535995j8020816k0656415
15441B23866146k4633269l2537673l7153137l2019814k2722661j5528294j1039825
15434D8231473q116798o184696m796375l772022l092366k567890k119893j791810
$$ plain form
15426 15789623 14226969 12854815 11648333 10635891 9793850 9090652 8496371 8051527 7708265
15417 7708265 7440653 7228701 7082518 6949566 6791712 6609143 6429604 6205894 5978393
15408 5978393 5708011 5389791 5085134 4754798 4400299 4049663 3732238 3481120 3243460
15399 3243460 2998232 2787024 2613141 2464881 2325003 2162662 2026895 1922595 1826744 1694467
15389 1694467 1592055 1528450 1447441 1391965 1351432 1273850 1217893 1158344 1109511 1064753 1018776
15378 1018776 971618 919986 896995 847346 816135 784337 733458 678485 643395 627885 616685
15367 616685 620394 592848 585139 591059 555335 508308 498162 508247 517743 499691 479378 462075
15355 462075 461585 435922 439375 432257 429032 414717 392516 325911 327805 341699 307239 287573 286221
$$ packed form
15426A5789623j562654j372154j206482j012442q42041p03198n94281m44844l43262
15417G708265k67612k11952j46183j32952j57854j82569j79539k23710k27501
15408E978393k70382l18220l04657l30336l54499l50636l17425k51118k37660
15399C243460k45228k11208j73883j48260j39878j62341j35767j04300r5851j32277
15389A694467j02412o3605q1009n5476m0533p7582n5957n9549m8833m4758m5977
15378A018776m7158n1632k2991m9649l1211l1798n0879n4973l5090j5510j1200
15367F16685L709k7546p709N920l5724m7027j0146J0085R496j8052k0313j7303
15355D62075m90k5663L453p118l225j4315k2201o6605J894J3894l4460j9666j352
$$ plain form
15342 286221 266825 247497 231064 251914 289042 275603 251763 266336 281034 229800 207569
15331 207569 192330 222149 235351 198316 157080 104911 76461 55093 79390 61012 27744
15320 27744 16625 36699 51273 68130 98907 135198 161402 163339 151383 180470 216536 247957
15308 247957 236362 207158 217208 224228 236247 230623 207960 231827 245600 234403 230129 235199
15296 235199 221606 233333 246089 230948 204034 196058 208875 221661 233721 214362 204444 201909
15284 201909 208607 170024 171136 175001 158556 134775 150974 170991 150552 166289 181382 183651
15272 183651 164877 146421 171781 179797 128245 145558 161945 159221 116469 82532 75234 115975
15260 115975 134443 135118 103182 85081 84262 97465 113512 108165 111602 137945 152489 131213 98936
$$ packed form
15342B86221j9396j9328j6433K0850L7128j3439k3840J4573J4698n1234k2231
15331B07569j5239K9819J3202l7035m1236n2169k8450k1368K4297j8378l3268
15320B7744j1119K0074J4574J6857L0777L6291K6204J937j1956K9087L6066L1421
15308B47957j1595k9204J0050P020J2019n624k2663K3867J3773j1197m274N070
15296B35199j3593J1727J2756j5141k6914p976J2817J2786J2060j9359r918k535
15284B01909O698l8583J112L865j6445k3781J6199K0017k0439J5737J5093K269
15272A83651j8774j8456K5360Q016n1552J7313J6387k724m2752l3937p298M0741
15260A15975J8468O75l1936j8101q19J3203J6047n347L437K6343J4544k1276l2277
$$ plain form
15247 98936 92097 74244 64746 73775 110894 103629 78075 71794 95317 135293 142563 160780 165193
15234 165193 150956 123629 105795 107883 90245 100419 92625 69181 65174 57824 34392 28172
15222 28172 42395 46158 74046 81721 62964 50648 71901 76673 96663 84441 70900 88168
15210 88168 83961 82525 82654 93682 105537 102333 85287 71844 84998 94475 100039 70612 46501
15197 46501 19629 27451 28541 27060 35483 27236 32182 29924 36085 50194 50717 48060 28041 13219
15183 13219 20831 40594 32391 31886 34109 34955 25398 33730 53670 58642 60992 54648 26597 35761
15169 35761 34943 36274 24782 17226 16357 26529 39125 19990 21573 29708 50156 53555 60891 62389
15155 62389 52511 40249 37508 52591 33309 30593 33558 36121 54357 45825 21519 -5455 -4544
$$ packed form
15247I8936o839j7853r498R029L7119p265k5554o281K3523L9976P270J8217M413
15234A65193j4237k7327j7834K088j7638J0174p794k3444m007p350k3432o220
15222B8172J4223L763K7888P675j8757j2316K1253M772J9990j2222j3541J7268
15210H8168m207j436J29J1028J1855l204j7046j3443J3154R477N564k9427k4111
15197D6501k6872P822J090j481Q423q247M946k258O161J4109N23k657k0019j4822
15183A3219P612J9763q203n05K223Q46r557Q332J9940M972K350o344k8051R164
15169C5761q18J331j1492p556q69J0172J2596j9135J583Q135K0448L399P336J498
15155F2389r878j2262k741J5083j9282k716K965K563J8236q532k4306k6974R11
$$ plain form
15142 -4544 14639 -5033 -26322 -29026 -12750 8755 25674 26286 12523 -14127 -26819 -45390
15130 -45390 -33184 -5456 3725 -1986 17474 25244 42697 43135 29767 32270 19900 18778 8492
15117 8492 -19337 -14915 23644 20027 14294 8824 -3186 -28753 -12414 -16642 -20306 -17908 -11860
15104 -11860 3514 37617 51353 58193 63614 86882 71516 33681 16172 18320 28187 14553
15092 14553 15422 28420 25652 39943 31448 25064 34038 44685 54185 42774 35005 43426 12253
15079 12253 -5945 15442 60335 74648 28737 9883 -13549 -8385 8174 -11301 -2711 14237
15067 14237 18193 17663 -348 11437 23724 13606 13720 11099 32027 24735 3200 4327 37563
15054 37563 63364 23495 18050 30894 59909 69528 60393 33463 11037 7416 5593 11632 44338
$$ packed form
15142d544J9183j9672k1289k704J6276K1505J6919O12j3763k6650j2692j8571
15130d5390J2206K7728R181n711J9460P770J7453M38j3368K503j2370j122j0286
15117H492k7829M422L8559l617n733n470j2010k5567J6339m228l664K398O048
15104a1860J5374L4103J3736O840N421K3268j5366l7835j7509K148R867j3634
15092A4553Q69J2998k768J4291q495o384Q974J0647R500j1411p769Q421l1173
15079A2253j8198K1387M4893J4313m5911j8854k3432N164J6559j9475Q590J6948
15067A4237L956n30j8011J1785J2287j0118J14k621K0928p292k1535J127L3236
15054C7563K5801l9869n445J2844K9015R619r135k6930k2426l621j823O039L2706
$$ plain form
15041 44338 37861 7023 -19000 -14646 -35483 -38696 -44823 -54867 -69317 -55686 -41893 -42739 -46244
15028 -46244 -50997 -77569 -61163 -33720 -9658 -21455 -49044 -52149 -64554 -68146 -55087 -80755
15016 -80755 -60220 -35992 -3969 14594 15290 704 -8496 -32948 -45160 -31164 -20715 -10444
15004 -10444 -10709 -13906 13649 13408 -18144 -38281 -38385 -39049 -35431 -22816 -52942 -50096 -47994 -50091
14990 -50091 -62926 -84226 -62238 -71680 -92497 -90017 -77711 -70284 -79688 -93681 -65185 -23272
14978 -23272 -22979 -8961 18444 45734 74627 84817 89978 101721 118096 122816 113944 113310 110350
14965 110350 99565 136465 165575 154482 184843 207246 214062 268856 331590 451995 568053
14954 568053 723178 913875 1045267 1154528 1222512 1270611 1312029 1283532 1200821 1116716 1030505
$$ packed form
15041D4338o477l0838k6023M354k0837l213o127j0044j4450J3631J3793q46l505
15028d6244m753k6572J6406K7443K4062j1797k7589l105j2405l592J3059k5668
15016h0755K0535K4228L2023J8563O96j4586r200k4452j2212J3996J0449J0271
15004a0444k65l197K7555k41l1552k0137j04o64L618J2615l0126K846K102k097
14990e0091j2835k1300K1988r442k0817K480J2306P427r404j3993K8496M1913
14978b3272K93J4018K7405K7290K8893J0190N161J1743J6375M720q872o34k960
14965A10350j0785L6900K9110j1093L0361K2403O816N4794O2734J20405J16058
14954E68053J55125J90697J31392J09261O7984M8099M1418k8497q2711q4105q6211
$$ plain form
14943 1030505 898929 750179 620638 479250 360696 277099 242757 227101 184839 147605
14933 147605 109377 66195 49809 73419 101321 103361 109823 108153 111260 91108 71583 76161
14921 76161 66942 40549 32942 45544 64578 61348 91071 111614 105791 85460 64838 55177 41743
14908 41743 26565 16142 20928 31434 69720 88901 88220 60704 42924 35171 20602 99
14896 99 24495 49692 58305 58132 47121 10754 20279 33933 56616 20628 -25464 -31737 -31086 -15363
14882 -15363 -9049 1480 -10338 -23176 -28571 -27718 -30037 -22737 -28566 -17930 2031 1352 -2367 -329
14868 -329 12721 -3026 -19256 -35965 -43118 -45371 -25371 -17406 -32366 -37905 -33107 -49525 -82136
14855 -82136 -80270 -41655 -4703 5257 6293 -8675 -33015 -27973 -1814 3944 -16826 -8568 -8694
$$ packed form
14943A030505j31576j48750j29541j41388j18554q3597l4342j5656m2262l7234
14933A47605l8228m3182j6386K3610K7902K040O462j670L107k0152j9525M578
14921G6161r219k6393p607J2602J9034l230K9723K0543n823k0331k0622r661j3434
14908D1743j5178j0423M786J0506L8286J9181o81k7516j7780p753j4569k0503
14896I9K4396K5197Q613j73j1011l6367R525J3654K2683l5988m6092o273O51J5723
14882a5363O314J0529j1818j2838n395Q53k319P300n829J0636J9961o79l719K038
14868c29J3050j5747j6230j6709p153k253K0000P965j4960n539M798j6418l2611
14855h2136J866L8615L6952R960J036j4968k4340N042K6159N758k0770Q258j26
$$ plain form
14842 -8694 -4971 687 17965 7220 10659 -15229 -25055 -7419 -4171 -25065 -35742 -4870 15116
14829 15116 16516 12357 19278 -7868 -25700 -2247 -5119 -10846 -26141 -20283 -5400 1616 7353
14816 7353 -2584 -9026 3851 36839 29305 19597 26998 8012 26904 15087 14328 24206 23687 28760
14802 28760 11532 4907 20193 -858 2980 14584 -9931 -15847 -19435 -16359 9281 15316 12325
14789 12325 -4745 -18797 -17351 21283 41425 36237 -1742 -31094 -33761 -32768 -34652 -18184 -17493
14776 -17493 -36201 -17962 -6520 -19801 -24483 -49579 -32082 -8746 8064 -6871 -25563 -15090
14764 -15090 -21567 3162 -10831 -16957 16757 16248 26868 8515 9440 16990 33724 39906 36083
14751 36083 31394 -27885 -47068 -24009 1682 -11217 -14995 7093 8619 -17074 -11982 -7593 11138
$$ packed form
14842h694L723N658J7278j0745L439k5888r826J7636L248k0894j0677L0872J9986
14829A5116J400m159O921k7146j7832K3453k872n727j5295N858J4883P016N737
14816G353r937o442J2877L2988p534r708P401j8986J8892j1817p59R878n19N073
14802B8760j7228o625J5286k1051L838J1604k4515n916l588L076K5640O035k991
14789A2325j7070j4052J446L8634K0142n188l7979k9352k667R93j884J6468O91
14776a7493j8708J8239J1442j3281m682k5096J7497K3336J6810j4935j8692J0473
14764a5090o477K4729j3993o126L3714n09J0620j8353R25P550J6734O182l823
14751C6083m689n9279j9183K3059K5691j2899l778K2088J526k5693N092M389J8731
$$ plain form
14738 11138 28816 36816 28319 14031 22152 26240 20950 3027 -18191 -19403 -2981 6130 8727
14725 8727 2149 13878 4852 -17621 -2965 -5229 14705 22160 2313 -10369 -6066 949 1628
14712 1628 16135 23606 25432 14902 17406 21667 43380 23427 28382 9015 -11940 -13071 -8317
14699 -8317 3364 -11406 -9080 -4152 3513 3760 10966 -10503 -97 7482 9125 11782 -312 22644
14685 22644 17223 -12241 -43669 -40565 -14007 -1092 13269 8534 11824 8653 -8497 -44310 -45263
14672 -45263 -1035 18188 -13543 -40455 -28049 -47276 -74598 -74684 -68749 -59188 -49848 -30024 -7899
14659 -7899 -83 384 11971 19342 -7405 -17968 -13263 -20465 -6334 -13830 -8107 29231 49335
14646 49335 50468 28973 32786 40526 24454 15091 13120 14347 20333 21262 28227 10157 8096 13320
$$ packed form
14738A1138J7678Q000q497j4288Q121M088n290j7923k1218j212J6422R111K597
14725H727o578J1729r026k2473J4656k264J9934P455j9847j2682M303P015O79
14712A628J4507P471J826j0530K504M261K1713j9953M955j9367k0955j131M754
14699h317J1681j4770K326M928P665K47P206k1469J0406P579J643K657j2094K2956
14685B2644n421k9464l1428L104K6558J2915J4361m735L290l171j7150l5813r53
14672d5263M4228J9223l1731k6912J2406j9227k7322q6N935R561R340J9824K2125
14659g899P816M67J1587P371k6747j0563M705p202J4131p496N723L7338K0104
14646D9335J133k1495L813P740j6072r363j971J227N986R29O965j8070k061N224
$$ plain form
14632 13320 10590 22603 -518 -14005 -32556 -13398 -18452 -39412 -48371 -32630 -25317 -514
14620 -514 21163 13337 8335 3717 11359 518 7108 30225 37671 38250 15522 32358 43413 30973
14606 30973 7127 -5278 -6811 4324 -5466 -16268 -18768 -12519 -14834 -28744 -16413 -12572 -11746
14593 -11746 -8831 -7785 -1237 8472 -15380 -37871 -49203 -33588 -20676 -16126 -33959 -42403 -44698
14580 -44698 -26428 -18988 -3834 -13744 -12873 1079 -2382 -26689 -11917 1234 14210 42898 40413
14567 40413 50981 51446 25275 -3387 12940 4596 -47953 -60035 -51601 -60232 -70097 -50383 -48421
14554 -48421 -49229 -39229 -27703 -37448 -49183 -50776 -46813 -49391 -40921 -12221 15930 22414 -10214
14541 -10214 -50885 -35567 -38842 -44084 -42398 -25830 -22572 -15851 -742 -7121 -2422 -19090 -24559
$$ packed form
14632A3320k730J2013k3121j3487j8551J9158n054k0960q959J5741P313K4803
14620e14K1677p826n002m618P642j0841O590K3117P446N79k2728J6836J1055j2440
14606C0973k3846j2405j533J1135r790j0802k500O249k315j3910J2331L841Q26
14593a1746K915J046O548R709k3852k2491j1332J5615J2912M550j7833q444k295
14580d4698J8270P440J5154r910Q71J3952l461k4307J4772J3151J2976K8688k485
14567D0413J0568M65k6171k8662J6327q344n2549j2082Q434q631r865J9714J962
14554d8421q08J0000J1526r745j1735j593L963k578Q470K8700K8151O484l2628
14541a0214m0671J5318l275n242J686J6568L258O721J5109o379M699j6668n469
$$ plain form
14528 -24559 -5220 -24293 -18997 -14343 -26265 -25399 -20907 -9560 -18739 -3609 8167 18519 -33997
14515 -33997 -45952 -8555 8068 16097 3408 -2209 -18692 13148 21598 19186 51562 25514
14503 25514 -27755 -51859 -37005 -33048 -37193 -43931 -11500 -23585 -47181 -36390 -30609 4869
14491 4869 18918 10180 18403 33 1398 9475 -1717 -5041 -837 -7981 4186 4228 23377 56464
14477 56464 53957 24945 9982 8220 19277 18691 15684 12983 12362 3077 -23078 -4966 -4586 -32774
14463 -32774 -21368 -12837 -15992 -13822 -18863 -12224 3291 -16501 -26886 -19769 -7504 -8283 -8651 -4293
14449 -4293 -13846 -16223 -4930 6557 -2087 -21421 -44769 -46750 -50965 -55503 -61181 -27991 -2807
14436 -2807 1007 -17880 -35799 -20057 -8504 -35395 -33167 -43663 -27266 5859 32303 20881
$$ packed form
14528b4559J9339j9073N296M654j1922Q66M492J1347r179J5130J1776J0352n2516
14515c3997j1955L7397J6623Q029j2689n617j6483L1840Q450k412L2376k6048
14503B5514n3269k4104J4854L957m145o738L2431j2085k3596J0791N781L5478
14491D869J4049q738Q223j8370J365Q077j1192l324M204p144J2167M2J9149L3087
14477E6464k507k9012j4963j762J1057n86l007k701o21r285k6155J8112L80k8188
14463c2774J1406Q531l155K170n041O639J5515j9792j0385P117J2265p79l68M358
14449d293r553k377J1293J1487q644j9334k3348j981m215m538n678L3190K5184
14436b807L814j8887j7919J5742J1553k6891K228j0496J6397L3125K6444j1422
$$ plain form
14424 20881 2817 -29508 -30832 -55087 -65516 -37979 -17969 5104 22446 -9834 -21618 -3470
14412 -3470 3839 -17456 -25951 -17817 -18866 -9324 -31254 -61588 -37063 -27961 -20525 -25915 -3975
14399 -3975 -19619 -23076 -144 -6879 -10106 11127 10265 4023 -7565 -14917 1433 18495 18009 25043
14385 25043 26591 35404 19370 10545 14978 3483 7478 879 -8717 -20762 -29226 -35546 -38261 -18937
14371 -18937 -32857 -21647 12907 40862 26664 7733 21431 27041 52329 46757 45189 34690
14359 34690 13151 -4989 2205 1787 -11319 -20056 -43706 -23441 -10654 -14978 -10315 -8909 -2553
14346 -2553 -7277 -1409 18760 -1893 -11454 -28067 -33085 -19281 -4177 5831 1656 14755 4518
14333 4518 -5111 13568 21779 25194 25012 -9064 -10279 25102 15334 -29945 -52941 -35458 -9307
$$ packed form
14424B0881j8064l2325j324k4255j0429K7537K0010K3073J7342l2280j1784J8148
14412c470P309k1295q495Q134j049R542k1930l0334K4525R102P436n390K1940
14399c975j5644l457K2932o735l227K1233q62o242j1588p352J6350J7062m86P034
14385B5043J548Q813j6034q825M433j1495L995o599r596j2045q464o320k715J9324
14371a8937j3920J1210L4554K7955j4198j8931J3698N610K5288n572j568j0499
14359C4690k1539j8140P194m18j3106q737k3650K0265J2787m324M663J406O356
14346b553m724N868K0169k0653r561j6613n018J3804J5104J0008m175J3099j0237
14333D518r629J8679Q211L415j82l4076j215L5381r768m5279k2996J7483K6151
$$ plain form
14320 -9307 2104 20318 -5543 6927 -2988 -14667 -17996 -7573 -4514 -14982 -38976 -70910
14308 -70910 -85495 -43949 -13798 -1655 -8453 -3980 -10712 -17506 -10598 14712 31664 2401 -16990
14295 -16990 -17149 -18776 -24493 -11237 -7340 9933 -5778 5127 15846 7009 -6016 3304 -4719
14282 -4719 4256 15210 15009 19961 18676 -5914 -23318 -24269 -38399 -13105 4691 13910 -5353
14269 -5353 -31757 -39948 -54624 -54253 -43610 289 -548 6179 32213 30188 34566 49247 70613
14256 70613 46984 27502 21681 3438 -2198 -2166 12505 30189 22256 -4830 -25054 -12159 -24089
14243 -24089 -25098 1193 14273 -294 -19000 -32630 -49520 -38303 -15659 -2373 -16206 -32927
14231 -32927 -39619 -45412 -49391 -36365 -24454 -26497 -28688 -37492 -36747 -40634 -34431 -12779 -8013 -332
$$ packed form
14320i307J1411J8214k5861J2470r915j1679l329J0423L059j0468k3994l1934
14308g0910j4585M1546L0151J2143o798M473o732o794O908K5310J6952k9263j9391
14295a6990j59j627n717J3256L897J7273j5711J0905J0719q837j3025R320q023
14282d719Q975J0954k01M952j285k4590j7404r51j4130K5294J7796R219j9263
14269e353k6404q191j4676L71J0643M3899q37O727K6034k025M378J4681K1366
14256G0613k3629j9482n821j8243n636L2J4671J7684p933k7086k0224J2895j1930
14243b4089j009K6291J3080j4567j8706j3630j6890J1217K2644J3286j3833j6721
14231c2927o692n793l979J3026J1911k043k191q804P45l887O203K1652M766P681
$$ plain form
14217 -332 -3287 8623 17676 27126 18078 16326 10135 29078 24120 -12745 -8492 4253 8521 17237
14203 17237 19663 2965 -17274 -7571 2805 11255 -8655 -55428 -41353 -29907 -15779 -11428
14191 -11428 -21580 6235 30591 10374 -10631 23209 27553 11885 4247 10388 -7369 -22974
14179 -22974 -19888 -18205 -6188 -8539 -29442 -21150 -2439 -23802 -29293 -17072 4531 -12783 -35074
14166 -35074 -16973 -31475 -26356 -7379 -6486 -28986 -36596 -36936 -46154 -28875 -3262 -5623 -20497
14153 -20497 -1817 -1745 -13031 -10507 22875 36670 17268 14928 -494 11270 9369 21061 14935
14140 14935 28716 41437 28124 23888 38506 18999 30294 24482 33430 26170 17520 22496 15442
14127 15442 11026 544 -8326 72 6092 15211 29906 40578 36713 10322 3222 8095 25159
$$ packed form
14217c32k955J1910R053R450r048j752o191J8943m958l6865M253J2745M268Q716
14203A7237K426j6698k0239R703J0376Q450j9910m6773J4075J1446J4128M351
14191a1428j0152K7815K4356k0217k1005L3840M344j5668p638O141j7757j5605
14179b2974L086J683J2017k351k0903Q292J8711k1363n491J2221K1603j7314k2291
14166c5074J8101j4502N119J8977Q93k2500p610l40r218J7279K5613k361j4874
14153b0497J8680P2j1286K524L3382J3795j9402k340j5422J1764j901J1692o126
14140A4935J3781J2721j3313m236J4618j9507J1295n812Q948p260q650M976p054
14127A5442m416j0482q870Q398O020R119J4695J0672l865k6391p100M873J7064
$$ plain form
14114 25159 50798 41531 34543 28416 20158 27578 22888 231 -30029 -27411 -26841 -15318 -5064
14101 -5064 6246 -4204 9747 20992 -6474 -29714 -36409 -25960 -124 8516 -13017 -2944
14089 -2944 18586 23224 29876 38900 6353 -11800 -12247 -8427 -20524 -36547 -18408 7145 10198
14076 10198 2778 562 -23301 -26413 -6363 3180 -15935 -14464 -23765 -31057 -3297 22438 16362
14063 16362 -948 17618 11140 7713 31128 36394 4213 7045 8830 16760 -7972 -14493 -13243
14050 -13243 -22944 -34245 5178 41231 44309 7189 9435 25891 17024 -21355 -30926 -15081 -21197
14037 -21197 -31039 -16389 2142 19866 27129 4328 -1593 19361 31463 12516 3957 13591 26833
14024 26833 -3623 13004 -126 -27695 -6039 -12220 -13191 -994 16792 23097 17165 717 -8564
$$ packed form
14114B5159K5639r267o988o127q258P420m690k2657l0260K618N70J1523J0254
14101e064J1310j0450J3951J1245k7466k3240o695J0449K5836Q640k1533J0073
14089b944K1530M638O652R024l2547j8153m47L820j2097j6023J8139K5553L053
14076A0198p420k216k3863l112K0050R543j9115J471r301p292K7760K5735o076
14063A6362j7310J8566o478l427K3415N266l2181K832J785P930k4732o521J250
14050a3243r701j1301L9423L6053L078l7120K246J6456q867l8379r571J5845o116
14037b1197r842J4650J8531J7724P263k2801n921K0954J2102j8947q559R634J3242
14024B6833l0456J6627j3130k7569K1656o181r71J2197J7786O305n932j6448r281
$$ plain form
14011 -8564 -4458 52423 53313 29299 9161 9439 19079 38846 26647 29952 21682 -7922 -26739
13998 -26739 -30884 -4343 -19666 1229 12024 27496 22574 -289 -14479 -5774 2884 -5804 -18513
13985 -18513 -23190 -15374 5117 9709 -24495 -32129 -21181 -18244 -14847 10910 34372 50892 37104
13972 37104 32470 24154 24336 15065 -14843 -39731 -11358 -10000 4503 11860 19056 40168 9209
13959 9209 -25557 -19502 -7170 -16019 -9038 -24683 -15963 5328 28194 46474 28657 2866 -1820
13946 -1820 -6053 -3476 4544 21389 18215 30253 23597 16136 38351 47128 45946 30237 17505
13933 17505 5378 -24800 -28724 15163 11592 999 8801 22076 6671 -10984 1551 36740
13921 36740 41808 17389 22381 15697 4757 10245 14356 35218 1585 -18617 -26875 -52519 -30502
$$ packed form
14011h564M106N6881Q90k4014k0138K78R640J9767j2199L305q270k9604j8817
13998b6739m145K6541j5323K0895J0795J5472m922k2863j4190Q705Q658q688j2709
13985a8513m677P816K0491M592l4204p634J0948K937L397K5757K3462J6520j3788
13972C7104m634q316J82r271k9908k4888K8373J358J4503P357P196K1112l0959
13959I209l4766O055J2332q849O981j5645Q720K1291K2866J8280j7817k5791m686
13946a820m233K577Q020J6845l174J2038o656p461K2215Q777j182j5709j2732
13933A7505j2127l0178l924M3887l571j0593P802J3275j5405j7655J2535L5189
13921C6740N068k4419M992o684j0940N488M111K0862l3633k0202q258k5644K2017
$$ plain form
13908 -30502 -23425 -31894 -25604 -2349 39935 29038 1218 23827 47080 34410 44261 22208
13896 22208 -20494 -25321 -24683 -10999 22534 30304 5419 476 6597 17931 27869 11736 -3143
13883 -3143 156 -9906 -28387 -22046 1174 -18123 -21395 -1 8058 11514 14248 4485 1042
13870 1042 -3026 -8950 28375 37327 12819 564 10292 -7715 -10798 -24010 -14056 -14542 -30070
13857 -30070 -22028 -12395 -24233 -31534 -47476 -48701 -42690 -35659 -27761 1864 15603 -13441 8697
13844 8697 18586 8320 713 12626 -3580 -5113 -13316 -23327 -13139 -26293 -17616 -6271 3547
13831 3547 -5652 -4523 -21099 -32434 -9675 2174 -9678 -33439 -43774 -32627 -8138 -7233 -15249
13818 -15249 -9204 -22063 -33203 -31598 -26157 14506 23060 -15504 -40658 -33671 -15923 -25368 -1047
$$ packed form
13908c0502P077q469O290K3255M2284j0897k7820K2609K3253j2670R851k2053
13896B2208m2702m827O38J3684L3533P770k4885m943O121J1334R938j6133j4879
13883c143L299j0062j8481O341K3220j9297l272K1394Q059L456K734r763l443
13870A042m068n924L7325Q952k4508j2255R728j8007l083j3212R954m86j5528
13857c0070Q042R633j1838p301j5942j225O011P031P898K9625J3739k9044K2138
13844H697R889j0266p607J1913j6206j533q203j0011J0188j3154Q677J1345R818
13831C547r199J129j6576j1335K2759J1849j1852k3761j0335J1147K4489R05q016
13818a5249O045j2859j1140J605N441M0663Q554l8564k5154O987J7748r445K4321
$$ plain form
13805 -1047 -14190 -14788 -11039 15981 38551 17639 -8051 -13547 -13814 -12958 -2000 1394 6739 12416
13791 12416 11735 23866 38026 20748 31126 45872 43370 24298 25588 31231 14840 12004 -1758
13778 -1758 -6374 11534 30203 13679 -810 17668 54498 66022 22838 -4906 -3218 14947
13766 14947 34307 14913 444 -9427 -15662 -4825 -1974 5292 17437 19573 12658 -998 4348
13753 4348 6843 8333 12238 7711 4804 -19328 -35372 -32426 -28836 -36895 -19168 26458 33897 25730
13739 25730 3130 -4639 17368 20844 11392 -13839 -32021 -42685 -20509 24658 42283 42779 33279
13726 33279 30696 38891 18597 -13473 -5169 2998 -5543 -26677 -5512 -20889 -58213 -34268 5682
13713 5682 22340 11508 12793 22437 32019 16092 9706 5537 -6106 -32102 -37856 -34583 -3325
$$ packed form
13805a047j3143n98L749K7020K2570k0912k5690n496k67Q56J0958L394N345N677
13791A2416o81J2131J4160j7278J0378J4746k502j9072J290N643j6391k836j3762
13778a758m616J7908J8669j6524j4489J8478L6830J1524m3184k7744J688J8165
13766A4947J9360j9394j4469r871o235J0837K851P266J2145K136o915j3656N346
13753D348K495J490L905m527k907k4132j6044K946L590q059J7727M5626P439q167
13739B5730k2600p769K2007L476r452k5231j8182j0664K2176M5167J7625M96r500
13726C3279k583Q195k0294l2070Q304Q167q541k1134K1165j5377l7324K3945L9950
13713E682J6658j0832J285R644R582j5927o386m169j1643k5996n754L273L1258
$$ plain form
13700 -3325 6086 12268 -12594 -11312 8586 3079 1093 2473 -456 -17136 -12318 -10698 -27668 -48440
13686 -48440 -27085 -3614 -8322 -27030 -29365 -29349 -17461 -1251 42831 52292 36182 13378 10626
13673 10626 19327 5605 9965 41618 47261 25170 16986 34783 41603 16997 1709 19457 -5826
13660 -5826 -29850 -41498 -41220 -6174 30582 33162 34107 20907 41596 44669 15272 22237 38556
13647 38556 47636 29117 4356 -594 -20842 -22909 12515 18537 -2470 -4445 -82 3942 17022
13634 17022 21497 28432 47687 64915 34867 5019 -4104 -17019 -1627 21319 39105 11427
13622 11427 -6174 10013 -5414 -37647 -41241 -47350 -37807 -15741 -17633 9695 25362 23539 19180
13609 19180 43036 52779 63440 68291 28959 4784 3180 14909 39339 5740 -25562 -10797
$$ packed form
13700c325R411O182k4862J282J9898n507j986J380k929j6680M818J620j6970k0772
13686d8440K1355K3471m708j8708k335J6J1888J6210M4082R461j6110k2804k752
13673A0626Q701j3722M360L1653N643k2091q184J7797O820k4606j5288J7748k5283
13660e826k4024j1648K78L5046L6756K580R45j3200K0689L073k9397O965J6319
13647C8556R080j8519k4761m950k0248k067L5424O022k1007j975M363M024J3080
13634A7022M475O935J9255J7228l0048k9848r123j2915J5392K2946J7786k7678
13622A1427j7601J6187j5427l2233l594o109R543K2066j892K7328J5667j823m359
13609A9180K3856R743J0661M851l9332k4175j604J1729K4430l3599l1302J4765
$$ plain form
13597 -10797 -2667 -21817 -13401 5485 23927 1303 -856 -13635 -18600 -31280 -22205 6740 30746
13584 30746 35956 47528 33873 25720 53125 53864 2917 -16504 -18315 -8950 -19575 -32088 -43684
13571 -43684 -51555 -30807 -19609 -12673 14336 -2781 -19309 -36576 -31816 -12647 -1254 10786
13559 10786 14430 6131 -9606 -17331 -6331 3275 13113 -13005 -36825 -47912 -32825 -14589 -23443
13546 -23443 -23750 -21020 -42640 -45646 -15458 -21725 -16289 6307 18857 14390 5742 6706 18894 27710
13532 27710 30452 30202 21281 7023 28420 20286 26336 22382 -6449 -6577 -3444 10277 -1575 6969
13518 6969 2130 -180 3549 -429 20104 44051 34729 46911 46177 21232 22013 36086 35345 1915
13504 1915 -7443 -18281 -20403 24707 49513 72213 40520 11963 -17226 -21273 -7330 -765 -6490
$$ packed form
13597a0797Q130j9150Q416J8886J8442k2624k159j2779m965j2680R075K8945K4006
13584C0746N210J1572j3655q153K7405P39n0947j9421j811R365j0625j2513j1596
13571d3684p871K0748J1198O936K7009j7117j6528j7267M760J9169J1393J2040
13559A0786L644q299j5737p725J1000R606R838k6118k3820j1087J5087J8236q854
13546b3443l07K730k1620l006L0188o267N436K2596J2550m467q648R64J2188Q816
13532B7710K742k50q921j4258K1397q134O050l954k8831j28L133J3721j1852Q544
13518F969m839k310L729l978K0533K3947r322J2182p34k4945P81J4073p41l3430
13504A915r358j0838k122M5110K4806K2700l1693k8557k9189m047J3943O565n725
$$ plain form
13491 -6490 -8387 8566 -10633 -52831 -44835 -30978 -13741 8668 24036 2380 3307 38110 18808
13478 18808 3098 -2645 3556 -15351 -5883 6412 23127 23458 -1217 -13713 9676 21874 34626
13465 34626 51740 52928 48756 9094 -11530 -24123 -39837 -36092 -31845 3160 7402 19125 27118
13452 27118 26560 6941 -2988 6625 -3675 2088 9359 -2918 -1733 8411 20217 38758 17175
13439 17175 16676 29368 42925 41931 28166 25232 40831 18139 12945 16634 2374 -4669 -19079
13426 -19079 -7851 -20318 -14985 2664 33471 23960 10956 19917 -11349 -34737 -32754 -23103 -37644
13413 -37644 -31220 -12397 -11156 -20339 -5333 28637 42954 32893 23769 25273 29066 16071 -4624
13400 -4624 -9009 -3933 -18776 7206 17368 14074 -15713 -44811 -29657 -9080 1789 2686 -11288
$$ packed form
13491f490j897J6953j9199m2198P996J3857J7237K2409J5368k1656R27L4803j9302
13478A8808j5710n743O201j8907R468J2295J6715L31k4675j2496K3389J2198J2752
13465C4626J7114J188m172l9662k0624j2593j5714L745M247L5005M242J1723P993
13452B7118n58j9619r929R613j0300N763P271j2277J185J0144J1806J8541k1583
13439A7175m99J2692J3557r94j3765k934J5599k2692n194L689j4260p043j4410
13426a9079J1228j2467N333J7649L0807r511j3004Q961l1266k3388J983R651j4541
13413c7644O424J8823J241r183J5006L3970J4317j0061r124J504L793j2995k0695
13400d624m385N076j4843K5982J0162l294k9787k9098J5154K0577J0869Q97j3974
$$ plain form
13387 -11288 -19938 17294 15134 -23947 -33039 -13040 16773 8098 5951 7239 20956 34094 30024
13374 30024 22062 19998 -7601 4513 -9855 -37812 -35250 -10189 -25169 -42140 -16412 -11249
13362 -11249 -6276 592 -1944 -6155 1528 -18715 -40657 -21349 -1060 -1304 -19155 -13912 10529
13349 10529 28110 8829 -18491 -9244 2134 -1596 -6521 -25745 -45128 -60434 -11066 21900
13337 21900 6224 22057 33629 32405 36934 27684 16174 36905 37075 23371 40679 22706 14471
13324 14471 11578 -51 -6245 -11335 7971 16198 33854 50740 44947 31410 22046 36451 8753
13311 8753 -10047 8663 24046 10461 -7013 4113 -6418 -6151 -2914 -35170 -38646 -16011 -23090
13298 -23090 -22780 -4093 10754 19278 10344 13532 10160 -21010 -28002 -24810 -27406 -2701 3844 4408
$$ packed form
13387a1288q650L7232k160l9081r092J9999K9813q675k147J288J3717J3138m070
13374C0024p962k064k7599J2114j4368k7957K562K5061j4980j6971K5728N163
13362a1249M973O868k536m211P683k0243k1942J9308K0289k44j7851N243K4441
13349A0529J7581j9281k7320R247J1378l730m925j9224j9383j5306M9368L2966
13337B1900j5676J5833J1572j224M529r250j1510K0731J70j3704J7308j7973q235
13324A4471k893j1629o194n090J9306Q227J7656J6886n793j3537r364J4405k7698
13311H753j8800J8710J5383j3585j7474J1126j0531K67L237l2256l476K2635p079
13298b3090L10J8687J4847Q524q934L188l372l1170o992L192k596K4705O545N64
$$ plain form
13284 4408 6412 10752 -14801 -48847 -39428 -12195 -9461 26365 24037 38149 63022 58324 33314
13271 33314 12949 -9865 4623 4938 5865 25966 25334 22876 25511 43554 36428 29950 52539 62106
13257 62106 50161 45835 44719 39010 23932 14146 -14515 -27105 -11645 36082 30958 -22691 -47967
13244 -47967 -32674 -16439 -4953 -3154 -11345 5204 20949 24269 43259 41759 44814 25009 7405
13231 7405 20285 4820 -22755 -1744 20153 12676 5990 -3638 3859 294 15165 23430 10586
13218 10586 8181 7167 23814 23412 -13161 -34922 -16209 -11223 3034 21105 5474 5657 12230
13205 12230 3104 12911 27454 50868 36342 55842 53872 35661 27483 24774 4130 -10843 12085
13192 12085 28044 31702 24144 10569 4108 12800 10808 25059 49193 47393 18207 30080 66110
$$ packed form
13284D408K004M340k5553l4046R419K7233K734L5826k328J4112K4873m698k5010
13271C3314k0365k2814J4488L15R27K0101o32k458K635J8043p126o478K2589R567
13257F2106j1945m326j116n709j5078r786k8661j2590J5460M7727n124n3649k5276
13244d7967J5293J6235J1486J799q191J6549J5745L320J8990j500L055j9805j7604
13231G405J2880j5465k7575K1011K1897p477o686r628P497l565J4871Q265j2844
13218A0586k405j014J6647m02l6573k1761J8713M986J4257J8071j5631J83O573
13205A2230r126R807J4543K3414j4526J9500j970j8211q178k709k0644j4973K2928
13192A2085J5959L658p558j3575o461Q692j992J4251K4134j800k9186J1873L6030
$$ plain form
13179 66110 52208 6745 1721 -540 -4063 -42899 -59079 -44710 -13410 8909 25199 42907
13167 42907 52955 67095 52779 35874 4103 -4136 -2499 9716 -2798 -8292 1892 -22385
13155 -22385 -45081 -20675 14194 757 12705 23317 32366 47049 41905 25808 33892 55057
13143 55057 59337 54556 44876 48268 40946 45060 27647 10652 24679 52196 42044 47562 36133
13130 36133 34920 32828 47349 51385 36660 20246 11706 15220 12404 26235 15401 11193 28770
13117 28770 61582 48087 56787 41843 -2374 -8181 18441 33461 22094 -1863 18707 6568
13105 6568 15944 -12 -22902 -13438 8419 26946 23224 5076 -2820 1226 11422 32901 80924
13092 80924 84289 54679 55704 49277 45520 23792 -5929 -27649 -6728 848 -16135 -3081 -8888
$$ packed form
13179F6110j3902m5463n024k261l523l8836j6180J4369L1300K2319J6290J7708
13167D2907J0048J4140j4316j6905l1771q239J637J2215j2514n494J0184k4277
13155b2385k2696K4406L4869j3437J1948J0612R049J4683n144j6097Q084K1165
13143E5057M280m781r680L392p322M114j7413j6995J4027K7517j0152N518j1429
13130C6133j213k092J4521M036j4725j6414q540L514k816J3831j0834m208J7577
13117B8770L2812j3495Q700j4944m4217n807K6622J5020j1367k3957K0570j2139
13105F568R376j5956k2890R464K1857J8527l722j8148p896M046J0196K1479M8023
13092H0924L365k9610J025o427l757k1728k9721k1720K0921P576j6983J3054n807
$$ plain form
13079 -8888 -13005 -19692 -13198 1648 14607 12292 -21475 -31235 -41126 -30005 -17805 -9632 -9330 2303
13065 2303 5550 -5283 1745 -1375 -4581 -512 -7555 -14483 -10364 -21425 -15312 -8499 21814 15408
13051 15408 -3207 -4803 7918 6698 19739 10378 -15039 -47483 -79995 -54036 -4817 13382
13039 13382 4842 2814 7604 14334 -525 8617 -667 2706 344 -12172 -23280 -1193 -5858
13026 -5858 -36482 -33005 -9034 -8264 -5464 -32725 -28119 -9114 20111 29768 17315 16829 36231
13013 36231 45693 35692 26627 16725 6287 -8175 -35943 -39057 -18190 -9064 2935 14065 13893
13000 13893 -2561 -1807 -20335 -14822 15765 17514 11106 30794 34713 23132 22656 58936 72105
12987 72105 38975 30080 23286 -8526 -15000 4954 27112 55048 56186 18889 24525 -8051 -22333
$$ packed form
13079h888m117o687O494J4846J2959k315l3767r760r891J1121J2200Q173L02J1633
13065B303L247j0833P028l120l206M069p043o928M119j1061O113O813L0313o406
13051A5408j8615j596J2721j220J3041r361k5417l2444l2512K5959M9219J8199
13039A3382q540k028M790O730j4859R142r284L373k362j2516j1108K2087m665
13026e858l0624L477K3971P70K800k7261M606J9005K9225R657j2453m86J9402
13013C6231R462j0001r065r902j0438j4462k7768l114K0867R126J1999J1130j72
13000A3893j6454P54j8528N513L0587J749o408J9688L919j1581m76L6280J3169
12987G2105l3130q895o794l1812o474J9954K2158K7936J138l7297N636l2576j4282
$$ plain form
12974 -22333 -30653 -27091 3705 -6297 -32365 -21162 4749 19384 22990 23268 33653 48410 24155
12961 24155 53393 44723 25222 15872 27098 39892 16334 -7546 -38944 -57912 -73231 -52149
12949 -52149 3410 31235 -4198 -26194 -22780 -30182 -11679 13444 11270 7664 25303 8856
12937 8856 -5084 -7929 12734 22498 7959 7706 3091 3542 238 25916 32823 29408 14321 19920
12923 19920 32581 43230 36615 1263 -31779 -10806 16351 15295 -23206 -25927 -7607 20674
12911 20674 51490 41360 44412 36457 37156 28155 21088 1459 -19910 -9639 10059 15273 31990
12898 31990 43855 19516 19645 34181 7057 -18455 -24941 -42455 -52159 -21491 -12643 -1699 20427
12885 20427 -924 -15176 14500 33349 41505 30458 37579 37714 18151 -14018 -29256 -37853 -37621
$$ packed form
12974b2333q320L562L0796j0002k6068J1203K5911J4635L606K78J0385J4757k4255
12961B4155K9238q670j9501r350J1226J2794k3558k3880l1398j8968j5319K1082
12949e2149N5559K7825l5433k1996L414p402J8503K5123k174l606J7639j6447
12937H856j3940k845K0663R764j4539k53m615M51l304K5678O907l415j5087N599
12923A9920J2661J0649o615l5352l3042K0973K7157j056l8501k721J8320K8281
12911B0674L0816j0130L052p955O99r001p067j9629k1369J0271J9698N214J6717
12898C1990J1865k4339J29J4536k7124k5512o486j7514r704L0668Q848J0944K2126
12885B0427k1351j4252K9676J8849Q156j1047P121J35j9563l2169j5238q597K32
$$ plain form
12872 -37621 -8473 -13279 -29925 -28527 -21022 8652 4939 -2149 -850 15503 33391 896 12609
12859 12609 19627 -8868 -13000 -13859 19615 36658 60846 34576 -13700 -9673 -1151 -11002 -14753
12846 -14753 -2804 5538 -21395 -51267 -13824 9536 17702 17328 19528 30611 21243 -3422 16995
12833 16995 47670 55793 38736 39878 54280 20713 2383 7049 13134 12946 -5634 6755 18982
12820 18982 25301 25208 34382 28883 19651 9505 -17458 -38506 -20744 -18913 -10237 -15569 -17296 780
12806 780 -10695 -2444 712 5757 14308 -751 15506 25897 13347 -5044 -22205 -38575 -39456
12793 -39456 -41799 -42214 -17041 9803 36016 29919 30535 30329 13168 15713 15202 28616 31198 26822
12779 26822 8574 -24876 -33172 -23468 -33567 -35253 -17740 2124 6334 -8935 -17540 9923 48025
$$ packed form
12872c7621K9148m806j6646J398P505K9674l713p088J299J6353J7888l2495J1713
12859A2609P018k8495m132q59L3474J7043K4188k6270m8276M027Q522r851l751
12846a4753J1949Q342k6933k9872L7443K3360Q166l74K200J1083r368k4665K0417
12833A6995L0675Q123j7057J142J4402l3567j8330M666O085j88j8580J2389J2227
12820A8982O319r3R174n499r232j0146k6963k1048J7762J831Q676n332j727J8076
12806G80j1475Q251L156N045Q551j5059J6257J0391j2550j8391j7161j6370q81
12793c9456k343m15K5173K6844K6213o097O16k06j7161K545n11J3414K582m376
12779B6822j8248l3450q296R704j0099j686J7513J9864M210j5269q605K7463L8102
$$ plain form
12766 48025 70936 48888 7318 -7404 8192 13011 394 10471 22288 31199 27191 23918
12754 23918 35978 39140 36751 43261 29846 4453 7148 12362 -16746 -23304 -39402 -51233 -21277
12741 -21277 -62 20807 37831 33456 38335 11454 1161 -115 4102 2698 875 24877 16515
12728 16515 58837 48981 40693 55233 49313 24355 16776 21372 5699 -875 12786 25498 33092
12715 33092 12899 191 3993 10272 -7539 -8845 -13863 -37036 -40328 -2193 34378 61527 95192
12702 95192 81984 59873 55964 44818 54886 46929 48021 34980 40186 45845 14785 -6447 11313
12689 11313 28393 57371 48881 16054 5169 25506 45861 53540 57634 55084 35081 32416 30138
12676 30138 14919 13493 16253 28616 24730 18846 20357 5675 -269 -2149 -5362 4993 16658
$$ packed form
12766D8025K2911k2048m1570j4722J5596M819j2617J0077J1817Q911m008l273
12754B3918J2060L162k389O510j3415k5393K695N214k9108o558j6098j1831K9956
12741b1277K1215K0869J7024m375M879k6881j0293j276M217j404j823K4002q362
12728A6515M2322r856q288J4540n920k4958p579M596j5673o574J3661J2712P594
12715C3092k0193j2708L802O279j7811j306n018k3173l292L8135L6571K7149L3665
12702I5192j3208k2111l909j1146J0068p957J092j3041N206N659l1060k1232J7760
12689A1313J7080K8978q490l2827j0885K0337K0355P679M094k550k0003k665k278
12676C0138j5219j426K760J2363l886n884J511j4682n944j880l213J0355J1665
$$ plain form
12663 16658 35314 41145 18053 9379 11538 3394 -25148 -14526 -17961 2220 27736 8261 9020
12650 9020 22223 22314 5362 -15626 3208 8551 812 22779 46990 45966 33657 17783 -20991
12637 -20991 -33584 -20478 -34685 -47585 -2204 51844 45578 16227 17468 25261 34845 54172
12625 54172 42857 26087 7360 8343 40154 43410 43005 29626 29146 14188 13889 18833 25809 8677
12611 8677 -9326 -11926 2051 33759 68657 67215 68589 39459 33323 52934 51359 23388 9311
12598 9311 7687 -7877 6408 12362 24977 22415 9122 7299 18156 42073 39420 37117 29411
12585 29411 25528 34806 38759 28992 36386 44098 29655 34876 41438 47756 70155 77376 71558 47825
12571 47825 36234 22908 8574 5328 16249 15828 21925 20668 23603 46060 53602 29360 14874
$$ packed form
12663A6658J8656N831k3092q674K159q144k8542J0622l435K0181K5516j9475P59
12650I020J3203R1j6952k0988J8834N343p739K1967K4211j024j2309j5874l8774
12637b0991j2593J3106j4207j2900M5381N4048o266k9351J241P793R584J9327
12625E4172j1315j6770j8727R83L1811L256m05j3379m80j4958k99M944O976j7132
12611H677j8003k600J3977L1708L4898j442J374k9130o136J9611j575k7971j4077
12598I311j624j5564J4285N954J2615k562j3293j823J0857K3917k653k303p706
12585B9411l883R278L953r767P394P712j4443N221O562O318K2399P221n818k3733
12571D7825j1591j3326j4334l246J0921m21O097j257K935K2457P542k4242j4486
$$ plain form
12558 14874 24798 20740 16795 24759 47059 37036 37011 38122 48636 25600 2602 33537 49190
12545 49190 28531 19262 2486 11799 12779 39153 34626 38917 22431 43789 42580 39501 26507
12532 26507 21545 8799 -11345 -15766 -12766 -36491 -27690 -919 -6961 -17859 -3298 4872 20731
12519 20731 38037 68712 76355 66493 69705 61718 53013 71220 65127 21474 2821 -10803 -3127
12506 -3127 -14039 8382 29169 40971 57346 28177 17177 3636 27946 25706 27601 21199
12494 21199 -1601 20880 21171 17844 29454 16241 -2100 -5185 -30226 -15953 -10634 -16755 -6882
12481 -6882 12758 37450 26036 6533 27907 17718 -6179 3572 17804 20577 4079 -23140
12469 -23140 -35207 -9929 15292 24964 19022 17899 -8581 -2842 30350 13664 12105 34315 29458
$$ packed form
12558A4874R924m058l945P964K2300j0023k5J111J0514k3036k2998L0935J5653
12545D9190k0659r269j6776R313R80K6374m527M291j6486K1358j209l079j2994
12532B6507m962j2746k0144m421L000k3725Q801K6771o042j0898J4561Q170J5859
12519B0731J7306L0675P643r862L212p987q705J8207o093m3653j8653j3624P676
12506c127j0912K2421K0787J1802J6375k9169j1000j3541K4310k240J895o402
12494B1199k2800K2481K91l327J1610j3213j8341l085k5041J4273N319o121R873
12481f882J9640K4692j1414j9503K1374j0189k3897R751J4232K773j6498k7219
12469b3140j2067K5278K5221R672n942j123k6480N739L3192j6686j559K2210m857
$$ plain form
12456 29458 32924 33400 16636 -14811 1282 2380 2552 14573 27253 45895 60737 38243 34342
12443 34342 46119 47511 58017 67365 78609 46774 50857 70769 65474 60155 35464 12100 26802
12430 26802 53341 65992 79139 68239 63005 62858 61175 57730 59122 24301 5449 13222 -12100
12417 -12100 -23932 -2473 20228 26096 25038 22664 24140 13330 2471 9130 29891 34710 23885
12404 23885 28528 37198 36889 41560 52089 42536 3943 9744 10306 14113 29614 19520 32852 91764
12390 91764 185375 234549 227073 205147 164209 124817 118283 79657 28270 14694 30630 51599
12378 51599 58473 54587 48840 46137 58591 62520 91218 93749 78379 51739 34489 23878 32069
12365 32069 58992 80723 88358 74618 79243 79109 98237 73590 68679 86922 78278 64893 64502
$$ packed form
12456B9458L466M76j6764l1447J6093J098J72J2021J2680J8642J4842k2494l901
12443C4342J1777J392J0506R348J1244l1835M083J9912n295n319k4691k3364J4702
12430B6802K6539J2651J3147j0900n234j47j683l445J392l4821j8852P773k5322
12417a2100j1832K1459K2701N868j058k374J476j0810j0859O659K0761M819j0825
12404B3885M643Q670l09M671J0529r553l8593N801N62L807J5501j0094J3332N8912
12390I1764R3611M9174p476k1926m0938l9392o534l8626n1387j3576J5936K0969
12378E1599O874l886n747k703J2454L929K8698K531j5370k6640j7250j0611Q191
12365C2069K6923K1731P635j3740M625j34J9128k4647m911J8243q644j3385l91
$$ plain form
12352 64502 92495 88182 79010 72961 94624 66437 34773 21067 64618 73639 61620 62247 49295
12339 49295 41922 45405 59295 52879 41265 27296 -3645 24063 52152 56216 47898 76229 78429
12326 78429 47711 30011 44425 19320 18862 24958 41673 25641 14482 26379 37463 53232
12314 53232 54364 40731 44919 46506 60102 47920 54855 64007 76373 50670 34260 52519 77376
12301 77376 74319 78853 51931 54756 42931 56777 67560 53475 42621 29500 28145 369
12289 369 -4271 12357 23412 7615 21528 48393 74752 70898 57363 51934 45857 50819 60198
12276 60198 68815 83312 60366 27429 17659 28513 61732 80617 109827 121260 114085 114242 122855
12263 122855 112766 119705 107202 77093 77873 58211 21058 -7859 -1266 11522 14073 19902 23569
$$ packed form
12352F4502K7993m313r172o049K1663k8187l1664j3706M3551R021j2019O27j2952
12339D9295p373L483J3890o416j1614j3969l0941K7708K8089M064q318K8331K200
12326G8429l0718j7700J4414k5105m58O096J6715j6032j1159J1897J1084J5769
12314E3232J132j3633M188J587J3596j2182O935R152J2366k5703j6410J8259K4857
12301G7376l057M534k6922K825j1825J3846J0783j4085j0854j3121j355k7776
12289C69m640J6628J1055j5797J3913K6865K6359l854j3535n429o077M962R379
12276F0198Q617J4497k2946l2937r770J0854L3219J8885K9210J1433p175J57Q613
12263A22855j0089O939j2503l0109P80j9662l7153k8917O593J2788K551N829L667
$$ plain form
12250 23569 36661 56608 58583 54031 40947 52567 45644 53058 57274 48010 51294 45871 80641
12237 80641 105913 99546 111397 115998 106300 102980 104665 109473 101090 99441 98973 90983 99309 127978
12223 127978 134676 116344 125092 121242 114864 121458 109933 118821 105787 109416 128958 123765 104866
12210 104866 113562 124547 120135 109796 112484 111088 111220 97541 97859 95177 78057 91728 152406
12197 152406 170944 156619 153024 140433 162265 180707 184148 167159 156477 172038 202170 203578
12185 203578 254499 325079 399671 426151 398057 359198 328892 265060 211280 186891 190498 153625
12173 153625 116817 100612 104398 111970 124398 109298 76474 101777 142703 141960 136082 128563 118221
12160 118221 97345 122889 120471 91078 89015 95184 122491 114234 112485 113111 130163 119078 104680
$$ packed form
12250B3569J3092J9947J975m552j3084J1620o923P414M216r264L284n423L4770
12237H0641K5272o367J1851M601r698l320J685M808q383j649m68p990Q326K8669
12223A27978O698j8332Q748l850o378O594j1525Q888j3034L629J9542n193j8899
12210A04866Q696J0985m412j0339K688j396J32j3679L18k682j7120J3671O0678
12197A52406J8538j4325l595j2591K1832J8442L441j6989j0682J5561L0132J408
12185B03578N0921P0580P4592K6480k8094l8859l0306o3832n3780k4389L607l6873
12173A53625l6808j6205L786P572J2428j5100l2824K5303M0926p43n878p519j0342
12160A18221k0876K5544k418k9393k063O169K7307q257j749O26J7052j1085j4398
$$ plain form
12147 104680 96517 87650 64058 36467 12323 -3196 19877 62908 72562 78521 94384 108064
12135 108064 104846 108011 129418 130864 133917 122733 109090 75941 51113 61842 67597 89862
12123 89862 89089 79632 73355 100235 133713 164410 154570 135729 147296 139134 133238 148326 173414
12110 173414 194937 195721 219412 209793 199548 168184 174924 166406 115706 105208 93779 104063
12098 104063 117988 147571 154937 141670 96099 104239 133301 136773 118947 118074 134533 152513
12086 152513 164218 147434 144165 155955 185009 193545 164048 151907 146344 161025 172404 161001
12074 161001 184723 177086 179736 159654 161602 197302 214251 196496 191448 206060 203658 213242 208963
12061 208963 203539 235034 294105 410321 575099 812833 1089385 1317931 1295113 1076677
$$ packed form
12147A04680q163q867k3592k7591k4144j5519K3073M3031R654N959J5863J3680
12135A08064l218L165K1407J446L053j1184j3643l3149k4828J0729N755K2265
12123H9862p73r457o277K6880L3478L0697r840j8841J1567q162n896J5088K5088
12110A73414K1523P84K3691r619j0245l1364O740q518n0700j0498j1429J0284
12098A04063J3925K9583P366j3267m5571Q140K9062L472j7826q73J6459J7980
12086A52513J1705j6784l269J1790K9054Q536k9497j2141n563J4681J1379j1403
12074A61001K3722p637K650k0082J948L5700J6949j7755n048J4612k402R584m279
12061B08963n424L1495N9071J16216J64778K37734K76552K28546k2818k18436
$$ plain form
12051 1076677 862388 738645 655529 592953 533554 490312 462395 463611 465224 446191 446552 448135
12039 448135 429078 449735 468847 481503 470104 478454 481497 473016 491454 525363 534988 521386
12027 521386 525961 537729 553972 540576 501976 493243 518379 550031 556039 570447 548948 541557
12015 541557 540171 535722 532971 537679 575694 634290 641195 644248 688228 693588 704315 728623 779093
12002 779093 784826 748414 770307 797284 813091 812397 861471 881534 908389 947000 982382 1054931
11990 1054931 1073524 1080855 1100829 1125115 1206368 1243383 1281283 1307139 1286014 1341738 1410537
11979 1410537 1436204 1472144 1524283 1585277 1649704 1708921 1761248 1837815 1939417 2025905 2114990
11968 2114990 2197265 2303507 2439300 2554191 2658546 2783422 2933027 3095713 3322278 3598410
$$ packed form
12051A076677k14289j23743q3116o2576n9399m3242k7917J216J613j9033L61J583
12039D48135j9057K0657J9112J2656j1399Q350L043q481J8438L3909R625j3602
12027E21386M575J1768J6243j3396l8600q733K5136L1652O008J4408k1499p391
12015E41557j386m449k751M708L8015N8596O905L053M3980N360J0727K4308N0470
12002G79093N733l6412K1893K6977J5807o94M9074K0063K6855L8611L5382P2549
11990A054931J8593P331J9974K4286Q1253L7015L7900K5856k1125N5724O8799
11979A410537K5667L5940N2139O0994O4427N9217N2327P6567J01602Q6488Q9085
11968B114990Q2275J06242J35793J14891J04355J24876J49605J62686K26565K76132
$$ plain form
11958 3598410 3908387 4225714 4523562 4842788 5168770 5532798 5882045 6220879 6697000
11949 6697000 7299561 8013586 8806233 9659872 10649499 11889581 13392964 15182476 17378503
11940 17378503 20084215 23399762 27608694 33140619 40595971 50845639 65458212 87050490
11932 87050490 120062839 171936360 252446375 364065303 481991341 529369507 442622578
11925 442622578 304745437 202685204 140499410 102618890 78459196 62176629 50610569
11918 50610569 42009567 35404702 30255259 26148132 22866859 20215764 18017979 16124233
11910 16124233 14496233 13118920 11955780 10943150 10100893 9419490 8796650 8176380 7634570
11901 7634570 7250330 6992569 6779983 6695676 6733266 6894458 7098610 7192688 7006234 6582578
$$ packed form
11958C598410L09977L17327K97848L19226L25982L64028L49247L38834M76121
11949F697000O02561P14025P92647Q53639R89627J240082J503383J789512K196027
11940A7378503K705712L315547M208932N531925P455352J0249668J4612573K1592278
11932H7050490L3012349N1873521Q0510015J11618928J17926038M7378166q6746929
11925D42622578j37877141j02060233o2185794l7880520k4159694j6282567j1566060
11918E0610569q601002o604865n149443m107127l281273k651095k197785j893746
11910A6124233j628000j377313j163140j012630q42257o81403o22840o20270n41810
11901G634570l84240k57761k12586q4307L7590J61192K04152R4078j86454m23656
$$ plain form
11891 6582578 6055774 5525838 5047282 4625426 4275410 3937334 3585626 3284944 3033995
11882 3033995 2825275 2634085 2466856 2311233 2170887 2062468 1963451 1879786 1761480 1631655
11872 1631655 1500957 1390490 1332763 1243679 1190776 1181926 1119335 1060794 998402 935128 894032
11861 894032 884068 883807 834017 796730 757682 746626 727025 702900 679681 651902 632357 613374
11849 613374 576986 569753 587320 580003 575218 584158 546355 524738 503259 451105 433191 422539
11837 422539 406114 415882 435805 419337 389884 344011 323848 325671 318635 315937 322601 316671 311314
11824 311314 322867 320703 283508 257121 256003 277004 295753 268193 251793 248529 235353 219708
11812 219708 207587 200239 181148 164322 125671 96825 61005 49968 31695 20993 -40288 -124494
$$ packed form
11891F582578n26804n29936m78556m21856l50016l38076l51708l00682k50949
11882C033995k08720j91190j67229j55623j40346j08419r9017q3665j18306j29825
11872A631655j30698j10467n7727q9084n2903q850o2591n8541o2392o3274m1096
11861H94032r964k61m9790l7287l9048j1056j9601k4125k3219k7779j9545j8983
11849F13374l6388p233J7567p317m785Q940l7803k1617k1479n2154j7914j0652
11837D22539j6425R768J9923j6468k9453m5873k0163J823p036k698O664n930n357
11824C11314J1553k164l7195k6387j118K1001J8749k7560j6400l264j3176j5645
11812B19708j2121p348j9091j6826l8651k8846l5820j1037j8273j0702o1281q4206
$$ plain form
11800 -124494 -99260 -6961 80142 152600 198487 252611 270550 281887 301052 289745 256722
11789 256722 242341 231773 248867 205856 178892 173439 176035 191059 205433 228793 277310 264608
11777 264608 251576 244082 194455 180190 195329 215114 219887 229213 227689 230832 219527 204656
11765 204656 186326 169008 158071 159919 173362 175866 194638 199186 187961 183108 201433 197038
11753 197038 182703 156446 122162 118194 108447 90742 80081 65205 70995 75073 74423 94659 99222
11740 99222 94811 72923 62902 64598 62185 104821 137603 159301 217317 228657 204191 185053
11728 185053 167890 121380 89284 77676 92558 117527 109073 84981 86499 85465 103331 127931
11716 127931 134416 143884 145888 128568 129848 158566 147471 133309 123228 88547 70529 70510 64372
$$ packed form
11800a24494K5234R2299Q7103P2458M5887N4124J7939J1337J9165j1307l3023
11789B56722j4381j0568J7094m3011k6964n453K596J5024J4374K3360M8517j2702
11777B64608j3032p494m9627j4265J5139J9785M773R326j524L143j1305j4871
11765B04656j8330j7318j0937J848J3443K504J8772M548j1225m853J8325m395
11753A97038j4335k6257l4284l968r747j7705j0661j4876N790M078o50K0236M563
11740I9222m411k1888j0021J696k413M2636L2782K1698N8016J1340k4466j9138
11728A85053j7163m6510l2096j1608J4882K4969q454k4092J518j034J7866K4600
11716A27931O485R468K004j7320J280K8718j1095j4162j0081l4681j8018j9o138
$$ plain form
11703 64372 58377 47952 51065 79981 79834 71421 62126 60706 60753 65853 64986 56975 62156 101962 90315
11688 90315 82135 89800 91307 92786 80305 85172 96249 97226 91707 89319 94141 106188 119870 143498
11674 143498 156669 121907 77521 61049 42259 37189 28850 26466 14543 1727 -8304 -5664
11662 -5664 34378 41014 10538 3542 70884 108876 140022 137702 87320 42496 26054 20649 23115
11649 23115 27430 28141 35335 46071 58154 65586 52948 55347 27500 3011 16027 23766 22117
11636 22117 2702 -8056 -14230 -23623 3594 14752 10007 30128 21152 31388 46859 77921
11624 77921 108968 99304 79388 52183 33095 10863 18201 26625 13005 9053 8665 40702 59435
11611 59435 76034 49309 55369 44940 14443 12817 32724 76202 72290 58926 57970 38307 45793
$$ packed form
11703F4372n995j0425L113K8916j47q413r295j420M7N100q67q011N181L9806j1647
11688I0315q180P665J507J479j2481M867J1077R77n519k388M822J2047J3682K3628
11674A43498J3171l4762m4386j6472j8790n070q339k384j1923j2816j0031K640
11662e664M0042O636l0476o996O7342L7992L1146k320n0382m4824j6442n405K466
11649B3115M315P11P194J0736J2083P432j2638K399k7847k4489J3016P739j649
11636B2117j9415j0758o174r393K7217J1158m745K0121q976J0236J5471L1062
11624G7921L1047r664j9916k7205j9088k2232P338Q424j3620l952l88L2037J8733
11611E9435J6599k6725O060j0429l0497j626J9907M3478l912j3364r56j9663P486
$$ plain form
11598 45793 42911 20797 25119 9877 -14384 -9883 -23030 -45351 -54087 -62845 -52537 -28090 -14869
11585 -14869 -2020 14519 42842 47778 61254 49432 21330 2856 -12945 -28208 -9456 -9946
11573 -9946 7504 15668 27986 25385 7340 833 2375 2091 1120 7976 20263 5898 -16052 -10827
11559 -10827 11904 17055 17943 17719 21386 20331 31874 34146 24821 16063 -16 -7189 37080 52086
11545 52086 68655 73607 84228 59527 21857 3253 12585 9699 29414 -5914 -8277 -17543 8800
11532 8800 6048 11014 25006 20883 4091 6285 36194 12469 -16689 3735 27389 33124 14719
11519 14719 312 -401 -703 7286 23215 21803 22344 30675 17084 8090 27781 21619 -8662 -20159
11505 -20159 -174 -9719 -5851 8093 22667 18311 33356 23153 12783 7459 -1336 4354 -7159
$$ packed form
11598D5793k882k2114M322j5242k4261M501j3147k2321q736q758J0308K4447J3221
11585a4869J2849J6539K8323M936J3476j1822k8102j8474j5801j5263J8752m90
11573i946J7450Q164J2318k601j8045o507J542k84r71O856J2287j4365k1950N225
11559a0827K2731N151Q88k24L667j055J1543K272r325q758j6079p173M4269J5006
11545E2086J6569M952J0621k4701l7670j8604R332k886J9715l5328k363r266K6343
11532H800k752M966J3992m123j6792K194K9909k3725k9158K0424K3654N735j8405
11519A4719j4407p13l02P989J5929j412N41Q331j3591q994J9691o162l0281j1497
11505b0159J9985r545L868J3944J4574m356J5045j0203j0370n324q795N690j1513
$$ plain form
11492 -7159 -1372 -85 -45218 -61973 -67834 -47623 -17815 -15134 -35435 -71306 -78349 -66973 -52015
11479 -52015 -22377 -17659 -41416 -36814 -17274 -34055 -26363 -18432 -46604 -69397 -107494 -122787
11467 -122787 -126704 -147342 -173281 -119479 -30823 15387 40309 57096 69596 73626 58028 46356
11455 46356 25630 -151 -33090 -14139 -13116 15740 3369 25957 39819 18116 15068 23508
11443 23508 33612 29323 -11155 -14063 -11288 12109 19711 33892 31577 27377 22166 7443 -6815
11430 -6815 15217 19442 16855 -16803 -28495 -4092 25071 21002 28365 19730 6895 13420 21957
11417 21957 19009 19430 33015 40521 41001 6799 -8239 -3524 -8564 19689 18233 7924 19877
11404 19877 33393 57735 57668 56695 45567 58008 56667 17084 -56 2748 9745 23496 20489
$$ packed form
11492g159N787J287m5133j6755n861K0211K9808K681k0301l5871p043J1376J4958
11479e2015K9638M718k3757M602J9540j6781P692P931k8172k2793l8097j5293
11467a22787l917k0638k5939N3802Q8656M6210K4922J6787J2500M030j5598j1672
11455D6356k0726k5781l2939J8951J023K8856j2371K2588J3862k1703l048Q440
11443B3508J0104m289m0478k908K775K3397P602J4181k315m200n211j4723j4258
11430f815K2032M225k587l3658j1692K4403K9163m069P363q635j2835O525Q537
11417B1957k948M21J3585P506M80l4202j5038M715n040K8253j456j0309J1953
11404A9877J3516K4342o7r73j1128J2441j341l9583j7140K804O997J3751l007
$$ plain form
11391 20489 32910 36384 11375 1009 9080 10647 4953 5925 999 18469 20839 7308 -6564
11378 -6564 17060 10250 -16507 -6021 52664 44014 16496 30427 37241 62471 39782 18759
11366 18759 8293 30415 66555 62672 60154 44731 30363 6138 -14100 17778 39577 27697
11354 27697 10246 1189 -3015 -16954 -18819 -32955 -12738 9610 39591 50529 22338 29734
11342 29734 30235 -5452 5612 -5375 -11164 -512 -7537 -11753 -32924 -36483 -25907 -11403 10534
11329 10534 25784 6408 -7465 5403 978 -17261 -14203 -19615 -18273 -11254 -29254 -30373 -13651
11316 -13651 12037 29555 1892 -10012 93 7047 25829 10463 -1006 3221 -9906 -48303
11304 -48303 -45767 -15480 -2550 1093 -7007 4221 31668 55151 43324 19453 20838 9279
$$ packed form
11391B0489J2421L474k5009j0366Q071J567n694R72m926J7470K370j3531j3872
11378f564K3624o810k6757J0486N8685q650k7518J3931O814K5230k2689k1023
11366A8759j0466K2122L6140l883k518j5423j4368k4225k0238L1878K1799j1880
11354B7697j7451r057m204j3939j865j4136K0217K2348K9981J0938k8191P396
11342B9734N01l5687J1064j0987n789J0652p025m216k1171l559J0576J4504K1937
11329A0534J5250j9376j3873J2868m425j8239L058n412J342P019j8000j119J6722
11316a3651K5688J7518k7663j1904J0105O954J8782j5366j1469M227j3127l8397
11304d8303K536L0287J2930L643q100J1228K7447K3483j1827k3871J385j1559
$$ plain form
11292 9279 -15299 -8158 7922 11488 5994 -8853 -16345 -13372 -12806 -33523 -18279 -17514 -4121 -15311
11278 -15311 -17837 -13496 -24881 9204 9573 17696 14042 9062 16922 12467 -12853 -15597 -19429 -17981
11264 -17981 -34560 -37052 -40300 -36509 -17630 -1055 6828 1542 -7023 -13587 -29946 -11244 9314
11251 9314 8060 24065 30082 15595 11981 24161 10344 -18369 -30128 -27298 -2871 7830 -867
11238 -867 11407 15971 -307 5078 -4854 -2418 -29384 -35825 -14031 -12305 9005 26176 20402
11225 20402 19602 7852 9044 9189 11404 2768 -27929 -24282 -17965 -17676 -6129 -4434 49 5733
11211 5733 10189 14701 16096 25214 39018 21151 3925 -4308 -7355 -14071 -25087 -12362 29671
11198 29671 58594 46665 8764 -26791 -36304 -42124 -27768 -17600 -23577 -11021 -4982 -4914 -1559
$$ packed form
11292I279k4578P141J6080L566n494j4847p492K973N66k0717J5244P65J3393j1190
11278a5311k526M341j1385L4085L69Q123l654m980P860m455k5320k744l832J448
11264a7981j6579k492l248L791J8879J6575P883n286q565o564j6359J8702K0558
11251I314j254J6005O017j4487l614J2180j3817k8713j1759K830K4427J0701q697
11238h67J2274M564j6278N385r932K436k6966o441K1794J726K1310J7171n774
11225B0402q00j1750J192J45K215q636l0697L647O317K89J1547J695M483N684
11211E733M456M512J395R118J3804j7867j7226q233l047o716j1016J2725M2033
11198B9671K8923j1929l7901l5555r513n820J4356J0168n977J2556O039O8L355
$$ plain form
11185 -1559 3558 4512 -3460 -26003 -21241 -18303 8533 18756 19799 34652 70225 61437 26080
11172 26080 26112 39884 7102 6411 12571 27669 31610 -1089 -17067 -38883 -26284 16699 29659
11159 29659 19433 9594 -6697 -4272 6322 20 -22739 -36251 -37696 -23192 -15811 17 12289
11146 12289 18200 16603 28424 16760 2918 3432 16145 25414 15433 -28112 -61078 -52016 -42335
11133 -42335 -19641 -1286 12627 16455 20817 27254 9077 23022 8575 5230 8208 -4599 -19350
11120 -19350 331 15356 35689 34541 14372 109 27613 39315 39636 53182 49607 28648
11108 28648 13088 -9800 2882 14827 22943 29207 45657 46406 49027 23870 15508 19853 27738
11095 27738 34713 36269 49598 36975 23012 30341 45193 23830 -913 3501 34587 58832
$$ packed form
11185a559N117R54p972k2543M762K938K6836J0223J043J4853L5573q788l5357
11172B6080L2J3772l2782o91O160J5098L941l2699j5978k1816J2599M2983J2960
11159B9659j0226r839j6291K425J0594o302k2759j3512j445J4504P381J5828J2272
11146A2289N911j597J1821j1664j3842N14J2713R269r981m3545l2966R062R681
11133d2335K2694J8355J3913L828M362O437j8177J3945j4447l345K978j2807j4751
11120a9350J9681J5025K0333j148k0169j4263K7504J1702L21J3546l575k0959
11108B8648j5560k2888J2682J1945Q116O264J6450P49K621k5157q362M345P885
11095B7738O975J556J3329j2623j3963P329J4852k1363k4743M414L1086K4245
$$ plain form
11083 58832 59893 44469 21906 32374 16838 33671 45136 25425 19612 28073 24612 10391
11071 10391 13784 -30586 -48712 -55655 -47628 -16968 7156 -7949 -254 7478 6382 12222 1594
11058 1594 11541 19092 45535 55686 33898 29828 57927 71542 57761 49467 66191 81878 89132
11045 89132 94383 105701 134554 123638 109861 143735 117025 89164 72184 91398 138134 176476
11033 176476 180163 183864 176554 155206 148035 150830 150350 158235 175479 201547 227423 272106 306429
11020 306429 315601 293063 260532 211552 194010 189034 171546 171889 164959 186094 193140 186998 156199
11007 156199 137148 136792 138359 121205 99724 100329 84453 81673 86308 94513 102243 119099 134940
10994 134940 118179 83614 70151 68175 71797 55656 33647 34039 35322 46519 53788 33951 43260
$$ packed form
11083E8832J061j5424k2563J0468j5536J6833J1465j9711n813Q461l461j4221
11071A0391L393m4370j8126o943Q027L0660K4124j5105P695P732j096N840j0628
11058A594R947P551K6443J0151k1788m070K8099J3615j3781q294J6724J5687P254
11045H9132N251J1318K8853j0916j3777L3874k6710k7861j6980J9214M6736L8342
11033A76476L687L701p310k1348p171K795m80P885J7244K6068K5876M4683L4323
11020C06429R172k2538l2531m8980j7542m976j7488L43o930K1135P046o142l0799
11007A56199j9051l56J567j7154k1481O05j5876k780M635Q205P730J6856J5841
10994A34940j6761l4565j3463j976L622j6141k2009L92J283J1197P269j9837R309
$$ plain form
10981 43260 35836 -13684 -24288 -10701 5169 2775 13003 27585 22356 9777 -824 6167
10969 6167 -20205 -10324 4857 9493 1275 16477 17982 35852 19956 22878 27998 24809 47090
10956 47090 32275 32951 34354 28550 21852 -1972 -2415 20090 21059 10392 440 3956 25086 34299
10942 34299 16424 10324 -1484 29640 29014 -5200 -25320 -4437 35412 37343 31590 57029 48055
10929 48055 35000 34601 47872 56300 69922 48224 21270 4332 2845 19640 19740 21064 42774
10916 42774 52567 49855 39633 34242 23747 17654 16697 20568 15642 33521 52846 46301 34992
10903 34992 60706 65755 65558 88235 56097 19336 -1818 -20707 5163 29188 30397 5132
10891 5132 12910 28973 17335 3479 -3542 7653 24255 22935 28396 23595 45275 24078 26877
$$ packed form
10981D3260p424m9520j0604J3587J5870k394J0228J4582n229j2579j0601O991
10969F167k6372R881J5181M636q218J5202J505J7870j5896K922N120l189K2281
10956D7090j4815O76J403n804o698k3824m43K2505R69j0667r952L516K1130R213
10942C4299j7875o100j1808L1124o26l4214k0120K0883L9849J931n753K5439q974
10929D8055j3055l99J3271Q428J3622k1698k6954j6938j487J6795J00J324K1710
10916D2774R793k712j0222n391j0495o093r57L871m926J7879J9325o545j1309
10903C4992K5714N049j97K2677l2138l6761k1154j8889K5870K4025J209k5265
10891E132P778J6063j1638j3856p021J1195J6602j320N461m801K1680k1197K799
$$ plain form
10878 26877 33428 38264 51170 23964 -14955 -364 30446 34281 374 -9411 29491 35327 27113
10865 27113 42856 55660 52490 55255 64805 62056 76243 66174 31667 22702 33687 36519 29651
10852 29651 45404 23792 -2936 15444 41471 52545 74386 84065 65994 33957 28527 44732
10840 44732 38027 33472 51828 72236 58972 77577 84480 69678 40618 14789 4416 21141
10828 21141 37843 54759 40226 -10030 -8228 9964 21438 7878 3320 -41002 -58184 -30098
10816 -30098 -11089 5057 7585 28089 34648 36632 26010 24298 16667 28803 7821 -11043 -13958
10803 -13958 -12464 -3271 10004 5291 -17473 -35475 -14361 -812 -4129 -9495 -8161 17661 12256
10790 12256 -2973 -28195 -58217 -82310 -63430 -29545 1478 34737 43061 32193 15390 6212
$$ packed form
10878B6877O551M836J2906k7206l8919J4591L0810L835l3907r785L8902N836q214
10865B7113J5743J2804l170K765R550k749J4187j0069l4507q965J0985K832o868
10852B9651J5753k1612k6728J8380K6027J1074K1841R679j8071l2037n430J6205
10840D4732o705m555J8356K0408j3264J8605O903j4802k9060k5829j0373J6725
10828B1141J6702J6916j4533n0256J802J8192J1474j3560m558m4322j7182K8086
10816c0098J9009J6146K528K0504O559J984j0622j712p631J2136k0982j8864k915
10803a3958J494R193J3275m713k2764j8002K1114J3549l317n366J334K5822n405
10790A2256j5229k5222l0022k4093J8880L3885L1023L3259Q324j0868j6803r178
$$ plain form
10778 6212 -5728 -9037 -10035 5007 12528 44811 59879 50472 55571 84863 86763 92881 66672
10765 66672 42524 35666 34261 56317 46602 2120 -21875 499 -3844 -4913 12035 14902 30925
10752 30925 25573 10038 18281 6588 18143 21050 6413 22668 35956 44497 40320 53064 55825
10739 55825 47220 39108 61475 51409 62585 76383 60486 37838 39266 67069 111891 111867 108201
10726 108201 102856 81622 61120 73854 92204 93617 112848 124866 128972 155363 166270 151021
10714 151021 138802 125744 108761 112770 132117 135041 143109 149377 148173 159995 176744 160123
10702 160123 129437 121671 118213 102166 91648 90113 85342 85577 94406 106949 111623 123665 118469
10689 118469 131845 173287 190560 191224 185334 174347 163716 153681 160211 166870 174115 176111 157256
$$ packed form
10778F212j1940l309r98J5042P521L2283J5068r407N099K9292J900O118k6209
10765F6672k4148o858j405K2056r715m4482k3995K2374m343j069J6948K867J6023
10752C0925n352j5535Q243j1693J1555K907j4637J6255J3288Q541m177J2744K761
10739E5825q605q112K2367j0066J1176J3798j5897k2648J428K7803M4822k4l666
10726A08201n345k1234k0502J2734J8350J413J9231J2018M106K6391J0907j5249
10714A51021j2219j3058j6983M009J9347K924Q068O268j204J1822J6749j6621
10702A60123l0686p766l458j6047j0518j535m771K35Q829J2543M674J2042n196
10689A18469J3376M1442J7273O64n890j0987j0631j0035O530O659P245J996j8855
$$ plain form
10676 157256 148379 159823 158478 139627 148795 157289 150869 168730 198476 203390 190895 196899 198183
10663 198183 195806 215206 217737 202996 239567 255991 238581 257943 285349 303390 319335 351336
10651 351336 366473 393883 432488 483104 486180 461206 449381 475710 473879 487799 505075 536931
10639 536931 543248 549417 598058 666818 753685 849804 928337 1027575 1151939 1262304 1323759
10628 1323759 1398691 1519384 1658176 1837758 2095062 2422636 2842858 3448964 4274729 5344245
10618 5344245 6725119 8511089 10595560 12660314 14160326 14633820 14192114 13460193 12939861
10609 12939861 12936546 13608007 15091967 17484520 20910410 25128765 29276050 31764122 31434848
10600 31434848 28876599 25839180 23589256 22566248 22836451 24510575 27625527 32142449
$$ packed form
10676A57256q877J1444j345j8851R168Q494o420J7861K9746M914j2495O004J284
10663A98183k377J9400K531j4741L6571J6424j7410J9362K7406J8041J5945L2001
10651C51336J5137K7410L8605N0616L076k4974j1825K6329j831J3920J7276L1856
10639E36931O317O169M8641O8760Q6867R6119P8533R9238J24364J10365O1455
10628A323759P4932J20693J38792J79582K57304L27574M20222O06106Q25765J069516
10618E344245J380874J785970K084471K064754J500012M73494m41706p31921n20332
10609A2939861l315O71461J483960K392553L425890M218355M147285K488072l29274
10600C1434848k558249l037419k249924j023008K70203J674124L114952M516922
$$ plain form
10592 32142449 37582266 42413229 44399723 42119112 36907240 31389559 27075242 24345091
10584 24345091 23085280 23160311 24481848 26839603 29733139 31989350 32120609 29412449
10576 29412449 24988002 20680230 17379406 15183990 13947410 13511894 13654625 14252516
10568 14252516 14944946 15275562 14710340 13107399 10907770 8761704 6991995 5653154
10560 5653154 4650916 3930062 3401410 2998641 2692360 2453520 2260011 2074212 1888923
10551 1888923 1742322 1598619 1495588 1392872 1295058 1205325 1111571 1040286 990115 928599
10541 928599 871360 810369 749095 726289 714877 667988 618200 591132 559384 549569 520367 483251
10529 483251 442310 410809 367730 320877 299149 298480 283166 265422 262326 230230 217340 219534
$$ packed form
10592C2142449N439817M830963J986494k280611n211872n517681m314317k730151
10584B4345091j259811P5031J321537K357755K893536K256211J31259k708160
10576B9412449m424447m307772l300824k195416j236580m35516J42731N97891
10568A4252516O92430L30616n65222j602941k199629k146066j769709j338841
10560E653154j002238p20854n28652m02769l06281k38840j93509j85799j85289
10551A888923j46601j43703j03031j02716r7814q9733r3754p1285n0171o1516
10541I28599n7239o0991o1274k2806j1412m6889m9788k7068l1748r815k9202l7116
10529D83251m0941l1501m3079m6853k1728o69j5314j7744l096l2096j2890K194
$$ plain form
10517 219534 220358 230413 192849 166185 173429 182547 181277 158114 140099 113176 110488 114676 142220
10504 142220 144420 130030 133235 138057 133103 118518 115461 128985 129859 97175 86054 66436 58499
10491 58499 52645 22008 25689 53411 66573 49255 35033 18151 39876 54047 41388 61067
10479 61067 63901 56683 49846 40516 41169 30790 22920 35337 29199 48730 61704 47271 28030
10466 28030 14726 -5248 9427 20299 22023 25004 43951 49362 63926 48330 26268 9163
10454 9163 11012 -4718 -2572 4254 4180 20852 65380 75275 72581 72815 93510 105341 85733 63944
10440 63944 63267 76794 88103 91377 71411 90348 79676 73989 74453 89177 111046 89892 63437
10427 63437 53131 48255 41288 29581 45707 49316 36263 24920 29611 36073 31074 40785 37848
$$ packed form
10517B19534Q24J0055l7564k6664P244R118j270k3163j8015k6923k688M188K7544
10504A42220K200j4390L205M822m954j4585l057J3524Q74l2684j1121j9618p937
10491E8499n854l0637L681K7722J3162j7318j4222j6882K1725J4171j2659J9679
10479F1067K834p218o837r330O53j0379p870J2417o138J9531J2974j4433j9241
10466B8030j3304j9974J4675J0872J724K981J8947N411J4564j5596k2062j7105
10454I163J849j5730K146O826p4J6672M4528R895k694K34K0695J1831j9608k1789
10440F3944o77J3527J1309L274j9966J8937j0672n687M64J4724K1869k1154k6455
10427F3437j0306m876o967j1707J6126L609j3053j1343M691O462m999R711k937
$$ plain form
10414 37848 31177 21647 33379 16270 14427 20574 -1619 30512 63944 67967 32596 21099 26455
10401 26455 27210 9537 -20003 -37010 -10131 26190 39559 29155 19960 21943 28531 1858 1581
10388 1581 18035 -1777 12758 29906 17046 22013 27489 14064 -15512 -7448 11891 -137
10376 -137 -20084 -1970 31719 58844 46431 44102 7355 -16223 -22313 5957 22421 26863 18419
10363 18419 24737 47047 56317 44323 36871 15076 5604 -7110 5759 -3705 -30946 -24525 2932
10350 2932 -13160 -18379 -10596 -1222 2134 -22607 -43788 -40291 -30597 -22420 -671 -846 -2375 -4948
10336 -4948 5768 21605 19684 -10321 -7194 -24299 -16300 -5268 17551 23984 20127 -124 1737
10323 1737 19540 -8479 -21645 -44781 -52062 -40593 -37368 -24600 -5811 4375 -6515 3384
$$ packed form
10414C7848o671r530J1732j7109j843O147k2193L2131L3432M023l5371j1497N356
10401B6455P55j7673k9540j7007K6879L6321J3369j0404r195J983O588k6673k77
10388A581J6454j9812J4535J7148j2860M967N476j3425k9576Q064J9339j2028
10376a37j9947J8114L3689K7125j2413k329l6747k3578o090K8270J6464M442q444
10363A8419O318K2310R270j1994p452k1795r472j2714J2869r464k7241O421K7457
10350B932j6092n219P783R374L356k4741k1181L497R694Q177K1749j75j529k573
10336d948J0716J5837j921l0005L127j7105P999J1032K2819O433l857k0251J861
10323A737J7803k8019j3166k3136p281J1469L225J2768J8789J0186j0890R899
$$ plain form
10311 3384 17670 3718 -25832 -25223 8140 12102 3292 -13411 -9707 28 12190 -1853 -27596
10298 -27596 1342 6257 6347 8821 -13477 -29151 -40706 -38700 -22009 -17568 3285 27815 10509
10285 10509 -7745 3070 11514 -10565 -15348 -5613 -16683 -60430 -48407 -20189 -13132 -22281 -16680
10272 -16680 -28792 -16317 -7288 -21184 -23322 -10431 9616 2645 -6727 19663 29266 26231 10717
10259 10717 -9579 4528 -1405 -6365 -14709 -6185 -2836 -34054 -59548 -47656 -18880 -15828 -13651
10246 -13651 -27067 18760 13145 28037 31409 19357 17090 2447 3661 22411 23874 -6379 -6381
10233 -6381 5125 -6362 -10282 9962 6536 4606 -13891 6998 29971 33519 35126 9926 26395
10220 26395 33071 40234 30802 20770 17282 26571 11411 1308 30 -9119 -2752 27480 8265
$$ packed form
10311C384J4286j3952k9550O09L3363L962q810j6703L704R735J2162j4043k5743
10298b7596K8938M915R0K474k2298j5674j1555K006J6691M441K0853K4530j7306
10285A0509j8254J0815Q444k2079m783R735j1070m3747J2023K8218P057r149N601
10272a6680j2112J2475R029j3896k138J2891K0047o971r372K6390R603l035j5514
10259A0717k0296J4107n933m960q344Q524L349l1218k5494J1892K8776L052K177
10246a3651j3416M5827n615J4892L372j2052k267j4643J214J8750J463l0253k
10233f381J1506j1487l920K0244l426j930j8497K0889K2973L548J607k5200J6469
10220B6395O676P163r432j0032l488R289j5160j0103j278r149O367L0232j9215
$$ plain form
10207 8265 11293 -11788 -14036 2561 3449 5249 -3353 -2658 -7222 -362 34894 21217 -3259 2098
10193 2098 4184 -9471 2924 12850 16679 5202 -9809 -2994 -1718 18712 13843 17225 18193 13453
10179 13453 45410 61250 69802 73846 66667 53077 57319 76060 77916 104906 129640 148689 164441
10166 164441 193403 194883 177725 160521 134659 94287 87065 89932 81473 97071 133272 171246
10154 171246 197872 207934 201784 190959 152384 141910 126763 107423 100332 108398 124147 135698
10142 135698 130638 144971 159710 151305 125198 105826 91787 60963 65364 78541 78411 87102 84266
10129 84266 63135 48651 43690 53278 66202 59145 28794 -12321 -18738 -20796 -371 8945 36636
10116 36636 31765 18075 3901 -9648 -12844 -24221 -18140 -3959 -63 -16231 -24375 -10846 2337
$$ packed form
10207H265L028k3081k248J6597Q88J800q602O95m564O860L5256j3677k4476N357
10193B098K086j3655J2395R926L829j1477j5011O815J276K0430m869L382R68m740
10179A3453L1957J5840Q552M044p179j3590M242J8741J856K6990K4734J9049J5752
10166A64441K8962J480j7158j7204k5862m0372p222K867q459J5598L6201L7974
10154A71246K6626J0062o150j0825l8575j0474j5147j9340p091Q066J5749J1551
10142A35698n060J4333J4739q405k6107j9372j4039l0824M401J3177j30Q691k836
10129H4266k1131j4484m961R588J2924p057l0351m1115o417k058K0425R316K7691
10116C6636m871j3690j4174j3549l196j1377O081J4181L896j6168q144J3529J3183
$$ plain form
10103 2337 -3149 -9975 -18408 -21109 -14758 17933 24692 26065 13393 2537 -30421 -50876 -36034
10090 -36034 -7284 22396 21665 5265 -17400 -12448 8744 14160 16653 3836 10172 -1516 7486
10077 7486 33095 20213 -13478 -29515 -47496 -53717 -50872 -23364 17346 19640 2829 -14687
10065 -14687 -22305 -16753 13107 6353 11902 11210 -9622 -22530 -19697 7184 9237 19940 6388
10052 6388 1927 10020 -136 -12019 -22337 -14127 -24896 -17651 -4785 455 8845 14982 10919
10039 10919 -10259 -25635 -25177 -8713 3564 4766 -19137 -15589 -10538 411 -16852 3626 28956
10026 28956 26077 4302 613 -6468 15743 36921 -3815 -14989 -6218 -2009 -18017 -25813 -34966
10013 -34966 -12798 -31620 -70375 -67423 -60773 -52535 -49807 -32437 224 22046 4580 -18370
$$ packed form
10103B337n486o826q433k701O351L2691O759J373j2672j0856l2958k0455J4842
10090c6034K8750K9680p31j6400k2665M952K1192N416K493j2817O336j1688R002
10077G486K5609j2882l3691j6037j7981o221K845K7508M0710K294j6811j7516
10065a4687p618N552K9860o754N549o92k0832j2908K833K6881K053J0703j3552
10052F388m461Q093j0156j1883j0318Q210j0769P245J2866N240Q390O137m063
10039A0919k1178j5376M58J6464J2277J202k3903L548N051J0949j7263K0478K5330
10026B8956k879k1775l689p081K2211K1178m0736j1174Q771M209j6008p796r153
10013c4966K2168j8822l8755K952O650Q238K728J7370L2661K1822j7466k2950
$$ plain form
10001 -18370 -4588 17985 -9951 -14642 -12827 150 -2555 -23583 -36864 -85 42928 15843
9989 15843 5322 -10930 -43770 -34349 -9281 -18913 -44040 -42509 -31819 -31134 -33673 -14665 -13228
9976 -13228 -10469 7376 8638 22520 11721 26241 34320 5839 -33559 -44540 -10740 -6597 -11101
9963 -11101 2829 -1104 1231 9369 24464 3456 -17859 -35756 -24911 -26017 -14321 -3563 -21083
9950 -21083 -35453 -16278 28905 1688 -19660 -4835 -13010 -5979 -28432 -14376 -3552 -8299
9938 -8299 -23141 -25183 2427 28712 16402 15228 7158 -626 23318 34377 17396 5251 -6073
9925 -6073 -2920 -21854 -29506 -7405 22533 34402 36778 20687 -8256 3560 12551 -3785 -22777
9912 -22777 -23177 -21077 -35981 -32084 -26119 -31309 -22687 -20133 -4732 -5986 -6278 -23769 -3039 3702
$$ packed form
10001a8370J3782K2573k7936m691J815J2977k705k1028j3281L6779M3013k7085
9989A5843j0521j6252l2840R421K5068r632k5127J531J0690O85k539J9008J437
9976a3228K759J7845J262J3882j0799J4520Q079k8481l9398j0981L3800M143m504
9963a1101J3930l933K335Q138J5095k1008k1315j7897J0845j106J1696J0758j7520
9950b1083j4370J9175M5183k7217k1348J4825q175P031k2453J4056J0824m747
9938h299j4842k042K7610K6285j2310j174q070p784K3944J1059j6981j2145j1324
9925f073L153j8934p652K2101K9938J1869K376j6091k8943J1816Q991j6336j8992
9912b2777m00K100j4904L897N965n190Q622K554J5401j254k92j7491K0730O741
$$ plain form
9898 3702 7824 30486 22911 5291 -26397 2569 31817 42650 19831 -799 -16266 -50501
9886 -50501 -61227 -38101 -47814 -37831 -7051 -10358 -16336 -3501 -2863 7069 8061 8405 39368 17637
9872 17637 4479 7924 2365 2782 -10992 -26433 -16845 -18054 -5797 4042 -15583 -32386 -33962
9859 -33962 -9591 4487 10564 19939 10546 22795 -2679 -12483 -7899 9349 34522 57171 40898
9846 40898 34753 19933 11030 -11571 -25974 -30163 -15190 -5780 7965 25104 -2865 -5789 21061
9833 21061 27743 45660 20132 -22489 3139 20953 32124 29288 45766 41262 -3558 -16247
9821 -16247 9430 12622 7292 25742 32215 29827 52943 34223 32693 33051 9761 -8030 1488
9808 1488 15723 18611 -6995 -48 7244 18335 42531 23109 8565 4934 -7751 -11365 -14393
$$ packed form
9898C702M122K2662p575j7620l1688K8966K9248J0833k2819k0630j5467l4235
9886e0501j0726K3126r713R983L0780l307n978J2835O38R932R92L44L0963k1731
9872A7637j3158L445n559M17j3774j5441R588j209J2257R839j9625j6803j576
9859c3962K4371J4078O077R375r393J2249k5474r804M584J7248K5173K2649j6273
9846D0898o145j4820q903k2601j4403m189J4973R410J3745J7139k7969k924K6850
9833B1061O682J7917k5528m2621K5628J7814J1171k836J6478m504m4820j2689
9821a6247K5677L192n330J8450O473k388K3116j8720j530L58k3290j7791R518
9808A488J4235K888k5606O947P292J1091K4196j9422j4544l631j2685l614l028
$$ plain form
9795 -14393 -5319 -7489 691 267 -12528 4659 36265 35774 4594 -5522 -22912 -30724 -17670
9782 -17670 -11570 -6426 6047 8054 -98 -25193 -35730 -29906 -29100 -1107 33501 63229 53109
9769 53109 27849 2252 -22424 -33674 -39236 -42908 -39337 -34883 -28910 -21369 -22720 -25008 -55375
9756 -55375 -55268 -39494 -26776 -15858 -21777 -24977 -34393 -42814 -30584 -14584 -29586 -37187 -33477
9743 -33477 -7344 8779 16955 18217 1295 -23230 -20119 -19537 -10093 -26968 -15708 -17766 -55409
9730 -55409 -45080 -52701 -68571 -75666 -72989 -25969 -9365 -3561 -12185 2878 -17638 -29651 -32251
9717 -32251 -18242 -14250 -11886 -13307 -6988 -28042 -58782 -50830 -30246 -33453 -42339 -39532 -20538
9704 -20538 -18491 -18676 -36356 -23727 -21443 -17672 -9402 -16695 -21783 -16747 13805 38460 39036 41961
$$ packed form
9795a4393R074k170Q180m24j2795J7187L1606m91l1180j0116j7390p812J3054
9782a7670O100N144J2473K007q152k5095j0537N824Q06K7993L4608K9728j0120
9769E3109k5260k5597k4676j1250n562l672L571M454N973P541j351k288l0367
9756e5375J07J5774J2718J0918n919l200r416q421J2230J6000j5002p601L710
9743c3477K6133J6123Q176J262j6922k4525L111N82R444j6875J1260k058l7643
9730e5409J0329p621j5870p095K677M7020J6604N804q624J5063k0516j2013k600
9717c2251J4009L992K364j421O319k1054l0740P952K0584l207q886K807J8994
9704b0538K047j85j7680J2629K284L771Q270p293n088N036L0552K4655N76K925
$$ plain form
9690 41961 42389 45424 32035 12785 9459 -18595 -46639 -26806 -11475 -18880 -37664 -42160 -55842
9677 -55842 -64522 -33901 1050 -219 -16027 -36122 -38200 -33767 -31544 -43704 -25558 -1027 19051
9664 19051 18588 48601 41878 40921 15691 -10011 12053 55786 63829 50778 34907 37344 25405
9651 25405 61305 92501 114463 182550 264097 275933 175175 89081 55091 48843 24004 12977
9639 12977 8649 32753 39732 12035 10020 18831 1619 21501 43318 52322 43015 34393 -1952
9626 -1952 927 3383 -19837 -28710 -5788 30254 53750 41742 19678 4704 16431 5501 -4704
9613 -4704 -36688 -26380 -11049 -35449 -15331 5755 7653 -2868 11237 -460 -30903 -32777
9601 -32777 -18603 -5620 -21350 -15370 -19144 -11340 -12747 11960 8748 13730 8091 9276 -1919
$$ packed form
9690D1961M28L035j3389j9250l326k8054k8044J9833J5331p405j8784m496j3682
9677e5842q680L0621L4951j269j5808k0095k078M433K223j2160J8146K4531K0078
9664A9051m63L0013o723r57k5230k5702K2064M3733Q043j3051j5871K437j1939
9651B5405L5900L1196K1962O8087Q1547J1836j00758q6094l3990o248k4839j1027
9639A2977m328K4104O979k7697k015Q811j7212J9882K1817R004r307q622l6345
9626a952K879K456k3220q873K2922L6042K3496j2008k2064j4974J1727j0930j0205
9613d704l1984J0308J5331k4400K0118K1086J898j0521J4105j1697l0443j874
9601c2777J4174J2983j5730N980l774P804j407K4707l212M982n639J185j1195
$$ plain form
9588 -1919 1165 23353 51892 48199 34126 30278 44171 17539 2117 12725 -3352 -30035 -49127
9575 -49127 -47286 -23595 8328 4336 -20879 -13371 -8064 -6757 5252 15713 24403 -17965 -31480
9562 -31480 -26281 -25075 -12047 14018 39934 38096 50996 35163 12083 -15071 -15905 2353 -4723
9549 -4723 -18011 -37525 -15438 -3166 -25899 -33105 -8477 -22310 -44342 -33489 -13801 -27909
9537 -27909 -46631 -13928 33494 20169 6391 -25971 -28802 -24904 6105 -10604 -14720 3362
9525 3362 10830 7195 1180 -9285 13282 24032 23546 14086 4980 -7902 -36510 -15552 -1425
9512 -1425 10023 15903 21388 10418 -10025 -37933 -26023 13140 21787 14896 25032 20766 34283
9499 34283 37157 1324 -19335 -3835 16785 5413 -6601 -9618 -3390 -200 1599 -7675 -15733
$$ packed form
9588a919L084K2188K8539l693j4073l848J3893k6632j5422J0608j6077k6683j9092
9575d9127J841K3691L1923l992k5215P508N307J307J2009J0461Q690m2368j3515
9562c1480N199J206J3028K6065K5916j838J2900j5833k3080k7154q34J8258p076
9549d723j3288j9514K2087J2272k2733p206K4628j3833k2032J0853J9688j4108
9537b7909j8722L2703M7422j3325j3778l2362k831L898L1009j6709m116J8082
9525C362P468l635o015j0465K2567J0750m86r460r106j2882k8608K0958J4127
9512a425J1448N880N485j0970k0443k7908J1910L9163Q647o891J0136m266J3517
9499C4283K874l5833k0659J5500K0620j1372j2014l017O228L190J799r274q058
$$ plain form
9486 -15733 -14501 -9400 18600 25785 -12148 -45921 -31742 17784 -14523 -38847 -35065 -4195 -12319
9473 -12319 -40684 -28596 -21702 -6307 5933 -14012 6442 5228 -7421 -2740 12239 12519 14323
9460 14323 17931 16797 21537 20409 4237 -26438 -23218 740 13509 3377 1125 14215 13572
9447 13572 2450 -18754 -33485 -3330 18802 13455 -41227 -56903 -21470 -5766 -1388 3607
9435 3607 8358 23593 14631 13077 3906 10622 27716 33106 11266 -6252 20343 36527 31669
9422 31669 1250 6551 6753 -1793 -631 -10853 15384 5266 -23821 -34015 -39966 -9568 -299
9409 -299 -1959 -2596 24011 31997 30165 5325 -17586 -22116 -35471 -38735 -31992 -26668 9611 28750
9395 28750 14082 -14682 -11713 -29463 -35332 -23741 -13193 -12908 962 8208 -13334 3720 17746
$$ packed form
9486a5733J232N101K8000P185l7933l3773J4179M9526l2307k4324L782L0870q124
9473a2319k8365J2088O894J5395J2240j9945K0454j214j2649M681J4979K80J804
9460A4323L608j134M740j128j6172l0675L220K3958J2769j0132k252J3090o43
9447A3572j1122k1204j4731L0155K2132n347n4682j5676L5433J5704M378M995
9435C607M751J5235q962j554r171O716J7094N390k1840j7518K6595J6184m858
9422C1669l0419N301K02q546J162j0222K6237j0118k9087j0194n951L0398R269
9409b99j660o37K6607P986j832k4840k2911m530j3355l264O743N324L6279J9139
9395B8750j4668k8764K969j7750n869J1591J0548K85J3870P246k1542J7054J4026
$$ plain form
9382 17746 -6442 -23420 -2327 -579 -8383 -10668 -28716 -31175 -15843 5773 -335 -20840 -12471
9369 -12471 -8774 22460 -6416 -19216 -1574 -2318 13579 21572 22796 20606 -3558 -14667 -36803
9356 -36803 -13688 5786 13142 12851 44023 45526 8926 -18266 -10961 -11761 -2541 -2614 7078 9314
9342 9314 3381 15315 3502 -3752 15918 15717 26134 28050 15763 -7101 -10090 -4790 -17924
9329 -17924 -16980 -7518 1236 26861 45208 34776 6591 -3085 -23427 -27974 -9002 -26836 -63423
9316 -63423 -59102 -33343 -27134 -23448 -40450 -33188 -23043 -24820 -47090 -60542 -33199 11551 5183
9303 5183 -30274 -27809 -24456 -50957 -57763 -30762 -14325 5953 16647 -350 6614 -628 -28604
9290 -28604 -30523 -16702 -5472 -4886 25380 27796 -7102 -25879 -12710 -3111 -4732 1411 13544
$$ packed form
9382A7746k4188j6978K1093J748p804k285j8048k459J5332K1616o108k0505Q369
9369a2471L697L1234k8876j2800J7642p44J5897P993J224k190k4164j1109k2136
9356c6803K3115J9474P356k91L1172J503l6600k7192P305q00R220p3R692K236
9342I314n933J1934j1813p254J9670k01J0417J916j2287k2864k989N300j3134
9329a7924R44R462Q754K5625J8347j0432k8185r676k0342m547J8972j7834l6587
9316f3423M321K5759O209L686j7002P262J0145j777k2270j3452K7343M4750o368
9303E183l5457K465L353k6501o806K7001J6437K0278J0694j6997O964p242k7976
9290b8604j919J3821J1230N86L0266K416l4898j8777J3169R599j621O143J2133
$$ plain form
9277 13544 4835 -1732 -28412 -38492 -34564 -27315 2712 -1496 15638 32889 59431 24227 -11892
9264 -11892 -33415 -43504 -47177 -26424 -8383 -6579 23562 30534 29264 -6674 -34698 -43941 -39538
9251 -39538 -35653 -48871 -21034 2380 -642 -19389 5642 29346 20374 -4029 -35836 -54830
9239 -54830 -43822 -11422 8013 14447 30854 27563 -2406 -13461 -25338 -41030 -43360 -35273 -19024
9226 -19024 20353 5383 -336 6789 -25169 -46618 -47457 -53603 -42533 122 17381 14142 26690
9213 26690 39225 39094 38248 32538 22553 29329 45548 47364 34932 32512 -1586 -43723 -44311 -6635
9199 -6635 -36809 -60617 -45523 -19359 -4502 2780 9190 29373 53302 34362 5728 -817 596
9186 596 -19337 -22383 -14438 -25274 -6986 -1078 -10621 -25389 -19463 -6873 -12030 -42856 -47418 -39267
$$ packed form
9277A3544q709o567k6680j0080L928P249L0027m208J7134J7251K6542l5204l6119
9264a1892k1523j0089l673K0753J8041J804L0141O972j270l5938k8024r243M403
9251c9538L885j3218K7837K3414l022j8747K5031K3704q972k4403l1807j8994
9239e4830J1008L2400J9435O434J6407l291k9969j1055j1877j5692k330Q087J6249
9226a9024L9377j4970n719P125l1958k1449q39o146J1070M2655J7259l239J2548
9213B6690J2535j31q46n710r985O776J6219J816j2432k420l4098m2137n88L7676
9199f635l0174k3808J5094K6164J4857P282O410K0183K3929j8940k8634o545J413
9186E96j9933l046P945j0836J8288N908r543j4768N926J2590n157l0826m562Q151
$$ plain form
9172 -39267 -38435 -36477 -43427 -48637 -30427 -8383 -7025 -34331 -58888 -44508 -31923 -19338 -765
9159 -765 -412 27267 46395 50741 58710 50696 26019 1133 21104 34648 30010 34199 51270 68137
9145 68137 46087 12097 -46110 -57272 -24344 684 -817 11974 52691 52694 33032 17008 22404
9132 22404 7312 -8980 2433 11650 23895 26899 24817 20885 17362 22793 21529 41517 21535
9119 21535 12480 -12908 7001 19791 4634 -18390 -31205 -19404 -25692 -13756 -3320 20691
9107 20691 2990 10372 14435 2460 -8184 -7514 -8632 -2158 -5346 -1868 -4486 -1849 -24852 -29119
9093 -29119 -27534 -19221 -13787 -16978 1759 -2431 -3273 -4023 -14869 -17312 -26851 -33317 -976 1381
9079 1381 862 -455 -34267 -41189 -34510 -46894 -38228 -21123 4904 14925 -5900 -14762 -21765 -21824
$$ packed form
9172c9267Q32J958o950n210J8210K2044J358k7306k4557J4380J2585J2585J8573
9159g65L53K7679J9128M346P969q014k4677k4886J9971J3544m638M189J7071J6867
9145F8137k2050l3990n8207j1162L2928K5028j501J2791M0717Lj9662j6024N396
9132B2404j5092j6292J1413R217J2245L004k082l932l523N431j264J9988j9982
9119B1535r055k5388J9909J2790j5157k3024j2815J1801o288J1936J0436K4011
9107B0691j7701P382M063j1975j0644O70j118O474l188L478k618K637k3003m267
9093b9119J585Q313N434l191J8737m190q42p50j0846k443r539o466L2341K357
9079A381n19j317l3812o922O679j2384Q666J7105K6027J0021k0825q862p003n9
$$ plain form
9065 -21824 -32276 -42871 -41001 -16108 15016 6104 59 10720 -15323 -38224 -31384 -38623 -62233
9052 -62233 -41428 -39632 -27179 348 11563 16307 19889 25457 6621 2254 22208 11002 -30271
9039 -30271 -40733 -26472 -12423 -6201 30575 24014 -35562 -28082 5924 -5408 4535 -21611 -33519
9026 -33519 -4466 11471 11628 1126 22590 33810 10953 12149 24198 30627 25917 9199 1790
9013 1790 -6094 -29634 -16107 -12785 -15320 -37537 -53654 -53496 -36464 -20103 -5114 11112 10853
9000 10853 14927 23142 15968 10376 18676 41078 29954 19958 7823 24499 12150 -20295 -36880
8987 -36880 -47793 -7848 19837 33280 40892 27090 8116 341 -5559 -14033 -5156 -9136 -4882
8974 -4882 -14748 -9478 -10335 -1055 9454 9395 22974 43213 10647 -21655 -47659 -46097 -41540 -11771
$$ packed form
9065b1824j0452j0595J870K4893L1124q912o045J0661k6043k2901O840p239k3610
9052f2233K0805J796J2453K7527J1215M744L582N568j8836m367J9954j1206m1273
9039c0271j0462J4261J4049O222L6776o561n9576P480L4006j1332R943k6146j1908
9026c3519K9053J5937J57j0502K1464J1220k2857J196J2049O429m710j6718p409
9013A790p884k3540J3527L322k535k2217j6117J58J7032J6361J4989J6226k59
9000A0853M074Q215p174n592Q300K2402j1124r996j2135J6676j2349l2445j6585
8987c6880j0913L9945K7685J3443P612j3802j8974p775n900q474Q877l980M254
8974d882r866N270q57R280J0509n9J3579K0239l2566l2302k6004J562M557K9769
$$ plain form
8960 -11771 -12442 -63353 -65329 -50080 -50823 -14896 -16994 -21685 -38406 -18543 -12068 -23498 -16575 1212
8946 1212 -9599 -3750 -14238 -39147 -40814 -20086 -25213 -38237 -20239 9205 22011 18491 20785
8933 20785 12484 4143 2342 1337 -17372 -30133 -30998 -28724 -108 -18560 -40761 -4006 12369
8920 12369 -3152 -11244 -6057 -12599 -20848 -35165 -38495 864 12510 9329 6649 -3588 -7976
8907 -7976 37239 34431 26784 19676 16360 -12927 -25757 -28869 -14481 -25527 -7508 -8340 -3279 5098
8893 5098 -5333 -20337 -41873 -50277 -33937 -40679 -59134 -45203 -44361 -7719 26667 31978 45232
8880 45232 32133 33340 21438 -19420 -33886 -27032 -22238 -28617 -16132 -34427 -32348 -24987 -13465
8867 -13465 10709 -2102 -9023 -25015 -20394 6629 20986 28795 31900 41642 30987 12820 20579
$$ packed form
8960a1771o71n0911j976J5249p43L5927k098m691j6721J9863O475j1430O923J7787
8946A212j0811N849j0488k4909j667K0728n127j3024J7998K9444J2806l520K294
8933B0785q301q341j801j005j8709j2761q65K274K8616j8452k2201L6755J6375
8920A2369j5521q092N187o542q249j4317l330L9359J1646l181k680j0237m388
8907g976M5215k808p647p108l316k9287j2830l112J4388j1046J8019q32N061Q377
8893E098j0431j5004k1536q404J6340o742j8455J3931Q42L6642L4386N311J3254
8880D5232j3099J207j1902m0858j4466O854M794o379J2485j8295K079P361J1522
8867a3465K4174j2811o921j5992M621K7023J4357P809L105R742j0655j8167P759
$$ plain form
8854 20579 36850 19624 -3889 -7520 -19113 -53617 -34247 -8085 -31833 -11562 -17946 -9625
8842 -9625 -16367 -33769 -41050 -43089 -39946 -30911 -23886 -24978 -13545 -5942 16554 24920 -11955 -23106
8828 -23106 -28885 -26958 -3948 31063 38864 46884 50179 29576 15243 9041 -10661 -13992 10942
8815 10942 1883 -24737 -15544 -14050 -6121 24645 14158 -28496 -31084 -9669 5889 6697 -7325
8802 -7325 -10300 -6945 -3221 12674 -1525 -12138 -8297 -13637 -6799 -8324 1752 10230 1840 -6897
8788 -6897 -22219 -2631 4330 -15238 -32375 -27680 -20633 -23532 -48107 -34511 -8942 -2302 -3131
8775 -3131 -13030 -35280 -26139 598 23396 2817 -2743 9655 -7593 -10530 11949 9876 -7541
8762 -7541 6839 6126 5813 -4532 -30909 -52094 -28940 -14264 -3041 -26129 -28941 -16558 -8705
$$ packed form
8854B0579J6271j7226k3513l631j1593l4504J9370K6162k3748K0271o384Q321
8842i625o742j7402p281k039L143R035P025j092J1433P603K2496Q366l6875j1151
8828b3106n779J927K3010L5011P801Q020L295k0603j4333o202j9702l331K4934
8815A0942r059k6620R193J494P929L0766j0487m2654k588K1415J5558Q08j4022
8802g325k975L355L724J5895j4199j0613L841n340O838j525J0076Q478q390q737
8788f897j5322J9588O961j9568j7137M695P047k899k4575J3596K5569O640q29
8775c131r899k2250R141K6737K2798k0579n560J2398j7248k937K2479k073j7417
8762g541J4380p13l13j0345k6377k1185K3154J4676J1223k3088k812J2383P853
$$ plain form
8749 -8705 1920 4907 -14262 -9404 18678 17218 -22696 -25864 -23968 -5317 18228 37710 33050
8736 33050 14083 17601 25286 28858 22980 -7079 -16289 324 1475 -33364 -44039 -33625 -40919
8723 -40919 -25569 -9621 -20139 -22197 -13724 3745 -5448 -2749 -15397 -54972 -42177 -16719 -19172
8710 -19172 -12633 -26687 -13906 -4301 4919 -14739 -36353 -30235 -34715 -21624 -8525 347 -8275
8697 -8275 -37907 -21929 -16814 -38589 -39835 -18855 5368 -749 -5422 -18342 -42170 -37459 -26583
8684 -26583 -13700 -3156 -3203 -5659 -3367 8558 13456 1899 -10085 -11139 -2379 3237 -3335 10821
8670 10821 13221 -8216 -18707 -4115 -13307 -9841 -28588 -35307 -9336 9806 29433 20798 15774
8657 15774 -4029 -6648 4176 7943 20595 40291 38397 25225 7221 4063 25088 41437 32044
$$ packed form
8749h705J0625K987j9169M858K8082j460l9914l168J896J8651K3545J9482m660
8736C3050j8967L518P685L572n878l0059r210J6613J151l4839j0675J0414p294
8723d0919J5350J5948j0518k058Q473J7469r193K699j2648l9575J2795K5458k453
8710a9172O539j4054J2781R605R220j9658k1614O118m480J3091J3099Q872q622
8697h275k9632J5978N115k1775j246K0980K4223o117m673j2920k3828M711J0876
8684b6583J2883J0544m7k456K292J1925M898j1557j1984j054Q760N616o572J4156
8670A0821K400k1437j0491J4592r192L466j8747o719K5971J9142J9627q635n024
8657A5774j9803k619J0824L767J2652J9696j894j3172j8004l158K1025J6349r393
$$ plain form
8644 32044 5425 -33946 -62078 -36166 -17604 -212 12301 27308 16344 -21096 -42133 -35242
8632 -35242 -37341 -22711 6223 6989 7567 7034 5506 9658 2198 27405 28354 21652 27245 34391 9137
8617 9137 -10064 -12178 -1744 -21068 -32807 -16770 -21495 -35357 -63727 -83186 -65719 -4761
8605 -4761 31628 15114 -4639 -3984 2083 5364 31419 7362 -6401 1381 9712 25881 24454
8592 24454 -951 -9841 -33177 -47544 -60711 -34746 3782 9286 20358 27724 29310 22664 19906
8579 19906 10265 -30547 -39008 -35889 -22541 -11147 -23968 -48381 -37246 -15811 3411 27806
8567 27806 17995 6761 -22495 -49014 -43763 -32502 -24548 -12855 -6419 13803 27735 29507 25391
8554 25391 20879 35576 31604 2469 -8664 2077 1783 -15626 458 6522 15862 27472 17664
$$ packed form
8644C2044k6619l9371k8132K5912J8562J7392J2513J5007j0964l7440k1037O891
8632c5242k099J4630K8934P66N78n33j528M152p460K5207R49o702N593P146k5254
8617I137j9201k114J0434j9324j1739J6037m725j3862k8370j9459J7467O0958
8605d761L6389j6514j9753O55O067L281K6055k4057j3763P782Q331J6169j427
8592B4454k5405q890k3336j4367j3167K5965L8528N504J1072P366J586o646k758
8579A9906r641m0812q461L119J3348J1394j2821k4413J1135K1435J9222K4395
8567B7806r811j1234k9256k6519N251J1261P954J1693O436K0222J3932J772m116
8554B5391m512J4697l972k9135j1133J0741k94j7409J6084O064R340J1610r808
$$ plain form
8541 17664 -4186 22361 26120 5915 -17377 -10730 2458 15467 37317 41294 32623 34923 44382
8528 44382 44534 32349 40307 6404 -31127 -12482 10423 4483 11578 -2561 11968 30124 17493
8515 17493 18503 35467 45303 54047 50763 46360 22147 10733 -1693 -17656 -5021 -9167 -38023
8502 -38023 -13336 -9136 -30161 -23439 -11944 -17006 -24158 -26959 -18782 -13566 -15044 -17271 -2436 -238
8488 -238 2850 16508 21164 20508 15660 14002 2491 -28169 -14105 11049 -19976 -24657 -2608 12146
8474 12146 14178 -1629 17875 17331 823 4101 -8586 -7553 5109 17132 15161 4041 14243
8461 14243 21355 7927 -2336 -3913 -5784 2313 -2848 7741 31594 29467 34276 16713 -3383
8448 -3383 -17070 -1010 10699 4968 29119 35253 16894 -4503 -7655 23026 35308 31478 14161
$$ packed form
8541A7664k1850K6547L759k0205k3292O647J3188J3009K1850L977q671K300R459
8528D4382J52j2185P958l3903l7531J8645K2905n940P095j4139J4529J8156j2631
8515A7493J010J6964R836Q744l284m403k4213j1414j2426j5963J2635m146k8856
8502c8023K4687M200k1025O722J1495n062p152k801Q177N216j478k227J4835K198
8488b38L088J3658M656o56m848j658j1511l0660J4064K5154l1025m681K2049J4754
8474A2146K032j5807J9504n44j6508L278j2687J033J2662J2023j971j1120J0202
8461A4243P112j3428j0263j577j871Q097n161J0589K3853k127M809j7563k0096
8448c383j3687J6060J1709n731K4151O134j8359k1397l152L0681J2282l830j7317
$$ plain form
8435 14161 -17849 -3566 15508 21330 5546 -2404 28412 26671 21051 24322 -11881 -16410 -612
8422 -612 4989 9113 2887 -3959 -14929 -4142 -12625 13593 41379 21486 6322 4715 25111
8409 25111 49629 58329 63664 71897 56773 49199 60647 22227 -8189 -26233 -16088 -12210 -32761
8396 -32761 -20365 4533 -10287 -13584 -37885 -36902 -24721 -26127 -42290 -46356 -36096 -22495 -6486
8383 -6486 22733 32744 -54 -12391 -16063 21023 36142 45053 54675 38589 24182 -13594 -40287
8370 -40287 -57785 -56594 -59829 -36378 -12233 -8780 -30802 -17040 -6743 1289 19710 5723 -21449
8357 -21449 -27030 -5766 14990 13509 16095 40100 -1689 -21722 3155 7956 29618 27863 34577
8344 34577 24400 14345 7566 -843 -4116 18981 24240 14130 2834 -6376 -17744 4316 60
$$ packed form
8435A4161l2010J4283J9074N822j5784p950L0816j741n620L271l6203m529J5798
8422f12N601M124o226o846j0970J0787q483K6218K7786j9893j5164j607K0396
8409B5111K4518Q700N335Q233j5124p574J1448l8420l0416j8044J0145L878k0551
8396c2761J2396K4898j4820l297k4301R83J2181j406j6163m066J0260J3601J6009
8383f486K9219J0011l2798j2337l672L7086J5119Q911R622j6086j4407l7776k6693
8370d0287j7498J191l235K3451K4145L453k2022J3762J0297Q032J8421j3987k7172
8357b1449n581K1264K0756j481K586K4005m1789k0033K4877M801K1662j755O714
8344C4577j0177j0055o779q409l273K3097N259j0110j1296r210j1368K2060m256
$$ plain form
8331 60 28325 47930 43648 34814 51614 45778 29541 27278 32618 33941 45766 36502 40256 34187
8317 34187 36839 32608 28855 32590 35791 30871 34188 10896 -5260 -19560 -44487 -25839 -28338
8304 -28338 -8859 -17 -9895 -8883 -20473 -23717 -27456 -29308 -21827 8993 3561 3565 2260 -14258
8290 -14258 -15122 -2226 26380 24725 30592 2485 -22869 -24429 15786 5839 -35979 -37014 -2339
8277 -2339 734 -2900 -19574 -33872 -13527 19872 47626 36478 4659 -8239 -14069 13717 45301
8264 45301 24306 -9113 -21805 -40774 -44073 -39863 -12503 -26725 -36580 -16315 431 23293
8252 23293 -19138 -24825 -13929 8561 11575 -10498 -35129 -36495 -33361 -21834 -23610 -2207 -6160
8239 -6160 -23033 -22352 -37668 -30905 -16000 6287 -7353 -5277 -13723 7988 43923 61104 45157
$$ packed form
8331F0K8265J9605m282q834J6800n836j6237k263N340J323J1825r264L754o069
8317C4187K652m231l753L735L201m920L317k3292j6156j4300k4927J8648k499
8304b8338J9479Q842r878J012j1590l244l739j852P481L0820n432Mj305j6518
8290a4258q64J2896K8606j655N867k8107k5354j560M0215r947m1818j035L4675
8277b339L073l634j6674j4298K0345L3399K7754j1148l1819j2898n830K7786L1584
8264D5301k0995l3419j2692j8969l299M210K7360j4222r855K0265J6746K2862
8252B3293m2431n687J0896K2490L014k2073k4631j366L134J1527j776K1403l953
8239f160j6873O81j5316O763J4905K2287j3640K076q446K1711L5935J7181j5947
$$ plain form
8226 45157 15764 12068 30860 15905 8040 -9104 -42257 -44267 -19864 -6207 -23006 -29254 -26474
8213 -26474 -7223 -13292 7409 11598 6281 3497 42205 54407 49955 28721 -942 -56325 -61196
8200 -61196 -23695 -10110 23728 50423 30989 48604 41823 16730 1849 3070 -3572 6202 23657
8187 23657 17318 2025 -5705 -12661 5093 20234 -2992 -10935 -24597 -40611 -44180 -47701 -45989
8174 -45989 -37174 -51370 -29572 -13217 -25673 -26653 -25386 -35495 -49105 -25820 -25736 -35659 -52268
8161 -52268 -36890 3199 25896 10884 10656 -3081 13039 -3990 -22950 -18896 4889 -14547
8149 -14547 -33952 -21817 30326 35731 25482 8484 -2315 -2708 1439 10917 23777 32819 15755
8136 15755 23264 45679 25363 -6637 -13788 -14629 -16491 -16851 -15925 -15120 -20488 -32193 -53829 -61023
$$ packed form
8226D5157k9393l696J8792j4955p865j7144l3153k010K4403J3657j6799o248K780
8213b6474J9251o069K0701M189n317k784L8708J2202m452k1234k9663n5383m871
8200f1196L7501J3585L3838K6695j9434J7615o781k5093j4881J221o642R774J7455
8187B3657o339j5293p730o956J7754J5141k3226p943j3662j6014l569l521J712
8174d5989Q815j4196K1798J6355j2456r80J267j0109j3610K3285Q4r923j6609
8161e2268J5378M0089K2697j5012k28j3737J6120j7029j8960M054K3785j9436
8149a4547j9405J2135N2143N405j0249j6998j0799l93M147R478J2860R042j7064
8136A5755P509K2415k0316l2000p151q41j862l60R26Q05n368j1705k1636p194
$$ plain form
8122 -61023 -70469 -53271 -26474 -20306 -30087 -20939 -23292 -6430 1829 -14620 -30647 -35068 -33661
8109 -33661 -446 28505 30706 50461 52066 44666 30436 5060 10610 13109 14080 21015 12630 -7282
8095 -7282 -10349 -14877 -41193 -47035 -17752 -17108 -29345 -45629 -35716 -17753 -51291 -63339 -22810
8082 -22810 4503 -13348 5874 18708 12402 -5538 -14405 6488 13897 -6009 -5217 6827 -19805
8069 -19805 -11911 33672 50375 17732 -17766 -37574 -72208 -52879 -18599 -12943 -22824 -13773 3173
8056 3173 18045 8678 -2350 -5514 15349 26538 22666 -18290 -31053 -40235 -33549 -18332 -13786
8043 -13786 -10830 19442 47900 40943 26321 26093 1931 -1217 7354 11839 35576 13903 13528 35581
8029 35581 47626 16743 -16755 -27212 -41699 -20568 7658 27057 22440 15622 -3242 2772
$$ packed form
8122f1023r446J7198K6797O168r781R148k353J6862Q259j6449j6027m421J407
8109c3661L3215K8951K201J9755J605p400j4230k5376N550K499R71O935q385j9912
8095g282l067m528k6316n842K9283O44j2237j6284R913J7963l3538j2048M0529
8082b2810K7313j7851J9222J2834o306j7940q867K0893P409j9906P92J2044k6632
8069a9805P894M5583J6703l2643l5498j9808l4634J9329L4280N656r881R051J6946
8056C173J4872r367j1028l164K0863J1189l872m0956j2763r182O686J5217M546
8043a3786K956L0272K8458o957j4622k28k4162l148Q571M485K3737k1673l75K2053
8029C5581J2045l0883l3498j0457j4487K1131K8226J9399m617o818j8864O014
$$ plain form
8017 2772 11119 12809 20047 28013 32474 24776 8929 1911 8965 1147 -10267 -8421 9014 17404
8003 17404 23866 34802 53071 66532 34257 13113 22983 41078 28791 -8057 -41540 -41296 -11210
7990 -11210 -2851 -14290 -3271 -4948 -16035 -33649 -37757 -45230 -1045 5525 10090 9939 11477 4406
7976 4406 15953 -11578 -21932 12977 -5053 8182 30541 32525 19499 -14121 -19492 -35524
7964 -35524 -31669 -7606 20934 9704 -7951 -13816 -38747 -52965 -44717 -25940 -27817 -37141 -48724
7951 -48724 -27843 -8632 4702 9375 -423 -10366 -6898 6989 18920 37949 25836 40814 47336
7938 47336 27584 13992 32026 32915 8943 15444 17768 15646 17387 -2554 12347 35545 35876
7925 35876 24347 32160 18202 -1303 692 26556 34681 20705 18922 34834 38097 24969 2692
$$ packed form
8017B772Q347J690P238P966M461p698j5847p018P054p818j1414J846J7435Q390
8003A7404O462J0936J8269J3461l2275k1144R870J8095j2287l6848l3483K44L0086
7990a1210Q359j1439J1019j677j1087j7614m108p473M4185O570M565j51J538p071
7976D406J1547k7531j0354L4909j8030J3235K2359J984j3026l3620n371j6032
7964c5524L855K4063K8540j1230j7655n865k4931j4218Q248J8777j877r324j1583
7951d8724K0881J9211J3334M673r798r943L468J3887J1931J9029j2113J4978O522
7938D7336j9752j3592J8034Q89k3972O501K324k122J741j9941J4901K3198L31
7925C5876j1529P813j3958j9505J995K5864Q125j3976j783J5912L263j3128k2277
$$ plain form
7912 2692 11718 39641 49696 45184 27521 -5894 -15428 -6190 -14532 -11063 -31424 -40544 -52916
7899 -52916 -60819 -64497 -55986 -23876 -45983 -39371 -34296 -15601 -15749 -24366 -4501 20075 -1541
7886 -1541 -31710 -30625 -31936 -12365 -7629 1989 -13306 17742 28077 5039 15390 43 10000
7873 10000 16499 16577 9493 -6059 -1498 -31980 -22422 -35250 -69697 -62311 -33105 -27656 -28111 -8584
7859 -8584 3713 -24515 -52356 -54317 -28768 -19752 -26199 -53802 -53922 -29792 -3048 -3818 -42698
7846 -42698 -44729 -7933 17197 37685 30582 2044 -10616 -3595 -4744 2084 9699 26537 42472
7833 42472 54667 22989 -9975 6709 6095 -23960 -25503 -29845 -24520 -7275 8651 10837 -13048
7820 -13048 -25838 -14969 -6630 7708 4402 30765 64906 58223 8033 3950 -12657 -34409 -50641
$$ packed form
7912B692R026K7923J0055m512j7663l3415r534R238q342L469k0361r120j2372
7899e2916p903l678Q511L2110k2107O612N075J8695j48q617J9865K4576k1616
7886a541l0169J085j311J9571M736R618j5295L1048J0335k3038J0351j5347R957
7873A0000O499P8p084j5552M561l0482R558j2828l4447P386K9206N449m55J9527
7859h584J2297k8228k7841j961K5549R016o447k7603j20K4130K6744p70l8880
7846d2698k031L6796K5130K0488p103k8538j2660P021j149O828P615J6838J5935
7833D2472J2195l1678l2964J6684o14l0055j543m342N325J7245J5926K186k3885
7820a3048j2790J0869Q339J4338l306K6363L4141o683n0190m083j6607k1752j6232
$$ plain form
7807 -50641 -46128 -29064 -6324 13313 4717 -18206 -26723 -29994 -15273 -34933 -52267 -68038 -53430
7794 -53430 -47366 -39007 22141 45178 51480 49112 58035 29875 19062 -1815 -3625 -21010 -16111
7781 -16111 -13175 -36302 -46102 -53725 -31504 -34767 -23144 -17092 -13168 -15287 -2086 -13212 -12281 -17815
7767 -17815 -16612 17693 7591 -7989 -11235 -24783 -42650 -59675 -59878 -55704 -39713 -25979 -16122
7754 -16122 -24347 -39656 -46594 -8706 2855 768 -641 -35489 -39908 -20187 122 2329 -11604
7741 -11604 -3786 18743 35122 17921 494 -5200 12502 1403 -30255 -51233 -54671 -60285 -41854
7728 -41854 -2271 20540 24230 18296 14430 38167 47183 22654 -2576 22991 55749 53107 22930
7715 22930 -9305 -12532 -35561 -19974 30813 29597 21555 33114 32755 27215 6381 160 7761
$$ packed form
7807e0641M513J7064K2740J9637q596k2923q517l271J4721j9660j7334j5771J4608
7794e3430O064Q359O1148K3037O302k368Q923k8160j0813k0877j810j7385M899
7781a6111K936k3127r800p623K2221l263J1623O052L924k119J3201j1126R31n534
7767a7815J203L4305j0102j5580l246j3548j7867j7025k03M174J5991J3734R857
7754a6122q225j5309o938L7888J1561k087j409l4848m419J9721K0309K207j3933
7741a1604P818K2529J6379j7201j7427n694J7702j1099l1658k0978l438n614J8431
7728d1854L9583K2811L690n934l866K3737R016k4529k5230K5567L2758k642l0177
7715B2930l2235l227k3029J5587N0787j216q042J1559l59n540k0834o221P601
$$ plain form
7702 7761 -7825 -2209 -13295 -43253 -43082 -35991 -30521 -15703 15756 19640 12102 -970 -4497 -13068
7688 -13068 -38024 -30002 -15720 419 -15950 -10388 -6202 6516 8525 -7544 -14025 -26354 -13168
7675 -13168 296 -16929 -15421 -705 1749 -5842 26246 23573 31638 5138 -19424 -13148 122
7662 122 4749 -4073 -5601 -18935 -37938 -27921 -14247 -7501 -3598 -8072 -9219 3596 22482 52758
7648 52758 49655 14120 16190 26112 -7719 -14468 -5266 -40218 -60971 -58997 -44939 2696 6343
7635 6343 -8201 4710 -20095 -42757 -28566 -29661 -22611 -42459 -35367 -24522 -22682 -28979 -40745
7622 -40745 -23982 -1976 -5546 -3673 -37015 -42979 -17824 -2061 -13658 5475 -4443 -26600 -24807
7609 -24807 -36948 -58773 -70639 -48477 -35136 -36745 596 316 6628 31872 29848 39755 45676
$$ packed form
7702G761j5586N616j1086k9958J71P091N470J4818L1459L884p538j3072l527q571
7688a3068k4956Q022J4282J6139j6369N562M186J2718K009j6069o481j2329J3186
7675a3168J3464j7225J508J4716K454p591L2088k673Q065k6500k4562O276J3270
7662A22M627q822j528j3334j9003J0017J3674O746L903m474j147J2815J8886L0276
7648E2758l103l5535K070R922l3831o749R202l4952k0753J974J4058M7635L647
7635F343j4544J2911k4805k2662J4191j095P050j9848P092J0845J840o297j1766
7622d0745J6763K2006l570J873l3342n964K5155J5763j1597J9133r918k2157J793
7609b4807j2141k1825j1866K2162J3341j609L7341k80O312K5244k024R907N921
$$ plain form
7596 45676 22298 8544 -12620 -26756 -20810 -16607 -42921 -33922 -24719 -18274 5630 18163 11362
7583 11362 15077 36450 52369 56468 50177 54804 47867 31300 41660 46583 31750 34198 13107
7570 13107 -9559 -18947 13450 13534 4128 11485 -7653 -12922 -6813 -23785 -17581 -23284 -35474 -20850
7556 -20850 -8692 -9935 -10378 -7652 -840 15132 23419 -1905 -8992 21831 6945 16157 10950 7014
7542 7014 9133 10858 -34050 -24770 -11974 -5198 29772 22251 7224 -2677 -18218 -26288 -23932 6906
7528 6906 26499 10715 -3668 -24019 5940 31641 13733 -7638 -3326 28742 17589 -17125
7516 -17125 -29669 -40547 -32659 -15247 -5950 -21338 -41157 -61646 -50499 -18877 -10123 -45358
7504 -45358 -51765 -29681 14150 35377 43584 51327 43516 43470 31387 21702 5695 12881 24161 14740
$$ packed form
7596D5676k3378j3754k1164j4136N946M203k6314Q999R203O445K3904J2533o801
7583A1362L715K1373J5919M099o291M627o937j6567J0360M923j4833K448k1091
7570A3107k2666r388L2397Q4r406P357j9138n269O109j6972O204n703j2190J4624
7556b0850J2158j243m43K726O812J5972Q287k5324p087L0823j4886R212n207l936
7542G014K119J725m4908R280J2796O776L4970p521j5027r901j5541q070K356L0838
7528F906J9593j5784j4383k0351K9959K5701j7908k1371M312L2068j1153l4714
7516a7125j2544j0878P888J7412R297j5388j9819k0489J1147L1622Q754l5235
7504d5358o407K2084M3831K1227Q207P743p811m6j2083r685j6007P186J1280r421
$$ plain form
7490 14740 19709 -9477 -20875 3974 4982 -3665 592 -4834 3936 15653 34121 15948 -10175
7477 -10175 -3775 25482 38096 44091 57776 70756 54339 25812 9798 -7879 -26036 -36025
7465 -36025 -21131 -22269 -32188 -32201 -6992 609 -7498 -1751 -14368 -9261 -13520 -24389 -10970 8808
7451 8808 10602 2860 -12361 -50758 -67036 -45492 -924 6402 -691 -2704 -4017 3761 25298
7438 25298 8774 -36240 -24264 -18712 -40513 -4933 26570 41048 37974 7393 3672 12613 11892
7425 11892 6902 3114 -10610 -17001 -28920 -40337 -37193 -38549 -61825 -55480 -34046 -25557 -4183
7412 -4183 -3476 -1841 28327 13588 -11272 -8736 -23780 -12015 4607 13979 8549 13716 21977 14523
7398 14523 -16545 -41024 -44930 -44377 -36546 -30553 -23175 14735 23016 12830 -20449 -40224 -32727
$$ packed form
7490A4740M969k9186j1398K4849J008q647M257n426Q770J1717J8468j8173k6123
7477a0175O400K9257J2614N995J3685J2980j6417k8527j6014j7677j8157r989
7465c6025J4894j138r919j3K5209P601q107N747j2617N107m259j0869J3419J9778
7451H808J794p742j5221l8397j6278K1544M4568P326p093k013j313P778K1537
7438B5298j6524m5014J1976N552k1801L5580L1503J4478l074l0581l721Q941p21
7425A1892m990l788j3724o391j1919j1417L144j356k3276O345K1434Q489K1374
7412d183P07J635L0168j4739k4860K536j5044J1765J6622R372n430N167Q261p454
7398A4523l1068k4479l906N53P831N993P378L7910Q281j0186l3279j9775P497
$$ plain form
7385 -32727 -24544 -22928 -17563 -37323 -26394 -11557 8479 5954 -4476 1305 -15529 -29867 -45064
7372 -45064 -26511 -15067 16302 26328 26264 35810 17451 21830 39268 22298 12030 6662 26353
7359 26353 8756 18875 24478 17983 -2900 4050 33467 55486 37068 3710 -9179 5676
7347 5676 -10537 -33067 -47616 -22233 6798 25140 31683 35301 35046 7573 -11369 -19175 -44983
7334 -44983 -52755 -46362 -43403 -43099 -27891 -9058 20020 9826 -2011 -10487 -13587 -1633 -5112
7321 -5112 -57251 -68026 -48115 -18242 6642 -13521 -20548 -7641 5724 6771 -10366 -5421 -6188
7308 -6188 -22644 -28012 -17083 -16268 -5166 -8259 762 9193 25617 34532 19920 -16341 -47855
7295 -47855 -44682 -15286 -8987 -27768 -39991 -27375 -19593 287 37611 26599 5470 11722 -74
$$ packed form
7385c2727Q183J616N365j9760J0929J4837K0036k525j0430N781j6834j4338j5197
7372d5064J8553J1444L1369J0026o4R546j8359M379J7438j6970j0268n368J9691
7359B6353j7597J0119N603o495k0883O950K9417K2019j8418l3358j2889J4855
7347E676j6213k2530j4549K5383K9031J8342O543L618k55k7473j8942p806k5808
7334d4983p772O393K959L04J5208J8833K9078j0194j1837q476l100J1954l479
7321e112n2139j0775J9911K9873K4884k0163p027J2907J3365J047j7137M945p67
7308f188j6456n368J0929Q15J1102l093R021Q431J6424Q915j4612l6261l1514
7295d7855L173K9396O299j8781j2223J2616P782J9880L7324j1012k1129O252j1796
$$ plain form
7282 -74 -30384 -36019 -11550 15837 21062 -2120 -18566 -18099 -33028 -22735 -10895 -1196 1137 -6209
7268 -6209 12340 32738 39261 31278 41996 38886 34732 62118 56155 25759 8816 12397 -5641
7255 -5641 -13703 -407 -4715 -33913 -54992 -25489 -16421 -55051 -59636 -51923 -18699 -32935 -34996
7242 -34996 -14668 -33453 -47994 -54698 -57745 -45588 -8969 14305 16198 -998 -5778 788 7067
7229 7067 -17025 -49233 -42262 -34311 -10872 103 -11293 -23900 -23214 -54669 -52816 -75237 -59771
7216 -59771 -50316 -20854 -11801 -33035 -64489 -72554 -28705 -4302 -37355 -32641 -21715 -25411 -38801
7203 -38801 -26604 -20226 -17986 -24426 -39591 -34855 -36358 -39475 -43222 -24270 7414 19711 25768
7190 25768 31876 30316 36930 11486 1409 -11611 -27275 -27310 -11949 1866 -8275 -10365 -1520
$$ packed form
7282g4l0310n635K4469K7387N225k3182j6446M67j4929J0293J1840R699K333p346
7268f209J8549K0398O523p983J0718l110m154K7386n963l0396j6943L581j8038
7255e641q062J3296m308k9198k1079K9503R068l8630m585P713L3224j4236k061
7242c4996K0328j8785j4541o704l047J2157L6619K3274J893j7196m780O566O279
7229G067k4092l2208O971P951K3439J0975j1396j2607O86l1455J853k2421J5466
7216e9771R455K9462R053k1234l1454q065M3849K4403l3053M714J0926l696j3390
7203c8801J2197O378K240o440j5165M736j503l117l747J8952L1684J2297O057
7190B5768O108j560O614k5444j0077j3020j5664l5J5361J3815j0141k090Q845
$$ plain form
7177 -1520 12087 30221 21811 20803 30393 26231 -12816 -28444 -11531 -5127 -35604 -16181 3354
7164 3354 2733 -16067 14246 28404 54504 50046 10659 -21441 -47546 -27530 -29932 -13211 17782
7151 17782 -2459 -27011 -31398 -1234 -330 9005 33992 18760 -688 -30000 -40777 -37252 -27266
7138 -27266 -25040 -31885 -53339 -41510 -25775 -12391 -14263 -21246 14635 44454 23340 -24245 -31696
7125 -31696 -23349 -20437 -7379 -22725 -22724 -23611 -17171 -9662 9662 28148 42167 34888 -12173 -22168
7111 -22168 -16159 -35307 -36418 13482 39222 39132 28306 3022 90 17662 24764 35577 52021
7098 52021 19907 -3514 353 15755 35552 23561 23797 29088 18883 5272 -3424 12880 10209
7085 10209 -3249 -1603 7486 28577 21160 6632 -290 22936 56664 46446 16736 1784 -8177
$$ packed form
7177a520J3607J8134q410j008R590m162l9047j5628J6913O404l0477J9423J9535
7164C354o21j8800L0313J4158K6100m458l9387l2100k6105K0016k402J6721L0993
7151A7782k0241k4552m387L0164R04R335K4987j5232j9448k9312j0777L525R986
7138b7266K226o845k1454J1829J5735J3384j872o983L5881K9819k1114m7585p451
7125c1696Q347K912J3058j5346Jq87O440P509J9324J8486J4019p279m7061r995
7111b2168O009j9148j111M9900K5740r0j0826k5284k932J7572P102J0813J6444
7098E2021l2114k3421L867J5402J9797j1991K36N291j0205j3611q696J6304k671
7085A0209j3458J646R089K1091p417j4528o922K3226L3728j0218k9710j4952r961
$$ plain form
7072 -8177 8357 12862 13702 13467 14040 14240 51383 74158 53548 44422 19195 -2923 2457 4010
7058 4010 8836 -2558 22563 25795 9495 -6782 -29752 -43543 -31500 -13062 -5378 6598 28295
7045 28295 31256 21390 5264 -1981 -15851 -31456 -49926 -33337 -33494 -44956 -21043 -24713 -46938
7032 -46938 -29917 -28016 -35717 -22620 -10964 -19574 -18521 -26311 -26330 -43337 -20342 30100 39584 21929
7018 21929 -10384 -11452 -2936 4998 9451 -6698 -15641 -40548 -61579 -68834 -71773 -65952 -33255
7005 -33255 -35911 -26209 -21990 -30514 -37798 -60120 -64858 -19950 -1665 898 12444 36102 26856
6992 26856 20273 45101 60037 34535 23075 18172 -9774 -14848 -14893 -11781 27288 26886 9781 14449
6978 14449 15662 39006 44457 47509 51080 61637 56947 54472 50789 388 3907 32315 31252 34329
$$ packed form
7072h177J6534M505Q40k35N73K00L7143K2775k0610r126k5227k2118N380J553
7058D010M826j1394K5121L232j6300j6277k2970j3791J2043J8438P684J1976K1697
7045B8295K961r866j6126p245j3870j5605j8470J6589j57j1462K3913l670k2225
7032d6938J7021J901p701J3097J1656q610J053p790j9j7007K2995N0442R484j7655
7018B1929l2313j068Q516P934M453j6149q943k4907k1031p255k939N821L2697
7005c3255k656R702M219q524p284k2322m738M4908J8285K563J1546K3658r246
6992B6856o583K4828J4936k5502j1460m903k7946n074m5L112L9069m02j7105M668
6978A4449J213K3344N451L052L571J0557m690k475l683n0401L519K8408j063L077
$$ plain form
6964 34329 58547 52147 39685 6252 -7061 -4825 7489 750 -11584 10394 32989 21765
6952 21765 -544 556 -21486 -20903 -28358 -22404 16176 5321 1864 3302 5636 22922 12246
6939 12246 8726 9528 4194 7451 9169 20215 12266 974 -12613 -20740 -29483 -37008 -22885 -6302
6925 -6302 18667 -5639 -1710 -22936 -27724 -20260 -7177 21801 18023 16737 21483 23996 4846
6912 4846 -23628 -28883 -22822 -9110 -18779 -28161 -12127 -11015 -1935 15707 22351 24939 -2942 -17419
6898 -17419 -26140 -25610 -26105 -35949 -24987 -6927 -3206 -18140 -27889 -19668 -3036 -10166 -23627 -22399
6884 -22399 -34363 -41036 -3700 23584 23281 -1851 -11385 -2352 5717 23844 7475 17765 21115
6871 21115 25290 24102 29497 30197 44163 33798 3579 -6752 -16008 -31819 -43157 -42307 -39131 -21629
$$ packed form
6964C4329K4218o400j2462l3433j3313K236J2314o739j2334K1978K2595j1224
6952B1765k2309J100k2042N83p455N954L8580j0855l457J438K334J7286j0676
6939A2246l520Q02n334L257J718J1046p949j1292j3587q127q743p525J4123J6583
6925f302K4969k4306L929k1226m788P464J3083K8978l778j286M746K513j9150
6912D846k8474n255O061J3712r669r382J6034J112R080J7642O644K588k7881j4477
6898a7419q721N30m95r844J0962J8060L721j4934r749Q221J6632p130j3461J228
6884b2399j1964o673L7336K7284l03k5132r534R033Q069J8127j6369J0290L350
6871B1115M175j188N395P00J3966j0365l0219j0331r256j5811j1338Q50L176J7502
$$ plain form
6857 -21629 11878 26455 8183 -9945 -15651 4356 19609 34623 28803 34973 13205 -9708
6845 -9708 -9662 -5433 -7828 -13381 -4493 20712 14401 25436 21963 22959 5170 -14060 -16997 -14624 -15379
6830 -15379 -13577 -27021 -6968 -19986 -9054 22207 35540 27655 35450 27325 3952 -13097 -12300
6817 -12300 -2633 -13775 -20813 -22596 -37062 -16400 12525 -5872 -2577 7478 -16320 -19953 -23450
6804 -23450 -21494 -36020 -40509 -19101 -1335 -8095 -15617 -22668 -6763 22015 8496 -13898 -10058
6791 -10058 14427 27628 34129 30997 -2249 21551 40539 1678 -5180 -894 18555 35582 27083
6778 27083 17634 20833 6654 -25051 -28903 -12421 -3634 9558 20387 27747 15760 -9677 -38184
6765 -38184 -60514 -49008 -39473 -58703 -54759 -27443 -2093 28507 66472 84957 69350 35332
$$ packed form
6857b1629L3507J4577j8272j8128n706K0007J5253J5014n820O170k1768k2913
6845i708M6M229k395n553Q888K5205o311J1035l473R96j7789j9230k937K373p55
6830a5379J802j3444K0053j3018J0932L1261J3333p885P795q125k3373j7049P97
6817a2300R667j1142p038j783j4466K0662K8925j8397L295J0055k3798l633l497
6804b3450J956j4526m489K1408J7766o760p522p051J5905K8778j3519k2394L840
6791a0058K4485J3201O501l132l3246K3800J8988l8861o858M286J9449J7027q499
6778B7083r449L199j4179l1705l852J6482Q787J3192J0829P360j1987k5437k8507
6765c8184k2330J1506R535j9230L944K7316K5350L0600L7965J8485j5607l4018
$$ plain form
6753 35332 381 -30305 -39128 -15751 -36384 -57464 -49372 -18915 -20233 -17982 -23808 -41069 -33848
6740 -33848 -12647 -2843 -463 -8107 18136 41084 48501 39696 35665 4408 1506 26450 66058
6727 66058 61382 41923 18514 5342 -3778 -7750 -14823 -9481 2099 10427 17400 17698 6901 15558
6713 15558 -2805 -23883 -37604 -30830 -5500 -21181 -23512 -24646 -9626 1721 -1615 -15498 -6528
6700 -6528 -10039 -22540 -22036 27440 48681 45785 39370 35820 32883 7096 -12006 -32681 -37889 -20263
6686 -20263 -12404 -6867 3474 3863 844 12378 12711 22657 23976 23270 19280 11768 21995 10250
6672 10250 -2376 -9308 -9628 -18572 -7679 2990 -157 137 28635 42091 21798 17985 43813
6659 43813 53143 11429 26940 30676 16062 -10241 -13036 30716 71807 66706 66964 43331 36840
$$ packed form
6753C5332l4951l0686q823K3377k0633k1080Q092L0457j318K251n826j7261P221
6740c3848K1201R804K380p644K6243K2948P417q805m031l1257k902K4944L9608
6727F6058m676j9459k3409j3172r120l972p073N342J1580Q328O973K98j0797Q657
6713A5558j8363k1078j3721O774K5330j5681k331j134J5020J1347l336j3883Q970
6700f528l511j2501N04M9476K1241k896o415l550k937k5787j9102k0675n208J7626
6686b0263P859N537J0341L89l019J1534L33R946J319p06l990p512J0227j1745
6672A0250j2626o932l20q944J0893J0669l147K94K8498J3456k0293l813K5828
6659D3813R330m1714J5511L736j4614k6303k795M3752M1091n101K58k3633o491
$$ plain form
6646 36840 30939 25817 12160 21179 7113 8155 21413 14017 21418 -2894 -35250 -17813 -18464
6633 -18464 -20544 -22265 -15469 -16532 -10489 4696 14517 9570 -289 -10509 -4790 -9605 9482 15209
6619 15209 -14992 -30333 -35054 -6871 -3064 11540 18541 11313 14477 -641 -2519 -6220 -10538
6606 -10538 -22350 -20409 3549 24505 14031 10283 3657 8143 29715 12235 -49299 -59891 -21827
6593 -21827 3962 5552 -8656 -38948 -69691 -35807 -5628 -7359 11053 45760 56679 27196
6581 27196 -22836 -12759 16204 2499 -11086 -25844 -41469 -58211 -31146 -9285 -16482 -26622
6569 -26622 -21376 -10925 -994 -8389 17762 31823 33611 17704 -36993 -44245 -16979 7042 11617
6556 11617 -10860 -26618 -32309 -24209 -20854 -22971 -54180 -49752 -51616 -25022 -10980 -24285 -4986
$$ packed form
6646C6840n901n122j3657R019j4066J042J3258p396P401k4312l2356J7437o51
6633a8464k080j721O796j063O043J5185R821m947r859j0220N719m815J9087N727
6619A5209l0201j5341m721K8183L807J4604P001p228L164j5118j878l701m318
6606a0538j1812J941K3958K0956j0474l748o626M486K1572j7480o1534j0592L8064
6593b1827K5789J590j4208l0292l0743L3884L0179j731J8412L4707J0919k9483
6581B7196n0032J0077K8963j3705j3585j4758j5625j6742K7065K1861p197j0140
6569b6622N246J0451R931p395K6151J4061J788j5907n4697p252K7266K4021M575
6556A1617k2477j5758n691Q100L355k117l1209M428j864K6594J4042j3305J9299
$$ plain form
6543 -4986 17251 22332 22544 20347 16678 15897 9741 -1026 -5631 10195 18345 16055 11462 -4721
6529 -4721 -24510 -31087 -58269 -44189 -14542 12410 13308 -25929 -30326 -45259 -42043 -14452 316
6516 316 -19748 -22310 839 8730 5487 -916 9480 25661 26835 26527 9676 -10693 -18711 -17960
6502 -17960 -17896 -25612 -34657 -50918 -39617 3367 30206 22821 -3071 -8758 3493 213 14645
6489 14645 9142 1833 19817 30909 28013 42116 50013 24148 15681 -19010 -19205 -3392 -13634
6476 -13634 -26846 -17003 9846 5351 4317 22233 30512 26996 16580 16407 5706 -2400 -16353
6463 -16353 -15483 4915 19765 7906 -33557 -33342 -24760 -21061 -15727 6713 16078 -11298 -4130 -843
6449 -843 17118 20673 11333 -9714 -21319 -11727 -8144 -2188 4780 -19373 -16764 -8448 12861 30159
$$ packed form
6543d986K2237N081K12k197l669p81o156j0767m605J5826Q150k290m593j6183
6529d721j9789o577k7182J4080K9647K6952Q98l9237m397j4933L216K7591J4768
6516C16k0064k562K3149P891l243o403J0396J6181J174l08j6851k0369q018P51
6502a7960O4p716r045j6261J1301M2984K6839p385k5892n687J2251l280J4432
6489A4645n503p309J7984J1092k896J4103P897k5865q467l4691j95J5813j0242
6476a3634j3212R843K6849m495j034J7916Q279l516j0416j73j0701q106j3953
6463a6353Q70K0398J4850j1859m1463K15Q582L699N334K2440R365k7376P168L287
6449h43J7961L555r340k1047j1605R592L583N956O968k4153K609Q316K1309J7298
$$ plain form
6435 30159 47068 41576 25189 15311 7713 9183 -14305 -32945 -40644 -30722 -28246 -50431 -63306
6422 -63306 -55937 -39735 -17171 1496 16382 -15980 -27755 -43471 -48940 -25287 -38933 -42888
6410 -42888 -39603 -24452 -4857 12916 27565 33044 13031 -2745 12332 8997 -9571 -33601
6398 -33601 -34276 -36132 -9923 -3401 15150 20404 -6319 -10718 12281 10853 6886 7569 4011 -8328
6384 -8328 -24151 -21018 -441 19592 12207 -4567 19221 11874 -18004 -36042 -10465 22129 19045
6371 19045 7768 -19489 -11783 -777 15633 28540 15296 -88 1779 4123 16668 -17728
6359 -17728 -41295 -25676 -5807 -8973 -28015 -25690 -19736 -7232 13584 16859 -10995 -29419 -644
6346 -644 53852 44599 19234 10159 25953 46424 52631 37931 4011 -9455 -37820 -26883 -36900
$$ packed form
6435C0159J6909n492j6387r878p598J470k3488j8640p699R922K476k2185j2875
6422f3306P369J6202K2564J8667J4886l2362j1775j5716n469K3653j3646l955
6410d2888L285J5151J9595J7773J4649N479k0013j5776J5077l335j8568k4030
6398c3601o75j856K6209O522J8551N254k6723m399K2999j428l967O83l558j2339
6384h328j5823L133K0577K0033p385j6774K3788p347k9878j8038K5577L2594l084
6371A9045j1277k7257P706J1006J6410J2907j3244j5384J867K344J2545l4396
6359a7728k3567J5619J9869l166j9042K325N954J2504K0816L275k7854j8424K8775
6346f44N4496r253k5365r075J5794K0471O207j4700l3920j3466k8365J0937j0017
$$ plain form
6333 -36900 -56224 -68092 -63316 -49741 -31496 -7350 -16279 -19161 -17174 -14638 10046 23132 31595
6320 31595 33637 21419 -8278 -33414 -16697 -1068 -11899 -6620 -4977 -40691 -46306 -22523 -6771
6307 -6771 -3888 -25866 -7616 -5503 2137 37817 63924 49524 16846 -17355 -17107 -12188 -1662
6294 -1662 -2079 -9746 -16055 -22068 10524 33616 14904 26009 28991 2310 -5944 -17522 -31675
6281 -31675 -10971 -19129 -4194 5417 8873 2883 -15015 -45109 -26841 9128 -4677 -19420 -15486
6268 -15486 10762 53117 40623 8362 -5817 -3480 12436 28111 18891 12522 17020 5940 8277
6255 8277 -31030 -40899 -7756 -1691 -21134 -8394 3358 -19276 -25865 -20897 -4329 11559 26887
6242 26887 14047 -15380 -29629 -21068 7094 28875 15288 -12152 -17308 -16000 -19118 -11142 -2308
$$ packed form
6333c6900j9324j1868M776J3575J8245K4146q929k882J987K536K4684J3086Q463
6320C1595K042j2218k9697k5136J6717J5629j0831N279J643l5714n615K3783J5752
6307f771K883k1978J8250K113P640L5680K6107j4400l2678l4201K48M919J0526
6294a662m17p667o309o013L2592K3092j8712J1105K982k6681q254j1578j4153
6281c1675K0704q158J4935R611L456n990j7898l0094J8268L5969j3805j4743L934
6268a5486K6248M2355j2494l2261j4179K337J5916J5675r220o369M498j1080K337
6255H277l9307r869L3143O065j9443J2740J1752k2634o589M968J6568J5888J5328
6242B6887j2840k9427j4249Q561K8162K1781j3587k7440n156J308l118P976Q834
$$ plain form
6229 -2308 17946 24441 31960 15620 3375 2485 18799 2552 -12208 -5002 8136 -10599 18975
6216 18975 28512 27988 6475 -17788 -35471 -19389 -35670 -23831 4995 5525 -38586 -51054 -36090
6203 -36090 -35037 -16641 -25821 -16264 16212 49653 21771 -32455 -19063 -4701 9464 20602
6191 20602 22305 2577 8473 54816 67901 56179 34541 -6375 -32201 -46197 -63453 -41614
6179 -41614 -27378 -21022 -12237 -9453 -4934 12725 9282 -20621 -52196 -36340 -19686 -20067 -14533
6166 -14533 -27971 -41219 -43844 -39223 -26718 -14093 -7378 -3568 -11980 -27225 -10239 6460 8719
6153 8719 10162 37503 34432 31893 19320 5653 18776 -4258 3597 97 -9618 4442 -2483
6140 -2483 -11185 6683 28542 13227 -3052 -38854 -19586 -4551 15374 25478 12502 28990
$$ packed form
6229b308K0254O495P519j6340j2245q90J6314j6247j4760P206J3138j8735K9574
6216A8975R537n24k1513k4263j7683J6082j6281J1839K8826N30m4111j2468J4964
6203c6090J053J8396r180R557L2476L3441k7882n4226J3392J4362J4165J1138
6191B0602J703j9728N896M6343J3085j1722k1638m0916k5826j3996j7256K1839
6179d1614J4236O356Q785K784M519J7659l443k9903l1575J5856J6654l81N534
6166a4533j3438j3248k625M621J2505J2625O715L810q412j5245J6986J6699K259
6153H719J443K7341l071k539j2573j3667J3123k3034P855l500r715J4060o925
6140b483q702J7868K1859j5315j6279l5802J9268J5035J9925J0104j2976J6488
$$ plain form
6128 28990 11947 12881 31350 29363 26613 20702 -7853 813 -2431 -12988 -8638 6758 -696 12023
6114 12023 34746 39749 29072 -25997 -35524 -10029 -4139 -14053 -9132 -5398 -8549 -4105 34251
6101 34251 41901 26301 14198 -3514 -19160 -20891 -33014 -25948 3323 -14445 10071 3644 7547
6088 7547 -11597 -39128 -35114 -19932 -4596 1124 -17110 -36239 -52697 -27963 -18254 -27820 -44058
6075 -44058 -38104 -64810 -76217 -54698 -12780 -8031 -2331 -3849 -22578 -29663 -16488 -6000 -20764
6062 -20764 -19890 -24725 -40116 -26756 8617 34623 16665 -18404 -18091 -22935 -6597 24306 16293
6049 16293 10523 -2114 -5742 -22083 -44103 -45970 -20183 -17020 -25988 -10076 -15506 3526 -1214
6036 -1214 -15149 -16051 -5513 -1250 -4851 -16323 -15024 4051 -19948 -6355 -7736 -22519 -6539
$$ packed form
6128B8990j7043R34J8469j987k750n911k8555Q666l244j0557M350J5396p454J2719
6114A2023K2723N003j0677n5069r527K5495N890r914M921L734l151M444L8356
6101C4251P650j5600j2103j7712j5646j731j2123P066K9271j7768K4516o427L903
6088G547j9144k7531M014J5182J5336N720j8234j9129j6458K4734R709r566j6238
6075d4058N954k6706j1407K1519M1918M749N700j518j8729p085J3175J0488j4764
6062b0764Q74m835j5391J3360L5373K6006j7958l5069L13m844J6338L0903q013
6049A6293n770j2637l628j6341k2020j867K5787L163q968J5912n430J9032m740
6036a214j3935r02J0538M263l601j1472J299J9075k3999J3593j381j4783J5980
$$ plain form
6023 -6539 -11287 -16317 -18876 -26384 -1423 16967 15456 14266 -14163 -1405 2026 9342 17317 19360
6009 19360 955 -15723 -18985 931 27645 32867 25302 37415 17170 -5329 -21651 -22210 -19151
5996 -19151 -20273 -34058 -41292 -10101 -13071 -19275 -5084 21682 27613 31394 59507 44563 19998
5983 19998 15736 21585 32825 35057 17743 6653 7564 -8966 1008 -2494 -6045 -23540 -43566
5970 -43566 -13336 3335 17417 14140 13789 22098 15605 -14670 -6573 -2516 7120 -7942 -22039
5957 -22039 -3020 -6832 -4196 17169 11623 5297 -643 -10796 -23449 -36401 -10261 -10759 -13362
5944 -13362 7915 -2182 -16733 -4946 -7224 1608 -9197 -2494 23483 54562 51233 18932 -30883
5931 -30883 -47354 -33922 -27176 -7849 1573 -4283 -14296 -14733 -27143 -45174 -35338 -25787 8190
$$ packed form
6023f539m748n030k559p508K4961J8390j511j190k8429J2758L431P316P975K043
6009A9360j8405j6678l262J9916K6714N222p565J2113k0245k2499j6322n59L059
5996a9151j122j3785p234L1191k970o204J4191K6766N931L781K8113j4944k4565
5983A9998m262N849J1240K232j7314j1090R11j6530R974l502l551j7495k0026
5970d3566L0230J6671J4082l277l51Q309o493l0275Q097M057R636j5062j4097
5957b2039J9019l812K636K1365n546o326n940j0153j2653j2952K6140m98k603
5944a3362K1277j0097j4551J1787k278Q832j0805O703K5977L1079l329l2301m9815
5931c0883j6471J3432O746J9327R422n856j0013m37j2410j8031R836R551L3977
$$ plain form
5918 8190 -346 -19424 -20699 -26133 -19520 -13844 12594 22284 19178 -12629 -7816 -7229 -12147 -1396
5904 -1396 2254 7697 -16993 -32392 -46707 -58970 -41354 -24277 -3919 18339 14705 -8095 -25990
5891 -25990 -22668 370 17240 27802 19051 25804 -2391 -37366 -29554 -5465 -9042 -3959 -15685
5878 -15685 -9267 36004 24403 -817 -43040 -44546 -30514 -46971 -77662 -63322 -56275 -63102 -32840
5865 -32840 -23439 -11671 -9133 -19455 -2643 651 -7491 -33681 -44008 -43160 -16280 13284 10297
5852 10297 1789 14284 7289 18053 25188 6861 -2170 -1782 -22645 -2753 18509 12010 -4304
5839 -4304 -1477 25776 45370 43307 32666 -9320 -20668 3405 10377 -5973 -21623 -19140 -26578
5826 -26578 -42444 -57060 -64575 -41495 -57187 -46189 -30131 -14242 -20871 -7902 20107 16369
$$ packed form
5918H190q536j9078j275n434O613N676K6438R690l106l1807M813N87m918J0751
5904a396L650N443k4690j5399j4315j2263J7616J7077K0358K2258l634k2800j7895
5891b5990L322K3038J6870J0562q751O753k8195l4975P812K4089l577N083j1726
5878a5685O418M5271j1601k5220m2223j506J4032j6457l0691J4340P047o827L0262
5865c2840R401J1768K538j0322J6812L294q142k6190j0327Q48K6880K9564k987
5852A0297q508J2495o995J0764P135j8327r031L88k0863J9892K1262o499j6314
5839d304K827K7253J9594k063j0641m1986j1348K4073O972j6350j5650K483p438
5826b6578j5866j4616p515K3080j5692J0998J6058J5889o629J2969K8009l738
$$ plain form
5814 16369 -9800 -36510 -32908 -9712 -3241 -22523 -42086 -49811 -34351 -12547 3905 -4958 -13500
5801 -13500 -7884 -27839 -42760 -17188 9142 2472 10804 29349 43511 44392 25911 -14691 -27211
$$ packed form
5814A6369k6169k6710L602K3196O471j9282j9563p725J5460K1804J6452q863q542
5801a3500N616j9955j4921K5572K6330o670Q332J8545J4162Q81j8481m0602j2520
$$ [...]
##END NTUPLES=NMR SPECTRUM
##END=
