##TITLE=Analysis number 327776
Compound Code mo 00019
Book Reference 233078
Project Code adrs flro3
Chemist Name jom
##JCAMPDX= 6.0         $$ Bruker NMR JCAMP-DX V2.0
##DATA TYPE= NMR SPECTRUM
##DATA CLASS= NTUPLES
##ORIGIN= Bruker BioSpin GmbH
##OWNER= nmr
$$ XWIN-NMR		Version 3.5
$$ Thu Apr  5 09:23:40 2007 GMT Daylight Time (UT+1h)  MAYBRIDGE\nmr@NMR_250MHZ
##.OBSERVE FREQUENCY= 250.131544655141
##.OBSERVE NUCLEUS= ^1H
##.ACQUISITION MODE= SIMULTANEOUS (DQD)
##.ACQUISITION SCHEME= undefined
##.AVERAGES= 16
##.DIGITISER RES= 18
##SPECTROMETER/DATA SYSTEM= dpx250
##.PULSE SEQUENCE= zg30
##.SOLVENT NAME= DMSO
##.SHIFT REFERENCE= (INTERNAL, DMSO, 0, 16.522)
##AUDIT TRAIL= $$ (NUMBER, WHEN, WHO, WHERE, WHAT)
$$ ##TITLE= Audit trail, XWIN-NMR		Version 3.5
$$ ##JCAMPDX= 5.01
$$ ##ORIGIN= Bruker BioSpin GmbH
$$ ##OWNER= nmr
$$ C:\u/data/dgb/nmr/ADRS/600/pdata/1/auditp.txt
$$ ##AUDIT TRAIL=  $$ (NUMBER, WHEN, WHO, WHERE, WHAT)
(   1,<2007-04-05 09:23:20.66 +100>,<MAYBRIDGE\nmr>,<NMR_250MHZ>,
      <created by zg, POWCHK disabled, PULCHK disabled
       configuration hash MD5:
       49 4B E0 1D 92 C2 6B 37 9F E6 65 BC 52 41 86 1D
       data hash MD5: 64K
       B0 84 B1 29 53 24 F5 A2 00 24 05 51 4E 18 50 EB>)
(   2,<2007-04-05 09:23:32.64 +100>,<MAYBRIDGE\nmr>,<NMR_250MHZ>,
      <Start of raw data processing
       ef LB = 0.3 FT_mod = 6 PKNL = 1 SI = 32K 
       data hash MD5: 32K
       84 A0 72 E2 55 AE 70 A3 CA 98 48 F8 78 14 4D F5>)
(   3,<2007-04-05 09:23:34.36 +100>,<MAYBRIDGE\nmr>,<NMR_250MHZ>,
      <apk 
       data hash MD5: 32K
       BC 2D 70 65 AC 89 22 96 55 04 A6 33 CC F6 0D A4>)
(   4,<2007-04-05 09:23:35.10 +100>,<MAYBRIDGE\nmr>,<NMR_250MHZ>,
      <abs ABSG = 5 
       data hash MD5: 32K
       D6 D0 3B 26 C1 31 8C 40 44 27 BC 1B D0 E7 BB 65>)
$$ ##END=
$$ 
$$ hash MD5
$$ B5 0C 54 B5 23 5E C3 07 72 4F 33 26 8D 3D 6F C9
##$RELAX= 
##$RELAX= 
##$RELAX= 
##$RELAX= 
##$RELAX= 
##$RELAX= 
##$RELAX= 
$$ Bruker specific parameters
$$ --------------------------
##$DU= <C:\u>
##$EXPNO= 600
##$NAME= <ADRS>
##$PROCNO= 1
##$TYPE= <nmr>
##$USER= <dgb>
##$AMP= (0..31)
100 100 100 100 100 100 100 100 100 100 100 100 100 100 100 100 100 100 
100 100 100 100 100 100 100 100 100 100 100 100 100 100 
##$AQSEQ= 0
##$AQ_mod= 3
##$AUNM= <au_zg>
##$AUTOPOS= <4 >
##$BF1= 250.13
##$BF2= 250.13
##$BF3= 250.13
##$BF4= 250.13
##$BF5= 500.13
##$BF6= 500.13
##$BF7= 500.13
##$BF8= 500.13
##$BYTORDA= 1
##$CFDGTYP= 0
##$CFRGTYP= 5
##$CHEMSTR= <none>
##$CNST= (0..31)
1 1 145 1 1 1 1 1 1 1 1 1 1 1 1 1 1 1 1 1 1 1 1 1 1 1 1 1 1 1 1 1 
##$CPDPRG= <>
##$CPDPRG1= <>
##$CPDPRG2= <>
##$CPDPRG3= <>
##$CPDPRG4= <mlev>
##$CPDPRG5= <mlev>
##$CPDPRG6= <mlev>
##$CPDPRG7= <mlev>
##$CPDPRG8= <mlev>
##$CPDPRGB= <>
##$CPDPRGT= <>
##$D= (0..31)
0 1 0 0 0 0 0 0 0 0.06 0 0 0 0 0 0 0.0002 0 0 0 0 0 0 0 0 0 0 0 0 0 0 
0 
##$DATE= 1175761399
##$DBL= (0..7)
120 120 120 120 120 120 120 120 
##$DBP= (0..7)
150 150 150 150 150 150 150 150 
##$DBP07= 0
##$DBPNAM0= <>
##$DBPNAM1= <>
$$ [...]
##$SUBNAM6= <"">
##$SUBNAM7= <"">
##$SUBNAM8= <"">
##$SUBNAM9= <"">
##$SW= 20.6930455092707
##$SWIBOX= (0..15)
0 0 3 0 0 0 0 0 0 0 0 0 0 0 0 0 
##$SW_h= 5175.983436853
##$TD= 65536
##$TD0= 1
##$TE= 683.16
##$TE2= 300
##$TE3= 300
##$TEG= 300
##$TL= (0..7)
0 120 120 120 120 120 120 120 
##$TP= (0..7)
150 150 150 150 150 150 150 150 
##$TP07= 0
##$TPNAME0= <>
##$TPNAME1= <>
##$TPNAME2= <>
##$TPNAME3= <>
##$TPNAME4= <>
##$TPNAME5= <>
##$TPNAME6= <>
##$TPNAME7= <>
##$TPOAL= (0..7)
0.5 0.5 0.5 0.5 0.5 0.5 0.5 0.5 
##$TPOFFS= (0..7)
0 0 0 0 0 0 0 0 
##$TUNHIN= 0
##$TUNHOUT= 0
##$TUNXOUT= 0
##$USERA1= <user>
##$USERA2= <user>
##$USERA3= <user>
##$USERA4= <user>
##$USERA5= <user>
##$V9= 5
##$VALIST= <valist>
##$VCLIST= <CCCCCCCCCCCCCCC>
##$VD= 0
##$VDLIST= <DDDDDDDDDDDDDDD>
##$VPLIST= <PPPPPPPPPPPPPPP>
##$VTLIST= <TTTTTTTTTTTTTTT>
##$WBST= 1024
##$WBSW= 4
##$XGAIN= (0..3)
0 0 0 0 
##$XL= 0
##$YL= 0
##$YMAX_a= 258907
##$YMIN_a= -293797
##$ZGOPTNS= <>
##$ZL1= 120
##$ZL2= 120
##$ZL3= 120
##$ZL4= 120
##$ABSF1= 16.522
##$ABSF2= -4.171173
##$ABSG= 5
##$ABSL= 3
##$ALPHA= 0
##$AQORDER= 0
##$ASSFAC= 0
##$ASSFACI= 0
##$ASSFACX= 0
##$ASSWID= 0
##$AUNMP= <proc_1d>
##$AZFE= 0.1
##$AZFW= 0.1
##$BCFW= 0
##$BC_mod= 0
##$BYTORDP= 0
##$COROFFS= 0
##$CY= 12.5
##$DATMOD= 1
##$DC= 0
##$DFILT= <>
##$DTYPP= 0
##$F1P= 14.0000005364418
##$F2P= -0.99999901652339
##$FCOR= 0.5
##$FTSIZE= 32768
##$FT_mod= 6
##$GAMMA= 0
##$GB= 0
##$INTBC= 1
##$INTSCL= 1
##$ISEN= 128
##$LB= 0.3
##$LEV0= 0
##$LPBIN= 0
##$MAXI= 10000
##$MC2= 0
##$MEAN= 0
##$ME_mod= 0
##$MI= 0
##$NCOEF= 0
##$NC_proc= -5
##$NLEV= 6
##$NOISF1= 0
##$NOISF2= 0
##$NSP= 0
##$NTH_PI= 0
##$NZP= 0
##$OFFSET= 16.522
##$PC= 1
##$PHC0= 218.6581
##$PHC1= 11.6468
##$PH_mod= 1
##$PKNL= yes
##$PPARMOD= 0
##$PSCAL= 4
##$PSIGN= 0
##$REVERSE= no
##$SF= 250.13
##$SI= 32768
##$SIGF1= 0
##$SIGF2= 0
##$SINO= 400
##$SIOLD= 32768
##$SREGLST= <1H.DMSO>
##$SSB= 0
##$STSI= 32768
##$STSR= 0
##$SW_p= 5175.98343685301
##$SYMM= 0
##$S_DEV= 0
##$TDeff= 65536
##$TDoff= 0
##$TI= <Analysis number 999999
Compound Code 99
Book Reference 9
Project Code 9>
##$TILT= no
##$TM1= 0
##$TM2= 0
##$TOPLEV= 0
##$USERP1= <user>
##$USERP2= <user>
##$USERP3= <user>
##$USERP4= <user>
##$USERP5= <user>
##$WDW= 1
##$XDIM= 32768
##$YMAX_p= 323792020
##$YMIN_p= -235225
$$ End of Bruker specific parameters
$$ ---------------------------------
##NTUPLES= NMR SPECTRUM
##VAR_NAME=  FREQUENCY,     SPECTRUM/REAL,   SPECTRUM/IMAG
##SYMBOL=    X,             R,               I
##VAR_TYPE=  INDEPENDENT,   DEPENDENT,       DEPENDENT
##VAR_FORM=  AFFN,          ASDF,            ASDF
##VAR_DIM=   32768,         32768,           32768
##UNITS=     HZ,            ARBITRARY UNITS, ARBITRARY UNITS
##FACTOR=    0.157963299565203, 1,           1
##FIRST=     4132.6476996994, 0,             0
##LAST=      -1043.33573715361, 0,           0
##MIN=       -1043.33573715361, -235225,     0
##MAX=       4132.6476996994, 323792020,     0
$$ Real data points
##PAGE= N=1
##DATA TABLE= (X++(R..R)), XYDATA
$$ [...]
28100 53640 60965 30821 29513 27210 37705 28021 29348 24561 -43650 -78045 -71839 -59511 -79556
28087 -79556 -71651 -50693 -32948 25415 63593 64009 40362 19928 -5096 -36730 -5404 73530
28075 73530 75443 69631 74086 72995 45801 23005 -17741 -40299 -55671 -80098 -60440 -23116
28063 -23116 34474 29850 39463 64227 53587 -22486 -3904 6356 -34281 -28322 288 -32257
28051 -32257 -74714 -45108 -70215 -106943 -55203 11924 3590 -37747 -27980 -53890 -8333 -18797
28039 -18797 12934 82222 67466 26220 32132 38434 38321 -15455 -8496 175 15603 18876 -20142
28026 -20142 8470 45397 23191 -26771 -12678 5299 -29675 -53550 -31994 44554 23272 -4890
28014 -4890 -51788 -55137 -54359 -75166 -98647 -72663 -39855 -40090 -59380 -48288 -56730 -16362 25700
28001 25700 33146 21522 3727 -17481 -33617 -19040 1047 -24532 -19879 16505 -37172 -21341
27989 -21341 -28974 -65735 29930 113319 110552 94486 73624 65884 46879 -16023 -46707 -23930
27977 -23930 18077 34436 38990 49218 101631 98066 86520 55228 35781 24884 50219 89900
27965 89900 101748 75133 26399 -2518 -1877 -49927 -90848 -75652 -5461 13229 49520 41848
27953 41848 24878 19170 -12213 28428 34179 -8566 -6624 29663 -10935 -22095 -47659 -81890
27941 -81890 -41307 -47977 -5068 -9884 -95676 -133487 -43899 31861 14529 -34750 -87075 -82511
27929 -82511 -53033 -19932 -17079 -20726 12489 4022 -6442 20665 -33730 -57533 -50878 -3044
27917 -3044 -12802 -23220 689 21493 28053 -6778 53555 98260 60943 52537 61826 56 -51838
27904 -51838 -95759 -106546 -72375 -25611 -8729 -21314 -28557 -37326 10729 -8430 -15894 36417
27892 36417 77134 102554 103261 61209 62511 59935 75280 28588 19901 37511 75933 77820 68133
27879 68133 95486 72472 59619 25363 22222 -322 -17966 -27174 -39130 -32645 50973 69999
27867 69999 43285 7899 -9571 -2816 36036 78616 59612 27334 34168 -3362 -29339 -11836
27855 -11836 16359 11758 -1075 27923 30668 37200 67710 47887 -7238 -46310 -70887 -55101
27843 -55101 -39028 -49002 -37580 -18618 -24339 -22875 -41943 -22027 21069 -4390 -42125 -54304
27831 -54304 -46871 -65175 -50597 -32760 -27600 -76206 -27384 5407 13484 7939 29835 40519
27819 40519 2412 -20297 -30408 -14518 -10896 -4098 -25847 -34056 45583 100956 68971 -19037
27807 -19037 -52624 -49204 -60033 -76090 -103285 -144063 -133418 -84895 -17997 15700 2630 55008
27795 55008 66913 14614 -32297 -69441 -66806 -46600 -35570 -2494 52656 -17240 -88457 -89173
27783 -89173 -67928 9682 25383 -3556 -885 25520 27109 42907 41448 45837 37327 -10337 -18122
27770 -18122 -41742 -46399 -48822 -12358 -39769 -82673 -84467 -34005 -17747 -27583 20305 26920 -56476
27757 -56476 -91778 -86540 -89015 -59928 -66312 -74325 -72328 -19508 86585 94190 62071 37096 63942
27744 63942 38123 -3745 -43018 -27346 -11070 -3201 -10677 -17626 39556 29239 -19377 -9282
27732 -9282 -36520 -68316 -33755 -52829 -65037 -34026 -23817 -29556 -480 49163 77453 64284
27720 64284 3690 -5733 20506 -27127 -99596 -128160 -121597 -82187 -6536 1723 11566 46809
27708 46809 72861 39509 -17696 6139 58218 85633 68392 55244 11009 -67047 -76767 -68260
27696 -68260 -67187 -47924 -13438 -12374 -28374 25477 45113 -912 490 35660 37481 -13869
27684 -13869 -18407 -34445 -79037 -106558 -103921 -81472 -70270 -50275 8108 75420 23458 -28080
27672 -28080 -54516 -37576 -62655 -44199 24875 76146 26901 3892 16186 18754 10232 23888
27660 23888 56720 87027 64415 63422 54759 -10436 -43137 -15371 18356 39782 18366 -57875
27648 -57875 -98599 -68336 -54659 -61571 -29861 -2660 -35396 -42161 -14115 4862 -25436 -46584
27636 -46584 -22889 23607 12231 -55226 -53135 -10278 8253 -18653 -1054 -37576 -75388 -58166
27624 -58166 -25269 10954 35086 81323 90239 69659 89836 42205 -13614 -45180 -21535 -35324
27612 -35324 -18300 33992 13923 16787 -11743 7228 14736 -21184 22744 -27145 -107811 -51034
27600 -51034 -35296 -4138 62277 61507 32195 49319 87321 34723 -17865 6593 -1855 -51139
27588 -51139 -46411 -59213 -88843 -49725 -46712 -70633 -107738 -69063 -10222 -669 -25424 -56057
27576 -56057 -42096 -58190 -71974 -70492 -38646 27736 27744 -48827 -71290 -42507 9105 32349 78641
27563 78641 48557 -14566 -13512 43974 21582 -1096 -47265 -117329 -73195 -64068 -94135 -126113
27551 -126113 -130186 -128609 -110570 -70808 -25696 -3176 -25508 -104965 -75208 -23006 -5560 29207
27539 29207 86417 65413 -24318 -77792 -66273 -12181 37285 27694 4532 -38858 -58259 -40745
27527 -40745 -72324 -57039 7285 56158 48356 90351 63628 15806 -38084 -76891 -4167 43066
27515 43066 23787 1346 -9736 -16676 40212 25070 39594 39955 63470 2316 -28426 -28614 21710
27502 21710 65878 59291 74312 23258 -19820 -55870 -13216 -13020 -30561 9836 -12406 -46667
27490 -46667 -42171 -53649 -34873 -8123 -70054 -101946 -7802 79394 79004 34805 -3005 5536
27478 5536 842 -50271 -42980 -44345 -50934 -25061 23616 35926 -2677 14255 74344 78060 39176
27465 39176 27756 42240 16830 -31676 -44316 -41464 -15358 -19776 -48474 18470 76506 29035
27453 29035 -7951 -5169 -48284 -86910 -118069 -84594 5486 -22690 -55539 -48854 -26459 -3314
27441 -3314 22961 13668 104309 110419 77113 9166 -30421 34250 58987 46845 36629 -26782
27429 -26782 -49561 -22978 25635 84105 83545 73570 90607 99371 55075 97547 59061 100274
27417 100274 156626 175936 116680 -8379 -72059 -21226 40586 32973 16658 50078 40626 -4764
27405 -4764 -14043 -64575 -50447 1897 11974 21191 5964 1236 41241 5240 16582 50587
27393 50587 33000 41945 67774 70746 61767 32422 18244 1222 -15089 -23096 10696 51408
27381 51408 92198 129189 131779 88812 81263 51350 45169 29172 77214 78434 37282 59112
27369 59112 41001 5528 -1279 10276 -11268 -32825 -48623 -29362 54703 75194 62818 52509
27357 52509 77868 92421 73992 84131 41883 23773 54355 68193 52034 49923 31518 54695
27345 54695 81132 52462 36267 30318 -7953 -7488 -12443 68513 103184 94026 64051 48795 67199
27332 67199 63559 43460 22976 56588 71886 9577 -38116 -17643 -17511 3098 -4670 -32880
27320 -32880 -45131 -38406 -14844 14301 7530 42802 51371 38117 31716 77943 77830 34709 18350
27307 18350 22523 634 16811 35756 22290 -23996 -63179 -8523 25287 60874 44364 -4059
27295 -4059 22725 37544 7195 33359 44373 -330 -9088 1640 -23496 -27347 45 -14340
27283 -14340 -2481 32625 77747 32104 47094 -30330 -17103 30753 76414 71034 1579 -31036
27271 -31036 19514 55888 58824 71590 75527 104983 112749 88519 26670 31961 73543 77208 103378
27258 103378 85186 87606 70714 27104 4762 2881 5051 -34725 -942 28934 32716 55604
27246 55604 6945 -3663 -41120 -32363 -1193 33478 71147 52582 61381 76000 11760 32130
27234 32130 45554 8424 13821 17597 24168 55942 62522 69353 75879 97389 90972 59752 53035
27221 53035 75558 95152 80810 44899 7248 41939 35756 29450 74912 33458 -5740 39968
27209 39968 62285 55596 43104 8731 -14014 -12068 37975 43594 38003 56937 64696 46548 27871
27196 27871 40307 62289 34155 2894 -44543 -48273 -19754 -19127 12112 35132 30396 30751 85869
27183 85869 96708 61926 86700 127016 154320 89235 56324 91216 127300 149426 129097 109296
27171 109296 124613 107192 78723 63774 81452 112028 61058 -26117 20314 83944 47100
27160 47100 -4175 -14711 -5995 18440 41548 58792 81661 92297 143497 134739 30242 10331
27148 10331 63172 142602 184681 132353 105038 36303 3963 -13191 31608 3275 -29822 -37517
27136 -37517 -37331 -43213 -40994 -63484 -40586 -2002 -545 35183 44509 41436 65539 79854 46134
27123 46134 21046 8167 -33628 -57796 -26497 -32770 -39561 -39829 -37379 -28507 11732 30925 -26070
27110 -26070 -47267 -61159 -77882 -71520 -41664 -30669 -49622 -39275 7213 32244 72304 100110
27098 100110 65819 33463 66647 52472 -25196 -48479 -17138 16475 20856 52937 45027 44853
27086 44853 37093 640 -33987 -58727 -11625 -7768 264 39740 -3289 18212 50963 59437
27074 59437 85961 101836 111638 113325 89934 119369 126240 66430 11576 -2026 3441 40350
27062 40350 15586 -35364 1874 48071 108433 118124 107177 96397 114076 21320 -9677 1008
27050 1008 65941 44172 -12516 27831 60834 32462 23770 -8720 5439 36865 2151 -48404
27038 -48404 -59643 -92646 -116142 -68730 -50074 -5092 -313 -19985 35878 43803 3281 22541
27026 22541 12565 16223 64442 61485 42595 59821 88201 62901 17846 -14549 15841 25415
27014 25415 25015 -12035 -32729 -13185 44500 140455 161192 177227 155808 96170 88493 22766
27002 22766 67790 77421 14076 -12853 15601 23033 -8118 18700 33896 -6119 -27180 -42142
26990 -42142 -28726 15227 54883 26108 -1022 7976 62953 125440 123680 110468 84684 85895
26978 85895 33949 16459 52206 63857 62755 53010 61700 55997 51510 100861 86860 81921 84886
26965 84886 61751 81427 119886 83000 49227 33337 62676 118521 122382 103943 79172 70217
26953 70217 70217 103047 78243 93380 86413 28839 -12716 -21686 -9711 52530 90327 106208 120425
26940 120425 108748 91979 66199 89908 105523 79016 11158 -31532 -4043 -3573 -6159 8879
26928 8879 2882 59447 72062 56474 74027 81109 89600 23178 12197 91168 104798 47570
26916 47570 12926 -6723 -8436 22715 56863 46198 57134 38830 31123 79068 126968 76337
26904 76337 46812 53855 38390 20343 22933 3954 29963 74600 70862 68695 90750 79874
26892 79874 49846 4736 -29590 -23018 -1337 -12077 25848 87371 47405 75917 107986 115850
26880 115850 61692 63845 34012 17202 23464 34794 27383 10982 32519 26470 33691 34960 90592
26867 90592 98173 48076 62066 80217 105871 82260 71291 94159 153959 119124 142599 138778
26855 138778 121368 106667 95621 53872 64315 46317 26720 22160 -26284 -15489 3118 31551
26843 31551 60692 72403 54870 46251 55592 80125 101721 106719 108936 154219 144565 92764 79578
26830 79578 95082 124027 136072 63867 -15012 -28514 -47701 -26448 48862 71417 14908 983
26818 983 30518 11470 29119 33893 29555 73460 87922 88219 63348 -1136 -14091 -12608 24393
26805 24393 37909 77718 65029 39639 66631 105011 115053 100422 87676 79506 75700 69662
26793 69662 30832 4572 -4146 6222 17637 40446 49408 -6626 41388 53446 55168 70127
26781 70127 64719 34258 27849 -33412 12001 31669 37110 59340 82306 76952 44393 18174
26769 18174 41871 11894 -4832 18009 43914 72563 68328 99909 107958 132823 129838 68957
26757 68957 1083 14744 68382 111244 94229 27552 -3752 26712 40068 67649 76264 45817
26745 45817 62538 92252 110450 98199 100288 99717 78113 20391 -10789 -14680 11970 38770
26733 38770 82043 91700 54095 80025 102408 206199 199278 147275 53566 67329 127150 157514
26721 157514 138380 105899 53490 62939 53864 63914 22348 10131 53810 82302 63707 57205
26709 57205 57409 13486 27602 114878 128597 109869 96610 113636 130071 136219 128972 84458
26697 84458 100804 145359 168491 158541 110124 34295 61250 54692 46788 60615 135701 147469
26685 147469 125429 79528 95616 125921 108207 141589 141190 127574 105987 37773 22291 42577
26673 42577 87629 86551 92325 126858 151626 168420 106806 115296 131845 82461 80751 74565 44402
26660 44402 70903 71411 64801 66979 11767 21189 69937 120074 171579 131167 91445 92718 102437
26647 102437 114653 167601 154168 83201 106686 110794 23473 89817 188874 171464 166863 149366
26635 149366 126402 146421 147906 139475 167141 167599 112721 99204 113613 107981 123620 176382
26623 176382 195033 138856 130194 150027 200489 216896 171093 179135 217273 227100 198055 165293
26611 165293 139718 106822 93365 66447 4572 -9185 -28431 -22222 8024 34700 31650 -6068
26599 -6068 10765 27575 46513 107345 114693 119238 78179 41383 49880 61465 32307 -13399
26587 -13399 26647 91374 69727 76045 86594 84355 101504 133362 160483 159760 126102 128981 107049
26574 107049 94678 138907 182709 175258 125488 112279 154976 131314 73795 61550 61583 63724
26562 63724 60830 94606 85820 146472 174856 161398 165858 117332 99243 117704 85246 145545
26550 145545 146092 89796 52105 41936 91873 105045 103822 150428 145729 150077 170768 199460
26538 199460 180267 132342 145193 145827 136179 128137 79454 68381 63931 58814 74315 120580 123020
26525 123020 145414 149850 124626 151193 206295 161406 111643 124751 151660 165314 145011 115424
26513 115424 135638 127985 92674 101790 144301 196146 193378 152626 105675 59478 125216 195018
26501 195018 148107 102953 81552 128075 118137 81404 122040 152031 182042 180030 162063 152293
26489 152293 201614 180413 129152 104350 112588 143713 155548 116869 129218 135736 123619 123237
26477 123237 159444 196785 233348 239023 221975 223549 224058 184471 166114 177977 171842 126077
26465 126077 155420 154026 182614 174665 156208 154886 155065 201662 207229 185535 196523 212912 207840
26452 207840 207667 200847 226123 256234 234793 183822 160658 194660 173941 162570 186760 215545
26440 215545 215314 231464 282609 240633 181396 169087 176132 188562 182981 184041 219164 190294
26428 190294 148117 155501 110503 96904 149125 158146 184107 237409 245489 224479 208684 213193
26416 213193 260303 287410 261008 253195 222803 206817 203467 236545 208395 206034 218485 184794
26404 184794 147582 184633 196460 209437 249523 305082 291777 277980 228935 221483 235385 202803
26392 202803 190604 144208 174140 228329 211784 163795 178464 186056 181250 173977 199895 193619
26380 193619 172347 198616 242553 231139 194687 224961 237601 172645 174702 211389 188520 143334
26368 143334 137509 122119 141358 150722 192831 248854 249986 215877 216044 209487 180876 170722 196326
26355 196326 252411 227015 157137 142237 122918 177313 228569 251396 246298 304068 317194 248221
26343 248221 231376 197199 224722 270496 290481 288535 292208 333372 331690 296082 280848 245139
26331 245139 258042 202646 216883 252969 228253 236983 218184 224753 192919 214241 230759 199857
26319 199857 205664 240284 299757 281972 232829 211938 203092 190808 211422 243252 292841 354345
26307 354345 315038 304324 341237 294664 256577 235331 235848 252592 236114 288016 350040 298167
26295 298167 267705 291352 298793 302172 312863 257847 274327 268995 238199 248213 269166 273113
26283 273113 304623 303451 278367 291268 320556 315663 322943 337761 310016 269846 230043 228876
26271 228876 290474 372573 405733 368673 305884 294072 315368 378875 392490 388647 323081 318679
26259 318679 300168 280318 232588 260343 326763 371826 373007 362704 330188 274868 260932 276277
26247 276277 274651 255491 190775 178584 241461 278429 212541 143834 142597 188970 236779 279984
26235 279984 291768 287340 308066 265215 243302 202563 226797 251414 298111 314805 300741 273497
26223 273497 246893 287570 263492 270357 268965 299311 297464 283223 266241 267191 263616 287197 281195
26210 281195 251795 233503 245345 274634 280056 278147 323614 395707 367155 261548 241251 283663
26198 283663 294542 268531 329506 348967 372458 431311 476629 456550 408030 334551 300443
26187 300443 358902 385008 343573 367864 390453 363661 420253 450980 427138 437945 364727
26176 364727 319677 324962 312088 309433 312948 334002 326621 332553 353956 336593 295871 279797
26164 279797 282809 318317 344464 342863 320639 339223 361202 372966 380491 385140 354772 381223
26152 381223 369458 345112 347778 380263 369889 292347 249465 281519 353588 406021 417143 441439
26140 441439 493410 457075 379592 341602 305218 348966 394895 424266 397420 404510 383085 418020
26128 418020 437647 413990 418982 478427 447577 451578 454985 418793 438583 450007 423240 457181
26116 457181 502129 497509 473558 482154 474325 477447 403528 379942 382760 362170 363710 366423 421460
26103 421460 471795 514075 517226 540249 522593 519090 451639 407206 365757 364267 422335 511817
26091 511817 490748 437025 400107 405320 428787 452664 480429 442857 457089 481138 429602 410832
26079 410832 460483 459909 396944 389254 389445 411282 399631 419036 430969 443548 436223 444966 418071
26066 418071 407177 422058 441709 515761 478595 470515 465263 473594 457999 456150 453190 529385
26054 529385 554791 572005 576122 544278 535612 573224 592570 568439 577102 566295 572416 525969
26042 525969 466803 487135 516073 503474 534524 527269 484454 508450 535578 558689 603405 558211
26030 558211 501550 531724 555912 595113 601016 512500 526161 532991 548918 587278 580846 564371
26018 564371 580735 593615 644846 605283 532918 535687 522252 536184 545048 563641 569360 588054
26006 588054 600601 543049 640343 686689 643581 643782 673083 729732 732400 634740 617503 595652
25994 595652 599506 574112 553892 564729 613266 616316 629777 643557 611010 574329 583308 615794
25982 615794 588950 561556 584659 621276 670033 700010 752467 759392 716512 771439 755272 766134
25970 766134 769130 762779 747419 704760 700319 688462 648422 689443 753361 773928 723818 654018
25958 654018 608701 616803 625832 675098 696518 673162 632195 635720 659335 700298 711551 754522
25946 754522 756103 698217 660588 661134 701591 735193 769389 729244 695491 687187 683245 737765
25934 737765 790988 850948 849829 812173 843484 876343 845772 861751 859854 853889 830830 774709
25922 774709 777120 795360 818436 827219 843427 799312 743944 731354 733643 723150 684070 674846
25910 674846 732184 762005 747978 742408 747601 767905 797978 785417 795198 781767 832902 813868
25898 813868 848719 889981 866196 860783 885189 927626 899557 900545 875740 893489 912437 832522
25886 832522 785628 786775 825402 877840 921708 938823 939517 942863 951524 959555 980385 1004193 1008978
25873 1008978 1028326 1000555 955313 970052 984352 1001689 1040099 1042760 1014689 1022971 1055511 1109514
25861 1109514 1051036 1031569 1030155 994891 1038175 994393 957697 962573 954996 984300 1012766 1024614
25849 1024614 1049753 1085708 1064153 1080150 1129916 1179293 1175303 1111470 1134836 1122770 1034998
25838 1034998 1029360 1067413 1085401 1072199 1120245 1147897 1096613 1092313 1131273 1139359 1170158 1183725
25826 1183725 1164689 1129899 1127846 1106947 1118069 1102591 1070559 1053357 1112657 1155342 1153399 1186658
25814 1186658 1215514 1249502 1266286 1246359 1258017 1272470 1303467 1305918 1270749 1287779 1314900
25803 1314900 1345978 1347145 1301857 1284376 1338055 1376237 1386525 1385534 1465270 1426040 1432437 1472872
25791 1472872 1444733 1393178 1401644 1391026 1344747 1380735 1379485 1364290 1355865 1352532 1343900 1338272
25779 1338272 1345378 1370560 1458684 1459311 1484398 1480168 1481732 1424406 1415154 1456442 1469566 1481339
25767 1481339 1501471 1562885 1560147 1488801 1470631 1513578 1521334 1585721 1612960 1602955 1578325 1551995
25755 1551995 1531004 1520100 1569570 1626076 1621834 1593543 1589054 1559977 1540605 1539483 1606745 1686102
25743 1686102 1668785 1636860 1671409 1670191 1682543 1704618 1676784 1656545 1627875 1693894 1777669
25732 1777669 1746967 1757855 1814360 1801933 1798241 1778723 1739096 1775553 1793786 1798141 1783196 1770386
25720 1770386 1778105 1840028 1854527 1865328 1935871 1961445 1968823 1986601 1986245 1966613 1981466 1996939
25708 1996939 2049676 2027570 2035286 2108444 2083492 2021980 2007607 2030023 2026973 2076132 2069051 2117782
25696 2117782 2128805 2147066 2169484 2229891 2234932 2228487 2173960 2193362 2222305 2200587 2200291 2236738
25684 2236738 2247487 2217938 2183169 2214047 2223795 2242526 2276897 2286472 2277349 2280808 2300187 2327825
25672 2327825 2382974 2399555 2413291 2384274 2387908 2411083 2396221 2414460 2489084 2521324 2535923
25661 2535923 2554834 2542812 2534552 2616993 2675248 2685392 2692636 2655575 2644950 2674961 2698245 2714158
25649 2714158 2702333 2713548 2704252 2715094 2730774 2760491 2803372 2799960 2805028 2847624 2902926 2931627
25637 2931627 2953077 2892441 2863568 2892247 2943793 3007967 3003335 2964953 2980697 3043581 3087592
25626 3087592 3101195 3125496 3146959 3166939 3194556 3210463 3233634 3241473 3264440 3263907 3244419 3204908
25614 3204908 3225264 3246872 3306540 3346641 3408607 3337539 3227954 3217402 3263644 3368424 3394471
25603 3394471 3423007 3456826 3473488 3485031 3506343 3523167 3475445 3441881 3519574 3590083 3661674
25592 3661674 3751692 3781643 3780867 3743339 3771061 3798354 3812819 3811615 3813750 3837824 3900951 3924971
25580 3924971 3959381 4010707 4009513 4030066 4037016 4067354 4103231 4092373 4083109 4115759 4181464 4224821
25568 4224821 4296473 4315649 4383697 4366818 4326830 4303563 4291981 4335191 4370107 4354551 4372895
25557 4372895 4390568 4437087 4515106 4561787 4572337 4550208 4565147 4644293 4738961 4733317 4697364
25546 4697364 4722499 4766682 4785794 4791965 4835728 4904543 4961776 4931283 4885848 4929935 5018674
25535 5018674 5034775 5072547 5133285 5160976 5149840 5198550 5221147 5257674 5329874 5409980 5445930
25524 5445930 5440670 5494926 5556489 5591846 5562987 5548905 5577501 5569489 5675735 5741788 5731851 5732918
25512 5732918 5709234 5759949 5892650 5969700 5922781 5896770 5944984 5974722 6006682 6017722 6011895
25501 6011895 6057391 6080639 6145904 6190288 6249049 6305985 6310339 6302807 6313486 6392337 6469757 6518419
25489 6518419 6570290 6567349 6573247 6663195 6710594 6734305 6781012 6845569 6818673 6827357 6887075 6967114
25477 6967114 6979151 7003939 7001159 7018762 7093388 7128334 7087079 7103474 7136084 7161038 7161016 7192908
25465 7192908 7234578 7295234 7307252 7318663 7409325 7416732 7413090 7422699 7480661 7491400 7458740 7515405
25453 7515405 7595474 7644738 7651640 7654175 7653454 7696356 7760551 7832174 7839626 7844208 7866008 7847213
25441 7847213 7892020 7945643 8016538 8069209 8108953 8067670 8078315 8054654 8076744 8078904 8110025
25430 8110025 8164665 8206898 8179779 8170184 8117839 8138084 8180415 8214512 8240207 8292416 8305077
25419 8305077 8303747 8299732 8310173 8313514 8279586 8236280 8271071 8282515 8371511 8401305 8394107 8425429
25407 8425429 8459052 8524004 8523146 8405449 8352467 8416128 8414352 8440243 8416707 8368185 8318814 8338586
25395 8338586 8376420 8324035 8330712 8351999 8375516 8332579 8367294 8407084 8393516 8408849 8386855
25384 8386855 8346395 8312855 8339352 8335450 8337686 8269746 8252513 8309203 8355007 8360495 8311888 8237144
25372 8237144 8207537 8219835 8227496 8208348 8277457 8291226 8309633 8247691 8166156 8171296 8152638 8156061
25360 8156061 8071844 8006180 8004416 8032731 7993779 7998817 8044698 8024422 7986098 7930638 7853939 7826168
25348 7826168 7789732 7709887 7664440 7744014 7788402 7776916 7758248 7710382 7660667 7650102 7637168
25337 7637168 7567241 7488025 7462306 7451213 7441166 7406558 7380356 7317496 7321818 7250560 7218305
25326 7218305 7238805 7231333 7207243 7170008 7119104 7097956 7087060 7023423 6997361 7000852 7001770 6997292
25314 6997292 6899812 6857331 6858032 6804047 6793401 6789019 6771126 6761420 6720271 6649116 6531682 6521742
25302 6521742 6481080 6450305 6460122 6429537 6433987 6448265 6365054 6318686 6284736 6191652 6203686 6203493
25290 6203493 6122131 6096503 6068673 6081611 6091717 6066906 5994898 5977358 5964357 5902565 5826066
25279 5826066 5799798 5740683 5706782 5692821 5694575 5696193 5649815 5612370 5542657 5521613 5446388 5392977
25267 5392977 5372018 5377456 5347050 5290618 5218976 5208817 5216464 5212391 5209299 5137053 5130775 5101867
25255 5101867 5051795 5029082 4986806 4940461 4948486 4936737 4914546 4876554 4853375 4817366 4771871
25244 4771871 4759435 4721355 4694580 4669982 4612694 4514661 4526689 4523047 4498253 4409759 4421506
25233 4421506 4459998 4405536 4358486 4342659 4321456 4313391 4243507 4156242 4170729 4216818 4201272
25222 4201272 4188234 4145323 4087469 4036267 4054497 4025642 4005156 4004458 3974314 3950662 3960922 3883932
25210 3883932 3862126 3886965 3831358 3805568 3789409 3788142 3799860 3783991 3766726 3731296 3696850
25199 3696850 3684938 3656085 3657413 3612570 3590860 3505836 3459341 3464264 3445655 3463399 3445289 3432261
25187 3432261 3446105 3450822 3405317 3363382 3374173 3328786 3251195 3242690 3253273 3226708 3208328 3213679
25175 3213679 3141041 3071600 3049773 3070456 3075615 3084464 3056705 3010626 2997209 2975619 2968562 2963339
25163 2963339 2932923 2939015 2914389 2904427 2909203 2892586 2852245 2832304 2865597 2849299 2791518 2799667
25151 2799667 2801144 2818580 2772196 2682801 2639811 2697697 2729001 2731434 2651424 2623284 2562880 2504360
25139 2504360 2538494 2578131 2508688 2491649 2470206 2416068 2398546 2403537 2419135 2409730 2372845 2379227
25127 2379227 2395504 2444959 2466648 2459481 2401770 2420169 2367116 2353249 2312995 2315441 2312137 2303435
25115 2303435 2290568 2270163 2230460 2157101 2132367 2119492 2160574 2221002 2178579 2171896 2151771
25104 2151771 2080272 2066701 2075699 2097225 2130112 2150170 2187268 2131756 2104663 2037217 1972207
25093 1972207 2019772 2046179 1990565 1979526 1972318 1954402 1956605 1924816 1913992 1904189 1897787 1895942
25081 1895942 1862637 1905668 1960606 1965861 1905439 1846343 1802745 1818417 1838903 1821888 1853607
25070 1853607 1880290 1804873 1713072 1686843 1702105 1680627 1665379 1614789 1602338 1682419 1690225
25059 1690225 1738339 1702845 1645434 1683366 1681157 1640942 1626465 1683586 1656243 1645675 1648089 1637980
25047 1637980 1642962 1668268 1639503 1564043 1542450 1547068 1552613 1565554 1547937 1504620 1478061 1449080
25035 1449080 1447379 1484310 1533105 1578768 1562454 1490382 1417329 1369748 1384295 1439879 1415786
25024 1415786 1443991 1426648 1462207 1498516 1414571 1360147 1370381 1351833 1341974 1368441 1348033
25013 1348033 1380305 1417336 1376932 1301363 1297397 1309403 1292804 1243266 1264035 1270528 1261059 1209208
25001 1209208 1202215 1204376 1197874 1136568 1122364 1139405 1166601 1244487 1222838 1227280 1204521 1168744
24989 1168744 1105963 1062616 1105967 1172172 1150772 1117723 1129203 1114177 1088124 1134448 1150566
24978 1150566 1162578 1142442 1133986 1145713 1104556 1023889 1064052 1096207 1121821 1068014 1045913
24967 1045913 1077301 1075374 1064522 1071357 1108871 1077339 1098548 1171525 1205257 1189996 1095348 1006779
24955 1006779 980959 986338 987439 992667 989532 980040 1013873 1015614 995968 999257 1042128 1003870 973383
24942 973383 910764 911263 943006 946454 958092 992230 959926 880966 892731 934238 952109 945002
24930 945002 930053 923955 924177 945965 915331 925277 890252 875962 905573 871696 882091 890497
24918 890497 896405 851583 851254 850494 838357 811803 810997 818140 891355 953480 895305 812403 828880
24905 828880 865728 860424 842088 828052 831466 783467 784570 794431 808956 772894 743858 733648
24893 733648 710049 729119 719895 734496 774284 701927 701081 756981 780805 832705 916725 871706
24881 871706 803665 779795 828923 849192 847006 836918 802876 767171 778353 807498 785434 812589
24869 812589 759068 663570 649046 634983 684478 723048 732643 751438 711114 720394 713418 683326
24857 683326 686460 724741 775741 720899 688258 639615 605158 601970 571713 620418 661463 690894
24845 690894 681999 691256 715649 708922 642965 595108 588725 593711 597346 610722 610546 598960 594494
24832 594494 639465 668452 678815 720446 696731 658571 641892 669278 701595 678160 700483
24821 700483 746368 754090 734761 679270 622560 614209 609945 532459 584498 596814 591799 558035
24809 558035 511749 576585 590166 623271 627780 601866 625145 651611 671287 629876 620619 604535
24797 604535 539591 556789 594885 556232 545330 550771 597750 598784 555188 510564 514981 501392
24785 501392 472717 489994 495902 508165 533405 581028 591460 526245 527392 485102 466972 514444
24773 514444 543755 514058 514037 482497 492109 509046 476247 441207 429226 408048 467614 484434
24761 484434 474102 490895 454178 438631 464950 504323 519046 506668 489940 523688 523808 483249
24749 483249 483586 472471 509559 513154 496656 508466 502603 471515 494830 562030 515825 548774
24737 548774 496619 445673 456256 488812 522674 484428 454202 443311 405423 404534 382121 363488
24725 363488 382614 415136 467578 473167 490838 467763 472984 475576 486817 494178 521796 465065
24713 465065 427128 446884 436019 371368 358022 358508 362223 389358 377022 405119 458396 482330
24701 482330 469152 455549 414449 412687 457150 433902 405570 383737 373360 347663 314640 354543
24689 354543 388597 397319 382345 327230 346559 351187 342080 369935 392215 355908 357448 341069
24677 341069 326664 356191 382110 404578 341087 361395 383210 352339 383577 411113 437908
24666 437908 410978 428379 454403 421433 356283 292378 289556 277564 295855 372758 379134 397291
24654 397291 357900 326840 353884 362137 349364 384914 389015 406540 389360 359528 337560 349323
24642 349323 320124 308520 335615 343411 305516 274338 310687 294201 301391 267447 262609 262684 312435
24629 312435 359738 356240 289932 248767 263666 260390 285402 295558 307105 296812 339782 377678
24617 377678 403399 393351 352413 296891 253227 249072 280876 298980 299336 325335 367755 371271
24605 371271 384163 408763 351484 290592 283188 262568 280199 292323 278517 278879 268607 242991
24593 242991 304267 368174 367142 358409 347929 307316 292159 275708 282184 249359 258713 267614
24581 267614 258275 256283 226873 212218 209495 223372 237166 290586 256817 265482 227379 178190
24569 178190 177701 201377 233282 211327 188623 214271 260412 263367 209169 216604 228418 211463
24557 211463 154211 162923 200448 245755 273601 242110 236193 241129 278743 293617 286643 293940
24545 293940 311661 313987 265894 263954 264545 253759 276881 289161 311033 282459 276530 302987
24533 302987 308341 245835 192803 172523 170467 160201 182148 232631 310792 303441 243626 175936
24521 175936 189506 241377 289978 271681 239063 209458 199183 228134 202380 150983 170868
24510 170868 214759 261131 211369 242783 266804 312495 269814 193189 186870 159940 110296 84155
24498 84155 141303 153161 173417 156240 145806 197707 231401 269412 244788 232518 191756 210953
24486 210953 172935 148415 129640 126959 213108 269002 303731 299322 336117 333057 319171 259158
24474 259158 253293 282827 197640 149643 175554 181446 141423 167021 102450 93628 103252 116152
24462 116152 198406 217931 244854 254163 216218 208716 207904 193375 217594 210325 163482 152001
24450 152001 143013 154174 217706 227506 147632 128834 97334 109838 145654 174654 172071 171885
24438 171885 163783 130829 159269 248237 280113 254389 231629 229440 241857 268308 340357 280358
24426 280358 185894 124410 62869 62897 103958 106941 138444 120964 146950 212028 266222 241122
24414 241122 209433 188306 215072 232066 245907 232928 200948 113157 72926 47198 60771
24403 60771 148513 193327 169071 149691 110802 104608 150965 192570 206471 139236 148130 165529
24391 165529 129865 134294 191146 224696 186108 149201 129289 145851 155625 155779 183851 182231
24379 182231 182639 171089 180019 166725 157873 160131 125570 120071 180678 188570 219487 303447 262635
24366 262635 197299 166780 190823 213859 169448 98920 118583 172368 203428 171990 134416
24355 134416 95471 45432 92148 129693 131784 110843 118017 148609 173490 190139 122314 126461
24343 126461 145687 169555 211053 205079 213179 230745 222868 224893 220189 177243 143477 116663
24331 116663 64363 50840 103568 156131 164177 132018 116159 72296 91019 148060 98214 61221
24319 61221 104402 117637 111079 114100 131896 98661 65256 79730 137679 164801 161270 141027
24307 141027 162097 157047 117904 118433 178042 188627 159297 143424 135824 119287 157550 184164
24295 184164 162521 98226 75430 77175 35020 26102 60478 59198 70239 105166 100584 87560
24283 87560 70726 80759 128564 153695 174812 188795 159504 111749 164948 162937 139099 100108
24271 100108 81612 126333 157312 196544 185777 182373 229324 235267 166043 110706 69933 40452
24259 40452 14918 26666 31732 69188 120714 75815 92952 84723 109517 122322 85747 64366
24247 64366 61478 37967 40340 53793 81387 99973 106859 95750 30500 23045 66602 87016
24235 87016 83882 84491 75157 70303 32785 37845 79590 51739 23724 50423 106217 116290 89509
24222 89509 11786 -32887 -14352 23560 58202 33468 66322 74156 64264 81764 32739 40397
24210 40397 70006 98414 113977 52921 101647 121617 96434 32319 69409 65243 15246 24244
24198 24244 49688 10560 -15811 19607 96377 105456 73582 82774 77039 84803 71294 79280 85994
24185 85994 50944 108939 102560 39911 82003 127204 82599 115300 107549 44445 43186 91475
24173 91475 107989 51679 27552 63135 89956 59582 39560 68378 25877 42048 90537 105913
24161 105913 117014 160467 145188 123002 87378 61462 20814 -24414 1047 43597 49382 47627
24149 47627 97549 110716 120419 130285 109951 81214 72852 67709 93127 47972 23051 15944 81919
24136 81919 129570 128531 145346 196646 196079 151034 145342 88082 68408 72038 41037 146416
24124 146416 153650 166897 169411 153772 129550 114737 45982 30941 77134 99634 52183 59848
24112 59848 97102 141200 120217 75539 92178 87534 113085 94600 18532 -2488 18303 91108
24100 91108 107184 139379 143090 128331 142539 128844 122633 115722 90146 67014 99974 75692
24088 75692 14985 -40035 -45741 -35995 -30811 -15332 57329 107948 103276 125518 112678 74512
24076 74512 33726 35221 35968 44324 24470 51749 37912 24429 29935 41377 68078 87077 72853
24063 72853 28130 18866 57173 98084 111508 99118 39652 110998 129227 112778 74867 43920
24051 43920 15031 35527 59739 15090 3411 22910 3970 64530 63784 31281 -11171 3726
24039 3726 53041 41065 21624 54651 63070 49125 122441 87364 25035 13507 4501 48347
24027 48347 30900 -5825 -10334 10946 67751 60610 31635 31041 69049 102442 65994 47057
24015 47057 4461 2872 -6718 -26139 -20097 -9998 27837 12375 -8994 11761 -4235 -25727
24003 -25727 -16629 29143 21364 48935 59034 42607 38830 50071 61689 36621 32810 17960
23991 17960 2564 16285 22268 7781 4442 9487 -288 7240 44661 8310 20145 34118 59936
23978 59936 87994 111377 81361 107248 94340 109471 54573 21502 -7228 48703 72177 47740
23966 47740 84805 101347 100895 72313 78753 76962 29982 22758 84798 90914 74932 23803 -10378
23953 -10378 -477 40264 19441 5758 20835 -10629 -12365 33697 12797 33984 68757 39721
23941 39721 9463 26126 -25163 -79362 -32184 44829 45670 86020 145983 132512 87178 73495
23929 73495 82710 64098 -5180 -29556 -109069 -76542 50622 40273 35913 24629 7492 -25791
23917 -25791 26250 71257 72735 43376 61768 36414 10028 34065 27123 -22984 2825 60765
23905 60765 67263 57843 30283 3737 23764 -2569 -180 -20192 -14174 62505 69957 80614 75810
23892 75810 13610 6281 32722 6568 -34865 -46615 -76025 -43878 -20151 -31678 17442 40598
23880 40598 76471 49856 27631 66910 57225 15211 32611 40009 56050 49706 54610 29789
23868 29789 18146 -19438 54566 28450 31271 54484 25645 6558 17191 -10777 -66877 -82400
23856 -82400 -72676 -880 28084 4336 4261 29181 27953 52895 5369 -2900 84424 123753 155709
23843 155709 106638 19501 11503 56 4123 -50051 -50979 -50424 5645 -16108 -17469 -59599 -61666
23830 -61666 -9695 5559 15330 5552 40087 26379 -30078 -103188 -44845 -30224 2385 -3133
23818 -3133 -35715 -29145 202 29403 15998 -29543 -55496 -51857 -34363 16997 43806 26545
23806 26545 25851 80194 93139 80461 10922 -10088 -16952 -16563 -16154 -49257 -18199 -2678 -7237
23793 -7237 -47391 -59014 -18991 -51497 33206 21264 -38623 -69488 -73312 -49055 6613 71592
23781 71592 50988 49030 -12243 -76893 -84062 -33785 3731 7237 -17248 -1847 26177 58221
23769 58221 95814 72596 36692 31169 16848 31710 -73268 -71082 -36108 21789 78579 53576
23757 53576 -34806 -104801 -85577 -40843 -11779 33589 76009 86001 63306 8863 8171 -30158
23745 -30158 -79137 -80694 -25620 -16491 -3931 -29453 -1909 31861 21136 47800 27723 9360
23733 9360 -22535 -14317 2868 3338 -20086 -7985 45025 62045 -3913 -66227 -24300 1107
23721 1107 -3683 10018 13389 -28078 -75116 -34503 -3548 1649 -15604 -3848 -2221 -732 7588
23708 7588 -26497 -26229 6149 23464 -38890 -51600 -44480 -4804 -1358 -41510 -76474 -92303 -56396
23695 -56396 -18045 13153 105 -50200 -103552 -127166 -97511 -72519 -60539 -32183 -8997 -17954
23683 -17954 -14855 -51556 -50734 -29544 -55927 -69431 -28807 23927 32058 21007 -5481 -18142
23671 -18142 -227 -8986 -60767 -64812 -37077 -25422 29327 54682 27 -12182 -22 28731
23659 28731 -55425 -36455 29045 39440 28761 41415 27049 77 -10882 -40604 -84645 -70192
23647 -70192 -44940 -25786 29348 37316 24936 34720 -2805 -58989 13963 36684 -10446 -36107
23635 -36107 -22261 -26190 5949 -53696 -97409 -70182 -48539 -51844 -35019 -29590 -22851 4121
23623 4121 -26795 -37249 -55672 -58304 -58722 -14196 31570 74979 70029 -9591 -18231 11700 11451
23610 11451 50720 61970 12024 38663 74185 26250 -19039 -43894 -6159 30964 53156 12616
23598 12616 -19885 12338 35722 4371 2858 1466 25535 30467 13983 25256 57326 55336
23586 55336 94764 84841 37526 26903 29554 20528 1773 48080 51003 -26720 -24452 -1874 29356
23573 29356 28089 7043 45157 41470 43242 54909 22091 -15742 10360 36938 68105 52307
23561 52307 16328 -29886 -28420 -10687 -19972 -41661 -26264 -99049 -105976 -81762 -74633 -83965 -79280
23548 -79280 -64724 -73567 -82140 -66854 -14338 -59539 -141399 -194120 -148374 -72943 -2514 52666
23536 52666 29094 -52684 -59738 -46056 -36262 -39099 -29588 -70724 -86786 -45096 -60260 -36872
23524 -36872 17200 65906 108664 41567 8886 -25463 -73079 -52437 -77804 -92787 -81807 -70755
23512 -70755 -41931 15857 25486 37198 48053 42014 36095 76534 102274 94210 117115 111197 16550
23499 16550 -8570 477 -9706 -21951 3826 7513 -31885 -29544 11040 -6308 -16694 -58696
23487 -58696 -82790 -61597 -54481 -94461 -64921 41912 82251 77350 68143 38864 41976 50230
23475 50230 26329 29637 10348 -58136 -80761 -40857 1788 13526 -13533 -54540 -56751 -6579
23463 -6579 -35311 -41518 12959 56074 17425 -31482 -31245 -15075 -37247 -35554 1255 46757 63371
23450 63371 44091 22199 -11017 17475 45026 10196 18874 42333 86413 74772 31484 34355
23438 34355 48871 -326 -2247 28272 28080 20463 26407 8672 -3030 17322 40031 46809 57425
23425 57425 78018 61155 32748 -16791 -54152 -34179 -82607 -97994 -2635 29882 -20859 -33407
23413 -33407 -16072 -26217 -57223 -31165 -17516 -5360 24664 -44966 -86616 -90035 -116008 -91434
23401 -91434 -91164 -107229 -100880 -102190 -109670 -61548 -25922 -55071 -25086 8479 -14627 12749 943
23388 943 -14922 6696 40894 11385 -2840 13449 42326 -31025 -79562 -31973 28854 33925
23376 33925 -14239 -40078 -66261 -73788 -86374 -51613 -71614 -54377 -27152 14185 47827 57467
23364 57467 56110 68742 3634 -19810 -54071 -72868 -102772 -98088 -59194 -39551 -31049 -14804
23352 -14804 54732 58425 51753 22985 40598 36795 -4776 -2053 -52443 -93668 -95140 -93289 -117961
23339 -117961 -52796 -19608 -45618 -29122 -44660 -14789 -80741 -75860 -61430 -62819 -53392 -61579
23327 -61579 -52975 -24874 -88135 -127690 -122488 -85770 -2608 18631 15375 28191 5698 -20446
23315 -20446 -18413 11006 -8411 -52442 -67307 -66939 -73112 -9175 31765 -443 -54619 -41608
23303 -41608 -74156 -103905 -85398 -1701 -27545 -59963 -72314 -28762 -13128 17887 31777 31369
23291 31369 12209 7271 -36958 -30687 -7507 44264 -5351 -90485 -134338 -86365 -57349 -26601
23279 -26601 65 20390 4530 -74010 -110715 -75982 -101347 -128085 -108948 -52372 -78847 -64419
23267 -64419 -29290 -30481 -50081 -63882 -114237 -83926 -74845 -89112 -88585 -110123 -101728 -112080 -83640
23254 -83640 1286 32155 9702 -19688 12394 -2134 -4568 -2022 -47494 -82288 -75157 -66200
23242 -66200 -50930 -57464 -75128 -95801 -118737 -130010 -81788 -14667 3537 -22670 -27010 -55209
23230 -55209 -32317 -13754 -4283 -18350 1058 39770 56737 56655 35854 -38485 -16694 7533
23218 7533 5413 -2038 -28964 -88287 -22053 -8948 -16164 -25477 -13000 -22565 -7015 -2406 -41503
23205 -41503 -24899 -4556 -11763 2397 17248 75078 68561 50552 51628 68762 107583 104856
23193 104856 132040 66234 -3923 -25469 -24069 -45262 -111595 -88924 -34841 -38332 -59679 -67908
23181 -67908 -76953 -74374 -74061 -80313 -59559 -10135 -10749 -15197 -32798 -46056 -23862 29817 33757
23168 33757 -64694 -88829 -22317 3549 16559 34932 37887 25240 21599 -8351 -392 -19825
23156 -19825 -50692 -79629 -74398 -1555 61759 -6994 -33396 20503 53733 17661 157 -8776
23144 -8776 -38158 -53237 -19468 -12530 -11376 6067 -36831 -62004 -21268 -64896 -20086 22328
23132 22328 11784 41906 111149 58803 29064 -3376 -57830 -132022 -140046 -103668 -93087 -112492
23120 -112492 -84043 -32685 -14421 -12243 -32905 14641 47945 21640 24088 5634 701 -428
23108 -428 23668 10962 -1330 3871 25480 35718 59613 90273 57478 38063 50425 -40257
23096 -40257 -92781 -113970 -74407 -35401 -33858 3641 62201 123691 89470 22890 -16915 -53681
23084 -53681 -32983 -42834 -59799 -95410 -85294 -99195 -67865 -73506 -104116 -96063 -38515 1503
23072 1503 8431 -4353 -44373 -51839 -6910 -21165 -65171 -76142 -38046 -23460 -40228 -60882
23060 -60882 26201 10335 -74018 -82807 -44201 -44415 -82028 -37720 15610 -12212 -18161 -58073
23048 -58073 -59748 -47762 -91472 -88753 -114059 -86634 -16647 -17383 34642 -5542 -55146 -88032
23036 -88032 -133629 -91421 -78289 -78391 -68968 -82845 -18937 38352 3246 -89466 -75641 -1918
23024 -1918 59377 29838 13357 -16843 -44637 -56046 -49668 -60848 -101777 -79676 -77729 -27997
23012 -27997 -23372 5318 27549 67070 -19139 -62829 -45241 -79513 -122381 -87787 -61644 -86667
23000 -86667 -104985 -88171 -50457 -59644 -43352 -46542 -72394 -32676 3441 18470 -14987 -30690
22988 -30690 -10962 4075 25259 52566 9283 -21216 -23293 12609 27558 45536 33234 2226
22976 2226 -27368 -16902 -11727 23639 51668 26783 -12219 45557 29277 35821 61156 31844
22964 31844 -691 5552 -67934 -118852 -111159 -77343 -20568 6694 -27454 -45936 -64679 -34432
22952 -34432 -35161 -35289 -27729 10485 -15751 -51933 -31199 -63617 -91729 -74227 -99967 -98659 -84076
22939 -84076 -74002 -76150 -67370 7345 -5029 -51175 -21408 -19010 -30615 -37275 -76224 -41920
22927 -41920 24454 37587 11643 -20501 -6496 -13479 -49369 -96085 -84475 -27995 -2837 -4373
22915 -4373 -37543 -84968 -67510 -89959 -110545 -50351 -65910 -36121 -28614 -64696 -60615 18957
22903 18957 52104 67258 61324 10668 -21670 -92503 -77936 -4172 -939 46659 -2376 -38988
22891 -38988 -66565 -36242 4042 -3223 47067 60735 2178 -8942 -56514 -43029 -50762 -95876
22879 -95876 -62012 -9911 4457 29127 -10394 -28759 -56267 -36334 -4642 13222 37558 23030
22867 23030 18374 12172 20543 39817 37854 18699 1207 8744 -15888 -67838 -81977 -74118 -114211
22854 -114211 -76743 -3478 7807 25682 69178 94457 111093 73946 44892 197 -76285
22843 -76285 -92567 -120870 -112610 -81236 -47567 -51952 -66162 -44705 15226 26161 30392 18432
22831 18432 -43950 -76281 -96223 -134105 -148873 -108367 -104894 -110310 -95486 -63786 -7225 -23192
22819 -23192 -75555 -48055 -42430 -69376 -102882 -88749 -82275 -80151 -126350 -132616 -85890 -50118
22807 -50118 -74840 -78931 -35036 4986 19917 49482 46881 25190 36364 14479 -8004 -74017
22795 -74017 -108842 -93932 -39725 -8666 -59435 -71202 -79887 -59595 -38731 -40725 -67918 -144976
22783 -144976 -115283 -138027 -81479 -73999 -71119 -107758 -110166 -51762 -74150 -91053 -52358 -22221
22771 -22221 -43795 -34361 -55752 -55477 -48108 -28725 -37499 -22769 -2652 -11391 -79723 -108230 -90809
22758 -90809 -85359 -65767 -53958 -58387 -52045 -63742 -48929 -85220 -96569 -624 -22435 -63182
22746 -63182 -79331 -71777 -42614 -29482 -31563 -23042 -44018 -120555 -141424 -154948 -134102 -94498
22734 -94498 -60270 -87817 -88652 -51283 -31326 9778 14491 19567 -2957 -58215 -47293 -40831 -17652
22721 -17652 -22332 -6830 -19451 -50724 -80695 -39139 -40205 -12921 45585 575 -82298 -157673
22709 -157673 -149048 -73704 -962 8079 11366 259 -6528 -19475 -109669 -87153 -43506 -12697
22697 -12697 -35491 -31956 -61898 -80652 -70214 -36819 -25105 -44096 16347 52897 29399 20513
22685 20513 -16150 -26192 -22070 -70368 -68534 -39065 -85549 -112533 -79401 -85956 -110236 -96864
22673 -96864 -40599 -44122 -57887 -44883 -79059 -95863 -56079 -55825 -35523 -20919 -86870 -72797
22661 -72797 -98146 -121254 -145080 -134578 -64006 -55085 -51386 4788 8325 -34042 -71975 -78197
22649 -78197 -46851 -52230 -121262 -147214 -111253 -45443 -14648 -6440 -33101 -57187 -63352 -97160
22637 -97160 -34618 6639 -7643 -20529 -71430 -66331 -85940 -35611 -15719 -47006 -30304 26310
22625 26310 28231 17269 47931 51918 -14377 -41411 -46965 -41837 -11993 -20793 -69435 -105077 -55298
22612 -55298 -28304 -53693 -9600 -30255 -93758 -108476 -71104 -48909 -32928 -19295 -37121 -25985
22600 -25985 -7379 -77045 -85012 -102511 -161485 -141632 -156131 -144864 -136116 -73206 -45521 -25929
22588 -25929 -54677 -47500 -35589 -29655 -56454 -54773 -23063 -10372 -25426 -20899 -63399 -132273
22576 -132273 -127703 -142365 -137679 -118857 -76161 -27054 -50904 -126363 -158778 -117772 -114199 -82474
22564 -82474 -61859 -76932 -97640 -18884 7894 19346 14791 28830 -47270 -88839 -116820 -133567
22552 -133567 -117228 -89851 -52850 -48562 -86193 -81069 -81787 -74876 -72738 -77935 -31023 29862 13990
22539 13990 -45730 -51774 -15508 -10754 -373 -8159 -1412 -13869 -87988 -73507 -50729 -47497 -29358
22526 -29358 -62375 -89156 -47972 -9555 6868 10600 -6560 -14139 -30181 -33845 -33511 -77035 -115232
22513 -115232 -99480 -87942 -36026 8405 -44767 -82901 -93296 -73592 -75759 -74113 -136684 -95699
22501 -95699 -113415 -143276 -105138 -92888 -74250 -37545 -55346 -142544 -150932 -114899 -92777 -92343
22489 -92343 -61145 -19043 -40183 -45381 -63777 -82896 -97643 -91894 -78263 -25441 -16382 -33844
22477 -33844 -26210 -13753 -43713 -57267 -45444 -14743 -37437 -38761 -72806 -34445 -27761 -20970
22465 -20970 -47876 -54520 -68379 -95915 -108524 -54949 -38448 -53364 -103523 -108818 -72394 -64462
22453 -64462 -72826 -29588 61208 79913 30113 -21350 -6933 -49860 -65481 -105570 -99831 -100843
22441 -100843 -53751 -2600 -37184 -49941 -43557 -93315 -118817 -130525 -121309 -96992 -76819 -56485
22429 -56485 5027 31877 49036 47400 20677 6260 71633 90107 23934 -35340 -29501 -47894
22417 -47894 -69758 -63143 -70478 -72380 -69772 -72600 -56771 -26798 9700 -6767 -61456 -63572 -43242
22404 -43242 -69094 -64729 -42619 -76354 -75786 -116532 -180983 -146841 -117615 -107624 -27383 -20845 -69089
22391 -69089 -104053 -80229 -38384 -66413 -102577 -84209 -57224 -31882 -37127 -15023 -67125 -61849
22379 -61849 -6185 36659 5439 -6886 -9808 58464 47272 -23693 -98944 -91345 -59220 -41626
22367 -41626 -11757 37698 30821 15452 47954 26301 11420 -14628 3453 -48844 -61670 -35750
22355 -35750 -26273 -463 44939 30153 19788 1035 24346 27880 -12457 -31564 -11739 4417
22343 4417 109927 84393 -2650 -18508 -34845 -47687 -46507 -5946 37693 41074 -2969 11466
22331 11466 -10615 37004 32483 35287 -57544 -68420 -33421 -66099 -102846 -65066 -33701 -56702
22319 -56702 -20128 -26288 -36876 -24667 -32200 -27049 -22322 -934 -18333 -31098 -64821 -51523
22307 -51523 -69291 -94797 -49727 -38522 -36231 -20180 -12808 -19278 -78137 -92663 -15296 66672
22295 66672 86393 24962 -21706 -23861 -38543 -33678 -32340 -6678 1456 19853 236 -8918 -6841
22282 -6841 -47092 -67815 -115835 -113904 -126010 -143370 -133127 -117776 -60838 -62585 -53168 2151
22270 2151 28907 -27472 -107352 -109312 -95965 -92754 -51506 -39853 -94599 -69521 -18440 -45455
22258 -45455 -84583 -54692 -7794 3469 -4737 3556 290 -34449 -66517 2262 29866 29219 -10617
22245 -10617 -15132 -15433 -22147 -45991 -69345 -67396 -56276 -43803 -76014 -68594 -73304 -119812 -140957
22232 -140957 -120394 -114053 -74070 -70479 -89972 -31326 -23225 -22193 -34894 -16491 -9595 12128
22220 12128 4771 -43047 -90791 -44271 -39116 -72784 -65906 -53112 -34161 -50418 -71173 -83099
22208 -83099 -60659 46298 47559 45761 35406 19357 -40789 -35614 -28184 -5803 -46688 -95092
22196 -95092 -45165 -60399 -53434 -24670 -86320 -84241 -36246 -34708 -18301 10117 -58649 -113096
22184 -113096 -81155 -60811 -54316 -43610 -39842 -43547 -44520 -15011 34719 39457 70922 29004 56856
22171 56856 33147 -31904 -45283 -27082 -49508 -73481 -57352 -26901 -32430 -81473 -148368 -183814
22159 -183814 -174865 -164137 -126907 -128674 -61762 -12236 -43482 -128240 -186597 -160822 -152920 -114179
22147 -114179 -109996 -105969 -69145 -93673 -80804 -45828 -35291 -53034 -14323 -25103 -31206 -45441
22135 -45441 -75226 -74023 -67421 -74735 -67898 -27334 41566 11882 -30752 -70310 -64949 -69273 -123286
22122 -123286 -60548 -14040 -28017 41132 93271 49828 -34360 -65933 -25017 -2449 137 -3179
22110 -3179 -18873 -19790 4700 9678 23402 -25569 -57578 -101180 -128285 -104809 -63944 -106410
22098 -106410 -107351 -52805 -18888 -41554 -72033 -81164 -71033 -88409 -96179 -69315 -28850 -41277
22086 -41277 -61519 -73610 -42632 -64431 -84328 -76739 -52265 -110290 -135450 -55100 -7746 -12361
22074 -12361 -53334 -25805 27049 -6707 -7435 -4118 -64778 -98831 -92390 -95359 -127057 -78152 -73415
22061 -73415 -114426 -66159 -27101 -31417 -20342 -6189 -10893 -47997 -34215 -6698 -32210 -55363
22049 -55363 -57083 -40706 -50451 -19456 -47538 -73926 -67158 -35088 10535 -9467 -45148 -23365
22037 -23365 -47914 -27682 -58213 -23962 12128 -11122 -42259 -20775 17008 -43810 -86904 -104560
22025 -104560 -46352 -11582 -16221 -14035 -85167 -103043 -55508 15579 38095 2546 -11446 3419
22013 3419 15114 -13676 -40674 9993 50202 68896 99312 94391 41330 -5504 -21892 11107
22001 11107 25164 -5291 -35625 -29120 -54026 -57668 -24387 -16248 50173 31942 -20841 -40449
21989 -40449 -25943 -11686 -58990 -70415 -43845 -46320 -39903 -35102 -23544 12116 26788 24262
21977 24262 -4432 -73648 -123348 -128779 -61662 -24926 -34863 -9292 -9183 -26169 -57731 -67470 -11476
21964 -11476 -23709 14384 2810 -28688 -85775 -123199 -91996 -86721 -177383 -140615 -58441 -26500
21952 -26500 -23767 -39967 -67116 -100031 -91696 -82420 -82747 -60962 -18724 -24473 -50162 -47487 -37771
21939 -37771 -61813 8746 37741 -1326 -41518 -103980 -111518 -98158 -88846 -60667 -65308 -82820
21927 -82820 -59195 36997 39525 4915 -16407 -44998 -15608 -41112 -56354 -35865 -65395 -122297
21915 -122297 -132337 -155694 -101437 -33119 -21722 -4556 -17628 -47953 -66800 -37227 -5723
21904 -5723 -31636 -41759 -7967 -16340 -51580 -105749 -103828 -111858 -128634 -109492 -31588 -20329
21892 -20329 -95636 -105025 -73727 -5342 -13951 -41006 -72257 -43077 -20002 -34649 -50453 -109278
21880 -109278 -111166 -49324 7330 12903 -42923 -33693 -42073 -19320 -11529 -22692 -61082 -67820 -47807
21867 -47807 -43961 -46502 -23293 39970 65416 38174 -8935 -25070 -58784 -39515 -35685 -29864
21855 -29864 -23532 -17267 -107904 -98972 -131581 -121698 -128905 -155756 -96957 -70088 -38379 -71076 -107787
21842 -107787 -133707 -126086 -182729 -143624 -140597 -101193 -61157 -40473 -52353 -111064 -105163 -41225
21830 -41225 26028 -12797 -70537 -61586 -118255 -169476 -167436 -105429 -67782 -64874 -82004 -132929
21818 -132929 -178724 -139147 -132481 -65909 -11048 -20946 -34787 -64124 -21779 -34218 -35750 3462
21806 3462 -18022 30128 65492 69258 26330 30570 82930 54573 24254 -22384 -37517 17571
21794 17571 25278 27629 34891 24430 -25261 -56732 -84895 -64220 -57764 -61297 -59172 -52371 -69416
21781 -69416 -94458 -103026 -151797 -126667 -88724 -39657 -59445 -79188 -90110 -80418 -34002 -41288
21769 -41288 -60230 -67492 -50022 -82627 -47491 4182 -8497 -44922 -40306 -16982 4423 -49064
21757 -49064 -51512 -75517 -56436 -2895 40232 -373 -23344 -75455 -94921 -72806 -43435 -26237
21745 -26237 -76048 -125545 -114408 -104239 -63394 -27053 -64599 -86652 -108507 -119605 -66767 -57482
21733 -57482 -93078 -128929 -130339 -96995 -39076 -36267 7938 4341 -37613 -55033 -89370 -120069
21721 -120069 -131512 -124720 -51479 -42597 -76506 -144370 -152750 -115308 -77880 -7515 -6221 8893
21709 8893 36273 31038 43383 -23684 -79184 -58667 -79211 -71154 -69988 -71885 -55351 -39944 -19906
21696 -19906 -2646 -6810 -43129 -90462 -118693 -67862 -61314 -132483 -163013 -151144 -165607 -98404
21684 -98404 -12654 -5522 -3876 -86692 -89500 -2440 11120 -14621 -3913 77266 50790 -17172
21672 -17172 -53735 -106359 -92999 -77806 -91313 -93801 -75163 -79419 -11741 -429 -23425 -36062
21660 -36062 -31333 -40056 -52115 -64292 -28259 -55348 -52516 -42630 -8633 -16765 -12451 7711 29189
21647 29189 -20927 -64991 -49513 -42563 -57248 -69254 -72993 -38594 -2889 -33533 -55549 -62473
21635 -62473 -80921 -50195 -62951 -97569 -103626 -124996 -127011 -127619 -112018 -127577 -57365 -50532 -92869
21622 -92869 -70746 -100880 -115068 -92409 -86251 -68525 -76681 -94777 -87272 -55916 -23576 17756
21610 17756 -7630 -25397 -15843 -15243 -6208 13200 24906 1418 -52528 -63549 -86880 -60244
21598 -60244 -48671 -43155 -13588 -10319 -44886 -56858 1509 62858 13415 -28718 13143 -30887
21586 -30887 -56710 -67698 -102500 -77829 -30411 -30640 -24245 24119 9659 -11727 -2670 50032
21574 50032 52490 -15155 -52137 -66716 -55866 -92342 -87580 -29583 -10272 -25849 -7642 -42063
21562 -42063 -59308 -106362 -134081 -107604 -108740 -86502 -1067 -6983 -51306 -68208 -53286 -45439
21550 -45439 -51933 -30662 -4740 -19911 -91486 -98160 -78639 -23975 -7948 4438 14658 -9977
21538 -9977 -55313 -35314 -9397 20670 -9283 -2763 -9986 -66698 -72478 -56553 -54516 -55055 -59693
21525 -59693 -37136 -34975 3684 29641 -19581 -25490 -39911 -85726 -95215 -98436 -100455 -88231 -31685
21512 -31685 46709 56621 63652 90442 79588 -7608 -52224 -58821 -46901 -7114 3049 -18709
21500 -18709 971 35920 -7165 -39893 -47809 -11968 4572 47341 24553 -45639 -68291 -99119
21488 -99119 -104292 -90987 -81433 -77186 -61773 -4456 9161 28134 -33615 -32373 28767 70905
21476 70905 54474 49910 15373 -51520 -70887 -68133 -64863 -48950 -32058 -45261 -8413 38899
21464 38899 34343 38905 15573 -47214 -62879 -46693 14524 27085 -13669 -44963 -52135 -4296
21452 -4296 -13004 -21092 -42460 -86030 -72167 -26814 -28628 -4099 48532 13012 8740 -7396 -4613
21439 -4613 12220 39991 40404 -14922 -48390 -37412 -1568 23670 -21118 -38379 -35426 -56868
21427 -56868 -35052 -39547 20822 55900 42423 40509 31908 -5096 57723 52272 -4726 -17343
21415 -17343 -58594 -75657 -81699 -92473 -78717 -30729 25225 12449 248 -23640 -35710 -77244
21403 -77244 -45832 -18305 -31857 -58554 -36174 -15772 -20309 -9292 35528 9634 -29198 -39593
21391 -39593 -63586 -113509 -56653 39908 -12468 -97892 -87645 -69594 -116556 -80346 -66509 -41350
21379 -41350 18182 50415 53712 66245 44177 1128 39333 41800 35027 29794 2980 -72216
21367 -72216 -69466 -101607 -69098 -60699 -59845 -57969 -103740 -75264 -38548 13224 -15550 -49748 -12266
21354 -12266 21504 -52543 -87153 -43974 -4727 -16568 -40008 -47521 -38479 -9613 -53845 -60445
21342 -60445 21422 34396 -34823 -61631 -55206 -32914 -38844 -53996 -108782 -55340 46510 49542
21330 49542 -17235 -62016 -74508 -41444 -39704 -112829 -89794 -73310 -45497 -75343 -49295 -10648
21318 -10648 36936 64583 37176 1965 -1114 -12912 2425 -545 -23932 6682 39970 120263
21306 120263 103090 23363 -81533 -68880 -34481 -103421 -113183 -47399 10305 32517 14125
21295 14125 -31285 -15525 27229 23099 -5200 13089 20642 -38332 -56308 -57856 -45207 -62397
21283 -62397 -75999 -59794 -3912 -3143 -3064 -3704 -33819 -5185 -38663 -69178 -35235 -10142 -40025
21270 -40025 -41241 -39859 22248 43415 -9426 486 9841 34984 55816 14541 21052 48182 6632
21257 6632 -14449 19397 37289 42795 17955 -8472 -27951 -60257 -95109 -81468 -48007 -41974
21245 -41974 -47722 -50637 -33616 -58608 -58094 -62836 -24712 3784 -9990 20336 35444 25651 -3504
21232 -3504 -35412 -21160 -3981 9885 -30582 29535 60248 44057 5410 -41309 -65257 -36841
21220 -36841 -26207 -11759 4617 -43501 -45779 -14585 -21277 -51982 -74776 -35400 2420 44241
21208 44241 9409 -16458 5541 58487 49987 -2257 6630 -53702 -67857 -32127 -3212 -19129
21196 -19129 -40089 -63004 -156054 -148512 -159071 -169063 -125596 -68539 -60470 -40662 -70510 -69551 -34129
21183 -34129 -39049 -22026 3079 -40144 -44899 -60596 -17857 38190 10855 -44974 -50689 -23135
21171 -23135 2975 15650 29512 -24370 -87181 -101719 -103981 -131518 -130678 -110970 -126972 -123523
21159 -123523 -96844 -58794 -76142 -66264 -67713 -91061 -80824 -44795 -40248 -15283 -53592 -35651
21147 -35651 -30237 -2611 -10063 -4241 -9003 22163 8907 -50982 -78706 -79135 -122698 -73189 -49227
21134 -49227 -62213 -11811 -13335 -3003 5195 -23852 -53889 -104093 -86195 -85787 -89294 -34703 22073
21121 22073 5219 -34852 -100678 -148863 -120331 -71886 -109625 -100119 -81173 -21899 19955 6450
21109 6450 -26576 -42640 -56852 -31666 -49896 -76494 -127820 -154464 -105099 -36076 -19552 -74026
21097 -74026 -61132 -59056 -41226 -3086 -4299 -47716 -55764 -74071 -80800 236 -17042 -33177
21085 -33177 -36955 -23716 -16896 10610 47651 58744 40305 52255 48416 30 -57209 -54916
21073 -54916 -16659 -40826 -66812 -64936 -81069 -31519 34037 64339 65457 58347 24107 13776
21061 13776 27715 16221 22360 35065 11520 -63879 -45475 -42721 12937 12555 -16405 -26117 -4589
21048 -4589 56922 44825 21122 2127 31644 25565 30033 70341 84833 53078 -18287 -71976
21036 -71976 -53842 -32485 -20583 -21062 -43771 -38771 8906 3030 -10312 -56400 -60222 -52908 -52434
21023 -52434 -41587 -57896 -45821 -21217 -48567 -72799 -33689 43220 51874 37447 52851 74853
21011 74853 76076 126204 78379 78845 73636 3044 2597 19703 28710 -11730 6705 -3613 -30761
20998 -30761 39729 24768 32817 24223 28316 44784 66793 108187 74797 4396 -112743 -130822
20986 -130822 -100949 -113463 -88423 -96839 -45324 -46837 -79358 -112600 -55659 32680 88655 40049
20974 40049 8257 -18047 -57502 -43630 -66970 -68123 -77937 -51328 -8245 -25669 -74150 -49042
20962 -49042 -55820 -107151 -102377 -82183 -59114 -69358 -89019 -72465 -60670 -62622 -36321 -58952
20950 -58952 -93704 -78503 -55398 -36946 -92096 -87475 -94488 -74190 -63548 -50417 -57546 -31006
20938 -31006 -22149 -29879 22535 10416 26766 18306 -27922 4341 -17612 -24561 -24396 -35229 -19059
20925 -19059 26880 85871 34352 -41197 -64431 -61965 -45474 -17904 -25779 -29886 3637 29341
20913 29341 30983 19388 -8949 -12335 -16384 -42484 -68530 -26160 -8431 -50642 -42127 -31354
20901 -31354 30925 119857 187762 179947 132506 167350 185408 189428 207382 208429 222257 255444
20889 255444 243542 288512 361236 355765 288551 353216 530961 780181 1030379 1296058 1449217
20878 1449217 1455586 1327254 1120532 976993 921166 882023 924073 1071940 1266370 1446599
20868 1446599 1609894 1623040 1467494 1244287 972869 838998 754874 675385 616353 601236
20858 601236 633218 694347 851009 1117767 1387459 1638960 1811914 1722254 1450493 1177636
20848 1177636 1022360 933582 890842 953866 1109979 1281608 1508015 1728917 1669672 1430355
20838 1430355 1146939 917537 738966 602200 539777 489886 418015 372033 347134 313258
20828 313258 263953 240911 234190 219376 209613 223227 224868 201352 138717 112300 65231 18263
20816 18263 29759 15034 20275 23002 -26194 -26641 -22950 -11568 36155 15977 -15068 21339 32827
20803 32827 10633 -9729 304 64234 86322 87773 40803 14367 913 -9419 45788 42242
20791 42242 32021 23249 34590 52182 48060 14828 -77507 -82548 -28314 25568 -2567 -48149
20779 -48149 -83171 -56148 -34256 -50421 -89207 -98758 -33130 -9767 20320 24890 -49 607
20767 607 -16955 43831 50933 40859 -20338 -75926 -77277 -71571 -56731 13615 -7170 -35258 13751
20754 13751 57134 45632 -371 5711 57383 89279 93343 154604 115007 14555 -67217 -39821
20742 -39821 -16309 -37249 -62085 -14971 46498 51177 -3813 -45568 -50490 -21132 -7200 -11274
20730 -11274 37244 39827 30846 31862 2993 -22953 -93648 -71383 -61564 -66062 -30670 4088 -24294
20717 -24294 -25174 -45644 -11256 1971 -27473 -28440 -41098 -26869 -20526 3638 28055 -11616 -43263
20704 -43263 -15662 -28801 -1402 16066 -11847 -48888 -46154 -65000 -91881 -44160 3994 21994
20692 21994 20509 35126 62565 96322 46382 -12837 -26414 -7416 -33832 -53161 -37099 3125
20680 3125 29740 32091 87963 107307 62954 2732 -55802 -89251 -74922 -117012 -135790 -138604
20668 -138604 -107598 -74423 -58023 -66433 -52906 -3575 10282 16931 9992 22416 18558 -3418
20656 -3418 -28883 -19161 -1330 -12190 -4607 -31088 -37918 -15946 -20026 -41637 -637 62214 40748
20643 40748 -1646 -18949 47640 71251 27847 34674 39339 -20469 -9051 60568 72410 42758
20631 42758 18831 23862 -20434 -2853 -14261 -11887 -42898 -89113 -88679 -46755 -15173 -36867
20619 -36867 -37343 -37549 -83155 -91127 -74782 -53764 -74690 -105293 -40153 24931 19742 66266 35318
20606 35318 -49970 -65061 -65156 -55810 -20211 71283 151308 111970 94308 76082 37766 8867
20594 8867 2495 -10866 12351 2087 -21947 -28348 11283 -8361 -44283 30046 43938 -1140
20582 -1140 -57222 -6788 28651 52198 46388 20820 9745 28648 -17920 -57147 -3521 60798
20570 60798 85051 86519 -3427 -42381 -11253 -7348 774 57096 71983 36631 -6170 -76964
20558 -76964 -105702 -58549 -43940 3161 29199 -27329 -36806 -26290 -41086 14123 47889 30617
20546 30617 -4571 -18605 -74520 -122565 -79355 -19945 -1115 -4271 -19839 -85381 -83319 -49951
20534 -49951 -10070 13796 -21852 -9002 10709 1053 -17897 -1301 8421 -8612 66474 124348
20522 124348 129875 126621 92390 123517 147692 120268 85574 80229 42033 8189 37421 49421
20510 49421 46349 50002 9870 -16749 -16604 26765 54019 85349 75021 50457 63279 57309 67326
20497 67326 34727 -32860 -73382 -103383 -68211 -85761 -70756 -1539 38783 29846 25081 5706
20485 5706 2292 27012 24000 23674 -6254 -55507 -74243 -118077 -117642 -67745 -37900 -42379 -41343
20472 -41343 -39151 -28617 -29498 -22369 -36382 -41113 -12294 10485 -92 23811 19469 42839 57020
20459 57020 69016 37156 23452 12943 11180 -16876 -9510 427 -18914 -6609 13399 9457
20447 9457 13237 33218 16375 -24135 -92589 -125148 -88241 -26623 35338 3855 -26346 -37547
20435 -37547 -89171 -68434 -38510 -37582 -39147 -16205 31402 52321 45469 -25367 -52503 15075
20423 15075 95577 114023 108642 120292 50641 -26299 -36196 -19561 -17338 3892 4166 35496 85353
20410 85353 62140 19968 -16968 -30884 -43436 -4698 50583 38252 13433 18857 12842 42889
20398 42889 65092 82176 100543 34676 28424 41282 90494 70296 28796 14977 -46185 -17299
20386 -17299 -19343 -17153 7017 39492 36403 262 -13318 -7302 2084 -51444 -109629 -84470 2370
20373 2370 51752 65004 104530 138458 95194 34454 41293 115268 135353 103512 46813 39880
20361 39880 26358 44060 7954 7915 18143 -15961 -30359 -51445 17229 23138 25076 29946 8733
20348 8733 1655 -39902 -58580 -56167 -13761 62911 95873 97871 106423 85776 67009 59265 12565
20335 12565 -27579 -954 46028 154969 158888 165015 130673 105075 106953 170590 228012 284090
20323 284090 332674 337647 374229 488587 618798 801725 1085660 1363116 1658455 1959331
20313 1959331 2160924 2295098 2355025 2278224 2219718 2141742 2022944 1974903 2033331 2164194
20303 2164194 2310767 2476286 2564742 2610034 2603414 2448306 2235637 1966938 1703156 1447653
20293 1447653 1246921 1101222 972019 843120 757491 646271 575448 532448 481885 493852
20283 493852 433881 354226 293830 212462 216235 196902 162300 142178 185966 202956 208703 199353
20271 199353 182616 209423 168449 118063 135398 140576 160346 154041 182317 201800 159281 155421
20259 155421 183955 163015 168611 212793 247155 217080 179203 123552 89209 106346 154773 128420
20247 128420 120136 102452 83528 113712 127137 112257 89451 107422 118346 69637 31730 62038
20235 62038 97600 55992 60187 129867 179635 181533 176503 115333 66132 28946 5028 5659 -11494
20222 -11494 40279 116387 126404 96450 79451 75357 70124 84902 93118 86675 79043 59641 -19536
20209 -19536 13447 36800 14345 31303 40275 99089 118348 108469 56052 33762 121959 213118
20197 213118 251342 209695 247069 298242 271955 327037 457944 626297 777737 889320 880898
20186 880898 916924 1046889 1157508 1215443 1228935 1208304 1173931 1184863 1223939 1308799 1279170
20175 1279170 1234472 1209059 1229778 1267153 1214761 1042045 827674 680455 553940 508345
20165 508345 426264 371581 370164 369344 315687 281256 268131 252768 247981 230965 269340 274647
20153 274647 222933 151798 119739 172192 241601 250800 222619 229862 213202 236566 247133 336914
20141 336914 400541 440448 495048 655906 780710 873232 999931 1094343 1173583 1253085 1293182
20130 1293182 1325348 1322865 1257528 1256183 1298887 1295255 1260123 1207348 1209009 1175472 1114754 1093476
20118 1093476 1124994 1061291 884988 705063 564815 497647 412060 329778 241232 224557 221650
20107 221650 226046 257234 209011 188551 183600 149877 135193 160208 202725 183618 125655 122987
20095 122987 13008 27251 116878 121759 114251 127848 125494 72097 87411 124328 118827 115750
20083 115750 48474 24803 59126 29983 -28527 -64351 -6075 -12111 -69525 -25894 -34190 -49914
20071 -49914 -39196 -30019 -5467 -214 27067 4494 -33178 3932 15369 38230 41953 -11392
20059 -11392 1774 43295 53591 74942 73706 6707 -4400 -697 103198 190848 156666 145281
20047 145281 160735 185697 171127 169889 162707 188238 207749 196815 172323 100999 77481 111609
20035 111609 101740 94736 54113 76479 124392 174992 191198 173142 164445 105578 72997 11442
20023 11442 -536 6583 2967 8079 596 17922 6558 4260 1805 -18246 -2123 9225 20135
20010 20135 36473 20583 -18436 -63403 -32522 -54017 -76251 -67850 -56314 6333 38276 36471
19998 36471 -7229 -41697 -58836 -24640 73942 93339 93421 109787 72615 59397 73550 118514
19986 118514 159735 143921 112836 122190 145340 135210 92614 163359 168421 191223 167686 189011
19974 189011 236951 256182 185715 142822 128794 175737 229713 189502 128373 148287 187325
19963 187325 188412 182811 158985 151747 127470 148481 115936 137921 90402 59086 83193 48782
19951 48782 58450 56563 4953 71941 79027 96086 104493 103365 25030 -47366 -46123 -57842 -69787
19938 -69787 -26717 17244 13747 -183 -18865 -50937 -72761 -82221 -109578 -147641 -124226 22417
19926 22417 40338 -24766 -55588 -2544 20907 11775 53405 50453 24148 7407 -29436 -42054
19914 -42054 -69628 -59327 -58320 -56415 -47041 -54855 -73492 -37020 -26316 -22726 -3572 -21802 -5639
19901 -5639 14644 22364 -14129 -29184 -68779 -69876 -25086 -6573 -6308 -7919 -8420 10151 -17828
19888 -17828 -37799 -26280 -14062 -28803 -28105 -2159 24534 31230 3534 -743 -28821 -35248 -81811
19875 -81811 -118012 -102593 -64108 -48862 -58341 -114505 -38176 22910 33230 20628 -11786 -717
19863 -717 12522 8191 54313 104945 125743 78490 6234 -14904 -2455 8539 40574 28839
19851 28839 21159 36126 -5459 4545 9009 18518 22849 32311 14296 17374 18327 41647 50996
19838 50996 37846 58033 124362 146634 134741 86037 93525 122958 91435 110614 138649 106347
19826 106347 93861 80985 83009 78024 75902 78413 74602 10909 15729 21945 897 -2908 70186
19813 70186 37636 37307 24460 55490 94221 149801 189346 149222 130291 117989 125821 74667
19801 74667 73514 55004 69642 74990 86293 65251 49671 10548 48251 113320 162073 151929
19789 151929 109486 122208 125306 98507 96003 108539 13812 -8650 59625 45487 42279 40389
19777 40389 57321 60924 68715 58976 10947 -18119 48105 128106 176805 147756 176492 184324
19765 184324 268021 287933 248447 177979 139715 152644 111981 90908 34560 58017 66811 83675
19753 83675 97519 142931 117785 118001 132354 113887 66743 62651 129758 112380 58522 11772
19741 11772 16917 75374 130182 107772 149291 188533 162028 117210 84618 81959 71753 72568
19729 72568 68579 4179 -24136 -22397 -28258 -8890 35643 33626 29901 68735 141310 204137 210963
19716 210963 214063 202869 165731 106900 43265 -440 -59512 -70317 -42691 29713 103158 95963
19704 95963 136432 126549 113830 133244 205546 333967 473014 691375 991717 1238876 1400059
19693 1400059 1340334 1051768 796675 716684 669956 627972 592911 661477 788962 1006086
19683 1006086 1251653 1413899 1322352 1067601 885075 670492 523886 461286 455869 421735
19673 421735 391365 367660 356736 316178 307107 318245 330845 277525 190991 199887 242115 171779
19661 171779 96187 118899 178461 232117 190572 210304 258711 254488 285104 304284 313892 300535
19649 300535 312625 339166 363176 396131 479545 611430 792875 1067043 1403672 1801611
19639 1801611 2110797 2092654 1864883 1510377 1252242 1141944 1074520 1033183 1095494 1252750
19629 1252750 1501148 1852648 2120703 2181605 2022057 1692423 1292470 986165 818992 671804
19619 671804 572570 506118 446088 383749 358978 373140 360163 338161 364239 358751 373143 351543
19607 351543 295915 230973 264666 216542 171722 251069 303112 309893 319478 280879 206217 187171
19595 187171 201303 213975 222101 259014 275724 249679 240897 256879 281160 281400 281403 280371 272891
19582 272891 241082 271871 253275 170738 137401 145831 144399 141337 109954 93164 113515 107493
19570 107493 101001 38834 27278 55132 71940 53625 37748 61245 55359 35375 91948 112667
19558 112667 124814 112267 117377 115502 108765 72114 88078 79159 62200 43246 92680 123059
19546 123059 153665 190013 169102 159350 158582 97413 92960 82193 37431 62650 82686 121509
19534 121509 142607 96896 34353 42876 -14845 -42801 4758 50148 52091 95157 60103 12720
19522 12720 -10000 46584 97091 143516 77031 65770 73002 88003 106228 93846 121252 176686
19510 176686 112764 33339 49307 107348 56064 33533 -24223 -6854 31251 41357 34159 17413
19498 17413 -8295 -42233 7363 82446 105337 47312 -12731 -38148 -41089 -57462 -79481 -47236
19486 -47236 -40414 -29657 -43353 47704 64267 59355 65449 32950 -61848 -35168 23120 21187
19474 21187 13687 -17516 -77525 -23255 18569 41020 35379 37844 -1719 -14645 4718 43886
19462 43886 81253 74833 52198 59240 87589 105551 111783 129538 62660 43707 84511 125724
19450 125724 168431 166092 102858 98482 127562 129730 123140 41005 106948 144130 111224 126939
19438 126939 130364 137626 144199 152089 197724 201007 189228 258831 371098 457868 502251 561902
19426 561902 685654 829935 979903 1224952 1457376 1664023 1844642 2076502 2309523 2480807
19416 2480807 2529122 2403987 2192691 2026546 1851553 1674647 1424928 1206979 1070171 908040
19406 908040 763863 648562 606062 578924 553268 467571 372798 375905 321536 274266 268737
19395 268737 258685 330230 344419 311949 264833 217609 204960 213023 241947 252124 269651 240095
19383 240095 192830 197847 263785 282697 239283 194421 207466 184245 211586 295914 346119 369045
19371 369045 406639 521494 624393 756599 959964 1115663 1203063 1306204 1409646 1560859
19361 1560859 1695690 1666594 1527191 1392820 1289698 1182776 982261 820331 732686 598847
19351 598847 519873 530476 504676 437853 395799 329182 289071 334957 327543 267796 252738 253222
19339 253222 261982 252507 200180 163150 140970 135259 149599 146930 168608 147544 154510 197927
19327 197927 234716 225581 149784 96094 93845 89458 102053 91646 37602 18910 18952 58851 54737
19314 54737 71703 93323 109030 49247 22231 53267 103044 82247 33216 25662 66555 118704
19302 118704 130204 113358 119035 91520 43982 80755 118379 127224 74982 56397 20841 -9503
19290 -9503 47841 67359 61476 94931 93691 81900 96640 155691 147525 106371 79727 73021 83018
19277 83018 112157 96674 88671 92772 49144 62258 61640 73517 76620 72095 100468 47418 2867
19264 2867 26284 28580 64101 84841 77901 37970 39403 76754 82896 47732 46570 47271 52824
19251 52824 48869 25626 24072 66816 85124 84059 47799 51554 49369 48076 70767 142268 204107
19238 204107 180580 179084 145504 118254 126102 115169 79168 105146 140594 158083 164819 172621
19226 172621 164289 132921 118516 94539 81413 105646 96740 128735 142175 137986 176402 164901
19214 164901 128692 70602 75022 64910 32622 -5174 -38651 -42211 -28706 43304 56742 74722
19202 74722 86970 128599 148928 157931 98413 58812 42313 44166 37051 87581 67472 67603 80616
19189 80616 57147 32627 66731 28196 20201 28710 20973 56708 63413 68490 56444 40938 17580
19176 17580 2200 5856 41209 77835 92936 101177 70373 93111 80714 114010 80361 28074
19164 28074 19207 56425 23325 10762 37598 95395 90808 61856 59453 53303 81783 114064
19152 114064 72097 27158 30185 46304 20390 -8865 4317 36103 86960 131374 133751 118961
19140 118961 106648 68954 63428 97127 83331 115163 146298 128141 88575 68773 58429 76072
19128 76072 78163 68152 73434 75490 101374 61532 36460 73084 73570 19100 10716 47751 82377
19115 82377 150938 175652 137209 83631 140399 136671 86931 20337 -7843 66027 109890 148931
19103 148931 146589 110060 63260 68881 84123 84182 38201 27449 37958 98543 144149 155625
19091 155625 193160 129666 85146 86601 102081 135610 123185 133457 73294 26386 59122 85978
19079 85978 66930 41791 19997 18477 57103 78956 96477 68295 46729 119508 101479 155302
19067 155302 182791 155218 150794 140701 148561 115700 131916 102851 92086 88561 93272 64746
19055 64746 34888 64853 59568 93372 90821 75010 22491 -43777 -32248 -27241 -12458 13310
19043 13310 67453 64778 22292 11596 43759 104173 99972 66464 24070 6405 -16607 37459
19031 37459 118278 113898 127949 145390 119851 117312 109563 90321 87672 7168 16676 70412 119178
19018 119178 124688 103881 65165 88322 129640 119122 120040 83367 12363 -816 39183 82654
19006 82654 74628 49091 59828 64052 20995 26220 11609 7481 54343 127537 143143 148015 147282
18993 147282 111651 85346 59690 104183 107584 136256 98586 71598 70085 79894 61116 50881
18981 50881 57279 34403 49006 103026 89980 48120 8463 74155 117098 122498 119719 75187
18969 75187 37007 54595 87094 52305 21584 30084 69420 129824 180385 246342 249118 208369
18957 208369 198830 200604 197165 245474 329598 373283 408380 416428 390292 408128 408247 325030 239551
18944 239551 265843 353330 367941 437496 525280 576274 585564 576317 610306 623767 625812 607113
18932 607113 517817 437478 331515 346726 324477 316858 321356 284204 261361 197770 172573 207604
18920 207604 231896 186843 134522 139359 202056 251612 277039 267504 294519 290021 297545 359054
18908 359054 419288 385646 321955 322623 408505 456055 515967 567150 608209 682012 748037 786558
18896 786558 889979 927846 960233 1009344 1030299 1029772 1081383 1079659 1094570 1078615 1066644 1084707
18884 1084707 1116322 1189422 1198224 1123503 1086186 1055541 1038543 1019147 949794 889745 835508
18873 835508 780872 748091 702329 602544 531241 535683 511310 467803 423393 429785 452543 417505
18861 417505 312911 312152 267775 239281 296493 349713 359724 303203 236656 210916 238247 255368
18849 255368 209105 218264 235920 226604 241397 239201 205387 186547 197170 227910 213359 190664
18837 190664 183670 141877 115348 172960 222410 217955 195030 195558 206382 226908 207313 215098
18825 215098 228888 215487 217287 175874 142663 182846 135834 116404 171080 195727 173552 132480
18813 132480 104539 106237 128628 96638 49828 98580 157419 138859 156711 156557 146240 95705
18801 95705 78223 138764 197168 180447 185309 204238 220574 242815 220269 157233 182834 219983
18789 219983 224921 268171 246219 253099 214421 207272 181216 203883 171234 197646 269953 247296
18777 247296 206222 100255 104609 135390 132547 152477 192575 236352 239677 205180 168837 127019
18765 127019 139846 181562 201789 167377 163119 188137 223116 229637 223702 244045 224275 211715
18753 211715 204842 188153 137597 173582 207666 188488 164304 156176 188579 255308 294763 243055
18741 243055 180224 151697 211501 218501 240676 227016 202064 204870 237222 211608 174020 171582
18729 171582 233631 244165 257020 255138 260032 272496 259678 250629 291232 312630 272761 255678
18717 255678 221481 211744 285549 367804 377849 380705 428944 465502 480950 550732 671516 849208
18705 849208 1097253 1363983 1581318 1689435 1645228 1502145 1272816 1051557 918265 806852
18695 806852 704231 630093 609265 614409 581353 536192 554752 535205 572069 628201 633007 661326
18683 661326 728542 760629 803825 891226 1068663 1283213 1517280 1735211 1790907 1769185 1624784
18672 1624784 1369269 1166082 980349 822552 750480 704671 659298 609472 632123 613945
18662 613945 634334 676772 703590 708007 730548 782459 845084 917362 1038133 1145677 1343853
18651 1343853 1619941 1859986 1906665 1824193 1651400 1444760 1277120 1173559 1089025 1050801
18641 1050801 1008989 965748 993896 946688 920047 925070 940144 895500 806388 813506 832104 884801
18629 884801 892316 915975 1055639 1306112 1534282 1786132 1961793 1923567 1746310 1480168
18619 1480168 1266317 1149921 1051429 976073 892066 821894 742300 698644 685887 662288 653763
18608 653763 592519 609414 664363 675649 651559 622916 647921 617055 576480 573238 582381 582854
18596 582854 556727 574909 596195 598878 593485 563888 566780 555586 517287 502348 552727 599260
18584 599260 642448 661593 681937 704542 746336 788657 859534 887663 943864 1000837 1041407
18573 1041407 1027624 1047520 1023631 979897 948858 894659 801580 833709 847137 841049 781244
18562 781244 791006 831841 866661 853936 806936 770693 773817 804744 825967 834021 873570 920753
18550 920753 918865 877993 880593 912513 965392 1030886 1041564 1065732 1139183 1135069 1116203 1129431
18538 1129431 1173012 1160484 1064950 1037212 1053830 1067138 1107545 1197763 1197057 1219644 1274715 1250668
18526 1250668 1241902 1325437 1373416 1405753 1432530 1432285 1444258 1512243 1610931 1658120 1675302 1629459
18514 1629459 1631055 1668364 1647371 1578504 1548558 1493967 1466182 1487526 1492832 1484241 1480080 1514041
18502 1514041 1524239 1555542 1558804 1600054 1660475 1734115 1795621 1890587 1975519 2031669 2162072
18491 2162072 2279131 2324093 2358958 2409034 2478215 2516925 2562940 2593323 2633824 2708404 2789900
18480 2789900 2822168 2832675 2912055 3025166 3047259 3032997 3086273 3214495 3369995 3474603
18470 3474603 3560395 3715996 3950626 4165333 4422454 4722361 5039250 5432113 5860754 6370254
18460 6370254 7014778 7809907 8877268 10351819 12339943 15065520 18856735 23939189
18452 23939189 30391654 38083423 46569995 54707128 60248678 61175495 58361027 54548150
18444 54548150 51204345 48978557 48550571 50602256 55392052 62834344 72381686 83296063
18436 83296063 94278277 102120685 102736706 95696512 84855769 73339033 62438115 53107767
18428 53107767 45665643 39873706 35488323 32206562 29822434 28119277 26914450 26027342
18420 26027342 25305208 24689689 24197538 23874012 23701433 23706381 23922755 24386288 25310461 26860704
18410 26860704 29158721 32312896 36308334 41201380 46956123 53387072 60469481 68296127
18402 68296127 77009798 86796441 97887984 110151318 123166604 137030710 152355456
18395 152355456 170313438 191636841 216018052 242889062 271619303 299719451 320070414
18388 320070414 323792020 309958985 287145104 262495472 237307847 211105985 185054642
18381 185054642 161259238 140871043 124060564 110282756 98740847 88855994 80269483
18374 80269483 72718983 66060414 59997511 54493218 49567717 45116382 41076579 37437365
18366 37437365 34185974 31243245 28650065 26320231 24234301 22245644 20330558 18634600
18358 18634600 17096468 15623791 14217935 13017448 11993216 11013729 10147895 9288580
18350 9288580 8542524 7903925 7328786 6751364 6254225 5777891 5360736 4964562 4647585
18341 4647585 4339514 4046255 3775258 3460423 3185659 2979234 2761162 2589690 2398692
18332 2398692 2233267 2082777 1918798 1789267 1713320 1611502 1510163 1444647 1337649 1220803
18322 1220803 1128620 1051114 993201 1024195 1018378 950073 890430 869991 888045 897115 864264 795138
18310 795138 716408 663737 650016 696817 726362 685752 579724 537529 557032 511704 493712
18299 493712 474972 447592 436253 407566 396369 383337 435228 460699 451745 457311 442520 437962
18287 437962 411654 440387 436018 442861 457332 477243 464105 401777 311019 324877 386164 458502
18275 458502 409488 372505 408653 447708 505622 510629 548107 526361 476481 465872 442160 354549
18263 354549 298505 287045 286531 319991 331457 283918 259063 262908 250220 251636 253279 250777 230380
18250 230380 251278 181203 166771 222326 270886 276575 265477 270557 277149 265707 218235 239233
18238 239233 254162 264977 275156 279453 217196 214252 220994 224209 276362 239072 210667 182068
18226 182068 204742 177062 177175 177355 138338 175093 166372 143745 133027 107458 155062 171409
18214 171409 147544 120930 57122 49888 53369 94641 106578 110174 115665 113081 81004 75042 79782
18201 79782 65466 31901 28223 -1313 7608 58952 132212 133206 67461 64015 90203 59791 62251
18188 62251 71607 43661 -33259 -57083 -42637 30642 10052 -11401 -33617 1755 23418 66218
18176 66218 106978 73588 26032 -6823 -27891 8523 100293 137915 127887 54565 -25326 -39205
18164 -39205 -56278 2131 82159 67249 83708 46916 14022 -19369 -49612 -43343 -37556 -69254
18152 -69254 -36108 -10587 -38909 -55110 -74080 -21024 24620 71576 84425 63439 -602 -63684
18140 -63684 -89555 -29563 -19510 -10636 7605 25916 13309 16979 18561 30241 38342 64167
18128 64167 23362 47139 52327 -21942 -34800 -31117 -7283 28219 -7131 -27636 -19567 28834
18116 28834 20938 2826 -13023 9284 14987 -10399 -38005 -2688 18769 47957 60647 85843
18104 85843 36766 -32686 -16152 -13085 -19709 -18887 -26701 -70542 -78827 -32840 -12225 6808 33713
18091 33713 24522 26207 64176 142497 155488 165832 106829 8779 -7431 -18523 -2709 -20191
18079 -20191 8081 59278 15462 -34553 -65359 -16717 15072 20623 4962 -68552 -57097 -56370
18067 -56370 -86531 -73710 -37394 576 -756 -41363 -77664 -67344 -68018 -37744 -6757 20170
18055 20170 28635 -5334 -36877 -11921 -14776 -345 32642 -3512 -31661 -79045 -99872 -117926
18043 -117926 -95600 -101997 -89603 -104543 -103599 -72046 -3342 7488 47619 74980 38143 16523
18031 16523 14320 3494 -23170 -76893 -56418 -9323 -11271 -45849 -37234 -8526 38562 64179
18019 64179 29790 -18352 -46170 4547 -44536 -88687 -51471 -1163 12572 -586 -22660 2117
18007 2117 -17151 -73804 -76978 -89087 -45546 22671 13231 24487 -28177 -101973 -115474 -65931
17995 -65931 -47674 -53840 -14864 -20718 -11290 5405 -16490 -13611 -21445 -21128 -10405 -53660 -89860
17982 -89860 -72176 -46424 -34813 13605 40635 63622 23803 -9817 -2758 24541 27409 15752
17970 15752 -32257 -47167 8181 38499 1097 -31582 -19353 27625 11377 -3445 -80432 -101698
17958 -101698 -37140 3388 22204 59299 50498 40012 37994 39666 37084 33351 2536 54194
17946 54194 131429 166238 150858 191632 259164 300224 362614 405568 417477 365658 332784 333296
17934 333296 264163 236774 238376 261743 328272 389182 428681 454580 448836 446163 385972 331528
17922 331528 334528 270384 210772 177419 179271 251773 237624 214841 212200 185750 179021 176141
17910 176141 196336 247113 355411 413076 467196 527992 545811 577035 651834 663415 713054
17899 713054 718311 689684 691201 680331 692905 789218 880386 910291 979224 1014314 1059576 1093093
17887 1093093 1106353 1106371 1026300 901506 855076 766430 736200 737078 737287 703559 687300 649078
17875 649078 593557 548523 527777 568284 562395 498054 442922 449041 374706 285782 244469 201693
17863 201693 147717 101859 66661 65329 81302 95459 49905 36976 106503 133750 118829 134836
17851 134836 146516 158647 127123 56272 -10544 -79595 -52577 16101 35397 43078 53833 93361
17839 93361 97196 66694 69008 49275 69753 116873 83121 46758 52087 84123 127552 133684
17827 133684 121679 104746 88142 18322 29544 76685 55045 52440 21419 -6446 29578 18861
17815 18861 -11566 -37007 -51746 -22367 8883 41753 48070 79684 85300 23953 -16195 -26565
17803 -26565 -13820 3942 -29696 7655 52384 36922 -35943 -74033 -60855 -77083 -102372 -90200
17791 -90200 -23761 33715 44269 -9124 -53718 -58721 -70717 -69754 -41958 -68151 -49800 -48103
17779 -48103 -59709 -121589 -72023 -8417 -62593 -111498 -73259 -119786 -123895 -120856 -113368 -83443
17767 -83443 -76790 -20268 -10794 -32218 -10323 6300 -46124 -71759 -48311 -32863 -58751 -76347
17755 -76347 -8278 60217 41337 -10852 12134 40074 55363 6790 -13437 -47931 -45325 -61360
17743 -61360 -15867 -22286 -40692 -15118 594 -33465 -84459 -108508 -130167 -113042 -29840 18822
17731 18822 60121 21694 -30495 -36642 -25413 46542 1742 -8589 -15763 -20916 -31098 -22167
17719 -22167 -44550 -26362 -12223 -41540 -14398 19607 36709 16484 -37061 -22699 20675 37540
17707 37540 45680 31373 21550 61635 82608 103715 88722 52636 -1943 71562 94110 69466
17695 69466 35044 -8160 -40004 -25434 -14634 -192 -11713 -26811 -34823 -23655 -17187 -3344
17683 -3344 37303 14466 -22830 -21259 -25786 -50128 -82897 -69255 -59705 -15359 -8007 2922 3791
17670 3791 54048 43493 -17900 -46294 -68217 -20890 8434 -2289 3257 -29454 -42854 -54880
17658 -54880 -27126 -25437 1163 78371 89409 24513 -8178 20275 7357 -55337 -72276 -44690
17646 -44690 -49013 -8179 -4141 -3019 -12931 -14006 -34902 -136 16912 37379 84885 75383 72513
17633 72513 56340 13280 -37373 -59079 3196 -3610 -8026 -55308 -74833 -57357 -48239 -30081
17621 -30081 -42678 -52789 -49530 -3053 16865 19871 47913 32971 -8621 10977 55898 22732
17609 22732 7838 10676 28955 -17865 -26624 19231 52630 80244 49360 -7364 2734 49208
17597 49208 15566 21947 -35885 -20169 67051 45088 8226 77788 115594 125445 111638 64949
17585 64949 10468 1352 -63191 -61171 -39427 8714 -8224 1332 -3702 -825 -2466 -823 -5639
17572 -5639 -18382 -56741 -78914 -61615 -61002 -77491 -48194 -78350 -79206 -118643 -80575 -78249 -86793
17559 -86793 -86151 -29722 38357 74358 84788 39147 14639 -29971 -93265 -96201 -103923 -53850
17547 -53850 -41843 -74282 -58674 -34079 -62078 -44235 29703 97825 61962 -17807 -21584 37260
17535 37260 69249 25751 -17833 -50010 -26455 -6430 -21624 10565 62359 74071 35756 -45202
17523 -45202 -33862 293 37523 68277 5319 -1746 54800 67057 86842 50848 83750 63647
17511 63647 3385 -36534 -41499 2935 51530 78637 68402 40673 1271 -39171 -10902 -25554
17499 -25554 -13543 -31389 -39903 14149 -3599 -2156 -9603 14161 -24707 -111089 -60890 -19163
17487 -19163 16805 92013 108382 76597 64630 82239 77741 31638 36897 23734 -9399 -79495
17475 -79495 -29799 70003 118117 121132 83440 97802 128204 86393 112358 78534 58117 79966
17463 79966 61369 33988 37704 58977 32107 -33305 -22605 -14446 -31823 52299 19119 -11368
17451 -11368 32789 14248 50787 23307 -25483 -52071 -32578 -36991 -21867 7676 40041 34614
17439 34614 32740 45338 22542 23435 38035 42864 14599 -15862 -14199 6225 31693 63815 36039
17426 36039 58336 42504 11783 -2659 42084 26969 -4745 -12199 25419 36147 29738 14801
17414 14801 12500 15047 13263 10971 55854 66238 87806 132806 161476 126908 128214 59222 45810
17401 45810 38585 11085 34416 45843 40525 47067 86457 158702 173444 160257 143289 123732
17389 123732 66410 32248 26702 43732 47776 77582 103187 76171 87878 146340 146848 140703
17377 140703 67914 69506 91158 89019 110503 89130 77579 80731 128973 176210 190306 179396
17365 179396 187259 191837 181989 196314 220701 208854 228856 205889 195395 248917 253339 227791
17353 227791 178899 110053 47586 82237 151517 200796 193310 181582 152769 139359 98137 77368
17341 77368 85594 98913 117622 134464 160564 128053 137843 148015 121696 134495 168541 111346
17329 111346 99784 96634 94047 77470 106527 108874 98892 117467 128908 124327 202689 223224
17317 223224 192666 168758 222000 254423 269165 253516 260876 299666 307079 332916 344431 344537
17305 344537 374201 401197 471365 491276 485454 564319 635978 650980 673915 761660 790484 741690
17293 741690 755208 756022 697474 625075 632820 608476 553023 526208 467204 430229 388314 351812
17281 351812 281547 226130 230938 249935 239464 220490 272354 312108 274855 292087 302656 321017
17269 321017 264064 203655 232050 229743 260919 309210 313979 300710 264304 211741 253453 291524
17257 291524 263381 268467 331118 385553 371700 357439 380320 437117 430310 453352 555755 633125
17245 633125 598780 598416 632659 647725 681631 691830 662906 633837 588651 534369 534024 512095
17233 512095 492563 478736 502905 496926 545916 551405 528979 563350 542951 509802 456201 433610
17221 433610 424008 418733 402867 393007 450682 444038 427371 419909 375023 428212 386535 332501
17209 332501 347000 428510 460695 443952 365416 344250 378572 419592 444496 461769 416309
17198 416309 391339 453293 446311 422656 410228 391900 408404 509070 549965 496457 490118 507906
17186 507906 556934 553382 546808 524588 506704 477208 416735 423229 489469 479178 414532 382327
17174 382327 377226 382329 400398 419429 414260 425288 399555 349396 309306 357343 378567 379558
17162 379558 345632 353520 329237 356597 390158 382427 415599 407347 379428 364879 338683 374494
17150 374494 399568 388201 379370 355650 413867 486731 486322 517695 517168 475780 521467 543821
17138 543821 499048 443318 399644 420517 451183 469801 509899 504311 545245 616949 675373 664490
17126 664490 607241 606009 588520 622583 608830 575104 573380 634960 620157 495174 489835 555467
17114 555467 599434 673823 666956 650583 662549 639752 623706 619943 654122 737376 766127 688161
17102 688161 651152 626685 660025 724779 779472 811587 819636 810413 826518 863093 833457 872170
17090 872170 930927 909646 882283 915505 959757 968693 959389 1006719 1117538 1183283 1274459 1291680
17078 1291680 1269613 1247617 1240296 1261911 1276892 1260432 1209202 1216010 1252612 1273393 1267461 1315316
17066 1315316 1420725 1410710 1432445 1541942 1566746 1563370 1600382 1669154 1628834 1565354 1538488
17055 1538488 1544376 1569714 1566432 1568563 1577126 1614692 1671392 1682082 1679265 1662974 1703714 1700648
17043 1700648 1739261 1746764 1759897 1811385 1874934 1905498 1907598 1914344 1872870 1843331 1849938 1918869
17031 1918869 1959455 1989796 2002491 1997551 2032997 2089219 2138416 2208734 2229514 2267123 2330620
17020 2330620 2406899 2465125 2519533 2513383 2582745 2583191 2589832 2610804 2626766 2702056 2795593 2862770
17008 2862770 2933151 3063532 3228097 3314414 3424217 3492298 3541331 3616404 3635337 3669090 3761246
16997 3761246 3848832 3977948 4065203 4144638 4257551 4410797 4552043 4695128 4824070 5003037
16987 5003037 5271426 5499740 5683542 5921595 6177180 6491385 6756849 7056933 7409533
16978 7409533 7771671 8147544 8595550 9054509 9560945 10076588 10564609 11136817 11830226
16969 11830226 12609262 13512921 14448404 15357714 16410138 17665652 19032420 20462222 22042897
16960 22042897 23785714 25647462 27654643 29725397 31888577 34224604 36610973 39023426
16952 39023426 41401812 43737302 45995589 48217415 50355267 52454407 54497947 56546180
16944 56546180 58574511 60679552 62840165 65073317 67455749 69838110 72190552 74380095
16936 74380095 76267782 77885981 79141630 79923594 80205715 79988014 79333317 78328151 77102471
16927 77102471 75688044 74096929 72369128 70609583 68917740 67295314 65698587 64025129
16919 64025129 62264866 60525252 58668936 56722846 54577860 52295355 49964153 47542384
16911 47542384 45195915 42785325 40398558 38129608 35935133 33817809 31761476 29850081
16903 29850081 28087199 26410530 24856608 23395493 22062976 20806289 19630551 18486406
16895 18486406 17434220 16456111 15601711 14746126 13961277 13220338 12530968 11880975 11295647
16886 11295647 10745513 10222387 9700267 9231116 8751147 8329817 8018920 7691402 7423666
16877 7423666 7109737 6847521 6595667 6398173 6221393 6042086 5866228 5681906 5507784
16868 5507784 5367933 5218047 5047752 4805287 4647401 4476092 4299089 4094292 3962791
16859 3962791 3844202 3749765 3651770 3552305 3475895 3387493 3329861 3310156 3249941 3179236 3083720
16848 3083720 3059988 3021062 2948039 2949202 2993723 3019837 3023495 3010334 3000366 3000589 2987077 2960202
16836 2960202 2983655 3049064 3128106 3214876 3296394 3350764 3474125 3602788 3800908 3982866
16826 3982866 4217423 4485878 4724675 4916312 5106715 5472068 5903300 6393028 6960931
16817 6960931 7634570 8317908 9126905 10150932 11493158 13335056 15906882 19462055 24309991
16808 24309991 30769460 39204814 49944507 62774018 76900035 91404864 105493702
16801 105493702 117163565 122217802 117350804 105069151 91409114 80304100 72703172
16794 72703172 68093590 65499477 63889502 62219470 59491269 55403575 50478309 45454771
16786 45454771 40800376 36582276 32790307 29440222 26561130 24038060 21896293 20142208
16778 20142208 18674469 17451153 16367220 15403910 14476476 13671427 12954093 12359128 11899401
16769 11899401 11508172 11244614 11128536 11138250 11352241 11771483 12431698 13484452 14960010
16760 14960010 17206943 20615742 25612503 32533908 41073120 49375490 54153013 53886184
16752 53886184 50984288 48878331 49459329 53684886 61999885 74351504 89583349 103836022
16744 103836022 112038958 112408046 108107279 101519356 91708038 78513094 64729761 53133080
16736 53133080 44389037 37832060 32985307 29331158 26482555 24281244 22517505 20930693
16728 20930693 19421959 17999088 16594869 15234473 13992024 12745544 11643926 10647649
16720 10647649 9820933 9036669 8280909 7643122 7023176 6434379 5868812 5364647 4923890
16711 4923890 4600962 4273635 3963710 3677913 3434464 3181334 2984493 2796717 2634185
16702 2634185 2493955 2331670 2240342 2140530 1995914 1859079 1738834 1671605 1609642 1560520
16692 1560520 1426156 1344562 1261150 1195639 1146869 1114958 1062464 977072 955405 973924 985210
16681 985210 945451 866061 820096 805856 776070 799929 848156 799782 744848 673015 635006
16670 635006 615632 609015 642291 607464 600213 585245 598841 585446 560235 509416 488130 486599
16658 486599 487559 538017 590046 602897 585883 553679 549667 600601 535252 525815 574861 571712
16646 571712 569295 585226 523621 490184 512559 523046 548813 590403 597128 561867 541039 512318
16634 512318 502017 467072 419658 483720 487228 436970 431875 417871 459397 486947 484904 468195
16622 468195 446594 476919 455396 460687 441232 378034 339960 280388 262246 224106 225022 239857
16610 239857 244498 225310 265824 297740 285261 250440 222163 186064 246052 246597 184983 139131
16598 139131 170697 199201 238376 245516 208293 223873 204881 213964 207852 234035 265763 224904
16586 224904 159641 93374 123702 162650 157184 94660 92762 134430 98737 72127 94300 156099
16574 156099 237916 265215 173793 122890 76231 88967 156603 187622 160381 109616 112316 103010
16562 103010 93116 53065 33120 99741 176862 192089 182627 166817 145534 133074 67886 65843
16550 65843 111792 123962 149622 138755 53026 17761 5411 -21478 20244 144719 158637
16539 158637 129581 141735 173158 126760 54388 -26133 -27401 -12224 -5092 31485 70916 46418
16527 46418 68424 149876 130953 98556 70512 67305 77304 68458 90394 129109 96482 82768
16515 82768 74469 73070 111467 73334 48410 91456 128001 83398 32901 -3933 -9566 5449
16503 5449 32010 67417 121478 81295 48382 19530 4244 34748 87858 91725 130361 147826
16491 147826 141183 54410 52128 103334 118130 94315 13277 47968 97054 24720 29029 114032
16479 114032 85399 58787 96814 79190 59071 101081 72756 42761 38194 46733 49642 101628
16467 101628 116615 81310 53127 3010 17283 -17395 -26385 -7843 22189 -23813 -66425 -37683
16455 -37683 7320 11979 47293 33729 29918 57795 21072 3478 -24302 -23074 32167 43203
16443 43203 21987 -5230 -16554 5265 27647 72208 20505 19814 34784 78632 60632 11856
16431 11856 20297 19807 15478 12187 38221 66883 71915 56666 35285 31530 15613 32076 -11786
16418 -11786 -59044 -72847 -72303 -111536 -130940 -24059 23453 68980 157597 109199 61094 73333
16406 73333 25334 13000 41111 77746 77951 28828 4690 -28871 -16431 20118 43173 83798
16394 83798 48400 74520 78499 22064 8324 -24926 -65771 -79814 -75031 -79178 -86244 -111214
16382 -111214 -87671 -12532 18717 46165 9780 651 22144 39871 -20483 -9689 1788 -13767
16370 -13767 -8160 -51086 -62579 -82415 -83402 -52007 -44724 -49658 -41335 -39653 -57077 -75431 -56342
16357 -56342 -69356 -41882 23612 48140 37630 26606 48534 19876 -12856 -39852 -28914 -10694
16345 -10694 15467 -37374 -60316 -52688 -41724 -45163 -13503 -27276 3405 36242 132 -15117
16333 -15117 -89469 -110669 -58496 -12006 -15971 -7163 4697 2469 15156 44301 2325 -28466
16321 -28466 37037 52326 114309 117297 56785 19149 18659 42293 55668 78327 86413 98996
16309 98996 145593 160998 140740 186265 232656 249423 374382 499551 586471 630896 656058
16298 656058 674694 644354 525884 421250 403482 315137 250090 237253 254031 254805 198856
16287 198856 196091 223632 227154 233302 210476 216729 168231 71486 25222 17615 50625 95952
16275 95952 76883 117949 111969 48236 18745 13135 -13243 28827 103903 95297 95086 89023 100433
16262 100433 71648 51605 46905 70146 92538 68497 124340 143168 137572 149981 147414 192301
16250 192301 245238 288009 272403 309681 334304 395001 412329 452624 509884 525454 538968
16239 538968 515483 499065 450478 386735 320456 152654 66275 32125 96811 132034 153704
16228 153704 128610 137888 90251 76486 50614 30915 -22937 -43159 9377 31396 53629 42111
16216 42111 1730 32595 644 -5694 41911 53437 43950 41434 54184 82003 51808 -26280
16204 -26280 -61772 -67614 -101201 -115998 -36128 -4616 3668 2651 -1216 774 -22227 -53550 -49701
16191 -49701 -2242 -37625 -92264 -54981 -28113 -73828 -96987 -63364 -57964 -46054 -37201 -21645
16179 -21645 -66913 -64835 -84783 -97837 -79028 -68209 -28375 -34800 32808 19308 23399 27767
16167 27767 -15921 -59142 -57866 -48044 -31914 -39384 -44278 -63187 -92459 -46929 23724 8565
16155 8565 -21273 -6137 -6247 -46718 -43925 -41699 -85914 -116569 -133183 -103600 -37076 -34401 4516
16142 4516 15128 -570 -1808 -38314 -42643 -63470 -16766 -30007 -32791 -19801 -37078 -47514
16130 -47514 -96493 -89531 -107947 -59263 -44878 -71619 -56137 -51026 -76561 -43987 -32969 -25200
16118 -25200 -44801 -111465 -134027 -127783 -81576 -83547 -60096 -58461 -21162 -22764 -88668 -110224
16106 -110224 -92641 -40468 -5348 -32215 -107213 -97331 -81470 -50103 -41718 5033 25770 2623
16094 2623 -25744 -34416 -73911 -125194 -142037 -91894 -60769 -28948 -5076 -76502 -113765 -117039
16082 -117039 -126482 -86159 -18713 10406 -50809 -123067 -123547 -110655 -114199 -147218 -163477 -143288
16070 -143288 -59708 14846 19783 505 2805 -36123 -48897 -74977 -121472 -90178 -131049 -95785
16058 -95785 -37517 -12523 9555 51877 81160 -14942 -128987 -134551 -70874 7087 25936 28495
16046 28495 50211 53455 37281 45840 -52661 -54993 -5250 -13237 -30809 -77149 -117711 -109037 -22426
16033 -22426 -46389 -57583 -18932 -55560 -58866 -12486 -36395 -66214 -40695 -25791 -18611 -59670
16021 -59670 -94314 -46517 -29955 -18997 48297 23419 -66281 -119596 -77748 -43489 -44008 -12604
16009 -12604 14788 52476 53165 6852 -15478 -55043 -105355 -93553 -96625 -126205 -143380 -135998
15997 -135998 -106753 21185 29982 -15612 -52808 -84623 -66720 -35506 -24918 -34293 -80381 -140397
15985 -140397 -136880 -81715 -34776 -26578 -3551 -2826 -36894 -85185 -74591 -128577 -104663 -30460
15973 -30460 -11490 -44666 -24739 -40718 -2879 11515 4415 6495 -46814 -53885 -38753 -32029
15961 -32029 -32032 -27551 -38324 -61055 -61170 -97515 -116699 -146647 -101090 -66472 -26192 -56427 -52597
15948 -52597 3676 -11386 -51067 9095 15498 -6809 -47009 -57522 -64865 -71762 -41468 -39673
15936 -39673 -52396 -14061 68074 56919 -12366 -21415 -77059 -118213 -122054 -120266 -131995 -124401
15924 -124401 -93492 -32517 15928 9789 -34397 -126939 -152625 -113403 -76515 -74638 -50176 -35129
15912 -35129 -25803 -62817 -70243 -22524 -37647 -25125 -21106 56354 48954 29046 888 -14752
15900 -14752 -11887 -14885 -35250 -38739 -11028 411 2005 -41603 -96119 -90382 -25338 -40852 11742
15887 11742 24711 -15944 -35711 -22666 -11688 1734 38250 25904 26588 35064 25478 62362
15875 62362 94335 51669 22353 33329 22380 -51143 -103659 -74236 -74800 -118674 -128458 -102724
15863 -102724 -90919 -134775 -132035 -119463 -81958 -41601 -44181 -50210 -53550 -86188 -32907 -9629
15851 -9629 -39407 -144902 -192717 -128692 -65753 -12872 -48337 -112869 -103425 -107013 -104811 -69923
15839 -69923 -72186 -67563 -13362 8929 -136 -21716 -46242 -70017 -87149 -66453 -12120 -12394 -36335
15826 -36335 -3874 1874 -47823 -35113 -40753 -81658 -114021 -137452 -57811 -24737 -40734 -134014
15814 -134014 -183676 -137179 -53048 -98662 -126424 -157481 -153604 -103338 -84579 -78407 -61441 -10205
15802 -10205 -49052 -36367 -2015 -11781 -45973 -25471 33794 30911 -38976 -42784 -22591 -31967
15790 -31967 -29792 -22912 30475 80824 13450 -6629 -27518 -59246 -75256 -42596 -38257 -57168
15778 -57168 -92122 -107676 -38471 25793 -30965 2316 -762 -26929 -53244 -58083 -49289 -58808
15766 -58808 -84274 -83957 -98347 -139316 -111910 -75695 -97785 -137317 -89165 -71183 -87331 -147782
15754 -147782 -218686 -183741 -133465 -67701 -636 -20374 -60703 -47159 -19071 -48661 -60454
15743 -60454 -66549 -92877 -30932 45355 28392 51927 66879 46300 40923 -30593 -72261 -106332
15731 -106332 -105038 -81678 -41250 -46735 -96118 -87533 -43177 -58983 -79349 -84677 -36652 -73225
15719 -73225 -99950 -72762 -78384 -69717 -35308 -39999 -47966 -80278 -151502 -122124 -50935 -77095
15707 -77095 -142173 -140227 -102332 -89969 -71484 -29098 -4135 -21513 -60663 -43804 7298 12469
15695 12469 13053 27169 18347 -16470 2787 32956 72960 56659 38612 39330 -8850 -18365 -27906
15682 -27906 -16586 -93968 -43411 -18183 3883 19039 -15415 -6317 55877 58579 -5957 -19236
15670 -19236 -21368 -17815 22466 29109 -32256 -58293 -60185 2175 46895 -12457 -80161 -34103
15658 -34103 4331 -12100 10852 27865 -19913 -68580 -103839 -98161 -96661 -94094 -105929 -137113
15646 -137113 -102319 -119777 -97727 -91047 -113534 -152409 -157927 -116400 -72600 -88950 -24853 19231
15634 19231 46679 68929 69439 37117 -19384 -70875 -119911 -144110 -129097 -141517 -168313 -161536
15622 -161536 -113501 -68648 -69457 -101097 -122025 -138450 -118592 -100918 -88648 -32919 -26204 -18911
15610 -18911 -13615 -33827 -70434 -80459 -61301 -22583 -17828 -57063 -55220 -40288 -37467 -7596
15598 -7596 -893 287 23782 38595 44226 14681 -25997 -25808 -14466 -17556 -15794 3115 -33501
15585 -33501 -60012 -15164 37481 96284 83177 67470 10144 -16006 -55806 -55200 -37823 -91781
15573 -91781 -117602 -62332 -73781 -64501 -12063 -31138 -45990 -29052 -3905 50091 63688 43506
15561 43506 -6423 -11929 26982 65393 36986 31127 16234 -33950 -94601 -68520 -26754 -747
15549 -747 12584 -2387 -14747 -81238 -119867 -114148 -81079 -42685 -64233 -67503 -31969 -3173
15537 -3173 -13568 -12946 -8332 -4532 -31286 -38604 -75823 -57626 -32749 16511 44688 -6200 -33203
15524 -33203 -62777 -54730 -11076 7941 -23577 -11014 -8576 -17674 -54770 -132978 -235225 -189478
15512 -189478 -170230 -201926 -203708 -181435 -107687 -43928 33075 -35098 -87332 -52430 -93667 -88054
15500 -88054 -31743 -43894 -21108 -12866 -74086 -44145 31396 40110 84664 83209 13777 -15042
15488 -15042 -30638 -46661 -66415 -55851 -68788 -45494 -64804 -101457 -73303 -28773 -21769 -94799
15476 -94799 -125222 -76332 -44795 48792 89875 70580 -13939 -21632 2322 -73752 -61224 -88701
15464 -88701 -73077 -56930 -15230 -38445 -49777 -76155 -104973 -114131 -58368 -70093 -124979 -94439
15452 -94439 -96974 -117929 -87426 -25816 -20414 -62303 -71269 -117648 -93685 -14276 -22831 -2031
15440 -2031 12521 -25073 5924 33670 3539 14374 -10148 -22043 -8012 6795 12488 7241
15428 7241 11553 -3491 -53788 -32679 -18333 -46713 -100487 -90978 -81636 -85307 -78035 -47305 -86238
15415 -86238 -100612 -56084 -62923 -26766 -27917 -630 15509 13466 -27537 -89185 -122183 -124129
15403 -124129 -92543 -77172 -47346 -50518 -1457 35035 -14631 -27230 -38778 -2974 -751 -11630
15391 -11630 26591 49040 36787 -53754 -130607 -110330 -44226 -13931 -12706 -25555 -53409 -18688
15379 -18688 -17637 -22145 -30126 -13414 -18469 -69998 -69169 -17428 -3093 -18910 -17684 -38105 -37227
15366 -37227 -29373 -55350 -38249 -67671 -52563 -56517 -25080 -4978 638 -12004 -46197 -73905
15354 -73905 -82743 -48949 -30544 26943 -20407 -77973 -116080 -98518 -107668 -86021 -70835 -117138
15342 -117138 -75082 -81674 -113892 -105465 -57295 -36320 -34348 -72788 -99191 -70496 -81007 -113922
15330 -113922 -121807 -128703 -60808 -91147 -100286 -92992 -81962 -87587 -73440 -43752 -21354 -62738
15318 -62738 -100690 -100522 -116029 -102896 -71135 -49193 -88402 -54318 7677 -45202 -83958 -104047
15306 -104047 -108505 -86956 -61124 -47149 9397 25638 -7082 -47073 -50240 -64203 -60256 -47596
15294 -47596 -86332 -195753 -169216 -135281 -123112 -100965 -7733 -21872 -34430 -25487 153 32462
15282 32462 -25976 -62020 -41743 -5271 42935 -21456 -68642 -33849 -33966 -69236 -92062 -63925
15270 -63925 -60652 -52683 -64142 -76035 -55595 -42632 -23360 -76016 -125714 -103868 -75088 -93100
15258 -93100 -80100 -7192 44996 -15833 -52218 -41041 -45540 -48817 -69577 -34986 13452 -8621
15246 -8621 -23392 -25874 -14432 20279 -15750 -16507 -52620 -34853 -24721 -16647 6165 30778 -10207
15233 -10207 -12113 -21177 -43960 -78112 -104559 -102223 -100991 -97804 -68361 -68663 -52473 -55334 -76053
15220 -76053 -71080 7396 23712 -37102 -99262 -65760 -54495 -96511 -127943 -134469 -112681 -45481
15208 -45481 28698 58660 57797 28503 36232 -9966 -36177 -32173 -76567 -114753 -111892 -51469 -83668
15195 -83668 -72271 -23873 25323 -35133 -110192 -136358 -88581 -17712 -29670 -45279 -59178 -17780
15183 -17780 9655 -29230 -80055 -107574 -101269 -108652 -64014 -57809 -50788 574 36875 -7038
15171 -7038 -51568 -38204 -60047 -78352 -119198 -125197 -104648 -95846 -90663 -46524 -38760 -53403 -51574
15158 -51574 -90151 -85910 -92506 -106554 -107745 -79558 6520 -13942 -55474 -76478 -91485 -90500 -71847
15145 -71847 -89060 -82527 -114307 -60647 -56736 -121130 -108240 -80760 -71472 -29261 -26233 -4734
15133 -4734 -20952 -100575 -104725 -79135 -76955 -95534 -72067 -9017 50225 79429 9381 -44076
15121 -44076 -28679 6080 -45427 -57831 -45866 -70967 -27422 -1004 -15674 -40854 -50147 -2238
15109 -2238 7452 -64085 -110867 -117583 -74360 -45211 -2217 -47565 -68052 -29413 -82058 -48552
15097 -48552 -38258 -65098 -58504 -29711 -76864 -93714 -48273 -63228 -38547 -9312 -13183 15521
15085 15521 26313 47273 26343 -6226 25482 39978 33800 -6770 -92872 -72218 -23505 -37646
15073 -37646 -16882 16179 38873 12085 -16040 -24444 11211 9531 -42457 -103551 -131633 -146399
15061 -146399 -109972 -14948 -12491 -70098 -100147 -69652 -29021 -50184 -111193 -146481 -79874 -22587
15049 -22587 -9160 -43110 -44257 -61939 -110216 -86031 -22258 -23514 -65539 -83393 -16364 -20355
15037 -20355 -44916 -32176 24962 -11448 5664 -862 11482 12420 27307 -18846 -47359 -85968
15025 -85968 -71910 -45216 -35159 -7743 83812 89545 57535 41047 10259 -31831 -46209 -11737
15013 -11737 -31957 -21845 30332 47371 -28728 -54487 -85348 -116169 -147839 -116037 -80688 -106406
15001 -106406 -86777 -66039 -53289 -35792 -15947 -39424 -76982 -66448 -61493 -61633 -13947 -22343
14989 -22343 -43737 -119960 -161954 -182939 -204235 -177654 -124712 -91077 -89712 -117413 -113299 -42653
14977 -42653 19406 76915 34655 -7702 -15339 -34135 -70233 -137193 -145172 -125574 -89760 -94531
14965 -94531 -142509 -128543 -67093 -42390 -2191 4925 14629 39945 37158 11646 -55739 -73096
14953 -73096 -86871 -138819 -133670 -108527 -94517 -38772 39200 54185 21722 -40356 -45570 -56481
14941 -56481 -60978 -63221 -80174 -73389 -8344 22680 8672 -20222 -31504 -27564 -66549 -113250
14929 -113250 -115177 -87024 -97415 -65817 -55255 -77498 -58975 -41371 -83706 -156787 -127633 -90530
14917 -90530 -69857 -67632 -74701 -90084 -132070 -126399 -29428 -20107 -46307 -79355 -72247 -63472 -54304
14904 -54304 -4624 78495 83711 30833 -41476 -68621 -99071 -97617 -74109 -75578 -47484 -42437
14892 -42437 -82871 -74383 -66462 -7461 50638 33099 -20382 -16863 -10486 -22247 -66142 -51955
14880 -51955 -33501 33335 17223 -846 18308 9596 33874 46705 20244 13121 -19120 -9190
14868 -9190 -2466 31666 81112 85048 59852 85213 81070 73544 50747 30287 35704 83038 69497
14855 69497 14429 -22722 -56702 -49360 -69196 -51671 -35150 35151 6883 -44715 -68013 -1145
14843 -1145 29849 -19154 -43078 -74015 -58179 -16198 -23545 -41833 -123743 -110513 -49781 -25796
14831 -25796 -36042 -32883 -53781 -21675 -1979 -21903 -15309 -49028 -34624 5298 11974 18242
14819 18242 36086 2 -43154 -59529 -29916 -765 -35500 -52152 -76415 -104093 -128425 -91997
14807 -91997 -44095 -36897 -22313 30567 32816 -8028 -23554 -44186 -86708 -98270 -47300 -28992
14795 -28992 -50987 -68167 -115798 -131887 -134612 -114041 -107276 -95238 -27250 -66837 -60463 -46853
14783 -46853 -15797 7856 -8077 -33268 -49430 -49221 -65323 -24004 -8179 -19767 -32486 -45653
14771 -45653 -47178 -47654 -36990 -4924 -9715 -53889 -134985 -162710 -125375 -46143 -58834 -88742
14759 -88742 -91066 -79502 -49727 -84645 -80092 -95909 -113503 -127629 -118737 -86596 -111731 -64223
14747 -64223 -10942 23494 64832 86889 86451 17571 40113 76560 45471 -23371 -98570 -107601
14735 -107601 -88156 -114728 -159134 -167689 -112197 -98716 -117367 -101396 -76278 -81683 -79008 -48914
14723 -48914 -15539 33631 55001 38113 5304 -2553 9689 -9652 -46030 -35014 -47498 -74974
14711 -74974 -65765 -77100 -119409 -115848 -102946 -98393 -74064 -33661 -48360 -11348 -33619 -61858
14699 -61858 -75243 -81356 -94728 -86169 -75863 -44528 -15401 21190 38850 590 -69161 -89859
14687 -89859 -51975 -78334 -124384 -194600 -224230 -179463 -93318 -41167 4676 14383 -23149 -84301
14675 -84301 -57314 -34481 -71015 -17883 -604 -32049 -17635 -21659 -82137 -125434 -122727 -75168
14663 -75168 -20531 -819 37002 23978 -56424 -98207 -104245 -47502 -14619 7059 21528 20433
14651 20433 34110 -8889 -57106 -62340 -89696 -106036 -107344 -53648 -27535 -35342 7811 62964
14639 62964 7919 -22203 -671 -79507 -109494 -63114 -9309 22485 5836 -18077 -48160 -44025
14627 -44025 -45378 -4613 7892 -20018 -10170 -46775 -82008 -77710 -8209 -311 -14413 -2396
14615 -2396 -16026 -8847 -29844 11653 -19208 -353 -7484 -44260 -19625 45106 63225 6081
14603 6081 -15592 -6736 40683 65777 41466 32196 58639 40453 46790 -9482 -85107 -55427
14591 -55427 35886 52903 29989 35560 -15077 -65737 -92105 -57456 -56058 -40587 -79186 -83102
14579 -83102 -72926 -31862 -44461 -61273 -18965 19472 -22957 -50737 -33520 6050 -2307 -3702
14567 -3702 22284 -2098 -62869 -5964 22509 2462 56893 82212 48552 20346 55233 82064
14555 82064 36340 -35257 -40254 34258 48794 38880 75273 52718 34289 40324 13372 -35299
14543 -35299 -31568 -58280 -86043 -100530 -43471 -23113 -57416 -15545 3616 -631 22005 28416
14531 28416 -32657 -16377 -63659 -8906 7132 -24716 -96876 -108067 -92577 -32326 3102 -16110
14519 -16110 15435 10147 37293 15721 29503 48055 25158 -1866 -26912 -6040 -24920 -20357
14507 -20357 -32239 22171 43656 22157 24647 42629 65922 26099 -24113 -26634 -29525 -58560
14495 -58560 -79640 -77920 -27175 19376 2165 -34695 -135906 -158903 -119515 -99590 -101553 -69723
14483 -69723 -51033 -82202 -94592 -82446 -77281 -57055 -59931 3670 -4915 13318 52212 105792
14471 105792 102814 95914 44636 25639 39900 42106 4959 -69675 -82834 -55144 -17807 -30072
14459 -30072 25357 42806 31134 -2083 3277 15467 80309 66707 68767 84213 96735 111170
14447 111170 170342 156685 62493 196 19733 58777 59944 91123 72034 33419 -24803 -16195
14435 -16195 39485 48010 36671 44 6887 -9516 -24183 -42722 -53860 -50640 -46715 4895
14423 4895 -38369 -69772 -42137 19813 46347 41734 -31850 -94584 -91992 -48745 -9824 26203
14411 26203 38462 71129 69191 46384 37066 2988 -66478 -87928 -65729 -51178 13712 52425
14399 52425 44813 2182 -25127 -20741 -49619 -29268 -23772 -20903 89444 43042 34128 47418
14387 47418 44157 22269 -19887 -49124 -23645 58945 131063 114706 115943 114490 96001 71056
14375 71056 44331 41057 62236 48833 48614 46064 55902 52024 24782 -49622 -34244 33108 56869
14362 56869 91047 157157 153729 57789 26158 25395 -3330 18082 46448 50981 26970 -38235
14350 -38235 -77724 -79770 -34393 -17633 -30210 24454 -17543 -12375 7490 216 22760 -1312
14338 -1312 -52826 -26344 -14941 13243 52095 51152 2756 -76670 -48034 -85726 -86232 -74298 -32990
14325 -32990 -41954 -95197 -67677 -31913 -9160 -22043 11440 15189 31087 1618 -85270 -94642
14313 -94642 -43535 8448 -864 -44853 -94045 -51913 -9272 -16996 23467 37103 4487 8048
14301 8048 4000 42546 51081 52630 56148 53557 65750 -12569 -92095 -61197 -37402 -14380 -26478
14288 -26478 -87466 -114329 -82708 -102969 -73019 -82696 -128757 -169149 -159275 -93873 -54443 -62114
14276 -62114 -71869 -55941 -22115 -14228 -26874 -48996 -52732 -5012 46953 27638 -33799 -64654
14264 -64654 -33691 -4055 -36480 -16827 -92839 -87114 -38466 -14198 -15156 -60785 -68886 -62371 -47083
14251 -47083 -37358 -32519 -15455 -17626 -78402 -96095 -105505 -91017 -77753 -18704 -16501 4933 43775
14238 43775 88153 100588 51228 28106 -7871 27701 70596 111588 84619 109176 116001 32239
14226 32239 -15760 3084 23228 80203 63381 33496 31606 39916 46987 31347 35467 33739 -29503
14213 -29503 -43152 -4259 -1326 11908 21199 38131 3048 -5706 73985 70582 49275 59617
14201 59617 44307 40514 76249 39312 27152 64919 83223 136604 104262 37536 69917 97742
14189 97742 80670 98652 34534 14537 -2333 -15857 45042 126403 100473 116765 88837 51148
14177 51148 18697 -12384 -21347 26573 81510 66495 58627 86165 129825 120475 105550 115796
14165 115796 96616 74964 58787 61341 72167 49661 -14274 -24287 -10560 8599 59894 59290
14153 59290 82286 131076 128558 119071 137705 58184 225 -18376 36184 63840 38275 -9930
14141 -9930 -15180 1006 6549 73630 63500 -229 -10610 4235 16394 26165 23768 12376 69929
14128 69929 84807 82115 91513 50791 18574 51203 67856 83641 117728 79083 23748 49180
14116 49180 21843 37155 9549 -37706 -56896 -48337 -63502 -56568 -36435 -16215 -53746 -71221
14104 -71221 -46306 -29610 -111977 -124985 -136423 -99797 -81922 -61911 -87893 -55202 -3075 73243
14092 73243 59726 35322 50103 69998 85764 106490 143034 158574 155039 110196 134089 140032
14080 140032 97213 15671 53744 95993 154925 109502 54417 106300 106748 70011 29047 5673
14068 5673 3014 -1962 -21016 -16753 6858 23205 36858 26113 18721 48480 75160 50368 22766
14055 22766 25148 49818 56372 53454 55541 41318 15039 32869 17642 -5823 -8251 23217 35767
14042 35767 52274 6361 15125 73083 99557 108660 78552 18146 5442 19301 -4182 -38299
14030 -38299 -31562 -61456 -44011 -2101 -34760 -4115 -9651 -14619 -824 42437 65738 46535
14018 46535 2160 20796 24106 17334 15833 -19827 10087 12233 -10492 47041 105896 112334 80651
14005 80651 54287 10820 8038 33145 30671 35523 29330 32863 20983 6732 25810 26686 49188
13992 49188 53846 57864 45119 31971 41761 55004 -4511 -67779 -76621 -56815 10794 38986
13980 38986 37696 -2837 -12260 -39242 -29895 -2325 26046 20349 54747 56219 88520 79788 66376
13967 66376 26772 88868 166736 174077 118506 90345 66450 -8240 -12548 -28216 -71048 -35360
13955 -35360 1130 -15831 -6644 23154 66842 92952 65812 27332 -30674 -57668 -30492 -15342
13943 -15342 4277 40279 57267 19093 -5232 -42448 -25111 -29046 -15391 20819 50671 32848
13931 32848 5596 1595 -11201 -13277 -13761 19715 -2984 -12060 21546 15553 -3371 1434 -21366
13918 -21366 -26475 -28595 -10883 -35333 -40093 -47059 -3926 -6052 -7504 -11529 -53312 -62527 -35999
13905 -35999 -36596 -32813 6092 5431 29174 29297 23951 16581 4330 -756 13971 -2892 -6704 45765
13891 45765 54931 48199 66766 54841 36657 8510 3431 12620 33867 21108 20881 18246 8447
13878 8447 -470 -55251 -72004 -50668 -28679 -5454 33171 66062 26105 63737 49750 -14045
13866 -14045 -11311 44595 40548 -34344 -37811 -2617 31886 703 46359 73508 66860 47900
13854 47900 54951 22676 -36259 -9628 5479 45122 31387 32688 69412 22609 -13700 36307
13842 36307 90283 79600 59649 71667 79443 98501 85933 83528 77889 41001 17018 2552
13830 2552 63666 148003 112660 39098 36049 82287 69964 89680 131395 122316 91499 76089
13818 76089 89639 39341 37079 108182 80239 45112 57701 63647 43971 8469 290 36062
13806 36062 6123 4362 -36221 -46946 -29186 10784 15015 -18691 7515 -15332 53323 81531
13794 81531 78147 99172 29309 -34814 -35330 -18140 -27763 -25233 35435 31839 53849 49048 75520
13781 75520 52119 12114 15867 1067 1382 9471 35944 66441 51660 -13040 10002 52032
13769 52032 53877 45957 22750 61339 132873 203042 185704 124621 63756 -6432 23645 38916
13757 38916 72595 51185 35094 35391 -17575 4947 57793 59431 49332 42619 2707 -8026
13745 -8026 3533 -5779 23357 2887 38519 36720 22640 27867 37945 -1444 -17219 7375
13733 7375 20102 -11660 5371 29064 -17044 -86767 -85385 -82894 -83099 -24867 47933 58681 49906
13720 49906 48435 23478 -9552 25531 48928 104189 102862 40171 -19665 -102592 -67080 -9798
13708 -9798 37295 29716 13299 42969 24314 6541 -5127 -15331 -25852 -13881 16457 1734
13696 1734 -30233 -36211 -14004 53508 47451 7910 13132 -44592 -75665 -8313 24540 12531
13684 12531 2783 2872 71993 94899 57083 31435 37998 75951 24692 23558 -2713 -65576 -76575
13671 -76575 13215 45839 -7836 -8074 -34682 -32440 17279 81931 143578 137627 103134 71453
13659 71453 53408 68363 27413 22840 49235 32715 4994 72920 104112 138025 115751 55890
13647 55890 25556 90045 63324 21719 38617 78780 98996 69460 -214 -25532 -53163 -23237
13635 -23237 -10809 -16459 -8842 12138 60031 46342 -6088 3953 24991 59927 51522 31896
13623 31896 12660 46078 72101 13885 25438 24262 -32220 -43776 13620 46056 73862 77184
13611 77184 78938 90955 88897 60016 -16 49255 80005 102454 108032 55123 56736 61740 38068
13598 38068 39855 40005 62636 71774 11845 29251 44758 64926 67415 66627 48288 48096 53582 73008
13584 73008 101467 82335 3768 3009 -8651 -23360 -2499 3171 40246 62990 17687 32365
13572 32365 35852 8205 -1725 -20763 -57976 -55486 -5709 -33995 -42260 -34405 13714 31109 28247
13559 28247 50746 33713 83673 62618 61571 119530 93438 36783 -14225 -73403 -10797 7085
13547 7085 -12319 68268 72416 72346 37415 28167 27479 18998 31561 25843 -24405 -10485 -16329 23141
13533 23141 57024 81092 109493 115030 125066 89420 62641 35907 23987 48708 33390 16296
13521 16296 3708 -262 -14589 -43568 10479 44427 36724 -36852 -25701 1360 -6883 73247
13509 73247 84914 77768 45842 85421 99561 46567 59403 84201 43944 53967 147834 209753
13497 209753 212698 214490 194263 154425 163488 122762 107589 104480 124790 154325 106547 28250
13485 28250 1931 -2610 40830 47571 31015 28329 54402 47692 29193 46267 67327 89085
13473 89085 111083 98487 107080 117771 137948 94926 83540 69754 103425 123458 136800 121915
13461 121915 79115 43211 37936 70662 48491 20559 32178 78909 27094 18460 75236 90034
13449 90034 107257 126389 101670 31424 20146 34162 34740 44212 81523 71894 54311 67709
13437 67709 105787 89278 92784 125029 146076 127316 132113 117697 81007 117285 111696 58196
13425 58196 62653 20574 -38956 -48090 433 5466 13031 -28163 -29918 -40627 -20775 25052 58676
13412 58676 62065 83537 101347 80869 53540 24416 13094 42394 95859 122305 104933 55214
13400 55214 51467 25209 -12406 -31272 -633 64533 48764 56537 21389 3830 13732 12074
13388 12074 33935 98720 122456 94054 46640 10411 -2443 -2769 42032 94581 152671 130093
13376 130093 57123 43801 94913 123466 86711 23927 55737 69114 62127 39052 7507 48903
13364 48903 74953 67226 29579 -1786 -1527 29440 56003 106074 60473 9266 47880 49234
13352 49234 95384 89206 53661 60283 66113 84679 38240 41858 57555 18533 -29070 -28512 -6366
13339 -6366 9459 15290 28289 73646 61793 55366 95531 93889 104139 163002 140453 158188
13327 158188 150920 114598 99443 77090 49483 50706 49542 91381 86793 123507 128658 142254
13315 142254 115154 74247 76505 95542 75152 39812 30028 72767 92384 97662 55703 66268
13303 66268 100927 140341 168398 131379 43675 43970 47324 102466 111772 98791 119313 100354
13291 100354 78944 53791 53481 -6356 -11087 -22666 -46563 -28531 13591 43621 52878 29133
13279 29133 66078 106169 46243 46276 24584 50484 54282 86050 112896 61997 10665 44832
13267 44832 40770 47285 80739 63181 104023 152363 167004 91423 99693 166533 132646 57086
13255 57086 13302 27857 38900 17223 -10067 40714 60238 123251 187422 109190 71131 91291
13243 91291 56138 103182 106182 107328 128180 138846 122382 81885 64055 77899 153267 181945
13231 181945 164031 133475 134686 170144 173760 187516 162975 155731 137103 190331 204664 202279
13219 202279 209514 205703 157294 127905 130656 179301 146495 169218 165692 194194 157445 98128
13207 98128 50634 43082 73276 106726 92826 75637 59574 67528 85399 73390 73345 94782 151907
13194 151907 232686 231067 206039 202102 123658 65270 63761 125173 152988 184855 179805 135939
13182 135939 82679 78990 85801 71508 101541 112684 87515 73822 94902 117721 106179 68775
13170 68775 75374 98011 98799 126794 143127 141398 185006 149805 107797 108831 142124 151071 144006
13157 144006 142180 117594 40711 44182 113356 136621 110150 101753 154671 136316 64125 64232
13145 64232 68393 76280 106018 97261 107431 103325 122916 114641 108036 69738 40786 106829 142606
13132 142606 116388 69006 84043 154100 172961 189354 176876 182600 198162 110670 36543 16226
13120 16226 68173 109052 117899 84378 114781 131798 121581 124895 125170 116439 97591 30222 -50027
13107 -50027 -6227 76480 158284 114966 56212 91128 79364 95902 128522 116696 154839 163146
13095 163146 128579 110810 88404 90701 84057 80356 128465 144654 144616 134065 93821 144098 191764
13082 191764 163111 131738 84934 75676 93931 118901 139674 138394 144778 135747 187586 196867
13070 196867 205540 177704 125145 98010 61435 125251 165221 175007 189716 187523 163217 165371
13058 165371 148619 107216 96040 122086 126655 111369 101823 131984 158662 177297 223789 242133
13046 242133 246539 194003 196891 202257 220976 232791 200675 196772 218555 215377 212586 186751 206698
13033 206698 187601 155130 113531 125029 177787 162602 205764 206510 182603 142067 76383 57066
13021 57066 60392 92693 91843 107417 159805 211914 202744 211177 209974 227752 227126 165083 153111
13008 153111 148130 136709 179566 248726 271141 268888 215703 118027 106760 151158 96124 64802
12996 64802 67001 108836 162155 208276 191686 188436 186549 167309 136250 130728 133587 127703 147884
12983 147884 147164 163308 159934 166424 143264 118708 94162 99396 98301 156809 193361 221444 196500
12970 196500 193486 198266 184233 148840 154974 92714 100253 141123 174491 206264 191604 210216
12958 210216 180775 105503 75551 136497 154429 151841 169526 172983 139905 130267 106747 146507
12946 146507 137135 122875 179296 131833 100604 144890 152824 157433 226182 226426 204619 201374 144831
12933 144831 239072 245289 180346 168523 243696 215605 145694 105358 162185 226525 203560 187097
12921 187097 175088 185406 186035 191812 203182 164967 172247 200319 215222 168041 189007 189870 198804
12908 198804 190251 207867 240902 250402 236194 240891 201558 165426 189988 239831 285411 295597
12896 295597 289111 293494 331353 332940 305767 226863 177045 165867 150785 145976 152896 197025
12884 197025 192380 172119 158258 161909 169032 238550 256315 273740 296148 245534 273775 295478
12872 295478 277251 352851 385289 360634 364134 351922 318596 307097 329765 348760 331919 288490
12860 288490 280370 279650 287040 270948 209460 206986 218512 243553 253024 253555 196479 161025 181003
12847 181003 175524 182355 168128 147660 195680 193180 186411 167413 145499 162514 220612 211051
12835 211051 242520 258138 292882 336726 294589 253697 246525 269819 303624 347264 332899 316929
12823 316929 338319 284698 237476 223269 215831 226091 240699 233105 257856 263867 236683 233153
12811 233153 233313 223528 196688 187515 235959 254130 264628 277446 221226 196369 216969 255548
12799 255548 267848 275851 215741 153065 140614 188857 219290 198463 225184 255187 299086 299744
12787 299744 279140 270838 278478 300213 289930 289902 334914 367290 341486 320932 320659 290097 292600
12774 292600 268248 277671 249632 187508 157573 179181 181214 147003 179579 202249 287168 321309
12762 321309 287934 260081 235861 207398 230784 281633 273260 262894 313531 287975 281603 249214
12750 249214 274455 271136 298716 305027 274904 275515 329253 348468 366142 356272 318181 365375
12738 365375 391192 425327 442500 445051 391413 347379 324399 348589 343275 312230 294604 347581
12726 347581 374009 359133 348464 331933 271782 323425 373522 393279 404899 369358 344160
12715 344160 326550 347399 358493 311973 247088 221991 251142 310928 371558 366557 322280 372426
12703 372426 447634 436127 400679 360579 320626 367730 398387 388990 360805 350470 359953 365000
12691 365000 328853 298840 327426 381335 374411 403416 370427 309182 277308 292139 351283 379356
12679 379356 387289 357309 316613 322084 345365 341252 308204 250261 266538 248256 249657 309232
12667 309232 327982 292302 362500 372246 358024 358865 384812 417190 403290 422872 447869 425965
12655 425965 376478 390378 417108 446897 447206 406566 399615 377889 364263 377073 399572 411130
12643 411130 409630 436707 488762 490898 470569 446359 406359 426709 495950 512114 461274 408182
12631 408182 421943 451878 410412 351492 375910 429223 466771 441815 446002 463912 429590 389483
12619 389483 401791 459811 491923 551885 574058 550051 470443 412124 403513 432458 441640 495269
12607 495269 509287 500676 504430 475644 395985 358459 367121 411951 432287 420632 377449 370544
12595 370544 383841 402002 411712 472388 506378 450846 445693 496232 504744 474637 471489 479841
12583 479841 498882 451164 482291 523561 516872 476653 468256 494085 448627 445846 472374 510375
12571 510375 495542 556521 572655 533552 523994 542540 567829 531547 512186 533215 551529 541342
12559 541342 448806 392971 439263 472064 481624 469467 487962 485028 456086 482434 490308 490435
12547 490435 437492 503784 498159 462520 491221 513054 472833 507588 536264 556896 561187 577611
12535 577611 590739 591232 632816 626855 590279 590688 583448 592087 647803 648711 610196 576240 566726
12522 566726 562213 580414 622485 653633 610340 596786 565715 541880 544458 577883 618724 580792
12510 580792 601265 633174 634612 599904 556149 596945 661630 668819 606649 532099 525852 578838
12498 578838 692176 706514 692094 695201 739113 715002 667427 673678 657997 630365 615172 630257
12486 630257 650375 623358 641428 693863 715484 694653 687395 714924 666577 628312 650744 661478
12474 661478 672151 685739 671093 658172 698127 728252 749090 739577 703599 688390 651033 676193
12462 676193 728448 768887 782892 736770 738969 712862 663982 675651 726365 719377 682637 622540
12450 622540 585794 646652 661358 697551 722241 677678 667053 641289 622412 718747 775562
12439 775562 811516 766530 729919 779406 820110 785944 776358 812839 808327 745761 711036 722584
12427 722584 734952 741295 723596 741233 764639 766005 727071 678523 682454 696784 669778 677021
12415 677021 709460 739087 790552 830086 798031 759375 757914 788300 830856 817789 852734 848784
12403 848784 781900 752380 757847 783225 807204 837336 916201 956346 971614 921342 860666 907725
12391 907725 936066 910900 893373 881487 858228 876444 889472 897748 922427 921893 962322 1011108
12379 1011108 982239 932038 865598 913764 930718 968523 999775 978680 966841 964759 983509
12368 983509 960002 976443 997382 1030409 1054780 1011338 979544 980717 980662 976183 960831 908191
12356 908191 897297 915198 894261 892884 950242 963557 981922 981997 957025 964085 1011340 1065064
12344 1065064 1064282 1073198 1048971 1069159 1084229 1024196 1037326 1073334 1083849 1074518 1055676 996382
12332 996382 970438 941538 993553 1033322 1030648 1081955 1104983 1152632 1186476 1105690 1080854 1121248
12320 1121248 1182201 1188059 1143168 1140889 1167730 1184204 1166121 1147262 1155770 1192716 1212317 1227671
12308 1227671 1227376 1230902 1188448 1198169 1258507 1246667 1228348 1183199 1159857 1216366 1272864 1257241
12296 1257241 1264181 1320899 1335529 1316074 1313466 1310977 1298048 1297040 1292511 1312792 1317169 1281115
12284 1281115 1258258 1299034 1339451 1353613 1350990 1334177 1355096 1385670 1365280 1334419 1360423
12273 1360423 1396630 1423107 1424222 1373595 1374724 1406026 1442436 1493958 1512335 1485198 1493250 1497592
12261 1497592 1494396 1531478 1573437 1567785 1597286 1548233 1512068 1525117 1491853 1508464 1539201 1506275
12249 1506275 1511275 1539930 1529338 1565696 1600180 1607166 1564141 1563281 1594121 1594961 1624481 1622331 1574665
12236 1574665 1565539 1589956 1611937 1655345 1669535 1733817 1704919 1704967 1689233 1619962 1629765 1651038
12224 1651038 1699998 1729764 1770430 1812675 1838887 1816772 1792106 1764891 1728296 1729929 1807712
12213 1807712 1857269 1842587 1835009 1855545 1881139 1909872 1972683 2002978 2053398 2058953 2077236 2012407
12201 2012407 1990197 2074713 2164247 2164554 2160589 2189990 2241520 2255156 2292797 2310330 2302468 2264963
12189 2264963 2274126 2310898 2354841 2362032 2404418 2425003 2410474 2492781 2506086 2457029 2401135 2434823
12177 2434823 2432106 2454853 2498537 2523771 2544416 2550232 2531541 2549776 2607236 2670047 2700123 2752469
12165 2752469 2766247 2776169 2816693 2843528 2893807 2925819 2904757 2839754 2785877 2797344 2806158 2858682
12153 2858682 2871666 2795229 2813963 2886910 2880694 2890886 2843979 2857441 2879096 2845553 2843531 2820878
12141 2820878 2855495 2892266 2887819 2852647 2832644 2835092 2804621 2852082 2901844 2913495 2943877 2968823
12129 2968823 2978353 2932002 2908545 2884793 2859604 2903041 2965052 2975009 2939301 2897921 2876560 2912830
12117 2912830 2991618 3082615 3138533 3019111 2934075 2899693 2872857 2888063 2863599 2834615 2847391
12106 2847391 2856165 2871468 2892279 2908875 2923433 2962506 2946002 2975640 2980873 2948974 2884031 2935049
12094 2935049 2987789 2988937 2910916 2829823 2859741 2929866 2974793 2951894 2905502 2916984 2944760
12083 2944760 2980123 2990357 2980246 2954504 2957706 2936665 2872381 2887655 2931839 3004736 2992636
12072 2992636 2987480 3030378 3075825 3062112 3050320 3070541 3101848 3094203 3129504 3136724 3146951 3131214
12060 3131214 3124629 3150842 3134341 3130671 3138048 3162893 3170508 3145036 3197426 3244029 3278727 3287643
12048 3287643 3309349 3282984 3273221 3273846 3284544 3262882 3258438 3203302 3229605 3301638 3321877 3324822
12036 3324822 3250698 3295191 3339713 3338897 3355419 3373181 3394595 3417555 3473435 3504731 3554845 3515251
12024 3515251 3486246 3513539 3550691 3563998 3585543 3605777 3599544 3635552 3651732 3610080 3603737 3630237
12012 3630237 3594849 3566392 3582436 3577546 3635546 3646811 3612351 3646526 3693334 3686915 3716771 3729006
12000 3729006 3726799 3686742 3625629 3663772 3683575 3712821 3733678 3697670 3654305 3679002 3766094
11989 3766094 3793984 3835042 3823531 3820471 3831752 3810822 3813088 3813822 3781724 3770855 3757052 3798392
11977 3798392 3806721 3795280 3790632 3853728 3868695 3848767 3874776 3883562 3878018 3876795 3892528 3883941
11965 3883941 3832519 3765781 3757471 3781856 3841991 3921173 3936722 3854878 3830096 3835702 3890582 3955208
11953 3955208 3953067 3940572 3951523 3949933 3888985 3888204 3904641 3901472 3854606 3875423 3872760 3924278
11941 3924278 3946713 3976912 3953216 3974599 3950322 3942889 3941571 3879012 3886104 3868967 3883392 3893882
11929 3893882 3904976 3869775 3846797 3825240 3827034 3840021 3864217 3893157 3890778 3903094 3902335 3907973
11917 3907973 3912688 3916542 3903827 3858420 3808105 3854847 3864033 3869826 3890230 3916930 3938323 3903963
11905 3903963 3902676 3910570 3939559 3922248 3976016 3931852 3924538 3910609 3928751 3957157 4011385 4022208
11893 4022208 3982581 3906366 3878155 3904120 3938677 3981566 4085292 4136016 4082973 4052632 4012829
11882 4012829 3996573 4065917 4095510 4118856 4107170 4097750 4104381 4119136 4110218 4053911 4042751 4047267
11870 4047267 4017492 4030658 4071903 4038701 4044480 4077844 4103846 4101207 4054839 4016306 4081036 4072384
11858 4072384 4067099 4112137 4139713 4149730 4128725 4113306 4051529 4074882 4082483 4097538 4097554 4026545
11846 4026545 4007963 4007400 4005750 4051612 4157084 4149857 4170546 4179736 4205977 4250960 4250497 4235567
11834 4235567 4251167 4235773 4256802 4304724 4307082 4313260 4298938 4295717 4295291 4297405 4326820 4409765
11822 4409765 4433159 4464431 4512243 4552479 4573905 4576525 4652172 4706462 4736960 4732865 4765583 4806238
11810 4806238 4830500 4959431 5022188 5099511 5193108 5279303 5357421 5429708 5565310 5718161 5823491
11799 5823491 5944577 6101228 6275899 6446588 6614517 6814218 7125959 7430685 7683812
11790 7683812 7959546 8418344 8996195 9559256 10215915 10929500 11746532 12685779 13756020
11781 13756020 15103365 16706357 18552903 20663063 23127509 25952547 29128532 32625591
11773 32625591 36335551 40146574 43888238 47303715 50248541 52690194 54485510 55833318
11765 55833318 56743455 57429353 58030939 58703648 59640442 60836023 62325813 64114297 66028994
11756 66028994 67930337 69654733 71166202 72361135 73047610 73376150 73537929 73637317 73780935
11747 73780935 74007851 74463751 75010541 75757183 76721708 77994356 79638565 81689666 84170383
11738 84170383 86955339 89958272 93061438 96117956 99033562 101685774 104020190 106024145
11730 106024145 107607031 108830970 109751143 110543820 111250366 111869967 112490701 113021810 113237772
11721 113237772 112965396 112042162 110517719 108546864 106188805 103475875 100721761 97990307
11713 97990307 95417782 93100834 90986480 89243393 87811882 86666586 85761774 84989777
11705 84989777 84357884 83921338 83730862 83752933 83997409 84188668 84237231 83972160 83267033 82163535
11695 82163535 80693265 79038264 77306624 75668743 74333051 73272673 72472853 71983679
11687 71983679 71708264 71511760 71108624 70300322 68987803 66990986 64292261 61010195 57332967
11678 57332967 53422563 49449718 45561132 41892541 38513519 35442891 32673796 30189229
11670 30189229 28001830 26012841 24210861 22570127 21058131 19680751 18463175 17246193
11662 17246193 16221417 15219385 14280617 13472369 12675079 11917275 11293923 10700275 10189921
11653 10189921 9680371 9249849 8896230 8576237 8249433 7918768 7528980 7179966 6817376
11644 6817376 6501387 6249959 6022307 5790757 5569371 5421655 5252124 5086789 4926149
11635 4926149 4774806 4617693 4469092 4376518 4244528 4155338 4062768 3994176 3937014 3873463
11625 3873463 3838836 3774113 3703911 3647106 3573973 3456549 3385470 3325544 3251558 3172256 3166926
11614 3166926 3169883 3145944 3102495 3011998 2920416 2856968 2822993 2816656 2811900 2766075 2784129 2735831
11602 2735831 2703641 2687526 2686276 2698353 2698828 2648667 2546429 2617871 2666536 2641203 2581963 2586729
11590 2586729 2537895 2485384 2462317 2442079 2407736 2355207 2337644 2353773 2390402 2419462 2404789
11579 2404789 2408593 2398838 2370992 2366469 2341084 2313878 2309345 2336275 2313650 2258582 2253022 2263940
11567 2263940 2171471 2120397 2124856 2190063 2190889 2171893 2129647 2126484 2087734 2012839 2016192 2004910
11555 2004910 1978193 1963618 1987333 1982090 1956848 1946692 1904910 1862664 1852726 1815352 1767061 1742693
11543 1742693 1779457 1709902 1657004 1644251 1616137 1637828 1654725 1627886 1638908 1636460 1685023
11532 1685023 1656911 1623732 1672902 1725756 1728384 1667502 1623036 1569252 1548652 1587875 1593142 1546566
11520 1546566 1501791 1454168 1474760 1452868 1476716 1437711 1403469 1403955 1416268 1388423 1415126 1409466
11508 1409466 1421193 1454887 1418608 1349661 1314038 1305294 1273535 1237769 1222260 1221079 1239305 1209081
11496 1209081 1210665 1226949 1262820 1298136 1283315 1266462 1235424 1219515 1255019 1339470 1360441
11485 1360441 1350104 1374767 1298737 1205603 1144730 1092909 1096965 1193549 1180976 1109263 1120420
11474 1120420 1118946 1154573 1170119 1169973 1133802 1089496 1129782 1105636 1107843 1121199 1120318 1129894 1117786
11461 1117786 1095906 1065745 1075411 1109101 1118778 1055799 1083835 1083511 1087068 1080911 1072069 1090608 1103938
11448 1103938 1042542 1034504 1063789 1073874 1055430 1017727 980910 984266 955564 929410 919933 985685
11436 985685 979340 999409 979601 1023662 998078 977234 916150 856498 843331 884831 911851 922045
11424 922045 880272 860134 887796 968597 956059 887771 888298 909750 978307 951532 954471 949221
11412 949221 953172 948724 902157 889594 920233 861855 860575 944960 938766 887810 883151 900292
11400 900292 904960 901370 900890 889355 880653 822200 846996 893330 880957 848424 817625 809602 841609
11387 841609 843924 808930 791952 790671 784792 832968 864900 871337 792220 779362 769264 788210
11375 788210 766449 771791 745435 717121 688022 687346 710137 686705 666697 682608 708097 688440
11363 688440 691362 682279 664794 655215 665921 662528 709300 748935 779009 837606 858668 822825
11351 822825 816184 795375 718572 657270 673508 743950 730555 716930 696696 692139 729765 758027
11339 758027 781807 823025 824689 866605 882962 863109 824401 879686 894967 914248 901069 865529
11327 865529 921223 960227 962424 917606 902007 926092 907561 872589 910935 1003754 1047619 1046244
11315 1046244 1017443 1023053 1008321 970651 1001401 1034394 1043092 1005273 983465 1022105 1031136 1050371
11303 1050371 1096976 1097588 1137269 1185559 1267102 1277172 1334454 1336026 1338002 1357588 1426912 1423228
11291 1423228 1435881 1483439 1480331 1486893 1478986 1429131 1370961 1383214 1378754 1402746 1456642 1448622
11279 1448622 1424920 1382733 1427206 1461943 1392283 1357638 1349128 1287648 1217134 1211144 1215677 1208188
11267 1208188 1218405 1222058 1282516 1300580 1322467 1334310 1338572 1361116 1407328 1492548 1548745 1562206
11255 1562206 1591196 1573045 1548626 1581572 1637550 1692167 1690601 1655183 1626063 1640810 1542626
11244 1542626 1459621 1422852 1404330 1385673 1370011 1351009 1304804 1238358 1244603 1265728 1218020
11233 1218020 1182894 1139047 1071935 1007758 1013124 1013966 1022480 997715 994686 971845 912863 871741
11221 871741 855000 870697 924164 956384 935127 949000 1011894 975891 948232 944720 961551 957840
11209 957840 929096 925124 948089 979907 978323 901579 845664 869340 896349 927836 940917 942533
11197 942533 921478 867632 805515 784383 796907 835295 779186 717538 700759 659576 588494
11186 588494 507545 503559 504353 505781 554199 601170 608349 567712 549035 556166 546714 554490 603871
11173 603871 601433 607650 624288 596129 610578 662893 712985 741356 695659 662241 636293 601888
11161 601888 575408 609017 556738 568810 627350 618442 590828 540080 543351 591474 642496 665248
11149 665248 648408 597672 550814 548854 561402 570058 587510 628054 629028 612369 582125 572089
11137 572089 592343 618484 607145 555778 589440 605290 624085 643785 614379 552542 540810
11126 540810 627219 651536 605688 588737 628126 631778 609846 631603 646934 682792 635480 573354
11114 573354 587284 586130 571540 549939 530402 547089 545268 583153 638334 665296 667545 666833
11102 666833 660238 624434 611160 627269 648997 689332 749381 768365 776347 749208 672871 616150
11090 616150 635518 663984 668008 672704 703157 732509 748839 690800 659254 643852 639506 586395
11078 586395 588833 615370 573840 534551 567952 620884 662962 618820 605970 587274 633047 668966
11066 668966 588366 584010 576584 605293 649985 637377 611680 598877 560907 596657 623970 582510
11054 582510 619234 637691 580334 532743 561863 612444 642352 633952 717477 810749 787971 790652
11042 790652 837979 813505 822609 903989 908740 930470 1007827 1075532 1085580 1068621 1072220 1086316
11030 1086316 1031164 957166 909905 886714 929919 1034988 1108710 1203766 1226152 1219005 1150112
11019 1150112 1146256 1190508 1220952 1217509 1257478 1233763 1223229 1159178 1216247 1277905 1267463 1246352
11007 1246352 1213412 1131189 1082818 1076383 1085787 1056950 1062400 1101821 1096417 1090633 1096648 1062394
10995 1062394 1051556 1006953 1020433 1002502 946440 936900 959947 974826 966788 955626 970337 987028
10983 987028 1009527 1016091 1008284 988997 973797 1028519 1075782 1086644 1122518 1153241 1159155 1194890
10971 1194890 1247543 1243194 1223193 1202733 1181902 1189218 1177039 1182649 1269841 1315847 1273866 1279921
10959 1279921 1325177 1372618 1377223 1406141 1392999 1438315 1566313 1630135 1681459 1705500 1729600
10948 1729600 1715155 1682988 1730971 1793964 1810033 1816703 1865580 1947217 2044294 2115951 2184564
10937 2184564 2284760 2300602 2350859 2439008 2477392 2509519 2515109 2593297 2681665 2745638 2810032
10926 2810032 2875836 2982149 3123044 3312175 3504787 3635278 3774617 3962814 4116274 4313246
10916 4313246 4511627 4740893 5003387 5340618 5675133 6021817 6442507 6951610 7556504
10907 7556504 8199839 8963179 9806118 10723208 11809958 13066778 14524273 16196639 18135190
10898 18135190 20560804 23362586 26557632 30228729 34338511 38880357 43730059 48783368
10890 48783368 53843348 58746395 63291745 67309572 70626180 73035687 74472745 74915762
10882 74915762 74394588 73071937 71070007 68474063 65455296 62252988 59027874 56014400
10874 56014400 53327035 50928077 48863338 47220627 45984373 45108294 44632705 44509579
10866 44509579 44736905 45254464 46151592 47465420 49232864 51557172 54501087 58077528
10858 58077528 62469289 67611750 73471386 79968893 87004873 94541032 102372821 110242080
10850 110242080 117884604 125028223 131280531 136416934 140178023 142486438 143189603 142259057
10842 142259057 139822574 136071420 131291968 125703359 119505453 112944339 106301363 99722621
10834 99722621 93361006 87426246 81991005 77035323 72625090 68643234 65234170 62219438
10826 62219438 59619161 57419903 55569006 54094983 52997128 52328426 52224536 52575931
10818 52575931 53460027 54951136 56981414 59667256 62898874 66559338 70555147 74663502
10810 74663502 78658907 82298725 85384608 87758986 89256752 89681131 88997386 87205612
10802 87205612 84418001 80785094 76496434 71729208 66641674 61564112 56709148 52082847
10794 52082847 47748319 43776226 40268452 37140627 34283948 31650067 29333238 27242198
10786 27242198 25317014 23529404 21904885 20337222 18872795 17554975 16354683 15248200
10778 15248200 14230882 13302682 12508783 11720420 10959974 10339806 9770809 9196837 8646787
10769 8646787 8149240 7706215 7334959 6936364 6627750 6333564 6063092 5848005 5512402
10760 5512402 5205088 4974798 4742696 4546554 4406235 4243656 4093191 3877610 3761174
10751 3761174 3660483 3533982 3371048 3288697 3225856 3108734 2990966 2925487 2875581 2797354
10741 2797354 2691235 2623140 2607471 2579857 2489958 2376390 2285383 2217392 2226714 2237001 2214855
10730 2214855 2212048 2154789 2123337 2092469 2086853 2067344 2056450 1988180 1934507 1936080 1907626 1837514
10718 1837514 1805903 1824099 1775083 1738442 1747024 1733728 1724282 1712751 1667668 1624234 1537646 1595399
10706 1595399 1629229 1624326 1576275 1506567 1478566 1477278 1485147 1451239 1402412 1402828 1398546 1435432
10694 1435432 1441858 1474307 1431822 1401415 1346733 1334493 1321153 1320903 1335882 1420413 1399021 1379285
10682 1379285 1419004 1383905 1352892 1295065 1216711 1169566 1173372 1255503 1310701 1276867 1202118
10671 1202118 1188309 1225550 1232721 1176908 1168682 1173148 1187429 1177074 1205742 1215558 1231183 1243731
10659 1243731 1225919 1225425 1217512 1245938 1259184 1279451 1314683 1316470 1331700 1314911 1271003 1271876
10647 1271876 1244073 1211093 1200639 1174617 1153421 1191897 1218286 1241866 1305013 1378047 1513365
10636 1513365 1664004 1748982 1866878 2052819 2263436 2442891 2591212 2668465 2798853 2968169
10626 2968169 3227021 3677326 4307415 5105810 6193038 7678708 9732585 12464423 15908954
10617 15908954 19997063 24044150 26934382 28062290 27669410 26640636 25964454 26186309
10609 26186309 27621125 30578958 35414423 42323229 50746990 58855370 63673477 63533311
10601 63533311 59781670 55152786 51616680 50056045 50765321 54076503 60252930 69212965
10593 69212965 79889160 89164624 92933958 89355481 80936815 71862452 64475914 59495584
10585 59495584 57024427 56950400 59193396 63558262 68940589 72970643 72958923 68118929 60504399
10576 60504399 52975837 46836723 42408037 39567980 38128189 37831394 38416855 39228911
10568 39228911 39287605 37855144 34687485 30482156 26329589 22767498 19784040 17351037
10560 17351037 15382193 13816109 12493880 11353155 10439091 9656096 8994207 8295314 7640556
10551 7640556 7120451 6595577 6069622 5601390 5196910 4766094 4361702 4036331 3794964
10542 3794964 3557356 3344965 3172698 3013570 2818576 2687615 2560509 2382270 2243975
10533 2243975 2082093 1971108 1885966 1785053 1722807 1651666 1586265 1558370 1496554 1426022 1305965
10522 1305965 1232383 1259226 1275432 1246096 1165590 1131126 1136881 1073004 1024385 957584 928093
10511 928093 962834 986877 1022711 977332 898984 909003 894013 877073 864738 851413 840847
10500 840847 827077 885024 908300 896035 899678 903841 863554 843286 875403 932109 905032 888358
10488 888358 919058 868520 849645 869381 951045 951777 989030 1057030 1093854 1115327 1079965 998600
10476 998600 979197 1005526 1020789 1024551 1068562 1055792 1023138 1006877 984742 944638 952323 936887
10464 936887 860583 915005 969296 989612 958681 895143 863325 875847 881602 927054 937006 949438
10452 949438 970191 967630 957331 996882 1041247 1093959 1144557 1124924 1154773 1180064 1215778 1238066
10440 1238066 1233578 1219227 1236106 1284236 1291694 1310859 1295339 1240748 1250806 1230890 1168763 1141219
10428 1141219 1048898 1054911 1100184 1055189 959741 933859 944990 928280 897792 873324 867298 868874
10416 868874 865305 861099 859355 821273 786053 774101 767903 717254 667824 689114 708868 729087
10404 729087 748838 756476 803735 832339 853715 859368 945528 936715 882023 841963 888758 937555
10392 937555 950438 881866 845841 773106 793738 840805 809825 812183 787936 734007 617442
10381 617442 608646 610900 542252 537384 545251 522198 508843 506505 434040 449325 468140 411812
10369 411812 454686 516724 512512 468130 447240 448526 370335 398453 451587 450637 405300 357199
10357 357199 365393 357878 374919 341712 350403 351086 325307 348742 344084 372824 365642 392778 466059
10344 466059 461548 347440 280881 288591 325155 351624 359529 397262 394112 370052 360691 368261
10332 368261 395111 394397 371777 345926 340737 346688 313561 310157 284495 273051 312696 302996 353923
10319 353923 396666 386228 362190 361860 404413 404786 333951 311591 328681 293354 246158 277680
10307 277680 341843 309970 307559 318481 272395 244205 278058 316253 294457 279072 278795 238146
10295 238146 232008 251632 306424 394097 383662 375920 385924 382334 405239 406153 420759 397663
10283 397663 329257 274087 289300 323349 382115 411711 446100 436784 434095 439025 407386 345726
10271 345726 319606 329359 317875 318236 317539 309478 300886 276040 285470 331959 322365 334534 341721
10258 341721 316319 324247 328711 306601 361209 396122 366949 340005 390460 423354 410587 401773
10246 401773 341197 278047 292123 299998 273515 299074 330280 327192 330479 330231 309869 276843
10234 276843 306824 320752 275621 247046 296846 294634 276005 267280 272991 281665 269961 287303
10222 287303 360425 348842 350791 307857 327879 262795 218723 233760 293166 308314 317633 271334
10210 271334 231609 254914 251779 253846 258281 236779 213567 227617 198508 211131 267250 250690
10198 250690 267874 245749 235693 281533 248266 246112 271099 283434 332338 329642 271417 241559
10186 241559 229411 301936 354016 369558 382345 379063 386958 375019 372485 343613 354510 352137
10174 352137 312444 310988 362561 430125 514498 511138 494882 583415 597074 556007 507110 437482
10162 437482 394036 437778 453602 512322 579988 658925 716529 756824 751719 733466 633326
10151 633326 553903 545839 506751 515538 537016 508360 559503 589113 603914 566521 537551 480432
10139 480432 437668 426448 459545 488575 501793 494909 469538 459821 424315 405614 417677 404750
10127 404750 395696 352903 332270 345017 324553 256544 213414 242289 198215 190934 232789 258225
10115 258225 244779 254111 268704 277281 276937 300995 299170 266103 204635 222463 246365 253801 261584
10102 261584 256514 256520 280754 247614 245851 240436 255782 252986 241957 218333 191669 147308 188264
10089 188264 237251 278728 320697 311161 324545 328970 324347 308098 312885 301223 289178 258902
10077 258902 254389 243156 211956 218740 227761 247613 232168 224217 227540 234159 243916 205840 213948
10064 213948 205253 235953 272859 248085 198404 227013 245423 185946 127459 78448 117651 164567
10052 164567 145151 150502 188024 143584 146715 160099 167895 132054 148529 160454 170349 145018
10040 145018 136875 176296 195002 223585 214178 147700 163791 150295 136828 142541 100380 93491
10028 93491 133776 128652 119509 123255 75195 93165 166454 204959 190023 124948 163499 216649
10016 216649 261407 247353 170883 135321 99077 85464 133713 113974 102796 123494 146603
10005 146603 170620 196344 178593 164809 188893 194325 205285 225831 214948 196644 138220 141409
9993 141409 183735 234960 259533 273070 291938 290067 235009 182509 188717 237160 179539 157927
9981 157927 220396 231533 212630 214003 261603 267112 227968 234508 287176 249152 263950 264797 212388
9968 212388 160132 136662 151767 151479 140200 149238 137457 147744 119330 135818 206543 284100
9956 284100 277283 257611 217055 183740 181890 172228 189468 144379 136511 130019 177520 137518 120765
9943 120765 180517 213817 249634 279785 260082 220269 210940 232709 212605 239304 277285 327300
9931 327300 337664 331602 395644 504619 502690 422111 296280 275443 291647 312659 302415 273239
9919 273239 327768 321217 208688 176053 187090 241948 322498 353990 312211 312207 250453 262668
9907 262668 265276 262995 310747 332499 345207 376014 349071 303210 278499 296830 304386 306874
9895 306874 306378 276987 267240 286936 273226 327884 326842 311853 282199 284710 337582 361833 413910
9882 413910 376352 343613 415506 496449 543073 523787 504027 454787 422190 485594 511062 463432
9870 463432 436552 506977 498826 529584 557484 541679 556034 527981 446819 435350 421361 418194
9858 418194 400614 385647 390729 410491 409207 375815 393553 378002 424017 468054 495471 532924
9846 532924 516133 518265 584698 552169 537469 554643 569489 601950 598079 607922 651301 637960
9834 637960 634110 623359 585801 516928 530119 538499 590014 549813 530906 499384 454597 428698
9822 428698 393027 338855 395047 489487 507935 433300 437862 407890 356154 376451 401531 446172
9810 446172 494891 480116 491962 516980 544407 569656 548707 558189 582066 548028 549780 557363
9798 557363 511482 459804 441144 435441 468163 423558 414604 405129 376831 309858 333398 355143
9786 355143 342549 347405 313093 286660 285750 261202 275392 246884 281045 263931 302706 304611
9774 304611 343584 355325 307700 249733 256195 292864 331643 355006 356107 330388 299393 330571
9762 330571 342083 346700 353071 409930 384267 321066 284684 269714 243782 251969 252173 224806 205316
9749 205316 173635 149172 209326 262577 258985 229623 215643 235790 246146 181771 193312 229370
9737 229370 264080 294277 296752 265172 301668 302139 239591 221450 274330 294451 277785 263293
9725 263293 332406 409223 397949 381853 353047 307363 287427 318190 307157 295184 295243 322931
9713 322931 300968 340543 323440 290920 229200 212677 283594 326125 373159 411437 388508 359182
9701 359182 351680 325093 284316 249976 252248 301801 329323 348820 356373 339433 345049 341375 323769
9688 323769 301460 232953 171823 219236 249992 265593 363303 470539 427185 382491 386094 382865
9676 382865 349615 305214 383458 404081 402687 367311 351617 387457 407168 433816 430572 424041
9664 424041 433388 442188 437036 392665 368646 341941 393385 413973 463878 627885 816227 917068
9652 917068 955928 877395 760542 669167 620304 605264 591042 626659 638554 639265 633163 583361
9640 583361 579563 632604 637716 623637 617865 590058 667186 727423 704966 632091 635563 621075
9628 621075 637021 634783 609912 600624 631010 611792 636303 667237 668650 656612 655185 694135
9616 694135 684682 735775 726462 640738 604532 648798 687435 662783 642544 633355 641741 692617
9604 692617 704895 721032 777942 822692 879913 888665 881652 892874 898106 924343 1024833 1065335
9592 1065335 1064053 1093623 1095538 1084212 1007794 1009931 1030271 1099275 1135102 1119958 1074443 1077717
9580 1077717 1120143 1079549 1108708 1087113 1094262 1073611 1034327 1057068 1126943 1133527 1163773 1139460
9568 1139460 1172140 1210188 1269613 1245468 1252389 1322289 1359096 1384617 1449028 1454347 1480622 1514649
9556 1514649 1569676 1610129 1603523 1608420 1645332 1746952 1798481 1869982 1893238 1915528 1929895 1959000
9544 1959000 1972983 2060345 2146557 2157759 2167200 2183835 2265329 2345583 2476683 2577361 2634069
9533 2634069 2788312 2968540 3166040 3339846 3520867 3690787 3926733 4202610 4525744 4899401
9523 4899401 5318307 5802573 6321086 6936367 7642177 8478741 9433669 10589578 12009630
9514 12009630 13556172 15303511 17226900 19190374 21197720 23004496 24414136 25354611
9506 25354611 25705665 25508607 24886063 24029604 23055811 22156880 21296946 20624349 20230200
9497 20230200 19980986 19914762 20085884 20418201 20933241 21526142 22292457 23255234 24321267
9488 24321267 25440541 26600413 27820959 29175748 30676542 32333765 34219150 36187011
9480 36187011 38188602 40412335 42917946 45876106 49279739 53082164 57063233 60984964
9472 60984964 64448915 67207103 69360918 70975786 72071401 72746856 72900758 72488200 71399083
9463 71399083 69648756 67422041 65022903 62728350 60712989 59018458 57546398 56268073
9455 56268073 55228550 54553475 54216774 54314221 54640262 55017962 55420030 55992278 56949397
9446 56949397 58611422 61019447 64174538 67918942 72059502 76260032 80056026 83253130
9438 83253130 85722852 87627635 89110043 90179720 90907637 91612849 92402646 93262140 94057887
9429 94057887 94532787 94488871 93690813 91981451 89333010 86054122 82320111 78447522 74793855
9420 74793855 71385513 68399864 65917450 63901460 62094154 60339656 58636407 57179036
9412 57179036 56010595 55244970 54913336 54936494 55238909 55959630 57096508 58592097 60377260
9403 60377260 62412621 64617001 66606063 68292563 69632362 70608805 71280392 71607424 71450775
9394 71450775 70561735 69001308 66814621 64153498 61300081 58367198 55525163 52895456
9386 52895456 50486653 48304375 46242517 44158636 42140071 40158580 38214587 36424688
9378 36424688 34699954 33035406 31436909 29847626 28390831 27089935 25885076 24813097
9370 24813097 23842180 23153117 22662792 22398312 22349817 22447655 22732767 23253432 23869741 24617907
9360 24617907 25393279 26019558 26335600 26287676 25853889 24944425 23663766 22073130 20442852
9351 20442852 18823267 17364009 16004504 14789554 13748221 12759750 11908236 11143141 10416428
9342 10416428 9783982 9205390 8677182 8157423 7677707 7247828 6866084 6481977 6156425
9333 6156425 5899202 5616000 5305356 5019586 4829998 4619631 4401518 4189398 4043725 3940618
9323 3940618 3822286 3643517 3521844 3463654 3371976 3283032 3219618 3123344 2957772 2919256 2906277
9312 2906277 2873887 2774500 2627242 2508721 2411551 2378334 2375754 2304196 2194456 2092628 2054631
9301 2054631 2048144 2079795 2047243 1958550 1930129 1900713 1908522 1907040 1869050 1820169 1783770 1785523
9289 1785523 1802463 1794756 1749650 1744112 1770146 1766255 1745382 1751653 1771566 1712570 1693147 1718415
9277 1718415 1706926 1632784 1656253 1640579 1593777 1580357 1573338 1515266 1411905 1356356 1343146
9266 1343146 1350995 1318812 1283191 1343093 1422352 1421489 1353261 1315670 1351720 1382864 1328492 1331821
9254 1331821 1335814 1310171 1316290 1301427 1371130 1316159 1266871 1240074 1244907 1286124 1334774 1314174
9242 1314174 1305122 1278542 1267495 1263531 1263848 1231185 1225433 1235173 1236505 1208129 1188383 1239811 1205855
9229 1205855 1258041 1254843 1210850 1168160 1117545 1147473 1221627 1250160 1219949 1197539 1144125 1117639
9217 1117639 1105185 1127812 1112942 1081089 1072035 1077663 1038822 1053369 1033518 992014 984216 1034209
9205 1034209 992431 926215 936637 895317 853037 861166 813142 797507 827952 832214 793028 752891
9193 752891 753584 794725 781593 785192 739059 720503 689381 744867 774912 764618 755973 764271 758323
9180 758323 729570 758011 797045 786174 848805 847720 784936 727428 771116 786527 785653 782683
9168 782683 819411 892321 866175 805394 773596 756898 737424 780723 786704 818529 809444 791065
9156 791065 835248 781313 697117 724681 722304 739471 800786 749506 761657 782699 790019 823266
9144 823266 875746 850597 827331 769007 755603 721531 707589 678950 675324 693176 685195 711133
9132 711133 728686 739684 724430 709358 716317 728382 699989 700963 707253 708458 746464 743575 761906
9119 761906 766727 734419 692988 740930 785022 753585 689688 668715 666745 610681 575221 581344
9107 581344 669977 707575 692279 629475 620969 653698 702079 706713 673520 674620 692770 702687
9095 702687 708634 632701 595142 646192 690416 679490 679661 685567 668809 662549 719454 692007 653136
9082 653136 617316 654615 674439 712664 694314 636060 610491 614330 636953 641387 665118 674737
9070 674737 729580 759955 742998 760718 753897 731124 748321 826216 887034 835042 823766 878510
9058 878510 912951 926974 925889 879322 895922 926129 881479 867630 820698 787567 736894 723409
9046 723409 723556 748840 763690 798172 785569 760522 703525 698746 733807 780554 821602 812696
9034 812696 814072 837969 870880 929007 943362 961985 961038 922911 940776 986083 998584 1003587
$$ [...]
##END NTUPLES=NMR SPECTRUM
##END=
