##TITLE=Analysis number 327300
Compound Code mo 00116
Project Code adrs
Chemist Name prosynth
##JCAMPDX= 6.0         $$ Bruker NMR JCAMP-DX V2.0
##DATA TYPE= NMR SPECTRUM
##DATA CLASS= NTUPLES
##ORIGIN= Bruker BioSpin GmbH
##OWNER= nmr
$$ XWIN-NMR		Version 3.5
$$ Tue Mar 20 11:45:06 2007 GMT Standard Time (UT+0h)  MAYBRIDGE\nmr@NMR_250MHZ
##.OBSERVE FREQUENCY= 250.131544655141
##.OBSERVE NUCLEUS= ^1H
##.ACQUISITION MODE= SIMULTANEOUS (DQD)
##.ACQUISITION SCHEME= undefined
##.AVERAGES= 16
##.DIGITISER RES= 18
##SPECTROMETER/DATA SYSTEM= dpx250
##.PULSE SEQUENCE= zg30
##.SOLVENT NAME= CDCl3
##.SHIFT REFERENCE= (INTERNAL, CDCl3, 0, 16.522)
##AUDIT TRAIL= $$ (NUMBER, WHEN, WHO, WHERE, WHAT)
$$ ##TITLE= Audit trail, XWIN-NMR		Version 3.5
$$ ##JCAMPDX= 5.01
$$ ##ORIGIN= Bruker BioSpin GmbH
$$ ##OWNER= nmr
$$ C:\u/data/dgb/nmr/ADRS/1320/pdata/1/auditp.txt
$$ ##AUDIT TRAIL=  $$ (NUMBER, WHEN, WHO, WHERE, WHAT)
(   1,<2007-03-20 11:44:38.11 +000>,<MAYBRIDGE\nmr>,<NMR_250MHZ>,
      <created by zg, POWCHK disabled, PULCHK disabled
       configuration hash MD5:
       49 4B E0 1D 92 C2 6B 37 9F E6 65 BC 52 41 86 1D
       data hash MD5: 64K
       7D B7 61 7B C9 C3 7F E9 36 93 96 BB CF 3B F1 22>)
(   2,<2007-03-20 11:44:54.67 +000>,<MAYBRIDGE\nmr>,<NMR_250MHZ>,
      <Start of raw data processing
       ef LB = 0.3 FT_mod = 6 PKNL = 1 SI = 32K 
       data hash MD5: 32K
       C2 EC 84 69 D7 F5 7E A9 AC 68 33 E3 72 3D F5 AA>)
(   3,<2007-03-20 11:44:56.50 +000>,<MAYBRIDGE\nmr>,<NMR_250MHZ>,
      <apk 
       data hash MD5: 32K
       DC 23 F1 27 CD FA E5 77 F1 63 71 FC 2C D4 30 99>)
(   4,<2007-03-20 11:44:57.17 +000>,<MAYBRIDGE\nmr>,<NMR_250MHZ>,
      <abs ABSG = 5 
       data hash MD5: 32K
       E4 5F 84 D8 3D 6D 2C DA 02 32 46 80 BF 28 F6 C6>)
$$ ##END=
$$ 
$$ hash MD5
$$ 4E 7B B5 CE 32 8D 5D 99 6D 86 33 C0 10 E6 CB DC
##$RELAX= 
##$RELAX= 
##$RELAX= 
##$RELAX= 
##$RELAX= 
##$RELAX= 
##$RELAX= 
$$ Bruker specific parameters
$$ --------------------------
##$DU= <C:\u>
##$EXPNO= 1320
##$NAME= <ADRS>
##$PROCNO= 1
##$TYPE= <nmr>
##$USER= <dgb>
##$AMP= (0..31)
100 100 100 100 100 100 100 100 100 100 100 100 100 100 100 100 100 100 
100 100 100 100 100 100 100 100 100 100 100 100 100 100 
##$AQSEQ= 0
##$AQ_mod= 3
##$AUNM= <au_zg>
##$AUTOPOS= <11 >
##$BF1= 250.13
##$BF2= 250.13
##$BF3= 250.13
##$BF4= 250.13
##$BF5= 500.13
##$BF6= 500.13
##$BF7= 500.13
##$BF8= 500.13
##$BYTORDA= 1
##$CFDGTYP= 0
##$CFRGTYP= 5
##$CHEMSTR= <none>
##$CNST= (0..31)
1 1 145 1 1 1 1 1 1 1 1 1 1 1 1 1 1 1 1 1 1 1 1 1 1 1 1 1 1 1 1 1 
##$CPDPRG= <>
##$CPDPRG1= <>
##$CPDPRG2= <>
##$CPDPRG3= <>
##$CPDPRG4= <mlev>
##$CPDPRG5= <mlev>
##$CPDPRG6= <mlev>
##$CPDPRG7= <mlev>
##$CPDPRG8= <mlev>
##$CPDPRGB= <>
##$CPDPRGT= <>
##$D= (0..31)
0 1 0 0 0 0 0 0 0 0.06 0 0 0 0 0 0 0.0002 0 0 0 0 0 0 0 0 0 0 0 0 0 0 
0 
##$DATE= 1174391076
##$DBL= (0..7)
120 120 120 120 120 120 120 120 
##$DBP= (0..7)
150 150 150 150 150 150 150 150 
##$DBP07= 0
##$DBPNAM0= <>
##$DBPNAM1= <>
##$DBPNAM2= <>
$$ [...]
##$SUBNAM6= <"">
##$SUBNAM7= <"">
##$SUBNAM8= <"">
##$SUBNAM9= <"">
##$SW= 20.6930455092707
##$SWIBOX= (0..15)
0 0 3 0 0 0 0 0 0 0 0 0 0 0 0 0 
##$SW_h= 5175.983436853
##$TD= 65536
##$TD0= 1
##$TE= 683.16
##$TE2= 300
##$TE3= 300
##$TEG= 300
##$TL= (0..7)
0 120 120 120 120 120 120 120 
##$TP= (0..7)
150 150 150 150 150 150 150 150 
##$TP07= 0
##$TPNAME0= <>
##$TPNAME1= <>
##$TPNAME2= <>
##$TPNAME3= <>
##$TPNAME4= <>
##$TPNAME5= <>
##$TPNAME6= <>
##$TPNAME7= <>
##$TPOAL= (0..7)
0.5 0.5 0.5 0.5 0.5 0.5 0.5 0.5 
##$TPOFFS= (0..7)
0 0 0 0 0 0 0 0 
##$TUNHIN= 0
##$TUNHOUT= 0
##$TUNXOUT= 0
##$USERA1= <user>
##$USERA2= <user>
##$USERA3= <user>
##$USERA4= <user>
##$USERA5= <user>
##$V9= 5
##$VALIST= <valist>
##$VCLIST= <CCCCCCCCCCCCCCC>
##$VD= 0
##$VDLIST= <DDDDDDDDDDDDDDD>
##$VPLIST= <PPPPPPPPPPPPPPP>
##$VTLIST= <TTTTTTTTTTTTTTT>
##$WBST= 1024
##$WBSW= 4
##$XGAIN= (0..3)
0 0 0 0 
##$XL= 0
##$YL= 0
##$YMAX_a= 410230
##$YMIN_a= -447935
##$ZGOPTNS= <>
##$ZL1= 120
##$ZL2= 120
##$ZL3= 120
##$ZL4= 120
##$ABSF1= 16.522
##$ABSF2= -4.171173
##$ABSG= 5
##$ABSL= 3
##$ALPHA= 0
##$AQORDER= 0
##$ASSFAC= 0
##$ASSFACI= 0
##$ASSFACX= 0
##$ASSWID= 0
##$AUNMP= <proc_1d>
##$AZFE= 0.1
##$AZFW= 0.1
##$BCFW= 0
##$BC_mod= 0
##$BYTORDP= 0
##$COROFFS= 0
##$CY= 12.5
##$DATMOD= 1
##$DC= 0
##$DFILT= <>
##$DTYPP= 0
##$F1P= 14.0000005364418
##$F2P= -0.99999901652339
##$FCOR= 0.5
##$FTSIZE= 32768
##$FT_mod= 6
##$GAMMA= 0
##$GB= 0
##$INTBC= 1
##$INTSCL= 1
##$ISEN= 128
##$LB= 0.3
##$LEV0= 0
##$LPBIN= 0
##$MAXI= 10000
##$MC2= 0
##$MEAN= 0
##$ME_mod= 0
##$MI= 0
##$NCOEF= 0
##$NC_proc= -2
##$NLEV= 6
##$NOISF1= 0
##$NOISF2= 0
##$NSP= 0
##$NTH_PI= 0
##$NZP= 0
##$OFFSET= 16.522
##$PC= 1
##$PHC0= 232.2821
##$PHC1= 7.7173
##$PH_mod= 1
##$PKNL= yes
##$PPARMOD= 0
##$PSCAL= 4
##$PSIGN= 0
##$REVERSE= no
##$SF= 250.13
##$SI= 32768
##$SIGF1= 0
##$SIGF2= 0
##$SINO= 400
##$SIOLD= 32768
##$SREGLST= <1H.CDCl3>
##$SSB= 0
##$STSI= 32768
##$STSR= 0
##$SW_p= 5175.98343685301
##$SYMM= 0
##$S_DEV= 0
##$TDeff= 65536
##$TDoff= 0
##$TI= <Analysis number 999999
Compound Code 99
Book Reference 9
Project Code 9>
##$TILT= no
##$TM1= 0
##$TM2= 0
##$TOPLEV= 0
##$USERP1= <user>
##$USERP2= <user>
##$USERP3= <user>
##$USERP4= <user>
##$USERP5= <user>
##$WDW= 1
##$XDIM= 32768
##$YMAX_p= 479090797
##$YMIN_p= -59953
$$ End of Bruker specific parameters
$$ ---------------------------------
##NTUPLES= NMR SPECTRUM
##VAR_NAME=  FREQUENCY,     SPECTRUM/REAL,   SPECTRUM/IMAG
##SYMBOL=    X,             R,               I
##VAR_TYPE=  INDEPENDENT,   DEPENDENT,       DEPENDENT
##VAR_FORM=  AFFN,          ASDF,            ASDF
##VAR_DIM=   32768,         32768,           32768
##UNITS=     HZ,            ARBITRARY UNITS, ARBITRARY UNITS
##FACTOR=    0.157963299565203, 1,           1
##FIRST=     4132.6476996994, 0,             0
##LAST=      -1043.33573715361, 0,           0
##MIN=       -1043.33573715361, -59953,      0
##MAX=       4132.6476996994, 479090797,     0
$$ Real data points
##PAGE= N=1
##DATA TABLE= (X++(R..R)), XYDATA
$$ [...]
##PAGE= N=2
##DATA TABLE= (X++(I..I)), XYDATA
$$ plain form
18068 -1617081 -1559865 -1508389 -1471391 -1425802 -1393847 -1354646 -1321393 -1300282 -1268712 -1229694 -1207215
18057 -1207215 -1194812 -1169136 -1145048 -1132774 -1091350 -1053336 -1004013 -973865 -964257 -962887 -962001 -937622
18045 -937622 -907862 -875659 -856429 -835098 -831424 -815863 -807312 -785043 -749715 -722172 -703180 -697388
18033 -697388 -692296 -698405 -673386 -660912 -656783 -647042 -619316 -601977 -595992 -609043 -601451 -584886 -576207
18020 -576207 -574953 -573369 -571614 -558310 -534889 -532558 -525023 -502829 -485924 -468827 -477069 -465326 -458958
18007 -458958 -444129 -441587 -446337 -451236 -448824 -427202 -411300 -417861 -421259 -417988 -416042 -411527 -386248
17994 -386248 -361730 -356094 -347020 -354379 -358670 -357320 -347141 -349754 -343801 -333533 -323313 -307876 -291697
17981 -291697 -287751 -282954 -287555 -288970 -279386 -271407 -273510 -270048 -271770 -280620 -283429 -281046 -264449 -248921
$$ packed form
18068a617081N7216N1476L6998M5589L1955L9201L3253K1111L1570L9018K2479
18057a207215J2403K5676K4088J2274M1424L8014M9323L0148R608J370Q86K4379
18045i37622K9760L2203J9230K1331L674J5561Q551K2269L5328K7543J8992N792
18033f97388N092o109K5019J2474M129R741K7726J7339N985j3051P592J6565Q679
18020e76207J254J584J755J3304K3421K331P535K2194J6905J7097q242J1743O368
18007d58958J4829K542m750m899K412K1622J5902o561l398L271J946M515K5279
17994c86248K4518N636R074p359m291J350J0179k613N953J0268J0220J5437J6179
17981b91697L946M797m601j415R584P979k103L462j722q850k809K383J6597J5528
$$ plain form
17967 -248921 -245646 -249829 -251537 -249453 -242944 -231632 -229340 -237716 -234837 -215193 -189475 -183828 -197577
17954 -197577 -195822 -179072 -179489 -184388 -186854 -186292 -192307 -184248 -197330 -202440 -187792 -167303 -151334
17941 -151334 -134621 -139259 -152736 -173453 -172933 -153825 -133461 -128793 -134228 -124822 -122503 -139776 -141370
17928 -141370 -144077 -142234 -137684 -136072 -148483 -145330 -141506 -141457 -113830 -101252 -105508 -103087 -118963 -130793
17914 -130793 -124356 -115129 -113868 -114210 -111134 -100906 -93809 -106936 -118922 -110497 -96334 -96231 -100327 -104694
17900 -104694 -96640 -85796 -77841 -85721 -84539 -68249 -60966 -70141 -69694 -75866 -71348 -57350 -60670 -73463
17886 -73463 -68179 -47569 -53605 -56772 -40449 -36506 -38455 -29287 -40583 -47371 -47105 -51867 -54638 -55235
17872 -55235 -61675 -63311 -76743 -74252 -59450 -53112 -46111 -46691 -35593 -40447 -40245 -31665 -27117 -25458
$$ packed form
17967b48921L275m183j708K084O509J1312K292q376K879J9644K5718N647j3749
17954a97577J755J6750m17m899k466N62o015Q059j3082n110J4648K0489J5969
17941a51334J6713m638j3477k0717N20J9108K0364M668n435R406K319j7273j594
17928a41370k707J843M550J612j2411L153L824M9K7627J2578m256K421j5876j1830
17914a30793O437R227J261l42L076J0228P097j3127j1986Q425J4163J03m096m367
17900a04694Q054J0844P955p880J182J6290P283r175M47o172M518J3998l320j2793
17886g3463N284K0610o036l167J6323L943j949R168j1296o788K66m762k771n97
17872e5235o440j636j3432K491J4802O338P001n80J1098m854K02Q580M548J659
$$ plain form
17858 -25458 -21888 -27656 -26377 -14861 -2234 2384 -1200 -4241 -9118 -19080 -12299 -18074 -22666 -7669
17844 -7669 -3160 -10892 -9809 -7191 -2358 12049 20453 17785 19956 21309 31764 32806 16298 8264
17830 8264 -4757 1372 10476 -12706 -10934 7821 28581 36208 37363 39710 42111 30215 11219
17817 11219 8012 9791 1802 10846 34672 47971 47833 55308 59404 24481 19332 36274 51923
17804 51923 47655 36387 35168 45760 54711 36330 38749 42323 51114 51616 62064 60294 53755 56108
17790 56108 50322 59872 45361 56496 63389 55823 42993 31772 35443 48705 50534 53588 52604
17777 52604 50271 56837 61008 63636 61402 63070 69777 78992 71971 65205 63706 68102 81069 71213
17763 71213 79050 84179 86458 88484 90143 90066 89227 80501 88030 94926 102222 82738 71685 73872 81083
$$ packed form
17858b5458L570n768J279J1516J2627M618l584l041m877r962O781n775m592J4997
17844g669M509p732J083K618M833J4407Q404k668K171J353J0455J042j6508q034
17830H264j3021O129R104k3182J772J8755K0760P627J155K347K401j1896j8996
17817A1219l207J779p989R044K3826J3299j38P475M096l4923n149J6942J5649
17804E1923m268j1268j219J0592Q951j8381K419L574Q791N02J0448j770o539K353
17790E6108n786R550j4511J1135O893p566j2830j1221L671J3262J829L054r84
17777E2604k333O566M171K628k234J668O707R215p021o766j499M396J2967r856
17763G1213P837N129K279K026J659p7q39q726P529O896P296j9484j1053K187P211
$$ plain form
17748 81083 88827 89769 106012 110095 106524 102662 99396 97674 104776 122886 109429 88474 77959
17735 77959 90066 101767 109250 113216 115966 112900 122420 125468 121696 111971 94836 99366 107072 108090
17721 108090 96301 93421 94213 87936 72598 73700 76586 83411 76174 74994 84698 105171 116192
17708 116192 98578 100675 111357 118281 107546 97255 99936 120968 122380 125874 136531 128960 124449
17695 124449 127601 129617 124181 112534 124034 125005 128400 134467 142121 137063 137993 139485 135703 141908
17681 141908 137206 140122 147154 138276 138817 145100 139986 144505 136628 125623 129046 149375 137383 124680
17667 124680 137697 140721 137009 136021 136451 133556 143320 161716 162613 158555 160204 154607 137869 125896
17653 125896 134017 147265 146401 137462 141816 139085 125041 123165 129949 136984 121869 118590 130158
$$ packed form
17748H1083P744R42J6243M083l571l862l266j722P102J8110j3457k0955j0515
17735G7959J2107J1701P483L966K750l066R520L048l772r725j7135M530P706J018
17721A08090j1789k880P92o277j5338J102K886O825p237j180R704K0473J1021
17708A16192j7614K097J0682O924j0735j0291K681K1032J412L494J0657p571m511
17695A24449L152K016n436j1647J1500R71L395O067P654n058R30J492l782O205
17681A41908m702K916P032q878N41O283n114M519p877j1005L423K0329j1992j2703
17667A24680J3017L024l712r88M30k895R764J8396Q97m058J649n597j6738j1973
17653A25896Q121J3248q64q939M354k731j4044j876O784P035j5115l279J1568
$$ plain form
17640 130158 134684 143232 146160 153351 151529 158797 159821 142881 136866 148549 159493 158662 167735 173503
17626 173503 174885 175819 164853 164698 158623 164194 162865 162996 169973 169843 167102 158363 146506 145627 152836
17611 152836 160074 155710 150366 161860 171023 164123 178842 185793 192402 205336 204054 185184 166504
17598 166504 160972 160039 173661 177471 190520 184261 169272 154384 165791 185137 193504 192834 187924
17585 187924 176705 175706 169772 183252 181317 167779 171429 187062 179649 181636 192785 191410 163510
17572 163510 154072 167758 186750 202825 225808 212272 202091 190920 195882 202277 201806 208331 205862
17559 205862 199089 212088 214444 205499 199134 191072 196189 191533 193034 201682 203682 203288 196257 188267
17545 188267 182585 195717 201561 206019 192953 179239 163407 154474 162660 173947 179345 174278 193765
$$ packed form
17640A30158M526Q548K928P191j822P268J024j6940o015J1683J0944q31R073N768
17626A73503J382R34j0966j55o075N571j329J31O977j30k741q739j1857q79P209
17611A52836P238m364n344J1494R163o900J4719O951O609J2934j282j8870j8680
17598A66504n532r33J3622L810J3049o259j4989j4888J1407J9346Q367o70m910
17585A87924j1219r99n934J3480j935j3538L650J5633p413J987J1149j375k7900
17572A63510r438J3686J8992J6075K2983j3536j0181j1171M962O395m71O525k469
17559B05862o773J2999K356q945o365q062N117m656J501Q648K000l94p031p990
17545A88267n682J3132N844M458j3066j3714j5832q933Q186J1287N398n067J9487
$$ plain form
17532 193765 202714 200213 197751 188009 182860 191921 203026 216465 222966 228085 233007 234912 223876
17519 223876 228187 223517 225648 226610 212642 215285 216472 219308 231562 226285 214439 212287 226052
17506 226052 234143 227450 225766 212644 211506 220150 232200 219340 226573 228644 222475 231663 244536
17493 244536 250305 240891 250135 260915 238475 239108 235977 213494 207484 211653 214336 221784 225416 223216
17479 223216 226035 227179 231174 242099 265498 260012 246371 261316 254879 252043 248968 234821 237314
17466 237314 262435 272747 280442 262979 236993 238117 234760 243286 253986 261038 258880 266595 274853
17453 274853 257787 249831 257534 268803 282910 282040 289657 306191 323940 326549 353425 328465 241237
17440 241237 187227 162166 152332 144208 158298 176250 173147 176841 196185 208390 212252 201179
$$ packed form
17532A93765Q949k501k462r742n149R061J1105J3439O501N119M922J905j1036
17519B23876M311m670K131R62j3968K643J187K836J2254n277j1846k152J3765
17506B26052Q091o693j684j3122j138Q644J2050j2860P233K071o169R188J2873
17493B44536N769r414R244J0780k2440O33l131k2483o010M169K683P448L632k200
17479B23216K819J144L995J0925K3399n486j3641J4945o437k836l075j4147K493
17466B37314K5121J0312P695j7463k5986J124l357Q526J0700P052k158P715Q258
17453B74853j7066p956P703J1269J4107q70P617J6534J7749K609K6876k4960q7228
17440B41237n4010k5061r834q124J4090J7952l103L694J9344J2205L862j1073
$$ plain form
17428 201179 201918 218568 223939 233628 226155 230819 243263 238237 231867 232014 246246 248217 246439 235803
17414 235803 239220 248342 266167 268062 260554 259657 237836 241186 259967 260572 236902 224798 232050
17401 232050 228266 244495 261433 257441 244618 247211 248695 244672 244169 242711 233629 242551 254541
17388 254541 273615 268378 262400 257484 259306 259657 272295 270838 270410 256301 245761 257751 267366
17375 267366 261272 260804 266850 267805 257336 260011 270137 271647 263666 251353 258657 259522 256691 263535
17361 263535 270604 266527 249563 265093 274488 272750 270011 260041 251708 260337 277451 271439 268272
17348 268272 273800 265741 256464 256191 256630 253940 255180 253716 249457 252614 258011 267417 274668 278310 275253
17333 275253 291412 302229 308599 314649 302273 289583 286178 288197 287117 286767 287117 294626 288347 287424
$$ packed form
17428B01179P39J6650N371R689p473M664J2444n026o370J47J4232J971j778j0636
17414B35803L417R122J7825J895p508q97k1821L350J8781O05k3670j2104P252
17401B32050l784J6229J6938l992j2823K593J484m023n03j458r082Q922J1990
17388B54541J9074n237n978m916J822L51J2638j457m28j4109j0540J1990R615
17375B67366o094m68O046R55j0469K675J0126J510p981j2313P304Q65k831O844
17361B63535P069m077j6964J5530R395j738k739r970q333Q629J7114o012l167
17348B68272N528q059r277k73M39k690J240j464m259L157N397R406P251L642l057
17333B75253J6159J0817O370O050j2376j2690l405K019j080l50L50P509o279r23
$$ plain form
17319 287424 302840 308112 317023 312423 295602 279093 277037 273894 291904 302993 293663 286039 269697
17306 269697 275834 281468 269328 268880 294131 297032 287571 281654 275659 278707 282191 288637 291066 286642
17292 286642 303339 309684 299415 301922 310560 307391 317358 326587 336853 335798 338687 342050 349370
17279 349370 329274 305973 289664 268679 253338 254550 249730 244801 242330 251187 255963 247681 245882
17266 245882 227801 219493 245091 264177 279111 289845 283659 274043 280716 282916 283442 289146 269214
17253 269214 254298 268130 283519 268125 268929 280119 277684 289567 294054 298158 293451 301574 312555
17240 312555 312167 311748 311277 298491 308914 306508 307397 312296 320669 319739 288649 285098 286558 286822 298345
17225 298345 303439 314597 309147 290453 283986 292686 294666 301108 309609 295028 290492 292040 299312
$$ packed form
17319B87424J5416N272Q911m600j6821j6509k056l143J8010J1089r330p624j6342
17306B69697O137N634j2140m48K5251K901r461n917n995L048L484O446K429m424
17292B86642J6697O345j0269K507Q638l169R967R229J0266j055K889L363P320
17279C49370k0096k3301j6309k0985j5341J212m820m929k471Q857M776q282j799
17266B45882j8081q308K5598J9086J4934J0734o186r616O673K200N26N704j9932
17253B69214j4916J3832J5389j5394Q04J1190k435J1883M487M104m707Q123J0981
17240C12555l88m19m71j2786J0423k406Q89M899Q373r30l1090l551J460K64J1523
17225B98345N094J1158n450j8694o467Q700J980O442Q501j4581m536J548P272
$$ plain form
17212 299312 312526 316051 304240 310597 320047 296549 291818 296087 298978 298050 304713 304907 313570 310067
17198 310067 305755 306250 303435 303935 309042 321873 319593 327037 337948 336034 332160 323627 321517 312058
17184 312058 313097 318457 312068 330979 346587 329019 310099 312912 324010 324622 314896 304795 292221
17171 292221 303302 308569 318642 328363 339952 339450 336448 324197 318361 336950 353132 350765 348888
17158 348888 350011 343694 340440 330584 319610 320800 330186 334517 337083 337118 325278 329118 337477 331992
17144 331992 335152 334944 332615 329185 343359 348894 338863 341949 340854 341382 348886 341001 346620 346474
17130 346474 357203 350435 351769 360191 368438 358597 344475 355851 366078 351734 337669 346706 348673
17117 348673 353845 369691 379720 374520 381844 396145 397687 398351 394572 396907 408393 423219 415916
$$ packed form
17212B99312J3214L525j1811O357R450k3498m731M269K891r28O663J94Q663l503
17198C10067m312M95k815N00N107J2831k280P444J0911j914l874q533k110r459
17184C12058J039N360o389J8911J5608j7568j8920K813J1098O12r726j0101j2574
17171B92221J1081N267J0073R721J1589n02l002j2251n836J8589J6182k367j877
17158C48888J123o317l254r856j0974J190R386M331K566L5j1840L840Q359n485
17144C31992L160k08k329l430J4174N535j0031L086j095N28P504p885N619j46
17130C46474J0729o768J334Q422Q247r841j4122J1376J0227j4344j4065R037J967
17117C48673N172J5846J0029n200P324J4301J542O64l779K335J1486J4826p303
$$ plain form
17104 415916 380579 370950 384905 384391 392128 359085 338162 323181 299087 281742 278572 278964 272437
17091 272437 264212 273392 282041 287000 291678 294976 302571 321695 318395 305115 307239 330056 312354
17078 312354 308896 320435 309917 299981 318945 343746 351261 350334 339272 338152 335073 330349 330955
17065 330955 322209 341534 350835 337699 345068 339371 344383 349049 351427 364899 354460 345568 338364
17052 338364 336453 330984 326356 321709 327253 344703 348340 351104 357164 341646 331260 322246 322453 339794
17038 339794 340021 354121 369521 360906 353424 361182 353993 362399 368557 365925 349503 341901 343633 346789
17024 346789 363055 366328 361743 357838 353658 348497 359225 362339 364451 366424 365244 367960 366019 360776
17010 360776 356897 373077 380161 383755 384941 384626 369413 344758 365200 365412 361659 358672 364753 364081
$$ packed form
17104D15916l5337r629J3955n14P737l3043k0923j4981k4094j7345l170L92o527
17091B72437q225R180Q649M959M678L298P595J9124l300j3280K124K2817j7702
17078C12354l458J1539j0518r936J8964K4801P515r27j1062j120l079m724O06
17065C30955q746J9325R301j3136P369n697N012M666K378J3472j0439q892p204
17052C38364j911n469m628m647N544J7450L637K764O060j5518j0386r014K07J7341
17038C39794K27J4100J5400q615p482P758p189Q406O158k632j6422p602J732L156
17024C46789J6266L273m585l905m180n161J0728L114K112J973j180K716j941n243
17010C60776l879J6180P084L594J186l15j5213k4655K0442K12l753k987O081o72
$$ plain form
16996 364081 345554 342594 354176 353282 353032 353417 362251 375652 386268 381960 378768 364455 358762 376456
16982 376456 379122 373583 387654 368543 351012 350901 358050 372404 364897 350721 362007 373035 371047
16969 371047 375637 367985 371651 364098 367056 371169 372735 377499 378398 376065 377712 369431 355655 346368
16955 346368 337855 342660 355337 376769 386922 380569 382163 390697 379802 373249 370082 370362 371786
16942 371786 378045 366951 369264 390586 390798 392034 381108 363112 363849 352571 356416 372326 383656
16929 383656 383805 379844 371083 368401 376511 388777 377149 375041 389237 403539 401714 404077 386826
16916 386826 369305 357698 356519 375349 383686 381620 378422 371537 369348 375445 380552 377481 380726
16903 380726 380320 386948 393790 390308 383249 390738 385059 392838 404761 391699 385756 391172 377392 374079
$$ packed form
16996C64081j8527k960J1582q94k50L85Q834J3401J0616m308l192j4313n693J7694
16982C76456K666n539J4071j9111j7531j11P149J4354p507j4176J1286J1028j988
16969C71047M590p652L666p553K958M113J566M764Q99k333J647q281j3776r287
16955C46368q513M805J2677K1432J0153o353J594Q534j0895o553l167K80J424
16942C71786O259j1094K313K1322K12J236j0926j7996P37j1278L845J5910J1330
16929C83656J49l961q761k682Q110J2266j1628k108J4196J4302j825K363j7251
16916C86826j7521j1607j179J8830Q337k066l198o885k189O097N107l071L245
16903C80726m06O628O842l482p059P489n679P779J1923j3062n943N416j3780l313
$$ plain form
16889 374079 372302 372839 366452 373429 375021 380467 389355 385786 402197 420183 405668 393709 382571
16876 382571 389379 387694 375303 375080 373703 376446 378274 394579 397870 409487 403412 409432 412376 408463
16862 408463 394032 393450 386857 397397 397198 402568 407591 408765 401411 405609 415451 417539 418535 404246
16848 404246 397526 402587 402470 399087 385378 384458 391553 396382 398716 395098 395654 406318 410521 400077
16834 400077 392258 372270 368482 370166 367755 380783 379216 375318 380767 396571 404434 401804 418535
16821 418535 428546 425261 419524 419441 418811 418845 418042 413140 410765 414549 418890 396505 395602 407507 410424
16806 410424 415086 426627 429414 410263 391501 388076 397696 424857 432207 404631 401139 407466 416027
16793 416027 418610 413142 418909 405713 389667 401878 421192 432959 430855 418332 424045 432903 425096
$$ packed form
16889C74079j777N37o387O977J592N446Q888l569J6411J7986j4515j1959j1138
16876C82571O808j685j2391k23j377K743J828J6305L291J1617o075O020K944l913
16862D08463j4431n82o593J0540j99N370N023J174p354M198R842K088R96j4289
16848D04246o720N061j17l383j3709r20P095M829K334l618N56J0664M203j0444
16834D00077p819j9988l788J684k411J3028j567l898N449J5804P863k630J6731
16821D18535J0011l285n737q3o30L4q03m902k375L784M341k2385r03J1905K917
16806D10424M662J1541K787j9151j8762l425R620K7161P350k7576l492O327Q561
16793D16027K583n468N767j3196j6046J2211J9314J1767k104j2523N713Q858p807
$$ plain form
16780 425096 413307 416134 411345 402553 400508 411418 417157 420105 430860 426904 418810 417053 413892
16767 413892 405997 417147 421942 425413 418860 398487 397430 402994 420353 426461 416665 416071 416887 415735
16753 415735 407534 407133 411729 412471 411432 428292 433304 420356 427244 430321 432666 431727 431811 430705 426861
16738 426861 427172 437367 426340 422526 430868 424146 425174 430733 436145 436604 445863 443744 452844 460869
16724 460869 461025 461907 454476 445617 438741 435420 426647 431112 441727 444198 442768 429854 420979 421767
16710 421767 434726 444489 448786 465010 467861 460978 448445 452798 437399 438955 447087 449012 459278
16697 459278 461913 467633 464604 465106 452891 447288 453961 453992 449962 449560 435585 429833 449365 452332
16683 452332 449482 465482 468724 460756 461327 465933 469439 458674 457090 462992 460254 464139 445223 426111
$$ packed form
16780D25096j1789K827m789q792k045J0910N739K948J0755l956q094j757l161
16767D13892p895J1150M795L471o553k0373j057N564J7359O108r796n94Q16j152
16753D15735q201m01M596P42j039J6860N012j2948O888L077K345r39Q4j106l844
16738D26861L11J0195j1027l814Q342o722J028N559N412M59R259k119R100Q025
16724D60869J56Q82p431q859o876l321q773M465J0615K471j430j2914q875P88
16710D21767J2959R763M297J6224K851o883j2533M353j5399J556Q132J925J0266
16697D59278K635N720l029N02j2215n603O673L1m030m02j3975n752J9532K967
16683D52332k850J6000L242p968N71M606L506j0765j584N902k738L885j8916j9112
$$ plain form
16669 426111 429148 440443 451594 459471 472541 471724 465317 458097 454637 458773 461241 467687 468897 463888
16655 463888 456047 454962 457670 456210 453009 448527 448886 437367 438473 442882 445036 449360 456769 478302
16641 478302 473950 469357 457757 450243 454990 479983 490164 477152 449421 445483 451687 473527 475274
16628 475274 468710 480550 471869 468942 477633 459973 454052 462793 453994 444897 460189 462390 459450
16615 459450 477592 484538 479339 476488 479697 479057 470036 467979 466704 469890 466730 463280 467968 466135
16601 466135 461095 453976 462679 465436 477633 487094 498791 498874 490719 484975 480762 472475 478417 500967
16587 500967 496716 479607 495869 487060 478801 481103 483824 483477 472825 479687 503577 495492 485288
16574 485288 498564 497715 482000 471773 474558 467935 461300 472372 486396 478016 485580 493989 489003
$$ packed form
16669D26111L037J1295J1151P877J3070q17o407p220l460M136K468O446J210n009
16655D63888p841j085K708j460l201m482L59j1519J106M409K154M324P409K1533
16641D78302m352m593j1600p514M747K4993J0181j3012k7731l938O204K1840J747
16628D75274o564J1840q681k927Q691j7660n921Q741q799r097J5292K201k940
16615D59450J8142O946n199k851L209o40r021k057j275L186l160l450M688j833
16601D66135n040p119Q703K757J2197R461J1697Q3q155n744m213q287N942K2550
16587E00967m251j7109J6262q809q259K302K721l47j0652O862K3890q085j0204
16574D85288J3276q49j5715j0227K785o623o635J1072J4024q380P564Q409m986
$$ plain form
16561 489003 499538 497003 504221 509052 504901 480241 467947 473759 482386 478992 487410 483017 478982
16548 478982 480390 476095 474091 489143 498100 511634 516573 507481 497377 493699 495130 511423 506032
16535 506032 498733 487310 480770 496803 502840 485110 488494 508139 522019 526961 507196 496752
16523 496752 487353 491114 507804 526315 527867 522932 516457 508434 513565 527091 515015 508768 501200
16510 501200 510318 501257 477581 490200 497598 496940 498857 498276 515551 516735 506384 505835 504303 508065
16496 508065 507326 493924 496106 509777 529178 529442 517935 513457 512923 499680 496674 510111 509961 508081
16482 508081 504586 490576 493514 497062 494552 489360 490299 486446 493979 503324 511023 519214 510935 500310
16468 500310 497833 495253 496350 495841 489387 498349 495562 518455 523385 513216 516978 519063 515009 503708
$$ packed form
16561D89003J0535k535P218M831m151k4660j2294N812Q627l394Q418m393m035
16548D78982J408m295k004J5052Q957J3534M939r092j0104l678J431J6293n391
16535E06032p299j1423o540J6033O037j7730L384J9645J3880M942j9765j0444
16523D96752r399L761J6690J8511J552m935o475q023N131J3526j2076o247p568
16510E01200R118r061k3676J2619P398o58J917n81J7275J184j0351n49j532L762
16496E08065p39j3402K182J3671J9401K64j1507m478n34j3243l006J3437j50j880
16482E08081l495j4010K938L548k510n192R39l853P533R345P699Q191q279j0625
16468E00310k477k580J097n09o454Q962k787K2893M930j0169L762K085m054j1301
$$ plain form
16454 503708 490077 485254 480615 473690 495645 498363 500374 495528 487987 485214 494640 507840 505656
16441 505656 493846 488138 494212 496800 511559 511832 498639 499114 502964 509356 528320 539082 539135 525115
16427 525115 520388 519820 516556 510784 515640 521439 531033 535822 532012 523778 525314 514972 507677 516969
16413 516969 523097 537468 534515 522436 517116 503236 506827 515475 527141 521038 519759 513037 520804
16400 520804 525240 526198 529760 535212 524420 514062 506422 500756 510007 534861 532857 529284 525569 527623
16386 527623 531893 538939 532615 528222 539637 545305 539017 546947 536812 522902 515820 526426 539673
16373 539673 543885 543629 540413 535240 540197 534621 526104 539327 554218 551652 559274 552564 536585 531783
16359 531783 539326 552906 556179 556155 563238 568913 559672 550284 557308 561748 571258 553415 546152 543352
$$ packed form
16454E03708j3631m823m639o925K1955K718K011m846p541k773R426J3200k184
16441E05656j1810n708O074K588J4759K73j3193M75L850O392J8964J0762N3j4020
16427E25115m727n68l264n772M856N799R594M789l810q234J536j0342p295R292
16413E16969O128J4371k953j2079n320j3880L591Q648J1666o103j279o722P767
16400E20804M436R58L562N452j0792j0358p640n666R251K4854k004l573l715K054
16386E27623M270P046o324m393J1415N668o288P930j0135j3910p082J0606J3247
16373E39673M212k56l216n173M957n576q517J3223J4891k566P622o710j5979m802
16359E31783P543J3580L273k4P083N675r241r388P024M440R510j7843p263k800
$$ plain form
16345 543352 539967 550656 530329 511619 522174 516454 516229 522081 523864 530135 532237 539001 551058
16332 551058 557886 561630 566733 556881 535231 539006 537745 523823 489874 505211 519693 508452 519675
16319 519675 528879 526971 542469 559460 552534 557683 555165 545974 559014 567260 569529 572052 549124
16306 549124 548036 566395 572715 568000 552451 553532 560020 559916 566347 553682 562711 563010 572122 572465
16292 572465 573376 573460 557891 537603 535091 537536 541301 543523 550683 546174 543790 538478 546207 547823
16278 547823 542529 540111 542401 540514 537079 540448 552207 559890 569150 572176 567754 564415 556097 556017
16264 556017 554185 551118 550960 556650 576922 579306 574908 568313 560454 556322 542503 548709 549321 555926
16250 555926 559277 561927 578632 574044 570140 570907 576328 586267 581682 571988 566446 575698 582529 581620
$$ packed form
16345E43352l385J0689k0327j8710J0555n720k25N852J783O271K102O764J2057
16332E51058O828L744N103r852k1650L775j261j3922l3949J5337J4482j1241J1223
16319E19675R204j908J5498J6991o926N149k518r191J3040Q246K269K523k2928
16306E49124j088J8359O320m715j5549J081O488j04O431j2665R029K99R112L43
16292E72465R11Q4j5569k0288k512K445L765K222P160m509k384n312P729J616
16278E47823n294k418K290j887l435L369J1759P683R260L026m422l339q318q0
16264E56017j832l067j58N690K0272K384m398o595p859m132j3819O206O12O605
16250E55926L351K650J6705m588l904P67N421R939m585r694n542R252O831r09
$$ plain form
16236 581620 577560 568461 576186 587309 583542 570791 570801 574502 567859 559778 561311 580470 579266 561804
16222 561804 557662 565630 569165 575474 576135 575019 571662 583635 593975 589376 594623 605884 596516 591124
16208 591124 587133 587816 589828 591072 596186 583060 576567 582105 587131 587110 583876 577619 587977 589820
16194 589820 587585 595325 606336 608143 597783 587747 581317 590436 605699 604678 584391 583876 580843
16181 580843 585089 595160 604533 596932 589247 603406 597112 597854 585626 600975 607273 618350 603571
16168 603571 587787 577592 583044 580208 573460 587424 598313 595942 591139 596713 600631 595116 589311
16155 589311 597021 592706 591452 597386 604044 596163 601222 612559 612424 598709 597939 618467 602324 593167
16141 593167 598239 604489 612021 618962 615834 618945 612618 610673 603739 598680 599285 602712 593316 587511
$$ packed form
16236E81620m060r099P725J1123l767j2751J0L701o643q081J533J9159j204j7462
16222E61804m142P968L535O309O61j116l357J1973J0340m599N247J1261r368n392
16208E91124l991O83K012J244N114j3126o493N538N026k1l234o257J0358J843
16194E89820k235P740J1011J807j0360j0036o430R119J5263j021k0287n15l033
16181E80843M246J0071R373p601p685J4159o294P42j2228J5349O298J1077j4779
16168F03571j5784j0195N452k836o748J3964J0889k371m803N574L918n515n805
16155E89311P710m315j254N934O658p881N059J1337j35j3715p70K0528j6143r157
16141E93167N072O250P532O941l128L111o327j945o934n059O05L427r396n805
$$ plain form
16127 587511 603328 621922 633766 647149 651507 650873 631581 616253 626005 629809 627220 626761 630973
16114 630973 639001 631298 624720 618851 622897 631000 627582 637948 626781 620502 610979 613618 620418 618929
16100 618929 623279 613263 623802 641150 638679 636618 641813 643387 647030 640055 650183 654216 641430
16087 641430 604003 574651 568928 579498 584502 602461 612964 607435 597856 598859 613981 623708 615428
16074 615428 604700 605428 611255 621339 623779 619603 620504 626500 621505 613186 615181 627416 626483 617818
16060 617818 610811 620972 622550 614763 628448 631665 626246 621568 628267 621999 613664 619997 614166 609521
16046 609521 605082 614739 634298 641232 636011 633843 633498 630630 618699 612970 634821 637805 632142 633929
16032 633929 628273 628414 628463 626890 634373 646399 646427 633250 633569 630990 630341 626638 627009 631315 640938 653793
$$ packed form
16127E87511J5817J8594J1844J3383M358o34j9292j5328R752L804k589m59M212
16114F30973Q028p703o578n869M046Q103l418J0366j1167o279r523K639O800j489
16100F18929M350j0016J0539J7348k471k061N195J574L643o975J0128M033j2786
16087F41430l7427k9352n723J0570N004J7959J0503n529r579J003J5122R727q280
16074F15428j0728P28N827J0084K440m176R01N996m995q319J995J2235r33q665
16060F17818p007J0161J578p787J3685L217n419m678O699o268q335O333n831m645
16046F09521m439R657J9559O934n221k168l45k868j1931n729K1851K984n663J787
16032F33929n656J41M9j573P483J2026K8j3177L19k579o49l703L71M306R623J2855
$$ plain form
16016 653793 643100 640210 650074 653290 639749 644658 667825 671365 666947 657809 648410 646870 652050
16003 652050 659896 665565 657123 651908 649855 647666 648956 655261 653455 646258 636934 636914 637602 652623 647636
15988 647636 641720 647191 656707 660877 662858 660641 655071 648948 636032 627862 632436 646711 650498 639303
15974 639303 638645 641560 669234 677214 677554 663620 652663 637193 634597 647629 664201 666802 660576
15961 660576 662428 667598 680170 684600 681310 672584 678325 677573 658290 648649 639998 641457 650940 666529
15947 666529 678190 679430 700008 692015 670172 666770 667566 678690 692536 680345 671280 658540 656617
15934 656617 667476 677158 682976 670855 674398 666005 670781 669903 674237 674271 681457 676498 674515 666780
15920 666780 672733 685911 667978 689801 702100 697268 699117 689692 672930 656142 648092 650776 657965
$$ packed form
16016F53793j0693k890R864L216j3541M909K3167L540m418r138r399j540N180
16003F52050P846N669q442n215k053k189J290O305j806p197r324k0O88J5021m987
15988F47636n916N471R516M170J981k217n570o123j2916q170M574J4275L787j1195
15974F39303o58K915K7674P980L40j3934j0957j5470k596J3032J6572K601o226
15961F60576J852N170J2572M430l290q726N741p52j9283r641q651J459R483J5589
15947F66529J1661J240K0578p993k1843l402P96J1124J3846j2191r065j2740j923
15934F56617J0859R682N818j2121L543q393M776q78M334L4P186m959j983p735
15920F66780N953J3178j7933K1823J2299m832J849r425j6762j6788q050K684P189
$$ plain form
15907 657965 662285 670807 696323 718779 713454 707818 691343 670914 677804 685913 695713 709462 703715
15894 703715 711831 704784 696741 699890 709200 700759 693327 687786 682703 702102 704621 701151 712900 714184
15880 714184 701619 674665 672507 681920 673919 657616 667379 676048 675811 676375 677264 681225 692506 698626
15866 698626 695179 700672 716618 725594 721252 700632 691314 691882 696817 699784 712702 713438 714327 703568
15852 703568 689126 687274 703697 719383 712388 703047 693895 697708 691436 689033 685135 689604 700688
15839 700688 703787 704605 696107 699232 714424 718049 718573 717177 716626 708030 706200 697887 690275 690520 709460
15824 709460 720765 727668 717388 708068 709768 714472 722794 725745 722227 727231 721508 721970 724381 725291
15810 725291 728634 729075 725090 725792 739416 742034 737712 739730 734719 716399 714788 720565 726254 732607
$$ packed form
15907F57965M320Q522K5516K2456n325n636j6475k0429O890Q109R800J3749n747
15894G03715Q116p047q043L149R310q441p432n541n083J9399K519l470J1749J284
15880G14184j2565k6954k158R413q001j6303R763Q669k37N64Q89L961J1281O120
15866F98626l447N493J5946Q976m342k0620r318N68M935K967J2918P36Q89j0759
15852G03568j4442j852J6423J5686o995r341r152L813o272k403l898M469J1084
15839G00688L099Q18q498L125J5192L625N24j396n51q596j830q313p612K45J8940
15824G09460J1305O903j0280r320J700M704Q322K951l518N004n723M62K411R10
15810G25291L343M41l985P02J3624K618m322K018n011j8320j611N777N689O353
$$ plain form
15796 732607 749240 750199 741355 751822 743845 729608 746537 768013 774718 763848 764051 770730 781052
15783 781052 780867 773673 763597 737372 713942 711156 712638 693520 690160 697989 701614 706918 713370
15770 713370 721329 716204 721091 732446 732825 734560 727676 730139 746763 748337 747809 745440 738442 737604
15756 737604 745770 738531 727785 722598 727627 733728 749146 743827 743917 755861 752133 749365 738365 745183
15742 745183 745253 741703 743949 748884 757357 749508 733097 736203 732332 741078 748402 753150 747808 739240
15728 739240 749503 750389 742503 725967 725788 735481 751318 760509 745500 729474 725033 733235 734033 742670
15714 742670 759189 760541 760775 757923 762516 765971 774514 767339 741975 723346 734101 753442 759088
15701 759088 751277 749427 750255 750224 751584 756929 744977 743638 755145 767735 779431 777737 762666 747176
$$ packed form
15796G32607J6633R59q844J0467p977j4237J6929K1476O705j0870K03O679J0322
15783G81052j85p194j0076k6225k3430k786J482j9118l360P829L625N304O452
15770G13370P959n125M887J1355L79J735o884K463J6624J574n28k369o998q38
15756G37604Q166p239j0746n187N029O101J5418n319R0J1944l728k768j1000O818
15742G45183P0l550K246M935Q473p849j6411L106l871Q746P324M748n342q568
15728G39240J0263Q86p886j6536j79R693J5837R191j5009j6026m441Q202P98Q637
15714G42670J6519J352K34k852M593L455Q543p175k5364j8629J0755J9341N646
15701G59088p811j850Q28l1J360N345j1952j339J1507J2590J1696j694j5071j5490
$$ plain form
15687 747176 739012 731869 742226 750844 746250 760133 765549 761885 753631 759599 763838 772942 764748 762679
15673 762679 778677 786005 790686 777739 760246 749243 754963 755236 758401 758519 769512 773780 750872
15660 750872 754414 758490 753464 764300 760817 755249 760755 764123 768183 776674 779718 782014 785044 791369
15646 791369 783299 783621 787143 776321 796820 807746 800653 798802 791302 774271 771409 783084 787919
15633 787919 788989 799278 811535 820463 821658 836112 828335 809300 787651 780443 773508 784907 779193
15620 779193 774053 781756 791332 791947 795781 796622 799308 798495 801371 806240 825769 838868 829228 817271
15606 817271 808807 806485 811691 819911 820585 803288 789799 784868 792600 791902 790912 798668 796533 791769
15592 791769 802600 805211 817834 812758 811829 815632 817978 817113 812066 799422 814869 829311 848409
$$ packed form
15687G47176q164p143J0357Q618m594J3883N416l664q254N968M239R104q194k069
15673G62679J5998P328M681j2947j7493j1003N720K73L165J18J0993M268k2908
15660G50872L542M076n026J0836l483n568N506L368M060Q491L044K296L030O325
15646G91369q070L22L522j0822K0499J0926p093j851p500j7031k862J1675M835
15633G87919J070J0289J2257Q928J195J4454p777j9035k1649p208o935J1399n714
15620G79193n140P703R576O15L834Q41K686q13K876M869J9529J3099r640j1957
15606H17271q464k322N206Q220O74j7297j3489m931P732o98r90P756k135m764
15592G91769J0831K611J2623n076r29L803K346q65n047j2644J5447J4442J9098
$$ plain form
15579 848409 839678 821106 820526 807597 795164 786186 797071 802044 812014 813391 816855 824912 821877
15566 821877 817981 819720 810335 807633 807981 816159 826808 829262 831048 829951 814535 823926 844735 858709
15552 858709 867684 866454 852561 844603 831647 811126 837414 864785 857473 848174 852199 853995 838367
15539 838367 827972 821617 823553 834627 827401 818330 815932 812446 821162 818464 834192 846009 855924
15526 855924 844132 839295 830044 818928 836939 847285 857569 873587 881217 885569 884573 868805 856389
15513 856389 847745 847409 860944 874009 879513 861070 845403 845427 843086 840247 850293 858867 860931 852766
15499 852766 862625 861240 852120 836467 826907 834279 834837 854769 866809 869462 855269 848442 855473
15486 855473 876581 880883 870925 881747 871799 871393 879896 887605 879127 880191 879272 878072 887546 882826
$$ packed form
15579H48409q731j8572n80j2929j2433q978J0885M973R970J377L464Q057l035
15566H21877l896J739r385k702L48Q178J0649K454J786j097j5416R391K0809J3974
15552H58709Q975j230j3893p958j2956k0521K6288K7371p312r299M025J796j5628
15539H38367j0395o355J936J1074p226r071k398l486Q716k698J5728J1817R915
15526H55924j1792m837r251j1116J8011J0346J0284J6018P630M352r96j5768j2416
15513H56389q644l36J3535J3065N504j8443j5667K4k341k839J0046Q574K064q165
15499H52766R859j385r120j5653r560P372N58J9932J2040K653j4193o827P031
15486H55473K1108M302r958J0822r948m06Q503P709q478J064r19j200R474m720
$$ plain form
15472 882826 866260 863939 860807 847192 834285 839347 850689 867666 866352 868925 875856 872058 872976
15459 872976 875840 882215 866045 851464 850433 861976 864160 858360 849633 847912 872441 884318 880997
15446 880997 883383 895593 889227 886331 884503 895483 901696 895373 906495 914947 894539 878678 873049
15433 873049 887071 893071 900059 907341 905614 904048 927015 931052 925446 923109 918845 927323 936361 933716
15419 933716 929434 929865 919080 910185 917246 914445 892361 874310 891148 896453 893882 907404 906907
15406 906907 904209 915639 919307 926407 937025 941620 936057 936256 931834 918818 922056 916997 902000
15393 902000 893938 891409 903567 920636 925128 919864 915700 934865 941484 943056 942473 935048 925278 924341
15379 924341 934577 946702 942860 956415 951605 948367 957254 951738 955433 949340 946049 941195 943070
$$ packed form
15472H82826j6566k321l132j3615j2907N062J1342J6977j314K573O931l798R18
15459H72976K864O375j6170j4581j031J1543K184n800q727j721K4529J1877l321
15446H80997K386J2210o366k896j828J0980O213o323J1122Q452k0408j5861n629
15433H73049J4022O000O988P282j727j566K2967M037n606k337m264Q478R038k645
15419I33716m282M31j0785q895P061k801k2084j8051J6838N305k571J3522m97
15406I06907k698J1430L668P100J0618M595n563J99m422j3016L238n059j4997
15393I02000q062k529J2158J7069M492n264m164J9165O619J572n83p425r770r37
15379I24341J0236J2125l842J3555m810l238Q887n516L695o093l291m854J875
$$ plain form
15366 943070 947931 937295 947296 958263 952036 955900 965710 945750 916571 909856 906113 912032 925944
15353 925944 923932 939374 957043 958586 952315 953635 957715 951076 951833 935173 923731 921388 931210
15340 931210 952861 948468 927009 932605 946526 969800 971800 967160 963780 953245 953900 958817 952297
15327 952297 950979 958298 957700 948586 935739 932711 924109 938040 939842 937724 946955 951655 943091 939617
15313 939617 943626 949497 955143 952951 945067 943141 936486 930907 944572 967009 965218 952979 950970
15300 950970 955019 964032 974326 986690 986103 982111 980358 974321 983057 984455 983988 983232 978766 980470
15286 980470 980472 978203 955259 945832 963040 987996 995867 999123 991586 984249 983187 985327 982242 995901
15272 995901 992480 984395 990873 1006959 1007545 986535 975271 989916 972183 969874 975819 963901 974960
$$ packed form
15366I43070M861j0636J0001J0967o227L864R810j9960k9179o715l743N919J3912
15353I25944k012J5442J7669J543o271J320M080o639P57j6660j1442k343R822
15340I31210K1651m393k1459N596J3921K3274K000m640l380j0535O55M917o520
15327I52297j318P319n98r114j2847l028q602J3931J802k118R231M700q564l474
15313I39617M009N871N646k192p884j926o655n579J3665K2437j791j2239k009
15300I50970M049R013J0294J2364n87l992j753o037Q736J398m67p56m466J704
15286I80470Kk269k2944r427J7208K4956P871L256p537p337j062K140l085J3659
15272I95901l421q085O478J6086N86k1010j1264J4645j7733k309N945j1918J1059
$$ plain form
15259 974960 977661 993738 1000181 1008914 997168 1005833 1020196 1034095 1031529 1018955 1015557 1021148 1020781
15246 1020781 1011780 1007293 1011006 1010806 1012880 1007717 1009216 1002501 994406 999364 1005274 1014874 1025942 1036294
15232 1036294 1037252 1025193 1010172 1004578 1012641 1018604 1011571 1029150 1039762 1042306 1042089 1026896 1010915
15219 1010915 1011849 1007847 1015986 1012514 1013541 1016423 1010435 1023331 1031894 1049041 1058594 1037717 1023469
15206 1023469 1039245 1058084 1067521 1057833 1050337 1038635 1044265 1040758 1040397 1042016 1053035 1044655 1047689
15193 1047689 1049839 1056735 1065021 1067266 1055758 1046775 1043040 1050364 1052637 1056654 1050696 1052070 1044922 1044590
15179 1044590 1052582 1056139 1057683 1048034 1048433 1058210 1072774 1081708 1085290 1085594 1082575 1082479 1073399 1060505
15165 1060505 1050587 1046580 1047373 1048258 1044149 1059774 1072100 1076508 1076367 1088679 1088824 1089247 1094510 1090069
$$ packed form
15259I74960K701J6077O443Q733j1746Q665J4363J3899k566j2574l398N591l67
15246A020781r001m487L713k00K074n163J499o715q095M958N910R600J1068J0352
15232A036294R58j2059j5021n594Q063N963p033J7579J0612K544k17j5193j5981
15219A010915R34m002Q139l472J027K882n988J2896Q563J7147R553k0877j4248
15206A023469J5776J8839R437r688p496j1702N630l507l61J619J1019q380L034
15193A047689K150O896Q286K245j1508q983l735P324K273M017n958J374p148l32
15179A044590P992L557J544r649L99R777J4564Q934L582L04l019r6r080j2894
15165A060505r918m007P93Q85m109J5625J2326M408j41J2312J45M23N263m441
$$ plain form
15151 1090069 1075105 1078788 1076768 1069473 1073047 1084792 1102273 1108494 1099102 1092729 1101514 1094208 1097546
15138 1097546 1114456 1120750 1111217 1107030 1115075 1108641 1100855 1092509 1095050 1107387 1094908 1096174 1115227
15125 1115227 1120725 1104474 1094876 1103069 1111155 1107945 1105229 1099786 1102882 1109663 1101603 1110250 1114391 1111413
15111 1111413 1117769 1124948 1112131 1106222 1116098 1125577 1133540 1131739 1119313 1114175 1121339 1132285 1126482
15098 1126482 1116860 1114140 1109593 1119946 1124047 1127771 1128704 1120471 1121005 1125775 1114223 1122122 1119351 1128737
15084 1128737 1136735 1139794 1136460 1136186 1118706 1117602 1120529 1136540 1148089 1157268 1153763 1151656 1135926
15071 1135926 1113800 1111957 1123095 1119254 1120868 1136830 1132781 1135150 1145936 1146173 1147256 1152232 1158687
15058 1158687 1167418 1159242 1151461 1151464 1157788 1154247 1167058 1165388 1157775 1170757 1170528 1175911 1177696 1178925
$$ packed form
15151A090069j4964L683k020p295L574J1745J7481O221r392o373Q785p306L338
15138A097546J6910O294r533m187Q045o434p786q346K541J2337j2479J266J9053
15125A115227N498j6251r598Q193Q086l210k716n443L096O781q060Q647M141k978
15111A111413O356P179j2817n909R876R479P963j801j2426n138P164J0946n803
15098A126482r622k720m547J0353M101L724R33q233N34M770j1552P899k771R386
15084A128737P998L059l334k74j7480j104K927J6011J1549R179l505k107j5730
15071A135926k2126j843J1138l841J614J5962m049K369J0786K37J083M976O455
15058A158687Q731q176p781LO324l541J2811j670p613J2982k29N383J785J229
$$ plain form
15044 1178925 1169992 1172338 1172476 1172235 1164135 1168976 1173307 1176738 1173684 1179652 1181630 1176594 1170880 1175208
15030 1175208 1193313 1203569 1207453 1195312 1179610 1183318 1200747 1203022 1207391 1218242 1209161 1191694
15018 1191694 1193597 1204268 1213715 1217453 1225059 1233264 1238196 1222702 1210408 1227237 1236489 1226699 1222882
15005 1222882 1222979 1227919 1220406 1208437 1204433 1226185 1244575 1243362 1241673 1232824 1235314 1239811 1230701 1227708
14991 1227708 1235169 1230582 1241180 1248582 1240730 1245717 1252648 1249667 1246439 1256037 1268382 1264211 1249952
14978 1249952 1255606 1253414 1249802 1252747 1260539 1271570 1276771 1280936 1291583 1293574 1283821 1274072 1276150
14965 1276150 1274741 1271921 1269768 1274681 1274758 1263588 1270090 1280871 1270817 1270584 1282464 1283468 1277387 1278038
14951 1278038 1280557 1290299 1279029 1269898 1286316 1291539 1293588 1302627 1309687 1309212 1311634 1315922 1309595 1307413
$$ packed form
15044A178925q933K346J38k41q100M841M331L431l054N968J978n036n714M328
15030A175208J8105J0256L884j2141j5702L708J7429K275M369J0851r081j7467
15018A191694J903J0671R447L738P606Q205M932j5494j2294J6829R252r790l817
15005A222882R7M940p513j1969m004K1752J8390j213j689q849K490M497r110k993
14991A227708P461m587J0598P402p852M987O931k981l228R598J2345m171j4259
14978A249952N654k192l612K945P792J1031N201M165J0647J991r753r749K078
14965A276150j409k820k153M913P7j1170O502J0781j0054k33J1880J004o081O51
14951A278038K519R742j1270r131J6418N223K049R039P060m75K422M288o327k182
$$ plain form
14937 1307413 1306481 1299604 1301121 1294631 1283324 1290223 1311822 1315823 1312445 1303639 1307771 1313637 1311836 1306388
14923 1306388 1313270 1316157 1333576 1346210 1336623 1324538 1331254 1329590 1330605 1325938 1326913 1332224 1318168
14910 1318168 1296521 1301773 1313762 1319657 1318493 1333741 1336951 1341199 1342936 1342795 1348001 1351362 1363954
14897 1363954 1349900 1340671 1335385 1344461 1345035 1345641 1352597 1357555 1364595 1365839 1356397 1351106 1350601 1340883
14883 1340883 1334960 1345337 1356875 1375952 1356716 1351004 1358790 1375942 1381183 1370303 1363066 1355557
14871 1355557 1368382 1369618 1363030 1362503 1369144 1365202 1378514 1395434 1400432 1394744 1410734 1416680 1405272
14858 1405272 1397304 1394864 1399029 1399901 1412008 1400229 1372123 1359740 1374501 1377921 1375895 1368492 1372769
14845 1372769 1393285 1405588 1402008 1399978 1400048 1406583 1423235 1433346 1429907 1431693 1446390 1447462 1438176
$$ packed form
14937A307413r32o877J517o490j1307O899K1599M001l378q806M132N866j801n448
14923A306388O882K887J7419J2634r587j2085O716j664J015m667R75N311j4056
14910A318168k1647N252J1989N895j164J5248L210M248J737j41N206L361J2592
14897A363954j4054r229n286R076N74O06O956M958P040J244r442n291n05r718
14883A340883n923J0377J1538J9077j9236n712P786J7152N241j0880p237p509
14871A355557J2825J236o588n27O641l942J3312J6920M998n688J5990N946j1408
14858A405272p968k440M165Q72J2107j1779k8106j2383J4761L420k026p403M277
14845A372769K0516J2303l580k030P0O535J6652J0111l439J786J4697J072r286
$$ plain form
14832 1438176 1431483 1390002 1339460 1328454 1342146 1342386 1339824 1350150 1362748 1370450 1371189 1376925 1384435
14819 1384435 1388002 1376555 1368100 1389991 1393358 1399322 1405471 1397089 1393342 1394845 1397645 1411892 1408010
14806 1408010 1416501 1414923 1406455 1417270 1427515 1413104 1405678 1404721 1411061 1425650 1426660 1429345 1420718
14793 1420718 1431424 1434296 1431748 1427538 1434285 1454326 1446263 1452936 1457026 1440192 1436933 1440160 1443405
14780 1443405 1454104 1464326 1470177 1477911 1486100 1482619 1472389 1477069 1475822 1473031 1496709 1490754 1486307
14767 1486307 1485015 1480661 1483857 1492574 1507035 1513940 1510788 1507176 1482750 1468839 1474219 1481102 1495264
14754 1495264 1486191 1496297 1505026 1504013 1502011 1498901 1496957 1491621 1500464 1506103 1514052 1511677 1509251 1510618
14740 1510618 1520870 1519097 1518828 1521593 1527168 1529556 1535158 1546222 1544595 1525432 1530662 1530150 1538035 1549086
$$ packed form
14832A438176o693m1481n0542j1006J3692K40k562J0326J2598P702P39N736P510
14819A384435L567j1447q455K1891L367N964O149q382l747J503K800J4247l882
14806A408010Q491j578q468J0815J0245j4411p426r57O340J4589J010K685q627
14793A420718J0706K872k548m210O747K0041q063O673M090j6834l259L227L245
14780A443405J0699J0222N851P734Q189l481j0230M680j247k791K3678n955m447
14767A486307j292m354L196Q717J4461O905l152l612k4426j3911N380O883J4162
14754A495264r073J0106Q729j013k002l110j944n336Q843N639P949k375k426J367
14740A510618J0252j773k69K765N575K388N602J1064j627j9163N230n12P885J1051
$$ plain form
14726 1549086 1549254 1547522 1547200 1546455 1551273 1553399 1575744 1580385 1572377 1564765 1567319 1573548 1577099 1571884
14712 1571884 1576048 1600816 1610552 1600553 1597996 1589343 1589887 1593300 1607171 1618433 1619007 1615060 1618616 1620692
14698 1620692 1620505 1631341 1629494 1617435 1591443 1595534 1605032 1588686 1593880 1604446 1617772 1612734 1622106
14685 1622106 1627511 1614041 1610162 1617009 1630059 1631169 1635425 1626060 1614226 1626742 1627082 1613596 1608201
14672 1608201 1617913 1631858 1639737 1649363 1644215 1639741 1653855 1655152 1646378 1641480 1645550 1645170 1654439 1664668
14658 1664668 1676517 1688016 1697359 1692731 1697623 1706836 1707736 1707754 1701232 1693755 1698377 1697930 1691992 1691717 1696461
14643 1696461 1711099 1713931 1708691 1708497 1709503 1715051 1712070 1716637 1734843 1730030 1717834 1714439 1710612
14630 1710612 1719039 1724733 1718103 1727196 1734906 1742793 1745815 1745827 1745084 1755802 1759758 1750283 1739565 1744391
$$ packed form
14726A549086J68j732l22p45M818K126K2345M641q008p612K554O229L551n215
14712A571884M164K4768R736r999k557q653N44L413J3871J1262N74l947L556K076
14698A620692j87J0836j847j2059k5992M091R498j6346N194J0566J3326n038R372
14685A622106N405j3470l879O847J3050J110M256r365j1834J2516L40j3486n395
14672A608201R712J3945P879R626n148m474J4114J297q774m898M070l80R269J0229
14658A664668J1849J1499R343m628M892R213R00J8o522p477M622m47n938k75M744
14643A696461J4638K832n240j94J006N548k981M567J8206m813j2196l395l827
14630A710612Q427N694o630R093P710P887L022J2p43J0718L956r475j0718M826
$$ plain form
14616 1744391 1737382 1736243 1738390 1735598 1753979 1773095 1773970 1766778 1777691 1785356 1794405 1785579 1785507 1778705
14602 1778705 1773203 1791469 1809775 1810034 1811318 1810284 1806203 1816089 1831182 1840508 1839873 1820807 1822201
14589 1822201 1822032 1813900 1802424 1814774 1815376 1824931 1822897 1831718 1842052 1827432 1817566 1827173 1837243
14576 1837243 1841746 1849064 1851430 1855582 1865906 1865348 1868409 1864412 1862678 1870753 1892664 1905319 1895082
14563 1895082 1892334 1899057 1894891 1884388 1868247 1885782 1901000 1904666 1914143 1922186 1930572 1923173 1903651
14550 1903651 1885080 1888118 1895567 1908763 1912873 1915839 1916597 1928108 1933024 1936580 1940783 1941731 1933714 1939787
14536 1939787 1967077 1974789 1982353 1985306 1977429 1963625 1963812 1965255 1960853 1968485 1973113 1983583 1987222
14523 1987222 1999144 2000778 2009091 2007176 2008681 2019836 2037877 2036570 2036935 2035114 2038473 2048203 2049036 2048007
$$ packed form
14616A744391p009j139K147k792J8381J9116Q75p192J0913P665R049q826p2o802
14602A778705n502J8266J8306K59J284j034m081R886J5093R326o35j9066J394
14589A822201j69q132j1476J2350O02R555k034Q821J0334j4620r866R607J0070
14576A837243M503P318K366M152J0324n58L061l997j734Q075K1911J2655j0237
14563A895082k748O723m166j0503j6141J7535J5218L666R477Q043Q386p399j9522
14550A903651j8571L038P449J3196M110K966P58J1511M916L556M203R48q017O073
14536A939787K7290P712P564K953p877j3804J87J443m402P632M628J0470L639
14523A987222J1922J634Q313j915J505J1155J8041j307L65j821L359R730Q33j029
$$ plain form
14509 2048007 2066836 2076740 2053826 2051365 2075043 2090003 2077468 2079746 2087385 2098004 2100549 2090922
14497 2090922 2093296 2101960 2111466 2106911 2109690 2110217 2113469 2121668 2150515 2156846 2148214 2139565 2136635 2132846
14483 2132846 2140505 2147553 2145926 2146359 2161219 2170150 2189886 2203747 2211545 2223434 2218172 2213187 2206774
14470 2206774 2211930 2229918 2244217 2240761 2249383 2276094 2277044 2265116 2263197 2279567 2286771 2295820 2308444
14457 2308444 2299562 2300238 2318594 2339728 2354787 2363846 2365470 2373781 2400014 2399334 2403605 2425823 2447657
14444 2447657 2464658 2477403 2511602 2541869 2556449 2587472 2629934 2680151 2750946 2838565 2957192
14433 2957192 3078312 3135149 3043660 2636931 2080868 1701777 1524922 1501703 1553768 1642207
14423 1642207 1709146 1759173 1812974 1875144 1924440 1956644 1979274 2012963 2039832 2065733 2095333
$$ packed form
14509B048007J8829R904k2914k461K3678J4960j2535K278P639J0619K545r627
14497B090922K374Q664R506m555K779N27L252Q199K8847O331q632q649k930l789
14483B132846P659P048j627M33J4860Q931J9736J3861P798J1889n262m985o413
14470B206774N156J7988J4299l456Q622K6711R50j1928j919J6370P204R049J2624
14457B308444q882O76J8356K1134J5059R059J624Q311K6233o80M271K2218K1834
14444B447657J7001J2745L4199L0267J4580L1023M2462N0217P0795Q7619J18627
14433B957192J21120N6837r1489m06729n56063l79091j76855k3219N2065Q8439
14423A642207O6939N0027N3801O2170M9296L2204K2630L3689K6869K5901K9600
$$ plain form
14412 2095333 2109763 2127438 2141980 2143500 2135286 2142458 2143187 2160337 2172112 2175950 2185229 2198738 2218196
14399 2218196 2222787 2234604 2252567 2278459 2291297 2299543 2313076 2315297 2302721 2309500 2306667 2308841
14387 2308841 2321144 2338688 2339466 2340001 2346020 2371271 2378548 2363412 2366628 2366405 2378055 2380373 2386381
14374 2386381 2389698 2389550 2412972 2434134 2443168 2455690 2454222 2450042 2448224 2455048 2458395 2453513 2462623
14361 2462623 2488670 2499566 2503322 2498241 2494006 2514012 2522902 2517582 2527810 2526326 2533160 2561304 2574642
14348 2574642 2576384 2574429 2589256 2602010 2610442 2608805 2601369 2610125 2615097 2605134 2614888 2638622 2634080
14335 2634080 2647512 2663644 2663556 2668945 2685828 2689677 2699605 2710390 2721109 2712818 2704369 2705324 2716096
14322 2716096 2740151 2753828 2750899 2751997 2756445 2752936 2748118 2750668 2768333 2787018 2785675 2797732 2806738
$$ packed form
14412B095333J4430J7675J4542J520q214P172P29J7150J1775L838R279J3509J9458
14399B218196M591J1817J7963K5892J2838Q246J3533K221j2576O779k833K174
14387B308841J2303J7544P78N35O019K5251P277j5136L216k23J1650K318O008
14374B386381L317j48K3422K1162R034J2522j468m180j818O824L347m882R110
14361B462623K6047J0896L756n081m235K0006Q890n320J0228j484O834K8144J3338
14348B574642J742j955J4827J2754Q432j637p436Q756M972r963R754K3734m542
14335B634080J3432J6132q8N389J6883L849R928J0785J0719q291q449R55J0772
14322B716096K4055J3677k929J098M448l509m818K550J7665J8685j343J2057R006
$$ plain form
14309 2806738 2817344 2830900 2828670 2818371 2804836 2815478 2829110 2850506 2864935 2887046 2902634
14298 2902634 2894780 2889410 2889400 2891056 2910526 2929284 2929988 2939784 2952679 2966037 2968608 2963891 2978688
14285 2978688 2975144 2973302 2984087 3010852 3003505 3001348 3005855 3016362 3024798 3051895 3061159 3063913 3078280
14272 3078280 3094774 3109453 3119083 3110426 3126823 3138990 3142149 3150257 3146296 3145180 3146292 3161012 3182543
14259 3182543 3199725 3213628 3231242 3231332 3246072 3257630 3255156 3247598 3242490 3251135 3265550 3271519 3288423
14246 3288423 3293284 3307773 3318786 3319618 3315954 3331677 3351507 3381287 3397741 3395602 3388200 3386835 3419824
14233 3419824 3455599 3473451 3483158 3493199 3493865 3495972 3481629 3488738 3516180 3529457 3547184 3551210
14221 3551210 3565155 3582002 3599823 3599710 3610294 3627363 3634948 3661480 3684936 3697747 3701240 3711532
$$ packed form
14309B806738J0606J3556k230j0299j3535J0642J3632K1396J4429K2111J5588
14298B902634p854n370j0J656J9470J8758P04R796J2895J3358K571m717J4797
14285B978688l544j842J0785K6765p347k157M507J0507Q436K7097R264K754J4367
14272C078280J6494J4679R630q657J6397J2167L159Q108l961j116J112J4720K1531
14259C182543J7182J3903J7614R0J4740J1558k474p558n108Q645J4415N969J6904
14246C288423M861J4489J1013Q32l664J5723J9830K9780J6454k139p402j365L2989
14233C419824L5775J7852R707J0041O66K107j4343P109K7442J3277J7727M026
14221C551210J3945J6847J7821j13J0584J7069P585K6532K3456J2811L493J0292
$$ plain form
14209 3711532 3735465 3768994 3797229 3804411 3829936 3845613 3869237 3903635 3920765 3900059 3889478
14198 3889478 3857231 3783951 3750067 3763474 3789654 3807942 3822526 3839325 3873982 3902521 3905964
14187 3905964 3915440 3949106 3960084 3962225 3983394 3996559 4018590 4049045 4069103 4100698 4129046 4127854
14175 4127854 4132095 4150035 4173353 4181008 4175347 4175646 4192716 4220344 4224168 4230027 4244285 4267582 4278941
14162 4278941 4301519 4331299 4366125 4385988 4420183 4448851 4461104 4480856 4496689 4518559 4506513
14151 4506513 4498428 4497791 4507055 4542806 4593474 4634640 4661326 4719078 4760399 4764255 4752971 4742751
14139 4742751 4712366 4704281 4723745 4758149 4821165 4871272 4903867 4921754 4942171 4971653 4990333
14128 4990333 4977981 4977563 4987938 5018663 5063558 5113851 5164890 5194364 5231828 5255385 5278808 5294259
$$ packed form
14209C711532K3933L3529K8235P182K5525J5677K3624L4398J7130k0706j0581
14198C889478l2247p3280l3884J3407K6180J8288J4584J6799L4657K8539L443
14187C905964R476L3666J0978K141K1169J3165K2031L0455K0058L1595K8348j192
14175D127854M241J7940K3318P655n661K99J7070K7628L824N859J4258K3297J1359
14162D278941K2578K9780L4826J9863L4195K8668J2253J9752J5833K1870j2046
14151D506513q085o37R264L5751N0668M1166K6686N7752M1321L856j1284j0220
14139D742751l0385q085J9464L4404O3016N0107L2595J7887K0417K9482J8680
14128D990333j2352m18J0375L0725M4895N0293N1039K9474L7464K3557K3423J5451
$$ plain form
14116 5294259 5309864 5331592 5357406 5374425 5394325 5418882 5459319 5510917 5560283 5598640 5636336
14105 5636336 5666746 5674563 5688308 5711530 5767806 5829048 5873461 5890015 5898178 5926561 5955834 5994989
14093 5994989 6029055 6067536 6112081 6153907 6204935 6228399 6273329 6307000 6320495 6360027 6411056
14082 6411056 6469721 6529882 6592406 6655504 6722645 6795730 6882418 6947447 7004282 7067969 7137996
14071 7137996 7176215 7170110 7130340 7091669 7079693 7086582 7119906 7170085 7215830 7284959 7324094 7389961
14059 7389961 7472605 7530147 7596330 7668252 7740240 7810664 7874844 7946952 8000542 8056546 8126849
14048 8126849 8209783 8278298 8351646 8441766 8519442 8589658 8652670 8739692 8819421 8910794 9021538
14037 9021538 9139620 9235074 9331120 9419502 9509034 9603803 9702617 9822826 9936203 10026443 10136421
$$ packed form
14116E294259J5605K1728K5814J7019J9900K4557M0437N1598M9366L8357L7696
14105E636336L0410P817J3745K3222N6276O1242M4413J6554Q163K8383K9273L9155
14093E994989L4066L8481M4545M1826N1028K3464M4930L3671J3495L9532N1029
14082F411056N8665O0161O2524O3098O7141P3085Q6688O5029N6835O3687P0027
14071G137996L8219o105l9770l8671j1976O889L3324N0179M5745O9129L9135O5867
14059G389961Q2644N7542O6183P1922P1988P0424O4180P2108N3590N6004P0303
14048H126849Q2934O8515P3348R0120P7676P0216O3012Q7022P9729R1373J10744
14037I021538J18082R5454R6046Q8382Q9532R4769R8814J20209J13377R0240J09978
$$ plain form
14026 10136421 10260440 10372465 10489392 10611653 10727931 10840989 10961035 11083161 11221535
14017 11221535 11367785 11526938 11678893 11828870 11982850 12155557 12336459 12528850 12719734
14008 12719734 12906283 13096320 13290860 13476582 13676174 13866884 14069614 14313596 14563065
13999 14563065 14816577 15077869 15354172 15638806 15928994 16233071 16530031 16817236 17131458
13990 17131458 17506988 17917315 18328674 18748719 19158216 19574042 20017891 20492288 20982627
13981 20982627 21509595 22086432 22714118 23354872 24052568 24799706 25611395 26471819 27392130
13972 27392130 28363831 29390784 30496752 31701806 32997565 34436094 36015813 37750326
13964 37750326 39655885 41715905 43793041 45726844 47829001 50503032 53831031 57847214
$$ packed form
14026A0136421J24019J12025J16927J22261J16278J13058J20046J22126J38374
14017A1221535J46250J59153J51955J49977J53980J72707J80902J92391J90884
14008A2719734J86549J90037J94540J85722J99592J90710K02730K43982K49469
13999A4563065K53512K61292K76303K84634K90188L04077K96960K87205L14222
13990A7131458L75530M10327M11359M20045M09497M15826M43849M74397M90339
13981B0982627N26968N76837O27686O40754O97696P47138Q11689Q60424R20311
13972B7392130R71701J026953J105968J205054J295759J438529J579719J734513
13964C7750326J905559K060020K077136J933803K102157K674031L327999M016183
$$ plain form
13956 57847214 62601816 68222905 74920718 82982978 92697690 104471094 119009837 136745573
13948 136745573 157084284 174691602 165976607 91609182 -25633581 -110852573 -147269051
13941 -147269051 -152275047 -140612374 -124607848 -109902442 -97655232 -87488889 -78976337
13934 -78976337 -71796263 -65668069 -60358242 -55729004 -51680819 -48123017 -45130264 -42883677
13926 -42883677 -41133625 -39421396 -37657695 -35901067 -34244208 -32705041 -31262884 -29921809
13918 -29921809 -28710022 -27600139 -26565349 -25629325 -24763624 -23966781 -23216454 -22506135 -21821297
13909 -21821297 -21175321 -20576708 -19996041 -19427320 -18872742 -18346343 -17853809 -17391941 -16962705
13900 -16962705 -16552153 -16157797 -15789274 -15424636 -15070793 -14731430 -14407530 -14101583 -13821269
$$ packed form
13956E7847214M754602N621089O697813Q062260R714712J1773404J4538743J7735736
13948A36745573K0338711J7607318q714995p4367425j17242763q5218992l6416478
13941a47269051n005996J1662673J6004526J4705406J2247210J0166343Q512552
13934g8976337P180074O128194N309827M629238M048185L557802K992753K246587
13926d2883677J750052J712229J763701J756628J656859J539167J442157J341075
13918b9921809J211787J109883J034790R36024Q65701P96843P50327P10319O84838
13909b1821297O45976N98613N80667N68721N54578N26399M92534M61868M29236
13900a6962705M10552L94356L68523L64638L53843L39363L23900L05947K80314
$$ plain form
13891 -13821269 -13549546 -13282006 -13026531 -12769711 -12522378 -12294304 -12069044 -11840600 -11620671
13882 -11620671 -11420206 -11233650 -11026039 -10829045 -10660900 -10492532 -10320647 -10163424 -10007571
13873 -10007571 -9847996 -9691588 -9550735 -9414851 -9272982 -9128711 -8974361 -8823565 -8685995
13864 -8685995 -8556458 -8438594 -8303313 -8168313 -8057230 -7952954 -7844623 -7741146 -7639174
13855 -7639174 -7524789 -7444188 -7368533 -7272000 -7172683 -7081509 -7002254 -6913323 -6805015 -6690282 -6583499
13844 -6583499 -6504853 -6438669 -6352813 -6280046 -6256353 -6264022 -6257896 -6228165 -6177450 -6090090 -6011859 -5942228
13832 -5942228 -5870027 -5781016 -5704931 -5628135 -5565755 -5495702 -5444601 -5399670 -5342742 -5288308 -5226359
13821 -5226359 -5165930 -5072611 -4934948 -4829749 -4792078 -4780181 -4775830 -4776091 -4749760 -4700335 -4647461
$$ packed form
13891a3821269K71723K67540K55475K56820K47333K28074K25260K28444K19929
13882a1620671K00465J86556K07611J96994J68145J68368J71885J57223J55853
13873a0007571J59575J56408J40853J35884J41869J44271J54350J50796J37570
13864h685995J29537J17864J35281J35000J11083J04276J08331J03477J01972
13855g639174J14385Q0601P5655R6533R9317R1174P9255Q8931J08308J14733J06783
13844f583499P8646O6184Q5856P2767K3693p669O126K9731N0715Q7360P8231O9631
13832e942228P2201Q9011P6085P6796O2380P0053N1101M4931N6928N4434O1949
13821e226359O0429R3319J37663J05199L7671J1897M351k61K6331M9425N2874
$$ plain form
13810 -4647461 -4624737 -4591145 -4563865 -4527416 -4483988 -4455266 -4419655 -4382843 -4337662 -4299232 -4277558
13799 -4277558 -4246614 -4196245 -4151582 -4107406 -4060057 -4009804 -3965965 -3927386 -3898495 -3859599 -3799512
13788 -3799512 -3755733 -3735306 -3708410 -3688851 -3667986 -3635974 -3618832 -3600618 -3565682 -3527502 -3494296
13777 -3494296 -3460676 -3426127 -3388589 -3364474 -3339863 -3311591 -3284223 -3254564 -3224870 -3196707 -3181756
13766 -3181756 -3189083 -3164692 -3135358 -3134756 -3123920 -3085491 -3044902 -3012156 -2986485 -2950097 -2913526 -2897848
13754 -2897848 -2913431 -2943861 -2953870 -2919202 -2855117 -2789027 -2726555 -2682847 -2641597 -2613880 -2624292
13743 -2624292 -2642358 -2638579 -2622657 -2614948 -2590131 -2559206 -2530480 -2500381 -2464222 -2433407 -2402178 -2389443
13731 -2389443 -2387570 -2366832 -2341207 -2322566 -2309914 -2302610 -2293416 -2268259 -2246097 -2227752 -2212613 -2190468
$$ packed form
13810d647461K2724L3592K7280L6449M3428K8722L5611L6812M5181L8430K1674
13799d277558L0944N0369M4663M4176M7349N0253M3839L8579K8891L8896O0087
13788c799512M3779K0427K6896J9559K0865L2012J7142J8214L4936L8180L3206
13777c494296L3620L4549L7538K4115K4611K8272K7368K9659K9694K8163J4951
13766c181756p327K4391K9334O02J0836L8429M0589L2746K5671L6388L6571J5678
13754b897848j5583l0430j0009L4668O4085O6090O2472M3708M1250K7717j0412
13743b624292j8066L779J5922P709K4817L0925K8726L0099L6159L0815L1229J2735
13731b389443J873K0738K5625J8641J2652P304R194K5157K2162J8345J5139K2145
$$ plain form
13719 -2190468 -2169156 -2153851 -2132745 -2106581 -2072321 -2046394 -2035352 -2022064 -2023719 -2016483 -2006558 -2016971
13707 -2016971 -2004330 -1982592 -1962967 -1943555 -1914781 -1883182 -1866278 -1843352 -1834543 -1814178 -1801915
13696 -1801915 -1810052 -1809797 -1815692 -1795601 -1753254 -1735064 -1727282 -1725853 -1718450 -1705416 -1703391 -1673128 -1638916
13683 -1638916 -1616925 -1601787 -1585686 -1579341 -1571233 -1576626 -1584764 -1588119 -1572475 -1554134 -1543622 -1538102
13671 -1538102 -1517689 -1486800 -1467394 -1462557 -1447820 -1429907 -1420905 -1428979 -1428380 -1409229 -1399923 -1386919
13659 -1386919 -1378156 -1373966 -1359066 -1349585 -1333964 -1331369 -1328350 -1306066 -1292486 -1287575 -1268018 -1250015
13647 -1250015 -1261032 -1258146 -1249124 -1217641 -1187906 -1168047 -1159601 -1160041 -1147938 -1144354 -1133875 -1126616 -1108371
13634 -1108371 -1096199 -1065926 -1043184 -1029564 -1021593 -1011597 -1016507 -1014090 -1004267 -1004855 -1005576 -1001210 -990294
$$ packed form
13719b190468K1312J5305K1106K6164L4260K5927J1042J3288j655P236R925j0413
13707b016971J2641K1738J9625J9412K8774L1599J6904K2926Q809K0365J2263
13696a801915q137K55n895K0091M2347J8190P782J429P403J3034K025L0263L4212
13683a638916K1991J5138J6101O345Q108n393q138l355J5644J8341J0512N520
13671a538102K0413L0889J9406M837J4737J7913R002q074N99J9151R306J3004
13659a386919Q763M190J4900R481J5621K595L019K2284J3580M911J9557J8003
13647a250015j1017K886R022L1483K9735J9859Q446m40J2103L584J0479P259J8245
13634a108371J2172L0273K2742J3620P971R996m910K417R823n88p21M366J0916
$$ plain form
13621 -990294 -976058 -955636 -946663 -948857 -934175 -932586 -919202 -907465 -892055 -884535 -878887 -865463
13609 -865463 -851695 -842194 -832997 -818088 -819840 -818023 -797078 -794541 -784013 -775109 -762874 -748465 -733249
13596 -733249 -726618 -704620 -673516 -661433 -669479 -679974 -684769 -679562 -682076 -673754 -659304 -643001 -639064
13583 -639064 -639984 -632731 -619068 -601733 -576049 -574389 -567925 -558553 -555602 -547532 -533214 -528985 -545134
13570 -545134 -533218 -516300 -522925 -517533 -499880 -474558 -459390 -467952 -464973 -455720 -447183 -435887 -435402
13557 -435402 -440313 -428805 -416140 -403003 -380282 -363145 -365637 -367570 -343402 -324335 -312047 -316813
13545 -316813 -324723 -317168 -298374 -289684 -298888 -307179 -274457 -253347 -252664 -266367 -268688 -270323 -267485
13532 -267485 -253813 -230593 -217308 -205801 -198498 -195297 -200200 -199869 -194998 -169184 -147771 -132893 -126374
$$ packed form
13621i90294J4236K0422Q973k194J4682J589J3384J1737J5410P520N648J3424
13609h65463J3768R501R197J4909j752J817K0945K537J0528Q904J2235J4409J5216
13596g33249O631K1998L1104J2083q046j0495m795N207k514Q322J4450J6303L937
13583f39064r20P253J3663J7335K5684J660O464R372K951Q070J4318M229j6149
13570e45134J1916J6918o625N392J7653K5322J5168q562K979R253Q537J1296M85
13557d35402m911J1508J2665J3137K2721J7137k492j933K4168J9067J2288m766
13545c16813p910P555J8794Q690r204q291L2722K1110O83j3703k321j635K838
13532b67485J3672K3220J3285J1507P303L201m903L31M871K5814K1413J4878O519
$$ plain form
13519 -126374 -126415 -120918 -113631 -112968 -121182 -106921 -98004 -88689 -88823 -66697 -45850 -41386 -39867 -39601 -29434
13504 -29434 -786 19564 20179 9013 17969 38380 53580 48541 47579 49985 65550 70293 64540
13491 64540 85948 111280 127452 127314 140984 161141 185863 207277 210699 207872 212372 234956 251016
13478 251016 252712 263224 264311 270656 278523 293504 316579 320882 333483 360515 385037 402065
13466 402065 417744 453496 500129 525431 568118 607434 656460 717933 797334 903825 1018473
13455 1018473 1104272 1069680 768857 213418 -245490 -473778 -544284 -493692 -413932 -330224
13445 -330224 -254136 -191176 -147414 -106269 -71257 -25268 7492 38693 88713 112330 121438 128460
13433 128460 128613 144916 163887 184430 224794 246908 255136 267757 265289 262594 279136 291386
$$ packed form
13519a26374m1N497P287O63q214J4261Q917R315j34K2126K0847M464J519K66J0167
13504b9434K8648K0350O15j1166Q956K0411J5200n039r62K406J5565M743n753
13491F4540K1408K5332J6172j38J3670K0157K4722K1414L422k827M500K2584J6060
13478B51016J696J0512J087O345P867J4981K3075M303J2601K7032K4522J7028
13466D02065J5679L5752M6633K5302M2687L9316M9026O1473P9401J06491J14648
13455A018473Q5799l4592l00823n55439m58908k28288p0506N0592P9760Q3708
13445c30224P6088O2960M3762M1145L5012M5989L2760L1201N0020K3617R108P022
13433A28460J53J6303J8971K0543M0364K2114Q228J2621k468k695J6542J2250
$$ plain form
13421 291386 294248 298390 316625 327525 346876 375218 387669 382247 367545 372687 382741 398885
13409 398885 416941 415782 420231 445726 460782 455158 469362 476391 500601 506186 513360 521224 519971
13396 519971 510357 525588 551483 556207 552724 575753 574567 565999 579036 581274 590795 597376 601587
13383 601587 627221 650700 659313 669872 673949 674878 673441 677141 703467 709886 698615 696933 704843
13370 704843 710122 712629 716456 736077 755500 774932 782116 781289 785095 795355 814809 823431 818585
13357 818585 813371 814589 838123 850055 843088 859280 889280 895858 897187 886676 887251 899255 915666
13344 915666 925355 935904 956510 961270 961909 971345 975416 967306 974173 971162 986553 993552 1001850 1013900
13330 1013900 1032082 1046579 1065898 1085855 1091918 1103832 1105240 1115707 1124885 1137332 1135509 1136032
$$ packed form
13421B91386K862M142J8235J0900J9351K8342J2451n422j4702N142J0054J6144
13409C98885J8056j159M449K5495J5056n624J4204P029K4210N585P174P864j253
13396E19971r614J5231K5895M724l483K3029j186q568J3037K238R521O581M211
13383F01587K5634K3479Q613J0559M077R29j437L700K6326O419j1271j682P910
13370G04843N279K507L827J9621J9423J9432P184q27L806J0260J9454Q622m846
13357H18585n214J218K3534J1932o967J6192L0000O578J329j0511N75J2004J6411
13344I15666R689J0549K0606M760O39R436M071q110O867l011J5391O999Q298J2050
13330A013900J8182J4497J9319J9957O063J1914J408J0467R178J2447j823N23
$$ plain form
13318 1136032 1158774 1170684 1183044 1191095 1201386 1217922 1225494 1212554 1226157 1243430 1280738 1312226
13306 1312226 1312315 1326037 1355718 1368696 1392276 1400278 1419380 1442872 1480988 1503991 1529763 1549410
13294 1549410 1583403 1606958 1643656 1695989 1768513 1840809 1931687 2034489 2146477 2289376 2449493
13283 2449493 2603253 2672783 2368024 1493261 645426 214638 90591 145245 261311 385519
13273 385519 511972 612678 707793 789148 843524 875130 905161 940131 966888 1007014 1044117
13262 1044117 1076844 1083120 1109809 1143188 1163042 1174753 1208524 1222550 1235305 1243537 1263628 1269159
13250 1269159 1283115 1310285 1330416 1345968 1364064 1373813 1390476 1404217 1405160 1428243 1437000 1460155
13238 1460155 1491897 1512813 1529895 1535558 1533376 1522076 1509215 1496608 1494809 1494058 1503217 1509664 1533139
$$ packed form
13318A136032K2742J1910J2360Q051J0291J6536P572j2940J3603J7273L7308L1488
13306A312226Q9J3722K9681J2978K3580Q002J9102K3492L8116K3003K5772J9647
13294A549410L3993K3555L6698N2333P2524P2296R0878J02802J11988J42899J60117
13283B449493J53760O9530l04759q74763q47835m30788j24047N4654J16066J24208
13273C85519J26453J00706R5115Q1355N4376L1606L0031L4970K6757M0126L7103
13262A044117L2727O276K6689L3379J9854J1711L3771J4026J2755Q232K0091N531
13250A269159J3956K7170K0131J5552J8096R749J6663J3741R43K3083Q757K3155
13238A460155L1742K0916J7082N663k182j1300j2861j2607j799p51R159O447K3475
$$ plain form
13225 1533139 1538871 1562376 1582112 1597882 1616777 1625604 1623469 1642679 1656330 1663564 1673236 1690843
13213 1690843 1701731 1705906 1713716 1746405 1762941 1761719 1780098 1798538 1805589 1815255 1824903 1822085 1834815
13200 1834815 1851355 1861842 1867916 1883385 1885879 1886570 1894611 1910598 1930232 1939315 1941951 1957208 1979303
13187 1979303 1989561 1990464 1991762 1992833 2001166 2009793 2019999 2034444 2056062 2072461 2089151 2101530
13175 2101530 2108414 2133179 2140545 2150974 2164367 2176217 2186800 2192868 2203244 2225581 2237920 2250126
13163 2250126 2240302 2247428 2264778 2292354 2321118 2329002 2332576 2337892 2349111 2368979 2377379 2388030
13151 2388030 2404028 2416177 2421652 2437258 2470719 2472090 2485104 2499492 2502605 2506983 2520395 2550885
13139 2550885 2575337 2581138 2593866 2604641 2628326 2643684 2663007 2692652 2696177 2692019 2703968 2718746
$$ packed form
13225A533139N732K3505J9736J5770J8895Q827k135J9210J3651P234R672J7607
13213A690843J0888M175P810L2689J6536j222J8379J8440P051R666R648k818J2730
13200A834815J6540J0487O074J5469K494O91Q041J5987J9634R083K636J5257K2095
13187A979303J0258R03J298J071Q333Q627J0206J4445K1618J6399J6690J2379
13175B101530O884K4765P366J0429J3393J1850J0583O068J0376K2337J2339J2206
13163B250126r824P126J7350K7576K8764P884L574N316J1219J9868Q400J0651
13151B388030J5998J2149N475J5606L3461J371J3014J4388L113M378J3412L0490
13139B550885K4452N801J2728J0775K3685J5358J9323K9645L525m158J1949J4778
$$ plain form
13127 2718746 2715532 2710832 2727175 2737123 2730793 2744548 2755249 2761464 2776276 2798941 2813892 2828623
13115 2828623 2846975 2881709 2889756 2904425 2915734 2938113 2946906 2954626 2980584 3006937 3019607 3033248
13103 3033248 3056203 3079320 3093294 3110089 3114019 3117213 3140096 3161891 3184923 3213835 3237427 3241732
13091 3241732 3253468 3261997 3260449 3276489 3304178 3323042 3350515 3373675 3410982 3456149 3488184 3516453
13079 3516453 3545454 3586570 3614872 3637194 3665938 3693506 3726740 3738220 3721221 3710261 3629023
13068 3629023 3519415 3480084 3482468 3513406 3559341 3596834 3632551 3674352 3714378 3742426 3766329
13057 3766329 3800454 3824622 3848311 3862152 3890447 3915933 3936605 3963040 3986760 4020132 4048064
13046 4048064 4070341 4108681 4117649 4125148 4150995 4172021 4198452 4226497 4255765 4278336 4291993 4315411
$$ packed form
13127B718746l214m700J6343R948o330J3755J0701O215J4812K2665J4951J4731
13115B828623J8352L4734Q047J4669J1309K2379Q793P720K5958K6353J2670J3641
13103C033248K2955K3117J3974J6795L930L194K2883K1795K3032K8912K3592M305
13091C241732J1736Q529j548J6040K7689J8864K7473K3160L7307M5167L2035K8269
13079C516453K9001M1116K8302K2322K8744K7568L3234J1480j6999j0960q1238
13068C629023j09608l9331K384L0938M5935L7493L5717M1801M0026K8048K3903
13057C766329L4125K4168K3689J3841K8295K5486K0672K6435K3720L3372K7932
13046D048064K2277L8340Q968P499K5847K1026K6431K8045K9268K2571J3657K3418
$$ plain form
13034 4315411 4352417 4389412 4431378 4467140 4489868 4537217 4582485 4618425 4634983 4646357 4664044
13023 4664044 4664391 4672539 4684078 4694309 4717990 4754046 4816560 4893737 4959834 4989295 4990343 4961730
13011 4961730 4925912 4909521 4897765 4937259 5021707 5100300 5178067 5226829 5254452 5286621 5303312
13000 5303312 5323853 5345914 5389821 5421026 5471224 5525345 5586650 5635145 5691590 5742600 5794111
12989 5794111 5835210 5872516 5890896 5902331 5939494 5974481 6007887 6058003 6128443 6185210 6227090
12978 6227090 6286182 6348559 6392415 6437748 6500746 6561765 6617876 6664531 6712987 6757019 6798272
12967 6798272 6839069 6876435 6906191 6949003 7009776 7063518 7118990 7190405 7245671 7300840 7373347
12956 7373347 7431919 7492962 7582750 7683048 7774439 7861101 7961336 8045587 8151188 8251113 8353528
$$ packed form
13034D315411L7006L6995M1966L5762K2728M7349M5268L5940J6558J1374J7687
13023D664044L47Q148J1539J0231K3681L6056O2514P7177O6097K9461J048k8613
13011D961730l5818j6391j1756L9494Q4448P8593P7767M8762K7623L2169J6691
13000E303312K0541K2061M3907L1205N0198N4121O1305M8495N6445N1010N1511
12989E794111M1099L7306J8380J1435L7163L4987L3406N0116P0440N6767M1880
12978F227090N9092O2377M3856M5333O2998O1019N6111M6655M8456M4032M1253
12967F798272M0797L7366K9756M2812O0773N3742N5472P1415N5266N5169P2507
12956G373347N8572O1043Q9788J00298R1391Q6662J00235Q4251J05601R9925J02415
$$ plain form
12945 8353528 8465144 8566513 8641218 8658663 8599783 8531933 8493125 8505212 8543516 8603716 8690464
12934 8690464 8775368 8855212 8942317 9036219 9135197 9216831 9313253 9416918 9506452 9613930 9714822
12923 9714822 9812195 9922226 10022733 10138262 10247946 10349386 10472670 10614924 10738677 10848081
12913 10848081 10970013 11082960 11211494 11358421 11502297 11644851 11789512 11933296 12074291
12904 12074291 12214766 12349798 12512634 12700386 12874971 13051127 13221796 13395308 13562917
12895 13562917 13728897 13894070 14058697 14236698 14425324 14617438 14833731 15062978 15290756
12886 15290756 15521945 15771182 16029350 16289842 16562029 16846661 17128460 17412343 17678942
12877 17678942 17954470 18234772 18505400 18788843 19115804 19463604 19847720 20247929 20649323
$$ packed form
12945H353528J11616J01369P4705J7445n8880o7850l8808J2087L8304O0200Q6748
12934H690464Q4904P9844Q7105R3902R8978Q1634R6422J03665Q9534J07478J00892
12923I714822R7373J10031J00507J15529J09684J01440J23284J42254J23753J09404
12913A0848081J21932J12947J28534J46927J43876J42554J44661J43784J40995
12904A2074291J40475J35032J62836J87752J74585J76156J70669J73512J67609
12895A3562917J65980J65173J64627J78001J88626J92114K16293K29247K27778
12886A5290756K31189K49237K58168K60492K72187K84632K81799K83883K66599
12877A7678942K75528K80302K70628K83443L26961L47800L84116M00209M01394
$$ plain form
12868 20649323 21062881 21507456 21951109 22404248 22861114 23345192 23860495 24424446 25041050
12859 25041050 25667973 26295762 26933206 27597718 28269969 28997320 29753310 30548509 31427687
12850 31427687 32359015 33362452 34458428 35634695 36891752 38222713 39605639 41088020
12842 41088020 42672162 44379604 46236383 48263206 50464827 52856352 55473953 58320794
12834 58320794 61418890 64907165 68860709 73328921 78249176 83431657 88866510 95485567
12826 95485567 103974679 114584968 127701472 143720407 163327431 187247443 215527172
12819 215527172 245905749 263948006 216117630 51992131 -115946758 -201387117 -230121315
12812 -230121315 -222381549 -200034250 -176671642 -156415395 -139714396 -125875179 -114238230
$$ packed form
12868B0649323M13558M44575M43653M53139M56866M84078N15303N63951O16604
12859B5041050O26923O27789O37444O64512O72251P27351P55990P95199Q79178
12850C1427687R31328J003437J095976J176267J257057J330961J382926J482381
12842D1088020J584142J707442J856779K026823K201621K391525K617601K846841
12834E8320794L098096L488275L953544M468212M920255N182481N434853O619057
12826I5485567Q489112J0610289J3116504J6018935J9607024K3920012K8279729
12819B15527172L0378577J8042257m7830376j64125499j67938889q5440359k8734198
12812b30121315P739766K2347299K3362608K0256247J6700999J3839217J1636949
$$ plain form
12805 -114238230 -104432500 -96365934 -90050732 -84665403 -79607798 -74872493 -70495807 -66554149
12797 -66554149 -63028243 -59846585 -56940627 -54330133 -51982346 -49832241 -47838084 -46003615
12789 -46003615 -44317691 -42781354 -41388963 -40091072 -38889282 -37740211 -36638861 -35583220
12781 -35583220 -34564801 -33615377 -32714875 -31889584 -31103054 -30326169 -29567967 -28847835 -28163822
12772 -28163822 -27516848 -26908348 -26337588 -25788268 -25224039 -24672285 -24165873 -23699029 -23246318
12763 -23246318 -22815549 -22436490 -22088135 -21714155 -21345178 -20996186 -20663904 -20373615 -20092527
12754 -20092527 -19809883 -19514906 -19222154 -18951135 -18670736 -18397467 -18142681 -17888705 -17610934
12745 -17610934 -17348166 -17115246 -16912831 -16703904 -16500107 -16281480 -16049182 -15827073 -15618132
$$ packed form
12805a14238230R805730Q066566O315202N385329N057605M735305M376686L941658
12797f6554149L525906L181658K905958K610494K347787K150105J994157J834469
12789d6003615J685924J536337J392391J297891J201790J149071J101350J055641
12781c5583220J018419R49424R00502Q25291P86530P76885P58202P20132O84013
12772b8163822O46974O08500N70760N49320N64229N51754N06412M66844M52711
12763b3246318M30769L79059L48355L73980L68977L48992L32282K90289K81088
12754b0092527K82644K94977K92752K71019K80399K73269K54786K53976K77771
12745a7610934K62768K32920K02415K08927K03797K18627K32298K22109K08941
$$ plain form
12736 -15618132 -15422057 -15237848 -15051091 -14855468 -14675321 -14514655 -14345907 -14180628 -14021366
12727 -14021366 -13864240 -13688145 -13532386 -13412053 -13264934 -13136062 -13021763 -12903579 -12778297
12718 -12778297 -12650374 -12519815 -12411843 -12306463 -12201865 -12082834 -11976418 -11873529 -11765033
12709 -11765033 -11658156 -11542715 -11425363 -11314304 -11216353 -11111174 -11018787 -10918781 -10824529 -10741126
12699 -10741126 -10658598 -10569661 -10478513 -10382521 -10288186 -10207046 -10127999 -10024260 -9850369 -9651303
12689 -9651303 -9548495 -9506869 -9514600 -9529297 -9499132 -9453275 -9386032 -9329390 -9274293 -9226587 -9193653
12678 -9193653 -9154459 -9095247 -9038649 -8970768 -8897935 -8833462 -8768096 -8726104 -8674399 -8597100 -8536277
12667 -8536277 -8473287 -8403575 -8334500 -8288680 -8239227 -8177215 -8092384 -8006651 -7950652 -7899495 -7885872
$$ packed form
12736a5618132J96075J84209J86757J95623J80147J60666J68748J65279J59262
12727a4021366J57126J76095J55759J20333J47119J28872J14299J18184J25282
12718a2778297J27923J30559J07972J05380J04598J19031J06416J02889J08496
12709a1765033J06877J15441J17352J11059R7951J05179R2387J00006R4252Q3403
12699a0741126Q2528Q8937R1148R5992R4335Q1140P9047J03739J73891J99066
12689i651303J02808M1626p731j4697L0165M5857O7243N6642N5097M7706L2934
12678i193653L9194N9212N6598O7881P2833O4473O5366M1992N1705P7299O0823
12667h536277O2990O9712O9075M5820M9453O2012Q4831Q5733N5999N1157J3623
$$ plain form
12656 -7885872 -7899521 -7906668 -7912560 -7891199 -7863027 -7823783 -7767331 -7716640 -7693093 -7672379 -7633098 -7580649
12644 -7580649 -7532846 -7471186 -7409489 -7361256 -7332677 -7293013 -7248223 -7228283 -7210718 -7189922 -7169959
12633 -7169959 -7151704 -7105288 -7041326 -6999020 -6943148 -6885010 -6841596 -6814878 -6838534 -6874441 -6887613
12622 -6887613 -6849873 -6764330 -6670611 -6566397 -6483570 -6434597 -6444763 -6463745 -6456016 -6441908 -6420625
12611 -6420625 -6396120 -6362240 -6319258 -6267118 -6214709 -6159955 -6125093 -6096453 -6067404 -6039345 -6027576
12600 -6027576 -6005544 -6002583 -6014964 -5993778 -5969537 -5944138 -5913736 -5881979 -5846768 -5819946 -5798201
12589 -5798201 -5776120 -5754203 -5720988 -5679572 -5635864 -5608518 -5614470 -5608189 -5570556 -5558061 -5543555 -5534632
12577 -5534632 -5501664 -5495166 -5476091 -5440929 -5409129 -5373053 -5347825 -5332255 -5311638 -5308693 -5313502 -5306220
$$ packed form
12656g885872j3649p147n892K1361K8172L9244N6452N0691K3547K0714L9281N2449
12644g580649M7803O1660O1697M8233K8579L9664M4790J9940J7565K0796J9963
12633g169959J8255M6416O3962M2306N5872N8138M3414K6718k3656l5907j3172
12622f887613L7740Q5543R3719J04214Q2827M8973j0166j8982P729J4108K1283
12611f420625K4505L3880M2982N2140N2409N4754L4862K8640K9049K8059J1769
12600f027576K2032K961j2381K1186K4241K5399L0402L1757L5211K6822K1745
12589e798201K2081K1917L3215M1416M3708K7346n952O281L7633J2495J4506Q923
12577e534632L2968O498J9075L5162L1800L6076K5228J5570K0617K945m809P282
$$ plain form
12565 -5306220 -5293490 -5276426 -5243220 -5233397 -5228253 -5232494 -5216327 -5179713 -5135036 -5113940 -5093647 -5068943
12553 -5068943 -5043621 -5018118 -4992397 -4972841 -4959829 -4948297 -4948531 -4930696 -4916611 -4903118 -4884219 -4862140
12541 -4862140 -4849535 -4806962 -4779388 -4788386 -4774473 -4764669 -4748692 -4737716 -4723047 -4711086 -4693291 -4672018
12529 -4672018 -4659024 -4640234 -4625642 -4615960 -4609465 -4589591 -4590975 -4594699 -4567247 -4543314 -4524363 -4506012
12517 -4506012 -4485350 -4468245 -4460374 -4445567 -4429541 -4416831 -4410600 -4407862 -4401109 -4377504 -4347030 -4320327
12505 -4320327 -4287271 -4279029 -4273548 -4254533 -4222762 -4212970 -4206134 -4191710 -4177275 -4163187 -4142025 -4107211
12493 -4107211 -4093859 -4121809 -4154210 -4195110 -4208304 -4188600 -4170288 -4146054 -4131692 -4114331 -4081744
12482 -4081744 -4052913 -4037427 -4040661 -4045838 -4038619 -4031002 -4037124 -4024771 -4020519 -4006116 -4005116 -3989880 -3973392
$$ packed form
12565e306220J2730J7064L3206R823N144m241J6167L6614M4677K1096K0293K4704
12553e068943K5322K5503K5721J9556J3012J1532k34J7835J4085J3493J8899K2079
12541d862140J2605M2573K7574q998J3913R804J5977J0976J4669J1961J7795K1273
12529d672018J2994J8790J4592R682O495J9874j384l724K7452K3933J8951J8351
12517d506012K0662J7105P871J4807J6026J2710O231K738O753K3605L0474K6703
12505d320327L3056Q242N481J9015L1771R792O836J4424J4435J4088K1162L4814
12493d107211J3352k7950l2401m0900j3194J9704J8312K4234J4362J7361L2587
12482d081744K8831J5486l234n177P219P617o122J2353M252J4403J000J5236J6488
$$ plain form
12469 -3973392 -3956740 -3956299 -3951652 -3943420 -3931003 -3907299 -3898941 -3887605 -3869806 -3850910 -3843223 -3830288
12457 -3830288 -3807628 -3795454 -3789116 -3781690 -3763459 -3752730 -3738494 -3748455 -3769961 -3761564 -3734180 -3706318
12445 -3706318 -3691200 -3687540 -3672731 -3643731 -3624553 -3624059 -3620728 -3614282 -3613954 -3602453 -3594725 -3585218 -3590266
12432 -3590266 -3591957 -3584756 -3573309 -3558137 -3547629 -3543767 -3526856 -3524205 -3510651 -3494100 -3477877 -3460935
12420 -3460935 -3456197 -3457833 -3443501 -3422043 -3411393 -3411309 -3399252 -3406432 -3401313 -3396952 -3382298 -3358295 -3345528
12407 -3345528 -3347722 -3329937 -3318382 -3327691 -3325602 -3318594 -3303453 -3289796 -3277965 -3268565 -3259930 -3244982
12395 -3244982 -3232977 -3212545 -3199385 -3170413 -3166016 -3172826 -3170967 -3183700 -3188000 -3174756 -3164305 -3145093
12383 -3145093 -3114701 -3108129 -3092594 -3077795 -3070485 -3060203 -3040802 -3026093 -3014802 -3010249 -3003944 -2999868
$$ packed form
12469c973392J6652M41M647Q232J2417K3704Q358J1336J7799J8896P687J2935
12457c830288K2660J2174O338P426J8231J0729J4236r961k1506Q397K7384K7862
12445c706318J5118L660J4809K9000J9178M94L331O446L28J1501P728R507n048
12432c590266j691P201J1447J5172J0508L862J6911K651J3554J6551J6223J6942
12420c460935M738j636J4332K1458J0650Q4J2057p180N119M361J4654K4003J2767
12407c345528k194J7785J1555r309K089P008J5141J3657J1831R400Q635J4948
12395c244982J2005K0432J3160K8972M397o810J859j2733m300J3244J0451J9212
12383c145093L0392O572J5535J4799P310J0282J9401J4709J1291M553O305M076
$$ plain form
12371 -2999868 -2993371 -2974955 -2961772 -2926100 -2914477 -2893696 -2872700 -2861389 -2829964 -2783464 -2753828
12360 -2753828 -2754757 -2732618 -2686984 -2665676 -2646010 -2600333 -2548482 -2482157 -2395261 -2315895 -2206750
12349 -2206750 -2061879 -1892725 -1723646 -1619538 -1831170 -2633406 -3544031 -4054207 -4248513
12340 -4248513 -4221881 -4096841 -3967589 -3856163 -3755153 -3656456 -3580088 -3514597 -3474809 -3433228
12330 -3433228 -3407957 -3371718 -3351332 -3332855 -3297015 -3261792 -3236933 -3215167 -3189045 -3176644 -3184049
12319 -3184049 -3178164 -3162208 -3140826 -3103987 -3096149 -3096767 -3082673 -3077706 -3052626 -3032504 -3028257 -3024980 -3014960
12306 -3014960 -3003569 -2985128 -2974017 -2965341 -2951598 -2936769 -2929929 -2933416 -2928176 -2907302 -2904038 -2903810 -2906493
12293 -2906493 -2896432 -2894412 -2883559 -2873828 -2881766 -2869129 -2853278 -2847500 -2840479 -2830410 -2813856 -2796981
$$ packed form
12371b999868O497J8416J3183L5672J1623K0781K0996J1311L1425M6500K9636
12360b753828r29K2139M5634K1308J9666M5677N1851O6325Q6896P9366J09145
12349b206750J44871J69154J69079J04108k11632q02236r10625n10176j94306
12340d248513K6632J25040J29252J11426J01010R8697P6368O5491L9788M1581
12330c433228K5271L6239K0386J8477L5840L5223K4859K1766K6122J2401p405
12319c184049N885J5956K1382L6839P838o18J4094M967K5080K0122M247L277J0020
12306c014960J1391J8441J1111Q676J3743J4829O840l487N240K0874L264K28k683
12293b906493J0061K020J0853R731p938J2637J5851N778P021J0069J6554J6875
$$ plain form
12281 -2796981 -2793570 -2801266 -2812592 -2814731 -2809800 -2799358 -2788246 -2777276 -2775538 -2764237 -2750472 -2759966
12269 -2759966 -2759043 -2747577 -2730456 -2737366 -2730205 -2722302 -2718941 -2709889 -2706975 -2713408 -2716957 -2707827 -2692058
12256 -2692058 -2677295 -2665292 -2671491 -2674053 -2657674 -2654240 -2654889 -2654705 -2653127 -2645618 -2632049 -2617286 -2618375
12243 -2618375 -2620313 -2620924 -2608389 -2589190 -2589305 -2602994 -2586203 -2561241 -2555863 -2556739 -2549562 -2540464 -2539901 -2538869
12229 -2538869 -2537610 -2532775 -2535219 -2530852 -2526206 -2527161 -2517603 -2517315 -2514353 -2523844 -2531527 -2505081 -2478709 -2484997
12215 -2484997 -2493668 -2492074 -2486069 -2479424 -2471261 -2480207 -2486684 -2477008 -2466156 -2458697 -2449714 -2443700 -2436863 -2423346
12201 -2423346 -2429837 -2432965 -2419318 -2410877 -2414471 -2426754 -2412517 -2412404 -2407756 -2406927 -2415743 -2415613 -2405340 -2392716
12187 -2392716 -2389755 -2398369 -2396566 -2388524 -2385495 -2368532 -2364526 -2363549 -2366453 -2364698 -2380249 -2375811 -2355107
$$ packed form
12281b796981L411p696j1326k139M931J0442J1112J0970J738J1301J3765r494
12269b759966R23J1466J7121o910P161P903L361R052K914o433l549R130J5769
12256b692058J4763J2003o199k562J6379L434o49J84J578P509J3569J4763j089
12243b618375j938o11J2535J9199j15j3689J6791K4962N378q76P177R098N63J032
12229b538869J259M835k444M367M646r55R558K88K962r491p683K6446K6372o288
12215b484997q671J594O005O645Q163q946o477R676J0852P459Q983O014O837J3517
12201b423346o491l128J3647Q441l594j2283J4237J13M648Q29q816J30J0273J2624
12187b392716K961q614J803Q042L029J6963M006R77k904J755j5551M438K0704
$$ plain form
12174 -2355107 -2345415 -2337416 -2326324 -2311377 -2315296 -2329647 -2330660 -2335011 -2337202 -2348181 -2330164 -2311369
12162 -2311369 -2314354 -2321001 -2319595 -2322399 -2297416 -2285911 -2289823 -2288229 -2276384 -2273697 -2278335 -2279105 -2277977
12149 -2277977 -2281983 -2287428 -2277268 -2263462 -2272113 -2267234 -2272026 -2265970 -2241300 -2244262 -2249572 -2236365 -2229440
12136 -2229440 -2224440 -2219579 -2206272 -2210508 -2208863 -2213422 -2209492 -2211350 -2198002 -2195620 -2216083 -2213860 -2201247
12123 -2201247 -2191353 -2174009 -2169536 -2186991 -2160446 -2147755 -2141504 -2133801 -2124694 -2133141 -2143581 -2153415 -2137578
12110 -2137578 -2147991 -2153129 -2151144 -2151068 -2139016 -2148797 -2154592 -2149174 -2144033 -2142675 -2128666 -2122572 -2095681
12097 -2095681 -2084767 -2087292 -2084958 -2087538 -2081583 -2083461 -2085447 -2081569 -2073749 -2067641 -2066587 -2078148 -2080299
12084 -2080299 -2064250 -2058408 -2064924 -2064703 -2054950 -2033050 -2029029 -2025549 -2027248 -2024042 -2017219 -2017818 -2032985 -2030292
$$ packed form
12174b355107R692P999J1092J4947l919j4351j013m351k191j0979J8017J8795
12162b311369k985o647J406k804K4983J1505l912J594J1845K687m638p70J128
12149b277977m006n445J0160J3806q651M879m792O056K4670k962n310J3207O925
12136b229440N000M861J3307m236J645m559L930j858J3348K382k0463K223J2613
12123b201247R894J7344M473j7455K6545J2691O251P703R107q447j0440r834J5837
12110b137578j0413n138J985P6J2052r781n795N418N141J358J4009O094K6891
12097b095681J0914k525K334k580N955j878j986L878P820O108J054j1561k151
12084b080299J6049N842o516K21R753K1900M021L480j699L206O823n99j5167K693
$$ plain form
12070 -2030292 -2028539 -2008919 -1997263 -1999884 -2006215 -1993106 -1975739 -1984382 -1989960 -1998525 -1994363 -1988934 -1989687
12057 -1989687 -1988253 -1988177 -1980404 -1963266 -1951988 -1953235 -1928995 -1925425 -1912509 -1896175 -1876221 -1858129 -1831432
12044 -1831432 -1796495 -1761882 -1744599 -1782866 -1945168 -2099749 -2174061 -2196600 -2177421 -2169258 -2158549
12033 -2158549 -2135530 -2111996 -2087334 -2060480 -2030864 -2026762 -2022528 -2014888 -2002935 -1996294 -2001303 -2004051
12021 -2004051 -2010637 -2006979 -1990709 -1987554 -1996718 -1991727 -1985599 -1983759 -1967770 -1962595 -1949915 -1958863 -1954642
12008 -1954642 -1956023 -1954022 -1955772 -1951604 -1946513 -1939043 -1928187 -1925115 -1932188 -1929153 -1916802 -1920083 -1921823
11995 -1921823 -1921362 -1908247 -1893563 -1890650 -1893725 -1886727 -1892816 -1894547 -1903117 -1895492 -1888716 -1885775 -1888455 -1884239
11981 -1884239 -1892512 -1894374 -1900602 -1889082 -1893730 -1903980 -1905790 -1898339 -1880842 -1872942 -1867592 -1866836 -1866327 -1864507
$$ packed form
12070b030292J753J9620J1656k621o331J3109J7367q643n578q565M162N429p53
12057a989687J434P6P773J7138J1278j247K4240L570J2916J6334J9954J8092K6697
12044a831432L4937L4613J7283l8267j62302j54581p4312k2539J9179Q163J0709
12033b158549K3019K3534K4662K6854K9616M102M234P640J1953O641n009k748
12021b004051o586L658J6270L155r164M991O128J840J5989N175J2680q948M221
12008a954642j381K001j750M168N091P470J0856L072p073L035J2351l281j740
11995a921823M61J3115J4684K913l075O998o089j731q570P625O776K941k680M216
11981a884239q273j862o228J1520m648j0250j810P451J7497P900N350P56N09J820
$$ plain form
11967 -1864507 -1853423 -1840662 -1826164 -1815180 -1810892 -1811982 -1822895 -1831294 -1845892 -1843332 -1834902 -1826859
11955 -1826859 -1806470 -1810214 -1804610 -1800316 -1806983 -1802379 -1796600 -1797670 -1807909 -1810950 -1802728 -1789513 -1783106
11942 -1783106 -1792400 -1808906 -1817333 -1812487 -1792731 -1789785 -1781513 -1784255 -1769837 -1764011 -1761840 -1766279 -1768084
11929 -1768084 -1761219 -1766122 -1766368 -1762828 -1768361 -1786946 -1785445 -1777022 -1758578 -1762562 -1770166 -1766368 -1759666 -1748504
11915 -1748504 -1746553 -1746946 -1754570 -1767981 -1765714 -1752436 -1734222 -1722088 -1724286 -1729241 -1731846 -1732738 -1731731
11902 -1731731 -1741103 -1742172 -1729340 -1736059 -1741323 -1731843 -1725604 -1705835 -1694148 -1699959 -1706064 -1722477 -1738380
11889 -1738380 -1731928 -1720763 -1718894 -1724305 -1708852 -1678931 -1667355 -1679924 -1684920 -1704031 -1697708 -1700693
11877 -1700693 -1699842 -1680363 -1671622 -1670705 -1673116 -1664950 -1667335 -1668650 -1659055 -1668402 -1677028 -1676334 -1682936 -1683528 -1692499
$$ packed form
11967a864507J1084J2761J4498J0984M288j090j0913q399j4598K560Q430Q043
11955a826859K0389l744N604M294o667M604N779j070j0239l041Q222J3215O407
11942a783106r294j6506q427M846J9756K946Q272k742J4418N826K171m439j805
11929a768084O865m903k46L540n533j8585J501Q423J8444l984p604L798O702J1162
11915a748504J951l93p624j3411K267J3278J8214J2134k198m955k605q92J007
11902a731731r372j069J2832o719n264R480O239J9769J1687n811o105j6413j5903
11889a738380O452J1165J869n411J5453K9921J1576j2569m996j9111O323k985
11877a700693Q51J9479Q741R17k411Q166k385j315R595r347q626O94o602n92q971
$$ plain form
11862 -1692499 -1680736 -1665975 -1666616 -1670093 -1689427 -1698864 -1679466 -1667563 -1663704 -1660516 -1653276 -1647866 -1648101
11849 -1648101 -1649682 -1648527 -1665411 -1657235 -1640947 -1643488 -1635960 -1643317 -1638460 -1650538 -1654347 -1653210 -1652983
11836 -1652983 -1648274 -1640484 -1637635 -1627296 -1606536 -1604115 -1599630 -1604644 -1616329 -1617870 -1616024 -1603759 -1598273
11823 -1598273 -1604797 -1610512 -1611946 -1616823 -1624076 -1612520 -1608717 -1607206 -1600694 -1588665 -1593798 -1596327 -1581898
11810 -1581898 -1577535 -1588484 -1598141 -1593484 -1599408 -1598054 -1600110 -1590824 -1573990 -1568938 -1573117 -1569555 -1566159
11797 -1566159 -1549000 -1546925 -1570717 -1577340 -1577146 -1575065 -1569239 -1570382 -1570599 -1569490 -1565791 -1553065 -1544363 -1543779
11783 -1543779 -1552229 -1558995 -1551977 -1538590 -1532236 -1540639 -1546493 -1553559 -1563411 -1558414 -1543458 -1543883 -1547721 -1542502
11769 -1542502 -1535639 -1530403 -1528575 -1523301 -1531500 -1543509 -1538934 -1529303 -1530870 -1531107 -1532297 -1534751 -1530887 -1520208
$$ packed form
11862a692499J1763J4761o41l477j9334r437J9398J1903L859L188P240N410k35
11849a648101j581J155j6884Q176J6288k541P528p357M857j2078l809J137K27
11836a652983M709P790K849J0339K0760K421M485n014j1685j541J846J2265N486
11823a598273o524n715j434m877p253J1556L803J511O512J2029n133k529J4429
11810a581898M363j0949r657M657n924J354k056R286J6834N052m179L562L396
11797a566159J7159K075k3792o623J94K081N826j143k17J109L699J2726Q702N84
11783a543779q450o766P018J3387O354q403n854p066r852M997J4956m25l838N219
11769a542502O863N236J828N274q199j2009M575R631j567k37j190k454L864J0679
$$ plain form
11755 -1520208 -1520253 -1523642 -1521202 -1515267 -1524035 -1539908 -1533088 -1517910 -1506535 -1506712 -1506776 -1506931 -1520652 -1528689
11741 -1528689 -1518101 -1488275 -1477666 -1482626 -1490313 -1493203 -1499557 -1502268 -1506484 -1511505 -1516591 -1502133 -1500696
11728 -1500696 -1504084 -1504779 -1504095 -1498939 -1484347 -1480932 -1473875 -1459244 -1451230 -1448359 -1445375 -1459027 -1471881
11715 -1471881 -1470134 -1462257 -1471350 -1483529 -1481175 -1480603 -1458660 -1430392 -1425813 -1436245 -1453496 -1448923 -1434063
11702 -1434063 -1432730 -1434790 -1454276 -1461705 -1472983 -1471235 -1448796 -1443376 -1449034 -1443928 -1458435 -1445676 -1414329
11689 -1414329 -1399033 -1433952 -1468229 -1473490 -1461595 -1465003 -1469512 -1462520 -1462768 -1457242 -1437625 -1417262 -1417896
11676 -1417896 -1416626 -1409394 -1410600 -1411578 -1416056 -1410178 -1423267 -1419744 -1418363 -1424460 -1425309 -1407914 -1413185 -1430818
11662 -1430818 -1421920 -1405939 -1404346 -1419376 -1427614 -1418585 -1409955 -1409569 -1414167 -1415865 -1413075 -1417982 -1424082 -1425076
$$ packed form
11755a520208m5l389K440N935q768j5873O820J5178J1375j77o4j55j3721q037
11741a528689J0588K9826J0609m960p687k890o354k711m216n021n086J4458J437
11728a500696l388o95O84N156J4592L415P057J4631Q014K871K984j3652j2854
11715a471881J747P877r093j2179K354N72K1943K8268M579j0432j7251M573J4860
11702a434063J333k060j9486p429j1278J748K2439N420n658N106j4507J2759L1347
11689a414329J5296l4919l4277n261J1895l408m509O992k48N526J9617K0363o34
11676a417896J270P232j206r78m478N878j3089L523J381o097q49J7395n271j7633
11662a430818Q898J5981J593j5030q238R029Q630L86m598j698K790m907o100r94
$$ plain form
11648 -1425076 -1417225 -1423308 -1423071 -1401134 -1368020 -1355382 -1354285 -1371345 -1379564 -1390680 -1398235 -1387648 -1390822
11635 -1390822 -1388432 -1392738 -1399321 -1382885 -1376059 -1385259 -1390610 -1380049 -1378231 -1367216 -1354334 -1367205 -1379218
11622 -1379218 -1366467 -1357248 -1356993 -1352240 -1352907 -1365650 -1371078 -1360886 -1348285 -1332103 -1349911 -1354397 -1354631
11609 -1354631 -1342135 -1333533 -1315032 -1307364 -1331649 -1353202 -1344512 -1328632 -1321275 -1320616 -1321512 -1336755 -1349767
11596 -1349767 -1349799 -1344919 -1355342 -1361949 -1358106 -1355444 -1348842 -1349426 -1350788 -1341655 -1332898 -1335389 -1331891 -1333400
11582 -1333400 -1327227 -1312460 -1311116 -1318187 -1311567 -1300335 -1307974 -1319014 -1324477 -1328231 -1309852 -1307807 -1309220
11569 -1309220 -1318862 -1321635 -1322399 -1324076 -1326214 -1325619 -1324259 -1319799 -1323885 -1312064 -1305343 -1301528 -1301129 -1302053 -1297665
11554 -1297665 -1307443 -1311952 -1324841 -1317861 -1295186 -1291595 -1293986 -1280138 -1280304 -1302139 -1300184 -1295491 -1294682
$$ packed form
11648a425076P851o083K37K1937L3114J2638J097j7060q219j1116p555J0587l174
11635a390822K390m306o583J6436O826r200n351J0561J818J1015J2882j2871j2013
11622a379218J2751R219K55M753o67j2743n428J0192J2601J6182j7808m486k34
11609a354631J2496Q602J8501P668k4285k1553Q690J5880P357O59q96j5243j3012
11596a349767l2M880j0423o607L843K662O602n84j362R133Q757k491L498j509
11582a333400O173J4767J344p071O620J1232p639j1040n463l754J8379K045j413
11569a309220r642k773p64j677k138N95J360M460m086J1821O721L815L99r24M388
11554a297665r778m509j2889O980K2675L591k391J3848j66k1835J955M693Q09
$$ plain form
11541 -1294682 -1285182 -1283937 -1289922 -1298453 -1299143 -1306338 -1309944 -1308029 -1310664 -1302395 -1289386 -1286369 -1291270 -1291817
11527 -1291817 -1289024 -1283724 -1268615 -1264372 -1255405 -1243609 -1244636 -1251803 -1257063 -1251140 -1260575 -1274081 -1269805
11514 -1269805 -1259187 -1264241 -1257193 -1251334 -1252073 -1256949 -1254557 -1237328 -1233724 -1249610 -1262194 -1261123 -1254553
11501 -1254553 -1256034 -1258588 -1266662 -1268796 -1268084 -1262530 -1254678 -1248996 -1261902 -1264980 -1259181 -1253556 -1233633 -1223127
11487 -1223127 -1225828 -1232060 -1238694 -1241603 -1240574 -1250354 -1251024 -1247084 -1244343 -1254265 -1267219 -1257265 -1246540 -1237423
11473 -1237423 -1230254 -1230789 -1238936 -1248180 -1241659 -1240808 -1235952 -1235886 -1244181 -1238990 -1234685 -1240533 -1231811 -1221286 -1216844
11458 -1216844 -1214239 -1221139 -1230789 -1232511 -1225118 -1211728 -1208988 -1217553 -1226778 -1225809 -1239227 -1236779 -1218113
11445 -1218113 -1207308 -1217112 -1209491 -1188760 -1184886 -1190912 -1195257 -1207570 -1220011 -1222685 -1220647 -1218677 -1223681
$$ packed form
11541a294682R500J245n985q531o90p195l606J915k635Q269J3009L017m901n47
11527a291817K793N300J5109M243Q967J1796j027p167n260N923r435j3506M276
11514a269805J0618n054P048N859p39m876K392J7229L604j5886j2584J071O570
11501a254553j481k554q074k134P12N554P852N682j2906l078N799N625J9923J0506
11487a223127k701o232o634k909J029r780o70L940K741r922j2954R954J0725R117
11473a237423P169n35q147r244O521Q51M856O6q295N191M305n848Q722J0525M442
11458a216844K605o900r650j722P393J3390K740q565r225R69j3418K448J8666
11445a218113J0805r804P621K0731L874o026m345j2313j2441k674K038J970n004
$$ plain form
11432 -1223681 -1222642 -1229691 -1224903 -1236976 -1223406 -1203704 -1201139 -1188511 -1177140 -1176516 -1173131 -1179108 -1176842
11419 -1176842 -1173426 -1166885 -1169125 -1188207 -1198481 -1193622 -1188058 -1173063 -1175983 -1182508 -1181343 -1166365 -1198038
11406 -1198038 -1204232 -1211682 -1213670 -1192742 -1179774 -1176013 -1174090 -1162324 -1168155 -1176906 -1192757 -1192341 -1182657
11393 -1182657 -1195627 -1201471 -1193891 -1182744 -1181817 -1170529 -1167083 -1158319 -1150166 -1161271 -1169932 -1170460 -1170962 -1160343
11379 -1160343 -1139479 -1140294 -1150352 -1163205 -1164652 -1144101 -1149331 -1163236 -1159931 -1155863 -1148625 -1154345 -1171588
11366 -1171588 -1180202 -1166367 -1164383 -1153755 -1139744 -1116038 -1109973 -1117468 -1135976 -1151228 -1156901 -1152350
11354 -1152350 -1147611 -1136775 -1133153 -1141021 -1153885 -1157752 -1159699 -1166189 -1154861 -1140948 -1125694 -1124878 -1115644
11341 -1115644 -1120518 -1128600 -1127223 -1140793 -1151989 -1157599 -1150741 -1142124 -1134733 -1143506 -1148241 -1131873 -1116298
$$ packed form
11432a223681J039p049M788j2073J3570J9702K565J2628J1371O24L385n977K266
11419a176842L416O541k240j9082j0274M859N564J4995k920o525J165J4978l1673
11406a198038o194p450j988K0928J2968L761J923J1766n831q751j5851M16R684
11393a182657j2970n844P580J1147R27J1288L446Q764Q153j1105q661n28n02J0619
11379a160343K0864q15j0058j2853j447K0551n230j3905L305M068P238n720j7243
11366a171588q614J3835J984J0628J4011K3706O065p495j8508j5252n673M551
11354a152350M739J0836L622p868j2864l867j947o490J1328J3913J5254Q16R234
11341a115644m874q082J377j3570j1196n610O858Q617P391q773m735J6368J5575
$$ plain form
11328 -1116298 -1116229 -1110734 -1102361 -1117229 -1121121 -1136356 -1140908 -1137224 -1138947 -1145805 -1140760 -1131188 -1116272 -1107917
11314 -1107917 -1101668 -1098275 -1120125 -1133765 -1131434 -1129197 -1128755 -1129950 -1123657 -1123342 -1128830 -1136463 -1142661 -1139841
11300 -1139841 -1148635 -1120768 -1117492 -1109569 -1108707 -1108447 -1101828 -1106492 -1110942 -1104942 -1114720 -1112702 -1112792 -1129499
11286 -1129499 -1136691 -1136375 -1133414 -1118986 -1107210 -1108467 -1105658 -1106858 -1105855 -1102670 -1100130 -1101467 -1106336 -1107122
11272 -1107122 -1100231 -1100785 -1088224 -1074483 -1080639 -1072250 -1082064 -1097898 -1105864 -1109154 -1117033 -1109900 -1086296
11259 -1086296 -1075567 -1067260 -1080774 -1082275 -1076010 -1071831 -1073528 -1068621 -1073947 -1082380 -1077361 -1075578 -1073297
11246 -1073297 -1061439 -1063397 -1061939 -1058875 -1073142 -1087990 -1091083 -1086355 -1088672 -1097735 -1099805 -1085181 -1065720
11233 -1065720 -1058668 -1066010 -1083777 -1087979 -1085017 -1080716 -1072731 -1067691 -1063008 -1051123 -1050402 -1064871 -1064729 -1062034
$$ packed form
11328a116298O9N495Q373j4868l892j5235m552L684j723o858N045R572J4916Q355
11314a107917O249L393k1850j3640K331K237M42j195O293L15n488p633o198K820
11300a139841q794K7867L276P923Q62K60O619m664m450O000r778K018r0j6707
11286a129499p192L16K961J4428J1776j257K809j200J003L185K540j337m869p86
11272a107122O891n54J2561J3741o156Q389r814j5834p966l290p879P133K3604
11259a086296J0729Q307j3514j501O265M179j697M907n326q433N019J783K281
11246a073297J1858j958J458L064j4267j4848l093M728k317r063k070J4624J9461
11233a065720P052p342j7767m202K962M301P985N040M683J1885P21j4469J42K695
$$ plain form
11219 -1062034 -1067080 -1066269 -1071399 -1068731 -1059559 -1055857 -1068567 -1073567 -1057599 -1058133 -1054489 -1048937 -1059576 -1048512
11205 -1048512 -1038541 -1032421 -1044355 -1049583 -1040249 -1057142 -1066929 -1067165 -1064660 -1066219 -1060549 -1054252 -1060486 -1059699
11191 -1059699 -1052743 -1052261 -1050700 -1056746 -1068411 -1072709 -1062277 -1052988 -1046318 -1040966 -1034533 -1033660 -1043567 -1050602
11177 -1050602 -1052245 -1055587 -1052999 -1046342 -1044807 -1038418 -1027047 -1040045 -1046570 -1051489 -1057523 -1059934 -1065540
11164 -1065540 -1054836 -1045938 -1043277 -1044064 -1037851 -1036552 -1038427 -1045177 -1050248 -1052719 -1057543 -1044846 -1037333 -1031638
11150 -1031638 -1026283 -1023635 -1012645 -1020218 -1022543 -1028494 -1036392 -1030614 -1051535 -1039866 -1020231 -1022237 -1045310
11137 -1045310 -1033760 -1017150 -1011998 -1011764 -1022582 -1018721 -1018664 -1017146 -1011301 -1017126 -1039646 -1041666 -1016447
11124 -1016447 -1017168 -1008597 -1008746 -1007240 -998352 -992538 -994531 -982881 -988442 -998493 -1019751 -1026832 -1016810
$$ packed form
11219a062034n046Q11n130K668R172L702j2710n000J5968n34L644N552j0639J1064
11205a048512R971O120j1934n228R334j6893r787k36K505j559N670O297o234P87
11191a059699O956M82J561o046j1665m298J0432R289O670N352O433Q73r907p035
11177a050602j643l342K588O657J535O389J1371j2998o525m919o034k411n606
11164a065540J0704Q898K661p87O213J299j875o750n071k471m824J2697P513N695
11150a031638N355K648J0990p573k325n951p898N778k0921J1669J9635k006k3073
11137a045310J1550J6610N152K34j0818L861N7J518N845n825k2520k020K5219
11124a016447p21Q571j49J506Q888N814j993J1650n561j0051k1258p081J0022
$$ plain form
11111 -1016810 -1004775 -1007591 -1009239 -1004477 -991962 -986312 -997327 -997985 -988697 -993190 -1002018 -999018 -994255
11098 -994255 -996675 -1007647 -1018658 -1013803 -994204 -982070 -975884 -961017 -968714 -988315 -987231 -979322 -985791
11085 -985791 -995802 -1012482 -1009172 -980589 -963388 -957148 -965776 -986873 -997886 -1004683 -1013442 -1012307 -1004183
11072 -1004183 -1006835 -1002413 -989212 -986748 -997636 -1003991 -988768 -980000 -985540 -989956 -984909 -977987 -977103
11059 -977103 -987359 -983892 -988227 -991231 -994394 -988218 -980681 -972241 -974934 -973781 -960438 -955166 -957527 -959321
11045 -959321 -950509 -943435 -962426 -998875 -1002014 -991322 -989918 -988136 -991579 -978682 -972546 -978581 -982525
11032 -982525 -961595 -975934 -990808 -998652 -989005 -977859 -956870 -941760 -943045 -972685 -983927 -976903
11020 -976903 -981508 -985516 -975496 -979289 -980651 -971008 -966073 -943787 -944777 -941760 -944726 -961623 -955374 -955429
$$ packed form
11111a016810J2035k816j648M762J2515N650j1015o58R288m493q828L000M763
11098i94255k420j0972j1011M855J9599J2134O186J4867p697j9601J084P909o469
11085i85791j0011j6680L310K8583J7201O240q628k1097j1013o797q759J135Q124
11072a004183k652M422J3201K464j0888o355J5223Q768n540m416N047O922Q84
11059i77103j0256L467m335l004l163O176P537Q440k693J153J3343N272k361j794
11045i59321Q812P074j8991l6449l139J0692J404J782l443J2897O136o035l944
11032i82525K0930j4339j4874p844R647J1146K0989J5110j285k9640j1242P024
11020i76903m605m008J0020l793j362R643M935K2286r90L017k966j6897O249n5
$$ plain form
11006 -955429 -955823 -966456 -967338 -951267 -954427 -956669 -952074 -957728 -953871 -956528 -966129 -960950 -950451 -933437
10992 -933437 -936792 -926577 -921856 -930429 -943906 -944218 -948191 -931949 -906521 -923337 -944987 -937956 -928609
10979 -928609 -920781 -929013 -935306 -934544 -942776 -934991 -940646 -938204 -938984 -928877 -922474 -922870 -923017 -923492 -929463
10964 -929463 -943932 -939999 -920580 -916181 -931419 -938385 -935400 -947947 -961006 -952009 -941822 -944159 -954768
10951 -954768 -956181 -958859 -959685 -947373 -937843 -928192 -937069 -945674 -939291 -930953 -936559 -960805 -963327 -948230
10937 -948230 -919767 -920342 -929905 -927998 -938726 -945544 -934437 -923212 -919716 -908233 -904322 -904728 -909849
10924 -909849 -914581 -913830 -927771 -937976 -928362 -926236 -935222 -927947 -935425 -932517 -933042 -918488 -904473 -908152
10910 -908152 -919993 -936122 -923345 -895977 -896028 -922825 -921164 -900038 -903652 -905608 -911000 -904862 -914570
$$ packed form
11006i55429l94j0633q82J6071l160k242M595n654L857k657r601N179J0499J7014
10992i33437l355J0215M721q573j3477l12l973J6242K5428j6816k1650P031R347
10979i28609P828q232o293P62q232P785n655K442p80J0107O403l96j47m75n971
10964i29463j4469L933J9419M399j5238o966K985j2547j3059Q997J0187k337j0609
10951i54768j413k678q26J2312R530R651q877q605O383Q338n606k4246k522J5097
10937i48230K8463n75r563J907j0728o818J1107J1225L496J1483L911m06n121
10924i09849m732P51j3941j0205R614K126q986P275p478K908n25J4554J4015l679
10910i08152j1841j6129J2777K7368n1k6797J661K1126l614j956n392O138r708
$$ plain form
10897 -914570 -920718 -916495 -905610 -902246 -896911 -887982 -889765 -892225 -891965 -889449 -896603 -910984 -913259 -891957
10883 -891957 -882595 -900623 -928445 -937788 -926879 -928488 -918211 -906737 -903126 -891366 -890785 -895700 -882183
10870 -882183 -878017 -880523 -886973 -888573 -884030 -909446 -918901 -906310 -892820 -887908 -892908 -886878 -867859
10857 -867859 -870635 -874908 -888809 -871635 -867946 -874620 -879154 -876358 -875809 -885997 -893065 -895583 -899438 -892016
10843 -892016 -876782 -883527 -887041 -886350 -885208 -895174 -887846 -883037 -872221 -864505 -869354 -885390 -882119 -873634
10829 -873634 -880522 -887449 -894357 -876866 -860784 -867209 -865425 -874371 -877463 -876536 -870064 -866846 -867788 -861950
10815 -861950 -866725 -853017 -848504 -847844 -857678 -876730 -869901 -867514 -856238 -849995 -869382 -886076 -876211
10802 -876211 -880473 -885892 -888628 -886756 -886569 -874034 -872873 -876052 -876057 -860962 -857271 -857159 -866025 -870897 -872734
$$ packed form
10897i14570o148M223J0885L364N335Q929j783k460K60K516p154j4381k275K1302
10883h91957R362j8028k7822r343J0909j609J0277J1474L611J1760N81m915J3517
10870h82183M166k506o450j600M543k5416r455J2591J3490M912n000O030J9019
10857h67859k776m273j3901J7174L689o674m534K796N49j0188p068k518l855P422
10843h92016J5234o745l514O91J142r966P328M809J0816P716m849j6036L271Q485
10829h73634o888o927o908J7491J6082o425J784q946l092R27O472L218r42N838
10815h61950m775J3708M513O60r834j9052O829K387J1276O243j9387j6694R865
10802h76211m262n419k736J872J87J2535J161l179nJ5095L691J12q866m872j837
$$ plain form
10787 -872734 -863717 -861055 -855764 -857410 -855510 -846626 -847360 -849320 -860007 -861300 -859834 -862978 -872834 -872709
10773 -872709 -887013 -881973 -868571 -861043 -872149 -881818 -883181 -882582 -865496 -851272 -851460 -856770 -847422
10760 -847422 -854283 -852770 -851292 -849936 -842949 -850470 -862722 -847954 -852574 -855249 -849662 -848649 -851634 -867144
10746 -867144 -868225 -863129 -858982 -860482 -860339 -855779 -837188 -832962 -839394 -848191 -838608 -853392 -861152 -868280
10732 -868280 -857095 -851971 -862965 -863281 -859683 -861847 -858599 -855657 -858292 -865457 -854835 -841422 -824139
10719 -824139 -833009 -846984 -845316 -860007 -850811 -851392 -846073 -846797 -857929 -858597 -862297 -859939 -860964 -842179
10705 -842179 -819880 -835486 -838334 -834200 -837573 -840391 -835722 -830654 -833783 -829754 -831115 -830453 -826745 -830176
10691 -830176 -832398 -833888 -832501 -837253 -833911 -825571 -820591 -820962 -818555 -822416 -817920 -813160 -829977 -837587
$$ packed form
10787h72734R017K662N291j646J900Q884p34j960j0687j293J466l144r856J25
10773h72709j4304N040J3402P528j1106r669j363N99J7086J4224j88n310R348
10760h47422o861J513J478J356O987p521j2252J4768m620k675N587J013k985j5510
10746h67144j081N096M147j500J43M560J8591M226o432q797R583j4784p760p128
10732h68280J1185N124j0994l16L598k164L248K942k635p165J0622J3413J7283
10719h24139q870j3975J668j4691R196n81N319p24j1132o68l700K358j025J8785
10705h42179K2299j5606k848M134l373k818M669N068l129M029j361O62L708l431
10691h30176k222j490J387m752L342Q340M980l71K407l861M496M760j6817p610
$$ plain form
10677 -837587 -832415 -816504 -824986 -814131 -819022 -823280 -813184 -819579 -827048 -823010 -827093 -830412 -825831
10664 -825831 -813936 -815463 -838302 -853399 -854549 -837862 -833702 -817129 -796256 -789967 -796274 -808286
10652 -808286 -811679 -803930 -808494 -804164 -797271 -783312 -790270 -804485 -810880 -805710 -786407 -779974 -798191
10639 -798191 -830645 -836241 -820777 -821652 -804977 -794815 -810528 -814550 -807062 -792882 -778644 -786920 -791509
10626 -791509 -800695 -802001 -801361 -805521 -812507 -818057 -804008 -811278 -808392 -803861 -810933 -812497 -805328 -802071
10612 -802071 -795669 -790141 -795008 -800184 -792855 -787204 -787566 -783869 -789603 -796689 -785749 -789873 -799063 -785076
10598 -785076 -794756 -792851 -777723 -776315 -783622 -785076 -785991 -790041 -791637 -796414 -793860 -798039 -810234 -810431
10584 -810431 -792714 -791467 -787776 -791482 -786522 -759377 -761651 -770809 -756158 -739207 -753079 -768214 -784674
$$ packed form
10677h37587N172J5911q482J0855m891m258J0096o395p469M038m083l319M581
10664h25831J1895j527k2839j5097j150J6687M160J6573K0873O289o307j2012
10652h08286l393P749m564M330O893J3959o958j4215o395N170J9303O433j8217
10639g98191l2454n596J5464q75J6675J0162j5713m022P488J4180J4238q276m589
10626g91509r186j306O40m160o986n550J4049p270K886M531p072j564P169L257
10612h02071O402N528m867n176P329N651l62L697n734p086J0940m124r190J3987
10598g85076r680J905J5128J408p307j454r15m050j596m777K554m179j2195j97
10584h10431J7717J247L691l706M960K7145k274r158J4651J6951j3872j5135j6460
$$ plain form
10571 -784674 -797726 -810385 -821053 -815308 -821832 -807563 -781986 -777502 -782947 -781892 -797405 -808459
10559 -808459 -799617 -787447 -776299 -771442 -784743 -786768 -795244 -791255 -782576 -769698 -768375 -763993 -777992
10546 -777992 -787205 -791032 -788851 -781295 -780420 -787968 -799485 -800153 -797501 -776234 -769162 -767708 -782904 -784047
10532 -784047 -784802 -783704 -781770 -777058 -780741 -778943 -766951 -765289 -769398 -774918 -789082 -790926 -797084 -785525
10518 -785525 -776758 -778731 -771210 -772115 -780189 -795534 -805483 -782112 -759250 -753617 -770574 -758844 -752710
10505 -752710 -778624 -777162 -761534 -763165 -770687 -765382 -766407 -768084 -759487 -761189 -783766 -786332 -777800
10492 -777800 -781390 -777492 -772549 -777730 -768943 -765215 -771241 -763288 -755581 -763773 -769853 -768456 -782387 -788022
10478 -788022 -790397 -786313 -775855 -766166 -756019 -740472 -734176 -746585 -771064 -768792 -757224 -762180 -769733
$$ packed form
10571g84674j3052j2659j0668N745o524J4269K5577M484n445J055j5513j1054
10559h08459Q842J2170J1148M857j3301k025q476L989Q679J2878J323M382j3999
10546g77992r213l827K181P556Q75p548j1517o68K652K1267P072J454j5196j143
10532g84047p55J098J934M712l683J798J1992J662m109n520j4164j844o158J1559
10518g85525Q767j973P521r05q074j5345r949K3371K2862N633j6957J1730O134
10505g52710k5914J462J5628j631p522N305j025j677Q597j702k2577k566Q532
10492g77800l590L898M943n181Q787L728o026P953P707q192o080J397j3931n635
10478g88022k375M084J0458R689J0147J5547O296j2409k4479K272J1568m956p553
$$ plain form
10465 -769733 -769295 -768101 -769659 -779573 -775187 -775524 -761366 -753883 -750922 -749477 -733532 -728339 -725276 -732944
10451 -732944 -742084 -750872 -754492 -750975 -741937 -744204 -738118 -744044 -743457 -740790 -751337 -759609 -760911 -749734
10437 -749734 -720582 -705499 -718043 -729934 -736056 -733880 -745193 -756736 -753225 -738681 -732237 -730838
10425 -730838 -746457 -755628 -754246 -765647 -770316 -756118 -738571 -739106 -739238 -738058 -736424 -736362 -745431 -757515
10411 -757515 -745533 -747640 -757108 -750593 -746468 -732376 -726903 -728016 -746204 -745519 -732532 -735629 -740889
10398 -740889 -736927 -736198 -739876 -732390 -733453 -738615 -751119 -747011 -733140 -724957 -715772 -708215 -722241 -708793
10384 -708793 -706818 -710086 -717563 -717776 -713215 -718414 -719719 -708889 -707143 -702426 -701037 -707885 -721461 -724739
10370 -724739 -723275 -730267 -731009 -720323 -712154 -730526 -724499 -722605 -725100 -721919 -711867 -712371 -723193 -718178
$$ packed form
10465g69733M38J194j558r914M386l37J4158P483K961J445J5945N193L063p668
10451g32944r140q788l620L517R038k267O086n926N87K667j0547q272j302J1177
10437g49734K9152J5083j2544j1891o122K176j1313j1543L511J4544O444J399
10425g30838j5619r171J382j1401m669J4198J7547n35j32J180J634O2r069j2084
10411g57515J1982k107r468O515M125J4092N473j113j8188O85J2987l097n260
10398g40889L962P29l678P486j063n162j2504M108J3871Q183R185P557j4026J3448
10384g08793J975l268p477k13M561n199j305J0830J746M717J389o848j3576l278
10370g24739J464o992p42J0686Q169j8372O027J894k495L181J0052n04j0822N015
$$ plain form
10356 -718178 -726247 -728324 -714532 -724088 -735784 -731219 -732490 -723081 -725781 -726256 -732413 -723109 -713710 -724260
10342 -724260 -740163 -741386 -733241 -748674 -757048 -759716 -740640 -729510 -721822 -717524 -711149 -716549 -721906
10329 -721906 -717598 -707764 -701125 -695695 -700300 -710409 -710108 -714941 -727046 -729291 -718680 -715255 -709089 -702623
10315 -702623 -704553 -704731 -701829 -705233 -699624 -698153 -712171 -696583 -685357 -698775 -705758 -703181 -713037
10302 -713037 -723883 -711971 -702057 -707052 -708759 -708341 -719536 -721333 -725392 -718220 -727297 -732517 -724398 -719768
10288 -719768 -715075 -701655 -703415 -705266 -702939 -706842 -709025 -714636 -709643 -694165 -695629 -717798 -719671
10275 -719671 -716078 -711458 -707876 -712227 -718150 -704478 -709636 -712483 -707892 -714090 -717646 -713936 -705410 -696359
10261 -696359 -688478 -692971 -721696 -725203 -696064 -695799 -701687 -703143 -726215 -713037 -704902 -709239 -692016
$$ packed form
10356g18178q069k077J3792r556j1696M565j271R409k700m75o157R304R399j0550
10342g24260j5903j223Q145j5433q374k668J9076J1130P688M298O375n400n357
10329g21906M308R834O639N430m605j0109L01m833j2105k245J0611L425O166O466
10315g02623j930j78K902l404N609J471j4018J5588J1226j3418o983K577r856
10302g13037j0846J1912R914m995j707M18j1195j797m059P172r077n220Q119M630
10288g19768M693J3420j760j851K327l903k183n611M993J5478j464k2169j873
10275g19671L593M620L582m351n923J3672n158k847M591o198l556L710Q526R051
10261f96359P881m493k8725l507K9139K65n888j456k3072J3178Q135m337J7223
$$ plain form
10248 -692016 -684889 -707264 -710086 -700475 -708201 -703680 -707969 -709638 -705041 -713367 -705206 -713091 -719089 -704204
10234 -704204 -692380 -692224 -695871 -697231 -695958 -693761 -699994 -700727 -703410 -708984 -704734 -699428 -694282 -697865
10220 -697865 -688824 -685691 -682378 -675870 -684656 -691555 -685617 -686203 -684326 -688424 -685277 -684407 -681424 -675539 -684002
10205 -684002 -679234 -673562 -681441 -678199 -679411 -678443 -686868 -703260 -713415 -700872 -698155 -698564 -697141 -680323
10191 -680323 -666617 -672799 -672872 -662698 -662807 -675043 -681840 -703029 -720027 -702994 -689981 -684661 -694868
10178 -694868 -686953 -675916 -679486 -686939 -684564 -679518 -671381 -675775 -671483 -690302 -695845 -690286 -685424 -678588
10164 -678588 -686835 -697297 -686227 -681942 -688053 -690829 -684066 -673203 -677914 -675037 -679088 -685797 -676569
10151 -676569 -681576 -667340 -657161 -663330 -676066 -665563 -650867 -649227 -657546 -666942 -662919 -657672 -662428
$$ packed form
10248f92016P127k2375k822R611p726M521m289j669M597q326Q161p885n998J4885
10234g04204J1824J56l647j360J273K197o233p33k683n574M250N306N146l583
10220f97865R041L133L313O508q786o899N938n86J877m098L147Q70K983N885q463
10205f84002M768N672p879L242j212R68q425j6392j0155J2543K717m09J423J6818
10191f80323J3706o182p3J0174j09j2236o797k1189j6998J7033J3013N320j0207
10178f94868P915J1037l570p453K375N046Q137m394M292j8819n543N559M862O836
10164f78588q247j0462J1070M285o111k776O763J0863m711K877m051o709R228
10151f76569n007J4236J0179o169j2736J0503J4696J640q319r396M023N247m756
$$ plain form
10138 -662428 -669931 -673027 -677972 -676921 -678911 -668325 -667019 -671668 -680473 -665009 -658153 -671217 -659951
10125 -659951 -656807 -667577 -675762 -675174 -686925 -688631 -680952 -695412 -679190 -667246 -664046 -654284 -661290
10112 -661290 -662292 -664269 -663498 -658975 -652125 -661168 -662438 -664800 -659749 -681454 -691297 -667972 -661858 -652503
10098 -652503 -654002 -668076 -671729 -667760 -661291 -641766 -631027 -646872 -654312 -641925 -643546 -650791 -645822
10085 -645822 -649888 -652704 -644714 -632587 -652268 -651664 -644280 -639799 -637953 -647525 -643437 -635555 -634529 -637850
10071 -637850 -654556 -653109 -639732 -633147 -634585 -623960 -623881 -628612 -629582 -631089 -632665 -634110 -637072 -634705
10057 -634705 -632773 -629364 -625133 -612343 -609113 -611113 -616830 -606094 -609807 -619900 -629798 -623489 -621585
10044 -621585 -618133 -637436 -642595 -636455 -620922 -610304 -608555 -620290 -624490 -607088 -600894 -589518 -569581
$$ packed form
10138f62428p503l096m945J051j990J0586J306m649q805J5464O856j3064J1266
10125f59951L144j0770q185N88j1751j706P679j4460J6222J1944L200R762p006
10112f61290j002j977P71M523O850r043j270k362N051k1705r843K3325O114R355
10098f52503j499j4074l653L969O469J9525J0739j5845p440J2387j621p245M969
10085f45822m066k816P990J2127j9681O04P384M481J846r572M088P882J026l321
10071f37850j6706J447J3377O585j438J0625P9m731r70j507j576j445k962K367
10057f34705J932L409M231J2790L230k000n717J0736l713j0093r898O309J904
10044f21585L452j9303n159O140J5533J0618J749j1735m200J7402O194J1376J9937
$$ plain form
10031 -569581 -564450 -550993 -587541 -658420 -699520 -694411 -685895 -682136 -688643 -672714 -649654 -639716 -646768
10018 -646768 -653546 -648412 -654628 -656963 -640099 -632671 -623461 -625979 -628654 -634605 -626379 -611841 -599140
10005 -599140 -603561 -597480 -589508 -564270 -563094 -560438 -556781 -571201 -622823 -686584 -743450 -750168 -719050
9992 -719050 -709977 -711180 -697963 -704925 -707278 -690734 -687857 -682686 -669777 -651202 -648055 -652747 -661399
9979 -661399 -669845 -667996 -661145 -652607 -657360 -661549 -658889 -645474 -646510 -659165 -664537 -651366 -645798 -653833
9965 -653833 -666562 -670140 -672203 -664342 -661433 -661892 -659471 -666064 -671107 -665615 -661420 -660576 -655925 -638339
9951 -638339 -634644 -642038 -639531 -650613 -639179 -633468 -639420 -637644 -634893 -635901 -632119 -629923 -656198 -647655
9937 -647655 -637282 -627192 -630321 -640258 -642763 -657835 -658577 -650510 -655120 -644569 -639369 -638029 -626230
$$ packed form
10031e69581N131J3457l6548p0879m1100N109Q516L759o507J5929K3060R938p052
10018f46768o778N134o216k335J6864P428R210k518k675n951Q226J4538J2701
10005e99140m421O081P972K5238J176K656L657j4420n1622o3761n6866o718L1118
9992g19050R073j203J3217o962k353J6544K877N171J2909J8575L147m692q652
9979f61399q446J849O851Q538m753m189K660J3415j036j2655n372J3171N568q035
9965f53833j2729l578k063P861K909m59K421o593n043N492M195Q44M651J7586
9951f38339L695p394K507j1082J1434N711n952J776K751j008L782K196k6275Q543
9937f47655J0373J0090l129r937k505j5072p42Q067m610J0551N200J340J1799
$$ plain form
9924 -626230 -612658 -603293 -600371 -599323 -606288 -620684 -620342 -609167 -614514 -623301 -625838 -623325 -619101 -617302
9910 -617302 -615135 -630271 -642137 -632004 -631003 -624894 -627121 -629097 -605876 -588226 -598136 -608538 -621055
9897 -621055 -627638 -622424 -622185 -633650 -642547 -645587 -636318 -624047 -614516 -610325 -616067 -607356 -614381 -609873
9883 -609873 -598730 -596118 -604989 -622555 -604006 -597218 -602442 -623374 -626702 -624674 -617178 -612600 -621852
9870 -621852 -623278 -641029 -632528 -635872 -651930 -652261 -638995 -643203 -642303 -629518 -614955 -610456 -600913 -603059
9856 -603059 -626341 -632602 -626679 -637637 -638453 -638073 -630268 -614964 -602599 -627319 -631989 -614590 -595127
9843 -595127 -599625 -596226 -592464 -586072 -581481 -595271 -606218 -614701 -611573 -611903 -600038 -600666 -606187 -609994
9829 -609994 -614142 -607513 -598635 -594282 -597814 -593798 -579603 -581712 -591775 -616947 -609151 -608085 -608679 -608697
$$ packed form
9924f26230J3572R365K922J048o965j4396L42J1175n347q787k537K513M224J799
9910f17302K167j5136j1866J0133J001O109k227j976K3221J7650r910j0402j2517
9897f21055o583N214K39j1465q897l040R269J2271R531M191n742Q711p025M508
9883f09873J1143K612q871j7566J8549O788n224k0932l328K028P496M578r252
9870f21852j426j7751Q501l344j6058l31J3266m208R00J2785J4563M499R543k146
9856f03059k3282o261N923j0958q16L80P805J5304J2365k4720m670J7399J9463
9843e95127m498L399L762O392M591j3790j0947q483L128l30J1865o28n521l807
9829f09994m148O629Q878M353l532M016J4195k109j0063k5172P796J066n94j8
$$ plain form
9815 -608697 -618472 -616335 -618536 -616320 -603397 -600090 -607131 -610946 -603882 -606696 -611025 -610337 -605051 -599541
9801 -599541 -599700 -607327 -597022 -577755 -592824 -603237 -603873 -604007 -624199 -625586 -618841 -624223 -625665 -623718
9787 -623718 -614591 -602254 -598009 -587624 -589014 -590074 -585596 -592486 -585567 -585516 -579837 -573619 -586683 -590318
9773 -590318 -578377 -590842 -582913 -568301 -565861 -565861 -568424 -559274 -566067 -577098 -593929 -607208 -604003 -578408
9759 -578408 -564393 -571589 -598894 -607122 -600965 -587235 -570673 -572795 -579935 -582804 -568161 -556134 -570849
9746 -570849 -569241 -576789 -574734 -583790 -599491 -617805 -613884 -599109 -578400 -583814 -598344 -599711 -595234
9733 -595234 -586677 -577214 -578565 -592854 -585601 -588260 -590607 -580745 -571242 -577095 -588414 -589060 -579511 -571182
9719 -571182 -563937 -555750 -554841 -579023 -587545 -585492 -587967 -600415 -604031 -589749 -583158 -573014 -572688 -583299
$$ packed form
9815f08697r775K137k201K216J2923L307p041l815P064k814m329O88N286N510
9801e99541j59p627J0305J9267j5069j0413o36j34k0192j387O745n382j442J947
9787f23718R127J2337M245J0385j390j060M478o890O919N1N679O218j3064l635
9773e90318J1941j2465P929J4612K440%k563R150o793j1031j6831j3279L205K5595
9759e78408J4015p196k7305q228O157J3730J6562k122p140k869J4643J2027j4715
9746e70849J608p548K055r056j5701j8314L921J4775K0709n414j4530j367M477
9733e95234Q557R463j351j4289P253k659k347R862R503n853j1319o46R549Q329
9719e71182P245Q187R09k4182q522K053k475j2448l616J4282O591J0144L26j0611
$$ plain form
9705 -583299 -590906 -589588 -584298 -574810 -568131 -571493 -590552 -579650 -566127 -573842 -581744 -570313 -559525
9692 -559525 -565610 -554137 -549088 -543551 -546481 -555938 -560901 -560142 -553121 -548993 -549140 -549908 -557107 -562884 -575602
9677 -575602 -581716 -567704 -562161 -571034 -585071 -576007 -566667 -564577 -550114 -551835 -554676 -564017 -576864
9664 -576864 -580809 -572046 -562632 -570013 -570178 -565836 -577373 -577454 -579806 -573915 -578971 -580824 -576345 -578970 -581498
9649 -581498 -571213 -565930 -561518 -565625 -569204 -545852 -533108 -528829 -538875 -565571 -573798 -561571 -554666
9636 -554666 -556789 -550426 -560009 -569062 -559429 -549442 -552389 -551154 -543423 -539456 -544270 -544187 -543449 -551780 -550242
9621 -550242 -547368 -537710 -547487 -554652 -554860 -558971 -571444 -576432 -565546 -572246 -570500 -566771 -566239 -571625
9607 -571625 -584210 -577343 -563263 -547549 -556053 -549558 -541816 -536738 -533527 -551543 -560276 -561114 -551825 -544792
$$ packed form
9705e83299p607J318N290R488O679l362j9059J0902J3523p715p902J1431J0788
9692e59525o085J1473N049N537k930r457m963P59P021M128j47p68p199n777j2718
9677e75602o114J4012N543q873j4037R064R340K090J4463j721k841r341j2847
9664e76864l945Q763R414p381j65M342j1537q1k352N891n056j853M479k625k528
9649e81498J0285N283M412m107l579K3352J2744M279j0046k6696q227J2227O905
9636e54666k123O363r583r053R633R987k947J235P731L967m814Q3P38q331J538
9621e50242K874R658r777p165k08m111j2473m988J0886o700J746L729N32n386
9607e71625j2585O867J4080J5714q504O495P742N078L211j8016q733q38R289P033
$$ plain form
9593 -544792 -548457 -558158 -561590 -569013 -563915 -543318 -537743 -544032 -547743 -546535 -537974 -520180 -527694 -536603
9579 -536603 -540356 -552580 -558528 -559194 -553264 -554011 -557993 -548017 -528860 -530777 -523837 -529351 -533473 -533444 -541865
9564 -541865 -543989 -518631 -508817 -520408 -519824 -511335 -518369 -526398 -530070 -529549 -512429 -515312 -519016 -513220
9550 -513220 -511062 -524899 -541204 -535353 -521634 -529606 -527150 -532819 -543322 -534644 -531497 -521110 -525683
9537 -525683 -523035 -528527 -543683 -556087 -561749 -554862 -535070 -522601 -528172 -529417 -540017 -540006 -533246 -529877
9523 -529877 -517215 -512071 -513924 -515405 -511176 -499688 -514103 -512563 -505437 -525047 -531647 -518424 -536246
9510 -536246 -548480 -543558 -536936 -538651 -537790 -534567 -535488 -532961 -525280 -539506 -535543 -517862 -519140 -525267
9496 -525267 -515337 -503455 -504568 -518314 -520480 -518600 -521928 -525357 -526893 -518249 -507748 -503224 -511884 -525357
$$ packed form
9593e44792l665r701l432p423N098K0597N575o289l711J208Q561J7794p514q909
9579e36603l753j2224n948o66N930p47l982R976J9157j917O940n514m122K9q421
9564e41865k124K5358R814j1591N84Q489p034q029l672N21J7120k883l704N796
9550e13220K158j3837j6305N851J3719p972K456n669j0503Q678L147J0387m573
9537e25683K648n492j5156j2404n662O887J9792J2469n571j245j0600J1O760L369
9523e29877J2662N144j853j481M229J1488j4415J540P126j9610o600J3223j7822
9510e36246j2234M922O622j715Q61L223r21K527P681j4226L963J7681j278o127
9496e25267R930J1882j113j3746k166J880l328l429j536Q644J0501M524q660j3473
$$ plain form
9482 -525357 -526132 -518932 -507138 -511791 -506164 -511203 -519107 -513859 -511006 -505906 -513995 -526997 -521014 -513112
9468 -513112 -514198 -516826 -509790 -510137 -509170 -501513 -499583 -489959 -492387 -493323 -499683 -506384 -508361 -521860 -521794
9453 -521794 -514175 -505175 -500970 -513120 -522364 -520051 -510425 -505458 -497945 -486139 -491542 -491129 -494437 -486748
9439 -486748 -481013 -485034 -488430 -497917 -490131 -486160 -486704 -498818 -511383 -507329 -490542 -494294 -504192 -488357
9425 -488357 -466380 -469038 -487521 -510481 -505334 -498976 -505534 -522372 -528832 -518546 -507274 -479581 -481790
9412 -481790 -498642 -492525 -478117 -460778 -457507 -479513 -496695 -492120 -489329 -484167 -486672 -496423 -494770
9399 -494770 -499058 -499381 -481892 -481641 -484454 -471169 -469739 -477162 -485643 -479582 -464586 -455083 -447935 -451861
9385 -451861 -464362 -471810 -464111 -462886 -451777 -436777 -432998 -430861 -435721 -447619 -462715 -461927 -460269
$$ packed form
9482e25357p75P200J1794m653N627n039p904N248K853N100q089j3002N983P902
9468e13112j086k628P036l47R67P657J930R624k428r36o360o701j977j3499O6
9453e21794P619R000M205j2150r244K313R626M967P513J1806n403M13l308P689
9439d86748N735m021l396r487P786L971n44j2114j2565M054J6787l752r898J5835
9425d88357K1977k658j8483k2960N147O358o558j6838o460J0286J1272K7693k209
9412d81790j6852O117J4408J7339L271k2006j7182M575K791N162k505r751J653
9399d94770m288l23J7489K51k813J3285J430p423q481O061J4996R503P148l926
9385d51861j2501p448P699J225J1109J5000L779K137m860j1898j5096P88J658
$$ plain form
9372 -460269 -457137 -458976 -468147 -471846 -463656 -464020 -469812 -465108 -475879 -484472 -481091 -463942 -450558 -447912
9358 -447912 -443073 -443461 -437957 -425829 -426478 -432061 -447683 -446576 -436625 -422413 -435033 -448519 -443547 -454539
9344 -454539 -450330 -444087 -452675 -439401 -428281 -425134 -421489 -419842 -426914 -423002 -428192 -426585 -413928 -407752
9330 -407752 -412910 -413503 -421320 -429825 -420468 -430409 -435404 -434620 -434031 -430537 -424190 -416868 -416941 -431697 -425969
9315 -425969 -414430 -405893 -403741 -399212 -400563 -387345 -384060 -380793 -379654 -384279 -374021 -391087 -389363
9302 -389363 -389820 -397107 -410251 -424653 -422762 -414248 -404940 -419074 -411694 -385971 -364466 -367829 -380269
9289 -380269 -382101 -381311 -369279 -346313 -343426 -345505 -353291 -347632 -336544 -337280 -338148 -352662 -357191 -359641
9275 -359641 -345601 -332999 -334361 -322574 -325850 -328808 -328519 -330700 -317121 -296843 -293035 -285821 -275235
$$ packed form
9372d60269L132j839r171l699Q190l64n792M704j0771q593L381J7149J3384K646
9358d47912M839l88N504J2128o49n583j5622J107R951J4212j2620j3486M972j0992
9344d54539M209O243q588J3274J1120L147L645J647p072L912n190J607J2657O176
9330d07752n158n93p817q505R357r941m995P84N89L494O347P322p3j4756N728
9315d25969J1539Q537K152M529j351J3218L285L267J139m625J0258j7066J724
9302c89363m57p287j3144j4402J891Q514R308j4134P380K5723K1505l363j2440
9289c80269j832P90J2032K2966K887k079p786N659J1088p36q68j4514m529k450
9275c59641J4040J2602j362J1787l276k958K89k181J3579K0278L808P214J0586
$$ plain form
9262 -275235 -275993 -286435 -288177 -280396 -279660 -273497 -266451 -267189 -272047 -277603 -264083 -253394 -237847 -245095
9248 -245095 -243943 -220604 -203829 -212294 -205762 -203978 -177752 -162610 -156933 -162936 -153307 -144464 -139139
9235 -139139 -115272 -98535 -96805 -92927 -61992 -39194 -23467 4934 30170 62330 93789 125128
9223 125128 154314 202895 238819 284624 309522 339413 399468 460574 514219 567337 639225 708139
9211 708139 745795 742234 689879 568196 326459 -39653 -464010 -895810 -1248192 -1478036
9201 -1478036 -1621906 -1684526 -1678522 -1644493 -1593537 -1547920 -1505104 -1453406 -1395409 -1356885 -1307947
9190 -1307947 -1257492 -1219352 -1176485 -1143664 -1125486 -1099643 -1079900 -1057422 -1036889 -1020265 -996242
9179 -996242 -971922 -962391 -950637 -920795 -908247 -907211 -901593 -903648 -899079 -882514 -863704 -849618 -837551
$$ packed form
9262b75235p58j0442j742P781P36O163P046p38m858n556J3520J0689J5547p248
9248b45095J152K3339J6775q465O532J784K6226J5142N677o003R629Q843N325
9235a39139K3867J6737J730L878L0935K2798J5727K8401K5236L2160L1459L1339
9223A25128K9186M8581L5924M5805K4898K9891O0055O1106N3645N3118P1888O8914
9211G08139L7656l561n2355j21683k41737l66112m24357m31800l52382k29844
9201a478036j43870o2620O004L4029N0956M5617M2816N1698N7997L8524M8938
9190a307947N0455L8140M2867L2821J8178K5843J9743K2478K0533J6624K4023
9179i96242K4320R531J1754K9842J2548J036N618k055M569J6565J8810J4086J2067
$$ plain form
9166 -837551 -827188 -816045 -808995 -790322 -778553 -781453 -766356 -756921 -757444 -754070 -752209 -728038 -719649
9153 -719649 -704809 -703622 -718001 -729061 -726914 -709489 -694099 -699703 -698537 -688586 -675759 -661150 -662722
9140 -662722 -666915 -669108 -661119 -665187 -677270 -672240 -669748 -664869 -658166 -664576 -657816 -665394 -674835 -671824
9126 -671824 -677709 -687315 -674992 -658124 -653445 -644759 -644583 -634013 -622059 -626864 -633130 -624767 -604446
9113 -604446 -591475 -599300 -600784 -595468 -586849 -600075 -609732 -611599 -612368 -618314 -627675 -631135 -624280 -625909
9099 -625909 -622409 -606628 -593876 -596946 -606156 -613168 -594870 -587871 -583857 -583202 -572437 -575247 -589383
9086 -589383 -605010 -607159 -606273 -581777 -572665 -583122 -583028 -574291 -561941 -549316 -552859 -572596 -572374 -583882
9072 -583882 -584505 -577802 -568985 -556287 -557425 -550733 -557338 -561762 -559754 -554432 -551534 -567139 -577342 -582155
$$ packed form
9166h37551J0363J1143P050J8673J1769k900J5097R435n23L374J861K4171Q389
9153g19649J4840J187j4379j1060K147J7425J5390n604J166R951J2827J4609j572
9140f62722m193k193P989m068j2083N030K492M879O703o410O760p578r441L011
9126f71824n885r606J2323J6868M679Q686J76J0570J1954m805o266Q363K0321
9113f04446J2971p825j484N316Q619j3226r657j867p69n946r361l460O855j629
9099f25909L500J5781J2752l070r210p012J8298O999M014O55J0765k810j4136
9086e89383j5627k149Q86K4496R112j0457R4Q737J2350J2625l543j9737K22j1508
9072e83882o23O703Q817J2698j138O692o605m424K008N322K898j5605j0203m813
$$ plain form
9058 -582155 -575451 -570885 -574907 -567593 -561711 -554853 -556442 -560430 -571229 -561806 -525232 -512353 -529212
9045 -529212 -539660 -535615 -527056 -523560 -513094 -526375 -540730 -557913 -560863 -535749 -517529 -514240 -527024
9032 -527024 -533091 -546543 -543211 -534670 -536892 -524669 -528140 -524236 -530382 -521843 -509900 -517386 -525398 -514059
9018 -514059 -513307 -509819 -506634 -512556 -509161 -520736 -546420 -540249 -544287 -534864 -510272 -494844 -497538 -508995
9004 -508995 -515879 -514988 -513466 -512546 -515797 -513695 -515794 -507369 -518877 -520943 -511058 -509347 -506362 -506614 -512454
8989 -512454 -505355 -492569 -475849 -481624 -499577 -508931 -496873 -502945 -501800 -494908 -488192 -491285 -500618
8976 -500618 -491934 -474345 -452125 -460146 -470774 -482159 -489219 -492787 -485596 -489912 -478660 -460581 -458155
8963 -458155 -467766 -490437 -499216 -494626 -472099 -452152 -466748 -477570 -465902 -452006 -451458 -459571 -466193
$$ packed form
9058e82155O704M566m022P314N882O858j589l988j0799R423L6574J2879j6859
9045e29212j0448M045Q559L496J0466j3281j4355j7183k950K5114J8220L289j2784
9032e27024o067j3452L332Q541k222J2223l471L904o146Q539J1943p486q012J1339
9018e14059P52L488L185n922L395j1575k5684O171m038R423K4592J5428k694j1457
9004e08995o884Q91J522R20l251K102k099Q425j1508k066R885J711K985k52n840
8989e12454P099J2786J6720n775j7953r354J2058o072J145O892O716l093r333
8976e00618Q684J7589K2220q021j0628j1385p060l568P191m316J1252J8079K426
8963d58155r611k2671q779M590K2527J9947j4596j0822J1668J3896N48q113o622
$$ plain form
8950 -466193 -469125 -471409 -465137 -465554 -473305 -473111 -461921 -448157 -447495 -459287 -455058 -444386 -447221 -440366
8936 -440366 -439893 -442859 -450138 -450421 -438531 -418910 -403338 -401249 -398774 -406118 -418551 -407620 -415477 -415295
8922 -415295 -411981 -407386 -395367 -379588 -373265 -389396 -388877 -370001 -359906 -366040 -352106 -366901 -391267
8909 -391267 -386673 -369315 -355747 -355547 -363818 -360795 -337779 -330977 -330956 -339216 -338954 -332840 -339986 -346174 -340662
8894 -340662 -334481 -332849 -324545 -319017 -317329 -320967 -310293 -303953 -309476 -291652 -274262 -247038 -245736
8881 -245736 -233501 -226917 -234842 -240159 -231882 -214185 -212292 -206770 -187268 -178677 -171686 -155591 -149016
8868 -149016 -120126 -76191 -48555 -37125 -21197 -11447 2498 35193 49359 80927 113450 157414
8856 157414 200946 251492 293294 348909 397142 470496 581500 715011 847108 1007831 1191233
$$ packed form
8950d66193k932k284O272m17p751J94J1190J3764O62j1792M229J0672k835O855
8936d40366M73k966p279k83J1890J9621J5572K089K475p344j2433J0931p857J82
8922d15295L314M595J2019J5779O323j6131N19J8876J0095o134J3934j4795k4366
8909c91267M594J7358J3568K00q271L023K3016O802K1q260K62O114p146o188N512
8894c40662O181J632Q304N528J688l638J0674O340n523J7824J7390K7224J302
8881b45736J2235O584p925n317Q277J7697J893N522J9502Q591O991J6095O575
8868a49016K8890M3935K7636J1430J5928R750J3945L2695J4166L1568L2523M3964
8856A57414M3532N0546M1802N5615M8233P3354J11004J33511J32097J60723J83402
$$ plain form
8845 1191233 1375982 1508954 1433920 811004 -378738 -1474162 -2105683 -2333123 -2309464 -2180186
8835 -2180186 -2035930 -1889193 -1767169 -1664176 -1571278 -1490909 -1402851 -1337076 -1285659 -1232378 -1186326
8824 -1186326 -1145836 -1116780 -1092819 -1071656 -1047907 -1024176 -1007070 -995049 -978262 -965970 -947490
8813 -947490 -924109 -904748 -878840 -859560 -864436 -863272 -851200 -829376 -828659 -819783 -803594 -793182 -777868
8800 -777868 -762395 -765237 -760724 -753031 -783261 -781985 -769967 -759259 -759281 -760461 -756916 -746381 -760927
8787 -760927 -750316 -733799 -728807 -722717 -718487 -712049 -721096 -719351 -707771 -704682 -696487 -687539 -674387
8774 -674387 -677050 -691480 -699039 -706453 -690672 -675959 -676887 -684137 -673277 -672857 -680965 -671090 -679552 -674732
8760 -674732 -659337 -650914 -646169 -640256 -633084 -646386 -655312 -646867 -653116 -660563 -662699 -656734 -629686 -606121
$$ packed form
8845A191233J84749J32972p5034o22916j189742j095424o31521k27440K3659J29278
8835b180186J44256J46737J22024J02993R2898Q0369Q8058O5775N1417N3281M6052
8824a186326M0490K9056K3961K1163K3749K3731J7106J2021J6787J2292J8480
8813i47490K3381J9361K5908J9280m876J164J2072K1824P17Q876J6189J0412J5314
8800g77868J5473k842M513P693l0230J276J2018J0708k2j180L545J0535j4546
8787g60927J0611J6517M992O090M230O438r047J745J1580L089Q195Q948J3152
8774f74387k663j4430p559p414J5781J4713r28p250J0860M20q108R875q462M820
8760f74732J5395Q423M745N913P172j3302q926Q445o249p447k136N965K7048K3565
$$ plain form
8746 -606121 -585335 -594267 -622394 -621973 -607563 -596398 -612966 -628890 -627226 -615014 -593375 -580778
8734 -580778 -580167 -581727 -587739 -586877 -588934 -588936 -583325 -588854 -584195 -590593 -592695 -606381 -612087 -603839 -611891
8719 -611891 -606819 -589964 -576406 -584399 -593964 -617939 -622418 -595025 -590521 -592016 -594979 -593628 -596368
8706 -596368 -598730 -599528 -612690 -619713 -618004 -594394 -582761 -589299 -588427 -584121 -577146 -566650 -565484 -582363
8692 -582363 -568344 -543886 -551735 -539934 -541648 -564027 -566332 -567025 -575443 -590423 -594979 -585139 -583903
8679 -583903 -578674 -584096 -586730 -583701 -583032 -579475 -588789 -571047 -547789 -548228 -556461 -560869 -576337 -575321
8665 -575321 -566146 -565502 -565731 -569761 -565213 -554602 -555783 -556367 -555641 -567474 -565514 -549133 -550691 -558904 -555268
8650 -555268 -556712 -567774 -552122 -539660 -540341 -540062 -550550 -547847 -545762 -541251 -544029 -546653 -546186 -532632
$$ packed form
8746f06121K0786q932k8127M21J4410J1165j6568j5924J664J2212K1639J2597
8734e80778O11j560o012Q62k057kN611n529M659o398k102j3686n706Q248q052
8719f11891N072J6855J3558p993r565k3975m479K7393M504j495k963J351k740
8706e96368k362p98j3162p023J709K3610J1633o538Q72M306O975J0496J166j6879
8692e82363J4019K4458p849J1801j714k2379k305o93q418j4980m556R840J236
8679e83903N229n422k634L029O69L557r314J7742K3258m39q233m408j5468J016
8665e75321R175O44k29m030M548J0611j181n84P26j1833J960J6381j558q213L636
8650e55268j444j1062J5652J2462o81K79j0488K703K085M511k778k624M67J3554
$$ plain form
8636 -532632 -535867 -539593 -544200 -553301 -559791 -559560 -539608 -523260 -521034 -517659 -528888 -537942 -554438 -557372
8622 -557372 -560104 -550500 -544130 -564415 -553494 -549547 -548832 -540045 -544564 -547897 -540307 -538498 -531209 -542465
8608 -542465 -540342 -544307 -539181 -552809 -554022 -545999 -542028 -544014 -533646 -533983 -543567 -549925 -538226 -531710
8594 -531710 -538996 -529661 -525649 -527105 -542415 -537013 -519935 -510873 -530051 -527209 -513688 -511292 -512668
8581 -512668 -512095 -529303 -535943 -528147 -525912 -511089 -512598 -523921 -526577 -523505 -531076 -530297 -529939 -543605
8567 -543605 -530216 -524353 -528167 -525911 -534469 -542543 -527978 -521968 -536017 -544073 -540201 -532336 -526884 -534778
8553 -534778 -552912 -558336 -559241 -530771 -517920 -507551 -503895 -477659 -484894 -498259 -518209 -519833 -509929
8540 -509929 -505806 -520700 -529934 -537434 -525693 -522436 -532301 -529921 -526633 -537333 -543006 -538273 -524306
$$ packed form
8636e32632l235l726m607r101o490K31J9952J6348K226L375j1229r054j6496k934
8622e57372k732R604O370k0285J0921L947P15Q787m519l333P590J809P289j1256
8608e42465K123l965N126j3628j213Q023L971j986J0368l37r584o358J1699O516
8594e31710p286R335M012j456j5310N402J7078R062j9178K842J3521K396j376
8581e12668N73j7208o640P796K235J4823j509j1323k656L072p571P79L58j3666
8567e43605J3389N863l814K256q558q074J4565O010j4049q056L872P865N452p894
8553e34778j8134n424r05K8470J2851J0369L656K6236p235j3365j9950j624R904
8540e09929M123j4894r234p500J1741L257r865K380L288j0700n673M733J3967
$$ plain form
8527 -524306 -516288 -521714 -523289 -536418 -520374 -508727 -528804 -545521 -557861 -549743 -525908 -513115
8515 -513115 -515336 -500081 -500404 -502354 -516143 -527363 -513824 -501686 -511996 -502768 -508342 -513082 -520476
8502 -520476 -519962 -509309 -516539 -527784 -535986 -533599 -529185 -527972 -515256 -495792 -498759 -503849 -505856 -503454
8488 -503454 -499636 -503239 -505978 -515737 -514453 -523413 -532112 -537288 -527746 -523073 -507519 -488666 -487775 -490619
8474 -490619 -489446 -497571 -504000 -503054 -502707 -490311 -493974 -487451 -479084 -480664 -497853 -518215 -525046 -509449
8460 -509449 -503660 -509626 -519916 -510028 -496799 -496273 -506820 -507004 -507513 -510046 -506083 -501473 -510146 -509505 -500477
8445 -500477 -500012 -508570 -519924 -514802 -509214 -509182 -510032 -503738 -504750 -511168 -506760 -507043 -506935 -500863 -510293 -498618
8429 -498618 -491536 -493664 -503349 -499487 -497646 -495372 -490790 -499888 -506112 -513891 -505043 -489806 -477058 -466719
$$ packed form
8527e24306Q018n426j575j3129J6044J1647k0077j6717j2340Q118K3835J2793
8515e13115k221J5255l23j950j3789j1220J3539J2138j0310R228n574m740p394
8502e20476N14J0653p230j1245q202K387M414J213J2716J9464k967n090k007K402
8488e03454L818l603k739r759J284q960q699n176R542M673J5554J8853Q91k844
8474d90619J173q125o429R46L47J2396l663O523Q367j580j7189k0362o831J5597
8460e09449N789n966j0290R888J3229N26j0547j84n09k533L963M610q673O41R028
8445e00477M65q558j1354N122N588L2q50O294j012o418M408k83J08O072r430J1675
8429d98618P082k128r685L862J841K274M582r098o224p779Q848J5237J2748J0339
$$ plain form
8415 -466719 -476897 -488953 -500768 -488768 -489197 -507230 -511889 -505923 -495964 -481923 -473705 -482771 -481854
8402 -481854 -479323 -492707 -506122 -508428 -502135 -498454 -502878 -508507 -511914 -534203 -536179 -516081 -512674
8389 -512674 -501394 -504459 -499769 -500100 -506893 -498772 -503465 -503962 -485829 -494698 -505253 -513206 -519037 -512811
8375 -512811 -494873 -503330 -501093 -486904 -485712 -483565 -466709 -475818 -480716 -485030 -497570 -500572 -498338
8362 -498338 -492732 -484303 -480783 -469812 -476432 -491125 -492901 -480275 -474815 -466446 -460161 -457501 -485468
8349 -485468 -496692 -491970 -475247 -466661 -468888 -469256 -464534 -466220 -461555 -452699 -454153 -456969 -471418 -481744
8335 -481744 -473708 -459487 -452275 -447728 -454091 -473195 -469287 -472667 -476214 -464186 -462110 -479316 -490870
8322 -490870 -504777 -494695 -491460 -497106 -490728 -487014 -477778 -469913 -471905 -489385 -491722 -484718 -480316 -473627
$$ packed form
8415d66719j0178j2056j1815J2000m29j8033m659N966R959J4041Q218r066R17
8402d81854K531j3384j3415k306O293L681m424n629l407k2289j976K0098L407
8389e12674J1280l065M690l31o793Q121m693m97J8133q869j0555p953n831O226
8375e12811J7938q457K237J4189J192K147J6856r109m898m314j2540l002K234
8362d98338N606Q429L520J0971o620j4693j776J2626N460Q369O285K660k7967
8349d85468j1224M722J6723Q586k227l68M722j686M665Q856j454k816j4449j0326
8335d81744Q036J4221P212M547o363j9104L908l380l547J2028K076j7206j1554
8322d90870j3907J0082L235n646O378L714R236P865j992j7480k337P004M402O689
$$ plain form
8308 -473627 -477597 -473405 -470213 -471183 -475044 -483024 -489427 -486614 -494381 -490941 -496797 -498367 -492207 -505486
8294 -505486 -503076 -498939 -498266 -498196 -478949 -473204 -481479 -469667 -456936 -475301 -493716 -504385 -484043
8281 -484043 -457400 -451095 -452327 -454885 -463375 -470160 -490158 -494010 -498454 -503232 -496272 -489008 -476868 -467918
8267 -467918 -468514 -473636 -472845 -471805 -475818 -462419 -459425 -464520 -462022 -466287 -473234 -488729 -499126 -502543
8253 -502543 -486336 -485661 -494020 -491586 -492536 -475481 -468221 -476865 -479678 -469917 -476770 -477121 -484391 -474489 -448932
8238 -448932 -444368 -453426 -458982 -458420 -461783 -471988 -486021 -475861 -461203 -457535 -458506 -456277 -464042 -469823
8224 -469823 -471573 -467811 -478485 -480107 -474117 -469733 -478909 -468988 -461138 -463481 -458951 -446203 -450474 -467486
8210 -467486 -483706 -484448 -474613 -474887 -473134 -468790 -455569 -449994 -460142 -473840 -467516 -464236 -465712 -458508
$$ packed form
8308d73627l970M192L192r70l861p980o403K813p767L440n856j570O160j3279
8294e05486K410M137O73P0J9247N745q275J1812J2731j8365j8415j0669K0342
8281d84043K6643O305j232k558q490o785j9998l852m444m778O960P264J2140Q950
8267d67918n96n122P91J040m013J3399K994n095K498m265o947j5495j0397l417
8253e02543J6207O75q359K434r50J7055P260q644k813R761o853l51p270R902K5557
8238d48932M564r058n556N62l363j0205j4033J0160J4658L668r71K229p765n781
8224d69823j750L762j0674j622N990M384r176R921P850k343M530J2748m271j7012
8210d67486j6220p42R835k74J753M344J3221N575j0148j3698O324L280j476P204
$$ plain form
8196 -458508 -472192 -470140 -449647 -461480 -460454 -451785 -450797 -454528 -449641 -456369 -457381 -457056 -462847 -469119
8182 -469119 -469565 -470881 -476258 -464828 -463422 -472566 -457786 -455293 -474057 -473794 -463079 -474055 -477894 -458370
8168 -458370 -441964 -449383 -445344 -443432 -446514 -457687 -465033 -458999 -452052 -441693 -458573 -466246 -463957
8155 -463957 -474306 -468447 -470563 -466126 -465335 -447032 -437599 -435290 -436677 -436359 -441508 -451569 -459417 -465308
8141 -465308 -477513 -479234 -476562 -474768 -475553 -473471 -472022 -473177 -464932 -449387 -456991 -468159 -478125 -474155
8127 -474155 -470379 -468159 -477529 -463192 -446709 -452821 -442432 -435729 -442258 -454866 -444023 -435356 -448175
8114 -448175 -447895 -452194 -465816 -471609 -475103 -459701 -465179 -482445 -454696 -445102 -439048 -436039 -420148
8101 -420148 -412192 -428243 -456025 -466753 -450645 -443881 -439685 -439955 -447397 -452654 -467793 -460065 -448697
$$ packed form
8196d58508j3684K052K0493j1833J026Q669R88l731M887o728j012L25n791o272
8182d69119m46j316n377J1430J406r144J4780K493j8764K63J0715j0976l839J9524
8168d58370J6406p419M039J912l082j1173p346O034O947J0359j6880p673K289
8155d63957j0349N859k116M437P91J8303R433K309j387L18n149j0061p848n891
8141d65308j2205j721K672J794p85K082J449j155Q245J5545p604j1168r966L970
8127d74155L776K220r370J4337J6483o112J0389O703o529j2608J0843Q667j2819
8114d48175K80m299j3622n793l494J5402n478j7266K7749R594O054L009J5891
8101d20148P956j6051k7782j0728J6108O764M196k70p442n257j5139P728J1368
$$ plain form
8088 -448697 -450434 -454127 -447963 -447646 -456736 -460639 -450495 -448575 -447970 -461957 -456648 -457602 -452911 -448512 -451302
8073 -451302 -445090 -437027 -443949 -443899 -442652 -441351 -451768 -462261 -443029 -428212 -426220 -443911 -451368 -445479
8059 -445479 -451259 -444774 -441717 -440577 -447433 -456130 -467671 -464865 -452407 -452479 -452514 -459252 -474380 -481142 -472237
8044 -472237 -458168 -452305 -446688 -444733 -431875 -432662 -434632 -455863 -455958 -442494 -436739 -436807 -434393 -430507 -428057
8029 -428057 -430241 -428641 -425255 -423735 -432318 -436881 -445013 -443174 -442774 -466110 -459301 -442562 -437822 -436759
8015 -436759 -453002 -456066 -458363 -470545 -465522 -462774 -459912 -451831 -450496 -452602 -462748 -459968 -443778
8002 -443778 -444286 -454012 -451784 -445920 -436495 -444129 -453253 -453595 -446967 -441369 -442003 -436282 -432695 -450007 -458306
7987 -458306 -458266 -452116 -432200 -422205 -422578 -415927 -430354 -444107 -445616 -426885 -423769 -437014 -437021 -432368 -436594
$$ packed form
8088d48697j737l693O164L17r090l903J0144J920O05j3987N309r54M691M399k790
8073d51302O212Q063o922N0J247J301j0417j0493J9232J4817J992j7691p457N889
8059d45479n780O485L057J140o856q697j1541K806J2458p2l5o738j5128o762Q905
8044d72237J4069N863N617J955J2858p87j970k1231r5J3464N755o8K414L886K450
8029d28057k184J600L386J520q583m563q132J839M00k3336O809J6739M740J063
8015d36759j6243l064k297j2182N023K748K862Q081J335k106j0146K780J6190
8002d43778n08r726K228N864R425p634r124l42O628N598o34N721L587j7312q299
7987d58306M0O150J9916R995l73O651j4427j3753j509J8731L116j3245pM653m226
$$ plain form
7972 -436594 -443681 -443104 -429142 -419050 -424891 -440468 -452934 -444830 -431882 -442890 -442499 -446169 -450938
7959 -450938 -449295 -444595 -435156 -425330 -416932 -432918 -444745 -446797 -445477 -439221 -434464 -432897 -428219 -438402
7945 -438402 -445063 -448200 -444390 -431774 -437629 -440306 -443807 -442543 -443711 -452479 -454291 -437635 -431364 -439219
7931 -439219 -447884 -450037 -433609 -413766 -429022 -435638 -442820 -446621 -450101 -445904 -452076 -456984 -445808
7918 -445808 -433558 -436976 -439143 -424376 -415201 -405301 -414921 -428584 -434433 -417689 -402039 -419282 -421306
7905 -421306 -418327 -441422 -440388 -422252 -414525 -429727 -424613 -410004 -420281 -447927 -450000 -447673 -442918
7892 -442918 -429463 -426389 -447066 -455327 -446184 -446197 -436785 -435281 -434850 -445314 -442343 -428541 -423731 -423840
7878 -423840 -436253 -442726 -440780 -442814 -439630 -425768 -420973 -433914 -442696 -450451 -457173 -452096 -446007 -442429
$$ packed form
7972d36594p087N77J3962J0092n841j5577j2466Q104J2948j1008L91l670m769
7959d50938J643M700R439R826Q398j5986j1827k052J320O256M757J567M678j0183
7945d38402o661l137L810J2616n855k677l501J264j168q768j812J6656O271p855
7931d39219q665k153J6428J9843j5256o616p182l801l480M197o172m908J1176
7918d45808J2250l418k167J4767R175R900r620j3663n849J6744J5650j7243k024
7905d21306K979k3095J034J8136P727j5202N114J4609j0277k7646k073K327M755
7892d42918J3455L074k0677q261R143j3R412J504M31j0464K971J3802M810j09
7878d23840j2413o473J946k034L184J3862M795j2941q782p755o722N077O089L578
$$ plain form
7864 -442429 -426132 -429728 -423336 -432872 -444645 -429391 -418360 -427761 -432339 -440350 -443126 -437660 -435332
7851 -435332 -434121 -435461 -445125 -453216 -441698 -438256 -438567 -442806 -438137 -421413 -418493 -414465 -416347 -442163
7837 -442163 -449836 -433562 -438409 -441880 -434562 -424459 -414551 -397677 -405781 -416933 -431977 -432886 -432922 -419014
7823 -419014 -427356 -440597 -446230 -433135 -426195 -417746 -419849 -444899 -459373 -457996 -437475 -426788 -427193
7810 -427193 -425593 -419878 -429167 -423222 -415870 -414069 -430055 -427851 -437948 -448259 -447536 -452298 -463442 -460533
7796 -460533 -433209 -413234 -411457 -420913 -423417 -418774 -422641 -428650 -427360 -418351 -424139 -433455 -430886 -429027
7782 -429027 -435246 -435405 -415327 -407423 -420425 -434699 -435394 -431339 -427372 -425958 -429963 -430178 -416700 -407960
7768 -407960 -415608 -420210 -418871 -414985 -414377 -410492 -410797 -409627 -413138 -413722 -415291 -420593 -417221 -417465 -431771
$$ packed form
7864d42429J6297l596O392r536j1773J5254J1031r401m578q011k776N466K328
7851d35332J211j340r664q091J1518L442l11m239M669J6724K920M028j882k5816
7837d42163p673J6274m847l471P318J0103R908J6874q104j1152j5044r09l6J3908
7823d19014q342j3241n633J3095O940Q449k103k5050j4474J377K0521J0687m05
7810d27193J600N715r289N945P352J801j5986K204j0097j0311P23m762j1144K909
7796d60533K7324J9975J777r456k504M643l867o009J290R009n788r316K569J859
7782d29027o219j59K0078P904j3002j4274o95M055L967J414m005k15J3478Q740
7768d07960p648m602J339L886O08L885l05J170l511n84j569n302L372k44j4306
$$ plain form
7753 -431771 -424582 -420155 -432446 -441638 -427524 -424231 -414280 -412379 -404935 -393469 -408699 -416720 -433251
7740 -433251 -426264 -415937 -420366 -430481 -430090 -426205 -432006 -448976 -447544 -438259 -433660 -441492 -433768 -428478
7726 -428478 -429204 -430186 -429545 -431947 -428696 -426506 -427239 -423330 -396412 -396688 -413565 -410163 -417639 -425260 -428784
7711 -428784 -413908 -406482 -402065 -407117 -403749 -412715 -408968 -388498 -392718 -407161 -412662 -397908 -406224
7698 -406224 -396580 -374016 -386583 -398067 -404778 -409908 -407930 -399631 -413606 -416882 -411310 -404939 -414301
7685 -414301 -421124 -426724 -431820 -438002 -429311 -412518 -394026 -392777 -397717 -414313 -418800 -421159 -426049 -404734
7671 -404734 -401228 -406379 -398622 -407736 -421022 -417236 -409882 -411251 -400401 -396232 -403837 -416119 -411555 -411134
7657 -411134 -421208 -421009 -413010 -423048 -439156 -442911 -424289 -411332 -391252 -388527 -391761 -394538 -397648
$$ packed form
7753d31771P189M427j2291r192J4114L293R951J901P444J1466j5230q021j6531
7740d33251O987J0327m429j0115L91L885n801j6970J432R285M599p832P724N290
7726d28478p26r82O41k402L251K190p33L909K6918k76j6877L402p476p621l524
7711d28784J4876P426M417n052L368q966L747K0470m220j4443n501J4754q316
7698d06224R644K2564j2567j1484o711n130J978Q299j3975l276N572O371r362
7685d14301o823n600n096o182Q691J6793J8492J249m940j6596m487k359m890K1315
7671d04734L506n151P757r114j3286L786P354j369J0850M169p605j2282M564M21
7657d11134j0074J99P999j0038j6108l755J8622J2957K0080K725l234k777l110
$$ plain form
7644 -397648 -403550 -392809 -379357 -391483 -410277 -401966 -406879 -425861 -416300 -405214 -417630 -432997
7632 -432997 -438612 -413368 -384885 -389441 -388643 -391024 -401034 -416389 -422782 -403452 -389007 -400877 -408842
7619 -408842 -407398 -402227 -397198 -403795 -409970 -416610 -415263 -414299 -406753 -400833 -404810 -396714 -397275 -408243 -404366
7604 -404366 -398033 -398242 -405163 -394795 -394473 -409397 -407361 -401484 -414832 -421929 -416543 -405202 -397278 -400521
7590 -400521 -417865 -424065 -427637 -434521 -432634 -433198 -432208 -429870 -423523 -429524 -421154 -404046 -408712 -410546
7576 -410546 -411939 -404175 -400586 -405589 -395563 -380892 -388387 -402184 -415760 -411570 -424756 -420625 -408364
7563 -408364 -409890 -405155 -403818 -416455 -423999 -402337 -398001 -402592 -411365 -408682 -392679 -409979 -426216
7550 -426216 -417490 -405909 -395724 -399585 -406595 -408477 -406779 -418365 -425236 -418218 -398001 -389088 -401246
$$ packed form
7644c97648n902J0741J3452j2126j8794Q311m913j8982R561J1086j2416j5367
7632d32997n615K5244K8483m556P98k381j0010j5355o393J9330J4445j1870p965
7619d08842J444N171N029o597o175o640J347R64P546N920l977Q096n61j0968L877
7604d04366O333k09o921J0368L22j4924K036N877j3348p097N386J1341P924l243
7590d00521j7344o200l572o884J887n64R90K338O347o001Q370J7108m666j834
7576d10546j393P764L589n003J0026J4671p495j3797j3576M190j3186M131J2261
7563d08364j526M735J337j2637p544K1662M336m591q773K683J6003j7300j6237
7550d26216Q726J1581J0185l861p010j882J698j1586o871P018K0217Q913j2158
$$ plain form
7537 -401246 -405089 -394633 -388037 -403285 -418151 -414743 -402214 -395035 -386889 -383225 -390374 -396577 -392501
7524 -392501 -391223 -395902 -397414 -395314 -409371 -406703 -400503 -407039 -415222 -409417 -406792 -409302 -417192 -409199
7510 -409199 -408809 -410310 -394710 -394577 -408145 -396897 -386025 -382589 -392058 -398206 -404274 -410170 -420938 -424342
7496 -424342 -410254 -389164 -389382 -381788 -377274 -387067 -404510 -414588 -408457 -411595 -399279 -381371 -373940
7483 -373940 -390602 -402936 -418804 -419881 -405331 -397542 -403947 -409213 -404700 -402521 -401128 -395091 -388029
7470 -388029 -382754 -380496 -398025 -419561 -427586 -417322 -403883 -409607 -425645 -416474 -406949 -396273 -385542
7457 -385542 -373715 -391862 -402857 -386035 -391105 -396714 -391973 -385101 -395684 -402987 -415694 -397110 -386381
7444 -386381 -400157 -389673 -383818 -385925 -379508 -383237 -405635 -414116 -397667 -401909 -400809 -403324 -386540
$$ packed form
7537d01246l843J0456O596j5248j4866L408J2529P179Q146L664p149o203M076
7524c92501J278m679j512K100j4057K668O200o536q183N805K625k510p890P993
7510d09199L90j501J5600J33j3568J1248J0872L436r469o148o068n896j0768l404
7496d24342J4088K1090k18P594M514r793j7443j0078O131l138J2316J7908P431
7483c73940j6662j2334j5868j077J4550P789o405n266M513K179J393O037P062
7470c88029N275K258j7529k1536q025J0264J3439n724j6038R171R525J0676J0731
7457c85542J1827j8147j0995J6822n070n609M741O872j0583p303j2707J8584J0729
7444c86381j3776J0484N855k107O417l729k2398q481J6449m242J100k515J6784
$$ plain form
7431 -386540 -375715 -377194 -385164 -400679 -398220 -379656 -374982 -384257 -382999 -394493 -397135 -392767 -402659
7418 -402659 -404610 -397526 -388420 -406595 -397626 -389081 -384347 -394599 -409805 -409210 -407327 -408601 -410759 -409873
7404 -409873 -406238 -405427 -400508 -398419 -391339 -397578 -398388 -392643 -397038 -393966 -395463 -410309 -408377 -401838 -402777
7389 -402777 -390822 -390388 -389812 -373063 -373414 -398394 -417642 -410854 -392799 -396531 -390839 -389979 -401269 -403599
7375 -403599 -405812 -399812 -392944 -375981 -371504 -371834 -377853 -371162 -380345 -398064 -409947 -396600 -391170 -388046
7361 -388046 -379533 -386318 -387356 -382882 -389598 -390557 -377698 -359395 -371287 -389631 -394698 -386856 -386319 -392427
7347 -392427 -397577 -378865 -365279 -378547 -384208 -381514 -381161 -379581 -388629 -393899 -393283 -379963 -372466 -376720
7333 -376720 -376467 -381255 -381653 -375077 -382832 -393050 -387622 -390032 -395079 -386613 -388318 -385466 -385845 -393073 -393335
$$ packed form
7431c86540J0825j479p970j5515K459J8564M674r275J258j1494k642M368r892
7418d02659j951P084R106j8175Q969Q545M734j0252j5206N95J883j274k158Q86
7404d09873L635Q11M919K089P080o239q10N745m395L072j497j4846J932O539r39
7389d02777J1955M34N76J6749l51k4980j9248O788J8055l732N692Q60j1290k330
7375d03599k213O000O868J6963M477l30o019O691r183j7719j1883J3347N430L124
7361c88046Q513o785j038M474o716r59J2859J8303j1892j8344n067P842N37o108
7347c92427n150J8712J3586j3268n661K694L53J580r048n270O16J3320P497m254
7333c76720K53m788l98O576p755j0218N428k410n047Q466j705K852l79p228k62
$$ [...]
##END NTUPLES=NMR SPECTRUM
##END=
