##TITLE=Analysis number 327437
Compound Code mo 00177
Book Reference 238146
Project Code adrs flr03
Chemist Name jom
##JCAMPDX= 6.0         $$ Bruker NMR JCAMP-DX V2.0
##DATA TYPE= NMR SPECTRUM
##DATA CLASS= NTUPLES
##ORIGIN= Bruker BioSpin GmbH
##OWNER= nmr
$$ XWIN-NMR		Version 3.5
$$ Fri Mar 23 12:46:46 2007 GMT Standard Time (UT+0h)  MAYBRIDGE\nmr@NMR_250MHZ
##.OBSERVE FREQUENCY= 250.131544655141
##.OBSERVE NUCLEUS= ^1H
##.ACQUISITION MODE= SIMULTANEOUS (DQD)
##.ACQUISITION SCHEME= undefined
##.AVERAGES= 16
##.DIGITISER RES= 18
##SPECTROMETER/DATA SYSTEM= dpx250
##.PULSE SEQUENCE= zg30
##.SOLVENT NAME= DMSO
##.SHIFT REFERENCE= (INTERNAL, DMSO, 0, 16.522)
##AUDIT TRAIL= $$ (NUMBER, WHEN, WHO, WHERE, WHAT)
$$ ##TITLE= Audit trail, XWIN-NMR		Version 3.5
$$ ##JCAMPDX= 5.01
$$ ##ORIGIN= Bruker BioSpin GmbH
$$ ##OWNER= nmr
$$ C:\u/data/dgb/nmr/ADRS/1830/pdata/1/auditp.txt
$$ ##AUDIT TRAIL=  $$ (NUMBER, WHEN, WHO, WHERE, WHAT)
(   1,<2007-03-23 12:46:15.39 +000>,<MAYBRIDGE\nmr>,<NMR_250MHZ>,
      <created by zg, POWCHK disabled, PULCHK disabled
       configuration hash MD5:
       49 4B E0 1D 92 C2 6B 37 9F E6 65 BC 52 41 86 1D
       data hash MD5: 64K
       B7 12 FC 7E FC B7 B7 7A 8A 00 CE 39 61 3E BB B5>)
(   2,<2007-03-23 12:46:31.13 +000>,<MAYBRIDGE\nmr>,<NMR_250MHZ>,
      <Start of raw data processing
       ef LB = 0.3 FT_mod = 6 PKNL = 1 SI = 32K 
       data hash MD5: 32K
       78 2D D4 0C 5C CE E7 6D 6F 51 5B 90 A7 AF DA AF>)
(   3,<2007-03-23 12:46:32.96 +000>,<MAYBRIDGE\nmr>,<NMR_250MHZ>,
      <apk 
       data hash MD5: 32K
       4F BD 84 AB A3 2E 58 1F A2 4B B2 ED 7B C8 D2 C4>)
(   4,<2007-03-23 12:46:33.69 +000>,<MAYBRIDGE\nmr>,<NMR_250MHZ>,
      <abs ABSG = 5 
       data hash MD5: 32K
       2E F3 CB 02 8A 26 20 D7 9E D9 3C F1 71 4D A0 BB>)
$$ ##END=
$$ 
$$ hash MD5
$$ A6 39 BA CA 30 5E 45 0A A3 B7 D1 A9 B2 1D 09 35
##$RELAX= 
##$RELAX= 
##$RELAX= 
##$RELAX= 
##$RELAX= 
##$RELAX= 
##$RELAX= 
$$ Bruker specific parameters
$$ --------------------------
##$DU= <C:\u>
##$EXPNO= 1830
##$NAME= <ADRS>
##$PROCNO= 1
##$TYPE= <nmr>
##$USER= <dgb>
##$AMP= (0..31)
100 100 100 100 100 100 100 100 100 100 100 100 100 100 100 100 100 100 
100 100 100 100 100 100 100 100 100 100 100 100 100 100 
##$AQSEQ= 0
##$AQ_mod= 3
##$AUNM= <au_zg>
##$AUTOPOS= <35 >
##$BF1= 250.13
##$BF2= 250.13
##$BF3= 250.13
##$BF4= 250.13
##$BF5= 500.13
##$BF6= 500.13
##$BF7= 500.13
##$BF8= 500.13
##$BYTORDA= 1
##$CFDGTYP= 0
##$CFRGTYP= 5
##$CHEMSTR= <none>
##$CNST= (0..31)
1 1 145 1 1 1 1 1 1 1 1 1 1 1 1 1 1 1 1 1 1 1 1 1 1 1 1 1 1 1 1 1 
##$CPDPRG= <>
##$CPDPRG1= <>
##$CPDPRG2= <>
##$CPDPRG3= <>
##$CPDPRG4= <mlev>
##$CPDPRG5= <mlev>
##$CPDPRG6= <mlev>
##$CPDPRG7= <mlev>
##$CPDPRG8= <mlev>
##$CPDPRGB= <>
##$CPDPRGT= <>
##$D= (0..31)
0 1 0 0 0 0 0 0 0 0.06 0 0 0 0 0 0 0.0002 0 0 0 0 0 0 0 0 0 0 0 0 0 0 
0 
##$DATE= 1174653973
##$DBL= (0..7)
120 120 120 120 120 120 120 120 
##$DBP= (0..7)
150 150 150 150 150 150 150 150 
##$DBP07= 0
##$DBPNAM0= <>
##$DBPNAM1= <>
$$ [...]
##$SUBNAM6= <"">
##$SUBNAM7= <"">
##$SUBNAM8= <"">
##$SUBNAM9= <"">
##$SW= 20.6930455092707
##$SWIBOX= (0..15)
0 0 3 0 0 0 0 0 0 0 0 0 0 0 0 0 
##$SW_h= 5175.983436853
##$TD= 65536
##$TD0= 1
##$TE= 683.16
##$TE2= 300
##$TE3= 300
##$TEG= 300
##$TL= (0..7)
0 120 120 120 120 120 120 120 
##$TP= (0..7)
150 150 150 150 150 150 150 150 
##$TP07= 0
##$TPNAME0= <>
##$TPNAME1= <>
##$TPNAME2= <>
##$TPNAME3= <>
##$TPNAME4= <>
##$TPNAME5= <>
##$TPNAME6= <>
##$TPNAME7= <>
##$TPOAL= (0..7)
0.5 0.5 0.5 0.5 0.5 0.5 0.5 0.5 
##$TPOFFS= (0..7)
0 0 0 0 0 0 0 0 
##$TUNHIN= 0
##$TUNHOUT= 0
##$TUNXOUT= 0
##$USERA1= <user>
##$USERA2= <user>
##$USERA3= <user>
##$USERA4= <user>
##$USERA5= <user>
##$V9= 5
##$VALIST= <valist>
##$VCLIST= <CCCCCCCCCCCCCCC>
##$VD= 0
##$VDLIST= <DDDDDDDDDDDDDDD>
##$VPLIST= <PPPPPPPPPPPPPPP>
##$VTLIST= <TTTTTTTTTTTTTTT>
##$WBST= 1024
##$WBSW= 4
##$XGAIN= (0..3)
0 0 0 0 
##$XL= 0
##$YL= 0
##$YMAX_a= 217156
##$YMIN_a= -300861
##$ZGOPTNS= <>
##$ZL1= 120
##$ZL2= 120
##$ZL3= 120
##$ZL4= 120
##$ABSF1= 16.522
##$ABSF2= -4.171173
##$ABSG= 5
##$ABSL= 3
##$ALPHA= 0
##$AQORDER= 0
##$ASSFAC= 0
##$ASSFACI= 0
##$ASSFACX= 0
##$ASSWID= 0
##$AUNMP= <proc_1d>
##$AZFE= 0.1
##$AZFW= 0.1
##$BCFW= 0
##$BC_mod= 0
##$BYTORDP= 0
##$COROFFS= 0
##$CY= 12.5
##$DATMOD= 1
##$DC= 0
##$DFILT= <>
##$DTYPP= 0
##$F1P= 14.0000005364418
##$F2P= -0.99999901652339
##$FCOR= 0.5
##$FTSIZE= 32768
##$FT_mod= 6
##$GAMMA= 0
##$GB= 0
##$INTBC= 1
##$INTSCL= 1
##$ISEN= 128
##$LB= 0.3
##$LEV0= 0
##$LPBIN= 0
##$MAXI= 10000
##$MC2= 0
##$MEAN= 0
##$ME_mod= 0
##$MI= 0
##$NCOEF= 0
##$NC_proc= -4
##$NLEV= 6
##$NOISF1= 0
##$NOISF2= 0
##$NSP= 0
##$NTH_PI= 0
##$NZP= 0
##$OFFSET= 16.522
##$PC= 1
##$PHC0= 222.7729
##$PHC1= 8.17183
##$PH_mod= 1
##$PKNL= yes
##$PPARMOD= 0
##$PSCAL= 4
##$PSIGN= 0
##$REVERSE= no
##$SF= 250.13
##$SI= 32768
##$SIGF1= 0
##$SIGF2= 0
##$SINO= 400
##$SIOLD= 32768
##$SREGLST= <1H.DMSO>
##$SSB= 0
##$STSI= 32768
##$STSR= 0
##$SW_p= 5175.98343685301
##$SYMM= 0
##$S_DEV= 0
##$TDeff= 65536
##$TDoff= 0
##$TI= <Analysis number 999999
Compound Code 99
Book Reference 9
Project Code 9>
##$TILT= no
##$TM1= 0
##$TM2= 0
##$TOPLEV= 0
##$USERP1= <user>
##$USERP2= <user>
##$USERP3= <user>
##$USERP4= <user>
##$USERP5= <user>
##$WDW= 1
##$XDIM= 32768
##$YMAX_p= 416575989
##$YMIN_p= -333568
$$ End of Bruker specific parameters
$$ ---------------------------------
##NTUPLES= NMR SPECTRUM
##VAR_NAME=  FREQUENCY,     SPECTRUM/REAL,   SPECTRUM/IMAG
##SYMBOL=    X,             R,               I
##VAR_TYPE=  INDEPENDENT,   DEPENDENT,       DEPENDENT
##VAR_FORM=  AFFN,          ASDF,            ASDF
##VAR_DIM=   32768,         32768,           32768
##UNITS=     HZ,            ARBITRARY UNITS, ARBITRARY UNITS
##FACTOR=    0.157963299565203, 1,           1
##FIRST=     4132.6476996994, 0,             0
##LAST=      -1043.33573715361, 0,           0
##MIN=       -1043.33573715361, -333568,     0
##MAX=       4132.6476996994, 416575989,     0
$$ Real data points
##PAGE= N=1
##DATA TABLE= (X++(R..R)), XYDATA
$$ [...]
##PAGE= N=2
##DATA TABLE= (X++(I..I)), XYDATA
19858 3789680 3960024 4101963 4158797 4224321 4090769 3823979 3736304 3649837 3685932 3791817
19848 3791817 3841098 3973220 4100005 4107980 3908732 3788483 3740188 3705852 3751980 3784037 3896251
19837 3896251 4013705 3955797 3705580 3472486 3358120 3439717 3549592 3612814 3720579 3813931
19827 3813931 3812967 3812300 3800702 3891281 3915976 3947589 4021912 4095727 4101052 4112227 4043187 4042318 4073017
19814 4073017 4108326 4164251 4225988 4255593 4336169 4418539 4383396 4267600 4256825 4291040 4388058
19803 4388058 4521218 4641797 4687910 4639358 4597558 4570016 4547008 4439959 4341202 4380403 4447664
19792 4447664 4516353 4596205 4598159 4693461 4748117 4772688 4771080 4724951 4724809 4739468 4773009 4849776
19780 4849776 4884876 4867407 4870089 4934687 4951203 4938571 4951523 4976120 5043483 5085150 5116896
19769 5116896 5155819 5168225 5208294 5286475 5282545 5287851 5322003 5354499 5342242 5394773 5418640 5405041
19757 5405041 5509155 5562471 5585713 5600223 5565117 5588030 5617382 5714644 5753158 5812949 5834353
19746 5834353 5909851 5834038 5826970 5900038 5975939 6047367 6097343 6155561 6204772 6184294 6128021
19735 6128021 6163906 6223282 6212281 6254985 6334980 6421074 6475791 6556575 6603462 6571211 6548405
19724 6548405 6536183 6586707 6686480 6756942 6785157 6929351 7085131 7178431 7175651 7097383 7048665
19713 7048665 7054772 7162393 7241074 7307545 7376758 7383518 7411141 7454035 7436774 7473579 7569032
19702 7569032 7671892 7776700 7895884 7974593 7993753 8040405 8070254 8119303 8144965 8173815 8217907
19691 8217907 8258221 8443046 8602049 8614610 8657870 8779334 8869989 8878441 8921556 9027438 9122071
19680 9122071 9311142 9496019 9580831 9692641 9828651 9908238 9930074 9989533 10118563 10251610
19670 10251610 10460081 10570702 10670115 10701199 10692148 10865881 11052595 11146164 11326834 11512795
19660 11512795 11669387 11793815 11852966 11948386 12090288 12282910 12437889 12595986 12740182 13026344
19650 13026344 13298241 13540073 13726965 13894962 14152049 14364393 14542116 14750513 14987740
19641 14987740 15255725 15625120 15964248 16264283 16603549 16869588 17186221 17538449 17998000
19632 17998000 18407918 18869702 19298308 19766100 20337708 20897374 21510177 22022924 22552560
19623 22552560 23135704 23763288 24523369 25296778 26137442 27004085 27867459 28766880 29900479
19614 29900479 31235764 32671319 34348068 36310812 38413250 40733771 43365379 46397340
19606 46397340 50060079 54526239 59854233 65728886 70420425 71151888 63420192 41082350
19598 41082350 19519694 11367904 13705416 21818559 30991090 37764464 38957960 28766966
19590 28766966 3344542 -15356020 -19906758 -14645457 -5012905 5512991 15586506
19583 15586506 23249734 25614972 17787585 -5843764 -26511589 -32905450 -29059753 -20216103
19575 -20216103 -11229074 -5365311 -6000097 -19197830 -45972390 -64926671 -70600308 -67700088
19567 -67700088 -61713426 -55872494 -50729460 -46421881 -42988413 -40211307 -37861036 -35800978
19559 -35800978 -33857716 -31927422 -30206176 -28729174 -27462485 -26365249 -25323289 -24315451
19551 -24315451 -23388124 -22548471 -21744040 -20905690 -20241967 -19698248 -19177931 -18638761 -18099146
19542 -18099146 -17533484 -16969797 -16513793 -16005705 -15586158 -15221510 -14858823 -14512538 -14117357
19533 -14117357 -13720454 -13367710 -13025619 -12763851 -12493779 -12179703 -11925466 -11603616 -11292587
19524 -11292587 -11153053 -10933361 -10683314 -10377999 -10124168 -10026722 -9924240 -9695870 -9512180
19515 -9512180 -9259630 -9045777 -8823641 -8744231 -8686908 -8545488 -8316830 -8089414 -7981272 -7784104
19505 -7784104 -7645384 -7536572 -7509900 -7542448 -7457443 -7298142 -7210818 -7064581 -6837617 -6663804
19495 -6663804 -6629856 -6757884 -6707034 -6629278 -6476357 -6394260 -6242202 -6081316 -5952343 -5757479
19485 -5757479 -5741483 -5859736 -5924343 -5949143 -5840382 -5671052 -5502896 -5414998 -5398697 -5425956
19475 -5425956 -5527343 -5515140 -5442215 -5372920 -5241570 -5119129 -5060106 -4900424 -4874373 -4804284
19465 -4804284 -4704712 -4603589 -4473257 -4460379 -4400672 -4298456 -4257750 -4254234 -4222377 -4251597 -4311536
19454 -4311536 -4243128 -4090614 -3991299 -4002494 -3991551 -3968886 -3931485 -3965826 -3870044 -3751249 -3699714
19443 -3699714 -3683580 -3711763 -3675327 -3649911 -3654351 -3607577 -3518190 -3413419 -3282052 -3212513 -3218135
19432 -3218135 -3214989 -3165513 -3152339 -3173949 -3165926 -3153108 -3108788 -3007430 -2794557 -2733717 -2723016
19421 -2723016 -2784492 -2851468 -2773409 -2659929 -2555819 -2522466 -2544520 -2562058 -2493205 -2521687 -2515738
19410 -2515738 -2471740 -2445102 -2455952 -2494869 -2388480 -2300099 -2217217 -2205844 -2190301 -2060425 -2069552
19399 -2069552 -2109999 -2141156 -2106579 -2057067 -2098014 -2035695 -2010446 -1984529 -1985026 -1982346 -1947414 -1951679
19387 -1951679 -1936878 -1924524 -1831302 -1783780 -1808976 -1819687 -1850414 -1810661 -1653086 -1632050 -1652282
19376 -1652282 -1637289 -1508971 -1422957 -1454196 -1466447 -1425830 -1391916 -1396620 -1467045 -1475097 -1445271
19365 -1445271 -1375843 -1327622 -1295327 -1288012 -1307872 -1345395 -1258320 -1196108 -1130764 -1172062 -1215882
19354 -1215882 -1208252 -1107649 -976620 -989263 -956282 -911874 -906617 -965741 -995947 -888700 -869238
19343 -869238 -940185 -978601 -929675 -875891 -839399 -788534 -849270 -802976 -677770 -605982 -664457
19332 -664457 -706065 -771057 -741998 -715850 -696923 -724049 -701081 -594826 -554868 -541205 -542969
19321 -542969 -597888 -599885 -515625 -517321 -584514 -567828 -508411 -469574 -474798 -470575 -409840 -402862
19309 -402862 -440608 -437521 -375963 -291817 -245604 -256178 -267273 -287332 -286621 -343373 -343662 -290782
19297 -290782 -241375 -169303 -209632 -186815 -71877 -18786 -13117 -12054 -5813 85559 82626 49876
19285 49876 1232 -1380 11696 105979 111054 77845 140003 126476 73592 74206 171808 275747
19273 275747 299816 251192 234078 243825 233694 296024 249275 189327 220589 253487 253711 290637
19261 290637 410073 452966 450168 549402 540036 495290 493152 482122 540934 573541 545359 566908
19249 566908 586824 580669 602862 527865 437754 446481 382278 410257 465835 532616 430529 339530
19237 339530 367210 393529 369042 378137 490704 599991 664559 639978 570887 666021 714119
19226 714119 721640 698898 698553 708747 719264 736211 798059 860136 899076 911783 828923 708236
19214 708236 771237 853325 831905 818589 810389 801819 860654 827915 694531 611396 577484 621842
19202 621842 709940 710849 707896 788650 814004 765327 771594 838188 863233 813436 766117 834437
19190 834437 916540 948900 893876 968910 929930 963078 1062525 1046702 960283 975767 1060173
19179 1060173 1133422 1271810 1322268 1270628 1283825 1234982 1144554 1180439 1156874 1136318 1115790
19168 1115790 1135817 1218146 1272474 1307553 1313188 1340390 1341904 1302952 1140854 1057862 1108094
19157 1108094 1250732 1278670 1265007 1238585 1231896 1292763 1312073 1332252 1336252 1337329 1355953 1450155
19145 1450155 1522820 1474916 1441433 1287348 1191612 1147071 1153020 1137935 1203988 1304737 1352592
19134 1352592 1430507 1483580 1487026 1465776 1477959 1452042 1515918 1581667 1602850 1617166 1616408 1620914
19122 1620914 1657935 1737732 1804735 1782031 1749462 1737801 1793883 1857444 1978160 1973710 1871057
19111 1871057 1794584 1765978 1730185 1819116 1942924 1961070 2002614 2045035 2030931 2031631 2067190
19100 2067190 2075314 2070229 1983921 1966506 1960678 1993250 2008246 1964734 2015354 2053626 2124279 2102776
19088 2102776 2144065 2207752 2235898 2251214 2291279 2337205 2319549 2317109 2345853 2396030 2363163
19077 2363163 2333001 2323055 2311421 2371940 2447390 2475749 2529087 2631706 2636830 2729714 2760411
19066 2760411 2707987 2731057 2779872 2875700 2822593 2634042 2464230 2377603 2408167 2425021 2452975
19055 2452975 2566988 2700450 2715359 2748479 2773211 2737347 2765962 2878526 2879249 2960808 3071863
19044 3071863 3002538 2820807 2605659 2606774 2707282 2772583 2728829 2827841 3004239 3056536 3073834
19033 3073834 3095310 3200526 3325877 3341816 3027748 2701710 2565597 2593153 2671372 2678673
19023 2678673 2788077 2902117 3046134 3264780 3287572 3325337 3357852 3326097 3415561 3501666
19013 3501666 3532492 3604156 3477103 3154532 2956968 2962819 3015967 3093085 3188164 3240754 3197447
19002 3197447 3255241 3307922 3186310 3190147 3218847 3258702 3333784 3416229 3483984 3534114 3519530
18991 3519530 3436898 3428798 3475264 3512451 3501783 3631994 3718758 3831636 3866612 3871746 3803206
18980 3803206 3871753 3868903 3833184 3815746 3839838 3832006 3694635 3541500 3510101 3517675 3490771
18969 3490771 3436195 3368903 3309181 3264998 3357182 3491745 3537298 3608209 3619009 3651298 3659106
18958 3659106 3721702 3749887 3758678 3913792 3968427 4051776 4110273 4209324 4277189 4384813 4498675
18947 4498675 4628377 4690855 4640799 4435883 4256854 4147622 4181145 4191855 4189581 4120079 3952038
18936 3952038 3721863 3677346 3703723 3668464 3629421 3699794 3845731 3958304 4073863 4063085
18926 4063085 4081794 4115437 4234897 4312951 4354678 4460234 4631757 4703289 4806887 5023125
18916 5023125 5279214 5269732 4988137 4607868 4451584 4540865 4769984 4923122 5023486 5224327
18906 5224327 5285780 4983693 4635431 4583125 4663405 4886067 5059401 5255906 5400235 5270763
18896 5270763 5018390 4985611 5015006 5154316 5357436 5526766 5656657 5682010 5538379 5204542
18886 5204542 4861148 4447778 4303517 4353034 4420267 4540806 4805778 4930335 4980622 5131614
18876 5131614 5327711 5437631 5569024 5745168 5838928 6023460 6119787 6187648 6023237 5715544
18866 5715544 5480136 5298677 5146775 5266417 5429742 5574176 5771211 5918987 6055970
18857 6055970 6121213 5956534 5775345 5626801 5635289 5762168 5947264 6153068 6203583 6153948
18847 6153948 6250774 6392391 6571575 6680234 6775842 6853508 6997610 7154348 7330717 7434298
18837 7434298 7476668 7387656 7202006 7086515 6968890 7001746 7101991 7242761 7294452 7286648
18827 7286648 7264218 7083110 6956805 6953985 7052196 7165477 7275711 7491194 7622834 7834467
18817 7834467 7964068 8059923 8158253 8247823 8449083 8625083 8752093 8706522 8614450 8493285
18807 8493285 8333139 8308735 8460339 8541009 8535029 8534957 8496299 8522036 8646328 8687662 8731657
18796 8731657 8926612 9120980 9313030 9369081 9388665 9529650 9575194 9744484 9922070 10017601
18786 10017601 10171089 10318503 10519404 10700574 10830184 10986018 11096376 11246482 11377426
18777 11377426 11424081 11476738 11624337 11844653 12102162 12267408 12346189 12560245 12712039 12792158
18767 12792158 12921233 13123037 13215996 13356674 13587698 13808866 14066276 14318252 14570269
18758 14570269 14774311 14973056 15272040 15537528 15774995 16086610 16381666 16603188 16867074
18749 16867074 17256196 17606597 17907412 18205830 18600636 18962904 19287646 19669216 20112971
18740 20112971 20536130 21085031 21628066 22153004 22647366 23241600 23948356 24554974 25142790
18731 25142790 25829023 26483063 27326367 28313052 29394841 30588588 31918756 33432110 35292284
18722 35292284 37427264 39827761 42790621 46281174 50217697 54618126 58653581 60426455
18714 60426455 54104494 34763333 17380479 11015906 12819126 18843290 25556263 30990910
18706 30990910 32310745 23013754 2263907 -12735004 -17294310 -15100901 -10418347 -5625629
18698 -5625629 -1301649 2667301 6404960 9882837 13240893 16600387 20122309 23804789
18690 23804789 27769268 32274074 37345425 43280257 50014530 57418070 64460208 68654884
18682 68654884 61966735 33050135 -1071373 -17399831 -18166680 -9887458 662748 9910530
18674 9910530 14243056 4316955 -27800129 -58120281 -70614444 -70242950 -63868113 -56895418
18666 -56895418 -50805087 -45625152 -41237407 -37384461 -33996003 -31105955 -28525186 -26313467
18658 -26313467 -24426413 -22808738 -21353495 -19978989 -18716639 -17549126 -16425413 -15367656
18650 -15367656 -14299815 -13328864 -12440675 -11551447 -10724825 -10073710 -9415377 -8684034 -7941650
18641 -7941650 -7150986 -6464228 -5728275 -5104133 -4464201 -3740229 -3074095 -2378863 -1770688
18632 -1770688 -1040237 -360565 261329 1017855 1618600 2178919 2715441 3242155 3873206
18623 3873206 4642218 5348862 6071832 6864719 7726953 8678931 9729010 10791653 11945264
18614 11945264 13061073 14167274 15356139 16691455 18292185 19912760 21683777 23797494
18606 23797494 26290638 29235759 32666755 36963093 42299872 48585673 55192987 60217289
18598 60217289 59581670 44830594 11125926 -20621838 -35447503 -37122232 -32009401 -25508113
18590 -25508113 -19255499 -13410007 -7976512 -2671786 2591885 7980816 13695106 20019793
18582 20019793 26796406 33456583 38143642 36821157 21556484 -10529222 -38248513 -49640133
18574 -49640133 -49076161 -42842186 -35407656 -28120693 -21046717 -14065146 -7418435 -1827670
18566 -1827670 854547 -3625220 -19758050 -38764981 -48206767 -49423493 -46081812 -41474233
18558 -41474233 -37054529 -32931292 -29106056 -25510717 -22049401 -18481840 -14865103 -11038573
18550 -11038573 -6886429 -2741811 622452 1037658 -5861743 -23981048 -43074157 -52209816
18542 -52209816 -53464725 -50575271 -46594735 -43076016 -40202622 -37692711 -35467944 -33603158
18534 -33603158 -32001813 -30686145 -29721374 -28974689 -28135149 -27309554 -26530995 -25826152 -25123111
18525 -25123111 -24349678 -23736905 -23171022 -22595177 -22057336 -21550038 -21115189 -20713932 -20338117
18516 -20338117 -19979669 -19769271 -19585969 -19331444 -19038703 -18764914 -18528576 -18193074 -17841693
18507 -17841693 -17530231 -17169538 -16888118 -16700341 -16505036 -16233819 -16045646 -15918336 -15671792
18498 -15671792 -15431401 -15306441 -15200550 -14917125 -14692002 -14548289 -14380681 -14209291 -14042481
18489 -14042481 -13846780 -13655923 -13435422 -13440398 -13528269 -13524769 -13424548 -13365022 -13288878 -13016281
18479 -13016281 -12801119 -12678388 -12647419 -12622240 -12653045 -12630406 -12477721 -12311252 -12149541 -12094660
18469 -12094660 -11900756 -11699856 -11531186 -11445067 -11423167 -11344529 -11189451 -11077510 -11013098 -10891790
18459 -10891790 -10774184 -10684642 -10631754 -10536355 -10446385 -10446133 -10494598 -10488324 -10388846 -10343054 -10296466
18448 -10296466 -10213868 -10145826 -10036152 -10035530 -10106582 -10086797 -9979442 -9894001 -9845931 -9781069 -9677350
18437 -9677350 -9553337 -9443798 -9382717 -9439879 -9447120 -9359152 -9204865 -9113478 -9085623 -9039045 -8984168
18426 -8984168 -8864981 -8879891 -8926342 -8921289 -8835047 -8820692 -8853592 -8799387 -8670107 -8556074 -8471928
18415 -8471928 -8400261 -8333159 -8419277 -8476760 -8428034 -8319886 -8174240 -8024580 -7955910 -8022980 -8016060
18404 -8016060 -8074474 -8080467 -7920401 -7902248 -7896628 -7859579 -7816848 -7797576 -7681215 -7545298 -7500462
18393 -7500462 -7466268 -7463768 -7398120 -7350187 -7322573 -7294603 -7334984 -7313897 -7199079 -7173541 -7256499
18382 -7256499 -7169272 -7105927 -7055493 -7126844 -7092019 -6926025 -6903692 -6822231 -6762530 -6793259 -6791814
18371 -6791814 -6841524 -6807371 -6812406 -6738630 -6751082 -6701795 -6612130 -6574684 -6548067 -6622916 -6685999
18360 -6685999 -6618585 -6583498 -6531357 -6439328 -6436368 -6508235 -6528610 -6487753 -6459182 -6496869 -6400888
18349 -6400888 -6374095 -6395650 -6416373 -6314299 -6182860 -6202190 -6288765 -6345331 -6225479 -6092770
18339 -6092770 -6134604 -6066573 -5990534 -5910272 -5876965 -5939079 -5910439 -5890655 -5767127 -5763936 -5815414
18328 -5815414 -5730012 -5683776 -5720327 -5782280 -5819113 -5814163 -5783640 -5684516 -5578921 -5636144 -5657218
18317 -5657218 -5632246 -5549132 -5502355 -5557260 -5553782 -5524097 -5535199 -5532940 -5522382 -5486013 -5386166 -5294161
18305 -5294161 -5264271 -5242433 -5294795 -5264970 -5338265 -5263173 -5217575 -5138027 -5152059 -5179652 -5216024
18294 -5216024 -5248902 -5267121 -5284456 -5296807 -5230668 -5239850 -5233096 -5195901 -5166671 -5140901 -5119110 -5210289
18282 -5210289 -5122322 -5117829 -5092096 -5121002 -5089913 -5009915 -5031613 -5119819 -5135619 -5012394 -4988840
18271 -4988840 -4926145 -4891271 -4985739 -4901859 -4821135 -4943896 -5010916 -4916731 -4835686 -4744022 -4716288
18260 -4716288 -4689047 -4672237 -4746747 -4788821 -4814783 -4755822 -4722891 -4653660 -4593192 -4560312 -4529581
18249 -4529581 -4444611 -4459493 -4478828 -4533627 -4543683 -4576901 -4534332 -4420801 -4376539 -4296055 -4341934
18238 -4341934 -4428071 -4377347 -4319104 -4279256 -4314766 -4360287 -4426317 -4465667 -4436458 -4412520 -4409714
18227 -4409714 -4402412 -4436813 -4401318 -4332028 -4408655 -4373695 -4277900 -4246921 -4151718 -4047059 -4020404
18216 -4020404 -4068557 -4049143 -3995390 -3999252 -4091669 -4073080 -4056764 -4020204 -4029774 -4022359 -4001575 -3944385
18204 -3944385 -3918166 -3952238 -3971679 -4009717 -4031928 -4087044 -4214464 -4231929 -4180926 -4092868 -4073506
18193 -4073506 -4080450 -4022229 -3968007 -3934493 -4055413 -4091883 -4047043 -3977338 -3916024 -3827309 -3844853
18182 -3844853 -3847348 -3763551 -3663995 -3622895 -3628257 -3658116 -3666043 -3671792 -3623685 -3571880 -3607243 -3717441
18170 -3717441 -3708009 -3690943 -3729500 -3783124 -3779777 -3765077 -3720026 -3595373 -3601011 -3678916 -3659359 -3776558
18158 -3776558 -3891491 -3890685 -3915075 -3950084 -3935911 -3855262 -3769722 -3725422 -3702762 -3728161 -3761319
18147 -3761319 -3799923 -3737587 -3721646 -3630131 -3617242 -3595893 -3579837 -3589165 -3546483 -3505111 -3521725
18136 -3521725 -3536694 -3492126 -3463360 -3557978 -3656780 -3637946 -3579810 -3541701 -3580256 -3680628 -3750031
18125 -3750031 -3745020 -3681853 -3770402 -3710958 -3716568 -3723387 -3656079 -3578228 -3559327 -3437537 -3404773 -3406608
18113 -3406608 -3403312 -3419446 -3423918 -3411118 -3409259 -3379847 -3413612 -3441197 -3400541 -3385780 -3458211 -3464040
18101 -3464040 -3418940 -3347591 -3290276 -3274671 -3306643 -3352947 -3341990 -3349886 -3366985 -3364917 -3369717 -3311448
18089 -3311448 -3281934 -3260416 -3335538 -3365265 -3381982 -3383678 -3382706 -3332187 -3269758 -3230418 -3186340 -3220487
18077 -3220487 -3297203 -3332898 -3306957 -3269373 -3248534 -3269166 -3439469 -3482957 -3373051 -3298354 -3200741
18066 -3200741 -3200424 -3259058 -3277519 -3226724 -3141298 -3128819 -3142028 -3049152 -3000575 -3119615 -3207273
18055 -3207273 -3140735 -3070705 -3009543 -2918705 -2935343 -3062267 -3107820 -3083240 -2964512 -2935538 -2968340
18044 -2968340 -2925014 -2884298 -2972860 -3026450 -2965299 -2985540 -3023910 -2992386 -2962131 -3010027 -3035436
18033 -3035436 -2912684 -2878592 -2848407 -2868397 -2841894 -2930736 -2971526 -3000311 -2950406 -2962985 -2931411
18022 -2931411 -2891795 -2823423 -2745654 -2668251 -2643591 -2675446 -2761725 -2785373 -2730489 -2652611 -2600250
18011 -2600250 -2592967 -2608996 -2590766 -2615939 -2607327 -2554836 -2558512 -2513972 -2466884 -2392417 -2364101 -2339612
17999 -2339612 -2440695 -2457824 -2413941 -2392990 -2383274 -2501351 -2701247 -2793031 -2736897 -2656433 -2600476
17988 -2600476 -2569376 -2521963 -2452202 -2404704 -2269932 -2204071 -2148812 -2042081 -2000768 -2135300 -2503185
17977 -2503185 -2805826 -2932891 -2957115 -2955395 -2867974 -2770296 -2790762 -2812143 -2818230 -2823535 -2732735
17966 -2732735 -2592774 -2466655 -2493248 -2521556 -2513870 -2526437 -2517201 -2468134 -2431584 -2384514 -2375054
17955 -2375054 -2422925 -2667950 -2918406 -2929574 -2890220 -2778350 -2645786 -2593187 -2698716 -2952981
17945 -2952981 -3182570 -3315536 -3395450 -3425815 -3385711 -3244421 -3135468 -3153885 -3175796 -3168939 -3130621
17934 -3130621 -3072029 -2924792 -2926066 -2881662 -2768191 -2696459 -2676390 -2655904 -2617260 -2526792 -2433084
17923 -2433084 -2419856 -2709591 -3071116 -3166061 -3245324 -3225326 -3223159 -3179055 -3039165 -2962238 -3033280
17912 -3033280 -3006792 -2939870 -2900803 -2870871 -2821937 -2785067 -2885746 -2940189 -2905412 -2854846 -2845853
17901 -2845853 -2830751 -2729739 -2720745 -2763120 -2812057 -2826887 -2770244 -2727296 -2771600 -2749131 -2687991
17890 -2687991 -2665874 -2673686 -2714173 -2677160 -2631632 -2656328 -2620263 -2518887 -2493550 -2591839 -2737059
17879 -2737059 -2724934 -2636652 -2488949 -2406618 -2442774 -2520871 -2470181 -2479434 -2569323 -2631729 -2639569
17868 -2639569 -2615646 -2490637 -2500679 -2572644 -2615743 -2609915 -2534183 -2457373 -2506998 -2508609 -2429637
17857 -2429637 -2419416 -2417594 -2429579 -2477510 -2404106 -2365433 -2363484 -2420587 -2436129 -2361324 -2283871 -2310606
17845 -2310606 -2373109 -2438187 -2473588 -2364756 -2357490 -2384358 -2467087 -2468052 -2496346 -2493167 -2504767 -2417865
17833 -2417865 -2333395 -2369947 -2302097 -2255931 -2325257 -2348187 -2393979 -2382277 -2462085 -2525482 -2441447
17822 -2441447 -2352515 -2310507 -2334864 -2395052 -2407599 -2373570 -2433535 -2471259 -2502598 -2486022 -2486792 -2461400
17810 -2461400 -2346946 -2240499 -2288641 -2264679 -2273730 -2251807 -2295703 -2263825 -2299020 -2349496 -2324316
17799 -2324316 -2294978 -2326470 -2329861 -2298425 -2178296 -2180534 -2266410 -2300809 -2364635 -2345870 -2356255
17788 -2356255 -2321638 -2221936 -2133678 -2120071 -2088277 -2105306 -2146959 -2270229 -2298058 -2302724 -2226178
17777 -2226178 -2174110 -2198351 -2184574 -2197676 -2229499 -2192357 -2136008 -2172669 -2143950 -2134343 -2165904
17766 -2165904 -2192339 -2207106 -2187573 -2174396 -2177452 -2162815 -2126497 -2143841 -2165368 -2228155 -2194651
17755 -2194651 -2174038 -2166402 -2097482 -2050276 -2060574 -2091015 -2078601 -2061497 -2139701 -2124867 -2052770
17744 -2052770 -2052864 -2051907 -2012383 -2063860 -2147612 -2159731 -2133731 -2114246 -2142503 -2107606 -2053715 -2051605
17732 -2051605 -2039831 -2050929 -2121107 -2131394 -2149516 -2184425 -2121928 -2094738 -2063020 -2021668 -2031530
17721 -2031530 -1958471 -1917364 -1951324 -1948223 -1928400 -1964116 -1912540 -1830409 -1775641 -1824781 -1903935
17710 -1903935 -1963334 -1989746 -1984309 -1968057 -1890355 -1816896 -1759075 -1832959 -1868510 -1838876 -1909827
17699 -1909827 -1967117 -1927935 -1863120 -1939946 -2046126 -2124342 -2074519 -1957598 -1963118 -2036760 -2059218
17688 -2059218 -2042735 -2013710 -1982741 -1973771 -1971637 -1986739 -2003814 -2019818 -2011681 -1969483 -1987544 -1934705
17676 -1934705 -1800871 -1761573 -1728115 -1711206 -1769319 -1813961 -1838205 -1820647 -1843239 -1860451 -1824335
17665 -1824335 -1761490 -1694681 -1751645 -1732887 -1732367 -1755942 -1835369 -1892801 -1941071 -1937043 -1925452 -1922630
17653 -1922630 -1919463 -2000582 -1997315 -1957695 -1899237 -1909876 -1852397 -1784663 -1775036 -1817938 -1707782 -1702817
17641 -1702817 -1677763 -1672519 -1816984 -1865633 -1838199 -1870906 -1942853 -1936668 -1944935 -1937943 -1857730 -1785374
17629 -1785374 -1822922 -1786280 -1796852 -1758279 -1690315 -1722639 -1716338 -1668232 -1768582 -1775168 -1787862
17618 -1787862 -1755425 -1747763 -1824796 -1875649 -1875822 -1851861 -1810023 -1852646 -1896777 -1876400 -1775244 -1767417
17606 -1767417 -1787872 -1821086 -1785789 -1791778 -1749648 -1684331 -1640896 -1699455 -1773052 -1728755 -1659675
17595 -1659675 -1661824 -1696408 -1605903 -1586818 -1665900 -1745460 -1699377 -1678289 -1748199 -1802215 -1761131
17584 -1761131 -1708522 -1707591 -1681651 -1589114 -1584857 -1642809 -1647150 -1664952 -1710927 -1639286 -1657251 -1674687
17572 -1674687 -1581663 -1624096 -1625510 -1636992 -1698992 -1659006 -1653796 -1733672 -1716763 -1712519 -1743280 -1698584
17560 -1698584 -1630909 -1663313 -1643196 -1520068 -1563593 -1585135 -1682616 -1775304 -1779301 -1714280 -1713841 -1668560
17548 -1668560 -1662255 -1745918 -1750696 -1661168 -1591164 -1561054 -1565475 -1611939 -1562069 -1578717 -1659644 -1677396
17536 -1677396 -1632205 -1606469 -1594883 -1633354 -1681765 -1684513 -1714919 -1673272 -1661801 -1620230 -1562977
17525 -1562977 -1491874 -1511896 -1604414 -1632906 -1661966 -1673988 -1657334 -1588089 -1451593 -1458942 -1526206
17514 -1526206 -1534335 -1494322 -1527923 -1559525 -1572544 -1591504 -1625670 -1527152 -1516191 -1616654 -1589531
17503 -1589531 -1531390 -1541244 -1500939 -1494768 -1496717 -1526406 -1645066 -1641058 -1593059 -1593042 -1643450 -1608161
17491 -1608161 -1607998 -1633829 -1685910 -1712397 -1708910 -1650895 -1594726 -1497828 -1426451 -1463204 -1493119 -1494256
17479 -1494256 -1527697 -1463994 -1493960 -1551821 -1557187 -1577397 -1609528 -1637190 -1665888 -1583718 -1566343
17468 -1566343 -1605146 -1488151 -1456680 -1492492 -1483312 -1463723 -1458225 -1419816 -1360567 -1399666 -1358260
17457 -1358260 -1287129 -1330649 -1512914 -1538342 -1497822 -1423363 -1379267 -1410527 -1487511 -1526760 -1508284
17446 -1508284 -1406246 -1408687 -1496948 -1581336 -1589532 -1565139 -1529034 -1528853 -1492740 -1552043 -1603481 -1566918
17434 -1566918 -1515489 -1411379 -1407008 -1480888 -1525186 -1513595 -1496384 -1489480 -1424853 -1468218 -1413098
17423 -1413098 -1451728 -1476743 -1456953 -1507251 -1515758 -1525622 -1554065 -1620221 -1597597 -1591156 -1530363 -1474220
17411 -1474220 -1454558 -1429648 -1506995 -1496042 -1491763 -1492763 -1448828 -1434256 -1404564 -1399777 -1405368 -1356984
17399 -1356984 -1391993 -1420452 -1374517 -1335440 -1321631 -1273123 -1250467 -1313999 -1413557 -1471639 -1461346
17388 -1461346 -1441216 -1391398 -1313385 -1403412 -1459761 -1526401 -1495758 -1444509 -1414446 -1436295 -1444084
17377 -1444084 -1419949 -1419472 -1437010 -1416863 -1408532 -1401739 -1487959 -1392306 -1393994 -1406808 -1484228 -1515305
17365 -1515305 -1436100 -1400585 -1334525 -1319820 -1364008 -1351055 -1282521 -1232212 -1252452 -1345031 -1482317
17354 -1482317 -1470990 -1260674 -1140955 -1159925 -1290960 -1398075 -1375528 -1432631 -1435375 -1346614 -1328006
17343 -1328006 -1327738 -1319586 -1321462 -1259284 -1340630 -1372281 -1433592 -1469390 -1403833 -1327461 -1340721 -1418675
17331 -1418675 -1376105 -1329129 -1290143 -1286228 -1306003 -1250635 -1228191 -1307664 -1332293 -1350816 -1389815
17320 -1389815 -1411219 -1342529 -1302486 -1320879 -1352364 -1380387 -1309833 -1288230 -1343021 -1356357 -1282120
17309 -1282120 -1261912 -1188385 -1215220 -1215026 -1239323 -1257566 -1224757 -1226207 -1320857 -1220808 -1166500 -1243518
17297 -1243518 -1260287 -1278671 -1306489 -1352410 -1331329 -1271723 -1196810 -1243694 -1318940 -1369689 -1350856
17286 -1350856 -1358990 -1379175 -1375215 -1317202 -1257408 -1225450 -1241700 -1283605 -1281015 -1186464 -1158689 -1072542
17274 -1072542 -1044834 -1061501 -1118238 -1110619 -1078092 -1033981 -1060555 -1181865 -1164870 -1142124 -1167288
17263 -1167288 -1126884 -1123345 -1224026 -1264295 -1271260 -1317329 -1255001 -1202798 -1198717 -1201798 -1147335 -1163201
17251 -1163201 -1271280 -1242372 -1287989 -1308931 -1308735 -1210350 -1181811 -1162241 -1078073 -1067918 -1139689
17240 -1139689 -1205135 -1281138 -1319360 -1303693 -1193234 -1108166 -1082983 -1103897 -1088092 -1089130 -1089855 -1133527
17228 -1133527 -1235812 -1327412 -1338452 -1215680 -1173641 -1186921 -1190682 -1098999 -1037791 -1090834 -1084938
17217 -1084938 -1144232 -1219240 -1234890 -1242256 -1180050 -1191987 -1148273 -1057853 -1094934 -1137951 -1086729
17206 -1086729 -1053170 -1074580 -1106552 -1177182 -1155854 -1155325 -1169761 -1205607 -1197621 -1218740 -1242068 -1189390
17194 -1189390 -1154475 -1185339 -1236953 -1263689 -1210091 -1198838 -1287985 -1285405 -1216435 -1209041 -1239305 -1206001
17182 -1206001 -1111606 -1047625 -1009390 -1007782 -1081260 -1132862 -1235214 -1189215 -1189588 -1105314 -1144576 -1135066
17170 -1135066 -1054390 -1008913 -990616 -1009638 -947945 -895975 -961678 -988039 -989375 -995081 -992294 -1048901
17158 -1048901 -1090607 -1136710 -1189521 -1217073 -1250976 -1212325 -1120249 -1106694 -1019195 -1000756 -1001517 -1016399
17146 -1016399 -1035351 -1052970 -1089677 -1135718 -1089031 -1104532 -1080922 -1056690 -1004217 -963354 -998438
17135 -998438 -1082035 -1145148 -1155243 -1131708 -1104187 -1053985 -1020412 -1066094 -1131425 -1149201 -1072638
17124 -1072638 -1055893 -1107319 -1173010 -1176151 -1134109 -1106510 -1128963 -1174801 -1154777 -1128533 -1152581
17113 -1152581 -1093498 -1162579 -1098977 -993293 -1036060 -1057288 -1056114 -1029315 -1042838 -1121571 -1162976
17102 -1162976 -1149493 -1069924 -1032797 -1018286 -1016502 -1030756 -991830 -1015122 -1094327 -1040794 -1005141
17091 -1005141 -1018399 -1045509 -1021027 -939608 -979942 -980207 -1019951 -994533 -1005371 -980048 -1006756 -1077299
17079 -1077299 -1134300 -1136090 -1114114 -1089873 -1099553 -1084843 -1078146 -1119075 -1167215 -1172925 -1107273 -1120543
17067 -1120543 -1066752 -1016324 -1053020 -1076143 -1070487 -1128856 -1047467 -940129 -861821 -858419 -952051
17056 -952051 -1013112 -1074771 -1140157 -1099251 -1076332 -1069851 -1005240 -999608 -1025727 -1061504 -1038850 -1109060
17044 -1109060 -1036045 -1013309 -1054417 -1046984 -999753 -1022470 -1003085 -1044843 -1052383 -969300 -1014899 -1078381
17032 -1078381 -1020426 -1079915 -1051575 -1078818 -1048109 -960354 -944201 -969622 -1006094 -1016096 -1017795
17021 -1017795 -1032143 -1010924 -1033407 -1038731 -1039033 -931535 -863284 -920035 -1011739 -1034610 -1019726 -974538
17009 -974538 -984440 -1057073 -1051418 -989150 -976885 -946728 -979247 -996910 -1000132 -1011579 -940192 -911282
16997 -911282 -921080 -1005911 -1124245 -1145193 -1038054 -961286 -996603 -966403 -962191 -994567 -1024646
16986 -1024646 -969809 -971600 -1054806 -1074146 -1072924 -986325 -907099 -916891 -1015076 -1000593 -1017250 -1004156
16974 -1004156 -1002060 -980399 -955842 -1009108 -998702 -943622 -866894 -817781 -898425 -925875 -937517
16963 -937517 -1004533 -961078 -872483 -879242 -930138 -902972 -901039 -944192 -897529 -741259 -760969 -847439
16951 -847439 -852985 -876845 -925904 -962924 -984228 -970917 -962956 -1033682 -1012711 -1052279 -1030445 -922410
16939 -922410 -800523 -767256 -867581 -903380 -869696 -812085 -834345 -943440 -923016 -876681 -833328
16928 -833328 -848522 -870968 -877804 -848599 -797927 -788268 -866109 -863480 -893583 -913214 -852067 -843248
16916 -843248 -836896 -848328 -880105 -905270 -893182 -908156 -946920 -910901 -845813 -790581 -858761 -922710
16904 -922710 -938930 -885121 -849500 -893511 -900665 -918341 -892529 -948019 -973342 -915790 -952637 -954515
16892 -954515 -959987 -938942 -898098 -774068 -742558 -737160 -709518 -745496 -784238 -912977 -965884
16881 -965884 -923956 -873825 -798867 -708556 -779179 -766220 -709682 -757977 -715873 -656581 -684128
16870 -684128 -702152 -681090 -640848 -703837 -729360 -770102 -799695 -834063 -907776 -914184 -987945 -938350
16858 -938350 -865810 -840864 -869844 -824995 -791470 -823777 -803385 -823028 -799221 -881709 -918833
16847 -918833 -950487 -870530 -820918 -875893 -879315 -865540 -861855 -830918 -866047 -890186 -881438 -819796
16835 -819796 -843358 -900232 -832313 -787412 -794757 -733323 -696247 -720947 -754035 -835659 -909868 -984943
16823 -984943 -918280 -858075 -799098 -727317 -694454 -742801 -741060 -705617 -689387 -641961 -675187 -665961
16811 -665961 -677011 -672533 -659697 -724905 -787386 -799147 -796155 -844757 -846578 -835918 -800296 -743613
16799 -743613 -776530 -775927 -752727 -772417 -762881 -727442 -730739 -765904 -765967 -871129 -962271 -884821 -833529
16786 -833529 -901767 -917849 -804245 -706150 -729227 -736090 -790080 -855040 -881087 -885930 -819691 -745763
16774 -745763 -728190 -710482 -750293 -807861 -786256 -703104 -624886 -586493 -642741 -756424 -734968
16763 -734968 -736246 -809238 -865623 -939270 -834808 -746589 -705073 -589262 -579173 -634285 -625203
16752 -625203 -651897 -680439 -688579 -694628 -659135 -678265 -763595 -765270 -734789 -780673 -788373 -766816
16740 -766816 -782672 -820066 -807267 -757812 -728280 -712451 -654486 -628210 -686990 -706316 -717844
16729 -717844 -703152 -724136 -700832 -613732 -650160 -773026 -789070 -735783 -755167 -813042 -829828
16718 -829828 -793255 -804703 -765086 -733080 -750752 -743528 -751518 -764926 -716359 -793797 -746642 -666205
16706 -666205 -742728 -751954 -707366 -662618 -661971 -659718 -720543 -716400 -584353 -670569 -859734 -844477
16694 -844477 -811781 -810934 -781855 -752394 -678957 -672613 -718254 -854504 -782321 -671255 -624028 -595352
16682 -595352 -547425 -596330 -642835 -633649 -692814 -692338 -720631 -715982 -694935 -687137 -676010 -671858 -650201
16669 -650201 -600134 -571975 -627782 -671968 -667696 -685677 -737990 -705522 -628005 -590418 -573290 -502932
16657 -502932 -470808 -532925 -617000 -664887 -656043 -649452 -652678 -618143 -672632 -732587 -708881 -739468
16645 -739468 -772774 -714065 -611734 -566141 -623813 -593458 -658841 -711026 -760471 -757671 -666036
16634 -666036 -606313 -629381 -628482 -629707 -643022 -672716 -634604 -614444 -606366 -600372 -586097 -600884
16622 -600884 -547216 -555864 -644188 -620138 -539023 -575419 -653658 -717933 -710170 -660072 -677763 -630526
16610 -630526 -590252 -579424 -482933 -520669 -613272 -585141 -599659 -624514 -699409 -766445 -747514
16599 -747514 -677595 -667881 -628005 -642144 -665845 -745888 -814504 -798030 -777366 -713318 -669476 -694478
16587 -694478 -567929 -498831 -612576 -636894 -633013 -640927 -661631 -648707 -582656 -575765 -581678 -673072
16575 -673072 -681295 -665186 -657951 -653038 -659554 -661111 -635684 -639299 -647300 -598069 -499939 -569310 -635809
16562 -635809 -564263 -522789 -604367 -696027 -721565 -671881 -704673 -724606 -679418 -607329 -653910
16551 -653910 -662882 -675253 -643017 -678953 -730148 -617495 -547270 -569098 -496730 -491307 -537087 -650843
16539 -650843 -652726 -620364 -564195 -566917 -619053 -582285 -560344 -532336 -506893 -490679 -598996 -666747
16527 -666747 -599865 -495107 -565006 -625362 -572585 -595194 -589894 -581411 -454943 -404599 -483087
16516 -483087 -515704 -559624 -596409 -634478 -683615 -645545 -619223 -558460 -486127 -496134 -626058
16505 -626058 -716216 -682927 -641751 -623386 -642352 -648907 -693880 -594675 -605477 -574068 -591201 -584413
16493 -584413 -510080 -484692 -510999 -547887 -456259 -394515 -497823 -545715 -555489 -503321 -558755
16482 -558755 -555895 -572211 -579380 -592450 -545666 -483607 -551773 -557450 -553344 -550453 -526973 -483134
16470 -483134 -489431 -603178 -619973 -633369 -696214 -617898 -588563 -623587 -642794 -654586 -573335
16459 -573335 -518021 -483376 -548408 -563648 -494244 -511678 -521569 -466535 -453525 -460522 -493345 -601650
16447 -601650 -601041 -591505 -611314 -532552 -530308 -520636 -601609 -685444 -602831 -601923 -573818 -554496 -524101
16434 -524101 -496775 -549640 -570569 -598177 -535654 -476738 -621418 -631627 -607435 -524726 -570452
16423 -570452 -594807 -504007 -416532 -376924 -441353 -460738 -484752 -527029 -593586 -555141 -467090
16412 -467090 -476798 -496046 -502178 -525043 -457725 -456639 -566188 -569489 -496065 -481624 -545811 -532872
16400 -532872 -532909 -529547 -518891 -555815 -601518 -575507 -546884 -529296 -488732 -426160 -460801 -572690
16388 -572690 -572316 -399995 -394806 -501745 -495605 -486891 -508677 -451928 -410038 -415017 -439829 -462185
16376 -462185 -489778 -596217 -566090 -488938 -475813 -454135 -413254 -422055 -412968 -443890 -519208 -540834
16364 -540834 -508987 -540042 -564199 -564043 -512729 -467365 -467646 -434681 -448456 -476530 -509271 -498725
16352 -498725 -432174 -420660 -559066 -609818 -619503 -598926 -573705 -554859 -582804 -545751 -495687
16341 -495687 -523159 -501127 -514819 -495619 -518711 -458640 -354970 -229155 -267104 -279429 -399107
16330 -399107 -357072 -316276 -396585 -423940 -438556 -516338 -465034 -378966 -312457 -352103 -454246
16319 -454246 -514828 -555412 -568669 -611837 -605112 -593701 -502988 -445531 -397880 -360228 -384641 -442522
16307 -442522 -490129 -455069 -458030 -504777 -527862 -473905 -443536 -396165 -393264 -451014 -443865 -387021
16295 -387021 -367233 -459322 -607076 -629038 -535250 -519442 -461714 -478179 -383631 -361888 -451990
16284 -451990 -483913 -440219 -435514 -449811 -476348 -495103 -447286 -373705 -391542 -469324 -469474 -460752
16272 -460752 -466100 -521898 -534635 -558747 -532930 -551520 -551891 -484187 -491665 -565012 -530625 -496043
16260 -496043 -525083 -531437 -485309 -465060 -437557 -385982 -398465 -418314 -389350 -309328 -354271 -372717
16248 -372717 -382281 -455057 -461475 -430721 -428507 -482293 -459964 -450018 -566951 -624760 -488186 -393220
16236 -393220 -374567 -389519 -425549 -349670 -299296 -306747 -391343 -453854 -442229 -380008 -359981 -486877
16224 -486877 -417008 -290199 -247415 -267935 -354136 -417064 -333378 -303271 -288635 -348709 -393658
16213 -393658 -366189 -392573 -340150 -382297 -406091 -402597 -421037 -470923 -436047 -357254 -361480 -346133
16201 -346133 -315427 -317479 -310244 -328938 -381309 -391389 -354495 -373072 -432047 -433157 -324449 -340446
16189 -340446 -433424 -465576 -485349 -458072 -404518 -350555 -285722 -323381 -355449 -300887 -278179
16178 -278179 -336380 -413196 -458348 -472959 -321939 -308969 -309368 -315232 -377926 -321770 -258559 -280240
16166 -280240 -322393 -324518 -308620 -290606 -240415 -253314 -396287 -396746 -304372 -355491 -330925 -262716
16154 -262716 -246599 -291017 -196151 -130402 -212493 -316844 -329344 -320768 -417661 -523393 -485078
16143 -485078 -477726 -459223 -449381 -452874 -473633 -419146 -345709 -236190 -234078 -227465 -273889 -321766
16131 -321766 -393173 -414963 -386632 -347516 -350105 -377026 -320871 -372508 -371420 -395476 -374661 -411358
16119 -411358 -366155 -421204 -449536 -417356 -356441 -373310 -292971 -287537 -281905 -301828 -320556 -342976
16107 -342976 -335428 -332039 -382639 -368534 -389145 -471004 -495015 -516555 -456011 -443415 -353596 -262311
16095 -262311 -235117 -263920 -245012 -228341 -328689 -399451 -385558 -364968 -353222 -263124 -285776
16084 -285776 -359116 -398915 -328678 -293559 -230428 -235796 -287307 -337188 -375410 -373158 -319360 -303743
16072 -303743 -313531 -296571 -337594 -329014 -305177 -269996 -197824 -251081 -294284 -300852 -367866 -356843
16060 -356843 -287448 -273680 -343835 -419310 -439796 -432195 -356984 -317584 -319261 -318594 -305264 -289178
16048 -289178 -277434 -301474 -266886 -223543 -232307 -334051 -370058 -287559 -262764 -297738 -334659
16037 -334659 -311594 -276778 -285803 -238879 -226821 -269560 -349976 -375801 -336168 -296451 -282812 -240194
16025 -240194 -210551 -275162 -317664 -276830 -239789 -255364 -251818 -290810 -312249 -294876 -228484 -235552
16013 -235552 -235923 -248079 -211751 -190392 -231392 -181266 -143820 -267760 -288849 -228831 -151914 -162301
16001 -162301 -208707 -203577 -263363 -321314 -342027 -349457 -321370 -341836 -409128 -335605 -288627 -344351
15989 -344351 -273489 -208560 -155113 -194729 -219405 -277186 -322667 -403256 -437708 -366449 -295077
15978 -295077 -255222 -261043 -175054 -144489 -253082 -311925 -427747 -439628 -424332 -424168 -384752 -364945
15966 -364945 -374986 -378286 -353479 -386483 -387011 -357275 -361192 -412346 -300660 -294524 -313568 -274762
15954 -274762 -214898 -260293 -243686 -246587 -337685 -368571 -290801 -268198 -298820 -324224 -312439 -295976
15942 -295976 -328082 -293673 -291069 -246396 -121535 -146741 -261409 -368253 -302199 -275276 -304929
15931 -304929 -301153 -247077 -327326 -354943 -310428 -275692 -244086 -312957 -370429 -326805 -248777 -136588
15919 -136588 -119101 -220967 -342001 -439012 -396064 -311563 -291674 -341007 -467667 -427800 -432263
15908 -432263 -393149 -345372 -322491 -261698 -254072 -332207 -393546 -284109 -291580 -295698 -375549 -325499
15896 -325499 -279558 -224869 -224227 -317863 -408599 -439307 -381680 -321967 -287681 -257541 -284824 -267772
15884 -267772 -266905 -252830 -187406 -131953 -211753 -301445 -272405 -205176 -248471 -290700 -267275 -231260
15872 -231260 -214939 -233476 -195882 -238360 -342936 -344874 -314990 -307254 -309314 -325826 -263252 -199038
15860 -199038 -201949 -193820 -186409 -174647 -185007 -159966 -199940 -249684 -294131 -325447 -425462 -496358
15848 -496358 -405348 -333390 -335657 -277391 -277948 -234576 -203773 -217878 -179854 -227035 -273483 -334505
15836 -334505 -318746 -322271 -324578 -320118 -349583 -357486 -279152 -198536 -202707 -192946 -211519 -244181 -261678
15823 -261678 -251316 -303230 -298246 -236289 -264676 -279796 -245324 -320164 -338588 -262818 -208240 -135319
15811 -135319 -228141 -239911 -222700 -267378 -267800 -307986 -357069 -363634 -385917 -295614 -203279 -205948
15799 -205948 -151634 -195786 -181165 -115742 -122596 -178392 -185330 -72624 -20681 -100398 -175793 -186359
15787 -186359 -247785 -190839 -225747 -242526 -251852 -173131 -122689 -113818 -164699 -195908 -219866 -177807
15775 -177807 -222793 -236647 -143836 -166808 -163822 -155931 -174804 -184503 -149361 -152321 -171887 -100433
15763 -100433 -100909 -127904 -154681 -138403 -151784 -214476 -184918 -181918 -277840 -285531 -214433 -173088
15751 -173088 -250718 -186283 -65452 -62291 -59488 -19388 -183295 -231634 -190339 -192366 -247723 -325750
15739 -325750 -254811 -260075 -228835 -250874 -233823 -227284 -193421 -178132 -115752 -72816 -118055 -190242
15727 -190242 -166473 -167921 -178614 -120371 -141696 -129378 -86416 -42024 -15859 -66729 -52741 -92198
15715 -92198 -178908 -303435 -251283 -194712 -219368 -215203 -248759 -176911 -100734 -123846 -60127 -47521
15703 -47521 -122650 -236400 -255845 -253407 -320654 -303875 -200369 -149011 -126455 -105495 -139832
15692 -139832 -210670 -239667 -286233 -257618 -218750 -88713 -180958 -217704 -224483 -210777 -236079
15681 -236079 -267978 -271752 -243958 -211673 -163538 -174829 -215047 -198084 -185478 -158121 -88129 -71000
15669 -71000 -55625 -66311 -58650 -80481 -85948 -206561 -323787 -294188 -252970 -181977 -146307 -9487
15657 -9487 9669 -84788 -106577 -112845 -212150 -201763 -168414 -120985 -53392 -83259 -193194 -174256
15645 -174256 -113696 -83704 -78630 -89236 -164180 -195399 -202171 -319204 -336464 -264350 -101670
15634 -101670 -5221 -109335 -133679 -65300 -45785 -78266 -20806 26599 10466 -24352 -94448
15623 -94448 -33542 -19780 -36039 16703 32955 6464 -44305 -36690 -77978 -136198 -141019 -162314
15611 -162314 -105010 -99389 -86588 -53423 -114019 -187454 -236527 -185689 -109767 -107986 -164070 -159231
15599 -159231 -93919 -56453 -67051 21570 50371 19347 -34097 -40355 -115958 -83760 -85687 -52481
15587 -52481 -68240 -58143 -82560 -137386 -106373 -41970 -60401 -90681 -35789 -83858 -93506 -78267
15575 -78267 -7394 -5053 16034 -34849 -21533 -39269 -79774 -94747 -52173 -93655 -153731 -188498
15563 -188498 -154020 -96037 -118141 -147491 -118226 -147789 -210069 -115093 -105924 -102549 -16656 -25781
15551 -25781 -38356 -49270 -122605 -132452 -144042 -160855 -55263 -55502 -137538 -163580 -129186 -148652
15539 -148652 -154831 -124863 -141063 -72507 -21694 -12124 -25140 -94521 -185604 -197242 -150196 -37946
15527 -37946 -35440 -61706 -202032 -214809 -129246 -38958 -20067 -19521 -81136 -162469 -110296 -22043
15515 -22043 -57 -17798 9037 -54395 -98472 -127164 -146400 -143381 -115554 -70562 -4906 -23728
15503 -23728 -68997 -73332 -109202 -79399 -34269 -58615 -52713 -94470 -116787 -83018 -124303 -176907
15491 -176907 -117417 -135839 -124281 -96700 -112377 -10287 60102 93103 140878 103991 -17558
15480 -17558 -91436 -86054 -41358 -29587 -44900 -69899 -106095 -101850 -166670 -172706 -102590 59819
15468 59819 78632 -35879 -123346 -114612 -130348 -195176 -129873 -168315 -182996 -132579 -113282 -114934
15456 -114934 -82215 -182493 -141465 -21763 12945 57169 80555 48437 -46500 -79217 -90645
15445 -90645 -110257 -131885 -146755 -190472 -175791 -177525 -279965 -282329 -113608 -36994 -79494 -56650
15433 -56650 -1903 -7938 -97594 -117024 -127564 -169651 -127497 -17303 29540 77716 70072 -34089
15421 -34089 -31898 -94458 -66339 -23978 4391 -42186 13445 1238 -36676 -18332 -60852 -30942
15409 -30942 97054 63543 54312 115773 104182 5247 -30012 -90553 -54716 -17097 -77431 -192892
15397 -192892 -187479 -93680 -53337 -111904 -48933 4012 -20073 -15959 -80106 -103159 -125273 -143813
15385 -143813 -89881 -52972 -75451 -31426 -69083 -7468 39216 7460 -23615 -36827 -15616
15374 -15616 77200 72484 -28466 19709 2682 -6671 20623 93941 150737 104301 50046 -18142
15362 -18142 -14025 -43460 -73709 -286 37215 -27770 -25253 -20842 -61590 -47509 8022 14711
15350 14711 -40616 -25833 23043 -3568 30338 14429 43396 67746 -14051 -3567 82857 80304
15338 80304 95443 65201 -2440 -27515 -49750 -91699 -97332 -95843 -41467 318 41871 36091
15326 36091 56414 89121 36950 23160 53287 101910 80733 16223 51002 101805 121503 162735
15314 162735 150664 126257 120715 4294 -22951 -86477 -47317 -40229 -92859 -88334 -63927 -131282
15302 -131282 -71297 -19460 -28364 881 6953 -42375 -103215 -81721 -31598 13059 29968 40725
15290 40725 45020 -28214 -81045 -99665 -45338 -13686 -37219 10375 -23343 -43402 -76712 -28300
15278 -28300 -27350 7414 68986 7680 -31581 -49170 -28527 21435 57797 97245 30714 17621
15266 17621 23971 14049 -26175 -56253 -48677 -117028 -86088 15056 -3903 -20137 26911 44775
15254 44775 68175 119878 183044 173844 127367 85386 49624 146412 237332 242796 151744 59839
15242 59839 103723 139752 96775 105585 150263 153924 157774 142411 57868 88535 54204 28430
15230 28430 20448 33508 192660 236558 157146 137393 136706 103083 35803 61580 157014 172095
15218 172095 130294 81017 83704 57329 31193 40156 -32332 -41040 25439 99469 23165 -18852
15206 -18852 3802 9256 23072 37211 71069 78077 18036 54517 192630 152901 21672 -63211
15194 -63211 -35954 -15645 -16223 -5231 -18181 -595 76831 53419 74395 73476 157592 155197 71233
15181 71233 29378 11641 65445 6366 -54003 -17183 84257 57714 6659 15723 18739 -3340
15169 -3340 83514 98229 87709 104584 118050 29642 39907 106161 132184 149979 57595 -8436
15157 -8436 -40393 45192 185976 135239 137436 165589 129861 141084 119458 117329 107037 110466
15145 110466 229630 339147 285172 231234 163688 177265 201423 205509 161601 170367 205647
15134 205647 192239 174666 74452 58154 56460 50863 55732 26406 54831 56452 116953 70250
15122 70250 37295 102649 204476 259589 319102 250314 227905 258597 154767 69342 105393
15111 105393 183948 152753 122113 115905 119576 131510 208010 228244 154480 176682 197262 215802
15099 215802 83375 48395 55301 89905 138165 147663 147761 110884 59050 -14328 -40685 45331
15087 45331 115747 190902 165047 161457 164585 120372 122920 119913 127740 161642 125343 114856 95749
15074 95749 81157 163942 114490 106520 140076 94922 140517 178076 181312 166454 199864 204546
15062 204546 127222 126396 150018 56179 75128 166069 164043 113310 105118 145863 111594 113447
15050 113447 215628 199063 153961 111299 43975 73158 119192 130453 233009 251113 213744
15039 213744 208724 253489 234678 126673 98335 136584 149431 160298 157996 92003 92238 118250
15027 118250 118405 53827 70377 107334 147767 171932 219392 222959 238634 224559 205879 190399
15015 190399 122941 54288 131210 195835 201363 191949 204574 135878 86191 127801 155554 115710
15003 115710 85171 93270 70593 70984 130898 98385 25916 8832 72710 108566 100652 29812
14991 29812 17707 89301 166231 191916 183276 169811 201286 148188 215770 242737 224394 196948
14979 196948 312173 384324 288989 217275 232670 257776 314344 295409 304577 313315 290419 260241
14967 260241 235140 246003 255852 235293 192624 175468 161316 164502 233877 244487 215854 234115
14955 234115 224071 321860 408365 378996 306676 322505 360881 453925 356609 201558 161491
14944 161491 164075 214368 211148 149782 130831 98226 190252 146409 108226 93510 99874 134014
14932 134014 178357 126962 107487 175182 173476 94150 59490 63710 84887 40433 35009 49893
14920 49893 46830 159937 171548 133102 160734 132334 82224 85200 171942 199301 196251 205731
14908 205731 118379 90715 90386 115397 141123 127515 105437 134693 82702 121248 175419 226176
14896 226176 218912 180366 170592 218517 209261 184128 183858 162922 187831 266559 227208 117405
14884 117405 129769 183910 160728 120862 132743 165549 159383 121706 69232 152241 202789 220321
14872 220321 156877 78784 46124 94563 132389 162893 246494 271205 245828 217869 203252
14861 203252 125243 218690 244272 168967 92969 158215 220170 267276 239252 244304 178259 151757
14849 151757 205898 171253 137062 185391 266891 203859 123482 90728 117030 92379 52162
14838 52162 138821 83151 32637 7363 3536 64752 151352 140683 156569 269395 237599 136938
14826 136938 99796 73825 109880 152427 117787 194011 218927 233470 210181 233021 290537
14815 290537 293173 276540 273812 238479 298984 342288 318277 236131 187589 189460 164257 237772
14803 237772 330997 338074 376557 324679 260469 305774 366575 321320 332653 381016 283033 284055
14791 284055 262981 243115 318135 303872 248100 198236 183289 206990 207171 264066 292492 281140
14779 281140 256131 255888 312001 321826 333753 352823 380897 379224 329495 295827 289050 289529 267382
14766 267382 217394 278065 293942 360314 319203 276877 237311 223368 155655 136460 160979
14755 160979 221837 270902 271084 323426 235399 190878 256854 230111 171178 173337 191938 222298
14743 222298 294593 258794 206093 231186 228869 180214 110236 100275 154327 127073 147127 207162
14731 207162 301947 334050 340080 298906 373122 328640 205796 164958 206406 262510 227306
14720 227306 208267 199957 164500 168284 188481 179999 104866 141397 82268 67244 108308 126244
14708 126244 159786 330478 430810 355186 311090 254391 261759 258838 287101 273769 215642
14697 215642 175001 257302 311329 264286 220808 237827 197578 201112 225166 282571 249988 303248
14685 303248 329918 344351 312121 291335 278938 285213 356208 352458 413945 443610 460715 413067
14673 413067 320948 322541 226970 163886 219114 274655 306815 269842 269258 242316 248762 226204
14661 226204 297685 351326 317526 275631 270340 292659 337321 348797 350267 350011 241444 255817
14649 255817 279517 263229 303601 390101 431736 374008 344467 331577 281959 237744 352229
14638 352229 411254 402472 328227 230378 228499 216063 252680 213397 210300 229084 367367 394404
14626 394404 352400 320438 323986 281424 235267 249710 275149 326391 302195 229383 213674 288761
14614 288761 284371 199759 129351 75063 56178 68978 175597 298619 350630 331206 330029
14603 330029 288109 315913 208268 224908 269187 367912 434687 432032 400833 422647 381732
14592 381732 310975 295862 292558 353624 317829 220135 252865 253676 195947 247193 261860 292588
14580 292588 237942 160960 203811 230094 281778 354331 338391 324910 303381 316496 330657
14569 330657 261713 318271 393123 361989 359250 422190 446065 348344 257172 309234 329434 339335
14557 339335 349352 418095 379993 353580 384121 417576 455716 454230 400292 409153 372619 303340
14545 303340 208242 157840 173854 219898 186186 272005 339690 402611 395514 318397 320755 352481
14533 352481 460698 494407 380537 295619 306351 361480 361906 332086 324903 322665 295323 344135
14521 344135 306493 323999 351307 304827 292675 284786 255348 282753 245800 295140 324818 343881
14509 343881 372358 365998 336377 308054 309205 285899 274234 282494 309215 260794 204846 279331
14497 279331 403775 415505 359995 281244 292820 371060 343156 366815 377270 313594 220659
14486 220659 299223 329533 382180 384256 352409 339002 447804 425671 400614 406991 366723 331001
14474 331001 311329 242762 265487 284441 262210 282163 340960 306608 324578 319366 315700 360094
14462 360094 375232 357363 373104 337501 301050 198180 133137 213577 329014 391314 472428
14451 472428 538546 465833 441008 429686 428803 419116 414715 435819 457830 461117 427421 444595
14439 444595 465452 410479 420804 384977 427642 451456 501947 496950 476895 415705 381238 313303
14427 313303 335750 390166 395712 311909 261138 244875 205597 247937 315022 370356 372292 378957
14415 378957 362797 339948 314310 278918 274602 333404 369965 327805 289577 297595 253138 163762
14403 163762 190928 110983 166979 216109 297679 391238 454110 509292 469591 420113 478138
14392 478138 503632 425850 364995 375897 422630 505078 474062 451980 368088 408537 392126
14381 392126 406586 312367 324382 386414 427614 412847 381321 345325 375914 409723 364383
14370 364383 219879 265214 476406 604166 615223 542262 557510 557219 493151 513542 450485
14359 450485 447163 523956 507663 492868 490505 455105 431153 419520 469472 554975 559004 436845
14347 436845 394445 390854 389914 363693 442403 524974 505903 490591 440904 425791 494287 479963
14335 479963 366154 321283 274520 287907 319582 345594 318638 339268 305954 258854 322666
14324 322666 308148 311674 383196 495466 476062 445419 382281 443298 420994 415518 470452 478049
14312 478049 474113 498340 466287 462228 476309 473027 511829 504342 491532 447145 436075 379992
14300 379992 362810 369218 390172 483011 394979 409624 458571 471596 451617 457522 480482 562722
14288 562722 547021 483991 492250 456294 427140 471140 467340 439830 483440 525215 573674 653531
14276 653531 551442 414864 464346 577392 528538 463316 543097 582000 536439 514185 529648
14265 529648 526734 448762 472067 538485 529794 536502 554892 461139 435065 402470 472455 507639
14253 507639 576289 567907 547311 546147 500235 482526 473536 470186 484324 477670 490256 496331 502443
14240 502443 530890 545330 486556 468169 444723 483511 526967 558768 576161 502968 461969
14229 461969 532268 529299 389100 334703 327491 300692 365737 387126 381033 406116 386115 410253
14217 410253 528429 552374 558085 554231 500137 476078 473121 542729 511490 498693 560807 601065
14205 601065 595307 527795 485081 436097 452387 402938 362328 401813 438800 446728 474539 548416
14193 548416 572834 542496 525018 511225 588864 492029 477561 423289 436054 443140 423998 412538
14181 412538 444760 515908 611344 557139 533986 509163 553106 521753 445819 450788 464399 444055
14169 444055 497942 653683 742976 718211 655222 559414 508785 531370 564763 586881 575845
14158 575845 539981 586717 613945 604225 655620 614235 617552 565448 507697 554616 523583 562082
14146 562082 594901 565233 473220 488227 563278 609032 662392 761397 768794 614094 547075
14135 547075 525516 482172 469160 353008 312772 360475 433309 459744 473815 511321 538986
14124 538986 591765 607499 539649 577470 575814 512703 542212 633089 649876 538371 474055
14113 474055 479206 484850 519948 511338 494405 497866 566198 597740 539533 488142 497004 571136
14101 571136 583906 568384 531367 561872 599419 680522 637831 576293 631860 618189 555582
14090 555582 610926 661566 601433 632842 687201 697871 645652 585972 476132 447070 555508
14079 555508 647606 683993 564697 590506 565249 463914 409166 398830 432617 457384 427179
14068 427179 428047 455029 592075 692242 660710 663961 680534 722853 703740 713907 720295 687190
14056 687190 575609 483919 416793 409610 478068 528782 478854 524729 564146 622027 627462 705474
14044 705474 745874 664071 620730 523237 456337 487865 569936 599681 635069 681876 692682
14033 692682 723038 732859 653788 583345 550306 489276 513886 579621 614036 593268 566387 608349
14021 608349 641451 639003 608798 509180 531207 617552 734031 713520 602496 603782 613794
14010 613794 617239 604711 517323 444575 525100 562489 548443 515483 575556 651644 698322 709018
13998 709018 737904 697670 666104 636607 689725 676565 643538 604794 600534 593923 541742 457940
13986 457940 520594 587980 606613 596582 537032 531867 587869 558655 592162 606812 587842 593925
13974 593925 649170 643858 525496 466189 498598 502091 618298 697260 676290 706231 610847
13963 610847 488637 524850 638111 644724 645982 653765 642018 664930 691079 680276 724802 740802
13951 740802 750295 742764 701252 696517 685306 572507 547993 562786 503116 510324 573095 564569
13939 564569 610133 657365 702578 722665 721058 721422 683796 641508 673384 653191 614051 639611
13927 639611 730612 785972 725991 696068 651335 705770 745164 718705 650135 545028 552169
13916 552169 604521 676398 703064 676447 612905 663494 704914 635258 620382 635041 600827
13905 600827 631875 649394 621853 685552 695410 712037 642421 596507 674803 783273 808489
13894 808489 759929 775457 797755 707874 595534 627745 722921 745419 720229 680261 691629
13883 691629 747546 750708 688459 712600 734779 700517 670913 672422 738044 690455 643195 635479
13871 635479 652749 618774 566444 575455 616712 684275 688625 691740 610371 570720 573011 562751
13859 562751 644937 732408 758196 749371 719887 706851 746849 720952 670250 738429 783313 709443
13847 709443 723421 759648 812244 789071 771206 797506 840338 835930 840651 815888 890236 884890
13835 884890 812269 745211 741506 722939 776874 808331 659956 567502 563489 586530 653707 756013
13823 756013 837843 816807 817091 786530 733906 755950 822531 847635 820007 851148 795281 793167
13811 793167 780905 750332 636212 669901 747526 728614 736419 783242 674396 711149 701224
13800 701224 653100 685548 720330 760662 757192 725023 762109 753845 734258 772942 754500 755039
13788 755039 782953 892418 878044 864518 778694 724719 697624 615984 625525 646840 722694
13777 722694 729530 731093 750530 882313 950128 923476 893773 868479 868193 892706 822803 778451
13765 778451 831158 845597 825770 816209 793712 795816 739179 739391 758051 868717 905156 862831
13753 862831 856054 885978 927485 943150 975028 956148 922934 875059 847301 804234 787224 743965
13741 743965 770400 807684 756775 723211 804242 780455 846546 855181 744979 820649 954097
13730 954097 896143 794196 730188 655140 659867 732605 770790 849619 925976 889192 749550
13719 749550 632382 688410 731447 734240 760375 789870 836581 852789 837957 761776 669823
13708 669823 678201 700196 648974 641850 652650 683918 665456 670825 722832 778758 811307 845922
13696 845922 859611 776818 806634 824898 801373 804108 818806 820304 797301 795170 831007 857487
13684 857487 823628 857655 919837 904540 945621 926329 840993 825720 801782 792006 862885 921843
13672 921843 944776 877831 789310 845613 919742 845174 714303 692507 754839 813925 813366 767250
13660 767250 783240 819535 877661 895694 836638 870949 900298 850612 864510 961269 956568 950826
13648 950826 939375 946129 891396 842790 833143 857337 792996 790935 819449 858702 867088 846150
13636 846150 845295 871703 886911 939741 952379 993765 989368 937959 937990 912672 881133 889780 894168
13623 894168 907259 893856 941300 943190 873375 785694 788486 844305 835071 806780 782457 829296
13611 829296 837365 810990 779141 805608 821534 758577 753588 825175 877315 848027 860845 832639
13599 832639 814843 810977 790919 815087 817376 856208 1024876 1015428 966250 1004200 1024548 1070769
13587 1070769 986088 897659 839689 886613 893516 861035 893002 890477 828796 799908 879391 928656
13575 928656 880510 837330 873018 873778 813378 850990 901934 870431 876294 810968 829217 817073
13563 817073 819146 778148 851503 833183 809480 823445 922921 918761 882445 898205 887647 848121
13551 848121 794167 803419 876689 966913 1027715 1009618 988179 939701 907146 965637 1055539 1074164
13539 1074164 1013610 1034142 1087390 1101349 994551 928652 952280 965023 975537 1044807 1082014
13528 1082014 995953 962340 989106 1033485 1015073 1070612 1099865 1091067 1082445 1116822 1066466 1064937
13516 1064937 1035612 946794 981367 1009993 962340 902363 865929 848453 857359 853563 941461 1022142
13504 1022142 1015810 944712 936923 1013532 1075443 1036134 1017134 1027687 1029449 1122526 1074626 1059623
13492 1059623 1087938 999216 990769 1034724 1006894 1026843 950503 900207 924472 990521 1004574
13481 1004574 1024517 1048685 936624 910280 921117 966814 1008740 981232 971722 952884 968723
13470 968723 1052230 1029703 1076693 1056803 988123 1035800 1079553 991434 920993 936141 932992 935809
13458 935809 945519 905910 900273 985472 1108941 1126578 1092121 1090749 1087562 1073467 1146491 1119798
13446 1119798 1074341 1026949 918171 937262 1005485 977585 1034103 1070829 1068577 1108103 1092909
13435 1092909 1036912 1044432 1025338 1084594 1163349 1158909 1121059 1086718 1026223 1010170 1049698 1076951
13423 1076951 1035253 997495 981931 962298 932903 973585 951155 940726 935919 931861 909643 954051
13411 954051 948819 982757 963381 912561 906055 951950 957872 1056094 1136457 1152121 1122340 1116235
13399 1116235 1081815 1119599 1177808 1094097 1082147 1108338 1104412 1068103 978800 934136 1013559
13388 1013559 1095008 1170156 1157486 1104472 1094342 1123195 1157633 1137436 1094842 1099743 1057687
13377 1057687 1093790 990529 976091 1007097 1042694 1047539 1000919 886500 862959 963526 1017736
13366 1017736 1051363 1037958 1032976 1042359 1132153 1155013 1037528 1005848 1103615 1058470 983698
13355 983698 1055998 1084806 1030545 1034986 1056157 1081615 1009004 979543 1042059 1096613 1103399 1131888
13343 1131888 1156320 1169795 1129384 1103306 1103010 1167499 1157923 1115222 1156834 1130373 1081169 1080173
13331 1080173 1041120 1078846 1147506 1160165 1074145 1111997 1098048 1112777 1107787 1098007 1013878 1020093
13319 1020093 1052425 1051043 1141001 1185682 1273521 1201824 1112510 1088990 1144958 1202299 1215308
13308 1215308 1197708 1187504 1135108 1116023 1098592 1104542 1063278 1089343 1176460 1202477 1183345
13297 1183345 1120624 1102784 1167422 1171965 1187950 1095764 1044183 1012962 1105806 1200581 1225284
13286 1225284 1204395 1218361 1255418 1298963 1252862 1218280 1190955 1232420 1276042 1271844 1250571
13275 1250571 1223919 1183694 1159212 1172349 1199928 1265484 1290574 1206050 1217665 1262757 1240697
13264 1240697 1220468 1169602 1251633 1199165 1167790 1149554 1188798 1251620 1184935 1207454 1206944 1212383
13252 1212383 1222535 1171375 1109076 1150659 1156466 1158209 1171871 1154978 1109995 1141407 1222861 1235577
13240 1235577 1243822 1229758 1165452 1192662 1211583 1173810 1149036 1100471 1135506 1205564 1166528
13229 1166528 1124948 1200453 1236868 1197967 1178477 1158333 1246974 1295903 1295632 1301274 1299241 1314107
13217 1314107 1277310 1276003 1382329 1424627 1348621 1240845 1206690 1307267 1337740 1300304 1224254
13206 1224254 1148199 1127580 1093277 1044901 1106869 1224949 1233881 1223509 1279111 1378591 1354620
13195 1354620 1394813 1403038 1355821 1343072 1302401 1307398 1275286 1249855 1198652 1156550 1195674 1175035
13183 1175035 1272523 1245460 1216311 1159408 1178528 1154747 1185347 1225459 1266632 1240144 1217517
13172 1217517 1214476 1304653 1237542 1236165 1239476 1233426 1186314 1153565 1115604 1145831 1248825 1346733
13160 1346733 1375242 1378744 1399137 1447838 1420003 1400893 1384599 1285659 1205867 1244017 1308100
13149 1308100 1309832 1285100 1282861 1239379 1296197 1302849 1283522 1234387 1216783 1274063 1285938 1319150
13137 1319150 1404972 1300252 1267603 1267621 1273539 1272123 1271051 1250348 1250240 1288906 1215649 1247114 1318786
13124 1318786 1326820 1343426 1437642 1430342 1409237 1343037 1255039 1232659 1243931 1245226 1313842 1395000
13112 1395000 1376777 1290946 1215045 1283660 1332781 1325914 1337967 1351626 1307663 1244019 1180254
13101 1180254 1262533 1301236 1317389 1372814 1370984 1340660 1306297 1323334 1337138 1320755 1313604 1264403
13089 1264403 1229908 1264985 1287056 1215198 1266396 1380821 1422253 1379249 1384775 1421397 1399673
13078 1399673 1387109 1382359 1388418 1401781 1404254 1434829 1394023 1376145 1427296 1392857 1333811 1337110
13066 1337110 1278434 1284990 1350064 1318237 1319054 1393859 1459119 1448436 1473624 1506449 1514699 1488069
13054 1488069 1425494 1418886 1405875 1316618 1284694 1332659 1305670 1315357 1381226 1431521 1439819 1447275
13042 1447275 1396622 1379809 1374570 1359110 1369762 1451810 1453221 1476542 1464611 1420801 1446059 1484744
13030 1484744 1456727 1528637 1504962 1563988 1553810 1547591 1516962 1433902 1418763 1515082 1552609
13019 1552609 1516835 1430932 1374712 1458841 1554093 1544441 1557898 1558964 1546870 1493017 1522796 1488918
13007 1488918 1462789 1571598 1602178 1473820 1356663 1369981 1451349 1470683 1429534 1486276 1567572
12996 1567572 1627607 1642016 1554402 1483907 1473542 1446034 1379474 1352678 1395561 1407711 1407877 1469210
12984 1469210 1529906 1534897 1556685 1527917 1542972 1536790 1464815 1503756 1576628 1606361 1603886 1545389
12972 1545389 1554526 1550441 1481452 1480199 1546041 1596920 1611179 1618656 1574085 1564257 1546064 1493931
12960 1493931 1517058 1590017 1590750 1548267 1657085 1722728 1676402 1630605 1634276 1566481 1523923 1570437
12948 1570437 1539683 1616570 1585964 1636581 1703341 1759361 1732984 1643986 1571175 1571763 1619625 1638971
12936 1638971 1658171 1682329 1733323 1770033 1764893 1685940 1650065 1620816 1672409 1663400 1645162 1601896
12924 1601896 1558322 1539278 1488488 1522216 1623587 1660305 1670735 1651931 1672355 1703377 1633751
12913 1633751 1622663 1661096 1660692 1581312 1524366 1472895 1448863 1485460 1536896 1600344 1709562
12902 1709562 1729020 1647286 1573433 1502294 1598137 1590990 1638689 1678117 1728149 1751027 1720863
12891 1720863 1709883 1730207 1730081 1697719 1713609 1792411 1772190 1750300 1722708 1654793 1684797 1712232
12879 1712232 1713781 1831342 1880015 1805739 1730951 1683966 1700800 1761112 1811422 1802611 1904490
12868 1904490 1901074 1893164 1816105 1794805 1787205 1787668 1751649 1744411 1728233 1777553 1758410 1747940
12856 1747940 1729234 1712920 1761666 1774968 1797979 1758959 1691599 1645817 1722435 1767363 1827812
12845 1827812 1795289 1756950 1716367 1722930 1737717 1810951 1775155 1725781 1745762 1751056 1842416 1868074
12833 1868074 1911590 1858248 1809998 1690233 1614248 1664198 1720263 1768172 1797846 1860427 1790269
12822 1790269 1747941 1833687 1906267 1887217 1862232 1838134 1886506 1932541 1897874 1904978 1956257
12811 1956257 1947529 1910164 1863996 1919789 1956104 1951927 1974122 1900351 1719939 1671322 1732479
12800 1732479 1735361 1745871 1753988 1746031 1815941 1880353 1913463 1912704 1884336 1810013 1854737 1891949
12788 1891949 1888627 1953728 1964276 1927639 1865293 1904562 1933839 1906036 1976382 1948684 1932071
12777 1932071 1977073 1962326 1889322 1839468 1859844 1846763 1870017 1909058 1933086 1950157 1957164
12766 1957164 1940733 1952760 2077424 2080621 1990513 1936412 1914322 1816953 1752599 1681869 1689515
12755 1689515 1764973 1816652 1785405 1904949 1986379 2010184 1978637 1927813 1947009 1967518 1990686
12744 1990686 2040426 2005346 1939444 1881211 1939491 1916851 1907314 1921394 1963964 2037189 2075585
12733 2075585 2061571 2010582 1953364 2021544 2005926 1877558 1815130 1860712 1818940 1810378 1931426
12722 1931426 2086829 2036033 1983572 2010594 2085576 2116855 2196993 2145794 2115141 2100650 2164739
12711 2164739 2113920 2077472 2129967 2071238 2057011 2061151 2096256 2015115 2030697 2073896 2068323 2032333
12699 2032333 2051790 2059188 2105688 2125089 2122857 2132700 2172929 2078846 1868213 1856617 1943572 2063133
12687 2063133 2069264 2045144 1976044 2036739 2086924 2145512 2149804 2049281 2085596 2212345 2165427
12676 2165427 2176093 2194934 2242209 2241593 2246852 2218452 2276726 2277851 2250372 2172202 2117144 2093760
12664 2093760 2095077 2052229 2092765 2201244 2218725 2198697 2194163 2183931 2109610 2142390 2228560
12653 2228560 2189955 2154166 2156180 2146309 2126860 2114413 2151200 2210557 2180855 2189792 2194594 2093369
12641 2093369 2070516 2157805 2134644 2113843 2048512 2102939 2177442 2226156 2202289 2215563 2174376
12630 2174376 2146896 2170884 2166051 2144587 2159357 2182018 2225238 2290205 2317878 2297226 2285146
12619 2285146 2332382 2375268 2336255 2316003 2314816 2339890 2408780 2465568 2383234 2318181 2373519
12608 2373519 2348791 2294313 2247662 2323472 2454085 2434641 2364881 2384848 2388533 2372440 2338878
12597 2338878 2285772 2319989 2376723 2358902 2329502 2331253 2333924 2320828 2384081 2360310 2386480 2390319
12585 2390319 2333979 2295420 2318735 2288101 2413126 2418165 2384071 2363011 2268416 2298103 2346265
12574 2346265 2321368 2272583 2318042 2422503 2418564 2358409 2378381 2380699 2379508 2503506 2475966
12563 2475966 2458986 2466221 2552792 2609720 2631343 2512265 2437945 2562251 2643025 2638785 2676506
12552 2676506 2707797 2690401 2560009 2452795 2410722 2467499 2537918 2490686 2501977 2532888 2525284
12541 2525284 2547854 2520453 2522625 2606280 2577738 2664323 2639683 2686836 2662043 2650242 2636076
12530 2636076 2660401 2681688 2632172 2635663 2715218 2721464 2695253 2627753 2604258 2650620 2658781 2613088
12518 2613088 2642795 2719006 2726072 2792240 2807229 2669813 2553292 2580507 2587667 2602370 2649791
12507 2649791 2663123 2608530 2651075 2758986 2751212 2770100 2780939 2730814 2693626 2709293 2686631
12496 2686631 2671414 2735090 2739368 2768967 2789744 2764017 2702385 2646378 2707549 2742313 2726562
12485 2726562 2699548 2861792 2900315 2886878 2956333 2943493 2919287 2906470 2894649 2848126 2761691
12474 2761691 2852729 2807587 2764756 2837612 2816253 2849518 2858102 2841982 2839914 2878198 2863481 2881405
12462 2881405 2874001 2884130 2870149 2937441 2961994 2934482 2817919 2800823 2797641 2778161 2754576
12451 2754576 2667401 2698046 2765517 2797477 2778941 2742773 2775347 2844201 2912567 2944770 2912131
12440 2912131 2848471 2831091 2916815 2953225 2978507 3027384 3027066 3001416 2998678 3093816 3038930 2996595
12428 2996595 3026975 3026763 3054763 3087142 3088711 3099204 3066963 3061373 3089798 3022359 2982443 3094299
12416 3094299 3113323 3091488 3078581 3193269 3235972 3236407 3226034 3257681 3211946 3127906 3060096
12405 3060096 3029387 3030994 3141699 3218730 3218983 3129970 3135353 3176764 3215345 3109540 3035035 3074427
12393 3074427 3095915 3159577 3228796 3249294 3213677 3276780 3293155 3301344 3263453 3333629 3453790
12382 3453790 3392120 3394897 3440116 3414971 3478522 3484279 3493241 3454449 3446255 3436881 3473208 3435814
12370 3435814 3428316 3430612 3427870 3423867 3382757 3404759 3435978 3493512 3421204 3362976 3271787 3277269
12358 3277269 3361308 3420407 3515169 3487045 3502054 3539123 3525227 3475718 3530166 3552400 3554218
12347 3554218 3575043 3648208 3668091 3683280 3637958 3599354 3538874 3590455 3723531 3719308 3674536
12336 3674536 3652826 3608817 3582190 3527333 3511685 3610426 3664549 3636909 3578737 3585662 3633841
12325 3633841 3691472 3713631 3672620 3756707 3763794 3694177 3624312 3701148 3771208 3714527 3736513
12314 3736513 3757992 3771453 3751235 3755677 3801304 3874691 3906656 3966231 3964399 3899445 3909625 3922607
12302 3922607 3855789 3854184 3894746 3969267 3998522 4007183 3969716 4022381 4040621 4062621 4012468 4061408
12290 4061408 4126939 4068550 4053161 4066795 4111129 4093126 4028060 3998869 3964850 3989381 4006384
12279 4006384 4006955 4060821 4071145 4111026 4220810 4260249 4281792 4273548 4248825 4267771 4282122 4248484
12267 4248484 4162618 4188714 4195880 4187104 4277104 4320299 4333269 4281892 4309225 4297607 4245503 4267387
12255 4267387 4326225 4376227 4393027 4437298 4483328 4434319 4341573 4413075 4497585 4552827 4584501
12244 4584501 4589538 4542857 4462567 4434580 4484659 4526868 4550141 4472472 4533834 4584437 4597231
12233 4597231 4599133 4587400 4601478 4615678 4645208 4698598 4758010 4722898 4779985 4787120 4850286 4860856
12221 4860856 4903876 4954267 4943613 4898895 4902370 4858125 4815793 4817722 4839450 4845260 4877654 4968680
12209 4968680 5005351 5023266 5006221 4991825 4905142 4904026 5052472 5130641 5090959 5133224 5134366
12198 5134366 5151093 5264922 5358065 5340253 5334678 5293157 5233263 5207061 5146522 5235881 5348511
12187 5348511 5309751 5243266 5236871 5323586 5376412 5439775 5471227 5393482 5364990 5412199 5481571
12176 5481571 5565445 5569285 5555439 5492077 5455971 5521199 5579825 5578730 5602176 5598461 5587371 5590242
12164 5590242 5616958 5633679 5645839 5693410 5789233 5911215 5892383 5907103 5916238 5895472 5843913
12153 5843913 5810563 5817608 5861575 5960302 5998855 5946833 5981566 6030279 6002417 6024850 6080664
12142 6080664 6182337 6176236 6187314 6231923 6216695 6331140 6438102 6466248 6437192 6401399 6402701
12131 6402701 6480301 6528752 6531182 6547481 6577725 6622481 6598401 6581562 6480744 6532021 6699027
12120 6699027 6724606 6701222 6711984 6727647 6749162 6813858 6782125 6735123 6718300 6715579 6820662
12109 6820662 6985376 7045122 6969508 6993825 7068081 7148552 7210665 7318273 7300212 7247504 7263371
12098 7263371 7322189 7370457 7409087 7499192 7564858 7573930 7645826 7706581 7672454 7602519 7676791
12087 7676791 7810218 7867192 7979549 8058298 8065219 8173397 8215398 8157741 8217367 8360792 8400113
12076 8400113 8373580 8326990 8361232 8479842 8620299 8668552 8692354 8646850 8679820 8772396 8779613
12065 8779613 8754716 8832931 8921577 8947114 9001383 9069085 9124549 9170053 9290901 9298562 9353581
12054 9353581 9492985 9668802 9841690 9975922 10014259 9962727 9784976 9639185 9658636 9688945
12044 9688945 9864729 10014901 10247215 10447046 10571745 10632657 10623583 10595810 10565056 10629316
12034 10629316 10764783 10867889 11003740 11054718 11019527 11060960 11100271 11199469 11345413 11501085
12024 11501085 11670853 11761468 11800986 11898120 12056552 12194452 12297948 12409448 12500306 12543789
12014 12543789 12657977 12864195 12966441 12975546 13043524 13215356 13375408 13569252 13726386 13949416
12004 13949416 14182512 14336158 14424855 14551459 14620828 14812634 14994015 15171410 15334805 15493876
11994 15493876 15649048 15791165 15993348 16147182 16307751 16489033 16677237 16929740 17158641
11985 17158641 17361174 17514861 17800230 18049509 18276658 18604723 18898863 19094104 19339764
11976 19339764 19689363 19988064 20267444 20605512 21003656 21313546 21625314 22045359 22452849
11967 22452849 22794851 23228673 23687808 24208854 24620644 25008208 25473464 25960271 26525301
11958 26525301 27117589 27755411 28449731 29054732 29714694 30429522 31151960 31917707 32721006
11949 32721006 33527517 34389712 35215558 36166997 37259706 38439769 39759464 41018475 42360443
11940 42360443 43830183 45398381 47194954 49080369 51109044 53232106 55525891 58117199
11932 58117199 60988870 64113170 67689957 71606300 75922390 80952158 86640668 93277290
11924 93277290 100873174 109746272 120295830 132996275 148118757 166082045 186710851
11917 186710851 207696364 222601132 217487666 164025722 41715935 -91797464 -172941237
11910 -172941237 -202050813 -198123699 -181500378 -162928623 -145947040 -131349732 -119077897
11903 -119077897 -108709674 -99878888 -92155279 -85376496 -79485900 -74183383 -69429423 -65201034
11895 -65201034 -61420414 -57989543 -54810447 -51812157 -49125970 -46769956 -44560514 -42487534
11887 -42487534 -40627400 -38837122 -37249452 -35811544 -34508010 -33435583 -32518073 -31739715
11879 -31739715 -31089424 -30611495 -30351221 -30348505 -30344548 -30232590 -30166162 -30142054 -29999599 -29600695
11869 -29600695 -29112529 -28609260 -28107476 -27486356 -26836181 -26192805 -25567099 -24975191 -24313120
11860 -24313120 -23715050 -23168441 -22581949 -22019722 -21561670 -21127425 -20713534 -20269698 -19825274
11851 -19825274 -19438721 -19045426 -18680333 -18429946 -18150610 -17856501 -17464540 -17184519 -16865023
11842 -16865023 -16498305 -16157374 -15883040 -15671536 -15492551 -15281384 -15035809 -14770104 -14548412
11833 -14548412 -14291508 -14141931 -13963001 -13674513 -13421036 -13201341 -13053180 -12952607 -12848820
11824 -12848820 -12715307 -12517821 -12337531 -12179073 -12079318 -11951308 -11827667 -11626787 -11468860
11815 -11468860 -11285951 -11091463 -10967404 -10875925 -10744390 -10588697 -10502807 -10391765 -10217822 -10097492
11805 -10097492 -10057732 -10052034 -9987650 -9831377 -9679142 -9423454 -9329955 -9292874 -9250468 -9067409
11795 -9067409 -8976217 -8884607 -8740914 -8633439 -8535048 -8463349 -8403185 -8306831 -8204860 -8139342 -8032494
11784 -8032494 -7977432 -8051076 -8073236 -7991743 -7861917 -7933212 -8009590 -7941924 -7761665 -7527935 -7306922
11773 -7306922 -7102311 -7147323 -7223203 -7260328 -7255541 -7174397 -7140433 -7063461 -6923498 -6845493 -6790843
11762 -6790843 -6722468 -6667286 -6649132 -6532244 -6357017 -6275613 -6203525 -6173087 -6099326 -6043779 -5970689
11751 -5970689 -5921042 -5901637 -5932186 -5952966 -5882966 -5787319 -5760045 -5806181 -5809503 -5824706 -5818923 -5694262
11739 -5694262 -5682174 -5627906 -5599559 -5584446 -5467072 -5385737 -5227734 -5114783 -5093667 -5145461 -5184687
11728 -5184687 -5160016 -5104064 -5024917 -4952256 -4968526 -4974616 -4958421 -4972711 -4992585 -4944775 -4884618
11717 -4884618 -4792743 -4805288 -4780669 -4729462 -4675293 -4550362 -4566456 -4507778 -4453479 -4360180 -4341257
11706 -4341257 -4321965 -4343731 -4331711 -4295104 -4222943 -4161004 -4182065 -4095559 -4078772 -4062110 -4084783
11695 -4084783 -4036084 -4050286 -4042693 -3975532 -3935527 -3900887 -3837649 -3787017 -3789236 -3797013 -3707557 -3712322
11683 -3712322 -3666218 -3687671 -3675611 -3601671 -3527845 -3495014 -3488236 -3544330 -3510791 -3440568 -3432306 -3398280
11671 -3398280 -3350093 -3373911 -3418482 -3416825 -3408570 -3301826 -3267296 -3296269 -3183768 -3105102 -3129621
11660 -3129621 -3184603 -3196762 -3158435 -3182591 -3148299 -3152875 -3102362 -3068143 -3043413 -2973672 -2894630
11649 -2894630 -2887130 -2891791 -2867553 -2899855 -2905006 -2834734 -2878063 -2871877 -2756002 -2713082 -2745360 -2806526
11637 -2806526 -2767014 -2777483 -2773626 -2807565 -2819655 -2749574 -2688709 -2572127 -2524064 -2554844 -2577683
11626 -2577683 -2554176 -2480073 -2472554 -2411117 -2321325 -2323602 -2332490 -2336819 -2305024 -2217341 -2197223 -2203887
11614 -2203887 -2246293 -2323938 -2335553 -2336984 -2332418 -2333468 -2336590 -2376163 -2288966 -2193183 -2219197 -2256340
11602 -2256340 -2206913 -2203214 -2163298 -2134354 -2179069 -2124145 -2123547 -2141655 -2176016 -2154997 -2046187 -2057541
11590 -2057541 -2072560 -2030835 -2070044 -2115853 -2018624 -1955331 -1922361 -1850508 -1819927 -1853865 -1912329
11579 -1912329 -1881804 -1795364 -1741660 -1777769 -1914865 -1935137 -1826969 -1790994 -1810766 -1744406 -1652866
11568 -1652866 -1592910 -1573227 -1589261 -1620272 -1595215 -1529942 -1491968 -1568878 -1592417 -1574204 -1585613
11557 -1585613 -1624357 -1554221 -1426710 -1419122 -1480176 -1491879 -1471831 -1511358 -1524308 -1495794 -1463730
11546 -1463730 -1416597 -1302551 -1268640 -1262663 -1317503 -1380361 -1386154 -1364758 -1311028 -1364075 -1377448
11535 -1377448 -1307081 -1286823 -1260923 -1291276 -1365532 -1317813 -1243473 -1170064 -1268179 -1298830 -1195247
11524 -1195247 -1108976 -1116434 -1167208 -1188277 -1212015 -1154796 -1094580 -1029270 -1002350 -1045661 -1023340
11513 -1023340 -922204 -976002 -1071852 -1175911 -1171677 -1203898 -1187024 -1107220 -1122349 -1113653 -1105933
11502 -1105933 -1070927 -976319 -910663 -938484 -964068 -918819 -885084 -795885 -716423 -770299 -797292
11491 -797292 -837026 -898421 -887310 -887175 -897024 -939947 -919169 -750002 -691105 -779558 -837799 -843187
11479 -843187 -810383 -778270 -712995 -688377 -662005 -685091 -639787 -684711 -778099 -811776 -802160 -709021
11467 -709021 -618747 -666080 -685039 -695879 -695102 -598493 -556019 -523908 -533697 -558043 -473329 -370557
11455 -370557 -386384 -423484 -390681 -432836 -469768 -453762 -467607 -457385 -414481 -375842 -366146 -406761
11443 -406761 -439640 -463674 -475268 -491824 -372639 -280523 -256682 -202378 -166363 -262987 -380332
11432 -380332 -396428 -306220 -186850 -105771 -198962 -233047 -300558 -320043 -318652 -314738 -304789 -253610
11420 -253610 -227487 -212686 -206831 -184771 -161166 -270379 -252770 -208223 -171001 -116811 -159404
11409 -159404 -222426 -190841 -118991 -29483 -7310 -2274 -73505 -57672 -283 40744 144244
11398 144244 171893 84971 31342 1005 60201 9913 -36685 -40806 33949 113764 159014 120648
11386 120648 107335 68320 47766 88148 38121 -43512 -9868 -3044 57465 170131 206208
11375 206208 190505 124492 96038 73478 15303 -8391 50440 111628 155346 208414 235573
11364 235573 247065 240847 237796 256901 190065 156142 211368 314553 253903 215134 261124 299137
11352 299137 301935 243800 208779 249329 293873 353868 347350 321475 278452 280039 336619 373701
11340 373701 374038 416466 412021 424632 447953 391337 386421 307098 260389 340355 398549 426374
11328 426374 461272 523149 581529 570289 566141 621411 689091 689329 611998 561089 567622 590433
11316 590433 607797 667039 728642 663201 638327 676731 755953 690573 670367 680101 727985 747668
11304 747668 664419 741868 787024 743378 768426 747664 669084 718017 793003 810906 712588
11293 712588 656810 594315 675309 761275 835968 835539 808179 856236 849319 744716 789458 914992
11281 914992 934899 915464 987924 942732 951751 912167 847180 889361 973594 1010337 970387 939469
11269 939469 890042 946265 988878 984151 985231 979549 948413 966327 934102 873306 914869 1008831
11257 1008831 1082647 1013198 972189 942844 1022732 1063607 1124068 1144220 1201302 1253528 1194417
11246 1194417 1090697 1053948 1068929 1067003 1091325 1172083 1228894 1214136 1217433 1205589 1211106 1224688
11234 1224688 1213158 1174125 1220021 1205197 1185418 1261506 1245596 1277454 1294406 1275456 1316503
11223 1316503 1301083 1310500 1383159 1327672 1287267 1362677 1419123 1458200 1453789 1471587 1387372 1325532
11211 1325532 1312529 1351991 1394826 1470592 1425229 1401836 1529649 1451951 1507206 1570284 1543703
11200 1543703 1586748 1625893 1689435 1685137 1650711 1538726 1518426 1552088 1595081 1615236 1634198
11189 1634198 1599204 1611732 1689995 1779133 1731144 1647285 1680201 1697361 1705068 1615971 1584437
11178 1584437 1648411 1694738 1789569 1790717 1766725 1801064 1779963 1752201 1806415 1798530 1820616 1875595
11166 1875595 1831793 1838173 1868936 1866391 1881980 1904962 1983269 1938634 1933720 1967634 1965595 1903969
11154 1903969 1930118 1966367 1943611 1892636 1900559 1990267 1991946 2037293 2040295 2012179 2017745 2075146
11142 2075146 2125036 2180799 2229832 2250184 2159681 2130919 2127324 2032943 1992841 2105321 2190784
11131 2190784 2251670 2262842 2226182 2175768 2243187 2268205 2255591 2328695 2384331 2354024 2380529
11120 2380529 2388770 2466709 2480551 2446035 2399286 2372524 2306674 2326882 2372200 2374352 2307554 2282738
11108 2282738 2385974 2434504 2440036 2422686 2434594 2438291 2447987 2539227 2638996 2643413 2651825 2676955
11096 2676955 2729583 2680640 2529816 2560212 2554127 2598448 2687991 2665635 2627195 2634419 2690276
11085 2690276 2724327 2744609 2806459 2849609 2788835 2699765 2712304 2754524 2888341 2900256 2847737
11074 2847737 2884834 2929633 3002799 2999224 2992365 3013038 3045528 3057506 3131391 3087423 3092506 3099593
11062 3099593 3158647 3280808 3302568 3306469 3317735 3352764 3344385 3356867 3355762 3350796 3361578 3390852
11050 3390852 3459410 3464748 3540338 3571530 3491855 3474570 3496147 3494578 3508312 3538824 3592557 3637778
11038 3637778 3813274 3870840 3919065 3900101 3869582 3748185 3618733 3499090 3444326 3467317
11028 3467317 3491106 3512382 3562445 3648425 3711548 3696750 3538829 3351811 3159636 3104009 3058594
11017 3058594 3085887 3167687 3240247 3182029 3240997 3301650 3284685 3152317 2987618 2900224 2812389
11006 2812389 2816985 2824574 2856941 2890299 2984612 3029329 3086795 3186781 3221426 3183572 3098571 3043088
10994 3043088 3050223 3071568 3103270 3183469 3315606 3357957 3386680 3434014 3496606 3454516 3521581
10983 3521581 3545571 3466908 3464326 3501576 3463658 3521267 3657794 3716641 3796074 3777497 3661729
10972 3661729 3665109 3767366 3809268 3849578 3838998 3844838 3869825 3920917 3970087 3944797 4009409
10961 4009409 3995292 4041716 4105526 4128002 4103696 4122954 4171969 4228293 4324201 4350283 4349819 4304136
10949 4304136 4350512 4410965 4473816 4462020 4398141 4515342 4509639 4447170 4426839 4492529 4470443
10938 4470443 4492618 4497987 4522743 4599575 4691761 4691629 4663590 4616304 4712745 4750131 4731715 4748616
10926 4748616 4776446 4844886 4834074 4784845 4803648 4911769 5003207 4970897 4941036 4973421 4998678
10915 4998678 4910554 4923204 5061001 5182908 5186828 5194909 5184182 5113545 5064369 5211517 5323209
10904 5323209 5345442 5357479 5318447 5295615 5344369 5403208 5420619 5385528 5395412 5464822 5557877
10893 5557877 5616014 5688991 5767115 5703439 5582433 5581863 5688628 5774053 5870677 5873305 5941607
10882 5941607 5951732 5988261 5991713 6011047 6023218 6098169 6137360 6144844 6167548 6238157 6230780 6277803
10870 6277803 6351779 6389957 6353428 6346610 6394447 6446045 6524980 6497689 6496046 6581784 6630707 6638792
10858 6638792 6625827 6686262 6688694 6663289 6725075 6763876 6790645 6832990 6894991 6945933 7024222
10847 7024222 7042372 7044758 7036259 7051169 7067860 7031810 7097457 7161834 7209630 7271422 7289822 7291313
10835 7291313 7398127 7485368 7517577 7492430 7467002 7381621 7457505 7625878 7763080 7774678 7732584
10824 7732584 7718592 7770058 7795498 7854301 7921321 8056578 8080945 8093777 8137298 8112631 8151186
10813 8151186 8245398 8283427 8349101 8405109 8324950 8340603 8391288 8335955 8353553 8535425 8739689
10802 8739689 8816368 8830677 8865456 8858886 8868952 8934321 9096069 9171466 9191042 9205203 9214057
10791 9214057 9247353 9303995 9312659 9404951 9553434 9617228 9724508 9781510 9834024 9880007 9931086
10780 9931086 10056899 10184917 10187431 10225535 10263266 10337702 10471669 10492747 10529673 10573611 10601224
10769 10601224 10738840 10896467 11003627 11030317 11061588 11181750 11289025 11397209 11538052 11639231
10759 11639231 11656626 11678399 11717707 11742130 11925127 11999684 12095251 12225163 12312998 12476331
10749 12476331 12480796 12484982 12555648 12620467 12698606 12734572 12847773 13034223 13256014 13332986 13373223
10738 13373223 13433256 13523518 13576585 13660836 13821931 13979027 14090344 14200608 14251743 14332743
10728 14332743 14460478 14637302 14798599 14863181 14833339 14860680 15039123 15251042 15385541 15570257
10718 15570257 15809496 15911216 16035797 16207795 16414411 16470810 16432858 16495760 16731920 16963589
10708 16963589 17151701 17348237 17538163 17683939 17876890 18133399 18316259 18432258 18555937
10699 18555937 18828738 18984205 19055748 19318388 19658225 19841469 20095705 20357081 20477048
10690 20477048 20727545 20992553 21226482 21542170 21794939 22115176 22467046 22649458 22737747
10681 22737747 23032764 23410170 23735959 24031386 24333716 24719397 25049263 25290266 25570545
10672 25570545 25847394 26241442 26637918 27028125 27420203 27816177 28231792 28717867 29156054
10663 29156054 29618666 30133434 30613125 31134929 31692934 32272379 32740702 33277935 33894185
10654 33894185 34596613 35276671 35938887 36577569 37232295 37978742 38761919 39643276 40487661
10645 40487661 41372427 42358051 43348882 44441357 45554361 46630933 47872165 49154401
10637 49154401 50526192 52023744 53638823 55255785 56900997 58622378 60433677 62303375
10629 62303375 64403956 66710082 69281401 72252773 75619782 79380971 83527270 88083009
10621 88083009 93071846 98348580 103511412 108203050 111318908 111611902 107827994 100405912
10613 100405912 92307160 86924390 85899808 89004188 95156097 103244319 111911011 119491863
10605 119491863 123185888 119226462 104458177 80784576 56619716 40306118 34577663
10598 34577663 37538907 45983777 56902599 67721649 75424199 76236287 65058247 38029827
10590 38029827 -782703 -37954816 -62447074 -71975934 -70159850 -62020833 -51356665
10583 -51356665 -41002607 -33573873 -32056265 -39629181 -57890989 -82942162 -105404569
10576 -105404569 -118360974 -121333276 -117324582 -109837832 -101488898 -93916393 -88432545 -86250765
10568 -86250765 -88245063 -94494720 -102941478 -109880445 -113103061 -112477664 -109243176 -104617765
10560 -104617765 -99557668 -94511618 -89887306 -85672070 -81837996 -78349416 -75146174 -72296062
10552 -72296062 -69718133 -67356939 -65147121 -63092509 -61078839 -59273506 -57592935 -55964003
10544 -55964003 -54443952 -52991748 -51637010 -50318761 -49102177 -47961826 -46937677 -46005436
10536 -46005436 -45107042 -44133931 -43182778 -42376952 -41588701 -40836136 -40099849 -39405510 -38656262
10527 -38656262 -37918626 -37318264 -36635806 -36048037 -35552940 -34941887 -34392889 -33944211 -33508402
10518 -33508402 -33034328 -32544856 -32002308 -31653964 -31272983 -30801439 -30381074 -29948699 -29510254
10509 -29510254 -29093742 -28673314 -28335118 -28043096 -27668930 -27330798 -27015201 -26723285 -26403727
10500 -26403727 -26196100 -25903345 -25606370 -25319849 -25030072 -24787709 -24585149 -24263476 -24041920
10491 -24041920 -23780073 -23465598 -23286476 -23059759 -22866549 -22704930 -22474970 -22319573 -22170841
10482 -22170841 -21862068 -21609827 -21480751 -21226825 -21010696 -20801143 -20636007 -20450791 -20259799
10473 -20259799 -20132594 -19993929 -19855375 -19690458 -19509551 -19412492 -19272821 -19128701 -18951297
10464 -18951297 -18774422 -18586751 -18412437 -18369882 -18387618 -18313246 -18188714 -18091829 -18035641 -17861488
10454 -17861488 -17577091 -17370172 -17148693 -17032821 -16939488 -16869422 -16748072 -16657817 -16620142 -16542097
10444 -16542097 -16370738 -16194369 -16040191 -16008924 -15876995 -15693505 -15676106 -15660151 -15657487 -15620843
10434 -15620843 -15510614 -15356909 -15248985 -15177081 -15110190 -15033228 -14981352 -14931826 -14758335 -14633122
10424 -14633122 -14595867 -14466686 -14310523 -14216218 -14192993 -14158747 -14109089 -14071258 -13999084 -13896285
10414 -13896285 -13770767 -13711997 -13700939 -13640723 -13577744 -13514408 -13431338 -13336807 -13251993 -13206241 -13107225
10403 -13107225 -12999468 -12956253 -12939746 -12882713 -12789806 -12842828 -12807985 -12660669 -12556633 -12547013 -12520562
10392 -12520562 -12456752 -12408796 -12333908 -12250688 -12237199 -12174815 -12084702 -11976655 -11928184 -11894656 -11864539
10381 -11864539 -11725832 -11677729 -11634017 -11600153 -11521710 -11470363 -11426717 -11477102 -11433565 -11316128 -11259930
10370 -11259930 -11177555 -11157243 -11105573 -10954315 -10904692 -10971876 -10894324 -10792381 -10726195 -10698275 -10666132
10359 -10666132 -10608184 -10617851 -10499475 -10433049 -10376333 -10332368 -10234310 -10190672 -10259142 -10270794 -10160049
10348 -10160049 -10113739 -10138619 -10091793 -10026862 -9993344 -9941762 -9926922 -9862940 -9799306 -9819037 -9871772
10337 -9871772 -9784999 -9686307 -9664290 -9685754 -9740476 -9673084 -9489034 -9352038 -9313400 -9289480 -9293101
10326 -9293101 -9339983 -9323248 -9320853 -9283977 -9267131 -9232961 -9217143 -9194088 -9199878 -9113988 -9109845 -9121372
10314 -9121372 -9109017 -9071732 -8994811 -8930607 -8880343 -8898980 -8927168 -8859397 -8798432 -8794426 -8713455
10303 -8713455 -8622204 -8608807 -8502841 -8533804 -8595736 -8609031 -8559364 -8455186 -8390216 -8417864 -8452546
10292 -8452546 -8418675 -8421773 -8434801 -8403682 -8339078 -8330674 -8327633 -8290502 -8076313 -7954111 -7947441 -7955080
10280 -7955080 -7930426 -8010880 -8002446 -7979323 -7924765 -7907342 -7941515 -7911055 -7809017 -7751163 -7778674
10269 -7778674 -7754090 -7699271 -7712529 -7737142 -7754990 -7673759 -7643148 -7685036 -7721599 -7634003 -7565328
10258 -7565328 -7495875 -7469713 -7571731 -7570682 -7524564 -7497206 -7450729 -7392481 -7308155 -7324607 -7335173
10247 -7335173 -7335300 -7132142 -7089117 -7115581 -7140284 -7114416 -7022062 -6978855 -6925949 -6860203 -6869695 -6845718
10235 -6845718 -6873808 -6785592 -6693321 -6603823 -6582124 -6526643 -6502636 -6438357 -6390455 -6331231 -6274151
10224 -6274151 -6145889 -5982812 -5852090 -5714539 -5704792 -5883139 -6183523 -6703143 -7266466 -7688719
10214 -7688719 -7873775 -7859028 -7801638 -7698445 -7541197 -7398263 -7263838 -7217273 -7241454 -7229369
10204 -7229369 -7156594 -7062034 -6933876 -6861860 -6797852 -6777391 -6714161 -6691159 -6684597 -6629872 -6645256
10193 -6645256 -6715795 -6746062 -6661812 -6611833 -6660850 -6571663 -6451444 -6397099 -6372025 -6361105 -6292618
10182 -6292618 -6166095 -6164424 -6135444 -6093974 -6051790 -6060459 -6069857 -6044086 -6009567 -5919305 -5851968 -5832531
10170 -5832531 -5786270 -5837483 -5879632 -5921819 -6058150 -6197890 -6240146 -6282574 -6284797 -6182763 -6014768
10159 -6014768 -5960931 -5884597 -5826962 -5836100 -5914997 -6115962 -6313596 -6487735 -6598008 -6729477
10149 -6729477 -6705092 -6529550 -6416184 -6365118 -6385376 -6401728 -6376376 -6396042 -6608508 -6798203
10139 -6798203 -6785745 -6660131 -6631770 -6578105 -6530364 -6506263 -6435503 -6450880 -6489222 -6535960 -6550063
10128 -6550063 -6539414 -6519714 -6556656 -6578896 -6472273 -6392058 -6396253 -6400220 -6360449 -6234371 -6188383
10117 -6188383 -6198117 -6208142 -6096413 -5984826 -6064097 -6043297 -6074981 -6042761 -6061692 -6047040 -5978439
10106 -5978439 -5948215 -5937017 -5907411 -5947588 -5983577 -5976053 -5941480 -5873141 -5843597 -5894603 -5875316
10095 -5875316 -5886778 -5876204 -5868866 -5820476 -5771304 -5764633 -5751635 -5729234 -5716029 -5800110 -5809240 -5715942
10083 -5715942 -5561907 -5549730 -5538206 -5556556 -5582365 -5558788 -5552666 -5606364 -5537620 -5399726 -5348474
10072 -5348474 -5354249 -5375055 -5414497 -5386235 -5340208 -5359445 -5462638 -5487844 -5490999 -5496737 -5446303 -5427321
10060 -5427321 -5426739 -5415583 -5402019 -5249602 -5201914 -5252019 -5334130 -5280301 -5283092 -5232846 -5199959 -5232195
10048 -5232195 -5292817 -5298973 -5256024 -5209907 -5147262 -5168141 -5124784 -5141039 -5202420 -5188784 -5184117 -5184488
10036 -5184488 -5199006 -5176585 -5145548 -5143959 -5153839 -5211054 -5256872 -5191270 -5215962 -5253894 -5198792 -5125921
10024 -5125921 -5074627 -5044804 -5028063 -5072295 -5021712 -4996421 -5014298 -5086523 -5071613 -5007380 -4902311
10013 -4902311 -4824160 -4803471 -4826097 -4853471 -4778519 -4812181 -4781287 -4873634 -4889092 -4861454 -4858465
10002 -4858465 -4874110 -4876948 -4871683 -4884744 -4834061 -4854471 -4779219 -4778934 -4859983 -4863373 -4783633 -4718515
9990 -4718515 -4675475 -4722799 -4813677 -4852865 -4851318 -4776711 -4724176 -4716448 -4652735 -4589270 -4587021 -4619393
9978 -4619393 -4633652 -4612988 -4605128 -4639500 -4612766 -4580944 -4604307 -4563386 -4542848 -4578201 -4702819
9967 -4702819 -4673918 -4643690 -4639204 -4623543 -4622514 -4706469 -4717608 -4691941 -4686974 -4700019 -4775347 -4779798
9955 -4779798 -4672202 -4543439 -4483711 -4351065 -4397326 -4461866 -4454156 -4436221 -4473126 -4424991 -4398770
9944 -4398770 -4445469 -4505610 -4514251 -4368594 -4313057 -4276438 -4248055 -4277746 -4272322 -4176751 -3963140
9933 -3963140 -3824856 -3847055 -4134600 -4659004 -4889815 -4912483 -4872693 -4812799 -4768525 -4747277 -4682097
9922 -4682097 -4600132 -4504084 -4548604 -4633371 -4601518 -4503545 -4519039 -4586656 -4543469 -4540801 -4495552 -4466006
9910 -4466006 -4494717 -4464931 -4459263 -4454798 -4394600 -4436206 -4354615 -4313973 -4367597 -4402966 -4345537 -4311103
9898 -4311103 -4386420 -4382827 -4283044 -4248659 -4188016 -4080845 -4156766 -4196387 -4258081 -4332342 -4366458
9887 -4366458 -4395420 -4380209 -4277552 -4188281 -4232826 -4281393 -4278137 -4233647 -4204539 -4193255 -4230546
9876 -4230546 -4276835 -4310481 -4287508 -4255086 -4247860 -4200888 -4167638 -4104536 -4047035 -4060635 -4137734 -4166148
9864 -4166148 -4153539 -4151733 -4127720 -4164063 -4168281 -4165591 -4213000 -4181874 -4137694 -4059699 -3999377 -4044672
9852 -4044672 -4139413 -4142586 -4174843 -4197957 -4140836 -4050881 -4046107 -4070313 -4029832 -4033197 -3926400 -3904945
9840 -3904945 -3866088 -3915188 -3955735 -3893530 -3964289 -3962996 -3954143 -3929273 -3966481 -4078850 -4095144 -4015245
9828 -4015245 -3989366 -3984180 -4006144 -4013958 -3984202 -3948881 -3980354 -4006651 -3905787 -3861360 -3821512 -3829599
9816 -3829599 -3823835 -3781092 -3807410 -3814738 -3825436 -3837948 -3849172 -3838890 -3803829 -3791704 -3813118 -3874994
9804 -3874994 -3868588 -3823231 -3800191 -3821216 -3773313 -3686646 -3717813 -3730527 -3705833 -3717698 -3788230 -3785890
9792 -3785890 -3733568 -3714206 -3749510 -3829752 -3773343 -3720184 -3742940 -3811112 -3852923 -3843815 -3837379 -3795723
9780 -3795723 -3792030 -3764790 -3729218 -3718773 -3644603 -3634732 -3671861 -3726482 -3707978 -3590463 -3518970 -3667713
9768 -3667713 -3781924 -3719446 -3675598 -3605159 -3658020 -3683385 -3612917 -3589745 -3629562 -3552174 -3512709
9757 -3512709 -3634511 -3686255 -3642571 -3680784 -3682870 -3724477 -3687966 -3626225 -3543256 -3640513 -3646024 -3642919
9745 -3642919 -3608332 -3624272 -3621988 -3599505 -3599252 -3630359 -3589876 -3565397 -3618659 -3668145 -3630660 -3631658
9733 -3631658 -3655221 -3630509 -3569662 -3605621 -3626971 -3547292 -3520474 -3565589 -3628170 -3638815 -3598155
9722 -3598155 -3528409 -3392856 -3380867 -3374547 -3301405 -3289151 -3328642 -3392767 -3446508 -3467504 -3510071
9711 -3510071 -3617449 -3609315 -3464685 -3381055 -3291268 -3288712 -3252846 -3280958 -3282174 -3379743 -3345233 -3299834
9699 -3299834 -3355707 -3371233 -3372381 -3350487 -3418822 -3566863 -3596741 -3473595 -3403117 -3430393 -3404493
9688 -3404493 -3325291 -3312051 -3237935 -3178275 -3144257 -3149993 -3214815 -3193071 -3216220 -3318871 -3302870
9677 -3302870 -3289164 -3294430 -3303393 -3278958 -3267902 -3223532 -3258842 -3323006 -3346660 -3260589 -3273437 -3276107
9665 -3276107 -3230852 -3191297 -3127974 -3044723 -3022068 -2974213 -2965443 -2983438 -2960821 -2925144 -2863544 -2849549
9653 -2849549 -2862143 -3118551 -3582326 -3862328 -3887728 -3803098 -3784594 -3675331 -3574997 -3534544
9643 -3534544 -3549276 -3552683 -3427320 -3398943 -3395261 -3400752 -3424021 -3452025 -3486179 -3445103 -3284145 -3322697
9631 -3322697 -3396169 -3348334 -3329565 -3315144 -3298393 -3276984 -3232598 -3192858 -3232189 -3287907 -3258056
9620 -3258056 -3390926 -3404001 -3423786 -3466371 -3442196 -3344458 -3267425 -3203539 -3211185 -3259166 -3283655
9609 -3283655 -3251550 -3186470 -3129001 -3138602 -3259256 -3322709 -3342336 -3296097 -3278640 -3225981 -3172804
9598 -3172804 -3165257 -3178001 -3218347 -3269853 -3283024 -3214297 -3227435 -3296485 -3332928 -3378794 -3278237
9587 -3278237 -3193985 -3238333 -3242013 -3205074 -3191545 -3236856 -3296418 -3290643 -3256968 -3220020 -3190358 -3203984
9575 -3203984 -3150473 -3160658 -3165305 -3170752 -3103523 -3066251 -3103839 -3095845 -3107564 -3033081 -3024389 -3105432
9563 -3105432 -3198825 -3220542 -3139943 -3184888 -3153395 -3090673 -3060479 -3021219 -3086424 -3090092 -3042460 -3042021
9551 -3042021 -3017702 -3023504 -2969870 -2943300 -2932809 -3047244 -3112975 -3066892 -3067507 -3031221 -3013993 -3025537
9539 -3025537 -3026094 -3022456 -3025726 -2983652 -2995477 -3035256 -3053749 -3001061 -2940780 -2941239 -2966364 -2954474 -2983899
9526 -2983899 -3029822 -3095335 -3072622 -3021059 -3012306 -3034153 -3003851 -2935424 -2892857 -2871483 -2847920 -2928376
9514 -2928376 -2907631 -2945923 -2962618 -2990273 -2983591 -3012255 -2915892 -2943394 -2989886 -3019680 -2988851 -2921746
9502 -2921746 -2886191 -2919517 -2934819 -2976558 -2935188 -2919246 -2920384 -2902201 -2909020 -2840675 -2849233 -2892940
9490 -2892940 -2946871 -2934700 -2927886 -2873070 -2848923 -2867331 -2970019 -2958055 -3046021 -3030280 -2927730
9479 -2927730 -2911960 -2962242 -2997248 -3033743 -3063188 -3034993 -2936438 -2856248 -2898196 -2896129 -2961237 -2967918
9467 -2967918 -2971582 -2940393 -2897120 -2883513 -2933019 -2900671 -2911707 -2929562 -2924888 -2896931 -2833520 -2830027
9455 -2830027 -2872456 -2908320 -2900754 -2951701 -2928417 -2907743 -2908238 -2941193 -2888023 -2842443 -2869045 -2821701
9443 -2821701 -2813454 -2752993 -2703752 -2740404 -2850364 -2854786 -2855919 -2887245 -2928878 -2872316 -2755215 -2746730
9431 -2746730 -2675392 -2666299 -2731663 -2850575 -2827969 -2781146 -2816870 -2864791 -2873604 -2829945 -2824525 -2802731
9419 -2802731 -2806468 -2727641 -2702786 -2743284 -2706505 -2746128 -2739749 -2760457 -2706980 -2715952 -2796022 -2821008
9407 -2821008 -2831655 -2791995 -2737758 -2730180 -2737044 -2680708 -2729504 -2718335 -2777356 -2787962 -2702120 -2599470
9395 -2599470 -2579775 -2540214 -2597011 -2684002 -2619585 -2644074 -2664425 -2749494 -2862957 -2814515 -2856847
9384 -2856847 -2779176 -2705199 -2746325 -2739231 -2722050 -2700960 -2658226 -2673912 -2593416 -2525817 -2523036 -2518542
9372 -2518542 -2577666 -2610119 -2642064 -2743547 -2782978 -2765753 -2749985 -2772247 -2766431 -2708662 -2691803
9361 -2691803 -2689871 -2673921 -2621892 -2603465 -2622671 -2649820 -2793857 -2843410 -2802057 -2855032 -2837908
9350 -2837908 -2821509 -2768426 -2759738 -2755607 -2723659 -2724252 -2713162 -2740660 -2726664 -2697443 -2686639 -2680815
9338 -2680815 -2695267 -2715862 -2687727 -2604259 -2518912 -2529199 -2563273 -2604244 -2651688 -2668968 -2579086
9327 -2579086 -2554092 -2538198 -2552929 -2573090 -2609174 -2570411 -2508457 -2467078 -2485245 -2551819 -2552925 -2594686
9315 -2594686 -2512076 -2459392 -2590445 -2684654 -2584260 -2486298 -2525596 -2555758 -2522892 -2482011 -2536161
9304 -2536161 -2557644 -2566316 -2528712 -2483858 -2449647 -2445388 -2444953 -2526027 -2561892 -2509822 -2497957 -2621039
9292 -2621039 -2569228 -2558941 -2549374 -2496472 -2490300 -2432008 -2382278 -2364864 -2405044 -2461031 -2464620 -2498702
9280 -2498702 -2533279 -2558852 -2493758 -2496427 -2542757 -2542211 -2535268 -2499197 -2479955 -2635890 -2667369 -2575275
9268 -2575275 -2508156 -2616176 -2768227 -2745979 -2650088 -2539274 -2504553 -2545757 -2545875 -2547153 -2580237
9257 -2580237 -2520499 -2464600 -2506720 -2501066 -2553292 -2575385 -2606052 -2646849 -2581065 -2510152 -2467743 -2433546
9245 -2433546 -2472474 -2502390 -2492399 -2482013 -2469677 -2521967 -2513691 -2515064 -2535656 -2572913 -2578720 -2509738
9233 -2509738 -2491099 -2507215 -2501491 -2501202 -2455753 -2491179 -2382343 -2344070 -2422248 -2433005 -2397712 -2362608
9221 -2362608 -2423600 -2412707 -2337294 -2409456 -2482547 -2503098 -2483113 -2436955 -2431453 -2410262 -2431952 -2531336
9209 -2531336 -2591716 -2548120 -2462692 -2370896 -2380861 -2402623 -2350961 -2347859 -2478111 -2564999 -2570438 -2508469
9197 -2508469 -2486605 -2505738 -2535222 -2498598 -2487465 -2499409 -2371315 -2321589 -2269670 -2206257 -2216712
9186 -2216712 -2295976 -2285711 -2293115 -2269582 -2378764 -2405051 -2406454 -2363561 -2274849 -2304466 -2402883 -2429072
9174 -2429072 -2433659 -2439448 -2391278 -2414538 -2357742 -2361748 -2403387 -2404118 -2399522 -2428873 -2390460 -2378616 -2343748
9161 -2343748 -2316985 -2325021 -2225436 -2189734 -2112268 -2063399 -2163306 -2278068 -2301410 -2288919 -2334768
9150 -2334768 -2372539 -2391455 -2410202 -2438422 -2475191 -2378275 -2294992 -2285849 -2302374 -2314886 -2317555 -2201902
9138 -2201902 -2213778 -2247887 -2236236 -2196831 -2251094 -2268031 -2270250 -2299720 -2272966 -2243958 -2244820 -2316330
9126 -2316330 -2351922 -2417794 -2436945 -2459135 -2423111 -2383976 -2260460 -2218419 -2242326 -2309653 -2313049
9115 -2313049 -2284711 -2242153 -2246572 -2359293 -2311338 -2300618 -2306251 -2278868 -2220832 -2272701 -2270504 -2396408
9103 -2396408 -2401299 -2416857 -2464252 -2428856 -2372794 -2341337 -2349422 -2332074 -2308457 -2302483 -2276719 -2202812
9091 -2202812 -2157998 -2302249 -2317009 -2367932 -2404354 -2425283 -2374850 -2287131 -2219560 -2205438 -2182155
9080 -2182155 -2197463 -2276684 -2282920 -2318847 -2327517 -2331346 -2350423 -2320542 -2216620 -2239510 -2251114 -2205849
9068 -2205849 -2226281 -2238414 -2290563 -2318668 -2301675 -2300847 -2253100 -2294936 -2232084 -2180536 -2098195 -2174301
9056 -2174301 -2245902 -2260377 -2345431 -2413727 -2368541 -2320330 -2291533 -2366492 -2314451 -2261112 -2219641
9045 -2219641 -2198216 -2217349 -2216547 -2247257 -2188276 -2110571 -2132678 -2205009 -2225898 -2236525 -2201043 -2301239
9033 -2301239 -2289936 -2176684 -2133878 -2102910 -2126173 -2169865 -2160161 -2123205 -2142950 -2219485 -2260949
9022 -2260949 -2275730 -2255461 -2287203 -2325644 -2227249 -2208222 -2215146 -2290212 -2258608 -2168771 -2219818 -2220592
9010 -2220592 -2212689 -2196063 -2105667 -2140684 -2202266 -2135495 -2151121 -2165689 -2204541 -2181000 -2130061 -2124589
8998 -2124589 -2152089 -2165271 -2148423 -2103257 -2065491 -2058336 -2101361 -2122812 -2162125 -2115171 -2051143 -2061427
8986 -2061427 -2121096 -2176528 -2160834 -2130389 -2099749 -2096496 -2256028 -2293652 -2334883 -2309237 -2191636
8975 -2191636 -2217009 -2187324 -2166439 -2126847 -2145579 -2121618 -2149390 -2197097 -2210042 -2142380 -2083836
8964 -2083836 -2134009 -2162579 -2172527 -2102357 -2066958 -2053294 -2044273 -2082040 -2122380 -2102217 -2055891 -2088924
8952 -2088924 -2087670 -2072699 -2087696 -2103940 -2063335 -2026044 -2103755 -2104898 -2117685 -2128344 -2136532 -2056615
8940 -2056615 -2083574 -2053812 -1979370 -1992784 -1991418 -2087596 -2096519 -2237660 -2289402 -2195246 -2172831 -2120961
8928 -2120961 -2175119 -2117049 -2034977 -1984346 -2013744 -2135439 -2137346 -2062602 -2058528 -2081550 -2162692 -2229243
8916 -2229243 -2147826 -2172365 -2109571 -2138201 -2137309 -2156356 -2152491 -2126292 -2165451 -2126468 -2113202 -2051442
8904 -2051442 -2041073 -1993033 -2001494 -2031885 -2035038 -2051180 -2106242 -2108702 -2061413 -2059096 -2064120 -2086814
8892 -2086814 -2107213 -2096787 -2106979 -2056872 -2037195 -2007195 -2011062 -2031270 -2070997 -2134961 -2192672 -2154728
8880 -2154728 -2153757 -2146237 -2118038 -2097149 -2253159 -2193854 -2112487 -2024139 -1942473 -1975212 -1955170 -2025678
8868 -2025678 -2029398 -2068023 -2087336 -2118646 -2070523 -2047337 -2158276 -2137992 -2097360 -2082942 -2014906
8857 -2014906 -2034120 -2119105 -2117361 -2108471 -2092200 -2071866 -2004958 -1984622 -1974093 -1880762 -1849443 -1929552
8845 -1929552 -1937793 -1954446 -2016258 -2099757 -2151672 -2080156 -1975747 -1894731 -1921741 -2012286 -2026713
8834 -2026713 -2012027 -2094292 -2091862 -2042648 -2036875 -1992889 -1940721 -1938168 -1990631 -2123743 -2160999 -2123553
8822 -2123553 -2110797 -2033703 -1995597 -1941683 -1945860 -1970415 -1916242 -1834576 -1863315 -1969668 -2070841
8811 -2070841 -2111806 -2082336 -2087245 -2051387 -1986995 -1953130 -1956564 -1951747 -1935316 -1894410 -1902171 -1914808
8799 -1914808 -1933051 -1916905 -1964951 -1961716 -1988656 -1931771 -1954814 -2038559 -2058412 -2016998 -1967872 -1984605
8787 -1984605 -1945066 -1936019 -1969558 -2113918 -2043774 -1943718 -1960813 -1925660 -1880681 -1865371 -1890039
8776 -1890039 -1912561 -1946778 -1978248 -1989860 -2011830 -2011549 -2026533 -2014941 -1930092 -1929616 -1982616 -1933265
8764 -1933265 -1896000 -1896604 -1911580 -1981811 -1937234 -1940874 -2028357 -2086610 -2103533 -2096391 -1965257 -1867222
8752 -1867222 -1874795 -1900707 -1910491 -1859184 -1837770 -1901260 -2004558 -2077988 -2042706 -2023092 -2056591 -2033570
8740 -2033570 -2025437 -1927661 -1821672 -1804461 -1746863 -1810877 -1896618 -2040295 -2084860 -1974160 -1867951
8729 -1867951 -1906831 -1924703 -1927821 -1979917 -1968222 -1889486 -1847915 -1873165 -1965413 -1928090 -1856746 -1843745
8717 -1843745 -1846067 -1865513 -1879392 -1817793 -1724389 -1642964 -1609321 -1544282 -1595896 -1691068 -1780130 -1874464
8705 -1874464 -1834003 -1814286 -1874584 -1835044 -1791375 -1725212 -1765374 -1862957 -1967262 -1965690 -1880360
8694 -1880360 -1837935 -1844123 -1897446 -1828643 -1815418 -1817274 -1814853 -1792973 -1831602 -1903576 -1922736 -1892895
8682 -1892895 -1910685 -1926108 -1871787 -1835198 -1871851 -1919815 -1811372 -1781529 -1817315 -1857761 -1843825
8671 -1843825 -1822873 -1784587 -1805151 -1774463 -1782549 -1849887 -1839226 -1866517 -1864777 -1855895 -1889676 -1843305
8659 -1843305 -1781950 -1764166 -1753970 -1742465 -1794893 -1824595 -1902652 -1980475 -1990536 -1983967 -1914224 -1849699
8647 -1849699 -1838551 -1925269 -1929399 -1870618 -1820375 -1889849 -1922149 -1974893 -1952592 -1891763 -1862054 -1859265
8635 -1859265 -1866437 -1869870 -1876834 -1848417 -1828137 -1850107 -1858625 -1870521 -1787218 -1670199 -1696851 -1735639
8623 -1735639 -1711060 -1731259 -1720990 -1775725 -1827772 -1851696 -1931634 -1912034 -1851105 -1814778 -1843076
8612 -1843076 -1810491 -1778824 -1738574 -1713040 -1752002 -1826130 -1797549 -1733951 -1713249 -1722064 -1722622 -1786759
8600 -1786759 -1848634 -1878811 -1931962 -1880197 -1808360 -1877539 -1872269 -1802021 -1740572 -1723430 -1757206 -1773581
8588 -1773581 -1828330 -1840518 -1817973 -1808810 -1738686 -1724672 -1697178 -1828807 -1921739 -1897453 -1823046
8577 -1823046 -1809375 -1924916 -1949808 -2018712 -1974412 -1976073 -2060713 -2074452 -2039078 -1993246 -1984788 -1996478
8565 -1996478 -1914074 -1896904 -1946421 -1938256 -1881090 -1877920 -2047745 -2084341 -2031677 -1925421 -1938341
8554 -1938341 -1922240 -1923030 -1945527 -1919731 -1917862 -1946214 -1985998 -1959180 -1877920 -1892974 -1895090 -1911959
8542 -1911959 -1844786 -1830112 -1882700 -1963163 -1895333 -1995482 -2028981 -1998962 -1940309 -1939106 -1911851
8531 -1911851 -1816646 -1736998 -1672400 -1651641 -1705329 -1782397 -1760639 -1793091 -1797827 -1838644 -1840654 -1850261
8519 -1850261 -1846615 -1877606 -1885340 -1943214 -1895777 -1791860 -1695140 -1778002 -1789417 -1826109 -1876328 -1885879
8507 -1885879 -1826702 -1825737 -1784431 -1771607 -1780632 -1783241 -1754031 -1748957 -1731378 -1717888 -1719696 -1788077 -1885701
8494 -1885701 -1859423 -1758550 -1755015 -1735790 -1735288 -1797630 -1831649 -1853123 -1845140 -1772723 -1799843 -1788461
8482 -1788461 -1879635 -1878813 -1752147 -1687806 -1739614 -1763805 -1726857 -1725760 -1790389 -1752879 -1708780 -1721328
8470 -1721328 -1725755 -1687037 -1718531 -1726971 -1684314 -1704419 -1740384 -1714557 -1640405 -1665507 -1692420 -1702837
8458 -1702837 -1656068 -1643808 -1645755 -1653787 -1703882 -1790753 -1771145 -1773425 -1747554 -1717980 -1741937 -1743635
8446 -1743635 -1785449 -1799295 -1869346 -1882134 -1844042 -1807157 -1804823 -1815309 -1811794 -1781837 -1806386 -1827313
8434 -1827313 -1761668 -1692450 -1685448 -1762929 -1850510 -1812175 -1771521 -1759784 -1805143 -1842164 -1919619 -1883633
8422 -1883633 -1828972 -1764777 -1741647 -1758087 -1799837 -1791409 -1809026 -1824641 -1879553 -1910428 -1921663 -1844604
8410 -1844604 -1836361 -1798807 -1742069 -1667917 -1701345 -1762714 -1833837 -1794684 -1710282 -1745356 -1783770 -1812326
8398 -1812326 -1791832 -1838646 -1878644 -1922622 -1883323 -1836157 -1872940 -1856928 -1801433 -1773460 -1747176
8387 -1747176 -1798253 -1898876 -1891067 -1741881 -1682399 -1695251 -1770838 -1764911 -1709483 -1715609 -1777865 -1807083
8375 -1807083 -1778009 -1781263 -1823255 -1862174 -1854300 -1847631 -1789639 -1812822 -1860042 -1806414 -1777015 -1699451
8363 -1699451 -1725386 -1730201 -1721598 -1803550 -1830681 -1784492 -1777936 -1741977 -1643408 -1617580 -1613847 -1689777
8351 -1689777 -1721784 -1681631 -1718963 -1673135 -1647685 -1618749 -1656591 -1666216 -1763628 -1784053 -1748333 -1687744
8339 -1687744 -1641349 -1702601 -1757438 -1801655 -1811436 -1818715 -1683111 -1642375 -1670772 -1683859 -1674060 -1622512
8327 -1622512 -1655882 -1645294 -1633416 -1659419 -1701462 -1730665 -1735782 -1657729 -1634256 -1693338 -1724488 -1724467
8315 -1724467 -1737335 -1743439 -1754606 -1749419 -1743932 -1666663 -1678429 -1712441 -1717734 -1680895 -1663329 -1639432
8303 -1639432 -1668952 -1684367 -1700924 -1660441 -1756173 -1790011 -1789277 -1770727 -1794091 -1837619 -1763477 -1693266
8291 -1693266 -1758165 -1835757 -1798241 -1719225 -1632689 -1623531 -1661153 -1760239 -1746357 -1635744 -1624129
8280 -1624129 -1606641 -1576852 -1592579 -1656738 -1665979 -1655637 -1636826 -1624746 -1623773 -1612099 -1514314 -1531452
8268 -1531452 -1589822 -1639941 -1664769 -1725694 -1648583 -1588554 -1584646 -1529368 -1506088 -1572962 -1604208 -1646686
8256 -1646686 -1667101 -1568588 -1531265 -1589781 -1561140 -1501698 -1521561 -1607603 -1620613 -1578641 -1629877
8245 -1629877 -1723535 -1768928 -1667473 -1615004 -1544372 -1516766 -1512384 -1537657 -1543167 -1573040 -1556713 -1578024
8233 -1578024 -1655434 -1696363 -1599690 -1500940 -1544662 -1700767 -1762682 -1683602 -1608523 -1720597 -1743535
8222 -1743535 -1764631 -1760147 -1764404 -1794078 -1671988 -1611360 -1665047 -1656786 -1759397 -1716204 -1639157 -1584795
8210 -1584795 -1532743 -1515080 -1422225 -1432273 -1528106 -1595552 -1690146 -1673240 -1588733 -1548239 -1495445
8199 -1495445 -1492067 -1528972 -1553834 -1524817 -1469011 -1498838 -1439163 -1428917 -1490749 -1542617 -1583925 -1632862
8187 -1632862 -1723776 -1762458 -1752968 -1700484 -1718186 -1720900 -1649505 -1613597 -1692142 -1720126 -1757238 -1767737
8175 -1767737 -1659718 -1580296 -1638818 -1670909 -1602569 -1544664 -1512226 -1566779 -1595817 -1539850 -1554654
8164 -1554654 -1642541 -1658514 -1621866 -1579218 -1587937 -1619001 -1671018 -1667455 -1687978 -1648647 -1554834 -1532724
8152 -1532724 -1594217 -1608521 -1585129 -1516252 -1401396 -1427629 -1514549 -1611150 -1653628 -1616089 -1506610
8141 -1506610 -1517595 -1632773 -1663708 -1620920 -1630718 -1602385 -1603495 -1513009 -1478518 -1491358 -1532700 -1539891
8129 -1539891 -1578480 -1608778 -1641160 -1613967 -1574902 -1588530 -1565390 -1525304 -1506052 -1549238 -1593201
8118 -1593201 -1593736 -1579960 -1533474 -1502722 -1462405 -1502532 -1614251 -1730264 -1751154 -1644412 -1591517
8107 -1591517 -1633812 -1762839 -1754296 -1601947 -1544415 -1562880 -1584602 -1530191 -1526454 -1533191 -1553930 -1601292
8095 -1601292 -1609583 -1557877 -1434945 -1450019 -1450427 -1428229 -1456474 -1479201 -1508663 -1529963 -1438695 -1422247
8083 -1422247 -1515221 -1522804 -1509242 -1467484 -1498624 -1460120 -1452934 -1442687 -1485310 -1544854 -1583569 -1586634
8071 -1586634 -1582291 -1505138 -1426242 -1508982 -1575319 -1595534 -1534120 -1525682 -1507966 -1442666 -1429842 -1512970
8059 -1512970 -1550754 -1575376 -1637066 -1624347 -1641628 -1643783 -1555294 -1500401 -1453526 -1579973 -1655053
8048 -1655053 -1644195 -1607867 -1569126 -1559433 -1543242 -1563394 -1579295 -1537920 -1463080 -1501486 -1465679 -1437714
8036 -1437714 -1454867 -1497205 -1506794 -1562532 -1532939 -1588985 -1607404 -1599931 -1592495 -1596872 -1580031 -1612574
8024 -1612574 -1623344 -1591150 -1593313 -1449097 -1374634 -1371792 -1416850 -1448530 -1415301 -1394342 -1432536 -1548651
8012 -1548651 -1545976 -1513986 -1597151 -1567958 -1672881 -1757534 -1741250 -1736178 -1694405 -1593861 -1521375
8001 -1521375 -1529427 -1568012 -1610676 -1598120 -1456163 -1403559 -1490195 -1593044 -1638800 -1694739 -1711674
7990 -1711674 -1662746 -1573127 -1550738 -1523199 -1500249 -1463195 -1456244 -1488773 -1509350 -1545065 -1552865 -1534965
7978 -1534965 -1549576 -1550891 -1523825 -1514571 -1603848 -1668154 -1743326 -1649246 -1591400 -1607795 -1603598 -1579724
7966 -1579724 -1630995 -1679617 -1697744 -1602546 -1614923 -1600030 -1623987 -1614465 -1544651 -1503860 -1625900
7955 -1625900 -1667132 -1742833 -1735876 -1644695 -1552781 -1547670 -1507471 -1496985 -1530012 -1540055 -1501627 -1451102
7943 -1451102 -1421906 -1460068 -1517846 -1648982 -1663885 -1557484 -1534299 -1563487 -1502991 -1533654 -1606507
7932 -1606507 -1641494 -1628349 -1568069 -1562628 -1578820 -1677181 -1691257 -1603443 -1658911 -1588631 -1540057 -1625604
7920 -1625604 -1515223 -1482342 -1498225 -1530926 -1573375 -1664281 -1651486 -1698668 -1627796 -1529115 -1617494
7909 -1617494 -1579704 -1477138 -1464816 -1515873 -1513283 -1494514 -1530791 -1512099 -1516873 -1525281 -1475636 -1445331
7897 -1445331 -1530687 -1620291 -1621493 -1518537 -1495345 -1495496 -1442306 -1478459 -1553925 -1605329 -1522851 -1502076
7885 -1502076 -1507839 -1530290 -1483531 -1466761 -1508032 -1502278 -1605597 -1548532 -1423293 -1484121 -1572528
7874 -1572528 -1601232 -1573339 -1532486 -1548906 -1584301 -1629309 -1592197 -1567024 -1521870 -1445699 -1462792
7863 -1462792 -1541341 -1541727 -1457377 -1498831 -1576862 -1605727 -1592031 -1526943 -1572857 -1495842 -1486393 -1512353
7851 -1512353 -1501134 -1420591 -1344083 -1311361 -1282849 -1354281 -1449768 -1508394 -1468484 -1498230 -1523797
7840 -1523797 -1454930 -1410139 -1487689 -1547149 -1530812 -1518263 -1502168 -1503998 -1492851 -1445611 -1403408 -1441088
7828 -1441088 -1448139 -1469413 -1437479 -1383704 -1389342 -1511533 -1543585 -1465768 -1455346 -1512106 -1563799 -1501592
7816 -1501592 -1475967 -1470789 -1440304 -1433370 -1397887 -1374678 -1437796 -1470092 -1433610 -1338080 -1306453 -1426555
7804 -1426555 -1503539 -1579095 -1551766 -1576505 -1653790 -1601613 -1533925 -1536669 -1506212 -1518152 -1486723 -1451454
7792 -1451454 -1400339 -1313763 -1324453 -1389108 -1385830 -1461167 -1525240 -1507768 -1472228 -1424704 -1385981 -1356067
7780 -1356067 -1310994 -1257841 -1249655 -1307940 -1369747 -1395354 -1432421 -1425263 -1365541 -1360627 -1345186 -1354084
7768 -1354084 -1384067 -1352354 -1359559 -1422650 -1392782 -1415606 -1488956 -1466229 -1527706 -1505150 -1471841 -1485029
7756 -1485029 -1457960 -1363397 -1366310 -1476417 -1462793 -1450373 -1373066 -1283161 -1362364 -1387605 -1374003
7745 -1374003 -1381650 -1416724 -1402043 -1428544 -1468977 -1420938 -1351197 -1365091 -1375024 -1274646 -1233989 -1241364
7733 -1241364 -1242897 -1230215 -1289622 -1368283 -1399981 -1402751 -1443357 -1485576 -1481245 -1433223 -1410853 -1421536
7721 -1421536 -1462912 -1415965 -1419520 -1442958 -1492381 -1461239 -1496856 -1444894 -1427875 -1378149 -1350938 -1289720
7709 -1289720 -1296898 -1326826 -1315266 -1323632 -1371389 -1406884 -1396033 -1415522 -1414903 -1430634 -1434064 -1441154 -1389143
7696 -1389143 -1348048 -1349275 -1404601 -1360471 -1378256 -1397175 -1388451 -1431007 -1439296 -1422255 -1386553 -1409237
7684 -1409237 -1407358 -1397218 -1427801 -1349813 -1372705 -1378317 -1458271 -1494149 -1476737 -1446509 -1390770 -1399538
7672 -1399538 -1447425 -1478807 -1480169 -1471267 -1509120 -1401744 -1399337 -1366729 -1338861 -1349367 -1324331 -1244049
7660 -1244049 -1176844 -1174527 -1163987 -1213298 -1290193 -1301480 -1352614 -1335152 -1433253 -1451444 -1407342 -1386965
7648 -1386965 -1354934 -1425985 -1502530 -1457469 -1411338 -1468665 -1526416 -1479234 -1450487 -1437808 -1454840
7637 -1454840 -1402545 -1417801 -1461371 -1429951 -1374507 -1375961 -1374762 -1328873 -1349046 -1341289 -1314224 -1310303
7625 -1310303 -1310198 -1314451 -1365366 -1472476 -1454056 -1424608 -1405104 -1337331 -1366866 -1439811 -1435499 -1367944
7613 -1367944 -1434723 -1405429 -1364621 -1317649 -1315459 -1274152 -1210608 -1246221 -1422262 -1481755 -1477816 -1486716
7601 -1486716 -1466491 -1394391 -1365495 -1359232 -1325622 -1231519 -1289793 -1263174 -1195004 -1225750 -1259542 -1280989
7589 -1280989 -1348396 -1352157 -1336460 -1363520 -1389807 -1391455 -1419351 -1421861 -1413381 -1346425 -1286229 -1281940
7577 -1281940 -1268721 -1346628 -1422738 -1451534 -1472855 -1490410 -1527986 -1529488 -1511657 -1474172 -1370502
7566 -1370502 -1401812 -1459234 -1443113 -1439314 -1433707 -1456725 -1364500 -1312667 -1272919 -1311528 -1377215 -1252331
7554 -1252331 -1248922 -1309334 -1323363 -1371207 -1422056 -1504541 -1467881 -1445715 -1438115 -1358118 -1391919 -1446711
7542 -1446711 -1478673 -1390367 -1352027 -1378738 -1431300 -1366242 -1398858 -1371165 -1312224 -1338027 -1263036
7531 -1263036 -1196072 -1243327 -1289369 -1287182 -1236286 -1256543 -1279250 -1382685 -1429116 -1445874 -1435232
7520 -1435232 -1393671 -1424486 -1468432 -1480708 -1439068 -1449126 -1409112 -1367891 -1296708 -1267229 -1312430
7509 -1312430 -1421515 -1469859 -1441515 -1484088 -1448953 -1446104 -1487108 -1480939 -1403583 -1313684 -1346747 -1449343
7497 -1449343 -1485608 -1421449 -1335861 -1356140 -1348228 -1363560 -1343345 -1381662 -1401559 -1386594 -1336308 -1333676
7485 -1333676 -1329512 -1302254 -1272343 -1258595 -1269183 -1349137 -1361300 -1358622 -1356799 -1328711 -1253338 -1235957
7473 -1235957 -1357710 -1329949 -1320222 -1292907 -1183152 -1139185 -1200164 -1247345 -1279352 -1360859 -1359210
7462 -1359210 -1297081 -1226000 -1216854 -1253318 -1302762 -1380194 -1466204 -1325307 -1288162 -1340208 -1397486
7451 -1397486 -1362425 -1315100 -1295603 -1246806 -1231549 -1266391 -1366026 -1318444 -1322173 -1329255 -1334942 -1348236
7439 -1348236 -1404784 -1432294 -1420723 -1434337 -1379666 -1400096 -1425720 -1362281 -1332762 -1301331 -1321483
7428 -1321483 -1367839 -1396520 -1377567 -1380445 -1384736 -1351282 -1299964 -1304674 -1356900 -1323555 -1285713 -1300299
7416 -1300299 -1300280 -1347516 -1356811 -1330566 -1357702 -1379379 -1353904 -1349535 -1307521 -1271816 -1326963 -1348803
7404 -1348803 -1315706 -1343482 -1429138 -1498370 -1514222 -1450828 -1365414 -1386512 -1387931 -1334908 -1292923 -1326305
7392 -1326305 -1383183 -1358460 -1308987 -1286304 -1212056 -1217139 -1167324 -1292394 -1323155 -1234472 -1228991 -1155004
7380 -1155004 -1126348 -1175338 -1219136 -1211215 -1348796 -1409168 -1404851 -1337821 -1317761 -1293641 -1239125 -1274367
7368 -1274367 -1329062 -1308978 -1280771 -1290021 -1320005 -1246601 -1267113 -1284741 -1459273 -1496206 -1469192
7357 -1469192 -1397813 -1338967 -1291122 -1284090 -1290547 -1308133 -1340945 -1374674 -1329496 -1327758 -1343140 -1369255
7345 -1369255 -1373726 -1365742 -1366415 -1381160 -1391240 -1380623 -1341849 -1338569 -1301145 -1278375 -1287301 -1254596 -1286124
7332 -1286124 -1306957 -1305123 -1310192 -1407923 -1482587 -1444483 -1449230 -1342844 -1300261 -1343732 -1348421 -1305003
7320 -1305003 -1283059 -1340176 -1325428 -1242761 -1237475 -1285703 -1320803 -1369582 -1390900 -1289995 -1334984
7309 -1334984 -1416472 -1421523 -1410208 -1337967 -1313275 -1289993 -1228096 -1301922 -1433841 -1415290 -1353641
7298 -1353641 -1290495 -1228293 -1231121 -1214245 -1230801 -1236567 -1211813 -1229317 -1306156 -1377863 -1315716 -1279343
7286 -1279343 -1335666 -1362457 -1370044 -1363164 -1308389 -1271661 -1354191 -1277732 -1209531 -1260721 -1214972 -1208055
7274 -1208055 -1162867 -1137724 -1150578 -1237634 -1295347 -1303006 -1301963 -1282761 -1309046 -1321921 -1363757 -1348614
7262 -1348614 -1305706 -1350459 -1293989 -1325946 -1385304 -1296647 -1173402 -1130533 -1138087 -1256649 -1324601
7251 -1324601 -1307682 -1281883 -1367534 -1374600 -1361378 -1383448 -1413859 -1371736 -1287004 -1284495 -1380367 -1434916
7239 -1434916 -1400108 -1309707 -1290513 -1295684 -1284521 -1278483 -1215533 -1169063 -1130217 -1174030 -1272513 -1244537
7227 -1244537 -1284337 -1336263 -1380245 -1356999 -1384330 -1365443 -1258656 -1240954 -1200025 -1195859 -1192918 -1258642
7215 -1258642 -1293537 -1285942 -1270870 -1279566 -1371306 -1397465 -1403651 -1326657 -1253420 -1262327 -1243969 -1243454 -1342256
7202 -1342256 -1369616 -1440108 -1448336 -1464859 -1439121 -1318788 -1218885 -1229155 -1279873 -1325159 -1384596
7191 -1384596 -1323510 -1247517 -1259453 -1256805 -1247881 -1293533 -1308746 -1300405 -1329387 -1280248 -1222464 -1325953
7179 -1325953 -1419411 -1342622 -1266297 -1234880 -1185987 -1213812 -1319931 -1379628 -1410199 -1349604 -1274538
7168 -1274538 -1206057 -1227144 -1248847 -1259893 -1239139 -1224510 -1286307 -1219372 -1190617 -1158051 -1100284
7157 -1100284 -1124267 -1172723 -1183574 -1138747 -1116665 -1152808 -1178078 -1230774 -1165917 -1142928 -1122678
7146 -1122678 -1192848 -1226636 -1253453 -1284233 -1283828 -1241485 -1249490 -1293493 -1343471 -1278641 -1217843 -1226274
7134 -1226274 -1244718 -1306633 -1317680 -1285249 -1235264 -1158080 -1152912 -1155470 -1152735 -1191996 -1197760 -1262703
7122 -1262703 -1298694 -1313831 -1394159 -1374230 -1264815 -1182760 -1148349 -1159226 -1263996 -1253870 -1316759
7111 -1316759 -1326178 -1233472 -1176257 -1201956 -1207295 -1140812 -1084188 -1087090 -1124236 -1237795 -1217227 -1195361
7099 -1195361 -1196359 -1204600 -1177899 -1186171 -1236569 -1224695 -1255173 -1245011 -1247649 -1275425 -1328257 -1278594
7087 -1278594 -1159204 -1170282 -1330648 -1426191 -1345097 -1285943 -1270527 -1296130 -1195317 -1181305 -1273924
7076 -1273924 -1335785 -1268097 -1211821 -1230968 -1248336 -1332355 -1352093 -1268514 -1128926 -1170099 -1267750
7065 -1267750 -1334723 -1321355 -1202299 -1176731 -1222180 -1142347 -1056581 -1162908 -1175818 -1206146 -1215268
7054 -1215268 -1231766 -1214828 -1237155 -1219418 -1217851 -1199675 -1156901 -1169036 -1157732 -1169415 -1244546 -1309539
7042 -1309539 -1270422 -1197267 -1197067 -1192907 -1170328 -1119562 -1095972 -1014080 -1022126 -1154892 -1294384 -1329333
7030 -1329333 -1344315 -1384162 -1372406 -1355341 -1295711 -1336685 -1342104 -1221417 -1201479 -1200349 -1230198 -1252759
7018 -1252759 -1216107 -1203767 -1150813 -1191920 -1151080 -1121380 -1095918 -1194065 -1213421 -1216971 -1262101 -1215820
7006 -1215820 -1293857 -1257492 -1135631 -1082007 -1123214 -1243338 -1283560 -1297778 -1331714 -1336716 -1317224
6995 -1317224 -1241156 -1179266 -1128166 -1172345 -1260390 -1328489 -1257780 -1239776 -1238222 -1341088 -1337332 -1319218
6983 -1319218 -1251522 -1119051 -1087273 -1097547 -1097933 -1130761 -1139881 -1218259 -1167942 -1064530 -1042861 -1103089
6971 -1103089 -1246603 -1256138 -1187390 -1175591 -1209481 -1286532 -1234666 -1172386 -1124784 -1125489 -1109700 -1133515
6959 -1133515 -1117204 -1080913 -1076192 -1082847 -1135492 -1156622 -1210425 -1234751 -1246994 -1220814 -1231231 -1211085
6947 -1211085 -1117869 -1105656 -1111804 -1213883 -1303679 -1276271 -1237548 -1203050 -1056079 -1030284 -994778
6936 -994778 -1047311 -1082448 -1036346 -1082777 -1157675 -1145833 -1169403 -1196454 -1296765 -1353274 -1281652
6925 -1281652 -1250515 -1096187 -1042205 -1102389 -1169882 -1194581 -1196928 -1192025 -1203931 -1130922 -1169547 -1194935
6913 -1194935 -1163519 -1097607 -1112158 -1107847 -1030578 -1087783 -1092848 -1150585 -1156611 -1101163 -1075594 -1127074
6901 -1127074 -1175823 -1202192 -1218995 -1221249 -1199265 -1206264 -1241448 -1235059 -1162722 -1095424 -1139013 -1194011
6889 -1194011 -1258941 -1286969 -1224275 -1203319 -1226099 -1178491 -1137144 -1119771 -1123738 -1099932 -1108150 -1159756
6877 -1159756 -1223811 -1322933 -1329643 -1300577 -1351323 -1391433 -1356892 -1326295 -1298695 -1355797 -1254656
6866 -1254656 -1231344 -1258567 -1191566 -1193925 -1174889 -1166164 -1102543 -1049852 -1129057 -1173752 -1159227 -1254228
6854 -1254228 -1229572 -1191321 -1203751 -1139962 -1159733 -1213501 -1219196 -1137367 -1126915 -1087792 -1122127 -1099947
6842 -1099947 -1105510 -1209348 -1166220 -1179037 -1168917 -1176887 -1258945 -1157490 -1078369 -1131507 -1161515
6831 -1161515 -1187498 -1127688 -1078488 -1099061 -1248117 -1277855 -1260162 -1226282 -1177028 -1168276 -1141994
6820 -1141994 -1105635 -1030622 -933642 -898552 -971760 -1069791 -1103972 -1186550 -1258999 -1210081 -1186314
6809 -1186314 -1207717 -1150311 -1066111 -1032306 -1150392 -1289020 -1263197 -1172437 -1167998 -1146085 -1141866
6798 -1141866 -1145874 -1206713 -1140271 -1018996 -1047793 -1078876 -1129241 -1122749 -1126726 -1214325 -1246059 -1115973
6786 -1115973 -1138735 -1210226 -1195439 -1139395 -1131972 -1160954 -1155200 -1160139 -1197147 -1163449 -1107264 -1135497
6774 -1135497 -1152217 -1130541 -1089380 -1070429 -1058753 -1109762 -1122278 -1185392 -1234052 -1244419 -1290899
6763 -1290899 -1264012 -1194503 -1137091 -1134649 -1214160 -1226218 -1203403 -1129882 -1110812 -1137360 -1102401 -1048272
6751 -1048272 -1055955 -1062235 -1036854 -1126175 -1104184 -1180275 -1159590 -1093786 -1046001 -1047105 -1032065 -1036610
6739 -1036610 -1045697 -1162692 -1232890 -1231813 -1101985 -1098812 -1112281 -1173380 -1180516 -1230119 -1230698 -1135021
6727 -1135021 -1074213 -1133014 -1065661 -1100554 -1168243 -1115734 -1082426 -1174484 -1260654 -1150791 -1132500
6716 -1132500 -1181941 -1163009 -1134817 -1114202 -1104780 -1114343 -1080426 -1061940 -1127171 -1157762 -1030172 -943956
6704 -943956 -1042934 -1155044 -1213395 -1231154 -1264952 -1190763 -1111924 -1073045 -1137280 -1159673 -1129311
6693 -1129311 -1111573 -1076631 -1113237 -1141038 -1170976 -1227481 -1283439 -1274810 -1236622 -1148764 -1107012 -1101476
6681 -1101476 -1142161 -1204499 -1182388 -1119592 -1055040 -1118558 -1146690 -1064184 -1061605 -1036386 -1078665 -1045521
6669 -1045521 -913606 -946708 -1042219 -1175059 -1197520 -1098651 -1080304 -1149095 -1178072 -1199055 -1178763
6658 -1178763 -1179699 -1268730 -1268726 -1264626 -1166232 -1079642 -1154682 -1109873 -1147783 -1131622 -1072327 -1020602 -988659
6645 -988659 -1043342 -1171849 -1142294 -1029344 -1039300 -1079861 -1027343 -1052894 -1016926 -992509 -1019218
6634 -1019218 -1050911 -1091973 -1136962 -1212020 -1163626 -1155900 -1193395 -1194744 -1220552 -1139065 -1020626 -1042143
6622 -1042143 -1025236 -1049908 -1109864 -1089115 -1209232 -1276391 -1244926 -1207809 -1176943 -1180804 -1177582 -1172536
6610 -1172536 -1125079 -1216984 -1273958 -1205761 -1097514 -1005759 -928220 -963367 -976932 -957245 -1035242
6599 -1035242 -1073456 -1113197 -1078029 -1024133 -1081711 -1131712 -1066878 -1003090 -1053678 -1064688 -1053907
6588 -1053907 -1096465 -1064938 -1064545 -1102389 -1113786 -1050274 -1056461 -1056841 -1021925 -928709 -948750 -1006818
6576 -1006818 -1061956 -1017886 -981935 -980589 -1014742 -1050744 -991991 -1026624 -1117143 -1183401 -1138645 -1085736
6564 -1085736 -1084117 -1033774 -1038366 -1096072 -1101233 -1002767 -982085 -975315 -960787 -949905 -974642 -971196
6552 -971196 -965272 -973473 -930658 -858269 -917635 -1037943 -1050603 -1023254 -993716 -1007064 -995199 -983417
6540 -983417 -990703 -1004888 -916868 -846916 -788592 -718511 -794905 -872437 -851992 -826920 -847916 -907007
6528 -907007 -914461 -937833 -1032373 -1110944 -1099870 -1078958 -1080207 -1154653 -1227314 -1287410 -1335881 -1328674
6516 -1328674 -1274453 -1222921 -1219354 -1261317 -1271281 -1240654 -1243745 -1232936 -1231551 -1210159 -1147965 -1128345
6504 -1128345 -1148475 -1135181 -1132184 -1153056 -1205853 -1241674 -1338373 -1371553 -1330982 -1291256 -1189858
6493 -1189858 -1195830 -1242366 -1242707 -1250955 -1291507 -1276233 -1170034 -1114645 -1125886 -1118627 -1180855 -1227200
6481 -1227200 -1128050 -1126069 -1115136 -1154620 -1153472 -1142502 -1142510 -1151267 -1206903 -1164734 -1114528 -1078369 -1071542
6468 -1071542 -1190745 -1248713 -1187434 -1229961 -1333210 -1291960 -1243576 -1177736 -1110756 -1045092 -1122841
6457 -1122841 -1186419 -1205622 -1246143 -1174750 -1089116 -1013062 -983942 -1034516 -1039539 -1068506 -1189205
6446 -1189205 -1146120 -1052019 -1041359 -1046027 -1093856 -1118388 -1079936 -1125751 -1126501 -1107456 -1181147 -1244052
6434 -1244052 -1158523 -1165028 -1210998 -1209897 -1272935 -1303839 -1241176 -1181247 -1098513 -1032658 -1067092 -1108409
6422 -1108409 -1125943 -1064924 -1087791 -1108209 -1099875 -1144129 -1161867 -1147847 -1076239 -1060948 -1112189 -1228720
6410 -1228720 -1238811 -1289564 -1266659 -1156220 -1069512 -1039787 -1053477 -1121609 -1092335 -1003624 -1033528
6399 -1033528 -1032432 -1096270 -1133117 -1146973 -1176447 -1190146 -1152952 -1144308 -1196209 -1221989 -1168761 -1098073
6387 -1098073 -1138133 -1071247 -1059665 -1129131 -1160788 -1187369 -1178858 -1178565 -1294905 -1279956 -1178444 -1193382
6375 -1193382 -1170107 -1174713 -1067024 -984564 -1012142 -1162792 -1234581 -1187790 -1163968 -1198674 -1205900
6364 -1205900 -1217045 -1258230 -1281218 -1255025 -1209002 -1190993 -1190427 -1206453 -1169002 -1144060 -1147518 -1099543
6352 -1099543 -1038713 -1001205 -1027245 -1008850 -951238 -1046613 -1098537 -1172792 -1200280 -1151637 -1069958
6341 -1069958 -1047304 -1118243 -1160803 -1160900 -1206448 -1194219 -1142916 -1077408 -1100130 -1085816 -990634 -1008840
6329 -1008840 -1132483 -1195395 -1049610 -953347 -939385 -994653 -1117929 -1150913 -1066189 -1062887 -1043041
6318 -1043041 -980224 -1040421 -1112023 -1117413 -1093936 -1107407 -1070978 -1010724 -1038632 -1090431 -1085406 -1115780
6306 -1115780 -1123211 -1142215 -1089100 -1068241 -1148847 -1250545 -1112067 -1046383 -1035953 -1018641 -981475
6295 -981475 -994811 -1047309 -1121794 -1151229 -1196505 -1196584 -1196504 -1232172 -1184697 -1165422 -1214565 -1140046 -1101145
6282 -1101145 -1104207 -1121981 -1105826 -1102009 -1005771 -979279 -1054321 -1018501 -977974 -972307 -993242 -962642
6270 -962642 -978393 -1012566 -1107413 -1133108 -1131918 -1118731 -1112152 -1051211 -1145697 -1171559 -1097918 -1188946
6258 -1188946 -1171923 -1121340 -1113525 -1118764 -1108444 -1175143 -1239859 -1196892 -1119450 -1076684 -1080203 -1193611
6246 -1193611 -1196316 -1143878 -1128510 -1108575 -1104102 -1063557 -1032095 -1107549 -1182991 -1182045 -1173325 -1068438
6234 -1068438 -1026213 -996111 -985108 -1025827 -1047254 -1032132 -954198 -1022926 -1083999 -1103009 -1103864 -1098179
6222 -1098179 -1102614 -1080430 -1102523 -1071278 -1017067 -1022001 -992615 -903708 -866437 -986888 -1041312 -1071046
6210 -1071046 -1036875 -1071407 -1093809 -1096337 -1035342 -965209 -1027653 -1069980 -1098150 -1028392 -970134 -1013233
6198 -1013233 -1120827 -1087250 -1027488 -917731 -828496 -922387 -989154 -976447 -1008645 -957737 -992314
6187 -992314 -996254 -1019323 -956606 -997035 -991701 -958044 -1079663 -1117513 -1168317 -1143286 -1083328 -1119574
6175 -1119574 -1095368 -1081858 -1095172 -1078260 -996113 -839685 -762844 -840565 -900741 -940420 -993175
6164 -993175 -995019 -1020062 -1094368 -1128209 -1067089 -1057113 -1051663 -1073511 -1085542 -1156529 -1119134 -1064827
6152 -1064827 -1035737 -988402 -1006509 -1041842 -1026568 -1001786 -965742 -990233 -1025030 -1023774 -1015193 -993325
6140 -993325 -975035 -1002307 -958455 -945443 -948980 -978604 -1010089 -1005062 -986248 -1003492 -994622 -996969
6128 -996969 -1019658 -1051597 -918995 -862028 -933202 -935990 -1011938 -1051922 -1042936 -995458 -955689 -872484
6116 -872484 -937197 -916735 -872022 -989148 -1114571 -1156208 -1085683 -1053188 -1099763 -1146929 -1150213
6105 -1150213 -1136819 -1113682 -1119863 -1095553 -1140410 -1033844 -981755 -1012251 -1055611 -1096274 -1137562
6094 -1137562 -1116041 -1141554 -1217583 -1176738 -1073918 -1034124 -1130217 -1172004 -1095671 -1020263 -988124
6083 -988124 -1045437 -974199 -990467 -1060036 -1124297 -1158843 -1134596 -1090177 -1135475 -1152543 -1048862
6072 -1048862 -959001 -932127 -928555 -924366 -941059 -947473 -966708 -1042222 -1075227 -1001575 -953628 -978823
6060 -978823 -949001 -925059 -935957 -977946 -1023181 -1101781 -1096222 -1075497 -1189443 -1213858 -1124486 -1075055
6048 -1075055 -1047996 -1135534 -1075332 -1098189 -1140570 -1167854 -1162423 -1204082 -1185186 -1082738 -1078137 -1117974
6036 -1117974 -1128243 -1178063 -1119825 -1092475 -1098990 -1021341 -1023437 -1018172 -1025217 -1108055 -1120155 -1071262
6024 -1071262 -1055048 -1046040 -1016428 -1042970 -1029351 -986974 -1020420 -974125 -954661 -1009757 -1021867 -1078685
6012 -1078685 -1121761 -1070077 -1065904 -1109906 -1045579 -1003140 -986433 -1022190 -1050517 -1121439 -1188712 -1213119
6000 -1213119 -1128122 -1145161 -1157737 -1165424 -1123201 -1048543 -1023160 -952356 -936585 -956727 -878641 -933241
5988 -933241 -982320 -970459 -968488 -943831 -907269 -926946 -1010940 -989830 -871883 -890676 -910747 -959070
5976 -959070 -1012331 -996201 -926153 -901489 -920734 -912356 -938488 -865305 -804753 -848981 -838911 -970073
5964 -970073 -1065098 -1145363 -1193480 -1172414 -1091135 -1065264 -1017120 -999662 -994414 -1001427 -1012628 -929978
5952 -929978 -949629 -958472 -995630 -919523 -927819 -1038789 -1097812 -1154385 -1144106 -1123344 -1115508 -1048550
5940 -1048550 -934214 -851756 -877071 -984451 -1011785 -1023747 -990909 -986114 -1035940 -1005104 -1054713
5929 -1054713 -1099926 -1051906 -1018096 -990545 -965329 -1000302 -1000292 -885617 -805341 -921693 -973673 -944349
5917 -944349 -945096 -1006641 -1046168 -1117107 -1128072 -1119559 -1069598 -1041037 -1132080 -1128585 -1118316 -1097470
5905 -1097470 -1066945 -1050557 -1031949 -1029798 -1023066 -1033895 -1034477 -1050642 -1056316 -1019453 -1055928 -1072657
5893 -1072657 -1052923 -1078161 -1084584 -1124338 -1097387 -1056417 -1013240 -977592 -962211 -949886 -1003227 -1046374
5881 -1046374 -1066634 -1054912 -1072881 -1088458 -1168157 -1112258 -1091264 -1101074 -1030336 -1049151 -1180018
5870 -1180018 -1173753 -1163114 -1161830 -1025213 -898143 -854326 -822950 -823892 -918285 -1027685 -1076193 -1042082
5858 -1042082 -970182 -955466 -934052 -926996 -973410 -989328 -998063 -993287 -955871 -945427 -868756 -855055
5846 -855055 -940929 -1021457 -1092136 -1123030 -1100037 -1069133 -1056528 -1105642 -1187236 -1193973 -1175553 -1179575
5834 -1179575 -1154690 -1145482 -1116572 -1121469 -1111204 -1057987 -1090092 -1129654 -1088187 -1039124 -1008711 -983495
5822 -983495 -1006381 -965493 -951426 -911560 -954420 -1065860 -1050357 -1035689 -950764 -840358 -864184
5811 -864184 -793288 -722914 -830004 -964656 -966788 -945869 -970431 -983509 -1055776 -1074583 -1045763
5800 -1045763 -991809 -1026472 -981360 -963373 -996448 -988102 -1085643 -1118422 -1026149 -1057678 -1136527 -1123938
5788 -1123938 -1072447 -1003773 -1036340 -1068268 -1048529 -1011229 -998370 -978724 -1040269 -1034653 -1013389 -1033031
5776 -1033031 -1060886 -991086 -945299 -885415 -950282 -934561 -926322 -868897 -883502 -789485 -767353 -859772
5764 -859772 -913314 -988972 -966688 -962973 -920563 -909751 -885294 -908226 -955994 -1051544 -1013691 -969031
5752 -969031 -985586 -1010032 -1017423 -986065 -996147 -989934 -993742 -1000805 -963095 -972642 -989944 -1011755 -1009049
5739 -1009049 -1020849 -976832 -866616 -852647 -875010 -829311 -823689 -830102 -877151 -982104 -971675
5728 -971675 -999976 -981956 -915346 -937868 -965375 -962903 -970231 -934279 -959864 -977706 -1026758 -988714
5716 -988714 -904197 -907158 -973288 -1020936 -973401 -1010227 -1002303 -929302 -871882 -790858 -841118 -813921
5704 -813921 -816102 -913264 -981121 -1021070 -1079010 -978852 -848689 -923147 -1022642 -1061993 -1170974
5693 -1170974 -1213332 -1192285 -1071641 -985399 -1004207 -964960 -1044667 -1063348 -1110304 -1054098 -974462
5682 -974462 -890070 -1003034 -1046318 -1046522 -1009915 -966707 -973402 -978035 -1012131 -1056193 -1006968 -963622
5670 -963622 -957655 -946467 -924223 -831767 -873441 -983300 -1018571 -989912 -1001014 -1000871 -998829 -972231
5658 -972231 -978372 -953468 -863081 -817040 -761890 -790626 -777926 -785343 -825454 -839203 -890162 -878034
5646 -878034 -876461 -895021 -876914 -882505 -858136 -802950 -846680 -844750 -880527 -964786 -963281 -923802
5634 -923802 -979276 -1034150 -1026455 -984458 -985759 -1002484 -1006165 -1031309 -1077695 -993674 -935419 -915291
5622 -915291 -976255 -936150 -929550 -982174 -1015394 -1030268 -1025053 -995595 -969830 -948688 -1000190 -999837
5610 -999837 -1019791 -1022785 -999318 -1018264 -1019352 -941826 -920702 -960829 -959047 -920789 -838123 -809677
5598 -809677 -868130 -895223 -904899 -870532 -869540 -862124 -888856 -875089 -819562 -842903 -892277 -960345
5586 -960345 -959095 -928570 -970004 -967997 -928440 -953910 -963812 -987824 -1022868 -1030656 -977583 -920582
5574 -920582 -903440 -862701 -871859 -866059 -887737 -873830 -768331 -758416 -797851 -845616 -979475 -1019622
5562 -1019622 -991719 -996092 -994039 -950287 -881082 -877819 -834512 -826475 -898356 -967078 -966549 -1007233 -983765
5549 -983765 -923706 -951691 -936686 -949570 -940349 -977322 -1022809 -997913 -938763 -864216 -878035 -915001
5537 -915001 -857754 -838345 -862287 -894115 -864366 -856908 -891021 -1026934 -1038028 -1131635 -1099985 -1033763
5525 -1033763 -942795 -947917 -943612 -953293 -898874 -910179 -946368 -972901 -955123 -964683 -966069 -913274
5513 -913274 -859973 -848856 -832004 -841641 -859956 -1018796 -1045951 -878389 -920542 -997766 -954472
5502 -954472 -894146 -904437 -828654 -873522 -945650 -962851 -923167 -1001745 -984899 -978014 -931177 -932590
5490 -932590 -902772 -948091 -1050798 -968632 -926253 -977850 -1023770 -969423 -1006351 -1123945 -1222381
5479 -1222381 -1221723 -1171331 -1181618 -1198204 -1142987 -1056026 -1053368 -1042905 -951756 -969885 -976326 -915873
5467 -915873 -958613 -970625 -919769 -909113 -940080 -963636 -1014896 -1026640 -1060883 -1008617 -993847 -934426
5455 -934426 -837420 -773252 -771553 -956349 -1057523 -1114582 -1052369 -1026091 -1010193 -975536 -877744
5444 -877744 -889885 -958790 -1076553 -1068455 -1061528 -966030 -894020 -927697 -1000312 -1079826 -1038311 -961482
5432 -961482 -894817 -847705 -884693 -954086 -993241 -960155 -941562 -953083 -969686 -877696 -841074 -843096
5420 -843096 -856502 -889801 -856616 -859126 -938159 -996704 -961608 -871169 -837044 -823394 -791122 -796543
5408 -796543 -750438 -810550 -956004 -1031674 -1068721 -1060511 -1044118 -988330 -983212 -1034886 -1079327 -1069758
5396 -1069758 -1053016 -947971 -896884 -876002 -817194 -883647 -975436 -981019 -963825 -912305 -911432 -851383
5384 -851383 -853063 -902020 -891800 -904322 -854432 -890273 -909025 -970795 -983056 -970552 -973193 -971338
5372 -971338 -936697 -878437 -903950 -938890 -952212 -852400 -827731 -919923 -958310 -958247 -978278 -1003637
5360 -1003637 -928523 -896985 -938703 -981077 -952811 -930281 -895035 -879326 -916475 -940364 -934515 -912705
5348 -912705 -885625 -920141 -979881 -923883 -891756 -852767 -857999 -838423 -856153 -849420 -825105 -835908
5336 -835908 -824137 -815062 -882248 -876127 -948924 -1028695 -1052042 -1014265 -981369 -924410 -941892 -913651
5324 -913651 -896741 -884518 -931595 -915884 -944912 -933539 -892093 -875206 -873290 -849901 -804728 -785051
5312 -785051 -790577 -862198 -919279 -952840 -862152 -828185 -895380 -979144 -949086 -851291 -842520 -873537
5300 -873537 -900004 -933103 -938525 -918996 -853893 -931187 -941702 -914624 -934311 -952034 -983547 -941150
5288 -941150 -932525 -911177 -867820 -897004 -840287 -811301 -845450 -857552 -900553 -970823 -983149 -996609
5276 -996609 -1017158 -943707 -981905 -933979 -865499 -847044 -882320 -900282 -928014 -981017 -1036125 -957630
5264 -957630 -918819 -936515 -901483 -875542 -899996 -915126 -972336 -958006 -934656 -885200 -848433 -847789
5252 -847789 -895152 -868240 -830804 -807464 -848999 -912883 -842297 -834159 -802269 -852657 -841370 -809150
5240 -809150 -823754 -854733 -893891 -912883 -894060 -751989 -779190 -909365 -924308 -995775 -1028673
5229 -1028673 -1002119 -900275 -924954 -885551 -886086 -970612 -1021143 -946850 -974434 -924371 -855941 -844885
5217 -844885 -843670 -798455 -779457 -792409 -806856 -879035 -873533 -837209 -739933 -787088 -833458 -823751
5205 -823751 -816879 -826530 -841863 -898364 -806610 -785007 -816174 -798500 -788949 -941137 -1038764 -1077068
5193 -1077068 -984819 -926089 -921501 -889611 -878834 -915359 -951799 -1007937 -998364 -1031138 -1009403 -930288
5181 -930288 -822980 -835605 -903291 -920597 -910760 -854119 -865680 -871952 -902830 -856106 -778739 -721093
5169 -721093 -723548 -761871 -709126 -714001 -763816 -862971 -855465 -873398 -903459 -849460 -754248 -767192
5157 -767192 -796110 -817622 -844936 -806382 -760384 -757254 -798250 -818702 -775459 -785588 -780408 -844892
5145 -844892 -931137 -878569 -889740 -939427 -906450 -888347 -830980 -845177 -924355 -1057464 -995415
5134 -995415 -857703 -869878 -927200 -946128 -948146 -882613 -929530 -951462 -963353 -906861 -916469 -979252
5122 -979252 -942564 -816384 -810198 -857202 -836914 -815952 -779012 -745605 -814821 -858593 -842661 -827598
5110 -827598 -869649 -912707 -868339 -952501 -1045810 -1036539 -1021140 -957499 -916194 -945845 -882770 -852174
5098 -852174 -808193 -749381 -773681 -734273 -765297 -872254 -867644 -894479 -912260 -919385 -949544 -1064024
5086 -1064024 -1081969 -943276 -901373 -952867 -995411 -1029394 -1014388 -1023353 -950229 -981726 -1039479
5075 -1039479 -1025470 -945797 -920869 -961474 -953689 -905069 -839872 -810680 -811584 -737931 -755877 -815413
5063 -815413 -903157 -900167 -885473 -914939 -924528 -902923 -914380 -866428 -907933 -894407 -864697 -883527
5051 -883527 -905011 -852420 -811022 -807323 -822624 -853848 -902412 -858035 -858580 -912436 -959185 -943375
5039 -943375 -890097 -943370 -996122 -985655 -996918 -1003361 -972761 -931676 -880909 -832508 -801384 -857136
5027 -857136 -908499 -878064 -808381 -860754 -920012 -932717 -938157 -951051 -902760 -831357 -846269 -785530
5015 -785530 -738308 -749766 -778419 -820698 -876220 -889315 -916742 -929522 -899754 -889150 -862491 -854822
5003 -854822 -880912 -823331 -788789 -755489 -808842 -841429 -842012 -854133 -807790 -767321 -725569 -774751
4991 -774751 -811425 -830708 -780825 -858935 -895908 -883182 -826645 -833128 -857586 -824068 -886306 -875918
4979 -875918 -931578 -929510 -893635 -900101 -843137 -816559 -810004 -814250 -860739 -924164 -917659 -963353 -962288
4966 -962288 -890419 -815394 -740416 -812349 -799222 -817288 -901856 -901781 -882353 -912991 -886084 -945762
4954 -945762 -924443 -850889 -848720 -921406 -925976 -880076 -894864 -891600 -959550 -933098 -890275 -936659
4942 -936659 -959088 -957522 -965304 -933898 -947517 -982863 -987235 -906127 -824515 -812166 -913160 -911256
4930 -911256 -890920 -907971 -970393 -1042395 -977170 -1009966 -969201 -945181 -917387 -862717 -915015 -860704
4918 -860704 -812312 -863042 -844694 -802823 -886118 -889488 -927422 -836506 -772541 -808036 -765800 -736753
4906 -736753 -813166 -809995 -801631 -802942 -801688 -856911 -939967 -924553 -914020 -909938 -851393 -909447 -932155
4893 -932155 -986247 -942186 -912405 -881912 -920876 -1033663 -958168 -822454 -834201 -947757 -963964
4882 -963964 -912377 -875349 -823048 -869526 -938771 -939242 -906754 -870403 -938411 -995581 -882732 -889424
4870 -889424 -863658 -811492 -815506 -862871 -885670 -844171 -791359 -810975 -824813 -921065 -974095 -993817
4858 -993817 -988290 -893753 -845476 -737786 -752952 -780037 -844437 -853792 -876245 -897878 -890019 -886659
4846 -886659 -845970 -811940 -744933 -772456 -845461 -868090 -864440 -827642 -817969 -858524 -810810 -857291
4834 -857291 -897891 -955636 -826150 -773118 -873866 -976442 -948890 -844799 -772714 -757568 -805749
4823 -805749 -762312 -792821 -916253 -908472 -777542 -760642 -867134 -996330 -1015645 -921002 -886984
4812 -886984 -903659 -864481 -834930 -815131 -878265 -858392 -774378 -750438 -769434 -784516 -830694 -853082
4800 -853082 -831710 -890970 -923543 -943263 -906353 -827787 -751489 -696597 -700934 -693294 -654584 -704518
4788 -704518 -782220 -757848 -733052 -707109 -718009 -783169 -796891 -706161 -733365 -761012 -784561 -864853
4776 -864853 -885737 -938712 -905943 -836899 -875124 -895071 -869689 -872633 -909476 -874284 -881185 -898421
4764 -898421 -941934 -935081 -827296 -846846 -855910 -809242 -791704 -825827 -843009 -814163 -819081 -817787
4752 -817787 -791170 -762509 -806608 -888744 -1020540 -976053 -949188 -892630 -940889 -978494 -945613
4741 -945613 -947440 -855819 -844234 -941724 -973508 -967079 -954633 -951234 -821617 -800047 -783371 -786983
4729 -786983 -846837 -879651 -876629 -848898 -868224 -863461 -814884 -730727 -768664 -869875 -882697 -920036
4717 -920036 -1052958 -1048374 -1027699 -1024657 -1019349 -974128 -823740 -746892 -752880 -849864 -875760 -889755
4705 -889755 -925606 -942905 -887886 -898371 -962983 -945093 -984600 -963638 -910680 -897587 -912717 -911063
4693 -911063 -881333 -825185 -794329 -826692 -799559 -779060 -797410 -814137 -787984 -856230 -912532 -843424
4681 -843424 -729382 -663787 -709781 -724708 -782856 -844654 -874763 -896404 -842325 -843409 -805423 -766350
4669 -766350 -745571 -722656 -658865 -680840 -716501 -800846 -778970 -718037 -758279 -852888 -931161 -950479
4657 -950479 -942306 -921656 -821535 -781874 -780470 -761621 -732177 -737038 -781849 -858044 -897783 -863437
4645 -863437 -808386 -809086 -829430 -861108 -835649 -732692 -614437 -628735 -697447 -762688 -749893 -703626
4633 -703626 -790880 -872784 -937652 -999416 -990129 -926710 -870003 -838232 -806870 -751048 -789656 -908041
4621 -908041 -917198 -850880 -838942 -774351 -832747 -878575 -873229 -829604 -865768 -850123 -751729 -743216
4609 -743216 -759955 -864025 -928471 -902108 -887599 -847011 -768926 -732023 -755529 -787866 -761415
4598 -761415 -815107 -863998 -770048 -673776 -684448 -714801 -798252 -906904 -936953 -883056 -829946
4587 -829946 -760431 -794966 -772694 -834344 -966290 -981200 -918029 -828622 -781813 -767480 -796048
4576 -796048 -861318 -863493 -876831 -902618 -925276 -877653 -816291 -868794 -866553 -808602 -857611 -957633
4564 -957633 -1032857 -1014404 -1003576 -969013 -866626 -790361 -704992 -681162 -751484 -817753 -866253
4553 -866253 -763738 -742789 -839912 -863028 -810621 -770514 -732552 -728454 -731250 -735516 -752043 -674332
4541 -674332 -762711 -800274 -787635 -839054 -844534 -879081 -895115 -806181 -750052 -815489 -817558 -769245
4529 -769245 -764268 -819847 -833045 -918167 -929286 -886344 -791624 -718844 -699247 -764773 -763251 -803139
4517 -803139 -852126 -859849 -794363 -824437 -821846 -824677 -768831 -744719 -789804 -859535 -811184 -767729
4505 -767729 -801401 -804479 -875150 -958477 -963439 -834550 -805001 -853456 -865132 -897920 -890637 -797733
4493 -797733 -801057 -801379 -795490 -874055 -939963 -907325 -847074 -851299 -860528 -818559 -858769 -871369 -836174
4480 -836174 -806401 -838250 -834015 -812046 -781730 -772668 -703665 -712450 -714721 -745231 -802052 -848385
4468 -848385 -865180 -777950 -760790 -816256 -809847 -799722 -846777 -903346 -913445 -834257 -751470 -690711
4456 -690711 -793239 -798434 -805517 -824527 -798919 -798878 -756178 -761790 -714040 -722256 -772989 -726942 -733602
4443 -733602 -788703 -756538 -675983 -749681 -825904 -939745 -1009850 -895627 -852614 -790201 -861205
4432 -861205 -898586 -911754 -777770 -722047 -769249 -777825 -786394 -808596 -859938 -847899 -785831 -826585
4420 -826585 -857896 -835651 -767657 -759986 -812818 -838393 -828318 -864183 -821049 -830539 -872670 -819966
4408 -819966 -750897 -705617 -670717 -695539 -814650 -877467 -948677 -972898 -937947 -911597 -871436
4397 -871436 -816610 -846516 -892658 -903489 -883051 -826877 -779083 -684872 -694308 -756355 -767311 -873393
4385 -873393 -836309 -804556 -860908 -922043 -845606 -884814 -897463 -795546 -766756 -744905 -780326
4374 -780326 -774760 -847644 -954058 -927289 -889968 -881097 -886117 -931601 -941227 -899966 -821139 -795338
4362 -795338 -823375 -828747 -815182 -820543 -756851 -702476 -698497 -756084 -730671 -734831 -712304 -743297
4350 -743297 -745176 -733627 -747781 -796498 -865697 -847460 -852275 -898255 -923563 -904800 -893742 -925932
4338 -925932 -909213 -876888 -943543 -889325 -838709 -871296 -888674 -864216 -769683 -725179 -736244 -773266
4326 -773266 -736677 -747809 -751622 -841162 -867441 -945296 -886750 -828256 -822554 -794808 -800134 -812604
4314 -812604 -817761 -814186 -798116 -816026 -761940 -782838 -794221 -855390 -912074 -816896 -734122 -690754
4302 -690754 -702824 -671930 -716653 -704081 -707062 -642638 -568728 -509295 -595489 -682672 -723680 -715402
4290 -715402 -743000 -766705 -767282 -697492 -595769 -634894 -728870 -772604 -778267 -738420 -749397 -775539
4278 -775539 -807496 -824306 -845766 -838019 -869802 -880594 -827582 -842527 -825870 -752648 -727502 -754184
4266 -754184 -742671 -774828 -791601 -799458 -845604 -924483 -891012 -824915 -766113 -731526 -746698 -763345
4254 -763345 -792971 -745098 -799736 -866911 -885179 -862660 -870440 -900364 -884438 -892041 -932105 -934247
4242 -934247 -843344 -808799 -739510 -755011 -833688 -886130 -915855 -925544 -948047 -872257 -876278 -795707
4230 -795707 -833137 -838715 -774420 -734553 -831277 -888889 -946434 -1016376 -977135 -973907 -893865 -802992
4218 -802992 -741328 -762543 -853470 -863372 -846804 -792349 -815693 -835666 -848269 -906936 -839075 -843960
4206 -843960 -858067 -798722 -795629 -848233 -815331 -764819 -767633 -766600 -774020 -802122 -832410 -846741
4194 -846741 -755293 -709753 -701965 -722065 -721783 -725411 -795036 -849031 -837329 -829882 -857939 -818610 -700428
4181 -700428 -636546 -703303 -768201 -742188 -690725 -685393 -638300 -672106 -783384 -742335 -689813 -672069
4169 -672069 -714465 -717999 -753430 -657071 -680056 -741213 -816500 -876859 -852749 -799271 -831679 -827516
4157 -827516 -818621 -820831 -698063 -703932 -752372 -753628 -762154 -763945 -741060 -740913 -699638 -677069 -763871
4144 -763871 -803793 -729481 -740575 -764957 -784339 -857304 -954561 -895602 -869057 -833744 -733892 -816216
4132 -816216 -841237 -769193 -647686 -619685 -672284 -660258 -722553 -750768 -769832 -749543 -688110
4121 -688110 -772164 -801752 -807034 -781938 -757525 -792390 -787314 -786290 -802836 -789611 -743038 -703204
4109 -703204 -694400 -790466 -770910 -682229 -664439 -704847 -612237 -614915 -688968 -750823 -782592 -778808
4097 -778808 -789144 -863578 -907005 -958248 -944765 -955193 -838173 -814476 -781296 -738456 -728727 -710918
4085 -710918 -679770 -644494 -669707 -826052 -880536 -793581 -765174 -729338 -727368 -708646 -716327 -781635
4073 -781635 -821018 -755927 -715250 -760491 -790590 -761469 -804274 -876401 -877746 -806861 -750965 -793928
4061 -793928 -772865 -711435 -726347 -828056 -878902 -787972 -775433 -727599 -651841 -683099 -740213
4050 -740213 -750442 -712000 -761869 -741338 -786465 -808227 -808900 -775574 -741738 -685249 -727616 -740707
4038 -740707 -681894 -693264 -731962 -743162 -791694 -859379 -882580 -854252 -863699 -826503 -756479 -710929
4026 -710929 -630562 -564943 -657040 -641767 -622326 -738568 -872842 -791987 -767631 -795375 -790247
4015 -790247 -808886 -883946 -922926 -889655 -796174 -701950 -700638 -702748 -739945 -714689 -669703 -763178
4003 -763178 -830287 -843266 -776941 -816918 -815116 -824481 -782952 -806208 -817915 -853399 -927100 -925773
3991 -925773 -840446 -868312 -825626 -743001 -700778 -763778 -763260 -682401 -696043 -767074 -798416 -809186
3979 -809186 -820813 -938039 -910620 -842635 -803373 -817044 -809508 -796540 -817956 -838655 -857594 -852640
3967 -852640 -836432 -793963 -744629 -732381 -696768 -688346 -788956 -844798 -796376 -806658 -774366 -694824
3955 -694824 -685054 -661585 -709936 -753598 -733583 -687413 -596168 -630430 -693749 -750007 -705916 -632796
3943 -632796 -628265 -690530 -762383 -696858 -640908 -664184 -694828 -738800 -770517 -848849 -834264 -758578
3931 -758578 -791483 -784110 -850150 -847436 -803611 -847277 -868850 -834521 -884482 -951093 -970296 -897611
3919 -897611 -817573 -783734 -801511 -808705 -771452 -802931 -826260 -850703 -839560 -774563 -706371 -716092
3907 -716092 -772731 -762334 -758224 -791524 -774177 -799728 -873603 -903790 -901766 -997773 -970837 -908689
3895 -908689 -838135 -847966 -846080 -775023 -724000 -744812 -722414 -786213 -893060 -832410 -779710 -806141
3883 -806141 -847299 -837831 -814891 -739283 -753595 -816638 -790688 -652594 -694899 -788148 -834577 -832708
3871 -832708 -888260 -906445 -862217 -833475 -838564 -755984 -716865 -743440 -823254 -821642 -834982 -905033
3859 -905033 -849053 -774532 -840471 -907099 -935639 -847499 -771149 -781310 -877467 -891613 -782345
3848 -782345 -675629 -670405 -820932 -935167 -946202 -935375 -959041 -868309 -734516 -611583 -547880
3837 -547880 -577930 -643896 -707954 -738978 -739021 -784522 -781601 -833918 -846606 -861844 -822112 -749575
3825 -749575 -750438 -812582 -915942 -852097 -743647 -648834 -700435 -664871 -604050 -654051 -729166 -758082
3813 -758082 -700982 -747102 -736071 -796981 -829910 -736089 -735685 -751603 -744547 -687798 -722846 -802725
3801 -802725 -783086 -761019 -705123 -694412 -712685 -706180 -731758 -698905 -710877 -603227 -617974 -716460
3789 -716460 -773064 -736170 -682907 -661628 -745548 -801775 -814605 -830829 -846617 -793354 -732076 -701148
$$ [...]
##END NTUPLES=NMR SPECTRUM
##END=
