##TITLE=Analysis number 327078
Compound Code mo 00912
Project Code adrs
Chemist Name af chempharm
##JCAMPDX= 6.0         $$ Bruker NMR JCAMP-DX V2.0
##DATA TYPE= NMR SPECTRUM
##DATA CLASS= NTUPLES
##ORIGIN= Bruker BioSpin GmbH
##OWNER= nmr
$$ XWIN-NMR		Version 3.5
$$ Thu Mar  8 10:21:49 2007 GMT Standard Time (UT+0h)  MAYBRIDGE\nmr@NMR_250MHZ
##.OBSERVE FREQUENCY= 250.131544655141
##.OBSERVE NUCLEUS= ^1H
##.ACQUISITION MODE= SIMULTANEOUS (DQD)
##.ACQUISITION SCHEME= undefined
##.AVERAGES= 16
##.DIGITISER RES= 18
##SPECTROMETER/DATA SYSTEM= dpx250
##.PULSE SEQUENCE= zg30
##.SOLVENT NAME= DMSO
##.SHIFT REFERENCE= (INTERNAL, DMSO, 0, 16.522)
##AUDIT TRAIL= $$ (NUMBER, WHEN, WHO, WHERE, WHAT)
$$ ##TITLE= Audit trail, XWIN-NMR		Version 3.5
$$ ##JCAMPDX= 5.01
$$ ##ORIGIN= Bruker BioSpin GmbH
$$ ##OWNER= nmr
$$ C:\u/data/dgb/nmr/ADRS/580/pdata/1/auditp.txt
$$ ##AUDIT TRAIL=  $$ (NUMBER, WHEN, WHO, WHERE, WHAT)
(   1,<2007-03-08 10:21:23.22 +000>,<MAYBRIDGE\nmr>,<NMR_250MHZ>,
      <created by zg, POWCHK disabled, PULCHK disabled
       configuration hash MD5:
       49 4B E0 1D 92 C2 6B 37 9F E6 65 BC 52 41 86 1D
       data hash MD5: 64K
       A2 DE 69 F9 34 46 FB 5D 85 C1 E3 F5 36 6E 1F 50>)
(   2,<2007-03-08 10:21:39.81 +000>,<MAYBRIDGE\nmr>,<NMR_250MHZ>,
      <Start of raw data processing
       ef LB = 0.3 FT_mod = 6 PKNL = 1 SI = 32K 
       data hash MD5: 32K
       C0 85 B9 BA F6 70 D5 6E 13 0B 54 07 2A AD C5 29>)
(   3,<2007-03-08 10:21:41.55 +000>,<MAYBRIDGE\nmr>,<NMR_250MHZ>,
      <apk 
       data hash MD5: 32K
       7D D1 C2 D6 53 A6 E2 DA 0C 2D 47 B0 52 93 5D 29>)
(   4,<2007-03-08 10:21:42.25 +000>,<MAYBRIDGE\nmr>,<NMR_250MHZ>,
      <abs ABSG = 5 
       data hash MD5: 32K
       48 46 C7 D3 EB 02 13 27 86 E6 F2 76 AE F9 2A B4>)
$$ ##END=
$$ 
$$ hash MD5
$$ 60 80 95 19 31 30 16 15 F4 0D 9D 8E 1A 49 EE 3D
##$RELAX= 
##$RELAX= 
##$RELAX= 
##$RELAX= 
##$RELAX= 
##$RELAX= 
##$RELAX= 
$$ Bruker specific parameters
$$ --------------------------
##$DU= <C:\u>
##$EXPNO= 580
##$NAME= <ADRS>
##$PROCNO= 1
##$TYPE= <nmr>
##$USER= <dgb>
##$AMP= (0..31)
100 100 100 100 100 100 100 100 100 100 100 100 100 100 100 100 100 100 
100 100 100 100 100 100 100 100 100 100 100 100 100 100 
##$AQSEQ= 0
##$AQ_mod= 3
##$AUNM= <au_zg>
##$AUTOPOS= <36 >
##$BF1= 250.13
##$BF2= 250.13
##$BF3= 250.13
##$BF4= 250.13
##$BF5= 500.13
##$BF6= 500.13
##$BF7= 500.13
##$BF8= 500.13
##$BYTORDA= 1
##$CFDGTYP= 0
##$CFRGTYP= 5
##$CHEMSTR= <none>
##$CNST= (0..31)
1 1 145 1 1 1 1 1 1 1 1 1 1 1 1 1 1 1 1 1 1 1 1 1 1 1 1 1 1 1 1 1 
##$CPDPRG= <>
##$CPDPRG1= <>
##$CPDPRG2= <>
##$CPDPRG3= <>
##$CPDPRG4= <mlev>
##$CPDPRG5= <mlev>
##$CPDPRG6= <mlev>
##$CPDPRG7= <mlev>
##$CPDPRG8= <mlev>
##$CPDPRGB= <>
##$CPDPRGT= <>
##$D= (0..31)
0 1 0 0 0 0 0 0 0 0.06 0 0 0 0 0 0 0.0002 0 0 0 0 0 0 0 0 0 0 0 0 0 0 
0 
##$DATE= 1173349281
##$DBL= (0..7)
120 120 120 120 120 120 120 120 
##$DBP= (0..7)
150 150 150 150 150 150 150 150 
##$DBP07= 0
##$DBPNAM0= <>
##$DBPNAM1= <>
##$DBPNAM2= <>
$$ [...]
##$SUBNAM7= <"">
##$SUBNAM8= <"">
##$SUBNAM9= <"">
##$SW= 20.6930455092707
##$SWIBOX= (0..15)
0 0 3 0 0 0 0 0 0 0 0 0 0 0 0 0 
##$SW_h= 5175.983436853
##$TD= 65536
##$TD0= 1
##$TE= 683.16
##$TE2= 300
##$TE3= 300
##$TEG= 300
##$TL= (0..7)
0 120 120 120 120 120 120 120 
##$TP= (0..7)
150 150 150 150 150 150 150 150 
##$TP07= 0
##$TPNAME0= <>
##$TPNAME1= <>
##$TPNAME2= <>
##$TPNAME3= <>
##$TPNAME4= <>
##$TPNAME5= <>
##$TPNAME6= <>
##$TPNAME7= <>
##$TPOAL= (0..7)
0.5 0.5 0.5 0.5 0.5 0.5 0.5 0.5 
##$TPOFFS= (0..7)
0 0 0 0 0 0 0 0 
##$TUNHIN= 0
##$TUNHOUT= 0
##$TUNXOUT= 0
##$USERA1= <user>
##$USERA2= <user>
##$USERA3= <user>
##$USERA4= <user>
##$USERA5= <user>
##$V9= 5
##$VALIST= <valist>
##$VCLIST= <CCCCCCCCCCCCCCC>
##$VD= 0
##$VDLIST= <DDDDDDDDDDDDDDD>
##$VPLIST= <PPPPPPPPPPPPPPP>
##$VTLIST= <TTTTTTTTTTTTTTT>
##$WBST= 1024
##$WBSW= 4
##$XGAIN= (0..3)
0 0 0 0 
##$XL= 0
##$YL= 0
##$YMAX_a= 391985
##$YMIN_a= -392775
##$ZGOPTNS= <>
##$ZL1= 120
##$ZL2= 120
##$ZL3= 120
##$ZL4= 120
##$ABSF1= 16.522
##$ABSF2= -4.171173
##$ABSG= 5
##$ABSL= 3
##$ALPHA= 0
##$AQORDER= 0
##$ASSFAC= 0
##$ASSFACI= 0
##$ASSFACX= 0
##$ASSWID= 0
##$AUNMP= <proc_1d>
##$AZFE= 0.1
##$AZFW= 0.1
##$BCFW= 0
##$BC_mod= 0
##$BYTORDP= 0
##$COROFFS= 0
##$CY= 12.5
##$DATMOD= 1
##$DC= 0
##$DFILT= <>
##$DTYPP= 0
##$F1P= 14.0000005364418
##$F2P= -0.99999901652339
##$FCOR= 0.5
##$FTSIZE= 32768
##$FT_mod= 6
##$GAMMA= 0
##$GB= 0
##$INTBC= 1
##$INTSCL= 1
##$ISEN= 128
##$LB= 0.3
##$LEV0= 0
##$LPBIN= 0
##$MAXI= 10000
##$MC2= 0
##$MEAN= 0
##$ME_mod= 0
##$MI= 0
##$NCOEF= 0
##$NC_proc= -4
##$NLEV= 6
##$NOISF1= 0
##$NOISF2= 0
##$NSP= 0
##$NTH_PI= 0
##$NZP= 0
##$OFFSET= 16.522
##$PC= 1
##$PHC0= 217.2473
##$PHC1= 11.03549
##$PH_mod= 1
##$PKNL= yes
##$PPARMOD= 0
##$PSCAL= 4
##$PSIGN= 0
##$REVERSE= no
##$SF= 250.13
##$SI= 32768
##$SIGF1= 0
##$SIGF2= 0
##$SINO= 400
##$SIOLD= 32768
##$SREGLST= <1H.DMSO>
##$SSB= 0
##$STSI= 32768
##$STSR= 0
##$SW_p= 5175.98343685301
##$SYMM= 0
##$S_DEV= 0
##$TDeff= 65536
##$TDoff= 0
##$TI= <Analysis number 999999
Compound Code 99
Book Reference 9
Project Code 9>
##$TILT= no
##$TM1= 0
##$TM2= 0
##$TOPLEV= 0
##$USERP1= <user>
##$USERP2= <user>
##$USERP3= <user>
##$USERP4= <user>
##$USERP5= <user>
##$WDW= 1
##$XDIM= 32768
##$YMAX_p= 344646693
##$YMIN_p= -225659
$$ End of Bruker specific parameters
$$ ---------------------------------
##NTUPLES= NMR SPECTRUM
##VAR_NAME=  FREQUENCY,     SPECTRUM/REAL,   SPECTRUM/IMAG
##SYMBOL=    X,             R,               I
##VAR_TYPE=  INDEPENDENT,   DEPENDENT,       DEPENDENT
##VAR_FORM=  AFFN,          ASDF,            ASDF
##VAR_DIM=   32768,         32768,           32768
##UNITS=     HZ,            ARBITRARY UNITS, ARBITRARY UNITS
##FACTOR=    0.157963299565203, 1,           1
##FIRST=     4132.6476996994, 0,             0
##LAST=      -1043.33573715361, 0,           0
##MIN=       -1043.33573715361, -225659,     0
##MAX=       4132.6476996994, 344646693,     0
$$ Real data points
##PAGE= N=1
##DATA TABLE= (X++(R..R)), XYDATA
$$ [...]
16065i4266k4367p585j7681k7916j3098l6136Q9681J01562K9432L8393J6734n0780
16053C973p0484j9579O380q344j708j9698j6126Q066J5620K3742K8371P1388J2959
16040C4560m3953q3960K2466N5299M0816L0803o9655r0187n0693L8676O3605k6494
16028g8717J4499j4141K7248L23o2794l4652N6888M7683N2077K0578n7314r1377
16016a19699l1856L5966K7671L2064L6009P4434M2948L6413m1807o2347L0623
16005F0419K4943l6124o7425J3293L2731m1989j7801O4535k7081l3734n300M6880
15993A3347K683o0917m3954j8920J9278L0853k5469m107K9287j564r556Q575J8090
15980d2374N2725l0305L393j6385J0751p781l4981l056J0835j3056m2785j2879
$$ plain form
16065 -94266 -118633 -126218 -143899 -171815 -184913 -221049 -131368 -29806 -374 38019 54753 3973
16053 3973 -66511 -86090 -79710 -88054 -89762 -109460 -125586 -117520 -101900 -78158 -49787 21601 34560
16040 34560 -9393 -93353 -70887 -15588 25228 56031 -13624 -103811 -154504 -115828 -52223 -78717
16028 -78717 -64218 -78359 -51111 -50788 -113582 -148234 -91346 -43663 8414 28992 -28322 -119699
16016 -119699 -151555 -115589 -87918 -55854 -19845 54589 97537 133950 92143 29796 60419
16005 60419 85362 49238 -18187 -4894 27837 -14152 -31953 32582 5501 -28233 -33533 13347
15993 13347 16030 -44887 -88841 -107761 -88483 -57630 -83099 -87206 -57919 -59483 -69039 -60464 -42374
15980 -42374 10351 -19954 -16561 -32946 -22195 -29976 -64957 -68013 -57178 -70234 -113019 -125898
15968a25898O9739J0869l4408l2995K4601L7706j6760L6164Q230m2668R536j7711
15956g3595J7430J26L9676j5849k7672N8671N2781J6901L2154l9334l3581Q541
15944C6249l8263k9270l1281J5123k059J0320J3413k6278J4839L3562k9766l558
15932c6969j2588m3038j2761o92N176K9206N7140J7515m0865k3773M1273J9417
15920i59m7291J0137Q1745O538m8814l3953L612j3889O049k3539l0949O6955n8798
15907h3156K1525J15770N1337Q611q8349n5128o0561r257O2566k4055j105j1667
15895g3469K2268O782L9603K447J6037K8626Q192l8546q9070j46k9790Q1757N077
15882b0232m1324j2956J1856K4679m1834K5434j737j5184K492l2578k5136O498
$$ plain form
15968 -125898 -56159 -45290 -79698 -112693 -88092 -50386 -67146 -30982 -22752 -65420 -55884 -73595
15956 -73595 -56165 -56039 -16363 -32212 -59884 -1213 51568 68469 100623 61289 27708 36249
15944 36249 -2014 -31284 -62565 -47442 -49501 -39181 -25768 -52046 -37207 -3645 -33411 -36969
15932 -36969 -49557 -92595 -105356 -106048 -100872 -71666 -14526 2989 -37876 -61649 -20376 -959
15920 -959 -48250 -38113 43632 50170 1356 -32597 -28985 -42874 -36825 -60364 -91313 -24358 -83156
15907 -83156 -61631 54139 105476 114087 25738 -29390 -89951 -99208 -36642 -60697 -61802 -73469
15895 -73469 -51201 -44419 -4816 -2369 13668 42294 50486 11940 -77130 -77276 -107066 -25309 -20232
15882 -20232 -61556 -74512 -62656 -37977 -79811 -54377 -56114 -71298 -68806 -101384 -126520 -120022
15870a20022k4282K5667J6434j5919k3506R138O1042N1016r950k821j2276L8694
15858f785m352l5012p1348J1533K5599M5230M7233j188J4594p932p083k61R563
15845A9791j7903j2451P436o6446l1227J0361k2996r376p437k596L4027N7790
15833d1027k96l3168j4612J5680k7346O218j0436K1972r650N4087N9001p215k6680
15820a3472n2561J3666l864k012j1462N8015O226L4760J8164r807j9526q1981
15808f3854l1054M987m9365j1003L0916L6785l1458l6559L0117O6453K2883R34
15796c0218j3440l1626j63p615k2667j8514k2649N9944O7250K3260P657j1151
15784F8m9369M500J9739l6576J6504L0043j6706m3605r153q652J734N4966j8864
$$ plain form
15870 -120022 -144304 -118637 -102203 -118122 -141628 -132490 -71448 -20432 -30382 -33203 -45479 -6785
15858 -6785 -11137 -46149 -117497 -105964 -80365 -35135 12098 10910 25504 17572 10489 10228 19791
15845 19791 1888 -10563 -3127 -69573 -100800 -90439 -113435 -122811 -130248 -132844 -98817 -41027
15833 -41027 -41323 -74491 -89103 -73423 -100769 -94551 -104987 -83015 -92665 -38578 20423 13208 -13472
15820 -13472 -66033 -52367 -56231 -58243 -69705 -11690 -5464 29296 47460 37653 18127 -63854
15808 -63854 -94908 -89921 -139286 -150289 -119373 -82588 -114046 -150605 -120488 -54035 -31152 -30218
15796 -30218 -43658 -75284 -75447 -83062 -105729 -124243 -146892 -86948 -19698 3562 11219 68
15784 68 -49301 -44801 -25062 -61638 -45134 -15091 -31797 -75402 -84555 -93207 -91473 -36507 -55371
15771e5371J1700J8847n032q06j2486R279p462o8343O418l0299K9715N3600j3414
15758f3654q749k8600p353M0618L3587J4627O0079O4154J1523N7266O9559r6754
15746A46303r9650p1390n5900k9561m741P7048J3083m2273k2828L810O3134L0530
15734G565K3454K6954R912m7846m9016p8988l9190J9947K8976L6799m2002j570
15722a05005j2881K6669L2101P79l1725M6904K7330o7856r403J4788M35o668k6565
15709a11097j9553P6509O1918n315l5506j9101o887j9093m5231K9704L5343m18
15697e8727j521P869N2663j0313k2842m0767K1893O1348j3230k723m5403j726
15685e3479L9558J6761m8809L8034R0528n3405n88l2599r716m4557n8154m8851
$$ plain form
15771 -55371 -43671 -24824 -29856 -30662 -43148 -33869 -41331 -109674 -103256 -133555 -103840 -50240 -63654
15758 -63654 -72403 -101003 -108356 -67738 -34151 -19524 40555 104709 116232 173498 243057 146303
15746 146303 46653 -24737 -80637 -110198 -114939 -37891 -24808 -67081 -89909 -86099 -22965 7565
15734 7565 31019 57973 67885 20039 -28977 -107965 -147155 -127208 -98232 -61433 -103435 -105005
15722 -105005 -117886 -91217 -59116 -58337 -90062 -43158 -15828 -83684 -93087 -78299 -77864 -84532 -111097
15709 -111097 -130650 -54141 7777 2462 -33044 -52145 -59032 -78125 -123356 -93652 -58309 -58727
15697 -58727 -60248 -52379 284 -10029 -32871 -73638 -51745 9603 -3627 -6350 -51753 -53479
15685 -53479 -13921 2840 -45969 -7935 82593 29188 28600 -3999 -13715 -58272 -116426 -165277
15673a65277J0603J3757J6505K6809M7420r46J8620p3819K3980L1405L847N7164
15661A0068p6q674j9638k0298m3559k2379j5166L4017n7803J100K4563M4313Q760
15648f4772M7803j9362K9850M8149j1689Q494K8670o1774n228J1476L1113J687
15636D4417K7975J5605J6573o602L680l5147q4849n8879q2055K2565m2426J0776
15624a68367J1657M5146N9774K7203L7529L4452M956Q923J778q849Kn7113l0576
15611c3485m4210k6738J9296M0306p165j1208K4553k4690o4753K5199K0608r759
15599i2046k8020l1999M950J0877k7769M9798J2767J772P6014j4585r8608j2173
15587a49022M7628J7419m3936K6158M2602J5765K1873J8243M6410K1872J8822
$$ plain form
15673 -165277 -154674 -140917 -124412 -97603 -50183 -51129 -32509 -106328 -82348 -50943 -47096 10068
15661 10068 9992 1318 -18320 -38618 -82177 -104556 -119722 -85705 -143508 -142408 -117845 -73532 -64772
15648 -64772 -16969 -36331 -6481 41668 29979 38473 67143 5369 141 11617 42730 44417
15636 44417 72392 87997 104570 97968 101648 66501 -18348 -77227 -159282 -136717 -179143 -168367
15624 -168367 -156710 -111564 -51790 -24587 12942 47394 52350 61273 63051 54202 54204 -2909 -33485
15611 -33485 -77695 -104433 -85137 -44831 -51996 -63204 -38651 -63341 -128094 -102895 -82287 -92046
15599 -92046 -120066 -152065 -147115 -136238 -164007 -114209 -101442 -99670 -23656 -38241 -136849 -149022
15587 -149022 -101394 -83975 -127911 -101753 -59151 -43386 -21513 -3270 43140 65012 83834
15576H3834p7222r825J5169m0433L4756M1030K3009J6976o926k2258L5772p86
15564I3096j9982o7615j8783N0655l5567r6461J885J9832m3802R390R5673P1366
15552E9687L4968l4923k8464J576J1127K587m0078n4369n5373J4932M1670Q9269
15540D2609q706J4820m4035j04485r452M0620P5742j208n2613L7542l3479j694
15528d4339l7125R183oJ4868J9272J4828l7612K0237J17543M7683m8505m4892
15516C1135k5878k021j4428k0118l0753q2742J9727L5536K9480L918L9239K5646
15504H741K9331j0253k4860q631J6524L0078o7441j5543j6060j3970J2928L3530
15492b5626L1485M268k8302R1o613p6653m819K3924M8834K9990r543N3833L4038
$$ plain form
15576 83834 6612 -3213 11956 -28477 6279 47309 70318 87294 80368 58110 93882 93096
15564 93096 73114 5499 -13284 37371 1804 -94657 -92772 -72940 -116742 -107352 -11679 59687
15552 59687 94655 59732 31268 32844 43971 46558 6480 -47889 -103262 -88330 -46660 42609
15540 42609 33903 48723 4688 -99797 -109249 -68629 7113 5905 -46708 -9166 -42645 -44339
15528 -44339 -81464 -72281 -72287 -57419 -38147 -23319 -60931 -40694 76849 124532 76027 31135
15516 31135 5257 3236 -11192 -31310 -62063 -144805 -125078 -89542 -60062 -56144 -16905 8741
15504 8741 38072 27819 2959 -5672 10852 40930 -26511 -42054 -58114 -72084 -59156 -25626
15492 -25626 5859 10127 -18175 -18084 -24697 -101350 -106169 -82245 -33411 -3421 -12964 40869 74907
15479G4907N041l0848j2761l5389q5379j3464Q76M2420P8632K0564m9557j07836
15467a12794l4952J2982L8956L0486j1008K8062M3374K9200O447o0175K5993J0821
15455G392K6235K6615m5143l2524K2719M2991m756p6294k9392j4333K9892r948
15443e6546k7158m7941O4494P7419N4987m4218r8795m3546L4538N1118R9441N7678
15431A21471k3934m1523o5448l3432o6516j865P5915M0159k710m0833l698K9012
15419a3402n4365k9614L5398M8018k4308p1349N0958M9814m172J9291m2858k0142
15407e6731J0978N4691p6320n1592L4542L5803j0070k6674l206m1134J7150Q090
15395a04473M8670Q3915j590L6892k1054m7865p6425k0799N3629m1341j4012J4828
$$ plain form
15479 74907 79948 49100 36339 950 -84429 -97893 -97017 -54597 24035 44599 -4958 -112794
15467 -112794 -147746 -134764 -95808 -65322 -76330 -48268 -4894 24306 30753 -29422 -3429 7392
15455 7392 33627 60242 15099 -17425 5294 48285 43529 -32765 -62157 -76490 -46598 -56546
15443 -56546 -83704 -131645 -67151 10268 65255 21037 -77758 -121304 -86766 -35648 63793 121471
15431 121471 97537 56014 -9434 -42866 -109382 -111247 -35332 4827 2117 -38716 -42414 -13402
15419 -13402 -67767 -97381 -61983 -13965 -38273 -109622 -58664 -8850 -13022 6269 -36589 -56731
15407 -56731 -45753 8938 -67382 -118974 -84432 -48629 -58699 -85373 -88579 -129713 -112563 -104473
15395 -104473 -55803 28112 26522 63414 42360 -5505 -81930 -102729 -49100 -90441 -104453 -89625
15383h9625L6217N1949m6469p8289k4630o846K5382N688L2355K6254P834l0226
15371i0406P234K8187K3263l634m5035r1644N5308M324J7582N6298k6121o4014
15359a28658J1863N5853k0643J0839K6481J1054l7292L9419L3349q695L3578o252
15347B0896p3255R536N7555M4739J0673o1582o0245m6672O198l6656K9818O8160
15335c0835O320j1j964K7566L0245n1392r5980o2466k1348N4014R7860L2203n1087
15322f6875O436O2033j8293j3669J4304n9844k9040J9265Q5218M2004m9464m6327
15310e4252K0156K8746p0113l5870J8030k3168M1249R319j0820j9938R865K7930
15298e8866k3607R959N8207M9116l8403j4257L0971r726k650K094k9902m7800
$$ plain form
15383 -89625 -53408 -1459 -47928 -126217 -150847 -157693 -132311 -126623 -94268 -68014 -60180 -90406
15371 -90406 -83172 -54985 -31722 -35356 -80391 -172035 -116727 -112403 -94821 -38523 -64644 -128658
15359 -128658 -116795 -60942 -81585 -70746 -44265 -33211 -70503 -31084 2265 -6430 27148 20896
15347 20896 -52359 -42823 14732 59471 70144 8562 -51683 -98355 -92157 -128813 -98995 -30835
15335 -30835 -24515 -24526 -26490 1076 31321 -20071 -116051 -178517 -199865 -145851 -47991 -15788 -66875
15322 -66875 -60439 1594 -16699 -30368 -16064 -75908 -104948 -85683 -465 41539 -7925 -54252
15310 -54252 -34096 -5350 -75463 -111333 -93303 -116471 -75222 -65903 -76723 -96661 -86796 -58866
15298 -58866 -82473 -72514 -14307 34809 -3594 -17851 13120 3394 744 2838 -27064 -74864
15286g4864l3967n076k4251o6844J8098L8330Q3079K8276j526l25l593M1608l341
15273d396k5220J8511j5119m2220r182k7575J8978J9149Q018l254M303j0911j2283
15260h1201K3642J1881K3934r573p7301k1918M4000L9857J4402l584j9798K1767
15248c3892J7366m3580k2432K9358J6093N9010j8430l5676p438K4316J0246j0169
15236a5228j5930j3546p688J1453M4910l9492J1514j5960K1233l955j2538J7173
15224a8054O940m3161l3287j369N5883M6069N193k3500j0880J9768K9872j3690
15212A9784M092p643M5069q440k0763O6835R810j50310m2728K4872N3414q692
15200a4700J800q475l9686J0647J0205L2494n4516k4600J4667j0740M9746o0315
$$ plain form
15286 -74864 -108831 -113907 -138158 -205002 -186904 -148574 -65495 -37219 -38745 -39070 -42663 -1055 -4396
15273 -4396 -29616 -11105 -26224 -68444 -77626 -105201 -86223 -67074 -59056 -62310 -58007 -68918 -81201
15260 -81201 -57559 -45678 -21744 -31317 -108618 -130536 -86536 -46679 -32277 -35861 -55659 -33892
15248 -33892 -16526 -60106 -82538 -53180 -37087 21923 3493 -32183 -39621 -15305 -5059 -15228
15236 -15228 -31158 -44704 -52392 -40939 3971 -35521 -24007 -39967 -18734 -22689 -35227 -18054
15224 -18054 -11114 -54275 -87562 -88931 -33048 13021 18214 -5286 -16166 3602 33474 19784
15212 19784 23876 16233 61302 52862 32099 98934 108744 -41566 -84294 -59422 -6008 -14700
15200 -14700 -12900 -21375 -61061 -50414 -40209 -7715 -62231 -86831 -72164 -82904 -33158 -93473
15188i3473m6338K9293j1371k0150K573l3737N9874M7956k5702J6002K3437P9452
15176B7816r562n4538j9013M6351k1592m1057N965K7900l3671k2781J8944K9291
15164d5947K1399N0862P560j1720k3392p0729l2396O1512j4193q0330k8059L0893
15152a34540J08226Q7613J6150K3846o9267n5625L35k0974N2832J7174m1964k0146
15140c6340j9861m4201k7518P1021L9485k8713l9378k6668J2040M2436L8465k0900
15128d0132r301L4182L8186m0369O610q569j3749k6843p8716r385K9634J8102
15116a00350Q2918R697k8626o569O2666L6583j6524o0266k532N0989L6827m9761
15104A5052n7826k097k1380M3584m390J9310L382J2893m9475K7960K8099p919
$$ plain form
15188 -93473 -139811 -110518 -121889 -142039 -139466 -173203 -113329 -65373 -91075 -75073 -51636 27816
15176 27816 18254 -36284 -55297 -8946 -30538 -71595 -65630 -37730 -71401 -94182 -75238 -45947
15164 -45947 -24548 26314 33874 22154 -1238 -71967 -104363 -42851 -57044 -137374 -165433 -134540
15152 -134540 -26314 61299 77449 101295 32028 -23597 -23262 -44236 8596 25770 -16194 -36340
15140 -36340 -56201 -100402 -127920 -56899 -17414 -46127 -85505 -112173 -100133 -57697 -19232 -40132
15128 -40132 -49433 -15251 22935 -17434 -10824 -19393 -33142 -59985 -138701 -148086 -118452 -100350
15116 -100350 -17432 -7735 -36361 -42930 19736 56319 39795 -20471 -23003 27986 64813 15052
15104 15052 -42774 -44871 -66251 -22667 -27057 -7747 -4365 8528 -40947 -12987 15112 7193
15092G193k0693n1227j5409O2518R6846m4446r3312n2158r4304J7363J20651P7154
15080A0176J3372L4232m5564r711o5945o0681L480j0569j8671Q2591J5236l3291
15068h5345j0147o375L5124L7400J6002m6200p999K4471J4123j277J1090L074
15056a6059k1280l6048L07j2589l5880k9958N2769L5021l6475n736P6874O6764
15044C7710l8296j0636L0199M3162K833m9989k5605l1956j1807N0353J658k3773
15032b6147r264j1845L5835m63j2782l8766P642K48m1715J4066k9487j6575K6750
15019a02503L7113L2456J9593J4039J2165J6932n5114m0106L1058K5926j3486
15008b1927M9677L4490J7127l7474o7243m6435J6410J9490r449K3331n1407j0669
$$ plain form
15092 7193 -13500 -64727 -80136 -17618 79228 34782 -58530 -110688 -204992 -187629 -66978 10176
15080 10176 23548 57780 12216 2505 -63440 -124121 -120641 -131210 -149881 -67290 -52054 -85345
15068 -85345 -95492 -101867 -66743 -29343 -13341 -59541 -67540 -43069 -28946 -30223 -19133 -16059
15056 -16059 -37339 -73387 -73080 -85669 -121549 -151507 -98738 -63717 -100192 -105928 -29054 37710
15044 37710 -586 -11222 18977 62139 64972 14983 -10622 -42578 -54385 -4032 -2374 -26147
15032 -26147 -35411 -47256 -11421 -11884 -24666 -63432 -55790 -55542 -97257 -83191 -112678 -129253 -102503
15019 -102503 -65390 -32934 -13341 698 12863 29795 -25319 -65425 -34367 -8441 -21927
15008 -21927 27750 62240 79367 41893 -25350 -71785 -55375 -35885 -45334 -22003 -73410 -84079
14996h4079J09897L1524k5345o6976J7341M7o7617j8810N73J974K5311k9797m0093
14983a46050J8681n215k594N9925N9538j3275o1300q3672k3285L6220J0430m234
14971a54831l8093j9657M0256o982L483K6942M9430P270O3465J4290N4372j6669
14959B3276o7703n7090m566J7841J9330M3644j23l834m9263k4710N0336L0842
14947b2020j5915k6217j1082n1911j0770N0905K1177O7014o3246l2123O9178j3408
14935c8418L0987j1529q464L8190k264m8156m7352j1006j0758M234l2736k070
14923a39342J4512k9307j4815J8918J02608L4565L387j1717l2799L7255K8147
14912A1412j7596L4251p4285j3646J6387l8795r864K9229M0814M8524j4897n3359
$$ plain form
14996 -84079 25818 57342 31997 -34979 -17638 -17591 -85208 -104018 -103445 -101471 -76160 -105957 -146050
14983 -146050 -127369 -132584 -135178 -75253 -15715 -28990 -90290 -173962 -197247 -161027 -150597 -154831
14971 -154831 -192924 -212581 -172325 -179307 -175824 -148882 -99452 -92182 -28717 -14427 39945 23276
14959 23276 -44427 -101517 -106083 -88242 -68912 -25268 -25391 -29225 -78488 -103198 -52862 -22020
14947 -22020 -37935 -64152 -75234 -127145 -137915 -87010 -65833 1181 -62065 -94188 -25010 -38418
14935 -38418 -7431 -18960 -27424 10766 8502 -39654 -87006 -98012 -108770 -104536 -137272 -139342
14923 -139342 -124830 -154137 -168952 -150034 -47426 -12861 -9474 -21191 -53990 -16735 11412
14912 11412 -6184 28067 -46218 -59864 -43477 -82272 -92136 -62907 -22093 26431 11534 -41825
14900d1825o1373l2146J8490K4318O5382K7517K8953l4433n1580o3296l0648N4069
14888i6572L1675M1669j5513o5926q4494L3691K5419N6380L90q269L2834M7447
14876a269O6597J5843k3369n0786m0341k3874J0407k1005j086j4442J2616k4631
14864i5340j1167K2985j5056m0850J0060N3588L4128m3880m0923J7470L2449M899
14852g1637o8398k8159J6713j3344j9830M6436N5288P6152O774q4309K957P6984
14840d373j5642J1648L5368l7843q793J8490L185Q415j9098O337J2978n839K0948
14827B5781m420n176M552j5266o4757j5182J8172N2600K2880O059j9651j912o0426
14814e6746n7154M2645r929M5446O5437k8452m8175n4727k6776N1519Q625j4450
$$ plain form
14900 -41825 -103198 -135344 -116854 -92536 -27154 363 29316 -5117 -56697 -119993 -150641 -96572
14888 -96572 -64897 -23228 -38741 -104667 -189161 -155470 -130051 -73671 -73281 -81550 -48716 -1269
14876 -1269 65328 81171 57802 7016 -33325 -57199 -46792 -67797 -68883 -83325 -70709 -95340
14864 -95340 -106507 -83522 -98578 -139428 -129368 -75780 -41652 -85532 -126455 -108985 -76536 -71637
14852 -71637 -140035 -168194 -151481 -164825 -184655 -138219 -82931 -6779 -5 -84314 -81357 -4373
14840 -4373 -20015 -8367 27001 -10842 -19635 -1145 2040 10455 -8643 -2306 10672 4833 25781
14827 25781 21361 16185 20737 5471 -59286 -74468 -56296 -3696 19184 25243 5592 3680 -56746
14814 -56746 -113900 -71255 -81184 -35738 29699 1247 -46928 -101655 -128431 -76912 -68287 -82737
14802h2737P5076m5556o4731M7950M9846k3545k3141m9284q553N0305k9414k3747
14790a27531l614M2381O0068M4257J6983j5669l3172O0656P8637m2743o5885j6143
14778a775J8384r634J6655N7157j9108n8909J3008o8541m4810J9790O8222J6579
14766G018j1817p1473N723J3154J9484P489j9978K0233L6636J9575j4741p773
14754C530O7663M753r6587j8152k5201k5706m9516j3687L318j176L0015O6109
14742e4637J2426l4474R99P630k2456J2028P8387J6308q035j7288o2600N7732
14730a3980O5203M265K4211J5110l9195k0566o897J1401m5763m169p0694J5829
14718f5245M2269k8755L9564j9961n3403L3656K6606n7231K859j8691K2267j4788
$$ plain form
14802 -82737 -7661 -53217 -117948 -69998 -20152 -43697 -66838 -116122 -124675 -74370 -103784 -127531
14790 -127531 -131145 -88764 -28696 15561 32544 16875 -16297 44359 122996 80253 14368 -1775
14778 -1775 16609 6975 23630 80787 61679 2770 15778 -52763 -97573 -77783 -9561 7018
14766 7018 -4799 -76272 -70549 -57395 -37911 -30422 -50400 -30167 6469 26044 11303 3530
14754 3530 71193 75946 -20641 -38793 -63994 -89700 -139216 -152903 -149585 -150761 -120746 -54637
14742 -54637 -42211 -76685 -75686 -68056 -90512 -78484 -97 16211 8176 -9112 -71712 -13980
14730 -13980 51223 55488 79699 94809 55614 35048 28151 39552 -6211 -10380 -81074 -65245
14718 -65245 -22976 -51731 -12167 -32128 -85531 -51875 -25269 -82500 -79641 -98332 -76065 -90853
14706i0853K9346N6259J5374o1034N9151L6789K678k9978L104K7347j5034J5233
14694D8382m3960J1391K908n9404K6208L465K4593M6856J332N4592n5195p3077
14682a1909J8153K1956Q581K1600j9837K6964J4869l3242r9580M290M8235N1861
14670E1941M0271k5135j7989p3165l4176j1960q975M473l3123J1855M4828O6310
14658A5155n40o372n9938k3240j7673l4202M0657L2794n994J9924L0057M9370
14646C9998J7056m571n5247R732m516J2789m1499o517M0355K4152l440k4382k6909
14633b2999K9662K7916J3657l7308k9018M0058K2415k7244L8886j381m0455J052
14621A5241M3056P60J2130j6566j5966o2178n6657L485R945J4081j944J4401N043
$$ plain form
14706 -90853 -61507 -5248 10126 -50908 8243 45032 47710 17732 20836 48183 33149 48382
14694 48382 4422 15813 18721 -40683 -14475 -11010 13583 60439 61771 116363 61168 -11909
14682 -11909 6244 28200 36781 58381 38544 65508 80377 47135 -52445 -48155 80 51941
14670 51941 92212 67077 49088 -24077 -58253 -70213 -79188 -74715 -107838 -95983 -51155 15155
14658 15155 14615 8243 -51695 -74935 -92608 -126810 -86153 -53359 -59353 -39429 -9372 39998
14646 39998 57054 52483 -2764 6968 2452 15241 -26258 -32775 7580 31732 28292 3910 -22999
14633 -22999 6663 34579 48236 10928 -18090 21968 44383 17139 56025 54644 14189 15241
14621 15241 58297 59057 71187 54621 38655 -23523 -80180 -76695 -66750 -52669 -54613 -40212 -35169
14608c5169k0021k9305K9555L3104o0352R9517O3951l4623k1685m7848k0620k8983
14596g2479L6539n724K7977o305M7934k5351L4517J2058K508n0984q8889K3921
14584f4278l848J373k86l8187m7669J4429M1161o054L4387J5319J2293Q292L0844
14571b224l0565J6894M4301j4174K592j7396k9058m9138l8568K3810K3775L731
14559f6020j5011n9792l1316Q3947O5645j3814L6648k4880o163j0897N5564N5335
14547F9246k0968P7715O7265r5523p3345n2443m5585j3031K6787O7926K4136j5424
14535A6756n047J528k8597k9655p0591P34L9411K3542P7699N6801j530j6122p7930
14522a3001P21K2159k6174n4168m0814K6023j8059m3240l3433K0047N3261N1271
$$ plain form
14608 -35169 -55190 -84495 -54940 -21836 -82188 17329 81280 46657 24972 -22876 -43496 -72479
14596 -72479 -35940 -41664 -13687 -19992 27942 2591 37108 49166 51674 690 -88199 -64278
14584 -64278 -68126 -66753 -67039 -105226 -152895 -138466 -97305 -103359 -68972 -53653 -41360 -33068 -2224
14571 -2224 -32789 -15895 28406 14232 16824 -572 -29630 -78768 -117336 -93526 -69751 -66020
14559 -66020 -81031 -140823 -172139 -88192 -22547 -36361 287 -24593 -30756 -41653 13911 69246
14547 69246 48278 125993 193258 97735 24390 -28053 -73638 -86669 -59882 8044 32180 16756
14535 16756 11709 13237 -15360 -45015 -115606 -114872 -75461 -51919 25780 82581 81051 64929 -13001
14522 -13001 -12280 9879 -16295 -70463 -111277 -85254 -103313 -146553 -179986 -159939 -106678 -55407
14510e5407M8118k6656l9859K3205K7000k054l7085m5258N7585K8992p311K3303
14498e427J0568j9099m0787q4354J9415L6146N2959M7217J0433m6216k7791l6758
14486h3694k0298M4912J7765k1839L1168L5310J5114K1415j5790k5292K9461k9788
14474a556L8054l0584q1716o322J01043R911j9038N2332l1658o046j8131L3718
14462D0007Q366K7412k893k6499o397l3510J8041K0065n4231j298k5101L1949
14450d089l9457O868j1967J7191K6308K2488r398l2971J046m6123O066k8494p028
14437i9560J8943N8997Q410o893m8982n150J5747K056M762j4099k7086o649J00107
14424F03M4324N2285k5375r7825n5486K5298l4060J539K5960o695Q280P2330l5765
$$ plain form
14510 -55407 -7289 -33945 -73804 -50599 -23599 -25653 -62738 -107996 -50411 -21419 -28730 -5427
14498 -5427 5141 -13958 -54745 -139099 -119684 -83538 -30579 16638 27071 -19145 -46936 -83694
14486 -83694 -103992 -59080 -41315 -63154 -31986 3324 18438 39853 24063 -1229 28232 -1556
14474 -1556 36498 5914 -75802 -82124 18919 28830 9792 62124 30466 24420 6289 40007
14462 40007 48373 75785 72892 46393 39996 6486 24527 44592 -9639 -10937 -36038 -4089
14450 -4089 -43546 -36678 -48645 -31454 -5146 17342 7944 -25027 -23981 -70104 -64038 -92532 -99560
14437 -99560 -80617 -21620 -13210 -20103 -69085 -74235 -58488 -56432 -51670 -65769 -92855 -99504 603
14424 603 44927 97212 71837 -25988 -81474 -56176 -90236 -88697 -62737 -69432 -61152 11178 -24587
14411b4587m068N2540K175o0777l55j4993L0848N3389P181k8747l3689r556l1106
14398f1745k2714l912m046P376M8306J0246l2529J3341N0135j9840m2694l0540
14386h8616Q4638N083j7610p3148m0451K0744K0908k1490M4546J5585k468k3812
14374g6091m3566l1829K0961K2291j3375j802N3450K4789M3516N3541n9638n3773
14362f1526M6556L221r470K163k6482n9620j743N3646Q1022j3589k0890K9316
14350B2604k5858N4455Q902r3779k7120M0892P0676j0856k2405K2146k7902K2005
14338C3760K1444j07686k8472M6478K5760K5891K5366N293n2047q302L4117J0852
14326C2454J5080l3098l5127j3316l2828J8245N9508j9215j6510J0717K59N3863
$$ plain form
14411 -24587 -28655 23885 26060 -34717 -35072 -50065 -19217 34172 41353 12606 -21083 -30639 -61745
14398 -61745 -84459 -88371 -92417 -85041 -36735 -26489 -59018 -45677 4458 -15382 -58076 -88616
14386 -88616 -3978 1105 -16505 -89653 -130104 -109360 -88452 -109942 -65396 -49811 -52279 -76091
14374 -76091 -119657 -151486 -130525 -108234 -121609 -123411 -69961 -45172 -1656 51885 -7753 -61526
14362 -61526 -14970 -11749 -21219 -19056 -45538 -105158 -106901 -53255 27767 14178 -6712 22604
14350 22604 -3254 51201 60103 -33676 -60796 -19904 50772 39916 17511 39657 11755 33760
14338 33760 55204 -52482 -80954 -34476 -8716 17175 42541 47834 -4213 -12515 21602 32454
14326 32454 47534 14436 -20691 -34007 -66835 -48590 10918 -8297 -24807 -14090 -13831 40032
14314D0032n4932m0065j9760K0376L7635M9002N384l4368m0793l0435n3992L3727
14302h8189N3149R403K4154J1203k5329K1424j3281l6479M9819k2934l4625J0880
14290d0805N3221R035j0267J4648m0937j2118O327o8314q2674L3740O4845J4522
14278e8777O1568Q102o8644j7249L1791K8378o669K5729K5805L1769M375J0594
14266G6772m6661m9165l0831k451K5461K8125N1882J2001M9048j2886o8115L911
14254C7091N1553L7079k5438q3235m8102K3013r124l0851l1985J9416j4991k1200
14242i6774J4699K0298o8891n6308N346J1954L4576P6527M5281M7979j3164k4858
14230c335k2062Q4327j9637k8940J9631n0718l1628N4112n6693k6920n2971K8283
$$ plain form
14314 40032 -14900 -54965 -74725 -54349 -16714 32288 37672 3304 -37489 -67924 -121916 -88189
14302 -88189 -35040 -25637 -1483 9720 -15609 5815 -7466 -43945 5874 -17060 -51685 -40805
14290 -40805 12416 21451 11184 25832 -15105 -27223 -20896 -89210 -171884 -138144 -73299 -58777
14278 -58777 2791 10893 -57751 -75000 -43209 -14831 -21500 4229 30034 61803 66178 76772
14266 76772 30111 -19054 -49885 -52336 -26875 1250 53132 65133 114181 101295 33180 37091
14254 37091 88644 125723 100285 17050 -31052 -8039 -17163 -48014 -79999 -60583 -75574 -96774
14242 -96774 -82075 -61777 -130668 -186976 -181630 -169676 -135100 -58573 -13292 34687 21523 -3335
14230 -3335 -25397 58930 39293 10353 29984 -20734 -52362 1750 -54943 -81863 -134834 -106551
14218a06551O4369j3940k2658K054j3358L1835l8891L5119L5760K6534N0455l6355
14206A4373J0207j8313o079m5022N3570J8263l8857l7775j0059p374N8464J9503
14194A0901M3514L2370l830J9258l5402l6840L0810P210m104m9202m7705J2606
14182b0414J3868o927O610j9528m2924K6705k1541M3705M7919k5670q617n4263
14170f1077L2270l9313k0080M4434j748k0218j2530J8142K8246L1542J6014n0018
14158c4336o261k0725k0372J4747J3522K3538k7597o4749J3925L1183J2884N662
14146e8579J5618L0185J5795l5451k0689K3798Q1305J9708m6022m2340r664l1678
14134e8014J9064Q6535m743p7772k948L7789L5708j3090n3133n2617l893J2575
$$ plain form
14218 -106551 -42182 -56122 -78780 -76726 -90084 -58249 -97140 -62021 -26261 273 50728 14373
14206 14373 24580 6267 188 -44834 8736 26999 -11858 -49633 -59692 -67066 -8602 10901
14194 10901 54415 86785 82955 102213 66811 29971 60781 67991 63887 14685 -33020 -20414
14182 -20414 -6546 -13473 -6863 -26391 -69315 -42610 -64151 -20446 27473 1803 -6814 -61077
14170 -61077 -28807 -68120 -88200 -43766 -45514 -65732 -78262 -60120 -31874 -332 15682 -34336
14158 -34336 -40597 -61322 -81694 -66947 -53425 -29887 -57484 -122233 -108308 -77125 -64241 -58579
14146 -58579 -42961 -12776 3019 -32432 -53121 -29323 51982 71690 25668 -16672 -26336 -58014
14134 -58014 -38950 47585 42842 -34930 -37878 -89 35619 22529 -30604 -83221 -87114 -74539
14122g4539m124l729m2234M2510N8225k2675m4333n1435k6001n896k8143K7016
14110a75358Q1854L9546J443m097j6036j5635L6182L249o5004O834Q5206J3315
14098h501K3541M6094J7499L665m8273j02378n0975L2463P5876R7737j1672p4376
14086G00m9974m6564l0457M1387L32o517P5359Q4070j9692k8717m7880L0336J9109
14073B1492o7320K5700M6248l0389l2138l7202k5350p791M4832O0200L6481J855
14061C6618J6533J80M0512R1p0729k8260Q024R5287k7281j8230o5246k808K2318
14048G009k4986o356m8844k6878M7544L688J5143P6327J3333q2842n0404O6607
14036a0659Q413Q5659j6327o8714j1347n6410m5849L4676P071j6858m064J00896
$$ plain form
14122 -74539 -78663 -82392 -124626 -82116 -23891 -46566 -90899 -142334 -168335 -174231 -202374 -175358
14110 -175358 -93504 -53958 -52515 -56612 -72648 -88283 -52101 -48852 -113856 -107022 -21816 -8501
14098 -8501 15040 61134 78633 82298 34025 -68353 -119328 -86865 -10989 86748 75076 700
14086 700 -49274 -95838 -126295 -84908 -84576 -91093 -15734 68336 48644 19927 -27953 2383 21492
14073 21492 -45828 -20128 26120 -4269 -36407 -73609 -98959 -106750 -61918 -1718 34763 36618
14061 36618 53151 53331 93843 93934 23205 -5055 2969 98256 70975 52745 -12501 -15309 7009
14048 7009 -17977 -24333 -73177 -100055 -52511 -48823 -33680 42647 55980 -26862 -77266 -10659
14036 -10659 -2246 83413 67086 -1628 -12975 -69385 -115234 -80558 -73487 -90345 -94409 6487
14024F487Q2218m2530p6775m929J5413j3500m2981O5765Q254j8968l2341l976
14012e7863J3860N1855k3460k9091M1M588R028N6783L2246k3701K9320J0714o6091
13999H229q1259J9897K9384L8021M2995k2403k0084M2812o152m4885l8581l5456
13987f7482n23j1984L612J2567j0817L5680K4979L3964J8327K9498j5264k2739
13975B9818j6502M231m9321l7237J3084O7299Q367m4710q1904l450Q2717M1027
13963A3419q2734p2481K2853Q655M3719j5329p4635R9136P1560k5580o3369m5031
13951a19817m0119K1293J4470l2661N3890L1557K0695O0809k104m0272n969L822
13939c4406Q9615N0486r634n7117l0832l779J7474K2837L6132Q535n5814k5472
$$ plain form
14024 6487 88705 46175 -30600 -35529 -20116 -33616 -76597 -10832 -2578 -21546 -53887 -57863
14012 -57863 -44003 7852 -15608 -44699 -44658 -40070 -31042 25741 57987 34286 63606 74320 8229
13999 8229 -73030 -53133 -23749 14272 57267 34864 14780 57592 51440 6555 -32026 -67482
13987 -67482 -68005 -79989 -76377 -63810 -74627 -38947 -13968 19996 38323 67821 52557 29818
13975 29818 13316 17547 -31774 -69011 -55927 11372 19739 -24971 -106875 -110325 -27608 13419
13963 13419 -69315 -141796 -118943 -110288 -66569 -81898 -156533 -57397 14163 -11417 -74786 -119817
13951 -119817 -159936 -138643 -124173 -156834 -102944 -71387 -50692 10117 8013 -32259 -38228 -34406
13939 -34406 55209 105695 96061 38944 8112 4333 21807 44644 80776 89311 33497 8025
13927H025J4091r815m0504j3166K1662P4476J7195j3249J2905j1231m5179l6097
13915b0887L086M2218L9296J0122n8554m9707q001J7973l4316j8185M5210K0015
13903a1730N052J9239n7253L7779L8116n3490Q191L0414m9311k47M412M4307l2920
13890a7441K7024J0818R568n091o4985L9292k6231n8544m6383k0084N77M1562
13878a09918L0495K0757N1615k3450N8149P501o0685o9718j2557O4270L4101l5066
13866d4506J9662N1883M4008N2737M7836r4894m9873m296L327m1495l4264j5376
13854f5251N1340P5509j4066r533O3347k706m8680J6427J5673l5951M4629j2509
13842G8229q383n3239N706K6110n9074n4840L7914L1166j5654N2073j179j2748
$$ plain form
13927 8025 22116 12301 -28203 -41369 -19707 54769 71964 58715 71620 60389 15210 -20887
13915 -20887 -17801 24417 63713 73835 15281 -34426 -42427 -24454 -58770 -76955 -31745 -11730
13903 -11730 -6678 12561 -44692 -6913 31203 -22287 -14096 16318 -32993 -33240 -28828 15479 -17441
13890 -17441 9583 20401 29969 24878 -40107 -815 -27046 -85590 -131973 -152057 -151480 -109918
13878 -109918 -79423 -58666 -7051 -30501 27648 35149 -25536 -95254 -107811 -43541 -9440 -44506
13866 -44506 -24844 27039 71047 123784 171620 76726 26853 22557 25884 -15611 -49875 -65251
13854 -65251 -13911 61598 47532 37999 101346 98640 49960 66387 82060 46109 90738 78229
13842 78229 69846 16607 22313 48423 -10651 -65491 -27577 3589 -12065 40008 38829 26081
13830B6081l9160l7078P560l5668K0313O2537q49L5128J823m046m1460p24M0626
13817C5083j2365p4776l746K9571l292J9459O6576L1436j2450k6742L5852k4308
13805F0298r7439o9733l3190O2398M9890L8648K0157l830K8909j3984q1686O616
13793c2946j5752j1996J7856M7046Q455k0428q000M7153j0416j1485p615P096
13781H968m2648N9409j6849l9697m1363j54N1443L7755K2800L4021j8097L6818
13769I2406j9161l4744J4245m9026j8484O8K0665L2856n3579k6408J0632j167
13757c1697L8184j607j3001r547L096J0716L8811j4266K4K0172l5368j3841M5839
13744C7515n6095O745j7553m9555n6054P758J6102P4968M4033L7903m3771k3502
$$ plain form
13830 26081 -13079 -50157 -42597 -78265 -57952 4585 3736 38864 40687 36641 -4819 -5543 35083
13817 35083 22718 -52058 -55804 -26233 -29525 -10066 56510 87946 75496 48754 84606 60298
13805 60298 -37141 -106874 -140064 -77666 -27776 10872 31029 27199 56108 42124 -39562 -32946
13793 -32946 -48698 -60694 -42838 4208 12663 -7765 -15765 31388 20972 9487 1872 8968
13781 8968 -33680 25729 8880 -30817 -72180 -72334 -20891 16864 39664 73685 55588 92406
13769 92406 73245 38501 52746 3720 -14764 -14696 5969 38825 -14754 -41162 -30530 -31697
13757 -31697 6487 4880 -8121 -17668 -14572 -3856 34955 20689 20713 40885 5517 -8324 37515
13744 37515 -18580 -11835 -29388 -78943 -134997 -127239 -111137 -36169 7864 45767 1996 -21506
13732b1506J2926l8253j77L9608K0840k2779M1846K0368p022m3316K424O0076
13720F5035L053l0265k413l919k8122l7819L6301N2290K2893r2658K796j8943
13708c1771p043K403M2732l1135k8538n8441q857M9187O2080n549m5425q6815
13696a47172k0280O5685Q138K3489O5495K0007M327r241L2979M451j8560j784
13684B7534J1028J5082n6654k3659m969k8405P185N1073M837k1149n752j1865
13672c5714J882J1473K3777K1325n4531m4368L4017J8592l6275k0952J7437L254
13660f0083L618K2358P147O113J3385N330N7379J9779j195k2626n563j6483j9247
13647I912j6360Q598k823o7269K7505K0852J6393j4165J2158q174M3436L6779
$$ plain form
13732 -21506 -8580 -46833 -47010 -7402 13438 -9341 32505 52873 45851 2535 4959 65035
13720 65035 68088 37823 35410 31491 3369 -34450 1851 54141 77034 -15624 -12828 -31771
13708 -31771 -38814 -36411 6321 -24814 -53352 -111793 -120650 -71463 -9383 -14932 -60357 -147172
13696 -147172 -167452 -101767 -93629 -70140 -4645 15362 19689 10448 43427 47878 29318 27534
13684 27534 38562 53644 -3010 -26669 -31638 -60043 -52858 -1785 3052 -18097 -23849 -35714
13672 -35714 -33832 -22359 1418 22743 -31788 -76156 -42139 -23547 -59822 -80774 -63337 -60083
13660 -60083 -56465 -34107 -26960 -20847 -7462 -2132 55247 75026 73831 51205 45642 29159 9912
13647 9912 -6448 2150 -673 -67942 -40437 -19585 -3192 -17357 -5199 -13373 30063 66842
13635F6842L0171M682o0455j35691M1229N5299M1277N5384Q102m3468k5417m2412
13623d457o563L511O450m30l341K1037M1693j310n6985n2232N8989Q1759K484
13610I0605j10199m2325J9920k0143L8774m650k9319o6828P370O3234l4261L054
13598h4768R451L3102N0223l8518n3894m486K6748L8095l33K7348J3757l7443
13586b0718k6509Q043l9009J0721Q8787l73M354O790k7318k4316p177j491M1009
13573A2793M1002l6428k7678L3077Q2150k6734q1310r679N5179L407k6572m6721
13561b7514R169l3686m78J4048l2690L2326M0022O70m2203M004O1674k1710j8515
13548a4883J6050L3082k2892n715N4691q517j740M9n5132n8240k7017m915J1815
$$ plain form
13635 66842 97013 101695 41240 -94451 -53222 2077 43354 98738 106840 63372 37955 -4457
13623 -4457 -11020 -7509 -1059 -1489 -4830 16207 57900 56590 -395 -52627 6362 88121 90605
13610 90605 -19594 -61919 -41999 -62142 -23368 -28018 -57337 -124165 -116795 -53561 -87822 -84768
13598 -84768 -75317 -42215 8008 -30510 -84404 -88890 -62142 -24047 -24380 2968 16725 -20718
13586 -20718 -47227 -39184 -78193 -67472 21315 20942 25296 32086 4768 -19548 -26725 -28216 12793
13573 12793 53795 17367 -10311 22766 104916 78182 -3128 -12807 42372 45779 19207 -27514
13561 -27514 -18345 -52031 -52509 -38461 -71151 -38825 1197 1867 -40336 -36332 25342 3632 -14883
13548 -14883 1167 34249 11357 5642 60333 51816 50076 50125 -5007 -63247 -90264 -95179 -83364
13535h3364J65034J13979O81r8243k5052J665L117N584M6551l1311p4220k4551
13523a30L7969K7587k5850n9849N7735O0424q285l63p3270m8370K967q9083j7680
13510a36198J2965J5211L9424K7045J2180K0381L6408O488N83m3544k7267k4932
13498f1256O3244j4839k6510j3900l9784J1618J3228L0738K3125N7212j6897k9954
13486c975R349J6909j6861K7032O576k122K699L2433o275p3882L6586L7847k7068
13473C9248p2251j0580L737K9819m2287j3728J2090M8414N2092m050J504J5296
13461E9304K2781o1767k6172L4672J7521Q218q2901K3536P9104J5395n8544j1961
13449A9186k0716n725m7901L1002L40K9462L1202N334M0863o3288j5031j6679
$$ plain form
13535 -83364 81670 195649 196330 98087 73035 74700 77817 83401 129952 98641 24421 -130
13523 -130 37839 65426 39576 -20273 37462 97886 89601 89238 15968 -32402 -29435 -118518 -136198
13510 -136198 -123233 -108022 -68598 -41553 -29373 -8992 27416 33904 34487 -9057 -36324 -61256
13498 -61256 1988 -12851 -39361 -53261 -93045 -81427 -68199 -37461 -14336 42876 25979 -3975
13486 -3975 5374 22283 5422 32454 39030 36908 39607 72040 65765 -8117 28469 66316 39248
13473 39248 -33003 -43583 -39846 -10027 -52314 -66042 -53952 -5538 46554 42504 44008 59304
13461 59304 82085 20318 -5854 28818 46339 54557 -28344 -4808 74296 89691 31147 19186
13449 19186 -1530 -7255 -55156 -24154 -23814 5648 36850 42184 83047 19759 4728 -11951
13437a1951p727J4948k0045m322K7553k9668k9502p488O4635L4540j7284p603
13425F086m5282k8063N4986j0J5800m6604J5702L8228K7390O421l2048k9053K1257
13412D810L0751J4801m0136n8856M731j4986Q548K0271J5669M7178m3033M0472
13400C0220N0460l4321o5109L6169N6615k6368K9393q936m3657l0718M8568M8956
13388I1272n2322p2480l2000l8193L6326J5174k4060J08414P9998o482l8471l9274
13376B7902j0231M868J7263n016O1118l994j55J9587J0694k1102n8305n6723k2992
13363c7086O9985J7097r9519j2518R033O598p266K8002n438R817P7467M9075J5548
13350A20795l7583l112L7945o7514o1329k1052J7604j8325O548J9352L3995j9450
$$ plain form
13437 -11951 -19678 -4730 -24775 -29097 -1544 -31212 -60714 -68202 -3567 30973 13689 6086
13425 6086 -39196 -67259 -12273 -12283 3517 -43087 -27385 10843 38233 44654 12606 -16447 4810
13412 4810 35561 50362 10226 -48630 -43899 -58885 -50337 -30066 -14397 32781 -10252 30220
13400 30220 80680 46359 -18750 17419 74034 47666 77059 68123 24466 -6252 42316 91272
13388 91272 38950 -33530 -65530 -103723 -67397 -52223 -76283 32131 112129 105647 67176 27902
13376 27902 17671 22539 39802 34786 95904 91910 91755 111342 122036 100934 42629 -14094 -37086
13363 -37086 32899 49996 -49523 -62041 -53008 -46410 -53676 -25674 -31112 -21295 56172 105247 120795
13350 120795 83212 80100 118045 50531 -10798 -31850 -14246 -32571 -26023 -6671 27324 7874
13338G874m3708q427o9342j2272J7699M0232K0414P1047P2102K359L8946l6067
13326A00857p4619J534K4744J6400P09J9165j7860m6085K2163P397J5670K7301
13314I7376j0819M557M156m1097k0382r385j6081J8349O7841O48l9971j9706p0301
13301c4815m3113L0311P5957L2870l6005l4162m84k7827m9176K2327P0045K2817
13289B8745n1614m3614l814L3967R008N9094N2492P90r4979n1152Q043M8744k282
13276f572J1086J5606r14k005N130N0336O7746m071n0071k728o8430j7233M7688
13263D5568O6861P9451p6150k5226R915m3956l9309q877R279L5532L4567J6648
13251A04303j7718n620l8816Q650K196R779K6846P4q165p0881j656J2204j5620
$$ plain form
13338 7874 -35834 -44261 -113603 -125875 -108176 -67944 -47530 23517 95619 97978 136924 100857
13326 100857 26238 27772 52516 68916 69625 88790 70930 24845 47008 54405 70075 97376
13314 97376 86557 91114 95270 54173 33791 24406 8325 26674 94515 95163 55192 35486 -34815
13301 -34815 -77928 -47617 28340 61210 25205 -8957 -9441 -37268 -86444 -64117 5928 28745
13289 28745 -22869 -66483 -70297 -36330 -27322 31772 84264 85054 -9925 -61077 -53034 -4290 -6572
13276 -6572 4514 20120 19206 17201 22331 72667 140413 136342 86271 83543 15113 -2120 45568
13263 45568 112429 191880 115730 90504 100419 56463 17154 8277 17556 53088 87655 104303
13251 104303 86585 80965 42149 50799 52995 62774 89620 89694 81529 10648 8992 21196 5576
13238E576n7056j959R367J06588P6329l886m3147o7532k7111l721J4001l2025
13226b4576k0775j4587M0084k872J226k6754J1145j8280Q843M703L0357L1364
13214A9878J9757M6866k3412j9399n6442n152N2036O298p925K0433O660N183n8544
13201F237n4994j2747L2447L4540K0999m499J9645R233m220l5921k7985o938J3248
13188a0955J8647L8652l1856j1308P9704L1373P939o227k7195l116l2278l1243
13176B2137j6350K3425k5453r437J9714J3301K0708j8522L1656J8225k7991J5228
13164F6641K2515L5168j3922k8871M179j2902J9534k2068J6785N795J9743j6034
13152I6563p377k3639J0429j8887L08K4075l7187K3726M4805l549m4770j743L0707
$$ plain form
13238 5576 -51480 -53439 -44072 62516 138845 134959 91812 24280 -2831 -6552 7449 -24576
13226 -24576 -45351 -59938 -19854 -22726 -21500 -48254 -37109 -55389 -46546 -41843 -11486 19878
13214 19878 39635 86501 63089 43690 -12752 -17904 34132 40430 32505 52938 59598 64781 6237
13201 6237 -48757 -61504 -29057 5483 26482 21983 41628 50861 46641 10720 -17265 -24203 -10955
13188 -10955 7692 46344 14488 3180 82884 114257 122196 115969 88774 85658 53380 22137
13176 22137 5787 29212 3759 -5678 14036 27337 48045 29523 61179 79404 51413 66641
13164 66641 89156 124324 110402 81531 85710 72808 92342 70274 87059 92854 112597 96563
13152 96563 89186 65547 75976 57089 57397 81472 44285 68011 112816 109267 64497 62754 93461
13139I3461J7523Q277p1276o0409O785M2654j9111n3509M7500L8588M852K8436
13127H3771J1468m7354J4008j3888N5852R7649L1546N743p857l4629m3809n0886
13115A01614j2744K6386J0194n4494k0501J1480j0016k0609m1126m3026j6601
13104f9443J8586N9017O7631L9580L6910K78J9265J325o5453l9223N1786l654
13092A16605k8442q342M7352k3706o5626k8360k307N1389J4764r5050k4768J9896
13080b6595L1830R054M651R812L8183q903L0318J9273N299k0011N6941q293k6403
13067A15156R137n3957j1619k4394k6998P109M9325K8832J876K6304k8631o1475
13055C0665j0484J9565p201l4595M946J4948L9290l7849j1557k4447K0588q974
$$ plain form
13139 93461 110984 119261 47985 -12424 -5639 37015 17904 -35605 11895 50483 55335 83771
13127 83771 95239 47885 61893 48005 103857 201506 233052 238795 230938 196309 152500 101614
13115 101614 88870 115256 125450 70956 50455 61935 51919 31310 -9816 -52842 -69443
13104 -69443 -50857 8160 75791 115371 152281 152559 171824 173149 107696 68473 120259 116605
13092 116605 88163 79821 127173 103467 37841 9481 7174 58563 73327 -21723 -46491 -26595
13080 -26595 5235 14289 18940 28752 66935 58032 88350 107623 112922 92911 149852 141559 115156
13067 115156 124293 70336 58717 34323 7325 14434 63759 92591 94467 120771 92140 30665
13055 30665 20181 39746 32545 -2050 2896 17844 57134 19285 7728 -16719 3869 -5105
13043e105j7835j1321K8395k8752N368J0671m2162P2562M5585K3401k4723J2321
13031F8405K6220K0063J978j93M3678k734j2458K5325j0743r8692j5211O1009
13019A06647K4550J5809p8401m7357j3028O866j1585M4806j7515k3916J2756O3300
13007H2932K6466K051m3663q230J6371k7632n570J5428L9397J2542l3005r3422
12995a6335O95L2032K0486O1146K1667k851j0642J1733o52l5407l9976J6007N9854
12982A17757N0072K9837j0173k2635o605k0680j5561K4749O753r7190q0531j8154
12970d2361O6115P7337J3481o6321j7389l8261n27j7623N9926k6176J5535K6973
12958E0709Q2723K7671k4431M11K5397k1736j8997j6208m9161k3545n2830R621
$$ plain form
13043 -5105 -22940 -34261 -5866 -34618 -29250 -18579 -60741 11821 57406 80807 56084 68405
13031 68405 94625 114688 116666 116473 160151 157417 144959 170284 159541 60849 45638 106647
13019 106647 131197 147006 68605 21248 8220 15086 3501 48307 30792 6876 19632 82932
13007 82932 109398 111449 67786 59556 75927 48295 42725 58153 97550 110092 77087 -16335
12995 -16335 -15640 16392 36878 98024 119691 116840 106198 117931 117279 81872 41896 57903 117757
12982 117757 167829 197666 187493 164858 158253 137573 122012 146761 153514 56324 -24207 -42361
12970 -42361 23754 101091 114572 48251 30862 -7399 -7926 -25549 34377 8201 23736 50709
12958 50709 133432 161103 136672 137083 162480 140744 121747 105539 56378 32833 -19997 -10376
12946a0376P4185q659m6863m771O2692L2366j1632k805j1416j7850m960o4384
12934a4473n5345j0310k2445M4842O5892L8327K1158j9024j9024K8130O1279N4
12922A19061q1323K7860N9060j6476J7662q038m4303l6629j9705q416N2674n784
12910E5643n2609j1903P081N8817P011j9962l1075O3150L9574j5972k4345K1378
12898I6788J2882L9181j8527q9798J8213J3440J6564L5643j1745m6078j3385N3253
12886A06431j4399n8311l1418j7961K0296P0137L1856N60K8307q770m2784m2251
12874D1693J7128J4707J0184o4123n631Q2978l03k601j4362l2979P526l6895N2508
12861F9830K5559K3400r9434M289J5759o224J57K0939r3463p178m563N8751L1615
$$ plain form
12946 -10376 63809 55150 8287 3516 66208 98574 86942 84137 72721 54871 49911 -14473
12934 -14473 -69818 -80128 -102573 -57731 8161 46488 67646 48622 29598 57728 119007 119061
12922 119061 37738 65598 124658 108182 125844 117806 73503 36874 17169 8753 61427 55643
12910 55643 3034 -8869 -1788 57029 64040 44078 13003 76153 115727 99755 75410 96788
12898 96788 109670 148851 130324 40526 58739 72179 88743 124386 112641 66563 53178 106431
12886 106431 92032 33721 2303 -15658 4638 74775 106631 107191 135498 126728 83944 41693
12874 41693 58821 73528 83712 19589 13958 96936 96633 94032 79670 46691 54217 17322 69830
12861 69830 95389 118789 19355 23644 39403 33179 33336 54275 -39188 -46366 -50929 7822 39437
12848C9437J0082R911j9099r138L8908M4049l049r6878O467P6194J9892n7743
12836E9033o7049K9625L2953m4057N0315O5988K0221q983k4918k9914L992k1948
12824F5258N8823R371m7701J1425k678j02326n023M4331O5572K0059j1706o8413
12812C6992n871J6522L6310o477O593J9265m5797P821j474j9394L0521k8580n114
12799D1317j598O887q081j7994j2996m3141l6265K5120J7043P4626L1265l9061
12787C7122k1091O3433L2350Q773j4242j9707m324L0373M3929K8019k3693k1105
12775A39837J3797j7363O558J7801l8978o0901Q440O1285N409K9530N131j1493
12763A59053j9649L392k6468O016k1526o459m5784m8724l4340J1126P6018N8157
$$ plain form
12848 39437 49519 59430 40331 31193 70101 114150 111101 14223 20690 96884 116776 59033
12836 59033 -8016 21609 54562 10505 60820 126808 147029 138046 113128 83214 87206 65258
12824 65258 124081 133452 85751 97176 94498 -7828 -12851 31480 97052 117111 105405 36992
12812 36992 31121 47643 83953 77476 84069 103334 57537 65358 63884 44490 75011 46431 41317
12799 41317 39719 46606 38525 20531 7535 -35606 -71871 -46751 -29708 44918 76183 37122
12787 37122 16031 79464 111814 120587 106345 86638 82314 112687 156616 184635 160942 139837
12775 139837 153634 136271 142829 160630 121652 60751 69191 130476 135885 165415 170546 159053
12763 159053 139404 142796 116328 122344 100818 94359 48575 -149 -34489 -23363 52655 110812
12751A10812J0748o6886J9897j7269L6260J9386j9013l9316K5192M8699l2344
12740I6166k1931K5714P194j1267Q248j036m908k2287o7187K3525o0932K882J03211
12727G7392N9266k0144k5876j1347j9604L8213N632J3980n0536q2113J0500j5632
12715b0269j0861L9559j7107r89O6600J7542o0630L2012L0131j1156k2487r345
12703C3000K0250J2031k6410R984K9336m3811J2615P8353n2099J1958M3420Q067
12691A36694K4259k6032m8038k4118j7110L2881O2480k2554n5847l8945M1005
12680F4675O9084J9641o0338l4963M2494M9516L0758l6362j16528l6572L7758
12669B9163N9949L5353j6553K7073k1148l1910o5134j0892m524K4359r873L3748
$$ plain form
12751 110812 121560 54674 74571 57302 93562 112948 93935 54619 79811 128510 96166
12740 96166 74235 99949 107143 95876 104124 103088 98180 75893 8706 32231 -28701 -25819 77392
12727 77392 136658 116514 90638 79291 59687 97900 103532 117512 66976 -15137 -4637 -20269
12715 -20269 -31130 8429 -8678 -9667 56933 74475 13845 45857 75988 64832 42345 33000
12703 33000 53250 65281 38871 48855 78191 34380 46995 125348 73249 85207 128627 136694
12691 136694 160953 134921 86883 62765 45655 78536 141016 118462 62615 23670 64675
12680 64675 133759 153400 93062 58099 100593 150109 180867 144505 27977 -8595 29163
12669 29163 89112 124465 107912 134985 113837 81927 16793 5901 1377 25736 15863 49611
12657D9611m2522r4214K1561O9398L3464N8569K5098m1659J9033l9181q001l3997
12645A7160j5041L1035j814K1851M7639L1272J7297j7970l0384L3802R464q831
12633A35480j3462R53o849O0365l1706k2016J7027l1558J9470j9891k7455J6195
12621I6553N9707J2797L0380K1474k4093j7643m2629l4701m8528M622N6023l191
12609A10771N046J997J807k0245J8410k3029j0918o829o721p755l6747M1448M0689
12596A07924O631O229K0420n1273o5008J6358m852O0182P5198M6844n6432N178
12584A67399q817n695o3938q2765K5888L6747L5161P5358L2534l0418j9472J4149
12572A76131J0102l2718l3366r846q9980k6057K6577M5697k4113n070M4360M679
$$ plain form
12657 49611 7089 -87125 -65564 3834 37298 95867 120965 79306 98339 59158 51157 17160
12645 17160 2119 33154 31340 53191 100830 132102 149399 131429 101045 134847 144311 135480
12633 135480 122018 122971 116122 176487 144781 122765 139792 108234 127704 107813 80358 96553
12621 96553 156260 169057 199437 220911 196818 179175 136546 101845 53317 57939 113962 110771
12609 110771 115817 117814 119621 99376 117786 94757 83839 77010 70289 62534 25787 67235 107924
12596 107924 114555 120784 141204 89931 24923 41281 36429 96611 171809 218653 162221 167399
12584 167399 158582 152887 88949 6184 32072 68819 103980 179338 211872 181454 161982 176131
12572 176131 186233 153515 120149 110303 20323 -5734 20843 66540 42427 37357 81717 86396
12560H6396j8181k1980K1817j2123l3153J5290L2810k1348j7998l9334K6425Q9733
12548A08354J9179K7354n2405p5373j2478j739K3217K3135M058J3647M835L6724
12536A18508M0472j0654n87m6620l2542J4319M5251n1861j6711J4112L2742K2561
12524A28990k1382o534M579J6713k0952j9040K742n068N8113J7837k8063j0632
12512A17303O028O019K0850O564j6723j2165N89K5572Q844k5771k4016k8166j2594
12499G2334k7985K3135o3974j7944N6055L0696J4175M0775M3065K4524j4886o2399
12487A17571k8523P517L4331L5913r380k9944m3315M6154K8902L2895J6043l3119
12475A75045m398q3372k6757N7581j058o3426J4519N0045J4775K690M0267P8621
$$ plain form
12560 86396 68215 46235 68052 55929 22776 38066 70876 49528 31530 -7804 18621 108354
12548 108354 127533 154887 102482 27109 14631 12892 36109 59244 63302 76949 81784 118508
12536 118508 158980 148326 147739 101119 68577 82896 128147 76286 59575 73687 106429 128990
12524 128990 107608 101074 105653 122366 101414 82374 85116 80048 138161 155998 127935 117303
12512 117303 123331 129350 150200 156764 140041 127876 128465 154037 162881 137110 113094 84928 72334
12499 72334 44349 67484 3510 -14434 41621 72317 86492 127267 170332 194856 179970 117571
12487 117571 89048 96565 130896 166809 157429 127485 84170 130324 159226 192121 208164 175045
12475 175045 170647 87275 60518 118099 117041 53615 68134 118179 132954 135644 175911 254532
12463B54532j7729j07874J583L1499L800M7315M4377r977l6769K5998L9638k3163
12451B53230k2388m9344l3699Q203Q5384K2094k9558k1732j4133n189L0243J1474
12439B34585k7466J3676L0804j0967o0609l1511o239J9808J8515N3636L9899m8594
12427B25537r3596j1226Q1759Q0351o5124K1585L6048P410J1910K4831j735l6426
12415B81324J4531J6365n6440o6744k7395O012j2035J490j0896N016R407M4636
12403B05271j35k3617o3492J2394J2915p235J9365P2955R8428O3567R1201N7975
12391E39592p7066n9324m5117l0518o489o1889m9928o755k0719n8908J8170J29503
12379B70552J2994n3009k5203o895p7844l8949J8906L4166K3928M9716M4714P7230
$$ plain form
12463 254532 236803 128929 130512 162011 165811 213126 257503 247526 210757 236755 276393 253230
12451 253230 230842 181498 147799 156002 241386 263480 233922 212190 198057 192868 223111 234585
12439 234585 207119 220795 251599 240632 180023 148512 142273 162081 180596 234232 274131 225537
12427 225537 131941 120715 202474 282825 217701 239286 275334 282744 294654 319485 317750 281324
12415 281324 295855 312220 255780 189036 161641 167653 155618 157108 146212 151228 160635 205271
12403 205271 205136 181519 118027 130421 143336 136101 155466 228421 326849 390416 481617 539592
12391 539592 462526 403202 358085 327567 321078 259189 209261 202506 181787 122879 141049 270552
12379 270552 283546 230537 205334 198439 120595 81646 100552 134718 158646 208362 253076 330306
12367C30306k2676r1744m9350N5405R1523R4117l761j06604m3009K8463N7139
12356C39809j6001j753L8124Q8141O6257k3290O59m7189L6779K7811l3535o8224
12344D07588p6131N1096L8094N904k1828J6704J2610k7765k0783J5991L0184m4678
12332C86986j1933J1958J11382K3429M8946J13023J12989J2653j14125j17605
12322E77703n5630n9841P6668L3077m0325p3228J734k5654k0006K1223M3094q187
12310D70628M653k5059n0328o3666M0711P4157q641m3889P2427L1438l359k0878
12298D78194n5595r7709J110O4246Q3128L6633k2594J1234n6097j5183L2926N497
12286D65790R899M073Q0340K4110p0192n2983o762k305q604j2410K9059N1377
$$ plain form
12367 330306 307630 215886 166536 221941 313464 407581 403820 297216 254207 282670 339809
12356 339809 323808 322055 360179 448320 514577 491287 491946 444757 481536 509347 475812 407588
12344 407588 331457 382553 420647 426551 404723 421427 434037 406272 385489 401480 431664 386986
12332 386986 375053 387011 498393 521822 570768 683791 796780 809433 695308 577703
12322 577703 522073 462232 538900 571977 531652 458424 460158 434504 414498 435721 478815 470628
12310 470628 475281 450222 399894 336228 376939 451096 442455 398566 470993 502431 499072 478194
12298 478194 422599 324890 326000 390246 473374 510007 487413 498647 442550 427367 460293 465790
12286 465790 475689 479762 560102 584212 514020 461037 454275 451970 443366 430956 460015 511392
12274E11392N0334j71j02509m4651J4575k9233k4155o3372j3556J4746K9451O063
12262C48914J5631M701K4328k4963J6505j8282j4116k7616p189l6341J3684M4711
12250C39967J4930m3913j5815k3263Q437Q6428J7019m7079M509K5173l4911N089
12238C36571O2270J1823k3704n8075K6730M4329n1939M307J29759K3451n7378
12227D48144J674m7383k0417P183L2311K6509J6583L174J08473L4903o8706j0866
12215E31582Q0865j6396j6484k8030L727N9075N30N905N4146L3665K3783j9012
12203G13356K1780j5623p349N1309K234j8395L909o6539K0734K9302k8274k5102
12191F81342l0229q8891J168L6761L2167J5762J3850P8041k5248m7684l9696n6105
$$ plain form
12274 511392 561726 561555 459046 414395 428970 399737 375582 312210 298654 313400 342851 348914
12262 348914 364545 369246 393574 368611 385116 366834 352718 325102 317913 281572 295256 339967
12250 339967 354897 310984 295169 271906 280343 366771 383790 336711 341220 366393 331482 336571
12238 336571 398841 410664 386960 328885 355615 399944 348005 352312 482071 505522 448144
12227 448144 449818 402435 382018 389201 421512 448021 464604 467778 576251 611154 542448 531582
12215 531582 612447 596051 579567 551537 555264 614339 614869 620774 674920 708585 732368 713356
12203 713356 735136 719513 712164 763473 765707 747312 751221 684682 705416 734718 706444 681342
12191 681342 651113 562222 563390 600151 632318 648080 661930 739971 714723 667039 627343 571238
12179E71238k7153K5330M5315K9982o9567Q1302M9872j118j03l4543k6243k5378
12167F18934n7859m2423N3417N2729j0399J3218K4761N2857J5665m5506j178Q2035
12155G56251O7032K8632m1844n3164P630k4148K2025K9272R7689M6536o2782j4757
12143H58372J8152k0540J0486K4724l9331N3395L9909Q12j2997K58L3902j4820
12131I52322L1l8642P239K3587L2169Q494J9651N2769P0422K7146j1697k2016
12119A121475k1617M4329P3255M181J2979M232l1937j8627j1153M5805K5777j837
12107A246862N4992K7846K4667k1146K9871K6525l3476K6976K3265J0163o9153
12096A347392K1893K7104l718P891L4146J4632M3912N2512M7487N0175L4511k0947
$$ plain form
12179 571238 544085 569415 614730 644712 575145 656447 706319 705201 705098 670555 644312 618934
12167 618934 561075 518652 572069 624798 614399 627617 652378 705235 720900 675394 674216 756251
12155 756251 823283 851915 810071 756907 764537 740389 762414 791686 889375 935911 873129 858372
12143 858372 876524 855984 866470 891194 851863 905258 945167 945979 932982 933240 967142 952322
12131 952322 952353 913711 920950 944537 976706 985200 1004851 1057620 1128042 1155188 1143491 1121475
12119 1121475 1099858 1144187 1217442 1221623 1234602 1238834 1206897 1188270 1177117 1222922 1248699 1246862
12107 1246862 1301854 1329700 1354367 1333221 1363092 1389617 1356141 1383117 1406382 1416545 1347392
12096 1347392 1369285 1396389 1392671 1400562 1434708 1449340 1493252 1545764 1593251 1643426 1677937 1656990
12084A656990k680L9222O315M8571j7515O627M7100L1947N1685K2976N6764O1315
12072B009317J8184l4305k3185J01305J13684Q0346N8363L9152O1662M7881m4826
12061B427578P7799K1310J02234R2265j0444K1193R2621L6514O7715O0525N3500
12050C042810J1840J6382K4629J22558O0384k1587N2488J14782Q1053J13116N2470
12039C670925L8764R8749R4559L3688J03496J01592M6314J05012J15319J18655
12029D527073R7795M1382R7338J37041J19873J00437J60405J46325K13203J59382
12019E800254J11912J12058J73237J98315K25297J76391J94954K31186K04010
12010G427614L05854K49898K43589L25453K69954K64771K90607L57009L45449
$$ plain form
12084 1656990 1654310 1693532 1699847 1748418 1730903 1737530 1784630 1816577 1868262 1891238 1948002 2009317
12072 2009317 2027501 1993196 1970011 2071316 2185000 2265346 2323709 2362861 2424523 2472404 2427578
12061 2427578 2505377 2526687 2628921 2721186 2710742 2731935 2824556 2861070 2928785 2989310 3042810
12050 3042810 3054650 3071032 3095661 3218219 3278603 3257016 3309504 3424286 3505339 3618455 3670925
12039 3670925 3709689 3808438 3902997 3936685 4040181 4141773 4188087 4293099 4408418 4527073
12029 4527073 4624868 4666250 4763588 4900629 5020502 5120939 5281344 5427669 5640872 5800254
12019 5800254 5912166 6024224 6197461 6395776 6621073 6797464 6992418 7223604 7427614
12010 7427614 7733468 7983366 8226955 8552408 8822362 9087133 9377740 9734749 10080198
12001A0080198K95272L39114M28699M17443M67478N53536N80708N58769N98910
11992A4320127O32811O34643O74244P37336Q20964P98351R24400R73031J067061
11983B1582968J184515J299162J332461J397728J556453J721888J911221K073330
11975C4059726K224777K473639K693610K991493L295920L688092M049376M498945
11967E9975578N015683N670042O307116P014555P840892Q709967R767750J0940607
11959A21242190J2106128J3403490J4633760J5743500J6519354J6847542J6597165
11952B27093129J5521040J3366410J0185143O044596J418675l391239p893380
11945B62344374j1542433j4275474j5986086j6609814j6601434j6046481j5082918
$$ plain form
12001 10080198 10375470 10714584 11143283 11560726 12028204 12581740 13162448 13721217 14320127
11992 14320127 14952938 15587581 16261825 16999161 17820125 18618476 19542876 20515907 21582968
11983 21582968 22767483 24066645 25399106 26796834 28353287 30075175 31986396 34059726
11975 34059726 36284503 38758142 41451752 44443245 47739165 51427257 55476633 59975578
11967 59975578 64991261 70661303 76968419 83982974 91823866 100533833 110301583 121242190
11959 121242190 133348318 146751808 161385568 177129068 193648422 210495964 227093129
11952 227093129 242614169 255980579 266165722 272210318 273628993 270237754 262344374
11945 262344374 250801941 236526467 220540381 203930567 187329133 171282652 156199734
11938A56199734j3995857j2844898j1633445j0496976r382295q429036p560707
11931H1856520o777385o029719n404129m849609m371934l900551l533096l244236
11923D3745861k925375k682787k396324k199353j997840j854521j687650j587139
11915B6414872j392390j374929j281786j100851j046521r63847r27428q28063
11907A7499057p98094p54372o81218o39000n57820n32044o02114n88403n50878
11898A1795114m94994l83422m26894l99972l21684l28879l27426l21748k92771
11889H497324l31033k59206k84991k91842j93353k21814k19254j49515j15834
11880F430482j27641j79068j85307j33681k14723k20470j03757j26336j70609
$$ plain form
11938 156199734 142203877 129358979 117725534 107228558 97846263 89417227 81856520
11931 81856520 75079135 69049416 63645287 58795678 54423744 50523193 46990097 43745861
11923 43745861 40820486 38137699 35741375 33542022 31544182 29689661 28002011 26414872
11915 26414872 25022482 23647553 22365767 21264916 20218395 19254548 18327120 17499057
11907 17499057 16700963 15946591 15265373 14626373 14068553 13536509 12934395 12345992 11795114
11898 11795114 11300120 10916698 10489804 10089832 9768148 9439269 9111843 8790095 8497324
11889 8497324 8166291 7907085 7622094 7330252 7136899 6915085 6695831 6546316 6430482
11880 6430482 6302841 6123773 5938466 5804785 5590062 5369592 5265835 5139499 4968890
11871D968890j49589q0901r4606r4394p4038j40366j04556p2882o4482j08711
11861C984365p8374j16875p4038j04739j02103j19687j03961j10099m4142m7018
11851C083329j03066p4005n7881p9235j9192p073j4876m3360m5594j2539q510
11840B617998n7304j26945q9954N153L3923j5597l2316l7092m1562j7017O090
11829B245377l4875O425n5587p0919o3224K1539O6760J5645k6015J310n2633j1253
11817B042550o225p757J0143o0340j02139j9058l5561j23734k0745L6375L7777
11806A751286m6831j15515q2677p8512n7039p630M8341Q406n0452k42n1815p2632
11794A244688o0469K6079J6442l1679m5110o0655l7886J159q1815L7456M8848
$$ plain form
11871 4968890 4819301 4738400 4643794 4549400 4475362 4334996 4230440 4157558 4093076 3984365
11861 3984365 3905991 3789116 3715078 3610339 3508236 3388549 3284588 3174489 3130347 3083329
11851 3083329 2980263 2906258 2848377 2769142 2749950 2742877 2728001 2684641 2639047 2626508 2617998
11840 2617998 2560694 2433749 2343795 2348948 2382871 2367274 2334958 2297866 2256304 2239287 2245377
11829 2245377 2210502 2216927 2161340 2090421 2027197 2048736 2115496 2131141 2105126 2106436 2053803 2042550
11817 2042550 2036325 2028568 2038711 1978371 1876232 1857174 1821613 1697879 1677134 1713509 1751286
11806 1751286 1704455 1588940 1506263 1427751 1370712 1363082 1411423 1419829 1369377 1369135 1317320 1244688
11794 1244688 1184219 1210298 1226740 1195061 1149951 1089296 1051410 1052569 970754 1008210 1057058
11783A057058M8052k6771o7295L264q6K5205L7273m1455j2950j4068n6706J4890
11771I66411K431j00842p7005k1530L0168j8934J7543j8028m1527L0214J2049
11760G80950k9625K3402l8604n302L0520J3934J2152n726L0905j2531O825r981
11748G96919k8455j5060l8285j8920l0550k8858j3651K48K6729p695P6231j9885
11736F98768m2651k2276l696J0017J9339k6545Q478N9624m6031m6718j2699n6717
11724E38893j7993m5172n629O4095J5126k7087n7266j2573L3346N4231N8970k7322
11712E71619k7787J9903M1617j0832p0345q1015K0218J18225j6556j9759k6618
11701E18670J5170J511L2813r1174m135M5957k2496J1175j2195r267n385j2417
$$ plain form
11783 1057058 1105110 1078339 1011044 1014308 1014222 1039427 1076700 1035245 1022295 1008227 951521 966411
11771 966411 968842 868000 790995 769465 799633 780699 798242 780214 738687 768901 780950
11760 780950 751325 774727 736123 730821 761341 775275 787427 781701 812606 800075 806900 796919
11748 796919 768464 753404 715119 696199 665649 636791 623140 623388 650117 642422 718653 698768
11736 698768 656117 633841 630145 640162 659501 632956 641434 701058 655027 608309 595610 538893
11724 538893 520900 475728 470099 534194 549320 522233 464967 452394 485740 539971 598941 571619
11712 571619 543832 563735 605352 594520 524175 443160 463378 581603 565047 545288 518670
11701 518670 533840 535351 568164 476990 472855 518812 496316 507491 495296 486029 480644 468227
11689D68227k7320r30N8664L1231l0015N4492M151l1771k9950n9097k0166K2264
11677D39780K2120K9235j0473O3278M7241q0831k1114j8586k9224j3476k9357
11666C98593k8941L4068N9124L9737o360n366K690N2182N6804K6317K5316L2379
11654F86543P4221J18595J41658J92298K08809L40875M87495N47246M85531J3695
11644C296966m34117n45941m43652l68511k93517j88779j34476j07418j16576
11635F63979m0214J3393k1626k9036j1990j37148j25019n6181m6514R9500N7411
11624C66555j7546l4503n426k1369m8082m589J8151N3368K564L7432k6000p3165
11612B47390n9112L092L3931Q7218j101M3028k0626p6797k0939R730J4243O016
$$ plain form
11689 468227 440907 439977 498641 529872 499857 554349 558500 526729 496779 437682 417516 439780
11677 439780 461900 491135 480662 543940 591181 510350 489236 470650 441426 427950 398593
11666 398593 369652 403720 462844 502581 496221 490855 493545 545727 602531 628848 654164 686543
11654 686543 760764 879359 1021017 1213315 1422124 1762999 2250494 2797740 3283271 3296966
11644 3296966 2862849 2316908 1873256 1504745 1211228 1022449 887973 780555 663979
11635 663979 623765 637158 615532 586496 574506 437358 312339 256158 209644 309144 366555
11624 366555 349009 314506 309080 287711 239629 235040 253191 306559 309123 346555 320555 247390
11612 247390 188278 191370 225301 312519 311418 354446 333820 257023 236084 245814 260057 266073
11600B66073J3500K9376k1277r6354n8753M1886j1677j0525N5689n5745m8043
11589A04150P0920N9555m3320n7445J2870J7275N1075M1470J8573l7577m4876
11578A92670l6397J9518k1121K5273M5681L6793n0228k8541J4828k4763j9340
11567A54373n2959m7550O6660P3612k4414p1657K5247P962M9464n024q031K3905
11555A91588k177M3844j02l8619j9593N6951J5045k9454l1428j0420P9526k0736
11543B34425r1344m6758N747M485O6952R905k9360j2773m393J1014L211m3654
11531A07457j4845k6336r206P5395L5710j3159l7857M5623K5551m4500k5652J3501
11519A31682K1530j329P483m1366k3437L7321K2439r119O3374P9767m2211o7869
$$ plain form
11600 266073 279573 308949 287672 191318 132565 174451 162774 152249 207938 152193 104150
11589 104150 175070 234625 191305 133860 146730 164005 215080 256550 275123 237546 192670
11578 192670 156273 175791 154670 179943 225624 262417 212189 183648 198476 173713 154373
11567 154373 101414 53864 120524 194136 169722 98065 123312 131274 180738 175714 167683 191588
11555 191588 189411 233255 233153 194534 174941 231892 246937 217483 186055 175635 255161 234425
11543 234425 143081 96323 102070 106555 173507 183412 154052 141279 136886 147900 151111 107457
11531 107457 92612 66276 57070 132465 168175 155016 117159 162782 188333 143833 118181 131682
11519 131682 153212 151883 159366 118000 94563 131884 154323 145204 208578 288345 246134 178265
11507A78265j879p890n5548l1245m202M1979L7447j4452K4327M5598q28m6449
11495A65123n5534l1880k7595P3612K9044k4378o8382j0846Q6672J3326N072r299
11483A44935p1071m3901M1856o4695l6933P7755L8239j5977R40n123J7253K893
11471H6171p004j9012j7009L5401R161m2845r272M5616n088m2597l7448j1692
11459a5618J943L4625O0789r080J6203O7292k04l5634l1429J3664K9497l0373
11447A01675o6036m5343K3859J6213N6593M7853L8457l9409n2465l4881L037k4006
11435B5547K2229Q0572J1668l4583m6557L2952j6603j4962k4775r340m152J6740
11423C8736N9081m2436p3547M0016M3226k9368k0415L3554J9725q302J8318M3123
$$ plain form
11507 178265 176386 168496 112948 81703 77501 119480 156927 142475 166802 212400 211572 165123
11495 165123 109589 77709 50114 123726 152770 128392 60010 49164 135836 149162 154234 144935
11483 144935 73864 29963 71819 7124 -29809 47946 86185 70208 71148 66025 83278 86171
11471 86171 79167 60155 43146 78547 87708 44863 35591 81207 76119 33522 -3926 -15618
11459 -15618 -13675 20950 81739 72659 88862 156154 155950 120316 88887 102551 132048 101675
11447 101675 35639 -9704 14155 30368 86961 134814 173271 133862 81397 46516 49553 25547
11435 25547 47776 128348 140016 105433 58876 91828 75225 60263 35488 26148 21996 38736
11423 38736 97817 55381 -18166 21850 65076 35708 15293 48847 68572 60270 78588 121711
11411A21711R669J545p3960l5644M6584J7085l4239p775l6611m6743R423J9711
11399i244L0721P5977p683k8183k9845O7216M9444K2717N0621j9060r6750p0039
11387C5892J338l88k7970N139K5070Q406K0249J705M3517n4881m1350j255L4382
11374D9854j5444m431P8n812M833J7944M0415k8224m2535K9554M9878m2967n2983
11361A60J5660J4018P2513K3062m6249r810p083m7027k0838J6054O3221R465j3767
11348F9379p4927m8461O3052K0942J3433J8339K3173m180m17m1062m780P227k7072
11335A4646j4120k9650K6976N3125L8003j8989l9305J0113L0187J3213l1985K0171
11323G2385J4602K5313K6100o4598j8875K5352k6949l6446r980k054J3802j248
$$ plain form
11411 121711 131380 132925 58965 23321 69905 86990 52751 44976 8365 -38378 -28955 -9244
11399 -9244 21477 97454 89771 61588 31743 98959 148403 171120 221741 202681 105931 35892
11387 35892 37230 36842 8872 14011 39081 47487 67736 69441 112958 58077 16727 15472 49854
11374 49854 34410 29979 30057 24245 29078 47022 87437 59213 16678 46232 96110 53143 160
11361 160 15820 29838 102351 125413 79164 69354 62271 15244 -5594 10460 73681 83146 69379
11348 69379 -5548 -54009 9043 29985 43418 61757 84930 80750 80333 39271 34491 41718 14646
11335 14646 526 -29124 -2148 50977 88980 69991 30686 40799 70986 84199 52214 72385
11323 72385 86987 112300 138400 73802 54927 80279 53330 16884 6904 4850 18652 17404
11311A7404O337L6423k9953l1348J0492J8337l3749L829J5465J2624R910J552
11299C7323L5395l322R132J4449J4524p8179j02374O4609Q363J3510K9149L8941
11287H1520j3573o0836M6022N1741o0577q8507J3599O3679M1119k6779m2433O589
11275A1564N5703R560L5076l2950o6180k3924M3338k1178k7756J3611K0480O4814
11263H2158P1041M538q745m9487l0859M8174L5519n1648q8006L4040j0465l96
11251C5864k9097k0441m450J0501R114j5226K492k0014j6183j5191N1655N2758
11239D1782K7213j3295m5680J494R997k5578j3390J02527O1697m001K7086K557
11227A72409l4847m8504L8008K4241M6695m9669p2605l7428k3947o106k0487L5444
$$ plain form
11311 17404 23741 60164 30211 -1137 9355 27692 -6057 -2228 13237 25861 35771 37323
11299 37323 72718 69396 78528 92977 107501 29322 -73052 -8443 -80 13430 42579 81520
11287 81520 67947 7111 53133 104874 44297 -44210 -30611 33068 74187 47408 4975 11564
11275 11564 67267 76827 111903 78953 12773 -11151 32187 11009 -16747 -3136 17344 82158
11263 82158 153199 157737 148992 99505 68646 116820 152339 100691 12685 46725 36260 35864
11251 35864 6767 -13674 -18124 -7623 1491 -13735 -11243 -31257 -47440 -62631 -10976 41782
11239 41782 68995 55700 10020 11514 21511 -4067 -17457 85070 146767 142766 169852 172409
11227 172409 137562 89058 127066 151307 198002 148333 75728 38300 14353 8247 -12240 23204
11215B3204J7561P106N0788O4771k2210p7874j3714O4763J2478k3648n0453k3987
11203B8785J3803l7792O0024K7756J2858n1039q638J6673k3179J612M2592J6852
11191A00307O229p1513L287K9990n0126K0263K023J3044l2244k4242Q276O0307
11179F5601L4245m9186k3145L8770K0246k310m1502L5102L4578Q480j4857m3483
11167F2539m5600j1656N7498J4251n7333M8574O57J7864R763j7035k7978m5918
11155E626k4683L8522K2842m6226J6351O4421k0853L448N4266q7140o4564M1360
11143C370N7139J7302J898l6343k1765P570r586k4963M008M5840K3629q086J8788
11130G8801m9413q4276m9106L466O4072j1205L783O6789P2769K5941K4223k4968
$$ plain form
11215 23204 40765 47871 98659 163430 141220 63346 49632 114395 126873 103225 52772 28785
11203 28785 42588 4796 64820 92576 105434 54395 45757 62430 39251 40863 83455 100307
11191 100307 106536 35023 38310 68300 18174 38437 40460 53504 21260 -2982 5294 65601
11179 65601 99846 50660 27515 66285 86531 84221 42719 77821 112399 120879 106022 62539
11167 62539 16939 5283 62781 77032 19699 68273 68930 86794 96557 79522 51544 5626
11155 5626 -19057 19465 42307 -3919 12432 76853 56000 59448 113714 26574 -37990 3370
11143 3370 60509 77811 79709 43366 21601 29171 19585 -5378 -1370 44470 68099 60013 78801
11130 78801 29388 -54888 -103994 -100528 -36456 -47661 -43878 22911 95680 121621 145844 120876
11118A20876K0184k5807k2143m0830M4453m17k0311o8732J8399N7342J6588n8135
11106D1467M3793M0725n2688j3697J0125J945n4767K3090R567m8701J004J3344
11094A5207r970l3517K244K3437K0097k4829J0913O2237O1053K6415r615q656
11082A35016K29m5495l8912l47K4155L72K0906R849l7926j5397J6180l33M1875
11069A10172L7150n4302m8486J7251J7846j3175J1836j0143l7766K416M317j7704
11057A9412J7340L0284J12271M8615l04k4795k6895j3817N7612J6075J2967K7839
11045B76604M2016M0782L2122m860j8309l1994j3025k4007L5520K3714P7055J91040
11033F26658J06762J7842m4903o1922p3158n6416k5131K7107P1480N4857J32274
$$ plain form
11118 120876 141060 115253 93110 52280 96733 96316 76005 7273 25672 83014 99602 41467
11106 41467 85260 125985 73297 59600 69725 71670 16903 39993 49560 859 1863 15207
11094 15207 5237 -28280 -26036 -2599 17498 -7331 3582 65819 126872 153287 143672 135016
11082 135016 135245 89750 50838 50491 74646 75018 95924 105773 67847 52450 68630 68297 110172
11069 110172 147322 93020 44534 61785 79631 66456 78292 68149 30383 32799 37116 19412
11057 19412 36752 67036 179307 227922 227618 202823 175928 162111 219723 235798 248765 276604
11045 276604 318620 359402 391524 386664 368355 336361 323336 299329 334849 358563 435618 626658
11033 626658 733420 751262 706359 644437 571279 514863 489732 516839 588319 643176 775450
11022G75450J08820R1093M2546n5246j35303p1853k9463j04369l0194o8667J8334
11011E41148J07158R6469O8730n738j38667j53024j21551p9504J8230J6192k8197
11000C21246j5549L2820k561p8408p114j6759R936J5838l6128m6629M912o8376
10988A13228k6026L4683q3656l9726m214k4803O416P1807j2316k2659L6200K8018
10976G6952L0367k2405l3460j2108J166K5844m032k1149K2154p543k564Q4171
10964A37393N7425p5569n6028j7609J8636l1204P746L255L573k352Q402o068n7332
10951i732k7130k2803M6057M8321L3545j4724m1838K576R2848N0163K1403p4788
10939A03898o3385J0109L3359k840P91j1578o914j0269N7105M3788o6376k2393
$$ plain form
11022 775450 884270 975363 1017909 962663 827360 755507 726044 621675 591481 522814 541148
11011 541148 648306 744775 813505 807767 669100 516076 394525 315021 333251 349443 321246
11000 321246 305697 338517 335956 257548 250434 233675 243611 259449 223321 176692 181604 113228
10988 113228 87202 121885 38229 -1497 -5711 -30514 -24098 47709 35393 12734 48934 76952
10976 76952 107319 84914 51454 39346 40512 66356 62324 41175 63329 55786 53222 137393
10964 137393 194818 119249 63221 45612 64248 33044 40790 44045 47618 45266 53668 47600 -9732
10951 -9732 -36862 -59665 -13608 34713 68258 53534 11696 14272 107120 157283 178686 103898
10939 103898 40513 50622 83981 81141 81932 70354 63440 53171 110276 154064 87688 65295
10927F5295M3206K8700L2575J4884l5947r9988n497K4042n7335k7021R7984M8923
10915A29821k213j4102K3588k0953m7667k9149N6136J5185n6778J2328J1412j9978
10903E7630J9405J1488K7254Q142j46877K295L1044j053o1041M2665L88M3290
10891C4630L0359L1040l8801o588j63j709J0548L2635j9696R266j7655m7192K5734
10878D2408J8844r286L961l7951L0553P6400O4035k0418K2727J20117P8642J9047
10866D09079K6569R336O8451J11926K1554P0023J58829J60366J98071K31388J09224
10855A574816J36523R8266N4122M1860l4489p8184r4831j41860k19350k27790
10845A109083k20239j50215o4594p3569r1355m7154m8268r679K1904k8960m7127
$$ plain form
10927 65295 108501 137201 169776 184660 148713 48725 43228 67270 9935 -17086 80898 129821
10915 129821 127608 113506 137094 116141 68474 39325 95461 110646 53868 66196 77608 57630
10903 57630 77035 88523 115777 123919 -22958 -20663 10381 9328 -51713 -9048 -8660 34630
10891 34630 64989 96029 57228 50640 50477 48768 59316 91951 72255 81521 63866 16674 42408
10878 42408 61252 51966 55927 17976 48529 124929 188964 168546 191273 311390 390032 409079
10866 409079 435648 444984 513435 625361 646915 716938 875767 1036133 1234204 1465592 1574816
10855 1574816 1711339 1809605 1863727 1905587 1871098 1792914 1698083 1556223 1336873 1109083
10845 1109083 888844 738629 674035 600466 509111 461957 413689 404010 425914 396954 349827
10834C49827l9579n9697L176O0308m384r9134n9063o3955L2127L785K83o549M0324
10821A57469K3842k5902K1161l3997l6361l3654P287M9651j5878p8130l763P7162
10809A08887L1829k5763l6185m027N0554N5868L6587K7476j2084j259n7474j9921
10797A54488O435J3280q788k6635L843q867m684q737r912l3272k461J8988L2092
10784A25770m5631j1623O4631K2693l9984l6294M4031J3711L330M1001M9822l0176
10772B01281r2449N5113L667J5013k2687m6908q6449p641L3284n5165l1059J9550
10760a4450K150O5363K8741J0627k7365J2902P377M240J7678k7056l4869j2939
10748C2399K3822J4290K0023N536k8685k9647j8382J04586P1008J0135O6281j5070
$$ plain form
10834 349827 310248 250551 253727 314035 309651 210517 151454 87499 119626 123411 123694 117145 157469
10821 157469 181311 155409 176570 142573 106212 72558 79845 129496 113618 35488 31725 108887
10809 108887 140716 114953 78768 74741 125295 181163 217750 245226 233142 231883 174409 154488
10797 154488 160923 174203 165415 138780 142623 133756 129072 120335 110423 77151 74690 93678 125770
10784 125770 80139 68516 133147 155840 115856 79562 123593 137304 140634 181635 231457 201281
10772 201281 108832 163945 167612 182625 159938 113030 26581 18940 52224 -2941 -34000 -14450
10760 -14450 -12300 53063 81804 92431 65066 77968 85345 89585 107263 80207 45338 32399
10748 32399 56221 70511 90534 96070 67385 37738 19356 123942 194950 205085 271366 256296
10736B56296m3759n0407r00j1347P21P43M6526K9833l8640N2542J0385K1466L9815
10723C13274j706o3669o5921m1507M2913j6921l3459N9966J01721L7526L9568
10712C71785Q6277O4565j8056m9509k1895j5885L1514k1925j4428J4984l2802
10701C94625o228L5138R956O134p7347M01n4597q0061o980N1667J8918M622N2819
10688C49067M8428N888o119j414K3117o1709k4784M9950N1600j985l5382j6519
10676C80138O4347L1690l0800k0965P138m68j5241M9120Q0224p20j0128M3460
10664E77795j7276k6391Q906p179l7487M1613R2935J07690M983O965J075K5759
10652G79388O5892K0152n9855O6175Q0344P6297M5134O6967L8277L5765R6460
$$ plain form
10736 256296 212537 162130 161230 149883 150604 151347 197873 227706 189066 241608 251993 273459 313274
10723 313274 311568 247899 181978 140471 183384 166463 133004 192970 294691 332217 371785
10712 371785 458062 522627 504571 455062 433167 417282 448796 426871 412443 427427 394625
10701 394625 388397 423535 433491 439625 362278 362679 308082 228021 221041 272708 291626 296248 349067
10688 349067 397495 403383 397264 395850 418967 357258 332474 382424 434024 432039 396657 380138
10676 380138 444485 476175 445375 424410 431548 431080 415839 464959 545183 544463 534335 577795
10664 577795 560519 534128 543034 535855 498368 539981 632916 740606 745589 752554 753629 779388
10652 779388 845280 865432 805577 871752 952096 1028393 1073527 1140494 1178771 1214536 1310996
10641A310996N3030L1813J17410J54120J44537K04078K19347K10246K82901L87300
10631C115778L55263L12013L09171K38644K98526N31087O68094Q63280J221226
10622G913082J674677K281209L155571M295730N682723P345679Q700164Q592421
10614D9641256N883782J376295k459140l570113k505523k56806K620714N963654
10606E6694119R938147J4361650J7785448J7222717R539749k773499j1638910
10599A11129421j2949697r286234m110021J345101P019949J3181859J9190115
10592A25520493K2880167K0187782P334666j1161110k2802803k3015802j7343531
10585A01599862j0846168m719644P77416N956060J0302194J2468145R482938p7972
$$ plain form
10641 1310996 1364026 1395839 1513249 1667369 1811906 2015984 2235331 2445577 2728478 3115778
10631 3115778 3471041 3783054 4092225 4330869 4629395 5160482 5828576 6691856 7913082
10622 7913082 9587759 11868968 15024539 19320269 25002992 32348671 41048835 49641256
10614 49641256 55525038 56901333 54442193 50872080 48366557 48109751 50730465 56694119
10606 56694119 66632266 80993916 98779364 116002081 125541830 122768331 111129421
10599 111129421 98179724 88893490 84783469 86128570 93148519 106330378 125520493
10592 125520493 148400660 168588442 175923108 164761998 141959195 118943393 101599862
10585 101599862 90753694 86034050 86811466 92767526 103069720 115537865 125020803 124942831
10577A24942831j2115274j8642012j7614412j3085159q430192m508153j392827
10570D9154802J082552K809103L181133J474249k483654o858768r107506q671313
10562C0580598o976988n103383l699906k661794j923508j467748j136258r16516
10554F694497p47918n91102m90556l71271k49789k97208k53061k99066l01441
10545C093085k00021j28875j31230r1748r5061o3028m4546o6115k549k7557n0418
10534B191937q8821n1967L1377n3843q1719K9581L6672j0741o4608l9180k0251
10523A878437j6149M1975O1505R794r795O7001J01440P2561J35944Q0796J592
10512B425101K8930L8755p637Q4551M7904Q9010J14081J46943N9892J09318J54126
$$ plain form
10577 124942831 112827557 94185545 76571133 63485974 55055782 50547629 49154802
10570 49154802 50237354 53046457 56227590 57701839 55218185 48359417 39251911 30580598
10562 30580598 23603610 18500227 14800321 12138527 10215019 8747271 7611013 6694497
10554 6694497 5946579 5355477 4864921 4493650 4243861 3946653 3693592 3394526 3093085
10545 3093085 2893064 2764189 2632959 2541211 2446150 2383122 2338576 2272461 2269912 2242355 2191937
10534 2191937 2103116 2051149 2082526 2028683 1946964 1976545 2013217 2002476 1937868 1898688 1878437
10523 1878437 1862288 1904263 1965768 1975562 1965767 2032768 2134208 2206769 2342713 2423509 2425101
10512 2425101 2454031 2492786 2485149 2569700 2617604 2706614 2820695 2967638 3027530 3136848 3290974
10501C290974J18930J08919J63688J59781J37187J45342K04652K59204L06047
10492D894724L28909L85170L12654L84163M70942M50534N14915N97220P02154
10483I041385P55595Q46274J024952J163354J361090J532130J736995J939593
10475A9401368K061896K229235K470216K885302L365563M091990N192912O719300
10467D8417782Q751702J1643710J5789186K1250665K7987534L4981491L9841544
10460B08663614L8946182L4495501K8719269J9588383J1443214K790530r745629
10453C34901064j8171893k5060534l2758398l6659772l8318834l7047014l0198138
10446A16686481k2567108j6651147j2389060r315771p185191n743237m619275
$$ plain form
10501 3290974 3409904 3518823 3682511 3842292 3979479 4124821 4329473 4588677 4894724
10492 4894724 5223633 5608803 5921457 6305620 6776562 7227096 7742011 8339231 9041385
10483 9041385 9796980 10643254 11668206 12831560 14192650 15724780 17461775 19401368
10475 19401368 21463264 23692499 26162715 29048017 32413580 36505570 41698482 48417782
10467 48417782 57169484 68813194 84602380 105853045 133840579 168822070 208663614
10460 208663614 247609796 282105297 310824566 330412949 341856163 344646693 334901064
10453 334901064 316729171 291668637 258910239 222250467 183931633 146884619 116686481
10446 116686481 94119373 77468226 65079166 55763395 48578204 42834967 38215692
10439C8215692l869953l309683k906063k617057k490542k254378k048753j905763
10431A6813500j641027j435708j301326j147790r68471q60206p04910n72491o14147
10422G567424n91830m29679l27010k76926k28941k56617k51007k40449k28078
10413D736887k02884k21046j17659n0086p5161n9319l1960l9448o9848o3928j08804
10402C696744j13943j30021j16536j77214k14846j87880j73100j61632j55891
10393B265681j06012j02886n2289N776m0481j42512q0951l6651q965n9220p4181
10382A567309r8523m0751l7794m5304O597j5218k4683j8606k5879j00153o7771
10371A099224N2111L8817J3946q4436n4634j2030n1828l0320p846k4880k7886
$$ plain form
10439 38215692 34345739 31036056 28129993 25512936 23022394 20768016 18719263 16813500
10431 16813500 15172473 13736765 12435439 11287649 10319178 9458972 8754062 8181571 7567424
10422 7567424 6975594 6545915 6218905 5941979 5713038 5456421 5205414 4964965 4736887
10413 4736887 4534003 4312957 4195298 4145212 4070051 4010732 3978772 3939324 3869476 3805548 3696744
10402 3696744 3582801 3452780 3336244 3159030 2944184 2756304 2583204 2421572 2265681
10393 2265681 2159669 2056783 2004494 2010270 1969789 1827277 1746326 1709675 1700710 1641490 1567309
10382 1567309 1468786 1428035 1390241 1344937 1351534 1336316 1311633 1293027 1267148 1166995 1099224
10371 1099224 1151335 1190152 1204098 1119662 1065028 1052998 1001170 970850 963004 938124 910238
10360I10238m624k5142l7374k4496k2539L7741Q001j4739j832J18K8653k8090
10348H25915k2260m3715n6731o8081K3183k9585r6563j4875r961N536l4323L7003
10336E15543L1443J15608L4794K8291J05929Q0747O9454L4896P019k7040q722
10325I87962J5552q3241q9179r3862O840L8217l4594q2839m1349k5014K0129L294
10313F21916Q6696j4366n9948o0001j9339L0224k4138j0736M5787p576m6299r9319
10301D42901j1555J959k6479k9790l3814m4969O0115l9007k3520M1186J6036K2168
10289C75231J4711m544J4671K2n3016j1055J7383L8039O0622P7748q3967r5389
10277C50456m4186m5197l8089K9383M5433J5402J9305K4452j6461j9517k1809
$$ plain form
10360 910238 905614 880472 843098 818602 796063 833804 841805 827066 825234 825352 854005 825915
10348 825915 803655 759940 703209 635128 658311 628726 532163 517288 507327 512863 478540 515543
10336 515543 546986 662594 697388 725679 831608 912355 981809 1016705 1023724 996684 987962
10325 987962 1003514 920273 831094 737232 744072 782289 747695 664856 623507 598493 618622 621916
10313 621916 708612 694246 634298 574297 554958 585182 561044 550308 596095 588519 542220 442901
10301 442901 431346 433305 406826 377036 343222 298253 358368 319361 295841 337027 353063 375231
10289 375231 389942 385398 400069 400091 347075 336020 353403 391442 452064 529812 445845 350456
10277 350456 306270 261073 222984 252367 297800 313202 332507 356959 340498 320981 299172
10266B99172k3251j246j8404M35k1886l0021J2748j2862J4508J3314J2612K6245
10254B71364J315j1179n2003n9829l3735J1018N5850O6879K2597k723n5528l2474
10242A81552k4097R053O077L6497P1733J0607N823k7798q7377l1266M6168l245
10230A93727k5386L3072K9515l654J3563r741n3425J4868L2321r333k1285O093
10218B00335k9915j4553K8408J7625p0566j4134k5420J2707P1254k0198j2456
10207A43087j4315m0269k2030O9119J22567K4002p8195J6276P1044o5144m5220
10196A80922q977J2150j0493m6109l373O2624L8488j5836J5733J4758K4045L8062
10184C01994l190J6579K6800K0510L3684Q5473p485l0204m3818o4283p158k0310
$$ plain form
10266 299172 275921 274675 256271 256706 234820 204799 217547 204685 219193 232507 245119 271364
10254 271364 272679 261500 209497 149668 115933 126951 182801 249680 272277 269554 214026 181552
10242 181552 157455 166508 172585 209082 280815 291422 297245 269447 182070 150804 196972 193727
10230 193727 168341 201413 230928 227274 240837 231096 177671 192539 224860 215527 194242 200335
10218 200335 170420 155867 184275 201900 131334 117200 91780 104487 175741 155543 143087
10207 143087 128772 88503 66473 135592 258159 282161 203966 220242 291286 226142 180922
10196 180922 171945 184095 173602 127493 124120 186744 225232 209396 225129 239887 263932 301994
10184 301994 298804 315383 342183 362693 396377 481850 474365 444161 400343 336060 328902 308592
10172C08592N8422Q3798O1773P9455K3196O7980P7183M7315O492p9971n7063n8426
10160F18746P3343M1744L7972M1853J29265J71634J03931l4501r8723q0579q5236
10149I19449j22173l4713P875L265k8360M6380L4613K3918j12580j32132j34932
10138D70610j23874r0654k3209O7412P5324l07M0593K6973M216r6287k0672o1919
10126B68206n3874k1883j431l8140N5481L6806j51682j15256j5469K9602M9618
10115D1978O145K5981j0458j9205P8551N2248O611m6075m0337o1796j4408o2920
10103d3685J2336N3349M082J974l2439L1363k354J4174M0145L1692k2357p5590
10091A2690L0104l0389j134K7021m5566j7290k8738N8957L1882K7675j229N6189
$$ plain form
10172 308592 367014 450812 512585 592040 615236 683216 760399 807714 814206 734235 677172 618746
10160 618746 692089 733833 771805 813658 942923 1114557 1218488 1183987 1085264 1004685 919449
10149 919449 797276 762563 770438 773703 745343 791723 826336 850254 737674 605542 470610
10138 470610 346736 256082 232873 300285 375609 375302 415895 442868 447084 350797 330125 268206
10126 268206 214332 192449 191018 152878 208359 245165 93483 -21773 -37242 -7640 41978
10115 41978 48123 74104 63646 44441 122992 175240 181851 135776 95439 33643 19235 -43685
10103 -43685 -31349 22000 26082 28056 -4383 26980 24626 38800 78945 110637 88280 12690
10091 12690 42794 12405 11271 38292 -7274 -24564 -53302 5655 37537 65212 63983 120172
10079A20172J7090L7188O6241K1359m2514m1182L584Q884K221Q249J3364k2322
10067A92334m3871O9400Q5900N7390J24491J28502J68109P7784J74869K18511
10057A253419J63907J71796J08802O1508K5732k5566j04253j02964j26612j98449
10047A227320j44812k07920j63312r4794j52888j15736k7499o9073M72o181k8054
10036B17523O036j2585n6339L2129J1497n4202k7809J5190K6175l0426m6990j2228
10024F7971m1139m0295O1645L806q987M0745N9250l9798n9608k2115J8219k7328
10012A2366m0151K7496N7847M7185M543l8015L30J9362j7829J321k9736K1888
10000F6607j414o6284J5977M1863O2163j8338L6721k7440o8313k5570m7902J4184
$$ plain form
10079 120172 137262 174450 240691 262050 219536 178354 181938 190822 193043 201292 214656 192334
10067 192334 148463 217863 303763 361153 485644 614146 782255 860039 1034908 1253419
10057 1253419 1417326 1589122 1697924 1759432 1785164 1759598 1655345 1552381 1425769 1227320
10047 1227320 1082508 874588 711276 616482 463594 347858 320359 251286 251758 245577 217523
10036 217523 223559 210974 154635 186764 198261 144059 116250 131440 157615 127189 80199 67971
10024 67971 26832 -13463 48182 51988 43001 83746 142996 103198 43590 21475 39694 12366
10012 12366 -27785 -289 57558 104743 109286 71271 71601 90963 73134 74455 44719 66607
10000 66607 65193 -1091 14886 56749 118912 100574 137295 109855 41542 15972 -31930 -17746
9988a7746J17290l6988m7153k0707Q815J4104L723r663L5446N2426o373r9l7177
9975E5898n1446k984K6770k100M7735K2405m2758j9085L5874L0947k7384K503
9963G6375r001k588l9243J5271K1904o239O5634L119p528n1357j4025j1941j4312
9950B6069n4763o194L0838o83J4472m010P6803j2866l0726L5010l1132K8762k4012
9937D7568M531l365j0225K705K7882m3592l2128P8819J22162O7154o3437n9966
9925A38108m1640n3463m9974J4005J5744L9874N2499K5515j5678l3116l3747k5074
9913C3053L016J5997k8787r323l508j2875k6860k8326K4456L2583M791j3537L9439
9900C0119L2051J905L1613O697K754l4665r3047k7013j0353K5140J7310j9701
$$ plain form
9988 -17746 99544 62556 15403 -5304 3511 17615 21338 11675 47121 99547 93174 93075 55898
9975 55898 4452 1468 28238 26138 73873 96278 53520 34435 70309 101256 73872 76375
9963 76375 67374 64786 25543 40814 62718 56479 122113 125232 117704 66347 52322 40381 26069
9950 26069 -28694 -34888 -4050 -4733 9739 5729 82532 69666 38940 73950 42818 71580 47568
9937 47568 52099 48734 38509 41214 69096 25504 -6624 72195 194357 261511 198074 138108
9925 138108 96468 43005 -6969 7036 22780 62654 115153 140668 124990 91874 58127 33053
9913 33053 36069 52066 23279 13956 10448 -2427 -29287 -57613 -33157 -574 4217 -9320 30119
9900 30119 62170 64075 95688 102385 105139 70474 -22573 -49586 -59939 -34799 -17489 -37190
9888c7190J8494L9264m0365j985J6990K6130M5513l6397k6820Q427q3486l2499
9876a03924N0565P1162n454k905p7939l3726K4523M9172P3596R823J6552O4799
9864A36244r557q0622q1937O1810N6763J1084l4738p7555K1600M4315k2285n6460
9852c1338j3524J2763k0133r690O5669J3828K685j2423P328J1171l437j0031K3644
9839C6512J8828o7940L20K0951J6531L8371k0064j8060l1155Q776M2331k5159
9827B0242k4595l0390l7985N6068J8311O0892L962r463j6408k3837m026P872o499
9814A4144m9106j323P2920k9049m3767j7619N723N1595j4268j283m877N0654M186
9801C7930l4738j0401k0813N8684K7286J0880J4583n8729M344k0100J0771q62
$$ plain form
9888 -37190 -18696 20568 -19797 -21782 -4792 21338 66851 30454 3634 12061 -71425 -103924
9876 -103924 -53359 17803 12349 9444 -68495 -102221 -77698 -28526 45070 54893 71445 136244
9864 136244 126687 46065 -35872 25938 82701 93785 59047 -18508 3092 47407 25122 -31338
9852 -31338 -44862 -32099 -52232 -61922 3747 17575 20260 7837 15165 26336 22899 12868 36512
9839 36512 55340 -12600 -12280 8671 25202 63573 43509 25449 -5706 3070 45401 20242
9827 20242 -4353 -34743 -72728 -16660 1651 62543 66505 57042 40634 16797 12771 20643 14144
9814 14144 -34962 -36285 36635 7586 -36181 -53800 -48077 3518 -10750 -12033 -16910 33744 37930
9801 37930 3192 -7209 -28022 30662 57948 68828 83411 24682 29026 8926 19697 18835
9789A8835k7862j601L4836m2734k8553k3330L923O031O6001J51778J24565J00299
9777C82188J47039J26088o2546j93340j64564j11259r8172J4501P842m4459M1523
9766D4841m914R055K8285J2575j8951L1256o301R944n2447q0837k0233p6772O0433
9753f4066K9829L649J3267L2701o705r319L4664o2207n0041l1141P3787R2386
9741E6804K4207L3269J0501k5053p790K355k1123o9078m699o28L5994O3369M9460
9728A47588l0164m7235l8474k2852k8269N6591J5312k0154n139j9932m0948n501
9716c9177n173k5113M1823R3403l9016m0660m697j1207n9581L2545j9634l4151
9704a10638M9695L655p77M0653N0750K1545M640o5525k5005j4341K3479K9299
$$ plain form
9789 18835 -9027 -10628 24208 -18526 -47079 -70409 -66486 -60455 5546 157324 281889 382188
9777 382188 529227 655315 592769 399429 234865 123606 25434 39935 47777 3318 44841
9766 44841 39927 48982 77267 89842 70891 102147 95846 105790 53343 -27494 -47727 -124499 -64066
9753 -64066 -34237 -30588 -17321 15380 8675 -644 34020 -28187 -78228 -109369 -35582 56804
9741 56804 81011 114280 124781 99728 91938 94293 73170 4092 -607 -1235 34759 98128 147588
9728 147588 117424 70189 31715 8863 -19406 37185 52497 32343 27204 7272 -33676 -39177
9716 -39177 -44350 -69463 -27640 65763 26747 -13913 -18610 -29817 -89398 -56853 -76487 -110638
9704 -110638 -60943 -57288 -58065 -17412 33338 54883 59523 -6002 -31007 -45348 -21869 7430
9692G430K0166J8492K5756n3176m6045j3834j8917l252J7888N809N3420J8258
9680C1995J7435K7077R742o2796n9430M6197K1691k3218L6837J1998l6740l2616
9668a1828j9583L5162R7940k4575k0427l347N0871L2910O8172J44662J77196K81006
9656H08159M25386P82275J272102J338971j10841j643076j246186o38925k81057
9647G06808k00366j79524o8776j7127n0994q4008m84J6054N577j5410n5756j4087
9635D1907m2406L1917K884m6556J5014Q4433M019k0706l5621n1362J0980O35l666
9622h528k6186J929K3785O1031L5450P583K1445q8693k1909j5178n667L4965n4637
9609c4610j6514K9389k0846l4556j9833N0263K0627K1796l3881M5760K2237l797
$$ plain form
9692 7430 27596 46088 71844 18668 -27377 -41211 -60128 -63380 -45492 -39683 13737 31995
9680 31995 49430 76507 86249 23453 -35977 10220 31911 8693 45530 57528 20788 -11828
9668 -11828 -31411 3751 101691 77116 56689 53342 104213 137123 205295 349957 527153 808159
9656 808159 1233545 2015820 3287922 4626893 4516052 2872976 1626790 987865 706808
9647 706808 506442 326918 258142 241015 190021 106013 105529 121583 127160 111750 55994 41907
9635 41907 -499 31418 34302 -12254 2760 87193 91212 70506 34885 -16477 -5497 -4862 -8528
9622 -8528 -34714 -32785 -9000 52031 87481 95064 116509 27816 5907 -9271 -14938 20027 -34610
9609 -34610 -51124 -21735 -42581 -77137 -96970 -46707 -26080 -4284 -38165 7595 29832 26035
9597B6035n8874O320l51j6752J0166K3996N5042q678o109l6320l4758k233K1007
9584b1509J9956M2705q926o3473K9737J2337l2900k1045j5155N9375L4289k8420
9572F971j9284n0427K1322K8782K8730j9997J96R56L1669q44l0640L1287P531
9559C6252n4811L8268L7158p3214r446q647J9465L7134o1549J2964N7544K4714
9547E5832J0840L8458K2275k3464m2150j6741M766K4520Q090k3306n0291j5202
9535f373j3071J9522K7453j0644l210L530J5974j0183n9140o6727j8958j2359
9523a34186O1718L4693l0796J6218J4269n1921l8884R918P9521j1466K0019K6732
9511d165q559M1522r641N9466k7985m0513j6852k7408l0296k1751l7489l7620
$$ plain form
9597 26035 -32839 -26519 -26870 -43622 -33456 -9460 45582 36904 30795 -5525 -40283 -42516 -21509
9584 -21509 -1553 41152 32226 -31247 -1510 10827 -22073 -43118 -58273 1102 35391 6971
9572 6971 -12313 -62740 -41418 -12636 16094 -3903 -3707 -2751 28918 28074 -2566 28721 36252
9559 36252 -18559 19709 56867 -16347 -25793 -34440 -14975 22159 -39390 -26426 31118 55832
9547 55832 66672 105130 127405 103941 61791 45050 49816 74336 82426 59120 8829 -6373
9535 -6373 -19444 78 27531 16887 13677 17207 33181 22998 -36142 -102869 -121827 -134186
9523 -134186 -72468 -37775 -68571 -52353 -38084 -90005 -128889 -118971 -39450 -50916 -30897 -4165
9511 -4165 -12724 28798 19157 78623 50638 10125 -6727 -34135 -64431 -86182 -123671 -161291
9499a61291J5424L9907P1148L2590k7711k561J2097K9927O5181J0860L0450n8698
9487E7323p6630R435j8190J8527J6224m3094j7095j626P5204O8118j4346J7482
9475I1332q3690o5731L1559K4981L250k2734j5610p107n446J6343k8667K8059
9463c3461J9155N2094n2037k414N4613n0360j334K6554J1864k519K455J2486j2482
9450B4614O3604N7483j3816Q667K9098Q415m7170J0543n3011k7991J427l5820
9438B6043n5375J489J3128P7864P6312N0236O8054M5638J3335o3174q1537r292
9426A62721K1055J9978j6533L9455o4807q2516j0066O2023J4562M132N736k7268
9414A28472K2186O4325N5799Q1771O6108R0522Q6281J66973N8848j50780k12654
$$ plain form
9499 -161291 -145867 -105960 -34812 -2222 -29933 -32494 -20397 9530 74711 85571 116021 57323
9487 57323 -19307 -9872 -28062 -9535 6689 -36405 -53500 -55126 20078 88196 73850 91332
9475 91332 7642 -58089 -26530 -1549 1701 -21033 -36643 -43750 -49196 -32853 -61520 -33461
9463 -33461 -14306 37788 -14249 -16663 37950 -12410 -13744 12810 24674 22155 24610 37096 24614
9450 24614 88218 145701 131885 140552 169650 178065 130895 141438 88427 60436 61863 26043
9438 26043 -29332 -27843 -14715 63149 139461 189697 257751 303389 316724 253550 172013 162721
9426 162721 183776 203754 187221 226676 161869 79353 69287 131310 145872 150004 155740 128472
9414 128472 150658 214983 270782 352553 418661 509183 595464 762437 821285 670505 457851
9403D57851j16120r3989j05948m4070O029j6650j1813J9680L9819k326j5505m3214
9391G3744m7769K8371J00415N3274L6723j7855J4253J0026p2142q6897l592m2980
9379D5571m5007Q993J782P869n6975k9192q871J4364P6057K5529J8830j8369N9871
9366A00452O4811K1712N0086j8675m8718M177n5737p0388n9970l722P0800M5350
9354A00178K8336o5429m1601j3172J126l9775L5884K8590j2428M0269l1589j50
9342C0239j9991m6220m315l4045Q11N9855j4849j7285j2688K7294J02334Q71k0871
9329E1140O95l491M4953M402q1403N588J6558j8810M593q112l594l4487K3163
9316A195l1014p52L7200l6677j0164l2106k8580M9685K4921M7172K2645o5436
$$ plain form
9403 457851 341731 247742 141794 97724 103753 87103 75290 94970 134789 132463 116958 73744
9391 73744 25975 54346 154761 208035 244758 226903 241156 251182 179040 92143 88551 45571
9379 45571 564 9557 11339 19208 -37767 -66959 -75830 -61466 14591 40120 58950 40581 100452
9366 100452 165263 186975 237061 218386 169668 173845 118108 47720 -12250 -15972 54828 100178
9354 100178 128514 63085 21484 8312 9438 -30337 5547 34137 21709 61978 30389 30239
9342 30239 10248 -35972 -40287 -74332 -73521 -13666 -28515 -45800 -58488 -31194 71140 72011 51140
9329 51140 51835 48344 93297 97699 16296 21884 38442 19632 24225 16113 12519 -21968 1195
9316 1195 -29819 -30571 6629 -30048 -40212 -72318 -100898 -51213 -26292 20880 43525 -21911
9304b1911o6376l3687P5531O9966J7234r310k2396l1091q314P099j8579l5912
9292g7746K067J9431K023J0147L8336n238K0451J6877N018l5402k3077j2810O2236
9279B2313P2544l3742l3554o9861k0998O3330K5078k5603q80j241L276K9369k3640
9266F391r25l1520o8971n0597M1374M3379j5956J1809O8676O7599J1390k4158
9254E8491k1395L9222k6852q7667j292O584K8903K0680Q211K8702q848m9782J8880
9241A3837K4091l1413j87m8205L820L4036k5655p781M2648P6223j2711m6389j337
9228B0977m6414k7424jL119q343O489R213k950K3834K7789M262L1087n385k9101
9214G152K3075j794O052K1123l084k7094J2982M551k8300J7827Q5019L4214p780
$$ plain form
9304 -21911 -88287 -121974 -46443 23523 40757 31447 9051 -22040 -30354 -23255 -41834 -77746
9292 -77746 -75679 -56248 -54225 -44078 -5742 -10980 9471 26348 31366 -4036 -27113 -39923 22313
9279 22313 94857 61115 27561 -42300 -63298 32 25110 -493 -1373 -2614 662 30031 6391
9266 6391 5466 -26054 -95025 -145622 -104248 -60869 -76825 -65016 3660 71259 82649 58491
9254 58491 37096 76318 49466 -38201 -39493 -32909 -4006 16674 24885 53587 44739 -5043 13837
9241 13837 37928 6515 6328 -41877 -38057 -4021 -29676 -37457 5191 81414 68703 22314 20977
9228 20977 -25437 -52861 -52862 -49743 -58086 -51597 -42384 -45334 -21500 6289 10551 41638 36253 7152
9214 7152 30227 28433 34485 55608 52524 25430 38412 42963 14663 32490 117509 151723 143943
9201A43943m3935N376K2774k1310r3982k2116N0377J544L33o4066J0901J6346
9189F185m5981l1132N1880J0370m2784K6031K0835o392o2203j2512K6824M5437
9177a3442m580j9542N542n470J6534N2288k130l3369j8488j4024J1842N3657l5465
9164f647K681K1868L289K765o0323m5025J4508J481j4882K6327L3819M1666J2235
9151C3762j1393m8666k1261J01003M4475J3780N711q5149n3285K5542j6671n2593
9139f4745j7770j7920m1633L8480M1175L8171l7993k8767L1916M5032P5283M248
9127F5477j2247m4054k404K1043o2961l7804q636K2952l2048R278P7383J4267
9115A0246O0945n9159o1084M7268M343j1252m025J7851k4917k1568J0340J2285
$$ plain form
9201 143943 100008 105384 128158 106848 12866 -9250 41127 42671 43004 -21062 -10161 6185
9189 6185 -39796 -70928 -19048 -8678 -51462 -25431 -4596 -10988 -73191 -85703 -58879 -13442
9177 -13442 -18022 -37564 -32022 -37492 -20958 31330 29200 -4169 -22657 -36681 -24839 28818 -6647
9164 -6647 -3966 17902 21191 23956 -36367 -81392 -66884 -65403 -80285 -53958 -20139 21527 33762
9151 33762 22369 -26297 -47558 53445 97920 111700 117411 32262 -21023 4519 -12152 -64745
9139 -64745 -82515 -100435 -142068 -103588 -62413 -24242 -62235 -91002 -59086 -14054 61229 65477
9127 65477 53230 9176 6772 27815 -35146 -72950 -81586 -58634 -90682 -81404 -4021 10246
9115 10246 71191 12032 -49052 -1784 2559 -8693 -12718 5133 -19784 -41352 -31012 -18727
9103a8727J1831o4694j8593L1531L9132P430J9975r737K8333k0415M0886k4446
9091B2506k6287l119M2336M8685m4426n891M4805P750k6984k9760l6744P205M7654
9078D7730M7497r7834p8835m1105J1322P6514M7141j2269n7530j9535L7526L8183
9066a195M5998l9226m5335n994P7558j0498J6934j3642l0329L3547J7679p3230
9054b7733k1648J2591O9895L5818o3022j8428n650m335K9256K0387J66J3515J1622
9041E2434J7937l4786l7447J6844J5488M537K0721j848m4572n7153K6341K7738
9029F234j7787L1242l2855k6220l00j9569Q461K2238J1406n3096j2025o539j1882
9016a00692L8573j533M6150M8536m5442k0680M594L445O0682P698o3863k9195
$$ plain form
9103 -18727 -6896 -71590 -90183 -58652 -19520 -12090 7885 -1852 26481 6066 46952 22506
9091 22506 -3781 -6900 35436 84121 39695 33804 78609 86359 59375 29615 -7129 76 47730
9078 47730 95227 -2607 -81442 -122547 -111225 -34711 12430 161 -57369 -76904 -39378 -1195
9066 -1195 44803 5577 -39758 -45752 31806 21308 38242 24600 -5729 27818 45497 -27733
9054 -27733 -49381 -36790 33105 68923 5901 -12527 -18177 -22512 6744 27131 27297 40812 52434
9041 52434 70371 35585 -1862 14982 30470 35007 55728 53880 9308 -47845 -21504 6234
9029 6234 -11553 19689 -13166 -39386 -39686 -59255 -50794 -28556 -17150 -70246 -82271 -88810 -100692
9016 -100692 -62119 -63652 -17502 31034 -14408 -35088 -30494 -27049 33633 41331 -22532 -51727
9004e1727P1188O1348o0855n4969P474j7232k842R7143O4471l2561j02141o1283
8992h1986M8417M0642q7304M5524K4568j0482k850j0485J3582R54P0607Q5629
8980A36816m6185r0182m3646n3606J2613K3254j6741L9333J7112l9844J3398j8029
8968f5707K0696M6958Q068m3582L5518P5440K545j6208O266n1483J9610L4488
8956G2609J3341o6692l3768m792m4386m279L8068k2439K5970K8655J2268o056
8944H499r172j7307k8674j5885K3205M5796k7997L09O472l1951m187P2165n027
8931A6246l0610K78j6477P167k923K9594K4242l6465m6882J0688L345r470K5950
8918b5317N5170k6647j61j6291L6313p512j3077l4702p5P057l0655m0134J8202
$$ plain form
9004 -51727 19461 80809 19954 -35015 -27541 -44773 -47615 49528 113999 81438 -20703 -81986
8992 -81986 -33569 7073 -80231 -34707 -10139 -20621 -23471 -33956 -20374 -19420 51187 136816
8980 136816 90631 449 -43197 -96803 -84190 -60936 -77677 -38344 -21232 -61076 -47678 -65707
8968 -65707 -45011 1947 10015 -33567 1951 77391 79936 63728 69994 18511 38121 72609
8956 72609 85950 19258 -14510 -19302 -63688 -67967 -29899 -52338 -26368 2287 14555 8499
8944 8499 -673 -17980 -46654 -62539 -39334 6462 -21535 -21226 -14754 -46705 -50892 21273 16246
8931 16246 -14364 -14086 -30563 -23396 -26319 3275 27517 -8948 -55830 -45142 -41797 -51267 -25317
8918 -25317 29853 3206 3045 -13246 23067 15555 2478 -32224 -32299 -25242 -55897 -96031 -77829
8905g7829M4712l605j156M4780n5392n4440L6677J1358k1031J9098Q2748L3192
8893E9112L050k5987L0699k354j0917l2376o376R224n2338p7647M4357j8604K8531
8880e1626N8842m3801J1039k75j6367K0271N702L6156k0358l1100l4688K2446
8868d3759J084L8475k7070m4084M6495P9051Q9048J259r0181n7412k0435j2528
8856d0057O6727Q943n3698l5418J8647K887J3599r628Q87J1999O6568J9361j8921
8843E1896k8483m4617K0067p26k5035K7861M7732J3538M7670M2554m6431l7626
8831F8400l9199Q844Q788O4149l7598n2470J4202L5049M890R153m4403k6755K824
8818A5874k5059M6012K3254m644n340n2003k1116J2996L1226m128m4255o620n1087
$$ plain form
8905 -77829 -33117 -36722 -37878 6902 -48490 -102930 -66253 -54895 -75926 -56828 25920 59112
8893 59112 62162 36175 66874 64520 53603 21227 14851 24075 -28263 -105910 -61553 -80157 -51626
8880 -51626 7216 -36585 -25546 -25821 -42188 -21917 -16215 19941 -417 -31517 -66205 -43759
8868 -43759 -42675 -4200 -31270 -75354 -28859 50192 139240 140499 50318 -7094 -27529 -40057
8856 -40057 26670 35613 -18085 -53503 -34856 -31969 -18370 -27998 -27111 -15112 51456 70817 51896
8843 51896 23413 -21204 -1137 -1863 -26898 963 48695 62233 109903 152457 106026 68400
8831 68400 29201 38045 46833 110982 73384 20914 35116 70165 75055 84208 39805 13050 15874
8818 15874 -9185 36827 60081 55437 50097 -1906 -23022 -10026 21200 17072 -27183 -33803 -84890
8805h4890m947N7372n268J7191k7059r36O339J7327P1487J8361q000J4123J2164
8792H3264J1932o954j709q701J5747k1521l1946k3754p20K0678j5374O105L6874
8779F3921K1790q3508m4254K9874K3892j8132K9208K0987L2406n149k7630o0931
8767a7526r0956l0729O9239P131L3134K3051L0943M147j4776K2675L1855O679
8755G4867L2288Q322K0386L93m9756p1553l026L1488m203m8763l6475o512j1294
8742f3838n7746N1330J1794M7563Q3751j3092j2096j8196k5142l9466M2409J7670
8730B4941k9106l1709j2808O295O5268R2939o0323l4473N1464K5312q04n9646
8718C7350m2336j2465q2573o280O4055M1915l5450L8830M6419O6097L0822k5298
$$ plain form
8805 -84890 -89837 -32465 -37733 -20542 -47601 -48537 -42198 -24871 46616 64977 56977 71100 83264
8792 83264 95196 88242 86533 77832 93579 72058 40112 16358 15638 36316 20942 27047 63921
8779 63921 85711 2203 -42051 -12177 11715 -6417 22791 43778 76184 71035 43405 -17526
8767 -17526 -108482 -139211 -69972 -62841 -29707 -6656 24287 28434 13658 36333 68188 74867
8755 74867 107155 115477 135863 136256 86500 14947 11921 43409 39206 -9557 -46032 -52544 -63838
8742 -63838 -121584 -70254 -58460 -10897 72854 59762 47666 29470 4328 -35138 7271 24941
8730 24941 -4165 -35874 -48682 -42387 22881 115820 55497 21024 72488 97800 96996 37350
8718 37350 -4986 -17451 -100024 -106304 -42249 -334 -35784 3046 49465 115562 146384 121086
8706A21086p8949j672J4335P7361j569o8587m2987K3024N22L2200J7680Q016j2854
8693H7606o3292n6524n6006L6524N1567K7592K1428k6208M4799M8273j2823L9299
8681A42235J9665q020k1406k4739J1020j7691l6795K1436L9896j1992l7864R678
8669H5423M5400k7805k3404l543j4188N201J9155k4669R60L1669j6616J2389L3459
8656A23431k952m7384J616P963j5389L7322K6935k417k7401p2629J6848N4435
8644A00378Q4563L4281n5306n6626o1128l9708M0999O0245l56K132k3896J7531
8632A03109j5100L0216j5647j0102N5138N8535J7486k7573o1526l2791j4973m108
8620H2664L1328k8782M2750J063j4591L0864q236n7756m6961j1522J1837O1780
$$ plain form
8706 121086 42137 40465 54800 132161 130592 62005 19018 42042 42564 74764 92444 100460 87606
8693 87606 24314 -32210 -88216 -51692 -125 27467 48895 22687 67486 115759 102936 142235
8681 142235 161900 153880 132474 107735 118755 101064 64269 85705 125601 113609 75745 85423
8669 85423 130823 103018 79614 76071 61883 67084 86239 61570 62530 94199 77583 89972 123431
8656 123431 120479 73095 74711 82674 67285 104607 131542 129125 101724 29095 45943 100378
8644 100378 184941 219222 163916 107290 46162 6454 47453 107698 107342 109474 85578 103109
8632 103109 88009 118225 102578 92476 147614 206149 223635 196062 134536 101745 86772 82664
8620 82664 113992 85210 127960 129023 114432 145296 137060 79304 32343 20821 32658 94438
8608I4438M4602O912l8685k4645J6517K9135L0585O6575j4173m3450K3846N7704
8596B49361n8457j6369J434o1103j7278M2745K4327O1009k5398k9527O1788L9774
8584B72306n305k0207q9408o9776k8734N2545L0497n9405M6794N8486M7444r5389
8572A39848q9000j5570M821L3016O7343K0941M140j1649m0199J6251K4567p0814
8560H3695l136Q0113L5618l0910O431m0146m361J9042N7202o7206n3785K4989
8548A07546O036l2239M4216O237j5913j8664O3096J2564j0775p2121o884L9492
8536A22591N1613n8616l8392m5160P2489N3457l1402R923K6682q6232p3631R293
8524A2615M0067k2469Q615n256m0036P332M6552K1148J6988J7921J7499l681n8167
$$ plain form
8608 94438 139040 145952 107267 82622 99139 128274 158859 225434 211261 167811 191657 249361
8596 249361 190904 174535 175969 114866 97588 140333 164660 225669 200271 170744 232532 272306
8584 272306 267001 246794 157386 87610 58876 111421 141918 82513 129307 187793 235237 139848
8572 139848 50848 35278 40099 73115 140458 161399 165539 153890 113691 129942 154509 83695
8560 83695 80559 160672 196290 165380 171811 131665 127304 146346 203548 136342 82557 107546
8548 107546 113582 81343 125559 131796 115883 97219 160315 172879 162104 89983 83099 122591
8536 122591 174204 115588 77196 32036 104525 157982 126580 136503 163185 76953 3322 12615
8524 12615 52682 30213 38828 33572 -6464 868 47420 68568 85556 103477 120976 117295 59128
8511E9128k1043k2042J9436O6521L0136l0438n0127j7880J3209R0304M2618k6955
8499A52867q0963p0203k2248J7915J09896M6236q983N108j5083m623p954l5129
8487H6836j3945M8556O3633R0359K2229j03939j21653l1795j8622M0026L1233
8476I2918m913o2101j4825J9103K1287j583M5078k9688m0589K3551k2733N004
8464C0509J2325m9030p195M1810r075N306l4575N713M1625n5218m2752L2922M0248
8451A2613j4932P556L81k2487O0751P8987k6765l3580K016M1407P8926O0371K2778
8438B68022j1745j35123p3409K6890j6490n0262P30P604J4279j8125m2498j0798
8426d0925Q684N2654K4906J0551j8625N5469l5102q7494m561o7244j390Q606N177
$$ plain form
8511 59128 38085 16043 35479 102000 132136 101698 51571 33691 46900 137204 179822 152867
8499 152867 71904 1701 -20547 -2632 107264 153500 144517 149625 134542 129919 121965 86836
8487 86836 72891 121447 185080 275439 297668 193729 72076 40281 21659 61685 92918
8476 92918 88005 25904 11079 30182 51469 49886 94964 65276 24687 48238 25505 30509
8464 30509 42834 -6196 -13391 28419 19344 24650 -9925 -4212 37413 -17805 -60557 -27635 12613
8451 12613 -2319 5237 5618 -16869 43882 122869 96104 62524 64540 105947 184873 245244 268022
8438 268022 256277 121154 47745 74635 58145 7883 8613 16217 30496 12371 -30127 -40925
8426 -40925 -32241 20413 45319 55870 37245 92714 57612 -29882 -34443 -101687 -103077 -94471 -89294
8413h9294q8M6615K7979L488Q7744L8585k6372k2707L0625K8332p7329O862k0230
8400C4210o1273j2881M9086K8039k5655M6464m5883p7800n3527O575J5850M6153
8388e0642J1060j4184L796j8116K4915L6507R419l180J7881m171k5068j196J4200
8375A221J7365o4456K9161K7953n7399K7544K7324J2850k7511j7200L5295k853
8363I294l8002j435L5202J9323k873l193l664l3500M2410K7591J4814K1P6745
8350A42733p2197q1812j4912L1729m498m617m2539L9201k3742K597J3419j7951
8338c2589j1229P2468L4883k0034m6340L797k634N988J9193J8525M4184o391k7785
8325E2036k1751j5812l4779k8058n0368M6490M5067K4422m393o6108L6082N6935
$$ plain form
8413 -89294 -89382 -42767 -14788 -11300 76444 115029 88657 65950 96575 124907 47578 54440 34210
8400 34210 -27063 -39944 9142 37181 11526 57990 12107 -65693 -119220 -112645 -96795 -50642
8388 -50642 -39582 -53766 -49970 -68086 -43171 -6664 2755 -425 17456 13285 -11783 -12979 1221
8375 1221 18586 -45870 -16709 11244 -46155 -18611 8713 21563 -5948 -23148 12147 9294
8363 9294 -28708 -30143 5059 24382 21509 18316 14652 -18848 23562 51153 65967 65988 142733
8350 142733 70536 -11276 -26188 5541 1043 -3574 -46113 -6912 -30654 -28057 -14638 -32589
8338 -32589 -43818 28650 63533 43499 -2841 956 -1678 4310 23503 42028 86212 79821 52036
8325 52036 30285 14473 -20306 -48364 -98732 -52242 -7175 17247 12854 -53254 -17172 39763
8313C9763k9795n9260L7827l0261p225L4967m4283n2337j0473J27987R6825m956
8301I8779o100O6763J0780p2702k5002j2879l1500o2365j5638O019K4068m67K6761
8288F517j0619j8832O3755K665o7192L1575J9988l7889j7680j8054k9999J7488
8276e8277K4974L4838J3475l2944j020M2562l8572n6108M4629L3057l6986R419
8264b0953J3475J9293K7089k9417K690Q263j4093r776n2826K9714M8263q584k5723
8251a2585k2530j3689k8562P0470K2177L3977n6545p7512J1193Q1624J569k731
8239F856k4961N2203N344j4417j00M907l8565j4834M6413j8364n3865J2184P821
8226b9378m994K1742q563m4097q399M4933m0718P6410J2205J3511n9832m9398
$$ plain form
8313 39763 9968 -49292 -11465 -41726 -48951 -13984 -58267 -110604 -121077 6910 103735 98779
8301 98779 92679 159442 170222 97520 72518 59639 28139 -34226 -49864 -43845 -19777 -20244 6517
8288 6517 -4102 -22934 40821 43486 -23706 7869 27857 -10032 -27712 -45766 -75765 -58277
8276 -58277 -33303 1535 15010 -17934 -18954 23608 -14964 -71072 -26443 6614 -30372 -20953
8264 -20953 -7478 11815 38904 9487 12177 20440 6347 -3429 -56255 -26541 21722 13138 -12585
8251 -12585 -35115 -48804 -77366 -6896 15281 49258 -7287 -84799 -73606 8018 9587 6856
8239 6856 -18105 34098 39442 25025 24925 29832 -8733 -23567 22846 4482 -49383 -37199 -29378
8226 -29378 -34372 -12630 -21193 -65290 -73689 -28756 -69474 6936 19141 32652 -27180 -76578
8214g6578P8639L6926l9041k4698K9801K7999o172L092K1305J2395o385l4440
8202B2843q645j8995o5166m0499L4135J1358N6551J8317q5938p156M1265J7022
8190b4908k7527L1135R4827l5839k3819j9839K3033k2347N790J5789L2314J6856
8178F5465n8883p1222N903L8747O009J7560n230k4877p060j5587k3897k1410o892
8165a01374O4123J8601j38K3627j6703n8493K922m2696M8955j0250m7978k391
8153a21795J11536M9292j1598l0944k5568k6938k7045r974K4128O8321l2970q386
8141d1941o687j097K6601J9082O198k7094j4704k2629K7587K9579k6547N8985
8129B7333O4701n8455k3705l3137L7444j7354j1945J0377j3772L244O8917N979
$$ plain form
8214 -76578 2061 38987 -54 -24752 5049 33048 26876 29968 51273 63668 57283 22843
8202 22843 14198 -4797 -69963 -110462 -76327 -64969 -8418 9899 -76039 -83195 -41930 -24908
8190 -24908 -52435 -21300 73527 37688 13869 -5970 17063 -5284 506 16295 48609 65465
8178 65465 6582 -64640 -58737 -19990 -13981 3579 -1651 -26528 -33588 -49175 -73072 -94482 -101374
8165 -101374 -37251 -18650 -18788 4839 -11864 -70357 -67435 -110131 -61176 -71426 -119404 -121795
8153 -121795 -10259 39033 27435 -3509 -29077 -56015 -83060 -93034 -68906 -585 -33555 -41941
8141 -41941 -48628 -49725 -23124 -4042 2156 -24938 -39642 -62271 -34684 -5105 -31652 27333
8129 27333 92034 33579 9874 -23263 14181 -3173 -15118 -4741 -18513 -15269 53648 59627
8117E9627l2637n2988k4325j2918Q926P190k9019K0622M3583N98o4277R063O9304
8104B749M3324j63k8138M5072K4717k9622o1976m0368k0066j0007O030P849l774
8091f4373J6869k4462L5169R5861l6271r4828l4630K4462L9512K8757P1751K4085
8079H1902m1166P506j0297n3692P653J8066K9396o278k7440Q517l6081k9286N369
8066d5831N6307P5220k9590J3808l9669m1524q106K9890m049L4186J4153o2765
8054g970r0048J5756L5860M6658K3420j8609r415K4645K4136J8369j8707P161
8042E1256m1719n1692M2251K845o462k5643j2172p713P9547M6340j3601J2065
8030G5302k2502l574K7925l4147o4839q3155J9690L4301k5897p617j973N4288
$$ plain form
8117 59627 26990 -25998 -50323 -63241 -54315 -47125 -76144 -55522 -11939 -11341 -75618 -66555 2749
8104 2749 46073 45910 17772 62844 87561 57939 -4037 -44405 -64471 -74478 -68448 -60599 -64373
8091 -64373 -47504 -71966 -36797 59064 22793 -72035 -106665 -82203 -42691 -13934 57817 81902
8079 81902 40736 48242 37945 -15747 -8094 9972 39368 33090 5650 14167 -21914 -51200 -45831
8066 -45831 10476 85696 56106 69914 30245 -11279 -19385 10505 6456 40642 54795 -7970
8054 -7970 -98018 -82262 -46402 256 23676 5067 -4348 20297 44433 62802 44095 51256
8042 51256 9537 -42155 96 2941 -3521 -29164 -41336 -49049 30498 76838 63237 75302
8030 75302 52800 49226 77151 43004 -21835 -104990 -85300 -50999 -76896 -84513 -86486 -32198
8018c2198Q269J7818J0602L6164Q2024Q691p2545l1190k7026m1131k1489K0353
8006d1658J9578L7093K5126Q859O8566J9073m3934q4585O8129Q6497M3057m1281
7994A64520o0426m194j5373J2491J5673N9903K5797N363K2104m462j6170N6828
7982B62054J8985j7598l6668k5872j3319k7320j014k7204j1007K020l0145K3991
7970A16903k6063k4631k8231k9920M5764K5563j028l3062R640L1587j778J8311
7958A03055N6740N0200K1169O4616K8500n322k3461p2266m0875k7056l1268n8173
7946F5859Q9486J7728m3496P821N7053N6411j259m2485o8605j9364K5383n6781
7934H7751q143M8272L9096l2745m3925l5604l0595L3355O1042J5472j9258k1765
$$ plain form
8018 -32198 -23929 -6111 4491 40655 122679 131370 58825 27635 609 -40522 -62011 -41658
8006 -41658 -22080 15013 40139 48998 117564 136637 92703 8118 76247 162744 205801 164520
7994 164520 104094 99900 84527 97018 112691 172594 198391 203754 225858 221396 205226 262054
7982 262054 281039 263441 226773 200901 187582 160262 159248 132044 121037 123057 92912 116903
7970 116903 90840 66209 37978 8058 53822 79385 78357 45295 54935 86522 84744 103055
7958 103055 159795 209995 231164 295780 324280 318958 295497 223231 182356 155300 124032 65859
7946 65859 155345 173073 129577 137398 194451 250862 249603 207118 138513 119149 144532 87751
7934 87751 79608 127880 166976 134231 90306 54702 24107 57462 118504 133976 114718 92953
7922I2953m606J291M046k3128o8192l3881n3312M3860L9032N2726M0994n0657
7910D1126o4515L3482L6738m3432r79P0196l3106M8375n6663j6358N4754L082
7898G2700j7427m2279O094J6398K997k0994k9749j323r494o7559J5791J1571M9630
7885a3644N3857j9112l7418M4589J6106l7962k4939K4309L9131q367L5192j8318
7873E3424m9260l2350k1221L7063j9464k2465J1074k6174P003M67k5171M0707
7861d6367P254l7819m4436N0450K9595M9021O4929J7590L182n3659M6272j6740
7849F9272j7097l93K268M504j1997Q771L6338k8304k7955L7170J3160o332o3485
7836A5920j6479q160j9574K8716q264j0171L5375o57R210O849n421k3855L2164
$$ plain form
7922 92953 88347 89638 93684 70556 2364 -31517 -84829 -40969 -1937 50789 91783 41126
7910 41126 -23389 10093 46831 3399 2420 72616 39510 87885 31222 14864 69618 72700
7898 72700 55273 12994 19088 35486 38483 17489 -12260 -13583 -23077 -90636 -74845 -63274 -13644
7885 -13644 40213 21101 -16317 28272 44378 6416 -18523 5786 44917 36550 71742 53424
7873 53424 4164 -28186 -49407 -12344 -31808 -54273 -43199 -69373 -62370 -61903 -87074 -46367
7861 -46367 -39113 -76932 -121368 -70918 -41323 7698 72627 90217 93399 39740 86012 69272
7849 69272 52175 51782 54050 58554 46557 55328 91666 63362 35407 72577 85737 79405 15920
7836 15920 -559 -8719 -28293 423 -7841 -18012 17363 16706 25916 32765 27344 3489 35653
7823C5653J251k3028k1578l4695o6267q438J0601k3892L4605L0189J3252L1118
7811b1229l3671J714q1240k5509K2190L2423M2814K7857J0882k2629L2970J8213
7799D785k9095K5008l942p1075n9509N9975L486J1128l087J6013M2146K2831j3574
7786E090m4322L3792J8542k4723J738k8376n5272Q753K2853Q39M337L0711l782
7773b9820k7453J5096L7023M4587l5623k0350l2207O189j9526j6565j004j5733
7761i5386L4829K5406K3628l5577K9535L4789j6565m760k4796M8258k5751n990
7749a2380j7383j3415L4732N2181m9859l4260j1554K3568P653k7387M9832R7620
7737I9348n151l9490k6021N1065k6944q216J0817Q65K0974L8670O579k5700n5596
$$ plain form
7823 35653 36904 13876 -7702 -42397 -108664 -117102 -106501 -130393 -95788 -65599 -52347 -21229
7811 -21229 -54900 -53186 -134426 -159935 -137745 -105322 -62508 -34651 -23769 -46398 -13428 4785
7799 4785 -24310 698 -3244 -74319 -133828 -73853 -70367 -59239 -62326 -46313 -4167 18664 5090
7786 5090 -39232 -5440 13102 -11621 -9883 -38259 -93531 -84778 -61925 -61086 -56749 -26038 -29820
7773 -29820 -57273 -42177 -5154 39433 3810 -16540 -48747 -42558 -62084 -78649 -79653 -95386
7761 -95386 -60557 -35151 -11523 -47100 -17565 17224 659 -4101 -28897 19361 -6390 -12380
7749 -12380 -29763 -43178 -8446 43735 -6124 -40384 -51938 -28370 -20717 -48104 1728 99348
7737 99348 94197 54707 28686 79751 52807 44591 55408 56273 77247 115917 122496 96796 41200
7724D1200m4357L6689K7998r168l4034q1074k4680L4086N7499L4641m1921m9313
7712e2434P571P8806Q86o9977k9727j6543J3467J9339O8261N2917k2566m0452
7700I548j528K8287l2118M8857k2196O331M300o2889k3146j4374q506j3484j5897
7687i6815J3640M9428K4752l7843L2856O1k6769j5528K5388m903n6071o1945J900
7674a51849P1897M1505L150K2582M9290k217n2158J2124N9177k4777l2522l9760
7662d3558n6746R0277O0171m2088L093K37k215o0720k0267M2387J9637k1733N8985
7649B7460J2161r398J7063n368r045l3826k7862J8198M5141J0182j2259q1392
7637d8945j9433P0867K5207l8998M2516K7726p6527m9176j9461J4241l9896l8146
$$ plain form
7724 41200 -3157 33532 61530 52362 18328 -62746 -87426 -53340 4159 38800 -3121 -52434
7712 -52434 -44863 33943 34829 -35148 -64875 -81418 -67951 -48612 19649 72566 50000 9548
7700 9548 8020 36307 4189 53046 30850 37181 41481 -21408 -44554 -58928 -67434 -80918 -96815
7687 -96815 -83175 -33747 -8995 -46838 -13982 -13921 -40690 -56218 -30830 -35733 -91804 -153749 -151849
7674 -151849 -79952 -38447 -35297 -12715 36575 34358 -17800 -5676 53501 28724 -3798 -43558
7662 -43558 -100304 -10027 50144 8056 11149 11386 9171 -51549 -71816 -29429 -9792 -31525 27460
7649 27460 39621 30223 47286 41918 32873 -953 -28815 -10617 34524 44706 32447 -48945
7637 -48945 -68378 2489 27696 -11302 31214 58940 -17587 -66763 -86224 -71983 -111879 -150025
7625a50025K9998J8333p007r696M3220N387k6082O1103L0117m2952L1655M6930
7613C0981l6262m4884J4117M168j3097R854J2101J4191k5199n4744K3566n709
7601g0917k410L1317n173P6697L530q9493m2336l3061N286L2359M6458K9221J9012
7588D90j6341p418m5111K1628L5640Q724K1726J412K2664l600k0592n9128l8602
7575g8508J9962K909K6390J9322J8748l7235l003L852j9185L6501R383l927O773
7562A982l7634M3139N5942J0486J6222k8685n5192n170M3570J1394q4731k3947
7550e2624R5031O360o4807l9026j2233j4332L9377N9698K9524j1413l451L378
7538C5482j9762l0563L4687N8201j2674l5786J6014O8080L6166k384k2699q870
$$ plain form
7625 -150025 -120027 -101694 -108701 -118397 -75177 -69790 -95872 -34769 -4652 -47604 -15949 30981
7613 30981 -5281 -50165 -36048 -31880 -44977 -35123 -23022 -8831 -34030 -88774 -65208 -70917
7601 -70917 -73327 -42010 -47183 29514 33044 -56449 -98785 -131846 -126560 -94201 -47743 -18522 490
7588 490 -15851 -23269 -68380 -46752 -11112 -2388 19338 20750 43414 39814 19222 -39906 -78508
7575 -78508 -58546 -55637 -29247 -9925 8823 -28412 -31415 -27563 -46748 -10247 -864 -4791 1982
7562 1982 -35652 7487 63429 73915 90137 61452 6260 1090 44660 56054 -28677 -52624
7550 -52624 42407 48767 -16040 -55066 -67299 -81631 -42254 17444 46968 35555 32104 35482
7538 35482 15720 -14843 19844 78045 65371 29585 45599 113679 149845 147461 124762 115892
7526A15892r357L4200J0904R595q3757q5714p6931K0639R5434J0351K096n93K0353
7513F3112k619k3115j8819j2362j4027l3174J1452M2277n3186o9406K2045o779
7501i4601L2308K4114J0145J2349L2725k3728m0394n214O256k6697N919M5309
7489b1509j2355N0784L4626o1379m3465K596l0866n1371N9526R1034K1887m6191
7477f683K7145k9788l1639O4392K6590R625m7768J37m5909n0952J3822J1502Q43
7464e8683J3923j0218o438M0709K3454k4908j9220l811j7101J2636R861M6254
7452F458p530J6164j6805m689N2161k9442R6k3652K3122J9155l1501l103J7366
7439A7800k8617j2784o6025o212K9099K4209O2693l5759o9606m1446Q2908O9144
$$ plain form
7526 115892 106535 140735 151639 161234 77477 -8237 -85168 -64529 30905 41256 43352 42759 63112
7513 63112 60493 37378 18559 6197 -7830 -41004 -29552 12725 -40461 -109867 -87822 -94601
7501 -94601 -62293 -38179 -28034 -15685 17040 -6688 -47082 -52296 -46040 -72737 -66818 -21509
7489 -21509 -33864 16920 51546 -9833 -53298 -50702 -81568 -132939 -73413 17621 39508 -6683
7477 -6683 20462 -9326 -40965 23427 50017 59642 11874 12011 -33898 -84850 -71028 -59526 -58683
7464 -58683 -44760 -54978 -61416 -20707 2747 -22161 -41381 -45192 -62293 -49657 -39796 6458
7452 6458 -1072 15092 -1713 -6402 45759 16317 16413 -7239 15883 35038 3537 434 17800
7439 17800 -10817 -23601 -89626 -95838 -66739 -42530 20163 -15596 -85202 -126648 -43740 25404
7427B5404l2491l8992j9078J0291k4134j3650j2624l8429L1473O1070L6704m9096
7415f3552N048O0313K5673q085j9208p959L408M9510L2077j0966p9404l6874n834
7402e5853L2314k0613r877n3336J2055M8259N9405J7060j7377q379j4861k4308
7390c5511m8091k0434O81K4645R949N1373M1508L1027m7762l2851k4496l168Q4608
7377C1478M2672J0597p903l4390j7457L425n7815l2438L9389K7775l964L4939
7365C6308M384n704o9850j1367J6724l4822L4874K3291K8817m4998o6237J2859
7353g5721O5741M2883m9544q697J8074k1710O362K6120L392J8429k1637o3576
7341e9884o5994n8472P4273Q9569J8132k1019Q069j2427O973j8992m2652k0056
$$ plain form
7427 25404 -7087 -46079 -65157 -54866 -79000 -92650 -105274 -143703 -112230 -51160 -14456 -63552
7415 -63552 -58504 1809 27482 19397 189 -7770 -4362 45148 77225 66259 -13145 -50019 -55853
7402 -55853 -23539 -44152 -54029 -107365 -95310 -47051 12354 29414 12037 3658 -11203 -35511
7390 -35511 -83602 -104036 -103355 -78710 -68761 -17388 24120 55147 7385 -25466 -49962 -53130 31478
7377 31478 74150 84747 76844 42454 24997 28422 -29393 -61831 -22442 5333 1369 36308
7365 36308 40692 34988 -34862 -46229 -29505 -64327 -29453 -6162 22655 -22343 -88580 -75721
7353 -75721 -9980 32903 -16641 -25338 -7264 -28974 -22612 3508 6900 25329 3692 -59884
7341 -59884 -125878 -184350 -110077 -20508 -2376 -23395 -15326 -27753 -20780 -39772 -82424 -102480
7329a02480P1098J9575o889j4517m6775k0252N9175P1431L3878L427J9933q9741
7317b137o9457P30K7775P344J1226K6339l9179m9971K4577J8135n2532M0333M6345
7304a0472j1616Q872L781K2981N252J5143j0958m7929j3557M3671K5940m25k2350
7291H333m0972J821k0424k9810L6039L7426m60n8109J3494l530j8516J19352j2822
7278C1822p5606j8469R5749L577l9953k3786K6217M1844K6845N726k003K7648
7266I9611l5272n9725J1852j8241r1869m313O5690K9457m7304l0754K5014K0543
7254c5311M2217L1892j5900K961J2509j8473n7938p3911J2149O4469Q803L5466
7242H933j8786l7497L9143L0415n544j0951q953N872P177j1670L502K6673L9438
$$ plain form
7329 -102480 -31382 -11807 -18696 -33213 -79988 -100240 -41065 30366 64244 67671 87604 -2137
7317 -2137 -71594 -70864 -43089 -35745 -24519 1820 -37359 -87330 -62753 -44618 -97150 -56817 -10472
7304 -10472 -22088 -13216 -9435 13546 18798 33941 22983 -24946 -38503 5168 31108 30683 8333
7291 8333 -32639 -30818 -51242 -81052 -45013 -7587 -8047 -66156 -52662 -56192 -74708 44644 31822
7278 31822 -43784 -62253 33496 37073 -2880 -26666 -449 41395 68240 73966 71963 99611
7266 99611 64339 4614 16466 -1775 -93644 -97957 -32267 -2810 -50114 -80868 -55854 -35311
7254 -35311 6906 38798 22898 25859 38368 19895 -38043 -111954 -99805 -35336 -26533 8933
7242 8933 -9853 -47350 -8207 22208 16664 5713 -3240 2632 9809 -1861 1641 28314 67752
7229F7752k679k0805n4715k5208k2115N4129o4441k2801K3479K1838l045K8115
7217b0496k6392J5009R884L4373k3733m7037J2076R3348k6969n2310m6157m136
7205h2540J8879M1364k2016n568J15921J4910l2955Q511j3755M872j15387m1958
7193a09722M4187M8064j2205j6241k2225K3688J0624k1991k9484J8990N3952M929
7181g434l4829o562J4339P329J6763j6121n000k0525k0985L252K8595M6109J7786
7168B2717O1384j0617l9119p5994l1256l8511K2118N3692M476J7141l801M411
7156a3359J0380K1363L8946L1685J0908l8751M514l245n2526l1659K0321J4903
7144A3480k6344l5991m76K1412j3327n3131J3897N0833q660n919O5965L0653l2148
$$ plain form
7229 67752 65073 44268 -10447 -35655 -57770 -3641 -68082 -90883 -67404 -45566 -48611 -20496
7217 -20496 -46888 -31879 -21995 12378 -11355 -58392 -46316 47032 20063 -32247 -78404 -82540
7205 -82540 -63661 -22297 -44313 -49881 66040 80950 47995 56506 42751 47623 -67764 -109722
7193 -109722 -65535 -17471 -29676 -45917 -68142 -44454 -33830 -55821 -85305 -66315 -12363 -7434
7181 -7434 -42263 -48825 -34486 -27157 -10394 -26515 -31515 -52040 -73025 -69773 -41178 4931 22717
7168 22717 84101 73484 34365 -41629 -72885 -111396 -89278 -35586 -31110 -13969 -17770 -13359
7156 -13359 -2979 18384 57330 89015 99923 61172 65686 62441 9915 -21744 -1423 13480
7144 13480 -12864 -48855 -49331 -27919 -41246 -94377 -80480 -29647 -38307 -44226 21739 52392 20244
7131B0244m1891J7367N0818L4291j7763J8000K7469n9972m2378p4486n7031N2168
7119g3164P0205j7097n9203M2967R2169l9034m213l7586n2703N03M5380L1785
7107IM559l6409N370M3269K3410K8793j2135l7545m8800K49M1511m6346m2263
7094g6328n2607n056k7768M0294M4316K6088j9753l875J3151N04r481l74k9269
7081a00158k2159M3145O3240P9358R733l4842p7641k5551M1071O4063M0290j792
7069G8757r4449o834k2303l9509N2258M1116L1184o3889o3208J1938J0749J9664
7057d4526n117n2530M4324J9800N0673L8548o2557o5693J6065j1902n1496j7196
7045a41607Q2965M0231l4501J6793J9822m0537L8859M7257n2584k2926k9k3397
$$ plain form
7131 20244 -21647 -4280 46538 80829 63066 81066 108535 48563 6185 -68301 -125332 -73164
7119 -73164 -2959 -20056 -79259 -36292 55877 16843 12630 -24956 -77659 -77156 -31776 9
7107 9 4568 -31841 -26471 16798 40208 69001 56866 19321 -29479 -29230 12281 -34065 -76328
7094 -76328 -128935 -133991 -161759 -121465 -77149 -51061 -70814 -74689 -61538 -61034 -70515 -70889 -100158
7081 -100158 -122317 -79172 -15932 63426 73159 38317 -39324 -64875 -23804 40259 80549 78757
7069 78757 -15692 -22526 -44829 -84338 -32080 9036 40220 -23669 -86877 -74939 -64190 -44526
7057 -44526 -49643 -102173 -57849 -38049 12624 51172 -11385 -77078 -61013 -72915 -124411 -141607
7045 -141607 -58642 -18411 -52912 -36119 -16297 -56834 -17975 29282 -23302 -46228 -46257 -69654
7033f9654L4880R7841m6386k8075p4462n1624j9507M0708j0856n249L4412Q8365
7021i607M6998L5215L9890k4018j8295l6229m1276l5312p114J7144J9182O305
7009g117M4581l954J2275K1484J5915m608p3397q493j6624j5368M3483n112j4704
6996a1639P415P333k9511J749P909J0332M5698O744k0841k273n9076r424p002
6983e2586m4884o133K1008O6764n8687l6735l04j5363N0332K2606L7486M4366
6971B7870K8844M4533R819o2798n4515l3847m3509r73L2299K0349L1299j6613
6959a7242p2504m456k6845Q254J0891J5849J5093L3391J1272p308o960M5515L2487
6946C7437l9588j9325K9435M095k0259k4705m9171j0252O889L4986J9207n8137
$$ plain form
7033 -69654 -34774 63067 16681 -11394 -85856 -137480 -156987 -116279 -127135 -132384 -97972 -9607
7021 -9607 37391 72606 112496 88478 70183 33954 -7322 -42634 -49748 -32604 -13422 -7117
7009 -7117 37464 33510 45785 67269 83184 78576 5179 -3314 -19938 -35306 8177 3065 -11639
6996 -11639 -4224 3109 -26402 -24653 -16744 -6412 39286 46030 25189 22916 -36160 -45584 -52586
6983 -52586 -97470 -103603 -82595 -15831 -74518 -111253 -111557 -126920 -76588 -53982 -16496 27870
6971 27870 56714 101247 111066 48268 -6247 -40094 -83603 -84576 -52277 -31928 -629 -17242
6959 -17242 -89746 -94202 -121047 -112793 -101902 -86053 -70960 -37569 -26297 -33605 -40565 4950 37437
6946 37437 -2151 -21476 7959 12054 -8205 -32910 -82081 -92333 -85444 -50458 -31251 -89388
6934h9388j5164L7325R3099L0524m6716k3427j2322n2008q831k019K9235k4055
6922h3747l106K3262Q2506N5068j4598q3189m5769l362P983R99K1305M6185L3255
6909C6792K5386K4476k5955p3177O4807M1588q733k1253J2341j4121m8447k2786
6897i082l3194P268J00857N3691n6529j7974k8146L803L6011L3248r5477o0147
6885f5671l0356k3027J025M1884L9073l7200j0467N7335J6825l1886K997j8198
6873e7666K601N1430l573k4375M939M2096l9993R856k8778l4545K4350L8108l3129
6860d8679J6709M8522L8567j2940k8988L9779k4995m2227J1682K4293l0550o7221
6848g6048j4038J0648j2325Q809L8698L5374O3643J7310J775M4992p1512k3184
$$ plain form
6934 -89388 -104552 -67227 25872 56396 9680 -13747 -26069 -78077 -86908 -88927 -59692 -83747
6922 -83747 -86853 -63591 18915 73983 59385 -23804 -69573 -72935 -64952 -63953 -42648 3537 36792
6909 36792 62178 86654 60699 -12478 52329 93917 85184 63931 76272 62151 13704 -9082
6897 -9082 -42276 -35008 65849 119540 63011 45037 16891 20694 56705 89953 -5524 -65671
6885 -65671 -96027 -119054 -118029 -76145 -37072 -74272 -84739 -27404 -10579 -42465 -39468 -57666
6873 -57666 -55065 -3635 -7208 -31583 -26644 15452 -24541 -14685 -43463 -78008 -53658 -15550 -48679
6860 -48679 -31970 16552 55119 42179 13191 52970 27975 -14252 -2570 21723 -8827 -76048
6848 -76048 -90086 -79438 -91763 -82954 -44256 -8882 54761 72071 73846 118838 47326 24142
6836B4142L7021k2307o0899l3657Q179l0576K0767Q8200p0014K898K288o036p1390
6823a11384J6818M4955M0102M2371p368j021J0675K5816j3792k8486R230N7312
6811H5228j7691l5421j05031j88O8742n352P054K7434j5584l2250k4117m3918
6799i1094J9172J0199N8207J5100L9038k0019m6229M0084K2157j6820m6469o34
6787a7308J9390K6018K5699J1747n7718l5842M5858J3366n580j1880L384M345
6775B1479k1194j8927L557j4978K6367O1713j0342o4725J7600L429J8575J1073
6763C3627n918N617K0598Q353J0309n5879m2724L578L6835N533L0929J9919p9711
6750h934o0360M2954M4901K0358L0540O559k0279l2188l6945k3701K3869m1405
$$ plain form
6836 24142 61163 38856 -22043 -55700 -47521 -78097 -57330 30870 -39144 -36246 -33958 -39994 -111384
6823 -111384 -94566 -49611 -9509 32862 25494 24473 35148 60964 47172 18686 27916 85228
6811 85228 67537 32116 -72915 -73103 -4361 -9713 -2659 24775 9191 -23059 -47176 -91094
6799 -91094 -71922 -61723 -3516 11584 50622 30603 -15626 24458 46615 29795 -16674 -17308
6787 -17308 2082 28100 53799 65546 7828 -28014 17844 31210 25630 13750 17134 21479
6775 21479 285 -18642 -15085 -30063 -3696 58017 47675 -17050 550 3979 22554 33627
6763 33627 27709 33326 53924 62277 72586 16707 -26017 -22439 14396 19929 50858 70777 -8934
6750 -8934 -69294 -26340 18561 38919 69459 76018 55739 23551 -13394 -37095 -13226 -54631
6738e4631o0322K2415P5440l0411K562N4046K3681l7628j6811J2809K5565R421
6726B6136k9515K9713q460n9136Q317l4681j1529J3943L7280J3739M154k3338
6714c3377k8291M8158Q9749K020l7105j17148r0987K4200J03746N6583j405j0136
6702F007N8600k0661K5844m0867p0630m0787L795k3038m243K4120k1123j0340
6690a13323J7886L661M5247j1806J8665J2240J5879k9496N6465P204K7443k74
6678D9791p9124q442M8886N6480mr5227l3219K1043O92J6751o6675j424p966L1965
6664f6473J3142K9772q690O562l6931P875J4005J0165j7603n34K6142l0692l7475
6651i0735n3330r77J21073O5001k1217k5369K137k4227J2562m330p5648J7556
$$ plain form
6738 -54631 -114953 -92538 -17098 -47509 -44947 9099 32780 -4848 -21659 -8850 16715 26136
6726 26136 -3379 26334 17874 -41262 -32945 -67626 -79155 -65212 -27932 -14193 -10039 -33377
6714 -33377 -61668 -13510 76239 78259 41154 -75994 -166981 -142781 -39035 17548 16143 6007
6702 6007 64607 43946 69790 28923 -41707 -82494 -78699 -101737 -105980 -81860 -102983 -113323
6690 -113323 -95437 -91776 -46529 -58335 -39670 -27430 -11551 -41047 15418 22622 50065 49791
6678 49791 -29333 -37775 11111 67591 67587 -27640 -60859 -39816 -39124 -22373 -89048 -90472 -98438 -66473
6664 -66473 -53331 -23559 -32249 -25687 -62618 -54743 -40738 -30573 -48176 -48710 -22568 -53260 -90735
6651 -90735 -144065 -145042 -23969 41032 19815 -5554 -3417 -27644 -15082 -19412 -95060 -77504
6639g7504M6874L3236M856k5440k4396M336J7698J7500n0844J4746J4716l928
6627b8150P2828j5505j1115j3359k7910l3164Q7732P7379k2240p8925Q270j4667
6615A174k5227M6272L6775n3992l3875m240l4331l9129l6770O7461K3731j4408
6603f6559l421M7893M2420M4617r281K1593j8631K5260n9158k6393j7080K5136
6591F396O7453j1211j7237k0489n3946j9001k2305K0604L6888k7379K1143M4909
6579B5825M6039K3968m2317m0870J5536J2100j944K4390k0036q659N908n4133
6567a4193k2125K9249N8710n6602j16074k2647m195J3098L0925P6288Q707j7819
6555c6678l9624j4925o1820j5522Q2273L8157P805j5156J9619j2432L263k2397
$$ plain form
6639 -77504 -30630 2606 7462 -17978 -42374 -38038 -20340 -2840 -53684 -38938 -24222 -28150
6627 -28150 44678 29173 18058 4699 -23211 -56375 31357 108736 86496 7571 15841 1174
6615 1174 -24053 22219 58994 5002 -28873 -33113 -67444 -106573 -143343 -75882 -52151 -66559
6603 -66559 -69980 -22087 20333 64950 55669 77262 58631 83891 24733 -1660 -18740 6396
6591 6396 73849 62638 45401 24912 -29034 -48035 -70340 -49736 -12848 -40227 -19084 25825
6579 25825 71864 95832 53515 12645 28181 40281 38337 62727 42691 34032 39940 -14193
6567 -14193 -36318 -7069 51641 -4961 -121035 -143682 -147877 -134779 -103854 -27566 -18859 -36678
6555 -36678 -76302 -91227 -153047 -168569 -86296 -48139 -40334 -55490 -35871 -48303 -45040 -67437
6543f7437l2882J1114K3409j2744N0004J804L9431N683k0427j2858J6755j5168
6531a3316K3476K573p813R322j0659k5420l8722J11372J0368m1558j6871K2175
6519B4927k4377l2867l7424l528N4306O0445o605O1961M5959k3747r8038J235
6507B2247J2490n4921k8665K3224j1323R463r644M56O2634l3874J5477P187J5343
6494C0094k3861k4255J5557K9359L9533n2353m4612M5669J6809j9070M343K5027
6482D2240n2035k228J4153L3626k8003l0703j5483l998O1795M6127J8172o2978
6470B0685n0985l203l172k3935q21L1677j0825P2118k9245m2122L1169N4186j026
6457D4501j7807l9039L0067j5889n9371J1620R508l9605L2152J436K289l6920
$$ plain form
6543 -67437 -100319 -89205 -65796 -78540 -28536 -26732 12699 18382 -2045 -14903 1852 -13316
6531 -13316 10160 12733 4920 14242 3583 -21837 -60559 50813 61181 19623 2752 24927
6519 24927 550 -32317 -69741 -73269 -18963 41482 34877 96838 142797 119050 21012 22247
6507 22247 34737 -20184 -48849 -25625 -36948 -27485 -37129 -36673 25961 -7913 7564 14751 30094
6494 30094 6233 -18022 -2465 26894 66427 14074 -30538 15131 31940 12870 17213 42240
6482 42240 -9795 -12023 2130 35756 7753 -22950 -38433 -42431 19364 65491 83663 20685
6470 20685 -30300 -33503 -36675 -60610 -61431 -29754 -40579 31539 2294 -39828 -8659 45527 44501
6457 44501 26694 -12345 17722 1833 -57538 -45918 -36410 -76015 -43863 -42427 -40138 -77058
6445g7058M9940O4157J8787m5852p201L8722K6894l2229o7201n6473M7951N940
6433c3623j2456p9266q108M4618j828M8840Q9746l7133q2447L4654N4320k5004
6421g687n306K9123K9619o6345j4360N7792P7380k0970R891J6000o5607n8530
6409a9000K8794N9559m920l5336q3995n346j1451M8556K0588k1068l5258K3232
6397c5645j0339J7308j3860Q389o3570m9217O2676o0749L2811R7072K9177m1278
6385b7225N6644k1797N315k292m3872J600K1177j0412o0294O526O1046L8984l7740
6372a2340r380k6917k0754L49j7672j6497O1893P3412J2161p533q9201l6050J6297
6359g2232J8094L4984L7333k3240n0586Q055k8008p3051M988P8409Q3782Q853
$$ plain form
6445 -77058 -27118 37039 55826 9974 2773 41495 68389 36160 -31041 -87514 -39563 -33623
6433 -33623 -46079 -125345 -133453 -88835 -90663 -41823 47923 10790 -71657 -37003 17317 -7687
6421 -7687 -12993 16130 45749 -20596 -34956 22836 100216 79246 89137 105137 39530 -19000
6409 -19000 9794 69353 64433 29097 -54898 -60244 -71695 -23139 -2551 -23619 -58877 -35645
6397 -35645 -45984 -28676 -42536 -34147 -97717 -146934 -84258 -145007 -112196 -15124 14053 -27225
6385 -27225 29419 7622 12937 10645 -33227 -31627 -10450 -20862 -81156 -74630 -13584 25400 -12340
6372 -12340 -21720 -48637 -69391 -69042 -86714 -103211 -41318 32094 44255 36722 -52479 -88529 -72232
6359 -72232 -54138 -19154 18179 -5061 -55647 -47592 -75600 -148651 -143663 -65254 18528 27381
6347B7381k2235l3261l4254M2466K1899m2109K339k8296O014K5955j1952k0260
6335f6313l3714j5443R7263L9515O1670m1300q874l3769J574m2576k916N2765
6323G882J131n2889m937N0130K0829j2320k823K3877l091L074O2773k2984j73
6310G0479L1808J8057n5214k7049N6524N1529n3339p4672j1181J4182j5185k9461
6298b3522k4727j9379N466k1899k3716M3171M1384L5774J4804q4734l254j9227
6286g9859M2686M7354j2344j8986Q591O795j5487Q767l4266o480N492l3945K1710
6273e9972L9464k1193n684J5434R122n1240k0411l0032K2934k1042n671O197L3337
6260h8757K713l4704K7272k5775M2473R421k6254N531J7729M38J9621M1534K290
$$ plain form
6347 27381 5146 -28115 -62369 -19903 1996 -40113 -37774 -66070 -60056 -34101 -46053 -66313
6335 -66313 -100027 -115470 -18207 21308 82978 41678 32804 -965 609 -41967 -44883 7882
6323 7882 9013 -43876 -48813 1317 22146 9826 7003 30880 27789 30863 93636 70652 70479
6310 70479 102287 120344 65130 38081 94605 146134 92795 18123 6942 21124 5939 -23522
6298 -23522 -48249 -67628 -62162 -84061 -107777 -64606 -23222 12552 27356 -57378 -60632 -79859
6286 -79859 -37173 10181 -2163 -21149 -12558 -5763 -21250 -12483 -46749 -53229 -47737 -81682 -59972
6273 -59972 -20508 -41701 -47385 -31951 -22829 -74069 -94480 -124512 -101578 -122620 -128291 -122094 -88757
6260 -88757 -86044 -120748 -93476 -119251 -76778 -67357 -93611 -88080 -70351 -69913 -50292 -8758 -6468
6247f468o280K2064k6876j8488m8952K2182p721N624m3064k385L2942M534K7186
6234d5702M7038L9570J8650o1540K590M5993o016l3278r208Q32j2224j5774k3790
6221e2859N0962R5791k6145k9469j8356K3867N8524N074n5933P178o9649q734
6209a9749J4263K832O745N2347M0360l214k6401J7832p420K9526j600m7395m9701
6196H425K5314Q544J2023j7687m6037k5731l3210R041O8809N8543L6499L6462
6184A40995M3297o0419o5515p1003L016o7434l1600Q0954Q127N007J8473j9332
6172a5434M667O2338P112p8182n0852k7184M8356K5745J7247L3752K5986l0534
6160B3017j3233k4833L2328N4748K2847l8492o521l514m9144l9833L6150M7741
$$ plain form
6247 -6468 -12748 9316 -17560 -36048 -85000 -62818 -70539 -64915 -107979 -110364 -77422 -72888 -45702
6234 -45702 1336 40906 59556 -1984 606 46599 40583 7305 -1903 -1071 -13295 -29069 -52859
6221 -52859 -1897 93894 67749 38280 19924 43791 102315 107389 51456 58634 -11015 -19749
6209 -19749 -5486 -2654 4091 56438 96798 93584 67183 85015 77595 107121 105521 58126 8425
6196 8425 33739 42283 54306 36619 -9418 -35149 -68359 -59318 9491 68034 104533 140995
6184 140995 184292 123873 58358 -12645 -9629 -77063 -108663 -27709 -19582 -14575 3898 -15434
6172 -15434 -10767 51571 58683 -19499 -70351 -97535 -49179 -23434 -6187 27565 53551 23017
6160 23017 9784 -15049 17279 72027 94874 56382 49861 46347 -2797 -42630 -6480 41261
6148D1261N9959R7930k9062n5535l1782m4149j1313j2715j1721P5538P3556l9603
6136A12364o5649k8008j4656l882n7012k620O2615j0365M2272J6985p4987r9229
6124a22172O590L0132L0304k4856M1443j3583J2293K7159o186l4881J8132M6906
6112A1281j0465K945k7122m0328l902L6264L5210L1067j0700m3734j396m8074
6100f8954J1561L3158N4306m665o2232l2187o112O4443n552m8419k2163m7977
6088a34793l5818K6090P9504M0210m0347O1240J3339J8702L391k2556l7766J6663
6076a2141o960j7076l7580m8162l0700l62Q4592J07195L1769l6885n3710Q706
6064a1314J2958L4585j6560o8825J8354N6292j6101j1635J9865o702P380K5806
$$ plain form
6148 41261 101220 199150 170088 114553 82771 38622 27309 14594 2873 78411 151967 112364
6136 112364 46715 18707 4051 169 -56843 -59463 3152 -7213 35059 52044 -22943 -122172
6124 -122172 -115582 -85450 -55146 -80002 -38559 -52142 -39849 -12690 -18876 -53757 -35625 11281
6112 11281 816 3761 -23361 -63689 -67591 -31327 3883 34950 24250 -19484 -20880 -68954
6100 -68954 -57393 -24235 30071 25406 -36826 -69013 -75125 -10682 -16234 -64653 -86816 -134793
6088 -134793 -170611 -144521 -65017 -24807 -65154 -3914 9425 28127 31518 8962 -28804 -12141
6076 -12141 -19101 -36177 -73757 -121919 -152619 -152981 -68389 38806 70575 33690 -20020 -11314
6064 -11314 1644 36229 19669 -49156 -30802 25490 9389 -2246 17619 10917 18297 44103
6052D4103L9736k1102j9005m8510l5364N0971k1182k2262m0299K2527l4885K9436
6040e5836L6678K3661M4421K2369j7263k9706l6028k0385J0820K5203m1851k1521
6028e9438Q28k7610M9541J8833m0352Q656P1477j216j8895J6187J8472m2231q7911
6015i3659L1740R3374L6144L9556K1303q011k3108o5787j1187L0450J9042J8750
6003H8607n5112l3117N1794o2083q142j4154l5913K584L6892N2802L3972q771
5991D9359K2898K4947K2660o4723n5389L0373q072o3840O795P72k6106q788m358
5978g3472k3812L6905l4470j3750M5205K2640M0M7347q364m3694J6917k569j7040
5965d8117k9937M4739O1292k8689n1140l1352o887J6404L2464k0469k197K0818
$$ plain form
6052 44103 83839 62737 43732 -4778 -40142 10829 -10353 -32615 -72914 -50387 -85272 -55836
6040 -55836 -19158 4503 48924 71293 54030 24324 -11704 -32089 -21269 3934 -37917 -59438
6028 -59438 -58610 -86220 -36679 -17846 -58198 -49542 21935 20719 1824 18011 36483 -5748 -93659
6015 -93659 -61919 31455 67599 107155 128458 120447 97339 31552 20365 50815 69857 88607
6003 88607 33495 378 52172 -9911 -18053 -32207 -68120 -65536 -28644 24158 58130 49359
5991 49359 72257 97204 119864 55141 -248 30125 22053 -41787 -34992 -34220 -60326 -69114 -73472
5978 -73472 -97284 -60379 -94849 -108599 -63394 -40754 -40714 6633 -1731 -45425 -28508 -31077 -48117
5965 -48117 -78054 -33315 27977 -712 -51852 -83204 -90091 -73687 -41223 -61692 -63889 -43071
5953d3071J2200J3343n725j0896J0860K446j1237L3213r59k2960o8354L1722k3734
5940h3152j3580n09M4062Q1219L1489o6017l1985R375J4301M9205K7316K9643
5928I1367l2023o4717L770L0669m6253p5556J0632J7572J8848j2153N900O1030
5916I086l2582m7584J9401N5003k8009k6025K6034L0152j3658L4779j2438p6095
5904f1936J6601j5577J1167J1327K7893Q8749j3653j6277q012l3686m4247K5538
5892a2113k7202J738n359K8777j0908p1926j2892m303J3185o499l243M2742Q3387
5879A5384M2625l371n4263l5516L745K2764K5038K6983n6387M784O447K8686N1563
5866G8482M751p8088m9722M1034l7367M844o338j0925j1006O697n3714K741K8824
$$ plain form
5953 -43071 -30871 -17528 -23253 -34149 -23289 -20843 -32080 1133 174 -22786 -91140 -59418 -83152
5940 -83152 -96732 -97241 -53179 28040 59529 -6488 -38473 -29098 -14797 34408 61724 91367
5928 91367 59344 -5373 -1603 29066 -17187 -92743 -82111 -64539 -45691 -57844 -51944 9086
5916 9086 -23496 -71080 -51679 3324 -24685 -50710 -24676 5476 -8182 26597 14159 -61936
5904 -61936 -45335 -60912 -49745 -38418 -10525 78224 64571 48294 40282 6596 -37651 -12113
5892 -12113 -39315 -37577 -42936 -14159 -25067 -96993 -109885 -114188 -101003 -107502 -110745 -68003 15384
5879 15384 58009 54638 375 -35141 -31396 -8632 16406 43389 -12998 -8214 -1767 26919 78482
5866 78482 83233 5145 -44577 -3543 -40910 -36066 -42404 -53329 -64335 -57638 -111352 -108611 -79787
5853g9787L964N1642O0754K1909l7328O388N7272J7232k8844j183k548m7348J3451
5840C5574J5393l3011j3741j3819k4430K685N790O3349P4245k8463n5630K777
5828C0719m019j4113l4720N6631n081o2329p619M837P8613P115j5473K9297k8170
5815C5688L747L6367J3147Q167m1417q5709o4590M6780O2525K139l549J8728n8796
5802b6773q9467k5496J11565O7610l7948k2947o06P317K7829n8140m5393k3752
5790a16201k7156m0343j977M1121L7371J9876O3319L9579J0114l9588Q613M5434
5778D0162j5620M5747o0801R728K0207j7819k7553l0549j1920L4989M4528m5009
5766a3910J107l6780m2464m3014L753P1973K6819K6813N6384L3108J5166K6494
$$ plain form
5853 -79787 -75823 -24181 36573 58482 21154 27542 84814 102046 73202 72019 69471 22123 35574
5840 35574 50967 17956 4215 -9604 -34034 -31349 -25559 37790 112035 83572 27942 30719
5828 30719 26700 12587 -22133 34498 29417 -32912 -40531 -35694 42919 50034 34561 63858 35688
5815 35688 39435 75802 88949 97116 55699 -30010 -94600 -47820 14705 16844 13295 32023 -26773
5802 -26773 -116240 -141736 -30171 37439 -509 -23456 -24062 -16745 11084 -47056 -92449 -116201
5790 -116201 -143357 -183700 -185677 -144556 -107185 -87309 -23990 15589 25703 -13885 -5272 40162
5778 40162 24542 70289 9488 19216 39423 21604 -5949 -36498 -48418 -13429 31099 -13910
5766 -13910 -12803 -49583 -92047 -135061 -131308 -59335 -32516 -5703 50681 83789 98955 125449
5754A25449k2622l6768o386j5104K4802k5129j5789n2952N985P952M8707j2179
5742B5966J8433N1885l4071m4096J3518N239N65L7862J9964k2933P432j4781n6060
5729H923N3800Q067p3983O435J0655j3800L9816r371n4771k6840k2983n5681K0881
5716a08852J921J1317K0054M4613k3794j9788M486m230N0258N9620J9325J0984
5704F5914m8651m5158m7514L915M1594o692K4280m203K9610J9505J497k2917M097
5691A5277L5121n1756q866K5540k5867l7540N505J4741Q0197K6067k2287j0739
5679D5393m7938m5349O8682q997k6698m5952L5783M5831k6855k4549j9436m626
5667e4711J677Q951O304l9806Q010L9802L6225O2397L9379m4264r3897n1639L6552
$$ plain form
5754 125449 102827 66059 59673 44569 69371 44242 28453 -24499 -18514 -10562 38145 25966
5742 25966 44399 96284 62213 18117 31635 36874 37439 75301 95265 72332 79764 64983 8923
5729 8923 62723 70790 -3193 3242 13897 97 39913 30542 -24229 -51069 -74052 -129733 -108852
5716 -108852 -106931 -95614 -75560 -30947 -54741 -74529 -70043 -74273 -24015 35605 54930 65914
5704 65914 17263 -27895 -75409 -71494 -29900 -36592 -12312 -16515 13095 32600 34097 11180 15277
5691 15277 50398 -1358 -10224 15316 -10551 -48091 -42586 -27845 52352 78419 56132 45393
5679 45393 -2545 -47894 20788 11791 -14907 -60859 -25076 20755 -6100 -30649 -50085 -54711
5667 -54711 -53034 -44083 -37779 -77585 -69575 -29773 6452 68849 108228 63964 -29933 -81572 -45020
5654d5020L6319J3657k6469p349J8474l8502K3668N2118O786j1465M966o7176
5642c9993m6343J1874M5692l573L9856O1054k4534K3607r836M748j6166o2384
5630a5998k1280k1737k6181k9782J3298J9582L7906O664K7533m2001O0847J1464
5618B0315o0434q151O6124m2969m8386L6077m604M9413n1999o4165J1873L8116
5606e8790M2316L5639N2827M4234k5340O144M8624m2066p2084k3051K7254n3653
5594a7946m8616K6935M0927R52J5459N2494K7632n3575n6497r089J4149j5479
5582b2654j6857J777o898N4441P714l5417m9047J2906R375L0234l2590q569K1059
5569c4526m7274n382O2044L856l0882J6615J8111k8533l1755M0131L9248o099
$$ plain form
5654 -45020 -8701 4956 -21513 -28862 -10388 -48890 -25222 26896 33682 22217 27183 -39993
5642 -39993 -86336 -74462 -28770 -32343 7513 68567 44033 67640 57804 62552 46386 -15998
5630 -15998 -37278 -59015 -85196 -114978 -101680 -82098 -44192 -37528 -9995 -51996 8851 20315
5618 20315 -40119 -48270 17854 -25115 -73501 -37424 -42028 7385 -44614 -108779 -96906 -58790
5606 -58790 -16474 19165 71992 116226 90886 97030 145654 103588 31504 8453 35707 -17946
5594 -17946 -66562 -39627 1300 2252 17711 70205 97837 44262 -12235 -21324 -7175 -22654
5582 -22654 -39511 -37734 -44632 9809 17523 -17894 -66941 -54035 -44660 -14426 -47016 -55585 -34526
5569 -34526 -81800 -87182 -25138 -21282 -52164 -35549 -17438 -45971 -77726 -37595 1653 -4446
5557d446j2525n4631k0649K5559n608k0492O5052J9734k3984K023K2143r120n0253
5544f7197l198K6712N3835l9893p5416K592K8073N2496p545j5376M4242N1977
5532E1302j4003j2292J5012m5906o9340l9434n693k3974M1400M4687P4224m524
5520A1459J745o9762j1046K7036K2588L0165k942L993o3880J4621o301k7609m7871
5507a17804N3852L4559L864k6492L1859P6469l9788m7866j0702j2006l1561l2291
5495a17907K367M3890R135k1698j1390O3488M9800r5698P877Q7813J1661M074
5483C3412j8040l4268l968j5956K6907j0924l8042k6585K6818J3434j2317L7856
5471b1673j7118J7651L896p964L1374M0707n0826p0364o8673k1082m4587K1858
$$ plain form
5557 -4446 -16971 -71602 -92251 -66692 -72300 -92792 -27740 -8006 -31990 -29967 -7824 -16944 -67197
5544 -67197 -70395 -43683 10152 -29741 -105157 -102565 -74492 -21996 -29541 -44917 -675 51302
5532 51302 37299 25007 40019 -5887 -75227 -114661 -120354 -144328 -102928 -58241 15983 11459
5520 11459 13204 -56558 -67604 -40568 -17980 12185 9243 13236 -50644 -36023 -42324 -69933 -117804
5507 -117804 -63952 -29393 -25529 -52021 -20162 56307 16519 -31347 -42049 -54055 -85616 -117907
5495 -117907 -115540 -71650 -62515 -84213 -95603 -32115 17685 -78013 -70136 17677 29338 33412
5483 33412 15372 -18896 -22864 -38820 -11913 -22837 -60879 -87464 -60646 -47212 -59529 -21673
5471 -21673 -38791 -21140 -17244 -25208 6166 46873 -3953 -74317 -142990 -164072 -208659 -186801
5459a86801J01704J07675K7542l6091m7800l463J0730K0188j3714l175J1117n1560
5447f3648N1402R343j4387K3779M3650l7697l0282P4799P903m6146O109k8454
5435c629K0767M7892r691q1345p799j0711n2048k4284P0942K3106L2200M1129
5423D6529R863j960k8945m2714J3906Q069J0837r024j7357m0357l1931K2053P4661
5410A3630J1526O261p3407l1504J1670P617k1269Q2381J6769J2417n0515m4956
5398e9380j5703R4162M507L50N8055j4159n5761j4579J0653N9186J1498M349j7940
5385F5238K5505k904L3816k1901j783l7852N363M8379j8361J1314j5336r3794
5373b316l9010q690L7132P4595n8511k9366j0986j1219j8627n5952K2939J2409
$$ plain form
5459 -186801 -85097 22578 50120 14029 -33771 -37234 -26504 -6316 -20030 -23205 -12088 -63648
5447 -63648 -12246 -2903 -17290 6489 50139 12442 -17840 56959 64862 18716 24825 -3629
5435 -3629 17138 65030 55339 -26006 -33805 -44516 -96564 -120848 -49906 -26800 5400 46529
5423 46529 56392 54432 25487 -17227 -3321 4748 15585 6561 -10796 -51153 -83084 -61031 13630
5410 13630 25156 31417 -41990 -73494 -61824 -54207 -75476 6905 23674 36091 -14424 -59380
5398 -59380 -75083 19079 23586 23936 81991 67832 12071 -2508 8145 67331 78829 83178 65238
5385 65238 90743 87839 121655 99754 97971 60119 65482 113861 95500 106814 91478 -2316
5373 -2316 -41326 -50016 -12884 61711 3200 -26166 -37152 -48371 -66998 -122950 -100011 -87602
5361h7602p111P6954J9165K2769m7054o2667J0389N0538J6262p7879J1415J7452
5349e7369K0258k0462k8544M212L2474k9364K7359O2439j4506l9097N2957N350
5337A5707n1092m628l5424q833N3622J6060n9225j0685K3710J6599l8488l2437
5325a15114N7414Q0945J3191p256k1257m9633n5215j1225J4769P9657O8865m8226
5313F915P779Q841l8733q065L758q106L8710K9260L4890L1109l0411j0235J5942
5300H1654K2395q179r5819o6508L8994K6360q605j2112r63L3707J0802k738k065
5287A6923k3142l6395L0531k4675m2666J8198O479J2989O2450l4578l8740K1382
5275c1244K5346n4808R087k8338J3291L7914J3376O697N5151J9697J8123q464
$$ plain form
5361 -87602 -94713 -17759 1406 24175 -22879 -85546 -75157 -24619 -8357 -86236 -74821 -57369
5349 -57369 -37111 -57573 -86117 -81905 -49431 -78795 -51436 11003 -3503 -42600 10357 15707
5337 15707 -35385 -40013 -75437 -84270 -30648 -14588 -73813 -84498 -60788 -44189 -82677 -115114
5325 -115114 -57700 23245 36436 29180 7923 -41710 -96925 -108150 -93381 -13724 55141 6915
5313 6915 14694 23535 -15198 -23263 -19505 -27611 11099 40359 75249 106358 75947 65712 81654
5300 81654 104049 95870 51 -66457 -27463 -1103 -9708 -21820 -22783 10924 21726 18988 16923
5287 16923 -6219 -42614 -12083 -36758 -79424 -61226 -54747 -41758 20692 -13886 -52626 -31244
5275 -31244 -5898 -60706 -51619 -79957 -66666 -28752 -15376 -8679 46472 66169 84292 75828
5263G5828K2880o0737o9196n7476p467P163n7775l2354K1388m584L6532P2427
5251e3371j8169k4774M8210O4899J924R209l5409M9100L4329m2876P91N7973N734
5238I7570k706j8644k5883k8651J5376O9179j7556K6005j6435m9622M581m1621
5226A1593l9865O0224N0571J9406j9841o9756l0198J6467N5834k9539m6387m415
5214b5906J5870L9775K945j5006K0778M7292q454k6467k960p165k5929J1485L5756
5201F2014P43J7989j596k8108n7073j3842K9886L2425m1907k3325K3760p1021
5189g0055m8365K5983N0417K6993R189K6186K1601L7202L2767M4414n611k0501
5177A30220m2844p5872n2540q235k2182J1709O8871N3397j2171J4937K6537l224
$$ plain form
5263 75828 98708 37971 -31225 -88701 -96168 -89005 -146780 -179134 -157746 -162330 -125798 -53371
5251 -53371 -71540 -96314 -48104 16795 18719 27928 -7481 41619 75948 33072 33863 91836 97570
5238 97570 94864 76220 50337 21686 37062 106241 88685 114690 98255 48633 53214 11593
5226 11593 -28272 31952 82523 101929 82088 12332 -17866 -1399 54435 24896 -21491 -25906
5214 -25906 -10036 29739 32684 17678 38456 85748 77294 50827 47867 40702 14773 26258 62014
5201 62014 62757 80746 79150 51042 -6031 -19873 10013 42438 531 -22794 966 -70055
5189 -70055 -118420 -92437 -42020 -15027 -5838 20348 41949 79151 111918 156332 150721 130220
5177 130220 87376 11504 -41036 -49271 -71453 -59744 9127 62524 50353 65290 91827 88603
5165H8603m121M0440m451k3848o1528q153L1969q098K4143r964o0125n7193j4680
5152f7006K1711M0090K689p534l6505n0300L0260K0009K6666L1975o26M261m4429
5139b8739m103q766L1187K944j6506L8208J06381l2060p2708k2050J0278m2161
5127c8095L6344K6103M3502l6008m2888L0316K7337M8381o150j6414r6610k3053
5115d7235J7065m9246m5815j562P2065O4954P0638J4964o720p5754j5123j3519
5103a5288o8022r6206l8427J34476P0471K5359J5540K6M366o1947n627J8942m0008
5090e6345l260O6801Q3747j5748l4759j8296l1905m7251J4980R464L9297K5305
5078C2030p349j7164O764M496N361K2524k2217k3634J7927L8353l241k9435k7423
$$ plain form
5165 88603 84482 124922 120471 96623 35095 26942 58911 50813 74956 64992 4867 -52326 -67006
5152 -67006 -45295 -5205 -2516 -10050 -46555 -96855 -66595 -46586 -19920 12055 11429 15690 -28739
5139 -28739 -32842 -41608 -10421 -7477 -23983 14225 120606 88546 15838 -6212 4066 -38095
5127 -38095 -1751 24352 67854 31846 -11042 19274 46611 94992 88842 72428 -24182 -47235
5115 -47235 -30170 -79416 -125231 -126793 -54728 10226 80864 95828 89108 13354 -1769 -15288
5103 -15288 -83310 -179516 -217943 -83467 -12996 12363 27903 27929 32295 -29652 -35279 -16337 -56345
5090 -56345 -59605 7196 90943 75195 40436 22140 -9765 -57016 -42036 -32572 6725 32030
5078 32030 24681 7517 14281 18777 24138 46662 24445 811 18738 57091 53850 24415 -3008
5065c008r10l0674J3444L3394M0909Q673k7118k6331n5653N3645l6432n4033k7089
5052a11183O2446M1643M150p7517n7092K6739O2815M4872k4224K076l3523K1661
5040c7137K7010n9714k9488K5773M3307J1016K5239M0354l1493m3299K784Q417
5028a7231j2012j5871J3179N7790M340l4440L787n014M5689k1476k880j63o0629
5015d4931k0602l121M8057O4078L815j7340k379o3491n9359J7186J8786P4935
5003A5634K1719l2970m4341K503J988L5682J23686P6158j4563l70k2146k0386
4991A42594p264K8594m5999r2943p3240k4422n930l1114P5573J5538l2548L3252
4979a7909O9683j9277l1390O2047J1945o5635l6158m9553q205O9010K9633N0573
$$ plain form
5065 -3008 -3918 -34592 -21148 12246 53155 61828 34710 8379 -47274 6371 -30061 -84094 -111183
5052 -111183 -48737 -7094 -2944 -80461 -137553 -110814 -47999 -3127 -27351 -25275 -58798 -37137
5040 -37137 -10127 -69841 -99329 -73556 -30249 -19233 6006 46360 14867 -28432 -25648 -17231
5028 -17231 -29243 -45114 -31935 25855 30195 -4245 -458 -5472 40217 18741 15861 15698 -44931
5015 -44931 -65533 -68654 -20597 43481 47296 29956 27577 -35914 -95273 -78087 -59301 15634
5003 15634 37353 4383 -39958 -37455 -35467 215 123901 200059 185496 185126 162980 142594
4991 142594 135330 163924 117925 24982 -48258 -72680 -78610 -109724 -34151 -18613 -51161 -17909
4979 -17909 51774 32497 1107 63154 75099 9464 -26694 -76247 -84452 -15442 14191 64764
4967F4764m5998r4739K0662P0642p270k34R5k9429J0030J5908l2376l0774J00439
4954D1720N1161l4129r3013l3615l007j4903n3014R754L2823L9588Q182O1329
4942A2876L3326k9356j7602j0385j9553k1871J9719M7721M3906j4694j3504k1321
4930I262j7833l5856J0801K4600K239P767k9661K6817j5274M8929M65k4844p3067
4917f5655J4638L0207O0729K3024n561k5168p7970k789J076J6001M1833K2133
4905C2498j0481q473k2477k1113k4425K6992L2220k7399J8593K9610k5125l775
4893c355O7121L5472j0667m6209l4467o5181l7981p795K1746l8626M3493J31658
4881E5209L9340q8884l3719K2552p125O8112N3672j2421o2135j6058k4329J3921
$$ plain form
4967 64764 18766 -75973 -55311 15331 8061 7827 7922 -21507 -11477 4431 -27945 -58719 41720
4954 41720 92881 58752 -34261 -67876 -70883 -85786 -138800 -129046 -96223 -56635 -48453 12876
4942 12876 46202 16846 -756 -11141 -30694 -52565 -32846 14875 58781 44087 30583 9262
4930 9262 -8571 -44427 -33626 -9026 -6787 980 -28681 -1864 -17138 31791 32256 7412 -65655
4917 -65655 -51017 -20810 39919 62943 57382 32214 -45756 -48545 -47469 -31468 10365 32498
4905 32498 22017 13544 -8933 -30046 -54471 -27479 4741 -22658 -4065 25545 420 -3355
4893 -3355 63766 99238 88571 42362 7895 -57286 -95267 -103062 -81316 -119942 -76449 55209
4881 55209 94549 5665 -28054 -5502 -12627 55485 109157 96736 34601 18543 -5786 8135
4869H135k8534m8093M6722M3553l70o277P368K5101K3709p540n7395k5565M4213
4856B5027j9964L7917p770k0374M580J7286l0410o5082j03839K0246j2666K8118
4844a26931L6599M1767P5335M0216m1005k1642K4597N6435l9288n174P013J9891
4832F7813K6015l425k9230K5468r000k1209n2930J9042K0942n476k0546l1939
4820a4475p328o053J6781o923K0153n8336j6081K1667J6444j8439q47K6715j256
4807b7978l3101L8525M7165J3463q928J1635j648k6864J68M8844j3414m2615L3282
4794C8534j7490J9698P5066M3211m5247o4809k4180o8178n4788j3152p648j0510
4782a29493J7460K5545P7149N1178k9800P374M2016l4808o5396L5586k2024m8602
$$ plain form
4869 8135 -20399 -68492 -21770 21783 21413 15136 22504 47605 71314 63774 6379 -19186 25027
4856 25027 5063 42980 35210 14836 19416 36702 6292 -58790 -162629 -142383 -155049 -126931
4844 -126931 -90332 -48565 26770 66986 25981 4339 28936 85371 46083 40909 47922 67813
4832 67813 93828 90403 61173 86641 77641 56432 3502 22544 43486 38010 17464 -14475
4820 -14475 -21803 -27856 -11075 -17998 2155 -56181 -72262 -50595 -34151 -52590 -53437 -26722 -27978
4807 -27978 -61079 -22554 24611 38074 29146 40781 39133 12269 12437 61281 47867 5252 38534
4794 38534 21044 40742 115808 159019 113772 48963 24783 -43395 -98183 -111335 -118983 -129493
4782 -129493 -112033 -86488 -9339 41839 12039 19413 61429 26621 -38775 -3189 -25213 -73815
4770g3815m4665K3558M5693n239L6150M6407P507m8449K4437N6820J1873j1566
4758F8711j8866p8678O700K9233l3353j7198k1136l1616j5503k5908K9693n286
4746a13207J616j31r43k0908N22R7196O4229k685n0831J3000j8578J6186k133
4733a6667j7903K0282O2201N565n9793K6432j6316K7644j5064m0158r229L9081
4721F075J5025j5548j3335J4664j6917o382L254K884k2910J0793J0596M3204O7757
4708I9160j0422o5526p14J4672k5742m43K3709r100k2224m5697M1212K1324j2302
4695G907r78M7081O411k9029l0298k2989j4718j0491k5397o0051n5646L4236J08122
4682d5840O5070k7730k7261j3812k4678N3124J6448L279k7253r815K882L7154
$$ plain form
4770 -73815 -118480 -94922 -49229 -54468 -18318 28089 35596 -12853 11584 68404 80277 68711
4758 68711 49845 -28833 -22133 7100 -26253 -43451 -64587 -96203 -111706 -137614 -107921 -113207
4746 -113207 -111591 -111722 -112665 -133573 -133051 -35855 28374 25689 -25142 -12142 -30720 -14534 -16667
4733 -16667 -34570 -14288 47913 53478 -6315 20117 3801 31445 16381 -23777 -33006 6075
4721 6075 21100 5552 -7783 6881 -10036 -16418 -13164 -10280 -33190 -22397 -11801 31403 99160
4708 99160 88738 23212 22498 37170 11428 10985 34694 25594 3370 -42327 -1115 20209 7907
4695 7907 6929 54010 60421 31392 1094 -21895 -36613 -47104 -72501 -132552 -188198 -153962 -45840
4682 -45840 19230 -8500 -35761 -49573 -74251 -21127 -4679 -1400 -28653 -38468 -35586 1568
4670A568n9937q0256p6448L326N6016J19134K9230K9852k7937r2328j4352L2543
4658g9589K375l5988M2612J4303L219K9873L6279L8172J1212k3068n9771O983
4646a3388K8997m1517j6390j4736j418n130m2695m5258L3913Q7864J1998p296
4634b5056N2604P723J2479L8407r091J2663m0766m7322m5270j7688L2173M6097
4622A6953o4857l5162L8905N1105J4318j1449o1777l489J8869O1135k333j2411
$$ plain form
4670 1568 -58369 -138625 -215073 -211747 -155731 -36597 -7367 22485 -5452 -97780 -112132 -79589
4658 -79589 -77214 -113202 -70590 -56287 -53068 -23195 13084 51256 62468 39400 -20371 -13388
4646 -13388 15609 -25908 -42298 -57034 -58452 -63582 -106277 -151535 -117622 -29758 -17760 -25056
4634 -25056 27548 35271 47750 86157 77066 89729 48963 1641 -43629 -61317 -29144 16953
4622 16953 -47904 -83066 -44161 6944 21262 9813 -51964 -55453 -36584 24551 22218 9807
$$ [...]
##END NTUPLES=NMR SPECTRUM
##END=
