##TITLE=Analysis number 327887
Compound Code mo 00918
Project Code adrs
Chemist Name creative chem
##JCAMPDX= 6.0         $$ Bruker NMR JCAMP-DX V2.0
##DATA TYPE= NMR SPECTRUM
##DATA CLASS= NTUPLES
##ORIGIN= Bruker BioSpin GmbH
##OWNER= nmr
$$ XWIN-NMR		Version 3.5
$$ Mon Apr 16 11:02:26 2007 GMT Daylight Time (UT+1h)  MAYBRIDGE\nmr@NMR_250MHZ
##.OBSERVE FREQUENCY= 250.131544655141
##.OBSERVE NUCLEUS= ^1H
##.ACQUISITION MODE= SIMULTANEOUS (DQD)
##.ACQUISITION SCHEME= undefined
##.AVERAGES= 16
##.DIGITISER RES= 18
##SPECTROMETER/DATA SYSTEM= dpx250
##.PULSE SEQUENCE= zg30
##.SOLVENT NAME= CDCl3
##.SHIFT REFERENCE= (INTERNAL, CDCl3, 0, 16.522)
##AUDIT TRAIL= $$ (NUMBER, WHEN, WHO, WHERE, WHAT)
$$ ##TITLE= Audit trail, XWIN-NMR		Version 3.5
$$ ##JCAMPDX= 5.01
$$ ##ORIGIN= Bruker BioSpin GmbH
$$ ##OWNER= nmr
$$ C:\u/data/dgb/nmr/ADRS/1490/pdata/1/auditp.txt
$$ ##AUDIT TRAIL=  $$ (NUMBER, WHEN, WHO, WHERE, WHAT)
(   1,<2007-04-16 11:02:04.91 +100>,<MAYBRIDGE\nmr>,<NMR_250MHZ>,
      <created by zg, POWCHK disabled, PULCHK disabled
       configuration hash MD5:
       49 4B E0 1D 92 C2 6B 37 9F E6 65 BC 52 41 86 1D
       data hash MD5: 64K
       97 92 12 AF 23 FC D6 66 39 31 3D B0 15 76 1B AB>)
(   2,<2007-04-16 11:02:17.66 +100>,<MAYBRIDGE\nmr>,<NMR_250MHZ>,
      <Start of raw data processing
       ef LB = 0.3 FT_mod = 6 PKNL = 1 SI = 32K 
       data hash MD5: 32K
       D6 00 32 12 DE D3 F5 BE 91 04 B3 5A C6 95 11 48>)
(   3,<2007-04-16 11:02:19.58 +100>,<MAYBRIDGE\nmr>,<NMR_250MHZ>,
      <apk 
       data hash MD5: 32K
       D3 AC 81 AA 5C 38 1B FC E6 C9 5D 10 38 09 2F E5>)
(   4,<2007-04-16 11:02:20.45 +100>,<MAYBRIDGE\nmr>,<NMR_250MHZ>,
      <abs ABSG = 5 
       data hash MD5: 32K
       BA 85 C8 FF B1 84 AB 13 28 4E 6F C9 92 28 B7 58>)
$$ ##END=
$$ 
$$ hash MD5
$$ 57 56 74 B9 7D 38 43 CB 65 C5 9C 43 26 1D 6D 28
##$RELAX= 
##$RELAX= 
##$RELAX= 
##$RELAX= 
##$RELAX= 
##$RELAX= 
##$RELAX= 
$$ Bruker specific parameters
$$ --------------------------
##$DU= <C:\u>
##$EXPNO= 1490
##$NAME= <ADRS>
##$PROCNO= 1
##$TYPE= <nmr>
##$USER= <dgb>
##$AMP= (0..31)
100 100 100 100 100 100 100 100 100 100 100 100 100 100 100 100 100 100 
100 100 100 100 100 100 100 100 100 100 100 100 100 100 
##$AQSEQ= 0
##$AQ_mod= 3
##$AUNM= <au_zg>
##$AUTOPOS= <10 >
##$BF1= 250.13
##$BF2= 250.13
##$BF3= 250.13
##$BF4= 250.13
##$BF5= 500.13
##$BF6= 500.13
##$BF7= 500.13
##$BF8= 500.13
##$BYTORDA= 1
##$CFDGTYP= 0
##$CFRGTYP= 5
##$CHEMSTR= <none>
##$CNST= (0..31)
1 1 145 1 1 1 1 1 1 1 1 1 1 1 1 1 1 1 1 1 1 1 1 1 1 1 1 1 1 1 1 1 
##$CPDPRG= <>
##$CPDPRG1= <>
##$CPDPRG2= <>
##$CPDPRG3= <>
##$CPDPRG4= <mlev>
##$CPDPRG5= <mlev>
##$CPDPRG6= <mlev>
##$CPDPRG7= <mlev>
##$CPDPRG8= <mlev>
##$CPDPRGB= <>
##$CPDPRGT= <>
##$D= (0..31)
0 1 0 0 0 0 0 0 0 0.06 0 0 0 0 0 0 0.0002 0 0 0 0 0 0 0 0 0 0 0 0 0 0 
0 
##$DATE= 1176717723
##$DBL= (0..7)
120 120 120 120 120 120 120 120 
##$DBP= (0..7)
150 150 150 150 150 150 150 150 
##$DBP07= 0
##$DBPNAM0= <>
##$DBPNAM1= <>
##$DBPNAM2= <>
$$ [...]
##$SUBNAM7= <"">
##$SUBNAM8= <"">
##$SUBNAM9= <"">
##$SW= 20.6930455092707
##$SWIBOX= (0..15)
0 0 3 0 0 0 0 0 0 0 0 0 0 0 0 0 
##$SW_h= 5175.983436853
##$TD= 65536
##$TD0= 1
##$TE= 683.16
##$TE2= 300
##$TE3= 300
##$TEG= 300
##$TL= (0..7)
0 120 120 120 120 120 120 120 
##$TP= (0..7)
150 150 150 150 150 150 150 150 
##$TP07= 0
##$TPNAME0= <>
##$TPNAME1= <>
##$TPNAME2= <>
##$TPNAME3= <>
##$TPNAME4= <>
##$TPNAME5= <>
##$TPNAME6= <>
##$TPNAME7= <>
##$TPOAL= (0..7)
0.5 0.5 0.5 0.5 0.5 0.5 0.5 0.5 
##$TPOFFS= (0..7)
0 0 0 0 0 0 0 0 
##$TUNHIN= 0
##$TUNHOUT= 0
##$TUNXOUT= 0
##$USERA1= <user>
##$USERA2= <user>
##$USERA3= <user>
##$USERA4= <user>
##$USERA5= <user>
##$V9= 5
##$VALIST= <valist>
##$VCLIST= <CCCCCCCCCCCCCCC>
##$VD= 0
##$VDLIST= <DDDDDDDDDDDDDDD>
##$VPLIST= <PPPPPPPPPPPPPPP>
##$VTLIST= <TTTTTTTTTTTTTTT>
##$WBST= 1024
##$WBSW= 4
##$XGAIN= (0..3)
0 0 0 0 
##$XL= 0
##$YL= 0
##$YMAX_a= 262917
##$YMIN_a= -362016
##$ZGOPTNS= <>
##$ZL1= 120
##$ZL2= 120
##$ZL3= 120
##$ZL4= 120
##$ABSF1= 16.522
##$ABSF2= -4.171173
##$ABSG= 5
##$ABSL= 3
##$ALPHA= 0
##$AQORDER= 0
##$ASSFAC= 0
##$ASSFACI= 0
##$ASSFACX= 0
##$ASSWID= 0
##$AUNMP= <proc_1d>
##$AZFE= 0.1
##$AZFW= 0.1
##$BCFW= 0
##$BC_mod= 0
##$BYTORDP= 0
##$COROFFS= 0
##$CY= 12.5
##$DATMOD= 1
##$DC= 0
##$DFILT= <>
##$DTYPP= 0
##$F1P= 14.0000005364418
##$F2P= -0.99999901652339
##$FCOR= 0.5
##$FTSIZE= 32768
##$FT_mod= 6
##$GAMMA= 0
##$GB= 0
##$INTBC= 1
##$INTSCL= 1
##$ISEN= 128
##$LB= 0.3
##$LEV0= 0
##$LPBIN= 0
##$MAXI= 10000
##$MC2= 0
##$MEAN= 0
##$ME_mod= 0
##$MI= 0
##$NCOEF= 0
##$NC_proc= -4
##$NLEV= 6
##$NOISF1= 0
##$NOISF2= 0
##$NSP= 0
##$NTH_PI= 0
##$NZP= 0
##$OFFSET= 16.522
##$PC= 1
##$PHC0= -125.6118
##$PHC1= 5.207665
##$PH_mod= 1
##$PKNL= yes
##$PPARMOD= 0
##$PSCAL= 4
##$PSIGN= 0
##$REVERSE= no
##$SF= 250.13
##$SI= 32768
##$SIGF1= 0
##$SIGF2= 0
##$SINO= 400
##$SIOLD= 32768
##$SREGLST= <1H.CDCl3>
##$SSB= 0
##$STSI= 32768
##$STSR= 0
##$SW_p= 5175.98343685301
##$SYMM= 0
##$S_DEV= 0
##$TDeff= 65536
##$TDoff= 0
##$TI= <Analysis number 999999
Compound Code 99
Book Reference 9
Project Code 9>
##$TILT= no
##$TM1= 0
##$TM2= 0
##$TOPLEV= 0
##$USERP1= <user>
##$USERP2= <user>
##$USERP3= <user>
##$USERP4= <user>
##$USERP5= <user>
##$WDW= 1
##$XDIM= 32768
##$YMAX_p= 574423474
##$YMIN_p= -330013
$$ End of Bruker specific parameters
$$ ---------------------------------
##NTUPLES= NMR SPECTRUM
##VAR_NAME=  FREQUENCY,     SPECTRUM/REAL,   SPECTRUM/IMAG
##SYMBOL=    X,             R,               I
##VAR_TYPE=  INDEPENDENT,   DEPENDENT,       DEPENDENT
##VAR_FORM=  AFFN,          ASDF,            ASDF
##VAR_DIM=   32768,         32768,           32768
##UNITS=     HZ,            ARBITRARY UNITS, ARBITRARY UNITS
##FACTOR=    0.157963299565203, 1,           1
##FIRST=     4132.6476996994, 0,             0
##LAST=      -1043.33573715361, 0,           0
##MIN=       -1043.33573715361, -330013,     0
##MAX=       4132.6476996994, 574423474,     0
$$ Real data points
##PAGE= N=1
##DATA TABLE= (X++(R..R)), XYDATA
$$ [...]
24174 -55205 -82170 -38171 -68328 -23085 -7731 71167 -24143 -91921 -66741 21420 38988 40027
24162 40027 61805 4763 -11879 37819 30396 -18929 -6078 62807 54380 90650 113613 107312
24150 107312 16216 -1611 57738 176542 167474 60265 77485 92705 -484 -3688 -38 -4929
24138 -4929 -29406 34190 70539 20334 39137 78158 777 -12727 -46058 4976 -4030 -73547
24126 -73547 -77861 -38928 10459 62498 18258 -38792 19650 -24457 -57130 -91563 -69878 -86156
24114 -86156 -47029 -17784 -69302 8350 88422 82069 110544 78971 111391 116923 130912 106016
24102 106016 72688 1841 -17954 68429 88303 89078 73833 30579 -3239 24945 56589 52673
24090 52673 109482 17547 -43850 -8974 69565 451 -6903 -55196 -26868 -52093 -99186 -112126
24078 -112126 -77606 -43262 -44043 11771 -2558 -3527 9399 -50131 -31385 -9106 -40824 -34005
24066 -34005 62787 100799 4095 -104160 -144606 -106723 -121728 17522 174213 178489 122896
24055 122896 115127 116390 46418 -44024 -96960 -43682 -41470 -134501 -218913 -236073 -66770 -26708
24043 -26708 -105956 -50811 -4732 -20956 -25558 -57715 -85042 -57130 -24380 -12369 48676 79459
24031 79459 61149 100740 86148 84545 153802 130915 78801 101277 171625 173656 141972 84177
24019 84177 78923 50468 67677 67312 19714 -43606 -110408 -151884 -113619 -72744 -93440 -132824
24007 -132824 -69231 -23306 -12140 48748 41819 26509 30620 76731 154122 182072 167010 138129
23995 138129 65034 59443 137956 178640 115685 97952 -12815 -26976 -47664 -79643 -36109
23984 -36109 -3002 15192 17564 34819 61355 -25297 -39307 -52793 5882 41412 87016 11465
23972 11465 19345 37421 66043 108889 41480 69122 120195 108142 115086 195517 181163 138191
23960 138191 45658 31084 -13468 -86702 -122390 -120660 -106427 -71580 -119330 -89135 39932
23949 39932 48358 80992 56803 29877 110632 108887 56221 27795 -38177 -125539 -157577 -219149
23937 -219149 -146518 -40137 -24300 -40336 -71795 -114633 -39083 17495 -2247 -51533 29302
23926 29302 132622 147442 112370 56224 -43583 -47897 43710 30508 75514 210655 214061 78493
23914 78493 17462 7198 31458 -18835 28536 71572 15832 -42676 -64981 -44133 -22 26262
23902 26262 -2853 42012 113323 121633 83121 64880 -16117 -89152 -51373 -63006 -6620 16610
23890 16610 33328 108437 155656 118255 28538 -21643 -50026 -23126 35569 -4082 -36838 -17032
23878 -17032 41934 46990 49278 69266 83914 132979 85648 46641 22063 87792 105194 46524
23866 46524 -40113 20968 44634 3890 -35307 -44143 -2849 74523 7710 -10205 25891 -5679
23854 -5679 16079 8261 -31548 -23736 -63483 -48246 -16815 -50696 -8672 10742 84160 39825
23842 39825 -3266 40528 53982 38812 -4930 -35194 -42871 -43925 -70346 -68572 49931 30955
23830 30955 -68461 -158709 -199404 -153292 -50007 15601 -62407 -80884 -78075 -79536 -123702 -113049
23818 -113049 -47759 68202 117154 54161 -81212 -80811 -38017 14709 72588 67131 26741 32491
23806 32491 114954 136233 42533 -92059 -65279 5342 121605 138810 144257 118939 68206
23795 68206 32764 -74840 -161961 -155027 5129 42311 1395 10007 -9843 -87161 -123525 16396
23783 16396 37334 -103355 -121578 -70590 -28593 -53985 -78842 -160597 -105208 -19951 22508
23772 22508 34984 7790 -6616 -29534 -83165 -100529 -36893 4669 -48130 -48241 20304 39324
23760 39324 45693 -33377 -119711 -62240 -6602 -15882 62038 59981 52181 -14904 -127993 -97944
23748 -97944 -72148 -26041 -31115 -42732 32003 21932 37356 72684 34963 -23995 -43209 23076
23736 23076 96532 91118 18526 -62167 -25807 4394 30444 25130 14442 16220 23538 5478
23724 5478 -22793 25530 86272 84634 141789 161437 57635 39980 91467 25879 -25799 -9151
23712 -9151 2803 99165 167053 148739 128067 180370 81970 40484 77450 88835 106871 84714
23700 84714 92989 85858 7480 -60250 51935 59355 11277 -36517 -42863 -15208 66889 115444
23688 115444 79669 60037 50495 43004 17981 -13316 88151 19294 -89944 -170799 -165058 -130217
23676 -130217 -119790 -116433 -151917 -228905 -163279 -59566 -43 55254 59766 43384 19085 8222
23664 8222 -51701 -63146 12916 -22455 -42617 -46988 -34078 -63760 -42816 -2251 29030 -29825
23652 -29825 -38857 -85258 -80170 28203 42635 79915 132792 102367 -34612 -105040 -54811 -10381
23640 -10381 -5043 47912 11354 32351 234 -14855 -10485 -38933 -11497 -21505 -2539 45059
23628 45059 -9541 26214 72105 52226 63934 -10570 -41524 -24065 45421 39742 11732 -61092
23616 -61092 -92518 -84277 -65990 -18891 -43699 -125734 -228426 -252282 -127751 -1746 8666
23605 8666 -60978 -107142 -23935 -37420 -86331 -89285 -57854 -14582 62749 37284 69745 -21271
23593 -21271 -19530 -56320 -27922 -118202 -58662 -19311 38557 30853 -58851 -50978 2470 -369
23581 -369 39988 37367 14906 -7073 54925 5189 21789 54501 93044 30046 86012 182020
23569 182020 202011 92934 42932 21644 18874 885 12893 19933 47056 49324 20809 34395
23557 34395 -8031 -74690 -60519 -75442 -134539 -83953 -27290 -57202 -3509 1164 -7067 -24518
23545 -24518 17051 45 30960 -15092 46259 78967 14277 32705 8892 -104092 -64152
23534 -64152 -24730 -19510 8682 53561 138415 132980 91721 44915 -28746 -25289 27987 -31435
23522 -31435 -173313 -197900 -119875 -98657 -16650 1081 -11107 21218 7361 84793 106779
23511 106779 70153 34177 -7462 -36683 -48244 -30690 -10553 82176 100367 30981 -9389
23500 -9389 14458 -43382 -38496 -23144 -38864 -101192 -122762 -113165 -117962 -163613 -219745 -91826
23488 -91826 -32251 -17090 21968 -10080 -9378 2754 52552 74694 61230 66460 92488 141357
23476 141357 194316 168895 151609 83707 46143 83399 79663 9694 42112 29155 -3855 65650
23464 65650 30370 12656 30257 883 -21099 -41115 896 -11372 -75745 -69684 -46555 -72206
23452 -72206 -146188 -58706 -85152 -146488 -156613 -141715 -72751 22359 -485 -59372 -25951 37634
23440 37634 30644 -279 199 4388 2485 -5111 -36230 -95345 -98752 -15889 91980 46469 -36083
23427 -36083 -51119 -22230 -13685 -9977 -34719 -41209 12511 53354 34156 17032 52419 85460
23415 85460 41039 11163 63854 145094 63927 -25281 48573 98660 100355 112373 123811 89255
23403 89255 -35221 -56028 -29446 -72604 -110659 -131300 -18136 18732 -37709 -8717 118153
23392 118153 155514 182264 126199 148460 72694 29259 13681 49288 80570 84076 -35720
23381 -35720 -53173 24608 28137 -60259 -22231 27327 70547 36852 -26431 24669 29754 28113
23369 28113 6095 30967 53649 125889 80110 18171 48532 125063 71842 112970 60210 22980
23357 22980 20109 44726 9541 -43695 -36587 -15947 -20147 -79956 -151526 -98713 -8085 -13200
23345 -13200 -76629 -91160 -84683 -98711 -68729 8905 -60565 -83056 -122021 -106996 -55068 -30066
23333 -30066 -50115 -33934 15282 30781 -6121 9830 45900 77139 67494 124941 147367 107175
23321 107175 121176 88817 19214 -8910 -76377 -203880 -133940 -31463 31214 -31645 -65656
23310 -65656 -84498 -94465 -57992 -86135 -102550 36143 79701 32731 -35068 -44203 -33256 -36386
23298 -36386 -31109 -96081 -107173 -98089 -106394 -103071 -157280 -88150 -6154 18014 -48020 -88221
23286 -88221 -144407 -14402 63809 95617 49716 15238 -83969 -171668 -183375 -214582 -171764
23275 -171764 -162066 -140298 -90959 -8365 44408 55279 69368 92942 69191 50492 25774 -66475
23263 -66475 -94750 -62654 5498 8283 74443 208456 215718 92725 5672 -17615 53387 80194
23251 80194 106614 83953 31933 106 -12400 7395 -20524 24736 112185 121397 119357 134320
23239 134320 169198 180259 131760 170012 157540 141348 125629 66217 -8001 38691 20705
23228 20705 22844 74752 50947 -1832 -50854 -26988 -3877 63438 85138 32154 35044 39284
23216 39284 8003 -47551 60686 205109 215005 137744 31027 30017 64503 105488 34318
23205 34318 15358 51506 55160 3780 -35639 -34963 1946 -4149 -4902 35576 56285 36854 -9395
23192 -9395 -17681 -41351 -28789 15465 97549 55258 29260 57110 -7248 -77664 -104794 -121394
23180 -121394 -134869 -160626 -180740 -157565 -105378 -97693 -133872 -160982 -245716 -253721 -119365 4026
23168 4026 -23201 25269 -7228 -25870 87500 151691 95518 25445 -10753 -52902 -89914 -118128
23156 -118128 -76421 -36450 2782 34113 85035 153641 53206 -39045 -58838 23101 77051
23145 77051 86031 84152 135861 169999 97493 -29397 -37397 20927 -68688 -95826 -118979 -16276
23133 -16276 28488 53654 49490 56710 58312 -63090 -133982 -76287 -43844 13285 37827 -3125
23121 -3125 -53087 27843 38497 -18832 -29853 -63300 -95420 -1635 5942 -80078 -117483 -134936
23109 -134936 -69934 -130106 -214601 -203087 -151549 -103069 -4602 5756 -80927 -192288 -237798
23098 -237798 -217521 -275577 -301309 -238041 -191104 -188740 -114926 -27143 -3821 46599 73247 60626
23086 60626 65243 39770 -5765 -7323 98705 99566 14145 -33729 -74625 -3449 -2276 8460
23074 8460 58118 89437 40848 8500 -65006 -205431 -151715 7601 113173 148807 -595
23063 -595 -60229 -50362 -98391 -123578 -92461 -38013 -27793 -47319 -41847 17783 28676 38999
23051 38999 -18021 -100636 -125988 -110783 -103720 -123216 -76020 -501 39616 -30038 68438 179411
23039 179411 76282 -41851 -31313 47703 77056 38348 88033 223863 166011 54374 -4063
23028 -4063 -35209 -47561 -93166 8064 -2620 -25628 -34121 -87765 -109777 -155871 -53886 68755
23016 68755 50183 -5713 -67154 -71497 -80476 -104001 23833 80895 -55291 -121964 -121157 -88619
23004 -88619 -18537 -26063 -80597 -152406 -84038 26451 -79059 -86084 -77970 -80752 -56183 -6880
22992 -6880 -22089 36294 88456 144664 180859 113997 -15800 -137899 -96376 -53479 -40269
22981 -40269 -72848 -102517 -31048 -51453 -55701 -25304 -33322 -10391 26580 -20391 -84706 -56926
22969 -56926 21079 -28669 -95707 -40629 69792 42370 27645 64499 -5617 -71581 40038
22958 40038 89417 30028 27200 79527 5346 -60842 45364 111263 16984 -81122 -4443 52304
22946 52304 81935 70551 31401 -15741 -54341 11241 41248 15052 -35224 1789 37053 -34621
22934 -34621 -95627 -91685 -34435 -85647 -51667 -81196 -136655 -115529 -104892 -52048 12015 24774
22922 24774 34627 -19109 14616 150 -51269 -8672 38946 113390 161844 131809 146057 139821
22910 139821 72174 58533 79142 -24357 -79582 -64980 -115212 -132055 -114527 -19798 57690
22899 57690 96552 67051 -530 -28424 -72819 -103244 20016 119874 76815 -28020 -71121
22888 -71121 323 115040 97081 136015 107940 90946 1454 -74835 -92434 -51770 -82600
22877 -82600 -50527 -93440 -180450 -144386 -65043 -3527 90771 82311 51091 61879 76257 54676
22865 54676 8478 -38252 -48692 51539 56682 5054 -87258 -104916 -105927 -83706 -24960 7130
22853 7130 -33956 -7419 68680 -33211 -24278 -30122 -34060 -9311 39689 -59696 -96247 4958
22841 4958 -12288 29493 16553 61354 85400 35730 -32018 -45679 -35527 -48554 17626 8226
22829 8226 -47728 -75070 -91487 -166284 -136062 -26853 -12533 -77210 -93295 -109382 -46483 64763
22817 64763 125761 40217 -104931 -84671 17567 110529 115982 46971 25134 123104 93758
22806 93758 109221 147768 193373 186187 100222 13511 581 -5328 -5147 -116508 -145558 5507
22794 5507 56712 1033 -16982 -18311 -29864 -34950 45652 77006 49259 88214 44313 -113
22782 -113 -1992 94307 132360 144308 183173 170869 43667 40133 35908 -45826 -126803 -77600
22770 -77600 882 -49390 -158734 -182286 -85855 -56318 -51655 -12811 65474 53182 42941 11600
22758 11600 -72586 -75576 -41676 -42097 -16091 -14925 -28239 -33527 -6144 50814 47650 27323 61586
22745 61586 82120 60874 94340 85994 -36003 -72003 -129701 -44949 76000 49847 -25902
22734 -25902 -125540 -81457 -36594 -36497 17618 77813 55004 -49696 -102830 -29347 39018 1875
22722 1875 21471 41979 81155 -11905 -107123 -145014 -201140 -147085 -24589 2673 -46147 -49063
22710 -49063 -82466 -26843 -1862 -20770 -58573 -53581 47202 45206 9501 -14932 -83270 -67496
22698 -67496 55986 102682 68720 91944 106430 64533 36281 -59542 -96969 -72912 31928
22687 31928 63730 52020 -26793 32924 108360 65468 52795 41738 37727 80772 49402 -28699
22675 -28699 -71162 -132071 -55550 -76725 -25599 38223 2810 -21088 -60115 8623 36977 26257
22663 26257 -14510 -62261 -61925 -41074 -30907 -29786 -42690 -121162 -160396 -138057 -79343 -19435
22651 -19435 62563 17684 -68238 -98558 -158907 -195382 -134682 -41699 521 20267 55404 20970
22639 20970 17456 -44043 -52331 -100002 -107935 -70616 -80643 -54573 33833 -2152 -28995 16295
22627 16295 33207 16672 -56099 -10826 13568 47207 40653 -25182 -14152 -18731 -115523 -149905
22615 -149905 -87998 -81244 -85030 -80446 -112821 -97982 -106429 -65092 1151 69287 86524 71019
22603 71019 161653 128577 79364 -58141 -104219 513 -23049 -49774 -62912 -74869 -40829
22592 -40829 -27538 36065 117279 129557 83171 112021 72823 15692 -30070 -26570 29721 -5460
22580 -5460 -40773 -10073 2138 17655 37017 50342 -40573 -110001 -80948 -79922 -123126 -112331
22568 -112331 -148537 -135508 -133912 -84479 252 33243 82296 38829 -111443 -144107 -189079
22557 -189079 -167457 -76580 57326 94484 62332 17046 -100590 -180422 -207736 -208246 -121628
22546 -121628 -45164 28174 27977 -32847 -47756 -74326 -45229 -72727 -166813 -280196 -278984 -267365
22534 -267365 -280410 -184845 -123245 -78746 -89625 -9916 45932 129550 136523 2835 -25240
22523 -25240 -21249 4614 29450 15390 36565 23141 -7552 -9947 -4563 11938 -34883 -115840
22511 -115840 -114998 -141217 -108821 -51552 -19085 -31403 25273 55108 65818 48386 -21386 -65044
22499 -65044 -57508 -68716 1936 56601 54227 32065 -8819 -53299 -133795 -132785 -98439 -68257
22487 -68257 -52016 -101065 -53437 -22622 18070 15937 -42471 -40771 21821 100400 162156 200343
22475 200343 204716 262488 218881 199533 83693 -31505 5199 7635 27811 65266 30055
22464 30055 10160 24534 13856 -43887 -30355 58605 112278 120920 10145 -26062 13546 19212
22452 19212 22102 40545 10453 -80327 -47883 -24410 36301 45791 51802 -12054 -99418 -65187
22440 -65187 -41304 14986 -1897 -100092 -86559 46230 136782 51900 -87303 -157559 -98722
22429 -98722 -47728 -44307 32432 23272 -28890 -50410 -4480 -52548 -87789 -145155 -239453 -196357
22417 -196357 -206709 -221023 -302619 -225744 -16504 58247 39786 67555 8933 -61384 -64082
22406 -64082 -45579 -47217 -145180 -137335 -38252 -11382 11330 3581 -28472 -17474 -43972 -41714
22394 -41714 -48336 -29217 -22369 -25469 14968 26324 16812 -71067 -165803 -198871 -141291 -3743
22382 -3743 30785 -5675 -75360 -104533 -104180 -104166 -55141 -3549 24422 48429 32624 -15237 -36882
22369 -36882 -63087 -73419 -3326 -22615 -31419 8440 25408 -19501 -99233 -57071 -134605 -125990
22357 -125990 -71197 31834 93265 99508 38574 96055 46451 -10182 35412 40756 381 -44425
22345 -44425 -52221 -117742 -127744 -102239 -119195 -113263 -197845 -226160 -184792 -223612 -216461 -168142
22333 -168142 -78718 32712 -53355 -46391 -13051 -21115 -23329 -5417 -15476 -65466 -102560 -2352
22321 -2352 27463 -15332 -110930 -116305 -114903 -90243 42133 85272 94752 70529 11515 -101930
22309 -101930 -68079 38375 -10654 -35191 -17174 -68322 -92887 -67110 -133122 -107844 -39186
22298 -39186 -110252 -153397 -154751 -131450 -68346 -117096 -87963 46724 89387 154071 176239 138624
22286 138624 120782 129887 135609 230179 203334 18810 -45052 -37096 -21524 70695 54686 8766
22274 8766 -22083 -14139 7285 -40960 -139429 -184054 -148133 -38994 -9801 -94436 -71167 -26073
22262 -26073 -84823 -115911 -134036 -62090 5303 -30619 14830 27726 135466 196124 143920
22251 143920 110787 118101 64605 -39080 -88864 -124433 -60347 -9167 -35067 -72792 -52401
22240 -52401 -36174 -51898 -51840 -82532 -31442 -334 -25627 -7526 57505 -6644 46906 88361
22228 88361 -13498 -119496 -152001 -41290 3084 21328 -59053 2117 21162 13824 32263
22217 32263 22052 64691 40788 -12740 -10593 13738 8917 -69920 -76209 -74720 -120971 -208391
22205 -208391 -194458 -131511 -94067 -140648 -120578 -141988 -133633 -111004 -103468 -65483 -76083 -22135
22193 -22135 72287 95013 78292 79037 102520 29909 -69839 -80009 -18467 -17881 16130 93601
22181 93601 121332 105279 76810 184103 162747 105338 114289 85094 102398 163007 203194 196568
22169 196568 59324 -25863 12195 38683 67304 93049 95756 12110 -28153 6837 36971
22158 36971 -5025 -45391 -34435 -33562 -47617 -75050 -48084 -2752 67322 123637 79689 40096
22146 40096 -4239 -3839 5379 -16782 -788 8590 68842 116394 53753 4892 -15145 57616
22134 57616 38314 -50416 -72534 -83744 -51635 35391 93039 95416 35741 32937 39616 -53153
22122 -53153 -46384 6723 -11736 31824 30350 13114 60545 86221 14442 -11767 17037 14399
22110 14399 -58029 -127111 -149667 -67490 80175 100060 94290 147005 105002 25226 -5645 34424
22098 34424 84320 73998 112457 93669 10221 43619 47554 -16260 -58486 -95197 -18291 -25776
22086 -25776 26356 104160 140976 130187 58021 77659 33348 -38826 1260 -21869 19771 -51469
22074 -51469 -65112 -71208 8644 68324 -11134 -96793 -94674 -103090 -82075 -59103 6316 -20226
22062 -20226 -21583 -34270 25046 -48493 -158647 -85120 -78510 -30157 104701 119072 102036 110365
22050 110365 99724 109207 113880 43067 -33402 15862 13980 10368 78234 167086 129455 115388
22038 115388 86633 18387 -69512 -50888 -26330 -20837 -23901 -33707 -26577 21084 -25934 -31081
22026 -31081 -56720 -12302 -14321 -20380 15633 3170 2297 -34097 -26503 11474 93294 121288 127565
22013 127565 135765 98738 49112 -51678 -67575 -122107 -77995 -19151 48431 -2807 -11138 -4211
22001 -4211 -49485 -93779 -76918 -515 159319 149723 17460 -49889 -32953 39178 -11309 -132191
21989 -132191 -111828 -2428 48542 -29357 -131157 -72096 -10601 10353 52887 35658 1862
21978 1862 22710 2138 -51344 -128623 -139701 -109211 -64566 -84898 -93975 -59829 -11728 -5403
21966 -5403 -20817 -2171 12605 -36680 -50512 -45633 -39792 -25406 -57663 -47679 48487 137356
21954 137356 156070 116253 74109 132095 152894 161393 110566 105593 45731 70564 88388 -13824
21942 -13824 -57123 -85087 -82832 -69998 -54484 -20099 15120 -31279 -95256 -117875 -94237 -114664
21930 -114664 -60994 35437 31150 25480 64618 19549 -9606 -26812 -37507 -45152 -70671 -56665
21918 -56665 -12587 4173 77520 127535 216247 210646 93299 41214 5676 -2585 106893 134019
21906 134019 51945 76778 59720 -3345 -43285 -97286 -69551 -68873 -26286 38578 121635 170444
21894 170444 162280 134838 109530 79783 103390 144448 89812 -76529 -179089 -132292 -53212
21883 -53212 -78714 -58177 -64965 -156687 -209261 -224582 -143720 11875 104494 110147 19801 34869
21871 34869 82226 37565 1548 67996 57466 -74830 -76046 -36925 26726 44366 85525 96392
21859 96392 82571 -17247 -94654 -25659 48828 43412 -18581 52443 71995 72791 30351 -98731
21847 -98731 -171167 -158450 -170786 -122337 -63666 12713 -12732 -8940 7785 9853 -95 -33918
21835 -33918 -21441 -1400 -65455 -21478 20359 -70943 -58556 34433 62846 23542 -12330 28711
21823 28711 35379 45182 173275 179374 148062 72902 25091 71269 91476 69103 89792 108760
21811 108760 47819 57362 126000 81873 2189 -17784 -39995 -61651 -22077 25823 35336 62506
21799 62506 54775 9505 -1984 -1856 -13862 -108441 -97197 -2316 80827 81057 82195 43620 7106
21786 7106 -7211 -3046 -61804 -24843 1527 6834 -88941 -6468 71970 59979 16571 5436
21774 5436 -11772 -80295 -66028 -69837 -73857 -74074 -24120 -36145 -952 22443 -42883 -93359 -84041
21761 -84041 -39494 72362 84462 51960 -51032 -63368 -42028 -45709 -80444 -104446 -86838
21750 -86838 -42873 -16479 -5323 -2600 25728 49256 58068 752 -3818 -53706 51431 50782
21738 50782 36446 38989 51877 67551 55570 -61084 -23147 3176 -2434 -23774 -34195 -52774
21726 -52774 -100877 -8549 -63349 -91915 -70927 -13880 -69213 -122385 -158299 -84667 -81816 -12523
21714 -12523 -37170 -54442 -179 -27532 -40428 -61904 -135158 -58030 -50953 -56535 -48512 32696
21702 32696 36738 59422 18355 -57435 -139511 -141082 -128358 -151047 -127765 -115923 -188168 -192638
21690 -192638 -73214 24034 10300 -154185 -241240 -145378 -44737 -12921 26034 108627 117566
21679 117566 41299 82930 106715 95261 22440 -45827 -16278 1377 -23713 1150 -41529
21668 -41529 -35680 -734 6811 -107457 -86042 -118304 -140829 -133338 -110120 -68518 -44493 -106661
21656 -106661 -146469 -138388 10296 -9972 -59578 -65679 -73947 -80801 -3471 -75806 -84131 -62831
21644 -62831 -49776 -45658 -27016 -4170 6761 35369 71175 105134 53706 18688 54087 33492
21632 33492 -35850 -112303 -148462 -59723 -34460 -107631 -90477 -24667 14938 12243 -5172 5795
21620 5795 -47668 -8941 29720 -5500 -55545 -115952 -132610 -61245 -5604 5545 -45203 -54075
21608 -54075 -80605 -67263 -50315 -64639 -75383 -56716 -34675 -25304 -71763 -76113 -71543 -39316
21596 -39316 -55196 -97343 -117902 -86895 -61684 -24386 -7824 -88858 -228451 -189751 -12750
21585 -12750 19455 -64490 -1027 39656 10060 -52597 -32074 -19907 -76482 -119068 -146355 -173385
21573 -173385 -195451 -144553 -61761 9531 -53412 -32773 4402 29206 55933 39984 -27517
21562 -27517 -38451 52566 68270 35635 18966 -1575 -36661 -38783 -33098 -81871 -102371 -46750
21550 -46750 56624 103269 90070 63846 -1785 -9101 -107183 -176978 -66322 -27837 -63388
21539 -63388 -101872 -119710 -111546 -36396 19924 -22972 -75196 -84636 -140526 -188009 -138040 -101044
21527 -101044 -104551 -86796 -40597 3136 20376 53156 48403 -44025 -77087 -28696 12486 29865
21515 29865 -14319 -72767 -61127 -69815 -24293 8996 -10409 22458 45033 10029 7044 57128
21503 57128 43788 99492 117116 39820 -12123 -3217 -22003 -76786 -45340 -93295 -128496 -109074
21491 -109074 -116402 -92793 2089 46553 -45143 -123972 -71967 103189 79885 22973 68061
21480 68061 138480 170543 102012 41470 21626 81735 106111 120455 102128 122285 63418 12827
21468 12827 -21762 -25280 -8651 66406 120142 180303 197079 149394 68504 55540 34222 7834
21456 7834 7199 39176 -4544 36668 -9406 -96428 -93483 -53562 -36944 39723 37164 5507 34714
21443 34714 85846 135843 105573 73478 14783 -38662 -115204 -106522 -35769 80728 138735 158412
21431 158412 91549 -19858 -47196 -74528 -144568 -197759 -103519 -71833 -24726 -51868 -153987
21420 -153987 -151803 -132549 -183426 -194350 -59997 52897 65527 56853 -907 -62351 -89186
21409 -89186 -124694 -193953 -179422 -88984 -105152 -32205 58175 11405 8536 -28104 -73344 -38386
21397 -38386 -72504 -118698 -125429 -110306 -87645 -91846 -59614 -26795 31688 1983 52687 66610
21385 66610 114913 120018 90956 27291 -47643 -27845 41354 -13220 -69283 -92585 -59668 -63161
21373 -63161 -14217 -10036 -84167 -114696 -123484 -51580 86676 26397 -37174 -33596 -91766 -82114
21361 -82114 -75007 -144936 -170795 -159841 -137345 -53878 -14506 29602 135043 173111 177775 105005
21349 105005 54739 1541 -10899 35579 64614 50992 -1500 58362 -2840 -100066 -67995
21338 -67995 -50185 -60085 -63489 32216 65470 60239 40071 70396 63580 -48982 -101680 -75428
21326 -75428 -103828 -170322 -158538 -155143 -67782 -5837 31957 -63610 -84757 -60746 -64407 -59396
21314 -59396 -106840 -55310 80949 172255 181842 145544 70332 33314 233 11562 -15694 -101215
21302 -101215 -96861 -105842 -182368 -149813 -132603 -105159 -159149 -169080 -118968 44688 123315 219269
21290 219269 279399 258173 161492 98950 45265 -5321 6253 12837 96693 110442 79787 39215
21278 39215 40088 15038 -26391 -93353 -51590 31566 -548 15637 48461 25252 -11530 -133211
21266 -133211 -169603 -74934 25576 70895 7652 -54418 -40657 -25814 16414 87085 48247
21255 48247 -27546 16625 36688 67794 -19793 -23822 9721 152482 217663 92430 -39667
21244 -39667 -65383 -128430 -84705 -148138 -101345 -64865 -3598 19099 2708 -17901 54431 56872
21232 56872 39668 90677 121357 146726 76849 -15078 -1408 -1569 16141 1322 11543 -27342
21220 -27342 -59523 -43767 -31126 -44887 -98817 -72747 -28215 -2744 -78260 -41969 -209 -14597
21208 -14597 -3733 97629 109514 118780 63132 49786 41727 -19618 27237 23650 19817 9399
21196 9399 -28767 -77176 -111720 -114618 -77898 -76802 -92057 -12521 39967 41573 46896 62291 96603
21183 96603 -27096 -30976 46372 36827 -37067 -118122 -106330 -84957 -94842 -129393 -140108 -65014
21171 -65014 -6109 -30320 -42275 -13734 -65948 -142371 -187422 -114732 -76316 -76477 -87864 -5578
21159 -5578 19557 -22070 37002 97688 83609 87637 42391 43870 73121 70301 20430 -55797
21147 -55797 -33429 -64133 -100119 -72299 -19799 -45980 -114043 -148652 -118155 -53365 15786 9711
21135 9711 4167 -46930 -121641 -86304 -87159 -71922 -17227 -47990 -17338 44556 76875 36624
21123 36624 -34349 -53499 -64115 -102163 33267 80949 18952 6247 9930 -75389 -120089 -53821
21111 -53821 -111870 -188542 -138405 -117349 -108576 -82711 -102334 -129693 13912 74039 19937 14186
21099 14186 25713 -59275 -66765 -6256 101707 99897 35431 3737 -38222 -49007 -108529 -113627
21087 -113627 -99490 -21259 -23625 -11956 12351 11178 30647 -5603 -6652 -16968 -63690 -21893
21075 -21893 -30541 27181 96019 160323 45228 -106376 -108973 23381 -41079 -78536 -69740 -13914
21063 -13914 15175 28267 14346 8297 -97573 -120818 -96022 -10202 50879 -12726 -92634 -163624
21051 -163624 -170972 -193136 -216481 -142937 -117319 -35187 -24280 -91414 -16816 -14821 -18562 72246
21039 72246 91178 1229 -60138 -86167 -58074 -79434 -102272 -56717 -64876 -91526 -76469 -95172
21027 -95172 -93196 -109427 -56388 31134 -26232 -63924 -71466 -81233 -52668 -30400 62111 -1305
21015 -1305 -99085 -123459 -38217 79978 95013 55170 39664 -31253 -40886 -53603 -53358 -32553
21003 -32553 -70956 -27938 33004 -22072 -22326 -11214 34594 -34057 -29041 17761 -8437 -30532
20991 -30532 -54133 -45361 -13124 -95563 -127708 -33007 23338 2647 -45205 -155780 -162724 -150967
20979 -150967 -136203 -23677 31666 53271 19272 -79151 -51994 -102066 -172315 -142884 -84292
20968 -84292 -91983 -149510 -133917 -76361 -77892 -66315 -1895 113738 128057 -822 -72271 -60321
20956 -60321 -151236 -145107 -72058 -113818 -75539 -27450 -18969 3588 -14028 -60647 -110379 -145855
20944 -145855 -18324 56559 48746 22349 23957 27590 74953 -27393 -56137 -17454 -26976 -53837
20932 -53837 -111563 -107199 -70280 -93701 -100709 -129252 -93045 -15582 -772 30102 43255 22933
20920 22933 -70493 -88703 -13678 -15485 -56178 -40666 -43086 -76858 -73828 -99045 -160012 -175448
20908 -175448 -125883 -137082 -89883 -70970 -114939 -104659 -92035 17705 69909 36370 -68620
20897 -68620 -116474 -125480 -135935 -137052 -113739 -103306 -100535 -44056 -77329 -29545 30106 4367
20885 4367 27561 56307 65166 -73630 -125303 -67358 -93925 -64104 -50584 -25582 40729 58295
20873 58295 15164 -47762 -126953 -123859 -60815 -38392 -2429 20169 22350 102394 130254 95817
20861 95817 43784 -24866 -83811 -181696 -246548 -167187 -41457 -3783 11611 29616 1236
20850 1236 -101872 -43688 100067 148784 119448 133888 104253 91509 69261 29706 -1248
20839 -1248 -65699 -87542 -60535 47245 147097 120969 122293 145446 144402 138460 110326 68459
20827 68459 28448 37772 2931 -70067 -6962 97744 71885 64683 29774 -33909 23739 69339
20815 69339 60471 57490 72590 79450 53224 -19466 -48405 -86694 -84929 -41261 95064 88798
20803 88798 28557 -19134 68855 69761 57279 31167 106986 145500 137565 44772 44621 71921 46000
20790 46000 49706 11993 -30653 -6524 -22791 -29660 -41452 -5949 45754 100087 58424 76169
20778 76169 86704 86260 86763 63549 26549 -4408 -46007 -54939 -72209 -2013 -63404 -121409 -116918
20765 -116918 16410 95887 198762 150317 126134 66615 24907 91430 75372 14810 -8536
20754 -8536 81568 98628 76329 78890 136012 37024 -50522 -39425 37262 69953 31015 5332
20742 5332 13277 12708 -12420 -49798 -36508 12288 -47099 -73086 -59011 -38479 -57451 -81755
20730 -81755 -116354 -240398 -275679 -171001 -95015 -140427 -209319 -205135 -148569 -182548 -203934
20719 -203934 -146959 -59841 -112797 -80150 -47714 -60695 -5577 -25906 -104919 -116379 -84906
20708 -84906 -25621 42062 10645 10387 18811 -9249 -12262 -37722 -57285 -109021 -101392 -33312 61964
20695 61964 36620 -8840 -47602 -112186 -66992 11481 -57741 -107405 -72444 -49379 24091 35670
20683 35670 -37973 -95437 -29049 -21867 17530 49618 38104 37467 68428 91925 44281 -23944
20671 -23944 -51143 -43206 59056 124865 82252 23376 81915 38020 -35084 -62926 -50970 41866
20659 41866 34294 18438 42132 12152 -10722 -276 -69212 -102682 -117734 -113488 -119084 -122173
20647 -122173 -40564 -41649 -28126 105509 193882 110488 18169 43900 72933 53814 51742 77712
20635 77712 167691 77854 -122055 -87604 53613 215919 226846 107326 72002 72216 43802
20624 43802 48419 74770 37095 16125 -30366 -134978 -137052 -21314 19808 -92869 -107579
20613 -107579 -72932 -104391 -165679 -65342 45946 74257 16312 -52375 -142630 -146131 -144685
20602 -144685 -93180 -110247 -53680 7714 52614 46392 8382 -38310 -55780 -84322 -76844 -37326
20590 -37326 -33108 -40039 -22638 -55175 -122179 -94079 -82715 -78034 -129918 -130095 -87403 -68564 -51986
20577 -51986 -59340 8511 -27930 -45012 -42208 -66190 -63119 -51498 24663 83252 106050 55699
20565 55699 93745 104556 118255 150228 119718 20790 51206 54260 30405 12796 -55481 -31198
20553 -31198 -46953 -68452 -123869 -112199 -88610 -115941 -148209 -151761 -162837 -92895 -64694 -5497
20541 -5497 41510 52351 -1152 -30630 40262 57551 68149 -10079 -29667 25007 99446 101436
20529 101436 73035 55155 15183 61823 75991 -39085 -43940 37801 87020 49942 42064 51985
20517 51985 50926 79001 64585 11507 -19473 -25930 -99153 -105426 -29254 12656 -31386 -21653
20505 -21653 -61738 -24729 -21444 -40455 -1245 6360 41866 90857 -29564 -52246 -62824 -93886
20493 -93886 -80841 -172896 -158739 -97620 -15994 630 94947 178082 215166 156903 74996 13421
20481 13421 165 46983 91519 99047 104971 110166 59523 60775 -19264 -83705 -84643 -72256 -155017
20468 -155017 -116948 16425 136552 75648 17314 -55510 -28426 -57805 -25975 98657 170587
20457 170587 45184 -71661 -145239 -163342 -171294 -105215 -115983 -39255 -34029 -88658 -3598
20446 -3598 122708 122892 27981 52485 36534 13949 -33219 -88289 -14617 3374 -19097 5713
20434 5713 78204 87954 67825 -8604 -62147 -72633 1352 136837 192926 144961 84905 -16033
20422 -16033 -79098 6072 47274 764 24955 22909 99120 260171 299849 237978 75004
20411 75004 39666 53850 62328 48687 46545 98987 180587 201988 40863 -31320 7878 58256
20399 58256 -1083 -54250 -64144 -88045 -93475 -8279 30027 19328 45200 35737 53935 42160
20387 42160 21074 15166 86196 179450 274702 371708 464952 537184 578467 660250 795652 779649
20375 779649 678289 565523 433382 307377 172806 138914 195001 247358 241797 283992 335900
20364 335900 419011 484825 579960 661479 671058 594335 568627 494619 409042 362236 312988 284108
20352 284108 226141 154797 107839 51515 -44617 -36994 45623 75326 90205 117717 147836 84473
20340 84473 62322 53796 74367 104156 175100 275882 284044 261745 206885 209665 262504 227600
20328 227600 193527 167398 96237 121250 181612 275289 406124 474848 679817 672136 634940
20317 634940 668655 573401 482709 482288 421858 490411 630895 615605 666942 646661 590056 531361
20305 531361 533906 527044 540638 426968 332665 326079 235751 228269 284504 330208 322322 222269
20293 222269 148403 124311 158699 98993 115245 123129 129702 84364 19669 -94918 -23440 -11181
20281 -11181 -97006 -74064 32688 65825 74918 77820 -17421 63676 115373 124773 55635 70322
20269 70322 154291 100863 29334 48196 23098 17530 -9210 26831 48877 42075 76804 17281
20257 17281 77209 91080 74016 50099 59065 182362 198774 177746 130078 40694 61536 122958
20245 122958 184720 172319 102238 112382 74177 -40357 -93472 16228 107930 51948 -18524
20234 -18524 -64462 -115618 -57138 35827 165494 155518 95090 77751 46748 61583 44394 -27826
20222 -27826 -92882 -22960 117799 75153 -35417 -37019 -91744 -93252 -64014 -51306 -12091 15465
20210 15465 -37855 -38142 -103467 -77909 6904 72225 -23678 -55667 19563 6806 3528 7929
20198 7929 1609 -7997 -38327 -18865 -32555 -106226 -36269 73453 104600 31345 46718 24330
20186 24330 -90463 -140831 -191098 -154999 -28070 60906 59851 24646 32467 12064 -31086 -103540
20174 -103540 -36103 33602 160203 220031 215078 279481 287302 262182 237271 164268 159813 196658
20162 196658 218740 128456 97500 91364 134347 97932 122993 124934 85500 56111 66694 63538
20150 63538 52228 -22992 -42512 -79985 -52741 -38876 -14112 2141 47083 122520 55259 54729
20138 54729 58269 104942 167565 184432 125169 146188 120566 33886 -9511 2112 53059 91680
20126 91680 46291 9175 22085 -16698 -42988 -46353 -48689 -4828 55052 65964 58696 9874
20114 9874 29178 20875 -6616 17660 24115 50142 33651 -41753 15278 37111 67282 41938
20102 41938 -18197 -73569 -149335 -105704 8932 58730 5793 83370 145393 34907 -11089
20091 -11089 54934 74907 72893 120779 80157 -16894 -27714 49395 99746 130139 143777 118628
20079 118628 87549 21272 -26538 -22116 -28426 -43159 80205 111545 120433 99807 -7763 -74243
20067 -74243 -40523 45239 101587 99189 156982 142656 139416 100234 71475 105181 148335 202249
20055 202249 191799 153814 13048 -1480 102309 99364 130020 98371 17684 32376 138006
20044 138006 259013 229400 190761 213934 198677 259688 211313 224219 172278 112510 151812
20033 151812 207366 243008 169200 34229 9601 116829 56681 -12367 -6397 50586 58303
20022 58303 103347 66257 22740 65873 69994 65828 107377 166679 136900 148092 188819 157334
20010 157334 107381 134517 125104 128049 101528 127305 64702 -89265 -82303 588 122464 95888
19998 95888 98089 117432 95444 82965 41578 41975 -5748 -44156 58715 85105 26028 51252
19986 51252 74205 80295 99366 128758 127079 138616 180438 194540 195650 153421 21774 38749
19974 38749 97793 128116 135473 178308 183313 132926 101254 129546 170525 209091 207280 147433
19962 147433 57818 117710 78433 135544 141587 147260 164449 258836 218377 265225 285757 373590
19950 373590 382825 382816 309498 256361 238806 228062 289809 290653 280542 283971 250060 293091 313671
19937 313671 266368 222744 185599 170956 202403 300063 375497 304050 178903 262833 349975
19926 349975 336623 330292 247893 241068 316449 328888 400512 395048 352559 376368 414571 399048
19914 399048 412410 556124 669467 695459 645633 600719 509704 387206 381837 440023 497212
19903 497212 549738 591478 587551 615076 670514 793400 796047 724297 621237 505490 509736
19892 509736 579950 627244 649132 711470 806026 827141 719528 753113 778213 773944 731924
19881 731924 734025 797352 891917 959302 989640 1052540 1124121 1143252 1243062 1337580 1388758 1441709
19869 1441709 1485174 1572201 1643819 1801452 1933291 2106031 2349211 2640381 3064764 3487480
19859 3487480 3867690 4351109 4736079 5113563 5561219 6261883 7114838 8413224 10633139
19850 10633139 13891954 18025599 22286685 25493686 26312745 24952584 22470607 20456837
19842 20456837 19621175 20248081 22544390 26787652 33745739 44925811 62634336 89420359
19834 89420359 126119793 167365264 203886431 220418691 214344546 189729980 158145233
19827 158145233 127436980 100627325 79245186 63785468 55273439 53276672 56893036
19820 56893036 63876304 70547165 72838363 67700316 56846943 43840005 32473744 24177305
19812 24177305 18840357 15519611 13482834 12272108 11568017 11261092 11133047 11150793 11153710
19803 11153710 11110278 11014403 10954940 10987057 11201203 11704698 12681530 14290267 16857633 21017389
19793 21017389 27341568 36470708 48449151 61421335 72172051 76567772 73709923 66343127
19785 66343127 58978712 55884150 58893356 69112509 86770646 111365652 142072897
19778 142072897 176388645 211920911 238942888 248494239 229769369 189983048 141299146
19771 141299146 98426474 67700025 48350770 36935930 30054294 25967844 23913456
19764 23913456 23650687 25098518 27731142 30487099 32067959 30682974 26666322 21222527
19756 21222527 16119362 12318718 9804790 8213103 7295194 6692744 6121464 5590001 5126130
19747 5126130 4552050 3995398 3527624 3201983 2901479 2657550 2380736 2207792 1970622
19738 1970622 1812968 1759861 1639188 1685777 1679318 1582517 1452131 1459659 1455421 1314379 1233785
19727 1233785 1240346 1277091 1263976 1222155 1121202 1127033 1111701 1122170 1268617 1418785 1574190
19716 1574190 1673393 1669068 1539044 1314667 1113734 980390 998382 1081754 1132462 1244119
19706 1244119 1386197 1563160 1708075 1769046 1792554 1735322 1670550 1516544 1439153 1410421
19696 1410421 1542646 1746865 2087294 2525093 3281697 4212342 5057274 5711711 6202207
19687 6202207 6435373 6596020 6565549 6110084 5467035 4699019 4065746 3537364 3205907 3109597
19677 3109597 3162230 3222962 3336412 3525629 3650726 3698976 3512076 3098965 2637096 2316035
19667 2316035 2104222 1919422 1703796 1664790 1713040 1812293 1922928 1989853 1971935 1835725
19657 1835725 1597545 1432758 1251673 1081947 1001540 1062294 1209147 1352639 1588799 1879141
19647 1879141 2105350 2425280 2605362 2609842 2644772 2751090 2858847 2934425 3032355 3278033
19637 3278033 3816005 4528453 5280296 6065241 6568913 6718464 6692827 6529625 6278706 5805363
19627 5805363 5070654 4205716 3528233 3061914 2805342 2627656 2502687 2502018 2672315 2861866
19617 2861866 2937361 2998825 2874170 2655033 2367801 2040456 1768597 1552959 1347882 1151105
19607 1151105 865798 718561 684857 591320 451554 441792 465323 377787 366256 376468 347490
19596 347490 314257 228430 217301 261457 335412 379445 353828 288720 248967 286728 306833
19585 306833 321010 366654 403607 457141 453859 435188 462043 460910 443279 441672 493877 489425
19573 489425 525457 589161 647887 787147 994266 1050811 1089065 1044900 820333 535192 419163
19562 419163 371836 274242 254540 181682 151643 130739 115527 136889 150348 149823 137081 218313
19550 218313 310206 255129 239685 221145 252880 214047 174056 93265 25564 90389 96970 52482
19538 52482 37487 120977 132235 66019 70695 45034 70167 88009 96480 55128 25254 -38942
19526 -38942 -112024 -98787 -83320 -56173 -94397 -43561 -31200 25610 67865 45385 133282 66876
19514 66876 22063 20006 36796 -38845 41402 62831 57299 81893 77346 165765 221385 188588
19502 188588 189968 179353 127794 54973 -71430 -79154 -66818 9403 44721 47919 82558 62123
19490 62123 86274 25633 86049 121033 124865 45628 -24358 680 -30593 -59363 -57405 -104438
19478 -104438 7856 101044 70335 73867 66850 44978 2129 -57911 8420 9206 23594 46976
19466 46976 75371 154882 162007 89946 134952 40894 12190 -60069 -28027 46246 56990 -13889
19454 -13889 -6697 -75335 -118121 -117392 -66073 -111594 -70141 -14458 -7074 -4232 -31012 -19418 107867
19441 107867 120054 11037 41795 91937 113881 129169 170277 244799 247942 249533 123568
19430 123568 8947 -3434 -47263 -2583 46793 54183 15475 -42582 -39112 1381 107313
19419 107313 115690 47011 53673 81827 104563 69105 147812 115684 98421 64797 39815 47904
19407 47904 114038 106814 127948 56052 -7194 -11284 94403 84607 90944 214813 222770 159834
19395 159834 67803 6386 65234 132539 117551 70182 81731 -18585 -105939 -111940 -65010
19384 -65010 -31135 -8923 48117 20013 -21233 -34088 -4579 10662 -2509 83289 89375 167536
19372 167536 255440 331000 339821 306629 379919 564006 653047 603978 614880 690531 707245
19361 707245 627697 462530 358520 330362 386570 558355 633378 745781 762062 736390 787216
19350 787216 786651 656782 458306 341895 399670 399376 357749 302711 286661 231683 176740 157269
19338 157269 111851 112156 85794 50222 51507 64363 60999 120222 160185 137360 47273 65150
19326 65150 97200 172610 191623 75445 38890 46940 156187 232199 250618 225028 185406
19315 185406 217939 273901 314791 417085 527876 503543 523869 601796 695477 758383 834544
19304 834544 859463 902280 900584 890159 867215 931133 1010062 969374 899965 877333 898653 897432
19292 897432 823579 788865 762668 596122 512765 538506 561835 548751 582123 712865 736419
19281 736419 681064 486528 388858 322310 315254 216952 152628 134213 94371 94845 59926 128376
19269 128376 144495 157738 42777 51035 115358 110115 122468 91965 35847 -24288 -2687 64562
19257 64562 163441 171306 83158 66665 136338 279534 336570 303668 364694 479168 452206
19246 452206 486035 472075 495348 497720 540835 661250 635161 541262 435849 396703 350647
19235 350647 276965 203193 207918 279294 380497 458127 509526 593946 714503 881240 902068
19224 902068 848234 730338 526498 311327 174611 84690 98335 57594 48734 -20264 -75184
19213 -75184 -62757 -55286 -118870 -165545 -135081 -26875 14974 13352 83734 148288 93374 -32497
19201 -32497 -100299 -135578 -114792 -87519 -121351 -144095 -79716 -71662 -72048 18278 166278 84252
19189 84252 103150 89074 74514 111792 147861 138452 149960 121523 25166 3174 38750 20764
19177 20764 -23413 -68037 -87592 -93322 -112694 -69522 -15629 7617 4891 -29659 -64799 -160700
19165 -160700 -121855 7537 -16729 -29451 16916 23595 -39177 58227 76516 45313 20634
19154 20634 54763 95165 80593 15823 -26547 -10171 -13348 7858 -53201 -15041 -45659 4894
19142 4894 9328 -3536 630 6610 -21209 45801 -15675 -35162 42706 48185 77944 106553 32565
19129 32565 -82976 -104763 -116947 -77659 -105598 -185279 -229035 -197487 -113403 -65588 30453
19118 30453 8025 52208 15036 -29619 51437 110908 128692 165349 139551 30069 -27948
19107 -27948 -53943 -14552 23244 99840 78867 179531 296602 296596 190820 84537 76145 115030
19095 115030 143462 104403 164785 204711 165029 124976 182696 152502 97663 98156 184309 209263
19083 209263 265668 239494 205759 215520 169557 82299 40562 57695 85935 82791 52978 126523
19071 126523 179354 166671 93374 46135 71810 65433 17468 10681 -9061 24969 76577 92074
19059 92074 91724 81710 8368 68145 109700 115945 56422 38962 53280 83025 98133 86981
19047 86981 86130 109635 88036 31541 46462 3302 33427 67988 81862 110306 184638 210323
19035 210323 189247 150515 101759 70304 99654 58757 77598 145568 215353 263637 186461
19024 186461 105539 93271 100203 171658 145690 113382 117490 191197 168586 30248 76501 146764
19012 146764 41824 -38168 -79358 -80204 14882 162439 224016 198686 75119 18540 92334
19001 92334 137781 153423 131418 161975 148294 164342 207923 119873 97378 111599 117061 150431
18989 150431 264867 298451 255844 181947 161604 13150 17868 27508 31993 -5957 -6102 2106
18977 2106 16823 20571 54454 127826 121627 136628 195342 195000 173217 187419 281752 190985 87137
18964 87137 121972 151572 200396 213323 268711 296869 402996 396168 336526 298570 284952 218080
18952 218080 181615 221327 216165 220589 280129 322497 338455 287860 209440 238185 264764 176603
18940 176603 111049 130843 64206 77860 138352 108763 80037 184523 304853 308960 292184
18929 292184 307550 329687 283533 240662 244439 311143 386873 348123 339008 287650 292770 331161
18917 331161 383357 473824 537145 489441 441996 431821 436887 428563 473352 468972 482051 556666
18905 556666 552399 554422 590850 585583 589001 616113 679559 629707 678816 709138 632976 683163
18893 683163 683680 730720 773419 792691 821286 789870 830077 904010 1026784 1014148 1069664 1115518
18881 1115518 1130748 1254453 1421742 1503439 1598478 1794230 1993695 2215488 2432072 2640369
18871 2640369 2929985 3247806 3659421 4107841 4477423 4759640 4870963 4927673 5117997 5499825
18861 5499825 6222098 7405263 9284330 12057761 15670814 19656055 23390946 26863578
18853 26863578 28997485 28736360 27311826 25604280 24150088 23668024 25040669 29204847
18845 29204847 36960589 49883842 70238204 99554985 134212083 167251765 200141815
18838 200141815 223987717 225964884 212757027 190140982 161955673 130355068 102181770
18831 102181770 81627499 68315684 61698378 60959862 63665764 67288009 70724270 70149512
18823 70149512 63810247 54851768 44946379 35100887 26631528 20470732 16569652 14195271
18815 14195271 12718806 11818468 11401697 11323335 11388107 11372282 11255035 11062752 10907006 10919305
18805 10919305 11236519 12020568 13354413 15552701 19190110 24772890 32624849 42051766
18797 42051766 50940159 59120989 65622962 66737534 64034250 60744058 58599776 60031603
18789 60031603 66854662 79296511 97953456 123215621 150321823 174422763 191122983
18782 191122983 201247727 197464996 174431873 144894360 113641969 83627181 58785576
18775 58785576 41347355 30948383 25020616 21971724 20981256 21549489 22970899 24381952
18767 24381952 25813858 26298595 24453611 21309273 17672820 14145419 11040697 8596813
18759 8596813 6943670 5855161 5160079 4810318 4482964 4314030 4189749 3963387 3673410
18750 3673410 3314009 2854314 2499760 2275982 2089749 1912607 1752869 1698081 1585138 1480044
18740 1480044 1411811 1301496 1280970 1216204 1174596 1152342 1228928 1235417 1300041 1284629 1338859
18729 1338859 1413986 1514119 1645217 1533005 1387564 1214785 1037041 940967 867699 783712
18719 783712 806759 773849 758587 764623 807680 918935 918218 935517 914335 826092 845625 836654
18707 836654 778435 647177 669210 657165 493592 506689 511773 495074 548764 599506 579024
18696 579024 591089 581180 592233 546253 568033 590246 582607 642865 619086 593241 671814 573632
18684 573632 454617 464178 536391 502089 455474 530197 607213 660073 738908 795820 810793
18673 810793 758757 781425 801682 735875 737115 651945 548990 493312 395206 367587 313965
18662 313965 286922 214061 206829 174502 329228 378372 370352 515044 563174 619779 640684
18651 640684 666583 564677 487983 412411 464907 574060 555034 546672 573456 524754 497251
18640 497251 529860 573310 547374 567065 704671 888637 1066621 1188826 1308473 1435990
18630 1435990 1493078 1463170 1333293 1176576 1021676 798041 609651 548602 567431 563783
18620 563783 542003 514653 559892 637420 608096 486860 404793 326474 246495 240363 259234
18609 259234 286375 219757 225861 228281 227816 239404 290991 314591 335605 324197 349286 330462
18597 330462 282849 238294 176221 178816 265976 305262 399382 401865 484960 525304 538046 559497
18585 559497 581766 532849 509765 563375 658483 817196 979034 1110020 1220683 1313656 1402012
18574 1402012 1289063 1064548 899643 818249 650169 475080 268494 163760 124008 232401
18564 232401 311390 231964 227161 249724 301377 334669 323449 294498 319228 364535 279203 279610
18552 279610 323068 481750 546236 582883 655655 727172 818910 758521 716662 716598 763277 839134
18540 839134 869689 942971 1167824 1526600 2052024 2560710 3053505 3501009 3635155 3537750
18530 3537750 3309694 2919081 2455054 2000971 1621701 1323059 1193758 1198074 1228259 1311125
18520 1311125 1321567 1291310 1174267 941264 730688 534646 376242 377047 380804 361660 328421
18509 328421 386306 461986 480674 518870 554563 590106 691887 813360 893748 992236 913160
18498 913160 848926 842317 936817 1042751 1289561 1587357 1980996 2444785 3070286 3621086
18488 3621086 4100411 4536833 4699130 4470059 4151955 3895636 3661865 3585560 3765187 3960736
18478 3960736 4011328 4136536 4247780 4000762 3600704 3114813 2643470 2133977 1635804 1212256
18468 1212256 885774 716500 604120 502950 576311 609516 590043 594552 563013 560870 582612
18457 582612 527004 398193 283248 195453 212424 332772 362495 381009 489061 597982
18447 597982 695057 783849 1017821 1107510 1163150 1092680 1042539 986350 1001370 1150899 1336513
18436 1336513 1575217 1993681 2350781 2711648 2951385 3158462 3141073 2843677 2384304 1849443
18426 1849443 1247117 789599 634934 428544 316568 323053 341166 394495 384407 428610
18416 428610 473673 478075 451898 419489 387134 281356 186153 131783 127113 176521 157809 113071
18404 113071 10428 -20698 -11158 -2017 52730 19595 -28900 -29312 -16419 -93583 -108462 -72881
18392 -72881 -23866 -31951 -9241 -6604 -34468 58011 35855 281 -27412 98 -6782 -27477
18380 -27477 -61595 35813 24531 40540 109232 51834 34113 4275 117473 154448 51312
18369 51312 -29240 -42997 48210 103795 62720 60289 87081 74240 32311 50068 61413 183449
18357 183449 218759 115989 130403 160607 110038 84669 51773 129068 167462 194727 233978
18346 233978 347541 409694 529481 600630 674228 795688 838529 813895 747055 690809 551550
18335 551550 449947 369554 340566 280710 310386 345661 334747 307253 284563 268209 335200
18324 335200 387175 374128 355656 373984 424334 555132 645713 571852 468353 563882 633943
18313 633943 658970 762723 821841 849455 816575 852632 792757 770682 690503 522730 379312
18302 379312 365770 331700 320778 385164 394176 354952 341083 339111 324627 385080 451062 477716
18290 477716 544692 649283 668859 747709 761213 740103 645651 511407 476490 404353 366568
18279 366568 323199 319747 277865 292120 241770 224136 320672 367919 383824 366022 444645 494859
18267 494859 461537 446234 452215 544098 734689 843248 745938 692116 657920 547146 467493
18256 467493 420715 315302 308992 445696 520287 528906 549279 603037 563701 444267 421435
18245 421435 453481 498778 496874 390223 228815 134206 79676 99182 29262 80638 104744
18234 104744 165046 131743 88765 139476 236516 280328 235723 110879 81449 148325 53999
18223 53999 11076 40076 95234 82720 150536 173460 217619 197681 62267 115369 121359 139693
18211 139693 134802 122084 104598 82341 21228 51653 58069 25146 117049 76242 55779 79129
18199 79129 92696 74473 90593 70391 81990 69201 79296 127732 136348 142220 143442 103243
18187 103243 33393 -2547 -32820 26478 112682 141232 53947 41500 -9392 44075 58228
18176 58228 41694 -16173 -38358 -15901 43712 70138 79974 64442 82224 79918 104515 144676
18164 144676 122554 118725 159074 195177 270422 327517 292694 240709 149879 134977 220825 258082
18152 258082 290467 284550 299995 306664 276159 217752 249999 358606 374082 353464 408069 463913
18140 463913 461055 483651 615033 733469 774792 758271 767369 757094 896785 958892 991630
18129 991630 1139628 1300607 1408386 1578852 1837848 2080435 2446472 2856135 3391362 4033672
18119 4033672 4748586 5666272 6847341 8577005 11347596 15675474 22891507 34993729
18111 34993729 54642254 85542388 130683298 179381619 176704527 132853526 81980902
18104 81980902 47238069 29457788 19897048 14345830 10799952 8495416 6838298 5557340
18096 5557340 4576499 3851171 3368684 2953450 2613876 2339985 2143121 2022042 1867325
18087 1867325 1755335 1595173 1359975 1235873 1100349 979201 964962 887110 817838 753809
18077 753809 620226 568273 571729 548546 561964 602836 505251 370480 438851 471929 448797
18066 448797 383708 314315 277814 338040 407203 346061 274910 217847 148001 79334 69157
18055 69157 86335 100395 69377 60583 104067 105274 69836 16238 13274 50992 92672 114154
18043 114154 61846 38359 101761 180911 219344 234869 159381 63165 59810 94021 147827 154246
18031 154246 96556 145596 130531 116454 39043 15687 79647 173257 181883 61450 75598
18020 75598 175226 150199 73969 -11342 -17252 69276 54679 -50996 -172001 -128655 -28121
18009 -28121 29893 6941 57145 39040 83226 92171 77001 50801 79867 47792 -20997 -28104
17997 -28104 -52157 -81538 -157160 -144719 -42916 -44312 -33664 -91962 -103996 -58105 -24838 -38690
17985 -38690 7869 43704 130946 198609 249969 242612 244979 136260 87611 76195 54864 11642
17973 11642 -25862 -42016 36826 54984 -11562 -52536 -32688 -11475 -300 25089 -40929 -61297
17961 -61297 -73193 -29353 -20128 -3590 -20071 -17440 -30005 -25439 -6154 -26395 -102564 -109313
17949 -109313 -81130 -75993 -21038 53053 -21532 -87138 -82077 -135533 -158774 -101767 -34400 -7404
17937 -7404 -20694 -59099 -78907 9543 -40099 -78588 -83345 -124088 -144394 -109186 -38226 15324
17925 15324 64367 29020 25129 -59109 -124235 -153625 -33201 -15004 27886 82454 52715 -22900
17913 -22900 -40617 -17553 -95157 -87014 -69628 -79732 -9205 15792 -25427 4802 47492 38472
17901 38472 -13832 -54325 -63443 -37239 -265 8555 39473 783 2141 80645 110962 71125
17889 71125 29450 -13374 14107 44957 -20788 -63676 -51443 -7851 -64365 -112892 -154939 -149656
17877 -149656 -161678 -209621 -95978 20106 109471 61519 -46286 -148076 -118262 -27252 -748
17866 -748 931 -109642 -130092 -144109 -143533 -37429 -26684 -98162 -109690 -69414 -611 87763
17854 87763 109137 -318 -99577 -178657 -129786 -187282 -204070 -112099 -78680 -36130 -13111
17843 -13111 -49138 -53444 -80480 -49434 48161 42876 20502 -62899 -87123 -95756 9411 75968
17831 75968 1053 25023 -49004 -71104 -48113 -92750 -131357 -141177 -105145 -91797 -24551 22497
17819 22497 35329 -142247 -218853 -153674 -115737 -134146 -128795 -120644 -115790 -145762 -76342 -21775
17807 -21775 -33854 -11500 35921 78500 94541 35874 54236 -13430 28656 46879 67561 -91514
17795 -91514 -183110 -32984 76737 47937 -39288 -10037 14305 38997 80580 88887 94926 21938
17783 21938 -29706 -67191 -125251 -144809 -152960 -160238 -67185 25036 87373 21565 -68200 -218319
17771 -218319 -269773 -312429 -269266 -141209 -78270 -63992 13857 134588 129208 13074 -27015
17760 -27015 54730 68470 -74771 -144617 -17584 -19299 -94995 -60648 -75302 -39865 -4871
17749 -4871 -120622 -96987 -61878 -52689 -61314 -16424 65055 105974 96424 66352 56308 47813
17737 47813 48775 79618 64148 79197 79160 15508 20560 -20099 -54179 27778 77863 118260 87652
17724 87652 14381 4633 -1685 -41028 -22078 74610 41535 26185 -50377 -52894 -36270 -29114
17712 -29114 -51537 -93368 -29464 -21948 -58880 -102341 -108573 -69580 -66108 -104428 -60610 -131006
17700 -131006 -173851 -145712 -66737 -46769 -70315 -129129 -162727 -45661 -13996 -39912 -69112
17689 -69112 -90690 -195571 -217793 -148634 -84284 -124535 -152075 -141284 -80885 -75353 -126937 -135118
17677 -135118 -160598 -69502 8136 -77705 -34680 -25533 -64102 -96388 6234 73156 21700
17666 21700 -31094 -15785 -7692 10770 37812 -185 -71872 -103366 -174653 -161997 -126961 -88117
17654 -88117 -16950 -12886 9498 83913 96179 124377 108117 40462 -21439 -33740 -59152 -39961
17642 -39961 -48101 -98421 -101726 -83505 -75657 -49135 3814 -281 -6281 1547 24036 -7929 14301
17629 14301 -42916 -110140 -47417 -4667 -2363 38997 69571 11131 57003 7781 -110868 -167687
17617 -167687 -143343 -82425 -11790 45040 106499 141652 79006 43177 6247 -18291 -32942
17606 -32942 39125 10264 -79226 -150815 -116071 -43709 -7940 -330 -40167 -54928 -54859 -45943 -37040
17593 -37040 -57212 -49515 -117211 -78417 -55325 -24087 45380 54651 57937 50469 113154 104508 38132
17580 38132 -49165 -44043 21178 -33698 -34163 -15611 -107978 -105208 -82773 -166305 -181263 -146679
17568 -146679 -140152 -169665 -140254 -90108 362 -47703 -71685 -75920 -124579 -143025 -100534 -98442
17556 -98442 -64355 -102505 -95388 -51981 -21302 -65810 -56597 21287 52745 53081 18103 74965
17544 74965 7708 -44791 -45485 -78326 -86050 23778 31203 35501 -21902 -70560 -85895 -22415
17532 -22415 -56300 12616 -63634 -45782 17076 7824 72143 47714 47738 102034 148949 72967
17520 72967 -32440 -64395 -618 51332 43434 45606 40771 77171 20918 -43229 -33274 52968
17508 52968 115001 143608 78551 -5662 -26954 -27013 -48558 13149 35408 -66224 -78326 -138800
17496 -138800 -153156 -137339 -78625 -84627 -58767 -78750 -129439 -119707 -11642 25207 44770 17617
17484 17617 55609 4690 -28087 98 -80958 -86811 -31478 -9193 -42841 -45779 -34498 -52467
17472 -52467 -163351 -195656 -91924 -9354 -51557 -79852 -44557 10942 -8388 33319 -81596
17461 -81596 -99522 -1615 34056 38868 14367 39434 36731 2996 -13446 44194 -22051 6645
17449 6645 45701 109621 25218 19678 151207 289408 529258 855978 1050042 800890 504758
17438 504758 253982 148172 39365 -73220 -87341 -52540 211 -86491 -143653 -136165 -110430
17427 -110430 -66754 -58849 -137072 -88435 56643 96666 -4903 -73786 -87328 -52433 -7487
17416 -7487 -43959 -67975 -53217 12952 11897 -25583 -29758 4262 -6091 -41039 -5526 36832
17404 36832 96148 66961 30751 9087 12631 -62106 -144575 -143615 -107705 -103169 -40517 37707
17392 37707 10104 -27402 -83947 -101956 -74177 -99636 8347 -40302 -86147 -62248 -15322
17381 -15322 615 -11451 -7324 -19561 -49250 -7035 -42055 -136003 -122860 -123367 -77958 -27516
17369 -27516 -55741 -129949 -134694 10617 26184 14373 -126531 -191425 -190081 -173757 -182774 -149252
17357 -149252 -29185 65170 6935 -30336 -60006 -20550 -58384 -64298 -29662 -72117 -52367
17346 -52367 -4697 11137 3352 -2351 20818 55268 68796 106682 113583 28991 -118804 -127322
17334 -127322 -97200 -115403 -33908 51485 78225 -33234 -53882 -129638 -119945 -36592 24524
17323 24524 102228 177350 191787 75467 -33631 -547 54939 70220 60302 128384 165539
17312 165539 97577 872 -49474 -60023 -14250 15860 -24098 -100949 -29070 22530 -29356
17301 -29356 -930 39108 16295 -4809 90446 92810 73547 28678 38601 78904 -3632 -53527
17289 -53527 -6068 -7794 -32615 -44319 -34320 49237 70815 -13275 -66007 -112714 -101679 -118139
17277 -118139 -173567 -226993 -188421 -115995 -181343 -123804 -51738 22149 59715 -11611 -126813
17266 -126813 -217332 -185076 -120723 -122793 -160340 -92372 -117682 -83293 -15569 14188 20548 -7624
17254 -7624 -116173 -136351 -137351 -153463 -88783 -66228 39565 77467 -50990 -41824 -16452 70684
17242 70684 49665 19011 -13765 29163 35568 691 -39221 -61050 -37749 -59070 -1276 52366
17230 52366 72745 78264 129808 98365 28483 11292 -56936 -34481 -18373 -46931 458 38169
17218 38169 17501 22621 82786 76973 33503 18038 -15147 53512 75587 39020 80038 100955
17206 100955 12428 45764 178063 146722 100600 92783 130734 127409 195676 214909 134793 37319
17194 37319 16848 -51777 -123208 -56565 90388 161262 156922 27382 -77601 -104040 28443
17183 28443 115286 135555 137026 -7542 -113468 -122646 -108608 -175248 -167083 -66657 -33567 9817
17171 9817 29127 33556 -35132 -92335 -55947 -2132 -8407 19488 -41437 -94911 -126469 -116091
17159 -116091 -100622 -5419 -34800 -48212 41359 17361 45891 -56076 -108668 -68633 -55236
17148 -55236 -10474 39812 41298 -2645 -80411 -97826 -68560 -115790 -127995 -154333 -141761 -138069
17136 -138069 -162735 -111005 -38640 23471 48986 -71817 -99816 -105622 -36677 -4208 -85332
17125 -85332 -137421 -58758 -58416 -39529 39537 72665 84229 81350 30631 14963 -28906 -110664
17113 -110664 -179236 -215350 -180265 -125703 -131697 -55566 -129213 -190743 -192591 -204742 -163769 -41487
17101 -41487 -46117 -42760 -38328 -28019 -10843 23267 34505 -29842 -102967 -110947 -90574 -38878
17089 -38878 -63970 -68574 -34142 -80533 -106645 -104904 -98280 -144550 -178001 -144787 -109303 -76443
17077 -76443 -50084 -38056 -17181 -21315 -15108 -5358 47652 80974 50753 -21063 -47673 -74019
17065 -74019 -124863 -99853 -139773 -185955 -191714 -142620 -82126 -88240 -1429 11289 -42818 -46638
17053 -46638 -7702 -18590 -66490 -81091 -61129 -27902 45603 44450 8644 -42775 -62805 -2848
17041 -2848 92189 79793 10320 73649 89827 4201 -1947 -4005 -39406 -65436 -97785 -94343
17029 -94343 -127763 -88505 -79400 -39131 -31225 -74141 -39685 -48009 -34680 -21379 -41524 -65784
17017 -65784 7797 -20221 -116299 -146678 -132289 -209273 -257470 -212478 -117519 -73729 10281 51117
17005 51117 42878 17720 -23024 -57927 -2680 41358 1300 -20615 -8695 -7365 -3303 48487
16993 48487 77379 -46508 -112059 -133899 -81632 -17979 -8046 -1827 -28920 16756 92640 157895
16981 157895 90539 70181 100487 58994 -32127 8889 69553 80858 35686 -44872 -29073
16970 -29073 -43890 -65195 -21837 -23619 -9914 19937 -55904 -128058 -132226 -146198 -120483 -68439
16958 -68439 -143926 -118748 -69869 -34827 -11937 -4944 54444 67340 -11564 -68427 -78102 -28428
16946 -28428 -30427 -38694 -57392 10745 106454 162118 114653 104584 82000 21498 -93230 -126805
16934 -126805 -40173 -37163 -123922 -172510 -182284 -86241 23178 -5069 -44210 -41203 -71644 -48006
16922 -48006 -6612 10100 8846 -94176 -196580 -203079 -126941 -97156 -46002 -48987 -7888 38389
16910 38389 47719 8695 -8051 -24366 -89729 -137371 -118717 -74793 -31565 -48642 -8069 7187
16898 7187 -22472 -18599 -43126 -14711 -45413 -124143 -93713 -80641 -105748 -175378 -251141 -241482
16886 -241482 -130695 -108682 -123802 -103252 -49385 -53636 -31931 -6401 228 -42153 -16110 -20280
16874 -20280 39669 114528 56647 19935 4969 24007 6886 -64316 -65620 -40896 11366 39645
16862 39645 32473 -77790 -83418 -68423 -111072 -103307 -142893 -169296 -155913 -131996 -83139 -7151
16850 -7151 14342 16965 57456 26340 -73228 -102998 -97794 -39220 9113 -20715 -33568 28029
16838 28029 24362 17267 -49488 -45526 -49548 -33459 -48955 -103415 -154130 -90937 -105149 -90170
16826 -90170 -66305 3645 71699 -19991 -19630 -19926 11355 28635 -10315 5585 18087 13410 -30156
16813 -30156 17876 74982 37832 17231 -80457 -189567 -286321 -159664 -69231 -99135 -26796
16802 -26796 -3568 -3253 -64569 -146477 -199567 -186295 -106209 37397 78788 36624 21522 -40847
16790 -40847 -109655 -98318 -100305 -67966 -56736 -78476 -6004 22696 35864 42334 -55827 -20162
16778 -20162 -8265 23701 -88902 -57473 -58052 -42679 -67827 -46325 7557 51393 76528 53211
16766 53211 -27867 -16249 -8970 -54035 -67089 -92606 -46406 -24284 -12837 -75848 -98694 -97821
16754 -97821 -44372 51939 -4048 -80286 -131034 -129120 39806 32132 -64179 -64479 -57196 -13742
16742 -13742 -95537 -168240 -149828 -154555 -121684 -79305 -98429 -79792 -109953 -122362 -125187 -144592
16730 -144592 -95655 -75524 -36353 -99072 -47285 64549 136473 173899 217000 185797 38545
16719 38545 -53946 -61368 -18082 -15648 -13069 -35102 24867 68331 103013 -25931 -33564 -69327
16707 -69327 -82815 -73955 -101913 -145064 -104256 -71976 -31011 -19830 -98375 -174793 -113085 -29138
16695 -29138 -9447 35261 -38635 -82792 -117768 -141697 -45883 -7585 3248 -11460 128 -93341
16683 -93341 -76211 7329 -17273 5681 23269 -13106 36222 97217 84910 66195 133253 139288
16671 139288 76969 -47024 -56940 -9411 -10982 -49504 -32999 -78916 -48235 -71715 -96394 -82733
16659 -82733 -65502 -86348 -45891 -5686 -1374 26971 129818 120386 90884 35874 1200 -47382
16647 -47382 -54460 -74360 -65027 -31879 24583 -1147 -106859 -126361 -167594 -251179 -215526 -79694
16635 -79694 -1352 -7384 -56378 -29858 -30402 -5505 -64153 -117451 -164486 -153095 -155437 -219161
16623 -219161 -184099 -113682 -84700 -54218 13503 38941 4681 -80982 -58651 28077 70691
16612 70691 -5821 5204 -28529 -22077 -27951 10103 46588 21161 45870 69266 71196 16561
16600 16561 59838 85753 109767 88773 -18933 -22746 26165 12622 -20728 -43741 -42023 -3608
16588 -3608 2948 35503 91267 24554 -54564 -79295 -103310 -99479 -83953 1902 -13596 -17841
16576 -17841 36893 44142 -35048 -100165 -134940 -96340 -17367 90187 57067 -80342 -124960
16565 -124960 -179738 -133138 66302 99453 7075 -48009 -30508 46232 40482 89054 46322
16554 46322 -67351 -41178 -40182 -64582 -114257 -26292 74717 121148 79916 58673 8151 -13686
16542 -13686 -30740 -77784 -28275 2450 72820 150247 96401 5380 -7054 -29659 -70733 -127885
16530 -127885 -171084 -122297 -112167 -37815 -14638 -9831 -54644 -56862 16623 42170 9079 2003
16518 2003 4620 43712 57297 -5302 -117582 -91461 -39730 -46219 -13009 14899 -19093 -23046
16506 -23046 115757 136991 103066 24760 -33775 -19878 64356 44931 61240 105030 77664
16495 77664 55302 9417 -38219 -25033 1837 81174 60556 -26374 -100141 -123848 -27186 -12942
16483 -12942 -39818 -58866 -99802 -103578 -81154 -77624 -75495 -6430 31074 6733 -47285 -96046
16471 -96046 -52227 -12968 -31221 -84401 -48649 50836 42647 41063 73037 102019 16233 16735
16459 16735 52946 11485 -36533 -193697 -233529 -171659 -149538 -61651 7810 -59921 -156579
16448 -156579 -162972 -89196 -47756 -13172 64648 17812 -69801 8870 5541 -7539 12689 29869
16436 29869 77405 129672 216621 204614 116849 34965 -13828 79614 132836 105166 11405 -57686
16424 -57686 -15725 44993 47992 -26441 -53303 -56609 -153284 -155889 -108169 -44898 -10862 20908
16412 20908 58248 -10530 -30481 -71713 -66284 -39755 -68684 -120103 -98702 -54731 -76509 -54918
16400 -54918 -22110 -41127 -39668 -17688 2648 -78878 -58462 -24245 48838 64639 130082 158357
16388 158357 73369 43056 20951 -11875 -41163 24660 38889 2592 -36665 20185 110020
16377 110020 79997 76353 -47741 -77726 -92198 -2204 112669 244984 272495 221900 157698
16366 157698 172305 126560 95748 76126 83642 77896 41783 26471 57934 76291 17756 49790
16354 49790 69171 47996 -50176 -40827 55969 63656 -29432 -81757 -89375 -68303 -27078 -30245
16342 -30245 -64151 -103187 -139159 -179660 -150191 -79554 10049 8517 -331 83811 61027 618
16330 618 9630 20787 -7940 -34434 -46902 -60442 -614 28573 -8815 -50507 -12428 -45704
16318 -45704 -52208 -24806 -72244 -42961 73567 105664 73812 18069 -25011 -11182 -11275 -3363
16306 -3363 77627 51533 -10128 -45160 -49156 -117930 -107399 -35156 -48687 -90403 -121681 -116859
16294 -116859 -63065 -68345 -39941 -9800 -5386 7652 60694 56879 -742 -112835 -29075 -26710
16282 -26710 -51793 -50503 -83716 -133108 -197985 -181064 -86091 38420 101489 98083 107445 46006
16270 46006 17189 16961 13465 5500 45695 61897 37730 46850 46350 -37593 -42296 -81588 -125153
16257 -125153 -53384 -88435 -121758 -98449 -84482 -101500 -84039 -73158 -45546 -27291 49975
16246 49975 5982 -49416 -41732 -63439 -53334 26887 35209 -45220 -107823 -132125 -146759 -92984
16234 -92984 -90443 -97566 -65019 76338 168640 134062 7736 -54742 -100571 -146290 -112974 -67168
16222 -67168 -28623 -32594 -97327 -97033 -26738 -651 18960 34246 -98006 -144686 -114891 -12613
16210 -12613 19290 26755 -2579 20528 3071 -42017 15451 48435 37961 -536 -33757 71133
16198 71133 115164 -18774 -10738 13415 -11046 -27518 -30289 -69139 -82818 -17813 9723 -24439
16186 -24439 19959 41549 90025 59385 38471 40337 84764 103316 73121 48787 -8946 9542
16174 9542 -9659 -26512 -13691 25961 83427 121885 132209 9725 -74329 -114804 -142179 -146557
16162 -146557 -192116 -118886 -7906 -13730 -59264 -113066 -193167 -194756 -63654 -18730 -50758
16151 -50758 12665 78200 24164 -20392 -23510 9936 79251 98792 117620 89051 22383 42646
16139 42646 95369 54901 70464 52019 58323 57022 63520 170535 185085 76858 66347 59236
16127 59236 155246 214861 180032 119974 109627 173428 124737 53862 56550 48837 -49487 -90685
16115 -90685 -109643 -65473 -66184 -114773 -134774 -69033 -123567 -120466 -26444 -47212 -270 56470
16103 56470 75318 37030 -37284 -85212 -39280 22458 78299 35575 -55451 -68797 -30719 -1115
16091 -1115 -6777 -5320 19854 65392 44551 -96008 -91851 -75197 -192856 -166157 -72076 -31694
16079 -31694 -118397 -108088 -82267 -91034 -96787 -17892 2312 24124 -41385 -109718 -137879 -64212
16067 -64212 -55948 -49933 -105405 -132514 -75637 -17501 71451 73621 28306 -16043 -48102 -6051
16055 -6051 139472 215292 166847 46239 38341 69831 10962 -61038 -16862 25794 -17898 -53622
16043 -53622 -112804 -114208 -76531 -51181 79213 105931 9428 9456 -18803 2225 71507 46948
16031 46948 19178 44708 72881 116239 111887 30517 -83005 -35359 5047 21995 -16055 25105
16019 25105 30665 -49226 -72539 -49949 36116 39116 54066 39056 -21584 -62085 -132006 -208091
16007 -208091 -166195 -116434 -55588 -16771 36478 25433 -15042 -51319 -82731 -56602 -42629
15996 -42629 -78194 -110040 -86163 -80069 -50955 -93071 -96350 -36554 -81382 -103574 -49620 9465
15984 9465 62948 42792 2642 12677 44191 -42119 -54209 -25298 -62095 -125424 -154635 -168663
15972 -168663 -51519 6417 -1280 -56312 -24041 6562 51518 88943 123695 107900 18825
15961 18825 -10747 23329 70054 58156 -41554 -1542 53902 48164 -6021 -17257 1242 -77305
15949 -77305 -24880 13609 87514 85952 13893 -60902 -92688 -98221 9495 37889 -20026 13348
15937 13348 73003 -18811 -39917 -29065 -28834 -56570 -45534 -14646 9164 74923 29068 15791
15925 15791 -18617 -30794 -39157 -87044 -138268 -207155 -166426 -163509 -200893 -221743 -188559 -51942
15913 -51942 33729 46403 -36020 -78605 7809 56650 16526 -35093 42300 75316 75456 -15709
15901 -15709 -7718 34095 -3468 -57709 -49109 20008 86543 99777 46775 8594 -17399 19430
15889 19430 -6806 11889 32657 85758 61401 2998 -24014 -35821 -42685 50540 107570 128922
15877 128922 177774 197749 171807 87334 75392 69000 62569 54928 16965 -69805 -40563 -87140
15865 -87140 -64736 74097 69312 58738 120100 114546 59697 67934 88712 54535 -304 20414
15853 20414 61604 29286 -29541 -73847 -46554 46496 32463 -43484 11896 114722 96784
15842 96784 25763 22499 31037 69 10624 35153 77881 50408 36991 -2345 19931 20848
15830 20848 68739 100817 53367 43180 79703 108252 29385 6915 -10403 -39849 -4571 -67089
15818 -67089 -62834 16727 22242 -40266 -11542 -19398 -6998 -136355 -185888 -44211 33821 18804
15806 18804 37436 11269 30789 -17541 -14596 7019 12322 29024 61499 38070 38952 76519
15794 76519 70721 -34801 -74298 -15094 7117 -72500 32094 109368 34973 -88213 -130000
15783 -130000 -78158 -16244 -65128 -39038 59533 36968 -54456 -78156 -69347 -4017 57966 33956
15771 33956 9986 -45515 -81891 -70428 -62609 -86895 -93173 -49421 569 -12912 -103654 -143765
15759 -143765 -125784 -41769 25333 65866 125113 36581 38353 65154 67027 59855 79126 66411
15747 66411 115958 109385 77255 23536 3601 -28031 -80375 -26325 74758 126583 103214 30851
15735 30851 -27999 -134126 -223189 -150255 -95165 -44859 31123 11354 24434 19872 -5425 -82604
15723 -82604 -80211 -40747 -62045 77385 111648 81100 68662 37929 3743 -13673 42 -11398
15711 -11398 -89750 -103874 -105851 -130775 -151914 -124212 -183704 -132870 -94907 -128330 -87946 -154109
15699 -154109 -137716 -94309 -165764 -204861 -176041 -116519 -137736 -114646 -51596 68795 88516
15688 88516 79949 62077 54456 36097 93411 148475 146781 76544 56817 35146 -21657 -159243
15676 -159243 -227237 -164550 -74225 -82506 3242 18543 -2281 -40800 -132902 -71781 -29806 -3597
15664 -3597 15249 53991 48013 -60885 -94995 -14309 -13828 -82535 -153411 -132435 -40204 60083
15652 60083 85548 144122 123173 124705 140168 45184 62162 57812 81154 58398 8921 -42651
15640 -42651 -63328 -83128 -41631 -8777 42476 43608 34910 32308 -26898 -38590 14540 -21463
15628 -21463 -128690 -88076 -702 15073 64527 107259 113232 105145 73235 7925 5509 -12023
15616 -12023 53068 18870 -35683 -38572 -22616 -18798 -47174 -65271 1828 12478 -26840 -69676
15604 -69676 24295 115089 182669 131692 60761 68324 72848 85495 99063 55484 -11258 53527
15592 53527 64385 -44651 -133272 -122961 -120759 -134627 -150985 -171526 -203608 -193195 -133211 -43385
15580 -43385 -44471 -102846 -124377 -39157 -42593 -32397 -74757 -111081 -177812 -138660 -123258 -143784
15568 -143784 -90095 -69194 -43552 -12619 21146 45420 20168 -20951 -68627 -77494 -42318 -38526
15556 -38526 -9622 38278 85718 73765 59998 36553 52762 62171 34430 49509 -20019 -10471
15544 -10471 17248 -46985 -50918 -43242 -137652 -87470 -6365 96689 143263 108184 86609 15856
15532 15856 -68872 -46176 -78658 -151749 -33343 143495 126015 47077 -13134 -68108 -48225
15521 -48225 -946 7575 -951 47505 103654 59658 -34650 -77695 -67694 -56338 -83833 -96421
15509 -96421 -85925 -14757 2874 -46018 -109527 -38970 54738 55491 55792 77202 99684 16279
15497 16279 -35765 23638 1897 -45627 -91816 -17077 7193 -13371 -58355 -66444 -55409 33304
15485 33304 98487 112486 58533 46718 67814 37208 38086 -37493 -74214 8428 32784 70577
15473 70577 85626 82430 86609 146881 109448 132011 186427 195002 82517 92523 130538 184276
15461 184276 139507 75536 26546 84352 106905 87738 74941 51374 28405 22135 -39343 -107384
15449 -107384 -37487 64295 -6770 -81872 -124755 -99546 -93829 -49953 30671 -43818 -87488
15438 -87488 -78084 -38022 -31422 52651 73408 70914 25162 33632 -49211 -97399 43016 74531
15426 74531 48680 -106630 -162655 -107680 -42359 -46099 -4186 -9348 -27192 8684 18914 40739
15414 40739 29412 -45104 4014 62908 121397 79495 89301 70224 91405 72764 47368 8987
15402 8987 77059 82135 92988 112077 85838 76175 58102 78415 99061 131396 81443 2892
15390 2892 -14974 -56499 31458 131269 87948 29697 12893 34769 22025 54096 61774 44853
15378 44853 39551 -15759 -19161 31458 63196 115844 131419 89232 -12671 -17109 1965 -126461
15366 -126461 -188922 -192193 -204575 -121914 51938 54391 -1899 44953 63224 41073 106578 178233
15354 178233 147762 14326 -21457 44221 67510 48123 32396 59516 78272 -31688 -98285
15343 -98285 -91761 -74520 -67706 -14264 57800 92022 94972 28640 -30266 -20737 -8920 45909
15331 45909 126725 62267 -3281 -1742 -22863 2783 42246 -6046 -14833 39175 25178 -14445
15319 -14445 -127260 -164384 -101140 -34130 9971 -26649 -85608 -91673 -25414 -58429 -95507 -66380
15307 -66380 -23100 -38157 -132873 -43234 69450 38076 48423 91444 87295 64311 17002 -3957
15295 -3957 40162 10648 13787 27693 -2795 24185 37797 10546 -28694 -47348 22929 -8093
15283 -8093 -10351 3722 101727 203213 179509 98683 36839 52499 30618 -14066 -29193 -59728
15271 -59728 -7959 89381 27706 74733 106676 77618 36806 26642 36429 39645 66119 55121
15259 55121 39959 -17383 -87918 -46918 1124 32329 -26185 -53167 -4552 39374 22429 -22805
15247 -22805 36706 83974 135808 137726 81469 67224 56902 16729 8385 -8932 -41581 -36963
15235 -36963 10245 -1478 18981 50716 48340 50151 -43890 -91543 -56087 -111322 -163371 -129738
15223 -129738 1858 18813 -71550 -122044 -118480 -70876 -50449 -85153 -83432 -16069 46140 34740
15211 34740 66982 70360 60900 -65867 -113044 -27157 2725 -31627 -46096 -68092 -99713 -112
15199 -112 124218 144297 149607 124327 135188 101645 62911 72689 -66047 -56898 13805 24939
15187 24939 58404 89766 89829 38747 -98317 -128173 -198750 -179956 -165944 -85296 -55078 -4364
15175 -4364 -20150 -45871 44408 58680 -2532 -50135 -76068 -91468 -31556 -13800 -52745 -30049
15163 -30049 -30487 -55462 -24703 -3483 98648 72870 32704 22701 5742 20622 111551 163530
15151 163530 131643 61069 -1893 53193 66387 47379 82652 59129 45633 94640 29606
15140 29606 19038 -35024 -41686 75618 78627 -16176 -147227 -181142 -146100 -135917 -116476 -107953
15128 -107953 -42431 -49339 -79487 -152493 -219119 -121476 18067 15544 -43729 -48791 -34223 -78513
15116 -78513 -70029 -53465 -39161 -36484 -153826 -134734 -45094 -21992 -102068 -110615 -108529 -37599
15104 -37599 -44303 -43039 -21272 -7647 -3389 57528 50460 -3612 66528 105578 164760 142642
15092 142642 69107 63943 96024 121055 142594 196264 154295 122309 108760 115059 51753 79823
15080 79823 109085 58659 86918 112219 -12090 -74141 -5034 64119 99362 145416 113447
15069 113447 80148 97075 29945 -1096 36173 57636 -6573 -79990 -94564 -81333 -84498 19065
15057 19065 87411 118027 109157 92486 82666 84217 33761 4113 45648 44606 57874 68449
15045 68449 80181 29250 29949 66891 18389 1069 47809 156361 70580 -22319 -29965 -18477
15033 -18477 -20083 -69552 -145224 -63271 -16131 -39510 -64921 -71239 -47695 -61090 -42042 4502
15021 4502 63996 31537 56713 44836 54013 18172 29522 63227 30650 -78017 -36098 42528
15009 42528 69767 54017 3576 -25034 -38260 51127 62968 33763 -67745 -101404 -77427
14998 -77427 -33378 27733 70607 74884 62849 72191 61444 4472 -62841 -73080 -22591 -70795
14986 -70795 -121065 -128426 -119811 -34525 -33356 6640 50780 38849 54643 15622 17337 59820
14974 59820 78929 99176 53844 35051 60429 42378 65358 115945 108951 53639 18714 30616
14962 30616 66237 79419 88641 147224 108434 96151 67063 19000 87146 188839 229720 156799
14950 156799 57940 40114 49879 11083 -62369 -15236 -19744 -41175 36310 160333 181945 105040
14938 105040 30850 82160 199779 135677 134541 135412 78118 118982 206779 293816 298870 207704
14926 207704 138462 95515 217501 335057 561405 858480 1203272 1617314 2090564 2503970
14916 2503970 2787322 2953963 2978691 2657030 2237626 1846050 1431442 1092525 863423 636906
14906 636906 401016 314293 368489 411972 407708 413502 374340 353566 262879 158936 91499
14895 91499 84247 111991 125526 107831 44252 101469 42766 16639 16816 102940 44719 -66283
14883 -66283 -74263 -72317 -98466 -126865 -69963 7295 6442 33087 74854 81462 48849 -28140 -80747
14870 -80747 -91030 -76918 -90309 -35883 75809 103562 134211 150534 80795 46282 53408 122468
14858 122468 107666 142591 129129 106944 154981 299904 317547 321700 421405 462259 485805
14847 485805 510597 523462 486670 381411 300939 317609 245214 162819 159619 94586 128359
14836 128359 237149 282931 249664 216890 176327 108541 65658 -69877 -99837 -20997 51381
14825 51381 55191 75027 85898 36012 87999 66524 62437 113768 97440 84149 124137 106590
14813 106590 72513 119481 -62 -51833 30040 104298 119101 57012 -17417 -49620 19563
14802 19563 105383 171792 72796 101791 195145 152910 194167 146794 45667 -11720 5758
14791 5758 15020 -9835 40197 118316 164814 94089 46320 111869 19740 -22587 77787 97530
14779 97530 156042 226130 258080 379227 316700 170849 131637 106357 74436 75339 146397 197676
14767 197676 165469 110067 137129 170382 124848 38384 34692 57879 58625 18497 14935 47359
14755 47359 24442 43070 47542 95599 91713 -22641 -94809 -98910 -123698 -51563 1383 86282
14743 86282 129297 110476 85294 160633 156149 115647 190723 150397 153616 219895 239505 279633
14731 279633 396746 405294 437197 407071 340930 294674 248864 189604 173316 142187 231220
14720 231220 257256 288727 288447 203799 187012 205509 224505 166399 146380 84199 80283 134590
14708 134590 106553 97325 120711 66892 56047 116419 134111 102563 115069 229468 250907
14697 250907 159178 203836 188942 166327 147965 160985 138792 205787 184713 95328 78854
14686 78854 31403 24917 165990 202959 206975 216020 261080 281382 296863 294123 242336 203507
14674 203507 183955 270327 314108 235205 271314 315366 325280 268402 218154 196081 148668 136294
14662 136294 70135 39468 15518 43036 10246 483 -6508 -18876 19769 -4728 29403 8429
14650 8429 -5102 20384 156979 163129 166751 124601 111722 193745 179627 137874 133027 73288
14638 73288 78242 84805 121287 116770 136109 139071 65823 -15768 36064 110308 100519 86047 79028
14625 79028 92930 121372 147467 137480 134417 174867 157586 137369 139638 81016 97880 223630
14613 223630 256727 231955 224786 237338 200074 189108 163177 222895 186008 214274 263776 272591
14601 272591 354714 530112 558042 396394 423350 477653 443986 344790 387706 496137 564045
14590 564045 632478 766045 827904 845194 796010 789225 775327 712776 597334 508623 528644
14579 528644 509086 577566 613200 628322 561435 561830 520883 526825 533927 451966 393439 403441
14567 403441 378174 376598 482767 579975 645419 513397 386727 398815 530502 580754 613614
14556 613614 675530 736220 683318 646310 657196 673521 677958 671579 632009 587855 600666 754645
14544 754645 762337 643158 577252 670645 777714 755128 793182 766000 719516 669505 676902
14533 676902 674931 744588 838788 939087 951957 968750 881482 865366 906474 962284 1060013
14522 1060013 1157994 1229047 1308265 1376852 1448176 1492033 1431561 1473325 1491807 1543371 1579975
14511 1579975 1643127 1696354 1809534 1991430 2137007 2142932 2264596 2482341 2716468 2842813
14501 2842813 3022975 3214249 3378698 3633106 3915037 4177366 4432103 4742095 5056653
14492 5056653 5483697 6037617 6641837 7482136 8535309 9928553 11777438 14100691 16606728
14483 16606728 19344013 22095226 24601107 26943910 29436279 32314912 36187992 42359489
14475 42359489 52216935 67580988 91599776 128642311 183622813 257083906 343606757
14468 343606757 434148528 511350934 562110196 574423474 543397832 478710293 391931765
14461 391931765 300288349 217405647 151075421 104627563 74982919 56789673 45438424
14454 45438424 38232385 33613475 30582130 28415120 26575082 24603332 22307870 19770919
14446 19770919 17122059 14548382 12318063 10556298 9041514 7867691 6932409 6153458
14438 6153458 5536473 5085692 4691764 4284643 3921168 3609512 3428839 3268765 3069600
14429 3069600 2878414 2656330 2487519 2373039 2307668 2252491 2092268 1903098 1859004 1756494
14419 1756494 1777830 1752371 1662722 1530440 1488611 1485414 1414683 1371885 1356914 1309769 1303494
14408 1303494 1256289 1202267 1119686 1104852 1127186 1010529 965558 974302 962607 933694 817727
14397 817727 773774 827360 907102 813636 766488 760863 744705 704759 636226 519952 361816
14386 361816 436026 496418 488076 434306 353964 298078 333006 459924 524254 476144 483004 426099
14374 426099 421846 404568 398273 396458 350152 311305 266001 241644 300352 313279 293073 301193
14362 301193 391065 386264 348061 303478 267829 190534 198695 136296 135793 178557 214598 138481
14350 138481 181362 160191 113664 74368 40380 99626 83302 101584 321429 401952 517046
14339 517046 638438 704190 806331 773788 792838 683699 600881 469081 385418 281323
14329 281323 297711 296734 204023 236361 229626 231673 275439 433385 420061 325006 293955 324766
14317 324766 274260 184653 155773 174293 146788 152430 190745 232590 172865 182905 200940 196533
14305 196533 213614 240969 232976 155902 145943 177091 207136 197586 133578 92507 138863 202167
14293 202167 272467 298277 297329 300986 300312 290707 263364 273642 291727 236649 224457 237920 289722
14280 289722 314962 373544 363670 362464 336107 266978 228452 209926 199881 254190 301700 230543
14268 230543 181989 139781 102789 40068 19546 40834 95910 127012 109472 161647 183878
14257 183878 151896 199402 132264 110130 155417 186913 85825 50954 44378 113700 187922
14246 187922 119763 33293 -18155 56363 79045 17360 2535 55263 61956 45729 16203 34807
14234 34807 65621 64347 48901 43271 3241 -28541 68657 173555 131198 82003 113676 63944
14222 63944 82161 104427 103289 116719 62006 -18694 -54370 -29488 19672 56701 84052 90081
14210 90081 197223 172804 156789 122450 165871 178990 213986 250429 232974 184341 141918
14199 141918 161859 179952 73752 53748 50852 -6850 -106430 -62988 -55952 -4575 52974 37144
14187 37144 59158 -25632 -46673 -31407 17167 55409 67832 86524 58501 101530 94552 121336
14175 121336 130382 117991 68337 83556 47946 -55529 42080 77671 47840 95862 168582
14164 168582 142630 65294 58625 89863 48459 16531 -4817 82943 165240 94408 -38259
14153 -38259 -72378 -66286 -107922 -100101 6153 66823 25659 24861 1345 29073 99583 96734
14141 96734 53238 61209 2513 25143 -23478 -6838 21097 2750 60352 127083 104820 -35321
14129 -35321 -46940 -7206 23676 19829 53376 -19688 -12002 69169 20645 97503 194643 176716
14117 176716 165956 203970 172036 241396 278623 229601 158572 31455 19221 -782 -72093
14106 -72093 18463 79862 -16430 -54286 -67557 -34485 -7769 -10871 -2244 -75386 -81290 -77745
14094 -77745 -92987 -69242 -27593 -1668 119349 171469 135424 34676 23361 -28477 90051
14083 90051 170380 80874 7356 -1194 -28372 -51800 -37932 23134 48279 39568 129614 152843
14071 152843 77122 59097 94787 82269 111505 127301 60545 -26104 76294 -3851 9279
14060 9279 -16208 -3325 19026 60035 87844 182748 232907 155423 47593 -16033 -66475 -25335
14048 -25335 79422 39691 -2367 60528 117923 107606 102808 82202 87011 162016 155922 154342
14036 154342 158180 126040 52949 33737 65220 100423 155939 211180 92944 112406 166962
14025 166962 217353 178298 88183 131204 228485 361056 490784 532555 609312 840460 1143024
14014 1143024 1621559 2026248 2423784 2798899 2968020 2983153 2801613 2449367 1933585 1430999
14004 1430999 1095257 822601 597676 398257 325459 282865 305850 264611 184547 181523 175219
13993 175219 214739 277029 223511 210484 285486 378924 401952 411741 390617 378994 427930 521015
13981 521015 655111 897751 1201451 1575450 2068829 2634420 3210237 3500558 3522640 3374745
13971 3374745 3063273 2589896 2073075 1528975 1002617 748387 541674 368672 301073 299765
13961 299765 257345 120394 133547 101834 64302 105449 145806 165507 150929 116896 124859
13950 124859 118267 138760 117056 45034 -20695 -22122 83568 100469 155641 122834 85696 90299
13938 90299 125948 52580 14759 1519 -16918 -25703 -7193 30974 49150 22261 15878 34712
13926 34712 70015 32930 11357 -5532 -105287 -121097 -78116 -53926 -23009 21104 10745 8208
13914 8208 13662 18938 54333 90476 74921 61641 158579 136956 -1277 3467 95495 179248
13902 179248 198560 209368 206899 127117 60132 -129 30139 71825 45996 16012 38066 17033
13890 17033 73816 152451 87412 28021 45089 94084 127667 66084 44779 40619 -1883 -45911
13878 -45911 -72425 -42696 14745 41593 61578 -47027 -116828 -90221 22452 58715 33244
13867 33244 127 20674 115776 85692 76481 23344 15304 64343 41188 10215 -23388 48142
13855 48142 17454 3184 34937 40177 2706 -88501 -58810 -39730 -44640 -78404 -79518 -66239
13843 -66239 -10263 67133 93465 69639 88480 50051 25018 37744 59591 34515 53557 72148
13831 72148 -47189 -32020 -21826 28465 24116 -94290 -47890 -91795 -160316 -81830 -58240
13820 -58240 -71333 -74936 -15493 -19149 -52808 -70959 -36715 -55415 -117422 -86734 -105737 -131706
13808 -131706 -76615 -39 -48269 -99273 -140102 -151044 -206175 -102418 -56875 -64017 -45384
13797 -45384 -47562 -80000 -24014 19153 69475 75132 121315 206581 167158 119752 101746 127767
13785 127767 113527 96496 43942 -9005 -1682 -33555 -65342 -14158 -16055 9831 111653 84947
13773 84947 -16658 -65602 -39046 -37541 -59869 -55428 -61254 7080 86872 8617 -44896 -123470
13761 -123470 -53197 -14673 -52272 -56991 -54306 -109516 -148642 -86927 58976 -19865 -58858 -10416
13749 -10416 -36455 -88641 -90625 -20297 96942 51307 -79391 -91857 -3403 53445 101108
13738 101108 84159 26574 -24494 -13573 82838 121720 55856 -75349 -92302 -56339 12452
13727 12452 -10036 -39609 4558 56743 14902 -81137 -38009 4824 29932 46608 138587 124616
13715 124616 49021 -27736 9100 10570 -40376 -62829 -90190 -86656 35508 123882 138984 85316
13703 85316 56270 113315 139915 114004 86051 157897 173520 200034 156325 101849 95346 56664
13691 56664 50277 44536 21460 31630 15788 51573 65221 126214 150153 75811 76312 155319
13679 155319 175613 327198 491444 765568 1017532 1388448 1681465 1876659 1990201 1910905
13669 1910905 1679850 1420654 1229792 962521 762612 654789 597734 610580 629411 658533
13659 658533 634979 639040 598497 601146 488498 407083 288134 170636 165682 175675 102278 103533
13647 103533 146655 172138 125197 25215 -52154 -4294 17973 122036 110114 65308 -24504
13636 -24504 88537 126207 35947 17062 47326 72119 97195 89950 -14321 -47396 -42056 -44466
13624 -44466 18935 51402 -28257 -52558 7510 -42059 -108701 -149356 -137525 -59306 -1637 -104036
13612 -104036 -207659 -227854 -93925 13616 33433 -62556 -33995 -52914 -64139 93636 199915
13601 199915 106501 30168 -38082 -40019 19439 -49655 -106005 -182749 -89100 -20125 54942 142073
13589 142073 133761 193446 216130 98997 59628 55759 56302 -6897 25070 107489 119011 141272
13577 141272 68773 80231 78368 108722 100732 54614 16713 56364 91287 115787 110978 108375
13565 108375 178760 255007 296181 282680 310438 285087 315692 343235 320434 386922 533774
13554 533774 636004 724401 818536 902573 1086539 1419444 1922897 2691581 3625130 4786527
13544 4786527 6042548 7134782 7959540 8343958 8152297 7576136 6594572 5367286 4150547
13535 4150547 3082004 2296978 1734928 1363341 1074886 805242 633969 589979 615835 552633
13525 552633 519163 472128 277869 129206 163980 189948 168905 177905 232356 291675 245918
13514 245918 165749 158304 175961 123589 85579 85698 49408 50638 -17509 592 131964 141619
13502 141619 32113 -58855 37763 -5724 -105602 -19862 63093 111657 104628 38687 -3645
13491 -3645 -43089 -109082 -143338 -109043 -41094 14161 51474 -1439 -6448 52562 105136 58879
13479 58879 36512 -17173 19790 68619 5367 39364 153495 158063 95611 76201 71279 74813
13467 74813 128004 165310 187713 108510 131835 99284 89882 79185 6336 -101688 -57754 -34189
13455 -34189 -38578 -15141 81294 110758 73013 23042 13624 34502 -43463 -57477 -71577 4074
13443 4074 58985 -8990 -84776 -28663 26238 9952 18074 112816 80277 36724 35707 65947
13431 65947 81821 22858 27406 116589 111408 167363 164268 71120 -4132 10793 87859 66463
13419 66463 -28339 -17293 -66129 -54955 22143 28081 44538 17418 -87190 -72782 -43675 -84995
13407 -84995 -101854 -174535 -115169 -52970 -50416 -47408 -101393 -118742 -116268 -15998 53431 55487
13395 55487 124229 136630 57088 42571 -408 -67683 -43036 -54608 -38753 -15935 -80673 -188927
13383 -188927 -123574 -24408 -113145 -176440 -72626 33252 55142 93452 82689 24226 -23402
13372 -23402 -19446 18261 84572 80031 23840 8575 108329 67100 103717 97369 70222 84495
13360 84495 40974 -36112 -33858 -11215 38073 97747 181193 210610 174274 160605 114054 95659
13348 95659 100032 87528 79767 107187 208776 322018 334716 404993 507880 697509 821362
13337 821362 817056 954082 1278359 1784543 2401012 3208019 4336860 5587281 6691996
13328 6691996 7625939 8176556 8241040 7792234 6913729 5818824 4703907 3604103 2642726
13319 2642726 1921342 1400902 1077561 880995 631324 537347 489807 408962 280190 257869
13309 257869 272769 237283 222855 261382 234320 216935 171765 147547 169299 181067 186077 146468
13297 146468 146858 100385 80739 18969 -45452 -90554 -129766 -70144 -31404 102976 202022 152669
13285 152669 158752 161070 121487 56438 52380 69726 119022 65710 27691 -56923 -98936 -47583
13273 -47583 -26933 -44588 28106 56061 47988 118228 59534 34300 17073 -25699 -54952 -67541
13261 -67541 -25940 -114025 -35252 25928 -3848 -10020 61593 151200 82299 -3561 -40497 11805
13249 11805 55810 43210 7678 13783 81124 135470 169473 147179 52405 2987 41606 39141
13237 39141 44358 61284 65197 68434 78192 105731 82530 94887 64312 -70252 -134662 -155509
13225 -155509 -70533 53491 33453 -29740 -54993 -147269 -86295 45340 57276 28287 -22181
13214 -22181 22619 16547 81992 149017 70934 43837 147359 43531 7332 -7296 -2564 69456
13202 69456 96636 33164 6188 83754 162815 104350 82861 106368 61564 -37625 -111132 -122867
13190 -122867 -82891 -111492 -130399 -86285 -79964 -46055 -16203 5951 9451 41644 45132 -34498
13178 -34498 -22714 47536 53121 65727 107256 87560 79476 52549 86047 182720 242994 162589
13166 162589 42178 31966 62881 6197 -40751 -58460 -11609 20491 -23825 -30138 12765
13155 12765 29395 -3826 -42843 -28499 -50609 -145060 -144178 -65876 -1778 7099 14086 -121244
13143 -121244 -67115 -38193 -43218 -7145 -6175 31047 34715 26385 -38770 12158 1704 -32919
13131 -32919 -9924 40530 10665 -2421 -12532 -29208 -84166 -77155 -41313 -23874 20273 84262
13119 84262 81723 111619 53202 -10134 33559 -55975 -82180 -54719 -32385 -75453 -52707 -42819
13107 -42819 -106856 -122056 -68727 -56660 -62075 -82160 -108439 -177449 -147824 -56593 -91562 -115021
13095 -115021 -89173 -39773 -16850 43299 61412 38031 24109 97681 134163 56956 37307
13084 37307 16351 26151 32388 4344 -47948 -30279 8260 -3975 -51240 2775 46991 60081
13072 60081 -18812 -113064 -168973 -184182 -232023 -236680 -133635 -70933 -35376 -12341 45399 -24208
13060 -24208 -42709 47828 52895 37522 107613 124872 74173 101244 69994 6081 -10628 -15457
13048 -15457 -35199 -42370 -19022 14473 24391 43241 29453 48777 -263 2171 -6838 75818
13036 75818 99638 91869 107323 -4922 -93213 -22282 16225 32282 -17507 -21297 16373 55087
13024 55087 49087 7243 20355 34787 6342 6652 -76014 -85919 -32663 -33939 -555 -6017 -1886
13011 -1886 10458 13279 -19565 40359 117816 120213 68227 -25797 -135266 -161853 -70203 -45297
12999 -45297 24820 39755 65308 45144 -11345 -61347 -61014 -41218 19272 14163 -20008 -29677
12987 -29677 -14005 55317 46194 -13787 13206 37984 -4793 -19678 -103450 -148455 -130164 -28562
12975 -28562 53544 53338 54465 11251 -4759 -124214 -139217 -89609 -95731 -86725 33735 42216
12963 42216 23979 -13641 -22100 56497 71501 44729 33918 75130 64178 71675 101117 13449
12951 13449 -34443 -59134 20523 119677 143090 100455 53004 82665 56057 16774 103640 159316
12939 159316 98692 74415 36093 72411 -5464 -129103 -152663 -85612 7856 21102 -17993
12928 -17993 -39234 -88502 -16906 -10371 -27776 58578 76798 77928 -74080 -107703 -33408 -3354
12916 -3354 -9531 63362 107291 36670 -68116 -33282 31680 84381 159908 141238 59956 3321
12904 3321 -47210 -79206 13204 41664 -31296 -26575 -42764 -17166 -54237 -93981 -12988 -38255
12892 -38255 -42084 -33177 -53740 -76633 -37630 -49172 -27375 -45343 -11797 48542 -10445 63642
12880 63642 124357 40807 -30142 36979 47267 12541 59753 54481 20920 34256 -915 63281
12868 63281 62128 59939 45180 42720 140057 134284 71268 54351 -6189 14303 18654 36477 55151
12855 55151 29485 -301 -74598 -163780 -110698 -44867 -61252 -60684 26145 -12375 -14449 19410
12843 19410 86060 87632 40674 71607 73250 49715 27141 78736 62456 11898 -10031 2918
12831 2918 28370 1013 34887 33196 -21688 -3314 38264 -40942 -61570 -69561 -41865 19320
12819 19320 -29042 -14244 62137 -20399 -128778 -143446 -61791 -28038 -13275 8352 -43154
12808 -43154 -84323 -61831 13063 15124 44452 3492 -25673 -54647 -25663 60862 14061 37439
12796 37439 22543 21795 48506 42182 -26678 -31439 -20700 2754 13346 -19276 -76389 -36869
12784 -36869 27475 94445 26917 -67834 -47468 25841 32499 43710 33310 7778 -40459 -51681
12772 -51681 27639 114631 110311 41448 15874 49721 -20569 -42136 -20803 22655 15842 109750
12760 109750 122225 16500 -71093 9248 30155 -3154 -24376 20499 -66310 -127102 -130494
12749 -130494 -213742 -231833 -240621 -208087 -231842 -223163 -108915 -76899 -107901 -118954 -148026 -66324
12737 -66324 -18492 -19314 30930 32814 16552 30763 29264 -55615 -20756 103457 180187 210019
12725 210019 217806 305050 463455 735637 1080881 1052078 746028 399879 130847 -17879
12715 -17879 20661 79728 50883 12660 -39487 -28689 91096 119219 39319 65905 58515 -55154
12703 -55154 -105434 -118861 -144680 -75420 -69456 30570 25054 -40066 -110375 -135017 -175305 -181964
12691 -181964 -140923 -142314 -155225 -108464 -33613 -80027 -119417 -138197 -134855 -24326 14087 -73775
12679 -73775 -109715 -24744 21367 47477 -31879 -28958 -24845 -38575 16181 13591 -49859 -205783
12667 -205783 -159964 -98014 -45742 21646 95977 78894 -37178 -186801 -206840 -167185 -44887
12656 -44887 -4632 94817 73587 103013 136137 149841 134371 80569 46340 85673 149349 137317
12644 137317 124735 119606 71395 -18917 -58429 -46783 -59471 -18787 88292 137204 81593
12633 81593 7774 31542 126845 133802 86736 25051 50836 68235 19091 76597 86150 83955
12621 83955 72425 41944 2572 -26284 72798 39274 3162 63180 80687 43726 -95659
12610 -95659 -100369 -103102 -129290 -102046 -159363 -166210 -88364 25370 59518 -62276 -147681 -108685
12598 -108685 -73119 -36393 26200 -4189 -91586 3339 55410 54775 107541 116651 97085 83915
12586 83915 54032 35160 -27914 -42409 -30310 57415 50856 74177 65959 43117 -28290 -26594
12574 -26594 6762 2409 -19648 -36645 -80110 -37470 -62071 -26758 22749 25195 -34122 -69227
12562 -69227 -23021 -93393 -167282 -78991 -57224 -66025 -28966 -18128 -46919 -16098 48877 9209
12550 9209 -106913 -73927 22068 12720 68405 117715 30362 23840 13151 -16307 -8908 37854
12538 37854 -39237 -108568 -104054 -12392 104893 100001 157031 256629 282922 192553 156494 158233
12526 158233 142607 167067 100813 33460 -2802 -42568 -69555 -82791 -92343 6137 11794 -59977
12514 -59977 -34032 16372 27742 28659 8106 19150 -37100 -101496 -135066 -100836 -31100 2787
12502 2787 -38051 -6994 33878 102979 167737 190911 134772 29593 -20682 -110823 -74478 -9817
12490 -9817 45000 34474 51761 58591 49998 33952 -44081 -656 -60051 -35274 43088 22231
12478 22231 56373 64123 61581 194356 282549 245515 358512 501313 606480 743420 948455
12467 948455 1256470 1649435 2004288 2159060 2148944 2015643 1762965 1371399 986659 688597
12457 688597 395231 299245 306159 228747 154842 149348 130458 113372 188286 221086 172189 70772
12445 70772 24976 -10533 -56741 -79581 2539 18161 -11312 12854 40802 80247 51068 67965
12433 67965 98910 95319 30517 58686 163889 187270 79205 53124 47054 63067 7974 -65018
12421 -65018 -84020 -67731 -34399 14962 30942 99745 110401 94667 22238 -12428 14927 43118
12409 43118 58027 10830 -28165 6373 50905 35428 2142 44487 91271 89368 119863 34912
12397 34912 -6671 9017 -83157 -180657 -165736 -95775 -1793 -10938 -72633 -68316 -69373 -29105
12385 -29105 -29596 1533 18267 79409 43111 35455 90818 71641 61423 80732 161853 108189
12373 108189 69433 31659 41781 72669 48368 -30821 -97242 -57951 37230 100419 65964
12362 65964 13577 -33502 -109147 -189413 -172870 -94450 -8100 104081 93566 75722 93666
12351 93666 3512 -11433 -10962 -29055 -79904 -134616 -110008 -46214 -66365 -31484 55883 117187
12339 117187 127963 122247 67225 11250 16735 24092 -102804 -90621 -7263 20747 -32075 -63594
12327 -63594 25706 76231 19142 10959 82207 55041 -9984 -10590 -6332 8880 -22489 -90564
12315 -90564 -89294 -20559 -1004 12815 -15031 -45518 -61932 -91760 -70786 -15724 -55296 -37684
12303 -37684 23476 93278 90259 84601 77556 3983 -9851 29092 -24073 18345 59877 58825
12291 58825 204 18521 18962 11995 -50059 -64169 -98578 -126957 -65937 -43184 -29376 -44493
12279 -44493 -16220 22497 29545 -35252 -26024 42334 100258 77586 84640 88250 92858 135274 106287
12266 106287 -2646 -14415 -64506 39681 86263 52170 -21562 -81626 -91710 -123001 -168031
12255 -168031 -201176 -191300 -152763 -132318 -128523 -147484 -26255 82686 142391 99970 98157 133105
12243 133105 45372 -62399 -76566 -75088 -70729 -51516 -12592 -3259 -32973 158 16528 -35301
12231 -35301 -12367 67515 -19081 14869 29567 57926 174270 280560 379618 448708 581383
12220 581383 813680 956148 916226 799034 579867 292029 185512 156601 102614 45772
12210 45772 49566 109471 126736 106586 72262 75001 157220 143816 30748 43478 48002 55755
12198 55755 5019 45439 24199 -19143 -14007 5005 76389 138411 176496 144630 80817 102520
12186 102520 166950 181264 260657 318109 388295 610520 756318 883138 1171853 1557328
12176 1557328 2209057 2913451 3136028 2856179 2178879 1503360 1016133 700055 534907
12167 534907 329845 136132 98105 70218 148524 160215 112607 96639 87014 89564 108685
12156 108685 105043 -6092 -16545 13975 76383 144155 96790 35085 46654 35198 46848
12145 46848 64479 42766 87560 127387 242201 315900 294285 349226 443104 622296 839602
12134 839602 1020551 1392506 1915689 2695602 3222812 3021843 2442278 1764930 1186795 868411
12124 868411 690100 544919 381609 205379 200058 222398 201535 126875 126970 109556 62117
12113 62117 -33961 -63699 -30165 76399 85603 92403 178105 73498 -84781 112763 191861
12102 191861 192966 152338 116466 108425 55147 66767 88648 102263 -13445 -69429 47807
12091 47807 153780 190591 356362 571796 829546 1016846 995247 786481 576644 393910
12081 393910 160135 113002 178882 216856 169263 139146 92734 13052 34437 93369 66372
12070 66372 17131 39660 -24270 -164897 -230176 -175414 -62838 -81019 -137453 -182668 -177679
12059 -177679 -148958 -160443 -147250 -166348 -177988 -179003 -200309 -184289 -48695 77899 50900
12048 50900 26358 26800 -23477 -95187 -91940 -36966 20560 15848 1236 106119 68066 53623
12036 53623 66611 8608 -61969 -44961 -85519 -74016 -6106 -15279 -68925 -8115 40585 -9936
12024 -9936 -53187 -32467 59008 17383 -18172 6951 187247 176956 178003 176632 86186 32807
12012 32807 6598 24073 35194 -6601 -37696 -22296 78149 88958 -31409 -118230 -158492
12001 -158492 -167306 -105309 -120046 -186465 -166252 -69625 -20857 -14022 -9710 42317 83260 98989
11989 98989 131499 80648 -34807 -122258 -77304 72498 177146 187618 82220 33956 72530
11978 72530 61568 -61950 -163833 -115927 -137696 -119327 10254 106334 208099 251532 178236
11967 178236 84654 51948 59044 85462 72343 -13337 12215 40623 69633 100949 45656 87384
11955 87384 97047 23093 27503 113754 117345 37285 16832 1468 45407 76208 80619 51630
11943 51630 -20244 17397 34673 -50579 -69413 47413 75373 42863 49127 100211 123258 111448
11931 111448 27875 -40128 -62906 -53686 -12260 -15692 -35304 9455 68848 66252 8003 -4669
11919 -4669 17821 -47952 14798 44859 13475 48139 -6312 -52131 -80511 -153724 -16939 91174
11907 91174 113014 25793 -91596 -150175 -113890 -76537 -85891 -80491 -1212 -48976 -104428 -142762
11895 -142762 -168966 -138808 -87031 -175951 -269430 -218451 -145598 -126867 -118397 -65245 -7823 -39457
11883 -39457 -38046 30032 54998 17556 6681 46640 56986 69555 56643 36075 18305 -8237
11871 -8237 -15623 -31100 -26415 -73140 -65877 -45860 6586 -45321 -148843 -201312 -148931 -35480
11859 -35480 -24855 -63350 -74416 -82239 -50563 -5934 -27096 -94896 -166254 -168069 -176848 -189804
11847 -189804 -198331 -189578 -210176 -272766 -226009 -118916 -114396 -169518 -127926 -88493 -18329 15357
11835 15357 24909 67093 17042 -36985 3933 -16817 -2873 -60501 -93554 -128961 -92611 20751
11823 20751 123876 193703 151825 15741 -48199 -69933 -74058 -143435 -109408 10675 80334
11812 80334 68158 67413 41900 -15237 -50171 -154186 -174600 -76548 12987 35650 -8148 -2578
11800 -2578 36848 62565 -16341 -49572 -36640 -70656 -102983 -108236 -18793 -28373 -7427 -60205
11788 -60205 -111840 -31596 3061 16290 -22856 -50911 -15396 -27432 -57889 -71442 -4544 90506
11776 90506 81849 43243 2133 52751 43695 30943 -31185 -104703 -121239 -31261 6953 -9508
11764 -9508 -43653 -20090 -12447 40978 142337 115422 45810 19295 23942 -57902 -99844 -91325
11752 -91325 -92821 -28816 -47088 -112819 -64393 17645 39036 3 28418 14464 25676 -60296
11740 -60296 -88625 6775 -16832 -80891 855 55386 11634 22848 -5102 -54678 20403 94954
11728 94954 115100 138025 137597 54695 -4949 -47878 -51522 10559 -3292 30764 48528 14498
11716 14498 -82949 -92429 -158257 -193797 -180719 -141649 -124089 -67534 -13273 -36860 -95197 -99005
11704 -99005 -90116 -37004 -21087 -20963 -65690 -25558 -10146 -92691 -107045 -25101 63558 -4869
11692 -4869 -67806 -100020 -63725 -64659 -44613 -25891 -4103 66389 18294 -44628 -55035 60184
11680 60184 79008 -9732 -4452 127044 132425 64826 98329 109341 153981 165295 167798 142709
11668 142709 88597 26598 13127 33457 -9303 -106210 -123386 -35629 -71443 -136108 -149265
11657 -149265 -99390 -73850 -77050 -92307 -123384 -134066 -75200 -14043 24786 9443 53024 128496
11645 128496 128698 193619 171262 86233 162421 146139 76691 51411 7727 -29384 -139725 -221622
11633 -221622 -255705 -114747 -72746 -111954 -114295 -146323 -208260 -183651 -51049 -29155 -105816
11622 -105816 -146113 -89810 -8741 5510 14464 -9619 16786 100970 51180 -75461 -146577
11611 -146577 -169696 -95478 -26072 -80310 -101535 -72572 -68648 285 48674 61158 -50 -22951
11599 -22951 7880 18067 -24192 -44991 -117836 -177374 -203144 -171034 -135162 -112762 -103607 -136168
11587 -136168 -92901 -85053 -60493 -88599 -47734 -46549 -26596 -21120 -47728 2936 21242 13485
11575 13485 44729 77263 78405 152036 120170 16141 -44407 -31534 -106759 -219019 -231481
11564 -231481 -212003 -188218 -155462 -80328 5904 49897 23564 1957 7157 67549 67554 69019 4330
11551 4330 -60956 -108680 -39429 10528 -76568 -142424 -89057 -22702 12648 51304 117012 192567
11539 192567 126101 49018 48984 529 -18485 31684 -4947 12313 -1820 -20178 23112 85223
11527 85223 3668 -22857 22230 61038 -25367 -111784 -212053 -228529 -138906 -130360 -46418 -40910
11515 -40910 -24008 31487 715 11145 8916 47846 74389 133884 116473 19369 -139768 -186288
11503 -186288 -154017 -87094 -29755 11689 -41989 -91479 -97828 -111742 -148594 -202917 -172938 -103283
11491 -103283 -61505 -119296 -139636 -48336 -30362 -73413 -123993 -168076 -146115 -122366 -175920
11480 -175920 -184343 -238724 -237130 -184672 -81200 -24308 -364 36188 4057 34162 69682 105307
11468 105307 75011 73199 87548 91293 46046 -50503 -64863 -15006 3379 3702 -3933 -3212 -34606
11455 -34606 -60089 -87029 -13902 -33729 -43449 -28646 -96385 -120774 -130362 -88979 -8697 -49503
11443 -49503 -69930 -46388 -18073 -48763 -16322 48560 11883 -23094 -39829 41605 27881 -16888
11431 -16888 -102545 -85445 -15661 18736 -9365 5006 5630 -246 71322 65549 4153 -20302
11419 -20302 -47839 54586 135868 99683 63796 89420 99864 -2173 752 37072 38384 29718
11407 29718 18418 -18744 -121254 -139233 -60118 -80278 -81437 -19260 23047 25296 -898 34797
11395 34797 112077 113681 145651 129940 156297 98820 33278 -24820 12906 82458 51610 37671
11383 37671 67149 92749 73737 41789 -6232 -78783 -98291 -85910 -115585 -25445 -64278 -165943
11371 -165943 -122920 -90458 -48800 -98557 -105443 -107838 -102571 -109288 -62145 -50373 -112898 -140135
11359 -140135 -160298 -134184 -242701 -272817 -235196 -152849 -151863 -30910 78732 9161 -96062
11348 -96062 -140886 -145642 -80705 10713 13921 -51510 15473 97432 -32366 -121653 -50588 -26908
11336 -26908 -104818 -97297 -44160 -86757 -138583 -75836 -64776 -17274 13251 24162 6321 -45151
11324 -45151 -66066 -60678 -17759 70011 33921 -18587 24703 -1763 -18820 -94047 -114135 -89993
11312 -89993 -42480 -10986 5019 36848 -36523 -100406 -71091 -76312 -72655 -6909 -36943 -172418
11300 -172418 -220762 -231085 -177403 -110823 -131098 -87615 -50120 -77544 -198766 -187930 -62937
11289 -62937 -22263 -59518 -42791 1996 82892 24004 -36474 -91557 -51183 -43134 -127400 -71435
11277 -71435 -22592 -17798 -31942 -41766 -3195 17715 -51289 -111586 -118038 -76569 -37996 4402
11265 4402 -38476 57140 39833 25046 -5443 -42757 -10403 4855 21141 41821 464 9281
11253 9281 21908 11843 56650 161398 184888 198497 212503 136642 123282 85789 40035 -5825
11241 -5825 -23958 -976 22542 36495 6851 62327 154313 90815 122491 87766 81260 -31408
11229 -31408 -34862 -27433 13035 -64591 -70231 -122418 -108179 -43016 -2513 -11848 2756 -49592
11217 -49592 -36244 10413 1062 -37902 -145902 -193592 -129366 -11996 59886 1325 -23285
11206 -23285 -73104 -15716 12247 87929 -15982 -40739 50141 -3858 -21515 3096 -14657
11195 -14657 -59125 -53201 -102948 -122663 19894 107674 142202 151064 121273 -9851 -66302 -45637
11183 -45637 -22302 -56961 -73304 -92350 -55675 2122 -52980 -107203 -103436 -45813 -153364 -141392
11171 -141392 -177643 -172359 -87251 -15583 8281 -22176 21969 111175 74221 -36815 -90517
11160 -90517 -126168 -85800 -26435 -102467 -105783 -36452 -26199 -19658 31876 30706 -17856 38628
11148 38628 61056 -25600 -104742 -135038 -79222 7592 38447 -5825 -83750 -100146 -87736 -100222
11136 -100222 -119757 -133388 -117442 -75149 -34544 -40733 -63915 -44416 6095 94631 63086 27946
11124 27946 57475 102463 58494 16119 16313 -19863 -66234 -81175 -78750 -51103 29762 84647
11112 84647 -645 -63042 -53856 -66975 -54704 -73731 -100570 -78085 -140491 -103485 -63767 9927
11100 9927 30578 7210 -35465 -26532 57667 56024 69392 79073 27600 -72735 -20731 108819
11088 108819 61316 -46536 -124415 -170350 -199651 -185035 -152409 -1216 31367 15483 -21450
11077 -21450 -28820 27465 29626 -32359 -123880 -78184 -31526 -89292 -110555 4846 57152 67271
11065 67271 83765 118172 130243 53797 58475 -33616 -123549 -14534 100437 84045 20425
11054 20425 -20836 -8599 -27194 -12821 54429 18551 27692 118125 159899 150306 101503 9142
11042 9142 24423 6333 -28441 34866 45709 24367 72592 98336 83199 106939 21729 -8904
11030 -8904 -60177 -84382 -84415 -16215 -35277 -71422 -108369 -170766 -130125 -77855 -32480 -78133
11018 -78133 -105383 -18040 45507 132856 182757 214654 224800 226870 78008 -56007 -71216
11007 -71216 -76849 -121688 -186361 -79145 -12916 -16605 -19974 -18780 -29802 -7767 35316 9413
10995 9413 -48577 -63299 -33145 -20988 11105 37048 -12035 -129612 -140035 -47045 16484 -62075
10983 -62075 -68789 55014 92689 119286 147579 104224 41545 -12098 -57802 -83318 -87090 -84057
10971 -84057 -94912 -47112 -42266 1678 98512 163583 166924 131448 137856 144995 116945 81131
10959 81131 33621 -33146 69620 22467 -16756 -15784 21155 32298 54594 65933 4036 106231
10947 106231 117327 47933 -67361 -121090 -78958 10638 -3678 -7646 13399 26243 -4303
10936 -4303 -90552 -72443 -72195 -67923 -124365 -152386 -97164 -151625 -163326 -166318 -104967 -94914 -83844
10923 -83844 -87538 -46132 -15939 41646 59706 17895 -66614 -149184 -87551 -87473 -83368 -122925 -136731
10910 -136731 -115288 -57266 -60820 -118804 -102758 -45244 35248 77180 34069 62123 75860 85982
10898 85982 77509 -31752 -37534 61 -4786 -88548 -131398 -57048 -14360 -41164 17170 46890
10886 46890 53763 138529 122391 20040 -75998 -158038 -115968 -136284 -78729 -85672 -102339 -71990
10874 -71990 -129592 -144390 -154201 -138618 -185868 -153597 -121343 -92940 -98208 -91247 -143705 -93657
10862 -93657 32534 -9455 -76469 -136545 -57036 -219 -17827 -8331 18216 -64520 -126970 -121977
10850 -121977 -71364 14767 17067 -39550 -101561 -51051 -10840 -138031 -142385 -62393 13866 -21680
10838 -21680 -26412 -1990 -14119 22143 59328 60606 24578 -91577 -75213 13154 57875 -43237
10826 -43237 7886 82488 68543 15413 -46682 -41278 -44477 -75473 -34503 -9825 -101572 -136164
10814 -136164 -192956 -164755 -75194 -46715 -44771 -30203 -874 13818 24772 106635 143258 89058
10802 89058 12271 -75679 -108123 -52070 -36137 -30368 30211 112129 74233 26873 15204 82330
10790 82330 78792 73634 -25349 4736 95921 97244 157713 124851 122035 112367 115266 82840 86491
10777 86491 56953 -48109 -14103 47011 70461 100639 45088 -39860 -96288 -184523 -53017
10766 -53017 24114 10852 105731 75688 55893 122999 112966 -53234 -53916 2792 6684 91042
10754 91042 53635 -38099 -139645 -85329 20581 18724 -6413 42422 5814 13993 39251 124150
10742 124150 98067 11376 -29308 57765 57903 6610 -75833 -81700 -68823 -24247 -35622 -93396
10730 -93396 -156757 -172264 -199988 -214304 -131486 -192128 -248061 -191990 -172363 -58277 282
10719 282 944 1790 22333 27493 -34270 -27052 40761 60091 44584 63937 115207 79855 6668
10706 6668 25135 64927 37442 80624 118335 61552 -14917 5917 -56985 -102881 -68399 -23361
10694 -23361 -87852 -82610 -32103 -69775 -24576 7852 6827 -19145 25087 -34180 -78392 -93359
10682 -93359 -136826 -142567 -128315 -88964 5348 22981 38125 2340 -28614 106884 129540 43979
10670 43979 6200 7359 26726 -36661 -44997 -79627 -114468 -166999 -140157 -80125 -13015 -1858
10658 -1858 -7122 37548 -1700 -17827 -62469 58291 130072 86666 18994 29630 -29738 -40960
10646 -40960 -43374 1304 -53804 -101026 -77666 -18350 -21816 26588 53269 125548 142975 88120
10634 88120 -34128 -19352 -7928 -11652 61098 57665 52157 26760 -41098 -161171 -147694 -57739
10622 -57739 57718 123905 30331 27037 38203 80200 40098 -49337 -85357 -58227 -55632 -88816
10610 -88816 -22604 14518 52105 20549 -88555 -57065 -31131 -86152 -92511 -92562 -21849 29601
10598 29601 40312 -84570 -57578 -9629 9283 33336 35560 113048 103490 99832 48157 55572
10586 55572 -6681 -36425 -66197 -41715 -41138 -24375 33286 112202 94963 67656 37215 20719
10574 20719 -11369 -122626 -127749 -95151 -46782 -11550 -939 29375 -11786 31389 103836 133810
10562 133810 -12448 31422 78196 1637 -153305 -174989 -148418 -156930 -62025 36139 68206
10551 68206 -11449 -23925 6648 -2866 -23886 -35394 -70561 -81185 -125807 -170529 -67187 -17282
10539 -17282 -17698 -54107 44147 31893 -10893 -35581 -67293 -97578 -106417 -136656 -91022 -33236
10527 -33236 -72691 -44757 -19969 -6132 -10690 -67289 -92558 -97737 -96825 -125497 -120656 -83378 -73295
10514 -73295 -172271 -144035 -124104 -5692 2241 -91487 -85124 -72850 -107258 -98085 -66181 -66588
10502 -66588 -9739 2777 -20 79167 11455 -70563 -92001 -54292 -1485 86753 63193 13527
10490 13527 -8378 -31062 -33827 -74762 11211 -16787 13617 89447 120477 112457 58634 56768
10478 56768 51782 55522 79038 56545 -38259 25051 81823 129801 76561 83169 52967 -22553
10466 -22553 -59135 -55123 20478 -39 39820 90932 50111 4013 61562 -18640 -75935 -31370
10454 -31370 -74667 -88213 56157 51501 45226 -12143 -17995 -99109 -119696 -121359 -163179 -98744
10442 -98744 73777 150000 128507 58521 98727 28872 -52462 -6582 44335 18195 -12104
10431 -12104 -67023 -62310 -10903 43944 111665 72735 -68 37243 44489 92570 60606 -122467
10419 -122467 -84854 -13355 22619 -12806 -96928 -42258 -16539 58800 104187 8861 -2946
10408 -2946 7085 -17132 -28321 -76055 -43999 35759 8065 -21711 -58652 -118703 -28305 -17212
10396 -17212 -101342 -180860 -230673 -204942 -191996 -189979 -150949 -30236 -45072 -131191 -110009 -71029
10384 -71029 -78042 -43671 20402 78551 82226 36432 24872 -49660 -20906 85441 69047 -33507
10372 -33507 -50720 -39292 -35286 27255 17347 5593 69474 81638 -16604 34401 73558 12111
10360 12111 14452 72346 38617 7300 22135 51486 45855 61433 -12279 -62797 -12614 69842
10348 69842 25964 88674 88017 19157 -10588 -16742 -40778 -25245 -26349 2734 -4736 -59956 -47790
10335 -47790 -10705 31483 -10998 -27538 2156 15012 30178 36566 11446 31489 45232 9834
10323 9834 -28380 -49651 -2207 25354 65446 51555 54738 89604 95068 74384 82223 74459 1242
10310 1242 -24382 -16803 36100 -33342 -73743 -100653 -120968 -98879 -85192 -33325 -55548 4892
10298 4892 -54356 -129270 -60332 60097 37106 39694 114357 149731 82290 59712 40568 -47977
10286 -47977 -49494 -49152 -99876 -74812 -33516 -12254 8043 -16563 19298 41457 -42700 -77026
10274 -77026 -50433 -13674 -13762 -14707 8960 -12555 49303 129580 81262 25842 -26157 -78623 -88980
10261 -88980 -27837 16090 16107 -19633 -56133 3938 129129 64294 -37614 -26466 -11858 -15461
10249 -15461 5554 50745 28132 45561 31688 -25780 -36865 17513 70477 75110 11106 43998
10237 43998 666 35710 58136 91354 141287 86009 46787 46021 2113 -34364 -17101 -14728
10225 -14728 27972 -6364 -35744 33771 63316 -30859 -107996 -177051 -112175 -3552 76864
10214 76864 32995 -12160 38323 35386 43450 -24397 4197 26736 -2620 22439 29791 75553
10202 75553 67728 83881 85298 -35328 -109092 -91944 -54572 -72895 -36267 -29031 -4894 18455
10190 18455 -101786 -123685 -70921 -42160 3930 59619 73943 103471 -12827 -118070 -79582
10179 -79582 -74255 -65965 -77577 -97097 -108702 -33845 -62693 -151979 -124217 -26260 47578 -56864
10167 -56864 -125983 -58968 -25568 -76515 -75613 -64145 -168765 -152206 -74405 3282 17420 -29478
10155 -29478 -1750 29836 -16530 -50716 -67327 -29477 -12795 -41905 11945 37633 11868 76600
10143 76600 90915 91396 120611 96996 79880 82848 120931 130121 56436 85560 47362 -26135
10131 -26135 14504 12772 -13267 -52115 -14704 79665 134619 96347 32864 8717 5074 6388
10119 6388 -21400 64210 77752 -14563 -50968 -18594 -12078 -3832 -1810 113519 87311 -27799
10107 -27799 -33711 -40763 -13955 26063 75011 -6924 -33726 63656 -14390 -39590 -59518 -98030
10095 -98030 -148526 -149789 -9247 98613 97101 27003 -54509 -40829 -49461 -75381 -62699 -1150
10083 -1150 -7135 -68077 -103822 -129466 -83252 -37954 -58472 -45795 -19353 7045 -77773 -93646
10071 -93646 -47776 -32786 -12883 13499 -26739 -118377 -108061 -49340 -49882 -89051 -99364 -39153
10059 -39153 69714 150717 56376 -42317 -67615 -24787 36854 18217 7416 -15395 -13752 60132
10047 60132 59846 -43809 -60898 -85527 -124910 -222622 -301272 -245702 -155973 -176144 -50032 8279
10035 8279 101806 103873 151331 85029 -25799 -5104 113268 222263 271131 357874 566702
10024 566702 864372 1192351 1258543 1097544 744229 467845 367238 295716 208124 151544
10014 151544 83814 46562 -58076 -25784 -7670 -16659 -1603 83962 98307 81321 49358
10003 49358 17081 11803 38644 40839 87210 128761 86625 53549 126203 169487 143988 61847
9991 61847 -54108 -17846 -24850 -5953 -12295 83345 82152 -7954 -15900 7222 -70691 -114268
9979 -114268 -141150 -94396 -88528 -63505 30688 88935 40473 -8314 -19946 -20248 49362 124789
9967 124789 153889 61221 65144 42744 22127 69075 59308 -57592 -166173 -135980 23612
9956 23612 97244 81585 -5100 -72684 -82163 -51211 -20292 49225 -21002 -53244 -24233 -14354
9944 -14354 -116715 -142595 -124142 -57310 -115589 -90012 -48885 -142244 -184845 -141527 -58591 15291
9932 15291 1509 14247 122523 313255 306411 293404 196497 97609 33184 7773 -76919 -109173
9920 -109173 -58631 -86901 -91093 -84357 -31902 45265 -29227 -86537 -96707 -51173 -10349 -8966
9908 -8966 19254 137554 111750 133354 126179 35665 48943 44989 -2224 66049 136328 178799
9896 178799 146706 143576 94083 80805 120808 80762 53054 6023 -7721 8549 43665 27272
9884 27272 -19404 24903 59891 43589 62773 2579 31374 122759 187780 212882 260159 209465
9872 209465 196532 121379 23468 3494 52718 35204 11018 -7114 -38438 -19256 20903 692
9860 692 14169 77181 141203 108410 177188 142280 205809 213791 139980 41149 -39152 -6465
9848 -6465 7342 -43324 -104787 -113222 -14722 78643 37275 -8171 -77038 -60750 -41590 8257
9836 8257 25962 -2664 -5433 -49702 -66733 -53992 -10810 78170 61895 38505 105407 155961
9824 155961 52378 33957 138478 162344 191239 166159 54190 44359 134384 96472 -38147
9813 -38147 -109657 -11231 22050 115106 144127 171764 106768 -13515 -111157 48710 141556
9802 141556 111304 80075 -40173 -36834 -46719 -47989 -569 17901 79565 61192 -50921 -41528
9790 -41528 -21032 -42960 281 8257 -55137 46725 35328 61733 130334 76564 7968 -13448
9778 -13448 -32433 -19652 -15101 -43864 20869 111952 105734 104097 107001 20093 -30870 -22057 -42772
9765 -42772 6665 -15411 -3899 15555 73885 87306 108328 28936 6288 84777 103922 17723
9753 17723 640 -39025 -38844 1091 34950 49587 90044 -27528 -8804 96439 56259 -46462
9741 -46462 -104210 -67625 -8185 -66158 50531 136907 133702 137756 194729 156180 195944 189255
9729 189255 183047 206785 189299 105949 55518 28051 -4441 99806 261447 304680 212353
9718 212353 135468 101307 103442 122534 167530 234646 279617 335833 253565 211936 180892 188711
9706 188711 240845 248405 300423 335213 257407 279432 276216 315133 302581 298041 288244 246791
9694 246791 237851 285236 320949 332574 321489 350932 397144 469629 526006 521627 523596 607354
9682 607354 699543 704468 707733 602245 540044 593979 745448 875562 916300 1011421 1043513
9671 1043513 1045493 1145459 1224771 1256950 1303527 1444070 1574466 1703064 1803060 1987074 2093799
9660 2093799 2232980 2407314 2554417 2752148 2790570 2916286 3140313 3307945 3395609 3497110
9650 3497110 3600612 3748533 3837797 3881221 4018710 4185899 4275374 4327156 4401639 4391453 4383307
9639 4383307 4401457 4408590 4442400 4393142 4424027 4516758 4545514 4604388 4613901 4475264 4379671 4325026
9627 4325026 4265031 4231879 4263020 4249151 4246504 4177721 4095472 4058719 3958169 3796670 3746721
9616 3746721 3745893 3729271 3666929 3621418 3583076 3541358 3498073 3416368 3347954 3317453 3340596 3300733
9604 3300733 3233209 3151398 3081944 3019943 2981790 2910627 2866581 2881898 2896589 2878520 2841113
9593 2841113 2946131 3062784 3071099 3053051 2994606 3020582 2935090 2834454 2786284 2747004 2823899
9582 2823899 2927911 2986339 2962554 2954123 2934622 2965398 3029663 3095556 3214790 3220708 3162039
9571 3162039 3193273 3186831 3200535 3183303 3195227 3291993 3288589 3273901 3304931 3408972 3488794 3502060
9559 3502060 3504389 3494908 3535428 3576911 3527528 3486519 3530596 3501617 3466684 3484996 3432885 3443950
9547 3443950 3478885 3461532 3418031 3376348 3304851 3236004 3201244 3146391 3020223 2992238 2948764
9536 2948764 2850527 2792528 2750534 2593846 2544482 2427838 2192318 2149113 2071913 1973113 1905971
9525 1905971 1833012 1796634 1842567 1735848 1669627 1536162 1465396 1421839 1334065 1215969 1086596
9514 1086596 973852 888136 833052 837511 809504 879334 934332 811146 669312 650704 690025
9503 690025 611526 543547 512313 404054 407614 490120 500584 380632 355710 405599 423687
9492 423687 344114 331755 271690 260504 247356 329124 359709 331386 334934 331299 260934 214155
9480 214155 234847 257914 222902 189972 164917 94547 60839 156288 225067 172483 123832 45791
9468 45791 -23152 -39804 -75022 -19113 63441 145915 153879 197532 227799 159930 155094 124861
9456 124861 96721 103836 113300 94973 29454 16823 74964 129810 175284 112090 69325 108907
9444 108907 115426 61975 30506 -8961 12126 151386 210631 174070 178718 212456 218967 202181
9432 202181 118310 33843 -17856 15762 97997 147771 156094 79550 23891 106416 197740 205635
9420 205635 132586 96358 83238 89850 48448 150604 149657 106156 111133 47241 -7753 53327
9408 53327 96717 178134 189856 224083 218274 181468 186622 122457 195986 115845 8468 115322
9396 115322 6055 -24706 30619 23971 63046 58152 9790 -991 100570 130212 66824 62664
9384 62664 143149 71424 32072 8249 17637 68406 101073 67243 78604 28975 55142 48721
9372 48721 22809 26249 54990 68658 89033 43948 49674 7180 -3597 15524 89608 124106
9360 124106 31740 -63090 -120684 -94790 25279 101154 154637 145835 64536 -26398 -28547 1666
9348 1666 -17127 -29252 -106983 -135780 -150014 -84367 -41433 -59905 -105485 -90408 -42494 -50944
9336 -50944 -40070 14613 28976 -34559 -7757 -38381 -81127 528 30808 -44975 -18564 91146
9324 91146 109313 98680 51853 22934 -74459 -38570 -29678 -55871 -2630 -20085 -30398 8260
9312 8260 120617 145714 74305 61618 172705 81641 9672 -60673 -47374 -85559 22466
9301 22466 121851 6676 -54063 4697 64812 140677 95259 34876 8794 -33591 -80389 -60425
9289 -60425 -65878 -72172 -17171 -56453 -25332 37532 64454 104244 79733 79883 83136 201 -32414
9276 -32414 -47640 -86268 -72484 -132038 -145024 -66467 -71871 -52061 -33979 -132811 -70840 -449
9264 -449 -56529 -84920 -99724 -171472 -69715 390 48762 60474 53783 95247 65446 -24009
9252 -24009 -123266 -120037 -113857 -113009 -65211 -47848 -93456 -64722 -39682 -49777 -21365 34029 82312
9239 82312 107956 123057 108530 42471 -684 -72237 -26808 50476 120163 115529 86365 56304
9227 56304 35465 -844 12215 21055 26320 -15630 -26955 -66263 -8632 77960 106521 92879
9215 92879 3274 48395 10055 15321 6758 -8353 -58409 -121833 -211633 -194840 -106517 19312
9203 19312 22646 -60410 -72160 -81758 -4858 24236 -5943 -50960 -14730 -28658 -59761 1383
9191 1383 24265 96955 191214 180599 111838 54456 39931 40270 -13396 -54347 -89487 -121494
9179 -121494 -138104 -143675 -27604 2213 -64281 -78482 -50404 -3785 18622 -3314 11532 -55298
9167 -55298 -141827 -133362 -61826 -50493 -50146 -72751 -114133 -153270 -184519 -171426 -122650 -65171
9155 -65171 5390 49721 26131 15058 39033 97200 187057 163287 103240 106810 66709 -48648
9143 -48648 -45943 -61738 8322 106029 111763 131750 214373 133843 74902 101116 87994 55679
9131 55679 97819 76759 50650 120058 169210 95162 99629 95342 61228 4529 -106879 -144621
9119 -144621 -141126 -69620 30054 70843 64547 -14483 44466 96106 57688 -399 -67704 -78349
9107 -78349 -80245 17010 151948 144125 122733 124955 118598 98761 42417 -22345 -38827 -70933
9095 -70933 -65648 -41213 26956 87621 118485 106613 111402 115202 55855 48561 53904 18142 -106109
9082 -106109 -42996 27436 105794 79447 32166 59779 33328 84744 115241 83535 67614 69804
9070 69804 11771 -37810 -14336 -17362 -105114 -70109 -14141 2222 37337 -40258 -154338 -118340
9058 -118340 -64609 -23830 -1594 -12905 -126922 -187421 -188747 -123138 -51127 10657 17088 -28370
9046 -28370 -39484 -8739 45066 121754 127773 39612 -8011 -66822 -129773 -1758 109447 112381
9034 112381 33587 -63541 -63293 20214 77348 156500 172045 60138 75887 131358 61302 -34119
9022 -34119 -14595 20687 -69715 48831 173094 109668 101247 46539 -11913 68213 96872 58935
9010 58935 -13560 -50251 -63558 -59172 -37122 -44778 -9145 22192 -111534 -215037 -99089 -15687
8998 -15687 30205 32192 -3957 -28322 -17445 41510 103132 87328 13815 -10324 20516 118550
8986 118550 94345 20496 68256 39205 25366 15488 22230 14133 73879 1467 16734 170969
8974 170969 141744 75405 50838 70480 86420 62507 59113 32588 24886 60057 94240 28153
8962 28153 -68719 2467 120573 170470 100157 60386 -10056 -19784 -42510 -14395 38611 12247
8950 12247 68218 109942 49936 4514 -26818 -81989 -81929 -109798 -88297 -64145 -17683 -6933
8938 -6933 -74031 -33569 43568 77341 -4137 -30429 -37825 -88520 -151322 -90826 -54712 -34552
8926 -34552 -4061 35780 -6204 -9961 28944 -43719 -114628 -144768 -129046 -193952 -259577 -194062
8914 -194062 -159967 -128999 -153848 -125276 -102014 -77026 -56084 -106370 -123388 -80477 2706 18144
8902 18144 -17001 -27579 -59164 4539 -2288 -29898 18359 18154 40417 83246 106017 144832
8890 144832 156396 143777 110662 76750 104617 70953 105541 118624 75668 39563 12782 14582
8878 14582 -46417 -72405 -33525 4558 66400 177697 205701 118993 29548 21278 -29307 -36485
8866 -36485 -32720 33855 96975 60440 48386 29243 -6111 -105429 -132547 -143723 -36980 20714
8854 20714 76030 96950 135906 115555 120664 108042 -55661 -158675 -201361 -152053 -79296 -32285
8842 -32285 21742 56778 14953 -24205 -107840 -140749 -83520 -92961 -63741 55422 75171 4768
8830 4768 -10289 -26929 40423 77835 167123 96453 48241 109046 134672 132565 152440 135705
8818 135705 118291 56789 -59617 -10593 22121 -38017 27987 58588 7869 -21077 -12080 116271
8806 116271 144406 142494 14021 -63962 -53104 -26501 -48238 -17253 47849 41572 -45352 -94676
8794 -94676 -1601 131955 140323 112615 31032 -73510 -34994 40625 52304 17269 43335 68474
8782 68474 -16773 -31780 9726 -41659 -86516 -92704 -63972 -114969 -111192 -117070 -126890 -70957 -20139
8769 -20139 45043 -12305 -11193 -13676 -36057 -35928 -6576 11885 21876 -41962 -30361 -35694 -62888
8756 -62888 -101530 -115826 -100252 -69749 -88516 -130806 -93546 -49107 -59101 -76716 -55696 -84715
8744 -84715 -62649 -992 78634 114579 74429 47364 13442 7760 22138 43674 122184 48717
8732 48717 11633 141034 140019 95267 164067 184774 116408 34982 58612 121994 131302 207594
8720 207594 225669 206629 187462 131856 121900 129604 34081 69119 180476 193405 226679 193992
8708 193992 125616 87264 103577 119794 103433 68222 123462 99099 33811 89749 133823 142380
8696 142380 190406 227091 303530 337924 237597 202208 229540 219063 151082 123044 117232 118910
8684 118910 94863 -8230 -79705 -42483 -20107 -1409 30773 68768 98477 130368 185975
8673 185975 245658 309627 325735 179383 142136 99156 66694 81506 78727 146099 124490 127208
8661 127208 109253 2350 5137 -25481 4204 43563 22352 49879 3843 15079 44926 23083
8649 23083 -28086 -34323 54902 96805 39629 -4821 -102153 -174740 -80487 -43543 974 88394
8637 88394 111695 92399 118739 100509 -44372 -164834 -217940 -169296 -134681 -64242 -26556
8626 -26556 -38980 46256 102992 96476 65180 -14465 -9487 8623 61390 47973 46435 63650
8614 63650 43942 86375 133715 172871 108347 66236 64828 96998 122917 34021 -108131 -104645
8602 -104645 -1285 75084 144647 171556 243011 219685 169960 191553 187367 182129 175971 130597
8590 130597 87914 27426 34587 28031 4338 73629 118689 46410 80640 50976 1180 34461
8578 34461 37527 91284 82557 143021 107328 80045 98552 241905 409126 437038 361717 372785
8566 372785 519603 685200 925003 1409005 2090924 2917088 3471079 3405944 2814095 1925475
8556 1925475 1195544 735691 461368 333550 260538 235249 171320 119072 219336 213780 220154
8545 220154 230742 225630 205587 174350 144778 102392 54880 -22906 -89122 -10979 129174 221557
8533 221557 238398 217614 196579 167978 232446 217751 207060 283936 384484 443530 559459
8522 559459 814531 1104131 1549715 2263890 3473356 5057138 6656254 7032467 6104364
8513 6104364 4557194 2917216 1774589 1060924 738358 592158 459340 365556 337792
8504 337792 335680 372982 374453 283514 223519 263405 209726 128216 104161 112817 74966 135984
8492 135984 190964 194125 98638 74704 56966 46732 142345 206685 203665 195691 276797 341911
8480 341911 338369 410178 456516 523101 739235 1077890 1552881 2185637 2997263 3454862 3231522
8469 3231522 2535382 1638379 966950 603842 456771 250766 84966 60385 60418 111203 59342
8458 59342 85515 84532 121238 33398 -34615 -8807 -4275 -78158 -32864 -10194 41385 47495 -3329
8445 -3329 54263 101411 74667 26789 78324 140169 61385 8735 5638 65672 158547 163939
8433 163939 19401 -57726 14733 65247 74928 43451 -54606 -87540 -61718 -95955 -34470 -41000
8421 -41000 -38777 48648 25772 -22881 -47572 -6264 -20433 -26813 -78161 -23526 4845 60296
8409 60296 -30282 -151878 -236602 -221338 -70628 -5232 -36981 -26465 94755 62419 -36281
8398 -36281 -47973 -95690 -61444 -143152 -113302 -102663 -50288 -49311 -38442 -25652 -154568 -124804
8386 -124804 -91351 -60510 -16565 -33864 -134762 -112213 -42884 -5713 -11943 -46042 23606 70144
8374 70144 -8074 -35624 -12600 18214 3420 -9097 -75361 -159231 -154076 -88221 -80907 -124964
8362 -124964 -225856 -254993 -255809 -229601 -179248 -145593 -112594 -120196 -109355 -85431 -77766 -49079
8350 -49079 -13315 8910 -47268 -96013 -142313 -54267 10315 -40039 -78575 -46262 -33418 -10498
8338 -10498 7652 -16227 -93649 -120132 -107914 -107072 -99038 -58796 -51223 -59611 -26967 12476 63156
8325 63156 81907 33921 23337 39225 178581 174160 193171 176524 86354 16114 -15421 -84920
8313 -84920 -21499 -35695 -46533 -97658 -81832 -63801 -100769 -137112 -106470 -12331 25725 -59068
8301 -59068 -95804 -126114 -109961 -18230 -44067 -129243 -133421 -157649 -127534 -81310 -131387 -140066
8289 -140066 -120759 -80110 23090 18582 -4946 -24958 -9134 -22158 -13227 -2575 -19106 -33444
8277 -33444 -70225 -154105 -67990 52138 107959 30579 -17278 58334 5885 -132039 -130325 -43898
8265 -43898 8764 -24225 -4100 69143 180882 178944 162584 196277 144741 75244 44297 4960
8253 4960 83848 139242 209089 139621 -25492 -73133 43517 112655 97942 -16391 -38486
8242 -38486 -28962 1711 -50220 -49725 32834 -24799 -22903 -33334 -19257 12606 -2902 -47190 -46100
8229 -46100 22293 15370 18884 13031 1945 -15269 27975 29954 -56307 -83801 15940 96677 114569
8216 114569 -5349 -23736 18435 -4443 -48549 69964 37728 -45760 -90185 -90147 -132275 -121329
8204 -121329 -61834 17979 -17617 30205 67039 63987 42124 42074 -66688 -122545 -107231 -51031
8192 -51031 19145 18875 33924 75200 -38757 5593 -21452 -34059 -72787 -78700 -132097 -141897
8180 -141897 -68414 13636 40466 -52854 -45329 -17687 -19697 -13648 12666 41049 14567 48133
8168 48133 117025 176970 182143 176927 75076 36436 72017 142121 65391 2102 69349 124453
8156 124453 145587 205185 200157 172801 151275 93096 116559 128238 48780 -56416 -40769 -15426
8144 -15426 -13924 40331 90123 70960 55474 -11731 -4558 35078 93702 42354 -14245 21501
8132 21501 89534 125900 105420 5515 7076 25211 -37711 19212 33992 43585 2817 -26150
8120 -26150 31319 24286 -20877 -64745 -37088 -14966 27352 52838 -60401 -66789 10700 22193
8108 22193 -77740 -43291 -101003 -143193 -95043 -98771 -87368 8658 -10427 -20980 -36658 -90794
8096 -90794 -50426 -39507 -66149 -72836 11782 60897 161632 144103 -652 -22179 -31180 22573
8084 22573 11564 -8440 -10884 -95669 -121854 -142156 -151248 -49643 -15255 -81613 -40830 138857
8072 138857 172308 134392 85496 50136 20285 -94353 -128540 -22557 -18684 7150 97700
8061 97700 156326 157641 77106 -14584 -60363 -54923 -33185 -9311 78975 109921 34836 27186
8049 27186 61530 79688 -1680 7603 61499 104345 144220 117519 26844 43044 72195 64718
8037 64718 29569 -30575 -9073 -6352 31105 -51011 -97943 -46853 -8723 -93189 -90976 50145
8025 50145 142209 138933 67769 90910 100690 74298 59807 115447 136186 150013 156442 53373
8013 53373 -87075 -6798 71403 46678 2479 23007 12409 36312 62301 29684 81910 127516
8001 127516 72886 -49278 3924 20505 12549 46952 60225 48475 87894 24382 49156 111674
7989 111674 94190 -17183 -123966 -123163 -79486 -57412 2995 21280 40369 40847 27829 93148
7977 93148 88173 -15413 -116446 -112617 -72242 -129417 -50139 53634 60090 32169 84979 -6371
7965 -6371 -448 23506 78930 83526 19246 -37301 -43506 20150 60416 91420 77845 53033 -54696
7952 -54696 -54995 -13848 61429 188182 207610 144064 25952 -44410 -64182 -37189 4521 -14934
7940 -14934 58698 33398 -20371 8237 23694 -13268 8759 46550 87192 84731 79822 84880
7928 84880 80473 120469 102676 32801 -8580 38947 113294 53019 6901 -5748 82276 148709
7916 148709 109105 77028 9326 -28099 -68022 -27797 80139 143923 100490 61605 48195
7905 48195 19650 -17784 -85728 -19666 68269 33210 -17011 -56660 -54921 6178 -20826 -61499
7893 -61499 -36985 65475 88454 120708 82960 24953 -1386 -31594 -43492 -85838 -45630 52393
7881 52393 136679 96190 10747 -14415 53507 68136 24084 -130890 -193933 -174785 -126713 -160676
7869 -160676 -160779 -49585 26347 7838 -31255 -109040 -102988 -43435 -91391 -88081 57352 110825
7857 110825 24642 -26203 -32994 -6615 48884 91311 46734 -13326 -28732 -30797 19302 4264
7845 4264 -36060 14550 47319 629 5409 -64311 -41216 -43728 -78636 -63780 -57596 -77363 -80900
7832 -80900 -113002 -120877 -69329 -54728 -46633 -19617 -115290 -160618 -98375 -82295 -46550 30122
7820 30122 2348 -66284 -33784 80562 167118 62299 -55068 -74864 -76449 -5413 21340
7809 21340 -53222 -84747 -132124 -147831 -77996 -35987 23157 75780 130664 51475 21429 -4477
7797 -4477 6937 33834 79415 1537 -34314 -79047 -82522 -58655 -134348 -83732 11897 84082
7785 84082 134706 168406 148854 115640 98687 95184 128788 113870 176388 192883 139307 67357
7773 67357 113192 68230 4877 -21459 -104936 -101621 14963 45068 30927 -20977 -34967 -79780
7761 -79780 -46831 -26145 -4452 -35209 -14005 -5838 -75463 -140822 -156463 -150335 -89114 -45295
7749 -45295 10576 4489 -466 27085 -9358 -7490 58988 56701 57071 21036 -47253 -60069 -135180
7736 -135180 -151573 -208629 -153453 -45950 -42333 -664 41618 -63425 -107615 -69370 -68346 -49461
7724 -49461 -61344 -33413 -5818 8494 10304 46250 -4580 -52358 -5681 24580 -39335 -102035
7712 -102035 -123544 -64878 -22984 -38896 -50719 -31104 -77720 -38954 25345 -19818 -4438 47206
7700 47206 62162 82630 82856 37341 -59777 -87736 4509 25351 103706 14135 -45183 -39500
7688 -39500 -6290 -39445 -18558 1311 36820 108670 109252 17853 -73984 -83070 -50023 -8306
7676 -8306 -89653 -202276 -155517 -97354 -96426 -87005 -75562 -61255 -10099 1372 -2893 12189 53690
7663 53690 46170 91389 98777 113591 127228 106080 72167 -11675 31538 -37308 -77417 -70820
7651 -70820 -66255 -71664 -132353 -162336 -160910 -175708 -44106 -2602 90119 102554 117873 81208
7639 81208 -6443 -50346 17015 -36201 -29415 -31493 -67763 -14212 6327 -57479 -127978 2544
7627 2544 25834 13686 26300 48848 100868 64907 97368 88643 36228 -19105 1383 34395
7615 34395 -2815 -119639 -90898 45789 66447 35331 -40718 -48636 28376 120104 139618 178099
7603 178099 122893 137948 103598 -83971 -145764 -160649 -106942 -58509 1706 -46220 -12249
7592 -12249 49085 95185 90620 -1124 -92535 -66616 -90957 -21273 -9328 16017 60644 74357
7580 74357 103786 77178 76840 79369 75397 145286 94253 88359 85612 129443 66156 -820 -42873
7567 -42873 -71064 -113894 -117987 -84488 -51018 -55214 -54386 -101164 -69337 50075 101613 107196 115555
7554 115555 67947 -13539 -52464 -60173 -64205 -15280 56211 39529 33967 38241 52446 95871
7542 95871 105420 137216 48903 -27979 -41999 30696 112675 50968 -73601 -110636 -99781 -105944
7530 -105944 -53848 -66448 -45434 -7807 20515 -218 22957 82371 68053 -49152 -99303
7519 -99303 -58244 -44184 -38381 -102737 -90389 -143361 -155777 -73596 -50491 -23439 71017 78389
7507 78389 30213 10998 -11203 -41252 -81433 -54450 -42669 -31319 -104557 -54782 -41000 -95232
7495 -95232 -127824 -184496 -201582 -193270 -196303 -75841 -24956 -57619 -108757 -202412 -157190 -101039
7483 -101039 -64353 -198121 -135111 -133872 -196307 -165285 -92639 -48015 25529 34066 117425 170983
7471 170983 123825 119639 20308 -42559 -71022 -93772 -82639 -91298 -153700 -183872 -65315 -62989
7459 -62989 -105238 -79774 -167714 -129812 -21189 -91191 -156903 -113573 -67002 25739 17579 17053
7447 17053 60213 157696 97410 20097 -17283 -72233 -90246 -78780 -102553 -90858 -22766 31655
7435 31655 -40133 -42874 3346 22799 4963 -101754 -178831 -162827 -75990 -45730 55781 89770
7423 89770 121906 96918 23121 58572 36523 19469 82168 45367 24988 -2698 -122626 -135281
7411 -135281 -47607 -49312 -57850 -63867 -46393 -25354 -116795 -167271 -118730 -124082 10593 121298
7399 121298 190706 217990 226158 214354 144679 39371 10887 22060 6306 -8489 -33214 -123147
7387 -123147 -82983 -41386 -30806 -115084 -173691 -196808 -178410 -172451 -146456 2785 14427 -4597
7375 -4597 -136166 -204200 -134891 -87321 -67169 -92482 -176589 -120714 -134254 -181434 -198991 -104051
7363 -104051 -10778 -25322 -67563 -97509 -78575 -147530 -75552 -88679 -40969 3668 81519 104869
7351 104869 105403 72140 53496 108891 34779 -12386 -71061 -55787 -68311 -121584 -24763 -41764
7339 -41764 -104951 -159288 -87728 -39313 42219 85489 44240 -24915 40911 65274 14077 -29827
7327 -29827 -16045 -52265 -120759 -92273 -2838 -52198 -42634 47794 16586 -45793 -9134 56721
7315 56721 72734 57732 93031 112150 39926 21408 28887 16742 18328 98022 130316 71737
7303 71737 -3480 20019 -13792 14509 -11101 -154435 -156215 -115704 -157786 -178657 -114036 -61441
7291 -61441 -44599 -33340 -677 10610 38143 18063 -15717 -29660 -35209 -24696 -56971 -42020
7279 -42020 -94320 -50146 57507 -14589 -28686 28105 -36707 -52007 -39538 -65580 -3769 -53556
7267 -53556 -41871 39173 82106 98456 5932 -56786 -64712 -25924 -23516 -65429 -28962 -25005
7255 -25005 -28323 1080 70099 60515 36126 16668 30782 65159 71201 100844 111129 7230
7243 7230 59734 75850 1528 -3479 63924 92397 70366 81423 23489 -83168 -193850 -249343
7231 -249343 -245468 -220745 -179212 -95161 17676 40042 96845 171840 169656 115366 62246 160773
7219 160773 197133 154232 60510 -18678 -10325 -63395 -113279 -99376 -44243 32496 62583 1646
7207 1646 -128919 -201954 -116622 -54647 -2542 35915 38968 -10600 -53123 -5634 7538 -11517
7195 -11517 -55149 -21345 49085 72468 61954 86608 16936 -88028 -95763 -181211 -203572 -113531
7183 -113531 -35291 -48134 -81291 -106682 -69870 19476 89344 73005 51666 72168 64175 102810
7171 102810 87945 53887 78153 12863 819 51867 53121 41061 30602 24383 -57023 -58251
7159 -58251 -26099 -89695 -1563 13325 8139 -25974 -77846 -84905 51107 92648 43132 50588
7147 50588 45126 687 1238 24565 72895 7250 20856 104480 146473 57285 -25635 -68609
7135 -68609 -82956 -51071 -51353 -103229 38222 143659 71030 -78247 -121675 -100483 -80766 6948
7123 6948 11363 -56966 -48382 -71938 -34122 627 82038 76301 6745 -59911 -54054 -80426 29238
7110 29238 76670 5595 -20572 -20985 -1737 -97624 -97983 -54137 -79930 -55616 -25562 -15220 -10448
7097 -10448 53700 60656 5051 -29453 -60775 -41910 13731 49823 69484 19570 7900 9915
7085 9915 -29143 -10790 -74316 -170437 -123577 -109602 -115342 40451 68791 24520 59604 57090
7073 57090 -3186 5729 -22022 -80168 -118871 -101126 21358 91622 102679 180551 151714 55343
7061 55343 19274 16518 78378 77277 90000 111594 147867 128849 46157 12585 97411 119280
7049 119280 -37383 -98038 -51616 -141068 -190486 -161365 -143958 -161913 -62893 -36932 -103479
7038 -103479 -133458 -73820 84895 123318 61193 -20591 -44638 -24694 -22095 1673 8601 -96206
7026 -96206 -46180 39239 49270 -44324 -55894 -86992 -101212 -162291 -65917 -17981 19833 97980
7014 97980 93753 48651 -25842 -80361 -47011 39249 110503 108561 79867 141470 161581 164728
7002 164728 180575 64170 -10905 -32131 -69741 -128451 -46500 61173 76409 40874 -2955
6991 -2955 43149 1333 27717 115954 124929 82858 44124 34200 -20473 -148172 -196785 -109737
6979 -109737 37927 113984 111430 99726 25105 -54543 -28423 -5231 24403 86866 146713 124175
6967 124175 34560 -36872 -55326 -60876 -26272 -57634 -42364 -81642 -47469 53086 -20321 -70276
6955 -70276 -57835 -67582 -47591 -49083 -5826 -97301 -75169 9394 32061 4407 -29056 458
6943 458 36448 6459 58954 167720 182747 148030 37246 7324 44477 31657 92302 143228
6931 143228 127644 115855 83619 -54276 -105810 -12135 90540 154150 146556 139241 51162 53330
6919 53330 26330 23815 -544 15887 -25265 -39565 -47871 9935 30686 -23506 -55991 -2033
6907 -2033 16075 24231 -7042 -73263 -61527 -61341 -67973 18585 -2770 36999 -50048 -59538 -4823
6894 -4823 -32382 -8115 -6824 -11376 7943 47754 125748 69572 21148 26874 117082 146663 121700
6881 121700 127525 43986 -40256 -25951 -4297 -98214 -70303 30864 -18615 -24743 -45859 -83756
6869 -83756 -71966 -119908 1863 -30360 -44394 68407 42366 -31625 -127811 -164272 -133073
6858 -133073 -62358 -43781 -37610 3192 32981 54540 -27882 -45949 -100670 -86612 -60714 4535
6846 4535 -13400 -45298 -53676 -70681 -115889 -161878 -176046 -152026 -85673 -48973 -35733 -19275
6834 -19275 -8566 -12202 9052 65983 97015 42482 -51113 -70669 -88105 -86478 -65559 -21343
6822 -21343 1229 -50828 19679 -24203 -56209 -57772 -48631 -75799 -52009 59155 92954 88650
6810 88650 30865 62276 -22500 1574 41684 103997 111571 45626 -56347 -142880 -67152 -54149
6798 -54149 -69131 -17934 -51913 -56256 -32123 -37237 -128736 -101076 -75733 -77421 -91556 -82115 -74018
6785 -74018 -3191 -16794 -44002 -42143 -7524 24618 -6193 -46950 -36983 -86487 -185857 -136917
6773 -136917 -49018 -29937 16767 24003 -12936 -55501 27527 76482 91168 108065 27142 -30258
6761 -30258 -5129 46790 18491 -64519 -53791 -121769 -141717 -38526 44262 86018 75581 12326
6749 12326 -10153 -22447 -20009 -59987 -143077 -44112 46388 10189 14555 72060 133560 64063
6737 64063 32658 -25767 -41536 -53680 -7665 52429 102169 71791 20394 -54285 44615 157967
6725 157967 98072 111783 190877 160293 83978 48725 62375 81111 12439 -69990 -62443 -70338
6713 -70338 -88075 9727 33884 24911 -75801 -107344 -14827 70824 42964 98596 146309 16316
6701 16316 -34809 -25316 3116 -11800 -64436 -65070 -71749 -17730 80264 71632 14485 -24358 33360
6688 33360 41412 24610 -56863 -75541 -34034 60924 58513 99493 31873 3667 -12125 -15910
6676 -15910 47587 88983 30954 -72462 -26030 12770 70527 76638 1072 -87195 -78047 -27102
6664 -27102 -36356 -42048 -11942 -28332 -25971 16985 27593 9352 -3507 1564 -35859 -41556 -40943
6651 -40943 -105439 -108886 -43721 -3350 7412 -4317 -35664 -52226 -86108 -105040 -43536 45618
6639 45618 23486 23193 -15750 -53492 -16151 -30525 -49516 -92743 -133832 -39417 -67534 -123212
6627 -123212 -114288 -73420 -7820 20219 25745 27567 61800 -3110 -27924 -371 -77137 -240379
6615 -240379 -330013 -254106 -130725 -60107 -8204 -36760 4076 29676 -3314 8758 43386
6604 43386 133845 148133 114137 73497 82306 80204 7567 -54797 -34040 15581 48821 -8221
6592 -8221 -90586 -148723 -67129 39437 27170 99899 131208 -11307 -26692 -28201 -68113 -61946
6580 -61946 -49613 -33699 -57704 -79167 -41236 -35773 -60087 -65434 -74478 -138122 -197230 -130215
6568 -130215 -106750 -89623 -27576 -19802 -82043 -96764 -52970 36129 102802 145792 153288 188884
6556 188884 184606 110104 41118 -309 -55334 -99435 -98988 1519 -23057 22276 71536 9197
6544 9197 -34248 -33057 -65470 -37034 5727 13159 -29408 -47357 -64264 -49171 -51273 -32730 43163
6531 43163 42526 -51557 -202159 -129531 -127865 -255323 -169976 -126812 -97431 -21819 -5746 -20352
6519 -20352 -81235 -34289 -29542 -5110 -334 -92422 -123643 -91461 -52070 -38594 36070 44017
6507 44017 -39345 -68611 21611 19961 -5705 -205 27656 74060 71293 162460 123510 141199
6495 141199 259822 269132 218710 103802 -9510 -78180 -24872 4721 19488 6683 -5901
6484 -5901 67749 108308 139872 83454 86301 74896 10798 -58905 -115435 -37493 95 10621
6472 10621 -62732 -96448 -21774 -76433 -128566 -137791 -87341 -43896 -15821 -52841 -23830 38299
6460 38299 -1503 -58789 -12687 -69601 -97242 -60541 -118100 -136649 -140745 -69989 28608 81056
6448 81056 61109 98372 144991 114985 97370 66533 6476 12416 21601 22155 18455 13588 -77656
6435 -77656 -134627 -91744 -18453 11817 -22048 13292 -4316 -18007 45501 -999 -59390 -49553
6423 -49553 -34230 14397 8617 87363 163913 65512 29564 80121 31393 20087 38796 29320
6411 29320 72184 81300 12324 -41896 -55935 -120846 -81888 -77744 -78614 -61122 -51594 -55830 39766
6398 39766 122390 122901 93863 24897 -50954 -67779 -71844 -100036 -24080 26865 25848 -22621 -19916
6385 -19916 -71936 -29968 59972 39138 -56720 -17662 94242 79828 -33918 -70710 -79156 -26183
6373 -26183 65705 89514 13448 -43747 25420 126886 185794 190355 209748 205528 151786 69070
6361 69070 45222 13762 35772 38506 74001 50433 50656 34166 -38226 -31000 -63237 8070 49941
6348 49941 -4146 18123 57908 32423 -39631 -77912 -5983 91310 97061 48634 53263 43701
6336 43701 71882 143000 49969 -41872 2293 40540 25297 -52175 -34712 611 14779 58551
6324 58551 10861 26498 9411 -104211 -201361 -118198 -59331 8136 25750 30 -36746 -74640
6312 -74640 -96141 -85030 -97245 -97242 -43980 -100989 -141354 -93472 -53514 -29900 -27321 31091 23343
6299 23343 79801 80778 -39649 -120631 -122952 -25098 -17104 17899 90282 6978 -13505 27496
6287 27496 87681 37796 -31270 -18523 -3945 51984 20018 -3188 -5860 -54895 -2998 11196
6275 11196 -46643 36475 78121 -42929 -107571 -184061 -167783 -181758 -139512 -69915 -20297 28992
6263 28992 35083 792 -6152 7318 35326 38563 72467 117898 59833 85499 31025 21448 -25106
6250 -25106 14548 -1008 1210 -5935 -34756 22871 -31814 -33593 -35432 -52597 -27987 -46742 40967
6237 40967 57472 -14435 -26704 -77570 -120267 -47210 -52342 -72746 -110056 -173811 -220728 -138785
6225 -138785 -98363 -190723 -140820 -59500 24793 -23946 -48978 -50014 -84026 -1939 101176 124783
6213 124783 41576 60159 -24271 -37125 -4927 -31374 7900 11265 61221 138231 127935 124617
6201 124617 157313 109609 27734 14701 23744 -61713 -106590 -140895 -88434 -80702 -41625 31140
6189 31140 76917 86032 4594 -28247 2677 -14378 -59380 -67756 18861 68913 102219 144721
6177 144721 93934 23921 -41474 -70347 -43532 14061 38748 48948 44479 43691 2480 -33070
6165 -33070 -60034 48669 64442 108084 1811 -97785 -45422 -5772 -145950 -211689 -194918
6154 -194918 -119730 -26752 -95323 -97045 -27764 5036 52155 35332 -12280 14365 35963 -88100
6142 -88100 -91541 -12637 34253 -5167 -49695 -18846 -101720 -95213 5834 -20271 -110192 -165480
6130 -165480 -151195 -6561 -26357 -74328 -20209 -54928 -112286 -23079 -33301 -54221 -18291
6119 -18291 -2904 23182 -58362 -48535 -39143 -73676 -140629 -180978 -159055 -156512 -155383 -95118 -4994
6106 -4994 -7316 -13240 -25250 11959 27767 10179 22815 -951 -21606 -71574 -121073 -95049
6094 -95049 -47881 -61657 -83886 -160612 -84498 -1668 42522 77022 37069 -22134 -49552 -53202
6082 -53202 -13191 20852 5339 -30637 9693 37591 50184 86671 156458 89277 47135 58635
6070 58635 78193 -11205 25120 -29235 -63279 -81874 -45784 -38081 -13584 -32281 -9560 31328
6058 31328 55226 59332 47527 12269 22431 3489 -55630 -70627 -69513 -68091 -69271 -144449 -170612
6045 -170612 -118340 -47039 -35344 7070 -1189 -61687 -109255 -93381 -44929 -79804 -88290 -141749
6033 -141749 -103618 29670 109192 117900 125035 88102 21369 -18425 -78127 -77698 -16492 13124
6021 13124 84246 7738 -14131 -938 26329 -19824 -6072 -40131 -88599 -48686 -35131 -78177
6009 -78177 -57908 -67355 -127761 -136667 -82749 -30168 -5944 -37156 -77437 2638 16975 -8474
5997 -8474 18314 30349 -16618 -4364 31880 -988 -51857 -129359 -147535 -40335 30222 3366
5985 3366 -59729 -95912 -34082 -41520 -6622 10606 -78755 -100482 9751 29285 -34008 60061
5973 60061 73444 89344 20640 -36522 -36596 -84096 -83930 -26099 -96857 -105619 -55447 44688 217190
5960 217190 242604 191933 98266 154597 232233 116075 85987 29067 21369 -56581 -99002 -10657
5948 -10657 27534 5325 -3379 15445 58918 19040 9148 16098 15634 -12136 -72129 -83283 -124837
5935 -124837 -121804 -78716 -101677 -162446 -156682 -72408 -138845 -172048 -162093 -165811 -139666 -126948
5923 -126948 -87171 -73873 -118144 -131250 -103480 -83023 -108537 -22157 -29292 -28518 49252 116270
5911 116270 109373 27549 -151702 -235728 -169076 -93890 -88523 -120265 -97190 -69716 -43113 -32214
5899 -32214 -930 68132 70775 59708 2828 -42801 13414 15236 984 -26806 -52724 653
5887 653 40132 -15553 -52797 -63218 -70512 34618 115266 143987 90965 53997 71057 -61046
5875 -61046 -91340 -53468 -54693 -124406 -196877 -226928 -170586 -67600 -43381 -54735 -47233 -15088
5863 -15088 -50387 -93848 -41182 30566 6687 -30592 -45948 -140954 -97763 57549 104583 158297
5851 158297 143501 76119 79703 99042 86890 97810 31913 -31890 -89454 -146029 -231191 -211530
5839 -211530 -93540 -27510 -27560 4583 41690 29886 -18319 34865 100596 35477 -22161 -120801
5827 -120801 -97032 -94411 -75706 -54645 -67569 17339 -26502 -114648 -127592 -98517 -76326 -12062
5815 -12062 -66688 -84379 30659 68130 107415 67406 54825 2150 -236 12047 11712 -31297
5803 -31297 -96837 15296 27396 26100 51086 8931 -6627 -36984 -63354 -142513 -123191 -110305
5791 -110305 -112180 -64213 -111466 -144380 -175083 -129164 38135 93362 -59436 -61459 -111669 -87598
5779 -87598 -27912 -65534 -102550 -135521 -139156 -110217 -69169 -39175 -33752 -22843 -92330 -71218
5767 -71218 -95991 -125183 -47858 -86612 -170615 -160471 -40250 69835 130361 66092 -12137
5756 -12137 -51543 -83919 -42517 -22353 -70351 -144217 -80809 -81622 -47707 41452 -53639 -108862
5744 -108862 -47810 -49077 -73596 -14857 -26054 -38372 -13967 -9258 -90229 -129711 -112932 -73595
5732 -73595 -62142 -56455 -16080 -23819 -104506 -114132 -109626 341 -8369 -23261 -11399 -37668 -3950
5719 -3950 -39075 -97878 -19380 -60454 -136749 -115217 -13628 41519 9165 -48244 -104503 -77236
5707 -77236 -44063 -101366 -190138 -191581 -76608 38951 41587 57234 39453 80049 59727 -68552
5695 -68552 -126475 -109374 -79922 -56572 -45218 -7207 102859 131583 124694 77681 80360 82690
5683 82690 79628 61113 49572 54897 16688 23501 22294 -6217 14707 104308 126805 67564 -8835
5670 -8835 28963 70963 71233 7316 2508 -44519 -66637 -42029 36325 58846 841 -86745 -107908
5657 -107908 -116168 -115344 -107296 -74904 -8284 13989 119077 114819 63014 89099 67622 105479
5645 105479 93284 74369 78538 92843 53903 47754 120164 78271 -3206 -17434 -79344 -63074
5633 -63074 -42842 -82672 -48965 -55615 -98757 -140171 -103391 -78170 -74596 -37351 -30709 45885
5621 45885 75920 22693 -61855 -11552 185894 257570 244537 279634 217369 125785 106889 161100
5609 161100 104363 100038 84971 77265 58304 -15192 -87441 -51197 -52383 -49736 10334 -34307
5597 -34307 44605 6173 -49315 31003 56510 30574 27499 -52901 -37538 10592 -28960 -102893
5585 -102893 -68014 -49813 -8249 55159 101176 62434 24038 -54305 -108730 -54206 9833 107130
5573 107130 125462 82336 19743 120269 87109 19230 21747 37661 -51397 -105280 -108881 -122809
5561 -122809 -86232 -43889 -30989 -64326 -98637 -91943 -58856 -20848 37853 1782 -51955 -113831
5549 -113831 -77052 18359 27056 -1883 -8193 10933 22894 16708 25351 71383 81208 10719 -23353
5536 -23353 -44258 -23606 -24581 -48244 -8834 56512 108623 100691 -40795 -36295 -32363 -88214 -3466
5523 -3466 -60081 -30339 4534 -62279 -104310 -88319 -72409 -93515 -155787 -148972 -113401 -114713
5511 -114713 -126054 -34852 19466 -52596 -79773 -42411 -70313 49336 34593 -10469 57706
5500 57706 167754 177941 134486 95684 56181 -36123 -97065 -145577 -115851 -81455 -86007 -38383
5488 -38383 -20615 -74123 -114897 -87473 -57881 -20149 -105803 -86542 -30664 5715 45695 23390
5476 23390 60603 120399 133497 109664 65878 25637 29849 88893 11281 7662 67558 90873
5464 90873 62673 10164 -72468 -151738 -144523 -94981 -24550 18411 -49569 -81715 -100221 -85431
5452 -85431 -42268 -81155 -64813 -92048 -76882 -40797 60643 106735 26605 -62136 -46267 -22874
5440 -22874 -65108 -114268 42052 53557 -87798 -131713 -51918 56533 1050 -58958 -107402
5429 -107402 -70382 8069 33885 15621 -22930 56393 123533 81643 94772 33601 38711 61892
5417 61892 68772 70661 30282 -36426 12463 79707 139041 68511 -8610 87514 91654 36287
5405 36287 39097 14928 -26006 -135486 -106708 -80594 -91979 -94344 -58512 -16572 5550 -3481
5393 -3481 -698 35232 74124 102586 121004 73347 18736 -28539 -54843 -68010 -67217 -75130 8935
5380 8935 30032 -3339 15363 16690 -87916 -66226 -3123 19095 26479 17459 -48861 -90476
5368 -90476 -20903 64124 96278 108903 108472 56338 6784 -36014 -6817 88391 90618 79851
5356 79851 39871 35478 -8582 -26518 -2431 21621 65447 103085 21889 1432 26361 -58625
5344 -58625 -111513 -66418 -43845 -47229 -65475 -76082 -71734 -55318 -28844 76132 167007 145877
5332 145877 76449 78386 79618 28922 5710 -11266 -74198 -100106 42072 136745 123075 115704
5320 115704 -1643 -35618 -11137 26975 128302 110381 48349 14776 44384 178295 100013
5309 100013 68345 22386 -28296 -94804 -105288 -176708 -172586 -139430 -93463 5855 96795 142941
5297 142941 101221 72173 71550 34723 -40704 54118 95481 16982 -3377 48916 111739 166876
5285 166876 124306 -26382 -55796 -20796 -9061 2680 -34995 -7115 -21345 -32844 -31411 -33818
5273 -33818 -625 -7889 58012 184876 264628 145875 35135 -5065 43320 78729 21556
5262 21556 -51188 -8627 -8306 68964 98085 21386 3109 -12487 41517 18514 -6708 37219
5250 37219 52933 -1248 -53638 -82457 -59226 7252 -17413 -6296 -45535 -64410 -72117 -83397
5238 -83397 -36409 44644 63484 -40188 -32173 -129237 -184386 -145043 -114621 -102369 -80023 -39619
5226 -39619 -42227 -81062 -33809 35229 45144 80177 119565 89864 28827 46414 32882 -48051
5214 -48051 -94513 -102396 -54938 9688 22244 65572 89632 55964 14285 67665 65878 585
5202 585 -93543 -74696 -82900 -130980 -131037 -55393 60036 45742 49755 90775 129016 46656 -93163
5189 -93163 -105048 -68228 23410 -10568 -51145 -28141 47342 44041 -19906 -32978 10529 80219
5177 80219 101890 73446 59525 -27879 -47933 13753 32374 -24368 -51504 -64523 -83275 -51290
5165 -51290 -33144 -90211 -82265 -16888 56378 80377 43843 28793 20864 -44725 -11542 115086
5153 115086 139102 50801 8929 13168 -36784 -81370 -68793 36833 77803 74092 33491 53326
5141 53326 73814 16027 -76576 -34479 -3915 -11233 -8993 34192 32534 24076 -4107 -30562 40645
5128 40645 69222 56375 -90392 -78987 -14002 -69825 -116174 -95995 -120003 -168625 -197969 -166196
5116 -166196 -63111 -12990 -26075 44305 143266 118501 -17672 -13308 138706 236327 143026
5105 143026 96969 10052 -95876 -56485 -32973 24619 31928 -42994 35302 83082 -59214
5094 -59214 -30824 11815 53895 82301 14784 -76924 -66115 -62636 -49565 19817 3830 60262
5082 60262 120875 144935 147400 131848 39315 -23788 -101637 -142840 -21296 94473 72281 -19018
5070 -19018 -69986 17807 21498 -11733 -71168 -75832 -30566 -23420 -60683 -33756 41626 66493
5058 66493 -13682 -61954 -3825 43624 76624 14669 18591 22187 -39807 -41759 65368 56287
5046 56287 69710 6840 -43468 -69943 -5621 13920 -8920 -53194 -77449 -95163 -129826 -102173
5034 -102173 -98070 -107344 -60540 -61857 -108691 -104853 -40714 -47745 -102768 -132835 -137221 -172831 -135185
5021 -135185 -150081 -98227 10166 39233 3306 -31046 -3961 60517 147442 153565 14950
5010 14950 -38883 -53176 -119133 -121670 -145553 -158728 -137162 -74624 -18795 -59231 -126931 -150150
4998 -150150 -39258 6375 29959 31682 -1964 47734 65793 50688 8731 -30530 5547 -19561
4986 -19561 -25447 -47463 -128810 -81354 -74797 -109008 -53683 -6529 61853 72289 33382 -57565
4974 -57565 -109587 -114441 -66817 -70658 -14073 -1551 -36793 -17019 -14174 -29698 -62765 -115841
4962 -115841 3316 17342 -7408 -18373 -15197 -23058 -2057 -3467 -71339 -46739 -13980 -38125
4950 -38125 -90635 -141575 -116653 -78195 -62036 -58258 -46938 42214 100239 12467 -24533 -109077
4938 -109077 -178113 -181315 -120776 -47584 -27933 -40556 -90633 -154747 -146603 -138751 -67955 -49614
4926 -49614 -57188 -132870 -135939 -96966 -54212 -3547 -884 -29694 -38967 -81334 -109202 -36720 34911
4913 34911 -41248 -95373 -80918 -8555 33172 24403 -15887 -19108 22505 132801 34868 48076
4901 48076 30614 -54327 -20971 35602 -39937 -7626 17217 -99392 -110303 -24675 80858
4890 80858 41879 29014 2560 46971 8199 -35027 -94531 -11918 103596 101713 32577 -38456
4878 -38456 -64843 -127599 -141038 -33856 -9365 46566 82575 79389 111741 75286 55877 15198
4866 15198 -41212 -119871 -69768 -13474 -29106 -91507 -36874 75791 -6739 -130826 -145295
4855 -145295 -69462 24076 59416 143038 192014 246225 191453 124705 147845 56385 -40085 -101003
4843 -101003 -67379 -30449 -40541 14543 152 29694 93685 77568 -6330 53787 99284 21028
4831 21028 -5577 9846 38932 40412 33530 -81973 -46106 -24365 -44049 -8416 8819 -14977
4819 -14977 11982 77067 86392 66917 53295 -18281 -44595 -9856 101164 66107 33543 -58756
4807 -58756 -182898 -141485 -109649 -41624 -13427 -124842 -119635 -64575 -80366 -168349 -138353 -91359
4795 -91359 -102446 -74749 -68104 -73010 2260 -3906 -90739 -163597 -114972 -81011 -126093 -114726
4783 -114726 -118543 -93405 -112911 -132518 -124187 -45042 -997 19285 8208 53012 -32852 -36340
4771 -36340 -121226 -195794 -211342 -68004 -3066 13338 -11294 55900 70641 32182 -11588 -16464
4759 -16464 -23480 -47373 -45032 -14756 -46640 -119009 -129875 -96957 -19383 36339 80725 75682
4747 75682 -6176 21859 38164 -9611 -7763 -45555 78722 190676 108971 86783 148904 55932
4735 55932 38943 62019 101607 105847 174468 156150 101197 71452 11905 -8992 -46521 -87345
4723 -87345 -149401 -122954 -58010 25616 142304 141550 107395 153903 161534 175418 175476 207814 142680
4710 142680 109422 59408 -17051 -11665 -668 -31862 -50559 -34892 -42129 -6644 9115 -10970
4698 -10970 -6052 -4091 56666 100328 73504 55692 68401 102671 96022 73246 71241 17569 -20643
4685 -20643 -30816 4499 -36886 -33528 -25236 17858 -63731 -89600 -123044 -73414 -61439 -25907
4673 -25907 78251 78774 67927 2027 -42644 -1245 638 11532 54620 21079 48900 42411
4661 42411 24194 -6746 87786 -14498 -168189 -109396 -110770 -73946 791 27645 80262 125358
4649 125358 105852 52004 30526 44274 66095 120564 214744 152322 157486 58916 61341 68799
4637 68799 59346 43152 21824 46839 40805 -22971 -92511 -72921 -9069 48757 83695 52038
4625 52038 95015 50195 22877 -20870 -73392 -91021 -121618 -159902 -106590 -75815 -7268 -6001
4613 -6001 -65379 -57702 -33066 -73920 -53596 -24333 49003 98569 125003 60344 58678 115329
4601 115329 145159 181001 232098 172133 142541 64477 49949 82188 50379 -39039 -133760 -152520
4589 -152520 -177353 -106701 -20184 48207 100832 95512 -46618 -57424 -42518 -77901 -76310 17631
4577 17631 72379 164089 99572 37174 99658 129492 102023 88889 113122 70652 35841 75349
4565 75349 16829 -17802 59274 51567 44347 40910 3393 -72100 -63990 -30046 -65861 -65980 -102591
4552 -102591 -58798 -84908 -97278 -70298 -18296 2825 38376 65485 90353 63650 11476 -13198
4540 -13198 -31008 -102093 -208122 -145091 -21054 -53914 -98221 -89114 -64133 -4286 -61462 -111776
4528 -111776 -71014 -84925 -94081 -56190 -21877 -65038 -61696 -17850 26649 26905 74327 47852
4516 47852 46756 44075 19362 5835 7062 35072 42121 175284 128291 23975 6507 -23205
4504 -23205 -120912 -68314 -27266 -7057 -91411 -191088 -130999 -59049 -66435 37076 82460 24111
4492 24111 40333 82918 58884 28813 -15429 -24677 -12304 -52913 -109701 -44752 -3904 -23850
$$ [...]
##END NTUPLES=NMR SPECTRUM
##END=
