##TITLE=Analysis number 327184
Compound Code mo 00932
Project Code adrs
Chemist Name creative chem
##JCAMPDX= 6.0         $$ Bruker NMR JCAMP-DX V2.0
##DATA TYPE= NMR SPECTRUM
##DATA CLASS= NTUPLES
##ORIGIN= Bruker BioSpin GmbH
##OWNER= nmr
$$ XWIN-NMR		Version 3.5
$$ Wed Mar 14 09:51:29 2007 GMT Standard Time (UT+0h)  MAYBRIDGE\nmr@NMR_250MHZ
##.OBSERVE FREQUENCY= 250.131544655141
##.OBSERVE NUCLEUS= ^1H
##.ACQUISITION MODE= SIMULTANEOUS (DQD)
##.ACQUISITION SCHEME= undefined
##.AVERAGES= 16
##.DIGITISER RES= 18
##SPECTROMETER/DATA SYSTEM= dpx250
##.PULSE SEQUENCE= zg30
##.SOLVENT NAME= CDCl3
##.SHIFT REFERENCE= (INTERNAL, CDCl3, 0, 16.522)
##AUDIT TRAIL= $$ (NUMBER, WHEN, WHO, WHERE, WHAT)
$$ ##TITLE= Audit trail, XWIN-NMR		Version 3.5
$$ ##JCAMPDX= 5.01
$$ ##ORIGIN= Bruker BioSpin GmbH
$$ ##OWNER= nmr
$$ C:\u/data/dgb/nmr/ADRS/860/pdata/1/auditp.txt
$$ ##AUDIT TRAIL=  $$ (NUMBER, WHEN, WHO, WHERE, WHAT)
(   1,<2007-03-14 09:51:09.78 +000>,<MAYBRIDGE\nmr>,<NMR_250MHZ>,
      <created by zg, POWCHK disabled, PULCHK disabled
       configuration hash MD5:
       49 4B E0 1D 92 C2 6B 37 9F E6 65 BC 52 41 86 1D
       data hash MD5: 64K
       45 E0 05 2F FD 43 89 51 AD 33 FE BF A1 C7 22 EB>)
(   2,<2007-03-14 09:51:22.31 +000>,<MAYBRIDGE\nmr>,<NMR_250MHZ>,
      <Start of raw data processing
       ef LB = 0.3 FT_mod = 6 PKNL = 1 SI = 32K 
       data hash MD5: 32K
       47 6C 2D 73 66 23 D5 9D 1E 5C 21 30 D1 D5 3B 7A>)
(   3,<2007-03-14 09:51:24.06 +000>,<MAYBRIDGE\nmr>,<NMR_250MHZ>,
      <apk 
       data hash MD5: 32K
       02 F6 63 DC 39 43 B7 37 23 9A 8C 52 C1 A3 6A 5B>)
(   4,<2007-03-14 09:51:24.87 +000>,<MAYBRIDGE\nmr>,<NMR_250MHZ>,
      <abs ABSG = 5 
       data hash MD5: 32K
       5C D1 E0 C6 FA E1 1E 5B 9E 13 64 E4 7A A7 C8 4B>)
$$ ##END=
$$ 
$$ hash MD5
$$ 7E 06 D0 CF 65 77 47 EE 6E 48 4A A8 C8 F1 89 9F
##$RELAX= 
##$RELAX= 
##$RELAX= 
##$RELAX= 
##$RELAX= 
##$RELAX= 
##$RELAX= 
$$ Bruker specific parameters
$$ --------------------------
##$DU= <C:\u>
##$EXPNO= 860
##$NAME= <ADRS>
##$PROCNO= 1
##$TYPE= <nmr>
##$USER= <dgb>
##$AMP= (0..31)
100 100 100 100 100 100 100 100 100 100 100 100 100 100 100 100 100 100 
100 100 100 100 100 100 100 100 100 100 100 100 100 100 
##$AQSEQ= 0
##$AQ_mod= 3
##$AUNM= <au_zg>
##$AUTOPOS= <16 >
##$BF1= 250.13
##$BF2= 250.13
##$BF3= 250.13
##$BF4= 250.13
##$BF5= 500.13
##$BF6= 500.13
##$BF7= 500.13
##$BF8= 500.13
##$BYTORDA= 1
##$CFDGTYP= 0
##$CFRGTYP= 5
##$CHEMSTR= <none>
##$CNST= (0..31)
1 1 145 1 1 1 1 1 1 1 1 1 1 1 1 1 1 1 1 1 1 1 1 1 1 1 1 1 1 1 1 1 
##$CPDPRG= <>
##$CPDPRG1= <>
##$CPDPRG2= <>
##$CPDPRG3= <>
##$CPDPRG4= <mlev>
##$CPDPRG5= <mlev>
##$CPDPRG6= <mlev>
##$CPDPRG7= <mlev>
##$CPDPRG8= <mlev>
##$CPDPRGB= <>
##$CPDPRGT= <>
##$D= (0..31)
0 1 0 0 0 0 0 0 0 0.06 0 0 0 0 0 0 0.0002 0 0 0 0 0 0 0 0 0 0 0 0 0 0 
0 
##$DATE= 1173865868
##$DBL= (0..7)
120 120 120 120 120 120 120 120 
##$DBP= (0..7)
150 150 150 150 150 150 150 150 
##$DBP07= 0
##$DBPNAM0= <>
##$DBPNAM1= <>
##$DBPNAM2= <>
$$ [...]
##$SUBNAM7= <"">
##$SUBNAM8= <"">
##$SUBNAM9= <"">
##$SW= 20.6930455092707
##$SWIBOX= (0..15)
0 0 3 0 0 0 0 0 0 0 0 0 0 0 0 0 
##$SW_h= 5175.983436853
##$TD= 65536
##$TD0= 1
##$TE= 683.16
##$TE2= 300
##$TE3= 300
##$TEG= 300
##$TL= (0..7)
0 120 120 120 120 120 120 120 
##$TP= (0..7)
150 150 150 150 150 150 150 150 
##$TP07= 0
##$TPNAME0= <>
##$TPNAME1= <>
##$TPNAME2= <>
##$TPNAME3= <>
##$TPNAME4= <>
##$TPNAME5= <>
##$TPNAME6= <>
##$TPNAME7= <>
##$TPOAL= (0..7)
0.5 0.5 0.5 0.5 0.5 0.5 0.5 0.5 
##$TPOFFS= (0..7)
0 0 0 0 0 0 0 0 
##$TUNHIN= 0
##$TUNHOUT= 0
##$TUNXOUT= 0
##$USERA1= <user>
##$USERA2= <user>
##$USERA3= <user>
##$USERA4= <user>
##$USERA5= <user>
##$V9= 5
##$VALIST= <valist>
##$VCLIST= <CCCCCCCCCCCCCCC>
##$VD= 0
##$VDLIST= <DDDDDDDDDDDDDDD>
##$VPLIST= <PPPPPPPPPPPPPPP>
##$VTLIST= <TTTTTTTTTTTTTTT>
##$WBST= 1024
##$WBSW= 4
##$XGAIN= (0..3)
0 0 0 0 
##$XL= 0
##$YL= 0
##$YMAX_a= 404450
##$YMIN_a= -455551
##$ZGOPTNS= <>
##$ZL1= 120
##$ZL2= 120
##$ZL3= 120
##$ZL4= 120
##$ABSF1= 16.522
##$ABSF2= -4.171173
##$ABSG= 5
##$ABSL= 3
##$ALPHA= 0
##$AQORDER= 0
##$ASSFAC= 0
##$ASSFACI= 0
##$ASSFACX= 0
##$ASSWID= 0
##$AUNMP= <proc_1d>
##$AZFE= 0.1
##$AZFW= 0.1
##$BCFW= 0
##$BC_mod= 0
##$BYTORDP= 0
##$COROFFS= 0
##$CY= 12.5
##$DATMOD= 1
##$DC= 0
##$DFILT= <>
##$DTYPP= 0
##$F1P= 14.0000005364418
##$F2P= -0.99999901652339
##$FCOR= 0.5
##$FTSIZE= 32768
##$FT_mod= 6
##$GAMMA= 0
##$GB= 0
##$INTBC= 1
##$INTSCL= 1
##$ISEN= 128
##$LB= 0.3
##$LEV0= 0
##$LPBIN= 0
##$MAXI= 10000
##$MC2= 0
##$MEAN= 0
##$ME_mod= 0
##$MI= 0
##$NCOEF= 0
##$NC_proc= -3
##$NLEV= 6
##$NOISF1= 0
##$NOISF2= 0
##$NSP= 0
##$NTH_PI= 0
##$NZP= 0
##$OFFSET= 16.522
##$PC= 1
##$PHC0= 229.1412
##$PHC1= 10.28381
##$PH_mod= 1
##$PKNL= yes
##$PPARMOD= 0
##$PSCAL= 4
##$PSIGN= 0
##$REVERSE= no
##$SF= 250.13
##$SI= 32768
##$SIGF1= 0
##$SIGF2= 0
##$SINO= 400
##$SIOLD= 32768
##$SREGLST= <1H.CDCl3>
##$SSB= 0
##$STSI= 32768
##$STSR= 0
##$SW_p= 5175.98343685301
##$SYMM= 0
##$S_DEV= 0
##$TDeff= 65536
##$TDoff= 0
##$TI= <Analysis number 999999
Compound Code 99
Book Reference 9
Project Code 9>
##$TILT= no
##$TM1= 0
##$TM2= 0
##$TOPLEV= 0
##$USERP1= <user>
##$USERP2= <user>
##$USERP3= <user>
##$USERP4= <user>
##$USERP5= <user>
##$WDW= 1
##$XDIM= 32768
##$YMAX_p= 377644553
##$YMIN_p= -114132
$$ End of Bruker specific parameters
$$ ---------------------------------
##NTUPLES= NMR SPECTRUM
##VAR_NAME=  FREQUENCY,     SPECTRUM/REAL,   SPECTRUM/IMAG
##SYMBOL=    X,             R,               I
##VAR_TYPE=  INDEPENDENT,   DEPENDENT,       DEPENDENT
##VAR_FORM=  AFFN,          ASDF,            ASDF
##VAR_DIM=   32768,         32768,           32768
##UNITS=     HZ,            ARBITRARY UNITS, ARBITRARY UNITS
##FACTOR=    0.157963299565203, 1,           1
##FIRST=     4132.6476996994, 0,             0
##LAST=      -1043.33573715361, 0,           0
##MIN=       -1043.33573715361, -114132,     0
##MAX=       4132.6476996994, 377644553,     0
$$ Real data points
##PAGE= N=1
##DATA TABLE= (X++(R..R)), XYDATA
$$ [...]
$$ plain form
20203 -20424 -36499 -25054 17511 57144 46525 9273 9524 31691 44685 18177 23795 22316
20191 22316 -21543 -51855 -11867 12821 -9327 -47960 -52426 -45581 -2068 29454 23688 5261
20179 5261 -6490 14143 16514 -2099 1319 -17659 -5204 5965 2045 -9478 -19927 -24371 -20183
20166 -20183 -2574 3963 4483 22226 31003 23586 35343 46224 31864 20688 22716 -4921 -13026
20153 -13026 -48729 -37592 7179 47394 66533 49615 18321 1607 -9535 -6037 -10734 8378
20141 8378 30904 46639 40498 38500 33633 15750 -10967 -13941 -1844 5761 7290 18099 17068
20128 17068 27080 73358 83906 32076 17948 29850 36785 41599 28248 38671 44253 30701
20116 30701 33920 41143 44865 43622 36067 31914 1162 -28170 -17079 16892 21302 29821 12682
$$ packed form
20203b0424j6075J1445M2565L9633j0619l7252K51K2167J2994k6508N618j479
20191B2316m3859l0312L9988K4688k2148l8633m466O845M3513L1522n766j8427
20179E261j1751K0633K371j8613L418j8978J2455J1169l920j1523j0449m444M188
20166b0183J7609O537N20J7743Q777p417J1757J0881j4360j1176K028k7637q105
20153a3026l5703J1137M4771M0215J9139j6918l1294j6714j1142L498m697J9112
20141H378K2526J5735o141j998m867j7883k6717k974J2097P605J529J0809j031
20128A7068J0012M6278J0548n1830j4128J1902O935M814j3351J0423N582j3552
20116C0701L219P223L722j243p555m153l0752k9332J1091L3971M410Q519j7139
$$ plain form
20103 12682 14461 1802 -7746 19957 21965 -12979 14897 27266 13866 1241 9231 -14138
20091 -14138 -7714 -10025 -6548 -529 17987 26625 43833 19227 15430 37866 10321 -25123 -4850
20078 -4850 17681 27993 12175 13357 -9069 -22799 -4140 25727 42491 34613 45705 11692
20066 11692 8726 7681 -6741 -31204 -38123 -17295 -9118 9093 29285 27546 36252 5631 10390
20053 10390 16016 -17248 -23575 -27945 -3762 -5498 -10244 3475 -6100 -26123 -28400 -2770 -22720
20040 -22720 -19855 -21451 -41790 -30094 -31214 -21763 18178 25479 23999 27113 37202 33744 10025
20027 10025 -1120 -7605 2862 239 22329 39680 42223 23880 -16245 -13968 11791 15523 16159
20014 16159 20940 23473 37878 34518 14201 -4650 10391 33770 30574 -2732 -122 5960 14229
$$ packed form
20103A2682J779j2659r548K7703K008l4944K7876J2369j3400j2625P990k3369
20091a4138O424k311L477O019J8516Q638J7208k4606l797K2436k7545l5444K0273
20078d850K2531J0312j5818J182k2426j3730J8659K9867J6764p878J1092l4013
20066A1692k966j045j4422k4463o919K0828Q177J8211K0192j739Q706l0621M759
20053A0390N626l3264o327m370K4183j736m746J3719r575k0023k277K5630j9950
20040b2720K865j596k0339J1696j120R451L9941P301j480L114J0089l458k3719
20027A0025j1145o485J0467k623K2090J7351K543j8343m0125K277K5759L732O36
20014A6159M781K533J4405l360k0317j8851J5041K3379l196l3306K610O082Q269
$$ plain form
20001 14229 5509 -6782 8354 34127 41190 17063 21136 17932 10800 17367 27688 17037 -19086
19988 -19086 -23007 -2566 30772 23450 27153 50506 25446 -10709 -3877 3724 630 -10560 -4927
19975 -4927 12058 1706 2709 -1747 7186 15011 40864 35546 3500 -15443 -33199 -29666 -10894
19962 -10894 -3296 -3770 -4337 19720 30648 24603 -2719 7325 46326 39518 13648 18683 24308
19949 24308 30748 44261 43863 40119 25823 3046 7236 9160 9533 31642 20139 10073 33066
19936 33066 37278 17716 -12682 -4602 7258 9604 6295 35077 35522 13265 9777 9452 -15373
19923 -15373 -40964 -32199 -37077 -42699 -46062 -15344 18648 27134 45373 48543 28829 10008 9082
19910 9082 16651 18 3753 20133 13109 -17205 -2851 13701 12222 18530 31347 55681 50929
$$ packed form
20001A4229q720j2291J5136K5773P063k4127M073l204p132O567J0321j0651l6123
19988a9086l921K0441L3338p322L703K3353k5060l6155O832P601l094j1190N633
19975d927J6985j0352J003m456Q933P825K5853n318l2046j8943j7756L533J8772
19962a0894P598m74n67K4057J0928o045k7322J0044L9001o808k5870N035N625
19949B4308O440J3513l98l744j4296k2777M190J924L73K2109j1503j0066K2993
19936C3066M212j9562l0398Q080J1860K346l309K8782M45k2257l488l25k4825
19923a5373k5591Q765m878n622l363L0718L3992Q486J8239L170j9714j8821r26
19910I082P569j6633L735J6380p024l0314J4354J6552j479O308J2817K4334m752
$$ plain form
19897 50929 56009 41232 33112 38707 26772 12128 12865 35210 18915 24544 39925 29538 27774
19884 27774 3641 18128 56596 63782 47539 46438 48543 30232 12269 -4998 2701 17614
19872 17614 40980 25110 1877 12615 -3686 -31 3950 78 13124 47671 45470 31491
19860 31491 21988 17472 17135 16423 17346 4740 27105 43912 44557 41530 28022 58176 70529 59122
19846 59122 44226 54278 29784 21531 42720 75047 36631 11717 14658 28304 65379 72409
19834 72409 61055 52794 36033 26468 18257 33795 34054 56295 67369 40067 35923 44525 54198
19821 54198 73159 74784 35118 7877 -3766 28975 85799 85187 74619 64686 31605 19772
19809 19772 36685 45431 37730 32431 30645 17919 30419 58277 65133 33181 -3754 -6617 21779
$$ packed form
19897E0929N080j4777q120N595j1935j4644P37K2345j6295N629J5381j0387j764
19884B7774k4133J4487L8468P186j6243j101K105j8311j7963j7267P699J4913
19872A7614K3366j5870k3233J0738j6301L655L981l872J3046L4547k201j3979
19860C1491r503m516l37p12R23j2606K2365J6807O45l027j3508L0154J2353j1407
19846E9122j4896J0052k4494q253K1189L2327l8416k4914K941J3646L7075P030
19834G2409j1354q261j6761r565q211J5538K59K2241J1074k7302m144Q602R673
19821E4198J8961J625l9666k7241j1643L2741N6824o12j0568r933l3081j1833
19809A9772J6913Q746p701n299j786j2726J2500K7858O856l1952l6935k863K8396
$$ plain form
19796 21779 36853 26422 38771 20901 -12120 -25571 -421 15447 14154 20559 32873 46166
19784 46166 31338 22565 31671 11735 1393 3288 19905 29229 15062 9750 -11675 10784 25768
19771 25768 23825 28559 17760 45828 70009 67120 66323 43240 14302 20429 31469 51543 47371
19758 47371 54920 91826 65533 28983 27549 18387 -11058 6520 12352 8225 37810 47990 17748
19745 17748 -4604 9852 16834 8733 8240 1336 -3164 28553 19896 25472 50674 53846 35556
19732 35556 22102 9689 -6277 -6926 5983 20718 42567 39647 30718 28425 15420 2337 7281
19719 7281 31512 33533 52642 80379 99553 80975 47655 30953 18694 24502 32109 22184 22472
19706 22472 37082 49303 52357 46272 45314 40501 19238 4519 927 1316 45185 65204 40444
$$ packed form
19796B1779J5074j0431J2349j7870l3021j3451K5150J5868j293O405J2314J3293
19784D6166j4828q773R106j9936j0342J895J6617R324j4167n312k1425K2459J4984
19771B5768j943M734j0799K8068K4181k889p97k3083k8938O127J1040K0074m172
19758D7371P549L6906k6293l6550j434r162k9445J7578N832m127K9585J0180l0242
19745A7748k2352J4456O982q101m93o904m500L1717q657N576K5202L172j8290
19732C5556j3454j2413j5966o49J2909J4735K1849k920q929k293j3005j3083M944
19719G281K4231K021J9109K7737J9174j8578l3320j6702j2259N808P607r925K88
19706B2472J4610J2221L054o085r58m813k1263j4719l592L89M3869K0019k4760
$$ plain form
19693 40444 34695 60033 45973 13958 -2273 20350 32533 45100 69742 80762 51082 23041
19681 23041 21942 17305 27140 37622 33732 41026 51876 62183 25442 34984 41277 20775 2739
19668 2739 28070 52348 50609 30194 23949 23877 42301 44927 8848 32293 34323 43871 46389 53980
19654 53980 44539 38341 -3754 11078 -18236 -36861 -33101 -28215 -12996 -17248 17415 28530 34714
19641 34714 42828 42118 50910 43471 57313 71937 85734 105178 109346 115600 100159 104452 78294
19628 78294 39782 37943 26301 25692 41508 50118 49949 28340 40411 74495 39682 -4505 -522
19615 -522 6644 -2868 1879 10415 48298 76334 62876 42985 10989 3541 16642 6341 1561
19602 1561 10404 12963 -930 609 40317 64148 23919 9512 14401 65077 50603 8680 18973
$$ packed form
19693D0444n749K5338j4060l2015j6231K2623J2183J2567K4642J1020k9680k8041
19681B3041j099m637R835J0482l890P294J0850J0307l6741R542O293k0502j8036
19668B739K5331K4278j739k0415o245p2J8424K626l6079K3445K030R548K518P591
19654E3980r441o198m2095J4832k9314j8625L760M886J5219m252L4663J1115O184
19641C4714Q114p10Q792p439J3842J4624J3797J9444M168O254j5441M293k6158
19628G8294l8512j839j1642o09J5816Q610j69k1609J2071L4084l4813m4187L983
19615e22P166r512M747Q536L7883K8036j3458j9891l1996p448J3101j0301m780
19602A561Q843K559j3893J539L9708K3831m0229j4407M889N0676j4474m1923J0293
$$ plain form
19589 18973 33358 8039 -2954 8533 16858 -5635 -4367 26844 34788 14467 29189 33611
19577 33611 12636 8208 19854 36971 60447 68301 39268 2611 18614 3565 -13848 -9087
19565 -9087 6437 33722 44916 49596 35894 10123 2078 12314 50873 65903 56416 44056
19553 44056 52258 40889 23569 23070 54395 81915 113421 69787 56168 78732 55229 47285
19541 47285 72737 68150 59929 89320 88336 58667 41357 34375 50782 41830 35502 29383 29992 30002
19527 30002 36023 12714 -7015 -4379 -12615 12572 51550 82287 105337 69023 33671 30850
19515 30850 36745 45010 42700 17727 6572 -12858 -19624 -10858 -9500 -12155 -14200 -11834 12782
19502 12782 16615 37263 68490 80714 89973 51632 40876 55730 41087 37336 43310 16839
$$ packed form
19589A8973J4385k5319j0993J1487Q325k2493J268L1211P944k0321J4722M422
19577C3611k0975m428J1646J7117K3476P854k9033l6657J6003j5049j7413M761
19565i087J5524K7285J1194M680j3702k5771q045J0236L8559J5030r487j2360
19553D4056Q202j1369j7320m99L1325K7520L1506m3634j3619K2564k3503p944
19541D7285K5452m587q221K9391r84k9669j7310o982J6407q952o328o119O09J0
19527C0002O021k3309j9729K636q236K5187L8978L0737K3050l6314l5352k821
19515C0850N895Q265k310k4973j1155j9430o766Q766J358k655k045K366K4616
19502A2782L833K0648L1227J2224R259l8341j0756J4854j4643l751N974k6471
$$ plain form
19490 16839 43002 60980 89832 91061 106423 113309 80080 44361 27525 35576 40374 49784 58380
19477 58380 49509 42974 46322 59850 70696 71425 54710 24422 74 -134 33870 59160 44835
19464 44835 56933 86854 89383 59906 72909 58696 55650 86281 129125 186659 193002 203091
19452 203091 193831 212029 239316 233967 223998 211189 225668 199393 202118 198923 218478 248503
19440 248503 231919 206879 212026 219288 204674 222502 207401 204183 202008 185942 160776 139708
19428 139708 138987 165561 211574 217047 196746 181385 199963 204457 196585 213018 260943 266054 278508
19415 278508 281688 307237 330509 367779 389852 425018 435474 488905 532302 546225 544047 561084
19403 561084 617431 646950 653670 647523 646602 653846 629132 621489 651622 617663 590293 566075 534619
$$ packed form
19490A6839K6163J7978K8852J229J5362O886l3229l5719j6836Q051M798R410Q596
19477E8380q871o535L348J3528J0846P29j6715l0288k4348k08L4004K5290j4325
19464D4835J2098K9921K529k9477J3003j4213l046L0631M2844N7534O343J0089
19452B03091r260J8198K7287n349r969j2809J4479k6275K725l195J9555L0025
19440B48503j6584k5040N147P262j4614J7828j5101l218k175j6066k5166k1068
19428A39708p21K6574M6013N473k0301j5361J8578M494p872J6433M7925N111J2454
19415B78508L180K5549K3272L7270K2073L5166J0456N3431M3397J3923k178J7037
19403E61084N6347K9519O720o147r21P244k4714p643L0133l3959k7370k4218l1456
$$ plain form
19390 534619 515359 480451 398889 366563 371791 343304 304320 260464 243128 221162 162740 148533
19378 148533 156459 170079 153416 138734 134332 132673 137371 113966 79635 76546 94884 83558
19366 83558 91310 69748 84226 109920 110664 101564 102242 92956 95587 101674 100570 111830 152296 175728
19352 175728 162097 180422 194405 179391 194540 218296 191584 211275 211884 246025 278173 294940
19340 294940 289665 264056 256224 248387 230125 239056 238676 239137 223728 215344 210875 167186 128199
19327 128199 109052 104026 83580 95805 130735 152711 119855 108311 107436 129628 137345 158249
19315 158249 154757 172581 176644 171674 168559 191666 219134 215797 217674 210410 197149 227721 249019
19302 249019 243963 261244 300840 320620 316385 300173 320221 353549 372540 372272 372361 354599 292280
$$ packed form
19390E34619j9260l4908q1562l2326N228k8487l8984m3856j7336k1966n8422j4207
19378A48533P926J3620j6663j4682m402j659M698k3405l4331l089J8338j1326
19366H3558P752k1562J4478K5694P44r100O78r286K631O087j104J1260M0466K3432
19352A75728j3631J8325J3983j5014J5149K3756k6712J9691O09L4141L2148J6767
19340B94940n275k5609p832p837j8262Q931l80M61j5409q384m469m3689l8987
19327A28199j9147n026k0446J2225L4930K1976l2856j1544q75K2192P717K0904
19315A58249l492J7824M063m970l115K3107K7468l337J877p264j3261L0572K1298
19302B49019n056J7281L9596J9780m235j6212K0048L3328J8991k68Q9j7762o2319
$$ plain form
19289 292280 277371 275305 274253 262033 253697 248072 232071 220564 209628 176777 170858 152492
19277 152492 151206 148905 161041 164979 161657 136412 142889 157705 151876 121995 120148 79765 81974
19264 81974 94231 67202 69865 65345 98482 127402 125173 112847 124235 123878 126835 160815 163973
19251 163973 166388 141597 139942 171658 153703 164609 183444 185763 215522 229572 208822 183633
19239 183633 165704 176749 180452 166681 139361 115403 114106 95071 109403 119757 124365 108265
19227 108265 95570 117054 120344 119408 114944 119107 120259 146789 134145 137284 132468 133685 179712
19214 179712 177531 151405 129830 103106 148107 177831 206325 228425 236324 249824 256207 274580
19202 274580 295831 327686 339430 332668 372610 405476 424469 435966 424510 405871 403846 404556
$$ packed form
19289B92280j4909k066j052j2220q336n625j6001j1507j0936l2851n919j8366
19277A52492j286k301J2136L938l322k5245O477J4816n829k9881j847m0383K209
19264H1974J2257k7029K663m520L3137K8920k229j2326J1388l57K957L3980L158
19251A63973K415k4791j655L1716j7955J0906J8835K319K9759J4050k0750k5189
19239A83633j7929J1045L703j3771k7320k3958j297j9035J4332J0354M608j6100
19227A08265j2695K1484L290r36m464M163J152K6530j2644L139m816J217M6027
19214A79712k181k6126k1575k6724M5001K9724K8494K2100P899J3500O383J8373
19202B74580K1251L1855J1744o762L9942L2866J8993J1497j1456j8639k025P10
$$ plain form
19190 404556 378667 338096 324497 296591 264316 246714 239133 232650 238203 214471 160760 151812
19178 151812 166309 173992 150636 149772 134404 141142 156087 133391 122422 139860 159561 195783
19166 195783 179362 143994 168900 193243 178919 167707 136814 137297 147288 154250 150354 197180
19154 197180 220892 214971 213263 233076 234662 245804 270490 302646 340204 358030 388897 423799
19142 423799 429884 429974 422834 390746 328203 298447 296597 285428 266808 273041 268661 273874 283107
19129 283107 264299 226835 239748 225926 175637 136312 118017 146744 174773 155539 139765
19118 139765 155024 174187 164157 155613 150234 157951 184080 201394 223871 225188 194152 173313
19106 173313 165633 175770 170465 188391 169682 184900 182483 186447 193995 201189 229266 232727 221111
$$ packed form
19190D04556k5889m0571j3599k7906l2275j7602p581o483N553k3732n3711q948
19178A51812J4497P683k3356q64j5368O738J4945k2696j0969J7438J9701L6222
19166A95783j6421l5368K4906K4343j4324j1212l0893M83R991O962l896M6826
19154A97180K3712n921j708J9813J586J1142K4686L2156L7558J7826L0867L4902
19142D23799O085R0p140l2088o2543k9756j850j1169j8620O233m380N213R233
19129B83107j8808l7464J2913j3822n0289l9325j8295K8727K8029j9234j5774
19118A39765J5259J9163j0030q544n379P717K6129J7314K2477J317l1036k0839
19106A73313p680J0137n305J7926j8709J5218k417L964P548P194K8077L461j1616
$$ plain form
19093 221111 210422 218980 233962 214613 199380 229679 215483 208297 196304 197092 178664 149767
19081 149767 182520 198832 171324 168201 194714 204138 204707 221626 243447 245538 226562 220749 230894
19068 230894 233707 227279 233252 204329 207719 207380 236294 272839 270414 273497 266189 284727 253071
19055 253071 231628 274936 297253 320573 338035 313491 278686 279525 309634 349974 350713 310402
19043 310402 305955 323907 337851 341352 348253 352931 356239 348345 354057 351552 356695 371699 372161 361464
19029 361464 361019 340444 383190 392487 413818 447717 438427 422213 437741 442622 462878 481351
19017 481351 496254 477768 484046 517579 510050 492052 500929 509483 529912 521440 504724 492554
19005 492554 475179 471634 472295 465891 478701 471378 475477 463807 460470 471188 469050 429553 444265
$$ packed form
19093B21111j0689Q558J4982j9349j5233L0299j4196p186j1993P88j8428k8897
19081A49767L2753J6312k7508l123K6513R424N69J6919K1821K091j8976n813J0145
19068B30894K813o428N973k8923L390l39K8914L6545k425L083p308J8538l1656
19055B53071k1443M3308K2317K3320J7462k4544l4805Q39L0109M0340P39m0311
19043C10402m447J7952J3944L501O901M678L308p894N712k505N143J5004M62j0697
19029C61464m45k0575M2746R297K1331L3899r290j6214J5528M881K0256J8473
19017D81351J4903j8486O278L3533p529j7998Q877Q554K0429q472j6716j2170
19005D92554j7375l545O61o404J2810p323M099j1670l337J0718k138l9497J4712
$$ plain form
18992 444265 465409 468395 482307 490655 503191 488823 485700 512935 511866 524006 554685 581743
18980 581743 570009 582996 605836 640734 646677 676619 707891 699556 725557 761710 818589 842141
18968 842141 897588 949800 1008039 1073582 1103391 1131559 1165672 1235569 1287841 1350977 1445690
18957 1445690 1574430 1702650 1807626 1941108 2074486 2273930 2522865 2832830 3281128
18948 3281128 3877187 4625757 5515790 6490808 7605574 8905245 10361167 11761829 13047170
18939 13047170 14385353 15882188 17524275 19188689 20863331 22701431 24718155 26795234
18931 26795234 28791741 30582612 31959289 33001481 33790303 34275261 34272582 33709086 33064892
18922 33064892 32483445 31895631 30972060 29747435 28523063 27426059 26315360 24924303
$$ packed form
18992D44265K1144K986J3912Q348J2536j4368l123K7235j069J2140L0679K7058
18980E81743j1734J2987K2840L4898N943K9942L1272q335K6001L6153N6879K3552
18968H42141N5447N2212N8239O5543K9809K8168L4113O9897N2272O3136R4713
18957A445690J28740J28220J04976J33482J33378J99444K48935L09965M48298
18948C281128N96059P48570Q90033R75018J114766J299671J455922J400662J285341
18939A3047170J338183J496835J642087J664414J674642J838100K016724K077079
18931B6795234J996507J790871J376677J042192P88822M84958k679n63496o44194
18922C3064892n81447n87814r23571j224625j224372j097004j110699j391057
$$ plain form
18914 24924303 23456276 22133394 21251648 20810461 20855605 21390626 22400061 23813535 25612028
18905 25612028 27796003 30062935 32274448 34706308 37538182 40787409 44372226 48754506
18897 48754506 54181847 60407438 67249822 74840025 82848355 90228264 96974174 103235592
18889 103235592 108581483 112447656 115030412 117173875 118907706 119726500 120283301 120940662
18881 120940662 121057818 120404581 118565850 115383867 110701323 104217394 96602961 87614671
18873 87614671 77600080 67322234 57514445 48690078 40972466 34378180 28902947 24560867
18865 24560867 21262350 18735344 16716515 15029052 13604242 12421597 11413713 10606813
18857 10606813 10079055 9811492 9855856 10265358 11060427 12313281 13835070 15507666 17349996
$$ packed form
18914B4924303j468027j322882q81746m41187M5144N35021J009435J413474J798493
18905B5612028K183975K266932K211513K431860K831874L249227L584817M382280
18897D8754506N427341O225591O842384P590203Q008330P379909O745910O261418
18889A03235592N345891L866173K582756K143463J733831Q18794N56801O57361
18881A20940662J17156o53237j838731l181983m682544o483929p614433q988290
18873H7614671j0014591j0277846r807789q824367p717612o594286n475233m342080
18865B4560867l298517k527006k018829j687463j424810j182645j007884q06900
18857A0606813n27758k67563M4364M09502P95069J252854J521789J672596J842330
$$ plain form
18848 17349996 19165806 20574200 21797798 22891982 23682373 24556496 25594102 26681616
18840 26681616 28093863 29527688 30496404 31188646 31406424 30702475 29368275 27698991 25765443
18831 25765443 23851196 22099371 20660806 19630221 18691709 17732989 16866384 15830796
18823 15830796 14509240 13095374 11640446 10189189 8874486 7789583 6909405 6265926
18815 6265926 5832761 5588612 5502686 5493134 5605016 5863559 6270706 6925265 7945302 9457038
18805 9457038 11506802 14263807 17789694 21895036 26259363 30868636 35245775 38677200
18797 38677200 41412002 43589801 44782939 45689454 47037699 48700762 50667806 53328926
18789 53328926 56089488 57696327 58277735 57953646 55780937 52193676 48312013 44179495
$$ packed form
18848A7349996J815810J408394J223598J094184P90391Q74123J037606J087514
18840B6681616J412247J433825R68716O92242K17778p03949j334200j669284j933548
18831B5765443j914247j751825j438565j030585r38512r58720q66605j035588
18823A5830796j321556j413866j454928j451257j314703j084903q80178o43479
18815F265926m33165k44149q5926r552J11882K58543M07147O54559J020037J511736
18805I457038K049764K757005L525887M105342M364327M609273M377139L431425
18797C8677200K734802K177799J193138R06515J348245J663063J967044K661120
18789E3328926K760562J606839N81408l24089k172709l587261l881663m132518
$$ plain form
18781 44179495 40142399 36820392 34372240 32265822 30298582 28525019 26457019 23933861
18773 23933861 21291138 18604262 15906989 13437883 11299399 9541113 8206489 7130376
18765 7130376 6230809 5489290 4896888 4468241 4150639 3898959 3692310 3473570 3296188
18756 3296188 3087951 2876705 2707159 2558266 2418069 2292449 2160503 2067680 1992766 1966536
18746 1966536 1970892 2034671 2120951 2186211 2213918 2248446 2316306 2400922 2480584 2573692 2711155
18735 2711155 2839386 3029129 3284737 3592352 4010698 4623665 5483791 6667113 8325964
18726 8325964 10654467 13760256 17586722 21756533 26130525 30958681 36433251 41807190
18718 41807190 45699795 47483117 48092166 48399039 48117703 46126025 42250709 37603946
$$ packed form
18781D4179495m037096l322007k448152k106418j967240j773563k068000k523158
18773B3933861k642723k686876k697273k469106k138484j758286j334624j076113
18765G130376q99567p41519n92402m28647l17602k51680k06649k18740j77382
18756C296188k08237k11246j69546j48893j40197j25620j31946r2823p4914k6230
18746A966536M356O3779Q6280O5260K7707L4528O7860Q4616P9662R3108J37463
18735B711155J28231J89743K55608L07615M18346O12967Q60126J183322J658851
18726H325964K328503L105789L826466M169811M373992M828156N474570N373939
18718D1807190L892605J783322O09049L06873k81336j991678l875316m646763
$$ plain form
18710 37603946 33187220 29319011 25800598 22557412 19680576 17389311 15665310 14367367
18702 14367367 13328445 12487510 11773934 11114693 10383458 9586376 8803995 8057345 7423027
18693 7423027 6863427 6406171 6040698 5742362 5577234 5636469 5889931 6292813 6791299 7345294
18683 7345294 8123306 9149513 10139132 10789726 11464687 12560804 14136032 15865196 17777223
18674 17777223 20239534 23462748 27400305 31653381 35795978 39625840 43265789 46497802
18666 46497802 48570759 48962235 47959188 46302550 44085210 40909181 36742270 32249055
18658 32249055 28050730 24400553 21132529 18131000 15483489 13288648 11540641 10156576
18650 10156576 8991208 7954246 7061372 6321446 5655348 5053229 4550738 4125453 3793470
$$ packed form
18710C7603946m416726l868209l518413l243186k876836k291265j724001j297943
18702A4367367j038922q40935p13576o59241p31235p97082p82381p46650o34318
18693G423027n59600m57256l65473k98336j65128N9235K53462M02882M98486N53995
18683G345294P78012J026207R89619O50594O74961J096117J575228J729164J912027
18674A7777223K462311L223214L937557M253076M142597L829862L639949L232013
18666D6497802K072957L91476j003047j656638k217340l176029m166911m493215
18658C2249055m198325l650177l268024l001529k647511k194841j748007j384065
18650A0156576j165368j036962q92874p39926o66098o02119n02491m25285l31983
$$ plain form
18641 3793470 3566640 3445579 3387401 3408539 3534248 3749659 3977312 4181338 4520369 4994676
18631 4994676 5420039 5616526 5703900 5925489 6275969 6613330 6873691 7249363 7886013 8710151
18621 8710151 9583624 10544328 11828238 13290215 14416866 14842335 14877524 14955361 15008048
18612 15008048 14576158 13367907 11706910 10076675 8699575 7450221 6182712 4947319
18604 4947319 3950257 3148148 2579828 2174403 1890239 1662137 1508288 1373456 1237100
18595 1237100 1127477 1031005 974868 909946 872191 817272 765234 759207 720291 698601 673354
18584 673354 575572 513458 470072 431049 388925 349981 325923 306841 283132 266376 273702 265290
18572 265290 254779 264885 253790 232466 200423 196005 196154 179184 157784 147073 126206 100294
$$ packed form
18641C793470k26830j21061n8178K1138J25709K15411K27653K04026L39031M74307
18631D994676M25363J96487Q7374K21589L50480L37361K60361L75672O36650Q24138
18621H710151Q73473R60704J283910J461977J126651M25469L5189P7837N2687
18612A5008048m31890j208251j660997j630235j377100j249354j267509j235393
18604D947319r97062q02109n68320m05425k84164k28102j53849j34832j36356
18595A237100j09623r6472n6137o4922l7755n4919n2038o027l8916k1690k5247
18584F73354r7782o2114m3386l9023m2124l8944k4058j9082k3709j6756P326q412
18572B65290j0511J0106j1095k1324l2043m418J49j6970k1400j0711k0867k5912
$$ plain form
18560 100294 98016 111251 100229 137774 183064 170893 162426 176163 163213 169158 169669 145177
18548 145177 140264 146922 120037 134102 143663 149300 160618 167777 138423 148283 131704 98045 109339
18535 109339 118615 112958 69405 45690 55379 55184 39551 60685 97760 103570 82193 55317 70241
18522 70241 83622 123983 117493 98318 89865 94059 103146 108964 100378 91772 88958 78291 87791
18509 87791 74169 43644 33805 51278 81106 89496 83098 80571 94601 102814 115860 102693 80705
18496 80705 91858 119154 105644 80679 64031 64538 61628 71712 112497 111763 114372 115280 93046
18483 93046 67559 52735 48557 47250 73826 92855 77204 31759 34761 44494 71345 74990 42041
18470 42041 14852 27348 28926 6071 9254 20312 42885 15130 19152 68406 84667 91504
$$ packed form
18560A00294k278J3235j1022L7545M5290j2171q467J3737j2950N945N11k4492
18548A45177m913O658k6885J4065R561N637J1318P159k9354R860j6579l3659J1294
18535A09339R276n657m3553k3715R689j95j5633K1134L7075N810k1377k6876J4924
18522G0241J3381M0361o490j9175q453M194R087N818q586q606k814j0667R500
18509H7791j3622l0525r839J7473K9828Q390o398k527J4030Q213J3046j3167k1988
18496H0705J1153K7296j3510k4965j6648N07k910J0084M0785p34K609R08k2234
18483I3046k5487j4824m178j307K6576J9029j5651m5445L002R733K6851L645l2949
18470D2041k7189J2496J578k2855L183J1058K2573k7755M022M9254J6261O837
$$ plain form
18458 91504 108383 122381 109457 82799 97857 159689 162042 150848 132851 143515 133718 108634
18446 108634 62967 39153 43010 34938 39324 63800 44718 27766 62297 59540 19025 24759
18434 24759 37257 59480 40040 37798 39344 36618 52828 50253 47456 53262 92642 83433 85704
18421 85704 93710 91548 99715 98802 112319 105203 129882 124102 127211 147373 189599 201339 187075
18408 187075 173275 166704 189244 199409 202486 240586 246787 259354 272295 322703 312900 295354
18396 295354 286142 270088 263023 266262 269868 255705 228747 247400 236735 269886 284002 289818
18384 289818 277963 265668 263881 289278 315136 332361 351443 384080 400507 404605 418225 411993
18372 411993 458191 462958 464778 472615 484809 487600 476708 462956 453996 435084 438116 475662 464147
$$ packed form
18458I1504J6879J3998j2924k6658J5058O1832K353j1194j7997J0664r797k5084
18446A08634m5667k3814L857q072M386K4476j9082j6952L4531k757m0515N734
18434B4759J2498K2223j9440k242J546k726J6210k575k797N806L9380r209K271
18421H5704Q006k162Q167r13J3517p116K4679n780L109K0162M2226J1740j4264
18408A87075j3800o571K2540J0165L077L8100O201J2567J2941N0408r803j7546
18396B95354r212j6054p065L239L606j4163k6958J8653j0665L3151J4116N816
18384B89818j1855j2295j787K5397K5858J7225J9082L2637J6427M098J3620o232
18372D11993M6198M767J820P837J2194K791j0892j3752q960j8912L032L7546j1515
$$ plain form
18359 464147 445555 447551 441024 426549 398546 378369 356563 327495 305825 327907 313046 255339
18347 255339 235236 232955 227994 226951 212361 177647 155350 155292 122959 107596 86995 38709 25056
18334 25056 1452 34086 96184 114344 113632 132326 150326 136419 126696 158520 188775 209557
18322 209557 223542 212678 205516 194131 186922 175516 177092 232803 274449 250403 235409 245102
18310 245102 240801 213922 215642 196998 165747 169167 156806 182623 165189 154254 147330 135672
18298 135672 113339 73027 37555 59469 72496 74343 71196 58535 37078 11309 2156 6518
18286 6518 17059 25154 35217 41397 36871 31698 61910 71295 85589 98833 115143 113268 115878
18273 115878 122649 122807 141162 178938 224048 204075 193054 208959 210837 185986 165563 179997
$$ packed form
18359D64147j8592J996o527j4475k8003k0177k1806k9068k1670K2082j4861n7707
18347B55339k0103k281m961j043j4590l4714k2297n8l2333j5363k0601m8286j3653
18334B5056k3604L2634O2098J8160p12J8694J8000j3907r723L1824L0255K0782
18322B09557J3985j0864p162j1385p209j1406J576N5711M1646k4046j4994R693
18310B45102m301k6879J720j8644l1251L420j2361K5817j7434j0935o924j1658
18298A35672k2333m0312l5472K1914J3027J847l147j2661k1457k5769r153M362
18286F518J0541Q095J0063O180m526n173L0212R385J4294J3244J6310j875K610
18273A15878O771J58J8355L7776M5110j9973j1021J5905J878k4851k0423J4434
$$ plain form
18261 179997 179970 125578 91290 103138 133900 137002 140683 143836 139421 121931 118825 112002 84255
18248 84255 50984 73206 67841 36128 14118 29880 63723 33174 50856 62436 78564 93933
18236 93933 92843 118925 118251 57156 3191 -22606 -22874 -17738 -4147 4886 26983 27591 -10559
18223 -10559 -7235 2593 4286 13701 13035 10222 6557 13462 29695 43048 56107 56323 32693 23041
18209 23041 30112 43062 27029 38660 48663 57241 93587 127849 165260 187547 201762 216724
18197 216724 219084 217159 197094 141091 127109 116066 103368 114047 117851 95049 93940 83323
18185 83323 79937 70655 35816 52722 80189 77520 77842 72397 80519 84635 84327 69029 89078 109655
18171 109655 116739 120056 120695 133069 137581 132299 109345 117599 147581 122980 115522 122708 114322
$$ packed form
18261A79997k7n4392l4288J1848L0762L102L681L153m415j7490l106o823k7747
18248H4255l3271K2222n365l1713k2010J5762L3843l0549J7682J1580J6128J5369
18236I3933j090K6082o74o1095n3965k5797k68N136J3591R033K2097O08l8150
18223a0559L324R828J693R415o66k813l665O905J6233J3353J3059K16k3630r652
18209B3041P071J2950j6033J1631J0003Q578L6346L4262L7411K2287J4215J4962
18197B16724K360j925k0065n6003j3982j1043j2698J0679L804k2802j109j0617
18185H3323l386r282l4839J6906K7467k669L22n445Q122M116l08j5298K0049K0577
18171A09655P084L317O39J2374M512n282k2954Q254K9982k4601p458P186q386
$$ plain form
18158 114322 116814 163723 207102 234915 262344 302387 311976 340061 351154 372990 410259 447155
18146 447155 474801 474596 448342 426866 434354 429443 437758 440199 429388 405984 390224 398867 404365
18133 404365 425802 426108 440792 475285 519916 593751 658501 690289 734948 832033 982107 1164058
18121 1164058 1374467 1609886 1853732 2186760 2642424 3277188 4239940 5737343 8208931
18112 8208931 12485561 20160946 34289134 55747540 69433242 60482322 44288552 29115386
18104 29115386 17995568 11792110 8486820 6548355 5348261 4520671 3862249 3334241
18096 3334241 2906646 2566699 2233967 1937323 1694713 1504599 1313650 1163683 1037983
18087 1037983 915756 825012 737561 652875 565635 513383 460225 436774 407533 407349 377626
$$ packed form
18158A14322K492M6909M3379K7813K7429M0043R589K8085J1093K1836L7269L6896
18146D47155K7646k05k6254k1476P488m911Q315K441j0811k3404j5760Q643N498
18133D04365K1437L06J4684L4493M4631P3835O4750L1788M4659R7085J50074J81951
18121A164058K10409K35419K43846L33028M55664O34764R62752J497403K471588
18112H208931M276630P675385J4128188K1458406J3685702q950920j6193770j5173166
18104B9115386j1119818o203458l305290j938465j200094q27590o58422n28008
18096C334241m27595l39947l32732k96644k42610j90114j90949j49967j25700
18087A037983j22227r0744q7451q4686q7240n2252n3158k3451k9241j84k9723
$$ plain form
18076 377626 331833 289513 280012 277393 258322 222472 207656 165854 164352 162876 138880 134337
18064 134337 109279 67745 78863 95367 112034 113724 105739 105344 111559 95849 80521 74792 65982
18051 65982 92082 139665 127838 87373 64476 84587 75947 43068 10560 6795 28364 8743
18039 8743 -18551 -43372 -3505 16521 40059 45541 33407 52224 50679 28898 48782 30147
18027 30147 25759 19580 -742 7379 -28648 -30586 -16258 -35279 -10820 -7272 16357 55195 66439
18014 66439 92730 62295 64801 55672 45126 26511 686 -8864 13404 8256 -14370 3473
18002 3473 -16390 -36857 -30905 -10701 24642 41705 16327 21814 8469 -19737 -27915 -39848
17990 -39848 -57250 -23464 -1488 47584 80008 78897 68282 76705 55402 27884 10318 -16019
$$ packed form
18076C77626m5793m2320r501k619j9071l5850j4816m1802j502j476k3996m543
18064A34337k5058m1534J1118J6504J6667J690p985l95O215j5710j5328n729q810
18051F5982K6100M7583j1827m0465k2897K0111q640l2879l2508l765K1569j9621
18039H743k7294k4821L9867K0026K3538N482j2134J8817j545k1781J9884j8635
18027C0147m388o179k0322Q121l6027j938J4328j9021K4459L548K3629L8838J1244
18014F6439K6291l0435K506r129j0546j8615k5825r550K2268n148k2626J7843
18002C473j9863k0467N952K0204L5343J7063k5378N487j3345k8206q178j1933
17990c9848j7402L3786K1976M9072L2424j111j0615Q423k1303k7518j7566k6337
$$ plain form
17978 -16019 -11429 2873 -6381 -2259 3061 -3199 -12199 -22111 -25421 -420 24678 40268 10529
17965 10529 -14184 1275 17240 27179 18902 834 -11017 -7972 -10306 -2207 12327 15743 3746
17952 3746 -17469 -13504 -21536 -20457 -6627 -2926 -5104 -9998 13082 34891 50391 33815 9745
17939 9745 6732 2656 -23724 -16838 -2875 10987 27958 28737 -9661 -3520 7392 1888 -23431
17926 -23431 -12598 -1541 8651 26387 40761 23659 -15662 -33238 -35224 -43304 -41670 -40132
17914 -40132 -4694 -7502 -3161 21608 31406 50963 20423 -24019 -25528 -6249 -3771 1689 -19265
17901 -19265 -55751 -67170 -42905 -26612 -43849 -33920 -37006 -27804 -17354 -16411 -7698 -13823 -10463
17888 -10463 -24693 -7680 -350 -6084 -26531 -14121 -7119 -9440 954 -6831 -16333 5093 13744
$$ packed form
17978a6019M590J4302r254M122N320o260r000r912l310K5001K5098J5590k9739
17965A0529k4713J5459J5965R939q277j8068j1851L045k334Q099J4534L416j1997
17952C746k1215L965q032J079J3830L701k178m894K3080K1809J5500j6576k4070
17939I745l013m076k6380O886J3963J3862J6971P79l8398O141J0912n504k5319
17926b3431J0833J1057J0192J7736J4374j7102l9321j7576j986q080J634J538
17914d0132L5438k808M341K4769R798J9557l0540m4442j509J9279K478N460k0954
17901a9265l6486j1419K4265J6293j7237R929l086R202J0450R43Q713o125L360
17888a0463j4230J7013P330n734k0447J2410P002k321J0394p785r502K1426Q651
$$ plain form
17875 13744 31763 58532 25252 -10399 -32133 -45370 -55183 -53229 -38691 -26181 -44522 -65724
17863 -65724 -77595 -32734 -29040 -41872 -34868 -42706 5345 20514 -2577 -3947 -7644 -15702 -31189
17850 -31189 -50763 -48913 -30710 -32047 -35623 -11784 -37533 -58755 -37148 -37897 -35298 -40390 -20141
17837 -20141 -33563 -61895 -63301 -36361 -41923 -60522 -78547 -84496 -71235 -54065 -43741 -47488
17825 -47488 -39853 -18519 -24291 -9341 13706 9922 -19335 -43984 -22336 -13726 -13631 36872 76294
17812 76294 60840 37626 189 -3718 17199 10380 -16929 -7797 8722 9390 16439 5013 -5800
17799 -5800 -31505 -25225 -10188 -10940 -44423 -44221 -22568 -12826 -27233 -40546 -38521 -22639 -2093
17786 -2093 7022 -19844 -41020 -56483 -51084 -28598 -19921 -41702 -62913 -87540 -72948 -44567
$$ packed form
17875A3744J8019K6769l3280l5651k1734j3237r813J954J4538J2510j8341k1202
17863f5724j1871M4861L694j2832P004p838M8051J5169k3091j370l697q058j5487
17850c1189j9574J850J8203j337l576K3839k5749k1222K1607p49K599n092K0249
17837b0141j3422k8332j406K6940n562j8599j8025n949J3261J7170J0324l747
17825d7488P635K1334n772J4950K3047l784k9257k4649K1648Q610R5N0503L9422
17812G6294j5454k3214l7437l907K0917o819k7309R132J6519O68P049j1426j0813
17799e800k5705O280J5037p52l3483K02K1653R742j4407j3313K025J5882K0546
17786b093R115k6866k1176j5463N399K2486Q677k1781k1211k4627J4592K8381
$$ plain form
17774 -44567 -16926 -27846 -21578 -15584 -20256 -11613 -8452 -12219 -13030 49 14609 29975 5262
17761 5262 -22838 -37223 -42873 -21433 -342 -16 -10089 -15903 -24446 -1289 23299 24281 -12969
17748 -12969 -23381 -9652 -12915 -22418 -26054 -30396 -41699 -58948 -45469 -12857 -23044 -22059 -9496
17735 -9496 11417 40948 14038 -9700 -13653 4379 29860 46976 42242 20215 -2020 -30747
17723 -30747 -26098 -7084 -31323 -49861 -59899 -64609 -60728 -43145 -3058 -4698 -61825 -62612 -41259
17710 -41259 -30197 -19216 -12671 5776 -41 -44229 -56107 -33903 -36945 -28121 -44966 -17990
17698 -17990 -1056 19658 28181 17264 -6054 -23861 -38750 -52984 -51395 -37933 -21099 -29440
17686 -29440 -42855 -33228 -33980 -53111 -40013 -16302 12108 -7666 -3459 -14823 -15683 1510 14247
$$ packed form
17774d4567K7641j0920O268N994m672Q643L161l767q11J3079J4560J5366k4713
17761E262k8100j4385n650K1440K1091L26j0073n814q543K3157K4588R82l7250
17748a2969j0412J3729l263r503l636m342j1303j7249J3479L2612j0187R85J2563
17735i496K0913K9531k6910k3738l953J8032K5481J7116m734k2027k2235k8727
17723c0747M649J9014k4239j8538j0038m710L881J7583M0087j640n7127p87K1353
17710d1259J1062J0981O545J8447n817m4188j1878K2204l042Q824j6845K6976
17698a7990J6934K0714Q523j0917k3318j7807j4889j4234J589J3462J6834q341
17686b9440j3415R627p52j9131J3098K3711K8410j9774M207j1364q60J7193J2737
$$ plain form
17673 14247 20527 -5636 -26809 -4700 -5392 -10551 -9757 -9632 -31770 -28004 -3627 -135 -8700 -16436
17659 -16436 -37585 -24932 -21084 -31008 -12697 -4775 -17140 -4243 6643 -19533 -28413 -30096 -40428
17646 -40428 -62555 -45414 -10141 6961 8997 9685 26821 7561 -4042 -2557 -22051 -21055 -66267
17633 -66267 -65887 -28544 -9994 -5078 8805 14029 10282 -976 10116 -11058 2796 -20671 -41321
17620 -41321 -27883 -11176 -21667 -21355 -4781 -23081 -41271 -39828 -25743 -4773 -23836 1157
17608 1157 12131 23248 1881 -32290 -19968 2027 -32692 -5922 7742 -14241 -7271 6479
17596 6479 24377 47261 56720 28574 26503 -5121 -22001 -20286 -44178 -58852 -80505 -49198
17584 -49198 -33022 -62259 -53081 -51959 -70468 -68172 -35871 -34563 -61964 -80450 -92938 -76306
$$ packed form
17673A4247O280k6163k1173K2109o92n159P94J25k2138L766K4377L492q565p736
17659a6436k1149J2653L848r924J8311P922j2365J2897J0886k6176q880j683j0332
17646d0428k2127J7141L5273J7102K036O88J7136j9260j1603J485j9494R96m5212
17633f6267L80L7343J8550M916J3883N224l747j1258J1092k1174J3854k3467k0650
17620d1321J3438J6707j0491L12J6574j8300j8190J443J4085K0970j9063K4993
17608A157J0974J1117k1367l4171J2322K1995l4719K6770J3664k1983O970J3750
17596F479J7898K2884R459k8146k071l1624j6880J715k3892j4674k1653L1307
17584d9198J6176k9237R178J122j8509K296L2301J308k7401j8486j2488J6632
$$ plain form
17572 -76306 -59048 -47615 -22364 15751 50102 65060 50748 44489 46367 49425 40841 22819
17560 22819 29208 43443 -9907 -29087 -25651 -27092 -31086 -7888 5732 -6783 1770 25806 47832
17547 47832 67088 55549 21925 8812 7567 -4083 -20658 -7425 -12651 -18687 -29930 -14888
17535 -14888 16921 -2920 -59347 -71448 -67042 -87977 -69437 -51738 -39892 -30249 9231 -1155
17523 -1155 -10931 8142 2001 -17286 1784 9997 -14224 -27396 -38429 -29080 -24428 -21771 -14645
17510 -14645 -18491 -23781 -42421 -42962 -13576 2196 -9524 -38553 -53636 -64170 -59754 -58242 -42566
17497 -42566 -27304 -41222 -46704 -48838 -30047 -13394 -21396 -51309 -61032 -31558 -11464 -16719 -46908
17484 -46908 -41432 -12124 33929 59285 52192 54287 32873 35122 -3439 -8479 -5984 -10806 -11730
$$ packed form
17572g6306J7258J1433K5251L8115L4351J4958j4312o259J878L058q584j8022
17560B2819O389J4235n3350j9180L436j441l994K3198J3620j2515Q553K4036K2026
17547D7832J9256j1539l3624j3113j245j1650j6575J3233n226o036j1243J5042
17535a4888L1809j9841n6427j2101M406k0935J8540J7699J1846R643L9480j0386
17523a155r776J9073o141j9287J9070Q213k4221j3172j1033R349M652K657P126
17510a4645l846n290j8640n41K9386J5772j1720k9029j5083j0534M416J512J5676
17497d2566J5262j3918n482k134J8791J6653q002k9913r723K9474K0094n255l0189
17484d6908N476K9308M6053K5356p093K095k1414K249l8561n040K495m822r24
$$ plain form
17471 -11730 5555 20317 -22636 -27820 -42143 -40813 -31786 -58019 -78992 -89951 -100430 -102138
17459 -102138 -58140 -36062 -42130 -34694 -29311 -18854 -29446 -43954 -16356 21374 21282 -12593 -16308
17446 -16308 12424 65736 109163 167518 262758 296534 226564 157602 104927 71222 53041 35318
17434 35318 45221 27266 20573 8322 16392 33238 35870 32265 63883 62803 47001 26007 -2502
17421 -2502 -12173 -21480 4670 7077 -20251 -3598 -26802 -32925 -28251 -31215 -70272 -48872 -7613
17408 -7613 6176 -8967 10008 -9305 -26438 -9894 -3505 -13838 -52 10695 14147 -6568
17396 -6568 -11782 8608 9521 -7402 -542 16321 35167 48489 48642 4438 -24943 -35983 -41035
17383 -41035 -47041 -51185 -41770 -31538 -15065 18176 53175 75255 14670 -851 6274 -20987
$$ packed form
17471a1730J7285J4762m2953n184j4323J330R027k6233k0973j0959j0479j708
17459a02138M3998K2078o068P436N383J0457j0592j4508K7598L7730r2l3875l715
17446a6308K8732N3312M3427N8355R5240L3776o9970o8962n2675l3705j8181j7723
17434C5318R903j7955o693j2251Q070J6846K632l605L1618j080j5802k0994k8509
17421b502r671r307K6150K407k7328J6653k3204o123M674k964l9057K1400M1259
17408g613J3789j5143J8975j9313j7133J6544O389j0333J3786J0747L452k0715
17396f568n214K0390R13j6923O860J6863J8846J3322J53m4204k9381j1040n052
17383d1035o006m144R415J0232J6473L3241L4999K2080o0585j5521P125k7261
$$ plain form
17371 -20987 -47911 -66983 -58301 -13488 -22597 -33569 -7063 3443 -7260 -13548 -17188 -36972
17359 -36972 -11303 709 -23248 -54214 -39365 -18937 -14726 -5688 10476 12150 -12062 -28219
17347 -28219 -48561 -65114 -61195 -43922 -37332 -27560 -2687 -1404 -22662 -28298 -38427 -32586 -7835
17334 -7835 301 -3599 -4946 -23830 -50257 -45957 -21860 -8827 -13839 6567 46552 29383 29513
17321 29513 6567 -16321 4300 -3614 -11496 -14961 6072 22462 -6540 -29394 -30583 -15712
17309 -15712 6490 22925 25225 -22035 -10470 6387 -5493 -44040 -28031 -26751 -28828 -12644
17297 -12644 -11211 -33248 -10931 12339 5572 -8012 -17214 -30970 -64079 -88286 -87534 -58219 -46188
17284 -46188 -69277 -82191 -59107 -38480 -24158 -11821 -3963 -33759 -38749 -35675 -24497 -25494 -39900
$$ packed form
17371b0987k6924j9072Q682M4813r109j0972K6506J0506j0703o288l640j9784
17359c6972K5669J2012k3957l0966J4849K0428M211R038J6164J674k4212j6157
17347b8219k0342j6553L919J7273O590R772K4873J283k1258n636j0129N841K4751
17334g835Q136l900j347j8884k6427M300K4097J3033n012K0406L9985j7169J30
17321B9513k2946k2888K0621p914p882l465K1033J6390k9002k2854j189J4871
17309a5712K2202J6435K300m7260J1565J6857j1880l8547J6009J280k077J6184
17297a2644J433k2037K2317K3270o767j3584r202j3756l3109k4207P52K9315J2031
17284d6188k3089j2914K3084K0627J4322J2337P858k9796m990L074J1178r97j4406
$$ plain form
17271 -39900 -9930 -26336 -36638 -35834 -44529 -59610 -67313 -44799 -22508 4945 -16480 -32112
17259 -32112 -23415 4597 24091 -12841 -18858 -9131 -24828 -596 -3935 -720 -11637 -7039 17368
17246 17368 39134 48209 40272 34907 33376 10783 -30020 1732 34976 19073 9109 -22382 -27613
17233 -27613 25634 45801 33711 -4997 14504 17939 -21799 -44562 -23711 -10591 335 31698
17221 31698 22848 7306 8257 20889 2358 -17665 -11525 6897 -5391 7767 5739 -8400 -28875
17208 -28875 -19558 -3092 -13517 -23661 -20275 -43166 -17734 28542 35670 18522 -10103 -41674
17196 -41674 -42680 12123 31795 102 -29547 -20090 4737 -3083 666 -12632 -12646 -28767 -39200
17183 -39200 -30860 211 22166 25770 -482 13313 2751 -5000 -8043 10526 17346 21315 4112
$$ packed form
17271c9900K9970j6406j0302Q04q695j5081p703K2514K2291K7453k1425j5632
17259c2112Q697K8012J9494l6932o017R727j5697K4232l339L215j0917M598K4407
17246A7368K1766R075p937n365j531k2593m0803L1752L3244j5903r964l1491n231
17233b7613N3247K0167j2090l8708J9501L435l9738k2763K0851J3120J0926L1363
17221C1698q850j5542R51J2632j8531k0023O140J8422j2288J3158k028j4139k0475
17208b8875R317J6466j0425j0144L386k2891K5432M6276P128j7148k8625l1571
17196d1674j006N4803J9672l1693k9649R457K4827p820L749j3298j4j6121j0433
17183c9200Q340L1071K1955L604k6252J3795j0562p751l043J8569O820L969j7203
$$ plain form
17170 4112 -19518 3586 -4091 -38107 -35050 -10700 -17029 -41318 1095 -4354 -18804 -31706 -11721
17157 -11721 -4258 -1144 5886 -7382 7692 6037 -18376 -29988 -10019 -9196 -32775 -66761 -100003
17144 -100003 -96672 -76923 -53575 -43070 -50119 -8002 -7432 11107 12654 -32112 -75131 -56419
17132 -56419 -24464 -26904 -14016 -31848 -39983 -36818 -26694 -27695 -33781 -23651 -18222 3716 15018
17119 15018 19774 -11561 -5713 -17775 -18356 -4895 -9828 -17253 -17081 2713 8001 -329 -104 -4030
17105 -4030 -40944 -38129 -7434 -5111 -27657 -30587 -35466 -43415 -48979 -44475 -5396 6085 6513 -10683
17091 -10683 -17966 -19532 -40463 -52856 -47304 -37871 -13488 -14149 -2171 6950 -25139 -54769 -86436
17078 -86436 -66256 -67705 -44661 -24142 -30982 -43047 -14404 -38001 -51163 -41665 -44186 -12760
$$ packed form
17170D112k3630K3104p677l4016L057K4350o329k4289M2413n449j4450j2902J9985
17157a1721P463L114P030j3268J5074j655k4413j1612J9969Q23k3579l3986l3242
17144a00003L331J9749K3348J0505p049M2117N70J8539J547m4766m3019J8712
17132e6419L1955k440J2888j7832q135L165J0124j001o086J0130N429K1938J1302
17119A5018M756l1335N848j2062n81J3461m933p425J72J9794N288q330K25l926
17105d030l6914K815L0695K323k2546k930m879p949n564M504L9079J1481M28j7196
17091a0683p283j566k0931j2393N552R433K4383o61J1978R121l2089k9630l1667
17078h6436K0180j449K3044K0519o840j2065K8643k3597j3162R498k521L1426
$$ plain form
17066 -12760 6501 5323 4661 8699 37374 43460 41612 35559 28184 38866 13812 -15088 -21780
17053 -21780 -16219 -11 -11150 -46744 -47312 -686 31423 36034 19123 21720 30143 5747 -22459
17040 -22459 -28780 -12161 3185 27918 -4631 -21247 -45282 -38156 -41355 -51827 -29296 -19309
17028 -19309 -43822 -51972 -42111 -22110 -18072 -32627 -77205 -70022 -20401 -26598 -16461 1054 5207
17015 5207 -11147 -20121 -32407 -60783 -85410 -82868 -75758 -78848 -49642 -21876 -31038 -27897 -47886
17002 -47886 -50522 -24912 -12358 -14230 -42416 -22423 -14726 -45905 -60963 -55589 -28566 -23002 -57811
16989 -57811 -57383 -44677 -21857 -20751 -47973 -36507 -37265 -50441 -21017 -27273 -39656 -28961 -32220
16976 -32220 -48508 -59307 -32705 -1171 -9952 -28294 -54663 -71651 -54441 -21005 -26268 -44589
$$ packed form
17066a2760J9261j178o62M038K8675O086j848o053p375J0682k5054k8900o692
17053b1780N561J6208j1139l5594n68M6626L2109M611j6911K597Q423k4396k8206
17040b2459o321J6619J5346K4733l2549j6616k4035P126l199j0472K2531R987
17028a9309k4513q150R861K0001M038j4555m4578P183M9621o197J0137J7515M153
17015E207j6354q974j2286k8376k4627K542P110l090K9206K7766r162L141j9989
17002d7886k636K5610J2554j872k8186J9993P697l1179j5058N374K7023N564l4809
16989e7811M28J2706K2820J106k7222J1466p58j3176K9424o256j2383J0695l259
16976c2220j6288j0799K6602L1534q781j8342k6369j6988J7210L3436n263j8321
$$ plain form
16964 -44589 -43843 -31320 -11963 -12410 -22940 -25826 -14270 -30226 -11583 -1892 -3738 -20151 10341
16951 10341 22555 -10909 -9598 -8749 -14907 -27974 -10185 -21357 -25111 -37574 -35422 -11840 12509
16938 12509 28151 12446 -19499 -49513 -63837 -47254 -33180 -15292 2578 -5957 -32923 -48243
16926 -48243 -18065 -12647 -9428 -3742 3852 -1404 -3447 -18977 -24077 -23335 -16469 -17364 -51961 -67039
16912 -67039 -60661 -34534 -47967 -27374 -31375 -37188 -20584 -20543 -11485 -29868 -43731 -23510 1520
16899 1520 -13868 -7509 -9586 -19156 -49814 -57760 -40608 -25693 -4511 12657 13837 26329 52227
16886 52227 58709 18386 -9453 -38784 -52405 -29530 3723 -1882 -3848 -9642 -50295 -56219 -45516
16873 -45516 -55162 -22903 -25363 -37126 -47725 -66892 -68663 -63047 -69066 -51599 -43146 -46890 -52470
$$ packed form
16964d4589P46J2523J9357m47j0530k886J1556j5956J8643R691j846j6413L0492
16951A0341J2214l3464J311Q49o158j3067J7789j1172l754j2463K152K3582K4349
16938A2509J5642j5705l1945l0014j4324J6583J4074J7888J7870q535k6966j5320
16926d8243L0178N418L219N686P594n256k043j5530n100P42O866q95l4597j5078
16912f7039O378K6127j3433K0593m001n813J6604M1R058j8383j3863K0221K5030
16899A520j5388O359k077r570l0658p946J7152J4915K1182J7168J180J2492K5898
16886E2227O482m0323k7839k9331j3621K2875L3253n605j966n794m0653n924J0703
16873d5516r646L2259k460j1763j0599j9167j771N616o019J7467Q453l744n580
$$ plain form
16860 -52470 -33598 -14305 -6402 -4321 -7977 -18677 -34212 -20571 7692 11012 316 8935 -13610
16847 -13610 -51694 -23975 -82 20091 39386 14560 12710 25064 26830 18935 10722 -321
16835 -321 -14335 -51043 -52179 -61072 -48465 -30204 -27615 -16400 -11488 10890 7223 12720 26339
16822 26339 3630 3919 33633 41834 31592 -3219 -28635 -23156 -4750 8728 -13721 -30074
16810 -30074 -39820 -49245 -50813 -25075 -18201 2047 26580 18139 5684 -3071 -9623 929 4405
16797 4405 7993 -19008 -28186 -32243 -35075 -56941 -48260 -21296 -13606 -16783 -8723 18889 32244
16784 32244 30439 13280 19597 -5042 -13139 44642 63330 30292 4920 -13294 -20791 -26415 -28321
16771 -28321 -1690 9489 8701 -2103 -14907 -40777 -35904 -21423 -20132 8882 33539 4771
$$ packed form
16860e2470J8872J9293P903K081l656j0700j5535J3641K8263L320j0696Q619k2545
16847a3610l8084K7719K3893K0173J9295k4826j850J2354J766p895q213j1043
16835c21j4014l6708j136q893J2607J8261K589J1215M912K2378l667N497J3619
16822B6339k2709K89K9714Q201j0242l4811k5416N479J8406J3478k2449j6353
16810c0074r746r425j568K5738O874K0248K4533q441j2455q755o552J0552L476
16797D405L588k7001r178m057k832k1866Q681K6964P690l177Q060K7612J3355
16784C2244j805j7159O317k4639q097N7781J8688l3038k5372j8214p497n624j906
16771b8321K6631J1179p88j0804j2804k5870M873J4481J291K9014K4657k8768
$$ plain form
16759 4771 -14820 7928 38514 18227 -19927 -13497 -26778 -19271 9451 11160 9283 23695 9359
16746 9359 -25 1680 -7136 -15518 -44444 -52728 -47654 -38013 -20159 16964 6416 3818 20177
16733 20177 -14931 -23169 -12195 -2842 7609 20851 18367 7322 6020 8160 -16176 -16961 7255
16720 7255 30719 26384 14381 10205 23477 41330 5932 7057 -11201 -33995 -62345 -43356
16708 -43356 -32635 -22213 -29517 -11248 -9708 -5452 8743 25780 18696 8586 21025 18581 23854
16695 23854 26827 34952 20674 2542 12436 -9280 -25132 -25801 -18793 -28949 -32399 -22036 -13573
16682 -13573 -8777 26077 40454 34203 24683 31620 56487 28865 -41350 -51529 -51309 -70867 -56491
16669 -56491 -15924 -30918 -17891 -10067 -28750 2688 13698 2627 7907 16006 3159 7388
$$ packed form
16759D771j9591K2748L0586k0287l8154O430j3281P507K8722J709j877J4412j4336
16746I359r384J705q816q382k8926q284N074R641J7854L7123j0548k598J6359
16733B0177l5108q238J0974R353J0451J3242k484j1045j302K140k4336p85K4216
16720G255K3464m335j2003m176J3272J7853l5398J125j8258k2794k8350J8989
16708d3356J0721J0422p304J8269J540M256J4195J7037p084j0110J2439k444N273
16695B3854K973Q125j4278j8132R894k1716j5852o69P008j0156l450J0363Q463
16682a3573M796L4854J4377o251r520O937K4867k7622p0215j0179K20j9558J4376
16669e6491M0567j4994J3027P824j8683L1438J1010j1071N280Q099j2847M229
$$ plain form
16657 7388 29207 30702 4495 -17550 -30272 -27194 5021 -2441 20169 22859 -11565 14732 53200
16644 53200 46489 37066 6525 3188 11205 2002 -9807 -30044 -38462 -17620 -28398 -29963 -6324
16631 -6324 -12112 -39169 -46872 -44177 -31011 -25362 -35674 -45550 -25052 -3303 -2960 20181 12075
16618 12075 7419 -874 -901 -10168 -42123 -60584 -30490 7578 -12628 -55147 -51785 -51310 -44638 -55444
16604 -55444 -53046 -36950 -16069 -4354 -10521 -43183 -41136 -10929 18858 25390 15494 13560 -18134
16591 -18134 -30632 -14187 -9602 -24438 -18788 7387 35682 29396 7575 9569 8691 9613 1499
16578 1499 -27183 9162 41424 35588 28830 5922 -11544 -5351 7991 21242 8889 -8093
16566 -8093 -1748 21017 15053 7140 5643 -36436 -36574 -11586 21520 -15598 -43863 -22577 -27482
$$ packed form
16657G388K1819J495k6207k2045j2722L078L2215p462K2610K690l4424K6297L8468
16644E3200o711r423l0541l337Q017r203j1809k0237q418K0842j0778j565K3639
16631f324n788k7057p703K695J3166N649j0312r876K0498K1749L43K3141q106
16618A2075m656q293k7r267l1955j8461L0094L8068k0206m2519L362M75O672j0806
16604e5444K398J6096K0881J1715o167l2662K047L0207K9787O532r896j934l1694
16591a8134j2498J6445M585j4836N650K6175K8295o286k1821J994q78R22q114
16578A499k8682L6345L2262n836o758k2908j7466O193J3342J3251j2353j6982
16566h093O345K2765n964p913j497m2079j38K4988L3106l7118k8265K1286m905
$$ plain form
16553 -27482 -2186 -5177 -17263 -55443 -63533 -85989 -78865 -31297 -16574 -20902 -22628 -4868 -11513
16540 -11513 25538 51039 18374 -1130 -5771 3346 869 -8916 6254 4242 9025 33634 28366
16527 28366 -14084 -47549 -37108 -34645 -40374 -37237 -36394 -42542 -15757 -29242 -48055 -44933 -5419
16514 -5419 -27769 -64840 -63174 -69612 -53207 -67552 -42765 -9985 -6669 2980 -11280 -20991 17153
16501 17153 59571 63097 33562 28066 39011 6430 9713 26216 -4031 -17791 -24464 -21524 -18027
16488 -18027 -35924 -49710 -42663 -33070 -23326 -15967 -19615 3572 -641 -15797 -47707 -64323 -71576
16475 -71576 -96919 -93927 -92852 -95714 -88446 -66823 -53534 -7060 32781 12563 5292 4244 -1650
16462 -1650 -2257 -14154 -14413 -6280 9782 736 9014 1048 -23190 -28816 -11956 -7815 -9726 -17691
$$ packed form
16553b7482K5296k991j2086l8180q090k2456P124M7568J4723m328j726J7760o645
16540a1513L7051K5501l2665j9504m641R117k477r785J5170k012M783K4609n268
16527B8366m2450l3465J0441K463n729L137Q43o148K6785j3485j8813L122L9514
16514e419k2350l7071J666o438J6405j4345K4787L2780L316R649j4260r711L8144
16501A7153M2418L526k9535n496J0945l2581L283J6503l0247j3760o673K940L497
16488a8027j7897j3786P047R593R744P359l648K3187m213j5156l1910j6616p253
16475g1576k5343K992J075k862P268K1623J3289M6474L9841k0218p271j048n894
16462a650o07j1897k59Q133J6062r046Q278p966k4238n626J6860M141j911p965
$$ plain form
16448 -17691 -26728 -53241 -72652 -60447 -57982 -54010 -46345 -53223 -45973 -21993 7883 14150 19251
16435 19251 14822 -221 -28856 -48023 -16367 -9910 -5199 -36067 -37613 -39494 -26620 -17871 -51742
16422 -51742 -60663 -57602 -15034 16301 14468 -8030 -6055 -1746 -7874 -27762 -32446 -38376 -20140
16409 -20140 13340 38482 23057 -6405 -6654 17147 28146 30407 26949 29452 8547 -16855 -14367
16396 -14367 17229 27244 10630 649 -5680 8775 7518 13147 16359 17877 23408 7274 -10055
16383 -10055 10457 23105 -61 -4086 -20222 -43315 -45289 -35069 -22968 -29573 -49435 -59771
16371 -59771 -69253 -39831 -17531 4624 35381 36089 15382 -3671 -22092 -12326 -9436 -12459 -38590
16358 -38590 -26202 -27565 -23177 -1767 2470 -22195 -28247 -25777 26513 57012 39048 40894 17429
$$ packed form
16448a7691r037k6513j9411J2205K465L972P665o878P250K3980K9876O267N101
16435A9251m429j5043k8635j9167L1656O457M711l0868j546j881J2874Q749l3871
16422e1742q921L061M2568L1335j833k2498J975M309o128j9888m684n930J8236
16409b0140L3480K5142j5425k9462k49K3801J0999K261l458K503k0905k5402K488
16396a4367L1596J0015j6614r981o329J4455j257N629L212J518N531j6134j7329
16383a0055K0512J2648k3166m025j6136k3093j974J0220J2101o605j9862j0336
16371e9771r482K9422K2300K2155L0757P08k0707j9053j8421R766K890l023k6131
16358c8590J2388j363M388K1410M237k4665o052K470N2290L0499j7964J846k3465
$$ plain form
16345 17429 8637 11664 10276 4304 -9157 -32812 -42710 -17504 -13454 1533 16206 8106 -37769
16332 -37769 -74312 -79743 -77334 -39393 -13611 24334 43026 54150 60305 45095 8488 30120
16320 30120 16072 3962 19598 2877 4680 9243 21263 4744 -9722 4077 -24849 -25180
16308 -25180 -12458 -12687 -29229 14116 19853 -47930 -75146 -78526 -93530 -97548 -76855 -59084 -28264
16295 -28264 -43756 -64957 -65453 -72095 -66272 -47907 -7458 -25512 -40359 -34525 -37992 -25627 -24954
16282 -24954 6513 9979 19307 -18972 -43826 -26882 -55077 -69859 -53530 -25984 -18471 -10028
16270 -10028 -24144 -19006 -12131 -21349 -43559 -49270 -30542 -11775 -35989 -31225 -23595 -13373 -13304
16257 -13304 -29104 -17930 15309 38911 31904 10933 17279 -1051 -22978 -16127 -20213 -24484 -13087
$$ packed form
16345A7429q792L027j388n972j3461k3655r898K5206M050J4987J4673q100m5875
16332c7769l6543n431K409L7941K5782L7945J8692J1124O155j5210l6607K1632
16320C0120j4048j2110J5636j6721J803M563J2020j6519j4466J3799k8926l31
16308b5180J2722k29j6542M3345N737o7783k7216l380j5004m018K0693J7771L0820
16295b8264j5492k1201m96o642N823J8365M0449j8054j4847N834l467J2365O73
16282b4954L1467L466R328l8279k4854J6944k8195j4782J6329K7546P513Q443
16270a0028j4116N138O875r218k2210n711J8728J8767k4214M764P630J0222O9
16257a3304j5800J1174L3239K3602p007k0971O346j8330k1927O851m086m271J1397
$$ plain form
16244 -13087 -4508 -13360 -33069 -27278 -26815 5230 23496 16194 -2289 -14080 -34841 -29838 4893
16231 4893 15738 16537 932 -15370 -25328 -18828 8942 11794 20922 3092 -25209 -40606 -33202
16218 -33202 -51523 -52042 -41786 3733 46736 57703 47566 4508 -54310 -57299 -53106 -54063 -17671
16205 -17671 -4552 17904 872 -28775 -23659 -13439 -22907 -34210 -40989 -36568 -18218 -170
16193 -170 -5288 -11149 9461 -18951 -25821 -1252 -17718 -8785 9370 14542 15394 29808 44601
16180 44601 44012 17546 -2002 -6975 -7699 9585 -3401 -13715 -726 417 9108 12606 29976
16167 29976 53091 29454 2052 -24627 -42680 -36199 -35982 -35257 -11471 -3675 -31853 -45424 -45285
16154 -45285 -38066 -47500 -53884 -24386 -14662 -24146 -9543 -26810 -12265 42724 42107 12378 -2843
$$ packed form
16244a3087Q579q852j9709N791M63L2045J8266p302j8483j1791k0761N003L4731
16231D893J0845P99j5605j6302r958O500K7770K852R128j7830k8301j5397P404
16218c3202j8321n19J0256M5519M3003J0967j0137m3058n8818k989M193r57L6392
16205a7671J3119K2456j7032k9647N116J0220r468j1303o779M421J8350J8048
16193a70n118n861K0610k8412o870K4569j6466Q933J8155N172Q52J4414J4793
16180D4601n89k6466j9548m973p24J7284j2986j0314J2989J143Q691L498J7370
16167B9976K3115k3637k7402k6679j8053O481K17P25K3786P796k8178j3571J39
16154d5285P219r434o384K9498R724r484J4603j7267J4545N4989o17k9729j5221
$$ plain form
16141 -2843 -3353 1244 -10358 -19997 -6025 55153 91077 57017 3394 -4541 11139 9688 -12395
16128 -12395 -15388 10035 5975 31984 23329 7488 -5210 1273 -31592 -51370 -49541 -44465 -56695
16115 -56695 -72116 -41831 -9243 5259 -840 26829 26729 -25292 -8388 3327 -2201 -22967
16103 -22967 -33303 -21198 -24808 -3973 25814 33452 343 -12160 -19724 -14816 4465 424 -7982
16090 -7982 -13133 -20328 -6658 -14088 -32115 -60287 -33022 -25086 -22804 7323 56566 44171 12485
16077 12485 2720 51819 51222 24920 7078 -14059 -18379 -18804 -25195 -7902 28906 28863 9412 15578
16063 15578 13900 -8333 -24827 -23857 -13783 7856 32350 11068 22578 35593 18820 5422
16051 5422 -621 -28132 -34808 -50049 -31609 -17292 -14885 -21122 -4331 13207 40508 22002 1551
$$ packed form
16141b843n10M597j1602r639J3972O1178L5924l4060n3623p935J5680j451k2083
16128a2395k993K5423m060K6009q655j5841j2698O483l2865j9778J829N076j2230
16115e6695j5421L0285L2588J4502o099K7669j00n2021J6904J1715n528k0766
16103b2967j0336J2105l610K0835K9787P638l3109j2503p564M908J9281m041q406
16090g982n151p195J3670p430j8027k8172K7265P936K282L0127M9243j2395l1686
16077A2485r765M9099n97k6302j7842k1137m320m25o391J7293L6808m3j9451O166
16063A5578j678k2233j6494R70J0074K1639K4494k1282J1510J3015j6773j3398
16051E422o043k7511o676j5241J8440J4317K407o237J6791J7538K7301j8506k0451
$$ plain form
16038 1551 -52572 -68045 -29209 -8600 -20197 -31112 -64574 -79788 -62987 -61348 -82248 -28245
16026 -28245 1211 -4411 -6901 -33784 -38897 -3192 18973 16826 -14450 -36479 -22957 -5515
16014 -5515 16718 2943 20011 -3573 -18362 -33646 -23639 -3143 -10941 -10009 -4977 -19674 -6950
16001 -6950 11290 -9138 -20848 -14440 10677 5397 -38370 2302 207 -38861 -48726 -26730 -5986
15988 -5986 -11495 2332 14696 -13403 -18876 -30761 -47696 -40944 -9549 11745 -31410 -49494
15976 -49494 -20604 -6750 -22998 -29045 -59069 -52434 -64268 -89506 -75386 -18834 -5856 -6989
15964 -6989 -2529 14662 29556 19283 21133 30109 9671 -9897 -10575 -1439 13597 9291 -5098
15951 -5098 -22877 22126 46355 63588 61020 39417 49567 40116 30114 -3686 12710 1138
$$ packed form
16038A551n4123j5473L8836K0609j1597j0915l3462j5214J6801J639k0900N4003
16026b8245K9456n622k490k6883n113L5705K2165k147l1276k2029J3522J7442
16014e515K2233j3775J7068k3584j4789j5284J0007K0496p798R32N032j4697J2724
16001f950J8240k0428j1710O408K5117n280m3767M0672k095l9068r865K1996K0744
15988e986n509J3827J2364k8099n473j1885j6935O752L1395K1294m3155j8084
15976d9494K8890J3854j6248o047l0024O635j1834k5238J4120N6552J2978j133
15964f989M460J7191J4894j0273J850Q976k0438j9568o78R136J5036m306j4389
15951e098j7779M5003K4229J7233k568k1603J0150r451j0002l3800J6396j1572
$$ plain form
15939 1138 -3099 -10856 -21649 -55888 -59990 -42682 -29785 -9124 -30847 -60586 -37274 -8181
15927 -8181 17546 17938 38331 25993 43248 44372 -3595 -35128 -9826 25662 29218 47274 59337
15914 59337 26292 -7511 -15565 -17877 -23861 -24808 -8949 -9551 -18495 -21181 -40715 -13430 -17227 -28986
15900 -28986 -23389 -8453 -9612 -2293 -24641 -17904 -26823 -24190 -11336 -12940 -37595 -44769 -22346
15887 -22346 9211 22871 13544 9170 5135 19460 4307 1859 -3188 -17690 -17935 -17315 -11010 -22355
15873 -22355 -5007 12508 13615 -10189 -1685 3246 -20604 -22591 11028 -8109 -27259 -11475
15861 -11475 -11532 -6910 21913 29957 -21722 -75777 -73304 -30775 3337 16245 -6901 -1672 -887
15848 -887 5594 -24603 -62745 -59014 -28139 -40651 -38218 -33262 -44855 -32739 -2541 12182 -8888
$$ packed form
15939A138m237p757j0793l4239m102J7308J2897K0661k1723k9739K3312K9093
15927h181K5727L92K0393j2338J7255J124m7967l1533K5302L5488L556J8056J2063
15914E9337l3045l3803q054k312n984r47J5859o02q944k686j9534K7285l797j1759
15900b8986N597J4936j159P319k2348O737q919K633J2854j604k4655p174K2423
15887b2346L1557J3660r327m374m035J4325j5153k448n047j4502k45O20O305j1345
15873b2355J7348J7515J107k3804Q504M931k3850j987L3619j9137j9150J5784
15861a1475n7M622K8823Q044n1679n4055K473M2529L4112J2908k3146N229P85
15848h87O481l0197l8142L731L0875j2512K433M956j1593J2116L0198J4723k1070
$$ plain form
15835 -8888 -5383 -8432 -14842 -17400 -42739 -58489 -59724 -50555 -70958 -72055 -52709 -40222 -36930
15822 -36930 -9522 20232 45710 48183 4065 -11811 -3768 5934 15169 -26636 -15438 21669
15810 21669 4306 -34209 -3604 14585 6752 -2878 -13405 -17484 -12465 -371 46812 70347
15798 70347 52355 38969 12935 21902 -16546 -23015 -36505 -22285 -10872 12507 31559 56062
15786 56062 50714 3273 -38914 -64840 -73276 -60739 -54568 -61638 -34927 -15485 5298 27466
15774 27466 11608 9665 13704 -3524 -16021 -11642 -6406 -4594 7527 7969 -16119 4798 -9853
15761 -9853 -35863 -49152 -43801 -34967 -60829 -74603 -61151 -21907 -1716 -4940 -35023 14854
15749 14854 59196 29058 5469 -27088 -36754 -11276 19285 17337 26526 17651 -7057 -30465
$$ packed form
15835h888L505l049o410k558k5339j5750j235R169k0403j097J9346J2487L292
15822c6930K7408K9754K5478K473m4118j5876Q043R702R235m1805J1198L7107
15810B1669j7363l8515L0605J8189p833r630j0527m079N019J2094M7183K3535
15798G0347j7992j3386k6034Q967l8448o469j3490J4220J1413K3379J9052K4503
15786E6062n348m7441m2187k5926q436J2537O171p070K6711J9442K0783K2168
15774B7466j5858j943M039j7228j2497M379N236J812J2121M42k4088K0917j4651
15761i853k6010j3289N351Q834k5862j3774J3452L9244K0191l224l0083M9877
15749A4854M4342l0138k3589l2557r666K5478L0561j948R189q875k4708k3408
$$ plain form
15737 -30465 -56977 -39604 -8884 -19459 -32081 -43454 -42546 -34833 2673 17498 -8496 -33708
15725 -33708 -5658 -10817 -29451 -19044 -9934 -9123 -3863 -9032 10376 13458 -4169 -45338 -65071
15712 -65071 -68951 -54233 -51638 -60348 -87139 -82758 -44267 -22527 6737 12501 22347 19294 11875
15699 11875 17633 18415 11662 9671 -23405 -44803 -26106 -15646 -16343 -6256 4370 9769 16766
15686 16766 13787 786 -45 11162 -17964 -12584 -5628 9000 -12483 -10794 -17401 -34759 -7323
15673 -7323 -296 -25054 -45733 -53169 -29853 -20671 -5057 10124 14208 26958 29455 25926 24133
15660 24133 8317 -12190 -9664 3216 18147 4054 -12241 -22241 -26078 -14015 -2456 -16118
15648 -16118 -49998 -34623 -3400 29931 47999 43055 21035 15773 13201 33159 11935 -5249
$$ packed form
15737c0465k6512J7373L0720j0575j2622j1373R08P713L7506J4825k5994k5212
15725c3708K8050n159j8634J0407R110Q11N260n169J9408L082j7627m1169j9733
15712f5071l880J4718K595q710k6791M381L8491K1740K9264N764R846l053p419
15699A1875N758P82o753j991l3076k1398J8697J0460o97J0087J0626N399O997
15686A6766k979j3001q31J1207k9126N380O956J4628k1483J689o607j7358K7436
15673g323P027k4758k0679p436K3316R182J5614J5181M084J2750K497l529j793
15660B4133j5816k0507K526J2880J4931j4093j6295j0000l837J2063J1559j3662
15648a6118l3880J5375L1223L3331J8068m944k2020n262k572J9958k1224j7184
$$ plain form
15636 -5249 -35819 -28430 -13872 -26247 -70061 -51682 -30528 -11624 410 -10092 -15103 -21563
15624 -21563 -55716 -54017 -37858 -27497 -40307 -2727 22438 4011 1621 9065 -31703 -50852
15612 -50852 -28869 32565 48936 24557 3057 -14124 -17343 15537 -9957 -17645 -22544 -40759
15600 -40759 -33005 -22813 -24931 -59424 -71879 -64487 -51954 -40764 -42778 -27928 -30375 -40928 -30353
15587 -30353 -31024 -18755 25706 16188 -5233 -27340 -32966 -30033 -778 13945 -11986 6847 22693
15574 22693 6132 13765 54691 57398 44148 3733 -5187 25471 518 -2701 15781 18776 -9940
15561 -9940 -19272 26148 7364 -3359 21683 1784 -17280 -26824 -53259 -48880 -25067 -28364 -30049
15548 -30049 -33592 -42498 -49648 -50095 -63667 -61909 -46789 -23573 -26309 -25383 -16964 -41461 -44928 -27450
$$ packed form
15636e249l0570P389J4558j2375m3814J8379K1154J8904J2034j0502n011o460
15624b1563l4153J699J6159J0361j2810L7580K5165j8427k390P444m0768j9149
15612e0852K1983O1434J6371k4379k1500j7181l219L2880k5494p688m899j8215
15600d0759P754J0192k118l4493j2455P392J2533J1190k014J4850k447j0553J0575
15587c0353o71J2269M4461r518k1421k2107n626K933K9255J4723k5931J8833J5846
15574B2693j6561P633M0926K707j3250m0415q920L0658k4953l219J8482K995k8716
15561i940r332M5420j8784j0723K5042j9899j9064r544k6435M379K3813l297j685
15548c0049l543q906p150m47j3572J758J5120K3216k736R26Q419k4497l467J7478
$$ plain form
15534 -27450 -24665 -20573 -24248 -21733 -24294 -34590 -45087 -64396 -66836 -31001 11175 7142 -34973
15521 -34973 -24953 -21982 -7265 19493 -19711 -41135 -24336 7208 -2463 -38732 -47977 -43029
15509 -43029 -14039 -24118 -17749 -33664 -44756 -33526 -19070 16844 43620 35276 23627 23911
15497 23911 20298 -3810 -26441 -16051 -7439 5790 -51263 -69655 -66019 -50251 -44845 -20890
15485 -20890 21874 34632 35768 69005 61548 61585 69358 27729 20369 9260 8151 40225 30882
15472 30882 20201 39047 30639 24909 43537 56495 55337 29121 -3465 10807 1830 -19262
15460 -19262 -12279 -2540 8158 32786 48403 44548 14993 -18184 -32897 -32988 -15795 -12365 -4845
15447 -4845 -7591 -22362 -34820 -7425 -11382 -5128 14594 9633 -1326 9442 23797 -12114 -32906
$$ packed form
15534b7450K785M092l675K515k561j0296j0497j9309k440L5835M2176m033m2115
15521c4973J0020K971J4717K6758l9204k1424J6799L1544r671l6269r245M948
15509d3029K8990j0079O369j5915j1092J1230J4456L5914K6776q344j1649K84
15497B3911l613k4108k2631J0390Q612J3229n7053j8392L636J5768N406K3955
15485b0890M2764J2758J136L3237p457L7P773m1629p360j1109j109L2074r343
15472C0882j0681J8846q408n730J8628J2958j158k6216l2586J4272q977k1092
15460a9262O983R739J0698K4628J5617l855k9555l3177j4713r1J7193L430P520
15447d845k746j4771j2458K7395l957O254J9722m961j0959J0768J4355l5911k0792
$$ plain form
15434 -32906 -15468 -6002 -19425 -10182 -10294 -22196 -30582 -48546 -18685 -7108 -7744 4441 21398
15421 21398 5846 -15621 -5506 25908 24840 45511 43823 19458 17427 22340 44273 9011
15409 9011 -36452 11171 33939 -3371 -1328 -9766 13633 29082 24433 8189 13191 25114 -5757
15396 -5757 -11864 19335 43361 44031 37385 6432 5286 -3077 -42434 -43904 -32106 -16242 -5944
15383 -5944 9708 22643 -15387 -18136 -9176 -545 -6174 -19589 -35548 -24624 11711 17506 3613
15370 3613 -11653 -16171 -13227 -15171 -39748 -56251 -41694 -12751 8933 8910 -3881 -12115 -16097
15357 -16097 -25322 -28446 -41473 -3748 4558 -3957 -536 10495 15411 -16815 -28893 -61572 -42551
15344 -42551 -26604 -22778 -37813 -25742 14035 26475 39934 15756 -19856 -19255 -14039 1877
$$ packed form
15434c2906J7438R466j3423R243j12j1902q386j7964K9861J1577o36J2185J6957
15421B1398j5552k1467J0115L1414j068K0671j688k4365k031M913K1933l5262
15409I011m5463M7623K2768l7310K043q438K3399J5449m649j6244N002J1923l0871
15396e757o107L1199K4026O70o646l0953j146q363l9357j470J1798J5864J0298
15383e944J5652J2935l8030k749Q960Q631n629j3415j5959J0924L6335N795j3893
15370C613j5266m518K944j944k4577j6503J4557K8943K1684k3j2791q234l982
15357a6097r225l124j3027L7725Q306q515L421J1031M916l2226j2078l2679J9021
15344d2551J5947L826j5035J2071L9777J2440J3459k4178l5612O01N216J5916
$$ plain form
15332 1877 16933 22327 50738 46543 4288 -7443 -13665 -21980 6945 34726 45477 48954 30000
15319 30000 6712 7765 9337 16002 28125 36043 31550 23797 1769 11779 17941 28022 16641
15306 16641 1645 1866 -15905 -30010 -32996 -44606 -46160 -43644 -40400 -9893 -30073 -33897 -30554
15293 -30554 -11943 -4052 7398 -8146 -25313 -18146 5951 10294 1338 -17953 -17115 24021 31599
15280 31599 14551 27002 -17930 -42526 -35998 -35105 -36436 -13194 -13414 -11787 6034 20142 13023
15267 13023 32106 53696 26333 -1504 7529 12717 16970 22514 24450 32675 23818 5727 -3372
15254 -3372 -8613 -17313 -14029 -7481 -7916 -17004 -21304 -37162 -27760 -32079 -24203 -24401 -51993 -56768 -31648
15239 -31648 -39895 -53236 -36226 -14165 4135 -8794 20424 21547 45791 78833 58815 30167
$$ packed form
15332A877J5056N394K8411m195m2255j1731o222q315K8925K7781J0751L477j8954
15319C0000k3288J053J572O665J2123P918m493p753k2028J0010O162J0081j1381
15306A6641j4996K21j7771j4105k986j1610j554K516L244L0507k0180l824L343
15293c0554J8611P891J1450j5544j7167P167K4097M343q956j9291Q38M1136P578
15280C1599j7048J2451m4932k4596O528Q93j331K3242k20J627J7821J4108p119
15267A3023J9083K1590k7363k7837R033N188M253N544J936Q225q857j8091r099
15254c372n241q700L284O548m35r088m300j5858R402m319P876j98k7592m775K5120
15239c1648q247j3341J7010K2061J8300j2929K9218J123K4244L3042k0018k8648
$$ plain form
15227 30167 1912 -6686 -8664 5856 -13153 -18957 -52056 -58894 -36392 -23146 -21518 -35776 -37633
15214 -37633 -27693 -15615 -26501 900 35682 68311 59549 39527 13299 -2468 7091 37268
15202 37268 59959 29456 3794 -8474 1697 5138 -11029 -31186 -35675 -60929 -75867 -68861
15190 -68861 -39406 -7793 -15109 -43510 -64490 -33815 -5928 -19703 -8489 -8095 -28746 -42830
15178 -42830 -21797 -33870 -32048 -2321 8150 7677 -13551 -42704 -52389 -57053 -25256 -25470 -36294
15165 -36294 -20670 -7618 1127 -4626 20097 41274 17106 -12652 5571 23440 27500 -3367
15153 -3367 8111 31089 20813 10881 24593 61185 60554 77437 43352 18641 7771 12931 4638
15140 4638 2905 178 -6760 -24237 -23145 27932 39630 30418 41869 35720 30807 23416 -3311
$$ packed form
15227C0167k8255q598j978J4520j9009n804l3099o838K2502J3246J628j4258j857
15214c7633R940J2078j0886K7401L4782L2629q762k0022k6228j5767R559L0177
15202C7268K2691l0503k5662j2268J0171L441j6167k0157m489k5254j4938P006
15190f8861K9455L1613p316k8401k0980L0675K7887j3775J1214L94k0651j4084
15178d2830K1033j2073J822K9727J0471m73k1228k9153r685m664L1797k14j0824
15165c6294J5624J3052Q745n753K4723K1177k4168k9758J8223J7869M060l0867
15153c367J1478K2978j0276r932J3712L6592o31J6883l4085k4711j0870N160q293
15140D638j733k727o938j7477J092N1077J1698r212J1451o149m913p391k6727
$$ plain form
15127 -3311 14766 32939 28301 5976 -32177 -48728 -24437 -33311 -26666 -13818 -16937 -8127 10547
15114 10547 21836 46652 43163 8674 -4250 -19037 -7282 13864 453 -12664 -12663 -10040 -26648
15101 -26648 -35688 -57508 -70970 -92476 -69569 -36979 -27904 -36764 -21405 -18537 9153 3128 -7305
15088 -7305 -15347 -40219 -48795 -34938 -5 -9457 -12895 2188 14952 19643 17890 -798 -21389
15075 -21389 -11146 -22131 -3463 14059 -16277 -21292 -20675 -8268 6074 3675 -617 19213 -26567
15062 -26567 -11059 3095 -30653 -9523 12212 11073 19805 54946 48071 47245 53558 36864 -1788
15049 -1788 7859 12988 11060 40785 35364 15397 -17480 -12744 -18305 -29016 -25863 -46567 -47382 -12081
15035 -12081 6335 -13369 -37450 -64598 -65780 -31001 -4434 -7486 9264 31996 7772 -17101
$$ packed form
15127c311J8077J8173m638k2325l8153j6551K4291q874O645J2848l119Q810J8674
15114A0547J1289K4816l489l4489j2924j4787J1755K1146j3411j3117JK623j6608
15101b6648r040k1820j3462k1506K2907L2590R075q860J5359K868K7690o025j0433
15088g305q042k4872q576J3857L4933r452l438J5083J2764M691j753j8688k0591
15075b1389J0243j0985J8668J7522l0336n015O17J2407J4342k399m292J9830m5780
15062b6567J5508J4154l3748K1130K1735j139Q732L5141o875q26O313j6694l8652
15049a788R647N129j928K9725n421j9967l2877M736n561j0711L153k0704q15L5301
15035a2081J8416j9704k4081k7148j182L4779K6567l052J6750K2732k4224k4873
$$ plain form
15023 -17101 3089 40528 43093 -8884 -45744 -38225 -12882 -8613 -34949 -33168 -16481 15736
15011 15736 21164 10642 -7578 2599 -1815 -9155 -13050 -17626 -45505 -43034 -44427 -738 33301
14998 33301 10605 -3394 15311 3757 673 -12675 -6605 1306 2225 4303 -25273 -27818 -9395
14985 -9395 5880 21470 2550 -14404 -30799 -38204 -24335 -20566 -42794 -48716 -54063 -40362 -30452
14972 -30452 -37872 -33196 -3187 -8585 -11899 -2965 -30270 -38408 -39563 7311 6030 4386 17945
14959 17945 19766 27527 33996 20272 -27943 -16918 -13242 4627 14196 -7880 -26038 -18306 -20220
14946 -20220 -3841 18229 19107 8404 10394 21563 -21408 -30649 16128 2532 662 30446 48852
14933 48852 45284 69113 64510 61138 12238 29118 36900 32487 29842 28054 -2803 -18511 -28359
$$ packed form
15023a7101K0190L7439K565n1977l6860P519K5343M269k6336J781J6687L2217
15011A5736N428j0522j8220J0177m414p340l895m576k7879K471j393M3689L4039
14998C3301k2696j3999J8705j1554l084j3348O070P911R19K078k9576k545J8423
14985i395J5275J5590j8920j6954j6395p405J3869L769k2228n922n347J3701R910
14972c0452p420M676L0009n398l314Q934k7305q138j155M6874j281j644J3559
14959A7945J821P761O469j3724m8215J1025L676J7869R569k2076j8158P732j914
14946b0220J6379K2070Q78j0703J990J1169m2971r241M6777j3596j870K9784J8406
14933D8852l568K3829m603l372m8900J6880P782m413k645j788l0857j5708r848
$$ plain form
14920 -28359 -18152 -26435 -13358 24706 9184 -10513 -6061 -7701 -17818 -6407 -2121 12641
14908 12641 6564 -10266 -34806 -40505 -25053 -15167 7486 32424 35843 27798 23843 33670 51469
14895 51469 35808 41953 48581 22796 -23929 -29576 -28050 -3957 12052 25087 39451 36976 35931
14882 35931 49696 53686 34933 35664 82345 87266 67800 91612 101261 100064 92109 80045 56144
14869 56144 31440 -27560 -11192 24326 21282 49004 73014 63035 68986 97232 122351 123691
14857 123691 125393 104657 124820 136598 154883 231129 326388 455614 627660 863162 1129090
14846 1129090 1443973 1700188 1872429 1945129 1914877 1716844 1467452 1177964 899800 702520
14836 702520 574214 436163 349758 295170 248726 205388 179522 155872 113243 112104 138456
$$ packed form
14920b8359J0207q283J3077L8064j5522j9697M452j640j0117J1411M286J4762
14908A2641o077j6830k4540n699J5452R886K2653K4938L419q045l955R827J7799
14895E1469j5661O145O628k5785m6725n647J526K4093J6009J3035J4364k475j045
14882C5931J3765L990j8753P31M6681M921j9466K3812R649j197p955j2064k3901
14869E6144k4704n9000J6368L5518l044K7722K4010r979N951K8246K5119J340
14857A23691J702k0736K0163J1778J8285P6246R5259J29226J72046K35502K65928
14846A129090L14883K56215J72241P2700l0252j98033k49392k89488k78164j97280
14836G02520j28306j38051q6405n4588m6444m3338k5866k3650m2629j139K6352
$$ plain form
14825 138456 110685 83507 85889 39605 31114 33854 27875 15803 62204 112829 96947 64166
14813 64166 21790 24664 47225 62810 78926 72165 65417 51522 26034 17629 -20402 -20793 750
14800 750 30669 40763 34754 -23591 -46433 -23366 -6358 10843 7502 14963 36045 42337 22965
14787 22965 9945 2738 41274 59250 69986 73920 78730 91802 89515 142861 226174 257900
14775 257900 295155 313360 322137 380923 431075 436388 426911 394958 347466 284917 266274 231250
14763 231250 160435 101006 103644 96667 67249 82109 66486 49194 58931 61016 42796 40831
14751 40831 21014 19839 33642 47687 77177 44078 19786 17932 -14867 -26242 -14692 12424
14739 12424 7464 40767 39585 7999 -3579 -15529 -29576 -27470 -7583 9983 14150 20927 33084
$$ packed form
14825A38456k7771k7178K382m6284q491K740n979j2072M6401N0625j5882l2781
14813F4166m2376K874K2561J5585J6116o761o748j3895k5488q405l8031l91K1543
14800G50K9919J0094o009n8345k2842K3067J7008J7201l341P461K1082O292j9372
14787B2965j3020p207L8536J7976J0736L934M810J3072k287N3346Q3313L1726
14775B57900L7255J8205Q777N8786N0152N313r477l1953m7492o2549j8643l5024
14763B31250p0815n9429K638o977k9418J4860j5623j7292R737K085j8220j965
14751D0831j9817j175J3803J4045K9490l3099k4292j854l2799j1375J1550K7116
14739A2424m960L3303j182l1586j1578j1950j4047K106J9887J7566M167O777J2157
$$ plain form
14726 33084 39034 21226 1733 15944 10437 -6279 -9306 1378 17888 46840 74674 83631
14714 83631 70327 81091 85409 94087 81496 69243 66328 67438 77806 103887 132079 95665
14702 95665 77452 58112 60015 61396 33843 611 -37892 -54481 -67672 -55245 -27139 -31637
14690 -31637 -17886 6435 8481 31014 45276 26968 30088 23077 11490 51737 47714 44329 37759
14677 37759 19095 -2004 -27834 -24607 -6692 -1335 13367 -2647 29370 44343 52730 29799
14665 29799 6123 -5992 -13788 -3995 6878 17383 41325 34988 53741 82590 113563 139013
14653 139013 151654 153566 202856 238081 274038 321160 316635 306289 281568 200518 128789 81559
14641 81559 67477 81806 78308 53721 43128 39261 17662 -8507 -8760 11236 53878 73238
$$ packed form
14726C3084N950j7808j9493J4211n507j6716l027J0684J6510K8952K7834Q957
14714H3631j3304J0764M318Q678j2591j2253k915J110J0368K6081K8192l6414
14702I5665j8213j9340J903J381k7553l3232l8503j6589j3191J2427K8106m498
14690c1637J3751K4321K046K2533J4262j8308L120p011j1587M0247m023l385o570
14677C7759j8664k1099k5830L227J7915N357J4702j6014L2017J4973Q387k2931
14665B9799k3676j2115p796R793J0873J0505K3942o337J8753K8849L0973K5450
14653A39013J2641J912M9290L5225L5957M7122m525j0346k4721q1050p1729m7230
14641H1559j4082J4329l498k4587j0593l867k1599k6169k53J9996M2642J9360
$$ plain form
14629 73238 83515 76232 70584 82759 44370 31373 41713 22976 29413 28092 43919 21030
14617 21030 -1137 -6755 -7455 20173 72726 99284 94215 69365 55548 40903 49947 41536 25023
14604 25023 23716 37454 43444 42308 33822 21892 22131 45583 78137 64324 33011 29541 34509
14591 34509 47508 88428 87613 62281 45532 46271 65357 76182 97255 90507 80274 100087 122277
14578 122277 123962 73943 41579 28790 40655 39960 59979 64145 79911 90273 82710 79173 83308
14565 83308 67094 47548 31521 39311 27368 29193 23035 38133 35348 25546 40008 59551 82348
14552 82348 125611 103845 76818 94813 126628 132522 115506 129385 163694 171095 159364 147290
14540 147290 175663 185491 176131 195035 192778 172433 196492 230485 256694 255285 270678 297158
$$ packed form
14629G3238J0277p283n648J2175l8389j2997J0340j8737O437j321J5827k2889
14617B1030k2167n618p00K7628N2553K6558n069k4850j3817j4645R044q411j6513
14604B5023j307J3738N990j136q486j1930K39K3452L2554j3813l1313l470M968
14591C4509J2999M0920q15k5332j6749P39J9086J0825K1073o748j0233J9813K2190
14578A22277J685n0019l2364j2789J1865o95K0019M166J5766J0362p563l537M135
14565H3308j6214j9546j6027P790j1943J825o158J5098k785r802J4462J9543K2797
14552H2348M3263k1766k7027J7995L1815N894j7016J3879L4309P401j1731j2074
14540A47290K8373R828r360J8904k257k0345K4059L3993K6209j409J5393K6480
$$ plain form
14528 297158 364334 416737 473788 528516 592051 634713 652269 623019 553535 506677 457038
14517 457038 365514 278352 226953 219702 203062 167662 117429 88638 106596 107233 116745 125741
14505 125741 138056 135953 132060 151410 166685 170252 157099 142335 148044 146336 152076 143452 143170
14492 143170 130989 106670 109662 121028 142116 183034 199797 201386 202634 206929 212027 253230
14480 253230 259226 261457 248391 243532 285873 296616 327032 329107 337199 349580 345453 319683 300773
14467 300773 338992 369041 390171 422098 458802 440297 437068 470568 494651 526869 523395 524100
14455 524100 522371 510612 533231 562648 593344 601099 617267 679416 725682 745386 773162 807275
14443 807275 822685 864005 929020 990805 1088677 1167508 1281115 1329883 1388135 1438756 1512540
$$ packed form
14528B97158O7176N2403N7051N4728O3535M2662J7556k9250o9484m6858m9639
14517D57038r1524q7162n1399p251j6640l5400n0233k8791J7958O37R512Q996
14505A25741J2315k103l893J9350J5275L567j3153j4764N709j708N740q624k82
14492A43170j2181k4319K992J1366K1088M0918J6763J589J248M295N098M1203
14480B53230N996K231j3066m859M2341J0743L0416K075Q092J2381m127k5770j8910
14467C00773L8219L0049K1130L1927L6704j8505l229L3500K4083L2218l474P05
14455E24100j729j1759K2619K9417L0696P755J6168O2149M6266J9704K7776L4113
14443H07275J5410M1320O5015O1785R7872P8831J13607M8768N8252N0621P3784
$$ plain form
14432 1512540 1619447 1698227 1772735 1851059 1979591 2148449 2316326 2477942 2673804 2914727
14422 2914727 3155495 3440475 3774579 4196227 4689057 5346637 6282760 7473490 8902823
14413 8902823 10552093 12336376 14100815 15782712 17338887 18925861 20771943 23252126
14405 23252126 26966236 32702391 41677535 55919888 78407035 112153707 157774200
14398 157774200 213032881 272576130 326702495 364563063 377644553 363626627 326044431
14391 326044431 272905692 214875340 161209993 118087193 87030475 66169365 52600191
14384 52600191 43694570 37663512 33394399 30274575 27821011 25671561 23528227 21301825
14376 21301825 18984407 16655056 14412068 12409782 10759296 9431683 8347857 7445295
$$ packed form
14432A512540J06907P8780P4508P8324J28532J68858J67877J61616J95862K40923
14422B914727K40768K84980L34104M21648M92830O57580R36123J190730J429333
14413H902823J649270J784283J764439J681897J556175J586974J846082K480183
14405B3252126L714110N736155Q975144J4242353K2487147L3746672M5620493
14398A57774200N5258681N9543249N4126365L7860568J3081490j4017926l7582196
14391C26044431n3138739n8030352n3665347m3122800l1056718k0861110j3569174
14384E2600191q905621o031058m269113l119824k453564k149450k143334k226402
14376B1301825k317418k329351k242988k002286j650486j327613j083826r02562
$$ plain form
14368 7445295 6699921 6113621 5590719 5131372 4741798 4401967 4070449 3744769 3473470
14359 3473470 3249192 3049975 2850445 2655296 2494311 2354111 2214065 2104735 2030921 1928337
14349 1928337 1855237 1796519 1714089 1614469 1546973 1501782 1434541 1362789 1270914 1234996 1219966
14338 1219966 1194497 1153240 1111503 1070609 1024450 1002430 974532 928737 901125 882149 872284
14327 872284 879466 852487 799098 781205 770168 736199 720826 703393 675505 673659 656890 636644
14315 636644 617885 616421 600745 584627 565101 534375 523167 546559 495750 470192 474598 495424
14303 495424 492840 501830 501012 500583 484470 474288 475902 514882 529153 488255 448399 428720 377631
14290 377631 350706 382604 419665 415839 424015 437847 474296 430784 391554 426293 433885 442399
$$ packed form
14368G445295p45374n86300n22902m59347l89574l39831l31518l25680k71299
14359C473470k24278j99217j99530j95149j60985j40200j40046j09330p3814j02584
14349A928337p3100n8718q2430r9620o7496m5191o7241p1752r1875l5918j5030
14338A219966k5469m1257m1737m0894m6159k2020k7898m5795k7612j8976r865
14327H72284P182k6979n3389j7893j1037l3969j5373j7433k7888j846j6769k0246
14315F36644j8759j464j5676j6118j9526l0726j1208K3392n0809k5558M406K0826
14303D95424k584Q990q18m29j6113j0182J614L8980J4271m0898l9856j9679n1089
14290C77631k6925L1898L7061l826Q176J3832L6449m3512l9230L4739P592Q514
$$ plain form
14278 442399 449236 434674 439193 474250 524802 595895 615182 591269 574752 536557 510801 417043
14266 417043 331537 260878 213028 193238 200907 203386 202944 173141 165878 185790 218094 224165 189960
14253 189960 191496 183504 164491 163510 157646 162809 182372 152700 112030 108688 120908 117728 129313
14240 129313 141098 129335 154993 164360 167695 186244 199063 232068 264141 239946 211286 244630
14228 244630 272665 259043 203679 185628 191606 183580 144920 155325 140426 129129 132599 135786
14216 135786 142199 146915 140232 155960 145419 119060 64667 29212 39664 59646 66567 77126
14204 77126 102492 79033 70274 108473 123866 130711 125928 118883 99730 99637 89629 66360 83627
14191 83627 92864 101133 97924 86917 81040 77129 118374 147797 127657 97912 82538 98226 96991
$$ packed form
14278D42399O837j4562M519L5057N0552P1093J9287k3913j6517l8195k5756r3758
14266D17043q5506p0659m7850j9790P669K479m42k9803p263J9912L2304O071l4205
14253A89960J536p992j9013r81n864N163J9563k9672m0670l342J2220l180J1585
14240A29313J1785j1763K5658R367L335J8549J2819L3005L2073k4195k8660L3344
14228B44630K8035j3622n5364j8051N978q026l8660J0405j4899j1297L470L187
14216A35786O413M716o683J5728j0541k6359n4393l5455J0452J9982O921J0559
14204G7126K5366k3459q759L8199J5393O845m783p045j9153r3j0008k3269J7267
14191H3627R237Q269l209j1007n877l911M1245K9423k0140k9745j5374J5688j235
$$ plain form
14178 96991 118484 107339 101833 130617 149905 144362 143575 148466 143058 118969 127801 135207 155860
14165 155860 161113 147222 134611 122725 131949 94152 75968 80282 51261 51056 59134 82204 73336
14152 73336 40310 76047 86479 98563 81861 88634 104771 122659 125901 131657 82594 63630
14140 63630 73589 86351 93736 68206 79733 92970 127391 128860 110114 110174 94353 62959 58477
14127 58477 63827 74473 89557 78358 87179 110701 113546 106653 107021 105205 106359 84926 86272
14114 86272 89629 108914 132967 116365 104746 99761 72114 51427 61953 78792 84148 78457
14102 78457 85030 75102 101955 124417 144064 167511 158774 160192 147559 120120 104719 71117
14090 71117 75082 72446 29603 1361 -17113 -16560 -4749 20656 6347 -3446 14343 20066 18599
$$ packed form
14178I6991K1493j1145n506K8784J9288n543p87M891n408k4089Q832P406K0653
14165A55860N253j3891j2611j1886R224l7797j8184M314k9021k05Q078K3070q868
14152G3336l3026L5737J0432J2084j6702O773J6137J7888L242N756m9063j8964
14140F3630R959J2762P385k5530J1527J3237L4421J469j8746O0j5821l1394m482
14127E8477N350J0646J5084j1199Q821K3522K845o893L68j816J154k1433J346
14114H6272L357J9285K4053j6602j1619m985k7647k0687J0526J6839N356n691
14102G8457O573r928K6853K2462J9647K3447q737J418j2633k7439j5401l3602
14090G1117L965k636m2843k8242j8474N53J1811K5405j4309r793J7789N723j467
$$ plain form
14077 18599 7273 -26072 -28589 2149 17779 2438 15886 18808 40774 34811 24212 31694
14065 31694 31485 35218 18191 38894 43143 40490 46899 30783 14131 23536 47649 46253 24159
14052 24159 17579 16042 32093 40878 39005 37373 39817 50981 30338 18163 -11433 -3078 16299
14039 16299 53077 58477 52384 46704 39462 59436 42230 18493 -97 988 6130 45176 45207
14026 45207 45021 21723 11527 12141 23498 30825 38811 49775 27670 27788 20070 15285 32973 32384
14012 32384 36285 44178 48347 27613 10872 -2396 142 4146 24928 59383 62747 41172 24683
13999 24683 15589 17784 8378 22635 52826 115389 121010 83382 37981 42378 51985 57433 93069
13986 93069 79560 55827 38738 8664 8207 4535 16287 34123 55257 67030 62424 31827
$$ packed form
14077A8599j1326l3345k517L0738J5630j5341J3448K922K1966n963j0599P482
14065C1694k09L733j7027K0703M249k653O409j6116j6652R405K4113j396k2094
14052B4159o580j537J6051Q785j873j632K444J1164k0643j2175k9596Q355J9377
14039A6299L6778N400o093n680p242J9974j7206k3737j8590J085N142L9046L1
14026D5207j86k3298j0196O14J1357P327P986J0964k2105J18p718m785J7688n89
14012C2384L901P893M169k0734j6741j3268K538M004K0782L4455L364k1575j6489
13999B4683r094K195r406J4257L0191O2563N621l7628m5401M397R607N448L5636
13986I3069j3509k3733j7089l0074m57l672J1752J7836K1134J1773m606l0597
$$ plain form
13974 31827 21618 47558 61403 31916 17060 16133 34954 48960 65700 65636 77273 97742 86816
13961 86816 79592 86925 115501 133705 171020 172598 172195 151038 140654 154151 124942 150118 218950
13948 218950 264974 311282 412406 602180 838059 1137034 1468726 1783982 2026546 2132090
13938 2132090 2105067 1960243 1698996 1398902 1112771 831138 598749 461565 378310 316790
13928 316790 258036 199916 190787 196362 191036 183719 161173 141804 124612 88674 38026 41123
13916 41123 81123 82546 80823 56166 34144 66277 81546 95828 59299 53899 64140 53838
13904 53838 45624 28415 32580 17862 17798 37504 24105 -158 14380 25421 12711 -1564 3966
13891 3966 16537 26624 44395 50741 59867 58605 41972 27997 17191 22698 64290 86799 67627
$$ packed form
13974C1827j0209K5940J3845k9487j4856r27J8821J4006J6740o4J1637K0469j0926
13961H6816p224P333K8576J8204L7315J578m03k1157j0384J3497k9209K5176O8832
13948B18950M6024M6308J01124J89774K35879K98975L31692L15256K42564J05544
13938B132090k7023j44824k61247l00094k86131k81633k32389j37184q3255o1520
13928C16790n8754n8120r129N575n326p317k2546j9369j7192l5938n0648L097
13916D1123M0000J423j723k4657k2022L2133J5269J4282l6529n400J0241j0302
13904E3838q214j7209M165j4718o4J9706j3399k4263J4538J1041j2710j4275N530
13891C966J2571J0087J7771O346R126j262j6633j3975j0806N507M1592K2509j9172
$$ plain form
13878 67627 43507 75137 97555 74091 69382 84788 101875 90270 79027 59366 52903 40283
13866 40283 62085 90082 77304 61599 51419 55164 67111 72363 62553 34924 28470 40964
13854 40964 38815 23526 43898 73903 57171 64873 49484 30644 34761 27889 40543 20765
13842 20765 21356 24601 12759 19259 52688 64519 75924 74403 81170 73519 68815 41904 25859
13829 25859 8243 -9865 -1278 41230 20048 -5367 33859 92712 87416 68947 43807 23182
13817 23182 5387 15455 35230 54252 55116 47303 55887 67788 59706 23041 14008 -8292 16320
13804 16320 8841 19999 27473 -12653 -12475 8010 5883 1233 -1343 -20465 -45423 -70693 -48746
13791 -48746 485 7765 3837 17329 14020 41144 35634 33864 46066 67470 49673 18973 40262
$$ packed form
13878F7627k4120L1630K2418k3464m709J5406J7087j1605j1243j9661o463j2620
13866D0283K1802K7997j2778j5705j0180L745J1947N252r810k7629o454J2494
13854D0964k149j5289K0372L0005j6732P702j5389j8840M117o872J2654j9778
13842B0765N91L245j1842O500L3429J1831J1405j521O767p651m704k6911j6045
13829B5859j7616j8108Q587M2508k1182k5415L9226N8853n296j8469k5140k0625
13817B3182j7795J0068J9775J9022Q64p813Q584J1901q082l6665r033k2300K4612
13804A6320p479J1158P474m0126J78K0485k127m650k576j9122k4958k5270K1947
13791d8746M9231P280l928J3492l309K7124n510j770J2202K1404j7797l0700K1289
$$ plain form
13778 40262 43841 32093 58100 73913 73967 53210 35248 29803 39287 44863 23145 33557 22487
13765 22487 33120 38419 41013 75430 66781 21821 4367 -1704 -21610 -33926 1765 32559
13753 32559 45686 21444 12236 44990 67977 49185 18964 21225 11547 6423 16469 45258
13741 45258 40451 48353 54299 32018 -9462 -22455 6128 22089 20608 44338 61051 40949
13729 40949 29133 19364 13681 12880 18584 49468 31234 12016 12907 42779 33614 24642 4173
13716 4173 -21185 -21093 -28809 -9100 6838 25576 13139 -8644 -9161 11417 9507 21997 23062
13703 23062 -6283 -28078 -25526 2280 19272 12277 55645 48197 26421 21760 23607 32273 23251
13690 23251 6442 -9963 -37619 -24604 19071 42957 38263 38122 13391 516 6961 11770 2266
$$ packed form
13778D0262L579j1748K6007J5813N4k0757j7962n445R484N576k1718J0412j1070
13765B2487J0633N299K594L4417q649m4960j7454o071j9906j2316L5691L0794
13753C2559J3127k4242r208L2754K2987j8792l0221K261r678n124J0046K8789
13741D5258m807P902N946k2281m1480j2993K8583J5961j481K3730J6713k0102
13729D0949j1816r769n683q01N704L0884j8234j9218Q91K9872r165q972k0469
13716D173k5358R2p716J9709J5938J8738j2437k1783n17K0578j910J2490J065
13703B3062k9345k1795K552K7806J6992o995M3368p448k1776m661J847Q666r022
13690B3251j6809j6405k7656J3015M3675K3886m694j41k4731j2875O445M809r504
$$ plain form
13677 2266 15483 18668 22197 33488 51168 32258 35807 21641 15476 6687 20661 33830 23239
13664 23239 64646 89197 46568 50394 66260 61653 67173 59832 59137 47064 22656 28040 49153
13651 49153 40352 16761 -11634 -21475 -24588 -18753 2843 -14346 -12978 -22263 -6611 -3950 -572
13638 -572 3330 12831 11567 14916 943 24261 44502 58067 57574 58307 38763 26659 -8481 -46722
13624 -46722 -30152 -8428 5189 -9185 -3444 10973 -2061 -7869 -6523 -9867 14503 -1038
13612 -1038 14396 18040 4772 6147 37986 28775 43393 24687 13262 26498 16349 -2145
13600 -2145 -3937 10563 51635 55293 21795 5115 10616 -2886 -19902 15599 53177 59666 24473
13587 24473 -3129 6382 25395 22075 3665 1398 -10771 21560 9845 -17706 3202 20599
$$ packed form
13677B266J3217L185L529J1291J7680j8910L549j4166o165q789J3974J3169j0591
13664B3239M1407K4551m2629L826J5866m607N520p341o95j2073k4408N384K1113
13651D9153q801k3591k8395r841l113N835K1596j7189J368r285J5652K661L378
13638e72L902R501j264L349j3973K3318K0241J3565m93P33j9544j2104l5140l8241
13624d6722J6570K1724J3617j4374N741J4417j3034n808J346l344K4370j5541
13612a038J5434L644j3268J375L1839r211J4618j8706j1425J3236j0149j8494
13600b145j792J4500M1072L658l3498j6680N501j3502j7016L5501L7578O489l5193
13587B4473k7602R511J9013l320j8410k267j2169L2331j1715k7551K0908J7397
$$ plain form
13575 20599 15708 -15231 -29781 -51952 -45623 -17834 -4565 -25408 -27339 -23241 -4841 12932
13563 12932 40157 53937 31307 37675 23759 27629 39384 19816 -955 -13720 -13623 -22374 -17150
13550 -17150 -18426 -23656 -2622 -1000 -24921 -5593 -14353 -17073 -22582 252 25212 32874 12458
13537 12458 20218 24673 12799 -21347 -25355 13211 38171 19114 20691 32658 29397 40355 50919
13524 50919 31151 -1390 -18890 3553 4766 3801 12219 24538 14077 -1023 8611 6363 26282
13511 26282 6795 3378 -16480 -36983 -12999 -24423 -25245 -10693 -18319 12906 6630 1595 12346
13498 12346 -24838 -33555 -5426 12178 29566 29377 -16400 -20133 -5100 -3502 998 3695 -1183
13485 -1183 9764 20714 20498 60000 55213 31286 37888 36210 11402 11196 31397 50553 48009
$$ packed form
13575B0599m891l0939j4550k2171O329K7789J3269k0843j931M098J8400J7773
13563A2932K7225J3780k2630O368j3916L870J1755j9568k0771j2765R7q751N224
13550a7150j276n230K1034J622k3921J9328q760k720n509K2834K4960P662k0416
13537A2458P760M455j1874l4146m008L8566K4960j9057J577J1967l261J0958J0564
13524E0919j9768l2541j7500K2443J213r65Q418J2319j0461j5100R634k248J9919
13511B6282j9487l417j9858k0503K3984j1424q22J4552p626L1225o276n035J0751
13498A2346l7184q717K8129J7604J7388j89m5777l733J5033J598M500K697m878
13485a183J0947J0950k16L9502m787k3927O602j678k4808k06K0201J9156k544
$$ plain form
13472 48009 74530 88803 43327 2753 11406 1911 298 -17978 4286 9692 8969 876 1238
13459 1238 -27587 -24125 -36725 -30964 -1374 2780 3533 3432 9285 7971 18314 16183 -1583 -9441
13445 -9441 -6695 26359 47642 22281 24687 19583 -3956 -7353 -13591 -3807 -3608 22161 29108 27064
13431 27064 7585 -4916 25773 24137 -11499 -28378 3317 40902 39174 19972 37101 31710
13419 31710 22919 -1889 -12880 562 21097 28684 39165 26227 31280 52843 52873 36493 20124
13406 20124 27687 22323 286 27168 21778 -15031 -13541 6702 17927 3513 -18534 -20905 -10848
13393 -10848 -3175 19360 40450 50706 29508 20942 15400 11464 14277 22335 21993 39189 18397
13380 18397 3583 23990 35521 44622 30724 21326 32341 23619 13205 -6310 -8107 -16324 -3703
$$ packed form
13472D8009K6521J4273m5476m0574Q653r495j613j8276K2264N406p23q093L62
13459A238k8825L462j2600N761K9590M154P53j01N853j314J0343k131j7766p858
13445i441K746L3054K1283k5361K406n104k3539l397o238R784J99K5769O947k044
13431B7064j9479j2501L0689j636l5636j6879L1695L7585j728j9202J7129n391
13419C1710q791k4808j0991J3442K0535P587J0481j2938N053K1563L0j6380j6369
13406B0124P563n364k2037K6882n390l6809J490K0243J1225j4414k2047k371J0057
13393a0848P673K2535K1090J0256k1198q566n542l936K813Q058l42J7196k0792
13380A8397j4814K0407J1531R101j3898r398J1015q722j0414j9515j797q217J2621
$$ plain form
13367 -3703 13438 -5006 9365 14951 46007 51762 41206 35541 -1472 -3816 21460 13368 9466
13354 9466 33379 26715 17299 33243 5893 8197 17583 15324 -4183 1470 -18533 -20852 -5464
13341 -5464 13399 -15845 -9912 21336 8601 -19260 -31430 -58957 -63189 -41148 -18998 -4133
13329 -4133 2462 8854 1785 -3775 18557 15644 6426 -27203 -58569 -41243 -49049 -51302 -62455
13316 -62455 -41280 -1672 15547 23866 40605 8902 12523 38609 33192 22635 32597 57445
13304 57445 51786 30368 8661 -5387 -16233 -16569 -17661 -17056 626 22315 8508 13275 -9638
13291 -9638 -22807 -43063 -43655 -3344 15714 19898 11574 29583 15747 11947 27250 37863 43514
13278 43514 49142 54550 62411 10260 -39752 3752 22688 31169 14583 7030 -1358 -10077 -3746
$$ packed form
13367c703J7141j8444J4371N586L1056N755j0556n665l7013k344K5276q092l902
13354I466K3913o664r416J5944k7350K304R386k259j9507N653k0003k319J5388
13341e464J8863k9244N933L1248j2735k7861j2170k7527m232K2041K2150J4865
13329d133O595O392p069n560K2332k913r218l3629l1366J7326p806k253j1153
13316f2455K1175L9608J7219Q319J6739l1703L621K6086n417j0557R962K4848
13304E7445n659k1418k1707j4048j0846l36j092O05J7682K1689j3807M767k2913
13291i638j3169k0256n92M0311J9058M184q324J8009j3836l800J5303J0613N651
13278D3514N628N408P861n2151n0012M3504J8936Q481j6586p553q388q719O331
$$ plain form
13265 -3746 31443 33278 18745 4307 -3335 -13396 -10536 15423 18374 -8986 -21366 -12789 -3654
13252 -3654 9830 28450 10440 -11467 4087 12889 -480 -7079 25170 13832 -3118 -23812
13240 -23812 -34322 -24693 -33829 -31387 6994 11602 25993 46041 54263 50961 43679 46616 37294
13227 37294 25530 21356 10774 8449 9040 -709 -21888 -30514 -8927 29940 20427 32268 12530
13214 12530 -6773 17946 9214 4496 -12334 -9289 -5269 -2901 -10819 2886 5985 19222 -6613
13201 -6613 -15879 -12824 -4537 9178 -1684 -12787 15769 47429 31471 21897 21109 27069 17553
13188 17553 20019 42764 72501 53936 368 -34107 -37706 -18359 -10660 -27693 -36477 -42126 -29228
13175 -29228 -28904 -5894 -6398 5882 20969 13297 14385 5360 -4087 -8491 -41990 -48778 -37433 -52727
$$ packed form
13265c746L5189J835j4533j4438p642j0061K860K5959K951k7360j2380Q577R135
13252c654J3484J8620j8010k1907J5554Q802j3369o599L2249j1338j6950k0694
13240b3812j0510R629r136K442L8381M608J4391K0048Q222l302p282K937r322
13227C7294j1764m174j0582k325N91r749k1179q626K1587L8867r513J1841j9738
13214A2530j9303K4719q732m718j6830L045M020K368p918J3705L099J3237k5835
13201f613r266L055Q287J3715j0862j1103K8556L1660j5958r574p88N960r516
13188A7553K466K2745K9737j8565n3568l4475l599J9347P699j7033q784n649J2898
13175b9228L24K3010n04J2280J5087p672J088r025r447m404l3499o788J1345j5294
$$ plain form
13161 -52727 -76381 -64374 -33047 -4196 7888 -16499 -10312 1678 7725 11966 39446 41630
13149 41630 31401 5008 -18957 -26594 -4311 -18388 -30749 -61540 -82810 -36139 -20726 -7200
13137 -7200 -3098 10541 19059 32353 38387 12835 8424 47855 79709 81383 54050 6046 -39789
13124 -39789 -32676 -7366 13974 6960 -9630 19904 11347 -17725 -53455 -33418 -18491 -25403
13112 -25403 -25522 -11975 -25990 -7305 -17918 -31181 -34495 -4464 -6166 10678 12297 4182 -3485
13099 -3485 -12011 3947 11295 30726 2200 -20579 -32009 -29813 -50499 -28305 -10364 31185
13087 31185 17998 -12808 -9308 12213 -12564 -18476 -8997 18308 31187 3155 2845 -13001 22736
13074 22736 56396 34831 9887 7931 -16251 -6989 -9322 -17629 -4628 -15019 -53546 -48803 -24157
$$ packed form
13161e2727k3654J2007L1327K8851J2084k4387O187J1990O047M241K7480K184
13149D1630j0229k6393k3965p637K2283j4077j2361l0791k1270M6671J5413J3526
13137g200M102J3639Q518J3294O034k5552m411L9431L1854J674k7333m8004m5835
13124c9789P113K5310K1340p014j6590K9534q557k9072l5730K0037J4927o912
13112b5403j19J3547j4015J8685j0613j3263l314L0031j702J6844J619q115p667
13099c485q526J5958P348J9431k8526k2779j1430K196k0686K2194J7941M1549
13087C1185j3187l0806L500K1521k4777n912R479K7305J2879k8032l10j5846L5737
13074B2736L3660k1565k4944j956k4182R262k333q307J3001j0391l8527M743K4646
$$ plain form
13061 -24157 -19998 -22841 -3598 51499 49955 14442 -33233 -6015 -3534 12905 12627 13027 9766
13048 9766 -25455 -5398 10882 7134 14183 18969 7047 -1011 11036 15582 24385 14609 17120
13035 17120 14823 20531 12998 -154 -13309 -18286 -18533 -9628 8658 -461 -5636 -20287 -13902 -11774
13021 -11774 -8310 -12808 -33606 -37505 -10909 3307 11276 -2357 -42325 -15178 22710 9083
13009 9083 3729 8404 1522 15569 3710 -12282 -29268 -39276 -2744 -52 -1695 21592 5822
12996 5822 -5343 11843 30296 30931 34120 25729 -850 -28159 -11396 23220 24249 26983 16562
12983 16562 25465 38785 21185 31431 51661 40638 32254 16993 5314 4651 4448 12026 27344
12970 27344 51033 32175 11152 10289 24527 43486 24054 6990 28621 50542 56664 22570
$$ packed form
13061b4157M159k843J9243N5097j544l5513m7675K7218K481J6439k78M00l261
13048I766l5221K0057J6280l748P049M786j1922q058J2047M546Q803r776K511
13035A7120k297N708p533j3152j3155m977k47Q905J8286r119n175j4651O385K128
13021a1774L464m498k0798l899K6596J4216P969j3633l9968K7147L7888j3627
13009I083n354M675o882J4047j1859j5992j6986j0008L6532K692j643K3287j5770
12996E822j1165J7186J8453O35L189q391k6579k7309J6763L4616J029K734j0421
12983A6562Q903J3320j7600J0246K0230j1023q384j5261j1679o63k03P578J5318
12970B7344K3689j8858k1023q63J4238J8959j9432j7064K1631K1921O122l4094
$$ plain form
12958 22570 2824 -30148 -19708 -2000 3158 -9372 85 24019 39501 15685 -12999 -45848
12946 -45848 -38180 -6164 2461 2548 -23026 -27291 -27217 21836 13960 23998 27351 29731 -9164 -3937
12932 -3937 -7093 -16107 5607 -7266 -52031 -44187 -36693 -34066 -15808 -22380 -7531 18708 27666
12919 27666 7352 9465 18129 -20471 -29581 -27848 -14668 -4693 10972 17749 13619 19783 33512
12906 33512 38278 53636 68497 41530 44141 61632 77144 74659 66252 67223 70219 70037 73694 46805
12892 46805 23094 -2190 -17141 -23162 13867 11064 -22278 -25382 11443 23230 7760 13848
12880 13848 20186 31351 8094 16134 35940 24729 16615 9702 3479 -10917 19510 38273 20757
12867 20757 -8053 -32479 -37601 3923 10742 13903 -9149 -27838 -63276 -39692 -33870 -56609
$$ packed form
12958B2570j9746l2972J0440J7708N158j2530R457K3934J5482k3816k8684l2849
12946d5848P668L2016Q625Q7k5574m265P4M9053p876J0038L353K380l8895N227
12932c937l156r014K1714j2873m4765P844P494K627J8258o572J4849K6239Q958
12919B7666k0314K113Q664l8600r110J733J3180R975J5665O777m130O164J3729
12906C3512M766J5358J4861k6967K611J7491J5512k485q407R71K996j82L657k6889
12892D6805k3711k5284j4951o021L7029k803l3342l104L6825J1787j5470O088
12880A3848O338J1165k3257Q040J9806j1211q114o913o223j4396L0427J8763j7516
12867B0757k8810k4426n122M1524O819L161k3052j8689l5438K3584N822k2739
$$ plain form
12855 -56609 -35598 -13073 14765 20354 23925 41573 63955 49992 47537 45267 41593 14574 9323
12842 9323 -7073 -36704 -18823 -12113 -5329 29161 53245 62708 27854 38194 36216 21308 18154
12829 18154 22552 2643 3364 3701 -3629 -20544 -14509 -15078 -14137 5348 12768 2056 -7628 -33142
12815 -33142 -28363 21474 39718 10653 21923 72 -10332 16537 30332 16103 9841 15691
12803 15691 15319 6112 25724 20644 -4585 -28843 -16822 -6214 15177 40350 31654 15849 15470
12790 15470 6881 -13857 -38705 -53855 -41728 -40001 -33185 -45723 -31501 -2223 -19048 -46383
12778 -46383 -19284 10192 38738 54224 35190 19789 7231 29318 7115 -26538 -27600 -3899
12766 -3899 12743 -22858 -48257 -44308 -53933 -63954 -30681 -29221 -31713 -30937 -18169 -3840 16546
$$ packed form
12855e6609K1011K2525K7838N589L571J7648K2382j3963k455k270l674k7019n251
12842I323j6396k9631J7881O710O784L4490K4084R463l4854J0340j978j4908l154
12829A8154M398j9909P21L37p330j6915O035n69R41J9485P420j0712r684k5514
12815c3142M779M9837J8244k9065J1270k1851j0404K6869J3795j4229o262N850
12803A5691l72r207J9612n080k5229k4258J2021J0608K1391K5173q696j5805l79
12790A5470q589k0738k4848j5150J2127J727O816j2538J4222K9278j6825k7335
12778d6383K7099K9476K8546J5486j9034j5401j2558K2087k2203l3653j062K3701
12766c899J6642l5601k5399L949r625j0021L3273J460k492P76J2768J4329K0386
$$ plain form
12753 16546 28407 30602 23259 17142 -6501 -31605 -2060 24970 26677 3043 14192 33306
12741 33306 9841 22279 21853 28012 13145 7194 -5155 -12064 -23207 -37447 -45829 -64264 -44852
12728 -44852 -16624 7696 12250 -6890 4024 10950 9681 11015 1200 21784 31884 28105 -991
12715 -991 9217 20746 4757 16243 430 -8543 -15915 9605 20594 7924 -6860 38 -6478
12702 -6478 1898 -7550 -1559 643 -21043 -33485 -11418 -5458 -13098 -43333 -65893 -40211 -20976
12689 -20976 -7213 -21926 -13686 4329 22475 4199 -9208 -9345 -3160 7691 17843 55845
12677 55845 53663 38290 52390 58526 27782 2720 -20051 -36239 -41290 -36581 -54400 -35694
12665 -35694 -7725 10755 15341 36489 79184 122330 87791 64089 9226 2662 14897 19727
$$ packed form
12753A6546J1861K195p343o117k3643k5104K9545K7030J707k3634J1149J9114
12741C3306k3465J2438m26O159j4867n951j2349o909j1143j4240q382j8435J9412
12728d4852K8228K4320M554j9140J0914O926j269J334r815K0584J0100l779k9096
12715i91J0208J1529j5989J1486j5813q973p372K5520J0989j2670j4784O898o516
12702f478Q376r448N991K202k1686j2442K2067N960p640l0235k2560K5682J9235
12689b0976J3763j4713Q240J8015J8146j8276j3407j37O185J0851J0152L8002
12677E5845k182j5373J4100O136l0744k5062k2771j6188n051M709j7819J8706
12665c5694K7969J8480M586K1148M2695M3146l4539k3702n4863o564J2235M830
$$ plain form
12653 19727 23318 31959 16775 -2673 9412 -5172 -510 -22650 -40647 -55709 -78284 -58631
12641 -58631 -18380 -28427 -43972 -30236 -716 -4483 22145 3233 -12509 40096 56821 59416
12629 59416 62977 34319 14422 -8393 -12326 8239 28999 26958 38626 17003 -20214 7493
12617 7493 46435 37077 18340 27934 43678 45428 14389 22558 50958 45263 37650 44955 1444
12604 1444 -34308 -48768 -24617 -17162 -29086 -10790 18409 16774 47107 58714 75835 102268
12592 102268 105011 77839 72198 57621 20023 -977 -6941 15779 24054 30720 14945 20490 -1532
12579 -1532 4835 7301 -16499 94 19319 33190 26575 18833 31550 36151 46780 22338 -30901
12566 -30901 -42177 -16921 18175 7715 -20282 -45380 -26077 -20941 11108 -11140 -5518 2001
$$ packed form
12653A9727L591Q641j5184j9448J2085j4584M662k2140j7997j5062k2575J9653
12641e8631M0251j0047j5545J3736K9520l767K6628j8912j5742N2605J6725K595
12629E9416L561k8658j9897k2815l933K0565K0760k041J1668k1623l7217K7707
12617G493L8942r358j8737R594J5744J750l1039Q169K8400n695p613P305m3511
12604A444l5752j4460K4151P455j1924J8296K9199j635L0333J1607J7121K6433
12592A02268K743k7172n641j4577l7598k1000n964K2720Q275O666j5775N545k2022
12579a532O367K466k3800J6593J9225J3871o615p742J2717M601J0629k4442n3239
12566c0901j1276K5256L5096j0460k7997k5098J9303N136L2049k2248N622P519
$$ plain form
12554 2001 23175 16353 16777 2797 1664 -7010 -38303 -35959 5245 36312 33575 32143 987
12541 987 8006 14271 14572 11943 16121 16406 26759 17395 22484 49633 61787 49109 48351 35941
12527 35941 23313 -7712 -12648 -6536 -2600 -7938 8711 20574 24203 25187 24853 22733 12381 -907
12513 -907 13050 25125 39232 57003 61523 48496 32232 8291 -17409 -15286 -5282 -3962 13619
12500 13619 27393 11466 607 7822 -7326 -28492 -14566 16575 9323 -38818 -96312 -62941
12488 -62941 -25073 -42498 -33418 -5056 13753 4680 11569 25172 7103 182 -10356 -3765 -12143
12475 -12143 -41123 -47054 -39152 -46219 -14616 29636 4308 -33593 -19293 -5841 -3602 -8906 -16225
12462 -16225 -4108 -3431 39778 22756 -2308 -4064 -1358 1200 9878 49968 80136 82365 46719
$$ packed form
12554B001K1174o822M24j3980j133q674l1293K344M1204L1067k737j432l1156
12541I87P019O265L01k629M178K85J0353r364N089K7149J2154j2678p58j2410
12527C5941j2628l1025m936O112L936n338J6649J1863L629R84l34k120j0352j3288
12513i07J3957J2075J4107J7771M520j3027j6264k3941k5700K123J0004J320J7581
12500A3619J3774j5927j0859P215j5148k1166J3926L1141p252m8141n7494L3371
12488f2941L7868j7425R080K8362J8809r073O889J3603j8069o921j0538O591q378
12475a2143k8980n931P902p067L1603M4252k5328l7901J4300J3452K239n304p319
12462a6225J2117O77M3209j7022k5064j756K706K558Q678M0090L0168K229l5646
$$ plain form
12449 46719 27790 18788 18796 23938 15458 23498 22959 22810 28243 31088 8672 -12926 -22519 11459 38393
12434 38393 30456 12554 42712 69021 71765 64415 36157 36230 46877 73247 127520 182571 284957
12421 284957 486008 641724 734260 734285 587303 404049 260365 207100 140257 89582 59011
12410 59011 68817 80820 41905 15677 59937 63615 31511 5821 5752 -1737 27600 15103 -9497
12397 -9497 -9909 17026 18717 6654 11144 5469 6558 -5322 -5557 7627 26353 35796 26736 3529
12383 3529 2042 4974 28822 42073 25087 -14438 -41958 -40188 -19194 -13009 -42768 -48524 -55408
12370 -55408 -29907 -26918 -42822 -57494 -73077 -43329 -21143 -1497 -6722 -19309 -43887 -33473
12358 -33473 -13966 -9354 19263 38591 22326 13315 -1255 18725 15946 -6849 -17364 13635
$$ packed form
12449D6719j8929r002QN142q480Q040n39j49N433K845k2416k1598r593L3978K6934
12434C8393p937j7902L0158K6309K744p350k8258P3J0647K6370N4273N5051J02386
12421B84957K01051J55716R2536K5j46982j83254j43684n3265o6843n0675l0571
12410E9011R806J2003l8915k6228M4260L678l2104k5690o9p489K9337j2497k4600
12397i497m12K6935J691j2063M490n675J089j1880k35J3184J8726R443r060k3207
12383C529j487K932K3848J3251j6986l9525k7520J770K0994O185k9759n756o884
12370e5408K5501K989j5904j4672j5583K9748K2186J9646n225j2587k4578J0414
12358c3473J9507M612K8617J9328j6265r011j4570J9980k779k2795j0515L0999
$$ plain form
12346 13635 28523 53649 32089 7767 -21810 -29927 -41725 -54956 -18122 11794 134 8468
12334 8468 -1999 -17322 -9364 4023 -16255 -23149 -32640 -20161 4768 -20363 -696 2714 12516
12321 12516 7284 8905 -1143 -3246 -35173 -32706 -675 28821 58725 50808 53953 62331 19445
12308 19445 16049 6664 -9041 -6044 -9001 -15450 -577 15968 27305 32449 9115 -16717 -7718
12295 -7718 -26379 -20581 -8837 11532 828 -50914 -44118 -27000 -20335 -23888 -17224 -8668 261
12282 261 -4592 1553 12123 33457 13733 -22998 -38210 -44847 -25989 -35134 -1806 7434 -10246
12269 -10246 -5515 -525 -11822 -42607 -41589 -30242 -15066 9699 17311 5623 17607 22049 37348
12256 37348 36355 20871 31795 15407 -24006 -67591 -63900 -57632 -29739 -15566 17302 16586 34946
$$ packed form
12346A3635J4888K5126k1560k4322k9577q117j1798j3231L6834K9916j1660Q334
12334H468j0467j5323P958J3387k0278o894r491J2479K4929k5131J9667L410R802
12321A2516n232J621j0048k103l1927K467L2031K9496K9904p917L145Q378m2886
12308A9445l396r385j5705K997k957o449J4873J6545J1337N144k3334k5832Q999
12295g718j8661N798J1744K0369j0704n1742O796J7118O665l553O664Q556Q929
12282B61m853O145J0570K1334j9724l6731j5212o637J8858r145L3328R240j7680
12269a0246M731M990j1297l0785J018J1347J5176K4765P612j1688J1984M442J5299
12256C7348r93j5484J0924j6388l9413m3585L691O268K7893J4173L2868p16J8360
$$ plain form
12243 34946 23263 3823 -21210 -19827 -3477 14891 25797 -6368 -31742 -21332 -20340 -19561 -13753
12230 -13753 -11157 -10455 -36753 -46828 -28192 -7961 -6961 -7061 -2679 12866 22242 11627 -2824
12217 -2824 -775 -33773 -59416 -46609 -16915 -24161 -14198 17637 23704 136 -9552 -3165 23210
12204 23210 23985 20359 9601 -18242 -42479 -23098 -22526 -4811 -22064 -12748 -30039 -49410 -31302
12191 -31302 -13188 -6100 2993 14922 -2147 -21838 -7401 18337 45962 39656 10429 1237
12179 1237 17450 10074 28225 23614 -1065 -40589 -28230 -32465 -39538 -65467 -13560 25279 30610
12166 30610 27957 10484 -13657 -39133 -18989 -21192 -29624 189 11133 -7763 -49513 -48445
12154 -48445 -22097 -26854 -53228 -50132 -28388 -15779 -8534 -9620 -37587 -26872 14201 15560 25778
$$ packed form
12243C4946j1683j9440k5033J383J6350J8368J0906l2165k5374J0410R92P79N808
12230a3753K596P02k6298j0075J8636K0231J000j00M382J5545R376j0615j4451
12217b824K049l2998k5643J2807K9694p246R963L1835O067k3568r688O387K6375
12204B3210P75l626j0758k7843k4237J9381N72J7715j7253R316j7291j9371J8108
12191c1302J8114P088R093J1929j7069j9691J4437K5738K7625o306k9227r192
12179A237J6213p376J8151m611k4679l9524J2359m235p073k5929N1907L8839N331
12166C0610k653j7473k4141k5476K0144k203q432K9813J0944j8896m1750J068
12154d8445K6348m757k6374L096K1744J2609P245j086k7967J0715M1073J359J0218
$$ plain form
12141 25778 64608 113896 110228 93199 42370 3815 -9904 -20132 -32846 -43475 -22769 16044
12129 16044 18231 5206 14230 21513 35096 29859 17672 18912 -1936 -10837 1027 16784 41941
12116 41941 55753 39736 10748 -8338 -3699 -31670 -32454 1691 11584 7698 24011 18917 22461
12103 22461 7086 -10513 10298 37164 20878 -12523 -51400 -49141 -21844 -52721 -71998 -61934
12091 -61934 -47781 -44174 -26848 -11406 -23375 -29532 -41201 -46114 -42532 -25363 -22533 -32029 -17577
12078 -17577 -18245 -23076 -11632 -11615 -33242 -18748 -11928 -12657 -60511 -71371 -32808 -30393 -33256 -24664
12064 -24664 -51660 -49496 -18290 7614 -2127 -20941 -26203 -2078 -23822 -45315 -19535 10161
12052 10161 1449 -38750 -45315 -25912 -18192 -13069 -12147 -20002 -17455 -26785 -22560 -4645 -7045 -11680
$$ packed form
12141B5778L8830M9288l668j7029n0829l8555j3719j0228j2714j0629K0706L8813
12129A6044K187j3025R024P283J3583n237j2187J240k0848q901J1864J5757K5157
12116D1941J3812j6017k8988j9086M639k7971p84L4145R893l886J6313n094L544
12103B2461j5375j7599K0811K6866j6286l3401l8877K259K7297l0877j9277J0064
12091f1934J4153L607J7326J5442j1969o157j1669m913L582J7169K830r496J4452
12078a7577o68m831J1444J7k1627J4494O820p29m7854j0860L8563K415k863Q592
12064b4664k6996K164L1206K5904r741j8814n262K4125k1744k1493K5780K9696
12052A0161q712m0199o565J9403P720N123R22p855K547r330M225J7915k400m635
$$ plain form
12038 -11680 -10374 8006 -13684 -16010 -11214 -16981 -25139 -46442 -40017 -15135 -10601 -3174 -17018
12025 -17018 -19088 -34355 -24644 -2253 6846 -9620 -10405 -6228 8552 5811 10576 42590 25177
12012 25177 21279 -3210 -38849 -28752 -1348 -4774 -18409 -18423 -22093 -36577 -33026 -76 -16603
11999 -16603 -12909 10676 11248 27704 43868 5864 17508 19836 -17399 -19625 -16014 -24698 -23380
11986 -23380 -25989 20434 20361 11942 24202 28412 25803 13511 13288 18502 11495 -4317 -7104 6125
11972 6125 9484 13453 11857 -2989 -2663 -14204 -15084 9563 5500 -8433 -38519 -42300 -25543 -5146
11958 -5146 8853 6716 -24314 -3824 38566 40904 32640 27933 22293 19299 32456 15573 6869
11945 6869 7863 15332 33903 12015 -3498 -9755 2355 18719 368 -53246 -80783 -58977 -26222
$$ packed form
12038a1680J306J8380k1690k326M796n767q158k1303O425K4882M534P427j3844
12025a7018k070j5267R711K2391R099j6466p85M177J4780k741M765L2014j7413
12012B5177l898k4489l5639J0097K7404l426j3635j4l670j4484L551L2950j6527
11999a6603L694K3585N72J6456J6164l8004J1644K328l7235k226L611q684J318
11986b3380k609M6423p3q419J2260M210k609j2292k23N214p007j5812k787J3229
11972F125L359L969j596j4846L26j1541q80K4647m063j3933l0086l781J6757K0397
11958e146J3999k137l1030K0490M2390K338q264m707n640k994J3157j6883q704
11945F869R94P469J8571k1888j5513o257J2110J6364j8351n3614k7537K1806L2755
$$ plain form
11932 -26222 -31779 -57828 -45856 -38936 -38066 -43347 -58312 -55520 -16606 -13981 -22480 -9737 4276
11919 4276 -2875 -24314 -41432 -32740 -19380 -35212 -64359 -59175 -46060 -16225 -1340 -27002
11907 -27002 10646 24222 9717 -8885 -28260 -30197 -23646 -22314 -36044 -39566 -29735 13749 25517
11894 25517 24071 12185 2407 -7720 -36581 -21115 14227 26330 15317 14878 1499 5433 39938
11881 39938 68011 38568 20291 -2506 15600 53466 38590 35444 50756 23733 13829 18679
11869 18679 -9766 -42534 -39144 -28399 -7777 1175 -8259 -22533 -40207 -29167 -11034 10515
11857 10515 6103 4054 14120 25834 26225 18460 -7218 -48933 -40785 -1324 1553 26071 7926
11844 7926 5018 4579 10006 -2229 -10739 -530 10419 15256 16596 12901 3912 20744 16185 2335
$$ packed form
11932b6222n557k6049J1972O920Q70n281j4965K792L8914K625q499J2743J4013
11919D276p151k1439j7118Q692J3360j5832k9147N184J3115K9835J4885k5662
11907b7002L7648J3576j4505j8602j9375j937O551J332j3730l522R831M3484J1768
11894B5517j446j1886r778j0127k8861J5466L5342J2103j1013m39j3379L934L4505
11881C9938K8073k9443j8277k2797J8106L7866j4876l146J5312k7023r904M850
11869A8679k8445l2768L390J0745K0622Q952r434j4274j7674J1040J8133K1549
11857A0515m412k049J0066J1714L91p765k5678m1715Q148L9461K877K4518j8145
11844G926k908m39N427j2235q510J0209J0949M837J340l695q989J6832m559j3850
$$ plain form
11830 2335 -44420 -48623 -12505 15659 23605 7936 -30982 -21561 -20144 -27900 -5416 10664 -27859
11817 -27859 -35166 -26541 -18871 -14315 -18714 -11523 -18176 -31920 -45046 -16424 -7966 -1382 1576 -2070
11803 -2070 7040 11766 -8699 -5675 -1093 9286 37446 55833 48010 58178 53610 23525 9264
11790 9264 14445 -1988 -17787 -19387 -20359 -29674 -31983 -14094 -47520 -46804 -42318 -7 8254 4869
11776 4869 18239 -814 -644 -7564 -6035 -28366 -19311 31783 35739 11143 -22839 -11536 -9390
11763 -9390 -14602 -35929 -45441 -32477 -12544 2357 19445 1161 -1062 5104 1749 18689 26392
11750 26392 21728 32200 28530 22141 32464 73898 48890 8652 -28038 -47218 -28200 -27367 -1045
11737 -1045 20547 16248 27057 33137 29078 22287 5024 -17040 -28726 -47677 -36866 3419 10235
$$ packed form
11830B335m6755m203L6118K8164P946j5669l8918R421J417p756K2484J6080l8523
11817b7859p307Q625P670M556m399P191o653j3744j3126K8622Q458O584K958l646
11803b070R110M726k0465L024M582J0379K8160J8387p823J0168m568l0085j4261
11790I264N181j6433j5799j600r72r315k309J7889l3426P16M486M2311Q261l385
11776D869J3370j9053J70o920J529k2331R055N1094L956k4596l3982J1303K146
11763i390n212k1327r512J2964J9933J4901J7088j8284k223O166l355J6940P703
11750B6392m664J0472l670o389J0323M1434k5008m0238l6690j9180J9018Q33K6322
11737a045K1592m299J0809O080m059o791j7263k2064j1686j8951J0811M0285O816
$$ plain form
11724 10235 -682 39045 29023 11424 614 18103 14040 16706 20118 681 -9007 -2052 -320
11711 -320 24742 59662 51859 66630 65966 52014 27484 15729 17941 22733 1576 -36045 -17849
11698 -17849 -10515 4770 36597 66996 34358 -2017 3479 7261 2536 7677 12065 7819 -10906
11685 -10906 -48728 -16649 20675 18774 11416 20437 18581 3183 24524 64085 81181 57442
11673 57442 14580 -7852 9468 -6631 -31225 -12287 -10950 11259 -8863 -4849 -17676 -16890
11661 -16890 -12068 5743 15950 25215 33262 26934 9898 -26856 -27172 7643 29924 32432 -4799
11648 -4799 -18616 -33704 -23106 -7877 -5317 10725 16512 -12179 -41058 -39231 1160 5970 -5055
11635 -5055 4115 -1082 -39192 -61198 -46604 -35744 -5074 23458 23311 23928 5277 -16801 -6761
$$ packed form
11724A0235j0917L9727j0022j7599j0810J7489m063K666L412j9437r688O955J732
11711c20K5062L4920p803J4771o64j3952k4530j1755K212M792k1157l7621J8196
11698a7849P334J5285L1827L0399l2638l6375N496L782m725N141M388m246j8725
11685a0906l7822L2079L7324j901p358R021j856j5398K1341L9561J7096k3739
11673E7442m2862k2432J7320j6099k4594J8938J337K2209k0122M014j2827P86
11661a6890M822J7811J0207R265Q047o328j7036l6754l16L4815K2281K508l7231
11648d799j3817j5088J0598J5229K560J6042N787k8691k8879J827M0391M810j1025
11635e055R170n197l8110k2006J4594J0860L0670K8532j47O17j8651k2078J0040
$$ plain form
11622 -6761 -18518 -25301 -22086 -24537 -4455 9277 18428 -2359 -7013 -5467 -13792 -13565 -28015 -31690
11608 -31690 -17401 -28612 -27375 -2173 -6150 -6377 -7157 -9814 -807 2343 18347 9115 12872 789
11594 789 -10035 -9249 -38092 -42786 -18475 -8553 -15611 -14433 -18821 -18452 11116 11633 2474 5543 -1351
11579 -1351 -3423 -25935 -16971 -14924 -25483 -12330 -33829 -65569 -47692 1411 23061 27400 17410
11566 17410 28666 4458 -5848 -14293 -24339 -5761 -957 -3814 -7271 -4577 -7653 -7654 -20713 -26524
11552 -26524 -39119 -44270 -19049 18394 31568 31461 17901 13640 -4179 13660 15505 -19578 -39747
11539 -39747 -159 8628 -14178 -52246 -48336 -36143 -24714 -20171 -2262 19761 -9530 -1028
11527 -1028 3283 -26766 -27739 -28107 -26644 -26341 -32374 22562 55242 60027 53089 43791 54847 31210
$$ packed form
11622f761j1757o783L215k451K0082J3732R151k0787m654J546q325K27j4450l675
11608c1690J4289j1211J237K5202l977k27p80k657R007L150J6004r232L757j2083
11594G89j0824P86k8843m694K4311R922p058J178m388L69K9568N17r159L069o894
11579a351k072k2512Q964K047j0559J3153k1499l1740J7877M9103K1650M339r990
11566A7410J1256k4208j0306q445j0046J8578M804k857l457K694l076jj3059n811
11552b6524j2595n151K5221L7443J3174j07j3560m261j7819J7839J845l5083k0169
11539c9747L9588Q787k2806l8068L910J2193J1429M543J7909K2023k9291Q502
11527a028M311l0049r73l68J463L03o033N4936L2680M785o938r298J1056k3637
$$ plain form
11513 31210 2062 -39091 -42188 -26593 -31035 -39569 -29996 -11178 -38354 -34429 -38788 -62418 -39953
11500 -39953 -23028 -28782 -41562 -68905 -52509 -12433 -23879 -28943 -23581 -25900 16973 5383
11488 5383 -22371 -52587 -54839 -35532 -16585 -31454 -41271 -13415 13756 33650 49363 32544
11476 32544 36838 56207 39314 13571 905 2564 -19983 -22169 -4126 20590 44801 48556
11464 48556 41677 6195 -8517 3474 5012 2035 9782 7335 4867 -15139 -3900 18283 26409
11451 26409 28013 14930 -9362 -14350 6715 30222 -1195 -8971 15510 31218 12082 -14088
11439 -14088 -12909 29 15593 35110 39884 47454 35433 44739 40921 31812 10985 -203 -3309
11426 -3309 -19712 -28437 -6650 -660 8592 17585 -7920 -19230 10575 -11902 -27484 -19890 47
$$ packed form
11513C1210k9148m1153l097J5595m442q534R573J8818k7176L925m359k3630K2465
11500c9953J6925n754j2780k7343J6396M0076j1446n064N362k319M2873j1590
11488E383k7754l0216k252J9307J8947j4869r817K7856K7171J9894J5713j6819
11476C2544M294J9369j6893k5743j2666J659k2547k186J8043K4716K4211L755
11464D8556o879l5482j4712J1991J538k977P747k447k468k0006J1239K2183Q126
11451B6409J604j3083k4292m988K1065K3507l1417p776K4481J5708j9136k6170
11439a4088J179J2938J5564J9517M774P570j2021R306l818r109k0827j1188l106
11426c309j6403q725K1787N990R252Q993k5505j1310K9805k2477j5582P594J9937
$$ plain form
11413 47 27158 14596 24774 35482 1144 -22128 2734 20850 28380 66113 107797 90020
11401 90020 56454 45631 55769 34518 -12097 -30900 -24397 -23315 21496 27042 36626 62966
11389 62966 68404 42496 5159 -12555 -23086 -38466 -50118 -29205 -21596 -27442 -38509 -37304
11377 -37304 -51360 -41675 -12301 -14166 -14257 20445 60785 67805 50480 33741 36557 26503 17619
11364 17619 29968 42418 28184 17173 9404 -4385 -14456 -2927 4190 -1497 13557 18228
11352 18228 24121 16585 14026 9220 -6943 -10582 -17108 124 -848 -13458 -6433 2370 9004 8060
11338 8060 25195 20111 29190 12708 19826 33717 36599 53568 56321 42162 -2230 -5306 5509
11325 5509 34799 29195 28327 57317 54846 39956 28757 -7524 4948 29036 35471 36850 32619
$$ packed form
11413D7K7111j2562J0178J0708l4338k3272K4862J8116P530L7733M1684j7777
11401I0020l3566j0823J0138k1251m6615j8803O503J082M4811N546R584K6340
11389F2966N438k5908l7337j7714j0531j5380j1652K0913P609n846j1067J205
11377c7304j4056R685K9374j865r1L4702M0340P020j7325j6739K816j0054q884
11364A7619J2349J2450j4234j1011p769j3789j0071J1529P117n687J5054M671
11352A8228N893p536k559m806j6163l639o526J7232r72j2610P025Q803O634r44
11338H060J7135n084R079j6482P118J3891K882J6969K753j4159m4392l076J0815
11325E509K9290n604q68K8990k471j4890j1199l6281J2472K4088O435J379m231
$$ plain form
11312 32619 23964 30944 19521 -16466 -8487 19039 21663 -9327 -35130 -18984 -20345 -8331 -1510
11299 -1510 6690 18365 8469 -20395 -32453 -18680 -12503 -3482 -21387 -952 -895 -9016 2180
11286 2180 1325 -8529 -40733 -14062 28616 30124 4237 -24191 -15342 22329 53153 51178 64245
11273 64245 55070 14180 657 23670 45553 54972 34639 67000 43644 -14629 -26551 -4497
11261 -4497 -12833 -18930 -5883 5620 -17465 -41373 -44190 -25520 -37497 -27927 -18000 -20069 -16696
11248 -16696 5989 21935 12300 -4800 11292 3779 -6750 -21737 -24952 -13716 -39794 -48134
11236 -48134 -31350 -3027 2066 -25584 -30740 -1658 -799 -8190 -37723 -53792 -49133 -43100 -1265
11223 -1265 20512 25494 -12451 -45852 -71332 -73249 -51094 -28354 -20643 -14266 -24005 -55516 -39771
$$ packed form
11312C2619q655O980j1423l5987P979K7526K624l0990k5803J6146j361J2014O821
11299a510Q200J1675r896k8864j2058J3773O177R021j7905K0435N7q121J1196
11286B180q55r854l2204K6671M2678J508k5887k8428Q849L7671L0824j975J3067
11273F4245r175m0890j3523K3013K1883R419k0333L2361k3356n8273j1922K2054
11261d497q336o097J3047J1503k3085k3908k817J8670j1977R570R927k069L373
11248a6696K2685J5946r635j7100J6092p513j0529j4987l215J1236k6078q340
11236d8134J6784K8323N093k7650n156K9082Q59p391k9533j6069M659O033M1835
11223a265K1777M982l7945l3401k5480j917K2155K2740P711O377r739l1511J5745
$$ plain form
11210 -39771 -35263 -7715 16115 42807 21882 -38309 -44290 -28212 -20060 -17995 -48756 -62583
11198 -62583 -55456 -64183 -44343 -19866 12852 56317 44965 13975 -12413 -5934 -7707 2211 -4279
11185 -4279 275 -5518 25181 16468 4365 -11316 -18591 5226 23773 596 -14890 -36688 -51604
11172 -51604 -46362 -65670 -86750 -82048 -64334 -41565 -38268 -82688 -89665 -58314 -58694 -49356 -25177
11159 -25177 -7875 -26351 -29802 -17257 -24704 -30268 -11863 -18450 -33982 -68489 -51495 -40038
11147 -40038 -28997 -6033 34293 31598 11192 -3168 -41823 -68552 -71980 -38656 7417 22122
11135 22122 20855 12996 696 -17796 -9367 2835 9936 -5278 -1313 28106 28471 -5830 -36263
11122 -36263 -21622 -30464 -43716 -16768 12748 37537 52333 96192 76523 17279 1833 -13346
$$ packed form
11210c9771M508K7548K3830K6692k0925o0191n981J6078Q152K065l0761j3827
11198f2583P127q727J9840K4477L2718M3465j1352l0990k6388O479j773R918o490
11185d279M554n793L0699q713j2103j5681p275K3817J8547k3177j5486k1798j4916
11172e1604N242j9308k1080M702J7714K2769L297m4420o977L1351l80R338K4179
11159b5177J7302j8476l451J2545p447n564J8405o587j5532l4507J6994J1457
11147d0038J1041K2964M0326k695k0406j4360l8655k6729l428L3324M6073J4705
11135B2122j267p859j2300j8492Q429J2202P101j5214L965K9419L65l4301l0433
11122c6263J4641q842j3252K6948K9516K4789J4796M3859j9669n9244j5446j5179
$$ plain form
11110 -13346 -13630 148 21255 1603 2259 12752 6022 3210 -7127 8714 526 -36136 -38902
11097 -38902 -31228 -6031 -9897 -39893 -27506 -1320 -7568 -14801 -20376 -28730 -44985 -28808 -17629
11084 -17629 -8571 -19313 -13984 -5698 1140 -14085 -16049 51433 60006 17554 10791 992 9570
11071 9570 -893 -13515 -19380 -11250 -2199 9222 29206 33667 23881 18182 11989 17832 -7734
11058 -7734 -46411 -36866 -45404 -44289 -34007 -36738 -60660 -49219 -32841 -7024 -2375 -14196 -19646
11045 -19646 -14932 -17401 -12829 -27456 -22260 24967 39088 46161 15991 -1859 -19077 -29721 -10173
11032 -10173 18506 15980 -1476 4711 18286 7803 -4868 -16668 -32459 -17043 4501 29415
11020 29415 43267 23649 7086 9606 9935 15615 25750 12252 17199 34528 9688 -2983 -6147
$$ packed form
11110a3346k84J3778K1107j9652O56J0493o730k812j0337J5841q188l6662k766
11097c8902P674K5197l866k9996J2387K6186o248p233n575q354j6255J6177J1179
11084a7629R058j0742N329Q286O838j5225j964O7482Q573m2452o763r799Q578
11071I570j0463j2622n865Q130R051J1421J9984M461r786n699o193N843k5566
11058g734l8677R545q538J115J0282k731k3922J1441J6378K5817M649j1821n450
11045a9646M714k469M572j4627N196M7227J4121P073l0170j7850j7218j0644J9548
11032a0173K8679k526j7456O187J3575j0483j2671j1800j5791J5416K1544K4914
11020B9415J3852j9618j6563K520L29N680J0135j3498M947J7329k4840j2671l164
$$ plain form
11007 -6147 -20997 -48537 -39979 -17282 1902 7049 30633 41972 33473 16025 -10286 -35994
10995 -35994 -29448 -13196 -20588 -5506 4892 14653 17355 18343 39014 24127 -17633 -46434 -34425
10982 -34425 -24807 -8695 20780 32830 6278 -5564 -43969 -67892 -30414 -3298 4947 9449
10970 9449 -10466 -40773 -74156 -65236 -60613 -29711 7222 991 -5004 -1039 14847 16097 38163
10957 38163 23886 636 -37713 -53016 -46643 -43459 -18656 11426 40451 46881 57439 27177
10945 27177 5825 -6898 -31155 -26615 -23908 -6159 1123 -2780 -24912 -1784 33966 17964
10933 17964 31881 23710 31282 43544 32363 -4236 10286 1593 38409 55240 11815 6275
10921 6275 23968 42487 29888 44133 53244 54546 37081 31460 34811 12192 -471 2401 -124
$$ packed form
11007f147j4850k7540Q558K2697J9184N147K3584J1339q499j7448k6311k5708
10995c5994O546J6252p392J5082J0398R761K702R88K0671j4887m1760k8801J2009
10982c4425R618J6112K9475J2050k6552j1842l8405k3923L7478K7116Q245M502
10970I449j9915l0307l3383Q920M623L0902L6933o231n995L965J5886J250K2066
10957C8163j4277k3250l8349j5303O373L184K4803L0082K9025O430J0558l0262
10945B7177k1352j2723k4257M540K707J7749P282l903k2132K3128L5750j6002
10933A7964J3917q171P572J2262j1181l6599J4522q693L6816J6831m3425n540
10921F275J7693J8519j2599J4245R111J302j7465n621L351k2619j2663K872k525
$$ plain form
10908 -124 -23687 -31564 -59927 -59525 -50877 -27951 -12411 -9319 -17064 -26154 -38208 -34725 9069 6357
10894 6357 16120 5187 -7016 -6245 6702 35464 25762 18903 9301 8302 27596 20230 11664 -2905
10880 -2905 1250 16052 15814 22104 -15573 -26800 -11520 -17025 -3380 4754 -13939 -13409 -5592 -19886
10866 -19886 -36333 -28627 -34108 -34239 -38729 -33892 -31205 -24796 -30197 -17487 2644 8962 33854 54749
10852 54749 54958 54105 27687 11434 -29756 -31023 -9609 -23652 -21207 -23483 -15274 132 21262
10839 21262 12254 7688 -3883 -9057 12885 13144 56 3369 -9091 2089 19461 18923 -16955
10826 -16955 -23387 -39568 -39504 -42011 -21427 -4039 8198 -29991 -47668 -29993 -10752 -817 9000
10813 9000 12407 16081 16612 26492 15545 13147 -1650 8918 18109 17513 32494 48800 17820 -4068
$$ packed form
10908a24k3563p877k8363M02Q648K2926J5540L092p745r090j2054L483M3794k712
10894F357R763j0933j2203P71J2947K8762r702o859r602r99J9294p366q566j4569
10880b905M155J4802k38O290l7677j1227J5280n505J3645Q134j8693N30P817j4294
10866a9886j6447P706n481j31m490M837K687O409n401J2710K0131O318K4892K0895
10852E4749K09q53k6418j6253m1190j267K1414j4043K445k276Q209J5406K1130
10839B1262r008m566j1571n174K1942K59j3088L313j2460J1180J7372n38l5878
10826a6955o432j6181O4k507K0584J7388J2237l8189j7677J7675J9241R935R817
10813I000L407L674N31R880j0947k398j4797J0568R191n96J4981J6306l0980k1888
$$ plain form
10799 -4068 -27797 -18720 13900 22731 43985 33289 23531 -8694 -23357 6565 14105 7045 -9033
10786 -9033 -36120 -22005 10000 22168 4741 14504 -9417 -19038 -29556 -30789 -14847 -20597 -25235
10773 -25235 -15263 -11 5695 -22033 -49243 -39329 -42831 -42331 3792 12955 -664 2111 -7539
10760 -7539 -20499 -22159 -10509 11230 5828 -11069 294 19092 9153 33514 37629 48936 25367
10747 25367 -12720 -1048 -3262 -2524 -21283 -40323 -33552 -29501 -43183 -24342 3423 -6041 -12198
10734 -12198 -33757 -52228 -52995 -22609 8891 10793 1755 -43091 -31680 -39667 -57698 -58444 -24282
10721 -24282 -10991 -1282 -1345 -13862 -14440 -8889 -23239 -40902 -40615 -30201 -35333 4966 40206 36592
10707 36592 30569 26901 -9148 -25204 -18979 3949 20642 24124 8382 22537 50670 40465
$$ packed form
10799d068k3729R077L2620Q831K1254j0696r758l2225j4663K9922P540p060j6078
10786i033k7087J4115L2005J2168j7427R763k3921r621j0518j233J5942n750m638
10773b5235R972J5252N706k7728k7210R914l502N00M6123R163j3619K775r650
10760g539j2960j660J1650K1739n402j6897J1363J8798r939K4361M115J1307k3569
10747B5367l8087J1672k214P38j8759j9040O771M051j3682J8841K7765r464o157
10734a2198k1559j8471p67L0386L1500J902r038m4846J1411p987j8031p46L4162
10721b4282J3291R709o3j2517n78N551j4350j7663K87J0414n132M0299L5240l614
10707C6592o023l668l6049j6056O225K2928J6693L482j5742J4155K8133j0205
$$ plain form
10695 40465 27659 23749 1752 -61491 -59804 2792 29170 40429 42440 13178 31277 42702
10683 42702 36963 32773 65100 87169 74869 44046 15230 7188 -19764 -29868 -11426 14092
10671 14092 -3250 -9349 -10476 -11349 -7068 -13176 -18651 4531 12013 21574 29251 11293 8714 16801
10657 16801 -7614 -27487 -2360 3648 -25784 -28471 -43782 -52381 -76102 -65581 -64912 -76908 -57147
10644 -57147 -58343 -65024 -48034 -16630 -7987 -20475 -12608 -28281 -52163 -53875 -64122 -51825 -19024
10631 -19024 5039 24190 5037 16668 10364 12271 15556 14902 -3551 -2445 18416 5264 -5909
10618 -5909 -6784 -3952 17024 15326 -14995 -40761 -36415 -6622 4729 15695 26889 40021 37512
10605 37512 36878 36250 44620 34243 16005 -27 3256 43399 46791 37167 39420 51575 43671 11558
$$ packed form
10695D0465j2806l910k1997o3243J687O2596K6378J1259K011k9262J8099J1425
10683D2702n739m190L2327K2069j2300l0823k8816q042k6952j0104J8442K5518
10671A4092j7342o099j127q73M281o108n475K3182P482R561P677j7958k579Q087
10657A6801k4415j9873K5127O008k9432k687j5311q599k3721J0521O69j1996J9761
10644e7147j196o681J6990L1404Q643j2488P867j5673k3882j712j0247J2297L2801
10631a9024K4063J9151j9153J1631o304J907L285o54j8453J106K0861j3152j1173
10618e909q75K832K0976j698l0321k5766M346K9793J1351J0966J1194J3132k509
10605C7512o34o28Q370j0377j8238j6032L283M0143L392r624K253J2155p904l2113
$$ plain form
10591 11558 -15313 -5328 25026 24615 25031 26550 13939 -15484 -40521 -50460 -49925 -13055 5110
10578 5110 -19530 -52501 -52602 -40524 -37560 7641 44410 46238 27286 24848 8536 -2240 -231
10565 -231 -6071 4457 29099 33063 20994 23943 5668 -18754 -41547 -53914 -47499 3183 21597
10552 21597 -14312 5986 1183 -940 5050 15187 14443 23985 32671 35306 31934 41927 28080 12906
10538 12906 16538 1307 -14700 -24052 -40296 -56363 -13320 5402 -3807 -19193 -16658 -9165 -14118
10525 -14118 -19877 -4116 18995 8300 -11740 10787 25637 19694 7668 -5465 -12542 -1238
10513 -1238 14383 -283 9369 -6162 18834 13055 19969 31004 30859 7909 12552 25190 16511
10500 16511 -26862 -15570 -22268 -3958 8357 3109 -12148 -21276 -19701 -15695 9076 35328 50117
$$ packed form
10591A1558k6871R985L0354m11M16J519j2611k9423k5037r939N35L6870J8165
10578E110k4640l2971j01J2078K964M5201L6769J828j8952k438j6312j0776K009
10565b31n840J0528K4642L964j2069K949j8275k4422k2793j2367O415N0682J8414
10552B1597l5909K0298m803k123N990J0137p44R542Q686K635l372R993j3847j5174
10538A2906L632j5231j6007r352j6244j6067M3043J8722r209j5386K535P493m953
10525a4118n759J5761K3111j0695k0040K2527J4850n943j2026j3133p077J1304
10513a238J5621j4666R652j5531K4996n779O914J1035j45k2950M643J2638q679
10500A6511m3373J1292o698J8310J2315n248j5257r128J575M006K4771K6252J4789
$$ plain form
10487 50117 27546 -20136 -40293 -29013 -34856 -33537 -21791 -1863 7717 -7240 -31415 -38901
10475 -38901 -19102 -13310 10266 18427 480 -40773 -23332 -4715 -12112 -26793 -45303 -11868
10463 -11868 5416 1411 -3108 -1168 -40097 -50206 -24560 -24908 -35012 -12909 -25541 -10042 14117
10450 14117 1900 3082 20940 9722 25005 64509 56049 28385 19406 24878 -4715 6108
10438 6108 36271 23937 4711 16352 15461 -9752 8386 18461 6885 -5127 -7169 30635
10426 30635 30613 27989 26008 -21964 -11057 26511 32008 11004 2069 4665 -15079 -39770 -43256
10413 -43256 -11366 20341 21389 17390 8424 -9337 8892 25043 23804 28160 15297 20735 17654
10400 17654 17590 7541 -16081 -10008 -3312 -1235 22324 24625 22016 6640 -12294 -23571 -11817
$$ packed form
10487E0117k2571m7682k0157J1280n843J319J1746J9928R580j4957k4175p486
10475c8901J9799N792K3576Q161j7947m1253J7441J8617p397j4681j8510L3435
10463a1868J7284m005m519J940l8929j0109K5646l48j0104K2103j2632J5499K4159
10450A4117j2217J182J7858j1218J5283L9504q460k7664q979N472k9593J0823
10438F108L0163j2334j9226J1641q91k5213J8138J0075j1576j2012k042L7804
10426C0635k2k624j981m7972J0907L7568N497k1004q935K596j9744k4691l486
10413d3256L1890L1707J048l999q966j7761J8229J6151j239M356j2863N438l081
10400A7654o4j0049k3622O073O696K077K3559K301k609j5376j8934j1277J1754
$$ plain form
10387 -11817 24274 44865 19370 11079 4323 -11040 -22588 -9433 23159 32909 -5927 -4614
10375 -4614 27716 12406 8316 17008 53167 59131 23618 29970 32845 34532 18296 -21542 -18031
10362 -18031 -23397 -1806 -4335 -7685 12995 30475 35382 29699 42405 23889 24323 19934 1670
10349 1670 14273 8080 -13817 -33288 -19539 5746 -15 3406 22045 35755 41675 34017 10616
10336 10616 7881 38778 4013 5761 -140 8453 2565 -6750 -12244 -26322 -22394 -16438 -38763
10323 -38763 -36831 -11918 7197 -4088 6080 13618 11920 10643 17418 -416 -20024 9742 11755
10310 11755 5212 9576 25745 23618 18120 25923 33430 7302 -20155 -55304 -66236 -32614 3556
10297 3556 7429 4112 17180 39766 24789 6482 -138 -25715 -9909 35080 33346 -18429 -29004
$$ packed form
10387a1817L6091K0591k5495q291o756j5363j1548J3155L2592R750l8836J313
10375d614L2330j5310m090Q692L6159N964l5513O352K875J687j6236l9838L511
10362a8031n366K1591k529l350K0680J7480M907n683J2706j8516M34m389j8264
10349A670J2603o193k1897j9471J3749K5285n761L421J8639J3710N920p658k3401
10336A0616k735L0897l4765J748n901Q593n888r315n494j4078L928N956k2325
10323c8763J932K4913J9115j1285J0168P538j698j277O775j7834j9608K9766K013
10310A1755o543M364J6169k127n498P803P507k6128k7457l5149j0932L3622L6170
10297C556L873l317J3068K2586j4977j8307o620k5577J5806M4989j734n1775j0575
$$ plain form
10284 -29004 -17432 -14255 15834 51875 44525 46993 43778 28285 40916 29096 32772 16944 -7620
10271 -7620 5434 15632 14585 3605 -20584 -26343 -28253 -29691 12941 44713 13532 -8425 -3074
10258 -3074 -9138 -8123 -10200 -3605 19858 19339 2561 -18573 -32744 -8954 19097 49508 51396
10245 51396 17583 -610 -11426 -3220 -13641 -30408 -42821 -35284 -7325 19554 20262 -10704
10233 -10704 -20376 -9297 -21931 -12853 -3408 -25964 -13166 -3426 -5437 -7023 1425 6694 -21890
10220 -21890 -36525 10127 33680 -15089 -5658 3132 -17254 -19471 -12568 -9900 17500 25563 -2925
10207 -2925 -6804 3558 -1868 -14363 -35057 -29830 265 19153 42526 51040 20727 3022 -23127
10194 -23127 -25761 -14298 -30970 -46446 -41226 -21653 16631 27466 50685 47223 26683 -15603
$$ packed form
10284b9004J1572L177L0089L6041p350K468l215j5493J2631j1820L676j5828k4564
10271g620J3054J0198j047j0980k4189n759j910j438M2632L1772l1181k1957N351
10258c074o064J015k077O595K3463n19j6778k1134j4171K3790K8051L0411J888
10245E1396l3813j8193j0816Q206j0421j6767j2413P537K7959K6879P08l0966
10233a0704r672J1079j2634R078R445k2556J2798R740k011j586Q448N269k8584
10220b1890j4635M6652K3553m8769R431Q790k0386k217O903K668K7400Q063k8488
10207b925l879J0362n426j2495k0694N227L0095J8888K3373Q514l0313j7705k6149
10194b3127k634J1463j6672j5476N220J9573L8284J0835K3219l462k0540m2286
$$ plain form
10182 -15603 -12903 1147 -20430 -6051 -2801 6000 21290 23444 6628 5127 11365 41291 48239
10169 48239 37468 20859 17940 21178 5616 -16160 -5074 23668 17144 -22859 -22429 -19722 -30725
10156 -30725 -14983 -2343 13099 22758 24792 2097 -7600 -46343 738 29479 29588 16533 31321
10143 31321 50878 66839 64703 32795 14183 -306 -6519 -14359 15778 26587 262 -28794
10131 -28794 -38725 -15430 600 16937 10718 -13606 -13086 -4214 22074 37003 10939 -7309 29408
10118 29408 35741 -8174 -17034 6103 21257 9502 -15016 -32387 -14881 11973 30507 44761
10106 44761 34488 38678 58749 59062 58632 52422 9300 -50316 -70239 -37864 -13252 30643 28625
10093 28625 18741 9988 7105 -2358 -22655 -10047 -3525 8416 41359 27360 39245 70691 73568
$$ packed form
10182a5603K700J4050k1577J4379L250Q801J5290K154j6816j501O238K9926O948
10169D8239j0771j6609k919L238j5562k1776J1086K8742o524m0003M30K707j1003
10156c0725J5742J2640J5442R659K034k2695r697l8743M7081K8741J09j3055J4788
10143C1321J9557J5961k136l1908j8612j4489o213p840L0137J0809k6325k9056
10131b8794r931K3295J6030J6337o219k4324N20Q872K6288J4929k6064j8248L6717
10118B9408O333m3915q860K3137J5154j1755k4518j7371J7506K6854J8534J4254
10106D4761j0273M190K0071L13m30o210m3122n9616j9923L2375K4612M3895k018
10093B8625r884q753k883r463k0297J2608O522J1941L2943j3999J1885L1446K877
$$ plain form
10080 73568 38024 7375 10715 5796 5966 26190 22670 23538 45941 19706 11108 11015 6916 22822
10066 22822 54100 54516 50103 31521 19658 -28346 -35549 -20983 7031 32389 19980 22536 22011
10053 22011 36104 38590 29959 38746 45625 36962 30498 34288 40907 30446 1731 -16379 -28246
10040 -28246 -14624 -13276 -14352 1015 -5020 -849 8527 30107 32068 62183 76887 51396 59176
10027 59176 74045 96327 109001 104982 57042 29785 36723 56297 58550 43205 22888 3551
10015 3551 1848 5845 10727 45692 52130 30945 -3240 -31327 -19420 -1119 50437 41376 12396
10002 12396 -2533 18795 33301 37984 14618 5124 23157 64892 44374 61157 77173 107108
9990 107108 165860 233169 253350 225361 165762 96545 73916 73205 49247 6889 -7748 15250
$$ packed form
10080G3568l5544l0649L340m919J70K0224l520Q68K2403k6235q598r3m099J5906
10066B2822L1278M16m413j8582j1863m8004p203J4566K8014K5358j2409K556n25
10053B2011J4093K486q631Q787O879q663o464L790O619j0461k8715j8110j1867
10040b8246J3622J348j076J5367o035M171R376K1580J961L0115J4704k5491P780
10027E9176J4869K2282J2674m019m7940k7257O938J9574K253j5345k0317j9337
10015C551j703L997M882L4965O438k1185l4185k8087J1907J8301N1556r061k8980
10002A2396j4929K1328J4506M683k3366r494J8033M1735k0518J6783J6016K9935
9990A07108N8752O7309K0181k7989n9599o9217k2629p11k3958m2358j4637K2998
$$ plain form
9978 15250 9051 18380 38617 28492 6442 32471 68936 61885 37343 40803 33278 28023 38357
9965 38357 19274 -13091 6596 20245 35371 31188 53565 90734 103666 107749 120033 126019
9953 126019 140463 160165 184870 258911 358795 513783 815515 1296417 2104587 3072956 3407280
9942 3407280 2905873 2136399 1436202 951230 663586 478244 376157 324306 251218 187508
9932 187508 165803 154167 142801 128215 127281 118215 110643 105715 116641 113498 82889 75610 67837
9919 67837 58949 53570 51641 62175 73387 71342 44098 59677 68081 60485 60539 52427 43750 38408
9905 38408 31156 31055 37060 50317 52868 38852 39269 52950 81762 84588 95055 103522 82472 53095
9891 53095 54202 40668 41804 46374 41564 58845 52193 29267 19275 43905 73838 82257 95212
$$ packed form
9978A5250o199R329K0237j0125k2050K6029L6465p051k4542L460p525n255J0334
9965C8357j9083l2365J9687J3649J5126m183K2377L7169J2932M083J2284N986
9953A26019J4444J9702K4705P4041R9884J54988L01732M80902Q08170R68369L34324
9942C407280n01407p69474p00197m84972k87644j85342j02087n1851p3088o3710
9932A87508k1705j1636j1366j4586r34r066p572m928J0926l143l0609p279p773
9919F7837q888n379j929J0534J1212k045k7244J5579Q404p596N4q112q677n342
9905C8408p252j01O005J3257K551j4016M17J3681K8812K826J0467Q467k1050k9377
9891E3095J107j3534J136M570m810J7281o652k2926r992K4630K9933Q419J2955
$$ plain form
9878 95212 126511 196850 291309 413779 590237 743123 786134 685888 530582 391995 266994
9867 266994 163676 157735 131681 98422 111988 115889 86578 85954 103905 98553 64207 33701
9855 33701 44085 54575 42243 52114 25090 29536 29173 34004 42478 23971 14593 27092 16428
9842 16428 24179 13650 6151 -1165 -7798 4976 13935 46193 58298 74394 59052 72099 85449
9829 85449 43032 16036 11231 16247 24869 20002 -15709 -8948 15430 31414 28991 49800 50202
9816 50202 58673 84878 105764 107236 84424 71906 29817 -27908 -36319 -39148 -12916 18466 38573
9803 38573 30079 19660 38413 44305 41609 45237 34927 10894 -21692 12028 24968 1730 -27807
9790 -27807 -14749 4268 -2660 7091 32467 32042 12478 13247 19258 -4971 15725 13887 27417
$$ packed form
9878I5212L1299P0339R4459J22470J76458J52886M3011j00246j55306j38587j25001
9867B66994j03318n941k6054l3259J3566L901k9311o24J7951n352l4346l0506
9855C3701J0384J0490j2332R871k7024M446l63M831Q474j8507r378J2499j0664
9842A6428P751j0529p499p316o633J2774Q959L2258J2105J6096j5342J3047J3350
9829H5449m2417k6996m805N016Q622m867l5711O761K4378J5984k423K0809M02
9816E0202Q471K6205K0886J472k2812j2518m2089n7725q411k829K6232L1382K0107
9803C8573q494j0419J8753N892k696L628j0310k4033l2586L3720J2940k3238k9537
9790b7807J3058J9017o928R751K5376m25j9564P69O011k4229K0696j838J3530
$$ plain form
9777 27417 36223 28969 -5643 -4640 22568 8559 -28483 -36372 -54905 -76438 -85107 -40435 10744
9764 10744 10878 -10575 -18463 -1290 -2518 25818 26637 28423 36302 21646 13241 46732 52613 48264
9750 48264 41021 39358 22614 7716 -14640 -2361 20081 30470 34380 73844 60842 64114 81981
9737 81981 77908 49166 51603 38798 37688 21397 1904 -14501 1683 23440 33821 72461
9725 72461 46708 5453 6029 -104 12479 8420 -960 -5340 -14281 771 950 -4988 -13539 -2452
9711 -2452 6556 24453 38896 38649 29675 30371 49110 42560 31507 37174 61700 33851 25083 41213
9697 41213 51090 30206 28887 18839 31269 54910 58242 58552 70395 83558 72600 55685 61368
9684 61368 48173 18599 -19741 -45122 -35329 -11714 8651 25802 29336 33214 9878 -36490
$$ packed form
9777B7417Q806p254l4612J003K7208j4009l7042p889j8533k1533q669M4672N1179
9764A0744J34k1453p888J7173j228K8336Q19J786P879j4656q405L3491N881m349
9750D8264p243j663j6744j4898k2356J2279K2442J0389L910L9464j3002L272J7867
9737H1981m073k8742K437j2805j110j6291j9493j6405J6184K1757J0381L8640
9725G2461k5753m1255N76o133J2583m059r380m380q941J5052J79n938q551J1087
9711b452R008J7897J4443k47q974O96J8739o550j1053N667K4526k7849q768J6130
9697D1213R877k0884j319j0048J2430K3641L332L10J1843J3163j0958j6915N683
9684F1368j3195k9574l8340k5381R793K3615K0365J7151L534L878k3336m6368
$$ plain form
9672 -36490 -75694 -52553 -3055 9909 2237 5406 14328 52252 61433 37967 34430 58022 76528
9659 76528 73172 61199 61958 49168 27688 24448 -14464 -32873 -24067 -12390 -7681 3359 26950
9646 26950 37155 39692 34865 23730 43269 57269 56338 72473 68085 51784 30935 7483 2536
9633 2536 1994 11248 18506 20423 26621 31981 7939 -8965 -589 -21783 -43749 -24084 -1220 6237
9619 6237 19135 39744 81855 100896 70853 50664 57078 58015 46698 35478 41910 24998 32530
9606 32530 17453 -11890 10661 30395 63188 75763 59135 41338 23385 23550 30668 52759
9594 52759 54519 55062 86504 74588 73276 58115 51089 57422 68464 40339 12171 31825 46206
9581 46206 59012 58866 56883 64922 82084 83198 108038 145878 138012 95963 61229 48801 44818
$$ packed form
9672c6490l9204K3141M9498J2964p672L169Q922L7924R181k3466l537K3592J8506
9659G6528l356j1973P59j2790k1480l240l8912j8409Q806J1677M709J1040K3591
9646B6950J0205K537m827j1135J9539J4000r31J6135m388j6301k0849k3452m947
9633B536n42R254P258J917O198N360k4042j6904Q376k1194k1966J9665K2864P457
9619F237J2898K0609M2111J9041l0043k0189O414R37j1317j1220O432j6912P532
9606C2530j5077k9343K2551J9734L2793J2575j6628j7797j7953J65P118K2091
9594E2759J760N43L1442j1916j312j5161p026O333J1042k8125k8168J9654J4381
9581D6206J2806j46j983Q039J7162J114K4840L7840p866m2049l4734j2428l983
$$ plain form
9568 44818 75056 57157 62047 49929 47084 50659 21892 24960 50123 37783 21857 19705 10278
9555 10278 20264 20564 37950 42257 76761 86594 89578 69183 53136 60419 63000 79023 52681
9542 52681 29315 27690 33427 20765 42578 44408 43719 31367 23782 52508 78466 97068 128284
9529 128284 147005 159947 155227 116384 84198 78434 104241 129479 91391 65830 71815 89178
9517 89178 92971 83667 52348 63789 70957 57362 74757 98942 109634 87926 89385 109315 126951
9504 126951 104020 77556 64331 49068 77259 86641 90260 104754 109347 112845 109209 82862 79970
9491 79970 93400 101580 107327 122826 111754 99274 54083 64122 78619 79425 90099 81687 77626
9478 77626 78669 106368 88628 56701 55878 92577 104020 103696 125155 117675 78407 51749 42316
$$ packed form
9568D4818L0238j7899M890j2118k845L575k8767L068K5163j2340j5926k152r427
9555A0278R986L00J7386M307L4504R833K984k0395j6047P283K581J6023k6342
9542E2681k3366j625N737j2662K1813J830o89j2352p585K8726K5958J8602L1216
9529A28284J8721J2942m720l8843l2186n764K5807K5238l8088k5561N985J7363
9517H9178L793r304l1319J1441P168j3595J7395K4185J0692k1708J459J9930J7636
9504A26951k2931k6464j3225j5263K8191R382L619J4494M593L498l636k6347k892
9491G9970J3430Q180N747J5499j1072j2480m5191J0039J4497Q06J0674q412m061
9478G7626J043K7699j7740l1927q23L6699J1443l24K1459p480l9268k6658r433
$$ plain form
9465 42316 91111 110163 136364 156789 125108 77336 66329 71163 121386 133272 99696 79303
9453 79303 76853 90891 116429 129919 143980 155026 137801 129888 131501 129997 116666 122038 100477
9440 100477 129671 117441 90211 75673 71151 97321 99799 85238 88244 88293 85269 105328 88433
9427 88433 88582 87553 101722 103656 85860 84385 108661 108422 95852 96836 61964 57739 94156 129860
9413 129860 153847 148628 116197 110510 127345 131363 143428 134116 151794 141224 154502 163164 144400
9400 144400 137203 120826 118521 119257 119547 125020 141690 165167 193454 184947 135566 84727 78992
9387 78992 94890 108045 142100 176596 159386 153086 146360 131141 141659 142766 153649 156731 139600
9374 139600 150901 172143 160403 162826 143697 125887 161773 169903 182892 186951 181434 164830
$$ packed form
9465D2316M8795J9052K6201K0425l1681m7772j1007M834N0223J1886l3576k0393
9453G9303k450J4038K5538J3490J4061J1046j7225p913J613j504j3331N372k1561
9440A00477K9194j2230k7230j4538m522K6170K478j4561L006M9l024K0059j6895
9427H8433J49j029J4169J934j7796j475K4276k39j2570R84l4872m225L6417L5704
9413A29860K3987n219l2431n687J6835M018J2065r312J7678j0570J3278Q662j8764
9400A44400p197j6377k305P36K90N473J6670K3477K8287q507m9381n0839n735
9387G8992J5898J3155L4055L4496j7210o300o726j5219J0518J107J0883L082j7131
9374A39600J1301K1242j1740K423j9129j7810L5886Q130J2989M059n517j6604
$$ plain form
9362 164830 144239 125821 160514 191477 155732 167797 211997 184064 180831 149094 150077 165118
9350 165118 209241 217204 219416 218930 207877 216840 198673 184403 184564 194536 199767 195508 224777 216273
9336 216273 194707 206862 186081 200487 214127 214691 215061 192102 176134 176553 197227 234951 247363
9323 247363 211522 191419 204119 246544 291366 273822 232261 232662 206245 181291 187617 240948
9311 240948 225359 213890 234094 253118 210008 206995 246396 274505 283637 284613 303056 313063
9299 313063 294308 263206 272109 300581 299893 290854 280773 260785 261180 277507 272218 266468 276531
9286 276531 289135 281583 259088 286543 299366 317853 326067 305375 274199 269981 296241 354197
9274 354197 357524 349669 340502 338163 280630 262808 281304 311155 315705 334586 344421 345074 316738
$$ packed form
9362A64830k0591j8418L4693L0963l5745J2065M4200k7933l233l1737R83J5041
9350A65118M4123P963K212m86j1053Q963j8167j4270J61R972N231m259K9269q504
9336B16273k1566J2155k0781J4406J3640N64L70k2959j5968M19K0674L7724J2412
9323B47363l5841k0103J2700M2425M4822j7544m1561M01k6417k4954O326N3331
9311B40948j5589j1469K0204J9024m3110l013L9401K8109R132R76J8443J0007
9299C13063j8755l1102Q903K8472o88r039j0081j9988L95J6327n289n750J0063
9286B76531J2604p552k2495K7455J2823J8487Q214k0692l1176m218K6260N7956
9274C54197L327p855r167k339n7533j7822J8496K9851M550J8881R835O53k8336
$$ plain form
9261 316738 321715 330347 343737 370645 388898 367544 360123 369221 347919 346330 365653 374424 382901
9248 382901 381988 365818 385010 396779 402221 370980 377079 397053 383545 397352 445592 461992
9236 461992 446862 415214 403898 431780 447388 463013 492133 501591 489772 470611 459694 442080
9224 442080 427686 426635 439745 461433 478005 480520 473372 495306 524440 518867 499149 475599
9212 475599 476901 490355 518777 524281 513464 477845 432826 440330 450394 473185 481506 471552 479806
9199 479806 517248 515932 528522 571813 565328 554595 571235 599185 598206 562204 535210 519880
9187 519880 529141 530647 522879 519346 514843 528010 565320 589034 603819 597147 582626 563349 568549
9174 568549 590090 563671 576047 577984 566146 559170 569516 579672 597680 588155 613678 594028
$$ packed form
9261C16738M977Q632J3390K6908J8253k1354p421R098k1302j589J9323Q771Q477
9248C82901r13j6170J9192J1769N442l1241O099J9974j3508J3807M8240J6400
9236D61992j5130l1648j1316K7882J5608J5625K9120R458j1819j9161j0917j7614
9224D42080j4394j051J3110K1688J6572K515p148K1934K9134n573j9718k3550
9212D75599J302J3454K8422N504j0817l5619m5019P504J0064K2791Q321r954Q254
9199D79806L7442j316J2590M3291o485j0733J6640K7950r79l6002k6994j5330
9187E19880R261J506p768l533m503J3167L7310K3714J4785o672j4521j9277N200
9174E68549K1541k6419J2376J937j1838o976J0346J0156J8008r525K5523j9650
$$ plain form
9162 594028 581057 594795 577386 548041 558788 574097 587640 570830 569539 571203 562593 593949
9150 593949 619519 613391 620364 593377 591150 603551 615145 618894 602586 584840 559627 520576
9138 520576 533655 555236 566886 577951 567561 586620 571226 556618 550786 581324 565861 548992
9126 548992 559569 558278 551001 541374 558259 577875 574621 564815 564535 560141 538204 529484 534876 531030
9112 531030 528554 525007 506498 509727 500972 520164 554242 555055 543164 547145 557689 563178 567306
9099 567306 566306 554810 544883 528622 505799 530227 524277 545390 570924 559025 520528 506107
9087 506107 520789 530023 511145 468252 452905 445599 463837 465067 466914 468020 450475 440546 462491
9074 462491 464144 439721 451375 457166 429707 412177 383639 394208 405941 437030 453068 458127
$$ packed form
9162E94028j2971J3738j7409k9345J0747J5309J3543j6810j291J664q610L1356
9150E93949K5570o128O973k6987k227J2401J1594L749j6308j7746k5213l9051
9138E20576J3079K1581J1650J1065j0390J9059j5394j4608n832L0538j5463j6869
9126E48992J0577j291p277r627J6885J9616l254r806k80m394k1937q720N392l846
9112E31030k476l547j8509L229q755J9192L4078Q13j1891L981J0544N489M128
9099E67306j000j1496r927j6261k2823K4428n950K1113K5534j1899l8497j4421
9087E06107J4682R234j8878m2893j5347p306J8238J230J847J106j7545r929K1945
9074D62491J653k4423J1654N791k7459j7530k8538J0569J1733L1089J6038N059
$$ plain form
9062 458127 454994 438023 426139 440602 433075 407094 438496 447883 430251 388121 372563 415824
9050 415824 423603 413304 430941 435825 434458 410546 381180 372563 351986 340958 383793 404318
9038 404318 404555 379268 358450 366183 396996 395079 365137 341648 301291 283500 309557 318855 287934
9025 287934 274163 297963 287919 261341 250224 269436 316664 340694 317451 326143 333307 351578
9013 351578 345517 312922 284164 297955 301904 315960 296934 276506 238136 247524 261887 301201
9001 301201 287069 269374 251520 273759 289131 285683 293796 266904 264284 274626 253856 247604
8989 247604 226783 203229 207822 224020 207150 185437 205862 232523 215058 213418 243056 272460
8977 272460 281484 255804 232663 224421 212173 181140 204095 220205 196078 183829 183542 174167 170166
$$ packed form
9062D58127l133j6971j1884J4463p527k5981L1402R387j7632m2130j5558M3261
9050D15824P779j0299J7637M884j367k3912k9366q617k0577j1028M2835K0525
9038D04318K37k5287k0818P733L0813j917k9942k3489m0357j7791K6057R298l0921
9025B87934j3771K3800j0044k6578j1117J9212M7228K4030k3243Q692P164J8271
9013C51578o061l2595k8758J3791L949J4056j9026k0428l8370R388J4363L9314
9001C01201j4132j7695j7854K2239J5372l448Q113k6892k620J0342k0770o252
8989B47604k0821k3554M593J6198j6870k1713K0425K6661j7465j640K9638K9404
8977B72460R024k5680k3141q242j2248l1033K2955J6110k4127j2249k87r375m001
$$ plain form
8964 170166 175232 163497 163293 197947 231036 225576 211816 224388 196780 174129 184347 165728
8952 165728 169960 226233 241517 226423 198092 190781 157709 137045 154094 172101 213922 208850
8940 208850 178999 178371 200156 215196 215697 210740 201728 210288 196967 180673 169433 183699 202977
8927 202977 186916 171171 157416 171247 159580 142177 145964 159706 166571 153873 138966 169452
8915 169452 202900 177885 155634 147188 137351 147092 154186 158147 161687 183906 192406 197736 197995 178050
8901 178050 157627 150259 169208 213227 215729 193437 163605 165929 179629 150381 130839 165378
8889 165378 166160 155660 132761 149772 161696 180687 185745 172716 177188 155383 127535 111624
8877 111624 125713 132182 130756 122216 126246 122951 147664 147601 126203 139714 156279 161546 170602 164059
$$ packed form
8964A70166N066j1735k04L4654L3089n460j3760J2572k7608k2651J0218j8619
8952A65728M232N6273J5284j5094k8331p311l3072k0664J7049J8007M1821n072
8940B08850k9851o28K1785J5040N01m957r012Q560j3321j6294j1240J4266J9278
8927B02977j6061j5745j3755J3831j1667j7403L787J3742O865j2698j4907L0486
8915A69452L3448k5015k2251q446r837R741P094L961L540K2219Q500N330K59j9945
8901A78050k0423p368J8949M4019K502k2292k9832K324J3700k9248j9542L4539
8889A65378P82j0500k2899J7011J1924J8991N058j3029M472k1805k7848j5911
8877A11624J4089O469j426q540M030l295K4713o3k1398J3511J6565N267R056o543
$$ plain form
8863 164059 149109 115680 74935 99885 114559 94200 92375 73733 72894 91661 107980 120139
8851 120139 131021 158860 147990 118255 92591 89410 52819 47946 70639 68130 62757 49566
8839 49566 51058 63525 79943 99027 118048 141070 124180 107819 100767 76311 60518 99247
8827 99247 107524 90584 81612 96368 94492 61358 85477 115548 95358 95524 95885 104483 87197
8814 87197 57340 69621 74229 82210 106831 125569 108455 84174 58714 24623 19346 34354
8802 34354 39494 59213 76139 85185 89501 67468 46195 60109 78568 99123 113491 91838
8790 91838 96505 113862 135906 115122 87361 77483 83893 48370 53860 24546 28199 68071 70624
8777 70624 65750 92519 108164 118592 105411 88138 49442 34974 35225 54939 101871 108968 99510
$$ packed form
8863A64059j4950l3429m0745K4950J4674k0359j825j8642q39J8767J6319J2159
8851A20139J0882K7839j0870k9735k5664l181l6591m873K2693k509n373j3191
8839D9566J492J2467J6418J9084J9021K3022j6890j6361p052k4456j5793L8729
8827I9247Q277j6940q972J4756j876l3134K4119L0071k0190J66L61Q598j7286
8814H7197k9857J2281M608P981K4621J8738j7114k4281k5460l4091n277J5008
8802C4354N140J9719J6926R046M316k2033k1273J3914J8459K0555J4368k1653
8790I1838M667J7357K2044k0784k7761r878O410l5523N490k9314L653L9872K553
8777G0624m874K6769J5645J0428j3181j7273l8696j4468K51J9714M6932P097r458
$$ plain form
8764 99510 104293 104231 100867 109177 81927 92027 122562 107960 94764 81226 90764 84440 65237
8751 65237 64879 93071 111706 124220 110306 95309 73818 50806 42728 63045 44340 77337
8739 77337 95382 95587 114186 145801 120259 59931 61047 92209 94660 88287 86526 75897 89716
8726 89716 88668 122430 123480 130131 136779 129052 136999 108523 95963 105904 98354 84639 81725 109406
8712 109406 126814 135050 130354 91264 81745 78491 74779 96636 84701 77398 101332 87644 110919
8699 110919 153393 154656 135035 131097 114465 110712 83903 91534 94083 88841 68054 42086 32150
8686 32150 53293 80372 91094 85722 102420 119398 128789 118663 125345 146064 122439 128210 150461
8673 150461 128292 106289 81284 106256 161734 156405 140986 138728 125483 115432 113998 150608
$$ packed form
8764I9510M783o2l364Q310k7250J0100L0535j4602j3196j3538R538o324j9203
8751F5237l58K8192J8635J2514j3914j4997k1491k3012q078K0317j8705L2997
8739G7337J8045K05J8599L1615k5542o0328J116L1162K451o373j761j0629J3819
8726H9716j048L3762J050O651O648p727P947k8476j2560R941p550j3715k914K7681
8712A09406J7408Q236m696l9090r519l254l712K1857j1935p303K3934j3688K3275
8699A10919M2474J263j9621l938j6632l753k6809P631K549n242k0787k5968r936
8686C2150K1143K7079J0722n372J6698J6978R391j0126O682K0719k3625N771K2251
8673A50461k2169k2003k5005K4972N5478n329j5419k258j3245j0051j434L6610
$$ plain form
8661 150608 169408 173192 179255 203322 197971 187638 234092 216061 197456 200675 160259 169393 175420
8648 175420 176752 180835 178620 186907 186210 189095 190133 213978 250706 255463 231732 216875 213150 215423
8634 215423 231487 231554 217949 215668 213917 212433 212583 214885 202118 182031 187970 181505 175970 173809
8620 173809 184956 223870 227548 199149 158815 153640 128520 142102 178651 192164 204288 181166
8608 181166 174521 160958 173265 197762 218259 213173 212274 203910 194698 197994 204619 186274 189009
8595 189009 136903 126097 121998 95373 70427 78994 56095 79481 99955 96529 70847 46901
8583 46901 44860 57853 88091 105655 102968 108311 111346 96660 74663 56644 52686 69988 81609
8570 81609 50821 30856 56165 58860 60875 50635 46160 48404 51800 50039 52115 46724 14198
$$ packed form
8661A50608J8800L784O063K4067n351j0333M6454j8031j8605L219m0416R134O027
8648A75420J332M083k215Q287o97K885J038K3845L6728M757k3731j4857l725K273
8634B15423J6064O7j3605k281j751j484J50K302j2767k0087N939o465n535k161
8620A73809J1147L8914L678k8399m0334n175k5120J3582L6549J3513J2124k3122
8608A81166o645j3563J2307K4497K0497n086q99q364r212L296O625j8345K735
8595A89009n2106j0806m099k6625k4946Q567k2899K3386K0474l426k5682k3946
8583D6901k041J2993L0238J7564k687N343L035j4686k1997j8019l958J7302J1621
8570H1609l0788j9965K5309K695K015j0240m475K244L396j761K076n391l2526
$$ plain form
8557 14198 -13328 -8907 10042 51809 73849 48635 49188 67308 59476 72024 51622 11190 3217
8544 3217 20123 5933 6968 31185 31746 27304 12833 23103 28803 983 -10056 29270 45357
8531 45357 58987 71668 38143 4547 9132 37118 35180 39664 83605 90695 100274 90515 62531
8518 62531 61407 43280 34909 33063 42550 55377 40547 33463 29088 32685 40102 53469 72886
8505 72886 66630 84877 96378 78290 53925 55126 55619 54927 68977 74132 65083 40577 32297 24885
8491 24885 43578 46045 50538 61240 71222 43595 3830 13168 41952 44928 40072 13538 20312
8478 20312 25885 37849 36343 46548 52822 63735 35664 25976 30948 32567 48215 32465 24210
8465 24210 7449 10119 55296 70326 68177 91866 114009 120278 146175 159584 148259 103780
$$ packed form
8557A4198k7526M421J8949M1767K2040k5214N53J8120p832J2548k0402m0432p973
8544C217J6906j4190J035K4217N61m442j4471J0270N700k7820j1039L9326J6087
8531D5357J3630J2681l3525l3596M585K7986j938M484M3941P090R579r759k7984
8518F2531j124j8127q371j846R487J2827j4830p084m375L597P417J3367J9417
8505G2886o256J8247J1501j8088k4365J201M93o92J4050N155r049k4506q280p412
8491B4885J8693K467M493J0702R982k7627l9765R338K8784K976m856k6534O774
8478B0312N573J1964j506J0205O274J0913k8071r688M972J619J5648j5750q255
8465B4210j6761K670M5177J5030k149K3689K2143O269K5897J3409j1325m4479
$$ plain form
8453 103780 69689 39222 31578 39402 31414 33620 19091 -3119 5155 30440 23808 -745 -25889
8440 -25889 -22422 4911 21015 16846 -74 11426 69915 80523 59775 68978 66038 46821 35182
8427 35182 45665 51111 48015 37711 29894 8295 -2555 -3361 12500 31733 33547 30321 31995
8414 31995 18037 23794 33867 33906 50044 58469 55149 47811 43431 21947 31859 40509 37695 3202
8400 3202 7497 48999 46718 23711 8162 24194 31371 22321 27324 81082 85505 91097 78647
8387 78647 54417 42426 28093 29204 31379 42188 47133 26653 -16995 -29690 -19173 -2505
8375 -2505 -3308 -8826 -29067 -42093 -34853 -98 22018 25762 9234 13920 13063 11995 22017 12939
8361 12939 34627 17223 -5428 -24402 -15272 -7940 -16782 -12117 -27843 -34047 -27813 -16494 -31834
$$ packed form
8453A03780l4091l0467p644P824p988K206j4529k2210Q274K5285o632k4553k5144
8440b5889L467K7333J6104m169j6920J1500N8489J0608k0748R203k940j9217j1639
8427C5182J0483N446l096j0304p817k1599j0850q06J5861J9233J814l226J674
8414C1995j3958N757J0073L9J6138Q425l320p338m380k1484R912Q650k814l4493
8400C202M295M1502k281k3007j5549J6032P177r050N003N3758M423N592j2450
8387G8647k4230j1991j4333J111K175J0809M945k0480m3648j2695J0517J6668
8375b505q03n518k0241j3026P240L4755K2116L744j6528M686q57j068J0022r078
8361A2939K1688j7404k2651j8974R130P332q842M665j5726o204O234J1319j5340
$$ plain form
8348 -31834 -39414 -32951 -25005 -9595 -23471 -31239 -32523 -31336 -52827 -42397 -41666 -24896 -17239 -13608
8334 -13608 13411 16882 13486 31427 29539 12284 279 8093 30654 34256 36231 25509 30834
8321 30834 42709 17219 5610 -2889 -7624 -7040 -22909 -20928 15632 49119 54968 4751 5143
$$ packed form
8348c1834p580O463P946J5410j3876p768j284J187k1491J0430P31J6770P657L631
8334a3608K7019L471l396J7941j888j7255j2005P814K2561L602J975j0722N325
8321C0834J1875k5490j1609q499m735N84j5869J981L6560L3487N849n0217L92
$$ [...]
##END NTUPLES=NMR SPECTRUM
##END=
