##TITLE=Analysis number 307249
Compound Code mo 01086
Book Reference 397/34/57
Project Code adrs
Chemist Name brucer
##JCAMPDX= 6.0         $$ Bruker NMR JCAMP-DX V2.0
##DATA TYPE= NMR SPECTRUM
##DATA CLASS= NTUPLES
##ORIGIN= Bruker BioSpin GmbH
##OWNER= NMR
$$ XWIN-NMR		Version 3.5
$$ Tue Apr 26 09:10:09 2005 GMT Daylight Time (UT+1h)  MAYBRIDGE\NMR@NMR_250MHZ
##.OBSERVE FREQUENCY= 250.131544655141
##.OBSERVE NUCLEUS= ^1H
##.ACQUISITION MODE= SIMULTANEOUS (DQD)
##.ACQUISITION SCHEME= undefined
##.AVERAGES= 16
##.DIGITISER RES= 18
##SPECTROMETER/DATA SYSTEM= dpx250
##.PULSE SEQUENCE= zg30
##.SOLVENT NAME= CDCl3
##.SHIFT REFERENCE= (INTERNAL, CDCl3, 0, 16.4059)
##AUDIT TRAIL= $$ (NUMBER, WHEN, WHO, WHERE, WHAT)
$$ ##TITLE= Audit trail, XWIN-NMR		Version 3.5
$$ ##JCAMPDX= 5.01
$$ ##ORIGIN= Bruker BioSpin GmbH
$$ ##OWNER= NMR
$$ C:\u/data/dgb/nmr/ADRS/2210/pdata/1/auditp.txt
$$ ##AUDIT TRAIL=  $$ (NUMBER, WHEN, WHO, WHERE, WHAT)
(   1,<2005-04-26 09:09:48.83 +100>,<MAYBRIDGE\NMR>,<NMR_250MHZ>,
      <created by zg, POWCHK disabled, PULCHK disabled
       configuration hash MD5:
       62 19 C7 07 E1 42 D1 B7 37 6C 3D D0 77 39 F9 E6
       data hash MD5: 64K
       5E 49 9F 37 C0 CD E9 5C EF 5B 56 15 CF A1 D4 84>)
(   2,<2005-04-26 09:10:01.10 +100>,<MAYBRIDGE\NMR>,<NMR_250MHZ>,
      <Start of raw data processing
       ef LB = 0.3 FT_mod = 6 PKNL = 1 SI = 32K 
       data hash MD5: 32K
       D7 60 12 9C A1 0F B4 30 36 00 2C EE F7 DD FE 8A>)
(   3,<2005-04-26 09:10:02.98 +100>,<MAYBRIDGE\NMR>,<NMR_250MHZ>,
      <apk 
       data hash MD5: 32K
       EF BE 2E 7E 10 2B 2A EF 86 FD 83 2C 62 DE 97 18>)
(   4,<2005-04-26 09:10:03.66 +100>,<MAYBRIDGE\NMR>,<NMR_250MHZ>,
      <abs ABSG = 5 
       data hash MD5: 32K
       CD 5A E3 B3 4E 7B 6E 97 16 22 93 A8 95 0E D5 87>)
$$ ##END=
$$ 
$$ hash MD5
$$ 6C E1 8A DB 36 9A 9D B1 2A AF 98 04 97 B0 83 49
##$RELAX= 
##$RELAX= 
##$RELAX= 
##$RELAX= 
##$RELAX= 
##$RELAX= 
##$RELAX= 
$$ Bruker specific parameters
$$ --------------------------
##$DU= <C:\u>
##$EXPNO= 2210
##$NAME= <ADRS>
##$PROCNO= 1
##$TYPE= <nmr>
##$USER= <dgb>
##$AMP= (0..31)
100 100 100 100 100 100 100 100 100 100 100 100 100 100 100 100 100 100 
100 100 100 100 100 100 100 100 100 100 100 100 100 100 
##$AQSEQ= 0
##$AQ_mod= 3
##$AUNM= <au_zg>
##$AUTOPOS= <3 >
##$BF1= 250.13
##$BF2= 250.13
##$BF3= 250.13
##$BF4= 250.13
##$BF5= 500.13
##$BF6= 500.13
##$BF7= 500.13
##$BF8= 500.13
##$BYTORDA= 1
##$CFDGTYP= 0
##$CFRGTYP= 5
##$CHEMSTR= <none>
##$CNST= (0..31)
1 1 145 1 1 1 1 1 1 1 1 1 1 1 1 1 1 1 1 1 1 1 1 1 1 1 1 1 1 1 1 1 
##$CPDPRG= <>
##$CPDPRG1= <>
##$CPDPRG2= <>
##$CPDPRG3= <>
##$CPDPRG4= <mlev>
##$CPDPRG5= <mlev>
##$CPDPRG6= <mlev>
##$CPDPRG7= <mlev>
##$CPDPRG8= <mlev>
##$CPDPRGB= <>
##$CPDPRGT= <>
##$D= (0..31)
0 1 0 0 0 0 0 0 0 0.06 0 0 0 0 0 0 0.0002 0 0 0 0 0 0 0 0 0 0 0 0 0 0 
0 
##$DATE= 1114502988
##$DBL= (0..7)
120 120 120 120 120 120 120 120 
##$DBP= (0..7)
150 150 150 150 150 150 150 150 
##$DBP07= 0
##$DBPNAM0= <>
##$DBPNAM1= <>
$$ [...]
##$SUBNAM7= <"">
##$SUBNAM8= <"">
##$SUBNAM9= <"">
##$SW= 20.6930455092707
##$SWIBOX= (0..15)
0 0 3 0 0 0 0 0 0 0 0 0 0 0 0 0 
##$SW_h= 5175.983436853
##$TD= 65536
##$TD0= 1
##$TE= 295.16
##$TE2= 300
##$TE3= 300
##$TEG= 300
##$TL= (0..7)
0 120 120 120 120 120 120 120 
##$TP= (0..7)
150 150 150 150 150 150 150 150 
##$TP07= 0
##$TPNAME0= <>
##$TPNAME1= <>
##$TPNAME2= <>
##$TPNAME3= <>
##$TPNAME4= <>
##$TPNAME5= <>
##$TPNAME6= <>
##$TPNAME7= <>
##$TPOAL= (0..7)
0.5 0.5 0.5 0.5 0.5 0.5 0.5 0.5 
##$TPOFFS= (0..7)
0 0 0 0 0 0 0 0 
##$TUNHIN= 0
##$TUNHOUT= 0
##$TUNXOUT= 0
##$USERA1= <user>
##$USERA2= <user>
##$USERA3= <user>
##$USERA4= <user>
##$USERA5= <user>
##$V9= 5
##$VALIST= <valist>
##$VCLIST= <CCCCCCCCCCCCCCC>
##$VD= 0
##$VDLIST= <DDDDDDDDDDDDDDD>
##$VPLIST= <PPPPPPPPPPPPPPP>
##$VTLIST= <TTTTTTTTTTTTTTT>
##$WBST= 1024
##$WBSW= 4
##$XGAIN= (0..3)
0 0 0 0 
##$XL= 0
##$YL= 0
##$YMAX_a= 506879
##$YMIN_a= -465559
##$ZGOPTNS= <>
##$ZL1= 120
##$ZL2= 120
##$ZL3= 120
##$ZL4= 120
##$ABSF1= 16.40592
##$ABSF2= -4.287251
##$ABSG= 5
##$ABSL= 3
##$ALPHA= 0
##$AQORDER= 0
##$ASSFAC= 0
##$ASSFACI= 0
##$ASSFACX= 0
##$ASSWID= 0
##$AUNMP= <proc_1d>
##$AZFE= 0.1
##$AZFW= 0.1
##$BCFW= 0
##$BC_mod= 0
##$BYTORDP= 0
##$COROFFS= 0
##$CY= 12.5
##$DATMOD= 1
##$DC= 0
##$DFILT= <>
##$DTYPP= 0
##$F1P= 14.0000005364418
##$F2P= -0.99999901652339
##$FCOR= 0.5
##$FTSIZE= 32768
##$FT_mod= 6
##$GAMMA= 0
##$GB= 0
##$INTBC= 1
##$INTSCL= 1
##$ISEN= 128
##$LB= 0.3
##$LEV0= 0
##$LPBIN= 0
##$MAXI= 10000
##$MC2= 0
##$MEAN= 0
##$ME_mod= 0
##$MI= 0
##$NCOEF= 0
##$NC_proc= -4
##$NLEV= 6
##$NOISF1= 0
##$NOISF2= 0
##$NSP= 0
##$NTH_PI= 0
##$NZP= 0
##$OFFSET= 16.40592
##$PC= 1
##$PHC0= 133.6326
##$PHC1= 6.512609
##$PH_mod= 1
##$PKNL= yes
##$PPARMOD= 0
##$PSCAL= 4
##$PSIGN= 0
##$REVERSE= no
##$SF= 250.130029033241
##$SI= 32768
##$SIGF1= 0
##$SIGF2= 0
##$SINO= 400
##$SIOLD= 32768
##$SREGLST= <1H.CDCl3>
##$SSB= 0
##$STSI= 32768
##$STSR= 0
##$SW_p= 5175.98343685301
##$SYMM= 0
##$S_DEV= 0
##$TDeff= 65536
##$TDoff= 0
##$TI= <Analysis number 999999
Compound Code 99
Book Reference 9
Project Code 9>
##$TILT= no
##$TM1= 0
##$TM2= 0
##$TOPLEV= 0
##$USERP1= <user>
##$USERP2= <user>
##$USERP3= <user>
##$USERP4= <user>
##$USERP5= <user>
##$WDW= 1
##$XDIM= 32768
##$YMAX_p= 485458035
##$YMIN_p= -80156
$$ End of Bruker specific parameters
$$ ---------------------------------
##NTUPLES= NMR SPECTRUM
##VAR_NAME=  FREQUENCY,     SPECTRUM/REAL,   SPECTRUM/IMAG
##SYMBOL=    X,             R,               I
##VAR_TYPE=  INDEPENDENT,   DEPENDENT,       DEPENDENT
##VAR_FORM=  AFFN,          ASDF,            ASDF
##VAR_DIM=   32768,         32768,           32768
##UNITS=     HZ,            ARBITRARY UNITS, ARBITRARY UNITS
##FACTOR=    0.157963299565203, 1,           1
##FIRST=     4103.61325309239, 0,            0
##LAST=      -1072.37018376062, 0,           0
##MIN=       -1072.37018376062, -80156,      0
##MAX=       4103.61325309239, 485458035,    0
$$ Real data points
##PAGE= N=1
##DATA TABLE= (X++(R..R)), XYDATA
$$ [...]
$$ plain form
18443 79780207 64612707 55535575 51872338 49460504 45609096 41451833 38793490 38344440
18435 38344440 40088035 43226809 45224950 43134690 37335462 30636684 25093868 21134414
18427 21134414 18395647 16433954 14960447 13810258 12884043 12147906 11595181 11116307 10592275
18418 10592275 10053452 9539103 9011346 8520762 8202544 8169968 8491373 9227836 10469808
18409 10469808 12346803 15221422 19649294 25850442 32578933 36661661 35960099 32299849
18401 32299849 28974886 28059642 30314621 35740243 42978736 49249705 54422758 62757424
18393 62757424 78397819 99611801 114185188 108777936 88433615 66638574 50681955
18386 50681955 40610685 34648723 31347332 29558812 28247274 26966408 25909539 25493458
$$ packed form
18443G9780207j5167500r077132l663237k411834l851408m157263k658343m49050
18435C8344440J743595L138774J998141k090260n799228o698778n542816l959454
18427B1134414k738767j961693j473507j150189r26215p36137n52725m78874n24032
18418A0592275n38823n14349n27757m90584l18218l2576L21405P36463J241972
18409A0469808J876995K874619M427872O201148O728491M082728p01562l660250
18401C2299849l324963r15244K254979N425622P238493O270969N173053Q334666
18393F2757424J5640395K1213982J4573387n407252k0344321k1795041j5956619
18386E0681955j0071270n961962l301391j788520j311538j280866j056869m16081
$$ plain form
18378 25493458 25781637 25964621 24790059 21747719 17879764 14426322 11858651 10054800
18370 10054800 8797494 7929815 7297529 6765579 6296481 5878110 5518620 5227582 4947107
18361 4947107 4557966 4032713 3483677 3012802 2649606 2382639 2169429 1979698 1808746
18352 1808746 1644198 1501682 1380854 1290489 1230243 1176678 1104679 1008268 907614 820388
18342 820388 749260 690950 650557 612194 585861 563909 534087 513610 503576 479356 461090
18331 461090 447550 434483 419752 399787 385231 368650 351944 345739 359400 372274 369933 370761
18319 370761 372095 377766 369996 351228 335687 328375 316126 311280 317865 331710 345710 370274 400865
18306 400865 439591 492116 551864 564102 506198 409340 328569 287048 261248 246748 244087 240506
$$ packed form
18378B5493458K88179J82984j174562l042340l867955l453442k567671j803851
18370A0054800j257306q67679o32286n31950m69098m18371l59490k91038k80475
18361D947107l89141n25253n49036m70875l63196k66967k13210j89731j70952
18352A808746j64548j42516j20828r0365o0246n3565p1999r6411j00654q7226
18342H20388p1128n8310m0393l8363k6333k1952k9822k0477j0034k4220j8266
18331D61090j3540j3067j4731j9965j4556j6581j6706o205J3661J2874k341Q28
18319C70761J334N671p770j8768j5541p312j2249m846O585J3845J4000K4564L0591
18306D00865L8726N2525N9748J2238n7904r6858q0771m1521k5800j4500k661l581
$$ plain form
18294 240506 235922 231817 233899 242434 239770 232504 225903 216472 215652 220374 223284 232995 238855 236191
18280 236191 244309 255707 268177 275470 280678 281880 277227 272261 276181 292289 314686 365404 445510
18267 445510 536548 580771 558216 491753 438922 415397 421753 442424 473379 529590 644095
18256 644095 841362 1187639 1733467 2368711 2786498 2856200 2587772 2155308 1800435 1639694
18246 1639694 1615792 1546807 1375887 1194552 1102422 1097656 1181402 1340874 1484471 1449345 1246932
18235 1246932 1012325 827080 705389 621831 561467 524392 510773 516119 521409 528778 546849
18224 546849 570214 614637 695768 776977 799110 757481 697076 653340 651750 707199 826243
18213 826243 1022561 1309212 1621648 1822718 1947708 2215218 2831469 3758870 4492541 4503387
$$ packed form
18294B40506m584m105K082Q535k664p266o601r431q20M722K910R711N860k664
18280B36191Q118J1398J2470P293N208J202m653m966L920J6108K2397N0718Q0106
18267D45510R1038M4223k2555o6463n2831k3525O356K0671L0955N6211J14505
18256F44095J97267L46277N45828O35244M17787O9702k68428m32464l54873j60741
18246A639694k3902o8985j70920j81335r2130m766Q3746J59472J43597l5126k02413
18235A246932k34607j85245j21691q3558o0364l7075j3619N346N290P369J8071
18224E46849K3365M4423Q1131Q1209K2133m1629o0405m3736j590N5449J19044
18213H26243J96318K86651L12436K01070J24990K67510O16251R27401P33671J0846
$$ plain form
18203 4503387 4104912 3769549 3642107 3782861 4151120 4639480 5063402 5198312 4893909
18194 4893909 4298412 3744285 3293298 2814874 2334468 1953377 1698859 1555131 1489226 1455064
18184 1455064 1458491 1461096 1415769 1284890 1105185 935062 809291 725399 662533 618973 580204
18173 580204 554885 549040 551325 558787 587128 642791 717135 837791 1049712 1352924 1585947
18162 1585947 1569871 1372026 1188382 1125830 1220034 1477994 1831186 2096632 2251456 2521849
18152 2521849 3097961 3848412 4334977 4271181 3658871 2866076 2237105 1868743 1691844 1640948
18142 1640948 1665278 1664897 1576346 1457865 1374021 1368195 1422886 1482867 1446336 1294419 1094334
18131 1094334 944737 851522 791960 764475 749845 728433 717402 723209 744682 789051 852674
$$ packed form
18203D503387l98475l35363j27442J40754L68259M88360M23922J34910l04403
18194D893909n95497n54127m50987m78424m80406l81091k54518j43728o5905l4162
18184A455064L427K605m5327j30879j79705j70123j25771q3892o2866m3560l8769
18173E80204k5319n845K285P462K8341N5663P4344J20656K11921L03212K33023
18162A585947j6076j97845j83644o2552R4204K57960L53192K65446J54824K70393
18152B521849N76112P50451M86565o3796o12310p92795o28971l68362j76899n0896
18142A640948K4330l81q8551j18481q3844n826N4691N9981l6531j51917k00085
18131A094334j49597r3215n9562k7485j4630k1412j1031N807K1473M4369O3623
$$ plain form
18120 852674 921529 991299 1060393 1131895 1258687 1484000 1882823 2583860 3841994 6171987
18110 6171987 9920908 13555073 13291630 9975085 6741033 4692750 3514029 2842213
18102 2842213 2435487 2178859 2026322 1931675 1838253 1680522 1479767 1283126 1119194 970512
18092 970512 840491 727322 639818 571425 513546 466745 439758 432435 439825 465372 502894
18081 502894 537877 538637 503169 448596 389359 348455 318677 298821 291387 298663 313256 332192
18069 332192 354925 378468 383310 381009 376801 378086 365036 331542 298593 259131 225254 203828
18057 203828 198011 193459 185668 178467 167303 162387 167143 173311 170124 163763 146971 133404 126684
18044 126684 114059 105483 102205 98477 104589 107651 99141 98292 98423 97904 90966 82910 86193 89214 87933
$$ packed form
18120H52674O8855O9770O9094P1502J26792K25313L98823P01037J258134K329993
18110F171987L748921L634165k63443l316545l234052k048283j178721o71816
18102B842213m06726k56628j52537r4647r3422j57731k00755j96641j63932j48682
18092I70512j30021j13169q7504o8393n7879m6801k6987p323P390K5547L7522
18081E02894L4983P60l5468n4573n9237m0904k9778j9856p434P276J4593J8936
18069C32192K2733K3543M842k301m208J285j3050l3494l2949l9462l3877k1426
18057B03828n817m552p791p201j1164m916M756O168l187o361j6792j3567o720
18044A26684j2625q576l278l728O112L062q510q49J31n19o938q056L283L021j281
$$ plain form
18029 87933 82496 82495 81357 76301 78476 83735 79050 74889 73474 75242 71396 72314 72689 65899 57192 50397
18013 50397 48157 52525 56069 55771 54333 57669 62562 56356 50954 52126 54950 54540 53303 46816 39547
17998 39547 41546 42569 46126 46987 44715 47105 51256 59983 64807 60552 58147 58905 60796 63773 63526
17983 63526 47717 46376 50170 49631 51699 54738 57659 61235 72883 70952 69870 66160 62790 64683
17969 64683 66375 65556 72436 86596 99211 100477 99234 102626 107164 113670 122177 128289 134865 154528
17955 154528 182951 206021 235030 242668 233716 229304 227328 245358 280637 321416 359524 383075
17943 383075 394003 405905 394617 365786 339765 322553 307780 300930 292649 283486 284253 296299
17931 296299 306726 315865 306943 307942 313381 326096 368428 462622 598096 740121 870321 1018276
$$ packed form
18029H7933n437jj138n056K175N259m685m161j415J768l846R18L75o790q707o795
18013E0397k240M368L544k98j438L336M893o206n402J172K824m10j237o487p269
17998C9547J999J023L557Q61k272K390M151Q727M824m255k405P58J891K977k47
17983F3526j5809j341L794n39K068L039K921L576J1648j931j082l710l370J893
17969F4683J692q19O880J4160J2615J266j243L392M538O506Q507O112O576J9663
17955A54528K8423K3070K9009P638q952m412j976J8030L5279M0779L8108K3551
17943C83075J0928J1902j1288k8831k6021j7212j4773o850q281r163P67J2046
17931B96299J0427R139q922R99N439J2715M2332R4194J35474J42025J30200J47955
$$ plain form
17919 1018276 1173767 1246899 1230957 1168112 1113113 1036668 923289 815996 738337 706827 709136
17908 709136 725403 747647 778351 800681 781872 730215 695694 687825 696451 699527 677351 623498
17896 623498 551291 490631 452281 438285 440339 453461 480941 522201 574539 609466 601350 581430
17884 581430 572446 572148 587983 602260 613571 629714 657038 678360 663365 634099 612156 603711
17872 603711 610033 641577 705068 815112 988508 1175578 1322334 1429993 1549566 1639894
17862 1639894 1586797 1437863 1275950 1118136 949142 782374 644986 556922 493577 449075
17852 449075 413799 385537 366519 360933 356043 348702 339914 334083 316819 291039 263470 238740
17840 238740 215778 200205 185580 177681 168345 163410 164130 167454 173548 179118 177614 171969 158186
$$ packed form
17919A018276J55491P3132j5942o2845n4999p6445j13379j07293p7659l1510K309
17908G09136J6267K2244L0704K2330j8809n1657l4521p869Q626L076k2176n3853
17896F23498p2207o0660l8350j3996K054J3122K7480M1260N2338L4927q116j9920
17884E81430q984k98J5835J4277J1311J6143K7324K1322j4995k9266k1943q445
17872F03711O322L1544O3491J10044J73396J87070J46756J07659J19573R0328
17862A639894n3097j48934j61913j57814j68994j66768j37388q8064o3345m4502
17852D49075l5276k8262j9018n586m890p341q788n831j7264k5780k7569k4730
17840B38740k2962j5573j4625p899r336m935P20L324O094N570j504n645j3783
$$ plain form
17827 158186 136608 113508 102339 105890 111634 107851 101213 98070 92258 89647 87890 81460 81187 85034
17813 85034 85139 81602 75018 80089 73139 68268 67767 71923 78369 74128 71523 72838 69726 69430 73698
17798 73698 73651 79670 78385 76005 76790 81849 88978 87137 86056 89290 89013 85285 79570 71715 65790
17783 65790 73320 79343 85484 96483 99966 98358 91998 87907 96522 104493 95578 96199 96505 85266
17769 85266 90706 100639 108138 111939 123020 127350 131943 144469 161762 187139 234891 276209 290930
17756 290930 271136 229881 209160 226839 248117 247930 237188 222388 223879 232314 238248 245401 251920
17743 251920 257839 248213 238696 238578 244284 246477 238733 230789 236465 244891 254165 258903 265791 275098
17729 275098 282654 294690 305035 310225 323530 333279 346251 362632 379735 392228 399219 409526
$$ packed form
17827A58186k1578k3100j1169L551N744l783o638l143n812k611j757o430k73L847
17813H5034J05l537o584N071o950m871n01M156O446m241k605J315l112k96M268
17798G3698m7O019j285k380P85N059P129j841j081L234k77l728n715p855n925
17783F5790P530O023O141J0999L483j608o360m091Q615P971q915O21L06j1239
17769H5266N440R933P499L801J1081M330M593J2526J7293K5377M7752M1318J4721
17756B90930j9794m1255k0721J7679K1278j87j0742j4800J491Q435N934P153O519
17743B51920N919r626r517j18N706K193p744p944N676Q426R274M738O888R307
17729B75098P556J2036J0345N190J3305R749J2972J6381J7103J2493O991J0307
$$ plain form
17717 409526 416366 425271 427983 428121 425017 429212 460470 526603 635120 809957 1021542 1166606
17705 1166606 1186348 1172857 1245239 1435630 1743729 2077443 2209737 2044747 1766705 1557149
17695 1557149 1515058 1628152 1799472 1804169 1596802 1339816 1150422 1038153 966090 913021
17685 913021 887918 885125 886401 878112 867666 853156 856541 866550 884323 896551 922428 965539
17673 965539 1026551 1106898 1209314 1352234 1492983 1584831 1616637 1636585 1690734 1801664 1983637
17662 1983637 2176851 2297936 2402526 2568291 2791825 3075123 3520190 4223750 5074627
17653 5074627 5739171 6010144 6110165 6408715 7092464 8123716 9545783 11562662 13900365
17644 13900365 15493417 15479839 14284226 12986827 12297505 12363763 13157850 14706410 17182832
$$ packed form
17717D09526O840Q905K712J38l104M195L1258O6133J08517J74837K11585J45064
17705A166606J9742j3491P2382J90391L08099L33714J32294j64990k78042k09556
17695A557149m2091J13094J71320M697k07367k56986j89394j12269p2063n3069
17685I13021k5103k793J276q289j0446j4510L385J0009J7773J2228K5877M3111
17673I65539O1012Q0347J02416J42920J40749R1848L1806J9948N4149J10930J81973
17662A983637J93214J21085J04590J65765K23534K83298M45067P03560Q50877
17653E074627O64544K70973J00021K98550O83749J031252J422067K016879K337703
17644A3900365J593052j3578j195613j297399o89322O6258P94087J548560K476422
$$ plain form
17635 17182832 21108146 27533925 38123600 54721180 77225654 99693332 110841780
17628 110841780 105705098 91536245 78120968 69534307 64400782 59924993 55201875 51283058
17620 51283058 49356960 49481746 50810048 52102113 51620703 48102708 42258864 35848141
17612 35848141 30106075 25566456 22301777 20041535 18435848 17225108 16110474 14850665
17604 14850665 13511589 12263063 11223727 10452785 9937911 9530465 9149804 8887817 8853944
17595 8853944 9069168 9542604 10423898 12042692 14784335 18958390 24311612 29502813 32436326
17586 32436326 32320178 30655884 29640174 30607706 33856051 38772765 43950623 48660025
17578 48660025 54650928 64902842 80273431 96011198 102159781 93763537 77004953
$$ packed form
17635A7182832L925314O425779J0589675J6597580K2504474K2467678J1148448
17628A10841780n136682j4168853j3415277q586661n133525m475789m723118l918817
17620E1283058j926098J24786J328302J292065m81410l517995n843844o410723
17612C5848141n742066m539619l264679k260242j605687j210740j114634j259809
17604A4850665j339076j248526j039336p70942n14874m07446l80661k61987l3873
17595H853944K15224M73436Q81294J618794K741643M174055N353222N191201K933513
17586C2436326j16148j664294j015710R67532L248345M916714N177858M709402
17578D8660025N990903J0251914J5370589J5737767O148583q396244j6758584
$$ plain form
17571 77004953 60675182 48645631 40654891 35472076 32063499 29683055 27948945 26483274
17563 26483274 24966126 23552440 22591132 21879474 20635859 18448821 15765487 13268348
17555 13268348 11278030 9758581 8570012 7592581 6758910 6055003 5457450 4941664 4464218
17546 4464218 3991977 3533773 3124329 2773047 2485344 2233138 1995767 1781642 1598674
17537 1598674 1434793 1298004 1172768 1067546 979728 901471 840814 790588 747147 702593
17527 702593 663731 630892 595061 575330 559944 537243 514628 490005 477087 464513 449737
17516 449737 443133 442899 451305 466004 469422 465581 462313 462338 477822 501995 536449 563710 554711 521957
17502 521957 480062 450368 436849 430556 434186 435342 446626 467395 503885 559784 640109 785229
$$ packed form
17571G7004953j6329771j2029551p990740n182815l408577k380444j734110j465671
17563B6483274j517148j413686r61308p11658j243615k187038k683334k497139
17555A3268348j990318j519449j188569r77431q33671p03907n97553n15786m77446
17546D464218m72241m58204m09444l51282k87703k52206k37371k14125j82968
17537A598674j63881j36789j25236j05222q7818p8257o0657n0226m3441m4554
17527G02593l8862l2839l5831j9731j5386k2701k2615k4623j2918j2574j4776
17516D49737o604k34Q406J4699L418l841l268K5J5484K4173L4454K7261q999l2754
17502E21957m1895k9694j3519o293L630J156J1284K0769L6490N5899Q0325J45120
$$ plain form
17490 785229 1014010 1326736 1670225 1938809 2043449 1953319 1740937 1501076 1276598 1092299
17480 1092299 950313 848614 788713 764058 777670 817427 865657 897469 874962 814214 724467
17469 724467 625290 545501 470710 419314 390843 382600 378288 366322 349602 332834 321500 318126
17457 318126 317653 318849 321618 319969 322107 324731 347278 378694 420695 469379 535812 600599 658414
17444 658414 685538 672216 632420 598165 582546 607257 667612 760874 891937 1060056 1250687
17433 1250687 1454354 1621614 1685097 1595392 1378966 1117274 891442 735687 632815 565149
17423 565149 521946 501978 503343 525055 575413 635449 664879 634502 582169 522993 477252 436359
17411 436359 397956 351432 310025 276783 259013 255043 260675 267583 269157 262587 250720 242403 228522
$$ packed form
17490G85229K28781L12726L43489K68584J04640r0130k12382k39861k24478j84299
17480A092299j41986j01699n9901k4655J3612L9757M8230L1812k2507o0748q9747
17469G24467r9177p9789p4791n1396k8471q243m312j1966j6720j6768j1334l374
17457C18126m73J196K769j649K138K624K2547L1416M2001M8684O6433O4787N7815
17444F58414K7124j3322l9796l4255j5619K4711O0355R3262J31063J68119J90631
17433A250687K03667J67260O3483q9705k16426k61692k25832j55755j02872o7666
17423E65149m3203j9968J365K1712N0358O0036K9430l0377n2333n9176m5741m0893
17411D36359l8403m6524m1407l3242j7770l970N632O908J574o570j1867q317j3881
$$ plain form
17398 228522 208825 187141 166883 143151 128953 124183 118693 120584 116394 125137 128361 134247 143363
17385 143363 151658 169625 191738 224576 271296 349164 480357 642327 732619 713033 643139
17374 643139 561175 474842 391622 334021 299121 277124 271220 280323 301536 346397 400326 441689
17362 441689 466334 481664 489699 474885 410151 329132 267810 227982 198529 182724 166634 154097
17350 154097 139668 128960 119989 106438 103259 114207 109218 103867 101746 100389 111486 125437 135072
17337 135072 156150 174851 191775 189770 176051 155363 138169 133845 133886 141142 152794 185617 236690
17324 236690 308656 390395 483615 565433 559963 461753 346095 264331 205523 176546 162861
17313 162861 158285 147869 140945 130075 124409 115663 119905 122503 113232 114264 114388 121263 134622 139680
$$ packed form
17398B28522j9697k1684k0258k3732j4198m770n490J891m190Q743L224N886R116
17385A43363Q295J7967K2113L2838M6720P7868J31193J61970R0292j9586o9894
17374F43139q1964q6333q3220n7601l4900k1997n904R103K1213M4861N3929M1363
17362D41689K4645J5330Q035j4814o4734q1019o1322l9828k9453j5805j6090j2537
17350A54097j4429j0708q971j3551l179J0948m989n351k121j357J1097J3951R635
17337A35072K1078J8701J6924k005j3719k0688j7194m324M1P256J1652L2823N1073
17324B36690P1966Q1739R3220Q1818n470r8210j15658q1764n8808k8977j3685
17313A62861m576j0416o924j0870n666q746M242K598r271J032J24O875J3359N058
$$ plain form
17299 139680 128553 116496 112287 98616 78540 69203 63082 65669 71271 73563 81447 84773 85890
17286 85890 82435 78346 69501 62761 54376 45582 35998 33353 31797 31801 34333 36924 35567 29973 25828
17271 25828 30181 27674 26719 25484 25832 17040 23532 29175 33879 35118 34661 49489 55782 56948 55398
17256 55398 55005 46938 41790 45703 55382 61586 67698 66581 61838 64563 63220 64373 61534 58720 59964
17241 59964 59095 46187 33458 30625 28053 32038 37635 45001 44609 37461 39606 37721 25408 16572
17227 16572 15932 17280 11265 13795 18542 22908 25585 28071 19412 12772 1426 1946 -90 4919 12422
17212 12422 13164 18872 21605 18945 19274 24891 18882 0 -14873 -21019 -19638 -22630 -23995 -14886
17198 -14886 -11210 3175 4121 3263 -3638 -3122 -11383 -12278 -12146 -4983 1166 3505 4645 9721 8515
$$ packed form
17299A39680j1127j2057m209j3671k0076r337o121K587N602K292P884L326J117
17286H5890l455m089q845o740q385q794r584k645j556MK532K591j357n594m145
17271B5828M353k507r55j235L48q792O492N643M704J239m57J4828O293J166j550
17256E5398l93q067n148L913R679O204O112j117m743K725j343J153k839k814J244
17241E9964q69j2908j2729k833k572L985N597P366l92p148K145j885j2313q836
17227A6572o40J348o015K530M747M366K677K486q659o640j1346N20k036N009P503
17212A2422P42N708K733k660L29N617o009j8882j4873o146J381k992j365R109
17198a4886L676J4385R46q58o901N16q261q95J32P163O149K339J140N076j206
$$ plain form
17183 8515 3176 -4664 -198 3266 3906 3298 -192 -6189 -5083 -3952 -2651 3934 4422 -1657 -9131
17168 -9131 -10961 -2375 1534 -321 3155 12717 13296 12556 5432 4159 -14512 -28704 -32077 -26765 -22285
17153 -22285 -22331 -14069 -490 10107 29440 40094 41614 34151 22588 17605 18208 16090 20586 38174
17139 38174 53689 69168 101669 143301 191532 235889 275092 298817 307635 314358 303232 277174
17127 277174 236250 207281 184741 173799 176162 180808 205182 242728 294256 349832 379050 380035
17115 380035 336808 284351 244058 214210 182161 160645 135129 113501 99053 90243 102933 117350
17103 117350 135521 149785 148836 142049 110502 73402 45639 36172 44023 55116 63773 73605 73259
17090 73259 66020 63523 69933 100324 143198 188888 237625 269904 289071 308717 329227 340450
$$ packed form
17183H515n339p840M466L464O40o08l490n997J106J131J301O585M88o079p474
17168i131j830Q586L909j855L476R562N79p40p124j273j8671j4192l373N312M480
17153b2285m6Q262J3579J0597J9333J0654J520p463j1563m983O03k118M496J7588
17139C8174J5515J5479L2501M1632M8231M4357L9203K3725Q818O723j1126k6058
17127B77174m0924k8969k2540j0942K363M646K4374L7546N1528N5576K9218R85
17115C80035m3227n2457m0293k9848l2049k1516k5516k1628j4448q810J2690J4417
17103A17350J8171J4264r49o787l1547l7100k7763r467P851J1093Q657R832l46
17090G3259p239k497O410L0391M2874M5690M8737L2279J9167J9646K0510J1223
$$ plain form
17078 340450 327699 292749 259810 220574 195187 182613 167569 152716 143242 139844 147863 154166
17066 154166 167668 202109 254960 321670 367818 359706 304183 236622 176873 132720 109780 94536
17054 94536 79474 60223 51486 62244 79247 95363 101249 101169 86974 71121 51618 30989 17866
17041 17866 3702 -7536 -6022 6937 11814 1973 -5172 -10384 -15945 -7543 2198 3658 -2217 -12323
17027 -12323 -17372 -11475 -10927 -9110 -12365 -15984 -18834 -16301 -10031 -16256 -20131 -16970 -10001 -5868 -863
17012 -863 5358 8127 9249 14163 12686 4008 -8262 -12901 -19965 -27701 -31747 -29976 -33651 -26764 -25677
16997 -25677 -28111 -24933 -25933 -29634 -35224 -37088 -30443 -14829 -4435 1729 2937 -2111 6168 14126
16983 14126 7740 -2 -7521 -7383 857 2485 -2068 -2270 -4579 -2006 -4063 -6720 -8691 -10335 -18025
$$ packed form
17078C40450j2751l4950l2939l9236k5387j2574j5044j4853r474l398Q019O303
17066A54166J3502L4441N2851O6710M6148q112n5523o7561n9749m4153k2940j5244
17054I4536j5062j9251q737J0758J7003J6116N886q0j4195j5853j9503k0629j3123
17041A7866j4164j1238J514J2959M877r841p145n212n561Q402R741J460n875j0106
17027a2323n049N897N48J817l255l619k850K533O270o225l875L161O969M133N005
17012h63O221K769J122M914j477q678j2270m639p064p736m046J771l675O887J087
16997b5677k434L178j000l701n590j864O645J5614J0394O164J208n048Q279P958
16983A4126o386p742p519J38Q240J628m553k02k309K573k057k657j971j644p690
$$ plain form
16968 -18025 -22116 -22285 -19601 -19783 -22262 -27537 -22793 -19498 -18299 -12509 -11418 -13035 -3103 1330 5279
16953 5279 865 -8813 -10648 -9375 -18715 -13441 -9856 -12077 -16531 -5274 965 -5870 -82 10383
16939 10383 13263 9127 2670 5252 825 -822 -7324 -15486 -22120 -23736 -22744 -24616 -30038 -22261 -13654
16924 -13654 -10712 -12162 -13613 -11947 -6925 -5445 -8224 -520 -1304 -1514 -3536 -12048 -15761 -18462 -22510
16909 -22510 -19210 -16207 -20766 -31568 -32876 -23510 -19877 -12533 -10903 -10013 -11967 -14458 -11547 -10411
16895 -10411 -9940 -9595 -11128 -12031 -18883 -20695 -26640 -25904 -20715 -14314 -17603 -13958 -16202 -19977 -26332
16880 -26332 -32916 -33123 -20868 -10964 376 799 -7375 -14961 -13240 -8797 -13496 -12277 -4386 -4337 -7133
16865 -7133 -4928 -3418 -1065 -5956 -13585 -13478 -13372 -11738 -14966 -17141 -12691 -9739 -9720 -6294 -5171 -7534
$$ packed form
16968a8025m091j69K684j82k479n275M744L295J199N790J091j617R932M433L949
16953E279m414r678j835J273r340N274L585k221m454J1257O239o835N788J0465
16939A0383K880m136o457K582m427j647o502q162o634j616R92j872n422P777Q607
16924a3654K942j450j451J666N022J480k779P704p84k10k022q512l713k701m048
16909b2510L300L003m559j0802j308R366L633P344J630Q90j954k491K911J136
16895a0411M71L45j533r03o852j812n945P36N189O401l289L645k244l775o355
16880b6332o584k07J2255R904J1340M23q174p586J721M443m699J219P891M9k796
16865g133K205J510K353m891p629J07J06J634l228k175M450K952J9L426J123k363
$$ plain form
16849 -7534 -14392 -11393 -8108 -8657 -10009 -15059 -15910 -13705 -11982 -10552 -8811 -10592 -6851 -8760 -4273
16834 -4273 203 -5313 -9259 -11853 -8322 -11840 -16714 -14993 -9054 -7318 -6400 -7185 -12940 -6932 3761
16819 3761 2950 -2397 2236 -4556 -8912 -5363 -3519 -2962 -9972 -20155 -17853 -20521 -14491 -14276 -15539
16804 -15539 -14251 -8664 1575 7521 3115 -3626 -6819 -12976 -21199 -15739 -15829 -19474 -19175 -15391 -14407
16789 -14407 -14829 -15300 -8356 -2636 -2288 -1404 -7661 -9309 -12847 -19967 -19858 -16556 -9681 -9699 -9708 -10624 -14503
16772 -14503 -19749 -17249 -12561 -9912 -11792 -24402 -20803 -11706 -5572 -9531 -11452 -13758 -11321 -7162
16758 -7162 -11167 -19369 -18929 -8519 -4160 -5585 -6025 -10413 -8084 -7237 -8152 -12223 -13325 -11550 -11555 -9115
16742 -9115 -10368 -9083 -4303 -5635 -2165 -6833 -17498 -28158 -34517 -29948 -24737 -23623 -21203 -15566
$$ packed form
16849g534o858K999L285n49j352n050q51K205J723J430J741j781L741j909M487
16834d273M476n516l946k594L531l518m874J721N939J736R18p85n755O008J0693
16819C761q11n347M633o792m356L549J844N57p010j0183K302k668O030K15j263
16804a5539J288N587J0239N946m406o741l193o157q223N460r0l645K99L784R84
16789a4407m22m71O944N720L48Q84o257j648l538p120J09L302O875j8rr16l879
16772a4503n246K500M688K649j880j2610L599R097O134l959j921k306K437M159
16758g162m005q202M40J0410M359j425m40m388K329Q47r15m071j102J775nK440
16742i115j253J285M780j332L470m668j0665j0660o359M569N211J114K420N637
$$ plain form
16728 -15566 -10240 -5403 -3929 -3479 -7831 -15393 -18222 -15258 -14487 -19644 -22616 -19348 -10581 4345 3377
16713 3377 -6118 -7017 -6571 -7936 -11535 -15389 -22509 -13026 -8612 -13943 -9806 -10915 -15078 -14483 -11594
16698 -11594 -8491 -13497 -13757 -8870 -7683 -6604 -9582 -10354 -13190 -24514 -33513 -33931 -25437 -23600 -22425
16683 -22425 -30987 -29931 -23892 -22604 -23590 -17973 -15925 -15792 -8595 -6152 -6823 -5210 -7322 -11616 -9153
16668 -9153 -2946 -3572 547 592 -8381 -15453 -18833 -20136 -22004 -23968 -28514 -21711 -19124 -20146 -12760
16653 -12760 -4069 -1402 -8590 -18918 -19674 -13292 -1115 7375 11740 8009 14835 22170 29217 34059
16639 34059 26163 12052 3993 -695 -1527 -6980 -8016 -5523 -7946 -6628 -4601 -5113 -3733 -6522 -7146
16624 -7146 -8462 -10222 -13389 -15589 -14892 -8266 -10115 -14807 -10693 -13465 -16042 -13957 -11359 -6149 -8571
$$ packed form
16728a5566N326M837J474M50m352p562k829K964P71n157k972L268Q767J4926r68
16713C377r495q99M46j365l599l854p120R483M414n331M137j109m163N95K889
16698a1594L103n006k60M887J187J079k978p72k836j1324q999m18Q494J837J175
16683b2425q562J056O039J288r86N617K048J33P197K443o71J613k112m294K463
16668i153O207o26M119M5q973p072l380j303j868j964m546O803K587j022P386
16653a2760Q691K667p188j0328p56O382J2177Q490M365l731O826P335P047M842
16639C4059p896j4111q059m688q32n453j036K493k423J318K027n12J380k789o24
16624g146j316j760l167k200O97O626j849m692M114k772k577K085K598N210k422
$$ plain form
16609 -8571 -7857 -12568 -18529 -11731 -13380 -12239 -10196 -17058 -15082 -12740 -4780 1951 2083 3618 11755
16594 11755 19741 32429 56463 77010 78717 72565 58083 45244 28781 21201 21182 18787 25839
16581 25839 26522 30044 40095 45492 46071 45923 31134 19202 18077 22192 18541 10149 -750 803
16567 803 5104 5198 2828 1653 5582 7195 9242 7187 3833 6651 5241 7406 9822 12433 10396
16552 10396 3473 6711 8833 8209 547 1691 9040 896 524 1251 7792 25850 37766 47753 50416
16537 50416 48124 47701 54326 57664 53768 47091 52884 64259 79641 93959 104669 101339 82792
16524 82792 60713 46108 46319 39689 28338 21537 19586 14477 14943 12240 11888 17502 6820 -2221
16510 -2221 -5693 4882 184 -11260 -19205 -15177 1410 -2882 -4845 -3055 -8965 -787 4499 8616
$$ packed form
16609h571P14m711n961O798j649J141K043o862J976K342P960O731J32J535Q137
16594A1755P986J2688K4034K0547J707o152j4482j2839j6463p580j9k395P052
16581B5839O83L522J0051N397N79j48j4789j1932j125M115l651q392j0899J553
16567H03M301R4k370j175L929J613K047k055l354K818j410K165K416K611k037
16552A0396o923L238K122o24p662J144P349q144l72P27O541J8058J1916R987K663
16537E0416k292m23O625L338l896o677N793J1375J5382J4318J0710l330j8547
16524H2792k2079j4605K11o630j1351o801j951n109M66k703l52N614j0682r041
16510b221l472J0575m698j1444p945M028J6587m292j963J790n910Q178N286M117
$$ plain form
16496 8616 5117 1229 2380 3695 5304 11080 16420 13417 22119 41608 61968 83266 94615 98211
16482 98211 92698 79932 71565 60397 54530 67039 84643 86928 83139 86239 93094 93034 85223 72013
16468 72013 57176 40820 28015 21541 9566 7894 11687 16615 13499 4643 7946 9210 4159
16455 4159 11858 14735 10666 19779 7297 2668 10302 12979 8245 4606 697 485 8610 9908 11321
16440 11321 14268 12610 10219 8784 22112 37750 54365 67377 65014 56212 40209 28527 28445
16427 28445 30020 37027 51636 61116 64903 80903 103402 113120 106463 83823 63828 54673 38328
16414 38328 28010 20304 17045 11031 10858 17324 21316 14996 5569 4400 8742 14401 11624 7045
16400 7045 599 -2379 6542 13365 13688 14618 7104 3074 4669 -3204 -8750 -8606 -10170 -5776 -6134 -2700
$$ packed form
16496H616l499l888J151J315J609N776N340l003Q702J9489K0360K1298J1349L596
16482I8211n513j2766q367j1168n867J2509J7604K285l789L100O855o0p811j3210
16468G2013j4837j6356j2805o474j1975j672L793M928l116q856L303J264n051
16455D159P699K877m069R113j2482m629P634K677m734l639l909k12Q125J298J413
16440A1321K947j658k391j435J3328J5638J6615J3012k363q802j6003j1682q2
16427B8445J575P007J4609R480L787J6000K2499R718o657k2640j9995r155j6345
16414C8328j0318p706l259o014j73O466L992o320r427j169M342N659k777m579
16400G045o446k978Q921O823L23R30p514m030J595p873n546J44j564M394l58L434
$$ plain form
16384 -2700 -5721 -13486 -11074 -6063 -1849 2459 4231 7616 6672 1045 3518 16960 25201 39348
16370 39348 53574 61231 60760 49699 41100 27130 13842 12438 19729 23140 20654 25024 19870 10966
16356 10966 6268 8905 3028 -4906 -11817 -7875 -412 2850 -2366 -1577 -1068 -254 -5934 -5717 -131
16341 -131 8604 12119 7042 -2325 -4075 -4741 -3628 -1688 1825 2741 -7166 -12439 -7404 -9941 -11474
16326 -11474 -9771 -6639 -3476 -4508 -7957 -10889 -10163 -1852 6628 15253 9414 5354 17413 20261
16312 20261 8009 6153 12734 20383 19932 14114 9138 3947 3392 2141 5764 17512 19592 9702
16298 9702 7413 6701 9452 23882 27104 25644 31730 32694 28987 15063 12717 8199 2007 -1024 -9735
16283 -9735 -10359 -4358 -1801 5738 12761 11129 3482 5932 4464 7434 7644 -3119 -6509 -10074 -12864
$$ packed form
16384b700l021p765K412N011M214M308J772L385r44n627K473J3442Q241J4147
16370C9348J4226P657m71j1061q599j3970j3288j404P291L411k486M370n154q904
16356A0966m698K637n877p934o911L942P463L262n216P89N09Q14n680K17N586
16341a31Q735L515n077r367j750o66J113J940L513R16r907n273N035k537j533
16326a1474J703L132L163j032l449k932P26Q311Q480Q625n839m060J2059K848
16312B0261j2252j856O581P649m51n818m976n191n55j251L623J1748K080r890
16298I702k289p12K751J4430L222j460O086R64l707j3924k346m518o192l031q711
16283i735o24O001K557P539P023j632p647K450j468K970K10j0763l390l565k790
$$ plain form
16268 -12864 -7250 6307 12756 19388 23651 20914 16015 19967 25642 24810 21274 14937 6232 10225
16254 10225 18736 17460 10383 2866 9640 11529 16752 11120 6564 11537 24940 40815 40776 30865
16240 30865 19344 19208 28197 30877 29514 22692 16867 16046 17222 23352 31732 30589 28160 36457 45586
16225 45586 48956 49647 43018 32015 24544 21199 25520 29369 33527 45877 54787 54847 57758 54772 56095
16210 56095 56976 46242 36803 48188 51322 56620 62037 58050 66767 80514 84442 85104 84757 76058
16196 76058 77865 89003 100106 100648 97859 107106 117975 134572 164083 193201 207913 223005 238923
16183 238923 258724 283269 311012 335448 374552 421452 483718 582551 725771 928682 1204357
16172 1204357 1588832 2145840 3005582 4323661 6028848 7553551 7942122 7018544 5564411
$$ packed form
16268a2864N614J3557O449O632M263k737m899L952N675q32l536o337q705L993
16254A0225Q511j276p077p517O774J889N223n632m556M973J3403J5875l9r911
16240C0865j1521j36Q989K680j363o822n825q21J176O130Q380j143k429Q297R129
16225D5586L370O91o629j1003p471l345M321L849M158J2350Q910O0K911k986J323
16210E6095Q81j0734r439J1385L134N298N417l987Q717J3747L928O62l47q699
16196G6058J807J1138J1103N42k789R247J0869J6597K9511K9118J4712J5092J5918
16183B38923J9801K4545K7743K4436L9104M6900O2266R8833J43220K02911K75675
16172A204357L84475N57008Q59742J318079J705187J524703L88571r23578j454133
$$ plain form
16163 5564411 4300871 3417572 2843990 2448334 2151848 1925856 1757998 1606735 1455171
16154 1455171 1313922 1176582 1056752 951580 854761 774303 714519 665832 622369 581316
16144 581316 554052 525353 497222 487836 478471 477592 492590 519866 550474 584037 605343 623632
16132 623632 642846 681390 723420 778898 859909 967706 1114303 1317966 1605536 2004753
16122 2004753 2561676 3333064 4440835 6154266 8835419 12517749 16120055 17313066
16114 17313066 15340837 12080430 9347101 7636869 6700380 6249069 6159647 6490656 7389219
16105 7389219 8842620 10411990 11090870 10242731 8485109 6750184 5453113 4551466 3916693
16096 3916693 3449719 3088513 2802213 2568921 2348732 2136297 1947583 1774412 1623839
$$ packed form
16163E564411j263540q83299n73582l95656k96486k25992j67858j51263j51564
16154A455171j41249j37340j19830j05172r6819q0458n9784m8687m3463m1053
16144E81316k7264k8699k8131r386r365q79J4998K7276L0608L3563K1306J8289
16132F23632J9214L8544M2030N5478Q1011J07797J46597K03663K87570L99217
16122B004753N56923P71388J107771J713431K681153L682330L602306J193011
16114A7313066j972229l260407k733329j710232r36489m51311q9422L31009Q98563
16105G389219J453401J569370O78880q48139j757622j734925j297071r01647o34773
16096C916693m66974l61206k86300k33292k20189k12435j88714j73171j50573
$$ plain form
16087 1623839 1497738 1401531 1325658 1271453 1226556 1185082 1160609 1149979 1145608 1164067 1206018
16076 1206018 1278143 1377288 1522204 1733873 2010495 2365581 2850684 3533390 4575036 6120477
16066 6120477 8164655 10222847 11424758 11661041 11878214 12829030 14117879 14471519 13597715
16057 13597715 12512213 12312293 13592130 16469924 20126362 22197210 20603279 16706369
16049 16706369 12887585 10173666 8399398 7189898 6286741 5580621 5038745 4610623 4217011
16040 4217011 3830676 3474672 3162397 2895293 2638331 2379942 2144474 1959548 1818200
16031 1818200 1696003 1602274 1536249 1494058 1463993 1431196 1407157 1396348 1424651 1481100 1563328
16020 1563328 1676134 1829999 2056732 2386800 2864110 3550647 4487896 5809327 7852119
$$ packed form
16087A623839j26101r6207p5873n4205m4897m1474k4473j0630m371J8459M1951
16076A206018P2125R9145J44916K11669K76622L55086M85103O82706J041646J545441
16066F120477K044178K058192J201911K36283K17173R50816J288849L53640q73804
16057A3597715j085502j99920J279837K877794L656438K070848j593931l896910
16049A6706369l818784k713919j774268j209500r03157p06120n41876m28122l93612
16040D217011l86335l56004l12275k67104k56962k58389k35468j84926j41348
16031A818200j22197r3729o6025m2191l0065l2797k4039j0809K8303N6449Q2228
16020A563328J12806J53865K26733L30068M77310O86537R37249J321431K042792
$$ plain form
16011 7852119 11084392 15616318 20199128 21916982 19786049 16275133 13768534 12990634
16003 12990634 13683678 15128872 16142777 15974574 15370430 15328587 15821046 15755688 14323877
15994 14323877 12029469 9823471 8164411 6999560 6149440 5487922 4986285 4618949 4318821
15985 4318821 3981414 3571530 3159733 2807265 2522624 2292639 2104280 1957346 1846942
15976 1846942 1777091 1729629 1697715 1668816 1618438 1551556 1508275 1514492 1563684 1658302 1822003
15965 1822003 2070874 2419055 2886812 3554072 4569564 6116611 8192145 10185633 10881997
15956 10881997 9929504 8296279 6964114 6287836 6188556 6561646 7410929 8938704 11542598
15947 11542598 15446898 19911584 22496246 21057165 17014928 12940196 10023167 8158046
$$ packed form
16011G852119L232273M531926M582810J717854k130933l510916k506599p77900
16003A2990634O93044J445194J013905j68203o04144m1843M92459o5358j431811
15994A4323877k294408k205998j659060j164851q50120o61518n01637l67336l00128
15985D318821l37407m09884m11797l52468k84641k29985j88359j46934j10404
15976A846942o9851m7462l1914k8899n0378o6882m3281O217M9192R4618J63701
15965A822003K48871L48181M67757O67260J015492J547047K075534J993488O96364
15956A0881997r52493j633225j332165o76278r9280L73090Q49283J527775K603894
15947A1542598L904300M464686K584662j439081m042237m074732k917029j865121
$$ plain form
15939 8158046 6942015 6071799 5434270 4984661 4631790 4264708 3859716 3464941 3135974
15930 3135974 2867222 2621094 2364505 2122753 1927993 1814344 1770930 1767135 1740274 1620121
15920 1620121 1435097 1259768 1120675 1023075 953376 908691 890985 871641 845734 834311 841105
15909 841105 851189 873863 925320 989615 1059083 1147702 1277976 1478531 1786634 2222051 2840821
15898 2840821 3759253 5164425 7132342 9255198 10429497 9833574 8066280 6213844
15890 6213844 4833922 3922369 3316146 2885489 2571688 2343271 2182543 2036654 1898873
15881 1898873 1796468 1761738 1767676 1714460 1554250 1341573 1165202 1056211 1009693 993218
15871 993218 971823 917865 850754 816150 803239 789406 749078 666757 581390 501898 436568
$$ packed form
15939H158046j216031q70216o37529m49609l52871l67082m04992l94775l28967
15930C135974k68752k46128k56589k41752j94760j13649m3414l795k6861j20153
15920A620121j85024j75329j39093r7600o9699m4685j7706j9344k5907j1423O794
15909H41105J0084K2674N1457O4295O9468Q8619J30274K00555L08103M35417O18770
15898B840821R18432J405172J967917K122856J174299n95923j767294j852436
15890F213844j379922r11553o06223m30657l13801k28417j60728j45889j37781
15881A898873j02405l4730N938n3216j60210k12677j76371j08991m6518j6475
15871I93218k1395n3958o7111l4604j2911j3833m0328q2321q5367p9492o5330
$$ plain form
15860 436568 396582 370335 350974 333060 326858 323116 311950 284889 260495 238725 218071 202557
15848 202557 196472 204786 223368 241439 263626 288027 303012 288669 244165 205552 186018 172645
15836 172645 169972 178317 190162 197320 207422 238464 283983 341397 400755 430416 412618 351633
15824 351633 294243 263570 260538 272208 290694 324016 382259 493815 647401 774683 771927
15813 771927 655663 514730 406522 336220 288583 248150 229154 216237 203387 189197 167202
15802 167202 147125 140390 136008 134733 120768 121913 127002 126355 125252 137110 157238 166307 153575
15789 153575 127988 107868 96921 88116 75632 68836 59604 57712 52957 53393 50190 56732 61967
15776 61967 67341 72265 73478 80157 86520 88986 96563 110722 137206 184263 252706 320049 367158
$$ packed form
15860D36568l9986k6247j9361j7914o202l742j1166k7061k4394k1770k0654j5514
15848B02557o085Q314J8582J8071K2187K4401J4985j4343m4504l8613j9534j3373
15836A72645k673Q345J1845P158J0102L1042M5519N7414N9358K9661j7798o0985
15824C51633n7390l0673l032J1670J8486L3322N8243J11556J53586J27282k756
15813G71927j16264j40933j08208p0302m7637m0433j8996j2917j2850j4190k1995
15802A67202k0077o735m382j275j3965J145N089o47j103J1858K0128R069j2732
15789A53575k5587k0120j0947q805j2484o796r232j892m755M36l203O542N235
15776F1967N374M924J213O679O363K466P577J4159K6484M7057O8443O7343M7109
$$ plain form
15763 367158 369961 316751 249466 199392 164486 147825 136805 125157 115075 104876 91859 82680
15751 82680 78086 76212 69822 63110 54814 41517 30326 31906 32290 25452 15145 7181 8464 4559
15737 4559 1507 1376 7036 8580 4780 6574 4033 15524 18640 16043 13296 5302 4220 4851 2184
15722 2184 -2213 -8045 -9202 6712 21963 27312 20365 14527 15120 12691 14136 8920 5082 9943
15708 9943 8220 -5378 -2395 4198 5477 -255 -3749 -4593 1245 7042 9397 6701 7419 -529 -1976
15693 -1976 4967 14636 17003 25982 34430 37500 30550 31991 33004 37019 37400 37116 36584 34082 34210 31112
15677 31112 16971 5770 3658 1983 10021 16227 6175 -3139 -2067 4936 4612 170 3107 5249
15663 5249 5670 1259 3410 2159 4209 2426 -2023 -3076 -3708 -4229 -9315 -7371 1525 19784 23901
$$ packed form
15763C67158K803n3210o7285n0074l4906j6661j1020j1648j0082j0199j3017r179
15751H2680m594j874o390o712q296j3297j1191J580L84o838j0307p964J283l905
15737D559l052j31N660J544l800J794k541J1491L116k597k747p994j082O31k667
15722B184m397n832j157J5914J5251N349o947n838N93k429J445n216l838M861
15708I943j723j3598K983O593J279n732l494q44N838N797K355k696P18p948j447
15693a976O943R669K367Q979Q448L070o950J441J013M015L81k84n32k502J28l098
15677C1112j4141j1201k112j675Q038O206j0052r314J072P003l24m442K937K142
15663E249M21m411K151j251K050j783m449j053o32n21n086J944Q896J8259M117
$$ plain form
15648 23901 26539 29131 22915 3484 -6486 -3337 -2391 4069 20285 44604 63450 67608 69380 68853
15634 68853 73410 70819 61756 56895 56011 50855 42862 37547 33083 25684 22595 29680 54562 66362
15620 66362 58788 38174 23669 16400 13637 7496 3454 5525 2229 -1341 8313 1139 -5549 -8716
15606 -8716 -7510 -10616 -11249 -11773 -3278 -8316 -18097 -15376 -5057 -59 -4665 -13865 -15598 -9267 -3419
15591 -3419 -5011 4730 13122 18531 19784 22220 29635 26387 35838 49731 55926 52555 55470 62485
15577 62485 55626 46072 37961 41509 56102 83440 98213 101625 89364 67836 45000 25527 24242
15564 24242 26617 25365 19901 16279 18563 17550 21316 20383 15964 17461 16931 18117 11331 338 -5184
15549 -5184 -5770 -77 -900 2752 7513 3402 2037 2942 -3463 -1572 -241 9650 13263 8808 13137
$$ packed form
15648B3901K638K592o216j9431r970L149R46O460J6216K4319J8846M158J772n27
15634F8853M557k591r063m861q84n156p993n315m464p399l089P085K4882J1800
15620F6362p574k0614j4505p269k763o141m042K071l296l570R654p174o688l167
15606h716J206l106o33n24Q495n038r781K721J0319M998m606r200j733O331N848
15591c419j592R741Q392N409J253K436P415l248R451J3893O195l371K915P015
15577F2485o859r554q111L548J4593K7338J4773L412j2261k1528k2836j9473j285
15564B4242K375j252n464l622K284j013L766r33m419J497n30J186o786j0993n522
15549e184n86N693q23L652M761m111j365R05o405J891J331R891L613m455M329
$$ plain form
15534 13137 17624 21413 16932 25547 47671 66146 84878 100261 92325 78521 73082 62288 60278
15521 60278 64826 69991 69762 70712 71974 76112 77270 68757 49077 41836 29824 25495 19842 15276
15507 15276 9076 5731 7769 5219 2287 -5431 -3736 3150 8063 7590 2492 340 -1224 -7912 -9331
15492 -9331 -10552 -11415 -2143 -3062 -4051 -4689 -7207 -3929 2965 8571 18185 24372 19923 25632 28439 30530
15476 30530 32389 35002 33090 26697 17782 16421 16029 21726 30819 43179 66797 91381 108009 104693
15462 104693 86812 70750 56699 54502 45097 34340 32115 33213 28276 23564 17397 17487 16153 11747
15448 11747 10378 2289 -5558 -3864 4477 4398 -3150 -6148 -7556 -7542 -11538 -9363 -8795 -3099 -3159 -3085 -4359
15431 -4359 -6679 303 -2316 -4236 -1825 -1340 -951 -1867 -1998 -8007 -15240 -19029 -14051 1787 9593
$$ packed form
15534A3137M487L789m481Q615K2124J8475J8732J5383p936j3804n439j0794k010
15521F0278M548N165k29R50J262M138J158q513j9680p241j2012m329n653m566
15507A5276o200l345K038k550k932p718J695O886M913m73n098k152j564o688j419
15492i331j221q63R272r19r89o38k518L278O894N606R614O187m449N709K807K091
15476C0530J859K613j912o393q915j361l92N697R093J2360K3618K4584J6628l316
15462A04693j7881j6062j4051k197r405j0757k225J098m937m712o167R0j334m406
15448A1747j369q089p847J694Q341p9p548k998j408J4l996K175N68N696o0P4j274
15431d359k320O982k619j920K411M85L89r16j31o009p233l789M978J5838P806
$$ plain form
15416 9593 11729 18758 25266 34028 33002 23670 11816 5539 3818 -1269 -7697 -15020 -6930 -2406
15402 -2406 -3001 2351 -748 -13571 -11879 -7734 -5458 -10474 -9749 -9561 -9687 -15507 -19100 -17773 -9827
15387 -9827 -9746 -11961 -13663 -13193 -12507 -22394 -21917 -15833 -16081 -13314 -7202 -6384 -10007 -15560 -15925 -17133 -15467
15370 -15467 -11511 -12921 -12465 -11613 -13000 -20435 -23163 -21951 -16003 -11294 -6636 -1346 -6260 -23188 -25612
15355 -25612 -23532 -20085 -13452 -13035 -12984 -14373 -8042 -5113 -4814 -6612 -8985 -13580 -10963 -6837 -14535
15340 -14535 -19812 -17929 -19612 -11969 -1379 506 4844 -1593 -11607 -13045 -16570 -17949 -16269 -13677
15326 -13677 -16969 -18875 -16739 -18288 -14750 -12457 -18773 -17114 -16487 -17650 -14687 -6249 -7828 -8467 -15536
15311 -15536 -21744 -19851 -21671 -23809 -28138 -27160 -29055 -26596 -24761 -17329 -14400 -13049 -11928 -10003 -9924
$$ packed form
15416I593K136P029O508Q762j026r332j1854o277j721n087o428p323Q090M524
15402b406n95N352l099j2823J692M145K276n016P25J88j26n820l593J327P946
15387i827Q1k215j702M70O86r887M77O084k48K767O112Q18l623n553l65j208J666
15370a5467L956j410M56Q52j387p435k728J212N948M709M658N290m914j6928k424
15355b5612K080L447O633M17N1j389O331K929K99j798k373m595K617M126p698
15340a4535n277J883j683P643J0590J885M338o437j0014j438l525j379J680K592
15326a3677l292j906K136j549L538K293o316J659O27j163K963Q438j579o39p069
15311a5536o208J893j820k138m329R78j895K459J835P432K929J351J121J925P9
$$ plain form
15296 -9924 -7018 -9168 -9867 -12314 -15335 -21687 -24150 -25986 -16761 -9245 -7207 -12739 -14264 -12365 -14701
15281 -14701 -15171 -21085 -21838 -14844 -11608 -8137 -9299 -6536 1255 -6397 -17350 -15461 -16763 -21556 -19839
15266 -19839 -29363 -33549 -24242 -19556 -15865 -14739 -11437 -12830 -13343 -6676 -10625 -11203 -14509 -17095 -17666
15251 -17666 -15698 -4795 -8422 -11253 -13012 -18510 -20193 -20707 -12871 -12989 -16193 -17459 -22712 -20222 -21600
15236 -21600 -24632 -26359 -27928 -34205 -28643 -16360 -12470 -19684 -22026 -30356 -34123 -34149 -30131 -25067 -19177
15221 -19177 -7894 -8718 -18038 -17346 -24613 -32349 -30734 -28889 -20889 -21658 -20214 -23348 -14096 -3807 -2906
15206 -2906 -12204 -24735 -26395 -25768 -26466 -16299 -10207 -12121 -15383 -19441 -17585 -13017 -14008 -20448 -22841
15191 -22841 -27263 -29036 -17539 -9252 -6040 -6775 -12538 -8406 -11112 -10767 -10954 -12195 -6280 -11760 -15083
$$ packed form
15296i924K906k150o99k447l021o352k463j836R225P516K038n532j525J899k336
15281a4701m70n914p53O994L236L471j162K763P791p652j0953J889j302m793J717
15266a9839r524m186R307M686L691J126L302j393n13O667l949n78l306k586n71
15251a7666J968J0903l627k831j759n498j683n14P836j18l204j266n253K490j378
15236b1600l032j727j569o277N562J2283L890p214k342q330l767k6M018N064N890
15221a9177J1283q24r320O92p267p736J615J845Q000p69J444l134R252J0289R01
15206b906r298j2531j660O27o98J0167O092j914l262m058J856M568r91o440k393
15191b2841m422j773J1497Q287L212p35n763M132k706L45j87j241N915n480l323
$$ plain form
15176 -15083 -24209 -28898 -27530 -20108 -14079 -18568 -18038 -21469 -18486 -23678 -29472 -26904 -23020 -20356 -22956
15161 -22956 -24859 -26254 -19447 -16897 -24773 -27988 -16653 -8541 -11737 -15817 -12947 -8530 -11405 -14848
15147 -14848 -14652 -20551 -23565 -16015 -11522 -11740 -19642 -20267 -25439 -16067 -10100 -13766 -13849 -14413 -13375 -12235
15131 -12235 -7777 -52 1755 -4132 -14933 -18730 -18426 -19878 -10216 -4575 -12767 -12041 -7691 -3776 4696
15116 4696 10850 -1664 -6248 -11129 -10046 -1516 -4808 -8486 -12114 -10386 -11277 -1306 9003 9128 7651
15101 7651 14613 23499 36869 44999 55223 51414 48825 55596 61859 56035 58048 71837 87222 103545
15087 103545 114150 121207 124201 118420 110255 111946 116002 117807 117166 115436 126341 138008 151491
15074 151491 163551 150474 126445 95927 77544 72325 72818 77953 81036 77763 70759 62830 54773
$$ packed form
15176a5083r126m689J368P422O029m489N30l431K983n192n794K568L884K664k600
15161b2956j903j395O807K550p876l215J1335Q112l196m080K870M417k875l443
15147a4848J96n899l014P550M493k18p902o25n172R372N967l666q3n64J038J140
15131a2235M458P725J807n887j0801l797L04j452R662N641q192P26M350L915Q472
15116D696O154j2514m584m881J083Q530l292l678l628J728q91R971J0309J25j477
15101G651O962Q886J3370Q130J0224l809k589O771O263n824K013J3789J5385J6323
15087A03545J0605P057K994n781q165J691M056J805o41j730J0905J1667J3483
15074A51491J2060j3077k4029l0518j8383n219M93N135L083l273p004p929q057
$$ plain form
15061 54773 47728 34794 21907 12156 13917 12659 5626 497 2349 8881 13602 16772 10659 6863
15047 6863 2601 1218 1785 8189 8511 2502 -1657 -2373 905 -2791 -11488 -6695 1420 5878 2151
15032 2151 -4787 -8963 -8919 -11239 -15457 -24074 -27492 -26677 -20112 -7810 -1684 -7496 -9685 -14879 -12452
15017 -12452 -11523 -5588 216 -986 -8521 -10712 -16015 -7496 -3305 710 -3525 -16935 -15039 -10075
15003 -10075 -4413 -5375 5642 16477 15281 4804 -2346 -2345 381 8963 15089 27861 41112 54366
14989 54366 53079 46038 33794 31627 39571 49986 65258 81002 93639 95159 88343 87530 78205
14976 78205 79163 87865 90181 91613 100087 108174 113707 121818 132527 135270 123532 108153 94604 84650
14962 84650 71114 65491 69317 79026 77027 64133 59893 52208 48894 40249 35645 27340 18116 11103
$$ packed form
15061E4773p045j2934j2887r751J761j258p033n129J852O532M721L170o113l796
15047F863m262j383N67O404L22o009m159p16L278l696q697M793Q115M458l727
15032B151o938m176M4k320m218q617l418Q15O565J2302O126n812k189n194K427
15017a2452R29N935N804j202p535k191n303Q519M191M015m235j3410J896M964
15003a0075N662r62J1017J0835j196j0477p150JK726Q582O126J2772J3251J3254
14989E4366j287p041j2244k167P944J0415J5272J5744J2637J520o816q13r325
14976G8205R58Q702K316J432Q474Q087N533Q111J0709K743j1738j5379j3549r954
14962H4650j3536n623L826R709j999j2894m240p685l314q645m604q305r224p013
$$ plain form
14948 11103 17560 23312 17701 7432 3051 5706 5886 -3295 -14178 -7839 -3149 -3977 -4686 -5022 -2439
14933 -2439 -3288 -8561 -6128 2200 -4750 -10900 -13348 -13251 -11358 -11791 -10956 -14088 -15585 -10948 -13288 -18186
14917 -18186 -22961 -19048 -15590 -18144 -22102 -19946 -14041 -16045 -15617 -16782 -8728 -3956 -7287 -5485 -2659
14902 -2659 -89 1252 -5230 -7304 -439 12242 25959 38821 48168 45633 53611 64610 63041 59278
14888 59278 75877 97433 120061 132011 120963 117734 114033 111670 116985 130069 140585 132579 113450
14875 113450 108551 111225 121361 138617 145805 138107 122384 110726 101784 96708 97159 97666 101060 92806
14861 92806 77480 73924 64027 62212 50642 46786 42147 46190 47121 49524 44038 38665 27139 25507
14847 25507 25392 26177 30031 24573 17202 13736 17779 18176 17785 12615 20009 28597 26833 26171 27211 37100
$$ packed form
14948A1103O457N752n611j0269m381K655J80r181j0883O339M690q28p09l36K583
14933b439q49n273K433Q328o950o150k448R7J893m33Q35l132j497M637k340m898
14917a8186m775L913L458k554l958K156N905k004M28j165Q054M772l331J802K826
14902b659K570J341o482k074O865J2681J3717J2862R347k535P978J0999j569l763
14888E9278J6599K1556K2628J1950j1048l229l701k363N315J3084J0516q006j9129
14875A13450m899K674J0136J7256P188p698j5723j1658q942n076M51N07L394q254
14861I2806j5326l556r897j815j1570l856m639M043R31K403n486n373j1526j632
14847B5507j15P85L854n458p371l466M043L97l91n170P394Q588j764o62J040R889
$$ plain form
14831 37100 50923 64158 72918 82031 75568 71990 81582 90842 111542 122722 122199 111272 96361
14818 96361 94332 110032 120967 122092 114897 107995 108649 110676 115320 123749 135157 126055 107157 93715
14804 93715 88732 86120 85163 84050 78685 75001 67313 59587 44633 36924 39079 31119 23550 23307 22292
14789 22292 19652 22227 25219 23407 19368 21198 16033 19346 22739 19730 17209 9780 5627 15981
14775 15981 21677 16502 18361 10587 4458 7216 18469 23308 31861 31327 23871 19454 14532 18537
14761 18537 19026 22398 26953 31177 34486 35634 25876 16230 14936 16013 14910 22133 25463 29755 25287
14746 25287 31406 41532 47892 48468 41586 37745 38245 39397 44408 56785 65850 71743 74140 69479
14732 69479 64349 60734 66569 63326 55151 53880 56389 67002 69432 63283 61889 71644 81515 73719
$$ packed form
14831C7100J3823J3235Q760R113o463l578R592R260K0700J1180n23j0927j4911
14818I6361k029J5700J0935J125p195o902O54K027M644Q429J1408r102j8898j3442
14804I3715m983k612r57j113n365l684p688p726j4954p709K155p960p569k43j015
14789B2292k640K575K992j812m039J830n165L313L393l009k521p429m153J0354
14775A5981N696n175J859p774o129K758J1253M839Q553n34p456m417m922M005
14761A8537M89L372M555M224L309J148r758r646j294J077j103P223L330M292m468
14746B5287O119J0126O360N76o882l841N00J152N011J2377R065N893K397m661
14732F9479n130l615N835l243q175j271K509J0613K430o149j394R755R871p796
$$ plain form
14718 73719 73030 69215 67097 65753 70275 73845 71979 78320 76601 72645 74280 75188 74486 69944 73135
14703 73135 68780 68257 65943 65229 64417 64618 58205 50091 44416 50807 52953 56497 59775 60002 62559 59551
14687 59551 61557 65009 59903 55714 67003 69960 73470 75036 78460 81672 84924 85849 85072 90412 100909
14672 100909 101735 102428 108420 110715 107043 104781 103360 100325 112033 120017 126766 124764 129785 137888
14658 137888 142173 147184 164132 182930 193955 200713 207917 208276 216608 230117 237981 240479 261060
14645 261060 289587 304728 313838 331172 359600 388543 425596 460020 485159 506202 536726 562413
14633 562413 607106 674092 739916 816916 914379 1010000 1120704 1253134 1431249 1681722 2022588
14622 2022588 2491689 3147742 4118758 5572623 7609963 9833269 11209850 11145684 10277659
$$ packed form
14718G3719o89l815k118j344M522L570j866O341j719l956J635R08p02m542L191
14703G3135m355n23k314p14q12K01o413q114n675O391K146L544L278K27K557l008
14687E9551K006L452n106m189J1289K957L510J566L424L212L252R25p77N340J0497
14672A00909Q26O93N992K295l672k262j421l035J1708P984O749k002N021Q103
14658A37888M285N011J6948J8798J1025O758P204L59Q332J3509P864K498K0581
14645B61060K8527J5141R110J7334K8428K8943L7053L4424K5139K1043L0524K5687
14633E62413M4693O6986O5824P7000R7463R5621J10704J32430J78115K50473L40866
14622B022588M69101O56053R71016J453865K037340K223306J376581o4166q68025
$$ plain form
14613 10277659 9612520 9667086 10580706 12629613 16188725 20991361 25135943 26133891 24785711
14604 24785711 23593668 23442508 23203142 22265204 21528680 21930932 23262784 24487863 25453178
14595 25453178 27261252 30141276 31703357 29426024 24664101 20123977 17083743 15473772
14587 15473772 14959418 15371760 16467189 17358349 16777140 14617924 11949469 9680305 8009085
14578 8009085 6792405 5877506 5162848 4598642 4134672 3722897 3351171 2999226 2669297
14569 2669297 2367199 2096505 1851243 1639903 1466850 1328993 1216673 1123551 1039260 948439
14559 948439 856514 785394 735532 682460 638991 600702 565004 530447 506831 489451 475901
14548 475901 470031 467581 465897 466324 466281 464364 459771 462034 467578 473770 482566 499765 521479 542086
$$ packed form
14613A0277659o65139N4566R13620K048907L559112M802636M144582R97948j348180
14604B4785711j192043j51160k39366r37938p36524M02252J331852J225079R65315
14595B5453178J808074K880024J562081k277333m761923m540124l040234j609971
14587A5473772n14354M12342J095429Q91160n81209k159216k668455k269164j671220
14578H009085j216680r14899p14658n64206m63970m11775l71726l51945l29929
14569B669297l02098k70694k45262k11340j73053j37857j12320r3122q4291r0821
14559I48439r1925p1120m9862n3072m3469l8289l5698l4557k3616j7380j3550
14548D75901n870k450j684M27m3j917m593K263N544O192Q796J7199K1714K0607
$$ plain form
14534 542086 576242 610482 638865 652378 669101 690379 727845 764515 802628 860153 938399
14523 938399 1034855 1164793 1325236 1498813 1658380 1807615 1983104 2239118 2642205 3259473
14513 3259473 4187576 5585732 7524864 9597787 10818035 10684402 9878778 9285602 9311830
14504 9311830 10077773 11850651 14980043 19261412 23008976 23940540 22759234 21704041
14496 21704041 21520965 21191326 20237188 19488365 19772972 20911503 21950590 22738962 24251979
14487 24251979 26704986 28046637 26067853 21933331 17963411 15269594 13810132 13298634
14479 13298634 13603232 14511983 15255521 14747700 12878879 10568015 8578577 7097997 6020160
14470 6020160 5206168 4573073 4076221 3676214 3321024 2989713 2673079 2371764 2106110
$$ packed form
14534E42086L4156L4240K8383J3513J6723K1278L7466L6670L8113N7525P8246
14523I38399R6456J29938J60443J73577J59567J49235J75489K56014M03087O17268
14513C259473R28103J398156J939132K072923J220248j33633q05624n93176K6228
14504I311830P65943J772878L129392M281369L747564R31564j181306j055193
14496B1704041j83076l29639r54138p48823K84607J138531J039087P88372J513017
14487B4251979K453007J341651j978784m134522l969920k693817j459462n11498
14479A3298634L04598R08751P43538n07821j868821k310864j989438j480580j077837
14470F020160q13992o33095m96852m00007l55190l31311l16634l01315k65654
$$ plain form
14461 2106110 1886241 1692059 1512865 1366790 1248020 1150409 1066920 981121 901116 826910
14451 826910 770424 721765 677363 639572 606916 578854 556636 541189 536519 526297 522273 512306
14439 512306 499986 492603 498836 517041 535135 547163 551383 541037 536913 550249 580296 621325
14427 621325 654384 665301 662948 658314 665830 683127 715233 745960 779412 805867 845558 895643
14415 895643 986018 1094646 1211288 1310079 1366871 1409240 1479937 1598207 1774944 2052302
14405 2052302 2456359 3021856 3787053 4779233 6183131 8283878 11025331 13545916 14644868
14396 14644868 14510337 14418266 15433481 18159344 22628797 27343047 29104710 27203319
14388 27203319 24285587 22787843 23463604 25832772 28299419 28766137 26935453 24581209
$$ packed form
14461B106110k19869j94182j79194j46075j18770r7611q3489q5799q0005p4206
14451H26910n6486m8659m4402l7791l2656k8062k2218j5447m670j0222m024r967
14439E12306j2320p383O233J8205J8094J2028M220j0346m124J3336L0047M1029
14427F21325L3059J0917k353m634P516J7297L2106L0727L3452K6455L9691N0085
14415H95643R0375J08628J16642R8791N6792M2369P0697J18270J76737K77358
14405B052302M04057N65497P65197R92180J403898K100747K741453K520585J098952
14396A4644868j34531r2071J015215K725863M469453M714250J761663j901391
14388B7203319k917732j497744O75761K369168K466647M66718j830684k354244
$$ plain form
14380 24581209 23424909 24166003 26515327 28686697 28037803 24751031 21123301 18723829
14372 18723829 17722065 17715046 17882271 17115666 15175604 12892653 10982061 9556099 8427285
14363 8427285 7442589 6603220 5960976 5489700 5136804 4839332 4532441 4183184 3847920
14354 3847920 3604288 3451215 3345743 3268070 3172170 3017513 2861453 2767677 2747398 2766134
14344 2766134 2807554 2878720 3015821 3281187 3744821 4445082 5498726 7104541 9338159
14335 9338159 11728130 13188129 13337734 13085020 13541473 15388171 18872300 23251644 25992605
14326 25992605 25208228 22596410 20718514 20773149 22637209 25182795 26400114 25241899
14318 25241899 22915449 21267485 21338114 23229770 25846011 26489598 24041087 20447051
$$ packed form
14380B4581209j156300P41094K349324K171370o48894l286772l627730k399472
14372A8723829j001764p019J67225p66605j940062k282951j910592j425962j128814
14363H427285r84696q39369o42244m71276l52896k97472l06891l49257l35264
14354C847920k43632j53073j05472p7673r5900j54657j56060r3776k0279J8736
14344B766134M1420P1166J37101K65366M63634P00261J053644J605815K233618
14335I338159K389971J459999J49605k52714M56453J846698L484129M379344K740961
14326B5992605p84377k611818j877896N4635J864060K545586J217319j158215
14318B5241899k326450j647964P0629J891656K616241O43587k448511l594036
$$ plain form
14310 20447051 17686160 16314937 16083159 16379039 16127159 14612784 12396120 10366622
14302 10366622 8845184 7708178 6760531 5950884 5292253 4796666 4416206 4091455 3792401
14293 3792401 3475404 3157030 2883536 2679891 2523232 2402934 2290942 2123053 1925491
14284 1925491 1764300 1647245 1553073 1468124 1378617 1274536 1173198 1093976 1034803 968965
14274 968965 875902 780755 703924 649658 619024 589539 552956 515636 480360 438088 392533
14263 392533 357558 334501 318125 294871 280163 274486 257384 241761 235078 233359 229730 222613
14251 222613 216222 200293 182999 176514 171833 162053 151629 148353 142897 129951 121654 124765 126249
14238 126249 121369 106469 100276 102339 99128 106054 99962 94772 97032 88017 81449 80265 76404 73796
$$ packed form
14310B0447051k760891j371223k31778K95880k51880j514375k216664k029498
14302A0366622j521438j137006r47647q09647o58631m95587l80460l24751k99054
14293C792401l16997l18374k73494k03645j56659j20298j11992j67889j97562
14284A925491j61191j17055r4172q4949q9507j04081j01338p9222n9173o5838
14274I68965r3063r5147p6831n4266l0634k9485l6583l7320l5276m2272m5555
14263C92533l4975k3057j6376k3254j4708n677j7102j5623o683j719l629p117
14251B22613o391j5929j7294o485m681r780j0424l276n456j2946q297L111J484
14238A26249m880j4900o193K063l211O926o092n190K260r015o568j184l861k608
$$ plain form
14224 73796 69011 74552 73763 72422 58761 58726 55891 63097 68716 66555 62737 65300 60608 60606 60323 63828
14208 63828 62741 60097 61851 56366 50158 52135 57061 58817 55839 53018 50257 52421 53018 62050 63797
14193 63797 50852 48803 53474 48057 49543 53823 52450 46070 48545 48336 45021 36268 41287 50205
14179 50205 45895 44269 48251 47643 43069 42624 39478 37367 39269 44875 49491 45775 29675 24377 24578
14164 24578 30768 33116 33143 30427 28431 35700 42167 35906 22071 19677 23386 16996 8003 -2489
14150 -2489 5689 18001 26944 29000 26053 15571 13445 10069 11651 13334 14289 19919 22401 23713
14136 23713 16101 19643 31340 41061 44210 41542 45052 58473 66859 68888 66027 63523 66669 75455
14122 75455 85938 94437 115581 138204 154477 149372 138557 126528 123135 123555 128071 133203 123795
$$ packed form
14224G3796m785N541p89j341j3661l5k835P206N619k161l818K563m692kk83L505
14208F3828j087k644J754n485o208J977M926J756k978k821k761K164N97R032J747
14193F3797j2945k049M671n417J486M280j373o380K475k09l315q753N019Q918
14179E0205m310j626L982o08m574m45l146k111J902N606M616l716j6100n298K01
14164B4578O190K348K7k716j996P269O467o261j3835k394L709o390q993j0492
14150b489Q178J2312Q943K056k947j0482k126l376J582J683R55N630K482J312
14136B3713p612L542J1697R721L149k668L510J3421Q386K029k861k504L146Q786
14122G5455J0483Q499K1144K2623J6273n105j0815j2029l393M20M516N132r408
$$ plain form
14109 123795 124602 133825 141999 153401 161959 159771 147325 128189 105025 95022 89328 84757 92651
14096 92651 102746 107407 100072 85412 64395 42833 31301 31726 31507 31538 34609 39264 33952 23209
14082 23209 17355 14851 9458 -3826 -6849 -2064 21 1038 1456 -3770 -10050 -3269 2231 8505
14068 8505 14207 16739 7305 -6954 -12191 -9275 3075 13061 9281 78 -3991 -4041 4571 12221 15401
14053 15401 8966 6657 1575 -4594 901 3982 -323 2471 1179 9712 19632 16918 8466 2863
14039 2863 -614 -2884 -1070 2982 4287 -2872 -622 6260 26577 39866 33511 20014 9757 542
14025 542 -4020 -983 12904 25993 37949 40400 47049 48180 49789 49168 54481 72320 96627 113113
14011 113113 124326 115384 102050 94423 91647 88148 89031 90852 98246 102887 110207 118045 120714 128448
$$ packed form
14109A23795Q07R223Q174J1402Q558k188j2446j9136k3164j0003n694m571P894
14096I2651J0095M661p335j4660k1017k1562j1532M25k19L1L071M655n312j0743
14082B3209n854k504n393j3284l023M785K085J017M18n226o280O781N500O274
14068H505N702K532r434j4259n237K916J2350R986l780r203m069n0Q612P650L180
14053A5401o435k309n082o169N495L081m305K794j292Q533R920k714q452n603
14039B863l477k270J814M052J305p159K250O882K0317J3289o355j3497j0257r215
14025E42m562L037J3887J3089J1956K451O649J131J609o21N313J7839K4307J6486
14011A13113J1213q942j3334p627k776l499Q83J821P394M641P320P838K669P734
$$ plain form
13997 128448 120705 105821 90569 77695 69529 69490 66187 66010 64528 59057 50932 36230 33367 30621
13983 30621 25894 23862 23941 19647 4922 -4620 -4960 2852 4177 11032 14890 9436 1907 -672 -2628
13968 -2628 -10657 -16297 -24650 -23712 -23860 -18899 -10950 -7628 -4086 -9193 -11692 -18663 -29919 -28873 -25226
13953 -25226 -20285 -18052 -21916 -21871 -20466 -12429 -4456 -220 -2505 -6922 -9611 -7834 -7537 -10473 -16900
13938 -16900 -27658 -33548 -39638 -42269 -43015 -40519 -29332 -22151 -27147 -14718 -9188 -12558 -15176 -12718
13924 -12718 -7689 -8806 -6061 -6038 1090 -3358 -972 4201 6886 9415 8915 9619 9659 1953 -1149 -6843
13908 -6843 -6952 -8396 -4404 96 3698 -1085 645 5697 5558 11553 25402 36856 45744 53777 55765
13893 55765 54016 52817 71206 100712 113409 116632 109839 98316 90129 89043 104178 123896 126240
$$ packed form
13997A28448p743j4884j5252j2874q166l9l303j77j482n471q125j4702k863k746
13983C0621m727k032P9m294j4725r542l40P812J325O855L858n454p529k579j956
13968b628q029n640q353R38j48M961P949L322L542n107k499o971j1256J046L647
13953b5226M941K233l864M5J405Q037P973M236k285m417k689J777K97k936o427
13938a6900j0758n890o090k631p46K496J1187P181m996J2429N530l370k618K458
13924a2718N029j117K745K3P128m448K386N173K685K529n00P04M0p706l102n694
13908f843j09j444L992M500L602m783J730N052j39N995J3849J1454Q888Q033J988
13893E5765j749j199J8389K9506J2697L223o793j1523q187j086J5135J9718K344
$$ plain form
13880 126240 117190 106300 97507 94735 103910 107614 111273 108075 93811 81333 74101 67300 62648
13867 62648 62292 60612 49539 42434 37286 32321 19964 9985 8140 2861 3413 3625 4446 4846 -710
13852 -710 -7149 2809 -2310 -5317 2090 4312 -4617 -8043 -10611 -8746 -57 3415 4605 1510 -1514
13837 -1514 6536 11159 23649 34564 46210 45899 44307 38986 40675 55766 77825 99288 106214
13824 106214 103239 97648 88420 94567 100301 113323 121628 113435 110460 101652 98846 105609 110876 109232
13810 109232 103116 86866 79665 72328 67122 59579 55467 54124 48877 42518 33261 27807 19620 19333
13796 19333 14693 4262 2089 -8969 -18467 -17650 -15616 -14194 -15137 -10629 -9061 -10715 1606 -3611
13782 -3611 -11584 -17935 -18797 -14920 -12852 -7909 -7955 -15601 -17897 -22221 -24437 -23120 -14730 -6217 -6373 -11800
$$ packed form
13880A26240r050j0890q793k772R175L704L659l198j4264j2478p232o801m652
13867F2648l56j680j1073p105n148m965j2357r979j845n279N52K12Q21M00n556
13852g10o439R958n119l007P407K222q929l426k568J865Q689L472J190l095l024
13837a514Q050M623J2490J0915J1646l11j592n321J689J5091K2059K1463O926
13824A06214k975n591r228O147N734J3022Q305q193k975q808k806O763N267j644
13810A09232o116j6250p201p337n206p543m112j343n247o359r257n454q187k87
13796A9333m640j0431k173j1058r498Q17K034J422r43M508J568j654J2321n217
13782c611p973o351q62L877K068M943m6p646k296m324k216J317Q390Q513j56n427
$$ plain form
13766 -11800 -14157 -12638 -14754 -17410 -23417 -30553 -24094 -22187 -25430 -25606 -27663 -27648 -22771 -24763 -23445
13751 -23445 -21263 -7691 -10063 -21520 -26985 -29679 -27328 -23941 -20799 -17710 -21271 -26342 -28353 -30299
13737 -30299 -30103 -22881 -25042 -26134 -17892 -15868 -23357 -28717 -26410 -26546 -26920 -26402 -23798 -14682 -17335
13722 -17335 -25649 -20028 -15669 -20000 -22739 -22963 -21204 -21827 -19033 -15361 -19009 -24468 -22918 -20488 -22698
13707 -22698 -20230 -21826 -26178 -24202 -12867 -2800 -6398 -13378 -16276 -23762 -22627 -17243 -13108 -17188
13693 -17188 -27085 -17585 -11390 -9523 -13968 -28281 -33626 -34069 -27703 -21012 -23420 -17987 -17669 -21726 -18548
13678 -18548 -23096 -34237 -30695 -32249 -37103 -34013 -24979 -17173 -21064 -19146 -15227 -14103 -20667 -32299
13664 -32299 -28559 -25650 -20639 -19028 -28148 -31477 -37129 -41757 -34595 -29939 -22680 -23157 -21691 -19839 -23367
$$ packed form
13766a1800k357J519k116k656o007p136O459J907l243j76k057J5M877j992J318
13751b3445K182J3572k372j1457n465k694K351L387L142L089l561n071k011j946
13737c0299J96P222k161j092Q242K024p489n360K307j36l74N18K604R116k653
13722a7335q314N621M359m331k739k24J759o23K794L672l648n459J550K430k210
13707b2698K468j596m352J976J1335J0067l598o980k898p486J135N384M135m080
13693a7188r897R500O195J867m445j4313n345m43O366O691k408N433L18m057L178
13678a8548m548j1141L542j554m854L090R034P806l891J918L919J124o564j1632
13664c2299L740K909N011J611r120l329n652m628P162M656P259m77J466J852l528
$$ plain form
13649 -23367 -32352 -32323 -26546 -20085 -27450 -32690 -25213 -17651 -15486 -19262 -16990 -13982 -9701 -11508 -13491
13634 -13491 -17014 -15411 -18562 -26228 -28284 -24909 -18302 -17820 -9633 -3658 -1392 -11409 -10613 -13842 -23464
13619 -23464 -24765 -23706 -26395 -25038 -24590 -26122 -17373 -13614 -12943 -11508 -13539 -12582 -14719 -14137 -11325
13604 -11325 -6118 -10312 -19572 -28178 -34635 -29449 -22844 -22629 -24601 -23112 -22360 -29447 -30477 -18777 -15960
13589 -15960 -25958 -30596 -23806 -22262 -22495 -27028 -28370 -29434 -26540 -26556 -25256 -25356 -23904 -17847 -21599
13574 -21599 -23269 -23138 -29219 -32749 -38852 -32310 -23477 -32604 -40795 -42577 -33687 -33061 -29518 -23337 -18915
13559 -18915 -18752 -15431 -17330 -25591 -32528 -31066 -31145 -26721 -26855 -26195 -29177 -29033 -28614 -28174 -24153 -17927
13543 -17927 -3597 -3821 -15047 -22627 -20115 -13244 -16323 -15205 -17728 -19155 -26171 -22975 -25905 -27990
$$ packed form
13649b3367q985K9N777O461p365n240P477P562K165l776K272L008M281j807j983
13634a3491l523J603l151p666k056L375O607M82Q187N975K266j0017P96l229r622
13619b3464j301J059k689J357M48j532Q749L759O71J435k031R57k137N82K812
13604a1325N207m194r260q606o457N186O605K15j972J489P52p087j030J1700K817
13589a5960r998m638O790J544k33m533j342j064K894j6J300j00J452O057l752
13574b1599j670J31o081l530o103O542Q833r127q191j782Q890O26L543O181M422
13559a8915J63L321j899q261o937J462p9M424j34O60k982J44M19M40M021O226
13543a7927J4330k24j1226p580K512O871l079J118k523j427p016L196k930k085
$$ plain form
13529 -27990 -26063 -29738 -29966 -26902 -17012 -14585 -9105 -12937 -18991 -21545 -20411 -19952 -26701 -30108 -31448
13514 -31448 -27577 -26215 -27832 -27092 -17052 -3452 -4509 -15974 -23505 -20407 -5765 -3652 -13466 -15920
13500 -15920 -9337 -9324 -18387 -26582 -27245 -25245 -24666 -27306 -33689 -34703 -28779 -22837 -19483 -13993 -20782
13485 -20782 -23567 -21836 -14260 -11932 -17511 -22070 -25976 -24216 -20754 -19000 -12683 -17578 -27987 -33700
13471 -33700 -33585 -34337 -32022 -24593 -14045 -7422 -8709 -18463 -18519 -15123 -12881 -15058 -15870 -24998 -31747
13456 -31747 -33364 -31048 -25162 -23192 -26625 -31826 -19287 -10626 -15243 -18115 -20115 -15911 -13900 -24485
13442 -24485 -25817 -24923 -27861 -26394 -24443 -22131 -21620 -22206 -30196 -37173 -28945 -24294 -20532 -22376 -21259
13427 -21259 -15757 -14387 -13524 -12537 -11646 -17463 -14781 -22468 -24073 -16884 -15158 -18689 -21360 -15916 -18906
$$ packed form
13529b7990J927l675k28L064R890K427N480l832o054k554J134M59o749l407j340
13514c1448L871J362j617P40J0040J3600j057j1465p531L098J4642K113r814k454
13500a5920O583J3r063q195o63K000N79k640o383j014N924N942L354N490o789
13485b0782k785J731P576K328n579m559l906J760L462J754O317m895j0409n713
13471c3700J15p52K315P429J0548O623j287r754n6L396K242k177q12r128o749
13456c1747j617K316N886J970l433n201J2539Q661m617k872k000M204K011j0585
13442b4485j332Q94k938J467J951K312N11n86p990o977Q228M651L762j844J117
13427b1259N502J370Q63R87Q91n817K682p687j605P189J726l531k671N444k990
$$ plain form
13412 -18906 -17532 -20074 -24455 -24991 -23677 -24028 -16600 -19775 -24449 -23447 -23440 -30618 -32413 -29093 -33341 -26314
13396 -26314 -19854 -16894 -17413 -19896 -11827 -9331 -18280 -23329 -21047 -19103 -18460 -17760 -20320 -19275 -17954
13381 -17954 -10942 -12829 -21713 -22992 -15395 -13156 -10384 -2291 1052 -9472 -22525 -16142 -11572 -10165
13367 -10165 -12627 -17326 -23816 -31021 -33506 -35662 -39010 -38189 -27982 -28528 -27170 -29729 -25430 -20846 -16139
13352 -16139 -16804 -18266 -13282 -9458 -18325 -23079 -22514 -19612 -18189 -20116 -16737 -11957 -15286 -16190 -19678
13337 -19678 -27103 -28595 -24465 -27876 -24367 -5931 -12 1388 7037 5318 4128 5570 4582 3217
13323 3217 -4367 -15522 -16206 -9355 -4445 -2662 -12118 -25820 -36794 -33731 -26885 -30540 -37247 -27004
13309 -27004 -15455 -15706 -22209 -21095 -10637 -4747 -5888 -16591 -27029 -29218 -38368 -35732 -27672 -25708
$$ packed form
13412a8906J374k542m381n36J314l51P428l175m674J002Pp178j795L320m248P027
13396b6314O460K960n19k483Q069K496q949n049K282J944O43P00k560J045J321
13381a7954P012j887q884j279P597K239K772Q093L343j0524j3053O383M570J407
13367a0165k462m699o490p205k485k156l348Q21J0207n46J358k559M299M584M707
13352a6139o65j462M984L824q867m754N65K902J423j927L379M780l329r04l488
13337a9678p425j492M130l411L509J8436N919J400N649j719j190J442r88j365
13323C217p584j1155o84O851M910J783r456j3702j0974L063O846l655o707J0243
13309b7004J1549k51o503J114J0458N890j141j0703j0438k189r150K636Q060J964
$$ plain form
13295 -25708 -22470 -21930 -29390 -31198 -29635 -29087 -30183 -29594 -29785 -28509 -29816 -29653 -26890 -29163 -29070 -28300
13279 -28300 -28872 -31985 -31397 -24776 -28744 -35366 -37197 -35047 -29749 -26054 -22764 -16996 -17929 -17815 -25391
13264 -25391 -33649 -35892 -36208 -40734 -42067 -31477 -20463 -14958 -9311 -7373 -2889 974 -1586 -1729
13250 -1729 -6547 -2551 8244 5750 -4955 -14940 -22816 -25214 -22804 -11944 -7960 -4088 -236 -9141
13236 -9141 -13799 -17474 -12192 -7650 -18294 -19985 -16508 -13594 -9163 -10855 -17703 -22473 -25139 -23406
13222 -23406 -19912 -22483 -28141 -27634 -30206 -29153 -19680 -7614 83 8993 7330 -44 -7250 -19025
13208 -19025 -33840 -40559 -30345 -23191 -20267 -24790 -22650 -20614 -19593 -23467 -30794 -21427 -9315 -5939
13194 -5939 -756 19 -3958 -5940 -10757 -9871 -6448 -4775 -12257 -14149 -13313 -12626 -9174 -13727 -20578 -17863
$$ packed form
13295b5708L238N40p460j808J563N48j096N89j91J276j307J63K763k273R3P70
13279b8300n72l113N88O621l968o622j831K150N298L695L290N768r33J14p576
13264b5391q258k243l16m526j333J0590J1014N505N647J938M484L863k560j43
13250a729m818L996J0795k494j0705r985p876k398K410J0860L984L872L852q905
13236i141m658l675N282M542j0644j691L477K914M431j692o848m770k666J733
13222b3406L494k571n658N07k572J053R473J2066P697Q910j663p374p206j1775
13208a9025j4815o719J0214P154K924m523K140K036J021l874p327R367J2112L376
13194e939N183P75l977j982m817Q86L423J673p482j892Q36O87L452m553o851K715
$$ plain form
13178 -17863 -8991 -3785 -5307 -6053 -2806 -7807 -17378 -17520 -6228 7380 13708 27065 32052 24746
13164 24746 21512 20976 27505 33394 41781 47655 53430 52311 51401 55031 55588 55118 67747 83684 87612
13149 87612 88492 99617 111375 121853 137805 172065 214687 285006 400621 571477 829249
13138 829249 1239170 1791739 2315224 2523650 2300475 1847434 1420690 1117029 922558 818778
13128 818778 772828 723326 647868 569692 505561 444806 387459 342485 303378 258813 216431
13117 216431 175830 145521 136739 121622 108478 100753 87821 74458 54005 49380 46968 50778
13105 50778 52405 41533 39783 33565 28354 24350 29728 34208 30303 26706 22240 24775 27437 29984
13091 29984 37237 41205 35421 34925 29559 19790 15538 15343 18753 21655 25345 30204 24700 24296 33910
$$ packed form
13178a7863Q872N206j522p46L247n001r571j42J1292J3608O328J3357M987p306
13164B4746l234n36O529N889Q387N874N775j119r10L630N57m70J2629J5937L928
13149H7612Q80J1125J1758J0478J5952L4260M2622P0319J15615J70856K57772
13138H29249M09921N52569N23485K08426k23175m53041m26744l03661j94471j03780
13128H18778m5950m9502p5458p8176o4131o0755n7347m4974l9107m4565m2382
13117B16431m0601l0309q782j5117j3144p725j2932j3363k0453m625k412L810
13105E0778J627j0872j750o218n211m004N378M480l905l597m466K535K662K547
13091B9984P253L968n784m96n366r769m252j95L410K902L690M859n504m04R614
$$ plain form
13076 33910 41466 39539 40753 37708 39549 32394 10933 -3814 -2316 -6806 -2293 -150 3215 8146
13062 8146 11638 3071 -3881 -8583 -8133 772 6335 3271 5923 6041 9620 13751 15961 13668 11487
13047 11487 14248 14237 5010 4834 6141 10471 11433 6824 7743 13665 16240 13726 7636 3450 432 -5051
13031 -5051 -5294 1676 9257 14923 10369 8067 452 -4015 -12108 -16483 -12662 -2492 -3099 1715 1892
13016 1892 -1204 -516 -4095 -11001 -20832 -24031 -28908 -40409 -61972 -80156 -77781 -70075 -69720 -65601
13002 -65601 -51584 -41885 -40922 -36572 -35377 -31939 -33000 -33423 -29824 -19810 -10470 3812 12433 13487
12988 13487 9029 10683 11006 12659 16172 19261 22859 21324 9932 8776 -6563 -9125 -11240 -10530
12974 -10530 -11214 -11508 -13013 -4175 -2527 -11453 -16081 -22052 -19428 -7331 -2737 -1041 -7016 -4571 1529
$$ packed form
13076C3910P556j927J214l045J841p155k1461j4747J498m490M513K143L365M931
13062H146L492q567o952m702M50Q905N563l064K652J18L579M131K210k293k181
13047A1487K761j1r227j76J307M330R62m609R19N922K575k514o090m186l018n483
13031e051k43O970P581N666m554k302p615m467q093m375L821J0170o07M814J77
13016A892l096O88l579o906r831l199m877j1501k1563j8184K375P706L55M119
13002f5601J4017R699R63M350J195L438j061m23L599J0014R340J4282Q621J054
12988A3487m458J654L23J653L513L089L598j535j1392j156j5339k562k115P10
12974a0530o84k94j505Q838J648q926m628n971K624J2097M594J696n975K445O100
$$ plain form
12959 1529 8135 7706 4079 -9381 -15407 -18687 -12973 -1236 8697 14145 18455 23095 23543 33200 59398
12944 59398 110533 175199 236004 291656 334708 347432 321903 270847 230546 215189 207161 202496
12932 202496 189582 155255 120779 95092 84198 82871 91068 101524 103233 93404 81511 70061
12920 70061 56987 45258 36574 35618 39354 38083 35533 26210 21180 28530 39112 50801 49215 46449
12906 46449 41765 25221 21808 29217 42584 46618 38679 29946 30295 32388 35197 43187 56308 71787
12892 71787 86789 87194 85999 76700 63132 47185 46928 57370 68994 49338 16753 -3623 -10990
12879 -10990 -13499 -2899 20689 40407 57268 71547 70471 67272 65947 76089 93825 107385
12867 107385 110085 113322 121582 123788 118566 118002 112285 104512 94616 91722 96740 91676 77681 68023
$$ packed form
12959A529O606m29l627j3460o026l280N714J1737R933N448M310M640M48R657K6198
12944E9398N1135O4666O0805N5652M3052J2724k5529n1056m0301j5357q028m665
12932B02496j2914l4327l4476k5687j0894j327Q197J0456J709r829j1893j1450
12920G0061j3074j1729q684r56L736j271k550r323n030P350J0582J1689j586k766
12906D6449m684j6544l413P409J3367M034p939q733L49K093K809P990J3121J5479
12892G1787J5002M05j195r299j3568j5947k57J0442J1624j9656l2585k0376p367
12879a0990k509J0600K3588J9718J6861J4279j076l199j325J0142J7736J3560
12867A07385K700L237Q260K206n222n64n717p773r896k894N018n064j3995r658
$$ plain form
12853 68023 62223 67018 72528 79145 91727 103952 117174 127100 135545 139991 129573 101735 81329
12840 81329 72806 67491 66237 72239 80850 88744 94529 93244 96398 99846 105463 102474 110993 120747
12826 120747 119646 122167 122132 113119 112218 118127 133148 143900 164050 207802 287507 423463 620123
12813 620123 827527 949626 883912 659709 480528 473006 527471 527330 488408 462041 429220
12802 429220 385495 369008 362157 368866 360347 339879 344021 354144 363098 371125 375542 381256 396234
12789 396234 424378 468073 508394 530653 533525 533038 533318 527736 529610 529634 515630 499847 495089 503388
12775 503388 526799 549271 544993 528224 514921 504258 504459 496173 468391 436960 408573 406528
12763 406528 430702 445395 481635 510194 538396 571070 602912 612914 621258 619892 625291 624781
$$ packed form
12853F8023n800M795N510O617J2582J2225J3222R926Q445M446j0418k7838k0406
12840H1329q523n315j254O002Q611P894N785j285L154L448N617k989Q519R754
12826A20747j101K521l5r013r01N909J5021J0752K0150M3752P9705J35956J96660
12813F20123K07404J22099o5714k24203j79181p522N4465j41l8922k6367l2821
12802D29220m3725j6487o851O709q519k0468M142J0123Q954Q027M417N714J4978
12789C96234K8144M3695M0321K2259K872m87K80n582J874K4j4004j5783m758Q299
12775E03388K3411K2472m278j6769j3303j0663K01q286k7782l1431k8387k045
12763D06528K4174J4693L6240K8559K8202L2674L1842J0002Q344j366N399n10
$$ plain form
12751 624781 616815 613056 624587 639588 642408 633797 627926 669308 743792 823843 904759 967729
12739 967729 1011912 1043301 1072593 1105255 1137218 1206062 1301454 1385569 1454279 1507473 1562257
12728 1562257 1607764 1649691 1696833 1757377 1824334 1910234 2022254 2148103 2260621 2359972 2467011
12717 2467011 2608214 2791042 3040430 3361929 3753287 4200760 4758975 5525192 6511683
12708 6511683 7438902 7967623 8105852 8161897 8388507 8888310 9671590 10758332 12219623
12699 12219623 14108219 16342052 18651572 20882725 23394036 26884744 32115083 39975104
12691 39975104 51926236 70578189 100473662 149072795 225867014 332010607 437902820
12684 437902820 485458035 448085681 360783589 274821189 214215825 177395936 157047630
$$ packed form
12751F24781p966l759J1531J5001K820q611n871M1382P4484Q0051Q0916O2970
12739I67729M4183L1389K9292L2662L1963O8844R5392Q4115O8710N3194N4784
12728A562257M5507M1927M7142O0544O6957Q5900J12020J25849J12518R9351J07039
12717B467011J41203J82828K49388L21499L91358M47473N58215P66217R86491
12708F511683R27219N28721J38229N6045K26610M99803P83280J086742J461291
12699A2219623J888596K233833K309520K231153K511311L490708N230339P860021
12691C9975104J1951132J8651953K9895473M8599133P6794219J06143593J05892213
12684D37902820M7555215l7372354q7302092q5962400o0605364l6819889k0348306
$$ plain form
12677 157047630 145905666 135521413 121891304 107242245 93940051 82343371 72167611
12670 72167611 63021621 54743395 47440888 41167787 35813338 31208817 27221682 23788410
12662 23788410 20851311 18366172 16286560 14546456 13010657 11618213 10385219 9345748
12654 9345748 8471386 7704704 7018445 6390740 5799821 5248648 4757465 4359947 4077007
12645 4077007 3922536 3903290 4068275 4547891 5536689 7205904 9267099 10556720 10041153
12636 10041153 8229259 6347112 5033655 4275632 3857358 3596469 3406771 3291468 3285219
12627 3285219 3396538 3602143 3760454 3646245 3244038 2743416 2319004 2005590 1787485
12618 1787485 1635454 1514500 1405309 1310378 1217902 1129514 1050908 982486 934468 903647 885726
$$ packed form
12677A57047630j1141964j0384253j3630109j4649059j3302194j1596680j0175760
12670G2167611r145990q278226p302507o273101n354449m604521l987135l433272
12662B3788410k937099k485139k079612j740104j535799j392444j232994j039471
12654I345748q74362p66682o86259o27705n90919n51173m91183l97518k82940
12645D077007j54471j9246J64985M79616R88798J669215K061195J289621n15567
12636A0041153j811894j882147j313457p58023m18274k60889j89698j15303o249
12627C285219J11319K05605J58311j14209m02207n00622m24412l13414k18105
12618A787485j52031j20954j09191r4931r2476q8388p8606o8422m8018l0821j7921
$$ plain form
12607 885726 864521 834603 816113 798182 765923 726952 672515 616906 583849 555022 516690
12596 516690 486133 454557 430586 416916 402102 394028 388168 378514 380498 398236 425409 448707
12584 448707 460567 467458 476734 494437 528816 574409 603598 605674 565336 505906 452735 419495
12572 419495 401831 388788 383287 378656 380588 373185 364480 351314 339153 334697 362263 422930 487575
12559 487575 516297 491023 446621 404588 375515 358971 348066 349787 353831 341229 338153 342975
12547 342975 341621 337775 336606 338191 334568 343623 348456 348249 346087 338106 325434 317113 300113 289792
12533 289792 278959 265575 265320 271276 271041 258662 235274 200987 172932 166955 165173 168813 174113
12520 174113 183638 181689 186056 186547 177800 168550 162372 154493 150197 141728 138586 138296 140906 135637 127717
$$ packed form
12607H85726k1205k9918j8490j7931l2259l8971n4437n5609l3057k8827l8332
12596E16690l0557l1576k3971j3670j4814q074n860r654J984J7738K7173K3298
12584D48707J1860O891R276J7703L4379M5593K9189K076m0338n9430n3171l3240
12572D19495j7664j3043n501m631J932p403q705j3166j2161m456K7566O0667O4645
12559D87575K8722k5274m4402m2033k9073j6544j0905J721M044j2602l076M822
12547C42975j354l846j169J585l623R055M833k07k162p981j2672q321j7000j0321
12533B89792j0833j3384k55N956k35j2379k3388l4287k8055n977j782L640N300
12520A74113R525j949M367M91q747r250o178p879m296q469l142k90K610n269p920
$$ plain form
12505 127717 122056 113466 103794 98648 89807 82642 84881 99151 111127 116372 120909 112408 112374 125521
12491 125521 141272 158312 166709 151226 136722 123192 104678 91425 89482 91184 83933 70668
12479 70668 60259 55882 59120 59064 73054 83970 84085 70698 65686 63495 57302 51857 55293 62403
12465 62403 71800 79248 75429 65912 58938 46249 45906 59339 70880 71075 73061 72920 67352 65477
12451 65477 61699 50846 43352 26429 13454 2941 -7180 -5214 12791 35165 42243 43878 48822
12438 48822 55718 53749 52796 52804 62686 70127 77363 75256 55280 42623 32642 28389 29847 35732 45724
12423 45724 54053 53271 59378 62385 70050 71336 63791 58831 62268 72350 70016 61352 55303 58540
12409 58540 57651 52510 59183 63007 55505 48010 45847 51317 56238 60908 63155 60647 61854 63095 62515
$$ packed form
12505A27717n661q590r672n146q841p165K239J4270J1976N245M537q501l4J3147
12491A25521J5751J7040Q397j5483j4504j3530j8514j3253j943J702p251j3265
12479G0668j0409m377L238n6J3990J0916J15j3387n012k191o193n445L436P110
12465F2403R397P448l819r517o974j2689l43J3433J1541J95J986j41n568j875
12451F5477l778j0853p494j6923j2975j0513j0121J966J8005K2374P078J635M944
12438D8822O896j969r53QR882P441P236k107j9976j2657r981m253J458N885R992
12423D5724Q329p82O107L007P665J286p545m960L437J0082k334q664o049L237
12409E8540q89n141O673L824p502p495k163N470M921M670K247k508J207J241n80
$$ plain form
12394 62515 62632 58338 49876 37524 20650 7142 12059 11169 9762 15352 18955 12602 8578 12313
12380 12313 10076 8160 9784 6775 9931 10212 14414 12714 23154 30296 37643 45608 44989 41188 43003
12365 43003 50772 57573 82586 111500 115414 93637 71524 53692 51451 43526 36227 36526 37474 33159
12351 33159 22090 14003 16083 17032 16692 20426 12140 6331 8324 12034 10631 7388 10262 5471 3517
12336 3517 2083 316 -4738 -10903 -15391 -16119 -5651 -11352 -16278 -9874 2748 4976 -912 -2362
12322 -2362 -5168 -4183 8440 17446 18597 13841 5535 2260 5895 12699 10180 4473 987 -6362 -16689
12307 -16689 -15549 -8460 -2259 3363 6634 8279 19502 14416 1363 -1342 572 1030 -2338 -5569
12293 -5569 -9649 -9312 -12212 -8480 -10407 -4551 -6730 -8720 -11286 -15128 -1712 4916 -8083 -13779
$$ packed form
12394F2515J17m294q462j2352j6874j3508M917q90j407N590L603o353m024L735
12380A2313k237j916J624l009L156K81M202j700J0440P142P347P965o19l801J815
12365D3003P769O801K5013K8914L914k1777k2113j7832k241p925p299K99R48m315
12351C3159j1069q087K080R49l40L734q286n809J993L710j403l243K874m791j954
12336C517j434j767n054o165m488p28J0468n701m926O404J2622K228n888j450
12322b362k806R85J2623R006J151m756q306l275L635O804k519n707l486p349j0327
12307a6689J140P089O201N622L271J645J1223n086j3053k705J914M58l368l231
12293e569m080L37k900L732j927N856k179j990k566l842J3416O628j2999n696
$$ plain form
12279 -13779 -8060 -1806 2847 -3565 -3989 169 -3468 1453 -4650 -11855 -3768 -4371 -211 4560 13193
12264 13193 16559 10281 4546 -5608 -19604 -23716 -16886 -10806 -4819 -2831 -3575 -5706 -3877 3666
12250 3666 8913 16756 16377 9273 4202 7561 3429 -1715 -1219 3592 12304 26378 46732 59547
12236 59547 75385 102250 136247 187763 251462 354105 525986 805055 1224503 1785361 2313008
12225 2313008 2486415 2240895 1789751 1377596 1087795 914603 817207 742975 660788 583843
12215 583843 509850 436986 384481 339205 294643 252166 217718 179387 143161 124271 102712
12204 102712 82807 72244 67713 64246 50801 49173 41338 33477 22724 18159 19283 18158 17492
12191 17492 9594 4270 10444 13988 7952 3129 4327 11392 20181 30595 39439 46986 45405 30583
$$ packed form
12279a3779N719O254M653o412m24M158l637M921o103p205Q087o03M160M771Q633
12264A3193L366o278n735j0154j3996m112O830O080N987J988p44k131J829P543
12250C666N247P843l79p104n071L359m132n144M96M811Q712J4074K0354J2815
12236E9547J5838K6865L3997N1516O3699J02643J71881K79069M19448N60858N27647
12225B313008J73407k45520m51144m12155k89801j73192r7396p4232q2187p6945
12215E83843p3993p2864n2505m5276m4562m2477l4448l8331l6226j8890k1559
12204A02712j9905j0563m531l467j3445j628p835p861j0753m565J124j125o66
12191A7492p898n324O174L544o036m823J198P065Q789J0414Q844P547j581j4822
$$ plain form
12177 30583 18635 11322 9760 12014 10327 11472 16984 16647 4423 -4873 -6890 -3396 -7900 -8220
12163 -8220 -7448 -1991 -4780 -13150 -18524 -13877 -12676 -11063 -22163 -28002 -17245 -2306 -766 -1933
12149 -1933 -4147 -5784 -9444 -13636 -16067 -10166 -2723 -3056 -7177 -11608 -12396 -12673 -11236 -19342 -19170 -12632
12133 -12632 -15086 -25188 -26308 -22033 -24932 -24918 -22201 -25995 -20082 -15583 -15750 -21916 -28195 -28557 -28224
12118 -28224 -27345 -20729 -26826 -33523 -33410 -23083 -23491 -28698 -24732 -29892 -31068 -27767 -21091 -18818 -29495
12103 -29495 -34710 -33305 -34624 -28757 -22457 -19564 -23001 -21386 -18509 -23231 -26777 -26363 -19337 -20110 -24043
12088 -24043 -22395 -20847 -23735 -26269 -28369 -22330 -16231 -15439 -18023 -11934 -5176 -6946 -7485 -15018 -23690
12073 -23690 -30043 -26909 -20432 -23016 -26504 -29179 -33935 -33521 -32236 -24581 -27357 -24834 -25236 -20957 -14126
$$ packed form
12177C0583j1948p313j562K254j687J145N512l37j2224r296k017L494m504l20
12163h220P72N457k789q370n374M647J201J613j1100n839J0757J4939J540j167
12149a933k214j637l660m192k431N901P443l33m121m431p88k77J437q106J72O538
12133a2632k454j0102j120M275k899J4K717l794N913M499j67o166o279l62L33
12118b8224Q79O616o097o697J13J0327m08n207L966n160j176L301O676K273j0677
12103b9495n215J405j319N867O300K893l437J615K877m722l546M14P026p73l933
12088b4043J648J548k888k534k100O039O099P92k584O089O758j770n39p533q672
12073b3690o353L134O477k584l488k675m756M14J285P655k776K523m02M279O831
$$ plain form
12058 -14126 -8742 -16768 -18293 -24470 -35988 -32498 -27961 -31125 -30538 -24492 -17757 -22231 -26035 -29045
12044 -29045 -39070 -45519 -40100 -37225 -44917 -49687 -44738 -38009 -37697 -33809 -27895 -23862 -24602 -29242 -32513
12029 -32513 -42962 -43446 -39753 -38917 -36918 -34360 -34037 -31606 -30444 -28055 -22335 -12872 -17029 -27520 -32123
12014 -32123 -34437 -40507 -35982 -26390 -24308 -19892 -17123 -24322 -26413 -29889 -34028 -34068 -32987 -32497 -31692
11999 -31692 -25846 -26040 -26045 -24207 -24064 -30911 -29948 -24899 -24481 -25148 -22429 -22076 -21698 -25350 -25977 -27336 -28794
11982 -28794 -28315 -34194 -40813 -43196 -40593 -42896 -46272 -50272 -45141 -42328 -46321 -42363 -35882 -40278 -44647
11967 -44647 -48768 -46013 -38714 -31863 -24196 -24649 -25378 -22440 -21843 -17738 -22188 -29370 -29587 -30164 -30817 -26555
11951 -26555 -22980 -25874 -29449 -32212 -30356 -31939 -41083 -40518 -36600 -36454 -27421 -23423 -30513 -40362 -35034
$$ packed form
12058a4126N384q026j525o177j1518L490M537l164N87O046O735m474l804l010
12044b9045j0025o449N419K875p692m770M949O729L12L888N914M033p40m640l271
12029c2513j0449m84L693Q36J999K558L23K431J162K389N720R463m157j0491m603
12014c2123k314o070M525R592K082M416K769p199k091l476m139m0J081M90Q05
11999c1692N846j94nJ838J43o847R63N049M18o67K719L53L78l652o27j359j458
11982b8794M79n879o619k383K603k303l376m000N131K813l993L958O481m396m369
11967d4647m121K755P299O851P667m53p29K938N97M105m450p182k17n77o53M262
11951b6555L575k894l575k763J856j583r144N65L918J46R033L998p090r849N328
$$ plain form
11936 -35034 -34175 -37068 -42027 -43576 -30952 -22496 -19250 -28125 -31821 -40326 -35580 -22788 -26507 -28604
11922 -28604 -25500 -17846 -12357 -17396 -20192 -26363 -26623 -29849 -37766 -37331 -36817 -40315 -40016 -32938 -27441
11907 -27441 -30590 -27170 -23036 -19897 -19620 -28770 -28158 -32864 -34535 -30949 -30206 -31278 -34887 -31281 -28753
11892 -28753 -34131 -40026 -36683 -32586 -30192 -28870 -28932 -32564 -36019 -38860 -31873 -25761 -33944 -42013 -45030
11877 -45030 -39796 -23276 -22578 -35360 -48751 -56332 -50179 -37405 -32392 -31205 -25482 -22022 -34361
11864 -34361 -48463 -57100 -48004 -36608 -37388 -37164 -36458 -33838 -30962 -28141 -29954 -35856 -36570 -37376 -38854
11849 -38854 -44603 -44569 -35867 -34572 -31989 -33259 -32880 -31593 -31903 -29813 -28285 -23354 -26843 -36866 -39069
11834 -39069 -33468 -31518 -33593 -34643 -40164 -32562 -27872 -37405 -43400 -46292 -43442 -48542 -44061 -28842
$$ packed form
11936c5034Q59k893m959j549J2624Q456L246q875l696q505M746J2792l719k097
11922b8604L104P654N489n039k796o171k60l226p917M35N14l498K99P078N497
11907b7441l149L420M134L139K77r150O12m706j671L586P43j072l609L606K528
11892b8753n378n895L343M097K394J322o2l632l455k841O987O112q183q069l017
11877d5030N234J6520O98j2782j3391p581O153J2774N013J187N723L460j2339
11864c4361j4102q637R096J1396p80K24P06K620K876K821j813n902p14q06j478
11849c8854n749L4Q702J295K583j270L79J287l10K090J528M931l489j0023k203
11834c9069N601J950k075j050n521P602M690r533n995k892K850n100M481J5219
$$ plain form
11820 -28842 -31534 -31718 -32821 -29654 -21634 -20352 -25814 -29011 -28666 -26498 -24727 -29050 -33436 -35001 -29351
11805 -29351 -22244 -24357 -27764 -28952 -31920 -33746 -31199 -30398 -33000 -37936 -40039 -35085 -32818 -33875 -31917
11790 -31917 -34003 -33245 -31909 -28597 -28750 -28845 -23816 -25162 -29534 -32664 -27337 -27644 -22318 -18411 -24466 -32275
11774 -32275 -31809 -34930 -40063 -47633 -41585 -34900 -32104 -29470 -28436 -24709 -27888 -28069 -26916 -31269 -39558
11759 -39558 -42852 -41631 -41302 -41446 -43539 -39333 -37165 -32127 -26710 -34783 -49376 -53395 -43254 -41604
11745 -41604 -46045 -43321 -44013 -47919 -47398 -44506 -45366 -52651 -48412 -39064 -34662 -36674 -40828 -37807 -41384
11730 -41384 -32245 -27159 -22664 -20220 -17859 -19896 -28905 -32067 -33106 -29377 -29267 -26091 -22602 -24841 -27584
11715 -27584 -29755 -25859 -29071 -37249 -44557 -54517 -57700 -52969 -46394 -33267 -25318 -31926 -35931 -40967
$$ packed form
11820b8842k692j84j103L167Q020J282n462l197L45K168J771m323m386j565N650
11805b9351P107k113l407j188k968j826K547Q01k602m936k103M954K267j057J958
11790c1917k086P58J336L312j53r5N029j346m372l130N327l07N326L907o055p809
11774c2275M66l121n133p570O048O685K796K634J034L727l179j81J153m353q289
11759c9558l294J221L29j44k093M206K168N038N417q073j4593m019J0141J650
11745d1604m441K724o92l906N21K892q60p285M239R348M402k012m154L021l577
11730d1384R139N086M495K444K361k037r009l162j039L729J10L176L489k239k743
11715b7584k171L896l212q178p308r960l183M731O575J3127P949o608m005n036
$$ plain form
11701 -40967 -42825 -40910 -39730 -40107 -44214 -41646 -38906 -33487 -33969 -40539 -33401 -28644 -16674 -16803 -23088
11686 -23088 -19435 -20455 -27615 -28197 -33322 -37125 -34555 -27572 -26673 -24029 -27333 -32663 -30638 -22771 -22146
11671 -22146 -25201 -30253 -37107 -38998 -37831 -36428 -36781 -37863 -40969 -44246 -36451 -29892 -34906 -41983 -47565
11656 -47565 -48944 -40124 -30626 -31092 -31101 -30143 -38473 -41440 -37671 -41797 -38449 -30092 -29035 -29396 -27515 -32478
11640 -32478 -39622 -41771 -31344 -23306 -18681 -27276 -32723 -30717 -39960 -44375 -33683 -31879 -41077 -52739
11626 -52739 -53324 -46496 -38159 -34776 -22074 -20690 -25654 -21520 -23586 -37935 -47693 -50189 -44966 -40761
11612 -40761 -35199 -36493 -42672 -42230 -37017 -38092 -47395 -50657 -44059 -42274 -37842 -37955 -39521 -35567 -31038
11597 -31038 -34041 -34309 -35846 -39440 -36263 -38471 -43143 -39275 -41816 -43803 -48472 -53007 -47907 -37282
$$ packed form
11701d0967j858J915J180l77m107K568K740N419m82o570P138M757J1970j29o285
11686b3088L653j020p160n82n125l803K570O983Q99K644l304n330K025P867O25
11671b2146l055n052o854j891J167J403l53j082l106l277P795O559n014p077n582
11656d7565j379Q820R498m66rR58q330k967L769m126L348Q357J057l61J881m963
11640c2478p144k149J0427Q038M625q595n447K006r243m415J0692J804r198j1662
11626e2739n85O828Q337L383J2702J384m964M134k066j4349r758k496N223M205
11612d0761N562j294o179M42N213j075r303l262O598J785M432j13j566L954M529
11597c1038l003k68j537l594L177k208m672L868k541j987m669m535N100J0625
$$ plain form
11583 -37282 -32280 -29688 -34620 -28576 -21554 -27064 -38917 -47647 -47558 -45322 -41558 -29157 -21600 -22034 -28509
11568 -28509 -38037 -42206 -38352 -38520 -37310 -41937 -36499 -36244 -45706 -44920 -41300 -34383 -24319 -25903 -30584
11553 -30584 -36200 -43482 -36763 -29666 -33612 -31046 -28404 -34023 -31488 -29167 -33248 -35982 -38041 -39314
11539 -39314 -44383 -48893 -50046 -49809 -53241 -48853 -38052 -41119 -37862 -25075 -21049 -16264 -13420 -33662
11525 -33662 -47069 -38032 -28798 -31747 -32293 -31454 -33471 -38929 -38480 -30724 -32856 -33609 -36409 -38595 -27602
11510 -27602 -26413 -30095 -37887 -42057 -35458 -33510 -33949 -36145 -38767 -44303 -47554 -41503 -39038 -34207 -32608
11495 -32608 -33414 -37344 -39379 -42971 -40420 -34502 -35065 -36520 -28541 -20661 -29287 -30137 -32163 -32905 -30736
11480 -30736 -25090 -28328 -32813 -32316 -35612 -35689 -40238 -48167 -48430 -50996 -41977 -44754 -45351 -42118 -38891 -31943
$$ packed form
11583c7282N002K592m932O044P022n510j1853q730Q9K236L764J2401P557m34o475
11568b8509r528m169L854j68J210m627N438K55r462P86L620O917J0064j584m681
11553c0584n616p282O719P097l946K566K642n619K535K321m081k734k059j273
11539c9314n069m510j153K37l432M388J0801l067L257J2787M026M785K844k0242
11525c3662j3407R037R234k949n46Q39k017n458M49P756k132p53k800k186J0993
11510b7602J189l682p792m170O599J948m39k196k622n536l251O051K465M831J599
11495c2608q06l930k035l592K551N918n63j455P979P880q626q50k026p42K169
11480c0736N646l238m485M97l296p7m549p929k63k566R019k777n97L233L227O948
$$ plain form
11464 -31943 -28596 -27990 -42055 -48684 -46965 -32653 -32150 -34013 -31589 -33654 -36040 -34740 -37719 -37928 -35626
11449 -35626 -39219 -44578 -38818 -37379 -36034 -41661 -45837 -42523 -40688 -44525 -37859 -32177 -30110 -30609 -33111
11434 -33111 -29233 -25312 -29041 -38185 -43719 -50280 -47062 -39216 -44514 -42844 -33970 -37468 -39356 -37168
11420 -37168 -33737 -32259 -33544 -36233 -33126 -24878 -28023 -26857 -24771 -32787 -38890 -42818 -48971 -50900
11406 -50900 -52372 -51661 -49539 -44674 -40625 -42775 -47053 -39010 -32330 -36090 -43281 -39319 -33260 -32886 -37542
11391 -37542 -38718 -34239 -35837 -40976 -45527 -43408 -38857 -32916 -37986 -44375 -50589 -49747 -43297 -41657 -43725
11376 -43725 -41370 -36274 -26955 -29177 -40049 -38571 -37633 -37928 -33816 -24971 -26196 -33099 -35743 -28421 -26114
11361 -26114 -22186 -27041 -28796 -28577 -28132 -24760 -21949 -31688 -38018 -40290 -42580 -36675 -43401 -43726 -36510
$$ packed form
11464c1943L347O06j4065o629J719J4312N03j863K424k065k386J300k979k09K302
11449c5626l593n359N760J439J345n627m176L314J835l837O666N682K067m99k502
11434c3111L878L921l729r144n534o561L218P846n298J670Q874l498j888K188
11420c7168L431J478j285k689L107Q248l145J166K086q016o103l928o153j929
11406e0900j472P11K122M865M049k150m278Q043O680l760p191L962O059L74m656
11391c7542j176M479j598n139m551K119M551N941n070o389o214Q42O450J640k068
11376d3725K355N096R319k222j0872J478R38k95M112Q845j225o903k644P322K307
11361b6114L928m855j755K19M45L372K811r739o330k272k290N905o726l25P216
$$ plain form
11346 -36510 -23691 -17218 -27431 -36129 -39222 -33870 -37910 -41016 -38766 -32429 -35634 -32773 -25885 -30347
11332 -30347 -40563 -51240 -46819 -39589 -40783 -38655 -27471 -29292 -37758 -44041 -37105 -33507 -43263 -51119
11318 -51119 -52914 -39761 -41491 -44790 -37378 -38269 -43085 -46680 -44286 -42875 -33365 -31983 -41879 -43835
11304 -43835 -41484 -39827 -38201 -38756 -37759 -34818 -33432 -28236 -28756 -27631 -28988 -31095 -24828 -32294 -33272
11289 -33272 -30731 -24920 -19938 -26484 -34624 -41677 -44979 -38765 -37849 -36405 -37112 -42390 -43057 -44128 -32013
11274 -32013 -19473 -22876 -23521 -30227 -33539 -35796 -43442 -49482 -38915 -29790 -25721 -26801 -30130 -32013
11260 -32013 -32622 -25461 -30056 -25351 -20692 -17957 -28771 -35721 -31712 -32152 -35649 -36372 -34580 -31593 -39246
11245 -39246 -37426 -42129 -43261 -37787 -35118 -32808 -33918 -30840 -34467 -39390 -40138 -38368 -43065 -44487 -45948
$$ packed form
11346c6510J2819O473j0213q698l093N352m040l106K250O337l205K861O888m462
11332c0347j0216j0677M421P230j194K128J1184j821q466o283O936L598r756p856
11318e1119j795J3153j730l299P412q91m816l595K394J411R510J382r896j956
11304d3835K351J657J626n55R97K941J386N196n20J125j357k107O267p466r78
11289c3272K541N811M982o546q140p053l302O214R16J444p07n278o67j071J2115
11274c2013J2540l403o45o706l312k257p646o040J0567R125M069j080l329j883
11260c2013o09P161m595M705M659K735j0814o950M009m40l497p23J792K987p653
11245c9246J820m703j132N474K669K310j110L078l627m923p48J770m697j422j461
$$ plain form
11230 -45948 -40444 -32059 -32558 -40360 -48452 -58787 -55705 -44943 -42301 -32151 -20876 -20536 -19080 -26307
11216 -26307 -33584 -33077 -38408 -32633 -28827 -31212 -39346 -46397 -47640 -38829 -32208 -29333 -27891 -31184 -38326
11201 -38326 -37694 -40831 -37900 -31716 -28039 -17668 -19200 -28133 -32312 -28995 -29124 -33579 -39155 -37305 -37061
11186 -37061 -35969 -42885 -44276 -40927 -42042 -44958 -47173 -49484 -48027 -45993 -49009 -56251 -51341 -56763
11172 -56763 -53326 -46537 -46047 -39961 -37247 -40822 -43047 -49654 -49344 -43470 -35645 -29128 -35369 -37699 -39884
11157 -39884 -35372 -25613 -25809 -37676 -44640 -44996 -38425 -30028 -23830 -32923 -47287 -48361 -50413 -48676
11143 -48676 -41468 -32213 -37473 -32599 -28076 -25775 -26485 -28881 -23471 -20665 -21532 -28052 -32161 -37644 -37035
11128 -37035 -34874 -36223 -38813 -38135 -35119 -33668 -34996 -34353 -37090 -42397 -43181 -42868 -37433 -37159 -35272 -32894
$$ packed form
11230d5948N504Q385m99p802q092j0335L082J0762K642J0150J1275L40J456p227
11216b6307p277N07n331N775L806k385q134p051j243Q811O621K875J442l293p142
11201c8326O32l137K931O184L677J0371j532q933m179L317j29m455n576J850K44
11186c7061J092o916j391L349j115k916k215k311J457K034l016p242M910n422
11172e6763L437O789M90O086K714l575k225o607L10N874P825O517o241k330k185
11157c9884M512R759j96j1867o964l56O571Q397O198r093j4364j074k052J737
11143d8676P208R255n260M874M523K301p10k396N410K806q67o520m109n483O09
11128c7035K161j349k590O78L016J451j328O43k737n307p84L13N435K74J887K378
$$ plain form
11112 -32894 -28613 -31224 -32823 -33324 -37385 -32709 -28117 -32761 -36895 -37349 -30422 -22197 -19507 -25752 -29081
11097 -29081 -29742 -30366 -29488 -34983 -34099 -28461 -26740 -34538 -33451 -36772 -35361 -32317 -28222 -29573 -28277
11082 -28277 -26737 -22579 -25897 -32679 -28460 -31447 -41338 -42533 -45446 -39621 -28698 -28734 -24746 -22143 -30381
11067 -30381 -36490 -34959 -31375 -29490 -36080 -34122 -26928 -25442 -24597 -23465 -26602 -26956 -23593 -21033 -24717
11052 -24717 -33014 -36930 -31448 -21984 -26954 -35778 -36913 -30811 -19931 -23294 -26421 -28155 -28522 -23604
11038 -23604 -22482 -30067 -31582 -25818 -27100 -41181 -49139 -47286 -49609 -49894 -47114 -40075 -39046 -45381
11024 -45381 -44304 -38604 -43484 -42002 -39831 -40591 -37241 -35688 -35102 -33213 -33304 -34508 -36527 -39280 -42977
11009 -42977 -43365 -35669 -35722 -41362 -41326 -44735 -46389 -43986 -33301 -23298 -18562 -19420 -36504 -38981 -39571
$$ packed form
11112c2894M281k611j599n01m061M676M592m644m134m54O927Q225K690o245l329
11097b9081o61o24Q78n495Q84N638J721p798J087l321J411L044M095j351J296
11082b8277J540M158l318o782M219k987r891j195k913N825J0923l6L988K603q238
11067c0381o109J531L584J885o590J958P194J486Q45J132l137l54L363K560l684
11052b4717q297l916N482R464m970q824j135O102J0880l363l127j734l67M918
11038b3604J122p585j515N764j282j4081p958J853k323k85K780P039J029o335
11024d5381J077N700m880J482K171p60L350J553N86J889r1j204k019k753l697
11009d2977l88P696n3n640L6l409j654K403J0685J0003M736q58j7084k477n90
$$ plain form
10994 -39571 -35715 -33430 -42152 -44180 -45064 -37346 -27277 -22193 -20768 -22300 -25053 -36323 -35908 -35707 -35336
10979 -35336 -40667 -54467 -42335 -33127 -32034 -33333 -34994 -40162 -40537 -35240 -29562 -25446 -28871 -31174
10965 -31174 -17179 -20321 -35133 -29050 -23866 -22774 -30524 -35991 -43997 -40447 -32335 -33616 -37834 -30667
10951 -30667 -33816 -41939 -45487 -48176 -48337 -51577 -54765 -53397 -46693 -38286 -34867 -39843 -38876 -31717 -31612
10936 -31612 -38457 -37912 -38887 -40263 -42186 -44991 -44772 -44770 -43462 -47331 -50023 -51154 -48116 -43131 -40523 -37197
10920 -37197 -28609 -26967 -28369 -27567 -28383 -29568 -31923 -32670 -30912 -26061 -30891 -29962 -28143 -29308 -35922
10905 -35922 -37150 -33553 -30747 -31157 -38937 -42875 -39155 -28432 -30042 -35897 -37068 -34855 -33367 -25050
10891 -25050 -20342 -23985 -23504 -23718 -22260 -21772 -26954 -31156 -25470 -24582 -20490 -21346 -26695 -29754 -31103 -28220
$$ packed form
10994c9571L856K285q722k028q84P718J0069N084J425j532k753j1270M15K01L71
10979c5336n331j3800J2132R208J093j299j661n168l75N297N678M116l425k303
10965c1174J3995l142j4812O083N184J092p750n467q006L550Q112j281m218P167
10951c0667l149q123l548k689j61l240l188J368O704Q407L419m976R67P159J05
10936c1612o845N45r75j376j923k805K19KJ308l869k692j131L038M985K608L326
10920c7197Q588J642j402Q02q16j185k355p47J758M851m830R29J819j165o614
10905c5922j228L597K806m10p780l938L720J0723j610n855j171K213J488Q317
10891b5050M708l643M81k14J458M88n182m202N686Q88M092q56n349l059j349K883
$$ plain form
10875 -28220 -23654 -32739 -25079 -14810 -15198 -18957 -24501 -19472 -14968 -14066 -20541 -17348 -16183 -24507 -26310
10860 -26310 -27837 -42537 -41471 -37389 -31777 -26185 -34303 -31301 -22996 -25123 -17212 -20761 -22082 -18424
10846 -18424 -20413 -18031 -14674 -19210 -24682 -25632 -24090 -24804 -29091 -32903 -41573 -43903 -41145 -32953 -33477
10831 -33477 -33809 -35836 -32866 -34879 -34401 -32852 -34073 -33028 -26370 -12945 -9573 -8340 -6166 -8768 -12101
10816 -12101 -15011 -11287 -5544 1704 -3669 -15354 -13683 -11939 -7498 -4762 -6562 -17602 -22721 -19609
10802 -19609 -19657 -23933 -18953 -17044 -13996 -14585 -10559 -8686 -12299 -7462 -14167 -20971 -28758 -30792 -24413
10787 -24413 -16950 -13046 -6614 -2007 -9503 -13997 -12030 -9550 -6841 -3012 -4189 -3947 680 -4074 -6839
10772 -6839 -9273 -16186 -8593 1440 4627 4358 6409 12755 15925 17630 26206 36780 32826 24499
$$ packed form
10875b8220M566r085P660J0269l88l759n544N029M504R02o475L193J165q324j803
10860b6310j527j4700J066M082N612N592q118L002Q305k127P911l549j321L658
10846a8424j989K382L357m536n472r50J542p14m287l812q670k330K758Q192n24
10831c3477l32k027K970k013M78J549j221J045O658J3425L372J233K174k602l333
10816a2101k910L724N743P248n373j1685J671J744M441K736j800j1040n119L112
10802a9609m8m276M980J909L048n89M026J873l613M837o705o804p787k034O379
10787b4413P463L904O432M607p496m494J967K480K709L829j177K42M627m754k765
10772f839k434o913P593J0033L187k69K051O346L170J705Q576J0574l954q327
$$ plain form
10758 24499 18426 21618 34577 49360 69576 94232 136103 184097 246691 328392 419115 512204
10746 512204 594290 666155 706962 718414 699738 654881 590861 506060 427524 362743 308073
10735 308073 262202 226127 200827 183959 169746 154668 139171 128837 117332 102051 91542
10724 91542 84674 77944 76201 63786 58352 65513 72898 79082 91262 104484 120234 139015 162042
10711 162042 180579 196217 213907 244816 297611 354449 421751 498400 579569 659351 744196
10700 744196 832690 918008 985574 1042134 1069869 1066995 1031966 983589 918386 846336 770399 690342
10688 690342 629773 579640 543706 520374 492857 461910 437761 409490 379060 340167 303398
10677 303398 269621 236581 210291 184745 163345 149507 128344 111860 108925 102758 86845 72798
$$ packed form
10758B4499o073L192J2959J4783K0216K4656M1871M7994O2594Q1701R0723R3089
10746E12204Q2086P1865M0807J1452j8676m4857o4020q4801p8536o4781n4670
10735C08073m5871l6075k5300j6868j4213j5078j5497j0334j1505j5281j0509
10724I1542o868o730j743j2415n434P161P385O184J2180J3222J5750J8781K3027
10711A62042J8537J5638J7690L0909N2795N6838O7302P6649Q1169P9782Q4845
10700G44196Q8494Q5318O7566N6560K7735k874l5029m8377o5203p2050p5937q0057
10688F90342o0569n0133l5934k3332k7517l0947k4149k8271l0430l8893l6769
10677C03398l3777l3040k6290k5546k1400j3838k1163j6484k935o167j5913j4047
$$ plain form
10665 72798 75947 77214 83391 85779 85137 78572 74119 79857 103221 136968 179187 240898 312635
10652 312635 402037 497460 598019 693914 763557 802313 810789 783891 727048 648685 560941
10641 560941 476609 395150 331851 280049 231811 200600 178427 171781 166142 151470 125990 100187
10629 100187 80462 60634 46885 31210 17155 9890 9372 13685 13314 10862 2167 -5650 -8276
10616 -8276 -10387 -10937 -19799 -20439 -20472 -20394 -16489 -13204 -12040 -16733 -15815 -17585 -23524 -22511 -25303 -26675
10600 -26675 -24736 -27327 -31385 -33786 -30565 -19973 -20336 -26465 -22399 -15268 -15088 -17542 -20403 -28090 -40855
10585 -40855 -38780 -36379 -33024 -32077 -35318 -33110 -33355 -38146 -44179 -45216 -40340 -33310 -29225 -22806 -25829
10570 -25829 -29480 -26258 -18365 -25888 -28771 -25031 -25594 -30341 -32292 -38134 -32703 -26480 -19486 -20169 -27152
$$ packed form
10665G2798L149J267O177K388o42o565m453N738K3364L3747M2219O1711P1737
10652C12635Q9402R5423J00559R5895O9643L8756Q476k6898n6843p8363q7744
10641E60941q4332q1459o3299n1802m8238l1211k2173o646n639j4672k5480k5803
10629A00187j9725j9828j3749j5675j4055p265n18M313l71k452q695p817k626
10616h276k111n50q862o40l3P8L905L285J164m693R18j770n939J013k792j372
10600b6675J939k591m058k401L221J0592l63o129M066P131J80k454k861p687j2765
10585d0855K075K401L355R47l241K208k45m791o033j037M876P030M085O419l023
10570b5829l651L222P893p523k883L740n63m747j951n842N431O223O994o83o983
$$ plain form
10555 -27152 -26817 -31228 -29176 -19388 -19596 -19044 -19498 -21434 -28025 -38758 -46685 -44556 -34123 -29477 -27984
10540 -27984 -20065 -18878 -27504 -23909 -23400 -29885 -31988 -30128 -26143 -27070 -23627 -24054 -25260 -30335 -30724
10525 -30724 -29955 -26870 -32859 -39972 -29310 -25181 -21707 -15070 -13192 -22686 -20008 -15400 -23972 -34918
10511 -34918 -30521 -26727 -35062 -40607 -50494 -44573 -35909 -28877 -26679 -27263 -35102 -40485 -40952 -34236 -30769
10496 -30769 -23443 -24836 -30620 -38578 -40029 -30096 -27728 -26723 -21788 -24973 -28460 -39081 -41120 -35723
10482 -35723 -32732 -37124 -48717 -41077 -36729 -34753 -35444 -40334 -39157 -38769 -41178 -35970 -29821 -30019 -33811
10467 -33811 -33084 -30641 -25322 -17107 -14666 -14944 -19174 -16318 -20904 -24832 -28635 -26083 -26123 -29236 -28975 -28325
10451 -28325 -30993 -34648 -39013 -31957 -34926 -33702 -24745 -20649 -16987 -21512 -27153 -35527 -34120 -29303
$$ packed form
10555b7152L35m411K052R788k08N52m54j936o591j0733p927K129J0433M646J493
10540b7984P919J187q626L595N09o485k103J860L985r27L443m27j206n075l89
10525c0724P69L085n989p113J0662M129L474O637J878r494K678M608q572j0946
10511c4918M397L794q335n545r887N921Q664P032K198n84p839n383m67O716L467
10496c0769P326j393n784p958j451R933K368J005M935l185l487j0621k039N397
10482c5723K991m392j1593P640M348J976o91m890J177L88k409N208O149j98l792
10467c3811P27K443N319Q215K441k78m230K856m586l928l803K552m0l113K61O50
10451b8325k668l655m365P056k969J224Q957M096L662m525n641q374J407M817
$$ plain form
10437 -29303 -26900 -28114 -29054 -25207 -23786 -25558 -22521 -19667 -22991 -22006 -23035 -33857 -42346 -44619 -43608
10422 -43608 -43026 -36657 -30997 -32248 -24280 -21736 -24468 -35231 -40811 -33908 -20751 -14733 -20913 -25826
10408 -25826 -31476 -27491 -23161 -24578 -21294 -15455 -22865 -27799 -29008 -22428 -16033 -11758 -18705 -34918
10394 -34918 -36811 -29968 -22997 -23822 -18347 -18083 -17656 -17877 -20675 -22348 -15984 -12639 -15940 -20356 -23488
10379 -23488 -23712 -19060 -17973 -15564 -17085 -13488 -13058 -14250 -5262 -10650 -17474 -13683 -14426 -16762 -11252
10364 -11252 -8367 -10989 -13901 -13650 -15834 -19018 -17477 -16544 -8048 4884 15264 26159 40403 44888
10350 44888 46004 42533 37340 31342 28846 28380 30648 29550 25510 19795 15181 16180 17977 14057 13106
10335 13106 9402 7388 -800 -10659 -11797 -1038 5804 3653 6698 20077 24399 28470 33722 38824
$$ packed form
10437b9303K403j214r40L847J421j772L037K854l324R85j029j0822q489k273J011
10422d3608N82O369N660j251P968K544k732j0763n580O903J3157O018o180m913
10408b5826n650L985M330j417L284N839p410m934j209O580O395M275o947j6213
10394c4918j893O843O971q25N475K64M27k21k798j673O364L345l301m416l132
10379b3488k24M652J087K409j521L597M30j192Q988n388o824L791p43k336N510
10364a1252K885k622k912K51k184l184J541R33Q496J2932J0380J0895J4244M485
10350D4888J116l471n193n998k496m66K268j098m040n715m614R99J797l920r51
10335A3106l704k014q188r859j138J0759O842k151L045J3379M322M071N252N102
$$ plain form
10321 38824 41044 38082 26596 17988 15524 13383 11224 6730 8180 7017 5849 3369 14765 25648
10307 25648 28776 28425 27527 27796 20531 20289 19854 8460 -7626 -9625 1060 -776 -7177 7763 22541
10292 22541 17894 12617 11361 3909 4218 5822 5816 10724 20832 29745 34926 41140 49720 59861 72952
10277 72952 95148 116122 130485 139861 152138 165432 180564 180719 180027 187789 196146 213823 243635
10264 243635 255140 258242 264321 268586 263152 237049 209213 188386 168892 143909 116457 99187
10252 99187 93036 83641 76129 64274 47535 38003 34293 33754 31197 23226 22647 18969 22770 20709
10238 20709 20453 14486 10149 4269 3872 8345 7749 7941 6439 -1020 -9314 -10899 -16134 -18351 -15536
10223 -15536 -5727 948 5034 3694 625 -11265 -17544 -14029 -14015 -17875 -9737 811 4632 4197 17081
$$ packed form
10321C8824K220k962j1486q608k464k141k159m494J450j163j168k480J1396J0883
10307B5648L128l51q98K69p265k42m35j1394j6086j999J0685j836o401J4940J4778
10292B2541m647n277j256p452L09J604oM908J0108Q913N181O214Q580J0141J3091
10277G2952K2196K0974J4363R376J2277J3294J5132J55o92P762Q357J7677K9812
10264B43635J1505L102O079M265n434k6103k7836k0827j9494k4983k7452j7270
10252I9187o151r395p512j1855j6739r532l710n39k557p971n79l678L801k061
10238B0709k56n967m337n880l97M473n96J92j502p459q294j585n235k217K815
10223a5536R809O675M086j340l069j1890o279L515J4l860Q138J0548L821m35J2884
$$ plain form
10208 17081 12563 -571 -7511 -10581 -13009 -5257 368 3359 7019 9087 13114 17418 9854 10061
10194 10061 21923 33412 48839 68487 89832 113994 146203 169582 181988 188954 195160 202009
10182 202009 199580 192398 185341 179480 185675 186068 183369 172018 162543 145455 131997 129922 134008 130677
10168 130677 126890 124004 114299 101620 96892 86514 74680 63774 57193 52855 47020 41041 34938
10155 34938 30384 33342 30264 24479 21319 22949 24314 26481 22217 17264 17900 22016 19634 8264
10141 8264 12642 11827 23394 31618 32421 29596 30702 30868 34138 41478 45306 42181 32324 29105 29253
10126 29253 31812 40165 35512 34358 40792 42119 52412 64181 81909 109524 146365 184225 210466
10113 210466 224568 206244 202690 221122 254920 304906 347265 367149 370160 354934 325087 298719
$$ packed form
10208A7081m518j3134o940l070k428P752N625K991L660K068M027M304p564K07
10194A0061J1862J1489J5427J9648K1345K4162L2209K3379J2406O966O206O849
10182B02009k429p182p057n861O195L93k699j1351r475j7088j3458k075M086l331
10168A30677l787k886r705j2679m728j0378j1834j0906o581m338n835n979o103
10155C4938m554K958l078n785l160J630J365K167m264m953O36M116k382j1370
10141H264M378q15J1567Q224Q03k825J106J66L270P340L828l125r857l219J48
10126B9253K559Q353m653j154O434J327J0293J1769J7728K7615L6841L7860K6241
10113B10466J4102j8324l554J8432L3798M9986M2359J9884L011j5226k9847k6368
$$ plain form
10101 298719 285916 284538 294321 307389 299996 267114 225728 188600 159828 132816 123026 116723
10089 116723 104959 87689 78504 71480 68519 70902 69278 67608 67547 63186 71868 63843 56214 50168
10075 50168 43719 45331 44317 49692 53448 56941 59762 63740 83650 111824 144435 173234 202677
10062 202677 216049 212767 211110 226486 253820 287187 325293 349055 350873 329223 299485 265770
10050 265770 245857 240689 251883 263276 255998 240675 203312 164510 133844 117186 99954 90235
10038 90235 91873 95861 90677 83569 77851 64629 55412 53352 55862 53533 40553 33202 30740 27385
10024 27385 26461 26172 21806 22328 22945 16026 12890 13474 13148 13870 10775 634 6660 7060 2042 -2386
10008 -2386 -5716 -8493 -8061 -4354 -10671 -6671 -8377 -12984 -9909 1832 8949 10380 12041 16893 23604
$$ packed form
10101B98719j2803j378R783J3068p393l2882m1386l7128k8772k7012r790o303
10089A16723j1764j7270r185p024k961K383j624j670o1m361Q682q025p629o046
10075E0168o449J612j014N375L756L493K821L978J9910K8174L2611K8799K9443
10062B02677J3372l282j657J5376K7334L3367L8106K3762J818k1650k9738l3715
10050B65770j9913n168J1194J1393p278j5323l7363l8802l0666j6658j7232r719
10038I0235J638L988n184p108n718j3222r217k060K510k329j2980p351k462l355
10024B7385r24k89m366N22O17o919l136N84l26P22l095j0141O026M00n018m428
10008b386l330k777M32L707o317M000j706m607L075J1741P117J431J661M852O711
$$ plain form
9993 23604 23095 27123 33352 38372 49537 57852 54749 55556 56445 48097 42559 54461 58651 56206 49344
9978 49344 48716 45639 40515 31322 27384 34915 35740 37762 38398 42438 43041 40051 41668 47328 40905 35740
9962 35740 34733 31971 30972 28293 24421 25034 25568 25474 30443 28808 35050 35537 20572 10890 16473 28715
9946 28715 38465 44123 49385 45449 40793 44193 52475 64293 68443 66976 80307 82264 80252 76344
9932 76344 69467 61601 59500 57370 60183 66539 60350 62102 60634 51474 44761 39985 46509 49746 50018
9917 50018 56409 59784 56428 63867 61491 57555 60072 54560 52605 51301 46568 50960 53709 60626 57961
9902 57961 50049 51726 56855 61293 66519 67803 67092 62206 60518 63989 67406 70296 81429 80678 79937
9887 79937 78329 77930 79625 71574 76497 79395 83671 86518 78693 70639 69585 69233 67216 71487 76877
$$ packed form
9993B3604n09M028O229N020J1165Q315l103Q07Q89q348n538J1902M190k445o862
9978D9344o28l077n124r193l938P531Q25K022O36M040O03k990J617N660o423n165
9962C5740j007k762r99k679l872O13N34r4M969j635O242M87j4965r682N583J2242
9946B8715R750N658N262l936m656L400Q282J1818M150j467J3331J957k012l908
9932G6344o877p866k101k130K813O356o189J752j468r160o713m776O524L237K72
9917E0018O391L375l356P439k376l936K517n512j955j304m733M392K749O917k665
9902E7961p912J677N129M438N226J284p11m886j688L471L417K890J1133p51p41
9887G9937j608l99J695q051M923K898M276K847p825q054j054l52k017M271N390
$$ plain form
9872 76877 83994 84959 89862 100364 114260 131029 135219 146170 145389 143461 164541 184145 207142
9859 207142 225173 224150 197660 179233 182270 186491 191273 197850 199576 204098 191474 168400 158168
9846 158168 156816 156170 158601 158907 161839 177352 192921 194295 179266 179289 184737 187577 192954 203289
9832 203289 202387 197586 194474 198784 200548 202915 205179 201323 202956 207580 208956 213718 227403 234517
9818 234517 249263 265380 273944 274697 263775 256556 259146 276955 305374 328618 340655 336369 328113
9805 328113 319875 317756 319090 333374 347779 357712 362224 364649 357941 352715 358855 360819 363638 377146
9791 377146 389631 398611 418009 438659 462345 472833 489012 506572 527046 552723 577017 596357
9779 596357 621897 651606 686930 718509 748768 779944 821841 874410 943685 1036110 1167165
$$ packed form
9872G6877P117R65M903J0502J3896J6769M190J0951p81j928K1080J9604K2997
9859B07142J8031j023k6490j8427L037M221M782O577J726M522j2624k3074j0232
9846A58168j352o46K431L06K932J5513J5569J374j5029K3N448K840N377J0335
9832B03289r02m801l112M310J764K367K264l856J633M624J376M762J3685P114
9818B34517J4746J6117Q564P53j0922p219K590J7809K8419K3244J2037m286q256
9805C28113q238k119J334J4284J4405R933M512K425o708n226O140J964K819J3508
9791C77146J2485Q980J9398K0650K3686J0488J6179J7560K0474K5677K4294J9340
9779E96357K5540K9709L5324L1579L0259L1176M1897N2569O9275R2425J31055
$$ plain form
9768 1167165 1340110 1570591 1836647 2066084 2205839 2297886 2419972 2605429 2845087 3161106
9758 3161106 3512005 3829055 4060276 4213621 4309520 4410531 4569170 4819600 5181019 5657071
9748 5657071 6244506 6985264 8049513 9658778 12109823 15811038 21302961 28806757 36997965
9739 36997965 42491263 43088600 40837880 39509140 41626641 48052650 58004394 68322027
9731 68322027 74813615 75390893 69921775 61052421 52903769 48223863 47661408 50307117
9723 50307117 53395600 52917472 47532297 39825705 32723905 27299674 23414098 20677216
9715 20677216 18743518 17299578 16059281 14866552 13747454 12824804 12167238 11775182 11569121
9706 11569121 11392180 11092843 10629005 10054521 9497617 9115123 8979555 9085798 9386928
$$ packed form
9768A167165J72945K30481K66056K29437J39755R2047J22086J85457K39658L16019
9758C161106L50899L17050K31221J53345R5899J01011J58639K50430L61419M76052
9748E657071N87435P40758J064249J609265K451045L701215N491923P503796Q191208
9739C6997965N493298N97337k250720j328740K117501O426009R951744J0317633
9731F8322027O491588N77278n469118q869354q148652m679906n62455K645709
9723E0307117L088483m78128n385175p706592p101800n424231l885576k736882
9715B0677216j933698j443940j240297j192729j119098r22650o57566l92056k06061
9706A1569121j76941k99337m63838n74484n56904l82494j35568J06243L01130
$$ plain form
9697 9386928 9781965 10222240 10865711 12031612 14046291 17328734 22420227 29530347 37406983
9688 37406983 42782816 43329230 40916862 39313065 41096626 47218961 57025163 67388830
9680 67388830 73922068 74511085 69169308 60442135 52296772 47484850 46736358 49233795
9672 49233795 52350579 52070736 46837092 39116028 31889602 26318345 22264513 19311891
9664 19311891 17116105 15445461 14080647 12825173 11609433 10512911 9605906 8900424
9656 8900424 8358934 7877914 7351745 6751012 6098797 5461352 4941341 4572740 4337180 4181268
9646 4181268 4044910 3866798 3627583 3416630 3293048 3256301 3207636 3078935 2895402 2760927
9636 2760927 2745267 2852523 3045212 3221880 3289302 3221085 3006436 2722961 2473285 2330284
$$ packed form
9697I386928L95037M40275O43471J165901K014679L282443N091493P110120P876636
9688C7406983N375833N46414k412368j603797J783561O122335R806202J0363667
9680F7388830O533238N89017n341777q727173q145363m811922p48492K497437
9672D9233795L116784k79843n233644p721064p226426n571257m053832k952622
9664A9311891k195786j670644j364814j255474j215740j096522r07005p05482
9656H900424n41490m81020n26169o00733o52215o37445n20011l68601k35560j55912
9646D181268j36358j78112k39215k10953j23582l6747m8665j28701j83533j34475
9636B760927j5660J07256J92689J76668O7422o8217k14649k83475k49676j43001
$$ plain form
9626 2330284 2304479 2329676 2311667 2180602 1947495 1698003 1481206 1318394 1194848 1107087
9616 1107087 1038071 979354 927714 878083 830027 790952 756453 739154 745692 740385 733071 722364
9604 722364 703198 676679 656050 650795 645168 644032 643742 642646 647148 677820 739936 845321 1008650
9591 1008650 1227092 1451598 1604769 1646763 1598969 1578953 1663806 1867716 2156034 2405139
9581 2405139 2536744 2520100 2349738 2113043 1912567 1811521 1812509 1869050 1865694 1744289 1515471
9570 1515471 1270993 1076255 934146 833349 757200 696535 656319 623623 587529 549501 509894
9559 509894 472888 447252 428723 421013 414350 399559 371545 346708 322977 310002 302233 292678
9547 292678 282571 271426 256165 241871 232967 218548 208197 208648 203997 196001 186858 190219 190339
$$ packed form
9626B330284k5805K5197j8009j31065k33107k49492k16797j62812j23546q7761
9616A107087o9016n8717n1640m9631m8056l9075l4499j7299O538n307p314j0707
9604G22364j9166k6519k0629n255n627j136k90j096M502L0672O2116J05385J63329
9591A008650K18442K24506J53171M1994m7794k0016Q4853K03910K88318K49105
9581B405139J31605j6644j70362k36695k00476j01046R88N6541l356j21405k28818
9570A515471k44478j94738j42109j00797p6149o0665m0216l2696l6094l8028l9607
9559E09894l7006k5636j8529p710o663j4791k8014k4837k3731j2975p769r555
9547B92678j0107j1145j5261j4294q904j4419j0351M51m651p996r143L361J20
$$ plain form
9534 190339 182620 171763 166015 155534 147650 149655 145899 136858 135861 139959 141702 136819 129846 131257
9520 131257 128753 123980 127607 126055 123843 122148 123428 122679 128051 126355 118783 112288 117243 119546 105676
9505 105676 100854 108942 104078 101242 101030 93334 84439 83546 88351 89159 88079 96432 96628 100446 98310
9490 98310 98974 109315 113412 114193 118057 114830 113275 117212 113872 108374 103104 109938 118813 124978 126442
9475 126442 128731 135883 137544 140983 136956 138217 139927 144971 147270 147820 144346 136519 136045 131854 128074
9460 128074 124957 126503 131916 130716 125195 129476 127981 130549 136369 138065 132761 128368 122841 123597 123735
9445 123735 116108 108268 102587 97937 95688 98381 110117 126550 132553 131333 119780 120262 124247 129050
9431 129050 123848 111907 108093 111972 120415 130599 139384 147088 143442 141757 143598 144516 144882 149175
$$ packed form
9534A90339p719j0857n748j0481p884K005l756r041r97M098J743m883o973J411
9520A31257k504m773L627j552k212j695J280p49N372j696p572o495M955K303j3870
9505A05676m822Q088m864k836k12p696q895q93M805Q08j080Q353J96L818k136
9490I8310O64J0341M097P81L864l227j555L937l340n498n270O834Q875O165J464
9475A26442K289P152J661L439m027J261J710N044K299N50l474p827m74m191l780
9460A28074l117J546N413j200n521M281j495K568N820J696n304m393n527P56J38
9445A23735p627p840n681m650k249K693J1736J6433O003j220j1553M82L985M803
9431A29050n202j1941l814L879Q443J0184Q785P704l646j685J841R18L66M293
$$ plain form
9417 149175 160659 171685 177340 176476 183525 189910 194211 190564 193673 184150 180766 185610 180769 171626
9403 171626 162385 163938 168007 174757 174908 166762 162684 158398 152932 148778 144295 146233 149834 155979 149279
9388 149279 146246 151468 154805 160493 166236 166149 172036 175053 179416 177187 175924 180996 190414 189077 185806
9373 185806 183006 185371 193722 214112 228922 232299 234279 245624 256219 267083 288809 318892 350235
9360 350235 380985 418186 441869 446978 444978 464485 498677 548053 599413 630371 637340 632507
9348 632507 603140 577360 566947 563621 576410 593427 592220 562401 520048 475849 442088 418372
9336 418372 407526 397369 374852 353536 350255 340879 323131 305048 285124 266658 266501 272124 266397
9323 266397 251236 238005 235373 243063 261824 271586 262383 260340 262720 270816 270560 277934 299891 333435
$$ packed form
9417A49175J1484J1026N655q64P049O385M301l647L109r523l384M844m841r143
9403A71626r241J553M069O750J51q146m078m286n466m154m483J938L601O145o700
9388A49279l033N222L337N688N743q7N887L017M363k229j263N072R418j337l271
9373A85806k800K365Q351K0390J4810L377J980J1345J0595J0864K1726L0083L1343
9360C50235L0750L7201K3683N109k000J9507L4192M9376N1360L0958O969m833
9348F32507k9367k5780j0413l326J2789J7017j207k9819m2353m4199l3761k3716
9336D18372j0846j0157k2517k1316l281r376j7748j8083j9924j8466j57N623n727
9323B66397j5161j3231k632P690J8761R762r203k043K380Q096k56P374K1957L3544
$$ plain form
9309 333435 380918 422590 448567 444338 440920 460660 491482 546406 608204 647593 657772 646250
9297 646250 621065 586084 565594 571341 591313 612604 606261 576617 538928 496452 466873 440604
9285 440604 423291 406950 383677 362611 342990 325420 315148 303574 295608 296167 288073 283081 287773
9272 287773 295780 311602 345528 405915 481510 554892 569997 535527 506354 512800 555571 638467
9260 638467 720140 778475 790462 747452 664532 584907 547405 551898 592317 626446 620135 559362
9248 559362 480823 424025 383709 357664 334729 328389 328588 327265 344105 360692 376467 393781
9236 393781 412172 416650 411827 408164 409792 391830 362449 337076 320300 314306 307987 295966 288641
9223 288641 291818 301786 312914 332281 364395 407402 477964 561853 608343 590640 544727 527221
$$ packed form
9309C33435M7483M1672K5977m229l418J9740L0822N4924O1798L9389J0179j1522
9297F46250k5185l4981k0490N747J9972K1291o343k9644l7689m2476k9579k6269
9285D40604j7313j6341k3273k1066j9621j7570j0272j1574p966N59q094m992M692
9272B87773Q007J5822L3926O0387P5595P3382J5105l4470k9173O446M2771Q2896
9260F38467Q1673N8335J1987m3010q2920p9625l7502M493M0419L4129o311o0773
9248E59362p8539n6798m0316k6045k2935o340J99j323J6840J6587J5775J7314
9236C93781J8391M478m823l663J628j7962k9381k5373j6776n994o319j2021p325
9223B88641L177R968J1128J9367L2114M3007P0562Q3889M6490j7703m5913j7506
$$ plain form
9211 527221 559055 635393 736657 816495 850667 831997 765769 686416 635859 627972 680923 759829
9199 759829 805584 794883 757511 719389 699257 692124 694755 708087 725571 733904 726218 694930
9187 694930 650780 601198 551378 527974 510053 496096 501184 505277 506279 498627 496876 512128 531976
9174 531976 542964 521591 489713 445543 407313 378155 355595 337904 323949 313817 318697 319331
9162 319331 318554 320344 325196 327621 330965 337236 357692 371954 396666 432078 467583 497477 513301
9149 513301 522992 537044 567627 621004 692218 772174 847908 886869 889403 878144 867633 869483
9137 869483 869521 851888 815216 773956 730264 686694 641104 599740 567670 545489 535906 540302 568874
9124 568874 617705 681046 732239 753165 762781 776484 820131 925011 1163024 1649135 2568282
$$ packed form
9211E27221L1834P6338J01264P9838L4172j8670o6228p9353n0557p887N2951P8906
9199G59829M5755j0701l7372l8122k0132p133K631J3332J7484Q333p686l1288
9187F94930m4150m9582m9820k3404j7921j3957N088M093J002p652j751J5252J9848
9174E31976J0988k1373l1878m4170l8230k9158k2560j7691j3955j0132M880O34
9162C19331p77J790M852K425L344O271K0456J4262K4712L5412L5505K9894J5824
9149E13301R691J4052L0583N3377P1214P9956P5734L8961K534j1259j0511J850
9137H69483L8j7633l6672m1260m3692m3570m5590m1364l2070k2181r583M396K8572
9124E68874M8831O3341N1193K0926R616J3703M3647J04880K38013M86111R19147
$$ plain form
9113 2568282 3925394 4883674 4358043 3164056 2205996 1648509 1339435 1178471 1092894
9104 1092894 1050160 1027897 1039296 1045450 1035925 1021599 993331 950301 898181 853412 836514 843061
9092 843061 853570 856256 851074 821632 772845 719611 682567 671418 666329 638054 613367 583742
9080 583742 573805 572421 577592 591375 607659 613117 612965 604668 583542 562773 546823 509870 463948
9067 463948 426149 403090 380732 364599 353228 331781 308814 294139 287326 284138 278192 264800
9055 264800 261140 267933 267522 270570 279532 298155 317863 352213 397785 441747 489282 512012 509577
9042 509577 508880 495879 457291 419269 388882 367604 356075 344700 334495 340718 358389 380607
9030 380607 399250 426512 453120 474805 492294 498460 503334 501960 478945 441265 406287 377026
$$ packed form
9113B568282J357112R58280n25631j193987r58060n57487l09074j60964q5577
9104A092894m2734k2263J1399O154r525j4326k8268m3030n2120m4769j6898O547
9092H43061J0509K686n182k9442m8787n3234l7044j1149n089k8275k4687k9625
9080E83742r937j384N171J3783J6284N458j52q297k1126k0769j5950l6953m5922
9067D63948l7799k3059k2358j6133j1371k1447k2967j4675o813l188n946j3392
9055B64800l660O793m11L048Q962J8623J9708L4350M5572M3962M7535K2730k435
9042E09577o97j3001l8588l8022l0387k1278j1529j1375j0205O223J7671K2218
9030C80607J8643K7262K6608K1685J7489O166M874j374k3015l7680l4978k9261
$$ plain form
9018 377026 349247 324796 303816 286443 274868 271415 259381 248989 245121 239836 235570 233524 230309
9005 230309 232526 231191 232553 228212 226392 232167 231556 238915 247974 261450 272126 286577 304722 315658
8991 315658 313299 308007 299335 305224 311035 342145 388402 424417 452636 473216 483805 487072 489038
8978 489038 498463 503987 484797 453118 425816 409155 391229 377636 370663 358935 348046 348136 348922
8965 348922 350833 356355 366213 385722 398032 404671 409104 412441 406570 405849 402290 410158 425788 449022
8951 449022 469245 491031 521790 554551 603784 663784 721739 764803 789283 798740 809580 832404
8939 832404 864106 917247 979256 1031096 1090577 1211920 1412032 1697229 2006351 2157562 2054296
8928 2054296 1837847 1670745 1608658 1670843 1862167 2232643 2855619 3826604 5148485 6445908
$$ packed form
9018C77026k7779k4451k0980j7373j1575l453j2034j0392l868n285m266k046l215
9005B30309K217j335J362m341j820N775o11P359R059J3476J0676J4451J8145J0936
8991C15658k359n292q672N889N811L1110M6257L6015K8219K0580J0589L267J966
8978D89038R425N524j9190l1679k7302j6661j7926j3593o973j1728j0889R0P86
8965C48922J911N522R858J9509J2310O639M433L337n871p21l559P868J5630K3234
8951D49022K0223K1786L0759L2761M9233O0000N7955M3064K4480R457J0840K2824
8939H32404L1702N3141O2009N1840N9481J21343K00112K85197L09122J51211j03266
8928B054296k16449j67102o2087O2185J91324L70476O22976R70985J321881J297423
$$ plain form
8918 6445908 6932006 6289853 5112126 4037433 3284453 2793479 2469233 2244074 2083577
8909 2083577 1970942 1878533 1794534 1710940 1627382 1544525 1466784 1401272 1370759 1386380 1430585
8898 1430585 1473714 1491139 1475297 1441898 1403255 1349269 1267783 1173092 1092666 1032531 1006062
8887 1006062 1003498 1010271 1028539 1058396 1077581 1065083 1022764 976239 934342 896075 863792 845987
8875 845987 842490 853840 870029 887165 917009 963632 1023336 1074880 1115245 1129132 1123178 1119464
8863 1119464 1123261 1136582 1158019 1184113 1206965 1216585 1222641 1238592 1267358 1321382 1377367 1407955
8851 1407955 1433546 1445195 1434764 1400959 1352367 1296629 1259213 1244470 1241285 1252314 1281789 1316536
8839 1316536 1359354 1394662 1407021 1409968 1410666 1395936 1375925 1335003 1286797 1224283 1166160 1120627
$$ packed form
8918F445908M86098o42153j177727j074693p52980m90974l24246k25159j60497
8909B083577j12635r2409q3999q3594q3558q2857p7741o5512l0513J5621M4205
8898A430585M3129J7425j5842l3399l8643n3986q1486r4691q0426o0135k6469
8887A006062k564O773J8268K9857J9185j2498m2319m6525m1897l8267l2283j7805
8875H45987l497J1350J6189J7136K9844M6623N9704N1544M0365J3887n954l714
8863A119464L797J3321K1437K6094K2852R620O056J5951K8766N4024N5985L0588
8851A407955K5591J1649j0431l3805m8592n5738l7416j4743l185J1029K9475L4747
8839A316536M2818L5308J2359K947O98j4730k0011m0922m8206o2514n8123m5533
$$ plain form
8827 1120627 1098802 1112948 1144247 1172702 1200953 1237900 1278463 1295692 1295250 1305568 1334588 1372988
8815 1372988 1407074 1440993 1470419 1502912 1532402 1574401 1628109 1708711 1819674 1964511 2172935
8804 2172935 2459378 2783738 3055540 3150434 3037494 2822709 2609725 2432414 2280030 2169687
8794 2169687 2101328 2052616 2009528 1978257 1976006 2011923 2040741 2018152 1927547 1817186 1715454
8783 1715454 1647403 1603075 1594325 1625747 1676046 1746395 1815617 1871124 1912091 1927665 1935216 1965828
8771 1965828 2032151 2135300 2267787 2418046 2597704 2827026 3121619 3522587 4058531 4724446
8761 4724446 5471570 6196504 6796108 7262652 7741728 8466374 9588227 10992052 12150380
8752 12150380 12340572 11410528 9892580 8392680 7204739 6352611 5741085 5282053 4931086
$$ packed form
8827A120627k1825J4146L1299K8455K8251L6947M0563J7229m42J0318K9020L8400
8815A372988L4086L3919K9426L2493K9490M1999N3708Q0602J10963J44837K08424
8804B172935K86443L24360K71802R4894j12940k14785k12984j77311j52384j10343
8794B169687o8359m8712m3088l1271k251L5917K8818k2589r0605j10361j01732
8783A715454o8051m4328q750L1422N0299P0349O9222N5507M0967J5574P551L0612
8771A965828O6323J03149J32487J50259J79658K29322K94593M00968N35944O65915
8761D724446P47124P24934N99604M66544M79076P24646J121853J403825J158328
8752A2150380J90192r30044j517948j499900j187941q52128o11526m59032l50967
$$ plain form
8743 4931086 4657373 4432134 4222332 4018705 3844151 3698826 3606586 3542627 3499675 3499997 3526558
8732 3526558 3580707 3673874 3807551 3962745 4133344 4297310 4451487 4625310 4859292 5225706
8722 5225706 5750286 6441542 7254233 8127021 9056738 10125456 11450702 13115261 15121088
8713 15121088 17337290 19474966 21135163 22117839 22755002 23693792 25306842 27318577 29087873
8704 29087873 29956483 29117544 26268094 22396210 18788095 16013057 14002647 12556905
8696 12556905 11507371 10726675 10120178 9637335 9243644 8947107 8776322 8724380 8713980 8712829
8686 8712829 8687276 8680537 8746858 8920867 9206731 9620905 10119865 10607705 11073325 11619033
8676 11619033 12329873 13237686 14292120 15390670 16509164 17747206 19381740 21765494
$$ packed form
8743D931086k73713k25239k09802k03627j74554j45325r2240o3959m2952L22K6561
8732C526558N4149R3167J33677J55194J70599J63966J54177J73823K33982L66414
8722E225706N24580O91256Q12691Q72788R29717J068718J325246J664559K005827
8713A5121088K216202K137676J660197R82676O37163R38790J613050K011735J769296
8704B9087873Q68610q38939k849450l871884l608115k775038k010410j445742
8696A2556905j049534p80696o06497m82843l93691k96537j70785n1942j0400j151
8686H712829k5553o739O6321J74009K85864M14174M98960M87840M65620N45708
8676A1619033P10840R07813J054434J098550J118494J238042J634534K383754
$$ plain form
8668 21765494 25126554 29404315 33944090 37600890 39357394 39136051 37821291 36563308
8660 36563308 36410545 38213086 42189205 46894448 48865299 45751260 39227002 32451190
8652 32451190 27105478 23282672 20578826 18645494 17229626 16161602 15263708 14372546
8644 14372546 13464077 12589745 11809086 11136799 10587015 10196393 9990904 9976203 10152910 10498745
8634 10498745 10947828 11397523 11749638 12059014 12443168 12961534 13601079 14382097 15391339
8625 15391339 16732998 18478516 20621233 23043536 25503707 27620066 28986590 29446677
8617 29446677 29336376 29441079 30546220 32909554 35942243 38660582 40632525 41714474
8609 41714474 40775547 36799426 30978355 25359246 21018748 17943706 15775941 14172933
$$ packed form
8668B1765494L361060M277761M539775L656800J756504k21343j314760j257983
8660C6563308j52763J802541L976119M705243J970851l114039o524258o775812
8652C2451190n345712l822806k703846j933332j415868j068024q97894q91162
8644A4372546r08469q74332p80659o72287n49784l90622k05489j4701J76707L45835
8634A0498745M49083M49695L52115L09376L84154N18366O39545P81018J009242
8625A5391339J341659J745518K142717K422303K460171K116359J366524M60087
8617B9446677j10301J04703J105141K363334L032689K718339J971943J081949
8609D1714474r38927l976121n821071n619109m340498l075042k167765j603008
$$ plain form
8601 14172933 12924867 11907908 11033331 10208176 9397619 8620528 7924003 7341739 6884835
8592 6884835 6580375 6418407 6374068 6384685 6417423 6446245 6485237 6547435 6717079 7080185 7702168
8581 7702168 8578871 9674889 10853941 11891665 12565130 12781827 12628988 12320907 12154004
8572 12154004 12411375 13327856 15086139 17852305 21534433 25360823 27745810 27330098 24359448
8563 24359448 20371400 16709725 13857722 11762277 10230887 9096281 8234196 7529359
8555 7529359 6904521 6300406 5731933 5215774 4756871 4355081 4015879 3731997 3528170 3391256
8545 3391256 3292526 3206192 3097525 2945997 2773568 2625958 2508910 2428371 2376227 2368828 2403085
8534 2403085 2479799 2609119 2805048 3076455 3462847 3998499 4740319 5726863 6901127 8054552
$$ packed form
8601A4172933j248066j016959q74577q25155q10557p77091o96525n82264m56904
8592F884835l04460j61968m4339J0617L2738K8822L8992O2198J69644L63106O21983
8581G702168Q76703J096018J179052J037724O73465K16697j52839l08081j66903
8572A2154004K57371R16481J758283K766166L682128L826390K384987m15712k970650
8563B4359448l988048l661675k852003k095445j531390j134606q62085p04837
8555G529359o24838o04115n68473n16159m58903m01790l39202k83882k03827j36914
8545C391256r8730q6334j08667j51528j72429j47610j17048q0539n2144p399L4257
8534B403085P6714J29320J95929K71407L86392N35652P41820R86544J174264J153425
$$ plain form
8524 8054552 8791909 8767308 8041562 6961951 5879187 4974900 4275701 3753037 3364773
8515 3364773 3069587 2828833 2613489 2415340 2228285 2066868 1929631 1806104 1717996 1644222
8505 1644222 1594408 1552062 1512156 1458195 1390196 1315982 1235467 1157342 1098906 1054243 1010843
8494 1010843 984983 978626 968843 949371 923661 902337 883467 871818 869400 884150 899185 911347
8482 911347 923203 939374 954022 966745 964105 947298 935540 928328 919602 895530 872796 854704
8470 854704 842995 838720 836887 832133 825821 818106 810432 816696 828640 838171 843575 856261 879332
8457 879332 920736 975802 1044196 1135687 1239517 1342856 1441226 1513209 1536274 1525585 1503139
8446 1503139 1478610 1450448 1429877 1419838 1419953 1407682 1372934 1331378 1296274 1280542 1279804 1274536
$$ packed form
8524H054552P37357k4601p25746j079611j082764r04287o99199n22664l88264
8515C364773k95186k40754k15344j98149j87055j61417j37237j23527q8108p3774
8505A644222m9814m2346l9906n3961o7999p4214q0515p8125n8436m4663m3400
8494A010843k5860o357r783j9472k5710k1324j8870j1649k418J4750J5035J2162
8482I11347J1856J6171J4648J2723k640j6807j1758p212q726k4072k2734j8092
8470H54704j1709m275j833m754o312p715p674O264J1944R531N404J2686K3071
8457H79332M1404N5066O8394R1491J03830J03339R8370P1983K3065j0689k2446
8446A503139k4529k8162k0571j0039J15j2271l4748m1556l5104j5732p38n268
$$ plain form
8434 1274536 1276659 1285804 1299417 1315659 1343383 1366349 1382658 1399778 1414130 1414724 1414003 1424027 1439504
8421 1439504 1454032 1476731 1491497 1502295 1532197 1569895 1611944 1663746 1730803 1782384 1827203
8410 1827203 1858359 1905195 1968183 2031401 2091519 2142730 2176496 2218377 2265538 2331782 2452625
8399 2452625 2626030 2832696 3060238 3277395 3440363 3509124 3496177 3492007 3564495 3745945
8389 3745945 4016520 4307411 4548567 4650252 4591411 4427163 4236649 4071571 3950579 3874840
8379 3874840 3825625 3809765 3815801 3842206 3886027 3949326 4024466 4114749 4224631 4350421 4479091
8368 4479091 4599877 4701943 4815437 4923103 5034091 5153930 5296133 5470485 5668974 5874358
8358 5874358 6088333 6318729 6579405 6891438 7272145 7744274 8300011 8927245 9620799 10403935
$$ packed form
8434A274536K123R145J3613J6242K7724K2966J6309J7120J4352N94p21J0024J5477
8421A439504J4528K2699J4766J0798K9902L7698M2049N1802O7057N1581M4819
8410A827203L1156M6836O2988O3218O0118N1211L3766M1881M7161O6244J20843
8399B452625J73405K06666K27542K17157J62968O8761j2947m170P2488J81450
8389C745945K70575K90891K41156J01685n8841j64248j90514j65078j20992p5739
8379C874840m9215j5860O036K6405M3821O3299P5140R0283J09882J25790J28670
8368D479091J20786J02066J13494J07666J10988J19839J42203J74352J98489K05384
8358E874358K13975K30396K60676L12033L80707M72129N55737O27234O93554P83136
$$ plain form
8348 10403935 11311070 12399444 13778505 15538717 17662378 20005402 22292402 24253900
8340 24253900 25657155 26483978 26968372 27484668 28385019 29965818 32506442 36275575 41689643
8331 41689643 49413629 60529227 76699038 100236909 133709807 178496579 232387922
8324 232387922 288050040 334639691 361765028 363800166 342344026 305044288 261404249
8317 261404249 219302772 183486044 155571008 134953551 119994769 108790471 99685151
8310 99685151 91577093 84070319 77241322 71350970 66584201 62897162 59938193 57162141
8302 57162141 54147633 50913875 47828245 45274631 43445015 42361990 41973532 42224991
8294 42224991 43007865 44157076 45459920 46845804 48515935 50769056 53764669 57585709
$$ packed form
8348A0403935R07135J088374J379061J760212K123661K343024K287000J961498
8340B4253900J403255Q26823M84394N16296R00351J580799K540624L769133N414068
8331D1689643P723986J1115598J6169811K3537871L3472898M4786772N3891343
8324B32387922N5662118M6589651K7125337K035138k1456140l7299738m3640039
8317B61404249m2101477l5816728k7915036k0617457j4958782j1204298r105320
8310I9685151q108058p506774o828997n890352m766769l687039k958969k776052
8302E7162141l014508l233758l085630k553614j829616j083025l88458K51459
8294D2224991P82874J149211J302844J385884J670131K253121K995613L821040
$$ plain form
8286 57585709 62450418 68915766 78069112 91600703 111619073 139770943 175763141 216217255
8278 216217255 255770913 289342495 312870534 324740547 328946038 334164512 348177982
8271 348177982 373440730 406166645 437354425 455402766 451135227 422385043 375136560
8264 375136560 320340661 268559412 225914487 193651313 170158923 152946425 139654003
8257 139654003 128425668 118045612 108049397 98627209 90206742 83010492 76943948 71685872
8249 71685872 66791354 61927041 57058261 52469901 48544312 45481473 43195429 41467970
8241 41467970 40052616 38779811 37637077 36743766 36245744 36209106 36645107 37641347 39408459
8232 39408459 42285972 46762476 53683112 64376101 80701992 104775769 137767462 177857145
$$ packed form
8286E7585709M864709O465348R153346J3531591K0018370K8151870L5992198M0454114
8278B16217255L9553658L3571582K3528039J1870013M205491N218474J4013470
8271C48177982K5262748L2725915L1187780J8048341m267539k8750184m7248483
8264C75136560n4795899n1781249m2644925l2263174k3492390j7212498j3292422
8257A39654003j1228335j0380056r996215r422188q420467p196250o066544n258076
8249G1685872m894518m864313m868780m588360l925589l062839k286044j727459
8241D1467970j415354j272805j142734q93311m98022l6638M36001R96240J767112
8232C9408459K877513M476504O920636J0692989J6325891K4073777L2991693M0089683
$$ plain form
8224 177857145 219248931 254154402 275586605 279260994 266146342 242070039 213775079
8217 213775079 185661521 159778729 137236787 118620927 103887232 92434334 83447582
8210 83447582 76218356 70266930 65252228 60895370 56901136 53019932 49138643 45237222
8202 45237222 41310962 37405609 33676640 30309932 27398605 24958085 22958549 21354397
8194 21354397 20036757 18907728 17883283 16891546 15902218 14921303 13990692 13137149 12385336
8185 12385336 11726438 11155328 10646788 10193395 9790667 9428113 9126239 8887673 8658723
8176 8658723 8370758 8048824 7756297 7522429 7318720 7104479 6850446 6580133 6354107 6224122
8166 6224122 6206564 6308728 6534685 6854719 7200574 7477518 7615681 7565867 7344289 6963788
$$ packed form
8224A77857145M1391786L4905471K1432203L674389j3114652k4076303k8294960
8217B13775079k8113558k5882792k2541942j8615860j4733695j1452898q986752
8210H3447582p229226n951426n014702m356858l994234l881204l881289l901421
8202D5237222l926260l905353l728969l366708k911327k440520j999536j604152
8194B1354397j317640j129029j024445r91737r89328r80915r30611q53543p51813
8185A2385336o58898n71110n08540m53393m02728l62554l01874k38566k28950
8176H658723k87965l21934k92527k33868k03709k14241k54033k70313k26026j29985
8166F224122j7558J02164K25957L20034L45855K76944J38163m9814k21578l80501
$$ plain form
8156 6963788 6462030 5902499 5351747 4869113 4496944 4217819 4007704 3833351 3681149 3544605
8146 3544605 3418464 3306648 3215796 3134927 3040816 2934509 2832912 2735499 2658300 2594078 2538280
8135 2538280 2478097 2407307 2351890 2302687 2262120 2248565 2245088 2254761 2253584 2232388 2204412 2154746
8123 2154746 2110946 2090390 2092943 2124041 2199289 2352314 2626019 3060547 3637766 4276255 4828546
8112 4828546 5060357 4905958 4469933 3922945 3419986 3052762 2819816 2697850 2634193 2587394
8102 2587394 2550268 2510782 2466482 2424361 2378749 2326699 2265328 2196022 2122507 2056041 2007130
8091 2007130 1965946 1918292 1892195 1871403 1845256 1824936 1807004 1803169 1815588 1830125 1841141 1841969
8079 1841969 1842120 1846642 1864808 1906624 1950627 2011724 2104617 2232436 2406457 2595202 2785272
$$ packed form
8156F963788n01758n59531n50752m82634l72169k79125k10115j74353j52202j36544
8146C544605j26141j11816r0852q0869r4111j06307j01597r7413p7199o4222n5798
8135B538280o0183p0790n5417m9203m0567j3555l477R673j177k1196k7976m9666
8123B154746m3800k0556K553L1098P5248J53025K73705M34528N77219O38489N52291
8112D828546K31811j54399m36025n46988n02959l67224k32946j21966o3657m6799
8102B587394l7126l9486m4300m2121m5612n2050o1371o9306p3515o6466m8911
8091B007130m1184m7654k6097k0792k6147k0320j7932l835J2419J4537J1016Q28
8079A841969J51M522J8166M1816M4003O1097R2893J27819J74021J88745J90070
$$ plain form
8068 2785272 2997623 3197657 3354923 3462577 3554571 3635586 3646320 3565111 3463141 3359157
8058 3359157 3239716 3103347 2956943 2830176 2734418 2656684 2600951 2561863 2516249 2447636 2362964
8047 2362964 2293143 2270187 2312155 2419984 2620183 2903826 3228405 3496804 3612468 3540018
8037 3540018 3305226 3010995 2729425 2506184 2367714 2288414 2245871 2194588 2132806 2077307
8027 2077307 2030415 1991609 1968904 1966583 1994437 2024903 2075010 2149868 2242892 2345905 2435072
8016 2435072 2516582 2594735 2667976 2739634 2828432 2929111 3007941 2988916 2821847 2571330 2329074
8005 2329074 2133406 1979319 1868389 1776068 1715058 1668551 1634615 1601082 1561690 1533775 1512959
7994 1512959 1524165 1565322 1648602 1783825 1953828 2125439 2234197 2251369 2199010 2140510 2121798
$$ packed form
8068B785272K12351K00034J57266J07654R1994Q1015J0734q1209j01970j03984
8058C359157j19441j36369j46404j26767r5758p7734n5733l9088m5614o8613q4672
8047B362964o9821k2956M1968J07829K00199K83643L24579K68399J15664p2450
8037C540018k34792k94231k81570k23241j38470p9300m2543n1283o1782n5499
8027B077307m6892l8806k2705k321K7854L0466N0107P4858R3024J03013Q9167
8016B435072Q1510P8153P3241P1658Q8798J00679P8830j9025j67069k50517k42256
8005B329074j95668j54087j10930r2321o1010m6507l3936l3533l9392k7915k0816
7994A512959J1206M1157Q3280J35223J70003J71611J08758J7172n2359n8500j8712
$$ plain form
7983 2121798 2171791 2256867 2309651 2271154 2147668 1993789 1852820 1737413 1644661 1577399 1530127
7972 1530127 1494969 1462760 1449768 1462990 1488322 1515824 1555993 1599910 1656381 1715433 1718954 1634630
7960 1634630 1493680 1345284 1229226 1149153 1102128 1071700 1045506 1017378 993437 974678 952551
7949 952551 931452 914655 908671 909244 916234 931607 951071 964594 981967 1018180 1075108 1166772
7937 1166772 1304713 1494530 1725227 1951826 2144892 2262449 2280461 2215180 2100593 2007074
7927 2007074 1987154 2072920 2271362 2529047 2751561 2818546 2682539 2385819 2041037 1729890
7917 1729890 1488151 1323215 1201287 1108048 1044031 988188 939697 902213 855579 807824 762197
7906 762197 733184 707310 692090 682953 669330 648271 626794 612711 611804 610287 605231 597504 589453
$$ packed form
7983B121798M9993Q5076N2784l8497j23486j53879j40969j15407r2752o7262m7272
7972A530127l5158l2209j2992J3222K5332K7502M0169M3917N6471N9052L521q4324
7960A634630j40950j48396j16058q0073m7025l0428k6194k8128k3941j8759k2127
7949I52551k1099j6797n984N73O990J5373J9464J3523J7373L6213N6928R1664
7937A166772J37941J89817K30697K26599J93066J17557J8012o5281j14587r3519
7927B007074j9920Q5766J98442K57685K22514O6985j36007k96720l44782l11147
7917A729890k41739j64936j21928r3239o4017n5843m8491l7484m6634m7755m5627
7906G62197k9013k5874j5220r137j3623k1059k1477j4083r07j517n056p727q051
$$ plain form
7893 589453 581883 568416 571335 581186 592546 604821 620159 635372 659181 700191 760097 846916
7881 846916 982285 1184085 1453520 1773513 2072469 2273715 2340840 2304307 2255374 2271846
7871 2271846 2380320 2563130 2729822 2766244 2631205 2348329 2013571 1706673 1458617 1273483
7861 1273483 1137066 1042820 974064 910359 856034 811777 757462 697107 646808 601843 571075
7850 571075 549888 524583 488505 466881 447491 428286 412812 409486 407703 399929 398661 398875 394967
7837 394967 382488 380855 388968 393889 393385 397996 415083 450465 505655 588358 721522 914799
7825 914799 1169801 1483681 1772110 1945647 1949351 1795789 1558027 1301107 1090735 932959
7815 932959 819707 739261 683148 632595 595869 565058 535097 498346 457559 423337 399702
$$ packed form
7893E89453p570j3467K919R851J1360J2275J5338J5213K3809M1010N9906Q6819
7881H46916J35369K01800K69435L19993K98956K01246O7125l6533m8933J6472
7871B271846J08474J82810J66692L6422j35039k82876l34758l06898k48056j85134
7861A273483j36417r4246o8756o3705n4325m4257n4315o0355n0299m4965l0768
7850E71075k1187k5305l6078k1624j9390j9205j5474l326j783p774j268K14l908
7837C94967j2479j633Q113M921n04M611J7087L5382N5190Q2703J33164J93277
7825I14799K55002L13880K88429J73537L704j53562k37762k56920k10372j57776
7815I32959j13252q0446n6113n0553l6726l0811k9961l6751m0787l4222k3635
$$ plain form
7804 399702 380871 364324 343261 314602 282163 269126 270723 269384 261739 252504 252431 250072 230185
7791 230185 212467 205738 208778 211358 207031 204200 192792 184210 180287 189890 197758 193517 194796 186609
7777 186609 180515 177508 178539 185190 182021 178159 175652 178660 176033 174211 171751 177499 178027 178099 171776
7762 171776 170614 172490 168752 159858 148856 148178 147895 147587 148106 151922 150472 140234 137566 131720 138927
7747 138927 144084 139026 140164 149079 156210 156723 155289 152646 157413 165175 164063 151402 135794 131133
7733 131133 143777 155011 147078 135370 129633 130998 133408 134487 141464 143137 133905 136449 137985 139433
7719 139433 144711 145161 146571 150094 147307 132177 118825 115475 120889 117842 118680 124013 130257 137765
7705 137765 143347 137984 127755 135962 135099 117033 116776 124672 127688 121784 126856 127802 128272 127953 125038
$$ packed form
7804C99702j8831j6547k1063k8659l2439j3037J597j339p645r235p3k359j9887
7791B30185j7718o729L040K580m327k831j1408q582l923R603P868m241J279q187
7777A86609o094l007J031O651l169l862k507L008k627j822k460N748N28P2o323
7762A71776j162J876l738q894j1002o78k83l08N19L816j450j0238k668n846P207
7747A38927N157n058J138Q915P131N13j434k643M767P762j112j2661j5608m661
7733A31133J2644J1234p933j1708n737J365K410J079O977J673r232K544J536J448
7719A39433N278M50J410L523k787j5130j3352l350N414l047Q38N333O244P508
7705A37765N582n363j0229Q207q63j8066k57P896L016n904N072R46M70l19k915
$$ plain form
7690 125038 125261 125487 118878 115729 120341 120678 117660 114421 111409 112408 114174 117009 123632 132566 135141
7675 135141 132404 128597 124071 129692 141307 150805 151976 150683 140874 129358 124562 125916 123394 118463
7661 118463 114260 111631 115634 113733 116072 112944 108307 101725 98249 102249 107763 115009 117663 122838
7647 122838 110320 105963 107998 112515 111532 111456 117561 113613 108864 118016 120894 119853 115403 112085 112132
7632 112132 114807 105123 97115 96191 94920 99388 95588 97496 100016 97031 95434 87486 80302 85557 101197
7617 101197 108592 109863 99756 94684 92410 85612 84287 88419 96578 96476 94384 88153 75901 73996
7603 73996 70178 72915 69662 70895 76996 82027 80433 82123 83988 79176 75769 75212 80964 91798 88499
7588 88499 91633 85939 77423 76125 79307 82965 77050 77479 70634 66738 70330 71880 77476 82547 84893
$$ packed form
7690A25038K23K26o609l149M612L37l018l239l012R99J766K835O623Q934K575
7675A35141k737l807m526N621J1615R498J171j293r809j1516m796J354k522m931
7661A18463m203k629M003j901K339l128m637o582l476M000N514P246K654N175
7647A22838j2518m357K035M517r83p6O105l948m749R152K878j041m450l318M7
7632A12132K675r684q008r24j271M468l800J908K520k985j597p948p184N255J5640
7617A01197P395J271j0107n072k274o798j325M132Q159j02k092o231j2252j905
7603G3996l818K737l253J233O101N031j594J690J865m812l407n57N752J0834l299
7588H8499L134n694q516j298L182L658n915M29o845l896L592J550N596N071K346
$$ plain form
7573 84893 80663 79660 64578 63980 69749 68824 65452 68165 66558 69111 65756 63212 64313 63489 67948
7558 67948 65937 72806 80105 82421 76812 67293 66492 62391 51979 55214 56147 63790 70271 69776 71779
7543 71779 78165 75681 69491 61504 59757 65470 69467 75203 73927 68396 65190 57767 50714 48337 54959
7528 54959 62083 64769 72121 72562 68906 63412 60565 63616 58721 51927 53865 51071 57374 64513 61074
7513 61074 56016 52228 44433 46150 52881 54247 54440 56180 61448 65461 65731 63439 65559 62729 54288
7498 54288 48474 55518 53079 53878 56283 57713 57810 61009 60165 54927 54132 55343 51464 53293 58104 52288
7482 52288 50813 56915 56692 57433 55484 50492 45687 48549 44485 37209 28062 37676 40844 42166 45986
7467 45986 49680 45755 38322 35418 38799 45602 52844 49909 43784 39461 33626 34756 38517 38622 34205
$$ packed form
7573H4893m230j003j5082n98N769r25l372K713j607K553l355k544J101q24M459
7558F7948k011O869P299K316n609r519q01m101j0412L235R33P643O481m95K003
7543G1779O386k484o190p987j747N713L997N736j276n531l206p423p053k377O622
7528E4959P124K686P352M41l656n494k847L051m895o794J938k794O303P139l439
7513F1074n058l788p795J717O731J366J93J740N268M013K70k292K120k830q441
7498E4288n814P044k439P99K405J430R7L199q44n238p95J211l879J829M811n816
7482E2288j475O102k23P41j949m992m805K862m064p276r147R614L168J322L820
7467D5986L694l925p433k904L381O803P242k935o125m323n835J130L761J05m417
$$ plain form
7452 34205 40880 43487 50556 54496 48482 46656 42153 40183 37157 32841 41067 47524 49767 43665 44299
7437 44299 50836 52355 48147 47151 42096 43370 43012 44547 46247 45886 42725 41033 41728 42278 40273 42993
7421 42993 41399 42799 42047 46367 45565 39716 35081 31550 33558 42052 42799 43966 46152 47891 44118
7406 44118 28411 25676 26488 27434 34625 35891 30452 28255 29119 30055 35003 35612 40260 43981 41863 41521
7390 41521 37948 32066 30478 31778 30758 30486 21414 16771 25445 31085 27247 28878 34470 34908 25053
7375 25053 28896 30421 31845 33775 37334 39699 43517 40951 33387 26753 29266 35354 39145 40768 35455
7360 35455 31961 34294 31489 26368 31519 28008 25241 28484 32991 34016 39524 39038 33162 32359 31199
7345 31199 25119 23071 20562 25137 34424 32393 25816 26970 27362 29714 32611 36273 31364 23104 31333
$$ packed form
7452C4205O675K607P069L940o014j826m503j970l026m316Q226O457K243o102O34
7437D4299O537J519m208r96n055J274l58J535J700l61l161j692O95N50k005K720
7421D2993j594J400p52M320q02n849m635l531K008Q494P47J167K186J739l773
7406D4118j5707k735Q12R46P191J266n439k197Q64R36M948O09M648L721k118l42
7390D1521l573n882j588J300j020k72r072m643Q674N640l838J631N592M38r855
7375B5053L843J525J424J930L559K365L818k566p564o634K513O088L791J623n313
7360C5455l494K333k805n121N151l511k767L243M507J025N508m86n876q03j160
7345C1199o080k048k509M575R287k031o577J154L92K352K897L662m909q260Q229
$$ plain form
7330 31333 34851 36426 27541 18428 21013 24574 19285 10553 12527 19488 20358 29962 39340 37803 39195
7315 39195 34529 30085 24421 23113 24233 30583 32805 29586 25830 26015 27898 19500 23090 18469 17817
7300 17817 22647 24737 23216 22996 19200 17333 15165 16912 18943 21255 22735 24222 25482 23034 19467
7285 19467 20525 19941 13322 14753 14633 18594 22094 24193 25946 25246 27464 22377 15515 10809 7610
7270 7610 9056 16072 17184 5817 6547 12849 15615 17742 21826 28018 29380 19249 10472 13513 14969
7255 14969 17115 20202 27178 25716 21837 24878 27998 33559 31531 25626 25578 24334 23794 22015 25895
7240 25895 19941 19050 13616 11988 13213 22318 23995 19127 16647 13466 15691 22783 25399 24890 28220
7225 28220 24474 18334 23897 27285 24158 19974 23320 26452 31648 30454 37924 42397 52179 64138
$$ packed form
7330C1333L518J575q885r113K585L561n289q732J974O961Q70R604R378j537J392
7315C9195m666m444n664j308J120O350K222l219l756J85J883q398L590m621o52
7300A7817M830K090j521k20l796j867k168J747K031K312J480J487J260k448l567
7285A9467J058n84o619J431j20L961L500K099J753p00K218n087o862m706l199
7270G610J446P016J112j1367P30O302K766K127M084O192J362j0131q777L041J456
7255A4969K146L087O976j462l879L041L120N561k028n905m8j244n40j779L880
7240B5895n954q91n434j628J225R105J677m868k480l181K225P092K616n09L330
7225B8220l746o140N563L388l127m184L346L132N196j194P470M473R782J1959
$$ plain form
7211 64138 61099 46116 45916 47710 43756 44076 46183 51016 55085 55727 63559 78633 89378 103921
7197 103921 127716 158939 221020 330935 508290 739371 915883 887514 710670 518007
7187 518007 377489 289437 235190 215423 204868 201365 201368 215158 224147 227810 224252 225057 229231 227644
7173 227644 213547 200063 182873 168522 152080 127998 109225 86324 73502 71302 59460 53625
7161 53625 56114 55885 48587 37481 42696 44802 43965 40214 39079 38743 28713 25984 30118 29445 29263
7146 29263 24868 24875 30810 36044 41601 43043 31987 25457 24459 23678 23703 21996 16853 17121 17233 19669 15283
7129 15283 16468 24996 28828 32296 33479 37081 33540 36388 25152 24170 24342 17081 13618 4509 3817
7114 3817 3427 2255 9728 14192 9562 9575 10719 14232 26887 27804 27508 22748 20728 22110 28288 28531
$$ packed form
7211F4138l039j4983k00J794l954L20K107M833M069O42P832J5074J0745J4543
7197A03921K3795L1223O2081J09915J77355K31081J76512k8369j76844j92663
7187E18007j40518q8052n4247j9767j0555l503LJ3790Q989L663l558Q05M174j587
7173B27644j4097j3484j7190j4351j6442k4082j8773k2901j2822k200j1842n835
7161E3625K489k29p298j1106N215K106q37l751j135l36j0030k729M134o73j82
7146B9263m395PN935N234N557J442j1056o530r98p81K5j707n143K68J12K436m386
7129A5283J185Q528L832L468J183L602l541K848j1236r82J72p261l463r109o92
7114C817l90j172P473M464m630J3J144L513J2655R17k96m760k020J382O178K43
$$ plain form
7098 28531 24957 16713 10653 10699 16844 15669 10307 13911 21083 19180 20766 21244 27352 24150 15532
7083 15532 11319 8561 203 -684 3206 16899 20367 20109 17688 24603 32038 35648 33385 27196 31219
7068 31219 29886 31458 28410 25368 22802 25078 24300 15853 13499 19000 21845 23091 22803 18711 22394
7053 22394 24480 11085 5268 10719 6667 6189 11301 13503 13658 17670 19282 21182 19583 16901 14476
7038 14476 15881 14481 7929 3766 6642 9651 3332 3389 10976 13786 15337 21355 22349 12495 2733
7023 2733 4026 8465 3553 1534 5354 -171 4443 9068 10922 16654 19036 15801 14378 15891 15153
7008 15153 7631 1254 -896 7597 15994 20258 17320 13070 6386 6575 260 -1594 -1561 6167 12729
6993 12729 13958 23226 29993 28261 22536 14195 14473 27089 27138 -29 -17867 -5245 15684 33771
$$ packed form
7098B8531l574q244o060M6O145j175n362L604P172j903J586M78O108l202q618
7083A5532m213k758q358q87L890J3693L468k58k421O915P435L610k263o189M023
7068C1219j333J572l048l042k566K276p78q447k354N501K845J246k88m092L683
7053B2394K086j3395n817N451m052m78N112K202J55M012J612J900j599k682k425
7038A4476J405j400o552m163K876L009o319N7P587K810J551O018R94r854r762
7023B733J293M439m912k019L820n525M614M625J854N732K382l235j423J513p38
7008A5153p522o377k150Q493Q397M264k938m250o684J89o315j854L3P728O562
6993A2729J229R268O767j732n725q341K78J2616M9k7167j7838J2622K0929J8087
$$ plain form
6979 33771 34038 22995 14173 12042 9837 7584 -2859 4727 14464 17180 20513 17441 14464 9650
6965 9650 9780 13201 11007 16052 17733 15855 20913 30711 35909 29336 20726 11376 9289 7618 7706 7548
6949 7548 13973 15870 17559 18590 18287 17195 14910 12314 14047 16536 18345 21192 25988 24151 13350
6934 13350 1255 -1921 2311 11827 9273 -3044 -6424 8859 23679 19512 9775 6302 14046 19707
6920 19707 15239 4743 2584 9636 15022 14789 17173 24302 25211 17010 8840 1798 1750 9035 4845
6905 4845 12705 22595 20166 15856 5947 3640 3245 2006 -664 -1760 -3323 -4866 -9164 -7271 -6086
6890 -6086 -2424 11220 21256 26788 25286 26321 23410 19173 7458 -1091 -3987 -10040 -13468 -12338
$$ packed form
6979C3771K67j1043q822k131k205k253j0443P586R737K716L333l072k977m814
6965I650J30L421k194N045J681j878N058R798N198o573q610r350k087j671Q8j58
6949G548O425J897J689J031l03j092k285k596J733K489J809K847M796j837j0801
6934A3350j2095l176M232R516k554j2317l380J5283J4820m167r737l473P744N661
6920A9707m468j0496k159P052N386k33K384P129R09q201q170p042m8P285m190
6905D845P860R890k429m310r909k307l95j239k670j096j563j543m298J893J185
6890f086L662J3644J0036N532j502J035k911m237j1715q549k896o053l428J130
$$ [...]
##END NTUPLES=NMR SPECTRUM
##END=
