##TITLE=Analysis number 327176
Compound Code mo 01204
Project Code adrs
Chemist Name aci
##JCAMPDX= 6.0         $$ Bruker NMR JCAMP-DX V2.0
##DATA TYPE= NMR SPECTRUM
##DATA CLASS= NTUPLES
##ORIGIN= Bruker BioSpin GmbH
##OWNER= nmr
$$ XWIN-NMR		Version 3.5
$$ Tue Mar 13 14:00:20 2007 GMT Standard Time (UT+0h)  MAYBRIDGE\nmr@NMR_250MHZ
##.OBSERVE FREQUENCY= 250.131544655141
##.OBSERVE NUCLEUS= ^1H
##.ACQUISITION MODE= SIMULTANEOUS (DQD)
##.ACQUISITION SCHEME= undefined
##.AVERAGES= 16
##.DIGITISER RES= 18
##SPECTROMETER/DATA SYSTEM= dpx250
##.PULSE SEQUENCE= zg30
##.SOLVENT NAME= CDCl3
##.SHIFT REFERENCE= (INTERNAL, CDCl3, 0, 16.522)
##AUDIT TRAIL= $$ (NUMBER, WHEN, WHO, WHERE, WHAT)
$$ ##TITLE= Audit trail, XWIN-NMR		Version 3.5
$$ ##JCAMPDX= 5.01
$$ ##ORIGIN= Bruker BioSpin GmbH
$$ ##OWNER= nmr
$$ C:\u/data/dgb/nmr/ADRS/810/pdata/1/auditp.txt
$$ ##AUDIT TRAIL=  $$ (NUMBER, WHEN, WHO, WHERE, WHAT)
(   1,<2007-03-13 13:59:56.70 +000>,<MAYBRIDGE\nmr>,<NMR_250MHZ>,
      <created by zg, POWCHK disabled, PULCHK disabled
       configuration hash MD5:
       49 4B E0 1D 92 C2 6B 37 9F E6 65 BC 52 41 86 1D
       data hash MD5: 64K
       E3 77 C2 B4 3D E6 63 6A EC F2 94 2D 5E 9B 0B 9F>)
(   2,<2007-03-13 14:00:13.15 +000>,<MAYBRIDGE\nmr>,<NMR_250MHZ>,
      <Start of raw data processing
       ef LB = 0.3 FT_mod = 6 PKNL = 1 SI = 32K 
       data hash MD5: 32K
       A0 DD 8B C6 7C EB 12 70 05 42 A5 EB 96 D8 2E 0E>)
(   3,<2007-03-13 14:00:14.95 +000>,<MAYBRIDGE\nmr>,<NMR_250MHZ>,
      <apk 
       data hash MD5: 32K
       99 79 8A 19 C4 69 1A A7 0F EF 89 12 05 0C 3F 22>)
(   4,<2007-03-13 14:00:15.79 +000>,<MAYBRIDGE\nmr>,<NMR_250MHZ>,
      <abs ABSG = 5 
       data hash MD5: 32K
       C6 05 58 55 C6 CA 5A 91 91 B2 C8 3E A3 F9 50 84>)
$$ ##END=
$$ 
$$ hash MD5
$$ 58 24 94 1D 5D 74 56 8E E3 30 03 45 0F 97 FE B7
##$RELAX= 
##$RELAX= 
##$RELAX= 
##$RELAX= 
##$RELAX= 
##$RELAX= 
##$RELAX= 
$$ Bruker specific parameters
$$ --------------------------
##$DU= <C:\u>
##$EXPNO= 810
##$NAME= <ADRS>
##$PROCNO= 1
##$TYPE= <nmr>
##$USER= <dgb>
##$AMP= (0..31)
100 100 100 100 100 100 100 100 100 100 100 100 100 100 100 100 100 100 
100 100 100 100 100 100 100 100 100 100 100 100 100 100 
##$AQSEQ= 0
##$AQ_mod= 3
##$AUNM= <au_zg>
##$AUTOPOS= <30 >
##$BF1= 250.13
##$BF2= 250.13
##$BF3= 250.13
##$BF4= 250.13
##$BF5= 500.13
##$BF6= 500.13
##$BF7= 500.13
##$BF8= 500.13
##$BYTORDA= 1
##$CFDGTYP= 0
##$CFRGTYP= 5
##$CHEMSTR= <none>
##$CNST= (0..31)
1 1 145 1 1 1 1 1 1 1 1 1 1 1 1 1 1 1 1 1 1 1 1 1 1 1 1 1 1 1 1 1 
##$CPDPRG= <>
##$CPDPRG1= <>
##$CPDPRG2= <>
##$CPDPRG3= <>
##$CPDPRG4= <mlev>
##$CPDPRG5= <mlev>
##$CPDPRG6= <mlev>
##$CPDPRG7= <mlev>
##$CPDPRG8= <mlev>
##$CPDPRGB= <>
##$CPDPRGT= <>
##$D= (0..31)
0 1 0 0 0 0 0 0 0 0.06 0 0 0 0 0 0 0.0002 0 0 0 0 0 0 0 0 0 0 0 0 0 0 
0 
##$DATE= 1173794394
##$DBL= (0..7)
120 120 120 120 120 120 120 120 
##$DBP= (0..7)
150 150 150 150 150 150 150 150 
##$DBP07= 0
##$DBPNAM0= <>
##$DBPNAM1= <>
##$DBPNAM2= <>
##$DBPNAM3= <>
$$ [...]
##$SUBNAM7= <"">
##$SUBNAM8= <"">
##$SUBNAM9= <"">
##$SW= 20.6930455092707
##$SWIBOX= (0..15)
0 0 3 0 0 0 0 0 0 0 0 0 0 0 0 0 
##$SW_h= 5175.983436853
##$TD= 65536
##$TD0= 1
##$TE= 683.16
##$TE2= 300
##$TE3= 300
##$TEG= 300
##$TL= (0..7)
0 120 120 120 120 120 120 120 
##$TP= (0..7)
150 150 150 150 150 150 150 150 
##$TP07= 0
##$TPNAME0= <>
##$TPNAME1= <>
##$TPNAME2= <>
##$TPNAME3= <>
##$TPNAME4= <>
##$TPNAME5= <>
##$TPNAME6= <>
##$TPNAME7= <>
##$TPOAL= (0..7)
0.5 0.5 0.5 0.5 0.5 0.5 0.5 0.5 
##$TPOFFS= (0..7)
0 0 0 0 0 0 0 0 
##$TUNHIN= 0
##$TUNHOUT= 0
##$TUNXOUT= 0
##$USERA1= <user>
##$USERA2= <user>
##$USERA3= <user>
##$USERA4= <user>
##$USERA5= <user>
##$V9= 5
##$VALIST= <valist>
##$VCLIST= <CCCCCCCCCCCCCCC>
##$VD= 0
##$VDLIST= <DDDDDDDDDDDDDDD>
##$VPLIST= <PPPPPPPPPPPPPPP>
##$VTLIST= <TTTTTTTTTTTTTTT>
##$WBST= 1024
##$WBSW= 4
##$XGAIN= (0..3)
0 0 0 0 
##$XL= 0
##$YL= 0
##$YMAX_a= 202162
##$YMIN_a= -266138
##$ZGOPTNS= <>
##$ZL1= 120
##$ZL2= 120
##$ZL3= 120
##$ZL4= 120
##$ABSF1= 16.522
##$ABSF2= -4.171173
##$ABSG= 5
##$ABSL= 3
##$ALPHA= 0
##$AQORDER= 0
##$ASSFAC= 0
##$ASSFACI= 0
##$ASSFACX= 0
##$ASSWID= 0
##$AUNMP= <proc_1d>
##$AZFE= 0.1
##$AZFW= 0.1
##$BCFW= 0
##$BC_mod= 0
##$BYTORDP= 0
##$COROFFS= 0
##$CY= 12.5
##$DATMOD= 1
##$DC= 0
##$DFILT= <>
##$DTYPP= 0
##$F1P= 14.0000005364418
##$F2P= -0.99999901652339
##$FCOR= 0.5
##$FTSIZE= 32768
##$FT_mod= 6
##$GAMMA= 0
##$GB= 0
##$INTBC= 1
##$INTSCL= 1
##$ISEN= 128
##$LB= 0.3
##$LEV0= 0
##$LPBIN= 0
##$MAXI= 10000
##$MC2= 0
##$MEAN= 0
##$ME_mod= 0
##$MI= 0
##$NCOEF= 0
##$NC_proc= -5
##$NLEV= 6
##$NOISF1= 0
##$NOISF2= 0
##$NSP= 0
##$NTH_PI= 0
##$NZP= 0
##$OFFSET= 16.522
##$PC= 1
##$PHC0= 232.3607
##$PHC1= 11.82717
##$PH_mod= 1
##$PKNL= yes
##$PPARMOD= 0
##$PSCAL= 4
##$PSIGN= 0
##$REVERSE= no
##$SF= 250.13
##$SI= 32768
##$SIGF1= 0
##$SIGF2= 0
##$SINO= 400
##$SIOLD= 32768
##$SREGLST= <1H.CDCl3>
##$SSB= 0
##$STSI= 32768
##$STSR= 0
##$SW_p= 5175.98343685301
##$SYMM= 0
##$S_DEV= 0
##$TDeff= 65536
##$TDoff= 0
##$TI= <Analysis number 999999
Compound Code 99
Book Reference 9
Project Code 9>
##$TILT= no
##$TM1= 0
##$TM2= 0
##$TOPLEV= 0
##$USERP1= <user>
##$USERP2= <user>
##$USERP3= <user>
##$USERP4= <user>
##$USERP5= <user>
##$WDW= 1
##$XDIM= 32768
##$YMAX_p= 452527935
##$YMIN_p= -951870
$$ End of Bruker specific parameters
$$ ---------------------------------
##NTUPLES= NMR SPECTRUM
##VAR_NAME=  FREQUENCY,     SPECTRUM/REAL,   SPECTRUM/IMAG
##SYMBOL=    X,             R,               I
##VAR_TYPE=  INDEPENDENT,   DEPENDENT,       DEPENDENT
##VAR_FORM=  AFFN,          ASDF,            ASDF
##VAR_DIM=   32768,         32768,           32768
##UNITS=     HZ,            ARBITRARY UNITS, ARBITRARY UNITS
##FACTOR=    0.157963299565203, 1,           1
##FIRST=     4132.6476996994, 0,             0
##LAST=      -1043.33573715361, 0,           0
##MIN=       -1043.33573715361, -951870,     0
##MAX=       4132.6476996994, 452527935,     0
$$ Real data points
##PAGE= N=1
##DATA TABLE= (X++(R..R)), XYDATA
$$ [...]
$$ plain form
23116 188899 27972 -85828 -42989 8433 63103 13333 29049 84818 -65502 -162666 -69425
23105 -69425 -5357 228753 7080 63166 10544 -241725 -45536 58671 -50844 -141050
23095 -141050 -277434 -182694 -67655 -243944 -424670 -404062 -23854 -24425 -69009 185653 330250
23084 330250 267253 272969 168478 -104816 -146617 117117 257987 258597 205623 54100 -155464
23073 -155464 -75123 115902 308244 323863 235069 30956 -319542 -223223 -415811 -610366
23063 -610366 -316914 -306975 -431949 -478749 -273725 -258566 -157619 -136531 -183493 -288558 -290493
23052 -290493 -175194 56491 -57380 41710 95148 10600 -128669 2128 13173 -88788
23042 -88788 -124752 -185877 -298833 -164093 -246317 -299854 -142276 -173374 -253875 -27649 88245
$$ packed form
23116A88899j60927j13800M2839N1422N4670m9770J5716N5769j50320r7164R3241
23105f9425O4068K34110k21673N6086n2622k52269J96189J04207j09515r0206
23095a41050j36384R4740J15039j76289j80726K0608L80208n71m4584K54662J44597
23084C30250o2997N716j04491k73294m1801K63734J40870O10n2974j51523k09564
23073a55464Q0341J91025J92342J5619q8794k04113l50498R6319j92588j94555
23063f10366K93452R939j24974m6800K05024J5159J00947K1088m6962j05065j935
23052b90493J15299K31685j13871R9090N3438q4548j39269J30797J1045j01961
23042h8788l5964o1125j12956J34740q2224n3537J57578l1098q0501K26226J15894
$$ plain form
23031 88245 -42096 -233694 -327918 -423817 -408889 -180385 -10489 30301 56750 97096 134345
23020 134345 173322 92650 -39004 72364 219628 90723 83100 225944 43903 -120665
23010 -120665 -314940 -479464 -590502 -531463 -270941 -131218 -313036 -281622 -218111 -83541
23000 -83541 -320194 -459646 -484218 -470368 -271368 -24068 -18224 3370 187138 36418 -188271
22989 -188271 -104727 -201330 -11516 58011 -184938 -180362 -246117 -310822 -331005 -239529 -7337
22978 -7337 -91009 171861 186154 -86975 -206693 -352258 -464657 -380461 -75616 -132497 -136655
22967 -136655 -69956 -61825 -4167 91697 33313 -144076 -117780 41335 210311 13842 -267056
22956 -267056 -263945 -189826 -143308 -239377 -184607 -105640 -36759 1707 -82151 62025 160772
$$ packed form
23031H8245j30341j91598r4224r5899J4928K28504J69896M0790K6449M0346L7249
23020A34345L8977q0672j31654J11368J47264j28905p623J42844j82041j64568
23010a20665j94275j64524j11038N9039K60522J39723j81818L1414O3511J34570
23000h3541k36653j39452k4572J3850J99000K47300N844K1594J83768j50720k24689
22989a88271Q3544r6603J89814O9527k42949M576o5755o4705k0183R1476K32192
22978g337q3672K62870J4293k73129j19718j45565j12399Q4196L04845n6881m158
22967a36655O6699Q131N7658R5864n8384j77389K6296J59115J68976j96469k80898
22956b67056L111P4119M6518r6069N4770P8967O8881L8466q3858J44176R8747
$$ plain form
22945 160772 10088 38336 108695 207081 134231 111691 1961 63438 308872 239818 140739
22934 140739 187857 145183 166488 -189509 -283152 -155523 -174225 -398104 -391336 -126517 19804
22923 19804 59388 -62361 283893 536771 449297 221008 -3186 -67727 -23211 -81583 -93871
22912 -93871 -49653 38649 49278 -183288 -374046 -149392 50451 115875 4939 -135248
22902 -135248 -559976 -520417 -231682 -8337 214558 223503 102445 -42410 109732 184036
22892 184036 -20091 -214139 -209745 -195196 -59215 82130 -51125 65739 10096 -87038
22882 -87038 1685 -118732 -90406 -11299 -66804 -252869 -260246 -39666 67805 -52820 -55077
22871 -55077 -32152 -80906 5053 166676 166002 -140046 -249171 -391428 -529334 -360568 -45170
$$ packed form
22945A60772j50684K8248P0359R8386p2850k2540j09730O1477K45434o9054r9079
22934A40739M7118m2674K1305l55997r3643J27629j8702k23879O768K64819J46321
22923A9804L9584j21749L46254K52878q7474k28289k24194o4541M4516n8372j2288
22912i3871M4218Q8302J0629k32566j90758K24654J99843O5424j10936j40187
22902a35248m24728L9559K88735K23345K22895Q945j21058j44855J52142P4304
22892A84036k04127j94048M394J4549J35981J41345j33255J16864n5643r7134
22882h7038Q8723j20417K8326P9107n5505j86065p377K20580J07471j20625k257
22871e5077K2925m8754Q5959J61623o74l06048j09125j42257j37906J68766L15398
$$ plain form
22860 -45170 -64472 -189842 -143853 47969 263607 241786 276062 182667 -91321 -218891 -101575
22849 -101575 105083 94029 33698 -178064 11970 113531 -118057 53491 47845 52580 115485
22838 115485 127939 50683 252368 92861 -165499 -209039 -154800 64955 126465 101836 240318
22827 240318 361302 164789 76921 133628 176928 235819 241604 172110 22684 79327 139266
22816 139266 -83415 -212875 -390738 -123606 -79468 -286311 -177285 -24317 -180252 205454
22806 205454 305734 248705 222537 233899 58748 -124698 -15833 96340 68819 65069 202002
22795 202002 264265 -32102 31890 -9573 30708 -54541 -27239 48762 -55660 -188511 22553
22784 22553 102374 72806 159920 180817 76918 -109957 -114184 39314 271019 525900 561726
$$ packed form
22860d5170j9302j25370M5989J91822K15638k1821L4276r3395k73988j27570J17316
22849a01575K06658j1054o0331k11762J90034J01561k31588J71548n646M735O2905
22838A15485J2454p7256K01685j59507k58360m3540N4239K19755O1510k4629J38482
22827B40318J20984j96513q7868N6707M3300N8891N785o9494j49426N6643N9939
22816A39266k22681j29460j77863K67132M4138k06843J09026J52968j55935L85706
22806B05454J00280n7029k6168J1362j75151j83446J08865J12173k7521l750J36933
22795B02002O2263k96367O3992m1463M0281q5249K7302P6001j04422j32851K11064
22784B2553P9821k9568Q7114K0897j03899j86875m227J53498K31705K54881L5826
$$ plain form
22773 561726 241311 -15171 68386 124657 50703 245365 159469 -66378 119487 22853
22763 22853 -37240 -148779 -444913 -509437 -516506 -543118 -111744 3180 -12723 -136830 -305972
22752 -305972 -459046 -341923 -446999 -502965 -507521 -447530 -313641 -509000 -512123 -273830 -121419
22741 -121419 -335296 -224012 -322076 -336486 -288977 -112197 -116736 -33211 331106 519764 242901
22730 242901 25940 -173468 -239992 -104077 -13577 -55066 -199622 -159502 -87043 -288234
22720 -288234 -303882 -246482 -217559 -192210 -149632 -257776 -219100 7193 54058 101498 -94938
22709 -94938 -117964 -97314 -212785 -89222 -42193 -108507 -325164 -286909 -33612 65337 30556
22698 30556 49477 -222710 -246258 -209958 -154247 -203372 -92968 -53400 -13060 152275 427222
$$ packed form
22773E61726l20415k56482Q3557N6271p3954J94662q5896k25847J85865r6634
22763B2853o0093j11539k96134o4524p069k6612M31374J14924j5903j24107j69142
22752c05972j53074J17123j05076n5966m556N9991J33889j95359l123K38293J52411
22741a21419k13877J11284r8064j4410M7509J76780m539Q3525L64317J88658k76863
22730B42901k16961j99408o6524J35915R0500m1489j44556M0120P2459k01191
22720b88234j5648N7400K8923K5349M2578j08144L8676K26293M6865M7440j96436
22709i4938k3026K0650j15471J23563M7029o6314k16657L8255K53297R8949l4781
22698C0556J8921k72187k3548L6300N5711m9125J10404L9568M0340J65335K74947
$$ plain form
22687 427222 617463 388725 46976 64839 49490 165863 243103 223237 91193 95185 -39132
22676 -39132 -50700 -162852 -225800 -77190 -37527 121663 93493 -155261 -358601 -250537
22666 -250537 55485 208874 227321 55745 8103 -126939 -301477 -353371 -327797 -68187
22656 -68187 212381 230153 238559 247342 77832 -38552 -172717 -106640 38423 138919 262210
22645 262210 91396 -152436 -145252 -45899 26532 15002 3014 119606 308008 384573 367358
22634 367358 288794 350542 314971 55060 -133310 -92988 -162214 -34330 -45615 -192623 -198006
22623 -198006 -4998 -86180 71469 166008 143285 175784 83444 -241384 -290412 -10148 46488
22612 46488 -129698 -170623 -104019 -158172 -212233 -140514 -87173 7130 45811 177870 124114
$$ packed form
22687D27222J90241k28738l41749J7863j5349J16373P7240j9866j32044L992j34317
22676c9132j1568j12152o2948J48610L9663J59190k8170k48754k03340J08064
22666b50537L06022J53389J8447j71576m7642j35042j74538n1894K5574K59610
22656f8187K80568J7772Q406Q783j69510j16384j34165O6077J45063J00496J23291
22645B62210j70814k43832P184R9353P2431j1530j1988J16592J88402P6565j7215
22634C67358p8564O1748l5571k59911j88370M0322o9226J27884j1285j47008n383
22623a98006J93008q1182J57649R4539k2723L2499r2340l24828m9028K80264N6636
22612D6488j76186m0925O6604n4153n4061P1719N3341R4303L8681J32059n3756
$$ plain form
22601 124114 100078 205643 399002 435996 334771 80920 -164156 -211181 -84974 101790
22591 101790 73761 150524 -123146 -274668 -194186 -352855 -380435 -213957 -161709 -267774
22581 -267774 -289345 -210559 -2623 49367 865 129898 -83596 -74620 -125916 -281710 -98518
22570 -98518 230855 77538 -51481 -269407 -24872 -247715 -472993 -136173 -26111 -38737
22560 -38737 21951 172619 162373 69833 181344 6254 -168270 -193667 -162244 -67714 84850
22549 84850 174952 267930 330055 347410 217536 230881 338634 286873 64132 -160035 -268532
22538 -268532 -211736 21536 55124 64115 -26483 3093 73766 -72799 -287429 -138849 -291468
22527 -291468 -77614 -187953 -65779 119949 72519 214630 549761 626020 436326 452062
$$ packed form
22601A24114k4036J05565J93359L6994j01225k53851k45076m7025J26207J86764
22591A01790k8029P6763k73670j51522Q0482j58669k7580J66478N2248j06065
22581b67774k1571P8786K07936N1990m8502J29033k13494Q976n1296j55794J83192
22570i8518L29373j53317j29019k17926K44535k22843k25278L36820J10062j2626
22560c8737O0688J50668j0246r2540J11511j75090j74524k5397L1423R4530J52564
22549H4850R0102R2978O2125J7355j29874J3345J07753n1761k22741k24167j08497
22538b68532N6796K33272L3588Q991r0598K9576P0673j46565k14630J48580j52619
22527b91468K13854j10339J22174J85728m7430J42111L35131P6259j89694J5736
$$ plain form
22517 452062 429447 376192 333305 116077 -74352 -108792 -48234 -38579 -70675 -857 174498
22506 174498 -38378 -58990 210914 167839 32492 129546 69364 -99933 -1049 153680
22496 153680 178576 173241 129330 167725 -86103 -414184 -512691 -57680 245777 388713 402379
22485 402379 173143 -144868 -286435 -319700 -121045 -140926 -165278 -235093 -147897 259173
22475 259173 237423 -102783 -288214 -267584 -70887 181788 383596 350157 254797 130699
22465 130699 -117641 -121451 -120721 -47778 225476 222457 -15484 320841 277739 199958 55538
22454 55538 -50990 135390 266450 192416 132597 154052 392568 537760 466141 200865
22444 200865 -85723 -284683 -326350 10049 253933 170371 85174 151823 337260 264145
$$ packed form
22517D52062k2615n3255m2887k17228j90429l4440O0558R655l2096O9818J75355
22506A74498k12876k0612K69904m3075j35347R7054o0182j69297R8884J54729
22496A53680K4896n335m3911L8395k53828l28081r8507M55011L03457J42936J3666
22485D02379k29236l18011j41567l3265J98655j9881k4352o9815Q7196M07070
22475B59173k1750l40206j85431K0630J96697K52675K01808l3439r5360j24098
22465A30699k48340l810P30P2943K73254l019k37941L36325m3102p7781j44420
22454E5538j06528J86380J31060p4034n9819K1455K38516J45192p1619k65276
22444B00865k86588j98960m1667L36399K43884q3562q5197O6649J85437p3115
$$ plain form
22434 264145 234698 44555 38657 -7782 -138039 -48011 75014 263013 299726 7869 -37010
22423 -37010 -18087 35564 -12365 -160498 -127793 -284886 -406015 -288702 -185173 -73669
22413 -73669 91629 -24262 -44022 -14863 -178420 -195551 -202218 -121041 -35580 -230593 -362926
22402 -362926 -360959 -290486 -173977 120754 113967 12945 -22700 83195 -27466 151898 396916
22391 396916 354467 264953 -38784 -152889 -105865 18058 -44619 -16657 281369 283562 1722
22380 1722 -327260 -211013 -141689 -307770 -232226 -158396 332 256187 197884 191894 261648
22369 261648 306612 338908 503389 329760 94025 42859 -79552 21876 108853 -82432
22359 -82432 -37337 78460 82334 197302 80825 153970 233472 -22632 133867 159580 -17929
$$ packed form
22434B64145k9447j90143n898m6439j30257R0028J23025J87999L6713k91857m4879
22423c7010J8923N3651m7929j48133L2705j57093j21129J17313J03529J11504
22413g3669J65298j15891j9760K9159j63557j7131o667Q1177Q5461j95013j32333
22402c62926J967P0473J16509K94731o787j01022l5645J05895j10661J79364K45018
22391C96916m2449q9514l03737j14105M7024J23923o2677K7962K98026K193k81840
22380A722l28982J16247O9324j66081P5544P3830J58728K55855n8303n990O9754
22369B61648M4964L2296J64481j73629k35735n1166j22411J01428Q6977j91285
22359h2432M5095J15797L874J14968j16477P3145P9502k56104J56499K5713j77509
$$ plain form
22348 -17929 97666 -171603 -215431 -251371 -310625 -388286 -272409 204218 517416 494724 380987
22337 380987 328191 -13499 -277653 -69436 -160932 -134615 137282 171379 351651 206838
22327 206838 63697 310961 332529 175143 161230 308974 408570 337896 105941 -189556
22317 -189556 -6567 -16787 -42649 -265343 -154849 15552 46501 24428 1083 -7867 -188782
22306 -188782 -210238 -74361 34945 97465 -69580 -75830 -197679 -363258 -349072 -132562
22296 -132562 8749 -5355 -161110 -38816 46749 -58809 -44090 153258 728 -84087
22286 -84087 -14030 117398 100899 177249 172238 110363 191486 138847 44316 78689 377663
22275 377663 410477 186684 278482 192311 -129902 -275591 -56106 -185949 -249186 -301228
$$ packed form
22348a7929J15595k69269m3828l5940n9254p7661J15877M76627L13198k2692j13737
22337C80987n2796l41690k64154K08217r1496K6317K71897L4097J80272j44813
22327B06838j43141K47264K1568j57386j3913J47744R9596p0674k31955k95497
22317a89556J82989j0220k5862k22694J10494J70401L0949k2073k3345q950j80915
22306a88782k1456J35877J09306O2520j67045o250j21849j65579J4186K16510
22296a32562J41311j4104j55755J22294Q5565j05558J4719J97348j52530q4815
22286h4087P0057J31428j6499P6350n011o1875Q1123n2639r4531L4373K98974
22275C77663L2814k23793R1798q6171l22213j45689K19485j29843o3237n2042
$$ plain form
22265 -301228 -351399 -176878 5061 -359098 -533761 -425244 -103058 135053 78563 -94142
22255 -94142 -224528 -281330 -48812 62090 167608 370591 650354 451649 110132 30102
22245 30102 -21531 -171778 19069 166588 233156 252720 399263 514452 228438 -52387
22235 -52387 82533 -230596 -256621 -303238 -368567 -210910 -192155 110337 125920 -9434 67146
22224 67146 -51176 -327758 -328417 -160491 -304945 -286451 -255385 -390699 -300943 -348221 -501090
22213 -501090 -389363 -397823 -287375 -70243 -126557 -408814 -424013 -442863 -493822 -479854 -354167
22202 -354167 -233948 -30249 -17467 -242901 -335673 -299701 -209449 -124083 -120903 -122300 -281845
22191 -281845 -162878 75830 326912 351022 215710 -13638 -160392 -448487 -362363 -259398
$$ packed form
22265c01228n0171J74521J81939l64159j74663J08517L22186K38111n6490j72705
22255i4142j30386n6802K32518J10902J05518K02983K79763j98705l41517q0030
22245C0102n1633j50247J90847J47519O6568J9564J46543J15189k86014k80825
22235e2387J34920l13129k6025m6617o5329J57657J8755L02492J5583j35354P6580
22224F7146j18322k76582o59J67926j44454J8494L1066j35314Q9756m7278j52869
22213e01090J11727q460J10448K17132n6314k82257j5199j8850n0959J3968J25687
22202c54167J20219K03699J2782k25434r2772L5972R0252Q5366L180j397j59545
22191b81845J18967K38708K51082K4110j35312k29348j46754k88095Q6124J02965
$$ plain form
22181 -259398 -174178 -273802 -372015 -41045 191608 126408 199436 395280 248215 140971
22171 140971 337334 361626 224072 6681 226181 236706 217939 116773 -130552 -183146
22161 -183146 -153584 -112410 -47347 -95531 -109719 -58032 -63259 -34653 -114620 -32233 34956 189775
22149 189775 -152268 -139204 -7619 -37509 -4662 36297 -195146 -324282 -272709 -272327 -254380
22138 -254380 3158 -16216 -85448 -100050 -90431 -146180 -153987 -326829 -156686 15827 -68898
22127 -68898 -196136 -154042 -59698 -196756 -143767 34257 -220816 -362012 -225538 -171976
22117 -171976 80918 56789 110895 70153 -148317 22090 39544 -33431 -156504 -131629 -233198
22106 -233198 13982 27948 -69961 156035 65950 -14249 -199898 -279179 -242091 -334643 -559144
$$ packed form
22181b59398Q5220r9624r8213L30970K32653o5200P3028J95844j47065j07244
22171A40971J96363K4292j37554k17391K19500J0525j8767j01166k47325n2594
22161a83146K9562M1174O5063m8184j4188N1687n227K8606p9967Q2387O7189J54819
22149A89775l42043J3064J31585k9890L2847M0959k31443j29136N1573L82J7947
22138b54380K57538j9374o9232j4602R619n5749p807j72842J70143J72513q4725
22127f8898j27238M2094R4344j37058N2989J78024k55073j41196J36474N3562
22117a71976K52894k4129N4106m0742k18470J70407J7454p2975j23073K4875j01569
22106b33198K47180J3966r7909K25996r0085q0199j85649p9281L7088r2552k24501
$$ plain form
22095 -559144 -421449 -448037 -408488 -528543 -583878 -365413 -373436 -497875 -418985 -295507 -483260
22084 -483260 -411654 -306829 -211492 -237114 -371525 -466244 -332646 -149417 -228312 -186573 -39733
22073 -39733 98643 -92601 -290780 -168742 89334 -32800 -232227 -214622 -205129 -315171
22063 -315171 -323243 -112448 60841 129243 187491 235882 91625 -75339 -217153 -69678
22053 -69678 -98345 -218220 -93689 -896 -30599 -232546 -22231 93484 90159 138271 79961
22042 79961 88009 -7185 24100 83807 -91868 -150118 115824 220434 -40718 -39875 81666
22031 81666 193678 356218 304043 110159 37476 187868 75917 168808 118361 -115974
22021 -115974 -179999 -110014 -218430 -27714 -6724 -62933 -77584 -8482 155841 26984 -45508
$$ packed form
22095e59144J37695k6588L9549j20055n5335K18465q023j24439P8890J23478j87753
22084d83260P1606J04825R5337k5622j34411r4719J33598J83229p8895M1739J46840
22073c9733J38376j91244j98179J22038K58076j22134j99427J7605R493j10042
22063c15171q072K10795J73289O8402N8248M8391j44257j66964j41814J47475
22053f9678k8667j19875J24531R2793k9703k01947K10315J15715l325M8112n8310
22042G9961Q048r5194L1285N9707j75675n8250K65942J04610k61152Q43J21541
22031H1666J12012J62540n2175j93884p2683J50392j11951R2891n0447k34335
22021a15974o4025O9985j08416J90716K0990n6209j4651O9102J64323j28857p2492
$$ plain form
22010 -45508 56635 36255 -121613 -300459 -160869 -207535 -298480 -394287 -419562 -499838 -552973
21999 -552973 -716223 -304439 -76185 -186547 -251007 -355436 -260235 18659 44705 -173294
21989 -173294 -347525 -110312 -169774 -317469 -506236 -446282 -356203 -302413 -348099 -209961
21979 -209961 -166337 -401267 -649373 -640558 -624338 -517188 -293719 -76068 -30868 105272
21969 105272 -79057 -81945 246998 171212 -39632 -184484 -231196 -255527 -236097 -321213 -234362
21958 -234362 -74450 -49139 -76653 -12529 7682 5195 59923 -156782 -123665 -338970 -451102
21947 -451102 -454016 -323289 -157972 205272 -6625 -269788 -403659 -393318 -254181 -84871
21937 -84871 -60183 -217977 -195318 -255327 -293367 -359999 -361889 -279427 -221996 -264114 -202159 -48589
$$ packed form
22010d5508J02143k0380j57868j78846J39590m6666r0945r5807k5275q0276n3135
21999e52973j63250M11784K28254j10362o4460j04429R5201K78894K6046k17999
21989a73294j74231K37213n9462j47695j88767N9954R0079N3790m5686J38138
21979b09961M3624k34930k48106Q815J6220J07150K23469K17651M5200J36140
21969A05272j84329k888L28943p5786k10844j44852m6712k4331J9430q5116Q6851
21958b34362J59912K5311k7514O4124K0211k487N4728k16705L3117k15305j12132
21947d51102k914J30727J65317L63244k11897k63163j33871J0341J39137J69310
21937h4871K4688j57794K2659o0009l8040o6632j890Q2462N7431m2118O1955J53570
$$ plain form
21925 -48589 154213 108469 -86726 -175320 -140444 -100358 35922 190708 112957 -62936 -74157
21914 -74157 -101926 137524 120473 154838 182791 111690 355320 452452 343658 252206 179207
21903 179207 69981 43772 123124 170845 162076 -140794 -376995 -120621 46970 -198587
21893 -198587 -59798 28576 99548 225066 327078 215378 -87485 -210421 -2477 64233
21883 64233 -217184 -239899 -97467 13802 126394 -75460 -204217 -376143 -253312 -209906
21873 -209906 -529120 -237770 -27520 45225 126497 -4934 -327114 -537623 -411753 -420500
21863 -420500 -396312 -380026 -368314 -347929 -99084 128052 87936 7273 138701 285831 200136
21852 200136 125476 187151 282748 268099 268785 396568 318329 104993 -128646 -102302 -19508
$$ packed form
21925d8589K02802m5744j95195q8594L4876M0086J36280J54786p7751j75893j1221
21914g4157k7769K39450j7051L4365K7953p1101K43630R7132j08794r1452p2999
21903A79207j09226k6209P9352M7721q769l02870k36201K56374J67591k45557
21893a98587J38789Q8374P0972J25518J02012j11700l02863j22936K07944O6710
21883F4233k81417k2715J42432J11269J12592k01854j28757j71926J22831M3406
21873b09906l19214K91350K10250P2745Q1272j31431l22180k10509J25870q747
21863d20500K4188J6286J1712K0385K48845K27136m0116q0663J31428J47130q5695
21852B00136p4660O1675R5597j4649O86J27783p8239k13336k33639K6344Q2794
$$ plain form
21841 -19508 84514 -61215 -132729 -244889 -200912 -275916 -202595 -138882 -255875 -249095 -81432
21830 -81432 70267 -66527 -110992 -232726 75145 149108 -75929 -77939 24853 15751 153425
21819 153425 80005 -23515 24468 79790 163971 136502 -105258 -230982 84289 -126465
21809 -126465 -357672 -320544 -476871 -449161 -333497 -388818 -285141 -108936 -9553 -111249
21799 -111249 -295687 -444268 -274373 -230887 -290049 -78124 -173567 8452 230486 142143
21789 142143 -169925 -353224 -163034 -9192 116902 274879 209908 204611 358999 263632
21779 263632 2745 193011 415886 265579 -17589 -86528 -91749 125549 22624 -116900
21769 -116900 -261003 -262405 -176207 -51333 259695 215303 -107324 -205236 -176360 -57802 -172273
$$ packed form
21841a9508J04022j45729p1514j12160M3977p5004P3321O3713j16993O780J67663
21830h1432J51699j36794m4465j21734L07871P3963k25037k010J02792r102J37674
21819A53425p3420j03520M7983N5322Q4181k7469k41760j25724L15271k10754
21809a26465k31207L7128j56327K7710J15664n5321J03677J76205R9383j01696
21799a11249j84438j48581J69895M3486n9162K11925r5443J82019K22034q8343
21789A42143l12068j83299J90190J53842J26094J57977o4971n297J54388r5367
21779B63632k60887J90266K22875j50307k83168o8939n221K17298j02925j39524
21769a16900j44103j402Q6198J24874L11028m4392l22627r7912K8876J18558j14471
$$ plain form
21758 -172273 -174467 26046 154119 413342 421937 207800 209203 223094 146744 -45176 -219995
21747 -219995 -44126 -287 2387 -14349 -133294 90753 27851 -133223 -407726 -664580
21737 -664580 -570575 -214448 -191060 -155268 -53736 32571 51293 -17401 -84081 -14906 7955
21726 7955 -102585 -259093 -458465 -388361 -350262 47656 -32733 -342408 -402036 -423785 -307692
21715 -307692 -128815 -144718 -137383 -240006 -182160 -239738 -64331 75825 39 29503 -242304
21704 -242304 -535880 -461330 -311851 -280718 -308457 -415778 -243986 -113013 -210593 -329353
21694 -329353 -194678 -235192 -404147 -465186 -405564 -78976 247166 307387 95059 -36222
21684 -36222 -207914 -331403 -146334 22123 178084 464885 302027 287155 238346 243571
$$ packed form
21758a72273k194K00513J28073K59223Q595k14137J403J3891p6350j91920j74819
21747b19995J75869M3839K674j6736j18945K24047o2902j61074k74503k56854
21737f64580R4005L56127K3388L5792J01532Q6307J8722o8694o6680O9175K2861
21726G955j10540j56508j99372P0104L8099L97918q0389l09675n9628k1749J16093
21715c07692J78877j5903P335j02623N7846n7578J75407J40156p5786K9464k71807
21704b42304k93576P4550J49479L1133k7739j07321J71792J30973r7580j18760
21694c29353J34675m0514j68955o1039N9622L26588L26142O0221k12328j31281
21684c6222j71692j23489J85069J68457J55961K86801j62858j4872m8809N225
$$ plain form
21674 243571 126190 91260 -156852 -352754 -492896 -489882 -431357 -213725 48870 165391
21664 165391 -30886 -138201 -83254 -84034 -143993 -37048 -87742 -194790 -289557 -255324 -234056
21653 -234056 -267241 -497033 -448230 -300545 -199744 -338267 -567986 -362592 -121315 -52776
21643 -52776 -248799 -408141 -236653 -267545 -289100 -160398 -3165 181623 -194077 -381076
21633 -381076 -170483 -285187 -183422 135175 266432 263405 261290 31591 -46587 -116498 -90100
21622 -90100 254963 101467 72717 -26894 -32123 -126845 -103404 -227822 -274570 -349284 -221509
21611 -221509 -38284 -231002 -506006 -188663 215838 362452 372142 355777 161397 126106
21601 126106 349495 353865 90957 19952 56198 -22278 -60501 -318963 -400064 -109633 -79074
$$ packed form
21674B43571j17381l4930k48112j95902j40142L014N8525K17632K62595J16521
21664A65391j96277j07315N4947p80n9959J06945n0694j07048r4767L4233K1268
21653b34056l3185k29792M8803J47685J00801j38523k29719K05394K41277O8539
21643e2776j96023j59342J71488l0892k1555J28702J57233J84788l75700j86999
21633c81076K10593j14704J01765L18597J31257l027k115k29699p8178o9911K6398
21622i0100L45063j53496k8750r9611n229r4722K3441j24418m6748p4714J27775
21611b21509J83225j92718k75004L17343M04501J46614R690j6365j94380l5291
21601A26106K23389M370k62908p1005L6246p8476l8223k58462q1101K90431L0559
$$ plain form
21590 -79074 -43401 -80118 -73789 151331 69652 223556 242791 202895 161062 207696 40367
21579 40367 4105 184378 426463 479820 541020 419177 26576 104957 111255 59715 -41696
21568 -41696 2087 -75370 -94733 -151641 -267612 -63364 55117 -94007 -243146 -306886 -62131
21557 -62131 -107255 -73295 -40255 -292424 -198863 93041 224437 -26922 -120627 -314550 -252359
21546 -252359 -211518 -63741 22197 55600 -3280 -340571 -420079 -299175 -37592 136762
21536 136762 161359 -16698 -97916 -166655 -41448 -113908 -220876 -172790 -87532 -56817 -58387
21525 -58387 90823 52750 -139301 110317 509070 398768 228720 294062 200618 134958
21515 134958 168702 228903 46357 -149011 -60155 106331 185782 282717 306431 295789 291403
$$ packed form
21590g9074L5673l6717O329K25120q1679J53904J9235l9896m1833M6634j67329
21579D0367l6262J80273K42085N3357O1200j21843l92601P8381O298n1540j01411
21568d1696M3783p7457j9363n6908j15971K04248J18481j49124j49139o3740K44755
21557f2131m5124L3960L3040k52169R3561K91904J31396k51359r3705j93923O2191
21546b52359M0841J47777Q5938L3403n8880l37291p9508J20904K61583J74354
21536A36762K4597j78057q1218o8739J25207p2460j06968M8086Q5258L0715j570
21525e8387J49210l8073j92051K49618L98753j10302j70048O5342r3444o5660
21515A34958L3744O0201j82546j95368Q8856J66486P9451R6935K3714j0642m386
$$ plain form
21504 291403 151772 98552 190059 26961 85247 -28743 -9247 -69344 -304781 -257956 -106135
21493 -106135 -219598 -176208 -324352 -287600 -303467 -523160 -461631 -300118 -50461 -201235
21483 -201235 -176029 -57214 -138991 -164521 -149537 -214659 -310536 -367954 -417524 -413071 -308438
21472 -308438 16376 132668 70290 121927 66032 -282956 -155157 103287 293406 211834
21462 211834 -107318 -50820 3736 -218784 72603 181332 110365 98706 -25614 -119615
21452 -119615 -112285 157389 353140 314649 263894 189759 119199 -212468 -73027 -134557 25906
21441 25906 184813 64837 76576 -123230 -299366 -353646 22738 223506 239741 47596
21431 47596 -34320 82773 97793 -54329 -222788 -184726 -251841 -180266 -234114 -119901 -183368
$$ packed form
21504B91403j39631n3220R1507j63098N8286j13990J9496o0097k35437M6825J51821
21493a06135j13463M3390j48144L6752j5867k19693O1529J61513K49657j50774
21483b01235K5206J18815q1777k5530J4984o5122r5877n7418m9570M453J04633
21472c08438L24814J16292o2378N1637n5895l48988J27799K58444J90119q1572
21462B11834l19152N6498N4556k22520K91387J08729p0967j1659j24320r4001
21452a19615P330K69674J95751l8491n0755p4135p0560l31667J39441o1530J60463
21441B5906J58907j19976J1739j99806j76136n4280L76384K00768J6235j92145
21431D7596q1916J17093J5020j52122j68459L8062o7115P1575n3848J14213o3467
$$ plain form
21420 -183368 -58672 2192 -71667 -31190 24450 140905 258809 179258 138691 -121702 -165823
21409 -165823 -41031 -231546 -257803 -349215 -330610 -350319 -403701 -459943 -425546 -386841 -458599
21398 -458599 -340811 -138956 -21448 37099 30663 41528 121023 -82763 -139233 143889 230135
21387 230135 43538 60925 198096 16871 -235952 -481995 -509234 -468415 -268871 -127108
21377 -127108 -225600 -226547 53338 45382 93343 104378 -77391 -171311 -25018 20493 206126
21366 206126 176494 125958 -43466 -97343 -61289 -68642 -328035 -412921 -467373 -139645 81372
21355 81372 100404 204943 -6925 -217992 -187590 -49583 2191 -88964 22975 298965
21345 298965 63554 -135780 26204 97236 261637 259099 348530 60435 -197107 -247560
$$ packed form
21420a83368J24696O0864p3859M0477N5640J16455J17904p9551m0567k60393m4121
21409a65823J24792j90515k6257r1412J8605j9709n3382n6242L4397L8705p1758
21398d58599J17788K01855J17508N8547o436J0865P9495k03786n6470K83122Q6246
21387B30135j86597J7387J37171j81225k52823k46043k7239M0819J99544J41763
21377a27108r8492r47K79885p956M7961J1035j81769r3920J46293M5511J85633
21366B06126k9632n0536j69424n3877L6054p353k59393q4886n4452L27728K21017
21355H1372J9032J04539k11868k11067L0402J38007N1774r1155J11939K75990
21345B98965k35411j99334J61984P1032J64401k538Q9431k88095k57542n0453
$$ plain form
21335 -247560 -198130 -162769 -29819 -106165 -126298 -103852 -197245 -241090 22958 395759 364942
21324 364942 326266 182979 117355 335020 438735 372020 97307 271790 505114 478262
21314 478262 261222 -49972 -246310 164933 263523 -5829 -260359 -689176 -585989 -327355
21304 -327355 -386856 -324967 -153127 15911 -96769 37617 67078 69959 4382 53708 -5128
21293 -5128 -219717 -223656 -160069 -128405 -5023 142807 134667 88181 85884 249327 440132
21282 440132 436069 157806 47167 -168885 -402230 -630389 -562480 -422395 -69671 78250
21272 78250 33785 112387 316371 303558 393044 443881 253470 -123542 -326934 -172182 -169502
21261 -169502 -104473 -64429 -23306 -71829 25076 357458 370247 276749 259508 130195 49347
$$ packed form
21335b47560M9430L5361J32950p6346k0133K2446r3393m3845K64048L72801l0817
21324C64942l8676j43287o5624K17665J03715o6715k74713J74483K33324k6852
21314D78262k17040l11194j96338M11243R8590k69352k54530m28817J03187K58634
21304c27355n9501O1889J71840J69038j12680J34386K9461K881o5577M9326n8836
21293e128k14589l939O3587L1664J23382J47830q140m6486k297J63443J90805
21282D40132m063k78263j10639k16052k33345k28159O7909J40085L52724J47921
21272G8250m4465P8602K03984j2813Q9486N0837j90411l77012k03392J54752K680
21261a69502O5029M0044M1123m8523R6905L32382J2789r3498j7241j29313q0848
$$ plain form
21250 49347 -9984 -58653 15362 42323 155802 301146 518407 665187 607357 341214 142655
21239 142655 133471 142237 149992 -77057 -53107 213463 388041 171878 87182 152132 -53629
21228 -53629 -126057 -285292 -249748 -58738 -115867 -20692 -47123 61872 183819 74204 170143
21217 170143 106838 -20936 -196915 -204981 -87005 -12996 -110790 -91801 -240143 -519094 -252033
21206 -252033 -184784 -205883 -112086 -30818 4436 172456 45972 18035 2487 -6754 -31722
21195 -31722 -167960 157742 365389 148321 -103896 -98617 -58508 -163962 37282 309472
21185 309472 194584 -32774 -868 198477 169887 110815 -25708 185155 235516 -48727
21175 -48727 -183022 -329050 -419671 -121124 -142810 61383 93518 21719 -39388 -166446 -227226
$$ packed form
21250D9347n9331m8669P4015K6961J13479J45344K17261J46780n7830k66143j98559
21239A42655r184Q766P755k27049K3950K66570J74578k16163q4696O4950k05761
21228e3629p2428j59235L5544J91010n7129R5175k6431J08995J21947j09615R5939
21217A70143o3305j27774j75979q066J17976P4009r7794J8989j48342k78951K67061
21206b52033O7249k1099R3797Q1268L5254J68020j26484k7937j5548r241k4968
21195c1722j36238L25702K07647k17068k52217N279M0109j05454K01244K72190
21185C09472j14888k27358L1906J99345k8590n9072j36523K10863N0361k84243
21175d8727j34295j46028r0621K98547k1686K04193L2135p1799o1107j27058o0780
$$ plain form
21164 -227226 73555 200303 200283 145399 41821 99730 22004 179572 103124 62233 259052
21153 259052 433870 314241 -41964 -147364 -196243 -215353 -42609 -24675 -161343 -99760
21143 -99760 -159900 -27359 166677 145218 45476 220013 428004 185721 -184570 -288460
21133 -288460 -319877 -205030 41619 -59993 38412 87647 -59784 -107065 -117762 -71425 38252
21122 38252 345350 275470 425208 399697 185635 213898 174745 209448 -2471 33470 167910
21111 167910 -38737 -306687 -421836 -274073 -142230 -265364 -121746 -44528 -75777 142238
21101 142238 221087 257711 261415 23680 -37012 6622 -155024 -270002 32943 4538 -130384
21090 -130384 225056 351703 365308 312254 69356 -157650 -314085 -283177 -415033 -335261
$$ packed form
21164b27226L00781J26748k0n4884j03578N7909p7726J57568p6448m0891J96819
21153B59052J74818j19629l56205j05400m8879j9110J72744J7934j36668O1583
21143i9760o0140J32541J94036k1459r9742J74537K07991k42283l70291j03890
21133b88460l1417J14847K46649j01612R8405M9235j47431m7281j0697M6337J09677
21122C8252L07098o9880J49738k5511k14062K8263l9153L4703k11919L5941J34440
21111A67910k06647k67950j15149J47763J31843j23134J43618P7218l1249K18015
21101A42238P8849L6624L704k37735o0692M3634j61646j14978L02945k8405j34922
21090a30384L55440J26647J3605n3054k42898k27006j56435L0908j31856P9772
$$ plain form
21080 -335261 -383852 -413291 -333562 -443885 -400927 -215330 -37274 205245 364096 135966
21070 135966 -100332 -1877 259531 165951 115129 44887 -80273 19494 107296 50639 30919
21059 30919 7164 -60159 -145163 -268805 -397432 -345622 -230171 -229269 -53124 -111106 -225421
21048 -225421 5167 126687 -13770 -62020 -219056 -17088 132460 -3764 -308958 -347098
21038 -347098 -304671 -162985 -133579 71582 83456 -86212 58597 284757 313438 156474
21028 156474 -101298 -19144 184912 141435 52408 56706 -24533 -207768 -208648 -19857 103346
21017 103346 127906 -39519 33092 129714 -1152 141291 217536 121868 151724 210322 -32407
21006 -32407 13292 175427 234513 151022 246756 209311 117861 -274897 -265597 162931 212939
$$ packed form
21080c35261m8591k9439P9729j10323M2958J85597J78056K42519J58851k28130
21070A35966k36298R8455K61408r3580n0822p0242j25160R9767Q7802n6657j9720
21059C0919k3755o7323q5004j23642j28627N1810J15451R02J76145n7982j14315
21048b25421K30588J21520j40457m8250j57036K01968J49548j36224l05194l8140
21038c47098M2427J41686K9406K05161J1874j69668J44809K26160K8681j56964
21028A56474k57772Q2154K04056m3477q9027M298q1239j83235q80J88791J23203
21017A03346K4560j67425P2611R6622j30866J42443P6245r5668K9856N8598k42729
21006c2407M5699J62135N9086q3491R5734l7445r1450l92758R300M28528N0008
$$ plain form
20995 212939 66619 -12965 77057 240311 -17108 182938 239884 181893 -125878 -108886
20985 -108886 189587 351616 281470 7161 -57067 383903 312916 38277 -89884 95652
20975 95652 62370 -169653 -399574 -207023 -203223 -278883 -42046 215629 303713 220121 71977
20964 71977 -44886 215834 138895 130194 256087 279906 544581 564953 94593 -121634 -45279
20953 -45279 -168410 -97600 260252 246144 36776 -318997 -335850 -113017 -207944 -35485
20943 -35485 67685 11655 81460 -17754 -229304 -135313 -60213 -98263 -226265 -253579 -151178
20932 -151178 -147550 -194425 -274014 -351894 -199845 -144172 41238 252111 54467 -179356 -484853
20921 -484853 -638502 -460034 -288009 -162917 -173255 -186293 -131225 -10876 182166 258216
$$ packed form
20995B12939j46320p9584R0022J63254k57419K00046N6946n7991l07771J6992
20985a08886K98473J62029p0146k74309o4228M40970p0987k74639j28161J85536
20975I5652l3282k32023k29921J92551L800p5660K36837K57675Q8084q3592j48144
20964G1977j16863K60720p6939q701J25893K3819K64675K0372m70360k16227P6355
20953d5279j23131P0810L57852j4108k09368l55773j6853K22833r4927J72459
20943c5485J03170n6030O9805r9214k11550R3991P5100l8050j28002k7314J02401
20932a51178L628m6875p9589p7880J52049N5673J85410K10873j97644k33823l05497
20921d84853j53649J78468J72025J25092j0338j3038N5068J20349J93042P6050
$$ plain form
20911 258216 -71122 -76362 65246 83291 59073 61902 33842 -89347 -276718 -300801 43901
20900 43901 551408 165277 3512 -94993 -169966 -244683 -404680 -292846 -332425 -203696
20890 -203696 23359 279366 250905 156298 -17937 82453 238696 208618 423136 222332
20880 222332 155722 76185 106157 197029 264886 93286 12036 6412 7478 -13227 91660
20869 91660 241162 228033 238990 -22741 -133702 82608 209245 390728 220529 20733
20859 20733 -28153 -5210 49358 119145 86008 141857 77326 24689 149983 120368 103162
20848 103162 -19517 145426 233026 143393 436687 471757 284976 176138 27469 -226900
20838 -226900 -333172 -152206 -157679 -391495 -342584 -278994 -364435 -200107 -185740 -126542 -56874
$$ packed form
20911B58216l29338n240J41608J8045k4218K829k8060j23189j87371k4083L44702
20900D3901N07507l86131j61765r8505p4973p4717j59997J11834l9579J28729
20890b03696K27055K56007k8461r4607j74235J00390J56243l0078K14518k00804
20880B22332o6610p9537K9972R0872O7857j71600q1250n624J066k0705J04887
20869I1660J49502j3129J0957k61731j10961K16310J26637J81483j70199j99796
20859B0733m8886K2943N4568O9787l3137N5849o4531n2637J25294k9615j7206
20848A03162j22679J64943Q7600q9633K93294L5070j86781j08838j48669k54369
20838b26900j06272J80966n473k33816M8911O3590q5441J64328J4367N9198O9668
$$ plain form
20827 -56874 97189 85761 -76099 10836 -139383 -315871 -423816 -444816 -511454 -390003
20817 -390003 -310359 -295782 -236416 -245458 -335452 -377153 -469242 -436755 -283462 -174302 -142586
20806 -142586 -3196 -49528 25329 -16832 21661 147888 216137 224894 53316 142281 218853
20795 218853 -50496 -195012 -195075 -115034 94462 -25973 -216063 -167980 -262047 -145235 -80231
20784 -80231 7527 67314 -133940 -177179 -269159 -236691 -169287 -37745 92417 70216 76430
20773 76430 160666 -49983 -115793 -371732 -424615 -159651 -4695 -117048 -320571 -300876
20763 -300876 -167358 -390902 -574436 -657624 -563659 -483225 -401733 -431404 -361240 -209748 -173632
20752 -173632 -143578 -96210 -291828 -393348 -268802 -368084 -246131 -169173 -336482 -336141 -344885
$$ packed form
20827e6874J54063j1428j61860Q6935j50219j76488j07945k1000o6638J21451
20817c90003P9644J4577N9366r042q9994m1701r2089L2487J53293J09160L1716
20806a42586J39390m6332P4857m2161L8493J26227O8249Q757j71578Q8965P6572
20795B18853k69349j44516o3Q0041K09496j20435j90090M8083r4067J16812O5004
20784h0231Q7758N9787k01254m3239r1980L2468O7404J31542J30162k2201O214
20773G6430Q4236k10649o5810k55939n2883K64964J54956j12353k03523J9695
20763c00876J33518k23544j83534q3188R3965Q0434Q1492k9671P0164J51492L6116
20752a73632L0054M7368j95618j01520J24546r9282J21953P6958j67309L41q744
$$ plain form
20741 -344885 -230175 16750 249284 283840 189420 193208 179566 103186 78932 -104235 -97457
20730 -97457 -133054 -46878 172309 120052 -325791 -395384 -330771 -170928 -293864 -395113 -148860
20719 -148860 -79436 -75597 -275996 -406662 -224673 -25188 -63202 -247246 -344408 -278057 -68788
20708 -68788 193745 224328 71239 -105254 -78704 54674 251757 165706 195549 122630 58389
20697 58389 -45983 -249126 -258982 -209707 -306300 -99165 -85587 -180816 -283947 -238928 -213315
20686 -213315 -69413 10863 -189567 -558429 -529497 -359425 -220982 -296101 -214094 -208264 -346126
20675 -346126 -401342 -259541 -117634 104565 -33526 -277214 -196798 -119347 -68179 -53101
20665 -53101 150937 103417 -43797 85730 226963 213741 374599 302168 38506 206029
$$ packed form
20741c44885J14710K46925K32534L4556r4420L788j3642p6380k4254j83167O778
20730i7457l5597Q6176K19187n2257m45843o9593O4613J59843j22936j01249K46253
20719a48860O9424L839k00399j30666J81989J99485l8014j84044r7162O6351K09269
20708f8788K62533L0583j53089j76493K6550J33378J97083q6051K9843p2919o4241
20697E8389j04372k03143r856M9275r6593K07135J3578r5229j03131M5019K5613
20686b13315J43902Q0276k00430l68862K8932J70072J38443p5119Q2007N830j37862
20675c46126n5216J41801J41907K22199j38091k43688Q0416P7451N1168J5078
20665e3101K04038m7520j47214J29527J41233j3222J60858p2431k63662J67523
$$ plain form
20655 206029 139453 67247 45519 -245015 -366689 -147210 -151252 -149834 -8219 54285 103344
20644 103344 153699 -100740 -167548 -306165 -189372 -114385 -114250 104736 146564 4707 -88208
20633 -88208 -128057 22126 -53378 -108690 -54919 -139965 -242450 -128884 -109481 -45197 132853
20622 132853 110360 85292 129829 -17010 110515 179722 33899 69460 68650 -163312 -182652
20611 -182652 -122111 1019 -155427 -85051 70585 174070 238528 -59387 -184709 -296995
20601 -296995 -577260 -663767 -462372 35257 21410 85274 343474 512136 258563 -23226
20591 -23226 -174706 -79501 -49109 -36781 -172862 -325856 -283992 -97049 -161755 -258242 -192882
20580 -192882 -153417 30500 -8027 -197317 -215357 -88245 58377 218662 227279 136909 167819
$$ packed form
20655B06029o6576p2206k1728k90534j21674K19479m042J418J41615O2504M9059
20644A03344N0355k54439o6808j38617J16793P4987J35K18986M1828j41857r2915
20633h8208l9849J50183p5504n5312N3771q5046j02485J13566J9403O4284J78050
20622A32853k2493k5068M4537j46839J27525O9207j45823L5561q10k31962j9340
20611a82652O0541J23130j56446P0376J55636J03485O4458k97915j25322j12286
20601b96995k80265q6507K01395M97629j3847O3864K58200J68662k53573k81789
20591b3226j51480R5205L0392J2328j36081j52994M1864J86943o4706r6487O5360
20580a92882L9465J83917l8527j89290j8040J27112J46622J60285Q617r0370L0910
$$ plain form
20569 167819 172192 48625 165805 -21118 -184987 -242663 -133563 -37343 -67571 -251623
20559 -251623 -142667 -24606 9689 -30521 117331 34291 -96120 -57874 106863 174156
20549 174156 92511 -39772 -23363 -263251 -477386 -529860 -299189 -243984 60285 278993
20539 278993 129913 -93955 -42005 -95458 -47274 19910 13389 100821 191371 163354 247048
20528 247048 473070 589580 601937 441116 293916 321362 390645 241241 -74680 -122743
20518 -122743 -209699 -232971 -75832 118950 235350 46542 15676 -33541 109096 33836
20508 33836 38422 -63085 -224835 -280135 -311663 -21124 83746 99781 125236 184255 -125955
20497 -125955 -98436 -226227 -218651 -89070 21740 -101808 42134 128892 120266 163150 285846
$$ packed form
20569A67819M373j23567J17180j86923j63869n7676J09100R6220l0228j84052
20559b51623J08956J18061L4295m0210J47852q3040j30411L8246J64737O7293
20549A74156q1645j32283J6409k39888k14135n2474K30671N5205L04269K18708
20539B78993j49080k23868N1950n3453M8184O7184o521Q7432R0550k8017Q3694
20528B47048K26022J16510J2357j60821j47200K7446O9283j49404l15921m8063
20518a22743q6956k3272J57139J94782J16400j88808l0866m9217J42637p5260
20508C3836M586j01507j61750n5300l1528K90539J04870J6035K5455N9019l10210
20497a25955K7519j27791P576J29581J10810j23548J43942Q6758q626M2884J22696
$$ plain form
20486 285846 45006 -149353 -55266 87704 316458 532566 574345 316755 386016 266248
20476 266248 144143 260967 68396 -74387 -163835 -185815 -385365 -133061 238975 330154
20466 330154 201785 21327 -43476 -97775 35968 -191148 -501017 -493596 -330566 -180577
20456 -180577 38145 -1647 -48371 -225262 -377339 -180008 -37215 -43300 -224947 -124513
20446 -124513 1499 145435 98941 213036 144542 -181049 -157743 -266323 -218524 -213207 -329031
20435 -329031 -403500 -537558 -136228 300490 189787 155588 219278 448572 499461 306937
20425 306937 264659 287438 415087 355831 192346 53668 127632 275423 222368 63047
20415 63047 -70050 42538 188470 260230 178012 338949 490252 501512 396735 332522
$$ packed form
20486B85846k40840j94359R4087J42970K28754K16108M1779k57590O9261j19768
20476B66248j22105J16824j92571j42783q9448k1980j99550K52304L72036R1179
20466C30154j28369j80458o4803n4299J33743k27116l09869P421J63030J49989
20456a80577K18722l9792m6724j76891j52077J97331J42793o085j81647J00434
20446a24513J26012J43936m6494J14095o8494l25591K3306j08580M7799N317j15824
20435c29031p4469j34058M01330M36718j10703l4199O3690K29294N0889j92524
20425C06937m2278K2779J27649n9256j63485j38678P3964J47791n3055j59321
20415F3047j33097J12588J45932P1760q2218J60937J51303J1260j04777o4213
$$ plain form
20405 332522 209260 215527 167102 89681 13257 -109684 114 -66682 -114306 -259617 -297690
20394 -297690 -61420 111806 -443 -73735 -139760 -69924 112977 121300 60065 -78281 -193784
20383 -193784 -158177 140592 415634 215684 115161 90611 -11118 -118576 -86884 7172
20373 7172 -880 75702 177737 316301 561891 630991 478150 243192 84146 -38300 -155378
20362 -155378 -165342 -107567 -229081 -123366 -118445 -34386 263871 211500 96708 67774 111631
20351 111631 53344 -5748 -30328 108689 -32704 -116156 -52870 -42077 -274009 -209327 6649
20340 6649 -183098 -194790 -134038 -336819 -395528 -152662 128136 169718 5293 -152982 -166160
20329 -166160 59526 122591 24317 -160780 -229130 -42164 202209 91336 95480 20896 202160
$$ packed form
20405C32522j23262O267m8425p7421p6424j22941J09798o6796m7624j45311l8073
20394b97690K36270J73226j12249p3292o6025O9836J82901Q323o1235j38346j15503
20383a93784L5607K98769K75042j99950j00523k4550j01729j07458L1692R4056
20373G172q052P6582J02035J38564K45590O9100j52841k34958j59046j22446j17078
20362a55378r964N7775j21514J05715M921Q4059K98257n2371j14792k8934M3857
20351A11631n8287n9092k4580J39017j41393q3452O3286J0793k31932O4682K15976
20340F649j89747j1692O0752k02781n8709K42866K80798M1582j64425j58275j3178
20329a66160K25686O3065r8274j85097o8350J86966K44373j10873M144p4584J81264
$$ plain form
20318 202160 278349 98011 177500 307661 248229 252982 215302 75111 -106709 -321794 -285442
20307 -285442 -201705 -82035 -151407 -136656 -253801 -145178 -66984 291384 241205 149859 -169057
20296 -169057 -143828 -141947 -20448 112512 47188 -81754 -46865 -52621 -11939 115370 237975
20285 237975 123297 102520 157406 110544 248070 342833 292168 169446 211661 225579 -32777
20274 -32777 -114073 -289186 -334921 -65946 111160 -41087 -117429 -149893 -114113 -57467 -46224
20263 -46224 -154490 -211734 -43851 -12852 -303179 -463901 -446885 -376544 -189737 -135504 -131445
20252 -131445 -150710 -165968 -290822 -73153 31862 27959 -181468 -326185 -255654 -124460
20242 -124460 243570 197682 60368 95306 133978 85840 -42243 -126205 -132267 -181192 -249153
$$ packed form
20318B02160P6189j80338P9489J30161n9432M753l7680j40191j81820k15085L6352
20307b85442Q3737J19670o9372J4751j17145J08623P8194L58368n0179r1346l18916
20296a69057K5229J881J21499J32960o5324j28942L4889n756M0682J27309J22605
20285B37975j14678k0777N4886m6862J37526R4763n0665j22722M2215J3918k58356
20274c2777q1296j75113m5735K68975J77106j52247p6342l2464L5780N6646J1243
20263d6224j08266n7244J67883L0999k90327j60722J7016P0341J86807N4233M059
20252a31445j9265j5258j24854K17669J05015l903k09427j44717P0531J31194
20242a24460L68030m5888j37314L4938L8672m8138j28083q3962o062m8925o7961
$$ plain form
20231 -249153 -148774 -133238 -81486 -244498 -90273 99125 424014 215065 -164178 -114625
20221 -114625 -82832 -124491 -244983 -71986 139818 15978 -96092 -40494 -330696 -572379
20211 -572379 -276806 -129858 -209728 -302052 -178767 -57484 149728 96152 -142848 -70510
20201 -70510 -24889 -176718 -375899 -317919 -29526 97993 -24839 7181 104428 247733
20191 247733 34092 -239591 -400766 -442326 -491382 -425372 -240190 -14796 148673 577717
20181 577717 414333 316631 230698 -20875 -44471 34760 157006 321487 342766 302409 360448
20170 360448 449897 377330 219942 -32849 -131724 24798 3544 -106574 3118 52529
20160 52529 287573 165319 151036 167793 267030 324270 271005 298087 458269 331683 247430
$$ packed form
20231b49153J00379J5536N1752j63012J54225J89398L24889k08949l79243M9553
20221a14625L1793m1659j20492J72997K11804j23840j12070N5598k90202k41683
20211e72379K95573J46948p9870r2324J23285J21283K07212n3576k39000P2338
20201g0510M5621j51829j99181N7980K88393J27519j22832L2020R7247J43305
20191B47733k13641k73683j61175m1560m9056O6010J85182K25394J63469M29044
20181E77717j63384r7702q5933k51573k3596P9231J22246J64481K1279m0357N8039
20170C60448Q9449p2567j57388k52791r8875J56522k1254j10118J09692M9411
20160E2529K35044j22254j4283J6757R9237N7240n3265K7082J60182j26586q4253
$$ plain form
20149 247430 305553 168180 129873 -48147 -73489 -89554 22516 114989 45055 29699 133199
20138 133199 26024 -269026 -250612 -290428 -133227 8482 80530 340192 288565 218740
20128 218740 241785 53077 -3170 75065 155010 261618 237400 159696 207353 168380 77634
20117 77634 90546 269976 150243 17552 331144 305372 -111994 -200586 93106 32026
20107 32026 -216622 -381702 27267 270846 234499 107477 250783 1924 -63818 77510
20097 77510 -45740 -55712 -59882 83462 244700 170429 61908 186871 69714 105582 -664
20086 -664 -98853 -168784 -128129 201161 479096 469827 373380 278499 -7916 -110926 -58215
20075 -58215 -24849 39358 -165272 -193132 -106468 -197917 -226444 -234983 -251342 -245686 -230263 -309740
$$ packed form
20149B47430N8123j37373l8307j78020k5342j6065J12070R2473o9934j5356J03500
20138A33199j07175k95050J8414l9816J57201J41709P2048K59662n1627o9825
20128B18740K3045j88708n6247P8235P9945J06608k4218p7704M7657l8973r0746
20117G7634J2912J79430j19733j32691L13592k5772m17366q8592K93692o1080
20107C2026k48648j65080M08969K43579l6347j27022J43306k48859o5742J41328
20097G7510j23250r972m170J43344J61238p4271j08521J24963j17157L5868j06246
20086f64r8189o9931M0655L29290K77935r269r6447r4881k86415j03010N2711
20075e8215L3366O4207k04630k7860Q6664r1449k8527q539j6359N656J5423p9477
$$ plain form
20063 -309740 -366789 -259097 -252440 -90601 -160799 -216926 -333878 -290943 -376899 -373088 -224019
20052 -224019 -50661 -26445 -83885 -165543 -156414 -52026 -126004 -166315 -151969 -29171 6501
20041 6501 -15272 -288448 -283026 -334683 -270375 -315779 -230755 50984 370590 230064 57682
20030 57682 151344 41047 88566 -11480 -227033 -172430 -28993 -106398 -47688 32592 125579
20019 125579 143043 -34804 -70972 85793 32466 -67875 156840 546995 516112 11609
20009 11609 -132084 201821 312497 97368 20063 25847 -17190 -127205 -112845 -107913 46408
19998 46408 178803 416985 441932 329889 338668 258365 99798 131049 203947 172437 -11457
19987 -11457 45529 22983 -17443 -69947 87046 244027 145166 -35397 -1710 -186526 -103660
$$ packed form
20063c09740n7049J07692O657J61839p0198n6127j16952M2935q5956L811J49069
20052b24019J73358K4216n7440q1658R129J04388p3978m0311J4346J22798L5672
20041F501k1773k73176N422n1657O4308m5404Q5024K81739L19606j40526j72382
20030E7682R3662j10297M7519j00046k15553N4603J43437p7405N8710Q0280R2987
20019A25579J7464j77847l6168J56765n3327j00341K24715L90155l0883n04503
20009A1609j43693L33905J10676k15129p7305N784m3037j10015J4360M932J54321
19998D6408J32395K38182K4947j12043Q779q0303j58567L1251P2898l1510j83894
19987a1457N6986k2546m0426n2504J56993J56981r8861j80563L3687j84816Q2866
$$ plain form
19976 -103660 118924 259571 355298 176626 258394 531771 480126 327512 168246 163115
19966 163115 245797 221358 -67575 60343 141421 99369 83823 262423 421404 277365
19956 277365 78179 -27812 -215692 -248601 -242128 -253264 -303357 -156394 -56351 -85326 -30017
19945 -30017 -191311 -392465 -207178 -87379 104966 64822 -278861 -518941 -343071 -241165
19935 -241165 -233416 -272740 -344563 -505584 -398761 -339714 -297981 -145275 -215026 -44913 146912
19924 146912 74392 213884 398829 328267 295572 349567 506605 420729 186036 350524
19914 350524 489442 468878 351851 383618 305109 -3770 -80859 203646 25240 -323535
19904 -323535 -358495 -443026 -584457 -417221 -349281 -50110 199 4215 -33099 -214320 -204891
$$ packed form
19976a03660K22584J40647R5727j78672Q1768K73377n1645j52614j59266n131
19966A63115Q2682k4439k88933J27918Q1078m2052j5546J78600J58981j44039
19956B77365j99186j05991j87880l2909O473j1136n0093J46963J00043k8975N5309
19945c0017j61294k01154J85287J19799J92345m0144l43683k40080J75870J01906
19935b41165P749l9324p1823j61021J06823N9047M1733J52706o9751J70113J91825
19924A46912p2520J39492J84945p0562l2695N3995J57038q5876k34693J64488
19914C50524J38918k0564j17027L1767p8509l08879p7089K84505j78406l48775
19904c23535l4960q4531j41431J67236O7940K99171N0309M016l7314j81221R429
$$ plain form
19893 -204891 -61577 65668 -31793 -312723 -237038 -57919 -86086 -417795 -376218 -121666
19883 -121666 -113002 -139732 -21429 124440 195322 -141192 -321253 -178210 -85885 -70422 -136091
19872 -136091 -555 104580 -170001 5490 -103472 -340510 -277070 -316163 -396952 -186307
19862 -186307 114084 -84370 -186264 -244564 -133001 132838 328283 191095 18399 33817
19852 33817 142809 227639 199224 212548 166023 -75181 107352 -29464 -122840 -82118 -234318
19841 -234318 -369039 -222545 -11670 -59766 -51741 -50979 -78883 55517 49924 135092 340873
19830 340873 236976 -89303 -123138 133101 238101 102817 152808 -7911 -403534 -617671
19820 -617671 -163387 -71084 213304 141965 -34166 282724 293528 281867 280478 222371 55713
$$ packed form
19893b04891J43314J27245r7461k80930P5685J79119k8167l31709M1577K54552
19883a21666Q664k6730J18303J45869P0882l36514j80061J43043R2325J5463o5669
19872a36091J35536J05135k74581J75491j08962k37038O3440l9093q0789K10645
19862a86307L00391j98454j01894n8300J11563K65839J95445j37188j72696J5418
19852C3817J08992Q4830k8415J3324m6525k41204J82533j36816r3376M0722j52200
19841b34318j34721J46494K10875m8096Q025P62k7904J34400n593Q5168K05781
19830C40873j03897l26279l3835K56239J05000j35284M9991j60719l95623k14137
19820f17671M54284R2303K84388p1339j76131L16890J0804j1661j389n8107j66658
$$ plain form
19809 55713 -101717 -134597 -78896 139061 139443 91724 52671 9390 -55804 37393 116461 150560
19797 150560 287691 360366 257764 328399 561944 445178 338679 207156 -2056 -69802
19787 -69802 641 39126 -41596 -166463 24345 -34199 -57137 -59632 -146813 -64598 -19967
19776 -19967 -22051 -83357 -286369 27149 142469 218020 228718 85398 20546 43805 262869
19765 262869 210747 176842 118240 76482 -76019 -242417 -243610 -224804 69515 344198 445996
19754 445996 173979 29082 -54582 98967 33167 171884 297420 329153 364232 252028
19744 252028 3648 -178750 -134208 41355 22136 -148693 -260598 -193853 94111 -1999
19734 -1999 -205108 -107091 -222810 -121345 32124 -84403 -92533 76115 386081 402509 31128
$$ packed form
19809E5713j57430l2880N5701K17957L82m7719l9053m3281o5194R3197P9068L4099
19797A50560J37131P2675j02602P0635K33545j16766j06499j31523k09212o7746
19787f9802P0443L8485q0722j24867J90808n8544k2938k495q7181Q2215M4631
19776a9967k084o1306k03012L13518J15320P5551J0698j43320o4852K3259K19064
19765B62869n2122l3905n8602m1758j52501j66398j193J8806K94319K74683J01798
19754D45996k72017j44897q3664J53549o5800J38717J25536L1733L5079j12204
19744B52028k48380j82398M4542J75563j9219j70829j11905O6745K87964r6110
19734a999k03109R8017j15719J01465J53469j16527q130J68648L09966J6428l71381
$$ plain form
19723 31128 265108 372111 117110 -100887 -293098 -208669 -245317 -33204 -181399 -205958
19713 -205958 -63769 117413 -7596 -264728 -274394 -150407 -36980 -43752 78056 79653 177107
19702 177107 354604 73182 -166641 45703 325092 230615 35554 -97575 -12279 -104238
19692 -104238 -18443 -149534 -21634 115578 252741 357578 300753 107521 47257 -167673
19682 -167673 -174612 54443 51552 -52919 -57865 -15655 -55151 134595 171625 138325 -47916
19671 -47916 -178115 -140964 -80955 -85457 50645 38391 56491 -84981 -141746 66260 188652
19660 188652 135201 78234 21273 36670 208034 318874 438393 459664 326183 220495
19650 220495 179656 303336 253351 293357 268486 188443 -13934 25086 234427 190785 175273
$$ packed form
19723C1128K33980J07003k55001k17997j92211Q4429l6648K12113j48195k4559
19713b05958J42189J81182j25009k57132r666J23987J13427o772J21808J597R7454
19702A77107J77497k81422k39823K12344K79389r4477j95061j33129Q5296r1959
19692a04238Q5795j31091J27900J37212J37163J04837n6825j93232o0264k14930
19682a67673o939K29055k891j04471m946M2210l9496J89746L7030l3300j86241
19671d7916j30199L7151O0009m502J36102j2254J8100j41472n6765K08006J22392
19660A88652n3451n6967n6961J5397J71364J10840J19519K1271j33481j05688
19650B20495m0839J23680m9985M0006k4871q0043k02377L9020K09341m3642j5512
$$ plain form
19639 175273 261255 127842 -48756 -2830 -205841 -87213 -77594 21739 -29383 34876 293110
19628 293110 434212 407869 292980 95937 119206 416019 508018 541261 285730 131230
19618 131230 78518 64322 139271 -99417 18158 276143 371327 324154 133711 104550 242014
19607 242014 266740 28316 -169505 -154353 28281 -135489 -51224 110024 -61710 -5326
19597 -5326 216606 31848 -323453 -255878 -70572 67863 -256409 -479308 -439718 -314910
19587 -314910 24159 224310 299960 218621 -142324 -234173 1358 403315 442802 416653
19577 416653 124476 -47235 132899 108071 195830 353624 216004 16704 19698 20624 37103
19566 37103 -24021 163029 173702 152011 114398 -73219 51795 160351 275740 123178
$$ packed form
19639A75273Q5982j33413j76598M5926k03011J18628R619R9333n1122O4259K58234
19628B93110J41102k6343j14889j97043K3269K96813R1999L3243k55531j54500
19618A31230n2712j4196P4949k38688J17575K57985R5184m7173j90443k9161J37464
19607B42014K4726k38424j97821J5152J82634j63770Q4265J61248j71734N6384
19597e326K21932j84758l55301O7575J85306J38435l24272k22899L9590J24808
19587c14910L39069K00151P5650q1339l60945r1849K35531M01957L9487k6149
19577D16653k92177j71711J80134k4828Q7759J57794j37620j99300K994R26J6479
19566C7103o1124J87050J0673k1691l7613j87617J25014J08556J15389j52562
$$ plain form
19556 123178 -14445 24716 86519 274194 210401 143607 -132764 -20585 -2621 -347626
19546 -347626 -362304 -174968 37673 174016 179891 -107075 -272807 -338051 -114700 147132
19536 147132 59081 -181481 -67717 186631 288847 399333 279815 7375 2033 -12581
19526 -12581 -39359 -51905 -45667 -159836 -130886 -66275 -147399 -305848 -319622 -188160 -73802
19515 -73802 -185107 -158685 -259651 -418769 -394261 -203378 -304554 -257805 74934 -89564
19505 -89564 -386173 -436509 -256438 -51342 84169 77120 -79019 -41991 -82447 7424 68396
19494 68396 191368 295732 297218 63908 67901 -37429 -14916 92607 72205 130473 370711
19483 370711 359478 55630 138040 80965 59510 -23863 -108297 8827 259068 156846 47571
$$ packed form
19556A23178j37623L9161O1803J87675o3793o6794k76371J12179J7964l45005
19546c47626j4678J87336K12641J36343N875k86966j65732o5244K23351K61832
19536A47132q8051k40562J13764K54348J02216J10486j19518k72440n342j4614
19526a2581k6778j2546O238j14169K8950O4611q1124j58449j3774J31462J14358
19515g3802j11305K6422j00966j59118K4508J90883j01176M6749L32739j64498
19505h9564k96609n0336J80071K05096J35511p049j56139L7028m0456Q9871O0972
19494F8396J22972J04364J486k33310L993j05330K2513J07523k0402N8268K40238
19483C70711j1233l03848Q2410n7075k1455q3373q4434J17124K50241j02222j09275
$$ plain form
19472 47571 -236814 -296694 -324511 -318144 -235296 -111574 -67696 -1212 9323 363123 421807
19461 421807 238559 232501 465781 497217 658536 499280 136651 35921 -151388 -413913
19451 -413913 -263914 -75866 -1120 -56608 -120598 115376 303701 201345 238867 96517
19441 96517 -212522 -247605 3374 26009 155353 98990 92148 -56582 -2890 -94252 -362675
19430 -362675 -374174 -87202 1033 -86275 -186179 -170615 146393 213361 146105 297141 190140
19419 190140 -24831 47595 -9345 -225271 -486466 -399587 -244140 -13676 98160 -55083
19409 -55083 -261838 -316817 -228291 -83164 269976 317201 82331 9560 42311 155938 65332
19398 65332 -141113 -28538 194612 430632 258798 113761 -229694 -391922 -245894 11667
$$ packed form
19472D7571k84385n9880k7817O367Q2848J23722M3878O6484J0535L53800N8684
19461D21807j83248o058K33280L1436J61319j59256l62629j00730j87309k62525
19451d13913J49999J88048P4746n5488o3990K35974J88325j02356L7522j42350
19441I6517l09039l5083K50979K2635J29344n6363o842j48730N3692r1362k68423
19430c62675j1499K86972Q8235q7308r9904J5564L17008O6968o7256J51036j07001
19419A90140k14971P2426n6940k15926k61195Q6879J55447K30464J11836j53243
19409e5083k06755n4979Q8526J45127L53140M7225k34870p2771L2751J13627r0606
19398F5332k06445J12575K23150K36020j71834j45037l43455j62228J46028K57561
$$ plain form
19388 11667 -137320 -343808 -347830 -303704 -289460 -163886 -32642 -146399 -163315 -14615 -82838
19377 -82838 242558 111595 44670 69646 5108 -270838 -247377 5116 -178918 -26762
19367 -26762 149431 367521 351150 398116 404328 347167 289248 317811 289159 280322 241187 140570
19355 140570 -10468 -79741 -46872 -108918 -29105 68700 45899 66936 236562 233842 96296
19344 96296 -63521 -110780 166214 163006 -29260 2935 -63920 -137183 -222276 -180039 64735
19333 64735 -41304 -109574 77257 -224137 -225527 -8069 16199 -108621 81822 176609 328760
19322 328760 45310 -194689 37477 425666 594847 508380 343303 241327 377214 615871
19312 615871 747140 653616 439333 248484 288734 406152 598427 573522 518809 345782
$$ packed form
19388A1667j48987k06488m022M4126J4244J25574J31244j13757j6916J48700o8223
19377h2838L25396j30963o6925K4976o4538k75946K3461K52493j84034J52156
19367b6762J76193K18090j6371M6966O212n7161n7919K8563k8652q837l9135j00617
19355A40570j51038o9273L2869o2046P9813R7805k2801K1037J69626k720j37546
19344I6296j59817m7259K76994l208j92266L2195o6855p3263q5093M2237K44774
19333F4735j06039o8270J86831l01394j390K17458K4268j24820J90443R4787J52151
19322C28760k83450k39999K32166L88189J69181q6467j65077j01976J35887K38657
19312F15871J31269r3524k14283j90849M0250J17418J92275k4905n4713j73027
$$ plain form
19302 345782 282491 378050 409223 231781 44352 -51472 116146 130981 105407 100804 212631
19291 212631 133482 207150 122424 236969 385682 270688 411935 274492 183260 338583
19281 338583 274505 248759 274683 186151 365500 192456 -110890 204713 345059 457913
19271 457913 350004 216510 159541 123716 252751 196334 66224 222095 408491 580651
19261 580651 776048 838140 931532 1006028 856296 689326 654397 736343 645252 482892 737771
19250 737771 722947 693384 700523 469413 568543 572190 505986 468223 237647 312494 570634
19239 570634 601227 370258 218011 160427 326991 416793 292643 63720 15293 78240
19229 78240 233398 178134 108332 170442 214672 -35499 -199346 -320105 -363712 -221292 48244
$$ packed form
19302C45782o3291R5559L1173j77442j87429r5824J67618J4835k5574m603J11827
19291B12631p9149P3668q4726J14545J48713j14994J41247j37443r1232J55323
19281C38583o4078k5746K5924q8532J79349j73044l03346L15603J40346J12854
19271D57913j07909j33494n6969l5825J29035n6417j30110J55871J86396J72160
19261E80651J95397O2092R3392P4496j49732j66970l4929Q1946r1091j62360K54879
19250G37771j4824k9563P139k31110R9130L647o6204l7763k30576P4847K58140
19239E70634L0593k30969j52247n7584J66564Q9802j24150k28923m8427O2947
19229G8240J55158n5264o9802O2110M4230k50171j63847j20759m3607J42420K69536
$$ plain form
19218 48244 133101 188206 215153 -28997 13089 -153592 -203841 45766 19406 70299 -67992
19207 -67992 84206 243746 120653 -19230 -9753 84023 -27194 79667 247088 200467
19197 200467 -23751 -45721 -89676 90073 21243 6692 178612 244032 -12180 -173845
19187 -173845 -73467 51645 64592 -166567 57659 262032 303514 335740 333508 393724 338973
19176 338973 297260 116755 -264000 -92880 -10369 179951 168982 197704 369476 330411
19166 330411 351489 289537 86930 17220 -25027 -49075 -15534 2633 98450 52669 205411
19155 205411 246481 418784 531619 267860 191868 341835 376925 437046 494948 699945
19145 699945 714327 375090 217679 47056 -74429 -148491 -42187 201724 303119 153659
$$ packed form
19218D8244Q4857N5105K6947k44150M2086j66681n0249K49607k6360N0893j38291
19207f7992J52198J59540j23093j39883R477R3776j11217J06861J67421m6621
19197B00467k24218k1970m3955J79749o8830j4551J71920O5420k56212j61665
19187a73845J00378J25112J2947k31159K24226K04373M1482L2226k232O0216n4751
19176C38973m1713j80505l80755J71120Q2511J90320j0969K8722J71772l9065
19166C30411K1078o1952k02607o9710m2247k4048L3541J8167R5817m5781J52742
19155B05411M1070J72303J12835k63759p5992J49967L5090O0121N7902K04997
19145F99945J4382l39237j57411j70623j21485p4062J06304K43911J01395j49460
$$ plain form
19135 153659 -171443 -282634 -97739 215871 388257 493033 508105 234297 94219 138195
19125 138195 249973 349839 215073 229132 353651 420137 622173 682516 921862 766811
19115 766811 756373 784221 583600 529808 163791 -52426 385043 626630 625670 602563 810413
19104 810413 715168 570325 265469 105351 33179 118940 97895 145286 -21905 244796
19094 244796 593976 589593 184583 50081 14144 22053 191179 248989 193483 66162 -204120
19083 -204120 -316402 -269326 -217726 -289055 -126308 -22252 -67772 236910 378254 288711
19073 288711 414421 316711 394825 420833 263541 504239 601652 705425 713167 594694 449688
19062 449688 311675 427928 247225 187490 43194 301681 344363 361661 356103 252544
$$ packed form
19135A53659l25102j11191J84895L13610J72386J04776J5072k73808j40078M3976
19125A38195J11778R9866j34766J4059J24519O6486K02036O0343K39346j55051
19115G66811j0438K7848k00621n3792l66017k16217M37469K41587r60k3107K07850
19104H10413r5245j44843l04856j60118p2172Q5761k1045M7391j67191K66701
19094B44796L49180m383m05010j34502l5937P909J69126N7810n5506j27321k70282
19083b04120j12282M7076N1600p1329J62747J04056m5520L04682J41344q9543
19073B88711J25710r7710P8114K6008j57292K40698R7413J03773P742j18473j45006
19062D49688j38013J16253j80703n9735j44296K58487M2682J7298n558j03559
$$ plain form
19052 252544 163630 136883 211417 298260 577111 680497 325823 42422 -12337 -108594 -306097
19041 -306097 -209781 -155649 23199 258627 500457 517534 339130 126814 11701 -139637
19031 -139637 -139302 30898 120288 -57300 -16729 -22858 146705 339619 557652 553205 545589
19020 545589 500742 459636 474494 464964 465312 457245 496826 470751 284850 178687 111353 142533
19008 142533 249630 127602 206402 418224 475026 210084 316995 469456 528089 530788
18998 530788 305388 294502 369299 153834 -34993 -25113 350745 580176 449162 377574
18988 377574 227948 297904 326216 289518 323711 346014 217624 276791 361014 364138 332963
18977 332963 197290 336367 453419 273566 77816 -77633 -77733 172509 374635 341074
$$ packed form
19052B52544q8914k6747P4534Q6843K78851J03386l54674k83401n4759r6257j97503
19041c06097R6316N4132J78848K35428K41830J7077j78404k12316j15113j51338
19031a39637L35J70200Q9390j77588M0571o129J69563J92914K18033m447p616
19020E45589m4847m1106J4858r530L48q067L9581k6075j85901j06163o7334L1180
19008A42533J07097j22028P8800K11822N6802k64942J06911J52461N8633K699
18998E30788k25400j0886P4797k15465j88827R880L75858K29431j31014p1588
18988C77574j49626O9956K8312l6698L4193K2303j28390N9167Q4223L124l1175
18977C32963j35673J39077J17052j79853j95750j55449j00K50242K02126l3561
$$ plain form
18967 341074 146906 334704 595992 413841 272445 244335 139160 402710 539426 651280
18957 651280 571089 469430 384760 569395 602608 720410 820131 804183 702986 673891 854518
18946 854518 953930 901666 923658 723107 637571 640304 718671 847298 823415 983436 1287472
18935 1287472 1369001 1164107 953032 750727 696116 479068 189269 431293 443615 202328
18925 202328 -6805 19883 322464 585244 887789 724470 217500 73491 25678 -68042
18915 -68042 264898 657170 598019 431053 459946 555522 642025 720691 688030 680693 628453
18904 628453 590423 408933 161393 250410 620409 693989 489594 362265 315276 393572
18894 393572 269853 466988 564341 812253 708710 635076 840114 917358 817522 799464
$$ packed form
18967C41074j94168J87798K61288j82151j41396k8110j05175K63550J36716J11854
18957F51280q0191j01659q4670J84635L3213J17802R9721j5948j01197k9095J80627
18946H54518R9412n2264K1992k00551q5536K733P8367J28627k3883J60021L04036
18935A287472Q1529k04894k11075k02305n4611k17048k89799K42024J2322k41287
18925B02328k09133K6688L02581K62780L02545j63319n06970j44009m7813r3720
18915f8042L32940L92272n9151j66966K8893R5576Q6503P8666l2661p337n2240
18904F28453l8030j81490k47540Q9017L69999P3580k04395j27329m6989P8296
18894C93572j23719J97135R7353K47912j03543p3634K05038P7244r9836j8058
$$ plain form
18884 799464 913274 812129 551789 231059 130089 346346 425026 538458 503874 90053
18874 90053 209148 316049 219793 167628 248531 521298 528207 294289 254830 242038 305920
18863 305920 445952 688386 686835 844896 786020 663687 507718 712289 722717 664660
18853 664660 524785 667643 660065 371860 569328 523742 559392 626856 610077 846387 793166
18842 793166 865439 767158 477794 520444 624248 638027 876188 1152753 929302 1073673
18832 1073673 1121270 1053346 1034896 1019799 1072958 1066936 1137868 1524311 1879532 2015471 2006327
18821 2006327 2035390 2239306 2248300 2389384 2548040 2492366 2432255 2963456 3438399 3655194
18811 3655194 3742414 4392174 4630612 4941571 5538331 6196752 7048261 8108524 9230359
$$ packed form
18884G99464J13810j01145k60340l20730j00970K16257P8680J13432l4584m13821
18874I0053J19095J06901r6256n2165Q0903K72767O909k33918l9459j2792O3882
18863C05920J40032K42434j551J58061n8876j22333j55969K04571J0428n8057
18853F64660j39875J42858p578k88205J97468m5586L5650O7464j6779K36310n3221
18842G93166P2273r8281k89364M2650J03804J3779K38161K76565k23451J44371
18832A073673M7597o7924j8450j5097N3159o022P0932L86443L55221J35939r144
18821B006327K9063K03916Q994J41084J58656n5674o0111N31201M74943K16795
18811C655194Q7220O49760K38438L10959N96760O58421Q51509J060263J121835
$$ plain form
18802 9230359 10324143 12482942 15486228 18989856 24078002 31518224 41395199 50815875
18794 50815875 56377144 58785972 59403021 59082277 57588103 54928283 51282394 47887082
18786 47887082 47627323 52166445 61317256 70665416 76904591 80083642 76643384 66578385
18778 66578385 54658454 42002114 30643480 22837741 17958435 14705613 12479440 11239614
18770 11239614 10371634 9716242 9470751 9784865 10074613 9896311 9538401 8907775 8447471
18761 8447471 8258165 8346069 8477150 9063891 9706793 10932913 12861054 15619979 19136968
18752 19136968 23574326 29539008 36959588 46083136 55202193 63036852 68913154 73917600
18744 73917600 76151581 73128234 66510440 57958344 50094214 46292260 47434310 53339228
$$ packed form
18802I230359J093784K158799L003286L503628N088146P440222R876975R420676
18794E0815875N561269K408828O17049l20744j494174k659820l645889l395312
18786D7887082k59759M539122R150811R348160O239175L179051l440258j0064999
18778F6578385j1919931j2656340j1358634p805739m879306l252822k226173j239826
18770A1239614q67980o55392k45491L14114K89748j78302l57910o30626m60304
18761H447471j89306Q7904J31081N86741O42902J226120J928141K758925L516989
18752A9136968M437358N964682P420580R123548R119057P834659N876302N004446
18744G3917600K233981l023347o617794q552096p864130l801954J142050N904918
$$ plain form
18736 53339228 64783962 78970532 90351632 96918940 96636142 86461203 71101573
18729 71101573 54397301 39031675 27550479 20201550 15322213 12301173 10296149 8937223
18721 8937223 7734585 6835749 6152616 5542217 5088476 4548554 4138169 3642185 3021511
18712 3021511 2845301 2790383 2768685 2577697 2520723 2490038 2349677 2478968 2615462 2703728
18702 2703728 2633043 2399906 2155310 1839943 1582858 1434770 1464696 1596996 1596860 1494883
18692 1494883 1351463 1267166 1321776 1269310 1150600 1241561 1086940 891327 748183 961115
18682 961115 1289009 1402340 1300042 1098321 1223904 1241817 1196259 1182627 1067181 948345
18672 948345 812179 688860 647213 553631 670135 722707 850785 1032255 1014415 975705
$$ packed form
18736E3339228J1444734J4186570J1381100O567308k82798j0174939j5359630
18729G1101573j6704272j5365626j1481196p348929m879337l021040k005024j358926
18721H937223j202638q98836o83133o10399m53741n39922m10385m95984o20674
18712C021511j76210n4918k1698j90988n6974l0685j40361J29291J36494Q8266
18702B703728p0685k33137k44596l15367k57085j48088K9926J32300j36j01977
18692A494883j43420q4297N4610n2466j18710R0961j54621j95613j43144K12932
18682I61115L27894J13331j02298k01721J25583J7913m5558j3632j15446j18836
18672I48345j36166j23319m1647r3582J16504N2572J28078J81470j7840l8710
$$ plain form
18662 975705 1067390 884821 800710 796116 731534 822710 1059226 940616 964095 763822 707167
18651 707167 573560 530169 620582 573288 583554 683713 636380 561278 653240 684748 815382
18640 815382 746562 730427 721166 557775 505868 561943 721314 891669 1104672 1123998 1196402
18629 1196402 1082421 986265 855559 852388 980539 1252043 1315350 1410962 1166053 1145268
18619 1145268 1243155 979702 748834 1031488 1355783 1155497 934522 794251 714349 893731
18609 893731 897276 876256 891846 1053714 1102888 969168 1010814 860095 647273 646193 763309
18598 763309 795319 821361 979956 1051931 1109681 771475 835394 985652 1091083 1204946
18588 1204946 1253707 1343998 1216549 1248954 1337637 1416136 1337484 1090932 838633 906414 1033213
$$ packed form
18662I75705R1685j82569q4111m594o4582R1176K36516j18610K3479k00273n6655
18651G07167j33607m3391R0413m7294J0266J00159m7333p5102R1962L1508J30634
18640H15382o8820j6135r261j63391n1907N6075J59371J70355K13003J9326P2404
18629A196402j13981r6156j30706l171J28151K71504O3307R5612k44909k0785
18619A145268R7887k63453k30868K82654L24295k00286k20975j40271p9902J79382
18609H93731L545k1020J5590J61868M9174j33720M1646j50719k12822j080J17116
18598G63309L2010K6042J58595P1975N7750l38206O3919J50258J05431J13863
18588A204946M8761R0291j27449L2405Q8683P8499p8652k46552k52299O7781J26799
$$ plain form
18577 1033213 1096213 1187259 1163892 1218471 1168933 1029415 911403 747884 715314 699097 716502
18566 716502 978261 1305542 1345387 1284247 1013520 1092518 1280494 1437860 1585242 1520498
18556 1520498 1642273 1673080 1578779 1620126 1395195 1429860 1414896 1543400 1518407 1552671 1653573
18545 1653573 1744404 1804735 1771902 1781448 2017624 1884352 1896898 1939646 2102460 2149978 2066552
18534 2066552 1940899 2022843 2278540 2369328 2407248 2176066 2048108 1940133 1948432 2092010
18524 2092010 2315447 2376662 2249830 2353539 2443331 2367433 2483855 2505025 2661810 2793171
18514 2793171 2888324 2815536 2914986 2976816 3156271 3354390 3334100 3309385 3342949 3267640 3340846
18503 3340846 3830855 4016433 4098321 4534987 4951733 5031927 5231333 5746947 6258948 7041793
$$ packed form
18577A033213O3000R1046k3367N4579m9538j39518j18012j63519l2570j6217J7405
18566G16502K61759L27281L9845o1140k70727P8998J87976J57366J47382o4744
18556A520498J21775L0807r4301M1347k24931L4665j4964J28504k4993L4264J00902
18545A653573R0831O0331l2833R546K36176j33272J2546M2748J62814M7518q3426
18534B066552j25653Q1944K55697R0788L7920k31182j27958j07975Q299J43578
18524B092010K23437O1215j26832J03709Q9792p5898J16422K1170J56785J31361
18514B793171R5153p2788R9450O1830J79455J98119k0290k4715L3564p5309P3206
18503C340846M90009J85578Q1888M36666M16746Q0194J99406N15614N12001P82845
$$ plain form
18493 7041793 7895882 9232373 10915580 13173638 16171439 20573088 26277204 31156620
18485 31156620 32773956 31089255 26997266 22346247 19243086 17730822 17525125 18775111
18477 18775111 21480753 25776964 31088383 34743515 35035272 32154190 26913781 21486710
18469 21486710 17441135 15021708 13550070 12719518 12320878 12001043 12148584 12076098 12062147
18460 12062147 12428019 12849016 13084071 13342629 13955716 14478585 14994364 15777970 16529953
18451 16529953 17465343 18874655 20194073 21984635 23703922 25848846 28805837 32432230
18443 32432230 37369815 43965397 53224236 65573640 79661719 91113613 97471910 100750794
18435 100750794 100459061 97085591 91858781 85929338 81120717 79032148 80754806 86270930
$$ packed form
18493G041793Q54089J336491J683207K258058K997801M401649N704116M879416
18485C1156620J617336j684701m091989m651019l103161j512264k05697J249986
18477A8775111K705642M296211N311419L655132K91757k881082n240409n427071
18469B1486710m045575k419427j471638q30552l98640l19835J47541p2486j3951
18460A2062147L65872M20997K35055K58558O13087N22869N15779P83606P51983
18451A6529953R35390J409312J319418J790562J719287K144924K956991L626393
18443C2432230M937585O595582R258839J2349404J4088079J1451894O358297L278884
18435A00750794k91733l373470n226810n929443m808621k088569J722658N516124
$$ plain form
18427 86270930 95000452 106767410 118146307 124454401 124622880 118442251 109099848 100214397
18419 100214397 93446955 89018590 86410352 84106279 81872436 79758969 77292904 74707048
18411 74707048 72401778 69908789 66904455 63709427 60395687 56905082 53931092 51105410
18403 51105410 48610033 46353681 43837489 41602357 39804551 38318167 37175765 36371852
18395 36371852 36679518 37815027 39754287 43391238 48984233 57544223 69467030 82812759
18387 82812759 91269195 90602909 82118905 68997806 56053387 46936315 42709736 42305832
18379 42305832 44926441 50751775 60011105 70462267 76887019 75551535 67226996 54348577
18371 54348577 41347988 31398369 24704669 20220355 17140257 14970968 13265818 11971869
$$ packed form
18427H6270930Q729522J1766958J1378897O308094J68479o180629r342403q885451
18419A00214397o767442m428365k608238k304073k233843k113467k466065k585856
18411G4707048k305270k492989l004334l195028l313740l490605k973990k825682
18403E1105410k495377k256352k516192k235132j797806j486384j142402q03913
18395C6371852L07666J135509J939260L636951N592995Q559990J1922807J3345729
18387H2812759Q456436o66286q484004j3121099j2944419r117072m226579m03904
18379D2305832K620609N825334R259330J0451162O424752j335484q324539j2878419
18371E4348577j3000589r949619o693700m484314l080098k169289j705150j293949
$$ plain form
18363 11971869 10859397 9958018 9052659 8722603 8465329 7962509 7584847 7564282 7260715
18354 7260715 6915122 6644410 6562405 6212002 5894960 6066007 5937445 5573131 5107236 4602060
18344 4602060 4511942 4417375 4292355 4107853 3978944 4032559 3987108 3852357 3798493 3721927
18334 3721927 3538243 3720422 3816329 3814039 3885198 3790622 3472160 3465063 3452054 3612871 3704067
18323 3704067 3594266 3509364 3220490 3284394 3609030 3807980 3566292 3257279 3325270 3550924
18313 3550924 3902899 4072776 4028146 4062094 3832924 4068226 4288275 4271243 4720122 4945562
18303 4945562 5003856 4853510 4842866 4942163 5204194 5526762 5951240 6611517 7733653 9213559
18293 9213559 11269593 14095399 17621324 22601693 29563421 38856068 48858027 55613265
$$ packed form
18363A1971869j112472r01379r05359l30056k57274n02820l77662k0565l03567
18354G260715l45593k70712q2005l50403l17042J71047j28562l64314m65895n05176
18344D602060r0118r4567j25020j84502j28909N3615m5451j34751n3864p6566
18334C721927j83684J82179R5907k290P1159r4576l18462p097j3009J60817R1196
18323C704067j09801q4902k88874O3904L24636J98950k41688l09013O7991K25654
18313C550924L51975J69877m4630L3948k29170K35302K20049j7032M48879K25440
18303D945562N8294j50346j0644R9297K62031L22568M24478O60277J122136J479906
18293I213559K056034K825806L525925M980369O961728R292647J0001959O755238
$$ plain form
18285 55613265 57096613 54520977 49797444 46713963 48414099 55390787 66449584 77089502
18277 77089502 80801061 75643066 63617827 48287145 34789121 25103115 19137662 15387506
18269 15387506 12690155 10970812 10065659 9231374 8677382 8091500 7589462 7717948 7826405
18260 7826405 7716962 7684585 7771300 7914982 8412465 8877610 9186007 9579384 10227879 10939912
18250 10939912 11927590 12930036 14349820 16529889 19405516 23118644 27987736 34416550
18242 34416550 43345685 55259474 69847472 83156822 91919288 96190027 97905048 100034788
18234 100034788 107413561 121783679 140666878 157957331 166118384 160582586 145527017
18227 145527017 127278179 111283968 99449286 91689770 86741784 83790195 82166048
$$ packed form
18285E5613265J483348k575636m723533l083481J700136O976688J1058797J0639918
18277G7089502L711559n157995j2025239j5330682j3498024r686006n965453l750156
18269A5387506k697351j719343r05153q34285n53992n85882n02038J28486J08457
18260G826405j09443l2377Q6715J43682M97483M65145L08397L93377O48495P12033
18250A0939912R87678J002446J419784K180069K875627L713128M869092O428814
18242C4416550Q929135J1913789J4587998J3309350Q762466M270739J715021K129740
18234A00034788P378773J4370118J8883199J7290453Q161053n535798j5055569
18227A45527017j8248838j5994211j1834682p759516m947986k951589j624147
$$ plain form
18220 82166048 80597343 78481073 76605802 74285936 70624796 65868413 61016633 56992184
18212 56992184 54820693 53537221 52126894 50062037 46884181 42680869 38178286 33439556
18204 33439556 29396882 26476142 24560922 23046040 21961879 20985524 20289847 20068317
18196 20068317 20216784 21028908 23358950 27573997 33766962 41205685 46811989 48646912
18188 48646912 47242867 43802828 41055780 40710626 43778034 49412720 55468287 59250492
18180 59250492 60387459 58504525 54883286 51079176 47096026 43217268 40251350 38844858
18172 38844858 39928182 43324664 47580096 51201358 53032990 52306351 48793261 43763246
18164 43763246 39178580 35653059 34343410 34930463 36132350 36990276 36300807 33820110
$$ packed form
18220H2166048j568705k116270j875271k319866l661140m756383m851780m024449
18212E6992184k171491j283472j410327k064857l177856m203312m502583m738730
18204C3439556m042674k920740j915220j514882j084161r76355o95677k21530
18196B0068317J48467Q12124K330042M215047O192965P438723N606304J834923
18188D8646912j404045l440039k747048l45154L067408N634686O055567L782205
18180E9250492J136967j882934l621239l804110l983150l878758k965918j406492
18172C8844858J083324L396482M255432L621262J831632p26639l513090n030015
18164D3763246m584666l525521j309649N87053J201887Q57926o89469k480697
$$ plain form
18156 33820110 30299391 26138289 21925103 18735945 16712683 15662378 14678281 14018285
18148 14018285 13056284 11877399 10540811 9191924 7857818 6768568 6002984 5625824
18140 5625824 5235475 4858401 4581749 4261872 4273497 4280844 4452757 4808503 5175401 5399444
18130 5399444 5604450 6116970 6511593 6885730 7622442 8386911 9385062 10887633 12515251
18121 12515251 14346660 16488022 19615916 23849670 29834129 38463288 51423999 70426475
18113 70426475 96835301 134281504 189559287 275167806 388180646 452527935 436493299
18106 436493299 372663606 266290788 167707794 106763620 72963577 53208870 40641423
18099 40641423 31664108 25262833 20827659 17841069 15342547 13121707 11638664 10440614
$$ packed form
18156C3820110l520719m161102m213186l189158k023262j050305r84097o59996
18148A4018285r62001j178885j336588j348887j334106j089250p65584l77160
18140E625824l90349l77074k76652l19877J1625P347J71913L55746L66898K24043
18130E399444K05006N12520L94623L74137P36712P64469R98151J502571J627618
18121A2515251J831409K141362L127894M233754N984459Q629159J2960711J9002476
18113G0426475K6408826L7446203N5277783Q5608519J13012840O4347289j6034636
18106D36493299o3829693j06372818r8582994o0944174l3800043j9754707j2567447
18099D0641423q977315o401275m435174k986590k498522k220840j483043j198050
$$ plain form
18091 10440614 9296712 8420078 7691335 6893352 6233491 5693001 5243606 4576607 4095097
18082 4095097 4013040 3875598 3826947 3460931 3147821 2942428 2689459 2668511 2450178 2141409
18072 2141409 2081728 1972893 1704720 1411275 1296056 1103527 854248 810623 873076 853666
18062 853666 835889 825071 947612 1064130 1142544 1017264 1011307 998109 1035574 979371 806860
18051 806860 827181 816057 628056 600140 664640 788758 919844 654117 477070 335146
18041 335146 377721 397495 532948 790104 542970 275005 292106 126094 -277591 -446370
18031 -446370 -153012 125268 250318 267122 162500 136262 219080 352546 495246 532133
18021 532133 257321 -31256 96014 263155 476902 523758 459763 351444 221725 201962
$$ packed form
18091A0440614j143902q76634p28743p97983o59861n40490m49395o66999m81510
18082D095097q2057j37442m8651l66016l13110k05393k52969k0948k18333l08769
18072B141409n9681j08835k68173k93445j15219j92529k49279m3625O2453j9410
18062H53666j7777j0818J22541J16518P8414j25280n957j3198L7465n6203j72511
18051H06860K0321j1124j88001k7916O4500J24118J31086k65727j77047j41924
18041C35146M2575J9774J35453K57156k47134k67965J7101j66012m03685j68779
18031d46370K93358K78280J25050J6804j04622k6238Q2818J33466J42700L6887
18021E32133k74812k88577J27270J67141K13747M6856o3995j08319j29719j9763
$$ plain form
18011 201962 102013 406979 491947 254424 114991 243200 32463 -95308 97230 56473
18001 56473 224260 53127 -183524 -217055 -53881 215915 224956 213137 465392 738053
17991 738053 541938 310282 232477 277900 617925 606803 326926 303630 510344 656527
17981 656527 802531 611368 207028 408465 309748 84496 -67441 141361 88692 82642
17971 82642 17413 52181 72013 -14695 -926 238731 14731 -45271 -68352 -272323 -442186
17960 -442186 -384046 29917 285054 355939 336956 321482 396821 491834 384270 289735 394556
17949 394556 402260 526379 522020 559653 468329 574274 484029 239898 106328 69066 115686
17938 115686 185210 203221 91955 -33990 -165682 -174713 -237074 -276350 -66722 -192798 -235396
$$ packed form
18011B01962r9949L04966Q4968k37523j39433J28209k10737j27771J92538m0757
18001E6473J67787j71133k36651l3531J63174K69796R041j1819K52255K72661
17991G38053j96115k31656p7805M5423L40025j1122k79877k3296K06714J46183
17981F56527J46004j91163m04340K01437r8717k25252j51937K08802n2669o050
17971H2642o5229L4768J9832q6708J3769K39657k24000o0002k3081k03971j69863
17960d42186N8140M13963K55137P0885j8983j5474P5339R5013j07564r4535J04821
17949C94556P704J24119m359L7633r1324J05945r0245k44131j33570l7262M6620
17938A15686O9524J8011j11266j25945j31692r031o2361l9276K09628j26076m2598
$$ plain form
17927 -235396 -230 178003 95626 -192258 -309493 -306296 -228307 -285004 -138111 -62316 264444
17916 264444 406773 194908 105130 185540 241686 209801 252308 337370 303353 344293 409952
17905 409952 294344 371641 344886 402420 535881 844532 891238 611714 462053 269314
17895 269314 261064 294772 162604 -34979 -38086 71163 -71668 -93822 128331 282313 133732
17884 133732 79187 -43563 -74023 -34681 -47532 -118110 -161702 -261963 -310806 -61402 71193
17873 71193 84380 274487 425790 407041 298912 148201 -95095 4935 -13110 164589
17863 164589 245033 305175 250002 -17590 -73387 104338 76173 43104 178518 141892 -150316
17852 -150316 -110954 -114716 -253254 -278861 -199468 206548 307387 86626 -135917 20236
$$ packed form
17927b35396K35166J78233q2377k87884j17235L197P7989n6697J46893P5795L26760
17916B64444J42329k11865q9778Q0410N6146l1885M2507Q5062l4017M0940O5659
17905D09952j15608P7297k6755N7534J33461L08651M6706k79524j49661j92739
17895B69314q250L3708j32168j97583l107J09249j42831k2154K22153J53982j48581
17884A33732n4545j22750l0460L9342j2851p0578m3592j00261m8843K49404J32595
17873G1193J3187J90107J51303j8749j08129j50711k43296J00030j8045J77699
17863A64589Q0444O0142n5173k67592n5797J77725k8165l3069J35414l6626k92208
17852a50316L9362l762j38538k5607P9393M06016J00839k20761k22543J56153
$$ plain form
17842 20236 133561 130768 58890 116505 96899 -104265 76503 418608 270011 142963 -124315
17831 -124315 -327898 -393620 -354001 -439197 -159742 -140133 -139128 -243823 -334562 -252214 -285444
17820 -285444 -218048 -136958 -33147 37566 -200752 -294731 -143567 185968 76747 -169142
17810 -169142 -496118 -561412 -358021 -63080 -180922 -222640 -112858 42608 195475 269968
17800 269968 335697 322518 141817 -204352 -254472 68503 214579 97815 60550 -51748
17790 -51748 -284478 -177314 -14724 78514 168050 176970 17397 -16751 180138 464447 429502
17779 429502 489582 453385 381336 151124 32179 41751 136059 343174 284073 227799 342517
17768 342517 154279 183685 171240 73215 -2855 307511 671708 536354 417358 199796
$$ packed form
17842B0236J13325k793p1878N7615j9606k01164J80768L42105j48597j27048k67278
17831a24315k03583o5722L9619q5196K79455J9609J005j04695r0739Q2348l3230
17820b85444O7396Q1090J03811P0713k38318r3979J51164L29535j09221k45889
17810a69142l26976o5294K03391K94941j17842m1718J09782J55466J52867P4493
17800B69968O5729j3179j80701l46169n0120L22975J46076j16764l7265j12298
17790e1748k32730J07164J62590R3238Q9536Q920j59573l4148J96889K84309l4945
17779D29502O0080l6197p2049k30212j18945R572R4308K07115n9101n6274J14718
17768C42517j88238K9406j2445r8025p6070L10366L64197j35354j18996k17562
$$ plain form
17758 199796 288317 239923 -37490 -144556 -366059 -246242 48843 89268 15051 132913
17748 132913 -5017 -96628 -189537 -85944 79433 135441 86244 -143922 -130782 -211108 -172929
17737 -172929 -450508 -414796 -220555 48547 94855 -33116 -56694 -131457 -133889 -172826 -167224
17726 -167224 101946 275149 -121307 -152387 199941 311449 276094 163820 288986 408023
17716 408023 350021 445380 435478 627856 609991 393205 361925 342954 250684 363212 494886
17705 494886 270416 313620 222351 63884 -5968 148757 196740 257681 309683 265194 335481
17694 335481 227603 293609 354034 175243 55007 17845 -34916 5369 178428 198748 86379
17683 86379 -180735 -53476 202363 210043 -39172 42370 105999 395594 239400 -68188
$$ packed form
17758A99796Q8521m8394k77413j07066k21503J19817K95085M0425p4217J17862
17748A32913j37930r1611r2909J03593J65377N6008m9197k30166J3140q0326L8179
17737a72929k77579L5712J94241K69102M6308j27971k3578p4763k432l8937N602
17726a67224K69170J73203l96456l1080L52328J11508l5355j12274J25166J19037
17716D08023n8002R5359r902J92378j7865k16786l1280j8971r2270J12528J31674
17705D94886k24470M3204r1269j58467o9852J54725M7983O0941N2002m4489P0287
17694C35481j07878O6006O0425j78791j20236l7162n2761M0285J73059K0320j12369
17683H6379k67114J27259K55839P680k49215Q1542O3629K89595j56194l07588
$$ plain form
17673 -68188 -230773 -78881 -24388 -204485 -47805 -86176 -199067 12648 246141 89273
17663 89273 8932 -19722 -57882 -139529 58782 140519 38349 -105682 -158135 -24295 101518
17652 101518 252535 -4953 42390 209458 398129 414202 241747 176818 133400 216335
17642 216335 258012 79111 40082 174041 311812 461348 300050 25035 -141481 -48119
17632 -48119 165213 291198 327785 58303 -26733 -112762 -150116 -35472 957 -143750 -281868
17621 -281868 -273563 -120460 -125643 -170311 -174523 65322 119856 59186 40720 -59794 -80550
17610 -80550 283792 391674 281120 44496 -142254 -40226 23530 37711 -115451 -210399
17600 -210399 -79870 173004 104433 33756 18147 -23112 -53287 -102703 -79483 -203088 -145213
$$ packed form
17673f8188j62585J51892N4493j80097J56680l8371j12891K11715K33493j56868
17663H9273q0341k8654l8160q1647J98311Q1737j02170j44031n2453J33840J25813
17652A01518J51017k57488M7343J67068J88671J6073j72455o4929m3418Q2935
17642B16335M1677j78901l9029J33959J37771J49536j61298k75015j66516R3362
17632d8119K13332J25985L6587k69482q5036q6029l7354J14644L6429j44707j38118
17621b81868Q305J53103n183m4668m212K39845N4534o0670j8466j00514k0756
17610h0550L64342J07882j10554k36624j86750J02028O3756J4181j53162r4948
17600b10399J30529K52874o8571p0677j5609m1259l0175m9416K3220j23605N7875
$$ plain form
17589 -145213 -201232 -97227 -135613 -287488 -379765 48577 297677 176859 73133 99823
17579 99823 231664 358691 132329 -54110 -179269 -222898 -126815 -127224 -283976 -236998 -224505
17568 -224505 -180053 -229610 -328384 -78206 179368 67163 42003 227331 67494 62791 -60108
17557 -60108 -93359 -13891 -178222 -289546 -213421 -35452 -114353 -38426 -125805 63966 64010
17546 64010 94061 210504 176009 60651 -58722 -115675 -134712 -113262 -171421 -361149 -567175
17535 -567175 -387260 -141513 144930 -44561 -169559 -242176 -278098 -131472 -147821 -252575
17525 -252575 -190900 -402114 -564297 -485178 -131378 -3416 94210 45382 152624 252619
17515 252619 -10102 -195796 -225213 -53291 157163 247010 255735 169882 -64505 -320435
$$ packed form
17589a45213n6019J04005l8386j51875r2277M28342K49100j20818j03726K6690
17579I9823J31841J27027k26362j86439j25159m3629R6083m09j56752M6978J2493
17568b24505M4452m9557r8774K50178K57574j12205k5160J85328j59837m703j22899
17557f0108l3251P9468j64331j11324P6125J77969p8901P5927q7379J89771M4
17546F4010L0051J16443l4495j15358j19373n6953j9037K1450n8159j89728k06026
17535e67175J79915K45747K86443j89491j24998p2617l5922J46626j6349j04754
17525b52575O1675k11214j62183P9119L53800J27962R7626m8828J07242R9995
17515B52619k62721j85694k9417J71922K10454Q9847Q725q5853k34387k55930
$$ plain form
17505 -320435 -493915 -666883 -548447 -208714 -17911 -26963 -123392 -148798 -289557 -299194 -294868
17494 -294868 -298514 -219624 -281167 -264585 -139406 -51799 -227436 -172991 -148192 16681 -93705
17483 -93705 -216823 -60612 159633 157765 -60547 -112265 49195 -156150 -367813 -228079
17473 -228079 -138280 17906 -58894 156389 272693 197653 121953 -96408 -34220 -70317 10461
17462 10461 -137321 -89419 146 -215285 -346382 -183037 -36905 -225711 -34551 -43904
17452 -43904 -139479 -91048 69442 282308 250772 312419 617655 873334 1195534 1761316
17442 1761316 2283078 2332207 1875009 1318988 938657 935915 702415 315219 251129 -172619
17432 -172619 -397273 -342033 -244713 -215104 -272841 -71092 -383119 -503150 -453309 -430270 -420333
$$ packed form
17505c20435j73480j72968J18436L39733J90803r052r6429k5406j40759r637M326
17494b94868l646P8890o1543J6582J25179Q7607j75637N4445K4799J64873j10386
17483i3705j23118J56211K20245j868k18312n1718J61460k05345k11663J39734
17473b28079Q9799J56186p6800K15283J16304p5040p5700k18361O2188l6097Q0778
17462A0461j47782M7902Q9565k15431j31097J63345J46132j88806J91160r353
17452d3904r5575M8431J60490K12866l1536O1647L05236K55679L22200N65782
17442A761316N21762M9129m57198n56021l80331k742k33500l87196o4090m23748
17432a72619k24654N5240R7320K9609n7737K01749l12027j20031M9841K3039R937
$$ plain form
17421 -420333 -537570 -509000 -852061 -635374 -419505 -398741 36999 49078 -53924 -108853
17411 -108853 -443180 -628355 -540085 -225188 -226868 -257069 -56635 239535 45336 -243123
17401 -243123 -251030 36980 -55886 -326615 -426174 -323461 -281112 -406487 -495447 -555609 -491672
17390 -491672 -331461 -420365 -414969 -402440 -190221 -81454 61344 -24948 -15570 -9906 -47092
17379 -47092 -118430 -309034 -571397 -687468 -500905 -287114 -300464 -252612 58221 316597
17369 316597 199603 74176 -261203 -379217 -383088 -151680 125242 519152 501032 248303
17359 248303 268647 171017 18614 210571 218553 127465 113012 27790 -213594 -414314 -384434
17348 -384434 -315222 -103873 63910 34324 29383 -9051 114328 393581 366592 147065 155899
$$ packed form
17421d20333j17237K8570l43061K16687K15869K0764M35740J2079j03002n4929
17411a08853l34327j85175Q8270L14897j680l0201K00434K96170j94199k88459
17401b43123p907K88010r2866k70729r9559J02713M2349j25375q8960o0162O3937
17390d91672J60211q8904N396J2529K12219J08767J42798q6292R378N664l7186
17379d7092p1338j90604k62363j16071J86563K13791j3350M7852L10833K58376
17369C16597j16994j25427l35379j18014l871K31408K76922L93910j8120k52729
17359B48303K0344r7630j52403J91957P982r1088j4453q5222k41384k00720K9880
17348c84434O9212K11349J67783k9586m941l8434J23379K79253k6989k19527Q834
$$ plain form
17337 155899 186372 -10870 -268167 -532489 -441272 -299286 -265136 -129232 87041 124537
17327 124537 77331 294678 174950 -84735 -347956 -155832 -236381 -212974 -24690 -72232
17317 -72232 14436 -64492 -206575 -305049 -161604 168887 114887 140920 305925 85950 -40477
17306 -40477 36550 180654 55517 -108835 -6 -44150 -62689 -137765 -142600 -196651 -347764
17295 -347764 -161722 -47660 -67625 -23449 148186 105998 -69216 -7493 11859 191882
17285 191882 214328 169761 29794 -247154 -167743 377617 337749 79537 205008 106946
17275 106946 -231858 -106456 -76191 55651 29826 -258605 -180577 -109182 76429 158824
17265 158824 -29850 -84427 -175584 -224565 -390360 -361454 -357255 -356891 -267607 -178221 21721
$$ packed form
17337A55899L0473j97242k57297k64322R1217J41986L4150J35904K16273L7496
17327A24537m7206K17347j19728k59685k63221J92124q0549K3407J88284m7542
17317g2232Q6668p8928j42083r8474J43445L30491n4000K6033J65005k19975j26427
17306d0477P7027J44104j25137j64352J08829m4144j8539p5076m835n4051j51113
17295c47764J86042J14062j9965M4176J71635m2188j75214O1723J9352J80023
17285A91882K2446m4567j39967k76948P9411N45360l9868k58212J25471r8062
17275A06946l38804J25402L0265J31842k5825k88431P8028P1395J85611Q2395
17265A58824j88674n4577r1157m8981j65795K8906M199L64Q9284Q9386J99942
$$ plain form
17254 21721 245310 256671 169707 4574 -100310 -300956 -234902 -312423 -283685 -307260 -352137
17243 -352137 -273499 -218053 -28386 193989 18639 -163672 -71168 189665 40137 -137455
17233 -137455 2167 -37291 -236823 -206560 -378229 -231452 27842 192693 222374 167921
17223 167921 42348 35858 224483 55824 3110 -15902 112129 203392 256936 264133 189680
17212 189680 -16350 -183459 -17843 -146510 -113891 19942 -48709 -111593 -258408 -221949
17202 -221949 -104797 139244 143500 155481 -115230 -251917 88509 127420 54717 -100322
17192 -100322 -152853 -53586 -24018 34721 254156 184122 -52894 -200530 -147330 24776 331372
17181 331372 193218 -17087 -86759 -224019 -179688 -222031 -302530 -351881 -114680 -133088 -327071
$$ packed form
17254B1721K23589J1361q6964j65133j04884k00646O6054p7521K8738k3575m4877
17243c52137P8638N5446J89667K22375j75350j82311R2504K60833j49528j77592
17233a37455J39622l9458j99532L0263j71669J46777K59294J64851K9681n4453
17223A67921j25573o490J88625j68659n2714j9012J28031R1263N3544P197p4453
17212A89680k06030j67109J65616j28667L2619J33833o8651o2884j46815L6459
17202b21949J17152K44041M256J1981k70711j36687L40426L8911p2703j55039
17192a00322n2531R9267K9568N8739K19435p0034k37016j47636N3200J72106L06596
17181C31372j38154k10305o9672j37260M4331m2343q0499m9351K37201j8408j93983
$$ plain form
17170 -327071 -285013 -134882 -142309 -188253 -208724 -350009 -268205 -395973 -382583 -357315 -201248
17159 -201248 -174113 -193258 -84346 -13693 153383 193056 23509 -156259 -162922 -290417 -127784
17148 -127784 -100824 -69420 -245765 -76622 159028 321118 21902 -74472 -135302 -131358 -119760
17137 -119760 -185177 -194185 -109170 -53941 9954 -21279 -287101 -493419 -579466 -396055 -255658
17126 -255658 -237083 -332504 -63264 81187 253316 176872 -160915 -495076 -422148 -246892
17116 -246892 -126795 -270040 -194689 27623 -92844 -118170 -321015 -448244 -380969 -544327
17106 -544327 -424930 -319027 -281598 -245785 -292170 -340496 -246271 8615 43890 -63764 -208303
17095 -208303 -391604 -398018 -348154 -169235 -206129 -270401 -200724 -244701 -409279 -382153 -355054
$$ packed form
17170c27071M2058J50131p427m5944k0471j41285Q1804j27768J3390K5268J56067
17159b01248K7135j9145J08912P0653J67076L9673j69547j79768o663j27495J62633
17148a27784K6960L1404j76345J69143K35650J62090k99216r6374o0830L944J1598
17137a19760o5417r008Q5015N5229O3895l1233k65822k06318q6047J83411J40397
17126b55658J8575r5421K69240J44451J72129p6444l37787l34161P2928J75256
17116b46892J20097j43245P5351K22312j20467k5326k02845j27229O7275j63358
17106e44327J19397J05903L7429L5813m6385m8326R4225K54886L5275j07654j44539
17095b08303j83301o414M9864J78919l6894o4272O9677m3977j64578K7126K7099
$$ plain form
17084 -355054 -302318 -177706 -138604 -12643 96603 -12808 -83942 53576 4641 25039
17074 25039 -3445 -126717 8219 230638 184014 152254 -58358 -121022 155218 362633
17064 362633 349223 153348 68205 43322 82353 -3847 569 110893 237557 -101722 -195514
17053 -195514 36635 321433 306791 162649 218029 207547 300238 223753 168490 38907 -112539
17042 -112539 -305216 -185423 -149608 -141396 -246040 -20737 -32302 -74615 -67566 -97903 -256454
17031 -256454 -174507 -219057 -198681 -88570 -6422 108046 229243 128130 -52248 -222208
17021 -222208 -63276 31612 85098 122553 225648 -163857 -274575 -139051 20544 182594
17011 182594 104592 -21102 182222 127937 17396 87758 192906 -151287 -276843 -391573
$$ packed form
17084c55054N2736J24612L9102J25961J09246j09411p1134J37518m8935K0398
17074B5039k8484j23272J34936K22419m6624l1760k10612o2664K76240K07415
17064C62633j3410j95875q5143k4883L9031q6200M416J10324J26664l39279r3792
17053a95514K32149K84798j4642j44142N5380j0482R2691p6485n5263j29583j51446
17042a12539j92677J19793L5815Q212j04644K25303j1565m2313P049l0337j58551
17031b56454Q1947m4550K0376J10111Q2148J14468J21197j01113j80378j69960
17021b22208J58932R4888N3486L7455J03095l89505j10718J35524J59595J62050
17011A82594p8002j25694K03324n4285j10541P0362J05148l44193j25556j14730
$$ plain form
17001 -391573 -297993 -431641 -324785 -97907 -45986 -179727 -148545 -133142 -308963 -678000
16991 -678000 -444174 -490308 -467004 -437589 -258207 -111278 -174566 -66268 -112692 -257881
16981 -257881 -180015 -117232 54472 124668 -41 12827 198626 353868 358826 289008 227954
16970 227954 363171 338158 285436 169694 166400 18389 -146419 -257726 -111196 309359
16960 309359 279463 -84131 -252495 -270621 -312612 -100829 -28826 22163 -173446 -102191 -88077
16949 -88077 -73336 -143605 -140330 -210076 -395244 -528237 -621032 -574704 -488974 -258870 -41547
16938 -41547 -89821 -10618 77916 229396 242916 21949 159736 293957 236628 60870 -265466
16927 -265466 -333709 -353088 -490065 -331853 -83005 -233662 -126140 5768 -227475 -7223
$$ packed form
17001c91573R3580j33648J06856K26878N1921j33741L1182J5403j75821l69037
16991f78000K33826m6134K3304K9415J79382J46929o3288J08298m6424j45189
16981b57881P7866O2783J71704P0196j24709J2868J85799J55242M958o9818o1054
16970B27954J35217k5013n2722j15742l294j48011j64808j11307J46530M20555
16960C09359k9896l63594j68364j8126m1991K11783P2003N0989j95609P1255J4114
16949h8077J4741p0269L275o9746j85168j32993r2795M6328Q5730K30104K17323
16938d1547m8274P9203Q8534J51480J3520k20967J37787J34221n7329j75758l26336
16927b65466o8243j9379j36977J58212K48848j50657J07522J31908k33243K20252
$$ plain form
16917 -7223 183881 109180 159094 73892 -96186 -151938 -107139 89733 255528 163846 294930
16906 294930 359799 159803 -6336 81703 45912 -39572 -154369 -129261 -233073 -378913
16896 -378913 -318703 -337360 -77237 -40922 -90750 -162813 -142407 -354548 -453564 -248348 -66023
16885 -66023 -12381 -197323 -323360 -230005 -263168 -90375 -137576 -163295 -296469 -553036 -545956
16874 -545956 -245362 -109577 -54301 -297412 -136561 -121373 -44449 -11093 -188782 -193331 -107895
16863 -107895 -133433 -95070 -190356 -285368 -189488 -312658 -461940 -370064 -293025 -283639 -290152
16852 -290152 -380861 -505790 -379637 -190365 -3969 63851 78237 126936 227487 188939
16842 188939 23579 -7914 178839 147460 74715 54508 224758 302450 -20269 -66297 75163
$$ packed form
16917g223J91104p4701M9914q5202j70078n5752M4799J96872J65795r1682J31084
16906B94930O4869j99996j66139Q8039l5791q5484j14797K5108j03812j45840
16896c78913O0210j8657K60123L6315m9828p2063K0406k12141r9016K05216J82325
16885f6023N3642j84942j26037R3355l3163J72793m7201k5719j33174k56567P080
16874e45956L00594J35785N5276k43111J60851J5188P6924L3356j77689m549Q5436
16863a07895k5538L8363r5286r5012R5880j23170j49282R1876P7039R386o513
16852b90152r0709j24929J26153J89272J86396O7820J4386M8699J00551l8548
16842A88939j65360l1493J86753l1379p2745k0207J70250P7692l22719m6028J41460
$$ plain form
16831 75163 11723 21510 123395 156797 164594 113517 -77043 -164263 -78495 -73279 159352 401741
16819 401741 383803 590318 424246 245667 455633 377466 343625 87311 89775 -17964
16809 -17964 135539 151062 97516 13960 -239392 -224525 -407427 -156502 91119 -44658
16799 -44658 -313527 -287242 -264118 -27730 70443 84141 77815 36835 -39939 22916 247867
16788 247867 155512 10657 -50615 73100 156154 305632 169818 322950 407958 255136
16778 255136 235435 158912 -48994 -229244 -18096 -52497 21244 268427 332147 265168 151589
16767 151589 31308 34762 -211566 -241259 -67174 76008 25115 27618 -148642 -158838 -84102
16756 -84102 91249 177540 55224 184824 345653 287065 -17787 -127311 -184471 -183700 57583
$$ packed form
16831G5163o3440R787J01885L3402P797n1077j90560q7220Q5768N216K32631K42389
16819D01741j7938K06515j66072j78579K09966p8167l3841k56314K464j07739
16809a7964J53503J5523n3546q3556k53352J4867j82902K50925K47621j35777
16799d4658k68869K6285K3124K36388R8173J3698o326m0980p6774O2855K24951
16788B47867r2355j44855o1272J23715Q3054J49478j35814J53132Q5008j52822
16778B55136j9701p6523k07906j80250K11148l4401P3741K47183O3720o6979j13579
16767A51589j20281L454k46328k9693J74085J43182n0893K503j76260j0196P4736
16756h4102J75351Q6291j22316J29600J60829n8588l04852j09524n7160P71K41283
$$ plain form
16745 57583 53207 2999 58090 134209 192776 -13318 -1185 -27741 89021 40807 -72653
16734 -72653 70376 -2750 -164087 -164645 -189528 -357183 -479701 -197877 -16716 -49445 -110870
16723 -110870 -215336 -135396 37261 -125073 -207311 -105527 13130 -68215 -10487 131117
16713 131117 -16153 -71458 101140 170862 -25461 -18253 -12438 7359 -33031 -189032 -305862
16702 -305862 -128257 138198 151233 381721 289158 199017 12603 7510 121653 -4071
16692 -4071 18591 204855 237300 -27382 -139452 -81364 -67347 -126926 -24309 74273 -122560
16681 -122560 -326207 -235768 -135377 -3881 114689 -99175 -154463 -65606 -146126 -149127 -237009
16670 -237009 -83164 -103235 -186348 -183752 -16616 20896 -67530 30420 125689 16210 40393
$$ packed form
16745E7583m376n0208N5091P6119N8567k06094J2133k6556J16762m8214j13460
16734g2653J43029p3126j61337n58k4883j67655j22518K81824J81161l2729o1425
16723a10870j04466P9940J72657j62334q2238J01784J18657q1345N7728J41604
16713A31117j47270n5305J72598O9722j96323P208N815J9797m0390j56001j16830
16702c05862J77605K66455J3035K30488r2563r0141j86414n093J14143j25724
16692d071K2662J86264L2445k64682j12070N8088J4017n9579J02617R8582j96833
16681a22560k03647R0439J00391J31496J18570k13864n5288Q8857q0520l001q7882
16670b37009J53845k0071q3113K596J67136L7512q8426R7950R5269j09479K4183
$$ plain form
16659 40393 -189282 -237801 -231768 -560198 -296574 -67627 -136879 -380148 -489040 -217918
16649 -217918 -154544 38231 -3087 127465 136919 -146517 -440111 -559420 -597566 -401611
16639 -401611 -241323 -78026 -241925 -241102 -90107 -46736 -18071 47509 52634 74188 -42375
16628 -42375 197461 217537 11683 -101450 -186019 -386783 -588292 -235234 -48668 132223
16618 132223 194015 -49076 -144754 -189178 -96394 -112188 42586 352710 468481 570211
16608 570211 285544 -16728 -201800 -305475 -53748 137694 16252 -93508 -55465 -132447
16598 -132447 -142631 118913 113637 -3034 51034 -4574 -32044 -258623 -349968 -323740 -138575
16587 -138575 -51563 51946 -20002 -28262 101469 337523 259043 81241 54715 -13424 115217
$$ packed form
16659D0393k29675m8519O033l28430K63624K28947o9252k43269j08892K71122
16649b17918O3374J92775m1318J30552R454k83436k93594j19309l8146J95955
16639d01611J60288J63297j63899Q23J50995M3371K8665O5580N125K1554j16563
16628d2375K39836K0076k05854j13133q4569k00764k01509L53058J86566J80891
16618A32223O1792k43091r5678m4424R2784j5794J54774L10124J15771J01730
16608E70211k84667l02272j85072j03675K51727J91442j21442j09760L8043p6982
16598a32447j0184K61544n276j16671N4068n5608k7470k26579r1345K6228J85165
16587a38575Q7012J03509p1948q260J29731K36054p8480j77802k6526o8139J28641
$$ plain form
16576 115217 87559 67975 -119473 -78791 126891 274023 151334 -16383 -115817 -246385
16566 -246385 -306341 -265247 -188174 -161927 -108015 -4595 149538 412189 284166 255196 192174
16555 192174 269079 51150 -117244 -114293 -62185 60884 323177 271525 420626 392158 -8729
16544 -8729 120034 144106 -6878 -257201 -255517 -3935 -55047 -138699 -11285 -28980 42330
16533 42330 67472 -126065 -149212 42284 169025 195475 427368 439806 241794 204506 29925
16522 29925 12731 401473 570995 605926 308422 -40004 -281868 -393435 -278228 -417850
16512 -417850 -347821 -61292 118145 45505 161430 251089 125305 -10510 -50846 87699
16502 87699 166096 50362 119735 -56314 -286731 -318420 -203914 -55989 -36894 5473 -159492
$$ packed form
16576A15217k7658j9584j87448M0682K05682J47132j22689j67717r9434j30568
16566b46385n9956M1094P7073K6247N3912J03420J54133K62651j28023k8970o3022
16555A92174P6905k17929j68394K951N2108J23069K62293n1652J49101k8468m00887
16544h729J28763K4072j50984k50323J684K51582n1112q3652J27414j7695P1310
16533D2330K5142j93537k3147J91496J26741K6450K31893J2438j98012l7288j74581
16522B9925j7194L88742J69522L4931k97504l48426k41864j11567J15207j39622
16512d17850P0029K86529J79437p2640J15925Q9659j25784j35815m0336J38545
16502H7699P8397j15734O9373j76049k30417l1689J14506J47925J9095M2367j64965
$$ plain form
16491 -159492 -40564 -23787 30643 54199 -67939 -245380 -213507 -244534 -241601 -476148 -369832
16480 -369832 -2254 -13548 -118555 147505 92357 -125690 -52964 -93027 -27910 113417
16470 113417 -10438 -300665 -493793 -312143 -178367 -101337 99915 -29230 -171351 -248079
16460 -248079 -328340 -415362 -532677 -244593 -264662 -178746 -2886 63490 -82587 316699
16450 316699 404615 309908 334941 153264 -178156 -259174 -56891 -22360 40832 274050 374473
16439 374473 438101 265871 250982 159055 -110257 -152220 -62545 135212 130128 102183 255863
16428 255863 114866 63004 42225 970 -99586 -76048 -210719 -176263 -147963 32742 157818
16417 157818 159185 58780 70993 155390 181779 185952 340065 362735 367828 -72151 -99919
$$ packed form
16491a59492J18928J6777N4430K3556j22138j77441L1873l1027K933k34547J06316
16480c69832L67578j1294j05007K66060n5148k18047P2726m0063O5117J41327
16470A13417j23855k90227j93128J81650J33776P7030K01252j29145j42121p6728
16460b48079q0261q7022j17315K88084k0069Q5916J75860O6376j46077L99286
16450C16699Q7916r4707K5033j81677l31420q1018K02283L4531O3192K33218J00423
16439C74473O3628j72230j4889r1927k69312m1963Q9675J97757n084k7945J53680
16428B55863j40997n1862k0779m1255j00556K3538j34671L4456K8300J80705J25076
16417A57818J367j00405J2213Q4397K6389M173J54113K2670N093m39979k7768
$$ plain form
16406 -99919 -515 61334 202132 45677 -128656 -274947 -207958 -200760 -138906 -52242 19225
16395 19225 100539 -56865 -131532 -50192 -70137 -148511 129016 464911 324614 321964 348369
16384 348369 349967 205508 -94865 126236 266981 68562 -48037 3029 -39487 85530
16374 85530 119980 76036 -50313 -83488 -148358 -278457 -311978 -357221 -271806 -178617 -137715
16363 -137715 -17826 133012 13092 -123464 -118510 -53852 -9149 -205025 -310959 -174116
16353 -174116 116329 -83531 -279041 -249844 -436827 -412112 -389935 -284323 -220031 -152383
16343 -152383 -212640 -178134 -26861 -78259 -83589 -176509 -45197 -23553 -109163 -64223 126684
16332 126684 399705 233788 353378 686993 578510 332025 147294 84103 -68038 -111192
$$ packed form
16406i9919R9404O1849J40798j56455j74333j46291O6989P198O1854Q6664P1467
16395A9225Q1314j57404p4667Q1340j9945p8374K77527L35895j40297k650K6405
16384C48369J598j44459l00373K21101J40745j98419j16599N1066m2516J25017
16374H5530L4450m3944j26349l3175o4870j30099l3521m5243Q5415R3189M0902
16363a37715J19889J50838j19920j36556M954O4658M4703j95876j05934J36843
16353a74116K90445j99860j95510K9197j86983K4715K2177J05612O4292O7648
16343a52383o0257L4506J51273n1398n330r2920J31312K1644q5610M4940J90907
16332A26684K73021j65917J19590L33615j08483k46485j84731o3191j52141m3154
$$ plain form
16322 -111192 5866 17037 -222497 -257896 -347954 -160015 -42612 -106944 -114097 -183199 -286638
16311 -286638 -120415 -134609 14453 99378 86218 -46052 -109124 144081 129584 -3122
16301 -3122 -171007 -299949 -84096 -146188 -235397 -251567 -209432 -194122 -97140 -92482 107941
16290 107941 -28799 -217109 19248 171974 60365 218780 274207 105539 109617 233487
16280 233487 159893 5435 -65264 42910 -6559 -63464 -30826 120954 92898 -46753 -128473
16269 -128473 -241451 -204521 -297540 -242326 105359 260159 194511 188286 303076 267408 302677
16258 302677 304571 186901 14888 -48111 -249561 -310373 -341216 -498163 -590526 -438286 -275213
16247 -275213 -315710 -264600 -191748 -66812 22859 23396 -18608 -216056 -470038 -467775 -222083
$$ packed form
16322a11192J17058J1171k39534l5399r0058J87939J17403o4332p153o9102j03439
16311b86638J66223j4194J49062Q4925j3160j32270o3072K53205j4497j32706
16301c122j67885j28942K15853o2092q9209j6170M2135J5310R6982M658K00423
16290A07941j36740j88310K36357J52726j11609J58415N5427j68668M078J23870
16280B33487p3594j54458p0699J08174m9469n6905L2638J51780k8056j39651q1720
16269a28473j12978L6930r3019N5214L47685J54800o5648o225J14790l5668L5269
16258C02677J894j17670j72013o2999k01450o0812l0843j56947r2363J52240J63073
16247b75213m0497N1110P2852J24936Q9671N37m2004j97448k53982K263K45692
$$ plain form
16236 -222083 -132468 -51313 302298 445237 147843 -117600 -323518 -305222 -309642 -208136
16226 -208136 -153611 -305228 -219455 -107588 12695 -1210 -133448 -208987 -307347 -395763 -172461
16215 -172461 -92989 -74180 -31449 -77783 -272677 -316719 -252474 -255292 -357324 -379547 -460483
16204 -460483 -366052 -242507 154796 134806 9967 95255 237927 200002 183472 76177
16194 76177 124225 171706 275917 43398 92475 171252 359734 199467 78630 -28774
16184 -28774 86973 66752 -132251 -415420 -26539 152725 189002 169291 121597 66440 -99663
16173 -99663 -255260 -39558 50306 -161087 -125043 -16463 49979 86179 106945 11166 -170835
16162 -170835 -259495 -379153 -468160 -404070 -267415 -455027 -605145 -457362 -141634 -267254
$$ packed form
16236b22083Q9615Q1155L53611J42939k97394k65443k05918J8296m420J01506
16226b08136N4525j51617Q5773J11867J20283j3905j32238p5539r8360q8416K23302
16215a72461P9472J8809M2731m6334j94894m4042O4245k818j02032k2223q0936
16204d60483R4431J23545L97303j9990j24839Q5288J42672l7925j6530j07295
16194G6177M8048M7481J04211k32519M9077P8777J88482j60267j20837j07404
16184b8774J15747k0221j99003k83169L88881J79264L6277j9711m7694n5157j66103
16173i9663j55597K15702Q9864k11393L6044J08580O6442L6200K0766r5779j82001
16162a70835q8660j19658q9007O4090J36655j87612j50118J47783L15728j25620
$$ plain form
16152 -267254 -513605 -442655 -288758 -74520 148958 288745 235445 46751 26336 -9371
16142 -9371 35944 90 47679 -56677 -4120 -15940 -98695 -323347 -370648 -139573 66175
16131 66175 -140688 -120826 -90148 -30783 70417 24773 -57490 -39670 -68010 141726 193075
16120 193075 -39280 -16152 157511 14328 -131891 -77497 150639 289112 341540 158875
16110 158875 -115491 -281190 -226216 -88481 45532 -71276 -170997 -290260 -319751 -180501
16100 -180501 20949 216826 558163 383960 53358 -154910 8401 48600 -73366 -260476
16090 -260476 -353095 -163789 -33070 32858 46623 58685 -186457 -8796 214458 224255 38282
16079 38282 -86184 -291320 -415569 -301751 -66326 139861 287688 12477 -276821 -155234
$$ packed form
16152b67254k46351P0950J53897K14238K23478J39787n3300j88694k0415l5707
16142i371M5315l5854M7589j04356N2557j1820q2755k24652m7301K31075K05748
16131F6175k06863J9862L0678N9365J01200m5644q2263J7820k8340K09736N1349
16120A93075k32355K3128J73663j43183j46219N4394K28136J38473N2428j82665
16110A58875k74366j65699N4974J37735J34013j16808r9721j19263k9491J39250
16100a80501K01450J95877L41337j74203l30602k08268J63311M0199j21966j87110
16090b60476r2619J89306J30719O5928J3765J2062k45142J77661K23254R797j85973
16079C8282j24466k05136j24249J13818K35425K06187J47827k75211k89298J21587
$$ plain form
16069 -155234 6483 -121699 -151375 -44787 -267240 -439985 -300919 -115031 -39513 10636
16059 10636 -42905 8876 -177044 -243841 -26818 87616 -75975 -219703 -48776 19560
16049 19560 -347191 -426152 -362837 -147235 -121568 -241938 -345256 -326696 -543720 -420896
16039 -420896 -204561 -208313 -7641 87786 194932 267252 292850 109796 163450 378081 375523
16028 375523 403998 115257 61570 132047 230473 324701 254961 152784 247744 273898 536523
16017 536523 282342 -53558 -105812 -135875 -144869 101509 367281 375391 136890 -14145 84141
16006 84141 239114 253730 210952 159287 -14081 -342191 -454482 -169719 124900 -94433
15996 -94433 -239755 -378256 -386594 -258487 -126781 -93814 -51284 23361 -96286 -204910 -80381
$$ packed form
16069a55234J61717j28182k9676J06588k22453j72745J39066J85888P5518N0149
16059A0636n3541N1781j85920o6797K17023J14434j63591j43728J70927O8336
16049A9560l66751p8961O3315K15602K5667j20370j03318J8560k17024J22824
16039d20896K16335l752K00672R5427J07146P2320K5598j83054N3654K14631k558
16028C75523K8475k88741n3687P0477R8426R4228o9740j02177R4960K6154K62625
16017E36523k54181l35900n2254l0063q994K46378K65772Q110k38501j51035R8286
16006H4141J54973J4616m2778n1665j73368l28110j12291K84763K94619k19333
15996i4433j45322j38501q338J28107J31706L2967M2530P4645j19647j08624J24529
$$ plain form
15985 -80381 -24181 -58373 86615 -78370 -103635 -107045 13066 -125430 -207965 -210733 -86146
15974 -86146 -268812 -360784 -378240 -305466 -510923 -407628 -267976 -129691 -86426 183258
15964 183258 112377 -35904 8570 8325 221065 224874 206577 206266 183562 96195 230839 421222
15952 421222 189560 198060 125775 -27299 -55974 123034 320375 246013 -130697 -139716 223790
15941 223790 300990 412319 251516 -187743 -378526 -319834 -259474 84794 152338 -102335
15931 -102335 -290116 -366211 95505 150364 -157981 -263120 -107594 -168089 -168018 -224841 -265473
15920 -265473 -414901 -152512 222109 370854 355499 359849 541839 510062 346531 210125
15910 210125 155083 188810 -62636 -2694 115827 173021 -151944 -152162 -111142 -196509 -83550
$$ packed form
15985h0381N6200l4192J44988j64985k5265l410J20111j38496q2535k768J24587
15974h6146j82666r1972j7456P2774k05457J03295J39652J38285M3265K69684
15964A83258p0881j48281M4474k45K12740L809j8297l11k2704q7367J34644J90383
15952D21222k31662Q500p2285j53074k8675J79008J97341p4362l76710r019L63506
15941B23790P7200J11329j60803m39259j90783N8692O0360L44268O7544k54673
15931a02335j87781p6095M61716N4859l08345j05139J55526o0495P1n6823m0632
15920b65473j49428K62389L74621J48745j5355M350J81990l1777j63531j36406
15910B10125n5042L3727k51446N9942J18521N7194l24965k18M1020q5367J12959
$$ plain form
15899 -83550 -103029 86343 415000 525475 722321 624100 486259 474388 239044 -27633
15889 -27633 -110424 -152797 -81816 -135239 -186853 -78912 15034 -2494 135795 98773 9191
15878 9191 137716 77405 153144 92756 134338 326591 305440 311605 161413 225926 292126
15867 292126 269833 444970 425815 284172 178063 294501 100427 25166 -141062 -168441
15857 -168441 -20744 78485 109838 -99595 -329505 -393204 -175059 -48382 -39323 -193105
15847 -193105 -236512 -83754 30501 60202 -70969 -321553 -421790 -272962 -144674 -174387
15837 -174387 -241232 -71778 114349 108775 158677 18882 -58791 82028 55670 -71849 -23734
15826 -23734 -59481 -213096 -12523 -55346 -116005 -274128 -379449 -365478 -135329 -238352
$$ packed form
15899h3550j9479J89372L28657J10475J96846r8221j37841j1871k35344k66677
15889b7633q2791m2373P0981n3423n1614J07941R3946j7528J38289l7022q9582
15878I191J28525o0311P5739o0388M1582J92253k1151O165j50192O4513O6200
15867B92126k2293J75137j9155j41643j06109J16438j94074p5261j66228k7379
15857a68441J47697R9229L1353k09433k29910o3699K18145J26677R059j53782
15847a93105m3407J52758J14255K9701j31171k50584j00237J48828J28288k9713
15837a74387o6845J69454J86127n574M9902j39795p7673J40819k6358j27519M8115
15826b3734l5747j53615K00573m2823o0659j58123j05321J3971K30149j03023
$$ plain form
15816 -238352 -266438 -125512 -51147 6852 -29590 140656 59756 1783 91236 200900 211171
15805 211171 83207 -1039 67943 118558 -31987 -281497 -234507 -234446 -26361 60587 -63236
15794 -63236 -109243 -72143 -126631 -69565 111131 125984 120156 260914 358489 386714 379585 324676
15782 324676 206031 142695 172716 -77646 -290103 -275764 -351310 -269667 -209205 -59792 -42273
15771 -42273 -59843 8139 -205173 -184333 -215059 -203237 -73404 11661 109475 137397 215298
15760 215298 422828 467210 348026 121004 -72676 -110890 -68289 -300796 -411181 -78196
15750 -78196 -201249 -139230 -97847 68994 94337 -161105 -63824 141959 117746 230135 407609
15739 407609 339257 153169 68403 -52189 7369 111727 259211 294669 472436 574136
$$ packed form
15816b38352k8086J40926P4365N7999l6442J70246q0900n7973Q9453J09664J0271
15805B11171j27964q4246O8982N0615j50545k49510M6990O1K08085Q6948j23823
15794f3236m6007L7100n4488N7066J80696J4853n828J40758R7575K8225p129n4909
15782C24676j18645o3336L0021k50362k12457J4339p5546Q1643O0462J49413J7519
15771d2273j7570O7982k13312K0840l0726J1822J29833Q5065R7814K7922P7901
15760B15298K07530M4382j19184k27022j93680l8214M2601k32507j10385L32985
15750g8196j23053O2019M1383J66841K5343k55442R7281K05783k4213J12389J77474
15739D07609o8352j86088q4766j20592N9558J04358J47484L5458J77767J01700
$$ plain form
15729 574136 752231 690744 675438 502069 228782 23643 12052 160835 350129 313556
15719 313556 269922 249854 171783 4842 -220202 -162160 -41160 -127535 129623 77237 -108997
15708 -108997 -171260 -359047 -356746 -192635 -13641 -168911 -326583 -307416 -231711 -94604
15698 -94604 -19955 -112033 132322 293703 213312 168941 207839 37355 -80213 -165221 39341
15687 39341 -9369 -54983 -120307 -260964 -322095 -193183 -112302 44102 119004 101253 261206
15676 261206 149521 -29126 173401 105615 162167 318260 423608 678387 653986 600632
15666 600632 324223 121513 58337 75597 26399 -2635 -19707 -1705 -39678 50166 -114226
15655 -114226 -250476 -224370 -229379 -195761 -168147 -175783 -231344 -479018 -383547 -275001 -238559
$$ packed form
15729E74136J78095o1487j5306j73369k73287k05139j1591J48783J89294l6573
15719C13556m3634k0068p8071j66941k25044N8042J21000q6375K57158n2386j86234
15708a08997o2263j87787K301J64111J78994j55270j57672J9167P5705J37107
15698i4604P4649r2078K44355J61381q0391m4371L8898j70484j17568q5008K04562
15687C9341m8710m5614o5324j40657o1131J28912Q0881J56404P4902j7751J59953
15676B61206j11685j78647K02527o7786N6552J56093J05348K54779k4401n3354
15666F00632k76409k02710o3176J7260m9198k9034j7072J8002l7973Q9844j64392
15655a14226j36250K6106n009L3618K7614p636n5561k47674R5471J08546L6442
$$ plain form
15644 -238559 -140871 -281333 -332054 -398923 -21031 112084 175543 75034 -2494 -161757
15634 -161757 -94388 102852 75645 -3883 -66581 -86340 -66387 -40380 72544 71627 141690
15623 141690 293847 299234 240107 171797 37728 -9620 -34484 130535 228273 293861 510500
15612 510500 427230 255286 282588 14998 -131062 -147935 6740 56700 122192 218334 150767
15601 150767 159163 268042 405435 342040 168414 43373 177083 235010 301644 54213
15591 54213 6581 -87080 -9117 -223739 -319487 -127203 234896 208098 -58829 -134591 74937
15580 74937 271048 345412 364723 364672 153819 53616 -77078 -218622 124442 393904 392594
15569 392594 233134 80560 -156928 -379749 -468474 -459683 -352216 -201175 -319569 -248717
$$ packed form
15644b38559R7688j40462n0721o6869L77892J33115O3459j00509p7528j59263
15634a61757O7369J97240k7207p9528o2698j9759J9953K6007J12924r17P0063
15623A41690J52157N387n9127o8310j34069m7348k4864J65019R7738O5588K16639
15612E10500q3270j71944K7302k67590j46060j6873J54675M9960O5492R6142o7567
15601A50767Q396J08879J37393o3395j73626j25041J33710N7927O6634k47431
15591E4213m7632r3661P7963k14622r5748J92284L62099k6798k66927p5762K09528
15580G4937J96111P4364J9311n1k10853j00203j30694j41544L43064K69462j310
15569C92594j59460j52574k37488k22821q8725Q791J07467J51041j18394P0852
$$ plain form
15559 -248717 -214810 -42518 22376 -161829 -148312 -208518 -250895 -191943 -124692 -74689 -56968
15548 -56968 244676 200235 223474 202248 63651 -241308 -270089 -6419 83421 109135 234877
15537 234877 -43329 -189379 -252684 -285159 -255105 -180468 -57092 148574 225486 224410 181419
15526 181419 89947 -31996 -225353 -101286 44738 210843 343571 269819 290972 -69892
15516 -69892 -244101 -40125 69818 246741 284025 223540 118136 -53210 -211343 -318767
15506 -318767 -364533 -262460 -97422 -75792 -390 310309 287501 -88515 121495 190924
15496 190924 91432 30015 47717 166507 112177 65994 120527 -90516 -61901 -148936 -175124
15485 -175124 -353539 -354696 -194744 -165179 -409552 -683925 -598605 -308554 -283318 -97691
$$ packed form
15559b48717L3907J72292O4894j84205J3517o0206m2377N8952O7251N0003J7721
15548e6968L01644m4441K3239k1226j38597l04959k8781K63670Q9840K5714J25742
15537B34877k78206j46050o3305l2475L0054P4637J23376K05666P6912j076m2991
15526A81419r1472j21943j93357J24067J46024J66105J32728p3752K1153l60864
15516f9892j74209K03976J09943J76923L7284o0485j05404j71346j58133j07424
15506c18767m5766J02073J65038K1630P5402L10699k2808l76016K10010O9429
15496A90924r9492o1417J7702J18790n4330m6183N4533k11043K8615q7035k6188
15485a75124j78415j157J59952K9565k44373k74373Q5320K90051K5236J85627
$$ plain form
15475 -97691 66679 45393 9078 3998 -153901 -88389 -112471 -203740 -314699 -341280 -251374
15464 -251374 -251648 -264453 -154671 -14268 50093 -36124 149344 339358 311405 156893 128662
15453 128662 -77343 -216615 -231752 -91483 -17475 142254 383433 101636 -254693 -356385
15443 -356385 -161209 -76691 -252277 -258026 -417098 -282667 -288838 -9317 176255 138761 -9458
15432 -9458 -91125 -226137 -227263 -37851 -22005 188491 125278 81339 93120 204677 113703
15421 113703 50100 -26771 241893 279858 232959 -126751 -157793 126639 235537 441567
15411 441567 359301 260191 243744 79726 -7755 -19823 -192376 -306526 -320365 -314032 -131250
15400 -131250 25937 -174766 -533674 -583469 -289844 130430 31725 -101749 -119926 201516
$$ packed form
15475i7691J64370k1286l6315n080j57899O5512k4082r1269j10959k6581Q9906
15464b51374k74j2805J09782J40403O4361q6217J85468J90014k7953j54512k8231
15453A28662k06005j39272j5137J40269P4008J59729K41179k81797l56329j01692
15443c56385J95176Q4518j75586n749j59072J34431o171K79521J85572l7494j48219
15432i458q1667j35012j126J89412J5846K10496o3213m3939J1781J11557r0974
15421A13703o3603p6871K68664L7965m6899l59710l1042K84432J08898K06030
15411D41567q2266r9110j6447j64018q7481j2068j72553j14150j3839O333J82782
15400a31250J57187k00703l58908m9795K93625M20274r8705j33474j8177L21442
$$ plain form
15390 201516 496126 528434 428929 169200 115084 362878 401170 376945 317169 282262 91670
15379 91670 105450 261761 329129 406674 166912 37094 66986 338241 266735 214962 181456
15368 181456 109639 15452 -13750 -29080 -72339 -40400 39576 -63305 -167118 2335 38537
15357 38537 -116616 -108733 1935 171099 276784 599441 317339 195150 220232 70875
15347 70875 -24677 22044 -7584 35132 -60817 -294267 -543532 -546526 -538160 -340005 -198227
15336 -198227 27728 267614 460892 241232 154526 52129 92250 129509 210965 276779
15326 276779 247913 120209 86186 79575 160001 112133 -71320 -246201 -361969 -396224 -217800
15315 -217800 60360 344282 404989 339228 373512 374515 242610 3121 -82932 -96259 -45831
$$ packed form
15390B01516K94610L2308r9505k59729n4116K47794L8292k4225n9776l4907j90592
15379I1670J3780J56311O7368P7545k39762j29818K9892K71255p1506n1773l3506
15368A81456p1817r4187k9202j5330m3259L1939P9976j02881j03813J69453L6202
15357C8537j55153P883J10668J69164J05685L22657k82102j22189K5082j49357
15347G0875r5552M6721k9628M2716r5949k33450k49265k994Q366J98155J41778
15336a98227K25955K39886J93278k19660q6706j02397M0121L7259Q1456O5814
15326B76779k8866j27704l4023o611Q0426m7868j83453j74881j15768l4255J78424
15315b17800K78160K83922O0707o5761L4284J003j31905k39489q6053j3327N0428
$$ plain form
15304 -45831 -4047 166300 207448 297808 414670 388705 417049 250619 230004 59964 148090
15293 148090 300582 242457 314167 110737 91286 126514 50914 111217 258196 259544 122651
15282 122651 4624 92393 317380 324256 191610 408954 602985 584371 329305 307961
15272 307961 243738 120324 58384 78925 -15007 -129415 -105644 -280811 -183935 -73814 -10113
15261 -10113 155979 9457 8572 -104406 -278535 -306957 -347677 -233321 -116332 -112986 -153070
15250 -153070 -140452 -71936 136633 278754 140431 113978 -135393 -218505 -104663 116888
15240 116888 111641 153594 217829 247354 257607 306618 283100 243888 383578 575170 356065
15229 356065 281286 340261 304759 -12623 -8759 36672 158529 137852 154400 256241 203390
$$ packed form
15304d5831M1784J70347M1148R0360J16862k5965K8344j66430k0615j70040Q8126
15293A48090J52492n8125P1710k03430j9451L5228p5600O0303J46979J348j36893
15282A22651j18027Q7769K24987O876j32646K17344J94031j8614k55066k1344
15272C07961o4223j23414o1940K0541r3932j14408K3771j75167R6876J10121O3701
15261a0113J66092j46522q85j12978j74129k8422m0720J14356J16989L346m0084
15250a53070J2618O8516K08569J42121j38323k6453k49371q3112J13842K21551
15240A16888n247M1953O4235K9525J0253M9011k3518l9212J39690J91592k19105
15229C56065p4779N8975l5502l17382L864M5431J21857k0677J6548J01841n2851
$$ plain form
15218 203390 181642 455369 547537 643663 723493 402429 76427 39128 257420 115176
15208 115176 -95077 -26680 -60459 -103179 73960 84865 79339 143353 124281 97072 119147
15197 119147 44260 12485 77209 309621 304103 188794 119790 163185 69740 228739 249465
15186 249465 366553 410844 378498 369275 234701 184283 208211 210079 266200 394781 251938
15175 251938 185464 49782 106366 23733 -165572 -209626 -154574 13032 291692 483594
15165 483594 451967 333830 220303 379978 321361 201070 177931 282325 328349 155407
15155 155407 235536 204442 35245 -172905 -134841 -104390 85846 -146624 -476571 -134816
15145 -134816 39813 115022 270835 188514 89915 76562 295054 255583 449703 679954
$$ packed form
15218B03390k1748K73727R2168R6126P9830l21064l26002l7299K18292j42244
15208A15176k10253O8397l3779m2720J77139J0905n526O4014j9072k7209K2075
15197A19147p4887l1775O4724K32412n518j15309o9004M3395r3445J58999K0726
15186B49465J17088M4291l2346r223j34574n0418K3928J868N6121J28581j42843
15175B51938o6474j35682N6584q2633j89305m4054N5052J67606K78660J91902
15165D83594l1627j18137j13527J59675n8617j20291k3139J04394M6024j72942
15155A55407Q0129l1094j69197k08150L8064L0451J90236k32470l29947L41755
15145a34816J74629P5209J55813q2321r8599j3353K18492l9471J94120K30251
$$ plain form
15135 679954 576654 399860 233088 201200 193918 266345 276198 160544 211321 415946 351783
15124 351783 179060 182075 327032 372246 204957 60003 76502 176963 137763 147014 286156
15113 286156 99480 121129 305990 601894 505020 282924 387733 244021 279015 321133
15103 321133 266264 191187 248797 229120 337454 558356 460936 382029 497895 386607 129706
15092 129706 -3917 127946 212894 292757 253446 183825 386486 166845 27321 58210
15082 58210 217421 162982 109424 151025 61264 205441 472194 283489 312788 366953 462319
15071 462319 248641 212271 75489 72331 146248 -32409 41941 204189 10465 76547 291496
15060 291496 428399 327899 183597 3879 -67053 -134498 113717 296159 387296 659111
$$ packed form
15135F79954j03300j76794j66772l1888p282P2427R853j15654N0777K04625o4163
15124C51783j72723L015J44957M5214j67289j44954J6499J00461l9200R251J39142
15113B86156j86676K1649J84861K95904r6874k22096J04809j43712L4994M2118
15103C21133n4869p5077N7610j9677J08334K20902r7420p8907J15866j11288k56901
15092A29706j33623J31863Q4948P9863l9311o9621K02661k19641j39524L0889
15082E8210J59211n4439n3558M1601q9761J44177K66753j88705K9299N4165R5366
15071D62319k13678l6370j36782l158P3917j78657P4350J62248j93724O6082K14949
15060B91496J36903j00500j44302j79718p0932o7445K48215J82442R1137K71815
$$ plain form
15050 659111 796743 731776 607533 635598 468428 175620 265035 370559 306918 109583
15040 109583 114689 261073 361678 316338 198020 292850 431670 332993 297042 335690 491399
15029 491399 583640 565711 552339 569216 525735 500258 697704 714861 592087 490640 444614
15018 444614 557720 617551 487618 491663 299941 169115 356205 360372 252111 157803 234403
15007 234403 306347 231326 300302 608414 614375 583053 551537 564470 765841 628145 673450
14996 673450 700397 578479 402510 405967 390562 403374 397059 390543 550040 386915 616774
14985 616774 433195 468260 631287 209988 -63289 -89292 -24893 132451 524013 658996
14975 658996 681674 652502 453838 397569 387916 406891 331399 384656 512638 726563 483858
$$ packed form
15050F59111J37632o4967j24243K8065j67170k92808Q9415J05524o3641j97335
15040A09583N106J46384J00605m5340j18318R4830J38820r8677l5951L8648J55709
15029D91399R2241j7929j3372J6877m3481k5477J97446J7157j22774j01447m6026
15018D44614J13106N9831j29933M045j91722j30826J87090M167j08261r4308P6600
15007B34403P1944p5021O8976L08112N961l1322l1516J2933K01371j37696M5305
14996F73450K6947j21918j75969L457j5405J2812o315o516J59497j63125K29859
14985F16774j83579L5065J63027m21299k73277k6003O4399J57344L91562J34983
14975F58996K2678k9172j98664n6269r653J8975p5492N3257J27982K13925k42705
$$ plain form
14964 483858 395866 532766 550451 588812 807551 722482 710823 684025 516669 527084 702654
14953 702654 725962 586770 409886 462615 786717 736361 585893 482439 751999 921876
14943 921876 694486 666505 772694 442157 404718 488483 586790 633456 712655 573187 596708
14932 596708 599721 440703 409648 242950 249578 534914 524319 697859 920630 938413 789125
14921 789125 717796 819493 941518 829090 815014 742318 774334 588489 425501 519036
14911 519036 546418 568667 674214 892374 1083363 1011952 1073663 1280238 996190 892175
14901 892175 798199 838148 625100 718526 703220 839845 1050857 817357 951873 1171711
14891 1171711 1250708 944463 1072611 1165527 1107653 1152687 1040012 882562 896169 863269
$$ packed form
14964D83858q7992J36900J7685L8361K18739q5069j1659k6798j67356J0415J75570
14953G02654K3308j39192j76884N2729L24102n0356j50468j03454K69560J69877
14943I21876k27390k7981J06189l30537l7439Q3765R8307M6666P9199j39468K3521
14932E96708L013j59018l1055j66698O628K85336j0595J73540K22771J7783j49288
14921G89125p1329J01697J22025j12428j4076p2696L2016j85845j62988R3535
14911E19036K7382K2249J05547K18160J90989p1411O1711K06575k84048j04015
14901H92175r3976L9949k13048R3426j5306J36625K11012k33500J34516K19838
14891A171711P8997l06245J28148R2916n7874M5034j12675j57450J3607l2900
$$ plain form
14881 863269 894136 896144 852150 1033234 1114920 976573 1121736 1254292 1418148 1380809 1147221
14870 1147221 1099544 1174422 1192125 1217925 1056953 979850 934807 845624 1162279 1549860 1500849
14859 1500849 1422253 1325943 1329483 1323573 1305768 1079717 945665 947926 816850 1001886 1190437
14848 1190437 1373329 1568170 1647134 1306985 973990 1115857 1463393 1455830 1374599 1673599
14838 1673599 1865627 2015318 2096429 2145980 2004510 1935790 1866499 1697914 1521445 1549365
14828 1549365 1364655 1348238 1658360 1703534 1524533 1525002 1375584 1380895 1444216 1398971 1481798
14817 1481798 1624729 1763208 1787045 1846529 1886085 1658303 1267893 1222982 1255504 1391092
14807 1391092 1500532 1457158 1692086 1769319 1733842 1737388 1708130 1717217 1757235 1826090 1830572
$$ packed form
14881H63269L0867K008m3994J81084Q1686j38347J45163J32556J63856l7339k33588
14870A147221m7677P4878J7703K5800j60972p7103m5043q9183L16655L87581m9011
14859A500849p8596r6310L540n910j7805k26051j34052K261j31076J85036J88551
14848A190437J82892J94841P8964l40149l32995J41867L47536p563q1231K99000
14838A673599J92028J49691Q1111M9551j41470o8720o9291j68585j76469K7920
14828A549365j84710j6417L10122M5174j79001M69j49418N311O3321m5245Q2827
14817A481798J42931J38479K3837N9484L9556k27782l90410m4911L2522J35588
14807A391092J09440m3374K34928P7233l5477L546k9258R087M0018O8855M482
$$ plain form
14796 1830572 1774906 1687201 1532319 1661192 1756457 1866918 1764979 1869064 1953233 1956981
14786 1956981 1940288 2073044 2061796 2174256 2147111 2092368 1979116 1719422 1752405 1765081
14776 1765081 1768467 1812891 1889160 1731951 1720971 1771378 2103399 2473094 2532553 2561413 2449064
14765 2449064 2613290 2455606 2477099 2372364 2286957 2521614 2361497 2168485 1905361 2104037
14755 2104037 2482887 2583964 2457308 2441518 2625508 2739250 2616961 2492853 2609271 2713287
14745 2713287 2780966 2790746 2923174 2872650 2850023 2980533 2979944 2870882 2840950 2948024 3012399
14734 3012399 3034580 3005665 3191133 3326441 3110388 2881307 2684820 2799559 2972921 2776373
14724 2776373 2785121 3025353 3155740 3272778 3228309 3283138 3460933 3317941 3357981 3393247
$$ packed form
14796A830572n5666q7705j54882J28873R5265J10461j01939J04085Q4169L748
14786A956981j6693J32756j1248J12460k7145n4743j13252k59694L2983J2676
14776A765081L386M4424P6269j57209j0980N0407L32021L69695N9459K8860j12349
14765B449064J64226j57684K1493j04735q5407K34657j60117j93012k63124J98676
14755B104037L78850J01077j26656j5790J83990J13742j22289j24108J16418J04016
14745B713287O7679R780J32428n0524k2627J30510n89j09062k9932J07074O4375
14734C012399K2181k8915J85468J35308k16053k29081j96487J14739J73362j96548
14724B776373Q748K40232J30387J17038m4469N4829J77795j42992M0040L5266
$$ plain form
14714 3393247 3431030 3500508 3560732 3256226 3307258 3266604 3340814 3546680 3877315 3941158 3999810
14703 3999810 4156124 4125777 4228180 4187262 4411205 4322346 4098144 4267828 4442201 4616240
14693 4616240 4693806 4703574 4694380 4707799 4688049 4834636 5148430 5204298 5289263 5509677 5917513
14682 5917513 6124035 6031209 5930195 5807458 5862323 5774757 5850894 5903676 5838661 6047621
14672 6047621 6383137 6715342 6675082 6647885 6765335 7086544 7156106 7376698 7728137 7821777
14662 7821777 7648710 7526444 7347177 7569735 8051794 8234868 8265995 8396674 8315478 8401892
14652 8401892 8598717 8900170 9255974 9690681 9813526 9855827 10111972 10120014 10140381 10449867
14642 10449867 10759198 10976449 11183614 11299358 11683491 12124682 12372002 12493569 12524312
$$ packed form
14714C393247L7783O9478O0224l04506N1032m0654P4210K05866L30635O3843N8652
14703C999810J56314l0347J02403m0918K23943q8859k24202J69684J74373J74039
14693D616240P7566R768r194J3419j9750J46587L13794N5868Q4965K20414M07836
14682E917513K06522r2826j01014j22737N4865q7566P6137N2782o5015K08960
14672F047621L35516L32205m0260k7197J17450L21209O9562K20592L51439R3640
14662G821777j73067j22266j79267K22558M82059J83074L1127J30679q1196Q6414
14652H401892J96825L01453L55804M34707J22845M2301K56145Q042K0367L09486
14642A0449867L09331K17251K07165J15744L84133M41191K47320J21567L0743
$$ plain form
14633 12524312 12618491 12915882 13275489 13608004 13821879 14038183 14122166 14261139 14526698 15164687
14623 15164687 15455835 15801706 16232955 16646772 17115136 17270937 17642560 18211376 18565039
14614 18565039 18976090 19400223 19835561 20243002 20835754 21421702 21911029 22749471 23338502
14605 23338502 23861350 24368491 24770676 25340747 25995199 26735457 27345210 27804941 28396161
14596 28396161 29405214 30269815 30930040 31648972 32115888 32727825 33492454 34217877 34822315
14587 34822315 35693557 36974712 37972279 38735453 39443279 40393990 41255336 42017661 42918327
14578 42918327 43752288 44537086 45427380 46252151 47093152 47890695 48602106 49260601 49776644
14569 49776644 50308404 50771683 51438573 51973297 52379804 52873768 53251610 53462397 53667373
$$ packed form
14633A2524312R4179K97391L59607L32515K13875K16304Q3983J38973K65559O37989
14623A5164687K91148L45871M31249M13817M68364J55801L71623N68816L53663
14614A8565039M11051M24133M35338M07441N92752N85948M89327Q38442N89031
14605B3338502N22848N07141M02185N70071O54452P40258O09753M59731N91220
14596B8396161J009053Q64601O60225P18932M66916O11937P64629P25423O04438
14587C4822315Q71242J281155R97567P63174P07826R50711Q61346P62325R00666
14578D2918327Q33961P84798Q90294Q24771Q41001P97543P11411O58495N16043
14569D9776644N31760M63279O66890N34724M06507M93964L77842K10787K04976
$$ plain form
14560 53667373 53694177 53717098 53861538 53920596 53923735 53883547 53650088 53580948 53333988 52909604
14550 52909604 52233466 51520522 51157992 50789383 50420943 49883301 48851813 48027392 47327521
14541 47327521 46338960 45507848 44753513 44057955 43317296 42486572 41752497 40950091 40297059
14532 40297059 39388689 38474349 37714925 36844855 35937333 35146016 34500385 33628696 32904760
14523 32904760 31968366 31214945 30481901 29535169 28948747 28293841 27498813 26990302 26570352
14514 26570352 25931199 25142168 24350465 23731643 23388774 22916723 22428702 21793544 21363975
14505 21363975 20971666 20588508 19976173 19597475 19192884 18592930 18118623 17759547 17346491
14496 17346491 17049019 16943755 16473098 16031905 15565113 15095057 14914910 14659010 14437096
$$ packed form
14560E3667373K6804K2921J44440N9058L139m0188k33459o9140k46960m24384
14550E2909604o76138p12944l62530l68609l68440n37642j031488q24421o99871
14541D7327521r88561q31112p54335o95558p40659q30724p34075q02406o53032
14532D0297059r08370r14340p59424q70070r07522p91317o45631q71689p23936
14523C2904760r36394p53421p33044r46732n86422o54906p95028n08511m19950
14514B6570352o39153p89031p91703o18822l42869m72051m88021o35158m29569
14505B1363975l92309l83158o12335l78698m04591n99954m74307l59076m13056
14496A7346491k97472j05264m70657m41193m66792m70056j80147k55900k21914
$$ plain form
14487 14437096 14114949 13608608 13333800 13233427 12757829 12261160 12089630 11777261 11440310
14478 11440310 11235099 11088736 11017640 11007167 10865581 10683439 10525825 10213625 9713517 9583349
14468 9583349 9362606 9060133 9162954 9185367 9204487 8886632 8666482 8529385 8496190 8286082
14458 8286082 8215353 8104371 7763328 7748154 7846537 7558986 7400295 7307585 7210172 6962839
14448 6962839 6715009 6703694 6640395 6659394 6639347 6595130 6482305 6382236 6353629 6182097
14438 6182097 5965097 5590164 5388912 5456761 5377870 5309531 5281166 5319318 4961181 4699754
14428 4699754 4591532 4633606 4695372 4654308 4648894 4606839 4510938 4430219 4400104 4462189 4409416
14417 4409416 4479999 4326697 4146312 4078776 3989360 3724907 3404179 3582858 3621642 3675628
$$ packed form
14487A4437096l22147n06341k74808j00373m75598m96669j71530l12369l36951
14478A1440310k05211j46363p1096j0473j41586j82142j57614l12200n00108j30168
14468I583349k20743l02473J02821K2413J9120l17855k20150j37097l3195k10108
14458H286082p0729j10982l41043j5174R8383k87551j58691r2710r7413k47333
14448F962839k47830j1315o3299J8999k0047m4217j12825j00069k8607j71532
14438F182097k17000l74933k01252O7849p8891o8339k8365L8152l58137k61427
14428D699754j08222M2074O1766m1064n414m2055r5901q0719l0115O2085n2773
14417D409416P0583j53302j80385o7536q9416k64453l20728J78679L8784N3986
$$ plain form
14407 3675628 3724560 3625746 3591867 3877495 3880342 3706465 3505550 3626815 3484207 3236600
14397 3236600 3066358 2908904 2827616 2984755 3049192 2984930 2936384 2990798 3095798 3072846
14387 3072846 2920316 3020833 2853415 2610648 2606524 2601309 2362661 2344091 2345523 2590244 2635685
14376 2635685 2764372 2738971 2833533 3043939 3128610 3209363 3036929 2599785 2259231 2086951
14366 2086951 2034492 2033425 1990323 1955747 2141802 2212132 2303997 2346104 2342467 2311754 2048977
14355 2048977 2040841 2412092 2734365 2639079 2327621 2238779 2266622 2137349 1985218 2140143
14345 2140143 2172133 2160477 2041005 1936526 2017749 2124541 2095872 1965557 1927682 1765871
14335 1765871 1666800 1512452 1617711 1684967 1904415 2045090 1942808 1798604 1809285 1720100
$$ packed form
14407C675628M8932r8814l3879K85628K847j73877k00915J21265j42608k47607
14397C236600j70242j57454q1288J57139O4437o4262m8546N4414J05000k2952
14387C072846j52530J00517j67418k42767m124n215k38648j8570J432K44721M5441
14376B635685J28687k5401R4562K10406Q4671Q0753j72434m37144l40554j72280
14366B086951n2459j067m3102l4576J86055P0330R1865M2107l637l0713k62777
14355B048977q136L71251L22273r5286l11458q8842K7843j29273j52131J54925
14345B140143L1990j1656j19472j04479Q1223J06792k8669j30315l7875j61811
14335A765871r9071j54348J05259O7256K19448J40675j02282j44204J0681q9185
$$ plain form
14325 1720100 1558867 1654342 1679495 1355548 1444767 1583229 1620599 1520191 1347189 1367414
14315 1367414 1211924 1381137 1504161 1441606 1272436 1341714 1286191 984370 1316669 1604330
14305 1604330 1650751 1657638 1425579 1133641 963419 1102627 1317924 1401818 1509981 1601389
14295 1601389 1697796 1775407 1612095 1641723 1578057 1450056 1279776 1308709 1360237 1379702 1531902
14284 1531902 1718751 1785989 1679922 1541339 1699333 1943554 2152096 2073669 1846550 1646210
14274 1646210 1622496 1629502 1435336 1361747 1396760 1448551 1311560 1205043 1229883 1439033 1243035
14263 1243035 1288976 1107144 1074983 967831 1012472 1317373 1136855 968769 909542 880174
14253 880174 1079836 1304622 922464 973433 943920 1011219 1156330 1187282 959484 763811
$$ packed form
14325A720100j61233R5475K5153l23947Q9219J38462L7370j00408j73002K0225
14315A367414j55490J69213J23024o2555j69170O9278n5523l01821L32299K87661
14305A604330M6421O887k32059k91938j70222J39208K15297Q3894J08163R1408
14295A601389R6407P7611j63312K9628o3666j28001j70280K8933N1528J9465J52200
14284A531902J86849O7238j06067j38583J57994K44221K08542p8427k27119k00340
14274A646210k3714P006j94166p3589L5013N1791j36991j06517K4840K09150j95998
14263A243035M5941j81832l2161j07152M4641L04901j80518j68086n9227k9368
14253H80174J99662K24786l82158N0969k9513O7299J45111L0952k27798j95673
$$ plain form
14243 763811 685991 728349 904872 1106189 1081645 913436 630815 861282 1007741 743858
14233 743858 511750 624008 854644 838443 784010 684855 532224 356496 382332 515566
14223 515566 538226 786763 1062649 1092268 1096076 1028728 1008426 840696 805925 844767 1180611
14212 1180611 1161214 1144336 1127367 1060311 1123520 1016942 733653 719310 824370 1019782
14202 1019782 1150223 1021161 753443 612736 679066 706699 750319 594069 722309 813897
14192 813897 835123 873169 670207 602605 531834 647344 652210 419428 397044 646287 640396
14181 640396 673049 938547 1156252 901863 579987 468125 320568 504332 817307 805911
14171 805911 875030 775483 678342 589175 387409 495740 609781 430444 392090 456713 314584
$$ packed form
14243G63811p7820M2358J76523K01317k4544j68209k82621K30467J46459k63883
14233G43858k32108J12258K30636j6201n4433r9155j52631j75728K5836J33234
14223E15566K2660K48537K75886K9619L808o7348k0302j67730l4771L8842L35844
14212A180611j9397j6878j6969o7056O3209j06578k83289j4343J05060J95412
14202A019782J30441j29062k67718j40707O6330K7633M3620j56250J28240R1588
14192H13897K1226L8046k02962o7602p0771J15510M866k32782k2384K49243n891
14181F40396L2653K65498K17705k54389l21876j11862j47557J83764L12975j1396
14171H05911O9119r9547r7141q9167k01766J08331J14041j79337l8354O4623j42129
$$ plain form
14160 314584 302587 571602 516735 212617 436899 637430 774082 775751 746561 508251
14150 508251 312655 315722 288670 136229 -98141 3668 264624 407105 531315 550189
14140 550189 512266 213969 148523 290030 524649 843027 816911 832864 556630 362063
14130 362063 266431 256098 -47610 -37491 143992 421938 514710 422553 320615 430001
14120 430001 584604 362068 280386 553528 570242 181026 293194 490015 487961 500683
14110 500683 603573 521744 733736 764944 431017 480835 531966 408947 175850 171071 437797
14099 437797 509598 601398 585048 327960 525567 516494 425472 503136 494248 482969 518030
14088 518030 348282 347184 495451 504859 354839 257885 355223 523162 473546 344012 399477
$$ packed form
14160C14584j1997K69015n4867l04118K24282K00531J36652J669k9190k38310
14150E08251j95596L067k7052j52441k34370J01809K60956J42481J24210J8874
14140E50189l7923k98297o5446J41507K34619L18378k6116J5953k76234j94567
14130C62063r5632j0333l03708J0119J81483K77946R2772r2157j01938J09386
14120D30001J54603k22536q1682K73142J6714l89216J12168J96821k054J2722
14110E00683J02890q1829K11992L1208l33927M9818N1131j23019k33097m779K66726
14099D37797P1801R1800j6350k57088J97607r073r1022P7664q888j1279L5061
14088E18030j69748j098J48267R408j50020r6954R7338J67939m9616j29534N5465
$$ plain form
14077 399477 375048 489179 533432 434947 334069 381942 461186 441239 615544 866303 705226
14066 705226 565076 476021 495208 680948 700150 742801 496970 153002 389850 727178
14056 727178 1056845 832449 644383 666038 508046 473353 554097 711234 547137 389662
14046 389662 387874 444811 642718 750140 649850 648419 628632 583370 614936 566709 535006
14035 535006 520451 748027 644158 654461 656433 573974 397473 389957 578635 682594 679220
14024 679220 618365 559046 400378 201977 362008 194810 36763 14923 191395 454440
14014 454440 540076 585172 471249 609482 327201 -99741 -40555 -29416 167654 241963
14004 241963 144107 166666 217383 167301 103825 -434 80870 -44268 -94974 185731 325898
$$ packed form
14077C99477k4429J14131M4253r8485j00878M7873P9244j9947J74305K50759j61077
14066G05226j40150q9055J9187J85740J9202M2651k45831l43968K36848L37328
14056G27178L29667k24396j88066K1655j57992l4693Q0744J57137j64097j57475
14046C89662j788N6937J97907J07422j00290j431j9787m5262L1566m8227l1703
14035E35006j4555K27576j03869J0303J972q2459j76501p516J88678J03959l374
14024F79220o0855n9319j58668j98401J60031j67198j58047k1840J76472K63045
14014D54440Q5636M5096j13923J38233k82281m26942N9186J1139J97070P4309
14004B41963r7856K2559N0717n0082o3476j04259Q1304j25138n0706K80705J40167
$$ plain form
13993 325898 105317 82474 28740 -90333 -201786 -184195 -35182 -15358 66826 -12559 -148320
13982 -148320 7039 -153970 -147125 50969 59179 214051 -29037 109952 339925 311803
13972 311803 150352 228198 269620 250386 25388 -9566 121083 42874 255890 519902
13962 519902 593477 505984 441750 374069 406090 531334 825861 1087566 723111 412292
13952 412292 359746 443263 610055 508941 474129 384409 69329 -3048 389014 696000
13942 696000 499302 501963 753844 743561 374214 243440 176131 256712 365223 478155
13932 478155 454441 254219 113859 197026 172493 5574 96116 313405 507562 533287
13922 533287 381333 384290 341479 362151 164210 -58478 31195 188036 110323 -130863 108126
$$ packed form
13993C25898k20581k2843n3734j19073j11453J7591J49013J9824Q2184p9385j35761
13982a48320J55359j61009O845J98094Q210J54872k43088J38989K29973k8122
13972C11803j61451P7846M1422j9234k24998l4954J30649p8209K13016K64012
13962E19902P3575q7493o4234o7681L2021J25244K94527K61705l64455l10819
13952D12292n2546Q3517J66792j01114l4812q9720l15080p2377L92062L06986
13942F96000j96698K661K51881j0283l69347j30774o7309Q0581J08511J12932
13932D78155k3714k00222j40360Q3167k4533j66919R0542K17289J94157K5725
13922E33287j51954K957m2811K0672j97941k22688Q9673J56841p7713k41186K38989
$$ plain form
13911 108126 407263 702350 737624 787705 592616 263406 -13689 201057 33392 90554
13901 90554 251240 195300 144669 171677 478402 721275 629547 427205 521927 572940 313459
13890 313459 204544 244219 333864 374912 450410 469461 344001 315768 441488 264478 331887
13879 331887 202053 11145 165775 200959 258663 346385 355392 264936 233884 469295 482649
13868 482649 122251 -85312 -118653 -94244 3507 221388 440094 527175 469483 390819 299096
13857 299096 126842 44008 116435 218954 93517 348927 435982 381880 408086 297408
13847 297408 464163 352817 56256 -96419 25034 183113 340343 438332 383146 348125
13837 348125 407093 353927 537022 569555 485843 422034 455509 509743 561782 467167 475453
$$ packed form
13911A08126K99137K95087L5274N0081j95089l29210k77095K14746j67665N7162
13901I0554J60686n5940n0631K7008L06725K42873r1728k02342R4722N1013k59481
13890C13459j08915L9675Q9645M1048P5498J9051j25460k8233J25720j77010O7409
13879C31887j29834j90908J54630L5184N7704Q7722R007r0456l1052K35411J3354
13868D82649l60398k07563l3341K4409R7751K17881K18706Q7081n7692p8664r1723
13857B99096j72254q2834P2427J02519j25437K55410Q7055n4102K6206j10678
13847B97408J66755j11346k96561j52675J21453J58079J57230R7989n5186l5021
13837C48125N8968n3166J83095L2533q3712o3809L3475N4234N2039r4615Q286
$$ plain form
13826 475453 151893 321473 426641 402378 369391 378045 264389 70752 62269 123242 11437
13815 11437 247000 416199 263384 -18712 -204028 -324266 -122806 -93651 -260493 -165128
13805 -165128 -120090 -163038 -118692 85099 410884 371379 116340 27271 283540 374158 37045
13794 37045 -139648 -54978 -14362 69053 312947 207011 29188 104034 217577 293052 392470
13783 392470 295233 87827 95298 -39790 -120997 -75026 189299 408338 514659 272149
13773 272149 5759 -191335 -90629 -43563 299948 354997 173972 140425 130722 -46342
13763 -46342 -232291 -150512 17605 105798 207511 191133 275925 117974 117306 252363 334061
13752 334061 438090 380727 230641 -18779 -107502 -34636 5627 -206386 127548 355757
$$ packed form
13826D75453l23560J69580J05168k4263l2987Q654j13656j93637q483O0973j11805
13815A1437K35563J69199j52815k82096j85316j20238K01460K9155j66842R5365
13805a65128M5038m2948M4346K03791L25785l9505k55039q9069K56269R0618l37113
13794C7045j76693Q4670M0616Q3415K43894j05936j77823P4846J13543P5475R9418
13783C92470r7237k07406P471j35088q1207M5971K64325K19039J06321k42510
13773B72149k66390j97094J00706M7066L43511N5049j81025l3547r703j77064
13763d6342j85949Q1779J68117Q8193J01713j6378Q4792j57951o68J35057Q1698
13752C34061J04029n7363j50086k49420q8723P2866M0263k12013L33934K28209
$$ plain form
13742 355757 409220 408763 294739 360172 301657 199523 73873 -30870 88980 184522 52600
13731 52600 -267110 -26136 85617 -74630 -113942 -100364 122976 140686 172840 -5705
13721 -5705 -2815 56437 241572 269666 387199 242443 -65953 -220585 22628 28007 197249
13710 197249 -102836 -106506 31092 54107 -92575 -49668 -144787 -305650 -58705 166294
13700 166294 169217 102549 141518 112705 169280 195185 73245 205618 310745 108335 -53204
13689 -53204 -24974 -35892 15489 187816 157709 125451 363528 316606 243105 162683 -19279
13678 -19279 39080 56036 -100149 -53458 44233 197387 331969 330486 212540 126654 10387
13667 10387 -36473 77263 465961 411987 390495 297258 222250 121117 82994 41689 162720
$$ packed form
13742C55757N3463m57j14024O5433n8515j02134j25650j04743J19850R5542j31922
13731E2600l19710K40974J11753j60247l9312J3578K23340J7710L2154j78545
13721e705K890N9252J85135K8094J17533j44756l08396j54632K43213N379J69242
13710A97249l00085l670J37598K3015j46682M2907r5119j60863K46945K24999
13700A66294K923o6668L8969k8813N6575K5905j21940J32373J05127k02410j61539
13689e3204K8230j0918N1381J72327l0107l2258K38077m6922p3501q0422j81962
13678a9279N8359J6956j56185M6691R7691J53154J34582j483j17946q5886j16267
13667A0387m6860J13736L88698n3974k1492r3237p5008j01133l8123m1305J21031
$$ plain form
13656 162720 226987 115700 -269288 -365893 -118883 -56717 66297 97693 -19977 -290909
13646 -290909 -265705 153780 104776 37287 241544 185561 -8426 -112409 -238395 -193973
13636 -193973 -110787 -34714 2117 -13450 90266 -23733 66484 113041 41356 1410 173875
13625 173875 296308 258284 92558 -22672 167663 382959 227938 29574 -92026 -101574
13615 -101574 -81272 115647 138984 -73349 58041 -10046 -117837 232916 481035 312368
13605 312368 148060 107464 130258 -130764 -289289 -256930 -43199 78307 -37425 25509
13595 25509 184764 170439 363807 409521 299534 221453 470746 474601 217212 -105998 -70733
13584 -70733 45029 3084 -975 49637 -182640 -153773 -103539 -44648 18225 -81573 -151476
$$ packed form
13656A62720O4267j11287l84988r6605K47010O2166J23014L1396j17670k70932
13646b90909K5204M19485m9004o7489K04257n5983j93987j03983j25986M4422
13636a93973Q3186P6073L6831j5567J03716j13999R0217M6557p1685l9946J72465
13625A73875J22433l8024j65726j15230J90335K15296j55021j98364j21600r548
13615a01574K0302J96919K3337k12333J31390o8087j07791L50753K48119j68667
13605C12368j64308m0596K2794k61022j58525L2359K13731J21506j15732O2934
13595B5509J59255j4325J93368M5714j09987p8081K49293L855k57389l23210L5265
13584g0733J15762m1945m059N0612k32277K8867N0234N8891O2873r9798o9903
$$ plain form
13573 -151476 15107 246444 60964 -76879 9333 154733 233123 137211 14308 -58429
13563 -58429 -111628 -212503 -50720 55410 -53095 -131005 97193 331967 313245 406579
13553 406579 300493 302163 232796 51248 -12445 -31489 -294635 -467845 -434299 -337307 21931
13542 21931 357604 334345 181558 112098 98714 124734 -8136 -159111 -180805 -167408 -83360
13531 -83360 39591 175642 223450 265410 399075 274705 115935 -107248 -307475 -305010
13521 -305010 -304982 -417515 -247760 -265823 -183468 79302 -47388 16387 206989 95797 89692
13510 89692 41550 55049 318878 365995 265550 158800 217443 247702 416134 433334 185618
13499 185618 -45532 126620 273085 134600 197909 466353 580560 411532 194027 292370
$$ packed form
13573a51476J66583K31337j85480j37843Q6212J45400P8390r5912j22903p2737
13563e8429n3199j00875J61783J06130j08505p7910K28198K34774j8722R3334
13553D06579j06086J670o9367j81548o3693j9044k63146j73210L3546R6992L59238
13542B1931L35673k3259j52787o9460j3384K6020j32870j50975k1694J3397Q4048
13531h3360J22951J36051M7808M1960J33665j24370j58770k23183k00227K465
13521c05010K8j12533J69755j8063Q2355K62770j26690O3775J90602j11192o105
13510H9692m8142J3499K63829M7117j00445j06750N8643L0259J68432J7200k47716
13499A85618k31150J72152J46465j38485O3309K68444J14207j69028k17505R8343
$$ plain form
13489 292370 327413 278343 150487 168119 170365 177384 255663 50904 -86844 -130034 -50073
13478 -50073 -65813 89291 98681 -206660 -251033 -294678 -484758 -418599 -60452 112776 70765
13467 70765 93034 -146255 -185565 522 148343 366718 263738 36678 58261 71866
13457 71866 28418 171192 23016 -129532 -12640 -23087 158363 355822 613959 493539
13447 493539 355200 226346 293970 311793 299436 314110 97975 -126696 -169284 -279729
13437 -279729 -3680 167342 157775 57859 -154848 -80449 33513 80769 126563 -40295 -306548
13426 -306548 -110076 -149582 -220463 -61827 213228 187454 -63952 -72546 114774 171150 62720
13415 62720 -187112 -95406 -80324 -52990 49163 132240 141630 308168 235593 257712 207789
$$ packed form
13489B92370L5043m9070j27856J7632K246P019P8279k04759j37748m3190P9961
13478e0073j5740J55104R390l05341m4373m3645j90080O6159L58147J73228m2011
13467G0765K2269k39289l9310J86087J47821K18375j02980k27060K1583J3605
13457G1866m3448J42774j48176j52548J16892j0447J81450J97459K58137j20420
13447D93539j38339j28854O7624J7823j2357J4674k16135k24671m2588j10445
13437b79729K76049J71022r567r9916k12707P4399J13962M7256M5794j66858k66253
13426c06548J96472l9506p0881J58636K75055k5774k51406q594J87320N6376j08430
13415F2720k49832R1706J5082K7334J02153Q3077R390J66538p2575K2119m9923
$$ plain form
13404 207789 29351 125265 -15690 -155057 13532 160534 -42676 37452 27569 102615
13394 102615 133428 124104 22011 72996 253504 262983 204289 95512 -35655 -3337 204582
13383 204582 287272 27538 -112639 -124690 -267341 -98374 232367 300475 241054 111914
13373 111914 -83510 -188093 -165097 -187404 -125999 -145722 -104321 156463 2948 -153052
13363 -153052 -313083 -291339 -8088 -31579 -151435 -153445 -194321 -1955 259527 238708 87054
13352 87054 126072 287819 223422 327960 -48473 -290647 -151969 -206249 -217277 41817
13342 41817 194655 382600 203436 251324 428147 191160 224668 272747 337225 210174
13332 210174 211617 439741 439071 327768 21396 121688 397859 360157 378142 454365 280484
$$ packed form
13404B07789j78438R5914j40955j39367J68589J47002k03210Q0128r883P5046
13394A02615L0813r324j02093N0985J80508R479n8694j08777j31167L2318K07919
13383B04582Q2690k59734j40177j2051j42651J68967L30741O8108n9421j29140
13373A11914j95424j04583K2996k2307O1405j9723M1401K60784j53515j56000
13363a53052j60031K1744K83251k3491j19856k010m0876J92366K61482k0819j51654
13352H7054L9018J61747o4397J04538l76433k42174J38678n4280j1028K59094
13342D1817J52838J87945j79164M7888J76823k36987L3508M8079O4478j27051
13332B10174J443K28124o70j11303l06372J00292K76171l7702J7985P6223j73881
$$ plain form
13321 280484 121775 196733 170227 249754 190527 18338 146129 269514 383505 383937 531262
13310 531262 209417 229048 415685 288796 228231 195132 293951 359387 360026 198726 126370
13299 126370 -182518 -285051 -152042 -236520 -119990 -9863 40956 94821 213623 210891
13289 210891 30982 -310535 -166766 172275 368421 497876 277629 -170381 57437 171258
13279 171258 -29763 -208254 -57167 89877 158502 -82653 -158421 -30721 189459 253767
13269 253767 341111 233606 322740 273440 107428 -219257 -488047 -488442 -187499 -76559 -63682
13258 -63682 -96630 -181873 -14726 313179 514539 302949 -7663 42528 90214 -52128
13248 -52128 42924 243239 187187 307524 241880 215491 198864 148310 394789 423556 439449
$$ packed form
13321B80484j58709P4958k6506P9527n9227j72189J27791J23385J13991M32J47325
13310E31262l21845J9631J86637j26889o0565l3099R8819O5436O39j61300p2356
13299A26370l08888j02533J33009q4478J16530J10127N0819N3865J18802k732
13289B10891j79909l41517J43769L39041J96146J29455k20247m48010K27818J13821
13279A71258k01021j78491J51087J47044O8625k41155p5768J27700K20180O4308
13269B53767Q7344j07505Q9134m9300j66012l26685k68790l95L00943J10940J2877
13258f3682l2948q5243J67147L27905K01360k11590l10612N0191M7686j42342
13248e2128R5052K00315n6052J20337o5644k6389j6627n0554K46479K8767J5893
$$ plain form
13237 439449 535304 395492 197384 23349 -81001 27055 126545 266153 177559 44674
13227 44674 149507 6519 -542675 -716569 -293995 -94560 9995 -35056 -155472 -142031
13217 -142031 -176560 -178151 -215205 -300630 -169140 -159774 -211024 -109144 209596 224345 249454
13206 249454 90387 -205337 -553391 -676821 -521306 -181434 -87119 -112374 -399853 -270518
13196 -270518 -21330 183564 220768 290745 217437 178032 301287 214007 158545 296516 542197
13185 542197 439056 -6346 -194329 -110278 -63752 54145 21856 -21442 -297124 -242958
13175 -242958 -347435 -178549 -100480 -181561 -227125 -325392 -381641 -422206 -277171 9537 86416
13164 86416 36893 121265 82912 85413 290944 378717 406485 320972 145591 75416 43074
$$ packed form
13237D39449R5855j39812j98108j74035j04350J08056R9490J39608q8594j32885
13227D4674J04833j42988n49194j73894M22574J99435J04555m5051j20416J3441
13217a42031l4529j591l7054q5425J31490R366n1250J01880L18740J4749K5109
13206B49454j59067k95724l48054j23430J55515L39872R4315k5255k87479J29335
13196b70518K49188K04894L7204O9977p3308l9405J23255q7280n5462J37971K45681
13185E42197j03141m45402j87983Q4051M6526J17897l2289m3298k75682N4166
13175b42958j04477J68886P8069q1081m5564r8267n6249m0565J45035K86708P6879
13164H6416m9523Q4372l8353K501K05531Q7773K7768q5513j75381p0175l2342
$$ plain form
13153 43074 -42388 167086 381471 380775 384694 209353 26091 -151162 -232646 -85085 76750
13142 76750 -107078 -139774 19794 107387 29869 96044 241820 424008 364644 344109 190515
13131 190515 -35425 -287930 -331049 -271968 -284284 -325339 -187693 -180939 -7595 -65943 -75388
13120 -75388 -419705 -512356 -211987 -110694 130074 331679 208032 194797 282224 126681
13110 126681 155073 26588 105128 107937 -77794 61859 380094 705989 576661 159784
13100 159784 115026 161669 197056 120941 200366 119130 -104425 -316888 -310464 -448107 -276896
13089 -276896 -70001 -231335 -295330 -230890 -316191 -453039 -285014 -301379 -326158 -375216 -326557
13078 -326557 -305100 -143345 204417 384727 355023 384794 441388 376402 357458 179244 -53153
$$ packed form
13153D3074q5462K09474K14385o96L919j75341j83262j77253q1484J47561J61835
13142G6750j83828l2696J59568Q7593p7518O6175J45776J82188n9364k0535j53594
13131A90515k25940k52505m3119N9081j2316m1055J37646O754J73344n8348r445
13120g5388l44317r2651L00369J01293K40768K01605j23647j3235Q7427j55543
13110A26681K8392j28485P8540K809j85731J39653L18235L25895j29328m16877
13100A59784m4758M6643L5387p6115P9425q1236k23555k12463O424j37643J71211
13089b76896K06895j61334o3995O4440q5301j36848J68025j6365k4779m9058M8659
13078c26557K1457J61755L47762J80310k9704K9771N6594o4986j8944j78214k32397
$$ plain form
13067 -53153 162550 178371 -98013 -65732 191197 360317 212975 67256 59108 -111596
13057 -111596 -96269 -56305 -104131 -74180 -222363 -147400 -220577 -167405 -106471 54567 43462
13046 43462 130870 99228 -116701 -4897 86059 45674 -63900 -150123 -76666 -110200 -333171
13035 -333171 -49315 12 -104240 -81366 159975 283145 297073 367941 578329 549751
13025 549751 537985 215699 98768 1704 -161741 15697 329774 138369 339282 373689
13015 373689 214295 142782 140986 130970 120906 21317 204959 187363 -3316 -83699 -45746
$$ packed form
13067e3153K15703J5821k76384L2281K56929J69120j47342j45719q148j70704
13057a11596J5327L9964m7826K9951j48183P4963p3177N3172O0934J61038j1105
13046D3462Q7408l1642k15929J11804R0956m0385j09574q6223P3457l3534k22971
13035c33171K83856M9327j04252K2874K41341J23170J3928P0868K10388k8578
13025E49751j1766l22286j16931r7064j63445J77438L14077j91405K00913L4407
13015C73689j59394p1513j796j0016j0064r9589J83642j7596j90679q0383L7953
$$ [...]
##END NTUPLES=NMR SPECTRUM
##END=
