##TITLE=Analysis number 327598
Compound Code mo 01274
Book Reference 488/188
Project Code adrs
Chemist Name miguelg
##JCAMPDX= 6.0         $$ Bruker NMR JCAMP-DX V2.0
##DATA TYPE= NMR SPECTRUM
##DATA CLASS= NTUPLES
##ORIGIN= Bruker BioSpin GmbH
##OWNER= nmr
$$ XWIN-NMR		Version 3.5
$$ Tue Mar 27 15:19:08 2007 GMT Daylight Time (UT+1h)  MAYBRIDGE\nmr@NMR_250MHZ
##.OBSERVE FREQUENCY= 250.131544655141
##.OBSERVE NUCLEUS= ^1H
##.ACQUISITION MODE= SIMULTANEOUS (DQD)
##.ACQUISITION SCHEME= undefined
##.AVERAGES= 16
##.DIGITISER RES= 18
##SPECTROMETER/DATA SYSTEM= dpx250
##.PULSE SEQUENCE= zg30
##.SOLVENT NAME= CDCl3
##.SHIFT REFERENCE= (INTERNAL, CDCl3, 0, 16.522)
##AUDIT TRAIL= $$ (NUMBER, WHEN, WHO, WHERE, WHAT)
$$ ##TITLE= Audit trail, XWIN-NMR		Version 3.5
$$ ##JCAMPDX= 5.01
$$ ##ORIGIN= Bruker BioSpin GmbH
$$ ##OWNER= nmr
$$ C:\u/data/dgb/nmr/ADRS/2270/pdata/1/auditp.txt
$$ ##AUDIT TRAIL=  $$ (NUMBER, WHEN, WHO, WHERE, WHAT)
(   1,<2007-03-27 15:18:38.54 +100>,<MAYBRIDGE\nmr>,<NMR_250MHZ>,
      <created by zg, POWCHK disabled, PULCHK disabled
       configuration hash MD5:
       49 4B E0 1D 92 C2 6B 37 9F E6 65 BC 52 41 86 1D
       data hash MD5: 64K
       24 C1 80 9D 5B EE BC C0 0B CA 41 33 E4 EE 32 72>)
(   2,<2007-03-27 15:18:55.00 +100>,<MAYBRIDGE\nmr>,<NMR_250MHZ>,
      <Start of raw data processing
       ef LB = 0.3 FT_mod = 6 PKNL = 1 SI = 32K 
       data hash MD5: 32K
       F2 46 3F 8F 29 B6 96 C1 86 6C B8 6A 72 5E F0 CF>)
(   3,<2007-03-27 15:18:57.10 +100>,<MAYBRIDGE\nmr>,<NMR_250MHZ>,
      <apk 
       data hash MD5: 32K
       83 8F 28 12 39 DF 7D CF 6E 3E DA 7E 62 D0 0B E3>)
(   4,<2007-03-27 15:18:58.89 +100>,<MAYBRIDGE\nmr>,<NMR_250MHZ>,
      <abs ABSG = 5 
       data hash MD5: 32K
       FC A5 20 B9 8A 1D 19 69 28 A4 3A CA 44 CB 21 01>)
$$ ##END=
$$ 
$$ hash MD5
$$ B0 26 CE 81 FA 6D B4 96 ED C4 13 57 88 77 D1 C6
##$RELAX= 
##$RELAX= 
##$RELAX= 
##$RELAX= 
##$RELAX= 
##$RELAX= 
##$RELAX= 
$$ Bruker specific parameters
$$ --------------------------
##$DU= <C:\u>
##$EXPNO= 2270
##$NAME= <ADRS>
##$PROCNO= 1
##$TYPE= <nmr>
##$USER= <dgb>
##$AMP= (0..31)
100 100 100 100 100 100 100 100 100 100 100 100 100 100 100 100 100 100 
100 100 100 100 100 100 100 100 100 100 100 100 100 100 
##$AQSEQ= 0
##$AQ_mod= 3
##$AUNM= <au_zg>
##$AUTOPOS= <48 >
##$BF1= 250.13
##$BF2= 250.13
##$BF3= 250.13
##$BF4= 250.13
##$BF5= 500.13
##$BF6= 500.13
##$BF7= 500.13
##$BF8= 500.13
##$BYTORDA= 1
##$CFDGTYP= 0
##$CFRGTYP= 5
##$CHEMSTR= <none>
##$CNST= (0..31)
1 1 145 1 1 1 1 1 1 1 1 1 1 1 1 1 1 1 1 1 1 1 1 1 1 1 1 1 1 1 1 1 
##$CPDPRG= <>
##$CPDPRG1= <>
##$CPDPRG2= <>
##$CPDPRG3= <>
##$CPDPRG4= <mlev>
##$CPDPRG5= <mlev>
##$CPDPRG6= <mlev>
##$CPDPRG7= <mlev>
##$CPDPRG8= <mlev>
##$CPDPRGB= <>
##$CPDPRGT= <>
##$D= (0..31)
0 1 0 0 0 0 0 0 0 0.06 0 0 0 0 0 0 0.0002 0 0 0 0 0 0 0 0 0 0 0 0 0 0 
0 
##$DATE= 1175005117
##$DBL= (0..7)
120 120 120 120 120 120 120 120 
##$DBP= (0..7)
150 150 150 150 150 150 150 150 
##$DBP07= 0
##$DBPNAM0= <>
##$DBPNAM1= <>
$$ [...]
##$SUBNAM7= <"">
##$SUBNAM8= <"">
##$SUBNAM9= <"">
##$SW= 20.6930455092707
##$SWIBOX= (0..15)
0 0 3 0 0 0 0 0 0 0 0 0 0 0 0 0 
##$SW_h= 5175.983436853
##$TD= 65536
##$TD0= 1
##$TE= 683.16
##$TE2= 300
##$TE3= 300
##$TEG= 300
##$TL= (0..7)
0 120 120 120 120 120 120 120 
##$TP= (0..7)
150 150 150 150 150 150 150 150 
##$TP07= 0
##$TPNAME0= <>
##$TPNAME1= <>
##$TPNAME2= <>
##$TPNAME3= <>
##$TPNAME4= <>
##$TPNAME5= <>
##$TPNAME6= <>
##$TPNAME7= <>
##$TPOAL= (0..7)
0.5 0.5 0.5 0.5 0.5 0.5 0.5 0.5 
##$TPOFFS= (0..7)
0 0 0 0 0 0 0 0 
##$TUNHIN= 0
##$TUNHOUT= 0
##$TUNXOUT= 0
##$USERA1= <user>
##$USERA2= <user>
##$USERA3= <user>
##$USERA4= <user>
##$USERA5= <user>
##$V9= 5
##$VALIST= <valist>
##$VCLIST= <CCCCCCCCCCCCCCC>
##$VD= 0
##$VDLIST= <DDDDDDDDDDDDDDD>
##$VPLIST= <PPPPPPPPPPPPPPP>
##$VTLIST= <TTTTTTTTTTTTTTT>
##$WBST= 1024
##$WBSW= 4
##$XGAIN= (0..3)
0 0 0 0 
##$XL= 0
##$YL= 0
##$YMAX_a= 332263
##$YMIN_a= -353946
##$ZGOPTNS= <>
##$ZL1= 120
##$ZL2= 120
##$ZL3= 120
##$ZL4= 120
##$ABSF1= 16.522
##$ABSF2= -4.171173
##$ABSG= 5
##$ABSL= 3
##$ALPHA= 0
##$AQORDER= 0
##$ASSFAC= 0
##$ASSFACI= 0
##$ASSFACX= 0
##$ASSWID= 0
##$AUNMP= <proc_1d>
##$AZFE= 0.1
##$AZFW= 0.1
##$BCFW= 0
##$BC_mod= 0
##$BYTORDP= 0
##$COROFFS= 0
##$CY= 12.5
##$DATMOD= 1
##$DC= 0
##$DFILT= <>
##$DTYPP= 0
##$F1P= 14.0000005364418
##$F2P= -0.99999901652339
##$FCOR= 0.5
##$FTSIZE= 32768
##$FT_mod= 6
##$GAMMA= 0
##$GB= 0
##$INTBC= 1
##$INTSCL= 1
##$ISEN= 128
##$LB= 0.3
##$LEV0= 0
##$LPBIN= 0
##$MAXI= 10000
##$MC2= 0
##$MEAN= 0
##$ME_mod= 0
##$MI= 0
##$NCOEF= 0
##$NC_proc= -2
##$NLEV= 6
##$NOISF1= 0
##$NOISF2= 0
##$NSP= 0
##$NTH_PI= 0
##$NZP= 0
##$OFFSET= 16.522
##$PC= 1
##$PHC0= 233.3469
##$PHC1= 8.353813
##$PH_mod= 1
##$PKNL= yes
##$PPARMOD= 0
##$PSCAL= 4
##$PSIGN= 0
##$REVERSE= no
##$SF= 250.13
##$SI= 32768
##$SIGF1= 0
##$SIGF2= 0
##$SINO= 400
##$SIOLD= 32768
##$SREGLST= <1H.CDCl3>
##$SSB= 0
##$STSI= 32768
##$STSR= 0
##$SW_p= 5175.98343685301
##$SYMM= 0
##$S_DEV= 0
##$TDeff= 65536
##$TDoff= 0
##$TI= <Analysis number 999999
Compound Code 99
Book Reference 9
Project Code 9>
##$TILT= no
##$TM1= 0
##$TM2= 0
##$TOPLEV= 0
##$USERP1= <user>
##$USERP2= <user>
##$USERP3= <user>
##$USERP4= <user>
##$USERP5= <user>
##$WDW= 1
##$XDIM= 32768
##$YMAX_p= 376554507
##$YMIN_p= -207800
$$ End of Bruker specific parameters
$$ ---------------------------------
##NTUPLES= NMR SPECTRUM
##VAR_NAME=  FREQUENCY,     SPECTRUM/REAL,   SPECTRUM/IMAG
##SYMBOL=    X,             R,               I
##VAR_TYPE=  INDEPENDENT,   DEPENDENT,       DEPENDENT
##VAR_FORM=  AFFN,          ASDF,            ASDF
##VAR_DIM=   32768,         32768,           32768
##UNITS=     HZ,            ARBITRARY UNITS, ARBITRARY UNITS
##FACTOR=    0.157963299565203, 1,           1
##FIRST=     4132.6476996994, 0,             0
##LAST=      -1043.33573715361, 0,           0
##MIN=       -1043.33573715361, -207800,     0
##MAX=       4132.6476996994, 376554507,     0
$$ Real data points
##PAGE= N=1
##DATA TABLE= (X++(R..R)), XYDATA
$$ [...]
16834A1662n4078J8170K0631j0300j3609J3336J5228P356j112j9768k4608j0654
16822d7746M513K1190m697N976L2954O394j4348q599q685j4205j9984R299P663
16809c0275K3116J0512k0125p504L220J2843P580o905K625P67M257j8630j1246
16796b9765j1648o486O339q40Q102K114m651q655J0356O871J2477R451o18j9826
16782b6779m246J0883J8423p073j0837r49L365M643K340k68k2032m580r345R685
16768c6770Q607J6096N092m915J0934o478j0793J4874P703o645o752k1218M172
16755b6093N21K5586r29l731J7711R042m083l498l876j4445n247j5615K6546J4383
16741A6272J078k580r919J8672k073J218Q586J6486q19j2954m980j1871j0289
$$ plain form
16834 11662 -42416 -24246 -3615 -13915 -27524 -14188 1040 8396 7284 -12484 -37092 -47746
16822 -47746 -43233 -22043 -26740 -20764 12190 18584 4236 -4363 -13048 -27253 -47237 -37938 -30275
16809 -30275 -7159 3353 -16772 -24276 -21056 -8213 -633 -7538 -4913 -4146 111 -18519 -29765
16796 -29765 -41413 -47899 -41560 -42400 -34298 -32184 -36835 -45490 -35134 -28263 -15786 -6335 -6953 -26779
16782 -26779 -31025 -20142 -1719 -8792 -19629 -20578 -17213 -12570 -10230 -10498 -32530 -37110 -46455 -36770
16768 -36770 -28163 -12067 -6975 -11890 -956 -7434 -18227 -3353 4350 -2295 -9047 -30265 -26093
16755 -26093 -25572 14 -915 -4646 13065 22107 18024 14526 10650 -3795 -9042 -24657 1889 16272
16741 16272 17350 14770 4851 23523 21450 22668 31254 47740 46921 33967 28987 17116 6827
16728F827q890M871J7622k836j1413j0168J129j2397l900M388J4635n370q061
16715a3563L3223J0911L040j809l597n726j75j218o95j1120q828j3972Q268J3527
16701H266J051o150j1193N060k654J651J2045j0667q582L077j015j6080J4716
16688a0475J5858j4604J3326K2008O516k6836l799J2237n575o734M950J3756M10
16675B1038k450l13L898j020n665j6192l4650j0K6195K1069p82o584P649p849
16661D334p438K968j5789l290P619l415j3043L819O305J4582O268o502m677M265
16647c994M767j3504k1047M407M2034Q340J9656J0274n773l4362j722J2920k582
16634A9414o727p33r09L626j1885j2138j3399o885J0350p856O315R595M670J4943
$$ plain form
16728 6827 -2063 2808 20430 17594 6181 -3987 -2858 -15255 -19155 -14767 -132 -5502 -13563
16715 -13563 19660 30571 33611 31802 28205 22479 22304 21086 20391 9271 443 -13529 -5261 8266
16701 8266 9317 3167 -8026 -2966 -5620 -3969 8076 -2591 -11173 -8096 -9111 -25191 -10475
16688 -10475 5383 -9221 4105 26113 32629 5793 1994 14231 8656 1922 6872 20628 21038
16675 21038 18588 18275 22173 21153 15488 -704 -35354 -35364 -9169 11900 11118 4534 12183 4334
16661 4334 -3104 -136 -15925 -19215 -11596 -15011 -28054 -24235 -17930 -3348 2920 -3582 -8259 -3994
16647 -3994 773 -12731 -33778 -29371 12663 21003 40659 50933 45160 10798 9076 21996 19414
16634 19414 12687 11954 11045 14671 2786 -9352 -22751 -29636 -19286 -27142 -20827 -11232 -6562 8381
16620H381j9667l1113K271K7676R334p260j30P256Q20l647k943J6740K4880j58
16606C2440j3778p565k0000k1979o803K6905K2307K29L269r980j1100L774n588
16593g869o324k927n954J695j7981k8511M435N3486J4335J0768K067o280j1361
16580d21J8730L503j8409r10J2448J307l831n592r357j1759R135o630J5845M910
16566H969j2914L793J3026j1409j8383J4312N289j2263q813N930j0472o051q05
16553b9791Q77m011J5576J6656k160j0091l764L224J1292Q825p00r616o397l226
16539a3306m217j5052K483J7073M421n579J656J625j8688j9608K181J2883j8009
16526e2137J9662l340j609j819M738l361K7615M0265R613j5737r951j3170N291
$$ plain form
16620 8381 -11286 -42399 -40128 -12452 -3118 -10378 -10508 -3252 -2432 -6079 -9022 7718 32598 32440
16606 32440 18662 11097 -8903 -30882 -37685 -10780 11527 11756 15025 5045 -6055 -2281 -7869
16593 -7869 -14193 -17120 -23074 -21379 -39360 -67871 -63436 -9950 4385 15153 17220 10940 -421
16580 -421 18309 21812 3403 2493 14941 16248 12417 6825 -2532 -14291 -5156 -11786 4059 8969
16566 8969 -3945 -152 12874 1465 -16918 -2606 2683 -9580 -18393 -12463 -22935 -28986 -29791
16553 -29791 -28914 -32925 -17349 -693 -2853 -12944 -16708 -13484 -2192 6633 5933 -3683 -10080 -13306
16539 -13306 -17523 -32575 -30092 -13019 -8598 -14177 -12521 -10896 -29584 -49192 -47011 -34128 -52137
16526 -52137 -32475 -35815 -37424 -39243 -34505 -37866 -10251 30014 39627 23890 13939 769 6060
16513F060J0126m461j9289N81j009J1854N969l356n938l403k2477l764J5621l064
16499a6550p728k289J7087P396j0683q403o888M076K1310J5171k0005j902J6819
16486G411l0578p570N623P558L0657J4370j0298k5944q766J5008p527P645K4122
16473B1711P482k4702k9014J8616J1870k696k76K538J656k089j0293K701L820
16460A324K589o186r302K2755N295r537J2217j3607r380n534j0919M192J0551
16447e542p364J55j0382R953J2890J2671L2204j232k9828k5503J3163J9689o198
16434A4676j7130N862J1656O974r088j7952k3239k927K598l047j076K2744K698
16421g251j5498L261M68J0277N242J1788j9174j5690l944J595K5825M92J7114
$$ plain form
16513 6060 16186 11725 -7564 -6983 -7992 3862 9831 6475 537 -2866 -25343 -29107 -13486 -16550
16499 -16550 -24278 -26567 -9480 -2084 -12767 -21170 -28058 -23982 -2672 12499 -7506 -9408 7411
16486 7411 -23167 -30737 -25114 -17556 13101 27471 17173 -8771 -17537 -2529 -10056 -2411 21711
16473 21711 29193 4491 -24523 -5907 5963 3267 2991 5529 7185 5096 -5197 -2496 1324
16460 1324 3913 -2273 -11575 11180 16475 6938 19155 5548 -3832 -9366 -20285 -16093 -5542
16447 -5542 -12906 -12751 -23133 -13180 -290 12381 44585 43353 13525 -11978 1185 20874 14676
16434 14676 -2454 3408 15064 22038 12950 -5002 -28241 -31168 -28570 -31617 -32693 -9949 -7251
16421 -7251 -22749 -19488 -19020 -8743 -3501 8287 -10887 -26577 -30521 -28926 -3101 -2609 14505
16408A4505l599o421J6710o461j1484j1885N058J1916m761m610j9719j8867l625
16395d3243K4123K0859J5699o888P11Q040n109k3886k6383Q676J1438Q887p030
16382a4106k465q97N992J5094K844r334M431P130J0404K2838j0693j0111r385
16369A1742k0352L383j058j08M419J3184O978Q93L606j730l308l897P220n970
16355A5002k4817j4430j2939J6383j1816J5478K077j913r886j0239j846J8097
16343b0849l957j5980Q724J8404J5743k302R00J9547O547J019J176m305p017k827
16329A4823o254q308l532j302K4532N257n756J0637R717m861n015k3471j6466
16316i999J7805J5959j8819l092j3308N946K1477J193n526l0688k1292L4560K144
$$ plain form
16408 14505 10906 4485 21195 14734 3250 -8635 -3577 8339 3578 -1032 -20751 -39618 -43243
16395 -43243 -19120 1739 17438 10550 11261 19301 14192 -9694 -36077 -27401 -15963 -7076 -14106
16382 -14106 -16571 -17468 -11476 3618 6462 -2872 1559 8689 19093 41931 31238 21127 11742
16369 11742 -8610 -5227 -6285 -6393 -1974 11210 18188 19081 22687 20957 17649 13752 20972 15002
16355 15002 -9815 -24245 -37184 -20801 -32617 -17139 -15062 -16975 -26861 -37100 -38946 -20849
16343 -20849 -24806 -40786 -32062 -13658 2085 -217 683 20230 26777 27796 28972 24667 17650 14823
16329 14823 8569 261 -3271 -4573 19959 25216 19460 30097 39814 34953 29938 6467 -9999
16316 -9999 7806 23765 4946 1854 -11454 -5508 15969 17162 11636 -19052 -40344 -5784 -3640
16303c640l483J1865j4797J3450J1187j0431l667K5201M312K685L107o04p894
16290B7291M090N765p263j4245J724j278p013K084L207k6084j0944J2283J5047
16277D664l296k2417Q426m306o88M559K096J4071j7201J4381J6422j8774j904
16264c967J8812K2116L631K5181R807l09j0499L804n045j2766j6906j3042k7341
16251f524k225J3505J6907o528j9968j1978j6446j0614j3537N373j0576L8246
16239b4365J7734k5378J1470O397j1540l8790j542J3195J1942L936L8J783J3639
16226b1481Q441J666O708L914K0671l616j1014o570j238R828j8926J585j1611
16213b1643k116J8365K255J3118P963n777j0118l384J6903J0007K7304l904l0912
$$ plain form
16303 -3640 -7123 4742 -10055 3395 14582 4151 484 25685 29997 32682 35789 35185 27291
16290 27291 31381 37146 29883 15638 17362 16084 9071 11155 14362 -11722 -22666 -10383 4664
16277 4664 1368 -21049 -12623 -16929 -17617 -13058 -10962 3109 -14092 289 16711 -2063 -3967
16264 -3967 14845 36961 40592 65773 75580 75271 64772 68576 63531 50765 33859 20817 -6524
16251 -6524 -8749 4756 21663 15135 -4833 -16811 -33257 -43871 -57408 -52035 -62611 -24365
16239 -24365 -6631 -32009 -20539 -14142 -25682 -64472 -66014 -52819 -40877 -36941 -36903 -35120 -21481
16226 -21481 -13040 -11374 -4666 -752 19919 16303 5289 -1281 -2519 7309 -11617 -10032 -21643
16213 -21643 -23759 -5394 -3139 9979 17942 12165 2047 -1337 15566 25573 52877 48973 18061
16200A8061j1565N232j7829O567n586J6815P647j4012J537J0478j5585k2205Q777
16187a1668k979L68J8381K7076J2738o535j9290k829j1883j1137l611k198M98
16174a3069J4098K3397q452m911J400n137Q715k2504j8547m565r21J6840O407
16161g249L209J2215N436k1859j4660j5074L5M283P896j9834j0121J7424Q378
16148b9921k161K9845J1539j2525j0196j15J9151L5659O430k8085k3435L342O352
16135E880r286l930R723j63j9099k768J8750J9693M411R085l450j1949K2308J9031
16121E8236k2673j6102j0448j087J2757l302p915j0974j4745k345P804J2572L129
16108D907n474R881K3323j349j3313J2242J8191k909J865j3237O08k3297j3370
$$ plain form
16200 18061 6496 11728 -6101 466 -5120 11695 19342 5330 6867 17345 1760 -20445 -11668
16187 -11668 -14647 -14279 4102 31178 43916 37381 18091 15262 3379 -7758 -11369 -13567 -13069
16174 -13069 1029 24426 15974 11063 12463 7326 16041 -6463 -25010 -29575 -30496 -13656 -7249
16161 -7249 -4040 8175 13611 -8248 -22908 -37982 -37947 -33664 -25768 -45602 -55723 -38299 -29921
16148 -29921 -32082 -2237 9302 -3223 -13419 -13534 5617 41276 47706 19621 -3814 -472 5880
16135 5880 -3406 -7336 2387 2224 -16875 -19643 -893 18800 23211 32296 28846 16897 39205 58236
16121 58236 35563 19461 9013 7926 20683 17381 9466 -1508 -16253 -18598 -10794 1778 4907
16108 4907 -567 9314 32637 31288 17975 30217 48408 45499 47364 34127 34735 11438 -1932
16095a932o461j00j894J5206K3354J1174k324l7333j2242J0260Q588r962J9229
16082A5563Q014L731p251r084n870l0049n364O177J3176j6674P18J1479J6479
16069A045o105M529J2243j2327o694j4961j8679M83O644J9168m121J5050q16M266
16055b75q436q332K970j1148l846K5168J7202r019l888q172J6884K271m586m22
16041F371J7814J9737J5213k0923k3184k3818j6641m48K2879R218Q459p295j2219
16028d837l110M019J6732J1885j2045r095j0746p355M738j36j04r915M115j295
16014a7149r828J2576J2472K1262j8571K413k001j9886m168p845k728J5801K1108
16001C456l575k0129j1417J183n895K2528J8315j6666l6262r097J9135L420k1331
$$ plain form
16095 -1932 -8393 -8493 -10387 4819 28173 39347 37023 -310 -12552 -2292 6296 -3666 15563
16082 15563 23577 27308 20057 10973 5103 -24946 -30310 -24133 -10957 -27631 -26913 -15434 1045
16069 1045 -5060 -531 11712 -615 -7309 -22270 -40949 -40466 -33822 -14654 -18775 -3725 -4541 -275
16055 -275 -8711 -17043 -14073 -25221 -29067 -3899 13303 4284 396 -7776 9108 11379 6793 6371
16041 6371 24185 43922 59135 38212 15028 -8790 -25431 -25879 -3000 6218 14677 7382 -4837
16028 -4837 -7947 -3928 12804 24689 12644 3549 -7197 -14552 -9814 -9950 -10054 -19969 -15854 -17149
16014 -17149 -26977 -14401 -1929 19333 762 3175 1174 -18712 -22880 -30725 -33453 -17652 3456
16001 3456 -119 -20248 -31665 -30482 -36377 -13849 4466 -12200 -48462 -57559 -38424 -35004 -56335
15988e6335M751J8491L5215J1033J459k3860j9640K1695O994j2476p161L576K203
15975a4055J8572P006j1290j650O340J3997K4868R568l5491k0995J368L757M900
15962F895J8529p499j8213k1202r069J6103K3359K1756R461p073p912o069j9870
15949h04r867j2004L696J1486m216k162Q90N713K408k0388M58M852m347j0331
15935c4616K469J7648P601L0513K954k0187l8481k8725j719K0235J3498P190R389
15922a2231j3409q99m715j6898j758Q850K0781Q746j4236r301L267O66J7757J7531
15908D151L838k598J6433p285r300j5245k8905R951J3330J4004J2511k6599o830
15895b2544N790L990K2575K1153j4471k5432k103l628j3109l607J9723M7230J6965
$$ plain form
15988 -56335 -51584 -33093 2122 13155 14614 -9246 -28886 -7191 -197 -12673 -19834 -16258 -14055
15975 -14055 4517 11523 233 -1417 4923 18920 43788 53356 17865 -3130 -1762 1995 6895
15962 6895 25424 17925 -288 -21490 -30559 -14456 8903 30659 40120 33047 25135 19066 -804
15949 -804 -10671 -22675 -18979 -7493 -11709 -13871 -12981 -7268 -4860 -25248 -24790 -19938 -24285 -34616
15935 -34616 -32147 -14499 -6898 23615 26569 6382 -32099 -60824 -62543 -42308 -28810 -21620 -12231
15922 -12231 -25640 -26539 -31254 -48152 -49910 -41060 -20279 -11533 -25769 -35070 -31803 -31137 -13380 4151
15908 4151 7989 5391 21824 14539 5239 -10006 -38911 -28960 -15630 -1626 10885 -15714 -22544
15895 -22544 -16754 -12764 9811 30964 16493 -8939 -11042 -14670 -27779 -31386 -11663 35567 52532
15882E2532k6894l3792p626J6111m245m772j6415j7186q671K9048N527J1171r040
15869a4252L725R757l4850m389M019j2006K4356R676p501m077j8372M494J7361
15856b2059Q072m858J6702O021P426K909m205k0575k4350n949O142j1199K747
15843d3176L8743J7530j1000j4130m892l78r175L1461M402K732n527j3313N663
15830a060K101j343k650n168J7644L59j9995N31P893n69l898J0813j7315j0822
15816b3479K335J1594J4991K666o5j7626j9085j4506J3343N999K2220j940O663
15803C110p749m588J050p225j71Q295Q461O860M675Q801O81k6609j4528L013m367
15788b0291M750N282j2248j1346j880N656J3854J5546o853N456j254l633R315
$$ plain form
15882 52532 25638 -8154 -15780 331 -3914 -8686 -25101 -42287 -50958 -21910 -16383 -5212 -14252
15869 -14252 -10527 -770 -35620 -40009 -35990 -47996 -23640 -13964 -21465 -25542 -43914 -39420 -22059
15856 -22059 -13987 -18845 -2143 3878 11304 14213 10008 -10567 -34917 -40866 -34724 -45923 -43176
15843 -43176 -4433 13097 2097 -12033 -16925 -17303 -26478 4983 9385 12117 6590 -6723 -1060
15830 -1060 1041 -302 -2952 -8120 9524 9883 -10112 -9581 -1688 -2257 -6155 4658 -12657 -23479
15816 -23479 -21144 -9550 5441 8107 8042 -9584 -28669 -43175 -29832 -23833 -1613 -3553 3110
15803 3110 -4639 -9227 -8177 -15402 -15573 -7278 1183 8043 12718 21519 22200 -4409 -18937 -15924 -20291
15788 -20291 -15541 -10259 -22507 -33853 -35733 -30077 -16223 -677 -7530 -2074 -3328 -6961 2354
15775B354m95p650j0626L449J869q548K3503n617J0180M782R248J2118Q44J4849
15761E0260q5M993M5074M4958K1701K1304l0984o1315m3351k3142J414J0308J349
15748D2484k0531k578O762r452j439j1131r933N731Q462j1432k4787m754J5068
15735a7530k2828n11K1122K556J5260N479Q995Q295Q207j0539j6766j9468N346
15722a2382J0632O571l480n379J7472k328Q827r511P34J7232L4070j7819j1726
15709C2913j4279o366q022q766Q618j6219j449K191L943o26j8980j032J452R834
15695a6788K2026J6416o650p490L31m032j9591l4652M385K6224J7644K5273L295
15682B6391j9020k6128J5J6340J888j0854j592O352m341k442J323J1382J8864
$$ plain form
15775 2354 1859 -5791 -16417 -12968 -11099 -19647 3856 -1761 8419 13201 22449 34567 35411 50260
15761 50260 50175 55168 100242 145200 166901 188205 157221 95906 52555 29413 30827 41135 42484
15748 42484 21953 19375 26137 16685 15246 4115 -5818 -87 8375 -3057 -27844 -32598 -17530
15735 -17530 -40358 -40869 -19747 -17191 -1931 3548 12543 20838 29045 18506 1740 -17728 -12382
15722 -12382 -1750 4821 1341 -4038 13434 11106 19933 10422 11156 28388 62458 44639 32913
15709 32913 18634 12268 4246 -4520 4098 -12121 -13570 -11379 -7436 -8062 -27042 -28074 -26622 -16788
15695 -16788 5238 21654 15004 7514 7845 3813 -15778 -50430 -46045 -19821 -2177 23096 26391
15682 26391 7371 -18757 -18742 -2402 -514 -11368 -12960 -6608 -10949 -13391 -12068 -686 18178
15669A8178P714j7650n156j2794j847j4163J2939j405j0251K5507J7150r503l1051
15656b2332l129K665N38L051O408L631M234J621n125n397n859M026k1904R009
15642b8563O874r229J3492q807k1526J6340M047M543J2180N934P262J6789R47
15629B0283q290J7329M780n09k0063j2725j2588K586J253O386j3986M318q52R363
15615b715J503N388n05k0733Q48M612l768O194J203J4888K445P653j0767J4466
15601B0712j2854K679K8661R409r400j9607j4609j2597J3745R081j4878j0706
15589a0364J8220J3759P834k9849k3372L575J9730l113L998J1002O11j5317K894
15576c92N65M162K6617j4630k7507m977Q544K1144j5470q322n537K351L1686K4480
$$ plain form
15669 18178 25892 8242 3086 -9708 -11555 -25718 -12779 -14184 -24435 1072 18222 8719 -22332
15656 -22332 -25461 -22796 -22258 -19207 -12799 -9168 -4934 -3313 -8438 -13835 -19694 -15668 -37572 -28563
15642 -28563 -21689 -30918 -17426 -26233 -47759 -31419 -27372 -22829 -10649 -4715 2547 19336 20283
15629 20283 11993 29322 34102 33593 13530 805 -11783 -9197 -7944 -1558 -15544 -11226 -12078 -2715
15615 -2715 -1212 4176 3671 -17062 -16214 -11602 -15370 -9176 -7973 6915 9360 17013 6246 20712
15601 20712 7858 10537 39198 48607 39207 19600 4991 -7606 6139 15220 342 -10364
15589 -10364 7856 21615 29449 -400 -23772 -20197 -467 -3580 418 11420 12031 -3286 -392
15576 -392 173 4335 30952 16322 -11185 -16162 -7618 13526 -1944 -10266 -15803 -13452 18234 42714
15562D2714O611j90j0583m310p817k755L991j4660J769J3559Q996q978L875K10
15548C2432j5397j2821R37k0177K1085J3066p578m364j0617J7697L665R89j8032
15535H85q673l466j6174j2311j170K6554J4751J2080j9599k1602J0129L6676j1611
15522F469k4616O86J052K0032j0651k2612k3037K0444K1780K0321K1524k1026
15510A0366j7070K3564J8955j3414J2399n820k2784k117L123J3873j8485j1718
15498i128p82l362p25J3755J3158J930n565j320k691q264q93Q031R15N146q408
15483A797k099o353J431k749l0271n740J3556J9475J4258j1132j4018L008J8499
15470c38J0421j5540j5404k217L257L380j2275K1557k923J993Q081M821k833J724
$$ plain form
15562 42714 49325 49135 38552 34242 26425 23670 27661 13001 14770 28329 37325 28347 32222 32432
15548 32432 17035 4214 5151 -15026 6059 19125 11547 7183 -3434 14263 17928 18917 885
15535 885 -7788 -11254 -27428 -39739 -40909 -14355 396 12476 -7123 -28725 -18596 18080 6469
15522 6469 -18147 -17461 -16409 3623 -7028 -29640 -52677 -32233 -10453 9868 31392 10366
15510 10366 -6704 16860 35815 22401 34800 28980 6196 4079 7202 21075 2590 -9128
15498 -9128 -9910 -13272 -13997 -242 12916 14846 9281 7961 5270 -2994 -3887 4144 5059 10205 1797
15483 1797 -302 -6655 -5224 -7973 -38244 -43984 -30428 -10953 3305 -7827 -21845 -18837 -338
15470 -338 10083 -5457 -20861 -23078 -19821 -16441 -28716 -7159 -10082 -8089 -8 4813 1980 3704
15456C704r798j8904q254J8186k904j8451M994J730J0121R209o343k2302J5481
15443b3531K915m585j832K4784p029j0276m165J1220K2562K369R2j6762q563M949
15429g852M145j2467m804N917J8274J1304r845m630Q743Q358j0337l725n412q340
15415a0671p814K9570K0321o158l9651m510n688j4882R279J7596n292l0074J3416
15402c4558K4503J2484j3615l068r699k0368j366J4013k772k772L3616J0744j9744
15389a2602N030P92Q044J9212J4541o981r04j4634j7098p613k485k774r994R754
15375a7712O629q763Q202J1829K1807N788J368j4507l1156j1908m024L9485N061
15362A2099j0321M995j1199q260K7125J1228o118o860j6340J3375J945j0742l906
$$ plain form
15456 3704 -6094 -24998 -33252 -15066 -17970 -36421 -31427 -29697 -19576 -10367 -16710 -39012 -23531
15443 -23531 -20616 -25201 -27033 -2249 -9278 -19554 -23719 -12499 10063 12432 12524 -4238 -12801 -7852
15429 -7852 -3707 -16174 -20978 -15061 3213 14517 4672 42 8785 17143 6806 3081 -2331 -10671
15415 -10671 -18485 11085 31406 25248 -14403 -18913 -24601 -39483 -30204 -12608 -17900 -47974 -34558
15402 -34558 -10055 2429 -11186 -14254 -23953 -44321 -45687 -31674 -34446 -37218 -3602 7142 -12602
15389 -12602 -7572 -6780 1264 20476 35017 28036 27132 12498 -4600 -12213 -14698 -17472 -27466 -17712
15375 -17712 -11083 -19846 -11644 185 21992 27780 29148 14641 -16515 -28423 -32447 7038 12099
15362 12099 1778 6773 -4426 -12686 14439 25667 19549 12689 -3651 9724 11669 927 -2979
15349b979j093j1341o442l128O971J9253j286j0710q971j3061p866K6331J7183
15336B861L894J0977j8606j0107J293j426K1337R031k1992j1357P363k671j9898
15323b9301Q241J1858K3194J217K39N748J6216p606l6631j1472P096P235j9511
15310b3477l1434L0129Q944N97J7585J651m366p383K3558J3293o240K0022J489
15297D4368j1616j2821l479j7899k1495P152J9949M093k3135o228K1291O220L687
15284A0087r036o429j632K702n139J2287L286o293J3187m505p260M997l296p730
15270d774r290N48m570l108j3226j1990J2362L1050J706j0022N93O334J5894O828
15256A8335L573k1634j3409Q631J4823K2445p811k503J9510o758j3250M53j571
$$ plain form
15349 -2979 -4072 -15413 -21855 -24983 -18012 1241 -45 -10755 -19726 -32787 -40653 -14322 2861
15336 2861 6755 17732 -874 -10981 -9688 -11114 10223 19254 -2738 -14095 -6732 -9403 -29301
15323 -29301 -21060 -9202 13992 15209 15448 21196 37412 29806 -6825 -18297 -11201 -3966 -23477
15310 -23477 -54911 -24782 -15838 -15241 2344 3995 -371 -7754 15804 29097 22857 42879 44368
15297 44368 32752 19931 16452 -1447 -22942 -15790 4159 8252 -14883 -21111 180 6400 10087
15284 10087 1051 -5378 -7010 -4308 -9447 2840 6126 -167 13020 8515 1255 6252 2956 -4774
15270 -4774 -14064 -13516 -18086 -21194 -34420 -46410 -34048 -2998 -1292 -11314 -10721 -4387 11507 18335
15256 18335 21908 274 -13135 -4504 10319 32764 24953 22450 41960 35202 21952 22405 20834
15243B0834K628J1700n13j1421o633j210k061k542N015J305j0726M041o880o378
15229b841J1482J1535j1822j7132j456J2973M018j9385m144J1961L300j3651M3609
15216B8447N231m1354r035j1116P807P569l032P111K0300P20j0326O779J3357
15203B2458j6302R151O392l627j4608k068M665L520q868j015K899n03n282R588
15189F400N123O03O644p126m445j1329j5420N131L1327J1003r484j1636N408J3849
15175B6048J912j1460k7809m166J394j533J3263N292k4134l335o667N131k980
15162b9044j213J3956Q657p879k3720Q121K5060J0653Q688j6487j1015j8735j0473
15149d3431J2263J4058J6346j1003j7501P20J685P780L52j173q050J0745K5120
$$ plain form
15243 20834 23462 35162 34649 23228 16595 15385 13324 10782 15797 17102 6376 10417 3537 -2841
15229 -2841 8641 20176 8354 -8778 -10234 2739 6757 -12628 -16772 -4811 -1511 -15162 28447
15216 28447 33678 -7676 -16711 -27827 -20020 -12451 -15483 -8372 11928 12648 2322 9101 22458
15203 22458 6156 15307 21699 18072 3464 1396 6061 9581 713 -302 2597 2094 -3188 6400
15189 6400 11523 12126 18770 11644 7199 -4130 -19550 -14419 16908 27911 18427 6791 12199 26048
15175 26048 27960 16500 -11309 -15475 -14081 -15614 -2351 2941 -21193 -24528 -31195 -26064 -29044
15162 -29044 -30257 -16301 -7644 -15523 -39243 -31122 -6062 4591 13279 -3208 -14223 -32958 -43431
15149 -43431 -31168 -17110 -764 -11767 -29268 -28548 -26863 -19083 -18731 -19904 -27954 -17209 7911
15136G911N705m65l763o697r691k948Q625J1467L026j2013j5277O113m965o15
15122a3587o221K3790k986q976L878R437K5460r618j6771j0730N084j118O152
15109C794j5165k1048N733J961K9560j521p223j0921m598O930J4932J6646j2042
15096G038p168J0826P573P127Q09j4587J2930o929j5157j9372J7654J5571j7411
15083a096k5480K942R732J987r242n010n462K3855l712N389J61J1844K077o364
15069A621P273o793r810J291r563J2090N925p919j2159J3462l047n740j671j2338
15055b7378M950m134J4448l345r059J0668p180k6469J1671Q456M859n548J1239
15042a6822K0604j5300k739O177J2187N572j7012R847K0632J0167j6659j3467
$$ plain form
15136 7911 13616 13151 9388 2691 -7000 -9948 -1323 10144 13170 1157 -14120 -8007 -12972 -13587
15122 -13587 -19808 3982 996 -7980 -4102 5335 30795 21177 4406 -6324 -1240 -2358 3794
15109 3794 -11371 -32419 -26686 -24725 4835 3314 -3909 -14830 -19428 -12498 2434 19080 7038
15096 7038 -130 10696 18269 25396 26205 11618 24548 17619 2462 -16910 744 16315 -1096
15083 -1096 -26576 -23634 -13902 -11915 -21157 -26167 -31629 -7774 -11486 -6097 -5936 5908 7985 1621
15069 1621 8894 2101 -7709 -6418 -15981 -3891 2034 -5885 -18044 -4582 -7629 -13369 -15040 -27378
15055 -27378 -22428 -26562 -12114 -15459 -24518 -13850 -21030 -47499 -35828 -27372 -22513 -28061 -16822
15042 -16822 3782 -11518 -14257 -8080 4107 9679 -7333 2514 23146 33313 16654 3187
15030C187J3814m07j953l302p820Q682q77p475q081r966J5425J7902j542o552
15016A1035o905K78L972o695j0971n179J3895J5851R361K2119K0303p555L7658
15003I7167N3400N0315Q3142K07630L9809j78333j56585p8185k6404n6847j7443
14992A7666J209R841Q988k1381p625K704R289J76j4048k6091J1664j372Q015j6515
14978a7480p676L493K976p085L517J1040K361l49o215K673J2244j0802j2176O978
14964a6501J1149K3803j9525O379m818j14j5347j0603j3641L4713K3998J996j1133
14951A0356J658j9221j5780k597j2342J0806K7801K541M58J3445m578l586J5618
14938B4579Q650j8931j7181K01j274j4778j4218j079O16K7j336K0795j111J1653
$$ plain form
15030 3187 17001 16594 14641 11339 3519 12201 11324 3849 -4232 -14198 1227 19129 17587 11035
15016 11035 4130 4408 8380 1685 -9286 -14465 -570 15281 24642 46761 67064 59509 97167
15003 97167 150567 200882 284024 491654 531463 353130 196545 118360 91956 35109 17666
14992 17666 18875 28716 37704 16323 8698 11402 20691 20867 6819 -19272 -7608 -8980 -965 -17480
14978 -17480 -25156 -21663 -18687 -25772 -22255 -11215 -8854 -9203 -15418 -12745 -501 -11303 -23479 -16501
14964 -16501 -5352 18451 -1074 5305 487 373 -14974 -25577 -39218 -4505 19493 21489 10356
14951 10356 12014 -7207 -22987 -25584 -37926 -27120 681 3222 3680 17125 12547 8961 24579
14938 24579 33229 14298 -2883 -2682 -3956 -18734 -32952 -34031 -33415 -33388 -34724 -13929 -15040 -3387
14924c387J5630J827J0586J094l839k8400k2575J1501K7596Q941K6226m0954k9475
14911b5229o266q211j0418J8570K5039r889r497J5343J9159K849K42p951K646
14898F387R228J1978R549j1655J980k5917o7k2112L944J3833Q543n16m939m897
14884d661l275l001l093r211R415j865K673L295j9899M545J3446J474K0026M836
14870A4705p363J050L606j0333j5983n712j5999j3805J2825K9667K3480l2228
14858a6090n499J8121l670O843N632l161O529p099j0367l223Q318R841Q441K8831
14844D3447j6251k3942K184J4590p930j1209O822J140M213m125j9881J1809R406
14831A0273n038l148o265j14P78N558Q258J2838J254j3141K3722n27k63j1725
$$ plain form
14924 -3387 12243 14070 24656 25750 21911 -6489 -29064 -17563 10033 18974 45200 4246 -25229
14911 -25229 -31495 -39706 -50124 -31554 -6515 -16404 -25901 -10558 8601 11450 11692 3741 6387
14898 6387 15615 27593 37142 25487 27467 1550 1483 -20629 -16685 -2852 5691 5175 236 -4661
14884 -4661 -7936 -10937 -14030 -23241 -13826 -15691 -13018 -9723 -29622 -25077 -11631 -10157 9869 14705
14870 14705 7342 8392 11998 1665 -14318 -20030 -36029 -49834 -37009 -7342 16138 -16090
14858 -16090 -21589 -3468 -7138 -295 5337 2176 8705 1606 -8761 -11984 -3666 6175 14616 43447
14844 43447 27196 3254 5438 20028 12098 889 7711 8851 13064 8939 -10942 867 10273
14831 10273 5235 2087 -4178 -4292 -3514 2044 10302 23140 24394 11253 34975 34448 34185 22460
14817B2460l0426j5830j165J4274O751j2305J6607j225j8470J9102m821j6077
14805b1125r53J120J7093J5259P586j0758j7754j379J2217L6695K2339m602k9946
14792B5792k5936q488o991K0436N814p681J6979J3781k2598l3030j7592J6135
14780b3379O680M700R998K361m585k52J5782K135M6j0637p423j3638k028m204
14766b4444K3608K817m6141K253L0142k220r140J8578M649K647L229J9494j3681
14753A1791N443m182O953O374P191o423J0470J3470k0832k2404j1975J3646p76
14740H746n684k4930J5721J1155j536Q833N928o829p130J6837J6337j9921j8555
14727a028l125o305J4494o286q114M845Q022L357O852J679O683J3930k035k4912
$$ plain form
14817 22460 -7966 -23796 -24961 -10687 -3936 -16241 366 -859 -19329 -227 -5048 -21125
14805 -21125 -22078 -20958 -3865 11394 18980 8222 -9532 -10911 1306 38001 60340 55738 25792
14792 25792 -144 -8632 -15623 4813 10627 2946 19925 33706 11108 -21922 -39514 -23379
14780 -23379 -16699 -11999 -2001 360 -4225 -4477 11305 13440 13486 2849 -4574 -18212 -20240 -24444
14766 -24444 -836 1981 -44160 -41907 -11765 -13985 -23125 -4547 102 2749 5978 25472 11791
14753 11791 17234 13052 20005 26379 33570 27147 37617 51087 30255 7851 -4124 9522 8746
14740 8746 3062 -21868 -6147 5008 3472 12305 18233 11404 4274 21111 37448 17527 -1028
14727 -1028 -4153 -10458 4036 -2250 -10364 -5519 2503 5860 12712 14391 21074 35004 32969 8057
14713H057j2343J138j3925N33J4952n864o732Q453J8552J9536K035j5629j8159
14700F04J550J0767j497r044J4314N690l0033j1060J6516N837k457N57p097o927
14686a2280J5784K950m491J2756P387l478r971j8779j100J7031J0192j5332j8674
14673a8005L863J614Q512J7878j8492p797K816q120J7860J1632k281k0894j867
14660a3281J4845n189j1700P631n000J4933J779J7004J3105p804r024m867J25
14647A2557j894r612N22l908m017n976K11K0066J2002j7535m018J4162K3154j4539
14633B1175k1263j6400r926J2988J8268q331J4361p172O987M115j2929m623R912
14620G162J8432n23Q193L748J3792k5287k3242J162o748r996k613J715J3162n362
$$ plain form
14713 8057 -4286 -3148 -17073 -16540 -1588 -7452 -14184 -5731 12821 32357 34392 18763 604
14700 604 2154 12921 11424 2380 16694 22384 -7649 -18709 -2193 3644 1187 1744 -5353 -12280
14686 -12280 3504 6454 1963 14719 22106 18628 8657 -10122 -11222 5809 16001 669 -18005
14673 -18005 -14142 -12528 -4016 13862 -4630 -12427 -9611 -17731 129 11761 9480 -11414 -13281
14660 -13281 1564 -3625 -15325 -7694 -12694 2239 4018 21022 34127 26323 17299 12432 12557
14647 12557 10663 1051 1573 -2335 -6352 -12328 -12117 7949 19951 2416 -1602 12560 35714 21175
14633 21175 -88 -16488 -26414 -13426 4842 -3489 10872 3700 10687 14802 1873 -2750 7162
14620 7162 25594 25071 33264 37012 50804 25517 2275 3437 -3311 -13307 -15920 -14205 -1043 -6405
14606f405P514O116j0438j5426j47K6415J7820N558m83j0168k550n679L636l823
14592A1940l833J045L886m011P418L387o898J7565J090j9934j6673O867M322O685
14578A2856o830l890J7454J0118k5678j7822k272r764m637K5595J3796j5375L066
14565c383K2419J7501k7498j5899j3576R525O401J951K3156K0942J51j7514l2568
14552h392J254j394k974o153j689P876R224J0000j2869m87K698r977j3994o638
14538c3515J7960L885J51J2325j7224k1459J0975J3636J7698p51r150o285N39
14525a1215J9875j0170q262o436O882J9027P170p544j5490n239m56J2990K2165
14512B3297o30P913m62m45k0946L251K23J955j1302r514p256J940L565R070R293
$$ plain form
14606 -6405 1109 7225 -3213 -18639 -18786 7629 25449 31007 30524 20356 17806 12127 15763 11940
14592 11940 8107 9152 13038 9027 16445 19832 12934 30499 31589 11655 -5018 1849 6171 12856
14578 12856 6026 2136 19590 29708 4030 -13792 -16064 -25828 -30465 -4870 8926 -6449 -3383
14565 -3383 19036 36537 9039 -6860 -20436 -10911 -4510 -2559 20597 41539 41690 24176 -8392
14552 -8392 -7138 -8532 -11506 -17659 -19348 -11472 -2248 7752 -5117 -5604 -2906 -12883 -26877 -33515
14538 -33515 -15555 -11670 -11519 806 -16418 -37877 -26902 -13266 4432 3681 -5469 -11754 -11215
14525 -11215 8660 -1510 -9772 -16208 -9326 9701 16871 9327 -6163 -11402 -11858 1132 23297
14512 23297 22667 30580 30118 29673 8727 11978 12201 14156 2854 -6660 -13916 -11976 -8411 659 9952
14497I952R563J0706n054l059M877N321N658l259j985L264l876k7858l2685j3431
14483d1866M055P562m044P766K3842K2512n922j5870O594l693n96M689Q497O49
14469A4175j330N96O846j0799N278P611N673j1902J685j326o059k0517j809o759
14455a8637J73K446M225q965P044M273J648M179Q37R047L877K083j569k3319k1421
14440c4079L316J4841p72O244K7248P750j6467k75R16q065j948L177n598j3614
14426a7326j206O755J0204m392k2518n022R245K1550M043k391j0045q027L788
14413a5342J5274j6569p336K1731j4550K097J8676k399J0852m934k0213n273K3251
14400E265K5505J8929m143j6646k7877j3295K0496o034j997J929k461j510M540
$$ plain form
14497 9952 19515 30221 25167 22108 26985 32306 37964 34705 32720 35984 32108 4250 -28435 -41866
14483 -41866 -37811 -30249 -34293 -26527 -2685 19827 13905 -1965 4629 936 340 5029 13526 14175
14469 14175 12845 13441 20287 9488 14766 22377 28050 16148 17833 16507 10448 -10069 -11878 -18637
14455 -18637 -18464 -16018 -11793 -20758 -13714 -9441 -7793 -3614 -2777 6270 10147 12230 10661 -12658 -34079
14440 -34079 -30763 -15922 -16694 -10450 16798 24548 8081 7806 8722 657 -1291 1886 -3712 -17326
14426 -17326 -18532 -11777 -1573 -5965 -28483 -33505 -24260 -2710 1333 -1058 -11103 -19130 -15342
14413 -15342 -68 -16637 -23973 -2242 -16792 -14695 3981 1582 12434 7500 -12713 -17986 5265
14400 5265 30770 49699 45556 28910 1033 -12262 8234 2200 203 2132 -329 -1839 2701
14387B701J2173J4831p340l705j9941n986J3057j959j8272J7016r52O339P338
14374A5300J917Q546L387p527j6105k1095j3131j2034J8423K3106o70k0205J6085
14361d003K590O366o255j2027O79J4656l960k3606N97j771M299J5458J7691j0725
14347a1n063j2898J1940Q241J0993R193j1063o289j466l254j6354K023N189K0987
14333A2168J3513j3507j0873R132j3510J1897Q409j0710k4797J1165r32J0841
14321B796n692O363J400P243p127k3162O29M589J2252R855J1153j5225J273N245
14307A1592J4182o960o695J431J0691m884o184j968j1062k562j4328Q970p847
14294a5624K796J0393J047k4381o302J6642k479K2928P355L167j2802o476j3655
$$ plain form
14387 2701 14874 29705 22365 18660 -1281 -7267 5790 3831 -14441 2575 1623 7962 15300
14374 15300 17217 25763 29150 21623 5518 -15577 -28708 -40742 -22319 787 117 -20088 -4003
14361 -4003 -1413 4953 -1302 -13329 -12650 2006 -1954 -25560 -24963 -26734 -22435 -6977 10714 -11
14347 -11 -5074 -17972 -6032 2209 13202 22395 11332 5043 3577 323 -16031 -14008 -8819 12168
14333 12168 25681 12174 1301 10433 -3077 8820 17229 6519 -18278 -7113 -8045 2796
14321 2796 -2896 3467 4867 12110 4983 -18179 -17550 -12961 -709 9146 20299 5074 6347 11592
14307 11592 25774 18814 12119 13550 24241 19357 13173 11205 143 -2419 -16747 -7777 -15624
14294 -15624 -12828 -2435 -1388 -25769 -32071 -15429 -17908 5020 12375 15542 2740 -3736 -17391
14281a7391J9918p702q511o218J7416K6P586J415k7182n381Q369K1456M788Q584
14267A7173q525p433N022k521j7611j9508K2385L0497Q964m859p638R072l240
14254B1778j1567J767L0551n949j2478k5719m439j840o951m781J4950K6445l698
14241A8069l725l870J788j3805j9652J7932J2070N994P781j6822k6080j6835N258
14228c1897P462M817J2229J0453J4651R123j032p011L523J5222J352j1021q073
14215A9798O299M629j9022M26J4604j1337l5708r905j0106q374P765K3750J8229
14202A048M900j9719l613M170k977J8476N665R515j6313j6675K766Q114J760K9756
14188B6873J3283l1733L061L806L617n565M851J8426j9877J974K840j8767j6874
$$ plain form
14281 -17391 2527 -5175 -13686 -19904 -2488 -2462 5124 6539 -20643 -26024 -17655 3801 8589 17173
14267 17173 8648 1215 6237 3716 -13895 -33403 -11018 19479 28443 23584 15946 25018 21778
14254 21778 10211 11978 42529 36580 24102 -1617 -6056 -7896 -14847 -19628 -4678 21767 18069
14241 18069 14344 10474 12262 -1543 -21195 -3263 8807 14801 22582 5760 -20320 -37155 -31897
14228 -31897 -24435 -19618 -7389 3064 17715 26838 25806 18795 22318 37540 38892 27871 19798
14215 19798 26097 30726 11704 12130 26734 15397 -20311 -30216 -40322 -48696 -40931 -17181 1048
14202 1048 5948 -13771 -17384 -13214 -16191 2285 7950 17465 1152 -15523 -12757 -4643 -2883 26873
14188 26873 40156 8423 11484 15290 18907 13342 18193 36619 16742 18716 21556 2789 -14085
14175a4085N227P841q520N674L4485k118M202k0021k4791j2436M385Q297P407
14162d453O084M020j5365J0054J2197j6813n954J6443J3194m127k7495j225J79
14149a3261L779K669M429j3474P335L388q580j2099Q285K4511J1548J7146j5954
14136A9722n889J4145k366m164j5425m118n046J216N330Q829k285j739O318O684
14122B1212m430j0627M158q525k1780j4028M527k802j019K925K3256J2569K0338
14109B5774k77j6597L136m274O168q92j6647p975L224J5116j0051j7811O767K4266
14095I927r050j9054J3359p074j5953K3236J5361n46j2168r818j1993j2219O66
14082c5326n595J4268J7304N972N633J937j4001m548m700K542q543L059N713o186
$$ plain form
14175 -14085 -8858 -1017 -9537 -3863 30622 28504 32706 12685 -12106 -24542 -20157 -11860 -4453
14162 -4453 1631 5651 -9714 340 12537 -4276 -10230 6213 19407 15280 -12215 -13440 -13261
14149 -13261 -9482 -6813 -2384 -15858 -8523 -5135 -13715 -25814 -17529 6982 18530 35676 19722
14136 19722 13833 27978 25612 21448 6023 1905 -3141 -1925 3405 12234 9949 8210 14528 21212
14122 21212 16782 6155 10313 1788 -19992 -34020 -29493 -32295 -33314 -30389 -7133 5436 25774
14109 25774 25497 8900 12036 7762 13930 13038 -3609 -11584 -8360 6756 -3295 -21106 -14339 9927
14095 9927 877 -18177 -4818 -11892 -27845 -4609 10752 10206 -1962 -11780 -23773 -35992 -35326
14082 -35326 -40921 -26653 -9349 -3377 2256 4193 -9808 -14356 -19056 -16514 -25057 -21998 -16285 -22471
14068b2471r226J1076J0635J3963k550Q63J570L811j2609j1306k788R429Q044
14055a559J1559L765q608j9875j67L40K7013J236j4743J888K1367n893j3987L678
14041F014j2106n179R992J2423J4281j6825j0484K315J1076k2500j0836J8945
14029b884J024j911p59K8299n433k6060j4598Q184Q144K5128R55n329k544l762
14015H454n165j1397j9953p468N429J5756K75M02Q157r053R24J1671J8696O730
14001B3458n795l5219q490J5871q938K319Q320J789J4101J9423J314J242l2171
13988b776N224J1708K5907J3149r65o924k2623j0554Q146J4064m755k9570k5245
13975b5214k185j0382J910O816K5410k008k8678o039M215J0717J9214q413l805
$$ plain form
14068 -22471 -31697 -20621 -9986 3977 1427 2290 3860 7671 -4938 -16244 -19032 -9603 -1559
14055 -1559 10000 13765 5157 -14718 -14885 -14545 12468 13704 -1039 849 22216 16323 2336 6014
14041 6014 -6092 -11271 -1279 11144 25425 8600 -1884 431 11507 -10993 -21829 -2884
14029 -2884 -1860 -3771 -4530 23769 18336 -7724 -22322 -14138 -5994 19134 20089 14760 12216 8454
14015 8454 3289 -8108 -28061 -35529 -30100 -14344 -14069 -13667 -5510 -14563 -13639 -1968 16728 23458
14001 23458 17663 -17556 -26046 -10175 -19113 -16794 -8474 -6685 7416 26839 28153 29395 -2776
13988 -2776 2448 14156 40063 53212 52247 45323 22700 12146 20292 34356 29601 31 -25214
13975 -25214 -27399 -37781 -35871 -29055 -3645 -5653 -34331 -40370 -36155 -25438 -6224 -14637 -18442
13962a8442j5727m35K0046r091r867L8821K7952j9291N063r854O099Q601l37k3663
13948a25J535J1887j2743j4371j2413q910M600K4734J138n623J0329J4045J5450
13935B9533j52j1731m934M986Q205P148j8287k8975n883J9247J4505K3214r319
13922B7557m148n510p441j4679o164M230P688k241P177j57j5643O105q750N062
13908f914J0444L734k298l960J069q235k368J807P71R764J1315L992J7621l402
13894C3340J0000q997j6733o587O447J3405O41K598n231j3234j3285O642J1083
13881B0089q426M712n906q66J8050J2833j7254M53j8268j2081n819J5901J6588
13868B0006j1829o857O364O394N864o879n821k5694j0831J7912J6345k924j7711
$$ plain form
13962 -18442 -34169 -34604 -14558 -23649 -33516 5305 33257 13966 19029 9175 15274 23875 23538 -125
13948 -125 1410 13297 554 -13817 -26230 -35140 -30540 -5806 -4668 -10291 38 14083 29533
13935 29533 29381 17650 12716 17702 25907 33055 14768 -14207 -20090 -843 13662 36876 27557
13922 27557 23409 17899 10458 -4221 -10385 -6155 1533 -708 6469 6312 -9331 -3226 -11976 -6914
13908 -6914 3530 7264 4966 1006 2075 -6160 -8528 -6721 -5950 3814 15129 19121 36742 33340
13894 33340 43340 34343 17610 11023 17470 30875 31516 34114 28883 15649 2364 9006 20089
13881 20089 11663 16375 10469 9603 27653 40486 23232 23685 5417 -6664 -12483 3418 20006
13868 20006 8177 1320 7684 14078 19942 13063 7242 -18452 -29283 -11371 4974 2050 -15661
13855a5661O928P575r749J4456j6778o268J5670j2262k835R93p563J1037J5312
13842H55Q770k3279j7270J7492K9225J6129k098j4723R364J3685l947k5965J4499
13829B2737J8974j2081j9664N042R394p042o897M463j8132j1794P572Q102J1409
13816A2083j2323k3788r333m419q061J5375J1965j1562l85J2864J4936p7J1577
13803H852k1593j3057K803Q350J056K0280r356q986M822O251N955R601j2384j3021
13789a0427O784K0560J6451J7038j4210j1604k6600r748J888k923m633l46k784
13776b0554J2893p002r569J4857R080K6008o953q009N393k2572r666K0354J9036
13763B3296j9193j1540M29O724q884P963P354j295J3725O422O496J210j752L146
$$ plain form
13855 -15661 -8733 -1158 -10907 3549 -13229 -19497 -3827 -16089 -18924 -17931 -25494 -14457 855
13842 855 9625 -13654 -30924 -13432 15793 31922 29824 15101 24465 38150 34203 8238 22737
13829 22737 41711 29630 9966 15008 24402 17360 10463 14926 -3206 -15000 -7428 674 12083
13816 12083 -240 -24028 -33361 -37780 -45841 -30466 -18501 -30063 -30448 -17584 -2648 -2725 8852
13803 8852 -12741 -25798 -22995 -14645 -13589 6691 -2665 -11651 -6829 -578 5377 14978 2594 -10427
13789 -10427 -3643 16917 33368 50406 36196 24592 -2008 -11756 -9868 -12791 -17424 -17770 -20554
13776 -20554 -7661 -14663 -24232 -9375 -295 25713 18760 10751 16144 -6428 -16094 4260 23296
13763 23296 4103 -7437 -7008 -284 -9168 -1205 6149 4854 18579 25001 31497 32707 30955 34101
13749C4101L040N097R790k4202j5186j3046m104J688L692q44n209J5410J0121
13736B0348j491m877R300p721k3451j9415j5444J6670J1694J9153J8991J324j5893
13723I188J0891j0849P955K1151l884j2198j7910j6038r17l412N121n91J6298
13710D805l729j917K454Q109j732R208J2353N508j6240p617j2772K994k377M937
13696C984j9588k1054j1402K1538R200m322k887O287J9486Q213J2111M480m348
13683B1698P812j7196j4780j0448K635K0890N309J8499q240j8081Q737j68m623
13670A2044j6903K645p543n622J3149K5474r245L76K87J5023O225q381o595l398
13656A7536j7398k2033K9458K8985N3L89r005K739p577j7090j1106J4374K8868
$$ plain form
13749 34101 37141 42238 52028 27826 12640 -406 -4510 -2822 870 26 -5183 10227 20348
13736 20348 18857 13980 23280 15559 -7892 -27307 -42751 -26081 -14387 4766 23757 25081 9188
13723 9188 20079 9230 17185 38336 34452 22254 4344 -11694 -12611 -16023 -10902 -11493 4805
13710 4805 1076 -841 1613 9722 7990 17198 29551 35059 18819 11202 -1570 1424 -953 3984
13696 3984 -15604 -36658 -48060 -26522 -17322 -21644 -24531 -18244 1242 9455 21566 26046 21698
13683 21698 29510 12314 -2466 -12914 -10279 10611 15920 34419 26179 8098 16835 16667 12044
13670 12044 -4859 -2214 -9757 -15379 -2230 23244 13999 14375 14662 29685 35910 27529 20934 17536
13656 17536 138 -21895 7563 36548 36601 36990 27985 30724 23147 6057 -5049 9325 38193
13643C8193j3364l685J9703k1920m162O225j4158j4804N257L349l1L13m100K5118
13629B1934r091k5144L672N114J1206K594j8783o077j529J6710N355q914R621
13616F668Q899p730j3086J9846J939j1377J948j3728O182K084J8758J7045j2905
13603B4543q295o636l5659R573J3465K9959Q87q78j5309O550o174j0652k065R46
13589B55q195j1842J9542J3960J8301n079O246R592p068k1351k3895k423L458
13576h499J9652J4332R445p911k3448J0706N873J786q216q915L316L111n192k6537
13562b0497J9458J1991j5496R557j371j1810M717J3950J2365j140j9918j286K4740
13549B5260R983k5421J488k7427o407L2011K3805P029L094K808O518j9254j6417
$$ plain form
13643 38193 24829 21144 40847 18927 14765 20990 6832 -7972 -2715 634 603 916 -3184 21934
13629 21934 12843 -12301 -8629 -3515 7691 10285 -8498 -14575 -16104 606 5961 -2953 6668
13616 6668 15567 7837 -5249 14597 16536 5159 7107 -6621 -439 1645 20403 37448 24543
13603 24543 16248 9612 -26047 -16474 -3009 26950 27837 26959 11650 18200 12026 1374 -691 255
13589 255 -7940 -19782 -240 13720 32021 26942 33188 42780 35712 14361 -9534 -11957 -8499
13576 -8499 11153 25485 34930 27019 3571 14277 20150 21936 13720 4805 8121 11232 6040 -20497
13562 -20497 -1039 10952 -4544 5013 3642 -8168 -3451 10499 22864 21724 1806 520 25260
13549 25260 35243 9822 11310 -16117 -22524 9487 33292 40321 43415 46223 52741 33487 17070
13536A7070L757j2239K476J7469k442N825J458l023P611L324L713o291l1304j3158
13522e754K3012P679p383K550M023q933l3488o035J9023K552J5980j3092j2424
13509a2290l421o493J5840J6568r757J42M586Q010p970j3175k674O258J5561J3926
13495B5111p484j4550k299M824N558r771J1344o668N735N664j1199o226p712K1836
13481A4163J7105k006q417k8037l448J6455k181K507K565P257R873K5048R775
13468F0659r216j4149k3533j8433R582n125M609P621j3726J304J3165l042J2279
13455B1995J1531k409n851k1330M337M234J0005q977L671J1065P173j0241j3497
13442A1706J5282k2949R952J9334j0802J614l573J008j5007J5534K1056L283k274
$$ plain form
13536 17070 20827 8588 11064 28533 26091 31916 33374 30351 37962 41286 44999 38708 7404 -5754
13522 -5754 17258 24937 17554 20104 24127 15194 -18294 -24329 -5306 -2754 13226 134 -12290
13509 -12290 -15711 -22204 -6364 10204 447 589 5175 13185 5215 -7960 -10634 -4376 11185 25111
13495 25111 17627 3077 778 5602 11160 1389 12733 6065 11800 17464 6265 39 -7673 14163
13481 14163 31268 29262 20845 -7192 -10640 5815 3634 6141 8706 15963 25836 50884 60659
13468 60659 51443 37294 13761 -4672 4910 -215 4394 12015 -1711 -407 12758 9716 21995
13455 21995 33526 31117 25266 3936 8273 12507 22512 13535 17206 28271 35444 25203 11706
13442 11706 26988 4039 13991 33325 22523 24137 20564 21572 6565 22099 43155 46438 44164
13429D4164J2927k30k685r088K172J2522Q513J4007J8053o405J2560M8412N1870
13416B06792L3444N2429P9133J23205J84743L32773N56219L53716l79851n37446
13406A005157l55949k13113j11464r0649o4379m2471k7325k4672L462j4231K863
13395F7229K2543J143j0252k2325j0097j9515j8443j501K5623K191p976j5671
13383A2949m654K0332J315r133o515Q846m677o274q133L674J1509K0701K5907
13370F5847R187q653r610N249j8510j8152j0044J975N981r032j712J1459k4869
13357h84K767k760J663O905j7790J5858K3239J5839j7143k944N204k1359J8243
13344B6838J1673J0889J5672Q420j46n576k5001K193Q595j536j7923q389M644
$$ plain form
13429 44164 57091 56861 54176 45088 47260 59782 68295 82302 100355 93950 106510 154922 206792
13416 206792 240236 292665 371798 495003 679746 1012519 1568738 1922454 1542603 1005157
13406 1005157 649208 436095 324631 233982 169603 127132 99807 75135 78597 64366 67229
13395 67229 89772 90915 80663 58338 48241 28726 10283 8782 34405 36596 28620 12949
13383 12949 8295 28627 29942 20809 14294 23140 18463 12189 4056 7730 19239 39940 65847
13370 65847 75034 66381 56771 62020 43510 25358 15314 17289 23270 14238 12526 23985 -884
13357 -884 1883 -877 786 7691 -10099 5759 28998 44837 27694 24750 29954 8595 26838
13344 26838 38511 49400 65072 73492 73346 67770 42769 44962 53557 52021 34098 25709 30353
13331C0353j9057j3381J3628K6128O003j902M115O976M833p001O357j387k0965
13318C4700m265K8378J3754J389N660K2463J232k2890j3760k1192k7434j1843
13306F192j7968J2189K2931M308M212m421o288j2828J4185r272k3724m383K9641
13293A4774K9997N311J3902l712j0688k700j1473n478K2243J6326j0425k9903
13281B8174j7467J4735J2425K60l387Q050J7393q006j2549N48R986J9499K0776
13268I0437M148n085L672j8121k4348K774L5996J5247K107Q623j0631J6056L4747
13255A55622L8685K1006M53q1915k07170j10405R83J8034K1162K1395J9014K5068
13243g8068J0710n063k363K0387K6554L122J6230M909l646J2086J145M583J5309
$$ plain form
13331 30353 11296 -2085 11543 37671 43674 41772 45887 52863 57696 50695 57052 55665 34700
13318 34700 30435 58813 72567 73956 79616 102079 103311 80421 66661 45469 18035 6192
13306 6192 -11776 413 23344 27652 31864 27443 21155 8327 22512 13240 -10484 -14867 14774
13293 14774 44771 50082 63984 60272 49584 46884 35411 29933 52176 68502 58077 28174
13281 28174 10707 25442 37867 38127 34740 42790 60183 52177 39628 40176 50162 69661 90437
13268 90437 94585 89500 93172 75051 50703 53477 89473 104720 106827 115450 104819 120875 155622
13255 155622 194307 215313 215766 133851 -73319 -183724 -182741 -164707 -143545 -122150 -103136 -78068
13243 -78068 -67358 -72421 -74784 -54397 -27843 -24721 -8491 -3582 -7228 4858 6003 10586 25895
13230B5895L40k1975K1917J4130O530J0508P96J9058M631k6591k5839R98K5900
13217E6298J2644k996p037p068k651k1287k8602N040Q704J5739L9367J182r118
13204F0215K155k03L215k5199o004k524O019N665M015n788Q518J6174o440m106
13190E5712j3409j544N112o578j5006L684K2711j1514k4281J821m289j144J4852
13177B6127Q388J2123Q36k2310q824M737K801r936j729N52J1750J0557o393m833
13163B3846P475O772K6959l292j8520L966l044K0758K2565K553n031j5691J5591
13150H4907J6009N96q082j2560j0393l1m819j3666j1641m9838m8472J3734L7483
13137f773K2819K8053L8001J6821j7236l1767r733m921J3553P754j5934m652N612
$$ plain form
13230 25895 26235 4260 26177 40307 46837 57345 58141 77199 81830 55239 29400 30398 56298
13217 56298 68942 65946 58909 51841 49190 27903 -699 4341 13045 28784 68151 69333 60215
13204 60215 62370 62167 65382 40183 34179 31655 37674 43339 47354 41566 50084 66258 59818 55712
13190 55712 42303 40759 45871 39293 24287 27971 50682 39168 14887 16708 12419 11275 26127
13177 26127 34515 46638 47474 25164 16340 21077 23878 13942 12213 12765 24515 35072 28679 23846
13163 23846 31321 38093 65052 61760 43240 47206 44162 64920 87485 90038 85007 69316 84907
13150 84907 100916 101512 93430 80870 70477 70446 65627 51961 40320 -9518 -57990 -44256 -6773
13137 -6773 16046 44099 82100 98921 81685 49918 40185 35264 48817 56571 40637 35985 41597
13124D1597j2490o682n996J6452J6695m565j2001j6097j8714J4706Q841j779n419
13111A4548r093J7459J3632p810j6409J9783L7803K3741k367j1436O238J5685
13099A01774J9241P38m0459j7170l842q308q952j4438k5790j5415j0891k5504
13087d9016l9475m7636r066J4735N8748P5923Q4842N1922O8713M8096r623k0297
13075B27866p7572p0341q81N126J4206N5658K8148J1423q250l5947j3553J1443
13063A47326k6709k0425p52M223j17p174J718K902m075l483n397L9185K9088J4295
13049A70605j6138r883O836J2325n390R13Q727r063k658J602j1J7156R127J7224
13035B01372L580q456r625k4016j4236K8837J8269J0052R221L2807J7469p131
$$ plain form
13124 41597 29107 22425 16429 32881 49576 45011 33010 16913 -1801 12905 21746 19967 14548
13111 14548 5455 22914 36546 28736 12327 32110 69913 93654 91287 79851 86089 101774
13099 101774 121015 121753 81294 64124 60282 51974 43022 28584 2794 -12621 -23512 -49016
13087 -49016 -88491 -136127 -145193 -130458 -71710 4213 89055 140977 209690 257786 248163 227866
13075 227866 150294 79953 79072 84198 98404 154062 182210 193633 185383 149436 135883 147326
13063 147326 120617 100192 99440 103663 103546 96372 98090 100992 96917 93434 88037 127222 156310 170605
13049 170605 154467 144584 151420 163745 158355 159268 167995 158932 156274 157876 157865 175021 184148 201372
13035 201372 204952 196496 186871 162855 148619 177456 195725 205777 214998 247805 265274 258143
13023B58143q217o090J7851M8208J6236J7662M23j3610Q390M8190Q172R914M8246
13010D53518M8816N3998N8583Q0150J02302J57257K70884M90366O14791o6280
13000B264385n82695m54617k49884j37203o1719r080j7343k3361k35N35J9869
12989G48652L9004N2166K1001K8660P7875P0788O6148K0976K4605L9905N4107
12978A243887Q8494O5169M9671O7713P6780R6539J19211J62629J62005J37037
12968B269135J61507K14484K74827K89358K89916L47305N02662O79515Q33018
12959E861727J101612J282691J607140K138465K384839K327832K978405M165899
12951B3848610N541995P254255J0037437J4631351K1638794L4552260O0833841
$$ plain form
13023 258143 249926 243836 261687 309895 326131 343793 344216 330606 338996 387186 395358 405272 453518
13010 453518 502334 556332 614915 695065 797367 954624 1225508 1715874 2330665 2264385
13000 2264385 1681690 1227073 977189 839986 778267 769187 751844 728483 728248 728783 748652
12989 748652 787656 839822 860823 889483 967358 1038146 1104294 1125270 1149875 1189780 1243887
12978 1243887 1332381 1397550 1447221 1514934 1591714 1688253 1807464 1970093 2132098 2269135
12968 2269135 2430642 2645126 2919953 3209311 3499227 3846532 4349194 5028709 5861727
12959 5861727 6963339 8246030 9853170 11991635 14376474 16704306 19682711 23848610
12951 23848610 29390605 36644860 46682297 61313648 82952442 117504702 178338543
12944A78338543J06017853R2198111n8840208j14834589p8891872m3188504k4349184
12937E6450150j4790481r786553o865548m837307l386257k336434j429044j029117
12929A1989409j699336j800369j289082q27405o50620n58178m99681n32159n05322
12920C627257l51820k52300k45383k40526k57567k33017j40523j27447j27614
12911A651060j18025r5649q3134q2585q7836p5036p1640r2495q7721m3617j8884
12900G94438l2951j9752l7613l6402j9194N002j9289m3925l1163k8183m1232k9492
12888D60244N221L156r533m5926k0887k1169j2142P168M62j0683l221j9493n301
12875C27896J713K0621r705m418j4679j3319j3284m6280k7764K5330R375p828
$$ plain form
12944 178338543 284356396 376554507 317714299 202879710 123987838 80799334 56450150
12937 56450150 41659669 31873116 25007568 20170261 16784004 14447570 13018526 11989409
12929 11989409 10290073 8489704 7200622 6373217 5722597 5164419 4664738 4132579 3627257
12920 3627257 3275437 3023137 2777754 2537228 2279661 2046644 1906121 1778674 1651060
12911 1651060 1533035 1437386 1354252 1271667 1183831 1108795 1037155 944660 856939 813322 794438
12900 794438 761487 741735 704122 667720 648526 653528 634239 590314 559151 530968 489736 460244
12888 460244 465465 468621 459088 413162 392275 371106 358964 366132 366594 355911 352690 333197 327896
12875 327896 329609 350230 340525 336107 321428 308109 294825 248545 220781 246111 255486 247658
12863B47658k0446l363J4079K3173j2369l1632k0292J4354K2565J3950j3263m926
12851B29488r624k8705k633J4119J8966K790l9109l3241r462R963o698J5120j1274
12838A49700j9039L2281L5314o003k3056K869K0250Q564J0748n191l0452m436
12826A71549j3118j6551l809p363j3686M029R728j7594k8518r35K5638L9881L3961
12813A83212L9326K3076m6214r2532l5169k2174L6614L8798M3634O1464P0249
12802C00284N1805J2899j2619k0023k7761o4429m1202r902k1197k3159j8391j1155
12790A15150l6223m480l0806k6730J0152L8380r181j4251Q173J5890R96L944K2779
12777I3793J2708j987Q66P599k546l845J770o189j0235q56J9817j636j6658l485
$$ plain form
12863 247658 227212 223849 237928 261101 248732 217100 196808 211162 233727 247677 234414 229488
12851 229488 219864 191159 188526 202645 221611 224401 185292 152051 142589 152552 145854 160974 149700
12838 149700 130661 162942 198256 192253 169197 172066 192316 200880 211628 206437 175985 171549
12826 171549 158431 141880 138071 130708 117022 121051 130779 113185 84667 83732 109370 149251 183212
12813 183212 222538 245614 199400 106868 71699 49525 86139 124937 168571 230035 300284
12802 300284 352089 364988 352369 332346 304585 240156 198954 189052 167855 144696 126305 115150
12790 115150 78927 74447 43641 16911 27063 65443 56262 42011 50184 66074 67070 71014 93793
12777 93793 106501 104514 105380 112979 110433 106588 108358 102169 91934 91078 110895 109259 92601 89116
12763H9116L3707J8534m896k2483k3122k2632k5763m737M474m448r010J4646J6625
12750F0011K6410J4848J8611Q812k193l3973m9001j5256k0373j3516o598M9520
12738C7302J9372j1584j2486o775j170K4418k510Q756J9184J2446k5170m854m283
12725E2646j194j2951L357L7770j4048l8063j0354K6760R027O139j028k4031p029
12712B7001K931J438J2873L5401Q169l890q478K018k4323j9704q824Q036P947
12699D0595O070K458J6710K0372p2O973k0060l0441k977N01q46N307j02j336j4247
12684B8905L514R584P348J3823J8177J969m180J450L727o59j0377M107l0478o01
12670D6309K252Q615K3575r483q948J1916J4057K6286j1170l4499l8639l730j0304
$$ plain form
12763 89116 122823 141357 136461 113978 90856 68224 42461 37724 42198 37750 28740 43386 60011
12750 60011 86421 101269 119880 128692 126499 92526 43525 28269 7896 -5620 -12218 37302
12738 37302 56674 45090 32604 25829 24659 49077 46567 55323 74507 86953 61783 56929 52646
12725 52646 51452 38501 41858 79628 65580 27517 17163 43923 52950 59089 58061 34030 27001
12712 27001 29932 31370 44243 79644 87813 83923 75445 77463 53140 33436 24612 32648 40595
12699 40595 46665 49123 65833 86205 86133 93106 73046 42605 39628 40129 39283 44590 44488 43152 28905
12684 28905 32419 42003 49351 63174 81351 83320 79140 80590 84317 83658 73281 77388 46910 46309
12670 46309 48561 57176 80751 71268 62320 74236 88293 114579 103409 68910 30271 26541 16237
12657A6237J7116J1930m619L379K587m397K4127L0706l665K637J3666J9357j8714
12644A10347o966L2995K4765N750K0361J9674J4444L0594J3269n7789k13038j40910
12632a46504j8362K3009P920J1594J1584N814K6860J4795J3121P581J2430j2113
12620d2271k911J0778J1155K5811J7661r679j6505r13k962L843R854j886m622
12607b647j1459j226K1693J1892M968j4261o142j2740j2490q885j651J0163J2413
12594a0372j9895m412n714J9049L6397J5973M652p047N939Q156j3200l9476j6042
12581b5992K4573Q114J2580j6494r98m530j4773p35J4645k646O601J9364N043
12568B4752m409j2880j0180k622j388o34K9m945L038J1488L092r044k551j9726
$$ plain form
12657 16237 33353 45283 40664 44043 46630 42233 66360 97066 93401 96038 109704 129061 110347
12644 110347 103381 136376 161141 166891 187252 206926 221370 251964 265233 207444 -5594 -146504
12632 -146504 -164866 -141857 -133937 -122343 -110759 -104945 -78085 -63290 -50169 -42588 -30158 -42271
12620 -42271 -45182 -34404 -23249 2562 20223 10544 -5961 -6874 -9836 -5993 3861 1975 -2647
12607 -2647 -14106 -15332 6361 18253 23221 8960 2818 -9922 -22412 -31297 -32948 -22785 -10372
12594 -10372 -30267 -34679 -40393 -21344 15053 31026 35678 28631 34570 42726 29526 -9950 -25992
12581 -25992 -1419 6695 19275 2781 1783 -2747 -17520 -18255 -3610 -6256 345 19709 24752
12568 24752 20343 7463 -2717 -5339 -6727 -7361 -7332 -12277 -9239 2249 5341 -3703 -6254 -25980
12554b5980j7511m26K001J6786r591L412K0397K8653L317L376j2423M775J8871
12541C5657m12k737K147n70q37J356R985R163o418j928k4979j4545j5734m113
12527a3965R770J4281j0822r003J5052J2863j1445j8772q000j3191J8710L3317
12515A8795Q278m332J816n199p714P760Q559Q015j2341p196Q338K38n72o422N767
12500B3790J5008J2062P281J2072n26j8178J299j1740j2920Q234K05O161L939
12487D6687J61K843P989L527j9460K975L4471K9804K6912J6138K2389L753L8838
12474B17027P4614J23229J83023K65438M29224N32891o0646n17107m54639k58720
12464E34334j19641q7903p7495p1488l0765k9097k8235j0692j2768k710l515m412
$$ plain form
12554 -25980 -43491 -43917 -41916 -25130 -34721 -31309 -10912 17741 21058 24434 12011 16786 35657
12541 35657 35245 32508 34655 34085 33248 34604 44589 53752 47334 45406 20427 5882 -9852 -13965
12527 -13965 -4195 10086 -736 -9739 5313 18176 6731 -12041 -20041 -33232 -14522 18795
12515 18795 27073 22741 24557 19358 11644 19404 27963 35978 23637 16441 24779 25017 24445 18023 23790
12500 23790 38798 50860 58141 70213 69687 51509 52808 41068 28148 36382 36587 42748 46687
12487 46687 46848 49691 57680 61207 41747 44722 79193 108997 135909 152047 174436 178189 217027
12474 217027 291641 414870 597893 863331 1292555 1825446 1764800 1247693 793054 534334
12464 534334 414693 326790 249295 177807 147042 117945 89710 79018 66250 63540 60025 55613
12452E5613l2509k2560K2144k844J299K0984j1634j4538q261j141o970r08R173
12439G848r196K148M451j6407J1417J1509j6339j8450j1308R207J1067m948j2059
12426c1060o920N601K8416J7873K753p571m267L906m666j1259O763m457Q827K5559
12412B9498Q134k750J690q704p526j4429j324k941R325Q308r911p638L125m216
12398F41o840j024n564j4946J6104J9224o048l8354j5045K3923L7696L2642J3535
12385E5944k2070j4542k4141j562p213J9194J8883j1460k8647n406L814K432P834
12372f940r708k0292J705J0347K0631J5176o846N961j6854k2733J817j0405r983
12359d8124M828J9542J0585j2709l777O118l932k983j3192K0027J5984J4385o131
$$ plain form
12452 55613 23104 544 22688 19844 21143 42127 30493 15955 7694 6553 -417 -1325 7848
12439 7848 -1348 800 5251 -11156 261 11770 -4569 -23019 -34327 -25120 -14053 -19001 -31060
12426 -31060 -37980 -32379 -3963 13910 16663 9092 4825 8731 4065 -7194 -431 -4888 3939 29498
12412 29498 37632 34882 36572 27868 20342 5913 4589 1648 10973 19281 9370 1732 4857 641
12398 641 -6199 -7223 -12787 -27733 -11629 7595 1547 -36807 -51852 -27929 9767 42409 55944
12385 55944 33874 19332 -4809 -6371 -13584 5610 24493 13033 -15614 -21020 -17206 -14774 -6940
12372 -6940 -16648 -36940 -35235 -24888 -4257 10919 4073 10034 -6820 -29553 -27736 -38141 -48124
12359 -48124 -43296 -23754 -13169 -25878 -29655 -23537 -27469 -30452 -43644 -23617 -7633 6752 621
12346F21r516j936Q779M312j4812J378P182J837J9482P981K024Q431k309k7220
12332F234o87o352n249k229j0234P176J3472J2690J300r927j1714L208L724K241
12318C653N752J0636K399J4479J7665m572J0005q587l004m606j3945j4205k87
12305A5383n734j6198k042K865r524M025Q139p104P491J8481K0801L942k001P304
12291D5828Q36J7167j2021j3120K4016K1343j0043k2669o285J0775M0267M6955
12279A43049O8239R7784J81587J39328p8492j42715o9662k7404n2071p0402r726
12268A79515M655k2293o554n130j9300j1693p212j3665K846m759j3780j2896j7070
12255E2664o555N9J4084L872O220J9442K1526K4475P9447M0339m6206p5878l6843
$$ plain form
12346 621 -8895 -10831 -2052 2260 -12552 -11174 -3992 -2155 17327 25308 27332 35763 33454 6234
12332 6234 5547 -805 -6054 -8283 -18517 -11341 2131 14821 16121 6194 -5520 -2312 1412 3653
12318 3653 9405 20041 22440 36919 54584 50012 60017 51430 48426 43820 29875 15670 15383
12305 15383 9649 -6549 -8591 -5726 -15250 -11225 -3086 -10190 -2699 15782 36583 40525 38524 45828
12291 45828 46664 63831 51810 38690 62706 84049 74006 51337 45052 55827 96094 143049
12279 143049 211288 309072 490659 629987 551495 408780 339118 311714 259643 189241 179515
12268 179515 184170 161877 155323 150193 130893 119200 111988 98323 101169 96410 82630 69734 52664
12255 52664 46109 46168 60252 64124 70344 89786 111312 135787 215234 255573 209367 133489 96646
12242I6646l7039k5321l3592n461o794q377J1553J202K2326K147n891r189Q820
12229A1030K6485M283j196n467j3137j5275K1570M3772M4693L9708N294k3745
12217A38015o970p142k1826j3638l2670j4829q006q368J7014N272n791j871j2789
12204B6401j3496J5648J5878J245Q792J3221J320j8762j0007j1854j5709k825
12192I852q369j0451K3296J1715Q68j078p927j3565o74j1045N216Q441N319j6607
12178e009P322P829L2325J5898o163m299P46O351r324j0056j327M30n828j1813
12164A7082J214n519k03j2629j1988K478O617K025j6452k1916J7760K1445q821
12151h907q4L46J1777J231j4455O939o453j9677Q978J7471J2741k347O504J5698
$$ plain form
12242 96646 59607 34286 694 -4767 -11561 -19938 -8385 -7183 15143 17290 11399 2210 11030
12229 11030 37515 41798 40602 35135 21998 6723 28293 72065 116758 156466 161760 138015
12217 138015 131045 123903 102077 88439 55769 40940 32934 24566 41580 46852 41061 39190 26401
12204 26401 12905 28553 44431 45676 54468 67689 69009 50247 40240 28386 12677 9852
12192 9852 1483 -8968 14328 26043 26911 25833 17906 4341 3667 -7378 -2162 6279 11598 -5009
12178 -5009 2313 10142 42467 58365 52202 47903 48649 55000 45676 35620 34293 34723 28895 17082
12164 17082 18296 12777 12574 -55 -12043 -9565 -2948 -923 -17375 -39291 -21531 -86 -8907
12151 -8907 -8991 -8645 3132 4363 -10092 -3153 -9606 -29283 -20305 -2834 9907 7560 14064 29762
12137B9762J0068j8684j5728K2947L2662m940l865o51O502K0486P357j5888j4333
12124E5695j7239j4889nP145k1857k4620O02p756N513J5853K0294J0038j6836
12111A1938j808J5670J283l1986o825K3280J337j194j3194Q14K3297m668J060
12098A9004j4207o060K7676j3769q689k297J5260K0666j9560j932n685j0962l804
12085d359P953J358K0303j7338k6412K4505K6802j773k1476k6149J3253N696k0879
12072a8516N670j0921N9K7876J1734o373j3124r230k0984J8565Q743j7892j6663
12059d1056R512J5998R486Q390J2177m685j7406n321O327k495o51l625R236p020
12045a1133j6430N456N880J5102l469J2817J450q732O993j3253j6508J2499m200
$$ plain form
12137 29762 39830 21146 5418 28365 61027 56087 52222 51571 58073 78559 85916 70028 55695
12124 55695 38456 23567 23562 30707 8850 -15770 -15168 -22924 -17411 -1558 18736 28774 11938
12111 11938 10130 25800 27083 -4903 -11728 11552 12889 11695 -1499 -685 22612 17944 19004
12098 19004 4797 -1263 26413 12644 3955 1658 16918 37584 18024 16092 10407 -555 -4359
12085 -4359 3594 4952 25255 7917 -18495 6010 32812 31039 9563 -16586 -3333 2363 -18516
12072 -18516 -12846 -23767 -23708 4168 15902 9529 -3595 -12825 -33809 -15244 -6501 -24393 -41056
12059 -41056 -31544 -15546 -6060 2330 14507 9822 -7584 -12905 -6578 -9073 -9724 -13349 -4113 -11133
12045 -11133 -27563 -22107 -16227 -1125 -4594 8223 9673 941 7934 -5319 -21827 -9328 -13528
12032a3528j9183N206K0497J0323j0873j0314P859K0419n615l4288j5933J3579
12020c1851N116J700K0661J7779j1801o121N052M016n165L853J3519o202j8927
12007h371O52r671R207J3466O127J486N787j652k8259P049M680J5374r506l603
11993B766j3450M663k61o34J4901K338M226R95j4322j3812J549M421J2759J5544
11979B1683l7o870j9721j344l034j1792J6124K8624k504j8849r681L1103K0249
11966D3951j4525j6859j9572j1154P974K2661P605o4L672j0863L017K919j4792
11953C970j1798K2748J7104k6217k383j2951K794Q001Q106O069j8543j6000Q514
11940a0586N425j3446l202k678K7776P161j6464K917J290j3951j1839O308J0187
$$ plain form
12032 -13528 -32711 -27505 -7008 3315 -7558 -17872 -10013 10406 4791 -29497 -45430 -31851
12020 -31851 -26735 -25035 -4374 13405 1604 -4517 535 4551 -614 3239 16758 10556 -8371
12007 -8371 -7719 -17390 -8183 5283 11410 12896 18683 17031 -11228 -4179 501 15875 6369 2766
11993 2766 -10684 -6021 -6282 -6916 7985 10323 14549 15544 1222 -12590 -11041 -6620 6139 21683
11979 21683 21646 14776 -4945 -6289 -9323 -21115 -4991 23633 21129 2280 -7401 23702 43951
11966 43951 29426 12567 -7005 -18159 -10185 12476 20081 20017 23689 12826 15843 18762 3970
11953 3970 -7828 14920 32024 5807 3424 -9527 -6733 1268 9374 15443 -3100 -19100 -10586
11940 -10586 -5161 -18607 -21809 -24487 3289 10450 -6014 -3097 -1807 -15758 -27597 -21289 -11102
11927a1102r605j6646K6063L7140L341p726j0539Q265R894J013j3935J8235J0444
11914D4842O055p107r014l048j4878j9386j0450M572q93m357K4140O342M014r62
11900A9870N506j7069j2945j3932k3505L4238m762j600J1310k4262J7332J7869
11888H050o667j7762L653l5163o067J3456K6725p528J0313K2214j889J14k839
11875F610M913J907J3818j2032j5531k8064J2026J5496M249J0079J582M78k1014
11862e483j9532M134K186l604N91J2168K026K0635L984l506K710k4132J9860R537
11848B1574R772J9518m0778k2374k187M095J7338j6783j6687J5356R363m435j0013
11835a6241k1099q479J454K0778j776k593m990L4130K8902j0838j5152j5954n560
$$ plain form
11927 -11102 -20707 -37353 -11290 25850 29191 21465 10926 19191 29085 30098 16163 34398 44842
11914 44842 50897 43790 34776 31728 16850 -2536 -12986 -8414 -9307 -13664 10476 16818 20832 19870
11900 19870 25376 8307 -4638 -18570 -42075 -7837 -12599 -14199 -2889 -27151 -9819 8050
11888 8050 1383 -16379 -12726 -47889 -53956 -40500 -13775 -21303 -10990 11224 9335 9449 6610
11875 6610 11523 13430 27248 15216 -315 -28379 -16353 -857 3392 13471 15053 15531 -5483
11862 -5483 -25015 -20881 -18695 -22299 -21708 -9540 -7514 13121 17105 13599 16309 -7823 12037 21574
11848 21574 31346 50864 10086 -12288 -14475 -10380 6958 -9825 -26512 -11156 -1793 -6228 -16241
11835 -16241 -37340 -45819 -44365 -23587 -25363 -27956 -32946 1184 30086 19248 4096 -11858 -17418
11822a7418j1778j7851R959K5406j0538k3627J6181P372M792O113Q26m09j2759
11809b3731J5780K2583q01M043k698L59P643p637K526M224j0800N16o117K928
11795H818K1016j6152j9332p73N075k032J477j0528k1802L1669J9383j102j218
11782A4499J5853J2411l3544k1769J032k201j535Q513l469O997o34n07q033J4311
11768A924P078o511k474J2924P204O138p769m556R268q106J2220l247l817J3984
11754C4260o755k0231J306J254R992n556o359M442m036K039N952J470m772J5084
11740B8090m178n285r742l88J0977j5161l845r84k0682j175O612L0372L243L668
11726B1522j339j1556j2684j3089O283n26j6973O95K6118k269L825l341n506J7371
$$ plain form
11822 -17418 -29196 -47047 -37088 -11682 -22220 -45847 -29666 -22294 -17502 -11389 -10563 -10972 -23731
11809 -23731 -7951 14632 13831 17874 15176 15535 23178 15541 18067 22291 11491 12007 5890 8818
11795 8818 29834 13682 -5650 -6423 -1348 -3380 -1903 -12431 -34233 -2564 16819 15717 14499
11782 14499 30352 42763 9219 -12550 -11518 -13719 -15254 -6741 -10210 -3213 -3847 -4354 -12387 1924
11768 1924 9002 2491 17 12941 20145 26283 18514 13958 23226 15120 27340 24093 20276 34260
11754 34260 27505 7274 8580 9834 19826 14270 7911 12353 8317 10356 16308 17778 13006 28090
11740 28090 23912 18627 8885 8497 19474 4313 468 -516 -21198 -22373 -15761 14611 17854 21522
11726 21522 20183 8627 -4057 -17146 -10863 -11389 -28362 -27667 -1549 -3818 7 -3334 -8840 8531
11712H531K0774j0129k1810j1213J9124K1897P761k0808k5454M529J0648M580
11700H430R398j4321j1907K0246r294k5324J0814N324k70J1683P219r401N503
11687H100m122q427p807K7349L2493p748K796J1494K1006M977j0350J8767K9827
11674A18355L2219k859j108j2053r051k1508l0846k2101Q073p757l562o09r881
11661C7312k977p57J2373q465k0K2022K3827j2595k7662k5560Q703j362K542j335
11647B6046j0881J2962J0285O24M465j7679j2788j3745J373J8116J7363j3661
11635B2480r449q200M062p279K0843l737j2486Q767L3780J5730R507P16j7460
11622E7274k0590k1393O388J8508r051k5055Q819K5881M3511N3672K8279Q115
$$ plain form
11712 8531 29305 19176 -2634 -13847 5277 27174 34935 14127 -11327 -6798 3850 8430
11700 8430 17828 3507 -8400 11846 2552 -22772 -11958 -6634 -6904 4779 11998 2597 8100
11687 8100 3978 -4449 -12256 15093 47586 39838 42634 54128 75134 80111 69761 88528 118355
11674 118355 150574 147715 146607 134554 125503 103995 73149 51048 59121 51364 47802 47193 37312
11661 37312 34335 33578 45951 37486 37466 59488 83315 70720 43058 17498 26201 24839 27381 26046
11647 26046 15165 28127 38412 39036 43501 25822 13034 -711 662 18778 36141 22480
11635 22480 13031 4831 8893 1614 22457 18720 6234 15001 48781 64511 74018 74734 57274
11622 57274 36684 15291 21679 40187 31136 6081 14900 40781 84292 137964 166243 174358
11610A74358K6427k768l2087k8766k2555o601q536k3428k9588l696l644J988j2611
11597B8493k8506n935O108K41L1105P785j553K4208l709j9014m060J4787J4037
11584F3987J3596L6747J6177R494K6375L9505J289k4942l4353k2131k4534j9248
11572H1962j5421j2097o630J3070L244R242K9294M7153J4818Q375j7465m1537
11560A14008j4244k4153l1061j9425m30m370j1817o712J2356N736M970N144p286
11547B2716K057M260n725j7386p654k095q776L6012J6446J3324O919L1177J9077
11534A10352K0589K9259K6327j3197m1012k1150j6717j6178k087l8913l0426R834
11522A6681J7358r603J5019K0061J098J4421k0864J0606K106J2438J614k9292
$$ plain form
11610 174358 200785 198017 165930 137164 114609 108008 99472 76044 46456 42760 39116 41104 28493
11597 28493 -13 -5948 160 401 31506 39291 37738 61946 58237 39223 35163 49950 63987
11584 63987 77583 114330 130507 140001 166376 205881 207170 182228 147875 125744 101210 81962
11572 81962 66541 54444 47814 60884 64128 73370 102664 149817 164635 173010 155545 114008
11560 114008 99764 75611 44550 25125 24695 20325 8508 1796 14152 19888 24858 30002 22716
11547 22716 24773 29033 23308 5922 -1732 -3827 -12603 23409 39855 53179 60098 91275 110352
11534 110352 130941 160200 186527 173330 132318 111168 94451 78273 76186 37273 6847 16681
11522 16681 34039 24436 39455 59516 60614 75035 54171 64777 66883 79321 80935 51643
11510E1643l501n84J559m384j5493M13j0649l967N010j561K424k4205r775m515
11496a7585J6697J2153j870K297p606J1120R262J4901K8572j4721j5988o537J914
11483C2609o824n684P419l872J417m365j4652J0450L640K1886J9670l8334j5681
11470G679l581j6198L526L4536L0716k6938k5886k6751k28K6097O307R24o381
11457C822j4962J6844l455j9626q34l273m582K1930k595j0849J7939O25j3413
11444a2429J967J1855R90l751k688K31k2997o550K9064J2657O358p938j3211p339
11430a3781j932K200O146J4398K1947q378j5666m903J2348L531j7764k935O184
11417A395K4262k399j4294J623q350m325J1534l687r645K2390M907j83o789j180
$$ plain form
11510 51643 48142 47558 49117 44733 29240 29653 19004 15037 20047 18486 20910 -3295 -13070 -17585
11496 -17585 -888 11265 9395 11692 4086 15206 24468 39369 67941 53220 37232 30695 32609
11483 32609 25785 20101 27520 23648 25065 20700 6048 16498 20138 42024 61694 23360 7679
11470 7679 4098 -12100 -8574 25962 56678 29740 3854 -22897 -23125 2972 9279 10203 3822
11457 3822 -11140 5704 2249 -17377 -18211 -21484 -26066 -4136 -6731 -17580 359 984 -12429
11444 -12429 -10462 1393 2383 -1368 -4056 -3825 -26822 -33372 -4308 8349 14707 6769 -6442 -13781
11430 -13781 -15713 -13513 -7367 7031 28978 20600 4934 31 12379 15910 -1854 -4789 1395
11417 1395 25657 23258 8964 10587 2237 -2088 9446 5759 -3886 18504 23411 23228 16439 15259
11403A5259N478j7445J6766L269j1618l0473M345N986Q00P524O374J1425J3423
11390C1113J342k4767p927o355J4200j0851j5806Q666J0884M143j6142o270J2807
11377d963l46k4038K447O994m0O90J0911R200q089j25m95j6739J0561O92p093
11362b0433J6047N201j7883K0379K4654o562j9169j6478J0750K456O702n388M772
11349E048q038j6655Q447K8494K0211r256p387l546k4048j9269J3045N557P950
11336E53J1193R990J5390J1003r444l3366k4809N294P281K0011L6679j0569k3590
11323A5616m949o961J631J1772r225J5014K06k665J17N781O551r717L440k1305
11309E306j0850k757k721P076l695o354j8058Q256J514Q66j6982J7638R177j0932
$$ plain form
11403 15259 20737 3292 20058 23327 11709 -18764 -14419 -8433 -7633 -109 6265 17690 31113
11390 31113 32455 7688 -239 -6594 7606 -3245 -19051 -10385 499 4642 -11500 -17770 -4963
11377 -4963 -5309 -29347 -26900 -19906 -19946 -19256 -8345 855 -7234 -7359 -7854 -24593 -14032 -13340 -20433
11362 -20433 -4386 815 -17068 3311 27965 21403 2234 -14244 -3494 -1038 5664 276 5048
11349 5048 -2990 -19645 -11198 17296 37507 28251 20864 17318 -6730 -25999 -12954 -7397 553
11336 553 11746 21736 37126 48129 38685 5319 -19490 -14196 -6915 13096 49775 39206 15616
11323 15616 10667 3706 5337 17109 7884 22898 23104 20439 20556 26337 32888 23171 26611 5306
11309 5306 -5544 -8301 -11022 -3946 -7641 -13995 -32053 -23797 -22283 -21417 -38399 -20761 -11584 -22516
11295b2516j5549k035K0512L2038M661j7955n789N186K0687J0998n689k1754M897
11282G692J4251J7810Q312l2549j9880l650N655n843n639m50Q381J665k601o74
11268g520N953M657o857p050m701J0197K2812P292m609p88Q610j4873r808J4841
11254A8156o445j5426j3066O500K306R709O675R068p259j9747j0772N774J4024
11241e03J168p991J1059K4492o538j4784M57K655J2652K3169j5067l0920J7038
11228A6887J2671k7798n930J1516J1464P66P115M808o432R909M637k2238p321
11215A0054K340O681K0593p597k3484k933N515o623j4509L343K7747j0597j1725
11202a195p330J5866J8589P632m98j2840j2844R539N059J1214l3991k0529m944
$$ plain form
11295 -22516 -38065 -40100 -19588 12450 17111 -844 -6633 -1447 19240 30238 24549 2795 7692
11282 7692 21943 39753 48065 15516 -4364 -8014 -2359 -8202 -13841 -14291 -5910 -4245 -6846 -7520
11268 -7520 -1567 3090 -3767 -10817 -15518 -5321 17491 24783 20174 19386 27996 13123 3315 18156
11254 18156 11711 -3715 -16781 -10281 -7975 1734 8409 17477 10218 -9529 -20301 -14527 -503
11241 -503 665 -7326 3733 28225 21687 6903 7360 10015 22667 45836 30769 -151 16887
11228 16887 29558 1760 -4170 7346 18810 19576 26691 31499 25067 34976 39613 17375 10054
11215 10054 12394 19075 39668 32071 8587 5654 11169 4546 -9963 -6620 21127 10530 -1195
11202 -1195 -8525 7341 25930 33562 33064 20224 7380 16919 21978 33192 -799 -21328 -26272
11189b6272N44n574L129N105J7467j2420J1158P970K218k68J7206O128K562K1914
11175E0867P666j4487j0228P125J4435k0696m945N514J2899J7374p242j0289p153
11162D0840O741j459p48o348m200J3693J6953j6145q762l089j1576n821o35k223
11148A7221q540n583K3609J6472O692K2787j3849r081k373J1138j186p723j4220
11135C5364j8797l053K4798M0207n080j7581j57k452K462J8296J3471K3267K9820
11122A40565N1234P2329P7140J42533K14394L42324N55519K64700m22179n35831
11112I02728l26029j76295j20321o8359l9505m0078j4684p280k572K97j0108k7403
11100G0391n176j3344l119o00l028j0978j1305J0162R947K680J2235O656j4655
$$ plain form
11189 -26272 -25728 -31302 -28173 -23068 -5601 -18021 -6863 1107 3325 3057 20263 26391 28953 50867
11175 50867 58533 44046 33818 40943 55378 34682 29737 35251 48150 65524 58282 47993 40840
11162 40840 47581 46122 45374 39026 34826 48519 65472 49327 40565 37476 25900 20079 19444 17221
11148 17221 8681 3098 26707 43179 49871 72658 58809 49728 47355 58493 57307 49584 35364
11135 35364 16567 13514 38312 78519 73439 55858 55701 53249 55711 74007 87478 110745 140565
11122 140565 191799 264128 341268 483801 698195 1040519 1596038 1860738 1438559 902728
11112 902728 576699 400404 280083 211724 172219 132141 117457 110177 107605 107902 97794 70391
11100 70391 65215 51871 48752 48152 45124 34146 22841 33003 42950 45630 57865 64521 49866
11087D9866n909J980n658J055P915k3733m837j1082j7368O653J6487m739M446
11074A5076N630J624q87M850J1526k0395j8915R842K5905J3227j0426l1750j6340
11061a1033K5144K2520K116r979k3661j0769M446J1634l171j0184J6635K6785
11049D0483J202k1544j9738p324k128J8476K0854K5712R679J391q837k4838k1372
11036A2016L940q641k475L881J518J5815J2437j4070j195N409l100J2411K0991
11023E8937j1917k0083J718o187l064l849K8931k034l821N391k2997L233O83r036
11009A5905n71N848O18R092R765R932K327j686J1266R923j12J7792k1298k6757
10995D2044J1601J4981p233j4035j1775q743J2328J8280J6972K7074K2408K5284
$$ plain form
11087 49866 43957 45937 40279 41334 49249 25516 20679 9597 -7771 -1118 15369 10630 15076
11074 15076 20706 22330 21443 26293 37819 17424 -1491 8351 34256 47483 37057 5307 -11033
11061 -11033 14111 36631 38747 28768 5107 -5662 -1216 10418 7247 -2937 13698 40483
11049 40483 41685 20141 403 -6921 -9049 9427 30281 55993 65672 67063 58226 33388 12016
11036 12016 15956 7315 4840 8721 10239 26054 38491 24421 23226 28635 25535 37946 58937
11023 58937 47020 26937 28655 22468 19404 15555 44486 42452 38631 44022 21025 24258 24941 15905
11009 15905 15334 21182 21800 30892 40657 50589 52916 51230 62496 72419 72307 90099 68801 42044
10995 42044 53645 68626 61393 47358 35583 26840 39168 57448 74420 101494 123902 149186
10983A49186J5799J7333J4342m357l6781j30380j78449n4493J0572J0360K9272
10972a57596L7320K2388J5682P188R394O913j1545J782J9846r050N913J0560J3119
10959b8086n259K4490K2837J3337K4023Q529m634n717j0269N402q229o623l863
10946B5938n187l937o339R741N818q899k196M029K0539J698j7942J6593J4894
10933E4750J8997J909o722J705j5915k1773k4639r687M669R88M536N337L711q60
10919A7006J652P539j3622j4660J297J2183K087K0036j674j4705k2898j5897j3969
10906c5625K444J5184K2313J899Q904K766o664j1954n306J2333J6629N518L128
10893C1569M851r646j465M30p434j9677l411J2492q881l6535K9827K5716J2996
$$ plain form
10983 149186 164985 182318 196660 192303 155522 25142 -153307 -207800 -197228 -186868 -157596
10972 -157596 -120276 -97888 -82206 -75018 -65624 -58711 -70256 -68474 -48628 -57678 -51765 -41205 -28086
10959 -28086 -33345 -8855 13982 27319 51342 59871 55237 49520 39251 44653 36424 29801 25938
10946 25938 20751 16814 10475 20216 26034 17135 14939 18968 39507 41205 23263 39856 54750
10933 54750 73747 75656 68934 70639 54724 32951 8312 -1375 3294 4282 8818 14155 17866 17006
10919 17006 18658 26197 12575 -2085 -788 11395 13482 33518 31844 17139 -5759 -21656 -35625
10906 -35625 -33181 -17997 4316 6215 15119 17885 11221 -733 -6039 6294 22923 28441 31569
10893 31569 36420 26774 25309 25739 18305 -1372 -4783 7709 -1172 -37707 -7880 17836 30832
10880C0832J4892L230K3217J4726p278j4212J568k811P356L895j9377k8647l5019
10867g628m427j3995j5612J1848J1209L0928J3691j830M658j6778J4878K2889
10855D9831L922j230l3511j6474k0087N504o696Q730J8548n105q440J7735o785
10842E942j6293R943O017P188J6662Q56R778m853o344m99L331q332P478J5021
10828D5895J5545O22K3599L3909o391j8938k920k3863j4787m531J5081J3722Q741
10815H5684j1065J0269j2467o0897p1085j4368M9248O4161M0940P1056O8828K2613
10803B42917p348m9426p4802k8817J5427J1576K6433M5336Q279q855j5832j1226
10791A53662q868k1003j8408k3780j0126J1338m802j6671P723J901K2139P772
$$ plain form
10880 30832 45724 48954 72171 86897 79619 65407 66975 64164 71520 75415 56038 27391 -7628
10867 -7628 -12055 -26050 -41662 -29814 -18605 12323 26014 24184 28842 12064 26942 49831
10855 49831 53753 52523 19012 2538 -17549 -12045 -18741 -10011 8537 3432 -5008 12727 5942
10842 5942 -10351 -408 5609 12797 29459 30315 40093 35240 28896 28397 31728 23396 30874 45895
10828 45895 61440 62062 85661 119570 113179 94241 91321 67458 52671 48140 63221 76943 85684
10815 85684 74619 84888 72421 11524 -59561 -73929 -24681 39480 80420 151476 220304 242917
10803 242917 235569 186143 111341 82524 97951 109527 135960 181296 189575 180720 164888 153662
10791 153662 144794 123791 105383 81603 71477 82815 78013 61342 69065 70966 93105 100877
10779A00877J5967R678J2495j066r24O308K1028M231Q801l516n625o901q501j53
10765A52699q981m153N177J3262L873J071k2003l2444K8397O3678N1158L9844
10753B91578K2092L868j5327k5273j0130n09k035O508K4638K0601j0k5435PK0864
10739C11437J6102M2315K0170m561K502p478q197L411J2586j226L231P402j2819
10726C84875P973J8528N0821N6623K8179K3506K7650K6030L3355K8078N1864P2813
10714H10295K9533J5760N0571N9570O8028Q5319P8182Q3487L8563O345J453K2982
10702A350088M2881J02562J11532J06663J28458J28769J60443J66847J97489K28096
10692B723828K58328L12493L27597M25675O43620Q41363J180061J605633J536215
$$ plain form
10779 100877 116844 126522 139017 137951 137027 143335 164363 168594 177395 173879 168254 161353 152852 152699
10765 152699 143718 139565 144742 158004 161877 162948 140945 108501 136898 200576 251734 291578
10753 291578 313670 317538 302211 276938 266808 266299 264264 270772 295410 316011 316001 290566 290573 311437
10739 311437 327539 369854 390024 385463 387965 380487 372290 375701 388287 387061 390292 397694 384875
10726 384875 392848 411376 462197 518820 546999 570505 598155 624185 657540 685618 737482 810295
10714 810295 839828 855588 906159 965729 1033757 1119076 1197258 1280745 1319308 1325653 1327106 1350088
10702 1350088 1392969 1495531 1607063 1713726 1842184 1970953 2131396 2298243 2495732 2723828
10692 2723828 2982156 3294649 3622246 4047921 4691541 5532904 6712965 8318598 9854813
10683I854813R40398J060937J900148K818215L743691M832429O202564Q158952
10675C9512147J1563812J6823750K5470939M2477131P7531846J17162722L7865122
10668C68407469r5915426j04882456o3209771l4476432j9967217j2563194q591295
10661B8801678o033130m271145l150391k326507j601019j144241p10621m23349
10653I141275r11473j199719r81205p60211o17275n68877m73061l48953k78487
10644C002014k40360k33262j94253j53250j19340j07923o6913k9873p5866j43143
10634A637831j52801j14281j11212j19833j01983o0340k6664n0199l4801l5391
10624H30326m6529k6618l2794m7344m2107j6891l6114j4826j0147p856k2945l0414
$$ plain form
10683 9854813 10795211 11856148 13756296 16574511 20318202 25150631 31353195 39512147
10675 39512147 51075959 67899709 93370648 135847779 213379625 330542347 368407469
10668 368407469 272492043 167609587 104399816 69923384 49956167 37392973 28801678
10661 28801678 22768548 18497403 15347012 13020505 11419486 10275245 9564624 9141275
10653 9141275 8229802 7030083 6048878 5288667 4671392 4102515 3629454 3280501 3002014
10644 3002014 2761654 2528392 2334139 2180889 2061549 1953626 1886713 1856840 1780974 1637831
10634 1637831 1485030 1370749 1259537 1139704 1037721 977381 950717 900518 865717 830326
10624 830326 783797 757179 724385 677041 634934 618043 581929 567103 556956 549100 526155 495741
10612D95741j4238L419O942q874l9152m2007j9388m0240j0531J4174J4972l875
10600C56943l1708j7386K111K5574k434m5451l8295O947L7485P100l704k5658
10588B71524m3712j7603L7794K3709l525j0499m797q761Q680j1016k3297k3718
10576A94779O268j4123p019K6098n441K3790J1529J9256Q303O557j0492j5659
10564B43846k0387k1258j7945k5193j5641N475J3918J4704K38M765O073k4993
10552A63602j8756J4763K341Q838n428j0879j078j8616k5931r698L0980L5994
10540A66132L3468L5335k6038p3824n2276k5200j3755M7753M2813M6628N2902
10529B33938P1141L0524J6222n670m0602m5465k4943k5121l4894r573k1180n686
$$ plain form
10612 495741 481503 484922 491864 482990 443838 401831 382443 342203 331672 345846 360818 356943
10600 356943 325235 307849 309960 335534 333100 287649 249354 256301 293786 300886 297182 271524
10588 271524 227812 210209 248003 271712 268187 257688 252891 244130 252810 241794 218497 194779
10576 194779 201047 186924 179905 206003 200562 224352 235881 255137 263440 269997 259505 243846
10564 243846 223459 202201 184256 159063 143422 148897 162815 177519 177757 182522 188595 163602
10552 163602 144846 159609 161950 170788 165360 154481 153403 134787 108856 99158 130138 166132
10540 166132 199600 234935 208897 135073 82797 57597 43842 91595 134408 181036 233938
10529 233938 305079 335603 351825 346155 305553 260088 235145 210024 175130 165557 144377 138691
10517A38691k1266j6615n936k6176K564Q057J6448p81N956K6749K336L416P946
10504A41389n937m3514j6961K8432Q886j0068J1917J2533J1021M531r550J327
10492A34006j6140j2511j546K956Q149K599l5955l0075n450j0090J2360j1270
10480C7033n920k371O717J561J6316N8115L9380R690k6983k7097k0416k3791l0633
10467C1601j2820j2658P318K3462K928j6802j5762r19J3263K4175M686J3095Q647
10454G0214K401j0915j4559p502k246k7531m731K1384M876j2873J3273J5794R410
10441E6995k80O840J028k0889Q986n522J4044P387k9686j0748N414n463k620J3821
10427C9307Q971j821p218p912L1554K4446j2523j2282k729p411K14r947o621K0925
$$ plain form
10517 138691 117425 100810 94874 68698 71262 79319 95767 94986 100942 127691 130027 133443 141389
10504 141389 135452 91938 74977 103409 112295 102227 114144 126677 137698 142229 132679 134006
10492 134006 117866 105355 103809 106765 114914 117513 81558 51483 46033 35943 48303 37033
10480 37033 31113 28742 35459 37020 53336 111451 150831 160521 133538 106441 86025 62234 31601
10467 31601 18781 6123 13441 36903 39831 23029 7267 6348 19611 43786 48472 61567 70214
10454 70214 72615 61700 47141 39639 37393 9862 5131 26515 31391 18518 31791 47585 56995
10441 56995 56715 63555 64583 43694 52680 47158 61202 68589 38903 28155 33569 28106 25486 39307
10427 39307 48278 46457 39239 31327 62881 87327 74804 62522 59793 52382 52596 42649 36028 56953
10413E6953J449r427J9349K5158O946m6886k6524J2082J0275M76n655p686P932
10400D4442j310J37L747J0344L551K76p894J6450L931r905j9760m495M792K9227
10386G3533j2055J5143K744n434j1134J4091J0251J0224j5450j8263R987J9547
10374I3184n99P399M60K3324K5796R421n22Q646j7582J341K5896M9716M71j14235
10360A12716k09687p3174K622J5803K5161K0157K3926K2541J7829j6246L805J8062
10348c6485N772o371r295J4729J2959o609P909L956P278K933m255N335R899k0768
10334a3013J0841J0749j0242j6505p376l183K2764O213q873q919k552J2977r476
10321a6595J4169K7103r81l763K3450k840k6140k1257j4318J1332J0720J58Q044
$$ plain form
10413 56953 58402 48975 68324 93482 100428 53542 27018 39100 49375 49851 44196 36510 44442
10400 44442 43132 43269 47016 57360 60911 61187 53293 69743 73674 63769 44009 39514 44306 73533
10386 73533 61478 76621 79365 73931 62797 76888 87139 97363 81913 63650 73637 93184
10374 93184 92585 99984 100444 123768 149564 158985 158463 167109 149527 150868 176764 226480 226951 112716
10360 112716 -96971 -170145 -167523 -151720 -126559 -106402 -82476 -59935 -42106 -58352 -54547 -36485
10348 -36485 -30713 -37084 -46379 -31650 -18691 -25300 -17391 -13435 -6157 -3224 -7479 -2144 7755 -13013
10334 -13013 -2172 8577 -1665 -18170 -25546 -28729 -5965 248 -8625 -17544 -20096 -7119 -16595
10321 -16595 -2426 24677 23696 19933 43383 40543 14403 -6854 -21172 -9840 880 1038 9082
10308I082K0852J6280n231O842p614j6687j960j2053k1871N526K0000K8943P079
10295D9188j0610k0398r444q318k6007k232Q81K6052o967p746Q507J641p95k4167
10281c0415J0537K838O87J4134J2703q023m493J1623j713n622j5925O596R27j0267
10267a6413j083J6686j1707Q803K504M196P898k770M028q98O388q029J786O99
10253A2088J7820J0946j7332l122l386j602j7936j8855k520J7825K8070K4252
10241D6248n866p822o145j1922J9533O199j5622n914j638J8910J0043R029K8955
10228H3988R240J8709J1034J0924O4205N4399O2380J11221J59066L09787M90894
10217A385847M45894j91570n27354m20449k59425j12757p3765n4616m0545l9316
$$ plain form
10308 9082 29934 46214 40983 47825 40211 23524 21564 9511 -12360 -6834 13166 42109 49188
10295 49188 38578 18180 8736 418 -25589 -27821 -26940 -888 -7855 -15601 -7094 -5453 -6248 -30415
10281 -30415 -19878 -17040 -16353 -2219 10484 2461 -2032 9591 7878 2256 -13669 -7073 -6146 -16413
10267 -16413 -17496 -810 -12517 -3714 -1210 2986 10884 8114 12142 11244 17632 9603 11389 12088
10253 12088 29908 40854 23522 20400 17014 15412 -2524 -21379 -23899 -6074 21996 46248
10241 46248 40382 32560 26415 14493 34026 40225 24603 18689 17051 35961 46004 55033 83988
10228 83988 93228 111937 122971 133895 198100 252499 314879 426100 585166 894953 1385847
10217 1385847 1831741 1640171 1112817 692368 432943 320186 246421 191805 151260 111944
10207A11944k4142j0991J389j9266L606J4493K8113k2172k5187J885L764m6891
10195A6545k6440K2754p114P788j657K536j520k337N570l720r079K310j8076J1834
10181f06q117j6650p149K4721J0918j2076o025j188O919J5613P107Q040m836O530
10167B3201n1Q957N055j3990j2999j7613p453j96p155R993l770k1034K014K2199
10153a2842j1564P738Q419k724N560J3378k1271m39n124r94N689R759J3898j0500
10139a017K397r649J0561R832R112j2613j9137o11J018K527M5L0728K0345J2637
10125E6175j2668j5174n83k1833N517m943M110j0610p404J6397J982M394p88k453
10111A2119Q886O343m921L411K2205r035l9971j3381J727J6363m550k5156j3241
$$ plain form
10207 111944 87802 76811 78200 58934 62540 77033 105146 82974 57787 59672 63436 16545
10195 16545 -9895 12859 5745 13533 11876 14412 12892 10555 16125 12405 3326 5636 -12440 -606
10181 -606 -8723 -25373 -32522 -7801 3117 -8959 -14984 -16172 -9253 6360 13467 21507 16671 23201
10167 23201 23150 32107 37162 23172 10173 -7440 -14893 -15089 -22244 -12251 -16021 -37055 -35041 -12842
10153 -12842 -24406 -16668 -8249 -10973 -5413 7965 -13306 -13745 -18869 -19863 -14174 -4415 9483 -1017
10139 -1017 1380 -8269 2292 12124 21236 8623 -10514 -11125 -10107 -7580 -7535 23193 43538 56175
10125 56175 43507 28333 27750 5917 11434 6491 10601 -9 -7413 8984 10966 15360 14572 12119
10111 12119 21005 27348 22427 25838 48043 39008 -963 -14344 -12617 3746 -804 -25960 -39201
10098c9201K730R778j708M126J2292R889Q315J2138Q053q062r715p029N149k446
10084D309l646J5828m203R506J1796j2332k1623K697K168P713r049J484M79j6210
10070a1083k1887J4983J8298r71p873N514j6061n834J8844m220n15j1423m716
10057b6944P101o175k0010J3847J2064J197N629P29M622K5116K8649K4724N5260
10044A25809j9373n3068k7519n610N257k004n108j2166m150J5462k1080j5840
10032a9390J4018J4453J4942J2293j4539j5328j4177n090J797J0304M849M7p505
10019c326j893J1698J0095l0563n564k1546O277K2100J2377r451M199J041K3249
10006A8693J4270m169N047M29j7331o34l618k5013j2811J4300J4677J7404J264
$$ plain form
10098 -39201 -36471 -26693 -28401 -24275 -11983 -2094 6221 18359 26412 18350 8635 1606 6755 4309
10084 4309 663 16491 12288 21794 33590 21258 -365 2332 4500 12213 3164 4648 5127 -11083
10070 -11083 -32970 -17987 311 -660 -8533 -3019 -19080 -24914 -6070 -10290 -10805 -22228 -26944
10057 -26944 -19843 -26018 -46028 -32181 -20117 -18920 -13291 -12562 -7940 17176 45825 70549 125809
10044 125809 106436 53368 25849 20239 25496 23492 18384 6218 2068 17530 -3550 -19390
10032 -19390 -5372 9081 24023 36316 21777 6449 -7728 -12818 -11021 -717 4132 4179 -3326
10019 -3326 -5219 6479 16574 -13989 -19553 -41099 -34822 -12722 -345 -9796 -5597 -4556 18693
10006 18693 32963 28794 33841 34270 16939 16305 12687 -12326 -25137 -10837 3840 21244 22508
9993B2508k588J1038k6056j6667K964M187L492q19N770K1326k393r699K906p329
9979H640j0638K0974J8851l962j0144j2251j1674q611p859J801J2825o173L069
9966e152L230j1866J7718l395k380J3356J0735O364P551j4971K939M505J922j5188
9952A5368j2024m073l759j0107m145J4648K8962j8679j5360J6119n461j6383J1525
9939c369J2982j6559J907J3073M723q170m273j5757K825J2465J4620J2310j5412
9926A1365k1130j5508L759j2824K840R503n90J0990R367o803m198J5719j495j3321
9912a2326K22n985l872n40J1972J3086Q848n402q207m870r711n018r768r501J7252
9897b3820m886K7226J5387J4291K6466J969K295r124j3903n246M596J5771j4251
$$ plain form
9993 22508 19920 30958 4902 -11765 -8801 -4614 -1122 -1941 3829 25155 22762 13063 15969 8640
9979 8640 -1998 18976 37827 33865 23721 11470 -204 -8815 -16674 -14873 -2048 -8221 -5152
9966 -5152 -1922 -13788 3930 535 -1845 11511 22246 28610 36161 21190 24129 28634 30556 15368
9952 15368 3344 -729 -4488 -14595 -18740 -4092 24870 6191 -9169 6950 1489 -14894 -3369
9939 -3369 9613 -6946 -5039 8034 12757 4587 314 -15443 -12618 -153 14467 26777 11365
9926 11365 -9765 -25273 -21514 -34338 -31498 -21995 -22585 -11595 -2228 -9031 -13229 2490 995 -12326
9912 -12326 -12104 -18089 -21961 -22501 -10529 2557 11405 6003 -2204 -7074 -16785 -21803 -31571 -41072 -23820
9897 -23820 -28706 -1480 13907 28198 54664 56633 58928 49804 35901 30655 35251 51022 36771
9884C6771k8915o299J296m459Q295N326m51L536q840o367j611J293r412n402q693
9869b3932r07J3076J4760K0104J6521J821k594r297j8292o052r537K970J1979
9856A0620J7523J5237r798L077j339j3554r55j2089n21j0812j1662J8807q802
9843d268o574k1857j078K2491L3823J8531j2717k8992k8118Q032L3338l574k335
9830F702k601m589k413n254K674r170Q243J8043M948j7588J2847j1976J6444J8418
9816C4728r589j6429k0618j0268j9665j730J1668M857Q955R453J5198J3884p234
9803A3210l54p355o341P068J711J0720O699L186p017O477o083j7205j6331J5667
9789D052Q847j541j814k67R723k819j8964k1753R802o11R44M0075k981j3754p831
$$ plain form
9884 36771 7856 1557 2853 -1606 6689 12015 11564 15100 6260 -107 -1718 -425 -9837 -15239 -23932
9869 -23932 -24839 -11763 2997 23101 39622 41443 38849 29552 11260 5208 -4329 -1359 10620
9856 10620 28143 43380 33582 36659 35320 21766 20811 8722 8201 -2611 -14273 4534 -4268
9843 -4268 -10842 -32699 -33777 -11286 22537 41068 28351 -641 -28759 -20727 12611 9037 6702
9830 6702 4101 -488 -2901 -8155 -5481 -14651 -6408 11635 16583 -1005 11842 -134 16310 34728
9816 34728 25139 8710 -11908 -22176 -41841 -43571 -31903 -27046 -18091 -8638 6560 20444 13210
9803 13210 12856 5501 -840 6228 7939 18659 25358 28544 21527 28004 21921 4716 -11615 4052
9789 4052 12899 11358 9544 9277 19000 16181 -2783 -24536 -14734 -15345 -14401 25674 22693 8939 1108
9774A108j4460M484l065j4071q96J2483K826J4266L033K134J3189Q429j5011k1619
9760g170O747K781r576J8793J9285Q770j8313m2761m291Q995R970J3578n458l417
9746b067q818o006j1955R885k4411J5725L1276J8411j306j0805j0396k239j8594
9733b1300k3497Q437J9925J2342R818j0898q583J5093N188K2338R475l744J1859
9720D6453k1696l1255p989j506j8110l675j6232K9919M860J1179R234Q177l636
9707E723m588Q639M435k784P309k370j6746l1748n28K0971J9608J4184Q762k647
9693B8220k2647r521n418P936N746r655J3785j277p247j079K1483J2883j4255
9680A8954k3602j3881J0905J1633J0373J129K895r935j3313K250j3p1Q042K8344
$$ plain form
9774 1108 -13352 -8868 -11933 -26004 -26900 -14417 -11591 2675 5708 7842 21031 29460 14449 -7170
9760 -7170 -423 2358 -7218 11575 30860 39630 21317 -21444 -25735 -16740 -6770 6808 1350 -2067
9746 -2067 -10885 -16891 -28846 -18961 -43372 -27647 3629 22040 20734 9929 -467 -2706 -21300
9733 -21300 -44797 -36360 -16435 -4093 5725 -5173 -13756 1337 6525 28863 38338 34594 46453
9720 46453 24757 -6498 -14487 -15993 -34103 -37778 -54010 -24091 -19231 -8052 1182 9359 5723
9707 5723 1135 9774 14209 11425 18734 16364 -382 -32130 -32658 -11687 7921 22105 30867 28220
9693 28220 5573 -3948 -9366 -1430 4316 -5339 8446 7169 -78 -1157 20326 33209 18954
9680 18954 -4648 -18529 -7624 4009 14382 15511 18406 8471 -4842 -2592 -2605 -2676 5366 33710
9666C3710L960k0656k4066l915J2237J6933l454j2293k601J2474k9157l459K2517
9653B230n126k3068o79J6143J1810j850K656J4299J7698N334j49k0152l1558j4879
9639b7291j3147N909J0740O907O888J788K7012R42p419j1314k7899j2535L4095
9626e324K5380M550j9720k914O336o624j9544j0651J8843l781L114K6371l35k3327
9612g626j8201l9429J3643K2158J1627K4372n084q313k1032J693j442q968J8241
9599a8361J7596P464K1087j46k6387k228K538l839N929J7995P869j3961n592p130
9585B834m817J3917K1126O79o084j9681P157K0247k5536q206P562n525K179J2374
9571A8226n001M131J7922j6271j6512k9042Q052R350j49J2285k333K16J9228p22
$$ plain form
9666 33710 37670 17014 -7052 -10967 1270 18203 14749 2456 -145 12329 -16828 -20287 2230
9653 2230 -2896 -25964 -26643 -10500 1310 -540 2116 16415 34113 39447 39298 19146 -12412 -27291
9639 -27291 -40438 -34529 -23789 -16882 -9994 -8206 18806 19748 12329 1015 -26884 -39419 -5324
9626 -5324 20056 24606 4886 1972 8308 1684 -17860 -28511 -9668 -13449 -10335 16036 15701 -7626
9612 -7626 -25827 -65256 -51613 -29455 -17828 6544 1460 -6853 -27885 -26192 -27634 -36602 -18361
9599 -18361 -765 6699 27786 27640 1253 -975 1563 -2276 3653 21648 29517 15556 9964 2834
9585 2834 -1983 11934 33060 33739 27655 7974 15131 35378 9842 1636 9198 3673 5852 18226
9571 18226 13225 17356 35278 19007 2495 -26547 -18495 -9145 -9294 2991 658 874 20102 19380
9557A9380j3009q19m860Q693J3369n27J311n520K716o782J0659j0381k272l368
9543H590k3656p501J8608K456o801J051J6864O132j3172j3842j2027o354J5493
9530a4159O437j127J1448j1703k295k720Q411Q926K1901n377o110N029j0867j6665
9516h871R922J3384P477J9625m2k7023L066j644l300J467M433j2442j7122K3224
9502A2154o233r247P727j0481p211P697J1340J4950J6758q491l969j4835J3668
9489B3827O780k3368m200K0377J3712j8784n278k692o562o744m292J0462k2091
9476a8853K12k994l5203J443K7023P701J7660p672p703J0563k64L454J486n932
9462i079M167K226J0783j2452j8604J3403J3588L731k3377K946J7063J8020Q598
$$ plain form
9557 19380 6371 5552 692 9385 22754 22227 23538 18018 20734 13952 24611 14230 11958 8590
9543 8590 -15066 -22567 -3959 -1503 -8304 -7253 9611 15743 2571 -11271 -23298 -29652 -14159
9530 -14159 -7722 -8849 2599 -9104 -11399 -14119 -5708 3218 25119 19742 13632 18661 7794 -8871
9516 -8871 1051 14435 21912 41537 41495 14472 17538 15894 12594 14061 18494 6052 -11070 12154
9502 12154 5921 -3326 4401 -6080 -13291 -5594 5746 20696 37454 28963 24994 10159 23827
9489 23827 30607 7239 3039 23416 37128 18344 13066 10374 3812 -2932 -7224 3238 -18853
9476 -18853 -18641 -21635 -56838 -55395 -28372 -20671 -3011 -10683 -18386 -7823 -8087 -4633 -3147 -9079
9462 -9079 -4912 -2686 8097 -4355 -22959 -9556 4032 7763 -15614 -12668 4395 22415 31013
9449C1013L192l5502N58K0285M226j393j026k1841n633K197M745q0n199K808K658
9434A008P238j2347j1553J8578K614K8067N00l703p446j1753J2635J6652m085
9421C6405r483J2124N659k8772J536K0441j3726j4373Q22r836K526j0648J2347
9408E022l473r510j6624L272M466K46Q513l542j5445K5914J7545J061k694j1115
9394C636J251N936m953J0630O567k864m827j8983n743K072k387R619J2385m121
9380H218m069R064P661J3860J3847l1689J7098J8876j0051j8832k959J146k9028
9367f858J3747J2405j6073L760m059M636M132R120K6517R871m706p170k2507r348
9353A3467j3759j1207K567l41N703J4292R87r054M576l96r346J051O11r31q362
$$ plain form
9449 31013 34205 -1297 -739 19546 23772 22379 21353 -488 -6121 -3924 821 741 -4458 -1650 1008
9434 1008 8246 -4101 -15654 2924 5538 33605 34105 30402 22956 11203 23838 40490 36405
9421 36405 26922 39046 44705 15933 17469 37910 24184 9811 10633 797 3323 -7325 5022
9408 5022 1549 -7961 -24585 -21313 -16847 -16601 -8088 -11630 -27075 -1161 16384 17445 14751 3636
9394 3636 4887 10823 5870 16500 23067 20203 15376 -3607 -9350 -7278 -9665 -46 12339 8218
9380 8218 4149 13213 20874 34734 48581 16892 33990 52866 42815 23983 21024 22170 -6858
9367 -6858 6889 19294 3221 6981 2922 7558 11690 20810 47327 57198 52492 45322 22815 13467
9353 13467 -292 -11499 -8932 -9273 -3570 10722 11709 2655 7231 6835 -2511 -1460 -849 -1780 -10142
9338a0142o146J0754J0087Q660O003J3571j7879o626P407l687L437j281M903r474
9324I587j8896J0451J0772M932L085Q186L831j9663j3053J1761J5555k00J6585
9311D2933J922j9222j2267P911N981k827o149J4889m242j6016q69j83J1790L032
9297B6683R542J3339q368j1902N303K0661K1469j0975j0262j649P322n588k2349
9284C3226p56J3583P444j4588j2602J4826n481j386j0387j1768l883P725r749
9271F204p27k433K7780J8105O759k1797n670J5311J5712j71P822M324j1707n683
9257E3829q06n143K119O37j6181l627P717Q431p222n84K5858N893M653j214j5114
9242E9246J385L296M934m609r755N874J2651M221p654J2777O717P764j596j7043
$$ plain form
9338 -10142 -16288 -5534 4553 13213 19216 32787 14908 8282 15689 12002 15439 14158 19061 9587
9324 9587 -9309 1142 11914 16846 19931 28117 31948 12285 -768 10993 26548 26348 42933
9311 42933 44855 25633 13366 21277 27258 24431 18282 33171 28929 12913 12044 11861 23651 26683
9297 26683 36225 49564 41196 29294 34597 55258 76727 65752 55490 53841 61163 55575 33226
9284 33226 32470 46053 53497 38909 26307 41133 35652 34266 23879 12111 8228 15953 6204
9271 6204 5477 3044 30824 48929 55688 33891 28221 43532 59244 59073 66895 71219 59512 53829
9257 53829 53023 47880 49999 50636 34455 30828 38545 46976 39754 39170 65028 70921 75574 74360 59246
9242 59246 60631 63927 68861 64252 54497 60371 73022 77243 69589 82366 89083 96847 95251 78208
9228G8208M045J4960K5178o951j726k4723M077K079L0659O079j172O289J207l4537
9214A03672q329J0578O829r241j761J7959j1907O329L0888J7256j1007l429k2610
9201A25227j2772J4698K1846q931r69O17Q504J4349J1440r47j0975j2489j228
9188A48370K9898R787L624k273N298J1297n478P879J115J2408J1666J8100j8905
9175B32786P056J6698N41M557K3573j853L398K7750K479N114K2764L044M555K4047
9161C76509j1882j0965m206J176M838L0420J9690J9163p356r454J9033J1744J8301
9148D57011K0071J6080L9252J9445j510J2522J7983m791K2220L4251o657Q454
9136F34331J8503J33K6392L4778J7928M132K1653K367j3K6163R499P019K0612
$$ plain form
9228 78208 82253 97213 122391 115440 113714 88991 93068 95147 125806 131885 130713 137002 138209 103672
9214 103672 95343 105921 112750 103509 101748 119707 107800 114129 145017 162273 151266 147837 125227
9201 125227 112455 127153 148999 140068 139099 139716 148220 162569 174009 173062 162087 149598 148370
9188 148370 178268 188055 191679 189406 194704 206001 200523 208402 209517 221925 233591 251691 232786
9175 232786 239842 256540 257081 261638 285211 283358 286756 314506 316985 322099 344863 347907 352462 376509
9161 376509 364627 353662 349456 350632 355470 385890 405580 424743 417387 407933 426966 438710 457011
9148 457011 477082 493162 532414 551859 550349 562871 580854 576063 598283 632534 625877 634331
9136 634331 652834 652967 679359 714137 732065 736197 757850 760217 760204 786367 795866 802885 823497
9123H23497n969R27L519K770K0835o0L5911K3491k6286l0797p159l602p118j2085
9109H17874j8744q076j9169j734l06J0785j2940j044o579k6428l6571j9532J0505
9096F88041n478l2705k6730j253l141k1514j1945j169k3212l5672q792m572j7786
9083D94072k641L15K775n15l6884k6207j1647j8647n303o681l619j7098j4378
9070C53542l059l304r629J2558l3603r128J0267r198l0448k0734k17R605R218
9057B75870j3720L675J5860n140k1773j5459l212j2098m630N213k4058p39J9143
9044B18932r810k6292J8456J4263j2553k4524q564r828o783j901Q070l0392k8567
9031A00507K3562L974m735m232j4172R787J9145r885k238K5081L1399j0405j6961
$$ plain form
9123 823497 817528 818455 821974 824744 845579 845519 881430 904921 878635 847838 840679 837077 829959 817874
9109 817874 799130 791054 771885 770151 769845 780630 767690 766646 760067 733639 697068 677536 688041
9096 688041 682563 649858 623128 621875 618734 597220 585275 584106 560894 525222 516430 511858 494072
9083 494072 491431 491746 494521 494006 457122 430915 419268 400621 395318 388637 385018 367920 353542
9070 353542 350483 347179 337550 350108 316505 307377 317644 308446 277998 257264 257047 266652 275870
9057 275870 262150 265825 281685 276545 254772 239313 236101 224003 219373 224586 200528 199789 218932
9044 218932 209122 182830 201286 215549 202996 178472 169908 160080 153297 151396 159466 129074 100507
9031 100507 124069 128043 123308 119076 104904 114691 133836 123951 121713 146794 178193 167788 150827
9018A50827n227j0613j6328j7669j7537Q484Q545K899k2066n306M581l046m080
9005G3464k1785l835M1756K1239k5671j1434j34M138j703J9140N949j690p830
8992I1604j0287m861J358n383J1144p339l696J7673J0631o380k166m774j3566
8979G3958M486O747J7415o153m776n902M560J481k6430l0909k3709R998J8559
8966C9325R877J1594J1867k7398o076J7029K464K503J7436N310N171p997p271
8953G3834k227K0613K4863L3326L2909K9328O8142R2709N0979L0599k2595o3205
8941C69275o9417p9951m4287l8773j7228k2847j96J4310M324O36j5030m233K09
8928I6792m720k213P856O506O269N515k87k4101j6197m887Q472m845r168Q36K1889
$$ plain form
9018 150827 145600 134987 118659 100990 83453 91937 100482 103381 81315 76009 80590 77544 73464
9005 73464 51679 47844 89600 110839 85168 73734 73600 77738 76035 95175 101124 99434 91604
8992 91604 81317 76456 77814 72431 83575 76236 72540 90213 100844 94464 92298 87524 73958
8979 73958 78444 85191 102606 96453 91677 85775 90335 91816 65386 34477 10768 20766 39325
8966 39325 49202 60796 72663 45265 39189 56218 58682 61185 78621 83931 89102 81105 73834
8953 73834 71607 92220 117083 150409 183318 212646 280788 373497 424476 455075 432480 369275
8941 369275 299858 219907 175620 136847 119619 96772 96576 110886 115210 115846 100816 96583 96792
8928 96792 92072 89859 97715 104221 110490 116005 115718 91617 75420 70533 79005 74160 64992 65828 87717
8913H7717Q781J3654m33J134P532P08J4679K0250P104K2900N5107O5226Q7920
8900C92279J53550J73605J09690K3346r7430j57138j25738q9201o8374o2390l1094
8889B21105k6224p763l504r703L425L114P865j8479o271j948Q746q747O46k797
8875A59465K407o290k7267r308k1363l913j689P556O759J2629q146L755k775Q1
8861A11901N221J8065j8529j7824K4793L5311O3305Q1715O3475K6137J6058n107
8849D04521o9646o8133p1747m5490j1175j7809l7502Q493j746j5901j0392r305
8837E4168q492L143n260m941K1048L4771O183j1525m49N509j0774j0934N497J402
8823G9346o421n311j703p839M912J0720J684q756o722o363j9292j3245j2743r203
$$ plain form
8913 87717 96498 110152 109719 110853 118385 119093 133772 154022 161126 184026 239133 304359 392279
8900 392279 545829 719434 829124 852470 755040 597902 472164 382963 314589 252199 221105
8889 221105 194881 187118 183614 173911 177336 180450 188315 169836 163565 161617 170363 161616 162262 159465
8875 159465 161872 155582 128315 119007 97644 93731 92042 99598 106357 118986 110840 114595 111820 111901
8861 111901 117122 135187 116658 98834 123627 158938 222243 303958 367433 393570 409628 404521
8849 404521 334875 266742 194995 149505 138330 120521 83019 91512 89766 73865 63473 54168
8837 54168 45676 48819 43559 38618 59666 94437 100620 89095 88646 94155 83381 72447 77944 79346
8823 79346 72925 67614 65911 58072 62984 73704 75388 66632 59910 53547 34255 21010 8267 -936
8809i36K475P461J2250K666o007J8767R065k08j0047L14K708n916k9703j5321
8795a2432p230Q514J8303K202j9943k5503j2290K9718J2916j3470p955K0294K1864
8782A4988J1684M182l731k4813K731K645J1358o457P908Q544j8027p885J26J7505
8768B0758L99J1208j6729k0869J932j9905m844J8268n167r605L6995L1570O012
8755E0023k0164k0159j5046O43K4381J9164N584k7377k2600j1592p891p59M981
8742b0812k811P767P484J1557J757N709r429K655j9218K018J1830p283K71o946
8728a5451M014o196J1508J6043M158k222N489M715j3647j6377n466p782R351J3514
8714A651J7532o78k1253K750l108N448j9679j3726j656R79j0999R845J5642L531
$$ plain form
8809 -936 1539 9000 21250 23916 17909 36676 45741 45533 35486 35800 38508 32592 2889 -12432
8795 -12432 -19662 -11148 7155 9357 -10586 -36089 -48379 -18661 -5745 -19215 -27170 -6876 14988
8782 14988 26672 30854 27123 2310 5041 7686 19044 12587 20495 29039 11012 3127 3253 20758
8768 20758 21157 32365 15636 -5233 -3301 -23206 -28050 -9782 -14949 -24554 12441 44011 50023
8755 50023 29859 9700 -5346 -4703 19678 38842 44426 17049 -5551 -17143 -25034 -25793 -20812
8742 -20812 -23623 -15856 -8372 3185 4942 10651 1222 3877 -15341 -13323 -1493 -8776 -8505 -15451
8728 -15451 -11437 -17633 -6125 9918 14076 11854 17343 22058 8411 -7966 -13432 -21214 -11863 1651
8714 1651 19183 18505 -2748 2 -3106 2342 -17337 -31063 -32719 -31740 -42739 -32894 -17252 -13721
8700a3721J8655Q125J237j46M137j0336k0457J607J2424J7907J7349N605k1130
8687B1256k0074j683J6707L0776K3098j2718j4607j3724j138n101J5557K522k553
8674C8318k6863Q38L597OR82n982o083J439j298o773J31K0775j788k5378N033
8659c046K5026k169j6795j6376p078J0351L223K6982J8707M081L746j150k5902
8646A9600j1642J7733M812Q052R078l548Q534N359M819j1383J2120m409j2385
8633D6740J33J269q291k210q737J6829l694j043l2182j5806J5899l076l913J6505
8619A8423j5400K8564K2176J2814j4218j4575J7760L27k4270j7709J799J6532
8607C2223P743K703n689k3984K0523J6270p873j6185J6151Q666k036P717q539
$$ plain form
8700 -13721 4934 13059 14296 14150 18287 7951 -12506 -10899 1525 19432 36781 42386 21256
8687 21256 1182 -501 16206 46982 70080 57362 42755 29031 27893 22792 38349 40871 38318
8674 38318 11455 12293 15890 15896 16878 10896 4813 6252 4954 -1819 -1688 19087 17299 -8079 -3046
8659 -3046 21980 19811 3016 -13360 -20438 -10087 -6864 20118 38825 42906 46652 45502 19600
8646 19600 7958 25691 30503 38555 47633 44085 52619 57978 62797 51414 63534 59125 46740
8633 46740 46873 48142 39851 37641 28904 45733 42039 40996 8814 -6992 8907 5831 1918 18423
8619 18423 3023 31587 53763 66577 52359 37784 55544 55871 31601 13892 15691 32223
8607 32223 39966 42669 36980 12996 33519 49789 41916 25731 41882 50548 48512 56229 47690
8594D7690R825N567j7807L770k636r070j2449j1904L253J6008q083P961l017j0009
8580A9099J3482L614k395n589o423N489j4703P000M056p322r44P998n571j6508
8566A283j0173J3626N520M705m810R53J4522K830k3872J57K660O835J6400r585
8552B1051L410N570j1599j8565J322R976Q774J1459O748j2082o820j1439p840
8539c5k570m504J8297L3445k1990j8433J465j951j3086j5754K872J9563J1953
8526I272m1531k2623k046M2389K1875M489j3256k336j5085j8201K409J8226K4068
8513G650Q742p511J4566J8676j5650j7246M526J502K645j4451l084j3216j1197
8500b4048J0127J8512O769n946n941p613j331J4961j0200k7990J0485J3749J0211
$$ plain form
8594 47690 57515 63082 45275 49045 46409 37339 24890 12986 16239 32247 24164 32125 29108 19099
8580 19099 32581 36195 33800 28211 21788 27277 12574 19574 23630 16308 15364 23362 17791 1283
8566 1283 -8890 4736 10256 14961 10151 11104 25626 28456 4584 4741 7401 14236 30636 21051
8552 21051 24461 30031 18432 -133 1189 11165 19939 31398 38146 26064 19244 7805 -35
8539 -35 -2605 -7109 11188 44633 22643 4210 5675 3724 -9362 -25116 -22244 -2681 9272
8526 9272 -32259 -54882 -56928 -14539 7336 11825 -1431 -3767 -18852 -37053 -34644 -16418 7650
8513 7650 16392 8881 23447 42123 26473 9227 13753 15255 17900 3449 365 -12851 -24048
8500 -24048 -13921 4591 11360 5414 -527 -8140 -9471 5490 -4710 -32700 -22215 -8466 1745
8487A745J26J1362M828K852r674j3846j9416l202J602K4334J8071q39R657J3591
8473D1191J0708q955k5359j6966R294p647j164J696m361l299L18j0647O569J7791
8459I169K3904M841p179J6165j951r148j9826j3542J907K2159o476q72n269j752
8445A2130j2382K241L075j108j1056Q203J9202L262q779J4033O471M14p456q355
8431A9895j5957k3110k733k197p062K046K0598O172r6j020J985k0763j2337J9846
8417a4733O975n335r831M704J5504K596M364P339J379p004O674J0588j498l1324
8403i602j5271O256n280o207j481Q80M8629M0518k0728m2396j4623J0019n296
8390a4582K384K2034k6733k3196J0846J1967N898p623j8100J661J0811M355k933
$$ plain form
8487 1745 1871 13233 18061 20913 11239 -2607 -22023 -25225 -23623 711 18782 17943 27600 41191
8473 41191 51899 42944 17585 619 9913 2266 1102 2798 -1563 -4862 -4544 -15191 -8622 9169
8459 9169 33073 37914 30735 46900 44949 35801 15975 2433 4340 26499 20023 19151 13882 12130
8445 12130 -252 1989 5064 3956 -7100 1103 20305 23567 14788 28821 35292 35706 28250 19895
8431 19895 3938 -19172 -21905 -24102 -31164 -29118 -8520 -2348 -2444 -3464 -1479 -22242 -34579 -14733
8417 -14733 -7758 -13093 -22924 -18220 -2716 -120 4244 11583 12962 5958 12632 23220 21722 -9602
8403 -9602 -24873 -18617 -23897 -30104 -31585 -30705 17924 58442 37714 -4682 -19305 -9286 -14582
8390 -14582 -12198 9836 -16897 -40093 -29247 -17280 -11382 -19005 -37105 -35444 -24633 -20278 -23211
8377b3211J7575L749M544j7739q376R56R132q868o428l790Q139K1034P459N748
8363I924P271k4672M710l157j0237Q933J9569n382j3079n156j927M770O878R730
8349H175M171M884J867R860n044m550N375K118L802Q940j8855j4924K295Q218
8335A6332j618J884P065j6453j1176J1717P940L252l116P911m191J137k153q145
8321A0386j6049r450J5689J8865k1704M86K3254k229q466M769J2551j6840j2780
8308a518K5328j7987l0223j7369K5198K3425k039n164Q428J6068j217O803M100
8295C3833k000k1647q595O107l478M384O072j2020p568L987L8934l965j7732m064
8281A2248J1036O173j9265l022O197o076N692m210o855Q927j1171k57K154k1084
$$ plain form
8377 -23211 -5636 -1887 2657 -15082 -23458 -22502 -13370 -22238 -28666 -32456 -24317 -3283 4176 9924
8363 9924 17195 -7477 -2767 -5924 -16161 -7228 12341 6959 -6120 -11276 -13203 -8433 -1555 8175
8349 8175 12346 17230 19097 28957 23913 19363 24738 26856 30658 39598 20743 5819 8114 16332
8335 16332 14714 16598 23663 7210 -3966 7751 15691 18943 15827 23738 19547 20684 18531 10386
8321 10386 -5663 -15113 576 19441 -2263 -1777 21477 19248 10782 15551 28102 11262 -1518
8308 -1518 23810 5823 -24400 -41769 -16571 6854 4815 -349 8079 24147 22930 29733 33833
8295 33833 31833 10186 1591 7698 4220 8604 14676 2656 -4912 -925 38009 34044 16312 12248
8281 12248 23284 29457 10192 7170 13367 7291 12983 8773 1918 10845 -326 -583 1571 -19513
8267a9513j3871J6433J6239L381l04j9337k4676J6639P262r444j13O29n625n447
8253c7747J8526o886K206L5362J0145k850q915j7104q376l258j812J4964j0974
8240a6719J7929M049O976J939K854o16p696j1419k506K767P798k950k7678n012
8226c0284K209L038p993J624j957k292o453R067J8824L0081J5237j9002q465M036
8212G670k0150L209l500p014J1750p021p365M744J2644J7032k375o405O90J4598
8198A8507J7268P684l305j4237k3205q828K757p210Q585n343Q98L303j4162j0822
8184b8110L056n910J5526J5636N859j7371o085P607J5494k1131Q471n440k023
8171a4421Q28J8285J4775j2608R879P199l380j0297j080j0061L634n199j3633
$$ plain form
8267 -19513 -33384 -16951 -712 2669 2365 -16972 -41648 -25009 -17747 -27191 -27304 -26675 -32300 -37747
8253 -37747 -19221 -26107 -23901 11461 21606 18756 9841 -7263 -15639 -18897 -20709 -5745 -16719
8240 -16719 1210 5259 12235 14174 17028 16412 8716 -2703 -5209 -2442 5356 2406 -25272 -30284
8226 -30284 -28075 -25037 -33030 -31406 -33363 -35655 -42108 -33041 -14217 15864 31101 12099 3634 7670
8212 7670 -12480 -9271 -12771 -19785 -8035 -15056 -22421 -17677 -5033 11999 9624 3219 3909 18507
8198 18507 35775 43459 40154 25917 2712 -6116 -3359 -10569 -1984 -7327 -6429 -3126 -17288 -28110
8184 -28110 -25054 -30964 -15438 198 6057 -11314 -17399 -9792 5702 -15429 -6958 -12398 -14421
8171 -14421 -13593 4692 19467 6859 16738 23937 20557 10260 9180 -881 2753 -2446 -16079
8158a6079N974O934M927L951P759q09j0102k7358j1000N763R839r560J3656P846
8144h259J2754P495N344o645K396J2226P29j5950n114p477J3751o734j5542j2005
8130b3031J6959l768r906j2827L161J7612k524j3035K6131j0139j9561j6731K1117
8117b6542L3068J8412n35J149N222J3677j8817K3838J34j9628k8162l52J7063
8104A8527q678J3201J1283o319K3983k2987m2513l592J39M268O83N04J0087J6576
8090A5162J6159j5567j7857m123k339k1639J5845J9830J8827r851j8512L42J7420
8077A3697Q693p229j8335l140q789r357P377j8860R251K8073r45J1573l941j3516
8063e448j4605N860J6150Q654J0852k2035k6098j9619l935K8285R803N472J1387
$$ plain form
8158 -16079 -10105 -3171 1756 5707 13466 12657 2555 -24803 -35803 -30040 -20201 -29761 -16105 -8259
8144 -8259 4495 11990 17334 10689 13085 25311 26040 10090 4976 -2501 11250 4516 -11026 -23031
8130 -23031 -6072 -9840 -19746 -32573 -29412 -11800 -14324 -27359 -1228 -11367 -30928 -47659 -26542
8117 -26542 6526 24938 24403 25552 30774 44451 25634 49472 49606 29978 1816 1464 18527
8104 18527 9849 23050 34333 28014 51997 29010 -13503 -17095 -16956 -12688 -12005 -11501 -1414 15162
8090 15162 31321 15754 -2103 -6226 -8565 -30204 -14359 5471 24298 14447 -4065 -3723 13697
8077 13697 22390 15161 -3174 -6314 -15103 -24460 -17083 -35943 -26692 1381 436 12009 8068 -5448
8063 -5448 -20053 -14193 1957 10611 21463 -572 -26670 -46289 -50224 -21939 -12136 -6664 4723
8050D723J9193M359R84l075o171M315p668J1186J3047K5608J666l2254J9277R272
8036F4462j4259k6896J8643L014j692q683j3448J4583j637k1558o820j4049j4258
8023b2598L0736K5964N219l171K264p744q069n948j5117j5082R026J0584k3048
8010a6984O291J0384J6432J4257p505L4266r674K0504K1757K2066N691j0796j5951
7997I0738m0778j7774j4552K4383Q447m09j946J2795J9630k1161j4460J358k3825
7984B2446k2655K0941K115O82J5108J2213j2245j7492r765R461r008j7301J4398
7971H898L0276j3722l2437k001L729J2486o005o399Q93N348P255J5909K2648J9188
7957F6066m200j5281l1575j8033J5943K563J8305P657j1127j0261L1324j1725
$$ plain form
8050 4723 23916 28275 29259 26184 20013 24328 16660 27846 40893 66501 68167 35913 55190 64462
8036 64462 50203 23307 41950 44964 43272 34589 21141 35724 34087 12529 5709 -8340 -22598
8023 -22598 8138 34102 39321 36150 38414 30670 22601 16653 1536 -13546 -4520 6064 -16984
8010 -16984 -10693 -309 16123 30380 22875 57141 47467 67971 89728 111794 117485 106689 90738
7997 90738 49960 32186 17634 42017 50464 50055 48109 60904 80534 59373 44913 46271 22446
7984 22446 -209 20732 22847 23529 38637 50850 38605 21113 11348 20809 11801 -5500 8898
7971 8898 39174 25452 -6985 -8986 -5257 7229 1224 -5175 -4282 1066 8321 24230 46878 66066
7957 66066 61866 46585 15010 -3023 12920 15483 33788 41445 30318 20057 51381 39656
7945C9656M403j1886l1404j7813L4722M332R68j4949k1600K85M325j0722Q81J6343
7931b459l901m495j964j3873j8772J751J1623J2443J2629L428J9598n518J204
7918A1694J7274J0323N651J2j5580j9366K786o501j6490K80K3909r194J234q777
7904b745p251k1692o569j163L589K1369K7641J5507Q230J7386o18m0300p05J0114
7890B2793k1512j1774mk812j92K1802L167N418o702J5587j4828j3818l602k527
7876i004J3064j3511j73J708k4540n228J4227M0126J3259j7654j8323P591Q114
7863I656j4780K081M855M138k821k0258J5915J8455L32q982j1486j1747q442J4689
7849h395N14o896J6452l03j358J467Q621j1982J3952q182j8619j4951n852J4185
$$ plain form
7945 39656 44059 32173 769 -17044 17678 22010 22978 8029 -13571 -13286 -8961 -19683 -18802 -2459
7931 -2459 -6360 -10855 -12819 -26692 -45464 -43713 -32090 -19647 -7018 -3590 16008 10490 11694
7918 11694 28968 39291 44942 44954 29374 10008 12794 6293 -10197 -9917 13992 4798 6032 -2745
7904 -2745 -9996 -31688 -38257 -39420 -35831 -14462 13179 28686 36916 54302 53684 13384 12679 22793
7890 22793 1281 -10493 -10497 -13309 -13501 8301 11468 16886 10184 25771 10943 -2875 -6477 -9004
7876 -9004 4060 -9451 -9624 -7916 -32456 -37684 -23457 16669 29928 12274 -6049 1542 9656
7863 9656 -5124 -3043 1812 5950 3129 -17129 -1214 17241 17573 8591 -2895 -14642 -23084 -8395
7849 -8395 -7881 -14777 1675 1372 14 1481 10102 -1880 12072 3890 -14729 -29680 -35532 -21347
7835b1347K6626R024j4074O031M799J4425Q933j4343j0975o439J4260j886q220
7822F814n188j5310k6447J3605R053q194O131J5064J5133q731J2489J4459r055
7809A9823j0691q57m171j4772o805P810L246j807j623K1801J055r921j1850m175
7795a2937o312N509J1825J5254O138k146j0975J848j539j0062o563Q760L156J7890
7781A9846K1295j263j1335j8360j0788K54K0306J4397p787j8806j8637j4775J0027
7768a5626K779l564N007m369K267k3994l526L0472K2193m591J996m850l400Q04
7754A598k712k3190k0293M785j4248p564L1198J2829m666k7775J7558K2577M543
7741e360r398J3758k9J974J8495k3731p94r714j7564k791K3607k948M145n811
$$ plain form
7835 -21347 5279 14303 229 6260 11059 25484 34417 20074 9099 2660 16920 15034 6814
7822 6814 1626 -13684 -40131 -26526 -17473 -25667 -19536 -4472 10661 1930 14419 28878 19823
7809 19823 9132 8275 4104 -10668 -17473 -9663 -6417 -8224 -9847 11954 13009 3088 -8762 -12937
7795 -12937 -19249 -13740 -1915 13339 19477 17331 6356 8204 6665 -3397 -9960 -1200 1956 19846
7781 19846 41141 39878 28543 10183 -605 -351 19955 34352 26565 7759 -10878 -25653 -15626
7768 -15626 -12847 -16411 -11404 -15773 -13506 -37500 -41026 -10554 11639 7048 9044 4194 794 1598
7754 1598 -1114 -24304 -44597 -39812 -54060 -61624 -30426 -17597 -22263 -50038 -32480 -9903 -5360
7741 -5360 -14758 -1000 -1029 945 19440 -4291 -5085 -14799 -32363 -35154 -11547 -14495 -10350 -16161
7727a6161l042O873O488J3305q699j9615m43j5684k167K9151P508l7160q102R328
7713c8420J4041J1332J0624j2544j126p121k0743l0936o21R715l954P428J2455
7700d9870P445K9625o797k9544J8725N709m300J1503R591M636J705j2274K936
7687a0910q870L037K4285K6728r316j6919j8918K412M167J269J4768m341q051
7674f59m742k326J8240J0821o844L8744L807l9035o374j0855j6650q915P037Q099
7660i652R397p146N772M006n429K515J77j0846J9522O434j8656O099j3052j2177
7646b3036j3789J0942J5974q601p335M820K0584K4028q868j0485l47k0515j1562
7633b8190J2087K2871l828o431L901Q48m692J1055P599j1762q223k138j7673m788
$$ plain form
7727 -16161 -19203 -12330 -5842 7463 -1236 -20851 -21294 -36978 -39145 -9994 -2486 -39646 -47748 -38420
7713 -38420 -24379 -13047 -2423 -14967 -16093 -23214 -43957 -74893 -75514 -65799 -69753 -62325 -49870
7700 -49870 -42425 -12800 -19597 -49141 -30416 -24707 -29007 -17504 -7913 -3277 -1572 -13846 -10910
7687 -10910 -19780 -16743 7542 34270 24954 8035 -10883 -8471 -4304 -3035 11733 7392 -659
7674 -659 -5401 -7727 10513 21334 14490 53234 57041 18006 11632 777 -15873 -24788 -17751 -9652
7660 -9652 -255 -7401 -1629 2377 -3052 -537 -360 -11206 8316 14750 -3906 2193 -10859 -23036
7646 -23036 -36825 -25883 -9909 -18510 -25845 -21025 -441 23587 14719 4234 3887 -16628 -28190
7633 -28190 -16103 6768 2940 -3491 410 1258 -3434 7621 15220 3458 -4765 -6903 -24576 -29364
7619b9364P077j2460j8612J7976J9874J6580J6496l492K108M328r270j5676m258
7606h693M890n190o956J0065j422r527l934K2325j2152j6676M169J1133Q951n233
7592h250k2431N139l290J8231K380p865J4924j1159r604K53P309k856K030J7854
7578B665J5500o53J1283K611q779p168j4278j6037r205J5850J2655j8495j2319
7565b6370j0242q575l995K3645K9553R178n154m815q710k1208Q96J3508m060j726
7551a8075r357q795P240O566M010q108j3329l762L3867J3475k000m278j0346j814
7537a4706O212r968N683J8471P90r728l660R303k0349k95J2149K6435K1277k109
7523C9505l3026o108n582J6214K922q664J8346L512L830j6993j1070k734q668
$$ plain form
7619 -29364 -22287 -34747 -53359 -35383 -15509 1071 17567 14075 16183 20511 11241 -4435 -8693
7606 -8693 -3803 -8993 -15949 -5884 -7306 -16833 -20767 1558 -10594 -27270 -23101 -11968 -3017 -8250
7592 -8250 -30681 -25542 -28832 -10601 -8221 -16086 -1162 -12321 -21925 -21672 -14363 -17219 -15189 2665
7578 2665 18165 17512 28795 31406 22627 15459 1181 -14856 -24061 -8211 4444 -14051 -26370
7565 -26370 -36612 -45187 -49182 -25537 4016 13194 8040 3225 -5485 -26693 -25797 -12289 -16349 -18075
7551 -18075 -27432 -36227 -28987 -22421 -18411 -26519 -39848 -43610 -9743 3732 1732 -2546 -12892 -14706
7537 -14706 -8494 -18462 -12779 5692 6482 -3246 -6906 2397 -17952 -18247 -6098 20337 41614 39505
7523 39505 6479 371 -5211 11003 13925 5261 23607 27119 30949 13956 2886 152 -8516
7510h516K901O957l19R58n891j2226J841J4845J3571m301o876M571k707j5114
7496a0306j1623q042K0334P156K174N48j1564j88j0020O387J1619k163P081J5025
7482A6418J447r074R939q260p446j351j5928j1315l635L5270K1605r972q251Q51
7468A0298K2116j207l8812Q483J2179L695j0415p269j3044J1375K4379j3471n593
7455B714j2400M187J2905j56r601j7064K906J0342j969J4921K3462M097M117j179
7441C7282j3296j9161q449j836j8851K235J1926k0375q955K7676N243p727N099
7428i189K3279M317j3944j4050o88J0711N632P034m953j9417p272J7112J4014
7415A2586P35k7020m412L454j0937J5419K8716J0764Q742o210j4489Q174r73j3333
$$ plain form
7510 -8516 -5615 1342 1023 1981 -3910 -16136 -14295 550 14121 9820 2944 7515 4808 -10306
7496 -10306 -21929 -29971 -9637 -2481 -307 241 -11323 -11511 -21531 -15144 -3525 -5688 1393 16418
7482 16418 17865 8791 18730 10470 3024 1673 -14255 -25570 -29205 6065 27670 17698 9447 10298
7468 10298 32414 31207 -7605 878 13057 16752 6337 -932 -13976 -2601 21778 8307 2714
7455 2714 -9686 -5499 7406 7250 -2351 -19415 -16509 -6167 -8136 6785 30247 34344 38461 37282
7441 37282 23986 4825 -3624 -5460 -24311 -22076 -10150 -30525 -39480 -11804 -6561 -14288 -9189
7428 -9189 14090 18407 4463 -9587 -10275 436 6068 13102 8149 -11268 -18540 -1428 12586
7415 12586 13321 -13699 -18111 -14657 -25594 -10175 18541 29305 38047 31837 17348 25522 24549 11216
7401A1216j4575J407o309J9452p354j3570O88J854o418J7008J4992L642j1271
7388A0762m518o028j9387l177Q803P978O944M961L028j3236k433J5526J3743j1457
7374A1509j2652J8553j0404l949l862P703K1167j7344j8687O943J6233L95r845
7361E760o821Q373j6253J5759J0554K1327J9841K348o752r598l719j9242m484
7348A7093l341m770j1897Q360J6381j9853p966o103M710j2338r667J4266J7757
7335B632J3073J6432K932n527j224j7972q816R406Q50j9919N730N709L657P185
7321A4148k358j6477k917o811O24J0056j5504R617K3605k529j6591l968k549P119
7307d535K3041N460j1116j6914o641R882N234j2931P694J4572J2301K219k3835
$$ plain form
7401 11216 -3359 -1952 -8261 11191 3837 -9733 -9045 -7191 -13609 3399 18391 22033 10762
7388 10762 6244 216 -19171 -22348 -13545 -5567 1377 6338 9366 -3870 -6303 9223 22966 11509
7374 11509 -1143 17410 7006 3057 -805 6898 28065 10721 -7966 -1023 15210 15605 5760
7361 5760 -1061 7312 -8941 6818 17372 38699 58540 60888 54136 44538 40819 21577 17093
7348 17093 13752 8982 -2915 5445 21826 1973 -5993 -12096 -7386 -19724 -29391 -15125 2632
7335 2632 15705 32137 35069 29542 28318 10346 1530 10936 11786 -8133 -2403 3306 6963 14148
7321 14148 11790 -4687 -7604 -14415 -13791 -3735 -19239 -9622 13983 11454 -5137 -9105 -11654 -4535
7307 -4535 18506 23966 12850 -4064 -10705 -823 4411 -8520 -826 13746 26047 28266 4431
7294D431j3744p618q668k380J5534J3120j4314m796j2270L2191J0551j1064q406
7281g433J5910K6676n792k0648n273j962m474k1185L480M429l377p692j3165J0984
7267b9522N428Q398K0503N218L665J0103M999J1158q243j3699j5718J0642n820
7254G112j8819K942N099o00m904M012J1740J2210o826p286k892q056n641L261
7240h648O548j481j3451N616J9138J0478j042L214j2365j6402J348K7732L14R449
7226C0448j2483k4225K2219J4096j4670k91K6255L222k4672j4665L284j2409P729
7213C838k5374j7740K9177Q731q823J3333j3587j4260J867Q002J429M898l119
7200a1628m511j6338n919J0457J2659j1176K4121m750l2495N521J0980L8178O562
$$ plain form
7294 4431 -9313 -16931 -25599 -27979 -12445 675 -13639 -18435 -30705 1486 12037 973 -7433
7281 -7433 8477 35153 29361 8713 3440 1478 -2996 -24181 -20701 -16272 -19649 -27341 -40506 -29522
7267 -29522 -24094 -15696 4807 10025 13690 23793 28792 39950 31707 18008 2290 12932 7112
7254 7112 -11707 -8765 -3666 -4266 -9170 -5158 6582 18792 11966 4680 1788 -6268 -11909 -8648
7240 -8648 -2100 -3581 -17032 -11416 7722 18200 17158 20372 8007 -8395 -7047 20685 20999 30448
7226 30448 17965 -6260 15959 30055 15385 15094 41349 44571 19899 5234 8518 -3891 3838
7213 3838 -21536 -39276 -10099 -1368 -10191 3142 -10445 -24705 -22838 -14836 -13407 -8509 -11628
7200 -11628 -16139 -32477 -38396 -27939 -15280 -26456 -2335 -7085 -39580 -34059 -23079 15099 21661
7187B1661q535k0884o162J7663q049j3813l716P894p53J0459l858l763J2091M239
7173D474P665M002m695P8k0540j7352m606Q406j8837J4382J6988k136J1140Q473
7159G442j7585k3650O069K4880K0552r093r887M860o189p698L996R340m433j6080
7145a7476J1539m39J0204k721j4845r25J57O811k280N346j0753J0157J670r56
7131d511R464Q158Q852j0298j358j0085j9818J250J1830J5317N465R342j2320
7118A1288j3326K0017O244k5592k0255o982j59o2P035Q136j1421j5857J7085J1460
7104a2389K456K967m99p846N98j1618K3045L8013J7492j2317j7583o381j3587
7091B351k697J5174n92R187R89q6Q274J1985j4112k7901j4113n600M584j3195
$$ plain form
7187 21661 13126 -7758 -13920 3743 -4306 -18119 -21835 -13941 -14694 -4235 -8093 -11856 235 4474
7173 4474 12139 16141 11446 11524 -9016 -26368 -30974 -22568 -41405 -27023 -10035 -12171 -1031 7442
7159 7442 -10143 -33793 -27724 -2844 17708 8615 -1272 3588 -2601 -10299 -6303 3037 -1396 -17476
7145 -17476 -5937 -6376 3828 1107 -13738 -14663 -14506 -7695 -9975 -4629 -15382 -5225 -3555 -4511
7131 -4511 4953 13111 21963 11665 10307 222 -19596 -18346 -6516 8801 14266 23608 11288
7118 11288 -2038 17979 24223 -1369 -21624 -28606 -28765 -28827 -21792 -13656 -25077 -40934 -23849 -12389
7104 -12389 -9933 -6966 -7465 -15311 -14713 -26331 -3286 34727 52219 39902 22319 15938 2351
7091 2351 -346 14828 14236 23423 24412 24326 32600 44585 30473 2572 -11541 -17141 -12557 -25752
7077b5752J2097Q40k65n016q391K5472j431p976j8866j763J3567q841K5331k93
7063a287K483M026K490p205L721M217R095j7362J666J3480k2059j1531m069J247
7049b1088J1635j4890q070L712K1420J2912j2411k5479p361j7955J8317L0515
7037h743l234r476O338J0172K150k9278L274L1250l826O80l596J817O12N5K7146
7022B5341q233k6575K757J6388j4947o816L946O944J164N02k0861q930M460J021
7008b3839J2312J7314o444r672j2689K26R747j137r099K609P441r320j007L230
6994b0328M505R816K2415Q553l1603l479J498n677k119m602K1071J7438k5896
6981h408n525P189k913j4884j0457J2919p271R584J1059Q007L483j4987R323o477
$$ plain form
7077 -25752 -13655 -12815 -13080 -18096 -26487 -1015 -2446 -10422 -29288 -31051 -17484 -26325 -994 -1287
7063 -1287 1196 5222 7712 507 4228 8445 17540 178 1844 15324 -6735 -18266 -22335 -21088
7049 -21088 -9453 -24343 -32413 -28701 -7281 5631 -6780 -32259 -39620 -57575 -39258 -8743
7037 -8743 -11977 -21453 -15115 -4943 -2793 -32071 -28797 2453 -1373 -693 -4289 -2472 -1860 -1805 25341
7022 25341 17108 -9467 -6710 9678 -5269 -12085 -8139 -1195 -31 471 -20390 -29320 -24860 -23839
7008 -23839 -11527 5787 -657 -10329 -23018 -22792 -13045 -14182 -23281 -20672 -13231 -22551 -23558 -20328
6994 -20328 -15823 -6007 16408 24961 -6642 -10121 -8623 -14300 -16419 -21021 50 17488 -8408
6981 -8408 -13933 -6744 -9657 -24541 -34998 -22079 -29350 -19766 -8707 -700 2783 -12204 -2881 -9358
6967i358R722J4872J5m1659N581M751j3670m26Q293R348J0755j2196J8736L848
6953H612J7286M78O014r910j1998n226m864K511j4798j5928q957J1801O242J8506
6939b31M406K7924K8296j2658k8376m264p228j7635q343J412l253J0751q583O135
6925a1647J0475j1403R079J4588j419j8634J6279L0606j1198k8468P099J1009
6913A6366j0342L18l136k420M808J2086j6009J8849J8489l319l0258l0723j5289
6900d0580J0851K2898M396J0734p774K40J6768r017l40P89j9225p378M563j1909
6886b4984q446n025J81L6967J2778O203j8090J712O148J6956P634p318l1116J921
6872d479q961p404j5273r807k5282R821K3428l579m712n938O020N344J383O844
$$ plain form
6967 -9358 364 15236 15251 -26408 -20827 -16076 -29746 -30172 -21879 -12531 -1776 -13972 4764 8612
6953 8612 25898 26376 32390 22480 10482 5256 392 2903 -11895 -27823 -36780 -24979 -18737 -231
6939 -231 4175 32099 60395 47737 19361 15097 7869 -9766 -18109 -16697 -19950 -9199 -17782 -11647
6925 -11647 -1172 -12575 -3496 11092 9673 -8961 7318 37924 26726 -1742 5357 16366
6913 16366 6024 6342 3206 786 5594 17680 1671 20520 39009 35690 5432 -25291 -40580
6900 -40580 -29729 -6831 -2435 8299 525 765 17533 8516 8176 8965 -10260 -17638 -13075 -24984
6886 -24984 -33430 -38455 -38274 -1307 11471 17674 -416 1296 7444 24400 32034 24716 -6400 -4479
6872 -4479 -13440 -20844 -36117 -45924 -71206 -61385 -37957 -41536 -46248 -52186 -46166 -40822 -39439 -32595
6858c2595K8637J2732p362l328q760j24J422j3050J633R392o702k2754J5458K1736
6844c665K0077k4542k6328R015Q803J2222K283l3179r432J3114J5391M1417j405
6831B3771N338j2767j8649J5343N146o299k065l308j3582K376p060R946q190n416
6817a5416P303P68J560j0598J0604J3760j5296O260Q287N754K769N102J2479L366
6803C6702j1823j5580L526k3391k5641o855J9302K9351J4140l2821k3331N489
6791c0932J3068N22J1718N783k1721K702K5782j6774j4541k407J7316J0048M894
6778E458K002J4494l949q786k6755M85j8823M403L5486J2205j1461l0753r673
6765c5667J1917J4583J0590p81Q62p701J4498K442l0637l190J9774K1359J665
$$ plain form
6858 -32595 -3958 8774 1412 -1916 -10676 -10800 -9378 -22428 -20795 -11403 -18105 -40859 -25401 -3665
6844 -3665 16412 -8130 -34458 -25443 -16640 -4418 -2135 -35314 -44746 -31632 -16241 25176 23771
6831 23771 29109 16342 -2307 13036 18182 11883 9818 6510 -7072 -4696 -11756 -1810 -10000 -15416
6817 -15416 -8113 -7345 -5785 -16383 -5779 7981 -7315 -1055 7232 12986 15755 20857 33336 36702
6803 36702 24879 9299 12825 -10566 -36207 -43062 -23760 5591 19731 -13090 -36421 -30932
6791 -30932 -17864 -17342 -5624 159 -21562 -18860 6922 -9852 -24393 -26800 -9484 564 5458
6778 5458 7460 21954 18005 9219 -17536 -17051 -35874 -31471 4015 16220 4759 -25994 -35667
6765 -35667 -23750 -9167 1423 642 1504 -6197 8301 10743 -19894 -23084 -3310 18049 19714
6752A9714R824p571j8148j1030Q852J6272J720k0625J0902J4378l092n397j6274
6739d75k7287L440J5741j233j0186j0159k978J5146J6272J6694p867k856q755
6726d503n301N211P251l2615j378J0277l644L766K2070j0574j0952J6408N576
6713A592k5034J2513J7437k5885l740K0117J8756J1244R367k8638j6317j322K655
6700g255K653L805p581k331n526j4423n097j781J4029J7351P124o934q398J6573
6686B209J8870k0002j5648P593J5495J2905q653q208o919N449J0310m627J178
6673I952k1779j6451J1643K3474N023J519K748l456N628l402k0499n983J335p064
6659a7312J3829J198K546N401k3064j3519P068p071j864J4332K1950N732m063
$$ plain form
6752 19714 29538 21967 3819 -7211 1641 17913 19633 -992 9910 24288 21196 15799 -475
6739 -475 -27762 -24322 -8581 -9814 -20000 -30159 -33137 -17991 -1719 14975 7108 4252 -4503
6726 -4503 -9804 -4593 2658 -29957 -31335 -21058 -24702 -20936 1134 -9440 -20392 -3984 1592
6713 1592 -23442 -10929 6508 -19377 -23117 -3000 15756 27000 36367 7729 -8588 -9910 -7255
6700 -7255 -4602 -797 -8378 -10709 -16235 -30658 -35755 -37536 -23507 -6156 968 -5966 -14364 2209
6686 2209 21079 1077 -14571 -6978 8517 21422 12769 4561 -2358 3091 13401 8774 9952
6673 9952 -11827 -28278 -16635 6839 11862 13381 16129 12673 18301 14899 -5600 -11583 -10248 -17312
6659 -17312 -3483 -2285 261 5662 -17402 -30921 -23853 -30924 -32788 -18456 3494 9226 5163
6646E163P452k6282j4698O262j6795j3238Q901K513P880o64O93K5529L9092n198
6632B6610r167O073j0376j181N520O782J931j6996k4132J2590M219o131J155N176
6618B073J3281k480k1157N701J7274P617o306l3310o061J4628K0641k935j3995
6605e029J0181R544j9444J0926K47R308N472O45j0635k1272j5861L0405J4708
6592A9195k1032j0289N414J0209j0932n877M187J3702J5306j6851j5829L962K0914
6579A2079k666k4686q85K2293J2706k451N111O569j332k59r459j6987L339L42
6565C714j3284k6543J2424J6071j3049m771N312m242j0162J3765J7458o639J268
6552h678J7097K499j9947j3168j422Q748j0415J1489K2504J130j6321J040K670
$$ plain form
6646 5163 12615 -13667 -28365 -22103 -38898 -52136 -43235 -40722 -32842 -33506 -32813 -7284 31808 26610
6632 26610 17443 23516 13140 11959 17479 24261 26192 9196 -14936 -2346 1873 -4258 -3103 2073
6618 2073 15354 12874 -8283 -2582 14692 22309 16003 -17307 -23368 -8740 11901 8966 -5029
6605 -5029 5152 14696 -4748 6178 6425 15733 21205 21850 11215 -10057 -25918 4487 19195
6592 19195 -1837 -12126 -6712 3497 -7435 -13312 -9125 4577 19883 3032 -12797 -8835 12079
6579 12079 9413 -15273 -16158 6135 18841 16390 21501 28070 26738 26479 17020 33 3372 3714
6565 3714 -9570 -36113 -23689 -7618 -20667 -25438 -20126 -24368 -34530 -20765 -3307 -9946 -8678
6552 -8678 8419 10918 -9029 -22197 -23619 -14871 -25286 -13797 8707 9837 -6484 -5444 -2774
6539b774L270j7203J8109J6643k9708j801M170m463K966k0172q515p678P571R454
6525c0131J3071J1560O312O014K3422M476j3924l4631n09K004l865l1102P81J2847
6511c3675m128J3173N106O402l246K630M722N29n625K628J3289n40j129N422J3206
6496A8764N227j0389r262q93l433J1799k214l072q394j7268J0236L3477J6707
6483D1285n167k8561J766j4563j2451J6629Q183j0045K136j6523j4889M725K3446
6470d029J6119k677k5758r431R538J9801n079k6171q384N227m41q607q776J398
6456d7270J5578J5606n100Q661J8987J6306r935j7800M788L224J688j8540J8612
6443D805N511l094J3522M93j6764j6453j6626j0202j405n487P208J1695J1558
$$ plain form
6539 -2774 496 -16707 1402 18045 -11663 -13464 -9294 -13757 -10791 -30963 -39478 -47156 -39585 -30131
6525 -30131 -17060 -5500 812 6826 30248 34724 20800 -13831 -14340 -12336 -16201 -47303 -46522 -33675
6511 -33675 -37803 -24630 -19524 -13122 -16368 -13738 -9016 -8487 -14112 -11484 1805 1265 136 5558 18764
6496 18764 23991 13602 4340 3447 14 11813 9599 6527 -1867 -19135 -8899 24578 41285
6483 41285 36118 7557 9323 -5240 -17691 -1062 7121 -2924 -788 -17311 -32200 -27475 -4029
6470 -4029 12090 9413 -16345 -25776 -16238 3563 -1516 -27687 -36071 -30844 -31285 -39892 -48668 -47270
6456 -47270 -31692 -16086 -21186 -12525 6462 22768 12833 -4967 -179 3045 4733 -13807 4805
6443 4805 10316 7222 20744 21237 4473 -11980 -28606 -38808 -40213 -45700 -38492 -26797 -15239
6430a5239K2473r823k1179j3015P117k073k39L1984N73r248q410p768J726N669
6416a7452J1113O328j2294j7396K438j2261J4247J3105J440l294O841K410M461
6403c14N673l742j6134l112K7528k730k4807j5951J8195R735J2846R811p720j2244
6389b966o35k720R524J204l7867m985K5517k319K665K105n913j3014m878J7716
6375a6566n685K018J460n667L285j7596J5245K3798O265j7555m767O990j7266
6362b6041j6504J426l334R353J1222J325n495M799K5427N499j1637j3755R422
6349h293J2104Q416n683k5615l447R109K7557n916J559k678k6478J3694K1975
6336A6304j0458q15r670k0383q833K834J5179J2847J3469j9647j5537p23L521
$$ plain form
6430 -15239 7234 -2589 -23768 -36783 -29666 -31739 -31978 6 579 -8669 -17079 -24847 -23121 -17452
6416 -17452 -6339 -11 -12305 -29701 -27263 -39524 -25277 -12172 -10732 -14026 -7185 -4775 -314
6403 -314 5359 1617 -14517 -17629 9899 7169 -17638 -33589 -15394 -5659 7187 16998 9278 -2966
6389 -2966 -3601 -6321 3203 4407 -33460 -38445 -12928 -15247 -12582 -10477 -16390 -29404 -34282 -16566
6375 -16566 -22251 -20233 -18773 -24440 -21155 -38751 -23506 292 6557 -10998 -15765 -8775 -26041
6362 -26041 -42545 -41119 -44453 -35100 -23878 -22553 -28048 -23249 2178 7677 -3960 -17715 -8293
6349 -8293 3811 12227 6544 -19071 -22518 -13409 14148 8232 9791 7113 -19365 -5671 16304
6336 16304 5846 5031 -4639 -25022 -33855 -31021 -15842 -2995 10474 -9173 -24710 -25433 -21912
6323b1912L158K644k790Q190J588J6540j431m533J8076j469j6719L346j6477j0527
6309b2316K787j1813Q543J0385L301k2100L131K8332J3536k2646k1294k822q44
6296c3820j8109J8245J7706P201J3647j220O18L440k511n073n158j9048K6102
6283B020n598m761K7219K1l3347o497J5522N607J3624J2755k27k0774K889Q573
6269A7026j7618j5968L694J2482J1809O637Q457k5146j0935J3190j2002K14j3854
6256b2014J5800R370l311j6172j4675M226K6295q523K459K8005J9877o825k2086
6243A2426k6170m167j1313J2867K6646Q318j2830L006N266j0653j9395k1305q572
6230d5876P131K1720K3406q098k583J8769J2869j159M66J767j7964l440l800J575
$$ plain form
6323 -21912 -18754 -16110 -18900 -10710 -9122 7418 5987 1454 19530 18061 1342 4688 -11789 -22316
6309 -22316 -19529 -31342 -22799 -12414 -9113 -31213 -28082 250 13786 -8860 -30154 -32976 -33820
6296 -33820 -51929 -33684 -15978 -8777 4870 3650 4268 7708 5197 124 -5034 -24082 2020
6283 2020 -3578 -8339 18880 18901 -14446 -20943 -5421 186 13810 26565 26338 5564 8453 17026
6269 17026 -592 -16560 -12866 -384 11425 18062 26519 1373 -9562 3628 -8374 -8160 -22014
6256 -22014 -6214 3156 -155 -16327 -31002 -26776 -481 -9004 -6545 21460 41337 34512 12426
6243 12426 -13744 -17911 -29224 -16357 10289 18607 5777 8783 14049 3396 -15999 -37304 -45876
6230 -45876 -38745 -17025 6381 -1717 -4300 14469 27338 26179 26645 28412 10448 7008 3208 4783
6216D783j7147l2195k0290K0042L0237M72M983p46k2282q093o93K612N914K270
6202c0133J0275J565J6420l996j37j2587k3176j2200j602L0395J9212J819R541
6189E396n9R059O689q396r977N123L254j7190k155N45J972j3309j0892l281Q971
6174b4250J0520j3477N134Q20J2146L724J6757J2128k1179p135J312J5916q489
6161C927m481k747l3433o172J2418K083q1J6405J3962Q470j1645k643P038J4590
6147A7691R608J1294R875l0174m3081J494K349J9249J3989R029L34l874j7422
6134C61j2255p788K5738L605Q587N145Jk1973j3502J5883j6977k2306j3535J241
6120d7775J0618J4197N185J6650J6833J5833Q592m134j0201k966q768M391n565
$$ plain form
6216 4783 -12364 -44559 -64849 -44807 -14570 -14098 -9115 -9861 -32143 -40236 -40929 -38317 -32403 -30133
6202 -30133 -19858 -18293 -1873 -5869 -6006 -18593 -41769 -53969 -55571 -25176 -5964 -4145 5396
6189 5396 5337 14396 21085 12689 2712 7835 11089 -6101 -8256 -7711 -5739 -19048 -29940 -33221 -24250
6174 -24250 -13730 -27207 -22073 -21253 -9107 -5383 11374 23502 2323 -4812 -3500 12416 3927
6161 3927 -554 -3301 -36734 -42906 -30488 -28405 -28486 -12081 1881 10351 -1294 -3937 3101 17691
6147 17691 27299 38593 48468 18294 -24787 -23293 -20944 -1695 12294 21323 21657 17783 361
6134 361 -11894 -19682 6056 9661 18248 23393 23394 1421 -12081 3802 -13175 -35481 -49016 -47775
6120 -47775 -37157 -22960 -17775 -1125 15708 31541 40133 35999 25798 22832 14064 18455 12890
6107A2890k1608j3970M06q439M95P101J6253j392J0783J0296J9758j3434j2722
6094F417l791l112J3381J0176n867J0121j381m782j1535j1353K854q11j5187J773
6080a3097J4369k670o449P994K0084L894q039j692J0766n237k0085M49K1722P174
6066B9183k1372k7980J5040Q387P411P692J867N520n943j0120k7054J237l242
6053a9374J613k7965J3459K0690J6001J28L011k0209L926P173o111j654p271r903
6039b6486J2546n066O796j295m232l445J7522Q515J449j2963p13J7418n422j881
6025B743j1174p5J7034N886J209J2972l127r664j2852j6639o67r933n509N086
6011b4710N578K744J7595L2325m147m2061m401J5327J3347M823n273j1681p207
$$ plain form
6107 12890 -8718 -22688 -22282 -30721 -30226 -23125 -6872 -8264 2519 12815 32573 19139 6417
6094 6417 2626 -486 12895 23071 17204 27325 25944 21162 9627 -1726 1128 317 -14870 -13097
6080 -13097 1272 -1398 -7847 147 20231 24125 16086 14394 25160 19923 -162 287 22009 29183
6066 29183 7811 -20169 -5129 3258 10669 18361 20228 25748 19805 9685 -17369 -16132 -19374
6053 -19374 -17761 -45726 -32267 -11577 4424 4552 7563 -12646 -8720 -1547 -7658 -9312 -16583 -26486
6039 -26486 -13940 -19006 -12210 -13505 -17737 -21182 -3660 4855 6304 -6659 -7372 10046 4624 2743
6025 2743 -8431 -8506 8528 14414 15623 28595 25468 15804 2952 -13687 -14354 -24287 -29796 -24710
6011 -24710 -19132 -16388 1207 33532 29385 -12676 -17077 -1750 11597 16420 11147 -534 -7741
5998g741O824L135J8610Q976l84O338M45N036m899n667n587L121q951r326j3023
5983c093k558q225J0965k141r74j2597q269K039K4082Q154j4330j4637R664K695
5969i225M778K0421q764k7614J2036K0285j3479Q525k390l676R283j8887q670
5956a7377L934K2627K853J0436Q522q725j9684k3062p860N449Q384P992J2766
5943F255j307k2194q673O636q500R450r20O791j3095J5222J2140r797k0339j344
5929b9675l706J3046J3480n098l904k136M48n892O993r754J725Q662o14r911r106
5914c5442l581L102O823J3174J6621K622k3769k2778n597J3254J8902J1065J3036
5901G432j9570j1180J7145K0646k2602j5036k415r923j0496K6834N796j4653j6371
$$ plain form
5998 -7741 -917 2218 20828 29804 29420 35758 36203 41239 36340 30673 25086 28207 19256 9930 -3093
5983 -3093 -5651 -13876 -2911 -5052 -6026 -18623 -26892 -24853 -771 7383 -6947 -21584 -11920 -9225
5969 -9225 -4447 15974 7210 -20404 -8368 11917 -1562 6963 4573 897 10180 -8707 -17377
5956 -17377 -13443 9184 12037 22473 30995 22270 2586 -20476 -28336 -22887 -14503 -6511 6255
5943 6255 4948 -17246 -25919 -19283 -27783 -18333 -19253 -12462 -25557 -10335 1805 -7992 -28331 -29675
5929 -29675 -33381 -20335 -6855 -11953 -15857 -17993 -17545 -23437 -16444 -26198 -24473 -15811 -16425 -26336 -35442
5914 -35442 -39023 -35921 -29098 -15924 697 3319 -20450 -43228 -48825 -35571 -16669 -5604 7432
5901 7432 -12138 -23318 -6173 14473 -8129 -23165 -25580 -35503 -45999 -19165 -13369 -28022 -44393
5888d4393o351Q589M356O785O40O476L141J3666Q808j4533j1638J9456m581J820
5874g759o085o548p74K7766J2145j5533j4812J656j7319m283K4156K5019n298
5861A2331m288O12l693l886J8810J1827O712J7771K039k4422q487l5749k7663
5848c8086k201m748n45L6400L0177K0190j7928j0695r238l0433j949J055N641
5835b2360K1444J0849j5492l311L467j2414J89N117P522O915m666L084j815P748
5821F277K090k6647k6268n175J1073K1867K5794j5128N588J4328o394r503j847
5808c945l1110p43J1232m696k0973J666J4128J8629J0898n572n768J9510n582
5795b326j0449J920J0908M256r852r196N254r867j2001J4521J3806P2l718o460
$$ plain form
5888 -44393 -50744 -42155 -37799 -31014 -30374 -23898 -20757 -7091 1717 -12816 -24454 -4998 -9579 -7759
5874 -7759 -13844 -20392 -21166 6600 18745 3212 -11600 -9944 -27263 -31546 -7390 17629 12331
5861 12331 8043 8655 4962 1076 19886 31713 38425 56196 58235 33813 25326 -10423 -38086
5848 -38086 -40287 -45035 -45580 -9180 20997 41187 23259 12564 3326 -27107 -29056 -28001 -22360
5835 -22360 -916 9933 -5559 -8870 -5403 -17817 -17628 -12511 -4989 1926 -2740 344 -1471 6277
5821 6277 8367 -18280 -44548 -49723 -38650 -16783 9011 -6117 -529 13799 7405 -2098 -3945
5808 -3945 -35055 -35798 -24566 -29262 -50235 -48569 -34441 -15812 -4914 -10486 -16254 3256 -2326
5795 -2326 -12775 -10855 53 4309 -5543 -14739 -9485 -19352 -31353 -16832 -3026 -2954 -6672 -13132
5781a3132l646k938K589j0021J6154J8636j8230N678N627j1802n73k0159r496
5768d1313J437J5620K5551Q663R927O064j9061k9683J3003J2220k536L944l477
5755C59R938J324r977J812j0899l785p299m283L702k19K607k8714J4817J4736
5741a5881J5296J6479l75k1220j633J2581M895j7494J550k515P575K5156J540
5728B5954K185m595n104j3609P666l587j6831p547J2843R915P665p679J8840J0517
5714C6633q666j9083J1695K625J016J8857J0086r884k3825j3298j629k4360m912
5701b4745Q897K3054l946K799M310j8744m895P862M307J60J3381P591k9680j2122
5687b1771O390K384K7379K8816o10j5395k5885m974O005j3454N233K4757m293
$$ plain form
5781 -13132 -16778 -19716 -17127 -27148 -10994 7642 -10588 -4910 717 -11085 -11658 -31817 -41313
5768 -41313 -39876 -24256 1295 9958 19885 25949 6888 -22795 -9792 2428 -108 3836 359
5755 359 10297 11621 1644 3456 -7443 -11228 -18527 -22810 -19108 -19327 -16720 -45434 -30617 -15881
5741 -15881 -585 15894 15519 -5701 -7334 5247 10142 -7352 -5802 -8317 -742 24414 25954
5728 25954 28139 23544 18440 4831 12497 8910 -7921 -15468 -2625 7290 14955 7276 26116 36633
5714 36633 27967 8884 20579 23204 24220 43077 53163 43279 19454 6156 4527 -19833 -24745
5701 -24745 -15848 7206 3260 6059 10369 -8375 -13270 -5408 -1101 -941 12440 20031 -9649 -21771
5687 -21771 -15381 -12997 14382 43198 42588 27193 1308 -3666 2339 -11115 -5882 18875 14582
5674A4582q060k0990l184N930j579J8186J456k2032l487L010J7779J4961M653
5661B1225Q554K789j8376k4906L128L801j9007r721n963J5452J8993J3482O236
5648A5687j2665j6482n041l397O247k089L223l583j003J433N462K521J0637P080
5634H030j022M037P494j1402n040m438q87J316j0826m460R333j8582k6659J0570
5620d2536K4298M050N810l48Q515k087k1815j4152M117J5493m115o695j5885O32
5606d4718J4125L1588P395n511M201J3383Q311m67k1198o825N271j194k2474J450
5592a6663J5854N812P523l85M450o588N119R457j528j0259k3403j6162P651J0564
5578h558J4085J1002m542r035l175q93r283K5774K64p655j8190n736P420j8527
$$ plain form
5674 14582 6522 -14468 -17652 -11722 -13301 4885 6341 -15691 -19178 -16168 1611 16572 21225
5661 21225 29779 32568 14192 -10714 -7586 -3785 -22792 -32513 -38476 -23024 -4031 9451 15687
5648 15687 3022 -13460 -18501 -21898 -15651 -17740 -14517 -18100 -19103 -17670 -12208 -9687 950 8030
5634 8030 7008 11045 18539 7137 2097 -2341 -3228 -1912 -12738 -17198 -7865 -26447 -53106 -42536
5620 -42536 -18238 -14188 -8378 -8726 -211 -2298 -24113 -38265 -34148 -18655 -22770 -29465 -45350 -44718
5606 -44718 -30593 995 8390 2879 7080 20463 28774 28307 7109 284 5555 4361 -18113 -16663
5592 -16663 -809 5003 12526 12141 16591 10003 15122 24579 23051 12792 -10611 -26773 -19122 -8558
5578 -8558 5527 16529 11987 2952 -223 -1116 -10399 15375 15639 7984 -10206 -15942 -8522 -27049
5564b7049j782n072Q695M8580L9721j71j8863J904j9678o955J273p91k3753m134
5550h075j1843o626J6365N991J107j5946R762J6891J1647m803J3828j0469m251
5537A3578l871k2265r660m261m088l10q492n570M44J3729J3454L245O416k630
5523a0281J4107J010O908p87j3002Q141n367p731K720j4807q596J115P509K2093
5509C032M133R314k010l73j1714l0679Q267K0299N009J8360R918M354k5139k1270
5495h499M266j0266j5951J1331P316J3179J9481j4997j1082J1034J57M946n162
5482E753q6n507j437J0974L497O933J1637j9728q844k140O072J59O607p081j2285
5467e476K932L486J4217m93p843J1177L2377j5317m1154j3391k652J0141r516
$$ plain form
5564 -27049 -28831 -33903 -25208 23372 63093 62922 44059 45963 26285 19330 20603 19812 -3941 -8075
5550 -8075 -19918 -26544 -10179 -4188 -3081 -19027 -9265 7626 19273 14470 28298 17829 13578
5537 13578 9707 -12558 -22218 -26479 -30567 -30877 -39369 -44939 -44495 -30766 -17312 -14067 -7651 -10281
5523 -10281 3826 4836 11744 10957 -2045 6096 729 -7002 -4282 -19089 -27685 -26570 -19061 3032
5509 3032 7165 16479 14469 14096 2382 -28297 -20030 269 5278 23638 33556 37910 12771 -8499
5495 -8499 -4233 -14499 -30450 -19119 -11803 1376 20857 5860 -5222 5812 5969 10915 5753
5482 5753 5667 160 -1277 9697 13194 20127 31764 12036 3192 1052 7124 7283 13890 6809 -5476
5467 -5476 -2544 942 15159 14666 6823 18000 50377 35060 -6094 -19485 -22137 -11996 -21512
5454b1512n005K0080j5745k8916L394K9861P810J0320J9638m324l2249N390K5662
5441A4404J3253l646o768j2522L729m843J9677q307q85J9611m589P08n287j5457
5427I078j4849k531j3658q782m100J2259R201J6961J0017m684M369L894N890j5078
5413G987k2028r515l139J7006K9886P601Q106m322o779O072k086q561j3578k3309
5399a6659l880K2098L666j4635P75P364o354K3380M360j8319j6951n695k91Q707
5385a2434l569p823J1726J2589J548j5283j3566j3096J5884J4038K4348N473k8625
5372h790k1273L220J36J2617O149J2024L418q141o015j1310k47j7872K461N017
5358b8606q56j0618J5485O922K0576K8425j151p706j2488P494l458j7817o375
$$ plain form
5454 -21512 -26517 -6437 -22182 -51098 -47704 -17843 -10033 287 19925 15601 -16648 -11258 14404
5441 14404 27657 24011 17243 4721 8450 3607 23284 14977 14092 33703 29114 29822 24535 9078
5427 9078 -5771 -8302 -21960 -30742 -34842 -22583 -13382 3579 13596 8912 13281 17175 23065 7987
5413 7987 -14041 -23556 -26695 -9689 20197 27798 35904 31582 24803 30875 28789 20228 6650 -16659
5399 -16659 -20539 1559 5225 -9410 -8635 -1271 -7625 15755 20115 1796 -15155 -20850 -21141 -12434
5385 -12434 -16003 -23826 -12100 489 2037 -13246 -26812 -39908 -24024 -9986 14362 19835 -8790
5372 -8790 -30063 -26843 -26707 -14090 -7941 4083 7501 -640 -6655 -17965 -18212 -36084 -33623 -28606
5358 -28606 -29462 -40080 -24595 -17673 2903 31328 30177 22471 9983 17477 14019 -3798 -10173
5345a0173J2725K21J4793j5985p623j2496O095J32o696k689K1117M764j2325l251
5331a1391O05P6J222P764k523p288Q543J446M057K240K867j3463j8014o665J4456
5316a6068j3950j2273Q194J6001J0943O703j9672k4433Q823J9544l121o676J4353
5303a1632J1546j3491j3863L655J9196J2347J023Q683l844N676Q09j9453k2634
5290b1982l270R34J1716J2523J2430j1658O819L153P645k5646l4181J1244J9754
5277a0519K961N037k05j4106k346N395J0669N255k1337j0937L129p535n12P325
5263b7726l292j0172Q623J7307J3710m090N280L6746l570o752J229k5630k3560
5250b1897p294J0766J5071N02L989J4344J7751j9126m933R787J6415j5620M042
$$ plain form
5345 -10173 2552 2773 17566 1581 -6042 -18538 -12443 -12311 -19007 -21696 -579 4185 -8140 -11391
5331 -11391 -10786 -10710 -9488 -1724 -4247 -11535 -2992 -1546 2511 4751 7618 -5845 -23859 -30524 -16068
5316 -16068 -30018 -42291 -34097 -18096 -7153 -450 -20122 -44555 -35732 -16188 -19309 -25985 -11632
5303 -11632 -86 -13577 -27440 -23785 -4589 7758 8781 17464 13620 19296 20105 652 -21982
5290 -21982 -25252 -24318 -12602 -79 12351 693 7512 10665 18310 -7336 -41517 -30273 -10519
5277 -10519 -7558 -2521 -2726 -16832 -19178 -13783 -3114 2141 -19196 -30133 -27004 -34539 -35051 -27726
5263 -27726 -31018 -41190 -32567 -15260 -1550 -5640 -360 36386 32816 26064 27293 1663 -21897
5250 -21897 -29191 -18425 -3354 -2852 1137 15481 33232 14106 9173 18960 35375 19755 23797
5237B3797k8927k9755J3194K5234J4464j6764j0155P481M280o902J390n140J4358
5224F555J2240J6791j5181j4525j4689q438J512J2232K1334r035N322Q56j0840
5211D134j2116J0559R369K3680j1865j1158j5428k708Q20l851p237K2872k948
5198D123n413L923j4248R161J3738k9375j5735K0105P294N61l1119M469J8933
5185a3583J1666J4089j325k0211l849k780J9267J0058N258r78p790j3997O871
5172B696j086q275N025J3051J3519J8834k1773j7857n556O370N852m569o821L296
5158B706n863k6784l744J6953J900k095R238p737N90J5492J5707R861k3933r079
5144f788J3720n786j0248J1160J8671J6398j5658q523n545j5358J5199J0672J0659
$$ plain form
5237 23797 -5130 -34885 -21691 3543 18007 1243 -8912 -1431 2849 -4053 -2663 -7803 6555
5224 6555 18795 35586 20405 5880 -8809 -17247 -15735 -3503 17831 8796 14118 14974 4134
5211 4134 -7982 2577 11946 35626 23761 12603 -2825 -5533 -4713 -8564 -15801 7071 4123
5198 4123 -1290 2633 -11615 -2454 11284 -18091 -33826 -13721 -6427 -5866 -36985 -32516 -13583
5185 -13583 -1917 12172 10847 -9364 -13213 -15993 3274 13332 18590 17612 9822 -4175 2696
5172 2696 1610 -6665 -1640 11411 24930 43764 21991 4134 -1422 4948 10800 6231 -590 2706
5158 2706 -3157 -29941 -33685 -16732 -14832 -16927 -7689 -15426 -14836 656 16363 26224 2291 -6788
5144 -6788 6932 1146 -9102 2058 20729 37127 21469 12946 7401 -7957 7242 17914 28573
5131B8573j7833k0061M616J3248K077P099K297j2188l352j4115K1716K10q978
5118C309r570q390k303m791J4682J7032k664q158l598k4701O218j0134j965m090
5104c9123P728J3146j3346k3599K4966J5546j7513M804L150p032J6523Q88p917
5091b1779P041J3360J9912j4922M651J8336M084l233k8595j478J3452P51o763
5078D817j0287p182m251R928n221m188M301j1367m205L306J1502J9177k7638k4634
5064d5942J5965j470J5468J6952J4553k0602k8469p485Q408o128n489K2048K2253
5051F2j0552r304J3948O995M510J488m967J7881J0887j3200k0136O016P393n924
5037E097p076m961j4268k1622o449L220J4026L1108P486J698m610l097o424M75
$$ plain form
5131 28573 10740 -9321 -4705 8543 10620 17719 20016 7828 4476 -9639 12077 12287 3309
5118 3309 -6261 -14651 -16954 -21745 -7063 9969 7305 -853 -4451 -29152 -22934 -33068 -35033 -39123
5104 -39123 -31395 -18249 -31595 -55194 -30228 -14682 -32195 -27391 -24241 -31273 -14750 -13862 -21779
5091 -21779 -14738 -1378 18534 3612 8263 26599 30683 27450 -1145 -2623 10829 11580 4817
5078 4817 -5470 -12652 -16903 -6975 -12196 -16384 -12083 -23450 -27655 -24349 -12847 6330 -21308 -45942
5064 -45942 -29977 -31447 -15979 973 15526 -5076 -33545 -41030 -32622 -38750 -44239 -22191 62
5051 62 -10490 -19794 -5846 1149 5659 7147 2180 20061 30948 17748 -2388 3628 11021 5097
5037 5097 -1979 -6940 -21208 -42830 -49279 -46059 -32033 -925 6561 8259 3649 552 -5872 -5397
5023e397K3406O460l214m158j0314j5954n149m476o799J4640J3777J8089L415
5010B4326k0154k7741p065P915m534N085k202o875j913p120J2869J9259J1659
4997C509N067J3151O377k9339j3792J4540m85P594l496q186P29m374o090k0630
4983c5425M677K0035M504L59J4963M103j2918k697P730p142j5812k04K3255j8395
4969a2967j4846J2884J546n0R221l143l217J390r20N490j2584l265p874j0778
4955c9113J4239K1233P845K3418R800j9203k0669j0212N193j2436j376K6009k453
4942B275k0777k1818K340K4961K8854J3739m868j9286J809m284j3389N612J2060
4929G228l681M919m796k0041j0978J3944J576J2336J8683j6480j9674L00j1252
$$ plain form
5023 -5397 18009 24469 21255 17097 6783 -9171 -14320 -18796 -25595 -10955 2822 20911 24326
5010 24326 4172 -23569 -30634 -22719 -27253 -22168 -24370 -31245 -33158 -40278 -27409 -8150 3509
4997 3509 8576 21727 28104 -1235 -15027 -487 -972 6622 3126 -5060 -4331 -8705 -14795 -35425
4983 -35425 -30748 -10713 -6209 -5850 9113 13216 298 -2399 5331 -1811 -17623 -17827 5428 -12967
4969 -12967 -27813 -14929 -13383 -13433 -4212 -7355 -10572 -9182 -10102 -4612 -17196 -20461 -28335 -39113
4955 -39113 -24874 -3641 4204 27622 37422 18219 -2450 -12662 -7469 -19905 -21281 4728 2275
4942 2275 -18502 -40320 -37980 -13019 15835 29574 24706 5420 7229 2945 -10444 -4832 7228
4929 7228 3547 8466 3670 -16371 -27349 -13405 -11829 507 19190 2710 -16964 -16664 -27916
4916b7916O313O705P178j986n076J3164l647j7721O117K0344M328j9046j595M400
4902h438P133j8549J0449J465J2048L685k4579m579O179j0864K2611O175q209
4889e473o269j1224j607o71j093P473L1741n288m182p87J5218n438l4359k1615
4875d3574J2848k875K89J1913J8416l240n925O752N771k302k108n111J5928P112
4861A3894j1645k3165r858P826M837K603K444n59r210m256o851P836J1355J920
4847a2829j942k663J6971P397K6200K820l2930j3526P70J3725K2568q769J1934
4834B9726J1784k2565J4483k0365k1762J6922Q635k3922l60J3926M362j3232j026
4821c394o094j1013M388J8074Q250J339k0673j5307k853L279K4500L544p407j3925
$$ plain form
4916 -27916 -21603 -14898 -7720 -9706 -14782 -1618 -5265 -22986 -16869 3475 7803 -11243 -12838 -8438
4902 -8438 -1305 -19854 -9405 -7940 4108 7793 -16786 -21365 -15186 -26050 -3439 2736 -5473
4889 -5473 -11742 -22966 -24573 -25244 -26337 -18864 12877 7589 3407 2620 17838 12400 -21959 -43574
4875 -43574 -30726 -33601 -33312 -21399 -2983 -6223 -12148 -5396 375 -1927 -4035 -9146 6782 13894
4861 13894 2249 -20916 -30774 -22948 -18111 -15508 -13064 -13623 -22833 -27089 -33940 -26104 -14749 -12829
4847 -12829 -14771 -17434 -463 6934 33134 35954 3024 -10502 -9732 3993 26561 17792 29726
4834 29726 41510 18945 33428 13063 -8699 8223 16858 -7064 -7424 6502 10864 -2368 -3394
4821 -3394 -9488 -20501 -16113 1961 10211 11550 -9123 -24430 -27283 -24004 496 4040 -3367 -17292
4807a7292p20J470N449M048J0298J4040k1247k3672L36K4713J2625k4766N320
4794i398J7868l14j6881k991K8983R469J930j8177p765O379q566n266Q338K2677
4780B6286N384o081j348j7080j2073j9916q361K7731p558l709K5265K2455j5484
4767A5511j4396o114k239Q843K260J155M732n520j5772o028j6367j374k500K8660
4753i149J8864k489j4389m758r31J2573p127j4391k33J1429L4375J1853p311M141
4739C2457J579q885j5237J1110J755K728j5269k2085j0529j9145J9579R405Q355
4726d182K102k094M403O583k070l936l562Q781J1367j5753M831K816l925j5178
4712i817j3227J5484R287p580q647j3172N100l431J0312o072q464K1425Q543J5737
$$ plain form
4807 -17292 -18012 -16542 -11093 -7045 3253 17293 -3954 -27626 -27290 -2577 10048 -14718 -9398
4794 -9398 8470 8156 -8725 -11716 17267 26736 28666 10489 2724 9103 537 -4729 3609 26286
4780 26286 31670 25589 24241 7161 -4912 -24828 -33189 -5458 -13016 -16725 8540 30995 15511
4767 15511 1115 -4999 -7238 1605 3865 5020 9752 4232 -11540 -17568 -33935 -35309 -37809 -9149
4753 -9149 9715 7226 -7163 -11921 -12852 -279 -7406 -21797 -22030 -10601 23774 35627 28316 32457
4739 32457 34036 25151 9914 21024 22779 25507 10238 -11847 -22376 -41521 -21942 -12537 -4182
4726 -4182 -2080 -4174 229 6812 4742 806 -2756 6025 17392 1639 6470 9286 5361 -9817
4712 -9817 -23044 -7560 1727 -5853 -14500 -27672 -22572 -26003 -15691 -21763 -30227 -8802 -259 15478
4698A5478N439j5008k3687j2144O621K6478K2374K206k6211j2968L274Q740o803
4685f211k6014p488M2858J0248k3000m397J2290J4890j4747J5527R590J7294r34
4672C9906l9530r181o697J0171j851p024p214R402P915k832J0400k5097j3704
4659c5336K3316k605K1466K7493p98j0312j5690k9192q22r12L757n37J0401n602
4645a5373n190l608J9563K6062K1209j0082M27m843K257l888P09o768J6883j0961
4631B6397j6927j2186K495K276m771r400Q839K1715k634j1202j0626J3448j3427
4618f003Q213o921k2180J77K3261O914J1194j4082n107j0458q15N703k6999K340
4604c4763K51J4395K2789J1243N083n220n601P60j1571k30j079n193J348k3197
$$ plain form
4698 15478 20917 5909 -17778 -29922 -23301 3177 25551 27757 1546 -11422 -8148 592 -6211
4685 -6211 -32225 -39713 3145 13393 -9607 -14004 -1714 13176 -1571 13956 23546 40840 39906
4672 39906 376 -8805 -15502 -5331 -7182 -14206 -21420 -12018 -4103 -6935 3465 -21632 -35336
4659 -35336 -12020 -14625 6841 34334 33536 23224 7534 -21658 -22480 -23392 -19635 -20172 -9771 -15373
4645 -15373 -20563 -24171 -4608 21454 42663 32581 33008 28165 30422 26534 27243 20475 37358 26397
4631 26397 9470 -2716 -221 2055 -2716 -12116 -3277 18438 15804 4602 -6024 7424 -6003
4618 -6003 2210 -4711 -26891 -26714 -3453 3461 14655 573 -4534 -14992 -15807 -10104 -37103 -34763
4604 -34763 -34512 -20117 2672 13915 18998 13778 8177 8937 -2634 -2864 -3943 -9136 -7788 -30985
4590c0985J0508O378P45n757j1542j3345J9393K2580N730J303l596j0192N365
4577c415r298J2429J646j4794j9016k765J2365m440P25K4366O274o984O408p497
4563c996O270L748J6788J4888j7226l3525p381N83M75R420j5643l778P742k030
4549b3665K2718J8461k790J0715m41m593J920P787m268j1402k812l2264j3391
4536c4025J1439l429K3392K2886m426r788k780j7706j0948r785J4170L1412j1028
4523f16j7438r637R270K8417J7248r59m720J452K209j7142p464m743P100j0621
4509g644K175M676q955J564k959l135P546j1682k3794P150J7944O233K3210o33
4495A1696J1389k6971K358J5608J8442k885n342q608k3510J1253J5473j1895p405
$$ plain form
4590 -30985 -20477 -14099 -13354 -19111 -30653 -43998 -24605 -2025 3705 5008 1412 -8780 -3415
4577 -3415 -12713 -284 1362 -13432 -32448 -35213 -22848 -27288 -26563 -2197 4077 -2907 3501 -3996
4563 -3996 2274 6022 22810 37698 20472 -13053 -20434 -19851 -19376 -9956 -25599 -29377 -21635 -23665
4549 -23665 -947 17514 14724 25439 24998 20405 22325 30112 25844 14442 11630 -20634 -34025
4536 -34025 -22586 -26015 -2623 20263 15837 6049 3269 -14437 -25385 -35170 -21000 10412 -616
4523 -616 -18054 -27691 -18421 9996 27244 26285 21565 23017 25226 8084 620 -4123 2977 -7644
4509 -7644 -5469 -793 -9748 -8184 -11143 -14278 -6732 -18414 -42208 -35058 -17114 -10881 12329 11696
4495 11696 23085 -3886 -1528 14080 32522 29637 24295 15687 -7823 3430 18903 7008 -397
4482c97j0055m486R381o236r297J6129K7564J9004n238k5526J3554N386r877N37
4468B0443j2263k1695J0811J1876l306o075k047k0165J3232m291j1636J0185P700
4455g231j1265O469K677J6245K478o373K1915n898j8657j3317k0770Q214L0119
4442D606P801j1775j0896J6928M213n250j2807j0813l862j0701L4962K4534m274
4429B2666j1081N402O714J7392l392j5694J2283r9j4922q565O76o358J9900J393
4415B6315m813p448m775j2105j8511j3013q130M792j251j4123J6501O243K065
4402b8253J5841n070j2145J4478K9759k7232m035J3298O598j1490l547k055J6609
4389B756j2286n962K381J9431Q518j5686j1145J1028J7970r301k1274J4542k1105
$$ plain form
4482 -397 -10452 -14938 -5557 -11793 -21090 -4961 22603 41607 36369 10843 24397 29783 19906 20443
4468 20443 8180 -13515 -2704 9172 5866 -209 -2256 -22421 -9189 -13480 -25116 -14931 -7231
4455 -7231 -18496 -12027 -9350 6895 9373 3000 24915 19017 360 -12957 -33727 -25513 4606
4442 4606 12407 632 -10264 6664 10877 5627 -7180 -17993 -21855 -32556 2406 26940 22666
4429 22666 11585 16987 23701 41093 37701 22007 34290 34191 19269 10704 11380 5022 24922 26315
4415 26315 21502 14054 9279 -2826 -21337 -34350 -42480 -37688 -38939 -53062 -36561 -30318 -28253
4402 -28253 -12412 -17482 -29627 -15149 14610 -12622 -16657 -3359 3239 -8251 -11798 -13853 2756
4389 2756 -9530 -15492 -13111 6320 14838 -848 -11993 -965 17005 7704 -13570 972 -20133
4376b0133q084L341M020O318L7720n09P074N615j0324j8518q761q987r186O887
4362a3527r930r383l245K6800q193k469Q558N469k5182m253J5986K5229m987j7377
4348a6504p334J1595Q03k0745J214J484J4963K671j1680N88K3729p682j3239q713
4334b8850J8489P626J3994k315l074p974O403r385p111K0626l273Q0J7577j4321
4320H492j9449L659n517O857J2313n093J278r379j7960M947J1332J883j7001M365
4306a9273K6365j0328k3872j1791k835K7714J6256q553j82l550j6402p886J387
$$ plain form
4376 -20133 -28217 -24876 -20856 -14538 23182 22673 29747 35362 25038 6520 -2241 -11228 -20414 -13527
4362 -13527 -23457 -32840 -36085 -9285 -17478 -19947 -11389 -5920 -31102 -35355 -19369 5860 873 -16504
4348 -16504 -23838 -12243 -11440 -32185 -30971 -29487 -14524 -11853 -23533 -22945 784 -6898 -20137 -28850
4334 -28850 -10361 -2735 11259 8944 5870 -2104 4299 -5086 -12197 8429 5156 5236 22813 8492
4320 8492 -10957 -7298 -12815 -5958 6355 1262 2540 -6839 -24799 -19852 -8520 -6637 -23638 -19273
4306 -19273 7092 -3236 -27108 -38899 -41734 -14020 2236 -6317 -6499 -10049 -26451 -34337 -32950
$$ [...]
##END NTUPLES=NMR SPECTRUM
##END=
