##TITLE=Analysis number 327847
Compound Code mo 07285
Project Code adrs
Chemist Name fudan
##JCAMPDX= 6.0         $$ Bruker NMR JCAMP-DX V2.0
##DATA TYPE= NMR SPECTRUM
##DATA CLASS= NTUPLES
##ORIGIN= Bruker BioSpin GmbH
##OWNER= nmr
$$ XWIN-NMR		Version 3.5
$$ Thu Apr 12 11:28:27 2007 GMT Daylight Time (UT+1h)  MAYBRIDGE\nmr@NMR_250MHZ
##.OBSERVE FREQUENCY= 250.131544655141
##.OBSERVE NUCLEUS= ^1H
##.ACQUISITION MODE= SIMULTANEOUS (DQD)
##.ACQUISITION SCHEME= undefined
##.AVERAGES= 16
##.DIGITISER RES= 18
##SPECTROMETER/DATA SYSTEM= dpx250
##.PULSE SEQUENCE= zg30
##.SOLVENT NAME= CDCl3
##.SHIFT REFERENCE= (INTERNAL, CDCl3, 0, 16.522)
##AUDIT TRAIL= $$ (NUMBER, WHEN, WHO, WHERE, WHAT)
$$ ##TITLE= Audit trail, XWIN-NMR		Version 3.5
$$ ##JCAMPDX= 5.01
$$ ##ORIGIN= Bruker BioSpin GmbH
$$ ##OWNER= nmr
$$ C:\u/data/dgb/nmr/ADRS/1200/pdata/1/auditp.txt
$$ ##AUDIT TRAIL=  $$ (NUMBER, WHEN, WHO, WHERE, WHAT)
(   1,<2007-04-12 11:28:06.29 +100>,<MAYBRIDGE\nmr>,<NMR_250MHZ>,
      <created by zg, POWCHK disabled, PULCHK disabled
       configuration hash MD5:
       49 4B E0 1D 92 C2 6B 37 9F E6 65 BC 52 41 86 1D
       data hash MD5: 64K
       91 0F 78 43 15 8F 2C 61 D7 1E 43 6B E8 18 C8 11>)
(   2,<2007-04-12 11:28:17.78 +100>,<MAYBRIDGE\nmr>,<NMR_250MHZ>,
      <Start of raw data processing
       ef LB = 0.3 FT_mod = 6 PKNL = 1 SI = 32K 
       data hash MD5: 32K
       12 E3 68 E7 D9 4B CB F7 8D 7D 96 10 27 DF 33 9A>)
(   3,<2007-04-12 11:28:19.51 +100>,<MAYBRIDGE\nmr>,<NMR_250MHZ>,
      <apk 
       data hash MD5: 32K
       D3 6D 4C 09 D2 FF 69 37 8D 9E 0B 9D B9 F4 F1 37>)
(   4,<2007-04-12 11:28:20.35 +100>,<MAYBRIDGE\nmr>,<NMR_250MHZ>,
      <abs ABSG = 5 
       data hash MD5: 32K
       2B 35 59 12 29 CE 92 F0 56 79 7C 30 A3 62 AC 11>)
$$ ##END=
$$ 
$$ hash MD5
$$ C1 BC 75 61 42 43 A9 75 6F 3E B1 ED 3B E3 86 57
##$RELAX= 
##$RELAX= 
##$RELAX= 
##$RELAX= 
##$RELAX= 
##$RELAX= 
##$RELAX= 
$$ Bruker specific parameters
$$ --------------------------
##$DU= <C:\u>
##$EXPNO= 1200
##$NAME= <ADRS>
##$PROCNO= 1
##$TYPE= <nmr>
##$USER= <dgb>
##$AMP= (0..31)
100 100 100 100 100 100 100 100 100 100 100 100 100 100 100 100 100 100 
100 100 100 100 100 100 100 100 100 100 100 100 100 100 
##$AQSEQ= 0
##$AQ_mod= 3
##$AUNM= <au_zg>
##$AUTOPOS= <9 >
##$BF1= 250.13
##$BF2= 250.13
##$BF3= 250.13
##$BF4= 250.13
##$BF5= 500.13
##$BF6= 500.13
##$BF7= 500.13
##$BF8= 500.13
##$BYTORDA= 1
##$CFDGTYP= 0
##$CFRGTYP= 5
##$CHEMSTR= <none>
##$CNST= (0..31)
1 1 145 1 1 1 1 1 1 1 1 1 1 1 1 1 1 1 1 1 1 1 1 1 1 1 1 1 1 1 1 1 
##$CPDPRG= <>
##$CPDPRG1= <>
##$CPDPRG2= <>
##$CPDPRG3= <>
##$CPDPRG4= <mlev>
##$CPDPRG5= <mlev>
##$CPDPRG6= <mlev>
##$CPDPRG7= <mlev>
##$CPDPRG8= <mlev>
##$CPDPRGB= <>
##$CPDPRGT= <>
##$D= (0..31)
0 1 0 0 0 0 0 0 0 0.06 0 0 0 0 0 0 0.0002 0 0 0 0 0 0 0 0 0 0 0 0 0 0 
0 
##$DATE= 1176373685
##$DBL= (0..7)
120 120 120 120 120 120 120 120 
##$DBP= (0..7)
150 150 150 150 150 150 150 150 
##$DBP07= 0
##$DBPNAM0= <>
##$DBPNAM1= <>
##$DBPNAM2= <>
##$DBPNAM3= <>
$$ [...]
##$SUBNAM7= <"">
##$SUBNAM8= <"">
##$SUBNAM9= <"">
##$SW= 20.6930455092707
##$SWIBOX= (0..15)
0 0 3 0 0 0 0 0 0 0 0 0 0 0 0 0 
##$SW_h= 5175.983436853
##$TD= 65536
##$TD0= 1
##$TE= 683.16
##$TE2= 300
##$TE3= 300
##$TEG= 300
##$TL= (0..7)
0 120 120 120 120 120 120 120 
##$TP= (0..7)
150 150 150 150 150 150 150 150 
##$TP07= 0
##$TPNAME0= <>
##$TPNAME1= <>
##$TPNAME2= <>
##$TPNAME3= <>
##$TPNAME4= <>
##$TPNAME5= <>
##$TPNAME6= <>
##$TPNAME7= <>
##$TPOAL= (0..7)
0.5 0.5 0.5 0.5 0.5 0.5 0.5 0.5 
##$TPOFFS= (0..7)
0 0 0 0 0 0 0 0 
##$TUNHIN= 0
##$TUNHOUT= 0
##$TUNXOUT= 0
##$USERA1= <user>
##$USERA2= <user>
##$USERA3= <user>
##$USERA4= <user>
##$USERA5= <user>
##$V9= 5
##$VALIST= <valist>
##$VCLIST= <CCCCCCCCCCCCCCC>
##$VD= 0
##$VDLIST= <DDDDDDDDDDDDDDD>
##$VPLIST= <PPPPPPPPPPPPPPP>
##$VTLIST= <TTTTTTTTTTTTTTT>
##$WBST= 1024
##$WBSW= 4
##$XGAIN= (0..3)
0 0 0 0 
##$XL= 0
##$YL= 0
##$YMAX_a= 373273
##$YMIN_a= -331738
##$ZGOPTNS= <>
##$ZL1= 120
##$ZL2= 120
##$ZL3= 120
##$ZL4= 120
##$ABSF1= 16.522
##$ABSF2= -4.171173
##$ABSG= 5
##$ABSL= 3
##$ALPHA= 0
##$AQORDER= 0
##$ASSFAC= 0
##$ASSFACI= 0
##$ASSFACX= 0
##$ASSWID= 0
##$AUNMP= <proc_1d>
##$AZFE= 0.1
##$AZFW= 0.1
##$BCFW= 0
##$BC_mod= 0
##$BYTORDP= 0
##$COROFFS= 0
##$CY= 12.5
##$DATMOD= 1
##$DC= 0
##$DFILT= <>
##$DTYPP= 0
##$F1P= 14.0000005364418
##$F2P= -0.99999901652339
##$FCOR= 0.5
##$FTSIZE= 32768
##$FT_mod= 6
##$GAMMA= 0
##$GB= 0
##$INTBC= 1
##$INTSCL= 1
##$ISEN= 128
##$LB= 0.3
##$LEV0= 0
##$LPBIN= 0
##$MAXI= 10000
##$MC2= 0
##$MEAN= 0
##$ME_mod= 0
##$MI= 0
##$NCOEF= 0
##$NC_proc= -3
##$NLEV= 6
##$NOISF1= 0
##$NOISF2= 0
##$NSP= 0
##$NTH_PI= 0
##$NZP= 0
##$OFFSET= 16.522
##$PC= 1
##$PHC0= 233.425
##$PHC1= 4.856421
##$PH_mod= 1
##$PKNL= yes
##$PPARMOD= 0
##$PSCAL= 4
##$PSIGN= 0
##$REVERSE= no
##$SF= 250.13
##$SI= 32768
##$SIGF1= 0
##$SIGF2= 0
##$SINO= 400
##$SIOLD= 32768
##$SREGLST= <1H.CDCl3>
##$SSB= 0
##$STSI= 32768
##$STSR= 0
##$SW_p= 5175.98343685301
##$SYMM= 0
##$S_DEV= 0
##$TDeff= 65536
##$TDoff= 0
##$TI= <Analysis number 999999
Compound Code 99
Book Reference 9
Project Code 9>
##$TILT= no
##$TM1= 0
##$TM2= 0
##$TOPLEV= 0
##$USERP1= <user>
##$USERP2= <user>
##$USERP3= <user>
##$USERP4= <user>
##$USERP5= <user>
##$WDW= 1
##$XDIM= 32768
##$YMAX_p= 401028823
##$YMIN_p= -124033
$$ End of Bruker specific parameters
$$ ---------------------------------
##NTUPLES= NMR SPECTRUM
##VAR_NAME=  FREQUENCY,     SPECTRUM/REAL,   SPECTRUM/IMAG
##SYMBOL=    X,             R,               I
##VAR_TYPE=  INDEPENDENT,   DEPENDENT,       DEPENDENT
##VAR_FORM=  AFFN,          ASDF,            ASDF
##VAR_DIM=   32768,         32768,           32768
##UNITS=     HZ,            ARBITRARY UNITS, ARBITRARY UNITS
##FACTOR=    0.157963299565203, 1,           1
##FIRST=     4132.6476996994, 0,             0
##LAST=      -1043.33573715361, 0,           0
##MIN=       -1043.33573715361, -124033,     0
##MAX=       4132.6476996994, 401028823,     0
$$ Real data points
##PAGE= N=1
##DATA TABLE= (X++(R..R)), XYDATA
$$ [...]
$$ plain form
14724 25585 53326 70887 55991 24961 22430 31462 16626 18307 13343 -1968 -3309 21481 40331
14711 40331 32554 35730 21033 20344 17487 12758 15424 39802 19282 4996 16812 34099 53565
14698 53565 66466 60986 57036 47938 20263 11103 -12591 -27439 -8742 31712 77222 77738 33772
14685 33772 36401 56973 36305 37047 43379 6668 -9558 96 19799 42530 62226 74175 75271
14672 75271 37382 29898 32004 23499 35395 28464 22789 26597 21170 31436 47362 75905 81579
14659 81579 75582 96932 82002 49043 34990 45770 37012 36514 15231 8342 14263 26453 58496
14646 58496 53203 15204 6172 12762 21243 7408 5467 10594 4722 26428 30284 51983 34244
14633 34244 29338 45194 80115 76956 63396 63710 87186 79214 92401 87482 88745 64301 90721
$$ packed form
14724B5585K7741J7561j4896l1030k531R032j4836J681m964j5311j341K4790J8850
14711D0331p777L176j4697o89k857m729K666K4378k0520j4286J1816J7287J9466
14698E3565J2901n480l950r098k7675r160k3694j4848J8697M0454M5510N16m3966
14685C3772K629K0572k0668P42O332l6711j6226R654J9703K2731J9696J1949J096
14672G5271l7889p484K106q505J1896o931n675L808n427J0266J5926K8543N674
14659H1579n997K1350j4930l2959j4053J0780q758m98k1283o889N921J2190L2043
14646E8496n293l7999r032O590Q481j3835j941N127n872K1706L856K1699j7739
14633C4244m906J5856L4921l159j3560L14K3476p972J3187m919J263k4444K6420
$$ plain form
14620 90721 114168 88288 80203 88306 87444 55960 32909 39495 35845 13185 41786 60506 46114
14607 46114 58944 65576 83926 79754 74791 71316 82642 76962 61344 77033 81548 71785 66751
14594 66751 61935 33960 35533 48439 61250 65820 52483 58483 28877 37281 46960 90094 91730
14581 91730 79247 95246 129069 127831 103200 65238 40562 33091 13406 26160 51445 66697
14569 66697 98894 113336 128395 142964 142262 136329 120347 104103 101103 124212 106707 84651
14557 84651 55763 74304 107149 106807 96942 73152 63720 80759 75307 35531 79613 87308 99119
14544 99119 112698 102897 80343 93377 98964 87862 92726 99365 114016 124287 112501 119538 91125
14531 91125 56881 52918 88026 111956 116455 119343 124927 131458 150995 139583 120684 99223 45931
$$ packed form
14620I0721K3447k5880q085Q103q62l1484k3051O586l650k2660K8601J8720j4392
14607D6114J2830O632J8350m172m963l475J1326n680j5618J5689M515r763n034
14594F6751m816k7975J573J2906J2811M570j3337O000k9606Q404R679M3134J636
14581I1730j2483J5999L3823j238k4631l7962k4676p471j9685J2754K5285J5252
14569F6697L2197J4442J5059J4569p02n933j5982j6244l000K3109j7505k2056
14557H4651k8888J8541L2845l42r865k3790r432J7039n452l9776M4082P695J1811
14544I9119J3579r801k2554J3034N587j1102M864O639J4651J0271j1786P037k8413
14531I1125l4244l963L5108K3930M499K888N584O531J9537j1412j8899k1461n3292
$$ plain form
14518 45931 61220 90977 117978 136428 151749 147854 142832 158566 173491 184121 171398 165989
14506 165989 190611 213004 198887 172230 169241 135703 134090 166468 192895 226314 242777 261517
14494 261517 250916 220383 208472 207597 235418 241076 267114 303039 288365 283487 272047 293429
14482 293429 333820 363700 336505 314222 317929 320758 300229 298843 287872 291376 280213 267289
14470 267289 255553 247118 258158 271678 284297 294929 298851 295468 271961 230646 229440 260703
14458 260703 282808 293251 297107 304261 340070 347330 344620 360582 373023 413056 450050 464868
14446 464868 462567 461686 459592 443132 395896 387505 415316 385916 356058 340453 352955 386989
14434 386989 382877 362255 363218 354490 343011 337698 361054 364697 373529 375721 411976 417803 419745
$$ packed form
14518D5931J5289K9757K7001J8450J5321l895n022J5734J4925J0630j2723n409
14506A65989K4622K2393j4117k6657k989l3538j613L2378K6427L3419J6463J8740
14494B61517j0601l0533j1911q75K7821N658K6038L5925j4674m878j1440K1382
14482B93429M0391K9880k7195k2283L707K829k0529j386j0971L504j1163j2924
14470B67289j1736q435J1040J3520J2619J0632L922l383k3507m1315j206L1263
14458B60703K2105J0443L856P154L5809P260k710J5962J2441M0033L6994J4818
14446D64868k301q81k094j6460m7236q391K7811k9400k9858j5605J2502L4034
14434C86989m112k0622R63q728j1479n313K3356L643Q832K192L6255N827J942
$$ plain form
14421 419745 397865 377961 372430 372293 370089 384249 435472 424592 425415 454161 452639 441680 490451
14408 490451 512849 499544 490110 510667 484976 503737 524109 545791 572974 549812 544680 542621
14396 542621 580044 584813 566723 586982 605053 607869 613673 615434 630512 645536 669171 686099
14384 686099 672506 683465 702325 688050 703450 721067 724792 755214 762178 762440 791771 815725
14372 815725 830521 842772 865563 914719 910118 919443 952660 972474 992787 1025626 1061845 1084657
14360 1084657 1084726 1096487 1117555 1135488 1182351 1205364 1235712 1257500 1302171 1315894 1346704 1366793
14348 1366793 1394229 1402061 1427616 1451189 1467024 1484060 1503351 1552530 1581676 1609160 1657210
14337 1657210 1706838 1779948 1816702 1832219 1868582 1899151 1892754 1938481 1991929 2019581 2040264
$$ packed form
14421D19745k1880j9904n531j37k204J4160N1223j0880Q23K8746j522j0959M8771
14408D90451K2398j3305r434K0557k5691J8761K0372K1682K7183k3162n132k059
14396E42621L7423M769j8090K0259J8071K816N804J761J5078J5024K3635J6928
14384F86099j3593J0959J8860j4275J5400J7617L725L0422O964K62K9331K3954
14372H15725J4796J2251K2791M9156m601R325L3217J9814K0313L2839L6219K2812
14360A084657O9J1761K1068J7933M6863K3013L0348K1788M4671J3723L0810K0089
14348A366793K7436P832K5555K3573J5835J7036J9291M9179K9146K7484M8050
14337A657210M9628P3110L6754J5517L6363L0569o397M5727N3448K7652K0683
$$ plain form
14326 2040264 2102985 2165997 2194720 2245756 2274070 2298826 2333562 2360924 2389966 2443336 2478189
14315 2478189 2485206 2522386 2553674 2605171 2631555 2675589 2731508 2770519 2801718 2842548 2859802
14304 2859802 2900595 2943386 2982991 3013411 3027234 3030353 3070602 3115863 3134192 3141261 3164161 3217612
14292 3217612 3261194 3313994 3341812 3358121 3346958 3355213 3402947 3452564 3456085 3431397 3471938 3493943
14280 3493943 3534059 3542224 3513235 3524824 3543072 3508705 3480405 3504888 3528704 3565621 3563818 3549042
14268 3549042 3537136 3502898 3485313 3477273 3473864 3497137 3520500 3529832 3493587 3464747 3456660 3447900
14256 3447900 3414373 3397127 3384005 3376817 3358812 3307186 3299938 3292707 3273467 3242259 3243510 3213869
14244 3213869 3182679 3180817 3139315 3084324 3062441 3058237 3047333 2997992 2953174 2913644 2864677 2819494
$$ packed form
14326B040264O2721O3012K8723N1036K8314K4756L4736K7362K9042N3370L4853
14315B478189P017L7180L1288N1497K6384M4034N5919L9011L1199M0830J7254
14304B859802M0793M2791L9605L0420J3823L119M0249M5261J8329P069K2900N3451
14292C217612M3582N2800K7818J6309j1163Q255M7734M9617L521k4688M0541K2005
14280C493943M0116Q165k8989J1589J8248l4367k8300K4483K3816L6917j803j4776
14268C549042j1906l4238j7585q040l409K3273K3363R332l6245k8840q087q760
14256C447900l3527j7246j3122p188j8005n1626p248p231j9240l1208J251k9641
14244C213869l1190j862m1502n4991k1883m204j0904m9341m4818l9530m8967m5183
$$ plain form
14232 2819494 2808918 2775244 2742251 2752715 2768788 2752990 2700009 2652653 2609173 2583577 2523724
14221 2523724 2478190 2419869 2372642 2370864 2346810 2319825 2288622 2267955 2222578 2176005 2169007 2150469
14209 2150469 2087919 2043126 2028690 2018104 1992723 1990496 1980849 1942406 1916344 1880191 1846520 1851820
14197 1851820 1854332 1793185 1740640 1736214 1722855 1710401 1703606 1683317 1656006 1647620 1657803 1659935
14185 1659935 1631737 1561421 1512296 1503638 1511610 1510688 1501880 1489060 1480171 1481312 1463965 1451045 1442807
14172 1442807 1438223 1406178 1408961 1397302 1376471 1395509 1375110 1346131 1338681 1341939 1313302 1262240
14160 1262240 1262805 1256032 1244632 1223973 1199560 1138995 1119643 1101988 1095942 1101948 1104539 1090884
14148 1090884 1054860 1045375 1050015 1092664 1112540 1111817 1081822 1055037 1058822 1034126 1012678 1038450
$$ packed form
14232B819494j0576l3674l2993J0464J6073j5798n2981m7356m3480k5596n9853
14221B523724m5534n8321m7227j778k4054k6985l1203k0667m5377m6573o998j8538
14209B150469o2550m4793j4436j0586k5381k227r647l8443k6062l6153l3671N300
14197A851820K512o1147n2545m426j3359j2454o795k0289k7311q386J0183K132
14185A659935k8198p0316m9125q658P972r22q808j2820q889J141j7347j2920q238
14172A442807m584l2045K783j1659k0831J9038k0399k8979p450L258k8637n1062
14160A262240N65o773j1400k0659k4413o0565j9352j7655o046O006K591j3655
14148A090884l6024r485M640M2649J9876p23k9995k6785L785k4696k1448K5772
$$ plain form
14136 1038450 1048655 1018293 996087 1011421 1022969 1006937 1008466 996388 991905 981308 976366 976442
14124 976442 943697 939167 910876 872131 865921 836136 803144 817482 814889 776009 759718 737557
14112 737557 752587 759957 780897 799455 790919 769031 753853 759277 750776 746206 751608 754518 787269
14099 787269 796196 803453 803854 789418 777756 779724 732113 717746 754646 762409 767034 790812 802914
14086 802914 817953 825340 806486 797258 780690 811793 854231 879949 891420 924133 942884 955500
14074 955500 968152 1007614 1056522 1112523 1130385 1164278 1237989 1274481 1331769 1392353 1476469
14063 1476469 1570339 1675644 1796770 1933000 2100210 2324427 2564923 2796248 3065609 3393684
14053 3393684 3790068 4230321 4747570 5364277 6108862 6970165 7982458 9245133 10794318
$$ packed form
14136A038450J0205l0362k2206J5334J1548j6032J529j2078m483j0597m942P6
14124I76442l2745m530k8291l8745o210k9785l2992J4338k593l8880j6291k2161
14112G37557J5030P370K0940J8558q536k1888j5178N424q501m570N402K910L2751
14099G87269Q927P257M01j4436j1662J968m7611j4367L6900P763M625K3778J2102
14086H02914J5039P387j8854r228j6568L1103M2438K5718J1471L2713J8751J2616
14074I55500J2652L9462M8908N6001J7862L3893P3711L6492N7288O0584Q4116
14063A476469R3870J05305J21126J36230J67210K24217K40496K31325K69361L28075
14053C393684L96384M40253N17249O16707P44585Q61303J012293J262675J549185
$$ plain form
14044 10794318 12615445 14726942 17109450 19663085 22322943 24857109 27052446 28674759
14036 28674759 29656415 29876667 29320975 28069376 26240377 24101205 21863074 19664244
14028 19664244 17684590 15966860 14560085 13433866 12552797 11890958 11402249 11000066 10711191
14019 10711191 10539223 10442714 10439060 10498795 10671325 10971913 11355781 11833838 12460679 13256603
14009 13256603 14278214 15552236 17113230 18950964 21034886 23304595 25618011 27828781
14001 27828781 29715998 31094738 31799208 31702510 30810162 29236183 27079457 24597840 21986396
13992 21986396 19423872 17108579 15072520 13337571 11923873 10809609 9898227 9135953
13984 9135953 8504960 7964413 7475993 7050512 6669677 6328510 6006670 5743408 5489138
$$ packed form
14044A0794318J821127K111497K382508K553635K659858K534166K195337J622313
14036B8674759R81656K20252n55692j251599j828999k139172k238131k198830
14028A9664244j979654j717730j406775j126219q81069o61839m88709m02183k88875
14019A0711191j71968r6509l654N9735J72530L00588L83868M78057O26841P95924
14009A3256603J021611J274022J560994J837734K083922K269709K313416K210770
14001B7828781J887217J378740P04470r6698q92348j573979k156726k481617k611444
13992B1986396k562524k315293k036059j734949j413698j114264r11382p62274
13984I135953o30993n40547m88420m25481l80835l41167l21840k63262k54270
$$ plain form
13975 5489138 5277763 5078110 4878308 4676747 4495394 4327308 4181795 4042364 3932016
13966 3932016 3835919 3732078 3662111 3623157 3568506 3469192 3411914 3363002 3301672 3221021 3181870
13955 3181870 3131464 3077509 3041187 2996888 2931070 2893301 2881651 2811570 2733004 2727113 2724427 2695616
13943 2695616 2652416 2613567 2579669 2486922 2433874 2410879 2374185 2375346 2346169 2314142 2256510
13932 2256510 2237272 2236645 2254889 2238861 2194422 2179921 2178715 2151352 2109882 2106815 2079830 2074048
13920 2074048 2051402 2038619 2034760 2038453 2039418 2016370 2003826 1945333 1919679 1916940 1891447 1846298
13908 1846298 1811393 1761883 1702841 1684464 1618120 1560218 1519364 1495998 1454933 1414027 1399385
13897 1399385 1387587 1386583 1376282 1333142 1293754 1291904 1284892 1239497 1188849 1172627 1171343 1162880
$$ packed form
13975E489138k11375j99653j99802k01561j81353j68086j45513j39431j10348
13966C932016r6097j03841o9967l8954n4651r9314n7278m8912o1330q0651l9151
13955C181870n0406n3955l6322m4299o5818l7769j1650p0081p8566n891k686k8811
13943B695616m3200l8849l3898r2747n3048k2995l6694J161k9177l2027n7632
13932B256510j9238o27J8244j6028m4439j4501j206k7363m1470l067k6985n782
13920B074048k2646j2783l859L693R65k3048j2544n8493k5654k739k5493m5149
13908A846298l4905m9510n9042j8377o6344n7902m0854k3366m1065m0906j4642
13897A399385j1798j004j0301m3140l9388j850p012m5395n0648j6222j284q463
$$ plain form
13885 1162880 1115236 1082975 1078515 1051510 1043860 1055864 1072137 1066028 1056943 1034585 1015837 1016563
13873 1016563 975825 920732 910300 908174 894159 865810 851139 816830 817373 807613 779983 773906
13861 773906 753865 735837 710706 706327 668425 631263 620246 630960 634016 595610 570304 538799
13849 538799 538698 556749 559730 556689 566228 551534 555495 510047 494023 481676 503459 523817 512661
13836 512661 506992 494835 500530 522585 523300 488450 477763 472900 444696 435604 423656 444438 472012
13823 472012 464380 479200 486562 517924 467015 414657 394654 391603 395160 387725 380679 372142 355775
13810 355775 356223 378534 381613 399199 420232 428544 436625 402243 407553 416092 395597 398646 388573
13797 388573 392712 391772 394816 408026 380076 387039 423364 417415 385307 421386 437167 383620 353403
$$ packed form
13885A162880m7644l2261m460k7005p650J2004J6273o109r085k2358j8748P26
13873A016563m0738n5093j0432k126j4015k8349j4671l4309N43r760k7630o077
13861G73906k0041j8028k5131m379l7902l7162j1017J0714L056l8406k5306l1505
13849E38799j01J8051K981l041R539j4694L961m5448j6024j2347K1783K0358j1156
13836E12661n669j2157N695K2055P15l4850j0687m863k8204r092j1948K0782K7574
13823D72012p632J4820P362L1362n0909n2358k0003l051L557p435p046q537j6367
13810C55775M48K2311L079J7586K1033Q312Q081l4382N310Q539k0495L049j0073
13797C88573M139r40L044J3210k7950O963L6325n949l2108L6079J5781n3547l0217
$$ plain form
13784 353403 365016 376402 370251 366043 352988 329445 297844 310382 312843 329208 345204 362511
13772 362511 384003 385998 351786 323449 336088 333274 333250 356826 358925 336845 331951 332950 325669
13759 325669 327545 342263 325138 320922 297958 286605 272756 243766 253732 266550 294354 308665
13747 308665 284971 246012 237754 254071 267840 232979 263310 270729 256218 247542 236727 259338
13735 259338 271494 283693 251454 210893 201189 189364 178846 162785 169043 190239 194331 208956
13723 208956 238389 231068 224424 248441 239280 218251 210721 206537 220197 221402 207984 224450 228668
13710 228668 209011 184829 164303 165098 171321 189406 168814 184078 198523 189645 189071 201694 201474
13697 201474 182319 182355 170968 158536 150171 159947 187937 172641 146715 145634 151206 159100 159334
$$ packed form
13784C53403J1613J1386o151m208j3055k3543l1601J2538K461J6365J5996J7307
13772C62511K1492J995l4212k8337J2639k814k4K3576K099k2080m894R99p281
13759C25669J876J4718j7125m216k2964j1353j3849k8990R966J2818K7804J4311
13747C08665k3694l8959q258J6317J3769l4861L0331P419j4511q676j0815K2611
13735B59338J2156J2199l2239m0561r704j1825j0518j6061O258K1196M092J4625
13723B08956K9433p321o644K4017r161k1029p530m184J3660J205j3418J6466M218
13710B28668j9657k4182k0526P95O223J8085k0592J5264J4445q878n74J2623k20
13697B01474j9155L6j1387j2432q365R776K7990j5296k5926j081N572P894K34
$$ plain form
13684 159334 168120 169358 157032 151920 139701 144188 164386 165161 137953 154438 185542 186013 181088
13671 181088 165074 157154 148961 136289 149998 170327 185582 159377 108834 78385 73025 116124
13659 116124 139328 151702 160110 167597 163579 178411 188350 179850 178886 207482 185914 169669 129697
13646 129697 120495 145414 184347 198580 201727 185709 184774 188678 173105 184815 159934 146750
13634 146750 137414 133473 137695 115700 100836 124975 135562 130556 124763 132476 170130 196015 204701
13621 204701 210393 183965 165898 160448 121685 112972 127526 154355 158647 141341 117398 125084
13609 125084 146758 171891 176216 173755 204492 229997 222312 209463 209143 205458 204578 177903 200075
13596 200075 238541 234970 237782 231412 246575 241053 233671 257304 304833 344197 342493 334587 329319
$$ packed form
13684A59334Q786J238j2326n112j2219M487K0198P75k7208J6485L1104M71m925
13671A81088j6014p920q193j2672J3709K0329J5255k6205n0543l0449n360M3099
13659A16124K3204J2374Q408P487m018J4832R939q500r64K8596k1568j6245l9972
13646A29697r202K4919L8933J4233L147j6018r35L904j5573J1710k4881j3184
13634A46750r336l941M222k1995j4864K4139J0587n006n793P713L7654K5885Q686
13621B04701N692k6428j8067n450l8763q713J4554K6829M292j7306k3943P686
13609A25084K1674K5133M325k461L0737K5505p685j2849l20l685q80k6675K2172
13596B00075L8466l571K812o370J5163n522p382K3633M7529L9364j704p906n268
$$ plain form
13583 329319 356358 393990 410239 417216 433221 423769 406490 394780 384371 370265 361729 407632
13571 407632 424167 384562 351004 300687 303485 326091 339066 339810 361107 356570 364107 346945
13559 346945 348349 343854 332860 309694 305555 312687 343368 355726 359391 380546 427957 463985
13547 463985 474156 501655 499716 490509 506409 531533 517777 467663 419745 432195 429665 429453
13535 429453 444902 452063 452381 426803 417250 400287 399079 402724 398803 400436 395304 379090 375334
13522 375334 390255 401804 372791 360713 389116 398005 431014 459111 454313 427862 416067 456090
13510 456090 487568 497094 522926 540413 522908 507468 498719 519033 506114 515611 551905 597527
13498 597527 644344 673380 692206 691674 690020 731397 764444 790728 849881 862598 881926 910670
$$ packed form
13583C29319K7039L7632J6249O977J6005r452j7279j1710j0409j4106q536M5903
13571D07632J6535l9605l3558n0317K798K2606J2975P44K1297m537P537j7162
13559C46945J404m495j0994k3166m139P132L0681J2358L665K1155M7411L6028
13547D63985J0171K7499j939r207J5900K5124j3756n0114m7918J2450k530k12
13535D29453J5449P161L18k5578r553j6963j208L645l921J633n132j6214l756
13522C75334J4921J1549k9013j2078K8403Q889L3009K8097m798k6451j1795M0023
13510D56090L1478R526K5832J7487j7505j5440q749K0314j2919R497L6294M5622
13498E97527M6817K9036J8826n32j654M1377L3047K6284N9153J2717J9328K8744
$$ plain form
13486 910670 941687 1018907 1074607 1139843 1216032 1258583 1304689 1386519 1454515 1511315 1596434
13475 1596434 1681616 1754352 1870690 1986566 2095296 2268525 2472394 2667131 2877880 3093378
13465 3093378 3358051 3620341 3878952 4182020 4547050 4920885 5327310 5767076 6254591
13456 6254591 6811468 7438818 8105071 8795006 9554664 10357428 11169554 12039127 12916310
13447 12916310 13791166 14630254 15391620 16065810 16667089 17111656 17405070 17576087 17599842
13438 17599842 17442153 17166878 16806209 16345054 15813025 15295088 14776005 14246611 13743532
13429 13743532 13294163 12927775 12563849 12240409 11986041 11825140 11740021 11683150 11679897 11725181
13419 11725181 11849655 12054226 12359511 12668841 13029684 13448455 13934221 14472065 15056203
$$ packed form
13486I10670L1017P7220N5700O5236P6189M2551M6106Q1830O7996N6800Q5119
13475A596434Q5182P2736J16338J15876J08730J73229K03869J94737K10749K15498
13465C093378K64673K62290K58611L03068L65030L73835M06425M39766M87515
13456F254591N56877O27350O66253O89935P59658Q02764Q12126Q69573Q77183
13447A2916310Q74856Q39088P61366O74190O01279M44567K93414J71017K3755
13438A7599842j57689k75275l60669m61155n32029n17937n19083n29394n03079
13429A3743532m49369l66388l63926l23440k54368j60901q5119n6871l253M5284
13419A1725181J24474K04571L05285L09330L60843M18771M85766N37844N84138
$$ plain form
13410 15056203 15622741 16175323 16738429 17227837 17700202 18070066 18270150 18300504 18211751 18028459
13400 18028459 17698859 17300042 16804713 16227707 15575349 14879808 14200922 13515585 12876421
13391 12876421 12265677 11701070 11191392 10661218 10171473 9695686 9262624 8848143 8502920
13382 8502920 8185726 7876592 7546899 7276326 7022979 6775000 6537750 6334484 6149044
13373 6149044 5929744 5739043 5606764 5473324 5343892 5220917 5075888 4944251 4799193
13364 4799193 4697581 4582963 4495779 4425529 4318171 4227412 4138651 4036488 3950728 3880942
13354 3880942 3817602 3737113 3642660 3531406 3452553 3396956 3342952 3269123 3237851 3221921 3207528
13343 3207528 3187397 3130172 3047090 2961566 2891318 2835596 2802849 2758071 2725877 2690587 2646220
$$ packed form
13410A5056203N66538N52582N63106M89408M72365L69864K00084L0354q8753j83292
13400A8028459l29600l98817m95329n77006o52358o95541o78886o85337o39164
13391A2876421o10744n64607n09678n30174m89745m75787m33062m14481l45223
13382H502920l17194l09134l29693k70573k53347k47979k37250k03266j85440
13373F149044k19300j90701j32279j33440j29432j22975j45029j31637j45058
13364D799193j01612j14618q7184p0250j07358r0759q8761j02163q5760o9786
13354C880942o3340q0489r4453j11254p8853n5597n4004p3829l1272j5930j4393
13343C207528k0131n7225q3082q5524p0248n5722l2747m4778l2194l5290m4367
$$ plain form
13332 2646220 2584187 2552092 2520153 2479805 2432352 2409585 2409395 2393867 2369292 2346974 2318448 2298584
13320 2298584 2268407 2222161 2154163 2110290 2082432 2054318 2000939 1932210 1912636 1917535 1886195
13309 1886195 1846381 1806580 1774255 1739067 1714918 1665845 1619313 1581511 1526755 1478186 1426533
13298 1426533 1401151 1378795 1365820 1362270 1372313 1312036 1259466 1234816 1226099 1208932 1162331 1108705
13286 1108705 1056992 1059770 1061898 1047692 1039286 1000794 960487 929446 914759 905532 901724 882748
13274 882748 853601 838794 800640 773578 785271 772716 741056 734464 689845 671803 662794 673260
13262 673260 674659 642266 632318 626866 639238 595613 564769 546715 502139 502506 488808 477614
13250 477614 490495 503425 487813 488759 494910 494487 458406 403354 374030 375255 413187 391719 361182
$$ packed form
13332B646220o2033l2095l1939m0348m7453k2767j90j5528k4575k2318k8526j9864
13320B298584l0177m6246o7998m3873k7858k8114n3379o8729j9574M899l1340
13309A886195l9814l9801l2325l5188k4149m9073m6532l7802n4756m8569n1653
13298A426533k5382k2356j2975l550J0043o0277n2570k4650q717j7167m6601n3626
13286A108705n1713K778K128j4206q406l8492m0307l1041j4687r227l808j8976
13274H82748k9147j4807l8154k7062J1693j2555l1660o592m4619j8042r009J0466
13262F73260J399l2393r948n452J2372m3625l0844j8054m4576L67j3698j1194
13250D77614J2881J2930j5612R46O151m23l6081n5052k9324J225L7932k1468l0537
$$ plain form
13237 361182 346494 333932 332175 326998 317827 331581 325140 362263 391906 373041 330202 300645
13225 300645 274939 271067 277808 266042 239584 208542 237668 262744 276965 284892 271339 262617
13213 262617 269071 298123 328188 324936 323581 297982 274989 289992 274991 276566 265391 273836
13201 273836 292877 272404 239816 255263 255411 245357 256710 279882 281278 255219 234828 276490
13189 276490 287004 248988 209289 222605 249881 260625 235218 231301 226733 214774 232749 242881
13177 242881 201630 180511 215194 236338 251010 263381 264929 246232 251774 270031 285181 273384
13165 273384 223559 186536 199103 195525 185730 184732 168919 186530 207347 209980 179437 206680
13153 206680 202278 183140 184471 164439 146475 131487 126383 156666 193004 179923 145943 121325
$$ packed form
13237C61182j4688j2562j757n177r171J3754o441L7123K9643j8865m2839k9557
13225C00645k5706l872O741j1766k6458l1042K9126K5076J4221P927j3553q722
13213B62617O454K9052L0065l252j355k5599k2993J5003j5001J575j1175Q445
13201B73836J9041k0473l2588J5447J48j0054J1353K3172J396k6059k0391M1662
13189B76490J0514l8016l9699J3316K7276J0744k5407l917m568j1959J7975J0132
13177B42881m1251k1119L4683K1144J4672J2371J548j8697N542J8257J5150j1797
13165B73384m9825l7023J2567l578r795r98j5813J7611K0817K633l0543K7243
13153B06680m402j9138J331k0032j7964j4988n104L0283L6338j3081l3980k4618
$$ plain form
13141 121325 120727 121707 117146 126650 166443 160889 146002 143496 142896 129738 160399 171544 142037
13128 142037 114850 134775 175391 186683 187533 163234 165769 150075 126770 115069 137794 168836
13116 168836 147763 101764 103254 106038 133238 149842 152298 152013 144484 154795 137157 135267 123251
13103 123251 101412 69843 55368 88780 93011 51112 20616 34585 71088 105679 138680 157104
13091 157104 140862 135976 104909 81166 75753 86490 113896 100747 77342 87416 69597 69280
13079 69280 62497 42505 55219 62551 61341 44994 49087 86405 123853 109167 108216 98886 89793
13066 89793 120242 124934 92683 89073 88067 113282 123011 105843 91238 75886 97521 77407
13054 77407 65525 55034 82007 102702 105388 71506 61884 74277 65055 91845 94779 80060
$$ packed form
13141A21325n98R80m561R504L9793n554j4887k506o00j3158L0661J1145k9507
13128A42037k7187J9925M0616J1292Q50k4299K535j5694k3305j1701K2725L1042
13116A68836k1073m5999J490K784K7200J6604K456k85p529J0311j7638j890j2016
13103A23251k1839l1569j4475L3412M231m1899l0496J3969L6503L4591L3001J8424
13091A57104j6242m886l1067k3743n413J0737K7406j3149k3405J0074j7819l17
13079F9280o783j9992J2714P332j210j6347M093L7318L7448j4686r51r330r093
13066H9793L0449M692l2251l610j006K5215R729j7168j4605j5352K1635k0114
13054G7407j1882j0491K6973K0695K686l3882r622J2393r222K6790K934j4719
$$ plain form
13042 80060 69941 79763 110026 115562 55053 41605 50214 33102 45429 46569 36049 74965
13030 74965 80731 83358 73828 65536 54882 57111 53970 85769 125087 98422 98870 98383 79651 93163
13016 93163 96922 98352 108167 87302 113118 159123 176207 171392 174366 158837 150613 155691 173756
13003 173756 173232 155537 132442 134679 166404 167997 153126 144468 168513 164374 144605 153725 139401
12990 139401 116161 117626 112598 118220 139988 155451 151863 111254 114211 127626 126828 118914 125411
12977 125411 132209 136837 95070 43043 26689 36168 54556 60689 95004 111674 115921 137318
12965 137318 167958 177816 174522 171079 151249 132929 142733 141801 155683 170792 145627 112552 111932
12952 111932 139649 107813 110138 114253 101010 97377 111835 106274 71483 49891 60436 60231 71256
$$ packed form
13042H0060j0119R822L0263N536o0509j3448Q609j7112J2327J140j0520L8916
13030G4965N766K627r530q292j0654K229l141L1799L9318k6665M48m87j8732J3512
13016I3163L759J430R815k0865K5816M6005J7084m815K974j5529q224N078J8065
13003A73756n24j7695k3095K237L1725J593j4871q658K4045m139j9769R120j4324
12990A39401k3240J465n028N622K1768J5463l588m0609K957J3415p98p914O497
12977A25411O798M628m1767n2027j6354R479J8388O133L4315J6670M247K1397
12965A37318L0640R858l294l443j9830j8320R804r32J3882J5109k5165l3075o20
12952A11932K7717l1836K325M115j3243l633J4458n561l4791k1592J0545k05J1025
$$ plain form
12939 71256 95428 96984 71445 55483 60376 87431 73906 58533 53818 57769 87830 89101 73993
12926 73993 78926 112086 115536 105852 98566 66397 64864 59619 51629 63412 92617 71571 45863
12913 45863 23252 31649 37484 37875 43566 65064 63111 35710 49432 48956 8790 46661 47783
12900 47783 47586 80874 97291 94986 71249 70544 66237 79623 113495 115239 97189 72516 49766
12887 49766 53589 75038 85764 86288 89514 79709 63309 66285 93730 92135 84599 82064 67867
12874 67867 29919 28106 70114 51179 43622 70002 75289 104908 128265 118489 102737 103286 85477
12861 85477 69612 52925 32514 41004 58053 60762 26049 5920 24265 37308 27036 67988
12849 67988 97207 92289 72840 46285 52064 28221 -18202 -17553 12937 15093 35001 46726 41357
$$ packed form
12939G1256K4172J556k5539j5962M893K7055j3525j5373m715L951L0061J271j5108
12926G3993M933L3160L450r684p286l2169j533n245p990J1783K9205k1046k5708
12913D5863k2611Q397N835L91N691K1498j953k7401J3722m76m0166L7871J122
12900D7783j97L3288J6417k305k3737p05m307J3386L3872J744j8050k4673k2750
12887D9766L823K1449J0726N24L226r805j6400K976K7445j595p536k535j4197
12874F7867l7948j813M2008j8935p557K6380N287K9619K3357r776j5752N49j7809
12861H5477j5865j6687k0411Q490J7049K709l4713k0129J8345J3043j0272M0952
12849F7988K9219m918j9449k6555N779k3843m6423O49L0490K156J9908J1725n369
$$ plain form
12836 41357 19668 1459 1904 22390 25611 29965 18628 -1893 -23507 -27520 -41267 -47094 -42572
12823 -42572 -35115 -3633 16938 6209 -17818 14707 46073 70950 68857 54329 23319 13227
12811 13227 44026 60515 65920 45053 40421 31529 22886 26932 18370 8514 30421 54441 66340
12798 66340 89111 86085 66787 75938 106881 112253 61081 19873 36343 48956 17001 -10351
12786 -10351 2861 36424 7242 -26049 -30012 -23776 -1604 29793 43590 44004 25763 14282
12774 14282 -11765 -26453 -43494 -85525 -40987 6096 34439 49177 47704 51716 49845 10769
12762 10769 -5397 -5458 -15522 -7577 -18716 -27467 -31056 -12566 -16489 5645 20123 36768 39030
12749 39030 13095 10428 45917 45936 56493 59515 51808 40037 52545 54583 31901 10521 12479
$$ packed form
12836D1357k1689j8209M45K0486L221M354j1337k0521k1614m013j3747n827M522
12823d2572P457L1482K0571j0729k4027L2525L1366K4877k093j4528l1010j0092
12811A3227L0799J6489N405k0867m632q892q643M046q562r856K1907K4020J1899
12798F6340K2771l026j9298R151L0943N372n1172m1208J6470J2613l1955k7352
12786a0351J3212L3563k9182l3291l963O236K2172L1397J3797M14j8241j1481
12774A4282k6047j4688j7041m2031M4538M7083K8343J4738j473M012j871l9076
12762A0769j6166o1j0064P945j1139q751l589J8490l923K2134J4478J6645K262
12749C9030k5935k667L5489J9J0557L022p707j1771J2508K038k2682k1380J958
$$ plain form
12736 12479 -11982 -7653 -5039 32211 56265 55865 28280 -11270 8639 52993 68166 67515 58657
12723 58657 48960 46356 36691 23065 25685 19218 42737 65204 98329 52490 10732 -2066 19405
12710 19405 27273 44266 51326 54695 29693 2221 -8472 -751 16679 46529 41327 35540 68114
12697 68114 80820 41392 51581 83059 88584 91805 88187 70713 64883 65808 56757 55764 31455
12684 31455 13625 6958 2452 -1736 -16902 15826 27246 19469 34332 69491 85782 80934 65606
12671 65606 50644 33421 31433 22523 39876 49747 12791 -19512 -21007 -10277 -10465 -17213 2746
12658 2746 7334 18810 13480 11436 16645 -11094 -15128 -12369 3551 5595 -14671 -20580 -2450
12645 -2450 12491 22646 29700 28160 39981 25292 -5015 13819 595 -1716 30663 50037
$$ packed form
12736A2479k4461M329K614L7250K4054m00k7585l9550J9909M4354J5173o51q858
12723E8657r697k604r665j3626K620o467K3519K2467L3125m5839m1758j2798K1471
12710A9405P868J6993P060L369k5002k7472j0693P721J7430K9850n202n787L2574
12697F8114J2706l9428J0189L1478N525L221l618j7474n830R25r051r93k4309
12684C1455j7830o667m506m188j5166L2728J1420p777J4863L5159J6291m848j5328
12671F5606j4962j7223j988q910J7353R871l6956l2303j495J0730j88o748J9959
12658B746M588J1476n330k044N209k7739m034K759J5920K044k0266n909J8130
12645b450J4941J0155P054j540J1821j4689l0307J8834j3224k311L2379J9374
$$ plain form
12633 50037 24931 25542 39666 10044 -15047 -8313 -9984 -17127 9013 31405 36711 34856 40479
12620 40479 46483 48261 47404 34536 26130 40087 20429 -2398 15303 48198 58146 58900 13047
12607 13047 -7622 -16433 -20720 4 22225 38802 26247 17058 32208 30271 31308 4548 -2954
12594 -2954 -24990 -1458 25093 14804 -3451 -1847 -8944 20859 38203 11703 49612 77007
12582 77007 64953 43100 39674 61817 61068 49580 19219 4295 9577 -435 -4828 -8165 -21470
12569 -21470 -7514 10133 26557 43586 60024 54140 29540 21067 22357 14053 -6453 5572
12557 5572 -393 -6218 -9485 24395 33330 -7086 -3632 6528 -5100 4771 28191 28689 24762 34860
12543 34860 29484 11761 26374 26244 24749 10389 3563 19931 8175 8839 1493 -8593 12427
$$ packed form
12633E0037k5106O11J4124k9622k5091O734j671p143K6140K2392N306j855N623
12620D0479O004J778q57j2868q406J3957j9658k2827J7701L2895R948P54m5853
12607A3047k0669q811m287K0724K2221J6577j2555r189J5150j937J037k6760p502
12594b954k2036K3532K6551j0289j8255J604p097K9803J7344k6500L7909K7395
12582G7007j2054k1853l426K2143p49j1488l0361j4924N282j0012m393l337j3305
12569b1470J3956J7647J6424J7029J6438n884k4600q473J290q304k0506J2025
12557E572n965n825l267L3880Q935m0416L454J0160j1628R871K3420M98l927J0098
12543C4860n376j7723J4613j30j495j4360o826J6368j1756O64p346j0086K1020
$$ plain form
12530 12427 11217 5746 14602 39191 3881 1479 8847 35437 21249 24402 53436 61661 20608
12517 20608 245 53 -16709 -23824 -19538 -15149 -8458 12378 -10025 -25003 -20734 6249 13818
12504 13818 -6633 -21629 -9382 13837 35677 49432 64529 57486 38117 15713 1982 -26079
12492 -26079 -32776 12476 30844 16489 28550 40993 30548 38104 21958 22031 -6635 7435 39282
12479 39282 16746 34594 76835 73891 81628 61540 31905 -8022 -33269 6197 -6859 3796
12467 3796 13919 40995 31206 21964 39438 26194 -7256 21200 23281 29872 42117 19579 27325
12454 27325 18667 -17558 -4862 3785 6557 30673 32307 53692 48132 24509 -12580 -31843 -2429
12441 -2429 18324 55869 51988 14908 -4774 -37478 -27698 -19460 -17459 1087 -14708 -25238 -15090
$$ packed form
12530A2427j210n471Q856K4589l5310k402P368K6590j4188L153K9034Q225m1053
12517B0608k0363j92j6762p115M286M389O691K0836k2403j4978M269K6983P569
12504A3818k0451j4996J2247K3219K1840J3755J5097p043j9369k2404j3731k8061
12492b6079o697M5252J8368j4355J2061J2443j0445P556j6146P3k8666J4070L1847
12479C9282k2536J7848M2241k944P737k0088k9635l9927k5247L9466j3056J0655
12467C796J0123K7076r789r242J7474j3244l3450K8456K081O591J2245k2538P746
12454B7325q658l6225J2696Q647K772K4116J634K1385n560k3623l7089j9263K9414
12441b429K0753L7545l881l7080j9682l2704R780Q238K001J8546j5795j0530J0148
$$ plain form
12428 -15090 -66354 -57034 -39627 -68119 -70787 -25594 -5552 6258 -20614 -25556 -4798 -28448
12416 -28448 -21365 13635 15213 4759 12660 29049 15502 -14232 -18675 -36412 -12604 1232
12404 1232 20584 28460 5716 2144 -8420 -2600 17307 24821 32066 44699 32743 27704 11110
12391 11110 17046 20446 12898 -9326 -7381 16929 45955 59530 59906 61877 24257 32377 43897
12378 43897 25430 15315 7824 -24462 -38316 -49957 -17653 18666 -15529 -48338 -19629 -3421
12366 -3421 10372 26370 30864 11757 -108 15378 34776 32175 32360 46520 2476 -8971 10230
12353 10230 20703 26786 33603 37768 30643 14899 10236 -5589 7988 25132 29502 25289 24352
12340 24352 17023 16937 14943 8019 12221 24200 7728 13259 43140 62415 60672 37843 21286
$$ packed form
12428a5090n1264R320J7407k8492k668M5193K0042J1810k6872m942K0758k3650
12416b8448P083L5000J578j0454P901J6389j3547k9734m443j7737K3808J3836
12404A232J9352P876k2744l572j0564N820J9907P514P245J2633j1956n039j6594
12391A1110N936L400p548k2224J945K4310K9026J3575L76J971l7620Q120J1520
12378D3897j8467j0115p491l2286j3854j1641L2304L6319l4195l2809K8709J6208
12366c421J3793J5998M494j9107j1865J5486J9398k601J85J4160m4044j1447J9201
12353A0230J0473O083O817M165p125j5744m663j5825J3577J7144M370m213r37
12340B4352p329q6j994o924M202J1979j6472N531K9881J9275j743k2829j6557
$$ plain form
12327 21286 28514 41284 18334 7097 4621 10282 -12460 -19214 -42781 -34918 -9950 -17251 -48325
12314 -48325 -65872 -56972 -45898 -22543 6899 15663 13561 -7176 -21325 5604 -15034 -34796
12302 -34796 2685 26574 -2185 -11312 -9905 -20969 -17328 -32785 -28561 1726 -7264 -845 8796
12289 8796 -688 -14367 1132 13591 19565 31253 49148 66009 41517 29373 39394 19871
12277 19871 35309 24772 24638 24376 10281 13733 13176 -7243 -1556 1314 18522 34714 38683 14774
12263 14774 -12145 -40497 -12540 7025 -12926 -15869 -17374 3814 -22341 -21643 24870 36135
12251 36135 31086 23102 7361 -14014 7516 11336 4373 17897 3939 -2978 -28924 -26387 -38223
12238 -38223 -24299 -10261 -3591 -10750 -16496 11257 21611 32973 52138 37911 20379 -2375
$$ packed form
12327B1286P228J2770k2950j1237k476N661k2742o754k3567P863K4968p301l1074
12314d8325j7547Q900J1074K3355K9442Q764k102k0737j4149K6929k0638j9762
12302c4796L7481K3889k8759r127J407j1064L641j5457M224L0287q990O419R641
12289H796r484j3679J5499J2459N974J1688J7895J6861k4492j2144J0021j9523
12277A9871J5438j0537j34k62j4095L452n57k0419N687K870J7208J6192L969k3909
12263A4774k6919k8352K7957J9565j9951k943j505K1188k6155O98M6513J1265
12251C6135n049p984j5741k1375K1530L820o963J3524j3958o917k5946K537j1836
12238c8223J3924J4038O670p159n746K7753J0354J1362J9165j4227j7532k2754
$$ plain form
12226 -2375 -6642 -23805 -16065 18391 48744 15520 562 34919 16827 13499 18938 32797 54716
12213 54716 48874 20189 15232 22259 24313 40439 39272 34611 38381 63314 56083 47470 13898
12200 13898 23968 60884 62749 35259 55973 62718 56735 32911 14345 -3837 9752 21007
12188 21007 27799 34223 30320 35456 9199 -2671 5179 10604 13192 16968 39788 17181 -6910
12175 -6910 -34745 -34534 -8529 -198 -18815 -11348 -21176 -49680 -33522 -4429 9628 4759 -14760
12162 -14760 -7087 -4517 -19923 -12549 13061 32015 34701 13034 12645 37546 62374 46184 16116
12149 16116 14650 -8293 -15876 -6993 -28390 -52530 -44676 -10718 2672 -761 15432 -7640 -8671
12136 -8671 -4120 28489 15855 -16357 -25723 -19818 9294 15019 1066 14663 37907 38371 59393
$$ packed form
12226b375m267j7163P740L4456L0353l3224j4958L4357j8092l328N439J3859K1919
12213E4716n842k8685m957P027K054J6126j167m661L770K4933p231q613l3572
12200A3898J0070L6916J865k7490K0714O745n983k3824j8566j8182J3589J1255
12188B1007O792O424l903N136k6257j1870P850N425K588L776K2820k2607k4091
12175f910k7835K11K6005Q331j8617P467r828k8504J6158K9093J4057m869j9519
12162a4760P673K570j5406P374K5610J8954K686k1667l89K4901K4828j6190l0068
12149A6116j466k2943p583Q883k1397k4140P854L3958J3390l433J6193k3072j031
12136h671M551L2609j2634l2212r366N905K9112N725j3953J3597K3244M64K1022
$$ plain form
12123 59393 44082 38649 42060 12555 2016 -14742 3854 -1641 23078 20416 16360 9288 14304
12110 14304 442 6673 32969 44699 10799 -20688 -10587 398 18475 16016 21803 25072
12098 25072 710 -12336 8520 11742 -6708 -3927 4821 -1076 -15894 -5336 13209 1005
12086 1005 937 -686 -24217 3287 30850 23013 15162 17433 6031 -18908 -31698 -28694 -8473
12073 -8473 10585 -4668 -12669 6496 24081 17869 -5519 35735 32828 6764 1064 18774 6481
12060 6481 -10265 -19068 -21603 -10814 31283 52286 40794 957 -15308 -5446 3930 302 -21134
12047 -21134 -30515 -36005 3152 16043 25716 27969 51103 27564 27948 24623 20737 44810 36320
12034 36320 -20574 -56806 -37715 5370 17830 22974 22128 12193 23049 25303 35033 69769 57458
$$ packed form
12123E9393j5311n433L411k9505j0539j6758J8596n495K4719k662m056p072N016
12110A4304j3862O231K6296J1730l3900l1487J0101J0985J8077k459N787L269
12098B5072k4362j3046K0856L222j8450K781Q748n897j4818J0558J8545j2204
12086A005o8j623k3531K7504K7563p837p851K271j1402k4939j2790L004K0221
12073h473J9058j5253q001J9165J7585o212k3388M1254k907k6064n700J7710j2293
12060F481j6746q803k535J0789M2097K1003j1492l9837j6265R862R376l628k1436
12047b1134r381n490L9157J2891R673K253K3134k3539L84l325l886K4073q490
12034C6320n6894l6232J9091M3085J2460N144q46r935J0856K254R730L4736j2311
$$ plain form
12021 57458 37336 42463 8032 -41039 -44281 -34294 -26492 1799 9215 18770 -6174 -21807 -27995
12008 -27995 -48999 -22089 3394 29224 37988 33112 -17081 -19741 6877 -14408 -11051 -13148 -2764
11995 -2764 -5006 4100 30221 40562 29444 -328 -5056 -1447 -9227 -29532 -44879 -42805 8857
11982 8857 52080 45730 26671 26031 -10087 -15081 -42 -1060 9733 -1911 -3051 -1815 -7190
11969 -7190 -8658 -6255 -19204 -15025 -23487 -29088 -34175 -32460 -2194 -5532 -13592 2895 12800 -3408
11955 -3408 -14021 -51697 -59392 -63597 -36191 -22003 -32391 -36988 -20169 19995 16447 26699 23874
11942 23874 26806 47024 24735 1298 23602 71543 74279 54271 18704 13015 -11416 -25230
11930 -25230 -39950 -54780 -28787 -14187 3414 226 -6998 11265 6950 2806 -8675 -6402 2212
$$ packed form
12021E7458k0122N127l4431m9071l242R987P802K8291P416R555k4944j5633o188
12008b7995k1004K6910K5483K5830Q764m876n0193k660K6618k1285L357k097J0384
11995b764k242R106K6121J0341j1118k9772m728L609p780k0305j5347K074N1662
11982H857M3223o350j9059o40l6118m994J5039j018J0793j1644j140J236n375
11969g190j468K403j2949M179q462n601n087J715L0266l338q060J6487R905j6208
11955c408j0613l7676p695m205K7406J4188j0388m597J6819M0164l548J0252k825
11942B3874K932K0218k2289k3437K2304M7941K736k0008l5567n689k4431j3814
11930b5230j4720j4830K5993J4600J7601l188p224J8263m315m144j1481K273Q614
$$ plain form
11917 2212 11366 3061 -13855 -37884 -39900 -54114 -52423 -29322 -15829 1134 9498 -4730 -9419
11904 -9419 19990 22890 7390 16143 37766 26225 -735 -13960 -9789 -17599 -16688 -7073 5713
11891 5713 -11821 -19731 20102 37374 34414 28063 15734 32521 12521 -2500 -7369 16009 13693
11878 13693 32463 43800 20307 8888 -5597 -7184 -20431 -10217 8417 -2600 -14586 -11501
11866 -11501 -6951 -16670 -1526 7750 26748 45132 43646 40139 59848 62979 22529 -7603 25113
11853 25113 37033 9250 -27679 -35378 -23325 17993 48057 45925 45377 5071 -16803 -5193
11841 -5193 9531 14068 5138 24847 60145 63179 52795 9362 -19804 -14671 -36883 -45713 -72640
11828 -72640 -77415 -85819 -71238 -37406 -29879 -26164 6932 38296 54454 31901 24518 25528 26869
$$ packed form
11917B212R154q305j6916k4029k016j4214J691K3101J3493J6963Q364j4228m689
11904i419K9409K900j5500Q753K1623j1541k6960j3225M171p810R11R615J2786
11891E713j7534p910L9833J7272k960o351j2329J6787k0000j5021m869K3378k316
11878A3693J8770J1337k3493j1419j4485j587j3247J0214J8634j1017j1986L085
11866a1501M550r719J5144R276J8998J8384j486l507J9709L131m0450l0132L2716
11853B5113J1920k7783l6929p699J2053M1318L0064k132n48m0306k1874J1610
11841e193J4724M537q930J9709L5298L034j0384m3433k9166N133k2212q830k6927
11828g2640m775q404J4581L3832P527L715L3096L1364J6158k2553p383J010J341
$$ plain form
11815 26869 9175 268 -7655 2704 22143 43915 25147 -22881 -23434 9711 -2601 -550 17804
11802 17804 14525 -3443 -36398 -73777 -62763 -39703 -42622 -38424 -16639 -12180 -15522 -22298 -4565
11789 -4565 16587 33990 1858 5221 35778 66259 63582 44087 3342 -12367 -13603 -10966 1366
11776 1366 -27468 -31211 283 2035 -34418 -11384 8493 24456 32287 50260 54060 28257 10116
11763 10116 10324 -11908 -25790 -35062 -48764 -39169 -22552 -40407 -58699 -44521 -25411 5296
11751 5296 7021 -9749 -578 15109 6857 -22405 -44135 -48637 -38012 -30193 -34730 -17113 -40176
11738 -40176 -53887 -55096 -49147 -13228 -9930 -1273 10633 -1661 -4571 4201 -8764 -16605 -13440
11725 -13440 -7639 23210 17729 9317 8477 6754 8498 28816 46647 31149 9576 6375 -26557
$$ packed form
11815B6869j7694q907p923J0359J9439K1772j8768m8028n53L3145j2312K051J8354
11802A7804l279j7968l2955l7379J1014K3060k919M198K1785M459l342o776J7733
11789d565K1152J7403l2132L363L0557L0481k677j9495m0745j5709j236K637J2332
11776A366k8834l743L1494J752l6453K3034J9877J5963P831J7973L800k5803j8141
11763A0116K08k2232j3882r272j3702R595J6617j7855j8292J4178J9110L0707
11751E296J725j6770R171J5687q252k9262k1730m502J0625P819m537J7617k3063
11738d0176j3711j209N949L5919L298Q657J1906j2294k910Q772j2965p841L165
11725a3440N801L0849n481q412q40j723J744K0318J7831j5498k1573l201l2932
$$ plain form
11712 -26557 -34035 -35909 -2515 17339 24503 45628 48642 33969 33727 37233 9080 -10120 -16723
11699 -16723 -45475 -44912 -4097 24159 12414 2178 2170 -3931 -14054 -17289 -12434 6364 11812 27310
11685 27310 45624 19504 6484 -12884 -5100 3755 -14851 -5693 -18328 -9868 -28772 -63842
11673 -63842 -63596 -70736 -62093 -35748 -39490 -35303 -7596 36219 35814 45745 24560 -4531 4366 28577
11659 28577 8431 -919 11437 24152 32598 21842 13218 27719 32541 17568 39377 8688
11647 8688 -11630 37709 16898 -10270 -1781 6698 4004 12192 26255 30608 32469 23115 -9627
11634 -9627 10887 33037 9978 16402 14423 -6277 -18200 4580 -2521 -7260 -7916 19675 -6599
11621 -6599 -47351 -44736 -47131 -50930 -37742 -35940 -35403 -39540 -63296 -57916 -22112 -4770 -6764 -32285
$$ packed form
11712b6557p478j874L3394J9854P164K1125L014j4673k42L506k8153j9200o603
11699a6723k8752N63M0815K8256j1745j0236qo101j0123l235M855J8798N448J5498
11685B7310J8314k6120j3020j9368P784Q855j8606R158j2635Q460j8904l5070
11673f3842K46p140Q643K6345l742M187K7707M3815m05R931k1185k9091Q897K4211
11659B8577k0146r350J2356J2715Q446j0756q624J4501M822j4973K1809l0689
11647H688k0318M9339k0811k7168Q489Q479k694Q188J4063M353J861r354l2742
11634i627K0514K2150k3059O424j979k0700j1923K2780p101m739o56K7591k6274
11621f599m0752K615k395l799J3188J802N37m137k3756N380L5804J7342j994k5521
$$ plain form
11607 -32285 -73433 -62429 -39596 -33633 -44420 -15799 2467 -3187 12850 14903 -5212 -21436
11595 -21436 -10359 628 16107 9519 -33466 -68269 -44304 -6448 3599 -24829 -28600 19324
11583 19324 42935 17840 8760 22407 9913 23821 18501 18547 7978 -9876 -18239 -52928 -67206
11570 -67206 -46890 -45666 -74876 -38248 542 6847 13264 14033 5696 -8114 -28992 -51298 -52475
11557 -52475 -61888 -34171 -28450 -32583 -36890 -58767 -56708 -50326 -62007 -66196 -70490 -47290 -9633
11544 -9633 -9306 -24268 -3703 12871 -2708 45875 47500 11665 -15283 142 17349 12092 21686
11531 21686 46155 31657 -2276 -10462 -16813 10009 24680 1213 -30131 -59114 -64094 -25058
11519 -25058 -9348 5393 13450 10943 25516 17351 9830 10505 -11454 -21881 -19726 -39591 -31027
$$ packed form
11607c2285m1148J1004K2833N963j0787K8621J8266n654J6037K053k0115j6224
11595b1436J1077J0987J5479o588m2985l4803K3965L7856J0047k8428l771M7924
11583A9324K3611k5095r080J3647j2494J3908n320M6j0569j7854q363l4689j4278
11570f7206K0316J224k9210L6628L8790O305O417P69q337j3810k0878k2306j177
11557e2475r413K7717N721m133m307k1877K059O382j1681m189m294K3200L7657
11544i633L27j4962K0565J6574j5579M8583J625l5835k6948J5425J7207n257R594
11531B1686K4469j4498l3933q186o351K6822J4671k3467l1344k8983m980L9036
11519b5058J5710J4741Q057k507J4573q165p521O75k1959j0427K155j9865Q564
$$ plain form
11506 -31027 -34111 -43922 -42998 -46025 -40843 -145 49274 32776 1342 -185 18515 40172 66123
11493 66123 50761 49975 31012 19801 17337 8142 1497 -25477 -5447 -22305 -18188 -13804 -8078
11480 -8078 -17983 8945 8842 -38045 -76184 -48284 -21996 518 834 3972 37595 53129 40403
11467 40403 22459 1297 -1167 11398 27130 42118 26843 6180 7 7125 6580 7155 -3844
11454 -3844 -19644 -11832 7692 -17576 -43540 -46720 -22587 126 17451 19009 6312 -3515 -2407
11441 -2407 -17081 26332 35240 13791 12226 9876 -4108 -5408 21171 51829 54919 78658 59488
11428 59488 13364 -8666 -23220 -2178 20869 35459 32590 19821 3339 -8655 -10489 -5501
11416 -5501 9222 22636 28401 -18058 -42576 -33853 -33024 -32534 -4565 25036 10217 -10787 -46025
$$ packed form
11506c1027l084r811R24l027N182M0698M9419j6498l1434j527J8700K1657K5951
11493F6123j5362p86j8963j1211k464r195o645k6974K0030j6858M117M384N726
11480h078r905K6928j03m6887l8139K7900K6288K2514L16L138L3623J5534j2726
11467D0403j7944k1162k464J2565J5732J4988j5275k0663o173P118n45N75j0999
11454c844j5800P812J9524k5268k5964l180K4133K2713J7325J558j2697r827J108
11441b407j4674M3413Q908k1449j565k350j3984j300K6579L0658L090K3739j9170
11428E9488m6124k2030j4554K1042K3047J4590k869j2769j6482j1994j834M988
11416e501J4723J3414N765m6459k4518Q723Q29M90K7969K9601j4819k1004l5238
$$ plain form
11403 -46025 -55924 -7832 3040 11508 -7754 -12670 -12518 -23520 -23072 -24885 -50165 -46878 -834
11390 -834 17272 12599 6624 20099 8888 3310 15784 4832 -9754 11000 9981 -6271 9444
11377 9444 23470 24243 30347 16184 -11854 -16691 -12508 -12134 -18916 -20085 -17048 922 25832 11917
11363 11917 -10240 5435 26906 47743 57821 61626 64279 81690 40855 9047 35088 55933
11351 55933 71493 76174 49717 24969 2380 -14525 -30197 -22567 1253 11201 7090 4920 -10180
11338 -10180 5236 22715 46454 45551 17427 -3120 -32559 -31340 -14907 -5471 -1697 10660 21736
11325 21736 29386 -16791 -21402 -3101 12003 26133 25615 16420 21764 -3510 3559 -4515 -8243
11312 -8243 -34636 -38901 -39729 -43699 -25262 -23603 -50984 -25840 -4546 -13084 -14374 -40476 -53263
$$ packed form
11403d6025r899M8092J0872Q468j9262m916J52j1002M48j813k5280L287M6044
11390h34J8106m673n975J3475j1211n578J2474j0952j4586K0754j019j6252J5715
11377I444J4026P73O104j4163k8038m837M183L74o782j169L037J7970K4910j3915
11363A1917k2157J5675K1471K0837J0078L805K653J7411m0835l1808K6041K0845
11351E5933J5560M681k6457k4748k2589j6905j5672P630K3820R948m111k170j5100
11338a0180J5416J7479K3739r03k8124k0547k9439J219J6433R436L774J2357J1076
11325B1736P650m6177m611J8301J5104J4130n18r195N344k5274P069q074l728
11312h243k6393m265q28l970J8437J659k7381K5144K1294q538j290k6102j2787
$$ plain form
11299 -53263 -55282 -34489 -7726 -17797 -17193 -7155 -44832 -22756 -8952 -1744 24660 8425
11287 8425 -11899 -19274 -22115 -9273 -8469 -34084 -21227 10601 31648 33794 20119 16317 4959
11274 4959 10306 18382 47339 54624 9513 -21019 -20885 -28843 -48092 -62239 -65972 -40808 -46181
11261 -46181 -60249 -35728 9315 39629 33708 56628 40441 40188 39097 28220 3661 16724
11249 16724 -13559 -42184 -20292 -10489 -20800 -7446 -754 34123 29296 -15691 -48564 -37858
11237 -37858 -8452 -986 -10364 -35313 -16944 -16885 15952 14865 22170 32064 38367 33669 39498 4887
11223 4887 7847 -6025 5704 71 5656 -22476 -22171 -30564 -41986 -52434 -23790 13019 18114
11210 18114 22422 7470 -14346 -13576 -8615 -31142 -39530 -537 -7720 -11558 -18188 -27640 -35652 -50684
$$ packed form
11299e3263k019K0793K6763j0071O04J0038l7677K2076J3804P208K6404j6235
11287H425k0324p375k841J2842Q04k5615J2857L1828K1047K146j3675l802j1358
11274D959N347Q076K8957P285m5111l0532J34p958j9249j4147l733K5164n373
11261d6181j4068K4521M5043L0314n921K2920j6187k53j091j0877k4559J3063
11249A6724l0283k8625K1892R803j0311J3354O692L4877m827m4987l2873J0706
11237c7858K9406P466r378k4949J8369N9L2837j087P305R894O303m698N829l4611
11223D887K960j3872J1729n633N585k8132L05q393j1422j0448K8644L6809N095
11210A8114M308j4952k1816P70M961k2527q388L8993p183l838o630r452q012j5032
$$ plain form
11196 -50684 -43695 -12841 -7228 -5220 39 614 -21445 -44162 -44020 -40324 -26217 -8005 -11578 -17834
11182 -17834 -9424 -5865 -6516 12963 17868 18179 18804 15738 11833 19640 28273 20464 30566 72102
11168 72102 46752 28847 19725 13500 5221 -4790 10134 38247 27392 -16447 -11980 -10414 -293
11155 -293 7590 -15236 -32438 -50622 -49899 -33896 -24251 -9698 -11721 -29609 -46549 -31445 -22000
11142 -22000 -48944 -58603 -29742 -4254 -11627 -26027 -20007 -4563 4921 -38905 -49551 -44531 -53539
11129 -53539 -47591 -42340 -36006 -34389 -27594 -3177 12811 -8897 -47697 -39972 -29033 -53479 -67380
11116 -67380 -91327 -124033 -122842 -78019 -16451 38142 13466 -19553 -106 -3669 -26706 -50275
11104 -50275 -44661 -22077 -15609 -32187 -33570 -19037 -37379 -6214 20133 28959 46992 31600
$$ packed form
11196e0684O989L0854N613K008N259N75k2059k2717J42L696J4107J8212l573o256
11182a7834Q410L559o51J9479M905L11O25l066l905P807Q633p809J0102M1536
11168G2102k5350j7905r122o225q279j0011J4924K8113j0855m3839M467J566J0121
11155b93P883k2826j7202j8184P23J6003R645J4553k023j7888j6940J5104R445
11142b2000k6944r659K8861K5488p373j4400O020J5444R484m3826j0646N020r008
11129e3539N948N251O334J617O795K4417J5988k1708l8800P725J0939k4446j3901
11116f7380k3947l2706J191M4823O1568N4593k4676l3019J9447l563k3037k3569
11104e0275N614K2584O468j6578j383J4533j8342L1165K6347Q826J8033j5392
$$ plain form
11092 31600 37042 19741 25410 13253 -9479 -6621 -4310 24420 3468 -8282 -11220 -5159 3412
11079 3412 26324 32557 26316 1515 -11032 -12639 -8632 -23476 -20062 -21144 -46703 -58285 -25895
11066 -25895 -11360 -34062 -35337 -27139 9643 29716 9670 -16343 -6999 661 -22701 -34553
11054 -34553 -10201 -8622 -26785 -27140 -15968 -13418 -28363 -19592 -1120 -647 -10137 -1589 24580
11041 24580 25745 20048 11277 -36218 -39202 -16353 -604 786 -16511 -34641 -22066 -7216 -15020
11028 -15020 -3767 10691 6980 -22827 -25797 -4660 11016 21983 -2325 -6825 -2368 31677
11016 31677 13330 -21284 -11003 -1175 -15631 -26743 -11010 -1077 18838 24070 -1912 -5068
11004 -5068 -19207 -36988 -14424 4361 17929 -10184 -21878 -9461 -4016 3909 173 18217
$$ packed form
11092C1600N442j7301N669j2157k2732K858K311K8730k0952j1750k938O061Q571
11079C412K2912O233o241k4801j2547j607M007j4844L414j082k5559j1582L2390
11066b5895J4535k2702j275Q198L6782K0073k0046k6013R344P660k3362j1852
11054c4553K4352J579j8163l55J1172K550j4945Q771J8472M73r490Q548K6169
11041B4580J165n697q771m7495k984K2849J5749J390j7297j8130J2575J4850p804
11028a5020J1253J4458l711k9807k970K1137J5676J0967k4308m500M457L4045
11016C1677j8347l4614J0281R828j4456j1112J5733R933J9915N232k5982l156
11004e068j4139j7781K2564J8785J3568k8113j1694J2417N445P925l736J8044
$$ plain form
10992 18217 26390 15715 -14577 -49996 -43886 -27137 -22530 -44933 -52214 -67377 -64259 -23667 -37960
10979 -37960 -63155 -51570 -23072 -23965 -38338 -40141 -33295 -31201 -36705 -63998 -74159 -53547 -27580
10966 -27580 -9078 -20366 -43954 -60048 -43251 -14790 -115 13283 15906 3577 -2500 -16813
10954 -16813 -22038 -4311 -1692 26160 52867 19309 -28546 -21665 -21365 -41926 -86289 -50440 -15550
10941 -15550 -8867 -19146 -2418 32648 18068 1176 -26254 -36076 -10247 -6292 -22940 -50159
10929 -50159 -43726 -27896 -34815 -45789 -37554 -3174 180 -6182 -12247 -31821 -11382 -5978 -873
10916 -873 24291 9367 -21034 -40768 -26680 -32119 -17927 -15669 -4724 -19171 -30276 -37355 -40682
10903 -40682 -64371 -81073 -51624 -23452 -12784 -5038 -11945 -7253 -22416 -27038 -24049 -33244 -21919
$$ packed form
10992A8217Q173j0675l0292l5419O110J6749M607k2403p281j5163L118M0592j4293
10979c7960k5195J1585K8498q93j4373j803O846K094n504k7293j0161K0612K5967
10966b7580J8502j1288k3588j6094J6797K8461J4675J3398K623j2329o077j4313
10954a6813n225J7727K619K7852K6707l3558m7855O881L00k0561m4363L5849L4890
10941a5550O683j0279J6728L5066j4580j6892k7430r822K5829L955j6648k7219
10929e0159O433J5830o919j0974Q235L4380L354o362o065j9574K0439N404N105
10916h73K5164j4924l0401j9734J4088n439J4192K258J0945j4447j1105p079l327
10903d0682k3689j6702K9449K8172J0668P746o907M692j5163m622K989r195J1325
$$ plain form
10890 -21919 -13457 10700 1596 9127 9126 7130 -4850 -4457 -12241 -29489 13567 34783 25020 23840
10876 23840 6332 -29177 -32054 -6147 17971 22081 -11185 -35998 -29132 -17994 -7004 17565
10864 17565 -5229 -14746 -33102 -51937 -46077 -31212 -11287 -42445 -25618 25263 36643 35335
10852 35335 39118 -21476 -37518 -35824 -23138 938 11513 9829 10066 43784 72870 60315 31519
10839 31519 -329 -6996 -15954 -8869 -7870 -19748 -31022 -36325 -45110 -23457 -12591 12944 -2768
10826 -2768 -24559 -6715 2756 -7156 -6213 -24092 -4380 -12181 -20855 -22661 -7823 -16918 -42994
10813 -42994 -49647 -40402 -22025 -19210 -14291 -8463 -17803 -18116 -2485 28919 10719 3740 -479 -10521
10799 -10521 -28915 -39098 -57121 -34371 11530 39666 13088 -25663 -3877 5855 -10449 13769
$$ packed form
10890b1919Q462K4157r104P531jj996j1980L93p784j7248M3056K1216r763j180
10876B3840j7508l5509k877K5907K4118M110l3266k4813O866J1138J0990K4569
10864A7565k2794r517j8356j8835N860J4865J9925l1158J6827N0881J1380j308
10852C5335L783o0594j6042J694J2686K4076J0575j684K37L3718K9086j2555k8796
10839C1519l1848o667q958P085R99j1878j1274n303q785K1653J0866K5535j5712
10826b768k1791J7844R471r912R43j7879J9712p801q674j806J4838r095k6076
10813d2994o653R245J8377K815M919N828r340l13J5631L1404j8200o979m219j0042
10799a0521j8394j0183j8023K2750M5901K8136k6578l8751K1786R732j6304K4218
$$ plain form
10787 13769 35727 30129 39111 52760 23751 21875 698 10234 29569 4956 -13802 -8303 -3203
10774 -3203 -12176 -41807 -69357 -107024 -91319 -74485 -43505 -47690 -44947 -29368 -27465 -40008 -49716
10761 -49716 -29718 -20830 23282 13975 9824 26354 22172 17872 33242 42747 13650 5044 17656
10748 17656 -599 5745 -9655 -8324 -14605 17548 46983 45558 38128 10065 -8048 -30991 -29116
10735 -29116 2914 12029 30266 14913 650 -15366 -29517 -19652 -5895 -16939 -27353 -25142
10723 -25142 -35244 -26121 -16424 -31878 -58417 -60095 -57184 -50523 -41037 -19843 -21041 -38882 -29692
10710 -29692 -15411 -30824 -15843 -26923 -10413 -11260 -29423 -32609 -13319 26715 30051 -4855
10698 -4855 -38083 -27749 -5104 2126 14360 -7140 -38530 -29514 -56 22661 -6692 -13717
$$ packed form
10787A3769K1958n598Q982J3649k9009j876k1177R536J9335k4613j8758N499N100
10774c203q973k9631k7550l7667J5705J6834L0980m185K743J5579J903j2543r708
10761d9716J9998Q888M4112r307m151J6530m182m300J5370R505k9097q606J2612
10748A7656j8255O344j5400J331o281L2153K9435j425p430k8063j8113k2943J875
10735b9116L2030R115J8237j5353j4263j6016j4151R865J3757j1044j0414K211
10723b5142j0102R123R697j5454k6539j678K911O661R486K1194j198j7841R190
10710b9692J4281j5413J4981j1080J6510q47j8163l186J9290M0034L336l4906
10698d855l3228J0334K2645P230J2234k1500l1390R016K9458K2717k9353p025
$$ plain form
10686 -13717 -922 -5416 -2478 1854 -6277 -16926 -24677 -9725 -11252 23134 20617 -11043 -26447
10673 -26447 -2327 2596 150 7030 13616 30017 16697 28198 20757 -7 -16991 -6572 13589
10660 13589 21115 17740 3056 -15246 -12100 982 10808 -12048 -32596 -21110 -13170 15369 23422
10647 23422 5754 -3790 -34252 -17147 -7810 -18696 -890 -1193 17977 3081 -12583 -56390
10635 -56390 -45696 -7020 30986 31221 4178 -11054 -19510 -3761 1823 4158 -24025 -23927 -1036
10622 -1036 4722 -37203 -61149 -51140 -64774 -46364 -29230 -21908 15400 19041 -23054 -30967 -13152
10609 -13152 1953 11484 1658 -35884 -54963 -33052 -13143 -10295 -10827 -10421 -48140 -59263 -33800
10596 -33800 -22703 -31216 -21342 11557 19901 2243 -10136 -9019 -28843 -27982 -17668 -16110 -20648
$$ packed form
10686a3717J2795m494K938M332q131j0649p751J4952j527L4386k517l1660j5404
10673b6447K4120M923k446O880O586J6401j3320J1501p441k0764j6984J0419K0161
10660A3589P526l375j4684j8302L146J3082R826k2856k0548J1486P940K8539Q053
10647B3422j7668r544l0462J7105R337j0886J7806l03J9170j4896j5664m3807
10635e6390J0694L8676L8006K35k7043j5232q456J5749N584K335k8183R8K2891
10622a036N758m1925k3946J0009j3634J8410J7134P322L7308L641m2095p913J7815
10609a3152J5105R531r826l7542j9079K1911J9909K848n32M06l7719j1123K5463
10596c3800J1097q513R874L2899Q344j7658j2379J117j9824Q61J0314J558m538
$$ plain form
10583 -20648 -39835 -29965 -24930 -11013 10189 23975 31645 36100 1262 -58411 -72177 -29232
10571 -29232 -19 -9079 -21293 -19441 -2435 10222 9127 41047 38219 8236 1311 -13688 -31175
10558 -31175 -16550 -6240 29856 21938 -12868 -10285 10944 5797 1752 -1386 -1766 -10090 -12031
10545 -12031 -841 6741 22361 16734 -4045 -7831 -14253 -18427 -28076 -62626 -77120 -43387 -26461
10532 -26461 -54980 -49277 -37814 2741 16352 4521 -2355 26043 36878 7761 -7827 -7736 17247
10519 17247 24027 46242 77808 70631 56776 22244 6774 27124 -3134 -39807 -51569 -72874
10507 -72874 -68679 -32337 -165 -7087 -6692 -17859 -14636 -6200 -28875 -19400 9774 17312 23932
10494 23932 14757 -1476 7647 11181 16117 -3660 -11239 -17655 -16031 -15003 -23856 -23352 -14263 -13700
$$ packed form
10583b0648j9187R870N035J3917K1202J3786P670M455l4838n9673j3766M2945
10571b9232K9213r060j2214J852J7006J2657j095L1920k828k9983o925j4999j7487
10558c1175J4625J0310L6096p918l4806K583K1229n147m045l138l80q324j941
10545a2031J1190P582J5620n627k0779l786o422m174r649l4550j4494L3733J6926
10532b6461k8519N703J1463M0555J3611j1831o876K8398J0835k9117j5588R1K4983
10519A7247O780K2215L1566p177j3855l4532j5470K0350l0258l6673j1762k1305
10507g2874M195L6342L2172o922L95j1167L223Q436k2675R475K9174P538O620
10494B3932r175j6233R123L534M936j9777p579o416J624J028q853N04R089N63
$$ plain form
10480 -13700 -30287 -32365 -27014 -28591 -21252 -9795 -4144 -35677 -21450 -980 1216 18125 -12688
10467 -12688 -18568 1491 17186 -3848 -14108 -33901 -18930 -6624 25819 15466 -1960 21653
10455 21653 34319 21971 -12906 -22948 -25591 -29550 -28147 -31444 -16932 -14223 -30829 -45150 -36307
10442 -36307 -29565 -10786 -286 -30654 -73534 -41844 -15066 -6682 -67568 -66001 -63177 -42630
10430 -42630 -34846 -28624 -34675 -33495 -3988 -3871 12178 10894 -18402 -4903 5872 -16005 -47536
10417 -47536 -59425 -58316 -24413 -17895 -12035 -32647 -40363 -70741 -64772 -66096 -41752 -10750 -5203
10404 -5203 -16947 -25428 5707 -10959 -31149 -12343 -16097 -46471 -47994 -34934 -11103 6882
10392 6882 15827 1494 76 24878 21884 17320 414 -6351 -13261 -10788 -9333 -15255 -15621 -34262
$$ packed form
10480a3700j6587k078N351j577P339J1457N651l1533J4227K0470K196J6909l0813
10467a2688n880K0059J5695k1034j0260j9793J4971J2306L2443j0353j7426K3613
10455B1653J2666j2348l4877j0042k643l959J403l297J4512K709j6606j4321Q843
10442c6307O742J8779J0500l0368m2880L1690K6778Q384o0886J567K824K0547
10430d2630P784O222o051J180K9507J17J6049j284k9296J3499J0775k1877l1531
10417d7536j1889J109L3903O518N860k0612p716l0378N969j324K4344L1002N547
10404e203j1744q481L1135j6666k0190J8806l754l0374j523J3060K3831J7985
10392F882Q945j4333j418K4802k994m564j6906o765o910K473J455n922l66j8641
$$ plain form
10378 -34262 -13334 -11193 -12778 -1984 -14156 -24012 -40489 -70018 -72322 -46957 -52490 -31559 -21040
10365 -21040 -33710 1488 -13796 -30077 -36744 -16953 26253 32543 10437 -23302 -25332 -38958
10353 -38958 -41293 -35281 240 -1995 -19853 -9538 5347 29002 48915 42668 17004 -7962
10341 -7962 -21102 12828 27683 56918 80163 66127 37002 19833 -20764 -35443 -7063 19274
10329 19274 26309 17490 6604 6586 41571 22315 20921 13289 7833 20290 182 -37720 -35236
10316 -35236 -28420 -25332 -39275 -55859 -39469 3545 4927 -821 19996 41493 29500 19027
10304 19027 14123 26173 17091 13319 23024 17382 23778 11688 28388 -8443 -29179 -31091 -25620
10291 -25620 -47550 -49888 -40312 -9484 32001 42517 33888 30569 14743 4502 -21497 -34997
$$ packed form
10378c4262K0928K141j585J0794j2172r856j6477k9529k304K5365n533K0931J0519
10365b1040j2670L5198j5284j6281o667J9791M3206O290k2106l3739k030j3626
10353c8958k335O012L5521k235j7858J0315J4885K3655J9913o247k5664k4966
10341g962j3140L3930J4855K9235K3245j4036k9125j7169m0597j4679K8380K6337
10329A9274P035q819j0886j8L4985j9256j394p632n456J2457k0108l7902K484
10316c5236O816L088j3943j6584J6390M3014J382n748K0817K1497j1993j0473
10304A9027m904J2050r082l772R705n642O396j2090J6700l6831k0736j912N471
10291b5620k1930k338R576L0828M1485J0516q629l319j5826j0241k5999j3500
$$ plain form
10279 -34997 -47460 -55330 -60893 -54318 -42689 -10568 -12885 -37831 -21241 9330 -10393 6482
10267 6482 13766 54401 35787 17090 -3971 -2553 -6609 -11408 -5517 32337 38560 46635 41966
10254 41966 17838 4092 -1172 -11367 -38536 -48902 -56757 -46543 -11706 4727 -23437 -24567
10242 -24567 -12232 -5269 10304 -13372 -27284 -13353 -13346 -50667 -60717 -47218 -28666 -29468 -30497
10229 -30497 -37987 -25313 -18911 -17786 -29757 -66698 -42382 -726 18482 21328 5120 18036
10217 18036 24222 24052 20249 18101 39713 63413 63721 42953 5939 14798 25286 14269 -18957
10204 -18957 -21234 -7581 -7212 11436 13358 12987 1638 -10135 -24752 -5174 -13446 -18982 -28373
10191 -28373 -27586 -28165 -27508 -17536 -4507 4844 -11779 -47599 -80890 -69826 -43162 -15557 -5645
$$ packed form
10279c4997j2463p870n563O575J1629L2121k317k4946J6590L0571j9723J6875
10267F482P284M0635j8614j8697k1061J418m056m799N891L7854O223Q075m669
10254D1966k4128j3746n264j0195k7169j0366p855J0214L4837J6433k8164j130
10242b4567J2335O963J5573k3676j3912J3931Pl7321j0050J3499J8552q02j029
10229c0497p490J2674O402J125j1971l6941K4316M1656J9208K846j6208J2916
10217A8036O186j70l803k148K1612K3700L08k0768l7014Q859J0488j1017l3226
10204a8957k277J3653L69J8648J922l71j1349j1773j4617J9578q272n536r391
10191b8373P87n79O57R972J3029R351j6623l5820l3291J1064K6664K7605R912
$$ plain form
10178 -5645 -5490 -12701 -20189 -2218 12554 9474 2210 -5526 -42140 -25586 -16202 -29364 -39132 -19141
10164 -19141 -24923 -12362 -3394 -34709 -50798 -36364 -21433 11811 9919 -32460 -9425 7133
10152 7133 -17438 -7951 -12968 -19624 -39295 -48404 -11190 23122 -2782 -38872 -45541 -55221 -46698
10139 -46698 -34043 -32987 -29513 -24910 -40645 -47160 836 -962 15313 22485 11487 18691 16213
10126 16213 -14851 -4574 7583 10263 2895 -29187 -18159 -7798 16514 24610 18248 -1572
10114 -1572 39064 61953 4812 -9610 -2417 15094 6815 -10733 -6990 18807 13317 9502 -2931
10101 -2931 2507 26688 1723 -28320 -50313 -46750 -1235 8929 5670 -1408 -2584 -19107 -28279
10088 -28279 -11594 3481 -10100 -4312 9435 6891 1051 29852 45396 10793 16521 45947
$$ packed form
10178e645J55p211p488J7971J4772l080p264p736l6614J6554R384j3162r768J9991
10164a9141n782J2561Q968l1315j6089J4434J4931L3244j892m2379K3035J6558
10152G133k4571R487n017o656j9671r109L7214L4312k5904l6090o669r680Q523
10139d6698J2655J056L474M603j5735o515M7996j798J6275P172j0998P204k478
10126A6213l1064J0277J2157K680p368l2082J1028J0361K4312Q096o362j9820
10114a572M0636K2889n7141j4422P193J7511q279j7548L743K5797n490l815j2433
10101b931N438K4181k4965l0043k1993L563M5515J0164l259p078j176j6523r172
10088b8279J6685J5075j3581N788J3747k544n840K8801J5544l4603N728K9426
$$ plain form
10076 45947 48033 52630 41972 20318 36512 42037 30057 28888 19224 18658 -19804 -10431 22256
10063 22256 28174 18178 -1218 -25781 14524 29978 15122 13677 17438 56743 58738 56219 30271
10050 30271 -16564 -8118 11795 6920 -6291 -15035 1880 27338 36566 24302 22164 -3781 11286
10037 11286 20946 20388 33448 24701 6713 -14186 -21399 -26347 -24112 -11821 -20316 -6258 20092
10024 20092 26869 22748 11033 19595 29935 -4237 -9986 4839 4947 2174 -8368 -13789 -8232
10011 -8232 -17261 -17608 -36694 -43264 -28556 -35695 4121 -24473 -54988 -35821 -54115 -52502 -42824
9998 -42824 -27876 -29929 -33677 -36193 -40007 -40976 -36158 -46882 -50510 -61908 -34068 -8077 -15678 -28687
9984 -28687 -54233 -30626 -20692 4424 14660 25969 10417 -8767 -35354 -52500 -28222 -3969
$$ packed form
10076D5947K086M597j0658k1654J6194N525j1980j169r664n66l8462R373L2687
10063B2256N918r996j9396k4563M0305J5454j4856j445L761L9305J995k519k5948
10050C0271m6835Q446J9913m875j3211q744J6915K5458R228j2264k138k5945J5067
10037A1286R660n58J3060q747j7988k0899p213m948K235J2291q495J4058K6350
10024B0092O777m121j1715Q562J0340l4172n749J4825J08k773j0542n421N557
10011h232r029l47j9086o570J4708p139L9816k8594l0515J9167j8294J613R678
9998d2824J4948k053l748k516l814r69M818j0724l628j1398K7840K5991p601j3009
9984b8687k5546K3607R934K5116J0236J1309j5552j9184k6587j7146K4278K4253
$$ plain form
9972 -3969 -24911 -31700 -39868 -36889 -47920 -39642 -11223 -21656 -26454 -41641 -39868 -46614 -49091 -28409
9958 -28409 -46887 -49276 -17703 21890 31217 17236 -2196 -8658 7585 23179 7618 -35379
9946 -35379 -42193 -24913 -10005 -23356 -46922 -75920 -76051 -50599 -16262 -16432 -12778 30 9283
9933 9283 20677 30139 34173 36330 26571 1382 -15987 -15665 2278 54045 38170 16524 12256
9920 12256 -21761 -52149 -20617 19761 47735 28932 34862 9816 -3679 16611 -6063 -33942
9908 -33942 -39379 -42472 -22364 -11324 -23139 -17584 -14441 -393 8665 30686 50600 54085 73989
9895 73989 63351 32849 30657 23837 16392 25677 16755 34401 13578 -27250 -14300 8668 12404
9882 12404 20306 8899 6367 -2373 -7681 -10855 -7450 -22902 3906 15021 -3901 -19921 -30003
$$ packed form
9972c969k0942o789q168K979j1031Q278K8419j0433m798j5187J773o746k477K0682
9958b8409j8478k389L1573L9593R327j3981j9432o462J6243J5594j5561m2997
9946c5379o814J7280J4908j3351k3566k8998j31K5452L4337j70L654J2808R253
9933I283J1394R462M034K157r759k5189j7369L22J7943N1767j5875k1646m268
9920A2256l4017l0388L1532M0378K7974j8803N930k5046j3495K0290k2674k7879
9908c3942n437l093K0108J1040j1815N555L143J4048R058K2021J9914L485J9904
9895G3989j0638l0502k192o820p445R285q922J7646k0823m0828J2950K2968L736
9882A2404P902j1407k532q740n308l174L405j5452K6808J1115j8922j6020j0082
$$ plain form
9869 -30003 -49327 -49245 -10475 -6423 -36819 -38910 -54533 -55999 -30552 -2597 70491 87006 91079
9856 91079 52601 42635 60441 23499 3755 41621 34989 24150 69529 83300 92079 123325
9844 123325 130455 115716 115238 110811 61800 28283 24377 6388 -6228 32818 51665 6456 -7159
9831 -7159 -8721 -7578 802 -15870 -14835 9354 30363 12844 3767 8989 15035 17472 26174 59738
9817 59738 88975 79683 51639 32763 26446 9173 -7020 -19737 1499 23992 13266 9874
9805 9874 35191 33449 26921 26157 -7860 -17271 -19206 -13833 -11205 10278 -27833 -29667 -1746 13541
9791 13541 18504 15846 -12556 -15469 -24748 7004 28654 23371 52861 39100 19971 1528 21438
9778 21438 43419 49517 35243 17115 4834 -9898 -12459 2902 -7154 -5555 8829 18275 22035
$$ packed form
9869c0003j9324Q2L8770M052l0396k091j5623j466K5447K7955P3088J6515M073
9856I1079l8478r966J7806l6942j9744L7866o632j0839M5379J3771Q779L1246
9844A23325P130j4739m78m427m9011l3517l906j7989j2616L9046J8847m5209j3615
9831g159j562J143Q380j6672J035K4189K1009j7519r077N222O046K437Q702L3564
9817E9738K9237r292k8044j8876o317j7273j6193j2717K1236K2493j0726l392
9805I874K5317j742o528p64l4017r411j935N373K628K1483l8111j834K7921J5287
9791A3541M963k658k8402k913r279L1752K1650n283K9490j3761j9129j8443J9910
9778B1438K1981O098j4274j8128j2281j4732k561J5361j0056J599J4384R446L760
$$ plain form
9765 22035 17664 6522 32819 43085 54072 50888 36248 19799 13131 8911 -13165 -19931 2020
9752 2020 18737 21086 8000 -2016 -10240 -1522 14658 6217 -3392 -28711 -38002 -39953 -13456
9739 -13456 -999 27337 7156 -23511 -26255 -37459 -11418 8327 11057 4667 13983 26305 4104
9726 4104 1924 37996 62259 26471 8016 -10519 -28787 -7394 29614 34940 44959 43321 22860
9713 22860 8644 20360 635 -28513 -19377 8148 25569 41538 46981 53169 48725 70154 64677
9700 64677 62706 25620 -2264 5921 -19247 -27448 -37922 -45626 -51059 -38720 -11822 -939 1992
9687 1992 8713 11651 -398 -13177 -19383 -14592 -25298 -15976 13735 6000 34792 53643 94269
9674 94269 64549 61910 71637 70636 35735 14985 -20619 -26376 -10078 4270 18738 9705 28159
$$ packed form
9765B2035m371j1142K6297J0266J0987l184j4640j6449o668m220k2076o766K1951
9752B020J6717K349j3086j0016q224Q718J6180q441r609k5319r291j951K6497
9739a3456J2457K8336k0181l0667k744j1204K6041J9745K730o390R316J2322k2201
9726D104k180L6072K4263l5788j8455j8535j8268K1393L7008N326J0019j638k0461
9713B2860j4216J1716j9725k9148R136K7525J7421J5969N443O188m444K1429n477
9700F4677j971l7086k7884Q185k5168q201j0474p704n433J2339K6898J0883K931
9687A992O721K938j2049j2779o206M791j0706R322K9711p735K8792J8851M0626
9674I4269k9720k639R727j001l4901k0750l5604n757J6298J4348J4468r033J8454
$$ plain form
9661 28159 34638 26890 66910 64496 44440 59467 33779 31118 18371 6138 -8232 -35555 -58595
9648 -58595 -41186 -15682 10312 19033 25440 29675 10836 -1685 22002 48918 2000 -38674
9636 -38674 -34680 -26691 15490 75542 90776 72296 45886 27908 24756 33965 17419 31919 41806
9623 41806 18279 30613 36884 34256 24911 32079 48269 18188 -5619 -12954 11217 33184 59235
9610 59235 29308 7344 35013 19833 36414 65507 45724 29856 65031 71563 48020 33057
9598 33057 29592 32939 25084 -7065 5525 12545 28464 10161 8305 5014 2427 50667 55932
9585 55932 23110 10491 17924 17711 3447 12972 19323 27381 46086 38889 61321 57036 39706
9572 39706 36116 23863 -1408 -24152 -15430 38630 48389 63537 74358 59871 20807 28379 55378
$$ packed form
9661B8159O479p748M0020k414k0056J5027k5688k661j2747j2233j4370k7323k3040
9648e8595J7409K5504K5994Q721O407M235j8839j2521K3687K6916m6918m0674
9636c8674L994P989M2181O0052J5234j8480k6410j7978l152R209j6546J4500R887
9623D1806k3527J2334O271k628r345P168J6190l0081k3807p335K4171K1967K6051
9610E9235k9927k1964K7669j5180J6581K9093j9783j5868L5175O532k3543j4963
9598C3057l465L347p855l2149J2590P020J5919j8303j856l291k587M8240N265
9585E5932l2822j2619P433k13j4264R525O351Q058J8705p197K2432m285j7330
9572C9706l590j2253k5271k2744Q722N4060R759J5148J0821j4487l9064P572K6999
$$ plain form
9559 55378 69669 59037 53508 80748 60547 51710 38627 50347 99525 93362 68752 59698 108552
9546 108552 123471 125499 169200 159861 145866 164372 167129 147972 112778 109793 94847 92939 109515
9533 109515 72284 87111 109711 88760 85588 74550 71339 89538 99540 132453 139577 99239
9521 99239 72974 80042 105824 154776 180139 152813 160653 158091 150600 106138 104926 121661 120350
9508 120350 104526 115992 140557 159185 168379 173539 182803 188296 172292 155255 160117 128843 102860
9495 102860 138926 152421 196308 189678 189786 204735 197285 222139 230173 209079 202764 201332 210535
9482 210535 220691 243252 270548 243327 242802 248220 257022 239589 251587 246358 239046 262755 291883
9469 291883 285918 278222 299100 297241 293064 308463 341384 347024 341404 348402 356071 330722 339321
$$ packed form
9559E5378J4291j0632n529K7240k0201q837j3083J1720M9178o163k4610r054M8854
9546A08552J4919K028M3701r339j3995J8506K757j9157l5194k985j4946j908J6576
9533A09515l7231J4827K2600k0951l172j1038l211J8199J0002L2913P124m0338
9521I9239k6265P068K5782M8952K5363k7326P840k562p491m4462j212J6735j311
9508A20350j5824J1466K4565J8628R194N160R264N493j6004j7037M862l1274k5983
9495A02860L6066J3495M3887o630J08J4949p450K4854Q034k1094o315j432R203
9482B10535J0156K2561K7296k7221n25N418Q802j7433J1998n229p312K3709K9128
9469B91883n965p696K0878j859m177J5399L2921N640n620O998P669k5349Q599
$$ plain form
9456 339321 390474 427232 427176 445226 437444 432957 475104 474523 479240 511168 526334 536187 575213
9443 575213 594633 596093 601782 643617 660749 612073 637034 660248 707305 754281 829176 891566
9431 891566 965170 1011072 1041454 1085664 1123340 1186036 1259537 1313516 1401126 1465721 1558518 1661278
9419 1661278 1766174 1879244 2048692 2186685 2335114 2506074 2675012 2893329 3113712 3329007
9409 3329007 3543717 3785392 4027997 4267033 4531314 4756967 4962388 5132819 5239585 5326350
9399 5326350 5369878 5354253 5280502 5195447 5047067 4920090 4823079 4682518 4517032 4441331 4375067
9388 4375067 4310285 4280651 4304457 4316647 4359096 4445641 4557676 4663005 4788634 4942451 5115324
9377 5115324 5292434 5538041 5816808 6157594 6485856 6867716 7321965 7775330 8210752 8642524
$$ packed form
9456C39321N1153L6758n6J8050p782m487M2147n81M717L1928J5166R853L9026
9443E75213J9420J460N689M1835J7132m8676K4961K3214M7057M6976P4895O2390
9431H91566P3604M5902L0382M4210L7676O2696P3501N3979Q7610O4595R2797J02760
9419A661278J04896J13070J69448J37993J48429J70960J68938K18317K20383K15295
9409C329007K14710K41675K42605K39036K64281K25653K05421J70431J06766Q6765
9399E326350M3528j5625p3751q5055j48380j26977r7011j40561j65486p5701o6264
9388D375067o4782k9634K3806J2190M2449Q6545J12035J05329J25629J53817J72873
9377E115324J77110K45607K78767L40786L28262L81860M54249M53365M35422M31772
$$ plain form
9367 8642524 9071459 9471472 9777171 9978198 10054070 10026010 9863346 9578296 9215211 8813348
9357 8813348 8398098 7954327 7529679 7111678 6730558 6418361 6187564 5901481 5633091 5392138
9347 5392138 5199757 5097345 4975597 4855221 4796248 4746218 4697735 4705404 4752388 4810534 4874432
9336 4874432 4961453 5055377 5180287 5299625 5422079 5585054 5725791 5870666 6024168 6128583
9326 6128583 6176720 6263676 6325576 6343088 6289786 6190074 6094420 5964892 5791483 5560125 5322281
9315 5322281 5064983 4781411 4438887 4157306 3866827 3602223 3361661 3160996 2952190 2765736
9305 2765736 2629140 2521533 2408561 2293724 2222662 2167511 2101946 2066936 2032450 1966218 1857780
9294 1857780 1778128 1708325 1690886 1663067 1636610 1572438 1508034 1486618 1475453 1448558 1388322
$$ packed form
9367H642524M28935M00013L05699K01027P5872k8060j62664k85050l63085m01863
9357H813348m15250m43771m24648m18001l81120l12197k30797k86083k68390k40953
9347E392138j92381j02412j21748j20376n8973n0030m8483P669M6984N8146O3898
9336D874432Q7021R3924J24910J19338J22454J62975J40737J44875J53502J04415
9326F128583M8137Q6956O1900J7512n3302r9712r5654j29528j73409k31358k37844
9315E322281k57298k83572l42524k81581k90479k64604k40562k00665k08806j86454
9305B765736j36596j07607j12972j14837p1062n5151o5565l5010l4486o6232j08438
9294A857780p9652o9803j7439k7819k6457o4172o4404k1416j1165k6895o0236
$$ plain form
9283 1388322 1372302 1343480 1282141 1248709 1212084 1196025 1161986 1142014 1116662 1087063 1102225
9272 1102225 1072914 1034879 1009872 1000774 1018007 999030 971717 974007 924826 894219 891723 871258
9260 871258 852921 850279 824564 780144 786920 773159 753548 750815 756657 760489 773324 748988 748823
9247 748823 742995 702240 693478 696782 668164 642326 643686 678218 694300 644842 611727 614424 612662
9234 612662 611172 571653 535518 506458 511217 526809 499521 465680 433002 417870 379908 382804
9222 382804 397736 403157 391430 390032 390373 406387 432574 429254 421221 397131 402701 397436 396565 405549
9208 405549 444505 424939 397682 398494 389062 395838 428302 456802 447621 444221 446304 439409 420108
9195 420108 413365 446429 516198 565458 552900 517807 526688 518431 532864 605400 647420 644051
$$ packed form
9283A388322j6020k8822o1339l3432l6625j6059l4039j9972k5352k9599J5162
9272A102225k9311l8035k5007r098J7233j8977k7313K290m9181l0607k496k0465
9260H71258j8337k642k5715m4420O776j3761j9611k733N842L832J2835k4336j65
9247G48823n828m0755q762L304k8618k5838J360L4532J6082m9458l3115K697j762
9234F12662j490l9519l6135k9060M759J5592k7288l3841l2678j5132l7962K896
9222C82804J4932N421j1727j398L41J6014K6187l320q033k4090N570n265q71Q984
9208D05549L8956j9566k7257Q12r432O776L2464K8500r181l400K083o895j9301
9195D20108o743L3064O9769M9260j2558l5093Q881q257J4433P2536M2020l369
$$ plain form
9183 644051 670988 696735 719902 768868 817952 883455 941300 979458 1051264 1157538 1257201
9172 1257201 1363163 1518070 1694045 1908688 2162946 2482472 2891955 3410693 4064879 4957592
9162 4957592 6088368 7402490 8708837 9719435 10173342 9798779 8580928 6982777 5545233
9153 5545233 4450241 3652475 3087996 2701025 2417709 2195266 2046735 1863825 1693587
9144 1693587 1575328 1481099 1406825 1316660 1271009 1218981 1156227 1094187 1016719 955252 889654
9133 889654 840806 831974 816140 802019 795333 774491 747347 727657 715297 694248 688112 697133
9121 697133 647499 628280 654572 679204 669486 658035 616186 605785 601932 591281 562900 505283
9109 505283 504737 518283 500339 484544 452447 457691 444389 421620 408280 411935 448666 462772
$$ packed form
9183F44051K6937K5747K3167M8966M9084O5503N7845L8158P1806J06274R9663
9172A257201J05962J54907J75975K14643K54258L19526M09483N18738O54186Q92713
9162D957592J130776J314122J306347J010598M53907l74563j217851j598151j437544
9153E545233j094992p97766n64479l86971k83316k22443j48531j82910j70238
9144A693587j18259r4229p4274r0165m5651n2028o2754o2040p7468o1467o5598
9133H89654m8848q832j5834j4121o686k0842k7144j9690j2360k1049o136R021
9121F97133m9634j9219K6292K4632r718j1451m1849j0401l853j0651k8381n7617
9109E05283n46J3546j7944j5795l2097N244j3302k2769j3340L655L6731J4106
$$ plain form
9097 462772 449754 456920 449615 433718 458595 462356 479178 465727 431757 440161 466841 480470
9085 480470 509780 545388 561877 564397 559849 541988 561381 626351 676844 722375 772119 818081
9073 818081 844128 853359 845176 872343 900892 944410 1000814 1083328 1159554 1233576 1287585 1345457
9061 1345457 1397681 1464345 1531810 1600746 1689328 1767877 1809137 1846430 1870619 1892642 1930265
9050 1930265 1932250 1887030 1840535 1768468 1698992 1619607 1520175 1422444 1308613 1213586 1145644
9039 1145644 1074936 1000451 956226 915995 905374 913442 871417 834929 810549 779691 714154 660366
9027 660366 628594 610385 590413 584340 564565 558881 566086 572141 583937 607941 639638 578264
9015 578264 520116 528542 539208 521342 529778 558412 547008 508020 522855 542802 561915 589008
$$ packed form
9097D62772j3018P166p305j5897K4877L761J6822j3451l3970Q404K6680J3629
9085D80470K9310L5608J6489K520m548j7861J9393O4970N0493M5531M9744M5962
9073H18081K6047R231q183K7167K8549M3518N6404Q2514P6226P4022N4009N7872
9061A345457N2224O6664O7465O8936Q8582P8549M1260L7293K4189K2023L7623
9050A930265J985m5220m6495p2067o9476p9385r9432r7731j13831r5027o7942
9039A145644p0708p4485m4225m0231j0621Q068m2025l6488k4380l0858o5537n3788
9027F60366l1772j8209j9972o073j9775n684P205O055J1796K4004L1697o1374
9015E78264n8148Q426J0666j7866Q436K8634j1404l8988J4835J9947J9113K7093
$$ plain form
9003 589008 599289 594737 604396 609175 653944 687931 707022 708174 710418 752242 834534 913643 933189
8990 933189 949374 1013650 1102369 1141663 1157737 1243439 1303303 1344595 1388416 1412268 1434526 1472042
8978 1472042 1533714 1601845 1671398 1734137 1786993 1830532 1925739 2026546 2107005 2201623 2326882
8967 2326882 2479008 2607165 2747991 2903716 3072992 3231334 3353475 3481283 3685809 3903537
8957 3903537 4146968 4382923 4670018 4998709 5334299 5721868 6124080 6585724 7119501 7673110
8947 7673110 8308826 9027834 9847279 10808690 11976082 13349427 14971668 16889328 19121307
8938 19121307 21676173 24571744 27953173 31811149 36207044 41238867 46952583 53540643
8930 53540643 61175351 70271010 81536666 96208235 115707245 142097204 178011874
$$ packed form
9003E89008J0281m552R659M779M4769L3987J9091J152K244M1824Q2292P9109J9546
8990I33189J6185O4276Q8719L9294J6074Q5702N9864M1292M3821K3852K2258L7516
8978A472042O1672O8131O9553O2739N2856M3539R5207J00807Q0459R4618J25259
8967B326882J52126J28157J40826J55725J69276J58342J22141J27808K04526K17728
8957C903537K43431K35955K87095L28691L35590L87569M02212M61644N33777N53609
8947G673110O35716P19008Q19445R61411J167392J373345J622241J917660K231979
8938A9121307K554866K895571L381429L857976M395895N031823N713716O588060
8930E3540643P634708R095659J1265656J4671569J9499010K6389959L5914670
$$ plain form
8923 178011874 225087321 280748517 336381590 380413989 401028823 385555449 330016300
8916 330016300 258440089 198572145 156472590 127866824 108221360 94470456 84595153
8909 84595153 77270273 71536066 66740918 62464762 58530665 54808922 51236415 47832665
8901 47832665 44738091 41922086 39356370 36977876 34771984 32726226 30846584 29148296
8893 29148296 27608127 26218071 24939226 23789918 22747694 21824324 20966601 20155825 19442409
8884 19442409 18816506 18202547 17609730 17099663 16641927 16175740 15737143 15317243 14929599
8875 14929599 14591118 14260089 13939064 13682629 13397352 13118966 12895479 12684928 12477404
8866 12477404 12284246 12066604 11867095 11653373 11470564 11315079 11171811 11048649 10901100
$$ packed form
8923A78011874M7075447N5661196N5633073M4032399K0614834j5473374n5539149
8916C30016300p1576211n9867944m2099555k8605766j9645464j3750904r875303
8909H4595153p324880n734207m795148m276156l934097l721743l572507l403750
8901D7832665l094574k816005k565716k378494k205892k045758j879642j698288
8893B9148296j540169j390056j278845j149308j042224r23370q57723q10776p13416
8884A9442409o25903o13959n92817n10067m57736m66187m38597m19900l87644
8875A4929599l38481l31029l21025k56435k85277k78386k23487k10551k07524
8866A2477404j93158k17642j99509k13722j82809j55485j43268j23162j47549
$$ plain form
8857 10901100 10758217 10666848 10614295 10522233 10423388 10358757 10289693 10253591 10204890 10129242 10120193
8846 10120193 10149810 10171619 10213362 10241424 10306176 10365970 10447831 10573978 10599137 10530451 10445386
8835 10445386 10299340 10098664 9883274 9649469 9424576 9165915 8900822 8632165 8375495
8826 8375495 8111920 7877333 7652643 7394853 7165443 6965592 6784127 6607941 6451380 6296016
8816 6296016 6147051 6001974 5865080 5749212 5622107 5501104 5402709 5334867 5292137 5188063
8806 5188063 5071706 4974321 4869868 4810666 4764362 4698154 4671538 4638297 4570215 4439053 4301960
8795 4301960 4106186 3925911 3813448 3733215 3613478 3484281 3383026 3260047 3088937 2937131
8785 2937131 2791707 2657521 2514776 2377652 2266048 2175154 2117324 2025233 1936123 1848232
$$ packed form
8857A0901100j42883r1369n2553r2062r8845o4631o9064l6102m8701p5648r049
8846A0120193K9617K1809M1743K8062O4752N9794Q1861J26147K5159o8686q5065
8835A0445386j46046k00676k15390k33805k24893k58661k65093k68657k56670
8826H375495k63575k34587k24690k57790k29410j99851j81465j76186j56561j55364
8816F296016j48965j45077j36894j15868j27105j21003r8395o7842m2730j04074
8806E188063j16357r7385j04453n9202m6304o6208k6616l3241o8082j31162j37093
8795D301960j95774j80275j12463q0233j19737j29197j01255j22979j71110j51806
8785B937131j45424j34186j42745j37124j11604r0894n7830r2091q9110q7891
$$ plain form
8775 1848232 1783454 1710033 1607319 1510546 1447786 1404223 1354638 1276502 1201916 1134919 1051683
8764 1051683 989435 934331 922780 925426 921152 914560 885348 820500 784229 763737 751370 711576
8752 711576 677932 681196 704883 680403 633431 601639 596155 584394 558701 549291 543569 565554
8740 565554 573360 562379 547855 559209 565753 548089 515824 515039 505914 483394 469712 459979 439292
8727 439292 424896 437573 452522 427182 433081 458736 467532 480656 482989 472043 482696 434029
8715 434029 428006 436159 450072 492978 519857 523513 551248 616241 657009 668009 674881 709975
8703 709975 727951 731868 764347 783645 775661 750684 722639 728540 787481 798554 803521 785628
8691 785628 757274 767602 788503 802258 826365 807379 813734 832363 851571 870828 868173 830094
$$ packed form
8775A848232o4778p3421j02714r6773o2760m3563m9585p8136p4586o6997q3236
8764A051683o2248n5104j1551K646m274o592k9212o4848l6271k0492j2367l9794
8752G11576l3644L264K3687k4480m6972l1792n484j1761k5693r410n722K1985
8740E65554P806j0981j4524J1354O544j7664l2265p85r125k2520j3682r733k0687
8727D39292j4396J2677J4949k5340N899K5655Q796J3124K333j0946J0653m8667
8715D34029o023Q153J3913M2906K6879L656K7735O4993M0768J1000O872L5094
8703G09975J7976L917L2479J9298p984k4977k8045N901N8941J1073M967j7893
8691G85628k8354J0328K0901J3755K4107j8986O355J8629J9208J9257k655l8079
$$ plain form
8679 830094 817406 805513 785192 774508 770498 762409 787574 784542 771938 751234 743590 711255
8667 711255 688065 671317 697206 702718 658497 618695 613077 639121 619576 604103 616490 625121
8655 625121 642952 678520 662220 631237 587393 571174 592608 604221 638844 634056 587465 601935
8643 601935 610657 623306 619481 567770 548389 545665 513274 500695 509785 493052 447933 426159
8631 426159 413937 412277 400319 371208 327915 309357 335271 352624 362941 352304 343969 364200
8619 364200 355800 324535 296993 334386 339747 347272 353411 316402 284932 273696 284414 309541
8607 309541 284611 265724 246671 242610 267351 285548 272828 256416 221357 189873 194782 218330
8595 218330 223040 250428 278673 285273 268304 258032 238529 209375 190724 171740 176833 171395
$$ packed form
8679H30094j2688j1893k0321j0684m010q089K5165l032j2604k0704p644l2335
8667G11255k3190j6748K5889N512m4221l9802n618K6044j9545j5473J2387Q631
8655F25121J7831L5568j6300l0983m3844j6219K1434J1613L4623m788m6591J4470
8643F01935Q722J2649l825n1711j9381k724l2391j2579R090j6733m5119k1774
8631D26159j2222j660j1958k9111m3293j8558K5914J7353J0317j0637q335K0231
8619C64200q400l1265k7542L7393N361P525O139l7009l1470j1236J0718K5127
8607C09541k4930j8887j9053m061K4741J8197j2720j6412l5059l1484M909K3548
8595B18330M710K7388K8245O600j6969j0272j9503k9154j8651j8984N093n438
$$ plain form
8583 171395 177119 184852 213653 234293 223941 226785 224298 212602 213542 231824 265840 253509 219545
8570 219545 229353 239052 234940 214110 226474 228414 262374 278341 276886 280214 294445 297151 298235
8557 298235 303307 299094 309399 304264 297081 292866 315911 333340 338358 339970 306909 281320 301554
8544 301554 339533 356084 349314 374878 381578 382961 413204 405779 391799 380633 410403 439768
8532 439768 452123 456974 469393 504415 592146 679460 774946 869830 938875 1027355 1152690 1258297
8520 1258297 1377379 1482637 1607544 1663746 1692325 1743744 1731223 1652845 1548137 1412542
8510 1412542 1302683 1218129 1094572 963710 854152 774356 685217 650700 635882 599057 557541
8499 557541 525430 501519 475441 453122 450597 448724 450274 445921 421566 387062 343903 327933
$$ packed form
8583A71395N724P733K8801K0640j0352K844k487j1696R40J8282L4016j2331l3964
8570B19545R808R699m112k0830J2364J940L3960J5967j455L328J4231K706J084
8557B98235N072m213J0305n135p183m215K3045J7429N018J612l3061k5589K0234
8544C01554L7979J6551o770K5564O700J383L0243p425j3980j1166K9770K9365
8532D39768J2355M851J2419L5022Q7731Q7314R5486R4884O9045Q8480J25335J05607
8520A258297J19082J05258J24907N6202K8579N1419j2521p8378j04708j35595
8510A412542j09859q4554j23557j30862j09558p9796q9139l4517j4818l6825m1516
8499E57541l2111k3911k6078k2319k525j873J550m353k4355l4504m3159j5970
$$ plain form
8487 327933 335576 356925 356010 353960 336388 336772 357077 339127 315459 288789 279336 274313 261110
8474 261110 227940 183857 169642 149172 147801 187494 210426 192835 191828 202128 198815 189954
8462 189954 202904 200098 176990 182174 168965 150856 164796 181166 169439 143536 146018 137593
8450 137593 142631 122123 134904 168139 166980 158424 180278 170670 150828 167423 162846 143029 124026
8437 124026 112957 97202 100814 113356 113196 120271 140143 159199 162058 174761 175478 174323 173541 151178
8423 151178 155687 165648 157616 138262 134429 135511 134815 133630 146815 133283 114058 123130 126928 119599
8409 119599 127904 141207 143097 156114 164926 179256 185433 167262 144112 142959 165162 196140 193008
8396 193008 179692 171006 164822 178894 157772 141792 142726 159860 153466 164811 157970 159685 169609
$$ packed form
8487C27933P643K1349r15k050j7572L84K0305j7950k3668k6670r453n023j3203
8474B61110l3170m4083j4215k0470j371L9693K2932j7591j007J0300l313q861
8462A89954J2950k806k3108N184j3209j8109J3940J6370j1727k5903K482q425
8450A37593N038k0508J2781L3235j159q556K1854r608j9842J6595m577j9817j9003
8437A24026j1069j5755L612J2542j60P075J9872J9056K859J2703P17j155p82k2363
8423A51178M509R961q032j9354l833J082o96j185J3185j3532j9225R072L798p329
8409A19599Q305J3303J890J3017Q812J4330O177j8171k3150j153K2203L0978l132
8396A93008j3316q686o184J4072k1122j5980R34J7134o394J1345o841J715R924
$$ plain form
8383 169609 194930 196892 159092 144917 125482 123799 143725 114645 103192 112409 99192 96194
8371 96194 103933 121975 135569 149540 139440 148266 153491 119494 85770 90384 93211 108208 139768
8358 139768 142635 152276 143162 127233 115413 99950 91594 84652 93670 82144 74722 74617 89627
8345 89627 103087 104988 76829 93400 105649 124621 140580 124914 79633 40302 65862 70005
8333 70005 73364 48259 74145 88782 84326 52814 54879 69040 96774 127210 109580 78309
8321 78309 87756 77379 69497 74401 75290 77348 74839 49960 29923 27036 52531 58011 75820 87501
8307 87501 86685 65498 53319 49955 50486 56618 69491 77376 79156 60361 41179 42356 70679 49339
8293 49339 4076 5037 32222 30558 62965 85327 53944 40747 44784 21760 27107 49590 54735
$$ packed form
8383A69609K5321J962l7800j4175j9435j683J9926k9080j1453R217j3217k998
8371I6194P739J8042J3594J3971j0100Q826N225l3997l3724M614K827J4997L1560
8358A39768K867R641r114j5929j1820j5463q356o942R018j1526p422j05J5010
8345H9627J3460J901k8159J6571J2249J8972J5959j5666m5281l9331K5560M143
8333G0005L359k5105K5886J4637m456l1512K065J4161K7734L0436j7630l1271
8321G8309R447j0377p882M904Q89K058k509k4879k0037k887K5495N480J7809J1681
8307H7501q16k1187j2179l364N31O132J2873P885J780j8795j9182J177K8323k1340
8293D9339m5263R61K7185j664L2407K2362l1383j3197M037k3024N347K2483N145
$$ plain form
8280 54735 37980 24395 20887 33274 66070 56705 58388 34419 33296 36215 48223 27040 29109
8267 29109 68931 83521 86253 88874 69974 44738 32546 32535 52416 23563 11846 52973 83793
8254 83793 71313 90438 98353 67079 48876 57589 70907 77246 61455 50820 50328 70324 90258
8241 90258 91041 76162 88924 108064 108424 130546 112919 93683 109347 82607 66387 81124 91466
8228 91466 104262 129874 171759 149625 111385 66110 73963 98126 114160 123103 95201 89980
8216 89980 69506 57501 31378 25051 53659 76090 50302 65381 79186 85309 76288 64933
8204 64933 70312 78946 42468 32094 71052 56129 44712 66398 57568 24023 -29793 -19759
8192 -19759 24385 39949 45362 58079 45834 43320 14122 5218 9466 30677 41622 10047 6868
$$ packed form
8280E4735j6755j3585l508J2387L2796r365J683k3969j123K919J2008k1183K069
8267B9109L9822J4590K732K621j8900k5236j2192j1J9881k8853j1717M1127L0820
8254H3793j2480J9125P915l1274j8203Q713J3318O339j5791j0635m92J9996J9934
8241I0258P83j4879J2762J9140L60K2122j7627j9236J5664k6740j6220J4737J0342
8228I1466J2796K5612M1885k2134l8240m5275P853K4163J6034Q943k7902n221
8216H9980k0474j2005k6123o327K8608K2431k5788J5079J3805O123r021j1355
8204F4933N379Q634l6478j0374L8958j4923j1417K1686q830l3545n3816J0034
8192a9759M4144J5564N413J2717j2245k514k9198q904M248K1211J0945l1575l179
$$ plain form
8179 6868 -7621 783 -8338 21416 59055 41811 45525 32077 5338 10291 36260 63348 61622
8166 61622 49600 67640 99928 106388 104064 69444 55843 51362 69742 96830 72920 46788
8154 46788 53630 68040 64545 24081 -8209 4660 21838 26432 24808 41092 51527 29601 25968
8141 25968 55045 67227 62433 38080 41386 21342 9019 17929 54062 72515 48903 43740 57022
8128 57022 70920 60557 53676 79200 111754 82584 87198 99384 99059 80030 100863 99229 77483
8115 77483 66967 34852 16625 28833 24600 38342 53096 37426 40450 -16764 -29619 8999
8103 8999 37939 23902 13889 51833 51751 44334 5544 9364 33553 65238 99046 122170 110815
8090 110815 87468 103792 102681 99319 52972 11402 21300 33603 77026 92682 67763 76094
$$ packed form
8179F868j4489Q404r121K9754L7639j7244L714j3448k6739M953K5969K7088j726
8166F1622j2022J8040L2288O460k324l4620j3601m481J8380K7088k3910k6132
8154D6788O842J4410l495m0464l2290J2869J7178M594j624J6284J0435k1926l633
8141B5968K9077J2182m794k4353L306k0044j2323Q910L6133J8453k3612n163J3282
8128E7022J3898j0363o881K5524L2554k9170M614J2186l25j9029K0833j634k1746
8115G7483j0516l2115j8227J2208m233J3742J4754j5670L024n7214j2855L8618
8103H999K8940j4037j0013L7944q2p417l8790L820K4189L1685L3808K3124j1355
8090A10815k3347J6324j111l362m6347m1570R898J2303M3423J5656k4919Q331
$$ plain form
8078 76094 114523 125801 101150 92953 101975 118601 109017 109821 75344 49316 29005 18383 41258
8065 41258 34087 28041 13664 10996 -10974 -36162 -27499 4324 21676 32040 47090 61516 76480
8052 76480 57424 34391 36348 64218 71276 67055 48370 50318 74890 103163 135001 121574 113496
8039 113496 113800 107721 83759 98451 81671 43333 8643 13759 34429 24779 24061 23975 40462 33772
8025 33772 24070 43031 67798 91102 111290 121127 86388 74840 79258 57509 54592 34336 27977
8012 27977 51576 56559 19248 48182 60215 60721 62201 55805 78378 73415 72121 82153 56373
7999 56373 48186 90330 72978 83338 79075 41798 30666 32640 28731 14407 48217 74725 64516
7986 64516 40588 28821 20846 25955 39820 47133 52515 69777 84927 80836 70331 53289 19227
$$ packed form
8078G6094L8429J1278k4651q197R022J6626r584Q04l4477k6028k0311j0622K2875
8065D1258p171o046j4377k668k1970k5188Q663L1823J7352J0364J5050J4426J4964
8052G6480j9056k3033J957K7870P058m221j8685J948K4572K8273L1838j3427q078
8039A13496L04o079k3962J4692j6780l8338l4690N116K0670r650p18q6J6487o690
8025C3772r702J8961K4767K3304K0188R837l4739j1548M418k1749k917k0256o359
8012B7977K3599M983l7311K8934J2033N06J480o396K2573m963j294J0032k5780
7999E6373q187M2144j7352J0360m263l7277j1132J974l909j4324L3810K6508j0209
7986F4516k3928j1767p975N109J3865P313N382J7262J5150m091j0505j7042l4062
$$ plain form
7973 19227 7338 -1031 10931 -2820 4668 24103 40262 24900 37456 65255 65075 50980 44977
7960 44977 16285 7188 29974 64383 56848 60717 64193 74166 92885 78560 66793 54400 55451
7947 55451 60617 58993 56583 54621 85489 108743 93883 86856 75900 96317 93972 75894 81183
7934 81183 75618 47882 43348 31033 50106 31229 50006 100482 109566 97792 102483 98796 92420
7921 92420 113250 106990 98479 93023 79985 36689 11303 44945 65097 79635 69246 89200
7909 89200 101740 123289 89626 47737 67421 50544 38690 73517 60487 67908 62888 71583
7897 71583 84620 61217 29699 21390 24389 43443 66209 59612 64426 51434 49950 72815 56223
7884 56223 51769 51440 27194 11091 -3140 12919 56520 76768 50455 45118 47299 46987 23821
$$ packed form
7973A9227j1889q369J1962j3751P488J9435J6159j5362J2556K7799j80j4095o003
7960D4977k8692r097K2786L4409p535L869L476R973J8719j4325j1767j2393J051
7947E5451N166j624k410j962L0868K3254j4860p027j0956K0417k345j8078N289
7934H1183n565k7736m534j2315J9073j8877J8777N0476R084j1774M691l687o376
7921I2420K0830o260q511n456j3038m3296k5386L3642K0152J4538j0389J9954
7909H9200J2540K1549l3663m1889J9684j6877j1854L4827j3030P421n020Q695
7897G1583J3037k3403l1518q309K999J9054K2766o597M814j2992j484K2865j6592
7884E6223m454l29k4246j6103j4231J6059M3601K0248k6313n337K181l12k3166
$$ plain form
7871 23821 7481 23505 39328 36041 28203 222 11003 46002 71411 52423 45227 47899 59081
7858 59081 51684 24814 18602 16611 26232 25630 10798 11708 -3347 24441 27463 35849 16910 -11592
7844 -11592 -42946 -27595 -9585 7927 -12321 -5658 6743 27065 27620 20647 23889 15363 23024
7831 23024 54205 46868 60173 62030 40871 41054 36279 39796 7378 -778 -14518 -13119 6890
7818 6890 3223 3888 19746 9667 15683 40801 53435 56513 53368 76395 76101 55974 16291 1523
7804 1523 25283 51619 43178 57430 102926 80111 67205 52406 52816 34760 3667 -970 19257
7791 19257 42953 40745 25449 44320 5292 -2659 3072 -4734 6403 35844 65685 54482 39562
7778 39562 18802 -10077 4909 -4262 4520 7503 -5811 9939 9542 -2123 -9550 -15018 -24953
$$ packed form
7871B3821j6340J6024J5823l287p838k7981J0781L4999K5409j8988p196K672J1182
7858E9081p397k6870o212j991R621o02j4832R10j5055K7788L022Q386j8939k8502
7844a1592l1354J5351J8010J7512k0248O663J2401K0322N55o973L242q526P661
7831B3024L1181p337J3305J857k1159J83m775L517l2418q156j3740J399K0009
7818F890l667O65J5858j0079O016K5118J2634L078l145K3027k94k0127l9683j4768
7804A523K3760K6336q441J4252M5496k2815j2906j4799M10j8056l1093m637K0227
7791A9257K3696k208j5296J8871l9028p951N731p806J1137K9441K9841j1203j4920
7778C9562k0760k8879J4986r171Q782K983j3314J5750l97j1665p427n468r935
$$ plain form
7765 -24953 -14843 -8890 -19073 -3004 -10553 -5479 -13996 -21649 10504 36467 29076 -3035 -29612
7752 -29612 -21039 -4356 -8509 -24845 -28698 -25901 -11540 11671 11621 10258 10247 15892 35591 53023
7738 53023 65802 77205 80479 44496 37302 29193 32973 45757 59415 42782 28146 39461 28842
7725 28842 35836 12760 -20295 -23491 -33097 -39434 -18443 26761 34703 22867 28267 48016 49279
7712 49279 68512 77001 79859 59566 11026 -19489 -19718 4750 20446 37917 31826 42673 28590
7699 28590 18195 31291 25027 15432 19482 -1347 531 -8507 -1648 9996 32050 18970 29161
7686 29161 48358 54934 32638 43327 40411 15137 -4891 -14282 -27818 -7983 29889 15887
7674 15887 -802 20284 1614 -15250 -28398 -49172 -46444 811 15372 2153 -22316 -63846
$$ packed form
7765b4953J0110N953j0183J6069p549N074q517p653L2153K5963p391l2111k6577
7752b9612Q573J6683m153j6336l853K797J4361K3211n0j363j1N645J9699J7432
7738E3023J2779J1403L274l5983p194q109L780J2784J3658j6633j4636J1315j0619
7725B8842O994k3076l3055l196r606o337K0991M5204P942j1836N400J9749J263
7712D9279J9233Q489K858k0293m8540l0515k29K4468J5696J7471o091J0847j4083
7699B8590j0395J3096o264r595M050k0829J878r038O859J1644K2054j3080J0191
7686B9161J9197O576k2296J0689k916k5274k0028r391j3536J9835L7872j4002
7674A5887j6689K1086j8670j6864j3148k0774K728M7255J4561j3219k4469m1530
$$ plain form
7662 -63846 -61529 -41001 -32127 -16272 -11744 -24005 9183 32536 28151 26893 35802 31078 12442
7649 12442 -8492 -4004 16535 -5168 -9736 -7376 8025 25691 36886 45315 51851 35894 19288
7636 19288 35012 40848 46281 37223 32722 39818 -16366 -31691 -10470 -45847 -56391 -45993 -25202
7623 -25202 -40090 -35050 2576 21401 60003 70290 27869 27011 27392 -3191 -29974 -28885 -20119
7610 -20119 -9215 -17605 -19503 -14290 -24870 -20148 -18019 14610 1682 -17024 -9109 -4872 -2618
7597 -2618 -14623 -11934 -7039 21575 45553 59961 51926 69016 53400 33245 -831 -34133 -31767
7584 -31767 -26173 -26683 -166 15575 -8472 -8436 -4948 -14191 2493 -20990 -51326 -19018 -5512
7571 -5512 -8465 625 -24367 -24960 1955 39127 43159 30022 32097 30479 7588 -12604 -5737 28418
$$ packed form
7662f3846K317K0528Q874J5855M528j2261L3188K3353m385j258Q909m724j8636
7649A2442k0934M488K0539k1703m568K360J5401J7666J1195Q429O536j5957j6606
7636A9288J5724N836N433r058m501P096n6184j5325K1221l5377j0544J0398K0791
7623b5202j4888N040L7626J8825L8602J0287m2421q58L81l0583k6783J089Q766
7610b0119J0904q390j898N213j0580M722K129L2629j2928j8706P915M237K254
7597b618j2005K689M895K8614K3978J4408q035J7090j5616k0155l4076l3302K366
7584c1767N594n10K6517J5741k4047L6L488r243J6684k3483l0336L2308J3506
7571e512k953R090k4992n93K6915L7172M032j3137K075j618k2891k0192O867L4155
$$ plain form
7557 28418 36954 -9133 -23237 -14486 -6770 -9908 16859 18421 19403 67129 64914 23568 31460 66806
7543 66806 48356 -16230 -9660 9989 14174 19255 8440 14198 24468 27947 38231 35150 37286
7530 37286 39176 43445 33582 33847 5120 -1328 33928 44519 36472 16635 -5134 -1612 12828
7517 12828 -13780 -27188 3829 13095 -5594 -23267 -55260 -53400 -65169 -48811 -34131 -22534
7505 -22534 -8213 25632 16872 -25639 -35421 -21430 -24156 -15432 -11572 -19970 11789 39895 20206
7492 20206 1269 24463 36869 22611 8416 2923 19636 26330 4676 -14068 -19742 -31510
7480 -31510 -29862 -40405 -36764 -18473 -18769 9434 20788 14896 26368 19254 -7382 -37342 -17001
7467 -17001 -17912 -4247 -4874 -4396 20684 8903 35290 37955 16672 3001 -23418 -23801 5465 15779
$$ packed form
7557B8418Q536m6087j4104Q751P716l138K6767J562R82M7726k215m1346P892L5346
7543F6806j8450o4586O570J9649M185N081j0815N758J0270L479J0284l081K136
7530C7286J890M269r863K65k8727o448L5256J0591q047j9837k1769L522J4440
7517A2828k6608j3408L1017R266j8689j7673l1993J860j1769J6358J4680J1597
7505b2534J4321L3845q760m2511r782J3991k726Q724L860q398L1759K8106j9689
7492B0206j8937K3194J2406j4258j4195n493J6713O694k1654j8744n674j1768
7480c1510J648j0543L641J8291k96K8203J1354n892J1472p114k6636k9960K0341
7467a7001r11J3665o27M78K5080j1781K6387K665k1283j3671k6419l83K9266J0314
$$ plain form
7453 15779 -13362 -6909 14399 2952 15107 17297 22815 31138 51158 53188 40461 34643 22008
7440 22008 35425 32957 21182 -6483 -5464 6913 6249 -25016 -40394 -29639 -21581 -41710 -31277
7427 -31277 -2045 13423 -2904 -43998 -43909 -8605 -9753 -31125 -35294 -9199 18438 22758 39754
7414 39754 43093 38422 52902 45979 35991 41088 33652 42380 45912 46069 51376 30344 19680 11896
7400 11896 41121 69389 65072 37371 31054 52553 59916 45962 47791 49425 28463 -13596 -32112
7387 -32112 -4578 -4051 17416 22410 15765 15501 9856 36510 38610 12339 42894 50288 41822 -1908
7373 -1908 -11953 736 11770 46771 44413 17605 5814 26755 14087 -19027 -14227 2455
7361 2455 -12515 -10372 8639 12727 15536 -2808 -10396 18318 19488 18870 20762 30910 41484 -3021
$$ packed form
7453A5779k9141O453K1308j1447J2155K190N518Q323K0020K030j2727n818j2635
7440B2008J3417k468j1775k7665J019J2377o64l1265j5378J0755Q058k0129J0433
7427c1277K9232J5468j6327m1094Q9L5304j148k1372m169K6095K7637M320J6996
7414C9754L339m671J4480o923r988N097p436Q728L532J57N307k1032j0664p784
7400A1896K9225K8268m317k7701o317K1499P363j3954J829J634k0962m2059j8516
7387c2112K7534N27K1467M994o645k64n645K6654K100k6271L0555P394q466m3730
7373a908j0045J2689J1034L5001k358k6808j1791K0941j2668l3114M800J6682
7361B455j4970K143J9011M088K809j8344p588K8714J170o18J892J0148J0574m4505
$$ plain form
7347 -3021 -39217 -39646 -15251 -19755 -68008 -66426 -50311 -35890 684 30718 25929 14484 1974
7334 1974 -24913 -40148 -32717 -28760 -17338 1114 17059 21886 32574 27187 7960 9159 35823
7321 35823 53632 23815 -18153 -33476 -22765 -406 16034 13755 27675 43633 15742 17822
7309 17822 41552 62524 51914 16903 -2142 -17408 -1548 8272 -4148 29239 47588 36202
7297 36202 29265 17526 -4129 -8943 7315 1441 8572 11082 16315 474 -1774 -21315 -39489
7284 -39489 -56051 -56540 -72073 -58091 -38829 -20225 -38595 -75500 -53794 -25869 -10900 -37938
7272 -37938 -21091 -8516 -11254 -28360 -20611 6342 23849 58190 68265 84471 79243 42058
7260 42058 20215 28124 -505 -8635 15270 41048 35618 26489 32813 20286 14651 15581 -11659
$$ packed form
7347c021l6196m29K4395m504m8253J582J6115J4421L6574L0034m789j1445j2510
7334A974k6887j5235P431L957J1422J8452J5945M827J0688n387j9227J199K6664
7321C5823J7809k9817m1968j5323J0711K2359J6440k279J3920J5958k7891K080
7309A7822K3730K0972j0610l5011j9045j5266J5860R820j2420L3387J8349j1386
7297C6202o937j1739k1655m814J6258n874P131K510N233j5841k248j9541j8174
7284c9489j6562m89j5533J3982J9262J8604j8370l6905K1706K7925J4969k7038
7272c7938J6847J2575k738j7106P749K6953J7507L4341J0075J6206n228l7185
7260D2058k1843P909k8629q130K3905K5778n430r129O324j2527n635R30k7240
$$ plain form
7247 -11659 -18512 -21009 -6329 17565 -13063 -51728 -33820 -24969 -28163 -40745 -52609 -23913 24363
7234 24363 13385 -15264 21061 21510 2528 3173 -1262 -4198 -33236 -30030 -37864 -35412 -43546 -13879
7220 -13879 1229 8405 25090 8113 27116 19441 -7801 -9248 8510 8220 -4580 -26680 -5072
7207 -5072 -5550 -18304 -15082 -7729 -5202 32117 52572 78626 73870 66710 49700 17764 -5285
7194 -5285 5282 22521 37029 45794 29240 5669 323 17248 -11180 -50623 -59639 -43494 -2097
7181 -2097 21428 20788 35051 43894 26284 29694 29979 25951 25050 25508 41591 50074 50792 48162 48155 9249
7165 9249 -962 -2444 -32392 -26561 -32447 -6865 23477 17843 -254 -5921 4141 -7012 -26654
7152 -26654 2046 -438 -40372 -9077 9249 -799 -6630 21528 40655 42512 43084 45086 20565
$$ packed form
7247a1659o853k497J4680K3894l0628l8665J7908Q851l194j2582j1864K8696M8276
7234B4363j0978k8649L6325M49j8982O45m435k936k9038L206p834K452q134K9667
7220a3879J5108P176J6685j6977J9003p675k7242j447J7758k90j2800k2100K1608
7207e072m78j2754L222P353K527L7319K0455K6054m756p160j7010l1936k3049
7194e285J0567J7239J4508Q765j6554k3571n346J6925k8428l9443r016J6145M1397
7181b097K3525o40J4263Q843j7610L410K85m028r01M58J6083Q483P18k630pl8906
7165I249j0211j482k9948N831n886K5582L0342n634j8097n667J0062j1153j9642
7152b6654K8700k484l9934L1295J8326j0048n831K8158J9127J857N72K002k4521
$$ plain form
7139 20565 7001 17508 -7951 -20176 -38967 -48044 -47574 -43967 -40946 -18856 -1941 -11971 -35748
7126 -35748 -40581 -17656 -27440 -23442 -1503 3406 6183 22959 19010 -6147 -12131 -17551 -43092
7113 -43092 -57330 -69372 -53321 8438 19158 9228 24099 33277 24904 1138 -367 -22523 -16681
7100 -16681 -3720 -22252 -46058 -44015 -13666 -19385 -39153 -11600 10506 28153 3745 11190
7088 11190 22095 20535 28265 34220 27044 16890 13031 20384 304 -24632 -4900 -7368 -12264
7075 -12264 -37958 -56876 -42718 -45536 -50985 -28330 -13064 10554 31727 22008 4628 1319 -8944
7062 -8944 -50934 -45675 -37867 -24861 3625 17196 24827 14418 21500 34318 28078 7347 -13043
7049 -13043 -33522 -43261 -43044 -36084 20511 41089 -8852 -8641 13862 19966 23561 27024 5060 -23185
$$ packed form
7139B0565j3564J0507k5459j2225j8791r077M70L607L021K2090J6915j0030k3777
7126c5748m833K2925r784L998K1939M909K777J6776l949k5157n984n420k5541
7113d3092j4238j2042J6051O1759J0720r930J4871R178q373k3766j505k2156N842
7100a6681J2961j8532k3806K043L0349n719j9768K7553K2106J7647k4408P445
7088A1190J0905j560P730N955p176j0154l859P353k0080k4936J9732k468m896
7075a2264k5694j8918J4158k818n449K2655J5266K3618K1173r719j7380l309j0263
7062h944m1990N259P808J3006K8486J3571P631j0409P082J2818o240k0731k0390
7049a3043k0479r739K17O960N6595K0578m9941K11K2503O104L595L463k1964k8245
$$ plain form
7035 -23185 -3367 16514 -17577 -44855 -22811 -28256 -45843 -40295 -9389 1851 -18404 -49699
7023 -49699 -39095 -19487 1100 15289 21593 -31618 -34103 -22228 -21580 -20397 -20509 3051 7228
7010 7228 7885 -2941 -223 -2704 -6553 8853 14235 -18597 -46697 -57057 -66404 -40666 -8540
6997 -8540 24595 14790 3422 -1306 -12262 -3721 16165 10410 33170 29048 27610 3900 2860
6984 2860 11712 6829 -286 2424 820 21149 43065 48065 35378 51615 62271 49645 32871
6971 32871 11904 -16291 -46116 -31683 -13398 -29934 -9481 -4241 -17482 -15294 -25365 -38490
6959 -38490 -29992 -18901 8530 -5050 3958 -8402 -28260 -26733 -22926 -24440 -40316 -55268 -36140
6946 -36140 -9545 5290 319 13540 13417 13744 12359 12480 20722 23261 6925 -113 10734 33657
$$ packed form
7035b3185J9818J9881l4091k7278K2044n445j7587N548L0906J1240k0255l1295
7023d9699J0604J9608K0587J4189O304n3211k485J1875O48J183j12K3560M177
7010G228O57j0826K718k481l849J5406N382l2832k8100j0360r347K5738L2126
6997h540L3135r805j1368m728j0956Q541J9886n755K2760m122j438k3710j040
6984B860Q852m883p115K710j604K0329K1916N000j2687J6237J0656j2626j6774
6971C2871k0967k8195k9825J4433J8285j6536K0453N240j3241K188j0071j3125
6959c8490Q498J1091K7431j3580R008j2360j9858J527L807j514j5876j4952J9128
6946c6140K6595J4835m971J3221j23L27j385J21Q242K539j6336p038J0847K2923
$$ plain form
6932 33657 6705 27433 35839 48137 25054 3125 16149 31483 29697 22481 37490 34606 -10743
6919 -10743 -42918 -46715 -49482 -54010 -68986 -71430 -61611 -34384 -9699 -5056 8870 33230 21882
6906 21882 6848 21800 29441 39290 52116 12798 -18786 -32877 15682 47729 35774 30827
6894 30827 24179 4140 -3651 -25811 -18310 -11439 -1700 39880 13975 8168 199 9409 5213 7183
6880 7183 -3870 -12568 -10930 -25784 4164 2260 -14615 -27843 -35076 -56298 -70534 -64394 -53332
6867 -53332 -62125 -75746 -44144 -32809 -35040 -14071 -25558 -35525 -25744 1891 -945 22276 26299
6854 26299 48706 42068 6121 -9214 -23672 -19780 -6779 11715 40253 74275 84914 66451
6842 66451 28516 16394 9367 -24762 -36768 -47074 -42257 -9128 17679 32692 -5032 6722
$$ packed form
6932C3657k6952K0728Q406J2298k3083k1929J3024J5334j786p216J5009k884m5349
6919a0743l2175l797k767m528j4976k444R819K7227K4685M643J3926K4360j1348
6906B1882j5034J4952P641R849J2826l9318l1584j4091M8559L2047j1955m947
6894C0827o648k0039p791k2160P501O871R739M1580k5905n807p969R210m196J970
6880G183j1053q698J638j4854K9948j904j6875j3228p233k1222j4236O140J1062
6867e3332q793j3621L1602J1335k231K0969j1487r967R781K7635k836K3221M023
6854B6299K2407o638l5947j5335j4458L892J3001J8494K8538L4022J0639j8463
6842F6451l7935j2122p027l4129j2006j0306M817L3129K6807J5013l7724J1754
$$ plain form
6830 6722 32067 41202 35504 30217 52198 88884 35325 -42092 -54957 -40336 -18190 8864 25453
6817 25453 11683 -16023 -46357 -73316 -45678 -4156 -6746 -17222 -56041 -74089 -41337 13567
6805 13567 6042 4471 25659 49756 59904 964 -27383 -4831 10517 -7676 -18446 -29263
6793 -29263 -37470 -27069 -25003 -12361 -3661 5522 -9763 -11113 -17716 -12499 543 8921 3400 -26360
6779 -26360 -31376 -24969 6675 3142 10461 13108 617 12227 37538 55507 61070 44855 34592
6766 34592 17544 23817 28682 46732 50059 34488 25193 24412 26234 9727 -8307 12458 15636
6753 15636 11133 26178 7295 -1574 34743 41647 24755 23952 33695 34594 60475 60665 24441 -15421
6739 -15421 -20330 -6445 -10885 -830 -756 -30484 -16294 14085 878 8413 18510 -1160 -23996
$$ packed form
6830F722K5345R135n698n287K1981L6686n3559p7417j2865J4621K2146K7054J6589
6817B5453j3770k7706l0334k6959K7638M1522k590j0476l8819j8048L2752N4904
6805A3567p525j571K1188K4097J0148n8940k8347K2552J5348j8193j0770j0817
6793b9263q207J0401K066J2642Q700R183j5285j350o603N217J3042Q378n521k9760
6779b6360n016O407L1644l533P319K647j2491J1610K5311J7969N563j6215j0263
6766C4592j7048O273M865J8050L327j5571r295p81J822j6507j8034K0765L178
6753A5636m503J5045j8883q869L6317O904j6892q03R743Q99K5881J90l6224l9862
6739a5421m909J3885m440J0055P4k9728J4190L0379j3207P535J0097j9670k2836
$$ plain form
6726 -23996 -30471 -7923 -10848 -45409 -37811 -3140 12958 27224 30415 37981 28330 6245 -25
6713 -25 42625 68825 67374 79442 55701 50426 55731 48244 12029 13959 22842 6160 2329 22159
6699 22159 3531 -11912 11922 40198 37729 20845 -3473 -32194 -22298 -37184 -24801 -25989
6687 -25989 -40519 -20624 11435 14152 -12489 -11095 -49799 -31659 11367 -5452 -23420 -9474
6675 -9474 -5406 -12820 -20116 -23802 -1609 1860 -20175 -22001 -27255 -34690 -21081 -20984 1083 -4995
6661 -4995 -13907 -14356 -38135 -65794 -49597 -597 -6390 -22188 -14395 -14885 -14478 -5639 11114 -15779
6647 -15779 -9024 18274 959 589 11742 2923 15447 1226 -46407 -41602 -351 17406 -4839
6634 -4839 3668 21260 31239 27572 19238 7960 11950 9953 -21781 -12895 527 -29329 -33471 -56579
$$ packed form
6726b3996o475K2548k925l4561P598L4671J6098J4266L191P566r651k2085o270
6713b5M2650K6200j451J2068k3741n275N305p487l6215J930Q883j6682l831J9830
6699B2159j8628j5443K3834K8276k469j6884k4318k8721R896j4886J2383j188
6687b5989j4530J9895L2059K717k6641J394l8704J8140M3026j6819j7968J3946
6675i474M068p414p296l686K2193L469k2035j826n254p435J3609R7K2067o078
6661d995q912m49k3779k7659J6197M9000n793j5798P793m90M07Q839J6753k6893
6647a5779O755K7298j7315l70J1153q819J2524j4221m7633M805M1251J7757k2245
6634d839Q507J7592R979l667q334j1278L990j997l1734Q886J3422k9856m142k3108
$$ plain form
6620 -56579 -60835 -46583 -44859 -49770 -26559 -16086 -1921 1471 -9833 1527 19490 -11032 -25404
6607 -25404 -14909 -9808 11914 25612 20896 2488 -16983 -4858 -3111 -6937 25597 37416 23939
6594 23939 11873 -8275 -6569 5170 7119 34908 16671 -2139 -432 -21709 -10348 19961
6582 19961 -6649 -29857 -63850 -61931 -26204 -28352 -47340 -42378 -33404 2588 25044 57922 58403
6569 58403 43854 27816 9792 27202 32106 25216 18262 20673 12751 -863 -8329 -9819 4092
6556 4092 -12534 -5741 45959 74370 55369 41804 18336 19902 12166 17728 18310 -1272 -8928
6543 -8928 -24284 -31333 -43249 -46582 -26121 -18398 -24222 -45330 -44235 -56004 -45098 -46030 357
6530 357 19860 143 -5349 24340 53611 35704 -4557 -10646 20759 29958 10402 -4970 -323
$$ packed form
6620e6579m256J4252J724m911K3211J0473J4165L392j1304J1360J7963l0522j4372
6607b5404J0495N101K1722J3698m716j8408j9471J2125J747l826L2534J1819j3477
6594B3939j2066k0148J706J1739J949K7789j8237j8810J707k1277J1361L0309
6582A9961k6610k3208l3993J919L5727k148j8988M962Q974L5992K2456L2878M81
6569E8403j4549j6038j8024J7410M904o890o954K411p922j3614p466j490J3911
6556D092j6626O793N1700K8411j9001j3565k3468J566p736N562N82j9582p656
6543h928j5356p049j1916l333K0461P723n824k1108J095j1769J0906r32M6387
6530C57J9503j9717n492K9689K9271j7907m0261o089L1405R199j9556j5372M647
$$ plain form
6517 -323 10751 -16361 -16558 15302 44358 17396 -35934 -41492 -31256 -28846 -33444 -39795 -1826
6504 -1826 10671 -13548 -31592 -46080 -75521 -82176 -64465 -50103 -48734 -78912 -86166 -42544 -18002
6491 -18002 -54679 -61161 -42428 -12379 -285 15053 48032 32672 36992 46319 20931 7958
6479 7958 21301 17593 -16494 -12371 37912 59938 44070 30756 19685 31633 26603 12737 -10370
6466 -10370 -24691 -2278 4598 -3403 -1380 -1663 -27411 -24414 -19374 -5438 16724 25156 -6850
6453 -6850 -6057 22375 39736 8944 19946 35652 742 -468 32915 32535 36388 1927 -31809
6440 -31809 -38675 -35607 -16859 -26866 -44097 -55946 -44475 -32097 -32291 -27604 -21951 -1025 22166
6427 22166 13201 -16718 -26802 -14636 -2942 -12430 -31183 -23005 8439 -14700 -38410 -28208
$$ packed form
6517c23J1074k7112j97L1860K9056k6962n3330n558J0236K410m598o351L7969
6504a826J2497k4219j8044j4488k9441o655J7711J4362J369l0178p254M3622K4542
6491a8002l6677o482J8733L0049J2094J5338L2979j5360M320R327k5388j2973
6479G958J3343l708l4087M123N0283K2026j5868j3314j1071J1948n030j3866k3107
6466a0370j4321K2413O876q001K023k83k5748K997N040J3936K2162Q432l2006
6453f850P93K8432J7361l0792J1002J5706l4910j210L3383l80L853l4461l3736
6440c1809o866L068J8748j0007j7231j1849J1471J2378j94M687N653K0926K3191
6427B2166q965k9919j0084J2166J1694r488j8753Q178L1444k3139k3710J0202
$$ plain form
6415 -28208 10589 33728 23995 26903 21038 1327 -35763 -24117 -7461 -28722 -54706 -26808
6403 -26808 9651 19770 27402 12283 33089 4992 -9968 -7111 -23800 -36275 -35161 -29064 -7819
6390 -7819 -2600 4826 -9975 -41545 -56597 -43743 -31858 -44481 -45804 -13246 3127 -5306 -38701
6377 -38701 -57683 -31339 28980 49070 53416 39752 79235 73936 60629 35236 34341 15607 18925
6364 18925 33269 15106 -11369 -32853 -23660 -17037 -35790 -30170 -5026 23487 10311 -4811
6352 -4811 14264 -10137 -29391 -28485 -42120 -32695 -27973 -27575 -25534 -24040 -18841 -4427 -29168 -46094
6338 -46094 -22130 -1728 -3002 22180 24224 6820 15115 -2053 -23470 888 5263 11755 30487
6325 30487 774 -22427 -30630 -51522 -61586 -53410 -59825 -50562 -40786 -25278 -22178 -18837 -10029
$$ packed form
6415b8208L8797K3139r733K908n865j9711l7090J1646J6656k1261k5984K7898
6403b6808L6459J0119P632j5119K0806k8097j4960K857j6689j2475J114O097K1245
6390g819N219P426j4801l1570j5052J2854J1885j2623j323L2558J6373q433l3395
6377c8701j8982K6344O0319K0090M346j3664L9483n299j3307k5393q95j8734L318
6364A8925J4344j8163k6475k1484R193O623j8753N620K5144K8513j3176j5122
6352d811J9075k4401j9254R06j3635R425M722L98K041J494N199J4414k4741j6926
6338d6094K3964K0402j274K5182K044j7404Q295j7168k1417K4358M375O492J8732
6325C0487k9713k3201q203k0892j0064Q176o415R263R776J5508L100L341Q808
$$ plain form
6312 -10029 -18506 -6531 -8703 -47553 -47514 -61648 -68295 -54419 -46178 -46216 -37187 -33019 -50729 -34431
6298 -34431 -25759 -13102 -48537 -46519 -39996 -26545 -17057 -6175 -2843 -16189 -20197 -3537 -26416
6285 -26416 -16611 -4965 -4594 1782 46816 59079 52904 31644 -6480 7573 18984 14580 10354
6272 10354 19088 9659 617 6156 -15963 -13920 -13915 -18356 -15876 5498 22934 34728 18387 17648
6258 17648 -9971 -22964 -20270 4822 778 7455 15791 44968 63986 34810 21089 27909 36553
6245 36553 22614 23947 34460 44952 26671 -11550 -35272 -24683 -17826 -23483 -16002 -18182 478
6232 478 931 3133 -6862 -23447 -10709 -11472 12782 45371 55264 25339 34029 25330 30118 38528
6218 38528 -11472 -34747 -50240 -34279 -26185 -39253 -40210 -3056 14589 12559 14339 26170 8313
$$ packed form
6312a0029q477J1975k172l8850L9j4134o647J3876Q241l8R029M168j7710J6298
6298c4431Q672J2657l5435K018O523J3451R488J0882L332j3346m008J6660k2879
6285b6416R805J1646L71O376M5034J2263o175k1260l8124J4053J1411m404m226
6272A0354Q734r429r042N539k2119K043Nm441K480K1374J7436J1794j6341p39
6258A7648k7619j2993K694K5092m044O677Q336K9177J9018k9176j3721O820Q644
6245C6553j3939J333J0513J0492j8281l8221k3722J0589O857n657P481k180J8660
6232D78M53K202r995j6585J2738p63K4254L2589R893k9925Q690q699M788Q410
6218C8528n0000k3275j5493J5961Q094j3068r57L7154J7645k030J780J1831j7857
$$ plain form
6205 8313 3216 -20965 -24792 -3934 -12981 695 11054 3033 -23544 -32140 -27292 -35067 -15176
6192 -15176 -19612 -41790 -54826 -51098 -18585 -13409 -8316 -26906 -13147 -6487 3451 20207 16949
6179 16949 -10386 -5636 -2805 -9552 -19754 -19291 -8046 8369 350 -13373 -10884 10824 -10039
6166 -10039 -31111 -47556 -9533 -7515 27536 58628 63334 56064 32601 33265 8280 13170 15600
6153 15600 15351 10887 21872 12018 8861 16065 16888 30944 31811 35798 31438 35663 16098 -15498
6139 -15498 -42764 -22435 -37295 -34330 4889 9030 30489 37813 33654 29826 16080 29507 -128
6126 -128 8474 -2872 5807 -8467 -4066 -5215 -2558 -11659 -2552 25594 44492 33070 46876 25286
6112 25286 -6676 -33024 -16516 19456 16915 16064 5943 28318 21625 30 10523 35402 45033
$$ packed form
6205H313n097k4181l827K0858r047J3676J0359q021k6577q596M848p775J9891
6192a5176m436k2178j3036L728L2513N176N093j8590J3759O660R938J6756l258
6179A6949k7335M750K831o747j0202M63J1245J6415q019j3723K489K1708k0863
6166a0039k1072j6445L8023K018L5051L1092M706p270k3463O64k4985M890K430
6153A5600k49m464J0985r854l157P204Q23J4056Q67L987m360M225j9565l1596
6139a5498k7266K0329j4860K965L9219M141K1459P324m159l828j3746J3427k9635
6126a28Q602j1346Q679j4274M401j149K657r101R107K8146J8898j1422J3806k1590
6112B5286l1962k6348J6508L5972k541q51j0121K2375o693k1595J0493K4879R631
$$ plain form
6099 45033 60611 48438 22757 42931 27157 -4233 5546 757 9839 -5328 -6298 6190 26100
6086 26100 57433 55066 58329 50747 12242 9573 14419 22315 15720 -23132 -13302 -1666 3804 7465
6072 7465 -32869 -66362 -31408 -24527 -22370 -9449 -27920 -50153 -51501 -27114 -40811 -62059 -50186
6059 -50186 -11989 -6987 -15012 -20640 -30786 -27699 -18683 -36493 -39617 -41512 -29092 -20457 -38253
6046 -38253 -44556 -27969 8213 25190 39065 38600 36172 -3186 25815 53967 31364 -18510 -47071
6033 -47071 -12413 -6814 -17632 -25844 -30976 -16570 -10584 -4131 -9003 3061 11799 13742 22629 22541
6019 22541 -23321 -51975 -38023 -13047 -31721 -18051 528 14097 -10046 -15180 -12808 -21102
6007 -21102 842 13922 32500 12381 -31014 -40733 -51406 -36544 -7308 12466 -24633 -41462
$$ packed form
6099D5033J5578j2173k5681K0174j5774l1390R779m789R082j5167r70J2488J9910
6086B6100L1333k367L263p582l8505k669M846P896o595l8852R830J1636N470L661
6072G465m0334l3493L4954O881K157J2921j8471k2233j348K4387j3697k1248J1873
6059e0186L8197N002q025n628j0146L087R016j7810l124j895J2420Q635j7796
6046c8253o303J6587L6182J6977J3875m65k428l9358K9001K8152k2603m9874k8561
6033d7071L4658N599j0818q212n132J4406N986O453m872J2064Q738J943Q887q8
6019B2541m5862k8654J3952K4976j8674J3670J8579J3569k4143n134K372q294
6007b1102K1944J3080J8578k0119m3395r719j0673J4862K9236J9774l7099j6829
$$ plain form
5995 -41462 -24709 -11752 230 15760 21819 7435 12185 -6964 -12488 4159 29625 17381
5983 17381 -2264 12706 28999 44841 50951 35974 27448 28801 13160 25642 12295 9480 26650
5970 26650 20416 3909 8831 2843 -20146 -25909 -45716 -37567 -36156 -7063 9639 30423 45484
5957 45484 27587 -20667 -25786 -21125 -26929 4536 1599 -10114 -2669 -13045 -45768 -47923 -54944
5944 -54944 -59929 -61728 -69452 -57722 -1122 23100 15458 14651 4085 -10469 -7818 3159 37828
5931 37828 26895 20383 10255 872 5508 -11122 -7318 -3146 22140 22584 12221 -6333 -2530
5918 -2530 -18414 -51126 -50709 -37215 -30304 4951 33989 15776 -13671 -10953 -1827 -29328 -19858
5905 -19858 -5858 10540 36775 37763 31846 37735 63932 52164 31495 41086 23021 -5906 -11389
$$ packed form
5995d1462J6753J2957J1982J5530O059j4384M750j9149n524J6647K5466j2244
5983A7381j9645J4970J6293J5842O110j4977q526J353j5641J2482j3347k815J7170
5970B6650o234j6507M922n988k2989n763j9807Q149J411K9093J6702K0784J5061
5957D5484j7897m8254n119M661n804L1465k937j1713P445j0376l2723k155p021
5944e4944m985j799p724J1730N6600K4222p642q07j0566j4554K651J0977L4669
5931C7828j0933o512j0128r383M636j6630L804M172K5286M44j0363j8554L803
5918b530j5884l2712M17J3494O911L5255K9038j8213k9447K718R126k7501R470
5905a9858J4000J6398K6235R88n917N889K6197j1768k0669R591j8065k8927n483
$$ plain form
5892 -11389 -40098 -29822 -17776 -39394 -14201 -2217 162 8796 12530 39254 30730 -3667 2508
5879 2508 21447 35995 52599 41605 30541 37423 44628 19028 -8132 -26690 -28550 -25377 -15281
5866 -15281 32723 50551 36260 20207 -18692 -55023 -78499 -63152 -5648 14183 13189 -2062
5854 -2062 7568 -30656 -41887 -64223 -61531 -42016 -50912 -37469 -36504 -28032 35 18089 18849 15234
5840 15234 17113 -16100 -30698 -43181 -52151 -64373 -50641 -46295 -28160 -25025 -40380 -49886 -41176
5827 -41176 -45032 -26105 -26443 -33253 -14168 2112 -3816 -10562 -27135 -7608 24163 20391 4405
5814 4405 -4749 -9286 -25277 -46244 -20822 1730 -3438 -16889 -30585 -29454 -20912 13206 30053
5801 30053 19776 18178 -15829 -12485 -2923 14371 23030 38503 41949 30178 29314 6457 -14695
$$ packed form
5892a1389k8709J0276J2046k1618K5193J1984K379Q634L734K6724q524l4397O175
5879B508J8939J4548J6604j0994j1064O882P205k5600k7160j8558j860L173J0096
5866a5281M8004J7828j4291j6053l8899l6331k3476J5347N7504J9831r94j5251
5854b062R630l8224j1231k2336K692J9515q896J3443R65Q472K8067J8054P60l615
5840A5234J879l3213j4598j2483q970j2222J3732M346J8135L135j5355r506Q710
5827d1176l856J8927l38o810J9085J6280n928o746j6573J9527L1771l772j5986
5814D405r154m537j5991k0967K5422K2552n168j3451j3696J131Q542L4118J6847
5801C0053j0277j598l4007L344R562J7294Q659J5473L446j1771q64k2857k1152
$$ plain form
5788 -14695 -30092 -22714 -28016 -30933 -26294 -12633 -13212 -15511 -16954 -7762 22913 24951 1925 -18216
5774 -18216 -32698 -47449 -26753 -20208 -50394 -43757 -22476 -14025 -8367 -9803 -16056 2072 -11640
5761 -11640 -16197 -15238 -10026 -15151 -7547 -9025 -5579 -7476 -21462 -12354 -4159 -14825 14301 9513
5747 9513 -12366 -5083 -16611 -25491 -3106 5405 -24286 -56059 -58602 -62847 -51562 -25255 -8749
5734 -8749 1789 -11265 -9303 5848 -2656 -26173 -16098 -3109 -31406 -58414 -50526 -60410 -46884
5721 -46884 -19579 -196 -14650 -32270 -42817 -58225 -45741 -27761 -8206 -12054 1515 17929
5709 17929 14229 9964 21647 21096 28944 12735 14504 43466 24445 4441 -5779 -30386 -32324
5696 -32324 -25300 24307 20733 7034 -13246 -30162 -41586 -29225 -48022 -59399 -28249 8609
$$ packed form
5788a4695j5397P378n302k917M639J3661n79k299j443R192L0675K038k3026k0141
5774a8216j4482j4751K0696O545l0186O637K1281Q451N658j436o253J8128j3712
5761a1640m557R59N212n125P604j478L446j897j3986R108Q195j0666K9126m788
5747I513k1879P283j1528q880K2385Q511k9691l1773k543m245J1285K6307J6506
5734h749J0538j3054J962J5151q504k3517J0075J2989k8297k7008P888r884J3526
5721d6884K7305J9383j4454j7620j0547j5408J2484J7980J9555l848J3569J6414
5709A7929l700m265J1683n51P848j6209J769K8962j9021k0004j0220k4607j938
5696c2324P024M9607l574j3699k0280j6916j1424J2361j8797j1377L1150L6858
$$ plain form
5684 8609 6914 5229 -32254 -44246 -30900 -23051 -27254 -38290 -28478 -3556 -7671 -1903 -3589 -25665
5670 -25665 -10697 30174 51326 31894 35136 48282 63692 29124 4013 15 -6111 -12817 -26870
5657 -26870 6976 17274 -6678 -9553 -8099 3299 13583 -3582 -19956 -20576 981 -7788 -30684
5644 -30684 -23300 -28097 -32420 -30312 -17566 -4131 -14046 2057 -3854 -11722 -15985 -31406 -37678 -32814
5630 -32814 -16481 -13495 3263 8985 13512 9366 21555 24841 21701 -20606 -38932 -29256 -2909
5617 -2909 18437 38109 55001 54750 55848 32881 -893 -3080 -13353 -9881 -21157 -13212 -3290
5604 -3290 -18276 5286 53145 35447 -5821 -30137 -25640 -35313 -36217 -21275 8802 -10347 -36403
5591 -36403 -82972 -72948 -53413 -54974 -59749 -61948 -35641 -19705 -10201 -24746 -32524 3526 19695
$$ packed form
5684H609j695j685l7483j1992J3346P849m203j1036R812K4922m115N768j686k2076
5670b5665J4968M0871K1152j9432L242J3146J5410l4568k5111l998o126o706j4053
5657b6870L3846J0298k3952k875J454J1398J0284j7165j6374o20K1557q769k2896
5644c0684P384m797m323K108J2746J3435r915J6103n911p868m263j5421o272M864
5630c2814J6333K986J6758N722M527m146J2189L286l140m2307j8326R676K6347
5617b909K1346J9672J6892k51J098k2967l3774k187j0273L472j1276P945R922
5604c290j4986K3562M7859j7698m1268k4316M497r673r04J4942L0077j9149k6056
5591c6403m6569J0024J9535j561m775k199K6307J5936R504j4545p778L6050J6169
$$ plain form
5578 19695 15547 30620 36419 29620 14733 19726 7057 -15286 -10502 -17858 -40197 -22914 4615
5565 4615 -3906 -33770 -44423 -30506 -39922 -44358 -10148 -4632 1447 20318 -1581 -20789 -2311
5552 -2311 -5144 -40032 -37244 -16426 3105 17699 -16194 -19700 18978 22417 12324 -16392 -32164
5539 -32164 -25942 17426 14580 4853 4100 -4008 -7830 21240 47447 58571 21926 -19678 1705
5526 1705 14483 -5085 -18561 -42442 -69694 -58129 -44615 -33852 -20083 -10621 24162 45503
5514 45503 33298 5618 -33753 -36738 -16267 -5747 -24092 -18833 13435 35135 42100 32109 -4017
5501 -4017 -18020 -1650 14211 -8476 -34121 -38205 -7106 25254 16753 6633 -704 -11922 -24968
5488 -24968 -32627 -67208 -50954 -25672 -16942 -35591 -13347 -13941 -23949 -29158 2040 -16754 -40730
$$ packed form
5578A9695m148J5073N799o799j4887M993j2669k2343M784p356k2339J7283K7529
5565D615q521k9864j0653J3917r416m436L4210N516O079J8871k1899j9208J8478
5552b311k833l4888K788K0818J9531J4594l3893l506L8678L439j0093k8716j5772
5539c2164O222M3368k846r727p53q108l822K9070K6207J1124l6645m1604K1383
5526A705J2778j9568j3476k3881k7252J1565J3514J0763J3769R462L4783K1341
5514D5503j2205k7680l9371k985K0471J0520j8345N259L2268K1700O965r991l6126
5501d017j4003J6370J5861k2687k5645m084L1099L2360q501j0120p337j1218j3046
5488b4968p659l4581J6254K5282Q730j8649K2244n94j0008n209L1198j8794k3976
$$ plain form
5475 -40730 -18055 9431 34282 18911 -5034 1511 -28975 -38054 -15300 11385 46774 55464
5463 55464 49097 17206 1882 5403 -5099 3103 -1680 8930 6686 -12334 -17527 -8730 -26521
5450 -26521 -19852 14695 20628 -7136 -19973 -19284 -6391 25532 34084 27529 12178 16838 3617
5437 3617 -6251 17365 48670 35142 29751 26472 29592 127 -11384 4313 -25015 -32243 -33715
5424 -33715 -17188 -27968 -25622 -10547 -600 8355 6289 -8576 -1004 12961 14548 3250 -32039
5411 -32039 -30540 3235 38208 60760 62421 53363 34944 22117 20303 27309 24305 -12471 -32924
5398 -32924 1181 41927 48224 20348 13221 20111 10413 -18408 -24292 4236 20341 10442 1853
5385 1853 -2088 -8634 9987 440 -24576 -17329 17217 23024 7894 -18971 -39019 -69604 -51549
$$ packed form
5475d0730K2675K7486K4851j5371k3945O545l0486r079K2754K6685L5389Q690
5463E5464o367l1891j5324L521j0502Q202m783J0610k244j9020n193Q797j7791
5450b6521O669L4547N933k7764j2837O89J2893L1923Q552o555j5351M660j3221
5437C617r868K3616L1305j3528n391l279L120k9465j1511J5697k9328p228j472
5424c3715J6527j0780K346J5075R947Q955k066j4865P572J3965J587j1298l5289
5411c2039J499L3775L4973K2552J661r058j8419j2827j814P006l004l6776k0453
5398c2924L4105M0746O297k7876p127O890r698k8821n884K8528J6105r899q589
5385A853l941o546J8621r547k5016P247L4546N807j5130k6865k0048l0585J8055
$$ plain form
5372 -51549 -28045 5483 9756 11179 41903 29259 -9299 -32642 -51277 -46421 -49324 -57258 -37507
5359 -37507 -18659 -6342 -1734 -3176 13080 3181 11690 14787 25643 16007 -4004 -52578 -82840
5346 -82840 -76146 -46831 -56539 -48536 -17338 -22958 -29050 -20706 -15493 -12860 2803 44887 69113
5333 69113 44738 14373 13807 -3229 -17333 -18788 17219 5352 -15644 -35202 -50334 -11913
5321 -11913 19216 12655 5121 -17067 -24379 2552 34034 32497 26793 22649 3854 16366 40453
5308 40453 -2693 -35734 -24578 -28737 -17147 -3877 -23935 -8312 -3712 13880 27283 15990
5296 15990 13682 -8902 -37359 -43195 -11037 10372 11650 13191 2237 -5512 -18638 -10425 -19535
5283 -19535 -15306 -17783 -40909 -27418 -8343 -2630 -30803 -15072 14229 13590 -22415 -29754 -28131
$$ packed form
5372e1549K3504L3528M273J423L0724j2644l8558k3343j8635M856k903p934J9751
5359c7507J8848J2317M608j442J6256r899Q509L097J0856r636k0011m8574l0262
5346h2840O694K9315r708Q003L1198n620o092Q344N213K633J5663M2084K4226
5333F9113k4375l0365n66j7036j4104j455L6007j1867k0996j9558j5132L8421
5321a1913L1129o561p534k2188p312K6931L1482j537n704m144j8795J2512K4087
5308D0453m3146l3041J1156m159J1590J3270k0058J5623M600J7592J3403j1293
5296A5990k308k2584k8457n836L2158K1409J278J541j0954p749j3126Q213r110
5283a9535M229k477k3126J3491J9075N713k8173J5731K9301o39l6005p339J623
$$ plain form
5270 -28131 -46178 -38444 -11290 8150 7352 -5559 -21351 -24162 -25073 -18779 -25427 -31661 -12043 -10698
5256 -10698 -24826 -38526 -10612 38795 33894 25182 21147 -6164 -9422 6988 37707 63170 46128
5243 46128 -1851 -10623 11191 26942 33981 20600 -6356 -16583 35734 34436 34677 15552 -3521
5230 -3521 5999 19362 12727 44725 45324 25678 25414 23036 32043 50955 2833 -45001 1351 12408
5216 12408 -4771 12706 28872 7219 -15395 -17068 -14713 -21002 -35828 -26886 -14425 33455 37151
5203 37151 2131 -6587 15537 15218 22812 44973 60198 85408 47579 18967 -2606 -13007 -43753
5190 -43753 -51046 -20682 -6395 -13288 -360 12552 28300 29995 42509 25589 12677 -2280
5178 -2280 -22480 -32580 -39499 -11201 -18610 -24081 -27497 -15444 20341 281 -28380 -57881 -37190
$$ packed form
5270b8131j8047P734K7154J9440p98j2911j5792k811r11O294o648o234J9618J345
5256a0698j4128j3700K7914M9407m901q712m035k7311l258J6410L0719K5463j7042
5243D6128m7979q772K1814J5751P039j3381k6956j0227N2317j298K41j9125j9073
5230c521R520J3363o635L1998N99j9646k64k378R007J8912m8122m7834M6352J1057
5216A2408j7179J7477J6166k1653k2614j673K355o289j4826Q942J2461M7880L696
5203C7151l5020q718K2124l19P594K2161J5225K5210l7829k8612k1573j0401l0746
5190d3753p293L0364J4287o893J2928J2912J5748J695J2514j6920j2912j4957
5178b280k0200j0100o919K8298p409n471l416J2053L5785k0060k8661k9501K0691
$$ plain form
5165 -37190 -31277 -29856 -24915 2320 -14007 -8202 22582 19430 20660 40422 36909 40726 43985 11050
5151 11050 9191 10613 847 -24797 -30275 -29415 -34481 -23184 -1801 -5535 -24217 -30919 -10078 17819
5137 17819 6781 -8462 -5494 21565 9978 -4929 -19099 -40662 -54270 -36325 -2875 14634
5125 14634 10766 -17141 -24142 -19523 -16341 -16765 -29680 -40140 -17476 7525 14716 17740 24727 20408
5111 20408 4600 -23151 -11785 -25684 -6905 22712 38350 5495 -13072 -5242 -3826 -27207
5099 -27207 -31364 -17400 -13830 -39979 -18530 -16348 -59986 -52750 -40507 -75792 -75732 -39625 -5314
5086 -5314 33490 38157 50844 49052 43195 50175 41402 31515 6308 -7994 -21119 -33372 -48532
5073 -48532 -46971 -33484 -43513 -35877 -8206 -6321 -27850 -29186 -2311 5653 -6372 -18927 -22896
$$ packed form
5165c7190N913J421M941K7235j6327N805L0784l152J230J9762l513L817L259l2935
5151A1050j859J422r766k5644n478Q60n066J1297K1383l734j8682o702K0841K7897
5137A7819j1038j5243K968K7059j1587j4907j4170k1563j3608J7945L3450J7509
5125A4634l868k7907p001M619L182m24j2915j0460K2664K5001P191L024O987m319
5111B0408j5808k7751J1366j3899J8779K9617J5638l2855j8567P830J416k3381
5099b7207m157J3964L570k6149K1449K182m3638P236J2243l5285O0L6107L4311
5086e314L8804M667J2687j792n857O980q773r887k5207j4302j3125j2253j5160
5073d8532J561J3487j0029P636K7671J885k1529j336K6875P964j2025j2555l969
$$ plain form
5060 -22896 -8232 23846 40367 27007 8733 15059 6742 15769 12647 -16133 -25940 -18340 -23189
5047 -23189 -22079 18049 24631 21214 14393 -6230 -16469 -17374 -3183 36433 42025 27704 168
5034 168 2806 13329 -981 12091 16004 -3045 -12475 -3088 -6094 -32921 -48208 -44554 -20506
5021 -20506 -11008 -3273 38768 34534 13451 25468 30595 15217 3654 -11148 10043 -8817 2297
5008 2297 10165 10108 36044 40148 6868 -22667 -21461 -4926 -11979 -8880 -17501 4356 7601 14747
4994 14747 30711 26296 24169 22590 23065 32564 31993 11967 -2632 -16956 6645 13174 42548 36622
4980 36622 33294 -3375 3194 -2979 3515 21060 1265 -19181 -40589 -41822 -4420 27553 77471
4967 77471 90996 80587 73624 42855 -7346 -28848 5357 6725 -9027 19283 21376 -9326
$$ packed form
5060b2896J4664L2078J6521j3360j8274O326q317R027l122k8780r807P600m849
5047b3189J110M0128O582l417o821k0623j0239r05J4191L9616N592j4321k7536
5034A68K638J0523j4310J3072L913j9049r430R387l006k6827j5287L654K4048
5021b0506R498P735M2041m234k1083J2017N127j5378j1563j4802K1191j8860J1114
5008B297P868n7K5936M104l3280k9535J206J6535p053L099q621K1857L245P146
4994A4747J5964m415k127j579M75R499n71k0026j4599j4324K3601O529K9374n926
4980C6622l328l6669O569o173O494J7545j9795k0446k1408j233L7402L1973M9918
4967G7471J3525j0409o963l0769n0201k1502L4205J368j5752K8310K093l0702
$$ plain form
4955 -9326 -10764 -11304 -21363 -14775 -27861 -7178 16919 3271 -18812 3464 19522 -3606 -2168
4942 -2168 -20197 -30552 -54525 -53827 -40803 -39720 -35175 -45564 -45806 -33267 -12898 9098 247
4929 247 9131 -10496 -44332 -52916 -33298 -36109 -23370 -33902 -43295 -23566 -29400 -19179 -13919
4916 -13919 -342 167 -28226 -16700 -31294 -7928 5011 2013 1689 -16662 -8352 15685 27795
4903 27795 19491 12689 12160 7996 -14918 -15335 -18133 -3408 -18886 -4849 8618 -8463 -3058 17642
4889 17642 39236 29992 17813 -6862 -4484 -14273 -6425 -2183 -5657 10493 13875 -2603 -12909
4876 -12909 -7344 -10161 -27669 -26901 -18124 189 -9643 -35344 -49874 -22191 -16394 -18877 -25394 -17074
4862 -17074 -20135 -23331 -28257 -17464 22294 48414 37705 11990 -4975 14181 30841 13302
$$ packed form
4955i326j438n40j0059O588j3086K0683K4097j3648k2083K2276J6058k3128J438
4942b168j8029j0355k3973O98J3024J083M545j0389k42J2539K0369K1996q851
4929B47Q884j9627l3836q584J9618k811J2739j0532r393J9729n834J0221N260
4916a3919J3577N09k8393J1526j4594K3366J2939k998l24j8351Q310K4037J2110
4903B7795q304o802n29m164k2914m17k798J4725j5478J4037J3467j7081N405K0700
4889A7642K1594r244j2179k4675K378r789P848M242l474J6150L382j6478j0306
4876a2909N565k817j7508P68Q777J8313r832k5701j4530K7683N797k483o517Q320
4862a7074l061l196m926J0793L9758K6120j0709k5715j6965J9156J6660j7539
$$ plain form
4850 13302 -22266 -21441 -15807 -977 -12465 -10863 -26023 -24706 -4474 4563 -1386 -18718 -27260
4837 -27260 -38696 -33923 -10505 -27724 -50912 -21239 29997 70606 21935 -11486 -13076 -5756
4825 -5756 5299 11204 28052 38789 18410 5621 7746 -19315 -17594 -21259 -26750 15715 30946
4812 30946 37445 54753 65041 37160 25810 9251 -14332 -22876 5388 40505 41533 60749
4800 60749 79603 52995 20385 7240 -6565 -4704 12140 40525 54484 32144 -2137 -26053
4788 -26053 -18180 -1656 -18781 -23119 -18554 -7414 -32194 -24554 -11326 3673 17174 -18575 -43746
4775 -43746 -50511 -28216 3608 51580 26221 -479 -25417 -25867 6167 45748 65028 83609
4763 83609 51156 25086 -3714 -4551 17218 30789 38888 38916 38223 23822 37379 48175 62364
$$ packed form
4850A3302l5568Q25N634J4830j1488J602j5160J317K0232R037n949j7332q542
4837b7260j1436M773K3418j7219k3188K9673N1236M0609m8671l3421j590P320
4825e756J1055N905J6848J0737k0379j2789K125k7061J721l665n491M2465J5231
4812C0946O499J7308J0288k7881j1350j6559k3583q544K8264L5117J028J9216
4800F0749J8854k6608l2610j3145j3805J861J6844K8385J3959k2340l4281k3916
4788b6053P873J6524j7125m338M565J1140k4780P640J3228J4999J3501l5749k5171
4775d3746o765K2295L1824M7972k5359k6700k4938m50L2034L9581J9280J8581
4763H3609l2453k6070k8800q37K1769J3571Q099K8o93j4401J3557J0796J4189
$$ plain form
4750 62364 47003 7791 22429 32869 20890 -13302 -6121 -11376 2052 4410 5582 -7586 -18458
4737 -18458 -14854 -14195 -3294 -5587 -20384 -21029 -43585 -35180 -14272 -4349 -38711 -73510 -57655
4724 -57655 -14583 16949 47363 55258 43008 27683 15218 1045 32432 34279 5993 11281
4712 11281 6812 12268 11963 -16088 -48113 -48553 -35322 -45973 -39484 912 -11337 -34434 -39982
4699 -39982 -37657 -1271 33915 64446 65292 43527 33003 16053 8333 39579 44321 25077 -14290
4686 -14290 5935 22047 6349 36420 39183 11733 29461 30563 21466 9048 26170 46505
4674 46505 35903 59926 51721 41391 36315 35729 11810 -4580 -4798 -3490 7399 30552 44275
4661 44275 24852 -4486 -5559 -16701 -17965 -27288 -6199 -11304 -47236 -26111 3912 25168 33953
$$ packed form
4750F2364j5361l9212J4638J0440j1979l4192P181n255J3428K358J172j3168j0872
4737a8458L604O59J0901k293j4797o45k2556Q405K0908R923l4362l4799J5855
4724e7655M3072L1532L0414P895j2250j5325j2465j4173L1387J847k8286N288
4712A1281m469N456l05k8051l2025m40J3231j0651O489M0396j2249k3097n548
4699c9982K325L6386L5186L0531Q46k1765j0524j6950p720L1246M742j9244l9367
4686a4290K0225J6112j5698L0071K763k7450J7728J102r097j2418J7122K0335
4674D6505j0602K4023q205j0330n076n86k3919j6390k18J308J0889K3153J3723
4661D4275j9423k9338j073j1142j264r323K1089n105l5932K1125L0023K1256Q785
$$ plain form
4648 33953 20684 925 -17130 -19489 -9252 -14039 -22454 -27063 -46265 -44731 -28026 -13080 15299
4635 15299 20820 12615 -43436 -66665 -42220 -17510 15569 14715 -27663 -34199 -21699 -5715 29453
4622 29453 37228 32112 51023 16161 125 -4638 -11396 -4042 1291 19177 2972 -16305 -7289
4609 -7289 10036 6273 12854 -7820 -36224 -8396 -4106 -10983 14350 15715 -33729 -44098 5067
4596 5067 59992 44722 6583 -2800 36661 46563 24295 24024 30099 10896 -25875 -42441 -20722
4583 -20722 12896 31508 25992 -17144 -45155 -35413 -28339 -24233 -26916 -44975 -67725 -32078 -5363
4570 -5363 8262 11082 -614 -28386 -536 -27243 -27974 13189 17911 -17861 -28233 -11132 -12031
4557 -12031 -5666 2996 4159 17764 12297 3161 -514 14354 18247 5572 -7885 7285 14065
$$ packed form
4648C3953j3269j9759j8055k359J0237m787q415m609j9202J534J6705J4946K8379
4635A5299N521q205n6051k3229K4445K4710L3079q54m2378o536J2500J5984L5168
4622B9453P775n116J8911l4862j6036m763o758P354N333J7886j6205j9277R016
4609g289J7325l763O581k0674k8404K7828M290o877K5333J365m9444j0369M9165
4596E067N4925j5270l8139r383L9461R902k2268k71O075j9203l6771j6566K1719
4583b0722L3618J8612n516m3136k8011R742P074M106k683j8059k2750L5647K6715
4570e363J3625K820j1696k7772K7850k6707p31M1163M722l5772j0372J7101q99
4557a2031O365Q662J163J3605n467r136l675J4868L893j2675j3457J5170O780
$$ plain form
4544 14065 34673 9366 -38352 -55299 -54090 -29558 -14484 20975 38038 27495 29298 6164
4532 6164 -4967 -7495 -36428 -56642 -48237 -29100 -19216 -16612 -59855 -70551 -37705 -16001 -14634
4519 -14634 -40486 -45923 -18374 19753 26179 22829 25061 24179 40034 47556 22335 2496 -6732
4506 -6732 -9002 -12995 -31603 -43149 -30443 8909 15481 15868 -845 -30565 -46492 -25003 -17500
4493 -17500 -7207 -4414 -19517 -10 6966 28634 -16402 -36384 -20611 -12082 27775 62946
4481 62946 42701 48235 50691 27563 21947 -3467 -6194 -10075 -24783 -38782 -15857 -11069 -23031
4468 -23031 -31044 -4870 11198 4852 -17870 -21692 -26556 -53664 -16946 -3095 -38828 -41736 -4954
4455 -4954 19725 13027 6304 23357 24114 33743 13740 -4013 -26597 -20579 9900 18328 12711 55407
$$ packed form
4544A4065K0608k5307m7718j6947J209K4532J5074L5459J7063j0543J803k3134
4532F164j1131k528k8933k0214Q405J9137R884K604m3243j0696L2846K1704J367
4519a4634k5852n437K7549L8127O426l350K232q82J5855P522k5221j9839r228
4506f732k270l993j8608j1546J2706L9352O572L87j6713k9720j5927K1489P503
4493a7500J0293K793j5103J9507O976K1668m5036j9982J5773Q529L9857L5171
4481F2946k0245N534K456k3128n616k5414k727l881j4708j3999K2925M788j1962
4468b3031q013K6174J6068o346k2722l822m864k7108L6718J3851l5733k908L6782
4455d954K4679o698o723J7053P57R629k0003j7753k2584O018L0479Q428n617M2696
$$ plain form
4441 55407 63197 22562 -29850 -30745 -25758 -16618 -24035 -36425 -57662 -44335 -46967 -32825 -19164
4428 -19164 -21653 -48878 -57804 -46589 -41710 7840 31612 5610 -51196 -53761 -51458 -29120 -40464
4415 -40464 -36654 -14148 -17493 -43605 -51630 -6968 4417 -5218 -2760 11112 -4913 -27847 -27885
4402 -27885 -47239 -35342 -55325 -41080 -37586 -40063 -32544 -39298 -17395 -16778 8660 7360 -10974
4389 -10974 -14883 13361 13948 7447 15330 -6351 -11118 6646 -8800 -53516 -61925 -25330 -17850
4376 -17850 -37109 -40254 -54379 -55333 -27648 -43161 -31024 -52184 -70654 -64513 -38427 -24324 -27571
4363 -27571 -25189 -15458 -16503 -10974 -10007 -20359 -15631 -24737 3448 -6564 -20693 -27049 -37112 -30194
4349 -30194 -858 7866 33389 24510 1014 8151 372 9959 8764 27251 39110 29557 29831 15548
$$ packed form
4441E5407P790m0635n2412q95M987R140p417j2390k1237J3327k632J4142J3661
4428a9164k489k7225q926J1215M879M9550K3772k6002n6806k565K303K2338j1344
4415d0464L810K2506l345k6112q025M4662J1385r635K458J3872j6025k2934l8
4402b7885j9354J1897j9983J4245L494k477P519o754K1903O17K5438j300j8334
4389a0974l909K8244N87o501P883k1681m767J7764j5446m4716q409L6595P480
4376a7850j9259l145j4125r54K7685j5513J2137k1160j8470O141K6086J4103l247
4363b7571K382R731j045N529R67j0352M728r106K8185j0012j4129o356j0063O918
4349c0194K9336Q724K5523q879k3496P137p779R587j195J8487J1859r553K74j4283
$$ plain form
4335 15548 3627 -11986 -8805 7299 28274 11679 -594 -48830 -65886 -31474 -17069 -25815
4323 -25815 -25883 4353 8384 8717 -28542 -55690 -26101 -38327 -35959 -40430 -40494 -24366 -27461 -18191
4309 -18191 -56747 -64126 -53638 -22844 -21252 -26267 -2329 -3386 -16686 -11834 609 -241 -12962
4296 -12962 -20591 -12342 -16302 -28761 -30005 -8855 -8879 8593 6024 1193 6804 27695 37214 9063
4282 9063 -7324 -47121 -66422 -38808 -38720 -25842 -26730 -14389 -249 18317 30841 20954 37972
4269 37972 45744 6427 -2317 -10176 7363 40056 46796 44804 18807 14651 18722 2777 10088
4256 10088 2694 -24166 -28095 335 22441 35802 36904 52277 62392 44414 15944 1666
4244 1666 13899 42427 53430 68492 71318 38632 13881 -529 9990 28398 1309 -24449
$$ packed form
4335A5548j1921j5613L181J6104K0975j6595j2273m8236j7056L4412J4405q746
4323b5815o8L0236M031L33l7259k7148K9589j2226K368m471o4J6128l095R270
4309a8191l8556p379J0488L0794J592n015K3938j057j3300M852J2443q50j2721
4296a2962p629Q249l960j2459j244K1150k4J7472k569m831N611K0891R519k8151
4282I063j6387l9797j9301K7614Q8J2878q88J2341J4140J8566J2524r887J7018
4269C7972P772l9317q744p859J7539L2693O740j992k5997m156M071j5945P311
4256A0088p394k6860l929K8430K2106J3361J102J5373J0115j7978k8470j4278
4244A666J2233K8528J1003J5062K826l2686k4751j4410J0519J8408k7089k5758
$$ plain form
4232 -24449 -2560 -6021 -35286 -17790 -513 20356 31658 29220 29442 30690 44528 66459 39164
4219 39164 20130 25131 32410 40252 25807 26085 6184 -16837 -4811 -15922 -7417 12027 5956
4206 5956 -11109 -7049 -17038 -1471 -2104 -334 5468 29491 35984 54626 53553 55499 57918 67447
4192 67447 55550 30627 -4751 -11321 -20367 -16926 -13567 -704 22723 15818 -2875 -600 -22950
4179 -22950 -15569 -3217 17391 -12873 -8611 6414 -4824 13287 36947 36477 23393 21074 9038
4166 9038 14247 -5223 -16709 -17255 -28234 -10249 16916 8811 14929 18208 8769 7641 8776 16867
4152 16867 34793 23729 26644 2137 4184 5914 -20338 -18662 12404 17771 -13473 -9608 53182
4139 53182 58551 59570 72570 60201 36676 18408 -2590 4745 20907 27778 21184 -2658 -12793
$$ packed form
4232b4449K1889l461k9265J7496J7277K0869J1302k438K22J248J3838K1931k7295
4219C9164j9034N001P279P842j4445K78j9901k3021J2026j1111Q505J9444o071
4206E956j7065M060r989J5567o33J770N802K4023O493J8642j073J946K419R529
4192F7447j1897k4923l5378o570r046L441L359J2863K3427o905j8693K275k2350
4179b2950P381J2352K0608l0264M262J5025j1238J8111K3660m70j3084k319j2036
4166I038N209j9470j1486n46j0979J7985K7165q105O118L279r439j128J135Q091
4152A6867J7926j1064K915k4507K047J730k6252J676L1066N367l1244L865O2790
4139E3182N369J019J3000j2369k3525j8268k0998P335J6162O871o594k3842j0135
$$ plain form
4126 -12793 -4976 1743 -10783 14188 22959 41148 43816 32745 23106 16350 -7616 -8171 -13987 -19974
4112 -19974 -22758 -12620 4308 -15543 -29426 -5992 -19474 -27235 -28589 -23701 -32109 -26298 -27966
4099 -27966 -12428 -18945 -12014 -25595 2623 -14164 9856 20024 44764 42539 -16095 -1892
4087 -1892 5463 -384 -1978 -28598 -26595 -6140 1446 -2102 -20335 -12696 -24957 -24474 -2614 13225
4073 13225 27931 37098 17523 11051 15328 -9657 15440 47789 33407 21300 -16095 -32506
4061 -32506 -25835 -12255 4101 9209 30515 27878 23274 19432 -13593 -21232 -24044 -17117 -10152 -19268
4047 -19268 -21702 -20043 3248 11025 27478 11644 -8160 -35683 -26317 -20057 -15884 4219 19441
4034 19441 21818 35965 21242 -8701 -17762 -27085 -39580 -34057 -26695 -16333 940 25128 45798
$$ packed form
4126a2793P817O719j2526K4971Q771J8189K668j1071r639o756k3966n55n816n987
4112a9974k784J0138J6928j9851j3883K3434j3482p761j354M888q408N811j668
4099b7966J5538o517O931j3581K8218j6787K4020J0168K4740k225n8634J4203
4087a892P355n847j594k6620K003K0455P586l548j8233P639j2261M83K1860J5839
4073A3225J4706R167j9575o472M277k4985K5097L2349j4382j2107l7395j6411
4061c2506O671J3580J6356N108K1306k637m604l842l3025p639k812O927O965r116
4047a9268k434J659K3291P777J6453j5834j9804k7523R366O260M173K0103J5222
4034A9441K377J4147j4723k9943r061r323j2495N523P362J0362J7273K4188K0670
$$ plain form
4021 45798 34086 28712 37124 35157 -8687 -8418 -14672 -16921 12609 27656 9366 38423 39544
4008 39544 41773 35670 14970 -11387 17707 53726 13574 3825 -8485 -8275 -7316 -623 4794 15581
3994 15581 25039 9000 -20454 -12688 6184 37319 39486 13737 -1906 -29471 -31942 -2578 -809
3981 -809 -1946 -18736 -6528 14809 6229 8647 18539 32816 24283 25267 2159 -48196 -60787 -30014
3967 -30014 -19996 -54853 -38142 -17030 -9964 3871 21170 -3355 -19170 -36911 -53533 -54024
3955 -54024 -9775 36023 47197 35437 -263 -9804 12515 11089 -12065 -27881 -40569 -32746
3943 -32746 -15502 9364 27843 18035 12484 20244 8069 -10085 6070 17349 29109 44808
3931 44808 33902 9157 12044 17233 -14317 -12233 -14897 -18022 -26328 -18714 23093 22759 -13492 -51711
$$ packed form
4021D5798j1712n374Q412j967m3844K69o254k249K9530J5047j8290K9057J121
4008C9544K229o103k0700k6357K9094L6019m0152r749j2310K10R59O693N417J0787
3994A5581R458j6039k9454P766J8872L1135K167k5749j5643k7565k471K9364J769
3981h09j137j6790J2208K1337q580K418R892J4277q533R84k3108n0355j2591L0773
3967c0014J0018l4857J6711K1112P066J3835J7299k4525j5815j7741j6622m91
3955e4024M4249M5798J1174j1760l5700r541K2319j426k3154j5816j2688P823
3943c2746J7244K4866J8479r808n551P760j2175j8154J6155J1279J1760J5699
3931D4808j0906k4745K887N189l1550K084k664l125q306P614M1807l34l6251l8219
$$ plain form
3917 -51711 -42930 -25698 705 1803 -15937 -9817 5108 6071 6185 -13722 4036 19134 -4240
3904 -4240 -48072 -41822 -5912 6321 12934 12260 -16532 -22703 9323 -6362 -40681 -77170 -74337
3891 -74337 -46912 -8423 -26583 -13475 -28867 -35052 -13622 -27179 -35490 -9201 29539 22307
3879 22307 27679 -14566 -2729 26273 7908 4904 16492 39396 48583 34164 4385 -1766 -13673
3866 -13673 13315 -7554 12523 11078 35247 34730 94497 90646 70424 46617 20222 14542 35772
3853 35772 -9002 -55243 -64296 -69982 -32577 -2635 12702 7855 12457 8967 8040 21934 -7716
3840 -7716 -10951 32778 31403 -4108 -26833 -47653 -67866 -50725 -55500 341 2160 -582 -12846
3827 -12846 -11613 -11862 3291 -28612 -24610 -13775 -34995 -38386 -27434 -37428 -56814 -35704 -6557
$$ packed form
3917e1711Q781J7232K6403J098j7740O120J4925R63J14j9907J7758J5098k3374
3904d240m3832O250L5910J2233O613o74k8792o171L2026j5685l4319l6489K833
3891g4337K7425L8489j8160J3108j5392o185K1430j3557q311K6289L8740p232
3879B2307N372m2245J1837K9002j8365l004J1588K2904R187j4419k9779o151j1907
3866a3673K6988k0869K0077j445K4169n17N9767l851k0222k3807k6395n680K1230
3853C5772m4774m6241r053n686L7405K9942J5337m847M602l490r27J3894k9650
3840g716l235M3729j375l5511k2725k0820k0213J7141m775N5841J819k742j2264
3827a2846J233k49J5153l1903M002J0835k1220l391J0952r994j9386K1110K9147
$$ plain form
3814 -6557 4965 34800 55307 63832 69006 67462 61256 10176 -14054 -18828 157 1044 -11402
3801 -11402 -25473 -24033 22064 24251 18048 26760 12064 -20258 8997 28408 22116 11626 -3535
3788 -3535 11459 4680 1048 -16559 -10559 22443 -6348 -16886 -5996 -15566 -18645 -34383 -40601
3775 -40601 -17925 -44734 -20396 23213 26187 20540 -16488 -17073 -15899 -17855 -13631 -54531 -50181
3762 -50181 -26085 -11164 9545 8189 6438 19022 9408 6591 13120 55553 104795 91695 49086
3749 49086 29759 28428 -18738 -29256 -25451 850 34492 11715 63 -12559 -26516 -50417
3737 -50417 -40210 -56634 -54051 -38528 -24409 -28628 -21976 -1233 2687 21808 47582 26321 21025
3724 21025 24266 36430 31050 38067 1075 1898 12696 52756 58518 34072 19747 15620 -1303
$$ packed form
3814f557J1522K9835K0507Q525N174j544o206n1080k4230m774J8985Q87j2446
3801a1402j4071J440M6097K187o203Q712j4696l2322K9255J9411o292j0490j5161
3788c535J4994o779l632j7607O000L3002k8791j0538J0890r570l079j5738o218
3775d0601K2676k6809K4338M3609K974n647l7028n85J174j956M224m0900M350
3762e0181K4096J4921K0709j356j751J2584r614k817O529M2433M9242j3100m2609
3749D9086j9327j331m7166j0518L805K6301L3642k2777j1652j2622j3957k3901
3737e0417J0207j6424K583J5523J4119m219O652K0743L920J9121K5774k1261n296
3724B1025L241J2164n380P017l6992Q23J0798M0060N762k4446j4325m127j6923
$$ plain form
3711 -1303 -15789 -23777 -7519 24962 35015 27143 25611 23573 3033 4136 26774 8425 -29825
3698 -29825 -66378 -71792 -53212 -31262 -13487 3175 38025 24861 1525 7062 15692 -16026
3686 -16026 -7934 -14114 974 24759 17350 -3666 -26519 -43785 -20772 12489 17870 15730 -23348
3673 -23348 -58487 -74627 -45925 -36612 -33605 -64933 -77947 -45623 -8044 -15646 -39938 -35430 -19707
3660 -19707 -26724 -4595 -16343 -28233 -29156 -22652 110 -8403 -23400 -20810 -49753 -44643 -33375
3647 -33375 -29855 -27207 886 19474 1811 3971 10244 12448 17566 -14783 -48640 -46143 -25269
3634 -25269 -24412 -33704 -25389 -22450 -23720 -18988 -11738 6695 -21748 -25787 -23617 -25689 -66199 -35853
3620 -35853 -34622 2200 24390 36268 19184 -7197 -19254 -18941 -20364 1791 27498 10704 -17701
$$ packed form
3711a303j4486p988J6258L2481J0053p872j532k038k0540J103K2638j8349l8250
3698b9825l6553n414J8580K1950J7775J6662L4850j3164k3336N537Q630l1718
3686a6026Q092o180J5088K3785p409k1016k2853j7266K3013L3261N381k140l9078
3673b3348l5139j6140K8702R313L007l1328j3014L2324L7579p602k4292M508J5723
3660a9707p017K2129j1748j1890r23O504K2762q513j4997K590k8943N110J1268
3647c3375L520K648K8093J8588j7663K160O273K204N118l2349l3857K497K0874
3634b5269Q57r292Q315K939j270M732P250J8433k8443m039K170k072m0510L0346
3620c5853J231L6822K2190J1878j7084k6381j2057L13j423K2155K5707j6794k8405
$$ plain form
3607 -17701 -47866 -66300 -37319 -12170 -24628 -30972 -67259 -79147 -40861 -39350 -21274 -4951
3595 -4951 -4799 -18317 972 -8267 -28786 -27589 -49599 -59615 -43631 -18994 -4662 5612 9323
3582 9323 18684 9104 -2978 4039 25158 9331 -8091 -12490 -39834 -69684 -63464 -33381 29
3569 29 41732 67868 52327 29323 18047 11532 18426 164 -6239 -12803 -18571 -19928 -2703 -3235
3555 -3235 -15781 -5396 -24742 -43147 -16428 2791 22347 38340 70823 97047 85340 68502
3543 68502 31892 17324 12811 -391 -17392 -34661 -32084 -35515 -16855 8351 3589 -30728 -47856
3530 -47856 -54978 -50843 -53604 -35468 -19966 -12123 -2943 -5517 -44919 -13214 13760 13543 11941 26356
3516 26356 6845 -12865 -9994 9521 21912 34569 -8989 -42115 -37430 -11798 -33725 -34265 -20478
$$ packed form
3607a7701l0165j8434K8981K5149j2458o344l6287j1888L8286J511J8076J6323
3595d951J52j3518J9289r239k0519J197k2010j0016J5984K4637J4332J0274L711
3582I323R361r580j2082P017K1119j5827j7422m399k7344k9850O220L0083L3410
3569B9M1703K6136j5541k3004j1276o515O894j8262o403o564n768j357J7225n32
3555c235j2546J0385j9346j8405K6719J9219J9556J5993L2483K6224j1707j6838
3543F8502l6610j4568m513j3202j7001j7269K577l431J8660K5206m762l4317j7128
3530d7856p122M135k761J8136J5502P843R180k574l9402L1705K6974k17j602J4415
3516B6356j9511j9710K871J9515J2391J2657m3558l3126M685K5632k1927n40J3787
$$ plain form
3503 -20478 -28523 -25353 2096 11446 29680 15416 -9966 -1526 -17279 -28360 -19408 -9067 -19350
3490 -19350 -45742 -32097 -30954 -40490 -31716 7251 -3258 -30354 -26673 -32124 -42173 -56560 -53185
3477 -53185 -40867 -33598 -35357 -37580 -69248 -49265 -38824 -25383 -13382 -42876 -41319 -46890 -49686
3464 -49686 -50950 -41922 -54385 -33117 -7051 575 5250 7572 36971 33641 34166 51183 36834
3451 36834 58 -48602 -61157 -40566 -9886 -29321 -55309 -27402 -3230 -4405 -22372 -21800
3439 -21800 -27518 -32850 -20422 -10304 -3748 -28907 -28038 -20056 -34905 -32925 -8216 -19968 -24406
3426 -24406 -13461 13898 29713 32474 22913 35900 43846 28995 1089 4268 16334 28253 54741
3413 54741 68298 68109 27351 959 6187 -8672 -39821 -19420 -168 1407 -11011 19561 19540
$$ packed form
3503b0478q045L170K7449R350J8234j4264k5382Q440j5753j1081Q952J0341j0283
3490a9350k6392J3645J143r536Q774L8967j0509k7096L681n451j0049j4387L375
3477e3185J2318P269j759k223l1668J9983J0441J3441J2001k9494J557n571k796
3464d9686j264R028j2463K1268K6066P626M675K322K9399l330N25J7017j4349
3451C6834l6776m8660j2555K0591L0680j9435k5988K7907K4172j175j7967N72
3439b1800n718n332J2428J0118O556k5159Q69P982j4849J980K4709j1752m438
3426b4406J0945K7359J5815K761r561J2987P946j4851k7906L179J2066J1919K6488
3413E4741J3557j89m0758k6392N228j4859l1149K0401J9252J575j2418L0572k1
$$ plain form
3400 19540 31387 34665 26479 33924 5197 -9217 -16522 10990 44270 32920 13209 4522 6083
3387 6083 32836 35010 4730 -25082 -18581 4853 9167 16938 37091 24861 15115 30118 7005
3374 7005 -40330 -15957 7975 11396 -14381 -35204 -17275 22952 34269 27868 15095 -912
3362 -912 16647 23665 24591 11116 28382 43669 44077 42272 38744 586 -41447 -46435 -40166 -47751
3348 -47751 -12873 3373 8552 4071 1385 22708 14897 -26251 -17539 -23100 5030 8488 -456
3335 -456 5929 -7774 -15647 2614 24451 1997 -8163 -13796 -11598 5524 1789 -1241 19247
3322 19247 30373 3576 -48107 -65665 -69877 -36462 2597 15754 -10140 2700 11733 10647
3310 10647 15161 19428 -9678 -28002 -17118 -1309 -3044 -31629 -27292 -16616 -24544 -23531 -32000
$$ packed form
3400A9540J1847L278q186P445k8727j4414p305K7512L3280j1350j9711q687J561
3387F083K6753K174l0280k9812O501K3434M314P771K0153j2230r746J5003k3113
3374G005m7335K4373K3932L421k5777k0823J7929M0227J1317o401j2773j6007
3362i12J7559P018R26j3475J7266J5287M08j805l528l8158m2033m988O269p585
3348d7751L4878J6246N179m481k686K1323p811m1148Q712n561K8130L458q944
3335d56O385j3703p873J8261K1837k2454j0160n633K198J7122l735l030K0488
3322A9247J1126k6797n1683j7558m212L3415L9059J3157k5894J2840R033j086
3310A0647M514M267k9106j8324J0884J5809j735k8585M337J0676p928J013q469
$$ plain form
3297 -32000 -31012 -10096 35193 26228 -3818 -26455 -10554 -11558 -7120 10162 28696 56683 22365
3284 22365 6698 -8077 -20232 3406 51448 40209 -3595 -447 -24747 -40457 -57335 -32930
3272 -32930 -5267 2709 21517 13302 -19675 -21941 -17624 -36367 -50804 -67458 -48823 -28844 -4548
3259 -4548 45340 47837 23421 -3750 -16348 -15876 -37776 -58143 -27037 2228 -9438 -29821 -27404
3246 -27404 -26899 -30699 -28762 895 19783 17368 -9142 -16390 -19075 -48413 -3664 40709 24037
3233 24037 9248 6255 21968 -21361 -28877 2452 -779 -6182 -5132 12241 5222 -5163 -1516
3220 -1516 -6854 -31152 -30379 -27554 -446 21280 -2142 -21827 -10175 10072 17659 34098 59802
3207 59802 47736 38460 50914 36579 41141 50163 21141 1689 -744 -4236 7373 19308 6283
$$ packed form
3297c2000R88K0916M5289q965l0046k2637J5901j004M438J7282J8534K7987l4318
3284B2365j5667j4775j2155K3638M8042j1239m3804L148k4300j5710j6878K4405
3272c2930K7663P976J8808q215l2977k266M317j8743j4437j6654J8635J9979K4296
3259d548M9888K497k4416k7171j2598M72k1900k0367L1106K9265j1666k0383K417
3246b7404N05l800J937K9657J8888k415k6510p248k685k9338M4749M4373j6672
3233B4037j4789k993J5713m3329p516L1329l231n403J050J7373p019j0385L647
3220a516n338k4298P73K825K7108K1726k3422j9685J1652K0247P587J6439K5704
3207E9802j2066r276J2454j4335M562R022k9022j9452k433l492J1609J1935j3025
$$ plain form
3194 6283 -14675 -59950 -29695 -5758 -3380 -19531 -15228 -4344 10050 -3743 -36568 -33434 -16091
3181 -16091 -10803 -5448 -27314 -21016 -31650 -19596 -30262 -46726 -28125 -1193 -7760 -14939 7186
3168 7186 3330 -15492 -10980 22736 35859 28252 40355 27260 -19845 -19609 -16452 -8839 -13226 1251
3154 1251 -17484 2297 5679 5815 6800 -12940 -39278 -51982 -69778 -101155 -88899 -56933 -43991
3141 -43991 -18346 -17046 -18664 -4460 -37785 -22027 -816 10046 11094 7585 14658 5547 882
3128 882 -21185 -26114 -27128 -47396 -60878 -47584 -25566 9365 31491 29341 55604 27927 -23005
3115 -23005 -18159 -16131 -8622 8533 14758 -15453 -28149 -26497 -25368 -25539 -26223 -40457 -35381 -14483
3101 -14483 1099 -30994 -59492 -62187 -44781 -11959 6317 -17297 -22520 -14438 -26947 -27150 -18232
$$ packed form
3194F283k0958m5275L0255K3937K378j6151M303J0884J4394j3793l2825L134J7343
3181a6091N288N355k1866O298j0634J2054j0666j6464J8601K6932o567p179K2125
3168G186l856j8822M512L3716J3123p607J2103j3095m7105K36L157P613m387J4477
3154A251j8735J9781L382J36R85j9740k6338j2704j7796l1377J2256L1966J2942
3141d3991K5645J300j618J4204l3325J5758K1211J0862J048l509P073r111m665
3128H82k2067m929j014k0268j3482J3294K2018L4931K2126k150K6263k7677n0932
3115b3005M846K028P509J7155O225l0211j2696J652J129j71o84j4234N076K0898
3101a4483J5582l2093k8498k695J7406L2822J8276k3614n223Q082j2509k03Q918
$$ plain form
3088 -18232 17518 16299 7905 17433 35655 10582 298 -724 -863 11466 -7245 -39508 -38665
3075 -38665 -21827 29494 55258 29655 48869 59758 50510 60659 68198 66439 65369 73045 76625
3062 76625 68840 53771 32897 18002 22627 -1154 -25433 6778 -22169 -36415 -11030 -2502
3050 -2502 -4705 -16265 33520 37843 3405 -8015 -1516 -17393 -21829 -23996 -58858 -83552 -48933
3037 -48933 -14670 -8912 -761 12385 34907 17396 29084 44479 54897 45809 38358 33043 45934
3024 45934 34284 -30231 -44341 3973 2934 4221 28296 32942 5927 -25225 -21348 -38763 -25123
3011 -25123 -8422 8910 20598 -6431 -12216 16879 35493 49620 31170 14610 13203 -6397
2999 -6397 -28601 -1993 42809 32885 -9345 -3679 1436 -1103 -714 22150 9491 -4330 1527
$$ packed form
3088a8232L5750j219q394R528J8222k5073j0284j022j39J2329j8711l2263Q43
3075c8665J6838N1321K5764k5603J9214J0889r248J0149P539j759j070P676L580
3062G6625p785j5069k0874j4895M625k3781k4279L2211k8947j4246K5385Q528
3050b502k203j1560M9785M323l4438j1420O499j5877m436k167l4862k4694L4619
3037d8933L4263N758Q151J3146K2522j7511J1688J5395J0418r088p451n315J2891
3024D5934j1650o4515j4110M8314j039J287K4075M646k7015l1152L877j7415J3640
3011b5123J6701J7332J1688k7029n785K9095J8614J4127j8450j6560j407j9600
2999f397k2204K6608M4802r924m2230N666N115k539L89K2864j2659j3821N857
$$ plain form
2986 1527 27485 25209 38647 29864 -22346 -44986 -15886 -3539 13922 9283 1320 -9186 -19164
2973 -19164 -32533 -25456 -17359 -18481 -36789 -46095 -36600 -10982 -2120 2540 12309 21765 12706 22694
2959 22694 44452 36252 10153 1526 -4193 -569 1870 -3628 -25605 -26484 -47703 -67538 -59628 -21226
2945 -21226 -3878 -2925 -10494 -22328 -43491 -55298 -69080 -63785 -54870 -22510 4694 491 27721
2932 27721 36694 31256 22631 -14168 6383 20989 11959 14169 25145 13410 -26457 -33791 -48194
2919 -48194 -44694 -19702 -46763 -46247 -41692 -60853 -60339 -60093 -72412 -30343 -12678 -12358 -43630 -56868
2905 -56868 -17987 6780 4047 15723 37201 41527 22263 -3960 -1182 477 -4138 18684 17177
2892 17177 -19691 -34272 -17811 -768 1128 31500 59266 29032 7564 -2326 7713 25279
$$ packed form
2986A527K5958k276J3438q783n2210k2640K9100J2347J7461m639p963j0506r978
2973a9164j3369P077Q097j122j8308r306R495K5618Q862M660R769R456r059R988
2959B2694K1758q200k6099q627n719L624K439n498k1977q79k1219j9835P910L8402
2945b1226J7348R53p569j1834k1163j1807j3782N295Q915L2360K7204m203K7230
2932B7721Q973n438q625l6799K0551J4606r030K210J0976j1735l9867p334j4403
2919d8194L500K4992k7061N16M555j9161N14K46j2319M2069J7665L20l1272j3238
2905e6868L8881K4767k733J1676K1478M326j9264k6223K778J659m615K2822j507
2892A7177l6868j4581J6461J7043J896L0372K7766l0234k1468r890J0039J7566
$$ plain form
2880 25279 -7095 -20331 -27694 -23014 -10482 27194 13877 4357 22521 52834 56263 55064 45682
2867 45682 49971 91645 73854 15598 -6850 21666 36789 14899 8714 -5574 -3558 -6247 -3287
2854 -3287 17787 46079 45320 4996 -10423 -2041 -3218 -43839 -71898 -87188 -112056 -89700 -44105
2841 -44105 -44789 -33701 -23393 -8803 3456 -7637 3951 13274 20929 27016 22409 -12451 -61195
$$ packed form
2880B5279l2374j3236p363M680J2532L7676j3317r520J8164L0313L429j199r382
2867D5682M289M1674j7791n8256k2448K8516J5123k1890o185j4288K016k689K960
2854c287K1074K8292p59m0324j5419Q382j177m0621k8059j5290k4868K2356M5595
2841d4105o84J1088J0308J4590J2259j1093J1588R323P655O087m607l4860m8744
$$ [...]
##END NTUPLES=NMR SPECTRUM
##END=
