##TITLE=Analysis number 327332
Compound Code mo 07389
Project Code adrs
Chemist Name hixia
##JCAMPDX= 6.0         $$ Bruker NMR JCAMP-DX V2.0
##DATA TYPE= NMR SPECTRUM
##DATA CLASS= NTUPLES
##ORIGIN= Bruker BioSpin GmbH
##OWNER= nmr
$$ XWIN-NMR		Version 3.5
$$ Wed Mar 21 13:21:38 2007 GMT Standard Time (UT+0h)  MAYBRIDGE\nmr@NMR_250MHZ
##.OBSERVE FREQUENCY= 250.131544655141
##.OBSERVE NUCLEUS= ^1H
##.ACQUISITION MODE= SIMULTANEOUS (DQD)
##.ACQUISITION SCHEME= undefined
##.AVERAGES= 16
##.DIGITISER RES= 18
##SPECTROMETER/DATA SYSTEM= dpx250
##.PULSE SEQUENCE= zg30
##.SOLVENT NAME= DMSO
##.SHIFT REFERENCE= (INTERNAL, DMSO, 0, 16.522)
##AUDIT TRAIL= $$ (NUMBER, WHEN, WHO, WHERE, WHAT)
$$ ##TITLE= Audit trail, XWIN-NMR		Version 3.5
$$ ##JCAMPDX= 5.01
$$ ##ORIGIN= Bruker BioSpin GmbH
$$ ##OWNER= nmr
$$ C:\u/data/dgb/nmr/ADRS/1500/pdata/1/auditp.txt
$$ ##AUDIT TRAIL=  $$ (NUMBER, WHEN, WHO, WHERE, WHAT)
(   1,<2007-03-21 13:21:15.18 +000>,<MAYBRIDGE\nmr>,<NMR_250MHZ>,
      <created by zg, POWCHK disabled, PULCHK disabled
       configuration hash MD5:
       49 4B E0 1D 92 C2 6B 37 9F E6 65 BC 52 41 86 1D
       data hash MD5: 64K
       49 88 54 A1 AB FB 14 0E C6 DB B7 F2 B0 3A F6 92>)
(   2,<2007-03-21 13:21:30.05 +000>,<MAYBRIDGE\nmr>,<NMR_250MHZ>,
      <Start of raw data processing
       ef LB = 0.3 FT_mod = 6 PKNL = 1 SI = 32K 
       data hash MD5: 32K
       7E 2B 34 5E B3 75 DB B4 18 C5 4D 0B 28 1F 76 A0>)
(   3,<2007-03-21 13:21:31.72 +000>,<MAYBRIDGE\nmr>,<NMR_250MHZ>,
      <apk 
       data hash MD5: 32K
       2D 4E 81 7E BF F2 21 85 89 92 3E F1 6C 5B 59 8D>)
(   4,<2007-03-21 13:21:32.49 +000>,<MAYBRIDGE\nmr>,<NMR_250MHZ>,
      <abs ABSG = 5 
       data hash MD5: 32K
       07 A1 55 C6 43 7C 83 0C FB B0 D1 CE 68 1F D0 DB>)
$$ ##END=
$$ 
$$ hash MD5
$$ 8D F0 DB 29 81 F6 65 05 93 48 C4 38 C2 07 4D 95
##$RELAX= 
##$RELAX= 
##$RELAX= 
##$RELAX= 
##$RELAX= 
##$RELAX= 
##$RELAX= 
$$ Bruker specific parameters
$$ --------------------------
##$DU= <C:\u>
##$EXPNO= 1500
##$NAME= <ADRS>
##$PROCNO= 1
##$TYPE= <nmr>
##$USER= <dgb>
##$AMP= (0..31)
100 100 100 100 100 100 100 100 100 100 100 100 100 100 100 100 100 100 
100 100 100 100 100 100 100 100 100 100 100 100 100 100 
##$AQSEQ= 0
##$AQ_mod= 3
##$AUNM= <au_zg>
##$AUTOPOS= <25 >
##$BF1= 250.13
##$BF2= 250.13
##$BF3= 250.13
##$BF4= 250.13
##$BF5= 500.13
##$BF6= 500.13
##$BF7= 500.13
##$BF8= 500.13
##$BYTORDA= 1
##$CFDGTYP= 0
##$CFRGTYP= 5
##$CHEMSTR= <none>
##$CNST= (0..31)
1 1 145 1 1 1 1 1 1 1 1 1 1 1 1 1 1 1 1 1 1 1 1 1 1 1 1 1 1 1 1 1 
##$CPDPRG= <>
##$CPDPRG1= <>
##$CPDPRG2= <>
##$CPDPRG3= <>
##$CPDPRG4= <mlev>
##$CPDPRG5= <mlev>
##$CPDPRG6= <mlev>
##$CPDPRG7= <mlev>
##$CPDPRG8= <mlev>
##$CPDPRGB= <>
##$CPDPRGT= <>
##$D= (0..31)
0 1 0 0 0 0 0 0 0 0.06 0 0 0 0 0 0 0.0002 0 0 0 0 0 0 0 0 0 0 0 0 0 0 
0 
##$DATE= 1174483274
##$DBL= (0..7)
120 120 120 120 120 120 120 120 
##$DBP= (0..7)
150 150 150 150 150 150 150 150 
##$DBP07= 0
##$DBPNAM0= <>
##$DBPNAM1= <>
##$DBPNAM2= <>
##$DBPNAM3= <>
$$ [...]
##$SUBNAM7= <"">
##$SUBNAM8= <"">
##$SUBNAM9= <"">
##$SW= 20.6930455092707
##$SWIBOX= (0..15)
0 0 3 0 0 0 0 0 0 0 0 0 0 0 0 0 
##$SW_h= 5175.983436853
##$TD= 65536
##$TD0= 1
##$TE= 683.16
##$TE2= 300
##$TE3= 300
##$TEG= 300
##$TL= (0..7)
0 120 120 120 120 120 120 120 
##$TP= (0..7)
150 150 150 150 150 150 150 150 
##$TP07= 0
##$TPNAME0= <>
##$TPNAME1= <>
##$TPNAME2= <>
##$TPNAME3= <>
##$TPNAME4= <>
##$TPNAME5= <>
##$TPNAME6= <>
##$TPNAME7= <>
##$TPOAL= (0..7)
0.5 0.5 0.5 0.5 0.5 0.5 0.5 0.5 
##$TPOFFS= (0..7)
0 0 0 0 0 0 0 0 
##$TUNHIN= 0
##$TUNHOUT= 0
##$TUNXOUT= 0
##$USERA1= <user>
##$USERA2= <user>
##$USERA3= <user>
##$USERA4= <user>
##$USERA5= <user>
##$V9= 5
##$VALIST= <valist>
##$VCLIST= <CCCCCCCCCCCCCCC>
##$VD= 0
##$VDLIST= <DDDDDDDDDDDDDDD>
##$VPLIST= <PPPPPPPPPPPPPPP>
##$VTLIST= <TTTTTTTTTTTTTTT>
##$WBST= 1024
##$WBSW= 4
##$XGAIN= (0..3)
0 0 0 0 
##$XL= 0
##$YL= 0
##$YMAX_a= 263375
##$YMIN_a= -291986
##$ZGOPTNS= <>
##$ZL1= 120
##$ZL2= 120
##$ZL3= 120
##$ZL4= 120
##$ABSF1= 16.522
##$ABSF2= -4.171173
##$ABSG= 5
##$ABSL= 3
##$ALPHA= 0
##$AQORDER= 0
##$ASSFAC= 0
##$ASSFACI= 0
##$ASSFACX= 0
##$ASSWID= 0
##$AUNMP= <proc_1d>
##$AZFE= 0.1
##$AZFW= 0.1
##$BCFW= 0
##$BC_mod= 0
##$BYTORDP= 0
##$COROFFS= 0
##$CY= 12.5
##$DATMOD= 1
##$DC= 0
##$DFILT= <>
##$DTYPP= 0
##$F1P= 14.0000005364418
##$F2P= -0.99999901652339
##$FCOR= 0.5
##$FTSIZE= 32768
##$FT_mod= 6
##$GAMMA= 0
##$GB= 0
##$INTBC= 1
##$INTSCL= 1
##$ISEN= 128
##$LB= 0.3
##$LEV0= 0
##$LPBIN= 0
##$MAXI= 10000
##$MC2= 0
##$MEAN= 0
##$ME_mod= 0
##$MI= 0
##$NCOEF= 0
##$NC_proc= -4
##$NLEV= 6
##$NOISF1= 0
##$NOISF2= 0
##$NSP= 0
##$NTH_PI= 0
##$NZP= 0
##$OFFSET= 16.522
##$PC= 1
##$PHC0= 221.0677
##$PHC1= 11.58978
##$PH_mod= 1
##$PKNL= yes
##$PPARMOD= 0
##$PSCAL= 4
##$PSIGN= 0
##$REVERSE= no
##$SF= 250.13
##$SI= 32768
##$SIGF1= 0
##$SIGF2= 0
##$SINO= 400
##$SIOLD= 32768
##$SREGLST= <1H.DMSO>
##$SSB= 0
##$STSI= 32768
##$STSR= 0
##$SW_p= 5175.98343685301
##$SYMM= 0
##$S_DEV= 0
##$TDeff= 65536
##$TDoff= 0
##$TI= <Analysis number 999999
Compound Code 99
Book Reference 9
Project Code 9>
##$TILT= no
##$TM1= 0
##$TM2= 0
##$TOPLEV= 0
##$USERP1= <user>
##$USERP2= <user>
##$USERP3= <user>
##$USERP4= <user>
##$USERP5= <user>
##$WDW= 1
##$XDIM= 32768
##$YMAX_p= 500785304
##$YMIN_p= -325054
$$ End of Bruker specific parameters
$$ ---------------------------------
##NTUPLES= NMR SPECTRUM
##VAR_NAME=  FREQUENCY,     SPECTRUM/REAL,   SPECTRUM/IMAG
##SYMBOL=    X,             R,               I
##VAR_TYPE=  INDEPENDENT,   DEPENDENT,       DEPENDENT
##VAR_FORM=  AFFN,          ASDF,            ASDF
##VAR_DIM=   32768,         32768,           32768
##UNITS=     HZ,            ARBITRARY UNITS, ARBITRARY UNITS
##FACTOR=    0.157963299565203, 1,           1
##FIRST=     4132.6476996994, 0,             0
##LAST=      -1043.33573715361, 0,           0
##MIN=       -1043.33573715361, -325054,     0
##MAX=       4132.6476996994, 500785304,     0
$$ Real data points
##PAGE= N=1
##DATA TABLE= (X++(R..R)), XYDATA
$$ [...]
16030a7130q0580k9486q168J7362O2181O9535O3834n5899o9916M4985j5518L289
16018a5511n707Q636M7483O2356K6363j4148m6987n1489J3921N0545m3965n8487
16006b6990k1274k5479O1502L6060m391o202L3348L524j8383J8149L6506L2550
15994A18920M0327N9106M6986K4979K4520q81p5923k4296R6870J19064L379L3611
15982D66662M8273R7432K5485J07863K8875l9343M0675k5330n6129m6561k9664
15971F18238m1139j04381m7875m5426l8788k5787p1880n5638K928K3694k5458
15960A88488l3980l7830m8826l7859m456L346L7215J7316l8036o6602l3908M9492
15948e640L2905j2807K1794Q3635p63j09498j156k265k0043J5596L755R6405m724
$$ y = [-17130, -97710, -127196, -135364, -118002, -55821, 13714, 77548, 21649, -48267, -3282, -18800, -15511, -21218, -12582, 34901, 97257, 123620, 109472, 62485, 10996, 24917, 75462, 31497, -26990, -48264, -73743, -12241, 23819, 19428, 13226, 46574, 50098, 31715, 49864, 86370, 118920, 159247, 218353, 265339, 290318, 314838, 313957, 238034, 213738, 310608, 429672, 433051, 466662, 514935, 612367, 637852, 745715, 774590, 735247, 775922, 750592, 694463, 647902, 618238, 577099, 472718, 424843, 379417, 340629, 314842, 242962, 187324, 190252, 213946, 188488, 154508, 116678, 67852, 29993, 25537, 28883, 66098, 83414, 45378, -21224, -55132, -5640, 27265, 14458, 36252, 119887, 119124, 9626, 8470, 6205, -13838, 1758, 5513, 101918, 97194]
15935I7194o4783k1750L0852j2144m0394n489k8367Q097L4534m051M1841M0448
15923G5988m0106k1609K1M990j9387J2110J9694j0825L9973J1696j2371O7P294
15910F7535J4730k679l6935k2558j8891Q660L6683j3923k2472Q2079j0589J6760
15898I8400J4048J3325j7604m0420K5214j5321J8052l692n3220K7990j8094o2660
15886a3982r166O2409j8244n1429j9145m2463q536J0310M5620N8033K7858K4732
15874F5997O1902j6321m1490r1319o3822O5919O6596k3599q0429n0078M9411j520
15862e8753k3222K6262N6032P0088j8877n2643k7017K9400q267m312O192k286
15850g403O8834m4898j1008j9109L1842L2658m3781q1652K0908O8838P9133o3734
$$ y = [97194, 32411, 10661, 41513, 29369, -11025, -16514, -44881, -36784, -2250, -6301, 35540, 75988, 35882, 14273, 14294, 19284, -103, 12007, 31701, 20876, 60849, 72545, 60174, 60241, 67535, 82265, 79586, 42651, 20093, 1202, 9862, 46545, 32622, 10150, 92229, 81640, 98400, 112448, 125773, 108169, 67749, 92963, 77642, 95694, 92002, 38782, 66772, 48678, -13982, -23148, 39261, 21017, -30412, -49557, -92020, -100556, -90246, -44626, 13407, 41265, 65997, 127899, 111578, 70088, -21231, -85053, -19134, 47462, 23863, -56566, -106644, -57233, -58753, -81975, -55713, 319, 70407, 51530, -1113, -28130, 1270, -6997, -11309, -5117, -7403, 61431, 16533, 5525, -13584, 18258, 50916, 7135, -74517, -53609, 15229, 94362, 30628]
15838C0628q2987q6874M662L9434J4336L84n2542P6104M5810P4084K1634L9599
15826A24272k3277o6382L3660O2137k8404n6850p6397O773K5890J9356j4848p0890
15814f4960j4670L6114K8532M3854J08393M8526o178p7091m6612l9311m7544M4159
15802A3212N4077M9520l595q4679l1622k5184Q0591M4929n2423o8041J8523O3044
15790E8352N2209K9458n2068l9625P4403N0651J8623m8575m2940p155m14n5045
15778C7874l7204Q559p682j0083n3121k5074Q170N3586M521l549n1672m710J0056
15765g0329j2524M9667M6272M8914k0212l0452L1164M2013m1225q0896N319J8094
15753a4195l180j2657n0605l3129M2392K5995m2694M2012P2038O2649m6448J6724
$$ y = [30628, -52359, -139233, -134571, -95137, -80801, -80417, -132959, -56855, -11045, 63039, 84673, 124272, 100995, 34613, 68273, 130410, 102006, 45156, -31241, -24468, 1422, 20778, 5930, -64960, -79630, -43516, -14984, 28870, 137263, 185789, 179611, 102520, 55908, 16597, -30947, 13212, 67289, 116809, 113214, 28535, -3087, -28271, 52320, 97249, 44826, -23215, -4692, 58352, 110561, 140019, 87951, 48326, 122729, 173380, 192003, 143428, 100488, 93333, 92919, 37874, 670, 9229, 1547, -8536, -61657, -86731, -78561, -24975, -20454, -24003, -75675, -80385, -70329, -82853, -33186, 13086, 62000, 41788, 11336, 42500, 84513, 43288, -37608, -32289, -14195, -17375, -30032, -80637, -113766, -71374, -45379, -88073, -46061, 25977, 88626, 42178, 58902]
15741E8902j7172j631M1811L403p5790l0393J3999l3722N9282P3049M7979k4481
15729A15236q6235k4598K3595O0291L4500j1709l0707k0345J4268N6083J18892
15718B49271n0109q3294l1153k4452L8329K5227l7171n8522O1990M8320Q1067
15707B19503M5189n8402r4222l4104J4557O7246K8523k0710K5627R528o8721m0167
15695I3847J25967m7025o9053J9923R89Q502k4421j3247K4428J5572O8107J4499
15683B18088q615m6942l6065l1238j2090O4172J5774p282K258K7721M3571m796
15671B24556q0285n8255k8942n461J9117N941j6053O1294K9396N4148J8642l6744
15659A87354l2395K0123j2098j8952J9817o056m592L5040P0416k2847J9649R668
$$ y = [58902, 41730, 40099, 81910, 85313, 9523, -20870, -6871, -40593, 18689, 91738, 139717, 115236, 29001, 4403, 27998, 88289, 122789, 111080, 80373, 60028, 74296, 130379, 249271, 199162, 115868, 84715, 60263, 98592, 123819, 86648, 28126, 90116, 138436, 219503, 264692, 206290, 112068, 77964, 92521, 159767, 188290, 167580, 193207, 202735, 134014, 93847, 219814, 172789, 103736, 123659, 124648, 133150, 108729, 95482, 119910, 135482, 203589, 218088, 209473, 162531, 126466, 95228, 83138, 147310, 163084, 155802, 158060, 185781, 229352, 224556, 144271, 86016, 57074, 51613, 70730, 76671, 60618, 121912, 151308, 205456, 224098, 187354, 154959, 175082, 162984, 144032, 163849, 157793, 153201, 188241, 258657, 235810, 255459, 265127]
15647B65127M0308k3680l7790L2505L8683l4772m8555q001L6071K6489M6835L5880
15635C69100l1190p0434R978N4933m056o2931K1293P8366K8047m0813l4038k3340
15623B94915L7732L1769K5445J3884l887l6264J9504K4962Q9410j6042M3926L5464
15611E60818r417M966j2124J6579K995m9380R699j4852k2923L0959O6314R9552
15599F83186L2480J1162K2202L601M5602N5672L2327J24030J7920k0094l446L6400
15587A041042n8952j6791M5151Q4803P0565Q8711k4185P3260J71751M2166j6388
15576A501133Q131n807J83533R5617J27486O9596J44653J49399J00706R0425J66367
15565B631239K27775K02415J84659K09472K42478K55069K76837K69039L71341
$$ y = [265127, 305435, 281755, 243965, 276470, 315153, 280381, 231826, 223825, 259896, 286385, 333220, 369100, 337910, 267476, 277454, 332387, 328331, 265400, 286693, 365059, 393106, 352293, 318255, 294915, 332647, 364416, 389861, 403745, 399858, 363594, 383098, 408060, 497470, 481428, 525354, 560818, 551401, 556367, 544243, 560822, 563817, 514437, 524136, 509284, 486361, 517320, 583634, 683186, 715666, 726828, 749030, 752631, 798233, 853905, 886232, 1010262, 1028182, 1008088, 1004642, 1041042, 982090, 965299, 1010450, 1095253, 1165818, 1254529, 1230344, 1303604, 1475355, 1517521, 1501133, 1509264, 1503457, 1686990, 1782607, 1910093, 1979689, 2124342, 2273741, 2374447, 2464872, 2631239, 2859014, 3061429, 3246088, 3455560, 3698038, 3953107, 4229944, 4498983, 4870324]
15556D870324M01071L56013L79811M70339N70482P17614P95154R70518J097763
15547A0629089J180378J337779J534011J839518K198872K547903L044989L668017
15539B7980556M475983N532190P060136Q812298J0828802J3008070J4821337J5917343
15531A08436715J5922861J4911315J2696710R313614M804633k45520n203762r414623
15523A51221943j2795648j4823702j5669594j5481678j4362269j2538920j0509840
15516E5040292q532924o825199n472501m464609l642426l030949k613059k196864
15508A8261761j889694j624279j457959j307805j152997r77977q62402p51672
15500H236976o93379n97438n04691m42281l78122l67375k81115l59228l44383
$$ y = [4870324, 5271395, 5627408, 6007219, 6477558, 7048040, 7765654, 8560808, 9531326, 10629089, 11809467, 13147246, 14681257, 16520775, 18719647, 21267550, 24312539, 27980556, 32456539, 37988729, 45048865, 53861163, 64689965, 77698035, 92519372, 108436715, 124359576, 139270891, 151967601, 161281215, 166085848, 165840328, 160636566, 151221943, 138426295, 123602593, 107932999, 92451321, 78089052, 65550132, 55040292, 46507368, 39682169, 34209668, 29745059, 26102633, 23071684, 20458625, 18261761, 16372067, 14747788, 13289829, 11982024, 10829027, 9851050, 8988648, 8236976, 7543597, 6946159, 6441468, 5999187, 5621065, 5253690, 4972575, 4613347, 4268964]
15491D268964k45675j66148k28054k20684j77935j78887j40527o8938j38773j50849
15481B552494n3941q6081j31413k06974p9088J9315n9903q0283r0309j29145l1628
15470A623044l8956M6855m8842q8445j02182l8271p9159k2348N1259r7965l1808
15459A173182l0123r1841k0727q159K5965J628l7128m4439l9820j4976l9698l4435
15447H39429j6386k4453L0132l0943o6935J6686l0196j5090K563m530N9621J5287
15435G75185o7412q0166l2833K7860m6137m4103j1855R955k0716J0394L9439p1234
15423D88377j5585j4616k7010P5745o5679n1831l0809K4412k8506l5900J2714
15412C31312o6534O836K0567J8041O2185L6806q2l1201M05m8684J9167L2062L9332
$$ y = [4268964, 4023289, 3857141, 3629087, 3408403, 3230468, 3051581, 2911054, 2842116, 2703343, 2552494, 2498553, 2412472, 2281059, 2074085, 1994997, 2014312, 1954409, 1874126, 1783817, 1654672, 1623044, 1584088, 1630943, 1582101, 1493656, 1391474, 1353203, 1274044, 1251696, 1302955, 1204990, 1173182, 1143059, 1051218, 1030491, 1022332, 1048297, 1049925, 1012797, 968358, 928538, 913562, 873864, 839429, 823043, 798590, 828722, 797779, 730844, 747530, 717334, 702244, 704807, 700277, 759898, 775185, 707773, 627607, 594774, 622634, 576497, 532394, 520539, 530494, 509778, 520172, 559611, 488377, 472792, 458176, 431166, 506911, 441232, 389401, 358592, 383004, 354498, 318598, 331312, 264778, 271614, 292181, 310222, 372407, 409213, 409131, 377930, 378335, 329651, 348818, 380880, 420212]
15399D20212j4766k9559N2374o797k6023k4649l1115K7142P1022l548j3834L88
15387D20847q0548n1557l7020n3776n996K2801k616K9879L4950P920l0351N36
15375B55069K105l2079r665Q6742J1629J0656J03699l0726m2872k3581l6283L7086
15363C31780n9684l8441p8420j2001L9202J9331k3209L7347M1483M0169k4162
15352B73395k9903n6048r2612m1401L4606J2683R599R6492K8464J16j3688j2559
15340B09144J5899m5759r7894j0511L0132O126N763o782Q4002j179o0404k7273
15328A01264j209l8931J4902N8696M1130Rp829L7725L2827m027n0531J9769J7587
15315B21382j233j0700L8714q330p7024L4260Q971P993k5445l8081j1704N373
$$ y = [420212, 405446, 375887, 428261, 421464, 395441, 370792, 339677, 366819, 437841, 434293, 420459, 420847, 340299, 288742, 251722, 197946, 191950, 214751, 212135, 242014, 276964, 284884, 254533, 255069, 257174, 225095, 215430, 302172, 313801, 324457, 428156, 397430, 354558, 330977, 294694, 331780, 272096, 233655, 155235, 143234, 182436, 201767, 178558, 215905, 257388, 297557, 273395, 243492, 187444, 94832, 53431, 88037, 100720, 110319, 206811, 235275, 235391, 221703, 209144, 225043, 179284, 81390, 70879, 101011, 107137, 112900, 106118, 190120, 188941, 128537, 101264, 100055, 61124, 76026, 134722, 175852, 175861, 168032, 205757, 238584, 234557, 184026, 203795, 221382, 220149, 209449, 248163, 239833, 162809, 197069, 206040, 214033, 188588, 150507, 138803, 144176]
15303A44176j220k2208J7835j8717k367p210j6424Q856N2221L4103m7321o7433
15291G4291j6801P3893M8095m4553p4210k2002K5500K8418j993l9475K8024N5767
15279A34954j6388p8627o6100N5486J05535L0165O5705m7602k2050q3098q333
15268F9647n7297m8272K4731J02207K0267o1152r991L3331l266j3449k9206L0010
15256E7560J2845l1085o4141j0460J853P7862Q0784K0355L4328P7976O7044p3869
15244B51052k1181m79l8843m4085j27099n3284K0743P518Q167r601N6383r793
15232C9498l1656k5436j4130l0509n7048K3028J03998O0467p5068J0226q763M1215
15220C5822l4431p096Q6235j3525k7269J5596l1912K5073k5490j9029J7175N157
$$ y = [144176, 142956, 120748, 138583, 119866, 117499, 110289, 93865, 102721, 154942, 189045, 141724, 74291, 57490, 131383, 179478, 134925, 60715, 38713, 64213, 92631, 90638, 51163, 79187, 134954, 118566, 39939, -26161, 29325, 134860, 165025, 230730, 183128, 161078, 77980, 69647, 12350, -35922, -11191, 91016, 111283, 50131, 40140, 73471, 70205, 56756, 27550, 57560, 70405, 39320, -24821, -35281, -33428, 44434, 125218, 145573, 179901, 257877, 324921, 251052, 229871, 229392, 190549, 146464, 19365, -33919, -13176, -5658, 2509, -7092, 49291, 39498, 7842, -17594, -31724, -62233, -119281, -96253, 7745, 68212, -6856, 3370, -5393, 35822, 1391, -5705, 80530, 67005, 39736, 55332, 23420, 48493, 23003, 3974, 21149, 26306]
15208B6306o0435l2834Q2936J140m1777J9238Q2885n8280l3804Q493K6064K554
15196B2486l011J4694M7612L0962L1046k0550L26J3203K8315M20j9890k5985l7128
15183H2500j8666j727L1996L5226m3836K0105J7212n9647L6881K7030j05820J1051
15171C2305J3023l9630l6411M600J1867K6382L1353l9824l8456l7624N5146O7132
15159D9863K9078k5829k0756j2168n6023K9414L2316j9348j190L6237O2495q8639
15147A5450l9833j8305n1472m230N5673M5267J7121l1076K477q734j4330N4608
15135B2616q99j09592m9802L2856j6828J4535O1171K9027N8818K4336l8755n4178
15123b6695l2553K7981o3733m2626O1806J27902N8018J5876P4087n3591q7924
$$ y = [26306, -34129, -66963, 15973, 17113, -24664, -5426, 77459, 19179, -14625, -6132, 19932, 22486, 19475, 34169, 81781, 112743, 143789, 123239, 123565, 136768, 165083, 165503, 145613, 119628, 82500, 63834, 62107, 94103, 129329, 85493, 105598, 122810, 63163, 100044, 127074, 21254, 32305, 45328, 5698, -30713, -26113, -14246, 12136, 43489, 3665, -34791, -72415, -17269, 49863, 78941, 53112, 32356, 20188, -35835, -6421, 25895, 6547, 5357, 41594, 104089, 15450, -24383, -42688, -94160, -98390, -42717, 2550, 19671, -11405, -8928, -17662, -31992, 22616, 21717, -87875, -137677, -104821, -121649, -107114, -45943, -16916, 41902, 66238, 27483, -26695, -59248, -31267, -95000, -137626, -75820, 52082, 110100, 125976, 200063, 146472, 58548]
15112E8548l0963K1593L6862o1740k5528j592K3622J9318o141n9430j1083L724
15100c2810J6070M1070O6050M4222k2766l3082j7250M849N0509J5759M6036J4459
15088A93116l2601J7986N5845m5949l4195O620R998L7898k978K4578R3411O2683
15076C86412Q8123J04205J7648J0871K0539R421J0267j5748K0931P653p5797k6643
15064E57882o3954m621K2673j02120p7228r7590m7472p1999l9785m6261k4202
15053E323j0335P9175K6123m2701K9455L3601n2386L1636q042k2852m3882j1286
15041A3829R623K9362k1750K1883L1774K7145n1241m0138l2255O4463q378j09064
15029f4747n7111N0923N2236K2197M632K7877m68P877J5491k5254J0838k9824
$$ y = [58548, 27585, 49178, 86040, 24300, -1228, -2820, 20802, 40120, 33979, -25451, -36534, -32810, -16740, 24330, 90380, 134602, 111836, 78754, 61504, 66353, 116862, 132621, 178657, 193116, 160515, 178501, 234346, 188397, 154202, 160822, 170820, 208718, 205740, 230318, 323729, 386412, 474535, 578740, 596388, 607259, 627798, 637219, 647486, 631738, 652669, 660322, 584525, 557882, 493928, 489307, 511980, 409860, 332632, 235042, 187570, 115571, 75786, 29525, 5323, -5012, 74163, 100286, 57585, 87040, 120641, 68255, 99891, 91849, 68997, 25115, 13829, 23452, 52814, 31064, 52947, 84721, 111866, 60625, 20487, -11768, 52695, 44317, -64747, -121858, -70935, -18699, 3498, 8130, 36007, 35539, 43416, 58907, 33653, 44491, 14667]
15017A4667k2061L7107j5497j7810J9484o0895q1313K3478M0927M6759M5599J4331
15005D4776k2358j3249j4819P974L0043K9732J1999M8301j9052L8416l3632j20299
14993a2168k3896O2124l01l5956K9782J8P656P7445N1705J1163n4923j7478J6731
14980A11902j1947q1380j1752q460K3954N1991N0819R532l1711p6831J9734M0611
14968H6462p568q0514P1457r229L5640m8550J5288J6080k9475k7013J850j065
14956B3363L2007n1187m8545l5622j498O6975m448J0520K6875p223n3987L0733
14944a2037K0906K3404k6866k3198L6559P357m7183k4252k155k8200K2334O915
14932d6416m464j1102j2020k8889J3593m825r47J4200L0963o6L0581P7523J7948
$$ y = [14667, -7394, 29713, 14216, -3594, 15890, -45005, -126318, -102840, -61913, -15154, 30445, 44776, 22418, 9169, -5650, 2324, 32367, 62099, 74098, 122399, 103347, 141763, 108131, -12168, -36064, 26060, 25759, -10197, 19585, 19603, 27259, 104704, 156409, 167572, 112649, 95171, 111902, 99955, 18575, 6823, -1637, 22317, 74308, 125127, 134659, 102948, 26117, 45851, 86462, 78894, -1620, 69837, 60608, 96248, 47698, 62986, 79066, 49591, 22578, 24428, 23363, 55370, 4183, -44362, -79984, -81482, -14507, -18955, -8435, 18440, 11217, -42770, -12037, 8869, 32273, 5407, -17791, 18768, 26125, -21058, -45310, -47465, -75665, -53331, -46416, -50880, -61982, -74002, -102891, -89298, -94123, -95070, -80870, -49907, -49973, -19392, 58131, 76079]
14919G6079o6084o0723J8235j7872m0047J7994L4083k9322K6836M2918N8117J1682
14907G1896n3763M817o4757M5388N8988m2082n2276J8862k6736m1866N864N5663
14895b0002m013j4827J9361j3566P978P7959O643j0877J3472l5933l4493P345
14883i53K4229j0696N8754N1862m9471k9055K9202l0580M139m0448k7998l9488
14871f0503j6344J7556J0726j5769P244M3107N890M4718k7120l3957K3917j2632
14859a3167K9123L2399K4550K7301n1208p635N2239K9409l3275o4068n3299j0441
14847c8072k8605j069L9694L3584n2115l85P9464n77l8404K4373K9776N2495K3001
14834A23160l4421m1611p4766q1393K9320J6116M1485K9638K4446m8219o2826
$$ y = [76079, 9995, -50728, -32493, -50365, -90412, -72418, -38335, -67657, -40821, 2097, 60214, 71896, 18133, 22950, -41807, 3581, 62569, 20487, -31789, -12927, -39663, -81529, -75665, -20002, -24015, -38842, -19481, -33047, -25069, 52890, 59533, 48656, 62128, 26195, -8298, -953, 23276, 12580, 71334, 123196, 73725, 44670, 73872, 43292, 47431, 6983, -21015, -60503, -76847, -59291, -48565, -64334, -57090, -13983, -8093, 36625, 9505, -24452, -535, -13167, 15956, 48355, 72905, 100206, 48998, 41363, 93602, 123011, 89736, 25668, -27631, -38072, -66677, -67746, -28052, 5532, -46583, -46968, 32496, 31919, -6485, 17888, 47664, 100159, 123160, 88739, 47128, -27638, -109031, -79711, -63595, -22110, 7528, 31974, -16245, -79071]
14823g9071K3911O2680L4577l7481m4302J2358N9366k9235k9125Q9341j0846l055
14811D9118j6159j4512r748P5438J9330K928P02n9906n583L4645m7527m7332N5617
14798C7011O7427k1309l8471K7659L4726J4726m8165N1150k8121k0734L3531j7986
14786I1444L7355q887r0433n7255q0270J7689R2028l6791n2057J1615K0266L2416
14774b2880K5608n421l4518P5284K2950l6198j19396k995J9088o3966P693Q5383
14762d9368k6500R593o066L8650M81P846m0105q1550K2345Q5867P2725n1012o8990
14749h6084R2347J8561k4911K158N2202P216m9454M935L1584K6669o4042j2317
14737a136j9949j2548l302p1274n0196N820N7150k7734N2374P0053p09P6917l271
$$ y = [-79071, -55160, 7520, 42097, 4616, -39686, -27328, 32038, 2803, -26322, 63019, 52173, 49118, 32959, 18447, 8699, 84137, 103467, 106395, 107097, 47191, 41608, 76253, 28726, -18606, 37011, 104438, 83129, 44658, 72317, 107043, 121769, 73604, 124754, 96633, 75899, 109430, 91444, 128799, 119912, 29479, -27776, -108046, -90357, 1671, -35120, -87177, -75562, -55296, -22880, 2728, -2693, -37211, 38073, 61023, 24825, -94571, -97566, -78478, -142444, -134751, -49368, -75868, -66275, -72341, -33691, -33210, -25364, -65469, -147019, -124674, -38807, 33918, -17094, -86084, 6263, 24824, -87, 2071, 54273, 61489, 12035, 16970, 48554, 75223, 11181, -1136, -21085, -33633, -36935, -108209, -158405, -152585, -95435, -123169, -70795, -742, -1451, 75466, 72195]
14724G2195n4407r5817m1875J7817n4424M267R0627R0185K0467k5555j2081J2805
14712B4204j8215j4055K0467O3962J8426k9519J6622n9750o8149P404N6798L0022
14700D8217m1042j25464j06710J9520L5506m6022L3658J62213Q1751l9622J856
14689B3861J0364k1088J8525j2085q873m2650L797L6375M5325l7398K3664O7730
14677A07547k1757k2933j1444p9351J4697N6842O452p3223l0406K1524r181K6489
14665a4744K7091K1063R645J5499p7909k5791N4760k5382J674K0785P3055j2656
14653F7090k8675m6532L2367L6011l3088o3620l9005j2395m0869M4060R7636M5132
14641E8112J1173M0263k0566k3526p3119n0133k5281L5555L3084j4595K0874O410
$$ y = [72195, 17788, -78029, -119904, -102087, -156511, -152244, -61617, 28568, 49035, 23480, 11399, 24204, 5989, -8066, 12401, 76363, 94789, 65270, 81892, 22142, -46007, -38603, 18195, 48217, 7175, -118289, -224999, -205479, -169973, -215995, -182337, -20124, 61627, 22005, 23861, 34225, 13137, 31662, 19577, 10704, -31946, -28149, 8226, 53551, 16153, 39817, 107547, 85790, 62857, 51413, -27938, -13241, 43601, 50053, -23170, -53576, -32052, -41233, -14744, 12347, 33410, 43055, 58554, -19355, -45146, 9614, -15768, -14094, 6691, 79746, 67090, 38415, -8117, 24250, 60261, 27173, -36447, -75452, -87847, -128716, -84656, 12980, 58112, 69285, 109548, 88982, 65456, -7663, -57796, -83077, -47522, -14438, -29033, -8159, -1749]
14629a749Q2766K8792p0526j8091k8307q213L3138K6300m881Q854k9868q6421
14617f8206l7218j5943K7196M1251L503J703l277K4127M6361K1094K2410k7659
14605C5342m5020M7160M3726k8514m9781K8103J3188o448n6138M2431j2805k5171
14593a3927l156q378k3496J3337m7665k247R2123L5112j5710m6493p3345n457
14581i9302N5008M1450L254J8890l0626k9874R989l5546j5775Q102N2983M5904
14569B4457l350L596n7425j6140J6377o1411J2995J9276r072j7414O8838N6716
14557C7443m7169l0000Q157L9441P064O370m4110L849K2331p280l9371k1753K9628
14544c5400j4042n680L8295l2760k1208m2895m0030m855M3111R5200Q975N3206
$$ y = [-1749, 81017, 109809, 39283, 21192, -7115, -15328, 17810, 44110, 39229, 48083, 18215, -68206, -105424, -121367, -94171, -52920, -49417, -47714, -50991, -26864, 19497, 40591, 63001, 35342, -9678, 37482, 81208, 52694, 2913, 31016, 44204, 37756, -18382, 24049, 11244, -13927, -17083, -25461, -48957, -35620, -83285, -85532, 6591, 41703, 25993, -20500, -93845, -99302, -44294, -2844, 410, 19300, -11326, -41200, -31211, -66757, -82532, -74430, -21447, 24457, 21107, 24703, -32722, -48862, -32485, -93896, -80901, -61625, -70697, -88111, -19273, 37443, -9726, -39726, -31569, 7872, 14936, 21306, -22804, -18955, 3376, -3904, -43275, -65028, -35400, -49442, -55122, -16827, -49587, -70795, -113690, -153720, -158575, -115464, -20264, -11289, 41917]
14532D1917n33L8585K0752k8876k3758k0272l2197p419m9314P371j0776J8007
14520d6513l708L876n8610l5089L8552M0233O1438K2531J8533l6463m5326K9865
14508a0681r467j0680j2016p7862n4461J6466L7268N4322Q0654R3558r739o2920
14496C4442j6939j5559l0918j2892J5847J9331j8077j7621N7582K1732Q596l844
14484D1680L9234L928n7952l9470Q200J08444P990j8100o3150n7549j1784n849
14472d4378O2718N36M4707L8686o1649r0441n7521J0208L7334K8257k5123M3353
14460a3313J3804l0417O3524N4698n2022o0625m5300L1426j3414J9838L6176K6254
14448C0629k7183p9291O0195N2679l5062M128J3749M1083j5311j2613J0520M1332
$$ y = [41917, 41384, 79969, 100721, 71845, 48087, 27815, -4382, -11801, -61115, -53744, -64520, -46513, -50221, -46345, -104955, -140044, -101492, -61259, 179, 22710, 41243, 4780, -40546, -10681, -20148, -30828, -42844, -120706, -175167, -158701, -121433, -67111, 13543, 107101, 97362, 34442, 17503, 1944, -28974, -41866, -26019, -6688, -24765, -42386, 15196, 36928, 45524, 41680, 80914, 84842, 26890, -12580, -4380, 104064, 112054, 93954, 30804, -26745, -38529, -44378, 18340, 18876, 63583, 102269, 40620, -49821, -107342, -97134, -59800, -31543, -56666, -13313, 491, -29926, 33598, 88296, 36274, -24351, -69651, -38225, -51639, -31801, 4375, 30629, 3446, -75845, -15650, 37029, 1967, 6095, 19844, 60927, 45616, 33003, 43523, 84855]
14436H4855m1629o2290k8425K9355J8716K1767N1232J1627l3254o8316p8780o3885
14424a59027L667P4057J699K7891J6189L7859j1806j6900l3224L2842j0893k7341
14412f4987L337k5746P120K2765P4007M7641k6197k3359l5523j0831n811M2208
14400D624N417m90m7798k0152M7817m1290K8055K0404l2795j7984J1648n077K2129
14387b5492j6287j4794o2426K0845K1900M7811M2031n3301n3443O4774P4131l0875
14375A4874m6297N301J0285M1134J4970L1351k8230n2257o105o929J3222Q9582
14363H0901k320j44754M514M8928N7895J5083j040K0130K2110j8817k6713K4419
14351H0336j9006n1384p3855j1705K6081O9915M5971m3572m0381l3230J223m6036
$$ y = [84855, 43226, -19064, -47489, -18134, 582, 22349, 73581, 85208, 51954, -16362, -95142, -159027, -155360, -81303, -79604, -51713, -35524, 2335, -9471, -26371, -59595, -26753, -37646, -64987, -61650, -87396, -80276, -57511, 16496, 64137, 37940, 14581, -20942, -31773, -37584, 4624, 10041, 9551, -38247, -58399, -10582, -51872, -23817, -3413, -36208, -54192, -42544, -47621, -25492, -41779, -56573, -118999, -98154, -76254, -28443, 13588, -39713, -93156, -28382, 45749, 14874, -31423, -26122, -15837, 25297, 40267, 71618, 43388, -8869, -14974, -21903, -8681, 80901, 78581, -66173, -61659, -12731, 45164, 60247, 59207, 79337, 101447, 82630, 55917, 80336, 61330, 9946, -63909, -75614, -49533, 20382, 66353, 22781, -17600, -50830, -49607, -95643]
14339i5643j9145J9388L4300m187M2015L3892l988k018L0777o0006k1649m3998
14327i0262j6196O8134m061n0944M0611M920n6501K6840K8867l8541j4862J1779
14315i0216k0377K1547N9628L6409n4711p3195l5065J01938R6974M231o6324p2249
14303i1410K0213M9552J4500p429P663M2370L1764J4448K6126k1496m1056j00359
14291e5114n7215L4657P8757j0773M835K0777L5460j0689J315q2752m667K2715
14279b2694J1320j994p1835j5591O5154R9728J3296m27p0482l1221Q149M2257
14267B5660j0250m2573n5876N541O3001O648J429L9550m308m07m2062o000n4986
14254g4633o1801l0398L6009k453L293M6143m7535m209O690L0443M6153l111M6536
$$ y = [-95643, -114788, -95400, -61100, -65287, -23272, 10620, 6632, 4614, 35391, -24615, -46264, -90262, -106458, -38324, -42385, -93329, -52718, -47798, -104299, -77459, -48592, -87133, -101995, -90216, -110593, -89046, -29418, 6991, -47720, -120915, -155980, -54042, 42932, 47163, -19161, -91410, -71197, -21645, -7145, -14574, -6911, 35459, 67223, 81671, 107797, 86301, 45245, -55114, -112329, -77672, 1085, -9688, -4853, 15924, 51384, 40695, 42010, -40742, -45409, -22694, -11374, -13368, -85203, -100794, -35640, 64088, 77384, 76957, 6475, -24746, -16597, 25660, 15410, -27163, -83039, -77498, -14497, -7849, -6420, 33130, 28822, 28415, -13647, -19647, -74633, -136434, -166832, -130823, -133276, -129983, -83840, -131375, -135584, -128894, -98451, -52298, -55409, -8873]
14241h873J6425m3349K5914J7432r036l813k1233j14297q2637q859Q8825M0842
14229a02659K2211K4483l1279L5432j1757J8835J0118M7852N449Q177K0396n6238
14217h980j0068J3171k02M4575m5870K0516M201M116l1652k1870J4422o5720j9082
14204a02443L1205J6998L2977L6329k5362R199p045m1242n514k7772J2945K8549
14192d1176k5868K3052J04186K1422r947j7904K1562K0314n5812j13537M5469
14181b8239j6735N3543j4888o3522J2941j847r513j9548K4657J7272O0672M7927
14169F2720k513J4195o3700l049j3879J9124q095J5168k3182n0658J5771R3395
14157E5297Q5394l9898k5747m7334j0694k5787p0339J7328L0668N2536p3435j10998
$$ y = [-8873, 7552, -35797, -9883, 7549, -1487, -5300, -26533, -140830, -223467, -232326, -143501, -102659, -80448, -55965, -87244, -51812, -63569, -44734, -34616, 13236, 18685, 26862, 47258, -8980, -19048, -5877, -6079, 38496, -7374, 13142, 17343, 21459, -10193, -32063, -17641, -83361, -102443, -71238, -54240, -21263, 15066, -10296, -1097, -8142, -49384, -54898, -82670, -69725, -41176, -67044, -43992, 60194, 81616, 71669, 53765, 75327, 95641, 39829, -73708, -28239, -44974, 8569, -6319, -69841, -56900, -58747, -68260, -87808, -63151, -45879, 14793, 62720, 60207, 74402, 10702, 7653, -6226, 12898, 4803, 19971, -3211, -53869, -38098, 55297, 140691, 100793, 75046, 27712, 17018, -8769, -79108, -61780, -31112, 21424, -52011, -163009]
14145a63009k6059M9581O3068K5566j4468M516N1602k8022o5207j1924P9119M6061
14133A0824k6755Q7845k1696n3341n7428L8306P7432j1838N8452L6796o9987p3974
14121e364P458q026M030j7130r321l3790m9019M433Q2100K7623l6459L8499N1145
14108E6179P7577K5569j17943j30253L8635M3603m9417K152M0648N1040N7194
14097I4984J6817k2257r5956n4184Q3404N2055M6388j5950o0132r2463l2092j7363
14085i6749J4449L6907o465P9700J4329k3110j8484p0108l3668P9004j8800O029
14073c6966R401N7896L7265k6413p4588l6210M8019K1974n7143k4656N1058P2013
14061D1650M0876l6722j9496J0513j1030n7229l8624p9272j1940Q588j1219M4196
$$ y = [-163009, -189068, -139487, -76419, -50853, -65321, -60805, -9203, -37225, -102432, -114356, -35237, 10824, -15931, 71914, 50218, -3123, -60551, -22245, 55187, 43349, 101801, 138597, 68610, -5364, 2094, -5932, -1902, -19032, -28353, -62143, -111162, -106729, -24629, 2994, -33465, 5034, 56179, 133756, 159325, 41382, -88871, -50236, -6633, -56050, -53898, -13250, 37790, 94984, 111801, 89544, -6412, -60596, 22808, 74863, 121251, 105301, 45169, -47294, -79386, -96749, -82300, -45393, -51858, 27842, 42171, 19061, 577, -69531, -103199, -24195, -42995, -36966, -27565, 30331, 67596, 41183, -33405, -69615, -21596, 378, -56765, -81421, -30363, 41650, 82526, 45804, 26308, 36821, 25791, -31438, -70062, -149334, -161274, -152686, -163905, -119709]
14049a19709N6964N66l4893O8583M8477k8530j1704j6560j4911Q370L2371P7676
14037F6700O1213J3793o2418r8843j7199P5845L0501k8147l8383J0040j7187L582
14025e03J0824o1840K3138N2883K6391j4211p5727o876J328L1496L5242K6952
14013D9097l5535j4961p1247K8602M3324j8471K9323J8614J0178n6959l5653K2016
14001c1672p413K5895K8347o335l0588Q848K1183K5455m987r034p5015L5015r266
13988b9567l0838M1352K5708r842l22j9740l7822p2930K7931M5284P1491P7617
13976H8322N628o5812r1038n8157K0806N279K3092L410K6788K5296K0080K2682
13964B6376p119l0956n718Q0520m8816m3815m2966k0543O5709m450l8687N3426
$$ y = [-119709, -62745, -62179, -97072, -28489, 19988, -8542, -20246, -36806, -51717, -43347, -10976, 66700, 127913, 141706, 79288, -19555, -36754, 39091, 69592, 41445, 3062, 13102, -4085, -503, 10321, -51519, -28381, 24502, 50893, 36682, -39045, -45921, -44593, -13097, 22145, 49097, 13562, -1399, -72646, -44044, -720, -19191, 10132, 28746, 38924, -18035, -53688, -31672, -39085, -13190, 15157, 8822, -21766, -12918, 8265, 33720, 28733, 19699, -55316, -20301, -29567, -60405, -19053, 6655, -3187, -3509, -23249, -61071, -134001, -106070, -60786, 10705, 88322, 93950, 28138, -62900, -121057, -100251, -94972, -71880, -68470, -41682, -16386, 3694, 26376, 19257, -11699, -17417, 63103, 14287, -29528, -72494, -93037, -27328, -31778, -70465, -17039]
13952a7039K667L3957K0615K2928l3516K4843q086n1617q2885L2085N5869L737
13940C558N286N7520k2153P469Q037j3417o9465n2867Q37R2462Q7164O205n5117
13927E5519m6928k5910J4364k1727L3446J4651j0428j2333k5042l2906j0568L1108
13915c6754J7920j3010l1246K3368Q569l9223L2825M9819N3114M0180L7447l9821
13903A03188k8341O5214l0582K0100n4472l0050N0113M2978J4322L811j8097L4271
13891A72455K735r9081m4986m3119l4740j0289J3965P1195N1663m280k2492j1716
13879D1310O927p7408L440j8378n3852M6729m774l1587j0517k9728J23344J02008
13867I7514P778m9400o1095M7079N7593l2740n0184O3452P676k0463J2259L0482
$$ y = [-17039, -14372, 19585, 40200, 63128, 29612, 54455, 46369, -5248, -88133, -56048, -179, 3558, 8844, 66364, 44211, 51680, 59717, 46300, -23165, -76032, -75195, 17267, 104431, 110636, 55519, 8591, -17319, -2955, -24682, 8764, 23415, 12987, 654, -24388, -57294, -67862, -36754, -18834, -31844, -63090, -39722, -31153, -70376, -37551, 12268, 65382, 105562, 143009, 103188, 74847, 140061, 109479, 129579, 75107, 45057, 95170, 138148, 152470, 156281, 138184, 172455, 175190, 76109, 31123, -11996, -46736, -57025, -43060, 28135, 79798, 75518, 53026, 41310, 48237, -29171, -25731, -44109, -97961, -51232, -56006, -87593, -98110, -127838, -4494, 97514, 105292, 55892, -5203, 41876, 99469, 66729, 16545, 79997, 87673, 67210, 79469, 109951]
13855A09951k3704p878O4145K6592N7827l3526j20162J469q9382l6228k0279K6878
13843d4297J8196L6197j5878L2291J2413K3847k1779k1764l9974l7252m186j8408
13831h0594M67J1741K4037M9878J4231L667k5755k0911j1097J5310j7726m115
13819d0867j4522n7627J8176l8200o439N663L4618N9135k3598J9873K1961j1613
13807c3440j6570J8118k9756o5852j1760M5917P293l1223j0270M1261O2527J3071
13795a0684j2108J1844L9164J1399k1k9567m4017J6806O0588M6376l4566l7667
13783A7547J03228L6913r7816o2086k3189l8874K7185N7188l9966K8329M2526
13772E0985l6054l2375n9472N2649O7795M6320j6759K0884o892J280M2853n549
$$ y = [109951, 86247, 78369, 142514, 169106, 226933, 193407, 73245, 74714, -14668, -50896, -71175, -44297, -26101, 10096, -5782, 26509, 38922, 62769, 40990, 19226, -20748, -58000, -62186, -80594, -80127, -68386, -44349, 5529, 19760, 23427, -2328, -23239, -34336, -19026, -36752, -40867, -55389, -113016, -94840, -133040, -139479, -133816, -99198, -40063, -63661, -43788, -21827, -33440, -50010, -31892, -61648, -127500, -139260, -93343, -86050, -117273, -127543, -86282, -23755, -10684, -22792, -10948, 28216, 39615, 39594, 10027, -33990, -17184, 43404, 89780, 55214, 17547, 120775, 157688, 59872, -2214, -25403, -64277, -37092, 20096, -19870, 8459, 50985, 14931, -17444, -76916, -24267, 43528, 89848, 73089, 93973, 87081, 88361, 131214, 125665]
13760A25665j02509j8338o976l6501O115L1854j5336j5525K4427r777M0051L3777
13748E6927k4449m6429n1199k2153M1058k154K3665O4233K1904l3481j04004l6644
13736a12726M1985P0876j6300M9009K0463r32l2026L3105k1582p9323k616O5881
13724A5814j0647q5088l7784J6671m1099L4567M0431J8572j6721L0430N599L6593
13712G338M1942J3367l3919r794q6720n680N6121j4715L7846J30468L0740L5071
13700B02065j3642l1031j6895n7935K0081p178p890Q5206L7292L2739M3246N5577
13688C41635M6481J2901P6105J21669Q7202J14362J74212J54625J63716J72792
13678A465700N1807o8535q5969j12784j01225j58300j49533j47185r7129j27595
$$ y = [125665, 23156, 4818, -2158, -38659, -32544, -690, -16026, -31551, -7124, -16901, 23150, 56927, 32478, -13951, -65150, -87303, -46245, -48399, -24734, 39499, 61403, 27922, -76082, -112726, -70741, 135, -16165, 32844, 53307, 52375, 20349, 53454, 31872, -47451, -50067, 15814, 5167, -79921, -117705, -101034, -142133, -107566, -67135, -48563, -65284, -34854, -29255, 7338, 49280, 62647, 28728, 18934, -67786, -73466, -17345, -32060, 5786, 136254, 166994, 202065, 188423, 157392, 140497, 82562, 102643, 95465, 87575, 172781, 210073, 242812, 286058, 341635, 388116, 401017, 477122, 598791, 685993, 800355, 974567, 1129192, 1292908, 1465700, 1517507, 1448972, 1363003, 1250219, 1148994, 990694, 841161, 693976, 596847, 469252]
13668D69252j30326m9989l2115J9776Q734m7713o0333j1238j9527o6237K0949
13657A01233l3103m4098L8769l2220m0319R487K2285j5456k3547n8826J8818P5574
13645A8597Q9120K4598j6602q776q72L0783j8093K7861l8686j05989k2529K8130
13633G542o080k1073L9541P0588K4870j3264k2681l6680n7196r413k8645p1766
13621a24257M186J08200Q2674k9770j7319J0676L7684j500j973P5595j6656j12582
13609A4958m7487L7935k4051l0824L8618M3082j3726R632K1713r1553n3624O9280
13597b6047k0423K3614N7636O1755M5260J3265R143o967M59k1997Q401l7819j5821
13584I0459J5075J3556K2183J8691o885J6315L0342o1423n3057N6579l730j5245
$$ y = [469252, 338926, 288937, 256822, 276598, 285332, 237619, 177286, 166048, 146521, 80284, 101233, 68130, 24032, 62801, 30581, -9738, -251, 22034, 6578, -16969, -75795, -56977, 18597, 107717, 132315, 115713, 106937, 106065, 136848, 118755, 146616, 107930, 1941, -20588, 7542, 1462, -19611, 19930, 90518, 115388, 102124, 79443, 42763, -14433, -23846, -52491, -124257, -120071, -11871, 70803, 41033, 23714, 34390, 72074, 70574, 68601, 144196, 127540, 14958, -32529, 5406, -18645, -49469, -10851, 32231, 18505, 28137, 49850, -41703, -95327, -26047, -46470, -22856, 34780, 96535, 141795, 155060, 164203, 157236, 157695, 135698, 144099, 106280, 90459, 105534, 119090, 141273, 159964, 153079, 169394, 199736, 138313, 85256, 141835, 138105, 122860]
13572A22860M3622M6949Q730M92j793j01922n5672p3076K0450Q3312L3045n9485
13560F7512J8457k3239q48K2162k3093j7180Q9902J9637J7049q827n4437L2631
13548A39726L2012J0366K2305J2011M1853L9462m3426O573J2349k3314n2217J2472
13536B10172k3804k668K7649l2249j2192r115n6268p0546M7527M3727L1062p2151
13524H1144J0620N6554l8477n8017o2774Q850Q4994K182j9823m9498j5888K8064
13512B7931N2182L5377K3945p8929K5894n771J7634n6481l2109R035K3775J2602
13500E5085r472J7502n5407l7437q3467j7261N6853O9525Q5859l1532j0030m522
13488C5696m1588O919l8218L334m2636n2374K3714O5493M5602k5997M102N1112
$$ y = [122860, 166482, 213431, 222161, 222653, 220860, 118938, 63266, -9810, 10640, 93952, 126997, 67512, 85969, 62730, 61882, 84044, 60951, 43771, 133673, 153310, 170359, 161532, 107095, 139726, 171738, 182104, 204409, 216420, 258273, 297735, 254309, 260882, 273231, 249917, 197700, 210172, 186368, 183700, 211349, 179100, 166908, 157793, 101525, 30979, 78506, 122233, 153295, 81144, 91764, 148318, 109841, 51824, -10950, -2100, 82894, 85076, 65253, 15755, -133, 27931, 80113, 115490, 139435, 60506, 86400, 80629, 98263, 41782, 9673, 18708, 42483, 55085, 45613, 63115, 7708, -29729, -113196, -130457, -73604, -4079, 81780, 50248, 40218, 35696, -5892, 1027, -37191, -33857, -76493, -128867, -105153, -39660, 5942, -20055, -15953, 35159]
13476C5159l2897l984n1970K9379p893L5488K7090p322j9997j9936J7027k0291
13464b0147J4821M394K6777l3652l7332N292K2128P417K6733k8740m1860K8447
13452b5722P0095J36371Q608n0958m1720n7667m0961l2814j8043P1235Q9028K1770
13440A29222k8553L5550K2141p6024j07588J4234M0910k7583L1698M5154j374
13429G7787k2908o957M2280N2273k7498k632q036q4684q4139l109K6075J3779
13417b7769L0324M8581J4323J0200K5178J5753K2218N3555M8338J3336J6778K3192
13405B94007M896J79p6792j4573j9075l5267J084J4085q079j0507m7249m1788
13393F0921k280o084l7253k6337J8184N5618N5571o0422n2689k756L907O5753
$$ y = [35159, 2262, -1722, -53692, -24313, -32206, 3282, 30372, 23050, 3053, -16883, 144, -20147, -5326, -932, 25845, -7807, -45139, -39847, -17719, -10302, 16431, -12309, -54169, -25722, 44373, 180744, 189352, 138394, 96674, 39007, -1954, -34768, -52811, 18424, 107452, 129222, 100669, 136219, 158360, 82336, -25252, -11018, 29892, 2309, 34007, 79161, 77787, 54879, 47922, 90202, 142475, 114977, 112345, 104309, 19625, -64514, -67623, -41548, -27769, 2555, 51136, 65459, 75659, 100837, 116590, 138808, 192363, 240701, 254037, 270815, 294007, 298903, 299082, 222290, 207717, 188642, 153375, 154459, 168544, 160465, 149958, 102709, 60921, 58641, 52557, 15304, -11033, 7151, 62769, 118340, 57918, 5229, 2473, 6380, 72133]
13381G2133k2176n670K0408n1289o5289J3279J6659j6448L3569l7368k5379M1395
13369b6176l2229l6660M1568J7640J673J3807o430P174L364n0066K3305R2361
13357D9331j1358l7651L2843P5407l0118k4587K1238j9100N0859j1323j07677
13346a2136l4367P0549J0633M0857m6316q2025J6986P9582Q609l0472j4959M0401
13334D7342J2536J5490o4513o0689K731L2416r18O569K0360j987M4220L0362j8232
13321F5687n7796j18388j4107N8242N8038K1993l1678M5216O1227N1112J7993
13310A57539J3456q0195j19684j4143N0116n7096p0176K2039N8963J7569M8025
13299B6413K2394L4364m3308j30750k7852K8456N2441M9331l2831Q5540N3025
$$ y = [72133, 49957, 44287, 64695, 13406, -51883, -38604, -21945, -38393, -4824, -42192, -67571, -26176, -58405, -95065, -53497, -35857, -34184, -20377, -26807, -19633, -16269, -66335, -43030, 49331, 37973, 322, 33165, 108572, 78454, 53867, 75105, 56005, 106864, 95541, -12136, -46503, 24046, 34679, 75536, 29220, -52805, -35819, 43763, 52372, 21900, 6941, 47342, 59878, 75368, 10855, -49834, -47103, -14687, -15605, -9036, 11324, 9337, 53557, 83919, 65687, 7891, -110497, -124604, -66362, -8324, 13669, -18009, 27207, 88434, 139546, 157539, 170995, 90800, -28884, -43027, 7089, -50007, -120183, -98144, -39181, -21612, 26413, 48807, 83171, 39863, -90887, -118739, -90283, -37842, 11489, -21342, 64198, 117223]
13288A17223m6965l2642K636n1569M1283J51132P615k2464m3954l4455O554k7953
13276F6441j05599k9582K0897K3762M3824J3361L8556m7517m1368Q6835P4094
13265A43704l0879o2498r9313k6242K4622j2914J5457j3526r851L3144J8075K8339
13253H118j5024m5559m283k436N7741L3874J1059n3991R632J7206m1826J6222
13241i267o30L5622L6536P2845J0844o2253l5995p553m0919k1138M901L5077K8102
13228D6172M6684J2514q7788k0049L6798O852o241R775Q0177j0366n8633J434
13216E7329N4401m4319j05279m5344M0689J0937P561L7765m0780k7748J8498N1165
13204A4875k9682p847K6280O6640N3499L5064k9796j6685m4234o1275j0046L1255
$$ y = [117223, 70258, 37616, 40252, -11317, 29966, 181098, 188713, 166249, 122295, 87840, 94394, 66441, -39158, -68740, -47843, -24081, 19743, 33104, 71660, 24143, -17225, 69610, 143704, 112825, 50327, -48986, -75228, -50606, -63520, -48063, -61589, -71440, -38296, -20221, 8118, -6906, -52465, -56748, -59184, -1443, 32431, 43490, -10501, -869, 16337, -25489, -9267, -9897, 25725, 62261, 135106, 145950, 83697, 47702, 40149, -770, -21908, -17007, 18070, 46172, 92856, 105370, 17582, -2467, 34331, 41183, 34942, 44717, 124894, 114528, 55895, 57329, 111730, 67411, -37868, -83212, -42523, -31586, -24025, 13740, -27040, -54788, -36290, 14875, -14807, -22654, 3626, 70266, 123765, 158829, 129033, 112348, 68114, 6839, -3207, 28048]
13192B8048K0370R873J2047j5867l6873m9351M3376k1934R392M7722k9968l1297
13180a4462J03761L8997m8166o5406j4395K2292j7546j1479R665L5505L6006k0059
13168E4713n4613M1302J21510J0099n4908o3214j01003n4012J09587J8136j7090
13157A0507K6340L1335j6277m3234k7075O5356J7205N586l0608P7456k4941r1234
13145D16L496k7397J5999m9327l8604K6667J9589K0819J8807Q4798P0970m7565
13133I8668j2000k7393p7262l6488n1390n6776R8575J5847N4538j2L251Q28J7027
13120B7413P8432L179l6189l3630J3812K1650J6689M4435o0053r8485l5447k5109
13108h3303L9371J24716L3353m8001l530K3589k0606m1069o3389K958L9082N9657
$$ y = [28048, 48418, 58291, 70338, 54471, 17598, -31753, 11623, -10311, -919, 46803, 16835, -14462, 89299, 128296, 80130, 14724, 329, 22621, 5075, -6404, 3261, 38766, 74772, 54713, 100, 41402, 162912, 173011, 118103, 54889, -46114, -100126, 9461, 27597, 10507, 36847, 68182, 51905, 8671, -18404, 46952, 64157, 69743, 39135, 116591, 91650, 416, 3912, -23485, -7486, -56813, -95417, -68750, -49161, -28342, -9535, 75263, 146233, 98668, 86668, 59275, -17987, -54475, -105865, -162641, -64066, -48219, 6319, 6307, 9558, 10386, 27413, 105845, 109024, 72835, 39205, 53017, 74667, 91356, 135791, 75738, -22747, -58194, -83303, -43932, 80784, 114137, 66136, 62606, 86195, 65589, 24520, -38869, -35911, 3171, 62828]
13096F2828n8754M724K7713n4735J7443n605J4694N9452M5868K4079j7613k4194
13084I5900j3626l9089j0334J6936K376L0486k4628k8188j4438M5173p3758k3728
13072c6918M0411M6120J4570R902r362j6859p381m2545K3011P4486Q3667K4434
13060B03536l6834m9034r627q257K0507o5402r0329M2482O8718m3286K016J9585
13048E4075o441k0577j8429M4525L7893K9795l3622q27K9732j9265N217N5550
13036A57626j131l3024m53J0016J3421l1851p101o3523k1476K7334l1192J1182
13024B9828J1490k0939q5514k5017N2037l2043J6320M3248Q554J6426j1303P7821
13012H0908o199k5621q6623j6597p2284k0053J55338N1730m5198n1941Q586J04354
$$ y = [62828, 4074, 8798, 36511, -18224, -781, -6386, 8308, 67760, 113628, 137707, 120094, 95900, 82274, 43185, 32851, 49787, 52163, 82649, 58021, 29833, 15395, 60568, -13190, -36918, 3493, 49613, 64183, 74085, 64723, 47864, 40483, -2062, 20949, 95435, 179102, 203536, 166702, 117668, 108041, 99784, 120291, 54889, -35440, 7042, 75760, 32474, 34490, 54075, 47634, 27057, 8628, 53153, 91046, 120841, 87219, 86392, 116124, 96859, 102076, 157626, 156495, 123471, 123018, 133034, 146455, 114604, 107503, 43980, 22504, 49838, 18646, 29828, 41318, 20379, -65135, -90152, -38115, -70158, -53838, -10590, -2036, 14390, 3087, 80908, 74709, 49088, -37535, -54132, -126416, -146469, 8869, 60599, 15401, -36540, -27954, 76400]
13000G6400N9062O310K782j5417N2416n2516k7376r7605J3612J871L8716L2584
12988I0839n0547M0519l6962O518n6541o5373P2690k0344L5160L0436K902M4046
12976I3343J4633l1707l8619N015M8909L1667k244k2209R293k9850J871m68m6389
12963C3245N2448J1424L0311O952j7036r9812M3062K5473J0712M4208K0362m2749
12951A18600p887j1703n1825N8692j6075p8785k5973L6151J157r192K9055L9628
12939H1843M1799k2389o231L6245L9151L4069k5761m4170k2995J9103M699m9563
12927H5800j4362k7827P124N7205R982n2114J0531M265j666k044L3598n205j5758
12914H9529n9847M5417O6581J983P481p2489J0419k7172m2660K871R9369L3899
$$ y = [76400, 135462, 141772, 144554, 129137, 181553, 129037, 101661, 4056, 17668, 19539, 58255, 90839, 40292, 80811, 43849, 50367, -6174, -71547, 1143, -19201, 15959, 46395, 49297, 93343, 107976, 76269, 37650, 42665, 91574, 123241, 120997, 98788, 108081, 78231, 80102, 79634, 33245, 85693, 97117, 127428, 134380, 117344, 17532, 60594, 86067, 96779, 140987, 161349, 118600, 110713, 99010, 47185, 105877, 89802, 11017, -14956, 21195, 22352, 13160, 42215, 81843, 123642, 101253, 95022, 131267, 170418, 204487, 178726, 134556, 111561, 130664, 135363, 85800, 71438, 43611, 50735, 107940, 117922, 65808, 76339, 80604, 78938, 76894, 110492, 105287, 89529, 29682, 75099, 141680, 143663, 151144, 78655, 89074, 61902, 19242, 22113, 121482, 155381]
12902A55381o9483j9519K5715L5701M6793J5653j6007l7914j5692j8740l9464
12891F2424l1381l4221N7326L3285K4037o6615l5586K7929l5219K1638L9270k5004
12879C7883O8117M9384k6077l3884R386L6758J921j7735L8198l5243l8686q7478
12867B544J8805R4734n5020j1754o074L490j0019P4393R2690q1907j1376J2493
12855A22999o231k8221M9625J3225n7029l8959O326K381M148O8199j2038p4280
12843E0145l7477p4743O069R5852K9646K5870l1513O6376O7100k0025k0456J2416
12831A69260j238l8114J84k0495j0008p4209O9149P2051n4731K2549J623j5205
12819A20816J941o3315l4793J10234M7762k5387j5098k1331M1288j1858O789K8908
$$ y = [155381, 85898, 66379, 92094, 127795, 174588, 190241, 174234, 136320, 120628, 101888, 62424, 31043, -3178, 54148, 87433, 111470, 44855, 9269, 37198, 1979, 23617, 62887, 37883, 106000, 155384, 129307, 95423, 104809, 141567, 143488, 125753, 163951, 128708, 90022, 2544, 21349, 116083, 61063, 49309, 43235, 46725, 36706, 111099, 203789, 121882, 110506, 122999, 116768, 88547, 138172, 151397, 94368, 55409, 61735, 64116, 68264, 136463, 124425, 50145, 12668, -62075, -56006, 39846, 69492, 95362, 63849, 130225, 197325, 177300, 156844, 169260, 168022, 129908, 130092, 109597, 99589, 25380, 94529, 166580, 111849, 134398, 136021, 120816, 122757, 59442, 24649, 134883, 182645, 157258, 142160, 120829, 162117, 150259, 157048, 185956]
12807A85956l8644J0126l679p2378m4855o0099N329k2785r923J4689J9867R7951
12795H1555m942O6718J0283p5193N139n1618J8197P1015l8419N392Q6542k0463
12783A54206L0976P810l8664K046k9046j7884l2290j8432M3239O6564o2742m8159
12771E7624j5614l9747K1005M6642Q3179N3645j2762q8952k0655L6806K2773K8125
12759A72069L2182p7797q5563M4474J29720K4569o6318m0061m766k0123m3653
12748F4733j0443J9473j9497k3697k2592j0750j687M1374K5038L6690M4522k2049
12736A21115k5450L3773M3717L5253j4408k8598J8374l0588n5495o8364M6929
12725G6258P8742L4061j6091J743k107k6222o676l7428k3905O1570k2089k662
$$ y = [185956, 147312, 157438, 153759, 81381, 36526, -23573, -18244, -41029, -50952, -36263, -16396, 81555, 76613, 143331, 153614, 78421, 83560, 31942, 50139, 121154, 82735, 88127, 174669, 154206, 185182, 192992, 154328, 156374, 127328, 109444, 77154, 58722, 101961, 168525, 105783, 57624, 42010, 2263, 23268, 69910, 153089, 206734, 193972, 105020, 84365, 121171, 143944, 172069, 204251, 126454, 40891, 85365, 215085, 239654, 173336, 133275, 128509, 108386, 64733, 54290, 73763, 54266, 30569, 7977, -2773, -4460, 36914, 61952, 98642, 143164, 121115, 95665, 129438, 173155, 208408, 194000, 165402, 183776, 153188, 97693, 29329, 76258, 155000, 189061, 172970, 174713, 172606, 146384, 139708, 102280, 78375, 139945, 117856, 115194]
12713A15194l0578j8279Q3148J2995M0489j7363M1776J895j8229m7993j6329r24
12701A45802K2109m6990l4361k847N1286K7726j2197o9428O319N5859L1472n0841
12689A23909J0858J0193K6542N0764o9789p6854M6711j7798O6182R8658N803k4025
12677B51154j11595j0661N623o9788M9828q395k5320J4014O7965N3389M662O666
12665B27542l7022K3068J1065m1941j1740L6632l1026L0868j9334o3804j7804
12654A06504P870J5702N5921L0899K3315j9414k0057k6244l5518J0261j0784k0066
12642A18389M5812K9043j0583L5608j4556K6444K3998J3174j6272p3598l6371
12631A41088K413J9976M2498J5885K7342j1398R924l6276j8360o0139o6410j8019
$$ y = [115194, 84616, 66337, 149485, 162480, 202969, 185606, 227382, 229277, 211048, 163055, 146726, 145802, 167911, 120921, 86560, 83713, 134999, 162725, 150528, 81100, 87419, 143278, 174750, 123909, 134767, 144960, 171502, 222266, 152477, 75623, 122334, 104536, 170718, 269376, 275179, 251154, 139559, 128898, 134521, 64733, 114561, 106166, 80846, 94860, 162825, 216214, 220876, 227542, 190520, 213588, 224653, 182712, 170972, 207604, 176578, 207446, 188112, 124308, 106504, 114374, 130076, 185997, 216896, 240211, 220797, 200740, 174496, 138978, 149239, 138455, 118389, 164201, 193244, 182661, 218269, 203713, 230157, 254155, 267329, 251057, 177459, 141088, 143501, 163477, 205975, 221860, 249202, 237804, 247728, 211452, 193092, 132953, 66543, 48524]
12619D8524J69205O6816l1702j4223j7547o6981n3056J8999j5675L6118J7488
12608A57966O7607l7094l658N8537P2258O169m0272l7445N369N0633k9269J465
12596B72266o18n913m7976m4895K5574O2768N186l0413j030l8448m9084r807j7458
12583A20152L1557l3760K1451J2526M9290K1399k7714M239o5895J9293Q313m5068
12571A15783p844J3568P7494k192k0079n231Q566j9262m5056L5199j0202j5106
12559A25638L590M4971M0502k0809L7120L4496m7218n3564J0544J7714J1040N781
12547B09805L3271j4929j6382m6627l8036K7372K5647J9027L6427N3931N212k4299
12535B70419k2060k236j1596q3622N0497O8624k9257l7591Q5716l76j6301k8689
$$ y = [48524, 217729, 284545, 252843, 238620, 221073, 154092, 101036, 120035, 104360, 140478, 157966, 225573, 188479, 184821, 243358, 315616, 321785, 281513, 244068, 249437, 300070, 270801, 272266, 271648, 265735, 217759, 172864, 198438, 261206, 266392, 235979, 234949, 196501, 147417, 137610, 120152, 151709, 117949, 139400, 151926, 201216, 222615, 194901, 199140, 133245, 152538, 160851, 115783, 107939, 121507, 199001, 196809, 176730, 171499, 180065, 160803, 115747, 150946, 140744, 125638, 129228, 174199, 214701, 193892, 231012, 265508, 218290, 164726, 175270, 192984, 204024, 209805, 243076, 228147, 211765, 165138, 127102, 154474, 180121, 199148, 235575, 289506, 294718, 270419, 248359, 246123, 234527, 150905, 201402, 270026, 240769, 203178, 288894, 288518, 272217, 243528]
12523B43528k4438n559m3825M6992N9021k4432j04463m3765K3398K5962M0483
12512A92902P7925m540J2685l220m9398K5800P4177o1922o3480o088K6849Q2343
12500C04033m9705j6255K2209j5042P7774n2512o0532l4929O404J16010j057k6652
12488B69746j0499n5189K6726J09234K9406p1529M3699l1934M831j6577L0799
12477C28713Q408p897j9878K841M9177j363p594K9013L2482k2831m1526l7048
12465C12497L2649k3199k4986p2205R903O1320L3056k7041j0471Q0014M8279j7142
12453D02674j2642M3494J6686O737k6237m2988p6376J0598n3868L7820J4302n3908
12441B66292m3361L8844R1960M5500k4198q917j2175J8159o632n8655j9258N5032
$$ y = [243528, 219090, 213531, 169706, 216698, 275719, 251287, 146824, 103059, 126457, 152419, 192902, 270827, 266287, 278972, 275752, 226354, 252154, 326331, 264409, 200929, 194841, 221690, 304033, 254328, 238073, 260282, 245240, 323014, 270502, 209970, 175041, 181445, 297455, 296398, 269746, 259247, 204058, 230784, 340018, 369424, 297895, 341594, 309660, 314491, 297914, 328713, 337121, 329224, 309346, 312187, 361364, 360001, 352407, 381420, 413902, 391071, 349545, 312497, 345146, 321947, 296961, 224756, 234659, 295979, 329035, 301994, 291523, 371537, 419816, 402674, 390032, 433526, 450212, 456949, 430712, 387724, 311348, 321946, 268078, 305898, 320200, 266292, 222931, 261775, 353735, 399235, 375037, 366120, 353945, 372104, 365472, 306817, 287559, 342591]
12429C42591J1821L6662P3306m073l2377l0926J6171M4329k290p1414q4614k720
12417B96466P1622M6971l0406J2669J0326O1838j8550m9245M4338K6660q0346
12406C92343k4230M1335p4618j6872l1705M3593N2155M6810K4034q0324n6412
12395C16109L05k0591r744L8814J9945P0042L9143K4114k0722N7931Q185n0004
12383D73527O989j0615q6024K0378N5822K5106k7662n4710J1380N9332l9423o478
12371D27622P3729l0925j4871j5957j4494L087L4073J7129J1917N0128p726m0804
12359D92908L0199L2188L5024K1077K452p6914l8614m2190j6020L9060J2889K770
12347D94829O5993r835n4519j4741K4462L9628m2244p2038j8042L9965J34418
$$ y = [342591, 354412, 391074, 464380, 460307, 427930, 397004, 413175, 457504, 455214, 383800, 299186, 296466, 368088, 415059, 384653, 397322, 407648, 469486, 450936, 401691, 446029, 472689, 392343, 368113, 409448, 334830, 317958, 286253, 329846, 382001, 428811, 452845, 372521, 316109, 316414, 295823, 286079, 324893, 344838, 414880, 454023, 478137, 457415, 515346, 523531, 473527, 480516, 469901, 383877, 404255, 460077, 485183, 457521, 402811, 414191, 473523, 434100, 427622, 501351, 470426, 455555, 439598, 425104, 428191, 462264, 479393, 491310, 541438, 533712, 492908, 523107, 555295, 590319, 611396, 613848, 536934, 498320, 456130, 440110, 479170, 492059, 494829, 560822, 550987, 496468, 481727, 506189, 545817, 503573, 431535, 413493, 453458, 587876]
12336E87876M9226J6409l0911p6516k6901L0454N251K8531q092j5088j7917n3627
12324D88695k5833O6893M7131L8751o3894J9496R166l2964Q9770M0433k8513n5877
12312E93254j3365n817N7911J4311q6140R593K4054K605L0392L0595J7553l3431
12300F41515p0551l430N9497O0935N9068K3425k4209n8484O6803O313k4096q7762
12288F49024p5271J3340m3781J0313R2172N1608P283K3674j8386K3852M4007L7244
12276H15079K38k0344R33L1775K3585R354K44r4750N876O1364k4484j0944J5616
12263H13542K1038j5425l093M1000L223o355K5523L9807J6031K5769R3506k1406
12251A033160n2039n252N5425p838o0247n6830j416r359L1864M5807k2714n0791
$$ y = [587876, 637102, 653511, 622600, 546084, 519183, 549637, 554888, 583419, 575327, 560239, 542322, 488695, 462862, 529755, 576886, 615637, 551743, 571239, 580405, 547441, 637211, 677644, 649131, 593254, 579889, 574072, 631983, 646294, 560154, 569747, 593801, 596406, 626798, 657393, 674946, 641515, 570964, 567534, 627031, 687966, 747034, 770459, 746250, 687766, 754569, 760882, 736786, 649024, 573753, 587093, 543312, 553625, 645797, 697405, 704688, 728362, 709976, 733828, 777835, 815079, 815317, 794973, 795906, 827681, 851266, 860620, 860864, 766114, 771990, 833354, 808870, 797926, 813542, 834580, 819155, 816062, 857062, 860285, 853930, 879453, 919260, 935291, 961060, 1054566, 1033160, 981121, 975869, 1031294, 1023456, 963209, 906379, 904963, 895604, 927468, 973275, 950561, 899770]
12239H99770l5864N1981K2326J5623m0734J3522N4418J03818K6390L3185j2570
12228A131865j3679k7102n5227Q7270N503p4716j14067J9503J9904J9710J5040
12217A014004O6781K540m530M565P3968L9885q436j8224J2322J621J9263K0861
12205A224620N5721K4198J7508k1430m5175N991O9381o5146l3976n1050J6671
12194A197313O1319l1451m0084M2063J17187O8493K2937l1832k1436K2754O556
12183A413819m9591O5595J43791M8239p5784K2035O2860l0871r3570L4280J1463
12172A552266n4655l2533M9307K4295j0162n0789J0837j5164K926k7643P3946
12161A522631M0791l51K0150O0562K1516m5242l3312M2663O1366J7815m1070l3141
$$ y = [899770, 863906, 915887, 938213, 953836, 913102, 926624, 981042, 1084860, 1111250, 1144435, 1131865, 1118186, 1091084, 1035857, 1123127, 1128630, 1053914, 939847, 959350, 979254, 998964, 1014004, 1080785, 1083325, 1078795, 1083360, 1157328, 1197213, 1188777, 1170553, 1182875, 1184496, 1203759, 1224620, 1280341, 1304539, 1322047, 1300617, 1255442, 1261433, 1330814, 1265668, 1231692, 1180642, 1197313, 1258632, 1227181, 1187097, 1229160, 1346347, 1414840, 1437777, 1405945, 1384509, 1407263, 1413819, 1364228, 1429823, 1573614, 1621853, 1546069, 1568104, 1630964, 1600093, 1506523, 1540803, 1552266, 1497611, 1465078, 1514385, 1538680, 1528518, 1477729, 1488566, 1473402, 1476328, 1448685, 1522631, 1563422, 1563071, 1583221, 1643783, 1665299, 1620057, 1586745, 1629408, 1690774, 1708589, 1667519, 1634378]
12149A634378O580k6517K3401N5111P6094J1009J8256J0737K4132j5193m0888
12138A777100P8593N1354m7953L9396L9036L8735L13j7379l5154J2359M5094K0279
12126B001773j8319K8236O5349L7187l4033R135M8647L8465k1296O610L8441O8083
12114B268278l8848p5372K6720M1112O3657L2772j383m0712K0676l9439Q125P4517
12102B340103K6995K8182O8775K667n5264J6401J05374P5035J7217L8745M317
12091B668547j1542J5491M6940L2798j1969L6909n220o9828j4899M2510L7355
12080B767092j5791L0440O8833J09737Q6723K94l5908Q7332M3053O062n0374p9188
12068C018305l9877Q0085N7503O4966q719L8938N5274O804J02270P6614Q6587
$$ y = [1634378, 1640958, 1614441, 1637842, 1692953, 1769047, 1780056, 1798312, 1809049, 1833181, 1817988, 1777100, 1855693, 1907047, 1859094, 1898490, 1937526, 1976261, 1976574, 1959195, 1924041, 1936400, 1981494, 2001773, 1983454, 2011690, 2077039, 2114226, 2080193, 2089328, 2137975, 2176440, 2155144, 2161754, 2200195, 2268278, 2229430, 2154058, 2180778, 2221890, 2285547, 2318319, 2316936, 2276224, 2296900, 2257461, 2265586, 2340103, 2367098, 2395280, 2464055, 2466722, 2411458, 2427859, 2533233, 2608268, 2625485, 2664230, 2668547, 2657005, 2672496, 2719436, 2752234, 2740265, 2777174, 2771954, 2702126, 2687227, 2729737, 2767092, 2751301, 2781741, 2850574, 2960311, 3047034, 3047328, 3011420, 3098752, 3141805, 3147867, 3097493, 3018305, 2978428, 3058513, 3116016, 3180982, 3172263, 3211201, 3266475, 3273279, 3375549, 3452163, 3538750]
12057C538750Q6011J0209p0603J5525L1603J4912L037J391Q4548M2180l1336J6873
12045C743100R1681O1699M9109P0956k2067l7115K7537M5178P3860M0313o1972
12034D082279L3831P5220O4433J01610K8071j8147M5456J2155L5595O6154M8072
12023D574729K5320J7925N7820M6646M942J02843L766K2093J18132k8070q8986
12012D857160p7803O9050O1840J17533Q5486J7155L5624N5528P0717J06552O1160
12001E460002N3616K5220q144P6600P7798N6936k3262o5938N0142Q7613Q8320
11990E878903L2581L65L4250O3280P8770O1751Q1943N7887k6728n1537M3621N5709
11978F310795j411O1552Q4806K5699K5005K9564L4960L8159O0573P3619P417Q0471
$$ y = [3538750, 3624761, 3634970, 3564367, 3579892, 3611495, 3626407, 3629444, 3630835, 3715383, 3757563, 3726227, 3743100, 3834781, 3896480, 3945589, 4016545, 3994478, 3957363, 3984900, 4030078, 4103938, 4144251, 4082279, 4116110, 4191330, 4255763, 4357373, 4385444, 4367297, 4412753, 4424908, 4460503, 4526657, 4574729, 4600049, 4617974, 4675794, 4722440, 4727382, 4830225, 4833991, 4856084, 4974216, 4946146, 4857160, 4779357, 4848407, 4910247, 5027780, 5113266, 5130421, 5166045, 5221573, 5292290, 5398842, 5460002, 5513618, 5538838, 5530694, 5607294, 5685092, 5742028, 5718766, 5652828, 5702970, 5790583, 5878903, 5911484, 5911849, 5946099, 6009379, 6088149, 6149900, 6231843, 6289730, 6263002, 6211465, 6255086, 6310795, 6309384, 6370936, 6455742, 6481441, 6506446, 6536010, 6570970, 6609129, 6669702, 6743321, 6750738, 6831209]
11966F831209Q933k9894P012P39O0427J10182M5403K617O072K4911L418J3037
11954G084066N6897N7884J9427J0374j1461k1380N5222O4439J8403j3130J1049
11943G331790K6882L1437M7918J5779o0683J3000R4299K9264j4978k3599O2512
11932G553621j094L5750M7365L7087j0446l6488N2377j2468M6163q846k3478o1460
11920G618083K581j2001k8985N6148M1033m3456j4118J2358J6867m5357n1707
11909G551446p5896r3237Q702Q4857O8019o483K3796n5190j14915R113R810K2824
11897G432846l2680p67m1254k727p3481q8757Q733N297j10992m7442j2978K532
11885G038330R005k0259r3429m5915n0671m1984k2702J8088K4394l8870p6065
$$ y = [6831209, 6840142, 6810248, 6817260, 6817999, 6878426, 6988608, 7034011, 7036628, 7042700, 7067611, 7071029, 7084066, 7140963, 7198847, 7218274, 7228648, 7217187, 7195807, 7251029, 7315468, 7333871, 7320741, 7331790, 7358672, 7390109, 7438027, 7453806, 7393123, 7406123, 7500422, 7529686, 7514708, 7491109, 7553621, 7552527, 7588277, 7635642, 7672729, 7662283, 7625795, 7678172, 7665704, 7711867, 7703021, 7679543, 7618083, 7620664, 7608663, 7579678, 7635826, 7676859, 7633403, 7619285, 7631643, 7648510, 7603153, 7551446, 7475550, 7382313, 7391015, 7475872, 7543891, 7537408, 7561204, 7506014, 7391099, 7400212, 7410022, 7432846, 7400166, 7399399, 7358145, 7355418, 7281937, 7193180, 7201913, 7207210, 7096218, 7048776, 7035798, 7038330, 7047335, 7027076, 6933647, 6887732, 6837061, 6795077, 6772375, 6790463, 6814857, 6775987, 6699922]
11874F699922n4947N058m4533p8251o1262o3596o4829N1262k7208q7495j5523
11863F258598J5233O0548k0920j26467r852n6277q4273r1903l3009k6840k3704
11852E861134n3962n0334l6593k2722l3599k3291o6759m2627q767l6747K1686
11841E507419j7137p0274m6838o1741p1558p427p0794r9741m1902k3045m1878
11830D955084n6462k2367K3591l1510j2205r5759j04562K2086j5716j27786q8432
11819D445962m7253m2317k213K1274m1529k1189Q184n3432j32106L1182o376k5430
11807D134757k0282M9374k2176k5901N857r1980j01770k9867k8123q5420n0022
11796C734447l4832m4153l6581m3302k5255K2894J1346o087o8772l0214l8465
$$ y = [6699922, 6644975, 6650033, 6605500, 6527249, 6465987, 6402391, 6337562, 6388824, 6361616, 6274121, 6258598, 6273831, 6334379, 6313459, 6186992, 6177140, 6120863, 6036590, 5944687, 5911678, 5884838, 5861134, 5807172, 5756838, 5720245, 5697523, 5663924, 5640633, 5573874, 5531247, 5522480, 5485733, 5507419, 5490282, 5420008, 5373170, 5311429, 5239871, 5232444, 5161650, 5061909, 5020007, 4996962, 4955084, 4898622, 4876255, 4899846, 4868336, 4856131, 4760372, 4655810, 4677896, 4662180, 4534394, 4445962, 4398709, 4356392, 4354179, 4375453, 4333924, 4312735, 4320919, 4267487, 4135381, 4166563, 4160187, 4134757, 4114475, 4163849, 4141673, 4115772, 4121629, 4029649, 3927879, 3898012, 3869889, 3784469, 3734447, 3699615, 3655462, 3618881, 3575579, 3550324, 3573218, 3584564, 3578477, 3509705, 3479491, 3441026]
11785C441026n6890o8730O235J1667j0832P536j746m0458o3043j16m2422j04003
11773C078224q433K8796j2436N9m5447n5599l5396q0233j1597J0112L8798j2526
11761B894322n4061n7756L4179M0075K7645n9689l3278l6160j42577m2272r444
11750B560984L8248j7770j22689J584O3929R824n4818M036M7389p4691j00405
11739B355621n6405N552M644j7602R319L2375q326p4564K2454J8170l290k6695
11727B261253J0958o7505n7826m0171n0615L1747K1958M8777j3250j5126r3012
11716B037188m0406p5126l1021J2765N3387j5842j21285q2555k2272Q0613N7375
11705A852821k6141K9030J5603q4626k3271M9669m2832j20485K0504O1123O813
$$ y = [3441026, 3384136, 3315406, 3321641, 3333308, 3322476, 3330012, 3328266, 3287808, 3224765, 3224649, 3182227, 3078224, 3069791, 3098587, 3086151, 3086210, 3040763, 2985164, 2949768, 2869535, 2857938, 2868050, 2906848, 2894322, 2840261, 2782505, 2816684, 2856759, 2884404, 2824715, 2791437, 2755277, 2612700, 2570428, 2560984, 2599232, 2581462, 2458773, 2460357, 2524286, 2534110, 2479292, 2483328, 2530717, 2456026, 2355621, 2299216, 2304768, 2309412, 2291810, 2301129, 2333504, 2325178, 2250614, 2273068, 2291238, 2287948, 2261253, 2272211, 2204706, 2146880, 2106709, 2056094, 2087841, 2109799, 2158576, 2145326, 2130200, 2037188, 1996782, 1921656, 1890635, 1903400, 1956787, 1940945, 1819660, 1737105, 1714833, 1795446, 1852821, 1826680, 1855710, 1871313, 1786687, 1763416, 1813085, 1770253, 1649768, 1670272, 1731395, 1738208]
11694A738208r542J5602K9418r6500n6667N454O256n5282J8553L5927J0556k0897
11682A621086J4610m5036p9245N7970J768l5663R621r186L5872n4887n7312M466
11670A464064l1911l6006M6953j8086j9941p1299j2095j5094j2169p5779L8019
11659A256656O045m2460k5108O9020O6058n3384m1766L214j7885Q5732k501m4795
11647A258826J4875J8837l0805l0383M3845m118l2645p2914K7106l3849n9870
11636A098905k7868L0886O6145J8219n5490j4005p1k5651q3843n3834K0724K8227
11624A002344O233J3179O3579J6630l9255k7422q287j5650R328o6479qJ3707M2135
11611A010034K1343L73L6430j6147j7755k3049k4797j5728J5818l277m4971o6707
$$ y = [1738208, 1728666, 1744268, 1773686, 1677186, 1620519, 1625973, 1632229, 1576947, 1595500, 1631427, 1641983, 1621086, 1635696, 1590660, 1511415, 1569385, 1571153, 1535490, 1545111, 1535925, 1571797, 1516910, 1459598, 1464064, 1432153, 1396147, 1443100, 1425014, 1405073, 1333774, 1321679, 1306585, 1294416, 1218637, 1256656, 1262701, 1220241, 1195133, 1264153, 1330211, 1276827, 1235061, 1238275, 1220390, 1306122, 1303621, 1258826, 1273701, 1292538, 1261733, 1231350, 1275195, 1271077, 1238432, 1165518, 1192624, 1158775, 1098905, 1071037, 1101923, 1168068, 1186287, 1130797, 1116792, 1116721, 1091070, 1007227, 953393, 974117, 1002344, 1008577, 1021756, 1085335, 1101965, 1062710, 1035288, 1027001, 1011351, 1020679, 954200, 954192, 967899, 1010034, 1031377, 1031750, 1068180, 1052033, 1034278, 1011229, 986432, 970704, 986522, 983245, 938274, 871567]
11599H71567m6154j713l9579K6159m1445m4046k4082P6132M4902J8233O719M871
11587H51564j7004m6575k9714j0094J097O0189K3365m6815k4211l268L1000j9197
11575G70337j3690j2889p023M5809Q682R56j821k9579l0592j6032p6371N6435
11563F94222J05227r287o1795k9256m0032j1158M7904K8937J7438j449K3083m8203
11551G15631j8440m9107k2086K3436l8168j8247l8861m9988L1627j1253j745N8547
11539E81346K3279m6873O2241J3014n9154M3426Q2461k2645p0835N0162L4432
11528F90854n2655j8937o8205k0961J03730Q6835J874o2964k6032j1784Q1810
11517G03565n259j07460n7315m5529o965K1577J7129N3558M3414K8386L0516j419
$$ y = [871567, 825413, 823700, 784121, 810280, 768835, 724789, 700707, 776839, 821741, 839974, 846693, 851564, 834560, 787985, 758271, 748177, 749274, 809463, 832828, 786013, 761802, 758534, 789534, 770337, 756647, 743758, 736735, 782544, 791226, 792182, 790361, 760782, 730190, 714158, 637787, 694222, 799449, 790162, 728367, 699111, 659079, 647921, 695825, 724762, 742200, 740751, 763834, 715631, 697191, 648084, 625998, 649434, 611266, 593019, 554158, 504170, 535797, 524544, 522799, 581346, 604625, 557752, 619993, 633007, 573853, 617279, 699740, 677095, 606260, 656422, 690854, 638199, 619262, 551057, 530096, 633826, 720661, 722535, 659571, 633539, 621755, 703565, 698306, 590846, 533531, 488002, 481037, 502614, 519743, 573301, 616715, 645101, 675617, 674198]
11505F74198k9700m1360m0715k8142j3639n1790j5377l6796O1355L6908R414M5708
11493E70064k2345l8788N4094l5638j0743L3003l1415j901m0474l2520M6998n135
11481D85200l1109m5174N648K0018m6754M6483N213n4263l0537m7686J13803K1257
11469D42099Q256k0077l6193j511R904r967J6333M2090O2691l3133o0975q860
11457D10657K7608m1038K8029O145K6180k0854K1840N1351m9926k5427m5127m5029
11445C44409M3980N0545j8321l8939j2896L1450k5010p2398n1143Q5827M2992
11434C80496l3359j9952J3329K260J2293j1822m0365p2701N2454K8653m2482P9805
11422C48609O2353M1874N897l2981o1355k4147Q817k9494L024K8038Q192j0316
$$ y = [674198, 644498, 603138, 562423, 534281, 520642, 468852, 453475, 416679, 478034, 514942, 524356, 570064, 547719, 508931, 563025, 527387, 516644, 549647, 518232, 516331, 475857, 443337, 490335, 485200, 454091, 408917, 414565, 434583, 387829, 434312, 439525, 385262, 354725, 307039, 420842, 442099, 450355, 430278, 394085, 392574, 402478, 392511, 408844, 450934, 513625, 480492, 419517, 410657, 438265, 397227, 425256, 431401, 457581, 436727, 458567, 509918, 459992, 434565, 389438, 344409, 388389, 438934, 420613, 381674, 368778, 400228, 375218, 302820, 251677, 337504, 380496, 347137, 327185, 340514, 342774, 355067, 343245, 302880, 230179, 282633, 311286, 268804, 348609, 410962, 452836, 458733, 425752, 364397, 340250, 349067, 319573, 322597, 350635, 358827, 348511]
11410C48511K903L36l3692l2151k2014L0402K7498j688n6157M1761J5676L2611
11398C53996J3254j7359l0981r339o3044j3996j0458m2005K1214k037j0196P9368
11386B68417L065k6086J074k4718k8599k5517J2550J9562P3856M4468r7285j9644
11374B01143N7882R454j0497J4361M4157J2567J0807k9899l9471q9425l1515K6208
11362A75772l2225Q8970j9343m9556J2550l0325l3531L9431J5534N2355N909l2189
11350A93352R41l393L6400P8602l6965J1151k6558n6665M902N5350P126k3871
11338B40372m5321l9647Q5629L9960l665n4197j5855J4684n2690k5666L0085O7461
11326B41150k3569m321K9936j7590p9529l7596j0402K2825O5616N9484j6015k5173
$$ y = [348511, 351414, 351750, 318058, 285907, 263893, 294295, 321793, 320105, 263948, 305709, 321385, 353996, 367250, 349891, 318910, 309571, 246527, 232531, 222073, 180068, 201282, 199245, 189049, 268417, 271482, 245396, 246470, 221752, 193153, 167636, 180186, 199748, 273604, 318072, 220787, 201143, 259025, 268479, 257982, 272343, 316500, 329067, 339874, 309975, 270504, 181079, 149564, 175772, 143547, 232517, 213174, 163618, 176168, 145843, 112312, 151743, 167277, 219632, 225541, 193352, 194293, 190900, 227300, 305902, 268937, 280088, 253530, 196865, 201767, 257117, 264243, 240372, 195051, 155404, 241033, 280993, 277328, 223131, 207276, 221960, 169270, 143604, 173689, 241150, 217581, 213260, 243196, 225606, 146077, 108481, 98079, 120904, 186520, 246004, 229989, 204816]
11314B04816M5967j4948j18166n5076l2596R9875P9471k0688k9880k0964L6438
11303A74249k717K8658K2498J4022l0637l6783j3164l5397k6955L1303K2718L4226
11291A82021L1038l5087O428N1204j1080o2005o6576P3353K7780m806l9842K5791
11279A78219L1692M4632N448J3062O782j8878L1069k6009m2112J1672P8052o064
11267C07565m5980j12164l6682M3330L1699o3339l0257J37677k4785k031M409
11256B09442j2746p1954m85L1630R354r735j5881m0364l8902P591P316o1428K047
11243A5885N2308J4038P7763L6616M792Q107k3448m4928l0998M7734O8951p7936
11231A48884m4547n968N0116K3532K5026K1039J0694k8953o9947L3893N4644l1314
$$ y = [204816, 250783, 235835, 117669, 62593, 29997, 129872, 209343, 188655, 158775, 137811, 174249, 171532, 200190, 222688, 236710, 206073, 169290, 156126, 120729, 93774, 125077, 147795, 182021, 213059, 177972, 184400, 235604, 224524, 162519, 95943, 169296, 197076, 192270, 152428, 178219, 209911, 254543, 259991, 273053, 279835, 260957, 292026, 266017, 223905, 235577, 313629, 307565, 261585, 149421, 112739, 156069, 187768, 124429, 94172, 231849, 207064, 205033, 209442, 196696, 124742, 124257, 155887, 165241, 155506, 139625, 99261, 60359, 67950, 75266, 13838, 15885, 68193, 82231, 159994, 196610, 201402, 209509, 186061, 141133, 110135, 157869, 226820, 148884, 104337, 98369, 148485, 172017, 197043, 218082, 228776, 199823, 129876, 163769, 218413, 187099]
11219A87099j7712j854n7567p0554R461J0366l9540M1724M2012o1629M253N4365
11207A00424K9777m4704m6031P6695p941K7694k2547q551J8813L3570q691l7185
11195A11323l713m3121m2223J3849L688R419N7975M9781r4033n0804N8402p874
11183F2669o8420Q719L6050j8007k4455o608P271r7021N966Q4841K8087j3295
11171E797J4603N4782n8872q655N7615J7117n732j6666O737O470n6558J0398J6699
11158D3735P8221P7378k9121k8013k0353m0731J5098m0154n8181J6085J10033
11147A23997j1441n3108M8945J7693K3921K7664o3407j04946K6569N2283K7885
11136A16055n2156m4619N3567j548k1211j5542R975K2502k1651N5483l5505j0464
$$ y = [187099, 169387, 167533, 109966, 39412, 48873, 59239, 19699, 61423, 103435, 41806, 46059, 100424, 130201, 85497, 39466, 116161, 108220, 135914, 113367, 104816, 123629, 157199, 148508, 111323, 107610, 64489, 22266, 36115, 39803, 49222, 107197, 156978, 62945, 12141, 70543, 62669, -5751, 2968, 39018, 21011, -3444, -10052, -2781, -99802, -93836, -8995, 19092, 5797, 20400, 75182, 16310, 7655, 65270, 82387, 76655, 59989, 66726, 73196, 16638, 27036, 43735, 121956, 199334, 170213, 142200, 121847, 81116, 96214, 56060, -2121, 13964, 123997, 112556, 59448, 108393, 126086, 150007, 177671, 114264, 9318, 35887, 88170, 116055, 63899, 19280, 72847, 71299, 50088, 34546, 44521, 67023, 45372, 100855, 65350, 54886]
11124E4886J6276j9490J9508m6221k0449K0032k4766n1764j5060J2110O4502k846
11112F718K7856K9076n0609J3828J4150n8536K2336K4830l4402L746J2155N8091
11100F9239L892m5156K8938K572n721M7982k0361J549j5768j4649k3435K3588
11088E2670l5216l6001P337M2351N846j2060M833L3494o0352p661M5936n1302
11076a0125K5702O9462N602K9009j2779m1214n0672P787J8081L822J6501K1148
11064H2324j6243m9110j205K3569k8791j7824l3661N7284k0142m5542q120K5071
11052c2390l1554j0626O0513L2450J44327N2873m1157K596L850l0437M0294L2999
11040B23738j5685o1963O1777Q3463R0574J18144J01522J56081J01809J0084j55426
$$ y = [54886, 71162, 51672, 71180, 24959, 4510, 24542, -224, -51988, -67048, -54938, 9564, 6718, 34574, 63650, 13041, 26869, 41019, -17517, 4819, 29649, -4753, -1007, 11148, 69239, 73131, 27975, 56913, 59485, 53764, 101746, 81385, 82934, 67166, 52517, 29082, 52670, 17454, -18547, -11210, 31141, 36987, 24927, 29760, 63254, 2902, -4759, 41177, -10125, 15577, 85039, 90641, 119650, 106871, 65657, 14985, 22772, 40853, 44675, 61176, 82324, 66081, 16971, 15766, 39335, 10544, -7280, -40941, 16343, -3799, -49341, -57461, -32390, -63944, -74570, -14057, 18393, 162720, 215593, 174436, 177032, 180882, 150445, 190739, 223738, 208053, 146090, 207867, 291330, 381904, 500048, 601570, 757651, 859460, 869544, 714118]
11029G14118j15208l0266Q158k1018O3278J6611J48738J28757L5583O8859l5119
11018I82491j33757j13572j14918l6768o8021n2619j092O6199m056J00322P0267
11007F94476m247j10515j84812j81900m8258O6520M3371J112j3568P2215K8243
10996C62637L1706p3761j04054p3486K0704l7223l6463m5852J7252p303j3811
10985D0346k0584l3383L50k955J6486O0088n985k960N6650p570J489J2819n3547
10972F1244L757J6594p5720l5872K4033m7194o9479p407J8639J452L6721L44j3380
10959h6268L6358K1129K7459k1331O8013R6241L0203J0848o1723p5690l2283m092
10947H864j2471m8301p1814k9597J03186Q4252j8125p2780p879J4947m097q64
$$ y = [714118, 598910, 568644, 576802, 555784, 619062, 635673, 784411, 913168, 948751, 1017610, 982491, 848734, 735162, 620244, 583476, 515455, 462836, 461744, 527943, 523887, 624209, 694476, 690229, 579714, 394902, 213002, 164744, 231264, 274635, 275747, 262179, 334394, 362637, 394343, 320582, 216528, 143042, 163746, 126523, 90060, 44208, 61460, 54157, 40346, 19762, -13621, -13271, -16226, 260, 60348, 54363, 51403, 108053, 100483, 101972, 114791, 61244, 65001, 81595, 5875, -29997, -5964, -53158, -122637, -130044, -111405, -109953, -73232, -72888, -86268, -49910, -28781, -1322, -22653, 45360, 141601, 171804, 182652, 120929, 45239, 12956, 8864, -3607, -51908, -123722, -153319, -50133, 34119, 15994, -56786, -64665, -49718, -53815, -54679]
10935e4679l5456J7914N8961J2983K5263j6157L2673P5382R701J3824j6685k7116
10923I6608j0387Q1855P1072O9854R977N7467J40916Q9563K29633L29434L76275
10912A542267M56766L40134R3452k96737n05090l91458l09684k28717j41197p9265
10902D80471j66642j07328n0414R894k7763l3071m3533O6466M6688m3460q9469
10891D1839p7241l8156M4899J15542K5867l3393L1713k9971m4270N1446j800m4879
10879D1596J9513l5004Q682L017l179n2635K6641Q670K9123m8238R958j0374m4440
10866d6670j0352l560k2134K5951R4175M9698m4830p0689k3056O0660N1814n2908
10854H099m5474n091M1876O1143J4654k1127j01601k5390L6425o5294j187J17598
$$ y = [-54679, -90135, -72221, -13260, -277, 24986, 8829, 41502, 116884, 126585, 140409, 123724, 96608, 86221, 168076, 239148, 309002, 318979, 376446, 517362, 606925, 836558, 1165992, 1542267, 1999033, 2339167, 2432619, 2135882, 1630792, 1239334, 929650, 700933, 559736, 480471, 313829, 206501, 156087, 165981, 138218, 105147, 61614, 128080, 174768, 131308, 41839, -35402, -73558, -28659, 86883, 112750, 79357, 111070, 81099, 36829, 88275, 86475, 41596, 61109, 26105, 34787, 37804, 34625, -18010, 8631, 17301, 46424, -1814, 8144, -2230, -46670, -57022, -60582, -82716, -56765, 37410, 87108, 42278, -28411, -51467, 9193, 61007, 8099, -37375, -42466, -590, 60553, 75207, 54080, -47521, -72911, -36486, -101780, -102967, 14631]
10842A4631j682p4223j0275k170M4659l2844m5600K3447j9919K905l7088l0001
10830a68160L3039j2880M8663K1610J1130k9813l5238o469n0663P1598K1456j3361
10818a09088M896j9775M4310K5760l4053k5008J6721l8982k0509L0615L374J2244
10806a09495L5543k126L0827R504J0930l3280l6626J966P0617P4435p37o5750
10794a4192M3490K9172m8173o3135o0232R081Q682M559J8236L7965K3570N861
10782e116O1131O0801j1634o6228l7323M6316N8382k6559m7118k3386j06580o1327
10770a58641L1670J18239j1874J6928n5468k5908l2934l522l261J32178J9613
10759B7020l8802J9226k6003n3854n116l2882n8234p6502j4264Q7760N8593R03
$$ y = [14631, 12949, -61274, -71549, -73719, -29060, -61904, -107504, -84057, -103976, -101071, -138159, -168160, -135121, -148001, -99338, -77728, -66598, -96411, -131649, -138118, -188781, -117183, -95727, -109088, -104192, -123967, -79657, -53897, -87950, -112958, -96237, -135219, -155728, -125113, -121739, -109495, -73952, -76078, -45251, -35747, -24817, -58097, -94723, -92757, -22140, 52295, 51558, -14192, 29298, 58470, 10297, -52838, -113070, -103989, -95307, -90748, -72512, -34547, -10977, -5116, 56015, 116816, 105182, 38954, 1631, 47947, 106329, 79770, 32652, 9266, -97314, -158641, -126971, -8732, -20606, -3678, -59146, -85054, -117988, -121510, -124771, 7407, 27020, -11782, 7444, -18559, -72413, -77529, -110411, -168645, -245147, -259411, -171651, -113058, -112155]
10747a12155R628k5648J182M7682N5019K807j3320o1091m2179L6533P08L9773
10735f1061O6694R4866J4608j9163j4963N3191n3601q6273l3037q997j2734K7348
10723c3122P2931J0929p2781m727L1015j1121j2399k4791k7349o1226j22655L0693
10711b24603K6914Q3654J00253k1290K727j4754n2570J4243J059j6266n9394O7265
10699i2762k314k1525q808l7212R878Q3018L8336j7143L979Q0717J0747N3753
10687A00664L818m9441N16N7054n0744j7728M6580l5326q0905j00114L0263n439
10675a00802P5366r806n6760J0071m1510L7904M3107k4139k7908k4985M4065M0685
10663c4712L6888K3512k1072n7639N193O7435O8804Q0920l0126R7060J16077M5123
$$ y = [-112155, -102527, -128175, -126993, -79311, -24292, -21485, -34805, -95896, -138075, -101542, -100834, -61061, 5633, 100499, 115107, 95944, 80981, 134172, 80571, -5702, -38739, -47736, -60470, -33122, 39809, 50738, -22043, -26770, 4245, -6876, -19275, -44066, -71415, -132641, -255296, -224603, -197689, -114035, -13782, -35072, -32345, -47099, -99669, -85426, -84367, -100633, -160027, -92762, -95076, -116601, -125409, -162621, -152743, -69725, -31389, -48532, -44553, 36164, 46911, 100664, 104482, 55041, 55557, 112611, 61867, 44139, 90719, 55393, -25512, -125626, -95363, -100802, -25436, -35242, -92002, -81931, -123441, -85537, -42430, -66569, -94477, -119462, -75397, -34712, 2176, 25688, 4616, -53023, -47830, 19605, 88409, 169329, 139203, 236263, 352340, 397463]
10651C97463m2976j1758L9055m903N2531J49448J19114R7508J21936R4425P4824
10640A086667O2875K5439O1427L9594K8376J16359K27738L27015L71299M84458
10630B831247M69981L41676L05406L24217N14229P74564R74988J244700J666755
10621I447763K213815K995633M050384N435106P011750Q582228R163037P253868
10613E6153584L116234j113072l215361k788108p44779J881846N126061R029745
10605F7446150J3367283J7388493J8565620J3265169J669310r117450j2984101
10598A09600474j0631158n808338k81411N413239J1325165J7514912K2552801
10591A49685684K2468627J2779268m979173j9966131k3881669j9709976j3246731
$$ y = [397463, 354487, 342729, 381784, 376881, 429412, 578860, 697974, 795482, 917418, 1011843, 1086667, 1149542, 1174981, 1236408, 1276002, 1304378, 1420737, 1648475, 1975490, 2346789, 2831247, 3301228, 3642904, 3948310, 4272527, 4786756, 5561320, 6536308, 7781008, 9447763, 11661578, 14657211, 18707595, 24142701, 31154451, 39736679, 48899716, 56153584, 59269818, 58156746, 54941385, 52153277, 51408498, 53290344, 58416405, 67446150, 80813433, 98201926, 116767546, 130032715, 131702025, 122584575, 109600474, 98969316, 93160978, 92879567, 98292806, 109617971, 127132883, 149685684, 172154311, 184933579, 179954406, 159988275, 136106606, 116396630, 103149899]
10584A03149899o873597j142008M056097Q870680J2072386J1188142L696230q403786
10576A26614043j7504926j8833082j5205558j0393742o111297k688406N181K050544
10568E7932757L064854K179087j161503n703998q856439r245288p778213o018393
10560B4412864m454351l283225k445495j893084j409399j099159q74550p28728
10552H224873o27582n67177m75496m33052l75359l11248j65289j24125j11227
10543E034318q1134q3156j41515j1835l0902P01N9940P2321J9585R9528J46831
10532E084682J77487K28309K54220K25134L08247M17136N67620P22078Q42392
10523H827305Q69073R87060J160774J025849O18639M98175Q12574J211602J543098
$$ y = [103149899, 96276302, 95134294, 99190391, 108061071, 120133457, 131321599, 135017829, 126614043, 109109117, 90276035, 75070477, 64676735, 58565438, 55877032, 55882213, 57932757, 60997611, 63176698, 62015195, 56311197, 47454758, 38209470, 30431257, 24412864, 19958513, 16675288, 14229793, 12336709, 10927310, 9828151, 8953601, 8224873, 7597291, 7030114, 6554618, 6121566, 5746207, 5434959, 5269670, 5145545, 5034318, 4953184, 4870028, 4728513, 4716678, 4685776, 4686477, 4746417, 4818738, 4838323, 4937851, 5084682, 5262169, 5490478, 5744698, 5969832, 6278079, 6695215, 7262835, 7984913, 8827305, 9696378, 10683438, 11844212, 12870061, 13488700, 13986875, 14799449, 16011051, 17554149]
10514A7554149K040967K653445L384521M386826N688225P372241R301812J1630018
10506F4012204J5477566K2022477L2079452M6816695O7522985R1044816R9911225
10499D38887420O1897884l8536304j05829283r8454725o9611078m6462319l1298820
10492A10592775k1680939j5622281j1844810r596157p805722o321310n084890
10485C2636666m065460l221630k667223k197803j744325j449837j127850p08013
10477A5454525m75270n86259j109010j322214j120626r31724q05171o35309n28203
10468G940739n00492m98251l80543l27899k94465k84308l07966k24591k07355
10459D914869k12439j18834j58049k06996j11964j46606q9975j04769j01419j71688
$$ y = [17554149, 19595116, 22248561, 25633082, 30019908, 35708133, 43080374, 52382186, 64012204, 79489770, 101512247, 133591699, 180408394, 247931379, 338976195, 438887420, 500785304, 462249000, 356419717, 257964992, 188353914, 141891595, 110592775, 88911836, 73289555, 61444745, 51848588, 44042866, 37721556, 32636666, 28571206, 25349576, 22682353, 20484550, 18740225, 17290388, 16162538, 15454525, 14979255, 14392996, 13283986, 11961772, 10841146, 9909422, 9104251, 8468942, 7940739, 7440247, 6941996, 6561453, 6233554, 5939089, 5654781, 5346815, 5122224, 4914869, 4702430, 4583596, 4425547, 4218551, 4106587, 3959981, 3870006, 3765237, 3663818, 3492130]
10449C492130j71075j26823o8195o1689j74473r0641l3776j3084r3031j74026
10439B485317q8045m8041l9773m7627O490m6372l3143q8002o8583J2864k7502
10428B017583l6683m205q5365l9184j1774m3479p3077j6054K8257j9667n9672
10417A656680l1295o6622n4653j9261j1916j6194o058j6754j7006q6200k6263
10406A304458j7831O5457n0110l5738K4019n6536j7389N1097j3403l8473o5786
10395A149765n0345O538L83q920l0671l430N988L1232O1891n8528k0494R800o5264
10382A027945k2033J4456k5449m9900j3692k9550J7871q536n4516m6105K6049
10371H36540K4651k4696M6881Q3305J35550O0346M788L948m0290n5081n3373o8524
$$ y = [3492130, 3321055, 3194232, 3126037, 3064348, 2889875, 2799234, 2765458, 2752374, 2659343, 2485317, 2397272, 2349231, 2309458, 2261831, 2268321, 2221949, 2188806, 2100804, 2032221, 2045085, 2017583, 1980900, 1976695, 1891330, 1852146, 1840372, 1796893, 1723816, 1707762, 1736019, 1716352, 1656680, 1625385, 1558763, 1504110, 1484849, 1472933, 1456739, 1450681, 1433927, 1416921, 1330721, 1304458, 1286627, 1352084, 1301974, 1266236, 1290255, 1233719, 1216330, 1267427, 1254024, 1215551, 1149765, 1099420, 1105958, 1106341, 1097421, 1066750, 1063320, 1069308, 1100540, 1162431, 1103903, 1083409, 1093209, 1027945, 1005912, 1020368, 994919, 945019, 931327, 901777, 919648, 911112, 856596, 810491, 836540, 861191, 836495, 883376, 966681, 1102231, 1162577, 1167365, 1171313, 1131023, 1075942, 1022569, 954045]
10359I54045o3293q6328p0901o9689m2220K4736J47372R2069J2903r222l7655
10348H51817j09591n8401l4408k6878K0552J5663n0397J9325Q9067O3519k6841
10337G53427n9456L2375K0213j6037k6373K964j1588m8664k4328J8316O7993r635
10325F99207p0138j7933k7798n1443p0995M4863J3466n5187r449P2041p680r4270
10313D24684K9724J08842O5798J7520J5416m3230n8237o6892p3900J9203k4252
10302D14676p0118j3658R6074Q9180J9125l1021J2298Q9231K0937o6098k8629
10291E31997l7706n7009k9319J07178J15698m976m9503l349K1093j4397k586j7478
10279E59643k0142k5530M0917K570p0714k9815O5335p7008q8560P1368J2497O7529
$$ y = [954045, 890752, 804424, 733523, 663834, 621614, 646350, 793722, 885791, 898694, 889472, 851817, 742226, 683825, 649417, 622539, 643091, 658754, 608357, 627682, 716749, 780268, 753427, 693971, 726346, 746559, 730522, 704149, 707113, 695525, 646861, 622533, 640849, 708842, 699207, 629069, 611136, 583338, 531895, 460900, 505763, 519229, 464042, 454593, 526634, 518954, 424684, 454408, 563250, 629048, 646568, 661984, 618754, 560517, 493625, 419725, 438928, 414676, 344558, 330900, 426974, 516154, 535279, 504258, 516556, 605787, 626724, 560626, 531997, 494291, 437282, 407963, 515141, 630839, 625863, 576360, 573011, 594104, 579707, 577121, 559643, 539501, 513971, 554888, 557458, 486744, 456929, 522264, 445256, 356696, 428064, 440561, 508090]
10267E08090p496m0260k8392O5676M5551j5744O108J2377l1607L2405p888o050
10255E32770m7257n2339K4086M9626K4781K5976n8546j4342k3294l687K0770j4726
10243D63818K5197K5289Q365m395p474l0183l5141q9628n2906Q488N3851m859
10231C60422M2318o758r541L5110N4916O7130j6874j6296o7303m0205O237M1876
10219D51032l7478p3779m9188M876N7520L6021k981K9333l001p744K2735K0879
10207D48225m8567k4301j4794J352J2664q2402M2116J8898k5184J9490j7102k8463
10195C01932l1566j3052K2077j8166K7981N1288O3878N9256j5107o791o7226j1815
10183C62689P8166J4200O8783K0107m8034j7714K6880J4563k19J2081j0444J2009
$$ y = [508090, 500594, 460334, 431942, 497618, 543169, 527425, 533533, 545910, 514303, 546708, 538820, 532770, 485513, 433174, 457260, 506886, 531667, 557643, 499097, 484755, 461461, 457774, 478544, 463818, 489015, 514304, 522669, 518274, 510800, 480617, 445476, 355848, 302942, 311430, 365281, 360422, 402740, 395982, 386441, 421551, 476467, 543597, 526723, 510427, 443124, 402919, 409156, 451032, 413554, 339775, 290587, 295463, 352983, 389004, 386023, 415356, 412355, 404611, 427346, 448225, 399658, 375357, 360563, 361915, 374579, 292177, 334293, 353191, 328007, 347497, 330395, 301932, 270366, 257314, 279391, 261225, 289206, 340494, 404372, 463628, 448521, 441730, 374504, 362689, 440855, 455055, 523838, 543945, 495911, 478197, 505077, 519640, 519421, 531502, 521058, 533067]
10171E33067N8712J6377L7101j246J10504J70712P9699O868j08371j44176n1120
10160G08127N5271O1854R7338M5399J14990J29668J36276j5981p7493j31584q1698
10149A042167q0830j30504p2334N4347N6901N9892Q5269O6018N049j06828p8831
10138I00316o5231p4291q5102l6127K2147Q2929K9242L137o817j4389j1338j05052
10126F39424q8700l9522n2381k9856j1147N8042n292l7275r8549j0278N6608N353
10114C86427k1838o5189n430K3671R988L0171O227L6814o5582n3441L8729k9363
10102B91184p4817K6688K2731M5421M5738N7111j1833l3615N0992L5341K8138
10091D83079R9643N8606P8361J27374J71097L00827L05630L90714L53835L66964
$$ y = [533067, 591779, 608156, 645257, 644011, 754515, 925227, 1004926, 1011794, 903423, 759247, 708127, 763398, 825252, 922590, 967989, 1082979, 1212647, 1348923, 1332942, 1255449, 1123865, 1042167, 961337, 830833, 758499, 812846, 869747, 929639, 1014908, 1080926, 1085975, 979147, 900316, 835085, 760794, 675692, 639565, 661712, 744641, 773883, 777020, 770203, 755814, 744476, 639424, 550724, 511202, 458821, 428965, 417818, 475860, 470568, 433293, 334744, 324466, 381074, 386427, 364589, 299400, 293970, 317641, 327629, 357800, 364027, 400841, 335259, 281818, 320547, 291184, 216367, 243055, 265786, 311207, 356945, 414056, 402223, 368608, 419600, 454941, 483079, 582722, 641328, 719689, 847063, 1018160, 1318987, 1624617, 2015331, 2369166, 2736130]
10081B736130m9005m54149n00805l22670l00575k43603j45186n3151P331n4873
10071F19444o7130o0279j1554l4792J1718l8703p6716o2751K0702M5516p4450
10060B71005Q23m526J5311K2943Q363K3266P187k2261K9547m922n760J4259m2293
10047C12942o6907k8148n3063K9541O3651J4411n9467j2021J6107j0797N3851
10036B60100L4415N573J0175R398M4714M1231l8181m4274o0993l6313J8335L0923
10024B75103l1667q6679M356M0563k8711k7192J8847M3983l8505J658L9556P816
10012B19128O4437k9631n7494m5756l4647M7836P8461j2305l4851n3156k911l0838
10000A08273j2069O2234N7384p2517m6201m329K3894L4910j3813K6235m0657l9456
$$ y = [2736130, 2687125, 2232976, 1732171, 1409501, 1108926, 865323, 720137, 666986, 674317, 619444, 552314, 492035, 480481, 445689, 457407, 418704, 341988, 279237, 299939, 345455, 271005, 271828, 267302, 282613, 305556, 313919, 337185, 344372, 322111, 351658, 346736, 340976, 355235, 312942, 246035, 217887, 164824, 194365, 258016, 272427, 212960, 200939, 217046, 206249, 260100, 294515, 300088, 310263, 319661, 364375, 405606, 367425, 323151, 262158, 225845, 244180, 275103, 243436, 156757, 161113, 201676, 172965, 145773, 164620, 208603, 170098, 171756, 211312, 219128, 283565, 253934, 196440, 150684, 116037, 163873, 242334, 230029, 195178, 142022, 139111, 108273, 96204, 158438, 215822, 143305, 97104, 92775, 116669, 151579, 137766, 164001, 123344, 83888]
9988H3888L7981J01490L0987k4097j9059L2063K3773r7919l4321k5540K5654j8483
9976A16417L6673Q0862M3604O9684q8834r9184l5434Q150M3613J5503J8061k4720
9964A84395n4647L9543L4497q307J3799L14m8115n1602j1598M5630P7935M981
9952B26825o427n8980M5851P1005j3151q7080m0889l6474M3591L8065L5025k2387
9940A94974o0168K0444N6954L836m5531m0312k2874L3024O6501J01485M8114Q5360
9928D41807N5191p6365n2406l1968r0970n5485l0650J546K344K8429Q655j12923
9916H7205K8704J8595J2239N2758p648K5665J7097J1396l2952l9553k3421J8007
9904A68092L7160j4396o9936r910m5593m7090k905R7568L9786k0864n8607j2010
$$ y = [83888, 121869, 223359, 254346, 230249, 211190, 243253, 267026, 169107, 134786, 109246, 134900, 116417, 153090, 233952, 277556, 347240, 258406, 159222, 123788, 131938, 175551, 191054, 209115, 184395, 129748, 169291, 203788, 195481, 209280, 209594, 161479, 109877, 98279, 143909, 221844, 226825, 220398, 161418, 207269, 278274, 265123, 178043, 137154, 100680, 144271, 182336, 217361, 194974, 134806, 155250, 212204, 216040, 170509, 130197, 107323, 140347, 206848, 308333, 356447, 441807, 496998, 420633, 368227, 336259, 245289, 189804, 159154, 160700, 163044, 191473, 200128, 87205, 115909, 134504, 146743, 199501, 191853, 217518, 234615, 246011, 213059, 173506, 150085, 168092, 205252, 190856, 120920, 111010, 65417, 18327, 15422, 112990, 152776, 131912, 73305, 61295]
9892F1295K6259m9813j7825M0228M5071k1152J9900J2029J2254k1485k911l5565
9880F8285n5418p5944L7491Q5341K4018l4846J6447K5487r2592k7186R2755J0854
9868G4692n6252l3253P6023K1972L2135K0699m073q0512p0717l540K8636Q3695
9856H9505O8093O545j8011J244l0734M5015J9751j7693J0104k2987m714L1891
9844A78009o9947l1605J6700J504q413N5272M2829M8671N855o1766J74l4862J4568
9831A56989Q148m3489l6275k2526K3998j5819K5048Q3695J7677o3680j4910K5167
9819A44023L1194n2711j9924l5637J6772l0858j571M3987P9953l0042m4177L1204
9807A32213n3594j7978J0118R5843O0338J1080j1209o4662r1288j6921M7166L9998
$$ y = [61295, 87554, 37741, 19916, 60144, 105215, 84063, 103963, 115992, 128246, 106761, 103850, 68285, 12867, -63077, -25586, 59755, 83773, 48927, 65374, 90861, -1731, -28917, 63838, 74692, 18440, -14813, 61210, 83182, 115317, 136016, 131943, 51431, -19286, -22826, 5810, 89505, 157598, 164143, 146132, 147376, 116642, 161657, 181408, 163715, 173819, 150832, 146118, 178009, 108062, 76457, 93157, 94661, 86248, 141520, 184349, 233020, 238875, 177109, 177283, 142421, 156989, 165137, 121648, 85373, 62847, 86845, 71026, 96074, 179769, 197446, 133766, 118856, 144023, 175217, 122506, 102582, 66945, 83717, 52859, 51288, 95275, 175228, 145186, 101009, 132213, 78619, 60641, 70759, 166602, 226940, 238020, 226811, 162149, 70861, 53940, 101106, 141104]
9795A41104l2567l8184l7377k2742K5903Q2900K2473o1191l9096k4140M7837O7067
9783A31987K1700l2527j3431R02L426l5506M3501M3998l1588o2296q3555j5334
9771b8723M1830K6559Q4722j7068p1497m6272N2187J0813P6399k502j6996j357
9759A08095p636k7678l3111j1825N6644K3163L5264K5836n2072n0784N739O2980
9747A34615L3164m8787j7349P4370J8570r8311j06633r994L7443K8599j343R68
9735D5312J2734m2875o2364j9878N4729Q2269J7355L2912K8003L4454L046m6542
9723A39155n1242N3791J08097N700l6018p7776o2620J6059q840l0997l488M8442
9711A00263M0292K1900J1214K4048J0884k1357m6657p8708k1055K8012K2036j4297
$$ y = [141104, 108537, 70353, 32976, 10234, 36137, 119037, 141510, 80319, 41223, 17083, 64920, 131987, 153687, 121160, 107729, 108631, 112057, 76551, 120052, 164050, 132462, 70166, -13389, -28723, 13107, 39666, 124388, 107320, 35823, -10449, 41738, 52551, 128950, 126448, 109452, 108095, 100459, 72781, 39670, 27845, 84489, 107652, 142916, 168752, 116680, 65896, 71635, 134615, 167779, 118992, 101643, 176013, 194583, 96272, -10361, -20355, 17088, 45687, 44344, 45312, 58046, 15171, -47193, -67071, -12342, 69927, 87282, 120194, 148197, 182651, 185697, 139155, 87913, 141704, 249801, 255501, 219483, 141707, 79087, 95146, 86306, 55309, 51821, 100263, 140555, 162455, 173669, 197717, 208601, 187244, 140587, 61879, 40824, 68836, 90872, 76575]
9699G6575O3458O3400L0722L8464m4224o2861j5560k8108o8427l0377m3317Q8725
9687F8470P1025k3549k311K4007n1759p4673q250L1367M9413k3845J5140R3478
9675A68513q691m1132J4770J2513K3239j6392j3425m147o183L1363L4580L35j8329
9662A77014M4325L4130n2179r2388j2949J8273Q0532P1328N1310J87156K42828
9651G49380K38599N9797k93908k88994k59168p6870M3916k0861l9528M2924j473
9640A53814o6917n9140o050o513Q846P1414n359k2538m0281k1549M7292M3038
9628I6057O7234J6618K0256l7010o8863k4120J3037j9143n3261k6559K5411L4421
9616D4078O5538K7213o932P969L0193R596l1226q0467p6243L6095j5847k4923
$$ y = [76575, 140033, 203433, 234155, 272619, 228395, 165534, 149974, 121866, 53439, 23062, -20255, 68470, 139495, 115946, 113635, 137642, 85883, 11210, 2960, 34327, 83740, 59895, 75035, 168513, 159822, 118690, 133460, 145973, 169212, 152820, 139395, 135248, 129065, 160428, 195008, 195343, 177014, 221339, 255469, 203290, 110902, 97953, 116226, 196758, 268086, 319396, 506552, 749380, 987979, 1047776, 753868, 464874, 205706, 128836, 172752, 151891, 112363, 155287, 153814, 86897, 27757, 21707, 15194, 24040, 95454, 90095, 67557, 27276, 5727, 53019, 96057, 163291, 179909, 200165, 163155, 94292, 70172, 83209, 64066, 10805, -15754, 9657, 44078, 109616, 136829, 129897, 137866, 168059, 177655, 146429, 65962, -10281, 25814, 9967, -14956]
9604a4956N983n3127k66O4307Q6299L5892L0566l7086l7280K0341J5128L642k3495
9591I5948l7168k8836O6939j8523M330j8736k1163J5531N13N6422J9278o2089
9579G2446l3819K9549l0503q5028J5520l8472m4499J2294j0417N6201J0873K7429
9567a8426L5784l5568k3790J0318L9821k4722M490Q889L3358n784j7696J6046
9555B2720J01068R889o7973k0455r576k5817M011m3832L0738M3932K9057J2064
9543H5826k6424j02951P756N7690L9444N0306N8336j4820j2536j8960l9611J0899
9531I4955k9893k4086J0952o3026j9398O6012m2417m5207J0027l4910K1447M7275
9519h269L0290K8178L5364k3760k1383N2997M761n728O104L8457m0268k8564K6899
$$ y = [-14956, -8973, -62100, -62366, 1941, 88240, 124132, 154698, 117612, 80332, 100673, 115801, 119443, 95948, 58780, 29944, 96883, 78360, 82690, 63954, 42791, 58322, 58835, 115257, 134535, 72446, 38627, 68176, 37673, -47355, -31835, -70307, -114806, -102512, -112929, -56728, -45855, -18426, 17358, -18210, -42000, -31682, 8139, -16583, -12093, -3204, 30154, 24370, 6674, 22720, 123788, 133677, 65704, 45249, 35673, 9856, 13867, -29965, 773, 44705, 73762, 85826, 59402, -43549, -35793, 21897, 61341, 111647, 169983, 155163, 142627, 123667, 84056, 94955, 65062, 40976, 51928, -11098, -30496, 35516, -6901, -52108, -42081, -76991, -55544, -8269, 22021, 50199, 85563, 61803, 40420, 93417, 98178, 92450, 98554, 137011, 96743, 68179, 95078]
9506I5078K2819N674q2920q0736J9903P2372N3748m0389N4833J4057O3750J8562
9494B16751k9811L1172j4681J4143n3569N069L9459l8525p6679M168L3247Q8N3015
9481A83847l244j660M9014K8129o1506m1806k1498k9131k8919n6830J8662m232
9469C0826l068Q4636m6388n5970k1929k6780q177m7524L4358O4552k2631q416
9457b6511K8973L9914J15089Q0789l0046p3999k7280J547k4002l7348j5297P4980
9445A06809j37m9486Q591o097m0033M9017K5311p0492p6784N9632k1943l0603
9433d6215m4563O272N9274m998m9098r849K3514l982l9710J16194R7785J5091
9421A19715L2440k7633k8334j8743J7215j08934m0267O7042K27l0480k4958m741
$$ y = [95078, 117897, 123571, 40651, -40085, -20182, 52190, 105938, 65549, 120382, 134439, 198189, 216751, 186940, 218112, 203431, 217574, 164005, 169074, 208533, 170008, 93329, 97497, 130744, 130832, 183847, 180603, 178943, 227957, 256086, 194580, 152774, 131276, 102145, 73226, 16396, 35058, 30826, 27758, 112394, 66006, 10036, -11893, -38673, -46850, -94374, -60016, 4536, -18095, -26511, 2462, 42376, 157465, 238254, 208208, 134209, 106929, 108476, 84474, 47126, 31829, 106809, 106672, 57186, 65777, 59680, 19647, 68664, 93975, 23483, -53301, 6331, -15612, -46215, -90778, -84506, -25232, -30230, -79328, -89177, -65663, -69645, -109355, 6839, 104624, 119715, 152155, 124522, 96188, 77445, 94660, -14274, -54541, 12501, 12728, -17752, -42710, -47451]
9409d7451O2496P0438m2615n0538L1566q442m3236r362Q8952l381m150K0863J1591
9396G6731k3150P272K5972q668l3341j1268L5276J3653m281p4697p0811O7493
9384A81K4090M8781N514n7650k2912J9704l4332P7524N0829m8808L3422L0720
9372A27063m194k405k0713O770l5327k8813M2333P1161p749n692L0617l6754p1726
9359F4571o4450r48L0527P037J6937O2962j8109o2164k4204O466p528m0281j7227
9346d6411L5407K9064L9733L8447o0734l8519j2346Q5039M7066n4013m1592N9879
9334H1020K2918n1325j8105M9456J1202l3764n0183m2188l3367k9160O3509O3605
9322C3618O1539k8197k0190p287r68O8560J4250j8578o4246J794K48P7467r662
$$ y = [-47451, 15045, 85483, 42868, -7670, 23896, 15454, -27782, -37144, 51808, 48427, 44277, 65140, 76731, 53581, 60853, 86825, 78157, 44816, 33548, 68824, 82477, 78196, 3499, -67312, 181, 24271, 73052, 78566, 20916, -1996, 17708, -16624, 60900, 111729, 62921, 96343, 127063, 122869, 120464, 99751, 106521, 71194, 42381, 84714, 155875, 148126, 142434, 173051, 136297, 64571, 121, -827, 29700, 36737, 53674, 116636, 98527, 36363, 12159, 18625, 11097, -29184, -46411, -11004, 18060, 57793, 96240, 35506, -3013, -15359, 69680, 116746, 62733, 21141, 81020, 103938, 52613, 34508, 83964, 95166, 61402, 11219, -30969, -64336, -93496, -29987, 33618, 95157, 66960, 46770, 39483, 38515, 107075, 121325, 102747, 38501, 40295, 40543, 118010, 108348]
9309A08348o398l1522p6248O0262j1610m1289j9376l2660L4667L6695m017J2367
9297B9219m1805m1604K5276O4383Q9446n7047l7372K583P001R2490j8375O822
9285A21017M6071m7071J4159p397j9182m2126o7649r37K4900j684j7534M3301
9273D5868r669o082P700J6749l3377k0249K3525j3965N58L5344k6652j955j1791
9260F004j2249R488J1049O342L5093M5572L6224p8102n7285q763K9564M8414m7279
9247B4072L0562J7271L4971m476k637j1221o0266n5667O5620J5225q7399L6633
9235B688K6888j5857l8000K5148K0877j5628K4785Q2122J4472l8840K4069k8711
9223H4013L228m4479l0743K6904J07537J4297o6642j085L2136K1631k4205m0345
$$ y = [108348, 101950, 70428, -5820, 54442, 42832, 1543, -17833, -50493, -15826, 20869, 16852, 29219, -12586, -54190, -28914, 35469, 124915, 67868, 30496, 33079, 40080, 132570, 114195, 121017, 167088, 120017, 134176, 126779, 107597, 65471, -2178, -3115, 21785, 20101, 2567, 45868, 36199, 30117, 37817, 54566, 21189, 940, 24465, 10500, 11058, 46402, 19750, 17795, 6004, -6245, 3243, 14292, 20634, 55727, 101299, 137523, 59421, 2136, -6627, 22937, 71351, 24072, 54634, 71905, 106876, 102400, 99763, 88542, 28276, -27391, 38229, 53454, -33945, 2688, 29576, 13719, -24281, 867, 21744, 6116, 30901, 113023, 127495, 88655, 112724, 84013, 87241, 42762, 12019, 38923, 146460, 160757, 94115, 93030, 125166, 146797, 122592, 82247]
9211H2247K6149K0969k0272k4314m844N607m2065K254p005n8040j6977K5094l0588
9198d1785K5981J3604k0639l9685L5257J00416J06498j2782J6119p84l3479m6007
9186A02714k4565L196K6151M5953o3933l9732J0380q0009j3883K0923j2135M4407
9174A9467n839j9859k8866N202M0691k292J7055N2637R282q783K8406o6158J9771
9161F0714K9612p649L960k2791j4735L2007l7136l8786J8623M288P9289K9995
9149A37391m1534K4041l0487k0937j5411k6092k6883K9772Q268k433L1915k8304
9137C9306J5825K534j7631O775M3957J5140m6006l579L5228J3275l2797k4886
9125D7141j4383p119l4781K1635m4647m6283j5314O5443Q5095m9487n4122M3331
$$ y = [82247, 108396, 129365, 109093, 84779, 79935, 85542, 43477, 45731, 38726, -19314, -36291, -11197, -41785, -15804, -2200, -22839, -62524, -27267, 73149, 179647, 166865, 182984, 182200, 148721, 102714, 78149, 81345, 107496, 153449, 89516, 49784, 60164, -19845, -33728, -12805, -24940, 19467, 13628, -6231, -35097, -29895, 10796, 8504, 25559, 78196, 87478, 78695, 107101, 40943, 60714, 90326, 82677, 86637, 63846, 49111, 81118, 43982, 5196, 23819, 28107, 107396, 137391, 95857, 119898, 89411, 68474, 53063, 26971, 88, 29860, 38128, 35695, 67610, 39306, 55131, 57665, 40034, 46809, 90766, 105906, 59900, 56321, 91549, 104824, 72027, 47141, 32758, 25639, -9142, 12493, -32154, -78437, -93751, -28308, 56787, 7300, -46822, -3491]
9113c491P8225p7328m8345j5734k6595m0477M3013N7575N9826j4193k0315J8740
9101A0901k4836j372L9160J5828j3082p075P59J7983r375k2968m216N5780M213
9088F1700K9732J7604j7951l9578K2978o1400m7505j477N0074j926l1651k1923
9076d1323K2626p290k0321J3004M9104j7702J2518J6251Q806M807J2683L2785
9064H5948o568N663Q68P3K6680o8383r8767m9767L597N3545L2816j15O012K1242
9050A2844l6795o1633L4234R2890J5277k219q481O591K1756o0316m3345k3671
9038e2868J6124l8152J8185N4646L2854j3522m095J9204P771J233r69j9171k2610
9025a370N8358J7290p874o2352q5209J2278L1171l4204j4011L6240K1869K3337
$$ y = [-3491, 74734, -2594, -50939, -66673, -93268, -133745, -90732, -33157, 26669, 12476, -7839, 10901, -13935, -15307, 23853, 39681, 26599, 19524, 20283, 38266, 28891, 5923, 1707, 57487, 61700, 91432, 109036, 91085, 51507, 74485, 13085, -34420, -35897, 14177, 12251, -19400, -41323, -18697, -25987, -46308, -33304, 15800, -1902, 10616, 26867, 35673, 40480, 53163, 85948, 79380, 85043, 85911, 85984, 112664, 44281, -54486, -104253, -100656, -47111, -14295, -14410, -8398, 12844, -23951, -85584, -51350, 41540, 56817, 54598, 46117, 52708, 74464, 14148, -29197, -52868, -36744, -74896, -56711, -2065, 30789, 17267, 13172, 32376, 40147, 41380, 40411, 21240, -1370, 56988, 74278, 66404, 4052, -81157, -68879, -37708, -71912, -85923, -49683, -27814, -4477]
9013d477l510j1241O1020q930k2284k6664Q9614L1581n7953n7603l442j9031k6843
9000e9763L7415K2253k8801P4448N1080L273q30k992J6563O0661k1582m9100l3552
8987F9073J9037l2771n6838o7651o7699M1064K3055L9305l7324R865L2465J2821
8975a5598l4762k2690P0889M5364K7194k082k954J0492k780j3822j4243l4013
8963A0995K9170K3521l0883Q590n3750q3383K3363R1293P5729l436o1722m1952
8951a2465J8586m0265K4355J8228m581O5203N8215O4872q651k3929m272L516j6284
8938A42528l6297r429L0539K1804L5537q2067j34114m7229R684O2147P3153K7096
8926I3352l6934k5472l0315j8955k376p364O839L6596m7834m954P8351K8028k900
$$ y = [-4477, -7987, -19228, 41792, 32862, 10578, -16086, 73528, 105109, 47156, -10447, -13889, -32920, -59763, -22348, -95, -28896, 45552, 96632, 99905, 99075, 96083, 112646, 173307, 151725, 102625, 69073, 88110, 55339, -1499, -69150, -136849, -95785, -72730, -33425, -70749, -60884, -28419, -15598, -50360, -73050, -2161, 43203, 70397, 68315, 65361, 75853, 73073, 59251, 45008, 10995, 40165, 63686, 32803, 41393, -12357, -95740, -72377, 18916, 94645, 91209, 29487, -12465, 6121, -34144, -9789, 8439, 3858, 69061, 127276, 192148, 183497, 159568, 155296, 158812, 142528, 106231, 96802, 127341, 149145, 184682, 102615, -31499, -78728, -69044, -6897, 66256, 93352, 56418, 30946, 631, -18324, -20700, -28064, -21225, 15371, -32463, -37417, 40934, 68962, 66062]
8913F6062N187k4951k2367r833n0714l0414M2868K8270P4422N653j059p1749k1307
8900i932k3118j0377l6495Q162K3781N913L4182L631P8923J1958k2984M158L9778
8887A07580O5732m8069n8260n1220n6629r497r891P627j9813j1151J7082j1695
8875g8204M437K5577j8358l393N1493K3664m3347q4335n1362Q2742M4460J8673
8863b7953L7037k6177l130q4231j6257M1629J6474N2604P2054N9738l730l4820
8851H3238m9749j2140q345m0558n5184m962K3538K0566K9120K2335n1286k0513
8839f3940O3457R722m0395n1566j0026J1062M4454M0129l0223P5545k7701o7257
8827d6739J0512Q4575O6400l4026m7246O2729k9297n0171O519O3344K3485p0630
$$ y = [66062, 71249, 46298, 23931, 14098, -36616, -67030, -24162, 4108, 78530, 84183, 83124, 11375, -9932, -33050, -43427, -79922, -71760, -47979, -42066, -7884, -4253, 74670, 86628, 63644, 67802, 107580, 173312, 125243, 66983, 15763, -40866, -50363, -60254, -52627, -72440, -83591, -66509, -78204, -73767, -48190, -66548, -69941, -18448, 5216, -38131, -122466, -173828, -91086, -46626, -27953, 9084, -17093, -20223, -104454, -120711, -79082, -62608, -10004, 62050, 121788, 118058, 83238, 33489, 21349, 13004, -27554, -82738, -87700, -64162, -43596, -14476, 7859, -43427, -63940, -483, 9239, -31156, -82722, -92748, -81686, -37232, 2897, -27326, 48219, 20518, -46739, -36227, 48348, 114748, 80722, 33476, 96205, 66908, 16737, 23256, 86600, 110085, 39455]
8815C9455l5029L0659l4288m4922k3851P0532J4010o852k9783L778J764k3618
8803c8145J4909j3257M437N7330n2498m2016P504N3274j5607M377k8569K2592
8791b5669M6833K9508n4349J0256L5707L2960l3222p2520k1597R1846Q0932j1111
8779A09574n202n8360R798k2321l5008l058M4901P4396Q837N650n0272k9281j0267
8766C9387j2275l332J1947P7396J9085m6077o9486n670j2920N8792L6595m681
8754H8761o1862j5944M705N444r8948q6688m659L6791R4406N9474n2535o2496
8742i3551k860M3301N0182J0707q1202M923P2950K4204j6924K3824K3665M1043
8730A00262j21l2897n6913M3122O0391O1095n476m1876l6683n810r448k1739k8871
$$ y = [39455, 4426, 35085, 797, -44125, -67976, 2556, 16566, 9714, -20069, -16291, -14527, -38145, -23236, -36493, -32056, 25274, -27224, -69240, -61736, -8462, -24069, -19692, -48261, -25669, 21164, 50672, -3677, 6579, 42286, 75246, 42024, -30496, -52093, 39753, 120685, 109574, 104372, 46012, 55810, 33489, -1519, -4577, 40324, 114720, 123557, 129207, 78935, 49654, 39387, 27112, 23780, 35727, 113123, 132208, 86131, 16645, 10975, -1945, 56847, 93442, 88761, 26899, 10955, 15660, 21104, -77844, -164532, -169191, -132400, -37994, 21480, -31055, -93551, -96411, -53110, -2928, 7779, -73423, -68500, 4450, 28654, 11730, 35554, 59219, 100262, 100141, 67244, 10331, 53453, 113844, 174939, 169463, 127587, 90904, 85094, 75646, 53907, 25036]
8717B5036L3110L5744j8093p1082n1436L1210K3237q2433n0674O3455Q616N749
8705d7561j7714j183K114N1120O18j2350l9196M8099K5904p6028K8583J4654K162
8692b0778N3260L4272Q2030L5504o0474m9874Q051K2014J8774J27119N1494J9491
8680C20883J0190m904n5114q0573m6485l172Q796k3998N5385J4285j16817k5282
8668E3194L9566J4772L6086m189k8353m6405m9845N8194K9235K0809K5755m875
8656A43944k1359n6223o3840j3593P4854J2991q7421j3076N6445K7797N67L4339
8644I5425n3227l5694J10271Q1064l2639k3129j4010J4947M4884p030j4575j8938
8632A47349n9200J2800K6364n3537m4173J6202K9713o173j7938j07036l9975M5001
$$ y = [25036, 58146, 93890, 75797, 4715, -46721, -15511, 7726, -74707, -125381, -61926, -53310, -47561, -65275, -66458, -64344, -13224, -12606, -24956, -64152, -16053, 9851, -66177, -37594, -22940, -20778, 32482, 66754, 148784, 184288, 123814, 73940, 81991, 104005, 122779, 249898, 301392, 320883, 331073, 326169, 271055, 190482, 143997, 140825, 149621, 125623, 181008, 195293, 78476, 53194, 92760, 107532, 143618, 139429, 111076, 64671, 14826, 73020, 102255, 123064, 148819, 143944, 122585, 66362, 2522, -11071, 63783, 76774, -10647, -23723, 32722, 60519, 61086, 95425, 42198, 6504, 116775, 197839, 165200, 142071, 128061, 143008, 187892, 180862, 166287, 147349, 88149, 100949, 127313, 73776, 29603, 45805, 75518, 69345, 51407, -55629, -95604, -50603]
8620e0603K0134O6650j7939P8157O2637o1086r2486j6618O813N8248K4105M0863
8608A18875R234n3623l3089k4023j2330m6223O5507M7528P244N925l4591j1296
8596C9138o360L3202K291m4740k5468L36M6306L8413M7431p8607p1922j1176K560
8583b8596L9713J2867J5046P6330j8674j0553O2786J6618o8575j4922K1829k0256
8571H3613J9273L9062j3064l5992k6461q7816m3288P7989N5666J2611l256K6498
8559A04835M981K2239R6349J7907m0567m171L881j13051j11120N302M1888o607
8547B1866k7654O9865J00493n8230o417k5734q4889l4960N437P3689j3662P728
8535B7532O4620N5824q5246n7596j905j375k6458L7858L099L339N9460L0443o2238
$$ y = [-50603, -30469, 36181, 18242, 96399, 159036, 97950, 5464, -11154, -4341, 53907, 78012, 118875, 128109, 74486, 41397, 17374, 5044, -41179, 24328, 71856, 79100, 85025, 50434, 39138, 32778, 65980, 68271, 23531, -1937, -1601, 44705, 83118, 130549, 51942, -19980, -31156, -28596, 11117, 23984, 39030, 115360, 96686, 86133, 148919, 165537, 96962, 82040, 103869, 83613, 102886, 141948, 128884, 92892, 66431, -21385, -64673, 13316, 68982, 81593, 78337, 104835, 109816, 132055, 228404, 246311, 205744, 201573, 205454, 92403, -18717, -13415, 28473, 21866, -5788, 64077, 164570, 106340, 99923, 74189, -10700, -45660, -40223, 33466, 19804, 27532, 92152, 147976, 62730, 5134, 3229, 1854, -24604, 13254, 16353, 19692, 79152, 109595, 47357]
8522D7357n3292M493j3266K2787M4143k2621m190j5900q72J1928L6815q4245l2487
8509e9350N9605L4102l7466n5853N6571r941j30607n7131M0039O5639J9847j6521
8497i1066J0039J8677N6381J9061K7763K4078K1455n7248l6213K2574N843q278
8485A3066O953j8081P5350O5178k5088j38514o0547P8805L3460K167L4740M506
8473G1995l2581k5350j4635o167N604Q8523R084n1337j0327l8994n5162k8896
8461h8243j2965q222M9282L7132P534p897L3683Q9224J6294J2221m4288n5024
8449B8731o9068j2709M3394n6587j3060l4594P6037J19416k6244P034j1964O0542
8437A10928L1247m5210l0682o011l0701n467L4769K1062j0540o836J7906k3583
$$ y = [47357, -5935, -1442, -14708, 8079, 52222, 29601, 25411, 9511, 8639, 20567, 57382, -26863, -59350, 255, 34357, -3109, -58962, -2391, -12332, -142939, -200070, -160031, -94392, -74545, -91066, -81027, -62350, -5969, 13092, 40855, 64933, 86388, 29140, -7073, 15501, 21344, 13066, 20019, 1938, 77288, 142466, 117378, -21136, -81683, -2878, 30582, 32749, 67489, 71995, 39414, 14064, -571, -6738, -1134, 87389, 96473, 45136, 34809, -4185, -59347, -88243, -101208, -109430, -60148, -23016, -15482, -23379, 10304, 99528, 115822, 128043, 83755, 28731, -40337, -53046, -9652, -66239, -79299, -113893, -37856, 81560, 55316, 62350, 50386, 110928, 142175, 96965, 66283, 60272, 29571, 24104, 58873, 79935, 69395, 62559, 80465, 56882]
8425E6882k279M696Q341k5353J8199J2407L7624k0879m8322N0721K9100j0789
8413A10348l071J3688r181l1821k9237K5239m1596j4468K3199J435R535k9582
8401B4488n3852p068l055Q8145j0755p2893K5195O291p493m4499M3369M4725l3132
8388e34J0949K2061j8764N453P8014L2326K0882p8648k4277L3410R5630K979n9292
8375A20189n5364J1093k5899o8368k2864K9343O8270N4875k4284l1764m3696J6516
8363B8047M8560m0999K3069l2839j9811R410p0022R159M4933L7470P7040M7612
8351A61629P228n6006m7564m7339Q836k2901l9772m3089K6750N3754K0134O0913
8339H2573K026p9094l7788p2050j948N6237p839j4254J8620l6798L6049j923L0254
$$ y = [56882, 54603, 59299, 67640, 42287, 60486, 72893, 110517, 89638, 41316, 92037, 121137, 110348, 107277, 120965, 111784, 79963, 50726, 75965, 34369, 19901, 43100, 44535, 54070, 24488, -29364, -36432, -39487, 48658, 37903, -34990, -9795, -3504, -10997, -55496, -12127, 32598, -534, 10415, 32476, 13712, 19165, 97179, 129505, 150387, 71739, 47462, 80872, 176502, 179481, 120189, 64825, 75918, 50019, -18349, -41213, -11870, 56400, 111275, 86991, 55227, 11531, 28047, 76607, 35608, 58677, 25838, 6027, 15437, -54585, -45426, -493, 36977, 114017, 161629, 168857, 112851, 65287, 17948, 26784, 3883, -35889, -78978, -52228, 1526, 21660, 82573, 84599, 5505, -32283, -104333, -106281, -50044, -57883, -72137, -53517, -90315, -54266, -56189, -25935]
8326b5935M0884L9520J5564o6804l3958N4481p035j4261j2792M6002N0304m9758
8314C6212K7904K9444m3793r5484R468j551j285m502N5112K0057k5625k5904K6128
8301F181J500l9388O6275K953m504K5406L3844k0223J3940J6765o7352l5407j2540
8288a2550k6287K1572k7011k7272R4524R5042k5921P53n2085j3258m6652N898
8276a3247L7223k3466j5856N0908M9578l5466j5160Q0541l0491o7172m2661l4244
8264e9513o5077J2898O2624J9411O916L0025o262j6108L7650m4071o0139m031
8252h5677L0614M1618J13671J1899K4164J3198n0185k0662k7590m7271p5483M8899
8240b2805M7164K8254J8327o0288J3658Q969l9343J1581M821o7879o7252M4345
$$ y = [-25935, 14949, 54469, 70033, 3229, -30729, 23752, 16717, 2456, -10336, 35666, 85970, 36212, 64116, 93560, 49767, -45717, -36249, -37800, -39085, -43587, 11525, 31582, 5957, -19947, 6181, 7681, -31707, 34568, 37521, 33017, 58423, 92267, 72044, 85984, 102749, 35397, -10, -12550, -38837, -17265, -44276, -71548, 22976, 118018, 92097, 92850, 40765, 27507, -19145, -13247, 23976, 510, -15346, 35562, 85140, 49674, 34514, 115055, 84564, 17392, -25269, -59513, -124590, -111692, -49068, -29657, -22741, 7284, 1022, -15086, 22564, -21507, -81646, -85677, -55063, -13445, 100226, 112125, 136289, 149487, 99302, 78640, 51050, 3779, -71704, -22805, 24359, 52613, 70940, 10652, 24310, 33279, -6064, 5517, 10338, -57541, -124793, -80448]
8228h0448K7512N3716J5903m9289k3103O0506k0378j4173K7138o1637q7300O306
8216a45247J2275O6403R2108L0468K584q1161n014K5197P3231P813M0122p3022
8204D5757m6313n4666m576q918K8257k9672N629K7486L1973l7563k0120L0852
8192c1874N8168k1695p7618J0959N0600l3714K5825K7050k5477l4849k9846n6014
8180a38485k0442J25674L8305M4575O3229L7588p4398o1364k4233M9700m742k0300
8168A5107k4206m1322k2260L5178L6588J7619k0730N251J2983j78K9147J6691
8156E9868L9091l1665p7204k9779M2079Q4585o1583k8811k5279K2937l7841N8522
8144A4920O1603q9484q162j4112p6052J2980M1912L4377j561l211J9475l7693
$$ y = [-80448, -52936, 780, 16683, -32606, -55709, 4797, -15581, -29754, -2616, -64253, -151553, -145247, -132972, -66569, 25539, 56007, 58591, -22570, -27584, -2387, 70844, 78657, 118779, 45757, -556, -55222, -59798, -68716, -40459, -70131, -64502, -37016, -5043, -42606, -62726, -31874, 26294, 4599, -73019, -62060, -11460, -45174, -19349, 7701, -17776, -52625, -82471, -138485, -158927, -33253, 5052, 49627, 112856, 150444, 76046, 14682, -9551, 40149, 35407, 15107, -9099, -50421, -72681, -37503, -915, 16704, -4026, 1225, 14208, 14030, 43177, 59868, 98959, 67294, -9910, -39689, 2390, 86975, 25392, -3419, -28698, -5761, -43602, 14920, 76523, -12961, -21123, -35235, -111287, -98307, -56395, -22018, -23579, -26790, -7315, -45008]
8132d5008q1490L6038P5011M514N224K213k8138N845j6810P397M7748J8878N963
8119C7385l601k6136L2444l0942J8652K1629j0052L250n4931k4618K2218r133
8107b3835k7886N2084M984l2633l7143K2028Q832K9450P1137R875l3009L231n7801
8094a0686j01N0457R64K2873n5579J3662K2808n3165l7329j4429P1410J1571L1390
8081E3846M9108j4752N2625j10460m3934L611J8590O6454l0300j3805J5095l4760
8069A1318l1260q500j3723N734k0750J973Q000M38P6201J0221n0827o241J3511
8056c905K7131O775M6008l8581o2463l6606M348k6226n2633L9704L6492k541O7832
8043E335R918J3206l9708R557n2130n1481M3809M0973K1986p9166m4600p233j6960
$$ y = [-45008, -126498, -90460, -15449, -10935, -5711, -3498, -31636, -25791, -42601, -35204, 12544, 31422, 37385, 33784, 7648, 40092, 9150, 27802, 49431, 39379, 42629, -12302, -36920, -14702, -23835, -51721, 363, 5347, -27286, -64429, -42401, -33569, -4119, 67018, 76893, 43884, 47115, -10686, -10787, 39670, 40634, 63507, 7928, 21590, 44398, -8767, -46096, -60525, 10885, 22456, 53846, 102954, 88202, 140827, 30367, -13567, -9956, 8634, 75088, 44788, 30983, 46078, 11318, -19942, -28442, -42165, -36431, -57181, -55208, -47208, -46770, 29431, 39652, -11175, -17416, -3905, 23226, 30001, 76009, 37428, -25035, -61641, -57293, -83519, -136152, -96448, -59956, -62497, 5335, 15253, 28459, -11249, -1692, -53822, -105303, -61494, -20521, 1465, -77701, -122301, -129534, -146494]
8030a46494J9518N7990O0059N9660K6731j1587m4430r0745j3402J6373k4454L4268
8018e6513O2561k2340O249J2109O2269Q703o2387j1807l3146j5857N9186O3487
8006G2514m5261o2666l0953k8237R2860O1193n5756M6241J6963l1999K3527J2504
7994G0930O265N8590R168p1106o3461J3098M4534j7094n4369k3427N5054J0273
7982C8455n890O033K8210o7631K429m4051M2196L0872L5540k3073J7695m194M489
7969F1080L1252n8088r114n370K251J472m1558l2821p4595k1109K6662N5549P2172
7956G783M4013j7308L4518j9027j0764J7788j13621j253R5985O9338Q522N325
7944A21299l6775r0223p3162L475L9374k125k1441m8637l6557K9943N8233P658
$$ y = [-146494, -126976, -68986, -8927, 50733, 77464, 65877, 21447, -69298, -82700, -66327, -90781, -56513, 6048, -16292, -10043, 2066, 64335, 73038, 10651, -1156, -34302, -50159, 9027, 72514, 27253, -35413, -66366, -94603, -1743, 59450, 3694, 49935, 66898, 34899, 58426, 70930, 77195, 135785, 144953, 73847, 10386, 23484, 68018, 50924, -3445, -26872, 28182, 38455, 32565, 38598, 66808, -823, 1606, -42445, -249, 30623, 66163, 43090, 60785, 56591, 61080, 92332, 34244, 25130, 19760, 22011, 23483, -18075, -50896, -125491, -146600, -119938, -64389, 7783, 51796, 34488, 69006, 49979, 39215, 57003, -56618, -57871, 38114, 107452, 115974, 121299, 84524, -5699, -78861, -75386, -36012, -38137, -59578, -108215, -144772, -114829, -56596, -48938]
7932d8938O3320R9375M4720m0817l375K1575j2744q8908P8560P7390j01533o868
7920H1757L8388K4491j8092m9124o1779P7518K7781j1147l8343n6013L5079R258
7908E9774q1908n8511J7443K8513J2960L3660p6275n5530P0205M0671k6486N003
7896c0481K3976k1483L8319O307O424k6368k1650l7721k0836o2572L7297J28213
7884A9425L8763l2560k3288j4497n5648J1167K3435K418j8443N142L830J1234
7872b9022J975o5686o5673J7654N4783N1611L7636N6784p105r4739j9925j5936
7860g7643K3937N3817L74l0940K2796J0632k98L5889L076n434k8282l5672j2267
7847d0015M3721j9108j0353Q593n15K8510P1813L0312j9730k0739n0836J4963
$$ y = [-48938, 14382, 113757, 158477, 117660, 114285, 135860, 123116, 34208, 112768, 190158, 88625, 81757, 120145, 144636, 126544, 77420, 15641, 93159, 120940, 109793, 71450, 15437, 50516, 59774, -22134, -80645, -63202, -34689, -21729, 11931, -64344, -119874, -49669, -8998, -35484, -30481, -6505, -27988, 10331, 16638, 23062, -3306, -24956, -62677, -83513, -146085, -108788, 19425, 58188, 25628, 2340, -12157, -67805, -56638, -33203, -30785, -49228, -44086, -40256, -29022, -27047, -92733, -158406, -140752, -85969, -34358, 3278, 60062, 52957, -41782, -61707, -77643, -53706, 111, 485, -30455, -7659, 2973, 2675, 38564, 41640, 36206, 7924, -27748, -40015, 3706, -15402, -25755, -17162, -17677, 10833, 82646, 112958, 93228, 72489, 21653, 36616]
7835C6616l5910l8147j8979M9258J29578l6397m8001J2928L256j3984l0752j2113
7823b647n1996O1250J255K0813M5597l0422k3452L429j2011r380o9203p4137L1868
7810a09036M0554j0276j4006o8387N4Q3486K8720j9047R793J1516J1258P389O9422
7797D1440P3628M7070q05j04349l8801k505o2942L2576N6950M7486n9629k3244
7785F875M0007M052j0233p2135r3674l5674j5003M886J3915K0744M3275q087L3373
7772f7679L7437P2723o2059m5795j1797m1035k468j2969O0461N7457k3953j7154
7760e6831K1651K167l0581j9933l0002O7114L79K4719j5296M176P5144N7978K7795
7747A28480n1346J4794n9894l1722j4216m8767K2560R282P947j3584k9022L302
$$ y = [36616, 706, -37441, -56420, -7162, 122416, 86019, 38018, 50946, 54202, 40218, 9466, -2647, -54643, 6607, 7862, 28675, 74272, 43850, 20398, 23827, 11816, 2436, -66767, -140904, -109036, -68482, -78758, -92764, -161151, -161097, -77611, -48891, -67938, -58145, -46629, -35371, -27982, 41440, 115068, 162138, 161333, 56984, 18183, 15678, -47264, -14688, 42262, 89748, 30119, 6875, 46882, 50934, 40701, -31434, -125108, -160782, -175785, -170899, -156984, -136240, -92965, -101052, -67679, -30242, 42481, -19578, -65373, -77170, -118205, -120673, -133642, -73181, -15724, -39677, -56831, -35180, -33013, -63594, -83527, -113529, -46415, -46036, -21317, -36613, -32437, 42707, 100685, 128480, 77134, 91928, 32034, 312, -13904, -62671, -40111, -30829, -22882, -36466, -65488, -62186]
7735f2186L1581j225J06165L2261m2568j3778L5806j2657j496n8007K2943J3077
7723D9916J9477J3715J7655q080k3332K8696l3470p75j7197l4869p61p1942j1845
7710g2812M1791M6603K1931N1456Q3241k3883o6197r078k4943R050p7721r8314
7698a18876l0825O1079K7083L4000j7155m627q1632O2483J7058m399l1204O7934
7686a9081N473Q056l1237o7549j7492M9459M3804j6212K1680L9085L8136R206
7674F3328n1766m8539j3469K9807L2553K1843P2937n6297q7270k9245l7034j8295
7662a21447J3943M5741O1173R0004m4665m2586l3627j2920J0836L3645L1430m812
7650B6715k4050l2621k4795l8493L8583P7996L5288p6921n3419k1324J6111O4398
$$ y = [-62186, -30605, -31830, 74335, 106596, 64028, 50250, 86056, 73399, 71903, 13896, 36839, 49916, 69393, 83108, 100763, 92683, 69351, 98047, 64577, 63802, 46605, 11736, 10975, -60967, -72812, -31021, 15582, 37513, 88969, 172210, 148327, 82130, 73052, 48109, 57159, -20562, -118876, -149701, -88622, -61539, -27539, -44694, -49321, -130953, -68470, -51412, -55811, -87015, -19081, -13608, -5552, -36789, -104338, -121830, -72371, -28567, -44779, -23099, 15986, 54122, 63328, 11562, -36977, -50446, -20639, 11914, 33757, 106694, 50397, -36873, -66118, -103152, -121447, -107504, -61763, -590, 89414, 44749, 2163, -31464, -44384, -33548, 97, 31527, 26715, 2665, -29956, -54751, -93244, -54661, 23335, 58623, -18298, -71717, -93041, -76930, -12532]
7638a2532M5708j3107K1632q5609m3668N4294M504O6164j148l3022M3280K1850
7626F8346L1676J1763j1901m1655p7708m4583j9576l9270K7507J9610K6569k4811
7614g4033L4526M0366K112l6705J1334N787o2668J3206P3861J9841M8500O59o0641
7601A6145j95n5408o9024j1652P410j6551l3495L630P9203Q1997M0868l9486L3052
7588C6494N7852l7697J4944L9069q6873o612L763k061q340j4187p705r183j563
7575b2099j3312Q7068J5457j02317l265O3542Q3791L2263q5985j3137N383l1961
7563A5428l9270k0579m8658L5461P5688K1525n0291k3365J5896j1903J3271J3119
7551c678K7763K3957j26592j02310m3507J4729N1293M1587j3929J4904J3706j3738
$$ y = [-12532, 33176, 20069, 41701, -43908, -87576, -33282, -28778, 37386, 36238, 3216, 46496, 68346, 100022, 111785, 99884, 58229, -19479, -64062, -83638, -122908, -95401, -75791, -49222, -74033, -39507, 859, 2971, -33734, -22400, -16613, -79281, -66075, 7786, 27627, 76127, 76786, 16145, 15950, -39458, -108482, -120134, -112724, -129275, -162770, -159140, -79937, 2060, 42928, 3442, 36494, 94346, 56649, 71593, 110662, 23789, 17177, 20940, 18879, 10539, -3648, -11353, -20536, -22099, -35411, 51657, 67114, -35203, -38468, 25074, 108865, 141128, 55143, 42006, 47389, 15428, -23842, -44421, -93079, -57618, 18070, 39595, -10696, -34061, -18165, -30068, -16797, -3678, 24085, 48042, -78550, -180860, -224367, -209638, -158345, -116758, -130687, -115783, -102077, -115815]
7539a15815O2585J5768J6977j449n5094K6471O1628j5736o0491N3875N9439l0276
7527A7882m9782J8527L3647l564p5796l3556k3503n5208N6943L8752l043J4434
7515f4267L107J9399j1028r127J6835o352J8070j0540k3481l8265o736j3378L6402
7502h9361J772j7705N6906k8886k4013K8508M3605J8460K4007p929m1237o102
7490d1975P4788L4835j4716l4259n8966n5829M7007M3660j8652l1380P4785K6018
7478D5316p6405N3501K5588n85Q172k1967m9457K454m2850o5691l4323j16155
7466b72402n2652P7390J31020N3101P0008r827k0060k7556K3075J4033R9446N792
7454I1368j06618o3511J7715M8329n759J792N0803r369J347k9879n0632j0941
$$ y = [-115815, -53230, -37462, -20485, -21934, -77028, -50557, 11071, -4665, -65156, -11281, 48158, 17882, -31900, -13373, 20274, 16710, -59086, -92642, -116145, -171353, -114410, -75658, -78701, -64267, -61160, -41761, -52789, -61916, -45081, -51433, -33363, -43903, -67384, -105649, -112385, -125763, -89361, -87589, -105294, -48388, -77274, -101287, -72779, -29174, -10714, 13293, 5364, -35873, -41975, 32813, 67648, 52932, 18673, -40293, -96122, -49115, -5455, -24107, -55487, 19298, 45316, -31089, 22412, 48000, 47415, 55587, 33620, -15837, -13383, -56233, -121924, -156247, -272402, -325054, -247664, -116644, -63543, 6465, -3362, -23422, -50978, -27903, -13870, 85576, 91368, -15250, -78761, -61046, -12717, -18476, -16684, 34119, 24750, 26097, -3782, -54414, -65355]
7442f5355K8618L0212L8984M7052o528j3305L6255r2373l23l1936L9843P917m6215
7429b7154m4010m5043n2547R4416L3907k3471l7882m3848L1651k2791k9743J526
7417a64989n783J17532Q0874l0310K127n862l5097m2258j546P220O7954J750N572
7404b816j3235L6029L9483m3204p0825l7992J3248m4787K7448K5458j4160N2550
7392c2803K7648L474l1540J211Q076l0968K5392K9123j03421J4780M6756j1953
7380e4225J9375K4973J2921l0895k1615K444L5291M8292l9217k6617k3337J3991
7368c8619K4141l5374N4269L5533j2427j8151M5103N778n2009k5136j1116M6782
7356A8774j5624k6433K7153J3417j0425l3468o8539L661Q6665L3514m9555o7686
$$ y = [-65355, -36737, -6525, 32459, 79511, 72983, 59678, 95933, 3560, 3237, -28699, 11144, 19061, -27154, -71164, -116207, -168754, -74338, -40431, -63902, -101784, -145632, -113981, -136772, -166515, -164989, -170772, -53240, 27634, -2676, -549, -6411, -41508, -83766, -85312, -78092, -10138, -8388, -2816, -16051, 19978, 59461, 16257, -54568, -92560, -79312, -124099, -96651, -71193, -85353, -32803, -5155, -1681, -33221, -32010, -23934, -54902, -29510, -387, -103808, -89028, -42272, -54225, -34850, -9877, 3044, -27851, -49466, -47022, -11731, 36561, -2656, -29273, -52610, -38619, -14478, -49852, 4417, 39950, 27523, 9372, 54475, 60253, 8244, -16892, -28008, 18774, 3150, -23283, 3870, 17287, 6862, -26606, -95145, -91484, -4819, 28695, -20860, -88546]
7344h8546O2497K4351m1353k4036K3586j0343k3171l7295O659J26571O3743K129
7332H4792k3709n8263j7751M8109k2562l5462o160J3127N5739r50n4588j1102
7320b8780n305k5439m6303K4912N736L1790P3806P875m5416r8784Q114Q1965N9781
7307D3952l3601K0042Q4891J1444l9547n9323j0417J6092o219k2493l7888q566
7295d1633N1823j3067j4604R28k3849q765Q619P467K259K8203m6611J5165L4891
7282H26P11J2046m6682l3692j569J9767N2431M6492K1676K5722L8812q3233k9729
7269B3578Q256p2464k8177M969K0617j914K2735M2359j5480J3917O160L056l880
7256B3732n1539o5065M2633O1596l6962M1014j1330m8302J8229K1499p2406J2374
$$ y = [-88546, -26049, -1698, -43051, -67087, -43501, -53844, -77015, -114310, -107651, 18920, 82663, 84792, 61083, 2820, -14931, 33178, 10616, -24846, -31006, -17879, 37860, 36910, -17678, -28780, -34085, -59524, -105827, -80915, -75179, -43389, 30417, 38292, -7124, -105908, -97794, -15829, 43952, 10351, 30393, 115284, 126728, 87181, 27858, 17441, 33533, 27314, 4821, -33067, -41633, 10190, -2877, -17481, -16553, -40402, -49167, -40548, -33081, -30822, -2619, -49230, -34065, 826, 1537, 13583, -33099, -66791, -68360, -48593, 3838, 50330, 72006, 97728, 136540, 53307, 23578, 31834, -40630, -68807, -63838, -43221, -45135, -22400, 19959, 4479, 18396, 24556, 27612, 23732, -27807, -92872, -50239, 11357, -25605, 15409, 4079, -44223, -25994, -4495, -76901, -64527]
7244f4527l5490J4515M5413j7451m9652m8391K2980N4990M2175P156o7727M0462
7232e5547R5736J9085n8285J2879l0262K4877J8582k1041N233J1344l4539M12
7220a1526J7926l8773L1983k1217n9502l9245K264N6104O3160R370O856J1879
7208B9279k856m6449l9096J2406K9723j2691J0345O9992l3371l0563M238m2399
7196e1442j8999j8422j8316r710p05J0307J3217r771J9330J6896J00030K2464
7184E4879J1067o7887L784k4323K9796L6873k3563Q529K4098j4067j0424K0326
7172D9088K9555l3626n4365K8153L598l8821l9387k9695K634K3858M8789o32K867
7159g984Q5525N7159J0733J130j6626r4525l7709P5065Q574n1221N4455K052o0453
$$ y = [-64527, -100017, -85502, -40089, -57540, -107192, -155583, -132603, -77613, -35438, -28282, -96009, -55547, 40189, 59274, 989, 13868, -16394, 8483, 27065, 6024, 11257, 22601, -11938, -11526, 6400, -32373, -390, -21607, -81109, -120354, -118090, -61986, 1174, 10544, 17400, 29279, 26423, -20026, -59122, -46716, -16993, -29684, -19339, 50653, 17282, -13281, -9043, -51442, -70441, -88863, -107179, -116889, -117594, -107287, -94070, -103841, -84511, -67615, 32415, 54879, 65946, -1941, 1843, -22480, 7316, 44189, 20626, 29155, 53253, 39186, 28762, 49088, 78643, 45017, -9348, 18805, 22403, -16418, -55805, -85500, -82866, -59008, -10219, -10851, -7984, 77541, 134700, 145433, 146563, 129937, 35412, -2297, 72768, 81342, 30121, 84576, 86628, 26175]
7146B6175o4262l2984O01M4511K3869L1250q6005l9040N2221M7181o035p643k2508
7133c2669j0904j1447K2302N6977j5594L9643J1159j0039j6556l7949K0531M4715
7121F0169k0523o6505n77o3847j8506N752J0596O2876m2817K6172N6736N424l340
7108A1610K5485K6500L7181p7097m4061L7344K940k3724l564P638k5462K7443
7096B233j6490l7955N0301N7707M8322M255q783l9543R996r8004j8516J9197j163
7083b8443j792l68M076r8855m6442M1895R4090K6440M090J448P3271n4m7309k1166
7069H81j1912r028m2806j7857k4789j2271N0237k910K9419M0071O214l5037l3893
7056f3681n1944P288K5597n7205l6664N2182J45500R0781j425n3748l7432K0606
$$ y = [26175, -38087, -71071, -70470, -25959, -2090, 29160, -56845, -95885, -43664, 3517, -2518, -10161, -32669, -43573, -55020, -32718, 24259, 8665, 48308, 59467, 49428, 32872, -5077, 15454, 60169, 39646, -26859, -27436, -91283, -109789, -104037, -93441, -30565, -73382, -47210, 9526, 14950, 11610, 37095, 63595, 100776, 23679, -20382, 16962, 19902, -3822, -7386, 252, -25210, 2233, -14257, -52212, -1911, 55796, 104118, 108373, 99590, 60047, 70043, -27961, -46477, -27280, -28443, -30235, -30603, -26527, -125382, -171824, -129929, -35839, -9399, -5309, -3861, 69410, 69356, 22047, 881, -11031, -20059, -62865, -80722, -105511, -117782, -67545, -70455, -41036, -965, 5249, -29788, -63681, -115625, -108337, -82740, -139945, -176609, -124427, 21073, 111854, 110429, 56681, 19249, 39855]
7044C9855Q418r3758O362Q2646Q796L3424M860p6813J606m2167k3902k8001o084
7031h4758J8639O0671m12j5663k8890O6992l0544m8907L1355M4111n3658j2265
7019e3329R225j5153j2389K6190K5352o4468m2045P162K0149k930L0954j239l1973
7006a04494j9809K0637J2943N0794P4419j7853j088j5705M2893m9733n6255p6908
6994a40159L7361R9776J3323M203R879j2719o4717n5376o3636M9865J22441N0854
6982E1095n2205k4254j4440l4300M4543K2911Q821M3544N4087j5570k7907j00303
6970d3978j7252O0437O627L7953J0170R931M4959M632m5710r5229p367K1316l0583
6957d4094M4414K3028r329N716l5493J4980m2052j17482p1124O3335Q3514L2708
$$ y = [39855, 48273, -45485, -39123, 43523, 52319, 85743, 90603, 13790, 15396, -26771, -50673, -78674, -84758, -66119, -5448, -5860, -21523, -50413, 16579, -13965, -62872, -31517, 12594, -41064, -53329, -44104, -59257, -71646, -45456, -20104, -84572, -126617, -119455, -99306, -102236, -71282, -72521, -104494, -124303, -103666, -90723, -39929, 34490, 16637, 15549, -156, 42737, -6996, -63251, -140159, -102798, -3022, 10301, 14504, 24383, 11664, -53053, -108429, -172065, -122200, 241, 51095, -1110, -25364, -39804, -74104, -29561, -6650, 2171, 45715, 99802, 84232, 56325, -43978, -61230, -793, 5834, 43787, 53957, 63888, 108847, 113479, 67769, -27460, -34827, -13511, -44094, 320, 23348, 14019, 19735, -15758, -778, -42830, -160312, -231436, -168101, -84587, -51879]
6945e1879R0980m3487k1151L4943J9214j0716m4619o6731k9100J1008R6676q686
6933b3548n2725j051J5107K5628l405j7756N4800l0921q971p800k4983O0449M7036
6920C1860l1243j02470j326K7485R215K3369J9009M0188K0282J9319N13M1473
6908I7674o142K1084k076l0567r3449m5870M5545j2671j4537K7397L5701J4068
6896C6157p1038m6327K6306J01474K1412l5886j7471L5557j2560q9536o3252M7474
6884f7690O6917k2416k5979M9805p0412k5762L5100l8355m5553j6598j904l8593
6872b01440L3249Q5096O5769k2240l8714r0019J7088M4281R02Q904j7176o0272
6860a74572L3095O6027L1645j58m0561M7694j5292j8720M3615M1367N5989Q5822
$$ y = [-51879, 39101, -4386, -25537, 9406, 28620, 17904, -26715, -93446, -122546, -111538, -14862, -23548, -76273, -77324, -62217, -36589, -39994, -57750, -2950, -33871, -42842, -50642, -75625, -15176, 31860, 617, -101853, -103179, -75694, -66479, -43110, -24101, 16087, 36369, 55688, 56201, 97674, 91532, 112616, 110540, 79973, -13476, -59346, -13801, -26472, -41009, -13612, 22089, 36157, -34881, -81208, -54902, 46572, 67984, 32098, 14627, 50184, 37624, -51912, -115164, -67690, -773, -23189, -49168, 637, -69775, -95537, -60437, -98792, -144345, -160943, -162847, -201440, -168191, -83095, -17326, -39566, -78280, -168299, -151211, -106930, -106028, -97124, -114300, -174572, -141477, -75450, -43805, -43963, -84524, -36830, -52122, -70842, -27227, 14140, 70129, 155951]
6848A55951o1663l6682J2790j8564q1039k9854K240L0131q79J8396O0638k6571
6836B4894J9556Q4471o3192l8618K8939L2813L830O041k7497n0189J7253M7905
6824H6206m6440j20472n6074M7367M6921j19n5767n7382P4463J00779P3776m1187
6812E2071j8629j3001K2699R70o705j9661M1779P9889p112j0471o4305l7423l354
6799A6747l8799m2647m032l7667n256J0080M5967n5289q785N9366j8007k1848
6787a00170M1068M5391J7964m2269o160L9862J8244k4406K3869J8669q7904r1691
6775a47533K1912K7541K9094K2266l7897j4094k5512K259j5670K0492M6631J3821
6763e6690N193m60n4178l3316Q5707L7637J6180p9410k4914Q0476L7276J1853
$$ y = [155951, 94288, 57606, 70396, 51832, -29207, -59061, -56821, -26690, -27569, -9173, 51465, 24894, 44450, 128921, 65729, 27111, 56050, 88863, 92693, 98734, 71237, 21048, 38301, 86206, 39766, -80706, -136780, -89413, -42492, -42611, -98378, -155760, -81297, 19482, 93258, 52071, 33442, 20441, 43140, 44110, 37405, 17744, 59523, 139412, 132300, 121829, 57524, 20101, 16747, -22052, -64699, -68731, -106398, -111654, -101574, -55607, -110896, -119681, -60315, -78322, -100170, -59102, -13711, 4253, -38016, -44176, -4314, 13930, -10476, 13393, 32062, -55842, -147533, -125621, -98080, -68986, -46720, -84617, -98711, -124223, -121964, -137634, -117142, -70511, -56690, -51497, -51957, -106135, -139451, -53744, -16107, 73, -79337, -104251, -23775, 13501, 25354]
6751B5354L8784j25084j22127L6045J27472M131j19k0658J7841O3279j7417q0297
6739e2796m2493N4629P8221O938o0726J7189m7358p3643J3639M7410P781r599
6727f0808N1071O8704j1896l5037l0395K6677J2411M954K8801L4826j3863l7808
6715C7637l8556k5415J5812p337k7961N7881J3524L4271p872j5247J6336k9247
6703B3826r2607o1334L3233L4632o03N0285k7170j0570O7755L5557k2407p3818
6691d3221K5832L3019q446J8178l6776K9758P2185q040l7334p3457n5782q2586
6679a66670J5816J6575L4433R3576k0983J0221O0409K2845j0724q4520o479M588
6667c0913J074J9864l7717k440M7446J9377l714m6594J7326J4907q194O4245j6314
$$ y = [25354, 64138, -60946, -183073, -147028, -19556, -15425, -15544, -36202, -18361, 44918, 27501, -52796, -95289, -40660, 37561, 44499, -16227, 962, -46396, -120039, -106400, -58990, -51209, -60808, -9737, 58967, 47071, 12034, -18361, 8316, 20727, 25681, 54482, 89308, 75445, 37637, -919, -26334, -10522, -17859, -45820, 12061, 25585, 59856, 51984, 36737, 53073, 23826, -68781, -130115, -96882, -62250, -62853, -12568, -39738, -50308, 17447, 53004, 30597, -43221, -17389, 15630, 7184, 25362, -11414, 18344, 90529, 82489, 45155, -28302, -84084, -166670, -150854, -134279, -99846, -6270, -27253, -17032, 43377, 66222, 55498, -29022, -35501, -30913, -29839, -9975, -47692, -50132, -2686, 16691, 12977, -33617, -16291, -1384, -9578, 54667, 38353]
6654C8353m9422q6702K6683k5787n7081r767Q2834J4969P3509O558L3358j5501
6642C2004o5087l1430L8941P4716J8912m0857o3645r3935o7165M6175O6730O4741
6630a9900R0385k9460p1288j8734j6719M3246K6130j6410r841r841n7352p1485
6618a61269K4794K8401l5396L2119P711k7418m3287m1549M6661K7304J6988N654
6606a19287N1744O5241m0796M1305Q8459J4390q6905J413m790m0900k3630M6212
6594g544l362j6887k210j3370L3307J17894L1204l1864l2067m5505N223l1324
6582C495M5651L2274k1111n7759M1666J207l911J8035m6624l3993l8379L5331
6570b4118K1761K8612r275K5385p333j7940k1979R869k270o833n6268l5003L334
$$ y = [38353, -11069, -97771, -71088, -96875, -153956, -163723, -80889, -65920, 7589, 14147, 47505, 32004, -33083, -64513, -25572, 49144, 68056, 27199, -36446, -130381, -197546, -151371, -84641, -19900, 70485, 41025, -30263, -48997, -65716, -22470, 3660, -12750, -22591, -32432, -89784, -161269, -136475, -108074, -143470, -111351, -103640, -131058, -174345, -215894, -169233, -141929, -124941, -119287, -67543, -2302, -43098, -1793, 86666, 101056, 14151, 15564, 10774, -30126, -53756, -7544, -10906, -27793, -30003, -43373, -10066, 107828, 139032, 107168, 75101, 29596, 34819, 3495, 49146, 81420, 60309, 2550, 44216, 45423, 41512, 59547, 12923, -21070, -59449, -24118, -2357, 26255, 16980, 42365, 35032, 17092, -4887, 4982, 2712, -4121, -60389, -95392, -92058]
6557i2058k7475N566N1923l8367K745l8028K5473J0079k5945L0327J9402K0393
6545e5965k1220R629P3237J2278q2502k1119k2424M3803o168J1801q11J5536M0665
6532c260K2388L7145J7352j0447K2318J9788n0874J0906k9084m4452n76j7585
6520b6381R447J0867l6732J8053L2910k8083q149J5720j4587K1792o0678n5472
6508a21293O3226K2282N6683K4992o4250L729R4052P553k0053l3373r782J9740
6496D3506K8960j1824m8463p2138K2766K9002l1406n4232l2824O6071J7758L509
6484c9315p66j991L5285k6933j6959l6506l814r573k3441R4398J4741k137m7491
6471f4502l968L2576l3072M7279N4149k428k4388k3352M0190k0727r400p511j0477
$$ y = [-92058, -119533, -113967, -62044, -100411, -97666, -135694, -110221, -100142, -126087, -95760, -76358, -55965, -77185, -67556, 5681, 17959, -64543, -85662, -108086, -64283, -70451, -58650, -59461, -43925, -3260, 19128, 56273, 73625, 63178, 85496, 105284, 54410, 65316, 36232, -8220, -8796, -26381, -16934, -6067, -42799, -24746, 8164, -19919, -28068, -12348, -26935, -5143, -65821, -121293, -58067, -35785, 20898, 45890, -18360, -14631, 79421, 86974, 66921, 33548, 23766, 43506, 72466, 60642, 12179, -59959, -37193, -8191, -39597, -93829, -126653, -60582, -42824, -39315, -40081, -42072, -6787, -33720, -50679, -87185, -90999, -100572, -124013, -29615, -14874, -17011, -64502, -68470, -35894, -68966, -21687, 32462, 30034, 5646, -17706, 22484, 1757, -7643, -15154, -25631]
6458b5631o4149j4752J2352J2502N3084R794j9423l6336K02M6075K1884l8827
6446d3225n3557j5139O2042M2731k1194p6164m0409M9576L6667K2131K1400k6580
6434d1721N832N427J5515J3499l6293n744l8854q413m4926J111L5728O7779M0807
6421I747l386l7962j9686J070o9091l0784O2829M1707J2047J504M265K4900L7486
6408C4646q7831P042K9582j6509L6107Q93m218q379L7664J5836N885m1737k0889
6395a1908l1258K0276l7765r872M786L7128R824j11219J4325N5509K4509N61L3186
6382a918J3002L7801l4081K7421l9805o2406o397j5266M2673n4037j8211K9812
6370h1412j3484K5273N8634j2115n1816N0422L3229N846R5716l771r8985k9535
$$ y = [-25631, -89780, -104532, -92180, -79678, -26594, -16800, -36223, -72559, -72357, -26282, -4398, -43225, -96782, -111921, -49879, -7148, -28342, -104506, -144915, -95339, -58672, -36541, -15141, -41721, -35889, -30462, -14947, -1448, -37741, -43485, -82339, -90752, -135678, -134567, -98839, -31060, 9747, 6361, -31601, -51287, -50217, -119308, -150092, -87263, -45556, -33509, -32005, -27740, -2840, 34646, -53185, -46143, -16561, -33070, 3037, 3930, -288, -8667, 28997, 44833, 50718, 8981, -11908, -43166, -22890, -60655, -70527, -65741, -28613, -18789, -130008, -115683, -60174, -35665, -35104, -1918, 11084, 48885, 14804, 42225, 2420, -59986, -66383, -81649, -38976, -93013, -111224, -81412, -94896, -69623, -10989, -23104, -74920, -24498, 8731, 14577, 110293, 106522, 7537, -21998]
6358b1998Q276L6888K0397M7452j1972J1945k5380r558p1554o2143L42l3510k3247
6345a34062Q685N0583O2452M7927o1586N648M1691k6692l8660o129k85L2580j9900
6332c7748j6833L9000K0699r9274j16064l933K3068L2312P8411N2200j0795q318
6320d7275K3641L1015J5502K0323k8373r807J0730J8358N719p1760q1233n4273
6308a67433j1406k6929M2216Q1960K9379O7599j8048n1446j2890m2217j913k3854
6296a34982J9650M1413J3752m4015k4784O8560J3842Q205Q4358O340q1540j278
6284c0479J5828o523n045l831k8726o328L3257m973n117K6052M8846m9551k3418
6271d0008M3696j8115m7386n2572M8036M7526o4515K5588j9824K2971o572q2385
$$ y = [-21998, -13722, 23166, 43563, 91015, 79043, 90988, 65608, 56050, -15504, -77647, -77305, -110815, -134062, -125377, -74794, -12342, 35585, -26001, -20353, 21338, -5354, -44014, -50143, -50428, -17848, -37748, -54581, -15581, 5118, -94156, -210220, -214153, -191085, -158773, -80362, -28162, -38957, -47275, -23634, 7381, 22883, 43206, 14833, 5026, 15756, 34114, 39833, -31927, -113160, -167433, -178839, -205768, -163552, -81592, -52213, 15386, -2662, -54108, -66998, -109215, -111128, -134982, -115332, -73919, -60167, -104182, -128966, -60406, -46564, -38359, 45999, 52339, -29201, -30479, -14651, -21174, -26219, -30050, -58776, -65104, -31847, -36820, -41937, -15885, 32961, -16590, -40008, 3688, -14427, -61813, -114385, -66349, -18823, -83338, -57750, -77574, -54603, -61175, -143560]
6259a43560j7037L6595J2054N8561N4441Q09M0678L8845l7563k7404l2358m7387
6247f3326j0741K0424O6086o929o9115n6520K829M5805j5121M4872P948L2073
6235a715p2L5139L7354m1328m4823m9370P7198N4151L1851p9338Q48n9916n2580
6222i2601k7085M1591M9896l4453o2683n6631P1745R3536M3454n0734M6274k4159
6210a850o8156j4534P0336q596O717M3108l7658o0033R183N5977K4578K2375m0265
6197A182M6372O1801n4719m8507k5697q201p924r398l6621K3454O3106k4256j2056
6184c1464N6932p26K4837N8907l3397o9037M784m593L5693j8107m3247M370j2953
6171b8001N959k3472l1035j4091j2594J7380N1467M0949l3508M187N3276K6566
$$ y = [-143560, -160597, -124002, -111948, -53387, 1054, 1863, 42541, 81386, 43823, 16419, -15939, -63326, -74067, -53643, 12443, 5514, -63601, -120121, -117292, -71487, -86608, -41736, -33788, -1715, -1787, 33352, 70706, 29378, -15445, -64815, 12383, 66534, 98385, 19047, 19895, -40021, -92601, -119686, -78095, -28199, -62652, -125335, -181966, -110221, -16685, 26769, -23965, 22309, -1850, -70006, -84540, -14204, -22800, -16083, 27025, -10633, -70666, -61483, -5506, 19072, 41447, 1182, 47554, 109355, 54636, 6129, -19568, -27769, -35693, -45091, -81712, -58258, 4848, -19408, -31464, 25468, 24742, 49579, 108486, 75089, 6052, 10836, 6243, 41936, 23829, -19418, -15048, -28001, -22042, -45514, -76549, -90640, -103234, -85854, -34387, 6562, -26946, -22759, 30517, 57083]
6159E7083r426q1720M5024L9629l9213o2667j7719O1056j7282l5921j5201k7577
6147a03934K9628K2538J6455r350n0279l2260K7572k7897n949M950K410P3236
6135e2880P6389J6342O005P76m7628j6550k1574R044l167P658m066M360K5172
6122a19j4989L6687L8906K1595k1467J0268J1755l1287l7049k7121j6908l0499
6110f0228r4131j940K2165L4756N5298J1476k5719O5888L9900j7353n0451L2402
6098A2063R0889o5645o0821n396j9682O4843o433n7896m3565k1338j008M5151
6086f8838M7042L4726k2161j6133P162n5265j045L5595j9561N1437J14587j6352
6074I1194q1343k785n7576M4448R0130n5954n8235J2159O580j332J1383K808p2613
$$ y = [57083, 47657, -34063, 10961, 50590, 11377, -51290, -69009, -7953, -25235, -61156, -76357, -103934, -74306, -51768, -35313, -44663, -94942, -127202, -99630, -127527, -133476, -128526, -126116, -52880, 23509, 39851, 45856, 46632, -996, -17546, -39120, -30076, -33243, -25585, -29651, -25291, -119, -15108, 21579, 60485, 82080, 60613, 70881, 82636, 51349, 14300, -12821, -29729, -60228, -154359, -156299, -134134, -99378, -44080, -32604, -58323, 7565, 47465, 30112, -20339, 12063, 102952, 37307, -23514, -28910, -48592, 16251, 9818, -48078, -91643, -112981, -113989, -68838, -21796, 12930, -9231, -25364, -18202, -73467, -74512, -38917, -58478, -7041, 107546, 91194, 9851, 7066, -50510, -6062, 84068, 28114, -30121, -17962, -11382, -12714, -1331, 1477, -71136]
6061g1136n4629n007O7878N1840Q032K6489k7225l3733l255k9141p759O9907M9990
6048D2251j6426p7195j8606p651J8460k3794O2119O8513L8209J2090o5717k2110
6036A0143p8025l1227O311L430L1953O4946N5439M5081j8240o9366k6105K3n6568
6023f2205L1053J03509j677k9462m842k9053n1206j1441k097j7176L9835j847
6011c6609l3513j5058L0566J06537L3320l8731q8049P221N5433K3436m7707n4980
5999e8134j0680K3339N1702J5822m3733n783J9644J2677l8481r1752n9981O0108
5987a25252Q4098k0781j0411J03102J5804o1579k1790j5364P692Q4064J0927p2127
5975b1617k8301j2142O3203L610J6860q441n8055k3254K2445J22713N6242j408
$$ y = [-71136, -125765, -130772, -62894, -11054, -3022, 23467, -3758, -37491, -40746, -69887, -77646, -7739, 42251, 25825, -51370, -69976, -77627, -59167, -82961, -20842, 47671, 85880, 97970, 32253, 10143, -67882, -99109, -92798, -89368, -57415, 7531, 62970, 108051, 89811, 20445, -5660, -5637, -62205, -31152, 72357, 70680, 41218, 36376, 7323, -43883, -55324, -57421, -74597, -34762, -36609, -70122, -85180, -54614, 51923, 85243, 46512, -41537, -34316, 21117, 44553, -3154, -58134, -68814, -45475, 6227, 22049, -21684, -27467, -7823, 4854, -33627, -125379, -185360, -125252, -41154, -61935, -72346, 30756, 46560, -15019, -36809, -52173, -44481, 39583, 50510, -21617, -49918, -62060, 1143, 4753, 21613, 13172, -44883, -68137, -45692, 77021, 133263, 131855]
5963A31855L1746o5715n5997o9200N285K0626Q946P154l2561l1824n819N973M3644
5950e887L5938P718m8300o1771O236J744m7121J8935P8632O250l5394K828k5871
5937f6063k6919K4515J9412l2653k0102P4317N857m1762j0446N8812o3936j8087
5925i7055M0631J3974J3797q022L5523m3826r438M4932K0292J7182p979k2208
5913b197K3825j5007m063r1389K5216J2709l5045k4742p401P9634P3499p425N8797
5900H6411O5934q8164j16965k6369k4868K6790M8238l78M921n2002k9908m2929
5888a49289N5416N8358N3168N8641j7867k1299k1907n2079M182j3830K1242Q8084
5876F2820J5474p2196r2418m3337k7896k1169K071Q0888K3746M2672M2952j6463
$$ y = [131855, 163601, 97886, 41889, -27311, -22026, -1400, 7546, 14700, -17861, -49685, -55504, -49531, -5887, 30051, 37769, -10531, -72302, -66066, -64322, -111443, -92508, -13876, -7626, -43020, -40192, -66063, -92982, -68467, -49055, -81708, -101810, -27493, -21636, -63398, -73844, -15032, -78968, -97055, -56424, -42450, -28653, -36675, -1152, -44978, -54416, -9484, 10808, 27990, 20011, -2197, 21628, 6621, 2558, -88831, -63615, -50906, -85951, -110693, -118094, -38460, 35039, 27614, 86411, 152345, 64181, -52784, -79153, -104021, -77231, -28993, -29371, -24450, -76452, -106360, -149289, -93873, -35515, 17653, 76294, 58427, 37128, 15221, -36858, -32676, -46506, -25264, 62820, 78294, 6098, -86320, -129657, -157553, -178722, -176651, -95763, -72017, -29345, 13607, -2856]
5864b856p6603o603j6508m0122L8042M2466J2519L1712j8142l674o667o9661n9423
5851a75520l6154O0817N4463j7675J6517j4261L0846M3820o168Q4017L3009k6298
5839D7413j6374n9737l2094q5219j8337J13928O9674L9491n7096p0702q0650q524
5827a58227M054r114K5193L1079M7143O1808m4878J891j6283k6223j4255J134
5815i6678L9315J3829O269j8385k7656O9383K6271k7431o2782o7640j3901R5118
5803f4288K1934L7835O851l7087J3845L3180L6404J961K8195j0793J2422k912
5791G7547l8728M2314M3068k8142k7349J146p6079k7407J1351M6772K577J0629
5779C7699m3976j3925N7167n1351m9809l2123j3823n111O1486L453J76N0336Q748
$$ y = [-2856, -79459, -86062, -102570, -142692, -104650, -62184, -49665, -17953, -36095, -39769, -46436, -116097, -175520, -211674, -150857, -96394, -114069, -97552, -111813, -80967, -37147, -43315, 40702, 73711, 47413, 31039, -28698, -60792, -146011, -164348, -50420, 19254, 58745, 1649, -69053, -149703, -158227, -154173, -163287, -138094, -107015, -59872, 1936, -42942, -41051, -57334, -83557, -97812, -96678, -57363, -43534, -37265, -55650, -83306, -13923, 12348, -15083, -77865, -145505, -159406, -64288, -42354, -4519, 2332, -34755, -20910, 12270, 48674, 50635, 78830, 68037, 80459, 77547, 38819, 81133, 124201, 96059, 68710, 69856, -6223, -33630, -22279, 24493, 27070, 37699, -6277, -20202, 36965, -14386, -64195, -96318, -110141, -115252, -53766, -50313, -50137, 199, 8947]
5766H947p380p9535q2887N1517O3994M0670p594J210j3392l1408m4061m584L129
5753a01374j2954p599o9775L2481Q0083P2953q104M9661J5630k1767P577J5008
5741E1820l0198p7037n8602o6595J06287J04640m6184p3377n39J2628k903l9730
5729a19790P0523J4632n4428j8442p312m519O0387K7127m1348K8654q0667l9750
5717a64933p614N2909M4261j2064o0329K344K4255O0494K0564J6249p111j077
5705c2052K005l4144n7352o736R71N0224L1710K6148M3146N9468j0467L7361m9245
5692F1037l9848K2689N4378K9458m7684K5615j5734k5083k7361P890M2440K2158
5680A09955p3611j3767K2995n9336L816J5136n2990K7764n3368m0577L3330q800
$$ y = [8947, 1567, -77968, -160855, -109338, -45344, -4674, -12268, -11058, -24450, -55858, -99919, -104503, -101374, -114328, -121927, -191702, -159221, -79138, -6185, -14289, 35372, 51002, 29235, 36812, 51820, 21622, -55415, -114017, -180612, -74325, 30315, -15869, -89246, -89785, -77157, -80060, -119790, -49267, -34635, -89063, -107505, -114817, -119336, -58949, -31822, -73170, -44516, -125183, -164933, -172547, -119638, -75377, -87441, -147770, -145426, -121171, -60677, -40113, -23864, -30975, -32052, -30047, -64191, -121543, -128279, -127308, -77084, -45374, -19226, 23920, 83388, 72921, 110282, 61037, 21189, 43878, 98256, 127714, 80030, 105645, 89911, 64828, 37467, 45357, 87797, 109955, 36344, 22577, 45572, -13764, -9948, 5188, -47802, -20038, -73406, -113983, -80653, -89453]
5668h9453K8342L6345K1440j5224J9601R7121O400k3063p5839m1077J1741K1075
5656b591j8746m5761m2438j8962L7908P2650J464j16641O5761N0730n6272j3816
5644h6714j9609J8281p69K0882N6032p779j2646k0009J3309M3280O6809M9169
5632A20236L935o2118m27k5219j0255k7413o316K6950J8253m5816n2107L6279
5620b4018j7439K9823j3734m6427K346N8474M5711l211n357M379n0183j3529L2984
5607a81J1773J6719l5173M547L4632P34m3399N735O8854k5055k6720j0577j5100
5594a3211J3963r4666N2178O9827J8554K7270l3877o549o6129j6434M3127N9212
5582E3265k4566K7016L5795p6159k7439K0347R392r809r923k6673M9094J4975
$$ y = [-89453, -61111, -24766, -3326, -18550, 1051, 98172, 104572, 81509, 5670, -35407, -23666, -2591, -21337, -67098, -109536, -128498, -90590, -17940, -16476, -133117, -67356, -16626, -72898, -86714, -106323, -88042, -88811, -67929, -11897, -19676, -32322, -52331, -39022, 4258, 71067, 120236, 124171, 62053, 61626, 36407, 26152, -1261, -7577, 19373, 37626, -8190, -60297, -24018, -41457, -11634, -25368, -71795, -69449, -10975, 34736, 31525, 26168, 30547, -19636, -33165, -181, 11592, 28311, -6862, -2315, 32317, 33051, -10348, -4613, 64241, 39186, 12466, 1889, -13211, 752, -93914, -41736, 28091, 46645, 73915, 40038, 33489, -32640, -49074, -5947, 53265, 28699, 55715, 91510, 15351, -12088, 8259, 17651, 7842, -2081, -28754, 20340, 35315]
5570C5315N4703k4163L4364l6850j03995k4854O0864p897l0322N74R1703J5465
5558F4907o6663L0551j20453j2603O4120j858q0861l1901J310j6095M8370P3119
5546d8057O6963R8394n4880L737j8063K0576L4389O5946k4982o8252m9580j3135
5534A3056O0203J308m144n2739j3420M116o8057n9639m248L9755J4920Q2251P2512
5521H5874K7601k4600n8143l0098l2847p0508L2463K1419m7383J3421J0688L3784
5509c8329j3244l1551k0576L1452L0237j0461M0241N277l4689k5138l5676O3801
5497c8656M6889l2964Q373l311L7129p0258l5432k6157J1922O734K2321R685K4601
5484c9124l469j2892L3802L2040k3624k5173M492L0147N0117o0826k9131l2105
$$ y = [35315, 90018, 65855, 100219, 63369, -40626, -65480, -4616, -12513, -42835, -42261, 49442, 64907, -1756, 28795, -91658, -104261, -40141, -41999, -122860, -154761, -153451, -169546, -121176, -48057, 18906, 117300, 62420, 66157, 48094, 68670, 103059, 169005, 144023, 75771, 26191, 13056, 73259, 74567, 70423, 17684, 4264, 8380, -59677, -119316, -123564, -83809, -68889, 13362, 85874, 113475, 88875, 30732, 634, -32213, -102721, -70258, -48839, -96222, -82801, -72113, -38329, -51573, -83124, -103700, -72248, -42011, -52472, -12231, -6954, -41643, -66781, -102457, -38656, 8233, -24731, -16358, -19669, 17460, -52798, -88230, -114387, -102465, -95731, -73410, -63725, -39124, -42593, -55485, -21683, 10357, -13267, -38440, -33948, -3801, 46316, -14510, -43641, -75746]
5472g5746R036k71K7431L7750k6923k9823n146J7878P7962l4091p1597j00383
5460a73923l4002K7095L7495J2322L7670K1390J43L6485K415l3531n3730N3318
5448f6853N5854L9684L9790n9680L3701O2415O1601M4828o9014p4404n9081j1343
5436b502n4229K0359K1724l701j5099j4227M3197K8200K7696r0529j0153N1736
5424B472K2951J087J2846j4971p6026j1840q832O6483M7902Q388o2274l5061n250
5411e2125O3611M5476l2949K8622j5257k0343m781J904j2434K5882N7005o9449
5399A5162p4627j3998M8031K0492k4553K1476M204J3464m211n8528p3503O0511
5387f6080P0559j528l4081O4112J2665o564K0711r4753j6756N6446m3209m3084
$$ y = [-75746, -66710, -66981, -39550, -1800, -28723, -58546, -63692, -45814, 32148, -1943, -73540, -173923, -207925, -180830, -143335, -131013, -93343, -71953, -71810, -35325, -32910, -66441, -120171, -66853, -10999, 28685, 68475, 8795, 42496, 104911, 166512, 211340, 142326, 67922, 8841, -2502, -56731, -36372, -14648, -18349, -33448, -47675, -4478, 23722, 51418, -39111, -49264, 2472, 25423, 26510, 39356, 24385, -51641, -63481, -72313, -5830, 42072, 50460, -11814, -46875, -52125, 11486, 56962, 24013, 52635, 37378, 17035, 12254, 14158, 1724, 27606, 84611, 15162, -59465, -73463, -25432, -4940, -29493, -8017, -3813, 9651, 5440, -53088, -126591, -66080, 4479, 2951, -31130, 32982, 45647, 39083, 59794, -34959, -51715, 4731, -38478, -81562]
5375h1562l4513M3887K2826o753J725p9681l6903L668M0129K1979O9870J6267
5363a9061J6460O6638O552P6170M6931p3917o6303l8681m0470j08961m8032j2572
5351a95246J05334N7224J5326j4801l3058j6137P9859l7213n0294L0965Q8116
5340C0075M6575m9301p2545m8785k9073J252j6606l4231O6536J653l4721N7733
5328h1438J16814R5402K8223o3002p2232m8933j6721J1446M4654k5036n9351N9987
5316a0187J09189K9054l1405j2288j1998k8879J1808L4795l4235n8523j3508r46
5304a7123j8974m4712j5825O6322l0976j1012N4210K8276m9334K3889J712k1267
5292c4814L3026L9724L4366r166J874K3460L2107J7382J755l1504n1359n5052
$$ y = [-81562, -116075, -72188, -49362, -56115, -54390, -134071, -170974, -167306, -127177, -105198, -35328, -19061, -2601, 64037, 70589, 146759, 193690, 119773, 53470, 14789, -25681, -134642, -182674, -195246, -89912, -32688, -17362, -32163, -65221, -81358, -1499, -38712, -89006, -58041, 30075, 76650, 27349, -45196, -93981, -123054, -121802, -138408, -172639, -106103, -104450, -139171, -81438, 35376, 130778, 159001, 95999, 23767, -25166, -41887, -30441, 14213, -10823, -70174, -10187, 99002, 128056, 96651, 84363, 72365, 43486, 55294, 90089, 55854, -2669, -16177, -17123, -36097, -80809, -96634, -30312, -61288, -72300, -18090, 10186, -39148, -15259, -13547, -34814, -1788, 37936, 72302, 63136, 65010, 88470, 120577, 137959, 139714, 108210, 56851, 1799]
5280A799q0125J7359J6290j8217l9130l4633N997L763L6428K7931K9344Q02o2908
5267i5300R000m1775N299R3053M2732L1127Q0043L3382l0105q440n3517k9824
5255C5675Q1322k165m7238n0052p4033K0922K3785j5776l2599j3625K2370J14941
5243F3527j9390o6703L7746j0282R758K7873m5263j8120P98k330J2410j7322J2364
5230a4934l8538N440K614K4635Q426L2361q166o4314l0088J6922K5015n1760m056
5217i6443l0962l3349Q754k1198o700K1932L2452L6398M2990L9369K8869k3097
5205i85m19o1858j7116J3495J6842L0415J3778J7301P4984j2688o000M2046Q657
5192A18452n2543m5082J8774J0519K253o2513L6309j0907M2186m8736m5324K158
$$ y = [1799, -78326, -60967, -44677, -62894, -102024, -136657, -130660, -126897, -90469, -62538, -33194, -32392, -95300, -86300, -128075, -122776, -29723, 13009, 44136, 124179, 157561, 127456, 119016, 65499, 35675, 116997, 114832, 67594, 17542, -56491, -35569, -11784, -27560, -60159, -73784, -51414, 63527, 44137, -22566, 15180, 4898, 14656, 42529, -2734, -20854, -20056, -22386, -9976, -27298, -14934, -53472, -48032, -45418, -20783, -12357, 20004, 11838, -52476, -82564, -65642, -40627, -92387, -96443, -127405, -160754, -152000, -173198, -179898, -157966, -125514, -89116, -46126, -6757, 22112, -985, -1404, -63262, -80378, -66883, -50041, -19626, -5848, 11453, 86437, 73749, 67749, 109795, 118452, 65909, 20827, 39601, 50120, 52373, -10140, 26169, 15262, 57448, 8712, -36612, -34454]
5180c4454J0932m8365J7623M8156K8973L5351l3480j5491L9272j9838n6160k4586
5168e2067k4096l9710P334N2029K4384L7862K1563L5473J02727Q7m2013p1653
5156E1920m9219K8999p647K447J9977M1007j5583k8826N134K3758l0715o2988
5144b1736J6683N1969M5193o2869n1968J2296l8895k7492O4727M8390n1509l2584
5132d7795K6363j2690K0704l5682r733l3218l859K6063l0375Q5319Q5958K1507
5120I2562J3160m1357n1316n888j2003J3034l6028j06979J8944M3590J8244N1321
5108b716K573J4308J6126o0356n7517O1896p0798l9188O4662M4955j3321j26480
5096a65856k5961Q4500L4535n432n8217M0673M0243N635p8997j8481Q0199J05513
$$ y = [-34454, -23522, -71887, -54264, -6108, 22865, 58216, 24736, 9245, 48517, 28679, -27481, -52067, -76163, -115873, -108539, -56510, -32126, 5736, 27299, 62772, 165499, 165586, 123573, 51920, 2701, 31700, 24053, 26500, 46477, 87484, 71901, 43075, 48209, 71967, 41252, -21736, -5053, 46916, 92109, 29240, -22728, -10432, -49327, -76819, -12092, 36298, -15211, -47795, -21432, -34122, -13418, -49100, -58833, -92051, -95910, -69847, -100222, -14903, 71055, 92562, 105722, 64365, 13049, 7161, -4842, 8192, -27836, -134815, -115871, -72281, -54037, -2716, -143, 14165, 30291, -30065, -87582, -25686, -96484, -135672, -71010, -26055, -39376, -165856, -191817, -107317, -72782, -78214, -136431, -95758, -55515, -49880, -128877, -147358, -67159, 38354]
5084C8354k2806j5250M5410k611o0790n455J9920K1670l0287O1687K2184k3481
5072D8545j2885k5011K4892K2932N9628l7943q1387n1492o8040J6288j9284N1475
5060g2282M6892K5407k9K2486q931k5959j552L2428j3061m0289L2008k1762L1006
5047F362m6217L7342N1226m3497m7484N771j741q625l8704o3830L8036L0311O405
5034g4645J9006m3147o6980r392L229L4493M7932K4875J1109j1256O496L6148
5022b2132J8486p5162m6624L2587q583N5616m946p0486j3385M3287N2839R1770
5010E3267J0428J5123L2944J066p1706r8363n8573j586K1905o7715o758K0616
4998a49352L0400M8615K5164R0722k7042P093M2651L613n3767l0695l5837j5086
$$ y = [38354, 15548, 298, 45708, 43097, -17693, -23148, -3228, 18442, -11845, 49842, 72026, 48545, 35660, 10649, 35541, 58473, 118101, 80158, -1229, -52721, -120761, -104473, -123757, -72282, -25390, 17, -12, 22474, 13543, -12416, -13968, 18460, 5399, -34890, -2882, -24644, 6362, -39855, -2513, 48713, 5216, -42268, -36497, -38238, -46863, -85567, -149397, -111361, -81050, -74645, -55639, -98786, -165766, -175158, -171929, -137436, -89504, -64629, -53520, -64776, -58280, -22132, -3646, -78808, -125432, -92845, -101428, -45812, -50758, -121244, -134629, -91342, -38503, 53267, 63695, 78818, 111762, 112828, 41122, -57241, -115814, -117400, -95495, -163210, -169968, -149352, -118952, -70337, -45173, 45549, 18507, 25600, 68251, 71864, 18097, -12598, -48435, -63521]
4986f3521Q2875N6451K614n4198l7100N3013J9434j8544q440p2235K5828J3151
4974f72j0229j9875K6184j5930l3072M0858N544n529K2392J9617K6882J9503l7292
4961C8381j2602l7390j2374j1560k0273K7743m387L157L2907L0704k4245r7132
4949h7071N722L1916J632j2447P660K368M5424L533l7709M2056k7155K2835J154
4936h2k0553J7920N0124o2992N524N4161j0044k7378M9852R399k5397N6663L5451
4923A32648o907k3223k8524q5533k7690N199j7310k7M1755m743J2546L1451J8724
4910D8366Q797k2175n2310L6154J296K2910K688P193l2995p1075q8162J0180L8364
4897i0769K4408K1440r9001N2863R9269Q3872k596l1322k1153n581k4832n867
$$ y = [-63521, 19354, 75805, 78419, 24221, -12879, 40134, 59568, 41024, 32584, -39651, -13823, -672, -10901, -30776, -4592, -20522, -53594, -12736, -7192, -12721, 9671, 29288, 56170, 75673, 38381, 25779, -11611, -23985, -35545, -55818, -28075, -32462, -29305, 3602, 34306, 10061, -87071, -81349, -49433, -47801, -60248, -52588, -50220, -4796, -1263, -38972, 3084, -24071, -1236, -82, -20635, -2715, 47409, -15583, -10059, 44102, 34058, 6680, 56532, 65931, 40534, 97197, 132648, 125741, 102518, 73994, -11539, -39229, -34030, -51340, -51367, -9612, -14355, -1809, 29642, 48366, 57163, 34988, -17322, 18832, 20128, 43038, 45726, 52919, 19924, -51151, -139313, -129133, -90769, -66361, -44921, -143922, -91059, 8210, 92082, 89486, 58164, 37011, 31430, 6598, 731]
4885G31k7263J2938l1977l6248l5390l5027j042L0936L2135L3835k0583O3496
4873a3459O2667k8536o5716l6691M0528j6082k0817K5928M4313P2456M1580r679
4861I6492o6571j3796K9528l6349n8898N1188j4315M9162J5031n476l9318r2226
4849h5548k6697M2764q6384J4001K3416O5949K9934n2179P226M3748K0202o3626
4837f7194J6302J210K5823L9332P4868m2525o7945n1436O68L8357l7819M3740
4825b6619L711m7914J263L2503N026k9415M724O9878M0970o4626p4964L7429J6799
4812c1235j9803L6872j0216K4247o362J75K3404j659J6812J8597o572J4110l6247
4799B2123M899L5920k8338j5577k2791m5684O0616N3580l6414j7708K5476j9974
$$ y = [731, -26532, -13594, -45571, -81819, -117209, -152236, -153278, -122342, -90207, -56372, -76955, -13459, 49208, 20672, -45044, -81735, -41207, -57289, -78106, -52178, -7865, 64591, 106171, 96492, 29921, 16125, 45653, 9304, -49594, 1594, -12721, 36441, 51472, 45996, 6678, -85548, -112245, -69481, -155865, -141864, -118448, -52499, -22565, -74744, -67518, -23770, -3568, -67194, -50892, -49682, -23859, 15473, 90341, 47816, -20129, -71565, -70897, -32540, -70359, -26619, -22908, -70822, -69559, -37056, -32030, -61445, -56721, 13157, 54127, -10499, -85463, -48034, -31235, -51038, -14166, -24382, -135, -6497, -6322, 17082, 15423, 32235, 50832, 44260, 58370, 22123, 27022, 62942, 34604, 19027, -3764, -49448, 11168, 64748, 28334, 10626, 36102, 16128]
4787A6128l0698l3152L4441p1393k2725L2048R1520O5346N530j0917K2567k7645
4775G1050r611j2755k7488j7889n995j8878n237j8958o1128K0562L8444p280k8006
4762h3169n2987K1083O7929L850n8254k2744P487K3626K9874m1193k3847j2609
4750a40954j5127k1574K8302L0668R1829r967p605n853O0538K1329L328k3234
4738A1680K2329J8389m0225m9432n7437j1058L0571M3657J3168m9342l4276J8909
4726h3067O4481N8159M3344J1822p389j10349l1005l3482m5165P4891N801P7M0784
$$ y = [16128, -14570, -47722, -13281, -84674, -107399, -75351, 16169, 81515, 87045, 76128, 98695, 71050, 61439, 48684, 21196, 3307, -2688, -21566, -26803, -45761, -106889, -86327, -47883, -55163, -83169, -136156, -115073, -47144, -43294, -101548, -124292, -116805, -93179, -63305, -104498, -128345, -140954, -156081, -177655, -149353, -118685, -26856, -36823, -44428, -50281, 10257, 31586, 34914, 11680, 34009, 52398, 12173, -37259, -94696, -105754, -75183, -31526, -18358, -67700, -101976, -83067, -18586, 39573, 82917, 94739, 87350, -22999, -54004, -87486, -132651, -57760, -51959, -51882, -11098]
$$ [...]
##END NTUPLES=NMR SPECTRUM
##END=
