##TITLE=Analysis number 327641
Compound Code mo 07653
Project Code adrs
Chemist Name ugmt
##JCAMPDX= 6.0         $$ Bruker NMR JCAMP-DX V2.0
##DATA TYPE= NMR SPECTRUM
##DATA CLASS= NTUPLES
##ORIGIN= Bruker BioSpin GmbH
##OWNER= nmr
$$ XWIN-NMR		Version 3.5
$$ Thu Mar 29 09:12:26 2007 GMT Daylight Time (UT+1h)  MAYBRIDGE\nmr@NMR_250MHZ
##.OBSERVE FREQUENCY= 250.131544655141
##.OBSERVE NUCLEUS= ^1H
##.ACQUISITION MODE= SIMULTANEOUS (DQD)
##.ACQUISITION SCHEME= undefined
##.AVERAGES= 16
##.DIGITISER RES= 18
##SPECTROMETER/DATA SYSTEM= dpx250
##.PULSE SEQUENCE= zg30
##.SOLVENT NAME= DMSO
##.SHIFT REFERENCE= (INTERNAL, DMSO, 0, 16.522)
##AUDIT TRAIL= $$ (NUMBER, WHEN, WHO, WHERE, WHAT)
$$ ##TITLE= Audit trail, XWIN-NMR		Version 3.5
$$ ##JCAMPDX= 5.01
$$ ##ORIGIN= Bruker BioSpin GmbH
$$ ##OWNER= nmr
$$ C:\u/data/dgb/nmr/ADRS/2530/pdata/1/auditp.txt
$$ ##AUDIT TRAIL=  $$ (NUMBER, WHEN, WHO, WHERE, WHAT)
(   1,<2007-03-29 09:12:04.50 +100>,<MAYBRIDGE\nmr>,<NMR_250MHZ>,
      <created by zg, POWCHK disabled, PULCHK disabled
       configuration hash MD5:
       49 4B E0 1D 92 C2 6B 37 9F E6 65 BC 52 41 86 1D
       data hash MD5: 64K
       C2 A3 BA 97 BB DD 4B 60 2A 5A 83 1E C2 91 FA 8F>)
(   2,<2007-03-29 09:12:17.22 +100>,<MAYBRIDGE\nmr>,<NMR_250MHZ>,
      <Start of raw data processing
       ef LB = 0.3 FT_mod = 6 PKNL = 1 SI = 32K 
       data hash MD5: 32K
       C4 19 46 B5 41 7A 6B B4 9C 2D F0 B6 C5 58 B9 4E>)
(   3,<2007-03-29 09:12:19.22 +100>,<MAYBRIDGE\nmr>,<NMR_250MHZ>,
      <apk 
       data hash MD5: 32K
       10 A2 81 3E F7 31 49 F2 B2 57 CA DE 99 F4 5D BC>)
(   4,<2007-03-29 09:12:20.04 +100>,<MAYBRIDGE\nmr>,<NMR_250MHZ>,
      <abs ABSG = 5 
       data hash MD5: 32K
       F4 16 AE BB 7B 5B 43 AD 2E 3C 98 5C 9A 82 42 F2>)
$$ ##END=
$$ 
$$ hash MD5
$$ 66 CB D6 05 33 E5 C3 AE 4C 37 03 A3 84 13 30 C0
##$RELAX= 
##$RELAX= 
##$RELAX= 
##$RELAX= 
##$RELAX= 
##$RELAX= 
##$RELAX= 
$$ Bruker specific parameters
$$ --------------------------
##$DU= <C:\u>
##$EXPNO= 2530
##$NAME= <ADRS>
##$PROCNO= 1
##$TYPE= <nmr>
##$USER= <dgb>
##$AMP= (0..31)
100 100 100 100 100 100 100 100 100 100 100 100 100 100 100 100 100 100 
100 100 100 100 100 100 100 100 100 100 100 100 100 100 
##$AQSEQ= 0
##$AQ_mod= 3
##$AUNM= <au_zg>
##$AUTOPOS= <59 >
##$BF1= 250.13
##$BF2= 250.13
##$BF3= 250.13
##$BF4= 250.13
##$BF5= 500.13
##$BF6= 500.13
##$BF7= 500.13
##$BF8= 500.13
##$BYTORDA= 1
##$CFDGTYP= 0
##$CFRGTYP= 5
##$CHEMSTR= <none>
##$CNST= (0..31)
1 1 145 1 1 1 1 1 1 1 1 1 1 1 1 1 1 1 1 1 1 1 1 1 1 1 1 1 1 1 1 1 
##$CPDPRG= <>
##$CPDPRG1= <>
##$CPDPRG2= <>
##$CPDPRG3= <>
##$CPDPRG4= <mlev>
##$CPDPRG5= <mlev>
##$CPDPRG6= <mlev>
##$CPDPRG7= <mlev>
##$CPDPRG8= <mlev>
##$CPDPRGB= <>
##$CPDPRGT= <>
##$D= (0..31)
0 1 0 0 0 0 0 0 0 0.06 0 0 0 0 0 0 0.0002 0 0 0 0 0 0 0 0 0 0 0 0 0 0 
0 
##$DATE= 1175155923
##$DBL= (0..7)
120 120 120 120 120 120 120 120 
##$DBP= (0..7)
150 150 150 150 150 150 150 150 
##$DBP07= 0
##$DBPNAM0= <>
##$DBPNAM1= <>
##$DBPNAM2= <>
##$DBPNAM3= <>
$$ [...]
##$SUBNAM7= <"">
##$SUBNAM8= <"">
##$SUBNAM9= <"">
##$SW= 20.6930455092707
##$SWIBOX= (0..15)
0 0 3 0 0 0 0 0 0 0 0 0 0 0 0 0 
##$SW_h= 5175.983436853
##$TD= 65536
##$TD0= 1
##$TE= 683.16
##$TE2= 300
##$TE3= 300
##$TEG= 300
##$TL= (0..7)
0 120 120 120 120 120 120 120 
##$TP= (0..7)
150 150 150 150 150 150 150 150 
##$TP07= 0
##$TPNAME0= <>
##$TPNAME1= <>
##$TPNAME2= <>
##$TPNAME3= <>
##$TPNAME4= <>
##$TPNAME5= <>
##$TPNAME6= <>
##$TPNAME7= <>
##$TPOAL= (0..7)
0.5 0.5 0.5 0.5 0.5 0.5 0.5 0.5 
##$TPOFFS= (0..7)
0 0 0 0 0 0 0 0 
##$TUNHIN= 0
##$TUNHOUT= 0
##$TUNXOUT= 0
##$USERA1= <user>
##$USERA2= <user>
##$USERA3= <user>
##$USERA4= <user>
##$USERA5= <user>
##$V9= 5
##$VALIST= <valist>
##$VCLIST= <CCCCCCCCCCCCCCC>
##$VD= 0
##$VDLIST= <DDDDDDDDDDDDDDD>
##$VPLIST= <PPPPPPPPPPPPPPP>
##$VTLIST= <TTTTTTTTTTTTTTT>
##$WBST= 1024
##$WBSW= 4
##$XGAIN= (0..3)
0 0 0 0 
##$XL= 0
##$YL= 0
##$YMAX_a= 142186
##$YMIN_a= -169369
##$ZGOPTNS= <>
##$ZL1= 120
##$ZL2= 120
##$ZL3= 120
##$ZL4= 120
##$ABSF1= 16.522
##$ABSF2= -4.171173
##$ABSG= 5
##$ABSL= 3
##$ALPHA= 0
##$AQORDER= 0
##$ASSFAC= 0
##$ASSFACI= 0
##$ASSFACX= 0
##$ASSWID= 0
##$AUNMP= <proc_1d>
##$AZFE= 0.1
##$AZFW= 0.1
##$BCFW= 0
##$BC_mod= 0
##$BYTORDP= 0
##$COROFFS= 0
##$CY= 12.5
##$DATMOD= 1
##$DC= 0
##$DFILT= <>
##$DTYPP= 0
##$F1P= 14.0000005364418
##$F2P= -0.99999901652339
##$FCOR= 0.5
##$FTSIZE= 32768
##$FT_mod= 6
##$GAMMA= 0
##$GB= 0
##$INTBC= 1
##$INTSCL= 1
##$ISEN= 128
##$LB= 0.3
##$LEV0= 0
##$LPBIN= 0
##$MAXI= 10000
##$MC2= 0
##$MEAN= 0
##$ME_mod= 0
##$MI= 0
##$NCOEF= 0
##$NC_proc= -5
##$NLEV= 6
##$NOISF1= 0
##$NOISF2= 0
##$NSP= 0
##$NTH_PI= 0
##$NZP= 0
##$OFFSET= 16.522
##$PC= 1
##$PHC0= -138.9273
##$PHC1= 14.7071
##$PH_mod= 1
##$PKNL= yes
##$PPARMOD= 0
##$PSCAL= 4
##$PSIGN= 0
##$REVERSE= no
##$SF= 250.13
##$SI= 32768
##$SIGF1= 0
##$SIGF2= 0
##$SINO= 400
##$SIOLD= 32768
##$SREGLST= <1H.DMSO>
##$SSB= 0
##$STSI= 32768
##$STSR= 0
##$SW_p= 5175.98343685301
##$SYMM= 0
##$S_DEV= 0
##$TDeff= 65536
##$TDoff= 0
##$TI= <Analysis number 999999
Compound Code 99
Book Reference 9
Project Code 9>
##$TILT= no
##$TM1= 0
##$TM2= 0
##$TOPLEV= 0
##$USERP1= <user>
##$USERP2= <user>
##$USERP3= <user>
##$USERP4= <user>
##$USERP5= <user>
##$WDW= 1
##$XDIM= 32768
##$YMAX_p= 447534957
##$YMIN_p= -711954
$$ End of Bruker specific parameters
$$ ---------------------------------
##NTUPLES= NMR SPECTRUM
##VAR_NAME=  FREQUENCY,     SPECTRUM/REAL,   SPECTRUM/IMAG
##SYMBOL=    X,             R,               I
##VAR_TYPE=  INDEPENDENT,   DEPENDENT,       DEPENDENT
##VAR_FORM=  AFFN,          ASDF,            ASDF
##VAR_DIM=   32768,         32768,           32768
##UNITS=     HZ,            ARBITRARY UNITS, ARBITRARY UNITS
##FACTOR=    0.157963299565203, 1,           1
##FIRST=     4132.6476996994, 0,             0
##LAST=      -1043.33573715361, 0,           0
##MIN=       -1043.33573715361, -711954,     0
##MAX=       4132.6476996994, 447534957,     0
$$ Real data points
##PAGE= N=1
##DATA TABLE= (X++(R..R)), XYDATA
$$ [...]
$$ plain form
25676 -163194 6218 32777 137360 210026 32617 138892 151306 193250 344916 325185
25666 325185 156438 132859 228203 230598 199998 151335 -6322 -82404 -105224 21563 -213786
25655 -213786 -376060 -292936 -324793 -245317 -181813 -167744 -229033 -459436 -347363 -213292 -132466
25644 -132466 -5435 -195464 -382172 -399822 -238637 -158249 -159454 -131532 -177309 -211051 -103284
25633 -103284 -97344 -24806 27825 43454 18860 -67290 -185516 -77434 581 -63271 -9048
25622 -9048 100071 181546 124243 2963 -71083 -63585 -51086 -89725 44671 30555 -58543
25611 -58543 -33228 109802 5551 -6613 -63598 -30346 50875 108579 -6562 -161804 -157891
25600 -157891 -176609 -109106 -80074 -179361 -203847 -240801 -370669 -477940 -486449 -327047 -301552
$$ packed form
25676a63194J69412K6559J04583P2666j77409J06275J2414M1944J51666j9731
25666C25185j68747k3579R5344K395l0600m8663j57657p6082k2820J26787k35349
25655b13786j62274Q3124l1857P9476O3504J4069o1289k30403J12073J34071Q0826
25644a32466J27031j90029j86708j7650J61185Q0388j205K7922m5777l3742J07767
25633a03284N940P2538N2631J5629k4594q6150j18226J08082P8015o3852N4223
25622i048J09119Q1475n7303j21280p4046P498J2499l8639J34396j4116q9098
25611e8543K5315J43030j04251j2164n6985L3252Q1221N7704j15141j55242L913
25600a57891j8718O7503K9032r9287k4486l6954j29868j07271q509J59402K5495
$$ plain form
25589 -301552 -281100 -227215 -337527 -429599 -339513 -175116 -88620 -142595 -153056 -129841 -82573
25578 -82573 -96842 -26893 -16565 -74084 53725 140015 111071 80048 43010 53738 64914
25567 64914 -119782 -199046 -128569 26269 123468 126230 218998 197908 44008 -100573 -179346
25556 -179346 -219343 -193993 51034 145230 93427 7689 -70708 -53849 61321 96951 30556
25545 30556 -12086 -155160 -258016 -150413 -33833 -121684 -190498 -75739 125037 38111
25535 38111 -70658 -78052 -149011 -91886 -29935 25694 -23722 -170132 -223296 -218609 -308063 -224582
25523 -224582 -151605 -88145 -17959 -75587 -123836 -87343 -35854 -235393 -173122 -151525 -159508
25512 -159508 -170942 -193970 -165195 -291642 -236505 -113854 -219602 -278503 -229850 -162512 2929
$$ packed form
25589c01552K0452N3885j10312r2072R0086J64397Q6496n3975j0461K3215M7268
25578h2573j4269O9949J0328n7519J27809Q6290k8944l1023l7038J0728J1176
25567F4914j84696p9264P0477J54838R7199K762R2768k1090j53900j44581p8773
25556a79346l9997K5350K45027R4196n1803q5738p8397J6859J15170L5630o6395
25545C0556m2642j43074j02856J07603J16580q7851o8814J14759K00776q6926
25535C8111j08769p394p0959N7125O1951N5629m9416j46410n3164M687q9454Q3481
25523b24582P2977O3460P0186n7628m8249L6493N1489j99539O2271K1597p983
25512a59508j1434k3028K8775j26447N5137J22651j05748n8901M8653O7338J65441
$$ plain form
25501 2929 2434 -12683 -2700 75547 -3317 -108668 -158894 -16722 -123156 -26607 42498 65466
25489 65466 17225 134156 302888 232304 135070 161482 104324 75667 -21373 -160366 -219413
25478 -219413 -105046 -99606 -47890 89103 217187 195314 164190 171536 364243 313806 159053
25467 159053 35865 -10565 -125550 -64022 22712 -16177 -58735 -83964 -59554 -126575 -47001
25456 -47001 12660 -68235 41278 98158 18163 -89437 -54854 28692 45047 -89661 -128052
25445 -128052 -71323 -113980 -72507 67592 -18357 -17772 48236 113774 239888 237196 198365 76640
25433 76640 16396 -124577 -140469 23841 86658 42574 119772 43674 -30555 -147476 -102916
25422 -102916 -166450 -348607 -334353 -316125 -268149 -199046 -110936 35078 59658 -31968 -29679
$$ packed form
25501B929m95j5117R983P8247p8864j05351n0226J42172j06434R6549O9105K2968
25489F5466m8241J16931J68732p0584r7234K6412n7158k8657r7040j38993n9047
25478b19413J14367N440N1716J36993J28084k1873l1124P346J92707n0437j54753
25467A59053j23188m6430j14985O1528Q6734l8889m2558k5229K4410o7021P9574
25456d7001N9661q0895J09513N6880p9995j07600L4583Q3546J6355j34708l8391
25445a28052N6729m2657M1473J40099q5949N85O6008O5538J26114k692l8831j21725
25433G6640o0244j40973j5892J64310O2817m4084P7198p6098p4229j16921M4560
25422a02916o3534j82157J4254J8228M7976O9103Q8110J46014K4580r1626K289
$$ plain form
25411 -29679 -5420 31903 -5886 -126107 -200774 -158068 -111942 -153986 -117109 61944 70489
25400 70489 14397 -156721 -378881 -439276 -336877 -350907 -189799 -128563 -126301 -47062 66897
25389 66897 163013 113749 -58094 -98045 -36412 42514 40534 92571 70782 137836 81238 -96801
25377 -96801 -137406 9038 67949 4793 63103 34360 22940 139202 79680 -11294 -45558
25366 -45558 -211952 -207196 -15540 28425 -45012 -138782 -121466 -109572 -9790 -101286 16612
25355 16612 126702 130735 -9456 -184869 -287814 -193333 81403 312543 308734 158732 -52344
25344 -52344 -92884 -107257 -54326 -138210 -186570 -53720 2768 -1407 71325 149671 80128 -46414
25332 -46414 51518 -24149 -162680 -200999 -73257 -117504 -11881 8004 -17824 -84609 -70730
$$ packed form
25411b9679K4259L7323l7789j20221p4667M2706M6126m2044L6877J79053Q545
25400G0489n6092j71118k22160o0395J02399j4030J61108O1236K262P9239J13959
25389F6897R6116m9264j71843l9951O1633P8926j980N2037k1789O7054n6598j78039
25377i6801m0605J46444N8911o3156N8310k8743j1420J16262n9522r0974l4264
25366d5558j66394M756J91656M3965p3437r3770J7316J1894R9782r1496J17898
25355A6612J10090M033j40191j75413j02945R4481K74736K31140l809j50002k11076
25344e2344m0540j4373N2931q3884m8360J32850N6488m175P2732P8346o9543j26542
25332d6414R7932p5667j38531l8319J27742m4247J05623J9885k5828o6785J3879
$$ plain form
25321 -70730 -3506 -140743 -99016 -22906 -93561 -22292 61512 226139 126150 -106982 -175618
25310 -175618 -111797 -69032 19790 267779 220670 132982 178598 196255 255338 122668 -134070
25299 -134070 -166556 -120272 -116737 11010 80639 96947 80199 3671 -51393 83502 68386
25288 68386 25436 -52593 -149772 -109008 -20648 -46801 -139402 -292195 -233195 -245 -33177
25277 -33177 -187290 -289210 -284825 -358781 -307934 -194927 -99966 67550 162589 -22360 -233235
25266 -233235 -98927 68686 188887 205895 165008 -16087 -253811 -206430 -116285 -234894
25256 -234894 -313773 -130500 -7615 109798 87681 27026 75636 113299 -52701 -77624 -31002
25245 -31002 80928 178955 118110 87576 114272 49555 -10780 -240142 -465044 -398196 -211241
$$ packed form
25321g0730O7224j37237M1727P6110p0655P1269Q3804J64627r9989k33132o8636
25310a75618O3821M2765Q8822K47989m7109q7688M5616J7657N9083j32670k56738
25299a34070l2486M6284L535J27747O9629J6308j6748p6528n5064J34895j5116
25288F8386m2950p8029r7179M0764Q8360k6153r2601j52793N9000K32950l2932
25277c3177j54113j01920M385p3956N0847J13007R4961J67516R5039j84949k10875
25266b33235J34308J67613J20201J7008m0887j81095k37724M7381R0145j18609
25256b34894p8879J83273J22885J17413k2117o0655M8610L7663j66000k4923M6622
25245c1002J11930R8027o0845l0534K6696o4717o0335k29362k24902O6848J86955
$$ plain form
25234 -211241 -236704 -226619 -178749 -177389 -190758 -148053 -26037 49073 161180 185555 81888
25223 81888 -48126 -76433 -18322 70209 142775 62332 -117036 -147031 -244529 -328847 -98934
25212 -98934 82653 66484 53026 30324 -138623 -32712 180063 288599 246187 89499
25202 89499 69151 6062 -124767 -190333 -138258 -21072 -134455 -172195 -96686 -49513 -87284
25191 -87284 -246672 -327722 -235889 -89213 -259403 -151402 -43415 -32981 -125603 -120114 -112625
25180 -112625 -24437 55303 41455 12352 86038 217279 187409 193964 38368 -19030 -117708
25169 -117708 -167452 -262826 -271810 -331576 -302468 -75713 51978 169986 234724 187635 145806
25158 145806 -12815 -6446 175579 148145 181331 165009 -21198 -123020 -55201 -131455 -250609
$$ packed form
25234b11241k5463J0085M7870J360j3369M2705J22016P5110J12107K4375j03667
25223H1888j30014k8307N8111Q8531P2566q0443j79368k9995r7498q4318K29913
25212i8934J81587j6169j3458k2702j68947J05911K12775J08536m2412j56688
25202H9499k0348o3089j30829o5566N2075J17186j13383l7740P5509M7173l7771
25191h7284j59388q1050R1833J46676j70190J08001J07987J0434r2622N489P489
25180a12625Q8188P9740j3848k9103P3686J31241k9870O555j55596n7398r8678
25169a17708m9744r5374q984n9766K9108K26755J27691J18008O4738m7089m1829
25158A45806j58621O369J82025k7434L3186j6322j86207j01822O7819p6254j19154
$$ plain form
25147 -250609 -221069 -100779 -198856 -94445 51017 120949 148264 130780 97292 186925 217975
25136 217975 22583 6471 -82111 -143051 32948 112388 95896 -92313 -132612 -253405 -270205
25125 -270205 -159936 10665 142233 189864 331574 313537 248117 195220 123067 72696 160439
25114 160439 210815 199387 214725 134019 73939 -30164 -131984 -75039 47130 -36270 -236586
25103 -236586 -357753 -132825 -24389 107846 106006 -27088 -148483 -253026 -111922 57487
25093 57487 36398 33430 37830 22992 -84847 -94517 -82187 -21369 110366 24661 142033 241927
25081 241927 14279 84259 173130 166358 109129 17766 -195251 -366865 -449920 -406140 -310212
25070 -310212 -123760 -128805 -91471 60418 172591 129622 278 -134650 -74806 97148
$$ packed form
25147b50609K9540J20290r8077J04411J45462O9932K7315j7484l3488Q9633L1050
25136B17975j95392j6112q8582o0940J75999P9440j6492j88209m0299j20793j6800
25125b70205J10269J70601J31568M7631J41710j8037o5420n2897p2153n0371Q7743
25114A60439N0376j1428J5338q0706o0080j04103j01820N6945J22169q3400k00316
25103b36586j21167K24928J08436J32235j840j33094j21395j04543J41104J69409
25093E7487k1089k968M400j4838j07839r670J2330O0818J31735q5705J17372R9894
25081B41927k27648O9980Q8871o772n7229r1363k13017j71614q3055M3780R5928
25070c10212J86452n045L7334J51889J12173m2969j29344j34928N9844J71954
$$ plain form
25060 97148 267790 235750 183850 -4424 -73256 -111023 140365 195367 6837 -64364 -34172
25049 -34172 140153 85385 968 135033 304704 497028 316947 13164 22206 -12101 -113730
25038 -113730 -90490 -53492 -154161 -124759 72406 9498 -147440 -196970 -152858 -197370 -156786
25027 -156786 -68969 -25646 -5682 -112752 -224882 -257523 -268348 -178449 -161442 -105543 -133147
25016 -133147 -107100 -104541 -120943 -209395 -169049 -17755 -159773 -233427 -188179 -262707 -232586
25005 -232586 -100201 -2027 -41867 -43997 -42419 -62812 -110757 -39940 109441 -45970 -78998
24994 -78998 -133103 -114151 124511 206496 102364 94381 135121 187289 109497 188041 360363
24983 360363 235839 58725 -52893 -170569 -183693 -205902 10704 136229 39482 -103048
$$ packed form
25060I7148J70642l2040n1900j88274o8832l7767K51388N5002j88530p1201L0192
25049c4172J74325n4768q4417J34065J69671J92324j80081l03783R042l4307j01629
25038a13730K3240L6998j00669K9402J97165o2908j56938m9530M4112m4512M0584
25027a56786Q7817M3323J9964j07070j12130l2641j0825Q9899J7007N5899k7604
25016a33147K6047K559j6402q8452M0346J51294j42018p3654M5248p4528L0121
25005b32586J32385R8174l9840k130J578k0393m7945P0817J49381j55411l3028
24994g8998n4105J8952K38662Q1985j04132p983M0740N2168p7792P8544J72322
24983C60363j24524j77114j11618j17676j3124k2209K16606J25525r6747j42530
$$ plain form
24973 -103048 -113427 -75283 -136903 -205291 -314310 -446088 -411508 -387244 -390179 -195198 -73354
24962 -73354 -93227 -145614 -107751 -226319 -393241 -437359 -209876 -136149 -128525 -207773 -99084
24951 -99084 -127042 -58451 -8647 80314 18011 -157313 -68002 -77533 -174081 -154396 -320719
24940 -320719 -308830 -21452 143672 43232 19151 28126 61154 63162 -19080 -19315 -3529 -44983
24928 -44983 -4511 146020 80420 106957 53525 -72861 15249 3532 -156655 -224638 -151012
24917 -151012 3882 191786 23494 -61617 -97309 -87526 113448 188837 240716 241485 262441
24906 262441 263044 289012 308140 108252 49660 -34453 -14948 58563 116703 245664 157169
24895 157169 125547 83883 -31387 -90702 -108655 -10855 71594 -68067 -123931 -254729 -29526
$$ packed form
24973a03048j0379L8144o1620o8388j09019j31778L4580K4264k935J94981J21844
24962g3354j9873n2387L7863j18568j66922m4118K27483P3727P624p9248J08689
24951i9084k7958O8591M9804Q8961o2303j75324Q9311r531r6548J9685j66323
24940c20719J1889K87378J65124j00440k4081Q975L3028K008q2242k35J5786m1454
24928d4983M0472J50531o5600K6537n3432j26386Q8110j1717j60187o7983P3626
24917a51012J54894J87904j68292q5111l5692R783K00974P5389N1879P69K0956
24906B62441O03K5968J9128j99888n8592q4113J9505P3511N8140J28961q8495
24895A57169l1622m1664j15270n9315j7953R7800Q2449j39661n5864j30798K25203
$$ plain form
24884 -29526 153239 128954 64506 12561 -78132 -107065 -72635 12960 126247 115528 -145664
24873 -145664 -167341 -134725 -179569 -188318 -70519 3848 -77710 -88661 -74413 -144666 -307346
24862 -307346 -247665 -198079 -92791 11220 -51090 -137223 -329151 -258770 -184440 -116171 -41601
24851 -41601 -54546 1813 -151309 -290937 -345711 -357034 -248272 -112396 -102138 -18706 108397
24840 108397 -800 -101599 -188198 -293753 -156198 -77811 -212447 -248533 -136128 -94578
24830 -94578 71781 -12921 -197692 -231896 -228598 -198840 -260246 -135166 -46645 -157945 -90301
24819 -90301 -145282 -165344 -282542 -312594 -327909 -60067 31888 208524 311334 221558 35984
24808 35984 50277 90768 -52369 15193 78994 101274 63329 -41589 -187588 -176344 -212971
$$ packed form
24884b9526J82765k4285o4448n1945r0693k8933L4430Q5595J13287j0719k61192
24873a45664k1677L2616m4844q749J17799P4367q1558j0951J4248p0253j62680
24862c07346N9681M9586J05288J04011o2310q6133j91928P0381P4330O8269P4570
24851d1601j2945N6359j53122j39628n4774j1323J08762J35876J0258Q3432J27103
24840A08397j09197j00799q6599j05555J37555P8387j34636l6086J12405M1550
24830i4578J66359q4702j84771l4204L298K9758o1406J25080Q8521j11300O7644
24819i0301n4981k0062j17198l0052j5315K67842R1955J76636J02810q9776j85574
24808C5984J4293M0491j43137O7562O3801K2280l7945j04918j45999J1244l6627
$$ plain form
24797 -212971 -213657 -191312 -56527 -50958 -111537 336 90959 166351 223055 98539 28464
24786 28464 4631 37892 118123 145143 4939 47517 137892 106160 60561 -146775 -196540
24775 -196540 -161965 -33927 75304 -66946 54622 41605 -162220 -54324 90789 30432
24765 30432 -10169 -165277 -137211 -166604 -40803 139125 10992 -73840 -96905 -161475 -212188
24754 -212188 -6070 121768 93961 146931 163787 67816 27511 74608 -78277 -92236 -121892
24743 -121892 -36311 -33463 134589 162795 -53234 -15988 40584 -4947 -86103 -265900 -386501
24732 -386501 -292673 -272375 -202374 12942 240396 199276 97892 -28260 -37445 5712 -52985
24721 -52985 -99641 -51591 -62411 -121208 -152171 -160708 -188702 -164566 -263393 -252552 -254077 -195306
$$ packed form
24797b12971o86K2345J34785N569o0579J11873R0623P5392N6704j24516p0075
24786B8464k3833L3261Q0231K7020j40204M2578R0375l1732m5599k07336m9765
24775a96540L4575J28038J09231j42250J21568j3017k03825J07896J45113o0357
24765C0432m0601j55108K8066k9393J25801J79928j28133q4832k3065o4570n0713
24754b12188K06118J27838k7807N2970J6856r5971m0305M7097j52885j3959k9656
24743a21892Q5581K848J68052K8206k16029L7246N6572m5531q1156j79797j20601
24732c86501R3828K0298P0001K15316K27454m1120j01384j26152r185M3157n8697
24721e2985m6656M8050j0820n8797l0963q537k7994K4136r8827J0841j525N8771
$$ plain form
24709 -195306 3956 154524 254720 212052 278326 286619 158416 33679 96947 82413 -214200
24698 -214200 -432302 -421555 -241871 -92687 -25278 42976 60029 34918 -27074 -87532 -92717
24687 -92717 -102041 -176471 -232233 -281948 -463434 -393721 -238010 -173062 -71253 -52869 156461
24676 156461 193705 109835 92377 103391 -168395 -400313 -245011 -21233 103202 -14914
24666 -14914 23219 34729 25989 26893 7999 -21711 -258073 -373714 -504722 -552183 -551744 -581974
24654 -581974 -580152 -498331 -394336 -251315 -134327 -191892 -35484 225985 46270 -157325
24644 -157325 -308663 -433102 -339719 -301695 -409180 -422459 -258600 -246345 -60008 101146
24634 101146 163317 -92424 -140974 -9445 174128 177655 16022 -59517 -65712 52511 214017
$$ packed form
24709a95306J99262J50568J00196m2668O6274Q293j28203j24737O3268j4534k96613
24698b14200k18102J0747J79684J49184O7409O8254J7053k5111o1992o0458n185
24687i2717r324p4430n5762m9715j81486O9713J55711O4948J01809J8384K09330
24676A56461L7244q3870j7458J1014k71786k31918J55302K23778J24435j18116
24666a4914L8133J1510q740R04j8894k9710k36362j15641j31008m7461M39l0230
24654e81974J822Q1821J03995J43021J16988n7565J56408K61469j79715k03595
24644a57325j51338j24439R3383L8024j07485j3279J63859J2255J86337J61154
24634A01146O2171k55741m8550J31529J83573L527j61633p5539o195J18223J61506
$$ plain form
24623 214017 116592 106524 70875 111212 67245 -15780 -25552 28028 -36740 -156851 -226562
24612 -226562 -272965 -318034 -297621 -280320 -400096 -544429 -446551 -368734 -355427 -274676 -63946
24601 -63946 38284 78058 231586 342134 189814 -64344 -118162 -49328 52112 24694
24591 24694 -114596 -161684 -191306 -137628 -46385 8677 -34739 -28593 -19845 50292 -52056 -135199
24579 -135199 6612 26677 114418 112532 -49334 -95509 -94491 -67813 -68724 -178713 -132697 -9155
24567 -9155 251146 210029 86389 -51077 -63014 -127060 -227101 -340179 -382924 -273488 -254833
24556 -254833 -298075 -286613 -192837 -124284 19947 -64232 -123833 -109637 -189721 -197815 23379
24545 23379 70179 -111679 -103539 -118202 -121089 81576 15441 -283672 -244470 -151882 -88281
$$ packed form
24623B14017r7425j0068l5649M0337m3967q3025r772N3580o4768j20111o9711
24612b26562m6403m5069K0413J7301j19776j44333R7878P7817J3307Q0751K10730
24601f3946J02230L9774J53528J10548j52320k54158n3818O8834J01440k7418
24591B4694j39290m7088k9622N3678R1243N5062m3416O146Q748P0137j02348q3143
24579a35199J41811K0065Q7741j886j61866m6175J018K6678r11j09989M6016J23542
24567i155K60301m1117j23640j37466j1937o4046j00041j13078m2745J09436J8655
24556b54833m3242J1462R3776O8553J44231q4179n9601J4196q0084q094K21194
24545B3379M6800j81858Q140j4663k887K02665o6135k99113L9202R2588O3601
$$ plain form
24534 -88281 -15894 18111 22419 96890 39518 -104318 -185181 -277419 -247261 -19920 60234
24523 60234 26809 33230 97729 46536 136404 372872 273820 455 -16066 -8907 -4754 -60919
24511 -60919 -14186 -72153 33279 28543 32577 44930 46350 222591 213835 173615 103133 48397
24499 48397 -23771 -39264 29046 44085 11937 -51544 106337 110695 30029 153809 169360
24488 169360 14686 -122943 -137025 -147184 -73447 -249767 -272969 -46324 -37686 -26568 -257932
24477 -257932 -157546 52222 65383 187334 94128 190915 269892 226784 229412 244110 462677
24466 462677 440966 177809 109725 69098 -75817 -153932 -130774 -65454 148566 268079 189372
24455 189372 108952 133716 75992 157842 38163 -196514 -162557 -83102 118778 299023 324951
$$ packed form
24534h8281P2387L4005M308P4471n7372j43836q0863r2238L0158K27341Q0154
24523F0234l3425O421O4499n1193Q9868K36468r9052k73365j6521P159M153n6165
24511f0919M6733n7967J05432m736M034J2353J420J76241q756m0220p0482n4736
24499D8397p2168j5493O8310J5039l2148o3481J57881M358q0666J23780J5551
24488A69360j54674j37629j4082j0159P3737j76320k3202K26645Q638J1118k31364
24477b57932J00386K09768J3161J21951r3206R6787P8977m3108K628J4698K18567
24466D62677k1711k63157o8084m0627j44915p8115K3158O5320K14020J19513p8707
24455A89372q0420K4764n7724Q1850j19679k34677L3957P9455K01880J80245K5928
$$ plain form
24444 324951 204699 -31650 -9521 -2046 19920 123398 16985 -101332 -109932 210395 308119
24433 308119 119345 244897 406044 241388 203542 177681 5913 -8432 -110708 -45229
24423 -45229 -52804 -78569 1244 37465 -105459 -197446 -151238 -45754 -32168 36531 16801
24412 16801 -58153 10142 -53063 -91602 -82252 -146432 -45112 59923 67656 402 -174755
24401 -174755 -307751 -177545 -37146 -8649 182885 156132 42932 -147840 -261325 -197619
24391 -197619 -130734 -3130 68382 19741 546 -104435 -230416 -268271 -261676 -133729 -41653
24380 -41653 -64343 -7821 20326 -51721 -69051 26588 -61847 3836 -93492 -24089 18015 4466
24368 4466 -7539 -111813 -156884 -114240 -234341 -377183 -449415 -409973 -334889 -276980 -329775
$$ packed form
24444C24951j20252k36349K2129P475K1966J03478j06413j18317q600L20327R7724
24433C08119j88774J25552J61147j64656l7846k5861j71768j4345j02276O5479
24423d5229p575k5765P9813L6221j42924r1987M6208J05484J3586O8699j9730
24412A6801p4954O8295o3205l8539R350o4180J01320J05035P733o7254j75157
24401a74755j32996J30206J40399K8497J91534k6753j13200j90772j13485O3706
24391a97619O6885J27604P1512m8641j9195j04981j25981l7855O595J27947R2076
24380d1653k2690N6522K8147p2047j7330R5639q8435O5683r7328O9403M2104j3549
24368D466j2005j04274m5071M2644j20101j42842p2232L9442P5084N7909n2795
$$ plain form
24357 -329775 -323950 -366271 -271742 -47420 15467 -90108 -134637 -105202 -209700 -227045 25148
24346 25148 102016 257596 217762 -102475 -168814 -90841 -59328 -138228 -68737 59386 48580
24335 48580 -128076 -27657 63110 50629 143766 153043 -9665 -21807 -75748 -152847 -279352
24324 -279352 -196439 -106176 -273304 -201931 -43846 22739 9280 74711 200316 108147 -48878
24313 -48878 -21343 -58449 -248280 -332365 -177025 -130979 -119329 -197376 -110089 -428 -160884
24302 -160884 -327478 -378027 -138542 -34489 8340 -78478 -94131 -5612 4239 35270 123404
24291 123404 81050 11256 29609 361 -118873 -78624 -209178 -299547 -181376 -203289 -223883
24280 -223883 -163805 -273156 -269360 -272849 -319258 -230178 -274683 -208444 -163518 -141017 -47490 -46784
$$ packed form
24357c29775N825m2321R4529K24322O2887j05575m4529K9435j04498j7345K52193
24346B5148P6868J55580l9834l20237o6339P7973L1513p8900O9491J28123j0806
24335D8580j76656J00419R0767j2481R3137R277j62708j2142n3941p7099j26505
24324b79352Q2913R0263j67128P1373J58085O6585j3459O5431J25605r2169j57025
24313d8878K7535l7106j89831q4085J55340M6046J1650p8047Q7287J09661j60456
24302a60884j66594n0549K39485J04053M2829q6818j5653Q8519R851L1031Q8134
24291A23404m2354o9794J8353k9248j19234M0249j30554r0369J18171k1913k0594
24280b23883O0078j09351L796l489m6409Q9080m4505O6239M4926K2501R3527P06
$$ plain form
24268 -46784 -146054 -181614 21873 129540 305402 318022 208900 172834 1091 -86791 -88159
24257 -88159 -153928 -52829 -57130 -96222 119008 124523 -132942 -160858 -135445 -201612 -240094
24246 -240094 -100343 9550 9286 -72450 -151765 -153588 -149131 -137462 -139321 -224302 -228197 -181761
24234 -181761 -20789 -137955 -264852 -142075 -31909 -59789 -67343 44166 -93482 -247834
24224 -247834 -303456 -135808 -46904 -22343 -117375 15523 76154 82344 -144960 -306624 -286642
24213 -286642 -162074 -61216 76001 63459 25557 96637 99282 70798 119083 120090 159193
24202 159193 9074 -269019 -278981 -351105 -429643 -270889 -101991 -275160 -256981 -191964 -224206
24191 -224206 6538 50618 106117 37118 -30422 -12976 13850 39668 -3383 -76115 -3572
$$ packed form
24268d6784r9270l5560K03487J07667J75862J2620j09122l6066j71743q7882j368
24257h8159o5769J01099m301l9092K15230N515k57465k7916K5413o6167l8482
24246b40094J39751J09893k64q1736p9315j823M457J1669j859q4981l895M6436
24234a81761J60972j17166j26897J22777J10166k7880p554J11509j37648j54352
24224b47834n5622J67648Q8904K4561r5032J32898O0631O190k27304j61664J9982
24213b86642J24568J00858J37217j2542l7902P1080K645k8484M8285J007L9103
24202A59193j50119k78093r962p2124p8538J58754J68898j73169J8179O5017l2242
24191b24206K30744M4080N5499o8999o7540J7446K6826K5818m3051p2732P2543
$$ plain form
24180 -3572 68008 112106 111465 125703 82701 -109191 -23070 198327 202460 43140 98075 -34841
24168 -34841 -134537 -266539 -310466 -235222 -228730 -33379 92516 29120 -50293 -202195 -202681
24157 -202681 -207100 -195729 -126214 -77560 -79529 -30175 77780 90329 -40512 -105122 -108049 31442
24145 31442 89567 63918 28376 110077 73545 -91133 -136914 -253949 -341252 -243365 -175929
24134 -175929 -103822 -108769 -286064 -376925 -335936 -257176 -266016 -253177 -386764 -382164 -181004
24123 -181004 -128915 -124703 -365131 -357242 -75177 -10876 17386 115365 185499 66614 -130294
24112 -130294 -107661 -21348 -105934 72252 31880 -155501 -176886 -163055 -188741 -135589 52388
24101 52388 6439 -103607 -48548 -95862 -116323 -59274 -69895 -129777 -117544 48036 -57215
$$ packed form
24180c572P1580M4098o41J4238m3002j91892Q6121K21397M133j59320N4935j32916
24168c4841r9696j32002m3927P5244O492J95351J25895o3396p9413j51902m86
24157b02681m419J1371O9515M8654j969M9354J07955J2549j30841o4610k927J39491
24145C1442N8125k5649l5542Q1701l6532j64678m5781j17035q7303R7887O7436
24134a75929P2107m947j77295r0861M0989P8760q840J2839j33587M600K01160
24123a81004N2089M212k40428P889K82065O4301K8262R7979P0134j18885j96908
24112a30294K2633Q6313q4586J78186m0372j87381k1385J3831k5686N3152J87977
24101E2388m5949j10046N5059m7314k0461N7049j0621n9882J2233J65580j05251
$$ plain form
24090 -57215 -185768 -66285 23585 297 44703 -77003 14764 -59335 -259335 -309094 39354
24079 39354 37639 -20506 -252090 -252028 -136708 -163299 -317757 -263998 29830 129345 127568 153258
24067 153258 109449 5790 -20361 -1367 -87871 -205444 -114657 -141574 -193570 -240212 -322286
24056 -322286 -204531 -151478 -149301 -39140 109740 72708 33806 12297 -55236 14364 -12153
24045 -12153 -70699 -284842 -303958 -132132 24945 174897 56960 46454 66609 -9888 -129959
24034 -129959 -177835 -137584 -156293 -167326 -152781 -157408 -35188 -98376 -354578 -341253 -274947
24023 -274947 -88925 -83640 -156528 -118965 -13968 80296 78610 139096 310887 516836 540356
24012 540356 382977 190967 104582 78801 2361 -11216 252637 303564 405268 335468 161868
$$ packed form
24090e7215j28553J19483Q9870k3288M4406j21706R1767p4099k00000m9759L48448
24079C9354j715n8145k31584O2J15320k6591j54458N3759K93828R9515j777K5690
24067A53258m3809j03659k6151J8994q6504j17573R0787k6917n1996m6642q2074
24056c22286J17755N3053K177J10161J48880l7032l8902k1509o7533O9600k6517
24045a2153n8546k14143j9116J71826J57077J49952j17937j0506K0155p6497j20071
24034a29959m7876M0251j8709j1033J4545m627J22220o3188k56202J3325O6306
24023b74947J86022N285p2888L7563J04997R4264j686O0486J71791K05949K3520
24012E40356j57379j92010q6385k5781p6440j3577K63853N0927J01704o9800j73600
$$ plain form
24001 161868 8154 -77436 -92393 -137853 -196986 -96093 111939 47588 46552 70690 170366
23990 170366 252733 375503 333284 205769 73948 77368 13360 -104721 11174 70467 170685
23979 170685 228215 97204 163331 82725 20900 87426 94704 -92363 -252843 -76338 -110005
23968 -110005 -143079 -131156 -167021 -85588 -78139 -125128 -149786 -82581 27436 146258 153067
23957 153067 113495 282963 227908 78472 27239 -87346 -284902 -241930 -198745 -94591
23947 -94591 66869 -917 -131595 -4805 29968 -15324 -135545 -274399 -283738 -124364 -50344
23936 -50344 -127869 -131790 41245 70889 -58677 -76876 -34689 -2006 56523 -10976 -133826
23925 -133826 12759 76735 94253 100928 119388 -40076 -89515 -28616 -14465 -47418 32330
$$ packed form
24001A61868j53714q5590j4957m5460n9133J00893K08032o4351j036K4138R9676
23990A70366Q2367J22770m2219j27515j31821L420o4008j18081J15895N9293J00218
23979A70685N7530j31011O6127q0606o1825O6526P278j87067j60480J76505l3667
23968a10005l3074J1923l5865Q1433P449m6989k4658O7205J10017J18822O809
23957A53067l9572J69468n5055j49436n1233j14585j97556M2972M3185J04154
23947i4591J61460o7786j30678J26790L4773m5292j20221j38854r339J59374P4020
23936e0344p7525l921J73035K9644j29566j8199M2187L2683N8529o7499j22850
23925a33826J46585O3976J7518O675J8460j59464m9439O0899J4151l2953P9748
$$ plain form
23914 32330 98982 190868 34872 213850 425736 338670 182314 -100112 -32648 189692
23904 189692 129442 27125 -87880 -109294 -47729 -28471 -63553 -32034 -956 -1273 -101462
23893 -101462 -282742 -190718 -101919 -161277 -10078 36606 36040 274891 454855 336309 242418
23882 242418 35197 16155 -50647 107318 217528 313309 380673 191226 -103665 -214568
23872 -214568 -299350 -239136 -78496 -27687 -137542 -180124 -303448 -346011 -222206 27262
23862 27262 -5174 -43025 112966 278526 230937 -51029 -227858 -334881 -181246 173035
23852 173035 163296 46187 -24626 71791 134548 54408 -17146 40552 81165 -44138 -155162
23841 -155162 -125971 -169704 -296594 -131087 -39909 -85219 125439 355314 323322 207910
$$ packed form
23914C2330O6652R1886j55996J78978K11886q7066j56356k82426O7464K22340
23904A89692o0250j02317j15005k1414O1565J9258l5082L1519L1078l17j00189
23893a01462j81280R2024Q8799n9358J51199M6684n66K38851J79964j18546r3891
23882B42418k07221j9042o6802J57965J10210R5781O7364j89447k94891j10903
23872b14568q4782O0214J60640N0809j09855m2582j23324m2563J23805K49468
23862B7262l2436l7851J55991J65560m7589k81966j76829j07023J53635L54281
23852A73035r739j17109p0813R6417O2757q0140p1554N7698M0613j25303j11024
23841a55162K9191m3733j26890J65507R1178m5310K10658K29875l1992j15412
$$ plain form
23831 207910 269964 168910 27855 -72461 -144511 -141160 -103809 4262 -89924 -15225 19445
23820 19445 -179747 -94949 -70749 -21669 -15787 15189 -1902 -139511 -155876 -176440 -209486
23809 -209486 -121367 -2240 -56032 -6503 178597 307317 346824 356803 397492 210682 131478
23798 131478 -7898 -21525 19590 -38529 -56784 -84432 -59680 54344 5692 6129 66601
23787 66601 -35548 -19454 -114548 -243587 -286510 -90758 -34983 -194353 -281431 -211781 -8705
23776 -8705 19507 65297 -41934 -149727 -99312 -118668 -232097 -208119 -242609 -51850 -17640
23765 -17640 -60161 -187069 -209305 -218951 -328082 -308333 -76083 149611 253847 52512 -171581
23754 -171581 -165843 -86246 -67000 -79344 -79897 -52651 -20643 -102244 -93238 -112464 -55486 107777
$$ packed form
23831B07910O2054j01054j41055j00316p2050L351L7351J08071r4186P4699L4670
23820A9445j99192Q4798K4200M9080N882L0976j7091j37609j6365k0564l3046
23809b09486Q8119J19127n3792M9529J85100J28720L9507R979M0689j86810p9204
23798A31478j39376j3627M1115n8119j8255k7648K4752J14024m8652M37O0472
23787F6601j02149J6094r5094j29039m2923J95752N5775j59370q7078O9650K03076
23776h705K8212M5790j07231j07793N0415j9356j13429K3978l4490J90759L4210
23765a7640m2521j26908k2236r646j09131J9749K32250K25694J04236k01335k24093
23754a71581N738P9597J9246j2344n53K7246L2008q1601R006j9226N6978J63263
$$ plain form
23742 107777 252524 111459 89948 154025 169250 73996 14195 48567 99968 -14302 -272680
23731 -272680 -207646 -23154 14368 248042 305940 226788 202430 -1162 -66714 -103520 -55018
23720 -55018 45506 96874 220510 340159 273764 136487 69260 85795 99991 130003 91962
23709 91962 35382 5893 -121135 -411606 -485381 -508841 -444229 -158098 62094 7826 -89281
23698 -89281 183045 340589 191920 50540 -38453 -98923 -231085 -182195 -138949 -93186 -4407
23687 -4407 -70824 -252757 -367028 -245006 -197817 -325760 -333165 -348003 -340000 -315193 -131266
23676 -131266 -30930 -187528 -300218 -89191 -29997 -171674 -205282 -200559 -280789 -110331
23666 -110331 -61176 -82319 -284511 -370320 -280826 -289633 -285848 -232654 -219617 -121889 -35258 23829
$$ packed form
23742A07777J44747j41065k1511O4077J5225r5254n9801L4372N1401j14270k58378
23731b72680O5034J84492L7522K33674N7898p9152k4358k03592o5552l6806M8502
23720e5018J00524N1368J23636J19649o6395j37277o7227J6535J4196L0012l8041
23709I1962n6580k9489j27028k90471p3775k3460O4612K86131K20192n4268r7107
23698h9281K72326J57544j48669j41380q8993o0470j32162M8890M3246M5763Q8779
23687d407o6417j81933j14271J22022M7189j27943p405j4838Q003K4807J83927
23676a31266J00336j56598j12690K11027N9194j41677l3608M723q0230J70458
23666a10331M9155k1143k02192q5809Q9494q807L785N3194J3037R7728Q6631N9087
$$ plain form
23654 23829 65888 60986 173562 140428 -74880 -194561 -268138 -136159 57847 162658 207959
23643 207959 220502 14324 -12564 -35260 29353 92720 -66425 -9596 133477 212714 139692
23632 139692 111046 24433 -38116 -72761 -115394 -73474 -84328 -75257 89746 72946 -3733
23621 -3733 -66945 -150371 -15756 68793 70235 170243 91869 -96118 -97458 5366 -42231
23610 -42231 14545 39008 -5199 -52344 -67125 77412 78395 102455 -90252 -213224 -216479 -99292
23598 -99292 -98999 -138770 -226408 -206294 -177748 -353432 -316978 -302378 -423639 -362478 -371824 -473810
23586 -473810 -348315 -263250 -169035 -119789 7784 97137 24894 1598 -73120 -196689 -257307
23575 -257307 -249596 -224653 -188694 -139920 -122652 -127758 80722 117076 59763 68103 74139 57763
$$ packed form
23654B3829M2059m902J12576l3134k15308j19681p3577J31979J94006J04811M5301
23643B07959J2543k06178k6888k2696O4613O3367j59145N6829J43073P9237p3022
23632A39692k8646q6613o2549l4645m2633M1920j0854R071J65003j6800p6679
23621c733o3212q3426J34615Q4549J442J00008p8374j87987j340J02824m7597
23610d2231N6776K4463m4207m7145j4781J44537R83K4060j92707j22972l255J17187
23598i9292K93l9771q7638K0114K8546j75684L6454J4600j21261O1161r346j01986
23586d73810J25495Q5065R4215M9246J27573Q9353p2243k3296p4718j23569o0618
23575b57307P711K4943L5959M8774J7268n106K08480L6354n7313Q340O036j6376
$$ plain form
23563 57763 -23300 67911 32375 4589 -42673 -163266 -229451 -159666 -25042 -27952 31106
23552 31106 6817 -35717 4071 193646 234658 -20491 118623 264397 453791 638063
23542 638063 503618 391137 304149 114208 -1093 23026 81889 85101 -217952 -257693 -123212
23531 -123212 42103 50431 -45419 -101636 -76536 -69729 -156492 -178409 -302272 -280025 -265403
23520 -265403 -309060 -219377 -86334 -82322 -100845 -153599 -279773 -298469 -245448 -302676 -158104
23509 -158104 -49978 -74415 34367 117374 133180 142375 22936 20740 74298 -2862 -16494
23498 -16494 -1565 -35632 -114619 -163458 -194315 -328999 -202474 -148227 -108802 -219628 -160134
23487 -160134 -215026 -321664 -247780 -129334 -70797 -57062 -204880 -351859 -377682 -186295
$$ packed form
23563E7763q1063R1211l5536k7786m7262j20593o6185O9785J34624k910N9058
23552C1106k4289m2534L9788J89575M1012k55149J39114J45774J89394J84272
23542F38063j34445j12481q6988j89941j15301K4119N8863L212l03053l9741J34481
23531a23212J65315Q328r5850n6217K5100O807q6763k1917j23863K2247J4622
23520b65403m3657Q9683J33043M012j8523n2754j26174j8696N3021n7228J44572
23509a58104J08126k4437J08782Q3007J5806R195j19439k196N3558p7160j3632
23498a6494J4929l4067p8987m8839l0857j34684J26525N4247L9425j10826N9494
23487a60134n4892j06638P3884J18446N8537J3735j47818j46979k5823J91387
$$ plain form
23477 -186295 -173802 -71765 -28367 -132326 -158967 -102339 10033 88801 208981 163930 118778
23466 118778 20531 -13638 91189 69918 60361 -236043 -355100 -247908 -129917 -142188 -132663
23455 -132663 -161012 -101433 19330 33172 -81101 -107508 18475 -177306 -120966 -103347 -183451
23444 -183451 -209155 -95450 -99137 77908 46144 161771 59897 65280 -31638 -31606 -48445 -100477
23432 -100477 -178706 -192141 -112897 -25657 48524 -7900 -109531 -191688 -10287 84615 164720
23421 164720 265366 12462 -116031 -58278 71791 -25801 -39938 -33538 49238 57969 9337
23410 9337 -48408 -71288 53691 152756 52598 -44449 -204583 -225264 -26116 191824 268518
23399 268518 203846 51958 94569 76985 -33351 -44560 -151600 -151022 -31265 152004 -577
$$ packed form
23477a86295J2493J02037M3398j03959k6641N6628J12372P8768J20180m5051m5152
23466A18778r8247l4169J04827k1271r557k96404j19057J07192J17991j2271R525
23455a32663k8349N9579J20763J3842j14273k6407J25983j95781N6340J7619q0104
23444a83451k5704J13705l687J77045l1764J15627j01874N383r6918L2j6839n2032
23432a00477p8229j3435P9244Q7240P4181n6424j01631q2157J81401R4902Q0105
23421A64720J00646k52904j28493N7753J30069r7592j4137O400Q2776Q731m8632
23410I337n7745k2880J24979R9065j00158r7047j60134k0681J99148K17940P6694
23399B68518o4672j51888M2611j7584j10336j1209j07040N78J19757J83269j52581
$$ plain form
23388 -577 15169 159397 115003 48331 -31937 -188706 -298501 -336962 -342146 -341350 -363899 -287529
23376 -287529 -151429 -22021 7610 -97064 -146391 -123661 25010 4237 -130415 49029
23366 49029 191376 75757 14221 -192239 -251574 28790 126060 121381 161998 138534 175319
23355 175319 152267 13888 45354 212143 121601 37298 203288 214793 7499 -213327
23345 -213327 -314308 -338545 -274821 -183593 -89919 31 98419 147312 88640 133673 152390
23334 152390 31314 -119860 -134068 -123270 -190957 -313825 -185927 -285235 -176691 -59778
23324 -59778 -38733 64455 98091 142539 171080 154805 115104 -21437 -146407 -180705 -236681
23313 -236681 -302293 -427245 -272709 -206996 -197338 -38868 -24271 58990 34223 -175498 -241679
$$ packed form
23388e77J5746J44228m4394o6672q0268j56769j09795l8461n184P96k2549P6370
23376b87529J36100J29408K9631j04674m9327K2730J48671k0773j34652J79444
23366D9029J42347j15619o1536k06460n9335K80364R7270m679M0617k3464L6785
23355A75319k3052j38379L1466J66789r0542q4303J65990J1505k07294k20826
23345b13327j00981k4237O3724R1228R3674Q9950R8388M8893n8672M5033J8717
23334A52390j21076j51174j4208J0798o7687j22868J27898r9308J08544J16913
23324e9778K1045J03188L3636M4448K8541j6275l9701j36541j24970l4298n5976
23313b36681o5612j24952J54536O5713R658J58470J4597Q3261k4767k09721o6181
$$ plain form
23302 -241679 -125497 169335 380420 302527 238857 157782 53923 -111796 -255440 -246361
23292 -246361 -241888 -249127 -101670 -59930 7171 115679 27661 28603 1211 -120590 -67739 -183345
23280 -183345 -222283 -212497 -255173 -371649 -294472 -381361 -419855 -223780 -33339 11699 -66238
23269 -66238 81642 32854 -98261 -84511 -203141 -117677 32937 146406 96680 -6519
23259 -6519 70860 158262 94585 109089 129178 80393 3168 61933 137981 179543 68445 2589
23247 2589 24914 -198158 -207394 -52268 -133288 -81433 142177 126167 -19713 -126824 -315795
23236 -315795 -302745 -93377 -39322 -45654 90471 118008 152514 163777 14102 -136566 -63432
23225 -63432 62225 -53723 -133689 -118626 -76119 -58483 -28074 -151876 -148328 54368 93706
$$ packed form
23302b41679J16182K94832K11085p7893o3670q1075j03859j65719j43644R079
23292b46361M473p239J47457M1740O7101J08508q8018R42k7392j21801N2851j15606
23280a83345l8938R786m2676j16476P7177q6889l8494J96075J90441M5038p7937
23269f6238J47880m8788j31115J3750j18630Q5464J50614J13469m9726j03199
23259f519P7379Q7402o3677J4504K0089m8785p7225N8765P6048M1562j11098o5856
23247B589K2325k23072r236J55126q1020N1855K23610j6010j45880j07111j88971
23236c15795J3050K09368N4055o332J36125K7537L4506J1263j49675j50668P3134
23225f3432J25657j15948p9966J5063M2507J7636L0409j23802L548K02696L9338
$$ plain form
23214 93706 190979 201872 41792 166421 129671 177449 135340 -78095 -165364 15799 167346
23203 167346 128245 142331 91158 -437 -25541 -1955 -26763 -101739 -130304 -69423 19642
23192 19642 -137257 -232586 -164504 -230569 11760 191243 137487 48580 -169856 -288773 -278852
23181 -278852 -312027 -223719 -30930 1247 -14366 30189 -49315 -129894 -92820 -194860 -241534
23170 -241534 -175002 -3198 -72443 -90736 -55767 14747 -18492 -89292 -143835 -22900 70477
23159 70477 166492 -74003 -113204 -37768 -67546 -114680 -278174 -293821 -72533 -5925 13436
23148 13436 -38486 -165802 -265001 -244329 -60505 27601 63677 139027 124730 126127 93760
23137 93760 73761 -28654 -53545 126861 -49338 -16087 9410 -40527 -36513 16601 107860
$$ packed form
23214I3706R7273J0893j60080J24629l6750M7778m2109k13435q7269J81163J51547
23203A67346l9101J4086n1173r1595k5104K3586k4808p4976k8565O0881Q9065
23192A9642j56899r5329O8082o6065K42329J79483n3756q8907k18436j18917R921
23181b78852l3175Q8308J92789L2177j5613M4555p9504q0579L7074j02040m6674
23170b41534O6532J71804o9245j8293L4969P0514l3239p0800n4543J20935R3377
23159G0477R6015k40495l9201P5436k9778m7134j63494j5647K21288O6608J9361
23148A3436n1922j27316r9199K0672J83824Q8106L6076P5350j4297J397l2367
23137I3760j9999j02415k4891J80406j76199L3251K5497m9937M014N3114R1259
$$ plain form
23126 107860 149325 40662 -82435 8867 81595 72920 -66790 -140193 -135085 -173053 -134892
23115 -134892 -126317 -40250 -33782 -29684 18751 -174036 -284895 -278974 -114640 -75784 -124631 -264757
23103 -264757 -215167 -134390 -126025 -218622 -153699 -27964 -157697 -279935 -242844 -89651 -110411
23092 -110411 -98769 -146009 -202237 -237910 -119692 -248280 -357290 -126686 52393 -46379
23082 -46379 -74060 -24782 63430 28163 -104947 -193713 -198540 -249519 -297381 -326665 -327115 -204779
23070 -204779 -154244 -70660 81262 8124 -116947 -302225 -368099 -273859 -122127 82591
23060 82591 274261 233856 169062 78774 -48668 103098 242969 95291 4813 -215211
23050 -215211 -232421 -69304 -175879 -129205 -29114 -14115 -36803 72921 204412 376418
$$ packed form
23126A07860M1465j08663j23097R1302P2728q675j39710p3403N108l7968L8161
23115a34892Q575Q6067O468M098M8435j92787j10859N921J64334L8856m8847j40126
23103b64757M9590Q0777Q365r2597O4923J25735j29733j22238L7091J53193k0760
23092a10411J1642m7240n6228l5673J18218j28588j09010K30604J79079r8772
23082d6379k7681M9278Q8212l5267j33110q8766m827n0979m7862k9284m50J22336
23070b04779N0535Q3584J51922p3138j25071j85278o5874R4240J51732K04718
23060H2591J91670m0405o4794r0288j27442J51766J39871j47678r0478k20024
23050b15211j7210J63117j06575M6674J00091J4999k2688J09724J31491J72006
$$ plain form
23040 376418 322921 49019 -52581 -63794 -122343 -59728 -189588 -201643 -181181 -97009 15051
23029 15051 166172 192761 -42455 -81818 -34757 38047 20744 -71595 -151886 -70321 -254790
23018 -254790 -268316 -84739 6713 -459 -146991 -197549 -197442 -204405 10668 -17655 -18534 1083
23006 1083 -70246 -74413 -219947 -205896 -185525 -90827 -83662 -92973 -139034 -84074 -7895 126976
22994 126976 243916 302509 210775 99684 -78856 -288451 -355103 -304769 -202423 -319785
22984 -319785 -587723 -383969 -130335 68429 47091 68671 7190 -92105 -163500 47393
22974 47393 73469 -109069 -121864 -28554 -9833 142022 202114 86622 33643 -125901 -198916
22963 -198916 -116878 22879 -42975 -36580 -62862 59429 174022 182614 218460 190592 46033
$$ packed form
23040C76418n3497k73902j01600j1213n8549O2615j29860j2055K0462Q4172J12060
23029A5051J51121K6589k35216l9363M7061P2804j7303r2339q0291Q1565j84469
23018b54790j3526J83577R1452p172j46532n0558J07o963K15073k8323q79J9617
23006A083p1329m167j45534J4051K0371R4698P165r311m6061N4960P6179J34871
22994A26976J16940N8593r1734j11091j78540k09595o6652N0334J02346j17362
22984c19785k67938K03754K53634J98764k1338K1580o1481r9295p1395K10893
22974D7393K6076j82538j2795R3310J8721J51855O0092j15492n2979j59544p3015
22963a98916Q2038J39757o5854O395k6282J22291J14593Q592L5846k7868j44559
$$ plain form
22952 46033 -1382 -26109 -18495 -20528 22314 9565 -71271 -155751 -192024 -97104 -27720 -79036
22940 -79036 -197535 -167190 -178247 -102970 -50679 111382 297383 294149 73608 -191660 -199914
22929 -199914 3369 -10767 3454 131560 97695 -915 96386 43117 -80687 -108217 101375
22918 101375 117155 1704 -68372 -174306 -246845 -359410 -313470 -182742 -157311 -278862
22908 -278862 -232169 -290215 -318806 -276336 -168135 -268945 -252840 37129 44627 -100449 -92249
22897 -92249 -152520 -102830 -316234 -299152 -176061 -181658 -134217 -153943 -238539 -316549 -279825
22886 -279825 -137695 8039 -47430 -55778 -72791 63042 101906 16046 -37574 -37683 -101382
22875 -101382 -24141 -5709 -74971 10493 82073 51730 -127601 -200054 -144568 49068 62416
$$ packed form
22952D6033m7415k4727P614k033M2842j2749q0836q4480l6273R4920O9384n1316
22940g9036j18499L0345j1057P5277N2291J62061J86001l234k20541k65268q254
22929a99914K03283j4136J4221J28106l3865r8610R7301n3269j23804k7530K09592
22918A01375J5780j15451p0076j05934p2539j12565M5940J30728K5431j21551
22908b78862M6693n8046k8591M2470J08201j00810J6105K89969P498j45076Q200
22897i2249o0271M9690k13404J7082J23091n597M7441j9726q4596p8010L6724
22886b79825J42130J45734n5469q348j7013J35833L8864q5860n3620j09o3699
22875a01382P7241J8432o9262Q5464P1580l0343j79331p2453N5486J93636J3348
$$ plain form
22864 62416 -44570 -325786 -346077 -130817 8168 -30196 -107994 -141426 -129341 -3284 183077
22853 183077 110781 -57047 22870 161452 112138 -20865 175485 327178 135804 31987
22843 31987 -86209 -165613 -240365 -311845 -229731 -285648 -209528 -87608 60215 16608 109199
22832 109199 84508 26894 -94095 -115839 -85349 -96425 -153283 -69635 -5782 6404 -135731
22821 -135731 26116 237872 194115 -41611 -36123 -28662 -125747 -212056 -343825 -368099 -255567
22810 -255567 -55575 -28984 -126930 -44660 -23210 -6929 44716 -32109 -185469 -310180 -294899
22799 -294899 -194074 -254651 -195375 -149608 -106633 -69171 53679 93701 117489 136120 341
22788 341 -78297 -145379 -184864 -179174 -138066 64819 4306 -23154 124635 -23268 -130808
$$ packed form
22864F2416j06986k81216k0291K15260J38985l8364p7798l3432J2085J26057J86361
22853A83077p2296j67828P9917J38582m9314j33003J96350J51693j91374j03817
22843C1987j18196p9404p4752p1480Q2114n5917P6120J21920J47823m3607R2591
22832A09199k4691n7614j20989k1744L0490j1076n6858Q3648O3853J2186j42135
22821a35731J61847K11756m3757k35726N488P461r7085q6309j31769k4274J12532
22810b55567J99992K6591r7946Q2270K1450J6281N1645p6825j53360j24711J5281
22799b94899J00825o0577N9276M5767M2975L7462J22850M0022K3788J8631j35779
22788C41p8638o7082l9485N690M1108K02885o0513k7460J47789j47903j07540
$$ plain form
22777 -130808 -182277 -227086 -70395 -48914 19027 185338 232006 166894 -19772 -36747 -172727
22766 -172727 -128073 -40149 -36100 -108028 -194578 -418887 -376546 -435570 -221805 -94580 -102224
22755 -102224 -127700 15253 68806 76183 46259 53105 280501 440246 350322 105331 -29451
22744 -29451 -132350 -318119 -299806 -216337 39861 190041 217106 231156 252163 211784 222421
22733 222421 45075 -104501 -106304 -219177 -277661 -123692 33956 111940 -19052 -101597
22723 -101597 -46808 -145980 -42452 118846 50580 -103672 -140152 -63836 131720 106538 49536
22712 49536 -83059 -32322 52708 195600 141108 -34128 -108878 -207521 -115338 144498 210558
22701 210558 114534 79530 97324 33010 -177159 -117595 2637 71491 20438 -35826 10015
$$ packed form
22777a30808n1469m4809J56691K1481O7941J66311M6668o5112j86666j6975j35980
22766a72727M4654Q7924M049p1928q6550k24309M2341n9024K13765J27225p644
22755a02224k5476J42953N3553P377k9924O846K27396J59745q9924k44991j34782
22744b9451j02899j85769J8313Q3469K56198J50180K7065J4050K1007m0379J0637
22733B22421j77346j49576j803j12873n8484J53969J57648P7984j30992q2545
22723a01597N4789r9172J03528J61298o8266j54252l6480P6316J95556k5182n7002
22712D9536j32595N0737Q5030J42892n4492j75236p4750r8643R2183K59836O6060
22701B10558r6024l5004J7794o4314k10169N9564J20232O8854n1053n6264M5841
$$ plain form
22690 10015 -5314 -134252 -237432 -299505 -170513 -177027 -239938 -83328 19090 183579 198250
22679 198250 -227 -34640 44009 13976 44673 -62904 -96155 -165611 -104197 46974 114363
22668 114363 120934 65263 116831 203499 111964 37146 35612 -7223 39531 -935 -113551 9259
22656 9259 21725 26902 -36456 -234718 -175510 -267059 -258556 -21912 27021 -52307 -51420 -94443
22644 -94443 -141647 -89267 -41219 -129668 -64052 -71498 7707 42993 51747 145703 276390 311808
22632 311808 287092 382272 232226 7052 49280 34959 -36880 -115072 -271610 -341587 -328706
22621 -328706 -282082 -290670 -168868 -18429 -132342 -320545 -307436 -324931 -428145 -378148 -320447
22610 -320447 -249910 -78814 85971 208488 88057 -31496 -102757 -50645 -36655 139186
$$ packed form
22690A0015j5329j28938j03180o2073J28992o514o2911J56610J02418J64489J4671
22679A98250j98477l4413P8649l0033L0697j07577l3251o9456O1414J51171O7389
22668A14363O571n5671N1568Q6668r1535p4818j534m2835M6754m0466j12616J22810
22656I259J2466N177o3358j98262N9208r1549Q503K36644M8933p9328Q87m3023
22644i4443m7204N2380M8048q8449O5616p446P9205L5286Q754R3956J30687L5418
22632C11808k4716R5180j50046k25174M2228j4321p1839p8192j56538o9977J2881
22621c28706M6624q588J21802J50439j13913j88203J3109j7495j03214M9997N7701
22610c20447P0537J71096J64785J22517j20431j19553p1261N2112J3990J75841
$$ plain form
22600 139186 131025 40118 6979 -22556 37882 -43469 -128748 -153711 -201059 -153838 -159806 -143561
22588 -143561 -215261 -312622 -218548 -218859 -135741 -59439 -161457 -287891 -70516 36997 -71578
22577 -71578 -147151 -319508 -267610 -218943 -124065 -21856 111665 328421 195382 -57495
22567 -57495 -108766 -171100 -147344 -31170 219768 303602 208942 117819 235968 270132 175643
22556 175643 197505 146217 244825 419432 423891 177108 120954 -5017 -132657 49710 122965
22545 122965 81096 61113 -83272 -114710 103580 225505 258622 166484 197145 76163 -114831
22534 -114831 -128558 -35064 -190918 -243365 -226574 -18597 192255 130271 59878 8950 -109116
22523 -109116 -118820 55574 34357 -1781 152314 196466 167074 204253 116657 46976 69895
$$ packed form
22600A39186q161r0907l3139k9535O0438q1351q5279k4963m7348M7221n968J6245
22588a43561p1700r7361R4074l11Q3118P6302j02018j26434K17375J07513j08575
22577g1578p5573j72357N1898M8667R4878J02209J33521K16756j33039k52877
22567e7495n1271o2334K3756J16174K50938Q3834r4660r1123J18149L4164r4489
22556A75643K1862n1288R8608J74607M459k46783n6154j25971j27640J82367P3255
22545A22965m1869j9983j44385l1438K18290J21925L3117r2138L0661j20982j90994
22534a14831j3727R3494j55854n2447J6791K07977K10852o1984p0393n0928j18066
22523a09116r704J74394k1217l6138J54095M4152k9392L7179q7596o9681K2919
$$ plain form
22512 69895 229674 336340 116663 -139296 -82998 75587 193857 284008 120103 54914
22502 54914 -37469 -52766 146407 127705 51139 42049 -272736 -390144 -502535 -398214 -265470
22491 -265470 -151722 -61968 130719 218750 139071 31937 -23232 84872 254727 269668
22481 269668 84877 42062 89664 20366 -6035 -10454 -50674 -78727 -70316 -68909 111147 347832
22469 347832 466789 519425 413210 254221 83663 -36477 22181 234653 285913 138823
22459 138823 40037 -56137 -120658 124302 149788 58507 -27330 -188675 -186659 -188634 -127914
22448 -127914 21478 63354 118081 132952 195782 94906 -140567 -319648 -217478 -200708
22438 -200708 -250499 -223713 -113209 26420 -29719 -117921 -274891 35056 189590 122897
$$ packed form
22512F9895J59779J06666k19677k55959N6298J58585J18270R0151j63905o5189
22502E4914r2383j5297J99173j8702p6566r090l14785j17408j12391J04321J32744
22491b65470J13748Q9754J92687Q8031p9679j07134n5169J08104J69855J4941
22481B69668j84791m2815M7602o9298k6401m419m0220k8053Q411J407J80056K36685
22469C47832J18957N2636j06215j58989j70558j20140N8658K12472N1260j47090
22459A38823r8786r6174o4521K44960K5486r1281q5837j61345K016j975O0720
22448a27914J49392M1876N4727J4871O2830j00876k35473j79081J02170J6770
22438b00708m9791K6786J10504J39629n6139q8202j56970L09947J54534o6693
$$ plain form
22428 122897 139178 207268 199656 180932 8608 -111855 -212462 -206374 -160201 -258147 -291289
22417 -291289 -183642 -142964 -8871 75018 -10225 13622 -15198 4397 -122576 -156408 -68606
22406 -68606 -51797 118713 128280 -113013 -183621 -339610 -291021 -176196 -129519 -74025 -116926
22395 -116926 -218864 -218800 -96524 -25005 142787 111294 -1772 37116 -28440 -11774 -87522
22384 -87522 -33177 -86125 -43615 26122 169831 201327 69044 95970 47049 -5787 204476
22373 204476 192023 22743 174632 334207 307059 179295 264640 251461 105989 80137
22363 80137 -24509 -105439 -272634 -201575 -83987 7277 39829 89757 28537 -111957 -59410
22352 -59410 -76561 -37436 217709 292585 213175 305228 289477 227521 31669 -194476 -248290
$$ packed form
22428A22897J6281O8090p612j8724j72324j20463j00607O088M6173r7946l3142
22417b91289J07647M0678J34093Q3889q5243K3847k8820J9595j26973l3832Q7802
22406f8606J6809J70510R567k41293p0608j55989M8589J14825M6677N5494m2901
22395a16926j01938O4J22276P1519J67792l1493j13066L8888o5556J6666p5748
22384h7522N4345n2948M2510O9737J43709L1496j32283K6926m8921n2836K10263
22373B04476j2453j69280J51889J59575k7148j27764Q5345j3179j45472k5852
22363H0137j04646q0930j67195P1059J17588R1264L2552M9928o1220j40494N2547
22352e9410j7151L9125K55145P4876p9410R2053j5751o1956j95852k26145n3814
$$ plain form
22341 -248290 -192659 -54649 -34954 -221787 -171715 15409 105062 8089 188778 299169
22331 299169 109069 -197476 -266134 -151331 -31251 733 60347 78949 79482 -19979 -162833
22320 -162833 -34669 -114800 -157610 -15316 -5865 77862 101160 70661 -91750 -104254 -116545
22309 -116545 -108919 -95713 45418 225246 346485 220515 25125 984 -17253 -18547 5403
22298 5403 171684 45323 -5626 50228 122437 107668 119392 2218 -194146 -250957 -94294
22287 -94294 -103073 -77106 72427 186311 222849 175552 73480 118394 124472 88504 26317
22276 26317 5482 -106536 -103728 61395 37892 -7600 -18382 37338 131641 6252 9871
22265 9871 -95461 -203050 -106033 112542 -14712 -62990 -77874 -147192 -20829 69660 -16854
$$ packed form
22341b48290N5631J38010J9695j86833N0072J87124Q9653r6973J80689J10391
22331B99169j90100l06545o8658J14803J20080L1984N9614J8602N33r9461j42854
22320a62833J28164q0131m2810J42294R451Q3727K3298l0499j62411j2504j2291
22309a16545P626J3206J41131J79828J21239j25970j95390k4141j8237j294K3950
22298E403J66281j26361n0949N5854P2209j4769J1724j17174j96364n6811J56663
22287i4294q779K5967J49533J13884L6538m7297j02072M4914O078l5968o2187
22276B6317k0835j12018K808J65123k3503m5492j0782N5720R4303j25389L619
22265I871j05332j07589R7017K18575j27254m8278j4884o9318J26363R0489q6514
$$ plain form
22254 -16854 -106917 -41403 171879 368537 174323 -48701 -131479 -261972 -158185 64624
22244 64624 245820 160104 166696 239845 200613 112137 -75096 -97183 14968 12485 32274
22233 32274 23740 73896 88931 22161 143985 108092 -16139 -88476 -99852 -91178 -102540 -65648
22221 -65648 34173 97673 31012 -118945 -189697 -30372 9980 43414 -48441 -184273 -130266
22210 -130266 -106858 -143758 -16393 192909 230971 156498 118053 179818 75305 -1371 36100
22199 36100 66067 41005 12533 -26042 122173 322800 228373 191886 191823 159404 68518 95124
22187 95124 224145 322733 279453 93893 64331 117387 68400 -60059 -80275 -78644 -20015
22176 -20015 35499 98542 123337 173991 1045 -53073 -17341 26045 -17854 4512 111456
$$ packed form
22254a6854r0063O5514K13282J96658j94214k23024q2778j30493J03787K22809
22244F4624J81196q5716O592P3149l9232q8476j87233k2087J12151k483J9789
22233C2274q534N0156J5035o6770J21824l5893j24231p2337j1376Q674j1362L6892
22221f5648R9821O3500o6661j49957p0752J59325M0352L3434r1855j35832N4007
22210a30266K3408l6900J27365K09302L8062p4473l8445O1765j04513p6676L7471
22199C6100K9967k5062k8472l8575J48215K00627r4427l6487o3l2419r0886K6606
22187I5124J29021R8588m3280j85560k9562N3056m8987j28459k0216J631N8629
22176b0015N5514O3043K4795N0654j72946n4118L5732M3386m3899K2366J06944
$$ plain form
22165 111456 38260 28075 158808 197306 233371 126645 95385 160097 96952 -48682 -110936
22154 -110936 -169279 -193578 -156883 -208315 -274502 -396842 -421631 -265627 -223675 -175930 45354
22143 45354 43688 -12111 4676 -2510 -82583 -93274 78876 177228 91739 69084 112018 204892
22131 204892 166462 73044 -81018 -207596 -185735 -268656 -211720 -157974 -195429 -165340 -86674
22120 -86674 26460 141320 159715 83179 2020 79112 179889 234847 164770 86993 209726
22109 209726 299570 108798 -45805 -126216 -92774 -173856 -332078 -323259 -260054 -115393 -64647
22098 -64647 -51211 92493 121001 -82599 -294820 -236719 -137190 -111875 -122027 -206403 -83682
22087 -83682 858 -81043 -94248 -131180 -163864 -76813 -104133 -169632 -334914 -333012 -233831 -214428
$$ packed form
22165A11456p3196j0185J30733L8498L6065j06726l1260O4712o3145j45634o2254
22154a10936n8343k4299L6695n1432o6187j22340k4789J56004M1952M7745K21284
22143D5354j666n5799J6787p186q0073j0691J72150R8352q5489k2655M2934R2874
22131B04892l8430r3418j54062j26578K1861q2921N6936N3746l7455L0089P8666
22120h6674J13134J14860J8395p6536q1159P7092J00777N4958p0077p7777J22733
22109B09726Q9844j90772j54603q0411L3442q1082j58222Q819O3205J44661N0746
22098f4647J3436J43704K8508k03600k12221N8101R9529K5315j0152q4376J22721
22087h3682Q4540q1901j3205l6932l2684Q7051k7320o5499j65282J902R9181J9403
$$ plain form
22075 -214428 -193976 -115782 -298 39316 163556 105660 2244 -108322 -188677 -93823 46447
22064 46447 180911 -18972 -159656 -93057 -61352 -98012 -211743 -198470 -151872 -177493 -249974
22053 -249974 -120920 -57741 57600 170341 78274 37214 44811 -40609 -104048 29515 143291
22042 143291 95993 105215 238215 168911 47072 -212270 -237177 -218598 -147365 -89659 -93430
22031 -93430 -212296 -162948 -95823 10687 -113219 -282768 -345306 -319752 -172719 -263809 -222876
22020 -222876 46680 212805 224699 197121 -24975 -147529 -107621 -3882 36727 160979
22010 160979 233900 135509 14694 4112 29476 90106 127327 161722 21285 8797 -50318
21999 -50318 38278 53193 159383 404569 374366 260791 30402 -65784 -122690 -211538 -155534
$$ packed form
22075b14428K0452P8194J15484L9614J24240n7896j03416j10566q0355R4854J40270
22064D6447J34464j99883j40684O6599L1705l6660j13731J3273M6598k5621p2481
22053b49974J29054O3179J15341J12741r2067m1060P597q5420o3439J33563J13776
22042A43291m7298R222J33000o9304j21839k59342k4907J8579P1233N7706l771
22031i3430j18866M9348O7125J06510j23906j69549o2538K5554J47033r1090M0933
22020b22876K69556J66125J1894k7578k22096j22554L9908J03739M0609J24252
22010A60979P2921r8391j20815j0582K5364O0630L7221L4395j40437j2488n9115
21999e0318Q8596J4915J06190K45186l0203j13575k30389r6186n6906q8848N6004
$$ plain form
21988 -155534 -134191 -154693 -276153 -163004 -160775 -277729 -138077 153683 276936 210367
21978 210367 206469 -57171 -149037 -155969 -62150 -20160 118397 159859 51795 1651 -2819
21967 -2819 -53284 -122435 -123637 94087 89986 9902 -52280 -197789 -181094 65660 128668 84774
21955 84774 -14025 18494 100871 155839 161899 138115 -23527 -27134 9489 74901 -36321 901
21943 901 175956 232096 1115 -108520 -131021 -213299 -90017 -129105 -72230 290655 364803
21932 364803 246714 245496 88760 -167892 -289205 -267575 -171501 -126886 -68241 -28057 -120363
21921 -120363 -157601 -72098 -4236 28458 -1715 7679 70430 105194 105204 206434 244675 253813
21909 253813 205988 211653 154657 107761 -154441 -92306 92518 219488 334437 330346 353294
$$ packed form
21988a55534K1343k0502j21460J13149K229j16954J39652K91760J23253o6569
21978B10367l898k63640r1866o932R3819M1990J38557M1462j08064n0144m470
21967b819n0465o9151j202K17724m101q0084o2182j45509J6695K46754O3008m3894
21955H4774r8799L2519Q2377N4968O060k3784j61642l607L6623O5412j11222L7222
21943I01J75055N6140k30981j09635k2501q2278J23282l9088N6875L62885P4148
21932C64803j18089j218j56736k56652j21313K1630R6074M4615N8645M0184r2306
21921a20363l7238Q5503O7862L2694l0173R394O2751L4764J0J01230L8241R138
21909B53813m7825N665n6996m6896k62202O2135J84824J26970J14949m091K2948
$$ plain form
21898 353294 302945 298780 231418 120568 180616 241744 159061 41420 248444 301398 151771
21887 151771 62526 97332 58304 -46563 -3603 73238 202167 257998 308673 174230 280048
21876 280048 144965 86665 -44042 -137968 -112125 5865 6797 44373 179249 151631 111711
21865 111711 94322 219772 281513 248169 150570 72740 -60993 28419 219254 169405 247517
21854 247517 152664 -138836 -207884 -55088 38755 -72742 -58206 -152809 -155022 -36585 -134405
21843 -134405 -97471 127078 225399 264616 358018 234120 64108 -7302 -56032 -165264 -102434
21832 -102434 -41256 -40841 -126213 -162713 -432091 -320954 -331862 -330202 -387362 -309440 -203468
21821 -203468 -206280 -198334 -134223 39315 10410 79972 168940 198345 75885 47114 163717
$$ packed form
21898C53294n0349m165o7362j10850O0048O1128q2683j17641K07024N2954j49627
21887A51771q9245L4806l9028j04867M2960P6841J28929N5831N0675j34443J05818
21876B80048j35083n8300j30707r3926K5843J17990R32L7576J34876k7618l9920
21865A11711j7389J25450O1741l3344r7599p7830j33733Q9412J90835m9849P8112
21854B47517r4853k91500o9048J52796R3843j11497J4536r4603k213J18437r7820
21843a34405L6934K24549R8321L9217R3402j23898j70012p1410m8730j09232O2830
21832a02434O1178M15q5372l6500k69378J11137j0908J660n7160P7922J05972
21821b03468k812P946O4111J73538k8905O9562Q8968K9405j22460k8771J16603
$$ plain form
21810 163717 175206 -32699 -140836 109268 129126 -135392 -84581 151142 205975 185161
21800 185161 78797 -35383 55239 -20204 -291945 -195055 -168024 -127312 -82009 16421 39839
21789 39839 86298 -22203 -38236 221521 306103 185540 200361 277010 354567 222900 181
21778 181 -108969 -155410 -16406 60079 -79000 -144274 -51104 14392 14405 88967 -24601 -152387
21766 -152387 -105079 -53360 -42910 108110 23765 104180 25580 -61878 -102104 -156211 -87479
21755 -87479 -47238 40994 66248 -15656 -51698 -27053 72717 68842 109707 17080 1763 143143
21743 143143 -23638 -236787 -321942 -516513 -431367 -210335 -106259 -26104 68615 71295 -61971
21732 -61971 -152693 54969 -17592 -40295 -36295 -4883 -79585 -178876 -180745 -128423 -114206 49350
$$ packed form
21810A63717J1489k07905j08137K50104J9858k64518N0811K35723N4833k0814
21800A85161j06364j14180R0622p5443k71741R6890K7031M0712M5303R8430K3418
21789C9839M6459j08501j6033K59757Q4582j20563J4821P6649P7557j31667k22719
21778A81j09150m6441J39004P6485j39079o5274R3170O5496J3P4562j13568j27786
21766a52387M7308N1719J0450J51020q4345Q0415p8600q7458m0226n4107O8732
21755h7479M0241Q8232K5254q1904l6042K4645R9770l875M0865r2627j5317J41380
21743A43143j66781k13149q5155j94571Q5146K21032J04076Q0155R4719K680j33266
21732f1971r0722K07662p2561k2703M000L1412p4702r9291j869N2322J4217J63556
$$ plain form
21720 49350 57613 -33198 -21400 -49596 -165803 -303368 -240120 -84153 121418 167072 375856
21709 375856 319822 125179 113809 -135338 -282694 -455696 -451715 -353133 -412050 -475143 -467546
21698 -467546 -373382 -348049 -331020 -290661 -171180 -278197 -233871 -276298 -201196 -100893 -231627
21687 -231627 -225121 -152646 -253501 -221020 -140933 59180 65853 116905 -10817 -13463 64902
21676 64902 102352 167160 307844 261000 324270 137921 -16842 -43331 -21017 99953 174721
21665 174721 149771 63673 -125444 -74652 147489 199020 110318 74309 -5193 -56233 -80748
21654 -80748 -154526 -94507 -30268 16381 1233 42255 117552 179532 145577 95330 38492 4819
21642 4819 -115282 -201132 -146328 -87948 -5348 -90035 -268496 -127478 26996 53740 67444
$$ packed form
21720D9350Q263r0811J1798k8196j16207j37565O3248J55967K05571M5654K08784
21709C75856n6034j94643j1370k49147j47356j73002L981R8582n8917o3093P597
21698d67546R4164K5333J7029M0359J19481j07017M4326m2427P5102J00303j30734
21687b31627O506P2475j00855L2481Q0087K00113O673N1052j27722k646P8365
21676F4902L7450O4808J40684m6844O3270j86349j54763k6489K2314J20970P4768
21665A74721k4950q6098j89117N0792K22141N1531q8702l6009p9502n1040k4515
21654h0748p3778O0019O4239M6649j5148M1022P5297O1980l3955n0247n6838l3673
21642D819j20101q5850N4804N8380Q2600q4687j78461J41018J54474K6744J3704
$$ plain form
21631 67444 77958 188226 209064 160839 85624 16588 85933 192208 191842 -21068 -85982
21620 -85982 35936 217655 225295 82922 121441 145065 98886 12620 -50991 107031 117961
21609 117961 6998 -93990 -97896 30790 96725 -65879 -837 -15989 -108235 -58418 73839
21598 73839 78248 46850 145908 227790 252243 263996 134614 142931 114024 123751 57765 92062
21586 92062 114711 96049 109775 76076 151173 96371 74224 61775 166839 156045 31118
21575 31118 -88230 -114532 60984 144632 56028 11018 54478 161020 210228 156236 80880
21564 80880 -39044 -147755 -162361 -65609 26680 60079 -43785 -148427 -61604 -119217 -179110
21553 -179110 -282816 -184382 -243725 -228869 -267739 -268598 -126544 -83021 97497 265077 300988
$$ packed form
21631F7444J0514J10268K0838m8225p5215o9036O9345J06275l66k12910o4914
21620h5982J21918J81719P640j42373L8519K3624m6179q6266o3611J58022J0930
21609A17961j10963j00988l906J28686O5935j62604O5042j5152r2246M9817J32257
21598G3839M409l1398R9058Q1882K4453J1753j29382Q317k8907R727o5986L4297
21586I2062K2649j8662J3726l3699P5097n4802k2147j2449J05064j0794j24927
21575C1118j19348k6302J75516Q3648q8604m5010M3460J06542M9208n3992p5356
21564H0880j19924j08711j4606R6752R2289L3399j03864j04642Q6823n7613n9893
21553a79110j03706R8434n9343J4856l8870q59J42054M3523J80518J67580L5911
$$ plain form
21542 300988 200688 -39286 -153210 -208954 -261907 -297542 -440048 -466557 -297593 -182808
21532 -182808 40202 223466 173012 151503 71719 124135 136628 160137 208129 131491 200944
21521 200944 135199 132575 126599 110401 -10116 -38603 -20438 1116 111735 103809 -2511
21510 -2511 63326 137640 172028 249853 255525 286068 49255 -158187 -139807 -155413 -79727 -83329
21498 -83329 -185458 -238952 -126179 -118500 -6321 91891 185952 185315 117477 -90776 -114348
21487 -114348 -81234 -35506 51370 56614 -3653 52940 -71579 -105022 -195221 -241296 -150393
21476 -150393 -130026 -206059 -7138 14332 -21879 -29613 69061 38414 106355 192189 -10159
21465 -10159 -128246 -81399 -130987 -125474 -203207 -135598 -81342 -85619 -39686 171212 67930
$$ packed form
21542C00988j00300k39974j13924n5744n2953l5635j42506k6509J68964J14785
21532a82808K23010J83264n0454k1509p9784N2416J2493K3509M7992p6638O9453
21521B00944o5745k624n976j6198j20517k8487J8165K1554J10619p926j06320
21510b511O5837P4314L4388P7825N672L0543k36813k07442J8380j5606P5686l602
21498h3329j02129n3494J12773P679J12179R8212R4061o37o7838k08253k3572
21487a14348L3114M5728Q6876N244o0267N6593j24519l3443r0199m6075R0903
21476a50393K0367p6033J98921K1470l6211p734R8674l0647O7941Q5834k02348
21465a0159j18087M6847m9588N513p7733O7609N4256m277M5933K10898j03282
$$ plain form
21454 67930 143869 243101 156737 25125 146900 279433 170701 200347 305625 331880 357062
21443 357062 270737 123415 75992 64926 80279 -96413 -29270 -118199 -87546 71311 20610
21432 20610 -32593 110257 206006 107131 -16346 -15883 192874 137096 136463 224174 122535 95417
21420 95417 65891 149261 265129 97752 109538 96455 -54421 -28426 -79116 -157011 -107886
21409 -107886 12726 86452 14729 -34621 68202 80986 -40256 40418 809 -43795 34937
21398 34937 -124963 -132206 179965 174188 -29728 -192569 -41099 263938 386758 329428 199401
21387 199401 155352 220414 193229 -85293 -302018 -394339 -308180 -62669 -11201 -8360 55458
21376 55458 -46386 -34756 108575 54739 257117 324249 190779 -22895 3181 195895
$$ packed form
21454F7930P5939R9232q6364j31612J21775J32533j08732K9646J05278K6255K5182
21443C57062q6325j47322m7423j1066J5353j76692O7143q8929L0653J58857n0701
21432B0610n3203J42850R5749r8875j23477M63K08757n5778o33Q7711j01639k7118
21420I5417k9526Q3370J15868j67377J1786j3083j50876K5995n0690p7895M9125
21409a07886J20612P3726p1723m9350J02823J2784j21242Q0674l9609m4604P8732
21398C4937j59900p243L12171n777k03916j62841J51470L05037J22820n7330j30027
21387A99401m4049O5062k7185k78522k16725r2321Q6159K45511N1468K841O3818
21376E5458j01844J1630J43331n3836K02378O7132j33470k13674K6076J92714
$$ plain form
21366 195895 284065 95543 -41662 -127976 -415879 -346902 -184401 -25847 -166147 -189047
21356 -189047 -117126 -91645 -93724 -104461 -136250 -100297 -262017 -497276 -296979 -267816 -43336
21345 -43336 120414 252766 140385 -36474 -77918 -157328 -217276 -185751 -42739 128483
21335 128483 133497 -98835 -107057 -68703 -55061 29470 129412 93289 134389 76846 15028 -24441
21323 -24441 -113256 -152316 -102932 -24849 87804 186672 227136 194844 187922 77821 18145
21312 18145 -111912 -340252 -464801 -515630 -291885 8251 97606 80087 15600 -78068 -147011
21301 -147011 -170512 36373 125647 59082 109549 151198 83097 37513 76756 349943 355624
21290 355624 227170 194705 158960 72639 -85447 -104424 -421 54472 -11413 -70077 -91410
$$ packed form
21366A95895Q8170j88522j37205q6314k87903O8977J62501J58554j40300k2900
21356a89047P1921K5481k079j0737l1789L5953j61720k35259K00297K9163K24480
21345d3336J63750J32352j12381j76859m1444p9410n9948L1525J43012J71222
21335A28483N014k32332q222L8354J3642Q4531R9942l6123M1100n7543o1818l9469
21323b4441q8815l9060M9384P8083J12653R8868M0464l2292o922j10101n9676
21312A8145j30057k28340j24549n0829K23745L00136Q9355j7519o4487r3668o8943
21301a47011k3501K06885Q9274o6565N0467M1649o8101m5584L9243K73187N681
21290C55624j28454l2465l5745q6321j58086j8977J04003N4893o5885n8664k1333
$$ plain form
21279 -91410 -107251 -49137 -7664 176809 155588 -34455 -71728 -64020 14189 -156557 -62277
21268 -62277 49522 219855 297158 87717 -82932 -2338 78440 97830 -29633 -263852
21258 -263852 -299653 -238057 -202558 -319629 -372533 -300185 -104839 -104738 -135832 -79051 -53734
21247 -53734 -149201 -211898 -229345 -91003 -193690 -219070 -220744 -96025 16403 -43196 -20100
21236 -20100 -115311 -284082 -161593 -194022 -188201 -129173 27205 168765 80416 -102275 -109090
21225 -109090 -11284 49688 109402 145974 -15778 -74684 -51223 39537 188580 49466 -76173
21214 -76173 3098 -132769 -228692 -198549 -133015 -19239 100858 21318 -89343 -134720 -53968
21203 -53968 6878 66081 68994 147585 175307 226609 159264 -67737 -96099 -53889 37951 29680
$$ packed form
21279i1410j5841N8114M1473J84473k1221j90043l7273P708P8209j70746R4280
21268f2277J11799J70333P7303k09441j70649Q0594Q0778J9390j27463k34219
21258b63852l5801O1596L5499j17071n2904P2348J95346J01l1094N6781K5317
21247e3734r5467o2697j7447J38342j02687k5380j674J24719J12428n9599K3096
21236b0100r5211j68771J22489l2429N821N9028J56378J41560q8349j82691o815
21225a09090R7806O0972N9714L6572j61752n8906K3461R0760J49043j39114j25639
21214g6173P9271j35867r5923L0143O5534J13776J20097p9540j10661m5377Q0752
21203e3968O0846N9203K913P8591K7722N1302o7345k27001k8362M2210R1840q271
$$ plain form
21191 29680 70377 149528 159369 255975 282935 223728 126391 174684 225259 109377 147184 100360
21179 100360 7434 185636 297187 201846 222114 108328 14554 -105571 -158093 -10728
21169 -10728 -66900 -57867 -74673 -165149 -138702 129648 271578 122225 -74398 -89530 -86079
21158 -86079 -183080 -189679 -53415 -70792 -203287 -204850 -412517 -382825 -348315 -253507 9469
21147 9469 203315 290376 9014 -117174 -188301 -158087 -153742 -98303 -89826 -41434 20954 100938
21135 100938 -49626 -46374 -25638 67156 136349 163821 -8805 -209098 -168612 28816 83456
21124 83456 -51918 -242592 -378477 -373992 -84828 52814 22948 41702 67834 72898 -76059
21113 -76059 -58723 10634 -115591 -74490 -74944 -51219 61825 4934 -35655 105840 157518
$$ packed form
21191B9680M0697P9151R841R6606K6960n9207r7337M8293N0575j15882L7807m6824
21179A00360r2926J78202J11551r5341K0268j13786r3774j20125n2522J47365
21169a0728n6172R033j6806r0476K6447K68350J41930j49353j96623j5132L451
21158h6079r7001o599J36264j7377j32495j563k07667K9692L4510R4808K62976
21147I469J93846Q7061k81362j26188p1127L0214M345N5439Q477M8392O2388P9984
21135A00938j50564L252K0736R2794O9193K7472j72626k00293M0486J97428N4640
21124H3456j35374j90674j35885M485K89164J37642k9866J8754K6132N064j48957
21113g6059J7336O9357j26225M1101m54K3725J13044n6891m0589J41495N1678
$$ plain form
21102 157518 -28610 -202337 -187885 54247 154653 14391 -63275 -170375 -249539 -128911
21092 -128911 -188191 -255378 -265406 -392169 -309315 -253333 -348459 -344912 -285683 -294626 -273816 -235903
21080 -235903 -7940 321469 341059 216977 80719 -113 -58699 -50769 128243 122274 24027
21069 24027 -33664 87929 115674 113035 237534 98259 53128 -11117 -71570 -74990 -127317
21058 -127317 -419065 -321343 -133993 -37919 -12491 57550 -71440 20991 184958 371171
21048 371171 280117 177087 156533 153109 116240 66881 145487 109649 154779 213594 159829
21037 159829 99414 141246 339399 662000 1003340 1433120 1762926 1932991 2004961 1921784
21027 1921784 1813678 1543099 1202306 956347 560793 359337 217801 232941 220355 155336
$$ packed form
21102A57518j86128j73727J4452K42132J00406j40262p7666j07100p9164J20628
21092a28911n9280o7187j0028j26763Q2854N5982r5126L547N9229q943K0810L7913
21080b35903K27963L29409J9590j24082j36258q0832n8586P930J79012n969r8247
21069B4027n7691J21593K7745k639J24499j39275m5131o4245o0453l420n2327
21058a27317k91748R7722J87350R6074K5428P0041j28990R2431J63967J86213
21048C71171r1054j03030k0554l424l6869m9359P8606l5838M5130N8815n3765
21037A59829o0415M1832J98153L22601L41340M29780L29806J70065P1970q3177
21027A921784j08106k70579l40793k45959l95554k01456j41536J5140j2586o5019
$$ plain form
21017 155336 191820 160265 264252 220767 86407 68570 106949 117051 49821 -83589 -107304
21006 -107304 -112315 -147682 -97317 -3227 -62582 -98267 -53938 -91140 -26602 -11607 2562 5217
20994 5217 -82160 -192696 -154504 -85482 -68156 -239445 -367475 -238651 23422 203472 173883
20983 173883 187665 259188 338387 408585 323639 258364 149030 247636 369071 129263 -11868
20972 -11868 -96114 -817 -35813 111644 150242 92075 -51491 -18349 -66167 -20380 -13374
20961 -13374 -39196 -116063 -239371 -105421 63421 -155759 -279299 -158346 -1430 114616
20951 114616 241529 153124 -88645 -69756 -82427 54254 389537 425827 373282 102227
20941 102227 -209056 -147686 5345 150674 179609 30414 25874 90511 128533 93846 11703
$$ packed form
21017A55336L6484l1555J03987m3485j34360j7837L8379J0102o7230j33410k3715
21006a07304n011l5367N0365R4090n9355l5685M4329l7202O4538J4995J4169K655
20994E217q7377j10536L8192O9022J7326j71289j28030J28824K62073J80050k9589
20983A73883J3782P1523P9199P0198q4946o5275j09334R8606J21435k39808j41131
20972a1868q4246R5297l4996J47457L8598n8167j43566L3142m7818M5787P006
20961a3374k5822p6867j23308J33950J68842k19180j23540J20953J56916J16046
20951A14616J26913q8405k41769J8889j2671J36681L35283L6290n2545k71055
20941A02227l11283O1370J53031J45329K8935j49195m540O4637L8022l4687q2143
$$ plain form
20930 11703 109938 64280 113604 169038 138131 103279 231012 155616 79678 151124 67309
20919 67309 -78379 -97869 17290 2712 -18959 -24044 -131283 -146643 30646 64573 87470
20908 87470 2041 -15012 -175562 -280702 -234417 -170553 -55552 -77565 22316 217334 224030
20897 224030 72622 -67395 -89910 -183311 -227788 -32300 134278 249852 255964 167896 148753
20886 148753 28091 -90634 112731 121719 210912 160197 81834 39883 36422 193916 251897
20875 251897 184741 43687 -232020 -284962 -306210 -168708 -90782 25360 -22124 45460 -10189
20864 -10189 13780 -30103 -4752 111391 103351 159930 184404 131166 76477 -98059 -165083
20853 -165083 -120396 -21546 71788 291320 200080 108446 15060 -42146 58879 39069 49726
$$ packed form
20930A1703R8235m5658M9324N5434l0907l4852J27733p5396p5938P1446q3815
20919F7309j45688j9490J15159j4578k1671n085j07239j5360J77289L3927K2897
20908H7470q5429j7053j60550j05140M6285O3864J15001k2013R9881J95018O696
20897B24030j51408j40017k2515r3401m4477J95488J66578J15574O112q8068j9143
20886A48753j20662j18725K03365Q988Q9193n0715p8363m1951l461J57494N7981
20875B51897o7156j41054k75707n2942k1248J37502P7926J16142m7484O7584n5649
20864a0189K3969m3883K5351J16143q040N6579K4474n3238n4689j74536o7024
20853a65083M4687R8850R3334K19532r1240r1634r3386n7206J01025j9810J0657
$$ plain form
20842 49726 114418 -54741 -200629 -149423 -181229 -67617 22634 37030 45299 256847 359228
20831 359228 208015 37964 -7230 135794 243962 163462 35161 40639 -33574 -168815
20821 -168815 -46034 -26094 34136 84386 102191 128498 32051 -10516 -49424 -171855 -68867
20810 -68867 63297 179540 125403 17044 -105784 -50646 11892 29684 138792 288425
20800 288425 187119 49422 -42141 -135057 -130796 -64936 -109737 -195440 -264681 -271287 -251181
20789 -251181 -95629 47556 -26280 -153653 -163745 -118466 -29777 -181299 -368485 -439249
20779 -439249 -272176 -117867 -120037 -12778 -81083 -10489 89269 196100 53119 -120120
20769 -120120 -132570 -198508 -59745 109797 75322 115760 175258 -20267 -58084 -61044 10259
$$ packed form
20842D9726O4692j69159j45888N1206l1806J13612R0251J4396Q269K11548J02381
20831C59228j51213j70051m5194J43024J08168q0500j28301N478p4213j35241
20821a68815J22781J9940O0230N0250J7805K6307r6447m2567l8908j22431J02988
20810f8867J32164J16243n4137j08359j22828N5138O2538J7792J09108J49633
20800B88425j01306j37697r1563r2916M261O5860m4801q5703o9241o606K0106
20789b51181J55552J43185p3836j27373j0092M5279Q8689j51522j87186p0764
20779d39249J67073J54309k170J07259o8305P0594R9758J06831j42981j73239
20769a20120j2450o5938J38763J69542l4475M0438N9498j95525l7817k960P1303
$$ plain form
20758 10259 74703 136425 234563 293906 158648 48156 -201 -33757 32615 193037 101088
20747 101088 117215 360534 326497 -9569 -180324 -130133 113399 25107 27698 77557 6328
20736 6328 -115549 -87190 7363 24473 17707 -35940 -47949 56858 123148 105852 -15331
20725 -15331 -74869 -188359 -161560 -47714 137635 91423 299611 172119 179398 144348 -53042
20714 -53042 -66567 -30735 -135206 -223648 -265974 -173931 -182665 -196916 -201115 5655 67007 21756
20702 21756 162331 327874 236007 126443 175541 225099 82037 40997 245710 389712
20692 389712 370808 305435 307090 342885 326202 401029 404818 466630 425498 494628 607493 414998
20680 414998 347916 405434 574389 399805 235946 309247 487020 425659 384272 290980 393899
$$ packed form
20758A0259O4444O1722R8138N9343j35258j10492m8357l3556O6372J60422r1949
20747A01088J6127K43319l4037l36066j70755N0191K43532q8292K591M9859p1229
20736F328j21877K8359R4553J7110o766n3647j2009J04807O6290j7296j21183
20725a5331n9538j13490K6799J13846J85349m6212K08188j27492P279l5050j97390
20714e3042j3525L5832j04471q8442m2326R2043q734j4251m199K06770O1352m5251
20702B1756J40575J65543r1867j09564M9098M9558j43062m1040K04713J44002
20692C89712j8904o5373J655L5795j6683P4827L789O1812m1132O9130J12865j92495
20680D14998o7082N7518J68955j74584j63859P3301J77773o1361m1387r3292J02919
$$ plain form
20669 393899 421338 296374 219217 137049 69193 52243 231674 405670 321939 251623 273763
20658 273763 270676 480633 489275 380383 273983 257182 402896 377861 360910 303389 163454
20647 163454 183819 -30155 -140681 29219 133095 103105 99573 218056 319054 471414
20637 471414 460460 315078 160529 -89872 -52617 95726 110052 135199 210056 297377 296303
20626 296303 416736 390998 341044 465794 449040 462466 653036 630445 347631 246401
20616 246401 318107 305754 372952 449778 306366 263270 147782 -20579 -123736 -137816 6506
20605 6506 233873 355355 309343 443278 476705 398805 573343 775986 1095834 1305134
20595 1305134 1431891 1539099 1717910 1738024 1569444 1240609 953310 812442 669450 521921
$$ packed form
20669C93899K7439j24964p7157q2168o7856j6950J79431J73996q3731p0316K2140
20658B73763l087K09957Q642j08892j06400j6801J45714k5035j6951n7521j39935
20647A63454K0365k13974j10526J69900J03876k9990l532J18483J00998J52360
20637D71414j0954j45382j54549k50401L7255J48343J4326K5147P4857Q7321j074
20626B96303J20433k5738m9954J24750j6754J3426J90570k2591k82814j01230
20616B46401P1706j2353O7198P6826j43412m3096j15488j68361j03157j4080J44322
20605F506K27367J21482m6012J33935L3427p7900J74538K02643L19848K09300
20595A305134J26757J07208J78811K0114j68580l28835k87299j40868j42992j47529
$$ plain form
20585 521921 528290 581874 582402 499320 381899 171957 88348 24901 -39099 106716 139141
20574 139141 -2335 46344 28729 -7929 -18471 178479 299575 346524 331619 280139 200776
20563 200776 318264 433536 376174 371501 479110 552467 422779 230794 123762 96386
20553 96386 157376 106659 178414 536985 768284 785245 668664 670961 697584 621698 545340
20542 545340 431288 369026 484558 504964 200832 166933 138648 251627 453251 610626
20532 610626 485644 355430 354587 277562 135327 45695 266150 423986 421926 450879 543256
20521 543256 537539 484985 566755 674425 850693 1171190 1518844 2069343 2360652 2067374
20511 2067374 1657592 1633564 1809912 1855273 1668763 1568130 1403971 1127427 890705 813184
$$ packed form
20585E21921O369N3584N28q3082j17421k09942q3609o3447o4000J45815L2425
20574A39141j41476M8679j7615l6658j0542J96950J21096M6949j4905n1480p9363
20563B00776J17488J15272n7362m673J07609P3357j29688j91985j07032k7376
20553I6386O0990n0717P1755L58571K31299J6961j16581K297K6623p5886p6358
20542E45340j14052o2262J15532K0406l04132l3899k8285J12979K01624J57375
20532F10626j24982j30214q43p7025j42235q9632K20455J57836k060K8953R2377
20521E43256n717n2554Q1770J07670J76268L20497L47654N50499K91309k93278
20511B067374m09782k4028J76348M5361j86510j00633j64159k76544k36722p7521
$$ plain form
20501 813184 666828 528256 418639 335030 442288 562276 499505 577989 641785 645852 694117
20490 694117 756700 814444 870771 652836 524051 526633 571376 687941 849853 958997 1037547
20479 1037547 949056 984990 1134606 1304271 1458941 1479680 1346606 1204009 1493956 1575414
20469 1575414 1747625 2229670 2888290 3488058 3590089 3675949 3952187 3992679 3593653 3209972
20459 3209972 3169076 3377744 3449250 3543741 3743452 3990830 4399675 4988335 5058927 4422774
20449 4422774 3992791 3842449 3918272 4163008 4562894 5149525 5900379 7053284 8500334
20440 8500334 10085066 11394607 12181347 13135527 14243309 15182551 15935833 17255888 19901239
20431 19901239 24238502 30507465 39980679 54784992 78879178 122230309 198778311
$$ packed form
20501H13184j46356j38572j09617q3609J07258J19988o2771P8484O3796M067M8265
20490F94117O2583N7744N6327k17935j28785K582M4743J16565J61912J09144P8550
20479A037547q8491L5934J49616J69665J54670K0739j33074j42597K89947Q1458
20469A575414J72211M82045O58620N99768J02031Q5860K76238M0492l99026l83681
20459C209972m0896K08668P1506R4491J99711K47378M08845N88660P0592o36153
20449D422774m29983j50342P5823K44736L99886N86631P50854J152905J447050
20440H500334J584732J309541P86740R54180J107782R39242P53282J320055K645351
20431A9901239M337263O268963R473214J4804313K4094186M3351131P6548002
$$ plain form
20424 198778311 312347917 416811723 418138338 388260037 412116976 404560763 289772979
20417 289772979 172826316 106982887 72660375 52742287 39741336 30771107 24765687
20410 24765687 20444603 17451894 15644116 14845084 14271312 13192485 11962957 11285674
20402 11285674 10524152 8734528 6972997 5857434 5184120 4714329 4693432 5295449 6399031
20393 6399031 7081363 6276868 4786904 3689393 3157288 2874536 2935148 2880574 2848950 2807099
20383 2807099 2859910 3184619 3830801 4613841 5637815 6611058 7331186 6861022 5220112
20374 5220112 3595852 2600697 1715711 1235309 904806 697438 612669 690921 727140 640926
20364 640926 498871 334596 352953 532701 596804 538677 394697 288514 371066 383593
$$ packed form
20424A98778311J13569606J04463806J326615k9878301K3856939p556213j14787784
20417B89772979j16946663o5843429l4322512j9918088j3000951q970229o005420
20410B4765687m321084k992709j807778p99032n73772j078827j229528o77283
20402A1285674p61522j789624j761531j115563o73314m69791k0897O02017J103582
20393F399031O82332q04495j489964j097511n32105k82752O0612n4574l1624m1851
20383B807099N2811L24709O46182P83040J023974R73243P20128m70164j640910
20374E220112j624260r95155q84986m80402l30503k07368q4769P8252L6219q6214
20364F40926j42055j64275J8357J79748O4103n8127j43980j06183Q2552J2527
$$ plain form
20354 383593 398057 228986 73428 38090 259164 400472 351741 216775 277959 369398
20344 369398 476784 229598 87295 174203 222358 183188 364645 296101 213322 309935 379530
20333 379530 306323 290991 368415 453135 407918 355629 129651 121395 191534 235327 227152 147836
20321 147836 134142 38245 47571 57442 -50146 -65621 -72233 -113870 -100604 -67461 36344 -27779
20309 -27779 -203981 -252950 -168465 -155807 -232771 -221916 -153990 9442 89751 163018 185873
20298 185873 167189 207447 104359 97556 -90074 -46887 22609 -58987 -86902 -60344 -30506
20287 -30506 -189348 -146851 -129778 -30988 127867 3149 -12551 82530 186042 189713 172260
20276 172260 25985 -60916 -106435 -36475 -160641 -145768 -99958 -36525 16508 44021 106427
$$ packed form
20354C83593J4464j69071j55558l5338K21074J41308m8731j34966O1184R1439
20344C69398J07386k47186j42303Q6908M8155l9170J81457o8544q2779R6613O9595
20333C79530p3207j5332P7424Q4720m5217n2289k25978q256P0139M3793q175p9316
20321A47836j3694r5897R326R871j07588j5475o612m1637J3266L3143J03805o4123
20309b7779j76202m8969Q4485J2658p6964J0855O7926J63432Q0309P3267K2855
20298A85873j8684M0258j03088o803j87630M3187O9496q1596k7915K6558K9838
20287c0506j58842M2497J7073R8790J58855j24718j5700R5081J03512L671j7453
20276A72260j46275q6901m5519O9960j24166J4873M5810O3433N3033K7513O2406
$$ plain form
20265 106427 235681 133780 -18114 -8387 225238 400285 258702 253678 280437 225788 162911
20254 162911 175277 376067 385901 383723 364345 492469 469972 462356 578150 617015 578224
20243 578224 341542 306068 387363 337079 261675 304595 165693 163854 172222 163813 207712 282421
20231 282421 118905 37673 -120835 -179031 -298767 -193924 -42384 -20794 -2789 91738
20221 91738 273649 337361 323921 270691 81498 179545 247739 267109 281042 138390 95519
20210 95519 130081 120861 28039 -9373 -31503 -58462 -22075 -130767 -235976 -88243 125123
20199 125123 303502 387031 296708 281470 327327 381603 387697 367514 431478 233886 171253
20188 171253 330252 368979 326385 262591 177109 137781 108257 66117 -49216 -124029 64695
$$ packed form
20265A06427J29254j01901j51894R727K33625J75047j41583n024K6759n4649o2877
20254A62911J2366K00790R834k178j9378J28124k2497p616J15794L8865l8791
20243E78224k36682l5474Q1295n0284p5404M2920j38902j839Q368q409M3899P4709
20231B82421j63516q1232j58508n8196j19736J04843J51540K1590J8005R4527
20221I1738J81911O3712j3440n3230j89193R8047O8194J9370J3933j42652m2871
20210I5519L4562r220r2822l7412k2130k6959L6387j08692j05209J47733K13366
20199A25123J78379Q3529r0323j5238M5857N4276O094k0183O3964j97592o2633
20188A71253J58999L8727m2594o3794q5482l9328k9524m2140j15333p4813J88724
$$ plain form
20177 64695 186097 158346 261743 100417 -138894 -195227 -72382 97601 187758 137900
20167 137900 58160 -31351 128041 224734 196548 191971 240242 204766 155961 127488 189204
20156 189204 133628 67890 120144 206386 142637 11147 34155 18563 -52611 -212284 -138294
20145 -138294 25508 107677 119965 204463 76167 118456 172533 148762 100419 101103 83351
20134 83351 7779 54075 149254 21463 18948 -41555 -57394 -26736 -169335 -343059 -490654
20123 -490654 -429993 -224449 -153781 -224516 -219295 -96662 -125136 -68067 71686 118354 5133
20112 5133 -76064 -181446 -183681 -149668 -110121 -223792 -266984 -197215 -197380 -279551 -242115 -101876
20100 -101876 -240044 -236278 -154434 -174988 -164671 -120469 -158267 -124000 -10548 86582 113110
$$ packed form
20177F4695J21402k7751J03397j61326k39311n6333J22845J69983R0157m9858
20167A37900p9740q9511J59392R6693k8186m577M8271l5476m8805k8473O1716
20156A89204n5576o5738N2254Q6242o3749j31490K3008j5592p1174j59673P3990
20145a38294J63802Q2169J2288Q4498j28296M2289N4077k3771m8343O84j7752
20134H3351p5572M6296R5179j27791k515o0503j5839L0658j42599j73724j47595
20123d90654O0661K05544P0668p0735N221J22633k8474N7069J39753M6668j13221
20112E133q1197j05382k235L4013L9547j13671m3192O9769j65q2171L7436J40239
20100a01876j38168L766Q1844k0554J0317M4202l7798L4267J13452R7130K6528
$$ plain form
20089 113110 291460 137671 -90734 -147909 -132506 -6900 74040 -991 -18168 -104810 -175119
20078 -175119 -165801 54660 72782 149227 26316 104840 96562 63067 -5812 -31417 46708
20067 46708 77111 -18910 -80046 -13049 26947 -81228 13060 220177 147818 49045 177729
20056 177729 211060 200399 187826 -14921 -190884 -277118 -348408 -278125 -197022 -127758 -95304
20045 -95304 -69440 -266075 -311527 -264160 -152755 -82098 -164522 -211249 -184839 -236107 -265186
20034 -265186 -106468 -80808 -55677 -220410 -181770 -121064 -688 61009 87340 35357 -89763
20023 -89763 -75249 -124824 -174769 -380157 -446289 -288524 -89379 -45494 -103762 44757 -1438
20012 -1438 -144527 -159375 -174875 -17766 2787 62104 99352 110123 128148 147817 -3716
$$ packed form
20089A13110J78350j53789k28405n7175J5403J25606Q0940p5031j7177q6642p0309
20078a75119R318K20461J8122P6445j22911P8524q278l3495o8879k5605P8125
20067D6708L0403r6021o1136O6997L9996j08175R4288K07117p2359r8773J28684
20056A77729L3331j0661j2573k02747j75963q6234p1290P0283Q1103O9264L2454
20045i5304K5864j96635m5452M7367J11405P0657q2424m6727K6410n1268k9079
20034b65186J58718K5660K5131j64733L8640O0706J20376O1697K6331n1983j25120
20023h9763J4514m9575m9945k05388o6132J57765J99145M3885n8268J48519m6195
20012a438j43089j4848j5500J57109K0553N9317L7248J0771J8025J9669j51533
$$ plain form
20001 -3716 33921 110636 18543 70217 49450 -85748 -259841 -281897 -30547 35871 51116
19990 51116 35259 52219 -107836 -75029 10104 86790 2489 -198991 -258682 -157760 -22159
19979 -22159 -72185 -40600 -145150 -122296 -130180 -48003 93257 162565 -19781 -703 57673
19968 57673 -13946 -49564 -66255 -201681 -266408 -298369 -380990 -453181 -302578 -216183 -204202
19957 -204202 -186218 -333341 -404083 -197623 -121698 -101074 -97634 -139390 -155181 -66132 -76342
19946 -76342 -263890 -255653 -59055 -172260 -191652 -82740 -56571 -32249 -91113 62493 101007
19935 101007 42722 -136056 -121034 95943 30250 98319 130361 -15481 -30805 154209 107813
19924 107813 10246 -53709 105188 17904 -78174 -18863 44772 79971 68953 -82471 -73026
$$ packed form
20001c716L7637P6715r2093N1674k0767j35198j74093k2056K51350O6418J5245
19990E1116j5857J6960j60055L2807Q5133P6686q4301k01480n9691J00922J35601
19979b2159n0026L1585j04550K2854p884Q2177J41260O9308j82346J9078N8376
19968E7673p1619l5618j6691j35426o4727l1961q2621p2191J50603Q6395J1981
19957b04202J7984j47123p0742K06460P5925K0624L440m1756j5791Q9049j0210
19946g6342j87548Q237J96598j13205j9392J08912K6169K4322n8864J53606L8514
19935A01007n8285j78778J5022K16977o5693O8069L2042j45842j5324J85014m6396
19924A07813r7567o3955J58897q7284r6078N9311O3635L5199j1018j51424R445
$$ plain form
19913 -73026 -51711 123635 114404 174192 268495 172499 88460 27014 6368 -38881 -101272 -43435
19901 -43435 175560 210899 192634 413009 411987 154804 -76398 46835 325735 769977
19891 769977 1521831 2469123 3599909 4034924 2851173 1510435 893652 663569 555203
19882 555203 574708 549024 311685 520804 732312 742115 942087 1317475 2334044 3596099
19872 3596099 4159299 3108923 1679091 945139 456938 211691 193776 78801 23896
19863 23896 179643 238991 234109 152940 103061 75760 -10253 -86645 -97309 23793 74651
19852 74651 152815 228128 -11099 -11685 132882 95065 4177 -204609 -73385 106716 4303
19841 4303 -107538 -206747 -219354 -57318 121657 112898 95447 204764 129649 201272 235832
$$ packed form
19913g3026K1315J75346r231N9788R4303r5996q4039o1446k0646m5249o2391N7837
19901d3435K18995L5339j8265K20375j022k57183k31202J23233K78900M44242
19891G69977P51854R47292J130786M35015j183751j340738o16783k30083j08366
19882E55203J9505k5684k37339K09119K11508R803J99972L75388J016569J262055
19872C596099N63200j050376j429832p33952m88201k45247j7915j14975n4905
19863B3896J55747N9348m882q1169m9879k7301q6013p6392j0664J21102N0858
19852G4651P8164P5313k39227n86J44567l7817r0888k08786J31224J80101j02413
19841D303j11841r9209j2607J62036J78975q759j7451J09317p5115P1623L4560
$$ plain form
19830 235832 83616 -23238 -52550 192486 734082 1201190 1706825 1950080 1866846 1396361
19820 1396361 1007931 542072 338004 512345 696009 914498 884503 550543 640372 958196
19810 958196 1315089 1598128 1794114 1959470 1866306 1772168 1700202 1486639 1136748 791832
19800 791832 468154 200429 110416 201069 390070 423800 335199 318236 372395 301380 268491
19789 268491 302400 151750 142868 73557 196633 229607 200026 275586 311111 311030 520403 581373
19777 581373 744275 848327 1312112 1757849 1993064 2117178 2116288 2010479 1913590 1651314
19767 1651314 1081826 664440 434863 406584 405661 219410 -89544 -73203 -60375 -107156 -114876
19756 -114876 -128993 -53642 -10283 -19348 -106288 -305393 -305122 -265649 -48875 10422 117220
$$ packed form
19830B35832j52216j06854k9312K45036N41596M67108N05635K43255q3234m70485
19820A396361l88430m65859k04068J74341J83664K18489k9995l33960Q9829L17824
19810I58196L56893K83039J95986J65356r3164r4138p1966k13563l49891l44916
19800G91832l23678k67725r0013R0653J89001L3730q8601j6963N4159p1015l2889
19789B68491L3909j50650q882o9311J23076L2974k9581P5560L5525q1K09373O0970
19777E81373J62902J04052M63785M45737K35215J24114q90j05809r6889k62276
19767A651314n69488m17386k29577k8279r23j86251l08954J6341J2828m6781p720
19756a14876j4117P5351M3359r065q6940j99105K71L9473K16774N9297J06798
$$ plain form
19745 117220 159741 163794 166330 167369 188289 11200 -169953 -212994 -236311 -88897 -55964
19734 -55964 26610 77499 94722 87792 163225 264047 152273 4588 34844 149855 69756
19723 69756 5481 41591 -17092 -19593 -9209 -77559 -37070 -3015 31250 -41682 97514 132136
19711 132136 164323 100640 17504 563 -38757 149822 265539 253952 183890 -17710 33445
19700 33445 -122655 -212909 -160691 34718 268891 268133 186387 38575 -111640 -95009 -19665
19689 -19665 80527 -48297 -141618 -139642 -188672 -125563 -122156 -210961 -142618 43126 75611
19678 75611 164924 209194 260873 233763 154502 68024 43241 62745 102149 137255 137888 235770
19666 235770 142231 149366 146602 58110 -596 -58490 -30636 24654 -46206 -91082 -100018 -182604
$$ packed form
19745A17220M2521M053K536J039K0920j77089j81153m3041k3317J47414L2933
19734e5964Q2574N0889J7223o930P5433J00822j11774j47685L0256J15011q0099
19723F9756o4275L6110n8683k501J0384o8350M0489L4055L4265p2932J39196L4622
19711A32136L2187o3683q3136j6941l9320J88579J15717j1587p0062k01600N1155
19700C3445j56100r0254N2218J95409K34173p58q1746j47812j50215J6631P5344
19689a9665J00192j28824r3321J976m9030O3109L407q8805O8343J85744L2485
19678G5611Q9313M4270N1679k7110p9261q6478k4783J9504L9404L5106O33R7882
19666B35770r3539P135k764q8492n8706n7894K7854N5290p0860m4876q936q2586
$$ plain form
19654 -182604 -198655 -181836 -125734 12174 108730 -102562 -201641 -185477 -120496 -74854 -180876
19643 -180876 -71827 73993 -64104 -266634 -247342 -252968 -14997 193330 221387 112882
19633 112882 120842 132198 120092 -17288 118303 184758 212656 171340 -27239 5594 72977
19622 72977 25305 190571 205586 212721 283622 537516 682720 582187 428000 367795 285072
19611 285072 160124 82754 -16269 30396 27013 58326 -72455 -129827 -147869 25310 140901
19600 140901 31853 155590 216557 76211 7486 126466 211673 184913 158243 74285 191521
19589 191521 291567 284631 136732 -25529 -316754 -350005 -400835 -350470 -226031 -269013 -279134
19578 -279134 -217198 -173819 -87070 -160120 -73157 -2427 57354 81156 -1306 24865 119200
$$ packed form
19654a82604j6051J6819N6102J37908R6556k11292r9079J6164O4981M5642j06022
19643a80876J09049J45820j38097k02530J9292n626K37971K08327K8057j08505
19633A12882P960J1356j2106j37380J35591O6455K7898m1316j98579L2833O7383
19622G2977m7672J65266J5015P135P0901K53894J45204j00533j54187o0205q2723
19611B85072j24948p7370r9023M6665l383L1313j30781n7372j8042J73179J15591
19600A40901j09048J23737O0967j40346o8725J18980Q5207k6760k6670q3958J17236
19589A91521J00046o936j47899j62261k91225l3251n0830N0365J24439m2982j0121
19578b79134O1936M3379Q6749p3050Q6963P0730N9781K3802q2462K6171R4335
$$ plain form
19567 119200 -12967 -206596 23937 114196 66744 28347 208111 56702 38072 86367
19557 86367 172674 196741 123379 -31631 -78816 -92126 167959 256667 151116 168010 197997
19546 197997 273332 133072 103260 -61575 -260883 -83213 61071 44061 13854 -62147
19536 -62147 69824 5360 30393 -73603 -68392 -124664 -149821 -102996 62391 4942 5518 -137379
19524 -137379 -164782 -34341 135327 250015 152031 2177 22070 -64599 62940 288581
19514 288581 410621 638964 642421 466776 416214 366865 359136 334948 280118 269870 256638
19503 256638 422560 454192 413021 673904 801063 733500 535039 560770 550307 463433 372751
19492 372751 75005 -1359 91047 168769 205450 297678 163679 11217 -65145 -106005 -229797
$$ packed form
19567A19200j32167j93629K30533R0259m7452l8397J79764j51409j8630M8295
19557H6367Q6307K4067p3362j55010m7185j3310K60085Q8708j05551J6894K9987
19546A97997P5335j40260k9812j64835j99308J77670J44284j7010l0207p6001
19536f2147J31971o4464K5033j03996N211n6272k5157M6825J65387n7449N76j42897
19524a37379k7403J30441J69668J14688r7984j49854J9893q6669J27539K25641
19514B88581J22040K28343L457j75645n0562m9349p729k4188n4830j0248j3232
19503B56638J65922L1632m1171K60883J27159o7563j98461K5731j0463q6874r0682
19492C72751k97746p6364R2406P7722L6681R2228j33999j52462p6362m0860j23792
$$ plain form
19481 -229797 -116785 84899 180814 227763 298680 253191 101726 -88532 -216353 -38858
19471 -38858 277630 220122 250920 425624 361472 208798 207807 124058 197546 88968 53024
19460 53024 -104381 -218571 -212348 -34704 104224 88678 76077 218232 132129 -67252 -63117
19449 -63117 -13587 -24807 -67806 16862 -32114 -63309 84175 145746 43309 -79264 -175010
19438 -175010 -106490 50694 295836 319949 200779 4532 -70169 -35817 54880 20613 -102233
19427 -102233 -46330 35369 -12386 -14390 7640 166645 329717 492303 520525 431708 275011
19416 275011 105363 111356 17221 -99998 -83823 -130195 -135302 -133526 19780 37863 -2483
19405 -2483 23408 213209 350362 254403 186678 122549 -1769 -26943 195600 302035 405854
$$ packed form
19481b29797J13012K01684R5915M6949P0917m5489j51465j90258j27821J77495
19471c8858L16488n7508L0798J74704o4152j52674r91q3749P3488j08578l5944
19460E3024j57405j14190O223J77644J38928j5546j2601J42155q6103j99381M135
19449f3117M9530j1220m2999Q4668m8976l1195J47484O1571j02437j22573r5746
19438a75010O8520J57184K45142K4113j19170j96247p4701L4352R0697l4267j22846
19427a02233N5903Q1699m7755k004K2030J59005J63072J62586K8222q8817j56697
19416B75011j69648N993r4135j17219J6175m6372n107J776J53306J8083m0346
19405b483K5891J89801J37153r5959o7725o4129j24318k5174K22543J06435J03819
$$ plain form
19394 405854 474255 278924 146931 278277 209051 340782 410066 341426 270126 106638
19384 106638 -3201 120728 185679 6757 20585 116328 96800 33982 -72067 -60115 -2684
19373 -2684 26075 142259 150927 123371 31006 -78573 11466 28181 25804 125114 197907 1587
19361 1587 60600 67120 80461 125215 3489 91081 69408 65097 180949 267399 237025 163408
19349 163408 105580 -14399 64623 200198 348100 496724 506755 516109 390179 311016 337986
19338 337986 371847 220642 82319 -46655 -17950 75085 120169 274988 161935 97380
19328 97380 -70892 4326 158175 74090 210904 315147 323481 159577 38404 160632
19318 160632 227437 253237 222927 390372 554030 747820 835282 680987 674142 888797 843135
$$ packed form
19394D05854O8401j95331j31993J31346o9226J31731O9284o8640p1300j63488
19384A06638j09839J23929O4951j78922J3828R5743j9528o2818j06049J1952N7431
19373b684K8759J16184Q668k7556r2365j09579R0039J6715k377R9310P2793j96320
19361A587N9013O520J3341M4754j21726Q7592k1673m311J15852Q6450l0374p3617
19349A63408n7828j19979P9022J35575J47902J48624J0031R354j25930p9163K6970
19338C37986L3861j51205j38323j28974K8705R3035M5084J54819j13053o4555
19328I7380j68272P5218J53849q4085J36814J04243Q334j63904j21173J22228
19318A60632O6805K5800l0310J67445J63658J93790Q7462j54295o845K14655m5662
$$ plain form
19307 843135 680803 516593 455788 409502 362597 329287 253824 207479 358711 378356 160811
19296 160811 127331 137971 41502 -11417 17749 -101034 -127415 -35417 132289 158091 218190
19285 218190 60289 86013 164253 67639 272401 369755 436340 528604 514364 428680 356990
19274 356990 480179 581122 694536 790022 702114 664914 638854 698023 735164 728162 860456
19263 860456 811105 697687 723650 898375 964027 915543 844137 1052213 1382150 1452444 1426432
19252 1426432 1546386 1822725 1900468 1960977 2044242 2091013 2161310 2228501 2576159 3038834
19242 3038834 3729172 4610856 5521737 5941008 5954978 6239043 6721332 6778445 6617444 7053167
19232 7053167 8133653 9643224 11060307 12039033 13465419 15413451 17297034 19884050
$$ packed form
19307H43135j62332j64210o0805m6286m6905l3310p5463m6345J51232J9645k17545
19296A60811l3480J0640r6469n2919K9166j18783k6381R1998J67706K5802O0099
19285B18190j57901K5724P8240r6614K04762R7354O6585R2264j4240q5684p1690
19274C56990J23189J00943J13414R5486q7908l7200k6060N9169L7141p002J32294
19263H60456m9351j13418K5963J74725O5652m8484p1406K08076L29937P0294k6012
19252A426432J19954K76339P7743O0509Q3265M6771P0297O7191L47658M62675
19242C038834O90338Q81684R10881M19271J3970K84065M82289N7113j61001M35723
19232G053167J080486J509571J417083R78726J426386J948032J883583K587016
$$ plain form
19224 19884050 23744193 29914745 40041296 57035494 87219875 142109043 235366099
19217 235366099 363069272 447534957 420752445 403892900 436624481 391507147 256242805
19210 256242805 151311324 96644964 67564909 49905983 38638229 31054237 25954730
19203 25954730 22687511 20102491 17230337 14798870 13139259 11597155 9909021 8740332
19195 8740332 8018088 7866075 7749227 7163507 6637563 6366559 5751355 4650592 3747410
19186 3747410 3158016 2765732 2459124 2324583 2249788 2082393 2027029 1900771 1639767 1532263
19176 1532263 1509148 1351988 1187550 1085610 1009283 1024630 880422 771752 876853 940823
19166 940823 833023 707541 829143 809418 758172 798463 751165 724337 558106 428255
$$ packed form
19224A9884050L860143O170552J0126551J6994198L0184381N4889168R3257056
19217B35366099J27703173Q4465685k6782512j6859545L2731581m5117334j35264342
19210B56242805j04931481n4666360k9080055j7658926j1267754p583992n099507
19203B5954730l267219k585020k872154k431467j659611j542104j688134j168689
19195H740332p22244j52013j16848n85720n25944k71004o15204j100763r03182
19186C747410n89394l92284l06608j34541p4795j67395n5364j26258k61004j07504
19176A532263k3115j57160j64438j01940p6327J5347j44208j08670J05101O3970
19166I40823j07800j25482J21602j9725n1246M0291m7298k6828j66231j29851
$$ plain form
19156 428255 406051 375113 563732 745743 699399 656657 722236 786401 718751 633644 504395
19145 504395 563367 658265 593084 519716 539862 615524 551202 603193 664963 734007 683971
19134 683971 599431 578558 597653 920114 1129303 1319304 1432116 1327267 1278731 1156802
19124 1156802 1027317 753653 668765 438886 488096 423166 441516 394450 353956 173093
19114 173093 198337 277398 313710 262171 130076 -47946 -121719 -101713 125795 314221 349955
19103 349955 361986 362866 300364 370960 337903 192115 197366 202901 254254 414393 285456 155931
19091 155931 89880 72427 69230 167679 395431 448346 358017 298536 152018 107428 285766
19080 285766 427097 441050 398739 235295 308907 332352 167015 117194 132492 161507 59814
$$ packed form
19156D28255k2204l0938J88619J82011m6344m2742O5579O4165o7650q5107j29249
19145E04395N8972R4898o5181p3368K0146P5662o4322N1991O1770O9044n0036
19134F83971q4540k0873J9095L22461K09189J90001J12812j04849m8536j21929
19124A156802j29485k73664q4888k29879M9210o4930J8350m7066m0494j80863
19114A73093K5244P9061L6312n1539j32095j78022p3773K0006K27508J88426L5734
19103C49955J2031Q80o2502P0596l3057j45788N251N535N1353J60139j28937j29525
19091A55931o6051j7453l197R8449K27752N2915r0329n9481j46518m4590J78338
19080B85766J41331J3953m2311j63444P3612K3445j65337m9821J5298K9015j01693
$$ plain form
19069 59814 32934 8708 90291 223718 146769 129024 128725 245202 199443 255036 272737 327391
19057 327391 254858 163250 178725 184388 129233 119517 -75275 15743 193281 221396 131963
19046 131963 144833 138906 236611 339625 321744 259141 271692 247960 151431 118927 35290
19035 35290 -39710 -109783 -139916 -99524 71873 227213 19849 -232495 -209099 -227351 -363586
19024 -363586 -317042 -148806 -89229 -204452 -258922 -216808 -115037 -47035 -76176 -180680 -130794
19013 -130794 80306 189893 173702 138798 48907 -60758 -25755 -72649 -22349 64214 88894
19002 88894 20781 -58054 -27509 -48679 -80073 14534 97363 98013 33202 -118344 31735 10630
18990 10630 -40450 37319 -74316 -141900 89620 56323 43497 -28001 151573 325483 110034
$$ packed form
19069E9814k6880k4226Q1583J33427p6949j7745k99J16477m5759N5593J7701N4654
19057C27391p2533r1608J5475N663n5155r716j94792R1018J77538K8115q9433
19046A31963J2870n927R7705J03014j7881o2603J2551k3732r6529l2504q3637
19035C5290p5000p0073l0133M0392J71397J55340k07364k52344K3396j8252j36235
19024c63586M6544J68236N9577j15223n4470M2114J01771O8002k9141j04504M9886
19013a30794K11100J09587j6191l4904q9891j09665L5003m6894N0300Q6563K4680
19002H8894o8113p8835L0545k1170l1394R4607Q2829O50o4811j51546J50079k1105
18990A0630n1080P7769j11635o7584K31520l3297j2826p1498J79574J73910k15449
$$ plain form
18979 110034 -140651 90104 146114 129042 121254 163647 -36755 -233656 -163808 -212534 -319176
18968 -319176 -197263 -37253 56860 74141 258666 410193 448266 359851 290549 405423
18958 405423 365985 100897 149343 225730 318176 449813 479594 297513 306265 100455 -70931
18947 -70931 -6730 -27017 -99991 -7324 123836 136823 353294 580379 416388 96742 86439
18936 86439 71043 88732 249096 377059 289485 107845 40381 -157534 -248750 -175710 9073
18925 9073 -94520 -55816 165264 168288 143224 260668 310605 48848 -126660 -204128 -165154
18914 -165154 -219920 -261732 -258464 -74532 69634 109280 78845 -158251 -168866 76955 120391
18903 120391 -84437 -212360 -77171 -46536 -86258 -45809 -102940 -221804 -169961 14111
$$ packed form
18979A10034k50685K30755N6010j7072p788M2393k00402j96901O9848m8726j06642
18968c19176J21913J60010R4113J7281J84525J51527L8073q8415o9302J14874
18958D05423l9438k65088M8446P6387R2446J31637K9781j82081Q752k05810j71386
18947g0931O4201k0287p2974R2667J31160J2987K16471K27085j63991l19646j0303
18936H6439j5396J7689J60364J27963q7574j81640o7464j97915r1216P3040J84783
18925I073j03593L8704K21080L024k5064J17444M9937k61757j75508p7468L8974
18914a65154n4766m1812L268J83932J44166L9646l0435k37096j0615K45821M3436
18903A20391k04828j27923J35189L0635l9722M0449n7131j18864N1843J84072
$$ plain form
18893 14111 127304 133697 52239 90507 150312 248755 310072 254072 273539 115339 54775
18882 54775 -54022 -66489 -84810 -52792 42305 64261 57402 100463 7468 -56349 -45383 53664
18870 53664 938 -73446 -186495 -77059 -85582 -75401 -92148 -142487 -211414 -99837 -3807
18859 -3807 68099 158939 147013 152964 95177 -125056 -226317 -170913 -220574 -197980 -115437 -268322
18847 -268322 -183748 -41419 -131404 -260757 -286997 -301172 -189820 -165794 -105372 -81956 -218833
18836 -218833 -263473 -233337 -191279 -290860 -113871 -120843 -246160 -168986 38884 -36253 -108950
18825 -108950 -170847 -207087 -82244 -101466 -100140 -52066 60063 16076 -9872 104930 17078
18814 17078 -7197 89243 29611 -109414 -175395 -273448 -247556 -109698 -122464 -51927 -38195
$$ packed form
18893A4111J13193O393q1458L8268N9805R8443O1317n6000J9467j58200o0564
18882E4775j08797j2467j8321L2018R5097K1956o859M3061r2995o3817J0966R9047
18870E3664n2726p4384j13049J09436q523J0181j6747n0339o8927J11577R6030
18859c807P1906R0840j1926N951n7787k20233j01261N5404m9661K2594Q2543j52885
18847b68322Q4574J42329q9985j29353k6240j4175J11352K4026O0422K3416j36877
18836b18833m4640L0136M2058r9581J76989o972j25317P7174K07870p5137p2697
18825a08950o1897l6240J24843j9222J326M8074J12129m3987k5948J14802q7852
18814A7078k4275R6440n9632j39025o5981r8053K5892J37858j2766P0537J3732
$$ plain form
18803 -38195 -5267 -14437 -25284 86449 76530 -84215 -5148 200735 56334 -169665 -73578
18792 -73578 69730 72297 -110917 -125348 -147623 -85788 -15876 -56359 -26407 104474 86162
18781 86162 53401 -47183 16163 60180 63018 -15298 -79665 90025 244566 197012 279917
18770 279917 317023 157021 -36384 -131035 -198721 -245789 -310242 -120459 -72901 -13813 -70384
18759 -70384 54303 -29438 -47757 -42000 -158678 -82167 16035 -71206 -161939 -61833 -28669
18748 -28669 -33295 -32985 -162738 -197372 -262007 -224171 6923 175981 129931 47140 -7990 -112617
18736 -112617 -328873 -460261 -506088 -410958 -376536 -264551 -198247 -45047 170960 191496
18726 191496 9409 -105286 -108335 -80538 -81636 -59028 -59762 -68566 -109277 -8135 -93142 -56887
$$ packed form
18803c8195L2928r170j0847J11733r919j60745P9067K05883j44401k25999R6087
18792g3578J43308K567j83214j4431k2275O1835O9912m0483K9952J30881j8312
18781H6162l2761j00584O3346M4017K838p8316o4367J69690J54541m7554Q2905
18770B79917L7106j60002j93405r4651o7686m7068o4453J89783M7558N9088n6571
18759g0384J24687q3741j8319N757j16678P6511R8202q7241r0733J00106L3164
18748b8669m626L10j29753l4634o4635L7836K31094J69058m6050q2791n5130j04627
18736a12617k16256j31388m5827R5130L4422J11985O6304J53200K16007K0536
18726A91496j82087j14695l049K7797j098K2608p34q804m0711J01142q5007L6255
$$ plain form
18714 -56887 -189763 -218270 -80747 -6437 -95051 54221 36258 -139578 62682 117889 15756
18703 15756 -155429 -147328 -187116 -225077 -195496 -105145 -49883 -73805 -199832 -167080 -185330
18692 -185330 -213821 -287327 -319443 -83943 -12263 -49616 -163680 62221 39437 52191 14400
18681 14400 -188170 -324713 -94924 216412 127979 83820 126170 -59786 -62920 -242752 -181107
18670 -181107 10494 102662 27549 36287 39618 14180 -141204 -83630 49836 124594 134792
18659 134792 262424 487511 764806 1091938 1276005 1618992 1811216 1765104 1595119 1627928
18649 1627928 1583271 1313597 984992 660531 269298 99498 115489 78244 58291 89663
18639 89663 148307 180927 234310 184512 93768 51220 155646 232980 149789 -121652 -181672
$$ packed form
18714e6887j32876k8507J37523P4310q8614J49272j7963j75836K02260N5207j02133
18703A5756j71185Q101l9788l7961K9581R0351N5262k3922j26027L2752j8250
18692a85330k8491p3506l2116K35500P1680l7353j14064K25901k2784J2754l7791
18681A4400k02570j36543K29789L11336q8433m4159M2350j85956l134j79832O1645
18670a81107J91601R2168p5113Q738L331k5438j55384N7574J33466P4758J0198
18659A34792J27632K25087K77295L27132J84067L42987J92224m6112j69985L2809
18649A627928m4657k69674l28605l24461l91233j69800J5991l7245j9953L1372
18639H9663N8644L2620N3383m9798r0744m2548J04426P7334q3191k71441o0020
$$ plain form
18628 -181672 -183614 -61581 42142 23307 124815 177605 308267 195739 175952 210868 89484
18617 89484 -89445 -213393 -383590 -282969 -11130 97655 45254 -6353 -26058 11696
18607 11696 57260 79968 5891 -67069 19670 -117350 -206410 -152693 -49775 -98236 -106442
18596 -106442 -3400 66909 -66619 -134311 -107643 -189487 -103491 -14908 7708 -77569 -74751
18585 -74751 99060 185563 196988 150683 223350 49943 24958 48436 -161183 -158828 -144151
18574 -144151 -202853 36732 47302 149267 185508 259620 238822 73193 -73564 -273894
18564 -273894 -125115 -218 125563 61768 -11444 1450 1685 -78240 48068 30365 -18094
18553 -18094 15412 -94679 -196554 -134610 -8372 46251 14346 19921 -49653 -58945 10343
$$ packed form
18628a81672j942J22033J03723j8835J01508N2790J30662j12528j9787L4916j21384
18617H9484j78929j23948j70197J00621K71839J08785n2401n1607j9705L7754
18607A1696M5564K2708p4077p2960Q6739j37020q9060N3717J02918m8461q206
18596a06442J03042P0309j33528o7692K6668q1844Q5996Q8583K2616q5277K818
18585g4751J73811Q6503J1425m6305P2667j73407k4985K3478k09619K355J4677
18574a44151n8702K39585J0570J01965L6241P4112k0798j65629j46757k00330
18564b73894J48779J24897J25781o3795p3212J2894K35p9925J26308j7703m8459
18553a8094L3506j10091j01875O1944J26238N4623l1905N575o9574r292O9288
$$ plain form
18542 10343 43142 51605 60052 -47002 -85201 -107518 2331 45653 143098 -29848 -327793
18531 -327793 -153715 -92323 -133407 -168427 -179736 11709 -14858 -52074 -16821 6322 -31342
18520 -31342 -105831 -142737 -178179 -187607 -108816 73275 36998 -185043 -222371 -167831 -177997
18509 -177997 -242334 -54134 177607 39439 -106749 -116633 -172402 -105674 5066 8670 67809
18498 67809 173121 99141 -1671 193640 162720 153302 162910 -24366 -14292 -42145 -186843
18487 -186843 -94716 56639 98847 -12734 43031 21422 833 19091 -121531 -57745 54042
18476 54042 250516 146326 -129160 -165599 -223907 -210560 -262382 -219556 -139974 -90697 -214728
18465 -214728 -353249 -142234 -89919 -153607 -153384 -175303 -85321 100560 176638 167606 254818
$$ packed form
18542A0343L2799Q463Q447j07054l8199k2317J09849M3322R7445j72946k97945
18531c27793J74078O1392m1084l5020j1309J91445k6567l7216L5253K3143l7664
18520c1342p4489l6906l5442r428P8791J82091l6277k22041l7328N4540j0166
18509a77997o4337J88200K31741j38168j46188r884n5769O6728J10740L604N9139
18498F7809J05312p3980j00812J95311l0920r418R608j87276J0074k7853j44698
18487a86843R2127J51355M2208j11581N5765k1609k0589J8258j40622O3786J11787
18476E4042J96474j04190k75486l6439n8308J3347n1822M2826P9582M9277j24031
18465b14728j38521K11015N2315o3688K23k1919Q9982J85881P6078r032Q7212
$$ plain form
18454 254818 313527 415671 467824 352407 421563 469079 166167 29155 -41143 -145352
18444 -145352 -343584 -298268 -274120 -266635 20739 7418 -60852 -154165 -211053 -175297 -133719
18433 -133719 -66101 -2634 -201236 -220409 -187020 -72860 111900 12511 -128695 -155152 -15991
18422 -15991 176559 221129 250033 202549 8149 -91173 -155335 -124874 -127187 -110669 -265723
18411 -265723 -221975 -85365 -32897 -47631 29083 65369 -6413 -85275 -100986 -256097 -178540
18400 -178540 40356 42860 39897 -35249 -69595 -48234 -125453 -96842 -96930 -208441 -287064 -193023
18388 -193023 -77723 -42877 -201394 -57442 167416 87985 -44669 -184138 -245708 -100506
18378 -100506 -26597 65426 48066 -70308 -151043 -198464 -274619 -256689 -115147 19812 30701
$$ packed form
18454B54818N8709J02144N2153j15417O9156M7516l02912j37012p0298j04209
18444a45352j98232M5316K4148P485K87374j3321o8270r3313n6888L5756M1578
18433a33719O7618O3467j98602j9173L3389J14160J84760r9389j41206k6457J39161
18422a5991J92550M4570K8904m7484j94400r9322o4162L0461k313J6518j55054
18411b65723M3748J36610N2468j4734P6714L6286p1782p8862j5711j55111P7557
18400a78540K18896K504k963p5146l4346K1361p7219K8611q8j11511p8623R4041
18388a93023J15300L4846j58517J43952K24858p9431j32654j39469o1570J45202
18378a00506P3909R2023j7360j18374q0735m7421p6155J7930J41542J34959J0889
$$ plain form
18367 30701 -175817 -268776 -238535 63019 273264 260778 137772 16725 -88819 -194685
18357 -194685 -301028 -188982 -79254 57117 53737 -81062 -173149 -229802 -180818 -180522 -207892
18346 -207892 -73342 -56016 -44958 2545 119567 47861 18833 -124247 -48762 83167 25340
18335 25340 -201116 -297949 -305237 -338040 -254696 -280521 -281378 -193179 -100866 -87404 42709 18633
18323 18633 87193 41266 -179998 -202810 -144231 -98774 -21293 -96071 -197008 -208160 -182292
18312 -182292 -232947 -200546 -218175 -101166 127653 38609 -182616 -67392 -202913 -338249
18302 -338249 -296725 -231554 -140391 3347 234812 270973 160945 35701 -61850 -97921 11174
18291 11174 15165 -11417 3953 78346 7547 -85126 -260148 -248748 -254344 -189433 -47119 -72684
$$ packed form
18367C0701k06518r2959L0241L01554K10245j2486j23006j21047j05544j05866
18357a94685j06343J12046J09728J36371l380j34799r2087n6653M8984K96k7370
18346b07892J34550J7326J1058M7503J17022p1706k9028j43080P5485J31929n7827
18335B5340k26456r6833p288l2803Q3344k5825q57Q8199R2313J3462J30113k4076
18323A8633O8560m5927k21264k2812N8579M5457P7481p4778j00937j1152K5868
18312a82292n0655L2401j7629J17009K28819q9044k21225J15224j35521j35336
18302c38249M1524O5171R1163J43738K31465L6161j10028j25244r7551l6071J09095
18291A1174L991k6582J5370P4393p0799r2673j75022J1400n596O4911J42314k5565
$$ plain form
18279 -72684 -105059 -121556 -162601 -95420 -54470 -99604 -101879 29564 89592 4542 -51337 -34766
18267 -34766 -35877 53299 29018 -16558 -81863 26661 59182 68188 28205 -143059 -184608 -148926
18255 -148926 -5573 221808 222748 233675 103569 -32094 -76686 -92358 -280368 -429530 -363480
18244 -363480 -99516 99642 -98920 -305514 -214379 14612 40916 -33173 -228760 -405859
18234 -405859 -355384 -305614 -200509 -223976 -279525 -307876 -128968 15529 -120361 -200829 -249332
18223 -249332 -414685 -461090 -418497 -285875 -170657 -324363 -289893 -155226 -250723 -266153
18213 -266153 -114043 38341 129979 173799 119692 38878 -67547 -357516 -445921 -377738 -240512
18202 -240512 -115119 -133840 -126372 -336344 -268325 -59716 -50385 -137619 -74684 28538 140129
$$ packed form
18279g2684l2375j6497m1045O7181M0950m5134k275J31443O0028q5050n5879J6571
18267c4766j111Q9176k4281m5576o5305J08524L2521R006l9983j71264m1549L5682
18255a48926J43353K27381R40J0927j30106j35663m4592j5672j88010j49162O6050
18244c63480K63964J99158j98562k06594R1135K28991K6304p4089j95587j77099
18234d05859N0475M9770J05105k3467n5549k8351J78908J44497j35890q0468m8503
18223b49332j65353m6405M2593J32622J15218j53706L4470J34667r5497j5430
18213b66153J52110J52384R1638M3820n4107q0814j06425k89969q8405O8183J37226
18202b40512J25393j8721P468k09972O8019K08609R331q7234O2935J03222J11591
$$ plain form
18191 140129 109078 -91852 -119749 -91949 -73077 79886 64276 -142084 -289526 -123807
18181 -123807 -30771 -56994 -114299 -52515 176346 251344 51140 -112060 -115757 -198194 -199931
18170 -199931 -106873 -11855 -68118 -86045 -115933 -134519 50579 351572 330962 364618 380193
18159 380193 322588 321340 419480 433676 299424 189992 148682 192783 136310 80348 155863
18148 155863 141404 29032 -118715 -125397 -18690 -63216 -119519 -152483 -119204 -339263 -240501
18137 -240501 -139747 -130536 -81899 57802 -44987 -70587 143143 317570 238233 330734 230231
18126 230231 -10507 9718 74648 -52800 -132466 26376 157598 166689 77494 37906 91915
18115 91915 236857 151765 81035 161757 123357 -67901 -37678 46796 -75703 -263139 -316407
$$ packed form
18191A40129l1051k00930k7897K7800J8872J52963j5610k06360j47442J65719
18181a23807R3036k6223n7305O1784K28861P4998k00204j63200l697q2437j737
18170a99931R3058R5018n6263j7927k9888j8586J85098L00993k0610L3656J5575
18159C80193n7605j248R8140J4196j34252j09432m1310M4101n6473n5962P5515
18148A55863j4459j12372j47747o682J06707m4526n6303l2964L3279k20059R8762
18137b40501J00754R211M8637J39701j02789k5600K13730J74427p9337R2501j00503
18126B30231k40738K0225O4930j27448p9666J58842J31222R091q9195l9588N4009
18115I1915J44942q5092p0730Q0722l8400j91258L0223Q4474j22499j87436n3268
$$ plain form
18104 -316407 -241650 -104003 127386 42954 5324 89911 11981 -171689 -254127 -382949 -390657
18093 -390657 -154315 -83571 -154315 -177959 -264588 -358147 -377435 -339431 -316157 -160491 24248
18082 24248 -5925 -19398 10971 3840 139443 248992 54890 -37462 75414 180595 292349
18071 292349 85104 -9202 -61057 -77009 46253 109150 18825 185959 353567 379929 261995
18060 261995 108611 -22868 -91173 40609 395242 357260 349263 310399 194130 -56700
18050 -56700 -147730 -87108 -107357 -193293 -337823 -336128 -155158 58358 89531 100605 80588
18039 80588 5694 9660 -6760 -157461 -233740 -288478 -349080 -287115 -265446 -348419 -350596 -259590
18027 -259590 -189856 -133370 101493 161224 128117 43873 -140938 -365453 -370963 -220630 -220347
$$ packed form
18104c16407P4757J37647K31389q4432l7630Q4587p7930j83670q2438j28822p708
18093c90657K36342P0744p0744k3644q6629r3559j9288L8004K3274J55666J84739
18082B4248l0173j3473L0369p131J35603J09549j94102r2352J12876J05181J11754
18071B92349k07245r4306n1855j5952J23262O2897r0325J67134J67608K6362j17934
18060B61995j53384j31479o8305J31782L54633l7982p997l8864j16269k50830
18050e6700r1030O0622k0249q5936j44530J695J80970K13516L1173J1074k0017
18039H0588p4894L966j6420j50701p6279n4738o0602O1965K1669q2973k177R1006
18027b59590O9734N6486K34863N9731l3107q4244j84811k24515n510J50333K83
$$ plain form
18016 -220347 -340370 -331505 -212506 -189055 -5161 50512 93907 70504 204991 172064 76881
18005 76881 304 -185354 -188360 73313 318801 334283 175979 1001 -239864 -256875 -78132
17994 -78132 -24074 95304 40770 3219 -99226 -160715 -234366 -172204 101004 155439 84368
17983 84368 -33126 -36289 -120546 -176450 65920 123978 167061 149699 83803 17955 -195086
17972 -195086 -106665 -38490 -121393 32647 133631 184459 129338 207219 211986 196147 182213
17961 182213 88907 1889 -115108 -180827 -253074 -107840 -340 -17351 42800 -33797 5078
17950 5078 8123 62480 141781 71730 -110478 -132652 -117695 -123394 -63274 32574 -13541 -102144
17938 -102144 -265006 -188352 -70282 -36315 -21874 16519 -92890 -274910 -436437 -420908
$$ packed form
18016b20347j20023Q865J18999K3451J83894N5673M3395k3403J34487l2927r5183
18005G6881p6577j85658l006K61673K45488J5482j58304j74978k40865j7011J78743
17994g8132N4058J19378n4534l7551j02445o1489p3651O2162K73208N4435p1071
17983H4368j17494l163q4257n5904K42370N8058M3083j7362o5896o5848k13041
17972a95086Q8421O8175q2903J54040J00984N0828n5121P7881M767j5839j3934
17961A82213r3306q7018j16997o5719p2247J45234J07500j7011O0151p6597L8875
17950E078L045N4357P9301p0051j82208k2174J4957n699O0120R5848m6115q8603
17938a02144j62862P6654J18070L3967J4441L8393j09409j82020j61527J5529
$$ plain form
17928 -420908 -250218 -164509 -49373 -174492 -333875 -355571 -178369 -121632 -70921 -106977
17918 -106977 -169677 -154786 -130424 -174873 -186389 -118591 82312 88206 31760 -170412 -276560
17907 -276560 -209594 -93419 1435 10526 -78470 -77641 -194258 -291016 -266040 -121244 44497
17896 44497 71396 189434 -49832 -363524 -307135 -131511 58288 79228 -95926 -52992
17886 -52992 11401 -168982 -290058 -257765 -228235 -195637 -144324 -149198 -102640 -109272 65176
17875 65176 134396 170701 14104 -64910 -75353 -87630 -118420 -218848 -156522 -230833 -194483
17864 -194483 -200949 -186530 -128174 -177416 -148194 -101885 67595 387 -45622 -104270 -90549
17853 -90549 -169896 -301836 -271379 -64768 54835 -11685 -12259 13469 -25468 -78729 -149356
$$ packed form
17928d20908J70690Q5709J15136j25119j59383k1696J77202N6737N0711l6056
17918a06977o2700J4891K4362m4449j1516O7798K00903N894n6446k02172j06148
17907b76560O6966J16175R4854R091q8996Q29j16617r6758K4976J44796J65741
17896D4497K6899J18038k39266l13692N6389J75624J89799K0940j75154M2934
17886e2992O4393j80383j21076L2293K9530L2598N1313m874M6558o632J74448
17875F5176O9220L6305j56597p9014j0443j2277l0790j00428O2326p4311L6350
17864a94483o466J4419N8356m9242K9222M6309J69480o7208m6009n8648J3721
17853i0549p9347j31940L0457K06611J19603o6520n74K5728l8937n3261p0627
$$ plain form
17842 -149356 -80344 -3367 -42750 -35076 -14616 113891 441198 621913 406800 259554 230439
17831 230439 167333 -990 -85987 -79009 168 66810 51947 -40407 62193 60489 -56855
17820 -56855 -269554 -273946 -124806 94380 159578 81920 12071 61499 92304 179337 248502
17809 248502 263209 148502 56744 48215 -97664 -158058 9241 141971 178587 385580 357412
17798 357412 183934 329284 632462 860213 953675 973154 1019799 972645 727154 557488
17788 557488 449007 220316 154876 105978 -73788 -109921 -91071 -18739 -4469 -159927 9453
17777 9453 42588 -162888 -228350 -244988 -132236 69019 163132 -27684 -108154 -78259 -229878
17766 -229878 -424554 -284164 -148266 -212796 -200196 -258767 -294516 -160780 -13838 12745
$$ packed form
17842a49356O9012P6977l9383P674K0460J28507L27307J80715k15113j47246k9115
17831B30439o3106j68323q4997O978P9177O6642j4863r2354J02600j704j17344
17820e6855k12699m392J49140K19186O5198p7658o9849M9428L0805Q7033O9165
17809B48502J4707j14707r1758q529j45879o0394J67299J32730L6616K06993k8168
17798C57412j73478J45350L03178K27751R3462J9479M6645m7154k45491j69666
17788E57488j08481k28691o5440m8898j79766l6133J8850P2332J4270j55458J69380
17777I453L3135k05476o5462j6638J12752K01255R4113j90816q0470K9895j51619
17766b29878j94676J40390J35898o4530J2600n8571l5749J33736J46942K6583
$$ plain form
17756 12745 -27723 70121 68888 219201 311891 238980 173879 182123 14373 8067 -51291 -32983
17744 -32983 9155 33095 -11065 24051 57758 45047 92472 36119 10062 66429 38276 162851
17732 162851 170320 17545 -62613 -76546 -126170 -57179 29672 -130497 -127716 -6132 12783
17721 12783 35150 65568 42140 -22503 -89088 -68140 -78858 -34226 -17319 -76971 -193367
17710 -193367 -330326 -252932 -203807 -124338 -127115 48313 124112 -33081 49550 117338 -833
17699 -833 -71793 -123486 -234216 -281634 -74427 34091 -58177 -33146 -79487 -137827 -234378
17688 -234378 -278506 -272668 -157404 -121407 127179 183000 62294 -39772 -17231 -183945 -119642
17677 -119642 -140380 -318995 -270835 -207949 -148023 -207921 -202540 -20519 17860 -24797 -177871
$$ packed form
17756A2745m0468R7844j233J50313R2690p2911o5101Q244j67750o306n9358J8308
17744c2983M2138K3940m4160L5116L3707j2711M7425n6353k6057N6367k8153J24575
17732A62851P469j52775q0158j3933m9624O8991Q6851j60169K781J21584J8915
17721A2783K2367L0418k3428o4643o6585K0948j0718M4632J6907n9652j16396
17710a93367j36959P7394M9125P9469k777J75428P5799j57193Q2631O7788j18171
17699h33p0960n1693j10730m7418K07207J08518r2268K5031m6341n8340r6551
17688b34378m4128N838J15264L5997K48586N5821j20706j02066K2541j66714O4303
17677a19642k0738j78615M8160O2886N9926n9898N381J82021L8379m2657j53074
$$ plain form
17666 -177871 -219796 -210892 -98913 -80776 -43558 -100480 -137801 -92694 -167647 -274646 -248064
17655 -248064 -79150 -29788 -56169 -11143 -106903 -17392 -39591 -192800 -79168 -59251 -22769
17644 -22769 -126785 -32112 229608 266989 150237 89542 101321 12008 -71457 15853 -102266
17633 -102266 -138372 -7513 66174 57598 43541 70778 126459 121273 78528 -115529 -125937
17622 -125937 -74888 -44719 -17522 30758 236085 208314 186693 121278 -23133 -51369 -127399
17611 -127399 -211617 -58567 18400 141023 192419 -32765 -53638 93508 -29501 -107016
17601 -107016 -178732 -198773 -163069 -110660 -53869 -488 -152825 -162769 -215881 -233046 -119643
17590 -119643 -190660 -208763 -281870 -339005 -217456 -159752 -142329 -59348 -123938 -122613 -106009
$$ packed form
17666a77871m1925Q904J11979J8137L7218n6922l7321M5107p4953j06999K6582
17655b48064J68914M9362k6381M5026r5760Q9511k2199j53209J13632J9917L6482
17644b2769j04016R4673K61720L7381j16752o0695J1779q9313q3465Q7310j18119
17633a02266l6106J30859P3687q576j4057K7237N5681n186m2745j94057j0408
17622a25937N1049L0169K7197M8280K05327k7771k1621o5415j44411k8236p6030
17611a27399q4218J53050P6967J22623N1396k25184k0873J47146j23009p7515
17601a07016p1716k0041L5704N2409N6791N3381j52337r944n3112j7165J13403
17590a19643p1017j8103p3107n7135J21549N7704J7423Q2981o4590J325J6604
$$ plain form
17579 -106009 -168801 -181658 -199655 -169516 -155122 -52644 73075 41827 15371 -73353 -219932
17568 -219932 -245416 -216195 -159477 10595 102855 31163 -90020 -134599 -99730 -58728 35996
17557 35996 39989 -17757 -30316 -207621 -176783 -156075 -140841 -121534 -231584 -240211 -40195
17546 -40195 -15431 -22399 29339 -59043 -35546 -109277 -179429 -218454 -328918 -527488 -357524
17535 -357524 -221591 -166853 -128498 -75174 -148859 -234228 -247390 -198397 -109460 -91043 -21013
17524 -21013 -21611 -54741 -85386 -22081 40502 184079 263258 167081 79130 203208 142963 71609
17512 71609 220739 364487 353433 327122 244522 -34597 -280391 -327921 -249168 -211998 -109290
17501 -109290 -85806 -48216 -17273 -5360 -1564 -98208 -51722 -27326 -17360 -71759 -107865 -100314
$$ packed form
17579a06009o2792j2857j7997L0139J4394J02478J25719l1248k6456q8724j46579
17568b19932k5484K9221N6718J70072R2260p1692j21183m4579L4869M1002R4724
17557C5996L993n7746j2559j77305L0838K0708J5234J9307j10050q627K00016
17546d0195K4764o968N1738q8382K3497p3731p0152l9025j10464j98570J69964
17535c57524J35933N4738L8355N3324p3685q5369j3162M8993Q8937J8417P0030
17524b1013n98l3130l0645O3305O2583J43577P9179r6177q7951J24078o0245p1354
17512G1609J49130J43748j1054k6311q2600k79119k45794m7530P8753L7170J02708
17501a09290K3484L7590L0943J1913L796r6644M6486K4396R966n4399l6106P551
$$ plain form
17489 -100314 -82083 -135125 -21483 -58658 -139281 -131270 -175869 -160758 -71181 -95205 -41452
17478 -41452 -81548 -84111 -19072 -52615 -271289 -424649 -352260 -146564 -150923 -211243 -180073
17467 -180073 -14603 259078 285969 106999 -28658 -119664 -128723 -123959 -67450 -16312 -69478
17456 -69478 -12783 -156145 -123589 61052 37015 -127418 -255402 -198856 -190168 -177144 -246169
17445 -246169 -278370 -316911 -189602 -48927 87999 244370 238105 279416 236806 143105 27313
17434 27313 -138204 -109681 -19018 18000 -174244 -297030 -422907 -234323 -124065 -127500 -148550
17423 -148550 -62593 -45190 35361 127909 90201 108359 192914 191542 222650 202150 146169 140949
17411 140949 112080 113678 125196 97145 -25664 -92982 -136663 -327950 -408666 -181117 -158580
$$ packed form
17489a00314J8231n3042J13642l7175q0623Q011m4599J5111Q9577k4024N3753
17478d1452m0096k563O5039l3543k18674j53360P2389K05696m359o0320L1170
17467a80073J65470K73681K6891j78970j35657r1006r059M764N6509N1138n3166
17456f9478N6695j43362L2556J84641k4037j64433j27984N6546Q688J3024o9025
17445b46169l2201l8541J27309J40675J36926J56371o265M1311m2610r3701j15792
17434B7313j65517K8523R0663L7018j92244j22786j25877J88584J10258l435k1050
17423a48550Q5957J7403Q0551R2548l7708J8158Q4555j372L1108k0500n5981n220
17411A40949k8869J598J1518k8051j22809o7318m3681j91287q0716K27549K2537
$$ plain form
17400 -158580 -97438 -73218 -194140 -107880 -145986 -257391 -253047 -85488 -15067 -84101 -158165
17389 -158165 15656 -32085 -101475 -156490 -164110 -326990 -382442 -271363 -18377 73894 138662
17378 138662 141967 -31830 -51988 -121411 -272712 -199160 -51341 246 120603 145072 -53898
17367 -53898 -130114 -4245 26961 71119 163556 6663 -178746 -144331 -195596 -303831 -313763
17356 -313763 -143348 -25659 38386 -173912 -270131 -245767 -284940 -108028 51841 76987
17346 76987 7379 -177437 -130928 -41188 98464 211757 -21866 -232571 -235111 -175271 -117181
17335 -117181 -66483 -17295 42332 25826 161027 61130 42488 105039 56968 14653 125469
17324 125469 72614 -112894 -162070 -191736 -115023 -172050 -255958 -227305 -158328 -60619 -40938
$$ packed form
17400a58580O1142K4220j20922Q6260l8106j11405M344J67559P0421o9034p4064
17389a58165J73821m7741o9390n5015p620j62880n5452J11079K52986R2271O4768
17378A38662L305j73797k0158o9423j51301P3552J47819N1587J20357K4469j98970
17367e3898p6216J25869L1206M4158R2437j56893j85409L4415n1265j08235r932
17356c13763J70415J17689O4045k12298r6219K4364l9173J76912J59869K5146
17346G6987o9608j84816M6509Q9740J39652J13293k33623k10705k540N9840N8090
17335a17181N0698M9188N9627j6506J35201r9897j8642O2551m8071m2315J10816
17324A25469n2855j85508m9176k9666P6713n7027q3908K8653O8977R7709J9681
$$ plain form
17313 -40938 142 15259 -9469 70267 148906 35516 -9593 -24740 -20453 8525 46669 182800
17301 182800 88847 87760 46750 -50678 26530 12327 52833 -89946 -183102 -77299 -27194
17290 -27194 -146401 -224449 -307418 -321202 -313588 -85523 -63158 -23332 58666 72775 136407
17279 136407 167283 180786 312573 371998 381626 339954 413757 308277 86387 134770 101106
17268 101106 128051 223004 54685 -159556 -204882 -167679 -203343 -153326 -55248 7287 -25203
17257 -25203 28713 -50935 53679 125392 257750 118178 107923 240015 175338 4177 -10042
17246 -10042 4540 -43564 -130007 -142223 -20852 -23326 -5616 -99541 -85600 -103503 -6792 46282
17234 46282 -40144 -125609 -102936 -5544 -78649 -182812 -43061 47737 92214 -6026 -107042
$$ packed form
17313d0938M1080J5117k4728P9736P8639j13390m5109j5147M287K8978L8144J36131
17301A82800r3953j087m1010r7428P7208j4203M0506j42779r3156J05803N0105
17290b7194j19207p8048q2969j3784P614K28065K2365L9826Q1998J4109O3632
17279A36407L0876J3503J31787N9425R628m1672P3803j05480k21890M8383l3664
17268A01106K6945R4953j68319k14241m5326L7203l5664N0017R8078O2535l2490
17257b5203N3916p9648J04614P1713J32358j39572j0255J32092o4677j71161j4219
17246a0042J4582m8104q6443j2216J21371k474J7710r3925J3941j7903R6711N3074
17234D6282q6426q5465K2673R7392p3105j04163J39751R0798M4477r8240j01016
$$ plain form
17223 -107042 37749 53259 -9017 -65407 -54913 88846 -33211 -164418 -238823 -314593 -370204
17212 -370204 -113641 7885 -111074 -230375 -289288 -176389 -62635 -101676 -169732 -203284
17202 -203284 -338933 -266105 -184339 -179452 -211023 -205950 -288776 -396650 -161657 41369 70426
17191 70426 -83204 -169159 -85439 -75492 -103521 45924 148770 187032 73322 19365 -101186
17180 -101186 -258180 -306067 -280282 -182309 -61515 -228154 -159420 -159970 -44944 75767 28235
17169 28235 -114611 -9954 49010 44354 134270 168530 222044 87061 210634 174549 198517
17158 198517 274956 81890 -89290 -47573 48898 -5213 -143460 -194774 -301048 -231456 -150139
17147 -150139 -171027 -106836 -90452 -102963 17154 -23584 100270 23037 -121746 -243210 -289799
$$ packed form
17223a07042J44791J5510o2276n6390J0494J43759j22057j31207p4405p5770n5611
17212c70204K56563J21526j18959j19301n8913J12899J13754l9041o8056l3552
17202b03284j35649P2828Q1766M887l1571N073q2826j07874K34993K03026K9057
17191G0426j53630q5955Q3720R947k8029J49445J02846L8262j13710n3957j20551
17180a01186j56994m7887K5785R7973J20794j66639O8734n50J15026J20711m7532
17169B8235j42846J04657N8964m656Q9916L4260N3514j34983J23573l6085K3968
17158A98517P6439j93066j71180M1717R6471n4111j38247n1314j06274O9592Q1317
17147a50139k0888O4191J6384j2511J20117m0738J23854p7233j44783j21464m6589
$$ plain form
17136 -289799 -274760 -150098 -20143 2675 -28223 -6446 4576 -168710 -56280 82383
17126 82383 -62718 -208663 -155684 -36081 114051 94533 33872 -9377 -76332 -285947 -382706
17115 -382706 -352593 -123799 -103745 -63812 166452 270912 -13634 -58099 -35066 -24753 34699
17104 34699 -116285 -132145 -154915 -108033 -76179 -175261 -178851 33959 65510 2855 132935
17093 132935 163415 21199 14702 -56514 -147481 -69851 119162 224038 74185 -70353 -73349
17082 -73349 -75101 22712 -39113 15112 -26451 -13467 26636 -79813 -5398 64263 241357
17071 241357 -13357 -251405 -253556 -189779 26734 11954 -58739 -170674 -217473 -188756 -184305
17060 -184305 -186444 -123007 -56926 -18247 -16768 -2353 25971 -11246 -226676 -296262 -386113 -388222
$$ packed form
17136b89799J5039J24662J29955K2818l0898K1777J1022j73286J12430J38663
17126H2383j45101j45945N2979J19603J50132j9518o0661m3249o6955k09615r6759
17115c82706L0113K28794K0054L9933K30264J04460k84546m4465K3033J0313N9452
17104C4699j50984j5860k2770M6882L1854r9082l590K12810L1551o2655J30080
17093A32935L0480j42216o497p1216r0967P7630J89013J04876j49853j44538k996
17082g3349j752R7813o1825N4225m1563J2984M0103j06449P4415O9661J77094
17071B41357k54714k38048k151O3777K16513j4780p0693j11935m6799K8717M451
17060a84305k139O3437O6081L8679J479J4415K8324l7217k15430o9586q9851k109
$$ plain form
17048 -388222 -286147 -167692 -29093 -29683 -75052 4903 140653 92586 42349 15140 55551
17037 55551 120341 80877 64097 11849 8857 -91955 -175724 -185018 -228871 -52578 102407
17026 102407 75134 102665 138305 18205 -50506 -94245 -276324 -373790 -406152 -340293 -250266
17015 -250266 -74621 -98811 -116656 -266569 -328836 -245750 -254136 -372904 -213110 -153220 -141792
17004 -141792 -185962 -113388 -213404 -158906 -171905 -288532 -380364 -214906 -119889 -223961 -352815
16993 -352815 -265231 -220104 -98339 -118995 -194423 -118252 50977 83502 227274 167515 -58848
16982 -58848 -149362 -208598 -245410 -236388 -209249 -156837 -144594 -128042 2871 78697 26009 54747
16970 54747 -15273 68374 -46915 -165079 -111349 -263090 -265829 -191776 -368907 -332670 -59303
$$ packed form
17048c88222J02075J18455J38599n90m5369P9955J35750m8067n0237k7209M0411
17037E5551O4790l9464j6780n2248k992j00812q3769r294m3853J76293J54985
17026A02407k7273K7531L5640j20100o8711m3739j82079r7466l2362O5859R0027
17015b50266J75645k4190j7845j49913o2267Q3086q386j18768J59794N9890J1428
17004a41792m4170P2574j00016N4498j2999j16627r1832J65458R5017j04072j28854
16993c52815Q7584M5127J21765k0656p5428P6171J69229L2525J43772n9759k26363
16982e8848r0514n9236l6812R022K7139N2412J2243J6552J30913P5826n2688K8738
16970E4747p0020Q3647j15289j18164N3730j51741k739P4053j77131L6237K73367
$$ plain form
16959 -59303 92188 57106 -96496 -117719 -32999 20612 206349 280389 259649 174091 61471
16948 61471 27760 -117627 -147944 -43466 -16235 26036 15187 53456 119952 143119 -28127
16937 -28127 -46396 -92464 -175074 -268592 -260312 -200669 -240744 -367386 -281551 -203804 -112351 -179889
16925 -179889 -289545 -391898 -373250 -278230 -55682 -86143 -106037 -53890 -185390 -109839 -95417
16914 -95417 -118376 -174898 -397485 -421493 -225532 -289214 -437503 -407507 -327902 -230047 -224438
16903 -224438 -277831 -363600 -337240 -258038 -191656 -239475 -269266 -329439 -111791 78828 57143
16892 57143 -69239 -163846 -156870 -57274 -30883 -71586 36334 6972 -172847 -144891 -52255
16881 -52255 -90953 -47707 -220407 -310390 -139614 -138539 -100870 -157742 -158758 -204750 -242642 -185262
$$ packed form
16959e9303J51491l5082j53602k1223Q4720N3611J85737P4040k0740q5558j12620
16948F1471l3711j45387l0317J04478K7231M2271j0849L8269O6496K3167j71246
16937b8127j8269m6068q2610r3518Q280N9643m0075j26642Q5835P7747R1453o7538
16925a79889j09656j02353J8648R5020K22548l0461j9894N2147j31500P5551J4422
16914i5417k2959n6522k22587k4008J95961o3682j48289K9996P9605R7855N609
16903b24438n3393q5769K6360P9202O6382m7819k9791o0173K17648J90619k1685
16892E7143j26382r4607O976R9596K6391m0703J07920k9362j79819K7956R2636
16881e2255l8698M3246j72700q9983J70776J075L7669n6872j016m5992l7892N7380
$$ plain form
16869 -185262 -197977 -287200 -198008 -152589 -51676 39347 74121 185625 27533 -112879 -10355
16858 -10355 113921 235400 43985 40686 4425 -15979 -16151 -86888 -171308 -223940 -268882 -169368
16846 -169368 -49537 -57906 -235609 -100461 -157118 -26832 34220 -56100 -97282 -53594 70606
16835 70606 170723 244151 247535 206142 -17317 -79912 -3281 -53363 38607 -19429 -117399
16824 -117399 -268132 -213717 -109742 -47498 -12122 140149 138982 -2089 -63722 -182690 -131629
16813 -131629 -48094 16624 247747 350358 261977 206593 160853 156401 141382 -136409 -341915
16802 -341915 -320956 -309643 -417704 -414429 -410088 -256722 -189481 -57461 -88446 -264240 -359279
16791 -359279 -287786 -44272 -25446 -227745 -328138 -234878 -126616 -41687 43515 120871 171699
$$ packed form
16869a85262j2715q9223Q9192M5419J00913R1023L4774J11504j58092j40412J02524
16858a0355J24276J21479j91415l299l6261k0404j72p0737q4420n2632m4942R9514
16846a69368J19831q369j77703J35148n6657J30286O1052r0320m1182M3688J24200
16835G0606J00117P3428L384m1393k23459o2595P6631n0082R1970n8036r7970
16824a17399j50733N4415J03975O2244L5376J52271j167j41071o1633j18968N1061
16813a31629Q3535O4718K31123J02611q8381n5384m5740m452j5019k77791k05506
16802c41915K0959J1313j08061L275M341J53366O7241J32020l0985j75794r5039
16791c59279P1493K43514J8826k02299j00393R3260J08262Q4929Q5202P7356N0828
$$ plain form
16780 171699 196822 94865 168714 243117 167149 154818 73222 -12427 -112094 -210539 -112038
16769 -112038 -5455 -82624 -61694 -200068 -312303 -96399 46246 -70876 -119869 -80679
16759 -80679 -90134 -197010 -284197 -257557 -224087 -112939 -155951 -109824 5533 65344 92817
16748 92817 -37671 -168238 -199623 -280350 -273358 -212968 -125845 150115 357942 225975 121898
16737 121898 -21313 -72744 -58021 -20906 -94996 -126247 -120187 -55450 -27349 -157895 -241327
16726 -241327 -197727 -89010 -579 -74092 -130634 -124135 -116572 22828 186894 125459 54605
16715 54605 53524 -48375 -78203 -67838 -103488 -312098 -275099 -179251 -178250 -301049 -294588 -344162
16703 -344162 -167929 -26824 28969 12326 -168813 -207961 55237 -61872 -204784 -129770
$$ packed form
16780A71699K5123j01957P3849P4403p5968j2331q1596q5649r9667r8445R8501
16769a12038J06583p7169K0930j38374j12235K15904J42645j17122m8993L9190
16759h0679r455j06876q7187K6640L3470J11148m3012M6127J15357N9811K7473
16748I2817j30488j30567l1385q0727O992O0390Q7123K75960K07827j31967j04077
16737A21898j43211n1431J4723L7115p4090l1251O060O4737K8101j30546q3432
16726b41327M3600J08717Q8431p3513n6542O499P563J39400J64066o1435p0854
16715E4605j081j01899k9828J0365l5650k08610L6999R5848J001j22799O461m9574
16703c44162J76233J41105N5793j6643j81139l9148K63198j17109j42912P5014
$$ plain form
16693 -129770 -84012 -49465 -129158 -105835 -507 104743 70453 -10138 -29706 -106043 -166107
16682 -166107 -194809 -78357 78044 3578 -143113 -7869 126448 7747 66085 153427
16672 153427 107591 127685 174090 130024 81381 -14096 -163412 -199731 -280331 -299172 -305421
16661 -305421 -338065 -215351 -65779 -21455 137731 163938 -7689 -160534 -432193 -422553
16651 -422553 -198793 -86842 -188399 -226250 36061 175494 43084 -32723 21327 79138
16641 79138 164543 203797 101401 29222 37110 104986 10326 22616 30427 -42756 1933 100539
16629 100539 103148 114356 16420 -190755 -141564 -8194 -255528 -392971 -338237 -180998 -142529
16618 -142529 -64878 -105953 -168506 -103489 -223532 -122170 831 -78690 -237852 -175825 -191110
$$ packed form
16693a29770M5758L4547p9693K3323J05328J05250l4290q0591j9568p6337o0064
16682a66107k8702J16452J56401p4466j46691J35244J34317j18701N8338Q7342
16672A53427m5836K0094M6405m4066m8643r5477j49316l6319q0600j8841o249
16661c05421l2644J22714J49572M4324J59186K6207j71627j52845k71659R640
16651d22553K23760J11951j01557l7851K62311J39433j32410p5807N4050N7811
16641G9138Q5405L9254j02396p2179P888O7876r4660J2290P811p3183M4689R8606
16629A00539K609J1208r7936k07175M9191J33370k47334j37443N4734J57239L8469
16618a42529P7651m1075o2553O5017j20043J01362J23001p9521j59162O2027j5285
$$ plain form
16607 -191110 -195522 -88288 32150 4587 -108533 -76386 -168398 -223940 -91658 104285 -219521
16596 -219521 -429965 -321441 -193129 -10255 -65865 -261739 -264597 -381342 -436823 -338948
16586 -338948 -202547 -46202 -81339 -230641 -111996 -43649 -197899 -193842 -146201 -212983 -327003
16575 -327003 -289438 -327801 -274249 -81627 81345 2634 -108037 -45917 112105 127138 251443
16564 251443 276449 139498 77015 -77203 -106004 61967 167469 91932 162681 66243 -17576
16553 -17576 36819 -71917 -239054 -264051 -208935 -48709 123737 -17743 -127810 -56201
16543 -56201 -21146 28260 65854 -16216 -76713 -51721 73074 163400 209993 101807 82654
16532 82654 239262 356524 170464 134371 133182 -24944 -59743 -57251 -46708 -31594 -22820
$$ packed form
16607a91110m412J07234J20438k7563j13120L2147r2012n5542J32282J95943l23806
16596b19521k10444J08524J28312J82874n5610j95874k858j16745n5481R7875
16586c38948J36401J56345l5137j49302J18645O8347j54250M057M7641o6782j14020
16575c27003L7565l8363N3552J92622J62972p8711j10671O2120J58022J5033J24305
16564B51443K5006j36951o2483j54218k8801J67971J05502p5537P0749r6438q3819
16553a7576N4395j08736j67137k4997N5116J60226J72446j41480j10067P1609
16543e6201L5055M9406L7594q2070o0497K4992J24795R0326M6593j08186j9153
16532H2654J56608J17262j86060l6093j189j58126l4799K492J0543J5114Q774
$$ plain form
16521 -22820 109732 112175 68080 24691 -128363 -312961 -483534 -533902 -498278 -348627 -253568
16510 -253568 -224662 -211941 -102280 -119653 -333775 -416597 -471056 -329878 -295021 -322113 -306270
16499 -306270 -184672 -152991 -145644 -282672 -298962 -90019 79711 -94281 -67740 66648
16489 66648 145941 163908 -91388 -302308 -109191 -233806 -157794 -165565 -190620 -29828 -6625
16478 -6625 -197149 -271953 -180365 -120529 -179032 -173705 150040 255757 73546 101384 -9511
16467 -9511 -55286 -130409 -214068 -340192 -291343 -127835 -119633 -235279 -321617 -174808 -258773
16456 -258773 -375208 -449694 -274785 -81894 -85547 -16126 168600 46939 23956 248733
16446 248733 191710 92874 -10439 -76258 -74153 -30143 23972 -130473 -52409 -164048 -141541
$$ packed form
16521b2820J32552K443m4095m3389j53054j84598j70573n0368L5624J49651R5059
16510b53568K8906J2721J09661j7373k14122q2822n4459J41178L4857k7092J5843
16499c06270J21598L1681P347j37028j6290K08943J69730j73992K6541J34388
16489F6648P9293J7967k55296k10920J93117j24615P6012p771k5055J60792K3203
16478f625j90524p4804R1588N9836n8503N327L23745J05717j82211K7838j10895
16467i511m5775p5123q3659j26124M8849J63508Q202j15646q6338J46809q3965
16456b58773j16435p4486J74909J92891l653O9421J84726j21661k2983K24777
16446B48733n7023r8836j03313o5819K105M4010N4115j54445P8064j11639K2507
$$ plain form
16435 -141541 -37652 -41639 -63334 5152 -47230 -91970 71048 107968 46966 -62784 -195673
16424 -195673 -265195 -228683 -149971 -250027 -153944 -22638 19442 100701 -13288 -182494 -161213
16413 -161213 -86753 -24651 -8106 16202 44891 71142 -128806 -314688 -322429 -179151 -175303
16402 -175303 -265998 -177705 -83054 -197565 -180158 -78878 -8338 51260 -29044 -116863 -58267
16391 -58267 -150126 -131974 11212 44318 -39190 -120513 -174930 -265146 -234978 -168643 -100730
16380 -100730 -163369 -161588 -23863 -56840 -48316 -53615 4320 -19140 -4290 62725 10846 -108303
16368 -108303 -266991 -217952 -282747 -254936 -156991 -158095 28219 29787 32344 111566 126277 17214
16356 17214 48842 55440 181249 12907 -48662 -55813 -30992 9276 113292 -74599 31906
$$ packed form
16435a41541J03889l987k1695O8486n2382m4740J63018L6920o1002j09750j32889
16424a95673o9522L6512P8712j00056R6083J31306M2080Q1259j13989j69206K1281
16413a61213P4460O2102J6545K4308K8689K6251j99948j85882p741J43278L848
16402a75303r0695Q8293R4651j14511J7407J01280P0540N9598q0304q7819N8596
16391e8267r1859J8152J43186L3106q3508q1323n4417r0216L0168O6335O7913
16380a00730o2639J781J37725l2977Q524n299N7935k3460J4850O7015n1879j19149
16368a08303j58688M9039o4795K7811R7945j104J86314J568K557P9222J4711j09063
16356A7214L1628O598J25809j68342o1569p151K4821M0268J04016j87891J06505
$$ plain form
16345 31906 130436 3705 17066 41113 97650 -63610 -24889 -40507 -128787 -256921 -433644
16334 -433644 -341974 -291404 -399686 -314971 -316538 -284056 -265726 -169947 -77879 -59054 -127584
16323 -127584 -162433 -181037 -8588 108424 155882 291619 274714 218784 61149 230373
16313 230373 272241 244762 313462 317450 192682 93917 130633 50872 37401 37442 201186 183937
16301 183937 97257 110691 96501 122568 -121526 -301588 -351822 -327623 -202985 -145459 -121854
16290 -121854 69158 75962 -2472 -43122 -283730 -438631 -380103 -318978 -215553 -280915 -374445
16279 -374445 -154039 17235 -6477 -57156 24841 -82885 -131622 -94852 -161987 -76391 85761
16268 85761 -94763 18522 -101421 -155256 -198661 -152267 -129341 -141819 -82399 -139779 -125214
$$ packed form
16345C1906R8530j26731J3361K4047N6537j61260L8721j5618q8280j28134j76723
16334d33644R1670N0570j08282Q4715j567L2482J8330R5779R2068J8825o8530
16323a27584l4849j8604J72449J17012M7458J35737j6905n5930j57635J69224
16313B30373M1868k7479O8700L988j24768r8765L6716p9761j3471M1J63744j7249
16301A83937q6680J3434j4190K6067k44094j80062n0234K4199J24638N7526K3605
16290a21854J91012O804p8434m0650k40608j54901N8528O1125J03425o5362r3530
16279c74445K20406J71274k3712n0679Q1997j07726m8737L6770o7135Q5596J62152
16268H5761j80524J13285j19943n3835m3405M6394K2926j2478N9420n7380J4565
$$ plain form
16257 -125214 -215375 -273590 -188989 -320332 -449394 -314024 -371302 -314192 -368516 -426766 -191834
16246 -191834 -145121 -280422 -260239 -201828 -103220 -76511 -119739 -263892 -215934 -74473 66897
16235 66897 207532 129791 88605 -84565 45427 116952 81095 152924 42238 -36034 -118308
16224 -118308 -42218 24214 -184320 -426438 -294670 -260362 -240392 -233556 -177747 -177225 -122407
16213 -122407 -13454 -90436 9568 40195 -61599 -107206 -184637 -251667 -150759 -72238 -40116
16202 -40116 -2555 -13676 45102 9604 -51253 -36326 -89944 -239430 -323954 -392625 -419922
16191 -419922 -257179 -203086 -172090 -64311 -87989 -86787 -65709 -141345 -4788 138161 80442
16180 80442 13484 73515 66713 37074 48259 -19559 127807 76926 67574 66894 87648 152032
$$ packed form
16257a25214r0161n8215Q4601j31343j29062J35370n7278N7110n4324n8250K34932
16246a91834M6713j35301K0183N8411R8608K6709m3228j44153M7958J41461J41370
16235F6897J40635p7741m1186j73170J29992P1525l5857P1829j10686p8272q2274
16224a18308P6090O6432k08534k42118J31768L4308J9970O836N5809N22N4818
16213a22407J08953p6982J00004L0627j01794m5607p7431o7030J00908P8521L2122
16202d0116L7561j1121N8778l5498o0857J4927n3618j49486q4524o8671k7297
16191d19922J62743N4093L0996J07779k3678J202K1078p5636J36557J42949n7719
16180H0442o6958O0031o802k9639J1185o7818J47366n0881r352o80K0754O4384
$$ plain form
16168 152032 65472 -149177 -62515 145354 200356 -56876 -69295 -19777 -43760 -7407 -121246
16157 -121246 -167326 -67258 -123753 -196366 -205639 -183126 -150319 -167949 -180878 -230106 -184959
16146 -184959 -124967 -49253 -81753 -29652 -108062 -220715 -162622 -274728 -221861 -190438 -109610
16135 -109610 -68581 85530 133074 71624 -4573 -64915 -74226 -50951 5870 2096 -100550
16124 -100550 -3676 36054 57858 61239 90169 159916 72153 81569 105660 38611 -18074 94633
16112 94633 119895 -4757 -209130 -237260 -257161 -141409 -154847 -166243 -151014 -174895 -168939
16101 -168939 -191297 -183856 -304934 -322933 -156282 -13514 -1826 -14960 -98973 -28067 -120939
16090 -120939 -169906 -230677 -270590 -153512 -11994 10806 88065 62022 -43195 -42336 -117242
$$ packed form
16168A52032q6560k14649Q6662K07869N5002k57232j2419M9518k3983L6353j13839
16157a21246m6080J00068n6495p2613r273K2513L2807j7630j2929m9228M5147
16146a84959N9992P5714l2500N2101p8410j12653N8093j12106N2867L1423Q0828
16135a09610M1029J54111M7544o1450p6197o0342r311K3275N6821l774j02646
16124a00550R6874L9730K1804L381K8930O9747q7763R416K4091o7049n6685J12707
16112I4633K5262j24652k04373k8130j9901J15752j3438j1396J5229k3881N956
16101a68939k2358P441j21078j7999J66651J42768J1688j3134q4013P0906r2872
16090a20939m8967o0771l9913J17078J41518K2800P7259k6043j05217Q59p4906
$$ plain form
16079 -117242 -170808 -160981 -80609 3957 -115063 -113441 -140313 -69755 98584 51727 -92559
16068 -92559 -192576 -248268 -208721 -24281 -31970 -118036 -37678 47631 -168185 -285359 -280816
16057 -280816 -158193 -130552 -138437 -135026 -51696 -31582 -48635 -192892 -360295 -263226 -160162
16046 -160162 -157732 -150713 -39797 6957 24134 -156749 -97443 -47427 -57479 -89550 36388
16035 36388 127728 363835 307428 192272 16336 -46331 49748 -40961 -50582 132844 -14735
16024 -14735 -146087 -198429 -263813 -308860 -155738 -129719 -189968 -37781 34275 -92703 -194748
16013 -194748 -182097 -83517 9380 -108876 -7528 152911 16531 20194 999 -92011 -128637
16002 -128637 -165268 -140402 -173262 -278788 -321585 -260727 -294393 -201874 -176868 -213230 -98923
$$ packed form
16079a17242n3566R827Q0372Q4566j19020J622k6872P0558J68339m6857j44286
16068i2559j00017n5692L9547J84440p689q6066Q0358Q5309k15816j17174M543
16057b80816J22623K7641p885L411Q3330K0114j7053j44257j67403R7069J03064
16046a60162K430P019J10916M6754J7177j80883N9306N0016j0052l2071J25938
16035C6388R1340K36107n6407j15156j75936o2667R6079r0709r621J83426j47579
16024a4735j31352n2342o5384m5047J53122K6019o0249J52187P2056j26978j02045
16013a94748J2651R8580R2897j18256J01348J60439j36380L663j9195r3010l6626
16002a28637l6631K4866l2860j05526m2797O0858l3666R2519K5006l6362J14307
$$ plain form
15991 -98923 -8849 -2755 -200971 -305142 -326925 -416540 -310115 -146504 -195148 -358223 -261311
15980 -261311 -243028 -134625 -15539 123472 -49245 -192860 -249198 -168162 -219202 -200468
15970 -200468 202366 493492 430881 121709 -148840 -29509 -10899 12849 -40904 63173
15960 63173 84321 63632 -144255 -284491 -159353 -154944 -261106 -278542 -258616 -210038 -1808
15949 -1808 53288 -56895 -101977 -124918 -51138 -31796 -45090 -163689 -190480 -185406 -335729
15938 -335729 -479691 -427575 -424485 -338908 -379470 -350920 -322711 -264111 -65813 165372 136777
15927 136777 121090 174897 184153 -14842 -175621 -35543 131996 124082 182667 218673 44396
15916 44396 118614 146006 185772 104261 -56957 -134818 -61569 70718 -4496 -155939 -27903
$$ packed form
15991i8923R0074O094j98216j04171k1783q9615J06425J63611m8644j63075R6912
15980b61311J8283J08403J19086J39011j72717j43615n6338Q1036n1040J8734
15970b00468M02834K91126o2611l09172k70549J19331J8610K3748n3753J04077
15960F3173K1148k0689k07887j40236J25138M409j06162j7436J9926M8578K08230
15949a808N5096j10183m5082k2941P3780J9342j3294j18599k6791N074j50323
15938c35729j43962N2116L090Q5577m0562K8550K8209N8600J98298K31185k8595
15927A36777j5687N3807R256j98995j60779J40078J67539p914N8585L6006j74277
15916D4396P4218K7392L9766q1511j61218p7861P3249J32287p5214j51443J28036
$$ plain form
15905 -27903 -83217 -98794 -63422 -109158 -360041 -428671 -203720 -17160 -148742 -244141 -121942
15894 -121942 -98452 -219060 -212738 -31128 -24926 -4693 126814 292342 144966 222451 180687
15883 180687 111168 145944 269284 70418 -74895 -104148 -22606 -84622 -153478 -212506 -171686
15872 -171686 -51501 24118 -32440 -178088 -113972 -34424 -33904 -140417 -213882 -108966 74079
15861 74079 63203 -122059 -89088 36348 135009 47946 -103856 21469 -63284 -222542 -418567
15850 -418567 -331822 -235948 -301206 -335289 -235227 -183142 -235413 -203406 -32176 4697 -117967
15839 -117967 -114335 -73595 -216132 -280783 -135747 111671 145030 80560 64813 155947 131908
15828 131908 29106 73531 282529 205670 55380 -130853 -181303 -111435 -4172 -6905 60576
$$ packed form
15905b7903n5314j5577L5372m5736k50883o8630K24951J86560j31582r5399J22199
15894a21942K3490j20608O322J81610O202K0233J31507J65528j47376P7485m1764
15883A80687o9519L4776J23340j98866j45313k9253Q1542o2016o8856n9028M0820
15872a71686J20185P5619n6558j45648O4116P9548N20j06513p3465J04916J83045
15861G4079j0876j85262L2971J25436R8661q7063j51802J25325q4753j59258j96025
15850d18567Q6745R5874o5258l4083J00062N2085n2271L2007J71230L6873j22664
15839a17967L632M0740j42537o4651J45036K47418L3359o4470j5747R1134k4039
15828A31908j02802M4425K08998p6859j50290j86233n0450O9868J07263k733O7481
$$ plain form
15817 60576 -24326 -20068 -103765 -125289 -94579 -158409 -324660 -414444 -396827 -290826 -304060
15806 -304060 -344136 -301888 -331684 -306214 -325385 -191995 -121281 -146187 35104 39692 -31138
15795 -31138 -129875 -119658 -96614 -60411 17142 -5202 39152 18252 -145418 -166288 -109840
15784 -109840 -101927 -157612 -230456 -201821 -101806 -32376 19103 176984 217531 273734 184906
15773 184906 169990 307317 282557 38307 -145580 -198514 -189200 -18679 101411 59537 -38564
15762 -38564 -124884 -18958 104480 35397 -188926 -168731 2880 97613 20673 -36342 93995
15751 93995 5693 -146303 -77321 116817 105683 134809 3051 -295920 -270097 -162529 -247756
15740 -247756 -160830 52595 -14006 67815 235520 59205 9749 34606 -48708 26992 190376
$$ packed form
15817F0576q4902M258q3697k1524L0710o3830j66251q9784J7617J06001j3234
15806c04060m0076M2248k9796K5470j9171J33390P0714k4906J81291M588p0830
15795c1138r8737J0217K3044L6203P7553k2344M4354k0900j63670k0870N6448
15784a09840P913n5685p2844K8635J00015O9430N1479J57881M0547N6203q8828
15773A84906j4916J37327k4760k44250j83887n2934R314J70521J20090m1874r8101
15762c8564q6320J05926J23438o9083k24323K0195J71611R4733p6940n7015J30337
15751I3995q8302j51996O8982J94138j1134K9126j31758k98971K5823J07568q5227
15740b47756Q6926K13425o6601Q1821J67705j76315m9456K4857q3314P5700J63384
$$ plain form
15729 190376 83149 -28756 32365 25120 17196 -5319 17595 120127 92814 -16353 -158853
15718 -158853 -188478 -130928 -28225 -156323 -379059 -318000 -230315 -310496 -379967 -338503 -247844
15707 -247844 39555 218260 270379 311101 245742 90838 -18010 -115804 -88280 -251809
15697 -251809 -218685 -164587 -173066 -106952 -76319 -79750 -116564 -1416 -70238 -111159 46395
15686 46395 228087 222794 231455 124548 108920 211864 209125 43511 -4348 -184074 -150692
15675 -150692 -164466 -249970 -193418 -157804 -18493 -106905 -149927 -13071 59024 -15602 -109054
15664 -109054 -145046 -206199 -215435 -30077 73004 95009 51471 49872 25014 -7712 -2890 -121760
15652 -121760 -151375 -62769 -84625 -146036 -172008 -370488 -453776 -268608 -184317 -172705 -162043
$$ packed form
15729A90376j07227j11905O1121p245p924k2515K2914J02532k7313j09167j42500
15718a58853k9625N7550J02703j28098k22736O1059Q7685q0181o9471M1464R0659
15707b47844K87399J78705N2119M0722o5359j54904j08848r7794K7524j63529
15697b51809L3124N4098q479O6114L0633l431l6814J15148o8822m0921J57554
15686D6395J81692n293Q661j06907j5628J02944k739j65614m7859j79726L3382
15675a50692j3774q5504N6552L5614J39311q8412m3022J36856P2095p4626r3452
15664a09054l5992o1153r236J85358J03081K2005m3538j599k4858l2726M822j18870
15652a21760k9615Q8606k1856o1411k5972j98480q3288J85168Q4291J1612J0662
$$ plain form
15641 -162043 -135381 -42801 174402 289395 228739 104784 -69209 -131238 -220850 -211061 -230347
15630 -230347 -219586 -227901 -141928 -129661 -56884 -71152 -206495 -202292 -28252 148929 76088
15619 76088 75379 167495 97279 25742 4165 -108054 -210122 -215282 -357512 -334039 -212668
15608 -212668 -220781 -152915 -52394 167180 224938 84425 147920 13287 -92991 -57748 72052
15597 72052 159402 3615 -69658 56675 -67479 -97827 -110861 -75176 -11123 106588 -33616
15586 -33616 -152996 -121981 -30003 13246 63457 128180 91137 24769 9904 -140584 -177312
15575 -177312 -138799 -30142 91063 2547 -59370 -203342 -180270 -120447 -243830 -180161 -154195
15564 -154195 -124294 -198896 -126521 -94828 -225587 -92136 75666 161198 117753 103890 5416
$$ packed form
15641a62043K6662R2580K17203J14993o0656j23955j73993o2029q9612R789j9286
15630b30347J0761q315Q5973J2267P2777j4268j35343M203J74040J77181p2841
15619G6088p09R2116p0216p1537k1577j12219j02068n160j42230K3473J21371
15608b12668q113O7866J00521K19574N7758j40513O3495j34633j06278L5243J29800
15597G2052Q7350j55787p3273J26333j24154l0348j3034L5685O4053J17711j40204
15586c3616j19380L1015R1978M3249N0211O4723l7043o6368j4865j50488l6728
15575a77312L8513J08657J21205q8516o1917j43972K3072N9823j23383O3669K5966
15564a54195K9901p4602P2375L1693j30759J33451J67802Q5532m3445j3863r8474
$$ plain form
15553 5416 -1155 153240 253766 197026 212675 151635 77311 103628 151281 63462 14786 -97774
15541 -97774 -262490 -304579 -201283 -23346 -61678 -90964 -220101 -208630 -146994 -260727 -352998
15530 -352998 -331167 -74639 4550 -177552 -171242 -35135 -90024 -79292 -77280 -213193 -171352
15519 -171352 -166875 -84046 50297 33483 -34430 -156746 -340928 -412270 -412371 -366968 -130165
15508 -130165 154607 168884 84337 -69572 -28664 -2691 44839 -183902 -9974 293523
15498 293523 449646 239301 206255 179710 177959 263780 242060 157291 -6653 -243989 -184375
15487 -184375 -204754 -398044 -380692 -185141 -9385 171674 192550 38166 -8760 -60315
15477 -60315 -174933 -237188 -308470 -226013 -226651 -142831 -20343 31163 -160767 -302260 -357821
$$ packed form
15553E416o571J54395J00526n6740J5649o1040p4324K6317M7653q7819m8676j12560
15541i7774j64716m2089J03296J77937l8332k9286j29137J1471O1636j13733r2271
15530c52998K1831K56528P9189j82102O310J36107n4889J0732K012j35913M1841
15519a71352M477Q2829J34343j6814o7913j22316j84182p1342j01M5403K36803
15508a30165K84772J4277q4547j53909M0908K5973M7530k28741J73928L03497
15498B93523J56123k10345l3046k6545j751Q5821k1720q4769j63944k37336N9614
15487a84375k0379j93290J7352J95551J75756J81059K0876j54384m6926n1555
15477f0315j14618o2255p1282Q2457o38Q3820J22488N1506j91930j41493n5561
$$ plain form
15466 -357821 -258137 -120061 48736 139178 190148 114386 64486 -96546 -205693 -166468 -85432
15455 -85432 -140016 -220608 -308804 -168601 -133246 36270 51583 11307 -117101 -187843 -237449
15444 -237449 -110064 -13055 -181973 -203795 -247577 -168299 -196704 -246354 -170262 -139675 63701
15433 63701 178233 35679 -14964 -55748 -126006 -157944 -2100 73665 37299 89898 239157
15422 239157 304062 111961 117473 233005 655 -146209 -54658 -22704 -150189 -142913 -108239
15411 -108239 -227905 -183470 -82437 25889 70416 -5259 -26412 -136660 -83638 -74986 13101
15400 13101 46761 -7546 -607 -44855 -3785 -73145 -242042 -308760 -257172 -222193 -159260 -96174
15388 -96174 -125003 -101830 -61400 1919 177090 234772 215851 265051 388693 367996 171994
$$ packed form
15466c57821R9684J38076J68797R0442N0970p5762m9900j61032j09147L9225Q1036
15455h5432n4584q0592q8196J40203L5355J69516J5313m0276j28408p0742m9606
15444b37449J27385R7009j68918k1822m3782P9278k8405m9650P6092L0587K03376
15433F3701J14532j42554n0643m0784p0258l1938J55844P5765l6366N2599J49259
15422B39157O4905j92101N512J15532k32350j46864R1551L1954j27485P276L4674
15411a08239j19666M4435J01033J08326M4527p5675k1153j10248N3022Q652Q8087
15400A3101L3660n4307O939m4248M1070o9360j68897o6718N1588L4979O2933O3086
15388i6174k8829K3173M0430O3319J75171N7682j8921M9200J23642k0697j96002
$$ plain form
15377 171994 -33842 83612 70932 -41070 -43106 -39713 22032 137695 193271 141082 61976
15366 61976 -25557 -85108 -159008 -115557 -154122 -186709 -145711 -145803 -157907 5031 209377 19417
15354 19417 -183977 -252715 -142752 -79372 35068 109881 31152 65311 163754 153063 273508
15343 273508 156899 37768 208636 357676 467174 424212 116298 -53538 -148336 -265577
15333 -265577 -252408 -214321 -107511 112672 56775 -252853 -355340 -292604 -185390 -198830
15323 -198830 -215481 -186081 -160043 42649 30190 -250559 -230185 -46534 -123488 -11064 230812
15312 230812 232489 213560 24810 19748 155235 80838 109945 58869 -210536 -269418 -6727
15301 -6727 -44112 -186131 -156724 1844 17692 36918 197417 409852 403003 225356 124746
$$ packed form
15377A71994k05836J17454j2680j12002k036L393O1745J15663N5576n2189p9106
15366F1976q7533n9551p3900M3451l8565l2587M0998r2j2104J62938K04346j89960
15354A9417k03394o8738J09963O3380J14440P4813p8729L4159R8443j0691J20445
15343B73508j16609j19131J70868J49040J09498m2962l07914j69836r4798j17241
15333b65577J3169L8087J06810K20183n5897l09628j02487O2736J07214j3440
15323a98830j6651K9400K6038K02692j2459k80749K0374J83651p6954J12424K41876
15312B30812J677j8929j88750n062J35487p4397K9107n1076k69405n8882K62691
15301f727l7385j42019K9407J58568J5848J9226J60499K12435o849j77647j00610
$$ plain form
15290 124746 -63836 -74673 -37892 26250 -105352 -131546 -271802 -239946 -154496 -159192 -314975
15279 -314975 -256281 -300656 -218606 18302 -12007 -289773 -358222 -247421 -84292 -35129 54056
15268 54056 -6975 22072 -3284 98475 -1396 -82847 -31222 -43235 98789 62151 -79420
15257 -79420 -165378 -133692 -99963 -86020 -116990 -57763 -118397 48595 129954 32781 -84574
15246 -84574 -122500 -295864 -343040 -267690 -131682 -21988 -91421 -112860 9284 83639 71538
15235 71538 -82777 -113721 -139871 -129229 -175775 -80659 -105977 -115490 90874 149922 30016
15224 30016 -18300 41699 -1587 -30560 71559 81542 28124 23329 36367 -55541 -211795 -383288
15212 -383288 -318259 -265215 -280162 -334406 -371104 -392181 -128667 -28448 -72986 -80098 -68483
$$ packed form
15290A24746j88582j0837L6781O4142j31602k6194j40256L1856Q5450m696j55783
15279c14975N8694m4375Q2050K36908l0309k77766o8449J10801J63129M9163Q9185
15268E4056o1031K9047k5356J01759r9871q1451N1625j2013J42024l6638j41571
15257g9420q5958L1686L3729J3943l0970N9227o0634J66992Q1359r7173j17355
15246h4574l7926j73364m7176P5350J36008J09694o9433k1439J22144P4355j2101
15235G1538j54315l0944k6150J0642m6546R5116k5318r513K06364N9048j19906
15224C0016m8316N9999m3286k8973J02119R983n3418m795J3038r1908j56254j71493
15212c83288O5029N3044j4947n4244l6698k1077K63514J00219m4538p112J1615
$$ plain form
15201 -68483 -27869 -75159 71855 235656 253211 248766 307656 196579 78746 -55453 -48931
15190 -48931 -16645 66971 215199 94349 207736 163162 51848 23589 -139044 -49359 -107407
15179 -107407 -176815 -66675 -25095 -47833 32922 32754 12274 10310 -2052 46492 46953 37638
$$ packed form
15201f8483M0614m7290J47014J63801J7555m445N8890j11077j17833j34199O522
15190d8931L2286Q3616J48228j20850J13387m4574j11314k8259j62633Q9685n8048
15179a07407o9408J10140M1580k2738Q0755j68k0480j964j2362M8544M61r315
$$ [...]
0H6
##END NTUPLES=NMR SPECTRUM
##END=
