##TITLE=Analysis number 326637
Compound Code mo 07908
Book Reference 483/114/2
Project Code adrs
Chemist Name mattw
##JCAMPDX= 6.0         $$ Bruker NMR JCAMP-DX V2.0
##DATA TYPE= NMR SPECTRUM
##DATA CLASS= NTUPLES
##ORIGIN= Bruker BioSpin GmbH
##OWNER= nmr
$$ XWIN-NMR		Version 3.5
$$ Fri Feb 16 08:56:46 2007 GMT Standard Time (UT+0h)  MAYBRIDGE\nmr@NMR_250MHZ
##.OBSERVE FREQUENCY= 250.131544655141
##.OBSERVE NUCLEUS= ^1H
##.ACQUISITION MODE= SIMULTANEOUS (DQD)
##.ACQUISITION SCHEME= undefined
##.AVERAGES= 16
##.DIGITISER RES= 18
##SPECTROMETER/DATA SYSTEM= dpx250
##.PULSE SEQUENCE= zg30
##.SOLVENT NAME= CDCl3
##.SHIFT REFERENCE= (INTERNAL, CDCl3, 0, 16.454)
##AUDIT TRAIL= $$ (NUMBER, WHEN, WHO, WHERE, WHAT)
$$ ##TITLE= Audit trail, XWIN-NMR		Version 3.5
$$ ##JCAMPDX= 5.01
$$ ##ORIGIN= Bruker BioSpin GmbH
$$ ##OWNER= nmr
$$ C:\u/data/dgb/nmr/ADRS/1040/pdata/1/auditp.txt
$$ ##AUDIT TRAIL=  $$ (NUMBER, WHEN, WHO, WHERE, WHAT)
(   1,<2007-02-16 08:56:24.32 +000>,<MAYBRIDGE\nmr>,<NMR_250MHZ>,
      <created by zg, POWCHK disabled, PULCHK disabled
       configuration hash MD5:
       49 4B E0 1D 92 C2 6B 37 9F E6 65 BC 52 41 86 1D
       data hash MD5: 64K
       F8 C4 EF 08 49 C1 1F 30 B5 B0 0A 14 8A 37 FE 2D>)
(   2,<2007-02-16 08:56:36.93 +000>,<MAYBRIDGE\nmr>,<NMR_250MHZ>,
      <Start of raw data processing
       ef LB = 0.3 FT_mod = 6 PKNL = 1 SI = 32K 
       data hash MD5: 32K
       58 55 DD 11 46 F1 6A 93 32 32 3B 42 97 F6 22 2D>)
(   3,<2007-02-16 08:56:38.57 +000>,<MAYBRIDGE\nmr>,<NMR_250MHZ>,
      <apk 
       data hash MD5: 32K
       5C 56 44 4E C0 00 D2 AB 09 79 00 7C A0 90 E4 DA>)
(   4,<2007-02-16 08:56:39.24 +000>,<MAYBRIDGE\nmr>,<NMR_250MHZ>,
      <abs ABSG = 5 
       data hash MD5: 32K
       CE 15 8A 6C 12 26 8E B9 B7 C6 16 BF 1E C3 B0 E3>)
$$ ##END=
$$ 
$$ hash MD5
$$ EC 41 A0 5C EE 32 A0 EB 2D C2 87 C5 0C 3C 9E C7
##$RELAX= 
##$RELAX= 
##$RELAX= 
##$RELAX= 
##$RELAX= 
##$RELAX= 
##$RELAX= 
$$ Bruker specific parameters
$$ --------------------------
##$DU= <C:\u>
##$EXPNO= 1040
##$NAME= <ADRS>
##$PROCNO= 1
##$TYPE= <nmr>
##$USER= <dgb>
##$AMP= (0..31)
100 100 100 100 100 100 100 100 100 100 100 100 100 100 100 100 100 100 
100 100 100 100 100 100 100 100 100 100 100 100 100 100 
##$AQSEQ= 0
##$AQ_mod= 3
##$AUNM= <au_zg>
##$AUTOPOS= <39 >
##$BF1= 250.13
##$BF2= 250.13
##$BF3= 250.13
##$BF4= 250.13
##$BF5= 500.13
##$BF6= 500.13
##$BF7= 500.13
##$BF8= 500.13
##$BYTORDA= 1
##$CFDGTYP= 0
##$CFRGTYP= 5
##$CHEMSTR= <none>
##$CNST= (0..31)
1 1 145 1 1 1 1 1 1 1 1 1 1 1 1 1 1 1 1 1 1 1 1 1 1 1 1 1 1 1 1 1 
##$CPDPRG= <>
##$CPDPRG1= <>
##$CPDPRG2= <>
##$CPDPRG3= <>
##$CPDPRG4= <mlev>
##$CPDPRG5= <mlev>
##$CPDPRG6= <mlev>
##$CPDPRG7= <mlev>
##$CPDPRG8= <mlev>
##$CPDPRGB= <>
##$CPDPRGT= <>
##$D= (0..31)
0 1 0 0 0 0 0 0 0 0.06 0 0 0 0 0 0 0.0002 0 0 0 0 0 0 0 0 0 0 0 0 0 0 
0 
##$DATE= 1171616183
##$DBL= (0..7)
120 120 120 120 120 120 120 120 
##$DBP= (0..7)
150 150 150 150 150 150 150 150 
##$DBP07= 0
##$DBPNAM0= <>
##$DBPNAM1= <>
$$ [...]
##$SUBNAM7= <"">
##$SUBNAM8= <"">
##$SUBNAM9= <"">
##$SW= 20.6930455092707
##$SWIBOX= (0..15)
0 0 3 0 0 0 0 0 0 0 0 0 0 0 0 0 
##$SW_h= 5175.983436853
##$TD= 65536
##$TD0= 1
##$TE= 295.16
##$TE2= 300
##$TE3= 300
##$TEG= 300
##$TL= (0..7)
0 120 120 120 120 120 120 120 
##$TP= (0..7)
150 150 150 150 150 150 150 150 
##$TP07= 0
##$TPNAME0= <>
##$TPNAME1= <>
##$TPNAME2= <>
##$TPNAME3= <>
##$TPNAME4= <>
##$TPNAME5= <>
##$TPNAME6= <>
##$TPNAME7= <>
##$TPOAL= (0..7)
0.5 0.5 0.5 0.5 0.5 0.5 0.5 0.5 
##$TPOFFS= (0..7)
0 0 0 0 0 0 0 0 
##$TUNHIN= 0
##$TUNHOUT= 0
##$TUNXOUT= 0
##$USERA1= <user>
##$USERA2= <user>
##$USERA3= <user>
##$USERA4= <user>
##$USERA5= <user>
##$V9= 5
##$VALIST= <valist>
##$VCLIST= <CCCCCCCCCCCCCCC>
##$VD= 0
##$VDLIST= <DDDDDDDDDDDDDDD>
##$VPLIST= <PPPPPPPPPPPPPPP>
##$VTLIST= <TTTTTTTTTTTTTTT>
##$WBST= 1024
##$WBSW= 4
##$XGAIN= (0..3)
0 0 0 0 
##$XL= 0
##$YL= 0
##$YMAX_a= 296699
##$YMIN_a= -420283
##$ZGOPTNS= <>
##$ZL1= 120
##$ZL2= 120
##$ZL3= 120
##$ZL4= 120
##$ABSF1= 16.45402
##$ABSF2= -4.239153
##$ABSG= 5
##$ABSL= 3
##$ALPHA= 0
##$AQORDER= 0
##$ASSFAC= 0
##$ASSFACI= 0
##$ASSFACX= 0
##$ASSWID= 0
##$AUNMP= <proc_1d>
##$AZFE= 0.1
##$AZFW= 0.1
##$BCFW= 0
##$BC_mod= 0
##$BYTORDP= 0
##$COROFFS= 0
##$CY= 12.5
##$DATMOD= 1
##$DC= 0
##$DFILT= <>
##$DTYPP= 0
##$F1P= 14.0000005364418
##$F2P= -0.99999901652339
##$FCOR= 0.5
##$FTSIZE= 32768
##$FT_mod= 6
##$GAMMA= 0
##$GB= 0
##$INTBC= 1
##$INTSCL= 1
##$ISEN= 128
##$LB= 0.3
##$LEV0= 0
##$LPBIN= 0
##$MAXI= 10000
##$MC2= 0
##$MEAN= 0
##$ME_mod= 0
##$MI= 0
##$NCOEF= 0
##$NC_proc= -5
##$NLEV= 6
##$NOISF1= 0
##$NOISF2= 0
##$NSP= 0
##$NTH_PI= 0
##$NZP= 0
##$OFFSET= 16.45402
##$PC= 1
##$PHC0= 228.5897
##$PHC1= 12.41361
##$PH_mod= 1
##$PKNL= yes
##$PPARMOD= 0
##$PSCAL= 4
##$PSIGN= 0
##$REVERSE= no
##$SF= 250.130017002173
##$SI= 32768
##$SIGF1= 0
##$SIGF2= 0
##$SINO= 400
##$SIOLD= 32768
##$SREGLST= <1H.CDCl3>
##$SSB= 0
##$STSI= 32768
##$STSR= 0
##$SW_p= 5175.98343685301
##$SYMM= 0
##$S_DEV= 0
##$TDeff= 65536
##$TDoff= 0
##$TI= <Analysis number 999999
Compound Code 99
Book Reference 9
Project Code 9>
##$TILT= no
##$TM1= 0
##$TM2= 0
##$TOPLEV= 0
##$USERP1= <user>
##$USERP2= <user>
##$USERP3= <user>
##$USERP4= <user>
##$USERP5= <user>
##$WDW= 1
##$XDIM= 32768
##$YMAX_p= 559836837
##$YMIN_p= -707149
$$ End of Bruker specific parameters
$$ ---------------------------------
##NTUPLES= NMR SPECTRUM
##VAR_NAME=  FREQUENCY,     SPECTRUM/REAL,   SPECTRUM/IMAG
##SYMBOL=    X,             R,               I
##VAR_TYPE=  INDEPENDENT,   DEPENDENT,       DEPENDENT
##VAR_FORM=  AFFN,          ASDF,            ASDF
##VAR_DIM=   32768,         32768,           32768
##UNITS=     HZ,            ARBITRARY UNITS, ARBITRARY UNITS
##FACTOR=    0.157963299565203, 1,           1
##FIRST=     4115.64418892233, 0,            0
##LAST=      -1060.33924793068, 0,           0
##MIN=       -1060.33924793068, -707149,     0
##MAX=       4115.64418892233, 559836837,    0
$$ Real data points
##PAGE= N=1
##DATA TABLE= (X++(R..R)), XYDATA
$$ [...]
$$ plain form
23679 95136 18310 -39404 -89127 -50545 2026 -60592 -115317 -76728 -46825 -84772 -121450 24568
23667 24568 125881 128647 23142 -107433 -120687 55527 312001 380625 282570 201861 193116
23656 193116 252420 239127 167472 109142 34269 -92388 -134176 -172913 -152010 -60658 24938
23645 24938 41986 42040 -44231 -97419 -120874 -48434 -21486 -152015 -131762 12726 -53209 84973
23633 84973 91164 44496 144028 2774 8028 61359 80424 -36006 -117911 -136675 -199215 -112494
23621 -112494 -116882 -144304 -144812 11861 -23188 -184574 -105846 -182952 -186299 56440 54875 27786
23609 27786 -23792 65866 -25280 -108950 -131568 -91734 95330 47898 -36354 -15335 -33131
23598 -33131 -83488 -13498 21407 -114444 -53570 94313 105966 -131363 -55295 -5358 -213152
$$ packed form
23679I5136p6826n7714m9723L8582N2571o2618n4725L8589K9903l7947l6678J46018
23667B4568J01313K766j05505j30575j3254J76214K56474O8624r8055q0709q745
23656A93116N9304j3293p1655n8330p4873j26657m1788l8737K0903R1352Q5596
23645B4938J7048N4q6271n3188k3455P2440K6948j30529K0253J44488o5935J38182
23633H4973O191m6668R9532j41254N254N3331J9065j16430q1905j8764o2540Q6721
23621a12494m388k7422n08J56673l5049j61386P8728p7106l347K42739j565k7089
23609B7786n1578Q9658r1146q3670k2618L9834J87064m7432q4252K1019j7796
23598c3131n0357O9990L4905j35851O0874J47883J1653k37329P6068M9937k07794
$$ plain form
23587 -213152 -324615 -287664 -111002 -29987 -81429 72774 199737 262437 51982 -64302
23577 -64302 -11752 44927 108436 176312 300035 262110 314044 161579 44532 46007 151365
23566 151365 201785 80181 105850 20204 -128077 -126239 -102770 646 -34226 -48672 55382
23555 55382 185033 156790 193783 29542 163 -61112 -59089 128141 68097 58455 -39781
23544 -39781 -158471 -228000 -110220 43642 183773 184747 176301 31296 -34919 84971 148754
23533 148754 -27482 -125168 -180910 -351081 -314719 -191023 -136658 40046 -6790 -255295
23523 -255295 -387975 -342044 -307699 -106605 20221 -165221 -98348 -126190 -142647 -39135
23513 -39135 6317 -78904 -200695 -285298 -417949 -387744 -356728 -105970 -15556 62690 86471
$$ packed form
23587b13152j11463L6951J76662Q1015n1442J54203J26963O2700k10455j16284
23577f4302N2550N6679O3509O7876J23723l7925N1934j52465j17047J475J05358
23566A51365N0420j21604K5669q5646j48281J838K3469J03416l4872j4446J04054
23555E5382J29651k8243L6993j64241k9379o1275K023J87230o0044r642r8236
23544c9781j18690o9529J17780J53862J40131R74q446j45005o6215J19890O3783
23533A48754j76236r7686n5742j70171L6362J23696N4365J76704m6836k48505
23523b55295j32680M5931L4345K01094J26826j85442O6873k7842j6457J03512
23513c9135M5452q5221j21791q4603j32651L0205L1016K50758R0414P8246K3781
$$ plain form
23502 86471 -12433 -59713 -53248 -283886 -504611 -454963 -224920 -267554 -308228 -272204 -152283
23491 -152283 -106928 -178097 -218705 -269182 -108720 -288979 -251003 -130691 -161730 -162518 -34080
23480 -34080 16672 21240 -85044 -143561 -151928 -178434 33495 21978 -109497 24749 -75727
23469 -75727 -66197 1484 -17873 -14740 32324 -54371 -223010 -119153 64340 -57919 -205698
23458 -205698 -296175 -76206 92307 90632 -37375 -153384 -139339 45800 -101126 -114242
23448 -114242 -54450 -85063 -3453 -67106 -83118 82644 223919 146729 -93008 -240203 -310373
23437 -310373 -250395 -394966 -235616 66883 121281 298490 274698 174834 185781 171875 108458
23426 108458 -81995 56753 260670 245866 203331 240648 134476 -11707 21376 87805
$$ packed form
23502H6471r8904m7280O465k30638k20725M9648K30043m2634m0674L6024J19921
23491a52283M5355p1169m0608n0477J60462j80259L7976J20312l1039p88J28438
23480c4080N0752M568j06284n8517q367k6506K11929j1517j31475J34246j00476
23469g5727R530O7681j9357L133M7064q6695j68639J03857J83493j22259j47779
23458b05698r0477K19969J68513j675j28007j16009J4045J85139j46926j3116
23448a14242N9792l0613Q1610o3653j6012J65762J41275p7190k39737j47195p0170
23437c10373N9978j44571J59350L02499N4398J77209k3792r9864J0947j3906o3417
23426A08458j90453J38748K03917j4804m2535L7317j06172j46183L3083O6429
$$ plain form
23416 87805 128943 149607 11906 -30547 -16767 140082 299460 237491 87708 146867 332264
23405 332264 192785 187143 305854 174310 13966 28084 147034 224327 261265 191452 29614
23394 29614 -83371 60047 36637 -72459 2522 121797 336388 302451 96902 -51232
23384 -51232 -107843 -93863 -78813 -184631 -361564 -365508 -422195 -183743 -92491 -54625 31578
23373 31578 67044 194949 189859 100187 -14870 -60609 129228 263371 231455 75003 -2055
23362 -2055 -81614 -141951 -183909 -126629 17144 156001 271965 66418 13357 62587 -29013
23351 -29013 12111 -22045 37032 71366 -12263 -31151 -44557 -123010 -250488 -175099 -83327
23340 -83327 62336 -1547 -121751 -163185 -52260 13306 -2289 -3303 91518 231251 290917
$$ packed form
23416H7805M1138K0664j37701m2453J3780J56849J59378o1969j49783N9159J85397
23405C32264j39479n642J18711j31544j60344J4118J18950P7293L6938o9813j61838
23394B9614j12985J43418k3410j09096P4981J19275K14591l3937k05549j48134
23384e1232n6611J3980J5050j05818j76933l944n6687K38452R1252L7866Q6203
23373C1578L5466J27905n090q9672j15057m5739J89837J34143l1916j56452p7058
23362b055p9559o0337m1958N7280J43773J38857J15964k05547n3061M9230r1600
23351b9013M1124l4156N9077L4334q3629j8888j3406p8453j27478P5389R1772
23340h3327J45663o3883j20204m1434J10925O5566j5595j014R4821J39733N9666
$$ plain form
23329 290917 128082 -39285 -64888 -172151 -158982 -13658 -164253 -222577 -331310 -266899
23319 -266899 -9797 212137 290309 226681 117594 -20613 135712 198855 12410 -6103
23309 -6103 49904 90609 -8046 -100604 -49289 26946 163414 180686 171104 184387 224968 154551
23297 154551 350185 315465 249589 262187 418617 343247 195391 164432 163771 75521 -21230
23286 -21230 9528 117627 -27365 95994 195057 183622 107037 -12337 77002 89974 113870
23275 113870 51410 58017 -12972 -62699 -130068 -94549 -33767 -4858 -145947 -54033 -84731
23264 -84731 -131183 -90361 -111868 -262572 -419010 -265907 -70010 123579 150594 104277 199578
23253 199578 91661 -36989 -33465 16580 104884 224897 290396 237914 214343 116137 61936
$$ packed form
23329B90917j62835j67367k5603j07263J3169J45324j50595n8324j08733O4411
23319b66899K57102K21934P8172o3628j09087j38207J56325O3143j86445j8513
23309f103N6007M0705r8655r2558N1315P6235J36468J7272r582J3283M0581p0417
23297A54551J95634l4720o5876J2598J56430p5370j47856l0959o61q8250r6751
23286b1230L0758J08099j44992J23359R9063j1435p6585j19374Q9339J2972K3896
23275A13870o2460O607p0989m9727o7369L5519O0782K8909j41089R1914l0698
23264h4731m6452M0822k1507j50704j56438J53103J95897J93589K7015m6317R5301
23253A99578j07917j28650L524N0045Q8304J20013O5499n2482k3571r8206n4201
$$ plain form
23242 61936 77785 184211 305471 279769 244299 45518 -20814 -46002 11116 -867 -79281
23231 -79281 -62225 -58006 -151905 -26172 65949 142837 84335 -56215 -77084 -105444 -61710
23220 -61710 -27932 50529 -12538 34231 45230 -67146 -266879 -229357 45951 162229 93346
23209 93346 124638 22368 -77458 -56838 -139481 -206325 -164201 -103627 -219353 -244474 -306543
23198 -306543 -329443 -206778 56466 320165 360098 279064 173894 301504 221058 -45608
23188 -45608 -115074 -9720 67008 -4451 -131581 -53487 -4839 -130909 -9508 141767 167321
23177 167321 -156247 -225417 36716 -67674 -206956 -62418 -36417 20640 226294 314934
23167 314934 392849 274847 99064 70401 -24506 -120149 -6184 139778 60975 93609 69702
$$ packed form
23242F1936J5849J06426J21260k5702l5470j98781o6332k5188N7118j1983p8414
23231g9281J7056M219r3899J25733R2121P6888n8502j40550k0869k8360M3734
23220f1710L3778P8461o3067M6769J0999j12376j99733L7522K75308J16278o8883
23209I3346L1292j02270r9826K0620q2643o6844M2124O0574j15726k5121o2069
23198c06543k2900J22665K63244K63699L9933q1034j05170J27610q0446k66666
23188d5608o9466J05354P6728p1459j27130P8094M8648j26070J21401J51275K5554
23177A67321l23568o9170K62133j04390j39282J44538K6001N7057K05654Q8640
23167C14934P7915j18002j75783k8663r4907r5643J13965J45962p8803L2634k3907
$$ plain form
23156 69702 35121 29459 -11238 21591 11401 89291 40388 138567 63539 -37892 177821
23145 177821 153063 38006 -30559 43751 14136 63717 10534 116510 -26365 14366 39419
23134 39419 -100332 -139306 -37458 112551 96129 72803 104038 238332 253539 240081 255144
23123 255144 102742 50791 129979 178958 127884 61420 94319 56906 -195325 -180877 -56457
23112 -56457 134417 230478 175139 96951 60559 103550 198985 99970 14344 -6058 41804
23101 41804 17812 79191 53592 14621 -90792 -172005 132684 271955 107982 49967 -31576
23090 -31576 -291192 -422499 -337359 -237778 -165103 -198794 -376694 -229545 -47911 -95772 123128
23079 123128 85737 -150015 -151460 21362 26915 50631 125671 136896 131874 52297 -98539
$$ packed form
23156F9702l4581n662m0697L2829j0190P7890m8903R8179p5028j01431K15713
23145A77821k4758j15057o8565P4310k9615M9581n3183J05976j42875M0731K5053
23134C9419j39751l8974J01848J50009j6422k3326L1235J34294J5207j3458J5063
23123B55144j52402n1951P9188M8979n1074o6464L2899l7413k52231J4448J24420
23112e6457J90874R6061n5339p8188l6392M2991R5435r9015q5626k0402M7862
23101D1804k3992O1379k5599l8971j05413q1213L04689J39271j63973n8015q1543
23090c1576k59616j31307Q5140R9581P2675l3691j77900J47149J81634m7861K18900
23079A23128l7391k35752j445J72822N553K3716P5040J1225n022p9577j50836
$$ plain form
23068 -98539 -17775 63816 67625 119542 58388 60911 3944 -4076 16660 216467 233200 189097
23056 189097 75113 12753 12903 54275 68434 52623 22314 -5986 -193073 -128329 56980
23045 56980 4977 -137671 -101109 110115 291968 200249 164629 160204 15069 -159573 -137346
23034 -137346 73806 45168 -215304 -315450 -145525 27208 252713 282731 193765 114434
23024 114434 57659 32064 -82920 -98003 -72537 -79104 -198791 -43392 72535 -99058 -165578
23013 -165578 -294830 -320975 -202310 -68239 -22598 137179 214282 73395 -94716 -197298
23003 -197298 -90581 -1667 -11264 -54713 -91188 543 170396 303796 320524 155325 -35374
22992 -35374 -85476 -46437 -177184 -261881 -244539 -134276 -132760 -144219 -140067 -176194 -270600 -159175
$$ packed form
23068i8539Q0764Q1591L809N1917o1154K523n6967q020K0736J99807J6733m4103
23056A89097j13984o2360J50M1372J4159j5811l0309k8300j87087O4744J85309
23045E6980n2003j42648L6562K11224J81853r1719l5620m425j45135j74642K2227
23034a37346K11152k8638k60472j00146J69925J72733K25505L0018q8966p9331
23024A14434n6775k5595j14984j5083K5466o567j19687J55399J15927j71593o6520
23013a65578j29252k6145J18665J34071M5641J59777P7103j40887j68111j02582
23003a97298J06717Q8914r597m3449l6475R1731J69853J33400J6728j65199j90699
22992c5374n0102L9039j30747q4697J7342J10263J516j1459M152l6127r4406J11425
$$ plain form
22980 -159175 13146 127600 89470 77094 2653 22790 -56766 -208431 -165966 -91855 -91875
22969 -91875 -378879 -510345 -449177 -362125 -151497 -279263 -392147 -279290 -344128 -253732
22959 -253732 126113 110410 -98560 -179656 -316311 -400501 -216285 1521 -176714 -177194 -23249
22948 -23249 69072 66894 -5406 -143075 -169304 -71516 -53350 20776 2323 -91002 -137819 -200563
22936 -200563 -130349 -46833 -141334 -226387 -132611 -12181 -24017 -38875 14525 51735 101546
22925 101546 54952 66142 -7253 -58257 -78985 -58528 -235870 -249812 -149872 -126265 -156196
22914 -156196 -248636 -293100 -159561 -185089 -281260 -216587 -140344 -69990 62932 83755 -87564
22903 -87564 78 -37892 143341 126619 -120595 -193890 -29114 -6164 -68172 -94262 -121475
$$ packed form
22980a59175J72321J14454l8130j2376p4441K0137p9556j51665M2465P4111k0
22969i1875k87004j31466O1168Q7052K10628j27766j12884J12857o4838R0396
22959b53732L79845j5703k08970q1096j36655q4190J84216K17806j78235m80J53945
22948b3249R2321k178p2300j37669k6229R7788J8166P4126j8453r3325m6817o2744
22936b00563P0214Q3516r4501q5053R3776J20430j1836j4858N3400L7210M9811
22925A01546m6594J1190p3395n1004k0728K0457j77342j3942R9940K3607k9931
22914a56196r2440m4464J33539k5528r6171O4673P6243P0354J32922K0823j71319
22903h7564Q7642l7970J81233j6722k47214p3295J64776K2950o2008k6090k7213
$$ plain form
22892 -121475 -55763 -153742 -198160 -178892 -160764 -123228 -158333 -83065 93479 136373 53964
22881 53964 -56644 -79820 -21087 -22464 -129783 -248166 -220597 -239452 -203846 -106584 -80461
22870 -80461 92242 263950 276460 46410 -126855 -234721 -84592 -67528 -53969 -99316
22860 -99316 -56772 -91552 -189163 -89695 -45914 95644 81477 -11864 -19871 -90844 99364
22849 99364 202506 4758 11914 62934 142861 148316 123130 9137 6109 12288 -17777 -47997
22837 -47997 -68493 -131148 -98068 -126128 -160877 -96943 36353 71442 121701 78250 3415
22826 3415 13656 6024 80489 239556 377897 263926 17701 -209076 -298851 -284108 -172927
22815 -172927 -54707 -219603 -312640 -259541 -134353 -137296 -238669 -254657 -138636 -193547 -253428
$$ packed form
22892a21475O5712r7979m4418J9268J8128L7536l5105P5268J76544M2894q2409
22881E3964j10608k3176N8733j377j07319j18383K7569j8855L5606R7262K6123
22870h0461J72703J71708J2510k30050j73265j07866J50129J7064J3559m5347
22860i9316M2544l4780r7611R9468M3781J41558j4167r3341q007p0973J90208
22849I9364J03142j97748P156N1020P9927N455k5186j13993l028O179l0065l0220
22837d7997k0496o2655L3080k8060l4749O3934J33296L5089N0259m3451p4835
22826C415J0241p632P4465J59067J38341j13971k46225k26777q9775J4743J11181
22815a72927J18220j64896r3037N3099J25188k943j01373j5988J16021n4911n9881
$$ plain form
22804 -253428 -194874 -88930 -101377 -227597 -271734 -149575 -68484 -191955 -233633 -237368 -184466
22793 -184466 -134899 -72221 -94652 -97090 -104416 20413 70131 84778 328389 146137 35047
22782 35047 25908 164397 122031 -14084 -32788 -158321 -240757 40765 52965 76348 129553
22771 129553 68821 87403 249980 154384 129485 22143 -147191 -223521 -46865 121853
22761 121853 189477 163963 5376 -88046 35195 744 -97152 -132184 -68475 -65069 71108
22750 71108 34636 -149848 -20402 46225 115643 56800 25501 53943 40312 -41052 -21391
22739 -21391 34098 -86733 -168628 -176072 -36159 64830 -60342 -54082 58751 170108 310079
22728 310079 211849 36368 -59123 -63368 2790 -8036 -17512 -57943 -161053 -106265 -110984 -273283
$$ packed form
22804b53428N8554J05944j2447j26220m4137J22159Q1091j23471m1678l735N2902
22793a84466M9567O2678k2431k438p326J24829M9718J4647K43611j82252j11090
22782C5047r139J38489m2366j36115j8704j25533q2436K81522J2200K3383N3205
22771A29553o0732J8582J62577r5596k4899j07342j69334p6330J76656J68718
22761A21853O7624k5514j58587r3422J23241l4451r7896l5032O3709L406J36177
22750G1108l6472j84484J29446O6627O9418n8843l1299K8442j3631q1364J9661
22739b1391N5489j20831q1895p444J39913J00989j25172O260J12833J11357J39971
22728C10079r8230j75481r5491m245O6158j0826r476m0431j03110N4788m719j62299
$$ plain form
22716 -273283 -131175 -120471 -100658 -28803 -39088 -47243 -74875 -160414 -55383 -10605 68413
22705 68413 21849 -13453 11013 82221 96879 121962 188697 192409 3908 -62519 -128627 -7099
22693 -7099 -59752 43332 -62612 -3518 -147767 -149082 -16868 -31923 -26795 -47216 28920
22682 28920 15674 -63693 22520 171854 222189 217907 100741 37482 201 -22044 -150832
22671 -150832 -34973 2532 -13773 155565 66019 134240 195407 125362 126665 222739 159687
22660 159687 -46721 -30146 41043 -105446 -208848 -204766 -302778 -317115 -330349 -227064 -323306
22649 -323306 -426850 -457203 -413200 -257019 -97989 47661 28025 -8345 -201480 -174900
22639 -174900 -149475 -146702 23678 -3856 61691 14290 -94627 -21199 126824 126009 41604
$$ packed form
22716b73283J42108J0704J9813P1855j0285q155k7632q5539J05031M4778P9018
22705F8413m6564l5302K4466P1208J4658K5083O6735L712j88501o6427o6108J21528
22693g099n2653J03084j05944N9094j44249j315J32214j5055N128k0421P6136
22682B8920j3246p9367Q6213J49334N0335m282j17166o3259l7281k2245j28788
22671a50832J15859L7505j6305J69338q9546O8221O1167p0045J303R6074o3052
22660A59687k06408J6575P1189j46489j03402M082r8012j4337j3234J03285r6242
22649c23306j03544l0353M4003J56181J59030J45650j9636l6370j93135K6580
22639a74900K5425K773J70380k7534O5547m7401j08917P3428J48023q15q4405
$$ plain form
22628 41604 59937 64653 -33452 -74984 -153725 -75325 86640 51384 -51505 -80142 217870
22617 217870 169451 166296 233204 341447 363277 289424 94088 -87334 -110667 -91348 -126641
22606 -126641 -125441 -32003 -74190 -209460 -165361 -84702 -57110 -41951 15098 -25966 -22392 -64061
22594 -64061 23282 -72348 11163 69954 -114037 -193122 -145300 -142629 -54380 -146899 -132150 -75863
22582 -75863 -125519 -146813 -82274 -59985 -8785 -75105 -191534 -217540 -180405 -113538 -49871
22571 -49871 -177806 -413759 -530918 -451723 -238605 -126493 -113412 -18842 -2028 -154673
22561 -154673 -139686 19879 80638 25023 -9080 -64207 -112972 -73515 -30574 -91996 -37862
22550 -37862 18817 -14784 46546 29653 -122360 -128232 -138938 -19465 82244 94213 34538
$$ packed form
22628D1604J8333M716r8105m1532p8741P8400J61965l5256j02889k8637K98012
22617B17870m8419l155O6908J08243K1830p3853j95336j81422k3333J9319l5293
22606a26641J200R3438m2187j35270M4099Q0659K7592J5159N7049m1064L574m1669
22594f4061Q7343r5630Q3511N8791j83991p9085M7822K671Q8249r2519J4749N6287
22582g5863m9656k1294O4539K2289N1200o6320j16429k6006L7135O6867O3667
22571d9871j27935k35953j17159P9195K13118J12112J3081R4570J6814j52645
22561a54673J4987J59565O0759n5615l4103n5127m8765L9457M2941o1422N4134
22550c7862N6679l3601O1330j6893j52013n872j0706J19473J01709J1969n9675
$$ plain form
22539 34538 23294 40332 -62295 -160152 -165626 -130916 -127502 112913 191307 235162 181467 78749
22527 78749 13458 -134222 -298269 -409334 -281376 -227071 -201978 4101 61651 -45278
22517 -45278 -30966 -3298 -67010 -130813 -265548 -384489 -361801 -239119 -101583 -16789 78215
22506 78215 54725 -34239 2129 120510 32687 -1848 18711 77322 92559 76640 -44779
22495 -44779 -120937 -92545 74781 180911 231358 245898 197687 224192 181127 204356 -73183
22484 -73183 -139624 -186026 -162952 -278860 -380144 -449230 -323488 -116191 63144 154808 52947
22473 52947 -13251 11822 41828 18159 -90184 -196604 14621 292539 281080 240803 184460
22462 184460 24619 227909 409502 235648 98868 175407 107426 40563 -59464 83049
$$ packed form
22539C4538j1244J7038j02627r7857n474L4710L414K40415P8394M3855n3695j02718
22527G8749o5291j47680j64047j11065J27958N4305K5093K06079N7550j06929
22517d5278J4312K7668o3712o3803j34735j18941K2688J22682J37536Q4794R5004
22506G8215k3490q8964L6368J18381q7823l4535K0559N8611J5237j5919j21419
22495d4779p6158K8392J67326J06130N0447J4540m8211K6505m3065K3229k77539
22484g3183o6441m6402K3074j15908j01284o9086J25742K07297J79335R1664j01861
22473E2947o6198K5073L0006k3669j08343j06420K11225K77918j1459m0277n6343
22462A84460j59841K03290J81593j73854j36780P6539o7981o6863j00027J42513
$$ plain form
22452 83049 212449 377584 348489 211633 218192 151919 -28844 -39500 79003 224916 12713
22441 12713 -94028 -113124 -259138 -263798 -241364 -66142 184832 221121 16821 -153796 -112698
22430 -112698 -1817 82374 107601 18169 84632 10837 -175097 -267990 -342457 -409935 -426755
22419 -426755 -250424 -18761 -76013 -2007 -29060 -127319 -296648 -170261 -103681 -45165 5565
22408 5565 -25411 162730 160834 384155 417279 173742 204188 138367 -29662 -224122 -182494
22397 -182494 -113506 -135714 -83663 -53335 -173406 -301265 -216515 -186780 -180087 -123355 -229012
22386 -229012 -328658 -340151 -385872 -190767 -20044 41054 -57142 -13852 -10181 -95020 -85040
22375 -85040 26813 -79900 -56581 -98239 -205059 -337418 -418880 -409607 -315779 -330060 -198656
$$ packed form
22452H3049J29400J65135k9095j36856O559o6273j80763j0656J18503J45913k12203
22441A2713j06741j9096j46014m660K2434J75222K50974L6289k04300j70617M1098
22430a12698J10881Q4191K5227q9432O6463p3795j85934r2893p4467o7478j6820
22419d26755J76331K31663n7252P4006k7053r8259j69329J26387O6580N8516N0730
22408E565l0976J88141j896K23321L3124k43537L0446o5821j68029j94460M1628
22397a82494O8988k2208N2051L0328j20071j27859Q4750K9735O693N6732j05657
22386b29012r9646j1493m5721J95105J70723O1098r8196M3290L671q4839R980
22375h5040J11853j06713K3319m1658j06820j32359q1462R273R3828j4281J31404
$$ plain form
22364 -198656 -138429 -306949 -290797 -232453 -252004 -245336 -282588 -286107 -311904 -154198 -228648
22353 -228648 -270198 -159267 -135047 -142623 -95900 -52276 -60163 9954 -7961 85909 143629 109564
22341 109564 142089 43520 22279 130456 208930 49928 64347 -42217 -125087 -182415 -56891
22330 -56891 20187 15354 100450 121574 114675 -89424 -99401 -17170 44703 65687 -96493 -201840
22318 -201840 -177771 -191104 -219547 -192758 7747 81712 29498 -35163 -28969 76044 160012
22307 160012 104189 72149 61107 44029 -42425 33605 83899 -46134 -207050 -346077 -334504
22296 -334504 -161868 -82593 -61701 -58131 -145606 -147885 -64180 -162660 -218984 -148300 16492
22285 16492 -203475 -291530 -164003 -234769 -398289 -405841 -304256 -353777 -255014 93373 332365
$$ packed form
22364a98656O0227j68520J6152N8344j9551O668l7252l519k5797J57706p4450
22353b28648m1550J10931K4220p576M6723M3624p887P0117j7915R3870N7720l4065
22341A09564L2525r8569k1241J08177P8474j59002J4419j06564q2870n7328J25524
22330e6891P7078m833Q5096K1124o899k04099r977Q2231O1873K0984j62180j05347
22318b01840K4069j3333k8443K6789K00505P3965n2214o4661O194J05013Q3968
22307A60012n5823l2040j1042j7078q6454P6030N0294j30033j60916j39027J1573
22296c34504J72636P9275K0892L570q7475k279Q3705r8480n6324P0684J64792
22285A6492k19967q8055J27527p0766j63520p552J01585m9521R8763L48387K38992
$$ plain form
22274 332365 302022 229174 122526 -34571 -52383 48778 90906 -71327 -221373 -223185 -25363
22263 -25363 -46756 -101943 86212 157655 242455 290282 96355 -64368 -19760 198297 74145
22252 74145 85916 41028 26635 18680 86210 154335 241528 167685 45670 -97870 -7312
22241 -7312 -111020 -136178 -43566 -76965 -83488 -113929 -144471 -20917 134446 158895 69933
22230 69933 161996 252446 250324 170687 205932 133624 67345 18357 -176397 -141749 -219154 -60827
22218 -60827 109110 178880 178401 26324 -60206 -110516 -94897 88076 223560 317569 242595
22207 242595 175179 146422 26231 -3984 -25919 94335 75524 -19004 -125512 -247152 -245389
22196 -245389 -177529 -57610 14980 20408 18931 -221548 -286934 -228439 -191507 -83662 -124311
$$ packed form
22274C32365l0343p2848j06648j57097j7812J01161M2128j62233j50046j812J97822
22263b5363k1393n5187J88155P1443Q4800M7827j93927j60723M4608K18057j24152
22252G4145J1771m4888j4393p955O7530O8125Q7193p3843j22015j43540R0558
22241g312j03708k5158R2612l3399o523l0441l0542J23554J55363K4449q8962
22230F9933R2063R0450k122p9637L5245p2308o6279m8988j94754L4648p7405J58327
22218f0827J69937O9770m79j52077q6530n0310J5619J82973J35484R4009p4974
22207B42595o7416k8757j20191l0215k1935J20254j8811r4528j06508j21640J763
22196b45389O7860J19919P2590N428j477k40479o5386N8495L6932J07845m0649
$$ plain form
22185 -124311 -116146 -4428 63866 -37205 10760 -8573 -59568 -95293 -244794 -421327 -246432
22174 -246432 -301452 -141219 30269 49430 87246 50733 111346 -8103 -9072 -143846 -155826
22163 -155826 -26160 -40848 -30366 230060 307763 272106 197217 59590 61053 240835 288466
22152 288466 352185 273425 118514 -57291 16237 42538 -78878 -120401 -4007 59218 16090
22141 16090 -50842 47491 124375 88593 53423 -42743 -77182 -160095 -209987 -115277 45764
22130 45764 148625 126465 158166 42334 -48406 -161282 -208241 -258241 -164407 87868 65778
22119 65778 31920 -41423 -155215 24058 92728 217865 19365 -1507 76134 163207 224811
22108 224811 380183 378915 101761 127363 311045 219818 86229 31623 35659 -116920 -75723
$$ packed form
22185a24311Q165J11718O8294j01071M7965j9333n0995l5725j49501j76533J74895
22174b46432n5020J60233J71488J9161L7816l6513O0613j19449r69j34774j1980
22163a55826J29666j4688J0482K60426P7703l5657p4889j37627J463J79782M7631
22152B88466O3719p8760j54911j75805P3528K6301j21416m1523J16394O3225m3128
22141A6090o6932R8333P6884l5782l5170r6166l4439q2913m9892R4710J61041
22130D5764J02861k2160L1701j15832r0740j12876m6959n0000R3834K52275k2090
22119F5778l3858p3343j13792J79273O8670J25137j98500k0872P7641Q7073O1604
22108B24811J55372j268k77154K5602J83682r1227j33589n4606M036j52579M1197
$$ plain form
22097 -75723 24314 -1282 -131191 -121481 -68118 -113274 12237 87691 94761 65910 -164938
22086 -164938 -321569 -190945 65810 22560 49234 74923 218348 262654 233371 165665 231870
22075 231870 168517 -29056 -214387 -253034 -288440 -213382 -138254 -122866 -71946 -109626 -184947
22064 -184947 -209794 -319103 -303358 -273925 -154439 -70412 -188189 -152743 -170707 -128864 43775
22053 43775 32210 7908 -181517 -352925 -364534 -263790 -192409 -181048 -239728 -42426 255255
22042 255255 310705 107346 -148414 -345973 -424019 -321889 -96982 -151043 -258019 -354529
22032 -354529 -263288 -192252 -37480 -43488 24217 -98419 -106469 -69522 140583 153638 -46164
22021 -46164 -86991 -64357 -60463 136347 149880 10618 -1801 64258 229398 267877 162668
$$ packed form
22097g5723J00037k5596j29909R710N3363m5156J25511P5454P070k8851k30848
22086a64938j56631J30624K56755m3250K6674K5689J43425M4306k9283o7706O6205
22075B31870o3353j97573j85331l8647l5406P5058P5128J5388N0920l7680p5321
22064a84947k4847j09309J5745K9433J19486Q4027j17777L5446j7964M1843J72639
22053D3775j1565k4302j89425j71408j1609J00744P1381J1361n8680J97302K97681
22042B55255N5450k03359k55760j97559p8046J02130K24907n4061j06976r6510
22032c54529R1241P1036J54772o008O7705j22636q050L6947K10105J3055j99802
22021d6164m0827K2634L894J96810J3533j39262j2419O6059J65140L8479j05209
$$ plain form
22010 162668 -16840 37437 69568 45212 140207 73702 -60191 -116922 -118006 -83928 -37354
21999 -37354 95108 58395 26859 37698 29578 -29533 -29117 -116945 -76948 -89608 9906 6355
21987 6355 116597 298367 241252 74424 61663 50192 -74070 -202000 -426001 -392731 -246874
21976 -246874 -164211 -268269 -58462 13434 -66957 -245411 -303301 -228990 -166001 -135919 11547
21965 11547 -68632 -247155 -175936 38677 103168 227982 88629 -144379 -147133 123235 290417
21954 290417 146336 -52641 -210631 -173234 -102466 -2196 49321 -49938 -81352 -175927 -133286
21943 -133286 -90533 -114818 123609 149797 64068 210469 108338 49497 -45268 -85839 21796
21932 21796 135516 22385 -71348 -139698 -33244 69009 251946 274945 218664 113121
$$ packed form
22010A62668j79508N4277L2131k4356R4995o6505j33893n6731j084L4078M6574
21999c7354J32462l6713l1536J0839q120n9111M16q7828L9997j2660R9514l551
21987F355J10242J81770n7115j66828j2761j1471j24262j27930k24001L3270J45857
21976b46874Q2663j04058K09807P1896q0391j78454n7890P4311O2989L0082J47466
21965A1547q0179j78523P1219K14613O4491J24814j39353k33008k754K70368J67182
21954B90417j44081j98977j57990L7397P0768J00270N1517r9259l1414r4575M2641
21943a33286M2753k4285K38427K6188q5729J46401j02131n8841r4765m0571J07635
21932B1796J13720j13131r3733o8350J06454J02253J82937K2999n6281j05543
$$ plain form
21922 113121 159465 291246 215408 -11428 -58622 -136643 -146207 -24976 164708 117623 43604
21911 43604 -126106 -58516 90537 -33664 -73350 12405 87987 86578 -12438 -189275 -154949
21900 -154949 -268260 -255553 -216651 -230837 -281125 -329912 -366008 -293467 -135726 -95262 -10619
21889 -10619 15228 -102535 -89073 27374 68416 70028 3874 -50183 -18417 -26546 37546 16170
21877 16170 29846 107501 146402 21865 -27953 71467 26829 47008 55697 -151815 -437063
21866 -437063 -393718 -275983 -176932 -64575 44201 87789 18241 217217 239150 181408 254775
21855 254775 210059 121625 308142 333528 150216 117643 175951 30671 -12720 30213 -60805
21844 -60805 -62534 -19118 -98503 40169 174557 233497 179168 -37597 -21616 26980 74786
$$ packed form
21922A13121M6344J31781p5838k26836m7194p8021r564J21231J89684m7085p4019
21911D3604j69710O7590J49053j24201l9686Q5755P5582j409r9016j76837L4326
21900a54949j13311J2707L8902j4186n0288m8787l6096P2541J57741M0464Q4643
21889a0619K5847j17763J3462J16447M1042J612o6154n4057L1766q129O4092k1376
21877A6170J3676P7655L8901j24537m9818R9420m4638K0179Q689k07512k85248
21866d37063M3345J17735R9051J12357J08776M3588o9548J98976K1933n7742P3367
21855B54775m4716q8434J86517K5386j83312l2573N8308j45280m3391M2933r1018
21844f0805j729M3416p9385J38672J34388N8940n4329k16765J5981M8596M7806
$$ plain form
21833 74786 141392 102296 119832 -109262 -151451 -110321 -267100 -298789 -172738 37005 213134
21822 213134 219195 167908 87193 23352 -107424 -264294 -327790 -252449 -173486 -37834 -28736
21811 -28736 -35319 -80309 -83750 17592 -98388 -159200 -147953 143082 151331 28408 15736
21800 15736 87899 276614 266619 300954 191298 -51671 -22672 172072 60071 79003 217255
21789 217255 141608 70912 -42912 37944 81818 35622 -100870 -105498 -144365 -121731 73596
21778 73596 78661 5374 -161333 -54262 109695 121623 66770 35593 14304 -104300 28527
21767 28527 121001 114518 36077 4322 9271 9725 -28262 122419 162528 116349 -27656 -114935
21755 -114935 -106413 26347 11870 -42257 60243 -48488 -158889 -169205 -120896 -101249 -135724
$$ packed form
21833G4786O6606l9096J7536k29094m2189M1130j56779l1689J26051K09743J76129
21822B13134O061n1287q0715o3841j30776j56870o3496P5341P8963J35652R098
21811b8736o583m4990l441J01342j15980o0812J1247K91035Q249j22923j2672
21800A5736P2163J88715r995L4335j09656k42969K8999J94744j12001J8932J38252
21789B17255p5647p0696j13824Q0856M3874m6196j36492m628l8867K2634J95327
21778G3596N065p3287j66707J07071J63957J1928n4853l1177k1289j18604J32827
21767B8527R2474o483p8441l1755M949M54l7987J50681M0109m6179j44005q7279
21755a14935Q522J32760j4477n4127J02500j08731j10401j0316M8309J9647l4475
$$ plain form
21744 -135724 -104833 -12033 -83847 -20788 114918 186419 429260 418280 484942 395831 193291
21733 193291 142709 221287 312413 136511 46913 7445 53713 93272 102530 202253 273555
21722 273555 -178 -4368 -9869 -85765 -154890 -83216 -121765 -105370 16300 -129031 -154570
21711 -154570 -33370 15006 -32898 -210141 -423668 -363667 -339628 -367432 -339487 -218743 -161823
21700 -161823 56786 -79594 -165044 -171551 -203702 -205008 -113501 -200985 -178482 -126432 -27497
21689 -27497 -57746 -232934 -205796 -62618 -4913 -111752 -69605 -33281 193328 304976 368262
21678 368262 264692 214395 200779 151201 152906 198000 97555 -163015 -290417 -361868 -342108
21667 -342108 -282412 -281168 -116241 -143331 -191846 -52471 -55469 -100002 -151152 -287788 -200786
$$ packed form
21744a35724L0891R2800p1814O3059J35706P1501K42841j0980O6662q9111k02540
21733A93291n0582P8578R1126j75902q9598l9468M6268L9559R258R9723P1302
21722B73555k73733m190n501p5896o9125P1674l8549J6395J21670j45331k5539
21711a54570J21200M8376m7904j77243k13527O0001K4039k7804K7945J20744N6920
21700a61823K18609j36380q5450o507l2151j306R1507q7484K2503N2050R8935
21689b7497l0249j75188K7138J43178N7705j06839M2147L6324K26609J11648O3286
21678C68262j03570n0297j3616m9578J705M5094j00445k60570j27402p1451J9760
21667c42108N9696J244J64927k7090m8515J39375k998m4533n1150j36636Q7002
$$ plain form
21656 -200786 -185842 -97187 -121273 -74617 105727 282648 145509 -60573 -110831 -146669 -244425
21645 -244425 -131373 210903 258531 146199 104507 14714 64249 148523 91779 29157 -63854
21634 -63854 -171803 -168713 -93141 -80763 -16323 70586 -6570 -28137 -63375 -219834 -174794
21623 -174794 -191122 -35041 -168876 -145217 -26563 -141647 48081 39439 27236 -62567 -92254
21612 -92254 -14784 -26136 -134626 -1619 233005 143981 -30724 36135 9248 -343940 -383217
21601 -383217 -149704 -25776 -430 103580 213488 272951 272339 111739 -52114 -102952 3623
21590 3623 79134 82350 -16607 -176883 -190346 87924 14665 -19756 60370 127672 -22803
21579 -22803 96376 275614 127964 -116388 -195406 -77566 -120651 -202051 -25816 -52846
$$ packed form
21656b00786J4944Q8655k4086M6656J80344J76921j37139k06082n0258l5838r7756
21645b44425J13052L42276M7628j12332m1692q9793M9535Q4274n6744o2622r3011
21634f3854j07949L090P5572J2378O4440Q6909p7156k1567l5238j56459M5040
21623a74794j6328J56081j33835K3659J18654j15084J89728q642j2203q9803k9687
21612i2254P7470j1352j08490J33007K34624q9024j74705O6859k6887l53188l9277
21601c83217K33513J23928K5346J04010J09908N9463o12j60600j63853n0838J06575
21590C623P5511L216r8957j60276j3463K78270p3259l4421Q0126O7302j50475
21579b2803J19179J79238j47650k44352p9018J17840m3085q1400J76235k7030
$$ plain form
21569 -52846 -69069 -50903 -284530 -318316 -212184 -217787 -279197 -127199 -110219 -292329 -334247
21558 -334247 -323836 -324168 -343322 -245328 -214388 -135105 -270764 -310768 -151748 -39794 -103148
21547 -103148 -2777 100823 -45904 -155620 -39446 72060 124015 118200 -12885 -83794
21537 -83794 -225781 -416997 -408574 -227712 -131535 29846 76919 36781 -45494 71132 59177
21526 59177 71104 91179 115120 -46176 -34283 158897 245664 26979 -186385 -105343 -72311
21515 -72311 -209113 -210812 -149505 -210910 -165378 -146515 -113204 30193 150684 70296 26211
21504 26211 52378 140963 51139 138707 23950 -84414 -235487 -205754 -107533 -263472 -124595
21493 -124595 19448 -130463 29839 173015 201436 154252 2037 -10625 -16815 -44605 -1601
$$ packed form
21569e2846j6223J8166k33627l3786J06132n603o1410J51998J6980j82110m1918
21558c34247J0411l32j9154R7994L0940P9283j35659m0004J59020J11954o3354
21547a03148J00371J03600j46727j09716J16174J11506N1955n815j31085p0909
21537h3794j41987j91216Q423J80862R6177J61381M7073m0138q2275J16626j1955
21526E9177J1927K0075K3941j61296J1893J93180Q6767k18685k13364Q1042L3032
21515g2311j36802j699O1307o1405M5532J8863L3311J43397J20491q0388m4085
21504B6211K6167Q8585q9824Q7568j14757j08364j51073K9733R8221j55939J38877
21493a24595J44043j49911J60302J43176K8421m7184j52215j2662o190k7790M3004
$$ plain form
21482 -1601 -98632 -143946 -116838 -14584 7312 73323 43828 57532 135800 96177 70805 57795
21470 57795 -1385 71273 -4082 18455 -160374 -173672 52394 91682 9222 -49985 15067
21459 15067 -7592 -79206 161939 89153 11648 -204439 -272556 -259006 -207563 -57189 28187
21448 28187 20116 135350 194642 185861 285097 231333 151168 216772 255965 223215 172790 123312
21436 123312 153012 -13497 33231 56302 -41999 -3232 -58214 -35494 70615 -57532 -282077
21425 -282077 -464174 -398200 -258929 -185265 -123394 15493 -43656 -77779 -169085 -240680 -145073
21414 -145073 -21796 -34474 -144201 -151508 -91250 -92902 17212 -112118 -246988 -275669 -58232
21403 -58232 4538 -34729 -68638 47797 199306 126843 203175 132778 -42272 -179193 -333442
$$ packed form
21482a601r7031m5314K7108J02254K1896O6011k9495J3704P8268l9623k5372j3010
21470E7795n9180P2658p5355K2537j78829j3298K26066L9288q2460n9207O5052
21459A5067k2659p1614K41145p2786p7505k16087o8117J3550N1443J50374Q5376
21448B8187q071J15234N9292q781R9236n3764q0165O5604L9193l2750n0425m9478
21436A23312K9700j66509M6728K3071r8301L8767n4982K2720J06109j28147k24545
21425b82077j82097O5974J39271P3664O1871J38887n9149l4123r1306p1595R5607
21414a45073J23277j2678j09727p307O0258j652J10114j29330j34870k8681K17437
21403e8232O2770l9267l3909J16435J51509p2463P6332p0397j75050j36921j54249
$$ plain form
21392 -333442 -56934 171646 38676 -45135 -61450 37586 99072 -34119 -149889 -123858
21382 -123858 -52706 -8967 21115 213263 311545 315595 185897 37196 35554 121113 11628
21371 11628 -83810 -83457 -112007 -48909 -87122 -5254 84956 199734 203381 129140 -24163 -187952
21359 -187952 -270761 -312241 -282235 -146729 -131815 -228790 -199222 -97811 53492 45002 159176
21348 159176 61550 37427 157682 46195 -128361 -95075 -130397 139931 148586 -32873 -185942
21337 -185942 -378352 -311028 -135957 -135402 -50955 -95679 -331499 -467421 -364551 -106908 66884
21326 66884 56478 77294 1733 -317808 -417583 -401566 -431461 -186001 43515 25944 46793
21315 46793 -63906 35427 -20483 -23367 -128150 -111008 -7821 -70856 -81951 -96717 -186883
$$ packed form
21392c33442K76508K28580j32970q3811j6315R9036O1486j33191j15770K6031
21382a23858P1152M3739L0082J92148R8282M050j29698j48701j642Q5559j09485
21371A1628r5438L53k8550O3098l8213Q1868R0210J14778L647p4241j53303j63789
21359a87952q2809m1480L0006J35506J4914r6975K9568J01411J51303q490J14174
21348A59176r7626k4123J20255j11487j74556L3286l5322K70328Q655j81459j53069
21337a85942j92410O7324J75071N55Q4447m4724k35820j35922J02870K57643J73792
21326F6884j0406K0816p5561l19541r9775J6017k9895K45460K29516j7571K0849
21315D6793j10699R9333n5910k884j04783J7142J03187o3035j1095j4766r0166
$$ plain form
21304 -186883 -132375 18472 121639 33744 92779 162007 42632 -11967 -20455 -1315 85201
21293 85201 -25897 -139737 -109659 -43058 -84030 -61553 -108737 -204652 -45421 86385 98573
21282 98573 68340 69517 -41166 -37167 146463 88190 -51384 -59806 -158301 -180726 -169484 -2744
21270 -2744 110531 54902 195623 210594 49846 -137389 -133309 -196164 -241510 -164558 -68329
21259 -68329 -196444 -142610 -252224 -308027 -202436 -82742 12230 75556 -93958 -284377
21249 -284377 -198612 -191354 -197231 -163858 -81940 -54267 -38353 248976 390327 177346 -60357
21238 -60357 -23245 -21205 -86980 68053 77801 254401 226348 61913 39231 -100269 -208748
21227 -208748 -69756 29138 216 144353 49537 88716 87234 120079 202100 316396 211287
$$ packed form
21304a86883N4508J50847J03167q7895N9035O9228j19375n4599q488J9140Q6516
21293H5201j11098j13840L0078O6601m0972K2477m7184r5915J59231J31806J2188
21282I8573l0233J177j10683L999J83630n8273j39574q422r8495k2425J1242J66740
21270b744J13275n5629J40721J4971j60748j87235M080o2855m5346P6952R6229
21259f8329j28115N3834j09614n5803J05591J19694R4972O3326j69514j90419
21249b84377Q5765P258n877L3373Q1918K7673J5914K87329J41351k12981k37703
21238f0357L7112K040o5775J55033R748J76600k8053j64435k2682j39500j08479
21227b08748J38992R8894k8922J44137r4816L9179j482L2845Q2021J14296j05109
$$ plain form
21216 211287 113708 38183 130286 132975 24216 -16554 98958 70284 103615 96547 66626
21205 66626 -7173 -40673 -86520 -236482 -243731 -280507 -171244 -25181 102361 72981 -7302
21194 -7302 -72985 -199008 -207191 -227192 -329556 -265656 -21339 275653 96135 -189064 -194516
21183 -194516 -106610 -141839 18274 153973 161031 70441 124364 156403 71940 107522 123859
21172 123859 147732 178366 118508 276764 317919 236613 180832 45597 -3678 -4954 -26883
21161 -26883 -85258 -145752 -77039 -64462 -50552 -153194 -216189 -287734 -323619 -500029 -496999
21150 -496999 -359700 -282486 -365976 -474054 -260148 56608 186954 155198 -38709 -99910
21140 -99910 -38310 172554 140652 -192569 -270271 -378130 -200371 31516 143583 176784
$$ packed form
21216B11287r7579p5525R2103K689j08759m0770J15512k8674L3331p068k9921
21205F6626p3799l3500m5847j49962p249l6776J09263J46063J27542k9380q0283
21194g302o5683j26023q183k0001j02364O3900K44317K96992j79518k85199n452
21183a94516Q7906l5229J60113J35699P058r0590N3923L2039q4463L5582J6337
21172A23859K3873L0634n9858J58256M1155q1306n5781j35235m9275j276k1929
21161b6883n8375o0494O8713J2577J3910j02642o2995p1545l5885j76410L030
21150d96999J37299P7214q3490j08078K13906L16756J30346l1756j93907o1201
21140i9910O1600K10864l1902l33221p7702j07859J77759K31887J12067L3201
$$ plain form
21130 176784 129723 149009 145817 34987 -20032 -61557 -41282 -9120 -4074 59262 228531
21119 228531 200055 189798 -31881 -85853 9669 -129020 -103396 -24952 177672 339165 290544
21108 290544 220916 89804 8683 -33778 -147626 -174843 -111759 -218898 -295994 -314301 -244021
21097 -244021 -136787 -63911 110351 44792 -35986 -137672 -159498 -28614 -17214 -50420 84104
21086 84104 137763 176164 210361 324157 214639 114563 105769 -56744 70129 185747 250726
21075 250726 180824 80018 -52158 -97952 -43073 20996 -15519 -27285 28661 43089 130111
21064 130111 94057 -536 -100561 -58369 26618 39041 113344 112527 -37804 -107339 -123209
21053 -123209 -178580 -221843 -127212 -198653 -64921 93179 57455 -20408 -25688 48569 155983
$$ packed form
21130A76784m7061J9286l192j10830n5019m1525K0275L2162N046O3336J69269
21119B28531k8476j0257k21679n3972R5522j38689K5624P8444K02624J61493m8621
21108B90544o9628j31112q1121m2461j13848k7217O3084j07139p7096j8307P0280
21097b44021J07234P2876J74262o5559q0778j01686k1826J30884J1400l3206J34524
21086H4104N3659L8401L4197J13796j09518j00076q794j62513J26873J15618O4979
21075B50726o9902j00806j32176m5794N4879O4069l6515j1766N5946J4428Q7022
21064A30111l6054r4593j00025M2192Q4987J2423P4303q17j50331o9535j5870
21053a23209n5371m3263R4631p1441J33732J58100l5724p7863n280P4257J07414
$$ plain form
21042 155983 173236 43332 10358 170399 212216 148627 162662 169649 44493 -44420 37277
21031 37277 -71110 -148 85278 81336 119363 106915 146845 46819 11414 243963 296277
21020 296277 280437 175704 46962 28397 17946 70174 18438 -52609 -71922 -32425 -82467
21009 -82467 -163229 -148698 -231272 -209711 -151266 -111279 6685 152251 332809 281902 187127
20998 187127 93510 97432 177167 139 -100278 45055 163004 195463 118757 139359 152643
20987 152643 27964 85905 -61542 -201301 -37521 160661 150553 95077 13190 131837
20977 131837 269296 197939 126163 40601 143049 80088 -64116 -34548 -10022 45220 -26502
20966 -26502 101773 11355 123040 147341 90583 37910 120750 165523 11122 -149152 -164429
$$ packed form
21042A55983J7253j29904l2974J60041M1817o3589J4035O987j25156q8913Q1697
21031C7277j08387P0962Q5426l942L8027j2448L9930j00026l5405K32549N2314
21020B96277j5840j04733j28742j8565j0451N2228n1736p1047j9313L9497n0042
21009h2467q0762J4531q2574K1561N8445L9987J17964J45566J80558n0907r4775
20998A87127r3617L922P9735j77028j00417J45333J17949L2459p6706K0602J3284
20987A52643j24679N7941j47447j39759J63780J98182j0108n5476q1887J18647
20977A31837J37459p1357p1776q5562J02448o2961j44204K9568K4526N5242p1722
20966b6502J28275r0418J11685K4301n6758n2673Q2840M4773j54401j60274j5277
$$ plain form
20955 -164429 -252180 -209909 -135764 -208369 -110799 17826 92465 97815 71709 -75878 -44143
20944 -44143 -6992 51288 37519 -6282 -2598 17536 -106661 -253545 -209702 107179 159995
20933 159995 125067 109057 -46364 -51233 120988 204388 155818 -8253 -18191 -134650 -270341
20922 -270341 -336038 -225517 -302977 -228545 -154644 -53432 239722 182077 -63227 -196583
20912 -196583 -132470 -2258 38636 63586 6582 125584 223985 244541 181821 12624 -110264
20901 -110264 -202526 -149913 -174190 -148901 -149983 48274 29915 -90085 -167223 -203937 -207644
20890 -207644 -81629 -59199 -50162 64521 15383 -208677 -206718 -179549 -104450 -73761 -21242
20879 -21242 29539 592 -109005 -161545 -30335 48908 59042 -6454 -98239 1762 -51765
$$ packed form
20955a64429q7751M2271P4145p2605R7570J28625P4639N350k6106j47587L1735
20944d4143L7151N8280j3769m3801L684K0134j24197j46884M3843L16881N2816
20933A59995l4928j6010j55421m869J72221Q3400m8570j64071r938j16459j35691
20922b70341o5697J10521p7460P4432P3901J01212K93154n7645k45304j33356
20912a96583O4113J30212M0894K4950n7004J19002R8401K0556o2720j69197j22888
20901a10264r2262N2613k4277K5289j082J98257j8359j20000p7138l6714l707
20890b07644J26015K2430R037J14683m9138k24060J959K7169P5099L0689N2519
20879b1242N0781k8947j09597n2540J31210P9243J0134o5496r1785J00001n3527
$$ plain form
20868 -51765 -43849 -91545 -65057 83331 -22525 -47470 8199 68705 27609 139117 30333
20857 30333 -50832 -180661 -191151 -207247 -109412 131568 295773 149581 96443 237059 306195
20846 306195 146419 134304 252179 249238 320860 254071 205401 254463 272041 322149 273261
20835 273261 214097 17918 -6599 12797 36165 91821 167024 181122 198238 161556 107910
20824 107910 -50582 -52997 15968 -135214 -45880 60203 -28630 -11453 -4511 -52435 -128953
20813 -128953 -171866 22282 214300 374762 300637 173411 74306 -56547 114828 380223
20803 380223 362535 235204 334957 506300 647022 741302 839594 1175371 1687668 2182698
20793 2182698 2636467 2825297 2485532 1976393 1451408 862905 601697 550457 400980 462008
$$ packed form
20868e1765P916m7696K6488J48388j05856k4945N5669O0506m1096J11508j08784
20857C0333q1165j29829j0490j6096R7835K40980J64205j46192n3138J40616O9136
20846C06195j59776j2115J17875k941P1622o6789m8670M9062J7578N0108m8888
20835B73261n9164j96179k4517J9396K3368N5656P5203J4098J7116l6682n3646
20824A07910j58492k415O8965j51182Q9334J06083q8833J7177O942m7924p6518
20813a28953m2913J94148J92018J60462p4125j27226r9105j30853J71375K65395
20803C80223j7688j27331R9753J71343J40722R4280R8292L35777N12297M95030
20793B182698M53769J88830l39765n09139n24985n88503k61208n1240j49477O1028
$$ plain form
20783 462008 490151 514401 269019 93338 104615 120481 173146 100814 34499 139562 163604
20772 163604 222668 222626 334422 454688 661828 752557 770356 862194 990282 1290542 1720496
20761 1720496 2134963 2783268 3002167 2614680 1949801 1396739 1015384 687719 463489
20752 463489 348625 314546 397676 428096 413489 528789 409665 216118 255946 249075 80767
20741 80767 -74236 -69216 5839 124833 141774 -4328 19883 143785 129748 239107 229437
20730 229437 81927 139231 150312 190128 204540 248368 199617 113323 116274 195783 221242
20719 221242 122221 -1733 18380 -83977 -202721 -275848 -64022 89156 105601 30391
20709 30391 32012 235132 230283 287289 196444 101009 -94401 -99456 122389 114268 277016 322995
$$ packed form
20783D62008K8143K4250k45382j75681J1277J5866N2665p2332o6315J05063K4042
20772A63604N9064m2J11796J20266K07140R0729J7799R1838J28088L00260M29954
20761A720496M14467O48305K18899l87487o64879n53062l81355l27665k24230
20752D63489j14864l4079Q3130L0420j4607J15300j19124j93547L9828o871j68308
20741H0767j55003N020P5055J18994J6941j46102K4211J23902j4037J09359r670
20730B29437j47510N7304J1081L9816J4412M3828m8751q6294K951P9509K5459
20719B21242r9021j23954K0113j02357j18744p3127K11826J53178J6445p5210
20709C0391J621K03120m849N7006r0845r5435j95410n055K21845q121J62748M5979
$$ plain form
20697 322995 147950 -68690 -167073 -285378 -266585 -89590 43283 228016 111140 95094
20687 95094 247030 308216 216657 310439 342575 206242 132397 31959 20181 -41122 -111691
20676 -111691 -84696 -53224 81250 2721 51307 24014 -105634 -87172 107944 253065 306340
20665 306340 303465 231921 74478 -135320 -166988 -204753 -49626 -7656 97519 61381 -45914
20654 -45914 52791 122658 71898 -13139 -18211 -119584 -81990 -47907 100381 22377 -105186
20643 -105186 -139323 -100956 -80435 -246945 -319018 -264260 -236669 -28871 76173 123387 167306
20632 167306 304095 178759 11926 37645 219305 385756 230899 122280 152857 54406
20622 54406 80089 49148 179319 149734 88161 76854 150168 268900 325863 397051 361280
$$ packed form
20697C22995j75045k16640r8383j18305J8793J76995J32873J84733j16876j6046
20687I5094J51936O1186r1559R3782L2136j36333p3845j00438j1778o1303p0569
20676a11691K6995L1472J34474p8529M8586k7293j29648J8462J95116J45121N3275
20665C06340k875p1544j57443k09798l1668l7765J55127M1970J05175l6138j07295
20654d5914R8705O9867n0760q5037n072j01373L7594L4083J48288p8004j27563
20643a05186l4137L8367K0521j66510p2073N4758K7591K07798J05044M7214M3919
20632A67306J36789j25336j66833K5719J81660J66451j54857j08619L0577r8451
20622E4406K5683l0941J30171k9585o1573j1307P3314J18732N6963P1188l5771
$$ plain form
20611 361280 347493 408901 284444 56762 134905 437833 367896 181760 -16528 -19265 45920
20600 45920 -38682 -61025 56985 252173 323717 142868 100242 71843 -16892 180624 186514
20589 186514 194394 276028 245959 124395 -104615 -140423 -61212 143007 187571 266261 229022
20578 229022 39138 50777 52858 -100200 -107646 -22075 9690 74570 116312 -49288 -82536
20567 -82536 21117 96399 178446 285010 40071 -37163 -145975 -106589 209494 253291 362795
20556 362795 510737 330202 86506 -108821 -180108 -50907 -84618 -73822 -96808 -83415
20546 -83415 -186100 -128609 96886 344687 477913 378538 156228 110077 250397 160434
20536 160434 94810 162311 132277 126844 276606 300657 220962 216742 297115 317075 260364 107705
$$ packed form
20611C61280j3787O1408j24457k27682P8143L02928o9937j86136j98288k737O5185
20600D5920q4602k2343J18010J95188P1544j80849m2626k8399q8735J97516N890
20589A86514P880Q1634l0069j21564k29010l5808P9211K04219M4564P8690l7239
20578B29022j89884J1639K081j53058p446Q5571L1765O4880M1742j65600l3248
20567h2536J03653P5282Q2047J06564k44939p7234j08812L9386L16083M3797J09504
20556C62795J47942j80535k43696j95327p1287J29201l3711J0796k2986J3393
20546h3415j02685N7491K25495K47801J33226r9375k22310m6151J40320q9963
20536A60434o5624O7501l0034n433J49762K4051p9695m220Q0373J9960n6711j52659
$$ plain form
20524 107705 -116687 -151680 -113746 -105485 -45507 86631 306122 397836 488601 456909 276165
20513 276165 216732 160083 182808 231267 146283 106196 114322 196848 251511 509156 476146
20502 476146 449689 719928 596115 318460 277936 193099 111867 86372 6059 120329 173230
20491 173230 270724 260614 107204 139681 242475 305901 166693 162086 163553 235279 142305
20480 142305 132261 -72261 67861 335251 401427 239203 310837 330942 239702 230201 434147
20469 434147 385487 256545 261812 372720 478324 564788 614562 759940 643502 419768
20459 419768 199339 123571 63448 195152 265104 241252 274013 444825 354210 190304 207032
20448 207032 260824 232150 224725 130250 71585 237758 215655 151373 233257 248028 502122
$$ packed form
20524A07705k24392l4993L7934Q261N9978J32138K19491R1714R0765l1692j80744
20513B76165n9433n6649K2725M8459q4984m0087Q126Q2526N4663K57645l3010
20502D76146k6457K70239j23813k77655m0524q4837q1232k5495q0313J14270N2901
20491A73230R7494j0110j53410L2477J02794O3426j39208m607J467P1726r2974
20480A42305j0044k04522J40122K67390O6176j62224P1634K0105r1240r501K03946
20469D34147m8660j28942N267J10908J05604Q6464M9774J45378j16438k23734
20459D19768k20429p5768o0123J31704O9952k3852L2761J70812r0615j63906J6728
20448B07032N3792k8674p425r4475n8665J66173k2103o4282Q1884J4771K54094
$$ plain form
20437 502122 578962 548814 382115 546084 650180 558182 546439 633843 418116 286410
20427 286410 254393 297703 442380 378891 290832 270117 244829 377697 300949 185515 323482
20416 323482 408744 320389 203688 353113 466131 605876 653794 609939 448932 507750
20406 507750 405270 324692 304936 251705 347210 238677 76250 133296 193600 158158 249474
20395 249474 399088 353044 220896 259849 408552 441641 278491 309704 361474 352439 346974
20384 346974 110571 -17222 -14522 137615 205911 333880 467022 428189 468392 486453 544502
20373 544502 634657 695417 570925 661771 649568 471460 372061 319089 362536 296719 262678
20362 262678 406990 540016 546668 451123 315253 256011 363238 370734 437504 572131 567354
$$ packed form
20437E02122P6840l0148j66699J63969J04096r1998j1743Q7404k15727j31706
20427B86410l2017M3310J44677o3489q8059k0715k5288J32868p6748j15434J37967
20416C23482Q5262q8355j16701J49425J13018J39745M7918m3855j61007N8818
20406E07750j02480q0578j9756n3231R5505j08533j62427N7046O0304l5442R1316
20395B49474J49614m6044j32148L8953J48703L3089j63150L1213N1770r035n465
20384C46974k36403j27793K700J52137O8296J27969J33142l8833M0203J8061N8049
20373E44502R0155O0760j24492R0846j2203j78108r9399n2972M3447o5817l4041
20362B62678J44312J33026O652r5545j35870n9242J07227P496O6770J34627m777
$$ plain form
20351 567354 259251 307753 312811 276726 294287 510440 621030 637604 522043 580671 790455
20340 790455 868787 862746 912434 956161 820179 693395 715991 803249 986964 1139905 1188212
20329 1188212 922145 734392 876310 1013611 992058 810851 830190 957568 1030447 1182585
20319 1182585 1243272 1209418 1085770 880123 792754 725549 867310 928776 1136113 1184748
20309 1184748 1185623 1214813 1137047 1337783 1611083 1440349 1160502 1064316 1042218 1139762 1218890
20298 1218890 1238021 1159586 1180332 1383772 1438629 1355999 1252402 1292937 1315556 1292868 1281237
20287 1281237 1301719 1446424 1595251 1659842 1625859 1653946 1569637 1590098 1655637 1587094 1361298
20276 1361298 1366522 1364745 1444555 1597968 1887409 2073522 2120036 2128676 2195213 2407771 2600158
$$ packed form
20351E67354l08103M8502N058l6085J7561K16153J10590J6574j15561N8628K09784
20340G90455P8332o041M9688M3727j35982j26784K2596Q7258J83715J52941M8307
20329A188212k66067j87753J41918J37301k1553j81207J9339J27378P2879J52138
20319A182585O0687l3854j23648k05647q7369o7205J41761O1466K07337M8635
20309A184748Q75K9190p7766K00736K73300j70734k79847r6186k2098R7544P9128
20298A218890J9131p8435K0746K03440N4857q2630j03597M0535K2619k2688j1631
20287A281237K0482J44705J48827O4591l3983K8087q4309K0461O5539o8543k25796
20276A361298N224j777P9810J53413K89441J86113M6514Q640O6537K12558J92387
$$ plain form
20265 2600158 2602607 2701011 2859201 3142905 3482426 3925788 4521841 5203337 5948985 6122407
20255 6122407 5850806 5305576 4790933 4545169 4432805 4706872 5087885 5543942 5746777
20246 5746777 5512380 5301673 5507169 5810679 6297896 6788895 7529819 8437044 9590317
20237 9590317 10805556 11626502 12124711 12754248 13747147 14672552 15268990 15833145 16798019
20228 16798019 18470761 20737675 23446427 27029549 31204654 36090931 42316457 51056665
20220 51056665 63583753 81390700 106284546 141620823 194095406 274460034 386595202
20213 386595202 497881460 527114026 442780630 318022554 214764576 147148380 106088503
20206 106088503 80857742 65060982 54791365 47435743 41666389 37310630 34548567
$$ packed form
20265B600158K449R8404J58190K83704L39521M43362N96053O81496P45648J73422
20255F122407k71601n45230n14643k45764j12364K74067L81013M56057K02835
20246E746777k34397k10707K05496L03510M87217M90999P40924R07225J153273
20237I590317J215239Q20946M98209O29537R92899R25405N96438N64155R64874
20228A6798019J672742K266914K708752L583122M175105M886277O225526Q740208
20220E1056665J2527088J7806947K4893846L5336277N2474583Q0364628J12135168
20213C86595202J11286258K9232566q4333396j24758076j03257978o7616196m1059877
20206A06088503k5230761j5796760j0269617p355622n769354m355759k762063
$$ plain form
20199 34548567 32661683 30923471 29604936 29165932 29567523 30883327 32704091 34860484
20191 34860484 37490024 41253420 46705717 55159251 67945292 85892018 110278212 144093316
20183 144093316 194136056 271295072 382349167 502176903 550864108 477242762 347388318
20176 347388318 233700198 157162982 110217894 81004768 62464576 50464909 42128555
20169 42128555 35948953 30910841 26346403 22652005 19982249 17752177 15983550 14742545
20161 14742545 13927595 13571910 12927445 11564048 10098052 9264777 8857055 8698820 8535265
20152 8535265 8098690 7262479 6229876 5292400 4630897 4296636 4212011 4208139 4170451 4170607
20142 4170607 4079920 3923864 3782600 3601468 3737829 4294486 5071125 5149723 4473857 3641666
$$ packed form
20199C4548567j886884j738212j318535m39004M01591J315804J820764K156393
20191C4860484K629540L763396N452297Q453534J2786041J7946726K4386194L3815104
20183A44093316N0042740P7159016J11054095J19827736M8687205p3621346j29854444
20176C47388318j13688120p6537216m6945088k9213126j8540192j1999667q336354
20169D2128555o179602n038112m564438l694398k669756k230072j768627j241005
20161A4742545q14950l55685o44465j363397j465996q33275m07722j58235j63555
20152H535265m36575q36211j032603r37476o61503l34261q4625l872l7688J56
20142D170607r0687j56056j41264j81132J36361N56657P76639P8598o75866q32191
$$ plain form
20132 3641666 3008044 2638106 2091602 1649685 1392296 1257413 1141587 1148546 1084014 1183938
20122 1183938 1174311 1237233 1178265 1047937 927811 965372 847454 770567 673184 612620 676069
20111 676069 892285 872452 747957 679858 671791 650569 522246 383246 484292 528286 556345
20100 556345 473820 302624 369417 402745 531298 562454 472897 449817 496024 456515 451554
20089 451554 444189 468034 309555 347496 526217 683968 611796 322055 165652 48558
20079 48558 85145 -11538 70794 154844 256034 429507 392962 327532 371503 325003 215306
20068 215306 82959 331122 393245 269440 163503 42242 218179 201513 126219 69556
20058 69556 214715 296103 234297 240805 364134 362019 330464 262756 151658 90541 273727
$$ packed form
20132C641666o33622l69938n46504m41917k57389j34883j15826O959o4532R9924
20122A183938r627O2922n8968j30328j20126L7561j17918p6887r7383o0564O3449
20111F76069K16216j9833j24495o8099q067k1222j28323j39000J01046M3994K8059
20100E56345q2525j71196O6793L3328J28553L1156q9557k3080M6207l9509m961
20089D51554p365K3845j58479L7941J78721J57751p2172k89741j56403j17094
20079D8558L6587r6683Q2332Q4050J01190J73473l6545o5430M3971m6500j09697
20068B15306j32347K48163O2123j23805j05937j21261J75937j6666p5294n6663
20058F9556J45159Q1388o1806O508J23329k115l1555o7708j11098o1117J83186
$$ plain form
20047 273727 380211 159676 130041 192460 248002 113081 -1709 -102742 -184621 -84085
20037 -84085 1660 -60235 -54128 -103418 -129709 -164428 -121995 -102286 -52666 5001 -148447 -272636
20025 -272636 -354735 -355640 -230021 -80164 -24743 62007 -109195 -145385 -56596 120588 212852
20014 212852 212430 145066 -62285 18398 30968 -112355 -98918 95093 55237 -7490 -140536
20003 -140536 -240497 -111829 86883 119506 368296 514417 547381 308734 130730 33904
19993 33904 -52336 -200564 -390050 -483460 -528131 -458900 -214784 -97346 -88194 -91507 -94047
19982 -94047 -61095 -83652 -102598 -243129 -155711 -168826 -259767 -72331 -89169 -158481 -192132
19971 -192132 -221832 -320772 -134195 108084 148458 166516 250235 170960 171618 117207 99006
$$ packed form
20047B73727J06484k20535k9635O2419N5542j34921j14790j01033q1879J00536
20037h4085Q5745o1895O107m9290k6291l4719M2433J9709M9620N7667j53448j24189
20025b72636q2099r05J25619J49857N5421Q6750j71202l6190Q8789J77184R2264
20014B12852m22o7364k07351Q0683J2570j43323J3437J94011l9856o2727j33046
20003a40536r9961J28668J98712L2623K48790J46121L2964k38647j78004r6826
19993C3904q6240j48228j89486r3410m4671O9231K44116J17438R152l313k540
19982i4047L2952k2557j8946j40531Q7418j3115r0941J87436j6838o9312l3651
19971a92132k9700r8940J86577K42279M0374J8058Q3719p9275O58n4411j8201
$$ plain form
19960 99006 227633 89195 150352 259193 157852 60689 84149 95444 256813 88067
19950 88067 -55583 -188120 -212910 -98203 -43470 123990 206513 134049 -22733 70436 76932
19939 76932 199043 361091 356157 268217 185418 279363 227911 12282 12450 -8073 -129205
19928 -129205 -181267 -96695 51302 291216 198807 225548 107115 1624 -117925 -179612
19918 -179612 -58143 52822 148229 104728 -29366 -75611 -168196 -72072 -214024 -76805
19908 -76805 109638 223860 391412 403238 348717 306209 171629 98283 192494 313700 161121
19897 161121 157527 138393 99465 -94808 -96253 -126230 -180886 -117152 -43725 -26739 -51243 -21659
19885 -21659 -12998 19352 -7507 -28754 -148327 -213095 -108401 -68188 -119896 -65357 101720
$$ packed form
19960I9006J28627j38438O1157J08841j01341r7163K3460J1295J61369j68746
19950H8067j43650j32537k4790J14707N4733J67460Q2523p2464j56782R3169O496
19939G6932J22111J62048m934q7940q2799R3945n1452k15629J68k0523j21132
19928a29205n2062Q4572J47997K39914r2409K6741j18433j05491j19549o1687
19918a79612J21469J10965R5407m3501j34094m6245r2585R6124j41952J37219
19908g6805J86443J14222J67552J1826n4521m2508j34580p3346R4211J21206j52579
19897A61121l594j9134l8928j94273j445k9977n4656O3734P3427J6986k4504K9584
19885b1659Q661L2350k6859k1247j19573o4768J04694M0213n1708N4539J67077
$$ plain form
19874 101720 215443 143473 207835 70230 -202122 -205916 -175113 -308684 -285987 -117486 -39695
19863 -39695 -82173 -111001 -49731 -72619 -71197 -1184 -24811 -126705 -299890 -414172 -329013
19852 -329013 -347561 -381705 -219764 99361 156470 80622 -30785 17634 5826 104982 404978
19841 404978 455187 472340 410894 158891 -7175 -73277 70310 -66617 -123735 -128529 -151859
19830 -151859 -77435 -15832 64517 -50789 -154102 -82619 -11519 156696 388190 316649 148641
19819 148641 201544 159302 -35117 -116162 -77935 -142405 -268694 -314617 -103353 14288 -57495
19808 -57495 -99398 -40498 40573 -41061 37745 60362 24952 -81421 -232182 -231689 -156484 -25911
19796 -25911 89508 46733 -45064 -45444 220482 266367 86549 107691 171421 60121 8959
$$ packed form
19874A01720J13723p1970O4362j37605k72352l794L0803j33571K2697J68501P7791
19863c9695m2478k8828O1270k2888J422P0013k3627j01894j73185j14282Q5159
19852c29013j8548l4144J61941L19125N7109p5848j11407M8419j1808R9156K99996
19841D04978N0209J7153o1446k52003j66066o6102J43587j36927n7118m794k3330
19830a51859P4424O1603Q0349j15306j03313P1483P1100J68215K31494p1541j68008
19819A48641N2903m2242j94419q1045L8227o4470j26289m5923K11264J17641p1783
19808e7495m1903N8900Q1071q1634P8806K2617l5410j06373j50761M93P5205J30573
19796b5911J15419m2775r1797l80K65926M5885j79818K1142O3730j11300n1162
$$ plain form
19785 8959 -25838 12744 55867 -107758 -159645 -166292 19409 44144 61255 87807 185339 133090
19773 133090 102208 154511 301674 78677 -53799 73956 7267 -158570 -199174 -104338
19763 -104338 3292 66326 89222 -22519 -227723 -369786 -299269 -129495 -150511 -173166
19753 -173166 -94093 -188675 -271026 -235650 -152519 -177689 -239676 -179563 -64433 -99709 -81662
19742 -81662 -31463 -214423 -257400 -271005 -341084 -140196 -52061 -85378 -113773 -43496 -125104
19731 -125104 -191179 -146717 137138 168945 72835 -44878 -127285 -68908 -69389 -112027 -26079
19720 -26079 -4998 75828 73530 55895 157981 129046 13081 34798 54311 74239 141057
19709 141057 -19810 -42516 86560 33719 -148112 -114517 -147809 -216419 -214710 -186163 -65595
$$ packed form
19785H959l4797L8582M3123j63625n1887o647J85701K4735J7111K6552R7532n2249
19773A33090l0882N2303J47163k22997j32476J27755o6689j65837m0604R4836
19763a04338J07630O3034K2896j11741k05204j42063P0517J69774k1016k2655
19753a73166P9073r4582q2351L5376Q3131k5170o1987O0113J15130l5276J8047
19742h1662N0199j82960m2977j3605p0079K00888Q8135l3317k8395P0277q1608
19731a25104o6075M4462K83855L1807r6110j17713q2407N8377m81m2638Q5948
19720b6079K1081Q0826k298j7635J02086k8935j15965K1717J9513J9928O6818
19709A41057j60867k2706J29076n2841j81831L3595l3292o8610J709K8547J20568
$$ plain form
19698 -65595 50122 127109 32728 90935 152932 20774 65957 107410 63015 -139506 -358446
19687 -358446 -331552 -267159 -209179 9776 92186 -75508 -201437 -265865 -216767 -86642 79262
19676 79262 -31508 -120159 -186017 -234847 -247720 -19529 58605 132320 272316 223668 210811
19665 210811 180458 -51154 -220116 -255281 -177670 -254708 -230331 -214493 -173786 -147664 -145933
19654 -145933 -200204 -112695 -90514 -14032 -23515 48671 101408 62480 16259 -169644 -57376
19643 -57376 76388 48332 75060 122161 159931 360729 481583 506376 469043 452137 494105
19632 494105 468527 536032 679964 811541 1189883 1640531 2240070 2755730 2868624 2306511
19622 2306511 1700352 1066099 543268 519663 621574 519786 432315 483779 446724 134512
$$ packed form
19698f5595J15717P6987r4381N8207O1997j32158M5183M1453m4395k02521k18940
19687c58446K6894O4393N7980K18955Q2410j67694j25929o4428M9098J30125J65904
19676G9262j10770q8651o5858m8830j2873K28191P8134P3715J39996m8648j2857
19665B10811l0353k31612j68962l5165P7611p7038K4377J5838M0707K6122J731
19654a45933n4271Q7509K2181P6482r483P2186N2737l8928m6221j85903J12268
19643e7376J33764k8056K6728M7101L7770K00798J20854K4793l7333j6906M1968
19632D94105k5578O7505J43932J31577L78342M50648N99539N15660J12894n62113
19622B306511o06159o34253n22831k3605J01911j01788q7471N1464l7055l12212
$$ plain form
19612 134512 5840 -22876 167300 182307 219984 64137 -26490 73281 135443 76118 123011
19601 123011 146421 151952 266072 377443 514746 611362 969551 1436891 2061005 2616685
19591 2616685 2998659 2724678 2211206 1583689 1120958 886641 729415 645456 509674 499170
19581 499170 396333 345033 233022 210892 40719 -30475 78297 94299 177984 141477 304275
19570 304275 377153 232502 163470 37066 74181 145185 110914 62942 -129250 -176490 -124575
19559 -124575 4907 72313 231775 220767 254346 166670 118683 132520 119375 150214 24563
19548 24563 -28428 -118616 2653 98261 98386 51299 -30856 36547 13872 65292 116721 50439
19536 50439 -22791 -94495 -288532 -281824 -279828 -252583 -165778 -3619 1537 73408 160939 68117
$$ packed form
19612A34512j28672k8716J90176J5007L7677j55847r0627R9771O2162n9325M6893
19601A23011K3410N531J14120J11371J37303R6616L58189M67340O24114N55680
19591B616685L81974k73981n13472o27517m62731k34317j57226q3959j35782j0504
19581D99170j02837n1300j12011k2130j70173p1194J08772J6002Q3685l6507J62798
19570C04275P2878j44651o9032j26404L7115P1004l4271m7972j92192m7240N1915
19559a24575J29482O7406J59462j1008L3579q7676m7987J3837j3145L0839j25651
19548B4563n2991r0188J21269R5608J25m7087q2155O7403k2675N1420N1429o6282
19536E0439p3230p1704j94037O708J996K7245Q6805J62159N156P1871Q7531r2822
$$ plain form
19524 68117 -33058 53064 51534 -46685 -103816 -74687 30892 -76653 -47722 -13439 -3349
19513 -3349 27009 4888 -129988 -91436 33608 3575 -71848 -185933 -82265 -70384 -27470
19502 -27470 -43455 -80707 -61558 63736 121081 134090 32187 -16697 -100666 -77663 117912
19491 117912 162097 74413 48631 145380 172151 234109 105355 -109498 -105027 105947 265790
19480 265790 219613 26774 27897 86937 82793 53879 -27554 -103784 -84674 -10481 -27666 -32536
19468 -32536 -146792 -168522 -215022 -70752 45630 -2278 17682 69955 110698 151686 151296
19457 151296 103878 24050 -13415 48165 70155 64195 111445 237149 311982 183357 -23394
19446 -23394 -77400 -14614 219178 375023 420384 267003 192878 235078 130690 313910 291234
$$ packed form
19524F8117j01175Q6122j530r8219n7131K9129J05579j07545K8931L4283J0090
19513c349L0358k2121j34876L8552J25044l0033p5423j14085J03668J1881M2914
19502b7470j5985l7252J9149J25294N7345J3009j01903m8884q3969K3003J95575
19491A17912M4185q7684k5782R6749K6771O1958j28754k14853M471K10974J59843
19480B65790m6177j92839J123N9040m144k8914q1433p6230J9110P4193j7185m870
19468c2536j14256k1730m6500J44270J16382m7908J9960N2273M0743M0988l90
19457A51296m7418p9828l7465O1580K1990n960M7250J25704P4833j28625k06751
19446b3394n4006O2786K33792J55845M5361j53381p4125M2200j04388J83220k2676
$$ plain form
19435 291234 267863 342340 142132 -23417 -22097 70625 104547 222940 92646 -36309 -62124
19424 -62124 -6771 126671 259374 186492 -20624 -92983 -32485 -30023 98938 150764 167951
19413 167951 230767 249148 221139 203360 199382 190234 97513 -6518 10173 -43769 -36424 -253612
19401 -253612 -129526 -111610 -241926 -496505 -333010 46707 56186 74408 249668 242553 128466
19390 128466 -62704 -102329 15853 -74354 -101085 -51009 13826 -10354 132059 344468 361930
19379 361930 375572 206335 -75500 -243639 -315586 -274812 -193133 -142101 43 -10597 9783
19368 9783 45916 138007 177488 243694 161576 181321 190657 134170 -48017 -150314 -220852 -150533
19356 -150533 -127139 68140 219687 193555 270026 126539 10492 104831 202883 564359
$$ packed form
19435B91234k3371P4477k00208j65549J320R2722L3922J18393j30294j28955k5815
19424f2124N5353J33442J32703p2882k07116p2359O0498K462J28961N1826J7187
19413A67951O2816J8381k8009j7779l978r148r2721j04031J6691n3942P345k17188
19401b53612J24086J7916j30316k54579J63495L79717R479J8222J75260p115j14087
19390A28466j91170l9625J18182r0207k6731N0076O4835k4180J42413K12409J7462
19379C61930J3642j69237k81835j68139p1947M0774Q1679N1032J42144j0640K0380
19368I783L6133R2091L9481O6206q2118J9745R336n6487j82187j02297p0538P0319
19356a50533K3394J95279J51547k6132P6471j43487j16047R4339R8052L61476
$$ plain form
19346 564359 878025 1282001 1778547 1957309 2102152 2111284 2151664 2247327 2506141 2360129
19336 2360129 1939400 1595854 1671675 2015439 2222525 2023322 1955603 2009980 2021674 2077511
19326 2077511 1784317 1383566 999805 790482 694323 462946 263301 200730 241315 13531
19316 13531 24454 97115 34629 53089 -40158 -262509 -235762 48378 95500 -56131 -22660
19305 -22660 87468 276937 354982 204328 -20722 -109613 -48564 -64558 -107281 45453 162946
19294 162946 -19996 -84494 -135508 76720 147771 76141 91005 242414 142570 119403 101182
19283 101182 -33638 -173396 -77735 57440 121452 49041 99763 133221 189194 191412 187402
19272 187402 228141 171857 149043 186453 155173 141555 220564 172384 16828 -26380 47047
$$ packed form
19346E64359L13666M03976M96546J78762J44843R132M0380R5663K58814j46012
19336B360129m20729l43546P5821L43764K07086j99203o7719N4377J1694N5837
19326B077511k93194m00751l83761k09323r6159k31377j99645o2571M0585k27784
19316A3531J0923P2661o2486J8460r3247k22351K6747K84140M7122j51631L3471
19305b2660J10128J89469P8045j50654k25050q8891O1049j5994m2723J52734J17493
19294A62946j82942o4498n1014K12228P1051p1630J4864J51409r9844k3167j8221
19283A01182j34820j39758R5661J35175O4012p2411N0722L3458N5973K218m010
19272A87402M0739n6284k2814L7410l1280j3618P9009m8180j55556m3208P3427
$$ plain form
19261 47047 58853 76628 22727 25537 34002 -2290 99516 202664 82446 20922 -69803
19250 -69803 29929 255359 532636 570107 565747 497267 370117 179221 239686 176638 101663
19239 101663 56793 107665 90094 10492 51428 136167 218271 202785 128042 -34914 -97082
19228 -97082 86385 34978 -209959 -212068 -163131 -187487 -162124 -76661 -122279 -180765 -41347
19217 -41347 122585 176917 288590 197012 172992 55623 46798 215386 425746 353549 167841
19206 167841 53568 148651 90010 163121 109468 -19791 150648 176216 15478 -140329
19196 -140329 -85606 6666 -128151 -160800 -108143 -28007 -38056 149187 236839 172608 152509
19185 152509 -11578 67709 54896 -18373 7692 -181313 -117406 57282 -71871 -99414 -46262
$$ packed form
19261D7047J1806J7775n3901K810Q465l6292J01806J03148j20218o1524r0725
19250f9803R9732K25430K77277L7471m360o8480j27150j90896O0465o3048p4975
19239A01663m4870N0872j7571p9602M0936Q4739Q2104j5486p4743j62956o2168
19228i7082J83467n1407k44937k109M8937k4356K5363Q5463m5618n8486J39418
19217d1347J63932N4332J11673r1578k4020j17369q825J68588K10360p2197j85708
19206A67841j14273R5083n8641P3111n3653j29259J70439K5568j60738j55807
19196a40329N4723R2272j34817l2649N2657Q0136j0049J87243Q7652o4231k0099
19185A52509j64087P9287j2813p3269K6065j89005O3907J74688j29153k7543N3152
$$ plain form
19174 -46262 -22214 -38372 -104910 -28327 200273 330963 344260 323011 309761 230530 112660
19163 112660 127532 163975 243609 200974 22274 98638 123492 87071 172749 107412 90438
19152 90438 264229 262777 206042 112732 286526 339550 471279 482993 476168 464854 337640
19141 337640 108888 46386 -49195 9478 34533 40931 260876 209521 -45304 -22502 47693
19130 47693 146006 149445 85516 -204289 -131311 30264 234413 344013 255801 59705 22465
19119 22465 147640 326694 304372 304558 264929 341082 256205 90246 260044 269413 136604
19108 136604 153004 242125 188756 124915 101135 49180 186691 210506 158542 242668 256342
19097 256342 111634 17356 41467 49663 32019 117307 117318 59927 222626 318203 307467 372114
$$ packed form
19174d6262K4048j6158o6538P6583K28600J30690J3297k1249j3250p9231j17870
19163A12660J4872L6443P9634m2635j78700P6364K4854l6421Q5678o5337j6974
19152I0438J73791j452n6735r3310J73794N3024J31729J1714o825j1314j27214
19141C37640k28752o2502r5581N8673K5055O398K19945n1355k54825K2802P0195
19130D7693R8313L439o3929k89805P2978J61575K04149J09600q8212j96096l7240
19119B2465J25175J79054k2322J86l9629P6153q4877j65959J69798R369j32809
19108A36604J6400Q9121n3369o3841k3780n1955J37511K3815n1964Q4126J3674
19097B56342j44708r4278K4111Q196j7644Q5288J1n7391J62699R5577j0736O4647
$$ plain form
19085 372114 368336 309644 526008 830419 1102348 1291685 1701439 2173333 2844227 3075280
19075 3075280 2768983 2257423 1544892 996943 667132 399327 237322 142180 48293 -21490
19065 -21490 127448 366316 279418 205768 204595 275245 263870 133232 207842 375304 387585
19054 387585 412989 360397 339490 503160 687776 896953 1036463 1287098 1636339 2087098
19044 2087098 2563396 2815556 2641670 2156135 1329808 779202 478661 536262 460678 332422
19034 332422 438905 386281 161082 73713 75011 273958 362991 390236 278872 195007 9716
19023 9716 -54269 28068 154710 185735 141419 89981 65366 83641 35456 158497 197883
19012 197883 46426 31658 -157118 -75934 -32390 168348 323594 276421 123151 97555
$$ packed form
19085C72114l778n8692K16364L04411K71929J89337M09754M71894O70894K31053
19075C075280l06297n11560p12531n47949l29811k67805j62005r5142r3887o9783
19065b1490J48938K38868q6898p3650j173P0650j1375j30638P4610J67462J2281
19054C87585K5404n2592k0907J63670J84616K09177J39510K50635L49241M50759
19044B087098M76298K52160j73886m85535q26327n50606l00541N7601p5584j28256
19034C32422J06483n2624k25199q7369J298J98947Q9033K7245j11364q3865j85291
19023I716o3985Q2337J26642L1025m4316n1438k4615J8275m8185J23041L9386
19012A97883j51457j4768j88776Q1184M3544K00738J55246m7173j53270k5596
$$ plain form
19002 97555 78105 78776 21189 61708 195658 177767 107861 -15593 -14941 118397 180940 93332
18990 93332 40026 14981 92223 229627 393524 420659 369321 557646 595491 403223 343669
18979 343669 329982 373016 453976 526662 137731 -11441 131826 251234 362908 358951 418599
18968 418599 373539 152809 76053 98443 111154 61021 212173 264839 200403 256968 482801
18957 482801 604961 544176 478555 556962 602444 510600 518098 439990 484914 544164 538033 546026
18945 546026 614859 767359 680894 532550 630881 769332 574934 402390 335253 225668
18935 225668 257865 254983 265578 271895 369022 252147 218301 214316 212576 211274 102935 160276
18923 160276 357527 361080 328783 152581 145194 187332 277650 526459 527977 317250 170721
$$ packed form
19002I7555j9450O71n7587M0519J33950j7891o9906j23454O52J33338O2543q7608
18990I3332n3306k5045P7242J37404J63897K7135n1338J88325L7845j92268n9554
18979C43669j3687M3034Q0960P2686l88931j49172J43267J19408J11674l957N9648
18968D18599m5060k20730p6756K2390J2711n0133J51152N2666o4436N6565K25833
18957D82801J22160o0785o5621P8407M5482r1844P498p8108M4924N9250o131P993
18945E46026O8833J52500q6465j48344R8331J38451j94398j72544o7137j09585
18935B25668L2197k882J0595O317R7127j16875l3846l985j740j302j08339N7341
18923A60276J97251L553l2297j76202p387M2138R0318K48809J518k10727j46529
$$ plain form
18912 170721 279040 366406 458674 603795 679863 634063 507488 485434 308077 317026 374758
18901 374758 629713 610562 532886 491086 393209 543793 657289 492298 268715 335042
18891 335042 346589 612484 780540 816672 805091 700214 554407 545435 667267 817003
18881 817003 1066214 1245560 1555354 1803308 1984284 2302306 2277824 2152747 2222882 2326570
18871 2326570 2203641 2126289 1872158 1426239 1164756 1121126 983461 823387 795714 858968
18861 858968 844910 796598 979908 969681 1113826 1456365 1781894 2253910 2409031 2632410
18851 2632410 2847324 2782850 2798561 2659497 2219701 1856803 1506130 1253850 1058489 863755
18841 863755 848132 937553 898792 879539 896024 906633 997801 999499 901922 840176 882429 937464
$$ packed form
18912A70721J08319Q7366R2268J45121P6068m5800j26575k2054j77357Q949N7732
18901C74758K54955j9151p7676m1800r7877J50584J13496j64991k23583O6327
18891C35042J1547K65895J68056L6132j1581j04877j45807q972J21832J49736
18881H17003K49211J79346L09794K47954J80976L18022k4482j25077P0135J03688
18871B326570j22929p7352k54131m45919k61483m3630j37665j60074k7673O3254
18861H58968j4058m8312J83310j0227J44145L42539L25529M72016J55121K23379
18851B632410K14914o4474J5711j39064m39796l62898l50673k52280j95361j94734
18841H63755j5623Q9421l8761j9253J6485J0609R1168J698r7577o1746M2253N5035
$$ plain form
18829 937464 971224 974092 889814 921490 997038 999018 1109761 1149638 1038505 1037459 922011
18818 922011 1012470 1075712 1063310 932506 826161 901230 905484 809029 791074 879562 862898
18807 862898 947622 1007706 1010737 888012 702482 745235 941388 978978 997009 1066043 1122257
18796 1122257 1077787 1197974 993906 972607 1131424 1287411 1337379 1245939 1297835 1344581
18786 1344581 1359505 1444694 1418501 1294668 1217198 1161137 1172842 1124829 1102606 954625 865626
18775 865626 1121321 1631299 1811523 1896394 2141243 2178386 2379094 2901312 3366792 3732058
18765 3732058 3696282 3314706 2994935 2604930 2442600 2275769 2216844 2421551 2419122 2483868
18755 2483868 2559700 2587217 2484721 2490141 2547023 2647336 2610895 2793613 2877334 3001290 3470388
$$ packed form
18829I37464L3760K868q4278L1676P5548J980J10743L9877j11133j046j15448
18818I22011R0459O3242j2402j30804j06345P5069M254r6455j7955Q8488j6664
18807H62898Q4724O0084L031j22725j85530M2753J96153L7590J8031O9034N6214
18796A122257m4470J20187k04068k1299J58817J55987M9968r1440N1896M6746
18786A344581J4924Q5189k6193j23833p7470n6061J1705m8013k2223j47981q8999
18775H65626K55695N09978J80224Q4871K44849L7143K00708N22218M65480L65266
18765C732058l5776l81576l19771l90005j62330j66831n8925K04707k429O4746
18755B483868P5832K7517j02496N420N6882J00313l6441J82718Q3721J23956M69098
$$ plain form
18744 3470388 3919555 4441601 4888495 5141215 5291350 5510120 5599356 5918848 6319374 6417934
18734 6417934 6306920 6357395 6850385 7549778 7940921 8161257 8394224 8819405 9670917 10671397
18724 10671397 11437191 11802998 12219930 12737915 13529967 14707060 15767154 16887679 17949815
18715 17949815 19510267 21524656 23921100 26469036 29816584 34428064 40749461 49689020
18707 49689020 61548487 77682733 101454104 138365940 195903382 273578302 344296134
18700 344296134 366557445 346022184 333241451 356516383 393561660 393241075 348131400
18693 348131400 304063057 297936421 335144394 384972169 397244035 365080030 335016632
18686 335016632 339864325 362192805 350037774 284360870 202130454 137465865 95787593
$$ packed form
18744C470388M49167N22046M46894K52720J50135K18770Q9236L19492M00526R8560
18734F417934j11014N0475M92990O99393L91143K20336K32967M25181Q51512J000480
18724A0671397P65794L65807M16932N17985P92052J177093J060094J120525J062136
18715A7949815J560452K014389K396444K547936L347548M611480O321397Q939559
18707D9689020J1859467J6134246K3771371L6911836N7537442P7674920P0717832
18700C44296134K2261311k0535261j2780733K3274932L7045277l20585m5109675
18693C48131400m4068343o126636L7207973M9827775J2271866l2164005l0063398
18686C35016632M847693K2328480j2155031o5676904q2230416o4664589m1678272
$$ plain form
18679 95787593 70776478 55357183 45103857 37919219 32745567 28716907 25540443 22828646
18671 22828646 20568821 18578869 17023205 16046636 15320508 14425608 13184751 11951438
18663 11951438 11091136 10463379 9966872 9231480 8789953 8355319 7796474 7227345 6878870
18654 6878870 6726888 6583914 6305703 5865911 5336127 5019115 4940397 5094713 4934707 4690910
18644 4690910 4562540 4328686 4359162 4419021 4144000 3506494 2998603 2517305 2578153 2799804
18634 2799804 2900561 2842681 2726781 2677567 2475434 2312620 2141982 1948336 1847353 1793199
18624 1793199 1871830 2017609 2105671 2080648 2104891 1935143 1821796 1962420 2057955 2107318
18614 2107318 1945262 1905188 1792620 1775176 1962746 2012120 2141127 2050764 2037504 2053859
$$ packed form
18679I5787593k5011115j5419295j0253326p184638n173652m028660l176464k711797
18671B2828646k259825j989952j555664r76569p26128q94900j240857j233313
18663A1951438q60302o27757m96507p35392m41527m34634n58845n69129l48475
18654F878870j51982j42974k78211m39792n29784l17012p8718J54316j60006k43797
18644D690910j28370k33854L0476N9859k75021o37506n07891m81298O0848K21651
18634B799804J00757n7880j15900m9214k02133j62814j70638j93646j00983n4154
18624A793199P8631J45779Q8062k5023K4243j69748j13347J40624R5535M9363
18614B107318j62056m0074j12568j7444J87570M9374J29007r0363j3260J6355
$$ plain form
18604 2053859 2066169 2048959 2029390 1942672 1820464 2073845 2150231 1940144 1893422 1901650 1898573
18593 1898573 2049208 2208139 2414376 2456428 2593989 2621902 2590474 2717469 2852685 2840979
18583 2840979 2861601 2985559 3118454 3123380 3284694 3594966 3785231 3874160 3890702 3944855
18573 3944855 4126785 4215479 4297900 4531547 4796230 5137519 5363289 5544371 5827407 6134141
18563 6134141 6592211 7059947 7582104 8240802 8915941 9720439 10491734 11510422 12825897
18554 12825897 14263149 16032268 18286094 21046116 24411007 28790552 34828771 43228409
18546 43228409 54839499 70225189 90396038 117926042 158582203 222609522 321217642
18539 321217642 447126799 548605046 559836837 470359842 337796651 224155646
$$ packed form
18604B053859J2310j7210j9569q6718j22208K53381P6386k10087m6722Q228l077
18593A898573J50635J58931K06237M2052J37561K7913l1428J26995J35216j1706
18583B840979K0622J23958J32895M926J61314L10272J90265Q8929J6542N4153
18573C944855J81930Q8694Q2421K33647K64683L41289K25770J81082K83036L06734
18563F134141M58070M67736N22157O58698O75139Q04498P71295J018688J315475
18554A2825897J437252J769119K253826K760022L364891M379545O038219Q399638
18546D3228409J1611090J5385690K0170849K7530004M0656161O4027319R8608120
18539C21217642J25909157J01478247J1231791q9476995j32563191j13641005
$$ plain form
18533 224155646 149202588 105347713 80139483 64673776 54146881 46318897 40424689
18526 40424689 35947582 32464076 29730298 27761898 26422085 25760061 25905132 26843216
18518 26843216 28458971 30772959 33874498 38584280 45500742 55449843 69076209 86798749
18510 86798749 111451621 147699645 204411959 293137202 411772396 517419196 543400659
18503 543400659 468490162 341769302 226732497 148792091 102700889 75982806 59697122
18496 59697122 48836321 40555851 34208604 29110132 24857946 21221051 18009997 15367162
18488 15367162 13618795 12155564 10939879 10006736 9107032 8260871 7644368 7048518 6446150
18479 6446150 5857799 5241744 4854583 4766708 4498462 4318618 4230337 3964068 3701687 3505587
$$ packed form
18533B24155646p4953058m3854875k5208230j5465707j0526895p827984n894208
18526D0424689m477107l483506k733778j968400j339813o62024J45071R38084
18518B6843216J615755K313988L101539M709782O916462R949101J3626366J7722540
18510H6798749K4652872L6248024N6712314Q8725243J18635194J05646800K5981463
18503E43400659p4910497j26720860j15036805p7940406m6091202k6718083j6285684
18496E9697122j0860801q280470o347247n098472m252186l636895l211054k642835
18488A5367162j748367j463231j215685r33143q99704q46161o16503n95850o02368
18479F446150n88351o16055l87161q7875k68246j79844q8281k66269k62381j96100
$$ plain form
18469 3505587 3299472 3097219 2748035 2471480 2489345 2427177 2304650 2345377 2324711 2201591
18459 2201591 2203713 2221049 2371062 2273588 2155739 1999214 1889114 1715138 1510732 1533245
18449 1533245 1541365 1677694 1803985 1714691 1526926 1562931 1589314 1705894 1597213 1511043
18439 1511043 1512262 1377591 1344642 1388382 1489512 1475470 1316666 1275903 1266177 1137287 1074586
18428 1074586 1141730 1054516 875744 1036853 1306055 1416778 1441734 1326359 1252208 1337576
18418 1337576 1326131 1330170 1539545 1529816 1517915 1408175 1202472 1096142 1110933 1100027 1160724
18407 1160724 1233735 1375172 1502721 1543092 1492040 1393128 1176061 1117535 1107813 1087139 998206
18396 998206 915631 888390 748095 900457 1274228 1310802 1192014 1182130 1318664 1379700 1424355
$$ packed form
18469C505587k06115k02253l49184k76555J7865o2168j22527M0727k0666j23120
18459B201591K122J7336J50013r7474j17849j56525j10100j73976k04406K2513
18449A533245Q120J36329J26291q9294j87765L6005K6383J16580j08681q6170
18439A511043J219j34671l2949M3740J01130j4042j58804m0763r726j28890o2701
18428A074586O7144q7214j78772J61109K69202J10723K4956j15375p4151Q5368
18418A337576j1445M039K09375r729j1901j09740k05703j06330J4791j0906O0697
18407A160724P3011J41437J27549M0371n1052r8912k17067n8526r722k0674q8933
18396I98206q2575k7241j40295J52362L73771L6574j18788r884J36534O1036M4655
$$ plain form
18385 1424355 1607583 1552771 1637967 1746851 1663559 1551876 1686651 1622791 1585725 1494378
18375 1494378 1557253 1729051 1749262 1714150 1677401 1715751 1877480 1919063 1839700 1894851 2219758
18364 2219758 2102438 2009211 2216522 2438688 2547321 2628230 2848675 2722660 2695155 2713913
18354 2713913 2754104 2706033 2733076 2912677 3056446 3365565 3637510 3888106 4147083 4561800
18344 4561800 4909344 5374127 5947916 6742330 7861876 8725343 9298202 9425522 9740271
18335 9740271 10229420 10785936 11218460 11499729 11502175 12008038 12721135 13815657 15519770
18326 15519770 17918138 20503778 23593116 27319602 32298407 39654129 49973999 64283358
18318 64283358 84681208 115217270 162572042 230233793 303471371 346667473 343200314
$$ packed form
18385A424355J83228n4812Q5196J08884q3292j11683J34775o3860l7066r1347
18375A494378O2875J71798K0211l5112l6749L8350J61729M1583p9363N5151L24907
18364B219758j17320r3227K07311K22166J08633Q0909K20445j26015k7505J8758
18354B713913M0191m8071K7043J79601J43769L09119K71945K50596K58977M14717
18344D561800L47544M64783N73789P94414J119546Q63467N72859J27320L14749
18335I740271M89149N56516M32524K81269K446N05863P13097J094522J704113
18326A5519770K398368K585640L089338L726486M978805P355722J0319870J4309359
18318F4283358K0397850L0536062M7354772O7661751P3237578M3196102l467159
$$ plain form
18311 343200314 318916444 314305106 332281785 335310702 294756155 223838422 157449510
18304 157449510 112058332 85678358 71446752 64099183 61194762 62188024 66949906 75897667
18296 75897667 90198920 113147207 150799431 209343443 284966211 347903639 364951185
18289 364951185 342474682 322609879 331318560 345940909 325008429 261312422 185243157
18282 185243157 125014295 85898278 62833375 48920330 39778101 33191745 27945881
18275 27945881 23881051 20921412 18573703 16630110 14897381 13352530 12155321 11275775
18267 11275775 10837787 10495615 10002838 9462227 9234171 9279829 9151807 8714599 8027468
18258 8027468 7379306 6868755 6163772 5560106 4882906 4343549 3864132 3524269 3341603
$$ packed form
18311C43200314k4283870m611338J7976679L028917m0554547p0917733o6388912
18304A57449510m5391178k6379974j4231606p347569k904421R93262M761882Q947761
18296G5897667J4301253K2948287L7652224N8544012P5622768O2937428J7047546
18289C64951185k2476503j9864803Q708681J4622349k0932480o3696007p6069265
18282A85243157o0228862l9116017k3064903j3913045r142229o586356n245864
18275B7945881m064830k959639k347709j943593j732729j544851j197209q79546
18267A1275775m37988l42172m92777n40611k28056M5658j28022m37208o87131
18258H027468o48162n10551p04983o03666o77200n39357m79417l39863j82666
$$ plain form
18249 3341603 3107737 2662571 2466885 2509969 2557910 2458940 2215917 2080241 2107385 2249681
18239 2249681 2144264 1965253 1779005 1622240 1703480 1687746 1515505 1335845 1198826 1441650
18229 1441650 1477621 1366410 1260100 1315166 1168705 1069596 915912 859605 817570 870834
18219 870834 727001 721031 835092 937285 1049553 1051521 1013587 1070560 1159821 1306611 1147913
18208 1147913 1034571 913844 924821 1055073 1056763 1066379 1086183 1058053 1000473 930344 886779
18197 886779 840432 869134 870290 830996 601388 567484 631222 767830 1043102 1155837 1126176
18186 1126176 970176 880280 659694 552093 655870 840315 884822 872345 893833 1067516
18176 1067516 1049632 844867 706624 744174 745729 760469 672714 668237 726178 820742 810862
$$ packed form
18249C341603k33866m45166j95686M3084M7941r8970k43023j35676K7144J42296
18239B249681j05417j79011j86248j56765Q1240j5734j72241j79660j37019K42824
18229A441650L5971j11211j06310N5066j46461r9109j53684n6307m2035N3264
18219H70834j43833n970J14061J02193J12268J968l7934N6973Q9261J46790j58698
18208A147913j13342j20727J0977J30252J690R616J9804k8130n7580p0129m3565
18197H86779m6347K8702J156l9294k29608l3904O3738J36608K75272J12735k9661
18186A126176j56000q9896k20586j07601J03777J84445M4507j2477K1488J73683
18176A067516j7884k04765j38243L7550J555J4740q7755m477N7941R4564r880
$$ plain form
18165 810862 985077 1187796 1032841 914067 1102930 1037652 722941 566123 641317 726867
18155 726867 944516 1040805 986856 795293 868409 1105575 1437312 1461820 1484499 1543632 1534824
18144 1534824 1459442 1541619 1749453 1942773 2168363 2244585 2278768 2302170 2349350 2472591
18134 2472591 2646778 2872289 2927057 3202360 3537063 3981671 4352610 4764756 5310642 6073336
18124 6073336 6949704 7715589 8898801 10298573 11672332 13389710 15921701 19706217
18116 19706217 25277694 33295894 44355848 60315220 83968578 122055564 185643682
18109 185643682 278972505 361631235 349689261 256495619 163224482 100212067 64650799
18102 64650799 45054490 33515598 26386938 21513615 17838741 14857619 12478855 10753118
$$ packed form
18165H10862J74215K02719j54955j18774J88863o5278l14711j56818P5194Q5550
18155G26867K17649R6289n3949j91563P3116K37166L31737K4508K2679N9133q808
18144A534824p5382Q2177K07834J93320K25590P6222L4183K3402M7180J23241
18134B472591J74187K25511N4768K75303L34703M44608L70939M12146N45886P62694
18124F073336Q76368P65885J183212J399772J373759J717378K531991L784516
18116A9706217N571477Q018200J1059954J5959372K3653358L8086986O3588118
18109A85643682R3328823Q2658730j1941974r3193642r3271137o3012415l5561268
18102F4650799j9596309j1538892p128660m873323l674874k981122k378764j725737
$$ plain form
18094 10753118 9421552 8288264 7246901 6416295 5587027 5055660 4632024 4213520 3789235
18085 3789235 3455804 3299389 3157894 2868417 2669246 2411818 2082482 1865702 1663794
18076 1663794 1467907 1499162 1495208 1529767 1526591 1442980 1352874 1312587 1246954 1123049 1017729
18065 1017729 845400 905497 891331 1010855 1125510 1075904 939586 944828 1083058 1322412
18055 1322412 1268720 1180853 1245026 1560034 1871871 2183322 2469965 2564064 2570805 2625667 2761225
18044 2761225 2721703 2310754 1967826 2018558 2226307 2471260 2521107 2472089 2402943 2258157
18034 2258157 2090287 1990071 1690024 1315404 1009692 826859 660157 626530 581884 455457
18024 455457 293932 106830 193285 383848 275720 343837 462554 388929 375556 260872
$$ packed form
18094A0753118j331566j133288j041363q30606q29268n31367m23636m18504m24285
18085C789235l33431j56415j41495k89477j99171k57428l29336k16780k01908
18076A663794j95887L1255l954L4559l176q3611r0106m0287o5633j23905j05320
18065A017729j72329O0097j4166J19524J14655m9606j36318N242J38230K39354
18055A322412n3692q7867O4173L15008L11837L11451K86643R4099O741N4862J35558
18044B761225l9522m10949l42928N0732K07749K44953M9847m9018o9146j44786
18034B258157j67870j00216l00047l74620l05712j82833j66702l3627m4646j26427
18024D55457j61525j87102Q6455J90563j08128O8117J18717p3625j3373j14684
$$ plain form
18014 260872 309245 241784 164307 80989 146371 278258 273924 286693 412579 544311 557774
18003 557774 548637 695706 653759 502480 523561 749076 1026353 1274075 1689278 2341796
17993 2341796 2930673 3159778 2948784 2442445 1881815 1453288 1070786 830567 774990 576705
17983 576705 349703 359487 334147 298179 377464 370038 434971 517617 724093 863745 958289
17972 958289 1028231 1136835 1181755 870815 521919 498396 649562 783808 936997 1136591
17962 1136591 1518677 2149311 2776716 2879660 2617803 2090170 1561698 852289 543699
17953 543699 423641 341321 171981 108414 120004 319041 328106 210198 268979 308318 221584
17942 221584 234919 423328 729073 876847 903292 725373 368257 279825 251074 92846
$$ packed form
18014B60872M8373o7461p7477q3318O5382J31887m334J2769J25886J31732J3463
18003E57774r137J47069m1947j51279K1081K25515K77277K47722M15203O52518
17993B341796N88877K29105k10994n06339n60630m28527l82502k40219n5577j98285
17983E76705k27002R784k5340l5968P9285p426O4933Q2646K06476J39652R4544
17972I58289O9942J08604M4920l10940l48896k3523J51166J34246J53189J99594
17962A136591L82086O30634O27405J02944k61857n27633n28472p09409l08590
17953E43699j20058q2320j69340o3567J1590J99037R065j17908N8781L9339q6734
17942B21584J3335J88409L05745J47774K6445j77919l57116q8432k8751j58228
$$ plain form
17932 92846 -54659 -221840 -254590 -234813 -102214 -49665 25948 62690 -127238 -66011 100547
17921 100547 -52799 -159550 2318 76576 68681 193420 168923 163319 140759 166911 183662
17910 183662 171935 -12582 -37028 -21335 -124653 -86037 74660 201270 104908 -12749
17900 -12749 -61388 24147 19358 -67287 -108015 -171248 -196344 -432648 -383290 -52885 4856
17889 4856 121136 241733 188704 -71264 -163924 -40046 -127683 -124444 78464 -8238 143748
17878 143748 13594 -114882 -7638 28539 -37402 42978 118089 83258 132748 20487 35576
17867 35576 -14163 -11537 39060 83584 132687 82033 23188 121879 159260 207796 414454 421841
17855 421841 422992 84622 -306148 -312792 -234758 -183846 -81558 -69594 -279313 -337651 -408519
$$ packed form
17932I2846j47505j67181l2750J9777J32599N2549P5613L6742j89928O1227J66558
17921A00547j53346j06751J61868P4258p895J24739k4497n604k2560K6152J6751
17910A83662j1727j84517k4446J5693j03318L8616J60697J26610r6362j17657
17900a2749m8639Q5535m789q6645m0728o3233k5096k36304M9358L30405N7741
17889D856J16280J20597n3029k59968r2660J23878q7637L239K02908q6702J51986
17878A43748j30154j28476J07244L6177o5941Q0380P5111l4831M9490j12261J5089
17867C5576m9739K626N0597M4524M9103n0654n8845R8691L7381M8536K06658P387
17855D21841J151l38370l90770o644P8034N0912J02288J1964k09719n8338p0868
$$ plain form
17844 -408519 -335242 -171190 -92480 -62119 -100939 -51365 -53548 4413 -19707 23463 74575
17833 74575 -24363 -229598 -318359 -154749 -10631 -107020 -189536 -42487 99472 125773 120135
17822 120135 -70689 -150339 -220151 -238497 -42986 112001 -52672 -171354 -113034 -38893
17812 -38893 -15348 -108856 -59492 -27857 -93245 -43535 17642 -78035 -31451 -19345 80505 107446
17800 107446 151227 215479 185065 99567 48283 -64905 -166267 -252566 -223557 -92482 -205389
17789 -205389 -158442 -151808 -76441 22007 12586 168753 148289 129105 53878 36405 76162 233065
17777 233065 211215 173692 170890 134421 169648 197571 86552 -14395 18459 92827 192046
17766 192046 46595 -23889 5560 96523 33503 45243 -38171 -26088 -11808 69479 61840
$$ packed form
17844d08519P3277J64052P8710L0361l8820M9574k183N7961k4120M3170N1112
17833G4575r8938k05235q8761J63610J44118r6389q2516J47049J41959K6301n638
17822A20135j90824p9650o9812j8346J95511J54987j64673j18682N8320P4141
17812c8893K3545r3508M9364L1635o5388M9710O1177r5677M6584J2106R9850K6941
17800A07446M3781O4252l0414q5498n1284j13188j01362q6299K9009J31075j12907
17789b05389M6947O634P5367R8448r421J56167k0464j9184p5227j7473L9757J56903
17777B33065k1850l7523k802l6469L5227K7923j11019j00947L2854P4368R9219
17766A92046j45451p0484K9449R0963o3020J1740q3414J2083J4280Q1287p639
$$ plain form
17755 61840 100782 72212 156522 259988 326393 260945 362889 682032 970456 1122457 1347855
17744 1347855 1693111 1597268 1594623 1459077 1547599 1487770 1396317 1144370 763204 589302
17734 589302 503303 403739 352296 333693 338836 421780 467911 493856 598237 672400 908686
17723 908686 1367584 1770685 1961446 1792210 1698243 1875635 1956144 1819983 1385711 878110
17713 878110 656141 470626 390011 334234 153520 -2731 193855 357856 468473 340504
17703 340504 100661 -33867 -178874 -75558 145029 339280 316613 79638 -72068 -72529
17693 -72529 -23570 59903 72384 208800 219440 36537 18256 87190 354550 317131 151142
17682 151142 113329 252463 180288 11479 47436 63884 54682 -77088 -191196 -158510 -213997
$$ packed form
17755F1840L8942k8570Q4310J03466O6405o5448J01944L19143K88424J52001K25398
17744A347855L45256r5843k645j35546Q8522n9829r1453k51947l81166j73902
17734E89302q5999r9564n1443j8603N143Q2944M6131K5945J04381P4163K36286
17723I08686M58898M03101J90761j69236r3967J77392Q0509j36161m34272n07601
17713H78110k21969j85515q0615n5777j80714j56251J96586J64001J10617j27969
17703C40504k39843j34528j45007J03316K20587J94251k2667k36975j51706m61
17693g2529M8959Q3473J2481J36416J0640j82903j8281O8934K67360l7419j65989
17682A51142l7813J39134p2175j68809L5957J6448r202j31770j14108L2686n5487
$$ plain form
17671 -213997 -158409 -111522 -139176 -163718 -233594 -62940 -7742 -167289 -158994 -83661 4188
17660 4188 -90522 -66746 152153 334468 360329 340124 321854 265451 340186 520777 926399
17649 926399 1333430 1636444 1774268 1524416 1175672 849975 737795 712245 788988 767352
17639 767352 916439 1322662 1686748 1725766 1263094 854905 752708 750083 574306 594205
17629 594205 629375 807839 1187844 1566765 1862497 1855520 1388689 809375 710371 746076
17619 746076 806450 855335 1002809 1296486 1549240 1630070 1529844 1147790 801219 609384
17609 609384 390138 152247 -22309 -20753 69856 143425 123435 49530 148198 251786 225574
17598 225574 58691 -62212 -42006 -203796 -202921 -221250 -157286 -2415 77394 74918 -20829
$$ packed form
17671b13997N5588M6887k7654k4542o9876J70654N5198j59547Q295P5333Q7849
17660D188r4710K3776K18899J82315K5861k0205j8270n6403P4735J80591M05622
17649I26399M07031L03014J37824k49852l48744l25697j12180k5550P6743k1636
17639G67352J49087M06223L64086L9018m62672m08189j02197k625j75777J9899
17629E94205L5170J78464L80005L78921K95732o977m66831n79314r9004L5705
17619G46076O0374M8885J47474K93677K52754Q0830j00226l82054l46571j91835
17609F09384k19246k37891j74556J556R0609P3569j9990p3905R8668J03588k6212
17598B25574j66883j20903K0206j61790Q75j8329O3964J54871P9809k476r5747
$$ plain form
17587 -20829 -146798 -94098 58887 -20678 -137852 -133840 -145402 -39140 -172307 -167802 -68387
17576 -68387 60951 130770 4481 -164249 -147165 -119040 -103403 -2395 -103673 -271755
17566 -271755 -269290 -111916 -36145 12111 -32519 25489 -9522 -210862 -172691 -119158 -254540
17555 -254540 -87834 108031 110771 223282 188853 273564 306195 277000 362334 403476 389200
17544 389200 370404 149299 25881 9928 53026 231896 109842 -7897 61038 217491
17534 217491 135686 97064 209845 228714 332754 245890 319644 287421 171057 109596 54236
17523 54236 68235 132524 127730 99003 137907 47320 -69782 119862 198843 231475 164768
17512 164768 86800 52148 -52736 -66409 -68193 -28992 -56873 -107260 -104964 -83809 29622
$$ packed form
17587b0829j25969N2700J52985p9565j17174M012j1562J06262j33167M505R9415
17576f8387J29338O9819j26289j68730J7084K8125J5637J01008j01278j68082
17566b71755K465J57374P5771M8256m4630N8008l5011k01340L8171N3533j35382
17555b54540J66706J95865K740J12511l4429Q4711L2631k9195Q5334M1142j4276
17544C89200j8796k21105j23418j5953M3098J78870j22054j17739O8935J56453
17534B17491q1805l8622J12781J8869J04040q6864P3754l2223j16364o1461n5360
17523E4236J3999O4289m794k8727L8904r0587j17102J89644P8981L2632o6707
17512A64768p7968l4652j04884j3673j784L9201k7881n0387K296K1155J13431
$$ plain form
17501 29622 -39343 -154975 -95604 -51316 -4774 -92734 -22180 60858 -57099 -201599 -213398
17490 -213398 -137539 -93766 -91721 -64865 -28108 -155537 -121184 23914 -62175 -104216 -40376
17479 -40376 146448 161335 45212 -144578 -38110 22619 44588 -59976 -161367 -237462
17469 -237462 -159628 87619 373217 292470 246219 231348 77297 -135499 -191553 -222391 -224309
17458 -224309 -215591 -418830 -419756 -220590 -58395 -122367 -90443 60851 145593 153368 325792
17447 325792 362886 442365 598036 779159 1185990 1737179 1862456 1383600 621746 206869
17437 206869 178925 120823 -14809 -63554 -238169 -190793 192 -48317 -46354 138531 57993
17426 57993 188234 235671 89510 -55938 -116795 -167678 -200128 -252638 -342292 -281551 -81955
$$ packed form
17501B9622o8965j15632N9371M4288M6542q7960P0554Q3038j17957j44500j1799
17490b13398P5859M3773K045K6856L6757j27429L4353J45098q6089m2041O3840
17479d0376J86824J4887j16123j89790J06468O0729K1969j04564j01391p6095
17469b37462P7834K47247K85598q0747m6251j4871j54051k12796n6054l0838j918
17458b24309Q718k03239r26J99166J62195o3972L1924J51294Q4742P775J72424
17447C25792L7094P9479J55671J81123M06831N51189J25277m78856p61854m14877
17437B06869k7944n8102j35632m8745j74615M7376J90985m8509J963J84885q0538
17426E7993J30241M7437j46161j45448o0857n0883l2450n2510q9654O0741J99596
$$ plain form
17415 -81955 21713 -66176 -113914 -6281 129093 219991 124244 130545 102642 -56130 -143368
17404 -143368 -185128 -134293 -214894 -283396 -365902 -202831 -72174 -90712 -283553 -294640 -206224
17393 -206224 -28644 -26058 -268902 -143009 -107508 -148677 -55765 -8501 -140557 -106296 -11829
17382 -11829 78044 23327 43618 164024 160664 24442 57162 195533 435174 490880 292197
17371 292197 201898 66486 -112556 -33666 139225 220371 45336 3286 -43497 95189
17361 95189 236767 208170 275480 254591 44667 -50502 -121200 -13940 168452 209104 180446
17350 180446 32027 -71693 -145437 -141350 -44009 -32707 -39536 59249 202559 390548 380784
17339 380784 425559 291242 253651 202604 231365 298377 145536 -12350 117281 173692 214293
$$ packed form
17415h1955J03668q7889m7738J07633J35374R0898r5747O301k7903j58772q7238
17404a43368m1760N0835q0601o8502q2506J63071J30657j8538j92841j1087Q8416
17393b06224J77580K586k42844J25893L5501m1169R2912M7264j32056L4261R4467
17382a1829Q9873n4717K0291J20406l360j36222L2720J38371K39641N5706j98683
17371B92197r0299j35412j79042P8890J72891Q1146j75035m2050m6783J38686
17361I5189J41578k8597O7310k0889k09924r5169p0698J07260J82392M0652k8658
17350A80446j48419j03720p3744M087R7341J1302o829R8785J43310J87989r764
17339C80784M4775j34317l7591n1047K8761O7012j52841j57886J29631N6411M0601
$$ plain form
17328 214293 205465 140079 77187 27894 -34902 215605 297040 217045 323831 428328 262393
17317 262393 168536 338962 347972 79132 22184 42608 102912 176109 138600 75866 291621
17306 291621 445604 590701 573301 409320 324972 174744 -163 -34831 -119454 -19673
17296 -19673 266401 267565 81078 -43007 -20009 -26747 145857 153981 147276 -21564 -123629
17285 -123629 -16134 -7177 174153 290835 323865 266757 167040 258671 213304 165528 121672
17274 121672 246228 158428 84438 113848 90075 2270 32115 -81622 -72199 164860 207307
17263 207307 163243 174423 200760 226224 270811 183812 256407 373109 312305 291011 349159
17252 349159 300958 291015 216241 322302 306071 228399 133328 251480 275159 236198 151138
$$ packed form
17328B14293q828o5386o2892m9293o2796K50507Q1435p9995J06786J04497j65935
17317B62393r3857J70426R010k68840n6948K0424O0304P3197l7509o2734K15755
17306B91621J53983J45097j7400j63981q4348j50228j74907l4668q4623R9781
17296a9673K86074J164j86487j24085K2998o738J72604Q124o705j68840j02065
17285a23629J07495Q957J81330J16682L3030n7108r9717R1631m5367m7776m3856
17274A21672J24556q7800p3990K9410k3773q7805K9845j13737R423K37059M2447
17263B07307m4064J1180K6337K5464M4587q6999P2595J16702o0804k1294N8148
17252C49159m8201r943p4774J06061j6231p7672r5071J18152K3679l8961q5060
$$ plain form
17241 151138 -5141 -221182 -132567 64585 72940 56083 214331 435492 319629 270043
17231 270043 377053 450477 536021 508204 427743 446491 394075 411226 327304 274123 401171
17220 401171 427490 623342 645448 462010 481596 518466 514884 553489 496057 387972 444362
17209 444362 335778 401187 550354 643293 458710 336329 309675 284298 272668 422937
17199 422937 399167 425482 441020 616733 661761 673933 557500 527022 492693 586966 455144
17188 455144 284078 313879 355288 364121 338923 562788 578129 505885 604836 776987 714026
17177 714026 506714 406843 448693 384773 605421 744479 647203 661263 730527 730192 921206
17166 921206 843491 800212 787465 745783 744210 871709 1020149 1074587 1173002 1114842 975607
$$ packed form
17241A51138j56279k16041Q8615J97152Q355j6857J58248K21161j15863m9586
17231B70043J07010P3424Q5544k7817q0461J8748n2416J7151q3922n3181J27048
17220D01171K6319J95852K2106j83438J9586L6870l582L8605n7432j08085N6390
17209D44362j08584O5409J49167R2939j84583j22381k6654k5377j1630J50269
17199D22937k3770K6315J5538J75713M5028J2172j16433l0478l4329R4273j31822
17188D55144j71066K9801M1409Q833k5198K23865J5341p2244R8951J72151o2961
17177G14026k07312r9871M1850o3920K20648J39058r7276J4060O9264l35J91014
17166I21206p7715m3279j2747m1682j573J27499J48440N4438R8415n8160j39235
$$ plain form
17155 975607 1140903 1165436 1101040 1091840 1088076 1097364 1060060 1077010 1110092 1044037 1028477 956441
17143 956441 1008299 1053010 1001448 1024733 1001223 1075455 1146323 1285386 1554789 1482124 1722594
17132 1722594 2033704 2135107 2248761 2461272 2491781 2551203 2692791 2954439 3502889 3779764
17122 3779764 4107928 4539725 4871870 4966386 4916151 4932012 5037908 5332954 5891084 6818963
17112 6818963 7929269 8838377 9221222 9384651 9569014 9921971 10314383 11211995 12425828
17103 12425828 14096617 16238230 18869089 21523335 24166936 27763129 33088210 40687198
17095 40687198 51907810 68055850 92453108 131580318 193664190 273903136 328553494
17088 328553494 303967813 231094718 165286267 125217345 108147461 107197077 120150864
$$ packed form
17155I75607J65296K4533o4396r200l764R288l7304J6950L3082o6055j5560p2036
17143I56441N1858M4711n1562K3285k3510P4232P0868J39063K69403p2665K40470
17132A722594L11110J01403J13654K12511L0509N9422J41588K61648N48450K76875
17122C779764L28164M31797L32145R4516n0235J5861J05896K95046N58130R27879
17112F818963J110306R09108L82845J63429J84363L52957L92412Q97612J213833
17103A2425828J670789K141613K630859K654246K643601L596193N325081P598988
17095D0687198J1220612J6148040K4397258L9127210O2083872Q0238946N4650358
17088C28553494k4585681p2873095o5808451m0068922j7069884r50384J2953787
$$ plain form
17081 120150864 149859513 202540405 275689527 331906642 314782819 242803844 173432964
17074 173432964 128687597 107457521 102759611 110999775 133826856 176944154 243688427
17067 243688427 311641893 323469034 265241492 192737552 140031884 112190094 103033937
17060 103033937 107574138 126246182 164149158 225352696 292875290 312137237 256771250
17053 256771250 179007001 117244682 78199868 55514888 42166416 33951179 28580948
17046 28580948 25121638 22628074 20638169 18776072 17048401 15319733 13483746 11561911
17038 11561911 10154143 9170473 8719636 8657615 8840649 8787733 8388221 7909537 7281057
17029 7281057 6539662 5558189 4772214 4252444 4143696 4205986 4347185 4177496 4018652 4252007
$$ packed form
17081A20150864K9708649N2680892P3149122N6217115j7123823p1978975o9370880
17074A73432964m4745367k1230076m697910Q240164K2827081M3117298O6744273
17067B43688427O7953466J1827141n8227542p2503940n2705668k7841790r156157
17060A03033937M540201J8672044L7902976O1203538O7522594J9261947n5365987
17053B56771250p7764249o1762319l9044814k2684980j3348472q215237n370231
17046B8580948l459310k493564j989905j862097j727671j728668j835987j921835
17038A1561911j407768r83670m50837o2021J83034n2916l99512m78684o28480
17029G281057p41395r81473p85975n19770j08748O2290J41199j69689j58844K33355
$$ plain form
17019 4252007 4226020 3950609 3509459 3064734 2557059 2198900 2046731 2042669 1998962 1909853
17009 1909853 1935457 1978286 1741772 1600082 1498819 1534586 1427538 1283272 1223716 1092267
16999 1092267 899370 920934 1010338 1022904 857767 786036 807144 622089 543261 733551
16989 733551 956725 1045851 876727 766897 921619 977069 1056580 1105438 941529 842258
16979 842258 848683 831787 790515 854360 797797 737682 723186 472971 420674 640994 896138
16968 896138 872256 832804 1029813 844623 611979 508941 254576 271465 406628 397523
16958 397523 488685 290136 289245 427493 545324 689193 582807 387109 176755 73001
16948 73001 217766 385302 343133 310407 467357 591579 520762 427820 449636 319250 335866
$$ packed form
17019D252007k5987k75411m41150m44725n07675l58159j52169m062m3707q9109
17009A909853K5604M2829k36514j41690j01263L5767j07048j44266n9556j31449
16999A092267j92897K1564Q9404J2566j65137p1731K1108j85055p8828J90290
16989G33551K23174Q9126j69124j09830J54722N5450P9511M8858j63909r9271
16979H42258O425j6896m1272O3845n6563o0115j4496k50215n2297K20320K55144
16968H96138k3882l9452J97009j85190k32644j03038k54365J6889J35163r105
16958C97523R1162j98549q91J38248J17831J43869j06386j95698k10354j03754
16948G3001J44765J67536m2169l2726J56950J24222p0817r2942K1816j30386J6616
$$ plain form
16937 335866 319836 141986 237069 393254 423699 370679 396588 412720 375771 366916 463187
16926 463187 398266 481389 408311 334512 394267 443959 290447 361398 407096 288328 209150
16915 209150 200210 102375 15261 156053 242179 373773 274502 52158 -69630 37680 143846
16904 143846 42390 262786 414195 259809 179838 211489 334078 329163 270470 372673
16894 372673 336122 265891 422920 429916 224329 195805 250295 312484 200314 207459 380943
16883 380943 323659 271434 115415 131434 314833 343743 199514 157555 42810 -55362 -98096
16872 -98096 -44861 49498 372 -67693 76367 95076 87648 177038 68425 -5256 9643
16861 9643 171678 5486 16926 107831 105978 80635 103974 -15829 18165 5745 717 -12419
$$ packed form
16937C35866j6030j77850R5083J56185L0445n3020K5909J6132l6949q855R6271
16926D63187o4921Q3123p3078p3799N9755M9692j53512P0951M5698j18768p9178
16915B09150q940r7835q7114J40792Q6126J31594r9271k22344j21788J07310J06166
16904A43846j01456K20396J51409j54386p9971L1651J22589m915n8693J02203
16894C72673l6551p0231J57029O996k05587k8524N4490O2189j12170P145J73484
16883C80943n7284n2225j56019J6019J83399K8910j44229m1959j14745r8172m2734
16872i8096N3235R4359m9126o8065J44060J8709p428Q9390j08613p3681J4899
16861I643J62035j66192J1440R0905j853k5343K3339j19803L3994j2420n028j3136
$$ plain form
16849 -12419 -19035 39975 121386 63513 -45862 20930 -30108 -21147 235096 87007 -42817
16838 -42817 106219 398849 260587 -54710 -152322 -279170 -254052 91440 283706 253505
16828 253505 162157 -3092 9389 -30346 -117246 -210689 -249637 -181587 -183321 -89101 -54812
16817 -54812 13115 45644 54909 38761 39763 67665 224355 390811 409754 207322 159503
16806 159503 56708 147776 154074 109565 118273 174629 184932 90144 5811 -90355 -286737
16795 -286737 -216880 -124644 -153690 -63155 100776 199176 89973 -22994 8054 146057 206430
16784 206430 272038 254158 269584 456541 371078 266815 193661 290060 314461 271709 185111
16773 185111 196055 194870 12128 -75859 -46824 -58891 209766 64825 -137320 -63501 -4383
$$ packed form
16849a2419o616N9010Q1411n7873j09375O6792n1038Q961K56243j48089j29824
16838d2817J49036K92630j38262l15297r7612j26848K5118L45492J92266l0201
16828B53505r1348j65249J2481l9735q6900r3443l8948O8050j734R4220L4289
16817e4812O7927L2529R265j6148J002K7902J56690J66456J8943k02432m7819
16806A59503j02795R1068O298m4509Q708N6356J0303r4788q4333r6166j96382
16795b86737O9857R2236k9046R0535J63931R8400j09203j12967L1048J38003O0373
16784B06430O5608j7880J5426J86957q5463j04263p3154R6399K4401m2752q6598
16773A85111J0944j185j82742q7987K9035j2067K68657j44941k02145P3819N9118
$$ plain form
16762 -4383 35704 -3225 93853 123606 111789 60761 -44479 30944 163437 199241 194905 28046
16750 28046 57498 101400 195410 141141 15825 -63183 -21361 145044 84712 -80569 -287621
16739 -287621 -230993 -74916 -111244 -177808 -114256 97766 128507 113751 -78346 -213183 -159277
16728 -159277 -59803 87730 245720 305683 143579 97440 7512 5400 90945 116382 131493
16717 131493 131686 -4096 -38754 115425 193603 224902 172170 64292 47790 113158 56052
16706 56052 43816 53143 -93965 -102420 -140451 -356814 -327082 -284662 58327 106506 30466
16695 30466 62313 -61359 -131761 -112792 -74731 -39405 -153152 -354191 -243218 -68900 38927
16684 38927 200850 171729 176415 90773 101372 174249 89576 -26583 -89595 -74547 -97178
$$ packed form
16762d383M0087l8929R7078K9753j1817n1028j05240P5423J32493L5804m336j66859
16750B8046K9452M3902R4010n4269j25316p9008M1822J66405o0332j65281k07052
16739b87621N6628J56077l6328o6564O3552K12022L0741j4756j92097j34837N3906
16728a59277R9474J47533J57990N9963j62104m6139q9928k112Q5545K5437J5111
16717A31493J93j35782l4658J54179P8178L1299n2732j07878j6502O5368n7106
16706E6052j2236R327j47108q455l8031k16363K9732M2420L42989M8179p6040
16695C0466L1847j23672p0402J8969L8061L5326j13747k01039J10973J74318J07827
16684C8927J61923k9121M686q5642J0599P2877q4673j16159o3012J5048k2631
$$ plain form
16673 -97178 -23557 -10898 -123173 -146471 -78944 28207 -83473 14144 140272 109779 203989
16662 203989 244246 204928 207772 197237 175005 166814 -15771 -75822 -182302 -149545 -93690
16651 -93690 -204047 -94481 -19542 -137664 -68540 20701 -75565 22745 7878 13969 102835
16640 102835 37002 30471 14122 -143373 -284042 -234583 -151260 -297999 -250926 -165268 -90556
16629 -90556 -56103 7874 40755 -48762 -104101 -1057 58281 99541 159300 24885 40727
16618 40727 20570 -122387 -216613 -141928 -97717 54033 250651 151358 10353 -2315 131328
16607 131328 -14428 -84593 -69697 207289 283932 196347 94128 72116 -34582 -158128
16597 -158128 -130057 -81258 -21081 -2653 -124025 -195568 3290 140925 53203 67652 37690
$$ packed form
16673i7178P3621J2659j12275k3298O7527J07151j11680R7617J26128l0493R4210
16662B03989M0257l9318K844j0535k2232q191j82585o0051j06480L2757N5855
16651i3690j10357J09566P4939j18122O9124Q9241r6266R8310j4867O091Q8866
16640A02835o5833o531j6349j57495j40669M9459Q3323j46739M7073Q5658P4712
16629i0556L4453O3977L2881q9517n5339J03044N9338M1260N9759j34415J5842
16618D0727k0157j42957r4226P4685M4211J51750J96618r9293j41005j2668J33643
16607A31328j45756p0165J4896K76986P6643q7585j02219k2012j06698j23546
16597a58128K8071M8799O0177J8428j21372p1543J98858J37635q7722J4449k9962
$$ plain form
16586 37690 19470 142156 92878 48906 92373 145008 140646 214936 371633 444144 450988 265033
16574 265033 58825 -23750 67150 51704 8734 -12877 68386 165034 -18894 -106073 -159582
16563 -159582 -39159 -48277 -176462 -143409 56492 156208 129582 16298 -19367 -68966 -120145
16552 -120145 -46506 -1318 27944 -153759 -164672 -179851 -16549 122427 -85241 -93728 -148983
16541 -148983 -325542 -252076 -104173 53342 68883 34075 48701 -1737 -8278 218117 372741
16530 372741 349594 459003 539510 595537 818010 1097683 1424324 1445033 1159381 810551
16520 810551 733809 703388 793676 828141 872068 1047040 1418056 1685113 1807526 1625677
16510 1625677 1304704 953239 655009 514055 503528 674582 788710 1070476 1332407 1382720
$$ packed form
16586C7690j8220J22686m9278m3972M3467N2635m362P4290J56697P2511O844j85955
16574B65033k06208q2575R0900j5446m2970k1611Q1263R6648j83928q7179n3509
16563a59582J20423r118j28185L3053J99901R9716k6626j13284l5665m9599n1179
16552a20145P3639M5188K9262j81703j0913j5179J63302J38976k07668q487n5255
16541a48983j76559P3466J47903J57515J5541l4808J4626n0438o541K26395J54624
16530C72741k3147J09409Q0507N6027K22473K79673L26641K0709k85652l48830
16520H10551p6742l0421R0288L4465M3927J74972L71016K67057J22413j81849
16510A625677l20973l51465k98230j40954j0527J71054J14128K81766K61931N0313
$$ plain form
16500 1382720 1199623 814964 578298 421272 285460 307304 327738 658264 1132155 1557386
16490 1557386 1767752 1638506 1251436 838152 628824 602304 429641 150601 130567 219594
16480 219594 156070 54517 -6861 -10022 -82319 -96403 -108366 -8400 -65012 -73356 -56054 -80574
16468 -80574 -82209 -94587 -96058 -191479 -58724 4054 -123387 -176590 -188290 -231602 -148996 -57305
16456 -57305 -36247 -83876 -184493 -115815 -284432 -269496 -8809 99021 182950 163413 139798
16445 139798 236147 159377 146252 244893 306339 326020 213757 147901 -43676 -160605 63818
16434 63818 219923 298663 183490 -166913 -398575 -276799 19341 201451 254537 356148
16424 356148 169244 59450 30611 126557 102520 -35629 -152950 -6350 18374 34965
$$ packed form
16500A382720j83097l84659k36666j57026j35812K1844K0434L30526M73891M25231
16490A557386K10366j29246l87070m13284k09328k6520j72663k79040k0034Q9027
16480B19594o3524j01553o1378l161p2297j4084j1963R9966n6612q344J7302k4520
16468h0574j635j2378j471r5421J32755O2778j27441n3203j1700m3312Q2606R1691
16456e7305K1058m7629j00617O8678j68617J4936K60687J07830Q3929j9537k3615
16445A39798R6349p6770j3125R8641O1446J9681j12263o5856j91577j16929K24423
16434F3818J56105P8740j15173l50403k31662J21776K96140J82110N3086J01611
16424C56148j86904j09794k8839R5946k4037j38149j17321J46600K4724J6591
$$ plain form
16414 34965 74660 -62247 -248069 -254834 -99078 -66152 -35600 -83004 -24760 -74218 -80144
16403 -80144 -10686 17874 60361 -42656 -182830 -377324 -463077 -279695 -123377 -67983 -32680
16392 -32680 222582 266262 254922 265856 178390 26861 207633 86163 20154 -6360 125639
16381 125639 254249 317104 213510 174998 237451 188375 182244 116009 -33881 -54183 -145206
16370 -145206 -79053 -53818 -28914 -7888 -13305 -5392 -42345 -18202 -5244 3378 57068 157956
16358 157956 130691 37131 74114 207414 219831 190338 121990 91978 -57252 45070 246855
16347 246855 209609 -6456 -167818 -69158 -2730 207092 261154 84535 -21443 -64172
16337 -64172 -104548 -205274 -213484 -30582 95198 -10650 -105760 -307718 -277391 -167530 -129643
$$ packed form
16414C4965L9695j36907j85822o765J55756L2926L0552m7404N8244m9458n926
16403h0144O9458K8560M2487j03017j40174j94494q5753J83382J56318N5394L5303
16392c2680K55262M3680j1340J0934q7466j51529J80772j21470o6009k6514J31999
16381A25639J28610O2855j03594l8512O2453m9076o131o6235j49890k0302r1023
16370a45206O6153K5235K4904K1026n417P913l6953K4143J2958Q622N3690J00888
16358A57956k7265r3560L6983J33300J2417k9493o8348l0012j49230J02322K01785
16347B46855l7246k16065j61362R8660O6428K09822N4062j76619j05978m2729
16337f4172m0376j00726q210J82902J25780j05848r5110k01958L0327J09861L7887
$$ plain form
16326 -129643 -310001 -324155 -158216 -8549 -75963 -128825 -165481 -68942 -139039 -173786 -164947
16315 -164947 -119656 -80644 57068 37684 37171 -7966 -128022 -116475 -136634 -80954 58250
16304 58250 47678 -45998 -69684 -144003 -60411 90602 184955 247205 119019 48484 -18527
16293 -18527 -80970 -177926 -78215 -35064 -107283 -61083 -103083 -230721 -150176 -193077 -221897
16282 -221897 -213304 -137493 -88639 -54873 -22686 3530 79485 21852 23812 7912 -28695 -133571
16270 -133571 -203845 -166828 -116941 -87436 -132580 40820 23278 -72506 -132361 -129883 -343617
16259 -343617 -386990 -263386 -142011 -248903 -220573 -140319 -180413 -212594 -182002 -188574 -90558
16248 -90558 -75812 -17433 -61379 29228 13640 -89887 25658 -10810 -95425 38970 120220
$$ packed form
16326a29643j80358j4154J65939J49667o7414n2862l6656R6539p0097l4747Q839
16315a64947M5291L9012J37712j9384n13m5137j20056J1547k0159N5680J39204
16304E8250j0572r3676k3686p4319Q3592J51013R4353O2250j28186p0535o7011
16293a8527o2443r6956R9711M3151p2219M6200m2000j27638Q0545m2901k8820
16282b21897Q593P5811M8854L3766L2187K6216P5955n7633J960j5900l6607j04876
16270a33571p0274L7017M9887K9505m5144J73400j7542r5784n9855K478k13734
16259c43617m3373J23604J21375j06892K8330Q0254m0094l2181L0592o572R8016
16248i0558J4746N8379m3946R0607j5588j03527J15545l6468q4615J34395Q1250
$$ plain form
16237 120220 -87547 -3182 -110191 -186634 -123763 -200460 -107617 -43315 -1909 1301 -84961
16226 -84961 -141388 -56897 -29243 -162865 -352110 -395326 -278974 -261066 -232053 -102877 -94624
16215 -94624 -220096 -220021 -43256 -86815 -144437 -66970 -41241 -169040 -143331 57855 276119
16204 276119 370064 111293 19708 115515 -2115 -37435 -16996 12322 -35950 -199430 -288151
16193 -288151 -155202 -17560 25764 -190097 -267665 -34747 266044 371098 278390 60109
16183 60109 -162422 -130943 -73563 -80822 -173646 -270232 -165354 -128853 -82626 3382 72352
16172 72352 74460 -76078 27728 10760 -213289 -224453 -234844 -223338 -127512 -75264 -56182
16161 -56182 63848 73240 -51960 -118505 -82720 -195527 -268752 -210027 -64816 66113 95115
$$ packed form
16237A20220k07767Q4365j07009p6443O2871p6697R2843O4302M1406L210q6262
16226h4961n6427Q4491K7654j33622j89245m3216J16352J7908K9013J29176Q253
16215i4624j25472P5J76765m3559n7622P7467K5729j27799K5709K01186K18264
16204B76119R3945k58771r1585R5807j17630l5320K0439K9318m8272j63480q8721
16193b88151J32949J37642M3324k15861p7568K32918L00791J05054r2708k18281
16183F0109k22531L1479N7380p259r2824r6586J04878L6501M6227Q6008O8970
16172G2352K108j50538J03806j6968k24049j1164j0391J1506R5826N2248J9082
16161e6182J20030R392j25200o6545L5785j12807p3225N8725J45211J30929K9002
$$ plain form
16150 95115 3020 -121296 -100528 -47718 -116799 -80859 109371 101128 133721 139812 194204 160998
16138 160998 190374 128773 -159917 -39601 -41582 -53886 3452 -23519 -13926 86264 183028
16127 183028 113296 238666 328620 346543 178063 321509 264591 23778 -119512 -21849
16117 -21849 -41864 -74245 14615 94020 119389 -21082 -54213 -149184 -281262 -302433 -177007
16106 -177007 -62644 -5208 -28351 -120332 -50177 -150568 -334868 -362701 -269648 -226433 -131554
16095 -131554 24131 -31357 -121447 -156787 -96396 -130047 -204273 -226 67136 -112629 -197663
16084 -197663 -314342 -224351 -134838 -131404 -233897 -78509 100553 203871 177137 68192
16074 68192 -22742 35944 89618 102460 162808 118119 111715 118873 88736 26549 -88992 -95346
$$ packed form
16150I5115r2095j24316K0768N2810o9081L5940J90230q243L2593O091N4392l3206
16138A60998K9376o1601k88690J20316j981j2304N7338k6971R593J00190R6764
16127A83028o9732J25370Q9954J7923j68480J43446n6918k40813j43290R7663
16117b1849k0015l2381Q8860P9405K5369j40471l3131r4971j32078k1171J25426
16106a77007J14363N7436k3143r1981P0155j00391j84300k7833R3053M3215R4879
16095a31554J55685n5488r0090l5340O0391l3651p4226K04047O7362j79765q5034
16084a97663j16679Q9991Q9513L434j02493J55388J79062J03318k6734j08945
16074F8192r0934N8686N3674J2842O0348m4689o404P158l0137o2187j15541o354
$$ plain form
16062 -95346 -264592 -246319 -167388 -92572 92688 201075 172163 69587 -92675 794 29936
16051 29936 65076 2404 -108130 -44507 -93826 -202160 -380774 -320782 -163290 -63718 -76196
16040 -76196 -4663 -70196 -55896 161343 304274 207716 84814 4343 -97675 -16212 -108614
16029 -108614 -269435 -95836 85445 143707 231123 248606 122144 -12446 -1293 98253
16019 98253 163180 72864 -42495 86594 59495 -89507 39278 32288 -43102 -77193 -111613
16008 -111613 -78985 16467 39721 46528 9482 44230 22211 -61842 -22161 -60581 -124536 -156723
15996 -156723 -217420 -161427 -73712 33164 66196 77841 106192 60262 -16884 84428 102796
15985 102796 -116479 -190344 -57149 12134 -1687 16173 -59978 -99101 -42865 -95377 39093
$$ packed form
16062i5346j69246J8273P8931P4816J85260J08387k8912j02576j62262R3469K9142
16051B9936L5140o2672j10534O3623m9319j08334j78614N9992J57492R9572j2478
16040g6196P1533o5533J4300K17239J42931r6558j22902q0471j02018Q1463r2402
16029a08614j60821J73599J81281N8262Q7416J7483j26462j34590J1153R9546
16019I8253O4927r0316j15359J29089k7099j49002J28785o990p5390l4091l4420
16008a11613L2628R5452K3254O807l7046L4748k2019q4053L9681l8420o3955l2187
15996a56723o0697N5993Q7715J06876L3032J1645K8351m5930p7146J01312J8368
15985A02796k19275p3865J33195O9283j3821J7860p6151l9123N6236n2512J34470
$$ plain form
15974 39093 202646 304867 256420 257765 262646 105554 24458 -91789 -196805 -103737 91742
15963 91742 342306 226925 50514 12849 -7960 -13847 40062 -78600 -48099 15606 -77999
15952 -77999 -167586 -201581 -53794 23076 121179 36092 -77854 -155065 -101130 23348 129660
15941 129660 -60638 27551 355466 440876 321134 178841 80398 122864 213048 144357 -10160
15930 -10160 6181 23895 8284 59753 145989 51272 -2391 70187 240727 121981 210028
15919 210028 164737 173506 317273 261271 3872 -99881 47212 127708 151700 94302 139591
15908 139591 214358 95651 14202 -105892 -210436 -251743 -233557 -219863 -169722 -54351 -51479
15897 -51479 -196660 -251019 -230512 -281621 -302324 -12863 129982 -76869 -137629 -121713 -180864
$$ packed form
15974C9093J63553J02221m8447J345M881j57092q1096j16247j05016R3068J95479
15963I1742K50564j15381j76411l7665k0809n887N3909j18662L0501O3705r3605
15952g7999q9587l3995J47787P6870R8103q5087j13946p7211N3935J24478J06312
15941A29660j90298Q8189L27915Q5410j19742j42293r8443M2466R0184o8691j54517
15930a0160J6341J7714j5611N1469Q6236r4717n3663P2578J70540j18746Q8047
15919B10028m5291Q769J43767n6002k57399j03753J47093Q0496K3992n7398M5289
15908A39591P4767j18707q1449j20094j04544m1307J8186J3694N0141J15371K872
15897e1479j45181n4359K0507n1109k0703K89461J42845k06851o0760J5916n9151
$$ plain form
15886 -180864 -252528 -232056 -178903 -121959 -5126 76526 109774 143800 88727 146471 167015
15875 167015 101737 -101321 -78669 -24515 99168 84482 -68345 -37718 -55423 -91511 -17120
15864 -17120 -75701 10740 41316 -121201 -256193 -218437 -132159 -126939 -217739 -98024 -18302
15853 -18302 -97654 -207345 -126949 -30617 20150 -109967 -251433 -229148 -226427 -251107 -360353
15842 -360353 -343854 -206757 -67608 -39415 66393 232302 75560 -221515 -213268 -298741
15832 -298741 -283553 -148509 -30694 -98058 -122311 34731 18295 -137377 -301465 -188786
15822 -188786 -77838 -104521 3077 -81332 -96117 -109521 -130039 -39332 -18441 -9966 -177989
15811 -177989 -275817 -156869 35426 198376 153069 280434 252814 206742 151544 -35522
$$ packed form
15886a80864p1664K0472N3153N6944J16833Q1652L3248L4026n5073N7744K0544
15875A67015o5278k03058K2652N4154J23683j4686j52827L0627j7705l6088P4391
15864a7120n8581Q6441L0576j62517j34992L7756Q6278N220r0800J19715P9722
15853a8302p9352j09691Q0396R6332N0767j30117j41466K2285K721k4680j09246
15842c60353J6499J37097J39149K8193J05808J65909j56742k97075Q247q5473
15832b98741J5188J35044J17815o7364k4253J57042j6436j55672j64088J12679
15822a88786J10948k6683J07598q4409j4785j3404k0518R0707K0891Q475j68023
15811a77989r7828J18948J92295J62950m5307J27365k7620m6072n5198j87066
$$ plain form
15801 -35522 -70742 -57403 -171381 -26698 -78881 -165930 -7569 91042 239791 233285 240323
15790 240323 120924 225503 286372 200337 166820 211750 56871 -136707 -144038 -151308 -56201
15779 -56201 -29553 36233 64713 264777 320481 224926 20485 -132254 33366 -27103 -103450
15768 -103450 -101712 14202 64072 305 -7458 -113729 38072 168529 132170 126828 -2266
15757 -2266 -28863 28590 -38685 -2363 73649 118038 195752 70420 103761 155967 62882 -82778
15745 -82778 -99791 -71603 -94079 -165907 -298849 -258590 -216229 -250144 -290506 -205950 -147418
15734 -147418 -306257 -139543 -126720 -242653 -53374 -101384 -153840 -65839 52563 4245
15724 4245 -17068 -189347 -205852 20706 97937 17716 -91027 147364 26544 -55112 -7022
$$ packed form
15801c5522l5220J3339j13978J44683n2183q7049J58361R8611J48749o506P038
15790B40323j19399J04579O0869q6035l3517M4930j54879j93578p331p270R5107
15779e6201K6648O5786K8480K00064N5704r5555k04441j52739J65620o0469p6347
15768a03450J738J15914M9870o3767p763j06271J51801J30457l6359n342j29094
15757b266k6597N7453o7275L6322P6012M4389P7714j25332L3341N2206r3085j45660
15745h2778j7013K8188k2476p1828j32942M0259M2361l3915m0362Q4556N8532
15734a47418j58839J66714J2823j15933J89279m8010n2456Q8001J18402m8318
15724D245k1313j72279j6505K26558P7231q0221j08743K38391j20820q1656M8090
$$ plain form
15713 -7022 -110267 -108619 -230657 -140578 -171096 -280029 -208784 -233552 -348568 -190030 -43717
15702 -43717 23528 16476 -41210 -20197 -130385 -310546 -305570 -158656 -119330 -164907 -169963 -125701
15690 -125701 21549 24740 -172776 -205997 -1241 134535 90923 -11689 12693 46622 28717
15679 28717 -6925 -59071 32566 63380 -3782 -60154 -117936 -73183 14077 61231 67174 55375
15667 55375 -36567 -101942 -134037 -116284 -88337 136241 123077 87799 42900 92891 179505
15656 179505 271176 192906 53231 -11965 7920 -206257 -217072 23331 -78435 -286482
15646 -286482 -331143 -172692 -124024 -1690 163299 179475 -15112 -91709 -16411 53999 -119031
15635 -119031 -177495 -55185 67673 96861 35992 50497 -6203 -15533 -103906 -115967 -52100
$$ packed form
15713g022j03245J648j22038R0079l0518j08933P1245k4768j15016J58538J46313
15702d3717O7245p052n7686K1013j10188j80161M976J46914L9326m5577n056M4262
15690a25701J47250L191j97516l3221K04756J35776m3612j02612K4382L3929j7905
15679B8717l5642n2146R1637L0814o7162n6372n7782M4753Q7260M7154N943j1799
15667E5375r1942o5375l2095J7753K7947K24578j3164l5278m4899M9991Q6614
15656A79505R1671p8270j39675o5196J9885k14177j0815K40403j01766k08047
15646b86482m4661J58451M8668J22334J64989J6176j94587p6597P5298P0410j73030
15635a19031n8464J22310J22858K9188o0869J4505n6700r330q8373j2061O3867
$$ plain form
15624 -52100 -20260 74046 -70694 -243461 -281808 -176701 -108681 481 155198 46521
15614 46521 29585 86234 61864 24430 76705 73871 40061 67811 51201 -112058 -25235 128086
15602 128086 59266 -150764 -114370 21656 23889 -7315 26339 -40505 10230 172249 171866
15591 171866 124176 154838 170007 43482 -14671 -93830 -69440 -64176 -58604 -34175 -21251 57213
15579 57213 43604 48452 1917 57996 195871 29876 53638 206804 287453 319808 217799
15568 217799 148762 99097 47616 -94081 20094 173843 331371 312021 184584 38985
15558 38985 -31482 -110727 -147896 -152869 -53769 -108617 -269543 -260260 -269102 -247989 -128804 -25911
15546 -25911 33183 122057 91305 69873 70246 -21443 -85915 -120641 37839 185298 183726 11278
$$ packed form
15624e2100L1840R4306j44740j72767l8347J05107O8020J09162J54717j08677
15614D6521j6936N6649k4370l7434N2275k834l3810K7750j6610j63259Q6823J53321
15602A28086o8820k10030L6394J36026K233l1204L3654o6844N0735J62019l83
15591A71866m7690L0662J5169j26525n8153p9159K4390N264N572K4429J2924P8464
15579E7213j3609M848m6535N6079J37875j65995K3762J53166Q0649L2355j02009
15568B17799o9037m9665n1481j41697J14175J53749J57528j9350j27437j45599
15558C8985p0467p9245l7169m973R9100n4848j60926R283q842K1113J19185J02893
15546b5911N9094Q8874l0752k1432L73r1689o4472l4726J58480J47459j572j72448
$$ plain form
15534 11278 23202 -109684 -120609 -89600 -91146 -173659 -108795 149649 81551 -228214 -204975
15523 -204975 -83891 29938 -9247 -93343 -164988 -234272 -52837 81043 -54039 -181916
15513 -181916 -116528 -191886 -159949 -207331 -123338 -5558 78891 264227 269654 149782 60133
15502 60133 11012 -37334 -72701 -136706 -275811 -233395 -167421 -146458 -185350 -41511 -19677
15491 -19677 -78196 26238 -863 -92179 -135224 -120757 73679 212474 235441 162326 182127
15480 182127 103317 125300 54060 -60197 27809 102432 140770 199591 81083 2426 -94970
15469 -94970 -89186 71273 155884 122097 7132 82853 172573 115266 22531 -31103 110068
15458 110068 184852 170150 204088 164967 34068 23071 85385 131390 158890 113593 85457
$$ packed form
15534A1278J1924j32886j0925L1009j546q2513O4864K58444o8098l09765K3239
15523b04975J21084J13829l9185q4096p1645o9284J81435J33880j35082j27877
15513a81916O5388p5358L1937m7382Q3993J17780Q4449J85336N427j19872q9649
15502F0133m9121m8346l5367o4005j39105M2416O5974K0963l8892J43839K1834
15491a9677n8519J04434k7101r1316m3045J4467J94436J38795K2967p3115J9801
15480A82127p8810K1983p1240j14257Q8006P4623L8338N8821j18508p8657r7396
15469i4970N784J60459Q4611l3787j14965P5721Q9720n7307r2735n3634J41171
15458A10068P4784j4702L3938l9121j30899j0997O2314M6005K7500m5297k8136
$$ plain form
15447 85457 178495 124940 120699 98436 108597 84812 109446 268231 177163 76813 2357
15436 2357 -220777 -169018 -168017 -89410 -118035 -244955 -181824 -68063 1931 -77535 -119906
15425 -119906 -8016 -35630 -126376 -113383 25839 105580 149270 177591 147423 8789 -56070
15414 -56070 -38582 -138607 -234140 -284702 -252709 -186130 -60566 -16499 16911 213299 357148
15403 357148 326223 288326 184807 117918 206215 70446 -86697 -100510 -97745 -191963 -254504
15392 -254504 -145858 -18420 -6497 108065 18362 22000 53795 66837 3286 -90000 -53275
15381 -53275 87935 138134 89055 74678 129333 126183 170260 56225 103370 191231 109188
15370 109188 -18210 -110646 -163946 -198595 -326421 -226978 -293353 -445342 -308309 -168846
$$ packed form
15447H5457R3038n3555m241k2263J0161k3785K4634J58785r1068j00350p4456
15436B357k23134N1759J001P8607k8625j26920O3131J13761O9994p9466m2371
15425a19906J11890k7614r0746J2993J39222P9741M3690K8321l0168j38634o4859
15414e6070J7488j00025r5533n0562L1993O6579J25564M4067L3410J96388J43849
15403C57148l0925l7897j03519o6889Q8297j35769j57143j3813K765r4218o2541
15392b54504J08646J27438J1923J14562q9703L638L1795J3042o3551r3286L6725
15381e3275J41210N0199m9079j4377N4655l150M4077j14035M7145Q7861q2043
15370A09188j27398r2436n3300l4649j27826R9443o6375j51989J37033J39463
$$ plain form
15360 -168846 -60870 45184 266555 159314 52160 -12744 -94625 -176597 -302194 -415139
15350 -415139 -363464 -273259 -105183 -178305 -212274 -173421 -177816 -102343 -183314 -169672 -254889
15339 -254889 -147898 -102447 -105654 -142920 -29667 84879 -4429 -138494 -58547 -33501 -129978
15328 -129978 -59222 33377 246734 322996 272391 25052 21869 190582 320347 230686 81282
15317 81282 -249588 -364505 -354046 -210273 -55998 140267 186830 134727 -12202 57108
15307 57108 -116425 -154450 -162126 -65912 11549 -80336 -160890 -102665 5099 111558 110381
15296 110381 34101 -72616 -110234 -81261 -78676 -160601 -225646 -164602 -177128 -137056 -190952
15285 -190952 -77261 -14150 -38413 -33018 137316 189999 178397 167139 75681 78553 95611
$$ packed form
15360a68846J07976J06054K21371j07241j07154o4904q1881q1972j25597j12945
15350d15139N1675R0205J68076p3122l3969L8853m395P5473q0971J3642q5217
15339b54889J06991M5451l207l7266J13253J14546q9308j34065P9947K5046r6477
15328a29978P0756R2599K13357P6262n0605k47339l183J68713J29765q9661j49404
15317H1282l30870j14917J0459J43773J54275J96265M6563n2103j46929O9310
15307E7108j73533l8025p676R6214P7461r1885q0554N8225J07764J06459j177
15296A10381p6280j06717l7618K8973K585q1925o5045O1044j2526M0072n3896
15285a90952J13691O3111k4263N395J70334N2683j1602j1258r1458K872J7058
$$ plain form
15274 95611 -7638 -6985 52554 -46928 -198368 -182312 -145140 -63380 41712 82864 113588
15263 113588 75682 27074 33303 170406 264953 202569 47343 -1935 -73865 -49639 -62731
15252 -62731 -150287 -71151 -243545 -366456 -258640 -127012 -128010 21141 43718 82100 121077
15241 121077 183419 149657 18953 -28511 -9766 -23028 -49523 24375 71874 41690 28233
15230 28233 -14166 113389 114248 157230 164609 120337 -26783 -149284 21794 106246 52949
15219 52949 -189 30957 -42361 -101886 -121503 -174011 -60720 89448 21744 -98043 -5613
15208 -5613 1312 50964 -38101 -87998 150351 247647 176272 230819 301880 167603 -8921
15197 -8921 51128 80396 54987 -17392 -2577 160632 169864 241622 206083 153165 116103 15521
$$ packed form
15274I5611j03249O53N9539r9482j51440J6056L7172Q1760J05092M1152L0724
15263A13588l7906m8608O229J37103R4547o2384j55226m9278p1930K4226j3092
15252f2731q7556P9136j72394j22911J07816J31628r98J49151K2577L8382L8977
15241A21077O2342l3762j30704m7464J8745j3262k6495P3898M7499l0184j3457
15230B8233m2399J27555Q59M2982P379m4272j47120j22501J71078Q4452n3297
15219E2949n3138L1146p3318n9525j9617n2508J13291J50168o7704j19787R2430
15208e613O925M9652q9065m9897K38349R7296p1375N4547P1061j34277j76524
15197h921O0049K9268k5409p2379J4815J63209R232P1758l5539n2918l7062j00582
$$ plain form
15185 15521 64581 143982 140440 60325 -91040 -163953 -100758 -36421 103202 170130 147131
15174 147131 32954 -36711 7136 -39613 -78203 80021 -5755 -71634 156587 155652 112722
15163 112722 227514 138829 105221 79226 25531 99812 218929 145295 184585 233782 168777
15152 168777 88750 123345 -14812 -151850 -84055 180579 257888 258819 77825 -58055 -122310
15141 -122310 -124083 -178812 -157644 -215119 -46414 5507 93459 77066 112101 121992 -70424
15130 -70424 -36573 -61530 -47523 -137154 -153719 -93088 114321 161141 93510 -70268 -78326
15119 -78326 -113181 -43596 -14587 53890 12895 -51945 -28590 80724 134711 92294 104201
15108 104201 412188 369577 212983 145461 284835 288069 121815 157051 43163 -126917
$$ packed form
15185A5521M9060P9401l542q0115j51365p2913O3195O4337J39623O6928k2999
15174A47131j14177o9665M3847m6749l8590J58224q5776o5879K28221r35m2930
15163A12722J14792q8685l3608k5995n3695P4281J19117p3634L9290M9197o5005
15152A68777q0027L4595j38157j37038O7795K64634P7309R31j80994j35880o4255
15141a22310j773n4729K1168n7475J68705N1921Q7952j6393L5035R891j92416
15130g0424L3851k4957J4007q9631j6565O0631K07409M6820o7631j63778q058
15119g8326l4855O9585K9009O8477m0995o4840K3355J09314N3987m2417J1907
15108A04201L07987m2611j56594o7522J39374L234j66254L5236j13888j70080
$$ plain form
15098 -126917 -188844 -352267 -364660 -323911 -211247 -4820 123030 65377 34618 39641 66535
15087 66535 107768 202545 23790 -202750 -203708 -172412 -78206 78166 112616 52051 -82419
15076 -82419 -82989 -67631 -118690 -10668 77971 108309 84391 -61812 -151023 -131172 -100213 -89464
15064 -89464 -46656 -99907 -222377 -237731 -187657 -253913 -244897 -210109 -156172 -52642 -53036 82929
15052 82929 241942 125524 49165 -37048 -202654 -202558 81975 321085 291224 108453 16052
15041 16052 -27373 -32458 106311 205773 292257 414147 274807 115452 -19421 -17206 59738
15030 59738 41824 -65777 -102973 -132616 -204505 -176463 -118524 -74693 -69714 -93822 18706
15019 18706 -34681 -22273 85480 151401 15826 26656 -155357 -139806 -38705 -46747 65681
$$ packed form
15098a26917o1927j63423j2393M0749J12664K06427J27850n7653l0759N023K6894
15087F6535M1233R4777j78755k26540r58L1296R4206J56372L4450o0565j34470
15076h2419n70J5358n1059J08022Q8639L0338k3918j46203q9211J9851L0959J0749
15064h9464M2808n3251j22470j5354N0074o6256R016L4788N3937J03530l94J35965
15052H2929J59013j16418p6359q6213j65606R6K84533K39110k9861j82771r2401
15041A6052m3425n085J38769R9462Q6484J21890j39340j59355j34873K215P6944
15030E9738j7914j07601l7196k9643p1889K8042N7939M3831M979k4108J12528
15019A8706n3387J2408J07753O5921j35575J0830j82013J5551J01101q042J12428
$$ plain form
15008 65681 94595 67093 84582 142352 294628 399483 528586 866589 1109911 1257290
14998 1257290 1559862 1719196 1340575 828523 393417 159477 181184 149848 218660 325327
14988 325327 192409 168935 226673 150581 -1161 -62770 -199427 -176126 -117946 -190510 -876
14977 -876 98890 3866 -25697 -160002 19830 -47530 122322 72468 16948 -43619 -27132
14966 -27132 -3026 102291 119329 32494 280709 416604 290679 304405 284559 220444 304698
14955 304698 266481 150645 -30703 -153682 -228892 -101006 163568 103646 -18378 60231
14945 60231 209023 133297 264606 217257 164603 93756 32331 62126 66191 164350 147622
14934 147622 109231 87877 68545 -92448 -303720 -389458 -345249 -291559 -147812 6513 2701
$$ packed form
15008F5681K8914k7502J7489N7770J52276J04855J29103L38003K43322J47379
14998A257290L02572J59334l78621n12052m35106k33940K1707l1336O8812J06667
14988C25327j32918k3474N7738p6092j51742o1609j36657K3301N8180p2564J89634
14977h76R9766r5024k9563j34305J79832o7360J69852m9854n5520o0567J6487
14966b7132K4106J05317J7038q6835K48215J35895j25925J3726j9846o4115Q4254
14955C04698l8217j15836j81348j22979p5210J27886K64574n9922j22024P8609
14945F0231J48792p5726J31309m7349n2654p0847o1425K9795M065R8159j6728
14934A47622l8391k1354j9332j60993k11272q5738M4209N3690J43747J54325l812
$$ plain form
14923 2701 -885 -23263 27922 -31052 -76251 -135936 -114180 -47017 81003 2928 77770 170246
14911 170246 71801 -90274 -104439 -148091 18608 206046 126810 144243 127596 96490 106857
14900 106857 157300 173937 32722 20267 257476 231006 194830 111565 -85668 -60843 -84267
14889 -84267 -16667 -28383 -59249 -57709 -75422 -253685 -122522 -45744 85103 254897 245918
14878 245918 193943 68834 -57731 -6919 -154738 -193328 -111185 -108624 -130703 -283942 -324153
14867 -324153 -312355 -252829 -182988 -126098 -176705 -31116 51087 122350 30097 -152809 -104221
14856 -104221 -117708 -187909 -30364 77788 16302 1877 46430 135681 260804 161566 112299
14845 112299 6960 -165570 -49194 -4772 -122871 -162160 -191394 -227184 -72836 77144
$$ packed form
14923B701l586k2378N1185n8974m5199n9685K1756O7163J28020p8075P4842R2476
14911A70246r8445j62075j4165m3652J66699J87438p9236J7433j6647l1106J0367
14900A06857N0443J6637j41215j2455K37209k6470l6176q3265j97233K4825k3424
14889h4267O7600j1716l0866J540j7713j78263J31163P6778J30847J69794q979
14878B45918n1975j25109j26565N0812j47819l8590Q2143K561k2079j53239m0211
14867c24153J1798N9526O9841N6890n0607J45589Q2203P1263r2253j82906M8588
14856a04221j3487p0201J57545J08152o1486j4425M4553Q9251J25123r9238m9267
14845A12299j05339j72530J16376M4422j18099l9289k9234l5790J54348J49980
$$ plain form
14835 77144 253054 134742 -32361 -67394 33953 39879 73933 99416 117370 104008 98090
14824 98090 102966 -18712 38143 103408 -100924 -221870 -132076 -148090 -114444 -20812 20263
14813 20263 -66944 -150903 -215183 -160335 -181530 -196301 -382398 -373413 -314233 -260192 -111838
14802 -111838 -106336 -67318 -22036 -95454 8128 220583 163343 199674 255058 350796 137752
14791 137752 -108137 -118180 -123875 -74797 -221696 -62581 24475 94696 197330 78039 -232363
14780 -232363 -136010 139183 153949 99621 42503 83520 168114 312225 225310 153602 59152
14769 59152 11207 102753 190856 205515 134028 -54709 -165891 22641 52444 145693 102774
14758 102774 46799 97467 139280 80985 156364 153988 320238 329055 84100 -125288 -327951
$$ packed form
14835G7144J75910j18312j67103l5033J01347N926L4054K5483J7954j3362n918
14824I8090M876j21678N6855O5265k04332j20946Q9794j6014L3646R3632M1075
14813B0263q7207q3959o4280N4848k1195j4771j86097Q985N9180N4041J48354
14802a11838N502L9018M5282p3418J03582K12455n7240L6331N5384R5738k13044
14791A37752k45889j0043n695M9078j46899J59115Q7056P0221J02634j19291l10402
14780b32363R6353K75193J4766n4328n7118M1017Q4594J44111q6915p1708r4450
14769E9152m7945R1546Q8103J4659p1487j88737j11182J88532K9803R3249m2919
14758A02774n5975N0668M1813n8295P5379k376J66250Q817k44955k09388k02663
$$ plain form
14747 -327951 -366065 -308661 -34920 86559 78735 -28524 -92564 -146583 -177532 72978 77915
14736 77915 -103458 -183116 -168629 -21984 -69896 -189732 -170187 -33224 79450 92515 197328
14725 197328 287165 50976 42689 104549 254879 304512 191529 133665 187448 286191 183501
14714 183501 168039 78661 49525 -96221 -77369 -76142 95453 132503 224617 257813 112924
14703 112924 20039 -31288 104026 175659 123179 114254 164605 208398 61599 9436 -36641
14692 -36641 8206 172829 170053 38369 215766 421657 361515 308126 268113 230275 82318
14681 82318 82595 160449 100374 47180 311750 250967 113064 20118 -51252 -62263 -74245 -39910
14669 -39910 96218 125374 56676 75732 137078 58851 -17267 15676 -49838 -73161 -55144
$$ packed form
14747c27951l8114N7404K73741J21479p824j07259o4040n4019l0949K50510M937
14736G7915j81373p9658J4487J46645m7912j19836J9545J36963J12674J3065J04813
14725A97328Q9837k36189q287O1860J50330M9633j12983n7864N3783R8743j02690
14714A83501j5462q9378k9136j45746J8852J227J71595L7050R2114L3196j44889
14703A12924r2885n1327J35314P1633n2480q925N0351M3793j46799n2163m6077
14692c6641M4847J64623k776j31684J77397K05891o0142n3389m0013l7838j47957
14681H2318K77P7854o0075n3194K64570o0783j37903r2946p1370j1011j1982L4335
14669c9910J36128K9156o8698J9056O1346p8227p6118L2943o5514k3323J8017
$$ plain form
14658 -55144 42304 59807 178313 227238 311336 340072 338026 308543 274847 214845 135811 10519
14646 10519 -49377 -174406 -336674 -225526 -209128 -123173 -21394 -25010 -3813 13338 -26942
14635 -26942 -17860 7807 -97613 -251348 -223894 -187188 33015 35577 53287 -18104 -161351
14624 -161351 -121371 -39092 90134 57351 125068 179683 44163 -201285 -230049 -213356 -120550
14613 -120550 -154022 -105067 -53152 94470 219265 126527 -80818 1545 -68391 -140776 -198576
14602 -198576 -88985 -147028 -262643 -81881 -31667 -43913 62005 5500 -150926 -126254
14592 -126254 -14178 -54526 -164529 -215126 -152734 -79332 -83584 -110519 -137114 69174 235370
14581 235370 87644 144310 249674 250301 93978 870 -24790 -30052 -160987 -180346 -101653
$$ packed form
14658e5144R7448J7503J18506M8925Q4098K8736k046k9483l3696o0002p9034j25292
14646A0519n9896j25029j62268J11148J6398Q5955J01779l616K1197J7151m0280
14635b6942R082K5667j05420j53735K7454L6706K20203K562J7710p1391j43247
14624a61351L9980Q2279J29226l2783O7717N4615j35520k45448k8764J6693R2806
14613a20550l3472M8955N1915J47622J24795r2738k07345Q2363o9936p2385n7800
14602a98576J09591n8043j15615J80762N0214j2246J05918n6505j56426K4672
14592a26254J12076m0348j10003n0597O2392P3402m252k6935k6595K06288J66196
14581B35370j47726N6666J05364O27j56323r3108k5660n262j30935j9359P8693
$$ plain form
14570 -101653 53099 189206 263339 137515 12975 80751 -27743 -35075 -105680 -167848 -221732
14559 -221732 14995 131444 143057 47693 98716 113254 154888 80549 80926 -70781 -232072
14548 -232072 -414552 -503788 -514943 -587041 -458147 -320653 -123547 -78056 9789 5459 -25058
14537 -25058 -178727 -139119 -29687 143493 136499 95234 70140 22780 39647 -36043 116097
14526 116097 125465 116700 118153 210646 312957 226721 195587 263373 124007 161903 209770 54297
14514 54297 -65241 -12401 246517 273712 377805 267479 39856 -28393 50328 -15289 18187
14503 18187 99114 70394 -313740 -381132 -316552 -173255 -35078 141990 252141 109202
14493 109202 53029 46196 9009 97957 191360 158759 -5582 -130160 -124433 -72301 -22333
$$ packed form
14570a01653J54752J36107P4133j25824j24540O7776j08494p332p0605o2168n3884
14559b21732K36727J16449J1613r5364N1023J4538M1634p4339L77j51707j61291
14548b32072j82480q9236j1155p2098J28894J37494J97106M5491Q7845m330l0517
14537b5058j53669L9608J09432J73180o994m1265k5094m7360J6867p5690J52140
14526A16097R368q765J453R2493J02311q6236l1134O7786j39366L7896M7867j55473
14514E4297j19538N2840K58918K7195J04093j10326k27623o8249P8721o5617L3476
14503A8187Q0927k8720l84134o7392O4580J43297J38177J77068J10151j42939
14493A09202n6173o833l7187Q8948R3403l2601j64341j24578N727N2132M9968
$$ plain form
14482 -22333 -72656 -21396 -9809 -54789 -35175 154510 77035 -49271 -147150 -111284 -91268
14471 -91268 -127396 -58927 -4819 82003 50751 121441 122343 21297 -24456 -15365 -71663 -234036
14459 -234036 -302212 -91897 58276 48665 41276 93310 102428 85355 -15145 -155404 -149623
14448 -149623 -94746 55353 -59955 -160532 -18586 -42585 38052 21042 178744 177554 106775
14437 106775 17469 63338 93291 18734 66236 185463 150409 135000 33522 -116188 -9166
14426 -9166 17004 44680 81322 -64385 -147006 -264539 -212492 -97929 -32124 -10950 -32579
14415 -32579 -101348 -148143 -267404 -127080 -53663 -50377 -90856 41471 -10994 -48313 90607
14404 90607 52494 26804 38838 -74893 -49180 27949 21793 82973 85405 75580 94998 135520
$$ packed form
14482b2333n0323N1260J1587m4980J9614J89685p7475j26306r7879L5866K0016
14471i1268l6128O8469N4108Q6822l1252P0690R02j01046m5753R091n6298j62373
14459b34036o8176K10315J50173r611p389N2034R118j7073j00500j40259N781
14448a49623N4877J50099j15308j00577J41946k3999Q0637j7010J57702j190p0779
14437A06775q9306M5869K9953p4557M7502J19227l5054j5409j01478j49710J07022
14426i166K6170K7676L6642j45707q2621j17533N2047J14563O5805K1174k1629
14415c2579o8769m6795j19261J40324P3417L286m0479J32327n2465l7319J38920
14404I0607l8113k5690J2034j13731K5713P7129o156O1180K432r825J9418M0522
$$ plain form
14392 135520 48217 -14002 -68503 -7577 81980 266756 145378 97264 51609 -53274 -65136
14381 -65136 -118378 -70555 -77847 -21899 86100 13982 -64399 -12021 13668 -154970 -167952
14370 -167952 -127412 -238791 -290096 -266756 -212335 -356956 -223057 -51234 -123235 24522
14360 24522 47012 74673 51674 5930 86500 172629 57737 -5605 150555 262632 91519
14349 91519 -24475 193778 260462 212622 184509 104944 60279 -45921 50464 85910 -718
14338 -718 41342 86713 224111 322002 236484 73964 60503 -19372 23457 180499 276264
14327 276264 221777 84588 19619 -40637 -120365 -81873 -21493 206793 306019 138476 -15040
14316 -15040 -86842 43145 269358 389577 319836 223538 104045 217691 382635 269713
$$ packed form
14392A35520q7303o2219n4501O0926Q9557J84776j21378m8114m5655j04883j1862
14381f5136n3242M7823p292N5948J07999p2118p8381N2378K5689j68638j2982
14370a67952M0540j11379n1305K3340N4421j44621J33899J71823p2001J47757
14360B4522K2490K7661k2999m5744Q0570Q6129j14892o3342J56160J12077j71113
14349I1519j15994K18253O6684m7840k8113p9565m4665j06200R6385L5446q6628
14338g18M2060M5371J37398R7891q5518j62520j3461p9875M2829J57042R5765
14327B76264n4487j37189o4969o0256p9728L8492O0380K28286R9226j67543j53516
14316a5040p1802J29987K26213J20219o9741r6298j19493J13646J64944j12922
$$ plain form
14306 269713 110040 101710 -11599 -86782 -75410 -60985 48266 51556 96858 135257 6118
14295 6118 -207724 -260118 -98926 -161556 -277598 -208027 -154537 -71437 41894 -7097 -26771
14284 -26771 -126279 -68846 -66445 56132 127973 127262 40115 110306 129145 -14448 -133948 -492994
14272 -492994 -645281 -707149 -493586 -140908 6784 70798 60858 -125430 -276972 -114183
14262 -114183 68391 218658 158583 12205 -12294 3404 14084 -8111 -36366 40060 66571
14251 66571 46295 16908 -54870 -15465 -87886 -241405 -347416 -180618 -15167 38846 -69559
14240 -69559 -85217 24184 37476 87595 23597 -1050 43344 209858 152464 -71397 -142368
14229 -142368 -18960 -98056 -38279 64102 -8493 -45373 -5903 -24848 -6219 152137 327075
$$ packed form
14306B69713j59673q330j13309p5183J1372J4425J09251L290M5302L8399j29139
14295F118k13842n2394J61192o2630j16042O9571N3490Q3100J13331m8991j9674
14284b6771r9508N7433K401J22577P1841p11q7147P0191J8839j43593j19500l59046
14272d92994j52287o1868K13563L52678J47692O4014r940j86288j51542J62789
14262a14183J82574J50267o0075j46378k4499J5698J0680k2195k8255P6426K6511
14251F6571k0276k9387p1778L9405p2421j53519j06011J66798J65451N4013j08405
14240f9559j5658J09401J3292N0119o3998k4647M4394J66514n7394k23861p0971
14229a42368J23408p9096N9777J02381p2595l6880L9470j8945J8629J58356J74938
$$ plain form
14218 327075 323154 337122 291939 218504 127941 4522 -88143 -60684 61911 201711 193155
14207 193155 137534 -28623 63016 53677 137988 98338 -45037 -85318 -54364 -206197 -136825
14196 -136825 115798 244486 301028 250494 148334 16179 14835 75587 138335 25292 -102040
14185 -102040 -45394 128697 182770 68856 -53448 236948 295200 42109 -157997 -166211
14175 -166211 -106618 -3893 -63182 -74211 99960 215359 158981 149218 264009 361097 289439
14164 289439 193276 86138 16852 231795 273188 239093 188853 -56036 -93373 -58365 -134465
14153 -134465 -18625 -29555 -207801 -266151 -93300 25667 51148 -8490 12624 -65722 -54894
14142 -54894 -150355 8583 122892 241849 259643 98806 -24700 -53369 32737 -53632 -180225
$$ packed form
14218C27075l921J3968m5183p3435r0563j23419r2665K7459J22595J39800q556
14207A93155n5621j66157R1639r339Q4311l9650j43375m0281L0954j51833O9372
14196a36825K52623J28688N6542n0534j02160j32155j344O0752O2748j13043j27332
14185a02040N6646J74091N4073j13914j22304K90396N8252k53091k00106q214
14175a66211N9593J02725n9289j1029J74171J15399n6378r763J14791R7088p1658
14164B89439r6163j07138o9286K14943M1393l4095n0240k44889l7337L5008p6100
14153a34465J15840j0930j78246n8350J72851J18967K5481n9638K1114p8346J0828
14142e4894r5461J58938J14309J18957J7794j60837j23506k8669Q6106q6369j26593
$$ plain form
14131 -180225 -182541 -169545 -310594 -267021 -119373 -66383 -72217 -210273 -190943 -99921 -166014
14120 -166014 -200391 120733 114818 -11234 -127706 -166422 -78875 -38260 14296 110982 259950
14109 259950 247056 129764 145695 147670 167620 153616 136064 169610 266560 343552 228076
14098 228076 40018 76760 84593 98379 135095 12629 -168255 -345749 -227224 -73448
14088 -73448 -31464 -8136 -25654 141044 220963 90458 100445 36588 -34695 -141729 -165466
14077 -165466 -2925 36635 32585 38506 65500 115229 62782 -31288 -92586 -56955 59934
14066 59934 80605 130749 154479 224396 97769 -100429 -245374 -101332 -66814 -144682 -182552
14055 -182552 -261713 -77888 -86350 -79600 -87299 -70901 39982 247991 208637 273211 275832 216916
$$ packed form
14131a80225k316J2996j41049M3573J47648N2990n834j38056J9330R1022o6093
14120a66014l4377L21124n915j26052j16472l8716Q7547M0615N2556R6686J48968
14109B59950j2894j17292J5931J975J9950j4004j7552L3546R6950P6992j15476
14098B28076j88058L6742P833J3786L6716j22466j80884j77494J18525J53776
14088g3448M1984K3328j7518J66698P9919j30505R987o3857p1283j07034k3737
14077a65466J62541L9560m050N921K6994M9729n2447r4070o1298L5631J16889
14066E9934K0671N0144K3730O9917j26627j98198j44945J44042L4518p7868l7870
14055a82552p9161J83825q462O750p699J6398J10883K08009l9354O4574K621n8916
$$ plain form
14043 216916 218463 232813 381266 278279 174240 73357 86634 122755 3960 -109920
14033 -109920 -20105 -69576 -75780 -100856 -190562 -134923 -177786 48497 81304 32660 169013
14022 169013 -1615 -57022 -10152 124791 240805 116070 -92438 -168480 -355661 -405593
14012 -405593 -298112 -194994 -56453 109255 144332 104311 174576 86036 50902 183756
14002 183756 74353 -6884 56193 249184 172348 85387 144090 227584 167333 62826 47374
13991 47374 -115239 -246738 -166619 -7085 -30611 -171086 -210696 -117899 -184796 -162117 -286714
13980 -286714 -137564 -73885 -50399 43094 157373 185713 111063 33769 37497 86691 134088
13969 134088 36982 -162007 -251228 -170302 -14178 18371 66510 94883 14426 -67231 -168889
$$ packed form
14043B16916J547J4350J48453j02987j04039j00883J3277L6121j18795j13880
14033a09920Q9815m9471o204k5076q9706N5639m2863K26283L2807m8644J36353
14022A69013j70628n5407M6870J34943J16014j24735k08508p6042j87181m9932
14012d05593J07481J03118J38541J65708L5077m0021P0265q8540l5134J32854
14002A83756j09403q1237O3077J92991p6836q6961N8703Q3494o0251j04507j5452
13991D7374j62613j31499Q0119J59534k3526j40475l9610R2797o6897K2679j24597
13980b86714J49150O3679K3486R3493J14279K8340p4650p7294L728M9194M7397
13969A34088r7106j98989q9221Q0926J56124L2549M8139K8373q0457q1657j01658
$$ plain form
13958 -168889 -157551 -129700 -66740 -66257 50199 137877 148077 111256 17694 -179784 -129461
13947 -129461 -111466 -155117 -59112 85438 134925 140376 120301 54294 29716 25845 -218730
13936 -218730 -181647 -59189 108296 104187 32941 -333 -87409 -122822 -88850 -62782 -174781
13925 -174781 -197861 -48789 -18 -170919 -154918 -67631 -29655 -114064 45452 111498 -74215
13914 -74215 -329165 -131595 -171923 -191851 -59020 95954 206667 106983 53512 -24206 -24289
13903 -24289 66674 98848 104937 171840 236022 -2451 -157026 23353 296560 338310 307697
13892 307697 180785 126447 77284 36679 113996 224077 216288 174011 189448 175016 271334
13881 271334 239818 195769 60785 45797 197498 180796 154094 216268 161718 -123479 -230665
$$ packed form
13958a68889J1338K7851O2960M83J16456Q7678J0200l6821r3562j97478N0323
13947a29461J7995m3651R6005J44550M9487N451k0075o6007k4578l871k44575
13936b18730L7083J22458J67485m109p1246l3274q7076l5413L3972K6068j11999
13925a74781k3080J49072M8771j70901J6001Q7287L7976q4409J59516O6046j85713
13914g4215k54950J97570m0328j9928J32831J54974J10713r9684n3471p7718q3
13903b4289R0963L2174O089O6903O4182k38473j54575J80379K73207M1750l0613
13892C07697j26912n4338m9163m0605P7317J10081p789m2277J5437j4432R6318
13881B71334l1516m4049j34984j4988J51701j6702k6702O2174n4550k85197j07186
$$ plain form
13870 -230665 -110494 -150412 -344057 -478286 -471097 -340520 -178042 -134897 81060 15729
13860 15729 -49144 -164526 -111604 120025 274575 135990 166879 192026 160840 179299 182562
13849 182562 99087 113760 156875 -76545 -117031 -84396 102627 99052 -14592 127455 157072
13838 157072 186098 206366 157168 164840 137601 -7190 11124 6950 21098 -97166 -178096
13827 -178096 -160398 -81733 -80995 70127 106818 12942 -36164 -170053 -225887 -257522 -166925
13816 -166925 -155408 -97702 -29825 -82536 -177110 -92172 100156 80796 40577 19062 24277
13805 24277 -19114 32258 56079 2217 -20632 -69747 -145320 -98652 -43378 121727 206438
13794 206438 122664 186264 288569 198516 163887 60435 -86731 -69897 -137550 -15662 -84815
$$ packed form
13870b30665J20171l9918j93645j34229P189J30577J62478M3145K15957o5331
13860A5729o4873j15382N2922K31629J54550j38585L0889K5147l1186J8459L263
13849A82562q3475J4673M3115k33420m0486L2635J87023l575j13644J42047K9617
13838A57072K9026K0268m9198P672k7239j44791J8314m174J4148j18264q0930
13827a78096J7698P8665P38J51122L6691r3876m9106j33889n5834l1635R0597
13816a66925J1517N7706O7877n2711r4574Q4938J92328j9360m0219k1515N215
13805B4277m3391N1372K3821n3862k2849m9115p5573M6668N5274J65105Q4711
13794B06438q3774O3600J02305r0053l4629j03452j47166J6834o7653J21888o9153
$$ plain form
13783 -84815 -154848 -132608 -158590 -137378 -235134 -193913 -114684 -101891 -54938 -27135 -66014 43966
13771 43966 -9691 -161648 -228403 -110155 -103027 -15935 -3389 -127987 -172843 -204488 -68722
13760 -68722 38684 78076 42176 -160303 9150 181717 19231 -129062 -161770 -85528
13750 -85528 -22203 -54370 -112504 -38384 163425 362733 465953 258776 96786 11981 77883
13739 77883 137658 61021 213649 275762 286708 327826 186799 42023 -137283 -163846 -190984
13728 -190984 -182619 -202473 -31865 12136 18674 96722 189876 261406 263200 242361 274434 313253
13716 313253 293326 284656 288664 175861 -30541 -187608 -124180 11996 113775 69452 42208
13705 42208 -165228 -205664 -152201 -251612 -290153 -301240 -306493 -183760 -43738 129218 74379
$$ packed form
13783h4815p0033K2240k5982K1212r7756M1221P9229J2793M6953K7803l8879J09980
13771D3966n3657j51957o6755J18248P128Q7092J2546j24598m4856l1645J35766
13760f8722J07406L9392l5900k02479J69453J72567j62486j48293l2708P6242
13750h5528O3325l2167n8134P4120K01809J99308J03220k07177j61990q4805O5902
13739G7883N9775p6637J52628O2113J0946M1118j41027j44776j79306k6563k7138
13728a90984Q365j9854J70608M4001O538P8048R3154P1530J794k0839L2073L8819
13716C13253j9927q670M008j12803k06402j57067O3428J36176J01779m4323k7244
13705D2208k07436m0436N3463r9411l8541j1087n253J22733J40022J72956n4839
$$ plain form
13694 74379 29400 231407 236968 136434 63621 108478 -92958 -245748 -173903 -15781 50511
13683 50511 144614 233040 203512 163114 204345 92872 72955 8294 -101827 -307324 -92531
13672 -92531 -42482 -86116 -130065 -296262 -220934 -12804 -76755 -178126 32010 140243 -20835
13661 -20835 -15395 -24428 -30744 3890 125071 185860 279937 98318 -106306 -58136 -170088
13650 -170088 -116924 -60961 -25195 47672 195354 245670 160845 152320 125744 46259 95360
13639 95360 24951 -133622 -204817 -95283 -67083 -70281 -104248 -82008 -35886 -140594 -116743
13628 -116743 20976 -50677 170592 432657 390698 176385 78419 -40477 -291776 -195731
13618 -195731 -56737 60157 260097 213563 115116 -51319 -26848 71790 86761 -39211
$$ packed form
13694G4379m4979K02007N561j00534p2813M4857k01436j52790P1845J58122O6292
13683E0511R4103Q8426k9528m0398M1231j11473j9917o4661j10121k05497K14793
13672i2531N0049m3634m3949j66197P5328K08130o3951j01371K10136J08233j61078
13661b0835N440r033o316L4634J21181O0789R4077j81619k04624M8170j11952
13650a70088N3164N5963L5766P2867J47682N0316q4825q525k6576p9485M9101
13639I5360p0409j58573p1195J09534K8200l198l3967K2240M6122j04708K3851
13628a16743J37719p1653K21269K62065m1959k14313r7966j18896k51299R6045
13618a95731J38994J16894J99940m6534r8447j66435K4471R8638J4971j25972
$$ plain form
13608 -39211 -160726 -201307 -222878 -212498 -165183 -39532 24570 39633 -51599 -78607 -136978
13597 -136978 -104527 -119044 -21132 -109518 -230635 -117018 -4275 26118 234430 223778 264688
13586 264688 273343 311190 282668 -37909 -152956 -58951 19059 49590 -107699 -190719 -275838
13575 -275838 -100527 -21455 -219299 -214505 -268802 -146995 149437 150764 112500 304218 266368
13564 266368 171900 164632 331361 354282 21862 -78808 -92914 21634 57241 -27869 -12488
13553 -12488 28077 133147 -32594 -69644 -119145 -140065 -10991 202795 137721 -4182 -12019
13542 -12019 -10844 -27239 52170 -129911 -133130 -262847 -141140 108023 281488 330523 468675
13531 468675 174786 9959 49891 167084 233382 269904 241793 213701 81967 52758 176106
$$ packed form
13608c9211j21515m0581k1571J0380M7315J25651O4102J5063r1232k7008n8371
13597a36978L2451j4517R7912q8386j21117J13617J12743L0393K08312j0652M0910
13586B64688Q655L7847k8522l20577j15047R4005P8010L0531j57289q3020q5119
13575b75838J75311P9072j97844M794n4297J21807K96432J327l8264J91718l7850
13564B66368r4468p268J66729K2921l32420j00670j4106J14548L5607q5110J5381
13553a2488M0565J05070j65741l7050m9501k0920J29074K13786o5074j41903p837
13542a2019J175j6395P9409j82081l219j29717J21707K49163J73465M9035J38152
13531D68675k93889j64827L9932J17193O6298L6522k8111k8092j31734k9209J23348
$$ plain form
13520 176106 207395 -51071 -169845 -132195 -24881 38699 -5972 102058 222068 280200
13510 280200 163044 7456 -41772 -61772 49212 170908 179837 13932 -91697 -173502
13500 -173502 -230980 -221002 -93264 -54770 -68860 28504 -10710 46565 108614 -16048 -12053
13489 -12053 52636 178506 114970 176550 126087 76490 137220 10243 -141881 -249116 -205469
13478 -205469 -21750 4123 53170 27808 -108649 -167202 -88799 -187543 -142769 -94089 -124191
13467 -124191 -100655 49244 3567 -28611 35200 86550 19211 -18239 47671 229045 207012
13456 207012 -98348 -34482 -9361 -67918 -180009 -236723 5179 45102 4056 4207 105963
13445 105963 194339 156772 171947 168691 40812 -175188 -118815 146888 287230 124576 9587
$$ packed form
13520A76106L1289k58466j18774L7650J07314O3580m4671J08030J20010N8132
13510B80200j17156j55588m9228k0000J10984J21696Q929j65905j05629q1805
13500a73502n7478R978J27738L8494j4090R7364l9214N7275O2049j24662L995
13489a2053O4689J25870o3536O1580n0463m9597O0730j26977j52124j07235M3647
13478b05469J83719K5873M9047k5362j36457n8553P8403r8744M4774M8680l0102
13467a24191K3536J49899m5677l2178O3811N1350o7339l7450O5910J81374k2033
13456B07012l05360O3866K5121n8557j12091n6714K41902L9923m1046J51J01756
13445A05963Q8376l7567J5175l256j27879k16000N6373K65703J40342j62654j14989
$$ plain form
13434 9587 -23486 -13097 97680 192576 299571 249205 120142 80267 261067 370166 213099
13423 213099 80168 122973 196091 300480 251339 138926 198562 85181 112691 178984 3953
13412 3953 -98003 -18853 -127771 -194952 -85980 -18202 144018 97136 -43512 -176393 40284
13401 40284 125898 80678 256107 271371 182690 94133 -12064 6390 -14164 19506 19713 -19154
13389 -19154 -23600 -72553 -182134 -133283 37533 111477 202853 261759 117363 -15960 -21969
13378 -21969 12209 80682 155358 64366 53975 144538 256301 191383 126092 140814 136441 50832
13366 50832 32224 -194376 -149253 -49743 -109713 -100314 -120624 -168590 -98501 78424 153435
13355 153435 83367 26885 -76108 -201039 -109878 -103353 -180153 -199001 -254758 -324262 -153892
$$ packed form
13434I587l3073J0389J10777R4896J06995n0366j29063l9875J80800J09099j57067
13423B13099j32931M2805P3118J04389m9141j12413N9636j13381K7510O6293j75031
13412C953j01956P9150j08918o7181J08972O7778J62220m6882j40648j32881K16677
13401D0284Q5614m5220J75429J5264q8681q8557j06197J8454k0554L3670K07l8867
13389a9154m446m8953j09581M8851J70816P3944R1376N8906j44396j33323o009
13378b1969L4178O8473P4676r0992j0391R0563J11763o4918o5291J4722m373q5609
13366E0832j8608k26600M5123R9510n9970R399k0310m7966P0089J76925P5011
13355A53435p0068n6482j02993j24931R1161O525p6800j8848n5757o9504J70370
$$ plain form
13344 -153892 116512 223535 97406 -98437 -143934 59098 54632 44819 149683 220138 193662
13333 193662 119377 132894 118854 40304 -6186 -71348 -174492 -187334 -123850 -111158 -206101
$$ packed form
13344a53892K70404J07023j26129j95843m5497K03032m466r813J04864P0455k6476
13333A93662p4285J3517j4040p8550m6490o5162j03144j2842O3484J2692r4943
$$ [...]
##END NTUPLES=NMR SPECTRUM
##END=
