##TITLE=Analysis number 326490
Compound Code mo 08011
Project Code adrs
Chemist Name fudan
##JCAMPDX= 6.0         $$ Bruker NMR JCAMP-DX V2.0
##DATA TYPE= NMR SPECTRUM
##DATA CLASS= NTUPLES
##ORIGIN= Bruker BioSpin GmbH
##OWNER= nmr
$$ XWIN-NMR		Version 3.5
$$ Thu Feb  8 09:38:15 2007 GMT Standard Time (UT+0h)  MAYBRIDGE\nmr@NMR_250MHZ
##.OBSERVE FREQUENCY= 250.131544655141
##.OBSERVE NUCLEUS= ^1H
##.ACQUISITION MODE= SIMULTANEOUS (DQD)
##.ACQUISITION SCHEME= undefined
##.AVERAGES= 16
##.DIGITISER RES= 18
##SPECTROMETER/DATA SYSTEM= dpx250
##.PULSE SEQUENCE= zg30
##.SOLVENT NAME= CDCl3
##.SHIFT REFERENCE= (INTERNAL, CDCl3, 0, 16.522)
##AUDIT TRAIL= $$ (NUMBER, WHEN, WHO, WHERE, WHAT)
$$ ##TITLE= Audit trail, XWIN-NMR		Version 3.5
$$ ##JCAMPDX= 5.01
$$ ##ORIGIN= Bruker BioSpin GmbH
$$ ##OWNER= nmr
$$ C:\u/data/dgb/nmr/ADRS/520/pdata/1/auditp.txt
$$ ##AUDIT TRAIL=  $$ (NUMBER, WHEN, WHO, WHERE, WHAT)
(   1,<2007-02-08 09:37:51.04 +000>,<MAYBRIDGE\nmr>,<NMR_250MHZ>,
      <created by zg, POWCHK disabled, PULCHK disabled
       configuration hash MD5:
       49 4B E0 1D 92 C2 6B 37 9F E6 65 BC 52 41 86 1D
       data hash MD5: 64K
       BF 8F 7C 45 41 72 AB 08 75 DE 06 AC 8B 47 8F B6>)
(   2,<2007-02-08 09:38:05.93 +000>,<MAYBRIDGE\nmr>,<NMR_250MHZ>,
      <Start of raw data processing
       ef LB = 0.3 FT_mod = 6 PKNL = 1 SI = 32K 
       data hash MD5: 32K
       B5 AA D8 57 AB F7 10 69 9A D9 14 BB 80 48 27 79>)
(   3,<2007-02-08 09:38:07.59 +000>,<MAYBRIDGE\nmr>,<NMR_250MHZ>,
      <apk 
       data hash MD5: 32K
       6E 18 A5 A4 D0 0B 0C B5 10 36 9E 54 9F EC 86 3B>)
(   4,<2007-02-08 09:38:08.39 +000>,<MAYBRIDGE\nmr>,<NMR_250MHZ>,
      <abs ABSG = 5 
       data hash MD5: 32K
       EB 07 B6 7E 4B 6D 7E 9F D5 D4 6F DB 3F D6 8D 6B>)
$$ ##END=
$$ 
$$ hash MD5
$$ 3A 79 BF 75 29 68 7B EC 08 5E 8A 87 FE 2F AB 2A
##$RELAX= 
##$RELAX= 
##$RELAX= 
##$RELAX= 
##$RELAX= 
##$RELAX= 
##$RELAX= 
$$ Bruker specific parameters
$$ --------------------------
##$DU= <C:\u>
##$EXPNO= 520
##$NAME= <ADRS>
##$PROCNO= 1
##$TYPE= <nmr>
##$USER= <dgb>
##$AMP= (0..31)
100 100 100 100 100 100 100 100 100 100 100 100 100 100 100 100 100 100 
100 100 100 100 100 100 100 100 100 100 100 100 100 100 
##$AQSEQ= 0
##$AQ_mod= 3
##$AUNM= <au_zg>
##$AUTOPOS= <38 >
##$BF1= 250.13
##$BF2= 250.13
##$BF3= 250.13
##$BF4= 250.13
##$BF5= 500.13
##$BF6= 500.13
##$BF7= 500.13
##$BF8= 500.13
##$BYTORDA= 1
##$CFDGTYP= 0
##$CFRGTYP= 5
##$CHEMSTR= <none>
##$CNST= (0..31)
1 1 145 1 1 1 1 1 1 1 1 1 1 1 1 1 1 1 1 1 1 1 1 1 1 1 1 1 1 1 1 1 
##$CPDPRG= <>
##$CPDPRG1= <>
##$CPDPRG2= <>
##$CPDPRG3= <>
##$CPDPRG4= <mlev>
##$CPDPRG5= <mlev>
##$CPDPRG6= <mlev>
##$CPDPRG7= <mlev>
##$CPDPRG8= <mlev>
##$CPDPRGB= <>
##$CPDPRGT= <>
##$D= (0..31)
0 1 0 0 0 0 0 0 0 0.06 0 0 0 0 0 0 0.0002 0 0 0 0 0 0 0 0 0 0 0 0 0 0 
0 
##$DATE= 1170927469
##$DBL= (0..7)
120 120 120 120 120 120 120 120 
##$DBP= (0..7)
150 150 150 150 150 150 150 150 
##$DBP07= 0
##$DBPNAM0= <>
##$DBPNAM1= <>
##$DBPNAM2= <>
##$DBPNAM3= <>
$$ [...]
##$SUBNAM7= <"">
##$SUBNAM8= <"">
##$SUBNAM9= <"">
##$SW= 20.6930455092707
##$SWIBOX= (0..15)
0 0 3 0 0 0 0 0 0 0 0 0 0 0 0 0 
##$SW_h= 5175.983436853
##$TD= 65536
##$TD0= 1
##$TE= 294.16
##$TE2= 300
##$TE3= 300
##$TEG= 300
##$TL= (0..7)
0 120 120 120 120 120 120 120 
##$TP= (0..7)
150 150 150 150 150 150 150 150 
##$TP07= 0
##$TPNAME0= <>
##$TPNAME1= <>
##$TPNAME2= <>
##$TPNAME3= <>
##$TPNAME4= <>
##$TPNAME5= <>
##$TPNAME6= <>
##$TPNAME7= <>
##$TPOAL= (0..7)
0.5 0.5 0.5 0.5 0.5 0.5 0.5 0.5 
##$TPOFFS= (0..7)
0 0 0 0 0 0 0 0 
##$TUNHIN= 0
##$TUNHOUT= 0
##$TUNXOUT= 0
##$USERA1= <user>
##$USERA2= <user>
##$USERA3= <user>
##$USERA4= <user>
##$USERA5= <user>
##$V9= 5
##$VALIST= <valist>
##$VCLIST= <CCCCCCCCCCCCCCC>
##$VD= 0
##$VDLIST= <DDDDDDDDDDDDDDD>
##$VPLIST= <PPPPPPPPPPPPPPP>
##$VTLIST= <TTTTTTTTTTTTTTT>
##$WBST= 1024
##$WBSW= 4
##$XGAIN= (0..3)
0 0 0 0 
##$XL= 0
##$YL= 0
##$YMAX_a= 611110
##$YMIN_a= -604015
##$ZGOPTNS= <>
##$ZL1= 120
##$ZL2= 120
##$ZL3= 120
##$ZL4= 120
##$ABSF1= 16.522
##$ABSF2= -4.171173
##$ABSG= 5
##$ABSL= 3
##$ALPHA= 0
##$AQORDER= 0
##$ASSFAC= 0
##$ASSFACI= 0
##$ASSFACX= 0
##$ASSWID= 0
##$AUNMP= <proc_1d>
##$AZFE= 0.1
##$AZFW= 0.1
##$BCFW= 0
##$BC_mod= 0
##$BYTORDP= 0
##$COROFFS= 0
##$CY= 12.5
##$DATMOD= 1
##$DC= 0
##$DFILT= <>
##$DTYPP= 0
##$F1P= 14.0000005364418
##$F2P= -0.99999901652339
##$FCOR= 0.5
##$FTSIZE= 32768
##$FT_mod= 6
##$GAMMA= 0
##$GB= 0
##$INTBC= 1
##$INTSCL= 1
##$ISEN= 128
##$LB= 0.3
##$LEV0= 0
##$LPBIN= 0
##$MAXI= 10000
##$MC2= 0
##$MEAN= 0
##$ME_mod= 0
##$MI= 0
##$NCOEF= 0
##$NC_proc= -2
##$NLEV= 6
##$NOISF1= 0
##$NOISF2= 0
##$NSP= 0
##$NTH_PI= 0
##$NZP= 0
##$OFFSET= 16.522
##$PC= 1
##$PHC0= 233.0291
##$PHC1= 4.520129
##$PH_mod= 1
##$PKNL= yes
##$PPARMOD= 0
##$PSCAL= 4
##$PSIGN= 0
##$REVERSE= no
##$SF= 250.13
##$SI= 32768
##$SIGF1= 0
##$SIGF2= 0
##$SINO= 400
##$SIOLD= 32768
##$SREGLST= <1H.CDCl3>
##$SSB= 0
##$STSI= 32768
##$STSR= 0
##$SW_p= 5175.98343685301
##$SYMM= 0
##$S_DEV= 0
##$TDeff= 65536
##$TDoff= 0
##$TI= <Analysis number 999999
Compound Code 99
Book Reference 9
Project Code 9>
##$TILT= no
##$TM1= 0
##$TM2= 0
##$TOPLEV= 0
##$USERP1= <user>
##$USERP2= <user>
##$USERP3= <user>
##$USERP4= <user>
##$USERP5= <user>
##$WDW= 1
##$XDIM= 32768
##$YMAX_p= 396683425
##$YMIN_p= -137230
$$ End of Bruker specific parameters
$$ ---------------------------------
##NTUPLES= NMR SPECTRUM
##VAR_NAME=  FREQUENCY,     SPECTRUM/REAL,   SPECTRUM/IMAG
##SYMBOL=    X,             R,               I
##VAR_TYPE=  INDEPENDENT,   DEPENDENT,       DEPENDENT
##VAR_FORM=  AFFN,          ASDF,            ASDF
##VAR_DIM=   32768,         32768,           32768
##UNITS=     HZ,            ARBITRARY UNITS, ARBITRARY UNITS
##FACTOR=    0.157963299565203, 1,           1
##FIRST=     4132.6476996994, 0,             0
##LAST=      -1043.33573715361, 0,           0
##MIN=       -1043.33573715361, -137230,     0
##MAX=       4132.6476996994, 396683425,     0
$$ Real data points
##PAGE= N=1
##DATA TABLE= (X++(R..R)), XYDATA
$$ [...]
17686d598K739o58K93K495j353l210k129j967J689j560P88P251k252k14j551J0045
17670E808J277r582Q002N936J670n210n436J354j781l420j090P61M285K682K679
17655G935P36m098J111Q422o24n766k276L366O63p32N043N132r399o22j411J269
17639H749M682L480K125k634n478J927l022l938j598K370m87m562j033J57k989
17624b251O77O484N775n33N03k332p154m553K612K47K618P53l2k768j641j214
17608b809P514m82L116M710q102m062N012J350k54l11m904M258L143p705n660
17593e186K40L92M764j849K825p15k347k328J299M497M396j385p623j345L035
17578a330J149P73k248O764O79j693k466k182l15N030N047m907j503K114n348
$$ plain form
17686 -4598 -1859 -2517 -2224 271 -1082 -4292 -6421 -8388 -6699 -8259 -7471 -220 -2472 -2686 -4237 5808
17670 5808 7085 -2497 5505 11441 13111 7901 2465 3819 2038 -1382 -2472 -1711 2574 5256 7935
17655 7935 8671 4573 5684 14106 13482 7716 5440 8806 9469 8737 13780 18912 9513 8891 7480 8749
17639 8749 13431 16911 19036 16402 10924 12851 9829 5891 4293 6663 6176 1614 581 738 -2251
17624 -2251 -1574 4910 10685 10152 10655 8323 1169 -3384 -772 -525 2093 2846 2814 46 -1595 -2809
17608 -2809 4705 4223 7339 12049 3947 -115 4897 6247 5993 5682 778 5036 8179 474 -5186
17593 -5186 -4946 -4554 210 -1639 1186 471 -1876 -4204 -2905 1592 5988 4603 -3020 -4365 -1330
17578 -1330 -181 592 -1656 5108 5787 4094 1628 -554 -869 4161 9208 4301 2798 4912 -436
17563d36p058O59J073L248L373Q039R742m467o085J607m073J331N640j054n442
17548F097k09N425K320n301j220L172M546J385j518m479J042N186q81l709o362
17533E494p765j430Q311k12m106j161P421O41o379n310q43j406J0892J1810R69
17518A6926r191q848k344J28k161k02O311k177l058P85N851j361J274Q456K442
17503A2831k069n144m812m305L431N016k631N96R72l311K614M682l97m704P654
17488A0423K970n003n386o014N029N120N266K952k93r276m754n82K124K942L511
17473I029k124k385k570K320K47O474J609o796l8O58j468k036k090N049J797o91
17457F985o755m594n498L161M761j252o850l065n411M327P831P154R216Q379J7322
$$ plain form
17563 -436 -7494 -6835 -5762 -2514 859 8898 18640 14173 8088 9695 5622 6953 12593 11539 6097
17548 6097 5888 11313 13633 8332 7112 10284 14830 16215 14697 10218 11260 16446 15565 11856 5494
17533 5494 -2271 -3701 4610 4398 292 -869 6552 7193 814 -4496 -5339 -6745 4147 15957 16926
17518 16926 7735 -1113 -3457 -3329 -5490 -5692 619 -1558 -4616 -3831 2020 659 1933 10389 12831
17503 12831 10762 5618 806 -3499 -68 4948 2317 2913 3885 574 3188 7870 7473 2769 10423
17488 10423 13393 8390 3004 -3010 2019 7139 12405 15357 15064 5788 1034 452 2576 5518 9029
17473 9029 6905 4520 1950 4270 4517 10991 12600 5804 5766 6424 4956 2920 830 5879 7676 6985
17457 6985 230 -4364 -9862 -6701 -1940 -3192 -10042 -13107 -18518 -14191 -6360 794 10010 18389 35711
17442C5711L2518K7297k2551l3962j6690o451K292n725m869K301R11n647l176
17429A959N511J161r415p436J2442P716j622J492N254j655j625M616l18l336l389
17414A1355k669O122L754l978K239q009l315p315n863L720J207O274j198o372
17400d048l940P074N515K314k214p486l877L911O590om792M088J679J038q85K625
17384G586n009J320n671l336P037J599n275j598K683l486J773j998l073R82p79
17369g245M420L222O468k137r270L780L185Q32P71o154M407P304q126n025k680
17354f248j670J726N326m269o036K137O272P7k742o007p299R178P231m907l672
17339a0903R211J0620R61l366O65J016l569l960R93M756m442l011P40j313M962
$$ plain form
17442 35711 68229 95526 72975 39013 22323 15872 18164 12439 7570 9871 10782 5135 1959
17429 1959 7470 8631 -784 -8220 4222 11938 10316 11808 17062 15407 13782 18398 18080 14744 11355
17414 11355 8686 14808 18562 14584 16823 8814 5499 -1816 -7679 -3959 -2752 3522 2324 -4048
17400 -4048 -7988 -914 4601 6915 4701 -2785 -6662 -2751 3839 3833 -959 3129 4808 5846 4961 7586
17384 7586 2577 3897 -1774 -5110 1927 3526 -1749 -3347 -664 -4150 -2377 -4375 -7448 -6466 -7245
17369 -7245 -2825 397 6865 4728 -4542 -762 2423 3255 4026 -2128 2279 9583 1457 -3568 -6248
17354 -6248 -7918 -6192 -866 -5135 -11171 -9034 -2762 -2685 -5427 -11434 -18733 -9555 -2324 -7231 -10903
17339 -10903 -1692 8928 9889 6523 7188 8204 4635 675 1668 6424 1982 -1029 -289 -1602 3360
17324C360K364m137n400l135L172L246M479l782n359J66K612P618r66n444l608
17309d814J460K066l63l731K308L227k2l852J200O752j359J993l142J521O601
17294I845L765o593L73o459L995j859n446M223L526m78m491m351n57r82m34m215
17278a0138L96L116L063M115K07o299o713M127L009J407J638N574M376l234p175
17263b531J551L113K284L191L991m149l297n858l20Q991j272k801R94Q455o110
17248F232j146k974o351n977K066p60n233J865K318O004O085O92l514Q33P346
17233G486k342k182J741k287J963n386L395N728p04N757M513p439k690K458j998
17218H013o858J851m380q139J877M826J998q567j21L688k395l242L326Q86M223
$$ plain form
17324 3360 5724 1587 -3813 -6948 -3776 -530 3949 167 -5192 -5026 -2414 5204 4238 -1206 -4814
17309 -4814 -3354 -1288 -1651 -5382 -3074 153 131 -3721 -2521 4231 2872 4865 1723 3244 9845
17294 9845 13610 7017 7390 931 4926 3067 -2379 1844 5370 4892 401 -3950 -4507 -5489 -5923 -10138
17278 -10138 -9742 -6626 -3563 552 759 -5540 -12253 -8126 -5117 -3710 -2072 3502 7878 4644 -2531
17263 -2531 -980 2133 4417 7608 11599 7450 4153 -1705 -2025 6966 5694 2893 3887 12342 6232
17248 6232 5086 2112 -4239 -10216 -8150 -8910 -14143 -12278 -9960 -3956 2129 2821 -693 140 7486
17233 7486 5144 2962 4703 2416 4379 -1007 2388 8116 7412 13169 17682 10243 7553 10011 8013
17218 8013 1155 3006 -1374 -9513 -7636 -2810 -812 -9379 -9500 -5812 -8207 -11449 -8123 -7237 -3014
17203c014M01p50J495o91j252J68j584k644K431O487L282j969l151j123o625K975
17187e564L476j1496m442K201J3656Q735M826Q31r676p479j889l140O342Q68J767
17172i84J380N238K643k354L723N39q338n820N732P121q277q25L724m202l075
17157c775M482J819k360j73K791K476j364L922K443M474j787l850l462n804m973
17142e141N17j334M914N67L133J105j936l002q85l491j841P37o605J65Q564N968
17126A435L625p08j0559M289J756l830n782K065L438J822J832l177M144j153o478
17111g281L835M423K891J502L138p773R56j146n84j036N26K911kn752j059M732
17095B81K225j968l135l888n945Q319N445l664n577N492M663j2P117J5276m807
$$ plain form
17203 -3014 -2613 -3363 -1868 -2559 -3811 -3643 -5227 -7871 -5440 1047 4329 2360 -791 -1914 -8539 -5564
17187 -5564 -2088 -13584 -18026 -15825 -2169 6566 11392 12223 2547 -4932 -6821 -9961 -3619 -2751 -984
17172 -984 396 5634 8277 5923 9646 10185 1847 -3973 1759 8880 603 -222 3502 -700 -3775
17157 -3775 707 2526 166 -7 2784 5260 3896 7818 10261 14735 12948 9098 5636 -168 -5141
17142 -5141 -4624 -5958 -1044 -477 2656 3761 1825 -1177 -2062 -5553 -7394 -6657 -13262 -13097 -4533 1435
17126 1435 5060 4352 -6207 -1918 -162 -3992 -9774 -7709 -4271 -2449 -617 -3794 350 -803 -7281
17111 -7281 -3446 977 3868 5370 8508 735 1691 545 -39 -1075 -549 2362 2360 -3392 -4451 281
17095 281 2506 538 -2597 -6485 -12430 -4111 1334 -2330 -7907 -2415 2248 2236 9353 24629 19822
17080A9822r529n70l061j0180J225k19m325L476Q91M27R35R61J880J626j367k756
17064g64J369M559O591k074p087q688L206J232p393k046M478l60N635n104O139
17049c07Q02K267K22j416l481l798L393K354j609k429k468P443j421k151n889
17034h488j085O327j430n816l657j429K668K378M170J607P597L385m351j1487
17020i611o963K738M164L09M41J112L892N541k312M298k091L06L215K727l519
17005D247J860k704J52L083J251l021l825M65m489N15j485m657O221P021p68k272
16989A594j544M505K255k748q237k312K13K190m056M538L270K120K577k567k801
16974a003l049L844L979M022q91k149K164j241l957J397k054q31L218j67j69M654
$$ plain form
17080 19822 10293 9723 6662 -3518 -2293 -2512 -6837 -3361 -2470 -2043 -1108 -147 1733 3359 1992 -764
17064 -764 605 5164 11755 9681 2594 -6094 -2888 -1656 -9049 -11095 -6617 -6977 -1342 -6446 -307
17049 -307 495 2762 2984 1568 -1913 -5711 -2318 36 -1573 -4002 -6470 973 -448 -2599 -8488
17034 -8488 -9573 -3246 -4676 -10492 -14149 -15578 -12910 -10532 -6362 -4755 2842 6227 1876 -9611
17020 -9611 -16574 -13836 -9672 -9363 -8922 -7810 -3918 1623 -689 3609 1518 1824 5039 7766 4247
17005 4247 6107 3403 3555 6638 7889 4868 1043 1508 -2981 -2466 -3951 -8608 -2387 4634 3866 1594
16989 1594 50 4555 6810 4062 -4175 -6487 -6274 -4084 -8140 -3602 -332 1788 4365 1798 -1003
16974 -1003 -4052 -208 3771 7793 6902 4753 6917 5676 1719 3116 1062 231 3449 3282 3113 7767
16958G767r837l166N73O71J92j372p37k104q1P890N299N584j15j0872l933r94
16942e235L496M437M005N758j242L093j312J74l285j0981p549k137J3185M330
16928F737n766K998L936m323q582L496M86K30l837l061J192N651L348m579k82
16913b356J07k983Q15m38N034L302J315m697R02J321J931j412M91n80n176k870
16897e294n598J324P528K510j035J13l5J71l40o53j990k467K453O597o464k930
16881f110l567k049P209M636K019K142o002p615M110K905K498J037l377L679k962
16866a447J241p228n757J57M634N692P797N298R67K487n490n944q312o998J299
16851a1604M558n883J928O557O353J94k295J192J338J563k388K613J113L020l578
$$ plain form
16958 7767 -2070 -5236 -4663 -3992 -3800 -5172 -5909 -8013 -8094 -204 5095 10679 10564 -308 -4241 -5235
16942 -5235 -1739 2698 6703 12461 11219 14312 13000 13174 9889 -1092 -8641 -10778 2407 6737
16928 6737 971 3969 7905 3582 -5000 -1504 -1018 -788 -4625 -7686 -6494 -843 2505 -2074 -2356
16913 -2356 -2249 -5232 -4417 -4855 179 3481 4796 99 1001 2322 4253 2841 3332 2752 -2424 -5294
16897 -5294 -10892 -9568 -2040 470 -565 -452 -487 -316 -656 -1309 -3299 -5766 -3313 3284 -3180 -6110
16881 -6110 -9677 -11726 -4517 119 2138 4280 -1722 -9337 -5227 -2322 176 1213 -2164 1515 -1447
16866 -1447 -206 -7434 -13191 -13034 -8400 -2708 5089 10387 11354 13841 8351 2407 -5905 -12903 -11604
16851 -11604 -7046 -12929 -11001 -4444 1909 2103 -192 1000 2338 3901 1513 4126 5239 8259 4681
16836D681o380j656n135O07N719J334n19P03j550M85o742K574J913N302J597J609
16820D542l324j084j467j0775M28R203K605M681l397K92j012l645m645o031m068
16805a7697k523R551J949n30J926K865l28k01j696k670L691L69l092k587m502
16790a5475K257j784N668L612N736N545n355l355K758l843P385N609p811p408
16776f461J74O224L969k311O038j522r697m042m589m319K833J1072K785m020K444
16761a422l174N951N739L909q787q905N43l142n80m97K296L442l838m209K659
16746a0015O956J0290M437q684j3270n65M164J02N156J657j711K649M736J516
16732G418r69K201L325q683o487o164J856J1642k319r305k824n015m88Q736k624
$$ plain form
16836 4681 -1699 -3355 -8490 -7883 -2164 -830 -1349 -646 -2196 -1711 -8453 -5879 -3966 1336 2933 4542
16820 4542 1218 134 -1333 -12108 -11680 -2477 128 4809 1412 1704 692 -2953 -7598 -13629 -17697
16805 -17697 -20220 -10669 -8720 -9250 -7324 -4459 -4787 -4988 -6684 -9354 -5663 -5294 -8386 -10973 -15475
16790 -15475 -13218 -15002 -9334 -5722 14 5559 204 -3151 -393 -4236 3149 8758 947 -6461
16776 -6461 -6287 -63 3906 1595 7633 6111 -3586 -7628 -12217 -16536 -13703 -2631 154 -3866 -1422
16761 -1422 -4596 1355 7094 11003 2216 -6689 -6146 -9288 -9868 -10365 -8069 -4627 -8465 -12674 -10015
16746 -10015 -3059 7231 11668 2984 -10286 -10851 -6687 -6585 -1429 228 -1483 1166 5902 7418
16732 7418 6449 8650 11975 3292 -3195 -9359 -7503 4139 1820 -7485 -10309 -15324 -15812 -7076 -9700
16717i700l59J282J202l819k299j094K331q96J918K922M712k889j68R442L690
16702F275L430Q14m194m147j788K730M783N166K30r904l396k484n91N570j0135
16687g641k916L183q14N596M972P82L775m463Q07J164N623J942K71m104l311J350
16671F216K450l832q041l928Q331j135j145J128K947K039K598M00L362j179n891
16656D320k432j092j53J623M367k357J111K358q963m381J26l552R94M97Q970K03
16640A639j023P96n844j677k149K071o89K593R58M673L926M19N527L635j0289
16625D566k263m599k263n389o160m7M589R555J539J170l168j755l600j293m250
16610a3368L139L635J449L116M056k33p140l307K07K673j907q63N515K307j563
$$ plain form
16717 -9700 -10059 -8777 -7575 -11394 -13693 -14787 -12456 -13352 -11434 -8512 -3800 -6689 -6857 2585 6275
16702 6275 9705 10519 6325 2178 390 3120 7903 13069 13299 3395 -1 -2485 -3076 2494 -7641
16687 -7641 -10557 -7374 -8188 -2592 2380 3162 6937 2474 3281 4445 10068 12010 12281 8177 4866 6216
16671 6216 8666 4834 -3207 -7135 1196 61 -1084 44 2991 5030 7628 8028 11390 10211 4320
16656 4320 1888 796 643 2266 6633 4276 5387 7745 -1218 -5599 -5473 -9025 -8031 -7534 1436 1639
16640 1639 616 1412 -4432 -6109 -8258 -6187 -6876 -4283 -3325 1348 5274 5693 11220 14855 4566
16625 4566 2303 -2296 -4559 -9948 -16108 -16155 -11566 -2011 -472 698 -2470 -4225 -7825 -9118 -13368
16610 -13368 -10229 -6594 -5145 -2029 2027 1794 -5346 -8653 -8446 -5773 -7680 -8543 -3028 -721 -2284
16595b284o115r953j903M611N986O443K009M64j506K603K528J150k824P06J0K507
16579D432J640m567m509J720L712J404o89j324o229j853j366M063j195M688O220
16564F147m404l754j05l068p975L155Q990k28J683N632P62q107J458J382o122
16549d554N271L089n07L23p362o809K398O028j392m244j488L4N785J816l220N56
16533d276q56N405L350n598p469P06N494L728l481k014q156L52k43K008R353l755
16517e452J887L48n482L250L270l475n99p095p57L555L773M53N883M081k219m952
16501c531J102k70J032M025m580l406J901K077m849O14K321L606K997K143k801
16486B381n699M65N962J895r8M37l84L26L67K511J91j811l458L844M160l697K322
$$ plain form
16595 -2284 -8399 -18352 -20255 -15644 -9658 -3215 -1206 -742 -2248 355 2883 4033 1209 1915 1925 4432
16579 4432 6072 1505 -3004 -1284 2428 3832 3143 1819 -4410 -6263 -7629 -3566 -4761 -73 6147
16564 6147 1743 -2011 -2116 -5184 -13159 -10004 -1014 -1242 441 6073 6835 -1272 186 1568 -4554
16549 -4554 717 3806 3299 3622 -3740 -10549 -8151 -2123 -3515 -7759 -9247 -9213 -3428 -1612 -4832 -4276
16533 -4276 -5132 273 3623 -1975 -9444 -8738 -3244 484 -2997 -5011 -13167 -12815 -13058 -11050 -1697 -5452
16517 -5452 -3565 -3217 -8699 -5449 -2179 -5654 -6253 -13348 -14105 -10550 -6777 -6324 -441 3640 1421 -3531
16501 -3531 -2429 -2699 -1667 2358 -2222 -5628 -3727 -1650 -6499 -5885 -3564 42 3039 5182 2381
16486 2381 -3318 -2853 3109 5004 4906 5343 4959 5285 5652 8163 8354 6543 3085 6929 11089 7392 9714
16469I714K880n173j0976m539J757L500q96P491l668n315k68J639q10n489l78
16454a0531J0028O437l69k390q509q703n5M949J687O404K346p3k154M956Q300
16439A2323k460j0125j1941J02M590J953M417P33J298N803k363j929L605N235
16425A1241j227J324p609q752n017L061O534N25k054j196K062L421N83M111O829
16410A3836o045q345k495l911q68k323P025M03m076N011M483p961J479K456j01
16395a432J569L316j168K1M273p64j756K01q023l165J225k849k927K35K540P286
16379a418O982L256l179k844j366m979O10m295o73L847P78o409j61j304N044Q80
16363e231k879j652M577J119kR490N577p337l296L097r421m641L802J410J975
$$ plain form
16469 9714 12594 7421 -3555 -8094 -6337 -2837 -3733 3758 90 -5225 -5493 -3854 -4664 -10153 -10531
16454 -10531 -503 5934 5565 3175 -5334 -14037 -14092 -9143 -7456 -1052 1294 1221 -933 4023 12323
16439 12323 9863 -262 -12203 -12101 -7511 -5558 -1141 -408 890 6693 4330 2401 6006 11241
16425 11241 10014 11338 3729 -5023 -10040 -6979 -445 80 -1974 -3170 -1108 2313 2896 7007 13836
16410 13836 7791 -554 -3049 -6960 -7828 -10151 -3126 -2723 -6799 -1788 2695 -5266 -3787 -1331 -1432
16395 -1432 137 3453 2285 2306 6579 5815 4059 4260 -3763 -6928 -5703 -8552 -11479 -11244 -8704 -1418
16379 -1418 5564 8820 5641 2797 1431 -3548 -2938 -7233 -7906 -4059 -3281 -9690 -9851 -11155 -6111 -5231
16363 -5231 -8110 -9762 -5185 -4066 -4068 5422 10999 3662 366 3463 -5958 -10599 -6797 -5387 -3412
16348c412n0L806K911m503j206M669n723o641l504j039M427R90j538L855l935
16333a0893j539O818M841L178Q729m937o314m638m451j602J51L056J493J269j47
16318d986k216j026k839J590J5297M060n050m384k428n79K407N709p776j0331
16304a2552m704J6131M231m35o540n810l141l59j159K802P304L38m739J630j974
16289h977l69N71J006L357k509l122K926l427m464M455Q353L588R610l75q076
16274B547j1770m187P953N260k207o198L74L623K16o59Q08M105Q456l852n912
16259a443J807L691J593p759J471M200o10k96q46r7k527K105P118R0q552k422
16243b477K988J943O790k294n946Q413L49p617r318m558k890P004Q224K552k333
$$ plain form
16348 -3412 -3462 344 3255 -1248 -2454 2215 -3508 -10149 -13653 -14692 -10265 -9275 -10813 -6958 -10893
16333 -10893 -12432 -5614 -773 2405 11134 6197 -117 -4755 -9206 -10808 -10657 -7601 -6108 -4839 -4986
16318 -4986 -7202 -8228 -11067 -9477 5820 9880 4830 446 -1982 -2561 -154 5555 -2221 -12552
16304 -12552 -17256 -1125 3106 2671 -3869 -9679 -12820 -13179 -14338 -11536 -4232 -3894 -8633 -7003 -8977
16289 -8977 -9346 -8775 -7769 -4412 -6921 -10043 -7117 -10544 -15008 -10553 -2200 1388 10998 10623 2547
16274 2547 -9223 -13410 -5457 -197 -2404 -8602 -8228 -4605 -4389 -5048 -4240 -135 8321 4469 -1443
16259 -1443 364 4055 5648 -2111 -640 3560 2950 2654 1808 1711 -816 1289 8407 8497 -55 -2477
16243 -2477 511 2454 9244 6950 1004 9417 9766 2149 -7169 -11727 -14617 -7613 611 3163 830
16228H30r01q776l868L473R88l304l121N519K818K277R107n08l969K642k189l224
16212b206q10m240o19O545k124k237j49l753J653K614j401J640P054m881l262
16197f176j906L583K36K921k457l288K036L627J087n330R75O53L160P259l443
16182B937p785K779N597k691O178L233l999m651k496K240J843j781L07j87o522
16167d998K346n902k843K308L507K542j987l279K272l56o009o078RN448O286M362
16151b372J0572P878k136n182l181L73l257r426L426L588j145m476l022M89j721
16136i592m40K407N498J2097n245o014K284P0L926N351m929l087q6k14o91L912
16120E247l482m646Q34L934l922p215n772M863K315N077N359m070m63L857qk413
$$ plain form
16228 830 -71 -8847 -12715 -9242 -8254 -11558 -14679 -9160 -6342 -4065 5042 4534 565 3207 1018 -2206
16212 -2206 -3016 -7256 -7875 -1330 -3454 -5691 -5840 -9593 -7940 -5326 -6727 -5087 1967 -2914 -6176
16197 -6176 -8082 -4499 -4263 -1342 -3799 -7087 -5051 -1424 -337 -5667 -4692 -4039 -879 6380 2937
16182 2937 -4848 -2069 3528 837 7015 10248 6249 1598 -898 1342 3185 1404 1711 1524 -4998
16167 -4998 -2652 -8554 -11397 -9089 -5582 -3040 -5027 -8306 -6034 -6390 -12399 -18477 -18468 -13020 -6734 -2372
16151 -2372 8200 16078 13942 8760 5579 5952 2695 -6731 -3305 283 -862 -5338 -8360 -7871 -9592
16136 -9592 -10032 -7625 -2127 9970 4725 -1289 995 1065 4991 10342 5413 2326 2240 2026 1335 5247
16120 5247 1765 -2881 -2047 1887 -2035 -9250 -15022 -10159 -7844 -2767 2592 -1478 -1941 1916 1908 -505
16104e05m350M28L404o21j997P86L80R19o125j316N539j34R93J378l010j661l224
16087i116l397M938O888j892o081J516K159J797m326r75K676J655M717L258O116
16072I933K068l343k592q43K024J839l40q915o532k688L260j432P695L832J00
16057D066r301k888k351K867L695N700n47J363Q398k423o131L082N041m335k479
16042C757K097l199p370r40K243J801P874k727k977L318J27k080n19k659n792
16027g046j377m891L508j335J748N968k189K070l88j536N287m018o940J186O187
16012c766q1J901M275J889l068M91J641J129n000o937o8K67N977M299k623K388
15996B714k737m634K986k955R47k371m997O858K466K394O944k10k686o633K894
$$ plain form
16104 -505 -4855 -4427 -1023 -1644 -3641 -2855 -2475 -1556 -7681 -8997 -3458 -3592 -2599 -1221 -4231 -5892 -9116
16087 -9116 -12513 -7575 -687 -2579 -8660 -7144 -4985 -3188 -7514 -8489 -5813 -4158 559 3817 9933
16072 9933 12001 8658 6066 5223 7247 9086 8746 -169 -6701 -9389 -6129 -7561 134 3966 4066
16057 4066 -5235 -8123 -10474 -7607 -3912 1788 1241 2604 11002 8579 2448 5530 10571 6236 3757
16042 3757 5854 2655 -4715 -5655 -3412 -1611 6263 3536 559 3877 4004 1924 1405 -1254 -7046
16027 -7046 -8423 -13314 -9806 -11141 -9393 -3425 -5614 -3544 -3932 -5468 -181 -4199 -11139 -9953 -3766
16012 -3766 -3847 -1946 2329 4218 1150 1641 3282 4411 -589 -7526 -7594 -7327 -1350 2949 326 2714
15996 2714 -23 -4657 -1671 -4626 -3679 -6050 -11047 -4189 -1723 671 7615 7405 4719 -1914 980
15981I80Q01M04l597N80J044q13l977j135N839R48J080l631N7j179k74m286M790
15964b369L066j502l294k746pQ377N601k215o748q89k160K024L517j214r157m785
15948a4501M423L333j13l007k116O774L0m162Q280j882r490k237J0555N916k609
15933h06l512M015j097n320q91Q792R33l114M46n645N066Q494K665l16k628J410
15917H492J69m8R82o209l542m339k37o4o16Q65L266j056l478J584l048K22O939
15900a18M437n375n980n500N48Q564N793J143M355K078o580l111l859p26q88O65
15884d554O099j990o182j010J376N71j532p035L331O353L978L857m077m969n58
15869f342K490M089J394L999L001p693k112j195k54J806O311L173M974K6m270
$$ plain form
15981 980 1781 2185 -1412 -832 212 -601 -4578 -5713 126 1074 2154 -1477 -1420 -2599 -2873 -7159 -2369
15964 -2369 697 -805 -4099 -6845 -6852 1525 7126 4911 -1837 -2726 -4886 -2862 655 -559 -9716 -14501
15948 -14501 -10078 -6745 -6858 -9865 -11981 -5207 -5177 -9339 -1059 -2941 -12431 -14668 -4113 1803 -806
15933 -806 -4318 -303 -1400 -6720 -7611 1181 2114 -1000 -554 -6199 -1133 7361 10026 9710 7082 8492
15917 8492 8661 8613 9595 3386 -156 -4495 -4732 -4796 -5412 -4547 -1281 -2337 -5815 -4231 -7279 -7057 -118
15900 -118 4319 -1056 -7036 -12536 -11988 -3424 2369 3512 7867 9945 3365 254 -3605 -4331 -5219 -4554
15884 -4554 1545 -445 -6627 -7637 -6261 -5690 -7222 -14257 -10926 -4573 -595 3262 -815 -5784 -6342
15869 -6342 -3852 237 1631 5630 8631 938 -1174 -2369 -2623 -817 5494 8667 13641 13667 9397
15854I397q042p495K22M538L506Q66j383o86O23O529J85j879n115j167m364j650
15838e915m761m726K279O495K674P398K821K762l032m796o391k502q062p008J0454
15823a2310R080N096L389j772L409l692L53m610k558k152j462P46R24M689L633
15808B763K466Q21r141o004j156m626N634O243L552K024p81N26j395L33M351j881
15792C729j118Q618M494n369m104k896K714M061M887l422k430N72M54N973J755
15777A7918p182o124p132l108N399l82r45J008M57R127M113j0167o851J973K686
15762G90k228m263L65n64n270n971P669L914M97P637n71p52R2R23l834p557o194
15745a5317o686m465M791J1720P006L870R164l62o729l550k478M116l29j672j295
$$ plain form
15854 9397 1355 -6140 -5918 -1380 2126 2992 1609 923 1546 8075 8260 6381 1266 99 -4265 -5915
15838 -5915 -10676 -15402 -13123 -6628 -3954 3444 6265 9027 5995 1199 -5192 -7694 -15756 -22764 -12310
15823 -12310 -3230 1866 5255 3483 6892 3200 3553 -1057 -3615 -5767 -7229 -6483 -5559 -870 2763
15808 2763 5229 6050 -3091 -9095 -10251 -14877 -9243 -3000 552 2576 1795 2321 926 1259 5610 3729
15792 3729 2611 11229 15723 10354 6250 3354 6068 10129 15016 11594 9164 9736 10190 16163 17918
15777 17918 10736 4612 -2520 -5628 -229 -611 -1556 -548 -91 9036 13149 2982 -3869 -1896 790
15762 790 -1438 -5701 -5336 -5900 -11170 -17141 -9472 -5558 -5061 2576 2005 1253 1345 2268 -1566 -9123 -15317
15745 -15317 -22003 -26468 -21677 -9957 -2951 919 10083 9721 2992 -558 -3036 1080 751 -921 -2216
15730b216l146J026N800M530L563m252n140m061l994N433N922j024n397P69O37
15715a550q03K582j300Q01N054l662k648l130O47L35m141m318j227J1894K340
15700H74M91q123J137M947L264O62n269r5J008p738J224Q524L424m277p68k271
15684b986Q631R392J022N7l707K073M995p732n959p682J528j420m668o62J309
15669e809M171Q035m52m742O81l564j69K835k536j2582j592N384P199K961P20
15654E40J757k77l49k50j612l392q340J07O622O552K00l952k674k021K790J450
15638b849o506p607J229Q371P56J631m526n484N039J856P846J1154n42l294P729
15623A4803m864r995p954m68l36l442m967r93K980P625O257j412M756L806k779
$$ plain form
15730 -2216 -5362 -4336 1464 5994 9557 5305 165 -3896 -7890 -2457 3465 2441 -2956 -2187 -1550
15715 -1550 -2353 229 -1071 -270 4784 1122 -1526 -4656 -4009 -3674 -7815 -12133 -13360 -1466 874
15700 874 1365 -6758 -5621 -674 2590 3252 -2017 -2112 -1104 -8842 -7618 906 4330 53 -715 -2986
15684 -2986 5645 15037 16059 16116 12409 14482 19477 11745 5786 -1896 -368 -1788 -6456 -7118 -5809
15669 -5809 -1638 6397 5945 1203 1884 -1680 -1849 986 -1550 -14132 -15724 -10340 -3141 -180 540
15654 540 2297 2020 1671 1421 -191 -3583 -11923 -11816 -5194 1358 1558 -2394 -5068 -7089 -4299 -2849
15638 -2849 -9355 -16962 -15733 -7362 -6606 -4975 -9501 -14985 -9946 -8090 -244 10910 10368 7074 14803
15623 14803 9939 -56 -8010 -8478 -8814 -12256 -17223 -18216 -15236 -7611 -1354 -2766 1990 5796 3017
15608C017n925L255K020l409k722k920k834M705p94j822Q108R976n430j860L121
15593F486m910K207L672j980l753J824K099l384O8m187j502q962L074j942O02
15578a0588O287O788m097J263r33j0506M530J3105n111j1273K327P880k100k670
15564e098q83l653M479M290J210p81m004m650K510O922K55O51Q315k081j4648
15549g166n080L686J437l100l141k392M609J611K23L845K508J680J281r60J264
15534C05J89j69L481Q182l972j43M633J297k959l885o043j827k381m113n369P08
15518a2066M711N78P130P581k176m57K179n318l587o72m225M287P744M588n995
15503D302m571k024q791L812K804p03l327n183L09L05N88O485j063m389l173K015
$$ plain form
15608 3017 -2908 347 2367 -1042 -3764 -6684 -9518 -4813 -5607 -7429 679 10655 5225 3365 6486
15593 6486 1576 3783 7455 5475 1722 3546 5645 2261 2329 -1858 -3360 -12322 -9248 -11190 -10588
15578 -10588 -4301 2487 -1610 -347 -1280 -11786 -7256 5849 738 -10535 -8208 -328 -2428 -5098
15564 -5098 -5981 -9634 -5155 -865 345 -436 -4440 -9090 -6580 342 597 1248 9563 7482 -7166
15549 -7166 -12246 -8560 -7123 -10223 -13364 -15756 -11147 -9536 -9313 -5468 -2960 -1280 1 -959 305
15534 305 494 325 3806 11988 8016 7873 12506 13803 10844 6959 916 -911 -3292 -7405 -12774 -12066
15518 -12066 -7355 -6777 353 7934 5758 5301 7480 2162 -1425 -2097 -6322 -2035 5709 10297 4302
15503 4302 -269 -2293 -11084 -7272 -4468 -5171 -8498 -13681 -13372 -13067 -12479 -5994 -7057 -11446 -14619 -12604
15487a2604P735J556J16K469J990J620N474M66l961j215J610K990q145r147M062
15472d984J049K619M346J592o835j640N059m518o750r67J456O965Q667J263o33
15457F689k767m066j329n917K500p00r7L367J874K481l769J088O263l358l222
15442i63N908J900J672J578k153O33L965q169o707N074M302l088L987q63O34m555
15426C155n498l273N640M777J11p99N68k073L493L127p135n278m009Q007R54o96
15410A071M038j888o846m960J75j02J761J671o043j910P950M332Q54L951k680
15395A374o000K150m345M455K701j174N90l820m708M759q21m088L908j08l83M194
15379a316K194l086J539M199k823r167l862L437J3333R455k267l988n867o289
$$ plain form
15487 -12604 -4869 -3313 -3197 -728 1262 2882 8356 8822 4861 3646 5256 8246 101 -9046 -4984
15472 -4984 -3935 -1316 3030 4622 -2213 -3853 1206 -3312 -10062 -11029 -9573 -2608 6059 7322 6689
15457 6689 3922 -144 -1473 -7390 -4890 -5590 -5687 -2320 -446 2035 -1734 -646 5617 2259 -963
15442 -963 4945 6845 8517 10095 7942 8575 12540 4371 -2336 2738 7040 3952 7939 7076 7710 3155
15426 3155 -2343 -5616 24 4801 4912 4113 4681 2608 6101 9228 2093 -3185 -7194 813 1767 1071
15410 1071 5109 3221 -3625 -8585 -8410 -8512 -6751 -5080 -11123 -13033 -5083 -751 103 4054 1374
15395 1374 -4626 -2476 -6821 -2366 335 -839 -249 -4069 -8777 -4018 -4839 -8927 -5019 -5127 -5510 -1316
15379 -1316 878 -2208 -669 3530 707 -8460 -12322 -8885 4448 13903 11636 7648 1781 -4508
15365d508n1M045J806O803J456q760K786m81P530j691m503K775M795N91k153j602
15349H838l493j3236j089R689K6n115n14N876O728P31J959J645l465K140m516
15334F204N16J214K114o848K898K656o543n775m042k016m03m595K523J4834J997
15319D734j876j155l139j511n03k219n856J400R876L408r08m324j012O475K883
15304F273l887K254k212j415r88p160o587R61N128P025k644k006j09Q17m602K358
15288f794N240q066l977q87Q775N641J313k970o8K574o230m762J799N916M117
15273A621J270n673o59L499O088J456n485k573k0K048K662L774q679o773l543
15258a0987Q282P13o062k386J062L378j214K688l277k017r8N555k354l18K172
$$ plain form
15365 -4508 -4559 -514 1292 8095 9551 791 3577 3096 10626 8935 4432 7207 12002 12593 10440 8838
15349 8838 5345 -7891 -8980 709 735 -4380 -4894 982 7710 8441 10400 12045 8580 10720 6204
15334 6204 6720 7934 10048 3200 6098 8754 2211 -3564 -7606 -9622 -10025 -14620 -12097 2737 4734
15319 4734 2858 1703 -1436 -2947 -3450 -5669 -11525 -10125 -249 3159 2251 -2073 -3085 3390 6273
15304 6273 2386 4640 2428 1013 25 -7135 -13722 -12761 -7633 -608 -3252 -5258 -5367 -4550 -9152 -6794
15288 -6794 -1554 -9620 -13597 -14484 -5709 -68 1245 -1725 -1793 781 -5449 -10211 -8412 -2496 1621
15273 1621 2891 -2782 -3441 58 6146 7602 2117 -456 -476 1572 4234 8008 -671 -7444 -10987
15258 -10987 -2705 -1992 -8054 -10440 -9378 -6000 -7214 -4526 -7803 -9820 -9918 -4363 -6717 -7035 -4863
15243d863j0085N36O539K048M042K203n08J114Q78j058k378l388j081L053K217
15228g31N084m035o173k144j086k306j631J999K290Q31J722j813k188M737L756
15213a688j66j845J214M103J486j697M446p77n107K32L994K027l022k332j173
15198c05K035m315k024l043K75k949o41J035J573l192j357K588P045J0364p245
15183a56n700K662J186o39P312J2336k883r746o06J756q304m808K310L476Q131
15168F327K197M292m15l100P92M25r458q52K182q14j680o09J86O33j04k810O44
15151b164p277J114P079M015J531m098l908K388N551J243k593n188J53o316j388
15136i858p65o059K107N51J0273P565n296J409M379o034n993J397j857m390l115
$$ plain form
15243 -4863 -14948 -14412 -7873 -5825 -1783 420 -88 1026 1904 846 -1532 -4920 -6001 -2948 -731
15228 -731 4353 318 -5855 -7999 -9085 -11391 -13022 -11023 -8733 -7902 -6180 -7993 -10181 -5444 -1688
15213 -1688 -1854 -3699 -2485 1618 3104 1407 5853 5076 -31 201 4195 6222 3200 868 -305
15198 -305 1730 -2585 -4609 -7652 -7377 -10326 -10967 -9932 -8359 -11551 -12908 -10320 -3275 7089 -156
15183 -156 -5856 -3194 -2008 -2647 4665 17001 14118 4372 3766 5522 -2782 -7590 -5280 -1804 6327
15168 6327 8524 12816 12401 9301 10093 10518 1060 208 2390 1576 -104 -713 -527 106 2 -2808 -2164
15151 -2164 -9441 -8327 -1248 2767 4298 200 -3708 -1320 4231 5474 2881 -2307 -2154 -8470 -9858
15136 -9858 -10623 -16682 -14575 -14024 -3751 3814 -1482 -73 4306 -1728 -7721 -6324 -8181 -12571 -15686
15121a5686L184P052J245p649M509O662K419K245J549L109j740l703J397J32J909
15106F634l765J923K534l445n523O43L231l767q871n037Q212M102N308o82j1782
15091a0285k251J0346N063n776l124p539K168J1937M605K98l053p521k024N475
15077a681p64K028l40l944L585N584J443q555l265N286K734m787m881M378N783
15062B604K028j407n52M64J324k785p6L332J013n596o697M48K529n77m776n129
15046a3853N235L274n02K367J034M39K963O150l510l577J753J689k539k575M228
15031B576P005k054J307l856j710J066j083j867q8J382l204n17J081l787k085
15016e834l6R99K553M914J599n192m469q589l371L167J183K46M718L082j935J252
$$ plain form
15121 -15686 -12502 -5450 -4205 -11854 -7345 -683 1736 3981 5530 8639 6899 3196 4593 4725 6634
15106 6634 2869 4792 7326 3881 -1642 -999 2232 -1535 -10406 -15443 -7231 -3129 2179 1497 -10285
15091 -10285 -12536 -2190 2873 -2903 -6027 -13566 -11398 539 5144 5442 2389 -5132 -7156 -1681
15077 -1681 -2445 -417 -757 -4701 -1116 4468 5911 -2644 -5909 -623 2111 -2676 -7557 -3179 2604
15062 2604 4632 3225 2673 3137 4461 1676 1600 4932 5945 349 -6348 -5900 -3371 -3948 -8724 -13853
15046 -13853 -8618 -5344 -5846 -3479 -2445 -2006 957 7107 3597 20 1773 3462 923 -1652 2576
15031 2576 9581 7527 8834 4978 3268 4334 3251 1384 1296 2678 -526 -1043 38 -3749 -5834
15016 -5834 -5870 -4871 -2318 2596 4195 -997 -5466 -14055 -17426 -14259 -13076 -12830 -8112 -5030 -6965 -5713
15000e713m44N12J117J065n478M949J869q566N87N850Q313j777o558M429J833
14985A988l605p34j122ml465q048k262o8O426R282N527L38L039K087m663p265
14969b549k346J1608N755n289k375j260r84m42M147j299J811o85l515k317M036
14954D296j080r495m73R64k571P503M698n194k832M801J014n037k390L040K023
14939g33L108k751k07P541K263K914k436o996k448n572p221m214P776J0244M909
14924F177l972k947N72K744M020k965j560m795m577o80L428l271J191Q116N319
14909F800o613m093K322k143k680p969k911O92M662K394N24J2o114O459N836r32
14893c754j4O2K046N116L176q822q377N253O651J992k017r60K449N236q32k582
$$ plain form
15000 -5713 -6157 -5645 -4528 -3463 -8941 -3992 -2123 -10689 -10102 -4252 4061 2284 -4274 155 1988
14985 1988 -1617 -2351 -3473 -3477 -6942 -14990 -17252 -17320 -10894 -1612 3915 4253 7292 9379 4716 -2549
14969 -2549 -4895 6713 12468 7179 4804 3544 2560 2118 6265 4966 6777 6092 2577 260 4296
14954 4296 3216 -6279 -6752 -5788 -8359 -856 3842 -1352 -4184 617 1631 -3406 -5796 -2756 -733
14939 -733 2375 -376 -583 6958 9221 12135 9699 2703 255 -5317 -12538 -16752 -8976 1268 6177
14924 6177 2205 -742 -170 2574 6594 3629 2069 -2726 -7303 -7983 -4555 -7826 -6635 1481 6800
14909 6800 187 -3906 -1584 -3727 -6407 -14376 -17287 -16595 -11933 -9539 -9015 -9003 -15117 -8658 -2822 -3754
14893 -3754 -3768 -3706 -1660 3456 6632 -2190 -10567 -5314 1337 3329 1312 352 2801 8037 7205 4623
14877D623n90K450N372k143p714n465r97l447l222J233k495J619L269Q20N99p997
14861a4085K840j007kN696Q504m09J429p492o008p52K606J505l43J543M056L864
14845A945j662n74m143K027o63L508n93m830J55k13j424R5J718p94K743J071n338
14828f972l724J245K450L116n405r119L93m83n227L633R669K566o905n924M131
14813a6556O228N745o202k251P786O711K19l000j555J0745N47o374L902M679j649
14798H975n289p370r41N248l651l612k893k222O086R858J873l088m37N976J383
14783I896m497m069n43M705k55r923J939N338n994q977Q68O984L921J316K669
14768C378L534k445m785m725M728N58N82o234l857M403k808n762M65N007P033
$$ plain form
14877 4623 4033 6483 11855 9712 1998 -3467 -4464 -7911 -11133 -9900 -12395 -10776 -7507 -6687 -6088 -14085
14861 -14085 -11245 -12252 -12254 -6558 1946 1537 2966 -4526 -10534 -11286 -8680 -7175 -7518 -5975 -1919 1945
14845 1945 283 -291 -4434 -2407 -3070 438 -155 -4985 -4830 -5043 -6467 -6372 -4654 -5448 -2705 -1634 -6972
14828 -6972 -10696 -9451 -7001 -3885 -9290 -18409 -18016 -18499 -23726 -20093 -10424 -7858 -14763 -20687 -16556
14813 -16556 -10328 -4583 -10785 -13036 -5250 1461 1680 -1320 -2875 7870 8417 2043 5945 10624 8975
14798 8975 3686 -3684 -4625 623 -3028 -6640 -9533 -11755 -5669 4189 6062 2974 2537 8513 9896
14783 9896 5399 1330 787 5492 5237 -4686 -2747 2591 -3403 -12380 -11512 -4528 -607 709 3378
14768 3378 6912 4467 -318 -5043 -315 243 825 -5409 -9266 -4863 -7671 -13433 -12968 -7961 -928
14753i28o695J702K549K388j14M523l109l506k542k681L755P21J651L439m989
14738c836N278n173k424L015M037R609Q757k402k752l703k145O22m818k771J101
14723B395K925m129L348J966m128j697l480K785N102n79m797K794k341k767M027
14708A424O41o50J13k398N9N971o536Q53M204l430K94J63K158N08p76L34l003
14691g1j085k105q212m177L889P335j935o07m023m70J803K571M506M91n227K482
14675d835J803j353m267k180J0255R116O157l994l215L41J103O160l075l945j479
14660F592K451l902r775M452L290n302m190Q422Q118l879o020j162L258n73N24
14645B304l153r784j330M65K986N658K307o709m635J57j879K431n59j472J896
$$ plain form
14753 -928 -7623 -5921 -3372 -984 -1098 3425 316 -3190 -5732 -8413 -4658 -3937 -2286 1153 -3836
14738 -3836 1442 -3731 -6155 -3140 897 10506 19263 16861 14109 10406 8261 8883 4065 1294 2395
14723 2395 5320 1191 4539 6505 2377 680 -2800 -15 5087 4508 -289 2505 164 -2603 1424
14708 1424 2065 1415 1528 -870 -811 5160 -1376 -523 3681 251 545 708 2866 3374 2598 2932 -71
14691 -71 -1156 -3261 -11473 -15650 -11761 -4426 -6361 -6968 -10991 -11461 -9658 -7087 -2581 -2090 -7317 -4835
14675 -4835 -3032 -4385 -8652 -10832 -577 8539 14696 10702 7487 7828 8931 15091 12016 8071 6592
14660 6592 9043 5141 -4634 -182 3108 -2194 -6384 2038 10156 6277 257 -905 2353 1780 2304
14645 2304 -849 -10633 -11963 -11498 -8512 -2854 -547 -7256 -11891 -11734 -13613 -11182 -11741 -13213 -11317
14630a1317n875M74J1580K804O98k803O787j343l104N310M777K625l267o666k723
14615b043n476p121K526J0449J532n06L661m882J368J491j332m180o477J248P117
14600b625P07j540j282N238R430k272o120n710n12O909K914j661K400K455J232
14585I563p752l259n360o224Q58O495K540j978J666O206M983k183J323N415j425
14570A0868n923m135m164j495L971K892M080O382m402o664m001L834N065o14o041
14555c47j721J361o7l656j650Q476P602N634p160p712n925M940j089L257k206
14540b63j0110M522J610m585o49J0588L32k958m069m301J631J373K689J0195k24
14525E781r36J882k138O525K648q166K02k778m242J979K989n802j292N828p771
$$ plain form
14630 -11317 -17192 -16718 -5138 -2334 -1636 -4439 2348 1005 -2099 3211 7988 10613 7346 680 -2043
14615 -2043 -7519 -14640 -12114 -1665 -133 -639 3022 -1860 -492 999 -333 -4513 -10990 -9742 -2625
14600 -2625 -1918 -3458 -4740 498 9928 7656 1536 -4174 -4686 2223 5137 3476 5876 8331 9563
14585 9563 1811 -1448 -6808 -13032 -12174 -5679 -3139 -5117 -3451 2755 7738 5555 6878 12293 10868
14570 10868 4945 810 -3354 -4849 -878 2014 6094 12476 8074 1410 -2591 1243 6308 5694 -347
14555 -347 -2068 -707 -774 -4430 -6080 2396 9998 15632 8472 760 -5165 -225 -1314 1943 -263
14540 -263 -10373 -5851 -4241 -8826 -9475 1113 1445 -1513 -5582 -9883 -8252 -6879 -4190 6005 5781
14525 5781 4845 6727 4589 11114 13762 5596 5798 3020 -1222 757 3746 -2056 -3348 2480 -5291
14510e291K229L918K95j152k963M183J136j1j961l053j102J041o133O73K800N233
14494a58m466P86j751L322p45l634p090M119m097j162M843J577K240J029j662
14479f849K626k445N993O397j840l277p159m986L042L820J823K04l399M099J673
14464b78j857k069n18K765r82k580K913n014k695m749L295Q044l666m262M943
14449f710J817l944k641J558K110K049N330N454j824q655K380m607j516r54N153
14434e000K385l061l150o515q10J500M358M573N27J72J071L008j800j479m544
14419h765J6O570N144L994N144j0110j0048K706O320k156k641J847o13M328k703
14404i67J577Q68K248k293l558R65J512P863j445q287J203N959l250m27l973l165
$$ plain form
14510 -5291 -3062 856 1151 -1 -2964 1219 2355 2344 383 -2670 -3772 -2731 -8864 -8191 -5391 -158
14494 -158 -4624 -3838 -5589 -2267 -3012 -6646 -13736 -9617 -13714 -14876 -10033 -8456 -6216 -5187 -6849
14479 -6849 -4223 -6668 -675 5722 3882 605 -6554 -11540 -8498 -4678 -2855 -2651 -6050 -1951 -278
14464 -278 -2135 -4204 -4722 -1957 -2939 -5519 -2606 -7620 -10315 -15064 -11769 -3725 -7391 -11653 -6710
14449 -6710 -4893 -8837 -11478 -9920 -7810 -5761 -431 5023 3199 -5456 -3076 -7683 -9199 -10153 -5000
14434 -5000 -2615 -5676 -8826 -15341 -16151 -14651 -10293 -5720 -5193 -5021 -3950 -942 -2742 -4221 -8765
14419 -8765 -8749 -2179 2965 6959 12103 1993 -8055 -5349 971 -1185 -3826 -1979 -2592 1736 -967
14404 -967 610 1478 3726 1433 -2125 -1160 352 8215 6770 -1517 -314 5645 2395 1968 -2005 -5170
14388e170J319j046K324M984j789p112k091l143p94O747K801M774M343m429K808
14373D526O170k410j3204n047L285J255n820K91N899r52q62J087r4j025R77l611
14357i535N039M16k73J314L565m342o328o15k86L88n70K793M120p11N286K614
14341B875q69j313o534n867O55K817K956J67J350j060L070k882k146j035N555
14326b261p0q464L61m017l195l768j54Q611R732P723j065j464k898r4K587n20
14310A044j605M072L397M177r053j017J416l54j637K422J032j17j4491n374P24
14295a5364P068O423L062P917O171J912o515l088m33k994L198l837k745R3J863
14280B731K677n623o233l484L639J629L945Q332n751j2969O312J274j634K374
$$ plain form
14388 -5170 -3851 -4897 -2573 2411 622 -6490 -8581 -11724 -12518 -5771 -2970 1804 6147 1718 4526
14373 4526 10696 8286 -4918 -9965 -6680 -5425 -11245 -10954 -5055 -6007 -6869 -5782 -5876 -6901 -5924 -9535
14357 -9535 -4496 -4080 -4353 -3039 526 -3816 -10144 -10759 -11045 -10657 -11227 -8434 -4314 -5025 261 2875
14341 2875 2006 693 -5841 -11708 -11053 -8236 -5280 -5113 -3763 -4823 -1753 -4635 -6781 -7816 -2261
14326 -2261 -2331 -10795 -10434 -14451 -17646 -21414 -21568 -12957 -3225 4498 3433 1969 -929 -1023 1564 1044
14310 1044 -561 3511 6908 11085 2032 1015 2431 2077 440 2862 3894 3777 -10714 -16088 -15364
14295 -15364 -8296 -1873 1189 9106 15277 17189 10674 7586 7153 4159 7357 3520 775 868 2731
14280 2731 5408 -215 -6448 -9932 -6293 -4664 -719 7613 1862 -11107 -4795 -3521 -5155 -2781
14266b781Q27o186n96J557O792N445n851m172K832m388k831N065J223K328K241
14251A505p86R08J976j407l763r790k069L666K472N852L830N556m794l802k078
14236b724o126L476L107M271P653p70r59m381j176K11q414m040L623M048l53l549
14220f103M524L522m3p329K660Q597L047o622o914K241r60K470J699p55J11k223
14204b078l055J86N339K449k023k661O651l76m309m311k253K038K398K594N006
14189E595j792o789M839M305j0934j2861K450O616J414L800Q446J552m307m277
14175a943n66O794o487r618L841J0147K339m457J343m498L996r94k340J460K877
14160A894R855N202n451k212r19J469m172j708K857j527k475N116R65k714p166
$$ plain form
14266 -2781 -1954 -8140 -8736 -7179 -387 5058 -793 -4965 -2133 -6521 -9352 -4287 -3064 -736 1505
14251 1505 719 1627 3603 2196 -1567 -11357 -13426 -9760 -7288 -1436 2394 7950 3156 -646 -2724
14236 -2724 -8850 -5374 -2267 2004 9657 8887 7928 3547 2371 2582 -5832 -9872 -6249 -2201 -2554 -6103
14220 -6103 -1579 1943 1900 -5429 -2769 5828 8875 2253 -4661 -2420 -3380 -910 789 34 145 -2078
14204 -2078 -5133 -4947 392 2841 818 -1843 4808 4432 123 -4188 -6441 -4403 -2005 589 5595
14189 5595 3803 -2986 1853 6158 -4776 -17637 -15187 -8571 -7157 -3357 5089 6641 2334 -1943
14175 -1943 -2509 4285 -2202 -11820 -7979 2168 4507 50 1393 -3105 891 -103 -2443 -983 1894
14160 1894 11749 16951 11500 9288 8369 9838 5666 3958 6815 5288 2813 7929 8894 6180 -986
14145i86l318j741k619O802N649M38p459n210m364o434j31N745K282O49J099M099
14129e499L152K951J569j303j084M794J543o304m339j602J869m838n249J502l99
14114a3237q70J414N993K392k515k906M496j937K251P147m07j446L527k064m342
14099b504p426K25M609M016j817K495k750k676K824O929J872J205J889k998m28
14084E465j540o954o689N373M235K102R00Q503J030m293m704J988K21j910m036
14069c09K001K907r848l145L527j073L179K53J161L391M086q077l280m134L05
14054i056M538j123N359K609M038M755K780l928l438q14O55n887l581L453n470
14039e110K74P471J757k986L230M362j497j0434o349P741Q13j76O558L329k237
$$ plain form
14145 -986 -4304 -6045 -8664 -1862 3787 4225 -3234 -8444 -12808 -19242 -19373 -13628 -11346 -10697 -9598 -5499
14129 -5499 -2347 604 2173 870 -214 4580 6123 -181 -4520 -6122 -4253 -9091 -14340 -12838 -13237
14114 -13237 -14107 -12693 -6700 -4308 -6823 -9729 -5233 -7170 -4919 2228 1821 375 3902 1838 -2504
14099 -2504 -9930 -9705 -5096 -1080 -2897 -402 -3152 -5828 -3004 3925 5797 7002 8891 5893 5465
14084 5465 3925 -3029 -9718 -4345 -110 1992 2892 11395 12425 8132 3428 5416 5637 3727 -309
14069 -309 1692 4599 -5249 -8394 -4867 -5940 -2761 -2508 -1347 2044 6130 -1947 -5227 -9361 -9056
14054 -9056 -4518 -5641 -282 2327 6365 11120 13900 9972 6534 5720 6375 488 -3093 360 -5110
14039 -5110 -4836 2635 4392 1406 4636 8998 7501 -2933 -9282 -1541 -728 -904 5654 8983 6746
14024F746l008l62l321K062Q25m724j311J589M074K60j064n740j028m526k891
14009a2419K936r840K119P039N499j345K98k780m368K965M311J03L548j39K103
13994C0K406R70K649j648q054L325P85k839q70L135R06P65p798M267k197n451
13978i619k998L745L993K251n884o022J2728R458J278m982o014O448J479p502
13964a641m464N113p11n59l656M281M559J699l961n148o662m297J3322O829k829
13949A875M129J314n244j841r87j0121J11j696L484K972j131K127N495l999k477
13934e989L920J522j666K836Q03L040Q89n856j499O607P092l780n983n677L52
13919c389k079J843k31L78K091L421M313j067p826k858M78q483q954Q692Q028
$$ plain form
14024 6746 3738 3376 55 2117 2942 -1782 -3093 -1504 2570 2830 1766 -3974 -5002 -9528 -12419
14009 -12419 -9483 -19323 -17204 -10165 -4666 -6011 -5713 -8493 -12861 -9896 -5585 -5482 -1934 -2073 30
13994 30 2436 3406 6055 4407 -3647 -322 463 -2376 -3246 -111 795 1560 -6238 -1971 -4168 -9619
13978 -9619 -12617 -8872 -4879 -2628 -8512 -14534 -1806 7652 8930 3948 -2066 4382 5861 -1641
13964 -1641 -6105 -992 -1703 -2262 -5918 -1637 2922 4621 660 -4488 -11150 -15447 -2125 4704 1875
13949 1875 6004 7318 2074 233 -754 -10875 -10764 -12460 -8976 -6004 -7135 -5008 487 -3512 -5989
13934 -5989 -2069 -547 -2213 623 1426 4466 5355 -501 -2000 4607 11699 7919 1936 -3741 -3389
13919 -3389 -5468 -3625 -3856 -3478 -1387 2034 6347 5280 -2546 -5404 -4926 -13409 -22363 -13671 -5643
13904e643l8P03M156Q30j669l492j745j164n41L580l644P460O010l014n351Q53
13888b709k233m400M932m870k455J0668Q758Q78l120m061l350k142K951j712M76
13873b389k431O577K631r341M16J209K508O341J773M32o370p928r84n391k78N182
13857h043P940L731J088j902l352J777O778q922r102P186M567n536l834k460R45
13842i139J446L103n450j529J114Q26p291l067O960J0145o71l172m440L602L455
13827d108n20m592J582J987J375j401o752J954l487J648P234o75k110n32P380
13812a017P219l866m968N900O13j935l475r240m008O607Q620J508l461l778k573
13797g854k582k595r90n50Q536L987j082O33p76J078K547J301K781o527p201j068
$$ plain form
13904 -5643 -5681 -4978 -822 8 -1661 -5153 -6898 -8062 -8603 -5023 -8667 -1207 4803 1789 -3562 -2709
13888 -2709 -4942 -9342 -4410 -9280 -11735 -1067 7691 8569 5449 1388 -1962 -4104 -1153 -2865 -2389
13873 -2389 -4820 1757 4388 -4953 -4537 -3328 -820 5521 7294 7726 1356 -6572 -7556 -12947 -13225 -8043
13857 -8043 -103 3628 4716 2814 -538 1239 8017 -905 -10007 -2821 1746 -3790 -7624 -10084 -9139
13842 -9139 -7693 -4590 -10040 -11569 -10455 -9629 -16920 -19987 -13027 -2882 -3553 -6725 -11165 -7563 -4108
13827 -4108 -4628 -9220 -7638 -5651 -4276 -5677 -12429 -10475 -13962 -12314 -5080 -5755 -7865 -8397 -1017
13812 -1017 6202 2336 -2632 3268 3881 1946 -1529 -10769 -14777 -8170 450 1958 -1503 -5281 -7854
13797 -7854 -10436 -13031 -14021 -14571 -6035 -2048 -3130 -2497 -3273 -2195 352 1653 4434 -2093 -9294 -10362
13781a0362J081M079N72j57j48N084N926q33p221j281L287N198m04k406p552n045
13765a0182j150J361L082O557L434M370j521r067l560n806m14j686L848M441O762
13750D69k389r190p885L030O648K616n374K449K927k555M364J537P486M951p63
13735H321j024o031m534j832k519n679L82Q600O843L214j530J696o488p651N271
13720b961P470n653L96L360m491J053k239K952L088J525m14M813P830l908p682
13705E139l450o129k364k216K340j018j63P69q59j084M828K869n653Q14L37M178
13689a662Q78j560m787K217M134N192q602j3658j092O111Q85M898j482M405O719
13674B596M63k588q3m018K339l960L152Q74r34N329j271l352k809K21n32Q12J0961
$$ plain form
13781 -10362 -9281 -5202 -4630 -4787 -4935 149 6075 5242 -1979 -3260 27 5225 4821 2415 -5137 -10182
13765 -10182 -11332 -9971 -6889 -332 3102 7472 5951 -3116 -6676 -12482 -12896 -14582 -10734 -6293 469
13750 469 -1920 -11110 -18995 -15965 -9317 -6701 -12075 -9626 -6699 -9254 -4890 -3353 4133 9084 8321
13735 8321 7297 1266 -3268 -5100 -7619 -13298 -12916 -4316 2527 5741 4211 5907 -581 -8232 -2961
13720 -2961 4509 -1144 -748 2612 -1879 -826 -3065 -113 2975 4500 4086 8899 16729 12821 5139
13705 5139 1689 -4440 -6804 -9020 -6680 -7698 -7861 -7092 -7951 -9035 -4207 -1338 -6991 -6177 -5840 -1662
13689 -1662 -784 -2344 -7131 -4914 -780 4412 -4190 -17848 -18940 -12829 -11944 -7046 -8528 -4123 2596
13674 2596 3059 471 388 -3630 -1291 -5251 -2099 -1225 -2159 3170 1899 -1453 -4262 -4041 -4573 -3761 7200
13657G200n45n294n14j141O32j947K685p08j293L441j387J708N040l212m204K244
13641B705L498q661o455j826R128P536k49J957o960l419M948J091J605P858j159
13626A1597l935n250m267O595o479j90K693M723k98n139J585l057j491N453K57
13611B797L435l30o968K219l76k296j166j72K331K295O614o858j2266p919L302
13596a5358M451P037L486P200k37p150N999M56m781m550J822L130l393j076M602
13581A638j0348M476p73l547Q188o87J14l662j886K696L287n659P19J238P7j109
13565e238n45J923m961m385R20m566k778M333N993m740J278L479K051O477J97
13550e62q343q528K87R128O027j09o749m921p74O029M596L917K504j908L299n62
$$ plain form
13657 7200 6655 1361 847 -294 338 -1609 1076 368 -925 2516 1129 2837 7877 4665 461 2705
13641 2705 6203 -2458 -8913 -10739 -1611 5925 5676 7633 673 -2746 2202 3293 4898 12756 11597
13626 11597 7662 2412 -1855 4740 -1739 -1929 764 5487 5189 50 1635 -1422 -2913 2540 2797
13611 2797 6232 5902 -1066 1153 777 -1519 -2685 -2857 -526 1769 8383 1525 -10741 -18660 -15358
13596 -15358 -10907 -3870 -384 6816 6579 -571 5428 5884 1103 -3447 -1625 1505 -1888 -2964 1638
13581 1638 -8710 -4234 -5007 -8554 -366 -1053 -939 -4601 -6487 -3791 -504 -6163 -5444 -4206 -4129 -5238
13565 -5238 -5783 -3860 -8821 -13206 -12286 -16852 -19630 -15297 -9304 -14044 -12766 -9287 -7236 -759 -562
13550 -562 -8905 -17433 -17146 -8018 -1991 -2100 -8849 -13770 -14544 -8515 -3919 -2 2502 594 3893 3331
13534C331o212M403M261j936o022q391q18L45K590L152Q067L203p126j1608n101
13519a7862O013j58j2k7N716M223P507M732n114j0428L160p97M823j091k575M522
13503B632j196m83m723k963J480N6r26K653R83n456N13o492O108K553N32p542
13487a2271M691N046P080q58J00k389m261r442m071J403J224L964M055j108k80
13472g117j018M523l215k516n294L685J3447M46o323n078R82R18m509L672Q411
13457A014J1650Q935j927q224j875l659m526j0173l920P198N797l856M059l130
13443b637r153n91R336Q795p18q220o367O053L794n657l409K429O694M025m02
13428C972j651M212k593k457j73k792m639N354J493j765k744l070N007N95l021
$$ plain form
13534 3331 -2881 1522 5783 3847 -2175 -10566 -11384 -11039 -8449 -5297 2770 5973 -1153 -12761 -17862
13519 -17862 -11849 -12007 -12019 -12046 -6330 -2107 5400 10132 5018 -5410 -2250 -3047 1776 685 -1890 2632
13503 2632 1436 953 -3770 -6733 -5253 -5197 -6123 -3470 -2487 -7943 -7430 -13922 -7814 -5261 -4729 -12271
13487 -12271 -7580 -2534 4546 3688 3788 1399 -2862 -12304 -16375 -14972 -13748 -9784 -5729 -6837 -7117
13472 -7117 -8135 -3612 -6827 -9343 -14637 -10952 2495 2941 -3382 -8460 -7478 -6560 -11069 -7397 1014
13457 1014 12664 21599 19672 11448 9573 5914 1388 -8785 -12705 -5507 290 -3566 493 -2637
13443 -2637 -11790 -12381 -3045 5750 5032 -3188 -9555 -3502 292 -5365 -8774 -6345 349 4374 3972
13428 3972 2321 6533 3940 1483 1310 -1482 -6121 -767 726 -1039 -3783 -6853 -1846 -1251 -4272
13413d272l163j840K346K528m315K361M024N85q608n316J864J0919N327k640K170
13398A970l6j123O37O570P62r094o636K499J807k463r49k107r28P783Q42J928
13382A462J541j1896k123O652J463n225O111N240l835l898J556p853K655L034
13368e116r85K363K062o67l187j0L479l788Q74J152J088L591k203P31k341O116
13352C159J2173N413K721p396j1843m910J354k902L901J403k762l514L50P111
13338D258J721j533l82N339j414k147K794k170o044m190q676q609N245M19m545
13323a9934J360N680J916L149K432J399m556k740K28K115j459K938k006o31J680
13308h429N881P427j549j165m186O89N070l611n379j178lJ517j176J41k41j57
$$ plain form
13413 -4272 -7435 -9275 -6929 -4401 -8716 -6355 -2331 -1746 -10354 -15670 -13806 -2887 2440 -200 1970
13398 1970 1934 811 1448 8018 8780 -314 -6950 -4451 -2644 -5107 -6056 -8163 -9091 -1308 -466 1462
13382 1462 3003 -8893 -11016 -4364 -2901 -8126 -2015 3225 -610 -4508 -2952 -10805 -8150 -5116
13368 -5116 -6101 -3738 -1676 -2343 -5530 -5540 -2061 -5849 -4975 -3823 -2735 856 -1347 -616 -2957 3159
13352 3159 15332 20745 23466 16070 4227 -683 671 -2231 1670 3073 311 -3203 -2853 4258
13338 4258 5979 4446 4064 9403 7989 5842 8636 6466 422 -3768 -12444 -21053 -15808 -15389 -19934
13323 -19934 -18574 -12894 -10978 -7829 -5397 -3998 -8554 -11294 -11066 -8951 -10410 -7472 -9478 -10109 -8429
13308 -8429 -2548 4879 3330 2165 -2021 -1332 3738 127 -5252 -6430 -6433 -4916 -6092 -5951 -6192 -6349
13292f349O139Q56l241o52M605k501l574L230j489L534J051l745o020k709J248
13277i617O891N616k791p29J338K941n016q827l776M983O852R966n040m999M79
13262a729J799M566p85o976M740M827k951k22J186j487j396l363o064m937K052
13247a0740k854M347L062J131n34j567k496l165J716O519N690k92r76q56L983
13232B968L922n39k282J0105p088r745L346L496j430j094K825N68o07k349j315
13217G81k921m525n019j902R266M991j093l058j351j707j2699j766Q996P532j0292
13202a4767o310N60Q297J0389m033l440m020L572P382L825k422j468n072l330
13188a0837p76O363K634N058J712Q87J656J222j601M087m772q196M290j473N10
$$ plain form
13292 -6349 -210 646 -2595 -3247 1358 -1143 -4717 -1487 -2976 558 1609 -2136 -8156 -10865 -9617
13277 -9617 -2726 2890 99 -630 708 3649 -1367 -10194 -13970 -8987 -2135 7831 2791 -2208 -1729
13262 -1729 70 4636 3851 -3125 1615 6442 3491 3269 4455 2968 1572 -1791 -7855 -12792 -10740
13247 -10740 -13594 -9247 -6185 -5054 -5588 -7155 -9651 -12816 -11100 -4581 1109 817 -159 -1015 2968
13232 2968 6890 6351 4069 14174 7086 -2659 687 4183 2753 1659 4484 5052 4445 2096 781
13217 781 -2140 -6665 -11684 -13586 -4320 671 -422 -3480 -4831 -6538 -19237 -21003 -12007 -4475 -14767
13202 -14767 -21077 -20517 -12220 -1831 -5864 -9304 -13324 -9752 -2370 1455 -967 -2435 -7507 -10837
13188 -10837 -11613 -5250 -2616 2442 4154 5041 6697 7919 6318 10405 5633 -2563 1727 254 764
13173G64qj697N390j541o357n520j631Q578k20N321n115M81L289j1139k337N514
13157f228N308M217J460O064k513L993K175n651m219R0J454o746j264J175q731
13142i416O71L645J385j814J597L194m350j834N292N169j779j705L739L267N6
13127G117n108l728j2277m19R592L654K084J966O496p18p504r463n546J708L010
13112i136N53Q156M801M995j050n50o655j1113k3N24L905L408J64k452j720O62
13096e531L56l993Q21p09n128J742L250M752N642J168p862j964l122k97O732M550
13080D07l959m050J210K780j426O145m690M036J735J295k016l285K803K522p2
13065C435O850R492J702r743p569j1023L639P521m499K507l902l423J1004k976
$$ plain form
13173 764 756 -941 4449 2908 -3449 -8969 -10600 -2022 -2242 3079 -2036 -1555 1734 -9405 -11742 -6228
13157 -6228 -920 3297 4757 10821 8308 12301 14476 8825 4606 4696 6150 -596 -1860 -685 -9416
13142 -9416 -8745 -5100 -3715 -5529 -3932 -738 -5088 -6922 -1630 3539 1760 55 3794 7061 7117
13127 7117 2009 -1719 -13996 -14415 -4823 -1169 915 2881 9377 8659 1155 -8308 -13854 -12146 -9136
13112 -9136 -8583 -427 4374 9369 8319 7769 1114 -9999 -10022 -9498 -5593 -2185 -2021 -4473 -6193 -5531
13096 -5531 -5175 -9168 -8347 -9056 -14184 -12442 -9192 -4440 1202 2370 -5492 -7456 -10578 -10875 -4143 407
13080 407 -3552 -7602 -6392 -3612 -5038 1107 -3583 453 2188 3483 1467 -1818 985 3507 3435
13065 3435 10285 19777 21479 11736 4167 -6856 -3217 4304 -195 2312 -1590 -5013 5991 3015
13051C015n545n762n35n77k407N425L886p92r42l702O371J0424j960p991j168
13036b260O300l043l218N07l661J335j174k491K185j07j521K345k309M65j180
13021g827Q171J891L352N694q52l087r077L264p885k250M697M817k330o84l145
13006e251j584Q132Q168K466l276k786n132L278k300J482J316m075k559n081n333
12991a2535l728M066N644K866k535m891J582P914k9j72j563K411J196L223M84
12976C933r592m008P42K756l704n492Q684J1041L629l89o48j453k362j697o61
12961G79K014m09n649L37M308J57k498N94k85m250J312M764J0309m470n495L341
12945D859l00O13n511m696K125J179M766J043k2l97n155o357l140M903J1630N106
$$ plain form
13051 3015 -2530 -8292 -8827 -9404 -11811 -6386 -2500 -3292 -4234 -7936 -1565 8859 6899 -1092 -2260
13036 -2260 4040 997 -2221 -1714 -5375 -4040 -5214 -7705 -5520 -5627 -7148 -4803 -7112 -6647 -7827
13021 -7827 344 2235 5587 11281 10429 7342 -1735 1529 -6356 -8606 -3909 908 -1422 -2106 -5251
13006 -5251 -6835 1297 9465 11931 8655 5869 737 4015 1715 3197 4513 438 -2121 -7202 -12535
12991 -12535 -16263 -12197 -6553 -3687 -6222 -11113 -9531 -1617 -1646 -1818 -3381 -970 226 3449 3933
12976 3933 -5659 -9667 -8925 -6169 -9873 -15365 -6681 4360 7989 7600 6952 5499 3137 1440 779
12961 779 2793 2384 -3265 -2928 1380 1537 -961 -367 -652 -4902 -3590 1174 11483 7013 1518 4859
12945 4859 4559 5172 -339 -5035 -2910 -1731 3035 4078 4056 3659 -1496 -7853 -10993 -6090 5540 10646
12929A0646j752L323o847l944n528o053M648J177N663J895K1J248j755n773n526
12914h557l144q14L010O518N425k244l98N160L46k600j881J290l510J255M896
12899D752L653L391N845l707n075k252k502l326J992L622K699l312p017k40M856
12884C379j900m987N948L122K956M222m528j2107j044M790j612q68j012l086o795
12869a3522J335J0850N922j539Q61q351P856O261K153n862j1124n856j780j802
12855a4598L835K575L504k64L77N648l212k833J427M524j001j324L029j34m346
12840b793n969j548N555J67k493L50M572K120J205L825k185k155j627n00q74K796
12824D46Q575N310j20l128o32m038k827n311j1144k662O343L119K182j860L576
$$ plain form
12929 10646 8894 12217 5370 1426 -4102 -10155 -5507 -4330 1333 3228 3249 4497 2742 -3031 -8557
12914 -8557 -11701 -12515 -9505 -2987 2438 194 -204 4956 5302 2702 821 2111 -1399 -144 4752
12899 4752 8405 11796 17641 13934 8859 6607 4105 779 2771 6393 9092 5780 -1237 -1477 3379
12884 3379 1479 -3508 2440 5562 8518 12740 8212 -3895 -4939 -149 -1761 -2629 -3641 -6727 -13522
12869 -13522 -12187 -1337 4585 3046 3907 -4444 3412 9673 11826 5964 -5160 -11016 -12796 -14598
12855 -14598 -10763 -8188 -4684 -4948 -4571 1077 -2135 -4968 -3541 983 -18 -1342 1687 1553 -2793
12840 -2793 -8762 -10310 -4755 -4588 -7081 -6731 -2159 -39 1166 4991 2806 651 -976 -1476 -2350 446
12824 446 9021 14331 14211 11083 10451 6413 3586 -1725 -12869 -15531 -9188 -6069 -3887 -5747 -2171
12809b171N154M495M622j040n517l397j480J956M383O399p289q333J306l06k516
12794c734K023j241M055N181l588j186k093n11L662k913r45m415n810k804Q840
12779e479M811r459L002Q305M06m216L648m501L167j532o426L316K142O131m63
12764B852k80j761j780n591m756N738M223M909p531l859M452P60K516L609o000
12749b499n175j518p22N177K910n557l417o749R000J3799k646m415J17N217m699
12734a177k583l09K41n592p54l31P075M810O8J319j094n801K432l142R05k169
12718f102M089M930J358j141k844k875Q91n145L116M268l798R89Q785L491m643
12703E369l420q056m464M336N215M14l972L448j351j280j979n09J457j42N523
$$ plain form
12809 -2171 2983 7478 12100 11060 5543 2146 666 2622 7005 13404 6115 -2218 -912 -1218 -3734
12794 -3734 -1711 -2952 1103 6284 2696 1510 -583 -1094 2568 -345 -1290 -5705 -11515 -14319 -5479
12779 -5479 -668 -10127 -7125 1180 1586 -2630 1018 -3483 -316 -1848 -8274 -4958 -2816 3315 2852
12764 2852 2572 811 -969 -6560 -11316 -5578 -1355 3554 -3977 -7836 -3384 -2624 -108 3501 -2499
12749 -2499 -7674 -9192 -9914 -4737 -1827 -7384 -10801 -17550 -8550 5249 2603 -1812 -1695 3522 -1177
12734 -1177 -3760 -4069 -3828 -9420 -10174 -10505 -3430 1380 1448 2767 1673 -4128 -1696 -4838 -3933 -6102
12718 -6102 -2013 2917 4275 3134 290 -2585 -1694 -6839 -3723 545 -3253 -2264 6521 10012 5369
12703 5369 1949 -6107 -10571 -6235 -1020 -606 -4578 -1130 -2481 -3761 -5740 -6249 -4792 -4934 589
12688E89J799p28o498k449k562L416n05J157L646j907L311O270L977J219k899
12673G836o660M479N825o045l32j233M649L517o610m528k348L160J0M867n05m250
12657A832M405k473p279l135j49r02j843K131L339L028k335K092qJ253K767k019
12641G04K973O364m714k132m666j30Q975K287k83J558l026j118K695l644q109
12626b266k859l24n344p187O306L65J817O785j750P499N503n529l886l151J89
12611c832P557R75o742M598M592L827J545m162m711p382l473l834L714M097l867
12596g098m761j47j792J927P222P050m08J310n987l624O421o26l779J895O19j682
12580c460q816m732R034O341N250j406q728q751J647L535P8Q11K626j029J765
$$ plain form
12688 589 2388 1660 -4838 -7287 -9849 -6433 -6938 -5781 -2135 -4042 -731 5539 9516 10735 7836
12673 7836 1176 5655 11480 5435 5103 3870 8519 12036 5426 898 -1450 1710 1720 6587 6082 1832
12657 1832 6237 3764 -3515 -6650 -6799 -7701 -9544 -7413 -4074 -1046 -3381 -1289 -1297 -44 2723 704
12641 704 3677 10041 5327 3195 -1471 -1601 7374 9661 9378 10936 7910 6792 9487 5843 -2266
12626 -2266 -5125 -5449 -10793 -17980 -11674 -11309 -9492 -2707 -4457 3042 8545 3016 -870 -4021 -3832
12611 -3832 3725 4700 -2042 2556 7148 10975 12520 8358 3647 -3735 -7208 -11042 -7328 -3231 -7098
12596 -7098 -11859 -12006 -13798 -11871 -4649 2401 1993 3303 -2684 -6308 113 -513 -4292 -2397 -1778 -3460
12580 -3460 -12276 -17008 -7974 -1633 3617 2211 -6517 -15268 -13621 -10086 -10008 -9197 -6571 -7600 -5835
12565e835N249P06q440J452L604J389p982o576K890K01K991J166K818R57n051
12550a0461Q409n103j756n125p58J888l02J387j711M344k156l760j44O468j595
12535a0375K839P806m122j067O397j264k389k20J357J782J122J313J684n736p079
12520g952p658l559j322j641J764M179o79N88K805r16N298N594R26Q23l415L619
12504a546j464l018M183J165N203J030L262Mq065J28O78J507j35j431j200m753
12488d452P97j064l764k50N058j36j24O443N298L212N933O55R345J3444k638q179
12472B9578m430q509l553o291o615k70j709R650M804m74m646j661j982N313M04
12457I609n049n656n023Q68M146k002k59J888K967N611R55K190p4n798n529k153
$$ plain form
12565 -5835 -586 120 -8320 -6868 -3264 -1875 -9857 -16433 -13543 -13342 -10351 -9185 -6367 -5410 -10461
12550 -10461 -2052 -7155 -8911 -14036 -14794 -12906 -13208 -11821 -13532 -9188 -11344 -15104 -15248 -8780 -10375
12535 -10375 -7536 270 -3852 -4919 1478 214 -2175 -2395 -1038 744 1866 3179 4863 -873 -7952
12520 -7952 -15610 -19169 -20491 -22132 -20368 -16189 -16868 -16280 -13475 -14391 -9093 -3499 -2573 -1750 -5165 -1546
12504 -1546 -3010 -6028 -1845 -680 4523 5553 8815 8819 754 882 1560 3067 2932 1501 301 -4452
12488 -4452 -3655 -4719 -8483 -8733 -3675 -3811 -3935 2508 7806 11018 16951 17606 26951 40395 37757 29578
12472 29578 25148 16639 13086 6795 180 -90 -1799 7851 12655 12181 7535 5874 3892 9205 9609
12457 9609 4560 -1096 -6119 -5251 -1105 -3107 -3366 -1478 1489 7100 8055 10245 10171 4373 -1156 -3309
12441c309Q427L998L943p621m128p9j119M53p811l324j050J959Q14P05L163k419
12425g398J851k724Q023K096J582n046r243K546Q10J567K631l045l734j826Q275
12410c635O410l594M711M71n677l88K999k727k738Q54k127N67L088J905N479K441
12394H039M204k472j442n545r106n4L274m356M952J071rp43K113J486m28n273
12378d289J619K708o543p261K249M854l111k11m19L418R615R374O00o951n655
12363cl463J498j57M708J602l908m846j723l104L066R68M607K283n204N85N410
12347B319k769P56R680m358k950p667l484K482n565J368L563M672j685o47N14
12332c771k52l224P350j260j39L217K305j092J380K815l670o787N082K739n973
$$ plain form
12441 -3309 5118 9116 13059 5438 1310 1231 112 565 -7246 -10570 -11620 -9661 -8847 -8142 -4979 -7398
12425 -7398 -5547 -8271 -248 1848 3430 -1616 -10859 -8313 -7503 -5936 -3305 -6350 -10084 -11910 -3635
12410 -3635 2775 -819 3892 4363 -1314 -1702 1297 -1430 -4168 -3314 -5441 -4874 -1786 119 5598 8039
12394 8039 12243 9771 8329 2784 -6322 -6376 -3102 -7458 -2506 -1435 -1444 -2187 -74 1412 984 -4289
12378 -4289 -2670 38 -6505 -13766 -11517 -6663 -9774 -9985 -10404 -6986 2629 12003 12603 5652 -3
12363 -3 -3466 -1968 -2125 2583 4185 277 -4569 -6292 -9396 -6330 -5362 -755 1528 -3676 -3091 2319
12347 2319 -450 306 9986 5628 2678 -4989 -8473 -5991 -11556 -10188 -6625 -1953 -3638 -4285 -3771
12332 -3771 -4023 -7247 103 -1157 -1296 1921 4226 3134 4514 7329 3659 -3128 1954 4693 -1280
12317a280o622j508P234O81P84Q63m009n246L095K511j116J27J542P553N1n548
12301h88q312P686P99K752l939l742k163Q582J2533J93n231K452k055r506o202
12286g041Q72N209J991k97n162m878J861J948p927j759O290K226n54M226p901
12271a0896K275R850K694j541O93o9m830r141K163J2828N78O90k578k34j554o525
12255e597N19k69l166j194O88M609J96O168R75n961o593J237O831Q778J942n792
12239C371k567k214o113m601J336Q0K152M650J128k486l02N103M400K330m011
12224B256m885L525K943M202M374o541m189N206J405l706J504J568k171r206o885
12209a0600M991M271N184m281J069L890J540k033k952N503l626N40N35m239L075
$$ plain form
12317 -1280 -7902 -9410 -2176 -1495 -711 152 -3857 -9103 -6008 -3497 -4613 -4486 -2944 4609 4660 -888
12301 -888 -9200 -1514 -715 2037 -1902 -5644 -7807 775 13308 13501 8270 10722 8667 -839 -7041
12286 -7041 -6169 -960 1031 734 -4428 -9306 -7445 -5497 -13424 -15183 -8893 -6667 -7221 -2995 -10896
12271 -10896 -8621 1229 3923 2382 3075 3006 -1824 -10965 -8802 4026 4604 5294 2716 2482 928 -5597
12255 -5597 -5078 -5347 -8513 -9707 -9019 -4410 -4214 1954 2929 -3032 -9625 -8388 -1557 7221 9163 3371
12239 3371 804 -1410 -7523 -12124 -10788 -10708 -8556 -3906 -2778 -5264 -5566 -463 3937 6267 2256
12224 2256 -2629 896 3839 8041 12415 5874 1685 6891 8296 4590 6094 7662 5491 -3715 -10600
12209 -10600 -5609 -1338 3846 -435 634 4524 6064 4031 1079 6582 2956 3496 4031 -208 2867
12194B867K523n606k644l625j888j866L688K074M998j054M87m172n669J962J162
12179f763M351K115P042O140n075L398m39j2646m026l00J573j387J641M98o637
12164a0515n27R9J291K326M68P330M478m128n74J903M337l958L979L324o467m908
12148a542k008J195m530K250P082k47p043N803N891K525K066n050m422J624K671
12133F265K835K042o3m520L024Q059m506j0127k348j95M44n29J356j913N26K337
12117B687K278P539K747P7n329j444j262J051J632l66L742O998P189k075m242
12102B1222n051q516k677L3J940M158q776n088O19j0481O373L934L430j58l895
12087b933M894N830j562r211M88J3645L465l441q019K004o98l771J204N249K850
$$ plain form
12194 2867 5390 -216 -2860 -6485 -8373 -10239 -6551 -4477 521 -533 -46 -4218 -9887 -7925 -6763
12179 -6763 -2412 -297 6745 12885 7810 11208 10769 -1877 -5903 -6203 -4630 -6017 -4376 -3878 -10515
12164 -10515 -11042 -10943 -9652 -7326 -6858 472 4950 822 248 2151 6488 2530 6509 9833 3366 -1542
12148 -1542 -3550 -2355 -6885 -4635 2447 2200 -4843 960 6851 9376 11442 6392 1970 3594 6265
12133 6265 9100 11142 11079 6559 9583 17642 13136 3009 661 466 910 381 1737 -176 350 2687
12117 2687 4965 12504 15251 15328 9999 8555 7293 8344 9976 9610 13352 20350 27539 25464 21222
12102 21222 16171 7655 4978 5011 6951 11109 2333 -2755 -2136 -12617 -6244 -2310 1120 962 -2933
12087 -2933 1961 7791 6229 -2982 -2494 11151 14616 11175 3156 5160 4462 691 1895 7144 9994
12072I994R928Q341N662k739n806n971l117j148m446q174l123q0j275J744N029
12057D819J544K033L368l846p095l751J436P079o137o666M166N863K939n701q196
12042h145K31P556Q282j100k872Q53L071l224M943j060l981p329l154K919l352
12027f362n542l733L697M230L374M874J372R057P896l217j5349k426L235R520
12013A0626l452j645K317r659k893J456R950J368p054k790p290n865N822j096
11999a0205J461P913L304J36K86j491p730m95k544Q142j24m372L891M161k707
11984c74m938N34J421j806L921J0326l398k348P186K119p994r637M248L704M330
11969G294l665k597k940m313l866k938J386L472M90R095j215o89N081N379N310
$$ plain form
12072 9994 19922 28263 33925 31186 25380 19409 16292 15144 10698 2524 -599 -679 -1954 -210 4819
12057 4819 6363 8396 11764 7918 823 -2928 -1492 5587 -550 -7216 -3050 2813 5752 51 -8145
12042 -8145 -7914 -358 7924 6824 3952 4805 7876 4652 9595 8535 4554 -2775 -5929 -3010 -6362
12027 -6362 -11904 -15637 -11940 -7710 -4336 538 1910 10967 18863 15646 297 -2129 1106 10626
12013 10626 7174 5529 7846 -1813 -4706 -3250 6700 8068 1014 -1776 -9066 -14931 -9109 -10205
11999 -10205 -8744 -831 2473 2609 2895 1404 -6326 -6821 -9365 -1223 -1347 -5719 -1828 2333 -374
11984 -374 -5312 -4778 -3357 -5163 -1242 9084 5686 3338 10524 12643 4649 -4988 -740 2964 7294
11969 7294 3629 1032 -1908 -6221 -10087 -13025 -11639 -8167 -7677 1418 203 -486 4595 9974 15284
11954A5284j032m733l319L552J20J392O566o913l267j041L05L628l39n028P24
11939E899j499k798J128k362M74L388k035l815k462P025N596N242n544n308L592
11924F521m21k387P90N23k571K689J272n887n50J27J568L609r85l051o906j143
11908f802K352M002k664L903P63j0315q83Q844m172l857n91R514L553m752k707
11893c812j418J66O659K437l008l04k955k605J340M261l271l452l701N084J139
11878c440N138N422m6K14o186N077K633j057q29o85j480p797K731K230M488J969
11862H382K46m077l054k710n18j842m305Q73L969N025r244Q25N635O637k551M56
11846C747L352K348j312l254m798j747j958J310o07n688M250J946R10l059N788
$$ plain form
11954 15284 14252 9519 6200 9752 9872 11264 17830 10917 7650 6609 6914 10542 10203 5175 5899
11939 5899 4400 1602 2730 368 842 4230 2195 -1620 -4082 2943 8539 13781 8237 2929 6521
11924 6521 6100 3713 4503 5026 2455 5144 6416 529 -21 106 1674 5283 4298 1247 -5659 -6802
11908 -6802 -4450 -448 -3112 791 1554 -8761 -9644 -800 -4972 -8829 -9420 94 3647 -1105 -3812
11893 -3812 -5230 -5064 1595 4032 1024 720 -2235 -4840 -3500 761 -2510 -5962 -9663 -4579 -3440
11878 -3440 1698 7120 7074 7288 1102 6179 8812 7755 6926 6241 4761 -3036 -305 1925 6413 8382
11862 8382 8628 4551 1497 -1213 -1731 -3573 -7878 -7005 -3036 1989 -7255 -6430 -795 5842 3291 3747
11846 3747 7099 9447 8135 4881 83 -1664 -3622 -2312 -2919 -8607 -4357 -2411 -1501 -4560 1228
11831A228L10M726J615M14l256o949P29O009O061P612m936j0198j115M581M306
11816A1137j574j0507m352K081J089m052j494M035J497K766q99J161K522M378
11802G788l518N813N95j6460n103L830Q190l245k330M601m381K325O076m059J65
11787B87K322l43k132M687J092J499p281m327O123L374J713O001k864o543N18
11772D126m444j671O199N43J543l915O69M501M795M926K406m443m951l182n729
11757A373j948j21K96J382J51m058J22J819k434K840p1K350J00M670L989m034
11741F426j106L079L258O1l005l105r213M070N698q46M417r6o289j302O490K882
11725A1419j130n34O301m539L26K035m881L072m425m959k646Q331M828Q07K663
$$ plain form
11831 1228 1538 6264 7879 8293 5037 -1912 -1183 4826 10887 18499 13563 3365 2250 6831 11137
11816 11137 9563 -944 -5296 -3215 -2126 -6178 -7672 -3637 -2140 626 -273 888 3410 7788
11802 7788 4270 10083 10678 -5782 -10885 -7055 1135 -2110 -4440 161 -4220 -1895 4181 122 287
11787 287 2609 2266 134 4821 5913 7412 131 -4196 1927 5301 7014 13015 10151 3608 4126
11772 4126 -318 -1989 4210 4753 6296 2381 3050 7551 12346 17272 19678 15235 10284 7102 1373
11757 1373 -575 -696 -400 982 1133 -2925 -2803 -984 -3418 -578 -649 1701 1801 6471 10460 6426
11741 6426 5320 8399 11657 11718 8713 5608 -3605 465 6163 5317 9734 9638 3349 2047 8537 11419
11725 11419 10289 9755 16056 11517 11843 13878 8997 12069 7644 2685 39 8370 13198 14005 16668
11710A6668L769m367p736J813r79l822k565Q620J074k447M742N253q43J321o094
11695A4407k276r581m874k211L274P55j877O757R422k642m837K373L454o019n040
11680A085p824n952J290O571M586K495l805o062j157L556M204j11J045P7o613
11665f615L869M939k06K546J876K431M306j275M894r282N26O233N827j709l399
11650A4961K972K50K71K308J246q937j299k249k601K536J503k314p958O002L159
11635I850m646l256J873L806k142P088J351m136N4J772Q03N74q330o059Q45N836
11619E283M233n361j169L700J776m611k590j806j708K610n613K653J163j276J034
11604a682P582Q062K242J563n091j0201L232j186j925p890L456K618J017l062
$$ plain form
11710 16668 20437 16070 8334 10147 9168 5346 2781 11401 12475 10028 14770 20023 19180 20501 14407
11695 14407 12131 2550 -2324 -4535 -1261 -506 -2383 4374 13796 11154 6317 8690 12144 6125 1085
11680 1085 -6739 -12691 -11401 -4830 -244 2251 -1554 -7616 -8773 -5217 -1013 -1124 -79 -2 -6615
11665 -6615 -2746 2193 1987 4533 6409 8840 13146 11871 16765 7483 8009 14242 20069 18360 14961
11650 14961 17933 18183 18454 20762 22008 13071 11772 9523 6922 9458 10961 8647 689 6691 9850
11635 9850 5204 1948 3821 7627 5485 12573 13924 9788 9842 11614 12417 12991 4661 -1398 -553 5283
11619 5283 9516 4155 2986 6686 8462 3851 1261 -545 -2253 357 -5256 -2603 -1440 -2716 -1682
11604 -1682 5900 13962 16204 17767 12676 2475 5707 4521 2596 -5294 -1838 780 1797 -1265
11590a265K532J259L290m83n049N18L649L697J021L283k752m172O944L972k380
11575A4064n056p78l799l865J371M929o444L595O80K780J184R44l03k457M877
11560A1722L210n720p308Q42O054j432K555j974k299k918M084Q417l130Q017k08
11545A9912o962n814J713k428j789l505M759K587m474o343N252M039j314r46J303
11530E990J532N133m40M93N028P391P244l183l548J803J778q969j6400m734p41
11515a623K687K533K430j87J652l186J8j617j971k838L817J213k890l890L821
11500c1J961L573o142j1470m796K504P993J0498M058N114M559m113q43n067j243
11485F555O6L353J964K761J944O985K919p255m194Q407K951p741k355J180j1208
$$ plain form
11590 -1265 1267 2526 5816 5333 284 802 4451 8148 9169 12452 9700 5528 12472 16444 14064
11575 14064 9008 8230 4431 566 1937 6866 422 4017 4697 7477 8661 9605 9302 6845 11722
11560 11722 14932 9212 1904 2746 8800 7368 9923 7949 5650 2732 6816 15233 12103 20120 19912
11545 19912 12950 7136 8849 6421 4632 1127 5886 8473 3999 -2344 2908 6947 5633 4687 5990
11530 5990 7522 12655 12215 12708 17736 25127 32371 29188 25640 27443 29221 20252 3852 -882 -1623
11515 -1623 1064 3597 6027 5840 7492 4306 4324 2707 736 -2102 1715 2928 38 -3852 -31
11500 -31 1930 5503 -639 -12109 -16905 -14401 -6408 4090 8148 13262 17821 13708 12865 7798 6555
11485 6555 6621 9974 11938 14699 16643 23628 26547 19292 15098 23505 26456 18715 16360 17540 6332
11470F332j929Q096O016o770l65n68k477N139L021k733j853J138j555l350L145
11455A1287k816j841M076J340K872k494k246n42R084N707m680p721n737J435l181
11440D543L470N66l063P46N130O291l585j2629l254J0869M045L195m22k917j605
11425A1380O9k893o254J263Q517J170k740l732n324P083J327J509L036k055L146
11410A5502N083J427p343m550j73m648K843L182l473k323K423m527L923J0333
11396A7679K883k510J80r831m101K211N834R82j741J160J372n116M10p31N311
11381A3992j468J190J380L057o12M999m820k287J361n28m447J462k870N240J965
11366A7614m185k379q67n085L382M809k383j001m735j752J951L595O231l233k967
$$ plain form
11470 6332 4403 12499 18515 11745 11380 10812 8335 13474 16495 13762 11909 13047 11492 8142 11287
11455 11287 8471 6630 10706 12046 14918 12424 10178 9636 18720 24427 19747 12026 6289 7724 4543
11440 4543 8013 8579 5516 6262 11392 17683 14098 1469 -1785 9084 13129 16324 15902 12985 11380
11425 11380 11449 8556 2302 3565 12082 13252 10512 6780 1456 8539 9866 11375 14411 12356 15502
11410 15502 20585 22012 14669 10119 9946 5298 8141 11323 7850 5527 7950 3423 7346 17679
11396 17679 20562 18052 18232 8401 4300 6511 12345 13327 11586 12746 14118 9002 9412 8681 13992
11381 13992 12524 13714 15094 18151 17539 22538 17718 15431 16792 16264 11817 13279 10409 15649 17614
11366 17614 13429 11050 10183 5098 8480 13289 10906 9905 5170 3418 5369 8964 15195 11962 8995
11351H995o591j547N024L508L927N17R96l724N821O819k124n575p267j853n045
11336A881R135n70r083j554Q682K651m611k87O094K447q454l905j812M743N880
11321A1237L50N501L62m850j15J259J231R74n811l867k363L174j613l163Q988
11306A1294m06p042P094N911J570K665j290r655j64J553j508m69P757L016L115
11291B3441n81k475k687K290k948l152M826L913O199m234m582j0195L779K113
11277A5707m699p57p23N551k13o62O089M047o44p27n713q146p042N600N561m583
11261H646m073L271L077J667m80N8K971L277k739m251l928j528Q173N80K949m628
11245A3042m359O91k691k248J476O529K530L861O276j434m297M522P02n468n673
$$ plain form
11351 8995 2404 857 5881 9389 13316 13833 14829 11105 16926 23745 21621 16046 8779 6926 1881
11336 1881 11016 10446 1363 -191 8491 11142 6531 6244 12338 14785 6331 2426 614 5357 11237
11321 11237 11587 17088 17450 12600 12485 13744 14975 15949 10138 6271 3908 7082 5469 2306 11294
11306 11294 10888 3846 10940 16851 18421 21086 19796 10141 9977 11530 10022 9553 17310 20326 23441
11291 23441 22860 20385 17698 19988 17040 13888 18714 22627 28826 24592 20010 9815 13594 15707
11277 15707 11008 10251 9528 15079 14866 14204 20293 24340 23696 22969 17256 9110 2068 7668 13229 8646
11261 8646 4573 7844 10921 12588 12108 12166 15137 18414 15675 11424 7496 5968 14141 14721 17670 13042
11245 13042 8683 9374 6683 4435 5911 12440 14970 18831 25107 23673 19376 23898 24600 19132 13459
11230A3459R10O018M9L371N636Q699K959j878n009j268j148r611o706o11j707
11215A3163o261q16L22M728O422M905N493l663j5502p175N023Q558l686L6k343
11200I204j467m904n941j187K442o267m378m370M375O730J905M83m259M846K43
11185b545p139l456J0252J0023J0027J1828J4619J5673R558J7413J9647J9871
11173A25771O400k0700k9518j9784r674l339n390j185L82K200l077k011J163Q31
11159D2069O153K136k366j547O054L521J3358O146j644j101P922P866k054K303
11145H8816j750p21L71J546k426L699O143J5708O820J1241J2155J7536K2242K5974
11131B07354L5706O3534J10713J96719L01718L89031L92352K55280Q2444n599
$$ plain form
11230 13459 14369 20387 20436 23807 29443 38142 41101 39223 34214 32946 31798 22187 15481 14870 13163
11215 13163 6902 6086 6408 11136 17558 22463 27956 24293 8791 1616 6639 15197 11511 11547 9204
11200 9204 7737 2833 -3108 -4295 -1853 -8120 -12498 -16868 -12493 -5763 -3858 -3375 -7634 -2788 -2545
11185 -2545 -9684 -13140 -2888 7135 17162 28990 43609 59282 68840 86253 105900 125771
11173 125771 132171 111471 81953 62169 52495 49156 43766 42581 42963 45163 42086 40075 41238 42069
11159 42069 48222 50358 47992 46445 52499 56020 69378 75524 73880 72779 80701 88567 86513 88816
11145 88816 87066 86345 86716 88262 85836 89535 95678 111386 118206 129447 141602 159138 181380 207354
11131 207354 243060 306594 417307 614026 915744 1304775 1697127 1952407 2034851 2029252
11121B029252M964k2742j53338l25552m13366l57669k38785j44758q5685n7901
11111B34420l4675k6283j4676j8989j8772j5794j0924m052m58m77K726p25r515
11098H1806l04k109n517m517n389n029m974n8n106P33L140l586m08M537M980m949
11082E3250m360O633J26p698J0209J0140O745K4417L0719n401k9030k0474j2572
11069F2704l364l755j0562j2406j037j29j215l204N351j776L02J0449N280N172
11055E1810n54j360k52K164K253k77j62J125M637k409k712K316q84o577p293j678
11039D0147m940K198k698J392L363M606J873N328r88j0499l360k445K078m58n626
11024B9971o177N05J2170R063N163K687J722P5Q835M807n607q573p674O63R172
$$ plain form
11121 2029252 2034216 2011474 1858136 1532584 1119218 761549 522764 378006 292321 234420
11111 234420 199745 173462 158786 139797 121025 105231 94307 90255 89797 89320 92046 91321 81806
11098 81806 81502 79393 73876 69359 63970 58941 53967 53909 48803 49536 52676 49090 48682 53219 58199 53250
11082 53250 48890 55523 55649 47951 58160 68300 75045 99462 130181 124780 95750 75276 62704
11069 62704 59340 55585 45023 32617 31580 31451 30236 27032 32383 30607 30909 41358 46638 51810
11055 51810 51256 49896 49644 51808 54061 53784 53622 54747 59384 56975 54263 56579 55695 49118 41825 40147
11039 40147 35207 37405 34707 36099 39462 44068 45941 51269 50281 39782 36422 33977 36055 35597 29971
11024 29971 23794 24299 36469 45532 50695 53382 55104 55179 64014 68821 63214 54641 46967 47630 56802
11009E6802J503L176J2866J0955J6473J8768L561k440k987r814n983k04O9m244
10995I8501j877K736l904k508n831o779O36J1807J2178j785o112L787J5306J0498
10981A26653N496n22K099J9733K5958K4984L3508L8577L5829K6252K0659O873
10969C66099j715j1191k0573k6901k1690k0269k4861k0869j4825o692M417J4195
10957B15125J8273L1632N4050P8129J32756K28942L42179M17163L89640K58529
10947B166418J12022N124r8517k44421l77168m16857l43356k32834j43176q5242
10937C41993m9292l8282k5138j5363j6981o404L707K455o735K071J67k531J185
10924A90852k352n525J060k713q046j4850j1721j4763j1251r655p681m454m754
$$ plain form
11009 56802 58305 61481 74347 85302 101775 120543 124104 121664 118677 108863 102880 102676 102745 98501
10995 98501 96624 99360 95456 92948 87117 80338 80974 92781 104959 103174 97062 100849 116155 126653
10981 126653 132149 131627 133726 153459 179417 204401 237909 276486 312315 338567 359226 366099
10969 366099 364384 353193 332620 305719 284029 263760 238899 218030 203205 196513 200930 215125
10957 215125 233398 265030 319080 397209 529965 758907 1101086 1518249 1907889 2166418
10947 2166418 2278440 2283564 2185047 1940626 1563458 1146601 803245 570411 427235 341993
10937 341993 292701 254419 229281 213918 196937 190533 194240 196695 189960 192031 192198 189667 190852
10924 190852 188500 182975 184035 181322 173276 158426 146705 131942 120691 111036 103355 98901 94147
10911I4147o613l961Q897K527M349M635o209j3235j5742p518j430J748J982r397
10897E4180j0815j0949j060J6221K4564K0267L189j363L134O527N877j024j0388
10884I8360r628j713J3893K2627J4840P495K0214L0127J2702k841k4791l5682
10872A45603k8851l2386k4820j7321j4284j5036Q319J8428K5354K5328K4741K7804
10860A42879J9502N246M935l40l334N662J0113J6450K3504L2051K8474L0812L8334
10847C54288M6485L3138J1672j1778k929Q286j0521k8998l9707k5893j4570j0170
10835C09303J92K22n04M684J524p505j2612o053n842J592o240p086r239o432M797
10820B60801O820Q813P527R544Q241M432M458P156J6012O847L726J0822J1655
$$ plain form
10911 94147 87534 83573 92470 94997 99346 103981 97772 84537 68795 61277 59847 61595 63577 54180
10897 54180 43365 32416 31356 47577 72141 92408 95597 94234 97368 103895 109772 108748 98360
10884 98360 88732 87019 100912 123539 138379 145874 166088 196215 208917 206076 181285 145603
10872 145603 116752 84366 59546 42225 27941 12905 21224 39652 65006 90334 115075 142879
10860 142879 162381 167627 172562 172222 168888 174550 184663 201113 224617 256668 285142 315954 354288
10847 354288 400773 433911 445583 433805 430876 439162 428641 399643 359936 334043 319473 309303
10835 309303 309495 309717 309213 313897 315421 307916 295304 289251 283409 285001 278761 271675 262436 256004 260801
10820 260801 267621 276434 283961 293505 301746 306178 310636 317792 333804 340651 344377 355199 366854
10807C66854J7043L0619L3623M6653M4037N2394M8245M3129L0747K1596P259m480
10795G37719j9348l3780k2381k6311k4812j7216r587j362R148J4755J2764K4996
10783F44585K4405L2422L3911L6666L9102K8475K5799J6712J8243J9793J8582
10772I38695J5102J6950K1311K9423L2884M1961M1841M2672M3170M7650O3829
10761A335488P6305Q6692Q4078P6138P2289Q1979J03329J05209J18660J41224
10751B281391J48398J52522J63661J80978K17257K73147L33727M33136N81378
10742D765595P55645Q43079P85667O92860O99392Q46084J008244J067960J102226
10733A2566752J193447J367544J663191K150847K854672L726644M987720P239959
$$ plain form
10807 366854 383897 414516 448139 494792 538829 591223 639468 682597 713344 734940 742199 737719
10795 737719 718371 684591 662210 635899 611087 593871 584284 582922 592070 606825 619589 644585
10783 644585 668990 701412 735323 771989 811091 839566 865365 882077 900320 920113 938695
10772 938695 953797 970747 992058 1021481 1054365 1096326 1138167 1180839 1224009 1271659 1335488
10761 1335488 1411793 1498485 1582563 1658701 1730990 1812969 1916298 2021507 2140167 2281391
10751 2281391 2429789 2582311 2745972 2926950 3144207 3417354 3751081 4184217 4765595
10742 4765595 5521240 6364319 7149986 7842846 8542238 9388322 10396566 11464526 12566752
10733 12566752 13760199 15127743 16790934 18941781 21796453 25523097 30510817 37750776
10725C7750776J1346903J8574649L0818336M8888501O6621882P0016042M9506068
10718C33523157J8935560r06956r41655R67282j6828551m6724332o8579794o6732398
10710A52712313m9148131l0845515j8627740j1670189p801662n679992m374154
10703B4564930l423737k640347k110646j820401j601362j351640j060506q74913
10695I681378p72143o72880n50564n26857o25053p30676p12843n79351m36771
10686D074240l36905k70445k34435k15804j91766j46657j21825j10669j15307
10677B330427j08118r4337p4718n7469n7354o4719p0094p4348o6022p4365q6875
10666A502008q6489o8281o2560n1783n1323n2249n2580m2613l5196l9072l6092
$$ plain form
10725 37750776 49097679 67672328 98490664 147379165 214001047 284017089 333523157
10718 333523157 352458717 351551761 350610106 351577388 334748837 288024505 219444711 152712313
10710 152712313 103564182 72718667 54090927 42420738 34619076 28939084 24564930
10703 24564930 21141193 18500846 16390200 14569799 12968437 11616797 10556291 9681378
10695 9681378 8909235 8236355 7685791 7158934 6533881 5803205 5090362 4511011 4074240
10686 4074240 3737335 3466890 3232455 3016651 2824885 2678228 2556403 2445734 2330427
10677 2330427 2222309 2127972 2053254 1995785 1938431 1873712 1803618 1729270 1663248 1588883 1502008
10666 1502008 1415519 1347238 1284678 1232895 1181572 1129323 1076743 1034130 998934 959862 923770
10655I23770l7095k9383k4131k1680k1246j2098J494N105J1208L072N217K170
10643H06403M670N207o16m441K873j907m316Q675J1117n067j2486j1309j0538
10630G88265j3011k331l62Q113J376q707j316j778m588j0962j0001j799N912L820
10616G52631J0657J4439K0841K7507L1302L7176K9233K2177J9182O371J5998J0227
10604I97741Q900M533J3807K1677K8646L0922L4229L2622N3796M6844N7248O0546
10592A391511M6765M6114M5283N4250N4037M5007N1421M2750N3710N3013O0878
10581A944739Q1172J00364J21953J44828J53606J75683J95868K17936K56415L09556
10571C702120L96530N31315P18898Q98936R93734R79020R29522R31437R98691
$$ plain form
10655 923770 886675 857292 833161 811481 790235 778137 779631 784736 795944 799016 804233 806403
10643 806403 811073 816280 815664 811223 814096 812189 807873 816548 827665 822598 810112 798803 788265
10630 788265 775254 772923 772561 780674 782050 773343 772027 770249 765661 754699 744698 742899 748811 752631
10616 752631 763288 777727 798568 826075 857377 894553 923786 945963 965145 971516 987514 997741
10604 997741 1006641 1011174 1024981 1046658 1075304 1106226 1140455 1173077 1226873 1273717 1330965 1391511
10592 1391511 1438276 1484390 1529673 1583923 1637960 1682967 1734388 1777138 1830848 1883861 1944739
10581 1944739 2025911 2126275 2248228 2393056 2546662 2722345 2918213 3136149 3392564 3702120
10571 3702120 4098650 4629965 5348863 6247799 7241533 8220553 9150075 10081512 11080203
10562A1080203J081765J141938J211687J404066J758582K279288K963756L881423
10554B6802708N381150P981109J2483689K0153357L3129453N2058914P0129013
10547B28119393P3891443N6114950K9867777Q689862o036364k5348091n0554492
10540C14744478p0383706p0936342n4854821l5765585k1987357j3904365r283268
10533C7629034o568260m902001l811378l035055k437930j968753j603262j260604
10525A2041791r83790q06689o91480o23771o32855p23501q03582p87844o74040
10516E314239n44930m34150l42535k78146k41341k11601j70136j40714j36695
10507B813991j19358j12481j05229j04651r6601p1368n5210m3746n5168p6704
$$ plain form
10562 11080203 12161968 13303906 14515593 15919659 17678241 19957529 22921285 26802708
10554 26802708 32183858 40164967 52648656 72802013 105931466 157990380 228119393
10547 228119393 302010836 358125786 387993563 396683425 390647061 365298970 314744478
10540 314744478 244360772 173424430 118569609 82804024 60816667 46912302 37629034
10533 37629034 31060774 26158773 22347395 19312340 16874410 14905657 13302395 12041791
10525 12041791 11058001 10251312 9559832 8936061 8303206 7579705 6776123 5988279 5314239
10516 5314239 4769309 4335159 3992624 3714478 3473137 3261536 3091400 2950686 2813991
10507 2813991 2694633 2582152 2476923 2372272 2275671 2204303 2149093 2105347 2050179 1973475
10497A973475r6021j01434r6227p9624o9939p1949p8659o8449o2387n6018n4044
10486A138724o0427n2017m5591m3255l3726k9216j8857k620L780o25r397j5151
10474H31622j8200j4492p757j4124j0988j1374j7887j5019r039j2393j6840k4999
10462F58510k0037k2059j6237j4311k0729j4194m479o404o531k62N758n366m132
10449E29527P99j4003j6777j7584j1932n022M97Q01P99p868m743p894j3137j3425
10435D20038j5132j2170j7896j4872j2345j1319jK000k141j18P477J9144J8299
10422C80964K4783J8863K1089J6095M479j5630j7921j9196k7900l2678p422k829
10410C42697q502k807J31o08j3548q836o297n950q074j0673j376O006J1841K0082
$$ plain form
10497 1973475 1877454 1776020 1679793 1600169 1530230 1458281 1379622 1311173 1248786 1192768 1138724
10486 1138724 1078297 1026280 980689 937434 903708 874492 855635 853015 856795 856170 846773 831622
10474 831622 813422 798930 791173 777049 766061 754687 736800 721781 712742 700349 683509 658510
10462 658510 638473 616414 600177 585866 565137 550943 546464 540060 533529 533267 539025 533659 529527
10449 529527 530326 516323 499546 481962 470030 465008 465505 466306 467105 459237 454494 446600 433463 420038
10435 420038 404906 392736 374840 359968 347623 336304 336303 338303 336162 336044 343521 362665 380964
10422 380964 405747 424610 445699 461794 466273 450643 432722 413526 385626 352948 345526 342697
10410 342697 334195 331388 331519 330911 317363 308527 302230 296280 288206 277533 276157 282163 294004 314086
10396C14086K2480K6057K0073P598j8513k9176l6537m4919l6446l1852k3875j6066
10384A52910j423J3780J7029J9689J5422M501J542L10J2055J3642K491m357P83
10371B48374J101J666P046k130r482p24K399k677J849n344r356k70m706r527k0691
10356A97528k1584j3157k970J149P596J3429O272j265o010p437r494p514q535
10343A48008j4352j9459j2968p244m290J56l241K473P203J1773J3447J3783K922
10330A38211K784P436J5029N583p5M112Q837Q624J5129J2874J682O026J3158K4226
10316B63636K6750M0364O1730R7679J68618K82926L82088L98524K85262J07971
10306B115548P686O263j8055j39540l15111m07869l71457k58208j44548q5967
$$ plain form
10396 314086 336566 362623 382696 390294 371781 342605 306068 261149 224703 192851 168976 152910
10384 152910 151487 165267 182296 201985 217407 221908 223450 223760 235815 249457 251948 247591 248374
10371 248374 249475 251141 258187 256057 246575 245851 248250 245573 247422 242078 232722 232452 227746 218219 197528
10356 197528 175944 162787 159817 160966 168562 181991 188263 186998 180988 173551 164057 156543 148008
10343 148008 133656 114197 101229 93985 89695 89851 86610 89083 96286 108059 121506 135289 138211
10330 138211 140995 148431 163460 169043 168968 173080 181917 190541 205670 218544 220226 226252 239410 263636
10316 263636 290386 330750 392480 490159 658777 941703 1323791 1722315 2007577 2115548
10306 2115548 2123234 2129497 2111442 1971902 1656791 1248922 877465 619257 474709 388742
10296C88742n5648l4661j2721j1981r550j2450j4709k0195k2443j9061j4495k2288
10284A38540j2243M804l23P008N253p628q551o429p430k408j2095q000P929L460
10270A01887l679l971q775l584n191j0021q461m852j453j653l751l519o679j90
10256C6108J1081Q836K942J0100J1384Q650M439m232J64j0395r325l417N224M236
10242G5795k967J371O36O203J1841R293R03k278K010j311K411r65r745r939r106
10227G4152K5L430J805J125r92j782K727l120k748r068l644K839j403n390m681
10212E3275J410o08O955M017J3068R734p744q430m886m735n837m041J750l447
10198E0481p765o048N938R996R947P782L061j0431r617k737L476o466M821M314
$$ plain form
10296 388742 333094 298433 285712 273731 264181 251731 237022 216827 194384 175323 160828 138540
10284 138540 126297 131101 130778 137786 143039 135411 126860 120431 113001 110593 98498 90498 98427 101887
10270 101887 98208 94237 85462 81878 76687 66666 58205 53353 51900 50247 46496 42977 36298 36108
10256 36108 47189 56025 58967 69067 80451 89101 93540 89308 89472 79077 69752 66335 71559 75795
10242 75795 72828 74199 74835 81038 92879 102172 103075 100797 102807 101496 103907 102942 93197 83258 74152
10227 74152 74177 77607 79412 80537 79545 77763 80490 77370 74622 65554 61910 64749 63346 57956 53275
10212 53275 54685 54077 61032 65049 78117 87851 80107 71677 66791 62056 56219 52178 53928 50481
10198 50481 42716 36668 42606 52602 62549 70331 73392 62961 53344 50607 54083 47617 52438 56752
10184E6752q316j151O017L819m907K332Q42k149J233k080O771J2764M090J122
10170G7139q55k327l798k58M452O747J866q315o85M264Q437O924J611O385J234
10155A02821M277O432P846J5688O757j48O112J3939J8855K7535M4378O5871R4550
10142D14913J70378K67009L78416M26597L48356K06287O4670l1483j56651l01118
10132A787374m13205m00156l00909j99147j33029p6340m5467m1925k7884j5751
10122A33561j0519j6971r466q045l198j190Lj5019j8158l380M786N411p178m798
10108D5839r199o283L138l640M045O452O361K788k216L70J864p37m907p648J593
10093C7820J786k07q723n223m129K771k193j4915p461J100N275J5400J5617R062
$$ plain form
10184 56752 48436 47285 53302 57121 52214 54546 55388 53239 54472 52392 59163 71927 76017 77139
10170 77139 76284 73957 70159 69901 74353 81100 82966 74651 73966 78230 86667 93591 95202 101587 102821
10155 102821 107098 113530 121376 137064 143821 143673 149785 163724 182579 210114 254492 320363 414913
10142 414913 585291 852300 1230716 1657313 2005669 2211956 2276626 2245143 2088492 1787374
10132 1787374 1374169 974013 673104 473957 340928 264588 219121 177196 149312 133561
10122 133561 123042 106071 96605 88560 85362 84172 84175 69156 50998 47618 52404 57815 50637 45839
10108 45839 36640 30357 33495 29855 33900 40352 46713 49501 47285 47655 49519 48782 43875 36227 37820
10093 37820 39606 39399 30676 25453 21324 24095 21902 6987 -474 626 5901 21301 36918 45980
10079D5980J4252Q608Q630N284n139o495k044n43K819j758K909O297q982r172
10065F0646k11o18r452k346j035n538n642M703k225q983R85J3883Q164p896j088
10050D3347L558K65M863M375r177o911j85j914o204L30j610J445K863N986O181
10035D7212n061l300l366O652J3650M686J0509J793K171K201O362Q150L587m723
10021I0523r432k532P560Q68L835J2868J8935K5137K9127L8388O7001J21621K33397
10008F37296M42303Q47641J075340O4233j084976q95470m28912k18461j14903
9999C24091o8591n0822l8847k8732j6338r157j5042j2948j0917l444o448Q50P411
9986G1066K93k015m310n392j0233n754J177m410l720j738O003N590J237m262n628
$$ plain form
10079 45980 60232 68840 77470 82754 77615 71120 69076 68533 71352 69594 72503 78800 69818 60646
10065 60646 60435 59817 50365 48019 46984 41446 35804 40507 38282 29299 30284 44167 52331 44435 43347
10050 43347 46905 47170 52033 56408 47231 40320 40135 38221 32017 32347 30737 32182 35045 41031 47212
10035 47212 42151 38851 35485 42137 55787 60473 70982 72775 74946 77147 83509 91659 95246 90523
10021 90523 81091 78559 86119 86987 90822 103690 122625 147762 176889 215277 282278 403899 637296
10008 637296 1079599 1927240 3002580 3066813 1981837 1086367 657455 438994 324091
9999 324091 255500 204678 165831 137099 120761 111604 96562 83614 72697 69253 62805 63655 71066
9986 71066 71359 69344 65034 59642 49409 43655 44832 40422 36702 34964 40967 46557 47794 43532 37904
9971C7904n481K611O83j582m268r688O118Q593k257o160r462k908L278M833Q754
9956C0968L162N326p254j2172j992j082j128L471l232q59K596j721l543J1425
9942B3965O064K039N449j127P07m394m812J898j112n2k599l689n88M883M356m122
9926B6866p569k554K083M53P129P067m729j683J200J028o05M780j04q567o115
9911A8680L275l034L330j245J475j379Q86j508J358Q853J856o164q751k406O443
9896B1669J4259q274j1717j13J867K173n657K975M037k988Q4J701O618k209j1114
9881A3311L803J2590J840K147J2143J274p386q813o362l442M508K697O01k993
9867B5918J050p120j168M629P739l62p568j0524n783M738J600k580L46L281J182
$$ plain form
9971 37904 32423 35034 35717 34135 29867 20179 26297 34890 32633 26473 17011 14103 17381 22214 30968
9956 30968 34130 39456 32202 20030 18038 16956 15828 19299 16067 15208 17804 16083 12540 23965
9942 23965 30029 32068 37517 36390 37097 32703 27891 29789 28677 28625 26026 22337 21749 26632 30988 26866
9926 26866 19297 16743 18826 19279 26408 33475 28746 27063 28263 29291 28686 33466 33362 24795 18680
9911 18680 21955 18921 22251 21006 22481 21102 21988 20480 21838 30691 32547 26383 17632 15226 21669
9896 21669 35928 27654 15937 15824 17691 19864 14207 17182 21219 18231 18315 20016 26634 24425 13311
9881 13311 17114 29704 31544 33691 45834 47108 39722 30909 24547 21105 25613 28310 28911 25918
9867 25918 26968 19848 18680 23309 31048 30686 23118 12594 6811 11549 13149 10569 10915 14196 15378
9852A5378m986n340N221M319K043Q316k220q736J885L387K873q338K035k103p065
9837F669l81R32L783R001M397j1582n187L99j68j059M728j252K940L121J074N029
9821B2444N501n126k778m441p089Q41L402K324J183J087O19k269O202Q234O041
9806C6175J4005K5252L4661R749k2306k7527k1400j0050p479p953j658p878J308
9793A4899P003k54m849J309L539j722J57o174m465K048n52k75k795k197p01M597
9777I568Q166l106K769J472K574J522J026l422n700l620M106K722l935K424j744
9762A4822n8K984M506n798m804j222m98N878l43O24N425p944n072J869K668r12
9746A2125Q105N247n298J722j730L102M895m033n590l344l718n611K984R572L843
$$ plain form
9852 15378 10392 5052 10273 14592 16635 24951 22731 13995 15880 19267 22140 13802 15837 13734 6669
9837 6669 6288 7220 11003 20004 24401 12819 7632 8031 7863 6804 11532 10280 13220 16341 17415 22444
9821 22444 27945 22819 20041 15600 8511 9352 12754 15078 16261 17348 17967 15698 21900 30134 36175
9806 36175 50180 75432 110093 119842 97536 70009 48609 38559 31080 23127 21469 13591 14899
9793 14899 21902 21648 16799 18108 21647 19925 20082 13908 9443 11491 10939 10664 7869 5672 4971 9568
9777 9568 17734 14628 17397 18869 21443 22965 23991 20569 14869 11249 15355 18077 14142 16566 14822
9762 14822 14764 17748 22254 16456 11652 10430 9932 15810 15467 16091 21516 13572 8500 10369 13037 12125
9746 12125 20230 25477 20179 21901 20171 23273 28168 24135 18545 15201 11483 5872 8856 18428 22271
9731B2271j950q98J963J507k414k038q23O826q96o950l349N160m037n483N082
9716A3971L296P29m061J238j437K424J860n917r080K4O535P158L863m275m649
9701A1679O461L960n920o228K91n44J752j626K325k818j293N110K578N941J593
9686B3261N033L207n438l234Q36L188K981m141n944p704K238J849o519J269L766
9671A4648K882O13o413k503m315j535Q540L573K511m356n59r37M926K524O844
9656B6443L392l81n02n693q429K083q57J599k461J711k237N51N923N477P550K583
9640C6752l971k982l285l01L472R73K968J307M513J338l787J3419J1190N278l260
9625F3624j659j109j185K576L380K904P988J5049Q823P190R486J0498J3215J0483
$$ plain form
9731 22271 20321 19423 21386 22893 20479 18441 17618 24444 23548 16598 13249 18409 14372 8889 13971
9716 13971 17267 17996 13935 15173 13736 16160 18020 12103 3023 3047 9582 16740 20603 16328 11679
9701 11679 18140 22100 16180 9952 10243 9699 11451 9825 12150 9332 8039 13149 15727 21668 23261
9686 23261 28294 31501 26063 22829 23665 26853 29834 25693 19749 12045 14283 16132 9613 10882 14648
9671 14648 17530 18143 11730 9227 4912 3377 11917 15490 18001 13645 13086 12149 17075 19599 26443
9656 26443 29835 29454 28952 23259 14830 16913 16056 17655 15194 16905 14668 15219 21142 26619 34169 36752
9640 36752 32781 29799 26514 26213 29685 30658 33626 34933 39446 40784 36997 50416 61606 66884 63624
9625 63624 61965 60856 59671 62247 65627 68531 76519 91568 100391 107581 117067 127565 140780 151263
9611A51263K0173K1655K8126M2486M8432O2280R5308J36591K10473L55381O12953
9600A785121J082326J948814K895366J917348j303994k925012k190364j182456
9592B027149o42033l78980k39516j70098j26910q7340o6222n3083m0408l3850
9582A88709k9698j9192j3956p720k897j4922j1723q075o729j875p128n171N156
9569F4779J998l516l399p129o015l480m998k350q65j196k349j497q7n571m715
9554A9610m252J527P694K831k653l300j0733k929M403M632j926r196J553M209
9540A1470O934l91n60L020j315l945o252j141R890L571k402n120K916N251n251
9525A6675o601Q57j747J374L712k391o521j777J129j04j948R00M180M244o860
$$ plain form
9611 151263 171436 193091 221217 263703 312135 374415 469723 606314 816787 1172168 1785121
9600 1785121 2867447 4816261 7711627 9628975 8324981 5399969 3209605 2027149
9592 2027149 1385116 1006136 766620 596522 469612 382272 316050 262967 222559 188709
9582 188709 159011 139819 125863 118143 115246 100324 88601 80526 73797 71922 64794 59623 64779
9569 64779 66777 63261 59862 52733 46718 43238 38240 35890 35025 33829 31480 29983 29896 24325 19610
9554 19610 15358 16885 24579 27410 24757 21457 10724 7795 12198 16830 14904 5708 7261 11470
9540 11470 18404 18013 17453 20473 19158 15213 8961 7820 17710 21281 18879 13759 16675 21926 16675
9525 16675 10074 10931 9184 10558 14270 11879 5358 3581 4710 4606 2658 3558 7738 11982 5122
9510E122m115K619P295M672k200p740o522M939J349K434L520l011j485L947J03
9495A0927P093k109M117M396r405m305N71l584n455o218L650P417O359L627j418
9480A5663J318j293p081N397N680k025m032o68M385J0358K24n450K032m702q509
9465A1297l003k133m696k207N925N291J560n443l657R213k407j610o46k19K175
9450I440k664O98j142K059P205k095K465J552J271k451m296j975k424N401j178
9435A1866M729k557q431p27J177L179m697l158k306j938J562j669R16n752K917
9420d889M747m549J631O4P640L426M466P285n092j5228J70l79N973K873O39k309
9404F468m118L166L558n931L951L215L253L842k609j3531o827K462M240R935l26
$$ plain form
9510 5122 1007 3626 10921 15593 13393 5653 -869 4070 5419 7853 11373 8362 6877 10824 10927
9495 10927 18020 15911 20028 24424 15019 10714 11285 7701 2246 -3972 -322 7095 13454 17081 15663
9480 15663 16981 15688 8607 14004 19684 17659 13627 12959 17344 27702 27926 22476 24508 19806 11297
9465 11297 8294 6161 1465 -742 5183 10474 12034 6591 2934 12147 9740 8130 7484 7265 9440
9450 9440 6776 7474 6332 8391 15596 13501 15966 17518 18789 16338 12042 10067 7643 13044 11866
9435 11866 16595 14038 5607 4880 6057 9236 4539 1381 -925 -2863 -1301 -2970 -2054 -7806 -4889
9420 -4889 -142 -4691 -3060 -2996 4644 8070 12536 19821 14729 -499 -329 -708 5265 8138 8777 6468
9404 6468 2350 5516 9074 3143 7094 10309 13562 17404 14795 1264 -5563 -3101 1139 11074 10748
9389A0748L040K142J208L715O280j59o398m400r346l596O162K131k278q464o460
9374e675N568K178L722N16J935k381R64m32o984m489p73L266R305K973j797J537
9358I433J461k475m899J124l183J235K760j520l781k231N136Q841r70L164O614
9343B0709q381j1791J976K46J962j095j592j242P552K858q914q69J171l555m426
9328e391k195O263l25k797P687N747J127j241j961r614k418j456j573m144O312
9313e979J684Q4j996K771Q269M252k248m623o408K095P843m2L142r70k140M001
9297I735n352m090k480l206p04k81N91L132N519o97j236k04L04l644k289L666
9281a236j972N096L997n952L126k097p230P46L443N862J221Q81M101L852k774
$$ plain form
9389 10748 13788 15930 17138 20853 27133 26974 20576 16176 6830 3234 9396 11527 9249 785 -5675
9374 -5675 -107 2071 5793 6309 8244 5863 6827 6395 -589 -5078 -5851 -2585 6720 9693 7896 9433
9358 9433 10894 8419 3520 4644 1461 2696 5456 3936 155 -2076 3060 11901 10931 14095 20709
9343 20709 12328 537 2513 2759 4721 3626 2034 792 8344 11202 2288 1419 2590 -965 -5391
9328 -5391 -7586 -1323 -1648 -4445 3242 8989 10116 8875 6914 -2700 -5118 -6574 -8147 -12291 -5979
9313 -5979 -4295 -4211 -6207 -3436 4833 9085 6837 2214 -4194 -2099 5744 5702 8844 7874 5734 9735
9297 9735 4383 293 -2187 -5393 -6097 -6378 -5787 -2655 2864 2167 931 727 1031 -2613 -4902 -1236
9281 -1236 -3208 1888 5885 -67 3059 962 -6268 -5522 -2079 3783 5004 5885 9986 13838 11064
9266A1064m69L559l242o452J786k718q854m614k241M878J0874M755r31N90M885
9251A2870l763p13k253o426n011k770M776L734K703M100l252j565Q12j817Q130
9236I555k36n661M99P127L400p224n646J891k031L530J615J076k12J092m400L061
9220G436M835m804J052l323l336l97L041r029n227M946O154k30q217P70K58M159
9204a912R122K69l863m187n704L896O363R9n308l057j678K767q37J119K683J564
9188A336n38Q007P396m990l975Q58j528j0896m251J904J424Q98J0441K206p31
9173G561M805j1585n215Q556J573r80J612n615k080m073L438M961l647L728J0092
9158A3131J492r296m452K78K703j488m037o531L992r99P22N096j175O100M576
$$ plain form
9266 11064 10595 14154 10912 4460 6246 3528 -5326 -9940 -12181 -7303 3571 8326 7395 7985 12870
9251 12870 9107 8394 6141 -285 -5296 -8066 -3290 444 3147 7247 3995 2430 3242 1425 9555
9236 9555 9319 3658 4157 11284 14684 7460 1814 3705 1674 5204 6819 7895 7683 8775 4375 7436
9220 7436 12271 7467 8519 5196 1860 1463 4504 -4525 -9752 -4806 1348 1118 -7099 -6329 -6071 -1912
9204 -1912 7210 7479 3616 -571 -6275 -2379 3984 4083 -1225 -4282 -5960 -3193 -4030 -2911 -228 1336
9188 1336 798 8805 16201 11211 7236 8094 6566 -4330 -8581 -6677 -5253 -4355 6086 8292 7561
9173 7561 12366 781 -4434 4122 5695 4715 6327 712 -1368 -5441 -2003 2958 -689 3039 13131
9158 13131 14623 5327 875 1153 3856 2368 -1669 -8200 -4208 -5207 -4485 611 -564 5536 10112
9143A0112L443o508o282J066K518J427m738j589K066o08M875J958N454n720L672
9128A1146r94o586l90L031K904m332L125L747M873K236j0371l662L55l216k306
9113d40j265n315O350K76m608J760l25m854M73J884O685M190n261J473k061k490
9097c528L297N434l659l549K350P757Q13Q86m62K67m122j129l121n664k095M181
9081b344N050K550m558l366J0019O591m32q634l75L551j49n869m379P232k169
9066B718o941l322N322R193M667M46p93m968j971m984K69K949k062k880m589k89
9050g235M912j368n7O23J466p19J620k809j74M120l245l410j71l7j354N769R811
9033G742J371k602K699o60m893N48m27o520l849o763Q70N124M014M331J062j526
$$ plain form
9143 10112 13555 7047 765 1831 4349 5776 1038 -551 1515 907 5782 7740 13194 7474 11146
9128 11146 10152 3566 3176 6207 9111 4779 7904 11651 16524 18760 8389 4727 5082 1866 -440
9113 -440 -1705 -7020 -670 -394 -5002 -3242 -3567 -8421 -7948 -6064 621 4811 -450 1023 -1038 -3528
9097 -3528 -231 5203 1544 -2005 345 8102 8915 9801 9339 9606 5484 4355 1234 -4430 -6525 -2344
9081 -2344 2706 5256 698 -2668 7351 13942 13510 4876 4501 8052 7903 2034 -2345 4887 2718
9066 2718 -4223 -7545 -2223 6970 11637 12083 11290 6322 4351 -633 -364 2585 523 -2357 -6946 -7235
9050 -7235 -2323 -3691 -3748 -3125 -1659 -2378 -758 -3567 -3741 379 -2866 -6276 -6447 -6484 -7838 -2069 7742
9033 7742 9113 6511 9210 8550 3657 4205 3778 -2742 -6591 -13354 -12484 -7360 -3346 985 2047 521
9017E21j261m374R36K689K670k804o421J903j491j741O993j396J17N728O852j812
9001G109p305J199j860J492m45n429J443K245N525L637O436q0q391M216m371m443
8985I78j909J664N551P185N201p56O192n809q836M434R500k653p018K30O830o055
8969A4729r401k621R212j35q636m681R69L320R8N033P372r854m112J3453j371
8954A3375l595M003K442q408r391k123J968L612O653N330o8k796n776j221J273
8939E278K207R066M468k846j0642j683O244M210N22j022l163o406k778m514R55
8924a04N017p51Q505L402l666r5o894l857k722j928M343K618j133l859L566M310
8908F752m84l692m136j515J511O411j173n64j297q55Q822R15p619r29k0K680K410
$$ plain form
9017 521 -740 -5114 -4178 -1489 1181 -1623 -8044 -6141 -7632 -9373 -2380 -3776 -3659 2069 8921 7109
9001 7109 -196 1003 -857 635 190 -5239 -3796 -1551 3974 7611 14047 13967 5576 9792 5421 978
8985 978 -931 733 6284 13469 18670 17914 24106 18297 9461 13895 23395 20742 13724 13954 20784 14729
8969 14729 5328 2707 11919 11784 3148 -1533 -564 2756 2854 7887 15259 5405 1293 14746 13375
8954 13375 9780 13783 16225 7817 -1574 -3697 -1729 1883 8536 13866 13798 11002 5226 4005 5278
8939 5278 7485 16551 21019 18173 7531 5848 12092 16302 16824 15802 12639 6233 3455 -1059 -104
8924 -104 4913 4162 12667 16069 12403 12308 5414 1557 -1165 -3093 1250 3868 2735 -1124 2442 6752
8908 6752 6268 2576 -1560 -3075 -1564 4847 3674 3110 1813 958 9780 10695 3076 2147 2127 4807 7217
8891G217Q0K855O078j627k165M908K7o719q809J460N35k197q0N661L759j463o394
8874C126k947J185N148M809o75k184j466K436l73n569m550M639m193M347j532
8859B201l992n509L526Q982L152l109j708J924j57l978N842K711j39o6m262O741
8843A2159K253l719p583m869l0K704j625l356R550K770m980j0955L68J1809n33
8828C963o66l208O072N327J323N342j354l842n775o192o315o03P280l111r09L757
8812A089l39l672Q19n521n775N128K412K049k35O805l461L037o105o946k176L319
8796i572K242M234P49J794k063L622N564L679m40o058L352n083o064O605Q006
8781A0567l913m613M639k999o060N081Lo832P912P06l532p586m31J0779J685k058
$$ plain form
8891 7217 7297 10152 16230 14603 12438 17346 17373 10654 1845 3305 3840 1643 1563 7224 10983 9520 3126
8874 3126 179 1364 6512 11321 10646 8462 6996 9432 9059 3490 -1060 3579 -614 3733 2201
8859 2201 -1791 -7300 -3774 5208 8360 5251 3543 5467 5310 1332 7174 9885 9746 9680 5418 12159
8843 12159 14412 10693 3110 -1759 -1789 915 -710 -4066 5484 8254 3274 -7681 -7313 4496 3963
8828 3963 3297 89 6161 11488 12811 18153 16799 12957 7182 990 -5325 -5928 1352 -1759 -2668 1089
8812 1089 750 -2922 -2103 -7624 -13399 -8271 -5859 -3810 -4045 2760 -701 2336 -3769 -10715 -12891 -9572
8796 -9572 -7330 -3096 -2347 -553 -2616 1006 6570 10249 9809 3751 7103 2020 -4044 2561 10567
8781 10567 6654 2041 6680 3681 -2379 2702 2705 -4127 3785 4491 959 -6627 -7058 3721 5406 3348
8765C348j589o427J265M518J176m443n034m54J161P327j52n387K169N464L577
8750F519j451R10J01K762k627p567j1413J607J1175J152Q4K978P158p813j2891
8735i316l613J530k540L75n41M53j857o34L864Q964J299k368k157K288R11L446
8719A04J046o313j261R469K891o643j033L704L213n62O65q77N87o112J429k194
8703a887K355j072j791m23N164j673Q10n041Q88J384k564O46K766O151L82K090
8687H185k871K681Q845O598j569j1114j3399L82M124m833J672N659R78m376l345
8672b383P616M14J58M747k532l238L032K458k089P699L31j847m377m04k984O98
8656G299m357K246J590p34L9r969n33O971M75k083J630l355k437L919o76J352
$$ plain form
8765 3348 1759 -4668 -3403 1115 2291 -2152 -7186 -7640 -6479 848 696 -4691 -2522 2942 6519
8750 6519 5068 5978 6079 8841 6214 -1353 -12766 -11159 16 1168 1252 4230 11388 3575 -9316
8735 -9316 -12929 -11399 -13939 -13564 -14105 -13652 -15509 -16143 -12279 -3315 -2016 -4384 -6541 -4253 -3342 104
8719 104 1150 -5163 -6424 3045 5936 -707 -1740 1964 5177 4615 5280 4403 4990 -1122 307 -1887
8703 -1887 468 -604 -2395 -2818 2346 673 1483 -3558 -2670 -1286 -3850 -3204 -438 5713 6095 8185
8687 8185 5314 7995 16840 23438 21869 10755 -2644 -2262 1862 -2971 -1299 4360 5338 962 -2383
8672 -2383 5233 5647 5805 10552 8020 4782 7814 10272 8183 15882 16213 14366 9989 9585 6601 7299
8656 7299 2942 5188 6778 6044 6083 -3886 -4419 2552 3027 944 2574 -781 -3218 701 25 1377
8640A377P247L887N380j010P42N085q430m324n250r510J103L936K21Q19M164N77
8624F014m627j482K019k909M382M792L539j821k706L721k695l503J0364N569J516
8609B2173k787l674n071m47m659J993P526J0549Q791K023r309j1993m064k510
8595H541L600j160M544P398r109Q28N246N63j2832p587r07j842M648Q442M422
8580A4795Q62o008j37J0305k525q053L307j916K608J384l658M716J634J476N43
8565A9333n429k984O599m9p50J4414J1652N437J3861K2242J613j4401j4963q021
8551D8554o847j930q977N395K496K854j020q167r531N863L573o421n415m223J920
8536A8124k194m590J096o056J744O591k719k802P87M211m758n770L560P043m548
$$ plain form
8640 1377 8624 12511 17891 16881 17623 22708 14278 9954 4704 -4806 -3703 233 454 1273 5437 6014
8624 6014 1387 -95 1924 -985 3397 8189 11728 9907 7201 10922 8227 4724 15088 20657 22173
8609 22173 19386 15712 10641 10194 5535 7528 15054 25603 34394 36417 27108 15115 11051 8541
8595 8541 12141 10981 15525 22923 13814 14642 19888 20451 7619 32 -875 -2717 1931 10373 14795
8580 14795 15657 9649 9512 19817 17292 9239 12546 10630 13238 14622 10964 15680 17314 18790 19333
8565 19333 13904 10920 17519 17470 16720 31134 42786 48223 62084 84326 85939 71538 56575 48554
8551 48554 41707 39777 30800 36195 38691 41545 40525 32358 22827 28690 32263 25842 20427 16204 18124
8536 18124 15930 11340 12436 6380 8124 14715 11996 9194 9981 14192 9434 3664 7224 14267 9719
8521I719j036j510r04O399q83m212K068m876L354J3428J4572K596o625n771m774
8506B1545q499q175k902K73K466m657p72M146k892j0436k571P987Q616J666K010
8491G805l777r606m994J064Q271K527j584J2k484m700L819Q274N959n635m587
8476C64o780k557R192J1148N121q18N500r33r778l659k970O93N311n288q410J202
8460b662M047j562l698J959L446l330J276N60L054r62L913k071j878j377l006
8445b291p022l825L641m495l53K747K172J1837K912L77k409J830M567k190l21
8430G177J740p888k197l159N67O797J068M283j713k659Q66K283K312q240o003
8415d766O459k936N731P774K452r045J829L019n876o049L341J127K758R81m123
$$ plain form
8521 9719 8683 7173 6269 12668 11785 7573 9641 4765 8119 21547 36119 38715 32090 26319 21545
8506 21545 13046 4871 1969 2242 4708 51 -721 3425 533 -9903 -12474 -4487 4129 5795 7805
8491 7805 4028 -5578 -10572 -9508 -1237 1290 -294 -282 -2766 -7466 -3647 4627 10586 4951 364
8476 364 -6416 -8973 219 11367 16488 15670 21170 20237 10459 6800 3830 4523 9834 4546 -3864 -2662
8460 -2662 1385 -177 -3875 -1916 1530 -1800 -524 36 3090 2128 6041 3970 2092 715 -2291
8445 -2291 -9313 -13138 -9497 -13992 -14345 -11598 -9426 2411 5323 5700 3291 5121 9688 7498 7177
8430 7177 8917 1029 -1168 -4327 -3760 3037 4105 8388 6675 4016 4882 7165 9477 1237 -4766
8415 -4766 1693 -1243 4488 12262 14714 5669 7498 10517 4641 -1408 1933 3060 5818 6799 2676
8400B676j49N896k064m113J803k126J786N009k342j532M375N319L001l101j395
8385A3043l767j5219l951n24L453P324L189q559n691J226M579L385O801R63k298
8370C954l153n792Q362J745j981M814o553q918k705O324N867P97K694N198J498
8355A2151J355j102P20l203M415K788k974k422m477J1313L412p685n327l235J376
8340G105p965n993m12L109K862P498l277j620L059k847J301L651k243R85M547
8325I760O00q053J254J0939m995n530j723K815o277m081n814K661P085N2m01K544
8309H36Q52j264l333L76K406o60K340j365N88J345j392m966n24O692m339M263
8293A855J1119K360o223r489j327L418R235K261j130l051l497l215j550K105M495
$$ plain form
8400 2676 2527 8423 6359 2246 4049 1923 3709 8718 6376 4844 9219 14538 17539 14438 13043
8385 13043 9276 -5943 -9894 -10418 -6965 359 3548 -5011 -10702 -9476 -4897 -1512 5289 6252 3954
8370 3954 801 -4991 3371 5116 3135 7949 1396 -7522 -10227 -3903 1964 2761 5455 10653 12151
8355 12151 13506 12404 13124 9921 14336 17124 14150 11728 7251 18564 21976 14291 8964 5729 7105
8340 7105 -860 -6853 -7265 -4156 -1294 6204 2927 1307 4366 1519 2820 6471 4228 5213 9760
8325 9760 10360 2307 3561 14500 9505 3975 2252 5067 -1210 -5291 -11105 -8444 -1359 -1307 -1708 836
8309 836 1688 424 -2909 -2533 -127 -787 1553 188 776 2121 729 -4237 -4761 1931 -2408 1855
8293 1855 12974 15334 9111 -378 -1705 1713 10948 13209 12079 9028 5531 2316 766 2871 7366
8278G366o002q265M62K681N385N017N6k075m374L480j158j324Q117O983r01n375
8262A0073l902o969O66R719n285j5384n60N280J401q2N085j2976J78R370M366
8247I80j249j836J807o294J424K942P81L920O232L847p612n08J434K528Q676o208
8231A0864p380q517q102L061J0917M316j562L767J355J023Q497j281r238m307
8217C413j4743k984P440M986P299M621K388k475m203j4q62p148j608n9J061J0797
8201G909r88Q18l785m081l0J583j09N81O300k046n461m658L382J721q830L573
8185d121P398J793l439m589k549M190R812N892q593o933m008k74m552L542J0066
8170C635j334j1331j647j923n040O034N714K16N258N785J344R1j846j814K079
$$ plain form
8278 7366 1364 -6901 -6439 -3758 1627 6644 6700 4625 251 3731 2573 1249 9366 16349 15448 10073
8262 10073 6171 -798 -132 9587 4302 -11082 -11642 -6362 -4961 -5043 42 -12934 -12756 -3386 980
8247 980 -269 -2105 -298 -6592 -5168 -2226 -1445 2475 8707 12554 4942 4434 5868 8396 17072 10864
8231 10864 3484 -5033 -13135 -10074 843 5159 3597 7364 8719 9742 18239 16958 7720 3413
8217 3413 -11330 -14314 -6874 -1888 5411 10032 12420 9945 5742 5728 4866 -2282 -3890 -3949 -2888 7909
8201 7909 6921 7739 3954 -127 -157 1426 1317 1898 8198 6152 691 -3967 -585 1136 -7694 -4121
8185 -4121 3277 5070 1631 -2958 -5507 -1317 8495 14387 5794 -1139 -5147 -5421 -9973 -6431 3635
8170 3635 2301 -9030 -10677 -12600 -17640 -11606 -5892 -5676 -418 5367 6711 6802 4956 3142 5221
8155E221J427l280Q09p56j90Q04M483o101m647N550N674j261l027J818j067n230
8139B27m828k880R237O186m52j685K352O678p755l960M343j253k763K372M076
8124I895j640l091k393K146l082J47l58m967J2144J929K012k225l86L612m984
8109H759o423j690j325p230Q633K837j745K418K531K817m832m219L56N438L272
8094I597N083J952M080j265j3110j2180K430N993r57N269l877J473J398J469M667
8079A2022K034j97K063k982q553l348R26q7L67K232K112N597K016o479p65K215
8063I173L277n489N034m519l987L417o453J108L666P383j162j0318l573K482J220
8048A259l431J457L796L021K344q669l666R022K107j709M283m477l856n836j89
$$ plain form
8155 5221 6648 3368 4177 3421 3231 4035 8518 2417 -2230 3320 8994 7733 4706 6524 5457 227
8139 227 -4601 -7481 1756 7942 7490 5805 8157 14835 7080 3120 7463 6210 3447 5819 9895
8124 9895 8255 5164 2771 4917 1835 1982 1624 -3343 8801 10730 12742 10517 10131 13743 8759
8109 8759 2336 646 -679 -7909 724 3561 1816 4234 6765 9582 4750 531 887 6325 9597
8094 9597 14680 16632 20712 19447 6337 -5843 -3413 2580 1623 6892 3015 4488 5886 7355 12022
8079 12022 14056 13859 15922 12940 4387 1039 1965 1878 2245 4477 6589 12186 14202 7723 6958 9173
8063 9173 12450 6961 11995 7476 3489 6906 453 1561 5227 12610 11448 1130 -2443 39 1259
8048 1259 -2172 -715 3081 6102 8446 -223 -3889 5133 7240 5531 9814 5337 1481 -4355 -4544
8033d544Q778N022j0432l53r0k750J073r98P898L220K72K728k663m548m081j77
8017a645K150o10j918J0755J1008l175j0859k359l417O291J1600k02M63l396p159
8002G527r5J915L776J743k362J898p939r145n101L716q96K787K52J651L34L653
7986C714k411n906n439j419P057P440L654k439r420P81O913P560j408k252k41
7971F184M19m850l2Q11N927n82m373L298n37o748R03R083N159K981l113j288L564
7954A6806K678m907k675l498J549O419M249q74j1971r700j131P432Q488N423n239
7939A3049L150O534p080p314K772J045L345k795q677n029K217O783M938j133M568
7924A6373J946j170l499J928l513k031j206P266m658m693N386J10M163N056j248
$$ plain form
8033 -4544 4234 9256 -1176 -1529 -1619 -4369 -3296 -4294 3604 6824 7096 9824 7161 2613 -1468 -1645
8017 -1645 505 -105 -2023 8732 19740 16565 5706 3347 -70 6221 17821 17619 18082 14686 7527
8002 7527 7432 9347 13123 14866 12504 14402 6463 -2682 -7783 -4067 -4963 -2176 -1924 -273 61 3714
7986 3714 1303 -4603 -10042 -11461 -4404 3036 6690 4251 -5169 -4388 2525 10085 8677 6425 6184
7971 6184 6603 1753 1721 2532 8459 7877 3504 6802 6265 -483 420 9503 14662 17643 14530 13242 16806
7954 16806 19484 14577 11902 8404 9953 16372 20621 19747 7776 -1924 -3055 4377 12865 18288 13049
7939 13049 16199 22733 15653 8339 11111 12156 15501 12706 4029 -1000 1217 8000 12938 11805 16373
7924 16373 18319 17149 13650 15578 12065 10034 8828 16094 11436 6743 12129 12239 16402 21458 20210
7909B0210j555J08j084l74m854j776M429l82N533O042L163j157j3376m644K0j604
7893H699K120O375O388j343q416m623j2460j199P392K318J435K730n63N491k558
7878A1786n332l309L124M979l497M205M419p84l515j102Q33q240n790N494M049
7863G320j928m000n813l74L986j200j774L024L857M57J343J926k861J140k500
7848B603l474N617j864j1468J898J1783k843n653J2156J929m729p074M61l169
7834c827J988Q673J110N921P82j456r170l562Q764J117K14K311k364k774j422
7819F305l711p210K593N74J90k256j878k3K840O971J167N285k733o479n668P135
7803C102O7l35m047o739P991P832J404k655N24k261n051P046L464k355n024Q65
$$ plain form
7909 20210 18655 18763 17679 17305 12451 10675 15104 14722 20255 26297 29460 28303 14927 10283 10303 8699
7893 8699 10819 17194 23582 22239 13823 9200 -3260 -4459 2933 5251 6686 9416 8853 14344 11786
7878 11786 6454 3145 6269 11248 7751 11956 16375 15591 12076 10974 11807 3567 -2223 3271 7320
7863 7320 5392 1392 -4421 -4795 -809 -2009 -3783 -759 3098 3555 4898 6824 3963 5103 2603
7848 2603 -871 4746 2882 -8586 -6688 5095 2252 -3401 8755 10684 5955 -1119 -658 -3827
7834 -3827 -1839 6834 7944 13865 14647 13191 4021 459 9223 10340 10554 12865 10501 7727 6305
7819 6305 2594 -4616 -2023 -1449 -1259 -3515 -5393 -5416 -2576 4395 5562 10847 8114 1635 -4033 3102
7803 3102 3169 2834 -1213 -7952 39 7871 9275 6620 7144 4883 -168 6878 10342 7987 2963 3828
7787C828P886L08q02l52k553K192L939m014q746m877m37r04J101P520j228J243
7771D104n202r426J529J0152R347L344j2305o576j503o16m309j390K613Q664O279
7756D705j357J718N708J304j630n05J897L183K058o114j3581P53K390K926J478
7741D933k324l081N40J643k99m976M846K052P48j765l478K091l092K431M547N095
7725I911J091J516N918N55n858m176L050j0884o706J577r05k107N5K186n2L132
7709a697L946M436k679m402p47M557k672k64L18m71l212j37j673k683N107N225
7693B952j622M20l488M802n79n940p124L223K484K478p33J193q821l832L945l150
7677a3792k795N61J2188N632r818k137R974j22o891k878j051K500P107M430j370
$$ plain form
7787 3828 11714 12022 11220 10868 8315 10507 14446 10432 1686 -3191 -3628 -4532 -3431 4089 2861 4104
7771 4104 -1098 -10524 -8995 1157 10504 13848 1543 -5033 -6536 -7152 -11461 -12851 -10238 -1574 4705
7756 4705 3348 5066 10774 12078 10448 9943 11840 15023 17081 10967 -2614 -1861 529 3455 4933
7741 4933 2609 -472 68 1711 1412 -3564 1282 3334 4082 2317 -1161 930 -2162 269 4816 9911
7725 9911 11002 12518 18436 18991 13133 8957 12007 1123 -5583 -4006 -4911 -7018 -6963 -4777 -4829 -1697
7709 -1697 2249 6685 4006 -396 -1143 3414 742 478 796 325 -2887 -3024 -4697 -7380 -2273 2952
7693 2952 1330 1750 -1738 3064 2485 -3455 -10579 -7356 -4872 -2394 -3127 -1934 -10755 -14587 -10642 -13792
7677 -13792 -16587 -16026 -3838 1794 -8024 -10161 -187 -309 -7200 -10078 -11129 -8629 -1522 2908 1538
7662A538O255k751m558j372M924j042P11l189J463L786j255m857M495N862q225
7647A785k507R639j890J292n395r368Q36n38L889Q4o1K815n455Q42M893o456n17
7630f112l164M302J2659q144m991M226J602o87j843Q105j011j1162k408J596j562
7615h594l090J914L532R4n97P432J1816n04p223K463o049l550L481J412r385k09
7599g057K697j964m150K125O191n486m80m68j330K170k56K098L63l089K652j734
7583g718k016j345L189k81J691O620J349m077m318M906O98o790J848Q183K891
7568D830l277j0032o366K521N454m4l734r268j525J2067L550l98M95K089M611
7553I73R53m672O49N580K181j913k891k835l482m458J672O614K291o75l051q20
$$ plain form
7662 1538 7793 5042 484 -888 4036 2994 3705 516 1979 5765 4510 -347 4148 10010 1785
7647 1785 -722 8917 7027 8319 2924 -6444 -5608 -6146 -2257 -2173 -2234 581 -4874 -4032 861 -5595 -6112
7630 -6112 -9276 -4974 7685 -459 -5450 -1224 378 -309 -2152 5953 4942 -6220 -8628 -7032 -8594
7615 -8594 -11684 -9770 -6238 -6144 -6741 691 12507 12003 4780 7243 1194 -2356 1125 2537 -6848 -7057
7599 -7057 -4360 -6324 -10474 -8349 -2158 -7644 -8124 -8592 -9922 -7752 -8008 -5910 -5547 -8636 -5984 -7718
7583 -7718 -9734 -11079 -7890 -8171 -6480 140 1489 -2588 -6906 -2000 -1302 -8092 -6244 1939 4830
7568 4830 1553 -8479 -14845 -12324 -6870 -6914 -10648 -19916 -21441 -9374 -5824 -6222 -5727 -3638 973
7553 973 1926 -2746 -2097 3483 5664 3751 860 -1975 -5457 -9915 -8243 -1629 662 -13 -3064 -3884
7537c884K07P756M554J311k279q90L311m984n263m655o404q459L552M835M910
7522f382J994M765K624K309N871l958l843L838N809k501m287m754r698K151J6153
7507A0091J1768Q200p905j0520o679n12Q97m236r282M686N657l744K828p852n614
7492a2217Q669L144m95l183o214N460N700J217K881m884k585k879L001k503J933
7477b955l2p745p967K683Q003N709l376p218L665J072j129J240K494n024M930
7462e650M496l535M933j199n817L857k127N366R489N362K793m21j80q034r355
7447b2n663J599m38j05K670k005j821K380m721j119p79L264l401k432L899L937
7431d757q85j462o43M308P763J962p713j1420o34L341J597M290J228K018K258
$$ plain form
7537 -3884 -3677 4079 8633 9944 7665 6775 10086 5102 -161 -4816 -11220 -19679 -16127 -11292 -6382
7522 -6382 -4388 377 3001 5310 11181 7223 3380 7218 13027 10526 6239 1485 -8213 -6062 10091
7507 10091 21859 30059 22154 11634 4955 4443 5340 1104 -8178 -3492 2165 -1579 1249 -6603 -12217
7492 -12217 -3548 -404 -899 -4082 -10296 -4836 864 2081 4962 78 -2507 -5386 -2385 -4888 -2955
7477 -2955 -2987 -10732 -18699 -16016 -8013 -2304 -5680 -12898 -9233 -8161 -9290 -8050 -5556 -10580 -5650
7462 -5650 -1154 -4689 244 -955 -6772 -2915 -5042 324 9813 15175 17968 17547 17367 9333 -22
7447 -22 -5685 -4086 -4524 -4629 -1959 -3964 -5785 -3405 -8126 -9245 -10024 -6760 -10161 -12593 -8694 -4757
7431 -4757 -5642 -7104 -7747 -3439 4324 6286 -1427 -12847 -13481 -10140 -8543 -4253 -3025 -1007 1251
7416A251n635K502j42M254O140k675k950K970R12Q80j866L213K548l855l37j589
7400E621n966n400o968m079P285J307p571l181L950P886N566l841l55J599Q8p398
7384a1457q6K027L646j759N23O210j932k361k815J841J654o773m438J56M809N242
7368e513J116L818L235j215n587J526L155K982O338J939l205p127m81P917r01
7353G997j1032j0137O821M365J735j53J058K000m154j576l408O174K473j993j843
7338a673p712p882L342K539l837L899N596k088l52L63J299q228j516M407L107
7323h736P134l30k107R50m519K424L086J363k659J091P598K807j543q921J63L248
7307A049o79k978k722L567l2p148m429K002J791L832N487N087O384J221P417j09
$$ plain form
7416 1251 -4384 -1882 -2024 2230 8370 5695 2745 5715 6627 7507 5641 8854 11402 7547 7210 5621
7400 5621 -345 -5745 -12713 -16792 -9507 -8200 -15771 -18952 -15002 -7116 -1550 -5391 -5746 -4147 -4059 -11457
7384 -11457 -11543 -9516 -5870 -7629 -7106 -896 -2828 -5189 -8004 -6163 -4509 -11282 -15720 -15564 -10755 -5513
7368 -5513 -4397 -579 2656 1441 -4146 -2620 535 3517 9855 11794 8589 1462 981 8898 7997
7353 7997 -3035 -13172 -6351 -1986 -251 -404 654 2654 -1500 -3076 -6484 -310 2163 170 -1673
7338 -1673 -9385 -17267 -13925 -11386 -15223 -11324 -5728 -7816 -8168 -7805 -6506 -14734 -16250 -11843 -8736
7323 -8736 -1602 -1932 -4039 -3089 -7608 -5184 -2098 -735 -3394 -2303 5295 8102 6559 -2362 -2199 1049
7307 1049 370 -2608 -5330 -1763 -1795 -8943 -13372 -11370 -9579 -5747 -260 4827 11211 12432 19849 19740
7291A9740j731N88k045n652l261j371K825q087j0576L445K693L415q39L676n57
7276B263n439p112K787P487j663m882J911j965m244j208K556K038j44R95m848
7261a1468M9J0164N921j176p126o963M313K910N199n80R30k251m289J359L915
7246I07J664m398J571J2909J0399l791n881m900m550k69J927p92m028l496Q12
7231a916J579Q65k414j875M174lk488j773p738l644L543J899L857O466p42n373
7215e583N989K676k80j267j276n323l03p66l92k390k845M292N774K292k129p12
7199b243K949K967N322k582J042m928N748j80j1531o488N886M025j440J515p57
7184f95K953K760O50L057L292k451j0354m768N563K054n972K329N398q375m446
$$ plain form
7291 19740 18009 18597 16552 10900 7639 6268 9093 1006 -9570 -6125 -3432 -17 -856 2820 2263
7276 2263 -3176 -10288 -7501 -14 -1677 -6559 -4648 -6613 -10857 -12065 -9509 -7471 -7615 -6620 -11468
7261 -11468 -11419 -1255 4666 3490 -3636 -10599 -6286 -3376 1823 1243 2173 -78 -4367 -3008 907
7246 907 2571 -1827 -256 12653 23052 19261 13380 8480 3930 3661 5588 4796 768 -2728 -1916
7231 -1916 -337 528 -1886 -3761 413 410 -2078 -3851 -11589 -15233 -11690 -9791 -5934 532 -210 -5583
7215 -5583 406 3082 2802 1535 259 -5064 -5367 -6133 -6525 -8915 -11760 -7468 -1694 598 -1531 -2243
7199 -2243 706 3673 8995 6413 7455 2527 8275 8095 -3436 -9924 -4038 -13 -1453 62 -695
7184 -695 2258 5018 5668 8725 12017 9566 -788 -5556 7 2061 -3911 -1582 3816 -4559 -9005
7169i005L773J992M676l048R07j56N14M559P95J182L38L92p109J364j393J170
7153I51o36m399l72J4p10N124M331r26p878n538R44K674N138k017N56o16M674
7136A314j753j212N505J0309L177j590k876r3k615M799J042j967j974r23n030
7121F113q17K772L805N22m443j0809n047J894L869R30K025l062l007p95k715N645
7105c120j969L097M236K69K87o715K944P949l068k658j373q37Q05k973P29M540
7089B143j683M52K083R25J359k227k86l691l670n496n81k539m733P231P476n727
7073h964k377M382R840L652o681J55P141k836R79N891L474N442n799k100l210
7058H989p609k875K734K661K239N016K596o007j1385l296K636L495n66k63l207
$$ plain form
7169 -9005 -5232 -3240 1436 -1612 -705 -861 -347 4212 5007 6189 6527 6919 -190 1174 -219 951
7153 951 315 -4084 -4456 -4442 -5152 -28 4303 3377 -4501 -10039 -9095 -6421 -1283 -3300 -2744 -3360 1314
7136 1314 -439 -1651 3854 14163 17340 15750 12874 12781 10166 14965 16007 14040 12066 11143 6113
7121 6113 5296 8068 11873 12395 7952 -2857 -7904 -6010 -2141 -1211 814 -2248 -5255 -6050 -8765 -3120
7105 -3120 -5089 -1992 2244 2513 2800 -3915 -971 6978 3910 1252 -121 -958 -153 -3126 -2397 2143
7089 2143 460 912 2995 3920 5279 3052 2766 -925 -4595 -10091 -10672 -13211 -17944 -10713 -3237 -8964
7073 -8964 -11341 -6959 2881 6533 -148 7 7148 4312 5291 11182 14656 20098 14299 12199 8989
7058 8989 1380 -1495 1239 3900 6139 11155 13751 7744 -3641 -6937 -4301 -806 -1372 -1635 -4842
7043d842K590K844n571j93M334J153O12k992L882J311r79k576k514K122k039P94
7027b064m844k674l12m297N93j314R026K961j042M0M039l723m706M941N952M654
7011G230L992r40p235N02N788M146q160l826J722J236n94m830l867K37j497j94
6995f290j276Q29r54J212k917j323P653J0229J652K23n528o698m84M39R078l818
6979B027r177m485l48N617P232n34j226j010r418L38N216M923O274K920R98J32
6963I479n55m687l698l120J470J181O50K695l731l537K917O206j017l747L423
6948C929K049p404p89N495L879j945m633J925m491q523p78L529J972L806j565
6933c544o701p74M327L70n668L11Q180K295n186q518K293N546k144R704K305N161
$$ plain form
7043 -4842 -2252 592 -4979 -5172 -838 315 927 -2065 1817 3128 2149 -427 -2941 -819 -2858 -2064
7027 -2064 -6908 -9582 -9894 -14191 -13598 -14912 -5886 -2925 -3967 -3927 112 -3611 -8317 -3376 2576 7230
7011 7230 11222 10282 3047 3549 9337 13483 5323 1497 3219 4455 3861 -969 -4836 -4599 -6096 -6290
6995 -6290 -7566 -6737 -7691 -6479 -9396 -10719 -3066 7163 8815 9038 3510 -3188 -3672 -3233 5845 2027
6979 2027 -7150 -11635 -11983 -6366 866 332 -894 -1904 -11322 -10984 -5768 -845 5429 8349 9347 9479
6963 9479 8924 4237 539 -2581 -1111 70 720 3415 -316 -3853 -936 5270 4253 506 3929
6948 3929 5978 -1426 -2215 3280 7159 5214 581 2506 -1985 -10508 -11286 -7757 -5785 -1979 -3544
6933 -3544 -10245 -11019 -6692 -6322 -11990 -11679 -3499 -1204 -6390 -14908 -12615 -7069 -9213 491 2796 7957
6917G957j211m933j393k123N172l335p49K858m711M275K475M644K118k790j1781
6902c527J177R614M286P76J382m798l610q21j1815j0245m606M772K441J556L967
6887i451R265j164k685n909O440M706j758k243l94n545o69P818L811O24n538m831
6871g523n386j842K084O000K947O939J386j241k745k374O808K640k255m572q467
6856g601L39M380N341m434R0P73K492J391l158o279R600O182n751o580M445N18
6840A748l540k524m730J36M420L824k939k625O4K729q36j808o751o745N15Q164
6824a0898j382M017M755l910Q92l02K759M602p185j152k00k341j443N681M034
6809b073q294OQ66N525L625K476P352R98p340j3144L093P238J14n121O62m033
$$ plain form
6917 7957 6746 1813 420 -1703 3469 134 -615 2243 -2468 1807 4282 8926 11044 8254 -3527
6902 -3527 -2350 7264 11550 12326 13708 8910 5300 4479 -7336 -17581 -22187 -17415 -14974 -13418 -9451
6887 -9451 -186 -1350 -4035 -9944 -3504 1202 -556 -2799 -3193 -8738 -9407 -1589 2222 2846 -2692 -7523
6871 -7523 -12909 -14751 -12667 -6667 -3720 3219 4605 3364 619 -1755 5053 7693 5438 866 -7601
6856 -7601 -7262 -2882 2459 -1975 -1885 -1112 1380 2771 -387 -6666 2934 9116 3365 -3215 1230 1748
6840 1748 -1792 -4316 -9046 -8910 -4490 -666 -3605 -6230 -6166 -3437 -4273 -6081 -12832 -19577 -19062 -10898
6824 -10898 -12280 -8263 -3508 -7418 -6526 -6828 -4069 533 -6652 -7804 -8004 -10345 -11788 -6107 -2073
6809 -2073 -10367 -10361 -9495 -3970 -345 2131 9483 10481 3141 -10003 -6910 328 442 -4679 -4017 -8050
6793h050k517j185M101J536p299O61L533N143N64K720M764K170l623j1785N121
6778d146M484M85K282P34R81n158m416k223J139O404Q387M46j497p628J991N210
6762G475m61q240k602k041j124N466l16q947m440K918Q642P664J789L43p736j886
6746c496M144l448J240K421J363n294p575J637O098M132K512o00o55j620k197
6731a338j129K685J534j0190m363P254N056R476M241m317n990p187o64k001J895
6716e038j383M812J676n88O309k4J247p947l580n17K74K791L693l994p50M950
6700A931r24j3k192m340m439m684K951P047O556M864K311K114l877n564L085n050
6684b24K132o12j1409M88J510K79M620K696l334J87o079l920M64L231j019L022
$$ plain form
6793 -8050 -10567 -11752 -7651 -6115 -13414 -12753 -9220 -4077 -3513 -793 3971 6141 2518 -9267 -4146
6778 -4146 338 823 3105 3839 4820 -338 -4754 -6977 -5838 566 8953 9399 7902 274 2265 7475
6762 7475 7014 -1226 -3828 -5869 -6993 -1527 -1843 -10790 -15230 -12312 -3670 3994 5783 6126 -1610 -3496
6746 -3496 648 -2800 -1560 861 2224 -3070 -10645 -9008 -2910 1222 3734 3134 2479 859 -1338
6731 -1338 -2467 218 1752 -8438 -12801 -5547 -491 8985 13226 8909 2919 -4268 -4932 -6933 -5038
6716 -5038 -6421 -1609 67 -521 5788 5764 7011 -936 -4516 -5033 -4759 -1968 1725 -2269 -3019 1931
6700 1931 1007 994 -1198 -5538 -9977 -14661 -11710 -4663 1893 6757 9068 11182 7305 1741 4826 -224
6684 -224 1908 1296 -10113 -9625 -8115 -7836 -3216 -520 -3854 -3667 -9746 -13666 -13202 -9971 -10990 -7968
6668g968j867L079M132J611q46l730o154J843K673J980J443j63K779J0748k124
6653G436q232n415l252K509m394Q676N73l118J211j235o547J949J089J2307N125
6638H682n95J739l238k471l599j1593k183M074O836P015N053j826J876k535r8
6623G137J988K114n725n792k04j361J128L220j228o822K440M128L86m205m591
6608g387j878j034m338l127L825J3125O121J370q799l203r81M314K336m196K561
6593a291r05n544k968K426O796j322m192j419J391N2j262L014O83L587O771j115
6577D702l284l825o178J619J386P02L489N34l318o23K710Q5j468n747J828N724
6561a664L617O506P13l212j1892j407N103K970j56K206n670n34n801L37J903r18
$$ plain form
6668 -7968 -9835 -6756 -2624 -1013 -1859 -5589 -11743 -9900 -7227 -5247 -3804 -3967 -1188 9560 7436
6653 7436 -796 -6211 -9463 -6954 -11348 -2672 -2099 -5217 -4006 -5241 -11788 -9839 -8750 3557 8682
6638 8682 8087 9826 6588 4117 518 -11075 -13258 -9184 -2348 4667 9720 7894 9770 7235 7137
6623 7137 9125 11239 5514 -278 -482 -1843 -715 2505 1277 -5545 -3105 1023 1409 -2796 -7387
6608 -7387 -9265 -10299 -14637 -17764 -13939 -814 5307 6677 -2122 -5325 -6306 -1992 344 -3852 -1291
6593 -1291 -2196 -7740 -10708 -8282 -1486 -2808 -7000 -8419 -7028 -6976 -8238 -5224 -4541 -954 5817 4702
6577 4702 1418 -2407 -8585 -6966 -5580 -4878 -1389 -855 -4173 -4796 -2086 -2001 -3469 -9216 -7388 -1664
6561 -1664 1953 8459 9172 5960 -5932 -7339 -2236 734 578 2784 -2886 -3420 -9221 -8884 -6981 -7899
6545g899j844N629L376o527o676O445J256M731m379M744R273M028l518r526K206
6530A319M411k311j1257p543P121P292L325k029k33M230k74q627J892k214N814
6515I16K188o392l742M235J621m590n091r96J027M918L337N516K577k943K477
6500E058K231q43L530m359l199K864L359k015J290l432L632k5J314p642n347N52
6484c032M853Q282m936m438K424P968o40j541k707m979l662k417J47l2n04m411
6468i625q062J503L59J38L439J537K647J497L396l438L440O639r13M314k945r361
6452e435n908M678K463Q69J517K376L375L032m294n602N13O563L4J400J81M149
6436I911M48p59n077m119m910K296M185n212q80n103p929Q273K578K018r4j022
$$ plain form
6545 -7899 -9743 -4114 -738 -7265 -13941 -7496 -6240 -1509 -5888 -1144 8129 12157 8639 -887 1319
6530 1319 5730 3419 -7838 -15381 -8260 -968 2357 328 95 4325 4051 -4576 -2684 -4898 916
6515 916 3104 -3288 -7030 -2795 -1174 -5764 -10855 -11851 -10824 -5906 -2569 2947 5524 2581 5058
6500 5058 7289 6446 9976 5617 2418 5282 8641 6626 7916 4484 8116 8091 9405 1763 -3584 -3032
6484 -3032 1821 10103 5167 729 3153 11121 10481 8940 6233 1254 -2408 -4825 -4678 -4710 -5214 -9625
6468 -9625 -17687 -16184 -15825 -15687 -12248 -10711 -8064 -6567 -3171 -6609 -3169 3470 2557 6871 3926 -5435
6452 -5435 -11343 -6665 -4202 -3333 -1816 560 3935 6967 2673 -2929 -2416 4147 4181 5581 5762 9911
6436 9911 10359 9600 4523 404 -4506 -2210 1975 -3237 -4117 -9220 -17149 -8876 -6298 -4280 -4374 -5396
6420e396M694K542M254k603q518j658j562M179J447n597L74K323L005m406p7K677
6404d322L74j565q34M718k38N11L939K690j133m386p323L337P046k280n736M863
6388c39n009J999m96j109M163j250j372Q1N159L408k609n230m8L384m384L977
6372C25l687r02k863J648l356r16M453L055M697J186k936N611m77k923l148l256
6356c489m324r49n02K776J851M311l546n327R41J734Q1j094j575N874k37m85N51
6339c409o566n163J220L350K05K775J364l45r834m025K581L023J612K002L741
6324g469j808M843J0411L565j072l471p85R16L576K481k292o019L298n285n049
6309d160k583O637M768k8l675L442J355o445l40J466k826l420J059k578J819m603
$$ plain form
6420 -5396 -702 1840 6094 3491 -5027 -6685 -8247 -4068 -2621 -8218 -7844 -5521 -2516 -6922 -6999 -4322
6404 -4322 -3948 -5513 -6347 -1629 -1867 -1356 2583 5273 4140 -246 -7569 -4232 2814 534 -5202 -339
6388 -339 -5348 -3349 -3845 -4954 -791 -2041 -3413 -3332 1827 5235 2626 -2604 -2652 732 -3652 325
6372 325 -3362 -4264 -7127 -5479 -8835 -9751 -5298 -2243 2454 3640 704 6315 5838 2915 -233 -3489
6356 -3489 -7813 -8762 -9264 -6488 -4637 -326 -3872 -9199 -8258 -6524 -6443 -7537 -9112 -3238 -3475 -3960 -3409
6339 -3409 -9975 -15138 -13918 -10568 -10363 -7588 -6224 -6569 -16403 -20428 -17847 -14824 -13212 -11210 -7469
6324 -7469 -9277 -4434 5977 9542 8470 4999 4214 5130 8706 11187 8895 2876 6174 889 -4160
6309 -4160 -6743 -106 4662 4634 959 4401 5756 -689 -1029 437 -2389 -5809 -4750 -7328 -5509 -10112
6293a0112n421O345Q37L302M717j736l930J303N568K532l674l819j442j410M072
6278b868Q095P61j246r588l889O934O929m735q31J329K083N671n468n596L15k205
6262d309k700P041Q072n416j356n026N980r42j0097J369L049j939M9l693l396
6247a3314O291M143q58j375M712Q63j139R05L46J038m336j499o96K063J807k316
6231c365p570k540J2610k985K937N700K739j401m039M323P99p560m120J32L928
6216d12J665m284k920L875K705O650l825j2977m940J883K307K460l650O047O301
6201H85j712j445J211R53l66k623m948j887O779P341l571p64N419J277L337P37
6185A0623l464q80k374o525L937K886m23O432L157J90j7099k2R164P534n140j386
$$ plain form
6293 -10112 -15533 -9188 -8351 -5049 -332 -2068 -5998 -4695 873 3405 -269 -4088 -5530 -6940 -2868
6278 -2868 5227 5988 4742 -4846 -8735 -1801 5128 393 -438 891 2974 8645 3177 -2419 -2104 -4309
6262 -4309 -7009 32 8104 2688 1332 -3694 2286 1344 -8753 -7384 -4335 -6274 -6225 -9918 -13314
6247 -13314 -7023 -2880 -3738 -5113 -401 462 -677 228 574 1612 -2724 -4223 -4919 -2856 -1049 -3365
6231 -3365 -10935 -13475 -865 -3850 -913 4787 7526 6125 2086 6409 7208 -352 -4472 -4340 -412
6216 -412 1253 -3031 -5951 -2076 629 7279 3454 -9523 -14463 -12580 -10273 -7813 -11463 -5416 885
6201 885 -827 -2272 -1061 -108 -474 -3097 -8045 -9932 -3153 4188 617 -147 5272 6549 9886 10623
6185 10623 7159 6279 3905 -2620 1317 4203 3780 10212 13369 13559 -3540 -3562 5602 13136 7996 6610
6169F610m9m006L724k308l001l805J56N665o849q571J460p14M349O86l207J291
6153h569j548K023J700J012K869P286J211Q305l972j4981L164o81q53J370P390
6138E726K149n583p561m196k375L947K239K091l931k167j343L908J364J686Q02
6123c244j667K776L420R75l860M318j844O33m360K085K79l007m612K045J667L655
6107g41N957j598O55j59O2l760j938L01M547K742O913o043n057R42K235m938k740
6090b620L014M142J724k225n048p84k209N766J878J299k307K677J366l888l155
6075c70r475j392M105M449J443l266n15O514q52J614J0035O388q129j0448p808
6060g707j738J28M620N263O858Q0j783j60m131K381j323k213p718r06k836J758
$$ plain form
6169 6610 6561 2555 6279 3971 970 -2835 -2679 2986 -3863 -12434 -10974 -11688 -7339 -6653 -9860 -8569
6153 -8569 -10117 -8094 -6394 -5382 -2513 4773 5984 14289 10317 -4664 -1500 -2181 -3034 -1664 5726
6138 5726 7875 2292 -5269 -9465 -11840 -7893 -5654 -3563 -7494 -9661 -11004 -7096 -5732 -4046 -3244
6123 -3244 -4911 -2135 1285 2260 -1600 2718 874 1507 -2853 -768 -489 -3496 -8108 -6063 -4396 -741
6107 -741 5216 3618 4273 4114 4176 416 -1522 -1221 3326 6068 12981 6938 1881 2823 5058 120 -2620
6090 -2620 394 4536 6260 4035 -1013 -1797 -4006 1760 3638 4937 2630 5307 6673 2785 -370
6075 -370 -9845 -11237 -7132 -2683 -1240 -4506 -5021 1493 641 2255 12290 18678 10549 101 -7707
6060 -7707 -9445 -9317 -4697 566 7424 7504 5721 5561 1430 3811 2488 275 -7443 -8349 -11185 -9427
6044i427o30k288l161P93K314Q447J770o794l171n650j296Q223o75O642J891l755
6028f767n345r48N039R409K657k859j823n033n177J403N058K162M51J0544j007
6013G764j194j0344n844K247P147K87k390m185L827j755j715M247L469j801l214
5998c454k091O544K711o268J716L074m200R3M918O473k646k683l632K707j132
5983B130J861J832k954o381J640N540M656q561n483L698O382l552o48m39J991
5968A712K863m253L496m336k253P966K568O04L159m761p257K087J6J127K564l646
5952A656m251j378O690l780o144K136M632k871n751L979K260k271L099m41q651
5937a1086k503k61J934K769O17k499P105M14q190n106k608P654M736k695L620
$$ plain form
6044 -9427 -10057 -12345 -15506 -14713 -12399 -3952 -2182 -8976 -12147 -17797 -19093 -10870 -11545 -4903 -3012 -6767
6028 -6767 -12112 -13060 -8021 1388 4045 1186 -637 -5670 -10847 -9444 -4386 -2224 -1773 8771 7764
6013 7764 6570 -3774 -9618 -7371 -224 63 -2327 -6512 -2685 -4440 -6155 -1908 1561 -240 -3454
5998 -3454 -5545 999 3710 -2558 -842 2232 -1968 -1875 3043 9516 6870 4187 555 3262 2130
5983 2130 3991 5823 2869 -3512 -1872 3668 8324 -237 -5720 -2022 4360 808 160 -279 1712
5968 1712 4575 322 3818 -518 -2771 5195 7763 8367 11526 6765 -492 1595 1611 2738 5302 1656
5952 1656 -2595 -3973 2717 -1063 -7207 -5071 -439 -3310 -9061 -5082 -2822 -5093 -1994 -2435 -11086
5937 -11086 -13589 -13850 -11916 -9147 -8530 -11029 -3924 -3510 -11700 -16806 -19414 -11760 -7024 -9719 -6099
5922f099M578j227k274K149O674M176O96j1870l087j562J02R077N064q35j980
5907C582m118J797J297n814p188M296L049m975k167J2730N948m395r87k783m271
5892c999m754r96J682j244N080p576p993N58J1259O767J68J446O94l274n613K313
5876e482K155m582K334J194k959N275l780N47J603L883O397l20J979j398K04p110
5860f0L404k44m952p252m457K070M295P562m09K819K857K438J746j226K786L592
5844A4969l664o740R52l527q434l295K438O92k77J995M112q98n185k184R243N430
5828E627k754l481O38q47n215R52L607O44j488K653r55k169n74n87O924N075O408
5811A4458K197r733n341L66k905l896k364j517N893N393K684j204k560k352j34
$$ plain form
5922 -6099 -1521 -2748 -5022 -2873 3801 7977 8673 -3197 -6284 -7846 -7744 1333 6397 5562 3582
5907 3582 -536 1261 2558 -3256 -10444 -6148 -3099 -8074 -10241 2489 8437 4042 3055 272 -3999
5892 -3999 -8753 -9749 -8067 -9311 -4231 -11807 -19800 -19242 -7983 -1216 -1048 398 1092 -2182 -7795 -5482
5876 -5482 -3327 -7909 -5575 -4381 -7340 -2065 -5845 -5298 -3695 188 6585 6265 8244 6846 7050 -60
5860 -60 3344 3100 -1852 -9104 -13561 -11491 -7196 366 -43 2776 5633 8071 9817 8591 11377 14969
5844 14969 11305 4565 5517 1990 -6444 -9739 -7301 -6609 -6886 -4891 -779 -1677 -6862 -9046 197 5627
5828 5627 2873 -608 30 -817 -6032 -5080 -1473 -829 -2317 336 -619 -2788 -3362 -3949 2975 8050 14458
5811 14458 16655 6922 1581 1947 -958 -4854 -7218 -8735 -2842 2551 5235 4031 1471 -881 -1015
5796a015J754n463l820M989P981p93j66k497r891J468N96n276N13M119K04K331
5780d966M985K674m850j1258m443L900J0298J2033J03o934m015n245j774M555
5766d937m54K308J964K278k560N28k855l45K862j361J153L415O83L758J313n109
5750B641J253l235m658k953K151j416l948J136J7l469m67N396P925K132N33l261
5734b23k577M559J631K79L82J077p24k797O194k283k700K032l747k761j909N94
5718b973j33l76M07k361Q423J27k062M210q20k923l091P85Q09k034j379M510L661
5701D780l62M655n938p480m310k289L055k647K483J489k295J784j307M823K436
5686a123M238O083j838p515j0965J822K654J232N218L837l068m359k696K171j817
$$ plain form
5796 -1015 739 -4724 -8544 -3555 4426 3633 3467 970 -8921 -7453 -6857 -12133 -11620 -7501 -7297 -4966
5780 -4966 19 2693 -2157 -13415 -17858 -13958 -3660 8373 8476 1542 -2473 -7718 -9492 -4937
5766 -4937 -5391 -3083 -1119 1159 -1401 -873 -3728 -4073 -1211 -2572 -1419 1996 2679 6437 7750 2641
5750 2641 3894 659 -3999 -6952 -4801 -6217 -10165 -9029 -9012 -12481 -12948 -7552 373 2505 3038 -223
5734 -223 -2800 1759 3390 3669 4051 5128 4404 1607 7801 5518 2818 4850 1103 -1658 -3567 -2973
5718 -2973 -3106 -3482 -3075 -5436 2987 3114 1052 5262 4442 1519 -1572 -787 22 -2012 -3391 1119 4780
5701 4780 4418 9073 3135 -4345 -8655 -10944 -7889 -10536 -8053 -6564 -8859 -7075 -8382 -3559 -1123
5686 -1123 3115 9198 7360 -155 -11120 -9298 -6644 -5412 -194 3643 575 -3784 -6480 -4309 -6126
5671f126o4L776l064K851K61k348p618L692N994P721k923p669l139L500Q098J845
5655D787j814J518p527j917J469N530p36k851J903L941r15j1323l894J478O972
5640c379o58j791K033M03J937k363j352J69M397M522J290k316l921j226r88R276
5624F033q05o641l380k474P231J0480j240l807o574K636K775J923J466j1114j236
5609d727O399n965k26l624J282J40K018M500K555O59P52l977l793k704P606M123
5593E018m783k866j533K381o900j0326P141P037J338M494m698N08M747j482K484
5578B560O313o566m609l842j612M554L543Q04N81o263k148L665R411J689o130
5563A950Q4K696q198j640L057m731o372j279J105J227L472k80K58j748Q203K910
$$ plain form
5671 -6126 -6190 -2414 -5478 -2627 -2366 -4714 -12332 -8640 -2646 5075 2152 -5517 -8656 -5156 2942 4787
5655 4787 2973 4491 -3036 -4953 -3484 2046 1310 -1541 362 4303 3388 -7935 -11829 -10351 -3379
5640 -3379 -4037 -5828 -3795 -3392 -1455 -3818 -5170 -5001 -604 3918 5208 2892 -1029 -2255 -3243 6033
5624 6033 5228 -1413 -4793 -7267 -36 10444 9204 5397 -1177 1459 4234 6157 7623 -3491 -4727
5609 -4727 1672 -4293 -4519 -8143 -6861 -6721 -4703 -203 2352 3011 3763 -214 -4007 -6711 895 5018
5593 5018 235 -2631 -4164 -1783 -8683 -19009 -11868 -4831 -3493 1001 -3697 -3189 1558 76 2560
5578 2560 8873 2307 -2302 -6144 -7756 -3202 341 1145 1726 -4537 -6685 -3020 6391 8080 1950
5563 1950 2034 4730 -3468 -5108 -2051 -6782 -13154 -14433 -13328 -12101 -8629 -8909 -8651 -10399 -2196 714
5547G14m1k57p37l979L648M332p68k630M21K401P869N027K752o547p629l715l854
5530b993l155L601K281k354L641K45N421k834j16j237J518K679k886k321k915
5515a425l95J047o949p34P617O129L15K010l925m019J881p20m415jL845m410J742
5498b407J954l251N090L325R94k194m589o322k372J240j154M071M886j2924q90
5483a4543Q823R285j293o292p725k386J03j677N085M096K904J127j440r55L941
5468i47m047p472P119J4646M589r469n11M691M456l953r979l444K823J110o762
5453g150j968P650O368J781j820k0q396j125K267j117l77M561Q593M414m488j429
5437G744n467l459L437M877J374n02l000J237M11L051K192l306n296n005k962
$$ plain form
5547 714 673 416 -321 -4300 -652 3680 2912 282 703 3104 10973 16000 18752 12205 4576 861 -2993
5530 -2993 -6148 -2547 -266 -2620 1021 1266 6687 3853 3737 2500 4018 6697 3811 1490 -1425
5515 -1425 -1820 -773 -7722 -8456 -839 5290 5605 7615 3690 -329 1552 832 -3583 -3584 261 -4149 -2407
5498 -2407 -453 -3704 1386 4711 5705 3511 -1078 -7400 -9772 -8532 -9686 -5615 -729 -13653 -14543
5483 -14543 -5720 3565 2272 -4020 -11745 -14131 -14028 -15705 -10620 -6524 -3620 -2493 -3933 -4888 -947
5468 -947 -4994 -12466 -5347 9299 13888 4419 3908 8599 13055 9102 -877 -4321 -1498 -388 -7150
5453 -7150 -9118 -1468 4900 6681 4861 4841 -3555 -4680 -2413 -3530 -3907 654 9247 13661 9173 7744
5437 7744 2277 -1182 2255 7132 8506 8004 5004 6241 6652 9703 11895 8589 3293 -1712 -4674
5422d674J586J719J670j719j996l102J26m594k205N193r05L278k381n583N836
5407g751O366J715j129n777k688n28Q521O833m207K313j079j164k72k296M02j341
5391b082K826L133J905J529p265p193l401K645M110J260M974n04O502k278j304
5376D857l066m962J63n527j0338n196L886R759M123N22J2513K270Q78n683j915
5361B284p469q340J4179J2071r177l663l63l56L201J751o497j477M913L165m600
5346c78J43j276L085K040O007L866l110j0474k607l580l813J639L728l341k98
5331h369L558M640n72p18N401j534n12j868l266j471L244P88K47N059L679L46
5315H652j347J065l879K109K786L868q188r103J137N485j074J120j482m154j133
$$ plain form
5422 -4674 -3088 -1369 301 -1418 -3414 -6516 -6390 -10984 -13189 -7996 -8901 -5623 -8004 -13587 -7751
5407 -7751 -1385 330 -799 -6576 -9264 -9792 -1271 5562 1355 3668 2589 1425 1153 -1143 -741 -2082
5391 -2082 744 3877 5782 7311 46 -7147 -10548 -7903 -3793 -2533 2441 1937 8439 6161 4857
5376 4857 1791 -3171 -3008 -8535 -18873 -24069 -20183 -10424 -6301 -5779 6734 9004 9882 4199 2284
5361 2284 -5185 -13525 654 12725 3548 -115 -478 -834 2367 4118 -2379 -3856 1057 4222 -378
5346 -378 -235 -1511 1574 3614 9621 13487 10377 -97 -2704 -6284 -10097 -8458 -4730 -8071 -8369
5331 -8369 -4811 -171 -743 -1461 3940 2406 1894 26 -3240 -4711 -1467 -679 -432 4627 8306 8652
5315 8652 7305 8370 4491 6600 9386 13254 5066 -4037 -2900 2585 1511 2631 1149 -3005 -4138
5300d138n27n550L39O84l610j269N284Q679O303L1q859R18m459j171M440J803
5284a102K806P421O18p131r243l590L372l009l779M071R93M618N484J263Q92j74
5268C510K543m692k962j435K741J108N018j3O10m543l946l322j011J113N946j123
5252d58p50l947l924N366L410l6o43K70j744L939j025j335M074P295m919n408
5236A65o529o402n75K827P470k048q02R500k555p365J431M191L64p678j437k503
5220a1946l955J281P379O429N355k843l899N531J868J214o88j742J627J947L794
5205A1352k323o914n442l676n309R95l41j628Q522O034n042r199L465R551K81
5190C26l567j372O27Q482o179o492K266J371m777K106N620j189K550j119K753
$$ plain form
5300 -4138 -4665 -10215 -9876 -9192 -12802 -14071 -8787 -108 6195 6226 -2633 -1715 -6174 -7345 -2905 -1102
5284 -1102 1704 9125 9743 2612 -6631 -10221 -6849 -9858 -13637 -9566 -8573 -3955 1529 2792 3684 3510
5268 3510 6053 1361 -1601 -3036 -295 813 5831 5818 6428 1885 -2061 -5383 -6394 -5281 665 -458
5252 -458 -1208 -5155 -9079 -3713 -303 -339 -982 -712 -2456 1483 458 -877 3197 10492 5573 165
5236 165 -6364 -12766 -13341 -10514 -3044 -5092 -5894 3606 1051 -6314 -4883 -692 -328 -8006 -9443 -11946
5220 -11946 -15901 -14620 -7241 -812 4543 1700 -2199 3332 5200 6414 5726 3984 5611 7558 11352
5205 11352 9029 2115 -3327 -7003 -12312 -11317 -11658 -13286 -4764 1270 -3772 -12971 -9506 45 326
5190 326 -3241 -4613 -3986 4496 -1683 -8175 -5909 -4538 -9315 -7209 -1589 -2778 -228 -1347 1406
5175A406L961J088o928J681N48j1K438P26m575j344L169M28n974qN56l345l355
5158i539j660k506N601J424K473M044k914K099j229k026k78o978j033J889N459
5143e174l953r419J89L797N707K168L862P095J542j0667r082M60N371q57L090
5128e871J987m580m214M016K382j109k079K756J386L924K744p204k401O47O00
5113g016K158n469O440q46j547m010J947J87r41N855L837j910K791n94J211J231
5097C324j627r870P397Q504p551l253L99l813l248j570n42L20Q623l164k85P500
5081A144k682q056l354N448O94J290O58J9M376P7k348n377o25K599O69L019m047
5064f496r90j492j49J271j315k136N092O530O308k763n827k085m06n370P59K833
$$ plain form
5175 1406 5367 6455 -473 1208 1756 1745 4183 4909 334 -1010 2159 2587 -3387 -3395 -2839 -6184 -9539
5158 -9539 -11199 -13705 -8104 -6680 -4207 -163 -3077 -978 -2207 -4233 -4511 -11489 -12522 -10633 -5174
5143 -5174 -9127 -18546 -18357 -14560 -8853 -6685 -2823 4272 5814 -4853 -13935 -13475 -8104 -8961 -5871
5128 -5871 -3884 -8464 -12678 -8662 -6280 -7389 -9468 -6712 -5326 -1402 1342 -5862 -8263 -7616 -7016
5113 -7016 -4858 -10327 -3887 -4733 -6280 -10290 -8343 -8156 -9097 -3242 595 -1315 1476 882 2093 3324
5097 3324 1697 -8173 -776 7728 177 -3076 -2677 -6490 -9738 -11308 -11850 -11530 -2907 -6071 -6356 1144
5081 1144 -1538 -9594 -12948 -7500 -6806 -5516 -4858 -4839 -463 -386 -2734 -8111 -8736 -6137 -5468 -2449 -6496
5064 -6496 -7486 -8978 -9127 -7856 -9171 -11307 -6215 315 6623 3860 -1967 -4052 -4458 -9828 -9069 -6236
5048f236J400p2J697j313l422m644j417M198Q335K328L88k807L059R692k622j2985
5032d421n271P039L467m518l085l405K443p50J396J367L280L916o965j3226K360
5017a6373N054J386r28M380K975o879K180O334N182n69n251r16L651j492j481
5002b747P598N994n968j0479j431K428m552k21K383J590O615N265n783o479m223
4987a0010k961N64L262n026N2M442l617L178N499L947l996o69k352k459J470L088
4971e588N029J611k246l771p79n56k693P38j0187L127J3225P910K370P34j514
4956G410M84k964L913M6l300N41o608n717L309P319k39l069j0760M80J677M049
4940c429p521l038L861Q298J1093K236p773k834j452J642Q345J155k096l524m425
$$ plain form
5048 -6236 -4836 -4908 -3211 -4524 -7946 -12590 -14007 -9809 -1474 854 1242 -1565 1494 11186 8564 -4421
5032 -4421 -9692 -2653 814 -3704 -6789 -10194 -7751 -8501 -7105 -5738 -2458 1458 -5507 -18733 -16373
5017 -16373 -11319 -9933 -10861 -6481 -3506 -10385 -8205 -1871 3311 2742 -2509 -3425 226 -1266 -2747
5002 -2747 4851 10845 4877 -5602 -7033 -4605 -9157 -9378 -6995 -5405 1210 6475 692 -5787 -10010
4987 -10010 -12971 -12407 -9145 -14171 -14119 -9677 -13294 -10116 -4617 -670 -4666 -5335 -7687 -10146 -8676 -5588
4971 -5588 -559 1052 -1194 -4965 -5744 -6300 -8993 -8255 -18442 -15315 -2090 5820 8190 8924 7410
4956 7410 7894 4930 8843 8889 5589 6130 -478 -6195 -2886 4433 4194 1125 -9635 -9155 -7478 -3429
4940 -3429 -10950 -13988 -10127 -1829 9264 11500 3727 893 -559 1083 9428 10583 8487 4963 538
4925E38k547j729K358K248J637J765J253j13k951m858K968K323k481j837n72K162
4909A64K7M966L309p745q224k686K675n399q222J1611O082j331Q83K82J429K606
4893D27K832p28J989J481P22j755l901l391o29k687L047k4N250n431m694K879
4877d613K63n352L771j691N6N576r68m006N501L592r33m465J156l778K621L235
4861c5q450J376j785o121K092Q189O698L787j281o102j853J25L873N387q47n527
4845d74n312J89j96k437o39M588N296k266K67k332k730r78N375K018k822K715
4829B62N118R930J410p247n348L288N025l586K802M762m474o374m041K986j977
4814B536j766R6l3M501n66q12m287l613j852Q194P329M208l826l967m916J916
$$ plain form
4925 538 -2009 -3738 -1380 868 2505 4270 5523 5410 2459 -2399 569 2892 411 -1426 -1998 164
4909 164 191 5157 8466 721 -7503 -10189 -7514 -12913 -21135 -9524 -3442 -4773 -3890 -3608 -2179 427
4893 427 3259 2531 4520 6001 6723 4968 1067 -2324 -2953 -5640 -2593 -2617 2633 -2798 -7492 -4613
4877 -4613 -4350 -9702 -5931 -7622 -7566 -1990 -2958 -6964 -1463 2129 1196 -3269 -2113 -5891 -3270 -35
4861 -35 -8485 -7109 -8894 -15015 -12923 -4734 1964 5751 4470 -1632 -3485 -3360 513 5900 5053 -474
4845 -474 -5786 -5597 -5793 -8230 -8869 -4281 1015 -1251 -984 -3316 -6046 -7024 -1649 369 -2453 262
4829 262 5380 15310 16720 9473 4125 7413 12438 8852 11654 16416 11942 5568 1527 4513 2536
4814 2536 770 866 833 5334 4768 3956 -331 -3944 -5796 2398 9727 13935 10109 6142 1226 3142
4798C142J112j787K404j924j331k343O273K111k648o743o933k038L509O746K728
4783B278m480j877m678n018J069N275K137l648m91M162N853K929o438o118K185
4768f860P049k646j752l041k778r590j681J1182J0085L323J98M228l544l77j640
4753B156M217J967l557n054J624j479J3J182J963k36k283j368J823J952r980o017
4737a3077Q359M665J973q215R20J673J537J590n430p93J613M74O969k466m22j16
4721g46J694P567r75n366n7n846J314N939R22j143m743K195P955l768n237p093
4705g388L188J276k291p267k747J189j848O602J2983M446m31j971m471N66O112
4690G948n403r04p782m634j668K300M971M051R13M114J48j094J676N071k658m284
$$ plain form
4798 3142 4254 2467 4871 2947 1616 -727 5546 7657 5009 -1734 -8667 -10705 -7196 -450 2278
4783 2278 -2202 -4079 -8757 -13775 -12706 -7431 -5294 -8942 -9433 -5271 582 3511 -2927 -9045 -6860
4768 -6860 189 -2457 -4209 -7250 -10028 -19618 -21299 -10117 -32 3291 3489 7717 4173 3796 2156
4753 2156 6373 8340 4783 -271 1353 -126 -113 1069 3032 2796 513 -855 968 2920 -7060 -13077
4737 -13077 -4718 -53 1920 -6295 -5375 -3702 -2165 -575 -6005 -6798 -5185 -4711 2258 -208 -630 -746
4721 -746 948 8515 7540 2174 2117 -3729 -2415 3524 4446 3303 -1440 755 8710 4942 -295 -7388
4705 -7388 -4200 -2924 -5215 -12482 -15229 -14040 -15888 -9286 3697 8143 7712 5741 1270 1836 7948
4690 7948 2545 1641 -6141 -10775 -12443 -10143 -5172 -1121 -208 3906 4054 2960 4636 9707 7049 2765
4674B765k327k284j700J984R277N58r224j974j968m89N49k897M096P379L214k352
4658D607Q35k891j1710j482J788L753n780L274o53j045K371R413O317K101m839
4643F059m875l708j765o19j387m52M896l755m466L255J1524o337k767M025j59
4628e31j725l038L141K090k028m884Q286K705m337k704n526M368N937M1j209p38
4612a52m133k549P341M186o251p349J025P99J078q3n43L197M270k156J481q98
4596g37m980j678k642L597M261j476k397m51N392J51j675m177K19J0789J471k40
4580E427K103L171o893k327L049l532M020n55j2864n085M860M459k473K732K217
4565a691o168m581M445L256l552O57J260k648J328K300m677L162J144K343J325
$$ plain form
4674 2765 438 -1846 -3546 -1562 7715 8273 -951 -2925 -4893 -5382 -4833 -7730 -3634 3745 6959 4607
4658 4607 5442 2551 -9159 -10641 -8853 -5100 -10880 -7606 -8259 -9304 -6933 2480 8797 10898 6059
4643 6059 1184 -2524 -4289 -4908 -6295 -6747 -1851 -5606 -10072 -6817 4707 -1630 -4397 -372 -531
4628 -531 -2256 -5294 -2153 -63 -2091 -6975 1311 4016 -321 -3025 -8551 -4183 1754 1795 586 -152
4612 -152 -4285 -6834 507 4693 -1558 -8907 -7882 -7083 -6005 -6088 -6631 -3434 836 -1320 161 -737
4596 -737 -5717 -7395 -10037 -6440 -2179 -3655 -6052 -6503 -1111 -960 -2635 -6812 -6593 4196 5667 5427
4580 5427 7530 10701 3808 1481 4530 998 5018 4463 -8401 -13486 -8626 -4167 -6640 -3908 -1691
4565 -1691 -7859 -12440 -7995 -4739 -8291 -7634 -6374 -9022 -7694 -5394 -10071 -6909 -5765 -3422 -2097
4550b097L014L338j40m510o130M008L026O78q059o92J519P572P138q40q576m992
4534e743M277J909N62l02k980p653o241Q003M914K582k733n781L648O858k916
4519a596m091J878P996m1J839K906L204m004k071l7q817n963j456L526M322o81
4503c086n77j274j910J501P403j269k372M660J010q586j0385K645N041M469O35
4488b095o017k903N101L838k872J991J766o903q938J966L968j197l93n325O048
4473a1965P012O926O796j025p439p102J503J0669N396j890M20o351o072J286l460
4458e296M784L646j772L49l641P581L446q881k635K14k076K305N76k654K335J487
4442b32K994m653o079K23k44P005L377J604r839P740L33n7l029R30j80L951L358
$$ plain form
4550 -2097 917 4255 4115 -395 -6525 -2517 509 1187 -6872 -7564 -6045 1527 8665 7825 -751 -5743
4534 -5743 -1466 443 1005 703 -2277 -9930 -16171 -8168 -3254 -672 -3405 -9186 -5538 1320 -1596
4519 -1596 -5687 -3809 4187 4146 5985 8891 12095 8091 6020 5983 -2834 -8797 -10253 -6727 -2405 -3086
4503 -3086 -3663 -4937 -6847 -5346 2057 788 -1584 3076 4086 -4500 -14885 -12240 -7199 -2730 -2095
4488 -2095 -8112 -11015 -5914 -2076 -4948 -2957 -1191 -8094 -17032 -15066 -11098 -12295 -12688 -18013 -11965
4473 -11965 -4953 1973 8769 7744 305 -6797 -5294 5375 10771 8881 9301 2950 -3122 -1836 -5296
4458 -5296 -512 3134 1362 1711 -1930 5651 9097 216 -2419 -2205 -4281 -1976 -1400 -4054 -1719 -232
4442 -232 2762 -1891 -7970 -7747 -7991 -986 2391 3995 -5844 1896 2229 2172 -857 73 -107 3844 7202
4425G202j580M381n958n011O530R2o992l862k364Q05J57K378J2253K479n049p621
4409b160k442k055k969N81L029J908j484J408L466k819j645m147l602l18N144
4394h105L293J779R91L994n822L128N160k316Q92J320r94l804M353N705l84n717
4378C473o371n674L737P136J813j575q482n142K477Q232L182M726r53n445l651
4363b517L967N250M485j866j2447n071j817n569K3Q877M137M326M705j339j610
4348C534l949l776j879j625p76n099k48k160k231N72L229Q505J208L478L334o289
4332d172J751J909N65k466P65M485k216J714L407M652k93p289m590K988P101J295
4316I606k3k984l834m629J595n200j899N975K800J874K084n29q105n72J721N790
$$ plain form
4425 7202 5622 10003 4045 -966 5564 5656 -1336 -5198 -7562 -6757 -6600 -4222 8031 10510 5461 -2160
4409 -2160 -4602 -6657 -9626 -9045 -6016 -4108 -5592 -4184 -718 -3537 -5182 -9329 -12931 -13249 -8105
4394 -8105 -4812 -3033 -2042 1952 -3870 -742 4418 2102 2994 4314 3320 -484 3869 9574 9190 3473
4378 3473 -2898 -8572 -4835 2301 4114 2539 -5943 -11085 -8608 -376 2806 7532 6579 1134 -2517
4363 -2517 1450 6700 11185 9319 -3128 -8199 -10016 -15585 -15562 -6685 -2548 1778 6483 5144 3534
4348 3534 -415 -4191 -6070 -7695 -8471 -13570 -13818 -15978 -18209 -17637 -14408 -5903 -4695 -1217 2117 -4172
4332 -4172 -2421 -512 53 -2413 -1648 2837 621 2335 5742 10394 10101 2812 -1778 1210 8311 9606
4316 9606 9583 6599 2765 -1864 -269 -5469 -7368 -1393 1407 3281 5365 4836 -3269 -3841 -2120 3670
4300C670K651p119n993L370J953k305l247l998K90q35M148P450J889P38n479k586
4284e403M436n66L438q16m984R90J101m851n356O175J970N562L992N075N02n889
4268E376P36l405n405L212K560k376l136m132K017R76M2P8J278K140J557L965
4252E483m35m885j269R37j03K935l941j992M414m303q372J0495L044q918r93Q251
4236C48Q217j05n311O80J645l511m649j30J206L552K293q71l06N534n337p027
4220c772p894M738J1726n894k769K817P213m878k376k522l728m954n241O853J081
4205i600L816k794J25K728M123L453l186N686L775j167O03Q034k88r790j196n566
4189a244o027J154J258l770P233P360j014l430m374K343O70k244n820m569K788
$$ plain form
4300 3670 6321 -798 -6791 -3421 -1468 -3773 -7020 -11018 -10728 -11563 -7415 35 1924 2662 -2817 -5403
4284 -5403 -967 -1533 1905 1089 -3895 -2905 -1804 -6655 -12011 -5836 -3866 1696 5688 10763 11265 5376
4268 5376 6112 2707 -2698 514 3074 698 -2438 -6570 -4553 -3577 -3535 -3457 -2179 -39 1518 5483
4252 5483 5048 163 -1106 -169 -272 2663 -1278 -3270 1144 -3159 -11531 -1036 2008 -6910 -7903 348
4236 348 8565 8460 3149 3829 5474 1963 -2686 -2816 -1610 1942 4235 3364 3058 8592 3255 -3772
4220 -3772 -11666 -6928 4798 -1096 -3865 -1048 6165 1287 -1089 -3611 -7339 -12293 -17534 -10681 -9600
4205 -9600 -5784 -8578 -8453 -5725 -1602 1851 -1335 4351 8126 6959 7562 15596 15308 5518 4322 -1244
4189 -1244 -7271 -6117 -4859 -8629 -1396 5964 4950 1520 -2854 -511 159 -2085 -7905 -12474 -9686
4174i686O141k165j976o299M535J2463L68J755P61p51J099l938m286K513J597
4159B131m905M23P253j900R62n609k056N519k143o551R95J423m649j297J139L935
4143e330r89k503P228j504m583K701j19j595K660o86o952P03N345J819J719j024
4127c110o502M468P783O988l421k208k323R30j0077o153L084J0727O128l118k214
4112I82k468k049O997O507o206l148M416L830O119O76m161o11o191j5k630J230
4096C278l084k711J836M803l269K926Q307j034r666o315L36j791k57k342k112
4081a1095L131N265M895k337j0095L03L861N471l96K293l412p76j476o02J107
4066c863L593N984K417j872j308k532m577k162K677J71r183M659L107J075l140
$$ plain form
4174 -9686 -3545 -5710 -7686 -13985 -9450 3013 3381 5136 5897 5146 6245 2307 -1979 534 2131
4159 2131 -2774 -2351 4902 3002 3964 -1645 -3701 1818 -325 -6876 -5881 -4458 -9107 -10404 -9265 -5330
4143 -5330 -6319 -8822 -1594 -3098 -7681 -4980 -5099 -6694 -4034 -4720 -11672 -10969 -5624 -3805 -2086 -3110
4127 -3110 -9612 -5144 2639 9627 6206 3998 1675 2605 -7472 -13625 -10541 186 6314 3196 982
4112 982 -1486 -3535 3462 9969 3763 615 5031 8861 14980 15656 11495 10884 4693 4678 2048 3278
4096 3278 194 -2517 -681 4122 853 3779 12086 11052 1386 -4929 -4593 -6384 -6641 -8983 -11095
4081 -11095 -7964 -2699 2196 -141 -10236 -9933 -6072 -601 -997 1296 -2116 -2892 -4368 -4970 -3863
4066 -3863 -270 5714 8131 6259 4951 2419 -2158 -4320 -1643 -1472 -10655 -5996 -2889 -1814 -4954
4051d954M72P21L552Q662j345j0455l043L218K77M044N407J243o638N48K026K002
4035E737n708K696O480q89n550l416J670K109J782L24l415K813K771n178k945
4020g19k75L835K549l712J009l677k275j941l791P537J221J140k468p588L230
4005e925J911l174n865m000L421k09L954J602O917j512J01l681r63k81l835O831
3989d708M679k257n633M537m69j173L126L701R59p862K613R012q08m674r41M419
3973D521k78k13o140k446Q78m833l011N110L979O080p74P927P231j252p085j2542
3957b848O14J463L760l622M19O227N845n970p788l21R980k568j61K00k859L154
3941E525L569r379q239k49O390j139L70j445m03J898M764L900M45j645N92l342
$$ plain form
4051 -4954 -4482 -3761 -209 8453 7108 -3347 -6390 -3172 -2895 1149 6556 7799 1161 1709 3735 5737
4035 5737 29 2725 9205 8316 2766 -650 1020 3129 4911 5235 1820 4633 7404 2226 -719
4020 -719 -994 2841 5390 1678 2687 -990 -3265 -5206 -8997 -1460 -239 901 -1567 -9155 -5925
4005 -5925 -4014 -7188 -13053 -17053 -13632 -13841 -9887 -8285 -1368 -2880 -2779 -6460 -7423 -7704 -11539 -4708
3989 -4708 -29 -2286 -7919 -3382 -3851 -5024 -1898 1803 2762 -5100 -2487 6525 5717 1043 102 4521
3973 4521 4243 4030 -2110 -4556 -3678 -8511 -11522 -6412 -2433 3647 2873 10800 18031 16779 9694 -2848
3957 -2848 -2234 -771 2989 -633 -214 6013 11858 5888 -1900 -2221 7759 5191 5030 5230 2371 5525
3941 5525 9094 -285 -8524 -8773 -2383 -3522 -3152 -4597 -5000 -3102 1662 5562 6007 4362 4954 1612
3925A612o527R45O438k915P551L406k99o996k775L416J930k172l428o053j446
3910g313J261O29J023L536l155M681L014J75J88j04k631k203Q220m70r649l843
3894f641J0351K86J561K519J527r512q846P43q5n471L301M113O714Q557M159j902
3878A1374l458l649n640o417l87k058j086K549N60j028J942K31n222L870L97K091
3862e931J071J465M623L342m021P40K273L801l396j414J262l645k66M422k357
3847A969j79J945p778K148O469L023J994j132m743q019k351j127j019M100N392
3832F92L132L594n69q218k577M500j903L527r91l205K365q221M759l528q56J289
3816f210K319O632J707q97n083M581Q042J224p862L903p968p893K367L515j170
$$ plain form
3925 1612 -4915 -3970 2468 -447 7104 10510 10211 3215 440 3856 5786 3614 186 -5867 -7313
3910 -7313 -6052 -5423 -4400 -864 -4019 662 3676 3851 4039 3935 1304 -899 7321 6851 -2798 -6641
3894 -6641 3710 3996 5557 8076 9603 91 -8755 -8012 -8097 -13568 -10267 -6154 560 9117 13276 11374
3878 11374 7916 4267 -1373 -7790 -8177 -10235 -11321 -8772 -8212 -9240 -7298 -7067 -12289 -8419 -8022 -5931
3862 -5931 -4860 -3395 1228 4570 549 1289 3562 7363 3967 2553 3815 170 -96 4326 1969
3847 1969 1790 3735 -4043 -1895 4574 7597 9591 8459 3716 -4303 -6654 -7781 -8800 -4700 692
3832 692 3824 7418 6849 -1369 -3946 554 -1349 2178 1187 -2018 347 -7874 -3115 -6643 -7499 -6210
3816 -6210 -3891 2741 4448 3551 -1532 3049 11091 12315 4453 8356 388 -7505 -5138 -1623 -2793
3801b793o551P57n671k199P412O716n357l278J864M044k194M867Q486K720o574
3786B249N869J0162J620p802q042m488p416O901K605m701m586K678N000m067j431
3771e449L937j450O12Q303J246M34o293M226K497r417l417l250j316N383J0158
3756F204J42K042p206j0133p18P361M473j714k7o28j553L781n023o768j213m229
$$ plain form
3801 -2793 -9344 -8587 -14258 -16457 -9045 -2329 -7686 -10964 -9100 -5056 -7250 -2383 6103 8823 2249
3786 2249 8118 18280 19900 12098 4056 -432 -7848 -947 1658 -3043 -7629 -4951 49 -4018 -5449
3771 -5449 -1512 -2962 -2350 5953 7199 7633 1340 5566 8063 -1354 -4771 -8021 -9337 -3954 6204
3756 6204 6346 8388 1182 -8951 -9669 -2308 2165 451 424 -204 -1757 2024 -2999 -9767 -10980 -15209
$$ [...]
##END NTUPLES=NMR SPECTRUM
##END=
