##TITLE=Analysis number 326638
Compound Code mo 08102
Project Code adrs
Chemist Name stores
##JCAMPDX= 6.0         $$ Bruker NMR JCAMP-DX V2.0
##DATA TYPE= NMR SPECTRUM
##DATA CLASS= NTUPLES
##ORIGIN= Bruker BioSpin GmbH
##OWNER= nmr
$$ XWIN-NMR		Version 3.5
$$ Fri Feb 16 09:04:18 2007 GMT Standard Time (UT+0h)  MAYBRIDGE\nmr@NMR_250MHZ
##.OBSERVE FREQUENCY= 250.131544655141
##.OBSERVE NUCLEUS= ^1H
##.ACQUISITION MODE= SIMULTANEOUS (DQD)
##.ACQUISITION SCHEME= undefined
##.AVERAGES= 16
##.DIGITISER RES= 18
##SPECTROMETER/DATA SYSTEM= dpx250
##.PULSE SEQUENCE= zg30
##.SOLVENT NAME= DMSO
##.SHIFT REFERENCE= (INTERNAL, DMSO, 0, 16.522)
##AUDIT TRAIL= $$ (NUMBER, WHEN, WHO, WHERE, WHAT)
$$ ##TITLE= Audit trail, XWIN-NMR		Version 3.5
$$ ##JCAMPDX= 5.01
$$ ##ORIGIN= Bruker BioSpin GmbH
$$ ##OWNER= nmr
$$ C:\u/data/dgb/nmr/ADRS/1050/pdata/1/auditp.txt
$$ ##AUDIT TRAIL=  $$ (NUMBER, WHEN, WHO, WHERE, WHAT)
(   1,<2007-02-16 09:03:55.29 +000>,<MAYBRIDGE\nmr>,<NMR_250MHZ>,
      <created by zg, POWCHK disabled, PULCHK disabled
       configuration hash MD5:
       49 4B E0 1D 92 C2 6B 37 9F E6 65 BC 52 41 86 1D
       data hash MD5: 64K
       1F 63 B2 2D 8C 9B AE 23 72 71 49 7D C5 2F 31 5A>)
(   2,<2007-02-16 09:04:08.71 +000>,<MAYBRIDGE\nmr>,<NMR_250MHZ>,
      <Start of raw data processing
       ef LB = 0.3 FT_mod = 6 PKNL = 1 SI = 32K 
       data hash MD5: 32K
       D5 73 DD 95 70 95 3C A5 85 4F F2 05 8D 85 5C 62>)
(   3,<2007-02-16 09:04:10.68 +000>,<MAYBRIDGE\nmr>,<NMR_250MHZ>,
      <apk 
       data hash MD5: 32K
       F6 F4 75 9A 9C 18 F3 62 1B DC 0A 3F F1 89 60 F0>)
(   4,<2007-02-16 09:04:11.43 +000>,<MAYBRIDGE\nmr>,<NMR_250MHZ>,
      <abs ABSG = 5 
       data hash MD5: 32K
       DE 26 97 65 6A 7A B0 53 56 EB 52 05 04 DB AF 75>)
$$ ##END=
$$ 
$$ hash MD5
$$ 50 0D B2 23 B9 8F 0B 52 2E 82 36 AE 54 30 4B 9D
##$RELAX= 
##$RELAX= 
##$RELAX= 
##$RELAX= 
##$RELAX= 
##$RELAX= 
##$RELAX= 
$$ Bruker specific parameters
$$ --------------------------
##$DU= <C:\u>
##$EXPNO= 1050
##$NAME= <ADRS>
##$PROCNO= 1
##$TYPE= <nmr>
##$USER= <dgb>
##$AMP= (0..31)
100 100 100 100 100 100 100 100 100 100 100 100 100 100 100 100 100 100 
100 100 100 100 100 100 100 100 100 100 100 100 100 100 
##$AQSEQ= 0
##$AQ_mod= 3
##$AUNM= <au_zg>
##$AUTOPOS= <40 >
##$BF1= 250.13
##$BF2= 250.13
##$BF3= 250.13
##$BF4= 250.13
##$BF5= 500.13
##$BF6= 500.13
##$BF7= 500.13
##$BF8= 500.13
##$BYTORDA= 1
##$CFDGTYP= 0
##$CFRGTYP= 5
##$CHEMSTR= <none>
##$CNST= (0..31)
1 1 145 1 1 1 1 1 1 1 1 1 1 1 1 1 1 1 1 1 1 1 1 1 1 1 1 1 1 1 1 1 
##$CPDPRG= <>
##$CPDPRG1= <>
##$CPDPRG2= <>
##$CPDPRG3= <>
##$CPDPRG4= <mlev>
##$CPDPRG5= <mlev>
##$CPDPRG6= <mlev>
##$CPDPRG7= <mlev>
##$CPDPRG8= <mlev>
##$CPDPRGB= <>
##$CPDPRGT= <>
##$D= (0..31)
0 1 0 0 0 0 0 0 0 0.06 0 0 0 0 0 0 0.0002 0 0 0 0 0 0 0 0 0 0 0 0 0 0 
0 
##$DATE= 1171616634
##$DBL= (0..7)
120 120 120 120 120 120 120 120 
##$DBP= (0..7)
150 150 150 150 150 150 150 150 
##$DBP07= 0
##$DBPNAM0= <>
##$DBPNAM1= <>
##$DBPNAM2= <>
##$DBPNAM3= <>
$$ [...]
##$SUBNAM7= <"">
##$SUBNAM8= <"">
##$SUBNAM9= <"">
##$SW= 20.6930455092707
##$SWIBOX= (0..15)
0 0 3 0 0 0 0 0 0 0 0 0 0 0 0 0 
##$SW_h= 5175.983436853
##$TD= 65536
##$TD0= 1
##$TE= 295.16
##$TE2= 300
##$TE3= 300
##$TEG= 300
##$TL= (0..7)
0 120 120 120 120 120 120 120 
##$TP= (0..7)
150 150 150 150 150 150 150 150 
##$TP07= 0
##$TPNAME0= <>
##$TPNAME1= <>
##$TPNAME2= <>
##$TPNAME3= <>
##$TPNAME4= <>
##$TPNAME5= <>
##$TPNAME6= <>
##$TPNAME7= <>
##$TPOAL= (0..7)
0.5 0.5 0.5 0.5 0.5 0.5 0.5 0.5 
##$TPOFFS= (0..7)
0 0 0 0 0 0 0 0 
##$TUNHIN= 0
##$TUNHOUT= 0
##$TUNXOUT= 0
##$USERA1= <user>
##$USERA2= <user>
##$USERA3= <user>
##$USERA4= <user>
##$USERA5= <user>
##$V9= 5
##$VALIST= <valist>
##$VCLIST= <CCCCCCCCCCCCCCC>
##$VD= 0
##$VDLIST= <DDDDDDDDDDDDDDD>
##$VPLIST= <PPPPPPPPPPPPPPP>
##$VTLIST= <TTTTTTTTTTTTTTT>
##$WBST= 1024
##$WBSW= 4
##$XGAIN= (0..3)
0 0 0 0 
##$XL= 0
##$YL= 0
##$YMAX_a= 291978
##$YMIN_a= -334871
##$ZGOPTNS= <>
##$ZL1= 120
##$ZL2= 120
##$ZL3= 120
##$ZL4= 120
##$ABSF1= 16.522
##$ABSF2= -4.171173
##$ABSG= 5
##$ABSL= 3
##$ALPHA= 0
##$AQORDER= 0
##$ASSFAC= 0
##$ASSFACI= 0
##$ASSFACX= 0
##$ASSWID= 0
##$AUNMP= <proc_1d>
##$AZFE= 0.1
##$AZFW= 0.1
##$BCFW= 0
##$BC_mod= 0
##$BYTORDP= 0
##$COROFFS= 0
##$CY= 12.5
##$DATMOD= 1
##$DC= 0
##$DFILT= <>
##$DTYPP= 0
##$F1P= 14.0000005364418
##$F2P= -0.99999901652339
##$FCOR= 0.5
##$FTSIZE= 32768
##$FT_mod= 6
##$GAMMA= 0
##$GB= 0
##$INTBC= 1
##$INTSCL= 1
##$ISEN= 128
##$LB= 0.3
##$LEV0= 0
##$LPBIN= 0
##$MAXI= 10000
##$MC2= 0
##$MEAN= 0
##$ME_mod= 0
##$MI= 0
##$NCOEF= 0
##$NC_proc= -6
##$NLEV= 6
##$NOISF1= 0
##$NOISF2= 0
##$NSP= 0
##$NTH_PI= 0
##$NZP= 0
##$OFFSET= 16.522
##$PC= 1
##$PHC0= 210.9171
##$PHC1= 10.77821
##$PH_mod= 1
##$PKNL= yes
##$PPARMOD= 0
##$PSCAL= 4
##$PSIGN= 0
##$REVERSE= no
##$SF= 250.13
##$SI= 32768
##$SIGF1= 0
##$SIGF2= 0
##$SINO= 400
##$SIOLD= 32768
##$SREGLST= <1H.DMSO>
##$SSB= 0
##$STSI= 32768
##$STSR= 0
##$SW_p= 5175.98343685301
##$SYMM= 0
##$S_DEV= 0
##$TDeff= 65536
##$TDoff= 0
##$TI= <Analysis number 999999
Compound Code 99
Book Reference 9
Project Code 9>
##$TILT= no
##$TM1= 0
##$TM2= 0
##$TOPLEV= 0
##$USERP1= <user>
##$USERP2= <user>
##$USERP3= <user>
##$USERP4= <user>
##$USERP5= <user>
##$WDW= 1
##$XDIM= 32768
##$YMAX_p= 591486557
##$YMIN_p= -1009500
$$ End of Bruker specific parameters
$$ ---------------------------------
##NTUPLES= NMR SPECTRUM
##VAR_NAME=  FREQUENCY,     SPECTRUM/REAL,   SPECTRUM/IMAG
##SYMBOL=    X,             R,               I
##VAR_TYPE=  INDEPENDENT,   DEPENDENT,       DEPENDENT
##VAR_FORM=  AFFN,          ASDF,            ASDF
##VAR_DIM=   32768,         32768,           32768
##UNITS=     HZ,            ARBITRARY UNITS, ARBITRARY UNITS
##FACTOR=    0.157963299565203, 1,           1
##FIRST=     4132.6476996994, 0,             0
##LAST=      -1043.33573715361, 0,           0
##MIN=       -1043.33573715361, -1009500,    0
##MAX=       4132.6476996994, 591486557,     0
$$ Real data points
##PAGE= N=1
##DATA TABLE= (X++(R..R)), XYDATA
$$ [...]
15689B19047J36896J06229p5987k38149k14M04571q7670k33358K1815L7333j87965
$$ 219047 355943 462172 386185 148036 147822 552393 464723 231365 253180 290513 102548
15678A02548r5972O2295M7280j15736m2321K78404K9664m627N8716J31804P1426
$$ 102548 6576 68871 116151 415 -41906 236498 266162 261535 320251 452055 523481
15667E23481q5098k50890j59779J64867R4359L2844J8782O9799J8822j25837m8905
$$ 523481 438383 187493 27714 192581 286940 319784 338566 408365 427187 301350 252445
15656B52445O4840K3247j63148j98139l8475K82645K14892m8485p8642k27005
$$ 252445 317285 340532 177384 -20755 -59230 223415 438307 389822 311180 84175
15646H4175J62567n7773l75848n5591K22910K92963J16909j8791k72171k99922
$$ 84175 246742 188969 -186879 -242470 -19560 273403 390312 371521 99350 -200572
15636b00572J19389K50568r3101J53781J09827k08130j77035j05587o4899K4295
$$ -200572 -81183 169385 76284 230065 339892 131762 -45273 -150860 -215759 -191464
15626a91464J51233J17489j69195K30124J31542K7605K64474n7258j77721j85755
$$ -191464 -40231 77258 -91937 138187 269729 297334 561808 504550 326829 141074
15616A41074o5466R5858J06308L8966J27437l3252j78566k16592p7097o9190j43154
$$ 141074 75608 171466 277774 316740 444177 410925 232359 15767 -61330 -130520 -273674
15605b73674k3970P1314J33242J21363n5400M5901J44103O641J6979J22083j17427
$$ -273674 -297644 -226330 -93088 28275 -27125 18776 162879 169520 186499 308582 191155
15594A91155j59987j51255k7566K6998J34487J03687J07757p8160j18563j5120
$$ 191155 31168 -120087 -147653 -120655 13832 117519 225276 147116 28553 13433
15584A3433L8427l0477j28631J00374J48877J964j55579J5942K39O890l3022k04007
$$ 13433 51860 21383 -107248 -6874 142003 143967 -11612 4330 4569 11459 -21563 -225570
15572b25570j38998Q2220J4168j1990J57890Q3623Q1221J37315j16672j69483
$$ -225570 -364568 -282348 -268180 -280170 -122280 -38657 42564 179879 63207 -106276
15562a06276n1719o2114j64344J02817R7413J38104Q9868l2366J5906p9925q1729
$$ -106276 -157995 -220109 -384453 -281636 -184223 -46119 43749 11383 27289 -52636 -134365
15551a34365q3729J2249m088M6491j92006L7447L41680Q154k27160L2014L9703
$$ -134365 -218094 -205845 -209933 -163442 -355448 -318001 23679 31833 -195327 -163313 -123610
15540a23610J47802K1253o9212j49129m5475j0727J00588K93349n722l51353J83630
$$ -123610 24192 45445 -23767 -172896 -218371 -229098 -128510 164839 159117 -192236 -8606
15529h606J80648O6178j48238R1545L0417l21084j86309J25969J91553J47442
$$ -8606 172042 238220 89982 181527 211944 -109140 -295449 -169480 22073 169515
15519A69515l9261O4518O2852m47j05668m6955o3743M0844P1397m3511P2512j50206
$$ 169515 130254 194772 257624 257177 151509 104554 40811 81655 153052 109541 182053 31847
15507C1847J44770J86987m8679j03816r5828r6371J7406r3807K50606K52863K2553
$$ 31847 176617 363604 314925 211109 115281 18910 36316 -57491 193115 445978 468531
15496D68531j09160l17870M130J53083j42146M9652j2286R8059J2507j8441L2063
$$ 468531 359371 41501 45631 198714 56568 106220 93934 191993 204500 186059 218122
15485B18122r9868J85307k6576n1750k6049M5943j21543j3794n0795J71428l712
$$ 218122 118254 303561 276985 225235 199186 245129 123586 109792 58997 230425 226713
15474B26713K6778l0220j90020j48726P0989R9852n6963j70972K699R8500J79641
$$ 226713 253491 223271 33251 -115475 -44486 55366 -1597 -172569 -169870 -71370 108271
15463A08271k25285k34556J44336K90603O5095R2590N1888j72933k74032n4824
$$ 108271 -117014 -351570 -207234 83369 148464 241054 292942 120009 -154023 -208847
15453b08847P7556r415J64732J14494j6690j19931q035J69083j18019j44033L5795
$$ -208847 -131291 -140706 24026 138520 121830 1899 -6136 162947 44928 -99105 -63310
15442f3310J04703N1639J04903j48030k51256p7082j08431q8864j01559J58023
$$ -63310 41393 93032 197935 49905 -201351 -278433 -386864 -475728 -577287 -419264
15432d19264L10576J60645r6318j30735K91007o4766q7229j36627r9020q9499
$$ -419264 -108688 51957 -44361 -175096 115911 51145 -36084 -172711 -271731 -361230
15422c61230K97272K18344K04882K43460q7432k47784l12001J30186J50323j17760
$$ -361230 -63958 154386 359268 602728 515296 267512 -44489 85697 236020 118260
15412A18260M0323l829k33361k03371J22055q0810k82871r3282K03666K22932
$$ 118260 158583 154754 -78607 -281978 -159923 -240733 -523604 -616886 -413220 -190288
15402a90288p6708m7282J54742l067K95800N8324k59302o6692P9031l5914j0618
$$ -190288 -266996 -314278 -159536 -162603 133197 191521 -67781 -134473 -55442 -91356 -101974
15391a01974j16831K8761N4712j08960J07444n3900J2755r712J35654L3319m8426
$$ -101974 -218805 -190044 -135332 -244292 -136848 -190748 -177993 -187705 -52051 -18732 -67158
15380f7158m8311l0720o584K4726J61888j90386j2861K73083m885j83423k7922
$$ -67158 -115469 -146189 -152773 -128047 33841 -156545 -169406 103677 98792 -84631 -112553
15369a12553J49717K2269j00891j10525Q957k6104r7383J15138J81355o1211m1629
$$ -112553 37164 59433 -41458 -151983 -143026 -169130 -266513 -151375 29980 -31231 -72860
15358g2860j47668q6276Q3861k9323J5193J0965J96982R2090J08136j90450k43871
$$ -72860 -220528 -306804 -222943 -252266 -237073 -226108 -29126 62964 171100 -19350 -263221
15347b63221l6751k5534K64464J35579n7377j26179n2109L71131j14214j8923
$$ -263221 -299972 -325506 -61042 74537 17160 -109019 -161128 210003 95789 76866
15337G6866k1483l31927M9933K26305k24820O8471m3932n8384K5982J69080J02263
$$ 76866 55383 -276544 -226611 -306 -225126 -156655 -200587 -258971 -232989 -63909 38354
15326C8354q3228q756J99560R5717m0014j36927N2315l9752q1859N6524J12309
$$ 38354 -44874 -53630 145930 241647 201633 64706 117021 77269 -4590 51934 164243
15315A64243Q8368J77713j56902k64257j45703j4573j49530J4344N3555n1579
$$ 164243 252611 430324 273422 9165 -136538 -151111 -300641 -286297 -232742 -284321
15305b84321J21020L3407P4446J61910j04510M1837q1801m2615J21368k095l8736
$$ -284321 -163301 -129894 -55448 106462 1952 43789 -38012 -80627 40741 38646 -90
15294i0J72389J24247r7647j64832j52704j14074J38818J24450J61418M029j15988
$$ -90 172299 296546 198899 34067 -118637 -232711 -93893 30557 191975 196004 80016
15283H0016l59080k18760J69470J04074J00376q0083l06543n9822L98429M05758
$$ 80016 -279064 -497824 -328354 -224280 -123904 -203987 -510530 -570352 -171923 233835
15273B33835P2183N7382j83539m05418R5143Q2406J25521R5695k59175j44623
$$ 233835 306018 363400 179861 -225557 -130414 -48008 77513 173208 -85967 -230590
15263b30590K11688J22798M4692j14207R5808J5155n759q1818j70362k0473n1081
$$ -230590 -18902 103896 148588 34381 130189 145344 139585 57767 -112595 -133068 -184149
15252a84149N2653M8090k1941J05898o9454J45473L63517P540j59933l28344k7501
$$ -184149 -131496 -83406 -105347 551 -68903 76570 440087 447627 287694 -40650 -68151
15241f8151l979k93296N9951K10967P5368m2648j85158N0353j01290l3482j88715
$$ -68151 -72130 -365426 -305475 -94508 -19140 -61788 -246946 -196593 -297883 -331365 -520080
15230e20080J13582K85863j77713l05198p8389J92405K80280M8060n2246J51761
$$ -520080 -406498 -120635 -298348 -603546 -681935 -489530 -209250 -161190 -213436 -61675
15220f1675J31232p2394j42366K82748J30776j23974k66046j46560J27850J52762
$$ -61675 69557 -2837 -145203 137545 268321 144347 -121699 -268259 -140409 12353
15210A2353p832M7975j51893j09983j52477j68266O0561J46355L08145J66289
$$ 12353 4521 52496 -99397 -209380 -361857 -530123 -469562 -323207 -15062 151227
15200A51227p1191j14401n7155J43821O0933l9374j62210P4588J50731j5862R1350
$$ 151227 80036 -34365 -91520 52301 113234 73860 -88350 -13762 136969 121107 212457
15189B12457p5493k13814j74373j52106K99882L35736k11770j11368k0357Q5535
$$ 212457 136964 -76850 -251223 -403329 -103447 232289 20519 -90849 -111206 -25671
15179b5671J1778k1416L3549J93526k35433k30012L16185J23795j63400l26765
$$ -25671 -13893 -35309 -1760 191766 -43667 -273679 42506 166301 2901 -323864
15169c23864p6418k2832J01701j5356j0291P049K2399K7791M15q0851m5487J06569
$$ -323864 -400282 -423114 -321413 -336769 -347060 -340011 -317612 -289821 -289406 -370257 -415744 -309175
15157c09175K67818L14134J17901n5560k37673J75894m7443j8744j02642l7593
$$ -309175 -41357 272777 390678 335118 97445 273339 225896 207152 104510 66917
15147F6917J27063j4910j19672k42350K8667P0588r8527K20944J26194M7254M7596
$$ 66917 193980 179070 59398 -182952 -154285 -83697 -182224 38720 164914 212168 259764
15136B59764j99790M6711n2450q8893j08178n1002J20266j74162m8842O1019O0760
$$ 259764 59974 106685 54235 -34658 -142836 -193838 -73572 -247734 -296576 -235557 -174797
15125a74797J28214J65432Q6408J461K5306k37429j68458l0132K9793j4079L7700
$$ -174797 -46583 118849 205257 206718 232024 -5405 -173863 -203995 -174202 -188281 -150581
15114a50581O5653o5043j67170p8486J92306Q5490l04574k96051J1578M25677
$$ -150581 -84928 -149971 -317141 -395627 -203321 -117831 -422405 -718456 -706878 -281201
15104b81201L99960J6521j85369O7436p0957J41663K85374p5687L6320j58014
$$ -281201 118759 135280 -50089 17347 -53610 88053 373427 297740 334060 176046
15094A76046j74464O7127j69429j17741J67357K28167J11897O8248j04926k84084
$$ 176046 1582 68709 -100720 -218461 -51104 177063 288960 357208 252282 -31802
15084c1802l7840L36150j06779k19597N5246J1233K44356J28538k62569l8638
$$ -31802 -69642 266508 159729 -59868 -4622 6611 250967 379505 116936 78298
15074G8298P2705N0786j21966L7835k5690L4809k57515q2206L11673o1952m3587
$$ 78298 151003 201789 79823 117658 91968 126777 -130738 -212944 98729 36777 -6810
15063f810K1787J72507J24783j43146k65848j51857N9431J32180j48978k87649
$$ -6810 14977 187484 312267 169121 -96727 -248584 -189153 -56973 -205951 -493600
15053d93600L4222L41470J18528O9934N2213o9117O1138o044P6825j23k0567k09193
$$ -493600 -459378 -117908 620 70554 122767 53650 114788 108744 185569 185446 164879 -44314
15041d4314K5583L58038J26583q8174r2173k9525k789O8415R6819j76698k28777
$$ -44314 -18731 339307 465890 377716 285543 256018 253229 321644 418463 241765 12988
15030A2988O1601k8986j61973j12051N5869J68405N4916J18634j63860r6261j13872
$$ 12988 74589 45603 -116370 -228421 -172552 -4147 50769 169403 5543 -90718 -204590
15019b04590j31355j0076o2462L702J9367M9745J36359P0833m3131q765l9575
$$ -204590 -335945 -346021 -408483 -404781 -385414 -335669 -199310 -128477 -171608 -180373 -219948
15008b19948L3259Q6789K8297J42904M9371k23219n1053J87254J32308J17902
$$ -219948 -186689 -99900 -71603 71301 120672 -102547 -153600 33654 165962 283864
14998B83864j33059k5269P4625K42413J06781m5839k67260l50182J4135o4436
$$ 283864 150805 125536 200161 442574 549355 503516 236256 -113926 -99791 -164227
14988a64227J21252M1379N1211K2477P6243j77272j85009m2505m4973k01746j61065
$$ -164227 -42975 -1596 49615 72092 148335 -28937 -213946 -256451 -301424 -503170 -664235
14977f64235L67729L31124K08984K9031j52999L7263J74934L1032j29578o8174
$$ -664235 -296506 34618 243602 272633 119634 156897 331831 362863 233285 165111
14967A65111j79039k06626J1618K19834J65100J45925J9988k59815N3527j43397
$$ 165111 -13928 -220554 -208936 10898 175998 321923 341911 82096 135623 -7774
14957g774K6769J30568M7973J71942o2148m84728J18361Q1767K2776k71409P6201
$$ -7774 18995 149563 197536 369478 307330 -177398 -59037 22730 45506 -225903 -149702
14946a49702J23583j42238k39553J00974J02494J02519j16624L7049m1489j32065
$$ -149702 -26119 -168357 -407910 -306936 -204442 -101923 -218547 -181498 -222987 -355052
14936c55052N9563J48815K36878j05261r7322J72508l7071o7671K6584j00679
$$ -355052 -295489 -146674 90204 -15057 -112379 60129 23058 -44613 -18029 -118708
14926a18708J72532q0705m35475j12568J17287J54705k45047J49049K00617J11789
$$ -118708 53824 -26881 -462356 -574924 -457637 -302932 -547979 -398930 -198313 -86524
14916h6524L5180r0359j820L6352j03212k38368K19386K9025R906j37673L3411
$$ -86524 -51344 -141703 -143523 -107171 -210383 -448751 -229365 -200340 -190434 -328107 -294696
14905b94696J0683m8127N6136P2071P1748P089m0975M9122J86294j42764j04193
$$ -294696 -284013 -332140 -276004 -203933 -132185 -125096 -166071 -116949 69345 -73419 -177612
14894a77612Q9341L18409l5945j05948L4204j63468j47802J01992j05988J43867
$$ -177612 -88271 230138 194193 88245 122449 -41019 -188821 -86829 -192817 -48950
14884d8950k7139L5079J17931j33430J67276j73090j53259J5889K1133J01689
$$ -48950 -76089 -41010 76921 -56509 110767 -62323 -215582 -199693 -178560 -76871
14874g6871Q7689O154k40362n6203j55861K19072J99596Q5890l12366p8858O4552
$$ -76871 10818 16972 -223390 -279593 -435454 -216382 -16786 69104 -243262 -322120 -257568
14863b57568O1739L46923o1097j73880M5507k16717j47932j23362J68195j76898
$$ -257568 -195829 151094 89997 -83883 -38376 -255093 -403025 -526387 -358192 -535090
14853e35090J29674j03183N4802L25655J36491J5640j65257j05444j14799k1162
$$ -535090 -405416 -508599 -453797 -128142 8349 23989 -141268 -246712 -361511 -382673
14843c82673K56513J24333L4945M9293J7535r2082L5440L19220J2415q4994l57695
$$ -382673 -126160 -1827 33118 82411 99946 7864 43304 362524 374939 289945 -67750
14832f7750N0486J06907p9875O1230J9199J3159j86165l27979N8770K61693K33072
$$ -67750 -17264 89643 9768 70998 90197 103356 -82809 -410788 -352018 -90325 142747
14821A42747L1169j59180j0838q402l5023J00427R2007n4900k11716k0166J04422
$$ 142747 173916 14736 3898 -4504 -39527 60900 152907 98007 -113709 -133875 -29453
14810b9453L47101J6247k22021l6847k7518K07677J21689K9801m8090J5692j28700
$$ -29453 317648 333895 111874 75027 47509 255186 376875 406676 358586 374278 245578
14799B45578n4792P6003j26949J69765m7192j73263j03448N6089O0880J20831
$$ 245578 190786 266789 139840 309605 262413 89150 -14298 41791 102671 223502
14789B23502p1078k0373j61034J7897J20859L6794l138j75754P1697L8529k87
$$ 223502 152424 132051 -28983 -11086 109773 146567 143429 -32325 39372 77901 77614
14778G7614N1588K9532j81110J28862L60825J99253l53285j70429k1162K06062
$$ 77614 129202 158734 -22376 106486 467311 666564 313279 142850 121688 327750
14768C27750q4190j58679K488j739R1213J37600j30203j4242k6908O7482N5058
$$ 327750 243560 84881 87369 85630 176843 314443 184240 169998 143090 210572 265630
14757B65630o6557k57381n206O6726P6346L07892J12978l07770l64118L1371L2430
$$ 265630 199073 -58308 -63514 3212 79558 387450 500428 192658 -171460 -140089 -107659
14746a07659L6362L8386o2316r2149Q567K93217L26807O366J43000k21227l12978
$$ -107659 -71297 -32911 -95227 -187376 -178809 114408 441215 447581 590581 369354 56376
14735E6376k778m614K7814k1O5667j05661J25533R7483l9688j02670j65762q2302
$$ 56376 53598 48984 76798 76777 142444 36783 162316 259799 220111 117441 -48321 -130623
14723a30623L3828Q2730m8603O096Q0727j30672j00172J07891J77391k2400j0836
$$ -130623 -96795 -14065 -62668 -56572 24155 -106517 -206689 -98798 78593 56193 45357
14712D5357L2591j41751j10730R6095j62030Q0113N1487K36863L7942p3597l7357
$$ 45357 77948 -63803 -174533 -78438 -240468 -160355 -108868 127995 165937 92340 54983
14701E4983j42835R1361P2599n2813L274J90362j76418l9946K4993j00741j02362
$$ 54983 -87852 3509 76108 23295 26569 216931 40513 567 25560 -75181 -177543
14690a77543r2875j1341K28696j30743k00230J45738L25379l4903J9959J52658
$$ -177543 -270418 -281759 -53063 -183806 -384036 -238298 87081 52178 72137 224795
14680B24795q7880n1350L9154P1337j70668l9201M2307R1699J95243M715k13957
$$ 224795 136915 85565 124719 196056 25388 -13813 28494 120193 315436 320151 106194
14669A06194k02779N4519O9017j81754r4945n9584p3301R6342Q7404K16547P7324
$$ 106194 -96585 -42066 26951 -154803 -249748 -309332 -382633 -286291 -198887 17660 94984
14658I4984j76926k48146J96948L40107J19506l16188r9591m5764m9254J48345
$$ 94984 -81942 -330088 -133140 206967 326473 10285 -89306 -135070 -184324 -35979
14648c5979J10915K43858J69259l57627k55062j34497J45625J50204k1197m6155
$$ -35979 74936 318794 488053 130426 -124636 -259133 -113508 36696 15499 -30656
14638c0656J99506O7662k97019j20709m6490J20925j19850L4286q96n1803l1358
$$ -30656 168850 236512 -60507 -181216 -227706 -106781 -226631 -192345 -193241 -245044 -276402
14627b76402j80429q9188K03815J86980K11215J00590o4854j17580J24380K94760
$$ -276402 -456831 -546019 -342204 -155224 55991 156581 91727 -25853 98527 393287
14617C93287n6179m4675o7611k16615k05635O3586J06372n8879k11969k8070K16702
$$ 393287 337108 292433 224822 8207 -197428 -133842 -27470 -86349 -298318 -326388 -109686
14606a09686R8842o8877K4005M7397j33727j46088J49345L89286j2287q2144o3022
$$ -109686 -10844 -79721 -55716 -8319 -142046 -288134 -138789 250497 238210 156066 93044
14595I3044l0312m1908J9685j26826k8661J39941J06514M7216m3204l3542O018
$$ 93044 62732 20824 40509 -86317 -114978 24963 131477 178693 135489 101947 107965
14584A07965m9869q8713q6356J15541j9229P0563j25988j20469o1254L2312J99174
$$ 107965 58096 -30617 -116973 -1432 -20661 49902 -76086 -196555 -257809 -225497 -26323
14573b6323K82549k6199j68795o4265J30216J91355m343O2194j18288j19522q440
$$ -26323 256226 230027 61232 -3033 127183 318538 314195 376389 258101 138579 130139
14562A30139J08939o1742j94981N1636j43383k659N4234M2642K67019J68290K80985
$$ 130139 239078 177336 -17645 33991 -109392 -112051 -57817 -15175 251844 420134 701119
14551G01119j25701l17913n8486J78287J1866L7891j04641m4394l7055k23470
$$ 701119 575418 257505 199019 377306 389172 427063 322422 278028 240973 17503
14541A7503k70782n1103P1902J05016K3712k6611r6012j28956L49272K53314p7873
$$ 17503 -253279 -304382 -232480 -127464 -103752 -130363 -226375 -355331 -6059 247255 169382
14530A69382k66804q2437J16783o3900r1922j90358l11844J01845L18106J52334
$$ 169382 -97422 -179859 -63076 -126976 -218898 -409256 -721100 -619255 -301149 -148815
14520a48815Q5337k5565J11522j06035j00977M2329o8028j8906J65072j61889
$$ -148815 -63478 -89043 22479 -83556 -184533 -142204 -210232 -229138 -64066 -225955
14510b25955j81493j04829N6300N4231J57016K38969J85870Q4450j99752k2294
$$ -225955 -407448 -512277 -455977 -401746 -244730 -5761 180109 264559 64807 42513
14500D2513k09412m25679L2213J95484N4129K91971j573j18693J16433J20148
$$ 42513 -166899 -592578 -560365 -364881 -310752 -18781 -20354 -139047 -22614 97534
14490I7534p2359q0866J6747Q6771j69744m3719n3972J85677r4471k45212M4525
$$ 97534 25175 -55691 -38944 47827 -121917 -165636 -219608 -33931 -128402 -373614 -329089
14479c29089J7450J73800J0378j93033q9348J19545K53669N9274j02314Q6572
$$ -329089 -311639 -137839 -127461 -320494 -409842 -290297 -36628 22646 -79668 6904
14469F904J17380j11407j48080K5196K59599J36150k67855j97398m3188q016J7664
$$ 6904 124284 12877 -135203 -110007 149592 285742 17887 -179511 -222699 -230715 -213051
14458b13051J23005J31937K30046k932j90693j91593N8340k0512j17465K5611
$$ -213051 -90046 41891 271937 269005 78312 -113281 -54941 -75453 -192918 -167307
14448a67307N4342n1521L5148r1374J733O51J2822k05966M3000J10417J65779
$$ -167307 -112965 -164486 -129338 -220712 -218979 -218328 -205506 -411472 -368472 -258055 -92276
14437i2276M2530l2216L4305M0474P3591J38135N0155q050M9694k5908n0692l6926
$$ -92276 -49746 -81962 -47657 -7183 66408 204543 254698 246648 296342 270434 219742 182816
14425A82816l62021P6735J83664l7366L0562J21780Q4265o841j74582P5390J5586
$$ 182816 -179205 -102470 81194 43828 74390 196170 280435 273594 99012 174402 189988
14414A89988j46098j13701J0584p964J46114o5329j67038n6337k9061K27295j15331
$$ 189988 43890 -69811 -59227 -67191 78923 13594 -153444 -209781 -238842 -11547 -126878
14403a26878j50961N9370j8227j74142O7301J23934Q9743k5358J807K9366O9880
$$ -126878 -277839 -218469 -236696 -410838 -343537 -219603 -129860 -155218 -153411 -124045 -54165
14392e4165K95370o9130N009m5644r6249p9072K62230J13857j70295k170M1332
$$ -54165 241205 172075 177084 131440 35191 -43881 218349 332206 161911 159741 201073
14381B01073j31855J04470K5045O4306K2684M5095J65348q1428l1063j76317N0848
$$ 201073 69218 173688 198733 263039 285723 330818 496166 414738 383675 207358 258206
14370B58206K50064J2994r4941k23027r8313k7533K55621L10486o1694j14270
$$ 258206 508270 521264 426323 203296 104983 77450 333071 643557 581863 467593
14360D67593j5071k70432l23150l00593Q0255L92938J13444j38270k88612M7443
$$ 467593 452522 182090 -141060 -441653 -361398 31540 144984 6714 -281898 -234455
14350b34455j19693J54200M7065j85148m7484k741k7671J87237J50398K462q0574
$$ -234455 -354148 -199948 -152883 -338031 -385515 -388256 -415927 -228690 -78292 -75830 -156404
14339a56404j54338J6267k1250o7825K90645r0275j37683p0200k0398L5099L1460
$$ -156404 -310742 -294475 -315725 -383550 -92905 -183180 -320863 -391063 -411461 -376362 -344902
14328c44902J61560L1964j94857j66543J11956K0561N56483R2335k33263J18291
$$ -344902 -183342 -151378 -346235 -512778 -400822 -380261 176222 268557 35294 153585
14318A53585L7549l0631n2251j17811k02301L1745J29981j49868o8319m8372j5210
$$ 153585 191134 160503 108252 -9559 -211860 -180115 -50134 -200002 -268321 -316693 -331903
14307c31903K05218O9886k36732q6912K2538m0044j63809L4184K01416L55807
$$ -331903 -126685 -56799 -293531 -380443 -357905 -397949 -561758 -527574 -326158 29649
14297B9649r088n92K0832M3508k9136J80472Q0437j1364k6295m0046N5003O1847
$$ 29649 20561 19969 40801 84309 55173 235645 316082 304718 278423 238377 293380 355227
14285C55227j36895p1744M7635k88056q5241Q9660O3295j11897k12924R1466J06906
$$ 355227 218332 146588 194223 -93833 -179074 -89414 -26119 -138016 -350940 -259474 -152568
14274a52568J75841J04175j25901j84199J75815J18932j31263r6693J679n9058
$$ -152568 23273 127448 1547 -182652 -6837 112095 -19168 -115861 -114182 -173240
14264a73240p9068J70048O2209j54914Q291J8701P4624L8450J39785j38127j07767
$$ -173240 -252308 -82260 -20051 -174965 -166674 -147973 -73349 -34899 104886 -33241 -141008
14253a41008J5602Q6206N4834k15701r7275J09926R6193M7903N6835k9766P5887
$$ -141008 -125406 -39200 15634 -200067 -297342 -187416 -91223 -43320 13515 -16251 59636
14242E9636k71467l24192J11835m8608j8381l0667P197J01812K61634K40864j17547
$$ 59636 -211831 -536023 -424188 -472796 -491177 -521844 -514647 -412835 -151201 89663 -27884
14231b7884j30876R1346J87972J7799j49059n4630q376k6801N6806J06124o9281
$$ -27884 -158760 -67414 120558 138357 -10702 -65332 -73708 -100509 -43703 62421 -6860
14220f860O9556o8398N7287j08773O9651Q2513n1421J90546K3207N3857j71784
$$ -6860 62696 -5702 51585 -57188 12463 94976 43555 234101 257308 311165 139381
14209A39381j42331J051R056J23540n3217j47002O9746J86042j54252J69602J91467
$$ 139381 -2950 -1899 7157 130697 77480 -69522 224 186266 32014 201616 393083
14198C93083j112j28635J68488r1028m52080j1828J87817L4434J54007K78446
$$ 393083 391971 263336 431824 340796 -111284 -123112 64705 99139 253146 531592
14188E31592m6401l9244L3945k97158j39742n6106j30329j45674J85161O4008
$$ 531592 485191 445947 479892 182734 42992 -13114 -143443 -289117 -103956 -39948
14178c9948n6243n5996J34792L1554r5007j80747K86759L78262m2126r0177k60631
$$ -39948 -96191 -152187 -17395 14159 -80848 -261595 25164 403426 361300 271123 10492
14167A0492l92280l3335K63045K4218j40585j40480j38161J23948K07591J87634
$$ 10492 -381788 -415123 -152078 -127860 -268445 -408925 -547086 -423138 -215547 -27913
14157b7913K30100K51571j06631n11795l59295J06772J78650l2545J2956J03128
$$ -27913 202187 453758 347127 -164668 -523963 -417191 -238541 -271086 -258130 -155002
14147a55002j20895o9169M9069J99657j29222q3593N5849J26477Q647Q7445j1887
$$ -155002 -275897 -345066 -295997 -96340 -225562 -309155 -253306 -126829 -118182 -30737 -42624
14136d2624k9847j16707J02604l998j38846l9924O8829k64237j48131J05058P0439
$$ -42624 -72471 -189178 -86574 -90572 -229418 -269342 -200513 -464750 -612881 -507823 -437384
14125d37384p5095r462J33815J18029Q9811J42465j19758j9581j14567p9943J01829
$$ -437384 -512479 -521941 -388126 -270097 -180286 -37821 -157579 -177160 -291727 -371670 -269841
14114b69841K19835J46516J62392j45831K5632o0235m1228R3709M7183K9628j42572
$$ -269841 -50006 96510 258902 113071 138703 78468 37240 130949 178132 207760 65188
14103F5188j93945J70769O4032o3245k35049q0651M7808M2680L5834l2289J91881
$$ 65188 -128757 42012 106044 42799 -192250 -272901 -225093 -182413 -146579 -178868 13013
14092A3013J42838l63907l33516O5625K66521L4886j32655N2939K6990J01878
$$ 13013 155851 -208056 -541572 -475947 -209426 -174540 -307195 -254256 -227266 -125388
14082a25388k7105p9037m217j55543J2178Q8199J47059m7054m02235q4502K12640
$$ -125388 -152493 -231530 -235747 -391290 -379112 -290913 -143854 -190908 -593143 -677645 -465005
14071d65005K30538M38469K1760j58107N5256j66589J25780J83813p4117j46068
$$ -465005 -234467 204002 225762 67655 122911 -43678 82102 265915 191798 45730
14061D5730L5616j0403p9094j74733p9381k15222J17974k1530O6556R0128o9013
$$ 45730 81346 70943 -8151 -182884 -262265 -477487 -359513 -381043 -314487 -224359 -293372
14050b93372o9466j43810J23576J810K58818J56187k40134q4800J99664M9917
$$ -293372 -362838 -506648 -383072 -381262 -122444 33743 -206391 -291191 -91527 -41610
14040d1610j43522J21842L18265J65820o6654k51260l54825j23035J66750Q5387
$$ -41610 -185132 -63290 254975 420795 354141 102881 -251944 -374979 -208229 -122842
14030a22842K92034O9795j09647j49145L4443j72621o9902K38739J56592m5173
$$ -122842 169192 238987 129340 -19805 14638 -157983 -227885 10854 167446 122273
14020A22273n1590K7526J05761q6003p8010j23398m6243m6017P3007J16769m036
$$ 122273 70683 98209 203970 117967 39957 -83441 -129684 -175701 -102694 14075 10039
14009A0039l66907J1363J03087R9471q501l0345O4756j67007L11689L72286j23540
$$ 10039 -356868 -345505 -242418 -142947 -151448 -181793 -117037 -284044 27645 399931 276391
13998B76391k29957j50755k36438k17713J02193J72290J92495J21375K762p6177
$$ 276391 46434 -104321 -340759 -558472 -456279 -283989 -91494 29881 32643 -43534
13988d3534P0607J31983j11987l26233M1148K98108P2323q4615q2806K15969j28161
$$ -43534 27073 159056 47069 -279164 -238016 60092 132415 47800 -35006 180963 52802
13977E2802j02873p6030o2172r942j5026J95376J92470j43946j97163m1906l4880
$$ 52802 -50071 -126101 -188273 -198215 -213241 -17865 174605 30659 -166504 -208410 -243290
13966b43290J74736K85128Q1966k81496r4700K51408K0425N9779L29854J33101
$$ -243290 -68554 216574 298540 17044 -77656 173752 194177 253956 583810 716911
13956G16911k97898j86717P4039j34871M892j98723k33098M0582r276q6838n5556
$$ 716911 419013 232296 306335 171464 176356 -22367 -255465 -214883 -224159 -310997 -366553
13945c66553J76951L46445Q1278j2958j30554N9073j62681j53911J86059N9374
$$ -366553 -189602 156843 238121 225163 94609 153682 -8999 -162910 23149 82523
13935H2523m441J48858k04978k89370O1080J18221J60177n2220j36364l12911
$$ 82523 78082 226940 21962 -267408 -206328 -88107 72070 19850 -116514 -429425
13925d29425l2375N6446j05462K33487K04694j78251j82181J71349Q4775K0017
$$ -429425 -461800 -405354 -510816 -277329 -72635 -250886 -433067 -261718 -176943 -156926
13915a56926J24258r1330L6776J01392j1697M1823O2482J37395l3216P4047j26298
$$ -156926 -32668 -123998 -87222 14170 2473 44296 106778 244173 210957 285004 158706
13904A58706q0637k48262j51976p0318K62388J26229K5510J1504k58128k57219
$$ 158706 78069 -170193 -322169 -392487 -130099 -3870 21640 33144 -224984 -482203
13894d82203N6670J44730J2056j19552J97633J72530j20364l0983N1663K2187
$$ -482203 -425533 -280803 -268747 -388299 -190666 -18136 -138500 -169483 -117820 -95633
13884i5633j07021j35255K7622J42773r218J2947K71555M8951l69067R0528p6042
$$ -95633 -202654 -337909 -310287 -167514 -176732 -163785 107770 156721 -212346 -121818 -197860
13873a97860j06917o825j9654J12108K46280K80344Q5667p7123O5096j61610r6579
$$ -197860 -304777 -311602 -331256 -219148 27132 307476 393143 316020 381116 219506 122927
13862A22927K7770k8187k59764k8956L2584J74292J60446m3308j50772k57886
$$ 122927 150697 122510 -137254 -166210 -133626 40666 201112 157804 7032 -250854
13852b50854o1046J69459R160L0369j97116r9665J07923J19667J37447K09286
$$ -250854 -311900 -142441 -133281 -102912 -300028 -399693 -291770 -172103 -34656 174630
13842A74630p6385R0567o3328j54119p3672o1663j87454j61853k43307J65506
$$ 174630 98245 188812 125484 -28635 -102307 -163970 -351424 -513277 -756584 -591078
13832e91078L45609R8332P4984j8470J1695K7329n9119j40128o5823P1177p1288
$$ -591078 -245469 -147137 -72153 -90623 -78928 -51599 -110718 -250846 -316669 -245492 -316780
13821c16780n7803j48170K82989J53388q5855K1021o7459j80311q0608N4940J48099
$$ -316780 -374583 -522753 -239764 -86376 -172231 -151210 -218669 -398980 -479588 -424648 -276549
13810b76549J32240J06833J37299n1242k02432K38833J81278k07695l99214k48229
$$ -276549 -144309 -37476 99823 48581 -153851 84982 266260 58565 -340649 -588878
13800e88878J64543J10237K26836K4704J47386p92k61249k93802K24090J91161
$$ -588878 -424335 -314098 -87262 -62558 84828 84036 -177213 -471015 -246925 -55764
13790e5764J84159J40273K38133k03747j86586M0242J67708k5870k28977j05869
$$ -55764 128395 268668 506801 303054 116468 156710 324418 298548 69571 -36298
13780c6298J07102p8016k67616m3209p798J60378J58927M8868k7855N9039L1470
$$ -36298 70804 -7212 -274828 -318037 -325835 -165457 -6530 42338 14483 73522 104992
13769A04992p7132n6154j72613k28091J04240M78771K16914j42910M7024l64n1653
$$ 104992 27860 -28294 -200907 -428998 -324758 154013 370927 228017 275041 274677 223024
13758B23024l13952j45666J08127M44564N651p5889k34918k33357J44330P4612
$$ 223024 -90928 -236594 -128467 316097 321748 245859 10941 -222416 -78086 -3474
13748c474Q1853N0612M7555O2241j69992k00535J50227J3445j81598k4415j63833
$$ -3474 78379 128991 176546 238787 68795 -131740 18487 31932 -149666 -174081 -337914
13737c37914J47130o5208r3572J58276M9845J04236K24978R8813m0489j27214
$$ -337914 -190784 -255992 -349564 -191288 -141443 -37207 187771 286584 246095 118881
13727A18881j05545k14249j02986L06738L22741Q4062K5229k7319k40120q3502
$$ 118881 13336 -200913 -303899 2839 325580 409642 434871 407552 167432 83930
13717H3930p1270j69058j50759K32760J31996l0013q1921j69752J35648Q7124
$$ 83930 12660 -156398 -307157 -74397 57599 27586 -54335 -224087 -88439 -1315
13707a315l01915j83596o4468o6260J39043K33275K92922N2035j25942N9250o0789
$$ -1315 -303230 -486826 -551294 -617554 -478511 -245236 47686 99721 -26221 33029 -27760
13696b7760K8207j3204j83669j75552J55380p5831j34245M5973J58561n7833l7345
$$ -27760 447 -12757 -196426 -371978 -216598 -292429 -426674 -380701 -222140 -279973 -317318
13685c17318j57523J47928M7920Q6735O4410O9960P1657j17388r9901J5913M2531
$$ -317318 -474841 -326913 -278993 -192258 -127848 -57888 13769 -103619 -203520 -187607 -145076
13674a45076j43432K45625K64346j10375m7578L8877j14091q5459K0660J52939
$$ -145076 -288508 -42883 221463 111088 63510 102387 -11704 -97163 -76503 76436
13664G6436J43785j21461M2541K62294K72339k02683k27164O1135K4559j35909
$$ 76436 220221 98760 141301 403595 675934 473251 246087 307222 331781 195872
13654A95872j73684r3534N2472O3021j83394Q8246L8769L13445p0491n8458J72341
$$ 195872 22188 -71346 -18874 44147 -139247 -51001 -12232 301213 230722 172264 344605
13643C44605K10332j14928l15519k32696M6774k28511j63108J14462J42857K11920
$$ 344605 554937 440009 124490 -108206 -61432 -289943 -453051 -338589 -195732 16188
13633A6188J39984j98102n2370K2414J5409m2998L16980J82510k91546j3642m4732
$$ 16188 156172 -41930 -94300 -71886 -56477 -99475 217505 400015 108469 94827 50095
13622E0095j2156j45127J26762R7332J26869R5449j2838r4635j86387o0659R5958
$$ 50095 37939 -107188 19574 116906 243775 339224 326386 231751 45364 -15295 80663
13611H0663p42o1207K6423j15994m7286K6036M5563j9282R9936K24014Q2085j40797
$$ 80663 79921 18714 45137 -70857 -118143 -92107 -46544 -65826 34110 258124 340209 199412
13599A99412o3594J1087J39461k4822j06727j38937k2015r390K521j53747J0788
$$ 199412 135818 146905 286366 261544 154817 15880 -6135 -15525 -13004 -166751 -155963
13588a55963P540n2724j50026K41454q0192k59582K34249K86960k4588J66356
$$ -155963 -148423 -201147 -351173 -109719 -189911 -449493 -215244 71716 47128 213484
13578B13484L8712j33748k07650p2036j84397J11285K62091P7114r1785j35921
$$ 213484 252196 118448 -89202 -161238 -345635 -234350 27741 104855 13070 -122851
13568a22851k43666k36803K73274J72773J01234j119j27009L8152q7076k8024
$$ -122851 -366517 -603320 -330046 -157273 -56039 -57158 -184167 -146015 -233091 -261115
13558b61115j11634l4272P4533j40090N2426J05726J45895k2532J08763L1567
$$ -261115 -372749 -407021 -332488 -472578 -420152 -314426 -168531 -191063 -82300 -50733
13548e0733j217j62213j30173J48625j8732j29656j70491K5849J10343K40960
$$ -50733 -51950 -214163 -344336 -195711 -214443 -344099 -514590 -488741 -378398 -137438
13538a37438L61845r7614l1469l0239K0440r1189M3603p4425p0718p055L16077
$$ -137438 224407 126793 95324 65085 85525 -5664 37939 -36486 -107204 -114259 201818
13527B01818J43158l29660O9172j9183r9388k63072O8822O9427j87540P8051J72076
$$ 201818 344976 15316 84488 65305 -34083 -297155 -228333 -158906 -346446 -268395 -96319
13516i6319M6417j01570j9468K26502J26132j22443k36719p5821K40348J07382
$$ -96319 -49902 -151472 -170940 55562 181694 59251 -177468 -253289 -12941 94441
13506I4441M1914J76934n3934k24438q2553j27066l4361j4074J52325K96431n015
$$ 94441 136355 313289 259355 34917 -47636 -174702 -209063 -223137 -70812 225619 220604
13495B20604L379J54564k07898P2186q4831q1482N3177l7959k26401K2985M36851
$$ 220604 223983 378547 170649 242835 158004 76522 129699 91740 -134661 -111676 325175
13484C25175J3001l73671L9966J8862J56427M0875j46240k29628K24815J44153
$$ 325175 338176 -35495 4471 23333 179760 220635 74395 -155233 69582 213735
13474B13735k18250P2537m4490o7154K11452j5233j45056j06040j57859N6442
$$ 213735 -4515 68022 23532 -43622 167830 152597 7541 -98499 -256358 -199916
13464a99916J09752J06396J38731Q2070P0277n5427k36345j85025o160J0816m7565
$$ -199916 -90164 16232 154963 237033 307310 251883 15538 -169487 -175647 -164831 -212396
13453b12396j5078J05362J55333k45209n7182L8450L1218L3924m113j76565j40276
$$ -212396 -227474 -122112 33221 -211988 -269170 -230720 -199502 -165578 -169691 -346256 -486532
13442d86532O5499K38553K24303o1807L9914j2700r2506R0153k8376p9164j18909
$$ -486532 -421033 -182480 41823 -19984 19930 7230 -85276 4877 -23499 -102663 -221572
13431b21572K01502J44286p4341N6049J93391j7416k2434q2003m4505K63137P3537
$$ -221572 -20070 124216 49875 105924 299315 281899 259465 177462 132957 396094 469631
13420D69631j78633o5663k4629o6972q9965J64233K51721k6614n70684n5210K7339
$$ 469631 290998 225335 200706 133734 43769 208002 459723 433109 -137575 -192785 -165446
13409a65446Q7902j14020j81727J96828J28206p9876q4914j12902J35933N8394
$$ -165446 -77544 -191564 -373291 -176463 -48257 -128133 -213047 -325949 -190016 -131622
13399a31622R3380Q0469o6415j45435k05777o8192J22345K82861J15032n2931
$$ -131622 -38242 42227 -24188 -169623 -375400 -443592 -321247 -38386 76646 23715
13389B3715N0021O0252j17504O0735P5434l3909j33601j20064j92074j74940k1678
$$ 23715 73736 133988 16484 77219 152653 118744 -14857 -134921 -326995 -501935 -523613
13378e23613K85030K44086J92760K9660r4032J7187Q1289J85668M0812j13045
$$ -523613 -238583 5503 198263 227923 133891 151078 232367 418035 458847 345802
13368C45802q1976j19153o5096J07295j20888j46642l9634m2832j41957j0521
$$ 345802 263826 144673 79577 186872 65984 -80658 -120292 -163124 -305081 -315602
13358c15602N7329k34941j09500J39646J53243K83937p4824o1899R3929j25728
$$ -315602 -258273 -493214 -602714 -463068 -309825 -25888 -100712 -162611 -68682 -194410
13348a94410K6550K88495K4633k8244j40448J75826J33819j43207K8360L9578
$$ -194410 -167860 120635 145268 117024 -23424 152402 286221 143014 171374 210952
13338B10952j76050j70338Q9429J36431M8860o0378l25244r3413K80845N0588
$$ 210952 34902 -135436 -46007 90424 139284 78906 -246338 -339751 -58906 -8318
13328h318k80409Q7296j10930p8778J25505K14480L2430J83338P9216j58674j13194
$$ -8318 -288727 -201431 -312361 -391139 -265634 -51154 -18724 164614 243830 85156 -28038
13317b8038j31929K5831J31578Q4331j50612R65J41240n3338r5432j1760J94443
$$ -28038 -159967 -134136 -2558 81773 -68839 -67874 73366 20028 -75404 -87164 107279
13306A07279o5132p0151j7205J13480J89748J16200r9084N3630k27175q5750P1339
$$ 107279 42147 -28004 -45209 68271 258019 374219 275135 328765 101590 15840 87179
13295H7179O2099j6144J37333J59767j4157j97860m00028r8882j08564R5176J07369
$$ 87179 149278 133134 270467 430234 416077 218217 -181811 -280693 -389257 -294081 -186712
13284a86712k72644R981n7700O9524J94361P6592j80426P4888K32139k21832k27797
$$ -186712 -459356 -449375 -507075 -437551 -243190 -166598 -347024 -272136 -39997 -261829 -489626
13273d89626J97933K74035Q8105k10853Q6003N2635J55629R9800J88914J8271
$$ -489626 -291693 -17658 70447 -140406 -54403 -1768 153861 253661 442575 460846
13263D60846k85445j13168K02447O6150m4145j9714k10769j60467K51273O0070
$$ 460846 175401 62233 264680 330830 286685 266971 56202 -104265 147008 207078
13253B07078k60079k10096K7812K11650J60160R9126P113j52400j98529m6539
$$ 207078 -53001 -263097 -235285 -23635 136525 235651 242764 90364 -108165 -154704
13243a54704j36578k2226M10639P7802q0653k9423j91926J45194K48652J6487
$$ -154704 -291282 -313508 97131 174933 94280 64857 -127069 18125 266777 283264
13233B83264J9108k31447j93446K39162J86122p6006l38428k7805p1958N8139
$$ 283264 302372 70925 -122521 116641 302763 226757 -111671 -139476 -211434 -153295
13223a53295J47842J40654q81q4749j40397k57612N5881p7652K7656J03584N5472
$$ -153295 -5453 135201 134320 49571 -90826 -348438 -292557 -370209 -342553 -238969 -183497
13212a83497J11560K81391j13823P487J64971j47093k63207N9512L7981n9516
$$ -183497 -71937 209454 95631 103118 268089 120996 -142211 -82699 -44718 -104234
13202a04234J03522R4666j60301k43229J14149J40467k2197o2373m19451r1755
$$ -104234 -712 93954 -66347 -309576 -195427 -54960 -77157 -139530 -558981 -650736
13192f50736K38294K67096N7511P8045J8136j24414j86284l8057m2442L6611J78647
$$ -650736 -412442 -145346 -87835 -9790 8346 -116068 -302352 -340409 -382851 -346240 -167593
13181a67593K39699J89555j59562n8226J09577j85381r1184K2177l6467J27878
$$ -167593 72106 261661 102099 43873 153450 -31931 -123115 -100938 -137405 -9527
13171i527J07209l05958J33639j1134l07165j13626J37929Q3904j39831J54893
$$ -9527 97682 -208276 -74637 -85771 -392936 -506562 -368633 -284729 -424560 -269667
13161b69667J55317J14782J08962q204j30448J02151J7989k42086L8562m1044
$$ -269667 -114350 432 109394 101190 -29258 72893 90882 -151204 -112642 -153686
13151a53686k76567j15921R9279K10044L9279K64085J33951l8240j35346r5494
$$ -153686 -430253 -546174 -446895 -236851 -197572 66513 200464 162224 26878 -68616
13141f8616R7760K96989j54963l01637O1181J10945Q2658l03016L2463K42930
$$ -68616 29144 326133 171170 -130467 -69286 41659 124317 -178699 -146236 96694
13131I6694n58l4087j04066j2611J5027o9m4390J67100Q9410q1074j86451k26727
$$ 96694 96136 62049 -42017 -54628 -39601 -39670 -84060 83040 172450 91376 -95075 -321802
13119c21802j20066k62232K14886J92098L79871j26215m1745J94647j83012k28512
$$ -321802 -441868 -704100 -489214 -297116 82755 -43460 -85205 109442 -73570 -302082
13109c02082K20634K71745M485o1006J3041n4249p6108k63273n3538K27610j43
$$ -302082 -81448 190297 194782 133776 146817 92568 16460 -246813 -300351 -72741 -72884
13098g2884p6839J62372l7012O3462o3815J9607k1395P7053M348J02872J00730
$$ -72884 -149723 12649 -24363 39099 -24716 -5109 -26504 50549 54897 157769 258499
13087B58499p5422J82579n3402l49632k1511J20113l7689K13159J61644J3626
$$ 258499 183077 365656 312254 -37378 -58889 61224 23535 236694 398338 411964
13077D11964l1674j03951k16233k66823l5926L08129k0353j43866N1978j74800
$$ 411964 380290 276339 60106 -206717 -242643 65486 45133 -98733 -46755 -221555
13067b21555j85716J36466L63396K42181o92R1686j68479r8877j40858k02151
$$ -221555 -407271 -270805 92591 334772 334080 425766 257287 158410 17552 -184599
13057a84599l10574k3724K05165m210n4131j8631k0142K21686O9689P3591J79053
$$ -184599 -495173 -518897 -313732 -317942 -372073 -390704 -410846 -189160 -119471 -45880 133173
13046A33173n1300p0499j12194o9646M5149j20616k10774J33144L50299K31927
$$ 133173 81873 11374 -100820 -170466 -125317 -245933 -456707 -323563 26736 258663
13036B58663k9694j51784j39977M3288j04542J01141J74120P0116j55097k38160
$$ 258663 228969 77185 -62792 -19504 -124046 -22905 151215 221331 66234 -171926
13026a71926k25028o0545P6024Q6558Q540J17079J19788k88695j85549J29153
$$ -171926 -396954 -457499 -381475 -294917 -286377 -169298 -49510 -338205 -523754 -394601
13016c94601M7748p0498p0771K26289L50393q1468j56508P162N1020l1440J68026
$$ -394601 -346853 -417351 -488122 -261833 88560 7092 -149416 -142254 -91234 -122674 45352
13005D5352K2495p1120k6782j89792k87671M5422J00522N7104J72303j03603L67641
$$ 45352 67847 -3273 -30055 -219847 -507518 -462096 -361574 -304470 -132167 -235770 131871
12994A31871K15040r4695M524J395k70413j00372l0889M7817J20417J40930j76624
$$ 131871 346911 252216 256740 258135 -12278 -112650 -143539 -95722 24695 165625 -10999
12983a0999k83665j08055L5234L60291L46736m4122N6725J9456k8638j24775j97814
$$ -10999 -294664 -402719 -367485 -7194 339542 295420 352145 371601 342963 218188 20374
12972B0374j66249j07711J03367j52680m2545K76024J48276k3204j14612j26400
$$ 20374 -145875 -253586 -150219 -302899 -345444 -69420 78856 55652 -58960 -185360
12962a85360K04077M7875n0147j52930R2759M8293j54989L9144K8919m0145P992
$$ -185360 18717 66592 16445 -136485 -43726 4567 -150422 -111278 -82359 -122504 -114512
12951a14512k11100j26389J1073K07799K51056j34609J6058O4951j29327j38421
$$ -114512 -325612 -452001 -440928 -233129 17927 -116682 -100624 -35673 -165000 -303421
12941c03421m3630M4180j5413j76665K17569j90077j73695J73010R9282J54272
$$ -303421 -347051 -302871 -318284 -494949 -277380 -467457 -641152 -468142 -368860 -214588
12931b14588j80675J744Q1641P7252K10300J3930J57565M9082L0014j62176n8474
$$ -214588 -395263 -393519 -311878 -234626 -24326 -10396 147169 196251 226265 64089 5615
12920E615j73908J06625J95248M9763j77988o9195J41179K5975L0882j51380J54286
$$ 5615 -168293 -61668 133580 183343 5355 -63840 77339 103314 134196 -17184 137102
12909A37102J93244n0114j04359j51338N0578j18622k44869L6591p111Q0136K16934
$$ 137102 330346 280232 175873 24535 75113 -43509 -288378 -251787 -258898 -178762 38172
12898C8172J9781M3330k44877j19688n6405O2891J35168J45179O8471j18569L1860
$$ 38172 57953 101283 -143594 -263282 -319687 -256796 -121628 23551 92022 -26547 5313
12887E313j35454J08738K6468j07360j34573J85790n0722M5758K39295j55821
$$ 5313 -130141 -21403 5065 -102295 -236868 -51078 -101800 -56042 183253 27432
12877B7432k3848n192o2444J06482J55250r9898O4391J47314j2762l58246j18117
$$ 27432 3584 -1608 -64052 42430 197680 97782 162173 309487 296725 -61521 -179638
12866a79638j84111j22627J67048L47305J68524n5772J05269j4270k79100J8449
$$ -179638 -363749 -486376 -319328 27977 196501 140729 245998 231728 -47372 -28923
12856b8923L39517j89504l32390k42592J80838K76745R9875j26774M8415J24353
$$ -28923 310594 121090 -211300 -453892 -273054 3691 103566 -23208 25207 149560
12846A49560J69107n9911j3158j04141k92808k65238J0034K79750k1695j24682
$$ 149560 318667 258756 245598 141457 -151351 -416589 -406555 -126805 -148500 -273182
12836b73182j12855N5925R0688j90883j28005P5518k5731J21985J66309j94417
$$ -273182 -386037 -330112 -239424 -430307 -558312 -482794 -508525 -386540 -220231 -414648
12826d14648N2049J2952O4546J47290J42633M4746j35555j58019L12510J89017
$$ -414648 -362599 -349647 -285101 -137811 4822 49568 -85987 -244006 68504 257521
12816B57521o0437j27520j75737J35321R2198J07019j82372j41497r4319k7963
$$ 257521 197084 69564 -106173 29148 121346 228365 45993 -95504 -189823 -217786
12806b17786K51165J41280p1127j76219j65822N8000j23458L4142k8134J53516
$$ -217786 33379 174659 103532 -72687 -238509 -180509 -303967 -269825 -297959 -144443
12796a44443j59226J33025L00973J74204j26343j28011j79370j1219j83509O6584
$$ -144443 -303669 -170644 130329 304533 178190 50179 -129191 -140410 -323919 -257335
12786b57335K84377m7755J24574M5868n8802n4650K28674N8424j87494J61647
$$ -257335 27042 -20713 103861 149729 90927 36277 264951 323375 135881 297528
12776B97528J03816j68317m4683R2892j60955m2091P1169j0328r8311p2255J579
$$ 297528 401344 233027 188344 281236 120281 78190 149359 139031 40720 -31535 -29956
12765b9956N4934M1391l55980l10819o2523K0588J77038K00676J05951K01351
$$ -29956 24978 66369 -289611 -600430 -662953 -642365 -465327 -264651 -158700 42651
12755D2651J42416j42880p363M1732j81420r0414l8674m1400J65736J2148j20935
$$ 42651 185067 42187 34824 76556 -104864 -195278 -233952 -275352 -109616 -97468 -218403
12744b18403J29562K68568n3796k31643j9076M7952P7556j68881J09524J19346
$$ -218403 -88841 179727 125931 -105712 -124788 -76836 720 -168161 -58637 60709
12734F0709J72835R9715P2087j16340j82628l35681P5909K73106k15293J29309
$$ 60709 233544 333259 405346 289006 106378 -229303 -153394 119712 -95581 33728
12724C3728J23619q266q9920L6434J16298J53962k15461k01255N0949r6340M6064
$$ 33728 157347 149081 59161 95595 211893 365855 150394 -50861 88 -96252 -50188
12713e0188q4436k14658J41189K69690J91383m2312l61894R364L260J47269K15147
$$ -50188 -134624 -349282 -208093 61597 252980 210668 -151226 -141862 -138602 8667 223814
12702B23814j40120m0286M3997p1964m5764Q3126n9938j17655P4559J1779K25278
$$ 223814 83694 43408 87405 15441 -30323 52803 -7135 -124790 -50231 -38452 186826
12691A86826N0079j33409j70698j60099j72136J610O6654J64242J95373j06219
$$ 186826 236905 103496 -67202 -227301 -399437 -397827 -331173 -166931 28442 -77777
12681g7777l7338j65869j15418j59441k1379p8618J13651J70794K66623R6297
$$ -77777 -115115 -280984 -396402 -555843 -577222 -655840 -542189 -371395 -104772 -8475
12671h475J8688P0770P3475p5849l4475L8840K7355J66118k006k00655m7849n2160
$$ -8475 10213 80983 154458 78609 44134 82974 110329 276447 274441 73786 25937 -26223
12659b6223j24536M1885j578L9002j61681j32546K02010q6500Q1459K44047K30162
$$ -26223 -150759 -108874 -110452 -71450 -233131 -365677 -163667 -250167 -168708 75339 305501
12648C05501j85639j46474n4278L2243o1398j54738q6875J26063l847J15011L11801
$$ 305501 119862 -26612 -80890 -48647 -110045 -264783 -351658 -225595 -229442 -114431 197370
12637A97370J3265n6698j75806j46482J36689J41208m1952q4222j8015K9405j30603
$$ 197370 210635 153937 -21869 -168351 -31662 109546 67594 -16628 -34643 -5238 -135841
12626a35841o7179j12341O5941L14179J54615n6579j49360o2174R7219M1720Q5362
$$ -135841 -203020 -315361 -249420 64759 219374 162795 13435 -48739 48480 90200 175562
12615A75562p516k03589j53159o233L07681J47616k07157l55581O3649J74949
$$ 175562 168046 -35543 -188702 -194935 112746 260362 53205 -302376 -238727 -63778
12605f3778k2680k22226k34533J99258L78245l611j55251m8109o478J42850K46527
$$ -63778 -86458 -308684 -543217 -343959 34286 30675 -124576 -172685 -179163 -36313 210214
12594B10214l7927l31438k03233o0145P1184p2008J80956K26494J98108l1249
$$ 210214 172287 -159151 -362384 -422529 -351345 -423353 -242397 -15903 182205 150956
12584A50956P627l12087j53568M2086J18813j03715J81138R2439j9288j96117
$$ 150956 158583 -153504 -307072 -264986 -146173 -249888 -68750 23689 4401 -191716
12574a91716J09629K02343J78522N7908k76699l26180M5605J74183N6827r2426
$$ -191716 -82087 120256 298778 356686 79987 -246193 -200588 -26405 30422 -62004
12564f2004p9102L0673n2485k60008J56737M20292J58757R1677j12335M7489J49723
$$ -62004 -141106 -110433 -162918 -422926 -266189 154103 312860 404537 292202 339691 489414
12553D89414j79273j03264L2932J16648M8478j75406L376r6086l3243r2110J29719
$$ 489414 310141 206877 239809 356457 404935 229529 232905 136819 103576 11466 141185
12542A41185j78629r9950N4774J77615O5272k14903k5493j126n2346j01279k483
$$ 141185 -37444 -137394 -82620 94995 160267 -54636 -80129 -81255 -133601 -234880 -237363
12531b37363j10288R8813n5523J97903J28345J3823J39714r5056k17732J32069
$$ -237363 -347651 -248838 -304361 -106458 21887 35710 175424 80368 -137364 -5295
12521e295O6191j31101o4322J37645j52217j71896j82623o2287O5329J8569J85268
$$ -5295 60896 -70205 -134527 3118 -149099 -320995 -503618 -565905 -500576 -482007 -296739
12510b96739K01693J54960N4010j50258o8054Q0834J2358k25601k07608J09125
$$ -296739 -95046 59914 113924 -36334 -104388 -23554 -11196 -236797 -444405 -335280
12500c35280J16223N0991K47662J60934L8157j47958k60270j51738L9580J00223
$$ -335280 -219057 -168066 79596 240530 278687 130729 -129541 -281279 -241699 -141476
12490a41476J34910N7608n9772J37497j77891k23955J72060J03995j01533K98209
$$ -141476 -6566 51042 -8730 128767 -49124 -273079 -101019 2976 -98557 199652
12480A99652J24647k11789k74408j73964r621R7892o1090R2464J3654q5245K7829
$$ 199652 324299 112510 -161898 -335862 -345483 -247591 -308681 -216217 -202563 -287808 -259979
12469b59979M4332j07178j18495J47641J59285m4845l7712J11066J06700k6936
$$ -259979 -215647 -322825 -441320 -293679 -134394 -179239 -216951 -105885 815 -26121
12459b6121j68617L7768j77928J26918K72460J06939n2131m0475j89907k37901
$$ -26121 -194738 -156970 -334898 -207980 64480 171419 119288 78813 -111094 -348995
12449c48995Q9788J00565j70064o6917J21526m9850J26933j8129k18711P2469
$$ -348995 -259207 -158642 -328706 -395623 -274097 -323947 -197014 -215143 -433854 -361385
12439c61385O9137j16540j43663l2131L48738K61778J7999k23871R0115k368k59947
$$ -361385 -292248 -408788 -552451 -584582 -235844 25934 43933 -179938 -89823 -92191 -352138
12428c52138q3756j72361M5372K51756L31860j96376J15230J20026j05637j35350
$$ -352138 -435894 -608255 -562883 -311127 20733 -175643 -60413 59613 -46024 -181374
12418a81374J17133J85905k49586o9255k8678J18887J08634K0408K40266L15017
$$ -181374 -64241 121664 -127922 -197177 -225855 -106968 1666 22074 262340 577357
12408E77357n1559j43005l16068k52326N0006O4123l2070K4195N9419Q686J22718
$$ 577357 525798 382793 66725 -185601 -135595 -71472 -103542 -79347 -19928 -11242 111476
12397A11476r8263N8773j1326k0541l5547J67322M3997k12577k33034k059J8801
$$ 111476 13213 71986 60660 40119 4572 171894 215891 3314 -229720 -231779 -212978
12386b12978M3410m767k5483j42605J4596J16652P0286P9971n878q6160r2613
$$ -212978 -169568 -174335 -199818 -342423 -327827 -211175 -140889 -60918 -66796 -152956 -245569
12375b45569J16455L01345R0631l15070l93807J09200K83166J36414K0464j41337
$$ -245569 -129114 172231 262862 -52208 -446015 -336815 -53649 82765 103229 -38108
12365c8108K04876k5547l51599j6045K60003m1200O1231j0203j95686j09784L8401
$$ -38108 166768 141221 -210378 -226423 33580 -7620 53611 43408 -152278 -262062 -223661
12354b23661J84491L7337k28767q1599J47096p1063K0350J78005J23522o704l7165
$$ -223661 -39170 -1833 -230600 -312199 -165103 -236166 -215816 -37811 85711 79007 41842
12343D1842j25642K3870n4646j9587n2331k3206l12759j80060J16574L06088J60204
$$ 41842 -83800 -59930 -114576 -134163 -186494 -209700 -522459 -702519 -585945 -279857 -119653
12332a19653R9105J23635l42464k32035J58103L37979J6780j59173k21806K18712
$$ -119653 -20548 103087 -239377 -471412 -313309 24670 41450 -117723 -339529 -120817
12322a20817q449J37715j77820P7633n0355l50163k1286J63998l3023L74338L74507
$$ -120817 -129266 8449 -169371 -91738 -142093 -492256 -513542 -349544 -382567 -8229 366278
12311C66278j04857j74140J2722k34327j32948M5553K41954m671j17204m1388
$$ 366278 261421 87281 100003 -134324 -267272 -221719 20235 15564 -101640 -143028
12301a43028J9544N4534m5762j98908q1250J10612K02984J14065j9144j62603
$$ -143028 -123484 -68950 -114712 -313620 -394870 -284258 -81274 32791 13647 -148956
12291a48956o1065j22330O0171M1224J45769M9326j18376j55314q1459q9437k4381
$$ -148956 -210021 -332351 -272180 -230956 -85187 -35861 -154237 -309551 -391010 -480447 -504828
12280e04828K07666Q4480J08736k1927J18273J41172j26140k10348j86350m6406
$$ -504828 -297162 -212682 -103946 -125873 -7600 133572 7432 -202916 -389266 -435672
12270d35672O5286J55794J06597M8950R2501j96729L9191n030j45540j93992q7
$$ -435672 -370386 -214592 -107995 -59045 33456 -163273 -124082 -129112 -274652 -468644 -468731
12259d68731L46408R2824O2633J70819r6431r340j18249j34959r9719k4435j21496
$$ -468731 -122323 -29499 33134 203953 107522 98182 -20067 -155026 -254745 -279180 -400676
12248d00676q6458J56531R1287J8918J93266J6705J30706k1317q6516j05817p7562
$$ -400676 -487134 -330603 -239316 -220398 -27132 -10427 120279 98962 12446 -93371 -170933
12237a70933N7677J85235J27752l5747M3345j83550Q4174j14254P6879l1557K42702
$$ -170933 -113256 71979 199731 163984 207329 23779 107953 -6301 70578 39021 281723
12226B81723Q733k32564j52072J08074L692j62508J3188L84865J21972k38903
$$ 281723 290456 57892 -94180 13894 17586 -144922 -131734 253131 375103 136200
12216A36200k097K63230R073k71656k42786J2125k2050o0163K21043J25152o5251
$$ 136200 134103 397333 406406 134750 -108036 -95911 -117961 -178124 42919 168071 102820
12205A02820m43503j7983K00285J31299P5910m2293J1641j15291k74732l63676
$$ 102820 -340683 -358666 -158381 -27082 48828 6535 18176 -97115 -371847 -735523
12195g35523J76085J15007l5716q2656k11021J44934J76429O3268l123K55085
$$ -735523 -559438 -444431 -480147 -562803 -773824 -628890 -452461 -389193 -392316 -137231
12185a37231k3471j23344k75415j19007l251J95324K53826R5903P8622k19737
$$ -137231 -160702 -284046 -559461 -678468 -681719 -486395 -232569 -136666 -58044 -277781
12175b77781o6032N3395N263n3508L23545K04374r2158j70955l5925N9546o0175
$$ -277781 -343813 -290418 -285155 -338663 -15118 189256 97098 -73857 -109782 -50236 -110411
12164a10411j4708L2196R1339j07422k3019j49352q2635J90237J42319n2510M1307
$$ -110411 -125119 -92923 -1584 -109006 -132025 -281377 -364012 -173775 -31456 -83966 -42659
12153d2659Q5954j75375k05718j56687O2817L15021L8337J10217n233o1256J013
$$ -42659 43295 -132080 -337798 -494485 -431668 -116647 -78310 31907 26674 -34582 -33569
12142c3569j33244p5541P8301j19984q3632J83143Q2359J28323K889o1143k8151
$$ -33569 -166813 -242354 -164053 -284037 -367669 -184526 -102167 26156 29045 -32098 -60249
12131f0249r5196j97585J20296J46888m1845l2316p339j10652N7522k2414N6924
$$ -60249 -155445 -353030 -232734 -85846 -127691 -160007 -167346 -277998 -220476 -242890 -185966
12120a85966o823N4529o4339o308m9471K12415L50311O1069j83742k88279j15476
$$ -185966 -192789 -138260 -202599 -208907 -258378 -45963 304348 365417 181675 -106604 -222080
12109b22080j63241k1297Q8007q4938J06133m7157J61605J48310j2460j75319
$$ -222080 -385321 -406618 -318611 -403549 -297416 -344573 -182968 -34658 -47118 -222437
12099b22437j09933j269J49726L7091J41297q4462J12137q2880q999J45337Q4739
$$ -222437 -332370 -333639 -183913 -146822 -5525 -89987 22150 -60730 -69729 75608 160347
12088A60347k12296j13179n2924L1981J02459j45572j27169K10290J33673m2398
$$ 160347 -51949 -165128 -218052 -186071 -83612 -229184 -356353 -146063 -12390 -54788
12078e4788m2992j97675k483Q1640j99835j03581M8883K11782Q8649L4055Q3598
$$ -54788 -97780 -295455 -297938 -216298 -416133 -519714 -470831 -259049 -170400 -136345 -52747
12067e2747O7987j62025j16147j43892l7983j67884K04540K39249L24426K12120
$$ -52747 15240 -146785 -262932 -406824 -444807 -612691 -408151 -168902 155524 367644
12057C67644j64347j57705P9573J69898k27890j99426o2216M7072k7246P3374
$$ 367644 203297 45592 125165 295063 67173 -132253 -194469 -147397 -174643 -101269
12047a01269M267J66991P3384j81436j75536O1520q3344l4339L0269J11j42006
$$ -101269 -97002 69989 143373 -38063 -213599 -152079 -235423 -269762 -239493 -239382 -381388
12036c81388K01970J86228j71461R6935K51648k36233k31253o3055R0054k3192
$$ -381388 -179418 6810 -164651 -67716 183932 -52301 -283554 -346609 -256555 -279747
12026b79747J53090J70173J59598j7367J24346K2690r6407j47356K6498j64430
$$ -279747 -126657 43516 203114 185747 310093 332783 236376 89020 115518 -48912
12016d8912o2458j14056k05322J62461J50838M6515J3154j1708J5552J37494J029
$$ -48912 -111370 -225426 -430748 -268287 -117449 -70934 -57780 -69488 -53936 83558 84587
12005H4587j93433k49184J12627K62013k0258j01822j7177K40905O5919J69322
$$ 84587 -108846 -358030 -245403 16610 -3648 -105470 -122647 118258 184177 353499
11995C53499k554K5743o5035Q5085o192j50235j57532P4538K06634O359k13498
$$ 353499 350945 376688 311653 396738 390546 240311 82779 157317 363951 370310 156812
11984A56812Q1273L6657P9987P8834j76931k14883N0549j08953j15464n4388n0246
$$ 156812 238085 274742 354729 433563 256632 41749 92298 -16655 -132119 -186507 -236753
11973b36753q1277P574R0930L9924L3086j16283j29952J87728j8926J3915J6515
$$ -236753 -318030 -310456 -219526 -179602 -146516 -262799 -392751 -205023 -223949 -210034 -193519
11962a93519l5633J04436R9193P0732j01156Q0031M805p7764j8904j57714l970
$$ -193519 -229152 -124716 -25523 45209 -55947 24084 28889 -48875 -67779 -225493 -229463
11951b29463J58354q4677R2866j03097j16162L1245q0079J24922p221P0495J64721
$$ -229463 -71109 -155786 -62920 -166017 -282179 -250934 -331013 -206091 -213312 -142817 21904
11940B1904R0084q7485M0395J11753j00375L0462M2511J2549j36780P9261j64166
$$ 21904 111988 24503 64898 176651 76276 106738 149249 161798 25018 104279 -59887
11929e9887P499m4248j09687K67968K11473P3733j03085j56676k45534j74947
$$ -59887 -52388 -96636 -206323 61645 273118 346851 243766 87090 -158444 -333391
11919c33391m2896k569L7649J98231r260j80294K7646J39865J35832N1149l7358
$$ -333391 -376287 -378856 -341207 -142976 -152236 -332530 -304884 -165019 -29187 21962 -15396
11908a5396j72634K658j16586m8816r8766J54846L38115K63862N4074k30648k65301
$$ -15396 -188030 -185372 -301958 -350774 -449540 -294694 43421 307283 361357 130709 -134592
11897a34592l9094J54188R4928n3098j29328k24512N676J24602Q1387R6361L8740
$$ -134592 -173686 -19498 75430 22332 -106996 -331508 -325832 -201230 -119843 -23482 15258
11886A5258J44292q6261j56054n3477l1475K0240J02799j84821p5337N02855J08874
$$ 15258 159550 73289 -82765 -136242 -167717 -147477 -44678 -229499 -304836 198019 306893
11875C06893k23320K1412K8265R0546M9007o6828k6922o4201J80320m4385J06679
$$ 306893 83573 104985 133250 223796 272803 205975 179053 114852 295172 250787 357466
11864C57466J01089n9919k11331k88188k57418R3949K30705r9481o3454q2204
$$ 357466 458555 398636 187305 -100883 -358301 -264352 -33647 -133128 -196582 -278786
11854b78786O0051N6988J88020J24982J06504k9955j20565k60716J59102J4072
$$ -278786 -218735 -161747 26273 151255 257759 227804 107239 -153477 5625 19697
11844A9697m0056J9800J2704J39876N0475J55281k41410k00645p2895j11130L0544
$$ 19697 -20359 -559 12145 152021 202496 357777 116367 -84278 -157173 -268303 -237759
11833b37759J60792J77795o3741j43199J56033M31764k29751k85391j86351j07350
$$ -237759 -76967 100828 37087 -106112 49921 481685 251934 -33457 -219808 -327158
11823c27158J22770K45953P2515j3103o6431M3670j63319k08035J1143K23215
$$ -327158 -204388 41565 114080 100977 34546 78216 -85103 -293138 -281995 -58780
11813e8780J86044M0197P5320k40391o4399l05034j4457K10215Q5743K65555j8386
$$ -58780 127264 167461 242781 2390 -62009 -367043 -381500 -171285 -85542 180013 161627
11802A61627k06658q5612l8300K930l06716j29341J92605J07669J18504j72497
$$ 161627 -45031 -130643 -168943 -166013 -472729 -602070 -409465 -301796 -183292 -355789
11792c55789k20126p1006M18786L61993k83673j1929N5116R7093j72368N2605
$$ -355789 -575915 -646921 -228135 133858 -149815 -161744 -106628 -9535 -181903 -129298
11782a29298o211n8339J32733N6814o2935l3954N0245k0665J63878J3181m4234
$$ -129298 -135509 -193848 -61115 -4301 -67236 -101190 -50945 -71610 92268 105449 61215
11771F1215K94757r6543j82415j19994J533J30957j6455l5754L228r3973J11773
$$ 61215 355972 259429 77014 -42980 -41447 89510 73055 37301 40529 -53444 58329
11760E8329p1307j05998p0705J60919J04972j27624k14402O1552J28445O4425
$$ 58329 -12978 -118976 -189681 -28762 76210 -51414 -265816 -204264 -75819 -11394
11750a1394o3409N6763K6178l4103m3132j88732j60106K16491K12058o3158o2009
$$ -11394 -74803 -18040 8138 -25965 -69097 -257829 -417935 -201444 10614 -52544 -114553
11739a14553j47130J9096O5972k0232L2639Q6128K7574j65990O7803J37826j01977
$$ -114553 -261683 -242587 -176615 -196847 -164208 -78080 -50506 -216496 -148693 -10867 -112844
11728a12844j05970J47655J16011j02396n6841k23099J03358K66734M7964j33828
$$ -112844 -218814 -71159 44852 -57544 -114385 -337484 -234126 32608 80572 -53256
11718e3256J24846N4786J46460j16093j05380j36076J2122j95471J08774K62499
$$ -53256 71590 126376 272836 156743 51363 -84713 -72591 -268062 -159288 103211
11708A03211L0554q2724j6521O0771n6465R1528q7082j70958j86941K46341J99416
$$ 103211 133765 51041 34520 95291 38826 130354 43272 -127686 -314627 -68286 131130
11697A31130Q5079m6806m9585j00742q9353m0143P9566n1793k02977J58591j2317
$$ 131130 216209 169403 119818 19076 -70277 -110420 -30854 -82647 -285624 -127033 -139350
11686a39350k07181O7417K06m6820K3961L1126K80548l2371K4998j76183j77498
$$ -139350 -346531 -279114 -278908 -325728 -301767 -270641 9907 -22464 2534 -173649 -351147
11675c51147L10800K03368q420j20724Q3576M6527k91609j82725N4172O100m8893
$$ -351147 -40347 163021 154601 33877 117453 163980 -127629 -310354 -256182 -250082 -298975
11664b98975j65628P0947J00371N2561n4938r585J51237R1765q3412K2001k0315
$$ -298975 -464603 -393656 -293285 -240724 -295662 -305247 -154010 -62245 -145657 -123656 -143971
11653a43971n1932J06045n9095K25765j32009L4761J23454k35074J1696K64467
$$ -143971 -195903 -89858 -148953 76812 -55197 -20436 103018 -132056 -120360 144107
11643A44107K08632j53151k19554j94600j10113p3975N0429L79521J85621j42639
$$ 144107 352739 199588 -19966 -214566 -324679 -398654 -348225 31296 216917 74278
11633G4278r7767R1248k88340j02057Q8002J871Q0825o3133n9489L7305K06394
$$ 74278 -23489 67759 -220581 -322638 -234636 -232765 -151940 -215073 -274562 -237257 -30863
11622c0863K97121M7824j25646j30780J47828o1341k50328O6991j90891J55945
$$ -30863 266258 314082 188436 57656 205484 144143 -106185 -39194 -230085 -74140
11612g4140K32185j51590n0888j18922k02102J45404O3435M913J19632q6225j59116
$$ -74140 158045 6455 -44433 -163355 -365457 -220053 -156618 -151705 -32073 -118298 -277414
11601b77414l2425j34111o0973J19561N8954K5796J43226P792j87346j01974J38037
$$ -277414 -309839 -443950 -504923 -385362 -326408 -300612 -157386 -149594 -336940 -438914 -300877
11590c00877K36633L4039l4460O3069j0318J1775J47654R8421j36834o6681j11497
$$ -300877 -64244 -30205 -64665 -1596 -11914 -139 147515 245936 109102 42421 -69076
11579f9076j23340K6259j38911K19721P5194j73816J39921J90078J7396L00456
$$ -69076 -192416 -166157 -305068 -85347 -10153 -183969 -44048 146030 163426 463882
11569D63882r9730l31501j09691k33291N5660N9131M2124M2050R4318K49895L33865
$$ 463882 364152 32651 -77040 -310331 -254671 -195540 -153416 -111366 -17048 232847 566712
11558E66712l6052n6113k9869j06908k81140j18372P850N2717J1602P7642k1500
$$ 566712 530660 474547 444678 337770 56630 -61742 -53892 -1175 10427 88069 66569
11547F6569M7350j94484k7033J87564j17328R8237O8356j39508p1845j33133j82704
$$ 66569 113919 -80565 -107598 79966 -37362 60875 129231 -10277 -82122 -215255 -397959
11536c97959N1485Q8744L1513l8857J32771L9013J70616j68640j81001r6276n8961
$$ -397959 -346474 -257730 -226217 -265074 -132303 -93290 77326 -91314 -272315 -368591 -427552
11525d27552R7457J75691j37287P3853R8844N1000J32824L26059J2974l28332
$$ -427552 -330095 -154404 -291691 -217838 -118994 -67994 64830 390889 403863 75531
11515G5531l4574N7390l83464l7111L1504R7755j40976r9855J09945P0186L54323
$$ 75531 40957 98347 -285117 -322228 -290724 -192969 -333945 -433800 -323855 -253669 100654
11504A00654Q8830j2382J40046J45445k08420j81609k46198k0316l805J54905
$$ 100654 189484 177102 317148 462593 254173 72564 -173634 -193950 -197755 -42850
11494d2850P2849j38709p5007j15817r5347m9068L74728K51780P2210l73140m70869
$$ -42850 29999 -108710 -183717 -299534 -394881 -443949 -69221 182559 254769 -118371 -589240
11483e89240j27213J91991l7462k2471K25221K50864M8346p1760K07941K51621
$$ -589240 -716453 -524462 -561924 -584395 -359174 -108310 -59964 -131724 76217 327838
11473C27838J03811l9609j51315j51353l56m8923o5794j45221j48704l9475K1586
$$ 327838 431649 392040 240725 89372 89016 40093 -25701 -170922 -319626 -359101 -337515
11462c37515J88559j53302j13130P793J37187j18488K3081J26869P6358R6561
$$ -337515 -148956 -302258 -415388 -407595 -270408 -388896 -365815 -238946 -162588 -66027
11452f6027K41493r3311j58308K3732Q679L8190J78683K7358p9922J58840n1241
$$ -66027 175466 82155 -76153 -52421 -43742 -5552 173131 200489 120567 279407 228166
11441B28166r2540N0158r2491j58840k04002O7735j49157L8573J40201j35629
$$ 228166 135626 185784 93293 -65547 -269549 -201814 -350971 -312398 -172197 -307826
11431c07826j94536J86623K19920j73543j0627J97667J37755j12570j97878j40131
$$ -307826 -502362 -315739 -95819 -269362 -279989 -82322 55433 -57137 -255015 -395146
11421c95146j73605J84613K09594K6588k01914j37834N6784K35223J11262K69044
$$ -395146 -568751 -384138 -174544 -147956 -349870 -487704 -430920 -195697 -84435 184609
11411A84609K465j58794j45775j34336M310L8107K8661M7430n8849m7800p4387
$$ 184609 187074 28280 -117495 -251831 -247521 -209414 -180753 -133323 -192172 -239972 -314359
11400c14359J67037K77890j01581k3514J53853K6261l01966j58831J04572J28099
$$ -314359 -147322 130568 28987 5473 159326 185587 -116379 -275210 -170638 -42539
11390d2539k92589j07555J46606k9382k18622M1801N0863J04097J50614L30940
$$ -42539 -335128 -442683 -296077 -325459 -544081 -502280 -451417 -347320 -196706 134234
11380A34234k3630k82826j41986Q4619q4893l54547R5684J52659K94996J21295
$$ 134234 110604 -172222 -314208 -229589 -314482 -669029 -573345 -420686 -125690 -4395
11370d395P7289l85495p519K09654j17104Q444K16290j51418j08535j4340J2836
$$ -4395 72894 -312601 -320120 -110466 -227570 -219126 -2836 -154254 -262789 -277129 -264293
11359b64293J27619P7710n8281R0592O0246l0156J61268J68786O7643j59927l09063
$$ -264293 -136674 -58964 -117245 -26653 33593 3437 164705 333491 401134 241207 -67856
11348f7856P9256J76341j60460J02837n1885l00749j38623K23834K74883J25548
$$ -67856 11400 187741 27281 130118 78233 -222516 -361139 -137305 137578 263126
11338B63126l15217j26291K87418Q1130L67579M6938j41984k0240l13275l07836
$$ 263126 -52091 -178382 109036 190166 557745 604683 462699 442459 129184 -178652
11328a78652r1726J14310K57848J4778j66817j32524J32220j4717n8142j30248
$$ -178652 -270378 -156068 101780 116558 -50259 -182783 -50563 -65280 -123422 -253670
11318b53670K03124r4296p6521K21396m1565j65652j88625K41999q9702j31604
$$ -253670 -50546 -144842 -221363 33 -41532 -207184 -395809 -153810 -243512 -375116
11308c75116O3081K12524M6771j7084O7391J97970J56547m02145k51604K49919
$$ -375116 -312035 -99511 -52740 -69824 -2433 195537 352084 -50061 -301665 -51746
11298e1746j23334k6957O6880L4951N7179J59261J27271l4293N7063M3702j2929
$$ -51746 -175080 -202037 -135157 -100206 -43027 116234 243505 209212 266275 309977 297048
11287B97048j73889Q253K15250L3637k08150k59564r9461M3942j74401k13102
$$ 297048 123159 131412 346662 380299 172149 -87415 -186876 -142934 -317335 -530437
11277e30437j3325J86498J45710J61266Q7808M5430P5403j69149j9625Q0107j15593
$$ -530437 -543762 -357264 -211554 -50288 37520 82950 158353 -10796 -30421 49686 -65907
11266f5907j05462j63133j53226o8604K81785J65709k00044k21319K3317l3986
$$ -65907 -171369 -334502 -487728 -556332 -274547 -108838 -308882 -530201 -506884 -540870
11256e40870Q2445K35103K20118K08182l64742o3644j638P5013j37716J09744
$$ -540870 -458425 -223322 -3204 204978 -159764 -223408 -225046 -150033 -287749 -178005
11246a78005J76480L9825K4664j53931K1248J08590j4324j45092k02134l423K1292
$$ -178005 -1525 38300 62964 -90967 -69719 38871 24547 -120545 -322679 -326102 -304810
11235c04810j11437q8812L82033K42676j14646j92061m2906p1091q7909R1091
$$ -304810 -416247 -505059 -123026 119650 5004 -187057 -229963 -301054 -388963 -297872
11225b97872Q5204J42373J6880k5567m4258J9957J5556Q9605K26782j68265j49868
$$ -297872 -212668 -70295 -53415 -78982 -123240 -103283 -87727 1878 228660 60395 -89473
11214h9473K44821K14558k17832j81269p893J21837M06122M3755l17439j98846
$$ -89473 155348 369906 152074 -29195 -37088 84749 490871 534626 217187 18341
11204A8341p5692n4578L20845J84119j02953k09627m0691K0489m9393K449j27436
$$ 18341 -57351 -111929 208916 393035 290082 80455 39764 60253 10860 13309 -114127
11193a14127q5544L96401j46j8707P2729k73562o7364L4927p2728j16853k37686
$$ -114127 -199671 196730 196584 177877 250606 -22956 -90320 -55393 -128121 -244974 -482660
11182d82660K41490P9555j90710j62618m5564J92247J79060J57985J63265m2252
$$ -482660 -241170 -161615 -352325 -514943 -560507 -368260 -189200 -31215 132050 89798
11172H9798k46338P2091R4352j12348J13671N6038o7256n0303j45934O1062J49111
$$ 89798 -156540 -84449 9903 -102445 11226 67264 8 -50295 -196229 -135167 13944
11161A3944J28776n7089j9110J14363p8578r1777o2116K45952J72285j72072j42177
$$ 13944 142720 85631 66521 180884 102306 10529 -51587 194365 366650 194578 52401
11150E2401K30698K4175j54496j08038O5638l8198p777p0649R8853O3205k43863
$$ 52401 283099 307274 152778 44740 110378 72180 64403 -6246 92607 155812 -88051
11139h8051j86177K1335J70176J27805j92542j93543J82987K00437P341j5795
$$ -88051 -274228 -252893 -82717 45088 -147454 -340997 -158010 42427 49768 33973
11129C3973j38923j20334J91149k4649J0793J14896N9503j36315j23817O4792
$$ 33973 -104950 -225284 -34135 -58784 -47991 66905 126408 -9907 -133724 -68932
11119f8932n5125R9240J02868j35238j51835J40777Q5214O4146K7152p8955l21311
$$ -68932 -124057 -24817 78051 -57187 -209022 -68245 16969 81115 108267 29312 -291999
11108b91999j02377q1212j23014K43118K48708N9526j37157J31224j15898J04832
$$ -291999 -394376 -475588 -598602 -355484 -106776 -47250 -184407 -53183 -169081 -64249
11098f4249J548J09780J34982J16160J26976l07766j21289O891j24570j66898
$$ -64249 -62701 47079 182061 298221 425197 117431 -3858 3033 -121537 -288435
11088b88435K89427K24090O463j86183m3064p4418p3344o9706M5363K6651m6713
$$ -288435 992 225082 231545 45362 2298 -72120 -145464 -215170 -169807 -143156 -189869
11077a89869J19290J16309M8032k10930K2303J80533O7774k68283m1451J41168
$$ -189869 -70579 45730 93762 -117168 -94865 85668 153442 -114841 -156292 -15124
11067a5124J26680N3559q3831j50943j77064m7616M0843Q2654J84727K40999K870
$$ -15124 111556 165115 81284 -69659 -246723 -294339 -253496 -170842 13885 254884 257754
11056B57754l31862L7110L7895j57469N5798j2763m5468K27834j34103J57003
$$ 257754 -74108 -36998 897 -156572 -100774 -113537 -159005 68829 -65274 91729
11046I1729J58123Q8015K48742K13713k834J01634r1706o202J60377l795J74102
$$ 91729 249852 337867 586609 800322 797488 899122 807416 801214 961591 957796 1131898
11035A131898L12162M32952L48476J85558m50699m73797L1505j10690j18469K16569
$$ 1131898 1444060 1877012 2225488 2411046 1960347 1486550 1518055 1407365 1288896 1505465
11025A505465P3967K85702N25120L28415K80524n8601n2398k15993k52459k05764
$$ 1505465 1579432 1865134 2390254 2718669 2999193 2940592 2888194 2672201 2419742 2213978
11015B213978k31373m26072m344L37537K72713K97711N3865k00401k09063m45002
$$ 2213978 1982605 1556533 1552189 1889726 2162439 2460150 2514015 2313614 2104551 1659549
11005A659549n06135o3020q0207j52226Q6782j10530k4382j23475J78209J9335
$$ 1659549 1153414 1090394 1010187 857961 944743 834213 809831 686356 864565 883900
10995H83900k9318L8263l39131k67059N0883j65674N2326Q4740p5343O7071M7871
$$ 883900 854582 892845 553714 286655 337538 171864 224190 308930 233587 300658 348529
10984C48529j0333j65889Q781l6343Q3883q8617j40166p608l7423j2487j90577
$$ 348529 338196 172307 181088 144745 228628 140011 -155 -7763 -45186 -57673 -248250
10973b48250J1605J77922l38013j4791J08765J04010l7445p5337N1873O7462o8767
$$ -248250 -236645 -58723 -396736 -411527 -302762 -198752 -236197 -311534 -259661 -192199 -260966
10962b60966J46401M3144p2688j709J84993P6672j31089R833k12j8491k7301n0688
$$ -260966 -114565 -71421 -144109 -145818 39175 115847 -15242 -5409 -5621 -24112 -51413 -102101
10950a02101J00372J30228p0525J4966R21k72325j15515J53890j05788J73865
$$ -102101 -1729 128499 57974 72940 73861 -198464 -313979 -160089 -265877 -92012
10940i2012p3076J53322J82903N6946R1836j26051r5550K4881P6441N2698l8753
$$ -92012 -165088 -11766 171137 228083 319919 193868 98318 123199 199640 252338 213585
10929B13585r6468K8802M2445N6640k73045j47816K0394M7879O3306J80484j21262
$$ 213585 117117 145919 188364 245004 -28041 -175857 -155463 -107584 -44278 136206 14944
10918A4944l30888p7685J55748J85985J62719J4312R7445LJ19011L5278j48368
$$ 14944 -315944 -393629 -237881 -51896 110823 125135 222580 222583 341594 376872 228504
10907B28504O4710k7124q3295k55346n4176j48669O7717J02786j00407K59038
$$ 228504 293214 266090 182795 -72551 -126727 -275396 -207679 -104893 -205300 53738
10897E3738n0822J5880n0420n6840q7847k23686r6957J01065J71203L2337j08930
$$ 53738 2916 18796 -31624 -88464 -176311 -399997 -496954 -395889 -224686 -192349 -301279
10886c01279l0393P3788j16746q070J92057pK3806R5144J67827j93876Q657K55645
$$ -301279 -331672 -257884 -374630 -382700 -190643 -190650 -166844 -71700 96127 -97749 -89092 166553
10874A66553O3345j32719j86050k9549K1958r7309N840K73007m2800j25788K17248
$$ 166553 229898 97179 -88871 -118420 -96462 -193771 -187931 85076 42276 -83512 133736
10863A33736P1678k38922j87986j10883J36921N4850J42660L38337J96760n6622
$$ 133736 205414 -33508 -221494 -332377 -195456 -140606 2054 340391 537151 480529
10853D80529L1404p5995m2781l61037j47301K74041J58768q4651k3526r7937j2637
$$ 480529 511933 435938 393157 32120 -115181 158860 317628 232977 209451 111514 98877
10842I8877J32345K12562J45941o8768j10438m9090n943j34702l0993m6507n2508
$$ 98877 231222 443784 589725 520957 410519 361429 355486 220784 189791 143284 90776
10831I0776J32794R554M7446p2273j04487M742j13957m2651K98435M0102j69143
$$ 90776 223570 233124 280570 208297 103810 108552 -5405 -48056 250379 290481 121338
10820A21338J22661O7283N9625j52010j54694k93650p6161J59902L0848L7016
$$ 121338 243999 311282 370907 218897 64203 -229447 -305608 -145706 -114858 -77842
10810g7842k01889j91135o3443J53950K35467j2302o0797M7380K91084J21257
$$ -77842 -279731 -470866 -534309 -380359 -144892 -157194 -217991 -170611 120473 241730
10800B41730k63988p7872K441O1360N5275J24935m9693j11290J16840P9220k10404
$$ 241730 -22258 -100130 -97689 -36329 18946 143881 94188 -17102 99738 178958 -31446
10789c1446Q8920L2715J59044n8823l58767J33594N3487J33643J15117j27468
$$ -31446 57474 90189 249233 190410 -168357 -34763 18724 152367 267484 140016
10779A40016j35967j06484j73450m0630P1492o6937L3434K31967l1023j08966
$$ 140016 4049 -102435 -275885 -316515 -245023 -311960 -278526 -46559 -77582 -186548
10769a86548o0128r3352N10425L33730m8558j91299Q4105n8864J82160J83141
$$ -186548 -246676 -340028 170397 504127 455569 264270 348375 289511 471671 654812
10759F54812J22469j92357k13522N3326k57613J6381M0898k19409j36964O8042
$$ 654812 777281 584924 371402 424728 167115 183496 224394 4985 -131979 -63937
10749f3937m5649j61643N6401m945j74606K3161J65440O3420Q6024j36621j18020
$$ -63937 -109586 -271229 -214828 -219773 -394379 -371218 -205778 -142358 -56334 -192955 -310975
10738c10975L14452L52611o2652n5852j25787k04948J32113Q1921J25454Q812
$$ -310975 3477 356088 293436 237584 111797 -93151 38962 120883 246337 255149
10728B55149j54850k45501l30406J51429K55025j06314J48761j4112o736J04208
$$ 255149 100299 -145202 -475608 -324179 -69154 -175468 -26707 -40819 -47555 56653
10718E6653K04767j74979Q3714q1782J39964J85808M8638J82276Q2458j69911
$$ 56653 261420 86441 170155 88373 228337 414145 462783 645059 727517 557606
10708E57606k11982j04878l1156N4890K00405J85698L6179J7001J16235O8740
$$ 557606 345624 240746 209590 264480 464885 650583 686762 703763 819998 888738
10698H88738K02918n274m30634k31278K43702L1200q1458q3723j23498K03027
$$ 888738 1091656 1086382 655748 424470 668172 699372 617914 534191 410693 613720
10688F13720J77849j14778r6845R2736Q2179j13720k58987j10466R8425J68082
$$ 613720 791569 676791 579946 672682 754861 641141 382154 271688 370113 538195
10678E38195L01558R4396n140p118J31556m42429j64866J14082L31850j7798Q9056
$$ 538195 839753 934149 929009 921891 1053447 611018 446152 560234 892084 874286 963342
10667I63342J12897j9645J73234P5332M5816j28200P3900j04995l7046l9166K15959
$$ 963342 1076239 1056594 1229828 1305160 1350976 1222776 1296676 1191681 1154635 1115469 1331428
10656A331428K7732K84139K67102j02714M1182M03705K51064j51035J59509K85717
$$ 1331428 1359160 1643299 1910401 1807687 1848869 2252574 2503638 2352603 2512112 2797829
10646B797829J24378P8889J91452L12272K23770K0242J85758N80381M69079N70572
$$ 2797829 2922207 3001096 3192548 3504820 3728590 3748832 3934590 4514971 4984050 5554622
10636E554622N94119N31661P28565J279185J474263J571412J301257Q27069N88500
$$ 5554622 6148741 6680402 7408967 8688152 10162415 11733827 13035084 13862153 14450653
10627A4450653R73874J781069K512552L450963M380571O150754Q213923J1348884
$$ 14450653 15424527 17205596 19718148 23169111 27549682 33700436 41914359 53263243
10619E3263243J5327967J9585228K4145580K7432027K7059477J9204052N494385
$$ 53263243 68591210 88176438 112322018 139754045 166813522 186017574 191511959
10612A91511959n915097j0166719o827826O59984J0278567K1994251L4515185
$$ 191511959 185596862 175430143 168602317 169262301 179540868 201535119 236050304
10605B36050304M6864472N5565899N2920182L0655053n371901l3387124l9822840
$$ 236050304 282914776 338480675 391400857 422055910 416684009 383296885 343474045
10598C43474045k9834904j2895537O189587K5334354M4110543O1127812P0017587
$$ 343474045 313639141 300743604 306933191 332267545 376378088 437505900 507523487
10591E07523487O0713731K3249339l1391264o9196682p4204738n8319317l6493351
$$ 507523487 568237218 591486557 560095293 490898611 416693873 358374556 321881205
10584C21881205j5781110K842912J9003016L1750863L6577803K7272061l04929
$$ 321881205 306100095 308943007 327946023 359696886 396274689 423546750 423241821
10577D23241821l6310819n8433757n8130332m4916479k9459622j6131950n465016
$$ 423241821 386931002 328497245 270366913 225450434 195990812 179858862 174393846
10570A74393846K729558P828835Q552734L025214q387426k1681567k9251070k9098345
$$ 174393846 177123404 184952239 193504973 196530187 188142761 166461194 137210124 108111779
10562A08111779k3624215j7927169j3352775r646236p008753n499210m018454
$$ 108111779 84487564 66560395 53207620 43561384 36552631 31053421 27034967
10555B7034967l126415k836747k049971j856430j715886j484377j418568j362598
$$ 27034967 23908552 21071805 19021834 17165404 15449518 13965141 12546573 11183975
10547A1183975r77300q74328n61225l64905m23356o63623o66538m98664k96091
$$ 11183975 10206675 9332347 8771122 8406217 7982861 7319238 6652700 6154036 5857945
10538E857945m87259k59378n3556p0980r6285l00573l86174p2044k47371k09244
$$ 5857945 5370686 5111308 5057752 4986772 4890487 4589914 4203740 4131696 3884325 3675081
10528C675081l4800Q837j03567m24946R7704j55570k3334j7045j70971k72323
$$ 3675081 3640281 3649118 3545551 3120605 3218309 3062739 3039405 3022360 2851389 2579066
10518B579066j27081J25077n2400j37655j23196K3654j93674j46940m2114m0590
$$ 2579066 2451985 2577062 2524662 2387007 2263811 2287465 2093791 1946851 1904737 1864147
10508A864147p3429m8459l5251n0807M2335k35943j4688L76126j55519j05527
$$ 1864147 1790718 1742259 1707008 1656201 1698536 1462593 1447905 1824031 1668512 1562985
10498A562985j87771k31634r2535j0848j95269m8311K06290K4753R9135J27688
$$ 1562985 1375214 1143580 1051045 1040197 844928 796617 1002907 1027660 1126795 1254483
10488A254483O6399L2485j29406j40060k69221L4558j04924j62270K34260J13505
$$ 1254483 1320882 1353367 1223961 1083901 814680 849238 744314 582044 816304 929809
10478I29809J07509k5088K4489j3726M8913M3165n9782j04710m5056J04506J11875
$$ 929809 1037318 1012230 1036719 1022993 1071906 1115071 1055289 950579 905523 1010029 1121904
10467A121904R395K3693J50179K3493l4114J6865J26523m4872j99859k38871r7640
$$ 1121904 1131299 1154992 1305171 1328664 1294550 1311415 1437938 1393066 1193207 954336 856696
10456H56696J08861P4157K32460j20893j08009J30837o8803k2915n5405L6203
$$ 856696 965557 1039714 1272174 1151281 1043272 1174109 1105306 1082391 1026986 1063189
10446A063189Q7553J20255p8728k18333j24144N883K2662r5385K80788o3080J9244
$$ 1063189 1150742 1270997 1192269 973936 849792 855675 878337 782952 1063740 1000660 1019904
10435A019904j90192P874R2539j9977J07487o9812J1161j20563j51760k04659
$$ 1019904 829712 837586 930125 910148 1017635 947823 958984 838421 686661 482002
10425D82002Q8797P4227q9778K1341j12742J05956J29229M134p5939R5871N0342
$$ 482002 570799 645026 555248 576589 463847 569803 699032 703166 627227 723098 773440
10414G73440q8018J31118l01689j50239K3042j33735M8894j3407L6339j6778Q5471
$$ 773440 685422 816540 514851 364612 387654 253919 302813 289406 325745 308967 394438
10403C94438K91986J56309O1382q0988j36846j38995O8684R4291N0676j33161
$$ 394438 686424 842733 904115 823127 686281 547286 615970 710261 760937 627776
10393F27776M5058o8314j34853k2908k4459j51682J34485J73266J22277K7994
$$ 627776 672834 604520 469667 446759 422300 270618 405103 578369 700646 728640
10383G28640K52998N1347o7697j66614O2744O8181j63858J02042n2458j36478
$$ 728640 981638 1032985 965288 798674 861418 929599 765741 867783 815325 678847
10373F78847o2290J08236j19904p8549N3231J37704Q1868J896j09051q2792J96452
$$ 678847 616557 724793 604889 526340 579571 717275 799143 801039 691988 609196 805648
10362H05648q3524j81674j55484P7208j8310j63932k07917M1655R3389j91609
$$ 805648 722124 540450 384966 462174 443864 279932 72015 113670 207059 15450
10352A5450J70602K23500j10808n6343K91872K20581Q3762k50558J05509J14103
$$ 15450 186052 409552 298744 242401 534273 754854 838616 588058 693567 807670
10342H07670j06545l47427k74175J01444p1613m4022l2390J27868Q1963J1795
$$ 807670 701125 353698 79523 180967 109354 65332 32942 160810 242773 254568
10332B54568j1624M0694M1648r840k1513k2228J04029o3033j64220K506r7054
$$ 254568 242944 283638 325286 315446 293933 271705 375734 312701 148481 150987 53933
10321E3933Q6581j3165k1044q3763J77089K1654J12851R0873J47687k4565j76209
$$ 53933 140514 127349 106305 22542 199631 221285 334136 425009 572696 548131 371922
10310C71922l05630R0529J87215r9126k363J8996J25153J39002j5919N0262j67145
$$ 371922 66292 156821 344036 244910 242547 261543 386696 525698 509779 560041 392896
10299C92896j41525o4746j31991J51783K20918j15270k37197o4058P7035L8789
$$ 392896 251371 186625 54634 206417 427335 312065 74868 10810 87845 126634
10289A26634J34458Q9887j22997k77036L3917J50148l5440j23353q1812M7592
$$ 126634 261092 350979 227982 -49054 -15137 135011 99571 -23782 -105594 -58002
10279e8002j0596N79k5741j96044N325K23524K61195L9859M7133k8208r9672J06658
$$ -58002 -68598 -68019 -93760 -289804 -284479 -60955 200240 240099 287232 259024 159352 266010
10267B66010J06632Q2217r1046m6687J6215J77690L9808m56629P476R2469q268
$$ 266010 372642 454859 363813 317126 333341 511031 550839 94210 101686 194155 185887
10256A85887j60327j55372l5667K4456M7688R5648k04027J4062J45535R8703j2804
$$ 185887 25560 -129812 -165479 -141023 -93335 2313 -201714 -187652 -42117 56586 43782
10245D3782q548J8942L5852j75225j66586M00346J81536j68891J30613P1426l5582
$$ 43782 35234 54176 90028 -85197 -251783 148563 330099 161208 291821 363247 327665
10234C27665N5261L4840J3757j74165J41638J27439l15601j10480l9106J9436
$$ 327665 382926 417766 431523 257358 398996 526435 210834 100354 61248 80684
10224H0684J85178K16075j410j74791l56033j07099M6227r703n51J13758M3270
$$ 80684 265862 481937 480527 305736 -50297 -157396 -111169 -120872 -121423 -7665 35605
10213C5605Q4631j56414k73165j11937L8614K65965J76580M4798j28910l3285
$$ 35605 120236 -36178 -309343 -421280 -382666 -116701 59879 104677 -24233 -57518
10203e7518L71498r251j26110Q871M0923j541O0308m1869Q4224J52140j33811
$$ -57518 313980 304729 178619 187490 228413 226872 287180 245311 329535 481675 347864
10192C47864P8039k7885m61451O355L42955K10365q1323j51095Q7168L17268l4926
$$ 347864 425903 398018 -63433 -57078 285877 496242 414919 263824 350992 668260 633334
10181F33334K4497Q0317O4750Q7317m0157o8663J5462q0932J55116O3873L5767
$$ 633334 657831 738148 802898 890215 850058 781395 796857 715925 871041 934914 970681
10170I70681J98338K39332M11388M27785K57918n52r7913k63724m00907j52319
$$ 970681 1169019 1408351 1819739 2247524 2505442 2504890 2406977 2143253 1742346 1590027
10160A590027J96621P6557J63151K65870K53267L07804M18099O3846j63271k82285
$$ 1590027 1786648 1863205 2026356 2292226 2545493 2853297 3271396 3335242 3171971 2889686
10150B889686l81267m08669n2822M5775J54483K82307J41721k9857r4551j02566
$$ 2889686 2508419 2099750 2046928 2092703 2247186 2529493 2671214 2641357 2546806 2444240
10140B444240k83742j55182j63576k88358j45470j85400j67551J71887K89788
$$ 2444240 2160498 2005316 1841740 1553382 1407912 1222512 1054961 1226848 1516636
10131A516636k45367j52887N7007j65836k90428k86055N4717j43678M8128J73694
$$ 1516636 1271269 1118382 1175389 1009553 719125 433070 487787 344109 392237 565931
10121E65931k57630J04250K8498j92805J2562j06597J2232j27805L3604j18794
$$ 565931 308301 412551 441049 248244 260806 154209 166441 38636 72240 -46554
10111d6554o8628O3483J86810j5631j52241k2086J23336n1675j83068M6104k4936
$$ -46554 -115182 -51699 135111 119480 -32761 -54847 68489 16814 -166254 -120150 -145086
10100a45086o6083J90958j6612j81157l5915J41442j29913k66972J64409L72640
$$ -145086 -211169 -20211 -36823 -217980 -253895 -112453 -242366 -509338 -344929 27711
10090B7711P9918M1408k0247O4116l7601k39535K8664J82129J05667j0957N6965
$$ 27711 107629 149037 128790 192906 155305 -84230 -55566 126563 232230 221273 278238
10079B78238q6810N860J11100j04007j63764l6893p9172m1479j5470j57914J47973
$$ 278238 191428 197288 308388 204381 40617 3724 -75448 -116927 -132397 -290311 -142338
10068a42338N6435L789m6973K33981L8570K9101P4540k31671k03777L8566m4855
$$ -142338 -85903 -82114 -129087 104894 143464 172565 247105 15434 -188343 -149777 -194632
10057a94632J15338K65855Q8739j94558j71632O3898J84323K2138p325j26841
$$ -194632 -79294 186561 275300 80742 -90890 -26992 157331 179469 172144 45303
10047D5303o7077r1097J87K7906j07577j07661J08565K20089m2446j0547k72073
$$ 45303 -21774 -112871 -112684 -84778 -192355 -300016 -191451 28638 -13808 -24355 -296428
10036b96428j63231J84841N3789k3056O9620M2461J26651k2198k2668J86567n8093
$$ -296428 -459659 -274818 -221029 -244085 -174465 -132004 -5353 -27551 -50219 136348 78255
10025G8255j45233J23474M1408J8105k08901q2341J71050K0954o6355l7520N9754
$$ 78255 -66978 56496 97904 116009 -92892 -175233 -4183 16771 -49584 -87104 -27350
10014b7350m8731j90635o8019P7456J4061l1314J06064K32357l5607l3097Q2279
$$ -27350 -76081 -266716 -334735 -257279 -243218 -274532 -168468 63889 28282 -4815 77464
10003G7464j43913L6576O3890m1274J20106O6353j20348n8514j21316K2347j91010
$$ 77464 -66449 -29873 34017 -7257 112849 179202 58854 340 -120976 -98629 -289639
9992b89639J4831J05015J23495j03793p8720j12634K70690K00103k02540r8427
$$ -289639 -274808 -169793 -46298 -150091 -228811 -341445 -70755 129348 -73192 -171619
9982a71619R617K0533q4778Q140J44023J2242q2853J36390K77853j4171j98583
$$ -171619 -162002 -141469 -226247 -218107 -74084 -61842 -144695 -8305 269548 255377 56794
9971E6794O747j29310N6038k5818k17018O699J77408L16115K6525l64505j43879
$$ 56794 63541 -65769 -9731 -35549 -252567 -245868 -68460 247655 274180 -90325 -234204
9960b34204O4807J71745j16678l7426m566K40790R2004J52650j71770j06023J25573
$$ -234204 -169397 2348 -114330 -151756 -156322 84468 176472 329122 157352 51329 176902
9949A76902n6004k9204L1438l8333K93360K74676K0676k24550j40005O996j43565
$$ 176902 120898 91694 123132 84799 378159 652835 673511 448961 308956 315952 172387
9938A72387r9237O0165J41069l3044J77503L690L3410K2156j93042j21540j20010
$$ 172387 73150 133315 274384 241340 418843 422533 455943 478099 285057 163517 43507
9927D3507J3217J03605J16427n3943l31521L2336O543j6399n0448N1216N5379
$$ 43507 56724 160329 276756 222813 -108708 -76372 -69829 -86228 -136676 -85460 -30081
9916c0081L2711n1753j08471J55768R5011j01551j66057o2508m1827J48590j6336
$$ -30081 2630 -49123 -157594 -1826 93185 -8366 -174423 -236931 -278758 -130168 -146504
9905a46504J11663M3726m9543k05030r5404j19027J50060Q0311J16542k72493
$$ -146504 -34841 8885 -40658 -245688 -341092 -460119 -310059 -229748 -113206 -385699
9895c85699j28062O2550Q8200K24231K27568p2084j24310L25736L39697J03345
$$ -385699 -513761 -451211 -363011 -138780 88788 16704 -107606 218130 557827 661172
9885F61172l36877k10847M0107j12089k9325R8966J68365n3077r2259j49949k5640
$$ 661172 324295 113448 153555 41466 12141 111107 279472 226395 134136 -15813 -41453
9874d1453J9752m086J2678o9116p7610o2794J04271J05724n8629O2666J46752
$$ -41453 -21701 -25787 -13109 -82225 -159835 -222629 -118358 -12634 -71263 -8597 138155
9863A38155r6482M2148K74159j55984k91031l5477l2497J98197J19597P1280j41407
$$ 138155 41673 83821 357980 201996 -89035 -124512 -157009 41188 160785 232065 90658
9852I0658M942J19540r9961l6947L43437j51148j78325J00969J39972m5639N6244
$$ 90658 95600 215140 115179 78232 421669 270521 92196 193165 333137 287498 343742
9841C43742k38078p4662j76346K12625K70692Q9042k03723J39406J19706l27884
$$ 343742 105664 31002 -145344 67281 337973 427015 223292 362698 482404 154520
9831A54520l08662p5531j47786p6717J67689J37822L8714o9684l8277J45098J84796
$$ 154520 -154142 -229673 -377459 -454176 -286487 -148665 -109951 -179635 -217912 -72814 111982
9820A11982k88644m1630L34250K17877J19050j70198M2704j89942n2296j56491
$$ 111982 -176662 -218292 115958 333835 452885 282687 325391 135449 83153 -73338
9810g3338J771J33949M535o2411Q1287q5705q0532R7013R3194l472R7306k2616
$$ -73338 -71567 62382 66917 4506 85793 88 -80444 16569 109763 106291 203597 180981
9798A80981R3353K59851k42793j62145k4133N1189J9763k3607j18851l9555q3645
$$ 180981 274334 534185 291392 129247 105114 156303 176066 152459 33608 -5947 -89592
9787h9592o0057p8703J0412J50721K2833N9429M9731K3830p9146J9753j80791
$$ -89592 -149649 -228352 -217940 -67219 -44386 15043 64774 88604 9458 29211 -151580
9776a51580k01314N705P6235Q551j08634J4328J79262L73838k81638k93001J3617
$$ -151580 -352894 -347189 -270954 -262403 -371037 -356709 -177447 196391 -85247 -378248 -364631
9765c64631J27616j69234J12080O8024l4725K2341J15909o5846Q9956R6974q0780
$$ -364631 -237015 -406249 -294169 -226145 -260870 -238529 -122620 -188466 -98510 -1536 -82316
9754h2316O6636R5932k3K4305m6048l9976n4356k926N6889P98m447L4619J91215
$$ -82316 -15680 80252 80229 104534 58486 18510 -35846 -38772 18117 18915 14468 49087 240302
9741B40302j71491k06092k64106j05363J38463J48917j7493J15797N8043q0209
$$ 240302 68811 -137281 -401387 -506750 -368287 -219370 -236863 -121066 -63023 -143232
9731a43232o5671L783p928o7607j349l1201J66883J63336J22460k09320m33290
$$ -143232 -208903 -205120 -213048 -280655 -282004 -313205 -146322 17014 139474 -69846 -503136
9720e03136K0151L66396L75726Q0697J51971l664j00135p5984k0314l4079J69225
$$ -503136 -482985 -116589 259137 339834 491805 488141 388006 312022 291708 257629 426854
9709D26854J5006j37492Q9008P6576j67106O1423j45035k87722l13263J32211
$$ 426854 441860 304368 393376 469952 302846 364269 219234 -68488 -381751 -249540
9699b49540J80609Q0855p9175r7162j74536j49135N7371P662J89715M9005J68866
$$ -249540 -68931 11924 -67251 -164413 -338949 -488084 -430713 -423051 -233336 -184331 -15465
9688a5465N105J23963J168j69479n2501N2592p4116k0245K12672M4590K22841
$$ -15465 -10360 113603 114771 -54708 -107209 -54617 -128733 -148978 63694 108284 331125
9677C31125J60444j38240k67020m67425K9725L34800J0551J32283j28621j61245
$$ 331125 491569 353329 86309 -381116 -351391 -16591 -6040 126243 -2378 -163623
9667a63623k20J29645M6522k11077P1839O0992l2375J33198J38600j4152K0006
$$ -163623 -163843 -34198 12324 -198753 -126914 -65922 -98297 34901 173501 159349 179355
9656A79355O1397o6900k34671p5424j60465R8939L03865K02302O7664l9127l2113
$$ 179355 240752 173852 -60819 -136243 -296708 -197769 106096 308398 376062 336935 304822
9645C04822L501k8068m7766j80903j26824n8777r9152Q9600j6294O4861K29778
$$ 304822 308323 280255 232489 51586 -75238 -134015 -233167 -143567 -159861 -95000 134778
9634A34778M7999r0215j08245J66234J78673O2140J77232J04844k35498l40254
$$ 134778 182777 92562 -15683 150551 329224 391364 568596 673440 437942 97688
9624I7688l24418j05479j1998P4658K51920J6365K77200J82509p0699l21234l96526
$$ 97688 -226730 -332209 -344207 -269549 -17629 -1264 275936 458445 387746 66512 -330014
9613c30014r1551K14910L5866K4885l4406J13904J94162K5176n5998j16340p577
$$ -330014 -421565 -206655 -170789 -145904 -180310 -66406 127756 152932 96934 -19406 -26983
9602b6983O6365l3060l6710q677K0623J99988k806q3201n3584j03784j69300l9085
$$ -26983 39382 6322 -30388 -39065 -18442 181546 178740 95539 41955 -61829 -231129 -270214
9590b70214k3887L3212K84639L54269o0593k65012j11959O4358Q1322j12346K6577
$$ -270214 -294101 -260889 23750 378019 317426 52414 -59545 4813 86135 -26211 366
9579C66r4117k5477K1357P4870l0398J14591J79566Q4968j71533j78929l95212
$$ 366 -93751 -119228 -97871 -23001 -53399 61192 240758 325726 154193 -24736 -419948
9568d19948O8451J24019k5426K44816O9075j211J23992j90583q1034Q5489j2192
$$ -419948 -351497 -227478 -252904 -8088 60987 59776 183768 -6815 -87849 -2360 -14552
9557a4552n3646j25974n7278K19436Q4994p7384K3278j05040j321k43018M4122
$$ -14552 -68198 -194172 -251450 -32014 52980 -24404 -1126 -106166 -107487 -350505 -306383
9546c06383K68443J85035J60828l70990o1249Q4445K08970J15628j21235n3933
$$ -306383 -37940 147095 307923 -63067 -124316 -39871 169099 284727 163492 109559
9536A09559j70752j3592J85709M3493J9451j14918k16540J20928j34964K959K58177
$$ 109559 -61193 -74785 110924 154417 173868 58950 -157590 -36662 -171626 -168667 89510
9525H9510q4137l43774O808Q6097K79R6961Q5882J08405J91896N6682l6967r7473
$$ 89510 5373 -338401 -331593 -245496 -245217 -148256 -62374 46031 237927 294609 257642 160169
9513A60169o2446j41236O1171j43918O0406o1817K09005Q9558k7285k55032l22488
$$ 160169 97723 -43513 17658 -126260 -65854 -127671 81334 170892 143607 -111425 -433913
9502d33913K82703J21300o0470J59720p6077M8262J09401j49796P9354Q0752K4457
$$ -433913 -151210 -29910 -90380 69340 -6737 41525 150926 1130 80484 161236 185693
9491A85693M6150p7620k83580L6716N7526j27564l5704O4745L5218r9826R9371
$$ 185693 231843 154223 -129357 -92641 -35115 -162679 -198383 -133638 -98420 -198246 -98875
9480i8875Q4023O953j30573L2065J85805j02394j88769n8263k7205r6469k00462
$$ -98875 -14852 -7899 -138472 -106407 79398 -22996 -211765 -270028 -297233 -393702 -594164
9469e94164o6998J82408K5864m7337K51571L5340M0069R7866J07195J14469J84816
$$ -594164 -661162 -478754 -452890 -500227 -248656 -213316 -173247 -75381 31814 146283 331099
9458C31099k8081j71141k78122j67103J48458K7376p1970k0558M7148O6381K64804
$$ 331099 303018 131877 -146245 -313348 -164890 -137514 -209484 -230042 -182894 -116513 148291
9447A48291J04371q2q6027k73525K9037Q7640k57065k76122j9989j47110L85821
$$ 148291 252662 252580 166553 -106972 -77935 9705 -247360 -523482 -543471 -690581 -304760
9436c04760L66330J51290j74480q0501j4829J45457K6865J00343J40716l1203
$$ -304760 61570 212860 38380 -42121 -56950 88507 115372 215715 356431 325228
9426C25228l42139j73557N4814P4896O8511k28802M5789R0557o6616r1249K05116
$$ 325228 -16911 -190468 -135654 -60758 7753 -221049 -175260 -84703 -151319 -242568 -37452
9415c7452J81679l5913j01573J1534j35852K6016l2951R5648j69124j34717k0149
$$ -37452 144227 108314 6741 18275 -117577 -91561 -124512 -28864 -197988 -332705 -352854
9404c52854o9280J60806L8846J61335J4812K4292M7822k66604k6497O9375j27975
$$ -352854 -422134 -261328 -222482 -61147 -46335 -22043 25779 -240825 -267322 -197947 -325922
9393c25922l5778K53674Q0459O7182q562j89394K2174J22944l6053j9170l142
$$ -325922 -361700 -108026 -27567 39615 31053 -158341 -136167 -13223 -49276 -68446 -71588
9382g1588J43350j67777o9345L28114J10695j68421k9989r3986M0711j6845J98234
$$ -71588 71762 -96015 -165360 162754 273449 105028 75039 -18947 21764 4919 203153
9371B03153l5149j54503j49983N2531j9933J81370j29563k57144O2539n4584k2354
$$ 203153 168004 13501 -136482 -83951 -103884 77486 -52077 -309221 -246682 -301266 -323620
9360c23620J7499J82626J31268L714K9148j8053K2076L12008k5704j84528j61980
$$ -323620 -306121 -123495 7773 11487 40635 22582 44658 356666 330962 146434 -15546
9349a5546o1655P484j9392l7159R6561R0457j5421j27775j1200j94936K7371K05686
$$ -15546 -77201 -69717 -89109 -126268 -29707 60750 45329 -82446 -93646 -288582 -261211 -55525
9337e5525K7227r6910J56401L97311Q4546k81573k94199R0691R9965j49557R2336
$$ -55525 -28298 -125208 31193 428504 513050 231477 -62722 27969 127934 -21623 70713
9326G0713l5879k38069j69597m8699K74715L34364K13756J1847k39627l7176Q2210
$$ 70713 34834 -203235 -372832 -421531 -146816 187548 401304 413151 173524 136348 218558
9315B18558P2860K38661m9049k74736j29987p0753J52843j23360K5855r9661r6911
$$ 218558 291418 530079 481030 206294 76307 5554 158397 35037 60892 -38769 -135680
9304a35680O2634J09559J43687j02261o1405J17436j45389j56157O3887J13847
$$ -135680 -73046 36513 180200 77939 16534 133970 -11419 -167576 -103689 10158
9294A0158J73656J34261k54960k83482j29140K85450K67425k2777j42306k18639
$$ 10158 183814 318075 63115 -220367 -349507 -64057 203368 180591 38285 -180354
9284a80354j61934Q5246J11044k2338j67402n7330Q5346J53560j07652N8496o419
$$ -180354 -342288 -257042 -145998 -168336 -335738 -393068 -307722 -154162 -261814 -203318 -209737
9273b09737L2993O630K55502J22946r7575k48071o5592J2090k8243O1469L0526
$$ -209737 -176744 -170114 85388 208334 110759 -137312 -202904 -190814 -219057 -157588 -127062
9262a27062J05921K91449K06424m7853k19545j13992o4919K4573q1638K92873
$$ -127062 -21141 270308 476732 428879 209334 95342 30423 54996 -26642 266231
9252B66231K01814P2636j02077j35163j4295r9822k65038J039J34871P99Q9509
$$ 266231 468045 540681 438604 303441 289146 189324 -75714 -74675 60196 60995 150504
9241A50504j22984O787k2742l9509Q2130k1763j59637k23650j26191J43957J73731
$$ 150504 27520 34307 11565 -27944 54186 32423 -127214 -350864 -477055 -333098 -159367
9230a59367r3865k15544K9214Q6855N1068J42444j91475q8076N0650j45218j17774
$$ -159367 -253232 -468776 -439562 -352707 -301639 -159195 -350670 -438746 -388096 -533314 -651088
9219f51088k4275J44050O3710M4607J35146j2549j10167j16002J63134R5424j8773
$$ -651088 -675363 -531313 -467603 -422996 -287850 -300399 -410566 -526568 -363434 -268010 -286783
9208b86783k2259K53845K90147j4872l29380j25612P3874O7081N3600Q3740j01435
$$ -286783 -309042 -55197 234950 220078 -109302 -234914 -161040 -93959 -40359 43381 -58054
9197e8054k2836l7932M1770M10266J18542l40693o9567j07364K06491J41239L8316
$$ -58054 -80890 -118822 -77052 333214 451756 111063 41496 -65868 140623 281862 320178
9186C20178O7606l0771j84920j66983q8472l5353J49661j26166l5083Q9594K10998
$$ 320178 387784 357013 172093 5110 -83362 -118715 30946 -95220 -130303 -40709 170289
9175A70289N9239J3988k31951O7305J16653N5066j19811j00130k1526J63803N9097
$$ 170289 229528 243516 11565 78870 195523 250589 130778 30648 9122 172925 232022
9164B32022r239K7736n1340N3800j60411l37464J31589K0666R0822R3338R0192
$$ 232022 222783 250519 199179 252979 92568 -244896 -113307 -92641 -1819 91519 181711
9153A81711j18723j69289j12065k58379M1939K16538Q4730j81850J9921K85770
$$ 181711 62988 -106301 -218366 -476745 -434806 -218268 -133538 -315388 -295467 -9697
9143i697J44193j12038J21880K2610Q968K3945r5331M679K57712J57819j97633
$$ -9697 134496 22458 144338 166948 175916 199861 104530 109209 366921 524740 327107
9132C27107N0089j70882k13188r1165J48432K1679l5915l87560Q2734L94643J0591
$$ 327107 377196 206314 -6874 -98039 50393 72072 36157 -351403 -268669 125974 136565
9121A36565r1206J98379K14392m0887j54159o8728j7155j3857k77461j85579J14058
$$ 136565 45359 243738 458130 417243 263084 194356 177201 163344 -114117 -299696 -185638
9110a85638j19564K2976R2020R6049q2083j27211P258M4372K19313M4289l6201
$$ -185638 -305202 -282226 -190206 -94157 -176240 -303451 -296193 -251821 -32508 11781 -24420
9099b4420J20570K7089m5108O1336p537k1968m1738k9536j13955l05535o1198
$$ -24420 96150 123239 78131 139467 131930 109962 68224 38688 -75267 -380802 -442000
9088d42000M00030P5221m8543J50487K05692Q1298q1402m5359Q8539J10273l22035
$$ -442000 -41970 33251 -15292 135195 340887 422185 340783 295424 383963 494236 172201
9077A72201k49012P6406J10548j57817L6115J16273j19117L2615M3347k43946
$$ 172201 -76811 -405 110143 -47674 -11559 104714 -14403 18212 61559 -182387
9067a82387J2934J68906q8239K53181M7505j49975P4144J73498o3980l54316j42294
$$ -182387 -169453 -547 -88786 164395 211900 61925 136069 309567 245587 -108729 -251023
9056b51023K24619j18133j91093j88829l9770K02223N3965K41355n323o2217l47234
$$ -251023 -26404 -144537 -335630 -524459 -564229 -362006 -308041 -66686 -72009 -134226 -481460
9045d81460R8945L65466J94127r9153k41809j13763R040J29163j37339Q058Q4057
$$ -481460 -382515 -17049 177078 77925 -163884 -277647 -268607 -139444 -276783 -268725 -184668
9034a84668L348k1599j28577k25936Q0418L1887M20733L05648N6206j73866m7992
$$ -184668 -181320 -202919 -331496 -557432 -477014 -445127 -24394 281254 337460 163594 115602
9023A15602K92157O9232P6240q9989k40128r6906K10031p2271j27160j102n2133
$$ 115602 407759 476991 553231 463242 223114 126208 336239 263968 136808 135706 83573
9012H3573L2183k5640j83272o3851q8353j19241M4256N995k5868o360j1039J87458
$$ 83573 115756 90116 -93156 -157007 -245360 -364601 -320345 -314350 -340218 -346578 -357617 -170159
9000a70159r8346J80548J24564j63479m908j44629K04956j7218J65532J03145
$$ -170159 -268505 -87957 36607 -126872 -131780 -276409 -71453 -88671 76861 180006
8990A80006k18423J35057j81076k4372Q2170J44704p0461K27155R6773J23183
$$ 180006 -38417 96640 -84436 -108808 -26638 118066 47605 274760 371533 494716
8980D94716j4370j42324j73626L8923j63988o9319j71196k5281j14635q2447J05835
$$ 494716 480346 338022 164396 203319 39331 -29988 -201184 -226465 -341100 -423547 -317712
8969c17712j48197j45345L29703K66665K3N9442O3946J41943j29494o5010J13329
$$ -317712 -465909 -611254 -281551 -14886 -14863 44579 108525 250468 120974 55964 169293
8958A69293M1330m7997r0941j34660J7612k2111o8901k11374P834P3192r1439
$$ 169293 210623 162626 71685 -62975 -45363 -67474 -136375 -347749 -339915 -266723 -358162
8947c58162K22486l7811N0460J72379J2748j68263n7195J03089j42149l0925L9173
$$ -358162 -135676 -173487 -123027 49352 62100 -106163 -163358 -60269 -202418 -233343 -194170
8936a94170J41856O7511P7455j95629j37186M5642J81833j1247j7248j05386l4762
$$ -194170 -52314 15197 92652 -102977 -240163 -194521 -12688 -23935 -41183 -146569 -181331
8925a81331J68270Q5855q1574j92192k5582l2081j5542N5833J06069m0028o6273
$$ -181331 -13061 72794 -8780 -200972 -226554 -258635 -274177 -218344 -112275 -152303 -218576
8914b18576k26281m3789K17308R930R6627P2313j01060q1488j20435Q8404r8802
$$ -218576 -444857 -488646 -271338 -261408 -164781 -92468 -193528 -275016 -395451 -307047 -405849
8903d05849M2599Q3327J37031K4374q3379J08596Q1693P4104P59O211l5086Q5039
$$ -405849 -363250 -279923 -142892 -118518 -201897 -93301 -11608 62496 63255 69466 34380 119419
8891A19419r402n4771M6609j00845Q6896M0899k53637P7183J62017J22258P0633
$$ 119419 110017 55246 101855 1010 87906 128805 -124832 -47649 114368 236626 307259
8880C07259J55195L2241J24681j73833l72593j73076J63038P0255P3841k00635
$$ 307259 462454 494695 619376 445543 72950 -100126 62912 133167 207008 6373
8870F373R9708L5130j90267n9934J60420R2883l27066l4633j42027J1032j276
$$ 6373 106081 141211 -49056 -108990 51430 144313 -182753 -217386 -359413 -348381 -349657
8859c49657J00333K8675J29911M8651Q0951P6153j03537j09813k6956p3460p4531
$$ -349657 -249324 -220649 -90738 -42087 38864 115017 11480 -98333 -125289 -198749 -273280
8848b73280j8615K83986J86216o2849k5522o3363j28177O9552j6560j2944j11512
$$ -273280 -291895 -7909 178307 115458 89936 26573 -101604 -32052 -48612 -61556 -173068
8837a73068o3081Q5724L81072n4335k51371p5424J17921L0736L4430m6680j03186
$$ -173068 -236149 -150425 230647 176312 -75059 -150483 -32562 -1826 32604 -14076 -117262
8826a17262J09998p9031j3172k2838j61295j79189J45170L28386J56093m1860
$$ -117262 -7264 -86295 -99467 -122305 -283600 -462789 -317619 10767 166860 125000
8816A25000l29430k87909J03999Q7804J13596N9478J27932K04356p1878l473j27795
$$ 125000 -204430 -492339 -388340 -300536 -186940 -127462 470 204826 132948 129475 1680
8805A680j33209J33038J49170q0278Q7725k22750J7151P2191k42954o7723L89754
$$ 1680 -131529 1509 150679 70401 158126 -64624 -47473 24718 -218236 -285959 103795
8794A03795K15441j23388L6846j3546j21139k9514r1824Q158N411n8845j30065
$$ 103795 319236 195848 232694 219148 98009 68495 -23329 -15171 -9760 -68605 -198670
8783a98670o336R614K78443J99704p2197q5801n8843J6502Q5543j19967j48507
$$ -198670 -205006 -195392 83051 282755 210558 124757 65914 82416 167959 47992 -100515
8772a00515k3403n1948M9179j68384j42788j23930k6607K50324J96195L23239
$$ -100515 -123918 -175866 -126687 -295071 -437859 -561789 -588396 -338072 -141877 181362
8762A81362J49613l42593j46949J02991J18184J499N7237o9162Q5368O0445k40593
$$ 181362 330975 -11618 -158567 -55576 62608 64107 121344 52182 137550 197995 -42598
8751d2598n5424K17411j24011k21650K34206J37135o4621j45908J9591O1219k12865
$$ -42598 -98022 119389 -4622 -226272 7934 145069 80448 -65460 -45869 15350 -197515
8740a97515J90896K81052M2070o6058n3056k15786o5290j27739j671P7671L210
$$ -197515 -6619 274433 316503 250445 197389 -18397 -83687 -211426 -213097 -135426 -132216
8729a32216J13967J9788J3988N067J1881o1115l04369J44974K63243J71115o8920
$$ -132216 -18249 1539 15527 20594 32475 -28640 -333009 -188035 75208 246323 177403
8718A77403K956j23668J08386k8676J2899J36809r0180J07505p9842q8938K89167
$$ 177403 180359 56691 165077 136401 149300 286109 195929 303434 223592 134654 423821
8707D23821J41770k67256k18867j90771J26662m0508J04309k7814k7508K4696
$$ 423821 565591 298335 79468 -111303 15359 -25149 79160 51346 23838 48534
8697D8534m8608M1402k5146j82049p5562K88949P2438m4881j69002m2129P8849
$$ 48534 -74 41328 16182 -165867 -241429 47520 119958 75077 -93925 -136054 -57205
8686e7205P9531J04649j63144q6528J37957j07329M7162L5490q2934P3100o084
$$ -57205 22326 126975 -36169 -122697 15260 -92069 -44907 -9417 -92351 -19251 -25335
8675b5335K4191J61191k33890J897k34844j04992n8111J46130K21262K52501R1818
$$ -25335 -1144 160047 -73843 -71946 -306790 -411782 -469893 -323763 -102501 150000 241818
8664B41818Q2942j23312l10295m9917p5872L8707l4367K8585Q0374q4660m1331
$$ 241818 324760 201448 -108847 -158764 -234636 -195929 -230296 -201711 -121337 -205997 -247328
8653b47328M2257K25666O3568j16957j59586j37376J48153J10289J69195R4371
$$ -247328 -205071 20595 84163 -32794 -192380 -329756 -181603 -71314 97881 192252
8643A92252l32907j76455J91927n357n25K10147J8669j50931J46067J71507N7025
$$ 192252 -140655 -317110 -125183 -130540 -131065 79082 97751 -53180 92887 264394 321419
8632C21419r2995j15215o503j8422j15439M6576j11156j588o5962p1116J23508
$$ 321419 228424 113209 106706 88284 -27155 19421 -91735 -93323 -159285 -230401 -106893
8621a06893J57284j70695j06337R6226K02982L8140L2323k3265q7944J44865J77673
$$ -106893 50391 -120304 -226641 -130415 72567 110707 143030 119765 31821 176686 354359
8610C54359l5487k39879l7678R201M4091j80857j70977R9683k4326L3392K35072
$$ 354359 318872 78993 41315 50516 94607 -86250 -257227 -157544 -181870 -148478 86594
8599H6594m9167J16454L0352p9620m5045j00838j7943o072J01996J71233J77268
$$ 86594 37427 153881 184233 104613 59568 -41270 -59213 -65285 36711 207944 385212
8588C85212j37630j24088k54299j52733R7445O7459L5343N3353j35979j1000k1040
$$ 385212 247582 123494 -130805 -283538 -186093 -118634 -83291 -29938 -165917 -176917 -197957
8577a97957J63254J96136k2534p8487R3216J751K9484J09880j66155k16367J20832
$$ -197957 -34703 161433 138899 60412 153628 155379 184863 294743 128588 -87779 33053
8566C3053o2342K13011q1238M9727L8914j37636r5873k23813Q0664O6404J83452
$$ 33053 -29289 183722 102484 152211 191125 53489 -42384 -266197 -185533 -119129 64323
8555F4323J04417M660j34733O9656l1392J28821j66688j06885K2495j14053k36286
$$ 64323 168740 173400 38667 108323 76931 205752 39064 -67821 -45326 -159379 -395665
8544c95665L756K49831j11412l0312r1429N6675K19843J93701K26683l6999j80857
$$ -395665 -391909 -142078 -253490 -283802 -375231 -318556 -98713 94988 321671 284672 103815
8533A03815k16308J08842P2238o0530j75018R9408q3247k25714k6671k001j3537
$$ 103815 -112493 -3651 68587 8057 -166961 -67553 -150800 -376514 -403185 -405186 -418723
8522d18723K7377j3636k13770Q016L54730L2118j92835m9863J78639J44084J5667
$$ -418723 -391346 -404982 -618752 -610736 -256006 -223888 -416723 -466586 -287947 -143863 -128196
8511a28196Q4849L04421k03688j08691Q6717j0247J15483m6026j08721L8642R5426
$$ -128196 -43347 261074 57386 -51305 35412 25165 140648 94622 -14099 24543 119969
8500A19969J62307K27840k28496l6681j04466l51454j08956J85591K01289P9324
$$ 119969 282276 510116 281620 244939 140473 -210981 -319937 -134346 66943 146267
8490A46267J04809J46774J28254n1458r4964k26193l77605J10786m8278n6261
$$ 146267 251076 397850 526104 474646 379682 153489 -224116 -113330 -161608 -217869
8480b17869J77361J74250l2657l90052o1764q8509J32816L20791K2517j4979p8987
$$ -217869 -40508 133742 101085 -288967 -350731 -439240 -306424 14367 36884 21905 -57082
8469e7082j28405K02897J820k3657J74588r1589p9092K29039j3652j91220o8744
$$ -57082 -185487 17410 19230 -4427 170161 78572 -520 228519 214867 23647 -45097
8458d5097J03026m8200j53954J02906J30823R4079q09k50754m2497M413Q6074
$$ -45097 57929 9729 -144225 -41319 89504 183583 182774 -67980 -110477 -106064 -19990
8447a9990J9005k20819Q9905J35187J07438K02524J13265q9788j22672j00097
$$ -19990 -985 -221804 -131899 3288 110726 313250 426515 336727 214055 113958
8437A13958j3629Q8842M9144r3139o650l8918O0221j62341L225l3876N6095k24812
$$ 113958 100329 189171 238315 145176 138526 99608 159829 -2512 713 -33163 22932 -201880
8425b01880r3624n4500K27543K44701K45642p427j79581l08773k079J81619r0300
$$ -201880 -295504 -350004 -122461 122240 367882 360455 180874 -127899 -129978 51641 -38659
8414c8659k11249J97849L10003L3651Q4035R5111k15928k24706J16628j66941
$$ -38659 -249908 -52059 257944 291595 375630 470741 254813 30107 146735 -20206
8404b0206l70424q1739J29074K59442J9088J16743k1539p7907J83077J139p9883
$$ -20206 -390630 -472369 -343295 -83853 -64765 51978 30439 -47468 135609 136748 56865
8393E6865k9057J28259P6130M8873p996k37171j73105J2936K12753K03816J18393
$$ 56865 27808 156067 232197 281070 273074 35903 -137202 -124266 88487 292303 410696
8382D10696j488N7457j30150k18348o4979R7764l1650k36102L81J95583K56042
$$ 410696 409208 466665 336515 118167 53188 150952 119302 -116800 -116419 79164 335206
8371C35206k14858p4865j05941J3266J37855j46674O3685L8974K018q530J83229
$$ 335206 120348 45483 -60458 -47192 90663 -56011 7674 46648 48666 40136 223365
8360B23365K31980j11280J5126J6992j7352k30552j67494q4639q5692J87419M5312
$$ 223365 455345 344065 359191 376183 358831 128279 -39215 -123854 -209546 -22127 23185
8349B3185k07980K45223J96930r5035P055k68818j0799K42270J70459j35434Q1197
$$ 23185 -184795 60428 257358 162323 169378 -99440 -110239 132031 302490 167056 248253
8338B48253L2920n6281n8855M0772K40421m3896j54437j7429m5512p6268M2617
$$ 248253 281173 224892 166037 206809 447230 403334 248897 231468 185956 109688 152305
8327A52305K9518l38861j48449K00417K13096Q7285M9661j43610m204N6811j19749
$$ 152305 181823 -157038 -305487 -105070 108026 195311 244972 101362 97158 153969 34220
8316C4220J09433K3276K08030j44500j42808l8930J32398N757k103j34858m5107
$$ 34220 143653 166929 374959 230459 87651 48721 181119 186876 184773 49915 4808
8305D808P7636M0600j14512k11760L5481J65711J47734r989k69083Q1079P1357
$$ 4808 82444 123044 8532 -203228 -167747 -2036 145698 135709 -133374 -52295 19062
8294A9062J04967n0567N0843j81967j29569K6749K70992L5188j77509L81086K37629
$$ 19062 124029 73462 124305 -57662 -187231 -160482 110510 145698 -31811 349275 586904
8283E86904L54147N32578J53622n59800m80982l75913l01540m5246J45047j11662
$$ 586904 941051 1473629 1627251 1067451 586469 210556 -90984 -136230 8817 -102845
8273a02845j77935r745n1761J15757J39702N5237R0830J43793m03243k58679O7536
$$ -102845 -280780 -290525 -342286 -226529 -86827 -31590 59240 203033 -200210 -458889 -391353
8262c91353J65118K4628m1806J46464l6494L7571k5001N8347k1467r482O5624
$$ -391353 -226235 -201607 -243413 -96949 -133443 -95872 -120873 -62526 -83993 -93475 -27851
8251b7851J21987o8006j73715J06880L06804M97106L08026J63741R0272l05998
$$ -27851 94136 26130 -147585 -40705 266099 763205 1071231 1234972 1325244 1019246
8241A019246p05020l04405j77657K1559N9758q5490l0766P3353M6918R9240L3775
$$ 1019246 314226 9821 -167836 -146277 -86519 -172009 -202775 -129422 -82504 16736 50511
8230E0511N6137k5637k65044K3316K7575P1370J62475J3271k80243o2342O4055
$$ 50511 106648 81011 -184033 -160717 -133142 -61772 100703 113974 -166269 -228611 -164556
8219a64556J32496K19649j32990j6409j34215J31541q8208o5859J45963K00823
$$ -164556 -32060 187589 54599 38190 -96025 35516 -52692 -118551 27412 228235
8209B28235l25503l2289k66621l8840K39722m739J18971J68390j27443k64871
$$ 228235 -97268 -129557 -396178 -435018 -195296 -200035 -81064 87326 -40117 -304988
8199c04988j54241J10518J50288p6729Q2572O4002j6429k4594K7976J42002Q6664
$$ -304988 -459229 -348711 -198423 -275152 -192580 -128578 -145007 -169601 -141625 377 87041
8188H7041o1660M5043P304Q2203j17486J24753J33344o4265j26091R8214J92464
$$ 87041 25381 70424 77728 159931 42445 167198 300542 236277 110186 208400 400864
8177D00864q8387n6868Q4764K08002m6234j68808p8961r9528J2409M1066l80614
$$ 400864 312477 255609 340373 548375 502141 333333 254372 154844 167253 208319 -172295
8166a72295l2591r4200J43474r593P112J50379J27190j21716q7312N0219k02673
$$ -172295 -204886 -299086 -155612 -165205 -158093 -7714 119476 -2240 -89552 -39333 -242006
8155b42006P8871K18431L20349J98895j19752k26292m125N46j86321Q3323M786
$$ -242006 -163135 55296 375645 574540 454788 228496 224371 224917 38596 121919 126705
8144A26705J91581m397j80992j26985l19336q5806M18316J73912p3279k06749
$$ 126705 318286 313889 132897 5912 -313424 -399230 19086 192998 119719 -87030
8134h7030L13727J9974j25699q1454k49323j73993r1448K78903Q7347P0270n0969
$$ -87030 226697 246671 120972 39518 -209805 -383798 -475246 -196343 -108996 -38726 -89695
8123h9695p2182j0980J29003J7712p7700m7953j13105n7879N9885J9771J54147
$$ -89695 -161877 -172857 -43854 -26142 -103842 -151795 -264900 -322779 -262894 -243123 -88976
8112h8976K80778L9722l49733k65616J36556J80680R7028J73666n4166k23810
$$ -88976 191802 231524 -118209 -383825 -247269 -66589 30439 204105 149939 -73871
8102g3871j58108j26022j02424J00559K10705O5041O7584O8373J71246M721q0850
$$ -73871 -231979 -358001 -460425 -359866 -149161 -84120 -16536 51837 223083 227804 146954
8091A46954J93689K88956K21224l23382l12762p6129o4460j18900k7165m9890
$$ 146954 340643 629599 850823 527441 214679 138550 74090 -44810 -71975 -121865
8081a21865J61127N9247J68719P3814q269k33881n5816L5719J8220J03514o1822
$$ -121865 39262 98509 267228 341042 332773 98892 43076 78795 97015 200529 138707
8070A38707j25596j51093j22881J57962J10467j7052j15311r8854N9115M05979
$$ 138707 13111 -137982 -260863 -102901 7566 -9486 -124797 -223651 -164536 241443
8060B41443K02071j28978k37304k49570l4742J16993J62275K42837O0826m11788
$$ 241443 443514 314536 77232 -172338 -207080 -90087 72188 315025 375851 -35937
8050c5937j63136O3041K38201N8432N5800r2101m3411n9865l11714l9679n783
$$ -35937 -199073 -136032 102169 160601 216401 124300 80889 21024 -290690 -330369 -336152
8039c36152K89551J94416p6742j53914o2285J01105L3502k07972o2854M1715J35552
$$ -336152 -46601 147815 71073 -82841 -145126 -44021 -10519 -218491 -281345 -239630 -104078
8028a04078N3478J33571m0604K2111J38698j86696J20610P540M6569j14429J03992
$$ -104078 -50600 82971 42367 64478 203176 16480 137090 144630 191199 76770 180762
8017A80762Q3951m6899k78987k1624K29123Q5303r9112o6409R2266j20408k46065
$$ 180762 264713 217814 -61173 -82797 146326 231629 132517 66108 158374 37966 -208099
8006b08099o0672J16028K34951J33183J98819j40456j61491k48325k41407K1120
$$ -208099 -268771 -152743 82208 215391 414210 273754 112263 -136062 -377469 -356349
7996c56349L3427K2917K39007J37614l3920J79088J78323k19286n1189J29088
$$ -356349 -322922 -300005 -60998 76616 42696 221784 400107 180821 129632 258720
7986B58720p7219l51666O0931J29657J36496m7985j98853j71575R3339O207P7670
$$ 258720 181501 -170165 -109234 20423 156919 108934 -89919 -261494 -168155 -161948 -84278
7975h4278J20556j80249j06061L48593J86796j83009J84991J85210q4496j95907
$$ -84278 36278 -143971 -250032 98561 285357 102348 287339 472549 388053 192146
7965A92146j13546k25349p7371M25014Q616M0061j09633K4687q1268n5057O3221
$$ 192146 78600 -146749 -224120 200894 209510 249571 139938 164625 83357 28300 91521
7954I1521p9064J59894M0396K16910k73125J05509q145j41594j72449J4771m9271
$$ 91521 12457 172351 212747 429657 156532 262041 253896 112302 -60147 -45376 -94647
7943i4647J2400o880q6278k17817J05623J30813P6877R4343N671n482m668J00487
$$ -94647 -82247 -89127 -175405 -393222 -287599 -156786 -79909 14434 20105 14623 9955 110442
7931A10442j06355r14r5532j35025K349J07551K10501n0142N0875j09417m9918
$$ 110442 4087 3173 -92359 -227384 -225035 -117484 93017 42875 93750 -15667 -65585
7920f5585k0650J52873N2237j8483j10891j4410K41141J22337j44076m00201k04395
$$ -65585 -86235 66638 118875 100392 -10499 -24909 216232 338569 194493 -205708 -410103
7909d10103J08608J48408L5922P3521n3019L7110O2917J57153j11465K6231q7538
$$ -410103 -301495 -153087 -117165 -43644 -96663 -59553 3364 160517 49052 75283 -12255
7898a2255m5993R0612J57747J6023m1672q7041P9619o2508k50047l2082O7096
$$ -12255 -58248 32364 190111 206134 164462 77421 157040 94532 -155515 -187597 -120501
7887a20501O2022J33381P1552M4649k21159R3361Q5556j81196j57202j3600J49870
$$ -120501 -58479 74902 146454 191103 -30056 63305 148861 -32335 -189537 -203137 -53267
7876e3267J55056J30708J22437J24880j25963J5648j17082l66205j68126K31891
$$ -53267 101789 232497 354934 479814 353851 369499 252417 -113788 -281914 -50023
7866e0023j67145j38548P4282j805l0145K8294K58317q3511m528L4251l7286k38362
$$ -50023 -217168 -355716 -281434 -283239 -313384 -285090 -26773 -110284 -114812 -80561 -117847 -356209
7854c56209q0250L01927R4416K4670R230J9039K9047k59857k68174J04640K21565
$$ -356209 -436459 -134532 -40116 -15446 -6216 12823 41870 -217987 -486161 -381521 -159956
7843a59956Q4086l90307J08776M74261Q3371k30127N64j46537j05863K22632K00307
$$ -159956 -75870 -466177 -357401 116860 200231 -29896 -29332 -175869 -281732 -59100 141207
7832A41207k836m66852r6403j32587J28333P6199O6028r2695p9720J87544P6754
$$ 141207 138371 -328481 -424884 -557471 -429138 -352939 -286911 -379606 -459326 -271782 -195028
7821a95028j06788P4731j8954k4297L3851Q1963J99520J01912L012m0060r3270
$$ -195028 -301816 -227085 -246039 -270336 -236485 -154522 44998 146910 149922 109862 16592
7810A6592M8462L58296L9889j18473k17691n43240R3949K93463k4996k9169J946
$$ 16592 65054 423350 463239 344766 127075 -416165 -322216 -28753 -53749 -82918 -80972
7799h0972P1393K5201L9626j72629j592K2915k37789O6445J81957N2169J85384
$$ -80972 -9579 15622 55248 -117381 -118973 -96058 -333847 -267402 -85445 -33276 152108
7788A52108J17473o8293J02324j58908l7133L1325m0171n8002j25566J6400K2688
$$ 152108 269581 201288 303612 144704 107571 138896 98725 40723 -84843 -68443 -45755
7777d5755J58321n1255m7034n8984J10234p608r5802j251N8906L7045r4157k34718
$$ -45755 112566 61311 14277 -44707 65527 57919 -37883 -39134 19772 56817 -37340 -272058
7765b72058k51398O2704K09113J41331J18429o7744j776o7117J27254J67829m6488
$$ -272058 -523456 -460752 -251639 -110308 8121 -59623 -61399 -128516 -1262 166567 120079
7754A20079l10090J28167P1941J47344J70202j17181n6j03503k27109n0561J15153
$$ 120079 -190011 -61844 10097 157441 327643 210462 210406 106903 -120206 -170767 -55614
7743e5614K05469j47546k32680N8582K25135L761r0022O5629K38452j04150K7439
$$ -55614 149855 2309 -230371 -171789 53346 57107 -32915 32714 271166 167016 194455
7732A94455M1397q1375Q7056Q3547j4133k4430j37483j9602k4093j09414J25272
$$ 194455 235852 154477 241533 325080 310947 286517 149034 129432 105339 -4075 121197
7721A21197n8278l56198J74663J13461r2268l7749k4183k3399M473J9652n5369
$$ 121197 62919 -293279 -118616 -5155 -97423 -135172 -159355 -182754 -178281 -158629 -213998
7710b13998l426O5531O8265Q988Q8626j12077j37198p4584M94206L86581l09699
$$ -213998 -217424 -151893 -83628 -74640 13986 -98091 -235289 -309873 184333 570914 261215
7699B61215o7590j93041m9597K49786J15904k34282p4566J13190n8835j9314P3679
$$ 261215 193625 584 -49013 200773 316677 82395 7829 121019 62184 42870 116549
7688A16549j30137j45732R8890J36170k4379M519J88617R5857j2276j62971J17903
$$ 116549 -13588 -159320 -60430 75740 51361 55880 244497 340354 328078 165107 283010
7677B83010j13508k26951q1268K17884K728r5515j41674q7727o8491p185R2279
$$ 283010 169502 -57449 -138717 79167 81895 -13620 -155294 -243021 -311512 -318697 -226418
7666b26418J75775j18784m5779K91223O8028n2116m2630J01837j99543o0943K3098
$$ -226418 -50643 -169427 -215206 76017 144045 91929 49299 151136 -48407 -109350 -86252
7655h6252R3313j27375j17288J94162k16254q3646J85878K3401J068n9318j29201
$$ -86252 7061 -120314 -237602 -43440 -259694 -343340 -157462 -134061 -132993 -192311 -321512
7644c21512J37141J73596K08613K4401l03805k04954J70135k7310J21335K28830
$$ -321512 -184371 -10775 197838 222239 -81566 -286520 -116385 -143695 -22360 206470
7634B06470L6091m5008J25692k13159L097p3686j56644J5986p5809j05790K15934
$$ 206470 242561 197553 323245 110086 113183 39497 -117147 -101161 -176970 -282760 -66826
7623f6826K8546k46498j68051M18566J01914p9167N8581j11448K00659J30807
$$ -66826 -38280 -284778 -452829 -34263 67651 -11516 47065 -64383 136276 267083
7613B67083l40964m8958k21753n2849L63046L00354J48913J02072j97419N8225
$$ 267083 -73881 -122839 -344592 -397441 -34395 265959 414872 516944 319525 377750
7603C77750p6165l01192m5240q0897q2636r4008l1255K35779J12142j6948k98436
$$ 377750 301585 393 -44847 -125744 -208380 -302388 -333643 -97864 14278 -2670 -301106
7592c01106j15521K16696r8256J96328L16461K22435k52556k52944J82168Q9042
$$ -301106 -416627 -199931 -298187 -101859 214602 437037 184481 -68463 113705 202747
7582B02747j8514m7540j02786j23834j97282n493J39601k3192j01073K35491K53612
$$ 202747 184233 136693 33907 -89927 -287209 -292702 -153101 -176293 -277366 -41875 211737
7571B11737j1429m7352K7914j08081j49549K7468Q340o8587j52621k47290J38647
$$ 211737 200308 152956 180870 72789 -76760 -49292 -40952 -109539 -262160 -509450 -370803
7560c70803P3549J50184K10354m1811l34977p1712L21261K99203K74882K2137
$$ -370803 -297254 -147070 63284 21473 -313504 -385216 -63955 235248 510130 532267
7550E32267j01528l8136o3843j29527N158P4413n0375j10644o0986K0857j42252
$$ 532267 430739 392603 328760 199233 204391 278804 228429 117785 56799 77656 -64596
7539f4596j45255J9130k11192J10833L43104K7953j55760L3156K32956R0278k7357
$$ -64596 -209851 -190721 -401913 -291080 52024 79977 -75783 -42627 190329 280607 253250
7528B53250k89396j41564N1099j24628n5790K0103O5337J25378L9245j67793j7866
$$ 253250 -36146 -177710 -126611 -251239 -307029 -286926 -221589 -96211 -56966 -224759 -242625
7517b42625J28143J68342o8276r6478J09599J34893K53226N0286k08602j60981
$$ -242625 -114482 53860 -14416 -110894 -1295 133598 386824 437110 228508 67527
7507F7527j52925j74670J83728J30129p9646o0064K374o3120m6317J17619L02302
$$ 67527 -85398 -260068 -76340 53789 -25857 -85921 -83547 -146667 -192984 -75365 226937
7496B26937j13563O313R243K9486l522j45234l08208j25748J82176m7963o7374
$$ 226937 113374 119687 128930 158416 154894 9660 -298548 -424296 -242120 -290083 -357457
7485c57457J25001J50237K3443j73050m3083J51227J14364j88073P6135l7604
$$ -357457 -232456 -82219 -58776 -231826 -274909 -123682 -9318 -197391 -121256 -158860
7475a58860k4232j24793M4576Q5294J26837M05175R7806j60463k28308r6818j96468
$$ -158860 -183092 -307885 -263309 -178015 -51178 353997 451803 291340 63032 -33786 -230254
7464b30254l1433J73940J57550K64530l5280j09208J5762m7976r0053J8210J11751
$$ -230254 -261687 -87747 69803 334333 299053 189845 205607 157631 67578 85788 197539
7453A97539n6061J16115l0754N3427j1780j51585j24379q1675J80258J02367J21582
$$ 197539 141478 257593 226839 280266 268486 116901 -7478 -89153 91105 193472 315054
7442C15054P3053k57753k03888k03292J95036J39922K60436n1773j22947l78660
$$ 315054 388107 130354 -73534 -276826 -81790 58132 318568 266795 143848 -234812
7432b34812K6905P4041P9455K9595K80017N1784j84761M7927K68827n7126Q7761
$$ -234812 -207907 -133866 -54411 -24816 255201 306985 122224 170151 438978 381852 469613
7421D69613p0717Q6869O6916N5187J03305j97516k81989k06351k9144q2010o9634
$$ 469613 398896 485765 552681 607868 711173 513657 231668 25317 -3827 -85837 -155471
7410a55471M2737o0833L8216K37406K83934J3791k98798j64863K24512j59146
$$ -155471 -112734 -173567 -135351 102055 385989 399780 100982 -63881 160631 1485
7400A485j35295J39337l41587J45783n3562j0374R7086P0839j8474j41917N4431
$$ 1485 -133810 5527 -336060 -190277 -243839 -254213 -157127 -86288 -104762 -246679 -192248
7389a92248N7266J10902R0567j71325l7346j42164q8816M9991o47Q3942k8560
$$ -192248 -134982 -24080 66487 -104838 -142184 -284348 -373164 -323173 -323820 -239878 -268438
7378b68438J45998j00672Q4866J23626o9482l6240k00811J4079l156N5306K80410
$$ -268438 -122440 -223112 -138246 -14620 -84102 -120342 -321153 -307074 -310230 -254924 25486
7367B5486J39632j97799L0718J77673N740n7487J35849p1749m3595j1429m0904
$$ 25486 165118 -32681 -1963 175710 181450 123963 259812 188063 144468 133039 92135
7356I2135j24885K3262k02691j43320j05611L68970K62803l4m3653j41544K438
$$ 92135 -32750 -9488 -212179 -355499 -461110 -92140 170663 170629 126976 -14568 -12130
7345a2130K42738k18303j12737J006J50361j24177k4216o9649N102J33469L4006
$$ -12130 230608 12305 -100432 -99426 50935 -73242 -97458 -167107 -162005 -28536 5470
7334E470k4925N6767l5656q2725r0156K7251j43299R722k424J00410J05403K9466
$$ 5470 -19455 37312 1656 -81069 -171225 -143974 -287273 -277551 -279975 -179565 -74162 -44696
7322d4696j00319L49584Q2538j00400r6715j49544j78729n4252o4698L36044J10689
$$ -44696 -145015 204569 287107 186707 89992 -59552 -238281 -292533 -357231 -21187 89502
7311H9502l24810j7527J85928L55123P6972k78454j71540p7601k8132J55249j73857
$$ 89502 -235308 -252835 -66907 288216 365188 86734 -84806 -162407 -190539 -35290 -209147
7300b09147M4595J64678L48037N0249K36716j63194n3782L0059k32358k39565
$$ -209147 -164552 126 348163 398412 635128 471934 418152 448211 215853 -23712
7290b3712j64055J86983j85607j60973J89597J66359n0560j3577q3947L1186j47296
$$ -23712 -187767 -784 -186391 -347364 -157767 8592 -41968 -55545 -139492 -108306 -255602
7279b55602p8427J01363J58182J86480P0917k94410j34368P4442K62689J42444
$$ -255602 -334029 -232666 -74484 111996 182913 -111497 -245865 -171423 91266 233710
7269B33710q7850P1457J77920k4615j55360k0607j29043M6897j22648J10609J22170
$$ 233710 145860 217317 395237 370622 215262 194655 65612 112509 -10139 100470 222640
7258B22640p7258J21778K50744J08180j88606q0555o1009k00679r449J78679k28636
$$ 222640 145382 267160 517904 626084 437478 356923 295914 95235 85786 264465 35829
7247C5829p9153R6041m2651J95175l4601q4301n2269o9586k87480P7548K0308
$$ 35829 -43324 52717 10066 205241 170640 86339 34070 -35516 -322996 -245448 -225140
7236b25140j47147L070K25706J05510k16305l16869L45014J14061o3031P7071
$$ -225140 -372287 -369217 -143511 -38001 -254306 -571175 -226161 -112100 -175131 -98060
7226i8060N6205l4455J4664j43784M1471K29359m145N1551l7991K62488J48518
$$ -98060 -41855 -76310 -61646 -205430 -163959 65400 61255 112806 74815 337303 485821
7215D85821J09129n9302k33273o5624m6493r948O3826M0164j08637r7036j15744
$$ 485821 594950 535648 302375 236751 190258 180310 244136 284300 175663 78627 -37117
7204c7117l00649j04784J40498J25284l5815L4101P9947J69783J83858j50617
$$ -37117 -337766 -442550 -302052 -176768 -212583 -178482 -98535 71248 255106 104489
7194A04489k1206j13033o5141K74389K66892J2877j22484j16337p1845K5915p7325
$$ 104489 83283 -29750 -94891 179498 446390 459267 336783 220446 148601 174516 97191
7183I7191q0977J43817j10363j50293n34K74786K03598k77493q2339r917O3074
$$ 97191 16214 160031 49668 -100625 -101159 173627 377225 99732 17393 7476 70550
7172G0550l4227J95010J6124k00036j19834L1513K72272J66464l02019j45715
$$ 70550 36323 231333 247457 47421 -72413 -40900 231372 397836 95817 -49898
7162d9898R623p0719O4627L5862k1682M3162J35301l292J93325L3883j3247j26774
$$ -49898 -40275 -110994 -46367 -10505 -32187 10975 146276 142984 336309 370192 356945 230171
7150B30171J21607j05486M2786k7126j43646j62754l8607J83531L3542j40286
$$ 230171 351778 246292 289078 261952 118306 -44448 -83055 100476 134018 -6268
7140f268r0600L3621k03839J86432K82917J2431j89437j35132m8196L8936k9596
$$ -6268 -96868 -63247 -267086 -80654 202263 214694 25257 -109875 -158071 -119135 -148731
7129a48731M7624o6965j24171p1954p3197J10650L46977L41522p1491p5124j51509
$$ -148731 -101107 -168072 -292243 -364197 -437394 -326744 20233 361755 290264 215140 63631
7118F3631p4626j12112L4233J31627K16998j8470j83028L4883R0282J25598J75455
$$ 63631 -10995 -123107 -88874 42753 259751 241281 58253 93136 183418 309016 484471
7107D84471p7473j70238q8166K6687J48148J84037l10380l30644l5169J80092
$$ 484471 406998 236760 148594 175281 323429 507466 197086 -133558 -168727 11365
7097A1365P9697m3095o9642P5887j2053k32693J15314O5614k47492j05160O8804
$$ 11365 91062 47967 -21675 54212 42159 -190534 -75220 -9606 -257098 -362258 -293454
7086b93454K92437O9345K4158J1870j19445Q3183k6076l30504n0374J47497Q2438
$$ -293454 -1017 68328 92486 104356 -15089 68094 42018 -288486 -338860 -191363 -108925
7075a08925J59549j35382J45492K9315k21044N6499N1147p1433q0236J26349M48026
$$ -108925 50624 -84758 60734 90049 -130995 -74496 -23349 -94782 -175018 -48669 399357
7064C99357J71174j83980p3169J3651k70003k40321j13935J55352L0602n300l4535
$$ 399357 570531 386551 313382 327033 57030 -183291 -297226 -141874 -111272 -116572 -151107
7053a51107o1229m1925K36273m6755k15539J13138j20254M3214K70683K7872l21589
$$ -151107 -212336 -254261 -17988 -64743 -280282 -167144 -287398 -244184 26499 54371 -267218
7042b67218j50346M8634Q2273J76968m9139M0201K4566Q0533J26767J70750r5641
$$ -267218 -417564 -368930 -286657 -109689 -158828 -118627 -94061 -13528 113239 283989 188348
7031A88348k08006R223l5924l9556j78242j65398j20239R0002J08365J60564K81268
$$ 188348 -19658 -10435 -46359 -85915 -264157 -429555 -549794 -459792 -351427 -190863 90405
7020I0405k0856K5560J14876j20225j35706O7547p7021j1833K3699q4647J27878
$$ 90405 69549 95109 209985 89760 -45946 21601 -55420 -67253 -43554 -128201 -323
7009c23M3093Q3302K77787k2555r1730j78346j59225J4247K39979P7978k98917
$$ -323 42770 126072 403859 381304 289574 111228 -47997 -33750 206229 284207 -14710
6998a4710n8211j89740M0230J69304J23966K72420R3214o3136L0673j47886J73880
$$ -14710 -72921 -262661 -222431 -53127 70839 343259 436473 373337 404010 256124 430004
6987D30004j46237r3055p4656j774j43918O7441J71944j60393J07696J91535P4678
$$ 430004 283767 190712 116056 114282 -29636 37805 209749 49356 157052 348587 423265
6976D23265O6398R3980j16809k66042j30576j46327J6746L0875P8889j87122j96994
$$ 423265 489663 583643 466834 200792 70216 -76111 -59365 -28490 50399 -136723 -333717
6965c33717j84707j38184K29308M14191R1254o2100J79558L9582R7320o7135k5425
$$ -333717 -518424 -656608 -427300 -13109 78145 16045 195603 235185 332505 265370 239945
6954B39945k0914R8111J31850K2114l53078k26436j12448P5717N4673K23659R5915
$$ 239945 219031 317142 448992 471106 118028 -108408 -220856 -145139 -90466 133193 229108
6943B29108K9659j05386m560j75083J28169l7657R84q3696j36278J08414o525
$$ 229108 258767 153381 148821 -26262 101907 64250 65234 -18462 -154740 -46326 -52851
6932e2851O4187K80685J83054R5902j72104k18781k48580L027n5077j253K82523
$$ -52851 11336 292021 475075 570977 398873 180092 -68488 -65461 -120538 -121791 160732
6921A60732k24362J55001J01101j2368q0373r2419M5848J87763N0077l34198k9661
$$ 160732 -63630 91371 192472 180104 99731 7312 53160 240923 291000 -43198 -72859
6910g2859K4624Q8497P9198R334j36483r5317J40564J03823j27482k3926K0974
$$ -72859 -48235 40262 119460 128794 -7689 -103006 37558 141381 13899 -10027 10947
6899A0947M9272j395n4592k4968K42503Q2022J9672p7386r2011j4007r8663k25224
$$ 10947 60219 58824 4232 -20736 221767 303789 323461 246075 154064 140057 41394 -183830
6887a83830K4182J49704j25694j93958J54371P0781L0164K907n9633K16201J21965
$$ -183830 -159648 -9944 -135638 -329596 -175225 -104444 -74280 -71373 -131006 85195 207160
6876B07160K5506k16926J00857p8313o4719o1897M9958j35770J6455J37729J41430
$$ 207160 232666 15740 116597 38284 -26435 -88332 -38374 -174144 -157689 -19960 121470
6865A21470p0862P6105n9472j06482j95592m2405L4657K5855j0363j81116N9540
$$ 121470 50608 126713 67241 -39241 -234833 -277238 -242581 -216726 -227089 -408205 -348665
6854c48665J89845J81172j22864k43846m647P8738L4813q4978J39755O341L5735
$$ -348665 -158820 22352 -100512 -344358 -349005 -270267 -235454 -320432 -180677 -174336 -138601
6843a38601J46971J72347j04712J41654j1928j51206j30851k067Q2123P6972o0735
$$ -138601 8370 180717 76005 217659 205731 54525 -76326 -78393 3730 80702 19967
6832A9967m6740P2663P2777q7529l6190k03521R2590K4018p803J63300K71793
$$ 19967 -26773 45890 118667 31138 -5052 -208573 -115983 -91965 -99768 63532 335325
6821C35325N8492j02929J3396K61305l41566j29772j12595j1629J52062J2010
$$ 335325 393817 290888 304284 565589 224023 94251 -18344 -29973 122089 134099
6811A34099j32213l9531R8008J12636L5379l7315j57127j19208j97291J61709
$$ 134099 1886 -37645 60363 172999 208378 171063 13936 -105272 -302563 -140854
6801a40854P5311N585J22487r2727k61005j93513p2972J54156J06395N0013m1651
$$ -140854 -65543 -59958 62529 -30198 -291203 -484716 -557688 -403532 -297137 -247124 -288775
6790b88775l4070J11080M7575k9309j65685n4596L91171R0097k46594q5839J81891
$$ -288775 -322845 -211765 -164190 -193499 -359184 -413780 -22609 67488 -179106 -264945 -83054
6779h3054J63000J90455j06052j14495r6114k38351j52568J61445L8672j77527
$$ -83054 79946 270401 164349 49854 -46260 -284611 -437179 -275734 -237062 -414589
6769d14589J53859M2357K63716P6735l27844l2785J71341O3062O0011o8877j11431
$$ -414589 -260730 -218373 45343 122078 -205766 -238551 -67210 -4148 55863 -13014 -124445
6758a24445J73394J88514J14223k95731j69155K3059J76118K6903j7741Q575j12134
$$ -124445 48949 237463 351686 55955 -113200 -90141 85977 112880 95139 103714 -8420
6747h420n7881K7776K34570n1262N0176J71037J0489j80687k02963j76810J22534
$$ -8420 -66301 -38525 196045 144783 194959 365996 376485 195798 -7165 -183975 -61441
6736f1441o0953j94507j4776Q9015J18298r6790J5236J30744J08761j51107n0666
$$ -61441 -122394 -316901 -331677 -242662 -124364 -221154 -205918 -75174 33587 -117520 -168186
6725a68186J15730j62330N0755N2924N7923p5942p8251Q7420R0116M3357r3272
$$ -168186 -52456 -214786 -164031 -111107 -53184 -129126 -207377 -119957 -29841 13516 -79756
6714g9756j0749l1883J39560n1664k19141j89274J36393M69032J30967k90055
$$ -79756 -90505 -122388 17172 -34492 -253633 -442907 -306514 162518 293485 3430
6704C430J1978o7346K9044K8570N7665O1270M8635j82853j75184L10867N0430
$$ 3430 15408 -51938 -22894 5676 63341 124611 173246 -9607 -184791 126076 176506
6693A76506Q1698m6978j43412k06476k6362L6786m8123r2451P3456O5244J63021
$$ 176506 258204 211226 67814 -138662 -165024 -128238 -176361 -268812 -195356 -130112 32909
6682C2909K09971j3821l66821n21071l50667M03203M07534q5719n7692J12096
$$ 32909 242880 229059 -137762 -658833 -1009500 -606297 -198763 -284482 -342174 -230078
6672b30078J18484r0001J64777N1723J35521K03371K4271j02587L5384L7037j89501
$$ -230078 -111594 -201595 -36818 14905 150426 353797 378068 275481 310865 347902 158401
6661A58401j90549J0593n3841R2463o7636Q3214O357m8824J6852L9329P1763j24673
$$ 158401 -32148 -21555 -75396 17067 -50569 32645 39002 -9822 7030 46359 118122 -6551
6649f551k23463J10731q2659J09990K35931r9021J6918o8012q2459k2852K43505
$$ -6551 -230014 -119283 -201942 -91952 143979 44958 61876 -6136 -88595 -111447 132058
6638A32058j92922j82798l721K17658J58803L4664k34593j05434q2230J67732
$$ 132058 -60864 -243662 -247383 -29725 129078 163742 -70851 -176285 -258515 -90783
6628i0783J05580j09711j38361K17036q3946j14370O2824l7986j34420K51814
$$ -90783 14797 -94914 -233275 -16239 -100185 -214555 -151731 -189717 -324137 -72323
6618g2323L00306K32486R1626l1470m7681P7165m22797l74230M0655L6786Q3210
$$ -72323 227983 460469 552095 520625 472944 550109 127312 -246918 -206263 -169477 -86267
6607h6267J2335j63808N877M43328K01774r1759j34373j03972p947q8569j97755
$$ -86267 -73932 -237740 -231863 211465 413239 321480 187107 83135 75188 -13381 -211136
6596b11136k36909J97071K76457J72758m9249k33942j05299N9773J04059j26238
$$ -211136 -448045 -250974 25483 198241 148992 -84950 -190249 -130476 -26417 -152655
6586a52655m0684K9957L31491R8560j97759j70010P5581j21162j25221k8840J26174
$$ -152655 -193339 -163382 168109 266669 68910 -101100 -25519 -146681 -271902 -300742 -174568
6575a74568K19328k4360M2928n167k24312j32514K3623r5058q3608K21897L79585
$$ -174568 44760 20400 63328 58161 -166151 -298665 -275042 -370100 -453708 -231811 147774
6564A47774J63616q4297O5900j18507j35366J12773j20773j96266n294J0084J94831
$$ 147774 311390 227093 292993 174486 39120 151893 31120 -165146 -170440 -160356 34475
6553C4475O8924o0737j40319Q4732J61225J43549L4339j38270l419k1748j29935
$$ 34475 103399 42662 -97657 -12925 148300 291849 326188 187918 184499 162751 32816
6542C2816J349M4971k28100k01485L5628Q1834K51262k3000o368N0688j20620
$$ 32816 34165 79136 -148964 -350449 -314821 -232987 18275 -4725 -11093 39595 -81025
6531h1025j17453K8426Q9968k2982J76645j7547L6930J97303M6275Q2021j77731
$$ -81025 -198478 -170052 -80084 -103066 73579 56032 92962 290265 336540 418561 240830
6520B40830m2483j94336j42154p9302r726M51254J61435j74579J36202R8651m23793
$$ 240830 198347 4011 -138143 -217445 -227171 224083 385518 210939 347141 445792 21999
6509B1999j34152J27749L1032P2038n6800k74961j09326K18329L07634M8220k05028
$$ 21999 -112153 15596 46628 118666 61866 -213095 -322421 -104092 203542 251762 46734
6498D6734J7137K78159P9026j05062l60064j40512M4157K87442N3231k15299J30479
$$ 46734 63871 342030 421056 315994 -44070 -184582 -140425 147017 200248 -15051 115428
6487A15428j84289k19883K25005J23935j43379J33530K19155m4342l616j75323
$$ 115428 -68861 -288744 -63739 60196 -83183 50347 269502 225160 221544 46221
6477D6221j11025k09640q0925N7195J44287P2263n2411J72118K8275p2723r9023
$$ 46221 -64804 -274444 -355369 -298174 -153887 -81624 -134035 38083 66358 -6365 -105388
6466a05388R4447R7090J21247k4437j68317R5876j61104j50196k31311J70426
$$ -105388 -10941 86149 207396 182959 14642 110518 -50586 -200782 -432093 -261667
6456b61667K22105M2958j03359K01773M28934L1461j96948K8010n984L659j83876
$$ -261667 -39562 3396 -99963 101810 530744 562205 365257 393267 387283 390942 207066
6445B07066j38831p9784l19256r6014K28427K27024j3463j84590K4359K1286J24493
$$ 207066 68235 -11549 -330805 -426819 -198392 28632 15169 -169421 -145062 -123776 717
6434G17J9612r5184j0274r2491q9719R7202J76276M2329J1764j11416K8132L32279
$$ 717 20329 -74855 -85129 -177620 -267339 -170137 6139 48468 60232 -51184 -23052 309227
6422C09227j39258p0066j2305m0689Q2823M229j51076L1688K43510j706j39490
$$ 309227 169969 99903 87598 46909 129732 133961 -17115 14573 258083 256377 116887
6411A16887k71099O4187K77209j51620j14600K9317J03829K5763n92j46042j38047
$$ 116887 -154212 -90025 187184 35564 -79036 -49719 54110 79873 79281 -66761 -204808
6400b04808R500L19412j14727k10560J16470R8509Q4997J67828M4871p125J17433
$$ -204808 -195308 124104 9377 -201183 -84713 13796 98793 266621 311492 304367 421800
6389D21800k60598j97754P0610O1727M2015k46164J98841J29293R52j24098j00716
$$ 421800 161202 -36552 34058 95785 137800 -108364 90477 219770 220722 96624 -4092
6378d092j89677L6579J25975n3889l8520J47502J30882N5349L3468j85691p6109
$$ -4092 -193769 -157190 -31215 -85104 -123624 23878 154760 210109 243577 57886 -18223
6367a8223L6855J11673J21892m3865q8731l16224n100K61459J70485O9107j57966
$$ -18223 18632 130305 252197 208332 119601 -196623 -201723 59736 230221 299328 141362
6356A41362R2101J10563j1554m39966k78294j77324R4525K90170M03786n5102
$$ 141362 233463 344026 332472 -107494 -385788 -563112 -468587 -178417 225369 170267
6346A70267j9751j05440l49357j06572O8377K94752J93554r5390k82250J27291
$$ 170267 150516 45076 -304281 -410853 -342476 -47724 145830 50440 -231810 -104519
6336a04519J38887k48855j73754J53486j08898j33084J48221J33107L28006K12955
$$ -104519 34368 -214487 -388241 -234755 -343653 -476737 -328516 -195409 132597 345552
6326C45552M5886l34738l61627J37789J38700L6846J8464Q691k8939R9036j32086
$$ 345552 391438 56700 -304927 -167138 -28438 8408 26872 35563 6624 105660 -26426
6315b6426P697j71702J53839J30704j2557k39093k98259p4587R4643K76232K43906
$$ -26426 -18729 -190431 -36592 94112 81555 -157538 -455797 -530384 -435741 -159509 84397
6304H4397q1J86080K26760j61593q8553m1600j15935p587k4047k12900k02489
$$ 84397 84316 270396 497156 335563 247010 205410 89475 81888 57841 -155059 -357548
6293c57548j17933k8170J03485K7538j99271q4637K54512K14622J27724j17801
$$ -357548 -475481 -503651 -400166 -372628 -571899 -656536 -402024 -187402 -59678 -177479
6283a77479j43399J24737J11852J62178J89848P0106r2950m8633p1985J43228
$$ -177479 -320878 -196141 -84289 77889 267737 337843 244893 196260 124275 267503
6273B67503j40365Q228j53191m6903J37528O7386R8522q2530r4531o1153j90554
$$ 267503 127138 135366 -17825 -64728 72800 140186 238708 156178 61647 494 -190060
6262a90060j16291K19011J11686J2794K18877M2905M3021J13373J32699k80147
$$ -190060 -306351 -87340 24346 37140 256017 298922 341943 455316 588015 307868
6252C07868l52963Q8891K33149k90569m5602q7608k56601P6782K500k92184R901
$$ 307868 -45095 43796 276945 -13624 -59226 -146834 -403435 -326653 -324153 -616337 -606436
6241f06436K83746K17223O6715k15235J0485J52776N2403j59219Q4142K86718
$$ -606436 -322690 -105467 -38752 -253987 -243502 -90726 -38323 -197542 -113400 173318
6231A73318k259j95823j05383j48354n6756j81457K32110O6053J13437K41733
$$ 173318 171059 -24764 -130147 -278501 -335257 -516714 -284604 -218551 -105114 136619
6221A36619q8710k397Q3165k2473k00292j36116J02359n39j8517P6133K74467
$$ 136619 47909 45512 128677 106204 -94088 -230204 -127845 -128384 -146901 -70768 203699
6210B03699k091n3397Q0495k59034j66743J06773N5560k5881O4834O5671J80452
$$ 203699 201608 148211 228706 -30328 -197071 -90298 -34738 -60619 4215 69886 250338
6199B50338J15009o9334l1336j37271k3380K07533M7316j41472k41672q9359J34825
$$ 250338 365347 296013 264677 127406 104026 311559 358875 217403 -24269 -113628 21197
6188B1197J2120l20760j00696J0182p686K36340J28966R4318p574K7525J45612
$$ 21197 33317 -287443 -388139 -377957 -385643 -149303 -20337 73981 66407 93932 239544
6177B39544J1227j33010j79509q0683j11831R2818m27R5142N032K18147K63335
$$ 239544 250771 117761 -61748 -142431 -254262 -161444 -161871 -66729 -61697 156450 419785
6166D19785j88792k58527j58244L31335r8500r4234M5902M5046j05717r1374l6666
$$ 419785 230993 -27534 -185778 145557 47057 -47177 -1275 43771 -61946 -153320 -189986
6155a89986J24442J58563j3116L1243K25083M860l8514j14260j34022j7557j50039
$$ -189986 -65544 93019 79903 111146 336229 341089 302575 188315 54293 36736 -113303
6144a13303J66945J1372K9818k01707l33123K32069O4605L38007K10708k8758
$$ -113303 53642 65014 94832 -106875 -439998 -207929 -143324 194683 405391 376633
6134C76633j26887j13703J88337j71628j59771J98580k09582k33472o9657K05762
$$ 376633 249746 136043 324380 152752 -7019 191561 -18021 -251493 -321150 -115388
6124a15388L65574K71490j21140j32572J5206k55260P805k6969Q126L6692p9319
$$ -115388 250186 521676 400536 267964 283170 27910 35715 8746 16872 53564 -25755
6113b5755n7791P5410j53423M4738J75718p9176m41077j98454J11379R4063J12127
$$ -25755 -83546 -8136 -161559 -116821 58897 -20279 -461356 -659810 -548431 -454368 -342241
6102c42241j6736k5734K984N6634J53850J21816j16772R876J19445r893R2567
$$ -342241 -358977 -384711 -381727 -325093 -171243 -49427 -166199 -156323 -36878 -46771 45796
6091D5796J71641k94546p8040J91979K45569r0127k76986l0677J2484O4408j1904
$$ 45796 217437 -77109 -155149 36830 282399 192272 -84714 -115391 -102907 -38499 -50403
6080e0403N3329M1641K5970J98801k8743J455o4701n0941J92781M9554k78674
$$ -50403 2926 44567 70537 269338 240595 242050 177349 126408 319189 368743 90069
6069I0069k25671j8900j47464j63090K34411J95634k8159o2236k057J36377J8238
$$ 90069 -135602 -154502 -301966 -465056 -230645 -35011 -63170 -125406 -127463 8914 27152
6058B7152J4493L03630l5067j10705Q9381j514M5629j49301l15322k27613L3785
$$ 27152 41645 345275 310208 199503 288884 287370 332999 183698 -131624 -359237 -325452
6047c25452R8190J08770M03370R4419j35760M9044K7115o1438L5910K3923j4373
$$ -325452 -227262 -118492 284878 379297 243537 292581 319696 258258 294168 318091 303718
6036C03718R1342j53759q8024R117k32711M6413N7842J19785J45449Q252m5751
$$ 303718 395060 241301 153277 162394 -70317 -23904 33938 153723 299172 307424 261673
6025B61673j23234L6204J60186p72o348r1778p5546k5039j6365k42896J43713
$$ 261673 138439 174643 334829 334057 327709 235931 160385 135346 118981 -123915 19798
6014A9798J72612J39349L6386j05360p0447K6945j44888L3077J1309J11533j35720
$$ 19798 192410 331759 368145 262785 192338 219283 74395 107472 118781 230314 94594
6003I4594n3886N1924J43571q4265O6340J22598j45857j56694j54002j76075O0297
$$ 94594 40708 92632 236203 151938 218278 340876 195019 38325 -115677 -291752 -231455
5992b31455p0472n291J59158K86558J23647j18208j02800l3412j37066J18773
$$ -231455 -301927 -307218 -148060 138498 262145 143937 41137 7725 -129341 -10568
5982a0568P6717m6512R4108R9104j76950l2139J54752l297j04901R1739J85657
$$ -10568 66149 19637 113745 212849 35899 3760 158512 155215 50314 142053 327710
5971C27710j68252k9118K33192P9675r5086p9195J00762r8985K6955k00292j32612
$$ 327710 159458 130340 363532 443207 348121 268926 369688 270703 297658 97366 -35246
5960c5246p7527K34062N336J43798j33621k74496j11326l952J72019K8882R2343
$$ -35246 -112773 121289 126625 270423 136802 -137694 -249020 -252972 -80953 -52071 40272
5949D0272J38654l1979q1166O9480L231j30747p6070k93246p5436K73037L38986
$$ 40272 178926 146947 65781 135261 138492 7745 -68325 -361571 -437007 -163970 175016
5938A75016k9466j77284J54036J20925j78163n5086K56336J01779j21681k16727
$$ 175016 145550 -31734 122302 243227 65064 9978 266314 368093 246412 29685
5928B9685J2031J9836J40608J01725q3172j83609n2473K0869Q9487q912p1206
$$ 29685 41716 61552 202160 303885 220713 37104 -15369 5500 94987 86075 14869
5917A4869j19378j3797K2396j2671J23747J89444m9025J31872J19531n5145j32158
$$ 14869 -104509 -118306 -95910 -108581 15166 204610 155585 287457 406988 351843 219685
5906B19685l097j33904l19106j56674n6874L29030j17057j07663J9612J62805
$$ 219685 216588 82684 -236422 -393096 -449970 -120940 -237997 -345660 -326048 -163243
5896a63243k3033l2296L2106J02787j13763M3331J30264J33239L6715N2559Q163
$$ -163243 -186276 -218572 -186466 -83679 -197442 -154111 -23847 109392 146107 198666 206829
5885B06829K9288J53979j43769j49659n1726K9086j72729J11691J56649j1531
$$ 206829 236117 390096 246327 96668 44942 74028 -98701 12990 169639 158108
5875A58108j09225k55484J84316J82331l7317j51523L49004L0430l9946o0766
$$ 158108 48883 -206601 -22285 160046 122729 -28794 320210 350640 310694 249928
5865B49928k58587j76676L3366J99949J33244P2725j30911j38741k1103j71525
$$ 249928 -8659 -185335 -151969 47980 181224 253949 123038 -15703 -36806 -208331
5855b08331J60947J85447J13998j89278n462J82109J18504R0171p5533j85467
$$ -208331 -47384 138063 252061 62783 57321 239430 357934 448105 372572 187105
5845A87105p9747J92750N5028j05136j8409j23944j1567j51970j68495j05776
$$ 187105 107358 300108 355136 250000 231591 107647 96080 -55890 -224385 -330161
5835c30161P269O2076M2649K64974J56475N2481O1872J04769r2967j79797l2033
$$ -330161 -322892 -260816 -218167 46807 203282 255763 317635 422404 329437 149640 117607
5824A17607j42050o4303K63835O3982q369j42926m6665q750j57032n0042M5462
$$ 117607 -24443 -88746 175089 239071 230702 87776 41111 32361 -124671 -174713 -129251
5813a29251l1843J88890P9931l3297j22976j92688Q8579K16950O0433m7428j65596
$$ -129251 -161094 27796 107727 74430 -48546 -241234 -152655 64295 124728 77300 -88296
5802h8296J20020j9686j6042J52099r8471k17960P9800R2843J1412k3977o0936
$$ -88296 31724 12038 -4004 148095 49624 -168336 -88536 4307 15719 -8258 -69194
5791f9194K90708L31129j06040k52204l81217l5080K04962K11621J24865j22816
$$ -69194 221514 552643 446603 194399 -186818 -221898 -16936 194685 319550 196734
5781A96734p2133j31527p6505L12461L8415j3451k66567j22965R4824J33928K25418
$$ 196734 124601 -6926 -83431 229030 267445 253994 -12573 -135538 -40714 93214 318632
5770C18632J15605N7191k00870k34998p8342j02983J85187j00760l1867j34901
$$ 318632 434237 491428 290558 55560 -22782 -125765 59422 -41338 -73205 -208106
5760b08106J80110J05985k23970m5603N3413K19243K27080k10846k26343j12721
$$ -208106 -27996 77989 -145981 -191584 -138171 81072 308152 97306 -129037 -241758
5750b41758j92241J53374K45711J91681n7460O2966l5203k35055j28012j20786
$$ -241758 -433999 -280625 -34914 156767 99307 162273 127070 -107985 -235997 -356783
5740c56783N7832P5088N3714K96264K9519k27092O1926J88953q5693j47662j89847
$$ -356783 -298951 -223863 -170149 126115 155634 -71458 -9532 179421 93728 -53934 -243781
5729b43781j01820J16425J45051K16037J8227o5102O8790j0124j14629l2516l9210
$$ -243781 -345601 -229176 -84125 131912 150139 85037 153827 143703 29074 -3442 -42652
5718d2652j08646k18194J37011J46550Q486J78869p7875r1563J7425k45278J22814
$$ -42652 -151298 -369492 -232481 -85931 -77445 101424 23549 -68014 -50589 -295867 -173053
5707a73053m7210r6910J26859J88729j41748L5772j03711j49029K43651K01118
$$ -173053 -220263 -317173 -190314 -1585 -143333 -107561 -211272 -360301 -116650 84468
5697H4468r8700k02857N9083l7605L3561K66343J17877j32194j55305k03843j23198
$$ 84468 -14232 -217089 -158006 -195611 -162050 104293 222170 89976 -65329 -269172 -392370
5686c92370P7638K8907J72967j2215J48253J13179o2482l01817O1988N0986q7372
$$ -392370 -314732 -285825 -112858 -125073 23180 136359 73877 -227940 -165952 -114966 -202338
5675b02338M4910O9803n8806J22650J6834J46134N6124R9490J12040k52006l6778
$$ -202338 -157428 -87625 -146431 -23781 -6947 139187 195311 294801 406841 154835 118057
5664A18057J89189P4956j56757j38151j25700J07311N02646k93042m17829K9631
$$ 118057 307246 382202 225445 87294 -38406 68905 571551 278509 -139320 -109689
5654a09689L5608J7831j05818O8042R3996O5762N8379m28597k37522J32392l7984
$$ -109689 -74081 -56250 -162068 -94026 -30 65732 124111 -304486 -542008 -409616 -447600
5643d47600n4727K02723J87789K69130j842r5361J28634o6699n24909p8729J06384
$$ -447600 -502327 -299604 -111815 157315 155473 60112 188746 122047 -402862 -481591 -375207
5632c75207j18779K55553K42182J9882l9603J61959k5027O1485j5590j2491j00022
$$ -375207 -493986 -238433 3749 23631 -15972 145987 120960 182445 166855 154364 54342
5621E4342J20660R6313J27019J90769j25543k52615K4623p3912j46210k7083p6241
$$ 54342 175002 271315 398334 589103 463560 210945 235568 161656 15446 -11637 -87878
5610h7878j16732k41350J64233J04372J21456J2162j85994R7685J7237J50749
$$ -87878 -204610 -445960 -281727 -177355 -55899 -43737 -229731 -132046 -114809 35940
5600C5940K70036J8683j03932L219R89j62356r2073N7044m0028o3276n9038k83788
$$ 35940 305976 324659 220727 223946 224935 62579 -29494 27550 -12478 -75754 -134792 -418580
5588d18580j09934J17186O6900J4551O5598R5238O361K15274J35766j55238l91690
$$ -418580 -528514 -411328 -344428 -329877 -264279 -169041 -162680 52594 188360 33122 -358568
5577c58568o7921K25472K21655J09196m511N7559j7160J11190J69568N3498j94688
$$ -358568 -426489 -201017 20638 129834 125323 182882 165722 276912 446480 499978 305290
5566C05290j93343l4371j4045j06670M9336k161n9348O3648J54230l1836n2208
$$ 305290 111947 77576 63531 -43139 6197 4036 -55312 8336 162566 130730 78522
5555G8522j58839O5303J98017Q8421k228J69887J72456j10191k54108j78602m6333
$$ 78522 -80317 -15014 183003 271424 269196 439083 611539 501348 247240 68638 22305
5544B2305j88255m0208j97163r5320Q6315M1647J40872K72046j87875j13110O468
$$ 22305 -165950 -206158 -403321 -498641 -412326 -370679 -229807 42239 -145636 -258746 -252278
5533b52278J01615J9350j08515J22153J36146R2570j03172j04990K0215L7053
$$ -252278 -150663 -131313 -239828 -117675 18471 111041 7869 -97121 -76906 -39853
5523c9853O5745j07879j83243N0648K31740j91423n1847M9053Q7081J81447p1924
$$ -39853 25892 -81987 -265230 -214582 17158 -174265 -226112 -177059 -89978 91469 19545
5512A9545Q0326M7508j09205R2104M6667J07528j13730l73372L6621J10171K9152
$$ 19545 99871 147379 38174 130278 176945 284473 170743 -202629 -166008 -55837 -26685
5501b6685K26298K55162m3905j38093R1159l2772j80108L2904J22245L7558j6596
$$ -26685 199613 454775 410870 272777 363936 331164 151056 183960 306205 343763 327167
5490C27167j6542K25202j83039p3190P6371K8689N913k7191Q6765n1757j13466
$$ 327167 310625 535827 352788 279598 355969 384658 390571 363380 450145 398388 284922
5479B84922k45053J46068K7730k24442j02155j66631j8451O7005J84103L01643
$$ 284922 39869 185937 213667 -10775 -112930 -279561 -298012 -231007 -46904 254739
5469B54739J16135j47523l42699j83722J38607K10387K24698k20073k63819J89259
$$ 254739 370874 223351 -119348 -303070 -164463 45924 270622 50549 -213270 -24011
5459b4011m5362K30650K8884J02375j45643j04782j59176k6386j34129P3535J47247
$$ -24011 -69373 161277 190161 292536 146893 42111 -117065 -143451 -277580 -204045 -56798
5448e6798O6834j7013K47349n3093j47256o3230J12756Q1771j41728J5409J77976
$$ -56798 10036 -6977 240372 187279 40023 -23207 89549 171320 29592 45001 222977
5437B22977O9738N2338j53687p5303j27679k0609K41761R054Q4799q605j02654
$$ 222977 292715 345053 191366 116063 -11616 -32225 209536 218590 303389 294784 192130
5426A92130l2144j66283O4031R9260N0400j98176O8472K45603l44748j30172K55875
$$ 192130 159986 -6297 57734 156994 207394 9218 77690 323293 -21455 -151627 104248
5415A04248P6253j58190k6049P1042n7389K9592k8388n3036j746j17515o5096
$$ 104248 180501 22311 -3738 67304 9915 39507 11119 -41917 -43663 -161178 -226274
5404b26274J1961J0951K9183l7473J50240Q1907j48813J5604N3864K12572J25291
$$ -226274 -214313 -203362 -174179 -211652 -61412 20495 -128318 -112714 -58850 153722 279013
5393B79013L4718j28105P8727K1447q419L7542j33499j59427J8250K4669P9280
$$ 279013 313731 185626 264353 285800 277381 314923 181424 21997 40247 64916 144196
5382A44196j14571l5534J26962L1990J56755M8462l1901r1003j46566j73566k12897
$$ 144196 29625 -5909 121053 153043 309798 358260 326359 235356 88790 -84776 -297673
5371b97673q0876p5918Q4674J18041K06832j28701j53240L46346J91797M726L6357
$$ -297673 -378549 -454467 -369793 -251752 -44920 -173621 -326861 19485 211282 216008 252365
$$ [...]
##END NTUPLES=NMR SPECTRUM
##END=
