##TITLE=Analysis number 326930
Compound Code mo 08116
Book Reference 510/31
Project Code adrs
Chemist Name jimp
##JCAMPDX= 6.0         $$ Bruker NMR JCAMP-DX V2.0
##DATA TYPE= NMR SPECTRUM
##DATA CLASS= NTUPLES
##ORIGIN= Bruker BioSpin GmbH
##OWNER= nmr
$$ XWIN-NMR		Version 3.5
$$ Fri Mar  2 08:22:49 2007 GMT Standard Time (UT+0h)  MAYBRIDGE\nmr@NMR_250MHZ
##.OBSERVE FREQUENCY= 250.131544655141
##.OBSERVE NUCLEUS= ^1H
##.ACQUISITION MODE= SIMULTANEOUS (DQD)
##.ACQUISITION SCHEME= undefined
##.AVERAGES= 16
##.DIGITISER RES= 18
##SPECTROMETER/DATA SYSTEM= dpx250
##.PULSE SEQUENCE= zg30
##.SOLVENT NAME= DMSO
##.SHIFT REFERENCE= (INTERNAL, DMSO, 0, 16.522)
##AUDIT TRAIL= $$ (NUMBER, WHEN, WHO, WHERE, WHAT)
$$ ##TITLE= Audit trail, XWIN-NMR		Version 3.5
$$ ##JCAMPDX= 5.01
$$ ##ORIGIN= Bruker BioSpin GmbH
$$ ##OWNER= nmr
$$ C:\u/data/dgb/nmr/ADRS/100/pdata/1/auditp.txt
$$ ##AUDIT TRAIL=  $$ (NUMBER, WHEN, WHO, WHERE, WHAT)
(   1,<2007-03-02 08:22:13.61 +000>,<MAYBRIDGE\nmr>,<NMR_250MHZ>,
      <created by zg, POWCHK disabled, PULCHK disabled
       configuration hash MD5:
       49 4B E0 1D 92 C2 6B 37 9F E6 65 BC 52 41 86 1D
       data hash MD5: 64K
       7C 44 E4 FF 09 76 2F CD 88 5F A0 6B 2C 8D A7 AD>)
(   2,<2007-03-02 08:22:31.47 +000>,<MAYBRIDGE\nmr>,<NMR_250MHZ>,
      <Start of raw data processing
       ef LB = 0.3 FT_mod = 6 PKNL = 1 SI = 32K 
       data hash MD5: 32K
       64 F0 6C 88 A4 87 24 EE 53 4A 09 C3 D4 76 FB 08>)
(   3,<2007-03-02 08:22:33.32 +000>,<MAYBRIDGE\nmr>,<NMR_250MHZ>,
      <apk 
       data hash MD5: 32K
       A3 E7 19 C6 21 84 37 E7 93 18 FE 9D F3 44 A5 97>)
(   4,<2007-03-02 08:22:34.97 +000>,<MAYBRIDGE\nmr>,<NMR_250MHZ>,
      <abs ABSG = 5 
       data hash MD5: 32K
       B7 77 F0 28 06 0E 3A EA 53 DC 71 42 83 EF A2 3A>)
$$ ##END=
$$ 
$$ hash MD5
$$ C4 56 2E 97 EE 84 A0 37 ED A1 D7 D3 BA 78 BD E3
##$RELAX= 
##$RELAX= 
##$RELAX= 
##$RELAX= 
##$RELAX= 
##$RELAX= 
##$RELAX= 
$$ Bruker specific parameters
$$ --------------------------
##$DU= <C:\u>
##$EXPNO= 100
##$NAME= <ADRS>
##$PROCNO= 1
##$TYPE= <nmr>
##$USER= <dgb>
##$AMP= (0..31)
100 100 100 100 100 100 100 100 100 100 100 100 100 100 100 100 100 100 
100 100 100 100 100 100 100 100 100 100 100 100 100 100 
##$AQSEQ= 0
##$AQ_mod= 3
##$AUNM= <au_zg>
##$AUTOPOS= <1 >
##$BF1= 250.13
##$BF2= 250.13
##$BF3= 250.13
##$BF4= 250.13
##$BF5= 500.13
##$BF6= 500.13
##$BF7= 500.13
##$BF8= 500.13
##$BYTORDA= 1
##$CFDGTYP= 0
##$CFRGTYP= 5
##$CHEMSTR= <none>
##$CNST= (0..31)
1 1 145 1 1 1 1 1 1 1 1 1 1 1 1 1 1 1 1 1 1 1 1 1 1 1 1 1 1 1 1 1 
##$CPDPRG= <>
##$CPDPRG1= <>
##$CPDPRG2= <>
##$CPDPRG3= <>
##$CPDPRG4= <mlev>
##$CPDPRG5= <mlev>
##$CPDPRG6= <mlev>
##$CPDPRG7= <mlev>
##$CPDPRG8= <mlev>
##$CPDPRGB= <>
##$CPDPRGT= <>
##$D= (0..31)
0 1 0 0 0 0 0 0 0 0.06 0 0 0 0 0 0 0.0002 0 0 0 0 0 0 0 0 0 0 0 0 0 0 
0 
##$DATE= 1172823731
##$DBL= (0..7)
120 120 120 120 120 120 120 120 
##$DBP= (0..7)
150 150 150 150 150 150 150 150 
##$DBP07= 0
##$DBPNAM0= <>
##$DBPNAM1= <>
$$ [...]
##$SUBNAM7= <"">
##$SUBNAM8= <"">
##$SUBNAM9= <"">
##$SW= 20.6930455092707
##$SWIBOX= (0..15)
0 0 3 0 0 0 0 0 0 0 0 0 0 0 0 0 
##$SW_h= 5175.983436853
##$TD= 65536
##$TD0= 1
##$TE= 295.16
##$TE2= 300
##$TE3= 300
##$TEG= 300
##$TL= (0..7)
0 120 120 120 120 120 120 120 
##$TP= (0..7)
150 150 150 150 150 150 150 150 
##$TP07= 0
##$TPNAME0= <>
##$TPNAME1= <>
##$TPNAME2= <>
##$TPNAME3= <>
##$TPNAME4= <>
##$TPNAME5= <>
##$TPNAME6= <>
##$TPNAME7= <>
##$TPOAL= (0..7)
0.5 0.5 0.5 0.5 0.5 0.5 0.5 0.5 
##$TPOFFS= (0..7)
0 0 0 0 0 0 0 0 
##$TUNHIN= 0
##$TUNHOUT= 0
##$TUNXOUT= 0
##$USERA1= <user>
##$USERA2= <user>
##$USERA3= <user>
##$USERA4= <user>
##$USERA5= <user>
##$V9= 5
##$VALIST= <valist>
##$VCLIST= <CCCCCCCCCCCCCCC>
##$VD= 0
##$VDLIST= <DDDDDDDDDDDDDDD>
##$VPLIST= <PPPPPPPPPPPPPPP>
##$VTLIST= <TTTTTTTTTTTTTTT>
##$WBST= 1024
##$WBSW= 4
##$XGAIN= (0..3)
0 0 0 0 
##$XL= 0
##$YL= 0
##$YMAX_a= 236451
##$YMIN_a= -197014
##$ZGOPTNS= <>
##$ZL1= 120
##$ZL2= 120
##$ZL3= 120
##$ZL4= 120
##$ABSF1= 16.522
##$ABSF2= -4.171173
##$ABSG= 5
##$ABSL= 3
##$ALPHA= 0
##$AQORDER= 0
##$ASSFAC= 0
##$ASSFACI= 0
##$ASSFACX= 0
##$ASSWID= 0
##$AUNMP= <proc_1d>
##$AZFE= 0.1
##$AZFW= 0.1
##$BCFW= 0
##$BC_mod= 0
##$BYTORDP= 0
##$COROFFS= 0
##$CY= 12.5
##$DATMOD= 1
##$DC= 0
##$DFILT= <>
##$DTYPP= 0
##$F1P= 14.0000005364418
##$F2P= -0.99999901652339
##$FCOR= 0.5
##$FTSIZE= 32768
##$FT_mod= 6
##$GAMMA= 0
##$GB= 0
##$INTBC= 1
##$INTSCL= 1
##$ISEN= 128
##$LB= 0.3
##$LEV0= 0
##$LPBIN= 0
##$MAXI= 10000
##$MC2= 0
##$MEAN= 0
##$ME_mod= 0
##$MI= 0
##$NCOEF= 0
##$NC_proc= -5
##$NLEV= 6
##$NOISF1= 0
##$NOISF2= 0
##$NSP= 0
##$NTH_PI= 0
##$NZP= 0
##$OFFSET= 16.522
##$PC= 1
##$PHC0= 215.9486
##$PHC1= 12.06367
##$PH_mod= 1
##$PKNL= yes
##$PPARMOD= 0
##$PSCAL= 4
##$PSIGN= 0
##$REVERSE= no
##$SF= 250.13
##$SI= 32768
##$SIGF1= 0
##$SIGF2= 0
##$SINO= 400
##$SIOLD= 32768
##$SREGLST= <1H.DMSO>
##$SSB= 0
##$STSI= 32768
##$STSR= 0
##$SW_p= 5175.98343685301
##$SYMM= 0
##$S_DEV= 0
##$TDeff= 65536
##$TDoff= 0
##$TI= <Analysis number 999999
Compound Code 99
Book Reference 9
Project Code 9>
##$TILT= no
##$TM1= 0
##$TM2= 0
##$TOPLEV= 0
##$USERP1= <user>
##$USERP2= <user>
##$USERP3= <user>
##$USERP4= <user>
##$USERP5= <user>
##$WDW= 1
##$XDIM= 32768
##$YMAX_p= 383456516
##$YMIN_p= -678569
$$ End of Bruker specific parameters
$$ ---------------------------------
##NTUPLES= NMR SPECTRUM
##VAR_NAME=  FREQUENCY,     SPECTRUM/REAL,   SPECTRUM/IMAG
##SYMBOL=    X,             R,               I
##VAR_TYPE=  INDEPENDENT,   DEPENDENT,       DEPENDENT
##VAR_FORM=  AFFN,          ASDF,            ASDF
##VAR_DIM=   32768,         32768,           32768
##UNITS=     HZ,            ARBITRARY UNITS, ARBITRARY UNITS
##FACTOR=    0.157963299565203, 1,           1
##FIRST=     4132.6476996994, 0,             0
##LAST=      -1043.33573715361, 0,           0
##MIN=       -1043.33573715361, -678569,     0
##MAX=       4132.6476996994, 383456516,     0
$$ Real data points
##PAGE= N=1
##DATA TABLE= (X++(R..R)), XYDATA
$$ [...]
$$ plain form
15773 66575 -18536 65217 36315 77350 78631 -33360 -97322 52820 85257 -68670 -242150
15762 -242150 -258421 -111289 -122790 -92238 46669 16721 -135745 -80590 -34064 -31328 37089
15751 37089 103260 -28211 -105651 -149567 27141 4706 -5445 98637 109443 62799 -18390
15740 -18390 -53198 -173092 -192680 -157957 -149681 -23727 55551 76319 70335 131262 200798 180680
15728 180680 -18876 -58280 72619 -324 -161298 -212149 -198434 -64961 -3116 -209097
15718 -209097 -286278 -257649 -288544 -238967 -115945 -80584 28715 -62960 -72246 -74931 -34470
15707 -34470 -24718 -121263 -178000 -226091 -197543 -252754 -251825 -177812 51508 274262 178086 3030
15695 3030 106674 112055 51119 89369 19858 -35668 -141042 -153376 -82661 -242953 -366182
$$ packed form
15773F6575q5111Q3753k8902M1035J281j11991o3962J50142L2437j53927j73480
15762b42150j6271J47132j1501L0552J38907k9948j52466N5155M6526K736O8417
15751C7089O6171j31471p7440m3916J76708k2435j0151J04082J0806m6644q1189
15740a8390l4808j19894j9588L4723Q276J25954P9278K0768n984O0927O9536k0118
15728A80680j99556l9404J30899p2943j60974n0851J3715J33473O1845k05981
15718b09097p7181K8629l0895M9577J23022L5361J09299r1675r286k685M0461
15707c4470R752r6545n6737m8091K8548n5211R29P4013K29320K22754r6176j75056
15695C030J03644N381o0936L8250o9511n5526j05374j2334P0715j60292j23229
$$ plain form
15684 -366182 -415015 -154739 4633 -2552 -44970 -190280 -227688 -133119 -113495 -282400 -147359
15673 -147359 -97712 -173495 -159882 -53081 -1011 54661 77120 33895 -145833 -180718 -229253
15662 -229253 -240588 -129271 -81474 -40590 -177619 -116515 -21798 54975 157057 278226 146720
15651 146720 -3541 -81230 8335 -138803 -309359 -285349 -59533 -70362 -165198 -14757
15641 -14757 98156 80595 1538 -118760 -170438 -156395 -257452 -188464 -132888 -225473 -415040
15630 -415040 -372840 -222180 -156794 -137893 -180761 -202596 -233249 -48176 -10688 -43706 -150418
15619 -150418 -216728 -217045 -219100 -223987 -41407 192715 39489 27158 -16253 -144605 -219324
15608 -219324 -190638 -63864 3074 173697 120299 -24049 24444 76988 -17062 860 -40987
$$ packed form
15684c66182m8833K60276J59372p185m2418j45310l7408R4569J9624j68905J35041
15673a47359M9647p5783J3613J06801N2070N5672K2459m3225j79728l4885m8535
15662b29253j1335J11317M7797M0884j37029O1104R4717P6773J02082J21169j31506
15651A46720j50261p7689Q9565j47138j70556K4010K25816j0829r4836J50441
15641a4757J12913j7561p9057j20298n1678J4043j01057O8988N5576r2585j89567
15630d15040M2200J50660O5386J8901m2868k1835l0653J85073L7488l3018j06712
15619a50418o6310l17k055m887J82580K34122j53226j2331m3411j28352p4719
15608b19324K8686J26774O6938J70623n3398j44348M8493N2544r4050J7922m1847
$$ plain form
15597 -40987 -212914 -349377 -303829 -171188 -239334 -228853 -222761 -132567 -129158 -84386 -81661 -23813
15585 -23813 -55035 -14042 36948 45003 -145234 -253972 -165728 -112955 -129979 -73898 -252105
15574 -252105 -207060 10982 27189 -91969 -149513 -142539 -239778 -423381 -339145 -282635 20251
15563 20251 19478 -212913 -349994 -382820 -379268 -345944 -269368 -291064 -263066 -131801 -100708 -139646
15551 -139646 -138761 -97148 -109674 -135545 -59686 -135414 -269786 -179571 -183405 -24825 146853
15540 146853 -8764 -246105 -407002 -433711 -284669 -161514 -233090 -332936 -261874 -249532
15530 -249532 -161947 -220738 -184338 -191950 -97336 -33806 -40399 -92521 -43483 -98816 -146870 -282853
15518 -282853 -187063 -162475 -148803 -114582 -175075 -214818 -62524 -3275 134667 95385 24736
$$ packed form
15597d0987j71927j36463M5548J32641o8146J0481O092R0194L409M4772K725N7848
15585b3813l1222M0993N0990Q055j90237j08738Q8244N2773j7024N6081j78207
15574b52105M5045K18042J6207j19158n7544O974r7239j83603Q4236N6510L02886
15563B0251p73k32391j37081l2826L552L3324P6576k1696K7998J31265L1093l8938
15551a39646Q85M1613j2526k5871P5859p5728j34372R0215l834J58580J71678
15540A46853j55617k37341j60897k6709J49042J23155p1576r9846P1062J2342
15530b49532Q7585n8791L6400p612R4614O3530o593n2122M9038n5333m8054j35983
15518b82853R5790K4588J3672L4221o0493l9743J52294N9249J37942l9282p0649
$$ plain form
15507 24736 -151230 -204543 -178323 -148208 -25070 199607 209025 272673 224076 101499 -26595
15496 -26595 -76777 -182511 -105034 12481 18280 -128330 109121 75563 82675 103730 57333
15485 57333 51529 -52076 -75234 100238 120112 -3539 -74072 -50845 -27828 -13777 34861
15474 34861 -2499 -19878 -43835 -51270 16418 20253 -29065 -163999 -98004 -41075 -125813 -250462
15462 -250462 -363414 -392175 -208394 -16282 63433 58209 167631 171592 124334 16784 -10279
15451 -10279 -140560 -177360 -193512 -219371 -52203 102348 36045 110681 63386 61742 59258
15440 59258 -51081 -163765 89955 204315 43240 96121 -26535 -222973 -203347 -162966
15430 -162966 -130884 -83066 -20208 60128 100626 288672 353009 171473 19530 -111954 -50806
$$ packed form
15507B4736j75966n3313K6220L0115J23138K24677R418O3648m8597j22577j28094
15496b6595n0182j05734P7477J17515N799j46610K37451l3558P112K1055m6397
15485E7333n804j03605k3158J75472J9874j23651p0533K3227K3017J4051M8638
15474C4861l7360j7379k3957p435O7688L835m9318j34934O5995N6929q4738j24649
15462b50462j12952k8761J83781J92112P9715n224J09422L961m7258j07550k7063
15451a0279j30281l6800j6152k5859J67168J54551o6303P4636m7295j644k484
15440E9258j10339j12684K53720J14360j61075N2881j22656j96438J9626M0381
15430a62966L2082M7818O2858Q0336M0498J88046O4337j81536j51943j31484O1148
$$ plain form
15419 -50806 -116361 -222042 -208929 -139590 -203154 -145566 -21515 140043 178769 129498 72722
15408 72722 57023 81949 67558 -57953 -184906 -190549 -80849 141262 308924 151096 -65544
15397 -65544 -122828 -130449 -170902 -32334 -79285 -143276 -136562 -83936 -22253 6538 528 -78226
15385 -78226 -51542 135643 125900 -75736 -122722 48221 32749 -5149 88400 140011 163233
15374 163233 86942 9905 41524 -108420 -183371 -66648 34990 -178249 -287496 -293024 -286770
15363 -286770 -184901 -160082 -162728 -68052 39032 153914 115524 -37800 -207953 -136988 41929
15352 41929 200184 125822 129399 67180 -52871 167945 238505 217788 78959 -54835 -50346
15341 -50346 -41829 -30842 -66291 21141 45100 79106 -48070 -160945 -6418 109472 11273
$$ packed form
15419e0806o5555j05681J3113O9339o3564N7588J24051J61558L8726m9271n6776
15408G2722j5699K4926j4391j25511j26953n643J09700K22111J67662j57828k16640
15397f5544n7284p621m0453J38568m6951o3991O714N2626O1683K8791o010p8754
15385g8226K6684J87185r743k01636m6986J70943j5472l7898R3549N1611K3222
15374A63233p6291p7037L1619j49944p4951J16723J01638k13239j09247n528O254
15363b86770J01869K4819k646R4676J07084J14882l8390j53324j70153P0965J78917
15352D1929J58255p4362L577o2219j20051K20816P0560k0717j38829j33794M489
15341e0346Q517J0987l5449Q7432K3959L4006j27176j12875J54527J15890r8199
$$ plain form
15330 11273 -103672 -104259 -75846 115062 111900 224528 146905 90587 228989 162185 34378
15319 34378 -143438 -155742 23845 127360 114364 81717 53928 -30128 -60822 -155656 -269484
15308 -269484 -344247 -233041 -159389 -76268 -80022 -115142 98640 99247 -62535 -185024 -65132
15297 -65132 -41001 -66585 -21463 19544 -21125 -191025 -72863 -54581 -144723 -197372 -293955
15286 -293955 -317454 -300607 -313965 -269121 -353408 -319066 -251081 -341244 -359491 -178399 -96240
15275 -96240 -139193 -104106 -158440 -187537 -376723 -372040 -224713 -54631 -208711 -217284 -74560
15264 -74560 -53532 -70766 -38830 53826 145109 63757 68769 83356 122354 12046 -88105
15253 -88105 -89721 -18871 68701 187376 75740 89051 106251 35434 -178113 -55529 -15716
$$ packed form
15330A1273j14945n87K8413J90908l162J12628p7623n6318J38402o6804j27807
15319C4378j77816j2304J79587J03515j2996l2647k7789q4056l0694r4834j13828
15308b69484p4763J11206P3652Q3121l754l5120K13782O07j61782j22489J19892
15297f5132K4131k5584M5122M1007m0669j69900J18162J8282r0142n2649r6583
15286b93955k3499J6847j3358M4844q4287L4342O7985r0163j8247J81092Q2159
15275i6240m2953L5087n4334k9097j89186M683J47327J70082j54080q573J42724
15264g4560K1028j7234L1936R2656R1283q1352N012J4587L8998j10308j00151
15253h8105j616P0850Q7572J18675j11636J3311J7200p0817k13547J22584L9813
$$ plain form
15242 -15716 -72576 -54982 -90337 -112325 -10765 73996 173364 81519 76169 1352 -86384 -112085
15230 -112085 -37004 -17481 -51819 89248 14923 -113217 -23259 -131928 -66707 -15845 -196408
15219 -196408 -335977 -322594 -289678 -183258 -9191 -127157 -101877 -76551 -43883 -48246 12882
15208 12882 116852 138645 154516 134544 -1512 40611 45686 121439 112242 -93021 -160958
15197 -160958 -88887 -86979 -32585 -54925 -127653 -209870 -287242 -183355 -66351 -90852 -60961
15186 -60961 -73697 -149647 -204122 -66722 -13735 32997 155338 138805 24946 -84635 -46345
15175 -46345 6106 -180496 -276861 -247086 -35836 79491 34459 -59366 -29885 -122354 -139546
15164 -139546 -129518 -129538 -77551 -22762 36880 178363 141778 220947 179452 122034 112614 74281
$$ packed form
15242a5716n6860J7594l5355k1988J01560Q4761R9368r1845n350p4817q7736k5701
15230a12085P5081J9523l4338J41067p4325j28140Q9958j08669O5221N0862j80563
15219a96408j39569J3383L2916J06420J74067j17966K5280K5326L2668m363O1128
15208A2882J03970K1793J5871j9972j36056M2123N075P5753r197k05263o7937
15197a60958P2071J908N4394k2340p2728q2217p7372J03887J17004k4501K9891
15186f0961j2736p5950n4475J37400N2987M6732J22341j6533j13859j09581L8290
15175d6345N2451j86602r6365K9775K11250J15327m5032r3825K9481r2469j7192
15164a39546J0028k0N1987N4789N9642J41483l6585P9169m1495n7418r420l8333
$$ plain form
15152 74281 190936 144745 272332 207222 94616 150000 198594 66533 -69666 4752 -33958
15141 -33958 -220963 -483175 -461668 -404761 -272411 -264306 -261238 -123524 -51348 42471 209186
15130 209186 255601 -38201 -75189 -186480 -169052 11968 21108 159195 270986 268994 114293
15119 114293 2053 -180776 -187487 6600 128360 39546 -151141 -176983 16679 -36075
15109 -36075 -131682 -214617 -179812 -101116 -135565 -311841 -266104 -225129 -65385 35674 -30520
15098 -30520 -189782 -208890 -164665 -72520 166 108118 45035 -60204 -99727 112232 102344
15087 102344 -19344 -55839 29018 127524 -45895 -31379 78190 77744 121033 51304 74768
15076 74768 64655 92034 123621 151395 168701 291118 256705 98006 27478 -48309 -32508
$$ packed form
15152G4281J16655m6191J27587o5110j12606N5384M8594j32061j36199P4418l8710
15141c3958j87005k62212K1507N6907J32350Q105L068J37714P2176R3819J66715
15130B09186M6415k93802l6988j11291J7428J81020R140J38087J11791j992j54701
15119A14293j12240j82829o711J94087J21760q8814j90687k5842J93662n2754
15109c6075r5607q2935L4805P8696l4449j76276M5737M0975J59744J01059o6194
15098c0520j59262j9108M4225R2145P2686J07952o3083j05239l9523K11959r888
15087A02344j21688l6495Q4857R8506j73419J4516J09569m46M3289o9729K3464
15076G4768j0113K7379L1587K7774J7306J22417l4413j58699p0528p5787J5801
$$ plain form
15065 -32508 -14323 -61921 -53527 -71612 -69770 -159325 -56399 -48376 -107959 -175552 -377269 -248366
15053 -248366 -155303 -34765 83787 133585 124640 116036 133339 -13685 -63212 63035 -46940
15042 -46940 -177434 -134236 -192908 -307704 -342215 -245803 -352323 -353481 -284133 -229989 -341491
15031 -341491 -207289 -52805 17699 38837 38014 3016 71234 171883 155223 245554 232953
15020 232953 152760 -36741 -85319 -54459 -32037 -85067 -227851 -153334 25522 -39814 -128472
15009 -128472 -51037 -16062 5300 -114700 -173686 -128985 -120840 -43080 94837 104066 90309
14998 90309 218791 108866 120718 133575 82051 36709 -80593 -236451 -334837 -133626 -11595
14987 -11595 90256 120902 88803 -39427 -241699 -135695 -58542 -61396 -32548 -27559 81076
$$ packed form
15065c2508J8185m7598Q394j8085J842q9555J02926Q023n9583o7593k01717J28903
15053b48366R3063J20538J18552M9798q945q604J7303j47024m9527J26247j09975
15042d6940j30494M3198n8672j14796l4511R6412j06520j158O9348N4144j11502
15031c41491J34202J54484P0504K1138q23l4998O8218J00649j6660R0331j2601
15020B32953q0193j89501m8578L0860K2422n3030j42784P4517J78856o5336q8658
15009a28472P7435L4975K1362j20000n8986M4701Q145P7760J37917R229j3757
14998I0309J28482j09925J1852J2857n1524m5342j17302j55858r8386K01211J22031
14987a1595J01851L0646l2099j28230k02272J06004P7153k854K8848M989J08635
$$ plain form
14976 81076 97694 13957 -48243 -137566 -182558 -33362 -48048 -50333 -50834 -141394 -180169 -65358
14964 -65358 -112293 34518 35281 -95888 12366 23448 60454 47643 -74358 -127621 -73935
14953 -73935 168899 231133 125441 43300 138455 374597 383230 354895 99979 -128637 -212754
14942 -212754 -173635 -186130 -241622 -350135 -433744 -356185 -168681 -57590 -60012 -91338 -103506
14931 -103506 80586 -94775 -168035 589 75254 -92666 -115214 151465 170724 109235
14921 109235 34002 177249 33998 -184459 -289243 -295772 -100740 -79468 -157284 -368766
14911 -368766 -396337 -392545 -176335 116364 31522 -9114 237 -11181 78388 -17078 81318
14900 81318 132176 113647 25152 80952 -74572 -83535 -39326 -171518 -106138 -143738 -202942
$$ packed form
14976H1076J6618q3737o2200q9323m4992J49196j4686k285n01r0560l8775J14811
14964f5358m6935J46811P63j31169J08254J1082L7006j2811j22001n3263N3686
14953g3935K42834O2234j05692q2141R5155K36142Q633k8335k54916k28616q4117
14942b12754L9119j2495n5492j08513q3609P7559J87504J11091k422l1326j2168
14931a03506J84092j75361p3260J68624P4665j67920k2548K66679J9259o1489
14921A09235p5233J43247j43251k18457j04784o529J95032K1272p7816k11482
14911c68766k7571L792K16210K92699q4842m0636R351j1418Q9569r5466R8396
14900H1318N0858j8529q8495N5800j55524q963M4209j32192O5380l7600n9204
$$ plain form
14889 -202942 -321988 -372713 -319868 -209215 -242958 -155400 -97412 -72563 -104966 -29888 143216
14878 143216 60586 -146464 -9984 178563 169996 52803 -40488 26256 -98755 -159203 -185081
14867 -185081 -203978 -365364 -330591 -239722 -140894 -12894 -17109 -87775 -114751 -186748 -139257
14856 -139257 65061 123258 182660 127072 -132531 -340580 -210707 -169600 -222983 -325469
14846 -325469 -400194 -409780 -164943 -92564 -82859 -189871 -160335 -194076 -153702 -324431 -332650
14835 -332650 -190072 -180377 -179037 -183072 -60384 -8058 53055 -29713 136265 164912 42537
14824 42537 -39191 -178887 -259271 -316308 -37954 39251 47760 51309 51860 16737 134448 58173
14812 58173 -46680 -160921 -149009 -163725 18823 134261 184760 133340 33997 -141276 -150647
$$ packed form
14889b02942j19046n0725N2845J10653l3743Q7558N7988K4849l2403P5078J73104
14878A43216q2630k07050J36480J88547q567j17193r3291O6744j25011o0448k5878
14867a85081j8897j61386L4773R0869R8828J28000m215p0666k6976p1997M7491
14856a39257K04318N8197N9402n5588k59603k08049J29873M1107n3383j02486
14846c25469p4725r586K44837P2379R705j07012K9536l3741M0374j70729q219
14835c32650J42578R695J340m035J22688N2326O1113q2768J65978K8647j22375
14824D2537q1728j39696q0384n7037K78354P7205Q509L549N51l5123J17711p6275
14812E8173j04853j14241J1912j4716J82548J15438N0499n1420r9343j75273r371
$$ plain form
14801 -150647 -110837 -133646 -76091 -84222 -104074 -102203 -233910 -260108 -139237 31853 37913
14790 37913 -111812 -135078 -32042 37905 104507 -116721 -295865 -307670 -251520 -153326 -97710
14779 -97710 -130516 -15803 95429 56810 61792 -75353 -48434 -80827 -202768 -157750 -155123
14768 -155123 -267904 -304237 -346490 -149365 -86921 -113855 -149444 -87725 -92675 -6696 5144
14757 5144 -177151 -194987 -153822 -69412 -85225 -105805 -80615 -54020 -16213 4240 3239 59767
14745 59767 81967 23496 -104205 -100804 -75378 -108494 -57211 -1156 -77196 -39719 93195
14734 93195 110417 75293 184719 3987 -101892 -245079 -310675 -136099 25983 117940
14724 117940 90869 72168 107014 327646 429391 310347 141676 115110 -39891 -104630
$$ packed form
14801a50647L9810k2809N7555q131j9852J871j31707k6198J20871J71090O060
14790C7913j49725k3266J03036O9947O6602k21228j79144j1805N6150R8194N5616
14779i7710l2806J14713J11232l8619M982j37145K6919l2393j21941M5018K627
14768a55123j12781l6333m2253J97125O2444k6934l5589O1719m950Q5979J1840
14757E144j82295j7836M1165Q4410j5813k0580K5190K6595L7807K0453j001N6528
14745E9767K2200n8471j27701L401K5426l3116N1283N6055p6040L7477J32914
14734I3195J7222l5124J09426j80732j05879j43187o5596J74576J62082R1957
14724A17940k7071j8701L4846K20632J01745j19044j68671k6566j55001o4739
$$ plain form
14714 -104630 71118 98893 38826 60466 84644 124765 285630 100422 -23684 -32253 173867
14703 173867 341356 415181 368310 149542 13245 -69161 -116181 -114522 -51054 -139922 -147185
14692 -147185 -142937 75863 226741 205474 -25533 -187921 -331012 -298360 -172814 -57212
14682 -57212 100225 -84530 -346702 -393155 -195830 -84532 63182 125256 72051 62425 -75429
14671 -75429 -215273 -362663 -298565 -94473 -25079 -85693 -237873 -291150 11741 258090
14661 258090 293877 6668 -113983 -78025 -92168 44211 -861 -112300 -144839 -12481
14651 -12481 100398 74682 87932 314540 389724 239228 -29788 -261858 -212691 -183250 -189497
14640 -189497 -108033 -172854 -110258 -96138 -56170 -5972 -62234 21922 -37443 -130422 -34633
$$ packed form
14714a04630J75748K7775o0067K1640K4178M0121J60865j85208j24106q569K06120
14703A73867J67489P3825m6871k18768j36297q2406m7020J659O3468q8868p263
14692a47185M248K18800J50878k1267k31007j62388j43091L2652J25546J15602
14682e7212J57437j84755k62172m6453J97325J11298J47714O2074n3205r626j37854
14671g5429j39844j47390O4098K04092O9394o0614j52180n3277L02891K46349
14661B58090L5787k87209j20651L5958j4143J36379m5072j11439l2539J32358
14651a2481J12879k5716J3250K26608P5184j50496k69016k32070M9167K9441o247
14640a89497Q1464o4821O2596J4120L9968N0198n6262Q4156n9365r2979R5789
$$ plain form
14629 -34633 50230 -82585 18946 188032 57064 -106811 -182159 -158254 -127675 -41633 -73290
14618 -73290 -159648 -227481 -308470 -208843 -24775 21262 41665 -103461 -164899 1037 17786
14607 17786 -29955 -140167 -198280 -152871 -114039 -183209 -266684 -250489 -293136 -341308 -276496
14596 -276496 -306196 -396830 -386659 -343252 -252183 -219263 -129608 -229087 -377395 -302159 -90549
14585 -90549 -35695 -42195 -83638 -218118 -76911 14737 6028 -219890 -255521 -229834 -199221
14574 -199221 -86458 26694 46333 -72239 -105151 64373 313197 258281 190915 104876
14564 104876 60439 51893 12650 71586 74899 -55637 46543 206898 107894 148254 41969
14553 41969 -41159 -120117 -99189 -104565 -74372 -119714 -270824 -287358 -360622 -535367 -553029
$$ packed form
14629c4633Q4863j32815J01531J69086j30968j63875p5348K3905L0579Q6042l1657
14618g3290q6358o7833q0989R9627J84068M6037K0403j45126o1438J65936J6749
14607A7786m7741j10212n8113M5409L8832o9170q3475J6195m2647m8172O4812
14596b76496k9700r0634J0171M3407R1069L2920Q9655r9479j48308P5236K11610
14585i0549N4854o500m1443j34480J41207R1648q709k25918l5631K5687L0613
14574a99221J12763J13152J9639j18572l2912J69524K48824n4916o7366q6039
14564A04876m4437q546l9243N8936L313j30536J02180J60355r9004M0360j06285
14553D1969q3128p8958K0928n376L0193m5342j51110j6534p3264j74745j7662
$$ plain form
14542 -553029 -386528 -173672 -159957 -99380 -59109 -39680 -80378 -108049 -200841 -138863 -92512
14531 -92512 -239321 -306968 -141533 -35371 -132542 -24071 -4362 -88005 932 158940 98708
14520 98708 -65038 -153880 -24717 27647 -146789 -176128 -5289 -36303 14110 15062 35805
14509 35805 -13010 -84777 -127598 -106136 25240 -35978 35509 53475 -11220 102386 26972
14498 26972 -30016 -88558 -82189 -160130 15013 -218 -172120 -200602 -155258 -61187 -984
14487 -984 -87135 -58901 28409 -50909 -107865 -83816 -159685 -257275 -209245 -117415 -9414 -136947
14475 -136947 -254822 -275434 -546601 -467434 -206307 -150275 -67690 85668 270055 277968 237361
14464 237361 110351 177609 85612 -43333 -113014 -221223 -285271 -138001 -184325 -177785 43373
$$ packed form
14542e53029J66501K12856J3715O0577M0271J9429m0698k7671r2792O1978M6351
14531i2512j46809o7647J65435J06162r7171J08471J9709q3643Q8937J58008o0232
14520I8708j63746q8842J29163N2364j74436k9339J70839l1014N0413R52K0743
14509C5805m8815p1767m2821K1462J31376o1218P1487J7966o4695J13606p5414
14498B6972n6988n8542O369p7941J75143j5231j71902k8482M5344R4071O0203
14487i84q6151K8234Q7310p9318n6956K4049p5869r7590M8030R1830J08001j27533
14475a36947j17875k0612k71167P9167K61127N6032Q2585J53358J84387P913m0607
14464B37361j27010O7258r1997j28945o9681j08209o4048J47270m6324O540K21158
$$ plain form
14453 43373 299713 270647 129476 -20459 -69546 116527 59173 84744 187602 265143 115423
14442 115423 -40101 -118977 -283089 -270605 -287723 -158256 -103260 71886 260652 395601
14432 395601 243494 116337 159944 97815 -36313 -155282 -6260 -56151 -430 -72935
14422 -72935 -36054 27443 17325 41561 106572 -31039 -8892 125503 3849 -52429 -4422
14411 -4422 28420 -171468 -178813 107128 175638 164884 61674 -21770 -31185 2512 -91871 -195244
14399 -195244 1254 175144 1079 -117103 -145812 -68751 21315 130179 -20873 -259151
14389 -259151 -153598 -14514 14328 99683 131106 121885 -28531 -144469 -135505 -114377 -123410
14378 -123410 44566 78732 -159015 -113083 -37603 -14535 1402 -1098 -19173 56005 79582
$$ packed form
14453D3373K56340k9066j41171j49935m9087J86073n7354K5571J02858P7541j49720
14442A15423j55524p8876j64112J2484j7118J29467N4996J75146J88766J34949
14432C95601j52107j27157M3607o2129j34128j18969J49022m9891N5721p2505
14422g2935L6881O3497j0118K4236O5011j37611K2147J34395j21654n6278M8007
14411d422L2842j99888p345K85941O8510j0754j03210q3444r415L3697r4383j03373
14399a95244J96498J73890j74065j18182k8709P7061R0066J08864j51052k38278
14389b59151J05553J39084K8842Q5355L1423r221j50416j15938Q964K1128r033
14378a23410J67976L4166k37747M5932P5480K3068J5937k500j8075P5178K3577
$$ plain form
14367 79582 59959 230537 327002 221589 199681 214569 171825 231549 300316 309257 247168
14356 247168 168737 40932 -13147 -2292 -130124 -143192 -64103 -161257 -132859 -2240 -50538
14345 -50538 88193 147900 132179 172266 26308 -8380 57797 -12793 -18275 -67333 -3305
14334 -3305 61618 -54945 23722 11259 39207 54657 98485 -12269 38367 54831 29073
14323 29073 -38441 -170034 -191557 -167470 -7444 214327 126336 184922 188821 6893 -170972
14312 -170972 -140381 -65021 -184835 41033 34666 91349 332851 370319 254517 127241 34738
14301 34738 -70447 -31824 16231 -12825 33585 150683 88112 133309 176546 175153 15393
14290 15393 129336 228307 6286 -90544 39737 31126 -55080 -215384 -252645 -151655 -10540
$$ packed form
14367G9582j9623J70578R6465j05413k1908J4888m2744N9724O8767Q941o2089
14356B47168p8431j27805n4079J0855j27832j3068P9089r7154K8398J30619m8298
14345e0538J38731N9707j5721M0087j45958l4688O6177p0590n482m9058O4028
14334c305O4923j16563P8667j2463K7948J5450M3828j10754N0636J6464k5758
14323B9073o7514j31593k1523K4087J60026K21771q7991N8586L899j81928j77865
14312a70972L0591P5360j19814K25868o367N6683K41502L7468j15802j27276r2503
14301C4738j05185L8623M8055k9056M6410J17098o2571M5197M3237j393j59760
14290A5393J13943R8971k22021r6830J30281q611q6206j60304l7261J00990J41115
$$ plain form
14279 -10540 124353 194330 219752 251798 234582 174915 148507 -10348 -230956 -211752 -44366
14268 -44366 194313 224475 226124 -20214 -148352 -284213 -143048 -85859 -40524 -69132 -76798
14257 -76798 -121731 -140438 82646 225543 98226 -40009 -264 30725 58504 52490 -167330
14246 -167330 -119441 -11741 18626 -32650 161418 215663 256605 187594 129874 222908 270173
14235 270173 85944 -57486 -100331 -132747 59553 116502 1362 -392 -139765 -183435 -182279
14224 -182279 -268731 -286926 -151475 12172 -156870 -143005 18488 -5255 -20559 -65972 99857
14213 99857 182240 49623 -125000 -171175 -159660 -165477 -56257 -72896 -178577 -72695 25328
14202 25328 27092 -170286 -285636 -180252 -292794 -233056 -11665 52867 14995 -11355 51178
$$ packed form
14279a0540J34893O9977K5422L2046j7216n9667k6408j58855k20608J9204J67386
14268d4366K38679L0162J649k46338j28138j35861J41165N7189M5335k8608p666
14257g6798m4933j8707K23084J42897j27317j38235L9745L0989K7779o014k19820
14246a67330M7889J07700L0367n1276J94068N4245M0942o9011n7720R3034M7265
14235B70173j84229j43430m2845l2416J92300N6949j15140j754j39373m3670J156
14224a82279q6452j8195J35451J63647j69042J3865J61493k3743j5304m5413J65829
14213I9857Q2383j32617j74623m6175J1515n817J09220j6639j05681J05882R8023
14202B5328J764j97378j15350J05384j12542N9738K21391O4532l7872k6350O2533
$$ plain form
14191 51178 156032 35534 51031 80950 37001 -180501 -277233 -330057 -435084 -360048 -144651
14180 -144651 -54908 -11517 199232 137272 73209 102053 -739 -36011 -72893 3386 83299
14169 83299 -22692 -98666 -63845 -174516 -190515 -75919 40025 19204 -124503 -66188 47493
14158 47493 14218 -24113 -44855 -172721 -212243 -143687 -61402 -94316 -86336 -242853 -298337
14147 -298337 -310775 -278586 -223870 -192165 -178038 -312525 -348086 -292182 -414964 -464101 -435291
14136 -435291 -365804 -208493 -160430 -107676 -138447 -180357 -22901 -66634 -231082 -93356 101929
14125 101929 73748 14046 -49953 -5904 -83756 31712 125735 -1592 -116030 -90000 -201300
14114 -201300 -308575 -416819 -226735 -141174 -177339 -247734 -93906 156383 140915 174107
$$ packed form
14191E1178J04854j20498J5497K9919m3949k17502r6732n2824j05027P5036K15397
14180a44651Q9743M3391K10749o1960o4063K8844j02792l5272l6882P6279P9913
14169H3299j05991p5974L4821j10671j5999J14596J15944k0821j43707N8315J13681
14158D7493l3275l8331k0742j27866l9522O8556Q2285l2914P980j56517n5484
14147b98337j2438L2189N4716L1705J4127j34487l5561N5904j22782m9137K8810
14136d35291O9487J57311M8063N2754l0771m1910J57456m3733j64448J37726J95285
14125A01929k8181n9702o3999M4049p7852J15468R4023j27327j14438K6030j11300
14114b01300j07275j08244J90084Q5561l6165p0395J53828K50289j5468L3192
$$ plain form
14104 174107 158248 -28522 -253912 -377696 -469351 -384085 -207580 -103113 -79722 -8256
14094 -8256 -76764 -1013 56533 11190 -163692 -266251 -136155 -80938 -73999 -13029 -16387 -105956
14082 -105956 -192751 -168767 -142655 -29854 65736 -29399 -168241 -190992 -183923 -152647 -130373
14071 -130373 -56161 8338 -53081 -153574 -51874 133891 -44493 -148164 -77018 34293
14061 34293 -63020 -64165 60997 -7387 -161116 4816 58521 -53965 101360 247041 305079
14050 305079 217877 89783 48917 92741 49187 -158278 -134331 -103137 -141917 -269852 -238760
14039 -238760 -138135 -32343 40881 185351 120439 27365 39989 90832 44717 14550 -159516
14028 -159516 -246693 -173767 -143321 -67889 113582 228141 85419 -125833 -106331 -56526 -29390
$$ packed form
14104A74107j5859j86770k25390j23784r1655Q5266J76505J04467K3391P1466
14094h256o8508P5751N7546m5343j74882j02559J30096N5217O939O0970l358q9569
14082a05956q6795K3984K6112J12801R5590r5135j38842k2751P069L1276K2274
14071a30373P4212O4499o1419j00493J01700J85765j78384j03671P1146J11311
14061C4293r7313j145J25162o8384j53729J65932N3705j12486J55325J45681N8038
14050C05079q7202j28094m0866M3824m3554k07465K3947L1194l8780j27935L1092
14039b38760J00625J05792P3224J44470o4912r3074J2624N0843m6115l0167j74066
14028a59516q7177P2926L0446P5432J81471J14559j42722k11252J9502M9805K7136
$$ plain form
14017 -29390 28290 64474 155102 75018 50194 -55756 -258481 -423931 -484630 -311649 -109954
14006 -109954 -108518 -48922 23772 24361 -3918 62487 230804 273971 197600 252027 280445 97767
13994 97767 82134 81716 85879 79742 20929 -28393 110739 113972 -131040 -113325 -27630 106971
13982 106971 156325 182825 42945 -173755 -323484 -195728 112716 114377 34435 -215738
13972 -215738 -396525 -366752 -209155 -40787 -57623 -44527 -31936 9394 -87351 -69527 22496
13961 22496 -4839 469 -88780 -49192 -28688 -6192 -154706 -252149 -322334 -228788 -91846
13950 -91846 -102159 -103468 -51210 -52475 -148344 -287864 -361026 -262098 -282322 -127878 -14167
13939 -14167 -53960 -80167 147618 91848 1262 -66477 -67101 61505 78413 106973 130859 32230
$$ packed form
14017b9390N7680L6184R0628q0084k4824j05950k02725j65450o0699J72981K01695
14006a09954J436N9596P2694N89k8279O6405J68317M3167p6371N4427K8418j82678
13994I7767j5633m18M163o137n8813m9322J39132L233k45012J7715Q5695J34601
13982A06971M9354K6500j39880k16700j49729J27756L08444J661p9942k50173
13972b15738j80787K9773J57597J68368j6836J3096J2591M1330r6745J7824R2023
13961B2496k7335N308q9249L9588K0504K2496j48514r7443p0185R3546J36942
13950i1846j0313j309N2258j265r5869j39520p3162R8928k0224J54444J13711
13939a4167l9793k6207K27785n5770r0586o7739o24J28606J6908K8560K3886r8629
$$ plain form
13927 32230 22906 122325 134918 146824 244531 373399 285438 235918 245764 299445 252567 152651
13915 152651 114044 67985 9588 -77059 -110046 14854 109333 130132 257777 278116 104703
13904 104703 143757 251816 193360 16123 119228 177008 90141 17702 48160 11343 10498
13893 10498 -20749 17263 -36977 -137752 -115276 -225398 -193402 -191541 -52778 229995 165116
13882 165116 -3573 -94530 -7790 111356 80102 125686 -20057 77672 330420 376500 128765
13871 128765 -95071 -280846 -212897 -77467 -44538 -24367 -123801 -22618 115438 180459
13861 180459 -668 -52251 -57654 -203889 -246817 -205882 -141515 -62518 6108 -30914 15839
13850 15839 -81429 -217537 -115221 -10999 12709 189804 338940 338523 328555 165882 3522
$$ packed form
13927C2230r324R9419J2593J1906R7707J28868q7961m9520R846N3681m6878r9916
13915A52651l8607m6059n8397q6647l2987J24900R4479K0799J27645K0339j73413
13904A04703L9054J08059n8456j77237J03105N7780q6867p2439L0458l6817q45
13893A0498l1247L8012n4240j00775K2476j10122L1996J861J38763K82773o4879
13882A65116j68689r0957Q6740J19146l1254M5584j45743R7729K52748M6080k47735
13871A28765k23836j85775O7949J35430L2929K0171r9434J01183J38056O5021
13861A80459j81127n1583n403j46235m2928M0935O4367P8997O8626l7022M6753
13850A5839r7268j36108J02316J04222K3708J77095J49136m17r968j62673j62360
$$ plain form
13839 3522 24900 62422 111451 16478 2454 -140823 -249845 20981 91364 -32581 25652
13828 25652 120709 189051 321136 375442 257316 162274 230122 35721 -52516 -102695 -73680
13817 -73680 -15113 -24576 -19875 -4050 -64308 33858 117436 337046 277641 -52724 25436 171438
13805 171438 254644 410074 414077 237253 140508 83221 -74331 -58297 6867 94855 105852
13794 105852 104013 299347 245504 -50513 -187753 -274928 -129167 -171102 -196766 -115747 -27100
13783 -27100 -194145 -362197 -231303 28420 100668 232047 219750 35658 35479 125773 186448
13772 186448 302774 360412 182349 64812 99091 35850 136827 55714 -20440 -127498
13762 -127498 -161356 -81756 -14646 204071 199431 30500 -36585 -11445 -42829 78607 245606
$$ packed form
13839C522K1378L7522M9029r4973j4024j43277j09022K70826P0383j23945N8233
13828B5652R5057O8342J32085N4306j18126r5042O7848j94401q8237n0179K9015
13817g3680N8567r463M701J5825o0258R8166Q3578K19610n9405l30365P8160J46002
13805A71438Q3206J55430M003j76824r6745n7287j57552J6034O5164Q7988J0997
13794A05852j839J95334n3843k96017j37240q7175J45761m1935k5664Q1019Q8647
13783b7100j67045j68052J30894K59723P2248J31379j2297j84092j79R0294O0675
13772A86448J16326N7638j78063j17537L4279o3241J00977q1113p6154j07058
13762a27498l3858P9600O7110K18717m640j68931o7085K5140l1384J21436J66999
$$ plain form
13751 245606 131198 -141683 -208993 -69677 -172302 -216440 14074 165730 291139 375155
13741 375155 256529 215397 237416 157915 227800 258746 245860 332476 388777 258172 -16859
13730 -16859 -84229 112443 138787 -16735 54728 241458 313453 171299 21326 -6343 90627
13719 90627 190690 154614 189547 141553 21891 -97151 48016 1621 40949 -4104 -67960
13708 -67960 -49197 -29362 83942 -6744 -28625 -49210 -45829 -10130 90436 47658 -13151
13697 -13151 -8418 -42640 -13118 66478 28180 -50130 -112962 13009 87741 -109215 -85773
13686 -85773 -19816 10161 -81065 66338 63725 -33205 -151351 -38352 -170922 -279908 -111038
13675 -111038 21712 16685 1463 -15 20687 230601 185073 62987 5307 -6770 95235
$$ packed form
13751B45606j14408k72881o7310J39316j02625m4138K30514J51656J25409Q4016
13741C75155j18626m1132K2019p9501O9885L0946j2886Q6616N6301j30605k75031
13730a6859o7370J96672K6344j55522P1463J86730P1995j42154j49973k7669R6970
13719I0627J00063l6076L4933m7994j19662j19042J45167m6395L9328m5053o3856
13708f7960J8763J9835J13304r0686k1881k0585L381L5699J00566m2778o0809
13697a3151M733l4222K9522P9596l8298p8310o2832J25971P4732j96956K3442
13686h5773O5957K9977r1226J47403k613r6930j18146J12999j32570j08986J68870
13675a11038J32750n027j5222j478K0702K09914m5528j22086n7680j2077J02005
$$ plain form
13664 95235 179433 72267 89038 113029 55526 -74309 -52220 -19412 -71950 -21736 -52809
13653 -52809 -106404 -236660 -148698 3098 102224 155964 81137 -88218 -176217 -120667 -28525
13642 -28525 62950 153592 66735 95858 222946 120770 90479 135343 -4601 -154899 -113524
13631 -113524 -7425 -86617 -247969 -206652 -154240 49198 -57774 -64482 -45788 -56563 55667
13620 55667 19380 37545 -119480 -239425 -189647 -172492 -248665 -335015 -421043 -330346 -139380
13609 -139380 -158900 -173747 -58043 49068 23252 -31233 -40540 -134742 -209603 -186640 -45734
13598 -45734 39 -164740 -199312 -273362 -209606 -95741 -8240 32935 4898 16871 -44928
13587 -44928 -140630 -70542 -212295 -200256 -67470 197017 135816 -2306 -168547 -208950 -100478
$$ packed form
13664I5235Q4198j07166J6771K3991n7503j29835K2089L2808n2538N0214l1073
13653e2809n3595j30256Q7962J51796R9126N3740p4827j69355q7999N5550R2142
13642b8525R1475R0642q6857K9123J27088j02176l0291M4864j39944j50298M1375
13631a13524J06099p9192j61352M1317N2412K03438j06972o708J8694j0775J12230
13620E5667l6287J8165j57025j19945M9778J7155p6173q6350q6028R0697J90966
13609a39380j9520j4847J15704J07111k5816n4485r307r4202p4861K2963J40906
13598d5734M5773j64779l4572p4050O3756J13865Q7501M1175k8037J1973o1799
13587d4928r5702P0088j41753J2039J32786K64487o1201j38122j66241m0403J08472
$$ plain form
13576 -100478 -14062 226986 234093 149196 93032 -19202 -98892 -27963 121261 198791 96610
13565 96610 -14432 -95647 45712 -11270 -60825 -12259 -30217 -52936 -70148 -69 88472
13554 88472 44636 -43188 23769 75388 55187 43870 -13742 102937 131355 247473 226814
13543 226814 242179 213636 195303 159442 -2294 -15257 -129568 -72383 110163 152633 -133793
13532 -133793 -268008 -225211 -114913 -201367 -31193 68337 187639 255582 338319 163126
13522 163126 -4677 38693 178978 324932 344525 277228 209920 164427 87162 -51397 -32587
13511 -32587 -13873 -196673 -278529 -303116 -185248 -18337 190799 114410 66983 158923 119336
13500 119336 -10214 -207297 -384114 -411002 -292374 -82910 -68830 -157558 -210528 -60618
$$ packed form
13576a00478Q6416K41048P107q4897n6164j12234p9690P0929J49224P7530j02181
13565I6610j11042q1215J41359n6982m9555M8566j7958k2719j7212P0079Q8541
13554H8472m3836q7824O6957N1619k0201j1317n7612J16679K8418J16118k0659
13543B26814J5365k8543j8333l5861j61736j2963j14311N7185J82546M2470k86426
13532a33793j34215M2797J10298q6454J70174R9530J19302O7943Q2737j75193
13522A63126j67803M3370J40285J45954J9593o7297o7308m5493p7265j38559J8810
13511c2587J8714j82800q1856k4587J17868J66911K09136p6389m7427R1940l9587
13500A19336j29550j97083j76817k6888J18628K09464J4080q8728n2970J49910
$$ plain form
13490 -60618 2984 142227 214003 151746 178458 323301 304587 215050 242361 270141 226161
13479 226161 185305 38082 -25531 -10354 -34567 31434 71029 131550 237846 108858 76242
13468 76242 18437 -35541 60193 75569 73560 35114 28071 39619 5679 -35296 171833 361983
13456 361983 318038 143690 145578 -4571 25559 -64924 -992 -77809 -355848 -320222 -384977
13445 -384977 -404144 -272944 -263509 -395210 -542430 -365087 -130513 -156604 -155576 -77540 -109170
13434 -109170 5656 143899 144759 161374 96143 -5327 -14293 -59526 -87325 -23980 1994
13423 1994 -124269 -90770 3123 4310 3543 -152530 -61512 -99842 -39728 83199 209123 298440
13411 298440 240181 292752 233188 127003 139440 98178 94634 152704 165272 16620 -104120
$$ packed form
13490f0618O3602J39243P1776o2257K6712J44843j8714q9537K7311K7780m3980
13479B26161m0856j47223o3613J5177k4213O6001L9595O0521J06296j28988l2616
13468G6242n7805n3978R5734J5376k009l8446p043J1548l3940m0975K07129J90150
13456C61983m3945j74348J888j50149L0130r0483O3932p6817k78039L5626o4755
13445c84977j9167J31200R435j31701j47220J77343K34574k6091J028P8036l1630
13434a09170J14826J38243Q60J6615o5231j01470q966m5233k7799O3345K5974
13423A994j26263L3499R3893J187p67j56073R1018l8330O0114J22927J25924Q9317
13411B98440n8259N2571n9564j06185J2437m1262l544N8070J2568j48652j20740
$$ plain form
13400 -104120 17279 144017 16272 -282 -68983 -112314 -176144 -181284 -93391 -43125 -100547
13389 -100547 -40492 72440 -91731 -106810 -137421 -104657 67478 118541 142559 40298 -106103
13378 -106103 -154572 -156646 -142093 46279 72209 -91558 -90733 41281 -76400 -186548 -162980
13367 -162980 -173131 -168512 -93151 -176608 -177656 -151811 -70514 38861 47570 29453 94277 124030
13355 124030 -2906 109896 56064 -21355 -41590 -14364 93579 72567 49376 51971 17807
13344 17807 -9219 43913 -24536 -33745 93067 54405 99961 -34763 -53747 70663 -33811
13333 -33811 -74594 -120497 -97605 -131051 -85185 -124787 -158649 -17212 57780 100497 17987
13322 17987 44459 214132 239942 204586 176550 112527 160383 176871 241067 12063 -246639
$$ packed form
13400a04120J21399J26738j27745j6554o8701m3331o3830n140Q7893N0266n7422
13389a00547O0055J12932j64171j5079l0611L2764J72135N1063K4018j02261j46401
13378a06103m8469k074J4553J88372K5930j63767Q25J32014j17681j10148K3568
13367a62980j0151M619P5361q3457j048K5845Q1297J09375Q709j8117O4824K9753
13355A24030j26936J12802n3832p7419k0235K7226J07943k1012k3191K595l4164
13344A7807k7026N3132o8449r209J26812l8662M5556j34724j8984J24410j04474
13333c3811m0783m5903K2892l3446M5866l9602l3862J41437P4992M2717q2510
13322A7987K6472J69673K5810l5356k8036o4023M7856J6488O4196k29004k58702
$$ plain form
13311 -246639 -180139 -190349 -152517 -271019 -450746 -225582 48320 111582 123923 -82669
13301 -82669 -92479 -141963 -98417 135541 220778 192328 193381 153161 111265 -62392 -151362 -269365
13289 -269365 -322343 -202204 96748 114392 146940 73522 4082 -81675 -18122 -64854 57304
13278 57304 45895 16605 -78083 -109320 -82491 -62710 -142326 -123266 89393 213782 178199
13267 178199 30405 -99279 -21779 133865 195898 307774 245148 -47131 -116029 11169
13257 11169 70778 -8629 1173 -80746 103242 354066 354265 285278 144855 127680 307747
13246 307747 364319 290948 129445 196185 38458 -112565 -99128 69271 48108 260774
13236 260774 181910 57519 306480 400673 281605 253830 313793 218907 206491 225726 228533
$$ packed form
13311b46639O6500j0210L7832j18502j79727K25164K73902O3262J2341k06592
13301h2669r810m9484M3546K33958Q5237k8450J053m0220m1896j73657q8970j18003
13289b69365n2978J20139K98952J7644L2548p3418o9440q5757O3553m6732J22158
13278E7304j1409k9290r4688l1237K6829J9781p9616J9060K12659J24389l5583
13267A78199j47794j29684P7500J55644O2033J11876o2626k92279o8898J27198
13257A1169N9609p9407R802q1919J83988K50824J99o8987j40423j7175J80067
13246C07747N6572p3371j61503O6740j57727j51023J3437J68399k1163K12666
13236B60774p8864j24391K48961R4193j19068k7775N9963r4886j2416J9235K807
$$ plain form
13225 228533 260473 104805 26958 121577 194934 207181 233214 176561 31979 -29929 86893
13214 86893 234851 240168 -50079 -275750 -309778 -339124 -426092 -268957 -80455 -36243 51056
13203 51056 27957 5444 39193 -34336 -323712 -471223 -496592 -316029 -155438 60043 -41457
13192 -41457 -90491 -154604 -53453 152501 226999 217776 163758 152987 250974 237804 57414
13181 57414 105081 36598 -88656 -194804 -6777 45399 80513 156582 -67239 -131073 -158167
13170 -158167 -95449 91769 273122 226116 191855 324948 561934 504559 293604 56207
13160 56207 74629 83762 13066 -57168 -59263 -83759 -89864 114386 240621 186452 94392 5863
13148 5863 67846 157788 181120 -794 -18878 -9068 -130829 -231078 -76837 56820 83985
$$ packed form
13225B28533L1940j55668p7847R4619P3357J2247K6033n6653j44582o1908J16822
13214H6893J47958N317k90247k25671l4028k9346q6968J57135J88502M4212Q7299
13203E1056k3099k2513L3749p3529k89376j47511k5369J80563J60591K15481j01500
13192d1457m9034o4113J01151K05954P4498r223n4018j0771R7987j3170j80390
13181E7414M7667o8483j25254j06148J88027N2176L5114P6069k23821o3834k7094
13170a58167O2718J87218J81353m7006l4261J33093K36986n7375k10955k37397
13160E6207J8422R133p0696p0234k095k4496o105K04250J26235n4169r2060q8529
13148E863O1983Q9942K3332j81914j8084R810j21761j00249J54241J33657K7165
$$ plain form
13137 83985 148764 112461 199813 368343 454209 285048 181723 141667 78200 -83309 37922
13126 37922 75214 -58911 -72462 -56028 65232 69603 180956 338659 344475 247159 219225
13115 219225 193126 190899 123994 76466 157895 116550 58131 206857 404834 509128 397738
13104 397738 308602 243866 286951 336554 316896 117520 104582 277929 220742 146247 123725
13093 123725 60062 21211 -103035 -48995 112868 164500 33951 -105236 -34286 -17859 20981
13082 20981 92341 217604 332231 226199 270928 426492 408334 338567 534690 815246
13072 815246 898346 983041 991246 865787 717573 575222 475295 380712 388897 429810 468743
13061 468743 472456 525023 483367 561682 611004 474841 297462 372109 342686 272170 269891
$$ packed form
13137H3985O4779l6303Q7352J68530Q5866j69161j03325m0056o3467j61509J21231
13126C7922L7292j34125j3551J6434J21260M371J11353J57703N816r7316k7934
13115B19225k6099k227o6905m7528Q1429m1345n8419J48726J97977J04294j11390
13104C97738q9136o4736M3085M9603j9658j99376j2938J73347n7187p4495k2522
13093A23725o3663l8851j24246N4040J61863N1632j30549j39187P0950J6427L8840
13082B0981P1360J25263J14627j06032M4729J55564j8158o9767J96123K80556
13072H15246Q3100Q4695Q205j25459j48214j42351r9927r4583Q185M0913L8933
13061D68743L713N2567m1656P8315M9322j36163j77379P4647k9423p0516k279
$$ plain form
13050 269891 127458 109032 115917 -20737 -30282 149257 193937 324641 433070 291913 196518
13039 196518 262139 361966 293288 148757 94503 237587 483753 757902 882068 1313222
13029 1313222 1590690 2097842 2753959 3179848 3206200 2905477 2351833 1743159 1055106 805814
13019 805814 733804 684894 535201 610716 471457 350462 434922 466980 497576 388648 459265
13008 459265 518952 574760 560567 543307 478574 368574 440761 498511 546891 563131 632995
12997 632995 632946 485726 435130 433942 391642 488332 558992 624626 652924 736003 887469 959798
12985 959798 1136416 1595234 2114423 2888361 3448735 3394294 3046361 2324248 1744325 1421608
12975 1421608 1140020 1017276 836635 672692 573561 647360 722286 646217 549565 344215
$$ packed form
13050B69891j42433j8426O885j36654r545J79539M4680J30704J08429j41157r5395
13039A96518O5621R9827o8678j44531n4254J43084K46166K74149J24166M31154
13029A313222K77468N07152O56117M25889K6352l00723n53644o08674o88053k49292
13019H05814p2010m8910j49693P5515j39259j20995Q4460L2058L0596j08928P0617
13008D59265N9687N5808j4193j7260o4733j10000P2187N7750M8380J6240O9864
12997F32995m9j47220n0596j188m2300R6690P0660O5634K8298Q3079J51466P2329
12985I59798J76618M58818N19189P73938N60374n4441l47933p22113n79923l22717
12975A421608k81588j22744j80641j63943r9131P3799P4926p6069r6652k05350
$$ plain form
12965 344215 194828 352062 388261 358853 460754 373368 264366 129651 11759 61129
12955 61129 92601 -100559 -212053 96453 247686 326646 260566 141990 3071 -85059
12945 -85059 60144 123384 263969 344717 292319 379981 608444 864125 1040112 1270194
12935 1270194 1581644 1262555 845122 565108 375793 209030 381847 463107 332480 246987
12925 246987 164665 296413 279987 289360 429163 443750 451802 452339 235570 119669 266932
12914 266932 358732 357349 305811 213343 102572 30578 53265 85997 64481 90966 136178
12903 136178 295532 488542 647431 538892 391375 328558 366456 386905 178869 26510
12893 26510 -4012 -106360 124858 317288 187136 117567 302563 326578 309269 377065 207017
$$ packed form
12965C44215j49387J57234L6199k9408J01901q7386j09002j34715j17892M9370
12955F1129L1472j93160j11494L08506J51233P8960o6080j18576j38919q8130
12945h5059J45203O3240J40585Q0748n2398Q7662K28463K55681J75987K30082
12935A270194L11450l19089m17433k80014j89315j66763J72817Q1260j30627q5493
12925B46987q2322J31748j6426R373J39803J4587Q052N37k16769j15901J47263
12914B66932R1800j383n1538r2468j10771p1994K2687L2732k1516K6485M5212
12903A36178J59354J93010J58889j08539j47517o2817L7898K0449k08036j52359
12893B6510l0522j02348K31218J92430j30152o9569J84996K4015j7309O7796j70048
$$ plain form
12882 207017 103441 83960 -47437 -90343 -176 -45310 82491 100386 30436 22384 56467
12871 56467 336039 407446 250620 144997 188989 271304 120901 81825 64007 93376 179795
12860 179795 318803 286086 168456 101900 108863 -79112 -235309 -368896 -279950 -185410 -291554
12849 -291554 -248375 16768 100543 139532 180624 193821 265624 318827 300582 343362 143666
12838 143666 87309 13094 13042 134900 101800 159669 230932 27703 -167490 -177344 -104056 131418
12826 131418 115014 224355 241296 168319 350977 280389 144590 151941 217712 90200 11421
12815 11421 96599 183722 135044 198366 340592 418436 383636 441680 346722 360282 366766 363150
12803 363150 263122 188698 215346 63192 -3795 165818 248541 327803 286331 334544 401808
$$ packed form
12882B07017j03576j9481j31397m2906R0167m5134J27801J7895o9950q052L4083
12871E6467K79572P1407j56826j05623M3992Q2315j50403l9076j7818K9369Q6419
12860A79795J39008l2717j17630o6556O963j87975j56197j33587Q8946R4540j06144
12849b91554M3179K65143Q3775L8989M1092J3197P1803N3203j8245M2780j99696
12838A43666n6357p4215n2J21858l3100N7869P1263k03229j95193r854P3288K35474
12826A31418j6404J09341J6941p2977J82658p0588j35799P351O5771j27512p8779
12815A1421Q5178Q7123m8678O3322J42226P7844l4800N8044r4958J3560O484l616
12803C63150j00028p4424K6648j52154o6987J69613Q2723P9262m1472M8213O7264
$$ plain form
12792 401808 515617 491642 524992 429728 403508 212119 42590 169633 237063 141944 43649
12781 43649 163660 288308 302393 208153 215345 253131 393287 399852 345661 383056 427945
12770 427945 419799 329846 329726 204611 101769 176062 154943 -24903 -28035 7148 63943 36196
12758 36196 55502 104721 91170 40599 178337 131012 85966 104379 203617 272169 310619
12747 310619 222217 90065 -105207 -107686 132631 179026 187283 133136 210406 301343 282241
12736 282241 166770 92387 123903 123698 32948 11485 111803 128032 34148 -63532 -79960
12725 -79960 70428 245347 221497 120751 317858 460518 416455 400735 377812 308870 215117
12714 215117 195388 157226 241597 319171 347737 383611 288532 173316 168525 248692 214295
$$ packed form
12792D01808J13809k3975L3350r5264k6220j91389j69529J27043O7430r5119r8295
12781D3649J20011J24648J4085r4240P192L7786J40156O565n4191L7395M4889
12770D27945q146q9953j20j25115j02842P4293k1119j79846l132L5183N6795k7747
12758C6196J9306M9219j3551n0571J37738m7325m5046J8413R9238O8552L8450
12747C10619q8402j32152j95272k479K40317M6395Q257n4147P7270R0937j9102
12736B82241j15471p4383L1516k05r0750k1463J00318J6229r3884r7680j6428
12725g9960J50388J74919k3850j00746J97107J42660m4063j5720k2923o8942r3753
12714B15117j9729l8162Q4371P7574K8566L5874r5079j15216m791Q0167l4397
$$ plain form
12703 214295 284941 550702 589910 525346 456641 316591 321455 226910 186090 292496 380512
12692 380512 641721 582408 438125 343317 409368 456485 492815 497819 561365 520547 497925
12681 497925 573719 627566 456040 303486 215505 235330 344282 306678 166987 171024 377742
12670 377742 429278 351501 275451 274971 372256 421913 397538 350941 443413 356196 220845 149816
12658 149816 279649 386978 283577 181061 252776 370824 435390 375141 279408 291667
12648 291667 224955 305715 85733 60169 107375 236432 418149 524480 547943 615964 618711
12637 618711 541163 565356 414921 314498 344191 515107 532120 389938 79218 39043
12627 39043 118291 275610 395643 412725 495688 351419 229588 238990 251233 339021 324122
$$ packed form
12703B14295P0646K65761L9208o4564o8705j40050M864r4545m0820J06406Q8016
12692C80512K61209n9313j44283r4808O6051M7117L6330N004O3546m0818k2622
12681D97925P5794N3847j71526j52554q7981J9825J08952l7604j39691M037K06718
12670C77742N1536p7777p6050m80R7285M9657k4375m6597R2472q7217j35351p1029
12658A49816J29833J07329j03401j02516P1715J18048O4566o0249r5733J2259
12648B91667o6712Q0760k19982k5564M7206J29057J81717J06331K3463O8021K747
12637F18711p7548K4193j50435j00423K9693J70916J7013j42182l10720m0175
12627C9043P9248J57319J20033J7082Q2963j44269j21831R402J2243Q7788j4899
$$ plain form
12616 324122 440108 436602 310230 297201 362365 385203 511961 498828 689093 746547 735996
12605 735996 571190 425415 350846 559739 683583 706949 681038 591876 595823 543913 474397
12594 474397 339812 269823 375754 576288 416190 309278 493667 545310 606989 693916
12584 693916 751489 759277 496244 464364 567463 577863 378028 316282 327377 389746 461112
12573 461112 531074 512048 538900 610741 472893 477294 561346 525394 460755 462356 363453 343780
12561 343780 427236 334679 288849 178111 82065 149359 155272 188693 209052 212546 284918 211404
12549 211404 276228 386067 604233 669540 754237 578134 440644 463482 495682 289372
12539 289372 344359 383735 202586 139033 222358 406189 513477 400587 373712 427184 253653
$$ packed form
12616C24122J15986l506j26372j3029O5164K2838J26758j3133J90265N7454j0551
12605G35996j64806j45775p4569K08893J23844K3366k5911q9162L947n1910o9516
12594D74397j34585o9989J05931K00534j60098j06912J84389N1643O1679Q6927
12584F93916N7573P788k63033l1880J03099J0400j99835o1746J1095O2369P1366
12573D61112O9962j9026K6852P1841j37848M401Q4052l5952o4639J601r8903j9673
12561C43780Q3456r2557m5830j10738r6046O7294N913L3421K0359L494P2372p3514
12549B11404O4824J09839K18166O5307Q4697j76103j37490K2838L2200k06310
12539B89372N4987L9376j81149o3553Q3325J83831J07288j12890k6875N3472j73531
$$ plain form
12528 253653 252911 474811 587790 590078 540580 541206 456778 310055 91519 171646 307507
12517 307507 459819 484131 411880 361778 393530 394515 450799 510022 451194 509179 634719
12506 634719 613258 587008 547753 547217 537165 299769 285410 304247 519913 651143 502318
12495 502318 328238 199946 233065 504648 709334 600366 566425 406062 310804 226906
12485 226906 297996 434411 591127 601810 561729 565020 461778 581865 585535 476105 515316
12474 515316 498300 553187 402249 314299 286892 288902 402619 540195 528531 321842 175579
12463 175579 221634 562508 719106 657393 327183 229544 322894 368113 349367 632488 927167
12452 927167 695731 515118 484998 520972 508507 621685 404986 300556 596168 645958
$$ packed form
12528B53653p42K21900J12979K288m9498O26q4428j46723k18536Q0127J35861
12517C07507J52312K4312p2251n0102L1752R85N6284N9223n8828N7985J25540
12506F34719k1461k6250l9255n36j0052k37396j4359J8837K15666J31230j48825
12495E02318j74080j28292L3119K71583K04686j08968l3941j60363r5258q3898
12485B26906P1090J36415J56716J0683m0081L291j03242J20087L670j09430L9211
12474E15316j7016N4887j50938q7950k7407K010J13717J37576j1664k06689j46263
12463A75579M6055L40874J56598o1713l30210r7639R3350M5219j8746K83121K94679
12452I27167k31436j80613l0120L5974j2465J13178k16699j04430K95612M9790
$$ plain form
12442 645958 541476 439014 436912 359722 296207 331132 346999 492042 628822 497022 350178
12431 350178 383653 574138 634716 653210 623415 520991 433797 492612 411273 205720 348825
12420 348825 477311 449271 548768 474717 339788 349648 516980 694267 580131 454041
12410 454041 345867 384285 595826 823571 872174 681343 547175 475189 539872 640018
12400 640018 896101 1016443 851500 826824 754696 530943 446404 620649 660072 548783
12390 548783 525340 701525 841290 763782 652920 633141 591131 691484 726086 671335 714089
12379 714089 780915 860143 895376 924979 826293 798846 613783 467393 434409 454278 623742
12368 623742 585981 671041 943868 936234 890892 1056969 1044704 1005549 1017455 1074668 991829
$$ packed form
12442F45958j04482j02462k102p7190o3515L4925J5867J45043J36780j31800j46844
12431C50178L3475J90485O0578J8494k9795j02424q7194N8815q1339k05553J43105
12420C48825J28486k8040R9497p4051j34929R860J67332J77287j14136j26090
12410D54041j08174L8418K11541K27745M8603j90831j34168p1986O4683J00146
12400F40018K56083J20342j64943k4676p2128k23753q4539J74245L9423j11289
12390E48783k3443J76185J39765p7508j10862j9779m2010J00353L4602n4751M2754
12379G14089O6826P9228L5233K9603r8686k7447j85063j46390l2984J9869J69464
12368F23742l7761Q5060K72827p634m5342J66077j2265l9155J1906N7213q2839
$$ plain form
12357 991829 786123 666873 785701 827419 735511 644401 406329 362125 443069 615913
12347 615913 715899 782471 786337 834315 1075484 1069744 972634 878094 946782 1106343 1114541 1168015
12335 1168015 1199070 1215738 1116617 1074675 1008491 924671 920593 986101 1018410 999031 937214
12324 937214 1125245 1279279 1197588 1133692 1207112 1071213 1119653 1054112 1051205 1045597 992290
12313 992290 925955 928111 1020909 1107383 1085048 1115115 1128672 1103880 920070 933835 1007787
12302 1007787 906503 940991 988240 874004 960992 1055720 1176665 1270560 1349557 1324499 1138362
12291 1138362 1084001 975065 1053515 1241082 1275004 1255553 1206386 1340468 1190055 1159600
12281 1159600 989298 1105068 1174697 1152251 1169978 1028600 1029561 1170210 1177741 1064350 1039867
$$ packed form
12357I91829k05706j19250J18828M1718r1908r1110k38072m4204Q0944J72844
12347F15913R9986O6572L866M7978K41169n740r7110r4540O8688J59561Q198N3474
12335A168015L1055J6668r9121m1942o6184q3820m078O5508L2309j9379o1817
12324I37214J88031J54034q1691o3896P3420j35899M8440o5541k907n608n3307
12313I92290o6335K156R2798Q6474k2335L0067J3557k4792j83810J3765P3952
12302A007787j01284L4488M7249j14236Q6988R4728J20945R3895P8997k5058j86137
12291A138362n4361j08936P8450J87567L3922j9451m9167J34082j50413l0455
12281A159600j70302J15770O9629k2446J7727j41378R61J40649P531j13391k4483
$$ plain form
12270 1039867 1156667 1243343 1339672 1337829 1386153 1372989 1300133 1270199 1176736 1185098 1333783
12259 1333783 1444901 1481280 1421652 1451705 1505156 1500600 1344809 1456095 1420569 1366889 1398853
12248 1398853 1385358 1371729 1314256 1331830 1436969 1630886 1656280 1575923 1464830 1396511 1400089
12237 1400089 1499642 1739780 1673175 1629337 1645672 1658025 1567210 1575036 1656027 1627129 1545765
12226 1545765 1579580 1670445 1804740 1845693 1733263 1696769 1770109 1764487 1702812 1842549 1806556
12215 1806556 1704316 1692067 1759463 1840942 2080752 2179042 2297690 2088627 1932580 2046027
12205 2046027 2171225 2275902 2204635 2139787 2105135 2029641 2221334 2281235 2252793 2226667 2422597
12194 2422597 2393112 2372191 2298439 2215231 2206783 2137855 2202819 2336286 2472369 2487432 2331261
$$ packed form
12270A039867J16800Q6676R6329j843M8324j3164p2856k9934r3463Q362J48685
12259A333783J11118L6379n9628L0053N3451m556j55791J11286l5526n3680L1964
12248A398853j3495j3629n7473J7574J05139J93917K5394q0357j11093o8319L578
12237A400089R9553K40138o6605m3838J6335J2353r0815P826Q0991k8898q1364
12226A545765L3815R0865J34295M0953j12430l6494P3340n622o1675J39737l5993
12215A806556j02240j2249O7396Q1479K39810R8290J18648k09063j56047J13447
12205B046027J25198J04677p1267o4848l4652p5494J91693N9901k8442k6126J95930
12194B422597k9485k0921p3752q3208q448o8928O4964J33467J36083J5063j56171
$$ plain form
12183 2331261 2175332 2171314 2251832 2189723 2316001 2468007 2566422 2626194 2619064 2513430 2483488
12172 2483488 2616893 2756800 2885783 2731396 2704525 2713797 2843312 2810796 2768831 2756461
12162 2756461 2843093 2832733 2734385 2718864 2937549 2903266 3071229 3095779 2939087 2928372 2999214
12151 2999214 2903643 3027207 3255140 3267685 3203488 3223774 3443084 3570006 3506958 3506222 3511639
12140 3511639 3546874 3475822 3339205 3143887 3153270 3266553 3357916 3574124 3580255 3563418 3742337
12129 3742337 3724933 3751735 3820936 3935493 3923707 3952295 3981410 4031851 3989107 3983847 4023489
12118 4023489 4042032 4070214 4083357 4206587 4091541 4269649 4513186 4495245 4437019 4499330
12108 4499330 4612098 4745555 4797755 4768973 4720562 4611652 4685384 4837619 4875363 4872714 5145316
$$ packed form
12183B331261j55929m018Q0518o2109J26278J52006R8415N9772p130j05634k9942
12172B483488J33405J39907J28983j54387k6871R272J29515l2516m1965j2370
12162B756461Q6632j0360r8348j5521K18685l4283J67963K4550j56692j0715P0842
12151B999214r5571J23564K27933J2545o4197K0286K19310J26922o3048p36N417
12140C511639L5235p1052j36617j95318R383J13283R1363K16208O131j6837J78919
12129C742337j7404K6802O9201J14557j1786K8588K9115N0441m2744n260L9642
12118D023489J8543K8182J3143J23230j15046J78108K43537j7941n8226O2311
12108D499330J12768J33457N2200k8782m8411j08910P3732J52235L7744k649K72602
$$ plain form
12097 5145316 5072925 4980683 5105042 5092836 5234070 5330950 5425251 5583870 5555096 5342900
12087 5342900 5382767 5613364 5740028 5797577 5839204 5977608 5887851 5940540 6085094 6243351
12077 6243351 6326617 6176531 6302974 6539093 6680230 6763139 6705548 6744419 6897592 6920735
12067 6920735 6945518 7090347 7157502 7287200 7416259 7558411 7678895 7765074 7893069 7943563
12057 7943563 8044450 8214815 8308505 8453284 8562909 8549040 8598408 8692442 8827823 9216438
12047 9216438 9299454 9362685 9597492 9761976 9915876 9901240 10013551 10193115 10290182 10224665
12037 10224665 10289849 10347886 10534981 10715203 10897754 10940821 11005977 11289551 11445709 11565803
12027 11565803 11705590 11989400 12347604 12564085 12846460 13011685 13184524 13278411 13561053
$$ packed form
12097E145316p2391r2242J24359j2206J41234R6880R4301J58619k8774k12196
12087E342900L9867K30597J26664N7549M1627J38404q9757N2689J44554J58257
12077F243351Q3266j50086J26443K36119J41137Q2909n7591L8871J53173K3143
12067F920735K4783J44829O7155J29698J29059J42152J20484Q6179J27995N0494
12057G943563J00887J70365R3690J44779J09625j3869M9368R4034J35381L88615
12047I216438Q3016O3231K34807J64484J53900j4636J12311J79564R7067o5517
12037A0224665O5184N8037J87095J80222J82551M3067O5156K83574J56158J20094
12027A1565803J39787K83810L58204K16481K82375J65225J72839R3887K82642
$$ plain form
12018 13561053 13878292 14096902 13969758 14005299 14345017 14776688 14935670 15024488 15414748 15771676
12008 15771676 15986829 16228952 16466618 16701898 16976861 17166207 17257367 17526786 18057858
11999 18057858 18526951 18863229 19232882 19659754 20105650 20415205 20507634 20604708 21047039 21591798
11989 21591798 21976282 22257545 22537857 22850236 23255210 23861963 24409103 24877205 25269898
11980 25269898 25558094 25855217 26289938 26780012 27072056 27455580 28112185 28580558 29068878
11971 29068878 29704479 30241537 30685639 31248108 31884091 32353433 32668733 33118581 33506528
11962 33506528 34234461 34778213 35254365 35696529 36362184 36960863 37398419 37924817 38446628
11953 38446628 38913663 39434654 39810833 40227766 40758069 41263534 41704793 42327354 42742759
$$ packed form
12018A3561053L17239K18610j27144L5541L39718M31671J58982Q8818L90260L56928
12008A5771676K15153K42123K37666K35280K74963J89346R1160K69419N31072
11999A8057858M69093L36278L69653M26872M45896L09555R2429R7074M42331N44759
11989B1591798L84484K81263K80312L12379M04974O06753N47140M68102L92693
11980B5269898K88196K97123M34721M90074K92044L83524O56605M68373M88320
11971B9068878O35601N37058M44102N62469O35983M69342L15300M49848L87947
11962C3506528P27933N43752M76152M42164O65655N98679M37556N26398N21811
11953C8446628M67035N20991L76179M16933N30303N05465M41259O22561M15405
$$ plain form
11944 42742759 43022588 43458179 44014921 44523073 44892902 45201877 45527606 45668241 45903623
11935 45903623 46413949 46682867 46797074 46922358 46982023 47194109 47282070 47319690 47469956 47611493
11925 47611493 47644418 47541712 47671442 47678465 47555867 47259846 47128383 47140045 46951240 46595941
11915 46595941 46222484 45986348 45772505 45699095 45575444 45233077 44753100 44369216 43897210
11906 43897210 43375858 42976653 42565523 42181222 41614963 41026021 40547336 40180456 39769379
11897 39769379 39277727 38904544 38523976 38021615 37506240 36793804 36104669 35557513 35147407
11888 35147407 34672948 34083219 33534522 32922185 32532672 32114847 31721451 31310803 30811211
11879 30811211 30398889 29876492 29304351 28987696 28376328 27757437 27274633 27088944 26733130
$$ packed form
11944D2742759K79829M35591N56742N08152L69829L08975L25729J40635K35382
11935D5903623N10326K68918J14207J25284N9665K12086Q7961L7620J50266J41537
11925D7611493L2925j02706J29730P023j22598k96021j31463J1662j88805l55299
11915D6595941l73457k36136k13843p3410j23651l42367m79977l83884m72006
11906D3897210n21352l99205m11130l84301n66259n88942m78685l66880m11077
11897C9769379m91652l73183l80568n02361n15375p12436o89135n47156m10106
11888C5147407m74459n89729n48697o12337l89513m17825l93396m10648m99592
11879C0811211m12322n22397n72141l16655o11368o18891m82804j85689l55814
$$ plain form
11870 26733130 26280423 25879591 25507412 25211648 24703259 24188890 23737367 23395515 22887899
11861 22887899 22414796 22043932 21792147 21526487 21121920 20958525 20496499 19969190 19488252
11852 19488252 19198488 19047556 18777920 18540585 18237734 17917049 17495509 17236283 16969668
11843 16969668 16603226 16414478 16347653 15968449 15552234 15386293 15201090 14998817 14773979
11834 14773979 14520328 14337960 14239540 14174154 13984637 13522694 13329021 13186962 13063760 12819786
11824 12819786 12469285 12201318 11990183 11982803 11885300 11674131 11271586 11074279 11044751 10950323
11814 10950323 10836321 10766525 10595374 10489347 10275499 10129121 10041079 9854326 9663552 9492718
11804 9492718 9323766 9161484 9213373 9112864 8816409 8737632 8574486 8544449 8450895 8331760
$$ packed form
11870B6733130m52707m00832l72179k95764n08389n14369m51523l41852n07616
11861B2887899m73103l70864k51785k65660m04567j63395m62026n27309m80938
11852A9488252k89764j50932k69636k37335l02851l20685m21540k59226k66615
11843A6969668l66442j88748o6825l79204m16215j65941j85203k02273k24838
11834A4773979k53651j82368r8420o5386j89517m61943j93673j42059j23202k43974
11824A2819786l50501k67967k11135p380r7503k11169m02545j97307k9528r4428
11814A0950323j14002o9796j71151j06027k13848j46378q8042j86753j90774j70834
11804I492718j68952j62282N1889j00509k96455p8777j63146l0037r3554j19135
$$ plain form
11794 8331760 8195672 8046297 7829708 7811403 7834671 7692537 7495393 7481273 7349078 7124477
11784 7124477 6994417 6985537 7071307 7007229 6696200 6546787 6586064 6558408 6578142 6581875 6487613
11773 6487613 6504351 6421817 6470683 6413362 6105550 6108465 5982326 5686750 5338298 5169326
11763 5169326 5248907 5389990 5506840 5511336 5365045 5244534 5437565 5548390 5492234 5278201
11753 5278201 5164760 5225559 5288801 5033293 4811577 4836409 4849437 4857693 4723137 4710319 4683161
11742 4683161 4696303 4576605 4623819 4490012 4220227 4291561 4334936 4168493 4129370 4134813 4009046
11731 4009046 3908113 3894846 3935408 3958800 3838213 3754919 3750866 3693163 3557037 3619517 3633785
11720 3633785 3657255 3559019 3446050 3372502 3459578 3567933 3380920 3305019 3410002 3600359
$$ packed form
11794H331760j36088j49375k16589j8305K3268j42134j97144j4120j32195k24601
11784G124477j30060q880Q5770o4078l11029j49413L9277k7656J9734L733r4262
11773F487613J6738q2534M8866n7321l07812K915j26139k95576l48452j68972
11763E169326P9581J41083J16850M496j46291j20511J93031J10825n6156k14033
11753E278201j13441O0799O3242k55508k21716K4832J3028Q256j34556j2818k7158
11742D683161J3142j19698M7214j33807k69785P1334M3375j66443l9123N443j25767
11731D009046j00933j3267M0562K3392j20587q3294m053n7703j36126O2480J4268
11720C633785K3470r8236j12969p3548Q7076J08355j87013p5901J04983J90357
$$ plain form
11710 3600359 3761460 3523110 3320604 3345567 3198799 3145021 3219999 3254945 3020346 2872099
11700 2872099 2916214 2771565 2863192 3048735 3091667 3102432 3154025 3000592 2835784 2938034
11690 2938034 2746073 2662137 2779430 2808689 2809658 2660972 2597653 2510170 2503394 2632686 2644150
11679 2644150 2641243 2530799 2436299 2448941 2377273 2273169 2271758 2212256 2243652 2264627 2262114
11668 2262114 2406833 2457394 2309534 2356119 2340543 2439040 2371868 2142183 2066925 1992386 2050535
11657 2050535 2256500 2191680 1964249 1868985 1933171 1864566 1868568 2074124 2295795 2231620 2117641
11646 2117641 2211752 2067255 1919394 1853067 1916298 2008702 1997015 2263436 2328515 2287879 2141338
11635 2141338 2073981 2039608 2045479 1857607 1712934 1722364 1865832 1719310 1628712 1721289 1759226
$$ packed form
11710C600359J61101k38350k02506K4963j46768n3778P4978L4946k34599j48247
11700B872099M4115j44649R1627J85543M2932J0765N1593j53433j64808J02250
11690B938034j91961q3936J17293K9259R69j48686o3319q7483o776J29292J1464
11679B644150k907j10444r4500J2642p1668j04104j411n9502L1396K0975k513
11668B262114J44719N0561j47860M6585j5576R8497o7172k29685p5258p4539N8149
11657B050535K05965o4820k27431r5264O4186o8605M002K05556K21671o4175j13979
11646B117641R4111j44497j47861o6327O3231R2404j1687K66421O5079m0636j46541
11635B141338o7357l4373N871j87872j44673R430J43468j46522r0598R2577L7937
$$ plain form
11624 1759226 1664803 1683729 1717459 1942608 2049753 1924227 1810385 1696853 1509661 1485141
11614 1485141 1552271 1599664 1657786 1641866 1760878 1722570 1606870 1612965 1514690 1314100 1228554
11603 1228554 1359077 1378862 1328889 1406056 1494143 1569569 1564251 1554451 1466896 1248866 1261342
11592 1261342 1178140 1164577 1177975 1200192 1187181 1335212 1473084 1509694 1431042 1246157 1280655
11581 1280655 1327984 1302504 1273345 1302302 1204539 1163756 1430815 1450576 1280783 1265206 1252133
11570 1252133 1343050 1550449 1579437 1480646 1247769 1175833 1085961 1023634 1152412 1072746 1087158
11559 1087158 1180623 1147464 1004036 1151981 1126462 1024612 1073568 1121977 1002307 1091227
11549 1091227 1037811 1042426 996936 968699 987989 1020711 1053852 1071576 1028875 1040300 1064247
$$ packed form
11624A759226r4423J8926L3730K25149J07145j25526j13842j13532j87192k4520
11614A485141O7130M7393N8122j5920J19012l8308j15700O095r8275k00590q5546
11603A228554J30523J9785m9973P7167Q8087P5426n318r800q7555k18030J2476
11592A261342q3202j3563J3398K2217j3011J48031J37872L6610p8652j84885L4498
11581A280655M7329k5480k9159K8957r7763m0783K67059J9761j69793j5577j3073
11570A252133R0917K07399K8988r8791k32877p1936q9872o2327J28778p9666J4412
11559A087158R3465l3159j43428J47945k5519j01850M8956M8409j19670Q8920
11549A091227n3416M615m5490k8237J9290L2722L3141J7724m2701J1425K3947
$$ plain form
11538 1064247 940805 818097 914785 1067053 1068138 1043491 924227 949701 949705 987812 790310
11527 790310 794883 880345 947900 872066 865645 901360 928980 954121 920717 956823 951771 827222
11515 827222 796308 1006683 1075388 974905 1027809 1128910 1173347 1107271 1150123 1054370 941753
11504 941753 888292 816199 789928 873808 841867 546732 339051 440955 522902 610156 613654
11493 613654 717678 726628 710457 677867 576676 649933 755724 680898 647717 687591 905813
11482 905813 1002700 827673 584747 676232 686359 775880 844747 862830 806793 800685 780606
11471 780606 699655 620612 553211 531860 453943 417548 274931 234921 303181 478979 623154
11460 623154 548958 650969 641338 634597 693027 668565 585532 615106 578695 541543 408840
$$ packed form
11538A064247j23442j22708R6688J52268J085k4647j19264K5474ML8107j97502
11527G90310M573Q5462O7555p5834o421L5715K7620K5141l3404L6106n052j24549
11515H27222l0914K10375O8705j00483N2904J01101M4437o6076M2852r5753j12617
11504I41753n3461p2093k6271Q3880l1941k95135k07681J01904Q1947Q7254L498
11493F13654J04024Q950j6171l2590j01191P3257J05791p4826l3181L9874K18222
11482I05813R6887j75027k42926R1485J0127Q9521O8867J8083n6037o108k0079
11471G80606q0951p9043o7401k1351p7917l6395j42617m0010O8260J75798J44175
11460F23154p4196J02011r631o741N8430k4462q3033K9574l6411l7152j32703
$$ plain form
11449 408840 578763 743873 660372 618959 535603 447263 318304 442675 556095 498190
11439 498190 561076 515438 415479 596081 604023 544925 576277 497428 611485 603383 506070
11428 506070 372946 280369 511363 761243 758956 710371 727048 699880 626232 478667 472354
11417 472354 616920 597706 489178 441241 344796 337599 387313 440756 557648 664382 686069
11406 686069 474339 412634 418654 455565 536352 466849 471475 440954 370815 214362 212201 234575
11394 234575 451418 326710 215484 241299 336753 409775 503577 512793 518989 551692 506147
11383 506147 474433 603438 632594 564976 485030 512566 470888 357698 168392 291657 349879
11372 349879 324645 407988 486304 409237 281757 392923 540086 439017 359191 298087 338845
$$ packed form
11449D08840J69923J65110q3501m1413q3356q8340j28959J24371J13420n7905
11439D98190O2886m5638r9959J80602P942n9098L1352p8849J14057q102r7313
11428E06070j33124r2577K30994K49880k287m8585J6677k7168p3648j47565o313
11417D72354J44566j9214j08528m7937r6445p197M9714N3443J16892J06734K1687
11406F86069k11730o1705O020L6911Q0787o9503M626l0521p0139j56453k161K2374
11394B34575K16843j24708j11226K5815R5454P3022R3802R216O196L2703m5545
11383E06147l1714J29005K9156o7618p9946K7536m1678j13190j89306J23265N8222
11372C49879k5234Q3343P8316p7067j27480J11166J47163j01069p9826o1104M0758
$$ plain form
11361 338845 274219 303074 199825 131611 120956 184464 216425 225853 296151 415252 587771
11350 587771 343650 342208 367560 415234 467129 526453 479042 459245 393769 330207 421916
11339 421916 416296 350564 298522 124176 239442 475886 454663 433679 320467 278480 313121
11328 313121 419551 455718 484639 394448 299239 221841 213277 276222 310838 252864 263448
11317 263448 244030 208963 128402 232417 73118 -7360 36973 53638 120782 103081 -11048
11306 -11048 10214 225563 249879 302368 217522 258724 329808 370660 267866 224452 282155
11295 282155 283062 216167 300476 286771 414083 420246 288288 228015 135773 32478 73278
11284 73278 275802 270132 123131 185412 75249 -68370 86243 238386 162020 143182 138693
$$ packed form
11361C38845o4626K8855j03249o8214j0655O3508L1961R428P0298J19101J72519
11350E87771k44121j442K5352M7674N1895N9324m7411j9797o5476o3562R1709
11339D21916n620o5732n2042j74346J15266K36444k1223k0984j13212m1987L4641
11328C13121J06430L6167K8921r0191r5209p7398q564O2945L4616n7974J0584
11317B63448j9418l5067q0561J04015j59299q0478M4333J6665O7144j7701j14129
11306a1048K1262K15349K4316N2489q4846M1202P1084M0852j02794m3414N7703
11295B82155R07o6895Q4309j3705J27312O163j31958o0273r2242j03295M0800
11284G3278K02524n670j47001O2281j10163j43619J54613J52143p6366j8838m489
$$ plain form
11273 138693 188091 49105 149782 125459 136462 343629 298451 243587 285934 372716 148472
11262 148472 -40058 -44183 29416 115347 157056 87603 180734 255567 218408 232616 252151
11251 252151 259389 134751 77470 172114 247059 212105 63780 75180 90491 79962 69507
11240 69507 99813 135195 160723 159844 283757 268321 379093 309455 166469 291443 411370
11229 411370 425507 292404 175483 336180 578691 696754 597218 405044 375789 325780
11219 325780 282423 247005 196888 43344 117415 137164 160958 121699 9463 132558 157433
11208 157433 183709 133310 164471 148699 -34701 -170416 90738 129063 73120 299271 305192
11197 305192 312588 303332 317017 437634 329386 326156 395198 331693 416940 502619 395026
$$ packed form
11273A38693M9398j38986J00677k4323J1003K07167m5178n4864M2347Q6782k24244
11262A48472j88530m125P3599Q5931M1709o9453R3131P4833l7159J4208J9535
11251B52151P238j24638n7281R4644P4945l4954j48325J1400J5311j0529j0455
11240F9507L0306L5382K5528q79J23913j5436J10772o9638j42986J24974J19927
11229D11370J4137j33103j16921J60697K42511J18063r9536j92174k9255n0009
11219C25780m3357l5418n0117j53544P4071J9749K3794l9259j12236J23095K4875
11208A57433K6276n0399L1161j5772j83400j35715K61154L8325n5943K26151N921
11197C05192P396r256J3685J20617j08248l230O9042o3505Q5247Q5679j07593
$$ plain form
11186 395026 191772 151464 211506 257402 295366 117960 -72433 25738 199455 323900
11176 323900 279120 102153 91843 113279 196404 95715 159830 271252 273285 357318 391876
11165 391876 458358 401551 311766 258228 258429 144906 177158 329723 361072 297205 285824
11154 285824 258852 133374 186707 334524 477949 421677 362792 393961 388698 305349 275986
11143 275986 269500 148795 195442 113131 2736 22493 116922 113403 -127747 -141595 -47997
11132 -47997 -65457 -26640 90106 142158 137756 136783 291209 202903 1642 102888 226571
11121 226571 249745 135231 103872 75853 169444 121257 311566 362838 294781 212420 208877
11110 208877 226619 11827 106951 152038 129364 238832 195456 312619 458629 506282 365406
$$ packed form
11186C95026k03254m0308O0042M5896L7964j77406j90393R8171J73717J24445
11176C23900m4780j76967j0310K1436Q3125j00689O4115J11422K033Q4033L4558
11165C91876O6482n6807q9785n3538K01j13523L2252J52565L1349o3867j1381
11154B85824k6972j25478N3333J47817J43425n6272n8885L1169n263q3349k9363
11143B75986o486j20705M6647q2311j10395J9757R4429l519k41150j3848R3598
11132d7997j7460L8817J16746N2052m402r73J54426q8306k01261J01246J23683
11121B26571K3174j14514l1359k8019R3591m8187J90309N1272o8057q2361l543
11110B08877J7742k14792R5124M5087k2674J09468m3376J17163J46010M7653j40876
$$ plain form
11099 365406 251850 75246 148696 69914 36853 173238 48294 -59417 -7958 118704
11089 118704 240311 232593 246962 26873 -15440 147853 136885 125098 32186 -137762 -188878
11078 -188878 -46364 37022 104175 68095 304475 389384 277325 149667 159634 252849 205653
11067 205653 56066 21721 -24882 16665 49578 81199 164041 184572 82540 78134 90137
11056 90137 162491 189012 413319 489262 494261 500237 579498 538888 504133 591955 686163 902833
11044 902833 1073118 1079907 963942 844307 852713 1153516 1306777 1453551 1673564 1792129
11034 1792129 1953819 1998302 2000029 1851618 1654513 1622303 1588724 1617364 1545335 1517377 1707847
11023 1707847 1877535 1911536 1932037 1856035 1810080 1726031 1792209 1845078 1863683 1768898 1740717
$$ packed form
11099C65406j13556j76604P3450p8782l3061J36385j24944j07711N1459J26662
11089A18704J21607p718J4369k20089m2313J63293j0968j1787r2912j69948n1116
11078a88878J42514Q3386O7153l6080K36380Q4909j12059j27658R967R3215m7196
11067B05653j49587l4345m6603M1547L2913L1621Q2842K0531j02032m406J2003
11056I0137P2354K6521K24307P5943M999N976P9261m0610l4755Q7822R4208K16670
11044I02833J70285O789j15965j19635Q406L00803J53261J46774K20013J18565
11034A792129J61690M4483J727j48411j97105l2210l3579K8640p2029k7958J90470
11023A707847J69688L4001K0501p6002m5955q4049O6178N2869J8605r4785k8181
$$ plain form
11012 1740717 1747505 1689908 1837050 2048464 1895624 1650709 1494700 1354731 1231369 1141508
11002 1141508 1277581 1179471 1107390 1050329 946242 848264 734861 569350 558532 723499
10992 723499 704096 509480 448933 349251 355277 226021 101308 142386 165487 244030 352473
10981 352473 344120 244458 95869 26433 -11023 -17845 -59459 43835 114366 102304 116433
10970 116433 152380 168503 296513 210893 167117 303502 266123 71169 3912 5233 -42449
10959 -42449 -21298 -109780 -191078 -137869 -59493 -68328 -137894 -21565 89322 113073 199242
10948 199242 223745 237920 255147 204684 206051 94194 -147971 -174747 -113129 -194141 -136035
10937 -136035 37389 266793 506503 486864 389021 92815 -38578 70228 98357 109684
$$ packed form
11012A740717O788n7597J47142K11414j52840k44915j56009j39969j23362q9861
11002A141508J36073r8110p2081n7061j04087r7978j13403j65511j0818J64967
10992G23499j9403j94616o0547r9682O026j29256j24713M1078K3101P8543J08443
10981C52473q353r9662j48589o9436l7456o822m1614J03294P0531j2062J4129
10970A16433L5947J6123J28010q5620m3776J36385l7379j94954o7257J321m7682
10959d2449K1151q8482q1298N3209P8376q835o9566J16329J10887K3751Q6169
10948A99242K4503J4175J7227n0463J367j11857k42165k6776O1618q1012N8106
10937a36035J73424K29404K39710j9639r7843k96206j31393J08806K8129J1327
$$ plain form
10927 109684 163465 297674 139060 35929 -55705 -159400 -23376 -1291 -21270 -131303
10917 -131303 -45953 -17874 28365 111115 125180 63916 -14232 28338 135491 451888 681139
10906 681139 527475 229299 -26683 -54702 39065 135443 197696 242177 202679 220956 234700
10895 234700 13794 -48934 13025 64306 12436 625 -167309 -223367 -35204 175240 107504
10884 107504 -98535 -206081 -145715 178661 127870 -26392 9668 178172 134710 126386 167632
10873 167632 235176 183378 57083 94689 109670 248684 206952 202152 80685 19765 -32172
10862 -32172 22346 63925 67345 156925 245408 268850 246700 376565 381914 425555 590631 455741
10850 455741 314132 87313 122356 222211 250763 387983 467506 490044 279455 348039 395293
$$ packed form
10927A09684N3781J34209j58614j03131r1634j03695J36024K2085j9979j10033
10917a31303Q5350K8079M6239Q2750J4065o1264p8148M2570J07153L16397K29251
10906F81139j53664k98176k55982k8019R3767R6378O2253M4481l9498J8277J3744
10895B34700k20906o2728O1959N1281n1870j1811j67934n6058J88163K10444o7736
10884A07504k06039j07546O0366L24376n0791j54262L6060J68504m3462q324M1246
10873A67632O7544n1798j26295L7606J4981J39014m1732m800j21467o0920n1937
10862c2172N4518M1579L420Q9580Q8483K3442k2150J29865N349M3641J65076j34890
10850D55741j41609k26819L5043R9855K8552J37220P9523K2538k10589O8584M7254
$$ plain form
10839 395293 217932 339287 448181 422996 281318 237259 350117 287237 190335 172576
10829 172576 140530 220256 282117 163878 142093 343275 512861 477037 515450 501138 292642
10818 292642 211765 173926 212510 198495 120758 -17195 15978 55327 146610 98716 167581
10807 167581 283135 113181 -211269 -112232 -11540 50213 161435 102007 151861 370496
10797 370496 463187 370405 360630 354133 172204 90231 134468 114177 203248 193882 210406 257974
10785 257974 244943 373107 503135 446009 349918 88225 32212 131598 281080 228880 267347
10774 267347 149471 109501 103675 155416 227929 232199 71813 10328 -118680 9405 97106
10763 97106 39632 124568 125593 134742 86633 176795 250772 166497 106104 126753 -54219 -177500
$$ packed form
10839C95293j77361J21355J08894k5185j41678m4059J12858o2880r6902j7759
10829A72576l2046P9726O1861j18239k1785K01182J69586l5824L8413j4312k08496
10818B92642q0877l7839L8584j4015p7737j37953L3173L9349R1283m7894O8865
10807A67581J15554j69954l24450R9037J00692O1753J11222n9428M9854K18635
10797C70496R2691r2782r775o497j81929q1973M4237k0291Q9071r366J6524M7568
10785B57974j3031J28164J30028n7126r6091k61693n6013R9386J49482n2200L8467
10774B67347j17876l9970n826N1741P2513M270j60386o1485j29008J28085Q7701
10763I7106n7474Q4936J025R149m8109R0162P3977q4275o0393K0649j80972j23281
$$ plain form
10751 -177500 -193889 -85794 147316 247054 272505 81246 9927 92551 -24662 -42109 112338
10740 112338 244816 437761 582599 510603 345241 320615 394055 414098 484354 455398 630313
10729 630313 629137 489392 452126 470895 458407 390840 401057 319830 362036 352786 151496
10718 151496 198205 373739 346380 439332 430885 479748 486421 544407 707916 827032 712665
10707 712665 667112 784953 792778 632273 723713 772138 734182 735432 894021 889325 792321
10696 792321 620263 514229 636787 922242 1040593 1005904 884598 944290 957936 887282
10686 887282 777276 842229 851840 980499 1162600 1004605 992976 983589 987953 1076588 1202245
10675 1202245 1168064 1086348 1166184 1314523 1307693 1316739 1158408 1121170 1335653 1561488 1557867
$$ packed form
10751a77500j6389J08095K33110R9738K5451j91259p1319Q2624j17213j7447J54447
10740A12338J32478J92945J44838p1996j65362k4626P3440K0043P0256k8956J74915
10729F30313j176j39745l7266J8769j2488o7567J0217q1227M2206r250k01290
10718A51496M6709J75534k7359R2952q447M8863O673N7986J63509J19116j14367
10707G12665m5553J17841P825j60505R1440M8425l7956J250J58589m696r7004
10696G92321j72058j06034J22558K85455J18351l4689j21306N9692J3646p0654
10686H87282j10006O4953R611J28659J82101j57995j1629r387M364Q8635J25657
10675A202245l4181q1716P9836J48339o830R046j58331l7238K14483K25835l621
$$ plain form
10664 1557867 1500575 1511044 1773765 1964579 1919408 1951024 2288731 2861898 3607988 4643121
10654 4643121 5525199 5762883 5066698 4272364 3651654 3305840 3112145 3030569 3009258 3108710
10644 3108710 3219753 3247194 3489011 3771659 4249949 4631216 4841281 5103610 5626384 6336028
10634 6336028 7029846 7678734 8367565 9161869 10223429 11160884 12188334 13624197 15319712
10625 15319712 17601673 20712033 24855812 30520287 37768713 47060389 58891183 73071235
10617 73071235 88875526 104079774 115686007 121456105 122004608 120377647 119598957 121944288
10609 121944288 129280633 142688067 162963338 189573144 220253588 248696482 266483865
10602 266483865 268860683 258560068 243888483 232107060 227312922 231372528 245427209
$$ packed form
10664A557867n7292J0469K62721J90814m5171L1616L37707N73167P46090J035133
10654D643121Q82078K37684o96185p94334o20710l45814j93695q1576k1311R9452
10644C108710J11043K7441K41817K82648M78290L81267K10065K62329N22774P09644
10634F336028O93818O48888O88831P94304J061560R37455J027450J435863J695515
10625A5319712K281961L110360M143779N664475P248426R291676J1830794J4180052
10617G3071235J5804291J5204248J1606233N770098N48503j626961p78690K345331
10609A21944288P336345J3407434K0275271K6609806L0680444K8442894J7787383
10602B66483865K376818j0300615j4671585j1781423m794138M059606J4054681
$$ plain form
10595 245427209 269551365 302484622 339249274 370190262 383456516 373290695 345419588
10588 345419588 312367433 283483252 263082757 252233758 250986355 258592105 272978063
10581 272978063 289555043 301019093 300064593 283789963 257160028 228386768 203467471
10574 203467471 184287321 171389250 164328900 161849749 162305221 163653010 162473070 156114583
10566 156114583 143993970 128282821 111905136 96717808 83786339 73131080 64617138
10559 64617138 57744870 52080111 47256908 43318554 40026778 37180448 34369052 31761325
10551 31761325 29354761 26984138 24817130 22922950 21176307 19632293 18176768 16850225
10543 16850225 15718390 14600942 13514221 12501183 11652089 10926351 10353811 9893362 9349740
$$ packed form
10595B45427209K4124156L2933257L6764652L0940988J3266254j0165821k7871107
10588C45419588l3052155k8884181k0400495j0848999j247403P605750J4385958
10581B72978063J6576980J1464050r54500j6274630k6629935k8773260k4919297
10574B03467471j9180150j2898071p060350k479151M55472J347789j179940o358487
10566A56114583j2120613j5711149j6377685j5187328j2931469j0655259q513942
10559F4617138o872268n664759m823203l938354l291776k846330k811396k607727
10551C1761325k406564k370623k167008j894180j746643j544014j455525j326543
10543A6850225j131835j117448j086721j013038q49094p25738n72540m60449n43622
$$ plain form
10534 9349740 8770596 8213886 7726449 7389079 6784966 6368515 6147135 5764090 5307742
10525 5307742 5156332 4761280 4398999 4318904 4282201 4206207 4116180 3959085 3718336 3550247
10515 3550247 3214421 3185679 3171024 3000647 2815417 2575085 2650229 2662079 2653344 2676096 2641409
10504 2641409 2517574 2489895 2406917 2239557 2173263 2162381 2180538 2188999 2247224 2218409 1946542
10493 1946542 1838443 1652868 1517959 1585219 1742534 1805105 1824219 1744323 1610915 1425249
10483 1425249 1343578 1359181 1497342 1539062 1615323 1548048 1533210 1508143 1629461 1723962 1583941
10472 1583941 1614796 1644983 1461401 1366628 1297252 1374566 1405863 1571951 1569691 1500072 1491137
10461 1491137 1381078 1497706 1481247 1298179 1172137 1268191 1342575 1300151 1110722 1148795
$$ packed form
10534I349740n79144n56710m87437l37370o04113m16451k21380l83045m56348
10525E307742j51410l95052l62281q0095l6703p5994r0027j57095k40749j68089
10515C550247l35826k8742j4655j70377j85230k40332P5144J1850q735K2752l4687
10504B641409j23835k7679q2978j67360o6294j0882J8157Q461N8225k8815k71867
10493A946542j08099j85575j34909O7260J57315O2571J9114p9896j33408j85666
10483A425249q1671J5603J38161M1720P6261o7275j4838k5067J21318R4501j40021
10472A583941L0855L0187j83582r4773o9376P7314L1297J66088k260o9619q935
10461A491137j10059J16628j6459j83068j26042R6054P4384m2424j89429L8073
$$ plain form
10451 1148795 1412411 1428479 1284016 1349319 1312353 1193488 1005125 859687 858405 1053654
10441 1053654 1174231 1108715 1049074 1012288 1055727 1060584 1187844 1120440 975454 927423 1063505
10430 1063505 1101245 948082 940413 961191 943937 906503 948202 1150383 1203924 1125951 1177998
10419 1177998 1252982 1241471 1101700 846967 695777 692374 775720 843440 825106 749330 725047
10408 725047 536927 450500 408523 388912 522816 556306 671538 609382 611873 651684 697762
10397 697762 605696 551609 432024 181990 203100 271667 269649 438293 538178 636587 635055
10386 635055 574346 581857 324933 158304 176962 323849 405496 465772 430113 500832 562214
10375 562214 575614 681068 640127 561064 513973 431189 333706 289420 299166 374535 517638
$$ packed form
10451A148795K63616J6068j44463O5303l6966j18865j88363j45438j282J95249
10441A053654J20577o5516n9641l6786M3439M857J27260o7404j44986m8031J36082
10430A063505L7740j53163p669K0778j7254l7434M1699K02181N3541p7973N2047
10419A177998P4984j1511j39771k54733j51190l403Q3346O7720j8334p5776k4283
10408G25047j88120q6427m1977j9611J33904L3490J15232o2156K491L9811M6078
10397F97762r2066n4087j19585k50034K1110O8567k018J68644R9885R8409j532
10386F35055o0709P511k56924j66629J8658J46887Q1647O0276l5659P0719O1382
10375E62214J3400J05454m0941p9063m7091q2784r7483m4286R746P5369J43103
$$ plain form
10364 517638 575362 523780 524726 443429 243911 303684 392550 500817 507888 615571 522394
10353 522394 340752 317081 298276 192957 252925 350614 214199 274682 297467 236738 279304
10342 279304 314572 305249 341682 365935 322003 223598 408621 536709 417922 345301 369599
10331 369599 507084 437363 418289 294427 207862 145950 208507 261862 212600 134895 85358
10320 85358 35336 83522 -19554 -133952 -26160 211169 297876 327378 351983 448543 316957
10309 316957 255554 304513 222707 173751 46100 124383 100515 218018 410263 507460 338340
10298 338340 153557 -87173 -22730 231442 299517 278380 492415 503877 403072 312108
10288 312108 122317 268299 194473 266329 318392 380553 426149 336861 564523 604622 435182
$$ packed form
10364E17638N7724n1582R46q1297j99518N9773Q8866J08267P071J07683r3177
10353E22394j81642k3671j8805j05319N9968R7689j36415O0483K2785o0729M2566
10342B79304L5268r323L6433K4253m3932r8405J85023J28088j18787p2621K4298
10331C69599J37485o9721j9074j23862q6565o1912O2557N3355m9262p7705m9537
10320H5358n0022M8186j03076j14398J07792K37329Q6707K9502K4605R6560j31586
10309C16957o1403M8959q1806m8956j27651P8283k3868J17503J92245R7197j69120
10298C38340j84783k40730O4443K54172O8075k1137K14035J1462j00805r0964
10288C12108j89791J45982p3826P1856N2063O2161M5596q9288K27662M0099j69440
$$ plain form
10277 435182 330226 320140 413836 435951 456736 413147 282248 266848 254696 349240 635233
10266 635233 591667 385985 354503 294016 260860 306482 246349 216325 242595 390985 351959
10255 351959 416494 400106 122376 36309 42220 138772 188440 208448 192412 269200 195169
10244 195169 20045 -16795 -61076 -36889 -18103 -42614 50562 162733 118405 100326 211759
10233 211759 326295 190115 305520 338364 118001 162891 206129 152229 135962 316189
10223 316189 426927 337468 234142 333731 323710 258942 274859 296322 332502 308961 329662
10212 329662 415923 365083 68782 -22238 95392 196321 204309 185367 129026 85907 104342
10201 104342 299125 280725 342750 491709 421540 303098 262057 117626 33348 -490 39408
$$ packed form
10277D35182j04956j0086R3696K2115K0785m3589j30899j5400j2152R4544K85993
10266F35233m3566k05682l1482o0487l3156M5622o0133l0024K6270J48390l9026
10255C51959O4535j6388k77730q6067N911R6552M9668K0008j6036P6788p4031
10244A95169j75124l6840m4281K4187J8786k4511R3176J12171m4328j8079J11433
10233B11759J14536j36180J15405L2844k20363M4890M3238n3900j6267J80227
10223C16189J10738q9459j03326R9589j0021o4768J5917K1463L6180k3541K0701
10212C29662Q6261n0840k96301r1020J17630J00929P988j8942n6341m3119J8435
10201A04342J94783j8400O2025J48959p0169j18442m1041j44431q4278l3838L9898
$$ plain form
10190 39408 140650 260717 282052 265271 357840 451666 458027 650688 750538 877230 982553
10179 982553 835654 703488 723688 680455 625219 693446 793301 894190 1056617 1278440
10169 1278440 1453490 1487286 1444851 1380705 1328945 1287721 1307517 1237716 1280724 1266791 1445420
10158 1445420 1614517 1892131 2275973 2524175 2592922 2466048 2313803 1890980 1636106 1671616
10148 1671616 1712687 1717766 1723968 1779843 1684780 1701110 1756270 1744604 1573273 1347897 1141255
10137 1141255 1077762 973631 959552 961176 966109 984187 1037970 1073345 901484 687860 605532
10126 605532 615385 599220 545427 339839 273905 313558 153630 206840 448117 324249 281449
10115 281449 301537 261327 328350 335466 262299 408466 454600 384396 375381 206818 321369
$$ packed form
10190C9408J01242J20067K1335j6781R2569R3826O361J92661R9850J26692J05323
10179I82553j46899j32166K0200m3233n5236O8227R9855J00889J62427K21823
10169A278440J75050L3796m2435o4146n1760m1224J9796o9801M3008j3933J78629
10158A445420J69097K77614L83842K48202O8747j26874j52245m22823k54874L5510
10148A671616M1071N079O202N5875r5063J6330N5160j1666j71331k25376k06642
10137A141255o3493j04131j4079J624M933J8078N3783L5375j71861k13624q2328
10126F05532R853j6165n3793k05588o5934L9653j59928N3210K41277j23868m2800
10115B81449K0088m0210O7023P116p3167J46167M6134p0204r015j68563J14551
$$ plain form
10104 321369 451929 435331 387810 202188 29571 44101 149037 135233 97579 187477 106512
10093 106512 67962 13369 67213 61415 155142 121774 269346 383432 379925 522540 408906
10082 408906 258897 180844 -1625 103828 168306 152451 58791 39933 51975 134277 177504
10071 177504 120138 -9544 -159066 -4333 -55975 -197149 -143859 2917 193117 183118
10061 183118 -726 -151640 -72269 128119 348759 315621 178265 168648 273199 114963
10051 114963 -103342 -83817 -65524 -9546 -64063 34601 80750 143947 105523 128308 27117
10040 27117 -36617 -84643 -44426 66690 82495 88865 84557 75271 122125 211997 190362 107924
10028 107924 -4327 -21876 17285 -28041 -16323 42857 49149 141209 98053 -26631 53143
$$ packed form
10104C21369J30560j6598m7521j85622j72617J4530J04936j3804l7654Q9898q0965
10093A06512l8550n4593N3844n798R3727l3368J47572J14086l507J42615j13634
10082D08906j50009p8053j82469J05453O4478j5855r3660j8858J2042Q2302M3227
10071A77504n7366j29682j49522J54733n1642j41174N3290J46776J90200r999
10061A83118j83844j50914P9371K00388K20640l3138j37356r617J04551j58236
10051A14963k18305J9525J8293N5978n4517R8664M6149O3197l8424K2785j01191
10040B7117o3734m8026M0217J11116J5805O370m308r286M6854Q9872k1635q2438
10028A07924j12251j7549L9161m5326J1718N9180O292R2060m3156j24684P9774
$$ plain form
10017 53143 87732 61150 -38077 58771 135042 138595 72814 -36142 -81096 -29770 130746
10006 130746 231935 224260 182018 71010 -4690 14366 -4131 -90497 -162895 -158511 -233142
9995 -233142 -140577 -2784 33522 130533 21682 -19511 105818 128676 94087 -80647 -21935
9984 -21935 6991 9405 62144 -17879 -164676 -91377 -57330 38497 1433 -63269 -111057 -249652
9972 -249652 -146538 -6829 -27142 -48598 -54047 -61343 -47796 78860 122880 251533 183115
9961 183115 -21456 -79726 33118 -108788 -119152 -12507 -9819 -86520 -49542 -131744 81855
9950 81855 358524 189553 52883 194910 254788 188304 91805 10569 -51480 38508 30188
9939 30188 150904 123068 21041 21276 59010 175422 262924 308484 336856 332386 492454 542467
$$ packed form
10017E3143L4589k6582r9227R6848P6271L553o5781j08956m4954N1326J60516
10006A30746J01189p675m2242j11008p5700J9056j8497q6366p2398M384p4631
9995b33142R2565J37793L6306R7011j08851m1193J25329K2858l4589j74734N8712
9984b1935K8926K414N2739q0023j46797P3299L4047R5827l7064o4702m7788j38595
9972b49652J03114J39709k0313k1456n449p296J3547J26656M4020J28653o8418
9961A83115k04571n8270J12844j41906j0364J06645K688p6701L6978q2202K13599
9950H1855K76669j68971j36670J42027N9878o6484r6499q1236o2049Q9988q320
9939C0188J20716k7836j02027K35L7734J16412Q7502M5560K8372m470J60068N0013
$$ plain form
9927 542467 534646 382445 129156 -30596 -47345 -81171 153878 214839 169852 26024 -98521
9916 -98521 -108432 -132252 -129560 -144912 -236173 -264658 -300832 -311379 -246757 -272151 -113379 49392
9904 49392 -17200 49264 193101 270936 222642 228282 185760 55989 -82515 -13293 -20801 -112353
9892 -112353 143093 374051 322743 335229 350782 415832 502650 456113 264587 49156 -14475
9881 -14475 -16767 116230 256100 216045 -31342 -60945 -132832 -94035 22525 137292 24052
9870 24052 -142144 -130558 -20021 -114688 -152819 -58606 76495 -66836 -217186 -258912 -107844
9859 -107844 -136235 49100 212159 257373 101809 -12332 88037 133419 -40465 -52710
9849 -52710 40935 69731 72855 -75789 -174397 -276548 -152526 -13783 60747 -43576 -55326
$$ packed form
9927E42467p821j52201k53289j59752j6749l3826K35049O0961m4987j43828j24545
9916i8521r911k3820K692j5352r1261k8485l6174j0547O4622k5394J58772J62771
9904D9392o6592O6464J43837P7835m8294N640m2522j29771j38504O9222p508r1552
9892a12353K55446K30958n1308J2486J5553O5050Q6818m6537j91526k15431o3631
9881a4475k292J32997J39870m0055k47387k9603p1887L8797J16560J14767j13240
9870B4052j66196J1586J10537r4667l8131R4213J35101j43331j50350m1726J51068
9859a07844k8391J85335J63059M5214j55564j14141J00369M5382j73884j2245
9849e2710R3645K8796L124j48644r8608j02151J24022J38743P4530j04323j1750
$$ plain form
9838 -55326 -44122 -91785 -66428 -55458 9503 -225678 -197889 -48161 -37199 -75514 -169918
9827 -169918 -129955 -159728 -163686 -89575 -140855 -194958 -23057 149980 187487 30573 -12792
9816 -12792 143209 94104 141178 114158 64706 -85105 -137546 -252591 -154312 -123161 -69982
9805 -69982 47342 107842 82525 85248 104792 146549 23648 -132597 -108272 182139 227990
9794 227990 215163 350960 335034 387789 533901 505561 384885 467496 608488 786312 1045522
9783 1045522 1377381 1926124 2950535 4451435 6662723 9628304 12275844 13438893 12647977
9774 12647977 10227147 7488090 5429708 4030991 3252867 2770212 2485225 2174234 1894708
9765 1894708 1620031 1492781 1381491 1506359 1387923 1078655 1012710 973444 857614 853814
$$ packed form
9838e5326J1204m7663K5357J0970O4961k35181K7789J49728J0962l8315r4404
9827a69918L9963k9773l958P4111n1280n4103J71901J73037L7507j56914m3365
9816a2792J56001m9105M7074k7020m9452j49811n2441j15045R8279L1151N3179
9805f9982J17324O0500k5317K723J9544M1757j22901j56245K4325K90411M5851
9794B27990j2827J35797j5926N2755J46112k8340j20676Q2611J40992J77824K59210
9783A045522L31859N48743J024411J500900K211288K965581K647540J163049p90916
9774A2647977k420830k739057k058382j398717p78124m82655k84987l10991k79526
9765A894708k74677j27250j11290J24868j18436l09268o5945l9266j15830l800
$$ plain form
9755 853814 822773 793127 726666 764604 742633 536163 436308 276167 261374 301481 270818
9744 270818 139475 87402 277819 473031 505289 400379 378006 484453 482240 393536 433340
9733 433340 393574 272492 223385 226557 252156 318886 248343 155706 157261 228890 330376 295388
9721 295388 179245 63347 -35015 8104 -22215 -41256 -27239 104948 176301 164988 100377
9710 100377 78691 269915 132666 -221622 -204650 -190235 2301 105000 -152789 -174070
9700 -174070 -128288 -78972 -201803 -272986 -300847 -97880 -181828 -176425 -101508 -142612 -192677
9689 -192677 -193299 -79995 45615 209789 235890 48973 -262493 -447120 -367364 -251090 -233270
9678 -233270 -148133 -136898 -169370 -237871 -289819 -266500 -260106 -188162 -316871 -332557 -153952
$$ packed form
9755H53814l1041k9646o6461L7938k1971k06470r9855j60141j4793M0107l0663
9744B70818j31343n2073J90417J95212L2258j04910k2373J06447k213q8704L9804
9733D33340l9766j21082m9107L172K5599O6730p0543r2637J555P1629J01486l4988
9721B95388j16143j15898r8362M3119l0319j9041J4017J32187P1353j1313o4611
9710A00377k1686J91224j37249l54288J6972J4415J92536J02699k57789k1281
9700a74070M5782M9316j22831p1183k7861K02967q3948N403P4917m1104n0065
9689a92677o22J13304J25610J64174K6101j86917l11466j84627P9756J16274J7820
9678b33270Q5137J1235l2472o8501n1948K3319O394P1944j28709j5686J78605
$$ plain form
9667 -153952 -72581 50186 115180 200961 284893 294796 206246 71117 174064 270234 244004
9656 244004 349108 756327 1034768 1228407 1256677 1200963 1011673 640779 366879 47193
9646 47193 100802 182035 105883 144638 209919 167865 85260 -68311 -124939 126288 55299
9635 55299 -133203 -135921 -166801 -1697 24997 24839 12225 -19319 -19569 19884 62158 223033
9623 223033 217248 25264 60883 56957 -118461 -116119 -239473 -228853 -246815 -131189 60757
9612 60757 54796 -28430 -89127 -103748 -133714 -182568 -15637 146011 71861 -6687 -68559 -36502
9600 -36502 40139 86384 32865 48559 91165 25374 -80014 -39604 83695 198985 97580
9589 97580 46559 88346 117697 60358 -68666 -23729 -178767 -213654 3013 -160181 -121356
$$ packed form
9667a53952Q1371J22767O4994Q5781Q3932R903q8550j35129J02947R6170k6230
9656B44004J05104M07219K78441J93639K8270n5714j89290l70894k73900l19686
9646D7193N3609Q1233p6152L8755O5281m2054q2605j53571n6628K51227p0989
9635E5299j88502k718l0880J65104K6694j58j2614l1544k50L9453M2274J60875
9623B23033n785j91984L5619l926j75418K342j23354J0620j7962J15626J91946
9612F0757n961q3226o0697j4621k9966m8854J66931J61648p4150p8548o1872L2057
9600c6502P6641M6245n3519J5694M2606o5791j05388M0410J23299J15290j01405
9589I7580n1021M1787K9351n7339j29024M4937j55038l4887K16667j63194L8825
$$ plain form
9578 -121356 -57207 -216499 -248530 -44486 47541 -34607 -148305 -141075 -34175 -32671 -10238
9567 -10238 60856 -18796 -120903 -30157 96014 -75699 -83469 -75170 -67405 37139 54948 92189
9555 92189 69605 60067 -3269 108075 289303 230916 147843 204385 261046 98932 -88871
9544 -88871 -110599 26083 -31785 -41069 -66317 -172163 -186278 -134168 -178723 -320512 -265276
9533 -265276 -211365 -219196 -76995 25369 155996 68872 33107 57212 176042 86274 42281
9522 42281 227927 200036 51124 -96500 -19418 -1135 212479 193591 24475 -38938 -246562
9511 -246562 -351072 -174683 -114273 -34985 42641 -10215 16347 -88365 -30940 12824 -24682
9500 -24682 -26287 38852 16614 45367 206939 236857 371519 200322 145764 93551 59748
$$ packed form
9578a21356O4149j59292l2031K04044R2027q2148j13698P230J06900J504K2433
9567a0238P1094p9652j02107R0746J26171j71713p770Q299P765J04544J7809L7241
9555I2189k2584r538o3336J11344J81228n8387q3073N6542N6661j62114j87803
9544h8871k1728J36682n7868r284k5248j05846j4115N2110m4555j41789N5236
9533b65276N3911p831J42201J02364J30627q7124l5765K4105J18830q9768m3993
9522D2281J85646k7891j48912j47624P7082J8283K13614j8888j69116o3413k07624
9511b46562j04510J76389O0410P9288P7626n2856K6562j04712N7425M3764l7506
9500b4682j605O5139k2238K8753J61572K9918J34662j71197n4558n2213l3803
$$ plain form
9489 59748 -47255 -185643 -104882 -89357 -26439 111551 -15556 -66814 36953 137558 47872
9478 47872 -128478 -305959 -213059 -220225 -229801 6874 134317 235267 183978 11766 75733
9467 75733 77030 121056 65269 47393 32075 97011 -113107 -216512 -176325 7825 30807
9456 30807 -136614 -166675 -95601 -104846 -170544 -350274 -376607 -204169 -31860 -113479 -208317
9445 -208317 -264853 -296347 -353754 -257447 -187281 -92847 -33296 144150 94437 -64442 -188145
9434 -188145 -53965 -137264 -193752 -84737 -27483 48622 173584 197254 100879 -7304 -209110
9423 -209110 -172115 -122358 -11022 43498 52930 96090 -29632 58577 142625 14527 25695
9412 25695 238586 48377 -123472 197175 215819 119972 183481 85573 -11123 -95581 52218
$$ packed form
9489E9748j07003j38388Q0761J5525O2918J37990j27107n1258J03767J00605q9686
9478D7872j76350j77481R2900p166r576K36675J27443J00950n1289j72212O3967
9467G5733J297M4026n5787j7876j5318O4936k10118j03405M0187J84150K2982
9456C0807j67421l0061P1074r245o5698j79730k6333J72438J72309q1619r4838
9445b08317n6536l1494n7407R6307P0166R4434N9551J77446m9713j58879j23703
9434a88145J34180q3299n6488J09015N7254P6105J24962K3670r6375j08183k01806
9423b09110L6995M9757J11336N4520R432M3160j25722Q8209Q4048j28098J1168
9412B5695K12891j90209j71849L20647J8644r5847O3509r7908r6696q4458J47799
$$ plain form
9401 52218 162304 -56070 -181721 -172071 -77201 -180826 -353553 -382496 -202064 -55710 -79702
9390 -79702 -171946 -118790 -90495 -165481 -97280 -95851 -65124 92948 195463 208610 89264
9379 89264 161854 111180 -32502 -195157 -295771 -138580 67101 336705 238927 137513
9369 137513 102910 207589 118443 -41701 -65656 -155785 -51194 75740 138367 -42210 -17617
9358 -17617 -98096 -61782 -60038 79391 210042 293790 103556 -80381 -35952 184192 295724
9347 295724 198040 -6922 19468 -82154 13094 86788 220595 196877 144588 180800 190066
9336 190066 227653 121321 193578 202158 184794 191518 -28493 -71000 27998 190721 254331
9325 254331 284607 282073 285964 179727 118334 62575 -31709 -67891 54397 -32027 -72130 -93299
$$ packed form
9401E2218J10086k18374j25651R650R4870j03625j72727k8943J80432J46354k3992
9390g9702r2244N3156K8295p4986O8201J429L0727J58072J02515J3147j19346
9379H9264P2590n0674j43682j62655j00614J57191K05681K69604r7778j01414
9369A37513l4603J04679q9146j60144k3955r0129J04591J26934O2627j80577K4593
9358a7617q0479L6314J744J39429J30651Q3748j90234j83937M4429K20144J11532
9347B95724r7684k04962K6390j01622R5248P3694J33807k3718n2289L6212R266
9336A90066L7587j06332P2257Q580j7364O724k20011m2507R8998J62723O3610
9325B54331L0276k534L891j06237o1393n5759r4284l6182J22288q6424m0103k1169
$$ plain form
9313 -93299 -183125 -54443 -1163 -33012 103315 201200 63925 -40387 -18192 103493 304365
9302 304365 265490 146201 50016 77184 104869 146971 124893 89030 237467 299275 172855
9291 172855 20163 133014 45090 69682 72234 102625 57037 -947 120113 37576 67359
9280 67359 108099 4821 -86997 -121822 -76994 50170 -19775 -19194 -31913 -114882 -185921 -117298
9268 -117298 -108336 102731 237941 269386 250138 237784 227961 155753 50211 -40754 72564
9257 72564 177810 191907 99796 142483 -62005 -200757 -273118 -125601 -163020 -176377 -88583
9246 -88583 -76845 5386 -1879 -81113 -82288 239500 277473 214746 107087 166373 172791 77183
9234 77183 42137 -20125 -124061 -45767 80942 67838 174426 339950 188464 139782 218429
$$ packed form
9313i3299q9826J28682N3280l1849J36327R7885j37275j04312K2195J21685K00872
9302C04365l8875j19289r6185K7168K7685M2102k2078l5863J48437O1808j26420
9291A72855j52692J12851q7924K4592K552L0391m5588n7984J21060q2537K9783
9280F7359M0740j03278r1818l4825M4828J27164o9945N81j2719q2969p1039O8623
9268a17298Q962K11067J35210L1445j9248j2354r823p2208j05542r0965J13318
9257G2564J05246J4097r2111M2687k04488j38752p2361J47517l7419j3357Q7794
9246h8583J1738Q2231p265p9234j175L21788L7973o2727j07659N9286O418r5608
9234G7183l5046o2262j03936P8294J26709j3104J06588J65524j51486m8682P8647
$$ plain form
9223 218429 338275 230308 238170 279176 297118 39657 -183451 -190820 -42197 -3953 48207
9212 48207 163926 122909 -36895 -53444 92490 153679 250146 366672 330206 228063 157789
9201 157789 214300 266998 148241 -1125 98372 70309 62150 163171 78708 66020 48798
9190 48798 -54079 -81442 176005 326894 339950 201210 -130923 -209286 -113674 -215489 -156308
9179 -156308 0 136445 151663 66396 -2756 31008 81314 -20445 -167256 -92622 -167095
9168 -167095 -199380 -258148 -352313 -277254 -93202 68882 230743 188603 169441 149722 -121345
9157 -121345 -205098 -163669 -81611 -116458 -36609 127691 86492 51384 216111 241943 101448
9146 101448 24275 1473 -19354 -48510 19355 97428 101398 -26493 11246 25042 -10157 47495
$$ packed form
9223B18429J19846j07967P862M1006J7942k57461k23108p369J48623L8244N2160
9212D8207J15719m1017j59804j6549J45934O1189R6467J16526l6466j02143p0274
9201A57789N6511N2698j18757j49366R9497k8063q159J01021q4463j2688j7222
9190D8798j02877k7363K57447J50889J3056j38740l32133p8363R5612j01815N9181
9179a56308J56308J36445J5218q5267o9152L3764N0306j01759j46811P4634p4473
9168a67095l2285n8768r4165P5059J84052J62084J61861m2140j9162j9719k71067
9157a21345q3753M1429Q2058l4847P9849J64300m1199l5108J64727K5832j40495
9146A01448p7173k2802k0827k9156O7865P8073L970j27891L7739J3796l5199N7652
$$ plain form
9134 47495 95651 -13691 -202732 -225529 -73024 -100437 -237157 -107432 4563 29958 -70509
9123 -70509 -84125 31745 19606 -45256 37177 177337 208326 109232 9289 -105340 -119718
9112 -119718 -120043 -17265 115261 95360 108777 150486 18337 -54694 -46963 -157018 -227510
9101 -227510 -170448 -44831 -8425 67928 -71127 -220479 -255474 -406295 -272868 -53180
9091 -53180 12518 12711 -43875 24904 278458 279541 165267 92902 88045 67088 102627 5045
9079 5045 -100211 -148441 -82219 69049 108205 4207 56681 81051 -16717 13218 -48321
9068 -48321 31105 177480 185870 98140 87081 63347 73655 41862 43980 -1347 -15727 -71697
9056 -71697 -97995 -221780 -190186 -69917 -67118 -51368 -80373 -224379 -263729 -152006 89857
$$ packed form
9134D7495M8156j09342j89041k2797J52505k7413j36720J29725J11995K5395j00467
9123g0509j3616J15870j2139o4862Q2433J40160L0989r9094r9943j14629j4378
9112a19718l25J02778J32526j9901J3417M1709j32149p3031P731j10055p0492
9101b27510N7062J25617L6406P6353j39055j49352l4995j50821J33427K19688
9091e3180O5698J93n6586O8779K53554J083j14274p2365m857k0957L5539r7582
9079E045j05256m8230O6222J51268L9156j03998N2474K4370r7768K9935o1539
9068d8321P9426J46375Q390q7730j1059k3734J0308l1793K118m5327j4380n5970
9056g1697k6298j23785L1594J20269K799J5750k9005j44006l9350J11723K41863
$$ plain form
9045 89857 121349 80785 183054 231403 225614 52623 -42945 -12071 28815 8793 -79757 -26837
9033 -26837 50358 -38122 -123345 -101525 7659 47798 -31253 -73401 -69380 -196185 -234436 -214210
9021 -214210 -361267 -261737 -117002 -32101 -21578 32482 5769 -109060 42243 205820 140854
9010 140854 -84521 -134625 2271 164652 233382 164051 139002 103387 22786 -115208 -85786
8999 -85786 -130386 -177794 -21956 37001 -18942 21452 60928 160200 127785 39518 -3892 38561
8987 38561 166224 -14862 -209738 -203075 -116718 -30282 96390 141591 57870 125658 245736
8976 245736 219087 109670 124389 117183 26740 13928 -49242 -110925 -101778 -126906 -67038 -82755
8964 -82755 -26848 -104999 25647 98290 14995 -80318 -147235 -270976 -177327 -64648 55590
$$ packed form
9045H9857L1492m0564J02269M8349n789j72991r5568L0874M0886k0022q8550N2920
9033b6837P7195q8480q5223K1820J09184M0139p9051m2148M021j26805l8251K0226
9021b14210j47057R9530J44735Q4901J0523N4060k6713j14829J51303J63577o4966
9010A40854k25375n0104J36896J62381O8730o9331k5049l5615q0601j37994K9422
8999h5786m4600m7408J55838N8957n5943M0394L9476R9272l2415q8267m3410M2453
8987C8561J27663j81086j94876O663Q6357Q6436J26672M5201q3721O7788J20078
8976B45736k6649j09417J4719p206r0443j2812o3170o1683R147k5128N9868j5717
8964h2755N5907p8151J30646P2643q3295r5313o6917j23741R3649J12679J20238
$$ plain form
8953 55590 82795 20912 96078 142915 136164 235781 230032 73074 32261 -95272 -65277 88682
8941 88682 87095 62616 42023 3261 -21715 63966 103088 133138 116883 153708 197733 44928
8929 44928 65049 92112 28993 26027 44289 -261550 -279868 -144851 91779 143659 117226
8918 117226 136511 214073 265345 347225 246102 150416 -97109 -180623 -66681 10231 -14978
8907 -14978 -42998 29797 22373 117522 244965 342618 204438 -68113 -49084 -65590 32298
8896 32298 95384 134138 81866 59256 13790 10245 -91311 -95104 181180 144834 39548 143962
8884 143962 289778 256076 274429 180319 130621 192524 357959 295346 115831 106494 56511
8873 56511 82951 60234 173282 171623 274277 332844 204964 126587 41300 -143415 -263960
$$ packed form
8953E5590K7205o1883P5166M6837o751R9617n749j56958m0813j27533K9995J53959
8941H8682j587k4479k0593l8762k4976Q5681L9122L0050j6255L6825M4025j52805
8929D4928K0121K7063o3119k966J8262l05839j8318J35017K36630N1880k6433
8918A17226J9285P7562N1272Q1880j01123r5686k47525q3514J13942P6912k5209
8907a4978k8020P2795p424R5149J27443R7653j38180k72551J9029j6506R7888
8896C2298O3086L8754n2272k2610m5466l545j01556l793K76284l6346j05286J04414
8884A43962J45816l3702J8353r4110m9698O1903J65435o2613j79515r337m9983
8873E6511K6440k2717J13048j659J02654N8567j27880p8377q5287j84715j20545
$$ plain form
8862 -263960 -118292 153685 106962 -69987 -82407 -204022 -273149 -313256 -202219 -191933 -295944
8851 -295944 -245761 -195998 3854 9961 -54266 -15263 154461 25148 -65902 170870 144458
8840 144458 -38078 -144559 -121403 -124883 80002 159443 213392 198910 106230 -17589 93308
8829 93308 208935 231427 90608 225106 291329 -17777 -121448 -109968 -16025 62233 191659
8818 191659 150360 180705 130029 278809 423065 482962 323165 183578 108633 -154585 -148883
8807 -148883 -49150 -123819 -90076 -3803 126639 65898 100788 75217 183961 82789 -41806
8796 -41806 -168394 -39234 201633 133533 242299 255185 138549 82336 67958 70453 46766
8785 46766 20272 64807 52201 -42554 -52709 183238 282154 274449 34411 -40877 -9348 170612
$$ packed form
8862b63960J45668K71977m6723j76949j2420j21615o9127m0107J11037J0286j04011
8851b95944N0183M9763J99852O107o4227L9003J69724j29313r1050K36772k6412
8840A44458j82536j06481K3156l480K04885P9441N3949j4482r2680j23819J10897
8829I3308J15627K2492j40819J34498O6223l09106j03671J1480R3943P8258J29426
8818A91659m1299L0345n0676J48780J44256N9897j59797j39587p4945k63218N702
8807a48883R9733p4669L3743Q6273J30442o0741L4890k5571J08744j01172j24595
8796d1806j26588J29160K40867o8100J08766J2886j16636n6213j4378K495k3687
8785D6766k6494M4535j2606r4755j0155K35947R8916p705k40038p5288L1529J79960
$$ plain form
8773 170612 161189 142773 192317 230193 295563 227766 117657 213781 232994 175082 140374 135069
8761 135069 103845 59610 -8323 -45403 -52701 82640 196284 301561 384000 250308 280309
8750 280309 293682 93738 108438 104276 115444 162075 55893 6340 210725 317836 107752
8739 107752 -33362 -93498 27610 172187 161085 62945 -6448 46355 83487 112919 171193
8728 171193 193526 144320 221426 219624 159731 14970 11544 80674 136128 35372 178852
8717 178852 247403 219978 170626 134869 119308 177600 244421 331517 351260 21090 -196574
8706 -196574 -183581 -55942 73410 41299 55293 48986 90913 60911 45184 127859 626
8695 626 9368 88954 118513 -29957 129135 346505 296423 221151 389782 388549 503590 488656
$$ packed form
8773A70612r423j8416M9544L7876O5370o7797j10109R6124J9213n7912l4708n305
8761A35069l1224m4235o7933l7080p298J35341J13644J05277Q2439j33692L0001
8750B80309J3373j99944J4700m162J1168M6631j06182m9553K04385J07111k10084
8739A07752j41114o0136J21108J44577j1102r8140o9393N2803L7132K9432N8274
8728A71193K2333m9206P7106j802n9893j44761l426O9130N5454j00756J43480
8717A78852O8551k7425m9352l5757j5561N8292O6821Q7096J9743l30170k17664
8706a96574J2993J27639J29352l2111J3994o307M1927l0002j5727Q2675j27233
8695F26Q742P9586K9559j48470J59092K17370n0082p5272J68631j233J15041j4934
$$ plain form
8683 488656 429014 298739 213443 106213 133791 311238 422780 494898 591940 597852 416668
8672 416668 363031 686288 881044 833636 509984 419246 466125 427015 198783 185346 243575
8661 243575 293805 384502 386580 405530 442835 456495 592058 407784 379618 374645 373378 303384
8649 303384 39656 111778 279134 390543 280542 281389 292776 222792 218176 227039 270188 318484
8637 318484 323269 362146 355390 356603 340698 350673 255793 411771 389624 349311 415009 344569
8625 344569 371396 518409 403326 283905 425806 411016 420841 422627 421062 466243 556298
8614 556298 618205 549211 381159 386821 408216 386119 419996 574686 519434 447011 518371
8603 518371 628817 602686 611353 681265 845514 988945 1016372 802299 760604 843442 921768
$$ packed form
8683D88656n9642j30275q5296j07230K7578J77447J11542P2118R7042N912j81184
8672D16668n3637L23257J94756m7408l23652r0738M6879l9110k28232j3437N8229
8661B43575N0230R0697K078J8950L7305J3660J35563j84274k8166m973j267o9994
8649C03384k63728P2122J67356J11409j10001Q47J1387o9984m616Q863M3149M8296
8637C18484M785L8877o756J213j5905R975r4880J55978k2147m0313O5698p0440
8625C44569K6827J47013j15083j19421J41901j4790R825J786j565M5181R0055
8614E56298O1907o8994j68052N662K1395k2097L3877J54690n5252p2423P1360
8603E18371J10446k6131Q667O9912J64249J43431K7427k14073m1695Q2838P8326
$$ plain form
8592 921768 928975 827672 607113 587035 674775 768465 924363 1013601 1093105 1109070 1240930
8581 1240930 1301207 1540192 1818849 1869874 1863473 1929145 2000518 1985112 2172313 2485163 2961736
8570 2961736 3168193 3211373 3503624 3622394 3715862 3630916 3495511 3250254 2962698 2805174
8560 2805174 2819512 2743917 2488595 2385972 2295785 2119737 1891684 1638795 1716744 1660168
8550 1660168 1579675 1485262 1405286 1259618 1094417 1003614 1051532 1102725 999320 917578 974365
8539 974365 1075638 1190214 1228121 1107543 1246670 1325859 1605905 2009848 2623546 3458098
8529 3458098 4146776 4324912 3778816 2919732 2248915 1739169 1346319 1175462 998701 916422
8519 916422 736076 664426 613863 649387 624803 633293 547464 588181 583201 571413 335464 355754
$$ packed form
8592I21768P207j01303k20559k0078Q7740R3690J55898Q9238P9504J5965J31860
8581A240930O0277K38985K78657N1025o401O5672P1373j5406J87201L12850M76573
8570B961736K06457M3180K92251J18770R3468q4946j35405k45257k87556j57524
8560B805174J4338p5595k55322j02623r0187j76048k28053k52889P7949n6576
8550A660168q0493r4413p9976j45668j65201r0803M7918N1193j03405q1742N6787
8539I74365J01273J14576L7907j20578J39127P9189K80046M03943O13698Q34552
8529C458098O88678J78136n46096q59084o70817n09746l92850j70857j76761q2279
8519I16422j80346p1650n0563L5524k4584Q490q5829M0717m980j1788k35949K0290
$$ plain form
8507 355754 487860 678654 732093 646661 324271 172010 340210 624884 564903 528126
8497 528126 497120 405001 594128 656591 912762 1026537 1267429 1444753 1591088 2140867
8487 2140867 2923553 3946592 5407428 6805415 7221910 6258306 4632027 3331637 2469450
8478 2469450 1966541 1700554 1577072 1545283 1460151 1317725 1131266 924892 911498 955950
8468 955950 920625 787951 566409 551516 723387 784105 844201 811854 760543 747334 716936
8457 716936 610259 371260 312641 499038 652530 521759 349223 301920 436587 462233
8447 462233 479652 494457 397732 526606 808650 1250509 1775657 2530895 3305712 3447071
8437 3447071 3088994 2521568 1799859 1212948 969801 883403 776426 625605 439167 536030
$$ packed form
8507C55754J32106J90794N3439q5432l22390j52261J68200K84674n9981l6777
8497E28126l1006r2119J89127O2463K56171J13775K40892J77324J46335N49779
8487B140867P82686J023039J460836J397987M16495r63604j626279j300390q62187
8478B469450n02909k65987j23482l1789q5132j42426j86459k06374j3394M4452
8468I55950l5325j32674k21542j4893J71871O0718O0096l2347n1311j3209l0398
8457G16936j06677k38999n8619J86397J53492j30771j72536m7303J34667K5646
8447D62233J7419J4805r6725J28874K82044M41859N25148P55238P74817J41359
8437C447071l58077n67426p21709n86911k43147q6398j06977j50821j86438R6863
$$ plain form
8427 536030 535013 511858 396553 250964 448383 474292 464678 480379 551204 583784 517827
8416 517827 533917 482370 218955 143274 145380 216023 301812 286438 235093 206751 215408 164636
8404 164636 128787 216851 255065 138803 343166 542958 423773 84398 108625 151854 112649
8393 112649 -7008 89736 274300 297789 161597 46916 103108 60978 61384 260504 171874
8382 171874 53267 -159159 -234995 -117328 28897 169556 157692 156056 193105 146057 223451
8371 223451 150672 51021 -30523 -42421 -19010 -44905 -86924 -69892 -208886 -177189 -187716
8360 -187716 -142004 -89167 -76252 135354 146141 -135106 -96192 -151287 -61011 -95224 7891
8349 7891 170504 354274 374470 194044 37074 -24499 -81421 100526 160587 227800 123746
$$ packed form
8427E36030j017k3155j15305j45589J97419K5909r614J5701P0825L2580o5957
8416E17827J6090n1547k63415p5681K106P0643Q5789j5374n1345k8342Q657n0772
8404A64636l5849Q8064L8214j16262K04363J99792j19185l39375K4227M3229l9205
8393A12649j19657R6744J84564K3489j36192j14681N6192m2130M06J99120q8630
8382A71874j18607k12426p5836J17667J46225J40659j1864j636L7049m7048P7394
8371B23451p2779r9651q1544j1898K3411k5895m2019J7032j38994L1697j0527
8360a87716M5712N2837J2915K11606J0787k81247L8914n5095R0276l4213J03115
8349G891J62613J83770K0196j80426j56970o1573n6922J81947O0061O7213j04054
$$ plain form
8338 123746 150808 45759 -49225 97385 204450 173293 341483 421257 464798 319013 145520
8327 145520 102260 93635 -17347 -110686 -120650 -26342 93705 266924 300882 282625 129685
8316 129685 30219 16329 94248 248150 217358 52669 -211036 -268194 -335056 -312243 -180841
8305 -180841 -92099 -207120 -378341 -300799 -341924 -288245 -120765 76222 179105 40105
8295 40105 66790 214102 196345 48938 19669 -141885 -92520 -80410 -94957 -15240 39095
8284 39095 847 -30360 -51754 -45383 46534 -50503 -81855 15017 7609 -132539 -171008 -63148
8272 -63148 51838 75945 101075 96828 86257 66996 62714 51938 -3952 -101502 -78704 -19068
8260 -19068 -15628 16373 21050 63692 26925 190132 231043 239206 237557 51248 152348 110061
$$ packed form
8338A23746K7062j05049r4984J46610J07065l1157J68190P9774M3541j45785j73493
8327A45520m3260q625j10982r3339r964R4308J20047J73219L3958j8257j52940
8316A29685r9466j3890P7919J53902l0792j64689k63705n7158o6862K2813J31402
8305a80841Q8742j15021j71221P7542m1125N3679J67480J96987J02883j39000
8295D0105K6685J47312j7757j47407k9269j61554M9365J2110j4547P9717N4335
8284C9095l8248l1207k1394O371R1917r7037l1352R6872p408j40148l8469J07860
8272f3148J14986K4107K5130m247j0571j9261m282j0776n5890r7550K2798N9636
8260a9068L440L2001M677M2642l6767J63207M0911Q163j649j86309J01100m2287
$$ plain form
8248 110061 -15955 -257934 -264187 -124417 -66433 -78831 -31753 109928 194205 -74862 -289000
8237 -289000 -252282 -28320 -50384 34637 92070 81589 123879 284924 276808 269076 242119 200240
8225 200240 26472 -133619 -103287 100506 157499 130645 119335 281911 325390 224391 75864
8214 75864 110319 263434 242531 152938 278671 469178 390042 232751 220544 105368 -97034
8203 -97034 -72410 -25147 17314 26796 86233 156871 39686 74201 235703 260473 35372
8192 35372 -160107 -3368 -35079 -28140 -139996 -18894 81738 -67157 4107 219960 149492
8181 149492 -60642 -185553 -129439 -235642 -99280 27915 -123880 -172494 -240629 -268178
8171 -268178 -96781 -66830 -65495 -34040 -73118 86088 132192 -13971 -179425 -52988 23186
$$ packed form
8248A10061j26016k41979o253J39770N7984j2398M7078J41681Q4277k69067k14138
8237b89000L6718K23962k2064Q5021N7433j0481M2290J61045q116p732k6957m1879
8225B00240j73768j60091L0332K03793N6993k6854j1310J62576M3479j00999j48527
8214G5864L4455J53115k0903q9593J25733J90507p9136j57291j2207j15176k02402
8203i7034K4624M7263M2461R482N9437P0638j17185L4515J61502K4770k25101
8192C5372j95479J56739l1711O939j11856J21102J00632j48895P1264K15853p0468
8181A49492k10134j24911N6114j06203J36362J27195j51795m8614o8135k7549
8171b68178J71397K9951J335L1455l9078J59206M6104j46163j65454J26437P6174
$$ plain form
8160 23186 111697 47385 8050 142887 160233 130732 64599 42600 105313 169997 267156 246693
8148 246693 101393 42943 60723 -79713 -260166 -195886 -109436 -31804 -13643 -156261 -24307
8137 -24307 77616 66674 97755 123949 166233 52081 -148178 -59405 -116952 -230985 -182979
8126 -182979 -163507 -165448 -12547 -89033 -188101 -209332 -182939 -12870 -41218 -101778 -82423
8115 -82423 146659 241214 321215 184034 -32732 -140006 -143564 -77961 -87586 -131628 -78358
8104 -78358 -49956 -163971 -84561 65244 73824 8428 41399 -56388 -239599 -254128 -114090
8093 -114090 -101679 29845 -18078 -1749 105872 228355 232576 248443 195948 61888 14029
8082 14029 119491 179646 168242 24877 -18854 6442 9450 14833 107721 212082 200934 14598
$$ packed form
8160B3186Q8511o4312l9335J34837J7346k9501o6133k1999O2713O4684R7159k0463
8148B46693j45300n8450J7780j40436j80453O4280Q6450P7632J8161j42618J31954
8137b4307J01923j0942L1081K6194M2284j14152k00259Q8773n7547j14033M8006
8126a82979J9472j941J52901p6486r9068k1231K6393J70069k8348o0560J9355
8115h2423K29082R4555Q0001j37181k16766j07274l558O5603r625m4042N3270
8104g8358K8402j14015P9410J49805Q580o5396L2971r7787j83211j4529J40038
8093a14090J2411J31524m7923J6329J07621J22483M221J5867n2495j34060m7859
8082A4029J05462O0155j1404j43365m3731K5296L008N383R2888J04361j1148j86336
$$ plain form
8070 14598 -91810 -75634 -86316 64694 41385 24445 86000 74807 119980 119523 201586 327598
8058 327598 191999 27713 69245 81759 39339 22576 -75197 -54982 126676 223011 221579
8047 221579 244360 54706 -63854 -47198 -194515 -236745 -209945 -81051 26844 124085 172216
8036 172216 284324 187306 116901 207329 219048 246518 61643 86914 240461 155622 171284
8025 171284 151698 282570 533894 335498 147938 207485 300453 253219 216991 157627 112701
8014 112701 203748 345665 449462 518680 434299 477585 411111 234108 374531 351023 391450
8003 391450 392068 226379 353287 331825 241403 222630 356772 366820 434044 470101 498594
7992 498594 462195 282450 228623 189750 108231 97267 191908 349675 320187 400154 486922
$$ packed form
8070A4598j06408J6176j0682J51010k3309j6940O1555j1193M5173m57Q2063J26012
8058C27598j35599j64286M1532J2514m2420j6763r7773K0215J81658R6335j432
8047B21579K2781j89654j18560J6656j47317m2230K6800J28894J07895R7241M8131
8036A72216J12108r7018p0405R0428J1719K7470j84875K5271J53547q4839J5662
8025A71284j9586J30872K51324j98396j87560N9547R2968m7234l6228n9364m4926
8014A12701R1047J41917J03797O9218q4381M3286o6474j77003J40423k3508M0427
8003C91450O18j65689J26908k1462r0422j8773J34142J0048O7224L6057K8493
7992D98594l6399j79745n3827l8873q1519j0964R4641J57767k9488P9967Q6768
$$ plain form
7981 486922 444919 304658 334591 273531 227885 336070 609837 740484 917116 970001 867630
7970 867630 837652 720179 594800 575773 678954 603701 604025 522302 430399 560846 667569
7959 667569 746263 712087 709871 701448 687336 634922 686364 530965 561243 648755 675732 791268
7947 791268 762147 529825 345756 450702 524920 486100 357781 196135 256568 547796
7937 547796 603640 550244 627471 710671 651942 687873 677793 664963 736365 816866 774577 693232
7925 693232 536712 441134 376781 358385 499252 443302 260149 82354 109257 155152 215863
7914 215863 303914 308905 232420 121414 62365 94837 106851 198486 220533 103631 236378
7903 236378 305326 242057 124278 105889 220645 189672 202549 212763 190605 254402 342830
$$ packed form
7981D86922m2003j40261K9933o1060m5646J08185K73767J30647J76632N2885j02371
7970H67630k9978j17473j25379j9027J03181p5253L24q1723r1903J30447J06723
7959F67569P8694l4176k216q423j4112n2414N1442j55399L0278Q7512K6977J15536
7947G91268k9121k32322j84069J04946P4218l8820j28319j61646O0433K91228
7937E47796N5844n3396P7227Q3200n8729L5931j0080j2830P1402Q0501m2289q1345
7925F93232j56520r5578o4353j8396J40867n5950j83153j77795K6903M5895O0711
7914B15863Q8051M991p6485j11006n9049L2472J2014R1635K2047j16902J32747
7903B36378O8948o3269j17779j8389J14756l0973J2877J0214k2158O3797Q8428
$$ plain form
7892 342830 357232 262914 300016 298215 133748 87665 65430 126878 127005 223655 245514 285087
7880 285087 244533 166853 259513 236702 87984 98861 -21758 -82162 37133 -1889 -207982
7869 -207982 -220752 -184389 -200361 -92400 144847 207787 165819 112303 89529 50170 -31287
7858 -31287 -102241 -45896 10755 102084 148750 34275 15729 104244 11267 -10343 46516 9487
7846 9487 53369 -132168 -212600 -88823 -125532 -14997 43222 16221 -22418 -60640 47342
7835 47342 162859 -36010 -193474 -127387 -102272 -172815 -142870 -163612 -199040 -193091 -149092
7824 -149092 -225383 -305481 -180748 -150647 -242305 -219299 53597 216796 203730 125424 39310
7813 39310 51250 135173 97636 118180 38007 -35081 -46263 -58226 14298 84004 30297 8073
$$ packed form
7892C42830J4402r4318L7102j801j64467m6083k2235O1448J27R6650K1859L9573
7880B85087m0554p7680R2660k2811j48718J0877j20619o0404J19295l9022k06093
7869b07982j2770L6363j5972J07961K37247O2940m1968n3516k2774l9359q1457
7858c1287p0954N6345N6651R1329M6666j14475j8546Q8515r2977k1610N6859l7029
7846I487M3882j85537q0432J23777l6709J10535N8219k7001l8639l8222J07982
7835D7342J15517j98869j57464O6087K5115p0543K9945k0742l5428N949M3999
7824a49092p6291q0098J24733L0101r1658K3006K72896J63199j3066p8306q6114
7813C9310J1940Q3923l7537K0544q0173p3088j1182j1963P2524O9706n3707k2224
$$ plain form
7801 8073 -50632 25043 -117626 -221371 -246162 -119375 103572 73121 202229 293673 330019
7790 330019 371646 226535 270911 260881 188072 193193 395492 395799 284833 154400 132751
7779 132751 243755 288558 123588 194430 290035 281119 96275 127337 105668 71326 207450
7768 207450 337373 128386 94478 -10213 32170 97321 115656 147800 188337 -20809 -93287
7757 -93287 -57552 -8519 32335 136339 33432 -39140 73932 39042 61379 51150 48649
7746 48649 -7011 -116451 -99540 1824 11017 15885 -5685 -52973 101277 100915 49664 62463
7734 62463 -69586 -98839 42523 84376 50700 52673 153072 149052 270473 264076 180188 149974
7722 149974 258101 292551 321614 228506 211125 247819 219150 68898 -70093 -84444 -76602
$$ packed form
7801H073n8705P5675j42669j03745k4791J26787K22947l0451J29108R1444L6346
7790C30019M1627j45111M4376j0030p2809N121K02299L07j10966j30433k1649
7779A32751J11004M4803j64970P0842R5605q916j84844L1062k1669l4342J36124
7768B07450J29923k08987l3908j04691M2383O5151J8335L2144M0537k09146p2478
7757i3287L5735M9033M0854J04004j02907p2572J13072l4890K2337j0229k501
7746D8649n5660j09440J6911J01364R193M868k1570m7288J54250l62n1251J2799
7734F2463j32049k9253J41362M1853l3676J973J00399m020J21421o397q3888l0214
7722A49974J08127L4450K9063r3108j7381L6694k8669j50252j38991j4351P842
$$ plain form
7711 -76602 -189127 -107266 29761 -129148 -177997 -160412 -353029 -308337 -261705 -303386 -271801
7700 -271801 -349578 -339585 -66675 -26198 -158608 -97708 6627 18401 1716 29705 -59792
7689 -59792 -23143 -9550 -253462 -252712 -150642 -108883 -254807 -213087 -66818 -44062 -77840
7678 -77840 -80032 -83518 -69258 -202471 -203886 -101775 -46698 -23718 -5166 -57573 66221 172111
7666 172111 310099 192256 105742 71310 -61899 -249265 -137392 -42280 10888 91161 113881
7655 113881 104916 -76586 -120669 40335 278622 99835 -192605 -343733 -169283 -163240 -116799
7644 -116799 6458 2790 5883 -119553 -23263 -70634 -221921 -63263 64969 -102443 -205468
7633 -205468 -137000 96044 130001 49130 86251 146114 -47621 -204726 -195354 -11852 61094
$$ packed form
7711g6602j12525Q1861J37027j58909m8849J7585j92617M4692M6632m1681L1585
7700b71801p7777R993K72910M0477j32410O0900J04335J1774j6685K7989q9497
7689e9792L6649J3593k43912P50J02070M1759j45924M1720J46269K2756l3778
7678g7840k192l486J4260j33213j415J02111N5077K2980J8552n2407J23794J05890
7666A72111J37988j17843q6514l4432j33209j87366J11873R5112N3168Q0273K2720
7655A13881q965j81502m4083J61004K38287j78787k92440j51128J74450O043M6441
7644a16799J23257l668L093j25436R6290m7371j51287J58658J28232j67412j03025
7633b05468O8468K33044L3957q0871L7121N9863j93735j57105R372J83502P2946
$$ plain form
7622 61094 77590 134251 266055 102752 -83974 -132166 -200128 -254787 -186100 -81809 -141717
7611 -141717 -38368 44347 4377 -77055 -39645 30547 -37394 -158667 -233451 -253979 -212024
7600 -212024 -236894 -145995 -127127 -169244 -70321 -41899 -207131 -334122 -321840 -102779 -22156
7589 -22156 8286 148307 121205 -104690 -201128 -148475 -176292 -49552 28081 225385 251146
7578 251146 112202 89573 157273 176663 255718 238721 126865 -43253 -172916 -159078 -3696
7567 -3696 111952 119099 149375 48056 -26034 -28602 -140093 -299118 -189032 69202 109021
7556 109021 51558 19435 -118737 -48548 -138897 -244171 -287679 -220067 -91205 -105977 -194139
7545 -194139 -247291 -189092 -152883 -59061 -12649 -210617 -38970 112292 152209 54751 74560
$$ packed form
7622F1094J6496N6661J31804j63303j86726m8192o7962n4659O8687J04291n9908
7611a41717J03349Q2715l9970q1432L7410P0192o7941j21273p4784k0528M1955
7600b12024k4870R0899J8868m2117R8923K8422j65232j26991J2282K19061Q0623
7589b2156L0442J40021k7102k25895r6438N2653k7817J26740P7633J97304K5761
7578B51146j38944k2629O7700J9390P9055j6997j11856j70118j29663J3838J55382
7567c696J15648P147L0276j01319p4090k568j11491j59025J10086K58234L9819
7556A09021n7463l2123j38172P0189r0349j05274m3508O7612J28862j4772q8162
7545a94139n3152N8199L6209R3822M6412j97968J71647J51262L9917r7458J9809
$$ plain form
7534 74560 202498 84552 -6821 5657 147317 114913 148416 -12575 -48827 28454 77219
7523 77219 50718 -83562 -200799 -236669 -216162 -50437 31869 -208389 -199431 -6458 33453
7512 33453 -76960 -25127 -85753 8226 128458 -1870 -92533 -207211 -15095 -4018 25490
7501 25490 87665 -13333 -93800 -91876 51198 199770 205396 125367 -88019 -9804 122929
7490 122929 163265 -27462 -221582 -278306 -198317 -166363 1713 10988 -74437 -120713 -262651
7479 -262651 -149759 44490 145547 139667 18699 -100557 -18075 29532 20398 -127450 -81299
7468 -81299 46341 187539 156927 71053 -123190 -226867 -225056 -34851 -19390 -159320 -299389
7457 -299389 -293682 -198025 -167853 -175287 -16234 -38436 -25438 112437 77543 104060 101522 1160
$$ packed form
7534G4560J27938j17946r1373J2478J41660l2404L3503j60991l6252P7281M8765
7523G7219k6501j34280j17237l5870K0507J65725Q2306k40258Q958J92973L9911
7512C3453j10413N1833o0626R3979J20232j30328r0663j14678J92116J1077K9508
7501B5490O2175j00998q0467J924J43074J48572N626q0029k13386P8215J32733
7490A22929M0336j90727j94120n6724P9989L1954J68076R275q5425m6276j41938
7479b62651J12892J94249J01057n880j20968j19256Q2482M7607r134j47848M6151
7468h1299J27640J41198l0612q5874j94243j03677J811J90205J5461j39930j40069
7457b99389N707R5657L0172p434J59053k2202J2998J37875l4894K6517k538j00362
$$ plain form
7445 1160 -82643 -69207 92001 179054 158778 145643 112883 164791 367432 425982 292059
7434 292059 180339 282152 86797 28888 -74097 -161213 -246259 -91668 81726 89171 160548
7423 160548 -88653 -84816 -89109 -159906 -174837 -186448 -292658 -121138 159211 234077 -69910
7412 -69910 -206331 15457 -6915 -38184 23052 9907 -527 68402 -8448 -19469 -94834
7401 -94834 -163922 -28948 184541 203919 80548 -65324 -208691 -188819 -80491 -170775 -75245
7390 -75245 49502 116497 -78474 -163822 -76646 -71867 -58370 -74705 -123830 -97624 -43492 -91231
7378 -91231 -135739 -82270 4683 23727 -5302 60638 129052 171082 177816 131868 83064 43660
7366 43660 -50304 -174407 -146129 -113920 -59493 -146560 -123906 -213207 -241386 -282077 -348375 -434415
$$ packed form
7445A160q3803J3436J61208Q7053k0276j3135l2760N1908K02641N8550j33923
7434B92059j11720J01813j95355n7909j02985q7116q5046J54591J73394P445P1377
7423A60548k49201L837m293p0797j4931j1611j06210J71520K80349P4866l03987
7412f9910j36421K21788k2372l1269O1236j3145j0434O8929p6850j1021p5365
7401i4834o9088J34974K13489J9378j23371j45872j43367J9872J08328r0284R5530
7390g5245J24747O6995j94971q5348Q7176M779J3497j6335m9125K6206N4132m7739
7378i1231m4508N3469Q6953J9044k9029O5940O8414M2030O734m5948m8804l9404
7366D3660r3964j24103K8278L2209N4427q7067K2654q9301k8179m0691o6298q6040
$$ plain form
7354 -434415 -462602 -471765 -565200 -555831 -412958 -368853 -238842 -124223 -101490 -19672 -34129
7343 -34129 -86566 -256619 -171214 -126715 -114011 -153877 -124561 -118742 -119345 -35160 49909 96039
7331 96039 49856 51676 66884 -74459 -264639 -425017 -340588 -346471 -388035 -410457 -295125
7320 -295125 -140157 -47747 -12922 23641 7811 29211 58304 26636 -135075 -108304 75200
7309 75200 26060 -51851 54992 -160881 -160498 -240778 -289877 -197498 -176791 -65685 -100878 -192713
7297 -192713 -260610 -179552 -187849 -271743 -168003 -115556 -145684 -73992 41583 -117043 -43138
7286 -43138 79598 45460 -104044 -220002 -262521 -201761 -24476 -88192 24130 28929 -38773
7275 -38773 -106299 -186908 -206487 -197801 -178593 -81650 -171934 -245327 -103799 94157 139150 2529
$$ packed form
7354d34415k8187r163r3435R369J42873M4105J30011J14619K2733Q1818j4457
7343c4129n2437j70053Q5405M4499J2704l9866K9316N819o03Q4185Q5069M6130
7331I6039m6183J820J5208j41343j90180j60378Q4429n883m1564k2422J15332
7320b95125J54968R2410L4825L6563j5830K1400K9093l1668j61711K6771J83504
7309G5200m9140p7911J06843k15873L83q0280m9099R2379K0707J11106l5193r1835
7297a92713o7897Q1058q297q3894J03740N2447l0128P1692J15575j58626P3905
7286d3138J22736l4138j49504j15958m2519O0760J77285o3716J12322M799o7702
7275c8773o7526q0609j9579Q686J9208R6943r0284p3393J41528J97956M4993j36621
$$ plain form
7263 2529 40128 71284 105885 -56575 -199209 -67574 54156 232958 206402 250824 254214
7252 254214 24219 -91627 -185767 -185523 -227652 -214469 -286274 -475486 -389149 -171536 -162724
7241 -162724 -208275 -83846 187499 303979 83085 201743 353078 174456 -79817 -222639
7231 -222639 -190947 -227608 -56756 -156476 -63818 -1483 -30916 -82786 -1524 -1362 49207 -26399
7219 -26399 -119639 -63184 -24260 -67592 -154907 -160928 -48363 84077 97765 188661 250640 324171
7207 324171 71960 -132249 -58949 -112595 -267772 -312917 -156345 26390 1813 -141263
7197 -141263 -268004 -252276 -381312 -270696 -23612 -8787 -147819 -142858 61627 -210 -242441
7186 -242441 -335693 -396917 -356543 -310205 -263348 -330469 -273164 -198913 -228009 -162491 -54832
$$ packed form
7263B529L7599L1156L4601j62460j42634J31635J21730J78802k6556M4422L390
7252B54214k29995j15846r4140K44m2129J3183p1805j89212Q6337K17613Q812
7241a62724m5551J24429K71345J16480k20894J18658J51335j78622k54273j42822
7231b22639L1692l6661J70852r9720R2658O2335k9433n1870Q1262J62N0569p5606
7219b6399r3240N6455L8924m3332q7315o021J12565J32440J3688R0896O1979P3531
7207C24171k52211k04209P3300n3646j55177m5145J56572J82735k4577j43076
7197a41263j26741J5728j29036J10616K47084J4825j39032M961K04485o1837k42231
7186b42441r3252o1224M0374M6338M6857o7121N7305P4251k9096O5518J07659
$$ plain form
7175 -54832 26124 -169081 -221554 -71327 9094 31180 81678 82327 156417 434 -303587
7164 -303587 -233471 -157465 -104999 23545 -113163 -313216 -352480 -240502 -107742 -145676 -219274
7153 -219274 -81477 148557 275975 351510 243997 27984 -187879 -170819 -113750 -136873
7143 -136873 -91809 -73393 -210358 -220304 -216192 -126341 -31989 -54000 -197976 -236398 -30818
7132 -30818 108972 37002 -27161 -71707 -51551 -144288 -208475 -93165 12558 25933 -27453
7121 -27453 -72584 -51908 41447 40363 -33020 2255 2924 -9492 -72481 -224470 -205240 -212374
7109 -212374 -220448 -180701 -22559 -4214 -53320 -85678 -104245 -242370 -285231 -296545 -384244
7098 -384244 -463820 -356264 -305443 -255594 -146136 -15647 102801 233257 41633 -60838
$$ packed form
7175e4832Q0956j95205n2473J50227Q0421K2086N0498O49P4090j55983l04021
7164c03587P0116P6006N2466J28544j36708k00053l9264J11978J32760l7934p3598
7153b19274J37797K30034J27418P5535j07513k16013k15863J7060N7069k3123
7143a36873M5064J8416j36965r946M112Q9851R4352k2011j43976l8422K05580
7132c0818J39790p1970o4163m4546K0156r2737o4187J15310J05723J3375n3386
7121b7453m5131K0676R3355j084p3383L5275O69j2416o2989j51989J9230p134
7109b12374q074L9747J58142J8345m9106l2358j8567j38125m2861j1314q7699
7098c84244p9576J07556N0821M9849J09458J30489J18448J30456j91624j02471
$$ plain form
7088 -60838 -47060 21332 129589 26060 -153520 -262835 -254790 -220304 -290443 -241711 -87120
7077 -87120 -5162 -157528 -221946 -256101 -122465 -38495 -80529 -187089 -152871 -35127 -91150
7066 -91150 -232279 -195283 -78920 -186391 -139828 -7321 13568 -9805 -104635 -163935 -215468
7055 -215468 -201392 -269850 -131398 33452 102383 -106156 -255868 -145414 -194138 -172485 -11575
7044 -11575 46243 2575 -137637 -118273 -39409 23077 45221 -111801 -52243 27336 200394
7033 200394 111073 127522 107597 -5538 -141970 -165090 -27257 86251 179775 175345 53656
7022 53656 50009 134028 57320 72304 158513 83056 -64852 -133678 -244721 -242164 -299192 -256389
7010 -256389 -253065 -163863 -187366 -48496 23010 -166336 -137006 -21505 70366 -2199 -24566
$$ packed form
7088f0838J3778O8392J08257j03529j79580j09315Q045L4486p0139M8732J54591
7077h7120Q1958j52366o4418l4155J33636Q3970m2034j06560L4218J17744n6023
7066i1150j41129L6996J16363j07471M6563J32507K0889k3373r4830n9300n1533
7055b15468J4076o8458J38452J64850O8931k08539j49712J10454m8724K1653J60910
7044a1575N7818m3668j40212J9364P8864O2486K2144j57022N9558P9579J73058
7033B00394q9321J6449j9925j13135j36432k3120J37833J13508R3524m430j21689
7022E3656l647Q4019p6708J4984Q6209p5457j47908o8826j11043K557n7028M2803
7010b56389L324Q9202k3503J38870P1506j89346K9330J15501R1871p2565k2367
$$ plain form
6999 -24566 106567 271247 227975 126391 63284 -17645 -58933 -165670 -299971 -407236 -224659
6988 -224659 -153490 -155577 -272842 -207858 4743 -13303 28605 191852 119122 -40982 -209000
6977 -209000 -266169 -139709 12021 2476 -98636 -117928 -145906 -102922 34115 26336 -21772
6966 -21772 24570 -79709 -39440 -37273 -175535 -271856 -96186 42747 79103 36910 -69020
6955 -69020 -124519 -86374 -26461 -119107 -233538 -295482 -215610 -227360 17601 135656 -24139
6944 -24139 -168912 -273073 -153788 -103842 -125207 -66382 -111529 -213481 -183924 -4685 -70578
6933 -70578 -232424 -184025 -147963 -90755 -203102 -286389 -330497 -200055 69650 76980 96985
6922 96985 22409 -20368 -98425 140 41779 86157 86033 -76372 -160758 -108981 77234 106987
$$ packed form
6999b4566J31133J64680m3272j01584o3107q0929m1288j06737j34301j07265J82577
6988b24659P1169k087j17265O4984K12601j8046M1908J63247p2730j60104j68018
6977b09000n7169J26460J51730r545j01112j9292k7978M2984J37037p779m8108
6966b1772M6342j04279M0269K167j38262r6321J75670J38933L6356m2193j05930
6955f9020n5499L8145N9913r2646j14431o1944P9872j1750K44961J18055j59795
6944b4139j44773j04161J19285M9946k1365N8825m5147j01952K9557J79239o5893
6933g0578j61846M8399L6062N7208j12347q3287m4108J30442K69705P330K0005
6922I6985p4576m2777p8057R8565M1639M4378j24j62405q4386N1777J86215K9753
$$ plain form
6910 106987 144868 171033 -28355 -263305 -418226 -299040 -271655 -179112 -110330 160443 99927
6899 99927 -803 75360 86097 25551 -26369 14354 172555 313429 133554 83346 -53837
6888 -53837 -75564 75543 -32337 -204982 -154736 -215581 -93074 97791 126433 108886 185390
6877 185390 123685 96510 -9997 -117930 -108666 22386 163056 59058 -73393 -274003
6867 -274003 -324950 -240728 -180641 42600 30435 -39353 13899 -128173 -360556 -348075 -357421
6856 -357421 -241096 -145057 -1212 27984 -70671 -179354 -193451 22243 150027 165956 201687
6845 201687 139975 -64695 -110554 32510 106878 124346 31398 -25021 93903 147432 110108
6834 110108 -23540 -99187 -171005 -31270 228623 184184 -19548 -165094 -217756 -276815 -311796
$$ packed form
6910A06987L7881K6165j99388k34950j54921J19186K7385R2543O8782K70773o0516
6899I9927j00730P6163J0737o0546n1920M0723J58201J40874j79875n0208j37183
6888e3837k1727J51107j07880j72645N0246o0845J22507J90865K8642j7547P6504
6877A85390o1705k7175j06507j07933R264J31052J40670j03998j32451k00610
6867b74003n0947Q4222O0087K23241j2165o9788N3252j42072k32383J2481r346
6856c57421J16325R6039J43845K9196r8655j08683j4097K15694J27784J5929L5731
6845B01687o1712k04670m5859J43064P4368J7468r2948n6419J18924N3529l7324
6834A10108j33648p5647p1818J39735K59893m4439k03732j45546n2662n9059l4981
$$ plain form
6823 -311796 -199323 -119237 -69771 92415 95872 2008 214902 197337 128555 204390 104577
6812 104577 13176 56326 239489 275791 120434 -120806 -110354 -125360 -183753 -159124 -5940
6801 -5940 35001 177710 72903 -128610 -206152 -125633 -141282 -198291 -383241 -469913 -296746
6790 -296746 -97592 4011 -24279 -215063 -206632 22086 -76166 -194372 -148147 10606 14313
6779 14313 -45666 -142355 -242584 -138978 -229616 -121694 -140242 -96643 -1712 -19960 -61013
6768 -61013 -81719 -128136 -227989 -370378 -318170 -175116 -179774 -183431 -299845 -283010 -155205
6757 -155205 -250650 -269733 -192534 -124283 -36160 51786 -36098 -256549 -335877 -151121 -167584
6746 -167584 -270799 -81741 -57853 -63146 127490 61065 56931 -120806 47787 -26437 -43738
$$ packed form
6823c11796J12473Q0086M9466J62186L457r3864K12894j7565o8782P5835r9813
6812A04577r1401M3150J83163L6302j55357k41240J0452j5006n8393K4629J53184
6801e940M0941J42709j04807k01513p7542Q0519j5649n7009j84950q6672J73167
6790b96746J99154J01603k8290j90784Q431K28718r8252j18206M6225J58753L707
6779A4313n9979r6689j00229J03606r0638J07922j8548M3599R4931j8248m1053
6768f1013k0706m6417r9853j42389N2208J43054m658l657j16414J6835J27805
6757a55205r5445j9083P7199O8251Q8123Q7946q7884k20451p9328J84756j6463
6746a67584j03215J89058K3888n293J90636o6425m134j77737J68593p4224j7301
$$ plain form
6735 -43738 67546 218789 137454 42792 -64997 -213080 -223077 -121320 -72181 -65553 6752
6724 6752 99227 117994 12668 -53447 -56430 5062 65917 35774 158965 155916 197187 154397
6712 154397 78181 38441 -106247 -146113 -15793 -60336 -82496 -48119 -77354 -44078 56999
6701 56999 33041 71822 232203 -35345 -261931 -278405 -132991 17807 71536 12951 51434
6690 51434 77081 8009 -248927 -243021 -37193 174893 228283 195350 170662 197343 197518 -152653
6678 -152653 -278020 -351275 -288339 -209787 -264146 -325363 -211383 -202061 -92442 35285 75876
6667 75876 -46718 -201884 -160285 -142445 -121720 -16925 -41189 -174345 -273427 -247180 -180639
6656 -180639 -89958 61601 40057 -192897 -402694 -393773 -359403 -113707 117424 139862 148400
$$ packed form
6735d3738J11284J51243q1335r4662j07789j48083r997J01757M9139O628P2305
6724F752R2475J8767j05326o6115k983O1492O0855l0143J23191l049M1271m2790
6712A54397p6216l9740j44688l9866J30320m4543k2160L4377k9235L3276J01077
6701E6999k3958L8781J60381k67548k26586j6474J45414J50798N3729n8585L8483
6690E1434K5647o9072k56936N906K05828K12086N3390l2933k4688K6681J75l50171
6678a52653j25367p3255O2936P8552n4359o1217J13980R322J09619J27727M0591
6667G5876j22594j55166M1599J7840K0725J04795k4264j33156r9082K6247O6541
6656a80639R0681J51559k1544k32954k09797Q921L4370K45696K31131K2438Q538
$$ plain form
6645 148400 68749 -860 43928 -19336 -58070 -126865 -148152 -99378 99 -41887 -93007 -37198
6633 -37198 -145916 -158184 -67870 -121408 -337865 -266801 -195926 -135478 -66662 -194272 -212826
6622 -212826 -141786 -125713 -162046 -111725 -34085 40899 -24337 61224 161302 106067 40604
6611 40604 63906 -56589 -77101 -146724 -61491 -102512 -25119 -107140 -10027 16350 -128144
6600 -128144 -235784 -136291 175534 317171 238949 86682 -57184 -100483 -113873 -113985 -235824
6589 -235824 -230619 -196120 -163777 -29695 -46280 -104195 -264212 -66877 -11288 -36650 -253652
6578 -253652 -340974 -177877 20317 279872 357375 297438 175112 -4664 19902 -103550
6568 -103550 -279832 -389408 -397697 -264015 -1816 -117713 -190633 -138931 -85466 -84637 -102780
$$ packed form
6645A48400p9651o9609M4788o3264l8734o8795k1287M8774R9477m1986n1120N5809
6633c7198j08718j2268R0314n3538k16457P1064P0875O0448O8816j27610j8554
6622b12826P1040J6073l6333N0321P7640P4984o5236Q5561J00078n5235o5463
6611D0604K3302j20495k0512o9623Q5233m1021P7393q2021R7113K6377j44494
6600a28144j07640R9493L11825J41637p8222j52267j43866m3299j3390j12j21839
6589b35824N205L4499L2343J34082j6585n7915j60017J97335N5589k5362k17002
6578b53652q7322J63097J98194K59555P7503n9937j22326j79776K4566j23452
6568a03550j76282j09576q289J33682K62199j15897p2920N1702N3465Q29j8143
$$ plain form
6557 -102780 -75529 -86953 -200821 -397622 -389467 -213366 -158220 31413 28164 123865 44860
6546 44860 -96838 -251040 -459096 -440001 -369025 -222020 -122284 -66922 -111534 66208 111860
6535 111860 164391 112574 129815 61702 -66637 -9173 -50468 -55071 118433 94261 -103174
6524 -103174 -220915 -280524 -202877 -200804 -317140 -295046 -113675 -133026 -313477 -303666 -212626
6513 -212626 -200047 -183264 -132639 5347 254751 177212 92000 11376 -39379 -97644 -219219
6502 -219219 -257975 -184486 -157001 -244662 -203311 -5716 63900 79466 -15055 -158899 -168960
6491 -168960 -208029 -168661 14132 70100 -16686 -135610 -145056 -239442 -392351 -370700 -225587
6480 -225587 -120619 -54481 -1526 96967 84346 -177175 -367380 -208766 -26099 129870
$$ packed form
6557a02780K7251j1424j13868j96801Q155J76101N5146J89633l249R5701p9005
6546D4860j41698j54202k08056J9095P0976J47005R9736N5362m4612J77742M5652
6535A11860N2531n1817J7241o8113j28339N7464m1295m603J73504k4172j97435
6524a03174j17741n9609P7647K073j16336K2094J81371j9351j80451R811R1040
6513b12626J2579J6783N0625J37986K49404p7539q5212q0624n0755n8265j21575
6502b19219l8756P3489K7485q7661M1351J97595O9616J5566r4521j43844j0061
6491a68960l9069L9368J82793N5968q6786j18924r446r4386j52909K1651J45113
6480b25587J04968O6138N2955R8493j2621k61521j90205J58614J82667J55969
$$ plain form
6470 129870 123586 35150 -26043 -139854 -305858 -329805 -160190 2090 33978 62957 90353
6459 90353 239098 154747 113872 3352 -15040 23302 47321 60018 198275 278535 367789
6448 367789 -13351 -303317 -290638 -209026 -49157 80235 108666 113044 24605 41327 81504
6437 81504 187215 176986 204127 46725 -27082 -64441 -96968 60849 222147 100482 -108211
6426 -108211 -304047 -276108 -108708 -93524 -98338 -89694 28651 165461 138078 76207 2705
6415 2705 -45110 -28225 -44868 -94663 -86518 -306499 -472266 -352660 -139651 90134 193614
6404 193614 259016 118112 -76568 -191322 -354818 -179500 4418 20618 76972 164308
6394 164308 58318 101539 127683 -16218 -22894 42221 66244 -50370 -7791 -14172 34243
$$ packed form
6470A29870o284q8436o1193j13811j66004k3947J69615J62280L1888K8979K7396
6459I0353J48745q4351m0875j10520j8392L8342K4019J2697J38257Q0260Q9254
6448C67789l81140k89966J2679Q1612J59869J29392K8431M378q8439J6722M0177
6437H1504J05711j0229K7141j57402p3807l7359l2527J57817J61298j21665k08693
6426a08211j95836K7939J67400J5184m814Q644J18345J36810k7383o1871p3502
6415B705m7815J6885j6643m9795Q145k19981j65767J19606K13009K29785J03480
6404A93614O5402j40904j94680j14754j63496J75318J83918J6200N6354Q7336
6394A64308j05990M3221K6144j43901o676O5115K4023j16614M2579o381M8415
$$ plain form
6383 34243 145204 101020 -37258 -128375 -181181 -236652 -245862 -329055 -387757 -329620 -162193
6372 -162193 -141816 -235399 -91123 -218877 -211164 -25321 119806 302669 295265 196943 55618
6361 55618 59334 -67733 -265866 -137304 10241 140321 123540 -89486 -232570 -218110 -300555
6350 -300555 -271541 -338005 -256017 -164116 -183582 -60523 27349 62871 -86449 50742 -70630
6339 -70630 -91616 66110 67073 -56329 -45190 -127479 -117666 -109253 -141301 -34602 -31246 -124298
6327 -124298 11931 57866 128203 149882 66492 -32188 -53021 -76544 -124891 46030 60555
6316 60555 81938 107288 159514 18282 -114970 -27692 -78903 -41561 89888 269769 386734
6305 386734 222911 35053 40406 -821 52480 188123 265308 275900 141722 94176 37920
$$ packed form
6383C4243J10961m4184j38278r1117n2806n5471r210q3193n8702N8137J67427
6372a62193K0377r3583J44276j27754P713J85843J45127J82863p404r8322j41325
6361E5618L716j27067j98133J28562J47545J30080j6781k13026j43084J4460q2445
6350c00555K9014o6464Q1988R1901j9466J23059Q7872L5522j49320J37191j21372
6339g0630k0986J57726R63j23402J1139q2289R813Q413l2048J06699L356r3052
6327a24298J36229M5935P0337K1679q3390r8680k0833k3523m8347J70921J4525
6316F0555K1383K5350N2226j41232j33252Q7278n1211L7342J31449J79881J16965
6305C86734j63823j87858N353m1227N3301J35643P7185J0592j34178m7546n6256
$$ plain form
6294 37920 63930 200424 231579 236700 301343 107781 -45890 -32081 -382 58964 293725
6283 293725 183040 -62588 -279999 -365608 -309277 -62261 -41292 -141753 -209672 -210029 -156865
6272 -156865 -185478 -309677 -277870 -128338 -12224 79904 76276 160837 115587 137706 -22707
6261 -22707 -136362 -47070 -241978 -276030 -98864 207840 225006 192165 50807 -174391 -84389
6250 -84389 111746 141648 283296 425637 342242 218962 131556 44240 -32277 -37587 -52961
6239 -52961 -43317 -72484 -139125 -186536 -80739 -1059 -85619 21318 -67779 -44342 -82643 -72919
6227 -72919 -88515 -183552 -320011 -280260 27646 -39027 61406 -28230 -52871 42972 9509
6216 9509 -32764 -92695 -13056 105660 6713 -78566 -65988 88438 102783 167519 127249 32304
$$ packed form
6294C7920K6010J36494L1155N121O4643j93562j53671J3809L1699N9346K34761
6283B93725j10685k45628k17411q5609N6331K47016K0969j00461o7919l57N3164
6272a56865k8613j24199L1807J49532J16114R2128l628Q4561m5250K2119j60413
6261b2707j13655Q9292j94908l4052J77166L06704J7166l2841j41358k25198R0002
6250h4389J96135K9902J41648J42341q3395j23280q7406q7316p6517n310j5374
6239e2961R644k9167o6641m7411J05797P9680q4560J06937q9097K3437l8301R724
6227g2919j5596r5037j36459L9751L07906o6673J00433q9636k4641R5843l3463
6216I509m2273n9931P9639J18716r8947q5279J2578J54426J4345O4736m0270r4945
$$ plain form
6204 32304 -23650 98312 246144 328008 177618 180668 129665 -39573 -133061 -105959 -111169
6193 -111169 -98392 -147254 -175690 -70883 -3330 -50666 -50988 -47323 -54387 -106189 -194012 -79039
6181 -79039 -133720 -152764 -121833 -48136 54824 153121 175946 115963 24961 -168496 -243843
6170 -243843 -209868 -100081 -62430 79556 53606 1151 -51100 -105639 -237052 -109349 -11497
6159 -11497 -41072 -29206 -99471 5411 67465 66507 -14113 2698 248619 212672 72488 -30232
6147 -30232 -89660 -65380 -88392 -116618 -91953 -36395 -95946 25967 123934 176428 38094
6136 38094 -47928 -180833 -254048 -173029 -131898 -35508 -144882 -98778 -71160 54808 20481
6125 20481 43275 56917 5033 30287 95330 173046 -15562 -88699 -93775 72942 99076 1715
$$ packed form
6204C2304n5954J21962J47832Q1864j50390L050n1003j69238r3488K7102n210
6193a11169J2777m8862k8436J04807O7553m7336l22L665p064n1802q7823J14973
6181g9039n4681j9044L0931P3697J02960R8297K2825n9983r1002j93457p5347
6170b43843L3975J09787L7651J41986k5950n2455n2251n4539j31413J27703R7852
6159a1497k9575J1866p0265J04882O2054r58q0620J6811K45921l5947j40184j02720
6147c0232n9428K4280k3012k8226K4665N5558n9551J21913R7967N2494j38334
6136C8094q6022j32905p3215Q1019M1131R6390j09374M6104K7618J25968l4327
6125B0481K2794J3642n1884K5254O5043P7716j88608p3137n076J66717K6134r7361
$$ plain form
6113 1715 -82682 -8514 -88004 -150748 107627 134005 -63462 -36358 -163891 -345504 -361572
6102 -361572 -258879 -158380 -243906 -340891 -233216 -214110 -351789 -274901 -85857 -47796 -112975
6091 -112975 -112031 -47980 -28921 -21314 24525 -32484 98168 95146 132099 169792 120870 61713
6079 61713 -144258 -269404 -335385 -253042 -245947 -199233 -237235 -236123 -165063 -105156 21685 160655
6067 160655 91162 -31161 -38106 105447 174593 258231 154209 101321 162867 128410 11455
6056 11455 115378 139142 90433 36542 -39086 -95813 -70256 924 -3498 37099 3776 -250404
6044 -250404 -292738 -183410 -156808 -108662 -47142 73440 66463 -228909 -344313 -360690 -196680
6033 -196680 -190557 -187258 -170629 -109637 9816 61738 13536 -95446 -59399 16616 14693 -108892
$$ packed form
6113A715q4397P4168p9490o2744K58375K6378j97467K7104j27533j81613j6068
6102c61572J02693J00499q5526r6985J07675J9106j37679P6888J89044L8061o5179
6091a12975R44O4051J9059P607M5839n7009J30652l022L6953L7693m8922n9157
6079F1713k05971j25146o5981Q2343P095M6714l8002J112P1060N9907J26841J38970
6067A60655o9493j22323o945J43553O9146Q3638j04022n2888O1546l4457j16955
6056A1455J03923K3764m8709n3891p5628n6727K5557P1180m422M0597l3323k54180
6044b50404m2334J09328K6602M8146O1520J20582o977k95372j15404j6377J64010
6033a96680O123L299J6629O0992J19453N1922m8202j08982L6047P6015j923j23585
$$ plain form
6021 -108892 -230087 -42261 7587 -56938 -16135 -156862 63434 182279 96544 131675 302999
6010 302999 208880 174032 177816 108660 77301 -2936 24497 54318 134973 138704 192764 172225
5998 172225 116256 142184 188478 130143 33301 -14673 -4 -94251 -137718 35238 180423
5987 180423 163448 253217 315005 142107 167521 90648 -25877 32065 -3489 -191416 -196905
5976 -196905 -78474 -32939 -90805 152016 78111 -87648 -145117 -152775 -89456 -34374 -71579
5965 -71579 -236840 -294101 -126587 -30076 69820 284335 196665 -27358 48268 246977 255399
5954 255399 68358 27780 -22785 -41882 -37269 -24897 -83116 -26662 -55054 -23460 85408
5943 85408 -85848 -225793 -340508 -192738 -140810 -138651 -277773 -260322 -161737 -123789 -164125
$$ packed form
6021a08892j21195J87826M9848o4525M0803j40727K20296J18845q5735L5131J71324
6010C02999r4119l4848L784o9156l1359q0237K7433K9821Q0655L731N4060k0539
5998A72225n5969K5928M6294n8335r6842m7974J4669r4247m3467J72956J45185
5987A80423j6975Q9769O1788j72898K5414p6873j16525N7942l5554j87927n489
5976a96905J18431M5535n7866K42821p3905j65759n7469p658O3319N5082l7205
5965g1579j65261n7261J67514R6511R9896K14515q7670k24023P5626J98709Q422
5954B55399j87041m0578n0565j9097M613J2372n8219N6454k8392L1594J08868
5943H5408j71256j39945j14715J47770N1928K159j39122J7451R8585L7948m0336
$$ plain form
5932 -164125 -133798 -42050 5368 -79441 -279426 -144574 -130333 -108909 -38079 -41202 -155530
5921 -155530 -261661 -68548 -178340 -194886 -92391 -179578 -219190 -257739 -86410 -33197 -37041
5910 -37041 -5216 19156 -9140 -44696 -11222 29301 85697 76248 102532 6828 50885 24346
5898 24346 -35379 -98821 -17974 68606 113648 7332 2406 -68759 -16309 22462 108065 126620
5886 126620 -98186 -201395 -189878 -85802 27899 -66404 -202077 -236867 -244683 -112295 -122907
5875 -122907 -18205 14504 -245598 -485352 -292905 8182 100558 69715 -102919 -192329
5865 -192329 -82334 42335 160891 -33868 -163825 -163642 -206171 -229692 -54366 -173144 -326922
5854 -326922 -485903 -354226 -260659 -252649 -105399 4571 -75317 -151224 -93161 47062 122249
$$ packed form
5932a64125L0327R1748M7418q4809j99985J34852J4241K1424P0830l123j14328
5921a55530j06131J93113j09792j6546J02495q7187l9612l8549J71329N3213l844
5910c7041L1825K4372k8296l5556L3474M0523N6396r449K6284r5704M4057k6539
5898B4346n9725o3442Q0847Q6580M5042j06316m926p1165N2450L8771Q5603J8555
5886A26620k24806j03209J1517J04076J13701r4303j35673l4790p816J32388j0612
5875a22907J04702L2709k60102k39754J92447L01087R2376l0843j72634q9410
5865a92329J09995J24669J18556j94759j29957J83m2529k3521J75326j18778j53778
5854c26922j58981J31677R3567Q010J47250J09970p9888p5907N8063J40223P5187
$$ plain form
5843 122249 -68233 17639 119351 110850 172260 195905 11945 -34945 -2145 65636 205350
5832 205350 315622 299120 125537 -18610 -65799 23693 -18207 -4375 -157579 -4967 101359
5821 101359 88291 29144 -126002 -121668 -84056 -213929 -139235 -167555 -48518 -78342 -106641
5810 -106641 -231910 -227231 -276407 -442023 -365306 -252727 -83827 30823 70899 47925 -46624
5799 -46624 -51094 29266 83169 127644 155924 56135 -34135 -67203 -275315 -255428 -213855 -160749
5787 -160749 -155550 -29028 124701 67254 168390 268432 208890 114911 50187 -52192 -146737
5776 -146737 -186158 -204253 -55453 -29856 -54277 -94762 -217374 27517 14200 -188104 -325215
5765 -325215 -394693 -353072 -221314 -293587 -322508 -223375 -146988 -70531 187427 301845 357081
$$ packed form
5843A22249j90482Q5872J01712q501O1410K3645j83960m6890L2800O7781J39714
5832B05350J10272j6502j73583j44147m7189Q9492m1900J3832j53204J52612J06326
5821A01359j3068n9147j55146M334L7612j29873P4694k8320J19037k9824k8299
5810a06641j25269M679m9176j65616P6717J12579J68900J14650M0076k2974r4549
5799d6624m470Q0360N3903M4475K8280r9789r0270l3068k08112J9887M1573N3106
5787a60749N199J26522J53729n7447J01136J00042n9542r3979o4724j02379r4545
5776a46737l9421j8095J48800K5597k4421m0485j22612K44891j3317k02304j37111
5765c25215o9478M1621J31758p2273k8921R9133P6387P6457K57958J14418N5236
$$ plain form
5754 357081 392911 247709 -58300 -113511 -69181 7067 66037 47240 -23099 -15953 -74652
5743 -74652 -52083 -54211 -73417 -108418 -54415 36467 -47513 -111392 -168085 -140167 -73226 -40354
5731 -40354 -122485 -120320 -57400 -178418 -258075 -154912 -86008 -5378 -38439 -189114 -234209
5720 -234209 -396466 -402591 -287261 -219944 -181424 -5697 155839 -27980 -84241 -77949 -265670
5709 -265670 -154253 -68310 -125877 -81340 -98072 -56332 -88958 -116422 -229448 -157203 -110118
5698 -110118 99781 184017 76181 50452 45086 -146263 -175319 -45144 95263 180197 113199
5687 113199 -130651 -153593 -96315 -37107 -68850 -38050 -147868 -153946 -217299 -171273 -144885
5676 -144885 -76066 124653 147077 160696 214821 167498 25571 -984 -38792 -101048 -190514
$$ packed form
5754C57081L5830j45202l06009n5211M4330P6248N8970j8797p0339P146n8699
5743g4652K2569k128j9206l5001N4003R0882q3980o3879n6693K7918O6941L2872
5731d0354q2131K165O2920j21018p9657J03163O8904Q0630l3061j50675m5095
5720b34209j62257o125J15330O7317L8520J75727J61536j83819n6261O292j87721
5709b65670J11417Q5943n7567M4537j6732M1740l2626k7464j13026P2245M7085
5698a10118K09899Q4236j07836k5729n366j91349k9056J30175J40407Q4934o6998
5687A13199k43850k2942N7278N9208l1743L0800j09818o078o3353M6026K6388
5676a44885O8819K00719K2424J3619N4125m7323j41927k6555l7808o2256q9466
$$ plain form
5665 -190514 -170720 -247550 -330493 -260558 -266361 -414324 -389420 -243839 -253448 -244689 -151900 -254298
5653 -254298 -303776 -173462 -150196 -129072 -289195 -452067 -564110 -421206 -263552 -101186
5643 -101186 -195777 -212435 -80553 6346 -8668 38987 -38859 -108389 -172915 -164664 -190097 -208167
5631 -208167 -26325 -10104 -40369 138375 170371 222756 181230 -23042 -98066 -23954 -13597
5620 -13597 -45972 -232582 -318743 -271940 -75385 -51141 -108737 -162855 -215435 -117190 -95261
5609 -95261 -70323 -212324 -365881 -323211 -89408 -17972 64422 45738 -72816 -87238 -184515
5598 -184515 -176656 -64660 -151426 -124663 -143360 -49551 -2865 13532 14965 -181225 -68287
5587 -68287 79315 950 59007 -6412 -159825 -133249 -18147 -44104 -83870 55005 27584
$$ packed form
5665a90514J9794p6830q2943O9935n803j47963K4904J45581r609Q759R2789j02398
5653b54298m9478J30314K3266K1124j60123j62872j12043J42904J57654J62366
5643a01186r4591j6658J31882Q6899j5014M7655p7846o9530o4526Q251k5433j8070
5631b08167J81842J6221l0265J78744L1996N2385m1526k04272p5024P4112J0357
5620a3597l2375j86610q6161M6803J96555K4244n7596n4118n2580R8245K1929
5609i5261K4938j42001j53557M2670K33803P1436Q2394j8684j18554j4422r7277
5598a84515P859J11996q6766K6763j8697R3809M6686J6397J433j96190J12938
5587f8287J47602p8365N8057o5419j53413K6576J15102k5957l9766J38875k7421
$$ plain form
5576 27584 -84885 -110899 -220735 -238613 -173838 -160947 -26332 -58291 -166066 -115108 -216114
5565 -216114 -232583 -143077 -116694 -284768 -315715 -303215 -158210 -53346 -27377 -65005 -197165
5554 -197165 -156976 -89959 -184094 -194900 -183543 -315701 -389479 -389696 -183158 -172338 -250965 -236429
5542 -236429 -250872 -325380 -220457 -69008 -93929 -134414 -113181 35701 223056 136171 -30915
5531 -30915 -40496 -183979 -122819 -84832 -142755 -251809 -147003 177 -58631 -49721 -13250
5520 -13250 31994 -19840 55425 28333 77667 122371 23075 108138 293608 188770 4294
5509 4294 -83484 -60339 -70318 23867 59950 12821 89912 227052 115477 -64134 -176360
5498 -176360 -191251 -88654 52145 23066 -198732 -334571 -400347 -392829 -148420 -76106 -11393
$$ packed form
5576B7584j12469k6014j09836j7878O4775J2891J34615l1959j07775N0958j01006
5565b16114j6469Q9506K6383j68074l0947J2500J45005J04864K5969l7628j32160
5554a97165M0189O7017r4135j0806J1357j32158p3778k17K06538J0820p8627J4536
5542b36429j4443p4508J04923J51449k4921m0485K1233J48882J87355q6885j67086
5531c0915r581j43483O1160L7987n7923j09054J04806J47180n8808Q910L6471
5520a3250M5244n1834P5265k7092M9334M4704r9296Q5063J85470j04838j84476
5509D294q7778K3145r979R4185L6083m7129P7091J37140j11575j79611j12226
5498a76360j4891J02597J40799k9079k21798j35839o5776P518K44409P2314O4713
$$ plain form
5487 -11393 -10768 -156868 -227357 -192500 -175953 -140660 -22333 141707 175233 204418 106505 23798
5475 23798 49631 131850 -5743 -90966 -87190 -50705 20266 -24217 -149166 -113125 134101
5464 134101 207637 76921 44843 32487 46114 82367 -105132 -307875 -416778 -281720 35504
5453 35504 202489 238947 136497 66125 -48840 114846 75250 -66684 -151497 -225086 -180778
5442 -180778 -264496 -313790 -198202 -158750 -35082 -66755 74410 168254 115073 -14446 -31791
5431 -31791 119022 182073 148125 -24865 -62891 32256 906 -76222 21646 94538 66399
5420 66399 -44068 -200250 -271350 -200981 -78924 -25269 -83621 -269294 -244589 -234044 -238813
5409 -238813 -119740 -44281 -126411 -124070 -163034 -287287 -276366 -108855 51632 -35337 -148431
$$ packed form
5487a1393O25j46100p0489L4857J6547L5293J18327J64040L3526K9185r7913q2707
5475B3798K5833Q2219j37593q5223L776L6485P0971m4483j24949L6041K47226
5464A34101P3536j30716l2078j2356J3627L6253j87499k02743j08903J35058L17224
5453C5504J66985L6458j02450p0372j14965J63686l9596j41934q4813p3589M4308
5442a80778q3718m9294J15588L9452J23668l1673J41165R3844n3181j29519j7345
5431c1791J50813O3051l3948j72990l8026R5147l1350p7128R7868P2892k8139
5420F6399j10467j56182p1100P0369J22057N3655n8352j85673K4705J0545m769
5409b38813J19073P5459q2130K341l8964j24253J0921J67511J60487q6969j13094
$$ plain form
5398 -148431 -74250 112382 87802 -38212 16889 254735 212551 158011 56253 143314 17754
5387 17754 -237 -30079 -69813 -189557 -252776 -212811 -161485 -44573 -79653 -24902 -64571
5376 -64571 -36168 -33933 86486 130850 25833 -104716 -45009 -65184 29555 -170820 -314740
5365 -314740 -193629 -298606 -183270 -90085 -50697 52887 35450 135984 68073 -23130 -13392
5354 -13392 -243626 -254405 -37221 52824 -58118 -103960 -10717 27787 -86543 -95731 -220550
5343 -220550 -252470 -67118 -59133 -77537 -43616 93363 234839 65527 -226904 -335413 -305338
5332 -305338 -168766 40720 38132 -15586 36505 743 -67596 83247 36782 -95135 -141451
5321 -141451 -202648 -100870 -115871 -47188 178754 130838 -17099 -124269 -45696 -23862 -54921
$$ packed form
5398a48431P4181J86632k4580j26014N5101K37846m2184n4540j01758Q7061j25560
5387A7754j7991k9842l9734j19744o3219L9965N1326J16912l5080N4751l9669
5376f4571K8403K235J20419M4364j05017j30549N9707k0175R4739k00375j43920
5365c14740J21111j04977J15336R3185L9388J03584j7437J00534o7911r1203R738
5354a3392k30234j0779K17184R0045j10942m5842R3243L8504j14330r188j24819
5343b20550l1920J85352P985j8404L3921J36979J41476j69312k92431j08509L0075
5332c05338J36572K09486k588n3718N2091l5762o8339J50843m6465j31917m6316
5321a41451o1197J01778j5001O8683K25942m7916j47937j07170P8573K1834l1059
$$ plain form
5310 -54921 -74238 -72070 -36665 9178 19670 -94943 -101289 -27376 20197 -8024 59939 -31543
5298 -31543 -98091 -32252 -98605 -26105 -124578 -241919 -93503 45924 52915 -246684 -187479
5287 -187479 -173359 -238574 -204967 -22359 446 -116410 -199053 -300856 -260434 -308837 -291834
$$ packed form
5310e4921j9317K168L5405M5843J0492j14613o346P3913M7573k8221O7963r1482
5298c1543o6548O5839o6353P2500r8473j17341J48416J39427O991k99599N9205
5287a87479J4120o5215L3607J82608K2805j16856q2643j01803M0422m8403J7003
$$ [...]
##END NTUPLES=NMR SPECTRUM
##END=
