##TITLE=Analysis number 327822
Compound Code nrb 04027
Book Reference 162901
Project Code adrs flro3
Chemist Name jom
##JCAMPDX= 6.0         $$ Bruker NMR JCAMP-DX V2.0
##DATA TYPE= NMR SPECTRUM
##DATA CLASS= NTUPLES
##ORIGIN= Bruker BioSpin GmbH
##OWNER= nmr
$$ XWIN-NMR		Version 3.5
$$ Wed Apr 11 15:51:22 2007 GMT Daylight Time (UT+1h)  MAYBRIDGE\nmr@NMR_250MHZ
##.OBSERVE FREQUENCY= 250.131544655141
##.OBSERVE NUCLEUS= ^1H
##.ACQUISITION MODE= SIMULTANEOUS (DQD)
##.ACQUISITION SCHEME= undefined
##.AVERAGES= 16
##.DIGITISER RES= 18
##SPECTROMETER/DATA SYSTEM= dpx250
##.PULSE SEQUENCE= zg30
##.SOLVENT NAME= DMSO
##.SHIFT REFERENCE= (INTERNAL, DMSO, 0, 16.522)
##AUDIT TRAIL= $$ (NUMBER, WHEN, WHO, WHERE, WHAT)
$$ ##TITLE= Audit trail, XWIN-NMR		Version 3.5
$$ ##JCAMPDX= 5.01
$$ ##ORIGIN= Bruker BioSpin GmbH
$$ ##OWNER= nmr
$$ C:\u/data/dgb/nmr/ADRS/990/pdata/1/auditp.txt
$$ ##AUDIT TRAIL=  $$ (NUMBER, WHEN, WHO, WHERE, WHAT)
(   1,<2007-04-11 15:51:04.28 +100>,<MAYBRIDGE\nmr>,<NMR_250MHZ>,
      <created by zg, POWCHK disabled, PULCHK disabled
       configuration hash MD5:
       49 4B E0 1D 92 C2 6B 37 9F E6 65 BC 52 41 86 1D
       data hash MD5: 64K
       1D 10 7E B6 AC BC EF F7 3D FD B3 95 AF C0 DB 80>)
(   2,<2007-04-11 15:51:15.33 +100>,<MAYBRIDGE\nmr>,<NMR_250MHZ>,
      <Start of raw data processing
       ef LB = 0.3 FT_mod = 6 PKNL = 1 SI = 32K 
       data hash MD5: 32K
       3E 2A 71 4F 0C 77 3A 88 D7 A8 F5 96 CD 2F 14 45>)
(   3,<2007-04-11 15:51:17.06 +100>,<MAYBRIDGE\nmr>,<NMR_250MHZ>,
      <apk 
       data hash MD5: 32K
       F4 D4 58 B1 78 9E F2 95 3B D7 EA 0A C9 79 18 D4>)
(   4,<2007-04-11 15:51:17.85 +100>,<MAYBRIDGE\nmr>,<NMR_250MHZ>,
      <abs ABSG = 5 
       data hash MD5: 32K
       1B FA B2 34 70 8C F1 23 11 19 FE 51 E5 4F 65 48>)
$$ ##END=
$$ 
$$ hash MD5
$$ E7 A9 83 B5 A6 FF 21 45 02 E9 8C 3F 61 8A 4D 29
##$RELAX= 
##$RELAX= 
##$RELAX= 
##$RELAX= 
##$RELAX= 
##$RELAX= 
##$RELAX= 
$$ Bruker specific parameters
$$ --------------------------
##$DU= <C:\u>
##$EXPNO= 990
##$NAME= <ADRS>
##$PROCNO= 1
##$TYPE= <nmr>
##$USER= <dgb>
##$AMP= (0..31)
100 100 100 100 100 100 100 100 100 100 100 100 100 100 100 100 100 100 
100 100 100 100 100 100 100 100 100 100 100 100 100 100 
##$AQSEQ= 0
##$AQ_mod= 3
##$AUNM= <au_zg>
##$AUTOPOS= <39 >
##$BF1= 250.13
##$BF2= 250.13
##$BF3= 250.13
##$BF4= 250.13
##$BF5= 500.13
##$BF6= 500.13
##$BF7= 500.13
##$BF8= 500.13
##$BYTORDA= 1
##$CFDGTYP= 0
##$CFRGTYP= 5
##$CHEMSTR= <none>
##$CNST= (0..31)
1 1 145 1 1 1 1 1 1 1 1 1 1 1 1 1 1 1 1 1 1 1 1 1 1 1 1 1 1 1 1 1 
##$CPDPRG= <>
##$CPDPRG1= <>
##$CPDPRG2= <>
##$CPDPRG3= <>
##$CPDPRG4= <mlev>
##$CPDPRG5= <mlev>
##$CPDPRG6= <mlev>
##$CPDPRG7= <mlev>
##$CPDPRG8= <mlev>
##$CPDPRGB= <>
##$CPDPRGT= <>
##$D= (0..31)
0 1 0 0 0 0 0 0 0 0.06 0 0 0 0 0 0 0.0002 0 0 0 0 0 0 0 0 0 0 0 0 0 0 
0 
##$DATE= 1176303063
##$DBL= (0..7)
120 120 120 120 120 120 120 120 
##$DBP= (0..7)
150 150 150 150 150 150 150 150 
##$DBP07= 0
##$DBPNAM0= <>
##$DBPNAM1= <>
$$ [...]
##$SUBNAM7= <"">
##$SUBNAM8= <"">
##$SUBNAM9= <"">
##$SW= 20.6930455092707
##$SWIBOX= (0..15)
0 0 3 0 0 0 0 0 0 0 0 0 0 0 0 0 
##$SW_h= 5175.983436853
##$TD= 65536
##$TD0= 1
##$TE= 683.16
##$TE2= 300
##$TE3= 300
##$TEG= 300
##$TL= (0..7)
0 120 120 120 120 120 120 120 
##$TP= (0..7)
150 150 150 150 150 150 150 150 
##$TP07= 0
##$TPNAME0= <>
##$TPNAME1= <>
##$TPNAME2= <>
##$TPNAME3= <>
##$TPNAME4= <>
##$TPNAME5= <>
##$TPNAME6= <>
##$TPNAME7= <>
##$TPOAL= (0..7)
0.5 0.5 0.5 0.5 0.5 0.5 0.5 0.5 
##$TPOFFS= (0..7)
0 0 0 0 0 0 0 0 
##$TUNHIN= 0
##$TUNHOUT= 0
##$TUNXOUT= 0
##$USERA1= <user>
##$USERA2= <user>
##$USERA3= <user>
##$USERA4= <user>
##$USERA5= <user>
##$V9= 5
##$VALIST= <valist>
##$VCLIST= <CCCCCCCCCCCCCCC>
##$VD= 0
##$VDLIST= <DDDDDDDDDDDDDDD>
##$VPLIST= <PPPPPPPPPPPPPPP>
##$VTLIST= <TTTTTTTTTTTTTTT>
##$WBST= 1024
##$WBSW= 4
##$XGAIN= (0..3)
0 0 0 0 
##$XL= 0
##$YL= 0
##$YMAX_a= 339852
##$YMIN_a= -435597
##$ZGOPTNS= <>
##$ZL1= 120
##$ZL2= 120
##$ZL3= 120
##$ZL4= 120
##$ABSF1= 16.522
##$ABSF2= -4.171173
##$ABSG= 5
##$ABSL= 3
##$ALPHA= 0
##$AQORDER= 0
##$ASSFAC= 0
##$ASSFACI= 0
##$ASSFACX= 0
##$ASSWID= 0
##$AUNMP= <proc_1d>
##$AZFE= 0.1
##$AZFW= 0.1
##$BCFW= 0
##$BC_mod= 0
##$BYTORDP= 0
##$COROFFS= 0
##$CY= 12.5
##$DATMOD= 1
##$DC= 0
##$DFILT= <>
##$DTYPP= 0
##$F1P= 14.0000005364418
##$F2P= -0.99999901652339
##$FCOR= 0.5
##$FTSIZE= 32768
##$FT_mod= 6
##$GAMMA= 0
##$GB= 0
##$INTBC= 1
##$INTSCL= 1
##$ISEN= 128
##$LB= 0.3
##$LEV0= 0
##$LPBIN= 0
##$MAXI= 10000
##$MC2= 0
##$MEAN= 0
##$ME_mod= 0
##$MI= 0
##$NCOEF= 0
##$NC_proc= -6
##$NLEV= 6
##$NOISF1= 0
##$NOISF2= 0
##$NSP= 0
##$NTH_PI= 0
##$NZP= 0
##$OFFSET= 16.522
##$PC= 1
##$PHC0= 218.3483
##$PHC1= 6.846582
##$PH_mod= 1
##$PKNL= yes
##$PPARMOD= 0
##$PSCAL= 4
##$PSIGN= 0
##$REVERSE= no
##$SF= 250.13
##$SI= 32768
##$SIGF1= 0
##$SIGF2= 0
##$SINO= 400
##$SIOLD= 32768
##$SREGLST= <1H.DMSO>
##$SSB= 0
##$STSI= 32768
##$STSR= 0
##$SW_p= 5175.98343685301
##$SYMM= 0
##$S_DEV= 0
##$TDeff= 65536
##$TDoff= 0
##$TI= <Analysis number 999999
Compound Code 99
Book Reference 9
Project Code 9>
##$TILT= no
##$TM1= 0
##$TM2= 0
##$TOPLEV= 0
##$USERP1= <user>
##$USERP2= <user>
##$USERP3= <user>
##$USERP4= <user>
##$USERP5= <user>
##$WDW= 1
##$XDIM= 32768
##$YMAX_p= 350396109
##$YMIN_p= -844480
$$ End of Bruker specific parameters
$$ ---------------------------------
##NTUPLES= NMR SPECTRUM
##VAR_NAME=  FREQUENCY,     SPECTRUM/REAL,   SPECTRUM/IMAG
##SYMBOL=    X,             R,               I
##VAR_TYPE=  INDEPENDENT,   DEPENDENT,       DEPENDENT
##VAR_FORM=  AFFN,          ASDF,            ASDF
##VAR_DIM=   32768,         32768,           32768
##UNITS=     HZ,            ARBITRARY UNITS, ARBITRARY UNITS
##FACTOR=    0.157963299565203, 1,           1
##FIRST=     4132.6476996994, 0,             0
##LAST=      -1043.33573715361, 0,           0
##MIN=       -1043.33573715361, -844480,     0
##MAX=       4132.6476996994, 350396109,     0
$$ Real data points
##PAGE= N=1
##DATA TABLE= (X++(R..R)), XYDATA
$$ [...]
29074 432066 33891 -34394 -127051 -256246 -317025 -335065 -267955 51200 111498 74641 171135
29063 171135 -48611 -24972 190698 249843 190956 200857 166334 36154 152466 80566 -202844
29052 -202844 -478705 -384854 -103528 -169137 -326676 -158651 -25866 -36328 -208253 -228010
29042 -228010 -97022 75223 -12764 -6656 -119556 -415109 -473334 -432375 -121444 221732
29032 221732 230719 203266 203092 158051 373697 402281 22213 13853 238100 292245 -47045
29021 -47045 -91199 -344021 -304001 -183798 -227565 -269829 -37504 366255 381114 443277 379520
29010 379520 414920 127961 207092 151440 -120005 -355173 -253691 -17171 275494 320554
29000 320554 239558 150975 180115 260500 269541 131585 -142774 -166611 -120170 -419416 -397922
28989 -397922 -141298 98813 22467 -184520 -124260 -227801 165980 260813 187661 250528
28979 250528 171286 57369 117494 167209 152304 -137761 -209455 -99416 41950 57199 115388
28968 115388 182220 207359 139761 153756 -57129 -90066 -175842 -148482 16320 32684 86737
28957 86737 134929 137428 -27359 -107091 -136164 -144582 94240 416524 668156 520934 595457
28946 595457 524149 322574 -129089 -167063 -75103 -132372 73501 354227 386405 447857 402023
28935 402023 103056 -305816 -454880 -342396 -218011 -129793 -83961 40966 -322184 -244793
28925 -244793 12495 143316 110339 61755 -41577 -30037 78999 441654 442483 271357 -140491
28914 -140491 -359383 -83957 178273 253057 55051 4377 55853 60368 10467 -21176 101130
28903 101130 238855 60414 -84296 -596 -29802 123659 217334 127259 -56645 -196024
28893 -196024 -58715 -288324 -239919 -63599 221489 234987 11666 -165395 -77790 15271
28883 15271 37490 85864 375734 135076 125260 242219 343607 404744 333694 486482 497415
28872 497415 360936 332652 331833 319277 243800 255377 424061 422028 24054 -56381 113712
28861 113712 262979 163109 -29854 -24009 -150758 -63850 -74086 25403 80408 188072 333194
28850 333194 218102 124387 -117814 -30620 315571 207164 -224991 -389690 -254847 -84159
28840 -84159 106804 246170 110161 -75198 -44456 108568 84477 -253312 -296593 -76911
28830 -76911 147370 170044 191001 337179 410903 216816 154259 365907 508626 502469 567041
28819 567041 477268 611004 490923 241941 102575 6264 120414 281452 366196 254330
28809 254330 288739 220786 214329 95229 -125048 -18003 234220 351365 297916 223000 78301
28798 78301 204207 169314 25146 -35421 63216 105252 18510 -79587 3536 284007 201721
28787 201721 -204740 -226248 117864 179003 182040 176053 -55800 -390397 -254646 86068 83728
28776 83728 122784 63381 -169539 -253606 -262703 -220479 -169659 -168774 -305339 -72471 -22980 -92727
28764 -92727 -299349 -450701 -216102 -120635 -112930 -119855 -212697 -431110 -544335 -442156 -386638
28753 -386638 -434417 -103001 64273 26508 -63417 -113007 -64431 129523 1269 -175040
28743 -175040 -64929 106072 178938 162798 46977 24047 350054 271799 184575 26137
28733 26137 23757 -226750 -290720 -349791 -89092 163500 22874 -135349 -28051 -13629 101021
28722 101021 317662 600311 737047 631786 351809 340848 126148 -45614 21218 84401
28712 84401 -169555 -102815 11060 -141526 -268298 -281086 -226499 -226604 -183230 -36573 -2506
28701 -2506 -42574 -112093 112967 268306 213699 44791 -60696 -135211 102102 188911 -9194
28690 -9194 -54857 -104436 -374585 -242215 -183969 -84312 64663 94123 187366 -1734 -191053
28679 -191053 -144937 -98689 -47911 -148327 -118470 -65733 -126454 -185235 -122251 -177909 -128198
28668 -128198 -160783 -80869 77270 144591 -26725 -110949 -261026 -45767 121761 233856
28658 233856 170572 -20114 -38577 80379 51661 80616 387944 226130 205652 140372 -53216
28647 -53216 14059 240772 420845 517113 99256 74030 -140701 -385309 -329438 -298798 -371389
28636 -371389 -188695 -82085 -171234 539 -178933 -299471 -197245 -287898 -253313 -115032
28626 -115032 7849 -185821 -291857 -233964 -202040 -174392 -114962 -135787 11322 -40998 -219075
28615 -219075 -66712 90446 96279 127081 448885 372327 83568 129925 270749 -818
28605 -818 -16076 221391 228559 111174 -161568 -239862 -459529 -509341 -462948 -252889 -52729
28594 -52729 100323 111779 25754 107425 55925 107140 154585 328903 296760 -60447 -165879
28583 -165879 -25286 68431 -240464 -409042 -272024 -132558 -109674 -31971 -12148 -251034
28573 -251034 -309258 -320209 -419593 -272336 -21956 38042 25407 -15308 -14661 -30062 -13246
28562 -13246 102007 191070 201717 187368 -37862 -96126 -19791 167925 170971 101162 36141
28551 36141 52941 -34084 -219714 -176334 -34860 174171 150220 48358 22832 -113593 -82603
28540 -82603 70375 -73734 -38867 -66641 -182666 -141064 -470 126983 213575 87617
28530 87617 -157221 -303155 -274620 -74113 102830 -128937 -273424 -195879 -226277 -225269 -160351
28519 -160351 -189513 -127690 -147698 -118946 36575 133644 12172 -199313 -24327 243387
28509 243387 183415 4475 -213513 -234068 -154207 -5896 -86836 -162606 -185389 -152236 -241608
28498 -241608 -256100 -589 -61785 -78610 -19021 -57510 -107861 -196954 -179972 -154943 -247845
28487 -247845 -211859 -107591 -59862 -188763 -348958 -338208 -249952 -139870 -239176 -18036
28477 -18036 54601 -20173 175964 203341 -197064 -383022 -218321 38141 86691 -138753
28467 -138753 -115618 -208145 -206817 58423 168176 114374 238023 246586 125626 45760 -198479
28456 -198479 -364621 -195534 -37053 -9776 -98089 -112361 45504 213323 231479 410633
28446 410633 221702 11373 -58332 100023 231704 343950 233819 40939 120789 305601
28436 305601 214603 146350 -47304 -85451 -129811 -70623 216783 203425 -62111 21591 281127
28425 281127 182712 -85478 -125959 66905 108864 82389 256270 296313 141467 -20661
28415 -20661 -842 126151 163289 116539 259334 64523 18439 44159 30260 -36689 53235
28404 53235 46151 -59529 234056 312248 112937 366 143770 185665 128979 109760 137882
28393 137882 239022 370521 345838 307002 291233 70041 -312160 -453578 -196631 -90020
28383 -90020 65101 -92040 -216261 -265245 -318883 6088 181929 -162729 -533564 -305906
28373 -305906 -5251 74621 -145255 -235075 -275776 -169789 -209648 -189941 -9237 -146501
28363 -146501 -93771 -187073 -179162 -167616 -79690 -34880 620 -43797 -72600 -207144 -282714
28352 -282714 -51611 83605 31828 166335 225510 230328 -1273 -192693 -244491 -168579 72013
28341 72013 131798 315244 164763 -16497 17460 218123 43676 -195021 -344781 -295357
28331 -295357 -195099 -12514 189532 114042 -56415 -23960 -57660 -115648 135573 95484
28321 95484 61926 69003 11595 196516 207016 20930 -3707 30712 168891 170334 163199 186590
28309 186590 89318 -165253 -275688 -315635 -165963 143 127654 -13943 -201753 -259866
28299 -259866 -338906 -503627 -407354 -317599 -187535 64268 160880 37268 -203767 -439818
28289 -439818 -581853 -467580 -255558 32189 232807 128313 45943 -150853 -136022 -21386
28279 -21386 131705 212188 86010 -36468 -14863 -13633 141595 73222 134226 54649 25247
28268 25247 -236469 -235700 -150322 -128610 48189 29296 172575 231049 266012 67925 -300860
28257 -300860 -553702 -405113 -54899 -114604 -24160 172580 110590 -169276 -204723 -348960
28247 -348960 -23826 161793 170653 132515 81775 -169998 -158360 -193373 -110269 -102482 -212348
28236 -212348 -95328 116963 -68212 -344143 -401281 -368843 -116194 -49291 -111000 -58138
28226 -58138 -23336 54341 -88242 -53793 -8485 -37495 -91787 -36822 -22128 -199457 46200
28215 46200 259577 164807 -186993 -164060 -173972 -76807 -218861 -269770 -222664 -419548 -265397
28204 -265397 91326 13637 14001 18037 -75486 65966 146566 80936 285662 234431 30823
28193 30823 79771 75554 -119981 -162203 -55137 111651 287580 201988 213565 153745 120201
28182 120201 106623 96238 -33521 -108208 -122105 -124140 -1907 90545 189346 144354 21559
28171 21559 -223193 -160161 -189227 -191516 -251133 -311337 -76639 177324 138829 -57328 -330245
28160 -330245 -433146 -201130 -18905 21 -203141 -277334 -259339 -7774 -77438 -146922
28150 -146922 -94953 -81108 2168 150877 197184 85153 -64139 -189171 -142062 -12725
28140 -12725 -58597 -67102 104136 16442 237773 384134 327452 168985 160649 193238 351807
28129 351807 153764 -8868 81790 147042 -99394 11835 183127 285888 465571 368145
28119 368145 269771 330391 270913 261503 21524 -48611 -12808 -78220 41199 2707 -140177
28108 -140177 -44785 94642 -14509 91631 126549 247209 249291 184120 -4041 -109168
28098 -109168 -212699 -214269 -111086 5583 138247 135816 101709 90517 -62340 -28586 91827
28087 91827 90081 198717 333569 229232 212738 36386 -317095 -338697 -191305 -195670 -159302
28076 -159302 -361005 -414384 -361220 -141826 90376 340280 468633 225633 221470 192201
28066 192201 186611 272692 132911 213676 357845 500257 528138 510669 345886 -15471 -308477
28055 -308477 -133159 157472 154659 209958 274929 197423 234454 273292 151328 202080 331630
28044 331630 376313 197720 51469 -116947 -27527 38244 -28842 -55235 -264291 -71854
28034 -71854 -22299 12849 -77546 -83985 22872 -28331 34573 203175 268206 -9859 -94050
28023 -94050 -157219 -143268 167894 304631 226355 100890 182535 161147 128032 155571 79677
28012 79677 -20583 149256 153253 -22576 -71091 -55302 -126633 24057 -96000 -162694 -82758
28001 -82758 605 79306 93104 98434 78771 34985 16335 -183038 -370040 -46321 251664
27990 251664 234006 -65077 -10486 197377 154301 98831 234563 455220 373405 372245 162576
27979 162576 75473 269734 185594 159320 138306 -81764 -50811 105915 48131 -53947 -14419
27968 -14419 -150640 -275366 -125826 -28881 35053 143253 134608 -27019 -1145 -53680 -297887
27957 -297887 -424012 -271403 -105585 33185 176742 18521 111638 130622 167744 210163
27947 210163 223430 32252 -166862 -189444 -389263 -397110 -234408 -133400 -33266 98449
27937 98449 -43100 -114348 -61180 -67754 -194941 -305135 -227662 -21677 -21995 122934 183064
27926 183064 418032 284124 83782 121478 -69910 -43860 2889 82937 45688 -168071
27916 -168071 2994 33008 -81950 -152790 -180823 -161318 -117109 -144059 -8025 78428 109917
27905 109917 134703 213896 378560 284479 318004 211359 84512 55143 -183289 -225851 -72929
27894 -72929 -37799 -117096 -277959 -279619 -8431 245816 230423 173725 76991 -8955 128734
27883 128734 243211 158556 72 -17729 152959 44829 91669 370128 294598 198131
27873 198131 27737 -223526 -216338 -179877 -86809 -14686 32472 -71003 -63520 88777 123228
27862 123228 49119 -16351 76174 123662 110347 19318 -13946 287777 268087 237054 9266
27851 9266 -139601 -158310 -298466 -309604 -27455 107114 129486 41682 94806 94040 166384
27840 166384 333365 148404 -80538 -45729 71797 135898 129191 44864 61806 41744 133947
27829 133947 93188 99741 99410 73655 64872 -76745 -6759 11875 -169440 -119950 -280364 -268031
27817 -268031 -190829 -185749 -50359 19472 6292 253675 46912 -235249 -116277 155221
27807 155221 501862 457333 82588 42717 93308 213482 247987 37175 40343 39236 168027
27796 168027 86676 -39331 -131202 -138156 -87656 -33407 73075 28611 39233 159157 -48727
27785 -48727 -276007 -175700 121072 253152 270939 93675 36573 -86949 -23222 168558
27775 168558 100880 -88833 -25324 -38147 -187626 -285298 -214163 -265234 -164754 -122887 -16952
27764 -16952 227074 268920 157626 -5677 -23874 38909 -140736 -139931 -57980 -4888 -81961
27753 -81961 -33575 21681 -59614 -280087 -366511 -593036 -585989 -441339 -268285 -59515 143604
27742 143604 -16123 -165998 -145816 -65518 204172 44352 197488 358129 374712 269534
27732 269534 327340 253657 -26022 -244026 -420022 -132839 -69174 55257 99059 -43117
27722 -43117 -77445 39863 184707 49972 58385 137858 125658 13222 -38607 1534 -140668
27711 -140668 -186441 -196629 117068 -46658 -25512 38555 69873 195766 283570 42673 -238880
27700 -238880 -48458 8668 130317 132443 -2504 -158725 -41326 -58539 -47339 -7139 -94727
27689 -94727 -181043 -50869 -45995 -89647 -110550 130859 240179 44567 -203783 -238186 15677
27678 15677 47112 122425 298730 9625 -249228 -192031 -132248 -513067 -646939 -419482
27668 -419482 -85241 -74677 -56427 121769 12573 -141284 -217384 -81540 -14086 128314
27658 128314 92260 12906 20713 97221 254335 180513 160 -7905 65563 29232 -20880
27647 -20880 -74034 140712 51974 -147668 -224999 -365773 -258831 -137680 -108469 40043
27637 40043 133789 78566 190439 178222 107171 -86843 -297818 -302438 8469 4901 201002
27626 201002 339937 5215 -83183 109895 166600 198577 230550 -446 -201570 -308869
27616 -308869 -498287 -575581 -504058 -556279 -617076 -533077 -484668 -570227 -404883 -311594 -128069
27605 -128069 -101494 -388109 -300438 -139429 114412 78352 222917 386540 50355 -134094
27595 -134094 -14854 -83293 -113181 -84946 270268 340932 297904 62989 -138586 -260386
27585 -260386 -139544 -297071 -550834 -589506 -378957 -44544 114992 111794 159114 103254
27575 103254 -42052 -23813 85038 41299 59584 111060 -35542 -118817 -6995 -80361 -150669
27564 -150669 -137851 -137863 -247155 -381762 -333739 -302842 -285627 -301361 -191293 -315458 -494424
27553 -494424 -400354 -60246 -134390 -228728 -276081 -158110 137233 203394 89331 -140673
27543 -140673 -123686 -117354 67515 -21027 -162601 -348790 -281455 -301372 -278213 -146839 -39093
27532 -39093 -284808 -182587 52015 90069 134137 -16118 -143637 -71354 33972 -82550
27522 -82550 -188111 -412186 -366159 -457128 -321707 -281231 -216485 -136204 -155285 -15184 32198
27511 32198 22929 -4557 -13812 -60247 61773 -22281 99706 172428 -28063 -285437 -172626
27500 -172626 -195694 -179957 -213933 -111612 81080 77842 -22908 -31133 -163762 -223676 -235174
27489 -235174 -362074 -266085 -233267 -173529 -98271 -123944 -313027 -373713 -282007 -155448 -297654
27478 -297654 -237818 -204827 -121375 16329 45626 232686 209191 226327 -148634 -138126 85820
27467 85820 152145 199982 266686 380899 399876 600394 311356 53146 115676 179201 25059
27456 25059 -146399 -175572 -69606 -57097 -188906 -171930 -128058 -172621 -288551 -220774 -235775
27445 -235775 -267660 -54962 -22137 -79353 70738 80016 11072 -12801 108579 248824 272388
27434 272388 239511 172536 81420 123971 195558 185264 53024 67776 134398 -4565 84388
27423 84388 400428 413475 91763 26854 -137349 -87458 -126170 -105605 -59585 -93180 -67909
27412 -67909 -205554 -348020 -119577 171321 261458 52195 -213244 -208294 -158073 -75045 -79785
27401 -79785 -18380 102312 26102 1610 26584 -61508 -68918 9198 202784 268355 189524
27390 189524 161294 53310 -164079 -374981 -296856 -231490 -196264 38960 83407 -7475 97070
27379 97070 -55234 -14763 -93815 -258519 -344569 -146588 112544 216381 238781 500604
27369 500604 612387 338397 283427 124423 105742 -6369 77165 217615 333057 320223
27359 320223 270453 242499 -27060 -300121 -192433 -89806 170094 236533 142381 -36881
27349 -36881 128769 314052 377430 468128 341632 69907 29766 -14392 26105 16458 64154
27338 64154 24858 20512 -33030 24698 225039 371901 750001 549412 432156 402882 224934
27327 224934 114834 52318 -55040 -73900 -48314 -217076 -294004 -156359 51771 -36378
27317 -36378 50334 54529 44589 8538 -208 41736 48075 -109532 -197772 46672 97688 247457
27305 247457 243202 113032 -85720 -282429 -136355 -266277 -397358 -226341 -164191 -81299
27295 -81299 -182476 -267254 -242286 -84898 32109 2499 199642 189186 302652 256496 -23189
27284 -23189 -83778 -769 159359 385754 238345 -99840 -77134 1023 -18143 -85582 -119209
27273 -119209 25888 242402 240322 -37308 10488 -28266 33800 -104812 -69324 -65352 -147107
27262 -147107 -175704 37664 122643 16813 -52006 -12452 -26502 115033 42489 25490 -127505
27251 -127505 -285048 -439043 -249474 -232951 -16147 24556 -88085 -126746 -245630 -468788
27241 -468788 -424530 -109304 -8277 -17533 -49535 115413 153936 221875 479206 453355 298200
27230 298200 227585 44815 242970 175534 49548 36003 45929 62927 173469 213883 156552
27219 156552 -83255 -164559 85530 174324 77222 169945 160595 51913 -9067 -59947 43454
27208 43454 165382 20265 -263576 -269430 -10763 89218 314474 428855 202534 68738
27198 68738 23753 248814 302200 393266 441153 474831 286196 -102322 -307310 -236810 30221
27187 30221 89524 89692 -190966 -173304 -60241 160892 477941 485795 316308 -70759 -217518
27176 -217518 -214319 71899 -49158 -61674 24477 -83110 -209576 -114297 -70239 -125621 -166326
27165 -166326 -164574 -77873 234588 355671 330948 262893 193110 -12832 -339055 -454339 -389141
27154 -389141 -316977 73397 59420 -88202 190387 229532 336826 290371 243744 105060
27144 105060 -165807 -146109 -194295 -125884 52493 -61841 67758 -53920 -108559 -90255
27134 -90255 -247513 -237936 59764 57017 113363 73030 -75540 53946 134564 -71541 4372
27123 4372 -13875 8042 111324 295973 184555 31549 43451 168162 216239 308684 264158
27112 264158 227239 273146 41141 -106502 -161679 -293680 -29408 185721 375510 346022
27102 346022 107154 -133659 -156786 -193356 -63980 -215608 -252250 -68359 99839 77204
27092 77204 184348 -35715 98243 173202 122742 113087 96592 129904 166667 262394 194241
27081 194241 89632 -20070 118153 183933 124782 174850 -159470 -348257 -43253 107965
27071 107965 131509 57421 -99847 1111 71087 160345 247661 533053 460277 534847 627191
27060 627191 425980 251950 193661 -92567 -318289 -337228 -210993 -125517 24340 -105571
27050 -105571 -68464 -134310 -227192 -365015 -305551 -28850 11248 -11034 171242 258197 160624
27039 160624 281668 326354 343586 147788 -172590 -411870 -521523 -399348 -321056 -216579
27029 -216579 -110427 -109961 -155830 -24910 97273 -107000 -36791 146391 54823 25985 28615
27018 28615 -174441 -250849 -197951 -76136 -24283 72653 23016 -134419 -221543 26 109583
27007 109583 163264 234950 249184 208520 107672 98405 31069 497 170879 200255 199268 24760
26995 24760 -6205 -83975 -223802 -232239 -11426 -73470 -215022 -312540 -336923 -40614 203347
26984 203347 592680 690477 352345 -8627 4321 -255179 -512235 -510967 -408685 -458363
26974 -458363 -447338 -189901 -93198 -243133 -131981 -91478 -46322 -97481 -207943 -233787 -393808
26963 -393808 -432454 -410062 -30508 -59691 -302782 -444232 -333471 -188149 -25496 -14755
26953 -14755 75259 157386 204549 154887 -41898 -96563 -296302 -440496 -648549 -824968 -648275
26942 -648275 -227165 -52983 -286596 -481860 -391737 -305960 -235545 -289282 -404426 -184426
26932 -184426 -69338 305221 353350 185471 247462 335042 340635 120396 55356 34310 -115816
26921 -115816 -130131 66169 28606 -62225 22557 50644 114751 224805 171409 124307 22783
26910 22783 -153967 -131025 -81992 205694 -21603 -192905 -274396 -273941 -33452 -55542 -55964
26899 -55964 -103882 -35232 -94403 -164521 -80588 58273 107023 36906 59811 84163 147637
26888 147637 65361 36267 61757 16357 262787 203527 166348 241191 369159 269597 405644
26877 405644 444112 391391 393397 192470 147562 77343 -29737 34312 123588 -52681 -29821
26866 -29821 -184030 -256502 -62640 -46670 48032 65977 9413 -203213 5477 154609 33896
26855 33896 -83446 -59880 38339 43534 47587 50495 -68442 39943 3637 -132921 -17973
26844 -17973 159291 90497 -42976 -247164 -285713 -470380 -660010 -677856 -505221 -320270
26834 -320270 -94397 -157862 -261012 -310281 -287300 -33853 310643 296794 227040 192537 -110228
26823 -110228 -411753 -372084 -278707 -168844 -62654 9178 -94176 -207083 -114210 -92474
26813 -92474 -336012 -331433 -196989 -230124 -110432 -98268 -209023 -308052 -8066 284570 304094
26802 304094 219944 197471 90370 91596 249299 420823 550505 279145 156458 192736
26792 192736 -72854 -134582 -29524 139386 -220323 -441642 -266601 -402485 -325128 -54163
26782 -54163 -83291 65939 -12478 -13576 -25590 5648 -24921 46613 115791 202715 342234
26771 342234 282874 418236 160787 -37917 -88244 -98657 103179 34939 -46153 81869
26761 81869 186090 71753 99531 397924 438421 280380 196848 145862 -107305 -63555 -85000
26750 -85000 -287650 -374242 -412391 -57464 29861 -50181 -137811 -234679 -219703 -302724 -48815
26739 -48815 138231 289089 443156 457622 513674 470169 410133 458031 218891 -35906 -133890
26728 -133890 155687 222075 109050 37650 -40815 -122188 -213530 -256835 -77456 -113598 -49138
26717 -49138 92278 113096 50983 129636 301403 121217 -145620 -252423 -134319 -1839
26707 -1839 -38885 -103569 -64732 11949 -9382 11803 -43391 -239786 -343457 -415162 -206097
26696 -206097 -4979 43580 30049 -90400 -238026 -238308 -269794 -280098 -450784 -386730 -19631
26685 -19631 103118 66832 63250 -106651 -151087 -150062 -63081 -69147 -51622 -116230 -113785 -85297
26673 -85297 -135762 -141120 -129660 150817 205192 213949 -19548 -338855 -331207 -253406 -50455
26662 -50455 -89219 -143262 -47166 103825 133645 256429 359908 313443 268287 420596 551529
26651 551529 482450 293711 337812 339840 338918 439178 514264 304024 160408 286839 159946
26640 159946 -42738 -234581 -326872 -316818 -61871 114322 249225 203118 -7534 -40782
26630 -40782 -202743 -237602 53039 34093 -124104 -176611 -224091 -134124 95235 142450 -59748
26619 -59748 -70476 -77147 -82067 -167650 -45229 90297 202261 313211 149843 46402 -81393
26608 -81393 -316410 -302356 -281876 -258820 -149719 -178746 -270136 -173393 -46921 99641 86520
26597 86520 -20620 -41035 30593 229010 289172 90497 137529 178417 -104425 -277792 -394320
26586 -394320 -225423 -53614 234759 231395 252329 316929 328312 264694 136936 170256 249417
26575 249417 164833 90462 -3504 -24553 -144857 -20169 20120 -778 77617 -27814 -108176
26564 -108176 181502 279399 298059 315630 223659 67365 49783 -6461 -81772 68302 273111
26553 273111 420593 544390 439099 90384 35021 -155145 -190454 -46661 -34469 330067
26543 330067 331880 257742 233645 268856 114405 315688 353677 278567 64254 30860 125638
26532 125638 150590 80693 107098 -30954 -20154 1949 -50026 -70169 -114486 160779 409251
26521 409251 417110 179667 97411 73461 101668 90884 63845 40529 9799 33183 -56794
26510 -56794 -90510 -64438 15683 -1274 -54012 -238887 -48216 79952 1946 -180500 -125643
26499 -125643 237612 446047 389302 305854 45101 -5961 -147798 -392814 -278926 37396
26489 37396 174937 100217 19942 99495 188441 -24310 -255777 -399455 -384574 -299873 -219145
26478 -219145 97475 149581 119794 7928 -143687 -53264 63601 199251 72878 86609
26468 86609 248048 300506 321981 421189 601049 476031 270710 179098 212576 326745 413960
26457 413960 360592 281244 341066 281212 -59004 -255441 -137232 -222208 -65920 59111
26447 59111 73884 365754 287865 -53019 -184352 -88829 94762 112256 25107 -178573 -230331
26436 -230331 -244751 -245763 -143525 -105121 50686 5714 -21242 -110687 -229050 -91933 -225290
26425 -225290 -309046 -214543 -148415 -229938 -345397 -327905 -258886 -247985 -166320 -215800 -128300
26414 -128300 -135819 -434583 -196842 -14139 -121458 -104351 -149074 -275733 -465631 -498539
26404 -498539 -249092 -126539 -217729 -283005 -135728 -55348 71413 114662 39443 -84646
26394 -84646 -352020 -203058 -149961 7748 -159864 -202926 -177602 48539 -6166 -417707
26384 -417707 -435345 -204081 -212201 -25577 34352 -57414 92106 46006 -240001 -300025 -211149
26373 -211149 -364267 -570514 -727331 -562615 -539400 -440618 -461072 -460227 -364553 -283445 -52049
26362 -52049 -8219 -127136 -475198 -381076 -6724 36982 -231256 -203585 3748 154862
26352 154862 114983 32767 -108273 -478837 -651009 -471135 -215413 -50393 -133458 -188351
26342 -188351 -264252 107377 63601 -8557 11398 -46144 -129560 -205527 -193603 17716 72330
26331 72330 139472 240078 138882 -35339 -164301 -29892 56237 -44966 -146810 -54598
26321 -54598 162260 210096 157272 238124 179334 363435 270496 193885 317469 346938 531241
26310 531241 452922 278356 190842 129719 240012 290531 368945 379318 418655 204610 49294
26299 49294 143483 221343 102618 113532 196352 70021 253 37965 42875 -29111 20298
26288 20298 108911 398391 493529 353795 426016 346666 54897 94067 170784 -106106 -89584
26277 -89584 14930 77568 -8856 13678 379131 315889 104694 109660 397261 301326 153410
26266 153410 122631 405153 421599 288622 78359 -28365 -166143 -187090 -210179 -95982
26256 -95982 -8309 11705 78196 177481 269113 193544 414706 497991 480744 317154 119258
26245 119258 58717 -125904 10140 -155890 -93509 -94545 -58566 -208174 -357280 -229697
26235 -229697 -108558 24627 259582 226432 -2902 17072 74848 25311 83707 38675 -114213
26224 -114213 -79339 60487 -238304 -306899 -183710 -46331 111163 179783 308258 322003
26214 322003 308099 57007 46385 -20605 -6949 -64629 -133330 53101 111479 -51722 -37408
26203 -37408 84596 147493 169353 151340 221342 -3529 -16852 -300231 -358660 -253800 -72216
26192 -72216 -163729 -84224 -123422 -230778 -337802 -91320 -12433 -225652 -476775 -516247 -439290
26181 -439290 40540 221296 153996 19884 -2557 183577 124772 1906 -13303 -175197
26171 -175197 -157982 -414 183792 106084 103088 251142 371629 277269 130537 30377
26161 30377 -61831 -213741 -269269 -72297 17979 -172167 -225756 -307060 -184263 -147892 -210050
26150 -210050 -201827 -152143 -11077 -47047 -107677 -116925 -37485 267 23476 -162845 -181818
26139 -181818 13072 93265 -165735 -171629 -122163 -6643 157666 248707 248549 114733 -74431
26128 -74431 -119269 1837 19310 109072 42444 92675 102753 270758 258175 187955 304831
26117 304831 234284 16222 -24145 101422 215727 -40005 -145193 88074 325221 357056
26107 357056 333569 204066 137267 -61478 -160819 -175341 -180451 -133030 -60535 160287 278173
26096 278173 166445 -190709 -218514 -57502 -60422 12543 -49477 -143885 30524 145634 208305
26085 208305 203783 170204 -25155 -191983 -264926 -205148 66270 107087 132418 -95995 -45362
26074 -45362 12000 -309142 -367858 -279715 -124996 200418 325970 435602 445182 267406 166842
26063 166842 205687 334594 404139 608846 406640 268190 132082 160546 80794 -214343
26053 -214343 -226487 -287688 -223298 -78610 -11104 -121574 -444589 -288668 -149136 -197366
26043 -197366 -77643 -131410 -294649 -403042 -316288 -440009 -338794 -392311 -315533 -150053
26033 -150053 -13426 190807 -25748 -17544 158314 109338 72774 15323 215619 229604 145031
26022 145031 -161189 -224545 -3052 160906 142178 130263 212346 129776 -64772 41855
26012 41855 349153 95957 -152120 -157093 -247612 -233570 -167589 -128130 122817 326437 389167
26001 389167 118480 -42 78838 39871 -80024 -72257 70750 -81287 -87899 -12482 38540
25990 38540 112484 -13169 -14784 -98509 78504 62578 -17224 -83841 -125071 -216796 -387901
25979 -387901 -251241 -33691 276395 350180 87376 218579 166366 57595 64183 266645
25969 266645 151567 -72115 -362116 -488012 -274598 -14948 48805 77536 -648 -31376
25959 -31376 166187 -75561 -42030 65606 -16067 -203629 -304580 -81336 -234766 -442941
25949 -442941 -345244 51763 120207 -37313 -271696 -38237 75008 -198770 -356006 -351358
25939 -351358 -130926 -181659 -339532 -43850 239055 107192 -23070 -36677 108099 61628
25929 61628 154310 190209 371916 474542 183283 -125065 -274887 29135 141632 -60712
25919 -60712 -193616 -128941 142498 30055 -118530 -238737 -323113 -326624 -289411 -41077 203137
25908 203137 355092 243106 123971 9336 -30796 155123 47254 3955 99338 256522
25898 256522 343648 190036 -61749 -83595 231365 256179 412724 618997 609243 340876
25888 340876 181896 122994 -35071 46855 198045 233063 431695 172878 8910 3887
25878 3887 -201950 -127975 -108257 100538 -67320 -177711 -146834 -79940 -97393 -176472 -194148
25867 -194148 -193266 -186699 -418946 -282735 -165697 12429 47476 -79248 -81420 -25106 154909
25856 154909 179454 104630 81854 209968 383218 347666 85144 -112221 -81010 170876
25846 170876 204821 144869 -4136 -108858 -99255 -106602 -245102 -383980 -320008 -296638 -26869
25835 -26869 144628 6650 -192603 -491368 -617084 -407876 -422091 -337328 -157215 2735
25825 2735 112711 123384 -43460 64784 93705 -46050 -23381 6079 37990 125394 196832
25814 196832 150103 153171 -174382 -110577 69524 131076 180811 21048 217159 301735 232002
25803 232002 232021 202951 365116 403104 357851 116576 60651 44768 82093 22308 397922
25792 397922 626736 387275 459310 418685 201245 285745 312650 305135 132883 135926 126061
25781 126061 29369 8943 -115230 25912 -113302 -227330 -165053 -169853 -254344 -95539 23630
25770 23630 10856 -84977 -319452 -307368 -48912 5968 -301717 -185978 -237786 -334614 -245059
25759 -245059 17737 313563 377329 229453 254901 332600 311154 81806 11745 148088
25749 148088 387903 541071 402574 267829 349620 497204 556576 413986 355616 292428
25739 292428 136845 27381 30910 99404 96466 217 -94431 -159270 -194053 17946 -16087
25728 -16087 -254964 -124286 346052 474643 335093 321184 234233 27443 -97620 15050
25718 15050 649 -38003 -17329 -61819 -99241 -61209 -187374 -131511 -128025 -180298 -134286 -373360
25706 -373360 -323494 -25424 123537 239065 182479 2539 -150021 -160630 185388 385804
25696 385804 111260 -178868 -87663 -121862 -219163 -280493 -162211 -133857 -244993 -171724 -164860
25685 -164860 -90296 -109594 -151012 20983 22309 -318984 -603823 -594737 -279663 -86452 -42757
25674 -42757 -6551 -67145 -119024 -112790 -87474 -56126 -2011 122426 273105 120874 39658
25663 39658 -174359 -261511 -333222 -172714 -72776 -134078 -340751 -28352 -24405 221400 123607
25652 123607 140135 193877 21290 176351 375128 323030 234019 81777 139029 45286 53978
25641 53978 36072 193130 133255 98706 46927 114978 111669 185843 427138 495676 433869
25630 433869 233839 144701 157348 73488 -98714 -80900 -40356 44439 135934 251903 351790
25619 351790 388027 363663 341352 335421 -57064 -64496 427730 431563 539779 266367 270847
25608 270847 283502 114672 -88413 -142033 -145623 -200656 59044 210007 297289 446006 356463
25597 356463 262848 275840 165851 28850 -103987 -23809 -205100 -237942 -352582 -388956
25587 -388956 -516322 -511153 -656317 -663983 -335648 -243347 -297259 -142811 -126210 -65906 88763
25576 88763 22841 -11315 153666 108309 -121714 -63909 144853 -75170 -11009 38645 31994
25565 31994 41781 -63986 -106723 -69914 -97354 34332 230771 265060 77548 32814 74398
25554 74398 93021 -12074 -255257 -373967 -199345 -309912 -387962 -100881 -133909 -216246
25544 -216246 -202358 -20967 181965 253311 37758 -325744 -284424 -180524 -152478 -116382
25534 -116382 126691 137837 123259 139845 77173 -60160 -37671 10160 -22310 -34076 -142097
25523 -142097 -83272 -9905 35392 -201494 -136661 -83524 -5179 -18046 -118560 -122735 91086
25512 91086 63532 -61638 -152972 -39573 -51861 -303256 -471856 -318984 -110544 -130610
25502 -130610 -69203 -217584 -260734 48787 107457 124810 23459 93031 188316 337119 336466
25491 336466 378390 194846 -105185 -203189 -400695 -243594 -52167 40809 111138 77562
25481 77562 -110582 -61511 -94590 -258999 -101438 -123843 -151689 -138101 -102996 -269700 -101512
25470 -101512 147789 320957 180261 318695 136223 -78497 -352383 -247719 -163272 -470392
25460 -470392 -466223 -487596 -356308 -311468 -270725 -143418 -254404 -389953 -270438 -173794 -96372
25449 -96372 -67769 -211648 -80829 -85006 -159505 12172 -12864 -42952 170318 20338 -116060
25438 -116060 -240045 -278613 -220144 -183738 -85221 187178 314872 226761 75509 25330 -85903
25427 -85903 -249132 -93424 86137 155751 105074 -51565 -62983 -39380 -219572 -221845 -48528
25416 -48528 41931 -129281 -367140 -513732 -419276 -261452 -293188 -116596 86851 63969
25406 63969 -20365 -358179 -291305 41818 216804 274302 195793 47271 12656 -110932 -209810
25395 -209810 -341936 -343686 -514478 -428704 -145620 34369 288595 224912 -143003 -40266
25385 -40266 -137275 -200990 -68306 -11012 -49498 -27826 -186923 -122415 117794 251241 203634
25374 203634 79181 -170776 -17311 85329 146013 305755 255871 25186 -14952 163577
25364 163577 -49261 -84224 70346 -31083 -160391 -161953 -108711 217154 195155 -90028
25354 -90028 -268625 -362881 -153889 190962 346782 146694 128389 185902 46671 -279503
25344 -279503 -351236 -407739 -220671 -101732 -36942 56976 86067 168638 226268 -24668 -178350
25333 -178350 -187991 -74868 -61137 6136 121645 39710 65871 1796 82472 74872 -808
25322 -808 -21162 124287 124586 15044 -105479 -172363 -166462 -233602 -386211 -462717 -474924 -310911
25310 -310911 -112356 -104352 -129355 -142469 32831 417170 431513 342304 268937 163620 188067
25299 188067 85120 -126241 -109735 237037 332897 284340 226559 105548 92976 -32871
25289 -32871 -153832 -24774 42770 145807 -90935 -176590 -133464 19805 74751 114187 152246
25278 152246 34489 96820 292807 239886 42942 -5670 71266 47525 202225 461628
25268 461628 340101 193184 61686 125884 149349 105107 18973 45227 54733 -148420 -249342
25257 -249342 2995 -158823 -198574 -249954 -460623 -549535 -308845 -196299 -168389 -391039
25247 -391039 -302104 -187397 29636 206127 -76052 -131588 10995 -77661 -28523 63982
25237 63982 -63064 -31055 -3057 21710 73123 4071 -60085 -75440 -85392 235844 252675
25226 252675 11052 193702 256494 59745 -83725 -167722 -127888 -106638 -278833 -306064
25216 -306064 -19445 -54781 -179423 -306199 -406243 -564471 -225574 123383 262363 148262
25206 148262 -63817 -165052 -35928 82046 -39609 -9358 5949 -8148 107907 152192
25196 152192 48001 325527 527509 428827 358613 229282 -95210 -223621 -250452 -152320
25186 -152320 -132472 -20993 -154631 -430587 -339988 561 155667 16819 -50254 -139558
25176 -139558 -207155 -181583 -161106 98826 -38969 -102736 -121616 -4906 100030 199721 143154
25165 143154 32619 -40721 -33483 -50701 166894 248593 309659 397328 180536 -51316 123867
25154 123867 389239 315964 179812 149987 263698 334788 90280 -21068 -32171 -40078 -106342
25143 -106342 -90093 -19523 125457 -100847 -348821 -294925 -82363 181518 175080 -117222
25133 -117222 -408872 -300498 -161018 74225 160082 8291 -202934 2834 -27460 -130110
25123 -130110 -413572 -320302 -116764 -38508 -108825 -115885 -123713 -102942 -91842 -163805 -289236
25112 -289236 -180259 -68534 -68624 51098 93525 -60891 -77120 -109266 49153 21059 -88439
25101 -88439 -26612 -49541 -136525 -285778 -260430 -310549 -408909 -411160 -227768 -145514 -77838
25090 -77838 -69685 -54620 4468 -34590 -257981 -400831 -251176 -45762 -54850 -188214 -324677
25079 -324677 -72657 17547 -27759 146667 317629 119135 -71510 666 75415 15559
25069 15559 34404 148439 264816 255286 196985 67871 29907 12200 -210697 -75068 -36871
25058 -36871 -205663 -96472 14225 -33882 187656 246576 188250 144802 197563 37567 -9085
25047 -9085 -165622 -286683 -161634 -39917 -310575 -372447 -398619 -272484 -63863 83028
25037 83028 98365 127791 100117 -108438 -231911 -176234 -87453 91462 43669 -18584 -174211
25026 -174211 -173048 -351170 -247777 -107858 -523858 -527440 -444016 -276759 -220020 -162609 -124244
25015 -124244 -166511 -65425 51630 107584 197996 152635 93236 -88385 -99494 124622 9879
25004 9879 49329 228499 202126 373019 345461 77802 -74719 -169203 -161077 -30281 151931
24993 151931 223135 102902 -78104 -260417 -184466 125679 133155 -50340 -314063 -498706
24983 -498706 -652109 -500192 -365928 -381689 -174248 -152387 332 71402 -15975 -107174
24973 -107174 -212952 -247811 18348 197774 542797 406346 140915 101148 329789 205282
24963 205282 72755 78120 50227 174791 127218 109096 208844 517574 671541 446147 352875
24952 352875 319513 246896 344030 461214 149247 -139453 -72868 -79975 125533 238217 142688
24941 142688 -172192 -165792 62995 -64964 -105961 -109968 -84631 -47598 -28873 -189229 -415464
24930 -415464 -454268 -210053 231329 145903 -216443 -581414 -331682 -167511 -14823 -1587
24920 -1587 38458 140180 192717 153254 76835 47235 160190 -22568 -48614 51952 22669
24909 22669 -204263 -318588 -243015 -320452 -309425 -168976 -138170 -70763 -321627 -541868 -620988
24898 -620988 -559439 -371240 -180933 -225181 -327719 -291773 -171323 -101248 52377 -54211
24888 -54211 -70072 196480 218238 96572 -51471 -3257 26262 101121 -130223 -102881 -95825
24877 -95825 51526 230171 257620 146026 -69811 -302715 -268390 -409253 -415276 -231467
24867 -231467 -236895 -226776 -208062 -213197 -179292 -11472 -26691 -109159 -201381 -359575 -391994
24856 -391994 -172954 46511 140353 21906 -115891 -195686 -319573 -360339 -407391 -441725
24846 -441725 -255654 -19915 67400 64107 -74815 -208538 -70859 -39674 48881 62907 -75904
24835 -75904 -61820 -68625 26758 154518 43861 -88459 -157780 29504 127120 61062 -138975
24824 -138975 -311270 -209332 141482 166566 33520 -137078 -22401 11997 21083 21560 -67208
24813 -67208 -19009 177688 216880 -2791 15584 143152 161172 -196393 -273693 -104246 281724
24802 281724 210059 113393 249154 277074 71624 -126497 -320480 -599853 -660868 -292911
24792 -292911 7521 104343 399675 395038 102693 20378 175598 254674 373114 216625
24782 216625 -148833 -452471 -205026 -241828 -486642 -416683 -133279 -103190 -18019 174662
24772 174662 223084 277067 491548 440642 261892 -80345 -120271 154792 85233 -77464
24762 -77464 -233459 -56367 215213 -45327 -152887 -200076 -196785 -67750 -190236 -272428
24752 -272428 -125816 -50352 26063 -4661 28759 196262 45902 -54117 -130342 -328114
24742 -328114 -333386 -306212 -223336 46826 -28765 173830 176476 66657 124007 99964 202836
24731 202836 -115798 -213348 -222044 -200524 -43135 76957 54043 28553 -89240 -212277 -101897
24720 -101897 -109145 8721 55642 -170799 -74408 28051 140988 152415 -123249 -211439 -89023
24709 -89023 -203247 -303904 -468380 -523329 -190698 -221781 -219073 -423479 -375130 -309759 -365431
24698 -365431 -169078 183744 -120852 -333900 -268083 -283522 -322035 -417137 -412643 -229219 52298
24687 52298 153226 185530 131667 -150573 -344763 -403252 -312672 -34379 181419 311169
24677 311169 301123 181498 142893 -18112 127846 -53341 -219518 -222603 -53835 138523
24667 138523 105144 22013 -107586 -269862 -387916 -72884 225044 91006 -93900 -134064
24657 -134064 -96793 -71468 94573 335913 281167 202992 -25726 -110713 -77210 -116621 -239475
24646 -239475 -321276 -256775 -28314 -59089 -177119 2815 -13566 -73652 21503 149178 329304
24635 329304 251753 205717 216136 207823 262277 48626 -85646 -102430 -118943 110294 159679
24624 159679 27817 -4101 213844 311066 65046 57633 222010 272151 390070 410147 474966
24613 474966 454528 422644 351601 477212 594460 461810 142567 -119505 96473 -169970
24603 -169970 4934 174094 137456 214201 258925 -18476 -198562 -188688 7936 154668
24593 154668 81690 90137 159789 114212 201115 54407 -166030 -105708 59440 -178072 -472332
24582 -472332 -281122 -40921 -206801 -294280 -135281 -204331 -110376 259530 378302 196260
24572 196260 -181862 -174709 -154317 -200849 -52778 176718 143881 164962 399305 293437 323515
24561 323515 287746 273960 319716 284508 119767 140085 122236 179898 79373 174834 208557
24550 208557 181941 89253 -10002 -341465 -273805 -106071 -60405 -112909 -30550 -69098 -198114
24539 -198114 -268920 20511 2606 -129320 78098 192986 309050 166151 171358 149554
24529 149554 173799 300316 317008 62116 -92060 24675 86574 -53427 89674 -57744
24519 -57744 -52015 -122291 -10156 11473 22388 -77191 1785 307501 502951 577972 462927
24508 462927 355407 3919 -52964 -105814 -3865 -13730 55656 -164515 -370536 -129152
24498 -129152 -45490 -30795 -56038 -156313 1479 83639 137314 101858 21801 31156 163484
24487 163484 140550 50089 163217 220874 135231 300065 194389 -227677 -231707 -74004 160493
24476 160493 52932 -202769 -96144 35323 -5550 98964 349213 384794 124382 146080
24466 146080 -15624 -61616 -128675 -148000 -65265 -21561 -21057 -221471 -413488 -348631 -164397
24455 -164397 144402 55785 72448 238934 363960 129132 -101743 -52253 -116917 -220643
24445 -220643 -271881 -249149 -70527 50112 -39931 -139514 -72795 -6010 -62175 -224195 -129631
24434 -129631 -222737 -45513 -68640 -288444 -222046 -165343 -120961 -10942 93939 14420 -62567
24423 -62567 -54614 -237508 47805 324915 224022 38754 -83108 -59191 -202590 -255152
24413 -255152 -173716 -9645 122169 272871 -37821 -112013 34888 85532 75555 28206 26325
24402 26325 -131897 -67293 -38406 60583 221152 108393 -274291 -77464 60216 -57760
24392 -57760 -134640 -101693 163445 -50903 -85567 -68343 -108876 224004 371917 204258 -25067
24381 -25067 -70500 -21412 -112559 -104809 170057 213893 -39901 181386 421394 200000 157128
24370 157128 440544 410790 435847 443508 454192 239008 157935 125876 188194 377724 153469
24359 153469 103749 174029 256348 190039 223330 183622 155063 136489 230346 262053 202455
24348 202455 216508 38813 -60717 -61519 -152426 -264001 -33227 246472 350043 214378 187896
24337 187896 378746 379919 321777 417221 466028 194794 157546 8236 10912 -98116 -200739
24326 -200739 -313100 -220143 -225440 -119504 -164270 28698 262299 122671 20059 113703
24316 113703 16208 -17355 -15846 87269 204861 182897 498708 902537 819270 328320 -5894
24305 -5894 -82891 65889 -134 44182 28713 15362 -23482 -78172 -29117 -97509 -114929 -74483
24293 -74483 140078 251490 -99844 -315204 -367487 -268792 -411565 -455366 -426318 -393934 -311035
24282 -311035 -332705 -133702 16442 11073 194864 290628 287957 178275 -89188 -169386 155595
24271 155595 176903 58538 154942 201752 135090 -93563 -272726 -327908 -264958 -98784 -131270
24260 -131270 -228576 -78211 8516 -7640 212898 131047 15595 57318 -149281 -75354 24804
24249 24804 21547 46543 51875 67137 214808 169818 23316 165175 198861 208724 175935 155333
24237 155333 -28130 -129458 -356757 -324286 -49903 54194 154761 286511 201106 115964
24227 115964 34248 204 -298080 -446515 -332464 -226921 -215962 -100615 176330 254538
24217 254538 78132 178193 43832 35747 189487 93603 -40907 -76708 -63852 -251293
24207 -251293 -432357 -417515 -384870 -246461 -256862 -174041 -17940 59442 149339 -87292 -152590
24196 -152590 -78972 -136458 -131855 -108159 -171343 -219097 -143417 -122872 -155876 -41302 187243
24185 187243 221420 134251 177139 36793 22792 -50628 -51278 -74130 56590 146280 41021
24174 41021 -18370 -160308 -243306 -28569 11214 167519 98280 -138347 -95307 -105742 -51690
24163 -51690 138163 274343 202603 188064 -26706 -60124 -101967 83606 -47917 -60712 39691
24152 39691 -52429 -189232 -48025 100756 -51182 -55013 87790 151216 -75324 -134943 145821
24141 145821 339499 258253 25731 -255306 -522469 -360076 -297528 -257535 -64200 129224
24131 129224 35853 -6725 12626 -75101 -99518 68676 179332 3158 -161690 -227501 -205080
24120 -205080 -203230 -123440 -224601 -112125 107450 89542 61554 -615 -84028 120367 22242
24109 22242 -185119 -168383 -2637 91400 80430 207152 333557 431575 300500 142643
24099 142643 199914 97550 46907 94337 173523 225333 211941 13512 -223981 -169111 -179790
24088 -179790 -151101 114966 159011 -58221 -4394 242391 177408 112288 72056 110874 79550
24077 79550 -164960 -126989 -47985 -202320 -137210 -188284 -89694 233310 364946 322411 218231
24066 218231 174734 176369 -208523 -362975 -216706 -38457 -77934 -191083 -35319 -12420
24056 -12420 19537 57941 69704 141929 182425 67514 116983 5406 -142369 23262 134582
24045 134582 -188159 -270635 -129125 7058 153454 120257 4542 -31985 57224 279329
24035 279329 283132 273948 307810 319629 328553 199049 202605 261958 134425 172484 378177 492793
24023 492793 642819 653366 450036 450823 411900 81708 63155 123540 329237 333525 364917
24012 364917 245056 157253 337479 114803 -178303 -382869 -450842 -245336 -376458 -710888
24002 -710888 -581608 -357411 -234411 -154958 -147168 45569 25787 -49581 33554 48139 -34904
23991 -34904 -108586 -18781 11724 181981 367094 264359 60199 176589 333743 127535
23981 127535 -141829 -87418 168759 175224 190070 95729 106397 194950 209972 243272 246403
23970 246403 146859 214939 331942 396297 234580 7938 -26680 -13696 -39692 95749 59796
23959 59796 -224217 -195500 44649 217918 94966 84000 103600 84421 -36388 73468
23949 73468 41328 46302 49006 193803 178979 224079 168172 117954 -9062 -117437 -174309
23938 -174309 -277488 -241066 54956 179685 103824 153636 75196 -132374 -172599 -139647 24865
23927 24865 275790 497279 528086 359629 -87619 -91198 -92178 1658 -154498 -99780 77416
23916 77416 158227 229908 -19811 92750 173208 334409 382534 199049 152953 203369 228476
23905 228476 199586 -68725 -99903 -302478 -193547 197491 206759 112833 -38238 -39919 12681
23894 12681 128444 261417 400029 600118 637964 388753 185858 88311 41128 49709 350843
23883 350843 416398 477611 728192 727537 544899 348851 351393 452891 385732 266785 -12790
23872 -12790 249957 353248 292353 53529 -259503 -123729 182897 368430 200202 123382
23862 123382 56620 58830 -43548 -50448 -144134 -175609 -163319 -177191 -99885 -90871 -40146 130308
23850 130308 113932 -119347 -152487 123 -92289 -92132 -4674 36266 169546 282592 142964
23839 142964 191394 100472 75999 114102 22201 -14711 260244 338307 446722 533183 498178
23828 498178 504503 473739 499137 290086 283231 413634 382619 260132 107047 186260 397785
23817 397785 442493 665280 597227 315955 247635 341539 211535 51048 87149 182229 359885
23806 359885 291624 174702 56152 -27438 -10751 63400 275743 353347 447687 387767 389681
23795 389681 320934 215212 125384 140881 357255 305994 415749 526758 438285 426446 369733
23784 369733 230726 101264 103525 343273 592846 461448 288512 198872 211828 194898
23774 194898 531082 650940 590008 456243 393262 499119 470327 360498 337403 412797
23764 412797 480641 434606 428976 415786 347124 79491 1028 -2170 -180323 -10729 252031
23753 252031 164443 60343 130859 286145 55202 -39618 91411 268868 407791 325359
23743 325359 164950 400260 416234 467265 431575 511754 368470 406609 461181 554006 517083
23732 517083 436166 299934 536207 805901 806767 549554 416481 449867 505602 398703 383637
23721 383637 626739 794864 707942 436574 373343 727843 810005 653577 576716 496485
23711 496485 714008 809121 811453 1014735 1091244 1101558 1069579 1067083 1084878 1121167 1239595
23700 1239595 1291565 1167039 989225 747728 730990 680587 818178 812053 784334 799554 871587
23689 871587 802832 715471 825386 873511 944180 828594 805288 820899 758451 764555 681177
23678 681177 488326 472864 754870 799074 674325 655669 767909 828785 894116 968927 857260
23667 857260 860950 1074451 837619 677565 712439 561382 466289 469750 666809 816564 868098
23656 868098 802444 811379 460383 76049 43542 339288 416031 535785 721749 795725 967237
23645 967237 962671 1101718 1170011 852904 668752 799956 980776 1263036 1308664 1164463
23635 1164463 917007 653117 662992 758733 940924 867425 737804 772210 849275 1001663
23625 1001663 825289 889694 843160 773824 1102088 1161900 973103 932980 940542 976937 914252
23614 914252 778570 895986 981326 1028084 944175 1097033 1217961 1233257 1398444 1364639
23604 1364639 1246358 1082902 1038455 1136278 1023259 1271342 1346468 1278914 1221763 1093733
23594 1093733 983014 1215989 1395961 1492125 1640363 1779132 1970098 1943000 1844025 1814631
23584 1814631 1757227 1875243 2009793 2120479 2300672 2231374 1964937 1824597 2132681 2442134
23574 2442134 2416798 2186976 1995912 2193991 2443758 2521328 2715918 2624354 2444992 2232527
23564 2232527 2318350 2568723 2716847 2615549 2392212 2539849 2748763 2808544 3143281 3089366
23554 3089366 3020789 3107263 3255770 3136864 2973996 3076542 3096244 3310997 3223244 3096451
23544 3096451 3235564 3463877 3386054 3049279 3105467 3172129 2895168 3013498 3377488 3605520
23534 3605520 3534139 3314580 3260204 3168356 3251051 3477517 3314142 3441982 3579509 3378023
23524 3378023 3485080 3613650 3574914 3593987 3869758 4279638 4282940 4335135 4487324 4611861
23514 4611861 4824795 4804088 4779309 4631308 4809293 5156607 5265026 5280831 5356732 5392241
23504 5392241 5625060 5612430 5622824 5745708 5996260 6077984 5956301 5978406 6096893 6304880
23494 6304880 6797372 7247923 7344246 7129438 7380151 7784709 8057736 8282601 8385026 8581373
23484 8581373 8831551 9224360 9325090 9535896 10121395 10455740 10803067 11186252 11255928 11581398
23474 11581398 11994771 12465502 12807165 13090907 13621868 14163022 14893315 15595355 16341460
23465 16341460 16629001 16935845 17597838 18447731 19094007 19840736 20677818 21443929 22441290
23456 22441290 23453651 24444153 25539734 26901489 28191422 29928128 31568754 32900496
23448 32900496 34569726 36431106 38589023 40696622 43057481 45633560 48448976 51380192
23440 51380192 54252527 57300708 60860571 64910577 69261674 73780920 78485744 83335990
23432 83335990 88604899 94408009 100482856 106816969 113227001 119635196 126035813 132487469
23424 132487469 138706723 144829744 150490144 155603829 159906026 163235181 165156434 166275620
23416 166275620 166227821 164741108 162177414 158735343 154282108 148915248 143056210 137249851
23408 137249851 130990583 124889144 118723178 112829129 106972912 101091765 95600447 90330809
23400 90330809 85180044 80562504 76182967 72115840 68309155 65147836 62213404 59241417
23392 59241417 56475713 53958701 51633115 49685861 47688445 45619025 43763398 42086714
23384 42086714 40516419 39125395 37750254 36456885 35268625 34037034 32734909 31825066
23376 31825066 31135778 30123975 29243535 28561181 27660685 26724565 25986616 25273436 24772209
23367 24772209 24500951 23987824 23430481 22823052 22148845 21644759 21245591 21131666 20775239
23358 20775239 20366987 20124593 19507821 19008638 18593635 18372860 18310542 17984252 17395524
23349 17395524 17133751 16932268 16804852 16506305 16451165 16517206 16301829 15913665 15755580 15703846
23339 15703846 15555637 15152881 14879819 14498422 14344191 14361150 14041868 13761300 13546855
23330 13546855 13271961 13001952 12766322 12580377 12401300 12194191 12040619 11769971 11623865
23321 11623865 11506981 11424146 11284257 11031890 10715661 10484521 10226135 10002719 9392747
23312 9392747 9090598 9129282 9080120 8980385 8852259 8869667 8779462 8706117 8415804 8199430
23302 8199430 8015658 7668821 7075217 7088742 7329380 7217903 7112449 7067653 7020944 6687893
23292 6687893 6395800 6224907 6274336 6442775 6150398 5734398 5590292 5507866 5361160 5273987
23282 5273987 4961645 4606833 4437947 4413229 4469496 4495580 4133659 4136894 4433581 4367901
23272 4367901 4003278 4142218 4252244 4264004 4169517 3959812 3597512 3550030 3282693 3209014
23262 3209014 3116438 3208523 2959848 2673540 2636329 2877909 3080395 3102244 3029487 3075797
23252 3075797 2850075 2594535 2140620 2090317 2158283 2254608 2225829 1957371 1792289 1925956
23242 1925956 1919399 2033281 2056185 2085603 2223489 2385057 2257888 1977332 1904931 1920990
23232 1920990 1853313 1657847 1704885 1807335 1896755 1862961 1564547 1624730 1824189 1689731
23222 1689731 1355294 1297860 1419880 1443038 1416370 1262957 1239410 1295889 1737877 1843484
23212 1843484 1647573 1640059 1639654 1571538 1473051 1309474 1317520 1361613 1451743 1594280 1537079
23201 1537079 1269451 1449462 1795735 1884886 1936687 1836161 1513352 1286999 1498205 1498350
23191 1498350 1473526 1414782 1272342 1265514 1293822 1284490 1305580 1308325 1182819 1094309 1160909
23180 1160909 1349959 1368279 1436526 1463745 1513676 1434305 1492568 1468784 1314622 1352853 1500585
23169 1500585 1473625 1337806 1345128 1448196 1479515 1299672 1304422 1168361 1111915 1183384 1219516
23158 1219516 1466657 1461763 1374842 1514022 1374395 1188790 1103407 1300180 1391749 1372722
23148 1372722 1303601 1309908 1377911 1449805 1274253 1153776 872342 884548 1055625 1487055
23138 1487055 1619510 1372873 1255150 1384498 1627217 1681690 1562090 1812853 1732793 1600195
23128 1600195 1596573 1483466 1322916 1452303 1396060 1274371 1086425 1039420 1043248 983391 1031709
23117 1031709 1031621 1017490 1059439 833873 625333 615645 763572 646545 564101 631001 742119
23106 742119 805044 867443 833182 861989 838302 772816 524130 369281 199335 -85610 -155300
23095 -155300 77829 223037 375206 547226 679992 843650 714904 536548 571512 924665
23085 924665 914472 693303 554003 479929 409367 534135 512358 316940 462298 805284
23075 805284 715876 479194 286370 615347 857975 951269 863486 792775 583247 522236
23065 522236 653226 593333 522917 572915 630655 451772 230151 230335 193171 137097 149405
23054 149405 185110 226315 359543 481035 465913 528818 431267 266986 286758 194687 102127
23043 102127 180779 426322 541961 577620 682390 606598 431510 514532 192515 300786
23033 300786 541294 533950 446646 462075 570413 452855 416422 587666 562930 497690 459833
23022 459833 674263 715422 682028 744822 777213 581592 448806 492008 466238 375964 533893
23011 533893 497045 436571 480225 317140 219487 324269 241041 102408 340173 501308
23001 501308 356001 323350 238448 367681 503371 605965 722049 707883 479322 200954
22991 200954 201603 110982 288749 523637 683884 608362 696899 636802 486426 319034 281300
22980 281300 312481 359100 594061 412299 66797 85116 168522 97399 343154 479637
22970 479637 588735 498996 517131 574335 347398 233435 396079 270463 248826 -12572
22960 -12572 -211515 -201252 -352626 -390853 -149326 34185 192245 511341 349738 145753
22950 145753 64615 459021 529333 373894 304551 171793 202385 35471 72413 353915
22940 353915 318184 182782 75563 384698 424175 203950 46335 97388 187273 311830
22930 311830 250199 141022 142997 49917 -124474 13066 412700 348271 140015 -300832
22920 -300832 -514628 -663837 -529203 -371386 -160874 55923 107932 -119133 -2546 155682
22910 155682 113107 103753 262374 372183 350505 195928 177912 362960 429131 370879 139105
22899 139105 209054 160673 179478 16729 -68158 90404 211061 299004 130798 253697
22889 253697 424163 460787 376269 316853 137488 71222 281297 494063 536441 327759
22879 327759 52140 -110289 133190 305016 338673 296348 26423 214356 234607 207320
22869 207320 154322 135356 61164 -130168 -173574 -155206 -189572 -155135 -13765 103432 46473
22858 46473 -14271 68115 176830 207610 358272 263268 -21866 53364 85642 94861 113862
22847 113862 170392 194553 157 -2659 -86372 -2319 358162 197971 7871 -164529 -82452
22836 -82452 -66875 -7109 84244 166954 168983 53777 -179855 -441194 -418117 -164509 -5122
22825 -5122 -5532 -109497 133234 250642 312608 238225 125505 174976 117147 42698 19794
22814 19794 -23544 -35308 -117203 -135306 -208783 -21938 -193437 -425042 -489494 -435225 -301538
22803 -301538 -155081 28258 219480 282863 32344 -51536 111783 225114 262489 257942
22793 257942 -5992 -66840 -57804 -37307 227078 67203 161551 452283 546428 415914 244468
22782 244468 222097 204310 150779 360475 465809 368680 430869 181256 -15379 82880 33690
22771 33690 275832 354388 102932 -15871 -12909 66127 287336 493557 662366 523400
22761 523400 305113 229211 409213 500177 386628 251468 138546 -214546 -326706 -46300
22751 -46300 222435 212555 326947 387726 130709 -93697 -95376 -33629 -127010 -206795 -351663
22740 -351663 -356663 -263963 -71026 -6190 -77174 -45067 -186039 -237334 -167435 -189004 -85671
22729 -85671 -182942 -21828 -21453 -100213 -166360 -193950 62715 135206 4476 -68301 -162683
22718 -162683 -304565 -159641 2119 184595 328060 373218 297724 178813 193294 355696
22708 355696 295308 95621 107084 30074 -110122 257503 382400 237106 243276 198161 186381
22697 186381 342969 206393 134967 67775 -2622 -188077 -242078 -28055 -9822 -177135
22687 -177135 -317573 -533513 -374283 -288097 -168486 143542 47920 29204 -123459 -69896
22677 -69896 12698 53304 93750 47374 141567 196188 373835 485827 278890 -15228 -82695
22666 -82695 114551 -80 19074 129511 334969 263753 188847 151818 140069 56471 139845
22655 139845 -16285 73640 170996 50237 23019 -3135 58779 55527 76167 50811 238820
22644 238820 312126 300230 43571 279912 299581 137459 29625 -126228 -199090 -174190
22634 -174190 -170448 -94069 40921 29066 -31917 -197643 -240508 40064 149494 232995 193593
22623 193593 -90840 -88598 -119586 -69364 -65077 59674 201499 245447 101190 -78528 32300
22612 32300 -132570 -296312 -33439 -69261 -118097 -211890 -240825 -174850 -154987 -226716 -307508
22601 -307508 -309456 -296775 -617458 -788227 -751340 -392968 -45223 134942 219243 -43904
22591 -43904 -76821 -104050 -148969 -225199 -61903 -26060 80019 125272 45848 -73552 -29296
22580 -29296 -8126 -78311 -396460 -357205 -49465 267537 381731 156204 -71701 -159486
22570 -159486 -48454 -215335 -118112 233893 255840 2080 -63151 -18991 -260619 -468095
22560 -468095 -256347 -173923 -231502 -270208 -176397 -101887 -172299 -140394 15776 -145720 -321391
22549 -321391 -33207 128390 228112 342936 429582 75171 -166263 -177788 256158 441778
22539 441778 159636 -2219 23734 124969 -133391 -155166 -53178 -121797 -207822 -202115 -215311
22528 -215311 -188971 -286364 -132918 62524 75136 125473 24759 60637 59442 13775 -77666
22517 -77666 24339 -84007 -12999 67406 -141801 -199549 -147188 40127 208564 155084 90268
22506 90268 57328 107156 156392 64950 -45107 -210222 -246612 -270138 -389909 -418551 -508501
22495 -508501 -459449 -233332 -266473 -378379 -240250 64797 280354 323363 252867 267933
22485 267933 357325 198001 44948 47839 -146705 -164122 -96310 36586 -20936 518 30509
22474 30509 -288079 -399925 -449127 -199401 54360 252942 220536 272304 421081 272129
22464 272129 109374 -134236 -212229 1253 -32740 -302865 -349840 -276574 -136138 57499
22454 57499 -12919 -114418 98330 116388 158518 235921 338980 659743 686211 583554 437737
22443 437737 152798 84959 37548 76330 36846 98707 192602 -35912 -314947 -283717 -191392
22432 -191392 147994 312387 -22542 -19950 93677 -155676 -256344 -237902 -138318 -189398
22422 -189398 -268099 -107273 22467 91142 270543 191420 68187 -56766 -107036 -130467
22412 -130467 -96179 -79543 -15353 -221303 -322614 -380899 -536794 -459356 -340969 -219628
22402 -219628 -246020 -185305 -96056 -19987 -97428 -198004 -81663 -144241 -256184 -156556 -75559
22391 -75559 -111882 -179657 -275450 -457271 -216538 -143742 -148053 -190491 -145351 245243 375437
22380 375437 196048 242817 98539 -191436 -132781 172007 71298 -375972 -622055 -598907
22370 -598907 -432783 -350324 -208253 -293104 -318058 -247987 -350217 -338915 -196788 -143608 -327342
22359 -327342 -265368 -4610 -218151 -307707 -377630 -364598 -350480 -308773 -274304 -292534 55037
22348 55037 93558 -146075 -339984 -356967 -217293 -86769 -79505 -76455 1212 121961 135432
22337 135432 246169 239404 270793 59085 -88875 74059 56624 -79098 95754 71772
22327 71772 177499 335812 228728 375210 480562 466842 179767 -224562 -493762 -749364
22317 -749364 -669220 -483771 -488311 -372154 -62984 30598 -38757 -33467 -142126 -48473 -49441
22306 -49441 -149503 39124 87527 -120704 -142750 4558 173120 -14173 -128410 -432564
22296 -432564 -257675 -31853 -105944 -214786 -209445 -226502 -453319 -402304 -114218 -55004 43219
22285 43219 -118563 -36585 159707 -13875 -106504 -209276 -94706 -231317 -416865 -265268
22275 -265268 -210705 -19347 267816 189440 111434 145293 81979 190769 492571 549620 357183
22264 357183 201572 -92647 -189285 48924 281761 203823 260347 349495 215380 131632
22254 131632 75303 8222 -16125 215557 340504 265769 94176 -134776 -139719 98965 440528
22243 440528 455184 180991 163164 207754 14611 -93069 -131373 -57742 -87640 -310356 -344779
22232 -344779 -354531 -564984 -406710 -201198 -52660 40734 178195 192871 208003 102514
22222 102514 75698 156902 41837 73878 161371 155761 82935 -1860 -5592 -97401 -118962 -37877
22210 -37877 -2698 -99517 -147204 -126473 -239260 -303867 -247699 -285023 -417035 -318477 -318390 -235446
22198 -235446 -271316 -256038 100542 164756 32872 24278 -106589 -93784 -14437 6513 23987
22187 23987 -174477 56541 229037 196539 -74262 -75504 -2980 -116834 -190444 -190027 -343070
22176 -343070 -510199 -442330 -212699 -221612 -425259 -366264 -341015 -44793 97964 -31987
22166 -31987 -183315 -73432 88195 5917 -77988 -228540 -397973 -476288 -463457 -341859
22156 -341859 -155629 -60863 48728 -37439 -52786 125527 117932 15956 25253 -51998 -31926
22145 -31926 191250 184847 -70260 -293657 -249170 -63927 31719 -44134 -66646 8396 -37960
22134 -37960 38704 63512 -33105 -205011 -225076 -305495 -480966 -247320 -153068 -50513 221479
22123 221479 175789 155427 25505 198661 162622 -10700 -110012 -66343 3672 -33800 101526
22112 101526 90135 81015 119177 37462 -128534 -122041 -250973 -302972 -274131 -558265 -523516
22101 -523516 -216171 -23481 21302 16965 71862 97397 21357 188780 324061 223014 -4115
22090 -4115 -156210 -47469 126426 53870 45482 -147097 -36627 53735 -55139 -275535 -62134
22079 -62134 -47919 12346 -132457 -218729 91175 83772 41127 145999 109317 -191715 -229061
22068 -229061 42394 26075 -200301 -25910 -10452 -82126 -6933 211613 483708 477881 41585
22057 41585 31508 23891 9218 153891 296950 218741 109977 -131893 -493 104533 86842
22046 86842 18678 -165888 -56118 -12303 -8294 67803 -103366 -65269 -163610 -158815 -53626
22035 -53626 118796 -146957 -299078 -287879 -129888 -171127 -102973 -232810 -45188 147996
22025 147996 30682 -14967 -54981 66004 46807 217897 63717 -93633 -270324 -25886
22015 -25886 46857 -46954 -42569 -119214 -76930 -151478 -25734 36532 -17227 148274 41983
22004 41983 -30915 -90254 -116274 -254057 -278651 -67948 -142494 -174598 -73809 -75891 -120632
21993 -120632 -153873 -291631 -425241 -488797 -403773 -307247 -194954 -147627 -131315 -35148 41850
21982 41850 -261743 -180712 11913 263064 455904 394772 164896 -12899 207371 322480
21972 322480 194997 217976 351509 240389 -153138 11277 417295 347941 352177 414547
21962 414547 259114 82639 -15924 120116 306482 134180 -191089 -340982 -257973 -195703
21952 -195703 -54661 -109917 -485359 -402752 -268162 -192104 -245388 -235291 -255147 -253494 -53413
21941 -53413 152048 137918 238784 189897 -117911 -274922 -259205 -257082 -199868 -145199 -211791
21930 -211791 -87194 -164327 -126500 -96995 -108494 67086 -25811 -143430 8293 -37314 -102838
21919 -102838 -273922 -379195 -147005 123678 -19932 -103868 -283452 -475828 -207213 -28092
21909 -28092 -21487 24484 -785 36614 -116577 -147611 11757 -93614 -47290 63327 50646
21898 50646 27909 -236902 -327709 40041 154650 85900 4594 -115222 -394464 -571994
21888 -571994 -518293 -351082 -276840 -68094 -28121 -252235 -609723 -397728 -231747 -137499
21878 -137499 -143781 -101392 -72213 -19978 218722 273019 297826 289630 109364 -97467 -88496
21867 -88496 206644 348317 161580 107889 70717 44054 231027 189973 281041 309158 213966
21856 213966 397723 307883 45452 -29049 -209171 -191795 175059 194338 -143703 -208501
21846 -208501 -148379 -222590 -367402 -471736 -291349 -92757 -216570 -238565 -229104 -151764 -87663
21835 -87663 -29442 -158787 -334532 -396659 -172835 -108884 33211 154563 -58016 66812
21825 66812 144342 109869 380356 243269 63532 40873 -155714 -140934 -130860 -261422 -177075
21814 -177075 -230872 -5125 78578 89852 82744 84814 197958 51214 -50344 -95790 -181512
21803 -181512 -104908 181398 275292 112189 103572 -382327 -535393 -229480 5755 26172
21793 26172 8185 -13464 -30915 67374 108991 122395 53578 -151584 -216333 -61907 -123208
21782 -123208 -245790 -354241 -288446 -217899 -221472 -238115 -507150 -510265 101353 182984 34573
21771 34573 -97794 -135465 -236438 -330149 -166196 -136563 -103558 -188670 -194387 -316231 -181134
21760 -181134 -330247 -161819 -166878 -30244 203481 167208 -37730 -144975 -38887 -27812
21750 -27812 -39962 -144346 -53704 -3510 -73939 -10384 -126133 -156091 -140806 -326807 -350155
21739 -350155 -175106 35167 146920 88489 144499 43476 -286876 45313 102606 -10402
21729 -10402 -143006 -144541 -30228 -22436 108530 154262 198539 256140 456969 231261 165936
21718 165936 260522 322574 240580 60119 -30772 -79928 -96796 -34843 -152165 -123420 -159571
21707 -159571 -143853 -81824 -306380 -493519 -460918 -315403 -38590 41760 -77415 35758
21697 35758 85384 -66780 68780 -20400 -196225 -311839 -373929 -256426 -74884 -38426
21687 -38426 20690 94219 126514 105754 220732 291315 146868 -30183 102035 83341 74914
21676 74914 3057 8946 -34180 -99453 -2002 -7797 24830 239331 403450 209291 196195
21665 196195 110942 97292 86193 172860 175269 146389 -35480 -232526 -239441 -292601 -371675
21654 -371675 -313510 -304426 -248782 -191028 -225022 -266152 99050 62861 -79280 -189756 -218253
21643 -218253 -32985 24387 -42730 40587 -35462 -122088 -304036 -454976 -240311 -136356
21633 -136356 -10095 -21786 -116006 -135457 -98923 -109012 -256862 -253188 -26229 15154 60202
21622 60202 229831 -2560 -221793 -257451 -392042 -361863 -366359 -314897 -290370 -301164 -352355
21611 -352355 -360394 -384167 -234644 -77123 -116784 -343457 -506418 -245237 143156 205705
21601 205705 287373 388170 154442 -141402 -470912 -373104 -221443 44051 -63117 -373116
21591 -373116 -323076 40736 87745 46554 -132609 -209293 -235790 -369283 -251512 -31649
21581 -31649 51833 43474 -190632 -308233 -382919 -226902 -50278 19560 -96220 -334370 -408809
21570 -408809 -533496 -557730 -481612 -197754 -54520 41968 161417 219078 90322 -72192
21560 -72192 -13172 -56236 -125231 -32580 166854 166952 189019 331056 441316 350036 210699
21549 210699 34112 -218552 -79703 137531 75106 -312649 -286186 -214872 -281987 -190790
21539 -190790 -105184 -164007 -217300 -70436 -128291 -110755 62466 22407 -71828 -225420 -280542
21528 -280542 -388201 -543184 -432744 -452156 -290159 -166578 -327963 -336475 -355261 -553152
21518 -553152 -544747 -450415 -208668 -184531 -364386 -250005 -86030 86517 -17228 -304140
21508 -304140 -280466 -149534 -134274 -96654 85151 106555 -209291 -351091 -155941 -190266
21498 -190266 -214548 -254171 -243107 -65082 97826 -36114 104918 200609 -1569 -173369
21488 -173369 -94807 120570 147869 -166199 -411292 -409612 -198623 -115810 10785 95805 177651
21477 177651 251890 68316 -134182 -100529 -186195 -334929 -88738 -60061 -73344 -72541 -323926
21466 -323926 -292248 -95559 -216140 -330458 -277254 -221871 -72840 -178889 -176596 -378751
21456 -378751 -411900 -387221 -371936 -231226 -120012 -229050 -376080 -341142 -120165 -76233
21446 -76233 -242342 -197627 -143740 -12802 75578 -103550 -170897 -91375 -104494 13215 -1243
21435 -1243 89651 143581 -117660 -337285 -213434 -158310 -374488 -341108 -179933 -89415 82348
21424 82348 182652 270071 390371 328108 86194 -51581 -102781 -82144 15530 -58518 -273080
21413 -273080 -318814 -278017 11168 135752 70540 6911 11771 18352 -115677 -102152 38046
21402 38046 101049 -36144 -8921 6325 138046 206941 66738 62560 -51596 -144203 116379
21391 116379 363546 320764 306065 300879 177052 92044 39634 -125991 -62125 -21882 108191
21380 108191 100365 44951 110018 196336 114125 148295 178923 127089 162739 63308 -39924
21369 -39924 -30395 52130 195392 84501 72830 213972 93920 -19770 148906 97389 80995
21358 80995 28476 57869 75728 81464 -49756 -64492 -47055 -123017 -181259 23012 138969
21347 138969 247784 285834 172274 85999 74871 16649 -175961 -27850 -80447 -96609 185057
21336 185057 174045 -224223 -128278 16519 14915 57817 273534 248058 367493 153487 -29398
21325 -29398 -138221 -102792 310161 112700 141421 429931 411715 447261 250865 150958 259797
21314 259797 597853 508313 193489 -27941 15870 66436 69805 -168389 -72477 -43502 -64222
21303 -64222 -42041 -14213 142129 -47150 -324102 -195148 -259813 -177392 -124770 -281035 -330897
21292 -330897 -246826 -153611 -83040 -196301 -180318 -165895 -149318 -25128 284756 88609 10832
21281 10832 -210998 -152739 -59214 87281 -75613 -130907 -52829 -53496 -96451 -18481 45737
21270 45737 62158 138425 93170 10859 -92349 9012 152775 67225 -34055 81040 29974
21259 29974 2342 -100121 -230858 -386269 -433895 -213343 -85308 -116406 -97153 -80432 -129245
21248 -129245 -305323 -397344 -247231 -165893 -386025 -489187 -584865 -465611 -466227 -516089 -373138
21237 -373138 -521409 -577509 -663187 -596771 -454858 -440710 -336581 -404059 -389755 -469907 -410920
21226 -410920 -566518 -600721 -305203 -84586 -125407 -252610 -136270 -113941 -6019 109212
21216 109212 74754 168747 -7743 -296596 -455960 -461001 -234618 -38636 36878 25047 -46237
21205 -46237 -60399 88627 100462 116929 90338 -66875 -14959 6391 64275 215984 -6940
21194 -6940 -176771 -67123 -4010 -123250 -280582 -109764 83188 20169 33134 105958 31222
21183 31222 78314 167894 222941 71839 -117464 -27217 -59237 -198540 -53971 -54926 65362
21172 65362 323730 498838 384290 208165 -138311 -267333 -275253 -165268 -25274 134001
21162 134001 161974 187056 127719 5898 -43514 47663 -226855 -203688 26140 -150685 -454128
21151 -454128 -531257 -510476 -523040 -298899 -216330 -112954 31556 221309 178688 243241 102523
21140 102523 -217919 -194068 1300 176756 151676 -13358 -128501 -76946 -234789 -350917
21130 -350917 -230944 -59420 -102825 -178861 -473879 -502222 -210820 -44851 -45527 -1602 25121
21119 25121 -25702 109895 32911 -43312 -14135 122396 365694 420785 313516 293492 62906
21108 62906 -96345 -94152 -85172 -190697 -263637 -230086 -17703 84520 -34911 -321910 -580073
21097 -580073 -588810 -367679 -87501 -11217 64210 78171 139015 296311 381493 179621 150958
21086 150958 106331 -25335 12851 -78100 -386879 -458475 -259159 -56797 -2202 -59592 -263649
21075 -263649 -320245 -192672 -256655 -286481 -396720 -263900 -130876 117992 452731 429907
21065 429907 319171 311423 106926 230122 351211 334301 112943 81100 129844 230583
21055 230583 -119156 -249930 -26923 -44571 -271234 -537184 -473494 -355015 -174121 10888
21045 10888 -3330 23854 38619 1329 -107028 -360261 -488695 -391998 -222503 -30177 -74703
21034 -74703 55407 120039 -18218 -56309 80115 246668 162007 123445 263599 227374 24139
21023 24139 110250 38521 -92873 -68316 -158781 -239121 -214366 -155394 -349250 -427310 -239696
21012 -239696 -199937 -280720 -93855 -266021 -205177 -119466 -175062 -239227 -418220 -667763 -483603
21001 -483603 12524 19059 85560 -164480 -354823 -301777 -315615 -320402 -285397 -109381 -8159
20990 -8159 -51699 -96220 -86101 -87609 -167300 -150423 -230754 -315390 -427181 -276765 -40213
20979 -40213 -77407 -49262 -73163 -107331 -347788 -510607 -443259 -353947 -233086 1124 -96027
20968 -96027 -202676 -153474 -173141 -170578 -9995 61286 -93863 -45155 259045 449844 490800
20957 490800 474361 395341 68081 44115 307220 341047 227150 245503 554738 422541
20947 422541 8918 40862 135629 129640 40083 4123 -48424 99137 240563 93128 -201387
20936 -201387 -142838 7930 170572 157276 168521 31375 -96023 -254658 -519401 -446410
20926 -446410 -283185 -204241 -2277 108025 -28910 99464 52336 -243830 -306390 -486942
20916 -486942 -430307 -248527 -25424 110100 205087 179198 242666 19457 -187133 -248073
20906 -248073 112493 316877 214270 95507 -206957 -110552 18887 -85564 -346017 -514898
20896 -514898 -553012 -585046 -488034 -426370 -277499 -230350 -77439 16598 -17697 190935 11676
20885 11676 -646 167639 217681 253852 338046 178268 127496 108417 -76688 -98890 196724
20874 196724 171010 -155368 -308876 -210940 -106669 -107275 -63067 -80891 7382 -112639 97075
20863 97075 117849 103372 173995 -134051 26457 5220 -129186 113801 141663 -134042 -564934
20852 -564934 -675412 -406594 -208895 -341177 -373342 -429324 -519393 -331873 -217569 -34133
20842 -34133 100102 67436 -119173 -120947 -125744 -117018 -142104 -256773 -180128 -156863 -56570
20831 -56570 -190949 -142610 5640 78181 20926 -69085 -250825 -317961 -380358 -223234 154353
20820 154353 270958 290999 -49731 19548 332669 242442 183963 157850 284935 79309
20810 79309 -165450 -92528 -34691 141943 289894 276843 43291 11729 -41453 -293427 -190460
20799 -190460 33764 298293 277576 223631 194095 -49083 -269507 -317175 -415508 -381678 -216259
20788 -216259 131537 64228 256532 320956 181085 -209768 -203712 110235 -43111 -168217
20778 -168217 77717 35085 -35465 -85302 -123605 -353399 -511183 -274158 -197968 -105339 154553
20767 154553 159110 314533 452293 460788 284134 217802 -39518 41535 -126475 -172512 -230856
20756 -230856 -312129 -246132 -50919 137871 -2655 -25882 -49599 -42260 89391 37530 -71878
20745 -71878 -64859 -269282 -246257 -43241 -312038 -443995 -424977 -417393 -284483 -47639 -27430
20734 -27430 -234398 -258305 -152297 245573 198581 3268 -83042 -19024 189139 67339
20724 67339 -81346 -105792 -3024 2971 -138031 4410 238606 379067 309990 407692 298590
20713 298590 268875 302657 132067 -100709 -204668 -194558 -102271 -60042 38715 98670 193002
20702 193002 314900 395808 331896 207391 332673 197419 155987 150512 -16191 -113164 -14065
20691 -14065 -196514 -170629 -58322 4292 -13510 -53200 -98431 217411 197220 136530 38451
20680 38451 -19336 -108207 15341 -35123 14300 35207 218715 539541 577703 415585 -72440
20669 -72440 -147629 -192059 -40485 44926 11785 26391 210778 331149 125694 98062 221577
20658 221577 216598 324189 520613 462109 446963 576800 510221 576811 266870 268117 487489
20647 487489 545734 414367 432984 261471 381325 665716 780198 1101866 1586490 1734570
20637 1734570 1746336 1704516 1750231 1688079 1577603 1450844 1372710 1538259 1185353 973401
20627 973401 888350 850846 984483 1067612 1126010 1007976 791128 851132 741671 701076 810028
20616 810028 835004 758151 930593 1040035 1049152 1171033 1112224 1201713 1257869 1203575 1018031
20605 1018031 1138686 1255916 1268238 1402324 1707943 1777273 1834563 1839861 1896553 1649963
20595 1649963 1587503 1605043 1381291 1239291 1059159 898608 652587 408064 482845 446356
20585 446356 667528 879157 726209 570350 407570 334911 282063 63841 59445 314190
20575 314190 271389 62446 -121505 -17781 54108 24231 -154049 -51157 121761 298888
20565 298888 388839 268015 227709 268021 182725 36755 -90139 -260344 -164437 -2502
20555 -2502 -30206 37760 160578 414965 297944 -11249 -224929 -68778 206839 384939
20545 384939 508004 749446 970886 849335 676359 323270 83252 -31046 -183321 -166184
20535 -166184 -168981 -10987 127458 271666 242371 91662 43770 146678 279665 295385
20525 295385 295152 84805 -73260 52921 49565 314502 646533 452087 355324 479946 528903
20514 528903 365988 383873 389389 443799 350439 -6237 -114120 5865 266779 305324 87867
20503 87867 59067 282247 529043 461845 334231 352445 274848 240906 27753 17672 328977
20492 328977 564907 442153 377200 361885 296395 159035 64257 -77642 51156 67982
20482 67982 225709 519710 714872 630776 578890 432257 345100 329726 411985 385865 216795
20471 216795 134508 304786 210731 179611 228576 162685 273979 284249 200697 159281 244550
20460 244550 272278 264329 248341 318130 321779 327037 367632 395081 183122 87771 137128 322935
20448 322935 377691 420809 455543 429350 221497 95344 174523 379391 241548 227962 178680
20437 178680 269707 228875 64443 -148900 -59529 166761 286287 199154 -74621 -324515
20427 -324515 -346836 -1124 23485 207969 289166 129633 20578 258762 357632 291836
20417 291836 388536 195661 8767 136594 -12249 69567 225241 221843 38657 71387
20407 71387 167383 208110 247798 371744 378796 267136 84342 5060 112050 135740 124336
20396 124336 72074 -60918 -188477 -205775 103160 361664 289034 299782 285255 285256 480820
20385 480820 471449 302984 362587 405223 230619 62375 -99379 -142173 45716 -85458
20375 -85458 -75679 203529 62350 -99934 -126292 -87589 87513 97570 367857 653442 580969
20364 580969 370086 171140 219151 238657 341983 406558 397875 276937 365337 572379 724414
20353 724414 769742 619534 461727 270694 341997 408490 334782 317490 258370 296072 139121
20342 139121 348310 447845 258789 281222 352401 398057 613475 735278 564415 495385
20332 495385 567120 479442 283628 254676 184055 330965 389876 53903 188570 338036
20322 338036 473233 366929 189265 146621 71729 128311 245372 307406 251287 417517
20312 417517 536340 589379 384795 392596 378581 398080 595957 620387 743230 829500 610854
20301 610854 395649 526987 626166 427515 461399 558355 593659 535351 464486 487719 477301
20290 477301 493720 253488 166104 471463 498374 367741 361488 567401 695280 757024 727036
20279 727036 723738 808562 780381 696875 497769 365899 456248 662917 497456 554568 470214
20268 470214 432184 272076 188008 155279 232417 383015 666313 843111 582866 573905 648659
20257 648659 489472 647562 651058 600202 846319 932741 1121675 944017 775935 709418
20247 709418 604422 793196 975420 971902 1000989 781647 834593 824931 844871 1150088 1311702
20236 1311702 1193810 1479227 1525190 1428025 1282834 1292038 1358523 1483039 1474857 1551972 1655474
20225 1655474 1695208 1747200 1960716 2124326 2085539 2062809 2126488 2180137 2239844 2216827 2240303
20214 2240303 2140302 2182838 2253598 2169288 2275983 2546431 2548593 2461422 2521002 2382582 2453900
20203 2453900 2377961 2279068 2246095 2328740 2558236 2504862 2599182 2521888 2335032 2299159 2282481
20192 2282481 2264126 2585143 2574637 2421697 2443289 2258488 2218640 2158474 2373892 2702871
20182 2702871 2907148 2994334 2851598 2665721 2718409 2917765 2931526 2864279 2855363 2667800
20172 2667800 2629550 2750693 2895925 2925013 2720141 2313469 2499894 2917928 2952061 2905857
20162 2905857 2951226 3041867 3162439 3220226 3078208 3007783 2970496 2892265 3144094 3277483
20152 3277483 3080379 2840500 2751469 2878131 3174394 3381162 3439784 3371691 3552006 3581469
20142 3581469 3606784 3830369 4072394 4256352 4566915 4529029 4753340 5304588 5494432 5572168
20132 5572168 5788564 5998989 5984624 6253736 6383025 6672588 7105186 7427157 7824311 8150350
20122 8150350 8566689 9111044 9698180 10465465 11159966 11794507 12479629 13276167 13986599
20113 13986599 14667274 15430157 16186191 17249004 18097340 19108287 20382886 21667220 23024081
20104 23024081 24224821 25522494 26912035 28397428 30255184 32544116 34962759 37818805
20096 37818805 41165176 44866114 49573580 55280276 61751566 69803463 79516895 91087214
20088 91087214 104979652 121826805 141471077 164080112 189313623 216804492 244696781
20081 244696781 270516643 290909421 303755591 309478727 309432682 303070336 290269350 273617307
20073 273617307 258429622 248171496 243313143 241277362 239007555 234772943 227646217 216308192
20065 216308192 200193808 181267483 162771100 147486557 136577977 130011897 126964829
20058 126964829 126892404 130143349 136582331 146303522 159518950 176017658 194933086 214137583
20050 214137583 231891062 247142007 259512399 268713252 274577391 277698750 280798919
20043 280798919 287341920 298593461 312442984 324962392 334204333 339287160 337441758
20036 337441758 325360382 301887699 270749906 237735531 206878834 179409892 155279237
20029 155279237 134617490 117663531 104220596 93638545 85072995 78130477 72831321
20022 72831321 68664071 64821426 61358937 58421144 56090927 54049851 52297582 50701596
20014 50701596 49305158 48153525 46864468 45612504 44633235 43520162 42282202 41158486
20006 41158486 40060473 39146930 38406688 37651458 36843693 36423541 35814193 35103773 34436732
19997 34436732 33552613 32921337 32293758 31589778 30906305 30392377 29469234 28372109 27799026
19988 27799026 27332391 26921404 26401729 25744995 25324648 24943990 24615481 23898726 23502898
19979 23502898 23333714 22906104 22302465 22040962 21724686 21535692 21478160 21292747 21133853
19970 21133853 20743635 20540693 20216325 19831100 19629154 19641305 19409411 19296120 19269190 19356701
19960 19356701 18971265 18535341 18336547 18030387 17766095 17455691 16960810 16539901 16167633
19951 16167633 15768187 15369443 15101038 14830058 14384942 13942938 13531139 13045208 12694545
19942 12694545 12144761 11875207 11484197 10932392 10709250 10739028 10589418 10384265 10013807
19933 10013807 9636223 9480820 9362060 8939683 8727781 8540693 8269757 8102678 7939905
19924 7939905 7932872 7829510 7420419 7075253 6946535 6884994 6643888 6413631 6416307 6211841
19914 6211841 6035212 5866693 5542289 5088026 4873506 4818360 4709590 4670985 4628621 4422321
19904 4422321 4072819 3850708 3986101 3833289 3448719 3304018 3378675 3306294 3258526 3096806
19894 3096806 3054007 2845935 2661586 2506279 2706304 2507130 2231695 2206181 2374005 2220893
19884 2220893 2036755 1970015 1844610 1641592 1353695 1478619 1347638 1217576 1268171 1246156
19874 1246156 1373462 1375423 1484392 1660602 1763029 1699047 1356726 1351795 1384980 1232003
19864 1232003 1211998 1210690 1109771 1351686 1487860 1586571 1439801 1408038 1489110 1524005 1603582
19853 1603582 1468504 1525494 1748272 1725618 1743873 1653951 1738905 1825186 1862195 2091704 2224687
19842 2224687 2297641 2051350 1959503 1634589 1370693 1679636 1866608 1702747 1384334 1594243
19832 1594243 1799043 1857632 1696553 1516219 1639811 1769724 2034975 2088960 2103390 2017564
19822 2017564 1793585 1471769 1340605 1331288 1478965 1651390 1589673 1741273 2015057 2019977
19812 2019977 1852133 2032881 2121131 2028880 1758066 1780754 2011744 2064481 2068582 1958664
19802 1958664 1825473 1938437 2262939 2355699 2314196 2060873 2065658 2185734 2214772 2171458
19792 2171458 2199923 2116345 2273238 2439146 2334093 2147263 2234074 2134126 2004883 1961911
19782 1961911 2055976 2361599 2440737 2474476 2508014 2335730 2471992 2677046 2777370 2889424
19772 2889424 2803622 2534720 2508488 2554253 2719076 2925629 3027202 2991898 2857848 2354980
19762 2354980 2091604 1882483 1710292 1583367 1675132 1778815 1592409 1644693 1468379 1312110
19752 1312110 1416175 1385921 1290036 1316367 1075929 1016228 1084107 1132488 875401 818480 921739
19741 921739 1096468 1055181 1288292 1410846 1619315 1706592 1672867 1852212 2276828 2408034
19731 2408034 2377175 2399205 2183711 2226722 2292804 2417519 2362392 2296138 2076234 2090373 2185720
19720 2185720 1918725 1695169 1535017 1427957 1348307 1276375 1194467 1261584 1278883 1491190
19710 1491190 1449707 1252130 1227766 1189507 1095724 1154863 1003011 870533 620062 509120
19700 509120 650949 978640 1244001 1149216 941840 871813 1066525 1409981 1431403 1275027
19690 1275027 1035834 848613 903177 1096667 994658 1066279 1023829 733441 564678 836099
19680 836099 1010591 864845 734282 569014 529581 780562 1046413 923288 764647 738957
19670 738957 866952 1033623 1027271 1005642 1034523 892325 1023366 1280065 1242330 1188494 1164984
19659 1164984 1177191 1146899 1124566 968067 977828 919981 1046701 1206322 1270309 1211534 1152134
19648 1152134 897074 995255 1111255 999266 856684 666820 660404 867565 720310 445268
19638 445268 404936 653693 653651 728716 786864 1007317 1022173 779788 691706 748916 600419
19627 600419 607632 846092 1038792 1180860 1185270 1212247 1180325 1040949 949699 1062736 1210326
19616 1210326 974950 731107 680129 594979 529792 406672 382912 669519 663545 459278
19606 459278 523727 627145 555773 460925 436537 651887 640960 520257 532916 542065 812747
19595 812747 787678 695834 617780 551089 453434 360896 562890 808647 938899 925859 724817
19584 724817 352988 82272 -31029 -184706 -138634 60584 132508 566995 707392 583182
19574 583182 692128 703802 783648 958182 922693 960658 891285 602390 376059 542733
19564 542733 723611 732735 497570 547996 755435 824795 883836 802339 853276 832143 720807
19553 720807 783831 709267 384605 557892 556138 674813 756171 821934 806099 697394 664643
19542 664643 966549 1123770 1115331 1077035 1104718 1096083 1301762 1369636 1547772 1570055 1401243
19531 1401243 1298491 1533325 1587955 1554883 1646035 1819498 1895860 1946210 2119396 2312311
19521 2312311 2479212 2617401 2822089 3176567 3315029 3317018 3316787 3511757 3600293 3402025
19511 3402025 3059851 3308610 3560559 3521527 3466168 3255772 3186253 3337167 3285189 3090953
19501 3090953 2883780 2701365 2538557 2534986 2542288 2601526 2588230 2488337 2650527 2738732 2798054
19490 2798054 2785216 2807760 3154382 3246996 3256619 3170688 3096547 3252219 3466016 3465160 3353878
19479 3353878 3330234 3492957 3891090 3959898 3748400 3821181 3851682 3974355 4081373 3809438
19469 3809438 3794739 3704285 3312851 3005676 3087525 3091648 2771902 2665835 2589637 2340077
19459 2340077 2147144 2088387 2111084 1917990 1689130 1463469 1493206 1851875 1942367 2040043
19449 2040043 1991713 1781372 1822931 1748366 1691928 1721687 1936427 1991143 1976805 1879992 2052271
19438 2052271 1917846 1680412 1723809 1905147 2004875 1940313 1860991 1964516 1985320 2019666
19428 2019666 2286823 2191827 1882323 1963341 2084364 1952950 1898129 2011579 2080035 2146658
19418 2146658 2120669 2152820 2192016 2280157 2199058 2227634 2401288 2569452 2608158 2572515 2910920
19407 2910920 2941973 2819223 2590140 2391265 2406740 2535537 2444898 2416971 2358936 2522052
19397 2522052 2688873 2793076 2911771 2772610 2841827 2927785 2988773 3018684 2820591 2544642
19387 2544642 2593251 2494603 2412726 2707711 2768482 2645136 2799629 2939265 3089625 2940550
19377 2940550 2641043 2578748 2698069 2715931 2922201 3058499 3108732 3047011 2754410 2995287
19367 2995287 3255148 3417003 3351381 3161568 3409647 3582535 3844536 3785954 3777396 3862652
19357 3862652 3797355 3630353 3719365 3679758 3618095 3653926 3821526 3743539 3688925 3319968 3314522
19346 3314522 3752835 4059116 4149534 4143825 3950727 3831635 3916861 3842549 4032038 4233892
19336 4233892 4168102 4314956 4391634 4468238 4408246 4373648 4436055 4714238 4767834 4934134 5071835
19325 5071835 5127581 5381486 5389987 5346471 5467182 5766573 6117338 6324807 6451631 6593500
19315 6593500 6906064 7518929 7889845 8190175 8433430 8790640 9065538 9397583 9688274
19306 9688274 10197758 10740526 11476494 12386456 13267212 14289323 15426386 16721215 18023768
19297 18023768 19797133 21529736 23231597 25624114 28368202 31342215 34343690 37634983
19289 37634983 40743296 43609615 46404782 48931813 51546343 55103374 59631083 65332382
19281 65332382 72845612 82739926 95721212 111967906 131071133 151592448 171039520
19274 171039520 188693835 205383826 220805275 232505390 239432239 243977407 249093170
19267 249093170 255630004 260541428 261408451 259953777 257081939 249826351 234548471 214105958
19259 214105958 195921501 183817190 175776634 168617114 161182704 154268747 147792939 141302688
19251 141302688 132682331 120787166 108297487 97984660 90866768 86346455 83706516
19244 83706516 83003821 83954232 86332700 90106333 95409207 101637919 108030047 114468578
19236 114468578 120241600 125842943 131254093 135917412 140763475 146923089 156737046 171016767
19228 171016767 189793008 212571292 238328147 264610524 287420709 303419100 312526014
19221 312526014 315881117 312172120 299685734 281603260 264850958 254468228 251063488
19214 251063488 251943570 253357045 254063237 253636441 249451981 237193114 216334604 191423593
19206 191423593 167283535 145861734 126889268 110558816 97586508 87342412 79209113
19199 79209113 73152634 68475391 64389651 60774757 57556184 54932010 52761267 50662578
19191 50662578 48852871 46998140 45381069 44087737 42843577 41422856 40261236 38888366
19183 38888366 37698809 36490931 35503297 34646789 33827675 32849375 31883490 31015301 30530596
19174 30530596 30187211 29614934 28961388 28339712 27891237 27539618 26961502 26418854 26039952
19165 26039952 25480843 25162259 25141614 24869398 24611572 24511384 24246698 23897958 23695665
19156 23695665 23444614 23105281 22879599 22555609 22588503 22633934 22581166 22458037 22314589 22344646
19146 22344646 22194897 22019632 21886489 21928635 21753790 21523630 21005476 20771560 20660389
19137 20660389 20533217 20427133 20215882 19752156 19192247 18812572 18652660 18455612 18075746
19128 18075746 17601351 17535086 17215615 16891813 16727819 16387239 16036063 15626912 15342586
19119 15342586 14971854 14753106 14508476 14160401 13965121 13641307 13376399 12972807 12694303
19110 12694303 12414694 12193843 12095333 12080961 11980695 11753635 11639577 11429914 11549989 11357302
19100 11357302 10971820 10893744 10832480 10721867 10602586 10443040 10154449 9807876 9340692 9265450
19090 9265450 9119113 9152740 9017211 8739726 8405049 8231381 7947815 7724360 7565052 7610497
19080 7610497 7420057 7469650 7259918 6977310 6658549 6285382 6023967 5932845 6012461 6017651
19070 6017651 5837004 5762177 5867366 5714493 5694025 5770451 5811761 5815351 5890123 6128529 6203519
19059 6203519 6101924 5927835 5905805 5977710 6098093 5977351 5893443 5966365 6074824 6257816
19049 6257816 6479130 6345958 6376503 6524234 6562699 6770280 7092932 7303235 7447708 7460310
19039 7460310 7529601 7741875 7846777 8042587 8575666 8904484 9185463 9530943 9725855 9847390
19029 9847390 10350445 10971126 11510400 11959169 12411852 13072138 13455237 13781799 14375853
19020 14375853 15113426 16155291 17165486 18481194 19658451 20846466 22095345 23724474
19012 23724474 25374005 27003934 28908959 31539697 34523180 37757617 41051154 45043276
19004 45043276 50067122 55977383 62715068 70348994 79759124 91733270 106186961 123679707
18996 123679707 144311731 168134868 195453158 225893969 259091492 292090925 319253780
18989 319253780 336486379 344441685 346256200 341750484 327974192 305833814 283218983
18982 283218983 267739268 260947407 258938783 257393510 254777676 250098414 240988955 225127922
18974 225127922 203351831 180034085 159773461 144632816 134869383 129562495 127771980
18967 127771980 129021085 133347218 140876950 151754504 166667738 185180327 205441357
18960 205441357 224662278 240857216 253823967 264206424 271210856 273116757 271794943
18953 271794943 272674747 280210221 293920691 309601708 322576238 330996780 334969000 331177490
18945 331177490 314461815 285003639 249682952 216151985 187463962 162526983 140469319
18938 140469319 121823842 106890762 95120001 86171397 78999186 73203097 68376226
18931 68376226 64228167 60672164 57888058 55448675 52893128 50747850 48847441 47203842
18923 47203842 45497024 44187029 42979267 41807278 40569557 39503740 38870449 37807965
18915 37807965 36748080 36101161 35492754 34918815 34479926 34020128 33210029 32623421 32226233
18906 32226233 32017932 31706308 31357020 30743405 30262893 29845998 29394801 28902579 28564009
18897 28564009 28047573 27585476 27151497 26674098 26116206 25299007 24940221 24821254 24603403
18888 24603403 24462436 24000957 23456325 23164140 23001275 22852869 22723439 22523805 22257523
18879 22257523 21916667 21748817 21546321 21403684 21230380 21130101 20821476 20867081 20895259 20612275
18869 20612275 20103254 20078227 19999841 19562120 19280012 18927968 18591256 18244703 17769455 17309848
18859 17309848 16997910 16823500 16505460 16034701 15606928 15313324 14866307 14223501 13952741
18850 13952741 13607784 13179822 13032724 12778776 12382463 11999940 11667262 11438552 11332394
18841 11332394 11040380 10710151 10466886 10377839 10375029 10157505 10021298 9913117 9597612 9300509
18831 9300509 9092027 8978208 8936523 9150257 9184420 9127205 8852699 8490458 8338854 8103550
18821 8103550 7898268 7798373 7805026 7687918 7378657 7479548 7360675 7262199 7225277 6871581
18811 6871581 6775424 6810494 6723459 6530981 6470592 6653669 6671366 6533898 6638811 6697915
18801 6697915 6802820 7033257 7238020 7047103 7076049 7272187 7439132 7777580 7937331 7985279
18791 7985279 8208514 8466627 9009200 9706336 10493153 11281530 12048078 13196873 14977030
18782 14977030 16758615 18455607 20395533 22072599 23616935 25245628 26821802 28260720
18774 28260720 29756703 31664535 33827405 35867381 37733297 39045067 39738981 39854416
18766 39854416 38790043 36652006 34511220 33332113 32943871 32735597 32118552 31711350 31323173
18757 31323173 30486412 28620074 26360856 24504034 23748995 23687396 24073258 25203254 27019980
18748 27019980 28997598 31060147 32938304 34264073 35443010 36467763 36964391 36366842
18740 36366842 35228132 34292307 34322838 35191330 36842436 39235855 42409256 46730110 52137886
18731 52137886 58480479 65894194 74949920 85964068 98416512 111605372 123579928
18724 123579928 133276497 139944288 143284503 142671753 136802229 126273736 112867280 99028338
18716 99028338 86135346 75702818 68034217 63394057 60858514 60120262 60593020 62277360
18708 62277360 63940242 64879771 65199512 65627965 65246678 63354665 60071338 56496757 54320389
18699 54320389 53568397 53993937 55359815 57734029 61340849 66814029 74160403 83051947
18691 83051947 92881439 101918046 109508300 115700891 121171149 125780941 128243093 129643895
18683 129643895 132920914 139852030 149084213 157256005 162656204 165770522 166958043 164037898
18675 164037898 154461529 140731888 128252988 120284516 116267333 114645964 113477554 112089569
18667 112089569 110917352 108905381 104726665 98436725 92429117 88646206 87568865 88517295
18659 88517295 90942481 94135584 97878361 102165136 107119772 113193637 120092539 129106255
18651 129106255 141670583 157654778 176411636 195830668 215408936 236222609 257321831
18644 257321831 274167282 282040813 280947166 275366584 268172144 257488275 240282294
18637 240282294 218039784 196795170 180705061 169248480 160699690 152738144 145040342
18630 145040342 136361314 125812467 114033623 103015001 94372873 87917692 83535907
18623 83535907 80673793 78977332 77954737 77656949 78192859 79545269 81821523 85071010
18615 85071010 89714937 96108187 104512512 115020975 127019308 139991468 152547971
18608 152547971 164414533 175820358 185945864 192487821 195384097 197929173 202918351
18601 202918351 211142271 222983364 238149597 255473380 272001027 286122645 297837365
18594 297837365 305757318 305261358 292283261 269925708 245921001 224350875 203795710
18587 203795710 182278861 161411836 144367291 131931886 122923139 116044283 110185503
18580 110185503 104625899 99093842 93642659 88273964 82988482 78152997 74004542 71045087
18572 71045087 69043326 67873637 67485681 67936817 69062237 70880052 73225575 75854673
18564 75854673 78138013 79870196 81675807 83241647 84198749 84935209 86437884 89819257
18556 89819257 95283243 101576364 107722858 112756785 116260161 117586837 115992356 111503288
18548 111503288 104951114 97269512 90125993 85208972 83073785 82574284 82865165 82782848
18540 82782848 82074773 80398084 77039085 71452096 64820567 57858682 51535409 46378327
18532 46378327 42613361 39731352 37646093 35975027 34617196 33448441 32238219 30928441
18524 30928441 29971334 29023290 28261592 27882711 27555962 27069346 26284781 25670054 25152580
18515 25152580 24709776 24425346 23939813 23416222 22715800 22150500 21743283 21271018 20653094
18506 20653094 20143479 19590472 19035349 18646613 17939130 17594514 17376340 17053203 16431847
18497 16431847 15830293 15449397 15329433 15052215 14426157 13924195 13736854 13603125 13359988
18488 13359988 13046483 12673636 12568032 12445953 12209284 12243686 12138510 12062661 11946196 11759989
18478 11759989 11478109 11316640 11273364 11175150 11182594 11260450 11131208 11014767 11265708 11343841
18468 11343841 11278134 10991931 10635904 10469175 10453495 10400685 10288923 10071973 9902642 9685867
18458 9685867 9367649 8992305 8681582 8383031 8005734 7747234 7664990 7818042 7555644 7354964
18448 7354964 7098699 7246467 7257455 7034224 6867719 6742136 6704328 6380977 5976563 5729997
18438 5729997 5871458 5814653 5576576 5381739 5364339 5458895 5480722 5390416 5420629 5395892 5469130
18427 5469130 5274007 5222564 5333278 5256434 5261449 5091511 4826210 4829391 4775193 4638245 4551350
18416 4551350 4706926 4955481 4759853 4685555 4532028 4834092 4809923 4486596 4165910 3761137
18406 3761137 3751464 3803876 3759244 3493215 3654887 3598729 3452318 3569253 3491606 3402138 3322989
18395 3322989 3119234 3127789 2904096 2766407 2688632 2810617 2796612 2701912 2633994 2703272 2664796
18384 2664796 2845155 2831517 2713987 2570872 2306233 2282007 2414036 2588728 2814713 2857445
18374 2857445 2983342 2907473 2768934 2614498 2712089 2778468 2540876 2617735 2731623 2578080
18364 2578080 2615142 2638944 2640093 2306925 2149656 2244664 2413329 2166207 1989321 1866125
18354 1866125 1900105 2058127 2128021 2157235 2186752 2131323 2064261 2060089 2146995 2261011 2020476
18343 2020476 1790921 2092129 2194906 1880546 1723234 1649404 1772215 2117515 2312669 2086080
18333 2086080 1820213 1639795 1682640 1694933 1685333 1782547 1780456 1943627 2134011 1890639 1871583
18322 1871583 1779631 1577577 1842174 1977424 2025891 1775262 1769694 1724770 1542933 1640904
18312 1640904 1709487 1707228 1686466 1585521 1344240 825587 796844 1026039 1294302 1543060
18302 1543060 1606387 1491889 1248011 1150399 1246531 1317799 1226656 1410425 1886052 1794112
18292 1794112 1582223 1389975 1301294 1240064 1304221 1248064 1016060 1198928 1395261 1518660
18282 1518660 1422776 1550553 1513432 1107094 781659 811336 831675 885160 948241 1150722
18272 1150722 1284946 947302 765739 979204 999762 1051582 1281197 1366426 1311379 1404737
18262 1404737 1325044 1248553 1128426 1072835 1115174 1184303 1246415 1294214 1342147 1339616 1250097
18251 1250097 1147133 1178328 1179343 1654558 1764905 1749064 1739451 1449758 1448351 1515495 1389888
18240 1389888 1333020 1172646 943749 919776 1094644 1107123 1100108 871570 485140 567410
18230 567410 979202 1117008 1119073 1149693 1023903 1150356 1068686 869643 920491 830981 603187
18219 603187 612472 902022 1001224 1036617 1122238 1076789 1041497 1055953 1162060 1361267 1418080
18208 1418080 1393077 1416642 1483057 1495816 1610824 1697099 1603142 1704848 1715794 1641300 1702927
18197 1702927 1646287 1766310 1692866 1500788 1465034 1713223 1738068 1604012 1432593 1162963
18187 1162963 985596 865655 1082676 1113282 894728 864628 794326 946260 1117799 1066513
18177 1066513 972236 942385 898321 1019201 964822 754691 718913 896304 1179843 1017639
18167 1017639 1029973 1039461 741995 694583 776729 668280 818257 1036384 1046899 1085200 1069213
18156 1069213 963503 884524 1021446 1155964 1037170 1068224 1321751 1415405 1402526 1378038
18146 1378038 1307041 1197423 1058271 965609 1201062 1412902 1173096 882299 976473 1156075
18136 1156075 1310124 1567109 1696062 1730757 1538491 1536263 1606026 1592780 1602125 1481363 1243496
18125 1243496 1094696 941911 769271 901973 841971 772423 870766 1035002 1059012 1096546
18115 1096546 1283928 1360467 1411140 1286845 1280547 1187802 1083646 870449 791660 953042
18105 953042 936489 1115435 1420620 1193085 1035881 1098029 1237658 1348430 1470133 1582720
18095 1582720 1518187 1475639 1420769 1309444 1319202 1322771 1669855 2043006 2113423 1844714 1689246
18084 1689246 1784995 2147787 1972586 1763369 1732392 1573640 1373959 1301793 1262703 1241747
18074 1241747 1248182 1249576 1102020 1031363 962689 966122 1068430 1147009 969954 879621 540528
18063 540528 678497 910731 860194 1063277 1031999 747076 667198 647027 646899 886123 1078562
18052 1078562 968744 814649 816252 855663 770895 793317 732121 683698 641607 620700 651008
18041 651008 585010 816140 1159954 1140124 1081771 1024093 966600 1091226 1077025 1200818 1264055
18030 1264055 1239742 1372358 1483467 1542118 1538210 1465955 1142834 681984 210481 331695
18020 331695 576515 622990 612452 533850 376906 206106 129645 141073 341560 422578 328335
18009 328335 390742 583398 556002 397943 459204 495752 429322 217001 276814 679721 805768
17998 805768 498706 574562 598417 488481 281354 61073 209922 379771 392922 299615
17988 299615 283368 290186 195392 315728 536000 517094 524226 380743 398123 351632 224680
17977 224680 328300 656900 690335 486772 339245 497451 520216 361066 305873 507778
17967 507778 785391 557130 321131 356072 412085 666043 934140 766599 399079 89629
17957 89629 189923 15433 -109186 116427 432462 692822 689410 614286 437869 161219
17947 161219 200248 150468 193820 318991 397987 418732 417760 325651 131941 99143 249833
17936 249833 225530 141011 66707 -187979 -144587 -65100 89277 144884 282094 180481 111183
17925 111183 236593 272896 525702 391020 51423 -65247 -22100 196560 357499 324963
17915 324963 251617 233632 113692 -17837 163323 445070 381055 410965 339844 308280 279153
17904 279153 79890 211311 239654 222279 169872 44735 116046 385407 440534 249361
17894 249361 109250 177310 64998 -99522 -189110 -112579 110239 141558 80283 -29894
17884 -29894 -29893 137370 137456 354720 226965 6390 19363 98614 65178 68924 39806 -17192
17872 -17192 -65935 -151643 128637 230680 122248 177436 337122 470077 450983 380631 307736
17861 307736 569468 591057 240246 288381 390327 372721 361611 278451 395493 542189
17851 542189 383596 410378 399240 488270 388060 228645 254552 60627 -241565 -236167 -221091
17840 -221091 -283140 -329249 -247126 25343 77301 67463 127704 39020 -52073 124510 383384
17829 383384 402495 569395 788757 702637 733758 522487 358018 302441 255520 484645
17819 484645 499149 298500 187879 421809 361968 417644 357520 169220 282800 221780
17809 221780 88680 -1954 -8110 -5972 -15383 190813 283559 236467 162174 193059 170748 126387
17797 126387 197441 225257 183649 241661 44861 -77240 -27161 -26183 -78229 149365 195544
17786 195544 300051 258308 196396 158074 166528 2052 -139769 -108394 -49699 172175 107002
17775 107002 99002 139297 64250 -11817 22262 -149274 -136599 53159 63167 60579 4462
17764 4462 79621 234603 86474 147684 171872 282130 311321 130064 224074 471957 530504
17753 530504 421061 254513 41420 -169853 -375207 -73976 313143 385909 553030 604072
17743 604072 474269 422067 161197 154189 53030 198511 204925 23959 -199066 -146161 44583
17732 44583 113934 -34181 -3217 -119131 -246074 -254301 -118933 -182979 -346644 -213319 59857
17721 59857 110687 392628 503424 558263 310603 -55795 -63371 241714 170688 202312 401369
17710 401369 546883 407740 143775 -8666 36621 -59228 -121627 -122041 -115801 -66634 39407
17699 39407 29581 -200839 -159756 65650 60653 -72240 -70438 144035 122882 143747 404602
17688 404602 312940 115163 30470 -135159 8665 155353 34948 148346 109167 -35042
17678 -35042 -28686 121049 234563 322366 201128 -136137 -173800 -142418 72250 125103 249659
17667 249659 290009 156302 4439 89476 278299 164777 5552 141957 171174 175613
17657 175613 108144 247645 113245 61909 -181404 -351530 -57925 82716 281713 165189
17647 165189 125771 102001 244696 274212 124810 148219 334591 469581 392051 280254
17637 280254 195694 137650 215639 152537 152114 382974 471401 218061 78250 -17182 36172
17626 36172 300936 461735 333602 199189 2571 -322044 -149464 138128 163838 126901
17616 126901 -57315 -68028 63843 103414 155308 262109 219756 119404 -96312 -305567
17606 -305567 -189126 -22199 250346 376959 130093 -115639 1163 105789 206082 260053
17596 260053 175782 58425 218130 322013 434166 458680 313847 152881 -15985 221438
17586 221438 435846 338797 302798 210521 -59531 -244287 -228605 -300190 -195840 -13624
17576 -13624 202293 45293 -185751 -338722 -194972 -122930 -177078 -211340 -226538 -327330
17566 -327330 -383358 -290032 -185301 -3536 25774 -262682 -254220 -17072 229350 331452
17556 331452 129193 -11969 19835 43753 238574 292556 198682 122118 32739 15199 139002
17545 139002 287230 438403 318008 413666 581771 434796 220206 27799 -147398 -7008
17535 -7008 285432 461099 383558 162251 123443 408460 387719 435668 495559 542790 539993
17524 539993 329131 198772 108613 -43304 -33036 -199633 -347274 -325499 -201875 -69511
17514 -69511 -22864 -68922 -190312 -90735 -149840 -94669 61845 98047 36369 116512 285231
17503 285231 167021 9945 135412 370954 471073 459916 247520 -28056 -74029 -152659
17493 -152659 -208713 -101205 43259 173809 107002 -143442 -356924 -373154 -402528 -270294
17483 -270294 -163458 -9226 136434 70512 17735 68796 77238 135696 342643 341193 133856
17472 133856 -74126 -76436 -203734 -51447 234306 221335 271385 397360 553572 582943
17462 582943 551435 537278 492014 212178 -127802 -143528 -112160 16076 78731 16652 24609
17451 24609 105247 391025 573748 474810 253681 -48668 -95392 -110549 -84598 132359 -18781
17440 -18781 11367 116589 234434 240378 139480 -95548 -351956 -410432 -403417 -153093 63751
17429 63751 28409 105796 184833 56980 143039 126907 194646 242935 206271 163413 44609
17418 44609 -103533 -115628 76704 -79522 -71737 -191717 -158231 39506 108928 246871 181546
17407 181546 -227524 -207292 -96040 -229112 -162335 -105704 -245161 -224668 -70671 198434
17397 198434 242734 168678 301988 68180 -228043 -239164 -38436 41757 -71927 45851
17387 45851 185205 48703 148069 154033 42319 -208258 -242481 -160173 -289753 -236680 -114674
17376 -114674 -245463 -495898 -292991 -150287 49864 116549 94117 -73266 -61930 -123848
17366 -123848 -148188 -304446 -254944 -241886 -56213 106091 38406 88243 97002 56896 99629
17355 99629 167048 9427 -64347 -13832 63030 24478 227679 297493 157152 158186 382836
17344 382836 312644 17974 23670 285722 508251 347649 126258 72455 80880 87846 -69571
17333 -69571 -194977 -237276 -248142 -272647 -343661 -461687 -248119 -255907 -199436 -292549 -553296
17322 -553296 -369228 -413901 -413657 -322080 -273424 -398498 -349856 -251600 5689 207378 228860
17311 228860 289940 394977 313135 112468 69538 -72064 -217735 -135019 -20672 33199
17301 33199 97729 160597 -47168 -198741 -164843 -114605 -76825 99955 262051 255708 134843
17290 134843 203659 160296 13694 86556 127689 169309 190873 277325 304074 208775 -101546
17279 -101546 -163559 -123864 -115555 182305 319508 130185 554536 506624 111666 -102568
17269 -102568 113602 205677 301669 191837 126515 102404 39168 189558 554512 606240 751803
17258 751803 626669 423658 181793 236208 269542 235310 154333 -39714 -112565 -57774 192581
17247 192581 377366 414885 75371 40756 -122136 -239960 -264566 -348355 -296853 -70968
17237 -70968 -81432 -244589 -151690 8989 -85604 -191678 -232507 -277863 -67808 -112208 -178512
17226 -178512 18804 370322 215334 67959 395344 556778 358424 177121 -8209 138564
17216 138564 312077 464616 423489 392618 307750 44817 150664 -15622 167422 174712
17206 174712 223727 119616 100452 75363 56617 141087 96961 84935 -80283 59529 -25835
17195 -25835 -127497 -165768 -153527 7484 76216 -44969 -199488 -93745 -90361 -239740 -140617
17184 -140617 -18404 -69679 -286573 -77087 61535 170781 163501 -15397 -9741 120543
17174 120543 216045 204439 95423 -87179 -78446 -33619 -186731 -194442 -69242 -76221 2644
17163 2644 -12552 -165854 -192564 -92266 -21606 131481 278529 126959 40919 -12783 -58295
17152 -58295 -46517 112601 116024 199646 96541 20209 46437 -266506 -222939 -113711 -72264
17141 -72264 43064 188877 140687 -19346 -99958 -14112 221828 342352 214065 28430
17131 28430 -61280 -169823 -195434 -144272 -185187 -71547 -223116 -210482 -64552 -36938 -36175
17120 -36175 -138685 -85494 -92692 -256292 -90984 -150927 -228132 -168155 -171214 -390969 -244620
17109 -244620 -13195 -124043 -149291 -215464 -259253 -118337 -124429 -434341 -399089 -348962 -175791
17098 -175791 92165 292268 244381 74846 -100388 6096 -6424 -40440 175770 193082
17088 193082 -91537 -277067 -259831 -304797 -17730 54444 -65824 -95467 28203 -56212
17078 -56212 50550 60039 -103024 -226752 -491137 -444381 -450658 -347883 -343590 -261030 -113293
17067 -113293 -134502 -203433 16547 310771 528902 333474 49128 85869 -40573 -169025
17057 -169025 -61079 -23851 -177399 -413678 -277162 -105493 -114062 -72033 1336 23287 -27413
17046 -27413 -85008 -216065 -199516 -159240 -261376 -205359 -151536 52317 33784 70477 207141
17035 207141 444320 295465 123544 113263 215216 181017 14101 139138 284295 125698
17025 125698 88800 93454 158016 169462 274074 313444 218036 256409 43286 -136841 -11337
17014 -11337 133908 217166 214298 21004 -11472 102306 125530 55216 -17359 -124840 -49725
17003 -49725 76686 -11334 -157264 -226846 -268734 -222889 -240425 -86037 -4300 121994 117856
16992 117856 41162 52536 -53884 -166236 -237213 -238039 117034 176562 114789 -111668 -328800
16981 -328800 -368930 -227179 -184953 -186041 -155864 -172950 -167450 5 -52525 -56891 -99665 -143877
16969 -143877 -188840 -294857 -240748 15278 20574 51990 202402 211567 223088 13313 -247245
16958 -247245 -270955 -274790 -88697 107462 4402 -76332 -105310 1754 -124459 -247487
16948 -247487 -399007 -439151 -202006 -380655 -414387 -452704 -249859 -15488 -8105 -27749 200546
16937 200546 223841 52023 -43077 141221 92979 102990 253353 289019 122252 -37041
16927 -37041 -88488 63692 88697 12855 212078 184224 -100019 -106163 -17200 198837 121562
16916 121562 98329 148222 93656 -120880 -242766 -360549 -513579 -610336 -462119 -132676
16906 -132676 194302 283110 4398 -176326 -281548 -312177 -220651 -134639 -201018 -297017 -434646
16895 -434646 -521294 -354332 -159445 -241232 -381926 -293158 20603 -123185 -336343 -273130
16885 -273130 -117303 -35565 -90648 -59016 53899 233572 76244 -78706 19345 -92891
16875 -92891 -329181 -122597 44056 38059 32730 -5827 145305 129213 67525 -103359 -2144
16864 -2144 59603 21164 26437 -68757 35261 54716 34287 -5267 111762 264013 41433
16853 41433 -520581 -646174 -515626 -425846 -255320 -139980 83627 149173 99442 125431
16843 125431 141799 73606 -29455 -83592 -155165 -127710 81174 146827 63738 40001 141049
16832 141049 26506 -3982 164582 198556 32204 34573 242447 48267 -49916 -59478 -22854
16821 -22854 79013 46622 93932 237392 74001 -35054 -3657 119737 11753 -88891
16811 -88891 123856 224808 86563 133334 340725 249898 69792 -54256 170725 186474
16801 186474 171522 -13396 -193422 -185235 -212325 -251164 -363550 -113148 59280 69776 89609
16790 89609 212760 352205 290496 303625 218556 -36338 -112516 -163540 -170557 -20724 -165493
16779 -165493 -290729 -77662 28234 -67744 -143863 -176407 -183983 -300657 -285030 -250402 -84706
16768 -84706 23158 -70479 159104 10311 9875 -96334 -278126 -341910 -131470 -113554 -188287
16757 -188287 -154938 -209396 -174537 -244561 -177496 -154267 -177111 -83941 -181198 -191612 -207012
16746 -207012 -225330 -221586 -277210 -132960 34053 239916 242838 268529 298409 197598 355182
16735 355182 209011 -54260 -95095 -85393 -151132 -238283 -250609 -355524 -293365 -211193 -234285
16724 -234285 -142632 -45354 -56399 -151460 -147813 65708 175972 143434 -238641 -268516 145652
16713 145652 408547 260856 195249 58240 -2158 155687 171761 232970 75932 -147376
16703 -147376 -266993 -113557 79769 119543 49719 196328 188744 141382 166542 268448 157115
16692 157115 80649 -54035 -177186 83001 39230 117798 168143 49642 -3671 -97436 -225028
16681 -225028 -30461 18683 -192 6214 -73326 -141997 -440603 -330586 -85814 3791 -23850
16670 -23850 -286280 -317649 119190 196472 -11498 -160966 -53385 142266 384780 156913
16660 156913 -97636 7673 -66224 -205206 -67878 98071 5555 114026 72567 14652
16650 14652 -87788 -1161 87000 -68272 -82143 -172252 -190824 -102127 -97029 37761 304012
16639 304012 225996 47829 -61351 -49668 -89800 -143316 82053 188932 61675 41718
16629 41718 234898 334480 442244 345826 135625 29434 -121682 -122376 -57286 76903 89138
16618 89138 65730 59358 169512 79915 -1141 -289 -62152 -138554 -382603 -220407 185213
16607 185213 252474 25359 32219 154393 -130056 -322980 -166141 -261937 -246180 -192073 -158023
16596 -158023 -367236 -392778 -224875 -256894 -235430 169306 96222 -153041 1485 134337
16586 134337 95842 44253 -197254 -198270 -251351 -90592 -43390 -110051 -76004 26844 -167796
16575 -167796 -242489 -34850 58318 41553 -87914 -6124 268876 174470 148648 -168800 -211498
16564 -211498 -11943 56178 165085 133150 -29021 -111950 -430033 -343799 -160044 -115708
16554 -115708 -78663 92842 -168260 -314518 -401829 -321616 -210009 3028 17096 63869
16544 63869 274200 195290 33462 -106805 -6024 113136 102220 -63620 -310062 -132870
16534 -132870 -29901 -157873 -236201 -252116 -193132 -43134 -33763 -120640 -364353 -388873 -421674
16523 -421674 -421077 -252702 83133 144676 70608 -83188 -182071 -185871 3049 -11643 37107
16512 37107 45733 249425 348049 238828 182313 -15338 -5455 5883 -113659 -211541 -234447
16501 -234447 -281609 -327512 -296710 -188517 -161537 -210257 -281267 -310195 -334671 -255436 42487
16490 42487 -30226 -292992 -423561 -421369 -324663 -347170 -294313 -328051 -32816 -49984 -243646
16479 -243646 -20348 111636 168954 147707 127338 10810 -236200 -362316 -265504 -201114
16469 -201114 -173016 -89847 130010 184835 115907 262608 125389 3303 177877 -115452
16459 -115452 -309671 -184338 -346586 -625844 -477362 -407693 -394643 -407701 -218454 -174280
16449 -174280 -208789 -138403 -195363 -286787 -235608 116651 220380 56761 47677 -110523 -415413
16438 -415413 -207944 -81336 -51121 -54797 -133701 -301360 -174834 -41899 -32879 -138203 -9382
16427 -9382 -45190 -240957 -235266 3583 192567 289005 270766 58388 -104732 -122902 -5522
16416 -5522 125565 -60853 -263056 -367604 -267952 56827 133677 211586 125192 72995 -67275
16405 -67275 -93701 -217799 -218518 -183512 -324698 -424578 -375025 -203995 -28383 18333 72803
16394 72803 289500 376737 264790 175018 83545 -83431 -297094 -361936 -384904 -578225 -281429
16383 -281429 -145289 -138997 -98604 -39420 -62407 -84321 -257019 -338254 -182353 23134 133624
16372 133624 104823 27179 51654 -106791 -127008 -295325 -223041 -67372 -229472 -311792 -258244
16361 -258244 -10406 77192 48950 -230823 -334327 -120357 -46763 242210 298232 47316
16351 47316 -71859 -97202 -110872 -120359 97604 39254 -95875 -131656 -311198 -315443 -133985
16340 -133985 -101132 -8979 -112228 -146945 102873 179258 43906 -202743 -154680 54316
16330 54316 -225202 -465084 -540889 -245770 -79279 -86162 -51206 -33271 131242 -374 -119959
16319 -119959 -50483 -16232 4934 106544 362071 552140 585200 534659 550443 425502 40653
16308 40653 -68049 -45917 -122143 -34832 38082 136275 -30494 -13124 -260445 -392964 -459902
16297 -459902 -538793 -332973 -67874 -156363 -378394 -426853 -272700 -120834 -312090 -324505
16287 -324505 -236434 -204817 -134407 -189586 -196344 -115593 -86385 -106890 -304670 -357355 -418066
16276 -418066 -363082 -227891 -59069 -54354 85335 102940 -16345 24626 -27953 28155 -77855
16265 -77855 -230189 -351858 -252121 -214250 -362913 -258297 -65374 112319 80673 376953
16255 376953 271693 9735 94083 248734 139760 -399301 -544437 -291948 -35630 -5009
16245 -5009 154641 243055 4261 -214504 -98264 -77002 -96628 -138227 -180261 -69694 -212412
16234 -212412 -166072 -160398 -81305 18314 -56074 -132014 107837 234777 368128 261387 22525
16223 22525 54882 -154256 -403409 -371124 -220290 -72344 -128799 -118913 -88028 -242174 -212556
16212 -212556 40440 1409 156150 269973 46347 -106263 -35680 -21414 67519 -164230
16202 -164230 -264387 -132151 -43320 -42083 -282251 -121613 -42231 -164902 -238026 85576
16192 85576 1826 -104902 -89332 -51801 -132160 -201411 -198351 -91343 5736 102886 -88459
16181 -88459 -268260 -246828 6376 1780 22621 72317 -14653 33334 210972 297319 161066
16170 161066 -102860 -57855 84684 -114435 -186003 -115183 -15253 85656 117693 -39870
16160 -39870 -81946 -70272 2941 151382 161839 163101 158301 -45624 -260754 -344285 -345265 -322880
16148 -322880 -78104 -273609 -542751 -551374 -492000 -387914 -421884 -397192 -284021 -218657 -417270
16137 -417270 -407836 -431749 -301148 -562631 -741785 -434535 -53269 44527 96059 89164 -218517
16126 -218517 -278224 -186795 -131800 53417 85997 72565 67112 154915 188371 171083 159713
16115 159713 171480 274964 335894 230861 -5939 -108424 64502 309945 422609 383771
16105 383771 358997 395297 376602 268044 156970 -59807 -83460 -133759 -421005 -357016 -101287
16094 -101287 90067 248146 286155 205131 163097 178481 254620 341588 108414 -87260 -72322
16083 -72322 30748 147986 195134 131051 16053 103749 62221 97239 -2775 -130577 -59629
16072 -59629 -75507 -76934 -46369 236408 2398 -159619 -369415 -420705 -259501 -119287 -288137
16061 -288137 -253101 -217692 -240043 -191546 -239478 -167707 -341586 -358105 -131570 -89092 -290711
16050 -290711 -504261 -387848 -265084 -166459 -233148 -17813 87586 -99658 -29633 90556
16040 90556 64004 -3013 100606 55876 -74794 -141950 -65151 145291 183629 102118 164358
16029 164358 144903 92630 27235 72977 68278 -55119 27691 -7787 -83382 -174572 -141202
16018 -141202 -2865 126121 47410 -80042 -11355 67225 -66533 -358374 -353338 -24966
16008 -24966 -74812 -156080 -103062 -185975 -371063 -9250 110819 213831 414170 276514
15998 276514 14014 36594 93789 46526 255470 198878 71101 -183295 -262659 -192762 -217166
15987 -217166 -328226 -311691 -154315 -118666 -322068 -380046 -93977 135543 31642 1541
15977 1541 -75877 1915 28148 -32758 -231747 -227470 10 -86401 -78595 -92762 -47468 67294
15965 67294 92605 -200390 -158355 -83763 -51664 -107247 -239861 -211385 -276488 -224345 -150060
15954 -150060 -44888 -69734 116127 182577 -131319 -292515 -415724 -288917 159385 312561
15944 312561 79049 -62560 -367995 -446414 -238391 -142991 -22444 77527 134360 128279 165763
15933 165763 111513 -88356 -45261 229928 149995 61597 10182 92375 15771 -159579 -366318
15922 -366318 -215203 -177061 -239367 -80763 28825 -9668 -166816 -68028 124420 95120
15912 95120 124824 133672 40661 -28771 -395362 -386159 -241419 -57530 -172111 -247482 -297811
15901 -297811 -271046 -283180 -31770 156891 143551 -48889 -75171 -182300 -311563 -334526
15891 -334526 -315188 -308371 -355407 -390380 -363232 -417565 -208931 -225412 -321501 -177626 -1096
15880 -1096 104603 222918 226825 294360 89307 -46992 62471 174929 35636 56201 -104690
15869 -104690 -56199 116494 271015 411555 25009 -267974 -338042 -248676 -263102 -116376
15859 -116376 3269 43619 -208435 -73190 -108399 -308126 -409558 -498602 -641648 -439381
15849 -439381 -359336 -391389 -158494 52982 125815 148638 153645 372947 397186 195822 -13917
15838 -13917 -75710 -193463 -354194 -510643 -305166 -312773 -405257 -81121 -100032 -86084 -108311
15827 -108311 -273589 -224402 -49794 -51174 -290595 -159741 29349 21851 -42809 196096 338462
15816 338462 238233 -188041 -219638 6929 77406 207677 165886 114542 72300 95170 341093
15805 341093 449932 265813 287100 262539 79138 -232255 -162022 50055 28384 73718
15795 73718 -2510 -51643 -155667 -70307 6753 -185153 -430687 -361752 -384829 -247702 -149525
15784 -149525 89714 116909 -12095 115727 14766 -133303 -120904 32725 -144024 -264569
15774 -264569 -230510 -252530 -51522 -77567 -212278 -14903 -32125 -235659 -270620 -241248 -242017
15763 -242017 -31909 -94906 -234853 -214987 -52822 -36725 -263320 -457015 -516191 -356375
15753 -356375 -53118 30005 206829 138501 110573 -15570 -108087 -356301 -541993 -546153 -545683
15742 -545683 -32413 204903 102232 -126152 -196696 -284055 -380140 -534090 -559250 -350861
15732 -350861 -230494 -158692 -220172 -169095 -80833 -142721 -274965 -299948 -241312 -289659 -356413
15721 -356413 -614425 -502046 -457124 -461746 -509574 -510764 -259770 -236911 -74179 -15404 -126980
15710 -126980 -79987 153217 123008 319540 197553 21738 100329 22035 53645 -31690 52890
15699 52890 122105 58294 35857 235888 67603 -28625 -96478 -180222 -308828 -491798 -259467
15688 -259467 90434 344063 274761 -147759 -462873 -290982 -124960 -56846 -258568 -62427
15678 -62427 283827 176934 94596 -83262 37195 -47688 -4461 117509 152938 389279
15668 389279 233094 13615 7669 -73220 -211020 -243981 -147118 -182082 -196898 -242590 -128590
15657 -128590 -52178 -37448 -113533 -63488 -59928 -189457 -99624 59942 228563 132150 -195077
15646 -195077 -185133 -155486 -71030 137233 195412 277202 -31248 -120643 -89934 17285 195300
15635 195300 510711 426867 134301 158446 444853 577687 420291 170345 181603 330228
15625 330228 -39673 -159463 -112346 -1415 -17916 -88500 -14407 -38540 -109798 -155371 -283093
15614 -283093 -197611 -346349 -360638 -280377 -85789 -78112 -304907 -171135 42574 -162289
15604 -162289 -387818 -361106 -76352 104290 180398 109678 -84816 164207 217127 171758
15594 171758 252225 374676 370251 308385 223180 134738 -9784 90312 332989 261566 43098
15583 43098 -111120 -268912 -240516 -285456 -358730 -182706 68231 211804 152375 -224341
15573 -224341 -421722 -429810 -278843 -9870 347811 354460 232019 196600 310104 387078 242915
15562 242915 210869 231818 44497 -67021 62210 154466 99286 -87114 -128080 74119
15552 74119 115303 53687 -64176 -336133 -346712 -461840 -497501 -304613 -186964 -277568 -318179
15541 -318179 -313969 -291986 -111196 -208015 -83522 -111177 -119677 -34001 84232 150489 442432
15530 442432 404907 176112 -22334 -119205 86471 73746 117676 214965 286868 261061 92878
15519 92878 146984 39907 -319317 -103732 260609 196474 139787 123840 152168 187357 149519
15508 149519 -50096 -214859 -29490 29063 10593 5743 19977 -70414 164830 437180 267491
15497 267491 397673 192061 129498 219137 21046 -167627 -136982 -31708 -36246 -205187
15487 -205187 -321270 -108068 -321639 -568789 -483395 -501447 -651957 -718812 -565320 -369369
15477 -369369 -111796 -116664 -42595 122699 53948 15491 -116936 -250927 50663 91050 -7857
15466 -7857 -177030 -203965 -88713 -171054 -290513 -350634 -168882 -166523 -338002 -385972 -333954
15455 -333954 -264951 -210224 -246510 -42564 17475 57800 -92062 -332459 -113505 -12078
15445 -12078 -92857 -281239 -252994 94304 -269995 -459149 -529225 -407225 -340286 -494508
15435 -494508 -564010 -387360 -410579 -336283 -213537 -169302 -30327 66777 38931 -141952 -61763
15424 -61763 117793 200609 120532 -108889 -230944 -230190 -169565 -219122 -225043 -264703 -465809
15413 -465809 -436993 -318140 -83634 -59672 -77295 -182626 -282711 -249913 -73161 -203890
15403 -203890 -148337 103636 90079 -11886 -71179 -166242 40706 191983 72357 -82145
15393 -82145 -46543 60641 -304252 -448934 -509941 -495296 -237633 -79621 -173140 -32848
15383 -32848 108377 181583 126596 -140784 -87422 -99388 -182100 -158909 27697 184652 301646
15372 301646 152189 116924 91142 -32985 -10191 375989 351890 151050 204291 169173 131607
15361 131607 -82072 -106800 -96565 27712 -15635 95144 21238 -57607 -71306 -122883 -184333
15350 -184333 -116236 -74611 -252509 -212397 106312 309072 252048 342453 388698 252777 67654
15339 67654 -212592 40914 163888 45283 132240 131617 53299 50415 -145414 121930 90681
15328 90681 146009 34768 -95744 -239023 -143724 188505 242096 -45687 -349967 -265007
15318 -265007 -299628 -16628 272656 391158 146032 -72 -24081 -58397 -126949 -49848
15308 -49848 -125936 -119923 -69952 -37186 40529 190598 190866 20259 -181017 -374194 -144784
15297 -144784 64488 176791 35779 32090 62303 186225 -40674 -199400 -94813 -151785
15287 -151785 -166583 60849 457180 348445 182421 100369 -64514 -48261 -256383 -463817
15277 -463817 -220902 -55017 80312 1827 -165620 -254431 -330034 -403254 -57667 74485
15267 74485 16063 23767 -70765 94367 169611 17013 -137151 -90663 -11090 143128 -19050
15256 -19050 -235498 -347622 -129713 -151 84149 211256 424698 69730 -298022 -104689
15246 -104689 144410 27609 5425 50404 -101404 -182313 -116027 -191507 -41263 -158359
15236 -158359 -272538 -409828 -431861 -405648 -314367 -282522 -191333 -305813 -225483 -241019 -274799
15225 -274799 -218438 -221352 -240807 -129582 -2112 -248155 -321143 -420733 -254653 16791 108024
15214 108024 76059 -15116 -67614 -63319 -200622 -14479 80812 89561 -93315 -68431 -59175
15203 -59175 18062 43072 -75622 57705 290008 171611 126221 -60591 -176996 -454140
15193 -454140 -402021 -385506 -368284 -334956 -267267 -207362 -291403 -175891 -122084 -32306 -182739
15182 -182739 -262894 -368129 -494272 -479947 -275080 -71657 31670 -16267 -11409 -51117 -151992
15171 -151992 -24783 -116813 -361823 -446497 -331086 -162789 -238799 -257538 -68129 186249
15161 186249 307203 490490 455404 235527 73377 49906 227098 241696 195076 138344
15151 138344 174100 -76352 -150129 -150765 -312271 -126004 -24854 19699 -57040 -23176 20926
15140 20926 -91961 -162004 -248515 -189433 -128039 -100001 -64126 -215917 -387835 -269823 -262333
15129 -262333 -262503 -32853 72293 -72305 -203017 -252531 -134718 -89825 49647 -35401 -30269
15118 -30269 107678 41543 -125948 19196 -112402 -238542 -144517 46414 -97824 -38234
15108 -38234 8783 100678 20983 -261061 -270069 -73078 -13971 -185772 -267726 -257450 -163281
15097 -163281 -42127 -129437 120282 344066 186606 36386 -148322 -184363 -13186 43777
15087 43777 -90441 -448257 -90625 319036 188987 109987 -76250 -210891 -128188 -105012
15077 -105012 -170395 -246092 -249208 -274305 -175723 5880 -187814 -325910 -382411 -336908 -224062
15066 -224062 -280885 -115008 -133980 -52234 -144032 -195553 -146287 -38596 152304 330617 375662
15055 375662 491214 380608 219962 75045 143069 76926 -64586 -145229 84875 3579
15045 3579 -210787 -87072 48601 -29321 198628 301628 62837 -588 207222 121682
15035 121682 -41653 87756 407096 574331 337679 173110 11011 -89515 140056 230813
15025 230813 255928 329439 212802 184477 168534 51200 -68718 -121520 -107687 -98198 -161332
15014 -161332 -104333 176084 193267 244012 215687 81920 45383 -200990 -427377 -146441
15004 -146441 -187914 -45660 9924 52766 -69778 -121303 -171229 -152602 -183675 -142346 4546
14993 4546 -61812 -242004 -309444 -163506 -39412 22962 -32058 -198933 -40690 17958 98126
14982 98126 106207 -67898 -242081 -361123 -150250 152580 134640 -192765 -258886 -213972 -21102
14971 -21102 74164 182291 -161437 -176862 1371 -116456 -225006 -244014 -573138 -537137
14961 -537137 -440096 -179880 129774 -102906 -405926 -322563 -181819 -99930 -129368 -10807
14951 -10807 -11479 -55812 -136818 -209029 -370063 -356040 -228901 -141851 7194 197259 372046
14940 372046 340946 163514 -94098 -193454 -313487 -308778 -213643 -343592 -205443 30185
14930 30185 12610 53463 -28353 -264346 -215185 -68142 -175338 -156113 -37329 59166 15547
14919 15547 -145907 -267298 -86419 2081 -29433 73576 79631 17157 30234 -104271 -1721
14908 -1721 29510 36065 105165 -53981 -172623 -186468 -164596 -198055 -128114 -277123 -124842
14897 -124842 234996 209405 97720 -80254 -279256 -197285 -32026 -164813 -285964 -252535
14887 -252535 -263649 -254610 -253725 -23892 23522 61840 82715 -90442 -288982 -351948 -165521
14876 -165521 -187304 -244860 -343356 -398385 -410534 -467905 -561405 -697097 -520354 -405967 -408236
14865 -408236 -288364 -268189 -27988 65698 148534 65137 -60168 -125582 -44688 63065 -212253
14854 -212253 -320623 -292970 25466 285375 413589 394188 27246 -58857 -136135 -86774
14844 -86774 -26661 -160172 -85734 -167640 -300335 -152020 -150776 107251 294704 256778 320651
14833 320651 -42199 -61332 158441 341675 17494 -366267 -520297 -638578 -565470 -399607
14823 -399607 -448346 -282446 -18646 -110667 -109809 -369721 -341173 -353200 -209376 -65703 -23406
14812 -23406 29173 155639 92564 182286 248015 34266 204037 147105 -71454 -208841 -127936
14801 -127936 -175879 -172511 -39491 -46935 -57240 40870 302873 525481 430943 22252 -158436
14790 -158436 -264331 -233481 -151173 -310764 -186602 62443 -416 -27577 133815 73514
14780 73514 79775 -83191 -95636 148581 309404 307635 119926 -28317 28253 82918 35474
14769 35474 -76051 -175352 -229714 -201157 -97253 -90948 68410 16171 -104501 -178857 -234569
14758 -234569 -175004 -135158 -94939 65178 -55877 -69118 -16244 -86583 -184435 -283529 -198244
14747 -198244 99191 91764 -42886 -112612 -39589 83431 254006 206252 -46260 -165836
14737 -165836 -244597 -176104 -81660 83763 255397 193994 317234 333683 196586 58045
14727 58045 -79270 36994 42917 -148287 -87384 13313 67000 95385 42640 -110620 -301820
14716 -301820 -73369 176875 61155 102611 174549 165104 226228 348161 474193 489863 495890
14705 495890 326339 85025 162603 307755 164890 51715 -76500 19911 -18933 132899
14695 132899 152868 12936 103542 243033 208980 147804 -16807 -54171 89555 136780 75355
14684 75355 17681 -12583 -62630 -9979 79813 122817 135273 194317 198915 20434 -74056 -199376
14672 -199376 -63053 354441 158647 146853 19288 123494 201511 -54236 -56208 21079
14662 21079 57274 115274 156414 261226 12338 -342643 -194345 76199 44035 -30924 -140310
14651 -140310 -155347 -141524 -354171 -555363 -350673 -222033 4798 36420 -95355 -80267
14641 -80267 221093 186205 41489 -176684 -271028 -84576 -69822 -130907 -16067 -62216 -189283
14630 -189283 -275799 -37508 92671 -67628 -203332 -264071 -243601 58652 123124 162177
14620 162177 158487 38106 126556 130831 134440 34589 36052 62704 63256 269521 197326 219917
14608 219917 340658 208224 -54932 -147074 -88058 65290 129355 171577 148789 385216
14598 385216 480271 239067 121731 -6578 -51227 9590 162187 195998 369676 589712
14588 589712 422335 392467 152563 46621 -115740 -20575 -93577 -13149 199748 68465
14578 68465 21375 81305 -55498 -244226 -266075 -169636 -197301 -188074 -347960 -207808 203
14567 203 -89323 -78727 -262042 -381734 20611 84696 195047 245894 258757 -60113 -232978
14556 -232978 -97841 34601 67281 -92226 -188447 -98552 -126211 -79597 -33022 22214 -201935
14545 -201935 -219573 -364638 -412953 -437313 -544136 -429064 -462174 -386373 -329356 -269021 -236466
14534 -236466 -233214 -543107 -765182 -534943 -81119 -219125 -460416 -523354 -400594 -265467
14524 -265467 -192761 -274531 -339693 -405102 -432365 -177336 -80866 48806 -73000 -368891 -369353
14513 -369353 -168792 -201465 -130588 -271687 -208112 222380 306098 324439 174995 70087
14503 70087 122167 87933 33189 21480 142060 184536 158590 161800 44759 -48544 10928
14492 10928 53913 70519 195167 320755 343877 239694 267831 214950 280408 420003 75811
14481 75811 -139495 -9921 95857 79582 -128641 -3013 94872 31858 -235547 -32515
14471 -32515 34928 -130909 -108987 30452 36354 4013 2186 -30979 -60239 74899 -81892
14460 -81892 -337761 -185835 112289 41330 -83690 -267860 -180262 -40580 -33902 -268831
14450 -268831 -453606 -280050 -73527 -37501 -128596 -169517 -335040 -373176 -193281 -25925
14440 -25925 106121 76554 152855 197056 73754 19688 20065 -30684 26422 -9784 104478
14429 104478 223107 384739 314507 237509 108594 149592 92277 -14333 -117535 -292010
14419 -292010 -204383 -143737 -146344 -150242 -151754 -110834 -81408 -248145 -138540 118017 269813
14408 269813 70616 -156109 72814 378682 137567 -203764 -173620 -23173 -86391 41049
14398 41049 84783 61241 221109 276308 182347 -27030 -328695 -335472 -111136 -95824 -188534
14387 -188534 -428824 -336787 -305435 -223330 -189806 -256703 -197545 -49575 98894 145304 222801
14376 222801 109587 58336 62626 156768 426643 331147 376484 439196 233229 -55439 -210240
14365 -210240 -433234 -349640 -331137 -306208 -40613 2411 -46862 -93474 -84207 -153892 38180
14354 38180 112097 -81104 1450 -204382 -429044 -185316 319099 350309 48354 -80323
14344 -80323 -12405 240016 387820 262744 209018 116959 5247 -43673 -128857 -209115 -53987
14333 -53987 68248 38322 -39060 -12032 57191 14959 -58991 -99995 -222262 -45085 141519
14322 141519 271504 211171 124823 130414 75349 -58579 -65021 -179386 -187193 -217087 -268432
14311 -268432 107966 210310 167495 -97233 -374761 -361314 -81185 153418 102657 129715
14301 129715 54666 -305669 -208458 -154170 -73386 -157961 -331382 -156198 143669 348837
14291 348837 479683 415872 445031 379075 56928 -81975 51169 119960 220471 -49397
14281 -49397 -104589 -108269 -214899 -403900 -281598 -150387 -25250 56683 -31488 -136643 55494
14270 55494 118523 72764 -108352 -215444 -146942 -288768 -281449 -303790 -305809 -128219 11957
14259 11957 73544 -38212 -106745 -56397 224021 167534 17365 -81405 156292 347458 243497
14248 243497 -7114 177811 263798 367170 393574 340284 341079 269230 110978 -3123 78620
14237 78620 41573 -74933 -110744 78493 12092 8528 -37138 -123087 -78354 -198639 -202139
14226 -202139 -136600 -255610 -60096 -40774 -60406 114006 70895 -53819 -21171 -48908 107751
14215 107751 268538 285580 480123 473545 35930 -59572 50322 -42035 -280824 -51917
14205 -51917 44793 83242 191394 -52215 -53835 -64242 120585 93504 10994 -102181 -226298
14194 -226298 -185441 -15957 -28863 86987 78512 181700 87815 110995 123890 103148 118312
14183 118312 255294 254715 119171 52266 191163 349389 147575 -134398 -148404 -155595 -269079
14172 -269079 -272637 -285404 -175383 -264783 -139675 -32600 -132264 -214142 -209535 -272596 -303010
14161 -303010 -324841 -264947 -231812 -184505 -56883 -119990 -152339 216175 315568 174771 -93250
14150 -93250 -267639 -387253 -333942 -131159 -228335 -288522 -292823 -326512 -329192 -347490 -333856
14139 -333856 -231805 -149110 -133045 -35541 862 -2885 48849 -27267 -227472 -105472 75144
14128 75144 27558 -163813 -81316 -14209 -176315 -137542 16154 50305 65831 131094 -76575
14117 -76575 -291781 -186319 89893 -67229 -121063 128486 207973 186867 160284 17583
14107 17583 -87846 101998 9518 -214911 -374199 -121963 -24571 68621 154476 106570 -22074
14096 -22074 -128793 -652 163945 152190 102148 -12445 -47803 -53704 83482 197193 82530
14085 82530 67749 193849 164641 234720 210282 304445 219539 111824 -58590 -215857 -169946
14074 -169946 -356211 -364943 -441539 -368737 -367367 -53679 129488 233966 404996 393270 -53211
14063 -53211 -195876 -11849 82242 57320 174748 134430 -8592 -131881 -69897 136546
14053 136546 338660 301420 233947 425585 410471 319454 217399 75378 124383 319217
14043 319217 24146 -33912 55379 79392 76080 -108325 -228430 -213661 -128316 -46034 -2416
14032 -2416 354184 482874 499573 330969 299180 261078 71062 -55114 -33633 -189272 -173741
14021 -173741 -72734 33349 227210 82898 107437 313 -128925 -2113 -215199 -82121
14011 -82121 184259 90546 -128469 -104389 -135103 -252756 -280570 -91083 -177109 -182230 -84726
14000 -84726 -47666 -203712 -209249 -293799 -4626 174075 197950 188208 185437 88707 133716 85351
13988 85351 97675 -31241 -16197 -20884 -59716 -13843 77430 137522 134772 155768 149536 74847
13976 74847 -80161 -96340 129078 223602 -25676 -157859 -247249 -312740 -409116 -355216 34646
13965 34646 282539 158239 116191 301885 332986 165439 355583 289848 55691 141880
13955 141880 225975 386706 340189 300698 -1270 -150906 77521 228951 93346 -231229
13945 -231229 -404903 -355928 -266206 -100629 -101753 225 -23625 41979 -13623 -57194 -183622
13934 -183622 -282895 -164009 -175935 -276798 -501044 -626354 -610335 -211169 -200948 -399735
13924 -399735 -365221 -324217 -363041 -455387 -359274 -166827 -60204 139964 444488 479440 154636
13913 154636 143701 271615 351550 250414 -112547 -401715 -199969 117683 47409 -132497
13903 -132497 -241326 -303299 -398001 -515012 -613712 -379003 -212956 -32623 -46289 -168400
13893 -168400 -181645 -103768 -56969 35460 -9737 120008 79869 209591 83013 -17349 -143710
13882 -143710 -145361 -90414 -3262 73955 -29149 -21033 -132674 -63789 -52100 40725 -125102
13871 -125102 -128182 -88428 -422459 -535206 -521469 -376838 -342193 -487463 -358114 -506219
13861 -506219 -395544 -187933 -231881 -252122 -227185 -130319 59203 -60611 25034 229497
13851 229497 321100 267550 168886 94232 -66252 19834 130701 59588 -138790 -49504 144334
13840 144334 181987 150092 162190 -7066 -109277 -52423 -181194 -145391 76784 -43712
13830 -43712 12519 132104 145077 267721 283422 234360 184566 -103294 -350108 -290828 -176474
13819 -176474 -31310 228872 303448 271916 181861 316297 340603 313517 140695 -11338
13809 -11338 142156 186141 134182 224001 171039 -27262 -227051 -212279 -147907 -11352 -81995
13798 -81995 -208319 -212046 -38080 60894 123570 -83750 -145001 -52501 166080 196045 155342
13787 155342 125171 258428 279738 490456 501074 243535 101468 168498 162161 410904 307635
13776 307635 -209866 -162510 -330241 -359768 -288940 -150942 -53528 115356 -288516 -563553
13766 -563553 -387479 -479478 -461582 -446095 -308362 -39583 158033 256582 -7147 -154024
13756 -154024 -237798 -136721 -7173 74182 172450 229331 343735 -63224 -153117 -18543
13746 -18543 -138445 -247189 -290074 -222459 -324940 -247701 -99791 31724 122132 144730 144769
13735 144769 283209 -111462 -290184 -311399 -288508 -154849 146438 215162 190542 85318
13725 85318 52420 16385 -76071 -106711 -118599 4553 160529 358841 319290 403906 274287
13714 274287 414033 435459 196882 130258 46351 136459 141878 184368 169618 17372 106490
13703 106490 -103938 -2616 33802 -75026 51540 96710 121470 87945 101795 107224 120809
13692 120809 210755 183259 29440 -13237 156183 300103 406818 348416 260548 76702
13682 76702 -144608 -172198 -110878 -38014 -19205 -342742 -439625 -174379 113384 115018 22698
13671 22698 -52787 -219287 -364056 -346539 -49148 60192 -59835 -86447 -108612 76590
13661 76590 -12048 -165502 -146294 -502469 -564230 -361593 -98140 -159252 -304696 -48792
13651 -48792 -19421 7045 15619 -24675 -182171 -30526 -158337 -348429 -277059 -229946 -370758
13640 -370758 -507718 -419069 -93364 68903 -93856 -124362 -22874 26587 -266401 -170274
13630 -170274 -129732 -177732 73724 98177 105029 -29566 178822 187658 137995 -98659 -242012
13619 -242012 -251366 -21742 9209 -210381 -1680 45384 -91617 -138772 -121465 -228620 -89735
13608 -89735 -69549 20400 -89981 -176277 -204378 -172560 34877 229352 65630 -66931 142663
13597 142663 378628 418255 194618 -116887 -334973 -352663 -275670 -160728 -271381 -292721
13587 -292721 -83494 80169 69100 101615 140882 245191 115041 -363294 -464775 -488979
13577 -488979 -300206 -254769 -170746 235988 157871 87277 61126 4147 -45596 -88235 90000
13566 90000 218869 188367 84244 134862 189086 157627 123332 -74374 -106491 52079 278108
13555 278108 380024 524963 199099 185629 180341 48627 -73567 -90769 -182215 42134
13545 42134 29584 -123513 -217597 -126958 -83912 -234753 -332838 -313371 -155071 157277 244716
13534 244716 -17290 40076 46657 93103 58887 70754 16164 -121231 -95486 64541 210617
13523 210617 12532 -39225 -73874 19506 207999 265523 144506 -11655 43788 -52894 -127971
13512 -127971 33348 112881 161191 239395 484159 232684 52796 -120037 -271385 -71439
13502 -71439 11133 -30638 -125842 -308930 -330648 -164528 -91242 -94090 -194695 -100723 -20272
13491 -20272 -99119 -57246 102710 48661 -98170 -231293 -61176 126541 17496 -347183
13481 -347183 -267279 -29190 137722 80270 139884 3126 66407 527802 440812 76035
13471 76035 52530 257670 376890 322947 270819 300891 202698 -112190 -291338 -156613 198459
13460 198459 277581 234588 36316 -8778 44510 -81972 -93371 5994 201620 70270 -85008
13449 -85008 -123744 -297866 -366660 -517863 -465027 -254932 -137311 -216283 -107372 -73104 95354
13438 95354 273088 115548 -114110 -237109 -195153 -109909 -217093 21961 117690 168310
13428 168310 184481 168352 195730 58885 132328 153629 -71447 -181638 86987 -81845
13418 -81845 -154949 19942 -26578 27166 150447 72775 74892 -23114 42002 -59985 26672
13407 26672 -108820 -363165 -207340 11220 91096 292964 246907 189855 197433 69092 -11552
13396 -11552 -87004 -148123 -130752 182589 308114 264382 175701 165317 117220 144426 96876
13385 96876 94386 64961 -52924 -138035 -124838 -60344 137698 76759 51472 -153915 -183055
13374 -183055 5523 23778 -96943 222209 318478 84873 173657 134150 -156912 -120418
13364 -120418 20341 204589 342402 107169 -129209 -39004 11500 19845 34161 -49385 -58779
13353 -58779 -130015 -219860 -166963 -84215 135549 149650 -103720 -175582 -2594 139341 174404
13342 174404 137150 3479 -60963 -174235 -153268 950 -141407 -154884 -135793 -162826 -196318
13331 -196318 -462245 -362568 -329934 -141584 -33457 -92409 -154567 -50509 63754 147133
13321 147133 161722 158254 143222 22148 -131696 -132296 -9628 59559 77649 41965 89030
13310 89030 69104 -78768 -115969 -193288 -224183 9071 107230 114209 196898 236019 209828
13299 209828 71026 134595 29624 -123634 -20760 152050 164009 98856 -90138 -62219
13289 -62219 -21342 13440 52897 -213908 -175110 -348237 -264055 -160374 -6229 135578 187240
13278 187240 63180 93667 299165 233878 296432 297276 446080 469663 472924 474027 175796
13267 175796 103634 -76291 -99946 -107359 62105 150347 150001 78790 240351 113362 159385
13256 159385 354897 534963 486177 251815 326279 408342 185238 -54515 -31464 49681
13246 49681 -130923 -213276 -288734 -296939 -110077 112665 205459 52592 49071 51175 -97864
13235 -97864 -296366 -445288 -424612 -368291 -210053 -78250 175607 406827 208144 166729
13225 166729 54622 -3187 39236 -62737 -233603 -110245 -70741 -91194 42604 -41881
13215 -41881 -105808 -102701 -113287 43049 259477 172701 162270 99106 166583 30044 -228314
13204 -228314 -173382 -89579 55154 29999 -97271 -145804 64566 113126 78263 18474 70811
13193 70811 96952 180258 305655 99900 30384 -17742 -163834 -106382 -9044 -78827 -15719
13182 -15719 -29382 1451 -10836 152719 132759 186848 236743 145229 271890 274664 260785
13171 260785 171118 -143867 -342263 -190530 -73865 -173740 -259359 -347294 -222197 -264290
13161 -264290 -188930 -72729 -25566 -63036 -280591 -472589 -542264 -687220 -628033 -568540 -462076
13150 -462076 -256268 -119857 -201739 -356577 -147635 -147324 -203357 -232796 -125435 -216033 -409355
13139 -409355 -201226 58629 53412 -302566 -401757 -314809 52479 -14235 42898 -56970 -169309
13128 -169309 -210009 -97268 -29977 117276 146325 998 131228 57195 -12352 163817
13118 163817 435785 320719 233230 174616 31691 -55741 134331 112893 -20692 -100025
13108 -100025 -15008 -18909 -235284 -243154 -296033 -420286 -348661 -215371 -128883 -407949 -444707
13097 -444707 -213576 -394408 -482655 -348560 -386242 -293532 133873 406745 457803 318633
13087 318633 294479 282517 455878 504538 547747 138623 -216286 -282290 -67355 20660 213316
13076 213316 365413 154649 177814 64874 -90721 -327767 -27018 247734 351930 249904
13066 249904 198939 55569 19510 -10152 -260039 -551172 -466861 -52590 143474 52977
13056 52977 8689 -14327 -5822 -86660 -12643 153225 300857 379202 257041 68487 215179
13045 215179 376061 310884 181791 33653 -15013 -25010 138293 42568 -39929 -256574 -465444
13034 -465444 -466860 -231026 -350993 -397054 -478079 -258926 -220831 -338302 -323166 -222064 -169251
13023 -169251 -156569 -29990 36830 304344 310717 264787 292520 25575 -135304 -274299 -230160
13012 -230160 -40702 70453 98880 117744 86757 21984 -43816 -134590 -134557 -120638 -161048 -50100
13000 -50100 97219 -3570 -48984 -156411 -64932 -98961 -59067 91219 289175 45780
12990 45780 -369814 -397776 -396053 -336367 -57926 -96833 -135941 -198902 -297413 -368534 -279203
12979 -279203 -72329 -255877 -502566 -522594 -88963 44981 -158850 -395445 -311157 -237544
12969 -237544 -262187 -332713 -323009 -344387 -422762 -465020 -333158 -195208 85623 -29826 -270150
12958 -270150 -409531 -341635 -215147 -139382 -82966 -25264 -51378 22577 111390 22199 -63526
12947 -63526 -102968 30751 184841 16377 -181854 -168880 -50227 -300961 -453311 -510559
12937 -510559 -225673 -19384 -40727 -75532 146014 109657 -33095 86615 -90402 -341547
12927 -341547 -501238 -189839 -8105 -61612 -268717 -163143 63516 -2165 147311 89668
12917 89668 59960 98212 94731 -28547 -90934 73076 50887 68251 13424 -55107 -61498 61729
12905 61729 110470 -60719 10296 53755 14208 1667 -268138 -276495 -230502 -59098 -143486
12894 -143486 -324934 -269194 -304989 -118596 -114722 -249556 -18245 195677 1475 -231178
12884 -231178 -376300 -108324 283370 137739 185463 211049 67702 65782 90393 -25873
12874 -25873 -54305 -209655 -197495 -138567 43432 -45512 -94553 11810 44323 228202 16978
12863 16978 -159999 -138267 -33014 152283 127470 60992 89846 49188 141468 159904 14174
12852 14174 136940 246737 -33048 -28184 20489 120257 125288 74062 -61416 -24643 228600
12841 228600 107867 26320 -63386 -140559 106528 253225 -82540 -234990 -67920 -152002
12831 -152002 47574 181477 80447 243049 226029 121200 103518 315127 443938 263558
12821 263558 272041 333967 150203 63013 -95771 -40059 219139 169979 -8218 -61096 -358452
12810 -358452 -695517 -690720 -282733 -186588 -278053 -191907 -50917 68418 120238 357116 560504
12799 560504 301081 62078 27772 25697 3102 11474 26073 -121374 -171490 -80561 -108517
12788 -108517 84318 110663 117155 241749 125777 -32304 -8716 -72242 -111971 -103599 211874
12777 211874 171279 -157814 -452922 -492772 -377081 -284476 -85162 41034 102991 203021
12767 203021 89018 41061 34124 -16765 -104064 -172530 -180346 -90531 64422 278312 300796
12756 300796 378472 444659 464492 239983 -60770 -137278 22103 -105176 -223278 -79632
12746 -79632 151385 64640 -142615 -269335 -299884 18182 212505 275945 364952 365272 395062
12735 395062 380674 356049 126231 122770 148257 -9709 -7786 83602 150551 158598 210665 414248
12723 414248 407514 -23513 -289612 -260214 -168759 133439 108201 75132 -19531 -168616 -127138
12712 -127138 -239251 -318834 -222899 -46330 43930 -377835 -347559 -279355 -129643 -64492 -63436
12701 -63436 -121197 -111464 -308583 -249545 -127913 -178663 -251885 -47965 4899 -115837 -180552
12690 -180552 -84111 -19853 -105352 -161195 -147770 131403 235820 374844 223607 324234
12680 324234 358651 247781 311809 374981 77796 -112297 -128211 -123852 -106096 66300 -9712
12669 -9712 -57708 -165743 -350982 -360860 -300400 -160954 -15431 -57920 145606 271113 101204
12658 101204 -106916 99210 180533 117924 117535 221837 231242 132072 177324 198336 138257
12647 138257 -218180 -212293 -117064 54121 76750 139175 89396 -124211 61340 498895 576257
12636 576257 372923 66123 83545 51987 -143468 -246026 -321939 -413741 -160084 142251
12626 142251 209542 366595 336853 278875 100016 92766 150561 -19916 12227 -180982 -421413
12615 -421413 -255819 -100377 92038 100747 156988 200251 342312 472434 415149 6327
12605 6327 -185545 -224250 -168715 111536 356549 317596 306233 245083 198351 267854 131720
12594 131720 -44171 -107091 -123464 -186643 -74611 118208 185208 120080 232919 48727
12584 48727 -70056 74940 37236 212828 353621 292049 262165 326142 102713 -96754
12574 -96754 -227441 -178817 -162287 -119398 98206 189805 337952 385478 152021 -46893 -84978
12563 -84978 74718 63993 -89219 -9659 -834 -67636 -184122 -338552 -213467 -69505 -26279
12552 -26279 318432 517908 239342 -173011 -220589 -79681 -160014 -132720 -183023 -49032
12542 -49032 200198 230968 131989 467134 387637 359965 456957 392871 292089 312164 406548
12531 406548 184552 191256 213438 126419 -59775 -178170 -188230 -166002 -210643 -232214 -326723
12520 -326723 -253616 39727 291816 107417 -168665 -144405 76180 81432 -51042 -92654
12510 -92654 45529 48076 -187663 -143171 19614 200490 120265 96629 331880 419194 521035
12499 521035 472374 712827 909484 696718 426027 304928 238614 504931 508548 311653
12489 311653 -30273 -208373 -269969 -74688 205535 297114 359148 340701 258510 357464 134622
12478 134622 260113 360569 117066 135977 108914 -149792 -426570 -194684 14491 38477
12468 38477 255105 238300 86214 -18161 115604 222876 104175 73659 18626 192222
12458 192222 309691 264893 155800 180898 431123 454022 383509 279078 315513 76989
12448 76989 -33457 57425 265943 345133 128193 27381 394196 466611 197747 -17792
12438 -17792 7563 144515 77775 84037 137051 96912 2696 24680 96231 79972 232108
12427 232108 188983 21887 -87246 -246590 -171519 -16112 -154738 -153781 -65434 -153167 -78622
12416 -78622 75797 165013 -42198 -67019 -254721 -452932 -228344 -13184 -58525 -422932
12406 -422932 -488431 -194020 99711 211393 336443 400590 499298 648420 479712 477430
12396 477430 374209 162828 38555 122830 47054 -50075 -247826 -137653 79221 254809
12386 254809 165085 249532 466673 267394 41530 135141 103440 135771 1934 -35050 110681
12375 110681 255675 94793 188914 334569 464902 548489 314403 254426 352605 433543
12365 433543 148063 156583 234988 256832 288212 439660 529082 66538 113741 208484 33234
12354 33234 -119962 -72111 -169395 37296 73655 -70264 -171804 167679 576729 688274
12344 688274 688782 670127 570290 354846 140097 109728 73085 62964 115381 252852 248874
12333 248874 204634 191589 378129 597911 679758 723165 554281 389107 452559 422636 367615
12322 367615 339782 279727 239519 298806 465977 373672 288951 525286 552248 613862 1006467
12311 1006467 952723 587459 612211 821181 545998 195727 206334 53898 40802 92804
12301 92804 -83911 -59694 -66026 132168 118786 159778 160813 -95012 -134421 51983 -9300
12290 -9300 -194223 -179299 -77395 256176 437254 558789 456622 325671 314455 189776
12280 189776 193157 321880 453829 529297 532507 459344 190944 305972 387494 290989 544388
12269 544388 679717 557587 463439 431042 532473 686978 593442 376560 337739 357493
12259 357493 186634 -63517 -313712 -295406 -67057 158618 99606 495728 654331 516793
12249 516793 320511 17232 54293 63254 -51582 -196028 -257545 -292382 -102655 105369
12239 105369 372387 197913 45204 -268012 -181769 -113546 132112 262908 222177 249758
12229 249758 296761 417166 423012 172709 190713 159835 -96515 -25738 -110682 -177892 -121778
12218 -121778 -4437 179740 328478 569567 425715 406972 305041 155470 329935 513791
12208 513791 500965 401537 286243 257315 226188 60826 273155 565061 579358 386477
12198 386477 363699 347466 526008 858145 741802 612870 550060 544130 557139 632173 558769
12187 558769 564453 516402 635806 663954 716327 790865 737768 596735 381376 381452 526491
12176 526491 380337 484274 489290 393532 416363 675351 679617 583394 474399 681032 704979
12165 704979 853281 885904 563585 165258 222628 199641 221308 307172 321175 274133 345355
12154 345355 480301 431217 407654 358830 295178 232485 259638 144376 94988 94965 275350
12143 275350 248545 153247 178938 223453 429023 661869 505175 553007 491210 500984 385973
12132 385973 296542 221908 300704 636587 906893 1215247 1272859 1191417 1349742 1090027
12122 1090027 752563 724734 683330 628979 767641 932933 854529 684143 633513 774367
12112 774367 649107 643581 647912 749501 733085 693449 775505 1044615 1146037 937070 588036
12101 588036 452210 778306 1130097 1248183 1133382 1154642 1319048 1365665 1477727 1673751
12091 1673751 1604357 1495369 1403874 1374804 1273555 1167717 1167840 1348420 1463846 1633741
12081 1633741 1734139 1829947 1603846 1730602 1765966 1906528 2073809 2279484 2177916 2232336
12071 2232336 2680486 2845186 2590151 2370211 2382253 2469396 2380436 2396000 2716406 2902874
12061 2902874 2791844 2628856 2738679 2764844 2862933 2759258 2618595 2766420 2647767 2680637
12051 2680637 2652471 2322105 2150136 2360244 2645861 2656365 2673133 2581036 2408760 2392187
12041 2392187 2267750 2174535 1975836 2120726 2321502 2397629 2385446 2526065 2660828 2779562
12031 2779562 2688595 2594089 2695301 2551985 2395428 2634854 2911545 2945430 2974164 3105578
12021 3105578 2979057 2981335 3051774 3280914 3186401 3157106 3336165 3437235 3719425 3789590
12011 3789590 3827484 3686047 3565089 3544635 3455928 3437723 3498363 3735468 4074525 4256402
12001 4256402 4430193 4490658 4676365 4738722 4762332 4803114 4955581 5206150 5523836 5607429
11991 5607429 5610425 5561857 5681711 6112942 6382367 6580999 6798217 7217628 7499112 7612933
11981 7612933 7888433 8191520 8662796 8862002 9229368 9518699 9873509 10386660 10837227
11972 10837227 11201492 11767362 12355159 12731465 13140441 13656703 14263143 15096822 15721897
11963 15721897 16364119 17134588 17825684 18742521 20032767 20981212 21925525 23116389 24463166
11954 24463166 26005999 27713897 29323923 30964847 32984775 35499160 37938087 40643801
11946 40643801 43443131 46568613 49956141 54007201 58411389 63486264 69314883 75574738
11938 75574738 82758635 90893989 100031575 110441777 122061649 135115710 149754604
11931 149754604 165811374 183929314 204145090 226103919 249524557 273519869 296652572
11924 296652572 317191967 333786923 345412772 350396109 348013030 338441713 322267176
11917 322267176 301137306 276958073 252057518 227856105 205012336 184534435 166585336
11910 166585336 150770773 137158709 125569300 115316843 106247093 98328183 91270524
11903 91270524 84868062 79607012 74730226 70322150 66573943 62906200 59512341 56548146
11895 56548146 53774512 51273938 48745384 46765222 44946284 43217156 41619027 40116772
11887 40116772 38728625 37313753 36223141 35142669 33957861 33027026 32185523 31167379
11879 31167379 30554356 29802085 28914023 28115652 27527270 27155397 26197906 25439169 24927024
11870 24927024 24386189 24048934 23688675 23298458 22724083 22349477 22186164 22029911 21598545
11861 21598545 21066213 21030791 20984574 20630566 20459444 20324247 20045269 19653835 19365054 19245086
11851 19245086 19042713 18916467 18859864 18816493 18763904 18659517 18325672 17956490 17809266 17980105
11841 17980105 17698869 17334604 17247775 17332803 17341082 17095787 16417403 15893167 15498190 15032658
11831 15032658 14982441 14699233 14272749 13840545 13374329 12977248 12450194 12060259 12113440 12060221
11821 12060221 11855031 11527798 11151966 10759541 10718427 10580469 10410181 10359190 10189826 10047603
11811 10047603 9732491 9735220 9707823 9155902 8719035 8560308 8523944 8518344 8377556 8097611
11801 8097611 8140312 7978128 7724429 7622041 7509909 7198288 7037384 7044227 6954090 6981938
11791 6981938 6674847 6329747 5962152 5629706 5503945 5495149 5646584 5610995 5313634 4989075
11781 4989075 4684482 4555918 4316849 4286320 4170226 3855438 3784866 3702034 3497373 3526769
11771 3526769 3427104 3060881 2961143 2969618 2906244 2733592 2478158 2444186 2562290 2556566 2443349
11760 2443349 2315295 2262251 2400541 2483797 2385134 2221407 2083971 1914595 1906607 1742480
11750 1742480 1559024 1624789 1886850 1933843 1869104 1840882 2028029 2041170 1902400 1771586
11740 1771586 1689495 1511289 1482604 1572534 1512640 1377675 1045067 1325488 1361332 1392961
11730 1392961 1393136 1381739 1484424 1400250 1266169 1079407 1284284 1600249 1361381 1204407
11720 1204407 1181772 1141717 1399025 1591173 1479479 1118623 1054345 1265246 1363469 1434063
11710 1434063 1218454 1226846 1384470 1588514 1854069 1833383 1600267 1523063 1495985 1611692
11700 1611692 1819289 1527365 1489351 1491353 1602631 1709360 1657784 1436171 1360700 1470620
11690 1470620 1589465 1692889 1671800 1776930 1863088 1811700 1904939 1859646 1578465 1416593
11680 1416593 1540794 1641360 1840255 2018456 1925527 1691689 1408387 1204435 1307572 1345729
11670 1345729 1199018 1341048 1346947 1269659 1591289 1705065 1393949 1371786 1443353 1378179
11660 1378179 1450467 1488460 1465282 1425083 1388261 1488365 1700015 2003699 1934161 1554745
11650 1554745 1435064 1707681 1581160 1445122 1322361 1247670 1260161 1207930 1362656 1339233
11640 1339233 1074443 1074745 1177809 992013 824809 971894 961669 954335 836730 795812 876881
11629 876881 995616 957374 723893 880843 1115873 1010258 911289 750253 694891 589359
11619 589359 597481 662365 539145 511742 502531 501557 388351 482246 687130 764027 708054 689478
11607 689478 680266 810653 654260 293077 185086 160460 482156 573103 680309 528118
11597 528118 384015 279283 277055 426191 281155 41901 174450 316836 497427 485673
11587 485673 365554 313570 493760 528628 307196 260455 238967 198808 219462 412727 503675
11576 503675 677386 836089 956780 903155 1048585 1136569 1008252 595396 516451 667700
11566 667700 757494 914321 825248 671115 586463 449031 529932 677568 729157 711524 533852
11555 533852 567479 596441 579294 564603 738257 782141 839162 914110 947572 996214 890619
11544 890619 1001576 1115895 1051178 1053875 799257 499759 603547 622503 862980 950002
11534 950002 834641 720126 731307 770800 797586 762073 804928 807225 795792 713418 712017
11523 712017 530593 422285 560844 747417 906874 763483 325818 93872 178444 283768
11513 283768 338657 351683 511008 377786 499942 577057 730373 770657 859786 774794 681852
11502 681852 662165 700045 706281 783280 679981 850607 686762 558531 503181 766104 906012
11491 906012 910570 1177215 1259285 1279094 1239908 1290518 1382777 1358018 1147165 797669 833988
11480 833988 1006580 1000485 1009827 966592 857845 829466 669799 755636 863024 773156 728846
11469 728846 492897 436032 634135 668636 692956 583793 656034 743422 754716 893929 695530
11458 695530 719170 768591 706415 716578 853515 792818 633948 709487 674720 640970 481920
11447 481920 424664 329051 547197 571718 431354 546863 668307 644004 733330 667272 636995
11436 636995 574542 601251 744144 1004365 1092085 829819 684820 719753 875770 928130
11426 928130 612829 275267 433080 760310 696802 572849 580005 651345 568600 527248 537744
11415 537744 429466 692842 656016 581408 609148 637058 720753 821671 862055 788427 992455
11404 992455 1065874 1210892 936435 559014 400210 534667 488438 301651 369347 451943
11394 451943 492731 522787 537309 668470 686933 489722 362475 392851 486072 493008 541567
11383 541567 530734 551300 496645 503885 634576 569358 243781 198144 214889 165230 115171
11372 115171 308129 356885 275625 262900 429849 385461 326472 320255 445605 373894 256433
11361 256433 284485 444814 373849 405660 375491 555007 520458 427462 439254 347339 274891
11350 274891 310684 76241 110430 375557 454536 260766 209675 173510 -115718 88949
11340 88949 110398 2019 61653 177991 273490 408992 342818 283054 359941 333566 103111
11329 103111 297362 203240 274834 283236 319002 308286 84534 199589 113339 428704 403276
11318 403276 350447 73508 12096 -78006 -366903 -439464 -220214 -168795 -61992 252356
11308 252356 301095 224477 262963 375781 247227 52975 -217220 -135283 -43096 -118755 -253381
11297 -253381 -301195 -246038 -160114 -154493 -229917 -185396 -274387 1393 125476 160972 181175
11286 181175 167929 257718 224240 82645 186680 28329 -80018 -117396 -75317 40071
11276 40071 276856 228400 -115925 -144563 -144337 -234091 -296113 -411987 -473142 -411451 63463
11265 63463 255468 100092 98076 329062 277182 272620 424225 377733 362434 232990 -7302
11254 -7302 412 32130 45911 94746 -196307 6424 70637 124076 101121 26320 88486 204086
$$ [...]
##END NTUPLES=NMR SPECTRUM
##END=
