##TITLE=Analysis number 327487
Compound Code rf 02972
Project Code adrs 
Chemist Name prosynth
##JCAMPDX= 6.0         $$ Bruker NMR JCAMP-DX V2.0
##DATA TYPE= NMR SPECTRUM
##DATA CLASS= NTUPLES
##ORIGIN= Bruker BioSpin GmbH
##OWNER= nmr
$$ XWIN-NMR		Version 3.5
$$ Tue Mar 27 11:32:10 2007 GMT Daylight Time (UT+1h)  MAYBRIDGE\nmr@NMR_250MHZ
##.OBSERVE FREQUENCY= 250.131544655141
##.OBSERVE NUCLEUS= ^1H
##.ACQUISITION MODE= SIMULTANEOUS (DQD)
##.ACQUISITION SCHEME= undefined
##.AVERAGES= 16
##.DIGITISER RES= 18
##SPECTROMETER/DATA SYSTEM= dpx250
##.PULSE SEQUENCE= zg30
##.SOLVENT NAME= DMSO
##.SHIFT REFERENCE= (INTERNAL, DMSO, 0, 16.522)
##AUDIT TRAIL= $$ (NUMBER, WHEN, WHO, WHERE, WHAT)
$$ ##TITLE= Audit trail, XWIN-NMR		Version 3.5
$$ ##JCAMPDX= 5.01
$$ ##ORIGIN= Bruker BioSpin GmbH
$$ ##OWNER= nmr
$$ C:\u/data/dgb/nmr/ADRS/2170/pdata/1/auditp.txt
$$ ##AUDIT TRAIL=  $$ (NUMBER, WHEN, WHO, WHERE, WHAT)
(   1,<2007-03-27 11:31:46.94 +100>,<MAYBRIDGE\nmr>,<NMR_250MHZ>,
      <created by zg, POWCHK disabled, PULCHK disabled
       configuration hash MD5:
       49 4B E0 1D 92 C2 6B 37 9F E6 65 BC 52 41 86 1D
       data hash MD5: 64K
       26 35 89 EB A8 9D 1F 7A EE 22 E4 F9 32 5C 85 D1>)
(   2,<2007-03-27 11:32:00.75 +100>,<MAYBRIDGE\nmr>,<NMR_250MHZ>,
      <Start of raw data processing
       ef LB = 0.3 FT_mod = 6 PKNL = 1 SI = 32K 
       data hash MD5: 32K
       D1 7C D7 7E E8 A4 9C C3 60 70 26 E6 11 87 C8 1E>)
(   3,<2007-03-27 11:32:02.33 +100>,<MAYBRIDGE\nmr>,<NMR_250MHZ>,
      <apk 
       data hash MD5: 32K
       6D 3B 24 CE F4 CF 0A D3 A3 81 5F 5F 37 0D 2C 72>)
(   4,<2007-03-27 11:32:03.10 +100>,<MAYBRIDGE\nmr>,<NMR_250MHZ>,
      <abs ABSG = 5 
       data hash MD5: 32K
       2B 28 78 05 A1 8B 26 D1 0C D6 B2 0A 76 43 C1 0A>)
$$ ##END=
$$ 
$$ hash MD5
$$ 5F 0F B8 9C A4 34 BE 23 5F 4D E1 4E 9C B3 F5 C0
##$RELAX= 
##$RELAX= 
##$RELAX= 
##$RELAX= 
##$RELAX= 
##$RELAX= 
##$RELAX= 
$$ Bruker specific parameters
$$ --------------------------
##$DU= <C:\u>
##$EXPNO= 2170
##$NAME= <ADRS>
##$PROCNO= 1
##$TYPE= <nmr>
##$USER= <dgb>
##$AMP= (0..31)
100 100 100 100 100 100 100 100 100 100 100 100 100 100 100 100 100 100 
100 100 100 100 100 100 100 100 100 100 100 100 100 100 
##$AQSEQ= 0
##$AQ_mod= 3
##$AUNM= <au_zg>
##$AUTOPOS= <19 >
##$BF1= 250.13
##$BF2= 250.13
##$BF3= 250.13
##$BF4= 250.13
##$BF5= 500.13
##$BF6= 500.13
##$BF7= 500.13
##$BF8= 500.13
##$BYTORDA= 1
##$CFDGTYP= 0
##$CFRGTYP= 5
##$CHEMSTR= <none>
##$CNST= (0..31)
1 1 145 1 1 1 1 1 1 1 1 1 1 1 1 1 1 1 1 1 1 1 1 1 1 1 1 1 1 1 1 1 
##$CPDPRG= <>
##$CPDPRG1= <>
##$CPDPRG2= <>
##$CPDPRG3= <>
##$CPDPRG4= <mlev>
##$CPDPRG5= <mlev>
##$CPDPRG6= <mlev>
##$CPDPRG7= <mlev>
##$CPDPRG8= <mlev>
##$CPDPRGB= <>
##$CPDPRGT= <>
##$D= (0..31)
0 1 0 0 0 0 0 0 0 0.06 0 0 0 0 0 0 0.0002 0 0 0 0 0 0 0 0 0 0 0 0 0 0 
0 
##$DATE= 1174991505
##$DBL= (0..7)
120 120 120 120 120 120 120 120 
##$DBP= (0..7)
150 150 150 150 150 150 150 150 
##$DBP07= 0
##$DBPNAM0= <>
##$DBPNAM1= <>
##$DBPNAM2= <>
$$ [...]
##$SUBNAM6= <"">
##$SUBNAM7= <"">
##$SUBNAM8= <"">
##$SUBNAM9= <"">
##$SW= 20.6930455092707
##$SWIBOX= (0..15)
0 0 3 0 0 0 0 0 0 0 0 0 0 0 0 0 
##$SW_h= 5175.983436853
##$TD= 65536
##$TD0= 1
##$TE= 683.16
##$TE2= 300
##$TE3= 300
##$TEG= 300
##$TL= (0..7)
0 120 120 120 120 120 120 120 
##$TP= (0..7)
150 150 150 150 150 150 150 150 
##$TP07= 0
##$TPNAME0= <>
##$TPNAME1= <>
##$TPNAME2= <>
##$TPNAME3= <>
##$TPNAME4= <>
##$TPNAME5= <>
##$TPNAME6= <>
##$TPNAME7= <>
##$TPOAL= (0..7)
0.5 0.5 0.5 0.5 0.5 0.5 0.5 0.5 
##$TPOFFS= (0..7)
0 0 0 0 0 0 0 0 
##$TUNHIN= 0
##$TUNHOUT= 0
##$TUNXOUT= 0
##$USERA1= <user>
##$USERA2= <user>
##$USERA3= <user>
##$USERA4= <user>
##$USERA5= <user>
##$V9= 5
##$VALIST= <valist>
##$VCLIST= <CCCCCCCCCCCCCCC>
##$VD= 0
##$VDLIST= <DDDDDDDDDDDDDDD>
##$VPLIST= <PPPPPPPPPPPPPPP>
##$VTLIST= <TTTTTTTTTTTTTTT>
##$WBST= 1024
##$WBSW= 4
##$XGAIN= (0..3)
0 0 0 0 
##$XL= 0
##$YL= 0
##$YMAX_a= 443903
##$YMIN_a= -427876
##$ZGOPTNS= <>
##$ZL1= 120
##$ZL2= 120
##$ZL3= 120
##$ZL4= 120
##$ABSF1= 16.522
##$ABSF2= -4.171173
##$ABSG= 5
##$ABSL= 3
##$ALPHA= 0
##$AQORDER= 0
##$ASSFAC= 0
##$ASSFACI= 0
##$ASSFACX= 0
##$ASSWID= 0
##$AUNMP= <proc_1d>
##$AZFE= 0.1
##$AZFW= 0.1
##$BCFW= 0
##$BC_mod= 0
##$BYTORDP= 0
##$COROFFS= 0
##$CY= 12.5
##$DATMOD= 1
##$DC= 0
##$DFILT= <>
##$DTYPP= 0
##$F1P= 14.0000005364418
##$F2P= -0.99999901652339
##$FCOR= 0.5
##$FTSIZE= 32768
##$FT_mod= 6
##$GAMMA= 0
##$GB= 0
##$INTBC= 1
##$INTSCL= 1
##$ISEN= 128
##$LB= 0.3
##$LEV0= 0
##$LPBIN= 0
##$MAXI= 10000
##$MC2= 0
##$MEAN= 0
##$ME_mod= 0
##$MI= 0
##$NCOEF= 0
##$NC_proc= -2
##$NLEV= 6
##$NOISF1= 0
##$NOISF2= 0
##$NSP= 0
##$NTH_PI= 0
##$NZP= 0
##$OFFSET= 16.522
##$PC= 1
##$PHC0= 218.0858
##$PHC1= 6.97367
##$PH_mod= 1
##$PKNL= yes
##$PPARMOD= 0
##$PSCAL= 4
##$PSIGN= 0
##$REVERSE= no
##$SF= 250.13
##$SI= 32768
##$SIGF1= 0
##$SIGF2= 0
##$SINO= 400
##$SIOLD= 32768
##$SREGLST= <1H.DMSO>
##$SSB= 0
##$STSI= 32768
##$STSR= 0
##$SW_p= 5175.98343685301
##$SYMM= 0
##$S_DEV= 0
##$TDeff= 65536
##$TDoff= 0
##$TI= <Analysis number 999999
Compound Code 99
Book Reference 9
Project Code 9>
##$TILT= no
##$TM1= 0
##$TM2= 0
##$TOPLEV= 0
##$USERP1= <user>
##$USERP2= <user>
##$USERP3= <user>
##$USERP4= <user>
##$USERP5= <user>
##$WDW= 1
##$XDIM= 32768
##$YMAX_p= 582888780
##$YMIN_p= -179669
$$ End of Bruker specific parameters
$$ ---------------------------------
##NTUPLES= NMR SPECTRUM
##VAR_NAME=  FREQUENCY,     SPECTRUM/REAL,   SPECTRUM/IMAG
##SYMBOL=    X,             R,               I
##VAR_TYPE=  INDEPENDENT,   DEPENDENT,       DEPENDENT
##VAR_FORM=  AFFN,          ASDF,            ASDF
##VAR_DIM=   32768,         32768,           32768
##UNITS=     HZ,            ARBITRARY UNITS, ARBITRARY UNITS
##FACTOR=    0.157963299565203, 1,           1
##FIRST=     4132.6476996994, 0,             0
##LAST=      -1043.33573715361, 0,           0
##MIN=       -1043.33573715361, -179669,     0
##MAX=       4132.6476996994, 582888780,     0
$$ Real data points
##PAGE= N=1
##DATA TABLE= (X++(R..R)), XYDATA
$$ [...]
14905d270k073R658j268q927p079J221O415J8677N978j1437p25M519Q460j326
14891A7823l767N270k761o603j0921O279J2069j6387n716L96n682p679M770o485
14877a9394R979K652J0005l451j1661j0065M873O630L637O595J4238N460n909
14864A3589R912o852m653q096p986M99l784J0100J5563L081J5k707j3428j1211
14850e958j2264J0856J3246k6l357p475j2357j2061J3517K2456O782p077K293
14837H575r570l396j908K872O444Q428P763K871r984k310Q156P579j1956p421
14823F143P381L83r540Q046P427p316n799J5596K1711P946k1796k6392j2273r795
14809a8278q21J8919K1776k608k0010q103O142J243k646K122J3391q659o484k27
$$ plain form
14905 -4270 -6343 3315 2047 -6880 -13959 -12738 -6323 12354 18332 6895 6170 10689 19149 17823
14891 17823 14056 19326 16565 9962 -959 5320 17389 1002 -4714 -4318 -10000 -17679 -12909 -19394
14877 -19394 -9415 -6763 3242 -209 -11870 -21935 -17062 -10432 -6795 -200 14038 19498 13589
14864 13589 23501 16649 11996 3900 -4086 -3587 -7371 2729 18292 21373 21388 18681 5253 -5958
14850 -5958 -18222 -7366 5880 5854 2497 -4978 -17335 -29396 -15879 6577 13359 6282 8575
14837 8575 -995 -4391 -6299 -3427 3017 11445 19208 22079 12095 9785 17941 25520 13564 6143
14823 6143 13524 13907 4367 12413 19840 12524 6725 22321 44032 51978 30182 3790 -8483 -18278
14809 -18278 -19099 -180 21596 18988 -1022 -9125 -2983 -1740 -4386 -2264 11127 2468 -4016 -4243
14795d243J131m154j43K793N127j3600k528R323J4096M226r416j4123l819P867
14781g463L18M904J4230j1090j8860J140N188N591q502J6014J3437j2590l519
14768a202R911l994j263j378K289Q351L068l288J9j1151k591K73l514J3550O222
14753A5302k042k2394k39M156J3075l434p246k60Q478l050p137K205N85Q678O095
14738A2772q474L50Q762Q023j1944j2025l269j730R002J470L935j700o227o511
14724g566N040j002q580l21Q444M335J2479l434n368p381K324J2816M939o685
14710A0040m331n797q644q387M670K472l504J746J2674R103k15k001k576R530
14696A4780j349j4330j276K175o12o100k113l427L599J0984Q895j8411n587O97
$$ plain form
14795 -4243 -3112 -7266 -7409 -4616 511 -13089 -15617 -6294 7802 12028 2612 -11511 -15330 -7463
14781 -7463 -7145 -2241 11989 899 -17961 -16821 -11633 -6042 -14544 1470 14907 2317 -1202
14768 -1202 8709 4715 3452 2074 4363 12714 15782 12494 12513 1362 -1229 -956 -4470 9080 15302
14753 15302 13260 -9134 -9373 -5217 7858 4424 -2822 -3082 5396 2346 -4791 -2586 -2001 6677 12772
14738 12772 4298 4648 13410 21433 9489 -2536 -5805 -7535 1467 2937 6872 5172 -1055 -7566
14724 -7566 -2526 -3528 -12108 -12429 -3985 350 12829 9395 4027 -3354 -1030 11786 16725 10040
14710 10040 5709 -88 -8732 -17119 -12449 -9977 -13481 -11735 939 10042 9827 7826 5250 14780
14696 14780 13431 -899 -2175 0 -612 -6712 -8825 -12252 -8653 2331 11226 -7185 -12772 -12075
14682a2075k136J5764K378N592n456R59M304M423Q941l345j4373L681J7478l841
14668B2294r285p011O162p172j3946O015P679n629r86O878J0313j4007p569J1104
14654D840Q073n354o315n546P652q497L891M637p075j1012q661M315M784j587
14640a5855L416J4891K0598k057j3752R695L233j1220L529J0973j1397j3197L935
14627B792M471j1000K963q120q405Q685P944o96J3986K401n553R015j829p014
14613I640N460p826j2106M714r59j1920p128J4039J7047J066j1078j704R520k001
14599F764p756m957J6426r369j4730J278K3670J7893P714p196n938j2227k995
14586H577K394L333K584o42j0718L773j246o024R126N861q097l318r911M973j403
$$ plain form
14682 -12075 -14211 1553 3931 9523 4067 5026 9330 13753 22694 19349 4976 8657 26135 22294
14668 22294 13009 5998 12160 4988 -8958 -2943 4736 -893 -1879 4999 15312 1305 -6264 4840
14654 4840 12913 7559 1244 -4302 3350 -5147 -1256 3381 -3694 -14706 -23367 -19052 -14268 -15855
14640 -15855 -12439 2452 23050 20993 7241 16936 20169 8949 12478 23451 12054 -1143 2792
14627 2792 7263 -3737 -774 -8894 -17299 -8614 -670 -1366 12620 15021 9468 18483 16654 9640
14613 9640 15100 7274 -4832 -118 -1077 -12997 -20125 -6086 10961 12027 949 -755 8765 6764
14599 6764 -992 -5949 10477 1108 -13622 -12344 11326 29219 36933 29737 23799 11572 8577
14586 8577 10971 14304 16888 16246 5528 9301 8055 2031 11157 17018 8921 5603 -4308 665 -738
14571g38j2576n54J188j050L153Q733R867l206P887K373K377o959J920j2055q488
14556h128J4379P538J697L7K940j3472M504K325l541K477R93J099m735q261M175
14541D027m161l563R940N60K350N053J653J405N680J0883L539J622k61j5986o394
14526A6347J3387K523J0170O057l520j6836k957R038O281J0338J8276P688J0030
14513H6822L4610M6838L9237M5008M5165N1018L8178J7375j9193m3473o2762o3411
14501B15412m5433k5793k5653l2300j7991O340J079q837l641n211q384m508R124
14488E4204K152l485j1603r675j4094r188j583J5687O202p431j1227N077P24m620
14474A1140J13l063J6936l39m879o771m322O154Q123o027k679K0182p146q619
$$ plain form
14571 -738 -13314 -13868 -12680 -13730 -10577 -1844 8023 4817 12704 15077 17454 10495 12415 360 -8128
14556 -8128 6251 13789 15486 15523 18463 4991 9495 11820 8279 10756 11749 12848 8113 -148 4027
14541 4027 -134 -3697 6243 6803 9153 14206 15859 17264 22944 33827 37366 38988 38727 22741 16347
14526 16347 29734 32257 42427 48484 44964 28128 25171 34209 40490 50828 69104 76792 86822
14513 86822 121432 168270 207507 252515 297680 348698 386876 404251 385058 341585 278823 215412
14501 215412 169979 144186 118533 86233 68242 74582 75661 66824 63183 57972 49588 45080 54204
14488 54204 56356 52871 41268 31593 17499 8311 6728 22415 28617 21186 9959 15036 15760 11140
14474 11140 11253 8190 25126 24787 19908 13137 8815 14969 23092 17065 14386 34568 27422 18803
14460A8803j0402M718m577M88n545J189J1645K029m148j3163l314M169K070L869
14446G831L447k334o807p391n909L597R933O374J1154N094j0237k425Q457O65
14432B1449q446l037O07R816j676j9229j1021P376o205M925J349K422Q96l688
14418d462N997P649M32K26L023J9853l4j4251l278R79m018J3510j0624k054K699
14403A5647m477Q41J4629o142l763j429J0170q949j2975o405L23O211O257k205
14389G733r953k229J1264P959k370p883M138j5m059o329R832J173j2078Q576L097
14374H856r999L608j1191L96L960R567M835j0656j372p197p974M430J0012K974
14360B49P72o30M053J4093N012J6256j0985k6449r652j2560P523J4486M358j3161
$$ plain form
14460 18803 8401 13119 8542 9030 3485 4674 16319 18348 14200 1037 -2277 1892 3962 7831
14446 7831 11278 8944 2137 -5254 -11163 -7566 2367 8741 19895 24989 14752 12327 20784 21449
14432 21449 13003 9966 10573 20389 18713 -516 -11537 -4161 -10366 -5441 -4092 -1670 -774 -4462
14418 -4462 1535 9184 9616 9842 12865 32718 32684 18433 15155 16134 12116 25626 15002 12948 15647
14403 15647 11170 12011 26640 20498 16735 15306 25476 16527 3552 -2853 -2530 3681 9938 7733
14389 7733 -2220 -4449 6815 14774 12404 4521 8659 8644 4585 -1744 8088 9261 -2817 5759 8856
14374 8856 -1143 2465 -8726 -8330 -4370 5197 10032 -624 -1996 -9193 -17167 -12737 -2725 249
14360 249 1021 391 4444 18537 23549 39805 28820 2371 -7281 -19841 -12318 2168 6526 -6635
14346f635M727L576J3823j4933j2643J3157J2684K4393J6777L109L932L645O345
14333G1957j0795q152K718O344n540k668p159m240M195j6559n853j217J7097K503
14319D2631l33n688n039Q80k670j2448n996K36M63Q761j004M878P179j947L90
14304C0293Q92R055L067L578r70o229j935n613j3953Q508J6010K111Q685P579
14290F1078P311J3339J20k0139l252J8768M097k377L306J395j1391N224p250r585
14276F0644j2930k986M026N031j913j7143N388Q935j456M806K853r115j3346L949
14262C6743N309n283n793K084m198K903O31j2396p417Q337K1345K648R886J4181
14248F8980J361j1298j4205j2303j7653j7985P85J8206J111J928j192O959L327
$$ plain form
14346 -6635 -1908 1668 15491 558 -12085 1072 13756 38149 54926 58035 61967 65612 71957
14333 71957 61162 53010 55728 62072 56532 53864 46705 42465 46660 30101 24248 23031 40128 42631
14319 42631 42298 36610 31571 32451 29781 17333 11337 11573 12036 20797 19793 24671 31850 29903 30293
14304 30293 31185 40240 43307 46885 45915 39686 37751 32138 18185 26693 42703 44814 53499 61078
14290 61078 68389 81728 81848 61709 58457 77225 81322 78945 82251 83646 72255 77479 70229 60644
14276 60644 47714 44728 48754 53785 51872 34729 40117 49052 47596 52402 55255 46140 32794 36743
14262 36743 42052 36769 30976 33060 28862 31765 32396 20000 12583 20920 42265 44913 54799 68980
14248 68980 70341 59043 44838 32535 14882 -3103 -2318 15888 16999 18927 17735 24694 28021
14235B8021J0673K1643j2877l2101p136Q053o933M892L2327J8532j176j1135M449
14222E7232k200j6035o42Q496p915o210j2120M822J6506m315N467j1357l494J340
14208B9575M158J1316K221j562j1822k133J6290J8286l379j7299m146j402J95
14195D0298q000J1548J4560l945l377J4289r408j0134r546k0221o254j7870j1094
14182a9154O924K1404J619M76L846O879m882r151L137N040q868j0683M299J4410
14168A5296J2481K7863J2540L1568K4909J2806J3438J327r481r737p592p10K606
14155A27314p492j3391m859o463R08j1q876k851K0282P66p59p606p437J042j9702
14140G0865P15m706k666R682R286k512o712R83N03j56R93n215m653P968k942M562
$$ plain form
14235 28021 38694 60337 47460 15359 8223 16276 9343 14235 46562 65094 63918 52783 57232
14222 57232 55032 38997 38355 46851 38936 32726 20606 25428 41934 37619 43086 31729 28235 29575
14208 29575 33733 45049 47270 45708 33886 31753 48043 66329 62950 45651 41505 40103 40298
14195 40298 32298 43846 58406 54461 51084 65373 55965 45831 36285 16064 9810 -8060 -19154
14182 -19154 -12230 9174 10793 11269 15115 21994 17112 7961 11098 16138 7270 -3413 886 15296
14168 15296 27777 55640 68180 99748 124657 137463 150901 152228 142747 133010 125418 124708 127314
14155 127314 119822 106431 101572 95109 96017 96006 87130 84279 104561 105327 104568 96962 89525 90567 70865
14140 70865 71580 66874 64208 73890 83176 80664 73952 74935 75438 75282 76275 71060 66407 74375 71433 75995
14124G5995J3683J516J4262J531j93J973l01J7217m529k7100J1317J8279o566
14111A17084j4347J335j700M239Q109N819R319J6003R868O597j4214Q047J8138
14098A74297r4j520O492O143L819J0580K3973P574K3411J2645O362N249q305J322
14084B71948J4931J7809P953J85n549O598J8994J0514J4377K3409P530L1086J6616
14071D36401K0215M0750L2924K4249J5547J7663M5871O0225N8012M3991M9039
14060H44887N8128O8714O8373R0496J07285J19778J34283J43704J61104K15207
14050B011959K63852L23225M02676M99722O15137P59278R10560J106788J352724
14041H245921J762434K488494L631909N319320P608367J0422071J3281888J5047966
$$ plain form
14124 75995 89678 91194 105456 106987 106794 108767 108466 125683 121154 94054 105371 123650 117084
14111 117084 102737 104072 102372 106611 114720 120539 129858 145861 155729 162326 148112 156159 174297
14098 174297 174203 172683 179175 185318 189137 199717 223690 231264 254675 267320 273682 278931 270626 271948
14084 271948 286879 304688 312641 312826 307277 313875 332869 343383 357760 381169 388699 419785 436401
14071 436401 456616 497366 530290 554539 570086 587749 633620 693845 751857 795848 844887
14060 844887 903015 971729 1040102 1130598 1237883 1357661 1491944 1635648 1796752 2011959
14050 2011959 2275811 2599036 3001712 3501434 4116571 4875849 5786409 6893197 8245921
14041 8245921 10008355 12496849 16128758 21448078 29056445 39478516 52760404 67808370
14033F7808370J4122840R246327M31643r270548j4979566j5540531j3224368j0081876
14025B8512291p175237m943410l404769k364106j698835j290531j072247r24798
14017E638358q05377p06848n95395m74990l90944l18415k72644k10905j90598
14008A672242j51469j29599r8378r5842r8997r6476p4806n5474o7666n6322m1238
13997G05975l9215l9651l1029l8162k7893k1457k2918l1445j9169j0166k4460
13986D00410k8877k9626j3077j2506j8857k2224j5400j3663j5519k2061L171n283
13974B06488j8141r185n345m735j726O282j811l032N791m406j0847r975j0264
13961A39094m072k195J578j889P242Q163j6407j0245k585N227m311j1354j728
$$ plain form
14033 67808370 81931210 91177537 91609180 82338632 67359066 51818535 38594167 28512291
14025 28512291 21337054 16393644 12988875 10624769 8925934 7635403 6563156 5638358
14017 5638358 4832981 4126133 3530738 3055748 2664804 2346389 2073745 1862840 1672242
14008 1672242 1520773 1391174 1292796 1196954 1097957 1001481 926675 871201 803535 747213 705975
13997 705975 666760 627109 596080 557918 530025 508568 485650 454205 435036 424870 400410
13986 400410 371533 341907 328830 316324 297467 275243 259843 246180 230661 208600 211771 206488
13974 206488 188347 179162 173817 169082 167356 173638 171827 168795 174586 170180 159333 149358 139094
13961 139094 135022 132827 134405 132516 139758 147921 131514 121269 118684 123911 119600 108246 106518
13948A06518m307K746l572j6391K910J7259j743m847M536j919p012J3954k511
13935A05621j4049k1507q134l601k418j212Q328J11P576m631o151M216k530j8332
13921D3287n336O726m421p366O049k507J480N275q522o37j222n919o611J492J470
13906B3238q49P211M706q274j2257p049k180m351L310J8760J9574J6363J2079
13893G0281P422O878m848M650o058j9460j4657K484Q268k90j4076R724J7563j5143
13879E2738q251m484P71j7477j0814L997J836J1916L241m115J43n030m361m02
13865A9708q82q015l693O94k49P837q423j0085M734O913j013q588J959N982K923
13850I802N731J2075m000j4430j0687j83R970Q46K750k928N243O332L759k365
$$ plain form
13948 106518 102211 104957 101385 84994 87904 105163 103420 98573 103109 101190 94178 108132 105621
13935 105621 91572 70065 61931 58330 55912 54700 63028 63139 70715 66084 59933 64149 61619 43287
13921 43287 37951 44677 40256 32890 38939 36432 37912 43187 34665 34028 32806 26887 20276 21768 23238
13906 23238 22389 29600 34306 26032 13775 6726 4546 195 3505 22265 41839 58202 70281
13893 70281 77703 84581 79733 84383 78325 58865 44208 46692 54960 54670 40594 50318 67881 52738
13879 52738 44487 40003 40774 23297 12483 16480 18316 30232 33473 29358 29501 24471 20110 19708
13865 19708 18826 10811 7118 7812 7563 15400 6977 -3108 1626 8539 7526 -1062 897 6879 9802
13850 9802 15533 27608 23608 9178 -1509 -1692 8278 9124 11874 8946 14189 20521 24280 21915
13836B1915j1248j1695P540M394K641J2985Q050m990j4156O681q45n840q082P241
13822A4591N556k136l58n341M297r382M253l335m680K066l052p821k031Q188n640
13807d825l419K341Q095r670J1637K850j5893n208r155L320N70M056P626P115
13793e60Q687P285j424o407J2227O650o622j3363q562O200k883j494r644j725
13779a1635O4M415N622R504J980J2416M016K856Q461j2524j2934R257O209o942
13765B0765k0631r4L1239P165j3411m346J879q324p040j574K983N210L642k789
13751A4674j4443Q749O519k441o008m4k877n875k724j1653N478N484N88J231J735
13736a607j1400j317r129p552j191J805L694m615R245J4J070n046J3200K6257
$$ plain form
13836 21915 10667 -1028 6512 10906 13547 26532 34582 29592 15436 22117 21272 15432 7350 14591
13822 14591 20147 18011 17653 12312 16609 7227 11480 8145 3465 5531 2479 -5342 -7373 815 -4825
13807 -4825 -8244 -5903 2192 -7478 4159 7009 -8884 -14092 -23247 -19927 -19357 -15301 -7675 -560
13793 -560 8127 15412 13988 7581 19808 26458 19836 6473 -2089 4111 1228 -266 -9910 -11635
13779 -11635 -11571 -7156 -1534 7970 9950 22366 26382 29238 37699 25175 12241 21498 27707 20765
13765 20765 134 40 31279 38444 25033 20687 22566 14242 7202 5628 8611 13821 17463 14674
13751 14674 231 8980 15499 13058 7050 7006 4129 -1746 -4470 -16123 -10645 -5161 -4573 -3342 -1607
13736 -1607 -13007 -14324 -23453 -31005 -32196 -30391 -26697 -31312 -22067 -22053 -20983 -26029 -12829 13428
13722A3428j639J1940J1110p365r794l458J0831k671j7185L012L383M767L593
13709A9952k893j191K855J720o467q88L51p457m459J647J427P432O475j659j654
13694A5191q599J498j977P365J2239n736j439N078J7j7628j0083Q313J745j5189
13680i205j2115J3928Q220j491n270O859j93M530j1471P127K806o565l097Q095
13666B158P457j1256q303J6383J144j2145j1583M391J955N657N281O10K202m673
13652g22j066J303R383l237k685o924O786J2184q45l030N695J9844r55j0212r033
13637A6486j762m797M184K048J927J2207p649j0920l613L185P824L993j1829p616
13623C668R573n10j2644q746J4324M963J3494J506j5314m292O722Q481L48k2720
$$ plain form
13722 13428 11789 23729 34839 27474 17680 14222 25053 22382 5197 8209 11592 16359 19952
13709 19952 17059 15868 18723 20443 13976 13088 13439 5982 1523 3170 4597 12029 18504 16845 15191
13694 15191 6592 8090 6113 13478 25717 19981 18542 23620 23637 6009 -4074 4239 5984 -9205
13680 -9205 -21320 -7392 828 -663 -5933 926 733 5263 -6208 919 3725 -2840 -5937 2158
13666 2158 9615 -1641 -9944 6439 7583 -4562 -16145 -11754 -9799 -4142 1139 1749 3951 -722
13652 -722 -1788 -485 8898 5661 2976 -3948 2838 15022 14177 11147 16842 36686 35731 25519 16486
13637 16486 14724 9927 14111 16159 18086 30293 22644 11724 8111 11296 19120 23113 11284 3668
13623 3668 13241 12731 87 -8659 5665 10628 24122 25628 10314 6022 12744 21225 21573 -1147
13609a147j7965R885J1628k124l545J2370L259J551k835q3J2360K8017K2342J5055
13595H8768J7535K2778J8352k2607l1549k6107j8640k5048j7157N55Q939L644
13583A9463k401N907N269l440J317q048j5165l104J0002J0195l051J31q046l120
13569E909J3414L906N011J3625L512K767J4392P136L831N759K0961J3677Q675
13556A22575L3478L1841M5976P6502M2696M3811J2779j5139k9751n1580o6496
13545B46692l6413m0182l9495k8765k1955q357n531q862j6952j4006R640K526
13533C8340n802k311n391p300n418P005J4163K598J094M179j1214j0553P62n711
13519A4441Q388r073j0206k854l164j3926o123r91N315J3328Q207j1875j2728
$$ plain form
13609 -1147 -19112 -9227 2401 277 -3268 9102 12361 13912 11077 10994 23354 51371 73713 88768
13595 88768 106303 129081 147433 124826 93277 67170 48530 23482 6325 6880 15819 19463
13583 19463 17062 22969 28238 24798 26115 18067 2902 -202 9800 19995 16944 17075 9029 5909
13569 5909 19323 23229 28240 41865 45377 48144 62536 69672 73503 79262 100223 113900 122575
13556 122575 156053 187894 233870 310372 353068 396879 409658 394519 364768 313188 246692
13545 246692 210279 170097 130602 101837 79882 71525 65994 57132 40180 26174 35814 38340
13533 38340 32538 30227 24836 17536 12118 19123 33286 35884 36978 41157 29943 19390 20152 14441
13519 14441 22829 13756 3550 696 -2468 -16394 -22517 -23508 -18193 -4865 3342 -8533 -21261
13506b1261J0703R716j1157q322J0972O962O404K75n043j1051L140r03o19J2527
13492B343P681j971n658q418l884K102J1248N442N163m376q246J3341l741K06
13478A1232R210j262o787j6530N98P434K748j966J4645k918k036p390J2147l160
13464A5965j532q228k3720q244J1662P435J3303K726n147j3480r120p380R600
13451a6160J0485o028N59O904O757k197M965J0774K0392r209R0l101l027r205
13437A1999n257J073J319N306J2143n54l657k0728l224O914R951K884j5433n563
13423b827J0935R079O026l160p084j222Q001K204j1303q833j293N351r864K881
13409a109J2379l677j3363k100m948j376q743J247K281L662P127O368J0554m784
$$ plain form
13506 -21261 -10558 -842 -11999 -20321 -9349 -2387 4017 4292 -751 -11802 -8662 -9565 -10184 2343
13492 2343 10024 8053 2395 -6023 -9907 -7805 3443 8885 14048 9672 1426 14767 11026 11232
13478 11232 20442 19180 12393 -4137 -3539 3895 6643 4677 19322 16404 14368 6978 19125 15965
13464 15965 14433 6205 -17515 -25759 -14097 -6662 6641 9367 4220 -9260 -18380 -25760 -16160
13451 -16160 -5675 -11703 -11144 -4240 2517 320 5285 16059 36451 27242 27332 24231 21204 11999
13437 11999 6742 7815 9134 14440 26583 26029 22372 1644 -1580 5334 15285 18169 2736 -2827
13423 -2827 8108 17187 23213 20053 12969 11747 19748 21952 10649 1816 523 5874 -3990 -1109
13409 -1109 11270 7593 -5770 -7870 -12818 -14194 -22937 -21690 -19409 -15747 -8620 -2252 8302 3518
13395C518m886n212L508L823j396j421o019J240M7q56r602J4881J2743q25L739
13380A3282N786n630r632j5798l643R894J770R77J0848J474j2187q947j3635p634
13366c3075K522P870J4209J7669R19k3527o131j990J1166J2349j6453q288L755
13353a9005k331o559R470K0428R666l589n780p326o363n337P709J969M782j4790
13339a7056k909l221L238J225l373J1960J078J627K571R973P88m094o722p201
13325a2116K546J280J964J5205K199m246j5308j301M37Q778K3331n130o019o48
13311A0972j994J739O322j235r92m625j7820n671R967j1274M05M778J8053M422
13297A3047O529o960j2778o85O12q305O70J3949J3995J4026p052l091j0106j4839
$$ plain form
13395 3518 -1368 -6580 -3072 751 -645 -2066 -8085 -6845 -6798 -7654 -17256 -2375 10368 9543 13282
13380 13282 19068 13438 3806 -11992 -15635 -5741 -3971 -2994 7854 9328 -2859 -11806 -25441 -33075
13366 -33075 -30553 -22683 -8474 9195 10114 -13413 -19544 -21534 -10368 1981 -14472 -22760 -19005
13353 -19005 -21336 -27895 -18425 2003 11669 8080 2300 -5026 -11389 -16726 -9017 -7048 -2266 -17056
13339 -17056 -19965 -23186 -19948 -18723 -22096 -10136 -9058 -7431 -4860 5113 5901 1807 -4915 -12116
13325 -12116 -9570 -8290 -6326 8879 11078 6832 -8476 -9777 -9340 -562 22769 17639 11620 10972
13311 10972 8978 10717 17039 15804 14812 10187 -7633 -13304 -3337 -14611 -14206 -9428 8625 13047
13297 13047 19576 12616 -162 -847 -235 -8540 -7870 6079 20074 34100 27048 23957 13851 -988
13283i88j1390n790Q171k354j506L348M319m691L008J5562M506j1833p186p799
13269a4623J0446J5942q944j0618j048n116J296J6821J0339p043q127M179J1787
13256A5291K607j1672j6538K268R386L270j2743j7055J4975K1599N268j953o058
13243H645n541n875j779q45J0251L291L041L623L665q01j3888q019k142L593M528
13228A747O608m162K342l77Q420m980q306l894n718j750Q12p467M3M088J320J415
13212i859K28j391j2936p4k835N182J6238J3730k585p502o052q097Q912j5148
13198b2189j5710J7497Q798K411R098L501m926m106N554J311k543k861M934L025
13184C794j4180l662P858K536j1214l976N383J4146M903n054o468j4809L455L935
$$ plain form
13283 -988 -12378 -18168 -9997 -12351 -13857 -10509 -6190 -10881 -7873 7689 12195 362 -6824 -14623
13269 -14623 -4177 11765 2821 -7797 -8845 -13961 -12665 4156 14495 7452 -675 3504 15291
13256 15291 17898 6226 -10312 -8044 1342 4612 -8131 -25186 -10211 11388 16656 14703 8645
13243 8645 3104 -2771 -4550 -5395 4856 8147 11188 14811 18476 17675 3787 -4232 -6374 -2781 1747
13228 1747 8355 4193 6535 6158 14578 9598 1292 -2602 -8320 -10070 -9258 -16725 -16682 -12594 -11274 -9859
13212 -9859 -9631 -11022 -23958 -24032 -26867 -21685 -5447 8283 5698 -1804 -7856 -15953 -7041 -22189
13198 -22189 -37899 -20402 -11604 -9193 -95 3406 -1520 -5626 -72 1239 -1304 -4165 769 3794
13184 3794 -10386 -14048 -6190 -3654 -14868 -18844 -13461 685 5588 534 -5934 -20743 -17288 -13353
13170a3353O656J1697N379j2179q406P067N812N93j1391N80P214o91p842O14J7899
13155I649M328M494L310j6054r870J3J3502K360j8246j2190N987J1037m928P416
13141H08L506K928j5910O082J8939p911j3853l131q092J8319o37l040Q718K002
13127H728m682n73o521j559q63l084M244j5008N034J0429O185p688K346k759j2207
13112a7978j922O95K76n21Q554j0048n960K491N869J4242J7156N616l15j4466
13098C689n301J1586J863M098j7915q379J0721O519J0538L074j0863J108J963
13085A2701R11r842l54M30j88O193K343j1718q196k027k428o114J0410Q934k005
13070i50P226L954J0753L593j1410j9644l896J0303p210K673J4714P283L654o08
$$ plain form
13170 -13353 -6697 5000 10379 -1800 -10206 -3139 2673 3266 -8125 -7545 -331 -1022 -8864 -8250 9649
13155 9649 13977 18471 21781 5727 -4143 -4130 9372 11732 -6514 -18704 -12717 -1680 -6608 808
13141 808 4314 7242 -8668 -2586 16353 8442 -5411 -8542 -16634 1685 1048 -1992 6726 8728
13127 8728 4046 3473 -3048 -4607 -5470 -8554 -4310 -19318 -14284 -3855 2330 -5358 -3012 -5771 -17978
13112 -17978 -19900 -19205 -18929 -19450 -10896 -20944 -26904 -24413 -18544 -4302 12854 18470 18155 3689
13098 3689 -1612 9974 11837 15935 -1980 -10359 362 6881 17419 20493 9630 10738 12701
13085 12701 13612 3770 3416 3846 3658 9851 12194 476 -7720 -9747 -12175 -18289 -7879 1055 -950
13070 -950 6276 10230 20983 24576 13166 -6478 -10374 -71 -7281 -4608 10106 17389 21043 20435
13056B0435L936K64n362j0387j414M451l01j2841N443O700L900K184n780L461
13042A4689j387n113j7764r276m498J2925n309p946O110J0233q135J650J2389
13029a432R154J064l397N197K702j4113o287J3484j1664p335N553J4696k922k43
13015D457J1316M824J821Q538R2m283p857j2947j3919j2794N419R707k332l828
13001a1786l871K982j0024m664J7181j870o636O232N710P886m206j2607k908R374
12987i207O747K831J6438J3090O14n943L865k30j3190j1474r100l381r67M578
12973e329l124l333J0024M747k154J373r168r377R724J0221j2872O609J3151M372
12959A4864N28j5227j4597k985L457q066J724O017o093O465P413L713j621n312
$$ plain form
13056 20435 24371 24635 19273 8886 7472 11923 11622 -1219 4224 10924 14824 17008 11228 14689
13042 14689 13302 8189 -9575 -18851 -23349 -10424 -15733 -23679 -17569 -7336 -15471 -13821 -1432
13029 -1432 7722 8786 5389 10586 13288 -825 -7112 6372 -5292 -12627 -7074 7622 4700 4457
13015 4457 15773 20597 22418 30956 31048 26765 18908 5961 -7958 -20752 -15333 -5626 -7958 -11786
13001 -11786 -15657 -12675 -22699 -27363 -10182 -12052 -18688 -12456 -6746 1140 -3066 -15673 -18581 -9207
12987 -9207 -2460 371 16809 29899 30513 24570 28435 28205 15015 3541 -5559 -8940 -9907 -5329
12973 -5329 -8453 -11786 -1762 2985 831 2204 -6964 -16341 -6617 3604 -9268 -2659 10492 14864
12959 14864 15392 165 -14432 -17417 -13960 -22026 -20302 -14285 -20378 -13913 -6500 -2787 -4408 -9720
12945i720j0176n339O287J0477o053O261J3230J1099J1150r981j4802M623q25
12932F231J104J2895k627j158q908L127N446j3103L501J3875j6277j5567M182
12919g279O149m52O524k613O347R264j5450k366K820K428l531l412L44n415M668
12904a974j820p4j4142j824N970L033m325K514j399J0093l028N48p55r884Q515
12889h552O919L688j978L564j2082p531J1758k641J1566k001n678O680J329q040
12875b999J604n84O96P227j798P899n693k926L516P892j1207P718P646O496l630
12860B1857j987M11J079n478k0183j8246M947n71P021l084L732Q653P16Q052o252
12845F67j9986P360Q083K619J3077N267j4950p232J1904M334j6133K947R71n538
$$ plain form
12945 -9720 -19896 -25235 -18948 -8471 -14524 -8263 4967 16066 27216 17235 2433 7056 6231
12932 6231 7335 20230 17603 16445 7537 10664 16110 3007 6508 20383 4106 -11461 -7279
12919 -7279 -1130 -1582 4942 2329 8676 17940 2490 124 2944 5372 1841 -1571 -1227 -6642 -1974
12904 -1974 -3794 -3868 -18010 -19834 -13864 -10831 -15156 -12642 -14041 -3948 -6976 -6428 -7183 -17067 -8552
12889 -8552 -1633 2055 77 3641 -8441 -15972 -4214 -6855 4711 2710 -2968 3712 5041 -2999
12875 -2999 -1395 -1979 -1283 5944 4146 12045 6352 3426 6942 14834 3627 11345 18991 25487 21857
12860 21857 19870 20281 21360 15882 -4301 -22547 -17600 -18171 -11150 -14234 -10502 -1849 -1133 6919 667
12845 667 -19319 -11959 -3876 -1257 11820 17087 2137 -5095 6809 11143 -4990 -2043 -1072 -6610
12831f610J0188Q504j5147k633m095p586J5046R841P590N486o650J288P534m439
12817A8317o758N481J3542J1312j824j5642j11N780m502k627l690n948l854o735
12803B741Q203j95j203j7894m85K213m556q388q17J3731N974j2540j235N717N556
12788c178N18j982O191J486m273j0171k181J6393J1946r921o166L398m23J604
12774C241J639J0480n128q683m76L378P321n995M520J0536n137l839J607j7388
12760c924p025K38J0656M332K128K75l998P302O693r172p284r280R408q067q693
12745a6411N837J0599j880J788L677j46L04N68l992n385j713k111n554N182r45
12730a0182K95N093j667k236J6835k403P21Q266P749j229j2528q745l930k544
$$ plain form
12831 -6610 3578 12082 -3065 -5698 -9793 -17379 -2333 7508 15098 20584 13934 15222 22756 18317
12817 18317 11559 17040 30582 41894 40070 24428 24317 30097 25595 22968 19278 13330 9476 2741
12803 2741 10944 10749 9546 -8348 -8833 -6620 -11176 -19564 -20381 -6650 -676 -13216 -14451 -8734 -3178
12788 -3178 -2660 -4642 1549 3035 -1238 -11409 -13590 2803 14749 4828 -1338 2060 1637 3241
12774 3241 4880 15360 10232 1549 1073 4451 11772 5777 10297 20833 15696 11857 13464 -3924
12760 -3924 -10949 -10711 -55 4277 6405 6680 2682 9984 16677 7505 221 -9059 349 -7718 -16411
12745 -16411 -10574 25 -1855 -67 3610 3464 3768 4336 344 -5041 -6754 -8865 -14419 -9237 -10182
12730 -10182 -9887 -4794 -6461 -8697 8138 5735 6456 14722 22471 21242 8714 -31 -3961 -6505
12716f505q562J4404J0496j4151K057O771o762q69N492q843J652J5417j0388J0457
12702A0666L167k510k19J13j370P198o650M635j020q670o471P153K0289O694k2762
12687A0243l063k054k202J892L947l398J354j228q534k486l381n818j0760R62
12673b4526J8295J3565O48k767j660O530L157j4216J0530J0935j4750j0495p03
12660e457P102j3369p454J4302R637M432p621j2538O99l742O330K522k564P399
12646c22R295J956K676Q050n18k636n854n068l788j072J0383O023q829j4472q826
12631a3002n775J5986N265O107L823L284R287l511j0696r417l574P897J5882L530
12617B5086j9253l0829o87L812J3918J1024N841o314k1281l663l212j411L326
$$ plain form
12716 -6505 -15067 -663 9833 -4318 -2261 4510 -2252 -3121 2371 -6472 -4820 10597 209 10666
12702 10666 13833 11323 11104 11217 9847 17045 10395 15030 14010 5340 -1131 6022 26311 33005 10243
12687 10243 7180 5126 2924 4816 8763 5365 6719 5491 -3043 -5529 -8910 -14728 -25488 -24526
12673 -24526 -6231 7334 7982 5215 3555 10085 13242 -974 9556 20491 5741 -4754 -5457
12660 -5457 1645 -11724 -19178 -4876 4761 9193 1572 -10966 -10267 -14009 -7679 -5157 -7721 -322
12646 -322 8973 10929 13605 21655 21137 18501 12647 7579 3791 2719 13102 19125 10296 -4176 -13002
12631 -13002 -18777 -2791 2474 8581 12404 15688 24975 21464 10768 1351 -2223 5674 21556 25086
12617 25086 5833 -24996 -25683 -21871 -7953 3071 8912 2598 -18683 -22346 -25558 -26969 -23643
12604b3643J7572J426N117J3309J1655J3842n429j0185L060K071r549j3327j5067
12591i148r936M030l784j928J387J1424m52J905K850J5944O949q510j375M289
12577A3645n087q010j8911m583J0009N674q910k693n043r8O411R870Q830l32r732
12562h960P415R537l208n212O731o508n250m680N514J1075J2114j1584k5293p418
12548b5727K655R744J3138k860o24J4342p74p090M066M270j6494o34O265J398
12534A675L12l923o72M100K208P76P463O160J833q096k425j0730m377J4305K0554
12519B9163K83j9255k5633l24N783L611Q612o29r034J330J2402J842J1483k716
12505A6918m078n237O772J1124R44j1171j4004j0050p451R127J8885R922O59j3629
$$ plain form
12604 -23643 -6071 -4645 472 13781 25436 39278 33849 23664 26724 28795 19246 5919 -9148
12591 -9148 -19084 -15054 -18838 -20766 -19379 -7955 -8407 -6502 -3652 12292 19241 10731 9356 13645
12577 13645 8558 548 -18363 -22946 -12937 -7263 -16173 -18866 -23909 -24007 -17596 -7726 1104 772 -8960
12562 -8960 -1545 7992 4784 -428 6303 -205 -5455 -10135 -4621 6454 18568 6984 -18309 -25727
12548 -25727 -23072 -13328 -190 -3050 -3674 10668 9894 2804 6870 11140 -5354 -5988 277 1675
12534 1675 1987 -1936 -2608 1492 3700 4476 11939 18099 19932 11836 9411 -1319 -5696 8609 29163
12519 29163 29446 10191 -15442 -15766 -9983 -6372 2240 1611 -7423 -6093 6309 8151 19634 16918
12505 16918 12840 7603 14375 25499 26443 15272 1268 -8782 -16233 -7106 11779 21701 22360 8731
12491H731j0539K31L429j643j195J274M620r447j6500m10J5230J4248o698j2132
12477a0801O063K809J9276p402n745K459j6205L602o559r55j318P782M940j007
12463c061N040P620N838o210j1249M048K875n67k975N187K785l340q824j77r67
12448c977P939r88p47k43N519m049p836j447q663L27J0281J9284R148O49j2547
12433A2650j004J201L988j3663j5011J0736J4615L854l691m52N347l708N802L33
12419B0997j1577j465O364J182j855n594l724p512j5812J1852Q752K203j4021
12406a0210o067O357J2523R841l971j3344P556L723j0359j0555J3836J4194r367
12393D157k786J1843p588j1540J858R141l962p143o565j621j97j534Q434O313
$$ plain form
12491 8731 -1808 -1577 1852 209 -986 288 4908 -4539 -21039 -21449 -6219 8029 1331 -10801
12477 -10801 -4738 -1929 17347 9945 4200 6659 -9546 -5944 -12503 -13458 -14776 -6994 -2054 -3061
12463 -3061 1979 9599 15437 9227 -2022 2026 4901 4334 1359 6546 9331 5991 -2833 -3010 -3977
12448 -3977 3962 2974 2227 1984 7503 3454 -4382 -5829 -14492 -14165 -3884 15400 24548 25197 12650
12433 12650 11646 12847 16835 3172 -11839 -1103 13512 17366 13675 13223 18570 14862 20664 20997
12419 20997 9420 7955 14319 15501 13646 8052 4328 -3184 -18996 -7144 1608 3811 -10210
12406 -10210 -16277 -9920 2603 12444 8473 -4871 2685 6408 -3951 -14506 -670 13524 4157
12393 4157 1371 13214 5626 -5914 -4056 5085 1123 -6020 -12585 -14206 -14403 -15937 -7503 -1190
12379a190n417K2012J628n126j881l615l875o957o595R497M133M189P845n865
12365H783p222q29p24n954r341M371Q396m366n886o620k289R926J9398q719P763
12350F687L96r129l816K812J2096o354l709p94P822j2256j541K531j5756j4520
12336c5531J2840J4055N531j4239o367J789R854O992l826r830k179K974J5417
12323b520J0817j324O945p675q692N201P585L246j2519j0291J1297J5198N53n350
12309A2471j4707m084K217N90J3603P057j623r909j1013q082J5364R422j930j2318
12295b942J0232o921k2021L71k475K567J4399P477J473j980L49n169j0927q422
12281b3989o667O375L433O955J5776O55l851O909J299k997j4213j0302N625N931
$$ plain form
12379 -1190 -6607 15405 17033 11907 10026 6411 2536 -4421 -11016 -1519 2614 6803 14648 8783
12365 8783 1561 732 8 -5946 -15287 -10916 -2520 -6886 -12772 -19392 -21681 -11755 7643 -1076 6687
12350 6687 7083 -2046 -5862 -3050 9046 2692 -1017 -1811 6011 -6245 -7786 -5255 -21011 -35531
12336 -35531 -22691 -8636 -3105 -17344 -23711 -21922 -12068 -5076 -8902 -18732 -20911 -17937 -2520
12323 -2520 8297 6973 13918 6243 -2449 2752 10337 13583 1064 -9227 2070 17268 17821 12471
12309 12471 -2236 -6320 -4103 -3513 10090 17147 15524 5615 -5398 -13480 1884 11306 9376 -2942
12295 -2942 7290 369 -21652 -21281 -23756 -21189 -6790 687 2160 180 529 -4640 -15567 -23989
12281 -23989 -30656 -24281 -20848 -13893 1883 2538 -1313 5596 6895 3898 -10315 -20617 -14992 -9061
12267i061j1Q289N153k521L09K120N14k2051M865J8466m119L106J4320k566O407
12252B3220K809p841o397j1112P503N198k554q591Q904k060m320J331P814O98
12238A4602j0587n047p654o805J666J5186P20P748o905o245J541O995O975j3902
12224a712p362M295J3468j188l737N589p667j5299l088P968J5376K905O447M774
12210B0769J6641O862k788k594r906n270N374l455K997k600m357P855j3153j0731
12196E644J040j503j06k434J0509K0627o73j6624r727j1882P972R466J1960P616
12182C1885k745j148p725L945K783l742k72J773J0699O078k017R340q703n804
12168C4347j3277m052M936Q721P018o253J14J533j2303J975K888n332r404n122
$$ plain form
12267 -9061 -9072 -783 4370 1849 2158 4278 4792 -17259 -12394 6072 1953 5059 19379 16813 23220
12252 23220 26029 18188 11791 679 8182 13380 10826 2235 11139 9079 4759 6090 13904 14602
12238 14602 4015 -1032 -8686 -15491 -13825 1361 2081 9829 2924 -3321 -1780 5215 12190 -1712
12224 -1712 -9074 -4779 8689 7501 3764 9353 1686 -13613 -16701 -8733 6643 9548 15995 20769
12210 20769 37410 44272 41484 38890 28984 23714 29088 25633 28630 26030 21673 29528 16375 5644
12196 5644 6684 5181 5075 2641 13150 33777 33104 16480 6753 -5129 2843 12309 24269 31885
12182 31885 29140 27992 20267 24212 26995 23253 22981 24754 35453 41531 39514 48854 40151 34347
12168 34347 21070 17018 21954 30675 37693 31440 31554 33087 20784 22759 25647 20315 10911 5789
12154E789M934L755p746o421R06M62L88L891J744k270m473M161L381j653K237
12139I085O143q556k043M592L165K397j715K292j4955P485K432O92R331p064m441
12124H840P466J830m233J591o517m615J4181J1242m078j6510j6257O931N021N323
12110A0215P576n635N766j235q646m27j0453j606N606N718K881k889r180J1176
12096H867N855N089J829p837o492o320M390P875J1118Q807M148p703j7975j9774
12082h123p97J0463n412J841M401R631M965O626o42m687k141L535j016j0395K257
12067A0506J4618P164J95l725q833q82K966j1132j5808k2384r98J1030J1255Q640
12053B612m755k334O76K2331N593p117P71j0609R174m425p91J854J7067K0658
$$ plain form
12154 5789 10723 14478 6732 311 1217 1679 2067 5958 7702 5432 959 5120 8501 6848 9085
12139 9085 15228 6672 4629 9221 12386 14783 13068 15360 405 7890 10322 11014 20345 13281 8840
12124 8840 16306 18136 13903 15494 8977 4362 18543 29785 25707 9197 -7060 -129 4892 10215
12110 10215 17791 12156 17922 16687 8041 7614 -2839 -4445 1161 6879 9760 6871 -2309 8867
12096 8867 14722 19811 21640 13803 7311 991 5381 13256 24374 33181 37329 29626 11651 -8123
12082 -8123 -8920 1543 -3869 -2028 2373 12004 16969 23595 22953 18266 16125 19660 18644 8249 10506
12067 10506 25124 32288 32483 28758 19925 19043 22009 10877 -4931 -27315 -28313 -17283 -6028 2612
12053 2612 -2143 -4477 -3801 18530 24123 17006 17777 7168 16342 11917 11126 12980 30047 50705
12039E0705J1165P095j28K496L94k036J912N111j4699m13K317J3343J3067J3364
12025A03693j1195j9155j4208j9171j899j0620l595N93k511l914j698J649R89
12012A8958R471K4033J1762p514k824J2501J760k732m969o99L851L026P424o568
11998F7480r500N279O810N56q093p041J0955j1274k811J0442M633N607k543m348
11984F6152k164o840j7408J1635J9283K276j1106J709J0218O684J993O972k933
11971H6471j815p315l436J0643O26j4J1090N077J6159M306M251J1602J1506l45
11957A48806L849J5020j226m328n054J2561J3229O079J4287J1785J4371R112J0337
11944B48828J9540J8257K4332J7804P901K0598K6294L0709K6677K7500M1985L0185
$$ plain form
12039 50705 61870 68965 68837 71333 71727 69691 71603 76714 62015 61602 63919 77262 90329 103693
12025 103693 92498 73343 59135 39964 38065 27445 23850 24443 21932 18018 16320 17969 18958
12012 18958 28429 52462 64224 56710 53886 66387 68147 65415 60446 59747 63598 66624 74048 67480
11998 67480 57980 63259 70069 70625 62532 55491 66446 55172 52361 62803 67436 73043 70500 66152
11984 66152 63988 57148 39740 51375 70658 72934 61828 63537 73755 80439 82432 89404 86471
11971 86471 84656 77341 73905 84548 85174 85160 96250 101327 117486 121792 126043 137645 149151 148806
11957 148806 152655 167675 166449 162121 157067 169628 182857 188936 203223 215008 229379 238491 248828
11944 248828 268368 286625 310957 328761 336662 357260 383554 414263 440940 468440 510425 540610
11932E40610L1520M4037O1348P3874N9136O9965P9833J03582J19081J43967J54780
11921A481733J89062K47922L01572L72448M72885O01024Q02697J077622J494772
11912G041737K096237K979279M254700N893584P721731R088698Q296572K990653
11904E0363191n135779r768933r297385o956184m815930l318163k360944j695364
11896G014509j254868r52230p46735n82716m69804l80049l16176k57938k20178
11887A833815j78703j73793j59794j41020j13494p0657o5466p4942o7522m8106
11877G40318n6498n4842l0547l2458m3156k5423k6552l1214j5562j4226k2726
11866C87114l1971k4282k1810j6526p657j91Q82j4095l0070k4989j6481j0026
$$ plain form
11932 540610 572130 616167 677515 751389 810525 880490 960323 1063905 1182986 1326953 1481733
11921 1481733 1670795 1918717 2220289 2592737 3065622 3666646 4469343 5546965 7041737
11912 7041737 9137974 12117253 16371953 22265537 29987268 39075966 47372538 50363191
11904 50363191 45227412 35458479 26161094 19204910 14388980 11070817 8709873 7014509
11896 7014509 5759641 4807411 4060676 3477960 3008156 2628107 2311931 2053993 1833815
11887 1833815 1655112 1481319 1321525 1180505 1067011 996354 930888 855946 788424 740318
11877 740318 683820 628978 598431 565973 522817 497394 470842 439628 424066 409840 387114
11866 387114 355143 330861 309051 292525 284868 284677 285559 271464 241394 216405 199924 189898
11854A89898k0155l759Q12j8846j7316K132j1314r438j0208j558R728J1673O503
11841A28152K558j0605l78O52P89M986j6748j3308k577M232J0504o537j1386o040
11827H4294k153O97j1976k811m140L240Q195N202j41L42l392q292p729p12K08
11812F0832L057J482k707n051J405j0242j0458j440N342r963Q18j191m705K486
11798B9665M220L645m204p276q976j5088p749q395J0800M412n408n133M40N926
11784c121l03J0526M191J0407m667j0721N579n168m343L152J5691k771m083J0110
11770B4479K028J7486J868m170N762o18o929k078p415r771J0367J7608O981j7725
11756C7873O22O772n61j4261q886O351K291N307o167m876r269n244P545K005j0672
$$ plain form
11854 189898 169743 165984 166796 147950 130634 132766 121452 112014 101806 100248 109976 121649 128152
11841 128152 130710 120105 119727 120379 121168 126154 109406 96098 93521 97753 108257 101720 90334 84294
11827 84294 82141 82838 70862 68051 63911 67151 75346 80548 80407 80749 77357 69065 61336 60624 60832
11812 60832 63889 65371 62664 57613 59018 48776 38318 36878 42220 32257 33075 31884 27179 29665
11798 29665 33885 37530 33326 26050 17074 1986 -5763 -14158 -3358 1054 -4354 -9487 -9047 -3121
11784 -3121 -3424 7102 11293 21700 17033 6312 11891 6723 2380 5532 21223 18452 14369 24479
11770 24479 26507 43993 45861 41691 47453 46835 39906 37828 30413 20642 31009 48617 55598 37873
11756 37873 38495 45267 44706 30445 21559 27910 30201 35508 29341 24465 15196 9952 17497 19502 8830
11741H830j4654j0822Q778O628j649p595N746L157p026o30j1993L056J1493L74
11727f307Q10Q749J1177j944k663R20l532L83K37L59J817j0627o996M075N558
11712B016l467j640m543L084P2N228k01L568J5651l718j4155q388P944l799L408
11697A060L213J3898P801J917n702q901q228P97n657P235q122k864p192O779j0256
11682a4222M997J810Q852L014k339J4570j3451k591R435N681q365n810m100K758
11668B39p88j6364l159J4009J5908k721J424p789l51J3074j241j857N957j2093
11654D248j7083q578P561N705n18q81L244J0415J747O845m714m265J0829K700
11640A7255j059j635L84O501j4242q925Q806K965p382Q213R880j3916K074k304
$$ plain form
11741 8830 -5824 -16646 -7868 -1240 -2889 -10484 -4738 -1581 -8607 -9237 -21230 -18174 -6681 -6307
11727 -6307 -5497 3252 14429 12485 9822 10742 7210 7593 7830 8189 10006 -621 -7617 -3542 2016
11712 2016 -1451 -3091 -7634 -4550 -4478 750 549 4117 19768 16050 1895 -6493 1451 -2348 1060
11697 1060 4273 18171 25972 27889 22187 13286 5058 5855 198 7433 -689 -3553 -10745 -3966 -14222
11682 -14222 -9225 -7415 1437 4451 2112 16682 3231 640 10075 15756 7391 1581 -2519 239
11668 239 -549 -16913 -20072 -6063 9845 7124 8548 759 408 13482 12241 10384 16341 4248
11654 4248 -12835 -21413 -13852 -8147 -8665 -9546 -6302 4113 5860 12705 7991 3726 14555 17255
11640 17255 16196 14561 14945 21446 7204 -1721 7085 10050 2668 10881 20761 6845 8919 6615
11626F615j8729J262J6220J4000n395j6973J0087r432j4422M940O013N55j6142
11613b1401n88J7509Q549M622o392M68M713j4234p601J484K630j120o536L026
11599a4871o757L316J1223Q122J0746J1093K39K025m789p841n966q375J6287k658
11585A1794l453l653j1388o06o47j320M292M557J6296R730M122K336j214n231
11571B5615K908J128o330j0288k478j1502L065K1405M428m682j02j2467q435n204
11557b939j0154J4162L525M180n252l606o261J0276K739j47l348l624q619o000
11543a5068l161N441J968K173R321o8j2288n804J0861Q349J1693k84n862P05J003
11528H979k372n497J705N1M698m700J123j7442j0096J0735K449j822p865j0539
$$ plain form
11626 6615 -12114 -10852 5368 19368 13973 -3000 7087 -2345 -16767 -11827 -5814 -5259 -21401
11613 -21401 -21989 -4480 4069 8691 2299 2767 7480 -6754 -14355 -12871 -10241 -11361 -17897 -14871
11599 -14871 -21628 -18312 -7089 1033 11779 22872 23111 25136 20347 12506 6540 -1835 14452 11794
11585 11794 8341 4688 -6700 -7306 -7953 -9273 -4981 -424 15872 25602 29724 32060 30846 25615
11571 25615 28523 29651 23321 13033 10555 -947 2118 23523 27951 23269 23167 10700 2265 -2939
11557 -2939 -13093 1069 4594 8774 3522 -84 -6345 3931 6670 6523 3175 -449 -9068 -15068
11543 -15068 -18229 -12788 -10820 -8647 674 606 -11682 -17486 -6625 1724 13417 13133 7271 7976 8979
11528 8979 6607 1110 2815 2866 7564 2864 3987 -13455 -23551 -12816 -10367 -12189 -20054 -30593
11514c0593Q703J299m679J1146K0844j249p028n355r0o012k367J2327K2916R734
11500B9596j2014n260n254r800M407P605P72O562M793R59l483k757j1487q449
11486c810m290p679j750N759o197r523Q846J1657J928k062L529K0073J9259j5660
11472B0080p093j0919n718j2687M758P237J2292k052l889N836q884N443N073k828
11458F649k812J1609k534l764p478J111m659j2535M222J5415o807P362K445N486
11444A3710p183k1413n081Q238J0937r013n515J0632M14j978O710k174j5132J2760
11430d088O426j9002k418O556J2047K449R271M658l495j108j437q13N120q393
11416E773k1757K89J4804J52q252R26Q079p415O467M795k095J5706j203r289L297
$$ plain form
11514 -30593 -21890 -20591 -25270 -14124 6720 5471 -1557 -6912 -7002 -13014 -15381 -3054 19862 29596
11500 29596 17582 12322 7068 -2732 1675 9280 10052 16614 21407 22366 18883 16126 4639 -3810
11486 -3810 -8100 -15779 -17529 -11770 -17967 -27490 -18644 -6987 -5059 -7121 -3592 16481 35740 20080
11472 20080 12987 2068 -3650 -16337 -11579 -4342 7950 5898 2009 7845 -1039 4404 9477 6649
11458 6649 3837 15446 12912 9148 1670 2781 -1878 -14413 -10191 5224 -1583 5779 8224 13710
11444 13710 6527 -14886 -19967 -11729 -792 -9805 -15320 -4688 -4274 -6252 458 -1716 -16848 -4088
11430 -4088 2338 -16664 -19082 -12526 -479 1970 11241 15899 12404 11296 9859 9046 14166 5773
11416 5773 -15984 -15695 -891 -739 -8991 -8065 14 -7401 -934 3861 1766 17472 16269 6980 10277
11401A0277m19n854l923J1652M564j3004j2479K403j778q228q252r906N561J2579
11387a6807n117K669J0258O754K695M465k805O034N115q238m069q292o11L428
11373d521J835n59q001O561r192n195Q501L447J0183J1274k535j1514j0794p75
11359a1285r506K834l388P47P509P471K556j0284O845P864P233M83J957j918r533
11344d15l639M459J2581N879n356O520K344j2832l036m002k680J7774R251j2562
11330A4286l861J651q504o317M46l3j772M167N857j1503r184q333P796J0994o999
11315a1309m924R654J5683L553o128j4709Q30L205L390O041L055P7Q337m039m400
11300H316l78n559M47P245o187l646j4352j2954O386J6127j0199O080L575R169
$$ plain form
11401 10277 9858 4004 81 11733 16297 3293 -9186 -6783 -8561 -16789 -25041 -34947 -29386 -16807
11387 -16807 -21924 -19255 -8997 -2243 452 4917 2112 8146 13261 5023 954 -7338 -7949 -4521
11373 -4521 -2686 -3245 -11246 -4685 -13877 -19072 -10571 -7124 3059 14333 11798 284 -10510 -11285
11359 -11285 -20791 -17957 -21345 -20598 -13089 -5618 -3062 -13346 -6501 1363 8596 9079 11036 9118 -415
11344 -415 -4054 405 12986 18865 13509 20029 22373 9541 6505 2503 -177 17597 26848 14286
11330 14286 10425 12076 3572 -2745 -2299 -2332 -4104 63 5920 -5583 -14767 -23100 -15304 -4310 -11309
11315 -11309 -16233 -6579 9104 12657 6529 -8180 -7350 -4145 -755 5286 8341 8418 16755 12716 8316
11300 8316 7938 2379 2826 10071 3884 238 -14114 -27068 -20682 -4555 -14754 -8674 -5099 4070
11286D070k619O451j348r473q711M897J360K231Q588p0n371l128L973R058l040
11271F868p112M439N061q002K860j722n473q980M985l673o919j9316o596N883
11257c7697J5275P553N850O308k441L16J812k12R733r714q003n406J6417R976
11243I767M618n700q500J380L078R396J4905p404j1459k815j848M569N309j533
11229A3763j0268p103j0042J5522K935n284L165O714P0o947j3493o263M006M513
11215h712J2972Q405j1221q036j97O348q341J326M409J0723K489k58n130K979
11201G756J0213k216k2120j2459J0869N754j5106j1686O358p629p15R741N808
11188a5432M036N02J1544M909p254K239O862q044M146J0470k803L604N543k5758
$$ plain form
11286 4070 1451 7902 6554 -2919 -11630 -6733 -5373 -3142 5446 5376 5 -3123 850 9908 6868
11271 6868 -244 4195 9256 1254 4114 2392 -3081 -12061 -7076 -10749 -17668 -36984 -43580 -37697
11257 -37697 -22422 -14869 -9019 -2711 -5152 -4836 -3024 -3236 6497 -3217 -11220 -16626 -209 9767
11243 9767 14385 8685 185 1565 4643 14039 28944 21540 10081 7266 5418 9987 15296 13763
11229 13763 3495 -3608 -13650 1872 4807 -477 2688 9402 9472 2525 -10968 -17231 -13225 -8712
11215 -8712 4260 12665 1444 -6592 -6789 -441 -8782 -7456 -3047 7676 10165 9907 4777 7756
11201 7756 17969 15753 -6367 -18826 -7957 -2203 -17309 -28995 -22637 -30266 -30981 -21240 -15432
11188 -15432 -11396 -10894 650 5559 -1695 544 7406 -638 3508 13978 11175 14779 20322 -5436
11174e436j3933P373Q206l273j0189k396P79j2269R182J6902J4234L408r211l134
11160B43m878j2393j597M999J6400k304j5311j4141J915J3912J5102J3346J1160
11147B6453j3311p835q161j226J715p415k876Q501j013n358j743N618o2R048J9146
11132B1481O358l461l135o574p739n741j3604j4152L649l305o82Q590P034L8J2535
11117A292J1758J308r759n064J920q593j17o729m285J1811M510Q9l717n083R017
11102a642J2O232P936m509q709j0936P635k234J5187J904P290M072J828m31j200
11087B2435j2630n120n634l073q244J1068R679L406M426j046q396o53l273k753
11073A92q515n101J1292M090K489O447n393n723J1707P192m984N270M630n34o680
$$ plain form
11174 -5436 -19369 -11996 -3790 -7063 -17252 -19648 -18869 -31138 -21956 -5054 9180 12588 3377 243
11160 243 -4635 -17028 -18625 -13626 2774 470 -14841 -28982 -27067 -13155 1947 15293 26453
11147 26453 13142 5307 -2854 -4080 -2365 -9780 -12656 -4155 -5168 -10526 -12269 -6651 -6713 2335 21481
11132 21481 27839 24378 21243 14669 6930 1189 -12415 -26567 -22918 -26223 -26905 -18315 -11281 -11243 1292
11117 1292 13050 14358 4599 -465 1455 -7138 -7255 -13984 -18269 -6458 -1948 -1859 -5576 -10659 -1642
11102 -1642 -1630 4602 12538 8029 -680 -11616 -3981 -6215 8972 10876 18166 22238 24066 23635 22435
11087 22435 9805 4685 -949 -4022 -12266 -1198 8481 11887 16313 15267 6871 6218 2945 192
11073 192 -8323 -13424 -2132 1958 4447 10894 5501 -222 11485 18677 13693 18963 23593 23059 16379
11058A6379q911k450J7556K412n35O381j436r980j4839O750J7271J7447K3344
11045F9389J2806j510o808o596k431K37O562J066O107J7929J7810J2939J3864
11032A41364R043q785l228j9814k3543P767J2610J9929N032J3589L8125K3493
11020B15582j2030j3439k2618l1308k1209q009R539n42K478J3301K1571K4604
11008A77920n533k0498k5486j3658j5446j1829j7961j3595j146k825K644P243
10996E9830L28k261j9006j2449j5340n189r123m877L05l310k864J4508J8357M430
10982B3339j2517k847K112M86l616r006M411r377J33J1911N055j700k742l327
10968B315M910K06q538j110j424j0985Q811m392Q200R184j0985o280j6952j611
$$ plain form
11058 16379 7468 5018 22574 24986 24451 30832 29396 19416 4577 11327 28598 46045 69389
11045 69389 82195 80685 73877 67281 64850 65087 71649 72715 78822 96751 114561 127500 141364
11032 141364 150407 141622 138394 118580 95037 102804 115414 135343 140375 153964 192089 215582
11020 215582 203552 190113 167495 136187 114978 106969 116508 115966 118444 131745 153316 177920
11008 177920 172387 151889 126403 112745 97299 85470 67509 53914 52768 49943 52587 59830
10996 59830 60158 57897 38891 26442 11102 5913 -3210 -8087 -7782 -11092 -13956 552 18909 23339
10982 23339 10822 7975 10087 10573 6957 -2049 2362 -7015 -6882 5029 10084 8384 5642 2315
10968 2315 7225 7431 -1107 -2217 -3641 -14626 -5815 -10207 -2007 7177 -3808 -10088 -27040 -28651
10954b8651P049J0202k456J0714J2690J812n973j3671J532J203j0412L052j509
10941a4418L851K0546J1042r230J606j0560N664j1423n859j0638n028J5406J3115
10928D074K003k118j8478k101P544J1865Q248j0241L939K932p50k389J535P526
10914A3589O457L532n003r138J4603L038j0818p018N812J997o16L972j8961j1080
10900i634J5340K0858K16n338j909m808k658l043k95J8871j1689j2402l2L613
10886G090J0667N186j225o874j5501o339J4948K982L907m655k131k609M157O321
10872A5924J3020J1085Q05j7723O002o725m909K569P719J405L710Q834J5290j709
10858E5297j9702r528j660n13p042O052J0952r221Q122J2075M78Q768k974j5489
$$ plain form
10954 -28651 -21602 -11400 -13856 -3142 9548 11360 5387 -8284 -6752 -5549 -15961 -12909 -14418
10941 -14418 -10567 9979 21021 11791 13397 2837 8501 -2922 -8781 -19419 -24447 -9041 4074
10928 4074 6077 3959 -14519 -16620 -9076 2789 11037 796 4735 7667 6917 4528 6063 13589
10914 13589 20046 23578 18575 9437 24040 27078 16260 9242 15054 17051 16435 20407 1446 -9634
10900 -9634 5706 26564 26780 21442 19533 14725 12067 9024 8729 27600 15911 3509 3477 7090
10886 7090 17757 22943 21718 14844 -657 -6996 7952 10934 14841 10186 8055 5446 9603 15924
10872 15924 28944 40029 40834 23111 29113 22388 17479 20048 27767 29172 32882 41716 57006 55297
10858 55297 35595 26067 24407 23894 16852 22904 33856 24635 32757 44832 45310 54078 51104 35615
10844C5615l542R30L571n431O593M046l554j339p713o959p638J1635k297r519
10830A4398J903L163l451K0772J9019j3166n160j6740j7725j2778P775M426N786
10817H222O388j2862r743M431p427j2825R673n93Q00J9942R145j3957r699N680
10803b825P580Q435m826q377J307j916K82o58K29m329m727p835l618L281R929
10788h068L643J3397L281p603m790K586J477P196J5365J1246j316j0167j8471
10775G776j7278L542K268N889K704n24r505M972J0526l885n672J3086R904q05
10761B2998j2705n625J7444P765k014l880j1762o862n732J0857J196Q187J1334
10748C1201n90J513q135q396q719r266r040N267Q389K1804P351K750N801m008
$$ plain form
10844 35615 32073 33003 36574 31143 37736 41782 38228 36889 29176 22217 14579 26214 23917 14398
10830 14398 16301 19464 16013 36785 55804 42638 37478 20738 3013 -9765 -1990 2436 8222
10817 8222 14610 1748 -7995 -3564 -10991 -23816 -14143 -14736 -13936 6006 15151 1194 -8505 -2825
10803 -2825 4755 13190 8364 -13 1294 -622 -340 -998 -769 -5098 -9825 -17660 -21278 -17997 -8068
10788 -8068 -4425 8972 12253 4650 -140 2446 3923 11119 26484 37730 36414 26247 7776
10775 7776 -9502 -5960 -3692 2197 4901 4377 -5128 -156 10370 6485 813 13899 23803 22998
10761 22998 10293 4668 22112 29877 27863 23983 12221 5359 -373 10484 11680 19867 31201
10748 31201 30611 32124 23989 15593 6874 -2392 -11432 -6165 2224 24028 31379 34129 39930 35922
10734C5922P330M939l403j5727q975Q0j78Q543K2929J4340K821O441M293j6068
10720F3287O671Q821j5322P141O276k223j7338J273O037J0889j333J698N545j6242
10706F5180k7136n680J685J4929J0777l560m284J0764L202q416r537K287j5124
10693C5087j6457L284R424R792L490J5354P321K230j2931j2380p144K073J3216
10680E2359P843l941j382N343l2p748j935j882q9J7324O060J5948n250r562K441
10665G5497J3288J2868M072r358j362M169Q290l072J1237J0485J131j4250k096
10652A10899J7148J1672J223Q214J0455M825J1742Q639J978K255R746J3017K0422
10639B32235L9532L3187J0644J7378M0427M3745O3762O9644P3161N9883M7654
$$ plain form
10734 35922 43252 48191 44788 29061 20086 20166 19988 28531 51460 65800 68621 75062 79355 63287
10720 63287 69958 78779 63457 70598 76874 74651 57313 58586 64623 75512 74179 75877 81422 65180
10706 65180 38044 32364 34049 48978 59755 56195 51911 62675 65877 57461 47924 50211 35087
10693 35087 18630 21914 31338 41130 44620 59974 67295 69525 56594 44214 37070 39143 52359
10680 52359 60202 56261 54879 60222 60190 52442 50507 48625 48536 65860 71920 87868 82618 73056 75497
10665 75497 88785 101653 105725 96367 95005 99174 107464 104392 115629 126114 127245 112995 110899
10652 110899 128047 139719 140942 149156 159611 164436 176178 184817 186795 189050 198796 211813 232235
10639 232235 271767 304954 315598 332976 373403 417148 480910 550554 623715 683598 731252
10628G31252N4702P9083R6598J30220J71519K33389L24197M61086O60009Q96921
10618C838976J177273J485999J785013J802813J326778L73714n13380q32347o05419
10609I839420j14917N08700J241128K057995K937945L629514L637606K277586
10601B6014977k88500k376053k861143k127723r95955K23596J456505K695704
10593B1741408L892145M667358M351312K006175j877440m701127n044883l893758
10585B1141190k422084j078954J01511J175046K082126K563710K133148L64344
10577B6060037k200149l882912l867195k943740j893891j011388l25637K08625
10569A0143750N77013O92312M16347l47738j313518j903830j878012j511421j114269
$$ plain form
10628 731252 785954 865037 961635 1091855 1263374 1496763 1820960 2282046 2942055 3838976
10618 3838976 5016249 6502248 8287261 10090074 11416852 11790566 11277186 10444839 9839420
10609 9839420 9724503 10233203 11474331 13532326 16470271 20099785 23737391 26014977
10601 26014977 25726477 23350424 20489281 18361558 17365603 17589199 19045704 21741408
10593 21741408 25633553 30300911 34652223 36658398 34780958 30079831 25034948 21141190
10585 21141190 18719106 17640152 17741663 18916709 20998835 23562545 25695693 26060037
10577 26060037 23859888 19976976 16109781 13166041 11272150 10260762 9935125 10143750
10569 10143750 10720763 11413075 11829422 11481684 10168166 8264336 6386324 4874903 3760634
10560C760634q11917o00424m39582l06311k42501j76697j35991j14401r5764r7180
10550G39866r3695p0864n5048m3659m0842l3327l4739k7075k1796k0384j3897
10539B84540k3390k9556j0628l690p679k3134k2839j447j3459K129O607j982j0262
10526A45210r487P236M72k925j0386j0572o02n230p654j5466K143p848j0201o018
10512F8672K0824L880j3539j6928P644n861j7711R785J2615j654j4746j3865r333
10499B9783J3552P937Q568N175k620j2802P467K243o276j2864j844N089n44j6636
10485B6228j2043j2341J0517J1337p134j0554P814R03m21n743j080J1488P019
10472B5990m982k67N226K136J3585P929j143k0917j9577L90M009K754n509j3344
$$ plain form
10560 3760634 2948717 2348293 1908711 1602400 1359899 1183202 1047211 932810 837046 739866
10550 739866 646171 575307 520259 476600 435758 402431 367692 340617 318821 298437 284540
10539 284540 261150 231594 220966 217276 209597 186463 163624 162177 148718 150847 157454 155472 145210
10526 145210 135723 142959 143431 140506 130120 119548 118946 113716 106062 90596 92739 84891 74690 68672
10512 68672 89496 93376 79837 62909 70553 64692 46981 56766 69381 67727 52981 39116 29783
10499 29783 43335 51272 59840 65015 62395 49593 57060 59303 53027 40163 38319 43408 42864 26228
10485 26228 14185 1844 12361 23698 16564 6010 13824 14727 14306 8563 7483 18971 25990
10472 25990 21008 20741 25967 28103 41688 49617 48474 27557 7980 8370 12379 15133 9624 -3720
10458c720J519J0090J1132L048L782M556Q152m056j1714J4027P540N052j0842
10445C8566N083N410j2519j713K435P43l227k108M736p458m955o754N764k774
10431B1229J245R48q004n521q012j998P67O397J0784Q739K288k410r256J1473
10417B8669P70L099K71q503o488q124o708P036Q014N043m626j0439l979J64N474
10402I673J221N007O282j6266j1243J2621L057p625n069J2483J5213M683o803
10389B3234j1962k326M121j0451L651M977k898l665L696M069j938o517j0601j2017
10375a8627J2656k183J1721N12p110N649K73o993P978Q86J1297K638o404L637
10361A5930K212m016j0476p55J732l47K51j3589k645j256r432J2688Q584O617
$$ plain form
10458 -3720 -2201 7889 19021 22069 25851 30407 38559 34503 22789 36816 44356 49408 38566
10445 38566 43649 49059 36540 34827 37262 38005 34778 32670 37406 29948 24993 18239 24003 21229
10431 21229 22474 23422 15418 9897 1885 -113 654 7051 17835 26574 28862 26452 17196 28669
10417 28669 29439 32538 32809 24306 17818 9694 2986 10022 18036 23079 18453 8014 4035 4199 9673
10402 9673 10894 15901 22183 5917 -5326 7295 10352 2727 -2342 10141 25354 30037 23234
10389 23234 11272 8946 13067 2616 6267 11244 8346 4681 8377 12446 10508 3991 -6610 -18627
10375 -18627 -5971 -8154 3567 4079 -3031 2618 2891 -4102 3876 4762 16059 18697 12293 15930
10361 15930 18142 14126 3650 2895 4627 4280 4531 -9058 -11703 -12959 -22391 -9703 -1119 5498
10347E498j3774k897O262n685K413p958M087K0087J0985j736p579p5o887n680
10333b939r320k958J0704J6400q137r079j5862R747j377M290J5826l99J5163M665
10319B6724j0007j7320O110P004l744m881N653J9206m140j7716j4650N37N251
10306a973K717N53n741o762L388k383l499R289R52j1040p178L324N850J296K185
10291i022J0319o675m883K419J4270o663k883N137j075O366P611n82p107q920
10277a688l850L648L437J892P406J553N635N316J7078j9761j7678R001J3278j0057
10263A5210k407o429q008P955J4427O321m949r517n450M411k222M348K932p955
10249H667J587o378k146O022J1790K827j0028j4471R283Q302k978J954N750L518
$$ plain form
10347 5498 -8276 -11173 -4911 -10596 -8183 -16141 -12054 8033 19018 17282 9703 9628 2741 -2939
10333 -2939 -12259 -15217 -4513 11887 3750 -5329 -21191 -11444 -12821 -8531 7295 6896 22059 26724
10319 26724 16717 -603 5507 12511 8767 3886 9539 28745 24605 6889 -7761 -7224 -1973
10306 -1973 744 1297 -4444 -11206 -7818 -10201 -13700 -4411 -3459 -14499 -21677 -18353 -12503 -11207 -9022
10291 -9022 1297 -5378 -10261 -7842 6428 -235 -3118 2019 944 7310 14921 14339 7232 -1688
10277 -1688 -5538 -1890 1547 3439 10845 12398 18033 23349 40427 20666 2988 11989 25267 15210
10263 15210 12803 6374 -1634 6321 20748 27069 22120 12603 7153 11564 9342 13690 16622 8667
10249 8667 10254 3876 1730 7752 19542 22369 12341 -2130 7153 15455 12477 14431 20181 23699
10235B3699m145r178L441n033j111R76j7438N499J6928R96j1794j4861o742J3851
10221d912N125l213Q231Q672P695m909j7500j0183M018j80L399J0786P786j550
10207A3265J0957J608j2428q278L035q96o455J839k612o557L540l301j634Q146
10193B29L477o49Q54O361j09l395M590m614O793M017M259N319l862o64J3679J9059
10177E5344R290J802M82M30J2289j1608r612O875J8059J9436J4642J5031n496
10164A26964K849m12o430j0571j1488k175L336R437K9412L8921L3142N060k4277
10151A93768l0562k8932k1617j7316p81K789K3103K1600J2405j0460j676k0103
10139A22218j0884k1296j0863K764j3742o348O415J0909n835q199p3r289q404
$$ plain form
10235 23699 19554 10376 13817 8784 7673 8649 -8789 -3290 13638 14634 2840 -12021 -18763 -4912
10221 -4912 213 -3000 5231 13903 21598 16689 -811 -10994 -6976 -7156 -3757 7029 14815 13265
10207 13265 24222 25830 13402 5124 8159 7263 808 2647 35 -6522 -2982 -6283 -7917 229
10193 229 3706 3057 3911 10272 10163 6768 11358 6744 13537 17554 21813 27132 23270 22606 36285 55344
10177 55344 64634 66436 66918 67348 79637 68029 58417 65292 83351 102787 117429 132460 126964
10164 126964 129813 129401 122971 112400 100912 98737 102073 111510 140922 179843 212985 218045 193768
10151 193768 163206 134274 112657 95341 94560 97349 120452 142052 154457 143997 142321 122218
10139 122218 111334 90038 79175 81939 68197 61849 68264 79173 73338 65139 65066 55777 47373
10126D7373o126j9538j5055n856P734M139o728K405O06n986l531N177J0384m08
10112A4590m513j058o027O926q584k628J1127m989r28J082n542j8005n155R366
10098a4338J0379J808J999K955R203K586p669m878q938K961r320m741q740M732
10084b2001K2828P418j1681j2301O152O382L314l652K98j2184j4271q68J3197
10071a7369J9083R060K661n523L622m268o306j3034l952J3490k071K650m798j079
10057g834J2119o137o061p3Q714J9851J3399k078o957k481r919j9509N511J0942
10043I487J36k183o145O266K645p854j515J0641J863M448o419N438j693j1068
10029D047p564J284p321R943R502j012j0498l414Q80K0085J5845j4930r738L081
$$ plain form
10126 47373 41247 21709 6654 798 8532 12671 5943 8348 8954 2968 -563 4614 14998 14590
10112 14590 10077 9019 2992 9918 1334 -1294 9833 4844 3916 4998 -544 -18549 -23704 -14338
10098 -14338 -3959 -2151 -152 2803 12006 14592 6923 2045 -6893 -3932 -13252 -17993 -26733 -22001
10084 -22001 827 8245 -3436 -15737 -9585 -3203 111 -3541 -3243 -15427 -29698 -30566 -17369
10071 -17369 1714 10774 13435 7912 11534 7266 960 -12074 -16026 -2536 -4607 -1957 -6755 -7834
10057 -7834 4285 -1852 -7913 -7986 728 20579 33978 31900 24943 22462 12543 -6966 -1455 9487
10043 9487 9623 7440 1295 7561 10206 2352 837 11478 13341 17789 11370 16808 15115 4047
10029 4047 -3517 -2233 -9554 389 9891 8879 -1619 -5033 -4153 15932 31777 16847 7109 10190
10015A0190R888q595j5814k347Q397O847j9787j166p814O16O146P388P524J5073
10001A6546j253r672j6187j2541n163J0794N580O250J8233O134k0682j7842K031
9988a7772L207J3365k161k061O420j421o194Q3K389q337M5K2974O433n317r070
9973B583M486J2010P564n224m01O49p705l566K652N900L79m554k399l581l583
9958E210J65m762j5699N709J8905k075j0324M634R83j7124j62N943j2972l659
9944b5228R092K1361J1767j4599j8171L704O145L827Q408K1394K9479M6154N6569
9931A59902J02624N2596r6142q9294n3265l5135l1209j9263J712J4290J2430R830
9919B9076n29k685M595j4840k11m289n728N202P803j855r66r369o20q023l204
$$ plain form
10015 10190 20078 11483 -4331 -6678 1719 8566 -11221 -12387 -20201 -19585 -13439 -6051 1473 16546
10001 16546 15293 5621 -10566 -23107 -28270 -17476 -11896 -5646 12587 18721 -1961 -19803 -17772
9988 -17772 -14565 -1200 -3361 -5422 998 -423 -6617 -6534 -4145 -12482 -12437 10537 16970 11653 2583
9973 2583 7069 19079 26643 21419 21018 21667 13962 10396 13048 18948 19327 14773 12374 8793 5210
9958 5210 5375 613 -15086 -9377 9528 7453 -2871 1763 2746 -14378 -14540 -8597 -21569 -25228
9944 -25228 -16136 5225 16992 2393 -15778 -12074 -5929 -2102 6306 27700 57179 103333 159902
9931 159902 262526 315122 218980 129686 76421 41286 10077 -9186 -7474 6816 19246 29076
9919 29076 28547 25862 30457 15617 15406 11117 5389 10591 18394 16539 15573 6204 5584 -2439 -5643
9904e643R880O11l082J123J524l636q975Ko184q61q56m751M337J1642O619p714
9888e964j2414J646J5845J0581J717N650J188k970j2444M17K14j2183o00n53Q869
9873a001R129N347j2199j967K944p276k484K2302J2271n190r799j4036L575L752
9859E368k697j556M066M853L498P502j407j9631q38Q456J978Q076p849r494N5
9844C80R784M161j0830m519q722k044J059J456M885R860N075n940L607o374L473
9829E311j2501m083J5872M079o328r311l27L49l265J5122J0807j1302j2475M118
9815c934Q146K045L184n316O43k409m02k474M936j096j0289j0238J739P496R115
9800A146R150l778n611K561L846j3802j3621p285p660J3664J3229k267M367P271
$$ plain form
9904 -5643 4237 4848 1766 2889 4413 777 -8198 -8196 -14380 -15241 -16097 -20848 -16511 -4869 1750 -5964
9888 -5964 -18378 -16732 -887 9694 11411 17061 18249 15279 2835 3252 3466 -8717 -9317 -9870 -1001
9873 -1001 8128 13475 1276 -691 2253 -5023 -7507 14795 27066 21876 12077 -1959 1616 5368
9859 5368 2671 1115 5181 10034 13532 21034 19627 -4 -842 7614 9592 17668 9819 325 380
9844 380 10164 14325 3495 -1024 -9746 -11790 -10731 -9275 -4390 5470 10545 4605 8212 1838 5311
9829 5311 -7190 -11273 4599 8678 2350 -6961 -7288 -6939 -10204 4918 15725 4423 -8052 -3934
9815 -3934 4212 6257 9441 4125 4768 2359 1957 -517 4419 3323 -6966 -17204 -15465 -7969 1146
9800 1146 10296 6518 907 3468 7314 -6488 -20109 -27394 -35054 -21390 -8161 -10428 -6061 1210
9786A210q356J983K131o606Q944J3820J175o537K076L895J1388J6497j656j9223
9772B0741j0403R890n742K542O195q384j7269j0085m759M786j082J2267m817K687
9758c433J2200Q825K302q067j1856k0480r8R528J0750l345l678O43N557J2156
9744A1004K14j6827m270J4674M415p061l089k156q258o486O482L085J853r308
9730a5728J2167J1085J3835L990j713k2848K810M14j3680J118J3090J8549N48
9717B3637J572m306m878j0392O995r22r182N099J4154j1095p258P21J1508o024
9703I629O341J974p350M017q769k854K0026L257j5888q666m661Q76N906N882m365
9688E355R012n5K963p327o256J568J620J3148j113k1747j755J5138R140K06L267
$$ plain form
9786 1210 -7146 -5163 -3032 -9638 -694 13126 14301 7764 9840 13735 25123 41620 39964 20741
9772 20741 10338 20228 14486 17028 23223 14839 -2430 -12515 -17274 -12488 -13570 -1303 -6120 -3433
9758 -3433 8767 17592 19894 11827 -29 -20509 -20607 -11079 -329 -3674 -7352 -6709 -1152 11004
9744 11004 11218 -5609 -9879 4795 9210 2149 -940 -3096 -11354 -17840 -11358 -8273 -6420 -15728
9730 -15728 -3561 7524 21359 25349 23636 788 3598 4012 -9668 -8550 4540 23089 23637
9717 23637 25209 20903 16025 5633 12628 11706 2524 7623 21777 10682 3424 4145 15653 9629
9703 9629 15970 17944 10594 14611 5842 2988 23014 26271 10383 1717 -2944 -2068 3838 9720 5355
9688 5355 14367 14312 17275 9948 3692 5260 6880 20028 18915 -2832 -4587 10551 19691 19897 23164
9673B3164p457L61J242n809j5840j3054M973j0614M528R63N704O202l136J926
9659f847j3681N534J3910Q996N683R096J8585K2591M9261N9566P83o6204m5721
9646F1552k2079n816n260K843r112m591m098N22l540K134P510L779J669r229o718
9631I566j1914J447R858J3207Q631j0059p910r121q3N939P145l141Q304J857j619
9616B2107m90j0118q200n757O667P318j0433j400N376o547l053R54O48J2813J388
9601A1273q850k945o291J786M327k616o343R512J4714O362p673J204p508j2338
9587e386j2956J0058M12j1446j294J1546J6622R310r002j309J0071k804M876j6712
9573A986j5238l574J8872N820J753k703j6698J1994R654L86j4454J886Q383P16
$$ plain form
9673 23164 15707 16068 17310 11501 -4339 -17393 -12420 -23034 -18506 -17543 -11839 -5637 -8773 -6847
9659 -6847 -20528 -14994 -1084 7912 13595 22691 41276 63867 113128 172694 173477 107273 61552
9646 61552 39473 33657 28397 31240 22128 17537 13439 13961 10421 12555 20065 23844 25513 16284 9566
9631 9566 -2348 -901 8957 22164 30795 20736 12826 3705 3622 9561 16706 13565 21869 23726 22107
9616 22107 21617 11499 3299 -2458 4209 11527 1094 -306 5070 -1477 -4530 -3576 -2928 9885 11273
9601 11273 2423 -522 -6813 -5027 -700 -3316 -9659 -147 14567 20929 13256 14460 6952 -5386
9587 -5386 -18342 -8284 -7872 -19318 -20612 -9066 7556 16866 7864 6555 16626 13822 18698 1986
9573 1986 -13252 -16826 2046 7866 9619 6916 -9782 2212 11866 12252 -2202 -316 8067 8783
9559H783n312J574m147M032J3331K772p669j1932n391P716J5593l023j4477j3362
9545a1512j108N244Q896N161j0747J538J0281K213j1637l400j914K581j178L252
9531b330N187j1473k568J0653M322l851J3645J4497J863j5564r818K274O440k0798
9517g521j1856p518L341P513J1926J3323k29j6353N32K3908J1475j6125j3039
9504f23m71o139J2498P468k014O616r859j4203L158J2318N769k152j0496J1683
9490A3553J420N003M274n167j874O493o925p35R558k750j3136m442N193p241q756
9475e532Q725r87O043o509K116l346n258O22j505M167N914o477j2474K120J404
9460a0977q754n847P318N033J167K082J627j470k589P369j213j108n643m208M853
$$ plain form
9559 8783 3471 5045 898 4930 18261 21033 13364 1432 -3959 3757 19350 16327 1850 -11512
9545 -11512 -12620 -7376 1520 6681 -4066 -2528 7753 9966 -1671 -5071 -6985 -4404 -5582 -2330
9531 -2330 2857 -8616 -11184 -531 3791 -60 13585 28082 29945 14381 4563 6837 13277 -7521
9517 -7521 -19377 -26895 -23554 -16041 -4115 9208 8979 -7374 -6842 17066 28541 12416 -623
9504 -623 -1094 -7233 5265 12733 10719 17335 7476 -6727 -3569 8749 14518 12366 1870 13553
9490 13553 14973 19976 24250 19083 17209 23702 16777 16042 25600 22850 9714 5272 10465 3224 -5532
9475 -5532 3193 2206 8249 1740 3856 510 -4748 -4126 -5631 -1464 4450 -2027 -14501 -12381 -10977
9460 -10977 -19731 -25578 -18260 -13227 -12060 -9978 -8351 -9821 -12410 -5041 -6254 -7362 -13005 -17213 -12360
9445a2360Q17k232P244J6273j1431n878q788K706p330J833J0144P372R474L592
9431A1436j661j5047l870J7667j982j1123k166k503R181N063l56k432J831N859
9417I897m993j4407n821M789Q212o953P781J4185P021j2050j3187r968P029J3640
9403E175O088n04q840K509J0328j954J174M100P80j0780J636Q339R220n753k1474
9388D4j3386j1538L086J2833Q956%j0490q736M965Q641J1552Q134n900j4252K704
9373c387Q80L884K989M392N14n336K469p35J659K904l826j2073l521R530J0284
9358A0627M950l684j0383j07r851r68R752J0432l221l062n974M034m280r443N225
9343e953J2518K301j0222R25M832P70j2087k13J029K707J8980k537m328o96O023
$$ plain form
9445 -12360 -11543 -13775 -6531 9742 -1689 -7567 -16355 -13649 -20979 -19146 -9002 -1630 7844 11436
9431 11436 9775 -5272 -9142 8525 6543 -4580 -6746 -9249 -68 4995 4639 2207 4038 9897
9417 9897 4904 -9503 -15324 -10535 -2323 -9276 -1495 12690 19711 7661 -5526 -15494 -8465 5175
9403 5175 11263 10759 1919 4428 14756 12802 13976 18076 18856 8076 9712 18051 27271 21518 44
9388 44 -13342 -24880 -21794 -8961 -5 -5 -10495 -19231 -14266 -5625 5927 14061 8161 -6091 -3387
9373 -3387 -2507 1377 4366 8758 9272 3936 6405 5670 7329 10233 6407 -5666 -9187 343 10627
9358 10627 15577 11893 1510 1403 -8448 -9416 336 10768 7547 4485 -1489 2545 -1735 -11178 -5953
9343 -5953 6565 8866 -1356 -431 4401 5171 -6916 -7129 -6100 -3393 15587 13050 8722 8026 14049
9328A4049K666O440j3675j7184m772M68R59J0086O183k226J351Q583J6977p116
9314B2789j8100L060Q833o490m062O552P903J945j6793p239O976R786K760O28
9300A8548n175J1888L951L78j0660j4657n224J586j783j3719M774O831K765J693
9286A196L900k982k6676J34K9604J4118j3927p006P618m597r641O797J0523r942
9272h81p286J068q85p79J414J8107J5611L105p204p312J141O369Q915n827k9979
9257d423p695K219k342R501J3413J2266L126k662r869k491l531L216j598k088
9243G042j0817J37n444N038R729m679m463O200L93J7108k188p697k910J140k42
9228H347L961R851l42q074q543l203R506N283M959L114L710q56l765j272J1021
$$ plain form
9328 14049 16715 23155 9480 -7704 -12476 -12008 -11049 -963 5220 2994 4345 12928 29905 22789
9314 22789 4689 7749 16582 10092 6030 12582 20485 22430 5637 -1602 5374 15160 17920 18548
9300 18548 13373 25261 29212 29590 18930 4273 -951 635 -1148 -14867 -10093 -3262 -497 1196
9286 1196 5096 2114 -24562 -24428 5176 19294 5367 -1639 5979 1382 -8259 -1462 9061 -881
9272 -881 -8167 -7099 -7984 -8763 -7349 10758 26369 29474 22270 14958 16099 22468 31383 25556 -4423
9257 -4423 -12118 -9899 -12241 -2740 10673 22939 26065 23403 13534 11043 7512 10728 9130 7042
9243 7042 -3775 -3638 -9082 -4044 5685 1006 -3457 2743 3136 20244 18056 10359 7449 8589 8347
9228 8347 12308 22159 21817 13743 5200 1997 11503 16786 21745 24859 28569 27713 23948 22676 33697
9213C3697L027q076p528m685N873r756k348M965L431N239Q305K036M898M798r015
9198C4861o270m705q853p970J848n377K186j088j1007p098N722J0319l025m90
9184i47N144R370K9K760R309J6780M996o737j0201j3798o001j3414o615N645O637
9169B957L56k119p33k715J7174N059p970L236k274P076O385J0490o030m613o471
9154A9808j2863j579k797K567R053o027R67k527m610k068N223R751n73j561m741
9139H023M248K665p178l323J946j149l479j229J676K731O800J1280N24O73n55
9124B3653K703j3350j1948L526l39j3306j747N340J8474J2778o572L119j041M08
9110B1698N205j507j2860n261j711J2294J2598J1714p25r975r698m020n075O872
$$ plain form
9213 33697 36724 28648 21120 16435 22308 12552 10204 15169 18600 23839 32144 34180 39078 43876 34861
9198 34861 28591 23886 15033 7063 8911 3534 5720 4632 -6375 -13473 -7751 2568 -457 -947
9184 -947 4197 13567 13596 16356 25665 42445 47441 40704 30503 16705 10704 -2710 -9325 -3680 2957
9169 2957 3313 1194 461 -2254 14920 19979 12009 15245 12971 20047 26432 36922 30892 26279 19808
9154 19808 6945 5366 2569 5136 14189 8162 9129 6602 1992 -76 5147 14898 14325 12764 8023
9139 8023 12271 14936 7758 4435 6381 5232 1753 524 2200 4931 11731 23011 23535 24208 23653
9124 23653 26356 13006 1058 4584 4245 -9061 -10808 -5468 13006 25784 19212 22331 21290 21698
9110 21698 26903 25396 12536 7275 5564 17858 30456 42170 41445 31470 21772 17752 12677 19549
9096A9549N087p941j3000J37R70M562M091R685J445r527m974J171j404m321l909
9081A621J1554q120O326R259J824n117M276N629l643k112L037j072K119J1721
9067C7302n897R200J0350k5036l3881o640R155N361p19J0882K4003L040J2644
9054D9764k513r950k6710j0719K9657K2300J375k7321p512J5579J246k1693n767
9041G736M947J454k681K858N907o93J3879J0386J425n506o701L160p347j1922
9027A6902l876J2428K1437j341j6043M692R760R230n834n299O239l030m18R496
9013E4343J186r653j0147L861q089P69M750m057j650q051q009J442J144q854o940
8998B045l065O103o852j522N320K2912O845n814K352o996n361k447R84O90j6773
$$ plain form
9096 19549 24636 16695 3695 3832 4802 9364 13455 23140 24585 15058 10084 11255 9851 5530 1621
9081 1621 13175 5055 11381 20640 22464 17347 21623 27252 23609 21497 24534 23462 25581 37302
9067 37302 31405 40605 50955 25919 -7962 -14602 -5447 -86 -805 10077 34080 37120 49764
9054 49764 47251 37301 10591 -128 29529 51829 53204 25883 18371 33950 35196 13503 7736
9041 7736 12683 14137 11456 14314 20221 19528 33407 43793 45218 39712 33011 36171 28824 16902
9027 16902 13026 25454 46891 45550 29507 34199 43959 53189 47355 42056 48295 45265 44847 54343
9013 54343 55529 45876 35729 39590 31501 32270 37020 32963 31313 23262 15253 16695 17839 8985 2045
8998 2045 -1020 5083 -1769 -3291 2029 24941 31786 25972 28324 21328 15967 13520 14504 15194 -1579
8983a579k812K5056m212k522O866K762j606J214q849n968J4785R506J0526M082
8969D7249m505n861J21R427k531m337O572r586j6966l301N978J5432p868j3861
8955A5963k023K0577J0749J062j958J1955j2710J792O5M871R623K786J215J2131
8941G6098J3186L861o048l05m168K3511J7886N176J9117J2370J3741P386K1060
8928B02871L1570L6181N2932P2694J19721J88854K16303K50504K86986K77591
8918A736207K03730Q4297n7937j97302k76315k99267k68058k20440j38481j10090
8908D56344r0735m3835l6068l8981j8652k0020j6050k2172k6058j1217p412j3576
8896A11568j3448j9404j5078O308L570K942l412j4327q411J958K80o838r340k456
$$ plain form
8983 -1579 -4391 20665 16453 13931 20797 23559 21953 23167 14318 8350 23135 32641 43167 47249
8969 47249 42744 36883 37004 46431 43900 39563 46135 36549 19583 16282 22260 37692 29824 15963
8955 15963 13940 34517 45266 46328 44370 56325 43615 45407 45472 50343 59966 62752 63967 76098
8941 76098 89284 93145 87097 86792 82624 106135 124021 129197 148314 160684 174425 181811 202871
8928 202871 234441 270622 323554 396248 515969 704823 921126 1171630 1458616 1736207
8918 1736207 1939937 2024234 1966297 1768995 1492680 1193413 925355 704915 566434 456344
8908 456344 365609 321774 285706 246725 228073 208053 192003 169831 143773 132556 125144 111568
8896 111568 98120 78716 63638 69946 73516 76458 73046 58719 50308 52266 52546 45708 36368 33912
8882C3912o641L699R720R523J928q374N24p790p951o141q54J2061n477j1763N736
8867B2112O594O93n888j526j08n475J3845L380J729k254n933j406j2768m872J5630
8852B3753M943R655P371o657m248q016j3000O526R076N625j6185k2436l507r091
8838a6191m565N387o690N30j1485r810l918j3407o267j110m262J7887P0700J15381
8824A32180P7416M6242J5738l4892j6626O416N421P137j9614k2103m804j8368
8812A74143j3653q271j3173j8136j8884o587P215q828l863K2910N153r011j2764
8799I6251j669l021p463J7708J6876R844q702j6191M022J5143J2426K6934J6077
8786A78235n848k4785l251P282k103J4044J0907k3853j096k02l188J629K4646
$$ plain form
8882 33912 27271 30970 40690 50213 52141 43767 44291 36501 28550 22409 21555 33616 28139 16376 22112
8867 22112 28706 29399 23511 21985 21877 16402 30247 33627 35356 33102 27169 25763 12995 8123 23753
8852 23753 28696 38351 45722 39065 34817 26801 13801 20327 29403 35028 18843 -3593 -7100 -16191
8838 -16191 -20756 -15369 -22059 -21529 -33014 -42824 -46742 -60149 -66416 -67526 -71788 -53901 16799 132180
8824 132180 209596 255838 271576 236684 220058 226474 231895 239032 219418 197315 192511 174143
8812 174143 160490 152219 139046 120910 102026 95439 102654 93826 89963 112873 118026 109015 96251
8799 96251 94582 91561 84098 101806 118682 128526 119824 103633 107655 122798 135224 162158 178235
8786 178235 172387 147602 144351 151633 149530 163574 174481 150628 149532 149330 146142 147771 172417
8773A72417M0696M194J0398J3215k6441k4925q830K7395L8647j3754k8871m8434
8761A55707l9952j7987p450K516M841Q339J0330l198l515M394J4142J2422j5815
8748A24774k4899j5617Q080J0309M455P106O440K606l636k2077m381J721K282
8735I7163n995l997K5547K4702o312k2219l0196k1627j0105j0625p15J4333Q361
8722E8315J1320N694r956l2500j9489j1946j8515J2424J5468K5623L9445L8224
8710A14107K1078o280O08K3325Q339l3392k6483j007K0142J7424j6800p587J9594
8697A33068m048j4427K1547k417j5178n247j6144m664p262j2785K1918J2179k571
8684A03969J771n025J4817K9287L4369J9697O615K7194R710j8292m3396m2161
$$ plain form
8773 172417 213113 217307 227705 240920 214479 189554 180724 208119 246766 233012 204141 155707
8761 155707 115755 97768 90318 92834 97675 106014 116344 113146 109631 114025 128167 140589 124774
8748 124774 99875 84258 92338 102647 107102 114208 120648 123254 119618 97541 93160 94881 97163
8735 97163 91168 87171 112718 137420 131108 108889 78693 57066 46961 36336 35621 49954 58315
8722 58315 69635 75329 65373 32873 13384 1438 -17077 -4653 10815 36438 75883 114107
8710 114107 135185 128905 129513 152838 161177 127785 101302 100295 120437 137861 121061 113474 133068
8697 133068 129020 114593 136140 133723 118545 113298 97154 92490 85228 72443 94361 106540 103969
8684 103969 105740 100715 115532 144819 179188 198885 205500 232694 242404 224112 180716 138555
8672A38555l2836l6914l3686o5416p0114K0564O2753N6629L8175K0292J5958J780
8660A15740p570m0880o6343m3948p386M7317M7665J9326J00064K43692J97810
8649F05487Q5027Q5323l3786j59268j41701k9395K8435L3095K4872K83M4680J3592
8637E56644n0934m3217j0320l452l1632l3933k3062j7802k4537j4695M519J314
8625C08893p081r788j775J1350P014N030k296j2231o169N880J5800L325o265j98
8611C11489j692p796J2170J5223K1062O210J1752J2981N248J6745K1347J433K2628
8598D48800J1077R40n397j9628o644P24J0778L660K0494L9647K8600K5303J9596
8585E77950R430L086K0887K6759K6250L0427K3712L8047O3563O9236M6074L0508
$$ plain form
8672 138555 105719 68805 35119 -30297 -100411 -79847 -17094 39535 77710 98002 113960 115740
8660 115740 108170 67290 947 -43001 -50387 -3070 44595 63921 163985 407677 605487
8649 605487 690514 775837 742051 582783 441082 411687 440122 473217 498089 498372 543052 556644
8637 556644 505710 462493 452173 448721 417089 383156 360094 342292 317755 303060 307579 308893
8625 308893 301812 292024 290249 301599 308613 313643 311347 299116 292947 298827 314627 317952 311687 311489
8611 311489 309797 302001 314171 329394 350456 356666 368418 381399 386647 403392 424739 426172 448800
8598 448800 459877 460817 455420 435792 429148 429872 440650 444310 464804 504451 533051 558354 577950
8585 577950 587380 590466 611353 638112 664362 694789 718501 756548 820111 889347 935421 965929
8573I65929o89Q717K4940L6841K8915K3299J5784J0177J7023J9960M4670P2676
8561A268242Q3079Q4407R1702O8331N5817R2423J26871J32167J10917J32829J51341
8550B398126J67051J89460J95954K03230K13750K67447L24635L50229L78823M61497
8540E150202N71767O59362P96670J036210J339886J758530K244541K710412L050120
8531A9317700L097779K519427J785281J635063K435164M650470P893212J2564864
8523E5898960K0061236L2092654N0254737P5720380J07436477J34827410J06596926
8516E82888780m1050174j58772205j37376224q4050179m8828233k9769666j9403552
8509F3638547j3219230r079633o167905m047944k367271j045113n72559j806571
$$ plain form
8573 965929 965240 973957 998897 1035738 1064653 1087952 1103736 1113913 1130936 1150896 1195566 1268242
8561 1268242 1351321 1435728 1527430 1595761 1651578 1744001 1870872 2003039 2113956 2246785 2398126
8550 2398126 2565177 2754637 2950591 3153821 3367571 3635018 3959653 4309882 4688705 5150202
8540 5150202 5721969 6381331 7178001 8214211 9554097 11312627 13557168 16267580 19317700
8531 19317700 22415479 24934906 26720187 28355250 30790414 35440884 43334096 55898960
8523 55898960 75960196 108052850 158307587 234027967 341464444 476291854 582888780
8516 582888780 541838606 383066401 245690177 161639998 112811765 83042099 63638547
8509 63638547 50419317 41339684 35171779 31123835 28756564 27711451 27138892 25332321
8501B5332321l486766l660530l064877k440500j907955j482114j142609q80612
8493G266358o90413n58464m97091m09355l17007k57790j91245j23996j40135l18845
8483C762017l95358k96455k18523j87860j54516j24537j19930j33160j36816j16112
8473A878750p9619n5536n4153q6265j10654j07837r5758q2230p4081n8219l8150
8462A036248k9299l8449n7263n8455k0469M396J8667J8599j3817j1492n001j2304
8450H31361k1064k0077k7695m5407k9012k748j606K251j4493j8149l7412l0907
8438E85042k8487l9471k9870j0369l029j3202n914O006J4125j9456j8799j2235
8426D24341Q859k726p032o30n424k5710k5009j9422j1201o209p890L188J0360
$$ plain form
8501 25332321 21845555 18185025 15120148 12679648 10771693 9289579 8146970 7266358
8493 7266358 6575945 6017481 5520390 5111035 4794028 4536238 4344993 4220997 4080862 3762017
8483 3762017 3366659 3070204 2851681 2663821 2509305 2384768 2264838 2131678 1994862 1878750
8473 1878750 1799131 1743595 1689442 1603177 1492523 1384686 1288928 1206698 1132617 1074398 1036248
8462 1036248 1006949 968500 911237 852782 832313 836709 855376 873975 860158 848666 843665 831361
8450 831361 810297 790220 762525 717118 688106 685358 683752 686003 671510 653361 615949 585042
8438 585042 556555 517084 487214 476845 473816 460614 454700 460706 474831 455375 436576 424341
8426 424341 433200 430474 423442 422812 417388 391678 366669 347247 336046 329837 321947 325135 335495
8413C35495j0534j3688k2209k0139j2169o469R08k10j7510l5315k1756j0693k606
8400A63105m44L245j345l7477j9519J2685L5588J1809m538O745N9845K0680n9167
8387A91212p7622o8310l7623M7310J07189Q0077L0169K5020L7950K5118J471p009
8375C54952l5355m7525m2124R482K7863J4449J6554M1533M7951K6425m2124q5166
8363B86915n7075l7829m8742m6643k2387J1774O787J2977O237n681N863L0144
8351A42340K5291M878j6784j3687n556o499k77J760j4654j3527k1K215Q67j2079
8337I4267n504J3234K0074J5789l89r698p172P814j2456k0057r373r585j048j2996
8323F2900j3293L8458N2001L4626K8989K1168j8821l7447k5584r692k9379j702
$$ plain form
8413 335495 324961 311273 289064 268925 256756 250287 251195 250985 233475 198160 176404 165711 163105
8400 163105 162661 165906 164561 127084 107565 120250 155838 167647 163109 169854 229699 250379 191212
8387 191212 113590 45280 7657 54967 162156 242233 272402 297422 335372 360490 361961 354952
8375 354952 319597 272072 229948 239430 267293 281742 298296 339829 387780 414205 372081 286915
8363 286915 229840 192011 143269 96626 74239 86013 92800 105777 112014 106333 112196 142340
8351 142340 167631 172509 155725 142038 136482 129983 129706 131466 116812 103285 103264 105479 106346 94267
8337 94267 88763 101997 122071 137860 137471 127773 120601 128415 115959 95902 86529 76944 75896 62900
8323 62900 49607 88065 140066 174692 203681 224849 206028 168581 142997 133305 103926 102224
8311A02224M484P082R525p454o747j3139k2443k8300j5879p347K117K0526L29
8298D4978J975J8116J0652l408j5090m776j288N039R990L230M750j3528j4791
8285D5849j4693m66J5677K078j1210J561M066k838k7P355J7601J0481R262R205
8271I3901j6594k4358q579r218n767k6296j6988r066P393K1231J8519J794J6570
8258D2542J4799p6M777k793j2346n995j1527j1349O285O950N702J7969O49j2929
8244D2658J986N569O437n889m192j1221j5587p30j1255n331N257k863k924M151
8230F066o559l668k698r46J229O05p100j4070j7718j0701M388k2621j2932k0825
8216a07550j6151j6013j0145o207j4056r547L4711N7356R0249R0264M0218O859
$$ plain form
8311 102224 106708 113790 123315 115861 109114 95975 73532 45232 29353 22006 24123 44649 44978
8298 44978 46953 65069 75721 72313 57223 52447 51159 56198 66188 69418 74168 60640 45849
8285 45849 31156 30690 46367 48445 37235 38796 42862 40024 39997 47352 64953 75434 84696 93901
8271 93901 77307 52949 44370 35152 29385 3089 -13899 -22965 -15572 5659 24178 25972 42542
8258 42542 57341 57265 62042 59249 46903 40908 29381 18032 24317 31267 36969 54938 55587 42658
8244 42658 44644 50213 56650 50761 46569 35348 19761 19031 7776 2445 7702 4839 1915 6066
8230 6066 -493 -4161 -6859 -7805 -6576 -5971 -13071 -27141 -44859 -55560 -51172 -73793 -86725 -107550
8216 -107550 -123701 -139714 -149859 -156066 -170122 -179669 -144958 -87602 2647 92911 133129 139988
8204A39988j6700j5289j2597p245M043J2935l855p081j7721o219n061k846j2689
8191D9663K089K35P912J0548M476J737r379q909o259o950j2682K953O973p323
8177C5084O242O262L34q800K372k246J6342Q660j4697m904O149j1287p473j27
8163C1911M664o720N903q795N322L523O04Q250K909M103j152k625P526j5136j1708
8148B8579K590q830p79O999q04p721N14K279J599J4210M381N614k508J0050R005
8133F5178J166j29R927Q410L60K1645J4729J4930J6666J5823J8005J5325K4940
8120B26975M6447P8942J07302J51007J95013K54393K82846K82275K38537J29695
8110A993432j6192j67819k54246k86983k86741k36613j70744j20347j03740n8901
$$ plain form
8204 139988 123288 107999 95402 88157 92200 105135 101280 94199 76478 70259 65198 62352 49663
8191 49663 51752 51987 59899 70447 74923 76660 67281 58372 52113 45163 32481 35434 42407 35084
8177 35084 41326 47588 47922 39122 41494 39248 55590 64250 49553 44649 50798 39511 32038 31911
8163 31911 36575 29855 35758 26963 32285 35808 36412 44662 47571 51674 50522 47897 55423 40287 28579
8148 28579 31169 22339 21560 28559 27755 20034 20548 22827 24426 38636 43017 48631 46123 56173 65178
8133 65178 66344 66215 76142 84552 84912 106557 121286 136216 152882 168705 186710 202035 226975
8120 226975 273422 352364 459666 610673 805686 1060079 1342925 1625200 1863737 1993432
8110 1993432 1977240 1809421 1555175 1268192 981451 744838 574094 453747 350007 291106
8100B91106m0091l4393l2015k4417j6897n631p520j6950j7119p474p74o156m336
8087G7333j1414j3565L282n240j9935j9982M999J0752j978O349j96j0385J913
8074B1933p074j1769p541J0652j2734P538P386K039J0597O62o68J4882J9078J0522
8060F5503j4251j3611j557r858k433Q164J2298j3994j2897l073p473P619J5300
8047B9737P725k278j2894k5585M293M019J4003J9565p207j796R88l002o929l224
8033A7415M433k340j076Pn521k967Q368J2384N148j729j7142k5511p962j958P960
8018a0491R791j410M64j0113m215L274J1975J4629N718M313K001N43n081K083
8004B3481l339l593J5429L550k804L884p311p082j264J1306k2839N964P965j046
$$ plain form
8100 291106 251015 216622 184607 160190 143293 137662 130142 113192 96073 88599 87825 81669 77333
8087 77333 65919 52354 55636 50396 30461 10479 15478 26230 24252 30601 30405 20020 21933
8074 21933 14859 3090 -4451 6201 -6533 1005 8391 10430 21027 21689 21021 35903 54981 65503
8060 65503 51252 37641 36084 26226 23793 31957 44255 30261 17364 14291 6818 14437 29737
8047 29737 37462 35184 22290 -3295 998 5017 19020 38585 31378 29582 30570 27568 20639 17415
8033 17415 21848 19508 18432 18439 12918 9951 18319 30703 35851 34122 16980 -8531 -16493 -18451 -10491
8018 -10491 -700 -2110 -1646 -11759 -15974 -12700 -725 13904 19622 23935 25936 26479 21398 23481
8004 23481 20142 16549 31978 35528 32724 36608 29297 22215 20951 32257 9418 15382 23347 22301
7990B2301j0376L926L770j1849k665R49M601Q185O567l098j7844n943l367J0854
7976F011J4378q331n035N176L311P134j451K614n150o553r141L670J761J4388
7962B2782J92j8519j502J5381M160J18J932o371K561j2569j0500N130M741P921
7948A5457J0545P250Q505n905j2448j5472Q914k0806m267J1500K00q81M103q51
7934E844j732k200L589R472K122j4370p91J0513J6933k671j9813j6582n059J809
7920a2936P567J0808J5850j2265r008K0442k377o82K56Q247L591j132m853j2236
7906A1272j173M72M666j673L111K689j5249j0995J567j838Q004P303J18J1886
7892B0160J0154K574j3421k986k680J211r516r202N279R274L978K216j0177k324
$$ plain form
7990 22301 11925 15851 19621 7772 5107 6056 10657 18842 25409 22311 4467 -1476 -4843 6011
7976 6011 20389 12058 7023 12199 15510 22644 21193 23807 18657 12104 2963 6633 8394 22782
7962 22782 22974 4455 2953 18334 22494 22612 24544 18173 20734 8165 -2335 2795 7536 15457
7948 15457 26002 33252 41757 35852 23404 7932 16846 -3960 -8227 3273 3473 2592 6695 5844
7934 5844 4112 1912 5501 14973 17095 2725 1934 12447 29380 26709 6896 -9686 -14745 -12936
7920 -12936 -5369 5439 21289 9024 16 20458 18081 17399 17655 25902 29493 28361 23508 11272
7906 11272 10099 10571 15237 13564 16675 19364 4115 -6880 -5313 -7151 853 8156 8274 20160
7892 20160 30314 32888 19467 16481 13801 15012 5496 -3706 1573 10847 14825 17041 6864 4540
7878D540p585o344j1628J8181K995l407l673p65o31L737n314J8253l215k949K798
7863D993o714j8513J34P617o1P558J890Q244P28p067k559j028J867l090N507J0332
7847I838L800r282n087k093p972j2464k995J8405M255J914j1092K774R107P686
7833F794J2104j5355j0011n947N05K891J3446J0076p553r234R699L226Q95q33
7819A0703j0051j4809j133J628Q571O633n077l991m241l706J0082M506j963j6905
7805a9753J1357P774J0715K1146K953m023r377j368q420N283n32l497r165K439
7791E532J1232j935j6498p674K981Q258o182Q34j3097l744N641j0033J5308J4053
7777D676L300p33p497R556o5n943P721k095p232j432N555l020M037J0259O727
$$ plain form
7878 4540 -3045 -9389 -21017 -2836 159 -3248 -6921 -7686 -8317 -4580 -9894 8359 5144 2195 4993
7863 4993 -1721 -20234 -20100 -12483 -12544 -4986 -3096 5148 5876 -1191 -3750 -4778 -2911 -6001 -494 9838
7847 9838 13638 4356 -731 -2824 -10796 -23260 -26255 -7850 -3595 -1681 -12773 -9999 -892 6794
7833 6794 18898 3543 -6468 -12415 -11910 -9019 4427 14503 6950 -2284 7415 10641 11536 10703
7819 10703 652 -14157 -15290 -13662 -5091 1542 -3535 -7526 -11767 -15473 -5391 -885 -2848 -19753
7805 -19753 -8396 -622 10093 31239 34192 30169 20792 19424 11004 16287 15755 12258 3093 5532
7791 5532 16764 14829 -1669 -9343 -6362 1896 -4286 -3452 -16549 -20293 -14652 -24685 -9377 4676
7777 4676 7976 7243 -254 9302 9237 3294 11015 8920 1688 256 5811 2791 6828 17087 23814
7762B3814Q771r630j2048o825J244N93j513k497j581o630k839J4344J2573j942
7748A5834N035l398K151j13j2725j0137q200K402l808J0435K820p318M497J4525
7734A2000O323o44o085j0253k650J2209K617L583o722j6674N935M353n641j017
7720b666o779j8170j330J3442O426j147j0071m736j102J3838J0738K787L209J99
7706D638J157N492r39r110q482k847j630J553j140P790N84r113O02J3785O788
7691I128j3074p095r098M245m49p405J4326L436m28R332K773R154q090r898R144
7676F001J996n165o64n079m705j162j1453K30k814j915J2339M480J373P887J0146
7661A1495N562J81o912j3334o099k339k169J0183k24N539K804J953O750q109j2932
$$ plain form
7762 23814 32585 22955 10907 4082 5326 5919 4406 1909 328 -6302 -9141 5203 17776 15834
7748 15834 20869 17471 19622 19509 6784 -3353 -11553 -9151 -12959 -2524 296 -7022 -2525 12000
7734 12000 18323 17679 11594 1341 -1309 10900 13517 17100 10378 -6296 -361 3992 -1649 -2666
7720 -2666 -9445 -27615 -28945 -15503 -9077 -10224 -20295 -25031 -26133 -12295 -1557 1230 4439 4638
7706 4638 5795 11287 10348 1238 -7244 -10091 -11721 -10168 -11308 -3518 -2934 -12047 -11445 2340 9128
7691 9128 -3946 -11041 -20139 -15894 -16343 -23748 -9422 -5986 -6414 2918 5691 14845 6755 -3143 6001
7676 6001 7997 2832 2168 -2911 -7616 -8778 -20231 -20001 -22815 -24730 -12391 -7911 -6538 1349 11495
7661 11495 17057 17238 10326 -3008 -9107 -11446 -13615 -3432 -3656 1883 4687 6640 13390 5281 -7651
7646g651q00K359N332P47M887P688R766l196j8306r464k46O839m006q906j267
7631a6224L35n606o729M690J355J5076l736k701K776L65j402N074j204J6307Q032
7616A6408o835j0761N721M674L421K632j0471j4097J0228J1636o429K955m776
7603D306p861j176n852n387k45J1870O336r966r088J0779J3533K340N227j0360
7589D456p605j248O99P098q675j0386J0641J2798o1m673n665R74m96M070J2002
7574A3929P814m172m904j2093r329N107K180j0291M655Q427J963l556Q383J1533
7560A9646J784j2091j185j0206p137L920O359m348j5151k908l840J341J3802Q809
7546a205l980o640J3512O981N59O258r214j002J0589J0546o656J94n196N30L246
$$ plain form
7646 -7651 -8451 -6092 -760 -13 4874 12562 22328 19132 826 -8638 -8884 -2045 -6051 -14957 -16224
7631 -16224 -15889 -21495 -28224 -23534 -22179 -7103 -10839 -13540 -10764 -10399 -11801 -6727 -7931 8376 16408
7616 16408 9573 -1188 4533 9207 12628 15260 4789 -9308 920 12556 6127 9082 4306
7603 4306 -3555 -4731 -10583 -15970 -16215 -4345 1991 -7975 -17063 -6284 7249 9589 14816 4456
7589 4456 -3149 -4397 -3698 3400 -5275 -15661 -5020 7778 7717 3044 -2621 -1647 -2143 1927 13929
7574 13929 21743 17571 12667 574 -8755 -3648 -1468 -11759 -7104 1323 3286 -270 8113 19646
7560 19646 21430 9339 8154 -2052 -9189 -5269 1090 -3258 -18409 -21317 -25157 -23816 -10014 -1205
7546 -1205 -5185 -11825 1687 8668 9227 15485 6271 5269 15858 26404 19748 19942 14746 15276 18522
7531A8522k041Q398o96j6115j883J9214J60n260j4805M230N022j0740j0425o31
7517g050q833N819K3789J2581j640q469k5m649j237k358j3392M33N769M9q824
7502h037l536J302O21n440p318j93J5922J1153p95k858M95L858l188j292j3672
7487a2978k594J383J724m366J905J1333J7601J0643j3400j533j014j809N249J964
7473A4108j1286q235R538M99R364N159L993m878n454j0823o019m157P127J092
7459B8m99l144j0397O766N444P765k835k427J688n953J088P157N328r117R192
7444A0084J56l468j9264j4158j219P071K975K30q168J261J2311N478l096k482
7430a2289J3217K732Q54N108J3433L237j0547j4194l749R498J2572r49M03O441
$$ plain form
7531 18522 16481 24879 24183 8068 6185 25399 25559 20299 5494 9724 14746 4006 -6419 -7050
7517 -7050 -15883 -10064 13725 26306 24666 16197 16172 11523 10286 7928 -5464 -5031 738 787 -8037
7502 -8037 -11573 -10271 -9650 -15090 -22408 -22601 -6679 4474 3679 821 1316 5174 1986 694 -12978
7487 -12978 -15572 -14189 -12465 -16831 -14926 -3593 14008 24651 11251 9718 8704 6895 12144 14108
7473 14108 2822 -5413 4125 4624 13988 19147 23140 18262 12808 1985 -4034 -8191 -1064 28
7459 28 -471 -3615 -14012 -7246 -1802 5963 3128 701 2389 -3564 -2476 4681 10009 892 10084
7444 10084 10240 6772 -12492 -26650 -27869 -20798 -17823 -17593 -25761 -24500 -12189 -6711 -9807 -12289
7430 -12289 928 3660 4514 9622 23055 26292 15745 1551 -2198 7300 19872 18923 19326 25767
7416B5767k0219J738K079k7186r946L662o0N140M762J7286J1521k462N236J229
7402A8547r229m399L166r758j2495N314l774M684M567K388k836j909K802l636
7388f568p10k634J8812j067j0712j0084L228J6088j790J051j0620m501Q12P775
7374i20P980m454j7448r30k92L363q601p562J1193Q380Q816j630O420O041m218
7359F138m850P603N154J717n521j2629N824L94j7191j117J1138J0302J861q868
7345d5k9852j0256P968J4382J6615J2382r938j6450K641p690j882J3253K107K710
7331d055J002N510j682k461j5283J2166Q821j6169r946q18r81M443K804L750k55
7316a3154J6369j309q495J8529n545j1113J2546L404r142j925N006j0027k314
$$ plain form
7416 25767 5548 7286 9365 -17821 -27767 -24105 -24165 -19025 -14263 3023 14544 12082 17318 18547
7402 18547 9318 4919 8085 -1673 -14168 -8854 -12628 -7944 -3377 -989 -3825 -5734 -2932 -6568
7388 -6568 -7278 -9912 8900 7833 -2879 -12963 -9735 6353 4563 5614 -5006 -9507 -8695 -920
7374 -920 7060 2606 -14842 -15772 -16064 -12701 -21302 -28864 -17671 -9291 -475 -2105 4315 10356 6138
7359 6138 1288 8891 14045 15762 10241 -2388 3436 3830 -13361 -14478 -3340 6962 8823 -45
7345 -45 -29897 -40153 -32185 -17803 -1188 11194 1256 -15194 -12553 -20243 -22125 -8872 -6765 -4055
7331 -4055 -3053 2457 775 -1686 -16969 -4803 4018 -12151 -22097 -22915 -23896 -19453 -16649 -12899 -13154
7316 -13154 3215 1906 -6589 11940 6395 -4718 7828 11232 2090 165 5171 -4856 -7170
7303g170J1925J3386n750j5040n057k33Q495J6287L432M330m001j1683P486j791
7289A4616j2710K831J294j3482P396L216P637L946L234n464k0721n675M847M970
7275d065O425j5k79n19J471J600j1704q240j201k620Q81J5628p069k956l801M25
7259a6039Q807J764P013K051n724j9494r947J7168J1972R762r27q930j7503J0730
7245i297O054K631l544M734O50r306j0723j354O062J967q11k242N780Q812j243
7230a830o075J1719N218j2263j2614J0996J4434j710j4222m324k4O169N602k011
7216i35j883q055K033J411l244J6281N328j0779R34j1731o235R388M098m101M299
7201c191P30J272j754R880J5441k80j9183N179k576o512k297j696O064P712M318
$$ plain form
7303 -7170 4755 18141 12391 -2649 -7706 -7939 556 16843 20275 24605 20604 8921 16407 14616
7289 14616 1906 4737 6031 -7451 -55 3161 10798 14744 17978 12514 -8207 -13882 -9035 -4065
7275 -4065 2360 2345 2066 1547 3018 4618 -7086 -15326 -16527 -19147 -18266 -2638 -9707 -12663 -16464 -16039
7259 -16039 -7232 -5468 1545 3596 -2128 -21622 -31569 -14401 -2429 7333 6406 -2524 -20027 -9297
7245 -9297 -3243 -612 -4156 578 1228 -8078 -18801 -20155 -14093 -12126 -12937 -15179 -9399 -587 -1830
7230 -1830 -7905 3814 9032 -3231 -15845 -4849 9585 7875 -6347 -10671 -10695 -4526 1076 -935
7216 -935 -2818 -10873 -8840 -7429 -10673 5608 10936 157 1091 -10640 -16875 -7487 -3389 -7490 -3191
7201 -3191 -2461 -1189 -2943 6937 22378 22098 2915 8094 5518 -994 -3291 -4987 1077 8789 13107
7186A3107K024N652n41j4390k247J3492J830j2513o723p737j1974Q684L683L74
7172g279N552j184k992Q282j5971j2304j2995j6J3988K719O260L934J430N050
7158e526N064j129n742J0434O107J1502N63m538Q532r024k0802J817m224l55Q643
7143A322m172J412j042J975j466J19o090p484M950J875J471P499J084O130J643
7128I226n079m420j8152k304J0757n775m431R497L952J5103J6087r120j2083p109
7114c851j4433K392Q507j284j3543L263J7344J9038K849q378l204J3479O473n485
7100B3167j7280j2151l733k575P054J4633M648j7328j1754O021N988k683m554
7087a0547o057l024j523J5953L87R99L011j4591N403L701k995n381L540j6063
$$ plain form
7186 13107 15131 20783 20242 5852 3605 17097 18927 6414 -309 -8046 -20020 -11336 -7653 -7279
7172 -7279 -1727 -2911 -5903 2379 -13592 -25896 -38891 -38907 -24919 -22200 -15940 -12006 -10576 -5526
7158 -5526 -462 -1591 -7333 3101 9208 20710 21273 16735 25267 16243 -4559 -2742 -6966 -7321 1322
7143 1322 -2850 -1438 -2480 -505 -1971 -1852 -7942 -15426 -10476 -8601 -7130 369 1453 7583 9226
7128 9226 4147 -273 -18425 -20729 -9972 -15747 -20178 -10681 -6729 8374 24461 15341 3258 -3851
7114 -3851 -18284 -15892 -7385 -8669 -22212 -18949 -1605 17433 20282 11904 8700 22179 28652 23167
7100 23167 5887 -6264 -9997 -12572 -5518 9115 13763 -3565 -15319 -9298 -3310 -5993 -10547
7087 -10547 -16604 -19628 -21151 -5198 -4811 -3812 -801 -15392 -9989 -6288 -9283 -14664 -11124 -27187
7073b7187j6560m913J1944R777l39o15J0324Q704P883o22P459Q744l600q272p02
7058B025j0175j2372J563J3987P660K92j97l611k262O705l974q934j0900m898
7044b5091J1397O166L567N793J1653l504p351P913q61j6381r24k023N353p663
7030a1956L599J5120J0762J135m240j0150j646J0646L639Q624j489j0981p753
7017E310N200n294L265L504p350o13J0244J0736R8r813j5646M8j021j424J003
7002a753j8290j2709m524J0198J1461J1583P305L928p146k42j1102L651J222k503
6988h921J092J3400l598n269j2487j6736j360N870n399K527J0690J4966M527N335
6974D637J000k723Q620j81j2816O372j367K107o386Q755j550p559J3571Q539m670
$$ plain form
7073 -27187 -43747 -48660 -36716 -26939 -27278 -27893 -17569 -8865 -982 -1604 5855 14599 10999 2727 2025
7058 2025 -8150 -20522 -18959 -4972 2688 2980 2783 -828 -3090 3615 -359 -9293 -20193 -25091
7044 -25091 -13694 -7528 -3961 1832 13485 9981 2630 10543 9682 -6699 -7623 -9646 -4293 -11956
7030 -11956 -8357 6763 17525 18660 14420 4270 2624 13270 16909 25533 24044 13063 5310
7017 5310 10510 5216 8481 11985 4635 4022 14266 25002 25100 15287 -359 -311 -1332 -2756 -1753
7002 -1753 -20043 -32752 -37276 -27078 -15617 -4034 3271 7199 53 -189 -11291 -7640 -6418 -8921
6988 -8921 -7829 5571 1973 -3296 -15783 -32519 -33879 -28009 -33408 -30881 -20191 -5225 -698 4637
6974 4637 5637 2914 11534 11353 -1463 4909 3542 5649 -737 8018 6468 -1091 12480 21019 16349
6959A6349j205j6507o276M622j0391p706Q520P114Q591L954p874j1124L922R693
6945A682K1141m502j5757q497l924p905j4043J7J99l760J3835J9449M018n841
6931c888m506J23J7921j794j104J4663q07j0511k591n256l663o988M732Q658L180
6916H169K523l102r599o527j335J7388J2881N142j7621m044L751P079L409p449
6902A0665n246k035J4006Q81j2066N70j0207p841J810q688M081m590m123Q715
6888a4068J3253j953j0046R673O922k793j4090k618Q241l674N858J3181k917m919
6874E0j259O993n287k929j5252J4787J5667R85m502m940j2892K655O336j1525
6860a1113J160P141J0532m073K147J367k276j5796l572Q031K598J52j1736L468
$$ plain form
6959 16349 15144 -1363 -7639 -3017 -13408 -21114 -12594 -5480 3111 7065 -809 -11933 -8011 1682
6945 1682 22823 18321 2564 -5933 -9857 -17762 -31805 -31788 -31589 -35349 -21514 -2065 1953 -3888
6931 -3888 -8394 -8271 9650 7856 6752 21415 20608 10097 7506 2250 -1413 -8401 -3669 4989 8169
6916 8169 10692 7590 -2009 -8536 -9871 7517 20398 25540 7919 3875 7626 14705 18114 10665
6902 10665 5419 3384 17390 18271 6205 6775 -3432 -11273 -9463 -18151 -14070 -18660 -22783 -14068
6888 -14068 -815 -2768 -12814 -3141 3781 988 -13102 -15720 -7479 -11153 -5295 7886 4969 50
6874 50 -1209 5784 497 -2432 -17684 -2897 12770 13755 9253 4313 -8579 -5924 412 -11113
6860 -11113 -9953 -2812 7720 3647 5794 7161 4885 -10911 -14483 -6452 -3854 -3702 -15438 -11970
6846a1970p115p72J2577P118k511M280j542R709M418q317o549m638j775N492J0895
6831I300J597o392j1006K965N406k349m00O002n299p710p098P477J998Q081q872
6816f300j3257l034J5635R018n730L044Q106n482m88q360m174o065J0105N041
6802a941m401J1705j382p531O565r380l04N096P465J31L547o690j1193m35J0227
6787A479J0838j6109k4880Q237O158J120M000j139J1369R930j1141o051N825M656
6773D292o32N04m386R274N177R715k445p446m056K993J71N805m321q585o174k855
6757b969N73j048Q035P174r58n138L292J201J762j9290J39J60j853P063m20k894
6741e171p634p904P068J4006k383K153m315m647R285P63q039r420N803J7088M718
$$ plain form
6846 -11970 -19085 -19857 -7280 -162 -2673 1607 65 9774 14192 5875 -674 -5312 -7087 -1595 9300
6831 9300 10897 4505 -6501 -3536 1870 -479 -879 5123 -176 -7886 -14984 -7507 -5509 2572 -6300
6816 -6300 -19557 -22591 -6956 2062 -3668 -624 7482 2000 1512 -6848 -11022 -17087 -6982 -1941
6802 -1941 -6342 5363 3981 -3550 3015 -6365 -6669 -1573 5892 6023 9570 2880 -8313 -8748 1479
6787 1479 12317 -3792 -28672 -20435 -14277 -13157 -9157 -10296 1073 11003 -138 -6189 -364 4292
6773 4292 3660 4164 -222 9052 14229 23944 21499 14053 9997 12990 13161 18966 14645 6060 -114 -2969
6757 -2969 -2396 -3444 4591 11765 10807 5669 8961 10162 11924 -7366 -7227 -7067 -8920 -1857 -2277 -5171
6741 -5171 -12805 -20709 -13641 365 -2018 135 -4180 -8827 458 1221 -6818 -16238 -10435 6653 11371
6726A1371m53r164k5970j432J0975J2360N657P09K786j125q289J334J2336m824
6712F271k69O452J1722o832k1419o664J1476J06M524J0421j467l649p183j1741
6698h252m947M654J4689p395q838k876K009P975Q713J0455j3624n122j285p197
6684a1041j038J4604j5505n889L692l942k458M11J8868l385j8651r50q23q380
6670c4487M754J0079J7314J0861O552l29r718J0104m922j3239j579o655j375J8756
6656F116J2815J019N52P715k5204j3161L425O570J415r813r744J0366N528N398
6642B997J5422k764Q89O461p876j5946k688J4264l572l132p606Q334J3135r05
6628A7013n965n62n788k929O254J464j6534m01l070j1590j0925J7636J2904Q768
$$ plain form
6726 11371 10918 1754 -24216 -25648 -14673 -2313 3344 4053 6839 5714 -2575 -1241 11095 6271
6712 6271 6002 12454 24176 17344 -4075 -10739 737 843 5367 15788 14321 10672 3489 -8252
6698 -8252 -13199 -8545 6144 -1251 -10089 -12965 -10956 -2981 5732 16187 2563 -2559 -3844 -11041
6684 -11041 -12079 2525 -12980 -18869 -15177 -19119 -21577 -21166 -2298 -5683 -24334 -25284 -26107 -34487
6670 -34487 -29733 -19654 -2340 8521 15073 14744 5026 15130 10208 -3031 -4610 -11265 -12640 6116
6656 6116 18931 19950 20502 28217 3013 -10148 -6723 -153 1262 -8551 -18295 -7929 -2401 2997
6642 2997 18419 15655 16544 23005 15129 -817 -3505 10759 7187 4055 -3551 4783 17918 17013
6628 17013 11048 10486 4698 1769 8023 9487 -7047 -7448 -10518 -22108 -33033 -15397 -2493 6275
6614F275J875n685k970J107P198O71M4K630q18q051o100r583p504P059m94K393
6598a1953J6521J1701M974n812j4332m769M269q901Q23N182m985n832m128L407
6584a3835N424k0K0801k628j5737J041k300O859J4417M179o369o441k3633r721
6570b7963J5802J3224J3383J957k572K012P733j2358n518K862m910J0106K540
6557A6298p057m066k86k44k230j4210K756J1482M215m147l000Q146j335p66o273
6542g17j5369K053j502N221O65k480K548M046J245p123j399n610N695M104k726
6527a1349l742r901J1261J8399l837j5113o079l789n76M014J3878n834L689J710
6513g269l88J7271K234m923j2794O443J0447O252q96l578j2101j6488j8512K109
$$ plain form
6614 6275 8150 2465 -505 602 7800 8471 8515 11145 10327 2276 -3824 -13407 -20911 -13852 -14346 -11953
6598 -11953 4568 16269 21243 15431 1099 -3670 599 -8302 -7479 -2297 -7282 -13114 -17242 -13835
6584 -13835 -8411 -8431 12370 9742 -5995 -4954 -7254 -395 14022 18201 11832 5391 -18242 -27963
6570 -27963 -12161 1063 14446 16403 13831 15843 23576 11218 5700 8562 3652 13758 16298
6557 16298 9241 5175 4889 4645 2415 -11795 -9039 2443 6658 2511 -489 7657 6322 5556 -717
6542 -717 -16086 -14033 -15535 -10314 -9649 -12129 -9581 -5535 -4290 -11413 -12812 -18422 -12727 -8623 -11349
6527 -11349 -15091 -24992 -13731 4668 831 -14282 -20361 -24150 -24726 -20712 -6834 -12668 -8979 -7269
6513 -7269 -7657 9614 11848 6925 -5869 574 11021 17273 16377 12799 698 -15790 -34302 -32193
6499c2193K2001O208m960j954k1556j2784J5359J6227L765o73R61n097O68o797
6485b0825k275J110j1998n266J3290M761J0906J382j166o283K45P4J1691O580
6471B226q669o106L08q277P402K170J7760Q279l768R880k832o893n225n676n949
6456e370r18Q260Q620j376k514J0747j701j4300q526j728K216J1982O099K645
6442A4136K479j1401j6766L650J5825o594r339O753k213M888N264K197o396j2186
6428i703p700J763j1226O941n89p990P639K2327O849K300J822J668N955o890n028
6413H138J3709n190k0697j1956p54Q783M983M108Q34n083q582n773M748J2323
6399d09O033j3650k534J4754j6295k1355K101J2253Q685N369J2482N040O476j369
$$ plain form
6499 -32193 -10192 -3984 -8944 -10898 -32454 -45238 -29879 -13652 -9887 -10560 -9599 -14696 -14028 -20825
6485 -20825 -23100 -21990 -33988 -39254 -25964 -21203 -10297 -8915 -10081 -16364 -16119 -16045 -4354 2226
6471 2226 -6443 -12549 -12241 -20518 -13116 -10946 6814 15093 11325 21205 18373 11480 6255 579 -5370
6456 -5370 -6288 1972 10592 9216 6702 17449 15748 1448 -7078 -8806 -6590 5392 11491 14136
6442 14136 16615 5214 -11552 -7902 7923 1329 -8010 -1257 -3470 1418 6682 8879 2483 -9703
6428 -9703 -17403 -15640 -26866 -19925 -20514 -28504 -20865 1462 8311 10611 12433 14101 20056 13166 8138
6413 8138 21847 16657 -4040 -15996 -16750 -7967 -2984 1124 1958 -3125 -11707 -17480 -12732 -409
6399 -409 5624 -8026 -10560 4194 -12101 -33456 -31355 -19102 -10417 -5048 7434 12474 18950 17581
6385A7581j244O219p86j7522p220m678q325J041j073N38R87K642J7109R139k497
6370A1911L899Q850j0972j2928k05k277j958l273k335J051j625K074M459Q660
6356E331j800j0139o943o355L563k910O431M391Q578j637R206P93L640L54r956
6341B547j5191J811J742K820J1406J699q961o734k203K237j4909J0006J6688J1759
6327A4717N737m168k351j621p395k702n062q020O872p55J917J7306J2607J03j0124
6312A7061j0570j2030p896Q454L174N025R095l132n284N401k940O150L711K185
6298A8404K541n310j2897k001j102M637K294N882J1624J2063m993j6248k2430
6285g536j3147j783J5789k054l943m578L352m422m032J360R275P467m995m396
$$ plain form
6385 17581 16337 22556 21770 4248 -2972 -7650 -15975 -14934 -16007 -15469 -14482 -11840 5269 14408 11911
6370 11911 15810 24660 13688 760 555 -1722 -3680 -6953 -9288 -8237 -9862 -7788 -3329 5331
6356 5331 3531 -6608 -13551 -19906 -16343 -19253 -12822 -8431 147 -1490 7716 8509 12149 12503 2547
6341 2547 -12644 -10833 -9091 -6271 5135 6834 -2127 -8861 -11064 -8827 -23736 -13730 2958 14717
6327 14717 20454 16286 13935 12314 4919 2217 -2845 -10865 -3993 -4748 -2831 14475 27082 27185 17061
6312 17061 6491 -5539 -13435 -4981 -1807 3218 12313 9181 3897 9298 6358 12508 16219 18404
6298 18404 20945 15635 2738 737 -365 4272 6566 12448 24072 36135 31142 14894 -7536
6285 -7536 -20683 -22466 -6677 -8731 -12674 -17252 -13900 -18322 -22354 -20994 -11719 -4252 -9247 -13643
6271a3643p833p80J063J1489M117R840O500N66m723n877p807N151J789o709P42
6256f115q178J821K838J5326p43L011p053m294N273R648j5333k441J3861J889
6242I510j6043o897k586l671J3099r109q321J300j992n434K498k802O864l447
6228b7031j3855J1661K0608M382n536K863q83j0754n124Q807K526q265o045m876
6214c1522M225N968p140N159J4157p373R68J3630L436k357K29k675M4j594j189
6199f034l640r150O139J2449j1039K425J4657J0842O215o939m305m98m226l816
6185C080J556R05p885n047P345P756j837q907o184K148M042j539L459M564M256
6170G712q550r100k329J5776k720n460K394j555j4614R089J8848n799j734l97
$$ plain form
6271 -13643 -21476 -22256 -21193 -9704 -5587 4253 10753 11319 6596 719 -7088 -1937 -148 -6857 -6115
6256 -6115 -14293 -12472 -9634 5692 4949 7960 907 -3387 1886 11534 -3799 -6240 7621 9510
6242 9510 -6533 -13430 -16016 -19687 -6588 -15697 -24018 -22718 -24710 -30144 -27646 -30448 -23584 -27031
6228 -27031 -40886 -29225 -8617 -4235 -9771 -6908 -7791 -18545 -23669 -14862 -12336 -20601 -26646 -31522
6214 -31522 -27297 -21329 -28469 -23310 -9153 -16526 -15558 -1928 1508 -849 -620 -3295 -3251 -4845 -6034
6199 -6034 -9674 -18824 -12685 -236 -11275 -8850 5807 16649 22864 15925 11620 11122 6896 3080
6185 3080 4636 5541 -2344 -7391 -46 7710 5873 -3034 -9218 -7070 -3028 -4567 -1108 3456 7712
6170 7712 -838 -9938 -12267 3509 789 -4671 -2277 -3832 -18446 -9357 9491 3692 1958 1561
6156A561j2695j7778L263j4981k757O008J386R205J3500J0775P979J218J1499
6143A8183k09o594j855j894n461j7404j6248j1922J8171J0525J298L985m777j79
6129a4381p801L363l162K96l38L734N03M432P962J7625N081P77n653p213j2157
6114f932K013j2880q8K797M896R771j086J011Q472K197j6564j86m194O739k357
6099f391n937N03p529R080J4496k117m462k83N253J2248L391J02m642l417o192
6084D103q015J6078M138l930j1031J642o399J0711r867j8459Q355P065J5664K56
6070A0311n730n411n974J0548J108j1602L910R1o742j1133J296R626J8016j879
6056F435r712k552j913J44N845l68J008J737j2251j6247m942J2971L243J803L431
$$ plain form
6156 1561 -11134 -28912 -25649 -40630 -43387 -37379 -35993 -26788 -13288 -2513 5466 6684 18183
6143 18183 17974 11380 9525 7631 2170 -15234 -31482 -43404 -25233 -14708 -13410 -9425 -14202 -14381
6129 -14381 -22182 -18819 -21981 -21685 -22023 -18289 -17786 -13354 -5392 12233 17314 18091 12438 5225 -6932
6114 -6932 -4919 -17799 -17887 -15090 -10194 -423 -1509 -498 7974 10171 -6393 -6579 -10773 -4034 -6391
6099 -6391 -12328 -11825 -19354 -10274 4222 2105 -2357 -2640 2613 14861 18252 18354 13712 10295 4103
6084 4103 -3912 12166 16304 12374 1343 2985 -3414 7297 -2570 -21029 -12674 -5609 10055 10311
6070 10311 4581 -830 -6804 3744 4852 -6750 -2840 -2749 -9491 -20624 -19328 -9702 8314 6435
6056 6435 -3277 -5829 -7742 -7598 -1753 -2121 -1113 624 -11627 -27874 -32816 -19845 -16602 -14799 -11368
6041a1368J4557M399K604J689O287j791j2135k0133L452Q942J767J385p195N107
6027b433j1172j796Q101O964j638j402L992R404l234j1987K949O877n959j0019
6013a1353Q56j94J3135k177m134M599J1739j5767j6980J0982M585M602M049R9
5999D041p767p282J4197R373j13l928j8757r36L502R080N254r717Q411J5902r927
5984A1333q743o093P337L055l844j357l49j2543j004r479n032n825L872J0461
5970a8211M860p614r718J5504Q701q760o737j7669k178J9746J6241N61k695O196
5956a773N394L721L764j0058o360q86O820N221M531q785j1904O052P62L532K173
5941B204j6011j3466L614L789P883O336J924j0364l605m903k611K2311P415j1494
$$ plain form
6041 -11368 3189 7588 10192 11881 18168 16377 4242 -15891 -12439 -3497 -1730 -345 -7540 -2433
6027 -2433 -13605 -15401 -7300 -336 -1974 -3376 616 10020 6786 -5201 -2252 4625 -1334 -11353
6013 -11353 -10497 -10691 2444 267 -3867 732 12471 -3296 -20276 -9294 -4709 -107 3942 4041
5999 4041 -3726 -11008 3189 12562 12449 8521 -10236 -11172 -7670 1410 6664 -3053 5358 21260 11333
5984 11333 2590 -3503 3834 6889 3045 1688 1339 -11204 -12208 -21687 -26719 -32544 -28672 -18211
5970 -18211 -13351 -20965 -30683 -15179 -6478 -15238 -21975 -39644 -41822 -22076 -5835 -5274 -7969 -1773
5956 -1773 3621 7342 11106 1048 -5312 -6198 622 5843 10374 1589 -10315 -4263 -3501 31 2204
5941 2204 -13807 -27273 -23659 -19870 -11987 -5651 -3727 -14091 -17696 -22599 -25210 -2899 4516 -6978
5927f978j5314n321O429k07J3907Q348M468q976o242Q661M316J611J1282o925
5913I059J854n791n266N155j0180o009n237L390o154J0361n77p631n202k74L524
5898a8978N32J2168O340k710o419j1724q610J1209R917K059N073J1499n625m130
5884F01l14o298j0316k71N455M438k55o307r871J1552J5892K1496k19j0197o927
5869H459J56L915k449n234l056m145q734q65K809m274M645k946J0229k296O783
5854B997n620r787R949N117j3605J1063J2983L667m631q264j2982k829q921l086
5840b3949N157P535J877n133j2884R065J8581k498j4268m98P186O962J1935p642
5826A426o303k0008J403P110P459M379k826N596J6768J546j4789j6329M996K114
$$ plain form
5927 -6978 -22292 -27613 -21184 -21391 -7484 864 5332 -3644 -9886 -1225 3091 4702 15984 9059
5913 9059 10913 5122 -144 5011 -5169 -11178 -16415 -13025 -19179 -8818 -9395 -17026 -22228 -22502 -18978
5898 -18978 -18446 -6278 62 -2648 -9067 -20791 -29401 -18192 -8275 -6216 -1143 10356 4731 601
5884 601 287 -6011 -16327 -16598 -11143 -6705 -6960 -13267 -23138 -11586 4306 25802 25583 15386 8459
5869 8459 8615 12530 10081 4847 1791 -2354 -11088 -11953 -9144 -13418 -8773 -11719 -1490 -3786 2997
5854 2997 -2623 -12410 -2461 2656 -10949 114 13097 16764 12133 3869 -9113 -11942 -20863 -23949
5840 -23949 -18792 -11257 -9380 -14513 -27397 -18332 249 -2249 -16517 -17015 -9829 -2867 9068 1426
5826 1426 -4877 -24885 -23482 -16372 -8913 -4534 -7360 -1764 15004 16550 1761 -14568 -9572 -7458
5812g458J1027L277j398n806K731q09j087m899K604Q426j0220l502J727R061J3624
5797A7298j605j7999p094Q891L348j1775l488J0794L608j1307o95L526L443n472
5783h527q45N395P678Q501o745k600n311j77o886j757J729l778P42K055k118J206
5767a1438J3234K650o354R522J895J716j2194m260O806m170q408j871J7862K695
5753G685o11m623n354m196Q436k554j583o491K761N765N3L478P330j2267P111
5738D940J0081J782j8961p203J8526J0580j0468q276K424O411M000r849j2880
5725h893j0249N900p734N650J3582J6945R395r292q648K136J0351O571p914o131
5711A1669O95j2808j2420m818L468N151o229L829J4180J160j0578R311J3615O556
$$ plain form
5812 -7458 3569 6846 5448 -358 2373 1564 477 -4422 -1818 6608 -3612 -7114 -5387 3674 17298
5797 17298 15693 -2306 -9400 -509 2839 -8936 -12424 -1630 1978 -9329 -10024 -6498 -3055 -8527
5783 -8527 -9372 -3977 3701 12202 5457 2857 -2454 -2631 -9517 -11274 -9545 -13323 -12581 -10526 -12644 -11438
5767 -11438 1796 4446 -1908 7614 9509 11225 -969 -5229 1577 -2593 -11001 -12872 4990 7685
5753 7685 7074 2451 -2903 -7099 1337 -1217 -2800 -9291 -6530 -765 -712 2766 10096 -2171 4940
5738 4940 15021 16803 -2158 -9361 9165 19745 9277 1001 3425 9836 13836 3987 -8893
5725 -8893 -19142 -13242 -20976 -15326 -1744 15201 24596 15304 6656 8792 19143 25714 17800 11669
5711 11669 12364 -444 -12864 -17682 -14214 -9063 -15292 -11463 2717 3877 -6701 2610 16225 22781
5697B2781j2036j4964M647K265p515l274p518J1327o798o246N504N671l832o508
5683a6496J833J1990P16l593R2k496p106K608M667k229m975K76N678J7337N531
5668A3833j2811m818J1358Q296r213r477m326p476J5719M046l460N079k380P556
5654A1926o698k664n120K231l829K944J0956j657q396l129K434k604j153J774
5640b985j490k574j1032O868J839j3663L792O692N010p388l550R311Q299k302
5626c173P533M46J196K043k570j4505p443N201J1546N555l694l688L054l087N877
5611D291o011j2081j5609j883K965J6413J2884L646J2592k817j3789M290N55n594
5597a48n607O179j883K812J9860J6286p508k8111j7307p714M842J0716O605J2930
$$ plain form
5697 22781 10745 -4219 428 2693 -4822 -8096 -15614 -4287 -11085 -17331 -11827 -6156 -9988 -16496
5683 -16496 -14663 -2673 -1957 -5550 -5458 -7954 -15060 -12452 -7785 -10014 -14989 -14713 -9035 8302 13833
5668 13833 1022 -3796 7562 15858 6645 -2832 -7158 -14634 1085 5131 1671 6750 4370 11926
5654 11926 5228 2564 -2556 -325 -4154 -1210 9746 8089 -307 -3436 -1002 -3606 -4759 -2985
5640 -2985 -4475 -7049 -18081 -11213 -9374 -23037 -19245 -12553 -7543 -14931 -18481 -9170 -871 -3173
5626 -3173 4360 4806 6002 8045 5475 -9030 -16473 -11272 274 5829 2135 -1553 1501 -1586 4291
5611 4291 -1720 -13801 -29410 -31293 -28328 -11915 969 4615 17207 14390 601 4891 5446 -148
5597 -148 -5755 424 -1459 1353 21213 37499 29991 1880 -15427 -23141 -18299 -7583 -978 11952
5583A1952J1106j2786j7936m926N937K553k661K264j930M163K231l741m721J1530
5569C035Q81j7096j3780j330L906K2621L894j0121k197k420n761r822m889J0074
5555b3005L569J2964l232j508N86l046J1629J1954q85l519q462po920o872J224
5540a5530J5599j06K905n126o572j4323l041J4454L168R355O998M161m207j3888
5526f153j3496n885J3539k126N757Q693l356k5473M145R603p00j08o039r587J59
5511c1027J7726J0262k516J2390k970N122l915r536p193m212K0461j750j2243
5498i401L349M881p520j2389L561Q987J3990n15q030l307Q596L19n688r327N05
5483a1989N150N156m365O81N141j590L047M711j629j697n619J1441J4794M994
$$ plain form
5583 11952 23058 10272 -7664 -12590 -6653 -4100 -6761 -4497 -6427 -2264 -33 -3774 -8495 3035
5569 3035 3916 -13180 -26960 -28290 -24384 -1763 2131 -7990 -10187 -12607 -18368 -28190 -33079 -23005
5555 -23005 -19436 -6472 -9704 -11212 -10626 -13672 -2043 9911 9026 5507 -2955 -2962 -9882 -16754 -15530
5540 -15530 69 -37 2868 -2258 -8830 -23153 -26194 -11740 -8572 783 7781 11942 7735 -6153
5526 -6153 -19649 -25534 -11995 -14121 -8364 329 -3027 -28500 -24355 -14752 -15452 -15560 -21599 -31186 -31027
5511 -31027 -13301 -3039 -5555 6835 3865 8987 5072 -4464 -11657 -15869 4592 2842 -9401
5498 -9401 -6052 -1171 -8691 -21080 -17519 -8532 5458 4943 -3087 -6394 2202 2521 -3167 -12494 -11989
5483 -11989 -6839 -1683 -6048 -5367 -226 -1816 1231 5942 4313 2616 -3003 8438 23232 28226
5469B8226j3922j3896j2257J915N748q994o424n93N45p54r818K127N12n0l11J243
5453b6703R790p862K0980O668j3745j1537j1509M274Q979k942J4330K6049N45
5440A7317o018m783N624r012r6n755j062k962N592k466O480k483j7436j1506N523
5425b3043J5412J3980Ol626L436Q447j0726j0663j525m936p47Q900K437n129m803
5410a2580j603j04N043K301P079n777j979Q104R515n033J949Q917k0531j5019
5396a9718K966J6671o375j4685Q647L045J971K1776M080r085K61r269Q76J0769
5382A1930J983m761j007k80P109L082j3941j343l05M286L083l187N21J9753M910
5367C1833j2689j3784j0251P091J026j781k194O373R765O017Q09o8j596Lo823
$$ plain form
5469 28226 14304 408 -11849 -9934 -4186 -13180 -19604 -20197 -19652 -20406 -30224 -28097 -27585 -27635 -27946 -26703
5453 -26703 -16913 -24775 -3795 2873 -10872 -22409 -33918 -29644 -20665 -23607 -9277 16772 17317
5440 17317 11299 6516 12140 3128 3032 -2723 -3785 -6747 -1155 -3621 2859 376 -17060 -28566 -23043
5425 -23043 -7631 6349 6355 2729 6165 14612 3886 -6777 -8302 -13238 -13985 -5085 -2648 -7777 -12580
5410 -12580 -14183 -14287 -9244 -6943 136 -5641 -7620 484 9999 4966 6915 15832 -4699 -19718
5396 -19718 -16752 -81 -6456 -21141 -12494 -9449 -7478 14298 18378 9293 9554 285 1161 11930
5382 11930 13913 9152 8145 7865 14974 18056 4115 2772 2467 6753 9836 6649 7170 26923 31833
5367 31833 19144 5360 -4891 2200 3226 1445 -749 5624 15389 21406 22215 22147 20551 20554 13731
5352A3731k3208o698J3457O108k0890o916P865k820l510K318m272J3703J04R012
5338b016O824j2326n858J509P028L794o776j10m50Q779J3732M835q970q112r461
5323g578K75j117o514L65J1077l38r437J3995J2988n917j1586j4693j3298k049
5309c3827K618J6977J8178l667J483J5116M690n090l559q802J03R540j9376l541
5295i157J281O879o029j267N250O173K505m72N187j407M98k978j1675J887q48
5280d173n862j739J6304J0793j0606J274N277J137l693j780J503R818m671p241
5266F341K298k433L323j19l249K465L23O813N16p694L52N521J8243j0138j1856
5251A0706l601j919l357M20N56J433Q70j1508J756J0357O288o471p856N729J2613
$$ plain form
5352 13731 -9477 -16175 -2718 3390 -17500 -24416 -16551 -19371 -22881 -20563 -24835 -11132 -11028 -2016
5338 -2016 4808 -7518 -13376 -11867 -4839 -1045 -7821 -7931 -8381 398 14130 18965 9995 1883 -7578
5323 -7578 -7303 -8420 -14934 -14569 -3492 -3830 -13267 728 13716 7799 -3787 -18480 -31778 -33827
5309 -33827 -31209 -14232 3946 279 1762 16878 21568 16478 12919 4117 4220 13760 -5616 -9157
5295 -9157 -7876 -997 -7026 -8293 -3043 3130 5635 5163 10350 8943 9441 6463 -5212 -3325 -4173
5280 -4173 -10035 -11774 4530 15323 4717 5991 11268 12405 8712 6932 8435 18253 13582 6341
5266 6341 8639 6206 9529 9410 6161 8626 8949 15762 16278 8584 8936 14457 32700 22562 10706
5251 10706 7105 5186 1829 2249 2805 4238 5108 -6400 -4644 5713 12001 5530 -2326 3403 16016
5236A6016J089l910k577o103j883K951K53j736l427j5056l880M573L289P413k98
5221c286p987O298O917O71J081J149N748n935m052o992L195Q483o49r99N744l289
5205F097J1344M85j1269o087P035M404M232q744K119K706r876j916P605J5687
5191B3822j2010j1467j062p955J533J0328J2022j573j2821j3924Q982R219P000
5178A2094n476J5000j0982j0114k628P179n23j2069o38Q175N216P126l171n895
5164C294n527j4276j6053M414P408J0084K968N502J363m131j76k160o217J168
5150a2339N063M511j712Q688N83m940o253L924K325J294j7801n73J1699k196j8894
5135b6621R80P102j1221j486J5655L778J9028N838q666j0871j4208O758n62o409
$$ plain form
5236 16016 17105 13195 10618 4515 2632 5583 5836 4100 673 -14383 -18263 -13690 -10401 -2988 -3286
5221 -3286 -11273 -4975 1942 2613 3694 4843 10591 4656 604 -6388 -3193 5290 4641 3642 9386 6097
5205 6097 17441 17926 6657 570 7605 12009 16241 7497 9616 12322 2446 530 8135 23822
5191 23822 11812 345 -717 -8672 -7139 3189 15211 13638 817 -13107 -4125 5094 12094
5178 12094 6618 21618 10636 522 -2106 5073 4550 -7519 -8157 18 5234 12360 9189 3294
5164 3294 -2233 -16509 -32562 -28148 -20740 -10656 -7688 -2186 -823 -4954 -5130 -7290 -13507 -12339
5150 -12339 -7276 -2765 -4477 4211 4794 -146 -6399 -2475 -150 1144 -16657 -17230 -5531 -7727 -26621
5135 -26621 -25641 -18539 -29760 -31246 -15591 -11813 7215 13053 4387 -6484 -20692 -13934 -14496 -20905
5121b0905j437K463N374K583q22o743J2516j6614j4372K0294J9361M3M548l967
5107B322n423N642K238K614m579o045J457n339m82k276L429l95J616R661k4p178
5091b762q332Q36P44Q959O666l378K191k524k180j0496k901m300J7485J1544k598
5076H954j3754L248J047r706L057R951L419N599j909M0k449J3230k28j2321j098
5061G080j820j4562j5909j643O155n262R388R151L226N634p406j985K721R066
5047C834Q49j3243J382M902l70Q175j2471j176K2619R336J0324j3745j8715J301
5033C002j1377r992N835j0591J013O574J094j3394q600M719M569J1975m51J2452
5019c172P72r346q442l820L587N49M676M554Q753n539q440M767M630n223K90M003
$$ plain form
5121 -20905 -22342 -19879 -14505 -11922 -12744 -19487 -6971 -23585 -37957 -17663 1698 1741 6289 2322
5107 2322 -3101 2541 4779 7393 2814 -3231 -1774 -7113 -7595 -9871 -6442 -6837 -5221 4440 4416 -2762
5091 -2762 -11094 -10258 -9514 -555 6111 2733 4924 2400 220 -10276 -13177 -17477 8 11552 8954
5076 8954 -4800 -1552 -505 -10211 -7154 2797 6216 11815 9906 9946 7497 20727 20499 8178 7080
5061 7080 5260 -9302 -25211 -26854 -20699 -25961 -16573 -7422 -4196 1438 -5968 -7953 -5232 3834
5047 3834 4683 -8560 -7178 -2276 -2646 5529 -6942 -8118 14501 23837 34161 20416 1701 3002
5033 3002 -8375 -18367 -12532 -23123 -22110 -15536 -14442 -27836 -36436 -31717 -27148 -15173 -15624 -3172
5019 -3172 -2400 -11746 -20188 -24008 -20421 -19872 -15196 -10642 -1889 -7428 -15868 -11101 -6471 -11694 -11404 -7401
5003g401K353j8718Q195K789k59Q125M14P566J0191q38K150N15j475k944j1652
4988i89j7980j4605O063K1415J592K329j989o273K799M69J8173J5956m785j4794
4974G381p773j733l858o871o230r809L002J794m80J3578K753q856M667R934r235
4959a1736o79N569j74j1684q326R826J7128Q981P089o667j419n537K791p880Q60
4944a858J242o8k735j1597j0465R54l428J0112j045N125L32n21J2219l33j916
4929c982n791n267Q717J525j768M307P418n193m681K765M65N002P48N46O110o394
4913D527m805M765j3519J182O263j846l775p23J056n513Q717R799q744L443n035
4898d208j118K115Q55o76p090J704J315n818j585m263k847j0886K417J0739K904
$$ plain form
5003 -7401 -5048 -23766 -15571 -12782 -13041 -4916 -4502 3064 13255 12417 14567 15082 13607 10663 -989
4988 -989 -18969 -33574 -27511 -6096 -4504 -2175 -4164 -10437 -7638 -7169 11004 26960 22175 7381
4974 7381 -392 -2125 -5983 -12854 -19084 -28893 -25891 -24097 -24577 -10999 -8246 -17102 -12435 -2501 -11736
4959 -11736 -12415 -6846 -7020 -18704 -27030 -17204 -76 8905 15994 9327 7908 2371 5162 -2718 -1858
4944 -1858 -616 -684 -3419 -15016 -25481 -24527 -27955 -17843 -18888 -13763 -13431 -13952 -1733 -2066 -3982
4929 -3982 -9773 -15040 -6323 -4798 -6566 -2259 5159 -34 -4715 -1950 -1485 3517 4265 4811 10921 4527
4913 4527 -278 4487 -9032 -7850 -1587 -3433 -7208 -7931 -6875 -12388 -3671 6128 -2616 827 -4208
4898 -4208 -5326 -3211 -2356 -3032 -10122 -8418 -7103 -12921 -14506 -18769 -21616 -32502 -30085 -19346 -16442
4883a6442J623p615q551j0629K7118K1760r628J929Q499L99l030J044J1466O837
4869B4780j5672p454N702p176o552m217r43l320Q211K736m728J4156j141j898
4855B484J6794r160n198K679P455j8620r811k011m444l08J7754K4207J0216r338
4841B2699r062j677m756p143q419M613K002j544o153q60m792n744M750R958p642
4826a3770j6491J85N579J4589J5646L887q431j5197j0145Q186K1453N847q520
4813B818l749j1064n327J15M843p922j0627m727N810J0016M687k541K561O873
4799h234J1421O41j523j852j268R852j682j586m123P925L071q008P515j1878j6582
4784a6311N316k736n83J3239M221O147n680o179n402K155p287k63O047P741k609
$$ plain form
4883 -16442 -14819 -22434 -30985 -41614 -14496 7264 -2364 -435 8064 8463 5433 6477 17943 24780
4869 24780 9108 1654 7356 180 -6372 -10589 -11532 -14852 -6641 -3905 -8633 5523 4382 2484
4855 2484 19278 10118 4920 7599 15054 -3566 -13377 -15388 -19832 -20140 -2386 21821 32037 22699
4841 22699 13637 11960 7204 61 -8358 -3745 -1743 -3287 -9440 -10300 -15092 -20836 -16086 -6128 -13770
4826 -13770 -30261 -30076 -24497 -9908 5738 9625 1194 -14003 -24148 -15962 5491 11338 2818
4813 2818 -931 -11995 -17322 -17207 -12364 -20286 -30913 -35640 -29830 -19814 -15127 -17668 -15107 -8234
4799 -8234 3187 3828 2305 453 -815 9037 7355 5769 1646 9571 12642 4634 12149 271 -16311
4784 -16311 -10995 -13731 -14314 -1075 3146 9293 3613 -2566 -7968 -5813 -13100 -13363 -7316 425 -2184
4769b184J1275J5376L043j5633n794l858p06J4315J332p755j8954O390J1988q319
4755E16j5431N365O857o046o056J5573J4091j216q701J466K9M357o636J771n529
4740D10M18r397L861J0481j519J0999j0314p220J708j29r082L741N895p402j459
4725i009N767m005r28J97k273K0335J022n645o763p777L201N167M729k740L294
4710D572P713m232k82q30l52N455j6301p526j148m013J0989J3109j7643m55m43
4695a1387J1870K85j0256q082n07o985O412K939R009J6851n018o496m704R442
4681C373K708M956j203P686j998j2936O46j398j1680J939L735l58o76k930m367
4666a2503R14r592k063J38L758J35K0837M556k0873O001J1525l216J0412J3015
$$ plain form
4769 -2184 9091 24467 27510 11877 6083 2225 1519 15834 17166 9411 -9543 -3153 8835 516
4755 516 -14915 -9550 -2693 -8739 -14795 778 14869 13653 4952 6418 6447 10804 4168 5939 410
4740 410 828 -8569 -4708 5773 4254 15253 4939 -2281 -573 -702 -9784 -6043 -148 -7550 -9009
4725 -9009 -3242 -7247 -8175 -7978 -10251 10084 11106 5461 -1302 -9079 -5878 -711 4018 1278 4572
4710 4572 12285 8053 7771 6941 6589 12044 -4257 -11783 -12931 -16944 -5955 7154 -10489 -10944 -11387
4695 -11387 483 768 -9488 -17570 -18077 -25062 -18650 -15711 -6702 10149 5131 -1365 -6069 3373
4681 3373 6081 11037 9834 17520 15522 2586 3232 1834 -9846 -7907 -4172 -4530 -5206 -8136 -12503
4666 -12503 -11589 -21181 -23244 -23106 -19348 -19213 1624 6180 -14693 -8692 2833 -383 10029 23044
4652B3044n940k0318j6609k788M671M500q198J305n425J0378M611M665J5855k815
4638F936J945j0000j2571N512Q030p493J8985K903j3248j2056LQ496J5101n529
4624G014j5714j1747P493K0535J350j7729o302j093Q047P157k676p334M758o986
4610a3227k038K029N237o958Q21R650J0440R473K61j0005J742K191l53k584N249
4595A1928P065m117q415J4l305O955J0412j064O075j894j3187p311o68j7780p978
4580b3270P574l358m358R78O360m76M086R249R71j3385K701J606M228N919P20
4565d55N168q84N808l230j099N880o059K406O139m943k697Q449j0777K792j139
4550E359k810O054O492k281o175Q98P239k363r95O697p41r21K488P669q135j0197
$$ plain form
4652 23044 17104 -3214 -19823 -22611 -17940 -13440 -21638 -20333 -25758 -15380 -10769 -6104 9751 6936
4638 6936 8881 -1119 -13690 -8178 -148 -7641 11344 14247 999 -11057 -11054 -2558 12543 7014
4624 7014 -8700 -20447 -12954 7581 8931 -8798 -15100 -16193 -8146 -989 -3665 -10999 -6241 -13227
4610 -13227 -15265 -13236 -7999 -14957 -14136 -4486 5954 15427 15688 5683 7425 9616 9263 6679 11928
4595 11928 18993 14876 6461 6475 3170 10125 20537 19473 25548 23654 10467 3156 2488 -15292 -23270
4580 -23270 -15696 -19054 -23412 -22434 -16074 -16550 -12464 -3215 -2244 -15629 -12928 -11322 -7094 -1175 -455
4565 -455 4713 3829 9637 6407 5308 11188 5129 7535 13674 8731 6034 14483 3706 6498 5359
4550 5359 2549 8603 15095 12814 6639 7537 14776 12413 11418 18115 17374 16453 18941 26610 18475 8278
4534H278J318J964j4051M496J0583L061j597p955M652R934j3643r159l762N884
4520CJ935Q476k019O261r130j1617o902J6500m618J2518J9443q35K098r521j3784
4505H808m318o348p700r934m384J646J4356Q261K669Q810K661r319j922j1043
4491g757j8226r751J321J0936N400j1630P413K572n600J3011J7679o47j771N741
4477H691M542j2073r681M613J0751R070n109j1332j371L692j2400j2431r9o003
4463b9140J6835K2196K910K448r054m020Q584q995j2289L20M579k933R077o133
4449e615j0890J040n584l61O698l410j4097L184J1084N065o315N429j024j067
4435a5863J0290K490r452R790k774n582Q044K786R837q946k0215k721J0906m577
$$ plain form
4534 8278 9596 11560 -2491 2005 12588 15649 14052 6097 10749 20683 7040 -2119 -5881 3
4520 3 1938 10414 8395 14656 5526 -6091 -12993 3507 -1111 11407 30850 30015 32113 22592 8808
4505 8808 4490 -1858 -9558 -19492 -23876 -22230 -7874 387 3056 11866 14527 5208 3286 -7757
4491 -7757 -25983 -35734 -34413 -23477 -18077 -29707 -22294 -19722 -25322 -12311 5368 4721 2950 8691
4477 8691 13233 1160 -8521 -3908 6843 15913 10804 -528 -1899 1793 -10607 -23038 -23137 -29140
4463 -29140 -12305 9891 12801 15249 6195 2175 10759 1764 -10525 -10205 -5626 -8559 518 -5615
4449 -5615 -16505 -15465 -21049 -21410 -14712 -18122 -32219 -29035 -17951 -12886 -19201 -13772 -14796 -15863
4435 -15863 -5573 -3083 -12535 -2745 -5519 -11101 -3057 -271 9566 620 -19595 -22316 -11410 -15987
4421a5987J881K0338O045J02n065o328q076K679J304l581p561P69M645N931L827
4406I23k336n515l858n802O627K141J051J0025k306j5654j8377o026J7184J7403
4392d520k631r251q567M388J387J714J266k354J0749L704J0554L472j2120j5057
4378a7266R223N536O179Q225p03o953q972j040O329l44k607K320J4549O716k6129
4363d937p007m613p239O926J616n98J1714M615J2438k719J379M141m478O798O348
4348B4384j4805P494J2513j0042r866L088P254m972K5L511l628K470M535j3564
4334H397j9278j2071R578M127M895K136j160j5109m78R56L93J1998j07N359L761
4319C397o982O732N835J029K51J9885P120j5845j6079L59R542P51L287p805m881
$$ plain form
4421 -15987 -14106 6232 12277 12379 7314 986 -7090 -4411 -3107 -6688 -14249 -13480 -8835 -2904 923
4406 923 -1413 -6928 -10786 -16588 -9961 -7820 -6769 3256 950 -14704 -33081 -39107 -21923 -4520
4392 -4520 -7151 -16402 -24969 -20581 -19194 -17480 -16214 -18568 -7819 -4115 6439 9911 -2209 -17266
4378 -17266 -8043 -2507 3672 11897 11194 4241 -4731 -5771 558 214 -2393 -73 14476 21192 -4937
4363 -4937 -11944 -16557 -23796 -16870 -15254 -15852 -4138 477 12915 10196 11575 15716 11238 18036 24384
4348 24384 9579 17073 29586 19544 9678 12766 20020 15048 15073 18584 14956 17426 21961 8397
4334 8397 -10881 -22952 -13374 -9247 -4352 -2216 -3376 -18485 -18963 -18007 -17614 -5616 -5723 -364 3397
4319 3397 -3585 3147 8982 10011 10262 30147 37267 21422 5343 5702 15244 15995 19282 11477 6596
4304F596j4850p66P1p504J0045l985O815K020m077J1377P32j2842q316k139J1636
4289e187J7559l321j8758j1135n319J3650M145l181j4443j2036R388J3073o525
4276b2090j7138Q741P408J9993J8610R962j3788j0805L608K249j910m114p089
4263f363k083J7659L924j0160k606N308M606k063j5914j7857j2988J2781J5704
4250a0052o471l87Q019J5021J666O133M80k451q757p542k478q826K652J4370J3395
4235A4772o069l885m979j5959j867Q144q674O165q24j1722j775m303J1760J2219
4221f997m076m840K554J596J0887R503l875q793j712J099P964J637L950q144l154
4206b401J0887n947o594n378J1533j123j0162O226j916j915j925J2470K884K927
$$ plain form
4304 6596 -8254 -9020 -8949 -16453 -6408 -10393 -3578 -1558 -5635 5742 6474 -6368 -14684 -16823 -5187
4289 -5187 12372 9051 -9707 -20842 -26161 -12511 -8366 -11547 -25990 -38026 -28638 -15565 -22090
4276 -22090 -39228 -30487 -23079 -3086 15524 25486 11698 893 4501 6750 4840 726 -6363
4263 -6363 -8446 9213 13137 2977 371 5679 10285 8222 -7692 -25549 -38537 -25756 -10052
4250 -10052 -16523 -16910 -8891 6130 7796 13929 14409 11958 3201 -4341 -6819 -15645 -12993 1377 14772
4235 14772 8703 4818 -161 -16120 -17987 -9843 -18517 -12352 -13176 -24898 -26673 -30976 -19216 -6997
4221 -6997 -11073 -15913 -13359 -11763 -876 8627 4752 -4041 -5753 -4654 3310 4947 8897 753 -2401
4206 -2401 8486 2539 -4055 -9433 2100 977 -9185 -2959 -4875 -6790 -8715 3755 6639 9566
4192I566q454o774K1K668L242p68m558l835n558l891P56J6694P149l603N903p466
4176A092j4900L218J1022J177J0784M061l123q829q948L903o01N129M986P142
4162A6113M647N022p979L623J1528o269k1156L877n899l572k12J777K189j2388
4148h699P72J362k181J2050J5816q16r092o054N85o498O786L869r0m777m801l361
4132e129k994J0068R792J132o475p916J050M534k639l645l297J0094k000j981
4118E94k509j0584j539K525K21n332N113M163K020K840k3486j691J3385P408J4339
4103G467o299r952j1068O399K741N277P865m073r785q878L468m561Q947R388M785
4088A721k025J0928p188j6693j9378J300J0051J1869r88J3916N780J926m923q824
$$ plain form
4192 9566 1112 -5662 -5641 -2973 269 -499 -5057 -8892 -14450 -18341 -17585 -891 6258 2655 8558 1092
4176 1092 -13808 -10590 432 1609 12393 16454 13331 4502 -4446 -543 -1144 3985 8971 16113
4162 16113 20760 25782 17803 21426 32954 26685 5529 9406 3507 -65 -277 1500 3689 -8699
4148 -8699 -7927 -6565 -8746 3304 19120 18304 9212 3158 3743 -2755 4031 7900 7810 3033 -1768 -5129
4132 -5129 -8123 1945 11737 12869 6394 -1522 -472 4062 1423 -2222 -5519 4575 2575 594
4118 594 -1915 -12499 -14038 -11513 -11292 -16624 -11511 -7348 -5328 -2488 -25974 -27665 -14280 -6872 7467
4103 7467 1168 -8784 -19852 -13453 -10712 -5435 2430 -1643 -11428 -20306 -16838 -21399 -12452 -3064 1721
4088 1721 -304 10624 3436 -13257 -32635 -31335 -21284 -9415 -10403 3513 9293 11219 6296 -2528
4074b528L72M680k91J130J372p663q105N862p314n384n897N436K038N24J042K7358
4058A2632J1178n115J1991j238j1626p211n137j055m3n893l976J3543p27l912
4044C411M432q57O83M004o958p787P264R698k199r80j4301O224m967j5753P55
4029a7331P959j137m659l089J1193k572J584n367N154J1287m28L733J765m254
4015C838Q159o161L067k374J5040l828N45L066j2090l543J873l110L040K911j254
4000I179j8038j1950r592n791J8091Q143N370L345j366j706k943m622J2613P527
3986H260O729M081j069j6509j2027K493P260J2649n716O849p408n566r131n969
3972a5074L005O598n912l923J3858J0300r75P64J881O542J715j2605j4507n495
$$ plain form
4074 -2528 -2156 2524 2233 3363 4735 -2928 -11033 -5171 -12485 -17869 -23766 -18330 -16292 -15768 -14726 12632
4058 12632 23810 18695 30686 29448 17822 10611 5474 4419 4376 -1517 -5493 8050 7323 3411
4044 3411 7843 6986 7669 11673 4715 -3072 4192 13890 11691 10711 -3590 2634 -2333 -18086 -17331
4029 -17331 -9372 -10509 -15168 -18257 -7064 -9636 -8052 -13419 -8265 3022 2594 6327 8092 3838
4015 3838 11997 5836 8903 6529 21569 17741 18286 21352 9262 5719 7592 4482 7522 10433 9179
4000 9179 -8859 -20809 -30401 -36192 -18101 -9958 -4588 -1243 -2609 -4315 -7258 -11880 733 8260
3986 8260 14989 19070 18001 1492 -10535 -8042 -782 11867 6151 13000 5592 26 -9105 -15074
3972 -15074 -12069 -5471 -11383 -15306 -1448 8852 7877 8641 10522 17064 18779 6174 -8333 -13828
3958a3828J3338O247L945L714q163N0q98q082m633N092P865l90K586q941j2884
3943a4982j26J1808J5685J968p316K315m113J1300k854r254P99p17m484o326J4700
3928H403J3371j4796o268O204j0192q092J681J0481j774K299k418q265M85o69
3914i550k875j650m121J197N645N360M809J4305J0411q716p444J013J0398o133
3900A2649j9257l986J38J1577J556J7k541q030J5367L035j5117L80J5160K141
3886A3089j3320J4708K578k071j3674J272R772K160q550l516N41J2501j5642K803
3872B651n728j532o512n344o478l61N429M270J239P87j498p4O136J4531L034k533
3856H017l376O261R12L340l06j013j790n154m089n658l198J4898R789o076k450
$$ plain form
3958 -13828 -490 5757 9702 13416 5253 5303 4405 -3677 -8310 -3218 4647 4257 6843 -2098 -14982
3943 -14982 -15108 -3300 12385 14353 7037 9352 5239 16539 13685 4431 5230 4513 29 -6297 8403
3928 8403 21774 6978 710 6914 -3278 -11370 -9689 792 -982 1317 -1101 -9366 -8881 -9550
3914 -9550 -12425 -14075 -18196 -16999 -11354 -5994 -1185 13120 23531 14815 7371 8384 18782 12649
3900 12649 -6608 -10594 -10456 1121 2677 2694 153 -7877 7490 10525 -4592 -4212 10948 13089
3886 13089 -231 14477 17055 14984 1310 2582 12354 14514 5964 2448 2989 15490 -152 2651
3872 2651 -3077 -4609 -11121 -16465 -22943 -23304 -17875 -13605 -12366 -11579 -13077 -13151 -7015 7516 10550 8017
3856 8017 4641 10902 11814 15154 14848 13835 12045 6891 2802 -2856 -6054 8844 18633 12557 10107
3841A0107r206n636J1674L951q869p145j0003J0049J2858K774j4575q463L637
3828h847P024n162L878Q132R21k18j2625o921O057K021O533j7457M760J0049K664
3813H09j0237q775q260j4730J2502O144Q374J3522p90K146J072q81p976q310N356
3798a0034J68M183k917J392Q970J1389j4783k5485j6315p213O418K767J915K5959
3784a3586J9667p925k694K526j476M803l861j502K882K931o40J1305o034N691
3770A2087Q717j4410j4048M720K532M336K1459p290k1516r331J261L773J0092
3757B382N737j0096q841m562J1954K141p905j366O843L126O505n214K822O262
3743I788p748J1881J2773n298r295k795J0423j487J570K188j3136o925j288K1202
$$ plain form
3841 10107 901 -4735 6939 10890 2021 -5124 -15127 -5078 7780 10554 -4021 -12484 -8847
3828 -8847 -1823 -6985 -3107 5025 5946 5728 -6897 -13818 -7761 -5740 793 -16664 -11904 -1855 809
3813 809 -9428 -18203 -26463 -41193 -28691 -22547 -14173 -651 -1441 705 1777 896 -7080 -15390 -10034
3798 -10034 -9866 -5683 -8600 -7208 1762 13151 -1632 -27117 -43432 -50645 -44227 -41460 -39545 -13586
3784 -13586 6081 -1844 -4538 -2012 -3488 1315 -2546 -4048 -1166 1765 1125 12430 6396 12087
3770 12087 20804 6394 -7654 -2934 -402 3934 25393 18103 -3413 -12744 -11483 -7710 2382
3757 2382 8119 -1977 -10818 -15380 -3426 -1285 -9190 -10556 -3713 -587 5918 704 3526 9788
3743 9788 2040 13921 26694 21396 12101 9306 19729 18242 19812 22000 8864 1939 651 21853
3729B1853J0458j2211j5782l981p27l066l268K781J6101M938l0180p845P533Q257
3715e139J0121K567r363p24J3158l120j0916J02l344p538J1502L881j6202N011
3701a0004Q34l988L823l980j325J1348n160L058J0568M887l836n223m928r125
3687a3051o514J1228O149J811m822p187M195q035p204J5697M08K151P063M903
3673F792R274j5002j052M918j1328n388K381K365J88P710J1316J8660j0388j6517
3659C929l339O764l762m335K036K580J2743L746p554j7673j4238p74M438M298
3645a1141J6882j0218j5590O343J6176L154r841o988J0043l055o014K774M755
3632b720O061M581j7951p376K1752J0695J87l783m56j6759j28J8154j581L54m149
$$ plain form
3729 21853 32311 20100 4318 337 -390 -3456 -6724 -3943 12158 17096 -13084 -20929 -13396 -5139
3715 -5139 4982 7549 -1814 -2538 10620 7500 -3416 -3314 -6658 -14196 -2694 1187 -15015 -10004
3701 -10004 -9170 -13158 -9335 -13315 -14640 -3292 -8452 -5394 5174 10061 6225 1002 -3926 -13051
3687 -13051 -19565 -8337 -2188 -377 -5199 -12386 -8191 -16226 -23430 -7733 -7325 -5174 1889 6792
3673 6792 16066 1064 12 4930 -6398 -11786 -9405 -7040 -6852 858 12174 30834 20446 3929
3659 3929 590 7354 3592 -743 1293 3873 16616 20362 12808 -4865 -19103 -19877 -15439 -11141
3645 -11141 5741 -4477 -20067 -13724 2452 5606 -4235 -11223 -1180 -4235 -10249 -7475 -2720
3632 -2720 3341 7922 -10029 -17405 4347 15042 15229 11446 10990 -5769 -5897 12257 10676 11030 6881
3617F881j0478m635J919P070L112n985r250O288l764L414P466K434N031M636p497
3602F642n975n539L744J294P829J4150j753p482o410q672r629j648o038j1458
3588c0945J5353K8279k93k001K548j3006J468J0109m854q834q389r579n375J7783
3574g736K8167J5575Q034j0172K584j2087j8444n040N517K543L912L288q058p63
3560G320j596k655M954L855j2310n859n648o73k993J0316K1026P24p696p676l142
3545b053J1220R220j520o99j167k656O385j2401p446Q47J0109M955j938n475n620
3530A761n674K016O887j0005p319M507J0972o680J00m099j844K844M308j975r107
3515a3308l627p068j0040O899P883O957J997l844m413l209j442O646o736l038
$$ plain form
3617 6881 -3597 -8232 -6313 757 3869 -2116 -11366 -5078 -8842 -5428 2038 4472 9503 14139 6642
3602 6642 667 -4872 -1128 166 7995 22145 20392 12910 6500 -2172 -11801 -13449 -19487 -30945
3588 -30945 -15592 12687 12394 10393 12941 -65 1403 11512 6658 -2176 -10565 -20144 -25519 -7736
3574 -7736 20431 36006 44040 33868 36452 24365 5921 881 6398 8941 12853 16141 8083 7320
3560 7320 5724 3069 8023 11878 -432 -6291 -11939 -12612 -15605 -5289 15737 16461 8765 1089 -2053
3545 -2053 9167 18387 16867 16168 15001 12345 18730 6329 -1117 -270 9839 14794 12856 7381 1761
3530 1761 -3913 -1897 4990 -5015 -12334 -7827 3145 -3535 -3435 -7534 -9378 -6534 -2226 -4201 -13308
3515 -13308 -16935 -24003 -34043 -27144 -19261 -12304 -10307 -14151 -18564 -21773 -23215 -16569 -23305 -26343
3501b6343R081R10N9O830J0794J464o439q170l984J0836J4136m004N934j642q709
3486G53o293R129Q110j3352J0975L395j5546l843m82L775L379L08J999J209J0626
3471A4142J0420N997k695j0270j5005q843K436j814q917m096J5044N365L180q602
3457c658j0626J1423K2q209O49J386N79l23j2519k713N761J190J1416P268j4240
3442a2594k755J1585M635p522l084O061L801J268m521m320Q333L033k528j697
3428c05o347n69P801R498o231k847N235k95j2746R41J5670p094j0364J1626J6531
3413B0504n92j6330q302n052N765L759m702K16J6364P110O71j5152j1486j1506
3399a8733l774K551J5413R705N573p98j350O647N383m243j7770N278J3910n446
$$ plain form
3501 -26343 -17262 -16352 -16293 -9463 1331 2795 -3644 -11814 -15798 -4962 9174 5170 11104 9462 753
3486 753 -5540 3589 11699 -1653 9322 12717 -2829 -6672 -7154 -3379 0 308 2307 3516 14142
3471 14142 24562 30559 27864 17594 2589 -6254 -3818 -5632 -14549 -18645 -3601 1764 4944 -3658
3457 -3658 -14284 -2861 -2839 -11048 -10399 -9013 -8434 -8757 -21276 -23989 -18228 -17038 -5622 1646 -12594
3442 -12594 -15349 -3764 871 -6651 -9735 -3674 127 1395 -3126 -7446 887 3920 1392 -305
3428 -305 -6652 -7221 580 10078 3847 1000 6235 5940 -6806 -5865 9805 2711 -7653 3973 20504
3413 20504 19912 3582 -4720 -9772 -4007 -248 -4950 -4734 11630 18740 19411 4259 -7227 -18733
3399 -18733 -22507 -19956 -4543 5162 10735 9937 8587 15234 20617 16374 -1396 3882 17792 12346
3385A2346j3003n183J2707J4341p37j7708j1296j836M439J6635P898o043J033
3372A3593j2055r341k24O768J1076L624n102L927j0055k024J805p695j2862J3526
3358e039Q123Q10R799k14J3061j0578n700R879Q836o65r313r620l400K669J1398
3343B0046L631j329n232j422n867j0984P67K513l373p86j870j02m419L892J2879
3328H344P067n377j2371j4139q27K933m346O812K3128J419o841j1429r904J0758
3314d773Q894r924j4137L210J1586M747l699j608J3100K941q983k679p4j4907
3300a6306K694j451K553j046J4826J0513L378r273p276J787N618K023o019P025
3286I046o625K363k762n128M9L466j388l606j147l28j470K92O513L097j795J561
$$ plain form
3385 12346 -657 -5840 6867 21208 20471 2763 -8533 -10369 -5930 10705 18603 12560 13593
3372 13593 1538 -7803 -8027 -1259 9817 13441 8339 12266 2211 187 1992 -5703 -18565 -5039
3358 -5039 3084 3894 13693 13479 26540 15962 10262 20141 28977 28312 18999 9379 5979 8648 20046
3343 20046 23677 22348 17116 15694 9827 -1157 -390 2123 -1250 -2036 -3906 -4008 -8427 -4535 8344
3328 8344 15411 10034 -2337 -16476 -17303 -14370 -18716 -11904 11224 12643 5802 -5627 -15531 -4773
3314 -4773 4121 -5803 -19940 -16730 -5144 -397 -4096 -5704 7396 10337 1354 -1325 -1399 -16306
3300 -16306 -13612 -15063 -12510 -13556 1270 11783 15161 5888 -1388 399 6017 8040 2021 9046
3286 9046 2421 4784 2022 -3106 -3057 409 -979 -4585 -5732 -6060 -7530 -7238 -725 2372 577 2138
3270B138n416q88J1920J913j0219k465p405J0668L439j200j2509j8251m878m132
3256c7285j346J0275J1594J0377K783j0270q301M957R582J6748L19K800K0m113
3242H140M747J53j829N39J0445q358j1339q740J9689J4167j1381j3560m20l457
3228a204L795J511Q723J663j72L422O03r265p096L961R40j0462l467j6073N628
3213a7493J3072r869N94K0184Q905m837j7381j2931K958J0391R324J251l41J0588
3199A4415r56l925p605m51o350L03p423N844r301l10N704j159J1764K042n669
3184c077k254l963k424O188j921K739N898J2809L237n474j0048M005l061p005
3170d351r471J454Q14J5086K840j2530j077R115O929j1223j4554j2704n708J1173
$$ plain form
3270 2138 -3278 -4166 7754 9667 -552 -3017 -10422 246 3685 2485 -10024 -28275 -33153 -37285
3256 -37285 -38631 -28356 -16762 -6385 -3602 -13872 -22173 -17216 -7634 9114 9433 12233 12253 8140
3242 8140 12887 13040 11211 11750 22195 13837 2498 -6242 13447 27614 16233 2673 2253 -1204
3228 -1204 2591 4102 12825 14488 14316 17738 18341 9076 1980 5941 6881 -3581 -7048 -23121 -17493
3213 -17493 -4421 -14290 -13696 6488 15393 10556 -6825 -19756 -16798 -6407 2917 4168 3827 14415
3199 14415 13459 9534 1929 1478 -4872 -4569 -11992 -6148 -15449 -15759 -10055 -11214 550 2592 -3077
3184 -3077 -5331 -9294 -11718 -5530 -7451 -4712 1186 13995 17232 11758 1710 5715 2654 -4351
3170 -4351 -13822 -12368 -11554 3532 6372 -6158 -7235 1880 8809 -2414 -16968 -29672 -35380 -24207
3156b4207J8353J6396M462J393M223OJ506j817m319N900L653l633k591Q50r967
3141A0208k0130l682m695J1267L048m672L252M910k712q618L873k046k904K066
3127a0835M853o147o143J2913J2457N132k527q496k418N143O467k438m763N47
3113C745k598r985J0294O584j553N255M910L209M516R6p938j4618j754K107K439
3098D709Q15j3500l844l388Q824M072J129O663J148J5180L919q493J778l382l531
3083A2099k198l359k828P780L156l450l919n355J9981r655q321J0131K923q379
3069H606o8P238l393j0880P243k00R899K804Q69k042k0182p347P574k657J4451
3054A1915N569j6727j1267N334J2373j738j379k54J13J4395j26K967p837m876
$$ plain form
3156 -24207 -5854 10542 15004 16397 20620 20626 22132 20315 15996 21896 25549 21916 19325 20175 10208
3141 10208 -9922 -13604 -18299 -7032 -3984 -8656 -5404 -494 -3206 -11824 -7951 -9997 -12901 -10835
3127 -10835 -5982 -12129 -18272 -5359 7098 12230 9703 1207 -1211 3932 10399 7961 3198 3745
3113 3745 1147 -8838 1456 8040 6487 11742 16652 19861 24377 24473 16535 1917 163 2270 4709
3098 4709 5524 -7976 -11820 -15208 -6384 -2312 -1183 5480 6628 21808 25727 17234 19012 15630 12099
3083 12099 9901 6542 3714 11494 14650 11200 7281 1926 21907 12252 3931 14062 16985 8606
3069 8606 8538 15776 12383 1503 8746 8546 18445 21249 22118 20076 -106 -7453 121 -2536 11915
3054 11915 17484 757 -10510 -5176 7197 5459 4080 3826 3939 18334 18208 21175 13338 8462
3040H462p051Q502o838j93K362j657O774M923j6378N228J20q230Q331O764O965
3025A8084m879j43j808J1633m335j324m572k326j4518L710J3224N860m804j7559
3011c757P016m111O31J3732p19j2079O323P588k794k381P047q501j2168m40O721
2996B108r673j109J1184k133l384j1011j1085l298O019K204J0104M591J3732J945
2982A0194j1029p451J68P508R250o465J299K803j1293j8240P935Q321J0131r66
2968B165p210n317n484K08J7049l339m982q916J258P950N930o509M446k866O391
2953G74Q392j0381j990o339j774p77J867J3293P907o968q374L585L819n134J342
2938g58L713n111j100j7614j6791J5595J4802L912O835M319n120j479j5628N109
$$ plain form
3040 8462 1411 9913 3075 2882 5244 3587 10361 15284 -1094 4134 4254 -3976 4355 11119 18084
3025 18084 13205 13062 11254 22887 18552 17228 12656 10330 -4188 -478 12746 18606 13802 -3757
3011 -3757 3259 -852 -221 13511 12792 713 7036 14624 11830 9449 16496 7995 -4173 -4613 2108
2996 2108 -7565 -8674 2510 377 -3007 -14018 -25103 -28401 -22382 -20178 -10074 -5483 8249 10194
2982 10194 -835 -8286 -8118 -610 8640 2175 3474 6277 -5016 -23256 -15321 -7000 3131 2165
2968 2165 -5045 -10362 -15846 -15638 1411 -1928 -6910 -15826 -14568 -6618 -688 -7197 -2751 -5617 774
2953 774 9166 -1215 -3205 -9544 -11318 -12095 -10228 3065 10972 4004 -4370 -785 3034 -2100 -758
2938 -758 2955 -2156 -3256 -20870 -37661 -22066 -7264 -3352 3483 7802 2682 1203 -14425 -9316
2924i316Q953N058j055m893n159m03j3643J4870M045K981O779K295r588p183J47
2909f112M794m91l517R218M207j0111o112N361m916k412KL591m307J149n868m760
2893b0284O504J0856j349p598o983J4498L422j806J3565j904M77K07Q689j440
2879A6854q158j9492j1875K895L027P036P359R129O07n023N872K766j7401q749
2865a5153K130R060N138q345m805l480O86K914K0358j842Q203L322j258j4849
2851B079k579P90L98Q91K695M019j908l637l519N418j123k056P330p96j794j963
2835D245p384q316J59K512M564Q319q796M27j521p095q628J915O51R128M610M113
2819a097L143m919O214m829j0610k049j717R17J1574M720p623l664m702n897l58
$$ plain form
2924 -9316 -363 4695 3640 -1253 -6412 -6815 -20458 -5588 -1543 1438 8217 10512 924 -6259 -6112
2909 -6112 -1318 -1809 -5326 3892 8099 -2012 -8124 -2763 -7679 -10091 -10089 -6498 -10805 -9656 -15524 -20284
2893 -20284 -13780 -2924 -4273 -11871 -18854 -4356 -934 -2740 10825 8921 9398 9605 18294 16854
2879 16854 8696 -10796 -22671 -19776 -16749 -9713 -2354 6775 7382 2359 8231 10997 -6404 -15153
2865 -15153 -13023 -3963 1175 -7170 -11975 -15455 -14769 -11855 8503 6661 14864 18186 16928 2079
2851 2079 -500 290 688 1579 4274 8293 6385 2748 -771 4647 3524 1468 8798 8002 6208 4245
2835 4245 -3139 -11455 -11296 -8784 -4220 4099 -4697 -4270 -5791 -12886 -21514 -19599 -18948 -9820 -5210 -1097
2819 -1097 2046 -2873 3341 -1488 -12098 -14147 -15864 -14947 -3373 1347 -6276 -9940 -14642 -20539 -20897
2804b0897K557R438O416m790j5500J847N290p459J0995P418k762o037o291k76
2790b0051n126N60J7131J4732J586p550N826J598j6184j2737J0190O336R795Q37
2776F943J254q84l675N922q624p453j614P066M309n990o414J719J2256J2768l206
2761A4377k3813k035k386k411Q681M866k802K174J949J1841J232j3053J970k507
2747a917j711K2671q965j8760Q340K081l752p10j2332o449l22Q22k826J1997J6332
2732D499O891o835j0783N672J3713K070p541m586n312r761j8564m938P722N541
2718b2212R825J2567M486L909K977K454n174M15n505l324o287j2043K245K928
2704a2739J298P285r69o451L57R718Q795M943L127M046j374o801o284k940j344
$$ plain form
2804 -20897 -18340 -8902 -2486 -7276 -22776 -20929 -15639 -23098 -12103 -4685 -7447 -13484 -19775 -20051
2790 -20051 -25177 -24617 -7486 7246 8832 1282 7108 8706 -7478 -20215 -10025 -3689 6106 6943
2776 6943 8197 7313 3638 9560 936 -6517 -8131 -1065 3244 -2746 -9160 -7441 4815 17583 14377
2761 14377 -9436 -11471 -13857 -16268 -7587 -2721 -5523 -3349 -1400 10441 11673 -1380 590 -1917
2747 -1917 -3628 19043 10078 -8682 -342 1739 -2013 -2723 -15055 -21504 -21826 -21004 -23830 -11833 4499
2732 4499 11390 4555 -6228 -556 13157 15227 7686 3100 -2212 -11973 -30537 -35475 -27753 -22212
2718 -22212 -12387 180 4666 8575 11552 14006 8832 9247 3742 418 -5869 -17912 -15667 -12739
2704 -12739 -11441 -4156 -5125 -11576 -11219 -1501 7294 12237 15364 19410 18036 11235 4951 2011 667
2689F67J417J2090n69O1l368j0850j9047r12J4966M953R275P538o60N565L511
2674B4637q056l680o121J657j2512m169J1746O996K435J1380P222j4073k350r286
2660E826n764n866j0863k832n760P58Q099J6958K4465J6555K812k3451j8277q82
2646A778m180O446M710m374q136N877j966k42l372o87K767q096q810L419N586
2631i280J31M203l566J1756p706p960l248K869j676o357K445J2916J176R455m635
2616E23J702j472j3365j6676J5344J5814L148n117l035J187n4R67P092L230p162
2601B126o237J0355J7774n185k844J3324q624n024p691o419p85n956N578q39j1138
2586a1585R366K090o403o916K473K490j649m387O865n505l735J7550L227q702
$$ plain form
2689 667 2084 14174 13605 13666 10298 -552 -19599 -20511 -5545 -592 8683 16221 15561 21126 24637
2674 24637 16581 12901 6780 8437 -4075 -8244 3502 10498 12933 24313 31535 17462 15112 5826
2660 5826 62 -5804 -16667 -19499 -25259 -24501 -16402 556 25021 41576 44388 20937 2660 1778
2646 1778 -2402 4044 8754 4380 -3756 2121 155 -87 -3459 -4146 -1379 -9475 -18285 -14866 -9280
2631 -9280 -9149 -4946 -8512 3244 -4462 -12422 -15670 -12801 -14477 -20834 -18389 -5473 -4297 5158 523
2616 523 2225 753 -12612 -29288 -13944 1870 5018 -99 -3134 -1947 -2001 -1034 6058 9288 2126
2601 2126 -4111 6244 24018 18833 15989 29313 20689 15665 7974 1555 770 -5186 392 -447 -11585
2586 -11585 -2219 -129 -6532 -13448 -10975 -8485 -10134 -14521 -7656 -13161 -16896 654 3881 -4821
2572d821j250K15L080L201Q25p303N410J296N364k642q98L69j0322q778P327O953
2556a974P443J030k759J734k301K972J0338j6799r974O409J669P215J1384K180
2542A8567q392n728J318k838l854k976P384n74K133R02k1935Q154R061N343l98
2527F167N344p622J065p886k253K983N060m668o02M212M229L696n868J3199k676
2512A4380j8042j756N43m468q981j738P732J2522k527m265K483N982J0698j598
2498A0965n078K530k89k0351q057k463J5877P99r629P111R997k265j999J4055
2484A1203L240p699l473k033N331J834n985j0114L748k232n410p727J1705J3130
2470E518j0299j0300k563L930k249m406R851o758K87Q048J873p023j076O206R194
$$ plain form
2572 -4821 -6071 -5856 -2776 425 1250 -6053 -643 653 6017 3375 2477 2846 -7476 -16254 -8927 -1974
2556 -1974 5469 6499 3740 5474 3173 6145 16483 -316 -10290 -3881 -2212 5003 16387 18567
2542 18567 10175 4447 5765 2927 -927 -3903 3481 2907 5040 5942 -15993 -7839 1222 6565 6167
2527 6167 11511 3889 4954 -2932 -5185 -2202 2858 -1810 -2412 1800 6029 9725 3857 17056 14380
2512 14380 -3662 -5418 -4875 -9343 -18324 -20062 -12330 192 -2335 -6600 -4117 1865 12563 10965
2498 10965 5887 8417 8128 -12223 -20280 -22743 -6866 -6067 -15696 -8585 1412 -853 -2852 11203
2484 11203 14443 6744 3271 1238 6569 8403 2418 -7696 -3948 -6180 -11590 -19317 -7612 5518
2470 5518 -4781 -15081 -17644 -13714 -15963 -20369 -10518 -17276 -16989 -8941 -7068 -14091 -15167 -8961 233
2455B33J0583O274N321j301K44L357r115j532L337l075j1626n662m40p150O826
2440c726N838R150J2246L853p747j6905j896K1594M587o189J2561k83j4308l4745
2426a5970J68J1498K046m782j844J0170Q918O888m688o051n806j4703m829j472
2412b0457m7O175K442L249K334J683M534L705J684j050p434r540L011k083o763
2397a8557k664N998K2064R920M95j1198l411m057k214M753p29O357o268o254K230
2382c535k319P382n145q137l556N630m419j2172j6152K1463R525l760J0538J4466
2368I809p373O682N312o209o653o762N628O289o457j3072m317O572N201Q80L992
2353d78J1373J150p14o84p777o839n383J958K595M805p742J961o273J973Q408
$$ plain form
2455 233 10816 17090 22411 21110 21354 24711 15596 14064 17401 14326 2700 -2962 -3402 -10552 -3726
2440 -3726 2112 11262 23508 27361 19614 2709 813 22407 26994 20805 33366 33083 18775 -15970
2426 -15970 -15802 -4304 -2258 -7040 -8884 1286 10204 17092 12404 6353 547 -14156 -18985 -20457
2412 -20457 -20504 -14329 -11887 -8638 -6304 -4621 -87 3618 5302 4252 -3182 -12722 -9711 -11794 -18557
2397 -18557 -21221 -15223 6841 16761 17256 6058 2647 -1410 -3624 1129 400 6757 489 -5765 -3535
2382 -3535 -5854 1528 -3617 -11754 -15310 -9680 -14099 -26271 -42423 -20960 -11435 -15195 -4657 9809
2368 9809 2436 9118 14430 8221 1568 -5194 434 6723 266 -12806 -17123 -10551 -5350 -4470 -478
2353 -478 10895 12045 11331 10647 2870 -3969 -9352 -7394 -4799 6 -7736 -5775 -12048 -10075 -1667
2338a667P635J8336J988j4016n952O483l251n115k506J4465M560j7937J244R19
2324E186j909N498k691l749n09R67Q372j3527j1608K591J6945n209j913J099k413
2309b870j906J504L957l98R242J781q189L766J5218r882j2094j741N42j782R62
2294a890R573Q249j5081r097J7M839j57J0221o243j1734P153M891j037J2370k803
2279I271n866k130K711M540K209j1554j0958P01N117K136P917L839n8k292j0112
2264d529j3620O718P699j0875j029J6962O866N609m658K651p182K8k883Q972l525
2249G204N429k180P085P529j1859m033J827L26N653o936j4706K123L883J1264
2235A2609P478o481j0633j055M872q314P874m702j3279J3650M951j972K773K720
$$ plain form
2338 -1667 5968 24304 26292 12276 6324 12807 9556 4441 1935 16400 20960 3023 4267 5186
2324 5186 3277 8775 6084 2335 1826 2793 11165 -2362 -13970 -11379 5566 357 -1556 -457 -2870
2309 -2870 -4776 -3272 685 287 9529 11310 3121 6887 22105 12223 129 -1612 -1070 -2852 -1890
2294 -1890 7683 15932 851 -8246 -8229 -3390 -3547 6674 431 -11303 -4150 741 -296 12074 9271
2279 9271 3405 1275 3986 8526 10735 -819 -11777 -11076 -5959 -3823 4094 7933 7875 5583 -4529
2264 -4529 -18149 -11431 -3732 -14607 -15636 1326 8192 13801 9143 11794 4612 4640 1757 10729 7204
2249 7204 12633 10453 17538 25067 13208 9175 11002 11328 16981 10045 -4661 -2538 1345 12609
2235 12609 20087 13606 2973 1918 6790 -1524 6350 1648 -11631 2019 6970 4998 7771 10491
2221A0491m091L192K333j4115j6592n046J0601P194K1475R576j187l407p062R87
2207A4349M174J1729j2734L232j6435m951M859J730l748j694J3701k726j3477
2194a991j732J5100M348j7035k300L227k321J1175J1485j225n438P278L853k776
2180B1648M22K33l423K139q180j2041l228L315k714q316j2554R56J1817J3973
2166D047K739O49p19l119p211j655j069J990l293J0358k249k440M46n238K565
2151d199j4023l09N298m858R490p46N484J8220o326r336r460Q131P957J0522l706
2136A2139j0391r340L72o300J2147K0757L608j3139o713j711n55l722o081M491
2122d438K779o848J5037M159j3130j5213j2497L012J7680J3290Q075J372r78j5138
$$ plain form
2221 10491 6400 9592 11925 -2190 -18782 -23828 -13227 -6033 15442 25018 23831 20424 13362 14349
2207 14349 18523 30252 17518 20750 4315 -636 4223 5953 2205 511 14212 11486 -1991
2194 -1991 -3723 11377 15725 -1310 -3610 -383 -2704 8471 19956 18731 13293 20571 24424 21648
2180 21648 22070 22303 18880 21019 12839 798 -2430 885 -1829 -10145 -22699 -21743 -9926 4047
2166 4047 6786 7435 6716 3597 -3614 -5269 -6338 -4348 -7641 2717 468 -1972 -1526 -6764 -4199
2151 -4199 -18222 -18531 -13233 -18091 -8601 -9347 -3863 14357 8031 -1305 -10765 -2634 5323 15845 12139
2136 12139 1748 -7592 -7220 -13520 -1373 19384 22992 9853 3140 1429 874 -2848 -8929 -4438
2122 -4438 -1659 -8507 6530 10689 -2441 -17654 -30151 -27139 -9459 3831 11906 13278 12300 -2838
2108b838j0150Q520L32O372O095m709L243J1209j293j5859q967L382J9304j546
2094A3095K793q409p441j2090q245J1107K261K857n530o478J99J6053j3500j6182
2080b9510J0674J4306K177j059n035N888N944l771n430j001j098J498l866L149
2066g134j703L758N999J3271L040j4517J0888J2076j773r268L695N566L361j977
2052B5282N307n399r324r432j2468M542Q331r05j6348k1077J0316N982J4892m386
2038d687l139L893j461k060j1867k779K926Q062m639n466N271K139R966L436j1224
2023a1629J5878Q641p321j0891O443P107n011j633R095L611m187j3755j3119M14
2009a6357J3017N632O742R438P698K316j8499r500O549m452j4772q562J4024J0633
$$ plain form
2108 -2838 -12988 -4468 -4136 2236 8331 3622 6865 18074 16781 922 -8045 -4663 14641 13095
2094 13095 15888 7479 38 -12052 -20297 -9190 -6929 -4072 -9602 -16080 -15881 172 -13328 -29510
2080 -29510 -18836 -4530 -2353 -3412 -8447 -2559 3385 -386 -5816 -6817 -7915 -6417 -10283 -7134
2066 -7134 -8837 -5079 920 14191 17231 2714 13602 25678 23905 14637 18332 23898 27259 25282
2052 25282 30589 25190 15866 6434 -6034 -1492 6839 5934 -10414 -31491 -21175 -15193 -301 -4687
2038 -4687 -7826 -3933 -5394 -7454 -19321 -22100 -19174 -11112 -15751 -21217 -15946 -13807 -3841 -405 -11629
2023 -11629 4249 12890 5569 -5322 1121 8228 3217 1584 10679 14290 10103 -3652 -16771 -16357
2009 -16357 -3340 2292 9034 18472 26170 28486 9987 487 7036 2584 -12188 -20750 -6726 3907
1995C907j0281o386O122j2837r73J5399N595n178p587k625l082O256J828J1573
1981A731K2479Q114j9294j5319j1132j494J2423o862n515J0300l044m172r927
1968b1712r54M023m641p618J3436J7106j1938j2935j766J3074P551J407p94j5098
1954b0859N42J1306O075J0199N26O128M202j710n231r791m790j607O850P371P260
1939A6471j272n630Q343l748L709p464k028o003o467K886N047J1526k220n03r967
1924B680j1981k308j441O880l078K40j340R901J2891j1474o854j4529J3104Q897
1910A588r85M200K408m633N881J743k1172n191n185P823K0044J3993M684q755
1896A6443n105l00p458j5013K107L915k878p861n774M914J8509J6668q492j5626
$$ plain form
1995 3907 -6374 -12760 -6638 -19475 -20448 -5049 546 -4632 -12219 -14844 -17926 -11670 -9842 1731
1981 1731 24210 32324 13030 -2289 -13421 -14915 -2492 -9354 -14869 -4569 -7613 -11785 -21712
1968 -21712 -22666 -18643 -23284 -30902 -17466 -360 -12298 -25233 -26999 -13925 -6374 -4967 -5761 -20859
1954 -20859 -20317 -9011 -2936 7263 7789 13917 18119 16409 11178 1387 -3403 -5010 1840 9211 16471
1939 16471 15199 9569 17912 14164 17873 10409 8381 2378 -4089 -1203 3844 15370 13150 12647 2680
1924 2680 -9301 -11609 -13050 -6170 -9248 -9008 -10348 -447 12444 970 -5884 -20413 -7309 1588
1910 1588 603 4803 7211 2578 8459 10202 -10970 -16161 -21346 -13523 6521 20514 25198 16443
1896 16443 11338 11038 3580 -11433 -9326 -5411 -8289 -16150 -21924 -17010 1499 18167 9675 -5951
1882e951K75J5946R25m102l06r696K541K241j0147l50L823q625o094J509J9163
1867A152J1662O991r483o183n626N45O346M920j935r973p958J1682O75n005j0217
1852a2407q050Q468N565M806K620m758J420N138j0297P407J4350L31j3031j3934
1838a2372r478O316O581P24n10N244o635k073J2825O503j350r325j86O624J4327
1823A7215R469j0796j8349q94O830R969J992R476r970l711q401q801j229J0119
1809B919N920N70n889O14o683R875N979O773m838j3787j3132L399J3600N030O153
$$ plain form
1882 -5951 -5676 10270 11195 7093 6787 -2909 -368 1873 -8274 -8624 -4801 -13426 -19520 -18011 1152
1867 1152 12814 19805 10322 4139 -1487 -942 5404 10324 8389 -1584 -9542 2140 2815 -2190 -12407
1852 -12407 -20457 -11989 -6424 -1618 1002 -3756 -2336 2802 -7495 -88 14262 14593 1562 -12372
1838 -12372 -21850 -15534 -8953 -8229 -8739 -3495 -10130 -12203 622 7125 5775 -3550 -3736 2888 17215
1823 17215 26684 15888 -2461 -3355 3475 13444 15436 24912 14942 11231 2830 -5971 -7200 2919
1809 2919 8839 9409 3520 4134 -2549 7326 13305 20078 15240 1453 -11679 -8280 5320 10350 16503
$$ [...]
##END NTUPLES=NMR SPECTRUM
##END=
