##TITLE=Analysis number 327672
Compound Code rf 03254
Book Reference 168744
Project Code adrs flro3
Chemist Name jom
##JCAMPDX= 6.0         $$ Bruker NMR JCAMP-DX V2.0
##DATA TYPE= NMR SPECTRUM
##DATA CLASS= NTUPLES
##ORIGIN= Bruker BioSpin GmbH
##OWNER= nmr
$$ XWIN-NMR		Version 3.5
$$ Fri Mar 30 10:19:00 2007 GMT Daylight Time (UT+1h)  MAYBRIDGE\nmr@NMR_250MHZ
##.OBSERVE FREQUENCY= 250.131544655141
##.OBSERVE NUCLEUS= ^1H
##.ACQUISITION MODE= SIMULTANEOUS (DQD)
##.ACQUISITION SCHEME= undefined
##.AVERAGES= 16
##.DIGITISER RES= 18
##SPECTROMETER/DATA SYSTEM= dpx250
##.PULSE SEQUENCE= zg30
##.SOLVENT NAME= CDCl3
##.SHIFT REFERENCE= (INTERNAL, CDCl3, 0, 16.522)
##AUDIT TRAIL= $$ (NUMBER, WHEN, WHO, WHERE, WHAT)
$$ ##TITLE= Audit trail, XWIN-NMR		Version 3.5
$$ ##JCAMPDX= 5.01
$$ ##ORIGIN= Bruker BioSpin GmbH
$$ ##OWNER= nmr
$$ C:\u/data/dgb/nmr/ADRS/2690/pdata/1/auditp.txt
$$ ##AUDIT TRAIL=  $$ (NUMBER, WHEN, WHO, WHERE, WHAT)
(   1,<2007-03-30 10:18:39.04 +100>,<MAYBRIDGE\nmr>,<NMR_250MHZ>,
      <created by zg, POWCHK disabled, PULCHK disabled
       configuration hash MD5:
       49 4B E0 1D 92 C2 6B 37 9F E6 65 BC 52 41 86 1D
       data hash MD5: 64K
       E5 72 5D E7 95 1B 25 21 25 4C 68 F9 40 57 8F CE>)
(   2,<2007-03-30 10:18:50.87 +100>,<MAYBRIDGE\nmr>,<NMR_250MHZ>,
      <Start of raw data processing
       ef LB = 0.3 FT_mod = 6 PKNL = 1 SI = 32K 
       data hash MD5: 32K
       1D 2C 6D 92 10 D4 D0 4D 89 66 14 FE 09 A3 B6 D1>)
(   3,<2007-03-30 10:18:52.65 +100>,<MAYBRIDGE\nmr>,<NMR_250MHZ>,
      <apk 
       data hash MD5: 32K
       91 35 E1 C5 3D B4 D4 24 48 E7 18 75 3E F7 07 36>)
(   4,<2007-03-30 10:18:53.42 +100>,<MAYBRIDGE\nmr>,<NMR_250MHZ>,
      <abs ABSG = 5 
       data hash MD5: 32K
       FC 53 A2 7C F6 B7 A8 22 EF 06 D2 8D 3A 40 F5 C7>)
$$ ##END=
$$ 
$$ hash MD5
$$ 3C C6 2F 4C C4 DF 96 A0 64 71 3C FA CB EF E4 92
##$RELAX= 
##$RELAX= 
##$RELAX= 
##$RELAX= 
##$RELAX= 
##$RELAX= 
##$RELAX= 
$$ Bruker specific parameters
$$ --------------------------
##$DU= <C:\u>
##$EXPNO= 2690
##$NAME= <ADRS>
##$PROCNO= 1
##$TYPE= <nmr>
##$USER= <dgb>
##$AMP= (0..31)
100 100 100 100 100 100 100 100 100 100 100 100 100 100 100 100 100 100 
100 100 100 100 100 100 100 100 100 100 100 100 100 100 
##$AQSEQ= 0
##$AQ_mod= 3
##$AUNM= <au_zg>
##$AUTOPOS= <54 >
##$BF1= 250.13
##$BF2= 250.13
##$BF3= 250.13
##$BF4= 250.13
##$BF5= 500.13
##$BF6= 500.13
##$BF7= 500.13
##$BF8= 500.13
##$BYTORDA= 1
##$CFDGTYP= 0
##$CFRGTYP= 5
##$CHEMSTR= <none>
##$CNST= (0..31)
1 1 145 1 1 1 1 1 1 1 1 1 1 1 1 1 1 1 1 1 1 1 1 1 1 1 1 1 1 1 1 1 
##$CPDPRG= <>
##$CPDPRG1= <>
##$CPDPRG2= <>
##$CPDPRG3= <>
##$CPDPRG4= <mlev>
##$CPDPRG5= <mlev>
##$CPDPRG6= <mlev>
##$CPDPRG7= <mlev>
##$CPDPRG8= <mlev>
##$CPDPRGB= <>
##$CPDPRGT= <>
##$D= (0..31)
0 1 0 0 0 0 0 0 0 0.06 0 0 0 0 0 0 0.0002 0 0 0 0 0 0 0 0 0 0 0 0 0 0 
0 
##$DATE= 1175246318
##$DBL= (0..7)
120 120 120 120 120 120 120 120 
##$DBP= (0..7)
150 150 150 150 150 150 150 150 
##$DBP07= 0
##$DBPNAM0= <>
##$DBPNAM1= <>
$$ [...]
##$SUBNAM6= <"">
##$SUBNAM7= <"">
##$SUBNAM8= <"">
##$SUBNAM9= <"">
##$SW= 20.6930455092707
##$SWIBOX= (0..15)
0 0 3 0 0 0 0 0 0 0 0 0 0 0 0 0 
##$SW_h= 5175.983436853
##$TD= 65536
##$TD0= 1
##$TE= 683.16
##$TE2= 300
##$TE3= 300
##$TEG= 300
##$TL= (0..7)
0 120 120 120 120 120 120 120 
##$TP= (0..7)
150 150 150 150 150 150 150 150 
##$TP07= 0
##$TPNAME0= <>
##$TPNAME1= <>
##$TPNAME2= <>
##$TPNAME3= <>
##$TPNAME4= <>
##$TPNAME5= <>
##$TPNAME6= <>
##$TPNAME7= <>
##$TPOAL= (0..7)
0.5 0.5 0.5 0.5 0.5 0.5 0.5 0.5 
##$TPOFFS= (0..7)
0 0 0 0 0 0 0 0 
##$TUNHIN= 0
##$TUNHOUT= 0
##$TUNXOUT= 0
##$USERA1= <user>
##$USERA2= <user>
##$USERA3= <user>
##$USERA4= <user>
##$USERA5= <user>
##$V9= 5
##$VALIST= <valist>
##$VCLIST= <CCCCCCCCCCCCCCC>
##$VD= 0
##$VDLIST= <DDDDDDDDDDDDDDD>
##$VPLIST= <PPPPPPPPPPPPPPP>
##$VTLIST= <TTTTTTTTTTTTTTT>
##$WBST= 1024
##$WBSW= 4
##$XGAIN= (0..3)
0 0 0 0 
##$XL= 0
##$YL= 0
##$YMAX_a= 571992
##$YMIN_a= -406696
##$ZGOPTNS= <>
##$ZL1= 120
##$ZL2= 120
##$ZL3= 120
##$ZL4= 120
##$ABSF1= 16.522
##$ABSF2= -4.171173
##$ABSG= 5
##$ABSL= 3
##$ALPHA= 0
##$AQORDER= 0
##$ASSFAC= 0
##$ASSFACI= 0
##$ASSFACX= 0
##$ASSWID= 0
##$AUNMP= <proc_1d>
##$AZFE= 0.1
##$AZFW= 0.1
##$BCFW= 0
##$BC_mod= 0
##$BYTORDP= 0
##$COROFFS= 0
##$CY= 12.5
##$DATMOD= 1
##$DC= 0
##$DFILT= <>
##$DTYPP= 0
##$F1P= 14.0000005364418
##$F2P= -0.99999901652339
##$FCOR= 0.5
##$FTSIZE= 32768
##$FT_mod= 6
##$GAMMA= 0
##$GB= 0
##$INTBC= 1
##$INTSCL= 1
##$ISEN= 128
##$LB= 0.3
##$LEV0= 0
##$LPBIN= 0
##$MAXI= 10000
##$MC2= 0
##$MEAN= 0
##$ME_mod= 0
##$MI= 0
##$NCOEF= 0
##$NC_proc= -4
##$NLEV= 6
##$NOISF1= 0
##$NOISF2= 0
##$NSP= 0
##$NTH_PI= 0
##$NZP= 0
##$OFFSET= 16.522
##$PC= 1
##$PHC0= 81.5739
##$PHC1= 4.694824
##$PH_mod= 1
##$PKNL= yes
##$PPARMOD= 0
##$PSCAL= 4
##$PSIGN= 0
##$REVERSE= no
##$SF= 250.13
##$SI= 32768
##$SIGF1= 0
##$SIGF2= 0
##$SINO= 400
##$SIOLD= 32768
##$SREGLST= <1H.CDCl3>
##$SSB= 0
##$STSI= 32768
##$STSR= 0
##$SW_p= 5175.98343685301
##$SYMM= 0
##$S_DEV= 0
##$TDeff= 65536
##$TDoff= 0
##$TI= <Analysis number 999999
Compound Code 99
Book Reference 9
Project Code 9>
##$TILT= no
##$TM1= 0
##$TM2= 0
##$TOPLEV= 0
##$USERP1= <user>
##$USERP2= <user>
##$USERP3= <user>
##$USERP4= <user>
##$USERP5= <user>
##$WDW= 1
##$XDIM= 32768
##$YMAX_p= 305841236
##$YMIN_p= -65207
$$ End of Bruker specific parameters
$$ ---------------------------------
##NTUPLES= NMR SPECTRUM
##VAR_NAME=  FREQUENCY,     SPECTRUM/REAL,   SPECTRUM/IMAG
##SYMBOL=    X,             R,               I
##VAR_TYPE=  INDEPENDENT,   DEPENDENT,       DEPENDENT
##VAR_FORM=  AFFN,          ASDF,            ASDF
##VAR_DIM=   32768,         32768,           32768
##UNITS=     HZ,            ARBITRARY UNITS, ARBITRARY UNITS
##FACTOR=    0.157963299565203, 1,           1
##FIRST=     4132.6476996994, 0,             0
##LAST=      -1043.33573715361, 0,           0
##MIN=       -1043.33573715361, -65207,      0
##MAX=       4132.6476996994, 305841236,     0
$$ Real data points
##PAGE= N=1
##DATA TABLE= (X++(R..R)), XYDATA
$$ [...]
18897B446m498m602j674o2m320m139m755P708O539J396J544O222K051M07j8977
18882a4714l226J4735J8125p702J244L997q979j2357k824J743L058O678Q23l453
18868b852M036P176o254l885p808M51L509M521Q245n829r822Q157J1646N863j7087
18853F7q863Q679J1448j7666j0890J7530N947j7595j5670p00m42R377n147K429
18839b1496N264L184M642N188n493q537j418M840P835l846k055j1991k928P81
18825b6030Q473R236O747m06q156p332J4423J914Q247q79j0648k43Q228j992o428
18810d846N458N618k407j564k995n159o170J1260n740l296P143O178R743J0461
18796B3684m023p353L187j3163j5092p193p53j371K983M547j205Q049N01J1630
$$ y = [2446, -2052, -6654, -8328, -8390, -12710, -16849, -21604, -13896, -7357, -5961, -4417, 1805, 3856, 4263, -14714, -17940, -3205, 14920, 7218, 8462, 12459, 3480, -8877, -11701, -9958, -6900, -222, 601, -2852, 1184, 8360, 2106, -1779, -9587, -9136, -5627, -1106, 7139, 1310, -8512, -355, 11291, 17154, 67, -8796, -117, 11331, -6335, -17225, 305, 6252, -11343, -27013, -27713, -28155, -18778, -23925, -21496, -16232, -13048, -8406, -3218, -8711, -17248, -18666, -13826, -5991, -9837, -11892, -23883, -26811, -26030, -17557, -8321, -1574, -1980, -10136, -17468, -3045, -1131, 7116, 6237, -4411, -4654, 3574, 1582, -4846, 612, 6230, 3823, 2259, -736, -5895, -12065, -805, -6545, -9841, -2698, 3480, 13223, 23684, 19661, 12308, 15495, 2332, -12760, -19953, -20706, -22077, -19094, -14547, -15752, -7703, -7202, 4428]
18782D428o067o7n695K892J1738K467n681J3726N453K826L143R124Q912K2610
18768F9809L8831K6512j0187m4927l8912j9547P351P399q486j2593l560K325L832
18755A7847J2101K731j453r991j9017n372j603O772M77N501l419j5592O721J0063
18741E766l727k541m535k127m044L264K0j2729j52M363O860L095J8416P304M817
18726B4050n2R010o675r772n667k288Q611l690o932l049J1772L686j52n858k596
18711A0398m056O571L945L960Q681K3589Q904J9834K7945K4866J4460N988J9326
18698A74411K1617L3315O0242L7125j3143l8043k3370n819j0006j0150R401L7944
18686B73524M7557P2923P7615j7254q9663r0323o5688m1847j2626J2306K2541
$$ y = [4428, -1639, -1706, -7401, -4509, 7229, 9696, 4015, 17741, 23194, 26020, 29163, 38287, 47199, 69809, 108640, 135152, 124965, 80038, 41126, 21579, 28930, 36329, 27843, 15250, 11690, 14015, 17847, 29948, 32679, 31226, 21235, 2218, -3154, -4757, 2015, 2492, 7993, 4574, -11018, -4297, 5766, 2039, -502, -5037, -7164, -11208, -7944, -7924, -20653, -20805, -16442, -9582, -6487, 11929, 19233, 24050, 23998, 33008, 26333, 16561, 10894, 8606, 17217, 13527, 6595, 3546, 15318, 19004, 18852, 12994, 10398, 6342, 12913, 16858, 20818, 29499, 53088, 61992, 81826, 109771, 134637, 149097, 155085, 174411, 196028, 229343, 289585, 326710, 313567, 275524, 252154, 246335, 236329, 226179, 235580, 273524, 321081, 394004, 471619, 454365, 364702, 274379, 208691, 166844, 154218, 166524, 189065]
18675A89065L2358K9144n573k7654m5279m0915k5790j2262n997J0161O188l528
18663I9918J497N53J0096J4703M06J3780J8922M0096M6395L0129K4527L1519P0104
18650D02645R0686N8043j9193o7246n5002p353J326L4758O8386R4244J42786J44562
18638H88642O7825m7030j29989j57979j00905l3447o645j0266L4456Q2334O2429
18627F49425l2996j12372j11720o5753m3696k4224p018k6212l0702l1435k7126
18616A36171j5778j6544l180J780o287J6009K3874J9536R009N404K5626L1162
18604B26782K7647J1062o972k7439k7453K308R948K1878M0413M2117P8254R7620
18592D96165M6138k5941p2409p3598k8558j0467r014j2215J0218M2485L5272l593
$$ y = [189065, 221423, 250567, 244994, 217340, 172061, 131146, 105356, 93094, 87097, 97258, 103446, 99918, 101415, 101968, 112064, 126767, 127173, 140953, 159875, 199971, 246366, 276495, 301022, 332541, 402645, 493331, 551374, 532181, 464935, 409933, 402580, 403906, 438664, 507050, 601294, 744080, 888642, 956467, 909437, 779448, 621469, 520564, 487117, 480472, 470206, 504662, 586996, 649425, 616429, 504057, 392337, 326584, 282888, 258664, 251646, 225434, 194732, 163297, 136171, 120393, 103849, 100669, 102449, 96162, 112171, 136045, 155581, 164590, 169994, 195620, 226782, 254429, 265491, 258519, 231080, 203627, 205935, 215883, 237761, 278174, 320291, 398545, 496165, 542303, 516362, 443953, 370355, 341797, 331330, 322316, 310101, 320319, 362804, 398076, 394483]
18580C94483m8222o4400m8098l0877j2077L540k259k8483l1485j8771k2949k860
18568H7542M389o835n342j896k1936o334M97R86o551J785L672m893M968j60n979
18553D3913p840j2950o309Q188M316n844J293q641N581L988j0635P596L997n64
18539B6089q851M440N473O658M194K176r441j2912j853Q303j700k673J0410J2369
18525D2682j1097p742m082M04j170M354j1214n269J0605l932o324m022L320M207
18511A0720o79N955O026m5J3689J912m60m789j2674J0328J133j2093R982R624
18497C8629j1332k954N664J909J2347M047J0634R909j282J1533M59k0750q922
18484D9891j3605r951J3622K446o861l18k204j925p06J904n618k797N64R837n188
$$ y = [394483, 346261, 281861, 233763, 202886, 190809, 194349, 192090, 163607, 132122, 113351, 90402, 87542, 91931, 85096, 79754, 77858, 55922, 49588, 50085, 51071, 44520, 46305, 49977, 45084, 50052, 49892, 43913, 36073, 23123, 16814, 25002, 29318, 23474, 24767, 16126, 21707, 25695, 15060, 22656, 26653, 26089, 17238, 21678, 27151, 33809, 38003, 40179, 30738, 17826, 15973, 24276, 22576, 19903, 30313, 42682, 31585, 23843, 19761, 20165, 18995, 23349, 12135, 6866, 17471, 13539, 7215, 3193, 6513, 10720, 10041, 15996, 22022, 21977, 35666, 37578, 37118, 32329, 19655, 29983, 31116, 19023, 29005, 38629, 27297, 24343, 30007, 31916, 44263, 48310, 58944, 68853, 67571, 79104, 79563, 58813, 49891, 36286, 26335, 39957, 42403, 35542, 35224, 33020, 31095, 30389, 32293, 26675, 23878, 24442, 34279, 29091]
18469B9091R693K2903q14p209n586m129o452k320N358P109J0822Q351J364N751
18455G3932j653k34o331n060R89r260J5090J5219P192J2316J1838l046j1358j2399
18441H7235j4677o982q235o342r87L793r326j9501K089J3978j330J984j512R474
18427D9661O338R530p84o591j7140R281K8491K2067o45l579k869j8028P89q24
18413G5697j714j632k594Q477J0976J057J5485J3721J6841Q761P534m502r041
18400A39066J4400J6567J865j265j2578j4527j0239m178J2272J1319j491j592
18388A49619M504q437j7128N148j3154j8725k556J211r794j0527M448j2335L001
18375G5275J5751J3746P772Q194m81k63m957L03M81j2877o411J3629K430K651
$$ y = [29091, 38784, 61687, 60873, 53664, 48078, 43949, 37497, 35177, 40535, 47644, 58466, 66817, 68181, 73932, 72279, 72045, 65714, 60654, 61643, 52383, 67473, 82692, 89884, 102200, 114038, 110992, 99634, 87235, 72558, 65576, 57341, 50999, 50012, 53805, 44479, 24978, 27067, 41045, 39715, 41699, 40187, 49661, 55999, 65529, 64745, 58154, 41014, 50295, 78786, 100853, 100208, 96629, 93760, 75732, 76521, 75697, 73983, 72351, 69757, 78234, 89210, 90267, 105752, 119473, 136314, 145075, 152609, 148107, 139066, 153466, 170033, 171898, 170633, 158055, 143528, 133289, 129111, 141383, 152702, 151211, 149619, 154123, 145686, 128558, 133706, 120552, 101827, 99271, 100482, 90688, 80161, 84609, 72274, 75275, 91026, 104772, 112544, 120738, 120257, 119994, 115037, 115340, 115821, 102944, 96533, 110162, 112592, 115243]
18361A15243p166J892m498r255J1558J0563Q058l950j1236q646J5632K1819N004
18348A45018N897M441J8497K1299p473J269Q26j896j3307q300q485l706n977L544
18334A51647J0549p98Q410P924J2058o71k0484l113J0260M225Q486P054o782J0700
18320A99465L39Q916J5630O668M102j3304k4327q526m439n962m52j837k844k058
18306A71371j5038N922J8303J8091l116p42j630J25K369m449p047J908J5796J3418
18292B15281O457n297M789J3903J7262O94n331N079l535K1563J5720r45O481R584
18278C01705K623M610J1988J2381K1030R665J2608K3968K5942J3722N016j2631
18266D32627L840K5437M107L492K116J5769p302k4762j9694j2841p079P966P257
$$ y = [115243, 108077, 109969, 105471, 96216, 107774, 118337, 126395, 122445, 111209, 102563, 118195, 140014, 145018, 150915, 155356, 173853, 195152, 187679, 188948, 189774, 187878, 174571, 166271, 157786, 154080, 148103, 151647, 162196, 161398, 169808, 177732, 189790, 189119, 168635, 165522, 175782, 180007, 188493, 195547, 188765, 199465, 199804, 208720, 224350, 231018, 235120, 221816, 197489, 188963, 184524, 178562, 178110, 176273, 173429, 171371, 156333, 162255, 180558, 198649, 195533, 194791, 193161, 193286, 195655, 191206, 184159, 186067, 201863, 215281, 221738, 216441, 221230, 235133, 252395, 253089, 247758, 252837, 249302, 270865, 286585, 285640, 292121, 301705, 304328, 308938, 320926, 333307, 354337, 364002, 376610, 400578, 426520, 440242, 445258, 432627, 436467, 461904, 466011, 469503, 471619, 487388, 480086, 455324, 435630, 422789, 415710, 423676, 430933]
18253D30933q947J839J3534J2258K3910K2145R257R508J2551l918J2711K8289
18241E64070K2976K7953L5015L9395M9574O0493M8245L2314L7238L2759O351K3047
18229I79430N1884R5240J16487J51731J84679K04667J88894J81106J67694J19886
18219B441698N1560k7855o64J14854K35492L00733L36247L59353M30635O42264
18209D884317J018904J588770K349764K940156J890414p08006j884671j391247
18201A0688401m02587M81569J302494K219259L394873N113644P759276J1964030
18193D2520959J8033368K2320174J6399288L696086q648983j7582536j5730369
18186F1007987p911288j637591k680081p215888p363357m210892o25186K571100
$$ y = [430933, 421986, 423825, 437359, 449617, 473527, 495672, 504929, 514437, 526988, 523070, 535781, 564070, 587046, 614999, 650014, 689409, 738983, 799476, 847721, 880035, 917273, 950032, 956383, 979430, 1031314, 1126554, 1243041, 1394772, 1579451, 1784118, 1973012, 2154118, 2321812, 2441698, 2493258, 2465403, 2464739, 2579593, 2815085, 3115818, 3452065, 3811418, 4242053, 4884317, 5903221, 7491991, 9841755, 12781911, 14672325, 13964319, 12079648, 10688401, 10285814, 10767383, 12069877, 14289136, 17684009, 22797653, 30556929, 42520959, 60554327, 82874501, 99273789, 102969875, 94320892, 76738356, 61007987, 53096699, 51459108, 48779027, 41563139, 34199782, 29988890, 29363704, 31934804]
18178C1934804N401480N691536j56500p010651q359775o280464l938721k384094
18170A4897615j365300p02776l36435j33654J27755M14446O52875R65331J621238
18161A6141095K624885L245569J732769q07331j358051k81735J317690K910621
18153B5525512M832608P546039J0858346J2472186Q796195M665695P953444J8769570
18145A01419595L2125568L2052348M799636j6715714j5955397r162867j078439
18138A27484730O121297J1138561J3432491N854639r822030k2892641k0538398
18131A10778649j4260556j5167982j6757708j3999532r493872n785910l178483
18124C2134606j369746L6524J311752R53480k266877m560951m238388k820844
$$ y = [31934804, 37336284, 43027820, 42871320, 35860669, 27500894, 21220430, 17281709, 14897615, 13532315, 12829539, 12493104, 12359450, 12487205, 12901651, 13554526, 14519857, 16141095, 18765980, 22011549, 23744318, 22936987, 21578936, 21297201, 22614891, 25525512, 30358120, 37904159, 48762505, 61234691, 70030886, 74696581, 82650025, 101419595, 133545163, 165597511, 170397147, 153681433, 137726036, 128563169, 127484730, 133606027, 144744588, 158177079, 164031718, 154209688, 131317047, 110778649, 96518093, 81350111, 64592403, 50592871, 41098999, 35313089, 32134606, 30764860, 30801384, 32113136, 33066616, 30799739, 26238788, 22000400, 19179556]
18116A9179556j471814m23435L92318J060443J892089K964137M745388P558078
18108C5896760P483748k88758m197404j480076L741293Q404526Q792058R89718
18100E9341865o865184p347948l140869K018508P184084J1823842J2049585P207287
18092H2271170Q708094J8512501K6516838J8040460k698675k3561565l3208453
18085I4580370k8130512j8540107j1266519p120154m751665l187634k057268j164784
18077A8361727k59014Q34842K244649L124382J169844l034886m798161l983350
18069A3660033k571934j624382j110546q24385o18523m35309k98727k53824k50503
18060E671900j92124j62579j56208k35567k81372l07675l44908l54449l47409
$$ y = [19179556, 17707742, 17284307, 17676625, 18737068, 20629157, 23593294, 28338682, 35896760, 43380508, 43091750, 38894346, 37414270, 41155563, 49560089, 58352147, 59341865, 52476681, 45128733, 41987864, 44006372, 51190456, 63014298, 75063883, 82271170, 90979264, 109491765, 136008603, 154049063, 151350388, 127788823, 94580370, 66449858, 47909751, 36643232, 29523078, 24771413, 21583779, 19526511, 18361727, 18102713, 18937555, 21182204, 24306586, 25476430, 22441544, 17643383, 13660033, 11088099, 9463717, 8353171, 7528786, 6910263, 6474954, 6176227, 5922403, 5671900, 5479776, 5317197, 5160989, 4925422, 4644050, 4336375, 3991467, 3637018, 3289609]
18051C289609l02463k70383k26872j89693j57748j10028o6771n7084q2453q8783
18041A737331p4535o2003n4274l2543l5096m2607n1243m4125j3250j0702j3091
18030A303862p208j5644k3147n5574o7347m9964m1858m0752j4171J7601J9700
18019A025498K8717M5907N9412J6445l7928n2441l7638k355K001N006R066M044
18007A065734k7801p2813p7857m7076q571l736k6997n9593m9530m3010l4454j9736
17995E94560j950k021j3636q975k2795j5498n654l382q24j9529o385K653p707
17982D88857o660J08J6567r737n614P031J832Q7O539M770R46p037j018P075N496
17967E09242K706p974n678n381J8372L7988L7431k115j9730k1335j1080o319N71
$$ y = [3289609, 2987146, 2716763, 2489891, 2300198, 2142450, 2032422, 1965651, 1908567, 1826114, 1737331, 1662796, 1600793, 1546519, 1513976, 1478880, 1436273, 1385030, 1340905, 1327655, 1316953, 1303862, 1296654, 1281010, 1257863, 1202289, 1134942, 1084978, 1043120, 1002368, 988197, 1005798, 1025498, 1054215, 1100122, 1159534, 1175979, 1138051, 1085610, 1047972, 1045617, 1047618, 1052624, 1061690, 1065734, 1037933, 965120, 887263, 840187, 831616, 827880, 800883, 741290, 691760, 648750, 614296, 594560, 592610, 590589, 576953, 567978, 545183, 529685, 524031, 520649, 519825, 500296, 493911, 496564, 488857, 482197, 482305, 498872, 489135, 483521, 490552, 492384, 492471, 499010, 503780, 504726, 497689, 496671, 503746, 509242, 511948, 503974, 498296, 492915, 511287, 549275, 586706, 584591, 564861, 543526, 532446, 526127, 526698]
17954E26698J2989m770l3810n1011m4247k6517J651L3j2943j0042j4379r171j6323
17941C18158P650J0945O913K475k373j054n179j1551n004J3j6247j793P503N952
17927C16408N418J7080P085K097j5565n95N918j061n444J0478j3598k2591p108
17914B98522N484J3767J1905J119K0929L4526M6380K1696k64k3843m6160l6964
17902C47097k1605k4566L875O147j2661n375K875N480J666O862J3191L299p453
17889C18832K838J0802Q808P28k106P2k9863k8331j6341j3147j4250J201j1228
17876B28015j719K717r465o64M150j0948q147j2387k153J3860M0p878J5923J4907
17862B26251K0633R742j531J678J0484n376p399j8001j275N186J0788R448J5049
$$ y = [526698, 539687, 534917, 501107, 450096, 405849, 379332, 380983, 381016, 368073, 358031, 343652, 334481, 318158, 325808, 336753, 343666, 346141, 343768, 342714, 337535, 325984, 320980, 320993, 304746, 302953, 310456, 316408, 321826, 338906, 345991, 348088, 332523, 331928, 337846, 336785, 331341, 341819, 328221, 305630, 298522, 304006, 317773, 329678, 330797, 351726, 386252, 432632, 454328, 454064, 430221, 384061, 347097, 325492, 300926, 304801, 310948, 298287, 292912, 295787, 301267, 302933, 309795, 322986, 326285, 318832, 321670, 332472, 341280, 342008, 339902, 339974, 310111, 281780, 265439, 252292, 238042, 239243, 228015, 226296, 229013, 219548, 218884, 223034, 212086, 203939, 191552, 189399, 203259, 203299, 195421, 211344, 226251, 246884, 256626, 255095, 256773, 267257, 261881, 254482, 236481, 235206, 240392, 251180, 260628, 275677]
17849B75677P658p421O191J3973L315r62m14K298J1346Q874O883J2455L5998L7344
17835D13215Q950r087j5679j6757j6167j6074j7076N13J335k1727q683k1952k9977
17822B50834j3863J1390j0464j7628j0947p000Q23O872J0727o45n930n989M651
17809B12831N005J414J6412J3669P051o020p804q013J900o63R057J567n301P717
17795B48822J859M744P112R914j878K003n59M733J2152J2310J4997J8097Q345
17782C42651K47J7235K2443J3567J1929j4127k9520j4969J339L285j3969q833
17770C31278k822j4088l183o647o223P859K73m275J814q471q918j0493O174J383
17756B83661K48N495r133J484O483M195M310P550q106J35Q490l348K07Q063O303
$$ y = [275677, 283335, 275914, 282105, 296078, 299393, 298431, 298017, 300315, 311661, 320535, 327418, 339873, 375871, 413215, 422165, 413078, 397399, 380642, 364475, 348401, 331325, 331838, 333173, 311446, 302763, 280811, 250834, 236971, 248361, 237897, 220269, 209322, 202322, 203145, 210017, 220744, 220099, 214169, 208180, 212831, 217836, 219250, 235662, 249331, 256382, 250362, 242558, 234545, 236445, 235782, 244839, 246406, 241105, 248822, 250681, 255425, 262537, 272451, 270573, 272576, 272017, 276750, 288902, 301212, 316209, 334306, 342651, 342898, 360133, 382576, 396143, 408072, 393945, 364425, 349456, 350795, 354080, 340111, 331278, 328456, 314368, 311185, 304538, 298315, 306174, 306447, 302172, 303986, 295515, 286597, 276104, 282278, 283661, 283909, 289404, 280271, 281755, 288238, 292433, 296743, 304293, 296187, 296322, 304812, 301464, 301671, 309734, 316037]
17741C16037J4961J4168K428R428J0484J5262J9324K0656m166q355j0026Q984
17729D09185J5107J6623J3879j5167j6979M606K785J1057J6145J5600J4748L110
17717D90699q526N828J9505K8511J5348K1437J4349O775L8535L9590L0876J7508
17705G20435K1361J4480J9193Q189M075K1850L4837Q964J3718J4072L4674L0442
17693I46290K5392M2623N7698O2374P8127Q0230R3339J16165Q4684K4972K3016
17682A634910N8568J17489J39263J70977J54715R6523J01970J26163J12569J30595
17672B843742K36081L70492M79962O07077P60364J050973J478026K057590K957829
17663A2842136M491694O694636P730981L956251j071949j369474K079621P090228
$$ y = [316037, 330998, 345166, 347594, 357022, 367506, 382768, 402092, 422748, 418582, 410227, 400201, 409185, 424292, 440915, 454794, 439627, 422648, 427254, 430039, 441096, 457241, 472841, 487589, 490699, 482173, 488001, 507506, 536017, 551365, 572802, 587151, 593926, 632461, 672051, 702927, 720435, 741796, 756276, 775469, 783658, 787733, 809583, 844420, 853384, 867102, 881174, 915848, 946290, 971682, 1014305, 1072003, 1134377, 1212504, 1292734, 1386073, 1502238, 1586922, 1611894, 1634910, 1693478, 1810967, 1950230, 2121207, 2275922, 2372445, 2474415, 2600578, 2713147, 2843742, 3079823, 3450315, 3930277, 4537354, 5297718, 6348691, 7826717, 9884307, 12842136, 17333830, 24028466, 31759447, 35715698, 34643749, 33274275, 35353896, 42444124]
17655D2444124J2033240J2431600L213204q882706j2047554p539514j060952M468149
17647D5059591N692442j768708r923538j0781104p595145m591639k862429j885252
17639A1344218j274114q88011o04014l56341j91916j97621k51894j74986m7804
17630G357517J00200K70036L19653L28210L92021M85571N87351P73065J163113
17621A1776737J713330K445143L664193N456649P298993O698364L073930K296163
17613D4423502M607962N783024O483743J1309031J8837794K0379910Q714458q718191
17605A11821233j6237603j0979250l187037l330084p655163n980582p64613L17318
17597F4004219m607457o894280m117920k72636Q36936j140177k822238k085899
$$ y = [42444124, 54477364, 66908964, 70122168, 61239462, 49191908, 41652394, 40591442, 45059591, 50752033, 48983325, 39059787, 28278683, 20683538, 16091899, 13229470, 11344218, 10070104, 9182093, 8578079, 8221738, 8029822, 7832201, 7580307, 7405321, 7357517, 7457717, 7727753, 8047406, 8375616, 8767637, 9253208, 9840559, 10613624, 11776737, 13490067, 15935210, 19599403, 25056052, 32355045, 39053409, 42127339, 44423502, 49031464, 54814488, 61298231, 72607262, 91445056, 111824966, 120539424, 111821233, 95583630, 84604380, 81417343, 78087259, 70432096, 64451514, 63686901, 64004219, 59396762, 52502482, 48384562, 48111926, 48948862, 47808685, 44986447, 42900548]
17589D2900548l35257O92211J585189L719403P495639J3110906K1023335K9932562
17581A20124536L3764380K3805673R01692j8023231j9311891o143472J2038442
17574A47156129K6152987K3931811J713103k0839575k4738440j3440093k112181
17567A37823741k599931j2349656j8011326j4985061o817968K366197Q801612
17560I4227608O118651l918384j0638310j2115799r436782m481721o92547k977626
17552E6085090q288085r127409o786130m362281k824960j830971j056688l56169
17544B1452397L53093J202461K286723L736600N742016Q175630R383892O923093
17536E9255905K060972j09859K687165Q381978J2123975Q930942O82951l555883
$$ y = [42900548, 42565291, 43257502, 44842691, 48562094, 56057733, 69168639, 90191974, 120124536, 153888916, 177694589, 178596281, 160573050, 141261159, 135117687, 147156129, 173309116, 197240927, 198954030, 178114455, 153376015, 139935922, 137823741, 135223810, 122874154, 104862828, 89877767, 83059799, 85425996, 94227608, 100346259, 96427875, 85789565, 73673766, 64236984, 59755263, 59062716, 56085090, 47797005, 38669596, 31883466, 27521185, 24696225, 22865254, 21808566, 21452397, 21805490, 23007951, 25294674, 29031274, 34773290, 42948920, 52332812, 59255905, 61316877, 61207018, 63894183, 72276161, 84400136, 93331078, 94014029, 90458146]
17528I0458146Q25850J1563108K3726142K8278640J6377160m799406j8350291
17521A48079349j7535110o522638N076737O237091o491159k1264045k5231550
17514H2348675j9625540j1921995o494882m396553m685830n165628m636692l489559
17506B1931996k361935j412389n02672L90901J042299O80639r59306k559122k927804
17497A3322607k360733j608532j043797p36513o46661o08700n52816n02652m30493
17488D831710l62031k68688k29654k22278k07376j95467j79256j56491j24216
17479B886253j07276j13169j02236j06306j08252j09991r1827q3307o4342m7335
17469A952212m1685o0575o9077n6304o1124o6313m7159k4128k3277k9744k0955
$$ y = [90458146, 91283996, 102847104, 126573246, 154851886, 171229046, 166429640, 148079349, 130544239, 124021601, 129098338, 135335429, 128844270, 107580225, 82348675, 62723135, 50801140, 44306258, 39909705, 35223875, 30058247, 25421555, 21931996, 19570061, 18157672, 17655000, 18045901, 19088200, 19768839, 18809533, 16250411, 13322607, 10961874, 9353342, 8309545, 7573032, 6926371, 6317671, 5764855, 5262203, 4831710, 4469679, 4200991, 3971337, 3749059, 3541683, 3346216, 3166960, 3010469, 2886253, 2778977, 2665808, 2563572, 2457266, 2349014, 2239023, 2147196, 2063889, 1999547, 1952212, 1910527, 1849952, 1780875, 1724571, 1663447, 1597134, 1549975, 1525847, 1502570, 1472826, 1451871]
17458A451871l0809k6622k2442l3751k4382k9750l4336j7246k0744k8526j9221
17447A164042j8291l233m673R922J9543J3827J9950k7358n8528o1121m7855l5730
17435I70495m7885m4585k7877r923L857j2882j9546l6158k1716m554Q65o144J271
17422G45218l233p632j7599j1494m070L295K644j0501m699J05K892J143O68L252
17408F99989j30J0756K1241J2278J7940Q894P830K084k1925m7767l8393m464K919
17395F71252j3433q786m574j569k5548j7272j5097j9237j3783j1062p895j515
17383E31481P983J6202M1642L8631m907m7012l9857j668K3167M4767L3861J640
17371F45930m4445l6307k1056N635p74r011k1626l1208j2494q3N607j122j1410
$$ y = [1451871, 1421062, 1394440, 1371998, 1338247, 1313865, 1284115, 1249779, 1232533, 1211789, 1183263, 1164042, 1145751, 1142518, 1137845, 1147767, 1167310, 1181137, 1201087, 1173729, 1115201, 1054080, 1006225, 970495, 922610, 878025, 850148, 840225, 844082, 831200, 811654, 775496, 753780, 749226, 750091, 743947, 745218, 741985, 734353, 716754, 705260, 701190, 704485, 707129, 696628, 691929, 692034, 694926, 696069, 696737, 699989, 699859, 710615, 731856, 744134, 762074, 770968, 778798, 780882, 758957, 711190, 672797, 668333, 671252, 657819, 649033, 644459, 642890, 617342, 600070, 584973, 565736, 551953, 540891, 532996, 531481, 539464, 555666, 597308, 635939, 631032, 584020, 544163, 542495, 565662, 610429, 644290, 645930, 601485, 565178, 544122, 549757, 548983, 539972, 518346, 487138, 474644, 474561, 480168, 479046, 467636]
17358D67636k6023m05J331p790l894j9893k3876j8795j5412j3880j3843J7540
17346C42696O062j5841j8348j1396n62j83q446M085J6090J1069Q336L285o149
17333C30698L938Q131K709o452J4635K8036M6212L9467J2567l0964l8871k3626
17321C86480n613O994K7607L171l3607m0059k8350j1506M319o131j1804j944m984
17308B84573j0785P587J3718p310k964k518k1255j9365j7114j7431P08r80M8j371
17294B05541j277Q333n659o080M743Q208j0850k030J2645k71N555L00j395o967
17280B10796j2299k72j151J3832L907k843M197J464r833k1657q962J2599J1798
17267B01576q794m562Q41j1219p254j4980j8936j1632p173J2968J5212r11M554
$$ y = [467636, 441613, 441208, 442539, 434749, 430855, 410962, 387086, 368291, 352879, 338999, 325156, 342696, 348758, 332917, 314569, 303173, 302611, 302428, 293982, 298067, 314157, 325226, 333562, 336847, 330698, 334636, 342767, 345476, 339024, 353659, 381695, 427907, 467374, 479941, 448977, 410106, 386480, 380867, 387861, 415468, 418639, 385032, 344973, 316623, 305117, 309436, 303305, 291501, 289557, 284573, 273788, 281375, 295093, 287783, 284819, 282301, 261046, 241681, 224567, 207136, 207844, 206864, 206912, 205541, 204264, 212597, 206938, 200858, 205601, 213809, 202959, 200929, 213574, 213303, 218858, 219158, 217763, 210796, 198497, 198225, 197074, 210906, 214813, 211970, 216167, 217631, 207798, 186141, 177179, 189778, 201576, 192782, 188220, 189061, 177842, 170588, 155608, 136672, 125040, 117867, 130835, 146047, 145136, 149690]
17254A49690M696n830q442r400O953N998k626J23N437J2316L965n227j0961j0434
17240A36258l449R288N962L06n597l379m046k089m030J0750J1497P66j075l860
17226A47302o672O314j027k455q437J309k1105J90K184J6889K1078J189k981l904
17212A49874j1358r213m261j0681r988J298J0219m243l687O855L398N265N24p608
17198A16394q430l85J899j7013j6507P544k570J5188J2053R395k738q22l947q831
17184A01230j159K98l264L6q716L17P586J1412P6l941J6N675j1650l696J9634
17169A13854Q510M56J066K747K616K25q620r862J0141J0264J3045J2993J1644
17156A69079K907O288J0190J1675J3993K0899K8005K0882R911J114n893k966K7216
$$ y = [149690, 154386, 148556, 140114, 130714, 137667, 143665, 141039, 141162, 146599, 158915, 162880, 157653, 146692, 136258, 132809, 142097, 148059, 148365, 142768, 139389, 135343, 133254, 129224, 139974, 151471, 152237, 151162, 147302, 140630, 146944, 145917, 143462, 135025, 136334, 115229, 115419, 117603, 134492, 155570, 156759, 153778, 149874, 138516, 129303, 125042, 114361, 104373, 105671, 115890, 111647, 107960, 114815, 118213, 123478, 124002, 116394, 107964, 107579, 109478, 92465, 75958, 83502, 80932, 96120, 108173, 117568, 114830, 114008, 110061, 101230, 100071, 100369, 97105, 97141, 88425, 88742, 96328, 107740, 107816, 103875, 103891, 109566, 97916, 94220, 113854, 122364, 122820, 123886, 126633, 129249, 129474, 120854, 110992, 121133, 131397, 144442, 157435, 169079, 171986, 178274, 188464, 200139, 214132, 235031, 263036, 283918, 293829, 294943, 289050, 286084, 313300]
17143C13300L9624M4495J1638m0517m8576k3887n812j183j384q181k9925l4065
17131B15527l1486k4524j1001K844p025l282p880L177N336j6550q417R394m100
17118A22013M61m26N015R96J620J384K363J196P393J3250J7921J2764K3204M2154
17104B51308N9578O4930M0386L3997N786M216M0111P8575J00717N3790k0888q2082
17092F30424p9474l3169j098K0291R433K103J3687L4105L7544K7243J0415J7506
17080F89010L4871J9347N622j6908l5653m9902m7854j2112L594J586J1282J0563
17068F13446K0790O3207N4417q049n1708l9513o95J2046P204j5823n5866o7611
17056E31845m2781k3175l6114l1915j3930J8946L8769M2400O51n0291m3132k2800
$$ y = [313300, 352924, 397419, 409057, 368540, 319964, 296077, 290265, 289082, 287698, 279517, 249592, 215527, 184041, 159517, 148516, 151360, 144335, 141053, 133173, 136350, 141686, 125136, 116719, 126113, 122013, 122474, 122048, 127063, 128059, 129679, 131063, 133426, 134622, 142015, 155265, 173186, 185950, 209154, 251308, 310886, 375816, 416202, 450199, 455985, 460201, 500312, 578887, 679604, 733394, 712506, 630424, 550950, 517781, 516683, 536974, 546407, 548510, 562197, 596302, 633846, 661089, 671504, 689010, 723881, 743228, 748850, 731942, 696289, 646387, 598533, 586421, 590015, 591601, 602883, 613446, 634236, 697443, 751860, 743811, 692103, 652590, 651895, 663941, 671145, 655322, 599456, 531845, 489064, 465889, 429775, 397860, 383930, 402876, 441645, 484045, 484696, 434405, 391273, 368473]
17044C68473Q11K0877p622k8610l1577k4054j2998M61J1723K8951P0545P8862
17032D75842O1258K3526L6576O7959N9117J0651m3040n4478l9304j4781M505l759
17020E84072l4280m9391o0845m6197j0113J3339L8008Q4088R7639L8969k6239
17009F29050q3236p7958l4040J0932L9137M6895Q504n8622r9305r4828o5355m2741
16997A78433j3285m541j2457k4490j6668m690r116k491j2111j005N848j2529j1756
16984E9142p327m515K3984J1531j1941k833O566L777j2484L285K455l686l630
16971F4324J345R279L249J0553L711j3198r016L757j905K67K253q98j5882m381
16957E3458M623J3867N647j1928n419l310m649j91O912p149J962P187K974Q638
$$ y = [368473, 369284, 390161, 382539, 353929, 322352, 298298, 285300, 285761, 297484, 326435, 396980, 475842, 537100, 560626, 597202, 665161, 724278, 734929, 691889, 637411, 598107, 583326, 587831, 584072, 549792, 500401, 439556, 393359, 383246, 396585, 434593, 518681, 616320, 655289, 629050, 545814, 467856, 433816, 444748, 483885, 530780, 539284, 480662, 381357, 286529, 221174, 178433, 165148, 160607, 148150, 123660, 106992, 102302, 93186, 90695, 78584, 77579, 83427, 70898, 59142, 51815, 47300, 71284, 82815, 70874, 68041, 74607, 78384, 65900, 69185, 71640, 67954, 64324, 65669, 74948, 78197, 88750, 92461, 79263, 70247, 74004, 72099, 72366, 74619, 73721, 57839, 53458, 58081, 71948, 77595, 65667, 60248, 56938, 52289, 52098, 59010, 51861, 53823, 61010, 63984, 72622]
16943G2622Q843n474j6289j9480N464K92o461L456O933j790j2576J337k466J4466
16929D8877J2416j4200o940N731R293J186p012k046m745m016p94J118p948Q583
16915C9503N849L693j974n030o05N785j110m623J543k362l88R709O877O466m953
16900E8380j2112j2695L616J7875K940n693N702K211m367j569m05j927p106m03
16886D4447k453L966j964k4449m484P33R879J735K334M660q348J474o506o305
16872A4719Q541M847j513J4597J6324r708M462N970o620j1949q503P93q343q650
16858A4967j2547j057O491j091J704J1276J3672N569n444J997O349Q95m508K191
16844D0464k20k812p123q23O799N482k047k0967q027R781J8924J712M321m855
$$ y = [72622, 81465, 75991, 59702, 40222, 45686, 45978, 39517, 42973, 49906, 48116, 35540, 36877, 34411, 48877, 61293, 47093, 40153, 45884, 55177, 56363, 49351, 47305, 42560, 38544, 37750, 38868, 30920, 39503, 45352, 49045, 47071, 42041, 41436, 47221, 46111, 41488, 43031, 40669, 40281, 49990, 56867, 63333, 58380, 46268, 33573, 37189, 55064, 58004, 52311, 58013, 60224, 55857, 54288, 53883, 51956, 44850, 44447, 41994, 45960, 43996, 19547, 15063, 15796, 25675, 27410, 29744, 34404, 26056, 27530, 21024, 14719, 23260, 28107, 26594, 41191, 57515, 47807, 52269, 58239, 51619, 39670, 31167, 31960, 23617, 14967, 2420, 1363, 7854, 6763, 8467, 19743, 33415, 38984, 33540, 35537, 41886, 42781, 38273, 40464, 40244, 37432, 30309, 29486, 36285, 41767, 39720, 18753, 10726, 20507, 39431, 41143, 45464, 40609]
16830D0609k552O079k083l332o93j47l996p818l806j2726O402P572K503R352l274
16815C2090K804k473K935J382J0496M731N618j2243j0132P901J1175r606m953
16802C9725j78K287o795L816q872q663j726J2695K591K276o05M215j879M005L644
16787D6536l286p514L189M94q126M93Q912q978L805K531Q257L561m896M447q807
16772D0618n208R952r737J352o3q830J048Q112O255p354p141J8777R113p029j1699
16757C8166k289o182l665L410P51k106K836k930R280P786R04j6602j3502J9599
16743C5456J7075p598j9033j8341o857J5432Q382Q717J2626K995j157q35j0799
16730C6063K976l408l497O514L550r189j5835j8596k292l808j3520M039P936R350
$$ y = [40609, 38057, 44136, 42053, 38721, 38028, 37881, 33885, 26067, 22261, 9535, 15937, 23509, 26012, 35364, 32090, 34894, 32421, 35356, 36738, 47234, 51965, 57583, 45340, 35208, 43109, 54284, 44678, 39725, 39547, 41834, 35039, 38855, 29983, 21320, 19594, 32289, 34880, 37156, 36551, 40766, 38887, 42892, 46536, 43250, 35736, 38925, 39419, 31293, 31786, 40698, 31720, 35525, 38056, 46313, 49874, 44978, 49425, 40618, 35410, 45362, 35625, 36977, 36914, 28084, 29132, 37244, 43499, 36145, 29004, 47781, 56894, 49865, 38166, 35877, 29695, 26030, 29440, 30191, 28085, 30921, 27991, 37271, 45057, 45961, 29359, 15857, 35456, 52531, 44933, 25900, 7559, 702, 16134, 24516, 33233, 45859, 48854, 47697, 46862, 36063, 39039, 35631, 32134, 38648, 42198, 33009, 17174, -1422, -3714, -7522, -21042, -17003, -9067, 283]
16716B83J7247K0654P344p279j4002o003m048m269O507J1848q816o062J8659N460
16702C7523o803j762q929l661o760o211J2587P277m993L913P217j301l263M479
16688B9313l673l728p560m771l464m366K024R960M721j829P86K0516p445l216
16674B7268l791q95R212k038q022j1591j3666j558m83o095L525K450K1179K0256
16660C5751K0974K3115K993r572j9320j8801k842k2195j4959p845R559R313j945
16647D226k438J4652J2257J117j1600Q304R657N660j1073k1365J4501P269j0687
16634B0480M5N657l891l649M973M539o807J779P59j992O319K646n554K114K949
16619C0367j944l090K147o478p680m660R746O643J416k93n817N525j906j2813
$$ y = [283, 17530, 38184, 45528, 38249, 24247, 18244, 14196, 9927, 16434, 28282, 19466, 13404, 32063, 37523, 30720, 28958, 20029, 16368, 9608, 3397, 15984, 23261, 18268, 22181, 29398, 28097, 24834, 29313, 25640, 21912, 14352, 9581, 6117, 1751, 3775, 13735, 18456, 16627, 17413, 37929, 30484, 27268, 23477, 22582, 31794, 29756, 21734, 10143, -3523, -5081, -5564, -11659, -8134, -5684, 15495, 35751, 56725, 79840, 82833, 73261, 53941, 35140, 32298, 10103, -4856, -12701, -3142, 6171, 4226, 1788, 16440, 28697, 29814, 18214, 26518, 36175, 41835, 30762, 9397, 23898, 31167, 20480, 20525, 26182, 22291, 18642, 23615, 28154, 21347, 23126, 23885, 21893, 28212, 30858, 25304, 27418, 30367, 28423, 25333, 27480, 21002, 13322, 8662, 18408, 25051, 26467, 26174, 20357, 25882, 23976, 11163]
16605A1163l660r856K738Q412K550L714J8195n115j1543K952M142j0198k01O359
16591A9652k671m148q928n18J0123J2776M411L929j2700j8213N974q128p124P316
16577A751N626k455r738N553J1922O39l893M43j3357j0301j293Q867J4592k250
16563F106K361m018l883j1818Q509J2986J1349j0641j3673M510J9465j039j9434
16550G80r14M554O05M123J018r027n78o374O794J637J234M527p00m005L781r50
16534F505j908k48N992J0273p843n91l439n375Q197J775k82M578m933j3069K329
16519A961m8J2622N684l132n018R66J0312Q835M021J182o592j259J165Q907l413
16504C6193j0636n940N503q696j3036M335l664m197P122J1369K35j2842j0276
$$ y = [11163, 7503, -2353, 385, 8797, 11347, 15061, 33256, 28141, 16598, 19550, 23692, 13494, 13293, 19652, 16981, 12833, 3905, 3387, 13510, 26286, 30697, 34626, 21926, 3713, 9687, 1559, -5565, 1751, 7377, 4922, -4816, 737, 12659, 13298, 9405, 9848, -3509, -13810, -15103, -6236, 8356, 6106, 8467, 4449, 566, -11252, -2743, 10243, 21592, 10951, -2722, 1788, 21253, 20214, 780, -134, 4420, 5025, 9148, 10166, 1139, 561, -5813, 981, 2618, 3852, 8379, 7679, 3674, 7455, 6505, 4597, 4349, 10341, 20614, 12771, 12180, 8741, 3366, 11563, 13338, 13056, 17634, 12701, -368, 1961, 1913, 14535, 20219, 17087, 12069, 13035, 23347, 32182, 36203, 37385, 30793, 29534, 30699, 39606, 36193, 25557, 19617, 25120, 16424, 3388, 7723, 4059, -138, 6984, 18353, 18588, 5746, -4530]
16491d530L50K0922K1396L7j4270j3510P78J1808J315l422l120j2480O313J6085
16477B7672j3490J634J7327R085Q11j7334j9013l988J0737k191j959l772M572
16464A0091R973n149j1092m679J0921O150m293n998k816N407k84k130k588n421
16450a908m432M083M575P63J2086j78J221q599k563P377Q809K726j8527k3247
16436a7814P98J8445N364r226j2904L858j1551Q551p698r456J3895J5201J2129
16423I592k511L89L903N444m962K005Q82l974o264l155P959J6030l724k839J3431
16408C2206j0039j5671J2640M55q864q39m815r312m361K768J7499L407N363J6803
16394C7240q3j2875p861l823j0308k142m510q13N410P302N778j2523n751N239
$$ y = [-4530, -4180, 16742, 38138, 38175, 23905, 10395, 11173, 22981, 24296, 20874, 17754, 5274, 11587, 27672, 14182, 15816, 33143, 42228, 43039, 25705, 6692, 2704, 13441, 11250, 9291, 5519, 10091, 20064, 14915, 3823, -856, 10065, 16215, 11922, 5924, 3108, 8515, 8231, 6101, 3513, -1908, -6340, -2257, 2318, 3081, 15167, 14989, 16210, 7611, 5048, 12425, 21234, 23960, 5433, -17814, -17016, 1429, 6793, -2433, -15337, -11479, -23030, -14479, -22177, -31633, -17738, -2537, 9592, 7081, 7470, 11373, 16817, 11855, 13860, 14742, 10768, 4504, 1349, 9308, 25338, 21614, 18775, 32206, 22167, 6496, 19136, 19591, 10727, 9888, 5073, -4239, -8600, -5832, 11667, 15074, 20437, 37240, 37157, 24282, 16421, 12598, 2290, 148, -4362, -5175, 235, 7537, 13315, 792, -4959, 280]
16380B80R772P545J3054j264r607J99N067j708j6745j0463J8307J2281Q80k200
16366B5398r145K495P084L472p876j5441q3N169M520n618j8683q060J2155J7270
16352A2657j0596j1318J624L351K577O770L949QK236R578N878k579K79J0667m099
16337C0982q205n678p421j1367R644N581J446R603P806L390p706j1881l976J2384
16323B4602M32l336q785r56J2200J758m852j2716q663n478M31k727P060L79J2051
16308A1400J0680j489o212j4117J872R041k697J487l722k0103k069N117M899M301
16294a612o160k221j49m114L588P286J0771n8n195K449J211O384R13o90J1589
16279B3992r87q980j2354n419O36O238L153m248N968P576N627j106j0309K920
$$ y = [280, 10052, 17597, 30651, 29387, 19780, 19979, 25046, 23338, 6593, -3870, 14437, 26718, 27598, 25398, 16253, 18748, 25832, 29304, 21428, 5987, 5904, 11073, 15593, 9975, -8708, -16768, -4613, 12657, 2061, -9257, -7633, -4282, -1705, 5065, 9014, 9022, 11258, 20836, 26714, 24135, 24414, 35081, 30982, 22777, 17099, 9678, -1689, 7955, 13536, 14982, 24585, 32391, 35781, 28075, 16194, 12218, 24602, 25034, 21698, 12913, 11957, 24157, 25915, 21063, 8347, -316, -5794, -5363, -8090, -1030, -651, 11400, 22080, 20591, 14379, 262, 2134, 11175, 8478, 9965, 6243, -13860, -15929, -10812, -5913, -1612, -7772, -9993, -10142, -14256, -10668, -3382, 7389, 7331, 2136, 4585, 5796, 12180, 13093, 12403, 23992, 23005, 14025, 1671, -3748, -3112, 3126, 6279, 2031, 7999, 15575, 21202, 20096, 9787, 12707]
16265A2707N645j8043J833R881K009l874N184k598j1582J2427M743j028j0384
16252F920J726R554J6081q226q239p116k153j0507N704j941k804M540N27q65N044
16237H245J5200q322P802J2867m923j1885n450J0498J022n45j5982j0585o156
16224h214R883L418l460j0140k476J174J9441J3320J0092N249j5644o216m797
16211A1630p447K3253J4948j1784o357r813k170j239k188j786J583L085p188o044
16197a517J2642k782j1236l633j663L876K374r294m864J0288R265K601n702k287
16183a932J5014Q634J504j2319R119Q863j3401j849R325q086p572n040M692M071
16169A1023l590j0106j0072O755R298j473l579J0373j7122R882K0342p516q560
$$ y = [12707, 18352, 309, 2142, 12023, 14032, 10158, 15342, 12744, 1162, 13589, 18332, 17304, 6920, 8646, 18200, 34281, 26055, 17816, 10700, 8547, -1960, 3744, 1803, -1001, 3539, 4066, 3201, 8245, 23445, 15123, 22925, 35792, 30869, 18984, 13534, 24032, 25054, 24509, 8527, -2058, -8214, 1669, 5087, 1627, -8513, -10989, -9815, 9626, 22946, 33038, 38287, 22643, 16427, 11630, 4183, 27436, 42384, 30600, 24243, 14430, 12260, 11021, 8833, 7047, 8630, 11715, 4527, -1517, 11125, 8343, -2893, -6526, -8189, -4313, -1939, -11233, -16097, -5809, 3456, 6057, 355, -1932, 13082, 21716, 23220, 10901, 20020, 28883, 15482, 13633, 22958, 14872, 7300, 2260, 6952, 11023, 7433, -2673, -12745, -5990, 3308, 1835, -1744, 8629, -8493, 1389, 21731, 14215, 5655]
16156E655k1794n242R783j888o15J5125J7053P854m318k6232j4588R857K5760
16143A6410J2342K920K211p486o650r79k2844j1944j525J0610N690L892m641K21
16129a773N235J6125O173k610J577j0680l757J1829N768k0271k0855k711J0050
16116e900M252J6266M403r317N741M833K370n174p799n816l48k913j6308J932
16102a3778J1200K348L088j7987m405J4564N0N80J2029J0530k749j3452r535J2941
16088E424O278J726k878L607m037o03k696P502m443j0678K542j468j742L898m156
16073a724O33k705L705L802M206K024J1096l295j0276K47J2040j0448j1884n922
16059h501j215N771P975j571k128J4216o900L954P568K365j0466j7777j787L483
$$ y = [5655, -16139, -21381, -11598, -13486, -14101, 1024, 18077, 25931, 21613, -4619, -19207, -9350, 16410, 28752, 31672, 33883, 26397, 19747, 18768, -4076, -16020, -17545, -6935, -1245, 2647, -1994, -1773, 3462, 19587, 25760, 23150, 24727, 14047, 10290, 22119, 27887, 7616, -13239, -15950, -5900, -1648, 14618, 19021, 9704, 15445, 20278, 22648, 17474, 9675, 3859, 3511, 598, -15710, -13778, -2578, -230, 2858, -15129, -19534, -4970, -4920, -4340, 7689, 18219, 15470, 2018, -7517, 5424, 11702, 13428, 10550, 14157, 10120, 9517, 6821, 14323, 9880, -798, 1744, 276, -1466, 2432, -1724, -1091, -3796, -91, 3711, 7917, 9941, 21037, 17742, 7466, 7713, 19753, 9305, -2579, -8501, -9716, -3945, 4030, 2459, 331, 14547, 7647, 11601, 19169, 21534, 11068, -6709, -8496, -5013]
16045e013Q56K634J032N343R299L253j15j954j687L260j7282Q39k209K608K986
16030C850M629j5398j0611q471P306J5559K936l040J6231J5215j1752j1927K458
16017F985R0J220J6247k264j5312r37l239m799J43L24J170j2212l906P547P710
16002a233J2902k15j3808M345l129k139m357l333N085K552l466J5460Q814J258
15988A8736R387j851k4808j7432L086Q467O406J799N12J1375K617l766j6483k857
15974d812q54L5k178j934J88L807O291J5572L835j0512j4227l73K753Q989o751
15959a71q161K664R265L381K720l20M861l593o305R05M801R506n691p801m611
15944A450K016J0909O616j5662o703L610K960O545k506p868p540k409K289J2804
$$ y = [-5013, -4157, -1523, -491, 4852, 14151, 17404, 17289, 15335, 13648, 16908, -374, 465, -1744, 864, 3850, 8479, -6919, -17530, -26001, -18695, -3136, -200, -3240, 12991, 28206, 16454, 4527, 6985, 7075, 8295, 24542, 22278, 6966, 6029, 2790, -2009, -1866, -1542, -372, -12584, -16490, -8943, -1233, 11669, 11454, -2354, 1991, -1138, -3277, -7634, -10967, -5882, -3330, -6796, 8664, 17478, 18736, 28123, 26272, 1464, -15968, -12882, -4415, 1991, 3790, 4302, 15677, 18294, 14528, -1955, -4812, -5666, -5631, -7809, -9743, -9555, -5748, 543, 16115, 19950, 9438, -4789, -5162, -2409, 6580, -171, -8332, -5668, 3597, 6978, 9698, 9378, 14239, 10646, 4341, 5246, 10047, 19553, 13862, 6061, 1450, 3466, 14375, 20991, 5329, -1374, 2236, 5196, 11741, 9235, 1367, -6173, -8582, -6293, 6511]
15930F511L09J026k4225m357N272P080l099N145p149o113R275M055l03L252J8530
15915A5209k292q897j0366M119K508J08m112N85k401m811j993O364J3589O472
15901A4082j2651K414q085r216R63L979L722n054M850N417o136O25J5719j363
15887I266n957j0592m998N975O04o96J9322l535j7056j419R080O21l168M286M431
15872F164l86n988J1299M149L02l289R234n667k3843j3960r323P030J8823K221
15858c234N175J0778J047K281o734o394o894k810J030N673J489L47M85K57K05
15843B701P739K916O678n961j0689p348P841M117q171J009q287q817m158N636
15829a4794K708j3921j062J8628O447K93j199L227l717j5711k9k240K017R183
$$ y = [6511, 6820, 7846, -16379, -20736, -15464, -8384, -11483, -6338, -13487, -19600, -10325, -6270, -6573, -3321, 15209, 12917, 4020, -6346, -2227, 281, 389, -3723, -3138, -5539, -10350, -12343, -5979, 7610, 14082, 1431, 3845, -4240, -13456, -12493, -8514, -4792, -9846, -4996, 421, -5715, -5090, 10629, 9266, 3309, -7283, -12281, -6306, -5702, -6398, 12924, 9389, -7667, -9086, -6, 615, -2553, 1733, 6164, 5778, -210, 11089, 15238, 15540, 12251, 21485, 15818, -8025, -21985, -31308, -24278, -5455, -3234, 1941, 12719, 13766, 16047, 9313, 2919, -3975, -6785, -5755, -82, 1407, 1754, 2239, 2496, 2701, 10440, 13356, 20034, 14073, 3384, -3964, 3877, 7994, -177, 832, -7455, -16272, -20430, -14794, -12086, -26007, -27069, -8441, -1994, -1701, -2900, 327, -3390, -19101, -19130, -21370, -19353, -10170]
15815a0170J3607l520n751m992L245L927m491M465L288K161J188J572O686J675
15801A2890n227j1306l628J1800p548p859q652M102O308M856j080j7745m404J2500
15787a4993Q802R5O226k230K464p3q053j3516n48J376M732R605O603j2274M766
15772g018j909K870R118m799M003O577k320K453n765N828L878j790O278o535r626
15757A243j32Q337P986M720p558Q669M738j6134m1M166R463k965j2478m525N694
15742A1183p310j3749p09M399O81K576O814L350r795n427k173m314J1152J5512
15728A2190L438J994q794q6N758n802l739j0328M751L026r159m404L779J742O351
15713G17J2000O214K733N070K250j3776r676n395J1571J1900n753j530K0204K760
$$ y = [-10170, 3437, -83, -5834, -10826, -7581, -3654, -8145, -3680, -392, 1769, 2957, 4529, 11215, 12890, 7663, -3643, -7271, 4529, -3019, -10878, -19530, -15428, -9120, -4264, -5344, -23089, -27493, -14993, -6191, -6096, 130, -2100, 364, 291, -7762, -21278, -21826, -20450, -15718, -6113, 490, -11784, -7018, -8927, -6057, 3061, -1738, 2265, 8842, 6522, 8975, 3210, 9038, 12916, 11126, 17404, 10869, 1243, 1111, 9448, 17434, 22154, 14596, 23265, 28003, 11869, 11828, 15994, 25457, 22492, 10014, 5489, 11183, 3873, -9876, -10585, -6186, -5505, -2929, 3885, 7235, -2560, -7987, -10160, -14474, -3322, 12190, 15628, 17622, 8828, 8742, 14500, 8698, 4959, -5369, -618, 2408, -6751, -11155, -7376, -5634, 717, 12717, 18931, 21664, 26734, 28984, 15208, 5532, 137, 11708, 23608, 17855, 16325, 36529, 39289]
15699C9289j8012j8836J796o049M084q163k662n33k065O250n062L528M726L540
15685A831J4352k838j2441q531p371N012n09r597R661l631N536Q475L958O818
15671A0725m990r540L448n755l652L654J3279O697n688r195o464n840O347M971
15657b003n157K059m309K539N505q024j657o518n313J2898L636k923R090K11M075
15642D109r815N906m281Q768m797M085M377k35n423q163K865P171q44Q523j0752
15627A494p455J3826M972j0467M833O787j849n761p139p837p057Q534O721j603
15613b001j7257L547j429k554J2942J0339Q888K804l9p368R5p04m223n433r153
15598a1546K971O444O091J7300N43l524P414N675r13l129k222O027j3102j0617
$$ y = [39289, 21277, 2441, 4237, -1812, 2272, -5891, -8553, -9086, -11151, -4901, -9963, -6435, -1709, 1831, 16183, 13345, 904, -7627, -14998, -9986, -10495, -20092, -10431, -14062, -8526, -51, 3907, 10725, 5735, -3805, -357, -6112, -9764, -6110, 7169, 13866, 8178, -1017, -7481, -13321, -6974, -2003, -7160, -5101, -9410, -6871, -1366, -9390, -11047, -17565, -22878, -9980, -6344, -9267, -177, 34, 4109, -5706, 200, -4081, 4687, -110, 3975, 8352, 8117, 2694, -5469, -2604, 4567, 3723, 12246, 1494, -5961, 7865, 12837, 2370, 7203, 13990, 12141, 6380, -759, -8596, -15653, -7119, -398, -2001, -19258, -15711, -17140, -19694, -6752, 3587, 12475, 15279, 15240, 7872, 7967, 7263, 3040, -2393, -11546, -8575, -2131, 3960, 21260, 21803, 18279, 25693, 31368, 30455, 27326, 25104, 31131, 18029, 7412]
15584G412k347J693j2295J804N888m670r57j0240j877J2657Q774P225o228J238
15570H077M815n837j4705j0738o153J0365P070J3373N707m455M300n751j2976
15557f908r666J123Q789N502L476M234j833m337L249j993l007j689l88n163o307
15542a4918J1720M010l080P446L485j4361l427q219N15M116m051P233P878m16
15528b069o698q585l331j1721m326J0757o4N900J0214J751j884q162J417l052
15514a9853Q312R566M936n882n356K378o517m552Q014r136j23J0388J1046n577
15500b356q220j1613M818K203N812j131K03J2665Q874j0552l248O887P523J921
15486A3786J393r635p595n856J1369o087o374r987L885l876j1235N148K5346M472
$$ y = [7412, 5065, 6758, -5537, -3733, 2155, -2515, -3472, -13712, -15589, -2932, 5842, 13067, 6839, 8077, 12892, 7055, -7650, -18388, -24541, -14176, -7106, 6267, 11974, 7519, 11819, 6068, -6908, -16574, -15451, -6662, -1160, 2316, 6550, 4717, 380, 3629, 1636, -1371, -3060, -3448, -8611, -14918, -3198, 812, -2268, 5178, 8663, -5698, -9125, -17344, -16829, -12713, -16764, -9531, -1653, -2069, -8767, -17352, -20683, -32404, -36730, -25973, -26037, -20137, -9923, -8172, -10056, -18218, -16801, -19853, -11541, -1975, 2961, -2921, -8277, -5899, -12416, -16968, -8954, -18090, -18213, -7825, 3221, -2356, -10576, -22189, -17371, -15168, -9356, -10487, -10284, 2381, 11255, 703, -2545, 4342, 11865, 13786, 15179, 5544, -2051, -7907, 3462, -2625, -8999, -18986, -15101, -18977, -30212, -25064, 282, 4754]
15472D754q557n837L554Q477j524k465r986L846N852j136J2090j1545L521L769
15458D813O466j5960j2961M182k121j4613O057R004k415O863J2328J714M276O84
15444H317m179P480m30j0620j2238l254K414K936M477Q681M128L755M716K166
15430A8349l466P204m112j1494m155n000L909k195L753j440J914N422m128M391
15416H952k4j5260J45R917k072p066l767R450P502r536m113j3607p323O702l224
15401b3324O869R697L796j254L967r895j8033J5859R224j530J763R608L874j2527
15387a906j4498j923M411J1598O542P268j1255j8629j266N391p85O587M589j1626
15373a5502L688M483k264r085m93K822j0715K007Q194j475k900J9890m895r267
$$ y = [4754, -3803, -9640, -6086, 2391, 867, -1598, -11584, -7738, -1886, -3022, 9068, -2477, 1044, 4813, 11279, -4681, -17642, -13460, -15581, -30194, -24137, -15133, -17548, -10685, 1643, 3357, 7633, 8317, 4138, 11618, 11188, 568, -11670, -14924, -12510, -9574, -5097, 3584, 7712, 11467, 16183, 18349, 14883, 22087, 17975, 6481, 2326, -2674, 1235, -960, 2793, 1353, 3267, 8689, 4561, 8952, 8928, -6332, -6187, 3730, 1658, -5408, -9175, 275, 7777, -1759, -5872, -19479, -26802, -20100, -23324, -16455, -6758, -2962, -4216, -249, -10144, -28177, -12318, -3094, -4624, -2861, 6747, 10621, -1906, -16404, -18327, -13916, -2318, 4224, 11492, 237, -18392, -19658, -14267, -15052, -8465, -3876, -15502, -11814, -7331, -9595, -18680, -19173, -16351, -27066, -25059, -16865, -18340, -21240, -1350, -6245, -15512]
15359a5512q922k118P979J2574J2889P990j962o932M754j938L31J104p987j9250
15345a7000p692N312L926j244M891p445K4J0365K253R06J756k789P724J0864j1126
15330G25j6279O204q349j1769K80K1389M540o186J409J3083P61J87j8396p254
15316a9655o32P95o3r776m509K1597O275M841Q716J4214L758m544m951M174m220
15301A6020o742j33j679K310j841k515j0980J689o567j037J1359L538K693K455
15287H570j345J2694K029j4761j0755j6603m411J7324r6k362L941J125K977j1047
15273a2720k393j509J1859N937o091Q184l515K384O943L130n097K79k625j5030
15259a0264K736k344j136j4302R132J6104J344j0942j697N312j741L404N319p807
$$ y = [-15512, -24434, -26552, -18573, -5999, 6890, 14880, 12918, 5986, 10740, 8802, 9133, 10237, 2250, -17000, -24692, -19380, -15454, -16698, -11807, -19252, -19228, -8863, -6610, -5704, -3948, -6737, 987, 11851, 725, -15554, -9350, -17699, -29468, -29188, -7799, -3259, -9445, -8036, 5047, 5808, 5995, -12401, -19655, -20287, -19492, -19555, -29331, -33840, -12243, -5968, -1127, 7589, 21803, 25561, 21017, 16066, 20240, 16020, 9278, 9145, 7466, 9776, 7935, 5420, -5560, -3871, -10438, -11475, -116, 3422, 6115, 8570, 7225, 19919, 21948, 7187, -3568, -20171, -24582, -7258, -7354, -9716, -5775, -4650, -1673, -12720, -15113, -16622, -4763, 1174, -4917, 3267, -248, 2136, 9079, 12209, 7112, 7391, 4766, -10264, -7528, -9872, -11008, -25310, -16178, -74, 1270, -9672, -11369, -6057, -7798, -4394, 925, -6882]
15245f882M241J39r518n714p981q550O323J1571P907P455N694N608n250j4325
15231i282j0283L517J795O967q386j184K333P026J3090M913l00l640n752p877
15217g063p915n745n166j029N214R54N003l966J0288j306n701l811J5342K1908
15203A7007N891k746r491p043J0022n978q463M646l183l536L036O280L640l156
15189F926n178L312J5967J0475n548j0181R53j5081j0995k930N007m123M058O024
15175a314J0249r53j0775r701o753j2067R530J3121l3m345o634L459K092Q887
15161e237J2682M67l052j3827m423R476K252m640m543J0149R596k576j3002j028
15147g706m616N798l259q250j0832Q214J1523k332k056p322O174Q775p835p739
$$ y = [-6882, -2641, -2502, -12020, -17734, -25715, -34265, -27942, -16371, -8464, -1009, 4685, 10293, 5043, -9282, -19565, -16048, -14253, -7286, -15672, -16856, -14523, -7497, 5593, 10506, 10206, 6566, 814, -7063, -14978, -20723, -25889, -26918, -21704, -20750, -15747, -19713, -9425, -10731, -16432, -20243, -4901, 17007, 22898, 20152, 10661, 3618, 13640, 7662, -801, 3845, 662, -2874, 162, 6442, 10082, 6926, 1748, 5060, 21027, 31502, 25954, 15773, 16726, 1645, -9350, -12280, -7273, -11396, -7338, -1314, 8935, 7982, -2793, -12494, -19247, -31314, -21784, -8663, -8696, -13041, -19675, -16216, -14124, -5237, 7445, 7912, 4860, -8967, -13390, -3914, -1662, -6302, -10845, -696, 8900, 6324, -6678, -7706, -12322, -6524, -9783, -18033, -28865, -20651, -9128, -11460, -13516, -20838, -14664, -5889, -13724, -21463]
15133b1463m909M771k270R353L832J1673Q185m721K672K016j6602j0417L464o08
15119a5024M759n03M823p671P85j0048m446j838n689J3964k290K551J5128j092
15105f591p208j5719K854q078k506J0216O707O187Q747K70k445O71L54J0638R28
15090E025r33j1413q946p71L242o667O626j088q657P796L898J446P857k124q377
15075a3086K292Q41k860Q138p419j3500K870J2688R894M889q473m680l22j0989
15061a9717P666J3975L782n345j2110j0413m392J1791o376n195N615R310J2754
15048A345l956L372n572J224K6147K076n340j2699q139R712J1439R01n066r902
15034E542k4997n513R64J3476L0q430J964N035q470n587r937R10R447l126o849
$$ y = [-21463, -26372, -21601, -23871, -14518, -10686, 987, 9172, 4451, 7123, 9139, -7463, -17880, -14416, -15024, -10265, -10768, -5945, -13616, -12831, -22879, -27325, -29163, -34852, -20888, -23178, -20627, -5499, -6591, -13799, -29518, -26664, -34742, -37248, -27032, -20325, -14138, -5391, -5121, -7566, -6895, -6541, 4097, 5025, 4092, -7321, -16267, -17038, -13796, -20463, -13837, -14925, -23582, -15786, -11888, -10442, -2585, -4709, -13086, -10794, -9953, -12813, -4675, -12094, -25594, -22724, -10036, -142, 4747, -3726, -8406, -8728, -19717, -12051, 1924, 5706, 361, -11749, -22162, -26554, -14763, -21139, -26334, -20719, -11409, 1345, -2611, 761, -4811, -3587, 22560, 24636, 19296, 6597, -1542, 8170, 19609, 20510, 15444, 5542, -19455, -24968, -24004, -10528, -10498, -18928, -16964, -11929, -20399, -25986, -35923, -35013, -25566, -28692, -35541]
15019c5541k629J3790l659j3882r72J3298P739l269O565K6355J0357j0079k234
15006E839Q236j333n502k3168j3491o771L95L195O485l331j386J574M494N055
14992a9709p427M811P61l41L043m08r433J09k733j0108K057K038J1024O836n774
14977b5254o699p00M878J5812m585N888p234r588P292K80P054O708K071J07K347
14962a623m829k956m229J0621R015K417L573j804q600K885L850J728j005K672
14948A1715m656J232r454q892n750o564q23O275j0841J0549N058m100j1388j857
14934b9496k780M813r1k367L525J897R576M486J6255K848p019j081j1094l275
14920a3803k415M301K1415M474j0594N065L497M552k31j3470k036N062K705p118
$$ y = [-35541, -38170, -24380, -28039, -41921, -42893, -29595, -21856, -25125, -18560, 7795, 18152, 8073, 5839, 14075, 12742, 7240, -15928, -29419, -36190, -35795, -32600, -26115, -29446, -30832, -29258, -24764, -19709, -27136, -22325, -21564, -21905, -18862, -19270, -28703, -28594, -31327, -41435, -39378, -37340, -26316, -19480, -25254, -31953, -32653, -27775, -11963, -16548, -10660, -17894, -27482, -20190, -19910, -12856, -6148, -4077, -3970, -1623, -6452, -9408, -13637, -3016, 5999, 8416, 11989, 10185, 1585, 4470, 8320, 10048, 9043, 11715, 7059, 8291, -1163, -10055, -15805, -22369, -23192, -16917, -27758, -17209, -12151, -16251, -27639, -29496, -32276, -27463, -27554, -29921, -26396, -24499, -14923, -10437, 5818, 8666, 1647, 566, -10528, -13803, -16218, -11917, 9498, 13972, 3378, 8443, 11940, 16492, 16261, 2791, 755, 5817, 8522, 1404]
14906A404j29K798Q311n738j1647O61l348n299q264K457Q741J1960J2864n254
14892I517o78j6608R86k934j2008k889m945r289O701J6962J137R295J1882L651
14878A0780j723p31j0992j1704j4030j445J0761L505O545o02j852N174M668p677
14864i323J1831k358k743N81n011P426K119O725K688k237J0885M194j4201J63
14850A0739p698p9K773q630K020M397K246L72J1440j5231j3258j671N37j081k81
14835a3405n260P695P061r239o278N115j2390j139J336K250L343L877K876J0793
14821c365N17J188n071j2623r725J9407P954L095J381P286K751r993n927j1575
14807a4700l552L127L383P809L498q476p23l674j1090Q954K4298L0344k553m943
$$ y = [1404, 1275, 4073, 12384, 6646, -5001, -4340, -7688, -12987, -21251, -18794, -10053, 1907, 14771, 9517, 8839, -7769, -6783, -9717, -21725, -24614, -29559, -38848, -32147, -15185, -14048, -4753, 7129, 10780, 9057, 8326, -2666, -14370, -28400, -29845, -19084, -15579, -9034, -9636, -11488, -6314, -1646, -9323, 2508, 150, -2593, -2012, -7023, 403, 2522, 9247, 11935, 9698, 20583, 24777, 10576, 10739, 3041, 2962, 5735, -2895, -875, 3522, 5768, 6140, 17580, 2349, -10909, -12580, -12043, -13124, -13405, -18665, -10970, -3909, -13148, -19426, -14311, -26701, -27840, -26504, -24254, -20911, -17034, -14158, -3365, -2848, -1660, -6731, -19354, -29079, -9672, -1718, 1377, 2758, 10044, 12795, 2802, -3125, -14700, -18252, -15125, -11742, -3933, -435, -8911, -9634, -13308, -24398, -15444, 8854, 39198, 36645, 31702]
14793C1702l536l015j9887m103O651Q778l069j0297l28n540j6401l147R595R252
14779c345q561n428J2572R283J735j957l011L942N092K739j5597k246n985Q298
14765b469M271n330Q484j480K351p880O599J0060o454j4009j2681n608K969J8970
14751b207O415j566L485J2628M093k477j114n892j3911r186j2696J901M609L731
14737a2187K756j343J275J1651R645j456o214L121N846j395j008p187J0563m815
14723I252r436L506q323o321l372l509N835J4203J0093o910j9038J00l630N097
14709a2453N452N53Q922r13r79P089O016p314o392M963J315j2705q422K063J1067
14694a738J1936J3424l137k3239J187j1289j0538K341J548L651R691J0569J6003
$$ y = [31702, 28166, 25151, 5264, 1161, 7812, 16590, 13521, 3224, 2896, -2644, -19045, -22192, -12597, -3345, -11906, -17334, -4762, 4521, 6256, 4299, 1288, 5230, 10322, 13061, -2536, -4782, -10767, -2469, 1802, -3528, 4956, 3476, 5827, -2053, 4546, 14606, 8152, -5857, -18538, -24146, -21177, -2207, 4208, 2642, 6127, 18755, 22848, 20371, 19257, 13365, -546, -9732, -22428, -20527, -15918, -12187, -9431, -10774, -9499, 2152, 11797, 10341, 4127, 7248, 13094, 11699, 10691, 3504, 14067, 9252, -184, 3322, -5001, -11322, -14694, -18203, -12368, 1835, 11928, 5018, -14020, -13920, -17550, -12453, -7001, -6448, 2474, 1561, 582, 7671, 13687, 6373, -19, 4944, 6259, -6446, -14868, -12805, -1738, 10198, 23622, 20485, -2754, -1567, -12856, -23394, -21053, -19505, -15854, -6163, 4406, 20409]
14681B0409P354o934l49q420j2046j2848p041R872R900k486o712O669r358k547
14667a4537N254O536n897J19o159p027J289p951Q800K3478r505K988O619J016
14653E023l266m716K844K304M127R760J0530n108k0198k639O584p4j1756k301
14639h886J8169J72j1036p793J972n39p481p951m84Q969N834P520P68r570j3188
14624b3524R803J4226O452j9025p862P586j32J177l577p553N429m405j0237J109
14610c0533L396o213m562j853J4090J3493o062k910J3789N36n981o668k447m978
14596b6903J816J823J812J1584J1203j3497k584J3212l39R28M244j2709o933O599
14582i744L645p483M435M844q784j6545Q071R223q777N836P406J755L737k631
$$ y = [20409, 27763, 20829, 20480, 12060, 14, -12834, -19875, -10003, -103, -2589, -9301, -2632, -11990, -14537, -9283, -2747, -8644, -8525, -14684, -21711, -20422, -28373, -19573, 3905, -5600, -2612, 4007, 5023, 1757, -2959, -115, 2189, 6316, 16076, 26606, 21498, 1300, -1339, 5245, 5171, -6585, -8886, 9283, 9455, -1581, -9374, -7402, -7941, -15422, -23373, -23857, -14888, -9054, -1534, -766, -10336, -23524, -13721, 505, 6957, -12068, -19930, -12344, -12476, -11299, -14876, -22429, -17000, -21405, -31642, -30533, -27137, -33350, -37912, -39765, -25675, -12182, -18244, -21154, -7365, -6829, -12810, -19478, -21925, -26903, -25087, -23264, -21452, -9868, 1335, -12162, -14746, -1534, -1873, -945, 3299, -9410, -16343, -9744, -6099, -13582, -9147, -4303, -13087, -29632, -21561, -12338, -21115, -15279, -7873, -6118, -2381, -5012]
14568e012q233m289O777L835q940n596M777N908M241J234l536N568J0503J0215
14554A7452j8128p130O344Q98J186L254N735j7728j6541Q911n367k9K944q986
14540b7185j55R709k151m392k906R443Q195o479j170N782p628L638O339M655l051
14525g356J841M309p285p999o479l598J2056O990J445p786r75l275n547L086J1419
14510i154N649P793l36n799n600R020n44n353P545L007j0767m973Q760J2931L230
14495A5409m436j9075j4035P018J3656Q68l811j770K270q317k616k916L735J8366
14481D346M46n12q944k955l437l139P252L620r023l229q49o325l933J3339J1341
14466b002k938r14j3141M891J348j0077j0115J731R502J701L400j686J479J3503
$$ y = [-5012, -13245, -17534, -10757, -6922, -15862, -21458, -16681, -10773, -6532, -5298, -8834, -3266, 7237, 17452, -676, -7806, -1462, -564, 622, 3876, 9611, -8117, -24658, -15747, -21114, -21143, -18199, -27185, -27340, -17631, -19782, -24174, -27080, -17637, -9442, -15921, -17091, -11309, -18937, -15299, -8960, -4305, -7356, -5515, -1206, -8491, -16490, -22969, -26567, -14511, -7521, -6076, -13862, -14837, -18112, -23659, -20573, -9154, -3505, 4288, 3952, -1847, -7447, 1573, 1029, -4324, 3221, 6228, -4539, -9512, -752, 12179, 15409, 10973, -8102, -22137, -15119, -1463, -595, -4406, -6176, -3906, -12223, -14839, -17755, -14020, 4346, 4792, 4280, -4664, -7619, -11056, -14195, -6943, -3323, -12346, -15575, -16424, -22749, -26682, -13343, -2002, -4940, -5854, -18995, -14104, -12756, -22833, -32948, -31217, -21715, -20014, -16614, -18300, -16821, -3318]
14452c318q654K067N735L182M869m683j3151Q414J2974l21j9602j6632N977J2663
14438a0480J2162J694M221q11o051j0719j0322K639J1112O233j304l5m209L252
14424b618P385o902K123j1967m797J5040K915j161n353j1265L306j962N627J2430
14410B801n216j0244K675L501M723J150k149L553L13k967K372J708o706L295p334
14395h525q121j5841K756N129O669Q977J1210j0180k477P558L084r981R377p996
14381h361L44R671O993p805k009r293N796J2186K210q495j6361p088o080P095
14367b1197q649l662Q754M845k023Q88J7627K4914J2827P751j4638r608j5396
14354B433R81p57l120j2744Q581K882j3712l822R808l326l861K485J442n384p085
$$ y = [-3318, -11972, -9905, -4170, -988, 3881, -802, -13953, -5539, 7435, 7114, -12488, -29120, -23143, -10480, 1682, 3376, 7597, 6786, 735, -9984, -20306, -17667, -6555, -322, -1626, -1661, -5870, -2618, 4767, -2135, -12, -11979, -16776, -1736, 1179, 18, -5335, -16600, -13294, -15256, -9629, 2801, -2415, -12659, -9984, -6483, -1760, -610, -2759, 794, 1107, -1860, 512, 2220, -4486, -1191, -8525, -16646, -32487, -29731, -24602, -17933, -8956, 2254, -7926, -10403, -2845, 239, -9742, -365, -8361, -8017, 1654, 8647, 842, -1167, -10460, -4664, 7522, 9732, 1237, -15124, -22212, -28292, -21197, -29846, -33508, -24754, -19909, -21932, -21044, -3417, 21497, 34324, 42075, 27437, 17829, 2433, 3414, 2657, -463, -13207, -4626, -1744, -15456, -19278, -9470, -12796, -16657, -14172, -12730, -18114, -25199]
14339b5199R208J131K672j841L209j2264L867m77p883Q090K8179K0710J4717J0544
14325E4663J8508K409k5455l2438l315o919j1823q049j0508L889O104J068p877
14312a9743j3599n554J07L106J0643r21l359P514R000m995j4681j634J7932J6154
14298c0j856n838J6636K4263J7873R173q804jl290j5974j3077j5639k1868j877
14284b0309J3436R329J0905n207n763o37j2961M413O709p164k180N496j380J0099
14270D786R590o239j4389j069L241J2737N746j3864o209o150R763L126k0446p228
14256b6605N44J6527K478o378m53L093q427k755r11J3694J7155q312l059m31j3822
14241a7662m871k297K230K686J1138j111o258N970J0143M515j0635j2234m074
$$ y = [-25199, -15991, -14860, -12188, -14029, -10820, -23084, -19217, -19694, -27577, -19487, 8692, 29402, 44119, 54663, 73171, 75580, 50125, 17687, 14372, 7453, -4370, -12419, -22927, -19038, -12934, -11866, -19743, -33342, -38896, -38789, -35683, -25040, -25961, -29320, -21806, -12806, -17801, -32482, -34116, -16184, -30, -1886, -7724, 8912, 33175, 51048, 60221, 51417, 51416, 48126, 32152, 19075, 3436, -18432, -20309, -6873, 2456, 13361, 8154, 2391, 1754, -11207, -6794, -85, -7249, -9429, -3933, -5313, 4786, 14376, 8137, -6252, -7321, -4080, 8657, 14403, 539, -5670, -11820, -2057, 1069, -19377, -26605, -26061, -9534, -7056, -13434, -13887, -10794, -19221, -21976, -22887, -9193, 7962, -350, -3409, -3840, -17662, -22533, -24830, -22600, -19914, -8776, -9887, -16145, -10175, -32, 4483, -6152, -18386, -22460]
14228b2460j75M642m31M342P609m058q659k006O072J560J2252O680J3609N317
14214B4294k3420j4466r487K254Q048p900j047K572K385O927n03J3843j1366m600
14200a2466Q733M144J125o525k035K146o890J351Q922j3917R449l641p112K788
14186a3928R29j2427p838J5839k14M381K0699L780k990j265N40o445N810j108
14172E763j4401O942R863j4117M170L898P986k80j419j3409O633j501j832P95
14158i09l98J618P974M56j0150j9204k293N390R349P860j322M155J695l514L238
14143C945N835j488o28n206n940N404O370n890j7592k145N335M776K7j814n749
14128a4760J1968J5200n89n239J596q743j813L935O287p384O721Q364m886q81
$$ y = [-22460, -22635, -17993, -18424, -14082, -6473, -10531, -19190, -21196, -15124, -13564, -1312, 5368, 18977, 24294, 874, -13592, -23079, -20825, -12777, -20677, -21724, -19152, -16767, -9840, -10343, 3500, -7866, -12466, -3733, 411, 1536, -4989, -7024, -4878, -11768, -10417, -1495, -15412, -5963, -9604, -16716, -13928, -12999, -25426, -33264, -17425, -17639, -13258, 7441, 11221, 8231, 6966, 7506, 1061, 6871, 5763, -8638, -1696, 8167, -5950, -1780, 2118, 10104, 9824, 8405, -5004, 1629, 128, -1704, -909, -1307, 311, 8285, 8741, -1409, -20613, -22906, -17516, -8167, -307, -1629, 2526, 4221, 707, 3945, 9780, 8292, 7664, 2458, -3482, 1922, 8292, 2402, -15190, -17335, -12000, -7224, -7197, -9011, -14760, -2792, 12408, 11819, 6580, 8176, -567, -2380, 1555, 7842, 458, 7179, 15543, 10657, 9776]
14114I776q143J906q038m514L60k273L171M079J1856J683n585q724k57j513j6704
14099b2920p38P040j2249n173N973J8866M183l142j3691k156J1423K528P122R82
14085a952j3471l572p128j1701L654K3272M483k449j88M973m208J512n737L09
14071a2203R366M096M475J0569J1081j284L032m314j1416j7702r328P812L093
14058b723n661M517j1641n867N849L747o972l58R314M452O222J1778J4084L22
14044B7063j7224j6593j081K284O077Q621N827o385J655o627o881P39O049o358
14030b834M147Q901j213K959J734j963J1633J3878J2070J8527R874N938n81Q98
14016H3968J3440J1382J8272N566o556J088j3804j4475j371K120n462j9022j0687
$$ y = [9776, 1633, 3539, -4499, -9013, -8653, -10926, -7755, -3676, 8180, 9863, 4278, -4446, -4703, -6216, -22920, -23658, -16618, -28867, -34040, -28067, -9201, -5018, -8160, -21851, -24007, -12584, -10056, -2934, -1952, -15423, -18995, -26123, -37824, -34170, -10898, -6415, -8864, -9052, -4079, -8287, -6775, -12512, -12203, -2837, 1259, 5734, 16303, 27384, 26100, 29132, 24818, 13402, -4300, -13628, -5816, -2723, -8384, -3867, -15508, -21375, -15526, -11779, -18751, -19109, -9795, -5343, 879, 12657, 26741, 27063, 9839, -6754, -7835, -5551, 526, 9147, 14974, 8589, 10244, 3617, -3264, -2525, 3524, -2834, 1313, 10214, 9001, 11960, 13694, 11731, 23364, 37242, 49312, 67839, 77713, 83651, 83070, 83968, 97408, 108790, 127062, 132628, 126072, 127160, 113356, 98881, 97510, 99630, 94168, 75146, 64459]
14003F4459j5086l364J7183J7140R32J0754O096J0785l147l212R827J7877J8758
13990A49002J5747o319k6066k4714j222j2360j6308m39j032j1540k4337j5380
13978B5032K263P19Q574M440j3119n98m656j0086r480o53M299J8732m048k538
13964A8881q441j4785j5213Q468J2832j2686J933K151L749n488R402J2021r99
13951A1825p644J405Q934k833n986p773l964q614L858M855j0550Q37L314Q564
13937c772r404r363J6340J6475o812j5724N662k05J5547J0965j0559j2943j2266
13924a6059j2259O905j072R21J0319K0151N554m472M381J037Q367O052k830l46
13910B6649P71j1511q135n146n400m094P330J906P39k8r011O200N922q160j5367
$$ y = [64459, 49373, 46009, 63192, 80332, 81264, 92018, 98114, 108899, 105752, 102540, 112367, 130244, 149002, 164749, 158430, 132364, 107650, 106428, 94068, 77760, 77321, 76289, 64749, 40412, 25032, 27295, 28014, 36588, 41028, 27909, 27311, 22655, 12569, 3089, 2436, 6735, 25467, 21419, 18881, 10440, -4345, -19558, -11090, 1742, -10944, -9011, -6860, -3111, -8599, 803, 12824, 11825, 4181, 5586, 14520, 11687, 5701, -2072, -6036, -14650, -10792, -5937, -16487, -15650, -12336, -3772, -13176, -22539, -6199, 10276, 3464, -12260, -6598, -6803, 8744, 19709, 9150, -3793, -16059, -28318, -21413, -22485, -21564, -11245, 8906, 14460, 9988, 14369, 15406, 23773, 29825, 26995, 26649, 27420, 15909, 7774, 2628, -2772, -6866, 464, 2370, 3109, 3081, -5930, 270, 6192, -1968, -17335]
13895a7335n625l288R434O536o313L980M380R080l355p650j0297J829k730j913
13881b3267J4452M178J296o249j0216l492J608r566o640J8937l4o845L704O778
13867a5356L887n537l766J6836Q038P776k287j4167j138P132n095p235l955J931
13853a2936R024j210R751O524j1882j0761j478j2365M374O434Q861k494P679n647
13839f126o392m107J835l532j544O553L914O403L840N049K617j0535j3564j818
13825a7407J5366N637j1688l712m148r185k707p46Q862J3556P623n726J864L813
13811A402o891l593L499O406j1085m379J8382m5q273j6839R40Q062J0368p381
13797i427k2482j1311l529m586J5279J0742J093k700N40r107k888J0237J4852
$$ y = [-17335, -22960, -26248, -16814, -10278, -16591, -12611, -8231, 849, -2506, -10156, -20453, -18624, -21354, -23267, -8815, -4637, -3341, -9590, -19806, -23298, -21690, -31256, -37896, -18959, -18993, -25838, -22134, -15356, -11469, -17006, -20772, -3936, 4102, 11878, 9591, -4576, -5714, 1418, -3677, -10912, -14867, -12936, -3912, -5122, 4629, 11153, -729, -11490, -12968, -25333, -20959, -14525, -5664, -8158, -479, -6126, -12518, -16625, -14790, -18322, -19866, -13313, -9399, -2996, 844, 5893, 8510, -2025, -15589, -17407, -2041, 3596, -8092, -11804, -15952, -25137, -27844, -28590, -19728, -6172, 1451, -4275, -2411, 1402, -5489, -9082, -5583, 823, -10262, -14641, 3741, 3696, -4577, -21416, -20476, -12414, -2046, -9427, -31909, -43220, -46749, -51335, -36056, -25314, -24221, -26921, -26381, -35488, -38376, -28139, -13287]
13784a3287N037k448k329M179r39R914J3414J292k401j0243q893j1002O413Q26
13770a0467J1j0940j3240L321P882O130J7389J2398N791J78p93N974k0773j9608
13756a6747p965J3197M585p131q997J8967J3147j908k147j0409L418l539J945
13743c584L47p185R18L713J0120P57M479m453j6215k065p216O155k503N8M248
13728a2426M062L118R587m661j4687j3896o426J0508K0293K500o769k520j0412
13715b1729N01k937O29j2745J4995P645N912K092L575m230l848l299P092k190
13701h537p952r690N99m701Q594N303N241L094J7804q658p291J590M620M15m043
13686c612M057j108r755j2711o984Q475Q78L561Q024p08Q699Q224l599l581k127
$$ y = [-13287, -8250, -10698, -13027, -8848, -9787, 127, 13541, 14833, 12432, 2189, -6704, -17706, -11293, -10467, -10456, -21396, -34636, -31315, -23433, -17303, 86, 12484, 18275, 18453, 17660, 23634, 2861, -16747, -24712, -11515, -6930, -14061, -23058, -4091, 9056, 7148, 5001, -5408, -1990, -5529, -3584, -3237, -10422, -9504, -5791, 4329, 5086, 9565, 5112, -11103, -13168, -20384, -14229, -16732, -16674, -12426, -8364, -5246, 4341, -320, -15007, -28903, -35329, -24821, -4528, -2028, -8797, -11317, -21729, -21228, -24165, -23536, -36281, -21286, -13641, -7729, -5637, -2062, -6292, -10140, -13439, -6347, -8537, -16489, -26179, -25580, -30281, -21687, -16384, -11143, -8049, 9755, 1097, -6194, -4604, 16, 431, -3612, 445, -663, -10418, -23129, -30113, -21638, -20760, -17199, -9175, -9883, -1184, 7040, 3441, -140, -2267]
13671b267o983n510o982O786J4953J302n82k391L214m244m080n910J362Q883M209
13656A760O618O459r509j6450m394o998j3643Q804J307O303K3656K717P998P95
13642A5423j7754n935J0998k732j1219k135O530l97J1259M155J773j1671L723
13629B018p28K286j480n919J451l11J195L597k665k185R090J4116j347o765J535
13614A3888o264j3584J179J4870o114L029R637q469j634K980M912J2158o302p022
13600A3264j0596k369J291k974N62Q01k522K370K883K914n178J231J0056j0503
13586A230j0729m606K2497p774j5380O951Q013R050r710j3550J424M990O855J58
13572e81j1448m342j5291J074R328J2798J2977P111p75k528M054p494r906j0717
$$ y = [-2267, -9250, -14760, -21742, -14956, -3, 1299, 717, -1674, 1540, -2704, -6784, -12694, -11332, -2449, 1760, 8378, 14837, 5328, -11122, -15516, -22514, -36157, -27353, -26046, -19743, 3913, 6630, 14628, 15423, -2331, -8266, 2732, 0, -11219, -13354, -6824, -7221, 4038, 8193, 9966, -1705, 2018, 1290, 3576, 2096, -3823, -2372, -2683, -1488, 2109, -556, -2741, 6349, 20465, 19118, 12353, 13888, 7624, -5960, -4781, 10089, 3975, 7004, 16641, 8172, 6538, 9518, 14430, 26588, 20286, 13264, 2668, 299, 1590, -1384, -822, -21, -2543, -173, 2710, 5624, 446, 1677, 11733, 1230, -9499, -14105, 8392, 618, -14762, -7811, 202, 9252, -458, -14008, -12584, -7594, -739, -581, -12029, -16371, -31662, -30588, -21260, -8462, 4515, 11626, 10851, 8323, 12377, 4883, -5023, -15740]
13558a5740M81J8124j1332m52R498n175J141P297j5928j0777O600J1818N554p603
13544f494r89m944J0995J7645O324O19J180J2945j8711j3691J024j993q341j55
13530d586j41L077K192r702k981R88k622l33o863o26J6983Q927n313p897L431
13515e466M89j1725Q913J1457L590j759J569R681N524j151k006o111Q110n000
13501A6115K801o843j0931r380j0981o28j192j3173K717O648J4915Q679Q620R1
13487G458j266k17R279M461K510j77j565J0906P172o219k047r343k401n85n518
13472A2448m441k698p51N510M757R103j2883q368L540K847Q774J558m265J3014
13458B8145R82N889R942Q219j0534o592Q357q329j2405m747n092N044Q863k293
$$ y = [-15740, -15259, 2865, -8467, -8919, 579, -4596, -3455, 3842, -12086, -22863, -16263, -4445, 1109, -6494, -7483, -12427, -1432, 16213, 22537, 23156, 24336, 37281, 18570, 4879, 5903, 3910, -4431, -4586, -4727, -1650, 542, -9160, -12141, -11153, -13775, -14108, -20971, -21597, -4614, 4313, -1000, -8897, -5466, -4977, -16702, -7789, 3668, 7258, 5499, 7068, 16749, 22273, 21122, 19116, 13005, 21115, 16115, 18916, 12073, 1142, -8238, -19219, -19847, -21039, -34212, -31495, -24847, -9932, -1253, 7367, 7458, 6192, 5975, 15254, 19715, 22225, 22048, 20483, 31389, 38561, 32342, 30295, 20952, 18551, 17966, 12448, 8007, 5309, 4558, 10068, 14825, 23928, 11045, 2677, 6217, 9064, 17838, 19396, 15131, 28145, 29127, 35016, 44958, 53177, 42643, 36051, 44408, 36079, 23674, 18927, 13835, 18879, 27742, 25449]
13444B5449J2310k31N147j4331j0581j725M241J1339N955j944J699Q700R627m760
13430E0895j7129r616M597K941n379R305j18l119n205q165J681k332J109Q878
13416B8343r365o900Q244L514j056K511N335O045L970N004R208j777M596J2762
13402G0434k567q984O196K593k3455O620J0368j0629p027J802n403Q068K0498
13389F8514k443N964J6258N708k95R674K1573K5287L8981O5055Q0739R5834J46371
13376E77220J88744J86841R8389m9164j66802j97483j50951q7388o5613n9856
13366B73937m3347k6163q088j5567k1129j2605j98J331J8764O113L847J5837J7134
13353B09866K1900L5791M0590O8598Q9079R6744J18060J62680K28378K84513K40647
$$ y = [25449, 37759, 37528, 42675, 28344, 17763, 16038, 20279, 31618, 37573, 35629, 37328, 46028, 55655, 50895, 33766, 24150, 28747, 31688, 26309, 35614, 35496, 32377, 27172, 19007, 20688, 18356, 19465, 28343, 18978, 12078, 20322, 23836, 22780, 25291, 30626, 36671, 40641, 45645, 54853, 53076, 57672, 70434, 67867, 58883, 65079, 67672, 44217, 50837, 61205, 50576, 43549, 45351, 39948, 48016, 68514, 66071, 72035, 88293, 94001, 93706, 103380, 124953, 150240, 189221, 254276, 335015, 430849, 577220, 765964, 952805, 1051194, 1002030, 835228, 637745, 486794, 399406, 333793, 273937, 230590, 204427, 196339, 180772, 159643, 147038, 146840, 148171, 166935, 173048, 176895, 192732, 209866, 231766, 267557, 308147, 376745, 465824, 562568, 680628, 843308, 1071686, 1356199, 1596846]
13342A596846J11135r745j27360j81386k01581k39332k27932j72567j06174o7696
13332C74208m4033l2235l6375l0447j3739p828o670p666j2104L558J1742J0061
13320B08472N794O839J0100K8505M2113N9805P2756J05065J47881J99741K44106
13309A131177K20743Q1612j26949k64185k57303j93918j32580q7599o3239m7829
13299B59930j7667o800m180o290m02q262j3585j9506j8229j752k6489j2251o780
13286A17737o827j929K395J814j5506m481k1480j0194M901J2908J4620J2681J467
13273A08106K1541J3602K6949K2960J5214P81K33J4449J11J0282K4006J9951k821
13260B75364k4102k9408j4859r697k2214j0767k1282k6223r086p043j8005q123
$$ y = [1596846, 1707981, 1698236, 1570876, 1389490, 1187909, 948577, 720645, 548078, 441904, 374208, 330175, 297940, 261565, 231118, 217379, 209551, 202881, 195215, 183111, 186669, 198411, 208472, 214266, 221105, 231205, 259710, 301823, 361628, 434384, 539449, 687330, 887071, 1131177, 1351920, 1433532, 1306583, 1042398, 785095, 591177, 458597, 370998, 307759, 259930, 242263, 235463, 231283, 224993, 224591, 216329, 202744, 183238, 165009, 163257, 136768, 124517, 117737, 110910, 108981, 111376, 113190, 97684, 93203, 71723, 61529, 66430, 79338, 93958, 106639, 108106, 129647, 143249, 170198, 193158, 208372, 209153, 209386, 223835, 223946, 234228, 258234, 278185, 275364, 251262, 221854, 206995, 197298, 175084, 164317, 143035, 116812, 107726, 100683, 82678, 74555]
13248G4555O16j978R270Q758K32O08P455N740o628P006K9759J9057O763M074P272
13233A72559n599k064P313P256O809R847K976j330o586n464k2656j6448j6821
13220A29792m760j829j6971j7414l662J0568L781J0116J9902L326Q76N178P720
13207A46623Q596J5841l103J012J1908M971K6363L9463M3959J8297j0580k0102
13195B83248l3981l3187k5510j5304j9742j0253j6659j5941n677P182R814K3426
13183A47416K6067K6093J2973J1189j1952n035k6822j9168p716r055q813k862
13171A32315n273j1909n019R399J3344J6086K7021L8608L2867K7208p493k0536
13159B46618j5842l2406j5475J280J3593K4120L319J1317K4607K7842K1977K2635
$$ y = [74555, 75171, 73193, 82463, 91221, 91453, 92061, 99516, 105256, 98628, 105634, 135393, 154450, 161213, 165287, 172559, 166960, 164896, 172209, 179465, 186274, 196121, 199097, 197767, 191181, 185717, 163061, 146613, 129792, 125032, 123203, 106232, 88818, 85156, 95724, 99505, 109621, 129523, 132849, 133725, 138903, 146623, 155219, 171060, 167957, 168969, 180877, 185848, 212211, 251674, 295633, 313930, 303350, 283248, 249267, 216080, 190570, 175266, 155524, 145271, 128612, 112671, 106994, 114176, 123990, 147416, 173483, 199576, 212549, 223738, 211786, 206751, 179929, 160761, 153045, 143990, 135177, 132315, 127042, 115133, 110114, 119513, 132857, 148943, 175964, 214572, 247439, 274647, 267154, 246618, 230776, 198370, 182895, 184175, 197768, 221888, 225207, 236524, 261131, 288973, 310950, 333585]
13147C33585J0197p996k5754l9648l8426m4478l9744k2105k412m181J050M956
13135A25044J505n172O904O706p828J4022N051R011J0784J2520J6028K2763L59
13122B17697L133K1237P772J9568K0059K0184M967J4068k805k7584l1786k6992
13110B39518k7141l3390k7623p547k650Q074P108J3871J2650R548L1456L3123
13098B56997P323O682J0553K46q09J0346P494J3110K1427J3071J7988K7466K7627
13085D19521o349k9370k2772j6033j4006k0790k0774l4233j9536K0521J7701P722
13073B81602k009J0110J8494J7949K3420R617j0511J1809K8058K6851K5436K2919
13061D63745K5837K3118K1495R650K1241J5533J7588L0161K3799J626j0697j6279
$$ y = [333585, 343782, 335786, 310032, 270384, 231958, 187480, 147736, 125631, 123219, 119038, 120088, 125044, 126549, 121377, 128281, 134987, 127159, 141181, 146232, 155243, 166027, 178547, 194575, 217338, 217697, 220830, 242067, 249839, 269407, 289466, 309650, 314617, 328685, 325880, 298296, 266510, 239518, 212377, 178987, 151364, 143817, 141167, 149241, 156349, 170220, 182870, 192418, 223874, 256997, 264320, 271002, 281555, 281801, 280992, 291338, 298832, 311942, 333369, 346440, 364428, 391894, 419521, 413172, 383802, 361030, 344997, 330991, 310201, 289427, 255194, 235658, 256179, 273880, 281602, 279593, 289703, 308197, 326146, 349566, 359183, 348672, 360481, 388539, 415390, 440826, 463745, 489582, 512700, 534195, 543845, 565086, 580619, 598207, 628368, 652167, 653793, 643096, 626817]
13049F26817m4456n2004l0006j1101l505l104N436J7982L2653O2585P1452K1699
13037F94448k2341m0864l5152l9524j9997o313j93N530J6972L4542L3929J2668
13025F33705Q564K5409L7020L7973K5927R686o509j9463l7748l8591l6340l1700
13013F07933k2260j1871q713m842p822j0990K519R306J4803J4949J6440K4328
13001F23780O031J1962Q259J2051J3632N406J7536L3320L7890K5135J6255K6040
12989H37297O917J8612L0543J697j4690n903n503m940O888J147J5943L865Q948
12976I00821K5899L6528J9280J4662J7268M9675N5500N0512L7350L7002L1612
12965A276109M2242P9118J02572J02251R1008J00811Q1432O8126P2184P4602Q8220
$$ y = [626817, 582361, 530357, 500351, 489250, 485745, 482641, 488077, 506059, 538712, 601297, 672749, 694448, 672107, 631243, 596091, 556567, 536570, 530257, 530064, 535594, 552566, 587108, 621037, 633705, 642269, 667678, 704698, 742671, 768598, 778284, 771775, 752312, 714564, 675973, 639633, 607933, 585673, 573802, 565089, 560247, 552425, 541435, 543954, 553260, 568063, 583012, 599452, 623780, 629811, 641773, 650032, 662083, 675715, 681121, 698657, 731977, 769867, 795002, 811257, 837297, 844214, 862826, 893369, 895066, 880376, 874473, 868970, 864030, 870918, 872065, 888008, 891873, 900821, 926720, 963248, 982528, 997190, 1014458, 1064133, 1119633, 1170145, 1207495, 1244497, 1276109, 1318351, 1397469, 1500041, 1602292, 1693300, 1794111, 1875543, 1943669, 2015853, 2090455, 2178675]
12954B178675J11606J28607J51198J71993K10365K40181K57602K80142L01591
12945D031960L46226M08795M89524N76671P16355R14259J187279J538604K018613
12936A2228286K685795L570935M768632O340735Q564931J1972013J7344272K5405188
12928I2880787L4402430L6249788K0718114q081088l0521433l4928712k7491378
12921H3228508j8866216j3225506r664733p023484n013322l589320k612692j888414
12913B1344821j353094r16400n39577j51908K51280P31245J313754K031208K949526
12904B5660855M174840N760427P856857J0696590J4737328K0896805L0396622
12897A20180324M2934187N2513351M8355459K7540285O65544j8926389k8029228
$$ y = [2178675, 2290281, 2418888, 2570086, 2742079, 2952444, 3192625, 3450227, 3730369, 4031960, 4378186, 4786981, 5276505, 5853176, 6569531, 7483790, 8671069, 10209673, 12228286, 14914081, 18485016, 23253648, 29594383, 38159314, 50131327, 67475599, 92880787, 127283217, 163533005, 184251119, 176170031, 145648598, 110719886, 83228508, 64362292, 51136786, 41472053, 34448569, 29435247, 25845927, 23233235, 21344821, 19991727, 19075327, 18535750, 18383842, 18635122, 19366367, 20680121, 22711329, 25660855, 29835695, 35596122, 43452979, 54149569, 68886897, 89783702, 120180324, 163114511, 215627862, 263983321, 291523606, 292189150, 273262761, 245233533]
12890B45233533l4428349m0990736m0968074l2764525k2552164j4868831j0159255
12883D8501599p353331n545094m309398l395292k654344k059206j550384j087660
12875B0546890o20741j51188L95267J023493J807520K777294M027047N708352
12867C5513934Q018730J1176237J5372277K0859427K8482846L6583329L5260718
12860A91267498J3903219j8737277l9900372m0570370l0211185j9617013j2498336
12853D3636164q376403o012280m615495l679809k962841k383297j956142j622976
12845A2026921j343368j147918r74679q13905o96464o10272n35369m57275m21959
12836E025712l60121l24780k93621k45569k08279j97332j68824j57205j47163
$$ y = [245233533, 210805184, 169814448, 128846374, 96081849, 73529685, 58660854, 48501599, 41148268, 35603174, 31293776, 27898484, 25244140, 23184934, 21634550, 20546890, 19926149, 19774961, 20170228, 21193721, 23001241, 25778535, 29805582, 35513934, 43532664, 54708901, 70081178, 90940605, 119423451, 156006780, 191267498, 205170717, 186433440, 146533068, 105962698, 75751513, 56134500, 43636164, 35259761, 29247481, 24631986, 20952177, 17989336, 15606039, 13649897, 12026921, 10683553, 9535635, 8560956, 7747051, 7050587, 6440315, 5904946, 5447671, 5025712, 4665591, 4340811, 4047190, 3801621, 3593342, 3396010, 3227186, 3069981, 2922818]
12827B922818j44006j42989j40164j48761j40384j00489j04396r7504q5736p5366
12817A743023n5753m3821n1574m4841m7447l7673m0614n2877m3236k9397k5497
12806A270293k1912m0254m5798n9656n1633n0512m9809m5447j5361r236j8889
12795H61786l0252k3283j4426l4101j4187N709j6528j6263p236j8844k6197j1399
12783F54779n349k381k263K572j002Q859J469L323q550j792j3643j6778k4100
12770E95144j8171j2674r000j0743q939J0599K45j5180j0273J213R501J6146N007
12757E52875m009j0264m374l374K4313L6418P1453R9576O5549k337p2686q5811
12745F67329o2282m3780k7122p350n720j3366j9102k1914l3152k7108k1468k9263
$$ y = [2922818, 2778812, 2635823, 2495659, 2346898, 2206514, 2106025, 2001629, 1904125, 1818389, 1743023, 1687270, 1643449, 1591875, 1547034, 1499587, 1461914, 1421300, 1368423, 1325187, 1295790, 1270293, 1248381, 1208127, 1162329, 1102673, 1051040, 1000528, 950719, 905272, 889911, 880675, 861786, 831534, 808251, 793825, 759724, 745537, 751246, 734718, 718455, 711219, 692375, 666178, 654779, 649430, 647049, 644786, 647358, 646356, 655215, 656684, 660007, 651457, 649665, 636022, 619244, 595144, 576973, 564299, 555299, 544556, 535617, 546216, 546461, 531281, 521008, 522221, 531722, 547868, 552875, 548866, 538602, 534228, 530854, 555167, 591585, 663038, 762614, 828163, 825826, 753140, 667329, 605047, 561267, 534145, 526795, 521075, 507709, 488607, 466693, 433541, 406433, 384965, 355702]
12733C55702L294J7593K7543O280k231j7482l3099o470J3479R066m184j4790j7004
12720C37697r220m305j2052k2204j6782K053J406K219K539N564Q042K468j6651
12707B80774J309j6075j2497j1319j0672r283r460M706J764M495J0840J0179J2822
12694B57583k283R37n216j5040J5828Q119l302J5224o016r908n964j0977J81P711
12680B46877p586j3908r682k0335j0749j1967n13q263p437r007r500j7448J820
12667A22302M20P62J442L790J077K558k491N080j380N021J4427J4490j006o020
12653A60472M898k035K643P16j117J528j528K1360J3342L127r257r110j6879j2632
12639A55528j8208j8684M803q072j4743o370N904J3371m605n845M34n781J5449
$$ y = [355702, 358996, 376589, 404132, 410412, 408181, 390699, 357600, 351130, 364609, 373675, 369491, 354701, 337697, 328477, 324172, 312120, 289916, 273134, 275187, 276593, 278812, 281351, 286915, 294957, 297425, 280774, 282083, 266008, 253511, 242192, 231520, 222237, 212777, 217483, 219247, 223742, 234582, 244761, 257583, 255300, 256237, 251021, 235981, 251809, 259928, 256626, 271850, 265834, 255926, 249962, 238985, 239166, 246877, 239291, 225383, 215701, 195366, 184617, 172650, 172137, 163874, 156437, 147430, 137930, 120482, 122302, 122722, 123484, 124926, 128716, 129793, 132351, 129860, 134940, 133560, 138581, 153008, 167498, 166492, 160472, 165370, 163335, 165978, 166694, 165577, 167105, 165577, 186937, 200279, 203406, 194149, 185039, 168160, 155528, 137320, 118636, 123439, 115367, 100624, 94254, 100158, 113529, 108924, 103079, 103513, 97732, 113181]
12626A13181Q725R536p886J1618J8940O472n174J3868K1299K832n714M287K562
12613A94546j3149j5578q658j3600j3459j2856j5381r512N844P237K340k081j1965
12600I3728M433O168O357R241J225j4883p202K43p401O986k740K292R44J667J116
12585A02174r40j4745j2677j3574k667J055O454N959Q553N085k126L990M380R430
12571A00351O017P360O658J3529J300R586O859j7446J797r586j0091L675J803
12558A21812L464k199m930j6071K136P726J51j192j3384o085j8411N171J1617
12545H9805L191Q141o829P959j487R993J4275J2662J3546O487O16J559j2104j199
12531A46615K1693J5108j420O08j0769j0491R067P049p77j0545l0844j9268j0026
$$ y = [113181, 121906, 131442, 123556, 135174, 154114, 160586, 155412, 169280, 190579, 193411, 187697, 191984, 194546, 181397, 165819, 157161, 143561, 130102, 117246, 101865, 92353, 98197, 105434, 107774, 105693, 93728, 98161, 104329, 110686, 119927, 121152, 106269, 99067, 99310, 91909, 98895, 96155, 98447, 99391, 101058, 102174, 101234, 86489, 73812, 60238, 57571, 58626, 65080, 71039, 79592, 84677, 82551, 86541, 90921, 100351, 106368, 113728, 120386, 133915, 135215, 144801, 151660, 134214, 136011, 126425, 116334, 120009, 121812, 125276, 123077, 118147, 102076, 104212, 111938, 112089, 110897, 97513, 91428, 73017, 78188, 89805, 92996, 101137, 94308, 102267, 100780, 110773, 125048, 137710, 151256, 157743, 158359, 159918, 147814, 146615, 168308, 183416, 181996, 182604, 171835, 161344, 170411, 177460, 176683, 166138, 135294, 116026, 106000]
12518A06000k711M888j5143k1681m282k925k288J5317J4522N136l405L373P984
12505A04785K378m586o325Q317O174j3976R13N416J1020O188R833J1005j2558
12492A28584L704l61M424P074J5258j2422k098O790j0117l780k341N739J9198
12479A59652J5963K3877L0734M1908P0222J09476J41361J81842J63144P0989p5565
12468I33603j43382j62027j50419r1357o4716m1547l6501k1173k8017o358o715
12457A81391m205J0624R050j014k0327j3840K667J6833R921K6122M0427N1951
12445C09600O5244R3648J16949J76597K43068K84362K50298J31242k2024j15010
12435A533974j50109j76469k15245k15027j81071j30585p5487n8745l6765l2640
$$ y = [106000, 103289, 108177, 93034, 71353, 67071, 64146, 61858, 77175, 91697, 96833, 93428, 96801, 104785, 107163, 102577, 96252, 104569, 110743, 96767, 97680, 103096, 114116, 120304, 130137, 141142, 128584, 132288, 131927, 136351, 143425, 158683, 146261, 144163, 150953, 140836, 137056, 134715, 140454, 159652, 175615, 199492, 230226, 272134, 342356, 451832, 593193, 775035, 938179, 1009168, 933603, 790221, 628194, 477775, 386418, 321702, 280155, 243654, 222481, 194464, 188106, 181391, 177186, 187810, 196860, 195846, 175519, 161679, 164346, 181179, 191100, 217222, 257649, 309600, 374844, 468492, 585441, 762038, 1005106, 1289468, 1539766, 1671008, 1648984, 1533974, 1383865, 1207396, 992151, 777124, 596053, 465468, 389981, 331236, 294471, 261831]
12425B61831k0436j6k3011r976k177l826j1458m805p308L037R404J8411L1975
12412B41645K5602L8385O6748Q2794J31767J76202K06552J67750L2422j26868
12402A042999k12576k09324j67809r8784p3728m7023k3622k8642k6451j7768j2725
12391A24547N016l504j742n056r705j6670j1555k13J419j1926j0623j297J1327
12378G0018M025J717k675J623j030L889l917n339J339j472K462O9n153j2467N840
12363E8929K4613K3943J173o763j0525q044J9383J6757J5384m826m421l94K127
12350A27336j811j9410j0462m194q732n322m947J0898Q352r00j5037k213K866
12337G6424j0198k706P082J809m046k396P337r774k580J0411J1294J0473L474
$$ y = [261831, 241395, 241379, 218368, 208392, 206215, 202389, 190931, 186126, 178818, 181855, 191259, 209670, 241645, 267247, 305632, 372380, 455174, 586941, 763143, 969695, 1137445, 1169867, 1042999, 830423, 621099, 453290, 354506, 280778, 233755, 210133, 181491, 155040, 137272, 124547, 129563, 126059, 124317, 119261, 109556, 92886, 81331, 81118, 82537, 70611, 59988, 58691, 70018, 74043, 75760, 73085, 74708, 73678, 77567, 73650, 68311, 69650, 68178, 70640, 70709, 65556, 53089, 58929, 83542, 107485, 108658, 101895, 91370, 83326, 102709, 119466, 134850, 130024, 125603, 125209, 127336, 125525, 106115, 95653, 91459, 82727, 77405, 72458, 83356, 91708, 90808, 75771, 73558, 76424, 66226, 63520, 70602, 72411, 68365, 65969, 73306, 63532, 60952, 71363, 82657, 93130, 96604]
12324I6604J5008J0856J023n541M812Q858P558l069j697N21L001J6795J5682Q894
12310A79305k911j892K673m196k86p804j6055r915j1619q060j3667k33R226N505
12296A20071k1666k5612N421j628j6450N411J8052N743L842N590m256r667j2729
12283G2122J2668M696m431q278J433J7057J3297j989o83j6889o262K299R150j749
12269I2441j352r400k3492L631J3592q13r081o37R224Q831Q893K638J0197N709
12255A10381m328J2996O031r250j0279k3406k0537o275o416j4343O563J4612o44
12242E5105j783Q95j487o436r489J0600J5095j0489o328j206J679Q143N547P598
12228F7444m614m332k95q99Q572K1314J4054L60k2183j6010j8380n326N92J1791
$$ y = [96604, 111612, 122468, 123491, 117950, 122762, 131620, 139178, 136109, 134412, 134933, 137934, 154729, 170411, 179305, 176394, 174502, 177175, 172979, 172693, 164889, 148834, 138919, 127300, 119240, 105573, 105340, 114566, 120071, 98405, 72793, 78214, 76586, 60136, 65547, 83599, 89342, 93184, 98774, 94518, 84851, 72122, 84790, 89486, 85055, 76777, 78210, 95267, 108564, 106575, 105892, 89003, 82741, 85040, 94190, 92441, 91089, 81689, 58197, 61828, 75420, 74607, 65526, 64889, 74113, 82944, 91837, 94475, 104672, 110381, 106053, 119049, 125080, 115830, 105551, 82145, 61608, 55333, 48917, 34574, 41137, 55749, 55105, 53322, 54217, 52730, 46294, 36805, 47405, 62500, 52011, 45683, 44477, 46156, 54299, 59846, 67444, 62830, 58498, 58203, 57304, 65876, 87190, 101244, 101604, 79421, 63411, 45031, 39705, 40297, 52088]
12214E2088O626o888l149n112j1018k147L993J092L781M716R976P696j1274j3825
12200C6555n081j0851N751L164R860k621M647J4459J103p858L48J52m887O071
12186E0812l624o122J314M090j1361m007Q60R152m166P652O936M960q121k290
12172D6085o916R716P890q965j2257N458M009N60r312N545N203L82L236p513l850
12157C9271o07P087M198P798r135k2479o95L306r613L66O129k7p434R493J4405
12142D2063l439r933j0964j486m845N334R389n433q72rm968o019n052K755j385
12127E136L104J4895k770q02Q075O856M141J766k889j2434k883k466l337J2986
12113B9378Q274m519n577o115j53J5199j599k978k252q720m824l544N110N683
$$ y = [52088, 58714, 51826, 48677, 43565, 32547, 30400, 34393, 35485, 39266, 43982, 53958, 61654, 50380, 36555, 31474, 20623, 26374, 29538, 39398, 36777, 41424, 55883, 56986, 49128, 49476, 49628, 44741, 50812, 47188, 41066, 42380, 46470, 35109, 31102, 31962, 41114, 36948, 44600, 51536, 56496, 48375, 46085, 39169, 48885, 56775, 47810, 35553, 41011, 45020, 45580, 36268, 41813, 47016, 47398, 50634, 43121, 39271, 38664, 45751, 49949, 57747, 48612, 26133, 25438, 28744, 19131, 19497, 25626, 25599, 18165, 27658, 42063, 38624, 28691, 17727, 16241, 11396, 16730, 26119, 20686, 19814, 19805, 14837, 8818, 3766, 6521, 5136, 8240, 23135, 20365, 19563, 27638, 34494, 38635, 40401, 37512, 25078, 22195, 19729, 16392, 29378, 37652, 33133, 27556, 21441, 21288, 36487, 34888, 31910, 29658, 20938, 16114, 12570, 17680, 23363]
12099B3363j389K435P150q449L431m048k402J1731O637R414q522j0831Q205J1815
12085D8540n248j1079m703m123J387R342k36p97O863q185q175P952K764q821o115
12070A9366q946R834l803O625J4681R960P64q173n996N473K189o310K1j0808j0740
12055A4137q294J2222N966N974J2241q878r927J2441L970k765p26j075k109J590
12041C4767j0828P360p320j2674p674Q63O575N510M299Q910J0996J943n913j4792
12027B2022m243J0733J5850l218j4548q173K967Q041J344k872N080k91r917j3825
12013H950j838J4287J2451o605l441L096j0733N12J797R627N729J3323m038q380
11999C4737r57L605k758J6242J3076o461k396m899l36p92j3862o756o768M654
$$ y = [23363, 21974, 24409, 31559, 23110, 26541, 22493, 20091, 31822, 38459, 47873, 39351, 28520, 36725, 48540, 43292, 32213, 27510, 23387, 24774, 34116, 33880, 33083, 39946, 31761, 23586, 31538, 34302, 25481, 19366, 10420, 20254, 16451, 23076, 37757, 47717, 48481, 40308, 34312, 39785, 41974, 35664, 35685, 24877, 14137, 5843, 18065, 24031, 30005, 42246, 33368, 23441, 35882, 39852, 37087, 36361, 35286, 33177, 34767, 23939, 31299, 23979, 11305, 3631, 4494, 11069, 16579, 20878, 29788, 40784, 42727, 36814, 22022, 17779, 28512, 44362, 41144, 26596, 18423, 21390, 29431, 30775, 27903, 32983, 32692, 22775, 8950, 7112, 21399, 33850, 27245, 23804, 26900, 16167, 16679, 18476, 28103, 33832, 47155, 43117, 34737, 33780, 37385, 34627, 50869, 63945, 57484, 55088, 50189, 49853, 49061, 35199, 28443, 21675, 26329]
11985B6329P391o472p83r57O227P783m87K749n89K967r78j4580J877j3107j1184
11970F186J7530p002o514J4448J9656J093J3120o555j5191k806K800K173L503
11957D2441Q019k54p386m742l304Q870m198K354Q661p534l114J7155L912J642
11943F2522k236j3801n747J2798J4061N418m612O489k531l715K296j285J3258
11930H2915J1413P971K4523L8823L1771K3218M7333O6466J07291J55578K01710
11919G99012K24317J17930o6779k00067k27622j62270j02081p0869n7234l9969
11909B14368j6096j5077j3549m220j4701j1390q88M291J5838K502J0102L114J6224
11896A90518L2987K5893L5019N5597R4002J15877J63270K14111J99206J69288
$$ y = [26329, 33720, 27248, 26465, 25508, 31735, 39518, 39031, 41780, 41191, 44158, 43180, 28600, 30477, 17370, 6186, 23716, 16714, 10200, 24648, 44304, 45397, 58517, 51962, 36771, 33965, 36765, 38938, 42441, 50460, 50206, 42820, 38078, 34774, 43644, 39446, 41800, 50461, 42927, 39813, 56968, 60880, 62522, 60286, 46485, 40738, 53536, 67597, 73015, 68403, 74892, 72361, 68646, 70942, 69657, 82915, 94328, 102299, 126822, 165645, 197416, 220634, 267967, 334433, 441724, 597302, 799012, 1023329, 1141259, 1074480, 874413, 646791, 484521, 382440, 311571, 254337, 214368, 198272, 183195, 169646, 165426, 150725, 139335, 138447, 142738, 158576, 161078, 171180, 174294, 190518, 223505, 249398, 284417, 340014, 434016, 549893, 713163, 927274, 1126480, 1295768]
11886A295768J52630J41866M2969j43964k85093l14671k41702j57127r5456n5145
11876C40075m2522m2358k6562k3621j3385k458j4318j0954j6582j4283q165O298
11864A31165K3626J1318J3740K3012L9622N2881N8232P2675R1075J11585J64972
11853G93903J78706O9226j22177j96203j84427j35469q3150o4389l9110k3851
11843A93059l1467k1528p969j8172k616j2075l621m110m551k243j194q821k892
11830G1800j1292n581Q792R18m56k075n942m501o69J4830J0400M541l929M262
11816H1098O629P187j498J315O11J637m121l378N110k3113l312m782j0047o72
11802E2664j7888j4352kN970J5230J082o925J2563L543q478k929k374O287J8524
$$ y = [1295768, 1448398, 1590264, 1633233, 1489269, 1204176, 889505, 647803, 490676, 395220, 340075, 297553, 255195, 228633, 205012, 191627, 189169, 174851, 163897, 147315, 133032, 124867, 131165, 154791, 166109, 179849, 202861, 242483, 295364, 353596, 426271, 517346, 628931, 793903, 972609, 1041835, 919658, 723455, 539028, 403559, 320409, 256020, 216910, 193059, 161592, 140064, 132095, 113923, 111307, 99232, 95611, 91501, 86950, 84707, 83513, 74692, 71800, 60508, 54927, 63719, 64637, 64181, 62106, 56164, 51663, 50994, 65824, 76224, 80765, 76836, 81098, 87727, 94914, 93416, 94731, 95342, 96979, 92858, 89480, 94590, 71477, 68165, 63383, 53336, 52664, 34776, 20424, 20422, 26392, 41622, 42704, 35779, 48342, 51885, 43407, 40478, 38104, 44391, 62915]
11788F2915P064j5928K515Q475J8684J0383J1331J3191o248l130j033p742K226
11775A02703R190L69o99k0308k2189k5845n139l96J941l471M639K5102R585n542
11761F9940N502l753J3558N018l454Q73J7242J6458K847J4768L1849L3696K3206
11748B27750j194j2433k5145m2332k7433o780J7004M953k5891j4559j9479j5264
11736E9197q327J5742K5908L831k225O835N465L338Q613L14O989O442N000R579
11722A46701J7296K2345L4921L1027L7446J4046J0037O831k6724l8762m1216m6113
11710A67835l5362j7700j8593L307q324r40J5226r503j0294J6985J2452o452K85
11697A08922O078J821J5715K7726K7194P746J3193J0304K0700J8941Q772J6826
$$ y = [62915, 69979, 54051, 56566, 65041, 83725, 94108, 105439, 118630, 112382, 109252, 108219, 100477, 102703, 111893, 112262, 111563, 91255, 69066, 43221, 38082, 37686, 39627, 36156, 40795, 65897, 75482, 69940, 75442, 71689, 85247, 90265, 86811, 87684, 104926, 121384, 124231, 138999, 170848, 204544, 227750, 226556, 214123, 188978, 146646, 119213, 112433, 129437, 134390, 108499, 93940, 74461, 59197, 50870, 66612, 92520, 96351, 94126, 100961, 106426, 109764, 118377, 118691, 125680, 132122, 137122, 146701, 163997, 186342, 221263, 252290, 289736, 303782, 313819, 320650, 293926, 255164, 213948, 167835, 132473, 114773, 96180, 99487, 91163, 90223, 105449, 95946, 85652, 102637, 115089, 108637, 108922, 115000, 116821, 132536, 160262, 187456, 195202, 208395, 218699, 239399, 258340, 267112, 283938]
11685B83938J5856J3491J2403o349m3880m5377k8437l4309l4144j5702o0K426
11673A19856L215o933j1526l850J0886J1496m046j8259o884J8022M883J7185J4798
11660A48843K3520K9597O664Q13J5833K7095j230r104Q491O368j2897k8788j9186
11647A96019k1701l166J066K748J1737M030P614N174J6325Q942j309k145P557
11634B32891N19J2296R172K4208K5560K0234J4416K3865L3584J579J1443K9292
11622D39059M2528L5286J3641q081k1563l0349j5460j7208q41O454k831J2651
11610D53286M7518O2073R4791J17514N8638m9221q9783p1989n6132j6290j5057
11599E35348J053K264J1387J2250J0821K9372L9259K4825J7312J5434R704K3467
$$ y = [283938, 299794, 313285, 325688, 319339, 275459, 230082, 201645, 167336, 133192, 117490, 117430, 119856, 123071, 116138, 104612, 100762, 111648, 123144, 119098, 100839, 93955, 111977, 116860, 134045, 148843, 172363, 201960, 208624, 209437, 225270, 252365, 251135, 242031, 250522, 256890, 243993, 215205, 196019, 174318, 171152, 172218, 174966, 186703, 190733, 198347, 203521, 219846, 228788, 227479, 225334, 232891, 233410, 245706, 254878, 279086, 304646, 324880, 339296, 363161, 396745, 398324, 409767, 439059, 481587, 516873, 530514, 522433, 500870, 470521, 455061, 437853, 437012, 443466, 440635, 453286, 500804, 562877, 657668, 775182, 833820, 784599, 694816, 622827, 566695, 550405, 535348, 536401, 538665, 550052, 562302, 573123, 602495, 641754, 666579, 683891, 699325, 709029, 732496]
11587G32496J6102l58k3818j5612l2971k9377k0093j7673P461j06m89L195n965
11574F12792p295l815J4973K7132J5645J3961J3396J1483J3309P330K4965K6859
11562G70735J6230K3319J6451j930M385J8831K1234K3260J0292J5162J3193L862
11550I35024M47L778K319J2055K2256J7960L5034K7538L4856K0407K2742L9403
11538A173819L4341M6895K8161K4648N3174N3038Q0444J02514J11504J16729R8910
11527A924177P3785Q6794J01344R4896R1472J14855J59887J96944K31527K37730
11517C313411K79333K93409L18049L63179M11541M79570N91625P04599R05711
11508G660427J145753J469150J947068K562372L417479M633965O282964Q500011
$$ y = [732496, 748598, 748240, 724422, 708810, 675839, 646462, 626369, 608696, 616157, 616051, 615562, 618757, 612792, 605497, 601682, 616655, 643787, 659432, 673393, 686789, 698272, 711581, 718911, 743876, 770735, 786965, 810284, 826735, 824805, 829190, 848021, 869255, 892515, 902807, 917969, 931162, 935024, 935471, 939249, 941568, 953623, 975879, 993839, 1028873, 1056411, 1091267, 1111674, 1134416, 1173819, 1208160, 1255055, 1283216, 1307864, 1361038, 1414076, 1494520, 1597034, 1708538, 1825267, 1924177, 1997962, 2084756, 2186100, 2280996, 2372468, 2487323, 2647210, 2844154, 3075681, 3313411, 3592744, 3886153, 4204202, 4567381, 4978922, 5458492, 6050117, 6754716, 7660427, 8806180, 10275330, 12222398, 14784770, 18202249, 22836214, 29119178, 37619189]
11500C7619189J1793267J7008040K5215217L6865775M6876829L7369247j741277
11493B11006287l7964296m4872917l4078252k3248854j6318644j1253488p563661
11486C5706175n219929l808297k842048k077441j499503j068021o82572k85301
11478A8223063J02656N36918J063137J699326K519691L623895N111908P045556
11470C9926150R796161J3917866K0123725K9395920M0881983M6373405L7949172
11463B38364382L0265076K6869829J0341949j9587022m9007624n9826687n0025571
11456A27394332l4089305k1716440j4145118r722856p085362n438587m297147
11449C0899517l421157k702637k102422j622030j217064q09865l59485J20110
$$ y = [37619189, 49412456, 66420496, 91635713, 128501488, 175378317, 212747564, 211006287, 173041991, 128169074, 94090822, 70841968, 54523324, 43269836, 35706175, 30486246, 26677949, 23835901, 21758460, 20258957, 19190936, 18508364, 18223063, 18325719, 18862637, 19925774, 21625100, 24144791, 27768686, 32880594, 39926150, 49722311, 63640177, 83763902, 113159822, 154041805, 200415210, 238364382, 268629458, 295499287, 305841236, 286254214, 237246590, 177419903, 127394332, 93305027, 71588587, 57443469, 47720613, 40635251, 35196664, 30899517, 27478360, 24775723, 22673301, 21051271, 19834207, 19024342, 18664857, 18784967]
11441A8784967O79299J350418K155479L228714M764590O875073R685777J2965307
11433F0489624J6505533K2658892L3075443M0307917K5629886j3010352m1146379
11426A44510564m2439616l0511983j9275862j2144456p925326n480725m124518
11419B2608078l331123k707412k159157j751706j450993j208035j033127r14924
11411H051601p86534o50976n44845m79672m49273l96803l38728k87804k44496
11402C872470k26006k14349j97434j62299j65653j54820j50860j40178j30048
11393B330823j21816j13765j07151r1153p6471o3744n7570o5395n7450o0271n7407
11382A458630l3033k5178m3261n6496l4893k0305j9557j7163j9124l7349l9628
$$ y = [18784967, 19464266, 20814684, 22970163, 26198877, 30963467, 37838540, 47524317, 60489624, 76995157, 99654049, 132729492, 173037409, 198667295, 185656943, 144510564, 102070948, 71558965, 52283103, 40138647, 32213321, 26732596, 22608078, 19276955, 16569543, 14410386, 12658680, 11207687, 9999652, 8966525, 8051601, 7265067, 6614091, 6069246, 5589574, 5140301, 4743498, 4404770, 4116966, 3872470, 3646464, 3432115, 3234681, 3072382, 2906729, 2751909, 2601049, 2460871, 2330823, 2209007, 2095242, 1988091, 1896938, 1820467, 1756723, 1699153, 1633758, 1576308, 1516037, 1458630, 1425597, 1400419, 1357158, 1300662, 1265769, 1245464, 1225907, 1208744, 1189620, 1152271, 1112643]
11371A112643n8513n3403m6762l5902k1082r779j1800k8088l7788k7022k0288
11360G62216m764j1066p097k9124m2169k1248n292q222j0868J031J3881J4348
11348F51626N410P265K168o502j639N350m021j5929j7335j6653l2476k8911k677
11335E45676q40j1197j6074l956l414Q431P427J3997L142o357k3100j1677K12
11322E02270o587k797K3256L0739O6620O6731p708o3221o6199m7305k5125j9495
11310D51179p224j0648k4413l6200l8478k0522r507j5891o057R245J9958P80J2400
11297C24622O823n69L793L532Q403j2875j5258j2690k4219m143K086j7228j3036
11284B49241r43r092m189J611k607J5862n420l0917j9820k9714k3992j0190M171
$$ y = [1112643, 1054130, 1000727, 953965, 918063, 896981, 887202, 875402, 847314, 809526, 782504, 762216, 757452, 746386, 739289, 710165, 667996, 646748, 641456, 633234, 622366, 623397, 637278, 651626, 657036, 664301, 666469, 659967, 658328, 663678, 659657, 643728, 626393, 609740, 577264, 548353, 545676, 544836, 533639, 517565, 513609, 510195, 518626, 526053, 540050, 543192, 536835, 513735, 502058, 502270, 495683, 492886, 516142, 546881, 613501, 680232, 672524, 609303, 543104, 495799, 470674, 451179, 443955, 433307, 408894, 372694, 334216, 313694, 304187, 288296, 282239, 291484, 311442, 312222, 324622, 331445, 330876, 334669, 338201, 346604, 333729, 318471, 305781, 281562, 277419, 279505, 262277, 249241, 248298, 239206, 235017, 236628, 234021, 249883, 244463, 213546, 193726, 164012, 140020, 129830, 134001]
11271A34001j0561q322r740J472J4930O757J4724K4579K5746R355L378k745j0666
11258A92908k1440n679J0171Q257o43J3091R119r692k2952r645M200L311N62o854
11244A64714l478p787p276j2253j7282r454j5581j2772o013q169L689J4503J0070
11231I2911p22J6284J8730J8663Q69j0151j840J554k525J4445K910R698K108K932
11217A65866O548J0695O244j3965j7995P687L897j0173q977L112r393l4826o329
11204A02391K905M601k568J510q79j0426q201m278J0988R320N831k57J5182L73
11190A26492l878M457J50J34n152M576j2654j7805j3769k708Q329J1557j205P621
11176A06145J1124n290k502J5409j854j7485n315q11j2797j364M525m21L580J3588
$$ y = [134001, 123440, 115118, 105378, 106850, 121780, 128537, 143261, 167840, 193586, 202941, 206319, 203574, 192908, 171468, 165789, 175960, 184217, 183574, 196665, 205784, 196092, 173140, 163495, 167695, 171006, 171568, 164714, 161236, 153449, 146173, 133920, 116638, 107184, 91603, 78831, 72818, 64649, 68338, 82841, 92911, 92189, 108473, 127203, 145866, 146735, 136584, 134744, 136298, 133773, 148218, 151128, 160826, 162934, 165866, 172414, 183109, 189353, 175388, 157393, 165080, 168977, 158804, 149827, 152939, 143546, 108720, 102391, 105296, 109897, 107329, 108839, 107960, 97534, 89333, 85055, 96043, 105363, 111194, 110937, 126119, 126492, 122614, 127071, 127221, 127355, 122203, 126779, 114125, 96320, 82551, 79843, 88172, 99729, 98524, 106145, 117269, 111979, 109477, 124886, 123032, 105547, 100232, 99421, 86624, 85260, 89785, 89364, 92944, 106532]
11162A06532l882o343j373R132p331N64M748L319k29j6639j4418j2692k0663J1287
11148E2012Q410n926j1205J4005L175L48J351m529k159J477Q252N165J2110N36
11134H3022j5307j439R999m588R7M497K387n087J3490O246K722J189q622j537
11120H7069p922j7541q275k369L499J0210N104J232N478n265m629O67P519l066
11106G1711j6444o244l623L400N166k72j483q896J005m446J0963K4624Q143O60
11092H4264j3761J1323J2323M995o393Q264J8001J3442P622l815j3049j7635l296
11079A02285O047L335J3659K4383J5979J0057J0451L0595L4727M3191Q8665J34024
11067E17398J95627K29557J81452j2145j81986k12144j55353j18059r3779n9020
$$ y = [106532, 102650, 96307, 94934, 104066, 96735, 97299, 102047, 105366, 105137, 88498, 74080, 61388, 40725, 52012, 60422, 54496, 43291, 57296, 60471, 60819, 62170, 57641, 55482, 56959, 65211, 70376, 82486, 83022, 67715, 66276, 76275, 71687, 71784, 76281, 78668, 73581, 87071, 93317, 96039, 97228, 88606, 87069, 79147, 61606, 53331, 50962, 54461, 64671, 69775, 71007, 76485, 71220, 66591, 67258, 74777, 71711, 55267, 49023, 45400, 48800, 53966, 53694, 52211, 43315, 44320, 39874, 50837, 75461, 83604, 84264, 70503, 81826, 94149, 99144, 92751, 101015, 119016, 132458, 140080, 136265, 123216, 105581, 102285, 108332, 111667, 125326, 149709, 165688, 175745, 186196, 216791, 251518, 294709, 383374, 517398, 713025, 942582, 1124034, 1111889, 929903, 717759, 562406, 444347, 350568, 291548]
11057B91548l7722j1284j0930O147j5772j5437r807J0324L670j0515P216l889
11045B03549q567n528n12L1121L8002M3161O1086R0289J50030K28604K65635K28414
11033A325284J58248J04717K551j42962k46162k72818k41159j59833j00451o7384
11023C60031m9052l7323l1377j9325k0598j4119j924R622M412j6894k0299j74
11011A62980k392n810J3212K9991L1082L6178N4678N4813Q3415J25797J59010
11000G42954J82686J11265q1343k10086k16525j36863r5255p4114l7727l0157
10990A54835k0104L524j1016j7051p934J3744Q117j6865k7189j3664k593n181
10978E8623j3626K36J878j157M822O976N970l058r176j4404k941o06K075p075
$$ y = [291548, 253826, 242542, 231612, 237759, 221987, 206550, 196743, 207067, 210737, 200222, 207438, 203549, 194982, 189454, 188942, 220063, 258065, 301226, 362312, 452601, 602631, 831235, 1096870, 1325284, 1483532, 1588249, 1590800, 1447838, 1201676, 928858, 687699, 527866, 427415, 360031, 310979, 273656, 242279, 222954, 202356, 188237, 186313, 195935, 200347, 183453, 163154, 162980, 160588, 154778, 167990, 197981, 229063, 265241, 319919, 374732, 458147, 583944, 742954, 925640, 1036905, 955562, 745476, 528951, 392088, 296833, 222719, 184992, 154835, 134731, 138255, 127239, 110188, 102254, 115998, 124115, 107250, 80061, 66397, 63804, 58623, 44997, 45233, 47111, 45954, 50776, 57752, 63722, 60664, 51488, 37084, 34143, 33537, 35612, 28537]
10964B8537j3993J722r49L658L032m013r592j307L841Q124m402J2689L406J1859
10950D2612J33q996j2032q647K415R923l484r054O497l450k75P9j0697o057j0963
10935a1996j327K4112J4850P569Q652j628j5876j3065Q367J2912n827K22K0816
10922D7781M977r624k2134o847j571l263r943n960J0587J0920R514J0275r195
10909B5517j3908n328o459R775J7574J2604k458j6819o76J0185j0218l441J7191
10896C3539J8588j853j7289m984J2577P428m616p480j1214p064J295j282J0678
10883B8323j843p426o434j26p739r676K2030J2350p142j0568p015m39K451m025
10869B721M71K218P078R411p475L154j5430j2815J4526J6894M039M150J0031o700
$$ y = [28537, 14544, 16266, 15317, 18975, 22007, 17994, 8402, 7095, 10936, 19060, 14658, 27347, 30753, 42612, 42745, 33749, 21717, 13070, 15485, 25408, 21924, 12870, 19367, 15917, 15642, 15721, 5024, -1033, -11996, -13323, 10789, 25639, 33208, 41860, 40232, 24356, 11291, 19658, 32570, 26743, 26965, 47781, 52758, 43134, 21000, 14153, 12582, 9319, -624, -6584, 4003, 14923, 24437, 34712, 25517, 11609, 6281, -178, 9597, 27171, 39775, 37317, 20498, 19822, 30007, 19789, 16348, 33539, 52127, 50274, 32985, 28001, 40578, 48006, 43390, 35910, 24696, 17632, 18927, 17645, 28323, 26480, 19054, 12620, 12494, 4755, -4921, 17109, 29459, 22317, 11749, 4734, 4295, 6746, 2721, 3192, 5410, 12488, 21899, 14424, 17578, 2148, -10667, 3859, 20753, 24792, 28942, 38973, 32273]
10855C2273p076j447o420j583J1944J5717k572j1851j5990L889P880Q23M04O076
10841C2067N849n037p458j1785j5185P109J667L125Q915o423j0348P41p16O153
10827H674M909k695M130j602L099N718L273M057m614q105Q771M36j4982j1071
10813bP252k476L087l217M930r368m850O795J295m07N253O61k4L998J8569O854
10797C8350M367j287n711l599p430L656k168j2160q107J877L350M109J966j1695
10783E518n744O093q01J1534K096Q924O485j4376R386J0567l289j3505j6356N36
10769G068N381j3706L090J0214K22q538j979n170J065O691m817j493R107J2300
10755A9435j549n04J768j579k2918J810j154j609j074k579n542P357P078L460
$$ y = [32273, 25197, 23750, 17330, 15747, 27691, 43408, 40836, 28985, 12995, 16884, 24764, 25587, 25991, 32067, 37916, 32879, 25421, 13636, -1549, 5560, 7227, 10352, 19267, 12844, 2496, 3237, 2521, 8674, 13583, 10888, 15018, 13416, 16515, 22233, 25506, 29563, 24949, 16844, 25615, 26051, 11069, -2, 7250, 4774, 7861, 4644, 9574, 206, -4644, 2151, 3446, 3039, 8292, 8953, 8929, 12927, 31496, 38350, 42717, 41430, 35719, 32120, 24690, 28346, 26178, 14018, 5911, 7788, 11138, 15247, 17213, 5518, -226, 5867, 5066, 16600, 18696, 27620, 34105, 19729, 29115, 39682, 36393, 22888, 6532, 7068, 12449, -1257, 1833, 12047, 12269, 3731, 1752, -3418, -2353, 4338, -479, -1972, 7135, 19435, 17886, 17382, 19150, 17571, -5347, -3537, -4691, -6300, -7374, -9953, -15495, -8138, -1060, 2400]
10741B400J777J2197K765n790p925q31L07k809K725J709M270R192J1314P797J1173
10726E0271j0178j0633m22m42P201m163j0917n314o792P263j082K922p702j2650
10712b638kK258M568l817q958N75J5352N52l395j1278m332R853J5140J762J658
10697A7298O663J543r07o90M971l371n320l693M266o533r9J766P937j0242J2918
10682B6507L05k471M688R824k831P196Q078m430m273l840o982K980J889l836n727
10667B7077j0612l645m303R683O016o776J0020Q593n793j6055p991L929J66l73
10653I936N114J739k178n68j86o02Q383N569P630N792j1913k6087o634J0465M539
10638A0999p709j4651N4L337J5734R375L965K553r594L522q71R110J935K471r27
$$ y = [2400, 4177, 16374, 19139, 13349, 5424, 4593, 4900, 2091, 4816, 6525, 10795, 19987, 31301, 39098, 50271, 40093, 29460, 29038, 28596, 35797, 31634, 20717, 15403, 8611, 15874, 14792, 17714, 10012, -2638, -2640, -382, 4186, 369, -8589, -8014, 7338, 7890, 4495, -6783, -11115, -1262, 13878, 15640, 17298, 23961, 25504, 24597, 23907, 28878, 25507, 20187, 16494, 20760, 14227, 14128, 15894, 23831, 13589, 26507, 26812, 24341, 29029, 38853, 36022, 43218, 51296, 46866, 42593, 38753, 31771, 34751, 36640, 32804, 27077, 16465, 12820, 8517, 18200, 24216, 17440, 27460, 36053, 30260, 14205, 6214, 10143, 10309, 9936, 15050, 16789, 14611, 14043, 13857, 13255, 21638, 27207, 34837, 40629, 28716, 2629, -4005, 6460, 10999, 3290, -11361, -11307, -7970, 7764, 17139, 21104, 23657, 14063, 17585, 16714, 25824, 27759, 30230, 29303]
10623B9303n114k054K0267K3092l154j7541m192j4144r603p145R487J4451O204
10610C9857j8675m583Q690q133q112k484n535N74K0646R110m016k0045j0734j49
10596c589O270P040q387o439J0475K0251J5589L96o075j4192r764o320L437L424
10582A2116p000R67N290m714J929j02J3993o185M197r350R40p31k206n462P049
10567A0731K0106J1797L232r874j4936q441l975j129R745J079p545P199q189n817
10553C983J9374M834n277k162q642j446p474j4757K14J3617N007N278j676J54
10539A1027j0614j483J5725r027n119r606J1391K8943R537p223k648j3971o152
10526A0780r665R841P115n603J118O94Q717n681j0204m775O574J0687O98r499
$$ y = [29303, 24189, 22135, 42402, 65494, 62340, 44799, 40607, 26463, 16860, 9715, 19202, 33653, 39857, 21182, 16599, 25289, 17156, 9044, 6560, 1025, 1599, 22245, 31355, 27339, 7294, -3440, -3589, 2681, 9721, 1334, -5105, 5370, 25621, 41210, 41606, 35531, 21339, 11575, 5255, 8692, 12116, 5116, 6083, 11373, 6659, 8588, 8486, 22479, 16294, 20491, 11141, 12081, 11350, 9144, 3682, 10731, 30837, 42634, 45866, 35992, 21056, 12615, 8640, 7511, 17256, 18335, 10790, 17989, 9800, 3983, 23357, 28191, 22914, 20752, 12110, 10664, 3190, -11567, -11353, 2264, 7271, 12549, 10873, 11027, 413, -1070, 14655, 5628, 509, -9097, 2294, 31237, 40774, 33551, 30903, 16932, 10780, 1115, 10956, 18071, 12468, 13586, 14280, 22997, 17316, 7112, 2337, 8911, 19598, 20296, 10797]
10512A0797j2926J3045j0891l36Q506J6831k20q114j5550q018J0778J95M991K059
10498A1147k343k236j962j390K126P82M262L287O870r112j9071j0742N573J290
10484a1519J1539J9643N884j1012n151N959o351j3578l80J48P614M094K316j5340
10470f134l211M11l378O211l639M601P874M855j6919L430J9897M666o532n486
10456F646k996l946q468N799J7136k30N080P65p929P204J5942p226O794R03L625
10441C9099j1137j3992q233m984J5424J9282J1430R773J8763K0093K3356Q032
10429A26906j7366l1379l5657k3834n2P63L264n723K304N900k371k6138j5491
10416a8874R425n175o836P255Q404N334L987K779Q76m715j4194N199J4124J441
$$ y = [10797, -2129, 10916, 25, -311, 8195, 25026, 24806, 16692, 1142, -6876, 3902, 4097, 9088, 11147, 8804, 6568, 4606, 3216, 5342, 6124, 10386, 13673, 20543, 11431, -7640, -18382, -12809, -11519, 20, 19663, 25547, 14535, 9384, 15343, 8992, -4586, -4966, -4818, 2796, 6890, 9206, -6134, -9345, -8934, -12312, -6101, -9740, -5139, 2735, 7590, -9329, -5899, 13998, 18664, 12132, 6646, 3650, -296, -8764, -2965, 14171, 13941, 19021, 19786, 11857, 19061, 35003, 27777, 34571, 35474, 39099, 27962, 13970, 5737, 753, 16177, 35459, 46889, 56662, 75425, 95518, 118874, 126906, 109540, 78161, 42504, 18670, 18618, 19381, 22645, 16922, 19226, 25126, 22755, -3383, -18874, -9449, -14624, -21460, -14205, -5801, -467, 3520, 6299, 7175, 2460, -11734, -6535, 7589, 9030]
10402I030o373k766n049J876k683j484M506L380M324N957L361k92J2520L282k2476
10387G113j3302n667J807J6089m935p715J222J5018j868J689j2976j389K0420
10374A5506J1539j6657m047R0o629k913k130j2218l566R140m333R210J381Q033
10360B406P699r937m028j902R554m497n037j861O693N730k06n381J44O215K3627
10345B9219J3171o832j0496r254l734p426q604M923J0308N798o99K1141J3842
10332E1357P046L426l714j8005J1984J0723r259P24Q503p476j9314r031o258o470
10318A4236p872K955q050j718J1239n802J3225m488j9213L244J3480J3047L751
10305B8034L299K050j8461j2091n248J04R494J1482N866J255q865p11R688P616
$$ y = [9030, 2657, -109, -5158, -3282, -5965, -7449, -2943, 437, 4761, 10718, 14079, 13787, 26307, 29589, 7113, -6189, -11856, -10049, 6040, 1105, -6610, -5388, 9630, 7762, 9451, -3525, -4914, 15506, 27045, 10388, 6341, 6431, -198, -3111, -5241, -17459, -21025, -11885, -16218, -7008, -5627, 2406, 10105, 168, -3860, -5762, 3792, -705, -5742, -7603, -910, 4820, 4614, -767, -623, 5592, 29219, 42390, 35558, 25062, 15808, 12074, 4648, -3956, 967, 11275, 17073, 16374, 37515, 51357, 58403, 61829, 58115, 40110, 52094, 62817, 53558, 54282, 62785, 55309, 35995, 26964, 20706, 14236, 6364, 9319, 1269, -449, 10790, 4988, 18213, 13725, -5488, -2244, 11236, 24283, 28034, 31333, 33383, 14922, 2831, -2417, -2313, 7181, 18663, 24529, 25784, 16919, 16208, 25896, 33512]
10291C3512j4364P5L739j780k248j2490P523J8918o480l443r141p137j4424r488
10277a7228L855N840J9193k28q847m786n727q922Q817j829k868j632K314O698
10263e350M644q092j3377Q373N229J620Q871j255j0213m337o67l946J096P578
10249i826J2893K0256j7952k5988m860O619M215Q132R198L131p178N682K29P862
10235A2413R790n061r325j466J0285J2307K843j6321j1371o117K526p675K569
10222d603K96K827O190j050J5730J1577L257q478j201o252p950m538j064Q70j795
10207C816p94o921q444J8581Q023k5296j0701K0716J4976m322J1238P182o411
10194B1643p922P737J2687O663l089k8957j0152K060J1795N280n799Q427j451
$$ y = [33512, 19148, 19223, 22962, 21182, 18934, 6444, 13967, 32885, 26405, 22962, 13821, 6684, -7740, -17228, -13373, -7533, 11660, 11432, 2585, -2201, -7928, -16850, -8033, -9862, -12730, -14362, -12048, -5350, -706, -8798, -22175, -13802, -8573, -6953, 1918, 663, -9550, -13887, -14554, -18500, -17404, -9826, 3067, 23323, 5371, -20617, -25477, -18858, -14643, -6511, 2687, 5818, -1360, 4322, 4551, 12413, 22203, 17142, 7817, 6351, 16636, 28943, 31786, 15465, 4094, -2023, 503, -7172, -4603, -4307, -1480, 4710, 3660, 19390, 30967, 34224, 25746, 24545, 18293, 10343, 5805, 4741, 5611, 3816, 3022, -3899, -12343, 6238, 14261, -11035, -21736, -1020, 13956, 9634, 20872, 28054, 21643, 13721, 21458, 34145, 40808, 37719, 8762, -1390, 670, 12465, 17745, 11946, 20373, 18922]
10181A8922o757J786j975Q756J9866P788j0170j432j0787j2566M726J1521l862
10168B5816j916P120J9284O539J5829J6353K5898R218n163N817J7817P054j0141
10155A39525j2110j8671j2718q595k1378k1639j0885j0860j775m030n580P404
10143A8688J516N86L638n721n117j6750Q890J1013n87q836l909R987k67p614o032
10128e15K408J2393L148R16N961J123n223j2792j0740k468q734r336R33L860O21
10113a8445M064R126J0180K774J3657O270q770j4172k598K892l171N286J1419
10100A8512O369m615K933k821k562q723r207R676L333m346L611J513J0771n90
10086B3854k7279l606J6648J3580M965r403p309j259k322L302k060K828l413O92
$$ y = [18922, 12165, 13951, 11976, 20732, 40598, 48386, 38216, 36784, 25997, 13431, 18157, 29678, 25816, 23900, 31020, 50304, 56843, 72672, 89025, 114923, 124141, 118978, 124795, 142612, 149666, 139525, 127415, 108744, 96026, 87431, 66053, 44414, 33529, 22669, 20894, 16864, 11284, 18688, 20204, 20790, 24428, 18707, 13590, -3160, 5730, 16743, 16156, 7320, 3411, 13398, 13131, 5517, -515, 1893, 14286, 17434, 18350, 24311, 25434, 20211, 7419, -3321, -5789, -14523, -23859, -22926, -19066, -18445, -14381, -5255, 4925, 7699, 21356, 27626, 18856, 4684, 2086, 4978, 1807, 7093, 18512, 24881, 20266, 23199, 20378, 17816, 9093, -114, 9562, 12895, 8549, 12160, 13673, 24444, 23854, -3425, -7031, 9617, 23197, 28162, 18759, 11450, 10191, 7869, 11171, 9111, 11939, 8526, 9218]
10072I218M455m486r476m755K714J1768J3642O767J2664L285k173l586j8541j4029
10058G467q154o757J763j647O142Q734N665L976j0447j1581M271J1684N296M291
10044B0703m654K728p355m122j54n83j5936j3984M707Q602Q384J8712K9545J4567
10030F1160K529n579k3719l6871j5626n04J2531J6043P383m412P771J0161J9784
10017E0651K6317L3972L642l2458l5933j0971r494j3502m696j4813q803M847q482
10004a9723L626K0262J174J3938Q001J964R879J3989j395j9504j6566j0712j5964
9991a1031n891M109J1374J3015L257r280q322k788q304R402J0176J5177k451L604
9977B2047l458j5713J427J930J1769J447J2790P827m554r207n165r158k466l028
$$ y = [9218, 13673, 9187, -289, -5044, -2330, 9438, 23080, 29847, 42511, 45796, 43623, 40037, 21496, 7467, -687, -7444, -5681, -7328, -1186, 7548, 13213, 17189, 6742, -4839, -568, 11116, 16412, 20703, 16049, 18777, 11422, 7300, 7146, 6563, -9373, -23357, -18650, -10048, -1664, 17048, 46593, 61160, 63689, 58110, 34391, -2480, -18106, -18610, -6079, 9964, 17347, 12935, 20706, 30867, 50651, 76968, 110940, 114582, 82124, 46191, 35220, 25726, 12224, 7528, -7285, -16088, -11241, -19723, -16097, 4165, 5339, 19277, 27278, 29242, 39121, 53110, 51715, 32211, 15645, 4933, -11031, -16922, -12813, -1439, 11576, 14833, 5553, -2769, -5557, -13861, -4459, 5717, 20894, 18443, 22047, 18589, 2876, 4303, 6233, 18002, 19449, 32239, 40066, 35512, 26305, 21140, 11982, 9516, 6488]
9963F488J0215M327l941k445r401r866r05J7013J4538q365p965o345M091K675
9949A0114l795K462N677J16j3285J409L316J6330j520r429m128l993j2493Q592
9935f27K2318l606j3961j3608q663Q721J1135k835J563Q514O540K206q048m625
9921E024J189J1878M128j1254M49j3434r629O831n874M153Q222J0650k602R38
9907A0669J7047J2561j2215j3858J4125O485j6853j6532o703Q779L426Q407N443
9894B0781M367q425L718L768k983m874P648P768l477p797J577J3012q36j1471
9880B2776K556M677J6682K2825K548p547k690j252J35J2113R987N814M3762M9537
9866A81923L6002M1148K4718L208k691n736o537K8140L5532N7634O7569L6605
$$ y = [6488, 16703, 21030, 17089, 14644, 5243, -4623, -5528, 11485, 26023, 17658, 9693, 3348, 7439, 10114, 6319, 8781, 14458, 14574, 1289, 2698, 6014, 22344, 20824, 11395, 7267, 3274, -9219, -627, 21691, 18085, 4124, -9484, -18147, -9426, 1709, -1126, 437, 8951, 15491, 17697, 9649, 5024, 6213, 18091, 22219, 10965, 11414, -2020, -11649, -4818, -10692, -6539, 1683, 12333, 9731, 10669, 27716, 40277, 28062, 14204, 28329, 34814, 17961, 1429, -5274, 3505, 6931, 15338, 20781, 25148, 16723, 20441, 24209, 21226, 16352, 24000, 31768, 28291, 20494, 22071, 35083, 34247, 22776, 25332, 30009, 46691, 69516, 72064, 64517, 61827, 60575, 60710, 72823, 82810, 88624, 132386, 181923, 217925, 259073, 283791, 286999, 284308, 278572, 272035, 300175, 335707, 393341, 460910, 497515]
9854D97515l1503p7631p1742n5757k2177J5620K7330K9692K632l0458n3820n1741
9842A77960l8442l6037j9915k1480j9875L461P319l936j555N75N836O032l90P865
9828F7418j110j9246j4379j2420L735J3914R667r715j3239j981L744l567k259
9815B0562r683Q967L210n031L705R470K871r278j1766R268J8922j642j3824M259
9801C0010j833R914Q60j9644o75k19J0097R193n9P880J5420N924q272J873N42
9786F1011M254J3862O916K8060K8035J8086N303K647M615M277J6960M2424N4365
9773B90815J5718k8533l4765k9922k694J1859Q149j0186j4101k0621l9157k8735
9761A17827j8008j0644l856j424J8699K5648L2582M8385K7656R17r93O414L153
$$ y = [497515, 466012, 388381, 316639, 260882, 238705, 254325, 281655, 311347, 313979, 283521, 229701, 177960, 139518, 103481, 83566, 62086, 42211, 45672, 52991, 49055, 47500, 48075, 53911, 59943, 59553, 67418, 66308, 47062, 32683, 20263, 23998, 37912, 47579, 37864, 24625, 22644, 26388, 22821, 20562, 10879, 19846, 23056, 18025, 21730, 31200, 34071, 24793, 13027, 22295, 41217, 39575, 25751, 30010, 28177, 38091, 38951, 19307, 18632, 18413, 28510, 37703, 37644, 45524, 60944, 66868, 58596, 60469, 61011, 65265, 79127, 86043, 114103, 142138, 160224, 165527, 168174, 172789, 177066, 194026, 236450, 290815, 306533, 278000, 243235, 213313, 210619, 222478, 230627, 220441, 206340, 185719, 146562, 117827, 99819, 89175, 85319, 83895, 102594, 128242, 160824, 209209, 236865, 237782, 236789, 243203, 246356]
9748B46356j998j3012N222J7289M4002L8204q795k9005m1071k8385k484m460j6190
9735B05673j9376j7740l4429l2272o243q254j3153j5053k1435o800k654M976k785
9722C0455J087J3797M097p423m617J4133m999j3353n735p134j0369K1J3578M555
9708B8093j6240J754R92L663J1041N655k408j3307j0689m451l765L274L125Q586
9694A5323K9132K775k679L940K5q208j871q854q006M203J7912k582r083j69J6485
9679D8343q953k0491j893L241K711l927Q163k710r318J125L297l19j517J1515
9665B9267n296j1564n56L331N009k857L384P395n06r414K602o103q588k938Q932
9650A2098J1235K3922L180j5481k833j1426k314j245K00L572M020q399r601K030
$$ y = [246356, 244358, 231346, 236568, 253857, 297859, 336063, 327268, 298263, 257192, 228807, 226323, 221863, 205673, 186297, 168557, 134128, 101856, 95613, 87359, 74206, 59153, 37718, 30918, 28264, 33240, 30455, 31542, 45339, 49436, 42013, 37396, 51529, 46530, 33177, 27442, 20308, 9939, 9960, 23538, 28093, 11853, 13607, 14599, 18262, 29303, 34958, 32550, 19243, 8554, 4103, 338, 3612, 6737, 15323, 44455, 47230, 44551, 48491, 48516, 40308, 38437, 29583, 21577, 25780, 43692, 41110, 32027, 31858, 48343, 39390, 18899, 17006, 20247, 22958, 19031, 27194, 24484, 15166, 16291, 19588, 19269, 17752, 29267, 23971, 12407, 11851, 15182, 20191, 17334, 20718, 28113, 27607, 18193, 20795, 14692, 6104, 3166, 12098, 23333, 47255, 50435, 34954, 32121, 20695, 18381, 17136, 17336, 20908, 24928, 16529, 6928, 8958]
9636H958O127M150Q416J2132L738M947q00k1597j1350O378M975L87J225N105L462
9621C6253J3135j036m513L707K476L104J883O822j4730q250J0001J5699K1730
9608H6281J1858R376R425M9275M7551O4015Q1115N7388L9281L1681P5538O8856
9596F31640m49o6096q7701n2316k5500l3599n3966n9106n1679m8694l6800k4467
9584I1267n594L619p10p357j3562Q112j514q760o169L984j768p971k472m151j743
9569D5211J1264J3914j1r658r118O1j388M205P946P787K215r586n951P072R943
9554G3906j0756j0246n134j1228j2945J3542J9458O029L511q49l083J775m141
9541E9839p630Q024P551j2079j0942Q648k216n426q167l095N049P754N023J7196
$$ y = [8958, 15085, 19235, 27651, 39783, 43521, 48468, 47668, 26071, 14721, 21099, 26074, 26461, 27686, 32791, 36253, 49388, 48352, 43839, 47546, 50022, 53126, 55009, 61831, 47101, 38851, 48852, 64551, 86281, 98139, 107515, 116940, 166215, 213766, 277781, 358896, 416284, 455565, 487246, 562784, 631640, 631191, 565095, 477394, 425078, 399578, 365979, 312013, 252907, 201228, 152534, 115734, 91267, 85673, 89292, 88582, 81225, 67663, 75775, 74261, 65501, 59332, 63316, 61548, 53577, 51105, 46954, 45211, 56475, 70389, 70378, 60720, 51602, 51663, 50275, 54480, 62426, 70213, 72428, 62842, 56891, 63963, 73906, 63150, 52904, 47770, 36542, 23597, 37139, 56597, 62626, 66137, 65288, 62205, 63980, 59839, 52209, 60233, 67784, 55705, 44763, 53411, 51195, 45769, 37602, 34507, 39556, 47310, 52333, 69529]
9527F9529M295m082k840K911J561L869j7392j8595J330o88L750P313P713P147
9513F5821O094n812j0228m659M336J7593N092k331j1031p626N10K590O09l512
9499E7446j901J907q16q635N785O129R645n266j542n320n037J6906J8404P02o149
9484H2258j1708p048j0276q95R30q84N706j721M818m592J0403P176r398l913J0923
9469G1779J694J913n575k0765M418m177M071r80M46J795N790N305o355o602K3268
9454G6025L192j1555n960q440J857J5571N08n820Q467J0217R993m839P476N269
9440A01961r108p148j10n564j7884m954J9575J4577J0679p577r093l335O70M277
9426H6966n705J921r906n26P527n445r722j330j9055l133J1611J4614k457j344
$$ y = [69529, 73824, 69742, 66902, 69813, 71374, 75243, 57851, 39256, 40586, 39898, 43648, 50961, 58674, 65821, 71915, 66103, 55875, 51216, 55552, 73145, 78237, 75906, 64875, 57249, 57759, 60349, 60958, 57446, 55545, 57452, 56636, 48001, 53786, 59915, 69560, 64294, 62752, 57432, 52395, 69301, 87705, 88407, 82258, 70550, 63502, 53226, 52331, 53261, 52377, 58083, 56362, 61180, 56588, 66991, 74167, 64769, 60856, 71779, 73473, 75386, 69811, 49046, 53464, 49287, 53358, 52378, 52824, 54619, 60409, 65714, 59359, 52757, 76025, 79217, 67662, 61702, 53262, 55119, 70690, 71198, 65378, 73845, 84062, 94055, 89216, 96692, 101961, 92853, 85705, 85595, 80031, 62147, 57193, 76768, 91345, 102024, 94447, 85354, 82019, 82689, 86966, 81261, 83182, 73276, 72750, 80277, 74832, 65110, 63780, 44725, 41592, 53203, 67817, 65360, 64016]
9412F4016j5403M228J8926O501m939j0561P330R387p778n233N534K214m918R979
9398G9283j0563j918J8157L048M08J127j0542K953J050N575J1578O956J052j0618
9384I7546k936j304J806J263K736k772k146K025P613R95M097l473k812m929o882
9369I0827p904J577O926j1597j1021L567o9J913M0L537j393j0438J2592R936K715
9354I1208j8380J50j202Q965J5941L114J1250j211n997m47K258N247r167q105
9340I3624n542J913J6361J0527j1141K03q298j772K121M724J7944j987n876M905
9326A17706m504n535p191M39K759J1066J0439m679k133o609p625O947L548n927
9312A08701M546M776q985q714J510P701J2886M389n009q911J042j211k676P753
$$ y = [64016, 48613, 52841, 71767, 78268, 73329, 62768, 70098, 79485, 71707, 66474, 72008, 74222, 69304, 79283, 68720, 66802, 84959, 88007, 88415, 89542, 79000, 81953, 83003, 88578, 100156, 107112, 108164, 97546, 94610, 93306, 95112, 96375, 99111, 96339, 94193, 96218, 103831, 104826, 108923, 105450, 102638, 97709, 90827, 82923, 84500, 91426, 79829, 68808, 72375, 72306, 74219, 74259, 77796, 76403, 65965, 78557, 88493, 91208, 72828, 72978, 71776, 80741, 96682, 99796, 111046, 109835, 103838, 103391, 105649, 110896, 101729, 93624, 88082, 89995, 106356, 116883, 105742, 105945, 97647, 95875, 97996, 102720, 120664, 118677, 112801, 117706, 113202, 107667, 100476, 100915, 103674, 114740, 125179, 120500, 118367, 111758, 104133, 111080, 114628, 108701, 113247, 118023, 109038, 100324, 101834, 109535, 122421, 126810, 121801, 112890, 113932, 112721, 110045, 117798]
9298A17798n619q533l534j1560m204J9556J3170J2352K984K177J8591p71j1985
9285A40422q352k289l628R447K860O301O324m710j1534k664J4119Q157o689K472
9271A50236n373o001r819K419J5763q007n996o7P772l84J0323J3637R283r236
9257A64550j6615o584L156R204Q020o552J024o300o509j2602Q841O209J198M108
9243A51148L50j4061k756Q129K393J031R160P418L757L52m932Q263j0124q322
9229A51806o217J0106n435j7972M520J1392O32N490J551O472M614j121p117R530
9215A68251L621r049m503L449l82N315J0442J0533j274m221p557l45N023L965
9201A83268o597k890n80r565N806M548J38J4296M178K273k814j3533j6456k247
$$ y = [117798, 112179, 103646, 100112, 88552, 84348, 103904, 117074, 129426, 132410, 134587, 153178, 152407, 140422, 132070, 129781, 126153, 135600, 138460, 144761, 151085, 146375, 134841, 132177, 146296, 154453, 147764, 150236, 144863, 138862, 129043, 131462, 147225, 139218, 133222, 133155, 140927, 140543, 150866, 164503, 173786, 164550, 147935, 141351, 144507, 153711, 161731, 155179, 156203, 149903, 143394, 130792, 139633, 145842, 147040, 151148, 151498, 137437, 134681, 142810, 145203, 146234, 155394, 162812, 166569, 166921, 161989, 170252, 160128, 151806, 145589, 155695, 150260, 132288, 136808, 148200, 148832, 154322, 155873, 162345, 166959, 165838, 158721, 168251, 171872, 162823, 158320, 161769, 161387, 166702, 177144, 187677, 186403, 182182, 174625, 174280, 179303, 183268, 176671, 173781, 173201, 163636, 169442, 173990, 174128, 188424, 192602, 194875, 192061, 178528, 162072, 159825]
9187A59825R689J5807J3430J0882L440o076r573m882j897k30J0425o19Q397M463
9173B13081Q7O304P306m853p522l023M543J1546j628j0839J59p348O089L661P73
9158B18336r882J914J3533J4064n507M689J4239J23k155j2720q133K977j1573
9145B19905n948L720O299J569M049L53l455P922J2225O838l483l151Q680j295
9131B54228r246M936P549l641l145o970K472K091Q998K263k94J324l880k828n317
9116B48540j433J8112K5630j029o925K224J0359Q134j489j0438m151l243J342
9103B85633P645j519M927N217l803J3709J3849M349Q183O421j5600p654O760O565
9089C34682n79J37L86R255R418j256m17O593Q338M444M313m055J417M672l351
$$ y = [159825, 169514, 185321, 198751, 209633, 213073, 206997, 197424, 192542, 190645, 190415, 200840, 200221, 208618, 213081, 213168, 219472, 226778, 221925, 214403, 211380, 215923, 227469, 225841, 215002, 215161, 207813, 213902, 217563, 218336, 208454, 210368, 223901, 237965, 232458, 237147, 251386, 251509, 249354, 236634, 228501, 231478, 219905, 213957, 217677, 223976, 225545, 229594, 229947, 226492, 234414, 246639, 253477, 249994, 246843, 255523, 254228, 244982, 249918, 257467, 253826, 250681, 243711, 246183, 248274, 257272, 259535, 259241, 260565, 256685, 253857, 248540, 247107, 265219, 290849, 289820, 282895, 285119, 295478, 303612, 302123, 291685, 287534, 284291, 285633, 293278, 291759, 296686, 301903, 298100, 311809, 325658, 330007, 338190, 344611, 329011, 321357, 328117, 334682, 334103, 334240, 334626, 343881, 353299, 352043, 351626, 358219, 366557, 371001, 375314, 371259, 372676, 377348, 373997]
9074C73997j445q313l507P234m577j77J1897Q228k054K25M97o01O029n173m006
9059C78254r699Q434L534J0270l732J521J0440J97q359Q280J9416l269P117J0585
9045D32989M641j4363O625K6364J6791p540j851J0546R583o719R834J8780J3349
9032E19029Q098L540P876O846k095J4384K6648M389R433K416O630O325J5201J4759
9018F43479O117J0858O878m223M297j0760j1257O531l190j0113J461l720N110
9005F41468R537j62p026P04j222m94M464o207M141O774n82J9887J6086N88n125
8990F82831k805N322J2882L126N879J4832O195J0395J4724p089m570M475P612
8977G53809R243k003K094J0177Q542M349J5946K09N12M930J8801J3190J6788J7113
$$ y = [373997, 372552, 364239, 360732, 367966, 363389, 363212, 375109, 383337, 381283, 381508, 382005, 381404, 387433, 382260, 378254, 368555, 376989, 380523, 390793, 387061, 388582, 399022, 399219, 390860, 399140, 418556, 415287, 422404, 432989, 437630, 423267, 429892, 456256, 473047, 465507, 463656, 474202, 483785, 477066, 486900, 505680, 519029, 527127, 530667, 538543, 545389, 543294, 557678, 584326, 588715, 598148, 600564, 607194, 613519, 628720, 643479, 649596, 660454, 667332, 663109, 667406, 656646, 645389, 651920, 648730, 638617, 640078, 636358, 641468, 651005, 650843, 643817, 644521, 643299, 642805, 647269, 641062, 645203, 651977, 651395, 671282, 687368, 687956, 682831, 680026, 685348, 698230, 701356, 707235, 722067, 728262, 738657, 753381, 746292, 741722, 746197, 753809, 763052, 761049, 763143, 773320, 781862, 786211, 802157, 802366, 802878, 807808, 826609, 839799, 856587, 873700]
8963H73700J4293J0467n463O729J9614P013J686R330P472O152P705J3220N06N141
8949I77565k185M690M505J6935J6268P278K3996J5857L982j3477j305J5569J9788
8936A089466J3519J0099J4692J9088J3318J1569L975J7846J8672P590J7410K5674
8924A262918J3586K0313J4995J4514K0700K7756K1660J8540J8936J9258J8840
8913A472016J5036J8364J6974P453K1192L6858L6414K9275L9346L5804K4265P898
8901A760895L4853L1731L1681L1195K5806K6264L9210L6113N0196L2781K5543
8890B126268K3353J8538L0543K7074L5180L7173M0692K8104L0174K8483L0894
8879B456476K7908K6966K9921L7223M9314K8527L8006M0849M8590N0340N1290
$$ y = [873700, 887993, 898460, 892997, 899726, 919340, 926353, 928039, 937369, 944841, 950993, 958698, 971918, 972424, 977565, 975380, 980070, 984575, 1001510, 1017778, 1025056, 1049052, 1064909, 1068891, 1055414, 1054109, 1069678, 1089466, 1102985, 1113084, 1127776, 1146864, 1160182, 1171751, 1175726, 1193572, 1212244, 1219834, 1237244, 1262918, 1276504, 1296817, 1311812, 1326326, 1347026, 1374782, 1396442, 1414982, 1433918, 1453176, 1472016, 1487052, 1505416, 1522390, 1529843, 1551035, 1587893, 1624307, 1653582, 1692928, 1728732, 1752997, 1760895, 1795748, 1827479, 1859160, 1890355, 1916161, 1942425, 1981635, 2017748, 2067944, 2100725, 2126268, 2149621, 2168159, 2198702, 2225776, 2260956, 2298129, 2338821, 2366925, 2397099, 2425582, 2456476, 2484384, 2511350, 2541271, 2578494, 2627808, 2656335, 2694341, 2735190, 2783780, 2834120, 2885410]
8868B885410M9021M1526M9910M9141N7116O6946O0496O5091P0272P5142O2633
8857C532704N8133P7625O0435O8270P1149P7846R1925R1277R7097Q5371Q9934
8846D401766J01296J07961J11440J15976J07297J18648J21960J47354J61667J42707
8836E638072J35191J45925J52299J57708J80750J73805J85337J90837K07265K08588
8826G375777K11936K16775K22808K57945K76648K90279K98265L06795L13862L25133
8816A0096223L44497L74191M02091M13777M25519M56490M92241N08128N44180
8807A4057337N85169O26608O67020P12051P41842P91771Q62188R12162R86652
8798B0942800J047175J130864J212615J314890J400981J520320J625317J765057
$$ y = [2885410, 2934431, 2975957, 3025867, 3075008, 3132124, 3199070, 3259566, 3324657, 3394929, 3470071, 3532704, 3590837, 3668462, 3728897, 3797167, 3868316, 3946162, 4038087, 4129364, 4226461, 4311832, 4401766, 4503062, 4611023, 4722463, 4838439, 4945736, 5064384, 5186344, 5333698, 5495365, 5638072, 5773263, 5919188, 6071487, 6229195, 6409945, 6583750, 6769087, 6959924, 7167189, 7375777, 7587713, 7804488, 8027296, 8285241, 8561889, 8852168, 9150433, 9457228, 9771090, 10096223, 10440720, 10814911, 11217002, 11630779, 12056298, 12512788, 13005029, 13513157, 14057337, 14642506, 15269114, 15936134, 16648185, 17390027, 18181798, 19043986, 19956148, 20942800, 21989975, 23120839, 24333454, 25648344, 27049325, 28569645, 30194962, 31960019]
8790C1960019J911127K075104K261043K452465K668085K914105L167160L463800
8782E2872908L783981M130317M520040M923301N371652N831732O311631O782488
8774I4528050P263791P716372Q099576Q375783Q522656Q479246Q183049P624007
8766A58792530O756857N541162M072455K373207N28130j339750l120011m707936
8758A68896644o005457o996413p684116q082538q242727q196631p997984p663695
8750A08027083p285181o859248o402544n964596n523150n107288m710175m332701
8742F1842200l994722l688169l387991l115265k861130k632293k435759k268054
8734C7458817k091024j912077j774193j648849j535202j440982j352979j255061
$$ y = [31960019, 33871146, 35946250, 38207293, 40659758, 43327843, 46241948, 49409108, 52872908, 56656889, 60787206, 65307246, 70230547, 75602199, 81433931, 87745562, 94528050, 101791841, 109508213, 117607789, 125983572, 134506228, 142985474, 151168523, 158792530, 165549387, 171090549, 175163004, 177536211, 178064341, 176724591, 173604580, 168896644, 162891187, 155894774, 148210658, 140128120, 131885393, 123688762, 115690778, 108027083, 100741902, 93882654, 87480110, 81515514, 75992364, 70885076, 66174901, 61842200, 57847478, 54159309, 50771318, 47656053, 44794923, 42162630, 39726871, 37458817, 35367793, 33455716, 31681523, 30032674, 28497472, 27056490, 25703511, 24448450]
8726B4448450j171430j086296r91154r40446q92516q40189p95022p44804o99513
8717A6287080o65773o28774n86049n43650n21690n02973m79061m42978m17221
8708A1498911m16024l92207l64331l38173l14486l05127l01762k94297k92335
8699H480169k72714k47554k37681k24390k18820k08187j98459j77266j83000j77732
8689F334366j67958j62269j52363j43667j34917j32127j27681j22009j35350j36125
8679D919900j20795j13355j17215j02330j02163j04515r3801p5794o9067q2264
8669C938601q2684q0093q8105q6491p3812n6649n3418o3523o4233n7795n2928
8658C178870l9483n5045n3888n1644m3474m9036n5218m3511n0687m6504l7902
$$ y = [24448450, 23277020, 22190724, 21199570, 20259124, 19366608, 18526419, 17731397, 16986593, 16287080, 15621307, 14992533, 14406484, 13862834, 13341144, 12838171, 12359110, 11916132, 11498911, 11082887, 10690680, 10326349, 9988176, 9673690, 9368563, 9066801, 8772504, 8480169, 8207455, 7959901, 7722220, 7497830, 7279010, 7070823, 6872364, 6695098, 6512098, 6334366, 6166408, 6004139, 5851776, 5708109, 5573192, 5441065, 5313384, 5191375, 5056025, 4919900, 4799105, 4685750, 4568535, 4466205, 4364042, 4259527, 4165726, 4089932, 4020865, 3938601, 3855917, 3775824, 3687719, 3601228, 3527416, 3470767, 3417349, 3353826, 3289593, 3231798, 3178870, 3139387, 3084342, 3030454, 2978810, 2935336, 2886300, 2831082, 2787571, 2736884, 2690380, 2652478]
8647B652478l2621k7065k8697l3792m0586l2116l8634l9719m2195l8328l1105
8636B267620m1245l3049l3115l7233m4652l8831k3880k1868k0539j6180k8175
8625A928853j9006l4223l1621l1297k1775k7365k0159k7434k3443k7698j9062
8614A645770j9607k7983l0563j8317j3516k7727l0032k0900j1133K390k897j1277
8602A434208j269j0600l1134k3387j4207j9434k0618k2310r044l991j3515k1967
8590A242732l1154l4127j7392k6462k0125k831o840j4164j8169j6386j2072j8185
8578A024825l231j9248j4696j2598j8412j4193k093k391L453j383M108P531J470
8565I53142Q347j3238k9393l0571j5293n626l0439k4327n900j4219k111j0799
$$ y = [2652478, 2619857, 2592792, 2564095, 2530303, 2489717, 2457601, 2418967, 2379248, 2337053, 2298725, 2267620, 2226375, 2193326, 2160211, 2122978, 2078326, 2039495, 2015615, 1993747, 1973208, 1957028, 1928853, 1909847, 1875624, 1844003, 1812706, 1790931, 1763566, 1743407, 1715973, 1692530, 1664832, 1645770, 1626163, 1598180, 1567617, 1549300, 1535784, 1508057, 1478025, 1457125, 1445992, 1448382, 1445485, 1434208, 1432939, 1422339, 1391205, 1367818, 1353611, 1334177, 1313559, 1291249, 1282205, 1278214, 1264699, 1242732, 1211578, 1177451, 1160059, 1133597, 1113472, 1110641, 1103801, 1089637, 1071468, 1055082, 1043010, 1024825, 1021594, 1002346, 987650, 975052, 956640, 942447, 940354, 937963, 941416, 940033, 944141, 951672, 953142, 961489, 948251, 918858, 888287, 872994, 867368, 836929, 812602, 806702, 792483, 790372, 779573]
8553G79573m295l402j7862j4145m225J499J225q591r710n614m017p516k3808o620
8539F72492Q875N76q696l992j3769L207q008k0070j2912J4135J6613J0388k902
8526F55937O755Q492n025J6671J6777J0797J7874M1487L3944J330l2249n0391
8514G22399n0866k8275j6986k2878k2558r916j5266j5601p379P584j7031j1486
8502E11741n488J2484j987L093j3127j7084r456k482N771P389q860j4430n137
8489D62427p345o43j415K545K951N928n878n471L947m654l20m764q565o837J4650
8474D46556J3772K1615J8401J7282L534j1343k2723k1872j0227j4606l965l101
8462D33323o681j333N59j1697j7435q709r861j4224l487j8660j9309l745k002
$$ y = [779573, 775278, 771876, 754014, 739869, 735644, 737143, 738368, 729777, 720067, 714453, 710436, 702920, 679112, 672492, 681367, 681943, 673247, 669255, 655486, 658693, 650685, 630615, 617703, 631838, 648451, 658839, 655937, 662692, 671184, 666159, 682830, 699607, 710404, 728278, 769765, 803709, 805039, 772790, 722399, 671533, 643258, 626272, 603394, 580836, 570920, 555654, 540053, 532674, 540258, 523227, 511741, 506253, 518737, 516750, 519843, 506716, 489632, 480176, 477694, 483465, 490854, 481994, 467564, 462427, 455082, 454439, 453024, 455569, 458520, 464448, 458570, 453099, 457046, 452392, 452072, 447308, 438743, 431906, 446556, 460328, 481943, 500344, 517626, 521160, 509817, 487094, 465222, 454995, 440389, 436424, 433323, 426642, 425309, 425868, 414171, 396736, 388027, 378166, 363942, 360455, 341795, 322486, 318741, 316739]
8449C16739l383k848o389K768J902j833j7744r574k011L072J8556J0210l122m984
8435C01359o640k142J3113M321J1283j0943o811j2300k1494j4075J2375J6959
8423B85005J2646L49p649Q030P634R100Q219K858L285j4802k2867m946j245q359
8409B77258j2883m973L417M576L526p475j0979o360K812O051o696m702M567o935
8395B41204l971J158J735j857N849j0860l563o568M776j949o449J2562p441m827
8381B19799J4578O783M151O35j468P288N363N7n584j8007J723j041j1513j4192
8367B08572R359p877q081K461J3699J7657J7313r449j9102j2945r791m697m048
8354A93071O152R975R84j0557j3300M957j822j1200j2458j834J2710J691N365
$$ y = [316739, 313356, 310508, 304119, 306887, 308789, 306956, 289212, 279638, 277627, 280699, 299255, 309465, 306343, 301359, 294719, 292577, 305690, 310011, 321294, 310351, 303540, 291240, 269746, 255671, 268046, 285005, 297651, 298000, 290351, 298381, 306015, 315115, 323334, 326192, 329477, 314675, 291808, 286862, 285617, 277258, 264375, 259402, 262819, 267395, 270921, 263446, 252467, 246107, 248919, 254970, 248274, 243572, 248139, 241204, 237233, 238391, 240126, 238269, 244118, 233258, 229695, 223127, 227903, 225954, 219505, 232067, 224626, 219799, 234377, 241160, 245311, 245946, 244478, 251766, 257129, 257186, 251602, 233595, 235318, 234277, 222764, 208572, 217931, 210054, 201973, 204434, 218133, 235790, 253103, 243654, 224552, 211607, 201816, 197119, 193071, 199223, 209198, 210182, 199625, 186325, 191282, 189460, 178260, 165802, 163968, 176678, 178369, 183734]
8341A83734m594J524m861j4323q78J0796k489M555j452j324J0910Q073k644n259
8327A81768j2847j541Q69P390J7646J7584p66k1731j683k828q291j3143J496P46
8313A64669o424o866r679L159J593J0352j707j5980j0149n080Q537J6353J0797
8300A59575N231L908p941o211l638n294p846j0138p468r4N093L076j126o249J634
8285A22512N172J537j1027K206l884Q910Q058J7102p146j6167L576j0383L591
8272A24057J0542L37r294J178M957m434k701P9j5340p99Q514j2563j2945J5120
8258A06708R429L263K568k405Q709O369m053J3209l41j1361j2238l685o292j2917
8244I6963j1831L506J2901P299n914k3087j3032J4186Q044n662J1436J5733k420
$$ y = [183734, 179140, 180664, 175803, 161480, 160602, 171398, 168909, 173464, 172012, 170688, 181598, 189671, 187027, 181768, 168921, 167380, 168249, 175639, 193285, 210869, 210103, 188372, 186689, 183861, 175570, 162427, 163923, 164669, 158245, 151379, 141700, 144859, 146452, 156804, 155097, 139117, 128968, 123888, 132425, 148778, 159575, 164806, 168714, 160773, 154562, 150924, 145630, 137784, 127646, 120178, 120084, 125177, 128253, 127127, 120878, 122512, 127684, 129221, 118194, 120400, 116516, 125426, 133484, 150586, 143440, 127273, 130849, 120466, 124057, 134599, 134936, 125642, 126820, 131777, 127343, 124642, 124721, 109381, 108582, 117096, 104533, 91588, 106708, 116137, 119400, 121968, 119563, 128272, 134641, 130588, 143797, 143456, 132095, 119857, 116172, 109880, 96963, 85132, 88638, 101539, 108838, 102924, 79837, 66805, 80991, 89035, 83373, 94809, 110542, 108122]
8231A08122P828O608r722j0844o53J3735O484n888j886j0967j1635k66p45P746
8217I7917Q722O624N630j2785n946j0859j013n695J7354J6729j1767j0912N126
8204I9125R567M35j2352O064K189j3772O304P102J8001k258q681j5260p945o654
8190H1865m665j3154j675R952q46l858j216O616k028L21O114o05K772K928r766
8175G2755p018P078N971J717m359R16l209o033J1172mj762J1646Q883K448n996
8160I4205j868n915O431J036M701O639p127n776N38M273O11k140k1073p845l034
8145F3656J0073q796L803O230J4062J6866j656n842q365q633J733J126J1038j3066
8131H2229N592J2142l267m328L994l25N657p303j0573j858p471M370K096j2076
$$ y = [108122, 115950, 122558, 112836, 101992, 101339, 115074, 121558, 115670, 113784, 102817, 91182, 90916, 90171, 97917, 106639, 113263, 118893, 106108, 100162, 89303, 88290, 82595, 99949, 116678, 104911, 93999, 99125, 108692, 109127, 96775, 102839, 105028, 91256, 97560, 104662, 122663, 120405, 111724, 96464, 88519, 81865, 77200, 64046, 62371, 72323, 71477, 67619, 66403, 73019, 70991, 71312, 77426, 76821, 79593, 82521, 72755, 65737, 72815, 78786, 80503, 76144, 77060, 73851, 67818, 78990, 78986, 77224, 88870, 97753, 100201, 94205, 92337, 86422, 92853, 93889, 98590, 105229, 98102, 92326, 92864, 97137, 97748, 95608, 74535, 66690, 63656, 73729, 64933, 68736, 74966, 89028, 105894, 104238, 98396, 90031, 81398, 83131, 84257, 95295, 82229, 87821, 99963, 96696, 92368, 96362, 96037, 101694, 94391, 83818, 81960, 74489, 78859, 80955, 68879]
8117F8879j0315j338Q925K783P693k231j271N457j4043o151n482J066q225l861
8103D1886R88n4o831Q056K8114P869J82L093Q807l706k559n039m982J959m361
8088G3422l849L161l959q888j200J3981R602J458R378p029M909Q260j6333j0216
8074G2697J799n92n508K081L152o331k499m508n240Q609R201j1886q343j839j111
8059D9682K647l284L425J767m164L46q66N748K5973r425j1907l001j749J0958
8045F6150l20K897O782q602j9906K151N988q995p194K178J1941J2859J0038j7754
8031E8213j9487j70K641J80l979m127M143K263P22m521l751J0977R396J779J558
8016E5837J116K843J8924Q652n105p404p236q901l032o128R40L672J9458L85r028
$$ y = [68879, 58564, 57226, 66151, 68934, 76627, 74396, 73125, 78582, 64539, 58388, 52906, 53972, 45747, 41886, 42874, 42820, 35989, 44045, 72159, 80028, 80210, 83303, 92110, 88404, 85845, 80806, 75824, 77783, 73422, 69573, 72734, 68775, 59887, 58687, 72668, 82270, 83728, 93106, 86077, 90986, 99246, 82913, 72697, 74496, 73904, 68396, 70477, 73629, 67298, 64799, 60291, 55051, 63660, 72861, 60975, 52632, 50793, 49682, 52329, 49045, 52470, 54237, 50073, 50419, 49553, 55301, 81274, 71849, 59942, 56941, 55192, 66150, 65830, 68727, 75509, 66907, 47001, 49152, 55140, 46145, 38951, 41129, 53070, 65929, 75967, 58213, 38726, 38556, 41197, 41377, 37398, 33271, 37414, 39677, 40399, 35878, 32127, 43104, 52500, 54279, 55837, 56953, 59796, 78720, 87372, 82267, 74863, 67627, 58726, 55694, 49566, 50506, 54178, 73636, 74021, 64993]
8001F4993l221q401m085J026M124j0342l426l360O030J9145j835o748m664n38
7987D8698L737O118n621k069J0897q753j299M905N656m834m852L904k941J786
7973E5332M309k422L096J100J852m589p442J6910r070j564Q928L335r207r967
7959E0601K73N462J327o616j7358k005M591K427K258O02O423k997L474m710j2378
7944C1374L146J566P602j5136j0783J904K416N38j1248r29J5588J8860Q97j850
7930D3945l388j542m69p815N567L198P401R015m26L426o853l766J0267O841j954
7915F3447k1345j1526J3479M498j010j279n822j8342k880J3116J0020r588m825
7902B7943O821m75q366K815P839N380q09j2829j5168O635P814q340n421J600R204
$$ y = [64993, 61772, 53371, 49286, 50312, 54436, 44094, 40668, 37308, 43338, 62483, 60648, 53900, 49236, 48698, 52435, 58553, 52932, 50863, 61760, 53007, 51708, 56613, 62269, 57435, 52583, 56487, 53546, 55332, 59641, 57219, 60315, 61415, 63267, 58678, 51236, 68146, 59076, 57512, 66440, 69775, 60568, 50601, 50874, 56336, 57663, 51047, 33689, 31684, 36275, 38702, 40960, 41562, 47985, 44988, 48462, 43752, 31374, 34520, 36086, 43688, 28552, 17769, 19673, 22089, 22627, 11379, 10450, 26038, 44898, 45795, 43945, 40557, 39015, 38546, 30731, 36298, 39496, 46897, 55912, 55486, 58912, 52059, 48293, 58560, 65401, 63447, 42102, 30576, 44055, 48553, 47543, 46264, 40442, 22100, 19220, 32336, 42356, 32768, 27943, 34764, 34289, 25923, 28738, 36577, 41957, 41148, 28319, 13151, 19786, 27600, 19260, 13839, 15439, 24643]
7887B4643N973j0738j6558L284M857n196K646Q245J5522N534j35p401j2379M854
7873B3151K633m55L730J1751L291P51j1237j2153m561J268J581l998J2890k489
7859B6153m768M966m29n549K422J1076n100O03m549p830M014L494L889p384Q481
7844B9489K240k775k612j1156n80N548K334m916j712M945P482R54J244M079Q552
7829D3116ql584q327n074n27M62r780J369J891L796Q698j0335j7865p87J1628
7814A4673N829n980J858o979j247l501p429M154J8767R194q296j3332o946n307
7800d542n80N699M554R915K718k517P129K288j0243K405K056k1p862J794n535
7785G258n790j550M298j2198j2927O272J8516J5478j112J3811k151j952o380r569
$$ y = [24643, 30616, 19878, 3320, 6604, 11461, 6265, 8911, 17156, 32678, 38212, 38077, 30676, 18297, 23151, 25784, 25329, 29059, 40810, 44101, 44852, 33615, 21462, 16901, 18169, 19750, 15752, 28642, 26153, 21385, 26351, 25922, 20373, 22795, 33871, 28771, 29374, 24825, 16995, 21009, 24503, 28392, 21008, 29489, 31729, 28954, 26342, 15186, 14606, 20154, 22488, 17572, 15860, 20805, 28287, 29241, 30485, 34564, 43116, 43108, 39524, 31197, 26123, 25596, 26058, 16278, 17647, 19538, 23334, 32032, 21697, 3832, 3045, 14673, 20502, 14522, 16380, 9401, 8154, 4653, -2776, 1378, 20145, 29339, 21043, 7711, 765, -4542, -5122, 577, 5131, 15046, 17764, 15247, 22376, 24664, 14421, 16826, 18882, 18861, 10999, 12793, 7258, 1468, -82, 4216, -7982, -20909, -14637, 3879, 19357, 18245, 32056, 29905, 27953, 21573, 12004]
7771A2004q809J687l708l870M773J834m176k400n498p273k856O606P376k025O384
7756D9o24J2238K759j3710p007N413N441N732l492j64N217n3q314J1989R786K007
7740B7267j4973j944J847N469n319q294m880j602Q865Q733l427r738O569N5l721
7725D907K84j1906j7711r950o06K1119O564J174J3452J1321j894n66M407k1029
7711d34q579M362M450P164q3L401M066n445Q311l904o353k952N710J6653o375
7696A9992m655J714p985l183O200Q55o609O91n877l809J3959J1897n959j1223
7682F008j1435N399P495J5904M532P27p789J160K907L42r220l385L650l978m63
7667A1854P328o047l704l857m274L823J861M502k484m706l109M2j998K792J6096
$$ y = [12004, 3195, 4882, 1174, -2696, 2077, 3911, -265, -2665, -8163, -15436, -18292, -11686, -4310, -6335, 49, -575, 11663, 14422, 712, -6295, -882, 4559, 10291, 6799, 6635, 11852, 11799, 3485, 15474, 25260, 27267, 12294, 10350, 12197, 17666, 12347, 4053, -827, -2429, 6436, 15169, 11742, 2004, 8573, 8628, 4907, 5191, -6715, -24426, -34376, -34982, -13863, -7299, -6125, 7327, 18648, 16754, 16188, 20595, -434, -9013, -4651, -201, 6963, 6880, 10281, 14347, 8902, 17213, 13309, 6956, 4004, 9714, 26367, 19992, 15337, 17051, 9066, 5883, 12083, 12938, 6329, 7020, 1143, -2666, 11293, 23190, 17231, 6008, -5427, -28, 7467, 23371, 27903, 28630, 20841, 22001, 24908, 25250, 16030, 12645, 16295, 12317, 11854, 19182, 13135, 9431, 5574, 1300, 5123, 6984, 11486, 9002, 4296, 1187, 1229, -769, 2023, 18119]
7652A8119k050j1461R49J532m417l436N125J1630m803j7259r666J2176m641R474
7638A272N090j928M172N678n729K755j4455j8985N343P919M399J1677L106K39
7624A0553m354O214q079j7177j337M595R001J0030L92p935k278o354R834J4854
7610A7959q469Q120R15j6616n631m269J7142L965J464L143m385p360o486L593
7596C085Q820L213l397o429j0703O586q452j2426O904L722R179Q609m730M198
7582H179q52j2487r57K063r709P302Q472J3757Q101j0406m784m228n656Q83k5
7567c47j99N151J7453N677q786q344j786j2361J3331J0732L882r189j1785P904
7553A1333J1517j1405k0765N374J732J09J7266J4471N269n684l995L173r820j1398
$$ y = [18119, 16069, 4608, 5557, 7089, 2672, -764, 4361, 15991, 11188, -6071, -15737, -3561, -8202, 1272, 6362, 4434, 8606, 14284, 8555, 11310, -3145, -22130, -16787, -8868, -4469, 7208, 10314, 10553, 6199, 12413, 4334, -12843, -14180, -9585, -584, 9446, 9838, 1903, -375, -6729, 3105, 17959, 9490, 17610, 18525, 1909, -3722, -7991, 9151, 13116, 14580, 17723, 13338, 5978, -508, 3085, 11905, 15118, 11721, 5292, -5411, 1175, -7277, -19703, -12799, -9077, 102, 8711, 3981, 8179, 7327, -5160, -6117, -4054, -13763, -6461, 2011, 15768, 23869, 13463, 8679, 4451, -1205, -322, -347, -546, 4605, 22058, 27735, 18949, 10605, 8819, -3542, 9789, 20521, 24403, 15214, 3429, 11333, 22850, 11445, -9320, -3946, -2214, -2105, 15161, 29632, 34901, 29217, 25222, 28395, 18575, 7177]
7539G177J825r046j1863K854J0791m299k642J600M926n525J568k917j399P398
7525D48J6768N729j3981j6240o059Q416J0119o30r336k774O845J1544J330l264
7511H915k638N294j1547Q80J524l176q682J464R757P548L255o003j409o034j129
7496a981N04N873K846M275j143j1104p899j717N663R486Q768r093l324J672j366
7481A460j3068j5878j373R851J0506J0423q547J805L358p537R1J5492O497l199
7467I881j0662r043L060J3925O907j2204J088J0193Q27j2844p920p811O821m134
7453a1916N999J2928J7165K516r204O443L708j2411j4069j2611N504O492j491
7440i47K001k401p144pN182R51P383n877r508O514J0605J4679J2015j888j9713
$$ y = [7177, 9002, -44, -11907, -9053, 1738, -2561, -5203, -3603, 1323, -4202, -2634, -5551, -6950, 448, 17216, 22945, 8964, -7276, -13335, -4919, 5200, 4570, -4766, -7540, -695, 10849, 12179, 8915, 6277, 11571, 24, 904, 2428, -748, -9430, -7966, 1791, 9339, 12594, 6591, 5182, -852, -1981, -1477, 4396, 7242, 11517, 10374, -730, -8629, -10346, -4683, 4803, 13571, 4478, 1154, 2826, 1460, -11608, -27486, -28859, -19008, -8502, 1921, -6626, -4821, -1463, -9000, -8909, 6583, 13080, 9881, -781, -9824, -6764, 7161, 14068, 1864, 2952, 13145, 13972, 1128, -6792, -14603, -7782, -11916, -5917, 7011, 24176, 26692, 17488, 23931, 27639, 15228, 1159, -11452, -5948, 544, -947, 1054, -1347, -8491, -8498, -3316, -2365, 5018, -859, -10367, -3853, 6752, 21431, 33446, 31558, 11845]
7425A1845j9841q408Q158J0333l613L890J873l738k358p458M961J1828j1916p621
7411a2065J193O852J048l035K460j0439L59M53j3412o968J0407P141k478J27j0286
7396b8643J925q979m637J7604Q861R354k440o121j869N2j866Q25k066J1575M178
7381b247j220M417J268m294j4993L805J2835m282j9412O467J0154R815K957N848
7367A1118k243o545L544j154n208j4006N989J881J7460J56k003M876M410j2886
7353E389l681N486K332m170Q414J2527K343j5845q985J3176l78n950J771l930
7339H499q5J0918q15o832J2391J0907o404K02M05K840K025j1396j4376l729o61
7324C889O557R67j2731n533j78M027j1489n180L191p275M126k477P945L190n064
$$ y = [11845, -7996, -16404, -8246, 2087, -1526, 2364, 4237, 499, -1859, -9317, -4356, 7472, -4444, -12065, -10872, -4020, -2972, -6007, -3547, -13986, -13627, -13174, -26586, -33554, -23147, -16006, -18484, -18357, -28643, -26718, -35697, -40334, -22730, -13869, -4515, -6955, -13076, -14945, -14893, -16759, -15934, -18000, -6425, -2247, -3467, 950, 2218, -2076, -17069, -13264, -429, -4711, -24123, -17656, -7502, 2313, 5270, 11118, 8875, 2330, 5874, 4720, -488, -14494, -8505, -6624, 10836, 10992, 8989, 13865, 18275, 5389, 1708, 7194, 9526, 5356, 13770, 26297, 28640, 12795, 3810, 16986, 16608, 10658, 12429, 8499, 8414, 19332, 18517, 11685, 24076, 34983, 28579, 28781, 29186, 32026, 34051, 22655, 8279, 4550, 3889, 10446, 11413, -1318, -6851, -7029, -3002, -14491, -19671, -16480, -23755, -19629, -22106, -14161, -10971, -16035]
7309a6035k731O264Q580J832N765p866j416M632M253J598m493m311k113K883k923
7294f081L657M435K666Q543r508j5574j5818j298K569m973J6795J9450K91o430
7280a276M157n720k060J8J5003M432j1400J0754m222j4914k291R63j098J002P496
7265H44Q025L917p440Q53j6493O01J5586j0907j0233N355L556J059L604N421j1829
7250h081J858P863m269o060q090Q930k381q72m055L372R83J0327R369l067m302
7235A525J13J526j631q84j2139j883J1854J7872L275l919j567q838n536j9621
7221a9853L966J064K40j1020j3145J2686J0807O561l081J1834N317p728n466J1829
7207D011R134m65k74M168l985l679m781K019O794k318j7063o808M933K053o461
$$ y = [-16035, -18766, -12502, -3922, -2090, 3675, -4191, -5607, -975, 3278, 4876, 383, -3928, -6041, -3158, -6081, -2424, 2011, 4677, 13220, 3712, -11862, -27680, -28978, -26409, -31382, -14587, 4863, 5154, -1276, 2881, -2839, -4899, -4881, 10122, 14554, 3154, 13908, 9686, -5228, -7519, -6556, -7654, -6652, 844, 8869, 12786, 5346, 6199, -10294, -9693, 5893, -5014, -15247, -9892, -6336, -5277, -1673, 3748, -8081, -6223, 1640, -2629, -8689, -16779, -7849, -10230, -11102, -15157, -11785, -10802, -475, 8894, 5827, 1525, 1638, 3164, 1533, 649, -11490, -13373, -1519, 16353, 19628, 15709, 14142, 5304, -232, -19853, -15887, -14823, -14583, -25603, -38748, -26062, -15255, -8694, -11775, 59, 5376, -2352, -7818, 4011, 13145, 12680, 12406, 16574, 12589, 8910, 4129, 6148, 12942, 10624, -6439, -13247, -8314, -6261, -12722]
7192a2722j1438L214j1991K0556J2378k374L15j1522j2913o7M872m228K420M698
7178a8802R479R330J620n126m287K025P74J84K789P768O235n192r877N161R790
7163A1871J0668l13q100j1473j1942K348n62p989J2944O136m821l555m063j447
7149a0298j159j0325J395J5378M348J662r067p795Q56l13K1526O59q034j3927
7135a5094o002R512Q037M614j3087p107L935l038R501J4826j4886j1484q035M207
7121b4101j0p992J831M409L860M659K577J075K238r562L155j172M423N423p83
7106i970J410j1190o372P655K559j714N669K933j0284j817J1016K580n043N344
7092g224M774p69k731k42O694M17j1471p519L377M774M838k417n382p482j9180
$$ y = [-12722, -24160, -20946, -32937, -12381, -3, -2377, -2062, -13584, -26497, -26564, -21692, -25920, -23500, -18802, -9323, 7, 1627, -3499, -7786, -5761, -4987, -4803, -2014, 5754, 11989, 6797, -3080, 2081, 11871, 22539, 22226, 14126, 2653, -9289, -6941, -7503, -15492, -2548, 3588, -1233, -4788, -8851, -10298, -11457, -21782, -20387, -5009, -661, 1001, -8066, -15861, -15005, -15318, 6208, 6867, -1167, -15094, -21096, -11584, -3547, 1067, -12020, -19127, -15192, -18230, -8729, 6097, -8789, -20273, -28308, -24101, -24111, -32103, -30272, -25863, -22003, -17344, -14767, -13692, -11454, -21016, -17861, -19033, -14610, -9187, -9970, -8560, -19750, -26122, -18467, -15908, -17622, -11953, -9020, -19304, -21121, -10105, -7525, -12568, -7224, -2450, -3219, -5950, -6192, 502, 919, -10552, -18071, -14694, -9920, -5082, -7499, -12881, -20363, -39543]
7077c9543J2670J4368O014r486L847k234Q056N298K983N931q019j0317j0357O438
7063a4351L569J584J7559J3909l636q627q964k035r044P557j740n328p684j87
7049a7418J1461p811j134J3907K428Q495j639j5123m631k510k69R917l638l577
7035a1542j300o135j931J5894J0432K491o831q708r526k705P489J2268L864l988
7021b28j551o460l415M963J9907L254j3714j945M142r32M40K367K307q739l617
7006c221q634j2689K679J1380l568N572J683q995o54M754r233r306J6670Q44K360
6991a0358P936N828K920q120q158K834P57o021K363J822P593o20r675j332p220
6976a9451o41J9921M670m128j88J51p320p548o25K735q996J3270P181J974j0721
$$ y = [-39543, -26873, -12505, -6491, -15977, -12130, -14364, -6308, -1010, 1973, 7904, -115, -10432, -20789, -14351, -10782, -9198, 8361, 22270, 18634, 10007, 1043, -992, -10036, -2479, -4219, -9547, -17231, -17418, -5957, -13768, -14902, -995, 1433, 9928, 8289, -6834, -11465, -13975, -14244, -4327, -7965, -11542, -12842, -18977, -20908, -5014, 5418, 7909, 1078, -7630, -17156, -19861, -12372, -104, 3760, -228, -1779, -8239, -11654, -6691, 13216, 16470, 2756, 811, 4953, 4021, 4461, 6828, 9135, 396, -3221, -11855, -24544, -21865, -10485, -14053, -8481, -6798, -15793, -16447, -11693, -20926, -30232, -13562, -12718, -10358, -2422, 3406, 6326, -1794, -9952, -7118, -6361, -12382, -10019, -8197, -604, -1224, -10899, -12231, -19451, -20092, -171, 4499, 371, 183, 334, -6986, -14534, -15159, -12424, -21420, -8150, -969, 1005, -9716]
6961i716r375j49J5683L095j603m88L20J2159N349q963m19q9n723l667j357o558
6945a1501m787n9N363k042O546Q643M864j3010j4408m048o414J1033J6244K301
6931a275l900P88K845j351j030Q234K355M774r121q346L823j217j3245p013L026
6916b0653L321j665j955J3405J1205k732j0278p807q844N502J7086Q134o656j3782
6902a5719n34m315m222M907J3761L707l260j6763J004o08O151L106m120J5869
6888a036N01j1909j0802q568J4166J6496N439j3240q815Q779L189J291j321N27
6874e303L265K245j093O061m151q572N776J1791L854q198n971O078n993j0415
6860a0626q228N749p039J29J2403j0404p036q329k243M119J2623J792K86q432
$$ y = [-9716, -19091, -19240, -3557, -462, -2065, -2553, -2233, 9926, 15275, 6312, 5893, 5804, 81, -3586, -4943, -11501, -16288, -16347, -10984, -13026, -6480, 2163, 7027, -5983, -20391, -24439, -30853, -19820, -3576, -1275, -5175, -4387, -1542, -2893, -3923, 4311, 6666, 11440, 2319, -6027, -2204, -3421, -16666, -23679, -20653, -17332, -18997, -20952, -7547, 3658, 926, -9352, -17159, -26003, -20501, -3415, 4719, -1937, -15719, -16253, -20568, -24790, -19883, -6122, -2415, -5675, -22438, -21434, -22042, -15891, -12785, -16905, -1036, -535, -12444, -23246, -31814, -17648, -1152, 4287, -8953, -17768, -8989, -5800, -4509, -5830, -5303, -2038, 207, -886, 5175, 1024, -7548, -1772, 10019, 13873, 5675, -296, 5782, -211, -10626, -18854, -13105, -20144, -20015, -7612, -18016, -25052, -33381, -35624, -31505, -18882, -17090, -16804, -25236]
6846b5236m335j681j0977L174R213J7906R723J0402Q328j1665J348j484k989R589
6832A1316Q27o334r989K823L466p762j1102r945L354L491j0689J2033Q244O963
$$ y = [-25236, -29571, -31252, -42229, -39055, -29842, -11936, -2213, 8189, 16517, 4852, 6200, 4716, 1727, 11316, 12143, 5809, -4180, -1357, 2109, -5653, -16755, -26700, -23346, -19855, -30544, -18511, -10267, -3304]
$$ [...]
##END NTUPLES=NMR SPECTRUM
##END=
