##TITLE=Analysis number 327185
Compound Code rh 00619
Project Code adrs
Chemist Name stores
##JCAMPDX= 6.0         $$ Bruker NMR JCAMP-DX V2.0
##DATA TYPE= NMR SPECTRUM
##DATA CLASS= NTUPLES
##ORIGIN= Bruker BioSpin GmbH
##OWNER= nmr
$$ XWIN-NMR		Version 3.5
$$ Wed Mar 14 11:41:09 2007 GMT Standard Time (UT+0h)  MAYBRIDGE\nmr@NMR_250MHZ
##.OBSERVE FREQUENCY= 250.131544655141
##.OBSERVE NUCLEUS= ^1H
##.ACQUISITION MODE= SIMULTANEOUS (DQD)
##.ACQUISITION SCHEME= undefined
##.AVERAGES= 16
##.DIGITISER RES= 18
##SPECTROMETER/DATA SYSTEM= dpx250
##.PULSE SEQUENCE= zg30
##.SOLVENT NAME= CDCl3
##.SHIFT REFERENCE= (INTERNAL, CDCl3, 0, 16.522)
##AUDIT TRAIL= $$ (NUMBER, WHEN, WHO, WHERE, WHAT)
$$ ##TITLE= Audit trail, XWIN-NMR		Version 3.5
$$ ##JCAMPDX= 5.01
$$ ##ORIGIN= Bruker BioSpin GmbH
$$ ##OWNER= nmr
$$ C:\u/data/dgb/nmr/ADRS/870/pdata/1/auditp.txt
$$ ##AUDIT TRAIL=  $$ (NUMBER, WHEN, WHO, WHERE, WHAT)
(   1,<2007-03-14 11:40:28.64 +000>,<MAYBRIDGE\nmr>,<NMR_250MHZ>,
      <created by zg, POWCHK disabled, PULCHK disabled
       configuration hash MD5:
       49 4B E0 1D 92 C2 6B 37 9F E6 65 BC 52 41 86 1D
       data hash MD5: 64K
       EE 80 AB FC 26 E9 4A 14 4C 89 EF 38 BA 4E 81 52>)
(   2,<2007-03-14 11:40:50.73 +000>,<MAYBRIDGE\nmr>,<NMR_250MHZ>,
      <Start of raw data processing
       ef LB = 0.3 FT_mod = 6 PKNL = 1 SI = 32K 
       data hash MD5: 32K
       06 84 95 41 05 CD FF D0 E9 3F FD B3 1E 13 AF 3D>)
(   3,<2007-03-14 11:40:56.26 +000>,<MAYBRIDGE\nmr>,<NMR_250MHZ>,
      <apk 
       data hash MD5: 32K
       D2 7F E1 9D 61 6F FD F0 1D 93 3B FE 2E CA 6A AE>)
(   4,<2007-03-14 11:40:57.73 +000>,<MAYBRIDGE\nmr>,<NMR_250MHZ>,
      <abs ABSG = 5 
       data hash MD5: 32K
       83 FC 70 DA CB 5C A3 FC B2 05 07 B8 5C 81 5C 16>)
$$ ##END=
$$ 
$$ hash MD5
$$ 85 1F AA CB D7 C5 CE 87 19 19 AC A7 9B DF 7B 67
##$RELAX= 
##$RELAX= 
##$RELAX= 
##$RELAX= 
##$RELAX= 
##$RELAX= 
##$RELAX= 
$$ Bruker specific parameters
$$ --------------------------
##$DU= <C:\u>
##$EXPNO= 870
##$NAME= <ADRS>
##$PROCNO= 1
##$TYPE= <nmr>
##$USER= <dgb>
##$AMP= (0..31)
100 100 100 100 100 100 100 100 100 100 100 100 100 100 100 100 100 100 
100 100 100 100 100 100 100 100 100 100 100 100 100 100 
##$AQSEQ= 0
##$AQ_mod= 3
##$AUNM= <au_zg>
##$AUTOPOS= <27 >
##$BF1= 250.13
##$BF2= 250.13
##$BF3= 250.13
##$BF4= 250.13
##$BF5= 500.13
##$BF6= 500.13
##$BF7= 500.13
##$BF8= 500.13
##$BYTORDA= 1
##$CFDGTYP= 0
##$CFRGTYP= 5
##$CHEMSTR= <none>
##$CNST= (0..31)
1 1 145 1 1 1 1 1 1 1 1 1 1 1 1 1 1 1 1 1 1 1 1 1 1 1 1 1 1 1 1 1 
##$CPDPRG= <>
##$CPDPRG1= <>
##$CPDPRG2= <>
##$CPDPRG3= <>
##$CPDPRG4= <mlev>
##$CPDPRG5= <mlev>
##$CPDPRG6= <mlev>
##$CPDPRG7= <mlev>
##$CPDPRG8= <mlev>
##$CPDPRGB= <>
##$CPDPRGT= <>
##$D= (0..31)
0 1 0 0 0 0 0 0 0 0.06 0 0 0 0 0 0 0.0002 0 0 0 0 0 0 0 0 0 0 0 0 0 0 
0 
##$DATE= 1173872424
##$DBL= (0..7)
120 120 120 120 120 120 120 120 
##$DBP= (0..7)
150 150 150 150 150 150 150 150 
##$DBP07= 0
##$DBPNAM0= <>
##$DBPNAM1= <>
##$DBPNAM2= <>
##$DBPNAM3= <>
$$ [...]
##$SUBNAM7= <"">
##$SUBNAM8= <"">
##$SUBNAM9= <"">
##$SW= 20.6930455092707
##$SWIBOX= (0..15)
0 0 3 0 0 0 0 0 0 0 0 0 0 0 0 0 
##$SW_h= 5175.983436853
##$TD= 65536
##$TD0= 1
##$TE= 683.16
##$TE2= 300
##$TE3= 300
##$TEG= 300
##$TL= (0..7)
0 120 120 120 120 120 120 120 
##$TP= (0..7)
150 150 150 150 150 150 150 150 
##$TP07= 0
##$TPNAME0= <>
##$TPNAME1= <>
##$TPNAME2= <>
##$TPNAME3= <>
##$TPNAME4= <>
##$TPNAME5= <>
##$TPNAME6= <>
##$TPNAME7= <>
##$TPOAL= (0..7)
0.5 0.5 0.5 0.5 0.5 0.5 0.5 0.5 
##$TPOFFS= (0..7)
0 0 0 0 0 0 0 0 
##$TUNHIN= 0
##$TUNHOUT= 0
##$TUNXOUT= 0
##$USERA1= <user>
##$USERA2= <user>
##$USERA3= <user>
##$USERA4= <user>
##$USERA5= <user>
##$V9= 5
##$VALIST= <valist>
##$VCLIST= <CCCCCCCCCCCCCCC>
##$VD= 0
##$VDLIST= <DDDDDDDDDDDDDDD>
##$VPLIST= <PPPPPPPPPPPPPPP>
##$VTLIST= <TTTTTTTTTTTTTTT>
##$WBST= 1024
##$WBSW= 4
##$XGAIN= (0..3)
0 0 0 0 
##$XL= 0
##$YL= 0
##$YMAX_a= 224440
##$YMIN_a= -264972
##$ZGOPTNS= <>
##$ZL1= 120
##$ZL2= 120
##$ZL3= 120
##$ZL4= 120
##$ABSF1= 16.522
##$ABSF2= -4.171173
##$ABSG= 5
##$ABSL= 3
##$ALPHA= 0
##$AQORDER= 0
##$ASSFAC= 0
##$ASSFACI= 0
##$ASSFACX= 0
##$ASSWID= 0
##$AUNMP= <proc_1d>
##$AZFE= 0.1
##$AZFW= 0.1
##$BCFW= 0
##$BC_mod= 0
##$BYTORDP= 0
##$COROFFS= 0
##$CY= 12.5
##$DATMOD= 1
##$DC= 0
##$DFILT= <>
##$DTYPP= 0
##$F1P= 14.0000005364418
##$F2P= -0.99999901652339
##$FCOR= 0.5
##$FTSIZE= 32768
##$FT_mod= 6
##$GAMMA= 0
##$GB= 0
##$INTBC= 1
##$INTSCL= 1
##$ISEN= 128
##$LB= 0.3
##$LEV0= 0
##$LPBIN= 0
##$MAXI= 10000
##$MC2= 0
##$MEAN= 0
##$ME_mod= 0
##$MI= 0
##$NCOEF= 0
##$NC_proc= -4
##$NLEV= 6
##$NOISF1= 0
##$NOISF2= 0
##$NSP= 0
##$NTH_PI= 0
##$NZP= 0
##$OFFSET= 16.522
##$PC= 1
##$PHC0= -125.2521
##$PHC1= 8.816801
##$PH_mod= 1
##$PKNL= yes
##$PPARMOD= 0
##$PSCAL= 4
##$PSIGN= 0
##$REVERSE= no
##$SF= 250.13
##$SI= 32768
##$SIGF1= 0
##$SIGF2= 0
##$SINO= 400
##$SIOLD= 32768
##$SREGLST= <1H.CDCl3>
##$SSB= 0
##$STSI= 32768
##$STSR= 0
##$SW_p= 5175.98343685301
##$SYMM= 0
##$S_DEV= 0
##$TDeff= 65536
##$TDoff= 0
##$TI= <Analysis number 999999
Compound Code 99
Book Reference 9
Project Code 9>
##$TILT= no
##$TM1= 0
##$TM2= 0
##$TOPLEV= 0
##$USERP1= <user>
##$USERP2= <user>
##$USERP3= <user>
##$USERP4= <user>
##$USERP5= <user>
##$WDW= 1
##$XDIM= 32768
##$YMAX_p= 387778398
##$YMIN_p= -304211
$$ End of Bruker specific parameters
$$ ---------------------------------
##NTUPLES= NMR SPECTRUM
##VAR_NAME=  FREQUENCY,     SPECTRUM/REAL,   SPECTRUM/IMAG
##SYMBOL=    X,             R,               I
##VAR_TYPE=  INDEPENDENT,   DEPENDENT,       DEPENDENT
##VAR_FORM=  AFFN,          ASDF,            ASDF
##VAR_DIM=   32768,         32768,           32768
##UNITS=     HZ,            ARBITRARY UNITS, ARBITRARY UNITS
##FACTOR=    0.157963299565203, 1,           1
##FIRST=     4132.6476996994, 0,             0
##LAST=      -1043.33573715361, 0,           0
##MIN=       -1043.33573715361, -304211,     0
##MAX=       4132.6476996994, 387778398,     0
$$ Real data points
##PAGE= N=1
##DATA TABLE= (X++(R..R)), XYDATA
$$ [...]
21778 -40352 -21548 8220 45168 52245 97350 121220 169056 146513 37830 9947 12763 33667
21766 33667 46718 -1059 -57282 47860 45517 -5557 -10037 -12809 16694 -14088 17043 41535
21754 41535 9813 12838 90553 29438 -37893 35957 -26804 -74843 -43976 -4463 71919 64588
21742 64588 77430 12172 -74617 -56412 -26244 -78924 -106007 -1275 21294 -82842 -61124
21731 -61124 -93480 -155184 -143019 -137096 -59135 37 51611 56957 -20750 -104863 -133839 -104861
21719 -104861 -96529 -87447 -39206 65516 64340 -73437 -113826 46216 5883 -42574 -76959
21708 -76959 -56223 -62792 -149863 -190273 -47756 6390 14797 17297 23499 -23117 -64190 -77104
21696 -77104 -29607 64458 83973 7712 -74278 -89589 -80681 -1244 41058 16535 21373 35352
21684 35352 -70186 -66957 29425 125129 209306 145995 105934 153419 85304 129368 177864 207047
21672 207047 167957 142773 18287 -107762 36115 87096 70556 -11131 -66138 -44284 -22566
21661 -22566 -18749 -53007 -77388 10749 111849 96743 38559 20614 -29582 -93956 -51172 23180
21649 23180 73405 17335 -61175 -93164 -85869 -53809 -19941 -37263 -37569 -37800 -63983 -26044 -20980
21636 -20980 -47133 -46545 -55597 -81051 -47355 1047 -69252 -41185 -26690 -91988 -97332 -106537 -62256
21623 -62256 1448 -9954 -38547 16499 -54245 -25837 18518 -19933 -22189 50130 72309 34539
21611 34539 15541 60538 39291 -52603 32849 115939 138007 110977 3231 5208 -87314 -100723
21599 -100723 -116561 -14364 56240 79833 124702 144996 108874 50054 20156 23787 63729
21588 63729 115340 1152 -40311 -109264 -230603 -190449 -161980 -105547 -62465 14941 29305
21577 29305 -92736 -190614 -98813 11556 -24746 -46934 46167 33130 -53293 -129025 -188603
21566 -188603 -96830 -44990 -87609 -59474 -76965 -21938 -48922 -33466 -52107 -13819 5156
21555 5156 -66833 -125996 -58784 59861 134707 -4207 -127810 -137629 -74629 -50937 -70828
21544 -70828 -158480 -101687 45066 122169 92898 -27786 -148183 -91920 199 -35867 -48006
21533 -48006 -46937 72118 94127 52967 -6580 -54586 -42206 7617 24100 18741 20688 137715
21521 137715 230424 224566 168098 167769 122994 24314 50112 137548 149686 107725 43453 -37979
21509 -37979 -93139 -139686 -90569 -17927 -10059 -18075 -2767 -66570 -94951 -28283 26816 -26950
21497 -26950 52983 72740 64267 -16769 -31526 -12744 -63719 -62687 -40608 -106178 -121772 -61974
21485 -61974 -54107 -30133 -82201 -105391 -96901 -18225 52779 71059 -36905 -22575 31444 89186
21473 89186 71772 -18531 11685 10316 3199 141504 158302 121094 134367 146483 128478 143712
21461 143712 64000 18427 -79929 -101819 -61594 -73037 -52645 -43823 -5792 -85052 -114730 -69544
21449 -69544 -57892 18235 -26965 -69493 -41839 12988 59725 46623 -11900 61642 110307 92038
21437 92038 108813 100257 15560 -19863 -42018 -63056 -114088 -143799 -93491 -132499 -126370 -35014
21425 -35014 35873 37120 51417 124093 67216 40915 -27657 16684 80874 71071 -37287 -117283
21413 -117283 -117987 -3264 32196 -19846 2622 52745 53068 31853 -76345 -74676 22133 58724
21401 58724 25895 81396 139952 78966 15857 -15152 -19171 -5074 -40900 -37303 -2362 -17555
21389 -17555 78948 51584 57864 107149 76210 64377 28217 26053 11434 72011 128112 75808
21377 75808 75115 53899 60114 24432 35761 82394 40540 -15253 8669 -20055 18017 23783
21365 23783 26588 50736 85687 24854 -17275 60890 138435 35270 -21490 -28302 20192 -12100
21353 -12100 35021 61768 22530 1023 101093 51598 70687 107396 116722 117635 102732 29094
21341 29094 24157 -30675 -14832 -20019 -50856 -78426 -72264 -12082 20781 -24161 -67241 -55188
21329 -55188 -14186 -40697 -13601 61529 37960 8666 -5940 49541 70145 62843 1793 15858
21317 15858 16333 -26566 5973 -81253 -160211 -134966 -47839 77014 96003 64911 -15987 -36258
21305 -36258 -88398 -66884 -142671 -89538 -21609 57004 66872 -38474 -81808 -92195 -86751 -95616
21293 -95616 -87249 -20867 2113 1726 -51659 -87450 -102051 -150029 -137743 -61730 -47751 17030
21281 17030 22676 12475 22301 65227 10251 4492 9095 -46615 -45685 -66662 -14632 -40541 -18325
21268 -18325 2507 -108490 -178103 -168097 -132828 -77568 -75183 -110240 -110642 -21390 23976 -4916
21256 -4916 -103271 -97933 951 24927 42456 -38026 316 18313 -5452 -64114 16606 123015
21244 123015 126997 104303 100852 81706 50562 45306 -50877 -41113 -1907 1017 549 60883 99126
21231 99126 84830 57176 43778 31109 -7988 -8993 -39434 -37159 -63711 -32704 -13400 -32434
21219 -32434 23310 56308 26395 -39295 -21331 -952 3067 -27397 -68894 -104258 -17230 -46099
21207 -46099 -52724 -16738 51738 -26843 -77398 -43812 -61448 -113297 -143188 -150640 -45591 -37558
21195 -37558 -48034 -128534 -203132 -194977 -107638 -44190 -40926 -65494 -51059 70200 5874 -26661
21183 -26661 -51426 -131784 -194773 -178645 -84761 -18302 -88419 -72226 -80642 -9291 60477 85674
21171 85674 38693 32496 66159 80864 25130 -57773 -85460 -106574 -146961 -132062 -17127 -26068
21159 -26068 -64049 -65121 -40739 -96145 -91637 -80637 -95795 30968 150050 158775 121347 151801
21147 151801 143692 37415 -7078 36177 53967 23187 -24981 -5988 15348 -5871 6314
21136 6314 109440 97741 65587 111460 50414 -16203 31596 -7706 -8267 63765 104261 131125
21124 131125 44151 -37751 -53908 -51232 -114132 -102131 -140270 -115189 -103360 -92767 -100824 -110462
21112 -110462 -75696 -14371 74982 57388 84809 144484 173615 116520 55201 -19302 16299
21101 16299 -28988 -47577 -46574 55226 108047 106872 113877 117611 107199 66381 -25694 -46992
21089 -46992 -4142 -62249 -125939 -82090 -2240 82998 24822 -14834 -49468 -37797 -12805 121462
21077 121462 106003 12942 -40001 -66136 -39525 -37397 -19562 19823 58258 50194 17113 3475
21065 3475 -15852 -71662 -73877 -61393 -81066 -90266 -38443 8522 37095 3442 -2803 -70805
21053 -70805 -40495 22576 -4218 -64386 -23921 25712 -7978 -99652 28007 52127 -107659
21042 -107659 -176837 -193184 -123705 -106089 -149704 -183221 -181228 -123988 -57196 -84498 -107626 -160276
21030 -160276 -113571 -11892 14997 -657 -19186 93075 84398 46953 -38079 -39930 -76513
21019 -76513 -94583 -105274 -51111 -603 22989 47544 102103 88836 -23255 -80905 -73751 -68606
21007 -68606 -34347 -38502 -54453 -105635 -61175 -32938 -41928 33440 111320 81081 -6380 -8293
20995 -8293 -25357 -7680 -38834 -82920 -135491 -114126 -43706 -4805 -2478 18787 15606 125031
20983 125031 114551 17750 -23042 -92814 -54185 27047 17245 -74118 -147296 -134785 -135046 -108071
20971 -108071 -8291 8277 -34359 -46246 651 59762 53650 94360 55952 60547 75040 -18066
20959 -18066 -95709 -65989 -33776 -19049 -21714 -86930 -94306 -96508 -53050 -4519 33852 34592 14299
20946 14299 26425 -51197 -139413 -91764 -88377 -183656 -143291 -29176 31447 54968 14095 -12255
20934 -12255 28853 40276 2914 -11701 -32238 -20277 -9364 -27686 -8630 34086 79738 88682
20922 88682 86370 16918 -19865 -43364 -1131 -54681 -95127 -24317 15225 24232 -55737 -68952
20910 -68952 -56027 -28164 -16655 -9805 86670 47274 -75373 -110015 -56076 17200 46423 29358
20898 29358 34108 36295 -2391 -9880 -35063 -75939 -23844 -48678 -29052 12090 91567 17953
20886 17953 -15329 -34201 5181 13335 37866 100067 87608 29986 27583 23022 -3252 36053
20874 36053 -1458 -33979 -88071 -89937 -35302 -46909 -100779 -119572 -118096 -58764 -47473 -107183
20862 -107183 -126412 -12190 -26438 -56017 13577 41976 20751 25619 -2883 -73499 -79262 -90038
20850 -90038 -64457 -113438 -133989 -162364 -82738 -26062 -79258 -65027 -11679 29906 67460 -19538
20838 -19538 -69063 -37703 -13106 -50220 -27482 -6719 -29795 -152044 -226772 -151899 -115573
20827 -115573 -147120 -190950 -186580 -151260 -65702 -26013 17107 25348 -36274 -50882 -41378 -95104
20815 -95104 -74089 -93455 -128859 -71364 -96066 -59770 -81371 -169083 -166481 -122907 -56306 -44550
20803 -44550 -26387 -11579 6032 -60318 -6260 30813 3992 -56792 -32098 124793 102018
20792 102018 21374 783 16428 -77302 -79012 -65668 -66820 -56559 -44277 -17693 24052 19098
20780 19098 -40745 -69979 -87814 -134861 -71514 -17986 -46918 -87707 -150046 -129120 -118583 -107650
20768 -107650 -64738 -50131 -75349 -23121 23763 9214 42381 37827 13002 957 -51907 -71555
20756 -71555 -126915 -75335 -25082 23906 -5350 -25445 -28737 -72715 -83537 -43639 -28552 -73875
20744 -73875 -60358 -25824 -98262 -104133 -155078 -153530 -86423 -116521 -61826 -12198 -131139 -171058
20732 -171058 -155544 -34019 21831 3573 22741 49213 64498 -633 66847 137868 117736
20721 117736 77918 66927 60240 12164 -21670 53037 69699 113474 187483 191368 118744 -15944
20709 -15944 -187761 -232391 -204024 -124416 -113310 -74497 -54326 -84973 -84551 -119409 -76931 6094
20697 6094 9144 -37512 -70361 -81763 -118473 -177323 -112287 -83127 -110884 -143882 -165211 -169883
20685 -169883 -267916 -233634 -134293 -151518 -167709 -127880 -132881 -86883 -80843 -147695 -83610 -23434
20673 -23434 -24091 109 25236 14467 -46338 -69667 -148809 -213494 -165121 -191056 -172223 -97776
20661 -97776 22648 28232 -19485 -22846 27815 65105 85754 105581 95127 28356 -35311 -86317
20649 -86317 -13203 -30560 -28599 56469 42721 -23537 -12231 -40453 -97312 -89575 -106871 -131781
20637 -131781 -99226 -79768 -152843 -177461 -131599 -89741 25880 18399 -12892 -50209 -115845
20626 -115845 -48037 -135230 -187952 -211084 -94851 -83882 -125787 -100337 -95959 -103654 -39594 -73197
20614 -73197 -110216 -38546 -12766 52163 71625 12942 -4303 19747 -41393 -76827 -82811 -105242
20602 -105242 -49063 -60352 -107962 -112225 -160379 -154666 -73839 -67787 -67743 -61161 -29202 699 -25498
20589 -25498 44167 -15906 -36622 -20473 -44002 9103 20466 -20982 -58274 -97827 -88113 -89896
20577 -89896 -74480 -56335 -4114 -1708 -17363 -41000 -14945 -27367 -38060 -26050 24220 42592
20565 42592 82275 30345 -36735 -54652 -34799 34882 31288 26709 41079 107619 105139 16978
20553 16978 -98570 -125812 -41438 977 -13277 -3460 -57933 -64734 -125486 -66712 -65076 -81167
20541 -81167 -36321 -718 -82045 -128065 -137777 -98575 -32809 -35949 -14823 -51609 -116887 -71664
20529 -71664 -36682 15765 19835 -35734 -11642 -23808 20835 77141 2093 -104275 -16907 52284
20517 52284 -41865 -572 49794 25819 -30232 -3718 -79240 -81387 -93019 -116507 -10559 56279
20505 56279 108070 -15887 -107949 -73734 -90787 -43706 -124889 -137667 -46857 -28788 -38012 -91159
20493 -91159 -121538 -92967 -80555 -27198 27561 69554 112 -54110 -21662 11661 -68284 3850
20481 3850 24155 42574 35957 34177 56801 37596 83544 81304 75784 116096 67848 86070 79750
20468 79750 60227 28530 -30805 -31357 6350 42130 44959 -8912 -44844 -54381 -109355 -73471
20456 -73471 -2714 33542 32740 24125 -6317 -19376 -59348 -870 115739 101588 11643 -98559
20444 -98559 -97054 -45344 26633 -22555 -57813 69227 47781 67051 84714 72208 -45073
20433 -45073 -110423 -166024 -221911 -167919 -80174 -26416 24171 39424 83407 65000 -5045 -78660
20421 -78660 -86495 -37745 -82505 -101590 -30687 -55999 -14167 -89803 -119130 -45124 9506 41698
20409 41698 50348 36772 40350 14576 -29039 -18994 63182 75926 40702 48296 -54982 19374
20397 19374 19040 55492 60929 -37951 -64279 -93554 -51976 52114 72858 -27202 -137997 -89259
20385 -89259 -4876 6886 4956 -40594 -22637 30382 40031 43620 33603 61159 -18409 -118823
20373 -118823 -86712 -68057 -73115 -52156 -17615 62982 43945 -41577 18147 97882 102585 58784
20361 58784 -15095 -1587 38849 39934 -30 -95800 -54964 -67471 -95194 2697 34754 -47429
20349 -47429 -96210 -54405 -15069 -36854 -71206 7627 91621 111307 75713 47636 65916 166671
20337 166671 161109 140284 90382 56714 -29298 -44751 -75695 -63442 -72021 -69385 -83391 -129850
20325 -129850 -86169 -73023 -22217 -2281 12330 3249 28249 36779 -22875 -2456 -36007 -78832
20313 -78832 -151916 -99031 -10761 11283 -5518 4132 12554 37491 -33587 -33599 22475 33911 -11126
20300 -11126 -74092 -108305 -74563 -57299 4350 -70805 -100428 -84057 -131284 -124579 -108522 -125897
20288 -125897 -111818 -96507 -147489 -206201 -234815 -220550 -88035 10375 10143 -39614 -34795 596
20276 596 -50906 -116283 -153582 -60718 -63857 -41626 -83207 -145082 -55159 1632 -74987 -135259
20264 -135259 -146199 -196199 -99758 43173 45802 -79921 -109926 -56158 -88439 -88919 3782 -63663
20252 -63663 -18551 71952 68279 27783 -33058 -79372 -75622 -32582 63772 98465 141184 159450
20240 159450 91746 62102 77563 12491 -101423 -129646 -123118 -106112 -48057 51473 65697
20229 65697 -23209 41412 49836 18107 28217 -25473 -44484 -53870 -41413 -14529 46852 37164
20217 37164 -4211 -41743 -82082 -46859 -70700 -44613 -21027 50328 23242 39188 66213 -38573
20205 -38573 -97177 -113707 -88209 -50626 6446 46422 62197 64659 -43646 -15906 11192 -57945
20193 -57945 -40443 -7368 -1606 -3955 41784 135002 112794 -7175 -52498 -73609 -118839 -177790
20181 -177790 -131903 -55954 31592 41274 23788 32754 52525 86739 54841 -58001 -73387 16851
20169 16851 60407 82914 123260 33572 -49909 12853 -38514 -47155 -20868 62380 117875 165196
20157 165196 152646 25552 36741 79264 132367 91405 54129 -16471 -29735 -145848 -150936
20146 -150936 -112945 -67440 -35865 -15299 14971 76198 76848 94892 50291 -122219 -147061 -54258
20134 -54258 -36822 -119015 -123124 -102107 -46913 -36659 -63059 -74142 38785 128357 145906 59044
20122 59044 9199 -15648 -27378 -39718 -10180 19914 1992 -4100 -22938 -74916 -122875 -61499
20110 -61499 -80736 -33519 -18225 -4082 20222 -1767 -64674 -105136 -92296 -58669 -97329 -39799
20098 -39799 -49240 -55869 -15130 47800 122962 22618 8343 -18674 -78050 -82042 -98225 -150439
20086 -150439 -97634 15712 -23220 -105459 -73078 -11871 -22636 -23593 -36213 -18855 -72542 -84187
20074 -84187 -105974 -41892 -28320 -106948 -137248 -109469 -76829 -135817 -101392 -34292 -51456 24317
20062 24317 -39448 -49676 14304 45970 7953 67355 97500 34406 -103640 -207681 -167035
20051 -167035 -116137 -101115 -61280 -10932 87472 91417 47437 20955 -68112 -106128 -75403 -35748
20039 -35748 41261 70178 37406 21845 2750 12616 -7272 -18427 39002 42336 17126 41235
20027 41235 62237 2108 -60005 -74803 -35929 72477 67160 -5924 -29480 -55880 -34895 -26095
20015 -26095 -85682 -61371 -97858 -94676 -254785 -253245 -137511 -114950 -128153 -75635 43635
20004 43635 69233 110809 149490 187819 100541 85621 38387 60746 68864 83575 37245 69229
19992 69229 -10148 -33427 -112435 -164766 -91248 -156342 -130665 -134146 -111895 -92282 -118561 -143168
19980 -143168 -92788 -73375 -107498 -34913 53051 -1122 -47164 -25696 48284 35298 48768
19969 48768 70449 35888 -21807 -100461 -129385 -145465 -61095 -20542 -79910 -125287 -143308 -167380
19957 -167380 -172164 -144888 -106508 -22112 13503 48226 122534 97036 102459 22936 -5002 4904
19945 4904 6894 -70661 -90653 -138627 -95632 -99382 -67809 -80897 -87203 -130818 -133285 -87883 -57345
19932 -57345 -98603 -106575 -74420 25966 24673 -13944 83232 -16470 -33381 -66642 -60672 -8303
19920 -8303 9315 74423 88573 11894 76071 154337 58191 -115451 -180631 -130466 -153487 -58489
19908 -58489 36323 66091 -11236 3350 -36020 -137276 -77177 33436 31216 -4587 -22073
19897 -22073 -41759 -7952 6779 35194 136077 110931 92479 11927 -78183 -121801 -97236
19886 -97236 -108136 9582 -22246 -98395 -44131 -748 14566 57472 94401 57016 1117
19875 1117 -14583 39478 47884 7651 -14825 -40655 -63504 -13591 82913 106648 98668 12479
19863 12479 -58162 -72597 -81033 -69980 17090 18345 26655 53875 52974 37307 26574 -1694 -78003
19850 -78003 -141118 -180253 -202450 -247807 -207366 -41495 -30840 -88102 6769 74527 43965
19839 43965 23558 -19337 -134163 -133951 -170739 -190365 -182657 -135719 -163440 -162621 -64954 -26096
19827 -26096 -156191 -222686 -175011 -132137 -115201 -84481 43306 95484 65173 -68260 -130550
19816 -130550 -109602 -45346 11711 22487 5837 -66186 -146693 -124221 -96548 -30844 7567
19805 7567 -23771 -67853 -98554 -69780 -121021 -143633 -98754 -20767 123709 159505 118236 134562
19793 134562 172284 95156 -26669 -168252 -235059 -167356 -147166 -169010 -12987 103650 90644
19782 90644 62741 53244 56566 16170 -57647 -1536 49516 16079 -46589 -62868 -36135 -9150
19770 -9150 32213 7387 -12554 38930 94953 105925 32932 -6325 -18053 -85928 -140269 -127560
19758 -127560 -14776 -4369 -30398 23106 109280 169096 187333 120100 103894 -7718 -61354
19747 -61354 -80551 -77448 8073 79726 100157 93205 76030 -12026 -56001 -60642 29653 101431
19735 101431 113102 99710 69609 -19020 -79388 -158413 -173854 -185619 -8154 130465 -23008
19724 -23008 -31647 38117 12225 -109655 -161429 -101492 -39714 3761 31616 101158 110520 57287
19712 57287 -44620 -68234 -15857 -48462 -9725 25693 97073 85137 57080 53361 13411 2102
19700 2102 5715 6045 44025 63416 -17491 -71121 -92442 -90172 -68279 -67177 -121479 -104593 -82057
19687 -82057 -20349 -20068 -80515 -13760 -32673 -41710 -17452 5217 -19066 -97033 -72062 -27776
19675 -27776 -28753 42133 79863 86647 52214 54190 81932 51978 -7192 59010 17613 -65890
19663 -65890 -65640 -88681 -96107 -73669 -123451 -66708 -16420 3672 15004 -53854 -100599 -111035
19651 -111035 -41860 -66961 20662 72852 75870 3510 -83953 -31344 -43137 -119858 -138100 -56818
19639 -56818 35894 47480 39858 86352 45006 -5195 -71908 -47898 -37398 -12307 -14647 45925
19627 45925 132508 123224 104683 101393 77360 93652 98785 38878 32129 63848 94872 28743
19615 28743 -17044 82821 138008 168464 139597 6069 -60466 -22056 81029 58975 -75280
19604 -75280 -99565 5692 32375 9735 86109 88762 31454 50106 26823 -80934 -113939
19593 -113939 -103397 -114527 -42274 31739 -37848 -105430 -34326 21527 22607 -33576 -56036 -126314
19581 -126314 -155631 -185342 -175912 -120724 -118742 -85790 1099 72288 28896 -51163 -137672 -80706
19569 -80706 -31604 8421 48034 61360 66594 97653 137716 47974 -47061 -23821 -36724 -65315
19557 -65315 -63725 6636 -19086 14513 -13502 -51326 -9686 -18260 -44365 -45687 17918 6838
19545 6838 -19459 19571 25098 29937 20375 30442 7986 -36045 -49445 -10422 -13283 -32595 -8013
19532 -8013 38071 42146 46474 56739 98690 50334 -3784 -45565 -5487 -25575 4886 -85599
19520 -85599 -100350 18268 24489 10951 113146 117874 16190 -34860 -52129 -27314 -22676 -95619
19508 -95619 -42888 -161025 -121242 -20427 40349 -31818 -143440 -138002 -115745 -6497 27531
19497 27531 246 88641 77960 94349 83516 81674 -1546 47770 89732 109459 55559 91177
19485 91177 121533 172357 165856 106498 64463 23754 -22263 -86506 -151554 -123328 -51212 7528
19473 7528 812 -34749 -105176 -140557 -146792 -146799 -94194 -30824 18449 38660 -12637 4595 30234
19460 30234 22472 41904 -6312 -12020 94310 122812 114478 45035 60649 28996 -101188 -142490
19448 -142490 -146850 -57134 8925 39602 36894 6563 -8508 -60076 -82157 -40718 -59327 -39813
19436 -39813 31657 88987 51075 839 -48856 -70938 -121074 -192817 -178611 -175555 -151139 -104458
19424 -104458 -12447 -26401 -68842 -146943 -135477 -100711 -25453 -91062 -155652 -52496 7638
19413 7638 53812 59882 60176 77789 15405 -15343 -6965 -58644 -87500 -31989 -70536 -35037 -15332
19400 -15332 -52370 -38454 5872 -23796 -51168 -82849 -76564 -4129 -35208 -15324 825 -3703
19388 -3703 84356 127273 73411 49241 40575 17039 -34777 -96286 -25364 38403 72389 32034
19376 32034 1508 -40309 -73335 -44432 -74415 -86494 -32677 12743 31054 22380 53042 8761
19364 8761 44415 88125 63876 63577 -2087 34868 65594 -18122 -27333 21902 -1144 -25755
19352 -25755 -158580 -173280 -41055 20828 24105 71726 163546 82724 5098 -2062 -16928 -13517
19340 -13517 -65926 -46072 -680 -36393 -98925 -47307 -55127 -92020 -101784 -68653 11255 159704
19328 159704 162712 93318 78353 35205 -57379 -76511 -52837 -48484 19399 17825 -37049 -56880
19316 -56880 40802 73370 53909 2364 -4986 14271 -11319 -45340 -5446 -64440 -142423 -87448
19304 -87448 -46899 -22450 -39199 -98302 -124296 -62698 -92777 -115124 -141480 -174860 -143768 -69778
19292 -69778 -44676 22086 -12826 -55374 -111143 -144091 -57548 31881 7768 4313 49237 50411
19280 50411 20947 -22114 40799 -5169 -63400 -158083 -159353 -134182 -99457 -23976 38818 70164
19268 70164 30758 -12949 -89871 -31828 -18386 -76288 -54599 -13571 -17649 58944 56646 -59726
19256 -59726 -90130 -76092 -109411 -14093 64897 -9849 -41568 9402 -1439 -30563 -81597 -195542
19244 -195542 -73108 -28572 -54420 -94550 -146627 -149256 -118723 -92479 -59105 -54369 -52644 -15150
19232 -15150 -30463 -49444 -46804 -108215 -92998 -141877 -159890 -95751 -44072 -22877 23821 -73562
19220 -73562 -173475 -68306 3412 17825 59004 -33949 -132694 -109307 -110780 -148862 -108759 -43566
19208 -43566 8699 -36270 -44022 -79995 -42542 332 -3212 -26777 -46240 34045 -10514 -31578
19196 -31578 -1167 -15265 -38693 -5826 87103 125885 11367 -87441 -53859 14707 -56537
19185 -56537 -130061 -203675 -142362 -111278 -130780 -100027 -75254 -79790 -42670 -50034 -78645 -57836
19173 -57836 -106819 -154245 -133985 -55276 -36043 -9366 -16080 19499 -20407 -19749 -89489 -54943
19161 -54943 -64315 -105048 -95629 -33911 30779 26928 -16675 -16870 -3438 50524 115850 101292 50932
19148 50932 79643 38719 -7073 -97852 -58298 -79324 -125676 -153089 -101271 -54690 -118617 -54231
19136 -54231 -47050 -86192 -63466 -26608 -41486 -114267 -74563 -46601 -33378 33300 70629 77933
19124 77933 57422 -46922 -53064 -58724 -125115 -154318 -21426 2178 62225 77673 46990 -22289
19112 -22289 10906 48998 53247 91595 87279 74779 130664 223962 187247 184937 175068 200937
19100 200937 199584 150058 191289 163559 214492 197689 203835 216015 177458 130926 101661 85809
19088 85809 1153 -87157 -28285 4276 -33212 -47030 -25429 -107262 -103346 -33614 39497 75926
19076 75926 15098 45330 76999 159020 236980 197192 64800 7768 56888 46683 -20260
19065 -20260 -30112 -107824 -225451 -171175 -63466 48299 -57335 -155386 -100245 -70968 -30112
19054 -30112 -88324 -78308 -16365 -42971 -62488 -30615 -39504 -46332 13528 22853 -44229 -56284
19042 -56284 -13881 10981 -33862 -3257 12025 -25320 -140358 -66745 -42034 -3358 59199
19031 59199 50976 35938 -51177 -90830 -138259 -210981 -220161 -131137 -100155 -21407 18997 -19746
19019 -19746 88877 145678 88452 22720 -23917 30193 59650 72737 72029 60486 50283 -31570
19007 -31570 -64778 -32674 -40099 -104409 -111515 -81021 -65528 -152909 -134551 -141374 -181896 -171124
18995 -171124 -119823 -108178 -14771 60151 62553 -2597 50300 -20913 -41422 -62076 -53450 -50543
18983 -50543 13144 58162 53883 63677 114524 53100 -32220 1041 2092 -15825 -40851 -49335
18971 -49335 -55642 -96362 -76324 52332 58500 38653 -22165 -128296 -78838 25218 -655
18960 -655 -54441 -115597 -54599 -62209 -77049 -39252 -10082 -71896 -49401 -6007 -25013 -67580
18948 -67580 -44515 -12634 26086 79474 64895 29249 3868 -98731 -84639 -72851 -73659 -44580
18936 -44580 40962 10569 38317 10198 62206 69077 -9145 -16146 -40223 23391 54999 31954
18924 31954 23456 85348 98862 98001 -6377 -71087 -43886 -25024 -48234 -74361 -125121 -60810
18912 -60810 -34591 -77387 -60313 -25754 -51758 -37703 -88025 -204327 -215417 -136655 -105648
18901 -105648 -52701 16711 -4461 -64758 -107811 -63867 33830 8713 -84077 -15299 31884
18890 31884 -75983 -117045 -97042 -89585 -70386 -41561 -19374 -35318 -34035 -49946 -18686 13979
18878 13979 -52630 -93071 -35477 -9236 -59494 -82029 -108259 -91920 -93945 -14801 33095 -19327
18866 -19327 -149505 -186035 -123158 -51583 2406 13310 21856 18720 31200 -34755 -90243 -58739
18854 -58739 -112226 -61422 -22851 -34443 -25527 -46957 -40171 -9005 -1936 -27847 -8721 -59911
18842 -59911 -110301 -107800 -153724 -128197 -12200 5582 -57425 -141949 -177874 -119815 -131490 -56811
18830 -56811 -26443 -28397 -76414 -54547 -40447 -61144 -53359 -83737 -158603 -143063 -66858 44784
18818 44784 39118 -12986 -107343 -67354 -18360 28404 27034 113797 87132 37547 90617 67041
18806 67041 103062 75312 6923 -8176 -32516 -47153 22471 115403 106691 53487 -82142 -42232
18794 -42232 87724 75040 -4675 -18316 14233 84927 47095 719 -35041 -42746 -77092 -37486
18782 -37486 -60240 -58588 62 29067 -8777 -23649 -53536 4637 69821 7226 55813 121883
18770 121883 169663 255309 456094 888379 1313161 1177885 806780 458019 225126 101116
18760 101116 76219 34952 27993 53181 -20870 -12329 14942 -66033 -71532 -110903 -63580 -29244
18748 -29244 54580 40732 -30976 -27256 -54035 -87309 -150579 -67294 49762 33372 36362 84318
18736 84318 114454 -12673 -90995 -67470 -48376 -55662 -26712 -109674 -147918 -79892 -19772 -55385
18724 -55385 -127480 -114537 -35536 -13538 -44733 57286 82213 18812 29937 106619 50243
18713 50243 26415 74755 75981 77969 58409 29424 20231 -44112 -86154 -80456 -91352 -16287
18701 -16287 71965 133397 45645 26572 -4607 -7024 40819 16641 -58829 17628 49564 43766
18689 43766 -36624 -40786 2250 56871 115342 97958 17031 34021 97394 89132 74354 48408
18677 48408 42091 -41422 -37221 -89270 -71510 -9609 10744 -69792 -32403 -48241 -116028 -163243
18665 -163243 -204788 -175132 -152562 -54859 37785 45877 94618 37669 20946 47565 19865 -20904
18653 -20904 -33986 -90556 -100336 -75959 -31456 37322 27353 -62787 -10026 16055 31658 59762
18641 59762 76642 53830 57244 121749 85628 7946 -6409 9754 19037 52265 25276 -56017
18629 -56017 -51984 -4895 6581 -10117 -27101 -95311 -115776 -45063 85853 119645 60505 42575
18617 42575 19669 4672 -54868 -19913 145323 165193 138705 97944 65972 77616 77695 81202
18605 81202 119802 72709 33163 -58505 -105361 -99944 -62920 -23405 81160 60691 3553 -54791
18593 -54791 -84713 -101021 -57466 -61401 833 84341 95131 104762 72386 34446 144675 194853
18581 194853 267596 261248 89356 -52874 -86898 -120682 -51360 -24708 -314 54219 79413
18570 79413 60399 -38203 -37539 -15651 -121695 -209229 -195346 -126208 -120319 -88451 -54479 -4251
18558 -4251 21481 33794 137265 157683 102531 35693 -2101 -6005 -49022 -14601 -68862 -83046
18546 -83046 -103939 -88297 1030 -15377 -116170 -158046 -177868 -118437 -57588 -24406 -23322 -16761
18534 -16761 36290 7449 33588 16938 39719 146982 121422 49405 -33721 -22475 18316
18523 18316 -29833 -8626 -31202 22914 33135 41212 -1608 9887 64441 89504 53040 -28562
18511 -28562 -64582 -61315 -75549 -128972 -113187 -82076 -69767 -25776 -61839 -56532 -9041 -31716
18499 -31716 -28122 95952 69827 38616 -14229 1391 -101368 -156902 -85634 -113843 -75401
18488 -75401 -43620 -59782 -78677 -49993 -1786 57815 88435 -5380 -41183 -55578 -70191 -39473
18476 -39473 -43884 -56427 -43755 -40976 -24290 -62006 -128895 -161739 -116682 -34228 7822 -92134
18464 -92134 -34490 86190 120452 45491 -13957 -21092 -19070 -99439 -25023 -42678 -48231 -30325
18452 -30325 -92563 -71171 -59159 17413 126331 144899 156136 92486 -6180 -246 -70027 -114818
18440 -114818 -69449 -12633 -33237 -92185 -72778 11705 -7683 10575 102782 162697 187917
18429 187917 121767 -6306 -80655 -94172 -71992 -79708 -50167 -2441 -73 -50154 -62687 -68770
18417 -68770 -82588 105122 159836 75692 -21755 -108398 -71755 -36907 32592 -9516 -57476
18406 -57476 13339 50996 -23077 -14231 -16163 -44788 -83914 -13630 15025 71907 132659 161678
18394 161678 119297 13379 -93731 -54717 9804 -43465 27731 103602 78684 61763 126318
18383 126318 139104 145152 165902 176792 137783 55641 96040 143420 144893 86609 29416 -48134
18371 -48134 -10146 -57659 3163 11671 -6020 -60149 -74249 -11882 31240 127589 183092 243465
18359 243465 230581 261457 202281 142211 116415 95827 61730 75595 87566 157338 138374
18348 138374 55804 -40643 -9306 100278 134268 125330 98941 104501 -30563 -18739 75649
18337 75649 32879 -5748 -40190 -45946 -50176 -250 69452 -85440 -60204 54962 99804 98698
18325 98698 72227 110953 160412 145337 130477 22846 -22643 23301 -38164 -102561 -43755
18314 -43755 9865 14913 5695 -20908 -42995 -22861 46873 -11149 31146 30283 37653 6322 -28808
18301 -28808 -32840 24754 38588 -55487 -28429 11731 -16771 -135285 -147539 -48853 29879 7838
18289 7838 -14631 87255 11554 -48482 -39146 7050 97413 8276 1127 17998 -23919 -3795
18277 -3795 -34152 -73060 -23241 -5348 45612 99719 101706 55934 81750 18820 -65820 -9976
18265 -9976 109801 52049 -25380 -96337 -163756 -195718 -192339 -163535 -63035 -32986 -101761 -116724
18253 -116724 -60042 96508 145034 68440 50449 19452 85370 66997 28224 40403 106368
18242 106368 112512 152456 180884 175163 121557 157456 199319 231731 186226 49055 -39509 -13154
18230 -13154 102163 143224 116109 105810 177468 133892 83155 19278 -14216 12568 12024 -1302
18218 -1302 4858 -3316 25254 -21514 -21572 -13190 -38261 -42903 17594 25202 -9463 47968 161810
18205 161810 67139 -17391 46391 144757 155364 30977 -2152 54572 86089 89105 89813 95693
18193 95693 49183 7023 21058 141674 215385 220672 172045 120637 169075 204799 119479 139915
18181 139915 245799 259472 197356 202321 234128 252653 305901 294607 248647 153046 119856
18170 119856 79857 30372 110329 295641 322291 249760 134056 106387 192366 300633 336984
18159 336984 293743 327302 306709 258187 308510 354235 306576 297848 471119 479604 464777 421066
18147 421066 459431 461227 533181 620646 714737 726882 632934 644132 642804 732535 891089 935913
18135 935913 1077679 1172428 1308936 1321735 1277384 1309017 1461209 1642543 1880385 2075603
18125 2075603 2247258 2541845 2877369 3270190 3840286 4456177 5256849 6334804 7749323
18116 7749323 9588654 12204028 16232388 22808354 33786841 53279126 89997652 155285363
18108 155285363 216586838 194972889 125484253 72166490 44487735 30358640 22419778
18101 22419778 17632834 14465730 12114545 10015311 8280321 7072556 5988906 5077259
18093 5077259 4374243 3808229 3364018 2883496 2559581 2375405 2143580 1909825 1604085
18084 1604085 1362389 1224783 1066128 933954 884671 877280 834474 852793 913620 812702
18074 812702 675230 565202 518230 473576 477910 506516 430344 399577 396969 326214 297313
18063 297313 320911 354980 368069 409637 393470 390138 367554 285019 197993 222820 196945 227604
18051 227604 304128 318635 247622 147698 120532 171433 26192 -7211 50278 103053 125461
18040 125461 86996 60388 -29614 -15884 113907 68065 54685 81796 151026 163216 102181
18029 102181 82454 105972 138014 88194 86126 106025 168850 147642 93030 89663 73519 -3389
18017 -3389 34332 50854 -59773 42864 108525 192080 179802 123097 74346 -61958 -102721
18006 -102721 19402 89962 143149 168140 170744 160967 168496 217158 224285 256450 238560 142899
17994 142899 44203 -35844 -14139 6579 79281 223590 186037 152291 157615 217596 261049
17983 261049 304304 131592 -4645 -120568 -104568 8353 79712 6353 -1891 61900 109296
17972 109296 120585 86440 90896 60287 19485 13737 356 -26672 21256 14762 9108 51550
17960 51550 62758 22837 -64864 -7094 96758 128588 81786 -13355 -5729 33422 45264 91110
17948 91110 85822 13862 -35176 -42131 50312 75545 135446 50774 64797 77750 70180 122856
17936 122856 114406 88939 355 -91400 -106167 -98919 -102202 -86718 -46086 -72336 -4790 54659
17924 54659 68753 29236 -16969 -43146 -131531 -142193 -78502 -101249 -177911 -140835 -95025 -57970
17912 -57970 -93965 -30657 -53541 -40386 23699 17194 -74039 -59247 29784 74243 99311 23292
17900 23292 21962 59903 66267 54530 8273 -31716 -59256 -28906 -48050 -18641 49563 60175
17888 60175 106042 47302 -65529 -124589 -24061 43058 66573 -27910 -81736 18797 6180
17877 6180 -85891 -70056 -54367 -178728 -150795 -54899 -55313 -20574 -51192 -108512 -137221 -131206
17865 -131206 -84200 -47263 52764 86234 15285 103811 117932 81259 98168 80128 11217
17854 11217 -52853 -74769 -89280 18279 11753 -93352 1920 56289 72351 136051 169743
17843 169743 143815 69908 68217 21126 -12313 -50936 -73232 -64753 11727 11854 -25248 -49448
17831 -49448 33138 -2395 -112697 -147743 -45542 -30327 -18669 37846 2859 470 64535
17820 64535 67647 62540 -1214 -42367 -21625 28115 102350 85024 79140 37050 18374 -11557
17808 -11557 -38991 -71038 -64791 3032 69014 42689 -52632 -157764 -115480 -111263 -93784 -72064
17796 -72064 245 67743 68696 46893 -62030 -64619 -68051 -70226 -67684 -75618 8009 55861 15183
17783 15183 -38635 -122658 -209955 -143971 -18473 26667 50528 75404 43324 -76849 -45917
17772 -45917 -38308 -66037 -35326 -7841 8828 73866 49931 9185 -24661 47267 34159 -51639
17760 -51639 -56691 -76456 -64906 -28711 11615 39297 101874 144571 45574 36250 58983 16681
17748 16681 -71834 -87610 -85360 -53659 -32034 113871 154461 29727 -73891 -58426 -2354
17737 -2354 29986 145198 101036 85587 139490 57620 68121 99244 97292 44288 9916 -111623
17725 -111623 -139494 -100124 -73105 -48368 -76908 12664 31003 -15835 -23912 -82633 -76585 -64425
17713 -64425 -63621 -64612 -27747 47548 70107 43409 84671 168442 90296 55990 63677 24881 -65709
17700 -65709 -116045 -92681 -63614 50088 62855 -42181 -45508 19741 4927 -92087 -97584 -59199
17688 -59199 -70294 -144237 -181681 -206290 -194435 -99153 -56913 -68540 -846 25567 38489 27644
17676 27644 51962 14600 6210 108465 173987 184715 72601 101282 115233 55065 24818
17665 24818 -7491 52617 -3146 -46628 -43970 -48047 -147279 -56787 29261 -37095 -103947 -54591
17653 -54591 51285 91117 23279 34150 32051 -32285 -91586 -85266 -37871 -47820 13547 82341
17641 82341 58398 65822 53215 -28842 -51133 -21109 80425 196458 163522 41737 -40547
17630 -40547 19594 44146 -78262 -84799 -121590 -147078 -117854 -99674 -51536 -106885 -137639 -56944
17618 -56944 -8788 12944 -39243 -67156 -40105 -4369 -36337 -3099 -47464 -98707 -75248 10928
17606 10928 1359 25604 12756 44540 7862 -132768 -178724 -138379 -74916 -12246 -16953 37651
17594 37651 -5918 15039 66244 82737 -12499 49579 99692 67762 -9120 -62179 -17519 -11452
17582 -11452 -3561 -3202 24515 60539 53138 110150 78657 -36163 -73694 -60632 -42166 -94180
17570 -94180 -199753 -174955 -105046 -60176 -3230 41499 14676 -116894 -164499 -107866 -88260
17559 -88260 -26017 -36754 30057 50426 10301 22147 44115 65493 22504 -45930 -20916 2673
17547 2673 -33270 -4949 1377 -46861 11776 -248 15428 -18210 -131408 -132226 -64660 -71476
17535 -71476 33489 10134 -17025 60270 128065 102459 5715 -97197 -184363 -214047 -199062
17524 -199062 -166679 -63362 -58686 -135385 -191410 -129364 -62248 -42795 -58313 -12278 42299
17513 42299 1697 -25009 -89947 -76652 -80457 -122129 -141350 -146540 -73694 -59990 -136467 -215928
17501 -215928 -162113 -153238 -149509 -113952 -99945 -63721 -68864 -20016 -18436 -27306 -33442 -67085 -36159
17488 -36159 -6662 -3264 -32475 -54751 -32836 -99656 -110646 -41888 -11630 -62189 -55850 -82145
17476 -82145 -23616 27338 100285 65006 32048 95056 76502 95890 87696 40947 29742 67794
17464 67794 97955 62095 -25266 3071 78609 34349 63272 75878 103964 73157 84840 68704
17452 68704 47594 24103 -40356 -23946 46095 178225 307080 383873 508212 882124 1175831
17441 1175831 1018650 637459 412463 250635 174955 107313 55239 86449 198582 167339
17431 167339 140906 142389 44920 26123 49777 69637 21368 435 -4342 -36544 -45816 -18532
17419 -18532 -29798 15025 15149 63962 72631 53658 115255 139648 144239 157487 81175 30656
17407 30656 87504 54158 -13026 27680 13004 -20585 9690 82260 96751 107955 118187 67882
17395 67882 22217 71366 80871 13776 -39540 16313 -18474 -55200 -103323 -82378 -56246 -16609
17383 -16609 107127 121988 137826 177718 238970 178451 46937 -51757 -2698 -27218 -20726
17372 -20726 3156 20526 41619 39327 -32599 -48656 16819 41877 3321 -12404 51026 121419
17360 121419 147712 73245 -78926 -88873 -40097 -90172 -157631 -157746 -128392 -73678 -10075 -10182
17348 -10182 7299 -16050 4723 54054 -2079 -134400 -56039 3663 35311 56872 47397 102566
17336 102566 83613 93923 50293 25985 -105814 -152250 -130676 -90293 -90731 -147026 -168758 -111959
17324 -111959 -7063 -2836 -16029 -35060 -81339 -59907 35768 47097 11811 -25859 -131160
17313 -131160 -88086 -59689 -19661 34590 -130342 -160799 -18824 108839 78617 72361 2713
17302 2713 -21390 -82369 -129199 -62243 34977 -50497 -87942 28202 88597 32897 6583 -63827
17290 -63827 -71032 -38933 -151193 -103862 6190 11233 -33786 -1553 3180 11118 -37295 -66810
17278 -66810 -17093 19229 -13535 -26554 -6779 15599 -10806 -38759 5999 95198 11812 -69968
17266 -69968 -54153 -90483 -51268 20313 58154 63666 103277 73522 52041 36997 37675 -21233
17254 -21233 -17050 3757 61685 -6086 10580 18160 40734 49403 -39669 -58716 -72623 -13772
17242 -13772 -3642 -40160 -13070 -56793 -22752 484 29626 -5323 4888 -16972 -53733 11056
17230 11056 115558 117901 13011 8637 64450 89557 118683 94176 86236 125288 231953 215892
17218 215892 145442 138303 111025 43994 -21650 -9361 43391 47244 86526 62457 92810 69479
17206 69479 81464 104320 80461 71045 26891 -15695 -11786 -1415 49906 56744 76876 110113
17194 110113 82014 60728 84528 49433 117354 98600 104417 140830 137586 123958 111706 73001
17182 73001 71873 127011 167726 124345 56613 107574 75921 -31746 -79640 22074 74285
17171 74285 24400 50567 39453 15610 9716 60406 11482 -43958 59989 193081 105602
17160 105602 22175 -36420 -145258 -179012 -73562 -16098 38420 75114 122741 83579 27539
17149 27539 11462 -2495 48281 50538 10259 61811 -27533 -68889 -15314 3000 40107 60505
17137 60505 14434 35142 8422 -19810 -34076 -102177 -172966 -103950 -97735 -45542 -28812 -36494
17125 -36494 43362 61388 47037 -21624 -71665 -47485 -39419 26138 156509 167856 127864 105389
17113 105389 113172 107701 90685 142133 180167 202490 280240 221029 162833 122797 91222 105382
17101 105382 138164 114919 124921 130678 77838 101517 128384 58426 65532 113253 89571 14246
17089 14246 -122013 -113911 -49300 38696 131594 118511 17285 -37750 -15609 -89915 -112105
17078 -112105 -143119 -114085 -68736 -117147 -83589 2082 -43856 43443 77620 8496 -87720
17067 -87720 -51580 65980 72851 -67994 -148433 -116755 -13832 -54241 -99335 -164800 -131986
17056 -131986 -45347 -47849 -24757 -26345 -34573 13024 -21045 -15633 -69603 43955 63525 41227
17044 41227 -37243 -35146 15763 -17276 80138 116396 65850 65705 126055 96776 22518 -57609
17032 -57609 -70205 -85613 -71629 -94876 -47358 -24005 -6320 62493 39700 15321 38941 62049
17020 62049 22582 7316 -97040 -117304 -63675 2606 27415 40307 97189 172046 105758
17009 105758 36917 52148 84082 75126 192446 146359 43779 89078 190933 145484 158215
16998 158215 184038 151137 108855 107855 135343 114851 172779 226176 212120 268575 226322 118766
16986 118766 -9999 -43539 -98551 -62800 9891 -17561 -68847 -41919 36770 160951 203359
16975 203359 197953 157866 116889 142196 92904 36461 8873 -6034 -38375 -2332 106951
16964 106951 97249 116975 101029 98983 94091 66608 27621 30040 97833 49371 19828 58121
16952 58121 99875 170825 156240 63487 79202 62561 69143 29778 136343 184209 169098 98016
16940 98016 60848 23360 79905 163781 119988 85415 89333 106619 162641 93973 -37605 -93708
16928 -93708 -64974 -27983 -17003 1821 59026 80669 144577 144450 87948 24610 96347 84366
16916 84366 127564 197862 95082 35814 -66882 -115205 -83810 51742 238602 230358 123232
16905 123232 86269 49062 77008 57284 81363 124979 142102 167950 171881 170862 186365 137416
16893 137416 205420 193618 178870 63969 18731 6539 -10898 232 -27753 -7750 -4617
16882 -4617 -27759 7947 72471 51292 84479 166828 160367 91744 172287 226869 193570 170346
16870 170346 156374 113105 110547 154789 154011 51898 -2204 -27985 30234 90637 54912 41668
16858 41668 91926 111241 55587 55962 48941 -33501 -44259 107545 205599 185310 146568 189996
16846 189996 210690 251384 174579 125177 143807 190615 127878 61136 82867 108756 79135
16835 79135 -3563 14789 129613 126134 17829 37281 25718 41940 111055 156827 89464
16824 89464 63197 168057 179626 123390 61164 40061 53343 31974 -16469 7851 40935
16813 40935 129135 136120 204567 135073 86971 106516 117970 105594 58458 -71465 -97542 47550
16801 47550 29566 62883 67359 172410 210825 226919 213015 198798 197190 190685 127375 197259
16789 197259 144720 123291 162086 141445 114072 155197 169658 179378 178403 133674 108655 117456
16777 117456 82255 51424 5803 -11404 57569 100312 145264 165403 147778 85222 19924
16766 19924 22057 66742 119017 110178 95941 143132 200259 264352 293217 231312 188645 214710
16754 214710 195361 163645 39052 43612 63230 83007 125884 103853 110579 115123 120050 122305
16742 122305 161523 193711 192166 198091 178884 190638 103889 37939 110845 109818 101777 98988
16730 98988 78562 29955 -55539 -31005 36103 77642 52052 146816 257143 222990 256177
16719 256177 295677 227999 202191 178880 132856 134900 95944 145879 113661 66778 172642
16708 172642 240015 270932 283880 362222 257062 206238 207895 189178 224452 276038 217986
16697 217986 199482 228738 210609 166413 99583 96228 128995 185251 145011 171153 147983 169027
16685 169027 232126 194674 223623 261895 225894 173699 213337 321129 296907 269525 246557
16674 246557 176320 115504 91860 124983 160516 236698 306781 348737 299605 305375 339976 281761
16662 281761 193053 164605 198719 259336 200439 258443 343801 317599 335618 326918 260861 349708
16650 349708 372093 346436 345161 309548 325516 388804 425728 406568 361219 379474 378362 393848
16638 393848 351113 312988 343926 280043 247677 173550 194647 188659 75152 130579 282525
16627 282525 372234 273968 186801 260473 268161 204474 192206 175536 178295 366005 468782
16616 468782 438275 334922 330109 385911 326219 213075 256175 350408 407201 394477 318660
16605 318660 324558 303516 304206 287909 287042 336140 285806 290265 365238 462651 483406 454526 511934
16592 511934 576468 567087 416275 285745 237081 334805 398571 412224 375430 414429 422874
16581 422874 405894 271455 257991 303166 308722 322671 233051 190596 222101 303645 341141
16570 341141 436980 476329 508803 636537 681544 593965 477770 423436 430035 438402 484240
16559 484240 501498 514222 435695 373928 451549 477897 469201 463882 429700 389954 403710 429780
16547 429780 426050 518614 547505 490380 537538 537997 621431 668171 623613 618506 580635 576930
16535 576930 588903 628474 632227 660226 646233 640203 682500 745627 749799 739402 713584 751441
16523 751441 727573 659366 672805 639245 551904 582688 701456 763656 798065 803776 784351
16512 784351 683323 619811 607659 590204 632893 691566 727355 698344 622553 500856 504653
16501 504653 546314 599928 720698 790148 810547 773632 760054 812370 821144 756920 731859
16490 731859 753327 770237 772949 744957 743902 775137 764884 743534 774422 768157 745252 776895
16478 776895 796498 807950 794868 749209 711090 772930 861579 836043 833321 838626 856488 867543
16466 867543 912863 963371 921293 968087 1013284 1060391 1067172 1064929 1083241 1078250 1073281 979643
16454 979643 940972 1012248 995181 967419 995801 1037669 1071919 1061484 1055429 972148 1054806 1094289
16442 1094289 1102076 1104147 1153723 1223076 1165714 1157069 1245991 1229842 1150580 1133231 1100326 1186074
16430 1186074 1247937 1221038 1252873 1344364 1348255 1297558 1330621 1309009 1302125 1332989 1321935 1306476
16418 1306476 1333696 1421242 1382156 1248962 1307492 1338365 1366403 1350829 1364998 1420809 1480195
16407 1480195 1436303 1410179 1406048 1412822 1448183 1610372 1593652 1625198 1623944 1660192 1646896 1571919
16395 1571919 1585562 1628021 1707302 1756406 1818474 1866222 1920220 1953963 1990674 1928596 1953405
16384 1953405 1962585 1968400 2002813 2032693 2090869 2105365 2097360 2111342 2131917 2129608 2120562 2231752
16372 2231752 2328001 2349603 2321177 2325284 2361479 2372485 2428653 2505245 2590171 2564786 2614395
16361 2614395 2663379 2737476 2726998 2794583 2906457 2916481 2997096 3054743 3059974 3143113 3164422
16350 3164422 3014545 2975412 2987349 3071232 3127379 3173306 3238347 3307720 3401017 3302116 3291866
16339 3291866 3349024 3407398 3493006 3534064 3628113 3689255 3696725 3734471 3720393 3789356 3781600 3740329
16327 3740329 3812398 3962683 4038773 4122275 4229611 4375411 4413842 4375605 4368788 4433155 4433105
16316 4433105 4424829 4522328 4716873 4768199 4779908 4860646 4926825 4985734 4982377 4943840 4977915
16305 4977915 5102100 5143579 5234870 5266569 5396779 5504636 5476985 5451010 5454511 5522463 5617046
16294 5617046 5702136 5808907 5954009 5971245 5870587 5920323 5956045 6043813 6062300 6204394
16284 6204394 6275398 6252951 6338678 6424939 6511540 6522254 6527236 6568889 6661330 6752352 6702533
16273 6702533 6676074 6704003 6871163 7004798 6998468 7052556 7121305 7150366 7099589 7061520 7081666
16262 7081666 7070049 7102703 7176750 7269786 7306764 7323817 7366570 7289427 7247475 7271933 7259439
16251 7259439 7290937 7376420 7453143 7495757 7452963 7379885 7350495 7424420 7357806 7255312 7323905
16240 7323905 7478754 7444523 7390809 7305758 7188053 7253838 7284290 7228915 7230192 7249489 7252237
16229 7252237 7231852 7148053 7111023 7110629 7135745 7106263 7076284 7056815 6974202 6902834 6803128 6746653
16217 6746653 6704781 6787703 6813320 6777857 6696196 6546249 6414329 6386287 6346525 6307687 6261176
16206 6261176 6234850 6208658 6138324 6022441 5984338 5925870 5848117 5761593 5706761 5730683 5660824
16195 5660824 5669838 5642970 5631348 5579755 5464415 5385035 5402737 5329174 5224499 5215667 5217946
16184 5217946 5175713 5104225 5011084 4946875 4970958 4978338 4858645 4716039 4589524 4542243 4499673
16173 4499673 4445545 4352033 4360824 4332588 4307315 4317557 4213912 4086129 4035865 4029061 4020590
16162 4020590 3932802 3883612 3935739 3891794 3805469 3742758 3622719 3598460 3624250 3553577 3492174
16151 3492174 3435650 3329799 3248888 3235013 3162441 3035998 3070868 3141359 3183462 3178001 3060389
16140 3060389 2959993 2851431 2843109 2843899 2820293 2747711 2718032 2738150 2697563 2597051 2501228
16129 2501228 2409739 2441132 2469831 2405354 2371141 2354962 2326330 2414591 2421020 2435838 2343190
16118 2343190 2191770 2109708 2101611 2140733 2139865 2114747 2137563 2083874 2026341 1975790 1951538 1964712
16106 1964712 1864107 1830148 1805043 1750221 1706645 1717882 1727004 1705659 1688962 1664730 1736906
16095 1736906 1731557 1819332 1735651 1687151 1705271 1628035 1610364 1616853 1603170 1548326 1497205 1442390
16083 1442390 1345323 1409800 1437685 1418085 1390555 1436238 1522849 1499321 1412332 1319094 1324139
16072 1324139 1331101 1323342 1377246 1421382 1350381 1350732 1377208 1319540 1142950 1121682 1265860 1294488
16060 1294488 1170944 1047118 1087428 1117073 1100833 1102503 1070086 1087053 1052027 918138 941099
16049 941099 982382 1000256 1073986 1072965 1052193 984519 933971 914323 970855 1033145 973563 968505
16037 968505 1016241 915861 913334 871712 830337 810343 778036 810085 831681 768517 743635
16026 743635 787289 784105 797401 837286 855990 868607 822434 757879 764956 762611 738213 687784
16014 687784 686893 674402 686578 771091 765191 671996 658910 699182 684673 644354 708918 732308
16002 732308 655795 682832 728646 680306 699149 748681 673644 634429 631574 655185 702664 698817
15990 698817 651351 636528 612613 623214 581813 566323 496155 516950 541240 592621 591488 543037
15978 543037 517041 490979 477165 427072 439088 410741 365927 378899 465237 507159 552067
15967 552067 436609 373531 389840 439946 519700 536108 599881 593172 655120 647248 586684 586639
15955 586639 584676 553966 468003 461119 479689 476400 499568 469104 444583 457786 478525 516196
15943 516196 467250 462435 501275 503720 505099 408929 420503 446149 419370 375204 359856 353042
15931 353042 413442 347972 333125 290082 315974 332127 339187 346022 260836 265857 339106 335060
15919 335060 384100 438203 444786 406992 488295 453441 420502 397454 411721 443046 444078 404193
15907 404193 412599 355105 285107 364068 434395 360553 272514 312713 258667 248296 221675 225417
15895 225417 188902 230030 326222 320696 333191 335954 379524 360892 337196 383967 410057 431545
15883 431545 297413 185882 203870 210202 196317 189908 184587 290957 348834 370293 314470
15872 314470 220996 165616 209023 242835 225232 180660 231037 350556 365627 363109 315329
15861 315329 174131 95494 116855 231385 256375 318087 323518 362070 385230 414981 418804
15850 418804 315142 229775 207816 231850 345448 342199 306758 315274 285901 288029 321459 272321
15838 272321 238375 258033 226825 204566 176601 166373 185722 173666 218104 236387 287669
15827 287669 256111 188923 153844 195752 217951 297438 278400 283138 292753 210949 110508 60235
15815 60235 105184 123110 147707 175085 135688 58071 2095 75519 152922 234483 218996 123735
15803 123735 101374 98558 118707 182717 172285 165734 204625 175481 172572 266461 244544 179211
15791 179211 160484 104675 85746 182087 199519 168233 212592 205117 207689 262538 219911 102291
15779 102291 134976 178077 209751 206815 128707 132162 142711 131523 162703 126782 154488 145595
15767 145595 42005 36448 101131 66436 77011 97298 124817 118118 187074 219054 186818 127359
15755 127359 -30164 -110808 -73106 -6798 47485 97056 148922 170454 79378 62238 139148
15744 139148 105106 66222 68521 29637 35021 70428 75798 61576 122981 119663 50698 -16874
15732 -16874 -27363 -2644 97084 66060 77108 11391 112180 149823 163479 207894 224043
15721 224043 197907 161331 142816 135868 120877 115518 72450 36994 11868 29261 103108 90321
15709 90321 85740 90886 125054 116614 33171 54168 32788 15717 -31333 30402 4057 -4827
15697 -4827 90918 272367 221421 114733 101704 133760 148918 90944 65578 38731 76797
15686 76797 95097 91073 119700 94791 122941 177193 135597 90686 25178 46386 121906 143292
15674 143292 206047 118662 49262 120113 149930 140708 80705 53611 61164 -67559 -66274 -39672
15662 -39672 37502 89257 130628 182213 143045 104741 121288 126982 144302 163348 114202 113442
15650 113442 106929 211966 257865 166575 120292 110313 139792 199325 152626 106233 57622 48375
15638 48375 57032 47712 78181 119414 125981 35617 28087 26897 33534 92430 84185 91527 140573
15625 140573 74320 41948 15325 48222 29770 43176 77615 134888 183389 161810 142845
15614 142845 88370 71889 73520 35873 44137 44195 54565 95457 124126 114551 115443 113464 123217
15601 123217 157658 143979 130589 70608 5902 -13649 -1081 -37389 38145 81287 89047 44964
15589 44964 66124 89504 -44123 -25199 -22574 11994 17344 3960 24347 22853 74688 140227
15577 140227 115916 -16545 -14917 -13139 -7197 45741 125231 110375 135009 170725 168443 163737
15565 163737 103527 168999 120483 60517 66961 9794 11233 11523 -14541 14942 83963 199019
15553 199019 162703 124977 95627 207823 243090 155371 51616 11998 -25740 36232 117257
15542 117257 123309 63504 87489 112989 148455 152699 73771 -700 4715 23122 5822 -56254
15530 -56254 -115568 -74930 -11887 17931 77132 148921 165684 140665 99813 73323 124036 128024
15518 128024 59211 54027 80831 87162 99761 133194 137994 86887 81017 130828 194950 227281
15506 227281 153889 116694 119471 134030 103091 76235 138235 181422 83793 25708 7431 68223
15494 68223 98087 88684 48668 -1238 -6382 40328 -5597 41891 147601 191427 167536 187358
15482 187358 198803 49403 1174 22338 38053 -14832 -130040 -119303 -86384 -72401 -85298
15471 -85298 -44779 -9746 46279 -24758 -65019 -26116 -85202 -54442 40983 26574 -85379
15460 -85379 -103229 -14535 -670 37915 111703 57813 -14136 38878 13140 -16495 9081 27533
15448 27533 66935 36736 24232 -28033 46487 97640 84082 146319 99814 76717 65644 71977
15436 71977 104878 126047 153548 146858 118549 106713 115231 61037 73162 102690 131149 147960
15424 147960 37630 -20899 90110 91161 90439 126866 104394 39112 -45932 14061 147460
15413 147460 139145 53957 15106 5431 -16792 -11605 442 -61773 -72593 -109909 -64474 112429
15401 112429 93490 71490 124507 111151 44933 -47270 11708 48935 47961 79542 39243 63192
15389 63192 96640 120168 95583 132247 133110 205662 209977 172559 156412 204053 206828 101374
15377 101374 97787 111961 105363 23092 -36928 14449 86127 46426 70616 35379 38039 77127
15365 77127 17156 -20917 -53097 11519 -42176 64010 100373 140331 100881 90811 40408
15354 40408 39537 72481 79177 14588 19087 74594 80132 56563 79637 75527 67716 116032 121273
15341 121273 177606 237826 96508 54933 21461 -1054 77834 128076 155756 146260 120260
15330 120260 73777 35124 -35100 -49503 -54440 -62016 -70563 -21998 42633 42608 -15911 50711 76396
15317 76396 118865 105426 29867 -24383 -37545 2938 20143 1285 7037 49204 49073 6045
15305 6045 43136 36034 13209 63864 78497 70316 24887 12808 39268 148012 149116 94738
15293 94738 125010 93321 20137 -54346 -31530 33441 -32730 12498 93876 14849 33375 58649
15281 58649 67102 119608 97355 70325 17559 -2854 12737 61941 121974 124177 119005 110581
15269 110581 84267 120440 133536 119757 122932 162690 132033 129798 102138 91029 104310 36862
15257 36862 24243 56782 62632 21182 -19837 -117774 -106318 -71574 -39136 -28150 -40896 40792
15245 40792 106145 39050 -26019 -15371 29703 78310 95476 122931 144506 87778 53882 64336
15233 64336 77290 38192 56558 110998 135560 156881 146416 127259 82796 141662 155235 67704
15221 67704 37656 -43209 -29765 36957 46877 104266 41948 44084 -5727 -38347 -20352 -29188
15209 -29188 -45308 -36425 -5510 73092 117083 55979 -8089 36054 84034 104504 108829 -17495
15197 -17495 -28356 18129 44432 47676 120213 95359 19664 -1853 48608 -16952 -78992 -63326
15185 -63326 -42473 -61659 -87212 -9944 75375 79654 18652 29407 99960 101092 54980 85985
15173 85985 55374 42556 87818 94654 73246 4003 5945 -72043 -147095 -119286 -115294 -46318
15161 -46318 36959 17662 -39143 -9308 86554 145196 131647 2385 -22643 -24881 -129 42272
15149 42272 36993 64847 95004 78356 -18441 -61033 -31599 -20423 -38117 -126442 -128820 -93677
15137 -93677 37746 21821 -46209 13233 -9749 -48355 11249 -28775 -122850 -89082 73649
15126 73649 65369 33491 -37764 -124522 -113099 -14725 69352 91610 109746 38388 38676 -65953
15114 -65953 -58418 -119458 -144633 -137329 -42496 -61189 -23870 18381 -23943 -125919 -64835 -64885
15102 -64885 -4456 44909 57095 90910 38462 39695 46543 55040 55993 -25502 -26732 -50410 -75759
15089 -75759 -32340 -37522 13241 50351 69628 30335 -48997 -96008 -119806 -97729 -592 -12992
15077 -12992 -65480 -93869 -62926 -61791 -56761 43099 159936 88285 50911 21326 -27238 -36593
15065 -36593 5177 33021 50031 41178 11283 -30084 -121561 -94543 -74334 -56043 -17560 -17214
15053 -17214 -39889 -44327 -96325 -108368 -38298 50325 47697 68304 28963 -2542 -44928 -39959
15041 -39959 -32800 -82144 -126625 -106503 19112 163329 134809 31699 35219 48365 1208
15030 1208 -38665 -53140 -38800 -8339 14978 65251 68157 94269 79557 75982 44422 -40308
15018 -40308 26196 -3699 50658 119698 154609 197915 153049 44152 13524 -51676 -94679
15007 -94679 -75925 -12653 -114337 -133001 -67787 -37504 3109 3888 76515 117151 69517 57199
14995 57199 -4870 -69494 -84529 -18587 79042 98355 118970 178424 116506 47302 -44911 -87965
14983 -87965 -51097 9384 16862 21416 86390 142136 128751 79641 42251 -35775 -14848 80864
14971 80864 85543 93324 89225 141216 143951 178918 112622 26017 -22769 -59320 11370 -45610
14959 -45610 -45377 53529 79259 65391 50293 11730 7293 40618 104498 158592 107556 67926
14947 67926 8160 16963 8204 1597 -13267 5051 29403 49559 -1610 6030 -14715 -59982
14935 -59982 -24511 -5724 -21618 -70235 11859 11155 -15295 -22914 -46588 -42076 -79196 -139055
14923 -139055 -131179 -105403 -136330 -107195 -135885 -122806 -113968 -159118 -87475 -1867 -154 -41555
14911 -41555 -146125 -176789 -71862 -83828 -76381 8010 113945 212419 162556 17180 21353
14900 21353 70769 40506 -11258 16079 118123 85766 64738 49226 -39249 -97138 -118137
14889 -118137 -110159 -125928 -125922 -173987 -214650 -117843 -121108 -39106 28232 58692 32256 -8148 -82119
14876 -82119 -11171 -1806 -60183 -89545 -92002 -10253 -48205 -121401 -77614 -41553 -122554 -97480
14864 -97480 -38236 -61719 -39166 -21404 21595 28895 55991 56820 62215 169100 129812 66157
14852 66157 62501 68091 80238 153774 150987 105413 68717 -17639 -58393 -12977 14541 2620
14840 2620 3151 -57001 -75603 -95311 -153627 -212098 -238219 -201895 -122225 -43181 21445 111547
14828 111547 107979 70857 -3762 -60193 -87668 -89957 -26282 34019 78028 54323 129 -14861
14816 -14861 37264 68044 133504 143531 77427 65718 -34923 -55302 877 9791 -27521 -67387
14804 -67387 -90672 -71420 -45968 -9243 -62501 -127765 -148410 -120083 -42749 3942 81066 25842
14792 25842 3208 90241 147267 119360 17240 -48829 -62932 -12028 52279 26074 11584
14781 11584 112478 136620 92793 56776 -12970 51563 54069 -27567 -57803 3962 102892 70923
14769 70923 33397 58851 95031 29530 -40388 -42915 -7531 -30097 -101197 -49035 83446 131002
14757 131002 94707 76195 27800 46137 42462 104772 24957 97926 155695 174738 179279 230334
14745 230334 312959 334569 212606 108913 44649 8475 -5649 -87042 -22362 -3429 3563
14734 3563 19194 -47647 -87262 -24139 2174 4458 -56026 11738 107883 40303 -41647 -49327
14722 -49327 18239 63116 41811 59313 74966 67451 154242 145562 169246 153509 29056 -33114
14710 -33114 -63654 -69409 -37574 -100930 -153243 -132317 -127363 -147098 -95747 9541 29490 58142
14698 58142 78726 117567 35340 -65181 -77125 33520 31261 -12578 -898 64715 59713 -36217
14686 -36217 -100953 -7800 75720 118733 141471 132813 32921 -21558 38831 -14614 -83681 -96865
14674 -96865 -52710 -27973 -11361 21859 20598 28972 76331 82878 114798 114420 74725 99230 138159
14661 138159 44447 4387 53924 -15793 -79109 -38921 3729 71539 178343 214217 178122
14650 178122 16328 -36322 -46011 -137516 -164326 -96193 -62552 -26731 -18416 -39461 26422 -26332
14638 -26332 -102828 -46933 20307 54733 17999 44582 69553 85536 78586 124779 117167 -12664
14626 -12664 -138229 -145265 32768 140285 163795 156549 142475 112103 59812 139956 102649
14615 102649 42571 70040 60748 45683 26983 10463 14228 -33694 -97439 -114225 -26572 -6576
14603 -6576 -45973 -125605 -145735 -130294 -65453 -25180 -91504 -135241 -76798 -108094 -97319 -4076
14591 -4076 -17535 -69654 -138690 -61947 -33091 7606 -4722 3488 19865 -25585 -29138 -33269
14579 -33269 -22819 18151 -1252 -20483 1787 -17442 -54977 -70534 -6979 -86661 -8726 48929
14567 48929 22749 -21747 9152 -2630 -45033 -24288 -39559 -54540 -35978 19331 59607 43915
14555 43915 39839 45638 106117 84957 -12035 -98447 -129880 -100850 -31118 5341 17142 -75134
14543 -75134 -79717 20659 47980 5495 -6661 20922 35616 29305 -56383 -34062 -27932 -30747
14531 -30747 24356 53634 59321 36911 28988 -32435 -38015 -31542 8215 23549 56125 60576 28142
14518 28142 -8049 77111 136314 119949 133984 109496 -958 -37334 -40657 -81629 -72406 -46850
14506 -46850 16531 64934 30387 -9813 9590 -2022 -70628 -8002 27336 -4834 -72262 -12020
14494 -12020 156 43171 20289 -66445 -78792 -2825 -4609 34202 83206 90243 68415 21015
14482 21015 -17807 -47498 -79879 -27821 -2779 -18556 -32672 -46418 -97228 -57061 -30209 -25869
14470 -25869 -19028 -6978 53284 28151 -2340 21843 69982 31819 -50651 -22713 -44590 -78179
14458 -78179 -19697 7321 43954 30369 19617 -38395 -68849 -94601 -86894 -128404 -83729 -91743
14446 -91743 -101883 -30793 -32614 -93698 -67375 46200 57398 -45588 -55930 -26593 -115904
14435 -115904 -107779 -39165 -30437 -45782 27493 -35681 -94130 -5911 -62087 -72618 723 42997
14423 42997 96208 89377 46959 2872 4104 47460 25505 -1786 -85206 -172113 -168866 -101403
14411 -101403 -140589 -187739 -93466 6649 50496 53838 44953 17557 35070 83348 81833 115836
14399 115836 47198 14956 118742 147650 126574 100175 65394 53592 71433 73819 47976
14388 47976 62839 34582 -44436 -30859 -41860 -93264 -68371 -70024 -136606 -162457 -56770 -36378
14376 -36378 -158930 -156115 -152470 -164579 -109156 -111374 -167498 -194064 -171425 -136158 -141281 -122928
14364 -122928 -148328 -73561 -8783 53943 60559 123079 62054 12222 -57275 -28473 -10648 -19206
14352 -19206 47273 -1811 7506 39224 75842 39642 45911 78905 100798 71798 44450 67531
14340 67531 46664 31200 43325 77595 165257 90975 -27798 2984 67217 100633 -5340
14329 -5340 -98217 -106011 -159175 -197591 -167946 -152775 -83968 11338 -35644 -46057 -87744 -78138
14317 -78138 -5415 53782 -13544 -3248 -43409 -75358 -42735 -57132 -48901 -57888 -60072 -52050
14305 -52050 48385 34991 29595 45400 69567 84458 108330 94657 117481 38688 -27669 -18560
14293 -18560 -2945 41991 77691 76180 77084 47155 -41306 -34565 17416 93112 81066 48367
14281 48367 87545 130397 109432 71414 79438 101553 117867 -66 -107445 -94177 -16587
14270 -16587 47123 117874 121021 154408 175437 142149 -24200 -41905 -94300 -74045 -57679 -102618
14258 -102618 -75742 -43731 -20626 37319 8185 5529 -4272 7641 45555 32452 24600 -16211
14246 -16211 -63441 -40651 -57053 -11840 33657 -31977 -127272 -161149 -128083 -156025 -160121 -115398
14234 -115398 -94102 -78986 -44320 -82146 -72065 -5934 5968 -62606 -81454 -77150 -40897 42773
14222 42773 14201 -22285 72708 60902 -37882 3692 31301 73226 18323 25381 26642 15286
14210 15286 -3174 -35200 -16446 23087 10827 -30108 -100811 -41587 -25596 20588 54057 30411
14198 30411 87766 132853 36969 -26744 -71950 -109844 -53906 -22551 -83361 -53867 -89681 -121014
14186 -121014 -126197 -87553 -60958 -50216 -76680 -65305 -39667 -99995 -82130 -67080 17439 61530
14174 61530 47762 8774 -12469 30455 41711 23121 10252 -47292 -20355 6815 68688 93726
14162 93726 91837 90691 -10081 32101 76315 53313 -76687 -144305 -127494 -105280 -83566 -23023
14150 -23023 11200 -46900 -104131 -134141 -111881 -23110 8456 -12596 14797 60173 66628 -5861
14138 -5861 -93309 -91006 -28629 -126311 -96189 -45233 53967 37535 -23310 88405 183734 137999
14126 137999 156736 198709 89209 36058 71174 348 -57610 -29137 44560 67627 -33293
14115 -33293 -58403 -75107 -79093 -33020 -81904 -97865 -54219 -28598 -48753 -94518 -68867 -23037
14103 -23037 -15450 -54271 -56073 -56884 -117383 -168955 -82149 7440 57566 55604 -18938 -2961 -23763
14090 -23763 -40400 23597 72561 118405 92484 -22437 -10323 3710 39367 42463 9786 50883
14078 50883 137951 117551 71092 64525 70849 38899 -17720 -96462 -66592 -82340 26822 113557
14066 113557 35258 -34270 25055 60419 60198 88530 149251 168296 8422 -22062 -4480 31624
14054 31624 -47539 -33313 -161412 -229913 -237083 -196918 -109344 -93398 -43905 -15446 19755 35568
14042 35568 46179 35001 -8459 -88372 -61510 50618 82558 92148 -17685 -93333 13663
14031 13663 65303 44922 -50796 -71109 -69023 -89686 -36080 -39665 -70674 -151443 -126611 -79518
14019 -79518 -59161 -96857 -113412 -67807 -20854 -13014 -87829 -117443 -77236 -31399 -18276 46614
14007 46614 114958 98316 45812 -29694 -1245 -23283 16649 58281 24143 -3558 -35774 -75316
13995 -75316 -105828 -63184 5891 125892 183754 165287 88981 44393 76314 54123 4735
13984 4735 -101700 -139747 -127615 -111794 -98747 -38657 -42572 -12987 -5034 -72029 -124973 -101680
13972 -101680 -159708 -142233 -87445 -34000 -28023 -48901 -27876 -41949 -68704 -28910 32499 42211
13960 42211 4928 -60664 -99965 -32415 -21186 -10566 45652 137681 90602 26241 -14359 -42580
13948 -42580 7057 69908 160110 158902 139204 77265 28894 -10889 2488 18257 18382 38892
13936 38892 145300 201222 152557 39926 47286 117732 119336 169701 147946 90576 79054 71984
13924 71984 67829 39098 20935 22361 67681 154209 58089 -58604 -11506 102961 69784 -6041
13912 -6041 64255 -69621 -68662 -80680 -106870 -106854 -32168 59400 120713 132790 173368 166398 115754
13899 115754 47632 97127 82404 76875 82535 42749 4130 25 121880 67505 -37802 -122279
13887 -122279 -144860 -115102 -82584 -26560 -57604 -85723 -61566 -34900 16532 25177 -65358 -73120
13875 -73120 -17701 15473 49692 -63655 -109963 -22497 -18382 17129 33162 9668 41625 -39156
13863 -39156 -117385 -217945 -188704 -69920 10299 -7130 1830 3960 2268 -80593 14508 150002
13851 150002 156476 199670 175379 45740 4405 -6030 14690 -36080 -46029 -69708 -114654 -48978
13839 -48978 10540 42645 -84 -41644 -40790 -23573 -51175 -45665 -42927 -56682 -11197 28035
13827 28035 -18906 -12546 44120 38679 11627 21383 29383 64466 66591 58306 89762 60404 69187
13814 69187 27263 62915 149741 80696 -6254 -55253 -71371 -98698 -138724 -57808 5305 9078
13802 9078 -14756 -8019 -15894 -18209 42221 17953 -31955 8081 33168 68974 74463 24227 20399
13789 20399 60787 61906 -8474 -117195 -217835 -212945 -85646 -65473 -59888 -137627 -188245 -199166
13777 -199166 -139626 -98293 -57810 -97910 -92010 25503 26958 29607 22264 -11952 -46522 -84705
13765 -84705 -38030 -32358 -61107 -104319 -26549 34363 8027 -79540 -133674 -84968 -11371 -43609
13753 -43609 -64057 948 9896 -100010 -109395 -79215 -102779 -136612 -106182 -75167 -67001 -41438
13741 -41438 -15966 30875 13817 -43941 -57437 32623 76175 42195 6964 2317 93 -15704
13729 -15704 11803 -7520 -101703 -52717 -65118 -85094 -89377 -54958 7433 5151 -21106 -27899
13717 -27899 61022 43654 44630 77780 66059 30847 -35958 -140546 -183303 -208318 -187829 -110730
13705 -110730 -128432 -166993 -160547 -101185 -18008 29983 -5519 -118911 -167324 -169227 -189276 -230988
13693 -230988 -253937 -230941 -161101 -175568 -100896 -10725 104522 85315 60304 19999 -7030
13682 -7030 65444 -15027 -83812 -16333 -51797 -102192 -109112 -30328 103433 83977 42554 -59934
13670 -59934 -25023 -71997 -35465 -36030 -77215 -40496 -9637 -31953 42929 69242 61008 37588
13658 37588 -26989 -171685 -149370 -60558 -40795 -57898 -141114 -201601 -148041 -84426 -8133
13647 -8133 -2867 46009 65839 55816 35007 98660 136224 115934 137027 94638 21759 -7337
13635 -7337 55 -13171 23094 15387 70875 72741 53736 28855 1726 -94585 -17008 21685
13623 21685 58470 -7845 -1620 83737 108028 84587 57816 -13258 -109463 26117 152300
13612 152300 93271 67262 14890 31600 11510 -46683 -18891 -37986 -28515 -57078 -107224 -139156
13600 -139156 -139478 -69225 -11108 -21656 -99162 -128720 -62850 -118024 -186472 -134538 -148403 -118793
13588 -118793 -97369 -104128 -67180 -59582 -154848 -90521 -46594 -35800 -34053 28124 76538 -50559
13576 -50559 -136349 -197335 -240724 -213249 -97562 -40238 -2875 -15985 -44637 -55286 8208
13565 8208 -1449 69205 189853 168944 236497 235575 128107 139808 82013 11626 -12574 -16719
13553 -16719 -68984 -82953 -56603 -89739 -159703 -187580 -143261 -29182 41653 106019 156754
13542 156754 53975 -22629 15237 16363 -16309 -5165 32914 44664 37289 74778 30427 55288
13530 55288 88091 51758 -31093 -47897 17829 232 -98821 -84846 -10912 -16049 38722 18659
13518 18659 -41764 -15944 48616 76421 22646 -18919 -11320 49287 73903 95551 69780 64593
13506 64593 57249 69399 28093 -27466 -28190 16273 32536 27193 164788 193646 120622 34227
13494 34227 -34088 -36304 -44926 -43720 3023 -7190 -65959 -68261 -68093 -45045 -13775 129016 138717
13481 138717 44292 -23373 16363 -81577 -114539 -54291 -8667 55248 -31011 -123587 -113591 -95941
13469 -95941 -87750 -84832 11084 87287 54066 107952 161914 119831 143864 103633 -15756 -24353
13457 -24353 -53116 -30701 -34918 30405 9158 10324 41310 26614 -5913 21682 -50471 -35829
13445 -35829 -10669 -69727 82956 120652 30959 18082 19964 -63531 -84742 -170142 -182231 -53248
13433 -53248 -30265 -46611 -33531 -38092 -51109 -97539 -130572 -76898 -34527 -23196 -3817 5172
13421 5172 26510 43901 -3496 -46853 20371 69714 89663 73072 46367 -45699 -64518 -6256
13409 -6256 127388 142430 205275 137855 78484 106857 -15057 -88262 -152713 -105293 -33941
13398 -33941 -29473 9269 65097 -21849 -87104 51420 109292 -27570 -128209 -142649 -20424
13387 -20424 56280 138580 152702 51390 -39184 -52450 -86599 -123448 -154497 -101773 35234
13376 35234 -18328 -66759 -147488 -153986 -87940 20000 113003 90800 5166 -27221 12702 35897
13364 35897 60178 77772 88186 151818 128907 53856 71968 17571 -69200 -116263 -76496 -37629
13352 -37629 -98268 -75959 -48276 -47871 -29158 -93329 -129487 -30044 -36385 -13541 -44739 -82913
13340 -82913 -113133 -106683 -98925 -88551 5970 66937 -16510 -51937 -19876 165260 181421 54532
13328 54532 21054 18346 -54856 -171184 -147133 -59257 -69076 -123757 -100604 -85796 -42164 -23893
13316 -23893 -115430 -142525 -102725 -87475 -62021 490 111363 79375 -5120 -47632 17815
13305 17815 -32641 -60325 -53935 23901 52485 142733 203568 83752 29881 31485 39843 37948
13293 37948 -16958 -54605 -77593 -46080 -58375 -101487 -98266 -33769 -80213 -186192 -147936 -67422
13281 -67422 57117 -19360 -110451 -113963 -63231 5026 61998 151566 167419 112244 38182 -7282
13269 -7282 41272 36410 -8674 -23478 -65616 -118515 -149848 -80531 -47891 -122571 -68430 -51694
13257 -51694 -110281 -89205 -57803 -48994 -45213 37405 -44983 -125178 -86927 -42600 -98813 -149787
13245 -149787 -108760 -75848 -108069 -90837 -18689 -9350 11645 -18211 -104091 -123851 -102896 -31832
13233 -31832 -31207 -17683 50166 36670 -32539 -70424 -59467 36464 37358 50259 101331 22122
13221 22122 -40249 -123536 -79808 17356 12160 52940 -5426 -19309 -79697 -136552 -40066 71111
13209 71111 86036 -13263 -31803 -37896 4403 -53494 -113468 -120226 -100257 -133773 -59639 57558
13197 57558 24309 4359 -51433 -40377 -98635 -61574 18433 29708 39104 80816 67546 30571
13185 30571 -3704 8710 -14089 -48259 -112040 -135851 -142073 -95155 -36166 -48141 46599 75212
13173 75212 93930 88908 25601 -8477 -25588 -67462 -65807 -23858 -22435 22103 30140 26143 -9494
13160 -9494 -13550 47250 -9082 -51323 -22344 -44805 -55735 27806 -12259 -54670 -60213 -6421
13148 -6421 12319 56494 88116 52088 13257 47693 84283 65034 28424 29511 73531 37281
13136 37281 78386 82174 51942 25140 -67449 -86803 -2583 92530 82125 68511 43399 -7075
13124 -7075 15472 31428 37343 3126 -52329 -63016 -28270 -44347 -70903 -131989 -126863 -16954
13112 -16954 87345 37554 1012 -26111 -33583 -3400 19122 14558 43360 66191 95785 88280
13100 88280 151586 144090 106442 39838 96728 79321 42603 -86821 -176569 -131293 -61259 -58192
13088 -58192 127 7608 -20929 -39235 -37331 -59644 -198924 -192409 -81274 -58623 -130324 -96435
13076 -96435 -37947 -88040 -56728 -72861 -125189 -136791 -89061 -96188 -83983 -21447 -138596 -177404
13064 -177404 -84162 -24483 29922 -28745 -48297 -62277 -57108 -62077 -30712 1182 -46430 47024
13052 47024 10638 -72584 -67402 -22078 -73682 -107686 -149564 -173724 -170387 -111272 -87626 -158810
13040 -158810 -126204 -81409 -106886 -65555 41888 119852 175708 139715 59005 -58380 -38550
13029 -38550 30311 100067 113237 84539 64269 13988 -33769 -29860 102442 176210 115680 123829
13017 123829 103719 80962 151401 130858 28166 -18027 31455 -8565 -44131 -48434 -63714
13006 -63714 -87039 -89669 -40409 -29204 12746 -22789 -35660 90314 200605 178237 86917
12995 86917 61007 61191 31016 -16041 -49897 -97938 -88657 -65351 -47201 -72716 -101899 -117039
12983 -117039 -138390 -66300 -5471 26663 -24863 -90093 -145154 -192190 -119682 8239 89990
12972 89990 66548 59055 82372 29933 -30709 1119 15283 8601 71245 50298 41966 -31016
12960 -31016 -42720 -62460 -43641 -22859 -48785 -110206 -98827 -17305 163 15372 10551 21715
12948 21715 30118 43999 7835 89196 143696 100045 55874 -11631 -63242 -50061 59740 46720
12936 46720 43611 542 25835 30599 -28213 -1406 11633 -4151 -32709 -99287 -82355 -167821
12924 -167821 -196486 -156584 -40405 -74008 -154209 -163832 -100986 -55717 -148987 -239660 -147133
12913 -147133 -30039 82173 101744 129742 37502 114281 117746 12119 -11639 16203 -49235
12902 -49235 -109214 -29037 20901 31460 -40213 -312 -11647 -60503 -70981 -26536 -33962 -41371
12890 -41371 56773 121320 224449 234559 144566 115011 48566 100727 94734 127615 109330 58595
12878 58595 -5183 84463 73937 7887 -50026 -44244 -3630 -27647 -49560 -45311 -49254 -72111
12866 -72111 -77360 -77953 -7647 34203 104036 67153 136273 155025 161052 138223 141289 79221 31316
12853 31316 29679 -45436 -74964 -6556 -61924 -172741 -98585 43870 187086 182291 119601
12842 119601 48039 -61140 -91653 -100469 -80719 -15209 -35720 -87836 -73402 -88682 -131839
12831 -131839 -47896 19216 27539 8960 13157 29590 1460 50747 101631 44057 10740 16412
12819 16412 -11194 -58381 -22474 58018 67179 32883 -16189 -100162 -115423 -3505 60848 61284
12807 61284 4982 -37316 -19563 22197 31373 49409 67003 -24103 -50375 -30826 -13861 68205
12795 68205 52355 119101 110885 76401 9905 60440 58738 75837 13576 -57139 -22827 -40553
12783 -40553 -70638 -38584 -39337 6055 -2941 -10368 18003 14375 65224 165363 52229 -20335
12771 -20335 -17149 -59251 -148460 -134598 -94970 -170372 -219291 -147116 -183034 -180262 -82265 14349
12759 14349 9298 41715 -11299 -104918 -87585 -75426 -25246 12689 33668 46326 -9064 -79249
12747 -79249 -126525 -61395 4962 -11867 -18249 -43341 -40992 71230 67244 -24072 -40553 5222
12735 5222 79711 12109 32251 54236 87910 81856 28484 57371 26432 -16149 -29161 -52709
12723 -52709 -31541 3804 70760 147974 122566 32173 -75010 -67468 -95738 -63520 -58541 -25065
12711 -25065 -15764 -49694 -23810 4270 22095 19367 58158 120281 61788 5235 37760 56902
12699 56902 48542 51771 41182 36447 -2542 36197 -102128 -165440 -91347 -54215 1293 13002
12687 13002 20045 -1275 -40003 -74044 11658 -13450 26545 167453 134884 19259 5895
12676 5895 63260 120376 115705 170820 95064 -6378 7262 15665 55632 96143 43106 79569
12664 79569 -51282 -45628 -85922 -109417 -39343 -34159 -26132 14058 -42893 -135233 -9418 107797
12652 107797 115098 64472 32538 9772 57923 12533 -15025 -7788 -60081 -49211 -50417 -40527
12640 -40527 -49576 283 -29812 -1295 -4314 -2261 -26443 11695 41339 28436 20242 -36220
12628 -36220 7086 55146 9623 -63119 -95361 -54285 -15614 -62471 41899 47537 40463 29720
12616 29720 16424 90780 185783 89261 -29076 -9049 7420 -36542 -156155 -146058 -106804
12605 -106804 -159915 -136010 -92582 82048 44490 8464 53349 -30210 -132338 -52610 62273
12594 62273 113460 85296 107065 66531 -25382 -45390 -2114 31044 22992 25394 89760 45126
12582 45126 18131 81390 37537 -23997 -117033 -157911 -120442 -123733 -85199 -91195 -111694 -135832
12570 -135832 -108920 -54166 -2051 7545 103103 40880 -73167 -109479 3944 35026 35130 18178
12558 18178 -2286 -42393 -80660 -7545 39929 -18353 -112955 -141084 -101528 -86571 -153058 -228651
12546 -228651 -177325 -137065 -119838 -120652 -97746 -170736 -137580 -64967 54161 149425 140473 109636
12534 109636 115301 58565 33302 56711 66010 77476 69460 85434 163262 90311 4818 -34323
12522 -34323 -20859 15167 23995 78326 123975 141551 127051 79014 100632 88953 59434 -8052
12510 -8052 36111 106179 120947 45206 -29332 -17576 -53413 -99102 -33944 39398 87683 16371
12498 16371 38555 -17912 -71496 -105081 -89142 6424 -26529 -70643 4755 55464 -5172 -61689
12486 -61689 -70206 -110368 -10355 78348 41039 99839 202666 262455 219965 136365 109837
12475 109837 99641 39512 20617 40120 69377 4632 15618 55011 14836 44416 179167
12464 179167 229255 128058 159084 75750 -41522 -96048 -51069 -53441 -45131 48571 93645
12453 93645 43178 -112148 -174126 -135831 -26862 5296 18809 48530 -19047 -78229 -61876
12442 -61876 -90125 -120875 -130139 -53084 5024 83514 96477 59860 -828 -22600 -3222 26676
12430 26676 70371 44599 -37519 -30044 -60062 -20791 61996 70209 38803 227 8046 36336
12418 36336 82122 99544 47620 22389 7763 51967 57432 38650 86550 46592 -1937 60527
12406 60527 31346 43005 64802 60658 68403 113211 50475 3524 49637 70211 55603 73895
12394 73895 42832 109114 96043 142299 95998 43389 11809 18795 106029 208654 337782
12383 337782 296455 402040 531211 584416 744759 1002498 1295470 1607064 1906757 2018395
12373 2018395 1937994 1650235 1240799 894501 625881 345934 185507 172546 298493 336819
12363 336819 216138 146559 116511 142412 148842 174163 246725 246910 209751 302668 333269 346884
12351 346884 340580 319560 339158 287486 198784 112871 96981 164810 190205 141739 46508 9468
12339 9468 -1135 -58543 -65525 -10078 16711 107062 73801 129211 171932 228369 197768 108169
12327 108169 46435 84783 125746 137427 167974 255383 275568 252985 237021 209114 302154
12316 302154 296176 319148 328530 407250 488401 489343 393846 306858 172228 141293 191420 182883
12304 182883 145817 107236 82545 -12161 -37988 86867 183408 189031 136484 182250 185703 143230
12292 143230 73437 83066 74977 66736 86619 102657 120142 177705 238797 195153 115104 99652
12280 99652 160752 213122 212516 305417 328072 401862 520493 494990 343975 249228 280364 332226
12268 332226 322270 379543 343097 311442 314299 296252 291490 166067 93807 100839 124123 126601
12256 126601 140615 120573 148413 138202 65405 108677 97272 100222 67660 36969 120098 183856
12244 183856 219003 139041 107781 159926 185439 163913 92013 84166 97418 135254 203357 240405
12232 240405 191413 162977 153974 143791 81616 32484 1135 4194 -39567 -53395 11714 -9196
12220 -9196 15174 52195 96725 131098 127701 146680 147168 105883 150699 146594 108326 15525 54187
12207 54187 147142 109170 26188 106873 124857 62680 42734 47787 86050 220159 270649 314477
12195 314477 306184 271885 193372 140594 177474 190241 133547 131310 208981 206594 145913 135314
12183 135314 45357 -40542 -38214 3628 21264 19298 -29230 -39834 24391 115591 127316 102544
12171 102544 117871 137137 89807 4886 36183 -4196 11974 62423 75418 73321 -8389 -24796
12159 -24796 1595 -44114 -57974 46194 109365 109941 122196 205754 210245 266557 316692 282847
12147 282847 260989 259931 206635 167320 127904 135408 52894 67009 65776 61644 53019 73281
12135 73281 28804 -18887 70664 130979 111513 99444 66926 64203 8242 2301 10931 65331
12123 65331 152345 187503 180106 125239 80407 61060 98783 129243 33755 4970 23620 66432
12111 66432 165282 216350 201140 121161 41357 94186 125076 218657 287637 278585 283604 304118
12099 304118 213496 227141 210768 172424 169173 189771 327478 371204 320086 323817 327321 288541
12087 288541 293653 246221 282267 318742 260355 149792 243304 348942 431359 443928 480468
12076 480468 437862 517483 538955 566682 632898 694906 650682 603833 586276 477834 339572
12065 339572 247045 300271 383596 370129 325128 331825 309315 259619 198703 242796 256570 264873
12053 264873 316523 409688 555001 655499 745588 942692 1189810 1516201 1947273 2240811
12043 2240811 2236064 1976416 1628319 1295267 986185 793695 670630 612155 577475 492390
12033 492390 415983 412740 462800 476515 407096 365069 355546 393611 377512 342041 321376 408273
12021 408273 449071 429027 453742 577943 641519 593407 643869 670448 677349 739969 749383 717457
12009 717457 756085 751777 749673 741452 803438 809866 820071 900398 856579 790889 719675 632873
11997 632873 645220 773512 802133 819956 919511 977808 944042 1018888 1073692 1184215 1277500
11986 1277500 1277614 1291528 1336220 1471170 1641396 1734290 1874484 1998774 2169752 2529305
11976 2529305 2953887 3505758 4083835 4475636 4627658 4654541 4772590 5098888 5470307 5855421
11966 5855421 6202024 6417284 6407416 6308226 6264104 6505972 7030347 7861575 8755412 9854682
11956 9854682 11381603 13250280 15532733 18652130 22967111 29187124 38607350 53337427
11948 53337427 77469717 117380478 177642564 250181114 321404550 376493980 387778398
11941 387778398 350776914 287597910 214079590 147689680 101244724 73010689 56031014
11934 56031014 45126865 37459323 31772024 27508482 24329602 22085745 20725570 20191801
11926 20191801 20788951 22728091 26215288 31326684 37256267 42621542 45802778 45710190
11918 45710190 42376678 36618248 30065310 24070314 19418431 16198056 14173163 12835422
11910 12835422 11820506 10778429 9813095 8898606 8181196 7585722 7046693 6576778 6319996
11901 6319996 6106683 6008069 6053596 6169679 6489336 6864700 7431215 8173532 9139826 10506141
11891 10506141 12325105 14822002 18350307 23074534 29059435 36020171 43034923 48973028
11883 48973028 52663707 54154700 54459087 55167263 57895730 63048042 69211164 74624301
11875 74624301 76871875 74256088 67526454 58362843 48759164 40258344 33424338 28206675
11867 28206675 24196125 21150580 18760557 16840956 15230003 13828127 12455037 11260209
11859 11260209 10299054 9544260 9078578 8937313 9128741 9566907 10134779 10903595 11815322
11850 11815322 12760294 13776981 15208301 16991009 19660005 23569444 29045748 36686780
11842 36686780 46244141 56495054 65578958 71693510 73260361 70188064 64467161 58406714
11834 58406714 54205859 52885863 54030205 56497523 58240365 57636446 54007159 47618726
11826 47618726 39832002 32021101 25197440 19768686 15757273 13147209 11341540 9943799
11818 9943799 8814414 7770765 6904198 6067735 5473543 5025756 4619804 4401374 4287693
11809 4287693 4210756 4161791 4223893 4379238 4693136 5075419 5634829 6342007 7330507 8816461
11799 8816461 11284688 15092583 20418520 26896265 33737708 39449463 42378575 41821569
11791 41821569 37762669 31438249 24659153 18624378 13886385 10603517 8437897 6964752
11783 6964752 5848608 4946296 4302335 3838872 3377990 2999526 2663910 2318205 2048424
11774 2048424 1874611 1773819 1699781 1517253 1359889 1207527 1200694 1152258 1095778 1067349
11764 1067349 1001139 939425 946481 864299 874703 907571 845384 768999 720487 688731 737072
11753 737072 727213 661564 626635 540887 537626 464522 394495 270989 310311 422805 396662
11742 396662 401421 384902 353819 385705 462549 551884 587039 539918 510542 454550 407528 360776
11730 360776 457717 536472 596527 582053 444800 374525 498766 598030 620032 685139 703363
11719 703363 674374 673070 641163 710621 623280 534653 497312 441934 440632 457763 399889 325794
11707 325794 331894 409172 414694 393114 282637 198938 142906 149841 136987 104202 105437 137482
11695 137482 219086 242688 162758 132615 185975 170965 143343 154748 192597 224674 264733
11684 264733 220606 285976 324637 335332 390577 460350 488716 451056 416724 405856 421939
11673 421939 435337 435090 377755 305024 297789 304017 279788 310839 278708 250257 249028 260029
11661 260029 289524 280763 256020 248010 146581 209665 329604 299882 157168 159095 150649 151440
11649 151440 157350 161014 103565 56222 134123 153027 25207 80448 100032 9851 48545 174531
11637 174531 344960 362990 338552 366563 278269 149372 225805 319094 260008 156074 130265
11626 130265 78976 100750 120387 95295 117632 64172 77930 152812 214216 176773 120868
11615 120868 177287 200061 170002 208732 194834 171207 180870 100529 30865 -25680 -4520 -17365
11603 -17365 26302 90282 198155 190027 239628 167028 66523 68535 36550 33408 -42648 -15500
11591 -15500 68943 91538 88822 101398 144676 145598 46199 108980 181394 125761 101205 130603
11579 130603 183630 236735 210174 192105 203184 193189 168674 139032 133759 148070 103341 56355
11567 56355 3013 -67238 -94832 -86075 -16693 11636 -13776 32604 22978 35896 46005 68470
11555 68470 24550 -66062 -115656 -35917 153109 149420 108586 54596 -1896 -35545 -74346 6209
11543 6209 121137 181646 155879 140040 142889 123028 175872 152886 36757 4014 -27074 -4842
11531 -4842 61443 67459 30104 61821 19340 65029 138987 134143 48886 10258 50578 48182
11519 48182 77264 56377 113223 190145 235396 303605 311462 360516 436560 537622 717300
11508 717300 1024515 1311436 1728885 1942131 1897108 1595675 1224897 871718 586158 405883
11498 405883 312352 151040 88082 66140 94258 167342 176139 123982 95166 131497 93354
11487 93354 70592 25857 76212 117268 123007 172347 113465 119593 172555 204085 218862 238313
11475 238313 210381 202099 174967 105297 21091 32448 110604 197490 220302 107357 28900
11464 28900 60255 18955 18530 79762 118488 124474 91111 42040 17217 -12001 -77314 -54662
11452 -54662 -23099 89589 147316 105503 13731 50978 84126 48307 139666 151821 84420
11441 84420 110910 137868 120057 178008 240559 272460 352905 436150 470453 538342 548889 421367
11429 421367 420670 411342 311809 257283 184735 179197 197089 235762 192373 182391 187363 148759 -8435
11416 -8435 -38549 -504 37486 81304 31499 -16016 61310 92469 176458 174246 153652 288696
11404 288696 350860 365648 283681 157864 165752 221303 206111 338382 359833 373247 398883
11393 398883 309783 265583 276722 249144 227720 195761 222911 296140 238280 203876 189086
11382 189086 162206 172647 171175 171026 141583 159695 86630 101115 85795 7755 -44485 -78158
11370 -78158 -84543 -79536 -72233 -12130 1798 -49279 -95802 -103867 -77958 17030 45560 76449
11358 76449 106524 140103 137937 103558 90632 44798 63767 75749 21992 43012 136866 219880
11346 219880 176580 105288 68106 123090 111267 -10567 -16489 15581 -25529 -127726 -29299
11335 -29299 -28709 -70624 -132961 -99530 -12005 5609 23109 16031 -44652 -52323 -114039 -106144 -56478
11322 -56478 -35190 -26210 -51575 -7885 49462 89685 59506 -15893 -71912 36537 141815
11311 141815 164545 117650 39291 -89277 -178459 -159327 -82129 -7650 21036 -18063 4637
11300 4637 63050 42693 8156 -35733 -67255 -38295 -46841 -52505 -78569 -48609 -108928 -130988
11288 -130988 -70190 -23513 -86091 -77399 6521 18305 -51615 11049 89590 224756 167542
11277 167542 62662 -21422 -21466 -70379 -50028 -30207 40725 17255 -93920 -106405 -47400 2454
11265 2454 -86649 -115267 3457 -4400 -81725 -93497 -49324 84448 61020 -31470 -23525 -10964
11253 -10964 11541 11643 16530 24551 16615 11827 -15943 -4649 23113 23577 -17554 -120149 -174673
11240 -174673 -233337 -185946 -142566 -77502 -78226 -93345 -136151 -139106 -57531 25101 43395 55665
11228 55665 -18496 -73179 -16691 97307 125913 154340 49036 -16441 5667 -117358 -202247
11217 -202247 -217389 -137169 -81927 -63996 -77331 -32383 -45197 -95951 -78360 -47220 -48426 -35708
11205 -35708 45040 126092 168996 223389 188115 193641 116896 19527 8570 -10816 -2822 13999
11193 13999 16119 48921 3034 10745 57465 64539 64704 47980 18031 12529 -40868 -67058 -1577
11180 -1577 -47520 -24662 -2179 -11099 55817 137616 148146 217119 167801 143488 85397 26433
11168 26433 24509 59975 9632 -64992 -107458 -101941 20410 81794 113161 163963 133521 85437
11156 85437 -604 -59570 -14520 14158 71595 157101 174636 66882 -39359 -157518 -231559
11145 -231559 -266169 -304211 -273282 -232271 -170705 -42420 -79020 -116428 -70037 -62415 -111399
11134 -111399 -52111 -65710 -24121 -46230 -21484 9978 53926 91926 43935 8253 -17403
11123 -17403 47022 51422 20007 -28005 -98548 -93677 -170832 -114225 -95896 -110367 -98837 -19238
11111 -19238 20837 3916 -54430 -91154 -118986 -118447 -144037 -146913 -88044 -35501 -47411 -142819
11099 -142819 -118221 7549 -18635 -58536 -40889 -45241 -14823 -29929 -44875 -11061 30419
11088 30419 24853 -45606 -30424 -41183 -63215 -72472 -85807 -48147 -42601 -127877 -225462 -134773
11076 -134773 -70258 -16226 53977 18741 68594 102598 108043 42008 -53757 -78038 -89545 -28580
11064 -28580 51458 -10931 -35544 -23332 -98563 -177030 -189489 -116935 17081 42717 16307
11053 16307 24879 74605 77229 1382 -122938 -85598 -16894 7831 -23374 -54857 -149028 -222663
11041 -222663 -117524 3594 -48705 -9497 -8306 24353 88311 46104 -75161 -121994 -177862
11030 -177862 -152089 -55021 -82107 -141314 -71400 -31169 -25846 -79352 -115187 -165428 -184803 -210989
11018 -210989 -168773 -108370 -90650 -117656 -176681 -188576 -107482 -70408 -80144 -101454 -112563 -94267
11006 -94267 -101059 -93667 -66631 -35472 -37895 -19522 -7776 -37811 -35400 36268 143999 110915
10994 110915 71503 166032 155311 103114 19248 10820 -6740 -33771 -65720 -46689 -8944 -28130
10982 -28130 -66977 -138286 -167068 -119606 -91894 -74766 -3924 6439 -8416 -32510 -9061 15620
10970 15620 -72380 -100098 -70812 -48047 -11079 71200 47834 -17456 21833 64143 103393 81594
10958 81594 79825 105778 123863 181656 184157 105041 100711 3143 -92872 -54665 -39316 -38942 -72968
10945 -72968 -76816 -81658 -117269 -124839 -32266 -25592 -55860 -40010 -2953 -16319 -5320 22586
10933 22586 13970 -15028 -41763 -59698 -6124 35955 23448 41160 53756 79877 66044 48387
10921 48387 2685 38174 96739 95643 42505 -20879 -17604 37146 -26101 -34893 51831 27801
10909 27801 -23663 1786 982 -10652 -3512 -20939 12438 14140 2537 -10479 -86857 -35580
10897 -35580 -11669 39362 60350 13690 44516 76025 66099 103500 183150 150080 75093 40741
10885 40741 -32232 13014 -22683 -16543 33208 -17646 -24562 21927 -16157 -111889 -94502 -103779
10873 -103779 -140686 -78767 -18627 47327 13752 -77511 -10040 66169 32312 -30074 -34785 36502
10861 36502 134925 153912 66323 -45500 -67807 -64890 -22351 61449 105875 109452 45442 2192
10849 2192 3306 -61377 -60340 -17324 -61854 -105495 -31992 84319 56353 26634 73228 23842
10837 23842 -34360 -61382 -144030 -123881 -63790 -59922 -8852 51719 8733 -41716 -100955 -40743
10825 -40743 -9826 -2640 48058 62264 -25327 -95937 -79065 -65973 -70239 -65292 -76119 -110071
10813 -110071 -109145 -174972 -188259 -123414 -76897 -18120 -100534 -130034 -145277 -164665 -126439 -133490
10801 -133490 -82489 -16071 16885 70705 62789 -80416 -57967 -5705 69248 56712 41910
10790 41910 29934 -94994 -218900 -300568 -226411 -14595 -64856 -151127 -26153 24392 37849
10779 37849 68504 83745 129236 122795 54119 -19872 -20136 -21009 -111951 -188568 -95226 -66588 -15518
10766 -15518 -36419 -88706 -26031 -3422 -4689 52060 32812 -95439 -159637 -158432 -203203 -208497
10754 -208497 -108884 -61295 -32749 29783 25053 6422 69522 17658 -46168 -65696 -138833 -142696
10742 -142696 -145067 -44762 6682 -348 -34083 -91011 -93790 -124179 -111526 -72834 -5337 -22512
10730 -22512 -54977 -5709 -97606 -51269 -15504 -83360 -88232 -41069 -15824 -21547 -49228 -20549
10718 -20549 -57022 -60022 -11242 -42799 -37139 -44075 -153748 -209189 -119939 -133542 -118409 -169144
10706 -169144 -240744 -189838 -129060 -92108 -118974 -73229 -132451 -169012 -150892 -133922 -124793 -95385
10694 -95385 -38616 -7922 -10462 -135729 -210151 -121764 -119936 -147859 -209370 -210508 -228578 -201501
10682 -201501 -206049 -193771 -193179 -147470 -131633 -92771 -98790 -41526 -27529 -47243 -24615 13233
10670 13233 10018 3059 76790 74854 29848 -36356 -20911 -19239 8457 51507 46770 -5524 104399
10657 104399 67744 5584 -58368 -79907 -68608 -22562 -27423 8317 -37857 -59810 -28591 -16987
10645 -16987 -20859 -81067 -114859 -177374 -229071 -145516 -20061 984 -6275 -104566 -163283 -210397
10633 -210397 -131001 3233 59991 147022 109962 11685 18414 -18826 -124642 -161054 -177638
10622 -177638 -143094 -93693 -40497 -75373 -94608 -126934 -132819 -75531 -104233 -111580 -130032 -201191
10610 -201191 -187809 -142655 -84270 -23672 30596 4176 -11892 38670 -12839 -90466 -129877
10599 -129877 -182076 -85474 -27653 -4153 60552 45161 37055 114674 127215 89226 99925 -36031
10587 -36031 -28807 85022 78294 42268 -34609 -27982 -7311 68495 67811 67888 -46508 -158355 -123834
10574 -123834 -57293 -51743 -123041 -166043 -143340 -163630 -143660 -141395 -96236 -80669 -45021 5963
10562 5963 1366 -52346 -55728 -85624 -101246 -86841 -47673 -25858 -40358 -94794 -134583 -112158
10550 -112158 -93789 -83102 -71504 -12496 -35695 -60605 -65141 -43777 -55166 -51674 -32679 -36206
10538 -36206 -46314 -30496 -51410 -99153 -63630 -165475 -278319 -241914 -197104 -151284 -171179
10527 -171179 -145590 -96122 -70972 -12730 -6116 -47604 34637 64672 37435 18504 16198 -30083
10515 -30083 -55325 9247 -60691 -133783 -40597 60525 9606 45905 113186 105699 52479 31499
10503 31499 -16592 -14775 8888 98425 83692 -5859 12089 -10580 24579 22780 -67136 -85330
10491 -85330 -148286 -126471 -139739 -111345 -70522 -61231 -60052 21384 98126 89552 82687 3711
10479 3711 -32614 -43267 -6996 -66283 -37542 -46574 -6552 38586 10725 -8106 -19742 -31927
10467 -31927 17467 8400 -39370 -92601 -32559 -34756 -9375 25810 90990 81559 -18892 1010
10455 1010 -28293 -3737 -4663 31105 53785 21691 19330 26362 -24882 -97871 -139425 -143693 -24403
10442 -24403 -15769 -36214 17246 46927 66600 -27373 -75841 -45770 -45278 -64703 -74369 -142646
10430 -142646 -95303 -28159 -20701 50716 16549 58588 83935 74502 4749 -29052 -92802 -203449
10418 -203449 -180590 -112971 -63442 -76793 -56364 -82531 -13524 30606 82126 115546 51928
10407 51928 -59496 -86318 -124846 -58685 -1804 -32869 -6460 -1612 -67436 -136364 -135719 -136414
10395 -136414 -62199 -25110 -25503 32231 14463 -33041 -94334 -47161 -130423 -110757 -71029 -83403
10383 -83403 -118030 -76649 -79789 -108823 -62779 43126 131000 132671 75017 -1132 43178 74113
10371 74113 15064 -35294 23611 26070 13564 -16923 -24864 -59746 -65077 29390 90659 70344
10359 70344 63719 7471 -42885 -77831 -45516 -26408 -65884 -75790 -91966 -135905 -107409 -70129
10347 -70129 2095 50567 101347 175508 183353 200687 286019 393590 371188 339630 301511 238184
10335 238184 184823 239063 191750 114183 192497 128204 -4012 -24978 26657 53630 -23462
10324 -23462 -36907 -36759 -49145 -118446 -126762 -159598 -120794 -140639 -154331 -167031 -180325 -40377
10312 -40377 26977 -7466 -37573 30480 13642 -9421 -95102 -200934 -232960 -241995 -210473 -148779
10300 -148779 -111455 -112700 -130122 -109890 -133345 -78159 -9020 -16996 -63753 -101520 -56986 -31530
10288 -31530 -15073 -61374 -80980 -55043 46002 -24157 -113846 -101281 -113963 -59053 -33090
10277 -33090 27069 46262 -5547 -9861 44599 59591 29747 47338 60642 28947 -14300 -35541
10265 -35541 -57110 -80864 -18241 25778 -14277 -57784 -85604 -85823 -78850 -60958 62198 155173
10253 155173 174165 139809 74597 161787 206198 61108 -44100 -20920 20578 82778 25854
10242 25854 -9908 -51602 57 -25648 58510 118460 112178 78952 28572 32106 25813 6622
10230 6622 -15132 -31276 28263 94744 154267 24071 -38370 -56524 -81452 -94116 -152946 -128762
10218 -128762 -49014 -1354 -2234 -55131 55139 62363 30444 15570 42722 119705 106961 101674
10206 101674 46212 77197 23125 9194 -93409 -103858 -39925 -18477 -129053 -147801 -25584
10195 -25584 4665 19908 63511 -16314 -119853 -157861 -197245 -171958 -117028 -54088 20511
10184 20511 43881 -42522 -77784 -95412 -66891 -11543 -22423 -95880 -134743 -142471 -178678 -57703
10172 -57703 -59736 -61254 -1751 -2450 1642 -9423 78302 28835 -25373 23305 65859 20326 21932
10159 21932 6565 55704 33581 27904 48936 61369 46141 -7935 -41270 -100818 -38435 2784
10147 2784 77588 81241 -77979 -124517 -113945 -167320 -42777 72526 92439 -390 -2982 7692
10135 7692 -1457 -21591 24863 20965 -40808 1135 14429 -45411 -132176 -96183 -16370 78301
10123 78301 70492 32523 -1085 -43676 -46734 -103816 -116256 -118707 -168012 -262582 -215947 -148104
10111 -148104 -43536 -46273 -99710 -45883 5323 28397 74218 89780 97617 31885 -25988 -10029
10099 -10029 5090 -70691 -97765 -22295 -30332 -63352 -101850 -92627 -99790 -94123 12864 18197
10087 18197 -25977 -69824 -148916 -141941 -149170 -171289 -166387 -93083 38895 58924 26547 26108
10075 26108 26076 40785 64535 23837 21969 -31800 -66896 -73314 -70714 -107444 -118115 -130338 -100156
10062 -100156 -96533 -47049 -3357 -22885 -109302 -138820 -117912 -4479 104646 57299 4267
10051 4267 82722 287260 207268 94516 112376 151078 95644 33387 97203 153915 120172
10040 120172 98046 119611 88116 94796 189651 299201 273220 102699 31343 27596 -67392
10029 -67392 -51376 48188 77319 83024 104895 50508 47847 33158 -10917 -44452 -35146 11675
10017 11675 -21770 -60250 -70425 -89647 -81291 -189 84034 84553 10708 43149 169421 147860
10005 147860 98498 100400 95872 78745 46841 6484 -102203 -200006 -124488 -46602 -70513 -82228
9993 -82228 -76168 -123912 -111224 -67335 11987 -7469 -82895 -142994 -135398 -108532 -102489 -73932
9981 -73932 -81618 -182733 -232800 -195850 -184339 -94363 -114272 -118400 -50615 -36865 -16706 -93706
9969 -93706 -152027 -106489 -66760 -103463 -126559 -124320 -131283 -77751 -315 45441 -29311 -8276
9957 -8276 50900 88939 68303 69409 60726 26700 64398 7859 -81184 -75260 -26560 -20355 -81938
9944 -81938 -178444 -169639 -156178 -165203 -113726 -63133 -114681 -169547 -191964 -110201 -58393 -41982
9932 -41982 -37582 -20887 -72135 -101207 -103964 -110557 -89344 -21162 -15254 -34742 -46504 -84618 -82360
9919 -82360 -61275 -11818 8000 -19515 -92129 -108509 -119193 -102609 -23182 -69782 -62260 -77983
9907 -77983 -55055 -95727 -125041 -81196 -66732 -97522 -50094 -72 12955 -11691 19210 63805
9895 63805 85390 159801 209047 140556 18459 41236 646 -48347 -142945 -174764 -99826 -56499
9883 -56499 -99299 -111367 -135173 -48665 -24753 -34322 -99812 -89007 6975 6001 -61268 -63186 -16005
9870 -16005 -37205 -41656 -85903 -98568 -113455 -119724 -191831 -200620 -132209 -80012 -58846 24892
9858 24892 86255 97720 53701 50548 -73566 -123117 -167345 -135529 -87634 -27453 9224 -63843
9846 -63843 -71519 -65572 -65230 -11796 -36989 4157 23259 -78449 -90220 -71175 -39687 -57089
9834 -57089 -81559 -53348 -39813 -80389 -68979 -25018 -9466 -17865 -101 46364 -5081 -17626
9822 -17626 32070 41901 27612 48463 27513 -8615 -13989 18484 -134418 -201679 -89306 -60624
9810 -60624 -89207 -39964 -6805 6365 -21547 -18763 -16909 5074 106135 129737 -18649 -57349
9798 -57349 -25594 -69213 -143088 -126931 -64960 -4484 48995 -18768 -155915 -160454 -28668 1638
9786 1638 -5338 -114034 -97327 -3248 37674 -89953 -197482 -177873 -159140 -192580 -110879 -66229
9774 -66229 -84068 -128394 -87986 -85449 -90421 -96939 -58831 -6928 -121593 -263133 -239297 -146041
9762 -146041 -45649 3174 8666 78269 78133 66865 18938 -2019 19427 -38014 -104554 -77550
9750 -77550 -65435 -25362 -93330 -159921 -74457 -9902 -59517 -96244 -34271 78670 114079 -17707
9738 -17707 -108679 -59203 -9437 -59915 -94383 -87957 1177 357 16256 -10169 24196 -7175
9726 -7175 52321 71665 -552 -67542 -162046 -202073 -52281 18004 -51601 -43723 42057 48534
9714 48534 34698 18476 -9996 -6889 -23198 41670 91 -15848 17987 62874 125272 99681
9702 99681 -31858 -127104 -170110 -165795 -117098 -77901 -50217 -28587 82824 124684 152071 144256
9690 144256 80659 -32586 -55637 -173140 -238572 -111648 -68604 -93694 -36907 70018 135496
9679 135496 64719 83476 111358 155451 133005 82008 -12181 -88866 -75669 14961 77272 51306
9667 51306 62709 101555 63939 11761 20237 28377 46828 104549 63033 -31199 4386 -52572
9655 -52572 -110026 -87027 -43948 -94707 -43402 33933 61426 5384 -59788 83297 160895 43762
9643 43762 41529 60405 -15608 -12399 21810 -10330 -57423 19715 30234 27358 11578 26997
9631 26997 -26330 -72552 -83590 28807 28145 -69566 -101893 -61317 -11639 52741 11365 -63736
9619 -63736 -30883 24965 32276 36426 -28571 -17632 -13267 -45091 6321 45191 37887 88116 59600
9606 59600 -63351 -82558 -12178 -25905 32882 123445 163814 80060 -1269 133764 67500
9595 67500 29875 -31052 -48538 -85156 -165204 -105424 20315 56962 22367 -17175 -64430 -7263
9583 -7263 42738 47319 234 42334 46237 33600 20213 -4241 12175 28013 -38833 -133679
9571 -133679 -154986 -108431 -26898 56088 31649 -18923 20012 135348 128447 40884 -39 -55307
9559 -55307 -98752 -37004 -23950 -51253 -46004 -5258 6718 -26360 -56596 -122545 -188747 -169683
9547 -169683 -185630 -78808 33200 21467 -61316 42415 107696 125571 93772 62004 96697
9536 96697 93410 155706 162576 157885 145427 123839 183034 179931 223652 134802 124063 150043 122993
9523 122993 91590 114820 54512 14726 -42447 -67840 -120136 -60730 -19436 -86627 -153367 -234244
9511 -234244 -234465 -96292 -19261 21163 19417 -57405 1325 -3163 -30131 17958 26427 5969
9499 5969 -96175 -141285 -67284 2592 45545 77612 106587 197637 160298 204509 173602 207484
9487 207484 267092 274877 231545 219115 87757 44765 -21550 -36687 -5113 824 17522 -16904
9475 -16904 -15686 3507 6500 -13434 -30882 -73778 -68682 -18486 59484 56541 47476 76502 114935
9462 114935 -5921 -59566 -29992 113861 113976 77703 -34815 -31419 1328 20415 80094 130642
9450 130642 51067 76873 60945 49667 75347 196923 171176 247284 333729 442949 500978
9439 500978 493541 409029 397827 331572 222579 211424 217883 278243 266343 198056 245293 295392
9427 295392 288180 234746 144555 214537 274128 211405 154754 15994 -828 8930 -27233 -91239
9415 -91239 -85990 -79398 -111212 -126308 -150198 -148432 -21579 62716 78886 53848 163725 120584
9403 120584 71048 121396 184230 247378 295811 268248 243032 183741 164286 206282 356405
9392 356405 358039 270767 192564 202775 242384 268703 227943 178701 84361 62995 24987 -1242
9380 -1242 12565 44816 64749 94104 153803 164570 153939 113499 132802 123626 3403 -40869
9368 -40869 -71879 -40111 15701 61762 81893 127219 172755 124092 71041 106159 102485 70034
9356 70034 186319 224458 173800 93583 114278 153885 193954 147646 205212 267899 205995 41082
9344 41082 -31247 -14580 21398 103788 157102 146042 180772 156220 100603 4964 -85604 -62767
9332 -62767 -77876 -56228 -63690 -88815 -81659 -60135 48803 95610 149429 104909 31190 -12244
9320 -12244 24880 103617 116156 62510 68442 43788 63825 94027 72174 -24561 -317 -3136
9308 -3136 29942 55039 689 81510 156356 93927 168472 247682 147345 10632 49802 101900
9296 101900 137680 131117 155155 94529 18268 42021 52055 60452 69209 63240 87037 81900 88014
9283 88014 135821 125046 130139 210226 223189 130806 153090 134662 59359 11033 -23474 -28467
9271 -28467 54767 -38071 -63217 -24834 40249 12843 39992 87024 157220 188911 150800 109631
9259 109631 151198 156954 165609 212432 239882 289994 362942 329447 322122 363898 355504 313822
9247 313822 283286 253585 222404 104519 54862 116804 185956 209749 186930 172608 193706
9236 193706 165135 127637 130830 100959 102768 115757 72943 -16587 -28196 105208 120315 22963
9224 22963 17070 16371 79390 199561 160125 147772 244703 344815 313642 300118 315049 311726
9212 311726 316871 318906 335349 380073 294974 233134 262721 278021 291186 265041 229820 236453
9200 236453 210259 222887 274180 262089 254273 274490 343161 350089 415944 400428 393049 261493
9188 261493 237615 277752 296920 428463 452339 439621 508565 420686 378008 480256 485483
9177 485483 475028 514840 488069 476045 422609 454642 508116 599676 663337 723611 757952 771908
9165 771908 746033 689520 780054 878818 890930 1020035 1109647 1042055 1111357 1251199 1288555
9154 1288555 1399702 1619624 1876760 2060323 2226751 2563809 2972661 3407607 4170630 5289084
9144 5289084 6933397 9098585 11208557 12124717 11458603 10372112 9929084 10414806 11510393
9135 11510393 12557812 12884713 12227241 10991412 9693145 8733038 8311217 8286872 8698907
9126 8698907 9450781 10627588 12037789 13785156 15916766 18139275 20143063 21407285
9118 21407285 21549528 20640192 18994122 16947164 14933399 13224556 11902595 10867322
9110 10867322 10081399 9512427 9161235 9164009 9614879 10464853 11955439 14394555 18104300
9101 18104300 23153377 28787294 34005874 37768456 38981195 37230112 33538283 29950776
9093 29950776 27842230 27336928 27312314 26803570 26083498 25755914 25606889 24814641 22721366
9084 22721366 19718980 16718909 14361656 12991389 12621400 13228545 14749035 16675794
9076 16675794 17819763 17177932 15187672 12881028 10898186 9351271 8364296 7743410 7433970
9067 7433970 7327878 7514684 8026351 8818131 9862870 10762776 11550938 12737469 14656563
9058 14656563 17650575 22018850 28321723 36294778 44317152 49213204 49354948 46158409
9050 46158409 42666029 41426482 43714892 48338147 52094345 52329310 49838822 46927724
9042 46927724 45115563 43925336 41636410 37224379 31815162 26902613 23222646 20778645
9034 20778645 19510504 19514310 21058361 24063594 27704363 29659503 28152640 24040320 19539921
9025 19539921 15905690 13223521 11220155 9904875 9171666 8836846 8697396 8735470 8941444
9016 8941444 9446111 10133348 11237665 12960174 15012652 17303937 19811188 22707269 26273327
9007 26273327 30224775 34072525 37489397 39983651 40899806 41131836 42088471 43063741 42737957
8998 42737957 41172913 39798984 39268564 38763641 37330461 34468270 30694550 26969348
8990 26969348 23955971 21340868 19204734 18085874 18237163 19062715 19023671 17320955 14751547
8981 14751547 12157244 9942744 8142117 6831950 5948626 5382449 4947303 4615020 4389770
8972 4389770 4209252 4146320 4094566 4146706 4297191 4560201 4944413 5306899 5568028 6018331
8962 6018331 6800608 8126303 10183910 12952883 16365040 19529963 21189271 20806705 19402999
8953 19402999 18451855 18288021 17914029 16669103 15006684 13646241 12579242 11416931 9807454
8944 9807454 7994256 6354364 5055181 4171326 3437268 2995918 2702151 2438922 2237176
8935 2237176 2008853 1889795 1740170 1528670 1504443 1552713 1472542 1469598 1499362 1429042 1483626
8924 1483626 1487542 1495638 1526077 1535107 1501251 1465367 1428604 1358183 1256538 1356107 1619542 1717842
8912 1717842 1559480 1362024 1222084 1183564 1190776 1213317 1200864 1139738 1099531 1130861 1239178
8901 1239178 1360599 1570549 1812155 2064995 2542972 3274500 4198819 5419029 6609847
8892 6609847 7423028 7876739 8417582 9171864 10278224 11664904 12472739 11690379 9794298
8883 9794298 7751310 6234189 5394133 4969757 4675356 4316844 3798753 3299518 3046500
8874 3046500 2985281 2898085 2800881 2809896 2730602 2577524 2484177 2480574 2651772 2911617 3179031
8863 3179031 3568232 4174555 5005511 5969746 6678354 6926075 6981570 7156906 7323156 7558547
8853 7558547 8210958 9297049 10742286 12515915 14831067 17290648 19743486 22489017
8845 22489017 25706969 29221371 32576430 34693079 34761528 34168890 33918621 31997235 27322272
8836 27322272 22114902 18202090 15444844 13325454 11671451 10694513 10268379 10054603 9656031
8827 9656031 8888181 8071631 7346575 6775475 6546653 6425039 6365209 6555828 6899049 7606962
8817 7606962 8685765 9912859 11234462 12567188 14253258 16201211 17547984 17660962
8809 17660962 17055985 16803785 17109045 17957577 19737700 22553385 26206488 30001621 33990641
8800 33990641 38674894 43796651 47304051 47233475 44685823 42250564 41790948 43033729 44268339
8791 44268339 43206756 40076094 36765649 34168280 32468410 31399283 29883334 27245717
8783 27245717 23525242 19329187 15722808 13010337 10980954 9633557 8831705 8402406
8775 8402406 8109845 8051106 8334660 8991826 9870464 11043305 12251247 13389380 14871160
8766 14871160 16700676 18519427 19321950 18922388 18444792 18686397 19321580 20356071 21984861
8757 21984861 24500949 27530140 30114881 31508980 31920457 31588702 31111091 31444466 33262901
8748 33262901 36476213 40029067 42673387 43708462 43845315 44159469 44522174 43625824 40415930
8739 40415930 34570297 27246241 20677899 15902481 12759369 10743898 9244342 8127948
8731 8127948 7261823 6597277 6071623 5564875 5303143 5251545 5338300 5657235 6131613 6888153
8721 6888153 7889422 8673118 8941382 8726264 8433126 8210464 8115065 8091741 8543432 9441221
8711 9441221 10648415 11885279 12832764 13437555 14278242 15803238 17939203 20374017 22878325
8702 22878325 25084251 26670814 27412927 27773212 28224263 27986194 25528876 21322155 17090612
8693 17090612 13404911 10351165 8150901 6600755 5523116 4822454 4261807 3815349 3437484
8684 3437484 3082782 2816127 2608564 2385876 2200352 1951357 1815041 1731579 1564330 1388964
8674 1388964 1436192 1511615 1504640 1562886 1551270 1441465 1478518 1584104 1700219 1932225 2123387
8663 2123387 2515943 2987626 3677937 4823472 6216782 7721807 9231841 10390973 10639636
8654 10639636 9683090 7748887 5821230 4288382 3307706 2675879 2243057 1898093 1590355
8645 1590355 1450917 1421903 1403885 1335533 1234516 1015420 915592 924826 943174 902715 828095
8634 828095 767844 786463 815602 813383 727716 628989 580307 613644 610111 637641 626803 596625
8622 596625 585386 550280 591225 589513 528276 449676 373646 320948 316557 281859 266314 277431
8610 277431 242425 292995 330098 360955 296985 265375 318789 362175 423790 453126 471839 510822
8598 510822 458675 374599 342694 347428 329747 305862 319054 324494 322101 315479 324326 367028 332594
8585 332594 337704 339435 339448 293237 314230 316326 345052 320844 303260 268957 216465 146338 86783
8572 86783 88294 83533 101036 132044 200920 162530 30591 33036 149359 103352 80496 147367
8560 147367 202247 197329 209865 106339 54693 49527 83988 107538 163100 220720 248640 204128
8548 204128 146446 203754 288924 455418 482030 370203 372882 356420 345667 388464 482244
8537 482244 625668 737882 722994 669469 576403 587258 644657 583989 469957 477633 384669
8526 384669 304969 300905 307187 349186 369065 340545 286529 266078 218566 117458 111667 211521
8514 211521 292918 268138 213507 142957 94144 102086 126938 193620 149131 113999 159397 166696
8502 166696 178444 162307 138513 212340 351947 624430 826692 974862 1068803 1045318 935207
8491 935207 839783 793515 729490 633307 501774 414475 427203 429267 326886 237209 255213
8480 255213 213348 169958 161266 98827 116182 126185 196351 164043 81405 97676 157485 169413
8468 169413 110642 60963 57339 77076 63230 103577 147770 173954 155242 190710 256098 262935
8456 262935 306511 340310 315726 282603 290837 299221 358593 348704 437573 597123 579637 571166
8444 571166 540197 394324 337064 300920 290824 255795 244777 307504 304353 307661 352162 343974
8432 343974 266130 227656 254137 223175 156366 147052 144011 106032 71003 94497 150615 155094
8420 155094 131012 189464 294009 272521 211596 212947 236183 265462 249227 200623 207260 202354
8408 202354 186311 221517 264067 276800 352004 419546 473589 498622 518899 466060 399868 383050
8396 383050 355975 346146 380615 420854 340754 359360 321307 261461 215558 147943 131990 88275
8384 88275 50595 64977 -14210 -4965 144934 215911 221312 231647 190791 139686 196209 176202
8372 176202 97757 36215 -18084 31811 156029 188499 241620 222466 211286 264127 293992
8361 293992 296254 313262 331347 370000 470083 524389 527115 501528 495675 499723 547701 522217
8349 522217 380526 229671 165087 104567 117538 165098 136782 73294 85847 36783 46856
8338 46856 100795 97431 99653 41665 -9808 37043 141977 132334 125986 163252 243961 241774 153645
8325 153645 83280 -4936 14966 -19490 -10207 12254 191920 313645 294999 197426 167449
8314 167449 264743 307941 309482 272912 314215 286356 286436 267325 349284 493946 518321 494904
8302 494904 389997 209919 137266 46783 35547 62581 153117 139822 179793 189487 145346
8291 145346 130099 165712 190385 223822 289538 288436 214915 189477 169618 127955 181014 262536
8279 262536 189156 283351 370840 372556 315251 206714 203560 222980 169173 123014 171164 163176
8267 163176 181157 84339 74212 123002 147003 221900 313835 303504 244583 142914 128174
8256 128174 124126 48118 39268 46068 42159 66347 160818 220665 226408 222247 220404 234028 187438
8243 187438 136604 107015 161136 227214 193416 206180 260965 307618 396474 396573 486234 488960
8231 488960 537237 505965 446422 447913 440483 423498 403239 406624 390653 354252 249853 167085
8219 167085 195743 281301 363319 292777 278129 275369 277298 303733 337852 321363 326466 341672
8207 341672 395481 447265 486097 442570 495566 521317 464204 387135 402303 505975 528981
8196 528981 523742 479741 419023 420383 481386 549461 511992 514847 623466 824659 924541 958358
8184 958358 981066 939573 959926 968891 1072321 1212328 1384085 1536605 1704885 1849020 1970059
8173 1970059 2120091 2159855 2213394 2339920 2447183 2639213 2833470 3083810 3490762 4027470
8163 4027470 4509614 4909618 5320618 5947991 6822631 7891343 9446478 11480193 14228066
8154 14228066 18390463 24792723 34818115 49720792 68896787 89098222 108361355
8147 108361355 126730814 138699832 136980814 124217263 106240628 85033272 64070137
8140 64070137 47086399 35279893 27474410 22161197 18524683 15966573 14145592 12680046
8132 12680046 11593098 10804942 10188987 9891784 9583333 9288720 9062977 8860623 8608407
8123 8608407 8273924 8063846 8107600 8385088 8753758 9319742 9965553 10712723 11586213 12473609
8113 12473609 13588187 15127877 17298965 20454569 25062428 31620727 40429089 52552001
8105 52552001 71576451 102469144 145693585 195639547 246165691 273421028 261519527
8098 261519527 225706279 179820982 133265248 95504480 69569499 52882067 42061506
8091 42061506 34761010 29794120 26384340 23953190 22167317 20443332 18618251 16951749
8083 16951749 15284733 13723812 12337090 11231530 10389325 9796225 9421394 9320219 9375893
8074 9375893 9504443 9601645 9619277 9480105 9371875 9429958 9657430 10127377 10939559 12161542
8064 12161542 13919033 16525416 20232105 25782677 33894241 45058634 57846964 70804485
8056 70804485 83843145 94681268 97132102 90133010 80616494 72165380 61253668 47248179
8048 47248179 34350936 25143704 19373542 15574474 12922604 11081894 9690747 8535234
8040 8535234 7604276 6827088 6036472 5354917 4807131 4264692 3774083 3444951 3176398 2907347
8030 2907347 2686111 2408923 2259926 2109814 1990360 1942718 1874984 1701219 1611490 1572167
8020 1572167 1461512 1328778 1266075 1202492 1143205 1030935 986876 937618 901556 817848 749847
8009 749847 757205 750975 774226 831175 783604 754695 777950 682370 658289 655172 658457 667416 631948
7996 631948 577556 546607 514906 573921 605196 544608 563417 636322 658750 603871 481049
7985 481049 409262 400743 451928 556806 542322 497831 480514 549367 658150 656559 618649 564992
7973 564992 439674 348522 314175 285733 261413 305097 275077 288382 324100 245737 197115
7962 197115 108612 83142 107679 95175 135916 153313 228052 315368 335900 309003 245195 298089
7950 298089 263827 325651 360973 324066 310245 294472 307029 298908 272060 314875 338679 302967
7938 302967 280047 261182 187213 245367 308398 309888 330183 320685 228252 197422 86389 8963
7926 8963 21179 68352 198570 270925 224348 249975 238112 207078 190283 201793 215940 228866
7914 228866 200962 195565 309536 395555 358329 306211 145157 90024 91924 26903 6135 19102
7902 19102 105262 149793 135808 134199 132599 152273 143596 258761 211174 169717 205582 206021 126971
7889 126971 109998 94477 81556 123773 166732 159003 140653 125518 229329 248423 215798 176765
7877 176765 125736 170960 159265 101360 94209 136328 208623 223647 211772 156948 153533 183077
7865 183077 157527 208322 228388 205442 184650 159483 160114 172139 151411 122823 180516 173075
7853 173075 164089 215133 158809 55224 -20800 30390 84745 145475 211021 203634 178815 152142
7841 152142 114943 76666 114054 199177 124210 131271 153220 114788 3744 72874 82601 25269
7829 25269 112988 183505 183362 102059 152264 185441 221744 188870 161904 62634 94 -15640
7817 -15640 46925 163417 242296 119228 35317 134328 171483 255530 244623 242967 142562
7806 142562 146491 137775 160860 131619 105893 86366 55700 30146 -10892 24075 61069 33291
7794 33291 -25630 -12372 121840 121288 147412 126928 134692 75450 64620 12283 -50260 34694
7782 34694 125670 149735 97452 68974 70469 -25564 -49390 4357 -77606 -69175 -48098 -17933
7770 -17933 -13962 1202 22056 -49888 -115399 -42052 -31202 818 -55929 6015 15507 -5044
7758 -5044 61384 84622 88845 153071 250955 248011 257864 356790 502216 659224 808432 841239
7746 841239 823012 802883 646364 422597 282605 240346 222840 214904 199548 155720 59610
7735 59610 48416 83702 97848 143264 121216 129545 51042 67278 110314 158966 164372 157756
7723 157756 190442 228855 247794 270624 283950 274299 263696 277058 294481 229142 151269 193839
7711 193839 243717 261971 176959 150356 259476 455595 697035 934916 1187975 1465364
7701 1465364 1598253 1541182 1271977 976440 728619 567951 455433 326602 178657 84878
7691 84878 125688 172939 218297 153594 121936 101627 86792 137173 149931 139292 145900 66237
7679 66237 27494 -17351 9913 43901 117068 115618 146392 129055 201600 177700 121560 103995
7667 103995 149690 130552 83763 76957 168059 276265 287370 292306 372109 438754 511146 482416
7655 482416 482057 453118 517435 529984 407649 267912 122567 51458 54946 90745 137168 44862
7643 44862 1382 57027 95603 166645 212773 134991 34133 28513 58951 26923 97882 58539
7631 58539 67658 85962 97003 85256 27139 11562 37656 57743 136312 108936 -21708 1907
7619 1907 -19363 -60604 -35931 -14525 73875 99780 96147 84325 61995 81613 131820 95206
7607 95206 33531 -90223 -102482 -20500 -8186 -48094 1407 49768 66366 78829 4717 -27435
7595 -27435 49616 54573 77088 39448 7538 -62498 -10630 38325 69202 104145 110975 25082
7583 25082 -8236 -34557 -96181 -75888 -15869 -20521 -635 48663 36466 -4439 -87540 -60064
7571 -60064 -37576 -60079 -110430 -88451 -52879 9370 -12247 -18188 -38409 -97790 -52625 -48485
7559 -48485 -3851 8637 19518 76461 172645 98563 36254 63069 131373 152060 61568 15979
7547 15979 -33550 91365 122885 185734 142598 70889 33312 -36861 -7243 30406 4173 19069
7535 19069 20821 43296 135060 13363 -10240 26591 11856 -43624 -85730 -112912 -27953 137321
7523 137321 178671 203551 202964 159332 67001 124445 161937 127556 41388 12413 63248 98940
7511 98940 78862 6312 -46166 -35190 -864 -55602 -93357 -3000 60783 60381 -4173 -120821
7499 -120821 -168254 -85914 52238 42021 9287 11468 49124 -79780 -140961 -59933 -35969
7488 -35969 -50365 -71103 -24546 61534 77005 41765 16554 11997 -6649 -889 10334 38811
7476 38811 58187 78035 -13978 -67920 -71506 -70352 101282 158832 69851 -65962 -70700 -31180
7464 -31180 -30232 -71220 -79358 -30233 -10031 -72251 -116455 -60700 26090 77957 40194 35342 7694
7451 7694 -62252 -39920 -46210 -77755 -31503 27556 85319 44869 4819 62478 33005 33061 97599
7438 97599 86948 125184 100823 28494 46388 -10917 -61275 -54921 -132379 -130256 -68801 24125
7426 24125 19388 -8438 -18058 41852 9215 70851 142736 54669 61906 133178 105740 90009
7414 90009 158020 140983 131552 272233 255422 159142 116636 56334 67171 141001 194237 150162
7402 150162 62530 28887 -88521 -79911 -25468 -37801 50446 28018 41903 66230 2446 -28608
7390 -28608 14438 20476 -3944 -64071 -49795 -43463 -62534 -60014 -32052 48850 90986 7117
7378 7117 -39278 -9470 -43274 -47310 -54324 1504 9413 -57978 -128650 -165388 -136050 -80825 -76934
7365 -76934 -35679 -9499 17346 67108 62194 -18029 -77696 -85527 -107117 -29234 -62202 -64982
7353 -64982 -32069 -66816 -135268 -129861 -75991 -65693 -33944 -132790 -93320 -76101 34832 86967
7341 86967 -31305 -160422 -139769 -45424 18565 -3706 -9516 963 -10407 83152 140252 120785
7329 120785 115149 110552 70727 68901 24968 -54281 -42729 8032 -29743 34841 13578 -96994
7317 -96994 -208856 -239171 -191940 -123471 -59221 -62030 -109103 -83013 -27382 -879 -71955 -100907
7305 -100907 -53846 40515 116837 92975 82218 177427 222490 151611 129295 63346 120368 162612
7293 162612 161216 105615 101547 139034 147286 62990 60901 7156 13071 59110 124704 63045 23698
7280 23698 66319 65538 -3146 -57948 -59555 -63996 -112823 -105643 -90101 -109132 -142982 -123978 -89891
7267 -89891 -33296 32694 -6635 -98857 -125694 -142141 -46072 -47758 -49086 -43137 -86671 -82818 -93526
7254 -93526 -135437 -110473 -111833 -118163 -111247 -74708 -46334 -55559 -94236 -48749 -324 38605 80221
7241 80221 33522 -21356 -26525 -7535 -27760 17914 12420 -19169 -47467 -29894 23433 2915
7229 2915 3629 -99366 -123297 -145086 -69857 -68449 -140492 -164186 -135235 -13768 114665 40014
7217 40014 14511 67701 41951 -37876 -22785 60473 66284 -5986 -75713 -27948 54198 74986
7205 74986 4924 -57053 -108476 -110902 -99291 -44955 -35992 -6106 71966 75054 19232 -11676
7193 -11676 -46189 -50432 -54116 -52079 14005 140608 111158 107118 89184 31050 -85841 -125276
7181 -125276 -89845 -83153 -96025 -59998 -58619 -69802 -81881 -56271 -10505 30015 -11279 -15849
7169 -15849 37151 32752 9100 -27690 -33476 -18660 -37610 -31034 -16177 12598 63986 -52426
7157 -52426 -149599 -176800 -196785 -162458 -117803 -118302 -47055 45840 105010 64579 44652 54409
7145 54409 26181 1 -53588 -96749 -104479 -176480 -167701 -107342 -52679 -5831 11140 49581
7133 49581 125619 130557 142867 101056 -5537 -88925 -67932 8353 35852 40989 14825 -22654
7121 -22654 -9936 -12854 53031 94851 131809 85472 -4712 -23292 5390 -47750 -57801 -58854
7109 -58854 75707 119961 176571 92113 -50338 -69608 -47489 -97981 -73956 -24693 -58763
7098 -58763 -115821 -46040 -46633 -78780 -5910 66911 105330 103750 87905 19876 -94513 -106304
7086 -106304 -114928 -33920 -9268 -13822 31203 -17990 -84294 -42609 -18919 -34212 -32105 -29391
7074 -29391 14639 -18780 -16796 29715 32759 63946 33705 10280 -38043 -7796 -59531 -61935
7062 -61935 -69258 -118594 -26708 104205 63399 106447 124996 119777 142630 56598 49765 47571
7050 47571 4088 -18948 -39662 -16101 7415 50152 119556 123080 17437 -18350 55999 87002
7038 87002 89458 77949 96627 79292 -56215 -127935 -216592 -231906 -76394 23911 53894
7027 53894 78208 1743 210 15733 8074 19837 7759 32045 69832 87378 110126 25509
7015 25509 -32916 -69976 -44207 -87146 -113477 -61925 -37195 -89669 -85367 -84638 -29599 -14433
7003 -14433 -17254 10611 -43540 -129013 -226153 -250351 -229218 -199164 -183684 -147708 -157268 -169597
6991 -169597 -117244 -31105 12147 24584 33906 -37979 -75638 -15771 -565 11189 -80161 -114038
6979 -114038 -88890 -31589 55570 -10070 -74282 -88337 -46721 143495 275633 204347 43971
6968 43971 12749 111 -38873 -105002 -67434 -62183 -79896 -113245 -110004 -68260 -3094 -36178
6956 -36178 -136318 -116805 -145085 -132836 -126973 -43812 -35559 -99416 -89422 -4768 85511 58989
6944 58989 47329 20123 -2481 -66996 -72140 -42804 19218 33344 4899 -8753 -54527 -93078
6932 -93078 -77137 -39693 -43732 -88921 -32331 -116815 -134541 -121875 -96231 -96178 -64826 -37122 -49407
6919 -49407 -12168 113269 121245 125390 81002 41002 12705 -8064 14310 57430 84662 12264
6907 12264 5258 54385 53487 -47755 -142419 -188536 -140798 -35003 60073 58490 84571 38482
6895 38482 -45149 -123741 -51829 31187 43391 128375 100641 44005 -3602 24542 21992 -30594
6883 -30594 -7298 -29413 -91463 -104574 -41787 124293 175370 134545 65396 -24879 -82180 -38379
6871 -38379 -51423 -88632 -135214 -137446 -150641 -58895 -7695 -38510 -81374 -71684 -45835 -49816
6859 -49816 -107856 -73404 -32760 12742 31850 -19142 -28866 -38217 -60225 -71604 -69565 -95155
6847 -95155 -178427 -207783 -61499 12643 -37755 -51172 -38301 -55170 -37573 2859 89486 176264
6835 176264 125854 68459 31224 1525 40355 74145 -1811 -22963 -12931 -78757 -89625 -98046
6823 -98046 -105046 -116704 -72599 -82049 -73077 -65031 -142070 -142647 -21558 19526 -2663 -13650 -104660
6810 -104660 -153518 -145692 -96941 -57316 -22042 -9168 5547 13014 74645 1950 -47928 -24860
6798 -24860 44064 86324 43189 49995 44558 45667 35339 -9688 -64069 -138129 -182018 -143789
6786 -143789 -93686 33618 62951 4073 -90018 1297 42230 12647 5061 34141 70097 90452
6774 90452 95609 123904 28334 -50247 -107668 -146026 -140031 -96984 -78003 -26591 -177921 -131364
6762 -131364 -21587 36895 4438 55808 26327 -6954 23510 -19669 -5491 26868 -4965
6751 -4965 -46014 33789 14798 -104407 -216723 -260992 -205259 -97695 -24292 -36155 55944
6740 55944 107582 48328 5954 8888 -36211 -69803 45090 -22927 -27965 -48884 -35425 -8506
6728 -8506 40564 136618 133907 95429 52110 10483 -84916 -117790 -112501 -112472 -49605 14979 -31297
6715 -31297 -73347 -117174 -53888 -25982 -20965 -15234 -40996 -49891 17668 -13729 52751 34895
6703 34895 -47909 -30439 -80089 -30506 38017 81492 -23685 -104145 -183630 -195786 -178028 -110464
6691 -110464 -49185 -58880 13223 124651 112735 -10945 -81953 -63582 -52499 -36015 -104256
6680 -104256 -58698 -35607 -20288 -17305 -27661 -34017 -33510 -8025 6833 -78785 -131369 -121561 -107385
6667 -107385 -66135 10434 156730 137272 93678 97334 149859 150483 -4649 -85192 -143174 -103225
6655 -103225 -19924 7345 59087 77876 77500 9218 -28412 -40668 -74254 -17289 3008 13710
6643 13710 49279 88504 96945 114229 58989 72241 46869 88514 96744 4932 -117965 -33593
6631 -33593 -5910 40291 26590 -13294 -54398 -83102 -12651 10437 20361 17419 12111 -1069
6619 -1069 26653 25323 -31789 -61133 -79097 -151709 -151550 -107660 7505 27045 -54916 -30167
6607 -30167 13434 31803 23816 50334 65216 -8594 -28987 -13660 -21788 54584 113874 99964
6595 99964 146986 162418 68471 -29974 -41350 -71336 -125040 -135699 -96545 -16920 549 -16124
6583 -16124 -31062 -49196 -13944 -1000 52140 41851 30851 79893 48242 68921 35104 27648
6571 27648 88774 151796 142578 135617 176954 169195 180571 121480 42924 54693 52841 33794 -48342
6558 -48342 -85204 -39598 -50509 -121870 -110902 -27217 751 7917 21402 26818 58299 128377
6546 128377 103501 150713 206316 155579 149999 164470 135792 23817 -21571 -17517 -49809 -122370
6534 -122370 -170974 -162885 -79182 -6957 -18338 -14958 6009 19421 22164 15193 -75125 -131952
6522 -131952 -66669 41057 17496 -9780 -64667 -42921 12502 7673 17228 46803 -975 -40076
6510 -40076 7766 35308 -27038 -45628 -59213 -135749 -151835 -58716 15923 11920 -14866 -46232
6498 -46232 -74383 -24319 65075 -23945 -115536 -117999 -88085 -142961 -137072 18003 48884 -12783
6486 -12783 -72216 -17169 50150 71377 47948 37934 -38056 -46913 -32410 -41665 -72665 -87320
6474 -87320 -71418 -75476 -10939 49020 6205 -18497 -25117 -113951 -92230 -56732 -103861 -103745 -56916
6461 -56916 19354 -369 91555 131287 146215 187587 101894 66719 82153 50849 61180 75116
6449 75116 75256 126301 73398 14853 -69515 -142639 -82439 82529 156536 166112 80874 -1086
6437 -1086 -25244 8086 -502 -2824 20553 -25558 -21944 -80034 -110119 -174902 -159452 -162842 -182062
6424 -182062 -182317 -195421 -132870 -35604 42241 -9179 -71082 -93757 -98410 -96475 -40422 30351
6412 30351 -35682 -66446 -26228 -35418 -62106 13794 1309 -48696 28684 66545 72879 54486
6400 54486 -23222 -35005 -10875 4842 -13169 -65383 -75333 -38023 -66652 -67706 -41291 -140077
6388 -140077 -207106 -277558 -252961 -184657 -175548 -76822 -21267 -112462 -111715 -74734 -20164 70706
6376 70706 92223 51483 82164 168970 121040 126620 158339 55969 35132 40143 18493 42722
6364 42722 91722 -2475 -31992 -56608 -44519 -79188 -38443 -40917 -94941 -81113 -51023 -30045
6352 -30045 -25333 154366 96307 403 -79649 -46970 -2716 -58423 -50034 -109255 -92086 -170203
6340 -170203 -153271 -125984 -113534 -75253 -31917 -115056 -169676 -219079 -167860 -17773 -47486
6329 -47486 -23111 -22433 -73882 -99489 -98347 -5349 8188 -97992 -134936 -72373 -82036 -35854
6317 -35854 59161 172817 210943 139642 91788 28378 -70205 -48238 -23518 -16407 89777 147178
6305 147178 -1556 -72457 -68329 -38934 4038 15411 28245 61798 48559 -39648 -2969 13104
6293 13104 -29744 -30809 -30156 -104360 -113282 -131546 -168404 -110254 -41832 3340 -12388 -23991 -11518
6280 -11518 770 -31136 -54546 -28020 36327 105744 -45346 -51390 19691 13931 -72076 -49237
6268 -49237 -26909 -33915 -47102 -90250 -76402 4382 20210 37988 -54034 -139840 -157816 -101436
6256 -101436 -49803 -10601 39493 28888 -3819 11582 12253 79145 88197 24020 26875 98530
6244 98530 157278 91470 89053 31490 2570 26517 37137 -20807 -34886 6758 51762 -17152
6232 -17152 64036 103246 93050 71752 73581 33778 -7543 -27489 -41328 -5769 55474 120949
6220 120949 106059 45870 -5787 -36735 -47171 -77652 -61389 -52474 -41449 -29768 -59482 -106636
6208 -106636 -94965 -92773 -1254 115475 98242 73654 48184 28525 -37833 -45907 -53700 -40030
6196 -40030 -41061 -17906 -9592 -20837 16500 -26595 -108431 -64848 -36384 5848 72899 69022
6184 69022 -10455 -57064 -85839 -43405 46335 43545 63251 80745 8371 -69196 -82491 -94043
6172 -94043 -108149 -74773 -72262 -135909 -47666 -17089 -13566 24551 39658 72097 35918 -45779
6160 -45779 -84333 -130609 -136910 -141119 -137854 -80230 46674 20302 16568 20701 -2491 14048 59985
6147 59985 69848 41566 21168 8802 22587 -19171 -114652 -102330 -37055 -62610 -40498 30434
6135 30434 -42925 -53897 -25860 -14276 75753 39859 84752 249067 304541 207394 130570 143497
6123 143497 74547 -12137 18913 105625 35791 60478 128645 110022 26306 -58554 -125378 -126421
6111 -126421 -103198 -42690 -6434 7243 -6693 -20322 48645 25791 34099 88449 35363 29265
6099 29265 39191 20506 78335 114669 134470 155426 115833 67249 60697 39345 -70457 -131468
6087 -131468 -47217 23405 39252 14190 25665 16493 60040 83566 97544 40506 26900 23630
6075 23630 3334 14187 -18647 -57761 -82464 -97256 -118419 -149396 -184451 -213995 -111509 5599
6063 5599 -44335 -59209 -72643 -72660 15326 89497 72830 -56856 -60057 -104136 -85621 -53765 -958
6050 -958 -14465 -14934 -21549 1917 4530 -68203 -106636 -102537 -59486 -107884 -10314 71141 54594
6037 54594 87713 165466 228048 213537 181440 162180 104527 67121 111407 81906 44305 78641
6025 78641 86570 73494 -17873 21676 92931 90409 66899 49673 -38571 -128262 -147016 -95414
6013 -95414 -97310 -109699 -106212 -86294 -34742 -27982 -220 -16956 -44125 -59131 -82565 -143854
6001 -143854 -157785 -88047 37650 168624 130133 116878 188513 45195 -42846 44699 88282
5990 88282 56722 101026 33858 24886 -7217 -97596 -148283 -83556 -70023 -27242 58476 51010
5978 51010 81667 16426 -74536 -142980 -136356 -72255 -87195 -120167 -52265 -9568 68861 87574
5966 87574 24658 23775 67139 149504 103305 76574 103972 146572 71267 15495 132927 139451
5954 139451 137234 74339 96387 86392 93984 62181 28114 -52856 -121426 -54791 -19700 -56820
5942 -56820 -31253 7853 -64969 -113631 -81700 -30551 -11310 35220 59311 -24517 -93056 -191559
5930 -191559 -189269 -58891 65954 128276 107553 46626 11281 -56509 -68956 -52387 -129151
5919 -129151 -59485 -50776 -110232 -136442 -85519 -73099 -125571 -128097 -25047 23632 56812 57564
5907 57564 42056 -33646 -153197 -94330 -8010 18160 33967 8101 10125 -10070 14211 11790
5895 11790 1387 64446 40351 47939 27552 74953 132974 160051 130182 75061 53355 20497
5883 20497 -20318 15747 -9405 -56794 457 38602 -43078 -143221 -185013 -151006 -89480 -69282
5871 -69282 -42830 -44754 -46814 78097 18522 -68079 -66903 -40256 2961 30002 65807 80611
5859 80611 -18422 -75359 -53954 23904 52129 43652 40462 35989 20381 63487 79105 55686
5847 55686 88935 18993 -79897 -81744 -61928 6851 89826 86081 32336 25904 -16476 -88899
5835 -88899 -40845 -34411 -40459 -39449 -17831 61558 73035 18736 -54790 -67515 -60812 -69692 -60805
5822 -60805 -16811 -10127 -15814 30023 48232 52778 131675 101942 36938 -39500 -51368 -40741
5810 -40741 29847 30069 -19489 3672 97692 108238 160651 100459 -8653 26171 93964 147399
5798 147399 104038 20314 31714 41069 65719 23519 -17754 52644 81675 66635 25621 -13215
5786 -13215 9525 1271 -36219 -15107 106459 84857 92768 110742 182534 195318 152906 106686
5774 106686 68575 11542 33175 45091 74792 3764 -114426 -102231 -11687 16817 31119
5763 31119 -19641 -51600 -41022 -65193 -2582 12437 -61201 -79070 -11505 -28582 -47930 -52572
5751 -52572 -46428 -99867 -126209 -62662 -67451 -64752 -97746 -81780 -69996 -77233 -44988 -71384 -103699
5738 -103699 -26772 18707 19467 37938 1139 -72123 -127116 -132231 -119605 -33817 5399 -26705
5726 -26705 -53299 12394 9372 -85957 -92363 -75199 -47422 -75518 -59288 2730 -38083 62525
5714 62525 152127 142478 104715 123746 79159 46667 22580 58905 51348 20919 41027 80884
5702 80884 138597 111442 -3294 729 93466 27030 -47445 -15483 -7056 10414 2484 -66726
5690 -66726 -18340 36542 122374 193612 209267 170402 122253 60337 -2092 6240 20533 -28584
5678 -28584 -45939 -16163 49766 56682 45960 54226 17271 -43473 -20088 -48775 -6681 29793
5666 29793 32250 -10267 -7508 -31479 38534 37920 -67883 -116536 -20075 72770 131083 71988
5654 71988 90766 43928 -43067 -48028 -73001 -122258 -117082 -108253 -168431 -173893 -170121 -240374 -146359
5641 -146359 27440 51444 -70613 -135902 -77293 -80895 -78253 5896 101718 78074 83898 21838
5629 21838 29805 26943 69380 135599 8924 -34563 41956 47524 6456 -93847 -50754 -4823
5617 -4823 -25485 -63068 -92573 -147638 -124177 -77678 -63621 -73505 -42618 -31499 -66947 -71997
5605 -71997 -33225 -41935 -41692 -102986 -64894 8177 -15218 -64250 -129576 -104660 7940 36905
5593 36905 -4404 3773 11051 -36542 -59068 -14187 35007 3662 -28556 -44004 -115695 -57419
5581 -57419 58864 81734 96139 49962 -42898 -30494 -6376 19606 52833 21680 -5475 -17059
5569 -17059 -66415 -52275 7407 50420 56702 -3360 20033 96314 31345 9478 19832 21578
5557 21578 -52466 -121210 -115625 -84458 -39600 84458 118213 72575 4795 21944 10838 16356
5545 16356 -39415 -64540 15460 561 -19792 -27328 179 -29242 -70209 35226 62176 -13224
5533 -13224 -7302 -5340 8240 9327 -49498 -79524 -57092 -41385 46495 57178 32117 27471 48352
5520 48352 -57036 -127513 -127543 -39089 -26575 -21433 -69571 -40241 125765 127504 9402 38959
5508 38959 55578 18865 -49219 -77866 -68604 48309 82612 105343 139338 165300 145594 -5551
5496 -5551 -63118 -4335 1502 -87810 -89501 -84620 -68517 -72839 -140956 -144253 -123343 -170452 -218218
5483 -218218 -188648 -110642 -31085 49664 51899 -21029 16697 59297 -1257 -3807 19172 767
5471 767 25619 74955 68929 47682 86723 90443 57180 -2591 -28900 -100415 -49748 -1335 22742
5458 22742 -3830 -37413 61442 64806 45312 59503 72480 34501 -39987 -99238 -104265 -108953
5446 -108953 -37362 3191 -41490 -21854 -48479 -91651 -110288 -128045 -117613 -8550 24935
5435 24935 -7384 59590 70444 15044 -105232 -81723 -95801 -118917 -80564 -129330 -74405 -12026
5423 -12026 45570 93907 70291 89718 118304 159524 164150 88911 102223 -21765 -115408 -136105
5411 -136105 -117755 -44720 -2314 12971 -47840 10061 -13378 -43068 5994 8723 67980 68467
5399 68467 41521 39191 63503 16569 26147 82775 136133 60630 -14610 -36472 -68967 -1814
5387 -1814 18713 -16881 20803 -31570 -23560 -67507 -61512 42371 52729 617 -16294 697
5375 697 -18864 -10322 -11630 -5220 -23548 -51745 -126487 -116706 -5183 -22142 -8086 42370 -17639
5362 -17639 56172 132003 137064 77552 33583 24484 68563 107274 126562 57976 72627 135568
5350 135568 134260 111967 173767 87564 75560 94232 42383 -4085 26742 14879 31545 29963
5338 29963 -35586 74880 131442 146652 82931 47054 19420 -4414 -98584 -113661 -123048 -83878
5326 -83878 -52691 -108075 -63419 -99551 -76458 -20952 8671 -6924 2759 41741 -6950 12621
5314 12621 26193 36371 15297 1103 -52494 -70098 -49929 -34917 -5943 -2771 63522 85505
5302 85505 111719 153155 87690 72240 84439 -23609 -125172 -86739 8162 6955 97665 86795
5290 86795 46055 -11842 -32643 28926 103167 157041 89881 18858 -23267 -17590 -24875 -42493
5278 -42493 -57613 -50822 2896 -27709 -31340 -28026 124 -15023 -1667 -54336 -39405 -662
5266 -662 -66534 -131621 5317 26994 46971 60159 41510 119693 169763 155347 118280 62657
5254 62657 50390 82084 38717 29924 -23475 -52508 -53543 3276 -1636 926 11010 15636 128610
5241 128610 147537 110894 9397 -814 68249 -11111 -66690 -64931 -19210 -12157 -37730 -109844
5229 -109844 -168460 -80971 -571 -25096 39398 30556 59245 86034 120975 162053 200902 162946
5217 162946 131280 117430 114626 143318 134315 76409 106335 68824 47137 101536 75974 108887
5205 108887 65703 -59930 -136500 -125748 -61873 26586 37870 26127 28226 -10364 -47296 27874
5193 27874 72998 13281 -38335 -11227 65975 111892 93733 67067 81207 130114 103044 56302
5181 56302 82208 64219 135901 84128 40544 9028 1118 -30754 -12821 26195 10109 -13004
5169 -13004 14829 -52798 -125445 -103820 -175037 -125061 -37370 -1145 -2377 -44359 -98242 -61160
5157 -61160 25945 99752 132709 171823 158859 99756 -6248 -24361 25796 -47781 -17615 48236
5145 48236 85939 13540 -38483 -46715 31558 32490 -56229 -125994 -183253 -136030 -59635 -9771
5133 -9771 42001 71021 -27623 -65619 -43228 -77944 -101923 -90321 -26669 20585 102056 115363
5121 115363 72135 37147 40288 -40238 -18355 116824 46403 -65733 -104143 -71612 -30877
5110 -30877 -27930 -17743 -69858 -28232 -24380 -77197 17495 67079 7518 -27678 -92507 -187838
5098 -187838 -157458 -3995 103698 150917 85054 20736 129537 93113 62964 51858 63079
5087 63079 15838 -27462 -16360 -43025 -40068 46611 24263 -7452 -64079 -62328 -49957 -31226
5075 -31226 1996 -46325 -120012 -128000 -77961 -8124 -67732 -93028 -101614 -140819 -80226 -27573
5063 -27573 -126170 -101698 -163281 -180932 -9885 43132 91507 51554 -6420 42447 137351 166810
5051 166810 152194 114507 155321 141080 65699 28032 -2003 -83395 -146796 -170966 -99910 -60136
5039 -60136 -62157 -60324 -319 8503 -18433 -106233 -124990 -46845 -8505 -23679 -69680 -27674
5027 -27674 -19179 6863 7877 -117309 -113733 -101526 -123880 -138857 -194852 -198554 -131731 -146607
5015 -146607 -126357 -73261 -30771 7 42921 9861 -6603 65645 75436 55921 27091 4195
5003 4195 55206 58835 -20631 -136297 -110290 -41391 -72150 -45777 -94933 -65693 51955 143561
4991 143561 71802 -39967 -107311 -4938 55441 40279 -40981 -10238 -42195 -60698 30341
4980 30341 130529 65066 52240 47838 28119 4565 112068 20112 -29757 53731 107714 94737
4968 94737 114960 -49015 -104784 -29575 83372 80697 47190 26971 56585 44996 117129 178900
4956 178900 260971 129858 32429 7513 -17392 -50708 -66484 5665 52987 16188 -78742
4945 -78742 -4417 68588 83422 29899 -53211 -86767 -153684 -223123 -168826 -105774 -11141 -18363
4933 -18363 -18231 -68965 -74953 -80573 -22528 7143 -37483 -50453 -15791 -14138 39599 6850 -32226
4920 -32226 40943 69102 6655 43530 75039 30476 -45762 -71818 -32332 -107106 -93441 15786
4908 15786 114215 106442 98165 41534 26021 -75555 -130614 -119294 -80168 -72038 -36676 -24191
4896 -24191 -80664 -95293 -58412 -135937 -117359 -105540 -84117 24395 -48920 -140036 -160901 -197013
4884 -197013 -186532 -148182 -190391 -135355 -91093 -43416 -54355 -4344 53486 68571 29613 58273
4872 58273 109836 51216 -44571 -59842 -41581 38765 -35140 -74103 -18673 -77000 -164534 3554
4860 3554 57477 36621 -69862 -98406 -9422 5843 -30134 -25267 -30525 -33331 1038 -12064
4848 -12064 21895 12580 -3098 69541 26280 -126332 -202568 -146898 -97637 -91519 -142421 -115033
4836 -115033 -32202 123 20094 9148 -98814 -87911 -21875 -24843 577 -34406 -37246 6687
4824 6687 18676 -657 53533 29511 -19455 -16302 20991 31904 -40349 -9645 78211 46056
4812 46056 31769 66514 23375 -47597 44693 112543 46495 13709 21713 101580 30264 -114716
4800 -114716 -133705 -121224 -116549 -77281 -46252 36344 69090 -30560 -147591 -122247 -53751 -20714
4788 -20714 85178 65292 7197 -18472 -17986 -16064 -101565 -86482 25301 78534 46466 107164
4776 107164 109580 31613 -8514 -15101 -141906 -139059 -141533 -107291 -77560 -77289 -48766 -46405 -22231
4763 -22231 -31600 -53877 -137052 -211987 -229626 -224609 -114586 -62482 -76791 -20046 29205 27024
4751 27024 -36828 -86533 -79577 -94684 -93639 -40683 -71665 -116909 -29715 61334 64912 65894 5195
4738 5195 -79874 -17106 34669 15338 -47628 46795 88814 20992 -1067 -40313 5068 25750
4726 25750 71919 138751 101354 12108 -34364 -94733 -139567 -137573 -125020 -131281 -138624 -85315
4714 -85315 12216 96685 70218 -54234 -51345 52947 90878 115655 158187 5825 -73632
4703 -73632 23698 78205 72694 102221 143228 92528 48468 -36627 -122419 -162303 -153220 -74600
4691 -74600 -10047 37089 66290 23968 -67897 -137271 -58290 -49167 12329 12141 62917 62897 51995
4678 51995 105185 169409 88823 -2400 90752 141165 85712 65650 26178 21819 31485 32137 -36934
4665 -36934 -51068 -89107 -68980 -126243 -94949 9202 118885 50304 -14689 -11924 -43801 4341
4653 4341 64075 116209 164372 165281 178814 89015 24017 -41431 -175732 -81614 88019 156740
4641 156740 88346 68909 25963 -45389 -110858 -59952 27593 80134 69483 6767 -5722 11691
4629 11691 -49754 -54443 -53369 -29828 -21376 -111608 -135692 -56933 13292 -73980 -108763 -155749
4617 -155749 -152138 -90935 -9968 8444 48171 60101 69835 88089 57731 12366 -37460 -111254
4605 -111254 -56576 -77830 -570 70021 74714 43505 799 -53977 -54376 -15178 -68456 -47396
4593 -47396 -75599 -61306 41209 22461 50222 94833 89168 29905 55521 58274 11960 -41508
4581 -41508 56015 80732 42781 77165 37318 25780 74005 59373 45440 -70156 -51695 -43038
4569 -43038 -21039 52654 67318 77104 131458 183174 108069 35129 62130 28804 10005 -35261
4557 -35261 -65051 -82765 -66834 -102165 -69125 -56330 1117 37465 97015 117872 97940 142817
4545 142817 187938 77525 -44404 -47536 7597 16927 43206 60744 27649 15453 -1519 10014
4533 10014 37419 -41919 -44292 59194 54369 11700 -42997 -21257 74172 77426 79688 21015
4521 21015 32133 55401 60958 100789 113530 41132 40356 167 -67313 -70349 8324 13798 41178
4508 41178 6875 17854 70218 89354 90632 71439 75129 14118 -13626 64912 56461 -696
4496 -696 6572 39458 95189 100854 58169 55581 53067 14333 -12223 14798 -111582 -199586 -175096
4483 -175096 -157897 -28733 29814 21474 39820 22748 -69804 -111841 -96572 -78716 -44572 -82766
4471 -82766 -82671 -53282 -3864 -12939 -21776 55430 9680 14767 -84187 -57506 -43060 -84521 -95384
4458 -95384 -64620 -38622 -21861 17030 88838 97751 35673 3003 -9615 -40299 -37191 -40025
4446 -40025 17207 51731 63568 101892 26413 -76165 -170734 -148334 -112959 -108692 -87246 4352
4434 4352 26820 -16238 -14352 -75327 -1337 50370 46851 -38004 -43819 -45560 -88186 -87279 24183
4421 24183 88622 -4564 -58585 -6923 30753 88848 144029 173950 164350 180186 213264 218941
4409 218941 173164 125670 101100 100141 39164 18554 50055 90354 85656 19963 29103 -16969
4397 -16969 -38040 12700 -25751 -51612 -42402 11116 46867 29980 7943 9187 12164 135242
4385 135242 135863 23191 80261 -467 -36919 -18745 -32828 -32954 -26653 -11745 -69529 -68959 -52672
4372 -52672 -65703 -34820 48424 47268 45872 2033 19754 17799 45540 71913 66974 22789 -111294
4359 -111294 -108835 -86526 -41387 22956 38222 -282 29088 55410 107494 107116 91067 161845
4347 161845 103687 26684 4874 56302 17292 -2541 23591 -8112 -68191 -55197 -58531 21787
4335 21787 61781 63720 49562 49097 62279 88377 28668 25254 165290 198908 155218 40959
4323 40959 11141 9718 52826 37504 65867 45672 22693 17364 -16086 57541 51081 64242
4311 64242 111326 138735 112744 89671 -31205 -132953 -218437 -135264 -6888 44066 28387
4300 28387 30369 -25454 -41368 49334 77714 115850 155860 147119 173526 133096 34983 -87453
4288 -87453 -132576 -46418 -2467 -33888 27227 43656 81577 45046 -1720 75074 123021 128847
4276 128847 88764 -356 -53016 -5369 80598 -17541 -46546 -2068 41004 71408 31410 -74473
4264 -74473 -24445 -45010 -67588 -5066 114964 40500 -25267 16065 -37586 -63982 -79339 -59720
4252 -59720 -4352 9664 18889 7736 24360 43568 32465 -556 27855 105318 76116 83451
4240 83451 57358 89182 110573 51158 -8764 -33945 -68343 -81257 -85778 -79276 47208 112349
4228 112349 55584 -66195 -118519 -118519 33184 32475 38054 38715 82458 75191 61878 62426 118475 122044
4214 122044 64993 5479 19636 -7330 -23036 -12565 40931 48146 13740 16902 33296 31487
4202 31487 96635 194474 148142 -24444 -34237 -52145 60210 181313 124542 50151 56537 101109
4190 101109 43700 52270 42070 4403 -66830 -99648 -70796 -60102 -54800 -82164 3903 36136
4178 36136 2418 -49362 -87193 -1858 -25801 -118056 -222778 -136840 -39928 -72268 -55043 28356
4166 28356 79036 -14127 -24737 -26990 68958 102731 -26911 -87018 -53872 -28556 -29153 -79369
4154 -79369 -55841 40544 65230 59066 70694 47559 -34168 -43976 76926 -3883 -141482 -73270
4142 -73270 -18648 -8357 -31316 32576 21793 -8480 -13 3836 -10606 -68829 -25386 -93
4130 -93 -1502 -2060 -85956 -60449 -64645 -72935 -40912 -13387 43116 -994 -49544 -106509 -19196
4117 -19196 17600 -46952 -33812 -32946 -37287 -33407 -46349 -33142 -602 -5829 -25447 -17568 -14290
4104 -14290 -44599 -63809 -66979 -3081 -5385 47309 119284 55755 -88032 -102082 -101436 -243482
4092 -243482 -245847 -113866 -18458 -40130 -83027 208 55441 79797 -19682 -170616 -178400 -132241
4080 -132241 -120217 -63165 -45850 -13000 121625 85609 6493 -32425 -21133 87785 98955
4069 98955 30110 -48205 -75201 -86583 -94096 -59627 -43844 -77492 -43937 -11531 -51417 -5766
4057 -5766 21900 -38347 -19867 51820 51398 22977 -43708 -111024 -46727 -8398 5410 -25052
4045 -25052 -49233 -60113 -124710 -80435 -55261 -3609 5509 -19598 65407 68917 80730 75507
4033 75507 1826 -66640 -22381 61330 41544 -14905 17137 49202 103696 45700 -11602 -29112
4021 -29112 844 20466 -5234 -16566 -25238 -74649 -49037 -15065 -93746 -76390 -5559 5903
4009 5903 -97619 -121921 -65359 27659 34741 69474 129820 158050 127353 67860 47565 104990
3997 104990 24345 -25168 -22319 -94220 -134772 -57831 -50867 -112639 -65716 -73055 -11155 -68898
3985 -68898 -101233 -160809 -69550 310 6008 18432 -32741 -6592 22160 12458 -39192 60390
3973 60390 112619 82937 59811 41256 39650 44347 81035 80893 54478 -43224 -101389 -134376 -89228
3960 -89228 -55370 -46998 6764 -80258 -80001 -26508 32099 50603 31234 -47761 -19993 16003
3948 16003 -9010 -46117 -58005 -145179 -95146 -91011 -9783 65939 1813 -61389 -54761 37963
3936 37963 113059 80647 37505 -43854 -125631 -92620 -79745 -73710 -96937 -52734 -36831 -14554
3924 -14554 1052 62520 20608 40117 20503 -30621 -43532 -122064 -213120 -210122 -117166 62737
3912 62737 40646 -118402 -110602 -85266 -107895 -80724 -89630 -14828 -13189 -18079 -32390 -37308 22652
3899 22652 59055 132451 100910 63989 12935 -7885 17949 -1960 -30179 -62135 -72387 -128160
3887 -128160 -195090 -238248 -114244 83889 49594 31655 31346 -26341 -38397 -55423 -76486 -122616
3875 -122616 -89717 -120918 -62014 8711 16301 86467 87918 -19073 -57533 25200 83373 9119
3863 9119 -92083 -103247 -25082 -21521 -109034 -96306 -17616 72085 20457 -38870 -46561 -9089
3851 -9089 49273 108757 181522 124801 -11649 -62241 -124182 -105103 -4735 6871 -41298 -51728
3839 -51728 -32255 6769 26506 63718 51202 -25255 -10207 28504 -27970 -66433 -82343 -51793
3827 -51793 -52190 -89282 -95664 -54797 13181 78916 120763 123773 119755 100324 16784 -3563 42990
3814 42990 92239 143027 93051 93797 36988 -4799 -4809 79145 91297 75409 43714 46978 39574
3801 39574 67011 -37079 10863 143415 84746 -47356 -91001 -122205 -112871 -116986 -168363 -125863
3789 -125863 -115283 -109982 -105471 -149043 -80395 -107660 -94507 -22904 44216 67159 66522 50919
3777 50919 439 -33603 -14784 -36034 -30571 -47529 -46554 -53834 -52994 -34023 125088 103928 -31334
3764 -31334 -41554 -22042 50291 19131 -54619 -34665 -35921 64911 76498 33556 61177 96673
3752 96673 50807 87869 66185 -4976 -84927 -162881 -78740 -16838 31010 -21022 -53967 -23568
3740 -23568 7867 55175 16422 44048 -2404 52282 129252 116444 69976 80159 68626 -1979
3728 -1979 -50639 -8118 79928 94506 135656 110129 108613 91758 36917 6310 -43913 -96860
3716 -96860 -35184 -43460 -88650 -77408 -25411 -52538 -23824 -26151 -34070 25965 -43831 -102094
3704 -102094 -49288 -16085 -61509 -96215 -35456 -5250 -64030 -159583 -213144 -211695 -146876 -156411
3692 -156411 -49616 -37452 282 -17837 -43221 59597 30079 -25876 -28098 -15427 29355
3681 29355 22073 65557 84883 34140 31963 19752 -16946 -32060 -65256 -53949 -38780 -84256
3669 -84256 -31269 47769 -11783 12454 80956 49794 72232 77132 63719 64193 47842 72502
3657 72502 76063 63970 102675 124812 112256 81361 74479 58190 -32674 -76623 -33372 -12276
3645 -12276 -72470 -85464 -40440 26284 -1405 -38598 -31253 -71406 -55961 32755 61211 70743
3633 70743 99617 21999 -34745 -73524 -78112 -109784 -123421 -24648 62888 115958 4083 -32594
3621 -32594 -31155 -35419 -12279 16296 82536 35983 -27003 -12961 32290 83087 55776 69627
3609 69627 86334 99932 127965 97727 53850 59982 45647 -27831 -31668 -61524 -42203 -16505
3597 -16505 -44166 -75510 -72541 -69745 -54202 11429 40942 4541 -49021 -8191 28098 32791
3585 32791 -52545 -55723 1191 103523 40583 -53097 -45886 10233 -45814 -145655 -39795 21531
3573 21531 34024 -66627 -118140 -18106 44763 78019 23945 -64996 -84993 -95130 -48055
3562 -48055 -3307 159 39698 73993 68669 38199 30783 6279 -92067 -141909 -60880 42019
3550 42019 82748 28705 -91469 -103526 -43780 -28215 -14549 -29518 -69759 -79589 25428 167780
3538 167780 131455 -19116 -127948 -241848 -262647 -226696 -47595 4103 19818 -69782 -72500
3527 -72500 -26687 -91949 -631 66901 109177 144209 149313 169194 162460 77320 58770 25050
3515 25050 3300 32005 90783 86473 102854 3025 -27656 34559 5723 -20193 -75839 -61802
3503 -61802 43001 50749 -37863 -98427 -132529 -82971 -33797 62400 96387 72900 53664 40287
3491 40287 35888 35478 -6008 2989 3339 -80451 -135610 -46564 80722 74278 -1859 -57326 -24345
3478 -24345 -43637 -60547 -61091 -34050 -107080 -43647 100584 170543 184169 156280 62671 20560
3466 20560 94613 99704 119098 188584 176271 144736 73567 -2400 33848 40475 56248 111675
3454 111675 93007 15576 -25381 65954 108427 86151 43030 -14040 -45807 41308 44384 -12431
3442 -12431 -42057 -14286 1686 52100 68377 93739 76644 76254 74043 20755 -7399 92590
3430 92590 184054 228282 243845 186525 28701 -104790 -177433 -212186 -219348 -78556 15150
3419 15150 22885 27509 10523 -15477 78287 66034 -47222 -109875 -82989 -94586 -26640 62238
3407 62238 125001 66260 38693 27701 38251 11811 -16264 -69225 -71353 -110504 -119133 -74495
3395 -74495 18728 954 -53342 -51484 62379 60532 64025 76691 28855 48595 69386 109113
3383 109113 29027 -33447 -40425 10168 34511 10003 26243 28121 -47093 -79282 -69146 -3965
3371 -3965 -47712 -90735 -90183 -89717 -14662 -26558 -74010 -108713 -67627 57138 102344 72924 -7969
3358 -7969 34088 35722 39304 84125 148175 137667 118696 67675 48002 21761 107493 181223
3346 181223 127141 148780 143371 181206 108851 91080 93379 7183 -31057 94637 113568 14184
3334 14184 -86209 -91105 -49705 -2624 42920 73910 104900 71535 -8276 -95361 -114661 -28781
3322 -28781 -40010 -137900 -96549 -8627 82983 151668 160496 119080 151987 90299 120646 45742
3310 45742 -3663 34414 30001 -64867 -27489 -128001 -165228 -131384 -75206 2191 56814 21607
3298 21607 -53209 -59428 -36890 -36536 -45115 -51731 6353 16368 -28335 -52958 -64168 -1817 28118
3285 28118 54470 847 -28496 10083 -6556 -13973 -13587 -25146 -58727 1962 103511 90225
3273 90225 65913 112573 132882 174624 110536 69424 20723 99927 -659 -85250 -46545 27199
3261 27199 31079 24732 -31067 -18867 43964 -1378 -25593 -14224 -29140 53203 101523 -2085
3249 -2085 -174368 -160645 -186634 -148902 -71587 -121566 -176433 -60446 -35975 -39085 -32125 -16492
3237 -16492 -24716 -77774 -113578 -93672 -47871 -75479 -69034 -66969 -117268 -58822 29076 47626
3225 47626 34553 27894 -44753 -55698 -37851 -20410 53958 79415 75278 34699 17281 16102
3213 16102 -1029 -39933 -70747 -92971 -134494 -156621 14012 27169 10933 14124 83403 32213
3201 32213 4393 -36546 -81898 -48247 41478 30423 -52800 -126086 -156016 -138176 -118932 -103545
3189 -103545 16369 71669 43397 72661 61266 -52208 -80276 -116116 -9299 105911 124496
3178 124496 39127 -64512 -59780 -7529 43344 -8585 -30375 -61664 -16881 -21486 -89053 -118997
3166 -118997 -60786 26562 -40817 -37326 -20396 -48879 -98197 -48140 7753 9565 28028 49942
3154 49942 -34742 -82603 -104593 8204 102676 122821 -16838 -143864 -71985 -42601 11280
3143 11280 23940 13266 50271 134445 153252 32556 -5483 43545 62432 61089 82910 -19691
3131 -19691 -12050 35067 11784 -97198 -70699 24388 79804 104083 15016 -32848 -16590 12180
3119 12180 -29442 -31437 67310 133529 150332 110576 44025 -5816 -30452 -34029 21191 69762
3107 69762 99420 27671 -94289 -73941 -12585 36915 -48015 -91329 15104 82304 146358
3096 146358 99667 -46900 -3228 90862 69174 -3103 -93300 -10992 38214 47100 19155 73518
3084 73518 154143 129262 88756 32222 18557 -54108 -44330 -8382 25831 39961 79107 -1033
3072 -1033 -88523 -173139 -131022 -38958 -38685 -11785 -84764 -158610 -147786 -113722 -90881 -54296
3060 -54296 -77687 -150520 -114207 -60972 -75597 -146808 -186484 -131218 -21817 40637 -25050 22538
3048 22538 75606 21631 -51680 -67845 -1023 37906 86057 -5795 -83816 -28818 -7480 6545
3036 6545 32347 41037 -10858 15108 5554 -22507 -82745 -155249 -119821 -117582 -91967 -16710 19270
3023 19270 -50010 -53805 -45604 -31221 -19638 11248 71556 23992 -61180 -33221 47772 67277
3011 67277 74053 35229 -89418 -116645 -103386 -58307 35068 39652 -5813 6476 -29067 5070
2999 5070 83771 77562 74709 99773 34942 -492 -22833 -49707 14214 26559 6626 -256 1958
2986 1958 39651 55953 22649 -9003 -121606 -152541 -103469 -15902 9334 -44421 -64268 -77467
2974 -77467 -69318 -29144 2157 -46371 -8083 50292 -26870 -87070 -96098 -54351 -13760 2393
2962 2393 -7483 -66141 -22283 31165 80157 112902 90666 22338 3723 -56217 -158207 -181234
2950 -181234 -147859 -8001 51995 19970 4539 -39009 7083 41968 69773 12213 -67514
2939 -67514 -111095 -72056 -355 2220 -66930 -87040 -98727 -120908 -104936 -52110 -52911 -3100
2927 -3100 12138 -49758 -101952 -53636 7921 -33485 -60299 -97574 -135817 -110675 -110767 -89329 -53567
2914 -53567 -103717 -170188 -108402 -50000 -13223 -2000 -26696 -29188 -58260 -105516 -87225 -106591
2902 -106591 -105617 -101001 -127831 -100424 -64612 -61182 37148 3788 -52390 -92211 -86766 -96266 -96953
2889 -96953 -98342 -138654 -222893 -157963 -73555 -122 -19318 -76930 -28597 13640 21746 30217
2877 30217 -2710 -76085 -98225 -65558 2781 98042 60038 -5187 -37831 -24680 21905 54282
2865 54282 79398 64326 39238 -61854 -67693 -96740 -62156 -20335 -24790 -114142 -79815 -26137
2853 -26137 -81048 -136724 -129356 -84511 -63260 -51004 -279 2282 13376 19651 63631 125918
2841 125918 86932 2116 -34511 28811 -14624 -12533 6694 -31444 -20806 -26977 39865 74993
2829 74993 121397 126326 122363 99684 82270 -56689 -36654 18966 12731 -17618 -40083 -28942
2817 -28942 35580 64115 98371 63202 50669 -1381 -8581 94839 95758 -698 -128521 -151305
2805 -151305 -101396 -143850 -47186 78979 115053 81190 19076 -3411 107145 66227 -3179
2794 -3179 -82852 -47176 -91575 -101280 -128822 -29925 29393 73487 38889 -17996 -112619 -95535
2782 -95535 -35603 8107 93613 86730 8233 -87484 -13694 68787 147836 106533 82794 65343
2770 65343 52522 138306 160495 83536 20354 -38236 -48095 20920 67829 81042 36580 -42348
2758 -42348 -128441 -209468 -163927 -135891 -137213 -91912 -107028 -78240 -75671 -103580 -92647 -64910
2746 -64910 -70089 -28349 97378 129483 89206 16128 636 -15693 -82128 -144923 -108623 -121146
2734 -121146 -77345 -25256 -2186 -52332 -79447 -87952 -62729 28239 124669 24897 5904 25354
2722 25354 26621 -20458 -44494 -56161 -127396 -79859 -20633 -13604 19296 -9346 -96855 4353
2710 4353 -11498 -53175 -88776 -124894 -114503 -2256 36417 -31506 -51856 -76569 -109814 -88871
2698 -88871 -135603 -111520 32080 147485 204704 135661 63305 56100 8258 -117318 -159227
2687 -159227 -108832 33314 40337 11540 24513 13562 -14832 -65491 -33275 -36499 -122020 -197823
2675 -197823 -106266 66117 124573 57525 -7632 -92 -5497 -96626 -140946 -121117 -76313 -48394
2663 -48394 -58503 -54881 -75378 32243 91989 59789 4275 -17574 -17520 4259 98248 132554
2651 132554 189057 81749 -6057 -41037 -22985 -90751 -107242 -78545 -12313 82938 66440
2640 66440 75122 52375 68532 132874 46074 -62602 -42079 36576 169011 184725 142424 70558
2628 70558 15829 -10520 -58169 -77621 -28296 -15194 -4426 -67537 -38877 -30383 70273 3321
2616 3321 -45152 -42549 -32692 -60940 -11674 38387 141680 159769 116957 29129 80376 36995
2604 36995 28535 114525 132052 80133 103979 48805 3102 -829 16188 -27850 -21086 -54355
2592 -54355 14652 30510 9752 -78823 -113107 -72388 -16846 -69987 -137593 -174771 -119344 -115569
2580 -115569 -127652 -144119 -71446 4372 -23572 11618 28814 41323 10094 79913 105462 114353
2568 114353 90836 69397 60950 7283 -95976 -97951 -25368 123706 138224 65099 2899 -50312
2556 -50312 -106609 -165957 -105206 -48236 40630 45413 -32594 -122515 -107779 11526 40955 49055
2544 49055 129097 51654 -60204 -66274 -71098 -115113 -99393 -62907 -16734 -10689 71422 142904
2532 142904 124479 78607 -19776 15280 -10688 -31253 29067 43165 75527 80525 84108 29498
2520 29498 58330 83189 154335 138647 84894 14759 27323 -31530 -149838 -179830 -123170 -88766
2508 -88766 -68663 -28297 -25203 -102533 -200674 -213919 -218304 -124524 -8030 71082 22450 -26593
2496 -26593 -53052 -50338 -68480 -26290 62859 54461 4305 34944 108006 136736 146610 102954
2484 102954 141669 168926 159241 172367 149926 19429 15042 19946 122304 123169 63997 35518
2472 35518 132128 131820 44628 -43728 -26977 -40020 -59180 -85744 -44090 55280 88677 106318
2460 106318 132114 89835 84141 74554 39842 -20493 -11608 9747 22485 -18721 -78243 -14495
2448 -14495 68634 102116 11428 -49115 12270 32557 94908 88823 11492 -81441 -142497 -104900
2436 -104900 -67950 -29715 -79197 -79112 -33297 35435 68341 7933 -65482 -18188 17339 1544
2424 1544 -19680 91 66912 35070 -674 20594 31595 31042 -35378 -17983 13408 84781
2412 84781 193858 187749 168962 65123 -39692 -104306 -95413 26995 25898 7977 4494 1704
2400 1704 -24944 -64793 -95517 -80808 -61856 -14892 23431 18784 14442 46152 18382 -49274
2388 -49274 -5941 49742 60337 16690 -35093 -24051 -31805 -38172 -41892 -51392 -147622 -173898 -122603
2375 -122603 -37289 -53076 56432 78576 51029 46558 86263 145059 19665 -69987 -15776
2364 -15776 57546 55848 4512 -25495 -17286 -50509 -35521 -40231 -61118 -12181 -9926 5349 -9419
2351 -9419 36239 76582 145484 99852 43413 35720 -27462 -44865 -64300 -71184 -97794 -55405
2339 -55405 -46060 31388 123225 170231 82394 -51449 -36514 7119 29412 57379 51193 14383
2327 14383 76589 73587 31354 -2493 -56697 -84895 -46814 -80583 -136579 -103485 -90137 -45104
2315 -45104 17913 46692 85454 49433 133125 159783 133428 134625 164357 175889 118489 29739
2303 29739 386 65863 103505 131524 103388 58160 -1092 -47124 -23315 -2295 -469 -65658
2291 -65658 -150219 -237388 -209278 -144266 -130234 -118067 -54302 18535 39560 449 123425 71878
2279 71878 76860 40457 -6084 -26774 36063 74615 6389 -72057 -7357 156258 170345 238661
2267 238661 216733 181812 119049 7228 -41501 -39795 -54841 24248 84484 184453 258697 145243
2255 145243 39687 3349 -77272 -60461 -61332 -94779 -79734 -139430 -82656 -11965 -42241 -32924
2243 -32924 -164364 -144539 -56121 14260 72325 54736 78685 83526 15666 58069 67436 -77772
2231 -77772 -67752 -83867 -15961 62012 63687 66506 67640 106099 101647 28869 -57545 -88188 -96945
2218 -96945 -9585 -11083 -35499 -48826 -15731 56637 95524 74601 -15216 -102016 -82758 -24544
$$ [...]
##END NTUPLES=NMR SPECTRUM
##END=
