##TITLE=Analysis number 327664
Compound Code rjc 02164
Project Code adrs
Chemist Name stores
##JCAMPDX= 6.0         $$ Bruker NMR JCAMP-DX V2.0
##DATA TYPE= NMR SPECTRUM
##DATA CLASS= NTUPLES
##ORIGIN= Bruker BioSpin GmbH
##OWNER= nmr
$$ XWIN-NMR		Version 3.5
$$ Thu Mar 29 15:01:36 2007 GMT Daylight Time (UT+1h)  MAYBRIDGE\nmr@NMR_250MHZ
##.OBSERVE FREQUENCY= 250.131544655141
##.OBSERVE NUCLEUS= ^1H
##.ACQUISITION MODE= SIMULTANEOUS (DQD)
##.ACQUISITION SCHEME= undefined
##.AVERAGES= 16
##.DIGITISER RES= 18
##SPECTROMETER/DATA SYSTEM= dpx250
##.PULSE SEQUENCE= zg30
##.SOLVENT NAME= DMSO
##.SHIFT REFERENCE= (INTERNAL, DMSO, 0, 16.522)
##AUDIT TRAIL= $$ (NUMBER, WHEN, WHO, WHERE, WHAT)
$$ ##TITLE= Audit trail, XWIN-NMR		Version 3.5
$$ ##JCAMPDX= 5.01
$$ ##ORIGIN= Bruker BioSpin GmbH
$$ ##OWNER= nmr
$$ C:\u/data/dgb/nmr/ADRS/2610/pdata/1/auditp.txt
$$ ##AUDIT TRAIL=  $$ (NUMBER, WHEN, WHO, WHERE, WHAT)
(   1,<2007-03-29 15:01:11.61 +100>,<MAYBRIDGE\nmr>,<NMR_250MHZ>,
      <created by zg, POWCHK disabled, PULCHK disabled
       configuration hash MD5:
       49 4B E0 1D 92 C2 6B 37 9F E6 65 BC 52 41 86 1D
       data hash MD5: 64K
       D8 A3 32 8D DA 27 2B 91 A4 D5 4A D7 7C D8 8E 41>)
(   2,<2007-03-29 15:01:28.22 +100>,<MAYBRIDGE\nmr>,<NMR_250MHZ>,
      <Start of raw data processing
       ef LB = 0.3 FT_mod = 6 PKNL = 1 SI = 32K 
       data hash MD5: 32K
       7C A7 42 5A 2F D1 68 C5 E7 FB DC AF D0 87 10 35>)
(   3,<2007-03-29 15:01:29.82 +100>,<MAYBRIDGE\nmr>,<NMR_250MHZ>,
      <apk 
       data hash MD5: 32K
       AE 03 E7 07 D0 FD 77 C0 24 F8 FC 63 00 8E E4 B7>)
(   4,<2007-03-29 15:01:30.57 +100>,<MAYBRIDGE\nmr>,<NMR_250MHZ>,
      <abs ABSG = 5 
       data hash MD5: 32K
       0C CC DC 5D BB 57 D3 DB 8D 51 19 2C 03 F3 01 04>)
$$ ##END=
$$ 
$$ hash MD5
$$ 0A 0C 19 A1 A8 2F 61 94 CB 2F 74 09 8B 73 FD 40
##$RELAX= 
##$RELAX= 
##$RELAX= 
##$RELAX= 
##$RELAX= 
##$RELAX= 
##$RELAX= 
$$ Bruker specific parameters
$$ --------------------------
##$DU= <C:\u>
##$EXPNO= 2610
##$NAME= <ADRS>
##$PROCNO= 1
##$TYPE= <nmr>
##$USER= <dgb>
##$AMP= (0..31)
100 100 100 100 100 100 100 100 100 100 100 100 100 100 100 100 100 100 
100 100 100 100 100 100 100 100 100 100 100 100 100 100 
##$AQSEQ= 0
##$AQ_mod= 3
##$AUNM= <au_zg>
##$AUTOPOS= <37 >
##$BF1= 250.13
##$BF2= 250.13
##$BF3= 250.13
##$BF4= 250.13
##$BF5= 500.13
##$BF6= 500.13
##$BF7= 500.13
##$BF8= 500.13
##$BYTORDA= 1
##$CFDGTYP= 0
##$CFRGTYP= 5
##$CHEMSTR= <none>
##$CNST= (0..31)
1 1 145 1 1 1 1 1 1 1 1 1 1 1 1 1 1 1 1 1 1 1 1 1 1 1 1 1 1 1 1 1 
##$CPDPRG= <>
##$CPDPRG1= <>
##$CPDPRG2= <>
##$CPDPRG3= <>
##$CPDPRG4= <mlev>
##$CPDPRG5= <mlev>
##$CPDPRG6= <mlev>
##$CPDPRG7= <mlev>
##$CPDPRG8= <mlev>
##$CPDPRGB= <>
##$CPDPRGT= <>
##$D= (0..31)
0 1 0 0 0 0 0 0 0 0.06 0 0 0 0 0 0 0.0002 0 0 0 0 0 0 0 0 0 0 0 0 0 0 
0 
##$DATE= 1175176867
##$DBL= (0..7)
120 120 120 120 120 120 120 120 
##$DBP= (0..7)
150 150 150 150 150 150 150 150 
##$DBP07= 0
##$DBPNAM0= <>
##$DBPNAM1= <>
##$DBPNAM2= <>
$$ [...]
##$SUBNAM6= <"">
##$SUBNAM7= <"">
##$SUBNAM8= <"">
##$SUBNAM9= <"">
##$SW= 20.6930455092707
##$SWIBOX= (0..15)
0 0 3 0 0 0 0 0 0 0 0 0 0 0 0 0 
##$SW_h= 5175.983436853
##$TD= 65536
##$TD0= 1
##$TE= 683.16
##$TE2= 300
##$TE3= 300
##$TEG= 300
##$TL= (0..7)
0 120 120 120 120 120 120 120 
##$TP= (0..7)
150 150 150 150 150 150 150 150 
##$TP07= 0
##$TPNAME0= <>
##$TPNAME1= <>
##$TPNAME2= <>
##$TPNAME3= <>
##$TPNAME4= <>
##$TPNAME5= <>
##$TPNAME6= <>
##$TPNAME7= <>
##$TPOAL= (0..7)
0.5 0.5 0.5 0.5 0.5 0.5 0.5 0.5 
##$TPOFFS= (0..7)
0 0 0 0 0 0 0 0 
##$TUNHIN= 0
##$TUNHOUT= 0
##$TUNXOUT= 0
##$USERA1= <user>
##$USERA2= <user>
##$USERA3= <user>
##$USERA4= <user>
##$USERA5= <user>
##$V9= 5
##$VALIST= <valist>
##$VCLIST= <CCCCCCCCCCCCCCC>
##$VD= 0
##$VDLIST= <DDDDDDDDDDDDDDD>
##$VPLIST= <PPPPPPPPPPPPPPP>
##$VTLIST= <TTTTTTTTTTTTTTT>
##$WBST= 1024
##$WBSW= 4
##$XGAIN= (0..3)
0 0 0 0 
##$XL= 0
##$YL= 0
##$YMAX_a= 352969
##$YMIN_a= -390363
##$ZGOPTNS= <>
##$ZL1= 120
##$ZL2= 120
##$ZL3= 120
##$ZL4= 120
##$ABSF1= 16.522
##$ABSF2= -4.171173
##$ABSG= 5
##$ABSL= 3
##$ALPHA= 0
##$AQORDER= 0
##$ASSFAC= 0
##$ASSFACI= 0
##$ASSFACX= 0
##$ASSWID= 0
##$AUNMP= <proc_1d>
##$AZFE= 0.1
##$AZFW= 0.1
##$BCFW= 0
##$BC_mod= 0
##$BYTORDP= 0
##$COROFFS= 0
##$CY= 12.5
##$DATMOD= 1
##$DC= 0
##$DFILT= <>
##$DTYPP= 0
##$F1P= 14.0000005364418
##$F2P= -0.99999901652339
##$FCOR= 0.5
##$FTSIZE= 32768
##$FT_mod= 6
##$GAMMA= 0
##$GB= 0
##$INTBC= 1
##$INTSCL= 1
##$ISEN= 128
##$LB= 0.3
##$LEV0= 0
##$LPBIN= 0
##$MAXI= 10000
##$MC2= 0
##$MEAN= 0
##$ME_mod= 0
##$MI= 0
##$NCOEF= 0
##$NC_proc= -5
##$NLEV= 6
##$NOISF1= 0
##$NOISF2= 0
##$NSP= 0
##$NTH_PI= 0
##$NZP= 0
##$OFFSET= 16.522
##$PC= 1
##$PHC0= 220.599
##$PHC1= 5.471414
##$PH_mod= 1
##$PKNL= yes
##$PPARMOD= 0
##$PSCAL= 4
##$PSIGN= 0
##$REVERSE= no
##$SF= 250.13
##$SI= 32768
##$SIGF1= 0
##$SIGF2= 0
##$SINO= 400
##$SIOLD= 32768
##$SREGLST= <1H.DMSO>
##$SSB= 0
##$STSI= 32768
##$STSR= 0
##$SW_p= 5175.98343685301
##$SYMM= 0
##$S_DEV= 0
##$TDeff= 65536
##$TDoff= 0
##$TI= <Analysis number 999999
Compound Code 99
Book Reference 9
Project Code 9>
##$TILT= no
##$TM1= 0
##$TM2= 0
##$TOPLEV= 0
##$USERP1= <user>
##$USERP2= <user>
##$USERP3= <user>
##$USERP4= <user>
##$USERP5= <user>
##$WDW= 1
##$XDIM= 32768
##$YMAX_p= 544878236
##$YMIN_p= -429816
$$ End of Bruker specific parameters
$$ ---------------------------------
##NTUPLES= NMR SPECTRUM
##VAR_NAME=  FREQUENCY,     SPECTRUM/REAL,   SPECTRUM/IMAG
##SYMBOL=    X,             R,               I
##VAR_TYPE=  INDEPENDENT,   DEPENDENT,       DEPENDENT
##VAR_FORM=  AFFN,          ASDF,            ASDF
##VAR_DIM=   32768,         32768,           32768
##UNITS=     HZ,            ARBITRARY UNITS, ARBITRARY UNITS
##FACTOR=    0.157963299565203, 1,           1
##FIRST=     4132.6476996994, 0,             0
##LAST=      -1043.33573715361, 0,           0
##MIN=       -1043.33573715361, -429816,     0
##MAX=       4132.6476996994, 544878236,     0
$$ Real data points
##PAGE= N=1
##DATA TABLE= (X++(R..R)), XYDATA
$$ [...]
21502 149956 79129 -42429 -146877 -196492 -113593 -1095 38212 -87607 -191066 -237458
21492 -237458 -111673 27497 131228 143716 224228 184740 108373 52319 57543 7594 -12545
21481 -12545 -36785 -84031 -115802 -184920 -47153 49635 89313 41983 -7604 -8871 53398 5602
21469 5602 -19905 -79333 -133012 -209652 -162408 -3705 47717 -61457 -46629 -32162 -42909
21458 -42909 121140 74193 -165 108771 84521 30388 50844 69869 62664 13997 -44698
21447 -44698 -32676 -27212 12998 -14203 -39067 -24699 -41881 4872 72445 100397 30022 -80259
21435 -80259 -203532 -150725 -74949 -47980 -98299 23668 110604 134795 157456 108489 43923
21424 43923 131270 168403 121535 21077 25446 41208 43217 92947 128063 108269 32071 -14660
21412 -14660 49493 -9460 -126136 -130973 -142281 -94187 -47322 -146080 -186763 -228002 -219735 -37239
21400 -37239 -17741 -79719 -109781 -104687 -63894 -165203 -232089 -88523 -89086 -120308 -183553 -194068
21388 -194068 -177165 -196066 -223136 -41531 105826 259653 250427 234345 156530 119677 40309
21377 40309 -49619 -64352 -132151 -121704 -48943 -7818 -18831 -65235 -8847 56628 76480 118971
21365 118971 73619 -6966 90700 78607 115643 75220 21851 -44813 -178215 -156503 -160116
21354 -160116 -137921 -134562 -66443 94294 90097 4166 53580 28175 -12389 84720 1504 12053
21342 12053 34139 -72760 -61764 -4613 39206 31523 -25859 56281 14837 -27136 101556
21331 101556 119423 77697 92438 173932 167336 4393 -124804 -115126 -85387 -90763 -90141 -101698
21319 -101698 36607 22301 -50678 -122829 60312 41522 54189 49215 36486 -50677 -139019
21308 -139019 -200006 -209947 -217758 -218502 -197985 -232449 -153663 -70469 -33007 -3986 -50417 -148115
21296 -148115 -73462 16765 12737 18832 -8370 -100402 -109215 -81730 6316 101939 17596 -86876
21284 -86876 -89873 -36206 -79464 -151841 -199527 -125971 -122612 -176423 -117092 -4700 -18184 -80909
21272 -80909 -52814 35345 91067 9602 3859 25364 47040 151865 146250 185494 174721 172077
21260 172077 222914 266869 155835 88478 102185 179781 121909 62084 71411 51246 -31247
21249 -31247 -143368 -135436 -13073 69841 128959 38412 -14877 -6928 -65376 53547 174406
21238 174406 65259 -76355 -77617 -45407 98658 139298 -18767 -67429 -1442 17312 20682
21227 20682 57278 228613 102297 -6559 -132418 -89191 -27753 55166 24442 -74715 -169904
21216 -169904 -162206 -165856 -212886 -233505 -256726 -206482 -98654 54295 25007 -81033 -138270
21205 -138270 -181785 -148293 45485 51707 89272 58357 69764 51006 42405 -19575 47280 49385
21193 49385 31485 5586 85925 136182 112093 74542 -3763 -122728 -32201 -35513 -19184 138310
21181 138310 11236 -112545 -89633 -104976 -61015 -62155 3056 87681 68946 8461 -9486
21170 -9486 -58423 -35209 79486 101008 -1795 -6549 -29873 -63719 -34207 -96991 -60423 -26339
21158 -26339 -55474 26522 94571 84257 47858 112730 -33518 -107044 -74516 -55791 -107327
21147 -107327 -14946 38722 16908 94524 -37020 -133141 -100844 -23763 -16267 40476 -9012
21136 -9012 -103038 -110920 -101855 6901 107946 137895 134604 20608 -102567 -15132 33139 -43942
21124 -43942 -83012 -149268 -228976 -189846 -110814 -81389 -91079 -65705 -55085 -141055 -169227 -80205
21112 -80205 26892 -77820 -105536 2243 98754 87788 102738 76284 22621 63348 162812
21101 162812 252363 180300 62933 -2399 -40925 -90509 -103668 -158060 -155045 -133545 -88779
21090 -88779 -81165 -202747 -119912 -163238 -100520 -46905 8931 119335 180850 168826 36621
21079 36621 -61788 -10271 21399 -32431 -59877 -63650 -148776 -79091 -16372 -33757 22611 201566
21067 201566 279031 196243 148615 138219 162778 234233 199362 10709 4080 -37417 81394
21056 81394 119533 -10778 42901 73176 113767 127179 50489 -59536 -58176 -56308 93625
21045 93625 174796 163965 218561 274105 167594 90705 12206 -55488 -33426 -36797 -154349
21034 -154349 -207329 -150951 -64701 -164684 -87324 31764 14232 74663 116706 61261 -36073
21023 -36073 -201175 -187901 -106968 -113084 -130705 -70371 -345 -61057 -155302 -229711 -191390 -78467
21011 -78467 -126339 -129191 -59880 30775 126086 101240 49808 17363 48666 54676 118667 172550
20999 172550 103469 -4781 -103830 -148534 -44759 47454 -14601 -41596 -126225 -85206 -70757
20988 -70757 -40321 -84548 -104284 -151657 -79038 -65910 -130561 -79993 -115422 -68294 -102010 -149730
20976 -149730 -95682 -20323 82242 177121 167427 130950 107879 103028 92849 49873 128066 55873
20964 55873 53889 -12413 -95009 -81023 37138 -34 20146 -9246 -36793 -103920 11775
20953 11775 -69118 -179730 -140452 -95124 -74009 -31956 -72018 -48380 -90687 -122108 -45079
20942 -45079 -94820 -115660 -20229 79995 176413 81299 -61279 -154159 -237943 -270829 -268061
20931 -268061 -260030 -119148 -34813 -42012 26976 38836 6952 86265 73723 31638 122040 74683
20919 74683 -64382 -26318 47772 140560 280258 204418 132815 259972 257607 128306 57404
20908 57404 22553 -75846 -197700 -135383 11865 27725 -24905 -28334 -8748 -28919 -36986 -93595
20896 -93595 -127808 -53738 -44563 -98698 -95994 -26501 -69667 -26196 -15328 -34588 -48174 19736
20884 19736 -65891 -73653 -95460 -102312 -82359 42427 13663 -72562 -11685 79831 78224 6470
20872 6470 6182 62038 26124 41232 -46240 -9420 -82451 -79409 -26354 -166585 -306031 -204767
20860 -204767 -142628 -171902 -195828 -75229 -41552 16025 2128 598 -25767 -62790 -34484
20849 -34484 -62570 -163134 -147461 -133621 15473 25800 -76310 -76473 -43390 -35445 -36342 59292
20837 59292 215862 154226 -72003 -146981 -156448 -288480 -292681 -215595 -246574 -285520 -275627 -171540
20825 -171540 -116849 -36971 -133119 -116690 -77914 -3773 -55678 -97804 -118437 -129721 -224848
20814 -224848 -214019 -14104 -46533 -65405 29468 103958 204125 253533 203962 136000 74787
20803 74787 27582 87277 51402 -22044 -126641 -70511 -41540 -33525 32581 47762 39038 68772
20791 68772 37261 69025 61248 76784 67672 57794 41182 48526 94684 70297 6342 108059
20779 108059 221258 231960 78531 -152154 -197043 -98069 -85525 -217042 -268436 -172536 -78597
20768 -78597 -107374 -182497 -97619 -84026 -27277 -31629 -30025 -22439 -37877 -156889 -213525 -65681
20756 -65681 -10009 -77513 -166381 -161133 -145842 -79645 41426 94335 204413 145956 38029
20745 38029 -46565 -68318 -95396 -194865 -94180 17946 77646 26308 51074 161624 53181
20734 53181 -61699 -43915 -74763 -41211 24339 -2905 -1155 124948 166805 79329 26421
20723 26421 -34165 63486 228286 227870 214981 200698 151817 58433 14869 41048 51973 -33724
20711 -33724 -9160 17581 66240 88370 -80557 -134411 -26020 18771 15600 54369 33613
20700 33613 1608 -135577 -110673 -90529 -64771 -113611 -147901 -43173 56920 148988 144081
20689 144081 -10004 -86763 -130245 -222749 -200840 -231601 -154980 -42465 13415 -32395 -3052
20678 -3052 -17061 -46453 154975 133655 -63696 -78764 -14935 -54391 -111444 -32713 -83227
20667 -83227 -138490 -158082 -75874 -90502 -152516 -149820 -26045 -35554 -76832 -101248 -91181 -90821
20655 -90821 -170731 -316826 -281256 -102811 -24288 -30540 -4384 19200 7179 -94155 -145305
20644 -145305 -66399 -51778 -108332 -95709 -15457 -19608 75843 40589 111320 127356 124390 42868
20632 42868 43141 -29091 -93236 -64212 -28415 -47706 -1671 36431 82263 126789 159803 195188
20620 195188 63261 -96217 -125811 -100958 -72257 -66418 56762 142050 61781 -51847 -89210
20609 -89210 -31093 20627 -57406 -91669 -195010 -122046 -153377 -200036 -113762 -59611 46001
20598 46001 100213 125404 58346 25308 -1185 -128712 -211979 -211089 -144992 -89894 -45611 -10411
20586 -10411 -36542 -90410 -79989 -31256 54159 -42929 -96073 -121615 -122788 -151875 -122723 7165
20574 7165 38270 97322 138241 91707 50284 -31004 -71343 -60338 -9952 102771 28258 -5888
20562 -5888 -119202 -164620 -61320 -10046 106942 159451 14439 -76140 21854 76025 3080
20551 3080 -65151 -8009 -38885 -116718 -98582 -28397 -111636 -155596 -199947 -160125 -248611 -266942
20539 -266942 -71511 93240 19496 65364 160052 64044 -10381 -107976 -43587 89698 62615
20528 62615 15303 100886 73168 26833 38766 18797 66554 14400 51013 -3173 36138 216523
20516 216523 276018 115099 34948 92564 200810 104233 -87589 33763 185674 89257
20506 89257 40717 -50951 -176880 -217746 -54163 60195 120065 108588 -28926 -117665 -123589
20495 -123589 -61205 -47029 -52780 -35101 96810 138263 109951 124554 42081 -5947 105181
20484 105181 18667 -97765 -202780 -177499 -146248 -120279 -83622 -132461 -54652 -48450 7060
20473 7060 72593 14491 -15395 -42129 -56359 -12631 72268 165896 291401 146901 -15569
20462 -15569 -17569 22787 -35896 -30147 52056 14083 1395 57687 67552 -14368 -123485 13984
20450 13984 68061 -21788 -115269 -57933 1169 43342 122416 80059 52596 -16441 -50301 2112
20438 2112 -6065 47686 147066 85668 -12672 -82047 -49965 -3225 19796 44867 98055 166707
20426 166707 63960 25269 20731 34924 95317 74173 -9399 40158 48793 -36490 -172577
20415 -172577 -228102 -213119 28504 -65666 84406 142535 62989 42225 72447 130547 63159
20404 63159 12228 39296 -12368 60888 87482 112864 151400 147241 119037 160786 -4607 -91165
20392 -91165 -22505 141189 160717 188360 264069 232628 126040 -12677 -15974 132356 155341
20381 155341 166176 92181 5218 2119 -22351 -38614 -11295 -2795 -77891 -119958 -61507 35089
20369 35089 -3334 68554 191079 155642 -3204 75972 181397 193090 23427 -167147 -146724
20358 -146724 -55909 -12461 18037 72597 -18858 34295 81067 47303 -9925 52352 86350
20347 86350 44917 55967 45124 30932 10586 41750 144861 137017 62479 -44761 -46564 -17143
20335 -17143 -5262 -38752 22664 25133 7554 6836 -12160 5475 108352 87487 -38236 -57402
20323 -57402 127 -60584 -15520 -61855 -54347 -27190 -228910 -265045 -226894 -148762 -72162 -39836
20311 -39836 -78297 22089 14563 -32371 -75290 -11641 7047 -97980 -176499 -227822 -233878 10395
20299 10395 137523 90503 33117 -3864 -48933 -49933 20068 103778 69471 15458 46309 94408
20287 94408 11317 -85257 -223233 -268312 -165676 -64520 -98905 -196756 -200653 -197089 -115157
20276 -115157 -44565 44591 59376 -35672 -51134 3978 -51887 -83851 -95649 24679 -7526
20265 -7526 -6528 41062 14980 -35163 -102943 -142925 -160010 -94792 -37135 -68226 -68921 -20487 -43172
20252 -43172 40473 56989 8426 -9882 59364 -50918 -106550 -63719 -47610 -108805 -39775
20241 -39775 30572 -62760 -43110 -34318 -56483 -123071 -54196 -46562 -42111 -71223 -41938 33401
20229 33401 105025 136497 88024 -3223 -86960 -162414 -37872 74145 144160 229345 127237
20218 127237 51349 -64991 -157682 -126514 -55544 -21909 15490 -3098 -166950 -231458 -104145
20207 -104145 -115050 25595 174995 149071 95326 117620 157003 169798 50879 99277 34662
20196 34662 25662 63925 104506 -6019 52892 60381 -17570 -94815 -169288 -100782 21644 44753
20184 44753 -62127 -156183 -211366 -95784 45386 8184 -78190 -37316 -80376 -49839 -55729
20173 -55729 -128829 -82662 -56526 -22592 -77984 -42317 -72866 -150132 -156550 -115392 -124495 -113775
20161 -113775 -5654 -8870 -90604 -1708 447 -58531 -59708 -49440 -88816 -114017 -25949 36922
20149 36922 122860 152863 11272 -32543 119636 255180 188932 27259 -25420 -46659 -123072
20138 -123072 -91134 39847 -4659 -15421 -96471 -112355 -90754 -42441 81150 37745 83365
20127 83365 120849 151430 78454 73737 8167 -81886 -35715 1661 -26484 -103696 -80874 -65848
20115 -65848 -88887 -67375 -48979 -107671 -153374 -35283 85682 75438 26900 -26976 -40976
20104 -40976 -93345 -176970 -186117 29650 72911 51501 88555 90484 71152 45310 88005 25579
20092 25579 -22855 -36692 -28333 -70823 -166281 -115936 -104788 -57760 -19961 61932 63786 123446
20080 123446 152552 82752 29994 -15617 -144751 -117037 23230 897 6714 41150 14403
20069 14403 -82359 -78587 48645 86219 77458 190428 193343 11270 102849 46572 -121975
20058 -121975 -54358 3127 26355 -114284 -155336 -50986 10196 25347 -4242 -152586 -96846
20047 -96846 -25812 -19689 -110070 -120872 -126734 -101043 -48213 -159528 -252485 -204056 -143784 -81808
20035 -81808 -167133 -61660 3521 12240 -54564 -140075 -163012 -99163 -64997 -57858 -77149 -64080
20023 -64080 -193814 -118168 -13749 156510 160346 84745 -96237 -94468 -117633 -70104 -63230
20012 -63230 -42819 -42689 -43487 -204501 -157574 -42687 10685 1051 -75406 -127273 -127905 -41982 -30110
19999 -30110 -64084 -87317 -113473 -136045 -108780 -14693 35700 69622 59789 67491 64657 -6056
19987 -6056 78782 175844 195081 116573 13535 -81279 -76545 -142208 -65391 5283 -7851 -7027
19975 -7027 -22233 -103180 -142559 -175247 -147921 -212044 -246694 -184206 -144851 -192949 -106967 107959
19963 107959 164131 53449 41167 -1592 -56039 62131 33475 -46488 -49666 -130818 -166044
19952 -166044 -133330 -37603 -120001 -139408 -129106 -94791 -90683 -80884 -125055 -140225 -150598 -79702
19940 -79702 -44872 -90672 -159369 -272918 -147626 -196300 -192496 -207998 -195298 -42007 15871
19929 15871 -24703 -45822 -28747 -106286 -211793 -157907 6872 -44492 -39924 79232 22677
19918 22677 -18796 -27290 101420 23603 -148667 -128943 -103444 -166457 -87640 -86501 -142681 -223220
19906 -223220 -246437 -107649 26755 55753 136074 203204 238637 233948 133985 -137954 -164857
19895 -164857 -144693 -97962 -31440 -57699 -28808 16011 4390 8137 -116061 -74922 1467
19884 1467 40045 -47436 -73041 -128424 -234417 -276190 -326280 -250945 -159060 -59878 -62538 17083
19872 17083 54502 41786 66025 100952 107437 -51442 -38730 -92752 -146343 -144499 -156299 -107720
19860 -107720 -79973 -167218 -157763 -126649 -138447 -99645 33506 22168 -74538 -142104 -222501
19849 -222501 -253983 -298569 -214570 -135279 -127316 -171974 -179450 -228170 -187772 -68259 65753
19838 65753 33248 -10515 53691 56839 -10451 -39441 78529 147185 134801 33037 -68653
19827 -68653 -32441 -9198 -24066 32337 164380 28175 -68479 -46384 -76330 67706 85193
19816 85193 97736 157495 210634 168886 134079 86358 101120 123959 86218 -12930 -51474 -93986
19804 -93986 45145 88230 165303 57876 -971 -38937 10816 -52287 -122458 -82936 -11859
19793 -11859 -57600 -60462 17159 -23724 -19921 -12771 -98601 -137051 -182865 -169576 -101339 26331
19781 26331 132716 192280 170062 58654 -59891 -119653 -111241 -66849 22995 148989 71301
19770 71301 -44396 -104307 -92568 -106734 -9547 23749 -66564 -59651 -121560 -276905 -338436
19759 -338436 -181674 -71481 -96921 -134690 -119200 -137983 -158716 -42172 -103794 -166752 -256606
19748 -256606 -315682 -191468 -159892 -182490 -263649 -154843 -63854 1852 45013 -39386 -84916
19737 -84916 -68274 -77670 -120665 -122118 -29733 1435 -4016 -42223 13635 8632 -447 -116280
19725 -116280 -222531 -192807 -155575 -152795 60957 119085 77378 130961 96235 30842 -115441
19714 -115441 -158954 -93896 29250 126904 21635 -81309 -79112 -25345 -700 90348 81921
19703 81921 -46305 -32408 104883 75765 -40708 42012 47130 -30459 -58428 15397 -17802
19692 -17802 -20237 -20533 -109552 -180223 -207136 -257795 -131880 -83743 -106339 -43257 19510 61652
19680 61652 65223 -26916 5270 -51044 -66604 -96320 -145748 -171599 -237760 -167307 -63046 -61141
19668 -61141 -106570 17023 90174 73321 18559 -125337 -147922 -77617 -115665 -78878 59825
19657 59825 51200 102353 37802 -73969 22637 40482 -119433 -63469 111864 84621 -36935
19646 -36935 -80782 -123717 -124578 -139506 -37431 42230 12190 21314 32020 17259 -19786 -93195
19634 -93195 -134668 -90903 80842 88318 -76917 -145973 -56952 174114 152636 18961 -47368
19623 -47368 -152049 -116768 -76168 -91914 -128932 -56127 -45874 -184805 -238885 -210430 -179511
19612 -179511 -129308 -99441 -163188 -145038 -9335 -30561 -63276 -106441 -118185 -21407 37556
19601 37556 49047 65133 43049 -34051 -35034 4239 -33810 35902 136198 170458 49295 76995
19589 76995 131203 107513 -26009 -99651 -106486 -99608 -77267 -31682 -14248 -148033 -116273 -150230
19577 -150230 -41157 10703 68386 -39930 -136823 -58057 -24295 -12299 12844 75298 62817
19566 62817 86997 112170 145777 14701 42920 14267 -70142 -139411 -257747 -271886 -253191
19555 -253191 -202562 -146144 -69767 133595 14310 3290 40716 16477 -804 47119 42982
19544 42982 34029 47520 27493 14891 46405 3212 -96808 -170391 -83269 6060 41598 -4374
19532 -4374 -154762 -194836 -253498 -288635 -208143 -141472 -9273 140886 116731 8565 40762
19521 40762 -1496 7815 72417 169168 118016 126394 193511 158279 56360 -38702 -63894 -101619
19509 -101619 -22824 170875 157632 140085 148985 220785 91208 -8561 27056 23883 -8489
19498 -8489 -39168 -96037 -25706 -11043 -1363 34005 55420 97005 100351 31340 62612 109908
19486 109908 -27732 -38684 3927 65677 -57346 -171652 -114908 -55305 -109358 -145968 -73051
19475 -73051 33419 83482 101575 4901 37439 89781 139473 78275 -69099 -75653 -106729
19464 -106729 -74570 725 -15019 -10526 -1905 18932 54464 26356 19296 20423 -43040 -178483
19452 -178483 -238970 -175866 -62391 -107400 -88367 -168065 -186728 -155439 -142318 -135523 -148772
19441 -148772 -30602 100422 -716 -25700 -26985 39191 -51709 -198266 -197265 -161906 -214732
19430 -214732 -213463 -173502 -132713 -67488 8964 -33795 -146474 -125810 -50832 -59348 -127514 -35880
19418 -35880 -60631 -85519 -64984 -26576 33606 -7078 48957 42760 -26821 -13408 71069 28207
19406 28207 -55716 -53931 -51441 -59107 -112973 41487 86286 24903 7880 -99559 -68281 -136544
19394 -136544 -162546 -109093 -68824 -60012 -100381 -57322 12110 39698 23150 12901 -36257 -116449
19382 -116449 -76500 54900 46290 89688 157293 141789 -32676 -134681 -145107 25704 -28440
19371 -28440 -41508 74315 29112 -129046 70599 231905 229327 105695 -87436 -32838 -77599
19360 -77599 -72984 -38428 -18809 -103012 -9772 -101642 -85746 57032 -20457 -135518 -35719
19349 -35719 -22586 -62734 -3149 -7071 96394 95025 -22022 -86301 -69101 61515 104012
19338 104012 -87319 -167959 -151714 -105144 -96602 -189342 -107751 -124876 -96920 -43979 -103509
19327 -103509 -185744 -159119 -105407 -94766 -113933 -133392 -8098 112165 86904 68369 165509
19316 165509 134449 142788 113866 129073 -4295 -81773 -39844 46483 126979 74541 -54381
19305 -54381 -73828 -175771 -65773 41668 -96730 -176004 -144411 -79755 -168885 -142580 -78585
19294 -78585 92604 117222 22688 -99611 -181343 -229807 -65840 -82212 -103979 -90249 -119230
19283 -119230 -72442 -98288 -180822 -261082 -291371 -164538 -163870 -63218 14722 -1494 -78886
19272 -78886 -139355 -49625 6768 39643 -21683 -172555 -281297 -288710 -203881 -81501 -68589
19261 -68589 -74326 -36160 -58234 -81414 -95808 -115938 -89675 -106412 -114142 -99343 -159148 -67542
19249 -67542 -104310 -145699 -67405 32645 7358 -35659 46144 27046 54600 -28448 79190
19238 79190 93787 -20125 21699 154764 253767 202012 183369 -7292 -279383 -241167 -87714
19227 -87714 -29862 -120644 -187879 -139814 -153949 -92109 54341 50450 -35103 -16202 66711 -6187
19215 -6187 17406 69444 93668 65303 99386 57389 1513 -115490 -212305 -93628 -36018
19204 -36018 -875 76570 45659 62019 -36061 -4992 -23889 -140218 -120714 -10589 22588
19193 22588 108930 182865 253188 95526 -40418 -35823 51392 77348 49389 -127754 -146360
19182 -146360 -144509 -47001 29403 43160 10837 -52909 -124085 -94270 -106343 -38817 73956
19171 73956 171607 226353 251573 121404 81662 52345 16721 -69490 -165404 -228086 -159618
19160 -159618 -64571 -72403 -81724 -57989 -42387 -52628 -33026 107573 124685 105964 172238 163450
19148 163450 35998 -46522 84149 103261 65251 104008 95458 82511 190672 46587 -52793
19137 -52793 -85938 -94346 -75356 -51852 -76564 -16840 8432 24605 8139 107160 139194 71857
19125 71857 40966 -15868 -128293 -114357 -125922 -78573 8066 97240 192631 159796 129408
19114 129408 51157 -18517 -24212 -30900 -23263 9498 19430 -59335 -35609 19054 -49802 -92505
19102 -92505 19063 40368 13335 40894 79505 16368 71945 26554 -99625 -138593 -22049
19091 -22049 76360 78689 74441 109540 75275 -40424 -98644 -164172 -108287 -48104 34650 91052
19079 91052 29638 -107628 -200782 -119762 -12801 35261 -41119 -40896 85616 217909 179060
19068 179060 114684 22556 -53320 -25896 -112076 -83332 -4299 -81771 -47119 41701 -4068
19057 -4068 -34451 -67242 -176562 -236695 -248097 -121792 -91530 -3716 13221 -4598 -89455
19046 -89455 -223911 -247164 -126244 -53694 32377 -36362 -112836 -161380 -134044 -70850 -75692
19035 -75692 -55082 -87037 -137894 -133676 -145530 -53494 -65793 -70503 -9106 -239 6411 -99348
19023 -99348 -165557 -51112 -116089 -119339 -3152 20908 -57331 55525 160888 167437 48744
19012 48744 66269 216372 54712 -16464 -59804 -149191 -235972 -213091 -121685 -160897 -122484
19001 -122484 -3394 47768 -35236 -84285 -101891 -249930 -249432 -206346 -145355 -75312 -37746
18990 -37746 98041 167326 86912 -45195 -107600 23004 -68836 -149316 -95780 -14677 151866
18979 151866 142448 84778 -21075 35771 60168 49502 37195 26284 -75221 -104435 -158077
18968 -158077 -34117 -33637 -121907 -81288 84325 39613 -35119 -128240 -76737 100 -61472
18957 -61472 19054 103157 99292 143037 104871 76130 148744 135551 2291 -18427 24123 36353
18945 36353 49691 90797 175231 131177 44223 -27864 -77077 -145027 -48135 120408 82711
18934 82711 42021 -48837 -26276 39370 -148 -19474 8247 13627 -8279 -53440 26287 28625
18922 28625 33161 9620 56261 218449 270687 260244 247768 167965 90150 56680 98523 149207
18910 149207 117818 -26549 -118859 -61747 5136 -136001 -174469 -169895 -201901 -98917 92766
18899 92766 148017 88941 -1541 36705 126236 148202 200930 51688 -6843 -42260 -166731
18888 -166731 -275085 -324928 -219513 -154372 -268191 -311613 -206145 -112356 20668 18007 -53722
18877 -53722 -52766 77364 44196 -171885 -150713 -87368 50147 144279 144181 10628 -18722 66293
18865 66293 12497 -47123 52156 -823 -40758 62331 39539 9279 15289 55908 84993 126934
18853 126934 163942 230161 178027 151278 116789 68741 48944 2147 -79486 -85112 -109586 -81018
18841 -81018 -111190 -15700 182143 251184 143934 25121 21924 -16491 61158 74634 43859
18830 43859 -3626 18323 -38249 31007 98909 173127 111659 66307 18673 -20099 29922 113655
18818 113655 166157 114461 186941 194906 84642 165581 59109 -131908 -131855 -42998 40939 -13433
18806 -13433 -55990 -41779 9953 68198 50157 114635 122243 62456 -98164 -126048 -95756 -106217
18794 -106217 -156163 -194727 -127659 -136996 -189526 -145966 -19272 125132 158718 136613 33963
18783 33963 55279 -33322 -101746 -174879 -126372 -180746 -261793 -221926 -73832 15868 123613
18772 123613 112729 156693 168266 63797 -9427 -36590 -99426 -181665 -104694 -36121 -22508
18761 -22508 31952 56224 -19793 -24666 49006 45233 -62968 -42368 16940 -114170 -173205 -209361
18749 -209361 -28378 30609 -35409 -51860 -40662 -75445 -28259 20210 75713 15484 -124391
18738 -124391 -88337 -27562 21751 59296 34608 -24392 -86582 -115845 -159918 -170558 -63320
18727 -63320 -21831 -86054 -198618 -201136 -232003 -48084 -29530 -180064 -141071 -150974 -168882
18716 -168882 -236861 -174765 -192039 -201749 -137105 -87948 -56554 -61202 -119328 -56918 186119 221506
18704 221506 231872 156920 35367 30928 87091 80589 52602 28291 49334 37828 -7434 -68705
18692 -68705 -58200 -37105 -69770 -77263 -20122 61174 -28026 62578 119646 19493 -77001 -109650
18680 -109650 -150902 -59848 -11256 1294 55729 28863 -44588 -8070 -21117 -57556 -116388
18669 -116388 -172984 -123865 -31022 5163 -10464 25978 49353 10106 -96009 -70408 -38802
18658 -38802 -7613 -21218 -101760 -81599 56499 153095 232538 152150 114246 -75381 -39980
18647 -39980 73620 135277 116958 52696 126210 140982 67617 32174 -32450 44265 180863
18636 180863 222196 158913 79886 90354 66883 -50536 -20700 -116631 -116076 -69950 -59172 -63134
18624 -63134 -68169 -22098 26130 8675 44940 -18541 -180243 -133759 -6369 31663 77960
18613 77960 224973 258105 128975 72489 4257 -75703 41193 134012 211562 85701 -34185
18602 -34185 -114054 -8011 -71300 -67102 3216 20780 -109253 -169253 -152912 -112519 -101686
18591 -101686 -137129 -123129 -68080 -46848 -95953 -88266 -78430 435 37808 132436 92203 -18869
18579 -18869 -100394 -35287 7022 -49550 -73631 -2785 99782 89672 99856 6946 -23467
18568 -23467 -43521 60960 -18797 -98476 -96133 -186126 -230470 -218308 -121394 -94205 -15333 98580
18556 98580 58174 36698 -3001 -31723 -71079 -79938 -25994 50110 32689 -14235 -68343 -17826
18544 -17826 31417 21876 7436 -54620 3195 20793 -47696 -151298 -195526 -179727 -182663 -215953
18532 -215953 -159953 -38042 -25499 7899 -55795 -26339 40252 121358 86074 -21030 16732
18521 16732 1285 6488 41206 114470 176812 183560 48090 16067 -33397 66096 239507 143294
18509 143294 43963 9218 -57252 -8914 -60857 -98927 -53453 165281 283847 136675 -8488
18498 -8488 -105980 -161471 -197405 -165648 -17321 -50112 -105475 -198701 -155574 -167187 -131057 -114931
18486 -114931 -81575 -48211 2976 19858 -61706 -93430 -145378 -178508 -140283 -117434 -93302
18475 -93302 -91066 -72262 -119862 -111595 -111767 -99330 -44954 21380 17149 125407 128449 200439 197547
18462 197547 172184 182068 245009 159348 -17027 -40687 49661 53616 -100393 -82890 -66586
18451 -66586 55190 57195 82352 3968 -75989 -218325 -133229 -78818 -127934 66306 -8661
18440 -8661 -40581 -46846 -41854 -76582 -142358 -184400 -124634 -84270 -272923 -383996 -429816 -296567
18428 -296567 -72539 63366 118126 102821 -23123 54373 37279 59631 54468 -3766 36950
18417 36950 165612 151524 84941 -61447 -96395 -92973 -126877 -31535 8758 -41123 -74371
18406 -74371 -178080 -153612 -55042 48712 20805 -11093 84513 208727 229714 228619 223951
18395 223951 225364 162325 165181 167450 157354 89481 -8178 -74156 -8518 54399 106680 48425
18383 48425 29561 -44404 -200526 -240428 -225374 -171237 -120068 -39517 5807 17396 -140478
18372 -140478 -158452 -188141 -178716 -161390 -125684 -73715 -89245 25543 125081 153037 79387
18361 79387 40850 11176 -99752 -108106 65998 37856 63721 102503 25756 13630 34959
18350 34959 55827 25915 13333 43895 82646 130891 155965 107173 147888 85507 -27896
18339 -27896 -56170 -123864 -94560 -41818 -34417 -132092 -183599 -163810 -134410 -77273 -85356 -150272
18327 -150272 -157794 -65746 2281 26086 -28196 -35912 78454 14135 81517 70683 -39497
18316 -39497 16643 54536 31651 65424 84060 91957 -14648 -7499 -62605 -123757 -110614 -194192
18304 -194192 -320813 -266756 -193873 -152570 -275331 -308365 -283441 -128016 -117595 -143158 -130011
18293 -130011 -119659 54308 62895 14215 48091 43956 93315 5983 13650 -23111 -52621 25298
18281 25298 119996 17507 -94722 -84327 -58347 -81383 58923 -446 -119438 -99711 -33204
18270 -33204 -4708 20557 -22698 -68073 -210400 -374886 -239002 -134009 -49657 21519 111271
18259 111271 132108 111311 32243 -49964 56056 68926 -148953 -210323 -166580 -197786 -265474
18248 -265474 -235869 -163790 -100478 -204162 -190814 -125278 -108846 -122380 -37872 -88615 -71592
18237 -71592 -57624 -169970 -175207 -87774 -51334 21102 107678 38612 -85248 -148413 -195808
18226 -195808 -155178 40403 280506 318848 360926 243331 145864 153035 250665 241362 94095
18215 94095 51886 134659 87316 41936 2634 -81466 -111041 19701 3495 12561 -16281 -131058
18203 -131058 -175484 -221617 -205636 -116011 -186042 -134511 45640 119292 85725 -10510 -44627
18192 -44627 -49386 49931 124795 71523 -21567 -124951 -150883 -18140 26366 -21757 -25294 -68184
18180 -68184 -53787 -56987 -38498 -25483 -59124 -98215 -94698 -85973 -58322 -179320 -200637 -65351
18168 -65351 77526 160486 117168 57630 58962 45624 15270 11219 10824 1378 -24770 -59680
18156 -59680 -5332 -56099 -169225 -133662 -78690 -170680 -98611 -86250 -46252 -107900 -90597
18145 -90597 -23208 -62638 4945 29144 -21921 -62830 67334 92533 51942 48277 68331 73113
18133 73113 45257 -5644 -66667 -194266 -288532 -256442 -163393 -100573 -105817 -107160 -2941 88067
18121 88067 156612 147122 81331 11586 -45875 24483 4237 72182 106131 -6262 -41086 11111
18109 11111 88429 25447 -69080 -95523 -70430 -149025 -153523 -78340 -60543 4445 -94341 -220536
18097 -220536 -323525 -244368 -190194 -203502 -213215 -233783 -273924 -230114 -206683 -256550 -333889
18086 -333889 -359467 -177110 -150026 -229546 -211123 -134901 -29948 61930 48149 -68331 -73296
18075 -73296 -42704 -88986 -162535 -192218 -65846 69112 65445 -11148 44634 42057 -43297 -41690
18063 -41690 -64841 -75832 -186886 -255180 -192959 -236694 -269239 -199611 -89329 -39069 -26894
18052 -26894 -89225 -53790 -20542 -14050 -35620 19767 -49847 -132170 -105030 -44510 93216 185231
18040 185231 134648 50834 51476 -15532 -55451 -113762 -239372 -355698 -243192 -128184 -155081
18029 -155081 -160301 -208074 -90150 66786 52174 32793 114842 138509 143461 99803 135233
18018 135233 147006 109283 48091 84691 -3780 299 26628 36735 2630 -51201 -660 -47834
18006 -47834 -37954 -13233 -117741 -110218 -83257 -97059 -29595 -63999 -73125 32341 41898 88542
17994 88542 96915 72537 18836 22623 12492 -168013 -317903 -351242 -178452 -103961 -174322
17983 -174322 -179975 -137912 -94740 -122978 -20964 135880 92572 30483 106274 158984 24198
17972 24198 -170907 -24228 136820 42219 -36024 -68219 -56322 -76513 -44914 -40758 -23308
17961 -23308 -2915 2609 90461 142122 103353 139142 124467 101967 18096 17452 29456 60911
17949 60911 70281 116060 89897 25347 -16609 -27982 -75246 -98494 -47148 41888 167811 112524
17937 112524 3373 8949 106055 -5409 -76527 -27246 -19598 26263 103623 56899 128071
17926 128071 169301 121937 -5837 -41548 54396 99220 108554 56442 31305 -17602 -64651
17915 -64651 61207 163024 218674 162176 40820 -21729 -49413 -24970 14532 212062 90552
17904 90552 47244 41587 -89555 -29735 -49625 -51741 -44490 -78497 -72466 -27584 -32431 -65458
17892 -65458 -60751 48273 51285 14996 17217 1540 -17060 -2752 -9543 -49507 -83959 16964
17880 16964 174092 202782 141849 221875 316639 428198 250699 139688 191178 195178 353162
17869 353162 402159 351448 344527 217552 182684 253304 287830 127981 40694 177998 287907
17858 287907 147725 185716 268863 309108 236739 262910 286912 256492 245601 149374 70207
17847 70207 58298 75478 18074 88893 151830 148461 113206 51103 14383 -39448 -38299 28033
17835 28033 75916 137801 201807 241164 200298 149379 89612 -39269 -109495 -172864 -93162
17824 -93162 -115001 -145257 -25506 -53775 -33661 119576 156990 215844 169475 80380 123874
17813 123874 110399 54568 -15052 37324 100271 54309 74690 138751 109536 241713 351830
17802 351830 183245 -21065 15405 98963 -32923 -137115 -338112 -272242 -196778 -52823
17792 -52823 -73151 -187473 -233870 -114237 -40969 -103984 -44539 -136124 -162587 -191518 -208565
17781 -208565 -238290 -293158 -356275 -335688 -332765 -293338 -162047 -208089 -150741 -126706 -99401
17770 -99401 37379 92847 91173 34036 11999 41801 40491 92613 146596 166019 165807 67120
17758 67120 -40342 -64512 -43583 14853 48540 -11059 -40116 -20154 98373 176488 270111
17747 270111 146990 141269 168992 239317 89088 -42930 -75379 -139111 -185360 -30399 36931
17736 36931 79587 -46827 -129100 -102950 -19799 -17917 981 31265 -60479 -62552 -44436 -58193
17724 -58193 -31135 17058 124374 146016 134644 117807 162842 86012 1787 41464 29265
17713 29265 56541 -47360 50547 105985 33376 -67921 -101755 90955 252467 262779 91226
17702 91226 222401 236161 63624 -969 -12085 9463 66013 52633 152619 260486 187805
17691 187805 99509 -6594 -86642 -89523 38171 149836 93411 22068 26979 -42746 18273
17680 18273 -9087 -23760 -84074 28308 66025 19070 7617 3183 30314 81456 65444 138443
17668 138443 201788 200268 373681 338023 168865 107581 72180 70969 111337 94416 164942
17657 164942 73198 102975 91369 51561 64831 77996 32176 -52432 -51040 -40519 -11058 26450
17645 26450 84168 25587 -5791 95540 30599 -164677 -264930 -179182 9826 10068 -87497
17634 -87497 -151061 -99312 -73790 -59904 -41966 -163043 -132893 -82475 -208443 -173941 -45006
17623 -45006 10441 25257 -12483 4292 1398 -81000 -155069 -145171 -105268 -1663 87223 48562
17611 48562 -21882 -136654 -53406 -129731 -153129 -101501 -165766 -109339 -68382 -52215 -65469
17600 -65469 25128 8845 -83410 -53473 -101160 -129559 -234147 -123290 25485 105996 46967
17589 46967 -104524 -181999 -98029 -71925 -106559 -80349 -70662 -40712 19485 137517 162466
17578 162466 11023 -64596 -6425 -375 -15690 15776 66485 722 -16764 -53067 21125
17567 21125 5003 2350 -5331 -45204 -39056 116914 193155 163607 99288 -43140 -39794 59566
17555 59566 81861 72143 32084 25518 16903 -10282 -79209 -104358 -88678 -33440 43916 138779
17543 138779 76913 -54276 -139828 -147688 -10419 -11155 -33107 -28058 27953 -51783 -233974 -260554
17531 -260554 -124290 13633 -29527 -124537 -18123 -16604 -26868 -92050 -83341 -55336 -21470
17520 -21470 -14822 -5509 -33851 -30207 72409 44192 2680 50636 79098 143649 90005 -44723
17508 -44723 -21680 130229 236700 127297 72953 64547 73690 64755 15709 854 160354
17497 160354 269989 346890 375594 139509 -5805 82239 69304 -47121 -91409 -67765 -73329
17486 -73329 -117304 -96599 6558 79810 96763 24354 -149076 -176165 -123298 -119961 -55284
17475 -55284 25310 17373 7560 -18132 -47988 -125200 -52912 -129177 -159674 -134344 -86858 40814
17463 40814 22253 -23951 -86703 -41002 -71127 -124689 -142562 -190750 -245064 -197211 -102533 -25079
17451 -25079 14348 -116907 -127247 -71717 -79587 -117905 -195548 14168 197416 123936 9690
17440 9690 -140205 -148877 -114230 -127601 -99266 -46128 -73533 -192739 -190351 -75591 -54451 -133393
17428 -133393 -253843 -242966 -161222 -250929 -292524 -227014 -212338 -208278 -197578 -171048 -119750
17417 -119750 -40500 119294 154503 134272 19289 15905 16953 -22690 -132833 -221870 -162222
17406 -162222 -179263 -155792 -72021 -131237 -133567 -54884 69777 176105 155956 43989 -6165
17395 -6165 -73022 -91206 -6768 44975 50004 45383 -18150 -71622 -128310 -72282 40864 -18582
17383 -18582 -22264 101166 53686 -12666 -45763 -55679 -70194 -57580 -57374 -42218 -61444 -23764
17371 -23764 47560 53653 -1822 31888 -28524 4765 10823 63724 58821 -62979 -176049 -145526
17359 -145526 -166687 -115686 -18651 -59063 -9883 77600 51975 64852 180862 253903 139783
17348 139783 56432 -34491 -98316 -194081 -277457 -326077 -257575 -234871 -283542 -268075 -260919 -271763
17336 -271763 -136333 -41359 -48666 -74710 -70714 -55568 -94483 -39323 -25942 26189 24411 45306
17324 45306 1739 23970 144353 66698 28593 17474 -38952 61229 -45590 -21735 64611
17313 64611 -29900 -134193 -53027 -83007 -200131 -178995 -129582 -71887 -51602 36684 65020
17302 65020 67481 102290 66611 3861 -32397 -156115 -241945 -188478 -109065 -40305 -106465 -208409
17290 -208409 -179914 -141641 -75439 -31423 -67571 -100222 -131288 -100504 -15781 37997 -15722
17279 -15722 -126494 -49889 152554 235013 222120 156278 109550 99290 90411 81170 87702 41337
17267 41337 -5164 16338 109443 108829 7826 -51400 -119706 -71714 -11176 3575 -5866 -35516
17255 -35516 -47951 -57096 9183 15599 -57206 -113488 -208220 -196958 -105931 -120686 -66641 9852
17243 9852 -100578 -110335 -61189 -113656 -99147 -174088 -115911 -20645 -45520 -136482 -149914 -54138
17231 -54138 -137063 -193261 -220526 -116130 -74173 31262 37048 50213 104094 138682 138138 91918
17219 91918 19359 -53510 -31855 7861 67424 79840 42796 33921 139122 214437 201070 105500
17207 105500 75158 48779 40004 49375 -57699 -96458 -78352 -167229 -230307 -173296 -151591 -100207
17195 -100207 -95053 -40901 -27905 -93236 -3584 115142 218564 227476 251262 190053 37496
17184 37496 -76172 44349 159504 167841 205746 201521 117570 -8802 33997 20298 43734
17173 43734 23320 63009 62475 43588 59798 162657 134692 54062 -3897 -63459 -188825 -142741
17161 -142741 -21551 -17204 -27786 8321 18423 52675 62876 95523 75598 72484 91657 33755
17149 33755 142003 147161 -4142 -51318 -51286 13958 -18970 -63873 22321 31212 107371 61219
17137 61219 22609 81640 132510 209689 56556 -11359 -86137 -131230 25826 153388 22521
17126 22521 -16710 49245 39453 34408 27680 -35404 -174684 -148395 -256900 -147918 9278
17115 9278 11521 -14285 7358 -39029 31968 34664 -101148 -132318 -102821 -103022 -183039 -121311
17103 -121311 -33592 -116775 -124531 -103243 -134696 -177810 -161099 -99272 -102449 -110561 -96040 -154460
17091 -154460 -268726 -164227 -85474 -148574 -135810 -60655 -78536 -52742 -71764 -35778 114790
17080 114790 57756 6111 138690 228926 -14858 -95811 -81583 -39154 -4280 -24726 -53445
17069 -53445 -4919 -9745 18584 -1673 -58308 -124424 -122062 -93773 -77330 26252 111776 112006
17057 112006 -33913 -120781 -136810 -115291 22238 4282 -18687 73142 -10 -16772 -81435
17046 -81435 -122408 -119563 -69783 -122484 -147018 -124866 -155906 -265156 -258473 -231244 -194497 -183872
17034 -183872 -174020 -153826 -140215 -165556 -183400 -241219 -148471 -119549 -68843 1042 -9141 23036
17022 23036 190660 269243 313788 229630 56431 16038 33113 11572 -95523 -58132 34393
17011 34393 -8930 -23048 49348 121214 100349 -64877 -63682 -16240 -54419 20821 153424
17000 153424 233521 177493 80142 -20138 -33256 45460 -9079 6925 170516 134333 51457
16989 51457 -45663 -29210 -45262 -88136 -66829 -42173 -75037 -118899 -140066 -139163 -119577 -47593
16977 -47593 -37351 71700 -9986 -150079 -266709 -209086 -176567 -63599 -55 24819 107971
16966 107971 -37613 -120212 -136195 -113782 -155950 -123328 -58043 56470 44578 -53977 44385
16955 44385 8752 18000 -36234 -58063 -50746 -113060 -44464 120657 184755 96503 36340 43942
16943 43942 -86336 -158824 -96204 -63046 -88322 -51282 80899 23877 -134235 -164140 -125968
16932 -125968 -70612 21891 209328 343087 266473 139403 44979 -40387 -124694 -123652 -254459
16921 -254459 -299915 -216402 -121994 -117724 44799 125846 44008 19378 -8009 -24564 -144904
16910 -144904 -158554 -83775 -135534 -111231 62043 52114 -1093 -107161 -197615 -159681 -118591
16899 -118591 -167049 -154255 -217101 -210968 -159587 -67191 -141513 -118926 -10903 -16641 -21698 -76868
16887 -76868 -95907 -29277 1389 -40630 4226 70393 -59745 -249813 -311870 -164701 -63550
16876 -63550 64109 128893 193733 204703 136561 99474 83904 113734 -3958 -20689 -40192
16865 -40192 -23533 -114969 -168132 -138177 -155552 33665 -38209 -115119 -81006 -67896 -59870 -28355
16853 -28355 -58685 -104170 -117228 -15202 142175 226243 128880 66238 58592 40693 25556
16842 25556 73361 114015 -35280 -52859 -82737 -140036 -39798 13458 70355 3791 -13144
16831 -13144 25223 -28198 -10623 7561 65266 120647 184616 173837 110556 60818 -34822 -15948
16819 -15948 -5462 -58711 -80861 -27240 -52629 23114 89542 124940 73733 -57807 19564
16808 19564 50133 84262 68017 129229 101566 -77289 -140928 -91881 -67168 72157 100284
16797 100284 81262 38205 25543 -5904 12492 24053 50203 31728 94093 202346 188838
16786 188838 182093 226707 162401 183332 209773 184561 92249 -16002 -52095 -13449 -53989
16775 -53989 -73708 -74996 -90679 -43383 82327 -34208 -189695 -306225 -282677 -98311 31468
16764 31468 -28724 -3002 54022 28715 21127 60721 135145 101252 -92046 -118031 -100890 -104943
16752 -104943 -1297 56651 16359 -46675 -20223 18873 -10039 19697 29941 5826 -55662
16741 -55662 -70928 -138772 -341045 -350437 -341616 -305415 -189391 -86624 -175433 -84167 -9375
16730 -9375 55997 76883 79792 35341 -48562 -118458 -92130 -129382 -81817 -117704 -154467 -153071
16718 -153071 -175042 -220436 -263090 -253572 -236186 -149957 -70027 -94425 -51189 -83217 -15366 178441
16706 178441 109070 112153 61427 13565 38032 -114712 -190995 -79289 -2067 -135633 -192789
16695 -192789 -86554 -67456 -181987 -201045 -68637 -104546 -221923 -75706 -91083 -103898
16685 -103898 -155876 -81795 -38551 41700 6603 -37118 -9623 55252 5095 -45621 -67342
16674 -67342 -24711 21621 48294 115468 178417 63414 -39076 -33374 -79162 -119936 -191612
16663 -191612 -141919 -49353 21413 55025 -912 3453 -42196 -90742 -173444 -218950 -185532 -109689
16651 -109689 -127325 -87384 -36850 -77591 -117828 -104815 -122977 -1546 -19114 -144362 -164246
16640 -164246 -129774 -175589 -194875 -142588 -119968 -49721 36302 52359 -57961 -31395 27607
16629 27607 1725 54034 45141 36352 147798 185255 96099 -9226 -105898 4001 114001
16618 114001 103770 7180 20476 -65678 -102264 -7191 57763 38589 50593 15372 -103870
16607 -103870 -60838 2085 -826 -36980 -59082 22804 61992 59112 89288 52231 -11907 -42142
16595 -42142 -8111 12284 42414 91 -60387 32870 66226 28907 -50592 -15745 138011
16584 138011 239932 217571 92519 61248 62955 45189 74353 -81326 -141767 -170414 -112919
16573 -112919 -157669 -193838 -222517 -231093 -92609 11554 -46705 -18151 -11291 72799 64260 137078
16561 137078 156819 78631 9641 -52689 -53660 -60720 -70854 -148677 -51442 29016 -43170 -96485
16549 -96485 -75901 -52883 -13524 -59204 -101760 -94488 -106182 -110806 -189494 -177373 -124405 -181609
16537 -181609 -228722 -138886 -48905 -57768 -81753 -53655 -22007 -76038 -154324 -161441 -101036 -16008
16525 -16008 122074 49246 -64866 -45939 18792 -35742 -7993 -8418 -41297 3507 32854 11242
16513 11242 15733 -40270 64636 57727 82580 154356 88467 -3275 -111224 -117858 -190207 -130491
16501 -130491 -90225 -92604 -51982 -37111 -75613 -48048 46211 51876 -33581 -113233 -63690 -85571
16489 -85571 -88660 -167983 -63495 -8617 53448 -1769 -89008 -139287 -136247 -215379 -271537 -215237
16477 -215237 -128596 -88399 -99639 -93982 16083 41804 -18967 -52162 -125480 -224086 -106595
16466 -106595 -125221 -167154 -166472 -123431 -118829 -110294 -91773 76463 44229 -147662 -82627 35918
16454 35918 134642 221503 255682 224449 36064 5733 -75246 -125656 -204917 -262694 -90279
16443 -90279 -12383 -6725 -104788 -165894 -142310 -122600 -126077 -54814 38904 36679 40783 8274
16431 8274 -43063 -48676 7270 -53072 -83287 -102836 -136549 -102541 -95797 -61247 -162345 -221680
16419 -221680 -175597 -126314 -41000 -39757 -55847 -14762 2619 -55718 -100713 19638 68264
16408 68264 54421 -2962 -17939 61068 198152 217654 210015 124702 113509 127860 87175 74722
16396 74722 68812 69496 137141 177937 175318 196340 221318 136644 115536 127199 17317 -103576
16384 -103576 -31132 135923 85633 138892 194997 185533 99834 12166 -33699 -11245 72858
16373 72858 94061 35631 58887 101878 53540 73199 149485 105670 -13343 -51661 -18467
16362 -18467 147415 238465 219539 108120 2348 -84270 -138845 -100298 -227061 -249584 -203827
16351 -203827 -102797 7175 47612 11943 83096 144543 66466 -1681 -44559 -2778 14452
16340 14452 -21788 -53839 -155657 -77883 -115413 -61718 39663 128888 169686 62867 -59831
16329 -59831 54939 56743 1017 -41511 -35095 -43226 8387 -14435 24973 38485 -27265 -59787
16317 -59787 77238 12641 -121137 -59548 56759 55358 142292 170898 102290 68618 104691
16306 104691 139306 45350 66015 110144 19930 102400 63555 48581 49021 -41397 -90165 -81832
16294 -81832 -123931 -67416 -136100 -113896 -106404 -176689 -155998 -180694 -115004 -9657 -130557
16283 -130557 -179665 -113176 -33285 -103972 -160261 -146823 -12510 -58837 -11732 88093 -20361
16272 -20361 -135409 -137985 -179108 -108190 26685 64131 121752 106284 33386 7365 -35385
16261 -35385 -63408 52606 24995 19011 104191 131577 38427 -39100 40707 167615 227030
16250 227030 147607 67520 28147 -13928 -39874 5658 43538 44435 93701 90943 98391 11068
16238 11068 1868 48844 156451 147214 136787 16780 -25860 -40929 -20762 36448 20067 -1012
16226 -1012 28959 74724 39033 47976 18739 38852 21639 -90596 -95457 -97385 -99041 -73962
16214 -73962 11281 -16286 -14795 41298 96038 132496 93914 43222 120205 166905 77572 72312
16202 72312 99819 66247 -3511 -35298 -43616 -61191 -63696 -70685 -41814 2790 33574 -2835
16190 -2835 -60686 -93551 -170800 -229524 -140102 -4042 68274 146898 227183 115876 7103
16179 7103 -66816 -52163 -6238 -49172 -32553 -24608 20758 92564 132862 210140 119129 90741
16167 90741 48345 -58000 -36955 -6515 51756 33666 -78501 -87492 -23328 -15239 39164 72731
16155 72731 146625 77954 52467 -38437 -65505 -9674 -97079 -130022 -74954 -116341 -139085 -217565
16143 -217565 -111316 -81933 -138651 -117272 -58959 4489 -104605 -98849 -67016 -47666 -83772
16132 -83772 -49827 -42404 21719 18102 2642 -3720 -112179 -76784 -40364 71397 228484 188788
16120 188788 159761 160516 30052 11162 63790 18947 -6528 -17683 -89336 -79020 -128596 -141166
16108 -141166 -51200 -20676 -52634 54807 84866 123529 20513 -144408 -133409 -36222 37417
16097 37417 4315 -46584 -95648 -113855 -65260 -34080 -83998 41609 59905 -41392 -56154
16086 -56154 19355 52650 102203 126265 70078 90570 114668 82971 -11809 -99388 -97865 -115128
16074 -115128 -130002 -7498 -46761 26023 86447 158513 26132 -79704 -66821 -60435 -102306
16063 -102306 -34906 -46158 -200822 -155756 -95002 -156756 -70536 -271 -14642 -104154 -111497
16052 -111497 -165095 -130064 79015 132611 -4512 -15235 32025 67852 -7536 -79284 -42251
16041 -42251 109896 175384 173142 88813 30056 16508 107493 174850 74206 78888 188561
16030 188561 257473 249293 237403 58111 -45240 -30254 -95986 -282694 -168947 -184797 -189264
16019 -189264 -165984 -103240 -75456 -59552 -159285 -150618 -56183 -39270 -63871 -132493 -87464 16209
16007 16209 58188 -38549 -2800 -4760 -50456 -80861 -194592 -254193 -290729 -191203 -133633 -115007
15995 -115007 -139763 -103223 -110944 -82248 69054 180620 118230 133312 182035 141263 66017
15984 66017 26330 -112751 -210203 -153860 -73539 -42870 46571 14551 22208 17525 -49434 -99418
15972 -99418 -118086 -58740 51316 43191 72826 64977 56946 78024 18569 -146538 -242844 -86624
15960 -86624 -33698 1959 37057 -99595 -86242 -120969 -114826 -44578 14824 30917 15839 1639
15948 1639 -36135 -15507 15097 46002 -130166 -176517 -122020 -96168 83857 180643 232066
15937 232066 263493 336538 378147 257674 154589 133380 -134569 -202085 -210540 -300664 -298241
15926 -298241 -230240 -195405 -124287 -102408 -201171 -136718 -110160 -30757 48633 62597 124290
15915 124290 157310 169639 84171 -76837 -101137 -16456 52339 111346 91688 84441 79841 148186
15903 148186 191537 72174 2027 86528 89931 -19097 -109548 -170747 -95953 38220 33807
15892 33807 56139 67493 -17883 -24619 -162152 -197345 -277245 -312790 -163586 -42879 -63748
15881 -63748 22402 29109 -35973 -52306 -115066 -52593 -74125 24976 63078 3239 -31528 -37684
15869 -37684 -26582 -51769 -53908 -22497 -126008 -175660 -132104 58990 57587 38786 -48161 -76519
15857 -76519 9168 130226 135047 97586 35906 -113548 -19964 72847 104848 61717 -22341
15846 -22341 -85082 -78155 -86804 -84060 -25339 36365 123001 52527 30452 87728 100502 89148
15834 89148 -20629 10555 41932 -102404 -192777 -67964 100939 30255 41494 -25889 -127680
15823 -127680 -176111 -193758 -128848 -76652 -50894 -131952 -172665 -108156 -6446 -30254 -53269
15812 -53269 -142658 -53692 -26556 -5092 -62891 -75212 -7721 -27555 -21071 -37215 4851 98894
15800 98894 63505 4250 43694 2581 155255 118476 55376 82029 146031 143255 -8032
15789 -8032 68731 149727 100121 45281 28843 45090 2910 -99357 -185246 -156623 -186198 -134865
15777 -134865 -11692 54673 -72193 -90394 -25867 -21314 -111814 -142383 -156473 -101231 -118893
15766 -118893 -18963 -24744 -113159 -83624 -3533 3187 -156964 -222694 -228607 -198699 -166381 -120691
15754 -120691 -97722 -75696 -25877 -66979 11402 1874 -29678 48160 -19677 17648 66906 50598
15742 50598 44912 21972 18557 80895 36322 29483 49491 33143 57154 32231 -47580 -98268
15730 -98268 -66248 -15941 10277 -15589 -14988 49191 62004 65482 114207 -68247 -145020 -144957 -181147
15717 -181147 -90725 -63366 -145138 -79073 1695 59395 59845 11099 -101735 -128701 -53900 38349
15705 38349 73536 92411 112068 60947 -68404 -20337 52593 171267 104324 -74308 -150341
15694 -150341 -52928 -95504 -81490 -38580 40157 100559 235047 228256 161544 48238 24681
15683 24681 43717 95358 127004 171451 110654 -39971 -58765 56980 98657 45252 49593
15672 49593 -14764 29101 134168 91134 -104507 -77344 -140710 -45849 -27268 -3764 103855
15661 103855 24016 -39737 64837 36002 -17136 1297 -19772 -117643 -34599 51723 -44544
15650 -44544 -46380 -111147 -146082 -73145 109382 75521 -18227 52336 54165 102059 106748 92907
15638 92907 103410 36596 -684 18214 -4109 -52192 -42508 -2908 64686 89485 -32331 -162557
15626 -162557 -180505 -179172 -139111 2031 79113 129892 115419 11448 -86501 -248408 -336533
15615 -336533 -270518 -124675 -15671 1686 -4919 -20988 -15953 -119415 -83571 -107376 -99610
15604 -99610 -64079 8192 10577 -4195 46143 4815 -82563 -42751 35960 128207 224741 254955
15592 254955 240371 178651 111722 71904 90588 30787 45071 39420 -17201 -120956 -142584
15581 -142584 -167056 -108352 65331 71066 -33510 -48513 -32241 41545 76182 52255 9209
15570 9209 61460 10276 159709 227416 221121 211320 57532 112780 37247 -145185 -142871 -146466
15558 -146466 -154870 -203048 -147724 -100539 -52504 12443 -17149 -92895 -170391 -106479 -64356 56004
15546 56004 -33353 -111622 -67217 16043 69202 92161 24234 25987 134297 77775 22401 -37291
15534 -37291 -69925 -197707 -134182 -42775 8564 -55671 -41164 81422 111201 145160 129050
15523 129050 28841 -7866 -25902 -82742 -139462 -149666 -78617 -61700 -72546 -126449 -110786
15512 -110786 -66874 -14579 -19266 18508 41096 -32095 -7554 -68759 -160543 -147703 -156773 -194670
15500 -194670 -200183 -171116 -151657 18551 12261 -149905 -205555 -126572 -37665 -17433 -32898
15489 -32898 -28516 -20374 -46278 -60650 -142060 -159070 -41912 19848 -45466 -1707 19484 65981
15477 65981 21341 -98082 -145826 -112058 -26917 -119683 -166228 -199645 -170385 -28001 105688
15466 105688 60940 -100463 -184411 -101981 100968 157914 176036 153524 124679 109364 33934
15455 33934 -37865 26147 46599 8638 -20927 68398 79979 166188 47139 -29636 55080
15444 55080 85352 47174 -20297 7050 4061 -38965 15602 100161 -4221 4344 55281 69127
15432 69127 -6592 -30342 -39906 -106868 -123324 990 60412 4791 -41966 5032 46052 48435
15420 48435 -16115 15196 -68423 -68138 46699 -74 5558 35863 115259 83712 16863 37154
15408 37154 41180 -22162 43441 53455 106954 183816 151568 25451 82176 130671 97652 19830
15396 19830 4090 -97667 -167515 -189083 -264198 -223917 -181123 -171885 -30607 76217 -7118
15385 -7118 -117701 -111069 -29995 47877 -26320 -39426 19520 153923 313138 281706 108397
15374 108397 -3902 -152545 -129140 -67117 -65227 37685 122359 124619 92507 74623 84659
15363 84659 34757 -48728 -174811 -299269 -154948 17030 18385 -68901 -127311 -122007 -102024
15352 -102024 -86312 -45117 -6335 23181 48496 -14303 -38892 -6243 -49255 -160014 -43001
15341 -43001 70977 86971 91716 332 -27431 -46734 -108265 -152987 -115415 -58678 -66094 -148180
15329 -148180 -93953 -3264 52537 39834 107312 57276 56805 62369 77779 30832 -133418 -170492
15317 -170492 -71925 66407 151888 70468 162 16683 33970 29243 28428 27665 63938 69443
15305 69443 -6636 -139612 -163945 -172728 -169596 -117601 -65074 -14144 -3765 -29172 -16686 40795
15293 40795 55928 84372 90037 52676 -39485 -148985 -82524 33837 143604 236498 162367
15282 162367 108868 42148 22838 89332 97647 126990 196131 142478 31133 37699 33089 142699
15270 142699 117789 -12264 -14414 13022 -9767 -23532 -143898 -226304 -167434 -14743 64571
15259 64571 53759 89058 35395 49747 -13081 9822 128247 177954 266542 165562 47132
15248 47132 20533 3070 70382 130402 -36725 -163905 -110656 -12628 -33609 35706 58783
15237 58783 5145 -31390 -72819 -68416 -127084 -163789 1036 -20368 -105976 -86725 66707
15226 66707 191188 104285 -103069 -83371 53189 71436 -6862 -120974 -96915 -44498 -9692
15215 -9692 54434 76047 108587 133372 78581 139773 159100 152728 69722 35439 7736 -60781
15203 -60781 -79355 -105445 4675 53403 -20006 46396 19704 -31705 -64719 -40865 4561
15192 4561 87889 171306 133116 -8885 -51462 -93069 -163568 -40745 -27830 -16534 115551
15181 115551 175888 46150 -68974 -50817 -42102 -22685 -7544 -116022 -175441 -146861 -33860
15170 -33860 -28809 -63598 -144093 -161345 -58556 -88918 -102865 -128308 -25988 47774 66957
15159 66957 -3835 13309 67006 49797 43282 -34655 -134018 -25029 444 -155886 -150583 -98510
15147 -98510 -74712 65774 142687 117455 34657 134807 180703 125592 133414 37590 -50729
15136 -50729 2229 36995 45609 -6377 -54977 40482 163421 177137 153235 99312 78337 120254
15124 120254 187606 107961 149430 221316 188452 214370 92859 -28205 -21622 -11861 2951
15113 2951 67476 132940 127496 131844 70834 113282 141797 180463 110115 126404 91121 6631
15101 6631 14642 9483 -55476 -43125 -34566 -76652 -32813 -6795 -8361 -63858 -44006 60877
15089 60877 107571 164714 191371 116420 941 -57253 -66193 51809 197539 125032 22076
15078 22076 -55203 -148257 -186462 -60930 -115230 -82571 30254 16383 -119356 -152482 -186401
15067 -186401 -211989 -319664 -288809 -304504 -165765 -21916 -35180 -12621 15191 20415 31432
15056 31432 -62595 -60576 61891 14833 3670 -131262 -51083 75486 49658 109048 111795
15045 111795 155963 216010 254871 189825 31228 70195 96721 -24787 -31036 -56476 -67502
15034 -67502 8687 116202 141627 209568 138474 112168 190657 84423 89237 76368 124870
15023 124870 153035 147510 190383 164931 63007 38667 130055 188260 132840 -11192 -35935
15012 -35935 -34264 -89539 -191250 -200759 -130223 -143428 -47714 -10636 -65215 -45473 -110227 -223775
15000 -223775 -322703 -322621 -271852 -279056 -135257 24361 43504 113521 230674 175078 250959 220504
14988 220504 150941 65756 -7896 -33412 -13182 -21226 -42491 9598 -51822 -94671 -172867 -184865
14976 -184865 -96103 -225147 -332703 -113652 59690 126252 -7513 9933 62373 40462
14966 40462 -75119 -126002 -219181 -186006 -77613 -13106 -7101 17930 1441 -1977 6346 -41607
14954 -41607 41255 1769 6053 -58379 -38048 -17731 -28205 3940 176648 169620 -4404 -115225
14942 -115225 -73454 -76172 127832 206849 139696 56818 -13003 7662 8621 83438 51483 -49295
14930 -49295 -175726 -146988 -109426 -106101 -32654 -17496 -9977 122479 259842 206775 112660
14919 112660 94547 78990 23110 69449 141912 164323 89081 33523 -64134 -37137 142588
14908 142588 165609 59588 15098 18504 -63297 -75804 -3299 86283 66673 -33919 9043
14897 9043 -27849 61848 137399 69033 53231 148334 172194 140710 136193 150287 56539 -935
14885 -935 9106 -8007 -12613 -12572 39437 -76923 -219860 -220490 -51828 69086 35023 -67438
14873 -67438 -268073 -237409 -134714 -219253 -120662 -11213 -89429 -62887 -60088 -4790 157618
14862 157618 43860 -84358 -169813 -85561 -102549 -158929 -258533 -219101 -162531 -25754 16288
14851 16288 -67245 -53860 -47068 -5716 74347 27860 -74147 -201260 -156475 1011 -5487
14840 -5487 -87672 -131129 -57406 -49420 1136 23080 -43268 -127338 -208828 -103059 12950 52563
14828 52563 155634 250637 155046 98414 115434 243118 118428 -24277 33044 76833 225769
14817 225769 149123 109073 114734 15164 -104540 -123505 -104853 10863 15963 -5077 -95209
14806 -95209 -126746 -33800 -47776 39186 107741 56521 64505 102723 79376 150937 121187 187834
14794 187834 61679 -21583 -36490 -75972 -47210 -62275 -79249 -111785 -3108 150060 142473
14783 142473 31421 -102712 -82413 -26175 -9372 -40659 -81661 -75983 -46922 -8670 46776
14772 46776 89093 69648 62725 40050 73052 92481 113435 25398 -38055 27358 53823 30507
14760 30507 -56196 -100174 -65513 -65051 14957 175499 132922 -80288 -117485 -105815 -116001 -26498
14748 -26498 45382 106520 -6549 50555 85478 -16694 -68462 89478 -10681 54 24803
14737 24803 71360 91543 27180 7145 1881 -56481 -96193 -28468 -5453 -19901 21783 20751
14725 20751 88807 120945 118113 186719 192873 151131 35595 126867 -21847 -30494 22425 -57003
14713 -57003 -59517 51687 905 -11319 -69439 -144976 -168109 -89968 11027 69308 177551
14702 177551 292723 163213 128445 177254 144977 16102 9152 -105968 -125135 -41292 42249
14691 42249 60602 125776 132402 -13694 -190529 -160962 -53368 -58635 -130290 -106029 -44188
14680 -44188 36837 105706 88980 46519 -39600 -155015 -139012 -65205 23217 140532 171004
14669 171004 64014 -134 -5871 -107874 -34657 118434 21153 -7339 -109683 -62259 -146355
14658 -146355 -168934 -156256 -81315 -91234 -72518 -102459 -44589 17044 130 -122884 -193966
14647 -193966 -135642 -111558 -176628 -82346 -96429 22100 -32234 -66661 -145468 -113472 -21516
14636 -21516 72064 121487 156070 119091 41579 3608 -59503 -33445 -58357 -26386 45097 44382
14624 44382 35948 6136 9717 -38940 -49694 -83426 -165266 -57864 106756 -25250 -55160
14613 -55160 -98272 -147287 -55341 30910 17734 -15344 -38817 -149159 -224747 -307192 -243297
14602 -243297 -168439 -84944 -40976 -50416 -1383 1611 -137912 -133186 -34902 -36192 -92774 -169072
14590 -169072 -11180 -48186 -49900 101134 37447 -40649 -11549 38266 147411 108099 127370
14579 127370 126944 55978 2441 1861 -70769 -141823 -121485 -95273 -87103 654 27016 71458
14567 71458 32515 -32588 -107214 -98145 -27338 -67217 -48194 -97932 -84692 -75596 -167044 -132261
14555 -132261 -97137 -126155 -177729 -97870 12975 -51912 -160096 -21312 125541 173223 119365
14544 119365 -20613 -59656 -58724 53465 183948 221072 205938 187896 166444 30954 21173
14533 21173 32505 -73268 -30742 60859 53532 37009 12362 -106170 -73298 -57661 -66790 -118409
14521 -118409 -187935 -82890 -8442 -53581 -75048 -122723 -185238 -194394 -1316 66054 39157
14510 39157 -50697 -26849 -29015 -126176 -273212 -338298 -128448 157761 87472 1749 34468
14499 34468 32209 34664 68183 147515 99395 78057 63427 94440 44929 14577 -116582 -123462
14487 -123462 -203912 -252116 -111279 42811 169359 122172 17195 -76452 -56984 83778
14477 83778 10244 -31631 -8492 -46764 -124576 -187784 -177271 -206528 -175129 -58526 1567
14466 1567 156574 191400 133678 77501 33238 -76468 -132368 -178968 -147620 -181068 -127614
14455 -127614 -59141 -35834 134325 181067 95048 94548 66276 -32905 -93556 -83971 -93803 -4837
14443 -4837 -12881 62350 57140 65955 85069 28722 86229 133585 24310 -130795 -178205 -194732
14431 -194732 -177727 -164819 -37013 6098 18074 112284 159270 161349 244482 206945 110352
14420 110352 44326 33185 80400 65473 77787 72962 44419 -27486 -160879 -134684 -95743
14409 -95743 -48391 -37712 -41610 -11917 30662 78046 169110 225307 159346 33746 106516 51628
14397 51628 22053 58757 -14164 -26787 13492 75279 127890 153628 171782 170555 116250 265595
14385 265595 322438 141208 -134822 -264412 -301396 -213020 -66102 -25148 12668 78213 43408
14374 43408 6132 -37624 -70042 -118185 -213400 -221678 -247345 -178545 -44183 30904 33501 237
14362 237 -19327 -38503 -151914 -114446 83029 97841 104496 -14156 -232549 -248936 -196658
14351 -196658 -163881 -115870 -54129 -24554 25874 16743 -6979 38391 40215 134162 91246 -4473
14339 -4473 -24557 4562 93764 212039 192473 80796 145879 155648 -13867 -29177 100721
14328 100721 161310 75358 -38197 57177 93144 112048 31646 160859 136642 121041 99507
14317 99507 182265 153105 119043 114432 160728 117725 126203 120351 -46172 -127405 -93278 -60772
14305 -60772 4846 42094 115855 92780 100873 59218 -47098 -144238 -99818 -20098 18518 23934
14293 23934 55725 -847 -11769 67903 61421 156957 87950 -30717 -44017 -96510 -110355 -48362
14281 -48362 13015 116591 146957 68972 -10762 -174680 -77792 26883 64267 -20391 -35110
14270 -35110 30786 82494 67604 -2982 90738 209481 92769 12572 27639 83947 16435
14259 16435 38885 58632 61627 75286 48820 -22670 89703 139959 53897 163066 132448
14248 132448 -10936 -90335 -79709 -127672 -23124 102851 125773 127991 82963 67242 2834
14237 2834 -15721 40238 55269 72359 65347 -17322 -30470 -71597 -56153 -143879 -165467 -49061
14225 -49061 3878 -70340 -80204 -39210 -28422 -27075 5154 -17526 35216 79493 105206 133162
14213 133162 135052 107367 19700 -143109 -197700 -173191 -108604 -46774 101285 107348 85321
14202 85321 6793 16981 79560 4941 -48620 -21976 51455 41434 74961 88576 115918 181426
14190 181426 149842 123427 121874 179495 18197 -60894 -20834 -89179 -62097 -89585 -110516
14179 -110516 -54828 -826 -5235 109281 104551 55954 115655 100196 53861 -60772 -158988
14168 -158988 -220807 -144209 -128764 -51211 -73065 -142255 -99701 -89801 563 59483 119168 135148
14156 135148 256937 246681 266631 230814 173804 36106 -57392 -92943 5741 75887 48625
14145 48625 866 22228 130191 157083 73033 74981 89905 -69649 -106722 -25595 14243
14134 14243 -24300 -81909 -37053 15572 43905 59963 -53165 -47147 436 10473 -41902 -27122
14122 -27122 19551 3501 -54060 -131240 -210686 -200971 -31455 66789 143899 72329 25298 -10579
14110 -10579 -182020 3312 240116 184888 77941 541 68473 166364 177374 147731 86468
14099 86468 42516 72518 81083 -8246 5009 64450 90717 42698 -39717 -61257 49225 204517
14087 204517 166935 161781 152561 149510 147990 61935 81787 116061 -699 -15909 49367 199455
14075 199455 313920 243037 77871 -8259 -6305 -9055 65387 165909 283915 155560 126582
14064 126582 148591 -51397 -41728 -96277 -79950 69410 196637 106180 17129 -17763 -145477
14053 -145477 -113186 -142404 -152612 -157816 -179823 -229427 -182482 -72405 -18543 69780 67803 103589
14041 103589 74127 162561 106777 21707 19904 -11541 -1138 61885 73891 37332 8010 80939
14029 80939 74481 21496 25277 164207 242628 136049 528 -64978 -158566 -159228 -307363 -381975
14017 -381975 -189256 -49104 143122 187098 150881 1100 -41269 15438 51536 -24510 -3307
14006 -3307 85430 109240 85901 67380 42688 -66442 -50980 83025 254970 182046 95233
13995 95233 100671 95650 -26842 -63874 16132 -32068 -58579 71556 72892 -102256 -147369 -144958
13983 -144958 -140249 -206901 -226579 -88694 -24934 -31663 4297 212255 310978 286129 209565
13972 209565 143533 126936 197863 189227 161740 85695 23973 12936 -12392 -29262 49862 90978
13960 90978 45359 -2807 56317 77544 93721 216403 194045 125183 142223 7002 -58533
13949 -58533 -134259 -277520 -214581 -162586 -103179 -130782 -32304 28037 99134 129595 24685
13938 24685 49364 110613 153230 184336 84425 -29945 -17073 24421 -50475 -127117 -130647 -182278
13926 -182278 -56777 128178 171661 95129 84069 178395 219445 177426 150633 71468 64074
13915 64074 76618 3054 -8563 97982 139589 89868 104187 12929 -13236 62470 145869
13904 145869 216240 257184 239576 103538 146804 250771 229673 100482 188872 153746 66510
13893 66510 64568 140528 191709 213483 174009 146147 193110 264447 283129 200883 256974 186934
13881 186934 37950 -37035 51067 162736 27383 -67702 -86406 -104396 -72395 -47378 -2256
13870 -2256 114371 105836 31092 33907 84486 79318 88064 65068 43720 113420 140745 106075
13858 106075 142411 167593 128123 55902 -13222 38604 996 -10878 118213 136705 96320
13847 96320 -35302 -101011 -77141 -82186 -215735 -244531 -171992 -110848 -131002 -215414 -169513
13836 -169513 -105256 -31175 4367 34470 -5803 -5901 3931 34059 -57327 -96792 -15416 -46820
13824 -46820 -103099 -21083 118154 96648 160915 136020 -39187 10040 -46913 3310 120171
13813 120171 151286 152032 77223 -7437 -66647 -17345 98060 180020 199730 236192 252501 170085
13801 170085 81887 112732 99963 4585 -142804 -108449 -1208 -41628 -58302 -20545 29902
13790 29902 -12481 -27094 -55569 -77059 -37474 -46815 33502 120070 142974 137151 47390 -31517
13778 -31517 -66272 -55707 -22581 12596 -175 10295 -1762 144705 103870 65094 66280 84065
13766 84065 59998 130287 142642 130783 136906 80932 -46488 -65228 -49485 7959 -22174 -47937
13754 -47937 20440 44218 49318 -43718 -3977 -46998 13107 102171 132358 175779 159361 79427
13742 79427 107345 110731 94705 59533 23612 54696 -82910 -94252 -11339 -49691 -101435 -274
13730 -274 87689 -34481 -21513 -72947 -156340 -140588 -57731 49120 48821 42727 -48656 29873
13718 29873 46788 80691 29102 91939 139247 37364 130420 46972 -6840 -71455 -73719 5392
13706 5392 15774 10058 -68166 -116565 -149987 -97483 -72963 -29200 42855 10496 47481 177191
13694 177191 242772 162281 51326 -52523 -132084 -124473 -67837 -104985 -221491 -213753 -163984
13683 -163984 -17976 114451 195882 125560 24527 -5249 72845 153958 232239 218130 180399
13672 180399 192675 35282 -27269 -89399 -29958 3157 102808 67107 -74084 13439 101954
13661 101954 81944 -6462 -162492 -163981 -38062 -99816 -175672 -67777 74086 114303 77648
13650 77648 23138 -11334 12581 10190 4352 71136 57055 62704 -40418 -173833 -164325 -233503
13638 -233503 -271910 -105588 -1493 83703 104236 154804 130170 133039 140184 -63671 -156371
13627 -156371 -106637 -137577 -209487 5695 23708 -8492 49674 30649 98772 34315 16143
13616 16143 28495 84005 197313 228939 159229 90634 6290 54314 170152 125288 -4366
13605 -4366 38311 38681 -125823 -206583 -147965 -90940 -72300 -126684 -104394 -8943 20021 72613
13593 72613 22720 -32470 -105754 -94596 -104124 -34715 138112 343210 348711 322146 232537 177832
13581 177832 183173 196694 122311 33465 -45718 -11116 24046 83846 63913 145514 157795 186131
13569 186131 288752 282794 182369 197586 105084 89426 145620 167080 233900 214152 170099
13558 170099 112360 131115 176502 222335 240465 275116 287170 379692 565327 708391 732665
13547 732665 943517 1239848 1432761 1703048 2073505 2466527 2909903 3087997 3077275 2840144
13537 2840144 2461654 2027944 1689773 1357298 1116290 1001614 955762 887810 900711 945332
13527 945332 866908 762061 832810 830903 873353 983869 1035492 1216281 1445559 1810768 2214744
13516 2214744 2516415 2916235 3277612 3367693 3165577 2810252 2385116 1951100 1685209 1499047
13506 1499047 1239698 997499 738023 599851 517504 331023 223968 308891 279951 348531
13496 348531 390402 393461 292076 183137 160174 222291 273031 217491 257951 231224 247813
13485 247813 220051 98511 18307 47494 82168 1156 -17116 -116738 -48040 -80384 -128471
13474 -128471 -131246 -101789 -7004 50030 91771 102935 130467 38045 30076 11646 75401 124935
13462 124935 127561 170522 215180 234957 153167 170230 227779 102830 80320 221458 279391
13451 279391 114510 1541 42619 219061 342381 285912 140774 158990 176474 56010
13441 56010 39932 52488 9170 -86824 -119131 -125178 -50452 20560 18513 77167 123760 146512
13429 146512 106702 91093 54159 55233 64948 34862 85424 66682 130522 151467 8427 -46688
13417 -46688 6117 31978 28484 82150 142814 156092 67925 98782 127952 106220 -89094 -145816
13405 -145816 -153306 -90971 -19103 38336 -74373 -47285 57971 72611 68792 143402 199893
13394 199893 129942 24352 -105293 -187903 -130895 -102851 36237 87211 167827 133997 14277
13383 14277 -59208 21952 111731 146073 129617 150148 74018 45981 -38497 -49485 -175619
13372 -175619 -209332 -41558 142000 101844 94629 212544 186955 105568 72740 24561 46027
13361 46027 97475 48696 -25191 -161309 -176964 -146090 -57259 -88508 -16880 6190 46314
13350 46314 30889 26251 -60006 43906 99362 87052 97439 -3763 -58098 -113723 -97241
13339 -97241 -91730 21948 87321 91607 -60628 -60564 5659 63840 83153 16080 -37711 -29285
13327 -29285 4763 58318 16692 -46847 -83469 61799 30180 54743 64335 94355 86734 -650
13315 -650 79004 10205 -33053 -28778 -118415 -75050 5353 -8280 120357 193432 106424 76995
13303 76995 105729 96227 110020 93059 152029 231101 115628 -66403 38934 166132 115960
13292 115960 74365 6276 -125572 -124738 -65881 -56169 -77471 -148877 -58881 14980 -26586 -5063
13280 -5063 97512 135867 152631 4550 -151170 -140096 -91542 -106335 -121202 -157253 -146177
13269 -146177 -109536 -15487 9734 -298 133531 211552 196927 108842 83650 218387 244056
13258 244056 198821 75975 27234 118208 226438 153415 62517 -6187 83511 162591 115139
13247 115139 149126 3079 -178743 -126172 10389 205014 236588 164598 -50658 -141042
13237 -141042 -57099 -5080 83952 157062 241424 234206 272689 186360 -10843 -78439 -13605
13226 -13605 64873 35712 -61060 -17425 22613 95889 122996 68275 -30978 -87854 -93072 -5988
13214 -5988 57596 43178 121907 51056 8141 -34252 78829 148478 80917 101375 49331 97528
13202 97528 157969 228162 226230 122877 164823 224011 134238 10261 -82270 -117461 -131478
13191 -131478 -116610 -81158 8264 -44093 -136275 -88183 -22979 37054 115871 83364 -11794
13180 -11794 -75423 85628 163956 114616 14775 -25711 16833 -42581 27009 153401 221799
13169 221799 173635 88877 35705 -40702 -124413 -268344 -284430 -165821 -57179 -79449 -62834
13158 -62834 -107145 -92124 53850 201223 115279 107547 242543 217186 188992 198092 153916
13147 153916 118829 159518 92939 95734 -649 -52539 38969 12147 29363 73261 106938 103790
13135 103790 79016 158717 220066 168481 161706 138945 82163 46028 142730 273566 314478
13124 314478 246989 216519 119225 19700 32975 -24021 -15118 -37679 47745 137534 73969 33767
13112 33767 33733 54079 57469 -1985 16557 45071 91201 15051 -19106 7945 41204 77794
13100 77794 72362 21859 64264 -753 -56292 -100063 -161491 -104378 53372 133372 101540 151201
13088 151201 79202 72747 210666 321888 189991 18770 125256 237896 149537 68042
13078 68042 57991 35170 -83235 -249327 -313769 -298805 -207736 -132566 -140418 -33559 116889
13067 116889 194058 136400 123603 91164 116304 190933 22242 -127347 24018 167138 290014
13056 290014 323613 341656 237223 39317 -63067 76091 91257 96486 130050 85131 -4281
13045 -4281 -3391 140515 183758 196151 251924 225522 228526 149554 70014 123187 192597 93057
13033 93057 -22256 -1676 131309 246737 289611 157614 145979 188301 196394 155842 96618
13022 96618 88713 199347 204544 181568 106930 -24151 -3257 16338 46751 173293 194439
13011 194439 9741 -39285 -52423 53110 54799 -14187 -50374 -44811 -88554 -48868 59299
13000 59299 -57219 -56515 83241 87714 9471 -39299 1748 55103 -48365 21498 32926 13762
12988 13762 -36099 -42523 -114846 -122859 -109269 -27795 114523 38195 -141197 -167515 -23235
12977 -23235 52485 137579 102661 87218 87028 -15891 22229 135405 222787 239001 226607 257100
12965 257100 178070 174484 231903 212448 120402 149200 152065 25693 2841 42202 53714 -10766
12953 -10766 -17903 -2809 -123013 -142548 -20784 23785 54208 206349 212202 115793 135244
12942 135244 123019 -20445 -128920 -150712 -188630 -114257 24885 97697 33797 -21411 -28878
12931 -28878 74809 110677 -3169 -28011 -81487 -72906 19143 33608 76245 94443 22490
12920 22490 -19232 -27912 -50081 -109082 -152274 -70005 -29694 45558 79069 110452 -10720 -94309
12908 -94309 -137056 -268428 -219204 -66121 -32430 34879 61528 -21224 -3445 -20543 3647
12897 3647 70747 160101 244024 170068 14132 58150 44614 -10351 -58903 -60881 4896 5829
12885 5829 34122 64795 92808 125339 195123 143605 33489 24558 -9664 -149722 -230934 -178493
12873 -178493 34609 129190 103840 82121 85317 274263 388619 381254 317515 262138 333104
12862 333104 275028 147557 195904 273778 63096 -25447 -44656 10681 193787 222676 128033
12851 128033 33285 -10118 -134265 -108307 -147761 -110917 -74128 31249 240712 222823 114029
12840 114029 22282 -18534 -43646 21290 37962 -51913 -12114 151048 85576 -62117 68911
12829 68911 220802 158519 163444 141812 -902 5840 81748 167833 34882 -108395 -45379
12818 -45379 74563 122858 117308 182428 242718 157964 205052 252028 268113 254020 82862
12807 82862 2362 105472 105768 118278 127643 16114 -54876 -101377 -17852 50396 30428 5328
12795 5328 45853 53951 59358 -24431 17067 51951 205094 325986 182384 77698 140733
12784 140733 182579 129787 -49876 1843 53732 196240 299354 293623 108326 76452 96937
12773 96937 59831 28414 89001 120907 209090 172083 242327 188093 142282 168581 128548 73639
12761 73639 123405 138082 166016 22508 -13266 123685 171102 251520 253943 205001 77138
12750 77138 -75335 -28726 -15521 -98605 -16224 35648 41815 86472 41445 93932 73957 176061
12738 176061 141887 236018 301815 181709 150954 219692 193028 193212 261113 253601 223006 224424
12726 224424 191507 240132 354989 331042 216082 211652 176968 89291 110940 75859 112159
12715 112159 219212 277511 330944 266030 134798 18024 40257 -15006 48721 63987 139672
12704 139672 166148 119581 188929 134394 160181 228000 251874 269956 291204 204652 91925
12693 91925 -22382 213770 433028 494715 506400 511782 439770 323771 160676 137221 126567
12682 126567 85484 -12215 -146348 -139095 -52562 139494 218969 215824 201493 240678 276009
12671 276009 286552 336111 440833 372110 313463 331560 446554 640012 636138 607025 472087
12660 472087 421263 337965 424352 492691 466586 596669 779130 919787 1063621 1149763 1109206
12649 1109206 1008573 913692 702372 531290 326391 236477 247692 249660 323408 364161 296173
12638 296173 229800 215294 161712 217788 186094 260672 388526 450629 536393 515697 566887
12627 566887 729126 947273 1118473 1194766 1088761 875790 699190 594614 547311 520658
12617 520658 510914 575474 700688 974546 1329497 1485528 1453736 1341222 1104895 894818
12607 894818 720127 639690 481110 421519 380465 271548 243861 255840 309232 350622 321205
12596 321205 280596 314872 262479 294473 432829 558921 680598 878748 1021521 1034118
12586 1034118 1080538 1098050 1049382 1002088 818020 745030 655809 606894 553219 632577 816517
12575 816517 904816 1009069 1205338 1203848 1098484 961641 869801 721801 663959 598137 536220
12564 536220 397360 313868 272985 185208 277340 349676 401661 375288 318981 327530 377468
12553 377468 451133 495440 614023 771818 879448 967012 975505 850545 660358 580531 568679
12542 568679 554137 632109 628456 571028 458408 468336 597530 594053 551029 502879 430920 415390
12530 415390 410120 361085 318688 325699 269286 234674 314425 396455 331809 323132 253730 122056
12518 122056 109866 273037 274631 244254 173597 306865 442165 413639 327405 369445 444867
12507 444867 434662 408392 316557 304918 245960 181804 161765 354780 402026 279422 157672
12496 157672 158523 193444 93984 89807 22976 28802 118270 79392 119679 211158 196085 109289
12484 109289 105456 72827 116819 129837 157911 173266 210537 170839 206267 285851 277892 224062
12472 224062 115368 44235 75401 134110 179436 209072 126961 -13765 -43970 -80950 -98236
12461 -98236 -128233 -85501 -13882 42047 161203 198505 138436 132040 71106 42886 89142 61333
12449 61333 45531 132326 156160 220911 218914 226031 60344 46586 162290 142908 197687 148316
12437 148316 124158 174957 204951 159937 50346 48987 130180 211758 201352 190718 112575
12426 112575 167983 131858 175271 251006 200582 120591 104651 28036 37319 193343 207049
12415 207049 210623 123902 56374 35424 -14708 103312 134251 172990 179684 155994 168939 200573
12403 200573 100374 -16364 3058 29750 43951 -1516 -59416 -85304 -87984 -63106 -68349
12392 -68349 6066 130751 122160 54522 73037 81617 147853 199874 290257 267479 124768 173272
12380 173272 190765 167735 161996 147835 58961 -119774 -229698 -139988 -59238 4965 13534
12369 13534 28284 101440 70273 31977 32979 47515 93772 -60737 -173455 -91236 -54449
12358 -54449 84313 45849 8645 -52033 -44972 100902 204972 166806 225686 306739 255033
12347 255033 180957 95509 88525 137822 205277 181568 159408 117497 116454 124883 198677 340165
12335 340165 309621 128313 126127 182907 216046 193426 92081 -57359 62019 145696 177329
12324 177329 198101 175966 93774 99805 156897 164326 119159 178352 316811 242491 113752
12313 113752 105318 145173 220064 245999 147309 164144 174976 152292 103283 173035 104302 140109
12301 140109 144904 151335 205733 202015 306007 375681 272487 119828 148000 157509 -12266
12290 -12266 92360 173993 235383 123407 11142 -21351 -72007 -165253 -45104 24159 -27506
12279 -27506 -33815 4279 15847 90029 -6856 -4447 88547 123243 121894 12748 -95255 -11249
12267 -11249 89514 217630 299330 248822 323965 288048 237185 254409 301495 327374 257106
12256 257106 134372 43092 -64369 18870 61712 106291 -16027 -24950 84879 22194 6770
12245 6770 -10846 4376 81530 102048 150878 136057 101963 120291 175156 270751 282369 268523
12233 268523 298385 245623 213817 126667 186497 169321 115613 90660 7215 -74385 -168924
12222 -168924 -218822 -113921 6758 93629 207209 171481 156350 144223 130039 145964 122014
12211 122014 228888 208684 127004 -25566 -106352 23036 108201 171057 274910 286110 277685
12200 277685 337577 247575 198951 189209 185837 254928 255837 177040 86812 111611 87942 -2115
12188 -2115 -10602 135593 181184 101049 156512 267444 290127 299364 351614 409644 279879 274868
12176 274868 292545 302427 325804 272796 312337 323365 298917 419582 567115 573277 421667
12165 421667 302650 233406 158284 103831 111796 299873 358713 261027 328601 350248 251707
12154 251707 218268 219586 253174 174679 23875 89736 82262 162960 239013 274183 296385 331779
12142 331779 320243 266605 405419 493863 368098 255735 165182 201015 314652 264821 240613
12131 240613 231320 137151 96181 135908 131471 59482 102253 119617 71515 -46646 -22510 57870
12119 57870 73473 15554 3944 -75481 -68699 100056 150274 211981 134693 37838 68112 85784
12107 85784 145061 294109 327226 364644 296812 253344 342303 395169 445754 456616 382364
12096 382364 367783 351304 424450 486119 565547 535611 513860 419021 300391 71499 63534
12085 63534 206169 354914 472420 455775 479114 465359 426371 476480 399905 358044 357078
12074 357078 386792 341554 370899 456201 425190 244690 140605 187914 212969 264338 283150
12063 283150 296941 285971 324457 419907 511311 541636 616402 678909 672150 660364 597674 484527
12051 484527 496237 611953 670959 661810 850388 947612 1094089 1233783 1196683 976463 905374
12040 905374 916236 813322 759775 674954 740924 686788 505252 475337 432213 588349 548275
12029 548275 415720 471296 479317 508933 590560 607421 651216 630476 643353 711067 774789
12018 774789 785310 773510 685348 695458 692592 699692 761545 746947 669364 698235 693007 748548
12006 748548 925384 922048 958458 952079 909881 883138 916404 915481 898071 839020 845183 1000774
11994 1000774 1011672 894525 939096 956022 979453 1105540 1203968 1213562 1197586 1170271 1123227
11983 1123227 1133508 1208275 1246563 1288047 1341444 1278150 1251838 1285518 1310162 1407175 1496370
11972 1496370 1575321 1712955 1884913 1828657 1729703 1708809 1822917 1966762 2036662 2135094
11962 2135094 2283103 2376265 2527391 2557939 2628930 2755854 2916514 3155246 3290552 3484196
11952 3484196 3782277 4051652 4314300 4538002 4723666 4981633 5330169 5655099 5956737
11943 5956737 6411043 6960033 7414368 8046327 8709243 9456427 10284098 11278662 12463073
11934 12463073 13869846 15595423 17369926 19413470 22110292 25526130 29708008 34929024
11926 34929024 41662314 50568430 62745205 79432096 103125711 137946706 189179684
11919 189179684 263842205 365750577 478168720 544878236 510757842 404259737 294088662
11912 294088662 211216181 155097050 117522164 91774965 73545669 60284893 50363536
11905 50363536 42578774 36557024 31573592 27562872 24349695 21608613 19072511 16949521
11897 16949521 15379795 14002080 12631303 11348785 10276142 9442786 8728596 8035687
11889 8035687 7341172 6776887 6325985 5974516 5660780 5326520 5054707 4828249 4650042
11880 4650042 4445047 4314102 4187449 4022931 3905333 3802548 3590232 3427830 3305022
11871 3305022 3310015 3204929 2973192 2717015 2538004 2469693 2301355 2176184 1997852 2031122
11861 2031122 2118773 2094607 1973767 1968762 1862534 1762181 1708735 1808326 1766501 1721709 1726406
11850 1726406 1686286 1647957 1627047 1656952 1666999 1547241 1422300 1327077 1359633 1374818 1383139
11839 1383139 1183000 1092875 996253 1048509 1142949 1106898 1185874 1153972 1223696 1325949 1240844
11828 1240844 1235887 1263934 1323130 1366429 1457267 1503567 1553865 1650984 1702761 1679141 1640280
11817 1640280 1566692 1548797 1605945 1706433 1650922 1565561 1471723 1495319 1395097 1360906 1445577
11806 1445577 1554595 1399901 1293528 1374350 1360004 1228625 1187562 1264820 1145799 1105425
11796 1105425 1066112 1008994 1088716 1176707 1205922 1165194 924816 764385 656198 690506 890980
11785 890980 880775 825272 870732 999828 1119404 1068510 965057 969602 987419 1053206 1158035
11774 1158035 1126182 931175 1095914 1221569 1164659 1116091 1125880 1023363 1026085 1097902 1036444
11763 1036444 993311 1130741 1180337 1220874 1212855 1122674 1005020 922078 1009257 1013517 945816
11752 945816 898277 815185 785476 765609 661369 630394 604298 708115 834644 794833 604625
11741 604625 559324 504807 415260 378940 492118 501741 582773 647801 729855 588833 596619
11730 596619 645884 708388 816184 943905 974364 991291 1006889 1084595 991492 893331 954042
11719 954042 1084353 948341 892385 967459 1056383 1078045 941780 842176 844586 820150 972948
11708 972948 1008412 886872 869914 866623 861633 893591 854303 917176 951710 953680 985032 915994
11696 915994 843244 795051 838763 986143 946067 867030 992153 1073402 1043141 1022536 924484
11685 924484 914649 922496 969681 971338 1042209 1043132 999422 923327 918605 945563 902447 874662 923409
11672 923409 1030587 1164494 1213950 1129116 1077866 1064930 1101485 1183991 1134143 1039014 1058135
11661 1058135 1207537 1172408 1058721 1153389 1094055 978727 915646 1016860 966848 858184
11651 858184 980658 965214 1006190 1013048 879391 822894 935985 1041183 1091609 1029421 946489
11640 946489 848759 886076 895836 879235 900843 960724 908627 1007918 1032623 1124340 1148388 1174289
11628 1174289 1341979 1392417 1294558 1255434 1160247 1168714 986031 767352 687125 625790 796263
11617 796263 1033063 1053167 967698 811705 825372 892343 825313 722708 735245 760435 763792
11606 763792 779531 820391 837267 828396 759364 803176 761857 795678 785959 721465 719382 807843
11594 807843 934709 921890 867065 785422 815804 834222 826937 814664 846489 855120 792129 757298
11582 757298 728637 835607 869672 828406 794640 899610 905858 968866 1067920 1125148 1054846
11571 1054846 1032890 992707 1006582 991831 1043549 1041777 969946 958330 1043646 1093900 1045230
11560 1045230 943145 956826 1008770 933370 937371 1009760 1146877 1154379 1109949 1133986 1053618
11549 1053618 1039536 1022819 1112234 1148096 1224291 1261925 1307530 1349042 1357211 1384114 1463755
11538 1463755 1601438 1717489 1792183 1704486 1615239 1621092 1519628 1563757 1638015 1615848 1638764
11527 1638764 1523821 1550320 1528433 1611244 1587501 1575031 1804627 1959387 1953785 1905941 1856172
11516 1856172 1767142 1759995 1886052 1911197 1873261 1883749 1896131 1922399 2005712 2192732 2220340
11505 2220340 2125466 2072604 2126397 2165518 2175806 2329779 2396566 2414241 2522425 2581776 2629826
11494 2629826 2775187 2942763 2995136 3051552 3303075 3463097 3647484 3718110 3829600 3850694
11484 3850694 4080918 4378646 4768620 5107540 5458123 5887890 6222361 6637972 7119905
11475 7119905 7496442 7950774 8396226 8873939 9552613 10462772 11420817 12625902 14038258
11466 14038258 15580349 17265353 19317604 21765278 24582510 27748974 31282997 34986990
11458 34986990 38904328 42985389 47162965 51090362 54330923 56646627 58229182 58791015
11450 58791015 58312996 57113714 55249273 53033687 50572058 47959468 45524068 43065837
11442 43065837 40688395 38649822 36864511 35462609 34410861 33649751 33180646 33034344
11434 33034344 33081195 33343118 33883263 34586137 35809838 37327879 39190721 41523130 44321381
11425 44321381 47528954 51189229 55778884 61169382 67200601 73950893 81314352 89187500
11417 89187500 97507713 105859328 113938479 121277740 127362838 131956780 134677288 135490197
11409 135490197 134407836 131642460 127472095 122140705 116485874 110742171 105367320 100941455
11401 100941455 97510749 95217483 94022080 93997043 94673260 95693655 96704109 97166376
11393 97166376 96812975 95710205 93578283 90442632 86699414 82715023 78908619 75422866
11385 75422866 72349588 69674773 67820272 66865298 66682095 67331680 68922498 71284383
11377 71284383 74338777 78047156 82084547 86184282 90136994 93787281 96835922 99167583
11369 99167583 100538818 100998126 100731413 100094136 99427754 99127189 99485040 100800673 103377661
11360 103377661 107418995 112832955 119383739 126676192 133862699 140263641 145046107 147789251
11352 147789251 147983295 145477168 140668401 133559200 124823951 115211002 105302838 95570175
11344 95570175 86678742 78930533 72098221 66178229 61347229 57224478 53994944 51286208
11336 51286208 49024107 47258838 45825596 44567418 43499063 42759859 42154616 41915861
11328 41915861 42116778 42709977 43677712 45083796 47101718 49796350 53013804 56696496
11320 56696496 61015514 66029747 71688408 77997255 84866292 91993816 99135346 105944202
11312 105944202 111988145 116790104 120038585 121814933 121654675 119506807 115684476 110464989
11304 110464989 103889968 96583443 89008838 81567282 74684269 68558416 63377448 59130635
11296 59130635 55703053 52896943 50622926 49022668 47700122 46528427 45517707 44662492
11288 44662492 44116952 43857143 43955760 44433173 45578697 47538813 50251803 53758711 57707023
11279 57707023 62239313 67168376 72147299 76817581 81057014 84800023 87763113 90260054
11271 90260054 92489280 94047707 94812548 94946429 94365756 92896057 90834686 88324056
11263 88324056 85640683 82950001 80206418 77207585 73874357 70214461 66272386 62038891
11255 62038891 57658294 53335428 49412096 46005872 43313095 41283630 39857926 39038701
11247 39038701 38904015 39032322 39394520 40049006 40693346 41364813 42096632 43007455 44228312
11238 44228312 46263234 48906165 52112464 56020116 60421701 65013755 69582667 73541069
11230 73541069 76470577 77773522 77210938 74860724 70922398 65610284 59708197 53563795
11222 53563795 47566260 41756235 36545664 32049608 28091075 24667216 21942675 19706362
11214 19706362 17769391 16105812 14761922 13465527 12247189 11255269 10494673 9801217
11206 9801217 9086690 8467754 7864360 7327729 6935505 6488089 6043035 5667632 5368796
11197 5368796 5001297 4637731 4555444 4343962 4000952 3853270 3603421 3528576 3543473 3401691
11187 3401691 3328281 3200895 3066752 2939985 2904089 2896102 2776324 2685947 2623269 2443918
11177 2443918 2207971 2162559 2269540 2300110 2351259 2349025 2254532 2111851 1958024 2005414 1970536
11166 1970536 1978569 2021079 2184531 2135588 1963662 1861174 1779800 1752760 1738139 1812552 1898523
11155 1898523 1729843 1727129 1745399 1717824 1611093 1592496 1564278 1458913 1438445 1488994 1440761
11144 1440761 1340085 1277185 1199338 1267201 1320850 1325085 1259580 1140753 1120665 1122744 1164933
11133 1164933 1193772 1179171 1090238 1192476 1218717 1220763 1341731 1315279 1264424 1241740 1241633
11122 1241633 1326452 1346906 1228233 1196674 1164935 1153807 1265040 1343647 1312999 1292545 1239762
11111 1239762 1226862 1203571 1236330 1261167 1347119 1220891 1045555 943132 904185 925708 1092069
11100 1092069 1148358 1226859 1268458 1193953 1247533 1287518 1276073 1232967 1228016 1266657 1272211 1215431
11088 1215431 1034438 1069205 1239394 1193871 1239526 1259143 1271121 1228417 1185118 1253328 1270820
11077 1270820 1163026 1023366 914615 1005883 1092726 1192642 1203768 1131456 1097073 1107711 1094239
11066 1094239 1170609 1260684 1259079 1273574 1362227 1367682 1393053 1425729 1309285 1236993 1296752
11055 1296752 1348205 1500444 1553361 1505253 1430590 1495781 1652820 1743419 1905949 2030690
11045 2030690 2123789 2153092 2122796 2161901 2166015 2013308 1860122 1919221 2110365 2172172 2263706
11034 2263706 2386152 2435707 2522756 2475133 2362376 2275841 2285872 2318053 2259826 2169907 2223426
11023 2223426 2543772 2829210 3114641 3209603 3178514 3071937 2881683 2824542 2865055 2905125
11013 2905125 2942412 3035224 3100327 3317886 3542693 3657680 3694906 3705297 3662124 3550725
11003 3550725 3611980 3791341 4028529 4244888 4358578 4605658 4777210 4928033 5040429 5282153
10993 5282153 5516749 5801628 6198285 6566821 6991516 7559873 8110760 8651592 9337649
10984 9337649 10144068 11042959 12103905 13348648 14881205 16725292 19132974 22048386
10976 22048386 25682487 30117186 35426637 41898578 49515721 57903924 66211301 73405401
10968 73405401 78185534 79954846 78355191 73965378 67595771 60416384 53302577 46876933
10960 46876933 41328357 36772200 32928428 29781902 27233898 25231844 23700456 22501788
10952 22501788 21505027 20831882 20561856 20286616 20188619 20483428 20951949 21563743 22234254
10943 22234254 22955456 24095627 25661475 27475813 29798852 32682980 36024307 39995002
10935 39995002 44940124 51124691 58930792 68811769 81185322 96072262 113073866 131074789
10927 131074789 148321940 162279806 170515357 171663691 165861703 154044506 137624366
10920 137624366 119235603 101315482 85427345 72413084 62016869 53901135 47433611
10913 47433611 42170468 37803348 34152989 31217919 28813601 26893866 25385976 24233256
10905 24233256 23285987 22516291 22013525 21685551 21592613 21646429 21707755 21885467 22423586 23181585
10895 23181585 24278676 25888192 27939330 30564742 34135011 38428746 43487504 49709460
10887 49709460 57170049 65695363 74800295 83233729 89402725 92055257 90227443 84335818
10879 84335818 75674362 65913477 56337137 47750581 40502794 34542454 29671613 25721127
10871 25721127 22407528 19728227 17669603 15921032 14425103 13162668 12062118 11145541
10863 11145541 10330954 9584755 8903526 8274335 7740679 7241039 6841036 6506989 5913882
10854 5913882 5424798 5037080 4714438 4442891 4142158 3902120 3767388 3663183 3579010 3416302
10844 3416302 3177367 3047462 2803714 2566597 2510180 2487748 2419955 2424725 2323087 2073443
10834 2073443 2066475 2183090 2068761 1954307 1875860 1815065 1712268 1638309 1614028 1662775 1725301
10823 1725301 1582337 1612332 1732360 1630138 1436413 1386290 1407842 1411715 1385906 1483649 1526218
10812 1526218 1461297 1394035 1344115 1189428 1247303 1276722 1196929 1087650 1060874 1001684 911214
10801 911214 850324 814368 840652 881552 795800 759693 708981 697949 666261 686201 655815
10790 655815 793191 807880 724400 713968 762882 784342 775693 674775 636502 627125 693927
10779 693927 793023 829932 810941 844046 815176 790359 720647 591374 475376 464330 535919
10768 535919 598242 650384 677787 649323 672766 701815 633521 711070 550872 481588 518405
10757 518405 586011 620731 616288 620592 594261 676365 749804 790968 696749 542217 499926 523842
10745 523842 554882 714989 870898 844069 741860 761974 809608 870005 844858 800293 783300
10734 783300 744705 755788 820432 812786 835252 815362 813954 796583 748944 757578 808385 813322
10722 813322 783527 824724 890561 934891 975726 1057452 1030642 923141 895865 916582 864109
10711 864109 797236 799433 758565 814870 875032 862162 738071 778958 849381 778795 705485
10700 705485 719987 583118 380625 470807 511378 543754 599061 592797 663295 728718 728037 682555
10688 682555 661693 675903 645440 533104 555919 693192 702054 790634 933579 808715 725501
10677 725501 714804 706705 780913 810573 849220 848358 896810 980674 1049184 1024602 1041017 1019153
10665 1019153 1060144 1211509 1297932 1436880 1360125 1263252 1089344 1102249 1165805 1303831
10655 1303831 1571333 1593646 1478181 1461736 1551056 1635580 1849363 2091492 2049592 1985841
10645 1985841 2019183 2132305 2241181 2159330 2166577 2318763 2451187 2504281 2649051 2986992
10635 2986992 3228026 3517193 4041312 4639828 5256290 5762193 6117217 6489569 6966140
10626 6966140 7575789 8519655 9683506 11211311 13194384 16091637 20027427 25296546
10618 25296546 32180181 40932325 51438148 62208152 70072450 72521292 70144841 66050225
10610 66050225 62807336 62174752 65018341 72006524 83788491 100815823 122438863 144167732
10602 144167732 157508429 156178687 143233278 127610346 115666285 109708856 110467186
10595 110467186 118352844 133481197 156128221 184080377 209857172 221066620 210218100
10588 210218100 183987424 155665350 133298350 118789624 111708454 111504925 117600390
10581 117600390 129538501 144576855 156931934 158532729 145395196 123252795 101185718
10574 101185718 84105222 72796295 66318793 63898082 64645712 67649900 71465005 73649973
10566 73649973 71124810 63206426 52192563 41287886 32418864 25679224 20684532 16994119
10558 16994119 14286966 12225730 10500870 9291120 8319489 7470885 6771442 6181014 5479222
10549 5479222 5066420 4702866 4125570 3578035 3264943 3057427 2830643 2541200 2504333 2551663
10539 2551663 2363770 2205296 2239732 2212547 2183230 2106855 1894485 1673105 1626287 1635466 1597182
10528 1597182 1501297 1368130 1299932 1228149 1159605 1072438 1053383 1239353 1279466 1304755 1301270
10517 1301270 1279490 1398958 1406845 1414866 1441124 1549692 1722383 1785001 1659673 1621969 1574435
10506 1574435 1558950 1486135 1375674 1243168 1123163 1104106 925041 901876 921004 866322
10496 866322 765674 549443 421847 456744 586375 737758 646371 625370 692615 726162
10486 726162 625589 653308 610831 537010 473553 443291 482143 647970 719497 647112 570225
10475 570225 473002 505436 632944 749676 844748 963007 1013276 1079546 1041965 1019715 959763
10464 959763 965741 924640 897366 898456 784944 652234 566034 469553 508583 440949 338030
10453 338030 236376 193269 117684 27031 105046 159790 177110 330708 427935 411048 328641
10442 328641 184296 165507 208562 299354 431034 379075 276568 295331 325168 209561 152377
10431 152377 162538 247832 211700 84079 106712 270396 255270 256400 250740 165417 219795
10420 219795 341291 312937 300459 116515 -1049 24656 51692 121201 225403 224861 224259
10409 224259 221048 213650 250711 246907 218326 165578 216868 175812 191507 234482 141403 151598
10397 151598 138490 95728 76360 168642 191094 263786 363492 511550 583688 465768 279345
10386 279345 236448 231242 170181 177386 79941 127988 223666 283461 287426 313129 306205 288465
10374 288465 323945 306535 278866 173886 240834 244234 262936 223248 295859 357221 389369
10363 389369 417765 394994 284525 184021 120124 164597 149034 108257 142776 184190 167256
10352 167256 160066 216446 200770 78493 49049 31191 121648 173969 335154 383641 356304
10341 356304 312835 281844 186765 97468 105864 41690 40392 171002 280930 244875 249751 254640
10329 254640 290339 201223 239027 130863 -24012 15806 89720 201351 281958 140000 132613
10318 132613 260053 270670 146766 149058 179149 173498 165772 71979 58735 170358 162954 183844
10306 183844 228116 214295 142406 22301 -37338 -51737 -60775 55761 116674 24914 -11564
10295 -11564 18232 149502 125747 19424 80616 52434 55278 32259 24346 148424 115645
10284 115645 74096 137700 150517 175187 209635 143776 103555 159538 183704 89040 82378 68483
10272 68483 131349 207301 300655 322172 314514 285104 292164 280326 208981 189614 195513 261981
10260 261981 296540 220640 178557 114382 -43497 -18381 136765 308742 359662 355489 263989
10249 263989 216795 303604 290988 171787 156939 167113 141185 229581 278680 217930 249705
10238 249705 84687 139238 335422 452041 484909 302563 196815 138026 107171 159873
10228 159873 74816 41611 19860 -59376 -35068 123429 279098 365116 299586 180091 109467
10217 109467 -75712 -217751 -24373 191937 244428 115354 95090 153923 188001 254917
10207 254917 216057 162040 74603 -33662 82513 219445 202012 257149 286626 306542 149394
10196 149394 67171 -24080 -38217 64106 80031 98216 151772 42390 192398 203209 144373
10185 144373 114451 204785 280789 240229 300793 412285 466288 452689 523388 491857 416437
10174 416437 368481 361994 429628 365956 423376 511778 481891 692751 998714 1095543 1043576
10163 1043576 1014625 876062 613559 531930 691007 696442 820546 1030338 1263718 1516038
10153 1516038 1580124 1266052 1030862 988163 885073 849805 837551 870299 844832 894654 917112
10142 917112 941439 945814 901062 779169 610643 509477 459571 516813 483638 427022 456221
10131 456221 520036 440893 335427 245698 289371 321063 256022 202729 234789 242886 248680 171418
10119 171418 220444 254067 224828 239656 208591 172018 189672 171207 271030 330920 270896
10108 270896 169585 200637 235244 200878 241631 244976 118711 58496 136486 151785 206869
10097 206869 58293 -34101 -6107 93263 191936 147705 -98228 -110254 139550 155436 122773
10086 122773 143413 74811 48978 138480 235938 264896 151693 46824 101464 235311 320903
10075 320903 230938 82594 108731 289919 444397 287304 141592 110888 24800 -40323
10065 -40323 -34978 -42151 -25754 -49444 25729 130931 184677 21192 18370 96939 200260 168383
10053 168383 227048 296770 168989 51279 154000 196487 140621 150175 263111 265948 244204
10042 244204 276173 262240 266543 148642 50279 31346 15368 174806 253416 136341 162087
10031 162087 160318 107576 64490 31355 51967 81385 235131 206375 79458 116667 144795
10020 144795 152077 118441 103975 104965 175296 196732 157089 229602 284922 230843 215744 291844
10008 291844 203851 69497 48046 150531 235114 188341 140740 160858 147419 206095 231395
9997 231395 155448 81145 -7642 65726 25784 -1404 115718 312844 318872 297512 254656
9986 254656 120272 -25717 7119 55142 83747 191206 188982 210806 261464 320682 316380
9975 316380 252564 224334 270167 249445 339806 332991 267320 223057 275177 349189 363712 310034
9963 310034 286109 274902 269181 197063 116165 115228 162940 226739 249270 254182 259110 281496 397038
9950 397038 488633 563650 670664 555318 414859 424688 214525 110835 161572 239713 324414
9939 324414 463085 499775 423785 463436 517975 552118 688002 841268 960532 1121489 1039083
9928 1039083 838573 627047 608951 598925 578932 558986 551122 604780 580420 473669 335289
9917 335289 434292 573301 649794 721927 778877 782028 817485 815995 761080 632754 560485 667761
9905 667761 748007 692120 599118 564621 562173 610702 601900 641557 562394 496664 562159 580853
9893 580853 404750 395384 527797 621556 630627 647375 622869 746344 735923 686648 705275
9882 705275 746988 689883 559909 511136 486056 512545 578411 706894 793309 661567 584818
9871 584818 549662 671650 736464 518103 364879 340465 401187 433526 531281 475514 606317
9860 606317 581926 585721 581509 583394 555929 495495 493874 478431 500256 500731 644148 723636 663434
9847 663434 589776 554807 550390 529721 573690 648758 604222 569395 649215 677820 672533 615453
9835 615453 591881 522704 575795 579219 484596 473379 491102 494133 488189 406354 343295 444788
9823 444788 557939 595073 674914 659519 701282 671182 545599 552728 622917 666349 676514
9812 676514 558713 471311 575432 684946 649410 482109 460865 543560 616254 701892 801988
9801 801988 777465 796358 792744 720519 700135 747284 631791 645919 650708 692143 655478 602944
9789 602944 549273 444623 576544 621499 571574 474143 520004 582523 673744 707040 680894
9778 680894 642777 702749 687574 655540 599932 606039 540111 614031 601856 613598 568932 567099
9766 567099 502647 512762 535991 537229 585388 607192 600867 669467 857266 802890 725711 674736
9754 674736 580762 481919 432497 452381 455710 552823 567455 580282 627442 537216 516970 639373
9742 639373 593435 591900 721985 729193 674134 618557 617060 630942 730167 747196 738911 759792
9730 759792 765546 670104 577380 502651 577405 771178 910311 789275 591961 623931 638453
9719 638453 716549 704738 734356 726825 823996 845592 807405 666373 711241 604278 560136
9708 560136 781080 927349 954238 971326 955604 945421 931800 915713 948538 886418 722018
9697 722018 708725 879847 983868 1064172 1043145 945888 899032 913102 807314 894986 959525
9686 959525 980348 1014175 970323 999474 944046 896549 871162 867040 802359 688273 714110 719525
9674 719525 648423 752393 768085 671477 728566 736965 711560 775067 888576 871837 830846
9663 830846 892539 991929 1032776 1039545 955010 995440 1134418 1055138 1029040 1044100 1134620 1147683
9651 1147683 1073015 1016905 1023419 1107901 1156114 1079060 1069091 1095083 1163774 1140033 1123280 1193389
9639 1193389 1272596 1264202 1253800 1160217 1189218 1263486 1364831 1407542 1459608 1331874 1207908
9628 1207908 1214507 1261363 1408219 1466713 1553922 1743246 1773474 1770731 1831230 1864515 1987980
9617 1987980 2121139 2021303 1892190 1946904 2030274 2014803 2076731 2161381 2252620 2367744 2567860
9606 2567860 2696753 2863535 2973372 3000017 3118273 3281823 3555749 3849842 4162951 4479685
9596 4479685 4918155 5508857 6056279 6645172 7472871 8542406 9655286 10786740 12030164
9587 12030164 13214964 14255693 15246752 15957999 16053877 15823528 15194968 14561615 13883326
9578 13883326 13274214 12764911 12193728 11697993 11431401 11510364 11733909 12085934 12615979 13491854
9568 13491854 14493269 15764308 17221321 18747588 20167873 21220278 21822759 22182390
9560 22182390 22266610 22533265 22934076 23563898 24213563 25125812 26388577 27742761 29204319
9551 29204319 30777198 32558239 34336395 36066409 37689484 39029438 40194678 40847077
9543 40847077 40928493 40619376 39919415 38965086 37700172 36305662 34954029 33912481 33478255
9534 33478255 33570270 34244916 35684429 37892071 40508043 43292832 46146364 49071171 51965107
9525 51965107 54960635 58072353 61047115 63387678 65464038 67404370 69460679 71987848
9517 71987848 74689847 77500809 79905690 81351478 81735293 81140534 79764041 77999718
9509 77999718 75847378 73455420 70707781 68005682 65395148 62895712 60591323 58277008
9501 58277008 56122792 54255240 52735616 51732946 51062802 50952420 51312925 52401269 54240080
9492 54240080 56907943 60319409 64416755 68947718 73334703 77375315 80803797 83084732
9484 83084732 84231485 84778373 85811378 88162939 91825344 96618880 102366367 108877785
9476 108877785 115240177 120634402 124459066 126238512 125609348 122434512 117677150 111854116
9468 111854116 105568036 99070229 92800404 87002154 82139825 78428248 75642076 73578998
9460 73578998 72134151 70556642 68039899 64820515 61428856 58365913 56042374 54794201
9452 54794201 54356125 54802377 56158759 58559834 61896802 65927277 70006966 73437370
9444 73437370 75587020 77026504 78835870 81673453 85458999 89750088 94260031 98346738
9436 98346738 102124804 105253810 107327471 108239034 108016073 106398206 103494958 99786754
9428 99786754 95638182 91240919 86799624 82218842 77148778 71315367 64968990 59284756
9420 59284756 54527958 50892944 48056512 45877874 44243923 43084569 42382543 42057526
9412 42057526 42238374 42558669 42605146 42350440 42207697 42391330 43168737 44618621 46971271
9403 46971271 50076282 53910446 58518344 63601369 68797485 73579133 77863808 81292585
9395 81292585 83736864 84654942 83959056 82103291 79653844 76843379 73907178 70909016
9387 70909016 67688989 64463252 61301174 58338229 55656786 53132457 50655476 48473803
9379 48473803 46782253 45496478 44281029 43105207 42078324 41044766 40116477 39298254
9371 39298254 38731253 38512716 38810392 39631033 40885535 42522619 44385502 46269081 48040108
9362 48040108 49505775 50906736 52335271 54198069 56662957 59527535 62833516 66438520
9354 66438520 69991700 73194535 75753104 77363054 77723060 76769867 74598421 71634522
9346 71634522 68480440 65506842 62857938 60922798 59774510 59105796 58866838 59112276 59492492
9337 59492492 59840803 59872207 59485085 58171403 55792885 52537074 48945449 45696512 43044258
9328 43044258 41279785 40309362 39923256 40049175 40566236 41412390 42646765 44292506 46496020
9319 46496020 48897696 51500995 54043955 56298535 58038500 59208748 59792952 59849270 59639510
9310 59639510 59131425 58320439 57341286 56329812 55357280 54610013 54425567 54480344 54307104
9301 54307104 53720133 52674163 51293212 49527224 47455236 45068209 42523543 40144828
9293 40144828 37849466 35751985 34093420 32936841 31997286 31578900 31615478 32182714 33269912
9284 33269912 34667117 36095594 37239460 38046976 38314752 38199662 37851281 37441311 36763081
9275 36763081 35602037 34101772 32440817 30912964 29352657 27809778 26347937 25012886
9267 25012886 24034680 23288455 22666795 22153194 21824560 21364839 21070912 20495692 19681386
9258 19681386 18655508 17593068 16380747 15068754 13908430 12848316 12099658 11510514
9250 11510514 11159650 11011421 10964953 10957812 11197806 11559976 12068067 12481353 12905167 13245952
9240 13245952 13442541 13495895 13119247 12734678 12241085 11617075 10798881 9795165 8992800
9231 8992800 8234796 7473856 6563318 5758358 5206767 4754687 4348620 4101628 3896868 3593966
9221 3593966 3266221 3050783 2829136 2648611 2439380 2363993 2221021 2098553 1999870 1859604
9211 1859604 1878297 1783039 1652552 1637583 1620314 1462608 1473047 1411579 1372196 1284922 1204609
9200 1204609 1207106 1160263 1177208 1188962 1264006 1220861 1134142 1110660 1126754 1143104 1056762 910700
9188 910700 817779 751929 870177 882769 766629 712999 745662 799214 819488 841822 919425
9177 919425 932593 906596 898656 929078 818470 802981 770246 816561 858293 769366 714998 706346
9165 706346 744248 806394 906409 910489 777244 731731 770216 716220 661349 756217 776056
9154 776056 895019 853034 646873 549893 546024 605036 566060 530706 573392 453059 319269
9143 319269 328191 437319 435568 579316 674530 667602 621929 595350 736957 629575 626484 775099
9131 775099 806284 790128 754241 788272 866619 855402 873714 877795 907592 957253 942270 774046
9119 774046 735678 778894 889874 941995 919888 849891 726374 664918 731534 797525 740962
9108 740962 838536 879849 930215 869321 787349 763374 791953 783514 694009 644302 689556 630475
9096 630475 609027 688002 682871 571123 584085 615904 635104 647575 649915 576151 524930 544192
9084 544192 529924 531346 595614 639973 527711 457125 463834 508743 524372 548738 538765 591479
9072 591479 667771 693555 683384 600155 483171 539154 667410 767190 783887 839694 786910
9061 786910 819431 804193 767280 707458 776005 725712 672890 663308 653959 591428 523068 574333
9049 574333 727874 753268 791050 801555 798710 705412 639360 516270 507588 551012 628810 629379
9037 629379 658045 661243 611806 575922 558576 526724 614356 707135 685191 700625 607667 522878
9025 522878 468307 522154 508045 515273 563845 495964 455411 600407 653455 673059 724555 768382
9013 768382 738338 676848 656605 652315 598031 483240 433431 415699 461024 444689 520302 454576
9001 454576 463691 420717 348302 320522 331622 277302 388626 520129 594995 571312 478069
8990 478069 399786 338529 387565 417697 401745 415884 416444 472104 478927 488260 466977 389921
8978 389921 388116 445783 419661 362636 444768 503476 552862 555762 417074 229451 232834 296061
8966 296061 471928 444327 475164 378237 314473 296009 322314 407799 256598 113346 151678
8955 151678 329939 374391 369764 337650 362263 501705 537728 435040 421831 435438 419002
8944 419002 400928 409874 357345 350120 328121 376895 350116 330917 467055 585108 538619 480883
8932 480883 421421 374477 373258 385072 232364 254465 402339 397746 311878 280007 198562 196746
8920 196746 201048 220521 221353 275272 313592 421769 459534 429818 491436 539668 548364 460116
8908 460116 359462 331825 294840 404362 355236 284162 298452 273152 192399 266301 330256
8897 330256 288007 263839 324690 367730 445903 361299 208278 94068 187487 306041 345618
8886 345618 348042 210931 190769 143026 76477 58734 140386 232205 339967 409945 441833
8875 441833 442601 407475 295054 147738 88029 93396 147514 306799 274823 274516 283669 294327
8863 294327 266648 236847 162284 174676 265660 160066 202917 249553 280978 197559 188289 224140
8851 224140 190959 114134 74424 50816 -32051 125399 210259 242189 317569 180299 104485
8840 104485 196485 132263 113225 60334 -136487 -102570 52128 -25846 -23086 -1162 56173
8829 56173 13596 141755 199116 159282 223872 163844 91830 94596 95702 201304 184936 143177
8817 143177 141987 145313 71774 71839 105516 211674 258635 172346 107076 101742 68586 -16674 36863
8804 36863 -6613 5277 -62590 -62822 -80242 -89332 -44709 130005 117044 17881 -32337 55195
8792 55195 110658 123581 108754 135970 150527 136579 183574 132210 -9793 -38199 -66234 -85691
8780 -85691 -45103 -62375 -28042 -75347 -12843 13169 298 -49326 -42070 -1698 66595 -13431
8768 -13431 -103768 510 83811 37443 -9757 -37354 59504 133980 127541 54374 61070 235122
8756 235122 380606 371928 180205 20303 46396 152165 182796 140272 -19832 -22387 38812
8745 38812 40554 -29564 -127518 -41159 6534 -23309 -31706 -17928 83933 14718 60241 124804
8733 124804 103118 17336 -31726 -88650 -110605 19988 138478 196374 283654 308601 299307
8722 299307 323750 247222 234519 192466 89427 63568 47912 95288 156315 69793 27195
8711 27195 23288 9746 123337 115202 107050 46610 26037 37645 131100 204315 142920 -3369
8699 -3369 -156279 -75804 54953 198738 194660 59420 4033 17077 123297 110628 -36051
8688 -36051 -31546 155957 128108 71097 11003 89804 175523 231781 222121 262537 179157 54304
8676 54304 4713 50384 148273 222168 170705 -72873 -56064 110387 91631 72207 92835
8665 92835 118763 182583 170234 78907 23844 47902 74073 -24825 -92214 -127399 7500 226359
8653 226359 213170 118582 88663 84673 22298 -26319 98158 173957 80198 60679 113255 126652
8641 126652 146483 250274 294976 244553 173651 185142 211465 174338 160767 197741 162521
8630 162521 167721 154835 122951 95351 88052 122410 6139 -145767 -127153 72483 138777
8619 138777 83788 92687 36051 -91170 -150498 -81547 -8643 47916 114823 156621 2990
8608 2990 -2075 25029 -90670 -130801 -142141 -36388 -27365 -147241 -85527 28151 166852
8597 166852 128843 62547 82400 48587 -44651 -91624 -11060 67651 60256 92445 195639 192415
8585 192415 12903 -109817 -137386 -162643 -157400 -82485 12771 220804 166089 -893 -7670
8574 -7670 1136 59712 108800 113634 53900 -89715 -174789 -156744 -117362 -189557 -159166 4608
8562 4608 97351 90349 70545 76356 117674 61935 27236 119730 48641 12009 173504 191869
8550 191869 99093 23595 81882 145063 -59852 -104206 -23687 -27473 -18331 -35024 28716 80520
8538 80520 35993 -29461 20739 45016 63818 38653 -43846 -104962 -95309 -58327 -10412 58630
8526 58630 81915 76977 57490 -15369 13041 60565 -43072 -26263 -84910 29796 47406 -48822
8514 -48822 76579 72399 139499 153384 229000 199592 88676 46229 -104718 -72602 -20168
8503 -20168 34733 47427 58610 62838 12560 48960 12438 -122032 -122540 2716 64411 39987
8491 39987 22687 -133487 -223657 -239672 -343191 -338554 -289919 -170999 -115816 -57382 -4506
8480 -4506 -96515 -119617 3460 27871 -103637 -163205 -86347 66412 -9765 -33670 -17012
8469 -17012 85280 52498 -73300 -60269 48534 41177 96419 126445 49748 -22590 -30914 -11188
8457 -11188 63481 55369 25739 -82159 -50596 -72574 -39156 38908 147568 176832 150025 48520
8445 48520 -16319 110123 91299 17141 -5662 101787 168526 246965 183542 180831 250572 346432
8433 346432 389995 356464 275910 188937 53626 -42691 -19690 36122 81005 26706 39746
8422 39746 99311 175859 185590 128955 206655 253401 253209 219105 162293 87615 79701 58304 158289
8409 158289 116211 10771 -168032 -150217 -164854 -137868 -119332 -2154 9300 -4539 19078
8398 19078 -26096 64170 73719 -40694 18540 104475 137610 98076 -37046 -95037 -115727 -163382
8386 -163382 -103716 -76762 -13416 -38539 -11363 84029 74395 80145 -30155 90711 128086 95022
8374 95022 131518 126649 33889 54156 -49437 -121251 -61382 -61931 21117 24983 -25672 9444
8362 9444 -77446 -87403 119112 302145 190191 97824 86648 109084 55555 71992 179186
8351 179186 234972 276379 196377 66807 121000 87600 -98430 -192917 -81665 31626 6851
8340 6851 10681 31705 96088 46211 -68831 -66270 -76274 -102864 69682 80410 -947 -83823
8328 -83823 -35190 60016 79835 156001 121239 -28130 -131889 -26522 13389 -40921 -87987
8317 -87987 -10859 -14299 87184 128003 220527 420883 468760 470447 411025 283156 458701
8306 458701 605323 662844 749389 828737 927421 1076235 1198342 1224969 1233706 1404325 1593519
8295 1593519 2022638 2565541 3354369 4531302 6573589 10080080 16150186 25851701 37451959
8286 37451959 40204548 29710939 18174530 11345594 7645714 5521186 4369654 3602878
8278 3602878 2983237 2484943 2064057 1837479 1675325 1538548 1609737 1634248 1411935 1207065
8268 1207065 1126654 1065711 1019384 1146446 1184079 1237061 1271132 1376960 1573134 1604901 1808054
8257 1808054 2130828 2430754 2937379 3767010 5298528 7759771 11923909 19054637 29740739
8248 29740739 39289803 36358468 24111354 14562779 9300591 6422473 4813857 3794431
8240 3794431 2943508 2412910 1978579 1671249 1418791 1191400 1142501 1147564 1178063 1096349
8230 1096349 1030987 885996 729028 651602 627070 617866 556561 410670 280237 349099 285475
8219 285475 178279 140241 101748 142728 205141 125661 72716 76150 119935 219003 90393
8208 90393 91350 81347 54150 100536 50010 58489 134173 174985 142792 26918 5400 17908
8196 17908 31979 10559 -65532 -22092 124744 94884 61488 100415 12673 62539 34490 -26680
8184 -26680 53683 -39927 -113893 -101874 -55430 -81006 -46894 -101802 -117615 -73170 -134441 -143253
8172 -143253 -144080 -66381 119481 179959 126646 216057 265907 294686 231146 185859 69204 -37553
8160 -37553 -135562 -127922 -98332 -101638 -134450 -140348 -223996 -113332 18654 -49435 -262128 -268438
8148 -268438 -207524 -39328 53513 73424 -49919 -153458 -168127 -232999 -263062 -158855 -50147
8137 -50147 -174919 -171870 -86667 -122034 -50041 10379 -36942 -109745 -68166 -171690 -153090 -127651
8125 -127651 -132504 13218 -1691 -68102 -164501 -191101 -133216 -76653 -86678 -88028 -6893 25196
8113 25196 -3456 68182 75588 103976 13538 -29644 -1306 -30135 -36277 75922 116240 85295
8101 85295 21032 102007 61371 103142 82973 83692 48686 -5823 -16127 -2548 -19027 -121195
8089 -121195 -206589 -201210 25635 155400 56293 -624 -120876 -81800 4155 70754 88427
8078 88427 77694 59934 63293 -31840 -69567 -55039 -4729 -75517 -113457 28716 102792 -45315
8066 -45315 -121558 -123539 -112240 -85081 -70938 -153801 -120530 -20051 77076 135906 63033 89393
8054 89393 1817 -125039 -220420 -254837 -263813 -250791 -205810 -208077 -105078 -70715 -242493 -296386
8042 -296386 -135020 41785 49338 18347 -40097 -34147 -9945 -471 -24501 -77236 -84089 -49617
8030 -49617 -97273 -98737 -26935 -87703 -159277 -179075 -11324 110178 20667 -6771 -75060 -78357
8018 -78357 53045 143493 126052 171869 35961 -117524 -40111 -48847 -152451 -122565 -55546
8007 -55546 25322 -39695 -112922 -94960 -20533 80495 145553 148591 66977 72247 144273 138109
7995 138109 212025 219116 127269 32738 -8548 49385 18844 -47982 22822 -41725 -50456 70409
7983 70409 106795 20165 -66307 22140 90349 74951 -40674 -68227 -15016 88906 115583
7972 115583 50659 -77807 -116756 -19839 -29 76666 58379 -9590 -68395 -104648 -104201 -113499
7960 -113499 21062 154594 125685 72683 -120444 -150843 -116191 -140892 -95272 -32129 44653
7949 44653 84267 137347 165687 145545 17967 -52630 63586 123903 115050 106423 211997 154815
7937 154815 40655 -7086 -50290 -42891 17250 -32284 31648 66161 94088 133775 119596 54826
7925 54826 -98859 -186028 -174669 -208194 -176810 76953 136649 129617 211794 205384 33567 -177232
7913 -177232 -117928 -140317 -210497 -285681 -259802 -271807 -289053 -122927 -49346 -87546 -77728 -47917
7901 -47917 -23382 135602 186910 165664 142738 23263 31257 124786 221562 190634 97470 101931
7889 101931 83864 102056 101318 92209 39029 22410 49264 37325 -75641 -98184 -26444 36772
7877 36772 87453 142803 141146 114013 44908 -110292 -227357 -168141 -146679 -198315 -145268 -147423
7865 -147423 -86939 78494 25934 15931 51190 -61184 -100509 -83215 -13577 6208 -77734
7854 -77734 -141757 -125187 -119651 48455 184519 197158 147905 33238 28795 21778 51582 -3850
7842 -3850 -15022 81327 70806 67152 17104 41121 110035 22416 -22239 18515 -38515 -68156
7830 -68156 26147 120466 134112 26435 21447 28 -73872 -113010 -60581 -163289 -140297 -147792
7818 -147792 -140161 -128143 -46457 -26595 -12308 -39833 -51766 -88493 -117913 -170143 -148564 7713
7806 7713 28020 66002 -20828 -61777 55885 217249 222451 115961 11649 -3922 -1806 4554
7794 4554 -36626 1877 -52414 -49808 11440 3570 122223 63012 -38742 -88625 -80343 -45589
7782 -45589 -13553 -95247 -105489 -55606 45689 30222 -2284 151716 129517 -86431 -186528
7771 -186528 -81014 -22480 15020 83198 54744 115630 176893 48992 -112278 -131196 -146340
7760 -146340 -188705 -143530 -53489 -59739 -53262 -63071 -9682 8119 108741 141787 86050 -107404
7748 -107404 -149123 -135931 -105182 51203 6353 -45855 -7982 66813 49333 -81468 -139984
7737 -139984 -143424 -145788 -118603 -105069 -156339 -176851 -154960 -40432 -72673 -142511 -82773 17558
7725 17558 65985 76250 182717 135153 123930 111786 -849 -85834 -40751 -2438 13147
7714 13147 87149 64368 -52008 -12608 -69026 -117238 -54437 -138487 -142408 -115852 -102236 -186610
7702 -186610 -131362 -19625 33630 53832 14373 34375 -115762 -84312 -60753 -62191 -90663
7691 -90663 -46229 13473 11861 -99018 -168194 -191081 -123510 -50579 84062 129604 40725 -37454
7679 -37454 1936 31694 47724 120521 114964 17387 -3491 -12589 -47210 -7361 68983 134772
7667 134772 121101 -2073 -84042 -183365 -175577 -176203 -50286 117905 195577 158650 145858 60021
7655 60021 66321 -22823 -193597 -191956 -161512 -208709 -161526 -28336 63142 79042 109886 43048
7643 43048 -43841 67285 142928 93206 -50832 -143134 -157858 -140500 -45908 -101932 -121674
7632 -121674 -71997 -85712 -43828 -10215 -79216 57629 -15906 -35826 71713 -63782 -195571
7621 -195571 -186007 -129668 -81411 8090 155501 141551 95378 -65313 -130765 -88785 -57669
7610 -57669 -85830 -180305 -138770 -86407 -63766 -14897 -11733 -61825 -84233 -75509 19605 80550
7598 80550 -13894 32269 68036 61242 11117 -142899 -194306 -121607 -29338 58148 59427 -6167
7586 -6167 84869 232185 177436 130688 72266 128729 80370 123201 164373 138255 44151 37914
7574 37914 86590 156595 263589 259966 113535 98606 43083 486 -36699 65094 57938 -46425
7562 -46425 -78959 -156137 -177581 -209077 -239712 -269917 -193605 -71052 -121487 -86255 -35482 -15583
7550 -15583 -39146 -126088 -137432 -57450 21298 68096 9655 -35488 -127093 -204548 -68394 -79666
7538 -79666 -151459 -138762 -61815 129795 94238 25300 -87853 -130277 -130169 -106365 -128022 -144616
7526 -144616 -63771 102149 185547 84284 -2758 -129741 -70376 76176 206885 222821 202888
7515 202888 220594 237087 230420 172092 214990 199047 110644 40858 -2784 11775 68349 191617
7503 191617 221329 169892 119398 80298 -22550 -109333 -203467 -89843 -43047 -86126 -104115
7492 -104115 -164538 -190007 -58873 61147 181598 113677 -35962 -164120 -218144 -184710 -197599
7481 -197599 -198022 -110087 2425 64139 55173 57159 -18287 -2529 -32576 138009 231188 117319
7469 117319 17999 -63945 -65741 -119170 -76394 59685 67501 52628 104126 46926 -26465 -67549
7457 -67549 -34041 -27053 -21872 3738 97285 203781 177226 69045 -161173 -263382 -205811
7446 -205811 -84648 -60645 -90817 -32296 -7575 -88172 -35783 102519 183734 169695 28993
7435 28993 -70823 -95429 -111742 -212227 -234157 -264797 -223792 -162192 27844 70536 -62528
7424 -62528 -32150 40087 23678 -60305 -15310 -17791 -71911 -90647 30912 127683 98520 68772
7412 68772 92846 123218 117260 24178 -77195 -122524 -156497 -116452 -58436 61844 110746 53690
7400 53690 10828 -197 -103793 -53234 20760 36317 -74555 -125258 -33842 -42043 -84238 -88478
7388 -88478 -39098 -36057 -76809 -38332 -69865 -116558 -192932 -249171 -230405 -287459 -377628 -380082
7376 -380082 -231258 -151071 -170309 -75135 -20985 -96174 -77161 48558 -5691 -77535 -50841
7365 -50841 62465 -30360 -90369 -10977 12193 22945 169786 195702 164229 152755 129770
7354 129770 29543 -65708 -28928 121441 48900 -33429 18304 -64874 -87597 -16103 -34504
7343 -34504 -115388 -189591 -203080 -105525 -158507 -230979 -221155 -161637 -33966 -56526 -171785 -209922
7331 -209922 -175142 -71854 -18356 29590 36431 98904 80277 56263 104808 77766 -32367
7320 -32367 -61169 43160 -11469 -35517 -9655 -2317 -64452 -129467 -143564 -173373 -108754 -116453
7308 -116453 -230453 -287739 -240655 -213532 -130860 -56822 -4213 -138504 -130068 -66698 -75068 -79589
7296 -79589 7331 25351 5266 -9517 171738 233374 198765 105893 23910 44903 124296 161886
7284 161886 219981 183507 94373 96825 15184 51021 -6136 57284 66988 123481 112243 92827
7272 92827 84783 -71972 -128846 -155102 -136870 -7159 104046 -38209 -124574 -119752 -30859
7261 -30859 31679 34211 65266 89863 39379 656 -13814 -135491 -101147 -100383 -107745 -81359
7249 -81359 -131372 -296628 -271282 -147332 -17091 15243 69995 59658 92748 -39191 -110688
7238 -110688 -137743 -56494 -970 -53250 -84428 93327 114053 115602 192387 131445 -17330
7227 -17330 -33451 -36643 -170469 -81263 -57078 -141294 -210304 -180050 -167562 -79209 50988 -6612
7215 -6612 -51134 -30659 64589 -34798 -118431 -112667 -80382 -98269 -29457 31531 103107 184678
7203 184678 165947 141392 152221 -59086 -67832 -46717 -134067 -237611 -233283 -117365 -103433
7192 -103433 -117834 -98328 -117327 -82286 -189336 -284622 -260134 -112588 -106925 -70461 16824
7181 16824 -11026 -36436 28001 27274 5709 60017 53875 -58902 -68504 -62534 -49767 -9460 88965
7168 88965 86245 195711 263647 132106 -18791 -65721 -77298 -147301 -91154 -26368 33136
7157 33136 109649 106527 -9491 -168107 -224998 -92759 -24919 11946 81871 22754 61639
7146 61639 67626 83307 36581 4637 -26049 -74573 -19600 26461 -75022 -152604 -157308 -37325
7134 -37325 -49961 -95501 -147929 -155061 -184456 -103152 -74657 -33976 -17763 -61362 -72838 -12951
7122 -12951 40122 18548 -102860 -85219 -9475 -115605 -164934 -29477 39051 76444 54696
7111 54696 -1357 -33728 -64611 12019 66400 -1405 -51095 -49660 30837 194232 202461 67820
7099 67820 -2092 82817 128705 92780 21198 -45093 -29650 42350 4472 34044 11422 -34076
7087 -34076 45277 121042 85035 51312 -59 -33149 -89493 -102385 -23947 27276 -15259 -82994
7075 -82994 -62807 -53368 -64458 -36278 -5312 -47550 47164 46046 -20349 -28967 -19977 -56802 -73953
7062 -73953 -19722 41796 14823 -57513 -38957 54518 117781 69551 120496 205897 71603 -30679
7050 -30679 -113767 -190433 -236702 -131488 42956 91468 152893 58902 -25271 -36511 31133
7039 31133 120979 67721 -40168 -114093 -111002 -133887 -125792 -31787 10914 1630 -134010 -218638
7027 -218638 -91272 7095 -116672 -126718 -53773 -40532 -31780 -22276 -21617 -70424 -60743 -382
7015 -382 -110782 -242406 -266342 -298918 -212491 -83421 141455 215074 275512 200695 80981
7004 80981 124674 118076 100627 23590 -47716 -65592 -42472 10022 202271 267050 315515 275973
6992 275973 138887 200311 183536 122341 -54743 -25886 -29957 -87129 -171881 -187243 -153975
6981 -153975 -67900 -4387 31539 94926 249486 202483 92132 31048 75610 126976 51797
6970 51797 -42538 -101884 10402 85931 62428 -15673 -60300 981 -47523 79105 95903
6959 95903 203757 176761 120984 32648 81090 58780 57923 84622 26325 113504 120287 100700
6947 100700 88219 -24565 41708 95875 123352 35552 32057 -12235 -85388 -56646 -84002 -154954
6935 -154954 -73408 -32391 -62281 37222 -37187 -68365 -126911 -94473 -91784 -58891 11833 44092
6923 44092 31612 -14499 6518 -28611 -34168 50255 45386 -1214 -34746 -47297 33161 119944
6911 119944 58024 48457 60225 55093 144220 51997 -171362 -158301 -146643 -200038 -138905 -17490
6899 -17490 75412 75938 105690 127640 154923 96281 -26433 -53809 -98343 -118246 -68098 -63336
6887 -63336 -111797 -102128 -95512 -49883 43243 60028 12175 -54777 -10744 44026 198513 200888
6875 200888 90191 7737 4461 47686 118648 161102 97988 -30931 -135592 -98523 87840
6864 87840 175934 87518 156343 177817 114786 82905 -17890 -105745 -64656 -142058 -160006 -171565
6852 -171565 -152906 62112 145139 145444 218420 208302 100584 26822 -31042 -40354 -98744 -59282
6840 -59282 -41572 -16710 51635 55552 44154 67875 27838 57359 126910 99927 123786 155933
6828 155933 78907 24093 109036 -1556 -116332 -40950 -52187 -9879 112195 214686 172138
6817 172138 124553 118966 172372 149842 116149 142496 -22731 -118094 -137019 -148346 -26378
6806 -26378 35839 -5140 71118 69696 120828 190514 127196 16610 -51333 -70684 -65686 -166425
6794 -166425 -101352 -166764 -211265 -175395 -76410 47770 1245 -92487 -73021 6545 -15189
6783 -15189 -27341 80637 157214 232579 210647 116632 52218 13908 -36432 -94358 -99559 4420
6771 4420 34555 -145537 -212396 -72397 57975 85340 99393 82274 56048 101242 102897 160994
6759 160994 145440 -4884 -93370 -49172 -36675 -24305 4690 -38002 -46555 -3991 5832 36604
6747 36604 51619 -32579 -129411 5015 75279 137832 143131 107007 129699 165959 197298 77170
6735 77170 57108 99559 143560 183497 45656 -41345 23714 26016 56082 836 -9508 -58343
6723 -58343 -36122 88505 2213 -74208 -99702 -190118 -155880 -28575 -52586 -134045 -203246
6712 -203246 -38783 218934 268364 134234 131336 107716 105444 105077 40604 32870 104747 158244
6700 158244 211380 219195 92737 69901 54845 112400 -67288 -146599 -219624 -230949 -126848
6689 -126848 -139823 -134634 -126104 -173903 -200112 -169965 -91589 -56492 -72845 -76335 -15132 -81919
6677 -81919 -83712 -152111 -124677 -211496 -215147 -175798 -192532 -168669 -162386 -200321 -170522 577
6665 577 57985 33163 69056 55873 -20255 -22636 -135622 -168416 -67579 -71711 93212 257173
6653 257173 188463 126729 112741 60742 100776 137805 228202 140261 -26815 -117382 -128262
6642 -128262 -60513 69671 4285 -84636 -93377 -6826 -2404 -29531 -25325 -135627 -127707 -63750
6630 -63750 72820 190458 188406 167388 89376 -16487 -135906 -211872 -183469 -116102 -136028
6619 -136028 -121949 -144375 -24588 75407 88495 28648 -93560 -157769 -243845 -103697 -91927
6608 -91927 -140628 -161007 -196385 -120781 -57977 39261 13450 -34185 41177 41124 73094 10688
6596 10688 -24966 -81880 -97279 -65649 -34036 -170865 -135910 -58031 -12878 -90321 -90038 -15845
6584 -15845 -24072 -6142 -1126 -47054 -79099 -106628 -205261 -128626 -188688 -173971 -48712 23756
6572 23756 82590 79256 94478 72943 74716 125934 122663 157069 99762 145271 9910 -19248
6560 -19248 -64766 -18674 -46548 -11288 36107 -12536 -143785 -258117 -318621 -278849 -180851
6549 -180851 -182612 -161784 -157836 -32491 3503 -36310 -58600 -118444 -106843 33387 68306 248302
6537 248302 288645 173450 101548 -17388 60153 166173 195997 61927 49067 33219 85270
6526 85270 107242 95052 -25889 -55000 -20209 28012 27742 53638 32463 -33241 -91212 25155
6514 25155 42879 -31050 -50801 -116690 -14694 55947 62704 51779 50760 24376 -69592 42455
6502 42455 116079 15695 -2237 -53530 11309 46806 210537 115888 74727 35984 -28548
6491 -28548 22293 -47969 -161628 -161458 -110285 -61366 3312 61320 29798 -33336 52652 7206
6479 7206 -63858 -21515 33552 128013 72262 34655 26133 -59002 -92941 67480 84258 151149
6467 151149 160699 87017 85075 62182 28367 891 -44870 -129232 -167250 -150075 -115691 -110141
6455 -110141 -116181 -100863 -56849 -134644 -108467 61929 163240 28082 56614 121398 70872
6444 70872 73169 146833 23405 -85861 -59973 -11866 42430 -36894 -162834 -186104 -184896 -186031
6432 -186031 -87484 -122693 -155207 -138146 -174872 -176338 -261735 -253859 -328943 -259920 -139865 -112019
6420 -112019 -59649 -14381 4319 54310 18168 5719 17232 -77007 -27854 6564 -75420 62562
6408 62562 71903 -56413 -83698 38781 -10880 -30968 -54480 -33716 10091 18575 -95199 -93519
6396 -93519 11138 34057 -9454 -114683 -110441 80048 18974 -138821 -65081 51757 101422
6385 101422 14146 -82207 -97325 -58659 -4990 -24370 -19404 4008 -18241 -36400 -77687 -43483
6373 -43483 -21536 45181 30213 114778 106292 166162 48784 54611 103169 44710 98339 -5202
6361 -5202 -67157 -138829 -141197 -84943 -126345 -74090 104485 157243 223295 143105 250621 242581
6349 242581 158668 50245 15571 -22474 -51323 -63838 -55953 -88611 -81156 -151939 -249558 -262001
6337 -262001 -285830 -326963 -226038 -256470 -270062 -131844 -119308 -117067 -56444 -117633 -207448
6326 -207448 -256648 -213015 -250562 -281351 -80568 -25649 -42392 26043 -19011 -36356 142329
6315 142329 69620 95518 137003 72686 134850 205057 228701 209450 174351 93036 -50028
6304 -50028 -72794 -88059 -94546 -8393 -21647 10767 53508 101831 84501 77181 -38841 -39281
6292 -39281 -34087 -151229 -76978 -41851 32173 2497 -67818 -176760 -201853 -37407 44149
6281 44149 -114659 -107943 -5217 63670 74911 -44764 -98483 -202020 -239875 -274262 -249452
6270 -249452 -143432 -130818 -76477 -23867 49728 42819 90953 -9755 -69953 165393 255667
6259 255667 155162 76269 38117 29997 -27784 -25376 68085 46490 59067 105899 151253 255767
6247 255767 361705 270763 201895 122652 24066 19832 16378 53490 64409 157287 136457 95065
6235 95065 20627 420 52132 30257 14603 -47194 -71812 -121986 -213342 -109942 -101919 -158101
6223 -158101 -146023 -223205 -209151 -102826 -28803 28086 93710 17199 30478 91265 -2905
6212 -2905 -19438 -4388 -2282 -136220 -175047 -196883 -217358 -242392 -48399 -30185 -52651 75589
6200 75589 63766 -68971 -57261 -90752 -161560 -118725 -49878 -239065 -319490 -195408 -160498
6189 -160498 -79916 -72948 -114209 -66128 62870 64651 -57173 -83727 -76892 -102435 -101175 -102427
6177 -102427 -121702 -96089 -60760 79258 145541 129302 164795 117385 118617 63628 98836 160337
6165 160337 210216 170619 192794 109285 -129003 -157224 -111365 -110838 -90324 -79835 -139188 -171310
6153 -171310 -75267 10729 -88053 -120109 -111459 -74365 59535 173464 139679 104059 35280
6142 35280 -54813 -118970 -201606 -223035 -82039 9702 19379 14712 -22322 -177798 -177797 -102136 64402
6129 64402 69786 45218 127749 100849 -27815 -57519 141940 190559 155516 54698 -25578
6118 -25578 -25458 -3243 -13992 8656 -44884 -106571 -17998 -23673 -71990 -39938 -32236 3343 -64613
6105 -64613 -118990 -153883 -152948 -43848 67367 152725 209355 127080 66035 -91824 -54127 -49306
6093 -49306 21882 11373 4008 78533 38230 10031 -43080 -133118 -22281 41364 40435 74569
6081 74569 56313 14921 33279 -53002 -82104 -84894 49569 76322 -51587 -100336 -62962 -101263
6069 -101263 -178850 -159347 -13325 95613 152385 185958 78964 17884 -7412 -121909 -71090
6058 -71090 4408 98076 143947 151838 125084 45653 46350 32902 56821 158779 155589 90418
6046 90418 106594 98401 67218 -6388 91532 168672 68461 1219 -113939 -88108 -65082 -91660
6034 -91660 -90488 -56297 6020 104900 148647 172709 177507 96140 57019 58181 25692 27893 94947
6021 94947 141674 116752 -32725 -194305 -171677 -162238 -57517 -43403 -42354 -14613 -83533 -27085
6009 -27085 23111 71588 53127 -24265 37940 47210 -8358 -51455 36756 21209 25950 37643
5997 37643 116914 175301 99308 65782 34522 141955 89489 121228 43665 33366 67227 -15110
5985 -15110 -56799 23620 107560 49421 -13507 81456 16708 -48359 -16591 -66495 -72719 -50226
5973 -50226 23818 28321 24820 -101899 -149304 -122040 -76104 -144189 -215678 -237763 -149229 -60862
5961 -60862 15440 -36806 3864 -26287 -42738 -31979 -11022 65173 141859 109302 120145 53383
5949 53383 -133356 -229948 -134096 -113943 -125989 -62213 -121499 -65364 -28937 -34543 -9279 -48268
5937 -48268 -66381 -81247 -24578 27089 56846 -47870 -79706 -120863 -173241 -207149 -89680
5926 -89680 11701 -114766 -160311 -67661 130354 220102 226061 112443 16062 -57863 -84233
5915 -84233 41940 45170 -18533 -60351 -62690 -70325 -138828 -137827 -131326 -149946 -118211 -84392 -92484
5902 -92484 -143849 -178571 -75889 33383 -15260 -43124 -110222 -182330 -248878 -215531 -184554
5891 -184554 -118770 -70932 -28936 -21413 -111628 -145335 -95678 -39182 -130090 -179670 -157407 -98700
5879 -98700 -186450 -230404 -171241 -121356 -130232 -154114 -47576 -53215 -76936 -63670 -29328 -84168
5867 -84168 -144323 9598 73932 -3676 -93997 -135897 -254871 -188216 -81572 -136412 -170938
5856 -170938 -92114 -78231 -105268 -185463 -214075 -104318 25085 59214 -12098 -59949 21365
5845 21365 -13405 -117451 -149743 -63763 -39283 -40876 18670 96412 29982 -2521 92686 -5368
5833 -5368 -111610 -113161 4174 -19547 -21360 -3563 62104 112327 78150 42039 84134 144696
5821 144696 104687 -43446 -81186 21107 24150 19441 79309 55104 88060 37363 -9584 81195
5809 81195 108422 -13599 -25265 -21686 24185 -32679 -23224 6720 -6032 -38147 -33553 -61090
5797 -61090 -76136 -61950 -67983 -36834 -89785 -169625 -82532 29830 43652 -30619 -16261 17413
5785 17413 -78847 -88062 -61614 -63342 32594 129963 93760 -3936 72230 57487 -43109 -123191
5773 -123191 -47060 -30019 -95299 -154781 -204545 -100986 -7076 -9680 -37026 -64440 -100688 -115981
5761 -115981 -38925 -9254 30658 16693 -6150 -41315 -37685 -19451 -15082 -40825 -30159 -42809
5749 -42809 -36956 -103420 1388 44657 21579 -24622 -56967 71824 124901 170975 33883
5738 33883 -126725 -94918 18355 -35849 -24936 91571 153135 138422 29535 -78784 -14674
5727 -14674 156704 203525 110107 62491 61857 -918 26273 50260 -109084 -121426 -65119 -22801
5715 -22801 -79536 4896 157548 53943 41031 168190 117466 -32963 525 -79802 -165844
5704 -165844 -132345 -73436 -86479 -33891 -272 -61347 -66244 132950 249285 208947 158255
5693 158255 196728 127069 15262 17046 18824 -38205 -76559 -152162 -130327 -152104 -184985 -212721
5681 -212721 -197108 -145793 -101166 -125915 -267138 -215933 -61464 36408 27941 31461 118129 41752
5669 41752 29748 -53858 -72759 35017 31563 -50206 36368 15541 -35494 75465 201172
5658 201172 148879 27933 7357 65547 97734 176296 205018 93502 60149 33310 32091
5647 32091 28162 72156 118241 116179 97713 82743 2375 12817 114795 -15776 -125937 -45329
5635 -45329 34739 4206 -58003 -80383 -219441 -254809 -122247 -50323 45552 94224 97683 3369
5623 3369 -43359 7070 -18929 -45565 -95549 -123397 -18087 90430 48750 165648 213361
5612 213361 126360 111187 201571 132297 50318 22007 -47621 35752 110764 38394 46402 123371
5600 123371 122815 -25057 -63100 -27865 41994 81868 102721 65783 43300 59214 6769 59360
5588 59360 47623 -13093 -68791 -70632 -48242 -58307 -148527 -186286 -228052 -88873 93281 104251
5576 104251 169025 148902 69900 -40934 -56311 -31395 16956 -16505 -34478 -55301 -67271
5565 -67271 -66937 -114363 -156269 -199418 -149271 -77492 -32591 -60934 -9666 -66011 -200389 -186051
5553 -186051 -102923 -36554 59865 187821 142289 79090 67332 89883 161045 120488 21258
5542 21258 -118580 -80756 -122391 -134717 -177559 -284479 -202908 -76392 20137 164773 77813
5531 77813 -29474 -110866 -151224 -112451 -52840 -11817 -48929 -78237 -85637 -83740 -127318 -175522
5519 -175522 -105024 -8647 -28324 -61681 -152414 -108687 -3342 6182 109276 43610 -77186
5508 -77186 -82537 -54455 -48677 -91258 -89114 -87942 -106019 -198407 -319712 -203030 -59626 -114516
5496 -114516 -10840 -4368 -201691 -227313 -109820 46860 41232 -90614 -174857 -232362 -254093
5485 -254093 -165913 -112872 -38423 -5878 -49891 -81583 18769 115270 115174 127628 157271 107783
5473 107783 -99585 -214938 -218302 -136891 -181862 -69458 29953 40934 -74785 -132384 -85524
5462 -85524 -57949 -93237 -71602 -29287 -178749 -255498 -240066 -220380 -149371 -133281 -136133 -86594
5450 -86594 -70310 27433 76906 -24462 -57121 -30756 -32903 -87747 -67118 -8575 -26361 -89606
5438 -89606 -70514 -37514 -55905 -57120 -23574 -97252 -103351 -154224 -174888 -95496 -25510 133838
5426 133838 176734 131989 8581 -60438 -76185 -2342 -31816 -114799 -149359 -45733 -65852
5415 -65852 74274 200420 161675 96517 -23353 41041 109875 149776 -4836 -60023 -36929
5404 -36929 -91075 -105339 -77130 -46570 -125413 -26247 -1476 67097 148006 -34168 -136784
5393 -136784 -98722 -168242 -96860 -77022 -106074 -21499 54604 -14597 -5110 14159 -13331 -52078
5381 -52078 372 36984 67720 81823 69870 21237 88876 38803 108388 86391 79449 58558
5369 58558 79130 38341 107857 210914 138511 -23769 -86589 -195958 -149160 -89898 -74645
5358 -74645 -117641 -76635 -38307 -81916 -45802 29444 102914 68585 32497 -7099 -166793 -127282
5346 -127282 -67490 -44161 -127682 -158944 -178086 -237644 -241644 -203306 27378 110549 -3108
5335 -3108 -118648 -98211 -46554 -60250 -35948 91808 102734 -89092 -162626 -129447 -70582
5324 -70582 -70425 -151042 -115521 -139840 -154297 -36802 70649 92898 120731 209659 179838 124238
5312 124238 -60074 -58733 -74994 -76874 -78054 -54410 -178756 -247471 -254673 -156243 -41533 -127587
5300 -127587 -244159 -379096 -282569 -215578 -206460 -192424 -106440 -121616 -141898 -79945 -109047
5289 -109047 -94257 42784 87833 -78328 -99257 -113055 -123154 -159821 -119783 14036 18063
5278 18063 -47041 -58107 -84874 -89904 15463 28250 -29473 -24565 -59991 5472 45253 -25258
5266 -25258 -87865 -45126 -33909 -36307 -103272 -47803 -22922 -107154 57012 71806 4086 38726
5254 38726 111262 212852 231532 181272 174839 138901 105392 -46302 -19395 41192 5398 -33984
5242 -33984 -71699 -16867 38986 -25659 16445 85141 163790 53043 -58008 -60652 -33924 92726
5230 92726 144339 124023 114708 128403 62434 -36610 -60731 -1548 64067 -45347 -103358 48440
5218 48440 4363 -79753 -19240 -3132 -3382 54385 85454 128019 190204 183897 80775 -31439
5206 -31439 -74987 -56460 -77311 -165988 -182448 -67236 -95287 -143227 -170106 -82121 -96603 -196907
5194 -196907 -232445 -179575 -39194 116709 112914 49084 -14422 -144924 -140110 -159406 -100119
5183 -100119 -170509 -71141 13346 2325 -56399 -198114 -208832 -136297 -93875 -51731 -76804
5172 -76804 -97075 -70071 -342 -120900 -186044 -181199 -73871 -67291 -55119 83067 130831 146318
5160 146318 -3782 -142960 -90444 -3533 -35528 -87647 -38255 22839 -83383 -106848 -64533
5149 -64533 34749 37835 -7303 -67076 -92400 -136072 -104342 -42711 -45708 -57748 34315 -6143
5137 -6143 -3907 721 -65110 -85318 3989 140605 188219 226765 120022 60073 110492 274438
5125 274438 275617 163716 -32069 -82397 -104431 -125166 -18868 53178 19090 41405 25563
5114 25563 29341 -41540 -7399 30379 42031 4599 57952 193263 319353 186681 7154
5103 7154 -137748 -171746 -195644 -158711 -22753 149040 126445 65557 115884 205016 244289
5092 244289 238902 249490 149586 14491 102815 134894 115377 231445 256548 237346 155447
5081 155447 76713 143324 8788 -83496 -48862 51082 89884 28195 31598 67389 69936 48712
5069 48712 31304 -40871 13939 51165 -73636 -45558 -75661 -87994 -96245 -2740 70029 100934
5057 100934 -4055 -7504 -1592 38339 -24960 12836 69074 7216 15181 -31030 -62537 -30610
5045 -30610 -106961 -195508 -139938 -82262 -62550 -118704 -126610 -30547 -22839 -37507 24646 140166
5033 140166 181381 127598 83507 86445 101263 -69432 -135784 -56865 -27177 100392 103870 11568
5021 11568 -22331 -172097 -206645 -200852 -172679 71307 6303 -23234 -142901 -114866 -55959
5010 -55959 19058 43789 -19173 -45039 66974 173449 76628 -54380 -76689 -49684 -89260
4999 -89260 -79661 -39447 13163 -73562 -107659 -85545 -53851 -75485 -85397 -109489 -5397 59490
4987 59490 18570 -42246 38405 25389 35847 99834 35039 -84340 -153213 -210163 -181623 -173531
4975 -173531 38041 88925 30061 -89380 -892 71548 127377 151348 61380 12394 30048
4964 30048 -37562 -80216 -176924 -102413 -85166 -28238 -46199 38736 89796 44431 32469 21063
4952 21063 72264 -17321 -25033 65272 144285 119066 44909 100391 154887 163033 135266 -19140
4940 -19140 -77383 2731 36004 -5834 -5761 -21607 -83682 -124 -8873 -41436 -62470 -37868 -77221
4927 -77221 -20910 80037 -12832 48337 99956 80039 199561 266788 228885 16572 -47835
4916 -47835 -112595 -131155 -109437 -64842 -43141 -76376 52227 239779 253366 172361 31680
4905 31680 -17143 -67393 73736 120077 79600 -37745 128482 152897 33467 -8153 -102991
4894 -102991 -143362 -57976 -81623 39880 72849 48755 100941 75788 39557 -63595 -68299
4883 -68299 28395 -4644 -57835 -49066 4259 182817 319298 314260 272619 113319 797
4872 797 58567 190843 257123 135059 120176 212122 207433 157493 118149 -6218 -72897 -40340
4860 -40340 -40473 -87346 -74345 -39907 -27748 86786 77031 35402 -22281 -35358 -46001 3573
4848 3573 -14857 31347 30138 -10802 91078 245753 258084 169463 85678 173869 112832 -37325
4836 -37325 -27841 -69439 -1244 -49157 -113607 -103568 -75661 77914 66285 -10565 -92466 -172784
4824 -172784 28292 109735 23096 -67294 -185008 -205793 -152928 -24663 77504 21782 -95814
4813 -95814 -194076 -194763 -44704 -35854 61543 68575 16893 -34166 -75892 60620 142466 145998
4801 145998 -26561 -172785 -297995 -282230 -176090 -97413 -191227 -150807 -111780 -83489 -141377
4790 -141377 -136230 -26372 -47524 -21480 124986 105342 -20150 -23717 79036 70761 87370
4779 87370 209284 261019 282723 184664 112874 2604 -100628 -62873 9097 -15791 -217530
4768 -217530 -367975 -245319 -129926 -111326 -169285 -23616 64243 57979 -16851 -36910 -126411
4757 -126411 -267278 -98034 -13088 -28622 103766 29805 -77798 -50836 -42066 -85902 -137158
4746 -137158 -55815 51629 33324 -37751 -43810 102654 288965 242781 113846 -40818 -103801
4735 -103801 -68417 -1063 -92113 -94395 -78683 -193307 -142671 -105571 -7839 -41533 -200695
4724 -200695 -206004 4701 138152 88735 -10191 61552 110766 97707 9438 -27382 -56404
4713 -56404 -84267 -112622 -46994 -9458 -32906 -25775 -11745 13005 -58371 34016 66574 54747
4701 54747 -20370 172681 100338 91131 88586 60834 -44594 -78940 30133 95278 -1569 38187
4689 38187 -21405 4190 109274 -45912 -220461 -276647 -179216 -47879 39003 13161 -127704
4678 -127704 -97104 -4874 36239 -76307 -58780 -144241 -133280 24555 27282 -15146 -14097 -60271
4666 -60271 -73444 -29817 100403 262527 204821 97128 -8792 -84123 -64249 -81839 -95375
4655 -95375 -100746 -86500 -140230 -91210 -16980 -118053 -264811 -293979 -305272 -182999 -78033
4644 -78033 -98217 -84839 -25780 -71513 -32931 18802 26325 -36875 -22346 -107536 -71987 -84651
4632 -84651 -64075 -85992 -108864 -70559 73081 140477 -29713 -125460 -73575 -73289 -21321 22238
4620 22238 1736 88648 128339 136211 93545 26731 -118388 -126307 -95948 -113681 -126418 -73434
4608 -73434 -85870 -13286 14778 -17833 -23758 -62151 -119106 -199139 -144400 2683 -137281 -98620
4596 -98620 -5688 89698 181926 100848 67085 94798 78461 144467 141735 -64279 -207699 -249168
4584 -249168 -190226 1505 91316 84468 107939 -24229 -98419 -119383 -134925 -81375 -112519
4573 -112519 -147522 -167665 -25580 26789 -41581 -107538 -75364 27140 110365 47434 -6714
4562 -6714 -20450 -84293 -117681 -105844 -36950 -118428 -146668 -64930 -59135 93007 64184 -14853
4550 -14853 54350 120381 53398 -133842 -64700 -67034 -100915 -124277 37805 101963 35551 -57007
4538 -57007 -59533 -96281 -245291 -229417 -98013 4857 3103 -13877 -55116 -88485 -63423 -46210
4526 -46210 35097 93520 40580 -129753 -266752 -250665 -159980 -58238 -83239 -63294 -54270
4515 -54270 -22832 -53891 -25584 50350 -12375 55501 -29870 -85411 -179120 -142829 -71195 -94098
4503 -94098 -81714 -52539 5617 -29106 -83958 -2221 13181 -34694 -132198 -155474 -109487 -134933
4491 -134933 -107555 -15700 -73382 -67304 -51427 -129505 -177523 -136769 -166276 -180286 -144092 -38393
4479 -38393 -11070 36336 69536 10946 40791 -84650 -207788 -161530 -128020 -18147 18047
4468 18047 -88229 -169490 -141044 -82142 -5998 44890 29040 -106531 -54207 -24229 7123
4457 7123 23637 -22283 -16073 45512 112433 67311 -76608 -25938 -47832 -106079 -72137 -100408
4445 -100408 -134536 -142471 -138950 -105706 -46089 8586 84460 169394 104336 -3591 -136364 -102311
4433 -102311 -176040 -173696 -149327 -151592 -145284 -111355 -101959 -38308 320 -95657 -224816 -221136
4421 -221136 -209965 -188767 -82455 38464 -120189 -138827 -100887 27412 85986 14726 89846
4410 89846 173208 68131 -98207 -184379 -159807 -235800 -127905 74447 180251 158182 119799
4399 119799 -4484 -58344 14984 -59512 -204433 -213163 -287825 -154800 -77555 -68240 -102129
4388 -102129 -64313 -80733 -61020 55080 -42679 -122040 -95795 -195035 -197099 -246370 -158654 -81355
4376 -81355 -3003 13168 -95608 -99327 -56283 -11620 51605 45332 15349 41332 -11031 -27409
4364 -27409 -1479 62902 101580 108660 5217 -123747 -69746 -22116 -93342 16097 142461
4353 142461 137394 82152 43375 92102 75234 62017 163340 82817 -39266 -54513 10235
4342 10235 -8816 -108466 26025 214554 173085 120348 98328 76840 30856 -50955 -35775
4331 -35775 -63695 -99258 -111536 -39005 35748 -81974 -113533 -164070 -93805 -33741 -34466 -68036
4319 -68036 8357 45055 37142 12732 70378 178857 144261 81692 85670 46464 92060 82127
4307 82127 31287 19299 -53061 -73033 -175289 -218674 -321743 -244479 -123513 25506 50789
4296 50789 4838 -9338 9371 87047 100569 167257 135602 157154 132113 33258 -29870 53287
4284 53287 -12258 -53606 -8752 17569 -44873 -14546 35328 -41141 -58511 -99774 -161446 -169566
4272 -169566 -165411 -155018 14955 28023 58003 69176 69147 -18284 -29799 81118 84441 130757
4260 130757 115212 160482 131031 115865 106477 33298 -165977 -200298 -144656 -95720 64097
4249 64097 85130 9402 -14437 -42572 -60996 -41007 -37925 -45989 -78633 -135140 -184142 -214544
4237 -214544 -285082 -302620 -159583 -92470 -4696 -42602 16803 9139 -100409 -209057 -191344
4226 -191344 -74666 -104251 -44819 47462 -28728 61139 150838 195926 203348 95230 12883
4215 12883 57347 141517 166016 192727 216963 153295 -31430 -134311 -138047 -188430 -150707 -226139
4203 -226139 -225047 -197355 -191715 -201623 -65628 -27753 -81391 -112850 -137622 -162361 -193765 -313813
4191 -313813 -233909 -94624 -23315 97219 110199 133197 188046 83994 37059 -3252 25162
4180 25162 22451 66060 51120 36967 44984 -19172 -37110 -72536 -111086 9002 19692 35578
4168 35578 65691 18100 29861 112204 154812 113145 215086 230926 261528 236086 181981 11922
4156 11922 -157802 -144655 28108 129691 143169 32557 -86588 -19311 -41796 -136723 -69252
4145 -69252 29981 138111 146208 68079 122551 168842 110339 -7232 -41795 -26405 -29163 -30384
4133 -30384 -103409 -68403 -2124 -28152 -61475 -37969 64779 82958 27697 87444 107291 35687
4121 35687 57877 83524 133378 321359 231921 66117 -76800 -190808 -129338 -128311 -91035
4110 -91035 -67737 -169770 -288143 -319057 -209192 -170672 -214694 -188415 -89153 -36648 60690
4099 60690 115500 -8393 -264237 -237656 -6836 101027 55336 -62270 -89137 -52204 -60599
4088 -60599 -151678 -259163 -283030 -134402 -2090 170732 336897 300285 173684 170669 148565
4077 148565 2812 -145012 -247117 -217707 -82985 -11839 19077 38808 201194 179346 5768
4066 5768 -143773 -32719 115557 123719 69280 -6123 -71475 -86151 -84155 -130555 -166382 -157726
4054 -157726 -129388 -18217 -4514 5427 243 -37549 -56035 -79307 -83571 -70667 -47600 -34155
4042 -34155 -20023 35850 -83978 -29532 -10623 -136595 -190061 -134203 -185725 -142963 -101704
4031 -101704 -77283 53697 117587 65310 -92883 -48760 -2384 -26621 36728 6372 5407 -35868
4019 -35868 48051 -5527 -20313 -57342 -10588 27424 106736 102756 106539 146884 17438 -32124
4007 -32124 -11964 93506 70679 62821 171524 210447 173324 186016 129250 22896 81667
3996 81667 119215 41974 71516 137225 -31265 -102176 -138514 -115875 -73263 -167026 -215404 -105558
3984 -105558 19857 -84115 -95679 -92407 -191785 -216222 -186960 -145684 -38637 -9556 10885
3973 10885 -24631 -71274 -26741 59481 -21877 -48620 -46828 37021 93143 34721 11602 82625
3961 82625 -2414 88006 121659 158367 169581 146977 67240 104361 38903 71084 83994 68992
3949 68992 49365 164295 113990 -36665 -191579 -61877 35813 51585 120699 9509 28595
3938 28595 25077 14707 -23540 54539 39078 -9772 -49991 -10772 -22104 126476 159960 47608
3926 47608 -74192 -26759 -71928 -129853 -119449 -166032 -106012 22456 74422 86801 75504
3915 75504 -89908 -56107 31233 -17371 14255 53365 -56133 1479 660 -34946 -25182 18426
3903 18426 -23172 -38953 -8004 -19711 -12320 -20004 31015 -56020 -61435 9356 -55758 -15661
3891 -15661 68533 11136 -43502 -7381 -65687 -11079 52400 30942 43724 3992 -62153 -87118
3879 -87118 -56740 -101275 -142594 -25981 95986 -56439 -206976 -230542 -203982 -174072 -96895
3868 -96895 -31398 8948 59381 61219 -19663 -131908 -169023 -129606 -64777 272 -32021 13110
3856 13110 -32903 -56027 -44416 -802 1054 -39561 -62693 -47681 60509 26654 -106241 -102202
3844 -102202 -70402 -34921 -28090 -112257 -67431 8634 -23820 10475 142407 18658 -69857
3833 -69857 -112010 -122998 -195985 -156036 -96659 -105108 -202869 -194214 -140488 -126012 -125192 -169342 -207431
3820 -207431 -196249 -8766 153957 182805 157408 49689 35587 -52327 -56265 15009 48515
3809 48515 135297 205396 206932 209556 191832 150951 6229 -12135 -118968 -214666 -94722 -84679
3797 -84679 -14701 -23186 56310 16060 -14496 37303 60489 19769 -15531 -58474 -112194 -76869
3785 -76869 -67173 -60493 -85322 -3642 112807 20234 -51328 -37707 2522 34709 16744 51833
3773 51833 -89282 -115181 -70077 -434 107848 162104 143208 133538 33193 2949 -43664
3762 -43664 -99171 -66395 -77497 -70300 -28644 35242 -114505 -96989 -97712 -3473 8328 17610
3750 17610 -113062 -105012 -105625 -76383 -65236 -32858 93348 114169 -2930 -4617 149970 173375
3738 173375 57912 -40027 -112668 -136049 -85583 -154548 -192935 -119291 -57840 -16774 -23213 -19695
3726 -19695 17715 21283 38137 -26119 19549 6614 -3700 4453 -7109 22095 -62296 -157421
3714 -157421 -172297 -134098 -113552 -203399 -166354 -77240 -42675 -20296 -103795 -182014 -236572 -189261
3702 -189261 -185245 -185816 -55348 -28509 39029 55819 40723 72767 -42287 -112835 -40823 61740
3690 61740 148166 168066 45092 -66127 -85791 -50102 -127913 -65140 98168 102000 74151
3679 74151 -27603 -46530 -31806 -184859 -179949 -200524 -227036 -155797 -41617 -8542 -528 43116
3667 43116 59006 68587 75120 137177 83454 -101234 -178205 -86398 -28111 37684 110938 103150
3655 103150 4871 -10166 46143 94285 71546 105534 -48823 -102092 -151659 -207986 -279253
3644 -279253 -190711 -136661 -107299 2091 46629 -43260 -57784 47086 54800 -37948 -103907
3633 -103907 -117760 -115940 -20949 -136049 -254639 -143309 117810 46023 -80086 -63668 -25954
3622 -25954 29108 -93962 -103485 -86874 -93723 -153223 -131388 -89150 -8290 -6669 81322 53296
3610 53296 -35473 -55987 -163250 -126484 -68785 -72904 -23397 -36045 26147 97447 74883 43781
3598 43781 147735 216997 223855 170689 95727 -134843 -113533 -32951 52398 49739 -69499 -217926
3586 -217926 -163961 -150354 -158017 -113845 -49530 35533 53427 43274 90687 -4539 -81301 -63531
3574 -63531 -61491 -107820 -84581 -27062 -24907 24721 -5178 -67481 -120634 -203142 -133479 24392
3562 24392 139080 47345 -101264 -166771 -151303 -95157 -98766 -177716 -115482 15562 40171
3551 40171 37570 67246 31462 29005 17341 -40556 -36773 -23786 1636 -18945 44588 126009
3539 126009 146295 -37293 -102953 -114149 -226254 -215387 -210104 -209955 -107043 -72261 -42930 -56952
3527 -56952 -140736 -118486 6110 10088 -40873 -24778 18684 -9975 -107574 -159955 -158539 -129165
3515 -129165 -23654 -78534 -1983 101743 -11692 -77753 -95446 -82797 22441 79254 19654
3504 19654 26786 80168 -25266 -56887 17750 88857 49321 -84741 -94095 17790 78101 51188
3492 51188 -12469 52103 -15357 -47867 -93143 -166706 -160532 -52253 86863 29078 21140 -41860
3480 -41860 -111454 -121847 -95815 -38609 -31936 -39603 -68821 -1945 38895 144797 176513 139943
3468 139943 39466 76 -11405 71976 92541 80407 122581 98759 -5065 52539 99649
3457 99649 88386 -15471 78094 70738 -24052 -78289 -139326 -82582 -70087 -17672 -19313 -4317
3445 -4317 -121862 -125482 -34036 -58602 -29067 -45321 -245587 -335529 -133659 -66787 13223 67946
3433 67946 76166 -4714 54253 88850 5449 17041 47784 6955 84871 96619 -7087 -131949
3421 -131949 -185156 -154511 -24843 -12339 33309 135538 119879 210038 267962 130064 58186
3410 58186 -9697 69469 57525 41367 -30147 -26386 15178 31946 20676 32485 -27643 -116947
3398 -116947 -126665 14324 81189 218312 299804 187828 32707 62463 52915 -120222 -150356
3387 -150356 -86421 -89147 -20075 46943 -168249 -253582 -225658 -28544 -51137 -73323 25258
3376 25258 97078 51557 -77619 -12447 55079 55852 6192 -125621 -180201 -183145 -71327 66469
3364 66469 26546 79177 114285 90803 120827 99536 108736 55880 -39137 -72524 -59236 1248
3352 1248 92017 55783 -1857 -2827 15062 -1517 -22436 -128086 -154049 -118704 -78585 -169483
3340 -169483 -273028 -188030 -152966 -159032 -163992 -78903 -153060 -182361 -85534 8314 -72999 -74727
3328 -74727 63379 84930 111376 141843 113293 141389 156314 111406 100210 130718 106797 91528
3316 91528 128585 66270 89313 193616 112021 -28062 -54012 -75198 10867 139334 164188
3305 164188 179595 -71298 -410445 -343693 -343158 -316976 -88294 34933 -58350 -88202 -49054
3294 -49054 -2300 38894 59665 -2511 -21179 -27301 20811 30169 20512 -36751 -55942 -50612 8937
3281 8937 103629 117810 71950 71498 -26172 -7754 91869 74156 -15519 -63852 -75774 -181114
3269 -181114 -230663 -140131 -55875 90410 58043 -46950 -22469 -38863 -115650 -52820 24690
3258 24690 53525 152472 156848 22063 90471 153558 109721 126414 211837 236649 85420 69344
3246 69344 -14396 -110465 -50455 -7519 -173216 -173555 -138648 -124700 -59514 -34142 2930 18012
3234 18012 79538 -3118 -86568 -129119 -94892 60690 116466 111090 60952 14771 378 55175
3222 55175 65151 148899 157721 154448 -7549 -96266 -84570 -5190 80511 40527 4772 1533
3210 1533 -53657 -138335 -113234 -27385 54707 -18439 -172657 -177837 -160299 -118301 -142228 -36459
3198 -36459 109086 195404 169153 78516 100708 143451 77433 90192 118303 70790 4850 -16669
3186 -16669 -47528 -161034 -105410 -13251 45412 -93230 -106739 -18047 8942 45313 48446 23368
3174 23368 -23249 -49470 -106735 -61518 -75675 -125057 -168546 -89590 49602 62923 -22921 14261
3162 14261 6078 -41656 -53805 -111616 -91498 -10925 7796 5595 -126377 -53482 18547 29357
3150 29357 22932 -89483 -129934 -68281 -61365 256 22058 55587 53116 -8508 39092 28438
3138 28438 -66418 -62239 -6028 -20128 27849 157125 192038 70 -6860 63946 -19811 -142334
3126 -142334 -121807 -102865 -56042 28384 18080 -27774 -168147 -222718 -278211 -15707 151440
3115 151440 211137 207575 156542 61208 136011 145549 154039 277685 357880 307839 80552 35863
3103 35863 11760 -33339 -111722 -44123 -12887 -131858 -169494 -153101 -125373 -144495 -160591 -234243
3091 -234243 -206791 -159699 -69444 -66389 26619 42582 104283 47087 43421 -17384 72973 233202
3079 233202 336921 127759 46377 16421 -64804 -92952 -128220 -126337 -54566 -71021 -50047
3068 -50047 347 -56407 -21741 75618 27634 28665 63066 93228 41488 112831 61367 -27136
3056 -27136 -148718 -243906 -142284 56149 -9602 -10367 3198 68086 81956 53627 30221 -15903
3044 -15903 -7565 -102709 -295484 -298117 -146020 -151940 -242175 -291998 -122029 -38588 35470 108027
3032 108027 133735 28966 33233 -21504 131524 238447 195266 81983 9282 -47887 -25934
3021 -25934 -26207 -92499 -124179 -126131 -173885 -188750 -115502 -96561 71939 137488 104302 105713
3009 105713 113289 203284 152396 89487 95945 182655 125459 141088 270377 126784 -71151
2998 -71151 23259 175366 79576 158294 229090 198549 130818 75840 37867 32289 95070 158954
2986 158954 169189 35387 13986 -75263 -176133 -49472 -65446 -56688 79431 70268 8420
2975 8420 -47731 -42098 50206 72703 28756 -40630 -29298 -57378 -140761 -140942 -122221 -151588 -6195
2962 -6195 112105 34507 -8961 -69620 -158592 -148196 -57522 -21560 -37181 -53745 -22428 16575
2950 16575 -7335 47477 30049 73265 117765 56279 10451 96390 147130 192766 152561 87699
2938 87699 200643 199003 40916 -88511 -147123 -145073 1412 39625 -21644 -184793 -153559
2927 -153559 -191810 -167524 34902 177817 112868 73222 60194 -5373 -47771 5144 69727
2916 69727 66053 18318 35185 54378 110502 103387 29626 7437 -72850 -73476 -34456 -63381 -65343
2903 -65343 -53264 -126849 -282149 -185561 36091 67685 104090 36036 45566 14511 -85325 -80564
2891 -80564 -64907 -37759 90183 60412 135328 139436 101737 20886 -88876 -142064 -128114 -85423
2879 -85423 2864 46906 4220 -55173 -55311 -28957 -41689 16317 7206 4258 85604 197430
2867 197430 179727 60215 122363 112044 97715 207828 217489 9422 -203355 -136500 -36346
2856 -36346 19233 66956 52564 65471 87175 128270 186189 199066 208021 134244 117489 144471
2844 144471 118402 104281 128437 130016 63835 36380 39697 29754 112990 179881 177615 139133
2832 139133 -29535 -108516 14172 39218 11793 -79112 67365 86435 18542 2940 -17567
2821 -17567 -45636 -44387 -70417 -101345 -226774 -192147 28689 79839 23289 -44464 -61728 -7463
2809 -7463 128685 240894 301245 340229 348445 266965 209273 170681 176650 218078 213048 222579
2797 222579 276686 220115 149123 62345 93148 154021 34743 27484 65149 118477 13110
2786 13110 -39536 132598 235403 139515 8550 -33167 45811 149141 213619 201561 58037
2775 58037 -105489 -164387 -190263 -158062 -177750 -29687 106568 62366 41310 44624 3144
2764 3144 -35891 7755 5085 157326 241252 154376 82529 227759 260659 194338 66051 45452
2752 45452 100863 86925 32165 6981 86373 109234 111972 80480 137903 167602 143974 78308
2740 78308 39263 -92368 -108763 -25351 -26734 -63273 -100313 -113765 -127581 -93118 -136602 -8255
2728 -8255 -13295 -64539 -101193 -125047 -57176 -8457 87370 92296 -3115 -113540 -99163 -163552
2716 -163552 -195627 -99068 -100051 -24162 35991 100560 96512 98866 109938 143955 231658 195138
2704 195138 87817 32075 -904 94210 79609 -75895 -145747 -84718 55718 58393 68025
2693 68025 11311 25667 -65026 4990 -92501 -195492 -153426 -57508 -35719 4467 31197 -5912
2681 -5912 48148 8586 29024 37563 39326 -81260 -57214 114294 139038 181799 192144 180637
2669 180637 203466 186302 67578 27528 6849 108698 129685 26296 237025 307832 228887
2658 228887 93216 43038 113436 111751 29082 18309 187358 115560 61046 66878 51084 69575
2646 69575 -90030 -244680 -147321 -10589 139145 131550 -2945 -49714 -91986 -165928 -203672
2635 -203672 -61190 23868 65482 94981 -68086 -166271 -169748 -154822 -33208 101089 -82024
2624 -82024 -175599 -189937 -120756 -47882 -13033 -108762 -15828 -1985 -90006 10621 -30832 -60748
2612 -60748 53898 46644 37250 67423 -4464 -118377 -139327 -35720 52915 146016 120010 2083
2600 2083 -87639 -78435 -136412 -135737 -33425 79656 90680 118035 118077 128149 107272 30282 -103763
2587 -103763 -183580 -195419 -125911 -229354 -150253 -79103 -15399 19373 67387 161033 195318
2576 195318 165542 149426 136240 85319 -4914 -89333 -124753 19044 8655 -36741 -45137 43053
$$ [...]
##END NTUPLES=NMR SPECTRUM
##END=
