##TITLE=Analysis number 327434
Compound Code s 11610
Book Reference 184671
Project Code adrs flr03
Chemist Name jom
##JCAMPDX= 6.0         $$ Bruker NMR JCAMP-DX V2.0
##DATA TYPE= NMR SPECTRUM
##DATA CLASS= NTUPLES
##ORIGIN= Bruker BioSpin GmbH
##OWNER= nmr
$$ XWIN-NMR		Version 3.5
$$ Fri Mar 23 12:22:23 2007 GMT Standard Time (UT+0h)  MAYBRIDGE\nmr@NMR_250MHZ
##.OBSERVE FREQUENCY= 250.131544655141
##.OBSERVE NUCLEUS= ^1H
##.ACQUISITION MODE= SIMULTANEOUS (DQD)
##.ACQUISITION SCHEME= undefined
##.AVERAGES= 16
##.DIGITISER RES= 18
##SPECTROMETER/DATA SYSTEM= dpx250
##.PULSE SEQUENCE= zg30
##.SOLVENT NAME= DMSO
##.SHIFT REFERENCE= (INTERNAL, DMSO, 0, 16.522)
##AUDIT TRAIL= $$ (NUMBER, WHEN, WHO, WHERE, WHAT)
$$ ##TITLE= Audit trail, XWIN-NMR		Version 3.5
$$ ##JCAMPDX= 5.01
$$ ##ORIGIN= Bruker BioSpin GmbH
$$ ##OWNER= nmr
$$ C:\u/data/dgb/nmr/ADRS/1800/pdata/1/auditp.txt
$$ ##AUDIT TRAIL=  $$ (NUMBER, WHEN, WHO, WHERE, WHAT)
(   1,<2007-03-23 12:22:01.69 +000>,<MAYBRIDGE\nmr>,<NMR_250MHZ>,
      <created by zg, POWCHK disabled, PULCHK disabled
       configuration hash MD5:
       49 4B E0 1D 92 C2 6B 37 9F E6 65 BC 52 41 86 1D
       data hash MD5: 64K
       57 64 95 6A A7 04 ED 01 4B 44 A0 47 A7 D9 E4 90>)
(   2,<2007-03-23 12:22:15.29 +000>,<MAYBRIDGE\nmr>,<NMR_250MHZ>,
      <Start of raw data processing
       ef LB = 0.3 FT_mod = 6 PKNL = 1 SI = 32K 
       data hash MD5: 32K
       72 9D 47 7C D9 73 E4 58 C8 7E D9 F3 47 04 FF D9>)
(   3,<2007-03-23 12:22:16.89 +000>,<MAYBRIDGE\nmr>,<NMR_250MHZ>,
      <apk 
       data hash MD5: 32K
       82 D0 69 43 56 27 CB 25 C8 61 B5 D3 2C 77 B6 13>)
(   4,<2007-03-23 12:22:17.68 +000>,<MAYBRIDGE\nmr>,<NMR_250MHZ>,
      <abs ABSG = 5 
       data hash MD5: 32K
       58 7B 8E E0 62 EA 66 E5 1B 20 EE AB E5 EA C6 37>)
$$ ##END=
$$ 
$$ hash MD5
$$ 3A B8 F1 C6 63 41 CF C4 E2 D3 04 17 31 E9 4E 2B
##$RELAX= 
##$RELAX= 
##$RELAX= 
##$RELAX= 
##$RELAX= 
##$RELAX= 
##$RELAX= 
$$ Bruker specific parameters
$$ --------------------------
##$DU= <C:\u>
##$EXPNO= 1800
##$NAME= <ADRS>
##$PROCNO= 1
##$TYPE= <nmr>
##$USER= <dgb>
##$AMP= (0..31)
100 100 100 100 100 100 100 100 100 100 100 100 100 100 100 100 100 100 
100 100 100 100 100 100 100 100 100 100 100 100 100 100 
##$AQSEQ= 0
##$AQ_mod= 3
##$AUNM= <au_zg>
##$AUTOPOS= <32 >
##$BF1= 250.13
##$BF2= 250.13
##$BF3= 250.13
##$BF4= 250.13
##$BF5= 500.13
##$BF6= 500.13
##$BF7= 500.13
##$BF8= 500.13
##$BYTORDA= 1
##$CFDGTYP= 0
##$CFRGTYP= 5
##$CHEMSTR= <none>
##$CNST= (0..31)
1 1 145 1 1 1 1 1 1 1 1 1 1 1 1 1 1 1 1 1 1 1 1 1 1 1 1 1 1 1 1 1 
##$CPDPRG= <>
##$CPDPRG1= <>
##$CPDPRG2= <>
##$CPDPRG3= <>
##$CPDPRG4= <mlev>
##$CPDPRG5= <mlev>
##$CPDPRG6= <mlev>
##$CPDPRG7= <mlev>
##$CPDPRG8= <mlev>
##$CPDPRGB= <>
##$CPDPRGT= <>
##$D= (0..31)
0 1 0 0 0 0 0 0 0 0.06 0 0 0 0 0 0 0.0002 0 0 0 0 0 0 0 0 0 0 0 0 0 0 
0 
##$DATE= 1174652520
##$DBL= (0..7)
120 120 120 120 120 120 120 120 
##$DBP= (0..7)
150 150 150 150 150 150 150 150 
##$DBP07= 0
##$DBPNAM0= <>
##$DBPNAM1= <>
$$ [...]
##$SUBNAM6= <"">
##$SUBNAM7= <"">
##$SUBNAM8= <"">
##$SUBNAM9= <"">
##$SW= 20.6930455092707
##$SWIBOX= (0..15)
0 0 3 0 0 0 0 0 0 0 0 0 0 0 0 0 
##$SW_h= 5175.983436853
##$TD= 65536
##$TD0= 1
##$TE= 683.16
##$TE2= 300
##$TE3= 300
##$TEG= 300
##$TL= (0..7)
0 120 120 120 120 120 120 120 
##$TP= (0..7)
150 150 150 150 150 150 150 150 
##$TP07= 0
##$TPNAME0= <>
##$TPNAME1= <>
##$TPNAME2= <>
##$TPNAME3= <>
##$TPNAME4= <>
##$TPNAME5= <>
##$TPNAME6= <>
##$TPNAME7= <>
##$TPOAL= (0..7)
0.5 0.5 0.5 0.5 0.5 0.5 0.5 0.5 
##$TPOFFS= (0..7)
0 0 0 0 0 0 0 0 
##$TUNHIN= 0
##$TUNHOUT= 0
##$TUNXOUT= 0
##$USERA1= <user>
##$USERA2= <user>
##$USERA3= <user>
##$USERA4= <user>
##$USERA5= <user>
##$V9= 5
##$VALIST= <valist>
##$VCLIST= <CCCCCCCCCCCCCCC>
##$VD= 0
##$VDLIST= <DDDDDDDDDDDDDDD>
##$VPLIST= <PPPPPPPPPPPPPPP>
##$VTLIST= <TTTTTTTTTTTTTTT>
##$WBST= 1024
##$WBSW= 4
##$XGAIN= (0..3)
0 0 0 0 
##$XL= 0
##$YL= 0
##$YMAX_a= 389820
##$YMIN_a= -402040
##$ZGOPTNS= <>
##$ZL1= 120
##$ZL2= 120
##$ZL3= 120
##$ZL4= 120
##$ABSF1= 16.522
##$ABSF2= -4.171173
##$ABSG= 5
##$ABSL= 3
##$ALPHA= 0
##$AQORDER= 0
##$ASSFAC= 0
##$ASSFACI= 0
##$ASSFACX= 0
##$ASSWID= 0
##$AUNMP= <proc_1d>
##$AZFE= 0.1
##$AZFW= 0.1
##$BCFW= 0
##$BC_mod= 0
##$BYTORDP= 0
##$COROFFS= 0
##$CY= 12.5
##$DATMOD= 1
##$DC= 0
##$DFILT= <>
##$DTYPP= 0
##$F1P= 14.0000005364418
##$F2P= -0.99999901652339
##$FCOR= 0.5
##$FTSIZE= 32768
##$FT_mod= 6
##$GAMMA= 0
##$GB= 0
##$INTBC= 1
##$INTSCL= 1
##$ISEN= 128
##$LB= 0.3
##$LEV0= 0
##$LPBIN= 0
##$MAXI= 10000
##$MC2= 0
##$MEAN= 0
##$ME_mod= 0
##$MI= 0
##$NCOEF= 0
##$NC_proc= -5
##$NLEV= 6
##$NOISF1= 0
##$NOISF2= 0
##$NSP= 0
##$NTH_PI= 0
##$NZP= 0
##$OFFSET= 16.522
##$PC= 1
##$PHC0= 217.0812
##$PHC1= 8.38718
##$PH_mod= 1
##$PKNL= yes
##$PPARMOD= 0
##$PSCAL= 4
##$PSIGN= 0
##$REVERSE= no
##$SF= 250.13
##$SI= 32768
##$SIGF1= 0
##$SIGF2= 0
##$SINO= 400
##$SIOLD= 32768
##$SREGLST= <1H.DMSO>
##$SSB= 0
##$STSI= 32768
##$STSR= 0
##$SW_p= 5175.98343685301
##$SYMM= 0
##$S_DEV= 0
##$TDeff= 65536
##$TDoff= 0
##$TI= <Analysis number 999999
Compound Code 99
Book Reference 9
Project Code 9>
##$TILT= no
##$TM1= 0
##$TM2= 0
##$TOPLEV= 0
##$USERP1= <user>
##$USERP2= <user>
##$USERP3= <user>
##$USERP4= <user>
##$USERP5= <user>
##$WDW= 1
##$XDIM= 32768
##$YMAX_p= 445505176
##$YMIN_p= -358176
$$ End of Bruker specific parameters
$$ ---------------------------------
##NTUPLES= NMR SPECTRUM
##VAR_NAME=  FREQUENCY,     SPECTRUM/REAL,   SPECTRUM/IMAG
##SYMBOL=    X,             R,               I
##VAR_TYPE=  INDEPENDENT,   DEPENDENT,       DEPENDENT
##VAR_FORM=  AFFN,          ASDF,            ASDF
##VAR_DIM=   32768,         32768,           32768
##UNITS=     HZ,            ARBITRARY UNITS, ARBITRARY UNITS
##FACTOR=    0.157963299565203, 1,           1
##FIRST=     4132.6476996994, 0,             0
##LAST=      -1043.33573715361, 0,           0
##MIN=       -1043.33573715361, -358176,     0
##MAX=       4132.6476996994, 445505176,     0
$$ Real data points
##PAGE= N=1
##DATA TABLE= (X++(R..R)), XYDATA
$$ [...]
22183a42572Q8183J9360j6239K8657l7753L2888O8172p6534o7332l11J10199J0497
$$ -142572 -54389 -35029 -51268 -22611 -60364 -27476 40696 -35838 -103170 -103481 6718 17215
22171A7215j7428p2974m661M9117M0015p1995p1171O2507N5915j6479q8875K3561
$$ 17215 -213 -73187 -77848 -28731 11284 -60711 -131882 -69375 -13460 -29939 -118814 -95253
22159i5253L4165N7521Q6102l6422m0092q1704p3393J6124K276L4290L1035J57887
$$ -95253 -61088 -3567 82535 46113 6021 -75683 -149076 -132952 -130676 -96386 -65351 92536
22147I2536o1869J1361N6982o2086j49377n9297N3230L8729N7947P1609K1904
$$ 92536 30667 42028 99010 36924 -112453 -171750 -118520 -79791 -21844 49765 71669
22136G1669n7359l7418q6377J44813P0141q2092R911J557Q3277j17121j25102
$$ 71669 14310 -23108 -109485 35328 105469 23377 33288 34845 118122 1001 -124101
22125a24101O7504P7042R9052j6464j02236n9899l335k4689q672J48793N2293
$$ -124101 -56597 20445 119497 103033 797 -59102 -62437 -87126 -95798 52995 105288
22114A05288k458j9747m4893n7950L6320r5835K9473M6370J4937j7267j3744l2720
$$ 105288 102830 83083 38190 -19760 16560 -79275 -49802 -3432 11505 -5762 -19506 -52226
22102e2226J5006K1312Q7099m3553k3128M0017M1470m1339p7958j8394M0283L0125
$$ -52226 -37220 -15908 71191 27638 4510 44527 85997 44658 -33300 -51694 -11411 18714
22090A8714n3488M6059Q8109J6416J197j4124M9885j8757L730J2928q9377j2593
$$ 18714 -34774 11285 99394 115810 117007 102883 152768 134011 137741 150669 61292 48699
22078D8699M0534R131j09307k5837Q7570j1540j07065j02075k549M1727J39096
$$ 48699 89233 98364 -10943 -36780 50790 39250 -67815 -169890 -172439 -130712 8384
22067H384K3425r0422n9975L7496R7925O5795k5583j17126q0501m0846P3512P1250
$$ 8384 31809 -58613 -118588 -81092 16833 82628 57045 -60081 -140582 -181428 -107916 -36666
22055c6666l4384j40519K4263J89092R3317k9145J6890O8254k4485m2440p6465
$$ -36666 -71050 -211569 -187306 1786 95103 65958 82848 151102 126617 84177 7712
22044G712k0784j6357n09O3739Q487l3116k6731J9760J00012k3066o5986q1160
$$ 7712 -13072 -29429 -29938 33801 42288 9172 -17559 2201 102213 79147 13161 -67999
22032f7999Q8219K8277j02993o6940o5150J1474L2014k6163L434N8168J4677J6717
$$ -67999 20220 48497 -54496 -121436 -186586 -175112 -143098 -169261 -165827 -107659 -92982 -76265
22020g6265m4902M4887J2772K4524O6242J2621q0246l2061k3430M0360O3259Q2658
$$ -76265 -121167 -76280 -63508 -38984 27258 39879 -40367 -72428 -95858 -55498 7761 90419
22008I0419r5332p995M6787k0918k4565j1501L7664L2169K1699q3807l8717o6415
$$ 90419 -4913 -12908 33879 12961 -11604 -23105 14559 46728 68427 -15380 -54097 -120512
21996a20512J3229M1750J05820M6126K7440p9276p0992O442J12044Q2186n8711
$$ -120512 -107283 -65533 40287 86413 113853 34577 -36415 -29973 82071 164257 105546
21985A05546n3574n6801k5422O3571k9172L8605n6460m4249J073r4809K4251R7682
$$ 105546 51972 -4829 -30251 33320 4148 42753 -13707 -57956 -56883 -151692 -127441 -29759
21973b9759m9895p7264O9711R9489M5456l2406L6602j04977k4071j8155m8472
$$ -29759 -79654 -156918 -87207 12282 57738 25332 61934 -43043 -67114 -85269 -133741
21962a33741o1225q9531J06866N8000K5968N3718J25260k7484k0470J065k743
$$ -133741 -194966 -284497 -177631 -119631 -93663 -39945 85315 57831 37361 38426 35683
21951C5683O2438k8657o3383p849k3745p4591j9773J6085M4085L4967j2380o6232
$$ 35683 98121 69464 6081 -1768 -25513 -100104 -119877 -103792 -59707 -24740 -37120 -103352
21939a03352L9682J7477J24250R7701n0328m5160k6674K1842N3242o555N0289
$$ -103352 -63670 -46193 78057 175758 125430 80270 53596 75438 128680 122125 172414
21928A72414o1368j21135j47310l9251m2015k7879R7750J12686J69342M4065m1457
$$ 172414 111046 -10089 -157399 -196650 -238665 -266544 -168794 -56108 113234 157299 115842
21917A15842r661M0200o0125j4682O9470j17852q0480n811O993m3399P933j7419
$$ 115842 106181 146381 86256 71574 141044 23192 -57288 -63099 -56106 -99505 -91572 -108991
21905a08991q0015j4617J05868n2834n7089Q8710J50983P9091l9221k0989p3684
$$ -108991 -189006 -203623 -97755 -150589 -207678 -118968 32015 111106 71885 50896 -22788
21894b2788l838m8428m7589l5858j4515J0074K665M8846N1559N4429m2475m3738
$$ -22788 -26626 -75054 -122643 -158501 -173016 -162942 -160277 -111431 -59872 -5443 -47918 -91656
21882i1656p7087N4087Q1931n3521k4744j2206k0677N5802R4034J24831M9670
$$ -91656 -168743 -114656 -32725 -86246 -110990 -123196 -143873 -88071 5963 130794 180464
21871A80464q1536n6271q2358l707K5544J5465r3334m4092M1617M5664N859k6545
$$ 180464 98928 42657 -39701 -43408 -17864 -2399 -95733 -139825 -98208 -52544 -46685 -73230
21859g3230r093K9210J9702J1576J7053K6499M6994o8305j05766O9892N6446p7531
$$ -73230 -82323 -53113 -33411 -21835 -4782 21717 68711 406 -105360 -35468 20978 -56553
21847e6553k9246j4267N3672K8523M6696k8178p9150m0341o0244j8158N4752J49746
$$ -56553 -85799 -100066 -46394 -17871 28825 647 -78503 -118844 -179088 -197246 -142494 7252
21835G252R4496l6072p4237j8599k2657q676M2147M8721N2047q0868O990N0477
$$ 7252 101748 65676 -8561 -27160 -49817 -58493 -16346 32375 84422 3554 10544 61021
21823F1021l9996m4326j03676J1705l1916N5234N9501K4080N9804J5915p867n1552
$$ 61021 21025 -23301 -126977 -115272 -147188 -91954 -32453 -8373 51431 67346 59479 7927
21811G927L6381k0634L1742k3287q8887M5572L6612O9573k631k2386l939j2503
$$ 7927 44308 23674 55416 32129 -56758 -11186 25426 94999 92368 69982 66043 53540
21799E3540j6870J5993L2055j1789j15418r4442J5439O4001K3709J0250o8255
$$ 53540 36670 52663 84718 72929 -42489 -136931 -121492 -57491 -33782 -23532 -91787
21788i1787n2094o1574l6102Q933K5995J6114R6847J43969J02135O8387l4971
$$ -91787 -143881 -205455 -241557 -232624 -206629 -190515 -93668 50301 152436 220823 185852
21777A85852j32975j12154M1142L1109K9503J6269j6990K6531J19801K5700J5864
$$ 185852 52877 -59277 -18135 12974 42477 58746 41756 68287 188088 213788 229652
21766B29652j28802n0018j8490k5359k7073k6145K6847O9113k9420j5626N7195
$$ 229652 100850 50832 32342 6983 -20090 -46235 -19388 49725 20305 4679 61874
21755F1874K4526Q9740m2859l7431M8485n5684n292j4625R2229Q050j22609l3671
$$ 61874 86400 176140 133281 95850 144335 88651 83359 68734 160963 169013 46404 12733
21743A2733J0592L966L2878j12136p1210P878k5517J2821L59J4283Q169n6720
$$ 12733 23325 27291 60169 -51967 -123177 -115299 -140816 -127995 -127636 -113353 -105184 -161904
21731a61904K6476M0689K6145q0505o4702P3385M4590p1076J41293P5614n6925
$$ -161904 -135428 -94739 -68594 -149099 -213801 -140416 -95826 -166902 -25609 50005 -6920
21720f920M4689R939L1381O2146J5550p6106m4668l596r9794p8695Q2134q265
$$ -6920 37769 47708 79089 141235 156785 80679 36011 32415 -67379 -146074 -63940 -72205
21708g2205k9726J14499M1083m6224j59499l3055J61342O5764j00723m4991R0824
$$ -72205 -101931 12568 53651 7427 -152072 -185127 -23785 41979 -58744 -103735 -12911
21697a2911K9609j8067j1019l1869n4229o0831q545N3479Q1006m450j31771n1252
$$ -12911 16698 -1369 -12388 -44257 -98486 -159317 -167862 -114383 -33377 -37827 -169598 -220850
21685b20850O8030O0873J4022K3567M2742m3130Q3307P7852j7838o2152m7081
$$ -220850 -152820 -91947 -77925 -54358 -11616 -54746 28561 106413 88575 26423 -20658
21674b0658O846J12370L2317M5770Q359j17218j82390m0398k5179j2340M1540
$$ -20658 -13812 98558 130875 176645 185004 67786 -114604 -155002 -180181 -192521 -150981
21663a50981M9104j4836p9770q3716L5271n3345J38276R167j07541L3166Q3569
$$ -150981 -101877 -116713 -196483 -280199 -244928 -298273 -159997 -150830 -258371 -225205 -141636
21652a41636l1504J19963N7872j4726q792N5135k9095M9141L558q4809p7643j8310
$$ -141636 -173140 -53177 4695 -10031 -18823 36312 7217 56358 59916 -24893 -102536 -120846
21640a20846K5054M5332l8166j9031P230J999L8663q542q2767J16769J43189L6736
$$ -120846 -95792 -50460 -88626 -107657 -100427 -98428 -59765 -68307 -151074 -34305 108884 145620
21628A45620n9244m8565K988Q464q6890l266L2816J5625K4363p31m966p0948l0514
$$ 145620 86376 37811 40799 49263 -37627 -40893 -8077 7548 31911 31180 26214 -44734 -75248
21615g5248L667J6461J3174m1941j777K0931j0879K1158M927O5049J01323l0050
$$ -75248 -71581 -55120 -41946 -83887 -85664 -64733 -75612 -54454 -49527 15522 116845 86795
21603H6795q1729O23K6424K182m7775q4152N7614P6089n8882j3875j497M6947
$$ 86795 5066 5689 32113 34295 -13480 -97632 -40018 36071 -22811 -36686 -38183 8764
21591H764K6949M3046o060m4697O687M3269l7969J42842O6779r8922j37742q6821
$$ 8764 35713 78759 72699 28002 34689 77958 39989 182831 249610 150688 12946 -73875
21579g3875o0404J7048K3695j8162k7557l6343O0156R3964n5062l968o084J00401
$$ -73875 -134279 -117231 -93536 -111698 -139255 -175598 -115442 -21478 -76540 -80508 -86592 13809
21567A3809L3823p8644j854o2105j9285O3920P0577M3519K7727m6728k1650j2581
$$ 13809 47632 -31012 -32866 -94971 -114256 -50336 20241 63760 91487 44759 23109 10528
21555A0528L4939j9643k4777r5464Q2055M4805R6805k2339r1587k9454l8237K0400
$$ 10528 45467 25824 1047 -94417 -12362 32443 129248 106909 15322 -14132 -52369 -31969
21543c1969l4745k0665O3829M3364O0986N767j9259O473k5128K4688q478p9859
$$ -31969 -66714 -87379 -23550 19814 80800 86567 67308 73781 48653 73341 64863 -14996
21531a4996j04896k8239K3122L4153j1919J22166K8388q3044l0969N7496L1826
$$ -14996 -119892 -148131 -125009 -90856 -102775 19391 47779 -35265 -66234 -8738 23088
21520B3088L006k6856p7013q9806N0275J9062M41m5178M8405J3186L5227l3909
$$ 23088 26094 -762 -77775 -167581 -117306 -98244 -97803 -142981 -94576 -81390 -46163 -80072
21508h0072N4221o5923j4723p180K3841j7519M7877k7836j2695l8605M1288M3584
$$ -80072 -25851 -91774 -106497 -113677 -89836 -107355 -59478 -87314 -100009 -138614 -97326 -53742
21496e3742q251j7277N379J1166l59o1204j2815m2506n544J01910R5880N4125
$$ -53742 -61993 -79270 -73891 -62725 -63084 -124288 -137103 -179609 -185153 -83243 12637 66762
21484F6762m6832n640p8784k6218M017m2228K1825N4105M7737N2767j0819k0546
$$ 66762 19930 14290 -64494 -90712 -86695 -128923 -107098 -52993 -5256 47511 36692 16146
21472A6146m2521P565N0923p8447j1503O6097o6079o4304J195K1718N9160L8730
$$ 16146 -26375 -18810 32113 -46334 -57837 8260 -57819 -122123 -120928 -99210 -40050 -1320
21460a320j228n788p0591n3898O6068K2313j2533k4230J1330N6543R1540M3341
$$ -1320 -2548 -8336 -78927 -132825 -66757 -44444 -56977 -81207 -69877 -13334 78206 121547
21448A21547n1120p0666M765J7979Q435l6361J5375K9598P709O2810l1935q5007
$$ 121547 70427 -239 4526 22505 30940 -5421 9954 39552 47261 110071 78136 -6871
21436f871M6487J0445j36815n2025o4L5923K695k728J2932k6783r081m9275l1692
$$ -6871 39616 50061 -86754 -138779 -138843 -102920 -100225 -102953 -90021 -116804 -125885 -175160 -206852
21423b06852K315j8646J34837O8322j2130l4014Q139j1399M20Q581k9387m7591
$$ -206852 -204537 -223183 -88346 -20024 -32154 -66168 -58029 -69428 -69008 -60427 -89814 -137405
21411a37405n2728m4598L7333Q9574l7672L3969O4903N4897L4374r5001m5440
$$ -137405 -190133 -234731 -197398 -107824 -145496 -111527 -46624 8273 42647 -52354 -97794
21400i7794N8136m1146j1580J6099o601j2800p42n2000R1298O5671O970o6598
$$ -97794 -39658 -80804 -92384 -76285 -82886 -95686 -96428 -148428 -57130 8541 15511 -51087
21388e1087M8725l9110j2409m8225l1974J0568k672O1258k3742J08262J03662
$$ -51087 -2362 -41472 -53881 -102106 -134080 -123512 -126184 -64926 -88668 19594 123256
21377A23256l4503l4760K3448M4497p2813n3373l9899k6512j3983N566J12445
$$ 123256 88753 53993 77441 121938 49125 -4248 -44147 -70659 -84642 -79076 33369
21366C3369r649j6372m2940j19144k1248J51622M4337J6097O0161l1798J9461
$$ 33369 23720 7348 -35592 -154736 -175984 -24362 19975 36072 96233 64435 83896
21355H3896m7633J8654k4171r7941n3852l3361m0316J5047J54804M1118R543j7876
$$ 83896 36263 54917 30746 -67195 -121047 -154408 -194724 -179677 -24873 16245 25788 7912
21343G912q1358K3654j1200k3520k8378l8823l3254Q0379K1649j5385Q499L4858
$$ 7912 -73446 -49792 -60992 -84512 -112890 -151713 -184967 -104588 -82939 -98324 -89825 -54967
21331e4967L991j13927M888J24626O4883n7533L0781J7472K8590r276m1614j9554
$$ -54967 -50976 -164903 -160015 -35389 29494 -28039 2742 20214 48804 39528 -2086 -21640
21319b1640j9095n5762N8486O9912R9338L0272o5150j00285m112j7661L5593R9175
$$ -21640 -40735 -96497 -38011 31901 131239 161511 96361 -3924 -8036 -25697 9896 109071
21307A09071k0295m9424p9582R366Q2615k2975p991o6981n5980N7240J29561J660
$$ 109071 88776 39352 -40230 -30864 51751 28776 20785 -46196 -102176 -44936 84625 86285
21295H6285n2362l1881p2328l071J34136L3215j01588K004L3670O1182J179q642
$$ 86285 33923 2042 -70286 -73357 60779 93994 -7594 -5590 28080 89262 90441 81799
21283H1799L995j9941l9486n814p1272j2297L774K543J49060Q6161k0844l7750
$$ 81799 85794 65853 26367 20553 -50719 -63016 -59242 -56699 92361 178522 157678 119928
21271A19928o4171n3456l6379O50M2684J07923q212j15693j00971j1944M0908
$$ 119928 55757 2301 -34078 -33428 9256 117179 108967 -6726 -107697 -119641 -78733
21260g8733o1684n6082J5054K1466N5786L1321M0333j4799L7728P5400o2485q771
$$ -78733 -140417 -196499 -181445 -159979 -104193 -72872 -32539 -47338 -9610 65790 3305 -5466
21248e466k4902j8862K7812o7939m5111L4546R0750k353k0734J8940o421o9884
$$ -5466 -30368 -49230 -21418 -89357 -134468 -99922 -9172 -11525 -32259 -13319 -19740 -89624
21236h9624P3283Q1242j0375m2453m7164K3349N2238l0266L4255K431K7465k2711
$$ -89624 -16341 64901 54526 12073 -35091 -11742 40496 10230 44485 46916 74381 51670
21224E1670j04350J4967L4102q4652L0132N2759O8082M9626P3613m1704j10359
$$ 51670 -52680 -37713 -3611 -88263 -58131 -5372 62710 112336 185949 144245 33886
21213C3886m0685m1097j00074j13461K1355J56753J16980K6606l4921n4053p3928
$$ 33886 -6799 -47896 -147970 -261431 -240076 -83323 33657 60263 25342 -28711 -102639
21202a02639K5974N0401n733L6285j4699p0278l5500J8835o1779r3453O8254M4330
$$ -102639 -76665 -26264 -31997 4288 -10411 -80689 -116189 -97354 -159133 -252586 -184332 -140002
21190a40002K8666n5342R2883O1855k1888L6219K9085p2990n3931M6878K818k5076
$$ -140002 -111336 -166678 -73795 -11940 -33828 2391 31476 -41514 -95445 -48567 -45749 -70825
21178g0825L100j3473K0786p6136J16538J12595n4316r0862K8416q818m8474O2211
$$ -70825 -67725 -81198 -60412 -136548 -20010 92585 38269 -52593 -24177 -32995 -81469 -19258
21166a9258N7107J0303K5026m1006q0913Q3550J3794Q633J14330j17678j57729
$$ -19258 37849 48152 73178 32172 -48741 34809 48603 57236 171566 53888 -103841
21155a03841Q214k7972M2484J37343J755j10592L6733J7756J0544M2641L8817
$$ -103841 -95627 -123599 -81115 56228 57983 -52609 -15876 1880 12424 55065 93882
21144I3882n9282o3990r8603q5765J8379J8903J37970J0512m6822O0648Q8339
$$ 93882 34600 -29390 -127993 -213758 -195379 -176476 -38506 -27994 -74816 -14168 74171
21133G4171J08203j0852o9236o3456P3468J4336k6669n0022J8938O1770o0693
$$ 74171 182374 171522 102286 38830 112298 126634 99965 49943 68881 130651 69958
21122F9958j11210L2349K1442k5195L7512O910j6074j0247n2551l1960O5488l7482
$$ 69958 -41252 -8903 12539 -12656 24856 31766 15692 5445 -47106 -79066 -13578 -51060
21110e1060n577N2349J6610L453o700o4484k1640q0358O032l2740r1134N4649
$$ -51060 -56637 -4288 12322 15775 9075 -55409 -77049 -157407 -151375 -184115 -275249 -220600
21098b20600J18687Q4565M978o8914M2660j8105j44419O0087J29888l3992J92701
$$ -220600 -101913 -17348 -12370 -81284 -38624 -56729 -201148 -141061 -11173 -45165 147536
21087A47536O2585k8137o4664j28180j54061j239J1549L6397L9863O5773O2387
$$ 147536 210121 181984 117320 -10860 -164921 -166160 -154611 -118214 -78351 -12578 49809
21076D9809J815p044j6711m8001k0938R081l5117M7328O996k064J5828o4078q1690
$$ 49809 51624 44580 27869 -20132 -41070 -31989 -67106 -19778 -12782 -14846 982 -63096 -144786
21063a44786K1426J64833N8241o2393K548l5189j22900j17024m407J7471L5387
$$ -144786 -123360 41473 99714 37321 39869 4680 -118220 -235244 -239651 -222180 -186793
21052a86793K2969O4963P4205k6813j40J9983L5468r4772N291J03539L6558J8591
$$ -186793 -163824 -98861 -24656 -51469 -51609 -31626 3842 -90930 -85639 17900 54458 73049
21040G3049m087l9736o3825p1301L1098M769m0862O4677N7131n9410p407L8559
$$ 73049 68962 29226 -34599 -105900 -74802 -70033 -110895 -46218 10913 -48497 -55904 -17345
21028a7345M686m2062Q2260N5512m3216o8778j12107L6356P4600k7691M360l9039
$$ -17345 -12659 -54721 27539 83051 39835 -28943 -141050 -104694 -30094 -57785 -53425 -92464
21016i2464n1102m3201K9497O3453R4169m0337J0940M5632J7915J7504P3624Q7444
$$ -92464 -143566 -186767 -157270 -93817 352 -39985 -29045 16587 34502 52006 125630 213074
21004B13074j00451q8213M9765R526m7447L4894r1060J888l4058K1310m0855m0046
$$ 213074 112623 24410 74175 83701 36254 71148 -19912 -18024 -52082 -30772 -71627 -111673
20992a11673J30015O8224K7951o6769j16014J3837M3052J5510L292r3280k3318
$$ -111673 18342 86566 114517 47748 -68266 -54429 -11377 4133 7425 -85855 -109173
20981a09173k2887l6572q186Q2775P0388p516J317N9509j803l2842p6100l1610
$$ -109173 -132060 -168632 -176818 -94043 -23655 -31171 -29854 29655 27852 -4990 -81090 -112700
20969a12700Q9132L5721J2299j9337p4744q4690K4179R9312L3407N875k7514J2628
$$ -112700 -23568 12153 24452 5115 -69629 -154319 -130140 -30828 2579 8454 -19060 -6432
20957f432q2081j53466P7871N7797j1745k5889N801n7500J9777R0632P6572M2198
$$ -6432 -88513 -241979 -164108 -106311 -118056 -143945 -138144 -195644 -175867 -85235 -8663 33535
20945C3535L7818M8931r0990J9526k8847r5478l7434J66159P4283o2251m4939
$$ 33535 71353 120284 29294 48820 19973 -75505 -112939 53220 127503 65252 20313
20934B0313m4281k0563p1189K1735M6572k7795J5980j5197M8030J54212j0508
$$ 20313 -23968 -44531 -115720 -93985 -47413 -75208 -59228 -74425 -26395 127817 117309
20923A17309o6814m9520J3465r952l5387K3840R3199Q044j17260j6812l6439q3938
$$ 117309 50495 975 14440 4488 -30899 -7059 86140 94184 -23076 -39888 -76327 -160265
20911a60265q650n1583O4097K8719j4088Q9380R074j27200j5415Q4044M2696o0156
$$ -160265 -168915 -220498 -156401 -127682 -141770 -52390 -43316 -170516 -185931 -101887 -59191 -119347
20899a19347r2271K4967J36000O5025J2673m973j68863j13767O4442L3491L5855
$$ -119347 -211618 -186651 -50651 14374 27047 22074 -146789 -260556 -196114 -162623 -126768
20888a26768J26304Q5174o9016q5191p64R5078J3879q6098m5525K7430J6269j00106
$$ -126768 -464 84710 15694 -69497 -70261 24817 38696 -47402 -92927 -65497 -49228 -149334
20876a49334o6017J7633P2525j9135J5210l1405Q8745J07550L136l5867p4457
$$ -149334 -215351 -197718 -125193 -144328 -129118 -160523 -71778 35772 38908 3041 -71416
20865g1416k3698N4501j0274Jn561n5744P1342M4225n7617M8748k0130j0569N7796
$$ -71416 -95114 -40613 -50887 -50886 -56447 -112191 -40849 3376 -54241 -5493 -25623 -36192 21604
20852B1604K0005l6495J5132L53m1226o3321q0034N1040N1090n499P414L7299
$$ 21604 41609 5114 20246 20599 -20627 -83948 -163982 -112942 -61852 -67351 -59937 -22638
20840b2638K7851j1205p6589K3777J00512M9465n8958n9886J7775N5570P046J2250
$$ -22638 5213 -5992 -82581 -58804 41708 91173 32215 -27671 -9896 45674 52720 64970
20828F4970J098j10190m0018j2696l4408p723J17300N1899K9959n3839p6448j2601
$$ 64970 66068 -44122 -84140 -96836 -131244 -138967 -21667 30232 60191 6352 -70096 -82697
20816h2697J5114R212p7335M685J45300j7361p7949q0419l8526J2093J32421K0160
$$ -82697 -67583 -58371 -135706 -131021 14279 -3082 -81031 -161450 -199976 -187883 -55462 -35302
20804c5302n426l0788k06175k9819R5002K2798M383R3034K7026K4790j2479K8624
$$ -35302 -40728 -71516 -277691 -307510 -212508 -189710 -185327 -92293 -65267 -40477 -52956 -24332
20792b4332j5057L9964O077k474l4160n602Q1442l5317j13474J9395J18426Q9624
$$ -24332 -39389 575 6652 4178 -29982 -35584 45858 10541 -102933 -83538 34888 124512
20780A24512k83m2003J5305j14316j11992L4680N8715k2782m0324L9780K12360
$$ 124512 124229 82226 97531 -16785 -128777 -94097 -35382 -58164 -98488 -58708 153652
20769A53652N2293K1308k5887j23279j34111K8413J00712J2426j86843j9461k1836
$$ 153652 205945 227253 201366 78087 -56024 -27611 73101 85527 -101316 -120777 -142613
20758a42613l8532j1042L2046N3999M8657p137l3734J4234L9490J2836M4610J1807
$$ -142613 -181145 -192187 -160141 -106142 -57485 -64622 -98356 -84122 -44632 -31796 12814 24621
20746B4621j10281K5972m6796K0792n7712m7961J49363P0483k7264q2276m3743
$$ 24621 -85660 -59688 -106484 -85692 -143404 -191365 -42002 28481 1217 -81059 -124802
20735a24802O6141K2276L1797p7783o1213J27987J05651N3889r1701j14066j26139
$$ -124802 -58661 -36385 -4588 -82371 -143584 -15597 90054 143943 52242 -61824 -187963
20724a87963M7985R2714L6689o9017n8248l8493J17464M7349n1000j0325j3088
$$ -187963 -139978 -47264 -10575 -79592 -137840 -176333 -58869 -11520 -62520 -72845 -85933
20713h5933N1746L2549L1849r2356n4439P0739J6661J5970m5184L7649J6036L0056
$$ -85933 -34187 -1638 30211 -62145 -116584 -45845 -29184 -13214 -58398 -20749 -4713 25343
20701B5343J3917N3331l7788J8209O1697k3737j67246j21978N8697J10972R2238
$$ 25343 39260 92591 54803 73012 134709 110972 -56274 -178252 -119555 -8583 83655
20690H3655O1769n5687r4325n8399K418o8655P5188P7700Q252m1889J5109n7717
$$ 83655 145424 89737 -4588 -62987 -60569 -129224 -54036 23664 31916 -9973 5136 -52581
20678e2581L9995J6466o0547Q6937M6448q8053j11856k9415k9634K2297J17959
$$ -52581 -12586 3880 -56667 30270 76718 -11335 -123191 -152606 -182240 -159943 -41984
20667d1984N6625O4540R391q074J7505j00805l5468J05142P6194P5573k1637q2117
$$ -41984 14641 79181 88572 80498 98003 -2802 -38270 66872 143066 218639 197002 114885
20655A14885m5691j11196j1519j2698p2398n4931R1764J07294K7872N0812l2588
$$ 114885 69194 -42002 -53521 -66219 -138617 -193548 -101784 5510 33382 84194 51606
20644E1606l8466j2035k9021p4420l6342P2211N5278l5833o237J13144M1292n0676
$$ 51606 13140 1105 -27916 -102336 -138678 -66467 -11189 -47022 -53259 59885 101177 50501
20632E0501k6548Q461J0124J9849r17J0136k7065L739o6711k3873N9082L2096
$$ 50501 23953 32414 42538 62387 61470 71606 44541 48280 -18431 -42304 16778 48874
20620D8874J6857m3336j73845k5215L3154J23784M4085p5676O861L8029o9903
$$ 48874 65731 22395 -151450 -176665 -143511 -19727 24358 -51318 -44457 -6428 -76331
20609g6331l302l0115j5392K3933Q9582q659m5895M7740J01270R3482n9518p8868
$$ -76331 -79633 -109748 -125140 -101207 -11625 -20284 -66179 -18439 82831 176313 116795 37927
20597C7927M203j11064l7340K0788l6875M1694J6985M2927P2830n0908j1485M9074
$$ 37927 42130 -68934 -106274 -85486 -122361 -80667 -63682 -20755 52075 1167 -10318 38756
20585C8756p5850j65773M8740L5057r109n6721K2772J09012N8115M8315r1142
$$ 38756 -37094 -202867 -154127 -119070 -128179 -184900 -162128 -53116 4999 53314 -37828
20574c7828r3030j8202Q2949Q0389L3236r1014k1488J24725M1943r4226o0702
$$ -37828 -130858 -149060 -66111 14278 47514 -43500 -64988 59737 101680 7454 -53248
20563e3248k5310q416k8019l2740J5693n3032L0915p910l996J45412J17922q8143
$$ -53248 -78558 -86974 -114993 -147733 -132040 -185072 -154157 -162067 -166063 -20651 97271 9128
20551I128r0774m2357M8930J0724O7736R3495j180j0960o9588o7899J0135L9283
$$ 9128 -81646 -124003 -75073 -64349 3387 96882 95702 84742 15154 -52745 -42610 -3327
20539c327l2525L5280O5316O7523N6488L480p4056q1517m2872R3592N056j55939
$$ -3327 -35852 -572 64744 132267 188755 192235 118179 36662 -6210 87382 92438 -63501
20527f3501n11Q3360J28934P945l9172j28782j9508J05321l0975j50061j00060
$$ -63501 -64012 19348 148282 156227 117055 -11727 -31235 74086 43111 -106950 -207010
20516b07010j06407R5600J15550O5617K0942l3865k565P8567P0181P8220l458
$$ -207010 -313417 -217817 -102267 -36650 -15708 -49573 -52138 26429 96610 174830 171372
20505A71372m1269j09177j36112m3888K5714R8720k3496Q228p3624k9587J39604
$$ 171372 130103 20926 -115186 -159074 -133360 -34640 -58136 -49908 -123532 -153119 -13515
20494a3515J42499k8195j5588l3841o7930l4216n3758Q9868j2496J61898o1596
$$ -13515 128984 100789 85201 51360 -16570 -50786 -104544 -14676 -27172 134726 73130
20483G3130l0576m3665J4161O2495k8046M884n2481o503Q8191o8829K0802p1828
$$ 73130 42554 -1111 13050 75545 47499 52383 -98 -6601 81590 12761 33563 -38265
20471c8265j14828Q5547M8441j5359n6319k4815q2409K665J36941N9669M8757
$$ -38265 -153093 -67546 -19105 -34464 -90783 -115598 -198007 -195342 -58401 1268 50025
20460E0025p489J3016J29649j2750p9118o8196K756j2359P53m2553j01504l1626
$$ 50025 42536 55552 185201 172451 93333 25137 27893 15534 16287 -26266 -127770 -159396
20448a59396J01619P7050P405l1501J8169M9041J6811O7106J5482j9040n0064
$$ -159396 -57777 19273 26678 -4823 13346 62387 79198 146304 161786 142746 92682
20437I2682p5837o9084p0110l8872n8964J21456O2260n9085J29757l5283j07600
$$ 92682 16845 -52239 -122349 -161221 -220185 -98729 -36469 -95554 34203 -1080 -108680
20426a08680l0864M8019n5728L322J26512j8168j124p3852q0432N7195L4587n8018
$$ -108680 -139544 -91525 -147253 -143931 -17419 -35587 -36711 -110563 -190995 -133800 -99213 -157231
20414a57231O06k8091M1463K9354K5670q7757L4063K6357o3675j5793j566J00904
$$ -157231 -156625 -184716 -143253 -113899 -88229 -175986 -141923 -115566 -179241 -195034 -196600 -95696
20402i5696J40092O2694K793p6570j3765Q319l950l8854L4241K9192p201P0554
$$ -95696 44396 107090 109883 33313 19548 27867 23917 -14937 19304 48496 41295 111849
20390A11849M3121l3667J9499r9698m3944L2068o5441q2276j3964l845q395M9954
$$ 111849 154970 121303 140802 41104 -2840 29228 -36213 -118489 -132453 -136298 -144693 -94739
20378i4739o477N2823q6798m5754J2010N0709O4753K5265o0238n8847j4864R093
$$ -94739 -101216 -48393 -135191 -180945 -168935 -118226 -53473 -28208 -88446 -147293 -162157 -153064
20366a53064O6686J8785P6543j1360J2687j13548p4223M0304N0384L9673M2772
$$ -153064 -86378 -67593 8950 -2410 10277 -103271 -177494 -137190 -86806 -47133 -4361
20355d361K4965l5301J9516L977j742M2239l2351j10072k1972N2332R3257p916
$$ -4361 20604 -14697 4819 8796 7054 49293 16942 -93130 -115102 -62770 30487 22571
20343B2571j12546k0549J188L0182K1539M5553k9181k4617L2134P5627L09K3889
$$ 22571 -89975 -110524 -109336 -79154 -57615 -12062 -41243 -65860 -33726 41901 42210 66099
20331F6099L6964m1221k6877M7093R4168j0240m0859r263J1016o9772j14581L5388
$$ 66099 103063 61842 34965 82058 176226 165986 125127 115864 126880 57108 -57473 -22085
20319b2085m0078m3174O7670l6064J7287N9899Q1295j0898l8038j5933r8805M4769
$$ -22085 -62163 -105337 -37667 -73731 -56444 3455 84750 73852 35814 19881 -78924 -34155
20307c4155J24595K638o3394m0618o3312k5152P6588Q555j0151m0640O9789N3296
$$ -34155 90440 93078 29684 -10934 -74246 -99398 -22810 -14255 -24406 -65046 4743 58039
20295E8039J9913J4379l982m5610n9064M0199p0546m3598N1373N4725p7135j5327
$$ 58039 77952 92331 88349 42739 -16325 23874 -46672 -90270 -38897 15828 -61307 -76634
20283g6634R952J35213q198q2122j54304Q5771Q5968M8792q1133j9319R6592K6757
$$ -76634 -66682 68531 60333 -21789 -176093 -90322 -4354 44438 -36695 -56014 40578 67335
20271F7335J024m3045m1850M807J52062K9019l953p8879m980K6080Q350p4570
$$ 67335 68359 25314 -16536 -11729 140333 169352 165399 86520 81540 107620 115970 41400
20259D1400j3922Q8196L7681o8569j47241m7724n6539J17862O8280K7347n2955
$$ 41400 27478 115674 153355 84786 -62455 -110179 -166718 -48856 19424 46771 -6184
20248f184p1152j8350P7149j041n38J3254L3546J6395j1374m2033n1813p1120
$$ -6184 -77336 -95686 -18537 -19578 -20116 -6862 26684 43079 31705 -10328 -62141 -133261
20236a33261k274J22909J36453q4998j6981K3535j8350O3265K5806p945o3867
$$ -133261 -135535 -12626 123827 38829 21848 45383 27033 90298 116104 108159 44292
20225D4292M8156p1900j4199K8747k3880p2246O3040J03628l1282p143j3214j8628
$$ 44292 92448 20548 6349 35096 11216 -61030 2010 105638 74356 67213 53999 35371
20213C5371m3559K4819R9487J8674k0236j10019j51608Q412O6271J57577n9067
$$ 35371 -8188 16631 116118 134792 114556 4537 -147071 -138659 -72388 85189 26122
20202B6122j1999K6827l3680R015L605j767M3410N1458N5349m8402l8031l478
$$ 26122 14123 40950 7270 16285 19890 18123 61533 112991 168340 119938 81907 78429
20190G8429m2933r2069j9052q268J4285R7592m1309k5518j8985j409N4747L7319
$$ 78429 35496 -56573 -75625 -83893 -69608 27984 -13325 -38843 -57828 -59237 -4490 32829
20178C2829m0234o9263l2662N8315M476j6253J8851J09312P8335p23p1157l0856
$$ 32829 -7405 -76668 -109330 -51015 -46539 -62792 -43941 65371 143706 142983 71826 40970
20166D0970N7214o9573n5630k2559L5563N9339K3926N2299l7784k3877o7947k093
$$ 40970 98184 28611 -27019 -49578 -14015 45324 69250 121549 83765 59888 -8059 -10152
20154a0152J17271N926n4479J5688p2621J739j2677M1412O6352M2134j6985l7739
$$ -10152 107119 113045 58566 74254 1633 3372 -9305 32107 98459 140593 123608 85869
20142H5869n0796m4641O5559k6692o8832k855N6009r2732j8951P6555J05953k709
$$ 85869 35073 -9568 55991 29299 -39533 -42388 13621 -79111 -98062 -21507 84446 81737
20130H1737m9418j6781L5230j9542M8166P3054J19215q0064j52988r7554q8l636
$$ 81737 32319 15538 50768 31226 79392 152446 271661 191597 38609 -58945 -59033 -62669
20118f2669J8064L3549J276j1069l6817m7335l9439L328O0387Q7516k4260j5145
$$ -62669 -44605 -11056 -9780 -20849 -57666 -105001 -144440 -141112 -80725 6791 -17469 -32614
20106c2614l3931L6716K2275m160j19372J2500l2123r992Q2711J40008M4996J7663
$$ -32614 -66545 -29829 -7554 -11714 -131086 -118586 -150709 -160701 -77990 62018 107014 124677
20094A24677J0231m0942r3551o0243K5182M1774p7060J552L2817J21969J32873
$$ 124677 134908 93966 415 -59828 -34646 7128 -69932 -68380 -35563 86406 219279
20083B19279m8756j64872k6378R872k46q7965m0758J28434K5581o7008j10765
$$ 219279 170523 5651 -20727 -10855 -11101 -99066 -139824 -11390 14191 -52817 -163582
20072a63582M9178M0971K7935M8972o2919l7073M7192m9939m1713M8775O3467
$$ -163582 -114404 -73433 -45498 3474 -59445 -96518 -49326 -99265 -140978 -92203 -28736
20061b8736j4768O2989r174n1757j20424J3850j417m174K6578N2240m3392j053
$$ -28736 -43504 19485 10311 -41446 -161870 -148020 -149437 -153611 -127033 -74793 -118185 -119238
20049a19238J10580k0212J2623k538j7571l7388J31322L7932j19625j8659k8412
$$ -119238 -8658 -28870 -16247 -18785 -36356 -73744 57578 95510 -24115 -42774 -71186
20038g1186J061O5790n0702K185l2490Q1148k4290q5465o7893J64654P8298k3098
$$ -71186 -70125 -4335 -55037 -52852 -85342 -4194 -28484 -113949 -181842 -17188 61110 38012
20026C8012o9422m4168J0313l4846L6455q728j8659J3600K0937N4742o6485n8805
$$ 38012 -31410 -75578 -65265 -100111 -63656 -72384 -91043 -77443 -56506 -1764 -68249 -127054
20014a27054k9991N5436Q4868J1428j1461j1455r2446m3883Q8618M0508p8541
$$ -127054 -157045 -101609 -16741 -5313 -16774 -28229 -120675 -164558 -75940 -35432 -113973
20003a13973M0100m9616L6555N148m482Q7259J07154j9846o4726N2396J786O159
$$ -113973 -73873 -123489 -86934 -81786 -86268 991 108145 88299 23573 75969 77755 83914
19991H3914p3357k8588k3219m7074n8975O2554l6291j4703N1804N7132L933O0616
$$ 83914 10557 -18031 -41250 -88324 -147299 -84745 -121036 -135739 -83935 -26803 -22870 37746
19979C7746k8507N5165L0743j9280p2107k8501Q7473K120N010K4342j8782M9310
$$ 37746 9239 64404 95147 75867 3760 -24741 62732 64852 69862 94204 75422 124732
19967A24732l5579o0413k9557J3932J09855p8435j0271M9697Q1399l0820m4825
$$ 124732 89153 28740 -817 13115 122970 44535 34264 83961 165360 134540 89715
19956H9715J0656l7126r7757k12839n86J33158L4950M3816j8509J3607j9337p0327
$$ 89715 100371 63245 -34512 -247351 -247937 -114779 -79829 -36013 -54522 -40915 -60252 -130579
19944a30579k0581p2610Q0865J00270K7697N9794p4007j9785m3204k8314J5377
$$ -130579 -151160 -223770 -142905 -42635 -14938 44856 -29151 -48936 -92140 -120454 -105077
19933a05077Q6220P7765j10928m6814P3202J3645J28111r031n8311l2197M4815
$$ -105077 -18857 58908 -52020 -98834 -25632 -11987 116124 107093 48782 16585 61400
19922F1400j9692P14M9528p3909l6994l3427o8350Q4500J55213P2540m7553j31935
$$ 61400 41708 42422 91950 18041 -18953 -52380 -120730 -36230 118983 191523 143970 12035
19910A2035j05335p8114q4433O5663J28469K8457O8436R713n469k4576j7398L3555
$$ 12035 -93300 -171414 -255847 -190184 -61715 -33258 35178 44891 39422 14846 -2552 31003
19898C1003p1186k2405j8386M5161n8451O4884R4349K574l2640l7315r1761q883
$$ 31003 -40183 -62588 -80974 -35813 -94264 -29380 64969 67543 34903 -2412 -94173 -103056
19886a03056N9116K108j2890k7427j5787J09483K6317j08950p1355K3047L2746
$$ -103056 -43940 -41832 -54722 -82149 -97936 11547 37864 -71086 -142441 -119394 -86648
19875h6648k9837k5004J42478J00993o93o6380m4141m3740n2927j4371K7383L2738
$$ -86648 -116485 -141489 989 101982 101289 34909 -9232 -52972 -105899 -120270 -92887 -60149
19863f0149M3020k7820L0968L602p302r6517n4539J03885N4687M7120n4272n930
$$ -60149 -17129 -44949 -13981 -10379 -17681 -114198 -168737 -64852 -10165 36955 -17317 -23247
19851b3247J14880m2161r564Q9437j02634o9734q3365n5378O7720k8447l2761
$$ -23247 91633 49472 39908 129345 26711 -43023 -126388 -181766 -114046 -142493 -175254
19840a75254O8392k7329J6514J7646j0857n3548J6543j385k4729m1964P6633J23578
$$ -175254 -106862 -134191 -117677 -100031 -110888 -164436 -147893 -149278 -174007 -215971 -139338 -15760
19828a5760m340j7035m9314J0504L1860k4194M4962R0913O1465j4895k0618M2728
$$ -15760 -20100 -37135 -86449 -75945 -44085 -68279 -23317 67596 129061 114166 93548 136276
19816A36276J2047m3645q0311K6816J450m5508N9861L8298J5220N9825K2325p0798
$$ 136276 148323 104678 24367 51183 52633 7125 66986 105284 120504 180329 202654 131856
19804A31856J23340L9206l0978l9645j18229p5442J9876N0951K6522j3954p3427
$$ 131856 255196 294402 263424 223779 105550 30108 49984 100935 127457 113503 40076
19793D0076q5470K2886M3517J19670K6110p7104K1662L4392k1233l4368j4097
$$ 40076 -45394 -22508 21009 140679 166789 89685 111347 145739 124506 90138 76041
19782G6041L0611J7034q2138j43641o1210Q1877R0447L0605O785J2554j8646p623
$$ 76041 106652 123686 41548 -102093 -163303 -81426 9021 39626 46411 58965 40319 32696
19770C2696o2921j14972l0711M8215J3509K266Q6244k4720o4841n0393K6882j2485
$$ 32696 -30225 -145197 -175908 -127693 -114184 -111918 -25674 -50394 -115235 -165628 -138746 -151231
19758a51231L7757K7877J37618n7170n1018J00889m1199l343o863n1464K4567
$$ -151231 -113474 -85597 52021 -5149 -56167 44722 3523 180 -6683 -58147 -33580
19747c3580O8027K7039M645j4037j6047p7357l324q184q4948L4136N5943K4431
$$ -33580 34447 61486 66131 52094 36047 -41310 -44634 -52818 -137766 -103630 -47687 -23256
19735b3256J10731K6153J7996k9175m017m3373K6019K7373j7153j8090p1692K1202
$$ -23256 87475 113628 131624 102449 98432 55059 81078 108451 91298 73208 1516 22718
19723B2718k6678L7467J1942M044n286O138J1857l5916j00799n0875K4098J53252
$$ 22718 -3960 33507 45449 49493 44207 50345 62202 26286 -74513 -125388 -101290 51962
19711E1962M5442q1354l4062q2558o0844Q0048O990l6911l583P6839K4022M4341
$$ 51962 97404 16050 -18012 -100570 -161414 -81366 -74376 -111287 -114870 -38031 -14009 30332
19699C0332M1772j7775n8228L2063M54N1998J28580j47963j73068J04746k8501
$$ 30332 72104 54329 -3899 28164 28618 80616 209196 61233 -111835 -7089 -35590
19688c5590o2340l5911P0812J04516l701N5691M9383j50918k8176l2522P3781
$$ -35590 -97930 -133841 -63029 41487 37786 93477 142860 -8058 -36234 -68756 5025
19677E025Q5859O0399k1505Q80L3142k5915j826K7919J1977m1027j37472j8070
$$ 5025 90884 151283 129778 130658 163800 137885 136059 163978 175955 134928 -2544 -20614
19665b0614p7741O2681J00892k4879k0066L840Q1969j02573p3765O2398J26007
$$ -20614 -98355 -35674 65218 40339 20273 24113 106082 3509 -70256 -7858 118149
19654A18149N0041P70j7555q1861n7392l7894J46759O9342k6394m3308q7486J5044
$$ 118149 168190 168960 151405 69544 12152 -25742 121017 190359 163965 120657 33171 48215
19642D8215K1739l6387N463n5036k7218L0970L4522o8250R3608J09617l6622k3427
$$ 48215 69954 33567 39030 -16006 -43224 -12254 22268 -45982 47626 157243 120621 97194
19630I7194O546p2546M162K1182K1325J287j7900L1154J4247k3767k8556K8850
$$ 97194 103740 31194 35356 56538 77863 79150 61250 92404 106651 82884 54328 83178
19618H3178j00881j8886r0179M7842O4561M2398p1973p8506J5491M8896P0473
$$ 83178 -17703 -36589 -126768 -78926 -14365 28033 -43940 -122446 -106955 -58059 12414
19607A2414P6540J2260j430k9772l0498o252k2775m0433L968m134O6485J4910
$$ 12414 88954 101214 99784 70012 39514 33262 10487 -29946 -25978 -30112 36373 51283
19595E1283k8997J5651J6486Q749J8906Q7019m724n1037l5828p585o8977j1200
$$ 51283 22286 37937 54423 63172 82078 169097 164373 113336 77508 69923 946 -10254
19583a0254M6027j3647j05084J9440J46554M0425o3878n6915k1559n2420k8522
$$ -10254 35773 22126 -82958 -63518 83036 123461 59583 2668 -18891 -71311 -99833
19572i9833K8122N2990l0100n2745L8714J7657l705L5190M0448M9282K52r1914
$$ -99833 -71711 -18721 -48821 -101566 -62852 -45195 -48900 -13710 26738 76020 76272 -15642
19560a5642r559n1905K691M2284k9094p262m4055p9005O1753N7433o0345K6711
$$ -15642 -25201 -77106 -74415 -32131 -61225 -68487 -112542 -191547 -129794 -72361 -132706 -105995
19548a05995j2464P9264P705p0689j2591Q4113P0885l7797j5281M2979R375L8513
$$ -105995 -118459 -39195 -31490 -102179 -114770 -30657 40228 2431 -12850 30129 39504 78017
19536G8017j7650p8005k4525l8865n671J01608J09730Q8188M832o81n4905k19727
$$ 78017 60367 -17638 -42163 -81028 -86699 14909 124639 212827 217659 216978 162073 -57654
19524e7654k3846J15149O3266k6557L7732M3884K6307J15509L6758j29178j80912
$$ -57654 -81500 33649 96915 70358 108090 151974 178281 293790 330548 201370 20458
19513B0458o2935K4437P033m748P6361K9540K9610r226m7774N2326j3996j54665
$$ 20458 -42477 -18040 -11007 -15755 60606 90146 119756 110530 62756 115082 101086 -53579
19501e3579r4213o2730L8815J24902J04568o4294j16579J2004R1086j8470N7169
$$ -53579 -147792 -210522 -171707 -46805 57763 -6531 -123110 -111106 -20020 -38490 18679
19490A8679J0333j0833j9574j2724M5419P3725J4178j29871j11471J6224N6377
$$ 18679 29012 18179 -1395 -14119 31300 105025 119203 -10668 -122139 -105915 -49538
19479d9538O491L7207L2651P0659m5374N1827l4802j1614l6328O605K1040j4491
$$ -49538 -43047 -5840 26811 97470 52096 103923 69121 57507 21179 27784 48824 34333
19467C4333q1264J307N8084j1105p2272J5329P3323R2173N7878M333m2718j5063
$$ 34333 -46931 -45624 12460 1355 -70917 -55588 17735 109908 167786 172119 129401 114338
19455A14338j7530L1588k9339K5951O764J2321M5939l5828N5434j4939K323O3480
$$ 114338 96808 128396 99057 125008 131772 144093 190032 154204 209638 194699 197022 260502
19443B60502l5230j23932O336l194r467J0036L6240j0756n2728n3106o8691N5746
$$ 260502 225272 101340 107676 104482 95015 105051 141291 130535 77807 24701 -43990 11756
19431A1756R0347j1443k5718M887j141j0563R269j03966o992L2754J9142k2885
$$ 11756 102103 90660 64942 69829 68688 58125 67394 -36572 -43564 -10810 8332 -14553
19419a4553k929L4656J55633R2385q5117n6R6608m0773j45526O0630M5370K0967
$$ -14553 -17482 17174 172807 265192 180075 180019 276627 235854 90328 150958 196328 217295
19407B17295N712k3509q2024J8438l1623j06042J7400P4098K6545J4261q2259
$$ 217295 223007 199498 117474 135912 104289 -1753 15647 89745 116290 130551 48292
19396D8292k3431o1297L8121J22094j4010m1652N7298J5722l5186L8937L8053
$$ 48292 24861 -36436 1685 123779 109769 68117 125415 141137 105951 144888 182941
19385A82941L9441m1357r6175J7100R3253j02587j25478J9734J6176k9993K8999
$$ 182941 222382 181025 84850 101950 195203 92616 -32862 -13128 3048 -26945 2054
19374B054L8887k7122j905l4215j8660R501Q6039J12041J37615o8389l7248P0161
$$ 2054 40941 13819 11914 -22301 -40961 -31460 54579 166620 304235 235846 198598 268759
19362B68759r9296j33418L053L340r8804n8642M4993J32125O9044o79j7668o4442
$$ 268759 169463 36045 39098 42438 -56366 -115008 -70015 62110 131154 130475 112807 48365
19350D8365L6761Q7946P456M6447Q405j0980j6222L425K3472m6790j0832p3490
$$ 48365 85126 173072 180528 226975 235380 224400 208178 211603 235075 188285 177453 103963
19338A03963k3682J48012J06414m8192l9772m9773J7892p6388l1319q290q4695
$$ 103963 80281 228293 334707 286515 246743 196970 214862 138474 107155 98865 14170
19327A4170J9429R8520M3185K5827k4240J0912K1373K164j7606l6870k3610o9492
$$ 14170 33599 132119 175304 201131 176891 187803 209176 211340 193734 156864 133254 63762
19315F3762N5086O6683m0097r8533o9553K9947j4383M3206P457K194J906Q8036
$$ 63762 118848 185531 145434 46901 -22652 7295 -7088 36118 43575 45769 47675 135711
19303A35711K4832k8933j1476N1147M9232L9732o0217p9100m8687J7637J7147
$$ 135711 160543 131610 120134 171281 220513 260245 200028 120928 72241 89878 107025
19292A07025k9912l8246R2163L7550o0945J6236j3646L8541m6266j7378K2220
$$ 107025 77113 38867 131030 168580 107635 123871 110225 148766 102500 85122 107342
19281A07342j2134J482L642K7331L7275K29K6040K4299k9631J2496p088J00348
$$ 107342 95208 96690 100332 127663 164938 165167 191207 215506 185875 198371 191283 291631
19269B91631R470q775O4566Q4820n3972j06479n8625K1336N9890o4248p5359L919
$$ 291631 301101 292326 356892 441712 387740 281261 222636 243972 303862 239614 164255 168174
19257A68174Q426l5130M8158j2556Q526j5070L4499J60540R149J0759r0658l6069
$$ 168174 176600 141470 189628 177072 185598 170528 205027 365567 374716 385475 294817 258748
19245B58748K3274O9223m860M2677k1484j0177K6550n2258m6171j3234l3058O053
$$ 258748 282022 351245 346385 389062 367578 357401 383951 331693 285522 272288 239230 245283
19233B45283k1122o0355l368J07363J5197n0029r61l4557O0601j4582m9103n112
$$ 245283 224161 163806 160438 267801 282998 232969 232008 197451 258052 243470 194367 189255
19221A89255q6535L136Q4366Q1912j11589n675P5400j81860n9485P7736J51192
$$ 189255 102720 105856 190222 272134 160545 154870 230270 48410 -11075 66661 217853
19210B17853L5446q6443q0898n9357N9419R1319L9000m9359K4866L1464m2523
$$ 217853 253299 166856 85958 26601 86020 177339 216339 166980 191846 223310 180787
19199A80787J22948J80670J68203P4174j12171j45449l8013p9501R5922P784N1726
$$ 180787 303735 484405 652608 726782 614611 469162 431149 351648 447570 455354 507080
19188E07080N0430J6189l8628p9124j26143k7519P761k3614k2840l2671n9834
$$ 507080 557510 573699 535071 455947 329804 302285 310046 286432 263592 230921 171087
19177A71087k7126L7188R8677P0541M2409j31150j27436K8478l4453P5673J31964
$$ 171087 143961 181149 279826 350367 392776 261626 134190 162668 128215 203888 335852
19166C35852m2898p1982n0874K4402R5489J15162L2238m4321o8497o0449n4148
$$ 335852 292954 220972 170098 194500 289989 405151 437389 393068 324571 264122 209974
19155B09974K8477k2975J5418J1503j06536k3671k1399l9605R7038N5234M2937
$$ 209974 238451 215476 230894 242397 135861 112190 90791 51186 148224 203458 246395
19144B46395m2423j4341L7746r001P7269k9325n9751j0404P6314k0066N6645l8032
$$ 246395 203972 189631 227377 218376 295645 266320 206569 196165 272479 252413 309058 271026
19132B71026r2670j0799Q59K702l8361M396j2771j15N4356O1410J8071l6270o214
$$ 271026 178356 167557 168416 171118 132757 137153 124382 124267 178623 240033 258104 221834 215620
19119B15620O1478O784j01791k3489L1022K9359M7326k3687M1779l1430p4920
$$ 215620 277098 283882 182091 158602 189624 218983 266309 242622 284401 252971 178051
19108A78051n2534l4579L4374O3014M8318L5994J3481l1673l8778m1291l4271
$$ 178051 125517 90938 125312 188326 236644 272638 286119 254446 215668 174377 140106
19097A40106l8366j7668j0129n8617p3536N1148J15550L6119p838J40388l2116
$$ 140106 101740 84072 73943 15326 -58210 -7062 108488 144607 136769 277157 245041
19086B45041m8462k2357m1467l7989M6074j22760o7506K2126L9971j9384n085
$$ 245041 196579 174222 132755 94766 140840 18080 -49426 -27300 12671 -6713 -11798
19075a1798M7832N3607l450J1871o2517o3047n8213O2851J59437P2630K5611l4997
$$ -11798 36034 89641 86191 98062 35545 -27502 -85715 -22864 136573 209203 234814 199817
19063A99817o8787n8938n6274O4393R4280m24j542K9352r5046L7227J28581L1083
$$ 199817 131030 72092 15818 80211 174491 174067 172525 201877 106831 144058 272639 303722
19051C03722l790p0498j02008K7884P7947J03162l7832j14118K268M5888l3173
$$ 303722 299932 229434 127426 155310 233257 336419 298587 184469 186737 232625 199452
19040A99452q9461m5388K1589L3724p1943n505j0959N1140O2595n590K3865m2150
$$ 199452 109991 64603 86192 119916 47973 42468 31509 82649 145244 139654 163519 121369
19028A21369R205p1229r1920R5549q883j06551k5085K5286N9897m0642Q3713M1575
$$ 121369 130574 59345 -32575 62974 54091 -52460 -77545 -52259 7638 -33004 50709 92284
19016I2284R8472R0539M3170m64l1487J0744m199m206l7911K6360k8078l0808
$$ 92284 190756 281295 324465 324001 292514 303258 299059 294853 256942 283302 255224 224416
19004B24416q5696l7260J20135N8804j49397J2105N1551L6349o5191n5636m055
$$ 224416 138720 101460 221595 280399 131002 143107 194658 231007 165816 110180 106125
18993A06125m4247J9357j1057Q6655l299j9243R3045q5893p4973K2879J20328
$$ 106125 61878 81235 70178 156833 153534 134291 227336 141443 66470 89349 209677
18982B09677Q1081k8685m8265m546P0753L9115o066j09136j1744l5152N005N663
$$ 209677 290758 262073 213808 209262 280015 319130 313064 203928 192184 157032 162037 167700
18970A67700j02468K0907J39546N7092r4915J3293L4021q0152q7574j8676R8246
$$ 167700 65232 86139 225685 282777 187862 201155 235176 155024 67450 48774 147020
18959A47020m9126K9358P145j9791O6942P7455l7842l6670n814k3685k0606N2459
$$ 147020 97894 127252 134397 114606 181548 259003 221161 184491 178677 154992 134386 186845
18947A86845j8998j4041n5939j1930L1705N811l2722k1637O3687Q6477O2666j2486
$$ 186845 167847 153806 97867 85937 117642 123453 90731 69094 132781 219258 281924 269438
18935B69438N4519q388q6589l4858k0867k3591N3162j2479j2709O179O3074k9979
$$ 269438 323957 315569 228980 194122 173255 149664 202826 190347 177638 183817 246891 216912
18923B16912l7499k3929k5026L6374J09019M361k4656R1020J10587J90542J68784
$$ 216912 179413 155484 130458 166832 275851 280212 255556 346576 457163 647705 816489
18912H16489J0968k2588K0577J29102Q7849j4331l2525O0356J7275m5712M3007
$$ 816489 827457 804869 825446 954548 1042397 1028066 995541 1055897 1073172 1027460 1070467
18901A070467m4493j00630k2653O4797L1298J780k8061j58905q0724O2945K1924
$$ 1070467 1025974 925344 902691 967488 998786 1000566 972505 813600 732876 795821 817745
18890H17745j7209j45499j11394o9261j283J1121l0860j33415J670J8950k538
$$ 817745 800536 655037 543643 474382 473099 484220 453360 319945 321615 340565 338027
18879C38027m2230j02896n3929J4884J43199J20270R8424j3462r9832j6284J3517
$$ 338027 295797 192901 138972 153856 297055 417325 515749 502287 402455 386171 399688
18868C99688Q3781O1868O6466J44831j9893M4462J06814R0817N551L830L9051
$$ 399688 483469 545337 611803 756634 736741 781203 888017 978834 984385 988215 1027266
18857A027266K3495M5796N1916N3716M3444J54586J30988N9324N5413N8476M9709
$$ 1027266 1050761 1096557 1148473 1202189 1245633 1400219 1531207 1590531 1645944 1704420 1754129
18846A754129M3735q589J1918o9821j95389k40889j01554r7595q2154j10211n6465
$$ 1754129 1797864 1789275 1801193 1731372 1535983 1295094 1193540 1095945 1013791 903580 847115
18835H47115k3030n3841j76245j74475M4776P9052K1144o1305o2316l311R1211
$$ 847115 824085 770244 593999 419524 464300 543352 564496 503191 440875 437564 528775
18824E28775N0074o908K4866k0734j9253p3672m3720l706j3746K2867R463L9945
$$ 528775 578849 571941 596807 576073 556820 483148 439428 435722 421976 444843 454306 494251
18812D94251J2333K198K2533J53971J43893J36622N2036m0129r6737P9604J21602
$$ 494251 506584 508782 531315 685286 829179 965801 1017837 977708 880971 960575 1082177
18801A082177Q6458J25162M6084l6168n2253j9550r3060q7461n7966O4367N5158
$$ 1082177 1168635 1293797 1339881 1303713 1251460 1231910 1138850 1051389 993423 1057790 1112948
18790A112948J0730m7024j16733j35045j9819J1823j06690j67440o4315m3922
$$ 1112948 1123678 1076654 959921 824876 805057 816880 710190 542750 478435 434513
18780D34513N9529N3374L804n8807p0745K646p0178O9330K936K2092l7607r4779
$$ 434513 494042 547416 551220 492413 421668 424314 354136 423466 426402 448494 410887 316108
18768C16108l6026Q0913J54856N4626Q1069J32178Q1980j7930j9386n9007K8347
$$ 316108 280082 360995 515851 570477 651546 783724 865704 847774 828388 769381 797728
18757G97728J09569P7387r4178k5997J1760J8208q5089J9181Q9421L170k1195
$$ 797728 907297 984684 890506 864509 876269 894477 809388 828569 917990 921160 899965
18746H99965M9173R9999k2327m6726j9420j41784m8425l0271j17174j15327J6441
$$ 899965 949138 1049137 1026810 980084 960664 818880 770455 740184 623010 507683 524124
18735E24124O6082N0443o094m4686n91M0959k3538q5886L9527l9029k8545L4380
$$ 524124 590206 640649 634555 589869 589278 630237 606699 520813 560340 521311 492766 527146
18723E27146O2426O5215p8982r8501k792m3179m5397j7251N8619n559n0526l4643
$$ 527146 589572 654787 575805 477304 474512 431333 385936 368685 427304 421745 371219 336576
18711C36576j5210J30605J81105M1841j02766l8079n1147q8520j7743L6912n3355
$$ 336576 321366 451971 633076 674917 572151 534072 482925 394405 376662 413574 360219
18700C60219q5009q4364O6598J55798J52968n8417j23651l9103n9455p4566J34098
$$ 360219 275210 190846 257444 413242 566210 507793 384142 345039 285584 211018 345116
18689C45116J05228P2676O7982P093k8425k2383l3546p8315j6691R1421M4196
$$ 345116 450344 523020 591002 598095 569670 547287 513741 435426 418735 510156 554352
18678E54352q473L1707L1583K0719L744o8668J862J7822J6967k8157J4874o525
$$ 554352 545879 577586 609169 629888 633632 564964 566826 584648 601615 573458 588332 581807
18666E81807m8151M73q4952O8454N7142j0454R4428J00765J4280j26225j32102
$$ 581807 533656 534129 449177 517631 574773 564319 658747 759512 773792 647567 515465
18655E15465m2506N4954r080l264O9904L0846J6584K5307J27308O1874R736K9588
$$ 515465 472959 527913 518833 515569 585473 616319 632903 658210 785518 847392 857128 886716
18643H86716J1418q4412n4988r285P2883K6315j169k5603r7868r7247q079J55430
$$ 886716 898134 813722 758734 749449 822332 848647 847478 821875 724007 626760 618681 774111
18631G74111n7367j7434L0469J25708J09248Q168n9452l0128Q7125r822n9946
$$ 774111 716744 699310 729779 855487 964735 972903 913451 883323 970448 960626 900680
18620I00680k299N2833Q300l5552o906o3239P7699M1823m9002j137o0872J0915
$$ 900680 898381 951214 959514 923962 917056 853817 931516 973339 924337 923200 862328 873243
18608H73243O761q5802r5132N1132R6864J1995l0971J4644j8560k0651q4099M7745
$$ 873243 880004 794202 699070 750202 847066 859061 828090 842734 824174 803523 719424 767169
18596G67169P2306O8966o224j2569Q831m592J1721P3908M2619j8477Q641k3918
$$ 767169 839475 908441 902217 889648 898479 893887 905608 979516 1022135 1003658 1012299 988381
18584I88381J5929O2563L4332j256j0857O341k682N5707Q1652R9769O376K3159
$$ 988381 1004310 1066873 1101205 1099949 1089092 1095433 1092751 1148458 1230110 1329879 1336255 1359414
18572A359414o6124m3573l6940j8817K1476n9715q0270l0459J9123N9546Q2218
$$ 1359414 1293290 1249717 1212777 1193960 1215436 1155721 1075451 1044992 1064115 1123661 1205879
18561A205879o2190M6243R3299J14047J4285j7677l0751p4938o0323K7273R865
$$ 1205879 1143689 1189932 1283231 1397278 1411563 1393886 1363135 1288197 1227874 1255147 1265012
18550A265012K652j5149J6135R2998k709m3254j8047k7922p1327l3395n6904r4515
$$ 1265012 1267664 1252515 1268650 1361648 1358939 1315685 1297638 1269716 1198389 1164994 1108090 1013575
18538A013575p8187Q3803J40386Q335N0547N0740L4998K7597p69M4412R3583j4416
$$ 1013575 935388 1019191 1159577 1167912 1218459 1269199 1304197 1331794 1331025 1375437 1469020 1454604
18526A454604o2281L1460k3534p7318m6776O2235P3615Q3447L9228K7334K7445
$$ 1454604 1392323 1423783 1400249 1322931 1276155 1338390 1412005 1495452 1534680 1562014 1589459
18515A589459l4686o9941L8400o1609J9018J17112N8747k0296P7041J20975j1844
$$ 1589459 1554773 1484832 1523232 1461623 1480641 1597753 1656500 1636204 1713245 1834220 1822376
18504A822376j23372j41428r5268m8158j39327m7886J40818J16149K7807n7070
$$ 1822376 1699004 1557576 1462308 1414150 1274823 1226937 1367755 1483904 1511711 1454641
18494A454641q3256L8326n3381o71j2247j6426K5131O5344P3124J4319R7836J47729
$$ 1454641 1371385 1409711 1356330 1355659 1343412 1326986 1352117 1417461 1490585 1504904 1602740 1750469
18482A750469Q689q274j1629o8013J4915p9993l5853P2899o317K9656J02566L2401
$$ 1750469 1759158 1750884 1739255 1671242 1686157 1606164 1570311 1643210 1636893 1666549 1769115 1801516
18470A801516M571K3999R0350R3893m041j22654m0547J20269P4807L5681k8214
$$ 1801516 1806087 1830086 1920436 2014329 2010288 1887634 1847087 1967356 2042163 2077844 2049630
18459B049630M2503L4222n406P3107J01978N9145J356J17981J38685J6491k7436
$$ 2049630 2092133 2126355 2120949 2194056 2296034 2355179 2356535 2474516 2613201 2629692 2602256
18448B602256Q9102K83862R0100K3989O6663O2475J85978J39788J84083K66200
$$ 2602256 2691358 2975220 3065320 3089309 3155972 3218447 3404425 3544213 3728296 3994496
18438C994496K11684J42722K39022K78070K21666K68773M21000M76782N88633
$$ 3994496 4206180 4348902 4587924 4865994 5087660 5356433 5777433 6254215 6842848
18429F842848O20265O58111Q01671J192545J662444K323585L398254N234784P328056
$$ 6842848 7463113 8121224 8922895 10115440 11777884 14101469 17499723 22734507 30062563
18420C0062563R520454J2009160J2572691Q766232J547032n724730r426718q402657
$$ 30062563 39583017 51592177 64164868 72931100 74478132 68753402 59326684 50924027
18412E0924027m553090L96914O133851J2032272J6795676J7706698J2038239K497322
$$ 50924027 46370937 46767851 52901702 64933974 81729650 99436348 111474587 113971909
18404A13971909o243880j0627889j0215583q727022q614571r453029r504996p506056
$$ 113971909 107728029 97100140 86884557 78157535 69542964 60089935 50584939 43078883
18396D3078883m226570r04419J944953K962265J641160j001875l734360n129631
$$ 43078883 38852313 37947894 39892847 42855112 44496272 43494397 39760037 34630406
18388C4630406m843948l401433k114593j033164l1552O90996J445183K686741
$$ 34630406 29786458 26385025 24270432 23237268 23205716 23896712 25341895 28028636
18380B8028636M313275O394412Q434045Q778955O676010L565544J964386L744520
$$ 28028636 32341911 38736323 47170368 55949323 62625333 66190877 68155263 71899783
18372G1899783Q505690J4812775J9931057K0894841J8585651J6243443K0026486
$$ 71899783 80405473 95218248 115149305 136044146 154629797 170873240 190899726
18365A90899726L1650222M3832690M5006220K5759512o263630l3346005m1856110
$$ 190899726 222549948 266382638 311388858 337148370 330884740 297538735 255682625
18358B55682625k8055439n655895J2512776K1429108J9290891Q707704p210854
$$ 255682625 227627186 221971291 234484067 255913175 275204066 283911770 276700916
18351B76700916k4116090l3852205l6648986l2358320k2034101r371538L586529
$$ 276700916 252584826 218732621 182083635 149725315 127691214 118319676 121906205
18344A21906205J5694206K4325238K6566551K4770018K2469719J7878186J2466865
$$ 121906205 137600411 161925649 188492200 213262218 235731937 253610123 266076988
18337B66076988M126462j3310337l3881873m5203244m3566509l3792826k3142175
$$ 266076988 270203450 256893113 223011240 177807996 134241487 100448661 77306486
18330G7306486j4901373r587060o142130l647390j360385J107971L395229L878187
$$ 77306486 62405113 52818053 46675923 43028533 41668148 42776119 46171348 50049535
18322E0049535Q08796l984614o779392o681732n017989l441151k051467j069906
$$ 50049535 50858331 46873717 40094325 33412593 28394604 24953453 22901986 21832080
18314B1832080n25460k55666j80910P2835O08589J348647K376109L789167O032138
$$ 21832080 21306620 21050954 20870044 20942879 21551468 22900115 25276224 29065391 35097529
18305C5097529Q820827J2046025J4124009J2586022J0529425J3333699K0840514
$$ 35097529 43918356 55964381 70088390 82674412 93203837 106537536 127378050
18298A27378050K7597397K6227734J6160617Q339831J2099491K1217957K1195111
$$ 127378050 154975447 181203181 197363798 205703629 217803120 239021077 260216188
18291B60216188M254537k1001537l8354758m0981914l4409011k5678453j6660118
$$ 260216188 264470725 243469188 205114430 164132516 129723505 104045052 87384934
18284H7384934p649865N28243O839159P568096J54827j0000981j5535573j5420523
$$ 87384934 79735069 80263312 87102471 94670567 94825394 84824413 69288840 53868317
18276E3868317j2191175q652108n960804m317389l120312k103005j251815r08160
$$ 53868317 41677142 33025034 27064230 22746841 19626529 17523524 16271709 15363549
18268A5363549p98207o76783n87715n67904m15570j93892J45396O35282J063539
$$ 15363549 14565342 13888559 13300844 12732940 12317370 12123478 12268874 12904156 13967695
18259A3967695J737091K451991L549585N367303P616732Q919461O950047J794069
$$ 13967695 15704786 18156777 21706362 27073665 34690397 43609858 50559905 52353974
18251E2353974k372306k283036J250999N839117Q557266Q258440O572042N321025
$$ 52353974 49981668 47698632 48949631 54788748 63346014 71604454 78176496 83497521
18243H3497521O097341O915721M221158k410585j1302957j7633725j7716613j3450524
$$ 83497521 89594862 96510583 100731741 98321156 87018199 69384474 51667861 38217337
18235C8217337q753111n026306k329697q04634p09785j819229k852127k879268
$$ 38217337 29464226 24437920 22108223 21303589 20593804 18774575 15922448 13043180
18227A3043180k350705j814949j184394p54639n06537m58454m31690m20690m52195
$$ 13043180 10692475 8877526 7693132 6938493 6431956 5973502 5541812 5121122 4668927
18218D668927l36757k23479r9549k12401k01485j90827k37740j41541o0220j69648
$$ 4668927 4332170 4108691 4009142 3796741 3595256 3404429 3166689 3025148 2964928 2795280
18208B795280j55269q6965K3343n3930j13575j42428Q8376M7996r4683j28198
$$ 2795280 2640011 2553046 2576389 2522459 2408884 2266456 2354832 2402828 2308145 2179947
18198B179947o7652j07057p3163o975j10770J5121O8448m9445J8116J08275J03700
$$ 2179947 2112295 2005238 1932075 1925100 1814330 1829451 1897899 1848454 1866570 1974845 2078545
18187B078545J16695J36570J36273J97633J94468J05080K48736J29826r8468j33102
$$ 2078545 2195240 2331810 2468083 2665716 2860184 2965264 3214000 3343826 3245358 3112256
18177C112256j73292j43419j07668j74216j63655n2265N5180Q5671J03775J81004
$$ 3112256 2938964 2795545 2687877 2513661 2350006 2297741 2352921 2438592 2542367 2723371
18167B723371L27261J14585N1128J20348J32586N4015j03304l05306k96010k70743
$$ 2723371 3050632 3165217 3216345 3336693 3469279 3523294 3419990 3114684 2818674 2547931
18157B547931k08674k06282j43127l8482m691N5864L8826L1786P0985O1442O6548
$$ 2547931 2339257 2132975 1989848 1951366 1946675 2002539 2041365 2073151 2144136 2205578 2272126
18146B272126J71979J81517J01688J94722J96704P6397m8698O6515L7794j1624
$$ 2272126 2444105 2625622 2727310 2922032 3118736 3195133 3146435 3212950 3250744 3239120
18136C239120q9796m3226M2317N8608P0610K24484K20846K90027M43442L59871
$$ 3239120 3149324 3106098 3148415 3207023 3277633 3502117 3722963 4012990 4456432 4816303
18126D816303K58751K79656L17501K64437N82805P72041J061811J351293K054073
$$ 4816303 5075054 5354710 5672211 5936648 6519453 7291494 8353305 9704598 11758671
18117A1758671L145149M736809P211354J0324191J1259189O584220j772744p215179
$$ 11758671 14903820 19640629 26851983 37176174 48435363 55019583 53246839 46031660
18109D6031660p432419m564311p66718L303581Q027095J3877313J8435250J5883483
$$ 46031660 38599241 34034930 33268212 36571793 44598888 58476201 76911451 92794934
18101I2794934L389680j0997565j7931790j6597561j1706829o912443l206511
$$ 92794934 96184614 85187049 67255259 50657698 38950869 32038426 28831915
18094B8831915j01590L093490O407492Q003229M613455k650968q434245r472864
$$ 28831915 28730325 31823815 38231307 46234536 50847991 48197023 39762778 30289914
18086C0289914p488411m835155k845565j608036r07627l86443L8897N18446J093729
$$ 30289914 22801503 17966348 15120783 13512747 12605120 12218677 12257574 12776020 13869749
18077A3869749K137648L502509N320878P433074P837914M147941j683829m731463
$$ 13869749 16007397 19509906 24830784 32263858 40101772 44249713 42565884 37834421
18069C7834421m072152j265060K300544N999014R206558R958384Q185988O817814
$$ 37834421 33762269 32497209 34797753 40796767 50003325 59961709 68147697 74965511
18061G4965511O038730N864983P674175Q470890L401582m909238j0466355j1094078
$$ 74965511 81004241 86869224 94543399 103014289 106415871 101506633 91040278 79946200
18053G9946200q359391o063785p047940r421171r786038p618476m520884j788501
$$ 79946200 71586809 65523024 58475084 49053913 39267875 31649399 27128515 25340014
18045B5340014P47440L121420M079985J796320k856785o010483o000015m479040
$$ 25340014 26087454 29208874 33288859 35085179 32228394 26217911 20217896 15738856
18037A5738856l014498j889043j156407o84050m34623k01429P3009L76434Q15793
$$ 15738856 12724358 10835315 9678908 8994858 8560235 8358806 8431815 8808249 9624042
18028I624042J515148K697752M002395N333332M317212N34568l013701l825689
$$ 9624042 11139190 13836942 17839337 23172669 27489881 28024449 25010748 21185059
18020B1185059k536423n35822J552738L960357O580281Q541575O792050L49025
$$ 21185059 18648636 18112814 19665552 23625909 30206190 38747765 45539815 45888840
18012D5888840o052902q404929p347599n028570k778014q81217R12024K702846
$$ 45888840 39835938 31431009 24083410 19054840 16276826 15395609 16307633 19010479
18004A9010479L600448K098466j775415m460945m744060l537210k441205j796825
$$ 19010479 22610927 24709393 22933978 18473033 13728973 10191763 7750558 5953733
17996E953733j169626o92889m83124l22743k16211k54435j43252r1169q9120n2601
$$ 5953733 4784107 4091218 3608094 3285351 3069140 2814705 2671453 2580284 2491164 2438563
17986B438563j14794j53446k30357k02079j31767j17391m9895q4893j12088j42334
$$ 2438563 2323769 2170323 1939966 1737887 1606120 1488729 1438834 1353941 1241853 1099519
17976A099519j24021q3208l7881n0603r5760K8070J62337j9526J7099p8354k0155
$$ 1099519 975498 892290 854409 803806 708046 736116 898453 878927 896026 817672 797517
17965G97517J7279p1190j28983K8383l2278k8834n6395m534j4933L5694o4157
$$ 797517 814796 743606 614623 643006 610728 581894 525499 520965 506032 541726 477569
17954D77569J762l6545p6590J8452J54739M3210j5162m2825K8881L8215N9193
$$ 477569 479331 442786 366196 384648 539387 582597 567435 524610 553491 591706 650899
17943F50899Q2506P7709j6176L8876j5595m8143o6188j20670k9569J9548L5281
$$ 650899 733405 811114 794938 833814 818219 770076 703888 583218 553649 573197 608478
17932F08478K1239M403r2521j11991l9935m7964m5369R1301O0099m4031o174j4801
$$ 608478 629717 634120 541599 429608 389673 341709 296340 387641 447740 403709 397535 382734
17920C82734k8301L6688K945P2730j1544q2596L6851N3055K8096J16087O8883
$$ 382734 354433 391121 394066 466796 455252 372656 409507 462562 490658 606745 675628
17909F75628L9189R4622K1698J01442r768L2161J93727J91453l609k6329J1528
$$ 675628 714817 809439 831137 932579 922811 954972 1148699 1340152 1336543 1310214 1321742
17898A321742r027n3775j25283k9924J33435R3628L128r4226j05964j36198j38622
$$ 1321742 1312715 1258940 1133657 1103733 1237168 1330796 1333924 1239698 1133734 997536 858914
17887H58914p3098j18652m5351o9152k1719Q7799j21414L4965m273K8838j8846
$$ 858914 785816 667164 621813 552661 530942 618741 497327 532292 528019 556857 538011
17876E38011p17j19665m7870l7007N0570p7367m5206J25029J59876L998j4684
$$ 538011 537294 417629 369759 332752 383322 305955 260749 385778 545654 549652 534968
17865E34968m3118o2964Q0030O8399l4106J04571Q1584J08807N4635J57436M7622
$$ 534968 491850 428886 508916 577315 543209 647780 729364 838171 892806 1050242 1097864
17854A097864n2901n2054J0822J4020L8611N6471J4947P2028L508j05580n7169
$$ 1097864 1044963 992909 1003731 1017751 1056362 1112833 1127780 1199808 1203316 1097736 1040567
17843A040567p4753L1398j5850n5695J1602J56721N8717N5506M0317m6053J4198
$$ 1040567 965814 997212 981362 925667 937269 1093990 1152707 1208213 1248530 1202477 1216675
17832A216675M5586L0852J8923M7222K731k08248k07234j08945r5905q2340k1149
$$ 1216675 1262261 1293113 1312036 1359258 1361989 1153741 946507 837562 741657 659317 638168
17821F38168q1458q7613q8568p3362k0565k9437n6286j9473N9946o9389j82O5533
$$ 638168 556710 469097 380529 307167 286602 257165 200879 181406 241352 171963 171781 237314
17809B37314j4641L0009K3325M5976r261J493m2256j0466m0274P4624J50227K028
$$ 237314 222673 252682 276007 321983 312722 314215 271959 261493 221219 295843 446070 448098
17797D48098J8234K3725Q535P2452J02781P2846J50654M0003P5623O8561k2036
$$ 448098 466332 490057 498592 571044 673825 746671 897325 937328 1012951 1081512 1059476
17786A059476o4696R7695R3965l1891o3559r1651o4753l288n4632q6658p5389
$$ 1059476 994780 1092475 1186440 1154549 1090990 999339 934586 931298 876666 790008 714619
17775G14619K1033N3223r0847j68008j8543l6984J9751j0305o5160o9614n900
$$ 714619 735652 788875 698028 530020 511477 474493 494244 483939 418779 349165 343265
17764C43265k0377M2205j12019j01434M7600J3583R0410j6015r3084q6211n8145
$$ 343265 322888 365093 253074 151640 199240 212823 303233 287218 194134 107923 49778
17753D9778M0569k9301n6957M6067P9113R6199J29971Q9518L3841Q8792l2790
$$ 49778 90347 61046 4089 50156 129269 225468 355439 444957 478798 567590 534800
17742E34800m8404R829J2390k8847o9630q9480j462R2723j7926j24322P1440Q9088
$$ 534800 486396 496225 508615 479768 410138 320658 319196 411919 393993 269671 341111 430199
17730D30199J39304J90820L5389j6550q8650j67403q4742p8208j03371m1612l7274
$$ 430199 569503 760323 795712 779162 690512 523109 438367 360159 256788 215176 177902
17719A77902M6642P4198K0684O0122j00385j78746p0964o2452p280J70274R9779
$$ 177902 224544 298742 319426 379548 279163 100417 29453 -32999 -40279 129995 229774
17708B29774j32426j47093M1372M3325J28498o415j11054l8797m9507k6606L2371
$$ 229774 97348 -49745 -8373 34952 163450 157035 45981 7184 -42323 -68929 -36558
17697c6558J4316k8872R3320R1315N9635O326j59600q8160L7932M6046p1157k7660
$$ -36558 -22242 -51114 42206 133521 193156 199482 39882 -48278 -10346 35700 -35457 -63117
17685f3117R6539J07669N9948r000j06945J5314k8385N321J7089M9194P6585j1616
$$ -63117 33422 141091 201039 192039 85094 100408 72023 77344 94433 143627 220212 208596
17673B08596j42119j37816j0489Q6208j829M0759n593l8057N6335p4068J3212
$$ 208596 66477 -71339 -81828 4380 2551 43310 37717 -340 55995 -18073 -4861
17662d861J2815k7691n133M4094l5699N666Q2297O0817K961M779j01922o1348
$$ -4861 7954 -19737 -24870 19224 -16475 -10809 71488 132305 135266 140045 38123 -23225
17650b3225n295N0685J06850L4864l8918l8576p5267j0311J51L7223L0195k3928
$$ -23225 -28520 22165 129015 163879 124961 86385 11118 807 958 38181 68376 44448
17638D4448J66402N0754p1434n797j12238j8541M4649K792q6412j22326L6801
$$ 44448 210850 261604 190170 184373 72135 53594 98243 101035 14623 -107703 -70902
17627g0902J54965J864M697q8623p7528k3920P9987l6823m2421l5478o142P6531
$$ -70902 84063 85927 90624 2001 -75527 -99447 -19460 -56283 -98704 -134182 -140324 -63793
17615f3793J01152M7478M8705N500K3239N2108r4476p9589P4130O4163N6942l24
$$ -63793 37359 84837 133542 139042 162281 214389 119913 40324 114454 178617 235559 235235
17603B35235L3396l9744p8940l0620J5594j1971M5806Q8929N3401k1323k3452
$$ 235235 268631 228887 149947 119327 134921 122950 168756 257685 311086 289763 266311
17592B66311L1090p9881j6271M2314l4518j1494q4871P5780J07726k5135k2678
$$ 266311 297401 217520 201249 243563 209045 197551 112680 188460 296186 271051 248373
17581B48373P2441K2092o9687j6783N2592j5546j52458q7073m0593p464N6031
$$ 248373 320814 342906 273219 256436 309028 293482 141024 53951 13358 5894 61925
17570F1925J4950N5904O0114L7780o594j5626J04472J0758L1596l5863O7800j0669
$$ 61925 76875 132779 192893 230673 224079 208453 312925 323683 355279 319416 387216 376547
17558C76547k4543j00878M7978J63963q6146l0824N2640M0676k8668O8136L221
$$ 376547 352004 251126 299104 463067 376921 346097 398737 439413 410745 478881 482102
17547D82102l916r910j01461j43054m2795J4515K1638R9423j4856p8823j5491
$$ 482102 478186 468276 366815 223761 180966 195481 217119 316542 301686 222863 207372
17536B07372q9724L8539N2142J3815k6347p0312j31448j3410J23265K5322K9421
$$ 207372 117648 156187 208329 222144 195797 125485 -5963 -19373 103892 129214 158635
17525A58635N892J0794n279m7412J5240J8977J9698M0043P5141N7533O2420N9490
$$ 158635 164527 175321 170042 122630 137870 156847 176545 216588 291729 349262 411682 471172
17513D71172M1319J37809J56442J70818J56656k72J5356n0790j29861k07992k19344
$$ 471172 512491 650300 806742 977560 1134216 1133944 1149300 1098510 968649 760657 541313
17502E41313j77563q761J00068r584L4689M1990r6910L12k0944m1277n3733M074
$$ 541313 363750 354989 455057 445473 480162 522152 425242 425554 404610 363333 309600 313674
17490C13674l7205p451p4085o8690n552k3599J4654K4705l9992r2591N6044J15486
$$ 313674 276469 269018 194933 126243 120691 97092 111746 136451 96459 3868 59912 175398
17478A75398M8453r0196j18703n3591o464M316j9639M117j16965J7404J82140
$$ 175398 223851 133655 14952 -38639 -45103 -40787 -60426 -56309 -173274 -155870 26270
17467B6270M0674o6564n3509L7276Q1010M9441K9336j9619N61J2191P0565j3817
$$ 26270 66944 380 -53129 -15853 65157 114598 143934 124315 124876 137067 207632 193815
17455A93815K3052J10017o255n5562K2634n9921l330Q9182J6905N341L8419P4624
$$ 193815 216867 326884 320629 265067 287701 227780 224450 313632 330537 335878 374297 448921
17443D48921M1253J19498J98389J55929P2615l2708j68116j38393j54478q9456
$$ 448921 490174 609672 808061 963990 1036605 1003897 835781 697388 542910 453454
17433D53454m1675j07857O4026L3564J5455p3361N1319N6506n3947p7518p1561
$$ 453454 411779 303922 367948 401512 416967 343606 394925 451431 397484 319966 248405
17422B48405j27599k2238N6472L3728m6694m6606Q6291L8971K1882q7793K9286
$$ 248405 120806 98568 155040 188768 142074 95468 181759 220730 242612 154819 184105
17411A84105n915J07984P5401M5281Q5965N8275M7908Q7424M7255R6679m0436
$$ 184105 178190 286174 361575 406856 492821 551096 599004 686428 733683 830362 789926
17400G89926m0894L9776l846l1717j30564q4186r7966j57117j16689q8011q826
$$ 789926 749032 788808 784962 753245 622681 538495 440529 283412 166723 78712 69886
17389F9886k8483m5374L0396M1596M299R612R819m421P8506j25568j34449P8363
$$ 69886 41403 -3971 26425 68021 72320 81932 91751 87330 165836 40268 -94181 -15818
17377a5818K7653J2341o6994M1190J09090m9062J0268Q7628l2934k7262l8817
$$ -15818 11835 24176 -42818 -1628 107462 58400 68668 156296 123362 96100 57283
17366E7283p736O5446k7382l4271o4769o995L4378l9089m5630K7535K8876k643
$$ 57283 49547 114993 87611 53340 -11429 -18424 15954 -23135 -68765 -41230 -12354 -14997
17354a4997p000o307J64281l0555p9860L0087L6229n5144K5404J17232R7518q0879
$$ -14997 -21997 -28304 135977 105422 25562 55649 91878 36734 62138 179370 276888 196009
17342A96009K7252R2227O6967O8939J45494Q6221Q1430J43636M8536J4610K2031
$$ 196009 223261 315488 382455 451394 596888 683109 764539 908175 956711 971321 993352
17331I93352J8876m2528j50471r6513j77181j61836m4315O2694j4929j00938r6620
$$ 993352 1012228 969700 819229 722716 545535 383699 339384 402078 387149 286211 189591
17320A89591q577p2692r7495K5523J7202K0694L1974p2605n7758L8356L5661O2470
$$ 189591 181014 108322 10827 36350 53552 74246 106220 33615 -24143 14213 49874 112344
17308A12344m22l2040L2133l3047M712m0733R2412J02465n0341k5009k2127p495
$$ 112344 111922 79882 112015 78968 83680 42947 135359 237824 187483 162474 140347 132852
17296A32852L1417L1704m4757p9689N6404Q5864L0389l3335r8305N474M3781P8800
$$ 132852 164269 195973 151216 71527 127931 213795 244184 210849 112544 118018 161799 240599
17284B40599k3614m2113l7057p5873j33999l89L7671J19462J288j08799K7881
$$ 240599 216985 174872 137815 61942 -72057 -72446 -34775 84687 85975 -22824 5057
17273E057N0216O7588P7633M3439J8370m5702J017l3162M7425l4741L452p9194
$$ 5057 55273 122861 200494 243933 262303 216601 217618 184456 231881 197140 200592 121398
17261A21398m3272m2747l4047k364J16110J46733N2629r3811j22683p6677m990
$$ 121398 78126 35379 1332 -1032 115078 261811 314440 220629 97946 21269 16279
17250A6279N4848j9578n4631P8570Q3756O918k3157J39985p4704l2202l3514l4830
$$ 16279 71127 51549 -3082 75488 159244 166162 143005 282990 208286 176084 142570 107740
17238A07740N9279j3477k4156m2184j6027J6505k0478k6166j5139L7207j0834
$$ 107740 167019 153542 129386 87202 71175 87680 67202 41036 25897 63104 52270
17227E2270P3023J9950M1300j6342l0296o0974J3253M5810j09524K13M0254Q241
$$ 52270 125293 145243 186543 170201 139905 78931 92184 137994 28470 28683 68937 77178
17215G7178k8489l3445O3573l6787n0926k0099O1676K4126R144R0476O9575j8164
$$ 77178 48689 15244 78817 42030 -8896 -28995 32681 56807 65951 156427 226002 207838
17203B07838j5976n5006K1730O2222j9009O341n6392N1476J210K485o9369j7482
$$ 207838 191862 136856 158586 220808 201799 208140 151748 203224 204434 206919 137550 120068
17191A20068J9270K659k7529k1235j0756l460K031l3129k0664M2836Q6205P8040
$$ 120068 139338 141997 114468 93233 82477 79017 81048 47919 27255 70091 156296 234336
17179B34336M7055j31431K6638l6998N014K0486N6316l1493l6202l703L6049k0871
$$ 234336 281391 149960 176598 139600 144614 165100 221416 189923 153721 150018 186067 165196
17167A65196j5095M3485L0314q545o5728J00494J00711m1514p1154j38634R7757
$$ 165196 150101 193586 223900 215355 149627 250121 350832 309318 238164 99530 197287
17156A97287N2897j1530j67675j50174O7010J26048J04713M1845J2642J19230
$$ 197287 250184 238654 70979 -79195 -12185 113863 218576 260421 273063 392293
17146C92293N1626m099k1766k955q231j0268o9898q7015o6517o800P1259P6626
$$ 392293 443919 439820 418054 415099 406868 396600 326702 239687 173170 166370 237629 314255
17134C14255J1377k3842o2347K5061M9178L3078K344k3221j5384j57638j19595
$$ 314255 325632 301790 239443 264504 313682 346760 349104 325883 310499 152861 33266
17123C3266O818J239j1485K302j9240N997L9223N8229R5240O9333m06k0368j1850
$$ 33266 40084 41323 29838 32140 12900 18897 58120 116349 211589 280922 280516 260148 248298
17110B48298Q569q5287k818Q2305N0431j58022m0749K7293J8761j2125P7488R5356
$$ 248298 256867 171580 168762 251067 301498 143476 102727 130020 148781 136656 214144 309500
17098C09500K0111o4382j940O1069K1058N4509m8226n2651r6282k5841J3289R7408
$$ 309500 329611 265229 263289 324358 345416 399925 351699 299048 202766 176925 190214 287622
17086B87622K0022l2970n895q6926K6932j2984K4643J1051J37074J68256o464
$$ 287622 307644 274674 268779 181853 208785 195801 220444 231495 368569 536825 530361
17075E30361M486p239R6059m503j38269q5201m6432M8559M8495J7145j77577q0232
$$ 530361 534847 527608 623667 619164 480895 395694 349262 397821 446316 463461 285884 205652
17063B05652J32488P3173l2726m9006o617n5614n1029m7684N7235K12515J41598
$$ 205652 338140 411313 378587 329581 322964 267350 216321 168637 225872 438387 579985
17052E79985M2975Q6932l5895q5392j39889q3409l1753J9748J19508m5754L301
$$ 579985 622960 709892 673997 588605 448716 365307 333554 353302 472810 427056 430357
17041D30357K2555J3803L3909Q0573L0804m8499r4028l8741O0809N5733Q6883
$$ 430357 452912 466715 500624 581197 612001 563502 469474 430733 491542 547275 634158
17030F34158O3206l5624j51334m4083L9395j2036k7391N6723J0222J7391M4820
$$ 634158 697364 661740 510406 466323 505718 493682 466291 523014 533236 550627 595447
17019E95447N6681R3773O7279R7919l0257o4968M8861K7129Q1826J35825R0685
$$ 595447 652128 745901 813180 911099 880842 815874 864735 891864 973690 1109515 1200200
17008A200200K66473J58059l3215j19934j25867j05190P5934J62284l9477m5918
$$ 1200200 1466673 1624732 1591517 1471583 1345716 1240526 1316460 1478744 1439267 1393349
16998A393349J21994J82858J26277J82733K34165J84265K25734K07126K10211
$$ 1393349 1515343 1698201 1824478 2007211 2241376 2425641 2651375 2858501 3068712
16989C068712K39217L45485N11402Q90352J226613J864382K981815M667166P405642
$$ 3068712 3307929 3653414 4164816 5055168 6281781 8146163 11127978 15795144 23200786
16980B3200786J1182099J4110309J1924666K048754r143965j3652317j2007538
$$ 23200786 34382885 48493194 60417860 62466614 53322649 39670332 27662794
16973B7662794q304816n342915l411539k238119j380654r57354p02520l72209
$$ 27662794 19357978 14015063 10603524 8365405 6984751 6027397 5324877 4952668
16965D952668j95344j63495L9609k1218j33340j76436j16545j7957l0568m71M5258
$$ 4952668 4757324 4593829 4633438 4612220 4478880 4302444 4185899 4167942 4137374 4136903 4182161
16954D182161o8452q1603j68205n9906l9645j21381q2794j6182j2688J28305K02124
$$ 4182161 4113709 4032106 3863901 3803995 3764350 3642969 3560175 3543993 3531305 3659610 3861734
16943C861734J68211K35147M03235N33982N70813N24581L25407L935R048P2021
$$ 3861734 4029945 4265092 4668327 5202309 5773122 6297703 6623110 6627045 6636093 6708114
16933F708114J92505M03643N15090O67076O67958P88422R34040J034790J254491
$$ 6708114 6900619 7304262 7819352 8486428 9154386 9942808 10876848 11911638 13166129
16924A3166129J361743J607749K061725K312764K727178L552838M557854O498989
$$ 13166129 14527872 16135621 18197346 20510110 23237288 26790126 31347980 37846969
16916C7846969R290984J3589944K0455078L1303055M7711559O9695543Q9695069
$$ 37846969 47137953 60727897 81182975 112486030 160197589 229893132 319588201
16909C19588201Q6854309L9062666l3363897q0263825q5270991o6847819m5259200
$$ 319588201 406442510 445505176 412141279 331877454 246606463 179758644 134499444
16902A34499444k8983764j8368403j1375179o637786k814607O25336M414359R266298
$$ 134499444 105515680 87147277 75772098 69134312 66319705 66945041 71359400 80625698
16894H0625698J5996301K5473481L7961326N0950048N9228250N5389981L6073946
$$ 80625698 96621999 122095480 160056806 211006854 270235104 325625085 361699031
16887C61699031N552177k6078634m9244823n8654554n5546513m4922140l3030051
$$ 361699031 367251208 341172574 291927751 233273197 177726684 132804544 99774493
16880I9774493k3333966j6275895j1325363p902553n766760m543574l666327l148002
$$ 99774493 76440527 60164632 48839269 40936716 35169956 30626382 26960055 23812053
16872B3812053k765631k563394k267809j995184j818502j439023j289182r41068
$$ 23812053 21046422 18483028 16215219 14220035 12401533 10962510 9673328 8732260
16864H732260p22304p14722n81548n16366m77595l69631k99308k96967j62732
$$ 8732260 8009956 7295234 6713686 6197320 5719725 5350094 5050786 4753819 4591087
16855D591087k26650k40769k54209k13983k48199j95287j37845p3611K9547o9499
$$ 4591087 4364437 4123668 3869459 3655476 3407277 3211990 3074145 3000534 3030081 2960582
16845B960582J003P0281J13877P0686J03629P0399k5844k1602j5147K0699j3217
$$ 2960582 2961585 3031866 3145743 3216429 3320058 3390457 3364613 3343011 3327864 3348563 3335346
16834C335346j9756J83427K90986M09024N32619N54541O97063R44503J263822
$$ 3335346 3315590 3499017 3790003 4199027 4731646 5286187 5983250 6927753 8191575
16825H191575J892276K867456M431539O346169Q224619Q749240P168159L392966
$$ 8191575 10083851 12951307 17382846 23729015 31953634 40702874 47871033 51263999
16817E1263999j502428n818032q468160q784273p393722n441192l576158k309438
$$ 51263999 49761571 43943539 35475379 26691106 19297384 13856192 10280034 7970596
16809G970596j605078j126046p53818o13999m50334l00269j11952k08350l09614
$$ 7970596 6365518 5239472 4485654 3871655 3421321 3121052 3009100 2800750 2491136
16800B491136l26735k72818k52017k22386j43874j63704j10046L9948n4362p3057
$$ 2491136 2164401 1891583 1639566 1417180 1273306 1109602 999556 1039504 985142 912085
16790I12085r7107n5277L5652J6525Q5189j5425j72346j04336j22755n7894m9702
$$ 912085 814978 759701 795353 811878 897067 881642 709296 604960 482205 424311 374609
16779C74609n4602K1605N1601K1395O4514N6119K9696j45J5295k8466j06092k8723
$$ 374609 320007 341612 393213 414608 479122 535241 564937 564792 580087 551621 445529 416806
16767D16806P0367n8820l5411r0447o0076M4391p9412n0424J7896P4825P5277
$$ 416806 487173 428353 392942 302495 242419 286810 207398 156974 174870 249695 324972
16756C24972M5118k7043J7881j566Q4425N5051J8065N9254k3591p2977j51349
$$ 324972 370090 343047 360928 359362 443787 498838 516903 576157 552566 479589 328240
16745C28240j380P6130p1094n0588j5163J17447n2734k7567J5985j0502p3173
$$ 328240 326860 402990 331896 281308 266145 383592 330858 303291 319276 308774 235601
16734B35601m7733O8955K7340r3054n0196k6089J01443R0124q7327j07113j0180
$$ 235601 187868 256823 284163 191109 140913 114824 216267 306391 219064 111951 101771
16723A01771Q8937J2506J7027J929q0027p3106Q5910M9118P0387J9541q8170k1092
$$ 101771 190708 203214 220241 222170 142143 69037 154947 204065 274452 293993 205823 184731
16711A84731K6095j17732r3618N9524M9129M5308M0407n1994l0946M5430J2406
$$ 184731 210826 93094 -524 59000 108129 153437 193844 141850 110904 156334 168740
16700A68740m8330n2463n0470N2660m2623O4411L4712O5526N041K1270p2669j45525
$$ 168740 120410 67947 17477 70137 27514 91925 126637 192163 197204 218474 145805 280
16688B80l8575l0117Q6451J03130J08174M2871j6960p5945k7226Q2263p4492j01507
$$ 280 -38295 -68412 18039 121169 229343 272214 255254 179309 152083 234346 159854 58347
16676E8347j3679l8323M220J9222k7280m9959Q6899J97320o7428j13976j09188
$$ 58347 44668 6345 10565 29787 2507 -47452 39447 236767 169339 55363 -53825
16665e3825J4525L2455l5518j047Q511J12916N2876n7831M1589n0380n4692q7148
$$ -53825 -39300 -6845 -42363 -43410 -34899 78017 130893 73062 114651 64271 9579 -77569
16653g7569l8465Q9850Q3752j9786q2186j7210L5764m3917m9645j6942J04026
$$ -77569 -116034 -26184 57568 37782 -44404 -61614 -25850 -69767 -119412 -136354 -32328
16642c2328O8826N3726J00485n0276l7242R363k1611q3451K469j7885J02744P4945
$$ -32328 36498 90224 190709 140433 103191 112554 90943 7492 9961 -7924 94820 169765
16630A69765K7275r9730K1035R293m501O410l8557j12233n5760m0776N4128R829
$$ 169765 197040 97310 118345 127638 123137 129547 90990 -21243 -77003 -117779 -63651 -53822
16618e3822J8901N7814p6668j1711l1886J546O613m3693M9973Q7458O5552P9750
$$ -53822 -34921 22893 -53775 -65486 -97372 -95826 -89213 -132906 -82933 4525 70077 149827
16606A49827j6740j4196j4094n5452K515l1239j021O9138K0571K1626j21093k4996
$$ 149827 133087 118891 104797 49345 51860 20621 19600 88738 109309 130935 9842 -15154
16594a5154K7527m7927n6530R6395k3744j32998M404R9487p3749m7190r417K0391
$$ -15154 12373 -35554 -92084 4311 -19433 -152431 -148027 -48540 -122289 -169479 -178896 -158505
16582a58505K4105K7122O8513p775n3139n6308m2469K4326R3674K5426m7769m1139
$$ -158505 -134400 -107278 -38765 -46540 -99679 -155987 -198456 -174130 -80456 -55030 -102799 -143938
16570a43938O2638K7686K6807R4384L8739n9667m8163P35j0936o735M0135j9349
$$ -143938 -81300 -53614 -26807 67577 106316 46649 -1514 -779 -11715 -18450 21685 2336
16558B336L5992l1774J8460Q0243K7346p0467K9475l077K1295n2456Q35q3456
$$ 2336 38328 6554 25014 105257 132603 62136 91611 88534 109829 57373 58208 -25248
16546b5248o8417M6345J07395p0306j07696o0250J30516J72183O387r4036j03182
$$ -25248 -93665 -47320 60075 -10231 -117927 -178177 -47661 124522 130909 36873 -66309
16535f6309l3641Q1280K4583L2811K5397p0246n0876N016O9213j7690K6527J36252
$$ -66309 -99950 -18670 5913 38724 64121 -6125 -57001 -51985 17228 -462 26065 162317
16523A62317k0496m7218J9502J0886n2721k6271N5037N4895k1743n4891p2289
$$ 162317 141821 94603 114105 124991 72270 45999 101036 155931 134188 79297 7008
16512G008j14024J2888M9882j0440j2550n9658o5879L0322k0470p4250n0739P4607
$$ 7008 -107016 -94128 -44246 -54686 -67236 -126894 -192773 -162451 -182921 -257171 -307910 -233303
16500b33303J90854J52927n5127p6948n0264M0910L3143P4993j4178p3567p2940
$$ -233303 -42449 110478 55351 -21597 -71861 -30951 2192 77185 63007 -10560 -83500
16489h3500M7669k380N0603j4693p1930J0639j12537o0537J6951P9037N6018L1759
$$ -83500 -35831 -38211 12392 -2301 -74231 -63592 -176129 -236666 -219715 -140678 -84660 -52901
16477e2901l4838p5619K3590K548O2557m1040j40006P133M9593J2943J02421J7045
$$ -52901 -87739 -163358 -139768 -137220 -74663 -115703 -255709 -248576 -198983 -186040 -83619 -66574
16465f6574J1616K8915M8111j0505P6124R0178r6180j17371L0969p5722j18734
$$ -66574 -54958 -26043 22068 11563 87687 177865 81685 -35686 -4717 -80439 -199173
16454a99173j2935J05429J08591J4190o3158n7312o4310J74908R8563j0811o7827
$$ -199173 -212108 -106679 1912 16102 -47056 -104368 -168678 6230 104793 93982 26155
16443B6155k6377j0672m3320O4770k6943L57L4770j01442L1284K5720K5985o24
$$ 26155 -222 -10894 -54214 10556 -16387 -16030 18740 -82702 -51418 -25698 287 -337
16431c37j50770j5059Q3025m5732l2624J9103L0740M7883Q9717L8050L1636j1770
$$ -337 -151107 -166166 -83141 -128873 -161497 -142394 -111654 -63771 25946 63996 95632 83862
16419H3862M9297M5553J1097K7769j4425N9903L5399N3495J39249K40980K17737
$$ 83862 133159 178712 189809 217578 203153 263056 298455 351950 491199 732179 949916
16408I49916L00158K98749N0431J6088r2605j03475k5383j60551j55808j26497
$$ 949916 1250074 1548823 1599254 1615342 1522737 1419262 1393879 1233328 1077520 951023
16398I51023j04980k61626k13161l8723m648r924n3973j3174j29702m5471M9593
$$ 951023 846043 584417 371256 332533 327885 317961 263988 250814 121112 75641 125234
16387A25234n2266r8644l9753J8175L8997K6060R194M6344m6764m5042j2474o7940
$$ 125234 72968 -25676 -65429 -47254 -8257 17803 26997 73341 26577 -18465 -30939 -98879
16375i8879k4011J6564l3038J14763Q2112O8068j27153j9454K9529j1502n3849
$$ -98879 -122890 -106326 -139364 -24601 57511 125579 -1574 -21028 8501 -3001 -56850
16364e6850k6781J0592o8067o1625l7163P594l4518J3354J3251J22483J10746
$$ -56850 -83631 -73039 -141106 -202731 -239894 -232300 -266818 -253464 -240213 -117730 -6984
16353f984O4772M0419M4050O621p3142n1285o0779L0463R6660J29332J28824J36893
$$ -6984 57788 98207 142257 148878 75736 24451 -36328 -5865 90795 220127 348951 485844
16341D85844J34358J59157J50048J78244Q7424O6416K3147m0518k5927n8564o8129
$$ 485844 620202 779359 929407 1107651 1195075 1261491 1284638 1244120 1218193 1159629 1091500
16330A091500j28489j41309j26793q8480j37132l8987n9427j01342k7080o8587
$$ 1091500 963011 821702 694909 606429 469297 430310 370883 269541 242461 173874
16320A73874p8147l3493l1295j2215j07497j05885M5663Q2173M688J1238K8308
$$ 173874 95727 62234 30939 18724 -88773 -194658 -148995 -66822 -62134 -50896 -22588
16309b2588l6419j5523K2094k1487R65J08391r8947j14492R2291N8766O667M0779
$$ -22588 -59007 -74530 -52436 -73923 -72958 35433 -63514 -178006 -85715 -26949 -20282 20497
16297B0497Q7393o3196l8267p0749J0160K0016P5516j2278j19591K3845M1094
$$ 20497 107890 44694 6427 -64322 -54162 -34146 41370 29092 -90499 -66654 -25560
16286b5560k414r652M9849N2303m3060l3761j1165o2845o893L6591J9173q130
$$ -25560 -27974 -37626 12223 64526 21466 -12295 -23460 -86305 -93198 -56607 -37434 -45564
16274d5564R8375o4578j21599M9038N6369J002k1419j4626j2819K0960K3013J3832
$$ -45564 52811 -11767 -133366 -84328 -27959 -26957 -48376 -63002 -75821 -54861 -31848 -18016
16262a8016m380j14288j54030P500P2200N4269N1871R5237P616q2188P617K998
$$ -18016 -22396 -136684 -290714 -283214 -211014 -156745 -104874 -9637 -2021 -84209 -76592 -73594
16250g3594P8091l6928r2392O3211R1740K2812K0793l8818l9561k6582M6876M3813
$$ -73594 4497 -32431 -124823 -61612 30128 52940 73733 34915 -4646 -31228 15648 59461
16238E9461L5787j24575K8747L3589j9360q541L1206k127j3920j3742j6223M1177
$$ 59461 95248 -29327 -580 33009 13649 5108 36314 34187 20267 6525 -9698 31479
16226C1479j15995j194K886J7663k2654m9056K2680j8199k8738O0854N3345j339
$$ 31479 -84516 -85710 -82824 -65161 -87815 -136871 -114191 -132390 -161128 -100274 -46929 -48268
16214d8268N0715k599j3940Q8952k6968j17557p3395m6571O0952Q8964J175n0117
$$ -48268 2447 -152 -14092 74860 47892 -69665 -143060 -189631 -128679 -39715 -38540 -88657
16202h8657J0244M2066n5790j07786M8102L3222K7593P1577K9474J0675o1044
$$ -88657 -78413 -36347 -92137 -199923 -151821 -118599 -91006 -19429 10045 20720 -40324
16191d0324m0029K6559P3817K2494O9211l6013n2448p6148J01838Q9806R67j5248
$$ -40324 -80353 -53794 20023 42517 111728 75715 23267 -52881 48957 138763 139730 124482
16179A24482r415p9362n1898m5118L9125j0848l2736p107P970k6503k597R5651
$$ 124482 115067 35705 -16193 -61311 -22186 -33034 -65770 -72877 -64907 -91410 -94007 1644
16167A644o6497j0183J18729P7211j4998j43652l4348Q0027P6591l4178k0632
$$ 1644 -64853 -75036 43693 120904 105906 -37746 -72094 7933 84524 50346 29714
16156B9714P136j4941R878k6556l7168O7146J6944L9586J6557J36J2222m9367
$$ 29714 36850 21909 31787 5231 -31937 35209 52153 91739 108296 108432 120654 71287
16144G1287J4099n57p2177J131K526L2429j855N6491l709o0588n0489L81k2189
$$ 71287 85386 84829 12652 13783 16309 48738 46883 103374 99665 39077 -11412 -11031 -33220
16131c3220j14537k3178O0618J2961Q4372K2877j07160o170Q9458M9577Q684k1476
$$ -33220 -147757 -170935 -110317 -97356 -12984 9893 -97267 -103437 -13979 35598 44282 22806
16119B2806r3494j13804Q2086J11130L5133Q573j03920j79016p2475j6677O1767
$$ 22806 -70688 -184492 -102406 8724 43857 52430 -51490 -230506 -302981 -319658 -257891
16108b57891P0586O7263M9353J9907K1454o5672l0682K0383K3281N4534J4418
$$ -257891 -187305 -120042 -70689 -50782 -29328 -95000 -125682 -105299 -82018 -27484 -13066
16097a3066j09N68p0311j6292L0638j9389O5873M8026L6571l4468p4274j16920
$$ -13066 -13175 -12607 -82918 -99210 -68572 -87961 -22088 25938 62509 28041 -46233 -163153
16085a63153J4531M4878L3411K4640l9888p3724m3191O903M9729R2453K6790M4341
$$ -163153 -148622 -103744 -70333 -45693 -85581 -159305 -202496 -195593 -145864 -53411 -26621 17720
16073A7720J17170q975j23321n7564J5028O3352K495N7259k8795M3253p8372o424
$$ 17720 134890 125915 2594 -54970 -39942 23410 25905 83164 54369 97622 19250 12826
16061A2826J8093j3460m0943j9786o8974j8431l4906R3408M0990j57152K4072
$$ 12826 30919 17459 -23484 -43270 -112244 -130675 -165581 -72173 -31183 -188335 -164263
16050a64263R4481p5993J1910L6673N9731O0134j4397j4500M3921L8116n847m304
$$ -164263 -69782 -145775 -133865 -97192 -37461 22673 8276 -6224 37697 75813 69966 65662
16038F5662n359m8984j0413n8750j4906j8336K9606N7092R641O1086k1271n8856
$$ 65662 60303 11319 906 -57844 -72750 -91086 -61480 -4388 5253 66339 45068 -13788
16026a3788m1926K0679K1215k5260j4515m478q667M7944J4529n9053r0293L5564
$$ -13788 -55714 -35035 -13820 -39080 -53595 -58073 -66740 -18796 -4267 -63320 -153613 -118049
16014a18049J50792K541M9044r8077q5755q9544M1932J63544K2426q1820m163
$$ -118049 32743 35284 84328 -13749 -99504 -189048 -147116 16428 38854 -42966 -47129
16003d7129J2891o3585L0020J8402J687Q6314r5144n0452J18131Q9978j512p0112
$$ -47129 -34238 -97823 -67803 -49401 -47714 38600 -56544 -106996 11135 101113 99601 29489
15991B9489n3340R272l0396N1601l1265J1617O1496j6148k7776o1188J24318L6973
$$ 29489 -23851 -14579 -44975 6626 -24639 -13022 48474 32326 4550 -56638 67680 104653
15979A04653q2191M8445k3734j8193o4534Q16k6463P657O1039L6212j2799r6279
$$ 104653 22462 70907 47173 28980 -35554 -34738 -61201 -53544 7495 43707 30908 -65371
15967f5371M3929P0180M8891J1627n2990q7947N7487m4642q8001p1800n691j323
$$ -65371 -21442 48738 97629 109256 56266 -31681 25806 -18836 -106837 -178637 -184328 -185651
15955a85651J22432M2068j4784O8966J4025o2689l2865M7817L904l8426o5907
$$ -185651 -63219 -21151 -35935 33031 47056 -15633 -48498 -681 3223 -35203 -101110
15944a01110l7832N6181R9216M8186j10764l8531N1856O5157R6969L8241m8084
$$ -101110 -138942 -82761 16455 64641 -46123 -84654 -32798 32359 129328 167569 119485
15933A19485m5378k7320J0577R549P9132k2866q0452j44765M4496J10266k491
$$ 119485 74107 46787 57364 66913 146045 123179 42727 -102038 -57542 52724 50233
15922E0233L4056q1519k1120J32364j8157m7660O996L3793M6382j41055m7041
$$ 50233 84289 2770 -18350 114014 95857 48197 55193 88986 135368 -5687 -52728
15911e2728M6301r526k7431J9976o1971l2406K9945N9850J4308r7564p39K5716
$$ -52728 -6427 -15953 -43384 -23408 -85379 -117785 -87840 -27990 -13682 -111246 -111985 -86269
15899h6269L844L5535N1802p795K1334R6871J4211j05102N2060J7682o8757l739
$$ -86269 -82425 -46890 4912 -2883 18451 115322 129533 24431 76491 94173 25416 21677
15887B1677J32060k7154j12229r6810M7996L7074L8562Q442l0571j9528j7296
$$ 21677 153737 126583 14354 -82456 -34460 2614 41176 49618 19047 -481 -17777
15876a7777M551p375o686p2099k4907K4494P736k0199m1311K0863J06648L8042
$$ -17777 -13226 -20601 -27287 -99386 -124293 -99799 -92063 -112262 -153573 -132710 -26062 11980
15864A1980l2184j8293p834J5461k2401J3856K5066m5256k4097R0268M2788p9965
$$ 11980 -20204 -38497 -46331 -30870 -53271 -39415 -14349 -59605 -83702 6566 49354 -30611
15852c0611j5455K5846M604N4348rk3540J7906m7583n613l4907j01741L7196J2079
$$ -30611 -46066 -20220 -15616 38732 38723 15183 33089 -14494 -20107 -55014 -156755 -119559 -107480
15839a07480N669l4712l465L6731r6239l5615K1574N4072P8896J60048o1724j26425
$$ -107480 -101811 -136523 -139988 -103257 -199496 -235111 -213537 -159465 -80569 79479 17755 -108670
15827a08670m7067K0960o2207q2505P7808N4745K2867l8076k2556j9267L8112
$$ -108670 -155737 -134777 -196984 -279489 -201681 -146936 -124069 -162145 -184701 -203968 -165856
15816a65856N9632L7746N8019l825Q4971r039k2107k0848J7032J7181P8483K2896
$$ -165856 -106224 -68478 -10459 -14284 70687 61648 39541 18693 35725 52906 131389 154285
15804A54285K9877k6780j78634j4882L026q934N7585l4413j51916n2927J11917
$$ 154285 184162 157382 -21252 -36134 -33108 -42042 15543 -18870 -170786 -223713 -111796
15793a11796M3703L689O2949j3271q7820J105o4499L81N0750k0113R5935m057
$$ -111796 -68093 -64404 -1455 -14726 -102546 -101441 -165940 -165559 -114809 -134922 -38987 -43044
15781d3044P9159j9045N452J3547j39643j33955R9912N8651r9375k7819M7248
$$ -43044 36115 17070 22522 36069 -103574 -237529 -137617 -78966 -178341 -206160 -158912
15770a58912q420J00648J21748J8167J7576j25309r7400M1476R8502R49n7153
$$ -158912 -167332 -66684 55064 73231 90807 -34502 -131902 -90426 8076 9025 -48128
15759d8128m2223l51K5778j2876L8463M0390J9913O7660o53q6975o0790M808k2007
$$ -48128 -90351 -90702 -64924 -77800 -39337 1053 20966 88626 87973 998 -59792 -54984 -76991
15746g6991M643k8164n146O1825P2101K2520n1875m4206J6874M5450l0137n620
$$ -76991 -72348 -100512 -105658 -43833 28268 50788 -1087 -45293 -28419 17031 -13106 -18726
15734a8726K2996O633q048p2561L4263r052r977L330P7773k8450m0277j0471j9033
$$ -18726 4270 10903 2855 -69706 -35443 -44495 -54472 -51142 26631 -1819 -42096 -52567 -71600
15721g1600o054Q4455K6821J0124M2208n6831q2765j2263R71Q500M0865Q200m5727
$$ -71600 -77654 6801 33622 43746 85954 29123 -53642 -65905 -64934 -56434 -15569 -7369 -53096
15708e3096J9993K0081k3935l7472m2727L5477J46147P7579m1382j59460n5636
$$ -53096 -33103 -13022 -36957 -74429 -117156 -81679 64468 142047 100665 -58795 -114431
15697a14431l325O2344J0221j4224o407O4231n4415J8572M6941q6726j21210K9007
$$ -114431 -117756 -55412 -45191 -59415 -65822 -1591 -56006 -37434 9507 -77219 -198429 -169422
15685a69422R9202J15726J34007L2681j17854j83981K8647J02720k7465n6033
$$ -169422 -70220 45506 179513 212194 94340 -89641 -60994 41726 14261 -41772
15675d1772M3726J1862q0102p6994o817J10247N0741n3184m0310k9312j2687l1261
$$ -41772 1954 13816 -66286 -143280 -150097 -39850 10891 -42293 -82603 -111915 -124602 -155863
15663a55863m2129J6356J8557P6891R280L5400L1664l6669l4848k6784j9075K6118
$$ -155863 -197992 -181636 -163079 -86188 -76908 -41508 -9844 -46513 -81361 -108145 -127220 -101102
15651a01102n0426N4741N3074K6652p513o7894j04646q972j3881N5639m132N1338
$$ -101102 -151528 -96787 -43713 -17061 -24574 -92468 -197114 -206086 -219967 -164328 -168460 -117122
15639a17122M2393M541K8249L7717J14535p7414j5198j1306n0872J5467J19707
$$ -117122 -74729 -70188 -41939 -4222 110313 32899 17701 6395 -44477 -29010 90697
15628I0697J3046j685q2816l6998o3537n8633N2086M8N8139J0668M9339j4195
$$ 90697 103743 102058 19242 -17756 -81293 -139926 -87840 -87792 -29653 -18985 30354 16159
15616A6159q7217n9298M2095O4452j09827l9096L9910J0869N8636M2431P4408
$$ 16159 -71058 -130356 -88261 -23809 -133636 -172732 -132822 -121953 -63317 -20886 53522
15605E3522M500q854j15434p8595J7929p252O489J19475L4250k6370Q662L6540
$$ 53522 58022 49168 -66266 -144861 -126932 -134184 -127695 -8220 26030 -340 8322 44862
15593D4862n8817N3402Q1152j2317r4888r0876l8609P3924l6310k2833m7138j15932
$$ 44862 -13955 39447 120599 108282 13394 -77482 -116091 -42167 -78477 -101310 -148448 -264380
15581b64380J19859R6204M0036j2314k5901Q19N4734O579M3258k7563n1333q0233
$$ -264380 -144521 -48317 -8281 -20595 -46496 -45677 9057 15636 58894 31331 -20002 -100235
15569a00235K5622P256j59475M7164Q8232m4360p1663M4047m0687O6111J61511
$$ -100235 -74613 -67357 -226832 -179668 -91436 -135796 -207459 -163412 -204099 -137988 23523
15558B3523N8399r1898k9231N5869L9408O161l4530q9077o8896Q7674L3608o7685
$$ 23523 81922 -9976 -39207 16662 56070 62231 27701 -61376 -130272 -42598 -8990 -76675
15546g6675p6314P091k5938n6910O6419L3813k3250N108L6099P7253L1838o7629
$$ -76675 -152989 -145898 -171836 -228746 -162327 -128514 -151764 -146656 -110557 -33304 -1466 -69095
15534f9095K066l8077l762R1862K4267l7288k1370P3519J0723l0310j03959j26800
$$ -69095 -67029 -105106 -108868 -17006 7261 -30027 -51397 22122 32845 2535 -101424 -228224
15522b28224N6452N599o9976L4262O3027Q434Q1237L7768J0243K4603j04314l6426
$$ -228224 -171772 -166173 -236149 -201887 -138860 -130426 -49189 -11421 -1178 23425 -80889 -117315
15510a17315n1206m994Q8970J23269R6811m1880o2044o6495l9184q2335m2991
$$ -117315 -168521 -173515 -84545 38724 135535 93655 31611 -34884 -74068 -156403 -199394
15499a99394j699K6933J15798P6827Q127n9392J7174Q4811k7205j07628j6203
$$ -199394 -201093 -174160 -58362 18465 26592 -32800 -15626 69185 41980 -65648 -81851
15488h1851K8020p3360K7235O4389m548q2329j8076N8079N9974K1861L5409o9225
$$ -81851 -53831 -127191 -99956 -35567 -40115 -122444 -140520 -82441 -22467 -606 34803 -34422
15476c4422o4268r4085O5112J0347m6256L9854K5987n9309J6639R0466O2625M167
$$ -34422 -98690 -192775 -127663 -117316 -163572 -123718 -97731 -157040 -140401 -49935 12690 16857
15464A6857o6655k9050J0452O0827N7285N9182l8194j16184J3135K2398n58K0583
$$ 16857 -49798 -78848 -68396 -7569 49716 108898 70704 -45480 -32345 -9947 -10505 10078
15452A0078M2868l7308q6888m5968j9399Q925l4405N0281K3359M2319Q2518K6888
$$ 10078 52946 15638 -71250 -117218 -136617 -127692 -162097 -111816 -88457 -46138 36380 63268
15440F3268N3485P82o9552o5325L1189N6582N0102J5372K1707N3557n7928j53479
$$ 63268 116753 117535 47983 -17342 13847 70429 120531 135903 157610 211167 153239 -240
15428b40n3648n4776p5832P3244J30957J25799M6992l3945q6643R850r458k1043
$$ -240 -53888 -108664 -184496 -111252 19705 145504 192496 158551 71908 81758 72300 51257
15416E1257l6038p1357k9330J4563j4583L3931p2401k1945N9925J24892P3952
$$ 51257 15219 -56138 -85468 -70905 -85488 -51557 -123958 -145903 -85978 38914 112866
15405A12866J6269j35196r6640M5235J0246m2725O1224L1083k0242p3793M6926
$$ 112866 129135 -6061 -102701 -57466 -47220 -89945 -28721 2362 -17880 -91673 -44747
15394d4747R703P1775p8235o6432J6177r528q2535M9827J57140N3519m049K0630
$$ -44747 -35044 36731 -41504 -107936 -91759 -101287 -183822 -133995 23145 76664 72615 93245
15382I3245P975p9325m3036r0029O447K2756r128L8779J24124n378K5231q6842
$$ 93245 101220 21895 -21141 -111170 -104723 -81967 -91095 -52316 71808 66430 91661 4819
15370D819J7943J0532o6529m0359J22584k8607l8293P2362l2928p0389J3921O890
$$ 4819 22762 33294 -33235 -73594 48990 20383 -17910 54452 21524 -48865 -34944 -28054
15358b8054J0497l7048K9693J4190M3281m5855o2969l0369N2372R1265J22116
$$ -28054 -17557 -54605 -24912 -10722 32559 -13296 -76265 -106634 -54262 37003 159119
15347A59119k8121m8664k129M0823n0564k7726M5595l4452j7893m4058m8001n9475
$$ 159119 130998 82334 80205 121028 70464 42738 88333 53881 35988 -8070 -56071 -115546
15335a15546M694Q3342L3354L739n4920k8791n6231N7137N994k9037l4645O5644
$$ -115546 -110852 -27510 5844 9583 -45337 -74128 -130359 -73222 -67228 -96265 -130910 -65266
15323f5266k7720l4700K6937J20899l0987P624j2767k0368r9563m5605L1449M4665
$$ -65266 -92986 -127686 -100749 20150 -10837 -3213 -15980 -36348 -135911 -181516 -150067 -105402
15311a05402Q3071L603j24764m2616o9619J4749M2661P1491R863j03269k4690
$$ -105402 -22331 -18728 -143492 -186108 -255727 -240978 -198317 -126826 -116963 -220232 -244922
15300b44922Q3741N5090k0804p4407N261L6197k0761R0913P2978N3707o5085P0320
$$ -244922 -161181 -106091 -126895 -201302 -196041 -159844 -180605 -89692 -16714 36993 -28092 42228
15288D2228K1093n9485p6071J3036j01121q534J05740k3944j3271j0718K188P687
$$ 42228 63321 3836 -72235 -59199 -160320 -168854 -63114 -87058 -100329 -111047 -108859 -101172
15276a01172j01840M5538M1202P6884j8545k7021N1878K0024J902o1299N445N5219
$$ -101172 -203012 -157474 -116272 -39388 -57933 -84954 -33076 -13052 -11150 -72449 -67004 -11785
15264a1785K8016m5756q0245L6483P2044n8639p3424J2623k1989J32781R3040
$$ -11785 16231 -29525 -109770 -73287 -1243 -59882 -133306 -120683 -142672 -9891 83149
15253H3149l0903o2762o4216k0798N6124K9636n8723k1891Q0677M976M941l3033
$$ 83149 52246 -10516 -74732 -95530 -39406 -9770 -68493 -90384 -9707 -4731 210 -32823
15241c2823o850O6777m5724r719L7244l4484n733l0189P0380J7758n0899l3581
$$ -32823 -39673 27104 -18620 -28339 8905 -25579 -31312 -61501 8879 26637 -24262 -57843
15229e7843O0233N3812l5876q1955P99p74Q495J25255L8239O6710k2649o3467
$$ -57843 2390 56202 20326 -61629 -60830 -61604 -53109 72146 110385 177095 154446 90979
15217I0979q2103j28863l807K9727J0033j16882q8088L8962J62162J19891j1520
$$ 90979 8876 -119987 -123794 -94067 -84034 -200916 -289004 -250042 -87880 32011 20491
15206B0491n324k7550o620j4986l4730o2235m5728O5867R4257K2481L2865n0891
$$ 20491 15167 -12383 -19003 -33989 -68719 -130954 -176682 -110815 -16558 5923 38788 -12103
15194a2103o4101P4950p7069L0069k5645o0275M8024J40452R4787j47756j05359
$$ -12103 -76204 -1254 -78323 -48254 -73899 -134174 -86150 54302 149089 1333 -104026
15183a04026J9531P3737k0393n2298K2278j10303K2783J06356O4480J7494N0254
$$ -104026 -84495 -10758 -31151 -83449 -61171 -171474 -148691 -42335 22145 39639 89893
15172H9893q619l848j8819o5959q0145l2649j8939l952M2926Q2889L684M1706
$$ 89893 81274 77426 58607 -7352 -87497 -120146 -139085 -143037 -100111 -17222 -13538 28168
15160B8168O1299l2857J8100m1036m6002J7442l5847M1761q660L9847o4056L4701
$$ 28168 89467 56610 74710 33674 -12328 5114 -30733 11028 2368 42215 -21841 12860
15148A2860L3109K3886m7335n6025K0989N4184P141J2188j20057R3319J56449
$$ 12860 45969 69855 22520 -33505 -12516 41668 48809 60997 -59060 34259 190708
15137A90708j5670j51831p8420L8642k9174l9714J2838k9478P2094j1173P692
$$ 190708 175038 23207 -55213 -16571 -45745 -85459 -72621 -102099 -30005 -41178 -33486
15126c3486k5438n530p1973k5946M8051Q7707K6016l0720j09526r939O1774M3081
$$ -33486 -58924 -64454 -136427 -162373 -114322 -26615 -599 -31319 -140845 -150784 -89010 -45929
15114d5929N9549r4844o7674J15983N1378o6274J6783J8654p6126j5198L2970
$$ -45929 13620 -81224 -148898 -32915 18463 -47811 -31028 -12374 -88500 -103698 -70728
15103g0728K2746K371l4005m1116K567L5287k5298R2147M6157j27641K8790N2846
$$ -70728 -47982 -45611 -79616 -120732 -118165 -82878 -108176 -16029 30128 -97513 -68723 -15877
15091a5877l5735j8966K6246O8443Q174o4490p1718n966J40521J07124P3811M544
$$ -15877 -51612 -70578 -44332 24111 32285 -32205 -103923 -109889 30632 137756 211567 216111
15079B16111p7891k1545K6868P4113l8501q5055m0438q6812j65965l1275P9347
$$ 216111 138220 116675 143543 217656 179155 94100 53662 -33150 -199115 -230390 -151043
15068a51043M915l6611j1241P6644Q3566n9244j2277P0336J8513L8032K4346J4499
$$ -151043 -146128 -182739 -193980 -117336 -33770 -93014 -105291 -34955 -16442 21590 45936 60435
15056F0435m5616j2817J7058p1905J4188Q2080p5300m2456M8463O5527M8400J7439
$$ 60435 14819 2002 19060 -52845 -38657 43423 -31877 -74333 -25870 39657 88057 105496
15044A05496M5001J4550j52860j24321L8337n1207l6370K8655M6826K0192P513
$$ 105496 150497 165047 12187 -112134 -73797 -125004 -161374 -132719 -85893 -65701 -58188
15033e8188m988k6488n062j5983k280j3633J825R7913M1906l2434M6559m8151
$$ -58188 -63176 -89664 -94726 -110709 -112989 -126622 -124797 -26884 15022 -17412 29147 -19004
15021a9004m8817J3634Q3916k9108M232n0382n5827j2085K8868L9917J04325k2407
$$ -19004 -67821 -54187 29729 621 4853 -45529 -101356 -113441 -84573 -44656 59669 37262
15009C7262j1228J6427n1254k1690K1928J3216L134q4377J1543O5094o6580r7931
$$ 37262 26034 42461 -8793 -30483 -8555 4661 7795 -76582 -65039 55 -66525 -164456
14997a64456J1352J1603K9046q538K7058L057l7576J5524N9012J6174P7925N8740
$$ -164456 -153104 -141501 -112455 -120993 -93935 -90878 -128454 -112930 -53918 -37744 40181 98921
14985I8921m5492j56534m2226k4046j5180J07950R1425k9477p5992O820j2062
$$ 98921 53429 -103105 -145331 -169377 -184557 -76607 14818 -14659 -90651 -83831 -95893
14974i5893K314k9487P1542J2074k9712K3335j8661m4541N3141j5843P82Q3430
$$ -95893 -93579 -123066 -51524 -39450 -69162 -45827 -64488 -109029 -55888 -71731 -70949 12481
14962A2481n0670L3049M4535m6094l7208N7951P6665J73537J6258o0622o9496
$$ 12481 -38189 -5140 39395 -6699 -43907 14044 90709 264246 280504 219882 150386
14951A50386n749N7899j0970l0024l1469k1234m5854J5435j12332q9905J4649
$$ 150386 144637 202536 191566 161542 130073 108839 62985 78420 -33912 -123817 -109168
14940a09168Q675Q2135N6842m8429l2624Q8062J08294J3601j6848m5233q4934
$$ -109168 -100493 -18358 38484 -9945 -42569 45493 153787 167388 150540 105307 20373
14929B0373k0461N9789O9423N137J4105P5502r0880p5919q0801o8625J9515L1370
$$ 20373 -88 59701 129124 134261 148366 223868 132988 57069 -23732 -92357 -72842 -41472
14917d1472N2405L8130q956j27551p311K3701K2482N5021j481M418R442K7475
$$ -41472 10933 49063 40107 -87444 -94755 -71054 -48572 6449 4968 9386 18828 46303
14905D6303l3374j3515j1614o4788J2225r917j0847J41738L1336j20367o5451
$$ 46303 12929 -586 -12200 -76988 -64763 -74680 -85527 56211 87547 -32820 -98271
14894i8271l9148R05J2399K0221J02359O2377n6461m4258n2922m1076Q971O4873
$$ -98271 -137419 -136514 -124115 -103894 -1535 60842 4381 -39877 -92799 -133875 -124904 -60031
14882f0031J143q0140P505J11681J5849j49409O5148L9869K5452r0519K5204Q4624
$$ -60031 -58888 -139028 -131523 -19842 -3993 -153402 -88254 -48385 -22933 -113452 -88248 -3624
14870c624M8832p4476k5141O1244k877j23926n9627M5191P1432K8905R6567J00951
$$ -3624 45208 -29268 -54409 6835 3958 -119968 -179595 -134404 -62972 -34067 62500 163451
14858A63451R075k2319K5366M0778j50341l6646q152l653j05276L8848k6394j21249
$$ 163451 172526 150207 175573 216351 66010 29364 21212 17559 -87717 -48869 -75263 -196512
14846a96512Q2942R8110J0459q0587n6123J854R6831Q2703q122J8059M8988m2312
$$ -196512 -113570 -15460 -5001 -85588 -141711 -139857 -43026 39677 31555 49614 98602 56290
14834E6290o0046j18958k66J0641n2198L1788K9386l0078J6541j4016K1266R8616
$$ 56290 -3756 -122714 -122980 -112339 -164537 -132749 -103363 -133441 -116900 -130916 -109650 -11034
14822a1034Q0883j11396j49160n82M8534M8210m9413r3764N3431J21112M0377
$$ -11034 69849 -41547 -190707 -191289 -142755 -94545 -143958 -237722 -184291 -63179 -22802
14811b2802L0919j25933l193k0890N0134J40009K8772p7154N7643j565n0358J53
$$ -22802 8117 -117816 -121009 -141899 -91765 48244 77016 -138 57505 55940 5582 5735
14799E735J571L938n5951K5755M2986n6928N249J7985m6700o2886K3658R4096
$$ 5735 7306 11244 -44707 -18952 24034 -32894 -27645 -9660 -56360 -119246 -95588 -1492
14787a492o1246j56847K0257K3151j8541N5334L7648M8538Q6485o3570o9911j02007
$$ -1492 -62738 -219585 -199328 -176177 -194718 -139384 -101736 -53198 33287 -30283 -100194 -202201
14775b02201o0783J22984O2191j7573K6164L2427J4355P688M0238J1394o7154
$$ -202201 -262984 -140000 -77809 -95382 -69218 -36791 -22436 -14748 25490 36884 -30270
14764c0270N9646l3366j13380M2220P0464l4021R3031M7192L1831J3100P444l1532
$$ -30270 29376 -3990 -117370 -75150 -4686 -38707 54324 101516 133347 146447 153891 122359
14752A22359J6494o4085n0316m5511J5706Q9755P1489J052q532o8388n0075l7949
$$ 122359 138853 74768 24452 -21059 -5353 84402 155891 156943 148411 80023 29948 -8001
14740h001j7680n2915j6035N733J8931m3117R5664K3012J07473N4966k9068M0293
$$ -8001 -25681 -78596 -94631 -88898 -69967 -113084 -17420 5592 113065 168031 138963 179256
14728A79256r9104j9582O2991k2504j6329j45130K2391j2303l3091K2379J22768
$$ 179256 80152 60570 123561 101057 84728 -60402 -38011 -50314 -83405 -61026 61742
14717F1742r1275o5755k4194M4866P3998L7089j346l0247j12655P2194O0453K821
$$ 61742 -29533 -95288 -119482 -74616 -618 36471 35125 4878 -107777 -35583 24870 27691
14705B7691k9890n9497J1496Q9662J299J5982m946j10316l8278j111j1855N6585
$$ 27691 -2199 -61696 -50200 39462 40761 56743 51797 -58519 -96797 -97908 -109763 -53178
14693e3178M2930p3673q0358o2053L2388J9319Q1811N6567L9281M4169m823L6518
$$ -53178 -10248 -83921 -164279 -226332 -193944 -174625 -92814 -36247 3034 47203 42380 78898
14681G8898n8658r0511Q1566n0074k8094m1922m4045R1341R8699J0751o3433J2199
$$ 78898 20240 -70271 11295 -38779 -66873 -108795 -152840 -61499 37200 47951 -15482 -3283
14669c283j320n9322m9351q5220r449J19693M9829J399o4247N389L2632P1320
$$ -3283 -4603 -63925 -113276 -198496 -207945 -88252 -38423 -37024 -101271 -95882 -63250 8070
14657H070L8831M5155P794q2407n8687q6543l602M0269k2772O2977J51370J6931
$$ 8070 46901 92056 99850 17443 -41244 -127787 -131389 -91120 -113892 -50915 100455 117386
14645A17386j31457l4126P9506K0882J9005r2437k5196R3420P5191o1150k3437
$$ 117386 -14071 -48197 31309 52191 71196 -21241 -46437 46983 122174 61024 37587
14634C7587j311m33K363n227j00231n8928k0550j4766R6525L5970K5017P1515
$$ 37587 36276 35843 38206 32979 -67252 -126180 -146730 -161496 -64971 -29001 -3984 67531
14622F7531q0139m7676k2661K3245J9369K2395N6647m818M5852m258M7101N1409
$$ 67531 -12608 -60284 -82945 -59700 -40331 -17936 38711 33893 79745 75487 122588 173997
14610A73997j6732n6686l0797p9765l4993L511L7862R3374L8707q3012p9129M7835
$$ 173997 157265 100579 69782 -9983 -44976 -41465 -3603 89771 128478 45466 -33663 14172
14598A4172M6505q2984j27854l1094N0968N0644J8611K2941K5359j7115k9086
$$ 14172 60677 -22307 -150161 -181255 -130287 -79643 -61032 -38091 -12732 -29847 -58933
14587e8933N0787k910n930L7866L0771k0044m5996O0359L0059j7190j79324j3932
$$ -58933 -8146 -11056 -16986 20880 51651 31607 -14389 45970 76029 58839 -120485 -134417
14575a34417O2167J29194P7805j25319k6837J28151P7846r0987j29552L6035l1265
$$ -134417 -72250 56944 134749 9430 -17407 110744 188590 97603 -31949 4086 -27179
14564b7179m6995L5735K6093O7601j0916Q362l7954J2518P431k4947M6381j0724
$$ -27179 -74174 -38439 -12346 55255 44339 52701 14747 27265 34696 9749 56130 45406
14552D5406L7084P0719K7924l919p193n309K3745M454l8559l5974L6182l5160
$$ 45406 82490 153209 181133 177214 170021 164712 188457 192911 154352 118378 154560 119400
14540A19400m2042k1370L0885r8991l5734L2787N8612L04J8349K075J5550l5982
$$ 119400 77358 55988 86873 -12118 -47852 -15065 43547 43851 62200 64275 79825 43843
14528D3843q0721m0205P0233K4799q3295r2644N1310M8588O2590j2228m3091L8517
$$ 43843 -36878 -77083 -6850 17949 -65346 -157990 -106680 -58092 4498 -7730 -50821 -12304
14516a2304L4448j2529m8265R194o4754n0230k7519Q2203O0282j2834j6334J84213
$$ -12304 22144 9615 -38650 -29456 -94210 -144440 -171959 -89756 -29474 -42308 -58642 125571
14504A25571R03J8305p9862n8029J1475P1538M6996r7237k6518Q4947L7903k6186
$$ 125571 126474 144779 64917 6888 18363 89901 136897 39660 13142 98089 135992 109806
14492A09806j2334n2062K0131M3615l2334q50J25980O6359j06423r4009o0063
$$ 109806 97472 45410 65541 109156 76822 75972 201952 268311 161888 67879 7816
14481G816Q370k4441n8851p5787l3186K3325N5240j1258P4986J03240J0313j8680
$$ 7816 16186 -8255 -67106 -142893 -176079 -152754 -97514 -108772 -33786 69454 79767 61087
14469F1087n6149J7709J7431l3020J6170n6227N698J3639P0481J5041L5067M1273
$$ 61087 4938 22647 40078 7058 23228 -32999 -27301 -13662 56819 71860 106927 148200
14457A48200j4506m2740n9721n2658O5474q60L384j1088O2447L2631q4143M044
$$ 148200 133694 90954 31233 -21425 44049 43189 46573 35485 97932 130563 46420 50464
14445E0464j7075n9351M5018R5319m2115q8852Q325K3758q0193K0657L1339k8128
$$ 50464 33389 -25962 19056 114375 72260 -16592 -8267 15491 -64702 -44045 -12706 -40834
14433d0834L8348j6611j7459M1598O8228L5041p3644N4209l4834m4355J28685
$$ -40834 -2486 -19097 -36556 5042 73270 108311 34667 88876 54042 9687 138372
14422A38372L5200p5384j45334l9589Q6824l717l7083k6909L5934m3582q408J7663
$$ 138372 173572 98188 -47146 -86735 89 -3628 -40711 -67620 -31686 -75268 -83676 -66013
14410f6013M8693p0686j6668J79439J42273l2330p1601m8293l8241r954j0615
$$ -66013 -17320 -88006 -104674 74765 217038 184708 113107 64814 26573 16619 6004
14399F004K5421o408l2873o2044Q3752l2368n7247L9761M0920k5755m9285L2773
$$ 6004 31425 25017 -7856 -69900 13852 -18516 -75763 -36002 4918 -20837 -70122 -37349
14387c7349p294J0889R2051O4483m0949P294p0751m2682N3017o5684p749j4481
$$ -37349 -44643 -33754 58297 122780 81831 89125 18374 -24308 28709 -36975 -44724 -59205
14375e9205N988j6796J1017J67676J6802n6258j08937j1522K6237Q618j6696o4342
$$ -59205 -53217 -70013 -58996 108680 125482 69224 -39713 -51235 -24998 -16380 -33076 -97418
14363i7418J39899N8809m2148o4148L5178l8983J2139J4696Q706l0180n6693q5457
$$ -97418 42481 101290 59142 -5006 30172 -8811 3328 18024 26730 -3450 -60143 -145600
14351a45600N3216L0129P0221o042l0811J7049M35m2734J1247j17771L198O4509
$$ -145600 -92384 -62255 7966 1924 -28887 -11838 -11403 -54137 -42890 -160661 -157463 -92954
14339i2954j742M9835R789Q662L3567k5699j56161l6106M5942J1159k1065Q3948
$$ -92954 -94696 -44861 -35072 -26410 7157 -18542 -174703 -210809 -164867 -153708 -174773 -90825
14327i0825Q1966K0794l6748M0524n9746k0063M3794p487m3211K8161m2573j19121
$$ -90825 -8859 11935 -24813 15711 -44035 -64098 -20304 -27791 -71002 -42841 -85414 -204535
14315b04535J8105J01128P0449L4902p008n7525k3567N7390Q5125p76j00480K4496
$$ -204535 -186430 -85302 -14853 20049 13041 -44484 -68051 -10661 74464 73688 -26792 -2296
14303b296L9996m5255n2440K8206q7598K8516Q8324Q968M1197K3507j8730n3547
$$ -2296 37700 -7555 -59995 -31789 -119387 -90871 -2547 6421 47618 71125 52395 -1152
14291a152j01817R5221Q7818l5781q1100j90K4464k8198m2222l5084l3753K436
$$ -1152 -102969 -7748 80070 44289 -36811 -37001 -12537 -40735 -82957 -118041 -151794 -149358
14279a49358J09856J9103q220K6599K6214N3694q0752l8461m1387o2941j8248
$$ -149358 -39502 -20399 -28619 -2020 24194 77888 -2864 -41325 -82712 -145653 -163901
14268a63901O349l953P0229L1942l707j050l6250L2070J7525m9613M0079J12885
$$ -163901 -157552 -161505 -91276 -59334 -63041 -64091 -100341 -68271 -50746 -100359 -60280 52605
14256E2605m4416q0519j2408L510N3205L0576m0449K6428k2582N1885J7173k3346
$$ 52605 8189 -72330 -84738 -81228 -28023 2553 -37896 -11468 -34050 17835 35008 11662
14244A1662n9811m0210Q713J08224o7849p6184O2710l2072J5300N4575P389K3991
$$ 11662 -48149 -88359 -79646 28578 -39271 -115455 -52745 -84817 -69517 -14942 -7553 16438
14232A6438P9365Q8872j7637q8312n8585q704n4093n4649J29575J6478q9080L5246
$$ 16438 95803 184675 167038 78726 20141 11437 -42656 -97305 32270 48748 -40332 -5086
14220e086N0725M4111j5171o5807j13957L4523J2045K9637j11640l2193J14162
$$ -5086 45639 89750 74579 8772 -105185 -70662 -58617 -28980 -140620 -172813 -58651
14209e8651M6927P8653k2165L684K4217m7589k7232m3459j1695J5666M6272O355
$$ -58651 -11724 66929 44764 48448 72665 25076 -2156 -45615 -57310 -41644 4628 10983
14197A0983j2089Q3741l8004o5000J05626J19687J6638j16582p7281o9958N2683
$$ 10983 -1106 82635 44631 -20369 85257 204944 221582 105000 27719 -42239 10444
14186A0444K7614L284K3808j19686r7695J5216J0084J13226R739m4607N297R856
$$ 10444 38058 41342 65150 -54536 -152231 -137015 -126931 -13705 -3966 -48573 -43276 -33420
14174c3420M1995L059j8056J9099p8092j3975L8542k8950o1350M5542j1019k7983
$$ -33420 8575 11634 -6422 12677 -65415 -79390 -40848 -69798 -131148 -85606 -96625 -124608
14162a24608o698O7549K1539j3168K5148J4370m8654p271M3076P3698M6119J4852
$$ -124608 -131306 -63757 -42218 -55386 -30238 -15868 -64522 -71793 -28717 44981 91100 105952
14150A05952o7690K1094L268j251n5150k9631j0025L1351R6843N6080r8149m3694
$$ 105952 38262 59356 62624 61373 6223 -23408 -33433 -2082 94761 150841 52692 8998
14138H998p3728j4838N626m3579K3393J6992M2585j397J0042o6801O1239Q7854
$$ 8998 -64730 -79568 -73942 -117521 -94128 -77136 -34551 -35948 -25906 -92707 -31468 56386
14126E6386o7792r2328J6648J31600Q6090j5301N0679L4881j02982r8479K5056
$$ 56386 -11406 -103734 -87086 44514 130604 115303 165982 200863 97881 -598 24458
14115B4458m1356N6245n1929o1785M4893k8718l7443L3778Q4603J4396N769n0630
$$ 24458 -16898 39347 -12582 -74367 -29474 -58192 -95635 -61857 22746 37142 42911 -7719
14103g719O4425M0748l4685M0619P0951n9439j17650P0043J14130k9545k7753
$$ -7719 56706 97454 62769 103388 174339 114900 -2750 67293 181423 151878 124125
14092A24125L0572m3129k373l5681l1298r350r1532m2979R2739P8490R3021j1491
$$ 124125 154697 111568 109195 73514 42216 32866 -58666 -101645 -8906 69584 162605 151114
14080A51114q3764q1061m1899N0905K9597o109o2560o6603J1135R4691k4124l4190
$$ 151114 67350 -13711 -55610 -4705 24892 18783 -43777 -110380 -99245 -4554 -28678 -62868
14068f2868n1252N1522Q3169l0166j8374L4259m014k6269M3557P8772k0051J02977
$$ -62868 -114120 -62598 20571 -9595 -27969 6290 2276 -23993 19564 98336 78285 181262
14056A81262n585m1181k9839r9647j979K2893k013k8089j7465K7923n533j0298
$$ 181262 175677 134496 104657 5010 3031 25924 23911 -4178 -21643 6280 747 -9551
14044i551m102k2958k0224l6077P0407J1774m3930m4675L226R8282K6228K1479
$$ -9551 -13653 -36611 -56835 -92912 -22505 -10731 -54661 -99336 -96110 2172 28400 49879
14032D9879j2197j6010j5766k781p3599r103K3469J1235N4364j5920j18728o3914
$$ 49879 37682 21672 5906 3125 -70474 -79577 -56108 -44873 9491 -6429 -125157 -189071
14020a89071k1736N1852R6859R1400j44425n3377P5652O454N5219j6888l9809
$$ -189071 -210807 -158955 -62096 29304 -115121 -168498 -92846 -86392 -31173 -48061 -87870
14009h7870N5805M2842k4522n0195j17629O576J9874R2985P9293M7785k5300j2757
$$ -87870 -32065 10777 -13745 -63940 -181569 -174993 -155119 -62134 17159 64944 39644 26887
13997B6887r497j12258k7655K7462j4250M0175J50950k0929q7410o7378L7301
$$ 26887 17390 -94868 -122523 -95061 -109311 -69136 81814 60885 -26525 -93903 -56602
13986e6602J43131M600j21322m9598m7198r1758j7699Q9701J4687k3107P1090
$$ -56602 86529 91129 -30193 -79791 -126989 -218747 -236446 -146745 -132058 -155165 -84075
13975h4075Q0200l9240l237K6043L3280Q3630M6967o730o111J2132l2040o5001
$$ -84075 -3875 -43115 -46352 -20309 12971 96601 143568 136838 130727 142859 110819 45818
13963D5818j04525j0357j2317r4102l1151N6921L2002l5707J33992P7377K8053
$$ 45818 -58707 -69064 -81381 -175483 -206634 -149713 -117711 -153418 -19426 57951 86004
13952H6004j1195M176J777N4J9640k004k0050n240k9249k4339l9605K5439M5091
$$ 86004 74809 78985 80762 80816 100456 98452 78402 73162 43913 19574 -20031 5408 50499
13939E0499n422l3507m2111n9549p93Q8663l2890k6059M5303j0892j7091l105
$$ 50499 45077 11570 -30541 -90090 -90883 -2220 -35110 -61169 -15866 -26758 -43849 -46954
13927d6954m0328n2738j6424L3826l1506Q1539J8204J3932p6093O529K3157J1523
$$ -46954 -87282 -140020 -156444 -122618 -154124 -72585 -54381 -40449 -116542 -110013 -86856 -75333
13915g5333P6297L1551J475l9753o4112N9838O915m356m5416J36205J8346l532
$$ -75333 964 32515 33990 -5763 -69875 -10037 -3122 -7478 -52894 83311 101657 98125
13903I8125K5051l2069j02601m316L6439N4290M3712l7285r7994K306L1743O8399
$$ 98125 123176 91107 -11494 -15810 20629 74919 118631 81346 -16648 -14342 17401 85800
13891H5800k5305n0995r627L0439n1598L9662K3896K3646M1623j14907m9419p107
$$ 85800 60495 9500 -127 30312 -21286 18376 42272 65918 107541 -7366 -56785 -63892
13879f3892M7231j422M6730P297m5905m6280M8584N8116J3654N7096j8399m8020
$$ -63892 -16661 -18083 28647 35944 -9961 -56241 -7657 50459 64113 121209 102810 54790
13867E4790p9448P4620O8543M4473j4321J2142P3088o2183r3780M1650j01818
$$ 54790 -24658 49962 118505 162978 148657 160799 233887 171704 77924 119574 17756
13856A7756p2055K4642L7840O6518j1008k6599q9203n0041J3732L9043N9164j3627
$$ 17756 -54299 -29657 8183 74701 63693 37094 -52109 -102150 -88418 -49375 9789 -3838
13844c838o0885K3252N3911l4175l1087L2805M070k8482m3409n3073j6449Q3288
$$ -3838 -64723 -41471 12440 -21735 -52822 -20017 -15947 -44429 -87838 -140911 -157360 -74072
13832g4072L870O5380q5577j7515M5370k8578P6242N1820k2097l7910o2019l0077
$$ -74072 -70202 -4822 -90399 -107914 -62544 -91122 -14880 36940 14843 -23067 -85086 -115163
13820a15163J8628J75448L923p8983M8230N0370p2090j5304o025k8141K4188N7330
$$ -115163 -96535 78913 82836 3853 52083 102453 30363 15059 9034 -19107 5081 62411
13808F2411k306l4001K62R6211J21920O9565j21966j06034j2929O3571K4921M2304
$$ 62411 60105 26104 26366 122577 244497 314062 192096 86062 73133 136704 161625 203929
13796B03929k2135j18747m4790j9576R6155l8133n6877J4115j379j2021K588k3860
$$ 203929 181794 63047 18257 -1319 94836 56703 -174 13941 12562 541 3129 -20731
13784b0731Q1495l2941m4151k0400M6466L540q855L0836K6760P7799k5501J8756
$$ -20731 60764 27823 -16328 -36728 9738 13278 4423 35259 62019 139818 114317 133073
13772A33073m3309r0185n5529P2982j7247L85r342o999K0205N2396l0491L923
$$ 133073 89764 -421 -55950 17032 -215 170 -9172 -16171 4034 56430 25939 29862
13760B9862L9640J6276L0895k1311M0685l7842L6951N3190k291J0666K5907j23486
$$ 29862 69502 85778 116673 95362 136047 98205 135156 188346 186055 196721 222628 99142
13748I9142j77248m8646j8921Q7428P7943J01987k5704m6869O0832m3853J1117
$$ 99142 -78106 -126752 -145673 -58245 19698 121685 95981 49112 109944 66091 77208
13737G7208j56037q3539M5455J03720o2741k6714J9615Q2180J43445p9252j0641
$$ 77208 -78829 -162368 -116913 -13193 -75934 -102648 -83033 -853 142592 63340 52699
13726E2699Q7427M2888K8507m1312m6160m057n9564l268N4616j3002k1406j35986
$$ 52699 140126 183014 211521 170209 124049 119992 60428 57160 111776 98774 77368 -58618
13714e8618j5303j093J280L2731n3388K9977L0989k0306o5675j20748j9842O4035
$$ -58618 -73921 -75014 -73734 -41003 -94391 -64414 -33425 -53731 -119406 -240154 -259996 -195961
13702a95961N0139R4390Q061j30407O3516Q6418P2058J4981l2460M1426k5055
$$ -195961 -145822 -51432 -43371 -173778 -110262 -23844 48214 63195 30735 72161 47106
13691D7106j3119L4223o7420j7409p201k5754n181J39182L1368p2582m594P69
$$ 47106 33987 68210 790 -16619 -23820 -49574 -54755 84427 115795 43213 38619 39388
13679C9388j6536L0343j9792P927M5812n2931j04759o5834P1803J22289R9963
$$ 39388 22852 53195 33403 41330 87142 34211 -70548 -136382 -64579 57710 157673
13668A57673q4037o7447M0701K9092p9878r5925J8041J29625M7794l7729K2162
$$ 157673 73636 6189 46890 75982 -3896 -99821 -81780 47845 95639 57910 80072
13657H0072o8681o7245L7601K8436J3599L7879J47060k6581n5507q0072j02422
$$ 80072 11391 -55854 -18253 10183 23782 61661 208721 182140 126633 46561 -55861
13646e5861M0833j2261p1046L1815l0570j06593M9943Q9660K7428L276m8671N0464
$$ -55861 -15028 -27289 -98335 -66520 -97090 -203683 -153740 -64080 -36652 -33376 -82047 -31583
13634c1583Q1498P6322l8898j09588Q1137J10576J897M5436J3345j57227j27475
$$ -31583 49915 126237 87339 -22249 58888 169464 171361 216797 230142 72915 -54560
13623e4560M0629j2985Q8802m398r693M3296q8002r9580n879L2428O465k908q0768
$$ -54560 -13931 -26916 61886 57488 47795 91091 3089 -96491 -102370 -69942 -63477 -66385 -147153
13610a47153k8048Q6711L7763k0378j6853Q709M6307P1860P5002n7931q2740j8955
$$ -147153 -175201 -88490 -50727 -71105 -87958 -79249 -32942 38918 113920 55989 -26751 -45706
13598d5706N0831L3969q9659m0527K7680L3978O1216l2583P1108Q9184L2460n6814
$$ -45706 5125 39094 -50565 -91092 -63412 -29434 31782 -801 70307 159491 191951 135137
13586A35137k1649m7573m1817j3461j1792K2666M2383N3140k0440l3187m9376
$$ 135137 113488 65915 24098 10637 -1155 21511 63894 117034 96594 63407 14031
13575A4031M9442l1403M1770J46705Q227N154J08942L3657l6419m3288j7149j60776
$$ 14031 63473 32070 73840 220545 228772 233926 342868 376525 340106 296818 279669 118893
13563A18893K3588L5355K5129j2955q1324r1Q6894m060k6567Nn5103o8312n0020
$$ 118893 142481 177836 202965 190010 108686 108595 195489 191429 164862 164867 109764 41452 -8568
13550h568N8112J6557J24R2222K9457Q577k8351l4142n8542k6820l839j3351j00420
$$ -8568 49544 66101 66225 158447 187904 196481 168130 133988 75446 48626 44787 31436 -68984
13537f8984M151J14663m4362m4693J3194P7431O0322J8127j48595n8770L8089
$$ -68984 -64833 49830 5468 -39225 -26031 51400 111722 129849 -18746 -77516 -39427
13526c9427m4011k8214K2044M7509J01125L1927j12724O5647J02694k7563O790
$$ -39427 -83438 -111652 -89608 -42099 59026 90953 -21771 43876 146570 119007 125797
13515A25797r6421J3406O9735J3183n9432j9730K2518l8978q8769K6427n6132
$$ 125797 29376 42782 112517 125700 66268 46538 69056 30078 -58691 -32264 -88396
13504h8396o9193k7403L683O9717J0890N6149j9669P5567K4193l0871j9956Q085
$$ -88396 -157589 -184992 -181309 -111592 -100702 -44553 -64222 11345 35538 4667 -15289 -7204
13492g204l0981K632m7695j1402m6272l6963J26781J3736j1695r465j20676L8032
$$ -7204 -38185 -35553 -83248 -94650 -140922 -177885 -51104 -37368 -49063 -58528 -179204 -141172
13480a41172M2972K8982J9096K5261p4593k9417O8592J23822m0976l982J06011
$$ -141172 -98200 -69218 -50122 -24861 -99454 -128871 -60279 63543 22567 18585 124596
13469A24596J5324m3475n0294r9420N4478m6095p089N6341J25007o173l8676K1068
$$ 124596 139920 96445 46151 -53269 1209 -44886 -51975 4366 129373 123200 84524 105592
13457A05592P4713j55486j5665o5739k3066Q2012L6657J4159j47028O5112J05939
$$ 105592 180305 24819 9154 -56585 -79651 2361 39018 53177 -93851 -28739 77200
13446G7200k5180q7331M406m0135m956M1024J01411m4625M4477P5675L4792q9650
$$ 77200 52020 -35311 -30905 -71040 -75996 -34972 66439 21814 66291 141966 176758 87108
13434H7108o1721r374K3380L0497Q4000N8744j0592j0469j0326r8960o8826O3438
$$ 87108 25387 16013 39393 69890 153890 212634 202042 191573 181247 82287 13461 76899
13422G6899M3405K0905l9256l8072o9068J9755m7910j11864P9773N6905n1720
$$ 76899 120304 141209 101953 63881 -5187 14568 -33342 -145206 -65433 -8528 -60248
13411f0248O4142P9843P6762L650j51615r9881j1240K9413J6894K7181J8362m0121
$$ -60248 3894 83737 160499 164149 12534 -87347 -98587 -69174 -52280 -25099 -6737 -46858
13399d6858k4142L4736R5401O4730j09377r6491M7847L2835k7619o9267J12904
$$ -46858 -71000 -36264 59137 123867 14490 -82001 -34154 -1319 -28938 -98205 14699
13388A4699N3786L7879o604J1970Q9687k3158o7240l9995l7913n2205P0180L5915
$$ 14699 68485 106364 99760 111730 201417 178259 111019 71024 33111 -19094 51086 87001
13376H7001K8172l9964K0739K5915N5984K8842j52638j8580o5852P1366N4915
$$ 87001 115173 75209 95948 121863 177847 206689 54051 35471 -30381 40985 95900
13365I5900j1912M3437l7738J6830n7234p2611l6841k7951L3165P7555j9861M8483
$$ 95900 83988 127425 89687 106517 49283 -23328 -60169 -88120 -54955 22600 2739 51222
13353E1222J08677K1640n6665l4322p8672p0951K3751l4740j32354n370J17393
$$ 51222 159899 181539 124874 90552 11880 -59071 -35320 -70060 -202414 -207784 -90391
13342i0391K6864M5832m2771n9242J8060Q2313m8533k4762L7042J4060r363Q4989
$$ -90391 -63527 -17695 -60466 -119708 -101648 -19335 -67868 -92630 -55588 -41528 -50891 34098
13330C4098J03947j3869M7101O5868q932q5697J3367o12J08566k0371o5653N6702
$$ 34098 138045 124176 171277 237145 228213 142516 155883 155271 263837 243466 177813 234515
13318B34515k0282p9566M952r281l2586r7653J0011J08605J2925k5611m4955L4857
$$ 234515 214233 134667 139619 130338 97752 99 10110 118715 131640 106029 61074 95931
13306I5931l1934M098O4157j18570o9130P3433r7107M148L8505J3297O8759R3147
$$ 95931 63997 68095 132252 13682 -55448 17985 -79122 -74974 -36469 -23172 45587 138734
13294A38734M1999j162r7164n7909N1613P7037M628l617l7431n0614q236L9483
$$ 138734 180733 179571 82407 24498 76111 153148 157776 154159 116728 66114 57878 97361
13282I7361J9301K7437L3977n1053k7747l09j3691O5133J6192m23L7332q5904
$$ 97361 116662 144099 178076 127023 99276 98967 85276 150409 166601 166178 203510 117606
13270A17606o5490k1787q574j3362J0264j6697n0337L1817n3576p6112R7402k8992
$$ 117606 52116 30329 21755 8393 18657 1960 -48377 -16560 -70136 -146248 -48846 -77838
13258g7838k5530Q1561J12718O2742J1310K7170q2011k9347L0269k2086M4723
$$ -77838 -103368 -21807 90911 153653 164963 192133 110122 80775 111044 88958 133681
13247A33681R3510m0031q1547N44Q4057J07706L3521o4699o5151J0933J735j7091
$$ 133681 227191 187160 105613 106157 190214 297920 331441 266742 201591 212524 214259 197168
13235A97168m8574o1106o0754L165N8476l8848p2303N2333M6197Q896l1437L9836
$$ 197168 148594 87488 26734 29899 88375 49527 -22776 29557 75754 84650 53213 93049
13223I3049L5145L2713P5861k8592o1806m8026m2651r9108M0861J9717j6983j1817
$$ 93049 128194 160907 236768 208176 146370 98344 55693 -43415 -2554 17163 180 -11637
13211a1637K4105J06524p0793j01297R0779P2300K9809j4554j5589r252k2615
$$ -11637 12468 118992 48199 -53098 37681 109981 139790 125236 109647 100395 77780
13200G7780r154n8906k3441k9309j1614N7417J43581J04110n4157j69743L1959
$$ 77780 68626 9720 -13721 -43030 -54644 2773 146354 250464 196307 26564 58523
13189E8523J18704m3216p6519m6122j080K2161Q3466N3181n2256j18336K372K5620
$$ 58523 177227 134011 57492 11370 10290 32451 115917 169098 116842 -1494 878 26498
13177B6498p1700k2768j885J4595R7194J16444N521L5418Q022m5888R1763L1168
$$ 26498 -45202 -67970 -69855 -55260 41934 158378 163899 199317 207339 161451 253214 284382
13165B84382m3925m5142n1398l365k2768k2431J351l8711P5603l525R0254K653
$$ 284382 240457 195315 143917 140552 117784 95353 96704 57993 133596 130071 220325 222978
13153B22978l7541p602n2477j5257K8785K5608j25542j01656j8298Q4136M9077
$$ 222978 185437 177835 125358 110101 138886 164494 38952 -62704 -81002 3134 52211
13142E2211R6538j5538o4843q9946j3233M2559o631o619p3895L7759P6494P6307
$$ 52211 148749 133211 68368 -21578 -34811 7748 1117 -5502 -79397 -41638 34856 111163
13130A11163K774L8321J274m2631o7193K7309P1567R4543O4419j26171r4038j9938
$$ 111163 113937 152258 153532 110901 43708 71017 142584 237127 301546 175375 81337 61399
13118F1399L7368N7282m3440k6033K4401J6278k2811m2276J60014K0022M1746
$$ 61399 98767 156049 112609 86576 110977 127255 104444 62168 222182 242204 283950
13107B83950J7393o3030j27454k4307J01884J7936l2721j260n745n4891L8967
$$ 283950 301343 238313 110859 86552 188436 206372 173651 172391 166646 111755 150722
13096A50722Q2125j04797j29552J7338Q8058p1416m1673K4310J37652j488j6996
$$ 150722 232847 128050 -1502 15836 103894 32478 -9195 15115 152767 151279 134283
13085A34283L3441L360L3707l8395N3392R0186J8779k0828Q53n6314n7826l0480
$$ 134283 167724 171084 204791 166396 219788 309974 328753 307925 308778 252464 194638 164158
13073A64158r9514p8925M6653Q515Q5587R2287l6092o3656M1350M1166J6281O6926
$$ 164158 64644 -14281 32372 40887 126474 218761 182669 119013 160363 201529 217810 284736
13061B84736p572o881k7163o9051J9368n351M8268J5082P696r3754m5510k628
$$ 284736 277164 270283 243120 174069 193437 188086 236354 251436 259132 165378 119868 117240
13049A17240N3644O2889j23118q2538M1148R0664r4975m6867N6216J075k784J31058
$$ 117240 170884 233773 110655 28117 69265 159929 64954 18087 74303 75378 72594 203652
13037B03652n1996k3984l7489j9650m5388N7421J21188o1299N8979r771q2978
$$ 203652 151656 127672 90183 70533 25145 82566 203754 142455 201434 191663 108685
13026A08685m0173k489J00017L0790R88N3122n1656n0817N3213O6919l5181j14507
$$ 108685 68512 66023 166040 196830 197818 250940 199284 148467 201680 268599 233418 118911
13014A18911r8568n3210M7847P3733r4500j29336J4235P2876K8319J3493R6809
$$ 118911 20343 -32867 14980 88713 -5787 -135123 -120888 -48012 -19693 -6200 90609
13003I0609N039j9985o1387q234l2876K3612Q794l2379p606P4754r130j02517
$$ 90609 95648 75663 14276 6042 -26834 -3222 5572 -26807 -34413 40341 31211 -71306
12991g1306m0618P8065J03704O6932Q5716O0714j0535o1917p8740L2016q0139
$$ -71306 -111924 -33859 69845 136777 222493 283207 272672 210755 132015 164031 83892
12980H3892j6502J1077O1421L4546q3634p4233p8232n2474L13P2775k7243M914
$$ 83892 67390 78467 139888 174434 90800 16567 -61665 -114139 -113826 -41051 -68294 -63380
12968f3380N5393O8563J35989l1485r8709O454m349m1822k9560P951j8176j2591
$$ -63380 -7987 60576 196565 165080 66371 72825 68476 26654 -2906 5045 -13131 -25722
12956b5722k0488j6600L6923M5374K5576K0028J40603P7067j11646j48893J6743
$$ -25722 -46210 -62810 -25887 19487 45063 65091 205694 282761 171115 22222 38965
12945C8965P7639p0873r3554l118N2606J18882L254N2551j4387K496n6625k4808
$$ 38965 116604 45731 -47823 -50941 1665 120547 123801 176352 161965 164461 107836 83028
12933H3028j1355J520o4072q773j8613J0951j9594M5114Q2228o869R884o0114
$$ 83028 71673 73193 9121 348 -18265 -7314 -26908 18206 100434 93565 103449 43335
12921D3335L3421l3287P8904K6122J5610k0890k0792Q18m105l9404k0548O5185
$$ 43335 76756 43469 122373 148495 164105 143215 122423 123241 119136 79732 59184 124369
12909A24369j0905q7932o2476J5154J45281m5510j5593Q8908M1226o5473l1661
$$ 124369 113464 25532 -36944 -21790 123491 77981 62388 151296 192522 127049 95388
12898I5388l4792l3770L2812j54083J8491J1899N4018K2585J2173R0587N1752
$$ 95388 60596 26826 59638 -94445 -75954 -64055 -10037 12548 24721 115308 167060
12887A67060l7345p8274r1393P69P7420J32748K8043ko454p4168l1367N5724J10993
$$ 167060 129715 51441 -39952 -39183 38237 170985 199028 199026 192572 118404 87037 142761 253754
12874B53754j12242j01607L9218j3714J7005m372L2193j47089P658M5124J56983
$$ 253754 141512 39905 79123 65409 82414 78042 110235 -36854 -29196 15928 172911
12863A72911m3687j25336P323K3957K5073j5932j0667k498p4900K4522L4762j2381
$$ 172911 129224 3888 11211 35168 60241 44309 33642 31144 -43756 -19234 15528 3147
12851C147q281K8487Q818q5895P9119J03772O3810L3491r1708J779k1772m8106
$$ 3147 -5134 23353 32171 -53724 25395 129167 192977 226468 134760 136539 114767 66661
12839F6661J1260J8637l7369j8281l1167n0102o1469O2025O5328O4000J1867n599
$$ 66661 77921 96558 59189 40908 9741 -40361 -101830 -39805 25523 89523 101390 95791
12827I5791K3065n2685l1247K143r09M847o714Q2577J08826L644n4763K722K872
$$ 95791 118856 66171 34924 37067 36158 41005 34291 116868 225694 229338 174575 177297 180169
12814A80169o4586j06770J0786R8593L8693o0520r564Q4589J30752J00149q8853
$$ 180169 115583 8813 19599 118192 156885 96365 86801 171390 302142 402291 313438
12803C13438k2449J702n3179j05081q0088o0272k0660m3230k0490p177R6787J14736
$$ 313438 290989 292691 239512 134431 54343 -5929 -26589 -69819 -90309 -97486 -699 114037
12791A14037R2372n0553q0051p8727n7632j4549Q2265J3770P1861N7003L1266
$$ 114037 206409 155856 75805 -2922 -60554 -75103 7162 20932 92793 149796 181062
12780A81062J17173K4407k406r2450j32145p6111K3493K9532k9044K8902N9505
$$ 181062 298235 322642 320236 227786 95641 19530 43023 72555 43511 72413 131918
12769A31918J179O2824R5489m4542n2337o3662j34557m7091M7179k288l0523L5607
$$ 131918 133097 195921 291410 246868 194531 130869 -3688 -50779 -3600 -5888 -36411 -804
12757h04J44603r3502n4679M3996k4278P8745P0541k5943n7763M0320K2346m4920
$$ -804 143799 50297 -4382 39614 15336 94081 164622 138679 80916 121236 143582 98662
12745I8662J01886k7767J4922L204j21949n3311N5751O0881J52676K0812j30344
$$ 98662 200548 172781 187703 190907 68958 15647 71398 132279 284955 305767 175423
12734A75423j47017j0823k7115j5738m4165l3010k1305N4776K1775l62R8620J11459
$$ 175423 28406 17583 -9532 -25270 -69435 -102445 -123750 -68974 -47199 -47561 51059 162518
12722A62518K996J6777j50857o7912M4216k2653l1271N3806K1159M6977K8579
$$ 162518 165514 182291 31434 -36478 7738 -14915 -46186 7620 28779 75756 104335
12711A04335K2751j6520m6941O6641O0486k2262j922L5186l2143n0010k6257L7013
$$ 104335 127086 110566 63625 130266 190752 168490 166568 201754 169611 119601 93344 130357
12699A30357L2536n2151L4583J9747Q109r037q4834j8850O9542N5184m8050N7920
$$ 130357 162893 110742 145325 165072 173181 164144 79310 60460 130002 185186 137136 195056
12687A95056m2242j06833n0985l131L7823m3617j6787J10215j2501J2161l6815
$$ 195056 152814 45981 -5004 -8135 29688 -13929 -30716 79499 66998 79159 42344
12676D2344j3690n5447N8932o7694J8956l3597p6723J8863Q0974k79m6077J14335
$$ 42344 28654 -26793 32139 -35555 -16599 -50196 -126919 -108056 -27082 -27361 -73438 40897
12664D0897K9413l7613j5254M019n4028k1780n5412m2591M5458j104l4130l0220
$$ 40897 70310 32697 17443 21462 -32566 -54346 -109758 -152349 -106891 -107995 -142125 -172345
12652a72345P8051J63239J8725l166P7109N7839m0771j21184j0662Q484P2774
$$ -172345 -94294 68945 87670 84504 161613 219452 178681 57497 46835 55319 128093
12641A28093Q0968J0190l5630p0786p8823Q147L5070l1706J8222k014j32943K1863
$$ 128093 209061 219251 183621 112835 34012 42159 77229 45523 63745 61731 -71212 -49349
12629d9349J34565M3329L0826J7189m2051m9512J08193J02235P774j06956j32435
$$ -49349 85216 128545 159371 176560 134509 84997 193190 295425 303199 196243 63808
12618F3808l6591o8939o5434n436R8915J45924J04522m5617j7654K9379j0880
$$ 63808 27217 -41722 -107156 -112592 -13677 132247 236769 191152 173498 202877 191997
12607A91997L9584O4802N0288n6549r643q80P002m1659n4128J0256p5647M1353
$$ 191997 231581 296383 346671 290122 280479 279599 286601 244942 190814 201070 125423 166776
12595A66776L8143M8177o175r8545R7425M5958j20116n524N1676K8946n4776m8425
$$ 166776 204919 253096 246921 148376 245801 291759 171643 166119 217795 246741 191965 143540
12583A43540J6287O6875N5456K3299j623j17432m7641N7803j05611l462k0118
$$ 143540 159827 226702 282158 305457 303834 186402 138761 196564 90953 87491 67373
12572F7373l9058m9265o928R518R5554P0715O0630K4603M6288L0632M009l6869
$$ 67373 28315 -20950 -27878 -18360 77194 147909 208539 233142 279430 310062 314071 277202
12560B77202J4790m5040n2419k9763o8153L3577m5340J2282m22L0956M5105l6866
$$ 277202 291992 246952 194533 164770 96617 130194 84854 97136 96714 127670 172775 135909
12548A35909L2269J22127r694p9964j51241J6973Q3912J2497O3717K2990j348
$$ 135909 168178 290305 280611 200647 49406 66379 150291 162788 226505 249495 248147
12537B48147n5240j2995O2680l5606j25495L6970o8745j19839J1680J26862J13475
$$ 248147 192907 179912 242592 206986 81491 118461 49716 -70123 -58443 68419 181894
12526A81894m6082j33368K5590J13328j8283Q3757L6407l7355j6294l374j45017
$$ 181894 135812 2444 28034 141362 123079 206836 243243 205888 189594 186220 41203
12515D1203J8375J7566l4534O111L0021J4735l1508j5409q8293r5366J09841O9295
$$ 41203 59578 77144 42610 48721 78742 93477 61969 46560 -41733 -137099 -27258 42037
12503D2037P7763L9252J26285m7311l496N3383m06m3348m3158q7057j1209m064
$$ 42037 119800 159052 285337 238026 234530 287913 287507 244159 201001 113944 102735 98671
12491I8671o552p565k5040M3478K1926n837L7004J9685n8173J00005m563K0500
$$ 98671 92119 84554 59514 102992 124918 119081 156085 175770 117597 217602 213039 233539
12479B33539O3279j3736K0921m5319r8476j55598J10387J05102L009O667K9187
$$ 233539 296818 283082 304003 258684 160208 4610 114997 220099 223108 229775 258962
12468B58962R9134l0608p5359n7923k4139m3963N382m4787J7790l1705N5763J9213
$$ 258962 358096 327488 252129 194206 170067 126104 131486 86699 104489 72784 128547 147760
12456A47760n738J467K3713n634o2274J3014k449J7733m1108J1403L1833J27755
$$ 147760 142022 143489 167202 161568 99294 112308 109859 127592 86484 97887 129720 257475
12444B57475K8323n3900o0087l515k5714n8783K3162R7061K0608M4102K777o0625
$$ 257475 285798 231898 171811 168296 142582 83799 106961 204022 224630 268732 271509 210884
12432B10884k8537N6382k3987J4954K9503J5894j27517p2748j12533o3888Q1232
$$ 210884 182347 238729 214742 229696 259199 275093 147576 74828 -37705 -101593 -20361
12421b0361R5582Q5669L7014M6406j0357k9120o8851L1907O3883K6950q9676p6156
$$ -20361 75221 160890 197904 244310 233953 204833 135982 167889 231772 258722 169046 92890
12409I2890M4438J00346J26773N2088n0911n9192n1238o0141M483L8189r28P104
$$ 92890 137328 237674 364447 416535 365624 306432 255194 195053 199536 237725 236797 243901
12397B43901p6775J8401L9626M0158l3173o5080o3762l307J3435q068K0384l1143
$$ 243901 167126 185527 225153 265311 232138 167058 103296 99989 113424 105356 125740 94597
12385I4597o9126R6224R2926P2942j6309q6497L2981j18988o0696K2423J18897
$$ 94597 25471 121695 214621 287563 271254 184757 217738 98750 38054 60477 179374
12374A79374J42424j0799p1861M3671J66213J7274m4386m6550k4569j1527q328
$$ 179374 321798 310999 239138 282809 449022 466296 421910 375360 350791 339264 330936
12363C30936k8154N7952r96n598n1634l9342J4884O7926P5686K3380j24504k8042
$$ 330936 302782 360734 359738 354140 302506 263164 278048 345974 421660 445040 320536 292494
12351B92494J8686M4569J38071l8350j28171j2723L5179M3507N0398p3760q0775
$$ 292494 311180 355749 493820 455470 327299 314576 349755 393262 443660 369900 289125
12340B89125j36336q212O1716L2418l7093l7911M2478J80056J3125l2324J8329
$$ 289125 152789 144577 206293 238711 201618 163707 206185 386241 399366 367042 385371
12329C85371j9428o6087N9081M9249j00893J4796n3337J2328J4618m2694J8563
$$ 385371 365943 299856 358937 408186 307293 322089 268752 281080 295698 253004 271567
12318B71567M0380m6310K4684j5652Q009o2854L8984O70o6560r3200L1765P9864
$$ 271567 311947 265637 290321 274669 282678 219824 258808 259478 192918 99718 131483 211347
12306B11347M7253J7890L0280l5485l6993M9705K6958j0065m232j4657L3929J11216
$$ 211347 258600 276490 306770 271285 234292 283997 310955 300890 296658 282001 315930 427146
12294D27146k3549k8992p036n045j9552O3320N5642q5003o6284K9621j7923l9721
$$ 427146 403597 374605 367569 362524 342972 406292 461934 376931 310647 340268 322345 282624
12282B82624J2708N5317m4261K1825J8221L2813K3414J12244N2701p1897k1060
$$ 282624 295332 350649 306388 328213 346434 379247 402661 514905 567606 495709 474649
12271D74649q5129K4006J08893K0153l4134l7499j12100l5506P9604L791j34434
$$ 474649 389520 413526 522419 542572 508438 470939 358839 323333 402937 406728 272294
12260B72294l55Q5025O0726M9336O1345o5468p1429n5721K9164J19508J9155o6151
$$ 272294 271939 356964 417690 467026 528371 462903 391474 335753 364917 484425 503580 437429
12248D37429j9805J9942n7641k6309K6209M7362N3895M3083N308m0873l0481L1868
$$ 437429 417624 437566 379925 353616 379825 427187 481082 524165 529473 488600 458119 489987
12236D89987p194J8299p8251J1785K9638l2654l2872L6947P0754L0522q5654K2253
$$ 489987 482793 501092 422841 434626 464264 431610 398738 435685 506439 536961 451307 473560
12224D73560k2748k2898M4363N0384N8800m4426m2522J21461m9391J6514K6026
$$ 473560 450812 427914 472277 522661 581461 537035 494513 615974 566583 583097 609123
12213F09123K2087k2028J8400r271N4217Q46r5716k7556j339N2588j5770L294
$$ 609123 631210 609182 627582 618311 672528 673374 577658 550102 548763 601351 585581 588875
12201E88875p1021m7718L2075R3142J1670K1030j4952K029j9908L2027K8640m862
$$ 588875 517854 470136 502211 595353 607023 628053 613101 615130 595222 627249 655889 651027
12189F51027l7496R371J0381j4406q697l2106Q5040P5248r9476n8319R668L3661
$$ 651027 613531 622902 633283 618877 610180 578074 663114 738362 638886 580567 590235 623896
12177F23896K7140K9922j7627j4159p731o8187M2013Q2252O4566J6995l9716j3468
$$ 623896 651036 680958 663331 649172 641441 573254 615267 697519 762085 779080 739364 725896
12165G25896q2675k2163M2526K1615K6559K6138K1788p807p4465L1326N8792N1783
$$ 725896 643221 621058 663584 685199 711758 737896 759684 751877 677412 708738 767530 819313
12153H19313J8396P5773K41K0703k6146o2180J6294M3577K4554m4277J0082N7382
$$ 819313 837709 913482 913723 934426 908280 846100 862394 905971 930525 886248 896330 953712
12141I53712m0072n1431r5422O639L6504J9845J5323O7786P43l1238L9715p4532
$$ 953712 913640 862209 766787 773426 809930 829775 845098 912884 913627 882389 922104 847572
12129H47572n3090M0352J8229L3400J9138M1388M7437M9183L5757P621m0531l0354
$$ 847572 794482 834834 853063 886463 905601 946989 994426 1043609 1079366 1086987 1046456 1016102
12117A016102l677K1724J7087O2770R337P8491L7983m9353L4411K5491m7212L0815
$$ 1016102 1012425 1034149 1051236 1114006 1123343 1201834 1239817 1190464 1224875 1250366 1203154 1233969
12105A233969O0384q6815o4430J6192Q8031L5208O7403M091Q9670M0581k2140
$$ 1233969 1294353 1207538 1143108 1159300 1247331 1282539 1349942 1354033 1443703 1484284 1462144
12094A462144j083m4400n0865q5218Q6228N7070k5818J11735M5020p1929j8076
$$ 1462144 1461061 1416661 1365796 1280578 1366806 1423876 1398058 1509793 1554813 1482884 1464808
12083A464808N6870M8744L4494m6103n2398J03066O1812P2585L6873r5044m5244
$$ 1464808 1521678 1570422 1604916 1558813 1506415 1609481 1671293 1743878 1780751 1685707 1640463
12072A640463M1787O1333k5948q3553L0643J79844Q6857L8149O9172K4973K2339
$$ 1640463 1682250 1743583 1717635 1634082 1664725 1844569 1931426 1969575 2038747 2063720 2086059
12061B086059L3486K9882l4978p959P4804N0948n2024Q9484J74922K2776O3237
$$ 2086059 2119545 2149427 2114449 2106490 2181294 2232242 2180218 2269702 2444624 2467400 2530637
12050B530637J17368Q5620o2226K4708J24033M895J3733j7784m7621m2327K6030
$$ 2530637 2648005 2733625 2671399 2696107 2820140 2825035 2838768 2820984 2773363 2731036 2757066
12039B757066J90713P3854R057k323P3800J47972p111J42377L9648K6127K2923
$$ 2757066 2947779 3021633 3030690 3028367 3102167 3250139 3243028 3385405 3425053 3451180 3474103
12028C474103j8563J10450N3490m1557N0920M4910J03607J63332O3928m3836J20005
$$ 3474103 3455540 3565990 3619480 3577923 3628843 3673753 3777360 3940692 4004620 3960784 4080789
12017D080789J96598n294R7820J69158J67620K9149R5983P7773J36742J65970
$$ 4080789 4277387 4272093 4369913 4539071 4706691 4735840 4831823 4909596 5046338 5212308
12007E212308J91043K41916K54988K58949J69913p63j3040O0107M7928R9430K12577
$$ 5212308 5403351 5645267 5900255 6159204 6329117 6328354 6315314 6375421 6423349 6522779 6735356
11996F735356J86865J09653J69590K51713J70288J85919J70444J44104K18487
$$ 6735356 6922221 7031874 7201464 7453177 7623465 7809384 7979828 8123932 8342419
11987H342419K14473K57781J67754K58354L41433K65047K25655K98398K72563
$$ 8342419 8556892 8814673 8982427 9240781 9582214 9847261 10072916 10371314 10643877
11978A0643877L24154L75516M33744L93837L69414M54529M11778M11998M66451
$$ 10643877 10968031 11343547 11777291 12171128 12540542 12995071 13406849 13818847 14285298
11969A4285298L57619K82997N27969N34118N46431O70380P29518Q07123P88342
$$ 14285298 14642917 14925914 15453883 15988001 16534432 17204812 17934330 18741453 19529795
11960A9529795P27039P61446O49468N52000O79026P15706O71246Q34253R09543
$$ 19529795 20256834 21018280 21667748 22219748 22898774 23614480 24285726 25119979 26029522
11951B6029522R53148Q78901J010282R79365R98417R85681R51718J045522R98861
$$ 26029522 26982670 27861571 28871853 29851218 30849635 31835316 32787034 33832556 34831417
11942C4831417R64252R84830J080227J105154J029998Q74304Q16047R15110P49376
$$ 34831417 35795669 36780499 37860726 38965880 39995878 40870182 41686229 42601339 43350715
11933D3350715N43627N44814O15650M68387L88081J51128R3254O1613j95894k89815
$$ 43350715 43894342 44439156 45054806 45523193 45911274 46062402 46155656 46217269 46021375 45731560
11923D5731560k97335m07862m70518n83628p04157o65848p25202p34117q62374
$$ 45731560 45434225 45026363 44555845 43972217 43268060 42602212 41877010 41142893 40280519
11914D0280519j022467j002230j017494r72938j035715j037238j173176j140606
$$ 40280519 39258052 38255822 37238328 36265390 35229675 34192437 33019261 31878655
11906C1878655j078419r14112p93981q71631r07242q13100p45016p53220p82571
$$ 31878655 30800236 29886124 29092143 28220512 27313270 26500170 25755154 25001934 24219363
11897B4219363q17623p04115o25928p16105p24110o69713p08916p23922m43230
$$ 24219363 23401740 22697625 22071697 21355592 20631482 19961769 19252853 18528931 18085701
11888A8085701l60309l85022n36733n15694m79540n12053m64241m33448n35297
$$ 18085701 17725392 17340370 16803637 16287943 15808403 15296350 14832109 14398661 13863364
11879A3863364n06319m41107l68314l84280k82004l48154l28903m04867m32817
$$ 13863364 13357045 12915938 12547624 12163344 11881340 11533186 11204283 10799416 10366599
11870A0366599k84351l09938k93274k12553j71869k87921j98666j14841j06473
$$ 10366599 10082248 9772310 9479036 9266483 9094614 8806693 8608027 8493186 8386713
11861H386713k00545k88682j84199j92194j91029k02747j33631j59480j36600
$$ 8386713 8186168 7897486 7713287 7521093 7330064 7127317 6993686 6834206 6697606
11852F697606j34866j05823k0183j1350K3039n692n8947Q161J04548Q2632m8156
$$ 6697606 6562740 6456917 6436734 6425384 6448423 6442731 6383784 6391945 6496493 6579125 6530969
11841F530969j46287k39227k20983k88247l43792j96041q8608j37843j78970k33690
$$ 6530969 6384682 6145455 5924472 5636225 5292433 5096392 5007784 4869941 4690971 4457281
11831D457281j73046j27617p3321j3816l3002j34723o0868N477r3170q4489k04060
$$ 4457281 4284235 4156618 4083297 4069481 4036479 3901756 3840888 3846365 3753195 3668706 3464646
11820C464646j54044k6960N7683Q796j64081j21146m847k1100j6733k8729k7346
$$ 3464646 3310602 3283642 3341325 3350121 3186040 3064894 3060047 3038947 3022214 2993485 2966139
11809B966139m3851l1394q7461j5298R3514p8k9323K0549O3570N0091M3591M8089
$$ 2966139 2922288 2890894 2803433 2788135 2881649 2881571 2852248 2872797 2936367 2986458 3030049 3078138
11797C078138r0095m8204j35459j15635m5806q0885j17061p1687m2315j28681
$$ 3078138 2988043 2939839 2804380 2688745 2642939 2562054 2444993 2373306 2330991 2202310
11787B202310m0902m8704q5939n1129Q464l9242j02809q8783J2371L2781L6704
$$ 2202310 2161408 2112704 2026765 1975636 1984100 1944858 1842049 1753266 1765637 1798418 1835122
11776A835122j6536n8468l7936q854l3041p1464m1939l9025o6427k933J7004N0786
$$ 1835122 1818586 1760118 1722182 1713328 1680287 1608823 1566884 1527859 1461432 1458499 1475503 1526289
11764A526289k8705P5814k5245O345n6680N959l6624J3597J05368m2895j28304
$$ 1526289 1497584 1573398 1548153 1554498 1497818 1503777 1467153 1480750 1586118 1543223 1414919
11753A414919j1122k7185J267j3942J3336M1648q8208m8388l8057m1986l3044
$$ 1414919 1403797 1376612 1377879 1363937 1377273 1418921 1330713 1282325 1244268 1202282 1169238
11742A169238O693O037m5512k6192K8152J2851l0189o9382R2179R4200R324j7126
$$ 1169238 1175931 1181968 1136456 1110264 1138416 1151267 1121078 1051696 1143875 1238075 1247399 1230273
11730A230273q4243J6235P1710J0651n2134k2646M7925q4944r2381N5909J4021
$$ 1230273 1146030 1162265 1233975 1244626 1192492 1169846 1217771 1132827 1040446 1096355 1110376
11719A110376p6074p0962K6715L2622J19530N7570o729j1371k861K0674J5514
$$ 1110376 1034302 963340 990055 1022677 1142207 1199777 1193048 1181677 1178816 1199490 1215004
11708A215004l3113j9515o9822r0497o7869o0518n0847L6479P3059L903J0304
$$ 1215004 1181891 1162376 1092554 1002057 934188 873670 822823 859302 932361 936264 946568
11697I46568K368l0204q0936M8221m060M1682R959n8539j6069J458r6681m2505
$$ 946568 948936 918732 837796 886017 881957 923639 933598 875059 858990 860448 763767 721262
11685G21262R6827L0770o9273j44077L5930J70950R2712J7745m9595l2750j9539
$$ 721262 818089 848859 779586 635509 671439 842389 935101 952846 903251 870501 850962
11674H50962j9328L4876K9624J2735k2638l0833M0111j3956M0278J8120j08471
$$ 850962 831634 866510 896134 908869 886231 855398 895509 881553 921831 939951 831480
11663H31480o6971J8134N165l5816p6601R7312M1217q3805k9169L191n483M6060
$$ 831480 764509 782643 787808 751992 675391 772703 813920 730115 700946 704137 698654 744714
11651G44714J8078j9535l0191J1184J4818j07802j0955j5586n213o0174j2654
$$ 744714 762792 743257 713066 724250 739068 631266 620311 604725 599512 539338 526684
11640E26684L5746p43k2972k7697O3296J08732J29494l4669j40344n8821k6397
$$ 526684 562430 561687 538715 511018 574314 683046 812540 777871 637527 578706 552309
11629E52309l2059p783R3656O4301J5891l0691L4589m7571m5610K8258M6841K0087
$$ 552309 520250 512467 606123 670424 686315 655624 690213 642642 597032 625290 672131 692218
11617F92218P024J2255n8301k4784j6158o3265n0457p3839k250O9834P7621K6027
$$ 692218 699242 711497 653196 628412 612254 548989 498532 424693 422443 492277 569898 595925
11605E95925l3851O1545J19957J6695P93j13584m7291n6813k2533L5921K7382
$$ 595925 562074 623619 743576 760271 761064 647480 600189 543376 520843 556764 584146
11594E84146k9147P3418m9336N4537Q7147m005m3398P3335J7702l7012m8684O4341
$$ 584146 554999 628417 579081 633618 720765 716760 673362 746697 764399 727387 678703 743044
11582G43044M7095j1790K1498K0605q3484j27787J981o092M1712N1117o1516j4019
$$ 743044 790139 778349 799847 820452 736968 609181 611162 605070 646782 697899 636383 622364
11570F22364J10491j7702p5490m6812j2912L7360P7532N3027Q528j5568K4788
$$ 622364 732855 715153 639663 592851 579939 617299 694831 747858 756386 740818 765606
11559G65606M3570n4821j3321M8597P590j11193n6567N6263r663j9269J4990R5273
$$ 765606 809176 754355 741034 789631 797221 686028 629461 685724 676061 656792 671782 767055
11547G67055L8660N9298j4898j21623o9928N0750O9382K9964Q3523q3162J63154
$$ 767055 805715 865013 850115 728492 658564 709314 778696 808660 892183 809021 972175
11536I72175J086j17865m0911k2009j3813r78N9202j7950n4281m258J38009R9869
$$ 972175 973261 855396 814485 792476 778663 777685 836887 818937 764656 760398 898407 998276
11524I98276K5228k1851N349m0772J4887Q1858P801L5292J3415n3761p930n8148
$$ 998276 1023504 1001653 1007002 966230 981117 1062975 1070776 1106068 1119483 1065722 1057792 999644
11512I99644M7413Q1820J02108N832r8068o1390M9869J51571J5902K7648J3116
$$ 999644 1047057 1128877 1230985 1236817 1138749 1077359 1127228 1278799 1294701 1322349 1335465
11501A335465J14637N0132j1124k7371o4863K3116R7925j11755m1141L6025J47160
$$ 1335465 1450102 1500234 1489110 1461739 1396876 1419992 1517917 1406162 1365021 1401046 1548206
11490A548206L5770L5382K9763J02353J20924M0587j5586K6132P9586M1019O4078
$$ 1548206 1583976 1619358 1649121 1751474 1872398 1912985 1897399 1923531 2003117 2044136 2108214
11479B108214P4973N8147Q7756J33800J06855K05636J67535J33454J21606J10338
$$ 2108214 2183187 2241334 2329090 2462890 2569745 2775381 2942916 3076370 3197976 3308314
11469C308314J99896J93658K52670L14339M14662L83319M10150M34268N71332
$$ 3308314 3508210 3701868 3954538 4268877 4683539 5066858 5477008 5911276 6482608
11460F482608P06694P32170Q95641R91160J000142J134282J357326J641603K062873
$$ 6482608 7189302 7921472 8817113 9808273 10808415 11942697 13300023 14941626 17004499
11451A7004499K599004L264614M136741N291815P181415R531666J2273590J5123691
$$ 17004499 19603503 22868117 27004858 32296673 39478088 49009754 61283344 76407035
11443G6407035J6525055J5515664J1617616O268754P38693n065270j0479493j4203696
$$ 76407035 92932090 108447754 120065370 126334124 127072817 122007547 111528054 97324358
11435I7324358j5342052j4195206j1777904r259912p060381n404539m120566l164769
$$ 97324358 81982306 67787100 56009196 46749284 39688903 34284364 30163798 26999029
11427B6999029k437889j826565j275736j001887q24978n60762k95118j09926J15226
$$ 26999029 24561140 22734575 21458839 20456952 19631974 19071212 18776094 18666168 18781394
11418A8781394L19096M85840Q02302J097339J374073J594950J859894K237968
$$ 18781394 19100490 19586330 20388632 21485971 22860044 24454994 26314888 28552856
$$ [...]
##END NTUPLES=NMR SPECTRUM
##END=
