##TITLE=Analysis number 327731
Compound Code s 14532
Book Reference 167453
Project Code qc fl
Chemist Name jom
##JCAMPDX= 6.0         $$ Bruker NMR JCAMP-DX V2.0
##DATA TYPE= NMR SPECTRUM
##DATA CLASS= NTUPLES
##ORIGIN= Bruker BioSpin GmbH
##OWNER= nmr
$$ XWIN-NMR		Version 3.5
$$ Tue Apr  3 09:13:18 2007 GMT Daylight Time (UT+1h)  MAYBRIDGE\nmr@NMR_250MHZ
##.OBSERVE FREQUENCY= 250.131544655141
##.OBSERVE NUCLEUS= ^1H
##.ACQUISITION MODE= SIMULTANEOUS (DQD)
##.ACQUISITION SCHEME= undefined
##.AVERAGES= 16
##.DIGITISER RES= 18
##SPECTROMETER/DATA SYSTEM= dpx250
##.PULSE SEQUENCE= zg30
##.SOLVENT NAME= DMSO
##.SHIFT REFERENCE= (INTERNAL, DMSO, 0, 16.522)
##AUDIT TRAIL= $$ (NUMBER, WHEN, WHO, WHERE, WHAT)
$$ ##TITLE= Audit trail, XWIN-NMR		Version 3.5
$$ ##JCAMPDX= 5.01
$$ ##ORIGIN= Bruker BioSpin GmbH
$$ ##OWNER= nmr
$$ C:\u/data/dgb/nmr/ADRS/220/pdata/1/auditp.txt
$$ ##AUDIT TRAIL=  $$ (NUMBER, WHEN, WHO, WHERE, WHAT)
(   1,<2007-04-03 09:12:56.22 +100>,<MAYBRIDGE\nmr>,<NMR_250MHZ>,
      <created by zg, POWCHK disabled, PULCHK disabled
       configuration hash MD5:
       49 4B E0 1D 92 C2 6B 37 9F E6 65 BC 52 41 86 1D
       data hash MD5: 64K
       23 AC FE CC C4 0F 87 E8 41 76 58 43 AC AD 37 A2>)
(   2,<2007-04-03 09:13:09.24 +100>,<MAYBRIDGE\nmr>,<NMR_250MHZ>,
      <Start of raw data processing
       ef LB = 0.3 FT_mod = 6 PKNL = 1 SI = 32K 
       data hash MD5: 32K
       E5 4F 51 AD 33 AF 0A E2 05 99 F4 3B C2 D5 69 D0>)
(   3,<2007-04-03 09:13:10.79 +100>,<MAYBRIDGE\nmr>,<NMR_250MHZ>,
      <apk 
       data hash MD5: 32K
       91 AB 92 A7 9E 3D 76 A0 F0 91 25 B1 FD 73 13 47>)
(   4,<2007-04-03 09:13:11.69 +100>,<MAYBRIDGE\nmr>,<NMR_250MHZ>,
      <abs ABSG = 5 
       data hash MD5: 32K
       28 18 3B 9C 5D 40 EB 9F FA 4B 0B 0F 2A 7B B3 66>)
$$ ##END=
$$ 
$$ hash MD5
$$ 1F 6D A6 55 30 DE 2D 7B 72 F0 B8 23 19 34 E1 92
##$RELAX= 
##$RELAX= 
##$RELAX= 
##$RELAX= 
##$RELAX= 
##$RELAX= 
##$RELAX= 
$$ Bruker specific parameters
$$ --------------------------
##$DU= <C:\u>
##$EXPNO= 220
##$NAME= <ADRS>
##$PROCNO= 1
##$TYPE= <nmr>
##$USER= <dgb>
##$AMP= (0..31)
100 100 100 100 100 100 100 100 100 100 100 100 100 100 100 100 100 100 
100 100 100 100 100 100 100 100 100 100 100 100 100 100 
##$AQSEQ= 0
##$AQ_mod= 3
##$AUNM= <au_zg>
##$AUTOPOS= <45 >
##$BF1= 250.13
##$BF2= 250.13
##$BF3= 250.13
##$BF4= 250.13
##$BF5= 500.13
##$BF6= 500.13
##$BF7= 500.13
##$BF8= 500.13
##$BYTORDA= 1
##$CFDGTYP= 0
##$CFRGTYP= 5
##$CHEMSTR= <none>
##$CNST= (0..31)
1 1 145 1 1 1 1 1 1 1 1 1 1 1 1 1 1 1 1 1 1 1 1 1 1 1 1 1 1 1 1 1 
##$CPDPRG= <>
##$CPDPRG1= <>
##$CPDPRG2= <>
##$CPDPRG3= <>
##$CPDPRG4= <mlev>
##$CPDPRG5= <mlev>
##$CPDPRG6= <mlev>
##$CPDPRG7= <mlev>
##$CPDPRG8= <mlev>
##$CPDPRGB= <>
##$CPDPRGT= <>
##$D= (0..31)
0 1 0 0 0 0 0 0 0 0.06 0 0 0 0 0 0 0.0002 0 0 0 0 0 0 0 0 0 0 0 0 0 0 
0 
##$DATE= 1175587975
##$DBL= (0..7)
120 120 120 120 120 120 120 120 
##$DBP= (0..7)
150 150 150 150 150 150 150 150 
##$DBP07= 0
##$DBPNAM0= <>
##$DBPNAM1= <>
$$ [...]
##$SUBNAM7= <"">
##$SUBNAM8= <"">
##$SUBNAM9= <"">
##$SW= 20.6930455092707
##$SWIBOX= (0..15)
0 0 3 0 0 0 0 0 0 0 0 0 0 0 0 0 
##$SW_h= 5175.983436853
##$TD= 65536
##$TD0= 1
##$TE= 683.16
##$TE2= 300
##$TE3= 300
##$TEG= 300
##$TL= (0..7)
0 120 120 120 120 120 120 120 
##$TP= (0..7)
150 150 150 150 150 150 150 150 
##$TP07= 0
##$TPNAME0= <>
##$TPNAME1= <>
##$TPNAME2= <>
##$TPNAME3= <>
##$TPNAME4= <>
##$TPNAME5= <>
##$TPNAME6= <>
##$TPNAME7= <>
##$TPOAL= (0..7)
0.5 0.5 0.5 0.5 0.5 0.5 0.5 0.5 
##$TPOFFS= (0..7)
0 0 0 0 0 0 0 0 
##$TUNHIN= 0
##$TUNHOUT= 0
##$TUNXOUT= 0
##$USERA1= <user>
##$USERA2= <user>
##$USERA3= <user>
##$USERA4= <user>
##$USERA5= <user>
##$V9= 5
##$VALIST= <valist>
##$VCLIST= <CCCCCCCCCCCCCCC>
##$VD= 0
##$VDLIST= <DDDDDDDDDDDDDDD>
##$VPLIST= <PPPPPPPPPPPPPPP>
##$VTLIST= <TTTTTTTTTTTTTTT>
##$WBST= 1024
##$WBSW= 4
##$XGAIN= (0..3)
0 0 0 0 
##$XL= 0
##$YL= 0
##$YMAX_a= 335201
##$YMIN_a= -379802
##$ZGOPTNS= <>
##$ZL1= 120
##$ZL2= 120
##$ZL3= 120
##$ZL4= 120
##$ABSF1= 16.522
##$ABSF2= -4.171173
##$ABSG= 5
##$ABSL= 3
##$ALPHA= 0
##$AQORDER= 0
##$ASSFAC= 0
##$ASSFACI= 0
##$ASSFACX= 0
##$ASSWID= 0
##$AUNMP= <proc_1d>
##$AZFE= 0.1
##$AZFW= 0.1
##$BCFW= 0
##$BC_mod= 0
##$BYTORDP= 0
##$COROFFS= 0
##$CY= 12.5
##$DATMOD= 1
##$DC= 0
##$DFILT= <>
##$DTYPP= 0
##$F1P= 14.0000005364418
##$F2P= -0.99999901652339
##$FCOR= 0.5
##$FTSIZE= 32768
##$FT_mod= 6
##$GAMMA= 0
##$GB= 0
##$INTBC= 1
##$INTSCL= 1
##$ISEN= 128
##$LB= 0.3
##$LEV0= 0
##$LPBIN= 0
##$MAXI= 10000
##$MC2= 0
##$MEAN= 0
##$ME_mod= 0
##$MI= 0
##$NCOEF= 0
##$NC_proc= -5
##$NLEV= 6
##$NOISF1= 0
##$NOISF2= 0
##$NSP= 0
##$NTH_PI= 0
##$NZP= 0
##$OFFSET= 16.522
##$PC= 1
##$PHC0= 218.3865
##$PHC1= 13.21567
##$PH_mod= 1
##$PKNL= yes
##$PPARMOD= 0
##$PSCAL= 4
##$PSIGN= 0
##$REVERSE= no
##$SF= 250.13
##$SI= 32768
##$SIGF1= 0
##$SIGF2= 0
##$SINO= 400
##$SIOLD= 32768
##$SREGLST= <1H.DMSO>
##$SSB= 0
##$STSI= 32768
##$STSR= 0
##$SW_p= 5175.98343685301
##$SYMM= 0
##$S_DEV= 0
##$TDeff= 65536
##$TDoff= 0
##$TI= <Analysis number 999999
Compound Code 99
Book Reference 9
Project Code 9>
##$TILT= no
##$TM1= 0
##$TM2= 0
##$TOPLEV= 0
##$USERP1= <user>
##$USERP2= <user>
##$USERP3= <user>
##$USERP4= <user>
##$USERP5= <user>
##$WDW= 1
##$XDIM= 32768
##$YMAX_p= 512689965
##$YMIN_p= -531014
$$ End of Bruker specific parameters
$$ ---------------------------------
##NTUPLES= NMR SPECTRUM
##VAR_NAME=  FREQUENCY,     SPECTRUM/REAL,   SPECTRUM/IMAG
##SYMBOL=    X,             R,               I
##VAR_TYPE=  INDEPENDENT,   DEPENDENT,       DEPENDENT
##VAR_FORM=  AFFN,          ASDF,            ASDF
##VAR_DIM=   32768,         32768,           32768
##UNITS=     HZ,            ARBITRARY UNITS, ARBITRARY UNITS
##FACTOR=    0.157963299565203, 1,           1
##FIRST=     4132.6476996994, 0,             0
##LAST=      -1043.33573715361, 0,           0
##MIN=       -1043.33573715361, -531014,     0
##MAX=       4132.6476996994, 512689965,     0
$$ Real data points
##PAGE= N=1
##DATA TABLE= (X++(R..R)), XYDATA
$$ [...]
17123e5049o6546J29493J41567R0797J5760Q3834o0763r1077n4777J868r439j7572
17111A08096o0816P6512R5349k0874o4956n7745O3200K42953Q754q8087j34671
17100A67715j02352J00257J54561n2391q8295M2680J05629L1618O7089J3111j30019
17089C09603o6571j3926J99034n1805p1644p0607P0166J0160J585o8555j9189
17078B28251J3086M1626p2945p8343j13268j13161J9090j04564J85577J58348
17068A63697L7512L7841J8526j08535p545j5261j4482K4462J54135J05336J7059
17057D12745p23n6446n8288j0651N2623R2120P063q2031Q7525o3532q5560N0812
17045C45657J53140J2376j25981q1301m4665J06189L1506M3426J2489P4480j29495
$$ y = [-55049, -121595, 7898, 149465, 240262, 256022, 339856, 279093, 188016, 133239, 135107, 125668, 108096, 47280, 123792, 219141, 198267, 133311, 75566, 138766, 381719, 390473, 302386, 167715, 65363, 165620, 320181, 267790, 179495, 222175, 327804, 359422, 426511, 439622, 309603, 243032, 229106, 428140, 376335, 304691, 234084, 304250, 314410, 315995, 247440, 228251, 241337, 282963, 210018, 131675, 18407, -94754, -75664, -180228, 5349, 163697, 201209, 239050, 257576, 149041, 141496, 126235, 111753, 136215, 290350, 395686, 412745, 412022, 355576, 297288, 286637, 339260, 431380, 438443, 356412, 443937, 380405, 294845, 345657, 498797, 511173, 385192, 303891, 259226, 365415, 396921, 440347, 452836, 527316, 397821]
17034C97821l4466j44370O0501J66153K3259n7451J3182J7370j35488l7850J3130
17023B81791K09130R8125O5472m5918o8710j45004O2531Q8147o3092j05810L3481
17012D10143J17459n3630O7639K29966O671j58348l8605K3033k9100n4098l8909
17001D82221n805o4432m2928Q3923P5134J47241j75903j75436Q0317J87636R3886
16990F85854M9535L1698j11677q6282j3633K3353K1625M2042j7961j21923N8329
16979E60960Q0522o579k6715O0187p0439L9033J39524K9177K1702q546l0498N2023
16967H40351J56723R8566o5070m8510J3401l4733q8642l222J13185m9130j4274
16956I18645o5996M556J43447J30674n3604p1559K1806N8439M1764J15182N2268
$$ y = [397821, 363355, 218985, 279486, 445639, 468898, 411447, 424629, 441999, 306511, 268661, 281791, 490921, 589046, 654518, 608600, 539890, 394886, 457417, 545564, 482472, 376662, 410143, 527602, 473972, 541611, 771577, 778248, 619900, 581295, 604328, 575228, 521130, 482221, 476416, 411984, 369056, 452979, 528113, 675354, 499451, 324015, 404332, 591968, 685854, 735389, 767087, 655410, 569128, 555495, 578848, 600473, 642515, 624554, 502631, 560960, 641482, 634903, 608188, 668375, 597936, 636969, 776493, 805670, 827372, 818826, 788328, 840351, 997074, 1095640, 1030570, 982060, 995461, 960728, 872086, 868864, 982049, 932919, 918645, 852649, 857205, 1000652, 1131326, 1077722, 1006163, 1027969, 1086408, 1128172, 1243354, 1295622]
16945A295622L7747n7964j20434j15002K4614j6282P3906J31918M3409K33143
16935A530677J9274N3513L2435l5554K4215J00944o0405n3279k0211P948J17135
16924A716692J04799j88P0035R301K4542j8100o3394p9803J20952J81676j11479
16913A955033n9512j8140J81244R4687R0526J33671J61165k2790q312N8111N2794
16902B618477J72159J48962J66357l7425J08314Q1740K1625l2596N9075P3734
16892C380422J55210K73585K04483K9075N0892J99701R8745K61693K44840N7898
16882D956544J80080J69146M32612L57868K61874L64359L16057J83089L22135
16873G543764L52012L45156L24476P13643M38656N07947O64937P23616O92952
$$ y = [1295622, 1333369, 1275405, 1154971, 1039969, 1064583, 1048301, 1122207, 1254125, 1297534, 1530677, 1549951, 1603464, 1635899, 1600345, 1624560, 1725504, 1665099, 1611820, 1591609, 1599557, 1716692, 1821491, 1821303, 1891338, 1900639, 1925181, 1907081, 1843687, 1763884, 1884836, 2066512, 1955033, 1895521, 1877381, 2058625, 2153312, 2243838, 2377509, 2538674, 2515884, 2507572, 2565683, 2618477, 2790636, 2939598, 3105955, 3068530, 3176844, 3258584, 3280209, 3247613, 3306688, 3380422, 3535632, 3809217, 4013700, 4042775, 4093667, 4293368, 4392113, 4653806, 4898646, 4956544, 5136624, 5305770, 5738382, 6096250, 6358124, 6722483, 7038540, 7221629, 7543764, 7895776, 8240932, 8565408, 9279051, 9717707, 10225654, 10890591, 11614207, 12307159]
16864A2307159O76141P69948R73043J003451J032775J048048J253486J137244
16856B0201295J174675J370953J324612J219401J024873J260779J116018Q94668
16848B9587274M53526L19705K39093j65452l75069l54800l97475m70234n03462
16839B8333106m38223m96978m60597k19170j11573q0827l7679J22924J33239L09790
16829B7054012L80004N14690N90225P71068R95563J148760J334247J559103J794404
16820C6142076J763175K061854K079393K120722K213421K132402K073518J856821
16812E2443382J770417J306406Q25885M47865m9537o54942j105719j102603j431509
16803E2449645j840189k008586j858351j977403j873904j701470j510276j581507
$$ y = [12307159, 12983300, 13753248, 14726291, 15729742, 16762517, 17810565, 19064051, 20201295, 21375970, 22746923, 24071535, 25290936, 26315809, 27576588, 28692606, 29587274, 30040800, 30360505, 30599598, 30434146, 30059077, 29704277, 29306802, 28836568, 28333106, 27894883, 27397905, 26937308, 26718138, 26606565, 26525738, 26488059, 26610983, 26744222, 27054012, 27434016, 27948706, 28538931, 29309999, 30305562, 31454322, 32788569, 34347672, 36142076, 37905251, 39967105, 42046498, 44167220, 46380641, 48513043, 50586561, 52443382, 54213799, 55520205, 56346090, 56793955, 56744418, 56089476, 54983757, 53881154, 52449645, 50609456, 48600870, 46742519, 44765116, 42891212, 41189742, 39679466, 38097959]
16795C8097959j536472j412988j222568j057288r77305r07585q33415n70460l14159
16786B9265719l14523l09218j55658R4966J75771L39054L89977M16770L68486
16777C0271344N24701O39851N25777M31243L23776P3681K2381j45397m18838p56378
16767C1492141j040751j130707j011661j082796j272820j164803j379221j286939
16759B2122443j089302r83581j068967r81296j022869r10645q06199q73575q35986
16750A3550023o90380o60158n79578m60563o01346n28273m69284n74024m20724
16741H565693l86305m21617m09368m52153l60091k45517l57553k74376o3614k22209
16731E372890k57194k22131j75727j60291j34754j42746k14446j14686j30416
$$ y = [38097959, 36561487, 35148499, 33925931, 32868643, 31891338, 30983753, 30150338, 29579878, 29265719, 28951196, 28641978, 28486320, 28581286, 28757057, 29096111, 29486088, 29902858, 30271344, 30796045, 31435896, 31961673, 32392916, 32716692, 32790373, 32812754, 32667357, 32248519, 31492141, 30451390, 29320683, 28309022, 27226226, 25953406, 24788603, 23409382, 22122443, 21033141, 20049560, 18980593, 17999297, 16976428, 16065783, 15259584, 14386009, 13550023, 12859643, 12199485, 11619907, 11159344, 10557998, 10029725, 9560441, 8986417, 8565693, 8179388, 7757771, 7348403, 6896250, 6536159, 6290642, 5933089, 5658713, 5595099, 5372890, 5115696, 4893565, 4717838, 4557547, 4422793, 4280047, 4065601, 3950915, 3820499]
16722C820499j95911r3111k0035k99189j14730j7875k20750k30369k34582k313
16712B391634j2279n6554q7436J2252P3918j7934j66021l6117n8688k15629k41465
16701A585681m3695o4009L5723j4576Q1849j0083L8589P5241j13564r8708j9616
16690A452832j16324j34812j17811p5680k5130L4292l0188j08591j1227j2114
16680H55247L6026l0400M000M871J0745Q7269o0829j839J1411j25239K4384J16417
16668I32063J50258m2952O3769n5304n9102j90250j15642O9287k670k0997q9159
16657F39301J4260L3974j649m8120o6271J5494P4121J55899J6860j16272j59946
16646E57651p4400k3466M7743R5402J19410k3645N7430p8115r1808j59060m8765
$$ y = [3820499, 3624588, 3531477, 3511442, 3212253, 3097523, 3079648, 2858898, 2628529, 2393947, 2391634, 2379355, 2322801, 2235365, 2247617, 2321535, 2303601, 2137580, 2101463, 2042775, 1827146, 1585681, 1541986, 1477977, 1513700, 1499124, 1580973, 1570890, 1609479, 1684720, 1571156, 1472448, 1452832, 1336508, 1201696, 1083885, 1008205, 983075, 1017367, 987179, 878588, 867361, 855247, 891273, 860873, 864873, 869744, 880489, 967758, 906929, 905090, 916501, 791262, 815646, 932063, 1082321, 1039369, 1103138, 1047834, 988732, 798482, 682840, 752127, 749457, 728460, 639301, 653561, 687535, 685886, 637766, 571495, 586989, 661110, 817009, 833869, 717597, 557651, 483251, 459785, 507528, 602930, 722340, 698695, 756125, 678010, 586202, 427142, 378377]
16635C78377J26517Q8842R9871l6555n5421J43223j32544j73801j96699j05554
16625A36256J17776J57832j139k8650L6937N2044k6391p3365j42351R5111R450
16614C33510j16512o7011l4954l072O6596P4461Q8603l9406R1909o2710n0198
16603B81216J00678K80O617R5309k2299L8967m7522j80934j45751J34380m625
16592B56316k7531J11021Q2301K2470J02141j21542j01191L6982K348K135o4320
16581C01130j12451j83721L2135K4062J00156J62224P4045q6460j96435j551O2634
16570A75768L8105N7556R6687n2466N353J0432j06525p2867J6329L0395J28090
16559C26857k8712l4085r615q4851o0714k3924j19194q6034J14421R9021n4218
$$ y = [378377, 504894, 593736, 693607, 657052, 601631, 744854, 612310, 438509, 241810, 136256, 254032, 411864, 410725, 382075, 419012, 471056, 444665, 371300, 228949, 324060, 333510, 216998, 149987, 115033, 111961, 178557, 253018, 341621, 302215, 394124, 331414, 281216, 381894, 382174, 388791, 484100, 461801, 500768, 453246, 272312, 126561, 260941, 256316, 228785, 339806, 422107, 444577, 546718, 425176, 323985, 360967, 363315, 365450, 301130, 188679, 4958, 37093, 61155, 161311, 323535, 397580, 311120, 114685, 113134, 175768, 213873, 271429, 368116, 315650, 321003, 331435, 224910, 152043, 168372, 198767, 326857, 298145, 264060, 254445, 169594, 108880, 84956, -34238, -120272, -5851, 93170, 38952]
16548C8952q2030K7577M8275J9880J21771Q4458q07Q065p8786L2567R4075j07726
16536B06271j10784o5808l0763n424M752J26609J90354M233k8915p7651J51437
16525C64311p104k04751k7651J38819O9541R2764q3594K2598Q3125j17369j10167
16514B20522Q2216J7521q4247j05200j64242j06413O5948m7176R2490K8200L7646
16503C7265J0034N1137r01j42020j18171J24531Q7776k5814k08015O137J26100
16492e1941J94426R2891k0428l9296m7895Q0982J609l2698Q186n6412o1278j0437
16480E7709K0098o5929n020L5159j6354O3491p5535N849J9524R9109M9680O6084
16468B53865o6218j91188K2340Q463K2202K2009J05797j94880p1776O0902M3834
$$ y = [38952, -43078, -15501, 32774, 52654, 174425, 258883, 258076, 266141, 187355, 219922, 313997, 206271, 95487, 29679, -1084, -6508, -1756, 124853, 315207, 319440, 290525, 212874, 364311, 357207, 152456, 124805, 263624, 333165, 425929, 342335, 364933, 448058, 330689, 220522, 302738, 320259, 236012, 130812, -33430, -139843, -73895, -121071, -28581, -381, 37265, 47299, 98436, 97535, -44485, -162656, -38125, 49651, 23837, -184178, -178041, -51941, 142485, 235376, 214948, 175652, 127757, 208739, 210348, 177650, 185836, 129424, 68146, 57709, 77807, 11878, 6858, 42017, 25663, 89154, 13619, 19468, 38992, 138101, 187781, 253865, 187647, -3541, 18799, 27262, 49464, 71473, 177270, -17610, -89386, -28484, 15350]
16457A5350o945p7614K369J56270k1712j11256j35189O8069Q7186P4334o2401
16446a1539o7624P9136K7256m7320K3429o168j20130k4602K8795k494q332K2113
16434a07480J49228R5246j53085J26568N7298j97266n1224o4998m1742J4138J7260
16423a56057k124j06764O7065M1682j4779N4209J15483J22314K7782q9794j92813
16412a33796l4169Q7644Q4655Q8995j29703q1666J25988P8426k2776r9370j56588
16401a92360p2292o0418Q1760J50405O4758r2768O9496N9250j14734n5367p5276
16390b37546O0539J71785L8442n7646j73762j30957o2374Q4142J00773P6675j1573
16379a41502R0512P6300j44719p8306J9964J0152k5878p358Q188J29020Q6757
$$ y = [15350, 8405, -69209, -66840, 89430, 67718, -43538, -178727, -110658, -23472, 50862, -11539, -79163, -27, 27229, -20091, 3338, -2830, -122960, -147562, -118767, -121261, -129593, -107480, 41748, 136994, -16091, 110477, 167775, -29491, -80715, -145713, -187455, -173317, -156057, -158181, -264945, -197880, -156198, -170977, -116768, -1285, 121029, 148811, 59017, -133796, -167965, -80321, 4334, 93329, -36374, -118040, 7948, 86374, 63598, -35772, -192360, -264652, -325070, -243310, -92905, -28147, -120915, -51419, 7831, -106903, -162270, -237546, -177007, -5222, 33220, -24426, -198188, -329145, -391519, -307377, -206604, -129929, -141502, -50990, 25310, -119409, -197715, -177751, -167599, -193477, -200835, -192647, -63627, 23130]
16368B3130l0157k21185j06565K41046J92652L139j17845p6124N7806J11235J0377
16357H7509j27505p3955q3327n0630l7056K36189J26211O9290o8433m8366r4533
16346f4606m1392J4338K06127j4385k54300J00955o1784o8613O9905L7845N9672
16335a6238j38106l8706m0192q2573J36884R1797N7554m0868l8241Q920K5271
16324g4498j67682N1415K3780R0238P7411J09902j35468n6498K5082k1170N5277
16313b2211R7088L2357L2564O0035q494k36203p5089K3825K40504J09409k23100
16302C0685O7559j351j20963n7278j2254j5477K2455k1788O1337K8968K5836J4036
16290B1765j03610r0469P8790m7963q7418N1593J45386j646j1546P6888J73578
$$ y = [23130, -7027, -228212, -334777, -93731, 98921, 102060, -15785, -91909, -34103, 77132, 87509, -39996, -113951, -197278, -247908, -284964, -48775, 77436, 146726, 78293, 29927, -64606, -105998, -91660, 114467, 100082, -154218, -53263, -115047, -183660, -113755, -75910, -16238, -154344, -193050, -233242, -315815, -178931, -87134, -29580, -70448, -108689, -99769, -74498, -242180, -190765, -166985, -76747, 664, 110566, -24902, -81400, -56318, -77488, -22211, 74877, 107234, 139798, 199833, 191339, -44864, -119953, -96128, 144376, 253785, 30685, 98244, 96893, -24070, -81348, -93602, -109079, -86624, -108412, -47075, -18107, 7729, 21765, -81845, -172314, -93524, -141487, -228905, -177312, -31926, -33572, -45118, 31770, 205348]
16279B05348k967j18470m4123n688J65925q7406l1217K2802j13338P928K2101
16268B0895J2455N770j60151l7804N9089n579L1184L2880O7999K4010l7393N6320
16256F9675L4532r8480l4059J23239P6182j30241M6932j7944j7449J743J7984
16245G2114q3840o2148K9320N2868J30876o1367j61596n5315k4306P6291m3134
16234a30237m2578K787P4711J8143P84N779Q8443O982J54860K3821k03083p6515
16222g6103R462q0237K4063J10076n6138o9831J43147J24813j1866j26189K9792
16211B0989R7732q1747r8469N4950J0936J05101J41197k47689j70721K01086R4428
16200A27793J8244k29567l7274N7793J4203o7425n9019Q6862M3756L9165J41661
$$ y = [205348, 202381, 83911, 39788, 34100, 200025, 112619, 81402, 104204, -9134, -1206, 20895, 33350, 39120, -121031, -158835, -99746, -105325, -74141, -41261, 26738, 50748, 13355, 69675, 104207, 5727, -28332, 94907, 171089, 40848, 87780, 69836, 52387, 54130, 72114, -11726, -73874, -44554, 8314, 139190, 77823, -83773, -139088, -163394, -87103, -130237, -172815, -170028, -95317, -77174, -76390, -70611, 17832, 24814, 179674, 203495, 412, -76103, -66641, -146878, -122815, -12739, -68877, -138708, 4439, 129252, 117386, -8803, 20989, 118721, 36974, -61495, -6545, 4391, 109492, 250689, 3000, -167721, 33365, 127793, 146037, -83530, -120804, -63011, -48808, -116233, -175252, -88390, -44634, -5469, 136192]
16189A36192J3818j31367m8861n1249n1668l3066J2762P6074K42333P0968q6218
16178A49718N1299k240p5554j79042n9311j461k7036J49796j5133N4511j6968
16167B8579K7623L2902k2764q0519n3118N6925O4515m871P3243L8535j43883m7594
16155c0427N374J14115k7030O7685K0361O821j08605j15343J3091Q6376M2611
16144G5029K6725J18297k7903R685o0624l3316O4858k6754N1510r3042j68270
16133f3805O4951J47963p1505n5363j4705r1975M1920J15309O3346n1630M2358
16122A26864j12301p0057J4618p4074J24042M7313J2837k4105j65931q9767L9783
16111a70778J75765N3905r4639q120N6405k5931j52080J5484J49184J38648P0363
$$ y = [136192, 150010, 18643, -30218, -81467, -133135, -166201, -153439, -77365, 164968, 235936, 149718, 201017, 198777, 123223, -55819, -115130, -116591, -143627, 6169, -8964, 45547, 28579, 56202, 89104, 66340, -14179, -67297, -10372, 54143, 49272, 122515, 161050, 17167, -30427, -25053, 89062, 62032, 129717, 150078, 156899, 48294, -67049, -53958, 32418, 75029, 101754, 220051, 192148, 201833, 141209, 107893, 172751, 145997, 197507, 104465, -63805, 1146, 149109, 77604, 22241, 7536, -84439, -42519, 72790, 136136, 84506, 126864, 14563, -55494, -40876, -114950, 9092, 56405, 69242, 45137, -120794, -210561, -170778, 4987, 58892, -35747, -43867, 12538, -13393, -165473, -149989, -805, 137843, 208206]
16100B08206l2290k6447j50949m1094J10930n0132r5095N3671R1796k2335p6945
16089c0684N8362J03412N0038m4714l8421q4604j37472l5032J5734J6692j15070
16078b41759L3960J21055Q0272J57252J643k24801j47330k9324K1497J5859J7897
16067a93779J98152j6027j06573J7061O3855m0729J1043k9715m5765Q6078j3263
16056f9662Q1142L7166P1316j3296j0771Q5009L6396J23880j05934k8661r8785
16045A07800j49295r7827l8322J04443J20569j7710l4813J27791J9446m6547Q895
16034A04430P1011K8199r8717r8906J7854n2512J3107N2508M5097J14764m2067
16023A54768j11121J41496j7584o9359j42177j11194Q3528P9526J15010N7650
$$ y = [208206, 175916, 149469, -1480, -42574, 68356, 18224, -76871, -23200, 68596, 46261, -30684, 27678, 131090, 181128, 136414, 97993, 13389, -124083, -159115, -143381, -126689, -241759, -207799, -86744, -6472, 150780, 152423, -72378, -219708, -249032, -227535, -211676, -193779, 4373, -11654, -118227, -101166, -37311, -78040, -66997, -96712, -142477, -56399, -69662, 11480, 48646, 119962, 106666, 95895, 180904, 217300, 341180, 235246, 206585, 107800, -41495, -139322, -177644, -73201, 47368, 29658, -5155, 122636, 142082, 95535, 104430, 175441, 203640, 104923, 6017, 23871, -28641, -15534, 36974, 82071, 196835, 154768, 43647, 185143, 167559, 98200, -43977, -155171, -71643, 7883, 122893, 180543]
16013A80543j58085r2108J5003J20747R2514Q1389Q492p4721p1271r3284j05632
16002i6413N7074J16996j12402l2558O6584J06840O2909j40775l4767j1321J59768
15991A41935q032n9209N6274Q1650j02458r4362J4758j5402k963P5530j7726K5071
15979I5066K5748O3465J09978m7121l3970j09817l1647m853K5469O499k3857P3624
15967A48584l280r6789P448M2766l4696l8254N0801n8752J86452n5644q1609j110
15955F5917Q6854N506p8322J1079N1980K17853m9340j05833L8632L2524j01117
15944A75733r4421k3340J26513J28130O2109p1005j15331o5535j5094R3495l240
15933A98014q2320j16302K0857L3970p9698M4206q1107J33029N1335K397n0250
$$ y = [180543, 22458, -69650, -54647, 66100, 158614, 240003, 248495, 173774, 102503, 9219, -96413, -39339, 77657, -34745, -67303, -719, 106121, 169030, 28255, -6512, -17833, 141935, 133903, 74694, 130968, 212618, 110160, 15798, 30556, 15154, 12191, 87721, 69995, 95066, 120814, 184279, 294257, 247136, 213166, 103349, 71702, 66849, 92318, 98817, 74960, 148584, 145304, 48515, 55963, 98729, 64033, 25779, 76580, 17828, 204280, 148636, 67027, 65917, 152771, 158277, 79955, 91034, 143014, 360867, 311527, 205694, 244326, 276850, 175733, 81312, 57972, 184485, 312615, 374724, 303719, 188388, 122853, 107759, 201254, 198014, 115694, -608, 20249, 54219, -25479, 18727, -62380, 70649, 121984, 124381, 74131]
15922G4131N4635L2830J0066N9227p2795M3354K12178n7260j26328L1877m7595
15911B14320j56738j21497J0581J38146Q7093J8806L5043l5786j05623N684l4566
15900E5463n9403J13437R870J18948Q8252k737r1055j08275L4363J01725n8380
15889B02208q880m2573m2946k1928n7634P5279P0627N0085n8578M3364L3633O8191
15877C10848l6370O0852j7140j04529j37416K0099k6852l4203J19627P6933J5676
15866B47525j5903J83173P8208o876p7030j42950j12536r996K3147J6471J12241
15855B95474Q0055r4118j31921n2425J05890R9814p5643m7704k8776n6826p2650
15844B1170k864J07187M4938Q5464Q511n0697J1202n189n2356j2241J20363J30386
$$ y = [74131, 128766, 161596, 171662, 230889, 158094, 201448, 413626, 356366, 230038, 261915, 214320, 57582, -63915, -53334, 84812, 171905, 190711, 225754, 189968, 84345, 90029, 55463, -3940, 109497, 119367, 238315, 326567, 323830, 232775, 124500, 158863, 260588, 202208, 193328, 150755, 107809, 85881, 28247, 103526, 174153, 224238, 165660, 209024, 242657, 310848, 274478, 335330, 318190, 213661, 76245, 96344, 69492, 35289, 154916, 231849, 247525, 231622, 414795, 493003, 486127, 409097, 266147, 153611, 143615, 166762, 183233, 295474, 375529, 281411, 149490, 97065, 202955, 302769, 227126, 179422, 150646, 93820, 21170, 18306, 125493, 170431, 255895, 264406, 213709, 224911, 219722, 167366, 155125, 275488, 405874]
15832D05874j83041j22975M1698Q8805j7800n3758J3913N5938P7875J2565r2589
15821B26505j75309R130K5074j9884P6245R6251N1351Q6398p8751r6727Q7612
15810B87895j2804K1639N0978q3629q1306l0056J15822R2480R2211J29226J0386
15799E92842J0799j70741l9577J29110o9694j31349j39494j71345q7983K44106
15789A66674L2717o0100n3786J5520M4417J41048J00721R2603m6323p5295r3309
15778B64887m7333M2749l3633p2432n96R8093J8569j15228j23440J54518Q2614
15767B68768k0537m1008l6636O2352K3601l4986K3092J30690J23059o9056p8488
15756C50851r635L4599k575Q7427J04796J0131n2838J04005n4903j1618O6828
$$ y = [405874, 222833, 99858, 141556, 230361, 212561, 158803, 172716, 228654, 306529, 319094, 226505, 51196, 60326, 85400, 65516, 141761, 238012, 289363, 375761, 297010, 200283, 287895, 275091, 296730, 347708, 264079, 182773, 152717, 268539, 361019, 453230, 582456, 592842, 603641, 432900, 393323, 522433, 452739, 321390, 181896, 10551, -77432, 166674, 199391, 139291, 85505, 101025, 145442, 286490, 387211, 479814, 433491, 358196, 264887, 217554, 260303, 226670, 154238, 153642, 251735, 270304, 155076, 31636, 186154, 268768, 248231, 207223, 170587, 232939, 256540, 221554, 244646, 375336, 498395, 429339, 350851, 341216, 375815, 373240, 460667, 565463, 575594, 522756, 626761, 571858, 560240, 627068]
15745F27068j1326j18856l7195J26754J22667q0994k33619K9266O9999n7226o6767
15734C69771k1776j9225J45360J57312M4843r3161n4372J52757Q8327n6130j52011
15723E61695m8127r5874k9651j02913Q2460K26379M1379Q8861n7378k05304N9078
15712E20605M4824L2907k5184N8154L9868j20216J2889N2162l4493j4064N4546
15701F21998N479L4322O1827q5234m298R86N0390J4987l4172k7237O965R4714
15689G40727r937J02550m8606l1224R5431r3545N6958J93988J84245J86068L6177
15678A412832J69362N8741L2015J07394L1525j21824m4240j16465k32314j04304
15668A192722j13206q3839j10677p8101L9832N2268L0922J34921n7140j60578
$$ y = [627068, 615742, 496886, 459691, 586445, 709112, 628118, 394499, 423765, 493764, 436538, 369771, 347995, 328770, 474130, 631442, 676285, 583124, 528752, 681509, 769836, 713706, 561695, 513568, 417694, 388043, 285130, 367590, 593969, 635348, 724209, 666831, 461527, 520605, 565429, 598336, 573152, 631306, 671174, 550958, 563847, 616009, 581516, 567452, 621998, 627477, 661799, 723626, 638392, 634094, 635080, 685470, 700457, 666285, 639048, 646013, 740727, 730790, 833340, 784734, 753510, 848941, 755396, 812354, 1006342, 1190587, 1376655, 1412832, 1582194, 1640935, 1672950, 1780344, 1811869, 1690045, 1645805, 1529340, 1297026, 1192722, 1079516, 995677, 885000, 806899, 846731, 898999, 929921, 1064842, 1007702, 847124]
15658H47124p4223J44817R1515l1299j8815q9368m8077Q1240J45495l6244j40616
15647H71549j0914J55540n9972m5955O4506P6125q9402R2480J17682r1923j13973
15636I65743k7635K733Q4978r0940l4321O7692n46j5242q6823J6368O7825J840
15624I51672j27633K2046L4738R0142j823n4132K3095M1876J45315J16319J39503
15613A381118M4163l7234j0249J249K2320q4850p7043L2557J71521O858m8996
15602A401414P7758k4418k038K2025k7941R9997J22981P968j6135o6072m4814
15591A550725P9848o2980j07326r0056j8307N9044J78453N7883K17410p9088q7986
15580A697620J6545o6793q4775m91N3953n7046P1885K32K10419L32563j29697
$$ y = [847124, 772901, 917718, 1009233, 977934, 959119, 869751, 821674, 902914, 1048409, 1012165, 871549, 860635, 1016175, 956203, 910248, 974754, 1050879, 961477, 1053957, 1171639, 1079716, 965743, 938108, 940841, 1025819, 934879, 900558, 968250, 967704, 952462, 865639, 882007, 949832, 951672, 824039, 846085, 880823, 970965, 969142, 915010, 938105, 979981, 1125296, 1241615, 1381118, 1425281, 1388047, 1377798, 1379047, 1401367, 1316517, 1239474, 1272031, 1443552, 1450410, 1401414, 1479172, 1454754, 1452716, 1474741, 1446800, 1546797, 1669778, 1677746, 1661611, 1595539, 1550725, 1630573, 1567593, 1460267, 1370211, 1351904, 1410948, 1589401, 1647284, 1864694, 1785606, 1697620, 1714165, 1647372, 1562597, 1562106, 1616059, 1559013, 1630898, 1631130, 1841549, 2174112, 2044415]
15569B044415k4963R1709m3815j366k2038p3033r2543N6126M1142L6293J5309
15558B027236K3803J17087J32458m0697j13820J7121R2386J47967R3537n8130
15548B438948p7936J32163J57960J17837m0905m5209r043P3658J14611O6756P2690
15537C001530M3961J4871j27354p3272P6972J78374J16791J1256O5837Q4400P5685
15526C469051J10607J09474k3466M0777O2153K6157P8402Q6672J36667M7446R8039
15515D241979J03924k142Q9916M8456O2193K00625R4816J4906J28210J1508J36245
15504E130636J56863J37394K44745J6077j4517K8310R0661O5713K4074O9005J73104
15493F122065R5876O4066Q3473K04730L04223L63400K30518N6587Q8755J21592
$$ y = [2044415, 2019452, 2111161, 2067346, 2065980, 2043942, 1970909, 1878366, 1934492, 1975634, 2011927, 2027236, 2051039, 2168126, 2300584, 2259887, 2146067, 2163188, 2255574, 2403541, 2497078, 2438948, 2361012, 2493175, 2651135, 2768972, 2728067, 2682858, 2673815, 2747473, 2862084, 2928840, 3001530, 3045491, 3060362, 2933008, 2859736, 2936708, 3115082, 3231873, 3243129, 3308966, 3393366, 3469051, 3579658, 3689132, 3665666, 3706443, 3768596, 3794753, 3873155, 3959827, 4096494, 4143940, 4241979, 4345903, 4343761, 4433677, 4482133, 4544326, 4744951, 4839767, 4854673, 4982883, 4994391, 5130636, 5287499, 5424893, 5669638, 5685715, 5671198, 5699508, 5790169, 5855882, 5879956, 5948961, 6122065, 6217941, 6282007, 6365480, 6570210, 6874433, 7237833, 7468351, 7524938, 7613693, 7735285]
15483G735285K14869J32389O9569K61576J18816J25944K15353K15342K08905K97893
15473I595941L48567K00407L28324K89654L01623J97768J36882L25046M11974
15464A2136186K24955J68936L71250M14159L89702L04834N24408O67574O01798
15455A5803802L94815M05952L89478P02010Q11216O60673Q02141P13706O97408
15446B1381201P99795P39043Q44614R48085J181333J259826J205030J205404J361399
15437C0925730J554203J522074J571259J508369J734185K021727K242576K343150
15429D5423273K560425K667859K611770K844801L231847L407011L688444L871394
15421G0306824M069772M280721M619092M819774N104284N232247N336570N413404
$$ y = [7735285, 7950154, 8082543, 8152112, 8413688, 8532504, 8658448, 8873801, 9089143, 9298048, 9595941, 9944508, 10144915, 10473239, 10762893, 11064516, 11262284, 11399166, 11724212, 12136186, 12361141, 12530077, 12901327, 13315486, 13705188, 14010022, 14534430, 15202004, 15803802, 16198617, 16604569, 16994047, 17696057, 18507273, 19167946, 19970087, 20683793, 21381201, 22180996, 22920039, 23764653, 24712738, 25894071, 27153897, 28358927, 29564331, 30925730, 32479933, 34002007, 35573266, 37081635, 38815820, 40837547, 43080123, 45423273, 47983698, 50651557, 53263327, 56108128, 59339975, 62746986, 66435430, 70306824, 74376596, 78657317, 83276409, 88096183, 93200467, 98432714, 103769284, 109182688]
15413A09182688N546844N369726N362651N367365M959241M445148L980827L316347
15405A47530837K507907J721433R30491j3245q35060j516639k334983k900089
15397A45090652l379991l874217m308706m551909m689491m770432m818824m840588
15389A09856494m801642m721207m390239m249835m193230m103615l970834l616143
15381G5809749l513779l630200l378697l134461k981105l047285k692635k371858
15373E1059729k306351k297511k253577k120943j772934j745992j787641j723317
15365C5051463j579880j440232j387230j271755j083249j167456j225180j081570
15357B4814911q35653r87823r63440r28579o98362q86407r38909p50891o53314
$$ y = [109182688, 114729532, 120099258, 125461909, 130829274, 135788515, 140233663, 144214490, 147530837, 150038744, 151760177, 152690668, 152677423, 151842363, 150325724, 147990741, 145090652, 141710661, 137836444, 133527738, 128975829, 124286338, 119515906, 114697082, 109856494, 105054852, 100333645, 95943406, 91693571, 87500341, 83396726, 79425892, 75809749, 72295970, 68665770, 65287073, 62152612, 59171507, 56124222, 53431587, 51059729, 48753378, 46455867, 44202290, 42081347, 40308413, 38562421, 36774780, 35051463, 33471583, 32031351, 30644121, 29372366, 28289117, 27121661, 25896481, 24814911, 23979258, 22991435, 22027995, 21099416, 20401054, 19514647, 18575738, 17824847, 17171533]
15348A7171533n03489n32045o65237m70023n34914n76394n83968l37392l59602
15339A2608469l53822l66433m20714m82361l41037l08575k06976l49482l83023
15330I396046k63913k02070k48439j66108r0403j51417k31036k13012l36492j21932
15320G371224k34458k58285j71615k45753l04176n1218O0564j163q9276j39015
15310E936829k79619j31729j00053j18116k07518j90940r4783j49586j75170J8311
15300D507626n1548k18667k6037O553o6760k8821j45252j3606j21406p3222o2220
15289C706640p1502m8627k7808p1035j56041J8157J64547j04769j06191J9636
15279C323007k8851j23655r1976j20723j0238N9610j23402j52098M0855N3562
$$ y = [17171533, 16668044, 16135999, 15470762, 15000739, 14465825, 13889431, 13305463, 12968071, 12608469, 12254647, 11888214, 11467500, 10985139, 10644102, 10335527, 10128551, 9779069, 9396046, 9132133, 8930063, 8681624, 8515516, 8425113, 8273696, 8042660, 7829648, 7493156, 7371224, 7136766, 6878481, 6706866, 6461113, 6156937, 6105719, 6166283, 6165120, 6075844, 5936829, 5657210, 5525481, 5425428, 5307312, 5099794, 4908854, 4814071, 4664485, 4489315, 4507626, 4456078, 4237411, 4211374, 4217927, 4151167, 4122346, 3977094, 3963488, 3842082, 3768860, 3706640, 3635138, 3586511, 3558703, 3487668, 3331627, 3349784, 3514331, 3409562, 3303371, 3323007, 3294156, 3170501, 3078525, 2957802, 2947564, 3007174, 2883772, 2731674, 2772529, 2826091]
15269B826091j4659r9013p9033m2287j86155m4755j4908J13278J02959P1486j10446
15258B522558r6776j75572J7700J19395K4604j25220j33155j63013o4232J0423
15248A936712O1274Q3004p1329j09502L2141l4088O266n2562j23582J64137m3715
15237A848756j12377o8846M2440J13718o4371R495p6314k6769R5083l1606j31335
15226A597874o2996l8378p6957J8967J8281M3373J167R594R8106k724j75110p6156
15214A355041q7878n0761N6047o7366k3835K5965L9729r9261j00679p4253J17844
15203A090593J06398Q7020J5888L0108n9264k80821k9925P3405M3412p2729R564
15192A013649J0244M0344J70497j37337q3013p6011k0418J2984l6197l683K1192
$$ y = [2826091, 2811432, 2712419, 2633386, 2591099, 2404944, 2360189, 2345281, 2458559, 2561518, 2633004, 2522558, 2425782, 2250210, 2267910, 2387305, 2411909, 2286689, 2153534, 1990521, 1926289, 1936712, 1997986, 2080990, 2009661, 1900159, 1932300, 1898212, 1904478, 1851916, 1728334, 1892471, 1848756, 1736379, 1667533, 1709973, 1823691, 1759320, 1768815, 1692501, 1665732, 1760815, 1729209, 1597874, 1534878, 1496500, 1419543, 1438510, 1456791, 1500164, 1501331, 1510925, 1609031, 1606307, 1431197, 1355041, 1267163, 1216402, 1272449, 1205083, 1181248, 1207213, 1246942, 1147681, 1047002, 972749, 1090593, 1196991, 1284011, 1299899, 1330007, 1270743, 989922, 959997, 1033402, 1076814, 1004085, 1013649, 1023893, 1064237, 1234734, 1097397, 1014384, 938373, 917955, 930939, 894742, 891059, 912251]
15181I12251k1031J58493q0834p0794K4230R8669L4023q3526K1762l921K6350
15170A015672k7801j86307p3941K6950M0474N9015P7707L3958k0082n3853K9809
15159I21601j46698l6666R1779M9377Q415M0054M4801k6117q1879j17671j0157
15148G36839r0673N321J05960J3162o996M6699L4398J4669k6707n0379J12940
15137H95233J3027n072Q7103J52258k5834R8606J76872N6955J58365o3931m1946
15126A501636o4026r6411j24972j9302n0032q2268j86390r5319j8618M1441R3306
15115H99045N0548j20973j95126q9872J11259J03423J2699p3801j65382n3289
15105D78531N1180J4785o2328L2123o7189l0168j26824J271O7386K9383J40400
$$ y = [912251, 891220, 1049713, 968879, 898085, 922315, 1020984, 1055007, 971481, 993243, 989322, 1015672, 987871, 801564, 727623, 754573, 795047, 854062, 931769, 965727, 945645, 891792, 921601, 774903, 738237, 830016, 879393, 887808, 927862, 972663, 946546, 864667, 746996, 736839, 646166, 651487, 757447, 770609, 763613, 810312, 844710, 859379, 832672, 782293, 895233, 908260, 903188, 990291, 1142549, 1116715, 1215321, 1392193, 1449148, 1607513, 1543582, 1501636, 1437610, 1341199, 1216227, 1196925, 1146893, 1064625, 878235, 782916, 764298, 805739, 899045, 949593, 828620, 633494, 543622, 654881, 758304, 771003, 697202, 531820, 478531, 529711, 544496, 482168, 514291, 447102, 416934, 290110, 291381, 358767, 388150, 528550]
15094E28550l5336r2128j91916p644J79437n0782J70494O4706P4989m0950q7387
15083E12033o0548p8731L7234K8752q8070j58498J3531l3399K9899L0431P1853
15072C04487Q0895K7386P850p4447r5138k9960l6929P6848P3058m946j54348j23269
15060E1487L7423R617j24981J263J46145O4977n7433n3370j0094L5665L4838R6242
15048B31779n4608q0147j25878N8186J22192K3804l4182j09159J7871J45065k5377
15037A69546k7448P2789J01436J4226n4985n8281n3405j3401n7308k4671K8993
15026I7491N8544n7196n0456R4835M8348O7818p2983r5677r1551L616j20512O4553
15014e3170J34617J02593J09688M1421o0562n9217r1948J177Q4280O0930n7189
$$ y = [528550, 493214, 401086, 209170, 201526, 380963, 330181, 500675, 565381, 640370, 599420, 512033, 451485, 372754, 409988, 438740, 350670, 192172, 205703, 172304, 202203, 232634, 304487, 385382, 412768, 420618, 346171, 251033, 221073, 184144, 260992, 334050, 329104, 174756, 51487, 88910, 98527, -26454, -25191, 120954, 185931, 128498, 75128, 65034, 100699, 135537, 231779, 177171, 97024, -28854, 29332, 151524, 175328, 141146, 31987, 49858, 194923, 169546, 142098, 214887, 316323, 330549, 275564, 217283, 163878, 150477, 93169, 68498, 97491, 156035, 98839, 48383, 143218, 191566, 259384, 186401, 90724, -827, 2789, -117723, -53170, 81447, 184040, 293728, 335149, 274587, 215370, 123422, 124599, 208879, 269809, 212620]
15003B12620j04747r3143k0201l3552K8261L4859Q4455L1604O1426k8314r4300
14992G8968R7597M3297r9272j66713O1998K45956J46785K4538k21185k03808K992
14981A1153J35116K10144J3790q704m6149q1745q5642m5935q702m8078M1465m8518
14969C8195m1705J44975K3440p2397j07888J01721J54611J42639l3411p5512l6362
14958B38306j57408M9424K08855M0654j09095j13417j43685j0048P6463Q3649
14948A63698j5649k6066l5254q9219r9907N2988k483L5120N5502R079Q8929R6095
14936B32833o5736n7318n0632K7427j01289j00266J9376L0726J0372k5193J21181
14925D1481J02596J28263j3198p8819L4889k7040j94809L0269O2826j3112N6622
$$ y = [212620, 107873, 14730, -5471, -39023, -10762, 24097, 108552, 140156, 201582, 173268, 78968, 176565, 219862, 120590, -46123, 15875, 261831, 408616, 433154, 211969, 8161, 11153, 146269, 356413, 370203, 361499, 315350, 233605, 147963, 102028, 93326, 45248, 86713, 38195, -3510, 141465, 164905, 92508, -15380, 86341, 240952, 383591, 350180, 274668, 238306, 80898, 130322, 339177, 379831, 270736, 157319, 13634, 3586, 80049, 163698, 148049, 121983, 86729, -2490, -102397, -49409, -51892, -16772, 38730, 47809, 136738, 232833, 167097, 109779, 59147, 86574, -14715, -114981, -95605, -64879, -54507, -79700, 41481, 144077, 272340, 259142, 180323, 215212, 188172, -6637, 23632, 86458, 73346, 129968]
14914A29968M3854k34625j9970J70698l7838o3534n2933j08956K5668P7452O9681
14903e35P4756L1073o1041m3913o911j3299l1528N7138j11114k8798P6727J9601
14891c7844P2732M3346J0922q4210N8178q035j75673o1515N9241k0651l4004o9278
14879b46791K7376M9995K3212M5412J21562J1644o1794j11235J54782Q7003j22053
14868b0887m9107j38777o6080P1521J86781J83993L4139P5032j9705j00862O0673
14857B16721Q305j92053j12143P784J03815J05675L1588J04610m3434k75n1561
14846A79032l0777j7530j5676q7304O6831l0383M8148J06439k3331k9593K4579
14835A90435q6968j81345o8024R2365L5983J2961n168N2189O5506R4123N4111
$$ y = [129968, 173822, -60803, -80773, 89925, 52087, -11447, -64380, -173336, -147668, -70216, -535, 74221, 105294, 44253, 340, -6571, -19870, -51398, 5740, -105374, -134172, -57445, -37844, 34888, 78234, 89156, 4946, 63124, 55089, -120584, -182099, -122858, -143509, -177513, -246791, -219415, -169420, -146208, -100796, 20766, 32410, -29384, -140619, 14163, 101166, -20887, -69994, -208771, -274851, -203330, -16549, 167444, 201583, 276615, 256910, 156048, 216721, 225026, 32973, -79170, -71386, 32429, 138104, 169692, 274302, 230868, 230593, 179032, 148255, 130725, 115049, 27745, 94576, 64193, 112341, 218780, 195449, 165856, 190435, 103467, -77878, -145902, -53537, -17554, -4593, -9761, 42428, 107934, 202057, 256168]
14824B56168j59994n6991K2172K0981M1344l02o6768J18686J8774k13481j0698
14813c0109J38677N9538M1995r6645p0614m1004J720R1332K7127l657Q3183l8855
14801A62688j40303j41463J9659L3867K4687P4721n9390j74402l3278j6720J00456
14790a49478J53908J04770O8387K0917j37889J8630L8211j9963N4826J25206m9336
14779B28189r9831j40793q4449Q4762r1705j34044K5019j3304P1222J41445Q0037
14768F6548j4787p516K9879o9445n5360M7966R6959N9291o3867j19468q3145r5494
14756b08439o6515R8284K09722N0183j28724o6237K0867L2316J35950N5027J4958
14745A47392q3840J117q468o8495m2998K713m0349j36452J53410M1367r0490P7066
$$ y = [256168, 96174, 39183, 61355, 82336, 123680, 123378, 56610, 175296, 194070, -19411, -30109, 108568, 168106, 210101, 113456, 42842, 1838, 3558, 94890, 122017, 118360, 201543, 162688, 22385, -119078, -99419, -65552, -40865, 33856, -25534, -199936, -233214, -249934, -149478, 4430, 109200, 177587, 198504, 60615, 79245, 117456, 97493, 152319, 277525, 228189, 128358, -12435, -96884, -12122, -103827, -237871, -212852, -226156, -154934, -13489, 66548, 51761, 44245, 74124, 4679, -50681, -2715, 94244, 153535, 89668, -29800, -112945, -208439, -274954, -176670, 33052, 83235, -45489, -111726, -90859, -58543, 77407, 132434, 147392, 63552, 64669, 56201, -12294, -55292, -52579, -92928, -229380, -75970, -34603, -125093, -48027]
14733d8027J28224O473r1169l9753J0758L2926L8152j6718m305K2059P2590m5236
14721F5974j07211o4987P2555r97L4927P9333n3427m5036N3003R0074o5289m5062
14709A3857q6800j2805q3182J01910j1803m9734R488K7548r4371j8601J9114m367
14697a89746k1786j1552P5979R5822L3346p9026j27110K0541j9189q201n0208
14686b81130M3689R9771J1905L3288O2173L425N9558J4817r6573p4174J63398
14675D0147Q0741K8679Q1834J5050j13071j81243j15507N9290J60921j7579p6141
14664c6879j79373L016N4174J20027R3139o9350j28194L3024K9404M6230k4258
14653e9040Q7232R4912M1092o6922K4636n5639j02706Q2874K7285q15o3938K258
$$ y = [-48027, 80197, 86670, -4499, -44252, -33494, -568, 37584, 20866, 16561, 38620, 111210, 65974, -41237, -106224, -33669, -34666, 261, 79594, 26167, -18869, 34134, 124208, 58919, 13857, -72943, -85748, -168930, -67020, -78823, -128557, -119069, -91521, -185892, -204493, -185379, -189746, -211532, -223084, -147105, -51283, -17937, -96963, -224073, -203532, -222721, -230922, -281130, -237441, -137670, -125765, -92477, -30304, -26879, 32679, 47496, -49077, -123251, 40147, 120888, 149567, 231401, 246451, 133380, -47863, -163370, -104080, 56841, 39262, -36879, -216252, -213236, -159062, -39035, 54104, -15246, -143440, -110416, -81012, -34782, -59040, 28192, 123104, 164196, 97274, 121910, 66271, -36435, 46439, 73724, 72909, 8971, 11229]
14641A1229J44108j00208j19332L4702l207l6450k4717p4319j5532J5044R6261
14630g2421J46501k8849K9352N5560J5094q4008r2268L828K9021Q204m342n0817
14618d5145M0163M0449j35494q1730o129N6831l7427j65832j29880J42527J45045
14607a76622J22238j39495m0695R9463J28513j1210L9169K0056p5367n6014Q3604
14596f360p4694L9133P1903j0608j74368k4435Q8339R692j05590j55484O5258
14585b77214R3731R3829N2521j11642J5170l2046p822J71540O5158j18269K9467
14574b5577r598N4874J9926l3565J5612q7662m5143J411o0837J3703J21554J49719
14562A14417J0391J05551j66581J0042j9657l2750l8976j16595J10254m6680j15224
$$ y = [11229, 155337, 55129, -64203, -29501, -32708, -69158, -93875, -168194, -183726, -168682, -72421, 74080, 45231, 74583, 130143, 145237, 61229, -31039, -27211, 1810, 10014, 5672, -45145, -4982, 35467, -100027, -181757, -187886, -131055, -168482, -334314, -464194, -321667, -176622, -54384, -193879, -234574, -135111, -6598, -17808, 21361, 41417, -33950, -89964, -6360, -81054, -41921, 29982, 19374, -154994, -179429, -91090, -81398, -186988, -342472, -277214, -183483, -89654, -37133, -148775, -133605, -165651, -173473, -1933, 63225, -55044, -25577, -35175, 19699, 39625, 6060, 21672, -65990, -111133, -109722, -170559, -156856, -35302, 114417, 124808, 230359, 63778, 73820, 54163, 21413, -17563, -134158, -23904, -70584, -185808]
14551a85808N4494J815j16824r3270J8410J45490L7899N0155J5572J85310M8267
14540A61510p4612l2838J36505M9871n7645j16689p2189p3J845O7079r0961j19684
14528a47881L3109k014O8322J04362J10556L7983P2462k68634j29627N519N929
14517a09914N1801m0354Q258R8251k2820l9150L2418J2581N9613M3351J46107
14506B40142j1568m1646o3274o4085l1093P7080L7375j27496j2769P7843K3442
14495A03951j63275j28806J86936N039o0436j00934q5115l9480Q1523m7523r7279
14484c45399N6877K4893k1115N0530n9676J77161K7667o8381K6991j3557Q7634
14473e6375r634j59735o3120M9599P5526P1562k936k7312j5877J04449N4947Q8488
$$ y = [-185808, -131314, -129499, -246323, -339593, -321183, -175693, -137794, -87639, -72067, 113243, 161510, 86898, 54060, 190565, 240436, 182791, 66102, -6087, -6160, -4315, 62764, -28197, -147881, -114772, -116786, -48464, 55898, 166454, 204437, 276899, 8265, -121362, -115843, -109914, -58113, -98467, -90209, 8042, -14778, -53928, -21510, -8929, 50684, 94035, 240142, 228574, 186928, 123654, 59569, 28476, 105556, 142931, 15435, 2666, 80509, 103951, -59324, -188130, -1194, 3845, -56591, -157525, -242640, -282120, -200597, -248120, -345399, -288522, -263629, -284744, -234214, -293890, -116729, -89062, -157443, -130452, -144009, -56375, -66009, -225744, -288864, -239265, -163739, -92177, -95113, -122425, -138302, -33853, 21094, 109582]
14461A09582K3078r1041o2450o3632j9983l4271o9298Q8267n8991L7543o2587
14450b03783j21898m12K18195R0191O1326l9555J52048n1880k50571j13320L3553
14439b26106M5666l3287N0406J17408L2590R8848p8615N004p0665r4887p3856
14428b27494R4642O6714q2371J00925m2008J17742O9637m5532j72630L7096J6259
14417f7020J0493j25519K5624J61487o2925o7058M4311M8227O6039J6234J21998
14406A71891J1499N627l1200p4542m7698m5609n7915J04120M8157n4739R923l6135
14394C379j11558j15925j07934J52944Q3326q2254m6184j35374M6669J16452n2863
14383b49322N8586J96222K9015j11049L9791J00005O7216L4169j00668r7547l0586
$$ y = [109582, 132660, 41619, -20831, -84463, -104446, -138717, -208015, -119748, -178739, -141196, -203783, -325681, -326093, -107898, -17707, 43619, 4064, 156112, 104232, -146339, -259659, -226106, -180440, -213727, -163321, -45913, -13323, 85525, 6910, 11914, -58751, -153638, -227494, -132852, -66138, -148509, -47584, -89592, 28150, 97787, 52255, -120375, -83279, -67020, -56527, -182046, -156422, 5065, -57860, -124918, -80607, -32380, 33659, 49893, 171891, 183390, 189017, 157817, 83275, 35577, -10032, -67947, 36173, 84330, 29591, 39514, 3379, -108179, -224104, -332038, -179094, -95768, -178022, -224206, -359580, -312911, -196459, -249322, -190736, 5486, 34501, -76548, -36757, 63248, 130464, 164633, 63965, -33582, -64168]
14372f4168j5144K8462n1784J87395J41166j64724j03603k01657m3180J2732M6616
14361b27889j7050J93022m437n3100M6172O4833P1202J307M6549L2262r4234r3108
14349c4471m3508p503Q1455l5927r8454L5216Q4852J8070l3200o1829r1079L6579
14337a49799m5657P7106K8866n4623R9813L0518j74496k0848J47525L4769l19
14326b7145J52776J1207j34430M8181l1462j8553P2054Q2649j31251j24056O8125
14315c1905Q0170l9218j8536L3923l2458r3773m7999o174L8710J085J13900n2846
14303e5121q4486K04322J49562J9601l7162q3068m4162r0390p491L8887j4208
14292c716R1011J00342J08166Q838j25480q8331r8646o4873J84k4598L9699k8926
$$ y = [-64168, -79312, -50850, -102634, 84761, 225927, 61203, -42400, -244057, -287237, -274505, -227889, -244939, -51917, -56354, -109454, -63282, 1551, 72753, 74060, 120609, 152871, 58637, -34471, -77979, -85482, -4027, -39954, -138408, -103192, -18340, -270, -33470, -95299, -186378, -149799, -195456, -118350, -89484, -144107, -44294, -13776, -188272, -209120, -61595, -26826, -27145, 125631, 136838, 2408, 50589, 19127, 574, 72628, 155277, 24026, -100030, -31905, 48265, 9047, -9489, 24434, -8024, -101797, -149796, -155970, -117260, -116175, -2275, -55121, -139607, 64715, 214277, 233878, 196716, 113648, 69486, -20904, -28395, 10492, -3716, 87295, 187637, 295803, 304641, 179161, 90830, -7816, -72689, -72505, -97103, -57404, -86330]
14280h6330o5557M9136l1931l3843N6354K7268k8N0441R1732L4919l2293r0837
14268c0969j13460R4998L8940J0377k5471L831P4922m4185j1844Q6421Q6308r6745
14256G3123Q321p7997p7647N8434r3817N2236N6809n7022j0023J37240l1169m8039
14244i551K1917l7018K9442j7769j527K0947j29403p1135p0483Q1445M9930J57666
14232B4461j4144l2551K6016j42859K4455R7250J06067r0077o9076M3924r5804
14221a22338J5855J41264L631j06048r513j8178K8918O2208N0933n2117n0128
14210e5513J8446O2494m3864j74580p3150l0266Q5577N8013J47j990j9124M4471
14198a29339J35954P2222R852J8734O6741r1884q2310l266M5443j25955j1157
$$ y = [-86330, -151887, -102751, -134682, -168525, -112171, -84903, -84931, -34490, 57242, 92161, 59868, -30969, -144429, -49431, -10491, -114, -25585, -21754, 53168, 8983, -2861, 83560, 169868, 73123, 81444, 3447, -74200, -15766, -109583, -57347, -538, -57560, -67583, 69657, 38488, -9551, 12366, -24652, 4790, -12979, -14506, 6441, -122962, -194097, -264580, -183135, -133205, 24461, 10317, -22234, 3782, -139077, -114622, -17372, 88695, -1382, -70458, -26534, -122338, -106483, 34781, 38412, -67636, -77149, -95327, -66409, -4201, 46732, -5385, -55513, -37067, 25427, -18437, -193017, -266167, -296433, -210856, -152843, -152696, -154686, -173810, -129339, 6615, 78837, 88689, 107423, 174164, 82280, -30, -3296, 42147, -83808, -94965]
14187i4965Q9895l7015o399N3991J1459R8995J4085k05510j39497l562J34148
14176h4375J57757o4836l1374j4425r4912m9581K4025J16688n2067k5274l1789
14165a50163n4765m9353J32393R5158Q6235N5097L9978J43779p6698j05170j1838
14154A04653q4691j40275J69713J23318m9628K5538J91527q3319j23868j2586
14144A20382q6410k07536N3351O4768j8127j15498k2171L8873m6585j12844k0389
14133c52186K5834J10604J93469l0903J6197m1257j54972O9248J8377O2467K2751
14122f0371l2560N4279P7256M978p7945N3681J578l0305j9680Q2030J17786m2388
14110A28339q4041m3992j2775j19863p8253Q3305J09722L1448m6235j12902p3444
$$ y = [-94965, -5070, -42085, -48484, 5507, 16966, 115961, 130046, -75464, -214961, -218523, -84375, 73382, 8546, -22828, -37253, -132165, -181746, -157721, -41033, -93100, -118374, -150163, -204928, -254281, -121888, -26730, 59505, 114602, 154580, 298359, 221661, 116491, 104653, 19962, -120313, 49400, 172718, 123090, 148628, 340155, 256836, 132968, 120382, 33972, -173564, -120213, -55445, -73572, -189070, -211241, -172368, -218953, -331797, -352186, -326352, -215748, -22279, -53182, -36985, -78242, -233214, -163966, -145589, -83122, -60371, -92931, -38652, 38604, 43582, -34363, 19318, 20896, -9409, -29089, 52941, 170727, 128339, 44298, 306, -12469, -132332, -210585, -127280, -17558, 13890, -32345, -145247, -218691]
14099b18691M4022K3567k3063j5586k4291Q197J08132Q2186o3401p6032K1958
14088a33002Q8395l5860M3813O9n2367R6626J8369O0044Q0947J3564L1738j05949
14076A06387j37305n8856J3077J37847Q5593L488j19257N071K0252N2832M0300
14065A49429L6811j08066l7280j06681m7117N9436l4079p5738J02369M9955K6724
14054A5763k9148j7445n436P4116m0196j25552Q6740q2912P1634J80794L4349
14043A62707k17909j43102M4222N2251M4247O0784r2676R5684J32036J8981r8058
14032E9167j35670K9478N2868m396Q3043J4505n1231K9115J2834K7591m2477m3093
14020C1734q0566p9626O2239N3656j5590q4922N0566J53337k1656R679j43397
$$ y = [-218691, -174669, -151102, -174165, -189751, -214042, -205845, -97713, -15527, -78928, -154960, -133002, -44607, -80467, -36654, -36585, -88952, 7674, 26043, 86087, 167034, 180598, 212336, 106387, -30918, -89774, -76697, 61150, 146743, 150231, 30974, 36045, 56297, 109129, 149429, 186240, 78174, 40894, -65787, -112904, -53468, -87547, -163285, -60916, -10961, 15763, -13385, -30830, -36266, 37850, -2346, -127898, -41158, -124070, -52436, 128358, 162707, -55202, -198304, -154082, -101831, -57584, 3200, -89476, 6208, 138244, 157225, 59167, -76503, -47025, 5843, 1447, 84490, 98995, 47764, 76879, 89713, 117304, 74827, 31734, -48832, -128458, -66219, -12563, -28153, -113075, -62509, 90828, 69172, 78851, -64546]
14009f4546j57912j86L8912K4736P0287J75970n5730j22215M552n1292N7399j3129
13997i3154j6486R9310K0395m0609K6516k944J27511p8774k7096j9245r6036O5741
13985c4871k3722j39091j2272J09133N910q6259K1072O4038J14414O8600r9056
13974a2104r6315P0252N753l9982j8425L2575k2544m2406R361J07591L8371l8694
13962f567q6466J10288P2316N9441l1022m2663k1035l6694J214l0120j17083o2187
13950a90578k7236l9694J37944k2545N5912J34914l464O1304M9692p5626O659
13939H7282j23368o4344m0515n1988Q6154O04o4472J6155J9496Q8201L2830M3325
13927B9360q6959m1582j7981J7036J19108j3041K4643j87498j98234Q2939K6884
$$ y = [-64546, -222458, -222644, -183732, -158996, -88709, 87261, 31531, -90684, -86132, -137424, -80025, -93154, -109640, -10330, 10065, -30544, -4028, -6972, 120539, 41765, 14669, -4576, -100612, -34871, -58593, -197684, -209956, -100823, -94913, -181172, -160100, -96062, 18352, 86952, -12104, -108419, -38167, -32414, -72396, -90821, -58246, -80790, -123196, -113835, -6244, 32127, -6567, -93033, 17255, 89571, 149012, 117990, 75327, 54292, 17598, 18812, -11308, -128391, -190578, -217814, -257508, -119564, -142109, -86197, 48717, 45253, 106557, 156249, 80623, 87282, -36086, -100430, -140945, -192933, -106779, -106175, -170647, -154492, -134996, -46795, -13965, 29360, -57599, -99181, -117162, -100126, 18982, 5941, 30584, -156914, -355148, -272209, -245325]
13916b45325n3687J96358Q0679Q759j20432j26006K0677q323R817J31401J40239
13905C4157N3427K4280q2828K2777K4672k04122q8998O6597L9456J02839k1560
13894b9303L0875N1457j2796k01576o7778q386J72576n1903o5605j44097P5023
13883b51513J8337J61027O6420M1547J13710m389J904j27154k1995J361J2676
13872A1931O2508N272J0714m1835L0454m6617l6254j7963J8678k3355o4233j8271
13860a08971L5243l549q6413j5900K0448l3637J21815K01825K87k2070j51517
13849d2439R821j35828p7456J59282P2829R330L2465J25419m8820N4247l0384
13838A28466j22326m7264N8818j05786j08414O3589o921m726M5080J87712O7385
$$ y = [-245325, -299012, -102654, -21975, -13216, -133648, -259654, -238977, -247300, -237483, -106082, 34157, 87584, 111864, 29036, 51813, 76485, -127637, -216635, -150038, -110582, -7743, -29303, 1572, 53029, 40233, -161343, -229121, -237507, -64931, -116834, -182439, -326536, -251513, -233176, -72149, -5729, 35818, 149528, 145139, 147043, 19889, -2106, -745, 11931, 74439, 79711, 90425, 48590, 79044, 32427, -3827, -21790, -3112, -26467, -90700, -108971, -73728, -77277, -163690, -179590, -159142, -192779, -70964, 130861, 131148, 109078, -42439, -32618, -168446, -245902, -86620, -13791, -4461, 28004, 153423, 104603, 158850, 128466, 6140, -41124, 17694, -88092, -196506, -132917, -139838, -144564, -99484, 88228, 155613]
13827A55613L0674R5385J0600q3163k06466M8648n2286N5189r935M5397j37880
13816d8224p8895L9952P785L3424J09737K1171p0284j70505j11341J01120J1557
13805a54503r1297L6712p3530M5551J62169m294J02726N3160j5483j7645j16198
13794g2632q2886Q2046K52345L9442k8430r0112n0792q8216J17941k9575j07082
13783e7951L7842L4632N5797J3181l8216j09126l3188o8021N8587L9024k582M2181
13771b7840K9827k1981j3162N9899R2779L236M8569l1774j47136J9703n5318k2039
13759f5237j19768J20186J77743Q2659j00764k7052O4236J68507r1689n0888n792
13748A52141j21593n6960M0399n770k2131k0942k5259m1192N3787O4796p8951
$$ y = [155613, 186287, 281672, 292272, 209109, 2643, 51291, -995, 54194, 44259, 89656, -48224, -127119, -87167, -79382, -45958, 63779, 84950, 14666, -155839, -267180, -166060, -154503, -245800, -209088, -282618, -237067, -74898, -79192, 23534, 76694, 61211, 43566, -72632, -155518, -73472, 178873, 218315, 189885, 99773, 48981, -39235, 78706, 49131, -57951, -20109, 14523, 70320, 83501, 45285, -63841, -97029, -165050, -106463, -67439, -70021, -27840, 1987, -19994, -33156, 26743, 119522, 122758, 171327, 139553, -7583, 12120, -43198, -65237, -185005, -64819, 112924, 195583, 94819, 67767, 132003, 300510, 208821, 157933, 152141, 30548, -26412, 13987, 8217, -13914, -34856, -60115, -101307, -47520, 17276, -61675]
13737f1675O2615R815J57838M239j01385l0927k7424M1325L4027o3363j83777
13726a58692j00319Q0986K59401J40994l8580r3764l3468N5831L9547l0193p6730
13715D5013j2637J0117J27829L4945j45052j00142J10509j39754r1891Q4453J33200
13704E6590q7877l7188o6668N9666R2991k27746j64485k7908L8242J45948M3703
13693a74732l1024J87002J75638q3937p152L5150j23658j29429O6678l5679Q4842
13682c6301R4891m2480R4313K162q3128r1505J8313j1449J04694j22315n7999
13671a30804P3236J03163j3255l4021R4335J23342R3424k02971m8171n890l1443
13660B0945j2884K1330M3198Q2395J50764o2150k04190N3540Q8347J50259J8379
$$ y = [-61675, 940, 10755, 168593, 172832, 71447, 40520, 13096, 54421, 88448, 25085, -158692, -259011, -178025, 81376, 222370, 183790, 90026, 56558, 112389, 151936, 121743, 45013, 32376, 42493, 170322, 205267, 60215, -39927, 70582, -69172, -161063, -76610, 56590, -31287, -68475, -135143, -75477, 17514, -210232, -374717, -402625, -364383, -218435, -174732, -205756, -18754, 156884, 72947, 65795, 100945, -22713, -152142, -85464, -121143, -36301, 58590, 16110, 110423, 112585, 29457, -62048, -43735, -55184, 49510, -72805, -130804, -57568, 45595, 32340, -1681, 92654, 215996, 309420, 106449, 58278, 52388, 20945, 8061, 29391, 72589, 154984, 305748, 243598, 39408, 92948, 181295, 331554, 349933]
13649C49933k5568P1639K30585J39614M043n9701R09r560J41228K09544J2247
13638A064913j15048o0541j6287n3612o5894r0373p9121q5526j05674m2729L4578
13627C84686R302n5021m3951j407m7140k1239J05884J06642j3715n5796q3759
13616B84486q0660m8966M845J17115J44191K00503Q0474n4422j27154L9166J78263
13605G37841K70187M0631m8841R9748O1207j00499j67545j24844l5080o5297j16685
13594E50823q903J41050q05m2148o8718k73757k25400J02170J78300K27083N8552
13583F38247j72735j03075L1993J03044L2594k38598m9070J63560j40227m4504
13573B21229L3523R3902M8094r1285l3760m1424k3401K4311J8159j75187o8340
$$ y = [349933, 324365, 396004, 626589, 766203, 770246, 710545, 711454, 701894, 843122, 1052666, 1064913, 949865, 889324, 873037, 819425, 753531, 663158, 584037, 498511, 392837, 350108, 384686, 393988, 338967, 295016, 293609, 246469, 225230, 331114, 437756, 424041, 368245, 284486, 203826, 154860, 159705, 276820, 421011, 621514, 701988, 647566, 520412, 559578, 737841, 1008028, 1048659, 999818, 1099566, 1160773, 1060274, 892729, 767885, 732805, 667508, 550823, 541920, 682970, 682165, 640017, 571299, 297542, 72142, 174312, 352612, 579695, 638247, 465512, 362437, 394430, 497474, 530068, 291470, 242400, 405960, 265733, 221229, 254752, 348654, 396748, 305463, 271703, 230279, 206878, 231189, 249348, 74161, 5821]
13562E821J9281Q7172n9887l8531M5500O5718j4147m3479p6859N3471K0125L2337
13550I6522P5417J22301l872j33973L3286L4102j27061Q548o7335k4065O0496
13539G4366O8353J6920j10532n8502P1049O1696p623k933R6327n7958j05945o6690
13527b1472L661j08176J39874N8086Q025O1293J41385j9356o8748n8089k3144
13516A13339k2647K0964o7912j09075P3515j3549o6404j8J27944l0078p9390J16088
13504F2777J41175J0136j85181l2707J73760Q0975q8922p8125J38635O5918r2707
13493A95734o0563j35513j66105m585P6073R083K6253Q9383J21138J27386Q3452
13482C61736q1318p9131j56079l8814J17458L0126J43200N344j0858o6474k9235
$$ y = [5821, 25102, 112274, 52387, 13856, 59356, 125074, 110927, 67448, -9411, 44060, 64185, 96522, 171939, 294240, 290368, 156395, 189681, 223783, 96722, 105270, 37935, 13870, 74366, 142719, 159639, 49107, -9395, 61654, 123350, 115727, 112794, 209121, 151163, 45218, -21472, -17811, -125987, 13887, 71973, 79998, 141291, 282676, 263320, 194572, 136483, 113339, 90692, 111656, 43744, -65331, 8184, -5365, -71769, -71787, 56157, 26079, -53311, 62777, 203952, 214088, 28907, -3800, 169960, 250935, 162013, 83888, 222523, 288441, 195734, 135171, -342, -166447, -171032, -94959, -85876, -59623, 29760, 150898, 278284, 361736, 280418, 201287, 45208, 6394, 123852, 153978, 297178, 302522, 291664, 225190, 195955]
13471A95955R3211k4181l7625k4037r8903o6749J46738J86817N1135n9394N3491
13460D16458q9032m3308j04040j03566L5812N7009p3406J05700P5039j4276O0546
13449C22936j07228j3949n9447L661j3491m8209l8944M0398K05271O7918q0771
13438B78145N9526J09911N6140j32227P812O6936j3661K1774O6991m4220m5507
13427D31620Q3978M0917O9042r7826m0671q0861p0727O086Q0693p9714k0476L3005
13415C55066l7952J780O5617P3141m2681m0788j16915p3742m7197k9280Q0957
13404A88006Q8716m2076J68698P8146k9592J33946J1225k49738q6294R4030k2263
13393C32804j68041K3510J15392R3427J28199l7534j28129P2880K1152p0444r2253
$$ y = [195955, 289166, 264985, 227360, 203323, 104420, 37671, 184409, 371226, 422361, 362967, 416458, 327426, 284118, 180078, 76512, 112324, 169333, 95927, 201627, 276666, 262390, 322936, 215708, 201759, 142312, 145973, 132482, 84273, 45329, 85727, 290998, 358916, 278145, 337671, 447582, 503722, 371495, 379307, 446243, 432582, 454356, 521347, 477127, 431620, 515598, 556515, 625557, 527731, 487060, 406199, 335472, 341558, 422251, 342537, 322061, 355066, 317114, 318894, 384511, 457652, 414971, 374183, 257268, 183526, 136329, 107049, 188006, 276722, 234646, 403344, 481490, 451898, 585844, 597069, 347331, 261037, 355067, 332804, 164763, 188273, 303665, 397092, 525291, 487757, 359628, 432508, 453660, 383216, 290963]
13382B90963O1168n8801J03534J10027L719r5859k2561J6901j49213k14499m811
13371D0568N6530n7079J04906J54322J822p3273k52717O1997J31819m2676O4740
13360A90959L7370L5340j73911m9514J10226N3297J26310N7300J9459m3222k3758
13349C39856p920j9793L5062q1741P6672J06871L981J92187Q4107p1465O3108
13338G20925J36504k931o3294j33877p6716J02858L9414o4120K0393M7449j13198
13327F13407j04155n9343K06973K44649O4140n9519l9140j57003P1880L1529j11135
13316G02283L0268J09778J07095j27832R186l4565J9602R8891R1035J0657j1122
13305A005276R9294O9282q845j64394j5638L6822P0998K6826p6280m4225K02624
$$ y = [290963, 352131, 293330, 396864, 506891, 510610, 414751, 392190, 409091, 259878, 45379, 40568, 97098, 40019, 144925, 299247, 301069, 227796, -24921, 37076, 168895, 126219, 190959, 228329, 263669, 89758, 40244, 150470, 203767, 330077, 387377, 406836, 363614, 339856, 331936, 312143, 347205, 265464, 342136, 449007, 452988, 645175, 729282, 657817, 720925, 857429, 854498, 791204, 657327, 580611, 683469, 722883, 658763, 679156, 726605, 613407, 509252, 449909, 656882, 901531, 965671, 906152, 867012, 710009, 781889, 813418, 702283, 732551, 842329, 949424, 821592, 830778, 796213, 815815, 914706, 1005741, 1016398, 1005276, 1104570, 1173852, 1165007, 1000613, 984975, 1021797, 1092795, 1119621, 1043341, 999116, 1201740]
13294A201740J08500n7833M912m9220J79280J32940m7447j37247l5176L8324J02281
13283A441054J20625Q959J14595J72656n4737P3671k5927J00231K8148j35965
13273A843310J21811J97563L5179K8005L2625q8737k2669j95476k9526J0952J1171
13262A944208P7680J83385J28675O7486k047M8971K5923J45569J02921J02877
13252B825648J30952J07397J25783J42380J15469J39990J19641J09139L39810
13243D156209K48718K35673L19688L33880L39251M83780N45516P23669P60379
13234H146763Q30010J029986J192152J282945J553910J703109K012781K427441
13226B0179097K974732L782563M946787O578900Q487047J0678617J2850348J4596945
$$ y = [1201740, 1310240, 1252407, 1257319, 1208099, 1387379, 1520319, 1472872, 1335625, 1300449, 1338773, 1441054, 1561679, 1570638, 1685233, 1857889, 1803152, 1876823, 1850896, 1951127, 1979275, 1843310, 1965121, 2162684, 2197863, 2225868, 2258493, 2169756, 2147087, 1951611, 1922085, 1933037, 1944208, 2021888, 2205273, 2333948, 2401434, 2399387, 2448358, 2474281, 2619850, 2722771, 2825648, 2956600, 3063997, 3189780, 3332160, 3447629, 3587619, 3707260, 3816399, 4156209, 4404927, 4640600, 4960288, 5294168, 5633419, 6117199, 6662715, 7386384, 8146763, 8976773, 10006759, 11198911, 12481856, 14035766, 15738875, 17751656, 20179097, 23153829, 26936392, 31883179, 38462079, 46949126, 57627743, 70478091, 85075036]
13218H5075036J5762021J7010280J7842518J7733814J6090051J3271388R693650
13211A92478758O415907L115243o43884m721325q538003j1492974j3428136j4255250
13203A48930336j4186815j3678938j2999748j1840100j0073120q238400o545735
13196G1367480n390640m372347l572674k799051k229177j809579j357809q20054
13188D9016149q1965Q26982J921999L260084N063499P262939R779897J1976279
13180H9025863J3308036J4717164J5880604J6257936J5630570J3836688J1041416
13173A89698277P357241M054645O18677k984766o854461j0499482j3112567j4373146
13165A53904418j4773709j4565601j3926738j3053166j1851460j0089990q443652
$$ y = [85075036, 100837057, 117847337, 135689855, 153423669, 169513720, 182785108, 192478758, 198894665, 202009908, 201366024, 196644699, 188106696, 176613722, 163185586, 148930336, 134743521, 121064583, 108064835, 96224735, 86151615, 77913215, 71367480, 65976840, 61604493, 58031819, 55232768, 53003591, 51194012, 49836203, 49016149, 48934184, 49761166, 51683165, 54943249, 60006748, 67269687, 77049584, 89025863, 102333899, 117051063, 132931667, 149189603, 164820173, 178656861, 189698277, 197055518, 201110163, 201728840, 198744074, 191889613, 181390131, 168277564, 153904418, 139130709, 124565108, 110638370, 97585204, 85733744, 75643754, 67200102]
13158F7200102o898476n611904m985890m440592l974290l712691l429276l122328
13150C1024655k845120k599186k343336k096721j933089j863096j651868j235054
13142A4457185j081149j090581q83230q13182p72561o72167o61824q00047n68270
13133G114174n45641m84713n18203m50502l38432k98583k66570l84481j56247
13124C670802j64009k30476j14218j12735j75488k40542j62062j84397l837j59971
13114B123067k56793j72472N12Q602M353j39046j21120o2591l3931q3702j18617
13103A148262q2347j28604q4683l230m1619M7933J13158L8077j08449K2380o851
13092I14027R0394j8499j40461k8550k6422J9455o6045r473M2527j5749Q669J11525
$$ y = [67200102, 60301626, 54689722, 49703832, 45263240, 41288950, 37576259, 34146983, 31024655, 28179535, 25580349, 23237013, 21140292, 19207203, 17344107, 15692239, 14457185, 13376036, 12285455, 11402225, 10589043, 9816482, 9144315, 8482491, 7682444, 7114174, 6568533, 6083820, 5565617, 5115115, 4776683, 4478100, 4211530, 3827049, 3670802, 3506793, 3276317, 3162099, 3049364, 2873876, 2633334, 2471272, 2286875, 2283038, 2123067, 1866274, 1693802, 1694314, 1702916, 1707269, 1568223, 1447103, 1384512, 1350581, 1266879, 1148262, 1065915, 937311, 852628, 849398, 807779, 855712, 968870, 1006947, 898498, 920878, 914027, 1004421, 985922, 845461, 816911, 790489, 809944, 743899, 734426, 776953, 761204, 769873, 881398]
13080H81398J07236K6876J29880P1153r2855k1338l1971o2860q8670p7679r0375
13069G50795j17908p7251j5349o0033q50J2496L0415k4769l9054k421o9237N0785
13057D37619j487L2144L9945L4387q5835r1757j38666P2002P6254k1584n3846
13046B99176J37775J13498J18192n2481O2944j9639R505j32429p4898r7625n5445
13035C08573K43825K20162P2987M4188J77290j2435R60o5800r5562j39063j05044
13024F50081o4242O8121k05183k7455R5127M0769J09009R2830m2639j26855M4140
13013F33703k1891J4049j58948q6538m8694Q311J34768M0998l0905r7856p9269
13002C07728k1093J5838l6514l6583J2339N2422M8143r6671j29927M1721J15040
$$ y = [881398, 988634, 1015510, 1145390, 1216543, 1123688, 1102350, 1070379, 1007519, 918849, 841170, 750795, 632887, 555636, 540287, 480254, 479404, 491900, 522315, 497546, 458492, 456071, 386834, 437619, 436132, 468276, 508221, 542608, 456773, 365016, 226350, 298352, 374606, 353022, 299176, 436951, 550449, 668641, 616160, 679104, 659465, 668970, 536541, 461643, 364018, 308573, 552398, 772560, 845547, 889735, 1067025, 1054590, 1055550, 989750, 894188, 755125, 650081, 585839, 653960, 448777, 421322, 516449, 557218, 666227, 759057, 716418, 589563, 633703, 611812, 625861, 466913, 380375, 331681, 339992, 474760, 515758, 484853, 386997, 307728, 286635, 302473, 265959, 229376, 241715, 294137, 342280, 245609, 115682, 157403, 272443]
12991B72443J06352J83646J53121J15971J21342j7586N9067r3334j8777j30445
12981G51800j78942j21588j01240o4612K9935P899k1776p2802j10849K3144J8976
12970A59945k3863n625r2254n897R358Q6121L2634j04202N2079J1415N4572k3667
12958A50616j63533l3226J304M746L1608M7875J56184N8814q5723j62473J73779
12947A79971P3125o9301p0078n5274K67824K46244n6558n0911O9872l3686o6665
12936D34563p6626k4601M0204k8682j86347J6981P7881J5485Q9881L2669j13287
12925B78121j60777R5744J1076n046k9266j2324m797K9436j4203l6476M6954N7792
12913B56234L5871O9210O8052P5119m3439j55174l3785n007m6710m1413m8004
$$ y = [272443, 378795, 562441, 715562, 831533, 952875, 935289, 994356, 901022, 882245, 751800, 572858, 451270, 350030, 285418, 315353, 323252, 301476, 228674, 117825, 140969, 159945, 136082, 130457, 38203, 32306, 41664, 127785, 160419, 56217, 108296, 119711, 174283, 150616, -12917, -46143, -44839, -40093, -8485, 39390, 195574, 254388, 168665, 6192, 179971, 253096, 183795, 113717, 58443, 326267, 572511, 515953, 465042, 534914, 501228, 434563, 357937, 333336, 373540, 344858, 158511, 175492, 253373, 268858, 358739, 391408, 278121, 117344, 213088, 224164, 219118, 189852, 177528, 172731, 202167, 187964, 151488, 198442, 256234, 292105, 361315, 429367, 504486, 461047, 305873, 272088, 267081, 220371, 178958, 130954]
12902A30954M5833k9556j42738l5606j0160M2487J59432R9605o0458O1463r1522
12891A69734k8412L4305o7592m7036J00123J7431N0354m0072o9892M3624j5740
12880A46827M1656j46272O5766K909q9767M6251r609n8852p7921j32402o3575
12869b74989r277J67578J16248L1029m809q1847q6373Q2865j5384K7163K2353
12858b5443j48636r5771J01090M2108J763L01O915R9192k3465j57505J8083P810
12846a73558Q0975J18836N106j5058O0233l2397j9464j2515J9763N4562k3710
12835F2773q156k914l3208m8124p6951j09143n656R7028J97102K0130r6918j30763
12823a34800P8916J06368p2378p5435P327j8053J81068L1307L7878o4051j05489
$$ y = [130954, 176787, 147231, 4493, -31113, -41273, 1214, 160646, 260251, 199793, 261256, 169734, 141322, 175627, 108035, 60999, 161122, 178553, 228907, 188835, 118943, 162567, 146827, 188483, 42211, 107977, 110886, 21119, 67370, 57761, -1091, -79012, -211414, -274989, -284266, -116688, -440, 30589, 25780, -56067, -142440, -59575, -74959, -47796, -25443, -174079, -269850, -168760, -126652, -124889, -124588, -117673, -18481, -41946, -199451, -181368, -173558, -92583, 26253, 31359, 16301, 76534, 44137, 24673, 12158, 31921, 86483, 62773, 54617, 51703, 18495, -29629, -106580, -215723, -221379, -124351, 72751, 92881, -4037, -134800, -55884, 50484, -21894, -97329, -90002, -108055, 73013, 104320, 142198, 78147, -27342]
12812b7342Q4855M4375j20969R8277J93000J4027j20499k4449L217P342J2490
12801A64324M9641M9910p7871R5636k53744j93950M9691Q2989l285L7367L7833
12790C8541R7870J16474j7176k9717l3932P3919J40188M4552J25178J1834j1521
12779E56210J67329J70881P5588J23222M9212o8178n5419n1913m4119P2111Q2003
12768A076927K6057r1155j37396j39432N556m1086n4208P312m2490l4948j23218
12757D51919o4225O0779o9762m6836N6344l6045l7060L289J10239L5970m0486
12746D24126M4435J427K610j9731J7929J93931J99697J90650J07996m4089j29382
12735I89599K6551K53074P3198q922j33768j85678l14744o5096r2452l0477J5616
$$ y = [-27342, 57513, 101888, -19081, 79196, 272196, 286223, 165724, 141275, 144492, 151834, 164324, 213965, 263875, 186004, 281640, 27896, -166054, -116363, -33374, -36659, 708, 38541, 136411, 252885, 235709, 205992, 172060, 245979, 386167, 430719, 555897, 567731, 556210, 723539, 894420, 970008, 1093230, 1142442, 1074264, 1018845, 966932, 922813, 994924, 1076927, 1102984, 1011829, 874433, 735001, 740557, 699471, 645263, 652575, 610085, 575137, 451919, 387694, 448473, 378711, 331875, 388219, 352174, 315114, 318403, 428642, 464612, 424126, 468561, 469988, 472598, 452867, 470796, 664727, 864424, 1055074, 1163070, 1118981, 989599, 1016150, 1269224, 1342422, 1333500, 1199732, 1014054, 699310, 634214, 541762, 511285, 526901]
12724E26901k2568j33057j31075k9666m9800j2736P5258r786J13379j92470l8274
12713I6106K33017j3243j11618m2089j5767l0607M0703j12021M5841J20317L930
12702B14569l7273j90249j50238k6155l5251l4548R2406J98896J99148R1903j5171
12691C08037j61675r7299j11723M112r739j68358r0111Q9354J56302J24731P7669
12680A21300p5642j43086J2569R0524P0813k6036m2523l0795j3227o7528M55m415
12668a07591Q465K2071n2429J72217K12817J60698r2228j32195l8063l8146m6570
12657F9046n7292m4717l5828O090J50586J4490k1671k6054m5073l0451n766k1529
12645d8169O8217K9114l3737J03828O5139j20326j08808p1056o5016l8040j9961
$$ y = [526901, 504333, 371276, 240201, 210535, 160735, 147999, 223257, 213471, 326850, 134380, 96106, 329123, 315880, 204262, 162173, 146406, 115799, 156502, 44481, 90322, 210639, 214569, 177296, -12953, -163191, -189346, -224597, -259145, -166739, 32157, 231305, 323208, 308037, 146362, 49063, -62660, -58548, -68287, -236645, -326756, -237402, -81100, 43631, 121300, 45658, -97428, -84859, 5665, 76478, 50442, 7919, -22876, -36103, -103631, -103176, -107591, -99126, -77055, -129484, 42733, 255550, 416248, 324020, 191825, 153762, 115616, 69046, 11754, -32963, -68791, -62701, 87885, 102375, 80704, 54650, 9577, -20874, -26640, -48169, 20048, 49162, 15425, 119253, 184392, 64066, -44742, -115798, -180814, -218854, -238815]
12634b38815J27561J26791N1408m4677m3475j10988K38944q3595j02129K1631
12624e7344j02371R0944J00561Q2839j05175n0751Q4537q5100m7186p2189r91
12613a62226M5641O0338l423k2931M0875j9655j9369m5515L7120Q929m2642j8667
12601a41525J15279J04765O2088j00274l0692L8620J77297N7227r6825q6674j2088
12590H7198j79238l4678O8824K6485j18410M9017L0465J15225K058M0688q2567
12579E067k1842k0736L3070Q5992Q6001p5929k02335n9403M7351q3611J24782
12568h1593M5796J62712J54476J8746p3529j03239k1227L5966K3016m8907j85162
12557g2945m0364P7861M8495j1644o1951J3543J2548l1230P1028J10026m1852
$$ y = [-238815, -111254, 15537, 66945, 22268, -21207, -132195, 106749, 23154, -78975, -57344, -159715, -68771, 31790, 114629, 9454, -41297, 43240, -41860, -89046, -161235, -162226, -116585, -56247, -59670, -82601, -41726, -61381, -80750, -126265, -89145, -80216, -122858, -141525, -26246, 78519, 140607, 40333, 9641, 48261, 225558, 282785, 185960, 99286, 87198, -92040, -126718, -57894, -31409, -149819, -100802, -70337, 44888, 46946, 87634, 5067, -16775, -37511, -4441, 81551, 167552, 91623, -110712, -170115, -122764, -206375, -81593, -35797, 126915, 281391, 300137, 226608, 123369, 102142, 138108, 161124, 112217, -72945, -113309, -35448, 13047, 1403, -60548, -47005, -34457, -65687, 5341, 115367, 73515]
12546G3515j37343q572J05370M9653j00030r9512k0709j8883P9805q9005j4748
12535a80459O4696O8112n7672n0734J8167J939k6802M5403k3580m7210K1119Q1456
12523h5565r8252k4650j3678O7782r7662o4266K3976K29492J50784P3877j38674
12512B3164n475q166m5165N6245K4766j85477n9569J23138J3149M0369m2512l1187
12500i6720O1786M36K8930j29121m6225N8524Q186o6719P9302J07484N6731m8461
12488A4133j01735O2056p8899J8120P9334K6092j09134J15969J44902n8600L0360
12477A42598p1449m9603K3306Q320J8856L6451j71014j8788K5767K708m2742N019
12465i0571o1859L783o7519M7922L16499O3389j03499m69k1234j05847J2086o6102
$$ y = [73515, -63828, -72400, 32970, 82623, -17407, -116919, -137628, -156511, -76706, -165711, -180459, -115763, -47651, -105323, -156057, -137890, -135951, -162753, -117350, -140930, -188140, -167021, -85565, -183817, -208467, -222145, -154363, -252025, -316291, -292315, -62823, 87961, 161838, 23164, 17689, 9523, -35642, 20603, 45369, -140108, -199677, -76539, -63390, -23021, -65533, -96720, -34934, -34498, -5568, -134689, -180914, -122390, -114204, -180923, -101621, 5863, 62594, 14133, -87602, -25546, -104445, -86325, -6991, 19101, -90033, 25936, 170838, 112238, 142598, 71149, 21546, 44852, 53172, 72028, 108479, -62535, -81323, -55556, -52848, -95590, -90571, -152430, -148647, -216166, -168244, 148255, 211644, 108145, 107676, 86442, -19405, -7319, -73421]
12453g3421K6662R8676R2537j12266M552L8581Q264P9345n0596m3152M174k837
12441G0519o2632Q855j01289k6016N5731J0812j4763P7326o6810p2880P0465O8218
12429A7536k9573L1080N3976L9601j9031o8161j7188n5398O455l7264R5913L0049
12417D7995p347M8964R300l5741j01984j9641K08841j4098O578J3607k5898J23697
12405B54273J79172K2679j62928j06512j13799l80r6905P4605L8089j12778q6295
12394a10779O8350L6510K9828P2814M3073q5639r3586Q4095r24m5537J22347n8912
12382F1640j40970N3811J68006N510L1354N9718R7486m9626r0746o1250J8961
12371A53894q6204k48023p8645P4241J42355R7635o6442l0585J04457R7645q3762
$$ y = [-73421, -46759, 51917, 144454, 32188, 36740, 75321, 83585, 162930, 112334, 69182, 73356, 70519, 7887, 16742, -84547, -110563, -54832, -44020, -58783, 18543, -48267, -121147, -50682, 17536, -12037, 19043, 73019, 112620, 93589, 25428, 8240, -47158, -40703, -77967, 17946, 47995, 40648, 89612, 98912, 63171, -38813, -58454, 150387, 136289, 142867, 156474, 130576, 254273, 433445, 456124, 293196, 186684, 72885, 72505, -24400, 50205, 88294, -24484, -110779, -42429, -5919, 23909, 96723, 139796, 54157, -39429, 44666, 43742, -1795, 120552, 61640, -79330, -25519, 142487, 147997, 179351, 239069, 336555, 286929, 196183, 134933, 153894, 67690, -180333, -258978, -184737, -42382, 55253, -11189, -41774, 62683, 160328, 76566]
12360G6566j54969j2632R1609K3308N0611O9123j81907j21361P0167J37218k699
12349D5034R027p7259k0468M0405j0161M819L5913k2770L0404J20509Q0468j28956
12337A06965j63457M6476J30516O326j0628j09248L129P9842M4221r516p9340
12326D5286J662j4262Q1387R8417j04861L7898j0751m0851j07824j03086k6433
12315a43418n0867j4944N8659k6940k4937J31245R5493J7395l7938N264n1379
12304d2367r1185N9235n1191N1488J1012n8575r0769R88M6005Q2003m2865M8638
12292g7583J2793O6443l8850L0764l476J08704m8961q1354j05739r1921O2039
12281a67141R4379J15524J45625m3021j41436J09137m3245j79645l8844L4108
$$ y = [76566, -78403, -91035, 574, 23882, 74493, 143616, -38291, -159652, -89485, 47733, 45034, 54061, -23198, -43666, -3261, -13422, -8603, 27310, 4540, 34944, 155453, 235921, 106965, -56492, -10016, 120500, 126826, 116198, 6950, 10079, 89921, 134142, 124626, 45286, 46948, 32686, 114073, 212490, 107629, 145527, 134776, 93925, -13899, -116985, -143418, -194285, -209229, -150570, -177510, -202447, -71202, 24291, 41686, 3748, 9012, -42367, -133552, -74317, -125508, -74020, -63008, -121583, -212352, -211364, -165359, -83356, -126221, -77583, -64790, 1653, -37197, -6433, -9909, 98795, 49834, -31520, -137259, -229180, -167141, -72762, 42762, 188387, 145366, 3930, 113067, 69822, -109823, -148667, -114559]
12271a14559J65354j7471o6811j13913n9426P3855N7285k8869P3678K3676M6792
12260C9591J7672j63079r8561o8291O3160J9230l6470J62500J69194k0381J09688
12249A94253m788p069m8097j39124m0020j14677k9663P0173P8641k7194o7331
12238a34896o159L6352j48431L1633J12579J7608N1158K4869j08160J5616J00715
12227g116L4235K4964J37983J1124L4511p0607j22950P4644q105p493m4515j03739
12215d7064L2893M3351q5821J42210N2314m461P8921l9051l5931L3771j49364
12204B1768r9003L2083Q1721l2666l4464K8125O5382p2442K8488Q3984J7397Q654
12192A29027J50326j72003j42694j0751N6337J3096L3553M2152J45039J07643
$$ y = [-114559, 50795, 33324, -33487, -147400, -206826, -132971, -75686, -104555, -30877, -7201, 39591, 57263, -105816, -204377, -272668, -209508, -190278, -226748, -64248, 104946, 84565, 194253, 189465, 182396, 134299, -4825, -44845, -159522, -189185, -119012, -40371, -67565, -134896, -141055, -104703, -253134, -221501, -108922, -91314, -40156, -15287, -123447, -107831, -7116, 27119, 52083, 190066, 201190, 235701, 165094, 42144, 116788, 108683, 101190, 56675, -47064, -14171, 29180, -56641, 85569, 137883, 133422, 212343, 173292, 137361, 171132, 21768, -77235, -45152, 36569, 3903, -30561, -2436, 62946, -9496, 18992, 102976, 120373, 129027, 279353, 107350, -35344, -46095, 10242, 23338, 56891, 99043, 244082, 351725]
12182C51725O445K7811L4692n5019K1634M5615j08811j4878j2800j15421m4708
12171A36285j01176P4742N2634q8471n8001o878k1702J49966J29348J7336j31722
12160A52361k7054j59589P7142J390R304o1539N3755J69053P9673j50558q5361
12149E8577J0380n2002J0313j3797O0102J9737l3778k345q2197M3752K02764P0835
12137B92341Q8441p3709p9670j5432M4486p1880q3225N038L8446p0346q5179m8512
12125e9201j19681L8177m433j06265N7284O6511m4887J5411N7489Q2126P250j2200
12113b2419p9499O4390L0686n291Q2839n1809L1539J00595l4369j8112k7742j1944
12101E8864j3569j22990k0038J19676J39210k0002J15816L3237j90564j59118
$$ y = [351725, 358170, 385981, 420673, 365654, 387288, 432903, 324092, 309214, 296414, 180993, 136285, 35109, 109851, 162485, 74014, 16013, 9135, -12567, 137399, 266747, 284083, 152361, 125307, -34282, 42860, 44250, 53554, -7985, 45770, 214823, 294496, 143938, 58577, 68957, 16955, 27268, 13471, 73573, 93310, 59532, 57187, -25010, 18742, 221506, 292341, 380782, 307073, 227403, 211971, 256457, 184577, 101352, 106390, 144836, 74490, -10689, -59201, -178882, -140705, -145138, -251403, -194119, -127608, -172495, -157084, -99595, -17469, -10219, -22419, -101918, -37528, -6842, -12133, 70706, 18897, 50436, 151031, 116662, 98550, 70808, 58864, 45295, -77695, -97733, 21943, 161153, 141151, 256967, 290204, 99640, -59478]
12091e9478R8636J72293J47841L9741k01404j00272J06117n7087R797K1789n608
12080A72365p2154j58458R9550J07386Q582M4191r5732Q7651k0212m7264j32263
12069f358J4540J49408J3372j51847p5416R2756J5994M1446M9793O8919L1733
12058B44340j15478k01609P0928J49071J96817J36882R3193L09904J42466r2470
12048I34044q5116j15350l8283M5297L7576q8571p8037m8624l3586j70540p0068
12037B88742o9883Q782J06617r1148j04791J33766J43140Q5784P5773m4770N3656
12026E85668J47965j30842q5451P0493R3222J08389Q4967j13229l4291J32672
12016H59563l2047k3197Q7446k7541q8032l3648j64400J11603N7143R2015o873
$$ y = [-59478, 39158, 211451, 359292, 399033, 197629, 97357, 203474, 146387, 156184, 177973, 172365, 100211, -58247, 41303, 148689, 157271, 201462, 105730, 193381, 173169, 125905, -6358, 8182, 157590, 170962, 19115, -56301, 36455, 52449, 93895, 143688, 212607, 244340, 128862, -72747, -1819, 147252, 344069, 480951, 574144, 884048, 1026514, 934044, 848928, 733578, 695295, 740592, 778168, 689597, 611560, 562936, 529350, 358810, 288742, 218859, 227641, 334258, 243110, 138319, 272085, 415225, 501009, 576782, 532012, 585668, 733633, 602791, 517340, 587833, 681055, 789444, 874411, 761182, 726891, 859563, 827516, 804319, 891765, 864224, 776192, 742544, 578144, 689747, 746890, 838905, 832032]
12005H32032M1325J03542j00587r3383K2097n507M8570l5878j11939J0931l7005
11994F74198Q676j0411J00020J13087n5993j96022K275M4079K2941J31070J05461
11983I39381O9653J84951J27933N881M8580R48N8900J757p8018n9487O0987J88053
11971A549519J04974O8411N9158K00652J90989Q5076j1348j2506j0843J55633
11961B379715J63269K48121K65969L15730K33583J30457J94405L71370M13325
11952D715944N51089K36918K15546L83681M10409O96920O34669P61108J027978
11943I634262J181838J260836J452720J729009K126515K563812L033154L757158
11935B6739304N052689O743816R078583J2729825J8195908K7086859M1070970
$$ y = [832032, 873357, 976899, 876312, 782929, 805026, 799519, 848089, 812211, 700272, 711203, 674198, 682874, 672463, 772483, 885570, 829577, 633555, 635830, 679909, 702850, 833920, 939381, 1009034, 1193985, 1321918, 1327799, 1376379, 1377327, 1436227, 1437984, 1359966, 1300479, 1361466, 1549519, 1654493, 1722904, 1782062, 1982714, 2173703, 2258779, 2247431, 2234925, 2224082, 2379715, 2542984, 2791105, 3057074, 3372804, 3606387, 3736844, 3931249, 4302619, 4715944, 5267033, 5503951, 5719497, 6103178, 6513587, 7210507, 7845176, 8606284, 9634262, 10816100, 12076936, 13529656, 15258665, 17385180, 19948992, 22982146, 26739304, 31791993, 38535809, 47614392, 60344217, 78540125, 105626984, 146697954]
11928A46697954O2532642Q9850264J05974855Q2113080K5521170m1065242r0315895
11921C81308828r0642049o6268989m4880913l0821550k1762077j6100357j2195027
11914I8637866r497238p283589n413679m516445m715935n578054n980338n857672
11906D9794916n283317m628468m077634l755402l252423k609424k388462k205744
11898B1594042j898409j444320j422217j187577j070035j149584j183367r12298
11890A1326235q38284p24705n35559o12296n03454n81926o11630m98944l68868
11881F050569m25153m80163m13735l36444l56332l23073l10972k72447P5457j14943
11871C092764l86123k10231j94993M2458n0051j86939k79220k42125k17362J81344
$$ y = [146697954, 209230596, 299080860, 405055715, 487168795, 512689965, 471624723, 381308828, 290666779, 224397790, 179516877, 148695327, 126933250, 110832893, 98637866, 89140628, 81857039, 76443360, 71926915, 67210980, 61632926, 55652588, 49794916, 44511599, 39883131, 35805497, 32050095, 28797672, 26188248, 23799786, 21594042, 19695633, 18251313, 16829096, 15641519, 14571484, 13421900, 12238533, 11326235, 10487951, 9763246, 9227687, 8615391, 8111937, 7530011, 6918381, 6419437, 6050569, 5625416, 5145253, 4731518, 4395074, 4038742, 3715669, 3404697, 3132250, 3207707, 3092764, 2706641, 2496410, 2301417, 2343875, 2293824, 2106885, 1827665, 1585540, 1368178, 1549522]
11861A549522J3396j33479L5958J98929J2475j91174k39333j20191n7905M8015
11851A116213N2290K0596j00566k20431j12484M3899l6430j5370R8016J8869q3207
11840G81395J9394L591j32181m4452N6631N2170n3198m0361l2285j20520M6042
11829E36226Q2577O4905r7563p6773j81211l0310j5276k0368Q4384K2924m5349
11818C24166q0487l7425J64166R2695n0774n2933L4597P8344j14976m4791P7814
11807C90396R6188o8817j95574j23165M7597O3880K1861J8214Q6580J40072J01394
11796E78626L6380r4675j05918m1149K6270O0491J8291N1171q0648m2079n4113
11785C52647J3946k0169k8363J37387l9928j21236J54259O6941j90595J5590P1557
$$ y = [1549522, 1562918, 1429439, 1465397, 1664326, 1676801, 1485627, 1246294, 1126103, 1068198, 1116213, 1168503, 1189099, 1088533, 868102, 755618, 799517, 763087, 747717, 845733, 864602, 781395, 800789, 804380, 672199, 627747, 684378, 736548, 683350, 642989, 610704, 490184, 536226, 618803, 683708, 586145, 509372, 328161, 297851, 282575, 262207, 346591, 369515, 324166, 243679, 206254, 370420, 463115, 412341, 359408, 394005, 472349, 357373, 312582, 390396, 486584, 417767, 222193, 99028, 146625, 210505, 232366, 250580, 337160, 477232, 578626, 615006, 520331, 414413, 373264, 399534, 460025, 478316, 529487, 448839, 406760, 352647, 366593, 346424, 318061, 455448, 415520, 294284, 448543, 515484, 324889, 340479, 412036]
11774D12036J73668J65750K225j29261j23915k218o9548j068J41824j14649K5953
11763D80797J24646P0081r9237k03335K2644J3683n3696J601l4098m1281q9218
11752A92587o9346Q4565n0139L0189L5095J89762J36949k08059k26388M5080R8518
11741B58813N9562K9603j10315k7120J9182n1483J7376J27936o6618n2133j09084
11730I5719p8652j4883K0246L2773J85181O132k6493J9517J3568m620q4753k03144
11718c9409m2197L7943R3131p0755N3577J8351J2740J5594n1892l1435Q0522N5591
11706A31761j6201p1101M3197J6567K3701J5074J22758j1332j17060q2816p9316
11695b4768M021M7939L6063l7425j01233J0823J06036L7164O9813M6386j65268
$$ y = [412036, 585704, 751454, 753679, 624418, 500503, 498285, 428737, 427669, 569493, 454844, 480797, 605443, 675524, 576287, 372952, 395596, 409279, 355583, 357184, 323086, 281805, 192587, 123241, 207806, 157667, 187856, 222951, 412713, 549662, 341603, 115215, 160295, 258813, 318375, 347978, 237663, 210543, 229725, 178242, 195618, 323554, 256936, 204803, 95719, 17067, 2184, 22430, 55203, 240384, 246516, 220023, 239540, 253108, 248488, 163735, -39409, -81606, -43663, 49468, -21287, 32290, 50641, 63381, 78975, 27083, -4352, 76170, 131761, 115560, 44459, 87656, 104223, 127924, 142998, 265756, 254424, 137364, 54548, -24768, -20747, 27192, 63255, 25830, -75403, -64580, 41456, 78620, 148433, 194819, 29551]
11684B9551l9315Q4302N6681k2492j74636l6104J30165J3686J19145J2696r1738
11673H1941K2125O9846J42637J24537n503j92044o8341M38P5329N5471j41213
11662A65223j08168k1569j540k6265J19014Q7214n6504m4358n41K2528J29185
11651B64219J9010q6953j34340k1479L0764Q9915n2301j32078r6425J22955J41928
11640A45215Q9687j09352Q4130O3176n2912j44813q71J15934J12978n745K7048
11629C24475m0138j38568O09k3056k7292p6676P7517p72j07660N7998J32506N3281
11617B32224j31703O7211m6932m8828p1820o5530p934q582K313L803J13226P2966
11605A10414n0137l5539j12407j44291M780j6538J98470J22400J04348m3631m2232
$$ y = [29551, -9764, 74538, 131219, 108727, -65909, -102013, 28152, 41838, 160983, 173679, 81941, 104066, 173912, 316549, 441086, 435583, 243539, 175198, 175636, 250965, 306436, 165223, 57055, 35486, 33946, 7681, 126695, 213909, 157405, 113047, 112506, 135034, 264219, 283229, 196276, 61936, 40457, 71221, 161136, 108835, -23243, -119668, 3287, 145215, 234902, 125550, 209680, 272856, 219944, 75131, 74260, 190194, 303172, 297427, 324475, 284337, 145769, 146378, 123322, 96030, 19354, 96871, 96099, -11561, 46437, 178943, 232224, 100521, 167732, 120800, 71972, 152, -65378, -73312, -81894, -79581, -75778, 37448, 110414, 60277, 24738, -87669, -231960, -227180, -243718, -45248, 77152, 181500, 137869, 95637]
11594I5637j23081l7460j3433m057p1523K6927n5878L9293J56504R51J7083n6077
11582b5114j03873M8264Q3947J23448L7670j64176j25921L5913L4123l1338m4097
11571a31154J01061K7985r2079J2393J01760J7590N1310j08679l197Q249P9336
11560F4575j2276j19247j29887k4907l006J20256J48504J8966M6527R4648r8014
11549A06139k20894R792O0270r7778L350Q7970R9192j00158O0319m622k3361o5532
11537h5313m3291m1280N0835J01447j49359m7567n504J50978O0666L3106m506
11526B0212r5519r430O7764j5853J22018n0409P9344R6360N3374P8374l1877p8703
11514B35655o3518r7619j23360j34808J65556J87873O4672Q9637j11236j32496
$$ y = [95637, -27444, -64904, -78337, -82394, -153917, -126990, -182868, -143575, 12929, 13880, 30963, -25114, -128987, -80723, 3224, 126672, 164342, 166, -125755, -89842, -55719, -87057, -131154, -30093, -2108, -94187, -81794, 19966, 37556, 88866, -19813, -23010, -14761, 64575, 52299, -66948, -196835, -221742, -224748, -104492, 44012, 62978, 109505, 204153, 106139, -114755, -104963, -44693, -142471, -139121, -51151, 48041, -52117, 8202, 3580, -19781, -85313, -128604, -169884, -119049, -17602, -166961, -214528, -220032, -69054, -8388, 24718, 20212, -75307, -84737, -16973, -32826, 89192, 38783, 118127, 214487, 267861, 346235, 314358, 235655, 172137, 74518, -48842, -183650, -18094, 169779, 234451, 324088, 212852, 80356]
11504H0356J8265N5369j57423k3888O3208q1156j54465p3094r648M0538J06498
11493a35440M2793J50002J1534O4764l4248Q654m0059j6969J19667j5043p4610
11482H1045o0520m4431l2339m3430O7593l4443L1192L2279N4614J5933k1139n7688
11470a1334L2048k4378m6680k0037k7594K0159R1951P7579M2205n048j01951k402
11458B4518K7212o3731n2802M1508N7855j6668l8076K8789n7484o5915l0113o2597
11446b07504O1692J7796Q9877j0528p8289j2126P7748K3387M1487j5579m0013
11435e2052J27943j911r9075J958n6445j39829o9643J63845P9161j0061L8064
11424a8045o0544p2992J31738J31622p975O4818l0987j25226M9265o2851N2144
$$ y = [80356, 98621, 153990, -3433, -27321, 35887, -45269, -199734, -272828, -282476, -241938, -135440, -92647, 57355, 68889, 133653, 99405, 108059, 68000, 51031, 170698, 155655, 81045, 20525, -23906, -56245, -99675, -32082, -66525, -35333, -3054, 51560, 67493, 46354, -11334, 20714, -3664, -50344, -70381, -97975, -77816, 14135, 91714, 133919, 128871, 26920, 24518, 51730, -12001, -64803, -23295, 34560, 17892, -20184, 8605, -48879, -114794, -144907, -207504, -145812, -128016, -38139, -48667, -126956, -139082, -61334, -37947, 3540, -12039, -52052, 75891, 73980, -25095, -23137, -79582, -219411, -289054, -125209, -46048, -56109, -18045, -78589, -151581, -19843, 111779, 103804, 168622, 137635, 12409, 61674, -1177, 50967]
11413E0967j38326j44695O3546O6986J03785r090m3051k9164J63647J08749l1015
11402A62339m0155j34931j34566J57832N632j04355j7713o4335M9146P0470k0028
11391g0664j8011m46R2564J47937P2530L8104j40551j38689k9387m1291l723O3694
11379b7933M9599p834r0340j07726M8567m5078K328K38768J03822q9281n4079
11368B0813k3534J2278r9803j25563q5142O4265j59019j2999R2807J15692J10333
11357h9872J4141j1898j7431L7138O6425q1415r7865j21434O7869R1463J14812
11346b8067R5461p3841j2998M8229L4895o7537j78933q6990Q1621M1023k6777
11335a73914J06492M3014j00934R4205K07485r8190j64376p0240n5870M5682J78308
$$ y = [50967, -87359, -232054, -168508, -101522, 2263, -6827, -49878, -79042, 84605, 193354, 162339, 122184, -12747, -147313, 10519, 16151, -88204, -105917, -170252, -121106, -50636, -70664, -88675, -89121, 3443, 151380, 223910, 262014, 121463, -17226, -46613, -87904, -91627, -27933, 21666, 13832, -76508, -184234, -135667, -180745, -178417, 60351, 164173, 74892, 20813, -2721, 9557, -90246, -215809, -300951, -236686, -395705, -408704, -315897, -200205, -89872, -75731, -87629, -105060, -67922, -1497, -82912, -180777, -302211, -234342, -142879, -28067, 67394, -6447, -19445, 28784, 63679, -3858, -182791, -269781, -188160, -147137, -173914, -67422, -24408, -125342, -31137, 176348, 78158, -86218, -156458, -212328, -166646, 11662]
11324A1662j2937j39172j35755j5252M0595J9469J51073J12706o7616J26327l107
11313H7993j37092q9070P5774L9440m3793R0381N9451K2967k9718m0230R7484
11302A33587j1817L698k22233l1163R5606N6630j07652k5629N5866R6156n9099
11291a6050l1841l695j23393J13070J24379j49992j56477N624K9568J8528L1651
11280a58628k7010l198Q7469O9065M6999L9923n9463p2619k10497m2569R0727
11269b39801J13245M377o4066K793N7097k6453K2244Q1604l6182n9066J44380
11258A72N6089k15102L4291P0442Q2169n5762r0006j56753N158K95258J50328
11247A76284j74218L7088l4485J3036Q4724k0179j51053r9824o0789J10407J0338
$$ y = [11662, -1275, -140447, -276202, -291454, -250859, -231390, -80317, 32389, -35227, 91100, 87993, -49099, -138169, -62395, -22955, -66748, 23633, 83084, 106051, 76333, 36103, 133587, 121770, 125468, -96765, -127928, -32322, 24308, -83344, -108973, -53107, 43049, -16050, -47891, -51586, -174979, -61909, 62470, -87522, -243999, -238375, -208807, -190279, -158628, -185638, -188836, -101367, -32302, 14697, 54620, -4843, -77462, -287959, -330528, -239801, -126556, -122179, -186245, -183452, -126355, -152808, -130564, -48960, -85142, -144208, 172, 56261, -158841, -124550, -54108, 28061, -27701, -117707, -274460, -269302, 25956, 176284, 2066, 39154, 4669, 17705, 102429, 82250, -68803, -168627, -229416, -119009, -108671]
11236a08671k4001M2753o2542m4330J618K5927j9027J30983J50199P2810q2504
11225H3215O0642J38490p8785j59879n0425R406O4994p6912o3584n0958l0372
11214a54168l7250m977R3640J13544m4939Q2070m178j51223n6950k5507Q6166
11203a03772m8700j0969K1642k774J9875P8092O3660M1962j5766j1004l1846j496
11191a096n8022p9892K5006R6851m8279j87651J1013O1762P7912K1900j4115J04419
11179I808O5054J140k4245n340k467l0n6122k651N1955p4110O3663J3203K0482
11166F0340r3466J3379R4181j31407O1018L4957n8105k6331k3860j5942K4879
11155f0357J52139j6472m9736q6580M3719J00284j03631j5114r2254r5140O2401
$$ y = [-108671, -132672, -89919, -152461, -196791, -195173, -169246, -188273, -57290, 92909, 165719, 83215, 143857, 282347, 203562, 43683, -6742, 2664, 67658, -9254, -72838, -123796, -154168, -191418, -196395, -102755, 10789, -34150, 47920, 43742, -107481, -164431, -189938, -103772, -152472, -163441, -141799, -144573, -124698, -46606, 17054, 59016, 43250, 32246, 400, -1096, -59118, -139010, -114004, -17153, -65432, -253083, -242070, -180308, -102396, -80496, -94611, 9808, 74862, 76002, 51757, 46417, 43950, 43920, -12202, -14853, 37102, -37008, 26655, 39858, 60340, -33126, -19747, 74434, -56973, 4045, 39002, -19103, -45434, -69294, -85236, -60357, 91782, 75310, 25574, -61006, -17287, 82997, -20634, -35748, -128002, -223142, -160741]
11144a60741R7398o6899j17509l905J5975R6506O7761j2481k0736O0948m0670
11133h4353r0373j0441J41569O7945m2835m679n0117N9655m9236M5599l0545K8131
11121a9680M86O8029J58760j47470j39046l0700k4591N2603l1432j25454l4029
11110b72524P2831O8312n5106m346O6229O6379K3711M0183o3939j14888J51155
11099b2003Q2933l0715j14207j10855L3365N2341P2859N7647k4555l1464j54817
11088a89471q3384M4260O5035R6629O2386j9570p034m6937l899j82025j2442J96733
11076g9719l7740N0539K3126n6888k6242k2930K319q8214J724P009J40899K032
11064h4085k7307k9551J189P0642O7181n2448R8723P6480R9203m2501r7989p4380
$$ y = [-160741, -63343, -130242, -247751, -251656, -235681, -139175, -71414, -83895, -104631, -43683, -84353, -174726, -185167, -43598, 24347, -18488, -23167, -73284, -13629, -62865, -17266, -47811, -19680, -19194, 48835, 207595, 60125, -78921, -109621, -134212, -81609, -113041, -238495, -272524, -199693, -131381, -186487, -190833, -124604, -58225, -34514, 5669, -58270, -173158, -22003, 60930, 30215, -83992, -194847, -161482, -109141, -36282, 21365, -3190, -34654, -189471, -272855, -228595, -163560, -66931, -4545, -24115, -31149, -78086, -81985, -264010, -276452, -79719, -117459, -66920, -43794, -100682, -126924, -149854, -147535, -235749, -234025, -227016, -86117, -84085, -111392, -140943, -139754, -69112, -1931, -54379, 44344, 120824, 220027, 177526, 79537, 5157]
11052E157q406L1837J4982r5167L6433J49601J06892O0019N2038r2633J04407
11041C65160N5994j16140k0008J70558j6729M3004O7942J43479K12141J24188
11031A029589p6054k68519q7305q6885J5093K76234J99675J62885J07000J16298
11021A388011j65055j68316n8778j00612j08101K431k1559K9254J68491O4169
11011A029935L8547k7849j36143j96864j7679j02148p9848K9284K30o5375p4868
11000C97222n9207J25121K00951k4892k87469j22124J6169l7200j71572k3084
10990A3915P509l1988M9423O5068R6623K588q1077j09338M5236o6120J047M7056
10978C9942l7411m7949J49999Q6920k4662l9134j79242j16271R8256N506l9650
$$ y = [5157, -3249, 28588, 43570, -51597, -15164, 134437, 241329, 301348, 353386, 260753, 365160, 421154, 305014, 285006, 455564, 438835, 481839, 549781, 693260, 905401, 1029589, 953535, 685016, 597711, 510826, 525919, 802153, 1001828, 1164713, 1271713, 1388011, 1222956, 1054640, 995862, 895250, 787149, 789580, 768021, 797275, 965766, 1029935, 1068482, 1040633, 904490, 707626, 689947, 587799, 507951, 537235, 537465, 472090, 397222, 338015, 463136, 664087, 639195, 351726, 229602, 245771, 208571, 36999, 13915, 21424, -10564, 38859, 103927, 200550, 203138, 122061, 12723, 57959, -8161, -7114, 39942, 2531, -45418, 104581, 191501, 166839, 127705, -51537, -167808, -69552, -64046, -103696]
10967a03696L752O9029K0547l3195K3623l413Q256n5763J39873m050j8651J24158
10955A70470Q7261j56503j36828j41285q766J51649q8068N145K80626P4134K7950
10944B65785J6775L3694j73184j57117K6566K03577J8258j87165q789j8652n4896
10933c5148L593L484N0742P0478p8577j32358R6864J497j8307l877K205P2630
10921C3226J9656Q4529R24r7777M5238K6302m2677j999J68992K3478j33992j03774
10909B2126M7367J7338j0156n6509l0432o5018j92065m333J82199J81937r4885
10898b431q0683L2352N064k7040m5614N524k3790m5046N3127N6951J07355m3556
10886g787o8851K0342R5579O9912J07754m7230j24868j6819N0409M6101J32496
$$ y = [-103696, -99944, -30915, -10368, -43563, -19940, -23353, -15097, -70860, 69013, 64963, 46312, 170470, 257731, 101228, -35600, -176885, -185651, -34002, -122070, -116925, 163701, 237835, 265785, 282560, 316254, 143070, -14047, 12519, 216096, 234354, 47189, 38400, 19748, -35148, -31555, -28071, 22671, 93149, 14572, -117786, -20922, -19425, -37732, -41609, -39404, 33226, 52882, 137411, 138335, 40558, 85796, 112098, 69421, 67422, 236414, 259892, 125900, 22126, 69493, 86831, 76675, 20166, -10266, -75284, -267349, -271682, -89483, 92454, -2431, -83114, -50762, -45698, -72738, -118352, -112828, -136618, -181664, -128537, -71586, 35769, -7787, -76638, -56296, 39283, 109195, 216949, 169719, 44851, 28032, 78441, 124542, 257038]
10875B57038l4704j25583j69236o2220J56740J60700o1212q3666j417Q2369N4739
10864A73548j2196r8750n7033k7296k6549n2364J8826J85004O7977j07723J18174
10853A81618Q8873r8190r72k2570m5093l7939Q3140Q4470r9566l2911r7285k2353
10841a8778J0532O7339j6228M7726l1155L2308N3779J8393r0665J7423R8405J7818
10829B06897P5427K9932j8708j95495j23829l6750J03106J60399l1697m3441p8187
10818D7654p648K2661Q6997n5149J0379l9187l329l6747r7035o4036L4915j16415
10806b16940q1168J17331K32705K4325p1698l9532P150K1772M3606j28303J12031
10795B1279J16529k1399j32927j02404q5145R8052J83512P8510J1696j11108k26602
$$ y = [257038, 222334, 96751, -72485, -134705, 22035, 182735, 121523, 37857, 36440, 118809, 173548, 161352, 62602, 5569, -21727, -48276, -100640, -81814, 103190, 171167, 63444, 181618, 270491, 172301, 171329, 148759, 103666, 65727, 148867, 233337, 133771, 100860, 3575, -18778, -8246, 59093, 42865, 90591, 59436, 91744, 145523, 163916, 73251, 90674, 189079, 206897, 282324, 312256, 293548, 98053, -25776, -62526, 40580, 200979, 169282, 125841, 47654, 40006, 62667, 149664, 94515, 104894, 65707, 62378, 25631, -71404, -135440, -100525, -216940, -298108, -180777, 51928, 76253, 4555, -34977, -27827, -6055, 37551, -90752, 21279, 137808, 116409, -16518, -118922, -204067, -106015, 77497, 156007, 167703, 56595, -170007]
10784a70007q5069J6386J23551p4234N142k0059m195M887L0631Q159J42653J04777
10772H2622j5515k9312p291K4363K5975r3369j39542p9967n9567K9729J60551
10761a01323J27381j37019J5886j47071Q9885J94409l1172k0512o831K0893L8261
10750D2787j08421r2242k8682R0876J08895K7281q7048n7405J56768Q0764k6155
10739A07418n2634j090r5229o2219P9164J4939M0782l1206o196J9772J03055J50429
10727B66985P9798J0578k2785l3521o531L4349P9835n8684M2363o4944K8111N4982
10715D10536N1028k4140j39086J16104J63542K3300r3652K0798l0755j85142J0831
10704C23364O6642R870J19884O9480p2963r5706j60495m1883R1240J06875Q0446
$$ y = [-170007, -255076, -238690, -115139, -189373, -184231, -204290, -208485, -203598, -172967, -164808, -22155, 82622, 67107, 37795, 30504, 54867, 80842, -12527, -152069, -232036, -291603, -261874, -101323, 26058, -110961, -95075, -242146, -152261, 42148, 10976, -9536, -16367, 4526, 42787, -65634, -157876, -186558, -95682, 13213, 40494, -46554, -103959, 52809, 133573, 107418, 54784, 53694, -41535, -103754, -24590, -9651, 31131, -75, -6271, 13501, 116556, 266985, 346783, 357361, 334576, 301055, 294524, 328873, 408708, 350024, 392387, 327443, 355554, 410536, 461564, 437424, 298338, 414442, 577984, 601284, 507632, 528430, 497675, 312533, 323364, 390006, 399876, 519760, 589240, 516277, 420571, 260076, 218193, 309433, 416308, 496754]
10693D96754J67045N2058j27678p5732K0130O1608r644m2535J0754j24112p8574
10682C50074k1661K0471J48005O0057j10834J39127J05571j90467q8694l654n5037
10671C52958j5487q9093O4139Q0507R3130J8251m5564j8865j19332M1997J36058
10660D98699J82832J07244p9356k7851K9580J34311J54245J36744N9429r8332
10650A097545P1418J62684L2227L5033P7933J04261n830r2269m7593N5262O2822
10639A553493K9609J98752L82152L85922K72542L38439M32758L70234L84640L25809
10629D674350L52172M56114N80107P82476J161833J492827J976623K812236L790529
10620A8079267N061111O653077Q238996R214847Q598958N700150K064716p71136
$$ y = [496754, 663799, 715857, 588179, 512447, 532577, 594185, 584541, 542006, 552760, 428648, 350074, 328413, 348884, 496889, 556946, 446112, 585239, 690810, 500343, 411649, 407995, 352958, 337471, 248378, 312517, 393024, 486154, 504405, 458841, 439976, 320644, 362641, 498699, 681531, 788775, 709419, 681568, 711148, 845459, 999704, 1136448, 1195877, 1097545, 1168963, 1331647, 1363874, 1398907, 1476840, 1581101, 1575271, 1483002, 1435409, 1490671, 1553493, 1583102, 1781854, 2164006, 2549928, 2822470, 3160909, 3593667, 3963901, 4348541, 4674350, 5026522, 5482636, 6062743, 6845219, 8007052, 9499879, 11476502, 14288738, 18079267, 23140378, 29793455, 38032451, 47247298, 55846256, 61546406, 63611122, 62839986]
10612F2839986j873325j046680J064023L979332P731560J1985642J6287392J8388116
10604A19356046J6124728Q573655q89774p986122r905984p293826k673977K694555
10596A17999301Q752669J5167785K0845431K2855591J7608595N388091q292998
10589B00324465j7999596k0079807j6399749j0759115m942537N65983O015451
10582A36725095J0132429J1002719O744111j847584j1019493j6480613j6817935
10575A18438729j3913652j0075136o265766k867546l30504J332365J441930m99167
10567H7261253l894884p269926r389454r444372q316621o827340n511404m383378
10559C2223874l427751k879395k522850k111302j736054j570747j463668j475600
$$ y = [62839986, 60966661, 59919981, 60984004, 64963336, 72694896, 84680538, 100967930, 119356046, 135480774, 144054429, 143164655, 135178533, 125272549, 117978723, 115304746, 117999301, 126751970, 141919755, 162765186, 185620777, 203229372, 208617463, 200324465, 182324869, 162245062, 145845313, 135086198, 130143661, 130709644, 136725095, 146857524, 157860243, 164604354, 162756770, 151737277, 135256664, 118438729, 104525077, 94449941, 88184175, 85316629, 84986125, 86318490, 87760420, 87261253, 83366369, 76096443, 66706989, 57262617, 48945996, 42118656, 36607252, 32223874, 28796123, 25916728, 23393878, 21282576, 19546522, 17975775, 16512107, 15036507]
10551A5036507j538090j135193j026480j005350j045420q77495n69621n78852
10543G260006o49820n35686o07912m71668l67448n47845k06322j65683k42349
10534C465273k18596k37457l54837k74373j25450j04798o1341k00561j79831n0794
10524A657235k0810j07663r3038j16194j78058j25827P8191J86609L0723R507
10514A320675o7458j08919o1078l9786j84230l0320l8483j5321M4874R3149r3774
10503H19329j15217n7212R5796p8378o3380J9122Q9804M4644N3324k7013q3717
10492F97102m3335K846p8372l9627l7505O018J33818j65193j24962P6443N7774
10481D85007j4852J1763J5371j63179j4736J13814m1131j42972o4160J82301K19444
$$ y = [15036507, 13498417, 12363224, 11336744, 10331394, 9285974, 8408479, 7838858, 7260006, 6610186, 6074500, 5466588, 4994920, 4627472, 4079627, 3873305, 3707622, 3465273, 3246677, 3009220, 2654383, 2380010, 2254560, 2149762, 2088421, 1887860, 1708029, 1657235, 1636425, 1528762, 1435724, 1319530, 1141472, 1015645, 1093836, 1280445, 1311168, 1320675, 1253217, 1144298, 1083220, 1043434, 859204, 828884, 790401, 775080, 819954, 913103, 819329, 704112, 646900, 742696, 664318, 600938, 620060, 709864, 754508, 807832, 780819, 697102, 653767, 656613, 578241, 538614, 501109, 507127, 640945, 475752, 350790, 427233, 485007, 470155, 481918, 497289, 334110, 319374, 433188, 392057, 249085, 184925, 367226, 586670]
10470E86670n4360j53216L7222O6371N7306N5032r7776K7771J02751L6553j65649
10459D98675o36K450P3707l7248l638r737O520N812r3324K283J16564j35636j23820
10446C01972K1411L8503K6333J06319O0305o0007P4395Q9578n5925j71781R251
10435D40354J08346r7279j18769J70565J04222L5681q155j13655j16158j54059
10425B51093J45388J2274l0341J8007l2236j52974j03270Q4574m4517j40471J27113
10414A34640J35193J12614J5433k0309R4842J0262K2371j1982M6810P7187m8826
10403E68235p0651k6615J4428m8082K8352n1473K4098j51067j20968k2641o8780
10392G4836J34917k747L7280R273n1264q0978J398N5611K3127j20142N5875J7812
$$ y = [586670, 532310, 379094, 416316, 482687, 539993, 595025, 497249, 525020, 627771, 664324, 498675, 498039, 500489, 574196, 536948, 533310, 523573, 530093, 535905, 442581, 444864, 561428, 425792, 301972, 323383, 361886, 388219, 494538, 554843, 494836, 569231, 658809, 602884, 431103, 440354, 548700, 451421, 332652, 503217, 607439, 643120, 634965, 521310, 405152, 251093, 396481, 408755, 378414, 396421, 364185, 211211, 107941, 192515, 147998, 7527, 134640, 269833, 382447, 397880, 377571, 472413, 482675, 505046, 493064, 539874, 617061, 568235, 497584, 470969, 485397, 437315, 465667, 414194, 438292, 287225, 166257, 143616, 74836, 209753, 207006, 244286, 253559, 202295, 121317, 122715, 178326, 201453, 81311, 137186, 154998]
10380A54998j71576k3935k8366J3337J43886O6099L1505l0945M2664L7696M5651
10369B81014j33409l8334R4168Q0410J47742l852j15102q0139j05800J9850J71
10358A46719k0511K6962j10401j43611J13058J91029P0164j52901j04505J03461
10348A19464j6869j0652m2363l795J29956Q4881j13934l4456m8264N049J3096
10337H2113K2789J48015j97979p6976J00092O9576r3353m0953O0038J93883M1802
10326C09047q820q3479k8222K0803j72586j27568N7987N6268K4897M8588N5010
10315A51925j1259K5518J11433R4816j12518j96539M7238K12500k4672j07081
10305A91361J52762O589k00465k2667P743K4607r4034j22005K3832K23564N9205
$$ y = [154998, -16578, -40513, -68879, -55542, 88344, 154443, 185948, 155003, 197667, 235363, 281014, 147605, 109271, 203439, 283849, 431591, 427739, 312637, 232498, 126698, 146548, 146719, 126208, 153170, 42769, -100842, 12216, 203245, 273409, 120508, 16003, 119464, 102595, 91943, 49580, 45785, 175741, 260622, 146688, 112232, 63968, 69017, 82113, 104902, 252917, 54938, -22038, 78054, 147630, 54277, 13324, 73362, 267245, 309047, 300227, 216748, 188526, 209329, 36743, -90825, -32838, 23430, 48327, 96915, 151925, 140666, 166184, 277617, 372433, 259915, 63376, 110614, 323114, 298442, 191361, 344123, 350712, 150247, 127580, 135323, 159930, 65896, -56109, -32277, 191287, 250492]
10294B50492j5916o9292o9945J64477N0596k4756q9174j48698o0364M2662L2146
10283F2228P7376m51p1606k9915l570L5631L6036K6923l7873L318R3306r6139
10271I5264l2175J619J7998k973J02692J2540r234J1916J1247r8310P7282M9169
10259B37035M499J17533k0920j28336l6361j1193r4276j08957K1300R3224r342
10248F4206j215J18304J5255j37021j44676L6152K3224R9604L2044l8904M1642
10237A08615p6887N1940P1603O4457M6736K3210k2265n1091j6120q0690k04789
10226h5281o1832J88485L6557j25369o4963J24507Q8225l1243r7333r0787M7839
10215g1195j1724J23458P3139K0637R3429n5764r0442j51458J4991o0969o0074
$$ y = [250492, 234576, 165284, 95339, 259816, 310412, 285656, 196482, 47784, -12580, 30082, 62228, 139604, 139153, 67547, 37632, 34062, 69693, 105729, 132652, 94779, 98097, 191403, 95264, 63089, 64708, 82706, 79733, 182425, 194965, 185731, 197647, 208894, 110584, 187866, 237035, 241534, 359067, 338147, 209811, 173450, 162257, 67981, -40976, -19676, 73548, 64206, 62991, 181295, 196550, 59529, -85147, -48995, -25771, 73833, 105877, 66973, 108615, 31728, 83668, 155271, 219728, 266464, 289674, 267409, 216318, 200198, 119508, -85281, -147113, 41372, 77929, -47440, -112403, 12104, 100329, 69086, -28247, -119034, -71195, -82919, 40539, 113678, 134315, 227744, 171980, 81538, -69920, -54929, -115898, -175972]
10204a75972P6999R3843J12354p481j2378o8017r1501j10441M1052j57274j70330
10193d69146J73269J82199M3875M6611l1378q0449J18335M9731N8214L0441R429
10182A31131R621K3315O4734K9243K34716P3223M8704r9910q2184M4512m5001
10171D32104J18403N9871J55450P2848r0849J03974J1695J23824K8120J4649R7954
10160A128043j53534j99556J03083J54485J26080J49399l6348j41104j376j37500
10150I91672o7985j8896j89123O9927Q113Q0645K09736J64754m04k40124j42675
10139H65640k71806k6139M6677N1988j3719m1624k3890O7256j38432r1432L1809
10128D56328J6896j50744n1567J5533k448l0522j9044j2898j42394J3309k8582
$$ y = [-175972, -98973, -5130, 107224, 99743, 87365, 19348, -72153, -182594, -141542, -298816, -469146, -295877, -113678, -69803, -23192, -54570, -135019, -16684, 33047, 91261, 121702, 131131, 140752, 164067, 228801, 258044, 492760, 565983, 614687, 514777, 432593, 477105, 432104, 550507, 610378, 765828, 838676, 747827, 851801, 863496, 987320, 1015440, 1030089, 1128043, 974509, 774953, 878036, 1032521, 1158601, 1308000, 1271652, 1130548, 1129172, 991672, 923687, 904791, 715668, 785595, 793708, 874353, 1084089, 1248843, 1248439, 1008315, 865640, 593834, 567695, 614372, 666360, 652641, 611017, 587127, 654383, 515951, 424519, 456328, 473224, 322480, 270913, 286446, 283998, 253476, 234432, 221534, 79140, 92449, 63867]
10117F3867M4429L4444J26138L334j25243j09211P8553l8516N4442J8818j02109
10106D8946q3829J04975n4831J2004K06523O9393j26141m1195K8092n127j14268
10095D4542n2987J21281p0791l8570P1679L5819K02J3589L0468j36385p1810L5643
10083a7320J17081J38591M4829k6149l463m5847n2813l4399n0070m1049Q4716
10072A14107j14816n9395N9505o2293J2536J17602O2145j5690P0852j27o1890
10061A22536k6986J34719J61813m1754l8316j61739k884O3996M6913j48517n4877
10050E4904J1730j8990N6473q857R2800m0613j75566j3999K03088K1017j83979
10039a992j05943r257n2206M1363J1092j2777p4254r0000M7234K39331N4251O674
$$ y = [63867, 108296, 142740, 268878, 272212, 146969, 37758, 116311, 77795, 132237, 151055, 48946, -34883, 70092, 15261, 27265, 233788, 303181, 177040, 135845, 163937, 158810, 44542, -8445, 112836, 42045, 3475, 75154, 110973, 111175, 124764, 155232, 18847, -52963, -17320, 99761, 238352, 283181, 257032, 253569, 207722, 154909, 120510, 70440, 29391, 114107, -709, -60104, -599, -62892, -50356, 67246, 129391, 113701, 184553, 184426, 122536, 95550, 230269, 392082, 350328, 312012, 150273, 147389, 211385, 258298, 109781, 54904, 66634, 47644, 104117, 95260, 188060, 147447, -28119, -42118, 160970, 181987, -1992, -107935, -117192, -169398, -128035, -116943, -129720, -203974, -293974, -246740, -7409, 46842, 53516]
10027E3516J49632O7536o8481m7805K4629K1688m0232J6475P7939j29030k23132
10016i7265M102R8483Q4350p9083m2046j06381k15595m0574J76318L04078O4463
10005A50850p1465j07496j0811l8576j0141K9037j4979P462J59983p4J2386M596
9993A10772j67921K9573J06112l8916l1243P147n8582R5176O5401q7412r1187
9982f1080L129L9063o5047R873J3615j3506M3149J16082J1914P463n3148K2043
9970G3550n7005M3589p003j07745J7333L5037K7453Q9778P420q2109j28374n1223
9958a39299L2040O1425J53143M2426j8723j70005k22969J67963N9369J7034J5905
9947a691M4064M0090O1299j391L7J4162J4831j66882l9037J0073j27136J8595
$$ y = [53516, 203148, 270684, 202203, 154398, 179027, 200715, 160483, 176958, 254897, 125867, -97265, -93163, 5320, 89670, 10587, -31459, -137840, -353435, -394009, -217691, 86387, 150850, 79385, -28111, -38922, -77498, -87639, -58602, -73581, -66119, 93864, 93790, 106176, 110772, -57149, -27576, 78536, 39620, 8377, 15524, -43058, 52118, 117519, 30107, -61080, -57951, -18888, -83935, -74062, -60447, -73953, -30804, 85278, 97192, 104655, 51507, 73550, 16545, 60134, 53131, -54614, -37281, -2244, 25209, 114987, 122407, 40298, -88076, -139299, -107259, -45834, 107309, 149735, 131012, -38993, -261962, -93999, -34630, -17596, -1691, 42373, 82463, 143762, 142371, 142408, 156570, 171401, 4519, -34518, -24445, -151581, -132986]
9935a32986K7405k0800K172M1051l6152L1181J05485J28491R2701o8752m7356
9924A22440J430P630J0352p4526k0449o3519r2777J4793Q9009N8139M197R9043
9912A55762J4856R0683k09627r0952N7017J46732J223j06876k37187K6202j13384
9901b65551l1588Q6545J58700P0112o53J14113L4647k8302J41570q7220j14922
9890G7451q5056o5870j42363m8701K05046k0093o3789Q4143M7970J5667j90751
9879a86346M9235J948n9180Q4694J21928p2p5230L4829k8542o3377p3224n0236
9867b43573Q9109O2689J13444N390j650k0727n5738j29442j9816K5330l7606J18040
9855i4550q752J338m0540l4475Q6992m1405P0749P1354J23657O2036l0930M057
$$ y = [-132986, -105581, -126381, -124209, -83158, -119310, -88129, 17356, 145847, 238548, 169796, 122440, 123870, 131500, 141852, 67326, 46877, -16642, -109419, -94626, -5617, 52522, 56719, 155762, 170618, 261301, 51674, -39278, 17739, 164471, 165694, 58818, -178369, -152167, -265551, -297139, -210594, -51894, 18218, 17565, 131678, 166325, 138023, 279593, 192373, 77451, -7605, -73475, -215838, -264539, -59493, -79586, -143375, -59232, -11262, 4405, -186346, -137111, -135163, -194343, -109649, 12279, 12207, -63023, -28194, -56736, -120113, -193337, -243573, -154464, -91775, 21669, 27059, 25409, 4682, -51056, -180498, -200314, -174984, -212590, -94550, -103302, -101964, -142504, -176979, -89987, -131392, -60643, 10711, 134368, 196404, 165474, 169531]
9843A69531n2138M5666O1289p1746J9034j01438j68363Q0727Q997l6603l3167
9832g8211K9930R492j01504N8398J44864O7460j35362k2238q5730m2365J0834
9821a44432l0140O7350J31710j9425m8699J8954k0814p7552p7109J12302K42209
9810A54354O5014r3210M3653M5330j17065j21366o3611N8968K5663m0342K3000
9799a9612J0627j6481J0366K2011J42112Q4434p6242j9281N6530R3473k7172k4000
9787B36765J23976m2983o1614K55270M89688P71388Q72461P83486J43464l42527
9777C229374p27905q08991m48212j43881j38167k49676L0464j61907j81363j10122
9767B89614J8003J75806J40823N4695r9820o3412o5023j01491N0650J6381j16912
$$ y = [169531, 117393, 163059, 224348, 152602, 171636, 70198, -98165, -17438, -8441, -45044, -78211, -48281, -38789, -140293, -81895, 62969, 130429, -4933, -27171, -112901, -155266, -144432, -174572, -107222, 24488, 5063, -43636, -24682, -45496, -123048, -200157, -87855, 154354, 219368, 126158, 169811, 215141, 98076, -23290, -86901, -27933, -2270, -42612, -19612, -8985, -25466, -15100, 6911, 149023, 233457, 157215, 137934, 194464, 287937, 260765, 236765, 360741, 317758, 256144, 511414, 1001102, 1772490, 2644951, 3428437, 3571901, 3229374, 2501469, 1692478, 1244266, 1100385, 962218, 712542, 743006, 581099, 399736, 289614, 307617, 483423, 624246, 678941, 579121, 515709, 450686, 349195, 399845, 416226, 299314]
9756B99314o6232q5558p7467l2970J8956j14153j05851J45310J13322q1484K8023
9745D1210O6985N4298J54527k0547l9815o4700m5392J1433j44609o9560J62554
9734A06384N4751k7606l6003N0305l74k03021p2209p013q5921r0650J79490J16934
9722a4933l0085k5981P0619J1037K666K3480M8248o9467j28690J25115J11692
9711A23701l5058j04469j9158q0681j841k3950R483J08237l0395K0931m7159N4
9699h0305l6008P0697R8569K7765J08426l4594q5094P270P2337J08559j11962
9688A45660j16546L0721n0037l9280K4324J07394J16307l6315J02705m3791j32906
9677A08236r7258j45992n3558O0877M9029m9993q8702J15526J18521j7327J01791
$$ y = [299314, 233082, 147524, 70057, 37087, 56043, -58110, -163961, -18651, 94671, 13187, 41210, 108195, 162493, 317020, 296473, 256658, 191958, 146566, 157999, 13390, -56170, 106384, 161135, 133529, 97526, 147831, 147457, -55564, -127773, -134786, -220707, -311357, -131867, -14933, -45018, -70999, -380, 10657, 13323, 36803, 85051, 15584, -113106, 12009, 123701, 88643, -15826, -34984, -115665, -117506, -141456, -131973, -23736, -54131, -33200, -80359, -80305, -116313, -45616, 52953, 80718, 189144, 154550, 69456, 76726, 149063, 257622, 145660, 29114, 59835, 9798, -29482, -5158, 102236, 218543, 182228, 284933, 241142, 108236, 10978, -135014, -188572, -127695, -78666, -128659, -217361, -101835, 16686, -641, 101150]
9666A01150j1217N5335J29798P6963r8432j82060l01920j59971N3363J93343N6386
9655h7262n7335J58391L2725p089l5391N3491K05308J28207j550m0639j41167
9644B07689k03799j24529q441o4006k224L8933L0997O2059J05284j26573j11052
9633a95662R7181R7520N2677p4207Q633m8481l3508q5823o0105J10403K04088
9622G2716M3267m5811J9477Q7750k4885q0254m6952J1975P6603j31555j21864
9611a39533L9950l517K468J1398N235N5232n7054r0541j4074j8817J35383L273
9599g0597K678N4982O1696l4279q5794n9311J25203J09141J6634L7376j72910
9588a5181Q92p3337L2976O5418K3285l8536j64827j7515J27036J52413J84426
$$ y = [101150, 89933, 145268, 275066, 352029, 253597, 71537, -230383, -390354, -336991, -143648, -87262, -144597, 13794, 46519, 39430, 4039, 57530, 262838, 391045, 389495, 348856, 207689, 3890, -120639, -129080, -193086, -195310, -156377, -125380, -63321, 41963, -84610, -195662, -98481, -961, 51716, -22491, -13858, -62339, -95847, -181670, -241775, -131372, 72716, 115983, 70172, 89649, 177399, 152514, 72260, 25308, 37283, 113886, -17669, -139533, -99583, -103100, -100632, -89234, -83999, -28767, -85821, -176362, -190436, -209253, -73870, -70597, -67919, -12937, 48759, 14480, -71314, -130625, -5422, 103719, 120353, 157729, -15181, -14289, -87626, -54650, 10768, 34053, -4483, -169310, -186825, -59789, 92624, 277050]
9577B77050k63929j11422J07086q4607l3158K0471p8290N5507J36783k3690Q4018
9566H5819l8986q0993J03495m2320o9938l6527J7132Q513M5451N416Q7192J26718
9554B10972O4679m176m964j01353K3489j52040r0222k6441J9956k04926j55577
9543d20603J60352J37085N3727O2401J06181M9736l3978L6981l5678j84320j20879
9532a88995J27498Q2493m7436k6457J4857O2013R3452n7796j32029M407j7111
9521h5104Q626n9666J11842M6384q5168Q0604j3300m8138P3945l5851J48961P8946
9509B22081j73028j06581J71418K564L3690j09814m0844Q4362O6293n5843p1446
9498B2852p0941M1942k7418j34016j670K4801J0463l1134L5564R1038M2216j6803
$$ y = [277050, 13121, -98301, 8785, -75822, -108980, -88509, -166799, -111292, 25491, 1801, 85819, 46833, -34160, 69335, 27015, -42923, -79450, -62318, -53805, -8354, -2938, 84254, 210972, 275651, 271475, 266511, 165158, 188647, 36607, -53615, -80056, -60100, -265026, -420603, -260251, -123166, -69439, -7038, 99143, 148879, 114901, 151882, 116204, -68116, -188995, -61497, 20996, -26440, -52897, -38040, 23973, 117425, 59629, -72400, -67993, -85104, -76478, -136144, -24302, 22082, -63086, 17518, 4218, -43920, 30025, -5826, 143135, 222081, 49053, -57528, 113890, 116454, 150144, 40330, -514, 83848, 150141, 94298, 22852, -48089, -6147, -33565, -167581, -169251, -144450, -133987, -165121, -129557, -38519, 3697, -13106]
9486a3106p9882N2972J7442Q244J2399J8064j05751q7392J20971J90271l2180
9475A02052n4689l8053K2812N632k3988K2315n2439j25034r645J58856J64267
9464A72086j91094m610L2673l1373l5112j1650J64889J03020j27346n1429k6620
9453f566p7185K3822k4757J09002M6955J7409j0717k6315j7394o2860M0056N1049
9441F2499j09137r6856n6514L209J56985O1186J4835k5847K1487K1343P459n9611
9429A038l0675n0330O6048m571o4837J23708L1669p7697p8684P4094P5783l615
9417F1931p1794j5619J06848p4855j8238K1538l9206P347P9811p1463j03143J593
9405a15250P0215K38681J1923k9349n3805j5013Q4131R778q5801l0901J01493
$$ y = [-13106, -92988, -40016, -22574, -14330, -1931, 16133, -89618, -177010, -56039, 134232, 102052, 47363, 9310, 32122, 37754, 13766, 36081, -16358, -141392, -151037, 7819, 172086, -19008, -23618, 9055, -22318, -57430, -69080, 95809, 198829, 71483, 20054, -6566, -83751, -59929, -84686, 24316, 71271, 88680, 77963, 51648, 34254, -28606, 11450, 62499, -46638, -143494, -200008, -196799, -39814, 21372, 36207, 10360, 31847, 53190, 60649, 1038, -29637, -79967, -13919, -18490, -83327, 40381, 72050, -5647, -84331, -10237, 65546, 61931, -9863, -25482, 81366, 6511, -11727, 9811, -29395, -22048, 57763, -13700, -116843, -115250, -45035, 193646, 205569, 176220, 122415, 107402, 191533, 201311, 115510, 84609, 186102]
9394A86102k5924o5601p7851o9120l7240j38514J18826J41298m046K3144j26221
9383g5147j48157J05332L3865k3457J07035N0860j74750rJ21406N741l9822k3309
9371f0412M7540J04187j6011J5944j8775k7399n8728L285M5896m845k43799q2034
9359b95151O0640J01592O6363n6192M274Q0862r279K0876m7927q5168p6474j7003
9347b52587J37456J91191Q6922j11950n9752N1808J3016Q585o6083p8517J581
9336g8330L9809P8247P5280m0739o3335O454P1672L2762j32122j39223L0297M8859
9324g0369K5831k6811q7995n8423q6273J2381Q1046N552Q4403J86456O8052o1705
9312G2145p2333r872j407K0237L0097q6449j17292j1698P1319J06581k0285o1299
$$ y = [186102, 160178, 94577, 16726, -52394, -89634, -228148, -109322, 31976, 27930, 51074, -75147, -223304, -117972, -84107, -107564, -529, 50331, -124419, -124428, -3022, 2719, -37103, -60412, -12872, 91315, 75304, 91248, 72473, 45074, -13654, -10369, 35527, 30682, -213117, -295151, -234511, -132919, -66556, -122748, -118474, -37612, -46891, -26015, -73942, -159110, -235584, -252587, -115131, 76060, 162982, 51032, -8720, 43088, 56104, 64689, -1394, -79911, -78330, -38521, 39726, 115006, 74267, 10932, 17386, 89058, 121820, -10302, -149525, -119228, -70369, -44538, -71349, -159344, -217767, -304040, -291659, -210613, -205061, -120658, 65798, 133850, 72145, -188, -10060, -11467, 8770, 38867, -47582, -164874, -176572, -105253, 1328, -18957, -80256]
9300h0256o0485K2909J08474q5199m7797r0316m5548L0445N3990j3052P6922J11114
9288a8799l3476o5147M9922N5902N8450J9706P9472j22061m194P3814q5903o5871
9276e8185N4507K164K3388Q7665j7507l4151J32897N4591m5698j57369j64667
9265a22365l4158J9081k2906l1303L6734P7805j1316p5986L0514K22790N2867
9254A41757o4611j12831K3091P4326l0043j1473p8452j562j21900l8720Q7242
9243a33176L6366q2928M3358J60598P52j29629L8057j8083q7095j4291J77713
9232h358R9476n9909j07220o7625k2379o1844P8053J18922R6720L0293j2900j84370
9220a01141L9707N6821m9599Q3590P7826p9171q5092Q9339L8138R572J0265M6922
$$ y = [-80256, -140741, -117832, -9358, -94557, -142354, -232670, -278218, -247773, -193783, -206835, -129913, -18799, -52275, -117422, -67500, -11598, 46852, 66558, 146030, 23969, 19775, 93589, 7686, -58185, -3678, -1514, 21874, 109539, 92032, 57881, 190778, 245369, 199671, 42302, -122365, -156523, -137442, -160348, -191651, -154917, -77112, -88428, -164414, -133900, 88890, 141757, 77146, -35685, -12594, 61732, 31689, 20216, -58236, -59798, -181698, -220418, -133176, -96810, -179738, -136380, 24218, 24970, -104659, -66602, -84685, -171780, -186071, -8358, 91118, 31209, -76011, -143636, -166015, -227859, -149806, -30884, 65836, 96129, 83229, -101141, -61434, -4613, -54212, 29378, 107204, 28033, -57059, 32280, 70418, 79990, 90255, 137177]
9208A37177j7670j598m4434o4574R0643M3940M2856O6434j4306k29149k35660
9197b26341j2522R0047j19068j30550J06538J34010M9096j552j14426M8063K07164
9186C0459o862q5645m3630J19043J9741k6507k6495L3645m9130l6368n5841J068
9174a26522K3024k8302P9586k575o0972Q2617k1666L2620n9144j4711L5171Q7316
9162B6442p9488n2751K1208l4920L6225j15171R1521J46545J09229p3710k26942
9151a51812p000J43036N0886R72N0815K3175R2653j9747j71936r6923l2259o0065
9139a78205l0511L8460J77852o4836j16684P4627J00732K6697j13533k4823L3929
9128g6295n5150L4912J12373k8464m2465n527N8682p0086K8687J43478O7089O7358
$$ y = [137177, 119507, 117909, 73475, 8901, 99544, 143484, 186340, 252774, 238468, 9319, -226341, -238863, -148816, -267884, -398434, -291896, -157886, -108790, -110342, -224768, -176705, 30459, 23597, -62048, -105678, 13365, 33106, 6599, -19896, 13749, -35381, -71749, -127590, -126522, -103498, -131800, -52214, -54789, -115761, -33144, -54810, -22190, -81334, -96045, -60874, 26442, -53046, -105797, -84589, -119509, -83284, -198455, -106934, 39611, 148840, 75130, -151812, -158812, -15776, 35110, 36082, 86897, 110072, 202725, 182978, 11042, -85881, -118140, -178205, -208716, -170256, 7596, -57240, -173924, -99297, 1435, 28132, -85401, -110224, -76295, -131445, -96533, 15840, -12624, -55089, -60616, -1934, -72020, -43333, 100145, 167234, 234592]
9116B34592l842L4601Q8376L1043O7394M9303Q7858j3142l058j57725k76196r7584
9104D1620P5894K4060o4668j0572k5544P4587J2436M0375K4936j4791O5740K0113
9092B64186l6716P135q8659j06535K4498N9134j7294j06533r6699K4131M5323
9081b8029j7870l6512Q1590J02204M0972J7866j19758j7668M3591r191m9009k8557
9069b0371j28931l9J73372N3715o4965j27176l2026j2728K0808J48084N6771k01838
9057a35324o8403O9551l4391q7448K1893l361O0582J13739Q9913m8861n9159j13173
9045a94442q3638R4212J56499J93704j37836j58662r728Q2052J02378Q6431p1383
9034E9587q4716j10781n1076J02953K6919J17568n3471m5227R3948p6738j39566
$$ y = [234592, 230750, 265351, 353727, 384770, 452164, 501467, 589325, 576183, 573125, 415400, 139204, 41620, 117514, 141574, 76906, 66334, 40790, 115377, 127813, 168188, 193124, 178333, 244073, 264186, 227470, 234605, 145946, 39411, 63909, 123043, 105749, -784, -97483, -73352, -28029, -45899, -82411, -821, 101383, 142355, 160221, 40463, 22795, 66386, 57195, 8186, -20371, -149302, -149341, 24031, 77746, 12781, -114395, -146421, -159149, -138341, 9743, 66514, -135324, -203727, -134176, -168567, -256015, -234122, -237483, -176901, -63162, 26751, -22110, -81269, -194442, -278080, -183868, -27369, 166335, 28499, -130163, -139891, -57839, 44539, 130970, 59587, -25129, -135910, -186986, -84033, -57114, 60454, 6983, -38244, 55704, -21034, -160600]
9023a60600j42433p6619p475q4975N3110Q0620J22453O0864L9909l5006O7557
9012h2595J29282O1604j53364m1664O9131r9459p546K0874M1377P7097P2243p6255
9000A0725o1888J15371k6865o0916o6247N105J31568M7111j6475M8157j27010
8989a364j67112j08906J30958Q3994p2862m2137P3474K35065J12511n6504o2550
8978A24567o3450Q6623R555j697j4005J49317q9510j49955o7453k10065q3509
8967c09582O9982P8905L5101o5356j4765j40540J46391o8076L4732J61757N6310
8956a5141r4841p0398O7146p3355m7716M7133J51841j0543j47435j1979R2061
8945a13227L0328m8400p295J20201p4175O2462Q1669j33638L9737N7395L3428
$$ y = [-160600, -303033, -379652, -387127, -472102, -418992, -338372, -215919, -155055, -115146, -150152, -82595, 46687, 108291, -45073, -86737, -17606, -117065, -124611, -103737, -62360, 14737, 86980, 10725, -51163, 64208, 37343, -23573, -89820, -84715, 46853, 93964, 77489, 125646, -1364, -168476, -277382, -146424, -62430, -135292, -177429, -103955, 131110, 243621, 187117, 124567, 61117, 147740, 157295, 155598, 141593, 290910, 201400, 51445, -16008, -226073, -309582, -239600, -160695, -125594, -190950, -205715, -346255, -199864, -267940, -233208, -71451, -15141, -109982, -180380, -113234, -186589, -234305, -187172, -35331, -45874, -193309, -205288, -113227, -82899, -131299, -138594, -18393, -92568, -30106, 51563, -82075, -42338, 15057, 48485]
8934D8485J526J35626l8166j88158j03184k9812M4882O8289j47006N4232J36495
8923a6791n0069j3992M3793l9900O6482j954J1277k770l3321j03785j88100N1482
8911b77648K90128Q1750N2097J57471k4764k16140j75345j67762O4405O1327J20212
8900c4269L3374m9919J67169L9790m5875j2775R1917l2311K1710N399o7168R5890
8888B12932j36770m0278K1929j0067P7161J29881J03314k511p5220j02768j45795
8877C1808j8776j18903N2080m2646j28486k8289R1075O6658l8233j54761j09105
8866c97578k3992j5504R9226J56106J47177J04995M7353o2418j47604n1434J06058
8855c7615m0799j9664N676K8638M476p0909o7388P8204J27018j06313l2639J69205
$$ y = [48485, 50011, 185637, 147471, -40687, -143871, -173683, -128801, -60512, -207518, -153286, -16791, -66860, -80852, -37059, -76959, -10477, -12431, -1154, -3924, -37245, -141030, -329130, -277648, 12480, 94230, 146327, 303798, 279034, 62894, -112451, -280213, -215808, -154481, -34269, -895, -50814, 116355, 156145, 110270, 97495, 189412, 157101, 178811, 184210, 117042, 212932, 76162, 35884, 57813, 47746, 124907, 254788, 358102, 355591, 280371, 177603, 31808, 13032, -105871, -53791, -96437, -224923, -253212, -162137, -95479, -133712, -288473, -397578, -421570, -437074, -337848, -181742, -34565, 70430, 117783, 55365, -92239, -143673, -37615, -78414, -98078, -92402, -63764, -59288, -130197, -197585, -119381, 7637, -98676, -131315, 37890]
8843C7890n1553j67339J10520J48638l7746o9272Q574n2365j21328L7433J85137
8832B8589O8424j0701m0778j24464J36241L6944o0590n3922j9087P7890P0447
8821A08993l4879l4391j1758o0575J1849K8670q6506R0465R973r9905o9497L0959
8809a16602J55024R5992p1098k35907j5823Q7069J60640n1830k8910l1557n4554
8798a07556J59143l8643j1970M8032n0482k3543o1196r1980j17115j10622L8534
8787c67398J68037J95414J13662l3834n4186j1781j4859k4384J0581r3618m1459
8776a53825r1972N2384M4926R1946K5408j7455k9174o8051K4035L6885p2740N2651
8764a04982L0680K9034J45664R2730j20029j37636j10180k9113J61193K23821
$$ y = [37890, -13663, -181002, -70482, 78156, 40410, -28862, -20288, -72653, -193981, -156548, 28589, 97013, 86312, 45534, -78930, 57311, 94255, 33665, -20257, -39344, 38546, 108993, 74114, 39723, 27965, -32610, -20761, 7909, -78597, 11868, 21841, -78064, -147561, -116602, 38422, 134414, 63316, -172591, -188414, -101345, 59295, 7465, -21445, -53002, -107556, 51587, 12944, 974, 49006, -1476, -25019, -86215, -178195, -295310, -405932, -367398, -199361, -3947, 109715, 75881, 21695, 9914, -4945, -29329, -18748, -112366, -153825, -245797, -193413, -148487, -56541, -31133, -48588, -77762, -145813, -121778, -84893, -157633, -104982, -74302, -45268, 100396, 193126, 73097, -64539, -174719, -203832, -42639, 181182]
8754A81182p98m8217q8215j06566l8476l2729r9718p446L5184R8409K22048n1768
8742F2890j6673m7098j1253o9051j3781M5998J01941O745L9267R624j25639k3629
8730d0659M3946q3497N3402M6321j06908j16831J11007K4300n3290K729L6534
8719h2946L667N888M1967J498n9896O1500L1091j31317n8558K4107J43631r5622
8707a14990l0486M0658M0199n7708J2155J05126j1799L7200M3366n7389L4523
8696D0855j01086l2261P1626O2451n2962N2592M9284r4685p7080R7737J6273q5614
8684e2870Q5379q451k7591j57846M9077j816k6115J66819R7470J5065R5743p2700
8672A62164n3919p4039J16227O0531p9571p521n3042r0944Q6181J03728j93801
$$ y = [181182, 180384, 132167, 43952, -62614, -101090, -133819, -233537, -240983, -205799, -107390, 114658, 62890, 46217, -881, -12134, -81185, -94966, -48968, 52973, 59718, 98985, 108609, -17030, -40659, 3287, -80210, -26808, 19513, -87395, -204226, -93219, -68919, -122209, -119480, -82946, -79279, -73391, -31424, -29926, -89822, -28322, 2769, -128548, -187106, -162999, -19368, -114990, -145476, -104818, -64619, -122327, -110172, -5046, -16845, 20355, 63721, 6332, 40855, -60231, -92492, -20866, 41585, -11377, 41215, 90499, -4186, -81266, 16471, 32744, -52870, 32509, 24058, -3533, -161379, -112302, -114118, -140233, 26586, 124056, 139121, 234864, 162164, 108245, 34206, 150433, 210964, 131393, 123872, 70830, -20114, 66067, 169795, -24006]
8661b4006j61410J278o2626k7668K32073K12560J9159J2548J4357l2708o6286
8650A17271j74607j26976O2653N0937Q7021j0481m1882O3470K7809l3901p5468
8639e4154P3212J68706K001j59776R2088R2531Q7949j7386j5817N5385J51j156
8627C23734K7384j65584m7610j92861N7510J23434j24003J0701q3556K4499J7755
8616b8597J5563M5485m3777o2109K8305j28677K1381J32452M3529N8240Q5222
8605A67017K237M5945q9169n4009R4548n0446p1321J33812r9228j09293J18229
8594H8322L2832K7068r5688m3869M944j43352J9428R1277K08267N192q0109K1185
8582A35497j8149j03766o896J0142K4737Q8109r858m9393p3306J02138j5823k2861
$$ y = [-24006, -185416, -184138, -246764, -274432, -42359, 170201, 189360, 201908, 216265, 183557, 117271, -57336, -184312, -121659, -70722, 16299, 5818, -36064, 27406, 55215, 21314, -54154, 19058, 187764, 189765, 29989, 122077, 214608, 302557, 285171, 269354, 324739, 324890, 323734, 351118, 185534, 137924, -54937, 2573, 126007, 2004, 12705, -70851, -46352, -28597, -13034, 32451, -11326, -73435, -45130, -173807, -152426, -19974, 23555, 81795, 167017, 169254, 215199, 126030, 72021, 166569, 116123, 44802, 178614, 79386, -29907, 88322, 121154, 148222, 52534, 8665, 13609, -129743, -110315, -19038, 189229, 194421, 114312, 135497, 117348, 13582, 6686, 16828, 41565, 129674, 119816, 70423, -2883, 99255, 83432, 60571]
8570F0571J05858n5312J23595k9140j67590j78125m5909Q0767J9746Q5430q12
8559i21n651n7604P6621Q3813r2747O6691k2420q0049j0082J3609N2832J44293
8547A68385o2607j04937L6432J18124R1012Q0415o4746j36817o7195p7167K38944
8536B19843L33054J47735J82166K24950o2427j83480k79724j59043j2010j4935
8526C96129j6058r863j33508p6016k8097M6355r752k0195l5131L9252N6440q4138
8514A25418j25976q3280P0760P2141J79844Q7998N355K6071N1900j68625j24782
8503A16824j87516j51599J27004N8704l3902M4209m0411j3236J9111J60706J15586
8492B15480J48737J95222L66679N88176K92793m3263k40811n66594l86480j24623
$$ y = [60571, 166429, 111117, 234712, 205572, 37982, -140143, -186052, -105285, -85539, -109, -921, -6572, -64176, 12445, 96258, 3511, 70202, 47782, -32267, -42349, -28740, 24092, 168385, 105778, 841, 37273, 155397, 246409, 326824, 262078, 125261, 58066, -19101, 219843, 552897, 700632, 882798, 1107748, 1045321, 861841, 582117, 423074, 411064, 396129, 380071, 370208, 236700, 160684, 132587, 178942, 169190, 148995, 113864, 153116, 209556, 125418, -558, -83838, -13078, 59063, 238907, 326905, 332260, 358331, 410231, 241606, 116824, -70692, -222291, -95287, -36583, -70485, -26276, -66687, -79923, -60812, 99894, 215480, 364217, 559439, 926118, 1514294, 1807087, 1763824, 1523013, 956419, 569939, 445316]
8482D45316j25238j26724J64191n0728J3409R9788j00651m4519J06088J66651
8472E47583r4059K4043k8771m1738k32689j55401p817O2278N4636J9926q2400
8461F5591n2321j1286L1043N2629o2895J6232L8060N7389R3584J35827q650n744
8449C49459p2395M2611J1216J29711K07868K74730K7696k2473j52210j66199j50040
8438D79974j65471j43797p766J90653K6170L6032l2773n2275l5376j54397j54313
8427a3339N4943J8622M0788l8587J07180J09559o3432q2160k01837j11863P4626
8416a05500Q5750N8019l5705n6895p023N1665M1603k4546J430N0646k8863N726
8404C6307N0065j929m5846n7389L2656Q935q732M3261J3624n2632p0184L5163
$$ y = [445316, 320078, 193354, 357545, 306817, 320226, 420014, 319363, 274844, 380932, 547583, 453524, 477567, 448796, 407058, 174369, 18968, 11151, 73429, 128065, 147991, 65591, 13270, 1984, 33027, 85656, 22761, 38993, 77053, 134442, 228026, 363853, 355203, 349459, 277064, 319675, 330891, 460602, 668470, 943200, 970896, 948423, 796213, 630014, 479974, 314503, 170706, 162940, 353593, 379763, 415795, 383022, 330747, 295371, 140974, -13339, 41604, 60226, 101014, 62427, 169607, 279166, 215734, 133574, -68263, -180126, -105500, -19750, 38269, 2564, -54331, -61354, -9689, 31914, 7368, 8798, 59444, 30581, 36307, 86372, 84443, 38597, -18792, 13864, 22799, 14067, 57328, 70952, 18320, -51864, -16701]
8392a6701J71246r872q6702j07967k8941Q9513J46941K7867L5087j65139j46107
8381i0775P8861k0789p354n0428J63905L9871M6889j19376r8568j26155K3169
8370a60750J49438J84506m7730j32657l4617m641N6504N9551J7629j44013N5161
8359a619M9819n057k5415j18450M1878O2854P4053K0816m7123P8295l3941n9803
8347C6307r7178l5446m5086J98914M4457r0421o8798L4931M2506K4543p9091o560
8335d0922j5864J10145M7059j8604l1081m4611j12300k7074N2732J06404J05835
8324A31719j00399k9876K0148q4171l8279Q555n9333l0293k2827L8523j3779K0248
8312a59764J5189n0533J13674K4445l3165o4772P3678J39007N3556R059j8963
$$ y = [-16701, 154545, 144673, 57971, -49996, -78937, 10576, 157517, 185384, 220471, 55332, -90775, -11914, -32703, -40057, -90485, 73420, 113291, 160180, 40804, -57764, -183919, -160750, -11312, 173194, 125464, -7193, -41810, -46451, 10053, 69604, 87233, -56780, -1619, 48200, 43143, 17728, -100722, -58844, 4010, 78063, 98879, 51756, 130051, 96110, 36307, -60871, -96317, -141403, 57511, 101968, 11547, -57251, -22320, 20186, 44729, -34362, -40922, -56786, 53359, 100418, 81814, 50733, 6122, -106178, -133252, -80520, 25884, 131719, 31320, 1444, 21592, -62579, -100858, -92303, -151636, -181929, -204756, -166233, -180012, -159764, -144575, -195108, -81434, -56989, -90154, -154926, -81248, 57759, 111315, 120374, 101411]
8301A01411M7942n343k0390j78998j40208J22309J26757R9005j03585q7307j73351
8290b11758K7862Q3908j18451k9452J05890L4656m6097J30299P9988K9974L6333
8279A23152n8569r2446j59125r6151l1456R407J68311J00077j591J23846P9187
8268A64642l9559j35420o3549N8097j2971J1619p1916l8347K24517K5655q7830
8257C4938J2047O2817K5091J3372J3055o4970K0091l6467n9907J01442L5537J7326
8245A74372K6178K8295n3851j02851p2080n8731P5276J86235r2828j7708N6815
8234A49122J6042j30835j05363P9729K9283k8660j13619J8969M5970j25803m0980
8223b06145J74123L9165J09103J5421L8049m5682j43465Q1904K8250J6079N535
$$ y = [101411, 149353, 144010, 123620, -55378, -195586, -73277, 53480, 152485, 48900, -38407, -211758, -183896, -99988, -218439, -247891, -142001, -107345, -153442, -23143, 56845, 86819, 123152, 64583, -27863, -186988, -283139, -314595, -305188, -136877, -36800, -38391, 85455, 164642, 125083, -10337, -73886, -15789, -28760, -17141, -89057, -127404, 97113, 122768, 34938, 46985, 109802, 134893, 148265, 161320, 96350, 116441, 79974, 20067, 121509, 157046, 174372, 200550, 228845, 174994, 72143, 63, -58668, 16608, 202843, 110015, 92307, 149122, 165164, 34329, -71034, 8695, 37978, 9318, -104301, -85332, -39362, -165165, -206145, -32022, 7143, 116246, 131667, 169716, 124034, -19431, 62473, 90723, 106802, 112337]
8212A12337j62384m1730k5011O6694l0077o5352K15981j04861Q1298J12471j05185
8201E4181j82082O6441O7545J9597j2979Q7917L1790L365j0121n5249n8634k2384
8189a0613j53438q5808J09404K00958j4911n8013n3991r3799M4611J5324p489
8178a07765n1657N9702N6954j2017j9124P4255r5296j28926J32655J63127L9562
8167A11470n9020l1666j8988L0009J5435K0159L5751o6709q5884K7244k289M9617
8155B5129J84857R8535r0467j20291m2192K6403M094J3090Q8337j37390j50922
8144a00817K7948J15073J30016m5982o3835j27612o3152N4890j0499Q173P2936
8133b861J5045k4512p8975k6511P8865O7406N0127Q9276r6658J2156p9960q5711
$$ y = [112337, -50047, -91777, -116788, -50094, -80171, -145523, 70458, -34403, 46895, 159366, 54181, -127901, -61460, 6085, 25682, 12703, 100620, 132410, 135775, 125654, 70405, 11771, -10613, -164051, -249859, -140455, 60503, 45592, -12421, -66412, -160211, -115600, -100276, -107765, -159422, -99720, -42766, -54783, -73907, 348, -94948, -223874, -91219, 71908, 111470, 52450, 20784, 1796, 31805, 47240, 67399, 103150, 36441, -49443, -22199, -24488, 25129, 209986, 308521, 218054, 97763, 55571, 81974, 86068, 99158, 187495, 50105, -100817, -72869, 42204, 172220, 126238, 62403, -65209, -128361, -73471, -83970, -75797, -2861, 12184, -12328, -91303, -117814, -38949, 28457, 78584, 167860, 71202, 83358, 3398, -82313]
8121h2313j07849o8700K22213m1013o8140N278J3225Q5528l8883l9186N1654L0327
8109c7859P0259J07420L9397k8109m9977m1438o008L2524n7554r089k0144m1033
8097d1611j28871M2520N1928Q3068m3631n4710K8890J2520Q7297m4431l4096O6988
8085B5861K3909m6663M3529L4047j20583N9773K7183M772Q5495j69p5803j38593
8073g7242k1311n7885J25008N6237r068o3401M9064O726J11249K2695k5814k1960
8061I4298j1534p2316m8190j49386L1806L4523J4752J3902J34571J97375o7777
8050A72024j48318j19104j11034Q8508J23025O2336K3095q8221k2314M8117R5986
8039A24100k010r9822r2224O4379P0261j43353j02895n432n5142N6197J62648
$$ y = [-82313, -190162, -258862, -36649, -77662, -145802, -140524, -127299, -41771, -80654, -119840, -68186, -37859, 32400, 139820, 179217, 151108, 101131, 59693, 53685, 86209, 28655, 19566, -578, -41611, -170482, -127962, -76034, 7034, -36597, -91307, -62417, -49897, 37400, -7031, -41127, 25861, 49770, 3107, 46636, 80683, -39900, 19873, 47056, 51828, 137323, 137154, 61351, -77242, -98553, -156438, -31430, 24807, 15739, -47662, 1402, 8128, 119377, 142072, 116258, 94298, 82764, 10448, -37742, -187128, -155322, -120799, -106047, -92145, 42426, 239801, 172024, 23706, -95398, -206432, -117924, 5101, 67437, 90532, 2311, -20003, 28114, 124100, 122090, 22268, -69956, -5577, 64684, -78669, -181564, -186996, -242138, -185941, -23293]
8028b3293O0535n7361n5685P7975R4912j12853r8767J10006P4991O4622q0193
8017E4889j71375Q0155Q9812q5075k2287R1408o8965J4999L2242q138J5430M8820
8005G1915O3192o4845R7471j08581j10808L2392P6851O1291q6821r2950j44975
7994b05868R5085J23888O7420j1446p2413j6045L2595J41371M944k54124p8074
7983a72667k472J04774n05j14026q79L3159j3690N8132P2204j5869o0002Q2735
7971b9106K47344n3671N785j58084p0499N0870m4874K2905m234J08112N6385n0792
7959H0141j29104O71p9196Q705P0691m1874n7974J16461J5294R413n5895O7090
7947D423J29686L8520n769n1242j19255J66915N7140o2671j66483n6614P5775
$$ y = [-23293, 37242, -20119, -75804, 2171, 97083, -15770, -114537, -4531, 70460, 135082, 54889, -116486, -36331, 53481, -31594, -53881, 37527, -31438, -16439, 15803, 7665, 23095, 71915, 135107, 70262, 167733, 59152, -51656, -19264, 57587, 118878, 32057, -60893, -205868, -110783, 13105, 80525, 69079, -3334, -19379, 13216, 154587, 159531, -94593, -172667, -175139, -70365, -70870, -184896, -185775, -152616, -166306, -108174, -35970, -51839, -111841, -29106, 218238, 164567, 170352, 12268, -58231, -7361, -52235, -29330, -33564, 74548, 130933, 80141, -48963, -48292, -127488, -118783, -48092, -89966, -147940, -31479, -16185, -6772, -62667, 4423, 134109, 172629, 166860, 115618, -3637, 163278, 220418, 157747, -8736, -65350, 10425]
7936A0425j0555j61954Q972K18267J55875p2019n8322l2465j14186N2721J92565
7925A89324N4187j14304q0333n8641P1096J21643R285Q220p0207r9807P9551J0576
7913A20590m8471p275j8186K9277K5018l6301o1747p0811K724R0410J7296J30431
7901A72955r0062p3553K1378O2812p5417n5511J26958J225j37723J3626J3503
7890a9809L3862O4302M7322L0069j7999j05043j38611o1266J09392J19658j040
7879F0837K2917q6453o1189o6405Q3472J16805n7933Q0040R2652K2949J9123p4910
7867A51905l3279k6670j04588J02329q3982j32061k3478p307k8893R0795J17480
7856B2251j3778J05343j37208k4484Q2011J54R7964j14551n8358O9103P2092j53635
$$ y = [10425, -130, -162084, -153112, 65155, 221030, 149011, 90689, 58224, -55962, -3241, 189324, 243511, 129207, 48874, -9767, 61329, 182972, 192257, 200477, 130270, 30463, 110014, 120590, 72119, 64844, 46658, 75935, 100953, 64652, 2905, -67906, -65182, 25228, 42524, 172955, 82893, 9340, 30718, 93530, 18113, -37398, 89560, 90785, -46938, -33312, -19809, 14053, 78355, 125677, 155746, 137747, 32704, -105907, -167173, -57781, 61877, 60837, 83754, -2699, -63888, -130293, -46821, 69984, 12051, 92091, 184743, 207692, 226815, 151905, 118626, 91956, -12632, 89697, 5715, -126346, -149824, -157131, -186024, -95229, 22251, 8473, 113816, -23392, -47876, 34135, 34289, 132253, 17702, -40656, 28447, 100539, -53096]
7844e3096l1950n3445J1661P7788j2612j2951j4863j1867N68N5353Q9555J41913
7832A86054p6388j82867L068L2227N1123l5348m6076N869O2519k0316O1465k1365
7820A9965m877j04821R6568O3824j66045n7595l5474k1976j11115Q1606J01823
7809a38117Q2473J26772j53183k4228P9753R1859J73429k8594j52412j08645m9834
7798a00727n239n0285J07559M2161N705N0543k1480J3088N6381o5520r1032k0964
7786g9810Q4615J0607k0449L570N4172R063k3524k02799q1907Q4561P7257q4542
7774a69186q4898Q8349J83950J05484j22111j15659J40381m1815j49885k34086
7764c99476J24800P4834l6665o3182K7498o6919L4244J72229K7852K7832j0741
$$ y = [-53096, -85046, -138491, -126830, -49042, -61654, -74605, -89468, -101335, -100767, -45414, 44141, 186054, 109666, -73201, -70133, -37906, 13217, -22131, -68207, -62338, 181, -20135, 41330, 19965, 15088, -89733, 6835, 70659, -95386, -152981, -188455, -210431, -321546, -239940, -138117, -55644, 71128, -82055, -106283, -26530, 65329, 238758, 210164, 57752, -50893, -100727, -105966, -156251, -48692, -6531, -826, 49717, 28237, 41325, 97706, 32186, -58846, -79810, 4805, 15412, -5037, -1467, 52705, 61768, 38244, -164555, -246462, -161901, -84644, -169186, -254084, -165735, 18215, 123699, 1588, -114071, 26310, -15505, -165390, -399476, -274676, -199842, -236507, -299689, -272191, -339110, -304866, -132637, -104785, -76953, -87694]
7753h7694j64527M5887O8376j0281K5725J3700j0940q8478l7405l895j10444l0679
7741c90655K94263k2960j53332n8123J43033K65503m1460r6473Q4951j38399j0039
7730a23691J82765Q5210O6925J8073q4787j96286P1116N5253J8403m2862m8838
7719A281q8984j00572j19897r2298R1650J35937Q1963l9029j9603J31019K8123
7708I590r0267o0416n413J19810L8704J14240J34337p1537k2478j02173L6226
7697A00623j1420Q9495m7942k6441k2906j66985L1525J23770l0272R45j9076m8692
7685b7376K0712J02224P4222k0987j86276j8519P1976R7737J02778j2449r0191
7674A13851L1877q1734n3202J5496O2526R7838r759q4949M5548J22208m9685j62736
$$ y = [-87694, -252221, -206334, -137958, -148239, -122514, -108814, -119754, -208232, -245637, -249532, -359976, -390655, -96392, -119352, -272684, -330807, -187774, 77729, 36269, -60204, 24747, -113652, -123691, 59074, 144284, 211209, 229282, 144495, -51791, 19325, 74578, 92981, 50119, 1281, -87703, -188275, -308172, -400470, -308820, -172883, -90920, -129949, -149552, -18533, 9590, -80677, -141093, -146506, -26696, 12008, 126248, 260585, 189048, 166570, 64397, 100623, 89203, 178698, 130756, 104315, 81409, -85576, -54051, 69719, 39447, 40392, 21316, -27376, -6664, 95560, 169782, 148795, -37481, -56000, 15976, 113713, 216491, 204042, 113851, 145728, 63994, 10792, 26288, 88814, 186652, 176893, 91944, 137492, 259700, 210015, 47279]
7662D7279j16831j11906m5269O3285K42124J36992q6359m4369r8787o9951K201
7651h1591O7690n2294O332O7205P0163R910Q0295N8741r742l5118j15835K7428
7639I3184j0477k5751L4552p7848p0422j10885o8386J6928P6244l6719L7298L7533
7627a04749L4757Q1454N2340j2561q8285o7434R5910J52280k3215k09537l4574
7616a23614K6505m5650q850J02095k0005j29870p0522k3133J75387J23908k029
7605D222m6444m5755P9726J04602q0692j12133N1857k2355j05306n1529p4513
7594b98320j4124J06313l75m5073L717J80993J51588M2767n5070r2027o7743L737
7582h3617n1304k0095R1534r9317O2168M5682O1093K22646k6570o3556M2099k9399
$$ y = [47279, -69552, -181458, -226727, -163442, 78682, 215674, 129315, 84946, -13841, -83792, -81591, -13901, -66195, -59863, 7342, 77505, 87415, 167710, 226451, 216709, 181591, 65756, 93184, 82707, 56956, 91508, 13660, -56762, -167647, -236033, -219105, -142861, -179580, -142282, -104749, -69992, 11462, 63802, 51241, -37044, -104478, -8568, 143712, 120497, -89040, -123614, -97109, -142759, -151609, -49514, -69519, -199389, -269911, -293044, -117657, 6251, 4222, -42222, -87977, -8251, 96351, 15659, -96474, -44617, -66972, -172278, -223807, -298320, -312444, -206131, -206506, -251579, -247862, -66869, 84719, 127486, 72416, -19611, -87354, -83617, -134921, -155016, -63482, -162799, -100631, -54949, 6144, 228790, 202220, 138664, 180763, 151364]
7570A51364m4684m2903K0162J22591l5086P196n1493k48057L3727O0883Q543M1794
7558B4037o1906m9288m7796P011J34859J25438j11560j58890j7509J04841J32340
7547H1577n3943o8330o7279o9616L6058L7326m8793Qj24903m7906l773J40183
7535a89391K39722N7841L0569n8218n9124j70720O227R114Q7330K1852L7576J693
7523A4471P6950j94544j72237o9099J1824J388p9620m5197J61224K52730P3263
7512C1153K8748J70690o0881k28182J3672L7322J1731L36R0346k4547r4110j06778
7500a30500J06899K9816k7711r9024n971R8939J27107O807l2797k9870j65215
7489a21520p8883L3897j9548P0735L4254l104o678o9653j1210M6935J06773j0176
$$ y = [151364, 106680, 63777, 83939, 206530, 171444, 178640, 127147, -120910, -87183, -26300, -17757, 24037, -37869, -87157, -134953, -127942, 6917, 132355, 20795, -138095, -155604, -50763, 81577, 27634, -40696, -107975, -177591, -141533, -104207, -153000, -152992, -277895, -325801, -329574, -189391, 50331, 108172, 138741, 80523, 21399, -149321, -143094, -133980, -46650, -24798, 12778, 14471, 91421, -103123, -275360, -344459, -332635, -331247, -410867, -456064, -294840, -42110, 31153, 59901, 230591, 169710, -58472, -44800, -7478, 4253, 4589, 94935, 70388, -23722, -130500, -23601, 6215, -21496, -120520, -126491, -27552, 99555, 106362, 73565, 43695, -121520, -200403, -166506, -186054, -115319, -81065, -84169, -90847, -160500, -171710, -124775, -18002, -28178]
7477b8178j13890r4350k2843O4580J00559L4436J02465J25186o2442j32057o8578
7466i5112M9591L4182k5692j2277L702j13122o9624J1393J0415M5164l5934P5088
7454a22226J9045j85160o1839o1733J60319J60765k1861j0014j00564l8767Q4487
7443a77548Q5013M2054j05577J098J19523L6557L9224O8785p7450k7984P0528
7432G4223O2612m7566j43581r0917P7406O6466m9533q1386j35020N0425K66273
7421D9402M1747j92222p3710k1941J30788J17126j432n9236J10759J49782j86959
7410F4104q6110o1117j10108j3285P3013N2369J11866q3355q5336q8832J31489
7399i5302J00358Q0044M5221q5175p1327k0209K2098j3763J07639K7075j33154
$$ y = [-28178, -142068, -236418, -259261, -194681, -94122, -59686, 42779, 167965, 105523, -26534, -95112, -45521, -11339, -37031, -49308, -45606, -158728, -228352, -216959, -206544, -161380, -197314, -122226, -103181, -288341, -350180, -411913, -251594, -90829, -112690, -122704, -223268, -262035, -177548, -92535, -50481, -156058, -154960, -35437, 1120, 40344, 109129, 31679, 3695, 74223, 136835, 89269, -54312, -145229, -67823, -1357, -50890, -132276, -267296, -216871, 49402, 91149, -101073, -174783, -196724, -65936, 51190, 49758, -9478, 101281, 251063, 64104, -22006, -83123, -193231, -206516, -133503, -81134, 30732, -52623, -137959, -226791, -95302, 5056, 85100, 130321, 45146, -26181, -46390, -24292, -38055, 69584, 96659, -36495]
7388c6495o5301K1893l5566o7247M8861K5600M1790J17372J4820l5892j15457
7377h5622J16808O616o4820K0444Q2354M7578n8993N9637K2795j86184n0411Q539
7365h1259n0394L2119k687j42884j55827P2323J65822J17601N9071M9297n581
7354E7601m732j02846K0810j25088K4876O0727j081J4357r371j49195P3757J37990
7342b195M7888r1102J6621P9208n6041k9183K3541j33295j6192J4310o6929Q5899
7330a27470P9898O5681J15304r3124m9597k1073L1186l9101P158J22362R660j51392
7318e0508k8334p1236o9245L3617J01636j7459j16470K3044K19652J0251q4070
7307d9122j1202N2133n748j5990j1869q6635L1575J50156J01106N6705J09574
$$ y = [-36495, -101796, -79903, -115469, -182716, -133855, -108255, -66465, 50907, 65727, 29835, -85622, 31186, 37802, -27018, -6574, 75780, 123358, 64365, 124002, 146797, -39387, -89798, -81259, -131653, -99534, -102221, -245105, -400932, -328609, -162787, -45186, 13885, 63182, 57601, 52869, -49977, -29167, -154255, -129379, -68652, -69733, -55376, -64747, -213942, -140185, -2195, 45693, -45409, -28788, 50420, -5621, -34804, -11263, -144558, -160750, -146440, -213369, -127470, -47572, 18109, 133413, 40289, -9308, -30381, 805, -38296, -31138, 91224, 100884, -50508, -78842, -150078, -219323, -185706, -84070, -101529, -217999, -194955, 24697, 34948, -49122, -60324, -8191, -13939, -29929, -41798, -128433, -96858, 53298, 154404, 211109, 320683]
7296C20683K7134L631j23699j71262r9978O8037N7276j4670P721p5385J6626K555
7284A8669n9702J38889Q738N417m267N4987O0440j27501o4056r3425P72m9406
7272a10445l4748K7407K6172J15683j74234L0126J41892o2904Q366J98599m2795
7261A23119o2525l6542r1837j97981L5804K16782O961K487L7304L8899o9524j13581
7249a10634P672J01843j6843J7177j0994j0142j09025N7490R7268n5234j35651
7238a67073k2817k9034R9848J52571p3282N5605Q6083r446j08774k5756J25073
7227H2998j25222j07553j5914m2215J29652K4673K2393l3435M2317q3009o0049
7216a65364J8585j7563k7967N4079R8029J08586j57619j18669K08761J51411k9608
$$ y = [320683, 347817, 351448, 227749, 56487, -43491, 24546, 81822, 67152, 74873, -512, 16114, 18669, -41033, 97856, 106594, 112011, 107744, 162731, 223171, 95670, 31614, -61811, -61039, -110445, -145193, -117786, -91614, 24069, -150165, -120039, 21853, -41051, -32685, 165914, 123119, 60594, 24052, -67785, -265766, -229962, -13180, -6219, -3732, 33572, 72471, 2947, -110634, -102962, -1119, -17962, -785, -11779, -21921, -130946, -73456, 23812, -31422, -167073, -189890, -218924, -119076, 33495, -39787, 15818, 101901, 92455, -16319, -42075, 82998, -42224, -149777, -165691, -207906, -78254, -53581, -31188, -64623, -22306, -105315, -165364, -146779, -164342, -192309, -138230, -40201, 68385, -89234, -207903, 858, 152269, 122661]
7205A22661j34779l6665K9456J52873Q211n8563k5629m3274j24265L0899j1945
7194i1020L7924k2461R200Q020o9900Q8207r525K4004q538k9349O9496K2994J15439
7181A44491R8393J19280o5325k41751P639p5506k6322R4128p3452j17218M5064
7170i0579K8119O1861O6029J0480o5418l0385J16981M7J5855q0737M342m4626
7158h031o9657q6713r888O18J5819J12485o5820r6919J36043Q072j13179N3717
7146a23453R3940Q0708k1252K416o6144J9109q5279l3946n97P9098J56667K0563
7134A21830M3030r9183q8330J23435M5357O616r8160j16500j9840J53263L1517
7123A03035J23148l3293m9964n845m8645l5005J46856p6527j07465o3046m6683
$$ y = [122661, -12118, -48783, -19327, 133546, 141757, 83194, 57565, 14291, -109974, -79075, -91020, -53096, -75557, -66357, -58337, -128237, -40030, -49555, -25551, -34089, -63438, 6058, 29052, 144491, 242884, 362164, 296839, 55088, 62727, -12779, -39101, 55027, -18425, -135643, -90579, -62460, -599, 65430, 75910, 10492, -19893, 97088, 97135, 112990, 32253, 36595, -8031, -77688, -164401, -174289, -173671, -157852, -45367, -111187, -208106, -72063, -63991, -177170, -123453, -29513, 51195, 29943, 32359, -33785, -14676, -99955, -133901, -134498, -55400, 101267, 121830, 164860, 65677, -22653, 100782, 146139, 152755, 54595, -61905, -81745, 71518, 103035, 226183, 192890, 142926, 137081, 88436, 53431, 200287, 123760, 16295, -46751, -93434]
7112i3434K1750J06715N7999p4870n1445J12278J55599o2396j05128r2265l7797
7101f2994Q4420l8547k9328j4696K4512q1385L4662J11095K29222n5007q9571
7090A12383J8270r0565j24278N6468j2533j22348L3779R0698Q326r3011k323R0769
7078c4365k8226n4188q225P9942P9783R2099k5745j48439j65497j1761J7439j9528
7066b26711J822j3881q1884P9915r721j19512N5682J32123j5394R107P7807k6208
7054a36855P750m0932R0690O7394K8278J8155j78043M763l093P5186J29158N7958
7042A20409l2003K9669M9547m7254k8771r6273K4219o9466Q086R1239l2533j439
7030A5430R0469k7768j70660j08166K05358M1768j7439o872l0895O0702k4346
$$ y = [-93434, -71684, 35031, 93030, 18160, -33285, 78993, 234592, 172196, 67068, -25197, -62994, 21426, -17121, -46449, -61145, -36633, -118018, -83356, 27739, 256961, 201954, 112383, 130653, 40088, -84190, -27722, -40255, -162603, -128824, -38126, -29800, -122811, -125134, -34365, -62591, -116779, -125004, -45062, 34721, 126820, 101075, -47364, -212861, -224622, -207183, -226711, -224889, -238770, -320654, -240739, -250460, -369972, -314290, -182167, -197561, -188454, -110647, -136855, -129105, -170037, -79347, -11953, 16325, 34480, -143563, -138800, -141893, -66707, 62451, 120409, 88406, 118075, 167622, 120368, 91597, -4676, 19543, -49923, -41837, 49402, 16869, 15430, 105899, 78131, -92529, -200695, 4663, 46431, 28992, 22120, -8775, 51927, 27581]
7019B7581j4551n1007l6850J327P467L7647K7252k0789J2910N2635q6880K1951
7007b1307k2035N353K7632j01624p7505k7140j8494R1719N4801J3142M2332P9579
6995D6453O7650O1669L778N1642j07946k00335K9069J05935k8156p8736j19899
6984a68876j0020O898J31354r0875r2789J73371J39965N4897O2497j61074p3641
6973b8293L8079j28463j35654m0729J7877P3828J41439r5719r3573P3481R4395
6962h3332P1571m3941K5659q6417n0382M1949K1152K3051Q1393M714O6043n1563
6950A9897n1268J5416O5829J7936L6981j37596R87m8957P3932j2652l7705N6783
6938d17K4802m1565J98526N208p8548j30745m4787J13637P1947N6577p9564j27682
$$ y = [27581, 13030, -37977, -74827, -73500, -66033, -28386, -1134, -21923, -9013, 43622, -43258, -21307, -43342, -37989, -10357, -111981, -189486, -216626, -235120, -143401, -88600, -75458, -33126, 46453, 114103, 175772, 179550, 231192, 123246, -77089, -48020, 57915, 29759, -48977, -168876, -178896, -171998, -40644, -131519, -224308, -50937, 89028, 143925, 206422, 45348, -28293, 9786, -118677, -254331, -295060, -277183, -203355, -61916, -157635, -251208, -177727, -83332, -11761, -55702, -30043, -116460, -166842, -124893, -103741, -80690, 703, 5417, 71460, 19897, -31371, -15955, 49874, 67810, 104791, -32805, -31818, -80775, -6843, -19495, -57200, -417, 24385, -17180, 181346, 186554, 108006, -22739, -67526, 46111, 118058, 174635, 95071, -32611]
6926c2611J3766J59937k9167m1373K9752K7371p6592N8071j8372j67171p7132
6915a53521N1340j6915j17217R3619K24027L2250o1969j4301Q1879J51227K5111
6904B95530j4016j93627q4265j08321M2890J43939j5388L4900P1674k0580j1327
6893A41409J8734p5382m0062J211r5476K98L9989J23503p6709j01825o1826j43465
6881b69601Q622J14855R9972k6698M870m1603L8025m0755O1214R933o2860o4709
6869a68735n0854k402O8269J94116M1254K0597p1364K6054M2276M6167M5047m784
6857A85641l165n9974p6996k3859k7000q2518M2393L6560j7454l6785J0225J1197
6845d1735p0216n1335n1082J6121K0744K20381K17747Q0041r2410j10326j3440
$$ y = [-32611, -18845, 141092, 111925, 70552, 100304, 127675, 51083, 109154, 90782, -76389, -153521, -102181, -119096, -236313, -142694, 81333, 113583, 51614, 37313, 119192, 270419, 295530, 281514, 87887, 3622, -104699, -61809, 82130, 66742, 101642, 173316, 152736, 141409, 160143, 84761, 44699, 45910, -49566, -49268, -9279, 114224, 37515, -64310, -126136, -269601, -260979, -146124, -46152, -72850, -67980, -109583, -71558, -112313, -51099, -41166, -104026, -168735, -219589, -221991, -153722, 40394, 81648, 102245, 30881, 56935, 99211, 145378, 190425, 185641, 182476, 122502, 45506, 21647, -5353, -87871, -45478, -8918, -26372, -63157, -52932, -41735, -111951, -163286, -214368, -198247, -177503, 42878, 260625, 340666, 248256, 137930, 124490]
6834A24490q8332j60552j5618M4067Q5499P6551k1617k08524k0286K0433J94294
6823C0405J95054l6020o3271j0652n7526O362N7260j22092k7849J4243m835r9152
6811a18073O758r3045P9858R2438q3771M7405L2285J9207M9666K0592J48484m194
6799A97610r9755j36969j98846n7877J06426O8068N5528N8503Q1210l9126N1988
6788H6760J07263Q797m1326m4511j11321q7395L1731K6939P289k3694P0430n2243
6776b1281o109l266j44342j06549j01498Q8612J38066Q8625j7787O9126O2397
6765D5994p4983N3537k1558q2856o6103R7888M3401j9316o5599j27327N9296R0175
6753f7451J87627O6519J1532o9078k9830o479r5825r3739J75827J21837J3180
$$ y = [124490, 36158, -124394, -140012, -95945, -10446, 66105, 44488, -164036, -184322, -163889, 30405, 225459, 189439, 126168, 115516, 57990, 64352, 121612, -480, -28329, -14086, -18921, -118073, -111315, -204360, -124502, -32064, -115835, -68430, -36145, -16938, 32728, 53320, 201804, 197610, 97855, -39114, -237960, -295837, -189411, -121343, -65815, -7312, 73898, 34772, 86760, 194023, 202820, 161494, 116983, 5662, -81733, -50002, -23063, -15774, -39468, 30962, -21281, -27390, -30656, -174998, -281547, -383045, -294433, -156367, -67742, -85529, -16403, 45994, -28989, 24548, 2990, -79866, -145969, -48081, -4680, -23996, -89595, -216922, -157626, -67451, 120176, 186695, 198227, 129149, 99319, 92840, -2985, -96724, 79103, 200940, 214120]
6742B14120J4494p1685O1229m821m0578j77195j10240p8830n2559J68431J3931
6731f3703o9936O2200J17720N7872j66500l6902j9790j1672P2555k3422l4958
6720a16536O9240P2615j26010k4564O4589J8357k2971L4832n6168O1077r043L6118
6708A536m9335R3242N85l9683k258j7125n656N1604j20133P6723R9079R2975R0988
6695B72542J3208j46635o3124K7018K4958L7482P784N6622m4554p3106j39091
6684b6896O635K05749k6072k3083L2526L305M6909j80049j4296L9859J18658J33479
6672C16724P2949n3224j56879j35943J41380p3145k8222p2492l8576R8606J55627
6661B26805M2665j14593j05721q9586J46p613O6267M4918j6005M6470K6355p3333
$$ y = [214120, 228614, 156929, 218158, 213337, 172759, -4436, -114676, -193506, -246065, -77634, -63703, -133639, -71439, 46281, 104153, -62347, -99249, -119039, -130711, -58156, -81578, -116536, -47296, 25319, -100691, -125255, -60666, -42309, -65280, -30448, -86616, -25539, -34582, 1536, -47799, 45443, 46028, 6345, 4087, -13038, -18694, 32910, -87223, -10500, 88579, 181554, 272542, 285750, 139115, 75991, 103009, 127967, 165449, 173233, 229855, 185301, 112195, -26896, -20261, 185488, 159416, 136333, 168859, 172164, 219073, 39024, 24728, 64587, 183245, 316724, 389673, 336449, 179570, 43627, 185007, 111862, 83640, 11148, -27428, 71178, 226805, 269470, 154877, 49156, -40430, -40284, -47897, 18370, 63288, 47283, 93753, 120108, 46775]
6649D6775J5438K331N0304n4753o9850J12156r6835j12007K130K7561K6127N9111
6637H488J08396j29110j01511j72072J7398R6423R9190N8655L1349R4834j10621
6626A419n830P2022M4106o5427q166k364L2926j75583J32717K72695r3325j80950
6614B4240L6337l3970j55514L5435J20094p69k8693O032L0957n8981K552p7949
6602a00229K3744M9406O1938K7350P2582O5509L8802n4708r3665j33210l2240
6591g4721J7336M930R7188o5418l0323J3608J11271J24862k8894o643j0348L2249
6579A85097q392p0708j05202l2766K5058N0268o3065j37082J51114J28389k25364
6568a02653j95208O7565M6002J60129P0474J12078K2485p5448p4243R079R3160
$$ y = [46775, 62213, 64544, 114848, 60095, -9755, 102401, 5566, -106441, -104311, -76750, -50623, 8488, 116884, -12226, -113737, -285809, -268411, -171988, -72798, -14143, 17206, 112040, 1419, -4411, 67611, 111717, 46290, 38124, 35760, 68686, -106897, 25820, 298515, 205190, 24240, 60577, 26607, -128907, -93472, 26622, 25853, -2840, 3192, 34149, -24832, -22280, -100229, -76485, -27079, 34859, 62209, 134791, 200300, 239102, 184394, 90729, -42481, -74721, -57385, -52455, 44733, -20685, -51008, -37400, 73871, 198733, 169839, 163196, 152848, 185097, 176705, 105997, 795, -31971, -6913, 43355, -19710, -156792, -5678, 122711, -102653, -297861, -230296, -184294, -24165, 46309, 158387, 180872, 105424, 31181, 40260, 133420]
6557A33420o345j21498l4734j12939J22186N8076j39758K1217K04328J926p3420
6546E2459r2824n4329K523O952L6367Q8072J63680l1277l2466N7456K9842k9334
6534A97121r5239j03228R0674K1628j1169p0459j00388n002o3115N0642J19447
$$ y = [133420, 127075, 5577, -29157, -142096, -19910, 38166, -101592, -80375, 123953, 125879, 52459, -40365, -94694, -92171, -85219, -48852, 39220, 202900, 171623, 139157, 196613, 226455, 197121, 101882, -1346, 89328, 110956, 99787, 29328, -71060, -76062, -139177, -88535, 30912]
$$ [...]
##END NTUPLES=NMR SPECTRUM
##END=
