##TITLE=Analysis number 327827
Compound Code sb 00590
Book Reference 144682
Project Code adrs flro3
Chemist Name jom
##JCAMPDX= 6.0         $$ Bruker NMR JCAMP-DX V2.0
##DATA TYPE= NMR SPECTRUM
##DATA CLASS= NTUPLES
##ORIGIN= Bruker BioSpin GmbH
##OWNER= nmr
$$ XWIN-NMR		Version 3.5
$$ Wed Apr 11 16:29:14 2007 GMT Daylight Time (UT+1h)  MAYBRIDGE\nmr@NMR_250MHZ
##.OBSERVE FREQUENCY= 250.131544655141
##.OBSERVE NUCLEUS= ^1H
##.ACQUISITION MODE= SIMULTANEOUS (DQD)
##.ACQUISITION SCHEME= undefined
##.AVERAGES= 16
##.DIGITISER RES= 18
##SPECTROMETER/DATA SYSTEM= dpx250
##.PULSE SEQUENCE= zg30
##.SOLVENT NAME= CDCl3
##.SHIFT REFERENCE= (INTERNAL, CDCl3, 0, 16.522)
##AUDIT TRAIL= $$ (NUMBER, WHEN, WHO, WHERE, WHAT)
$$ ##TITLE= Audit trail, XWIN-NMR		Version 3.5
$$ ##JCAMPDX= 5.01
$$ ##ORIGIN= Bruker BioSpin GmbH
$$ ##OWNER= nmr
$$ C:\u/data/dgb/nmr/ADRS/1040/pdata/1/auditp.txt
$$ ##AUDIT TRAIL=  $$ (NUMBER, WHEN, WHO, WHERE, WHAT)
(   1,<2007-04-11 16:28:49.80 +100>,<MAYBRIDGE\nmr>,<NMR_250MHZ>,
      <created by zg, POWCHK disabled, PULCHK disabled
       configuration hash MD5:
       49 4B E0 1D 92 C2 6B 37 9F E6 65 BC 52 41 86 1D
       data hash MD5: 64K
       B8 72 03 2B FD 84 9E F8 5D 4A 06 67 54 99 C4 75>)
(   2,<2007-04-11 16:29:04.35 +100>,<MAYBRIDGE\nmr>,<NMR_250MHZ>,
      <Start of raw data processing
       ef LB = 0.3 FT_mod = 6 PKNL = 1 SI = 32K 
       data hash MD5: 32K
       CA 7B E3 27 05 A0 C7 A0 CA 64 3D BA 35 02 60 39>)
(   3,<2007-04-11 16:29:06.19 +100>,<MAYBRIDGE\nmr>,<NMR_250MHZ>,
      <apk 
       data hash MD5: 32K
       F8 3A BE 24 3A D6 71 E5 BF EA 76 E4 7D 8B ED 49>)
(   4,<2007-04-11 16:29:07.11 +100>,<MAYBRIDGE\nmr>,<NMR_250MHZ>,
      <abs ABSG = 5 
       data hash MD5: 32K
       10 06 4A 37 BD 73 D8 3D AA C4 37 06 7B 12 24 1C>)
$$ ##END=
$$ 
$$ hash MD5
$$ 5B 07 E8 0A EE BC DD 3A 37 14 1A 3A 13 92 71 83
##$RELAX= 
##$RELAX= 
##$RELAX= 
##$RELAX= 
##$RELAX= 
##$RELAX= 
##$RELAX= 
$$ Bruker specific parameters
$$ --------------------------
##$DU= <C:\u>
##$EXPNO= 1040
##$NAME= <ADRS>
##$PROCNO= 1
##$TYPE= <nmr>
##$USER= <dgb>
##$AMP= (0..31)
100 100 100 100 100 100 100 100 100 100 100 100 100 100 100 100 100 100 
100 100 100 100 100 100 100 100 100 100 100 100 100 100 
##$AQSEQ= 0
##$AQ_mod= 3
##$AUNM= <au_zg>
##$AUTOPOS= <44 >
##$BF1= 250.13
##$BF2= 250.13
##$BF3= 250.13
##$BF4= 250.13
##$BF5= 500.13
##$BF6= 500.13
##$BF7= 500.13
##$BF8= 500.13
##$BYTORDA= 1
##$CFDGTYP= 0
##$CFRGTYP= 5
##$CHEMSTR= <none>
##$CNST= (0..31)
1 1 145 1 1 1 1 1 1 1 1 1 1 1 1 1 1 1 1 1 1 1 1 1 1 1 1 1 1 1 1 1 
##$CPDPRG= <>
##$CPDPRG1= <>
##$CPDPRG2= <>
##$CPDPRG3= <>
##$CPDPRG4= <mlev>
##$CPDPRG5= <mlev>
##$CPDPRG6= <mlev>
##$CPDPRG7= <mlev>
##$CPDPRG8= <mlev>
##$CPDPRGB= <>
##$CPDPRGT= <>
##$D= (0..31)
0 1 0 0 0 0 0 0 0 0.06 0 0 0 0 0 0 0.0002 0 0 0 0 0 0 0 0 0 0 0 0 0 0 
0 
##$DATE= 1176305328
##$DBL= (0..7)
120 120 120 120 120 120 120 120 
##$DBP= (0..7)
150 150 150 150 150 150 150 150 
##$DBP07= 0
##$DBPNAM0= <>
##$DBPNAM1= <>
$$ [...]
##$SUBNAM7= <"">
##$SUBNAM8= <"">
##$SUBNAM9= <"">
##$SW= 20.6930455092707
##$SWIBOX= (0..15)
0 0 3 0 0 0 0 0 0 0 0 0 0 0 0 0 
##$SW_h= 5175.983436853
##$TD= 65536
##$TD0= 1
##$TE= 683.16
##$TE2= 300
##$TE3= 300
##$TEG= 300
##$TL= (0..7)
0 120 120 120 120 120 120 120 
##$TP= (0..7)
150 150 150 150 150 150 150 150 
##$TP07= 0
##$TPNAME0= <>
##$TPNAME1= <>
##$TPNAME2= <>
##$TPNAME3= <>
##$TPNAME4= <>
##$TPNAME5= <>
##$TPNAME6= <>
##$TPNAME7= <>
##$TPOAL= (0..7)
0.5 0.5 0.5 0.5 0.5 0.5 0.5 0.5 
##$TPOFFS= (0..7)
0 0 0 0 0 0 0 0 
##$TUNHIN= 0
##$TUNHOUT= 0
##$TUNXOUT= 0
##$USERA1= <user>
##$USERA2= <user>
##$USERA3= <user>
##$USERA4= <user>
##$USERA5= <user>
##$V9= 5
##$VALIST= <valist>
##$VCLIST= <CCCCCCCCCCCCCCC>
##$VD= 0
##$VDLIST= <DDDDDDDDDDDDDDD>
##$VPLIST= <PPPPPPPPPPPPPPP>
##$VTLIST= <TTTTTTTTTTTTTTT>
##$WBST= 1024
##$WBSW= 4
##$XGAIN= (0..3)
0 0 0 0 
##$XL= 0
##$YL= 0
##$YMAX_a= 402700
##$YMIN_a= -490788
##$ZGOPTNS= <>
##$ZL1= 120
##$ZL2= 120
##$ZL3= 120
##$ZL4= 120
##$ABSF1= 16.522
##$ABSF2= -4.171173
##$ABSG= 5
##$ABSL= 3
##$ALPHA= 0
##$AQORDER= 0
##$ASSFAC= 0
##$ASSFACI= 0
##$ASSFACX= 0
##$ASSWID= 0
##$AUNMP= <proc_1d>
##$AZFE= 0.1
##$AZFW= 0.1
##$BCFW= 0
##$BC_mod= 0
##$BYTORDP= 0
##$COROFFS= 0
##$CY= 12.5
##$DATMOD= 1
##$DC= 0
##$DFILT= <>
##$DTYPP= 0
##$F1P= 14.0000005364418
##$F2P= -0.99999901652339
##$FCOR= 0.5
##$FTSIZE= 32768
##$FT_mod= 6
##$GAMMA= 0
##$GB= 0
##$INTBC= 1
##$INTSCL= 1
##$ISEN= 128
##$LB= 0.3
##$LEV0= 0
##$LPBIN= 0
##$MAXI= 10000
##$MC2= 0
##$MEAN= 0
##$ME_mod= 0
##$MI= 0
##$NCOEF= 0
##$NC_proc= -5
##$NLEV= 6
##$NOISF1= 0
##$NOISF2= 0
##$NSP= 0
##$NTH_PI= 0
##$NZP= 0
##$OFFSET= 16.522
##$PC= 1
##$PHC0= 225.5213
##$PHC1= 15.2004
##$PH_mod= 1
##$PKNL= yes
##$PPARMOD= 0
##$PSCAL= 4
##$PSIGN= 0
##$REVERSE= no
##$SF= 250.13
##$SI= 32768
##$SIGF1= 0
##$SIGF2= 0
##$SINO= 400
##$SIOLD= 32768
##$SREGLST= <1H.CDCl3>
##$SSB= 0
##$STSI= 32768
##$STSR= 0
##$SW_p= 5175.98343685301
##$SYMM= 0
##$S_DEV= 0
##$TDeff= 65536
##$TDoff= 0
##$TI= <Analysis number 999999
Compound Code 99
Book Reference 9
Project Code 9>
##$TILT= no
##$TM1= 0
##$TM2= 0
##$TOPLEV= 0
##$USERP1= <user>
##$USERP2= <user>
##$USERP3= <user>
##$USERP4= <user>
##$USERP5= <user>
##$WDW= 1
##$XDIM= 32768
##$YMAX_p= 531860416
##$YMIN_p= -306689
$$ End of Bruker specific parameters
$$ ---------------------------------
##NTUPLES= NMR SPECTRUM
##VAR_NAME=  FREQUENCY,     SPECTRUM/REAL,   SPECTRUM/IMAG
##SYMBOL=    X,             R,               I
##VAR_TYPE=  INDEPENDENT,   DEPENDENT,       DEPENDENT
##VAR_FORM=  AFFN,          ASDF,            ASDF
##VAR_DIM=   32768,         32768,           32768
##UNITS=     HZ,            ARBITRARY UNITS, ARBITRARY UNITS
##FACTOR=    0.157963299565203, 1,           1
##FIRST=     4132.6476996994, 0,             0
##LAST=      -1043.33573715361, 0,           0
##MIN=       -1043.33573715361, -306689,     0
##MAX=       4132.6476996994, 531860416,     0
$$ Real data points
##PAGE= N=1
##DATA TABLE= (X++(R..R)), XYDATA
$$ [...]
$$ plain form
22375 -82625 -96686 -32444 -18065 -33440 -24385 -58272 -141466 -124036 -117698 -98920 -114942 -110784
22363 -110784 -85189 23194 69917 14863 -21021 -58993 -87808 -61272 -9880 46364 -18027
22352 -18027 -27559 -29545 -5993 16722 8789 -15059 -8461 -26374 -33960 -64265 -73543 -98474 -101641
22339 -101641 -44630 68828 166355 163465 87817 58076 52421 -22886 -64417 -9003 70479 65608
22327 65608 3766 2814 42676 49979 -41194 -70648 -17023 56472 70589 91143 28853 -15207
22315 -15207 -23190 -23940 -30945 -9107 -14384 -26519 -11135 84164 111832 95379 64609 41433 53173
22302 53173 23534 -18465 12753 17132 -32186 -49025 -81734 -108750 -42182 -26953 -67542 -57175
22290 -57175 -68121 -26768 2658 79996 129350 172672 109179 77813 25276 -26838 -5946 -60159
$$ packed form
22375h2625j4061O4242J4379j5375R055l3887q3194J7430O338J8778j6022M158
22363a10784K5595J08383M6723n5054l5884l7972k8815K6536N1392N6244o4391
22352a8027r532j986K3552K2715p933k3848O598j7913p586l0305r278k4931l167
22339a01641N7011J13458R7527k890p5648k9741n655p5307m1531N5414P9482m871
22327F5608o1842r52L9862P303r1173k9454N3625P3495J4117K0554o2290m4060
22315a5207p983p50p005K1838n277j2135J5384R5299K7668j6453l0770k3176J1740
22302E3173k9639m1999L1218M379m9318j6839l2709k7016O6568J5229m0589J0367
22290e7175j0946M1353K9426P7338M9354M3322o3493l1366n2537n2114K0892n4213
$$ plain form
22278 -60159 -116462 -61605 -64996 -111130 -129259 -46942 -9521 25875 -3307 23371 12718 31269
22266 31269 50753 138135 162261 108132 56816 -20541 583 -24936 -64351 -110152 -47331 46103
22254 46103 40920 52859 121247 71828 -21293 37593 51811 5300 34287 89622 6116 -31210
22242 -31210 -14243 61956 95075 -39285 -103597 -92956 -53676 8159 27098 52756 91925
22231 91925 -6630 -102520 -46840 -21588 5082 49443 80993 72741 -66366 -106846 -78854 -68137
22219 -68137 -84774 -150977 -77926 13960 26335 25833 -50934 -74492 -109816 -59888 -62767 -54696
22207 -54696 54859 140606 146396 126378 46935 13060 -4937 -64801 7335 83188 42755 1447
22195 1447 46644 81184 27295 -8138 -54092 -3346 2739 -22370 -70416 -115498 -68125 -73543
$$ packed form
22278f0159n6303N4857l391m6134j8129Q2317L7421L5396k9182K6678j0653J8551
22266C1269J9484Q7382K4126n4129n1316p7357K1124k5519l9415m5801O2821R3434
22254D6103n183J1939O8388m9419r3121N8886J4218m6511K8987N5335q3506l7326
22242c1210J6967P6199L3119j34360o4312J0641L9280O1835J8939K5658L9169
22231I1925r8555r5890N5680K5252K6670M4361L1550q252j39107m0480K7992J0717
22219f8137j6637o6203P3051R1886J2375n02p6767k3558l5324M9928k879Q071
22207e4696J09555Q5747N790k0018p9443l3875j7997n9864P2136P5853m0433m1308
22195A447M5197L4540n3889l5433m5954N0746O085k5109m8046m5082M7373n418
$$ plain form
22183 -73543 -32277 -22634 -8853 17285 48372 -34056 -87105 -12001 38701 66722 75376 -40840
22171 -40840 -71613 28554 42732 10572 35937 18372 -7715 41594 32491 32472 73786 72169
22159 72169 80736 39243 -40415 -59518 -7073 95500 102531 -5627 -6605 37508 24118 37708
22147 37708 33530 -45355 -144299 -78778 36158 56827 -85631 -132762 -75463 25505 -10666
22136 -10666 -88101 -100943 -118364 -75064 -69698 -110576 -103191 -81809 -103127 -117369 -133122 -95439
22124 -95439 -86130 -53766 -19623 42232 -23361 -14473 -26744 -11078 24992 36800 -18835 -36918
22112 -36918 -309 19150 25851 -14609 -56806 -62085 -75496 -14146 -15200 -34797 -6049 -7906
22100 -7906 -71346 -98289 -109399 -67445 -86470 -151139 -146237 -163996 -132848 -108926 -77058 -54100
$$ packed form
22183g3543M1266R643J3781K6138L1087q2428n3049P5104N0702K8021Q654j16216
22171d0840l0773J00167J4178l2160K5365j7565k6087M9309r103j9M1314j617
22159G2169Q567m1493p9658j9103N2445J02573P031j08158r78M4113j3390J3590
22147C7708m178p8885r8944O5521J14936K0669j42458m7131N7299J00968l6171
22136a0666p7435j2842j7421M3300N366m0878P385K1382k1318j4242j5753L7683
22124i5439R309L2364L4143O1855o5593Q888j2271J5666L6070J1808n5635j8083
22112c6918L6609J9459O701m0460m2197n279j3411O1350j054j9597K8748j857
22100g906o3440k6943j1110M1954j9025o4669M902j7759L1148K3922L1868K2958
$$ plain form
22088 -54100 383 52535 67558 119193 80116 25401 -71566 -79624 -1606 -33555 -78242 -25407
22076 -25407 -85143 -73400 -37666 -9623 12902 49731 48379 72342 37549 4562 -12706 -68674
22064 -68674 -86343 -72534 -7764 -3374 -59452 -103842 -90530 -96977 -68586 -90402 -74371 -2276
22052 -2276 25833 47723 29179 32053 53346 -37526 -74529 -39702 -18196 6482 -1110 66978
22040 66978 114449 86566 87400 84039 72927 36163 -8954 -109455 -190801 -157693 -110914 -143545
22028 -143545 -144506 -115827 -98862 -56640 -15157 -3973 -60168 -151691 -172320 -104051 -88258 -2920
22016 -2920 5608 36334 64062 55344 47421 48249 36425 61338 25389 -3783 21422 2069 46826
22003 46826 6766 -4101 -19545 -43070 -78658 -70935 7760 72034 61054 12581 -22116 -117979
$$ packed form
22088e4100N4483N2152J5023N1635l9077n4715r6967q058P8018l1949m4687N2835
22076b5407n9736J1743L5734K8043K2525L6829j352K3963l4793l2987j7268n5968
22064f8674j7669J3809O4770M390n6078m4390J3312o447K8391k1816J6031P2095
22052b276K8109K1890j8544K874K1293r0872l7003L4827K1506K4678p592O8088
22040F6978M7471k7883Q34l361j1112l6764m5117j00501q1346L3108M6779l2631
22028a43545r61K8679J6965M2222M1483J1184n6195r1523k0629O8269J5793Q5338
22016b920Q528L0726K7728q718p923Q28j1824K4913l5949k9172K5205j9353M4757
22003D6826m0060j0867j5444k3525l5588P723P8695O4274j0980m8473l4697r5863
$$ plain form
21991 -117979 -207072 -191603 -168123 -106427 -55292 -83433 -31979 23672 -1174 36094 29390 -2720
21979 -2720 -65275 -24702 39638 59055 54882 16023 -12480 20737 -28783 31086 72857 45697
21967 45697 -5403 -11197 1869 20995 -48255 -41129 8993 55074 38707 19345 20315 46222
21955 46222 49095 13346 82568 -8330 -51959 -23828 1939 70135 85680 22260 -51721 -93546
21943 -93546 -77486 -86713 -31088 -49759 13334 27654 14226 -36478 -99362 -108568 -79606 -52904
21931 -52904 -115452 -135784 -42599 11293 33968 23348 -1940 -74000 -93731 -92514 -47194 -48786
21919 -48786 -56429 -27097 26089 24248 -67490 -37667 60962 64913 86552 141150 108680 66257
21907 66257 -10076 13220 13527 -13314 -8038 -49418 -45243 -24701 -7637 5221 36761 31630 35691
$$ packed form
21991a17979q9093J5469K3480O1696N1135k8141N1454N5651k4846L7268o704l2110
21979b720o2555M0573O4340J9417m173l8859k8503L3217m9520N9869M1771k7160
21967D5697n1100n794J3066J9126o9250P126N0122M6081j6367j9362R70K5907
21955D6222K873l5749O9222r0898m3629K8131K5767O8196J5545o3420p3981m1825
21943i3546J6060r227N5625j8671O3093J4320j3428n0704o2884r206K8962K6702
21931e2904o2548k0332R3185N3892K2675j0620k5288p2060j9731J217M5320j592
21919d8786p643K9332N3186j841r1738K9823R8629L951K1639N4598l2470m2423
21907F6257p6333K3296L07k6841N276m1380M175K0542J7064J2858L1540n131M061
$$ plain form
21894 35691 26266 -74824 -99393 -147060 -159142 -106527 -97095 -49549 59785 42212 -28192 -91784
21882 -91784 -20284 47715 37476 29421 41326 90395 65049 54004 695 -7058 -16923 -13700
21870 -13700 -60527 -569 5054 19812 12313 15213 -51880 -49847 -33780 -27850 26899 52349 -7507
21857 -7507 -20361 -45735 -54864 -94960 -128368 -98510 -60137 -54672 8085 4390 -1757 15227 -24419
21844 -24419 -69783 -74846 -47851 -25312 -25975 -39015 -74494 -53828 -10861 -100378 -94982 -22976
21832 -22976 -71970 -66142 -64122 -41186 10665 79352 77956 -398 -29002 -12201 -58776 -17311
21820 -17311 -33251 -22058 59839 137900 158490 83302 -15228 2612 53025 16493 -22220 23119
21808 23119 -48684 -109161 -73304 6569 -37604 -76037 -58095 -23095 3398 34164 15217 44921
$$ packed form
21894C5691r425j01090k4569m7667j2082N2615R432M7546J09334j7573p0404o3592
21882i1784P1500O7999j0239q055J1905M9069k5346j1045n3309p753r865L223
21870a3700m6827N9958N623J4758p499K900o7093K033J6067N930N4749K5450n9856
21857g507j2854k5374r129m0096l3408K9858L8373N465O2757l695o147J6984l9646
21844b4419m5364n063K6995K2539o63j3040l5479K0666M2967q9517N396P2006
21832b2976m8994N828K020K2936N1851O8687j396p8354k8604J6801m6575M1465
21820a7311j5940J1193Q1897P8061K0590p5188r8530J7840N0413l6532l8713M5339
21808B3119p1803o0477L5857P9873m4173l8433J7942L5000K6493L0766j8947K9704
$$ plain form
21796 44921 36325 12927 32780 35042 28640 -48578 -138833 -70707 -12424 -25421 -26387 22571 1366
21783 1366 9188 -53193 -100056 -109990 -50375 -59545 -84352 -13265 51429 10519 -58569 -100960
21771 -100960 -163395 -181940 -98981 -159216 -105995 18738 -12814 -53513 -77272 -106389 -121446
21760 -121446 -125928 -88368 -38614 21635 12965 -48459 -38916 3440 -25801 30120 13930 -104325
21748 -104325 -96075 -4804 57109 20919 17557 16106 26750 4881 -73576 -61945 -71249 -138964
21736 -138964 -136301 -73602 -98915 -83380 -48236 -22926 38335 13666 -5702 -7970 -33746 -26681
21724 -26681 -13099 -90365 -82045 -75993 -134187 -78444 16611 42633 8128 -31194 -23173 -78460
21712 -78460 -68875 -54248 -54879 -12705 -49002 -70886 -32660 -54816 -39881 -11527 -21614 5700
$$ packed form
21796D4921q596k3398J9853K262o402p7218r0255O8126N8283j2997r66M8958k1205
21783A366P822o2381m6863r934N9615r170k4807P1087O4694m0910o9088m2391
21771a00960o2435j8545Q2959o0235N3221J24733l1552m0699k3759k9117j5057
21760a21446m482L7560M9754O0249q670o1424R543M2356k9241N5921j6190j18255
21748a04325Q250R1271O1913l6190l362j451J0644k1869p8457J1631r304o7715
21736a38964K663O2699k5313J5535L5144K5310O1261k4669j9368k268k5776P065
21724b6681J3582p7266Q320O052n8194N5743R5055K6022l4505l9322Q021n5287
21712g8460R585J4627o31M2174l6297k1884L8226k2156J4935K8354j0087K7314
$$ plain form
21700 5700 70737 25891 56176 79496 34073 -38654 -85153 -64122 -23157 -52667 -2043 16164
21688 16164 42616 -30314 -62563 -53985 -102217 -141447 -116758 -102610 -61342 1406 81769 71038
21676 71038 -23546 -30983 3907 -900 -28666 -22514 -10297 -64018 -24040 -2675 984 11095
21664 11095 -67487 -140585 -138939 -153704 -100437 -42456 -22263 -37653 -144671 -158451 -118478 -101937
21652 -101937 -11460 34849 -14538 -99967 -106202 -101535 -68586 -109396 -46708 -20896 18104 25171
21640 25171 52547 1521 -107538 -63203 -43251 -112851 -75156 943 50986 -29016 -117362
21629 -117362 -52192 13600 58425 70254 -44089 -7137 43781 -4993 57094 91406 74959
21618 74959 61562 90844 55342 19349 -18230 -52034 -61408 -30247 -55556 -8829 -5896 30270
$$ packed form
21700E700O5037m4846L0285K3320m5423p2727m6499K1031M0965k9510N0624J8207
21688A6164K6452p2930l2249Q578m8232l9230K4689J4148M1268O2748Q0363j0731
21676G1038r4584p437L4890m807k7766O152J2217n3721L9978K1365L659J0111
21664A1095p8582p3098J646j4765N3267N7981K0193j5390j07018j3780L9973J6541
21652a01937R0477M6309m9387q5429o235M667L2949m0810O2688K5812L9000P067
21640B5171K7376n1026j09059M4335J9952o9600L7695P6099N0043q0002q8346
21629a17362O5170O5792M4825J1829j14343L6952N0918m8774O2087L4312j6447
21618G4959j3397K9282l5502l5993l7579l3804r374L1161k5309M6727K933L6166
$$ plain form
21606 30270 48295 13054 -68155 -76588 -20621 -15109 -37217 8794 4220 -17032 6828 24015
21594 24015 17287 -8867 21433 48004 69583 45367 22299 27281 36820 36843 31019 -15251 -52975
21581 -52975 -124707 -136737 -46833 51082 43582 20012 15159 -28822 -105643 -53823 -8155 -16244
21569 -16244 10353 -17335 -1995 53955 36599 26148 16498 -17211 -27011 -50638 -60970 -62002
21557 -62002 -45441 -68160 -51371 -5262 7534 7457 7220 -27733 -36781 -67140 -81104 -45369 -111632
21544 -111632 -139522 -166678 -155714 -109121 -110126 -133371 -150235 -151880 -99790 -44026 -35537 -21436
21532 -21436 -56428 -59921 -42990 24085 46569 -9822 -44037 28610 24764 -103634 -117331 -139509
21520 -139509 -104319 -59986 -40855 51929 128952 142238 156082 131802 94172 61483 16053
$$ packed form
21606C0270J8025l5241q1209q433N5967N512k2108M6011m574k1252K3860J7187
21594B4015o728k6154L0300K6571K1579k4216k3068M982R539K3n824m6270l7724
21581e2975p1732j2030Q9904R7915p500k3570m853m3981p6821N1820M5668q089
21569a6244K6597k7688J5340N5950j7356j0451r650l3709r800k3627j0332j032
21557f2002J6561k2719J6789M6109J2796p7k37l4953r048l0359j3964L5735o6263
21544a11632k7890k7156J0964M6593j005k3245j6864j645N2090N5764Q489J4101
21532b1436l4992l493J6931O7075K2484n6391l4215P2647l846j28398j3697k2178
21520a39509L5190M4333J9131R2784P7023J3286J3844k4280l7630l2689m5430
$$ plain form
21509 16053 -37767 -43089 -44222 -1916 -29904 -16883 37039 -7001 -40670 -19508 5692 -9535
21497 -9535 -29119 -68243 -163449 -240049 -223559 -123842 -9247 8336 -21670 20009 47035 57400
21485 57400 62589 40802 37707 79006 105489 14921 14087 82934 154353 66564 53154 86717
21473 86717 117241 95191 8325 -69941 -54496 -37981 -78953 -48562 20243 -26316 -50066 -31513
21461 -31513 -67110 -83697 11467 150136 67741 37389 83222 114999 78779 54972 115482
21450 115482 182717 164312 46030 -10844 -79200 -46828 48535 88535 3197 2677 26633 87893
21438 87893 48486 11330 -46226 -109489 -27671 -16921 -62695 -14251 68893 69493 -807 10419
21426 10419 -55482 -121775 -120612 -76571 -51175 54521 61302 43178 24263 26642 44381 24941
$$ packed form
21509A6053n3820n322j133M2306k7988J3021N3922m4040l3669K1162K5200j5227
21497i535j9584l9124r5206p6600J6490R9717J14595J7583l0006M1679K7026J0365
21485E7400N189k1787l095M1299K6483r0568q34O8847P1419q7789j3410L3563
21473H6717L0524k2050q6866p8266J5445J6515m0972L0391O8805m6559k3750J8553
21461c1513l5597j6587R5164J38669q2395l0352M5833L1777l6220k3807O0510
21450A15482O7235j8405j18282n6874o8356L2372R5363M0000q5338n20K3956O1260
21438H7893l9407l7156n7556o3263Q1818J0750m5774M8444Q3144O00p0300J1226
21426A0419o5901o6293J163M4041K5396J05696O781j8124j8915K379J7739j9440
$$ plain form
21414 24941 -53564 -80506 -115089 -125545 -70057 -98855 -61845 -3115 -107066 -155668 -43580
21403 -43580 31248 61876 92024 30063 -12691 16112 -20511 -102613 -97899 -53232 13873 -44715
21391 -44715 19380 79426 62569 58404 82089 64618 30925 25598 -27239 -122981 -134368 -115492
21379 -115492 -43949 49724 61767 26535 43073 47833 11533 -29380 -38826 -1073 -38937 -87550
21367 -87550 -53547 -22601 -9270 -61982 -52084 -98309 -84692 -83610 -69102 1740 29231 43903
21355 43903 20120 7046 -7376 -89229 -44081 -23215 -99837 -136787 -43676 -43441 -109869 -127765
21343 -127765 -100498 -125091 -89058 -8955 -8805 5104 -30895 -18062 50520 5205 22296 11068
21331 11068 18388 80453 -19186 14593 79775 22771 -50975 -155977 -131651 -33818 -6532 69843
$$ packed form
21414B4941p8505k6942l4583j0456N5488k8798L7010N8730j03951m8602J12088
21403d3580P4828L0628L0148o1961m2754K8803l6623q2102M714M4667O7105n8588
21391d4715O4095O0046j6857m165K3685j7471l3693n327n2837r5742j1387J8876
21379a15492P1543R3673J2043l5232J6538M760l6300m0913r446L7753l7864m8613
21367h7550L4003L0946J3331n2712R898m6225J3617J082J4508P0842K7491J4672
21355D3903k3783j3074j4422q1853M5148K0866p6622l6950R3111K35o6428j7896
21343a27765K7267k4593L6033Q0103J50J3909l5999J2833O8582m5315J7091j1228
21331A1068P320O2065r9639L3779O5182n7004p3746j05002K4326R7833K7286P6375
$$ plain form
21319 69843 172139 209310 197010 168725 141909 81044 12832 38192 40341 -14325 -36013 -46702
21307 -46702 -72975 -69936 -55597 -29137 15346 55152 7390 7979 24756 23064 69698 83425
21295 83425 152280 158391 182923 208757 171286 69210 984 2627 38821 131483 106399 -8984
21283 -8984 -40066 -79207 -20155 7848 31001 24958 -2324 16656 -21568 -30375 57860 -33077
21271 -33077 -82466 -14465 -9931 -94068 -130117 -71529 -56679 -129612 -139083 -136121 -85702 -144625
21259 -144625 -111169 -73224 -98344 -104243 -118691 -78021 -7114 26800 27764 16722 15718 28289
21247 28289 29116 72600 13889 -43677 -109463 -152718 -177064 -120660 -53392 -90011 -75179 55902
21235 55902 115662 46415 42979 35861 -12929 -42911 -45431 19567 90545 56164 -9939 -29212
$$ packed form
21319F9843J02296L7171j2300k8285k6816o0865o8212K5360K149n4666k1688j0689
21307d6702k6273L039J4339K6460M4483L9806m7762N89J6777j692M6634J3727
21295H3425O8855O111K4532K5834l7471j02076o8226J643L6194R2662k5084j15383
21283h984l1082l9141N9052K8003K3153o043k7282J8980l8224q807Q8235r0937
21271c3077m9389O8001M534q4137l6049N8588J4850p2933r471K962N0419n8923
21259a44625L3456L7945k5120n899j4448M0670P0907L3914R64j1042j004J2571
21247B8289Q27M3484n8711n7566o5786m3255k4346N6404O7268l6619J4832J31081
21235E5902N9760o9247l436p118m8790k9982k520O4998P0978l4381o6103j9273
$$ plain form
21223 -29212 -57417 13395 70181 57878 55875 11547 -9357 -77743 -58830 -9295 -30824 -28232
21211 -28232 21839 31170 21977 11840 -32349 -117233 -114294 -20700 -28287 -7895 -39263 -73349
21199 -73349 -50236 24322 47220 20563 6656 11863 66024 28412 112506 144821 101488 10852
21187 10852 -29872 70824 191136 107575 47052 7724 -62741 -120352 -123204 -49325 -14173
21176 -14173 -28045 -18154 -12447 -22002 -65431 -41288 -550 -17082 -1863 74949 53994 -31919
21164 -31919 -54441 -30161 4254 12205 -39800 -2006 -49937 -93134 -77095 -122454 -184313 -179951
21152 -179951 -116144 -79858 26061 109177 118205 58890 -17718 -9278 -35786 6492 -29290 -60644
21140 -60644 -90207 -131415 -85624 -61323 -10542 10997 41531 81017 43822 -41617 -16941 27184
$$ packed form
21223b9212k8205P0812N6786j2303k003m4328k0904o8386J8913M9535k1529K592
21211b8232N0071R331r193j0137m4189q4884K939R3594p587K0392l1368l4086
21199g3349K3113P4558K2898k6657j3907N207N4161l7612Q4094L2315m3333r0636
21187A0852m0724J00696J20312q3561o0523l9328p0465n7611k852P3879L5152
21176a4173j3872R891N707r555m3429K4143M0738j6532J5219P6812k0955q5913
21164c1919k2522K4280L4415P951n2005L7794m7931m3197J6039m5359o1859M362
21152a79951O3807L6286J05919Q3116R028n9315p6608Q440k6508M2278l5782l1354
21140f0644k9563m1208M5791K4301N0781K1539L0534L9486l7195q5439K4676M4125
$$ plain form
21128 27184 15833 -6932 -36132 -103118 -125066 -122183 -176130 -162541 -51056 15654 -8292 -39875
21116 -39875 -53577 -26660 -39723 -36334 -48911 -83252 -84335 -17874 -30547 -33352 -33709 -20212 3576
21103 3576 38286 51926 5961 -60355 -51785 -16397 54443 63758 75541 137714 86440 16696
21091 16696 -55666 -81660 -86603 -18837 1850 -15551 -24562 809 47093 92208 120055 109931
21079 109931 95896 16290 -30352 -77499 -71281 34136 68217 72098 18630 60722 92658 99796
21067 99796 86339 57561 92316 76668 57524 72604 -201 -105165 -144233 -116266 -51569
21056 -51569 -25464 -47218 -70228 -61557 -13623 26910 -23442 -60700 -50310 -65046 -93241 -75913
21044 -75913 -84976 -55192 -74761 -88992 -8633 8184 -32320 -126688 -143754 -27327 28564 143555
$$ packed form
21128B7184j1351k2765k9200o6986k1948K883n3947J3589J11485O6710k3946l1583
21116c9875j3702K6917j3063L389j2577l4341j083O6461j2673k805l57J3497K3788
21103C576L4710J3640m5965o6316Q570L5388P0840R315J1783O2173n1274o9744
21091A6696p2362k5994m943O7766K0687j7401r011K5371M6284M5115K7847j0124
21079A09931j4035p9606m6642m7147O218J05417L4081L881n3468M2092L1936P138
21067I9796j3457k8778L4755j5648j9144J5080p2805j04964l9068K7967O4697
21056e1569K6105k1754k3010Q671M7934M0533n0352l7258J0390j4736k8195J7328
21044g5913r063K9784j9569j4231Q0359J6817m0504r4368j7066J16427N5891J14991
$$ plain form
21032 143555 122628 104777 126968 104898 104911 114931 67033 54506 82719 84440 116764 68984
21020 68984 -92947 -61506 -68223 -60386 -50555 -12928 42802 -3194 -50285 -29590 -24170 -34149
21008 -34149 -51929 -79674 -140375 -241811 -195658 -179707 -148333 -153360 -226200 -214094 -137760 -71074
20996 -71074 -64588 -157528 -133691 -100845 -128818 -126683 -82724 -41518 -46480 -80375 -60785 -95689
20984 -95689 -176853 -75179 -41700 -4735 -15593 -71460 -70705 -20514 15760 -24137 -14230 29669
20972 29669 26734 -204 -1725 -22603 53032 57407 12320 110 -72403 -53414 -78006 -87483
20960 -87483 -19545 23110 8633 31778 10924 -16030 -11466 73245 83121 81467 50350 19573
20948 19573 -2655 25650 54121 40305 20835 -98349 -60153 19651 -9816 -81243 -123709
$$ packed form
21032A43555k0927j7851K2191k2070J3J0020m7898j2527K8213J721L2324m7780
21020F8984j61931L1441o717P837R831L7627N5730m5996m7091K0695N420r979
21008c4149j7780k7745o0701j01436M6153J5951L1374n027p2840J2106P6334O6686
20996g1074O486r2940K3837L2846k7973K135M3959M1206m962l3895J9590l4904
20984i5689q1164J01674L3479L6965j0858n5867P55N0191L6274l9897R907M3899
20972B9669k935k6938j521k0878P5635M375m5087j2210p2513J8989k4592r477
20960h7483O7938M2655j4477K3145k0854k6954M564Q4711R876j654l1117l0777
20948A9573k2228K8305K8471j3816j9470j19184L8196P9804k9467p1427m2466
$$ plain form
20937 -123709 -79677 -30369 -85655 -77961 11345 19767 -100123 -135680 -95667 -50914 -23811 -60465
20925 -60465 -103868 -159899 -163892 -157204 -121087 -121298 -94287 -79225 33397 43855 54770 22440
20913 22440 -71059 -38967 -12492 -34321 -49206 -67252 -64615 -11301 -45427 -80120 -51167 -17371
20901 -17371 -7767 78665 186610 177992 86001 49876 29394 18645 -37410 -95443 -78708 -98901
20889 -98901 -35490 -113145 -138129 -90449 5935 9280 -37699 5648 98814 79090 74000 95547
20877 95547 49455 16946 -10788 -19175 12358 2862 -49306 -52508 -61045 -97928 -116903 -98227
20865 -98227 -43092 -17087 19270 -20931 -8330 -66514 -65187 -35005 -52023 -50324 -3053 2744
20853 2744 9653 22932 -2901 -44266 -14397 -5839 -63267 -41974 -88297 -119841 -142073 -162056
$$ packed form
20937a23709M4032M9308n5286P694Q9306Q422j19890l5557M0013M4753K7103l6654
20925f0465m3403n6031l993O688L6117k11K7011J5062J12622J0458J0915l2330
20913B2440r3499L2092K6475k1829j4885j8046K637N3314l4126l4693K8953L3796
20901a7371R604Q6432J07945q618r1991l6125k0482j0749n6055n8033J6735k0193
20889i8901O3411p7655k4984M7680R6384L345m6979M3347R3166j9724n090K1547
20877I5547m6092l2509k7734q387L1533r496n2168l202q537l6883j8975J8676
20865i8227N5135K6005L6357m0201J2601n8184J327L0182j7018J699M7271N797
20853B744O909J3279k5833m1365K9869Q558n7428K1293m6323l1544k2232j9983
$$ plain form
20841 -162056 -116338 -34571 -5103 18578 -43807 -123088 -152259 -189499 -162174 -133508 -81353
20830 -81353 -54651 -75278 -55015 -21261 -51486 -39350 -62299 -60402 1384 -5177 2809 -36473
20818 -36473 -12712 51969 87984 28018 -105170 -50005 20922 2482 -21032 -22254 -56674 -79063
20806 -79063 -72402 -21245 -33295 -8059 -71522 -90001 -65084 -15654 7873 37984 65733 23879
20794 23879 -23786 -40761 -75133 -80188 -73194 -83762 -87540 -68479 -94514 -166254 -174617 -102155
20782 -102155 -32604 20177 -43531 -68038 -60714 -6459 37828 -29600 -77138 -35534 39296 46493
20770 46493 33785 13585 -38181 -57093 -39074 -20569 39902 70830 87637 -2335 -66532 -18778
20758 -18778 98492 66625 -59546 -88086 -40560 -54491 -42836 19408 14115 -63355 -41482
$$ packed form
20841a62056M5718Q1767K9468K3681o2385p9281k9171l7240K7325K8666N2155
20830h1353K6702k0627K0263L3754l0225J2136k2949J897O1786o561P986l9282
20818c6473K3761O4681L6015n9966j33188N5165P0927j8440k3514j222l4420k2389
20806g9063O661N1157j2050K5236o3463j8479K4917M9430K3527L0111K7749m1854
20794B3879m7665j6975l4372n055O994j0568l778J9061k6035p1740q363P2462
20782a02155O9551N2781o3708k4507P324N4255M4287o7428m7538M1604P4830P197
20770D6493j2708k0200n1766j8912J8019J8505O0471L0928J6807q9972o4197M7754
20758a8778J17270l1867j26171k8540M7526j3931J1655O2244n293p7470K1873
$$ plain form
20747 -41482 -4653 4776 -14865 24524 -37689 -80902 -148121 -139358 -44919 -1521 36357 21947
20735 21947 -12562 -20239 -55205 -60138 -58019 -87524 -89253 -93683 -88534 -95840 -104059 -80708 -21268
20722 -21268 -60666 -109678 -89450 -74606 -442 -28124 -88095 -37822 -47573 -3590 -55448 -96530
20710 -96530 -130095 -69019 -31249 -81004 -91931 -119791 -40331 -23106 -29285 -22277 -141048 -172361
20698 -172361 -161393 -51906 -11436 33761 -12938 -66534 -51058 -120532 -84764 -27944 -56097
20687 -56097 -98910 -139513 -32140 -4799 20665 -22621 -109448 -158635 -122606 -154968 -169427
20676 -169427 -119552 -90730 -152444 -115517 -70207 -30436 4227 -4860 -13136 -23269 -51910 -106990
20664 -106990 -88915 -55626 -19778 -76686 -51350 -20045 -10348 -69158 -46795 14307 3042 -3556
$$ packed form
20747d1482L6829R429j9641L9389o2213m3213o7219Q763R4439M3398L7878j4410
20735B1947l4509p677l4966m933K119k9505j729m430N149p306q219K3351N9440
20722b1268l9398m9012K0228J4844P4164k7682n9971N0273r751M3983n1858m1082
20710i6530l3565O1076L7770m9755j0927k7860P9460J7225o179P008j18771l1313
20698a72361J0968J09487M0470M5197m6699n3596J5476o9474L5768N6820k8153
20687e6097m2813m0603J07373K7341K5464m3286q6827m9187L6029l2362j4459
20676a69427M9875K8822o1714L6927M5310L9771L4663r087q276j0133k8641n5080
20664a06990J8075L3289L5848n6908K5336L1305R697n8810K2363O1102j1265o598
$$ plain form
20652 -3556 -78557 -118315 16130 -111 -7676 -64946 -41521 -19182 -29216 -42305 13663 -5771
20640 -5771 -5436 -26039 -39252 82686 141029 87082 55502 29731 -2281 -15553 -30415 -27747
20628 -27747 -10058 -35729 -116657 -106868 -51561 6881 59792 67480 31486 -29863 -37768 -64096
20616 -64096 -73270 -147829 -139435 -109589 -14422 34458 -14288 -38654 -20116 -81602 -116433 -57311
20604 -57311 -103707 -122923 -91406 -53494 -22129 -14530 -83323 -82870 -39098 -49153 -56740 -32364
20592 -32364 -18775 -60605 -27464 -23274 3283 15082 38217 8240 100085 57180 -7135 -47872
20580 -47872 -19757 241 10943 54614 77718 61219 82509 98591 19752 -53491 -44719 -26108
20568 -26108 75008 114453 43925 -15443 30273 28401 51929 38077 36338 29908 -45858 -109621
$$ packed form
20652c556p5001l9758J34445j6241p565n7270K3425K2339j0034j3089N5968j9434
20640e771L35k0603j3213J21938N8343n3947l1580k5771l2012j3272j4862K668
20628b7747J7689k5671q0928R789N5307N8442N2911P688l5994o1349p905k6328
20616f4096r174p4559Q394K9846R5167M8880m8746k4366J8538o1486l4831N9122
20604e7311m6396j9216L1517L7912L1365P599o8793M53M3772j0055p587K4376
20592c2364J3589m1830L3141M190K6557J1799K3135k9977R1845m2905o4315m0737
20580d7872K8115J9998J0702M3671K3104j6499K1290J6082p8839p3243Q772J8611
20568b6108J01116L9445p0528n9368M5716j872K3528j3852j739o430p5766o3763
$$ plain form
20556 -109621 -124957 -89952 -55151 39500 4151 19630 1431 31713 83660 38820 5929
20545 5929 46376 81400 49342 51853 9307 -12939 711 -19951 -23176 -33046 -16488 -36132
20533 -36132 -58460 -44785 -44793 -30703 -40499 -41597 23160 100694 93749 64110 15346 -78725 -85325
20520 -85325 -131024 -21455 38860 21281 -11241 -18419 -13184 -61482 -70970 -103290 -171801 -220239
20508 -220239 -189825 -124549 -166533 -92366 15560 36470 81304 37204 52201 101314 114279
20497 114279 72187 -35785 -81497 -43035 -46240 -75089 -17380 -27905 -59400 -12730 29699
20486 29699 54351 -19031 -53183 -52241 -73761 -69270 -77833 -67715 -29268 -20077 -79697 -72649 -39777
20473 -39777 -147610 -87244 2963 62086 45465 21509 2727 35838 72892 29257 -22503
$$ packed form
20556a09621j5336L5005L4801R4651l5349J5479j8199L0282N1947m4840l2891
20545E929M0447L5024l2058K511m2546k2246J3650k0662l225r870J6558j9644
20533c6132k2328J3675qJ4090r796j098O4757P7534o945k9639m8764r4071o600
20520h5325m5699J09569O0315j7579l2522p178N235m8298r488l2320o8511m8438
20508b20239L0414O5276m1984P4167J07926K0910M4834m4100J4997M9113J2965
20497A14279m2092j07972m5712L8462l205k8849N7709j0525l1495M6670M2429
20486B9699K4652p3382l4152R42k1520M491q563J0118L8447R191n9620P048L2872
20473c9777j07833O0366R0207N9123j6621k3956j8782L3111L7054m3635n1760
$$ plain form
20462 -22503 873 -28785 -24987 38361 90553 27973 39315 114408 91220 97868 77186 -73169
20450 -73169 -161125 -104040 1140 35926 -62158 -53740 7549 16737 -23461 -6286 8161 1565
20438 1565 -21589 -40793 -6000 79033 -14315 -73940 -57803 -15446 30968 -9321 15275 36127
20426 36127 -75826 -147452 -160942 -145357 -132996 -159861 -167890 -144872 -95860 -125421 -150952 -100884
20414 -100884 -27485 -4945 44374 122108 116844 51455 2549 63955 110406 68191 46646 44038
20402 44038 34965 137439 194514 145852 67832 -37632 -118385 -87769 -102046 -33982 -42264 -97788
20390 -97788 -53072 -55647 -101215 -8189 -16180 -53653 -99647 -103233 -117779 -147604 -115809 -121267
20378 -121267 -196187 -158479 -217183 -250378 -216463 -167191 -73159 -94514 -79089 -42050 -63435
$$ packed form
20462b2503K3376k9658L798O3348N2192o2580J1342P5093k3188O648k0682j50355
20450g3169q7956N7085J05180L4786r8084Q418O1289R188m0198J7175J4447o596
20438A565k3154j9204L4793Q5033r3348n9625J6137M2357M6414m0289K4596K0852
20426C6127j11953p1626j3490J5585J2361k6865q029K3018M9012k9561k5531N0068
20414a00884P3399K2540M9319P7734n264o5389m8906O1406M6451m2215k1545k608
20402D4038r073J02474N7075m8662p8020j05464q0753L0616j4277O8064q282n5524
20390i7788M4716k575m5568R3026p991l7473m5994l586j4546k9825L1795n458
20378a21267p4920L7708n8704l3195L3915M9272R4032k1355J5425L7039k1385
$$ plain form
20367 -63435 -57901 -51390 -45015 -63570 -71792 -72552 -66856 -50814 -79224 -31448 3277 -19241 5611
20354 5611 -53842 -45204 -37233 -45775 -3935 -32905 14370 32813 33873 -30614 -11030 3850 11341
20341 11341 -5070 -33475 -6248 -90095 -95061 -77103 -153846 -188421 -194426 -175738 -212888 -115869
20329 -115869 32569 86950 82319 45315 -19992 14698 -14161 -41628 25605 -62174 -37087
20318 -37087 91632 38501 -48808 -106060 -76055 -41890 -50124 -95643 -99061 -77094 -69612 -70676
20306 -70676 -158798 -161212 -102469 -101543 -105944 -91812 -68160 -132178 -158724 -221261 -259527 -231222
20294 -231222 -159356 -162757 -206143 -183626 -122509 -20097 19849 -3652 -30918 33615 15578
20283 15578 -18245 -59131 -110034 -117877 -122496 -96894 -83642 -37800 -25791 -39703 -80783 -73933
$$ packed form
20367f3435N534O511O375j8555q222p60N696J6042k8410M7776L4725k2518K4852
20354E611n9453Q638P971q542M1840k8970M7275J8443J060o4487J9584J4880P491
20341A1341j6411k8405K7227q3847m966J7958p6743l4575o005J8688l7150R7019
20329a15869J48438N4381m631l7004o5307L4690k8859k7467O7233q7779K5087
20318c7087J28719n3131q7309n7252L0005L4165q234m5519l418K1967P482j064
20306g0676q8122k414N8743R26m401J4132K3652o4018k6546o2537l8266K8305
20294b31222P1866l401m3386K2517O1117J02412L9946k3501k7266O4533j8037
20283A5578l3823m0886n0903p843m619K5602J3252M5842J2009j3912m1080O850
$$ plain form
20271 -73933 -75742 -55305 30635 -7977 28891 90956 63879 23014 39764 -36249 -114295 -165036
20259 -165036 -168235 -121477 -3393 -36593 -122342 -148059 -109354 -53488 -70606 -138859 -164577
20248 -164577 -132986 -66288 -133477 -95529 -2513 -85848 -136520 -33555 32294 -18752 -65841
20237 -65841 -69207 -69590 -75417 -15596 -36079 -92223 -123910 -33228 -35807 -122457 -101447 -26086 21887
20224 21887 -2063 -23771 6879 56499 76068 -33636 -74949 -37780 -13858 8752 -61777
20213 -61777 -115196 -77379 -3872 38305 24463 -23 -11280 51844 64468 78401 -6066 -30615
20201 -30615 -37444 515 -32995 -72089 -121022 -160501 -111171 -75697 -50244 -50060 -71304 -68738
20189 -68738 -78053 -107274 -92315 -85981 -42510 -20128 -38831 4584 -1251 -111484 -176226 -136183
$$ packed form
20271g3933j809K0437Q5940l8612L6868O2065k7077m0865J6750p6013p8046n0741
20259a65036l199M6758J18084l3200q5749k5717L8705N5866j7118o8253k5718
20248a64577L1591O6698o7189L7948R3016q3335n0672J02965O5849n1046m7089
20237f5841l366l83n827N9821k0483n6144l1687R0682k579q6650K1010P5361M7973
20224B1887k3950k1708L0650M9620J9569j09704m1313L7169K3922K2610p0529
20213f1777n3419L7817P3507M2177j3842k4486j1257O3124J2624J3933q4467k4549
20201c0615o829L7959l3510l9094m8933l9479M9330L5474K5453J84k1244K566
20189f8738r315k9221J4959O334M3471K2382j8703M3415n835j10233o4742M0043
$$ plain form
20177 -136183 -129259 -75456 -84223 -132839 -119239 -161329 -156259 -136275 -51730 -74010 -125382 -83238
20165 -83238 -20570 34146 73546 99556 129755 121183 109332 88742 45048 37402 50459 32571
20153 32571 -25297 -51290 -35071 -17257 25438 -10387 -107032 -160391 -115545 -12609 37345
20142 37345 -12763 -49577 -75013 -39767 -35393 -100311 -76938 -34372 -51234 -20071 19178 79538
20130 79538 60559 47298 79045 104137 43964 -52567 -58759 17962 124509 162100 111353 25166
20118 25166 -64786 -119252 -84777 -55987 -107771 -174469 -95537 -6061 43698 32615 42812 85337
20106 85337 73538 56089 39219 -3774 74534 22177 15417 54913 67270 50894 8728 19608
20094 19608 -6311 -40010 -56944 -109931 -33573 34595 1686 40157 46542 27746 30244 -40332
$$ packed form
20177a36183O924N3803q767m8616J3600m2090N070J9984Q4545k2280n1372M2144
20165h3238O2668N4716L9400K6010L0199q572j1851k0590m3694p646J3057j7888
20153C2571n7868k5993J6219J7814M2695l5825r6645n3359M4846J02936M9954
20142C7345n0108l6814k5436L5246M374o4918K3373M2566j6862L1163L9249O0360
20130G9538j8979j3261L1747K5092o0173r6531o192P6721J06547L7591n0747q6187
20118B5166q9952n4466L4475K8790n1784o6698P8932Q9476M9759j1083J0197M2525
20106H5337j1799j7449j6870m2993P8308n2357o760L9496J2357j6376m2166J0880
20094A9608k5919l3699j6934n2987P6358O8168l2909L8471O385j8796K498p0576
$$ plain form
20082 -40332 47307 98216 40798 -88979 -47444 -4459 -85074 -119324 -89983 -39063 -84496
20071 -84496 -49894 -19925 28660 5730 -59451 -53267 -9758 6680 -30386 16183 37547 137816
20059 137816 136591 50037 44373 19345 2148 32681 32267 -45832 -103221 -94313 -6439 82093
20047 82093 63014 -40844 -6837 -10063 -50802 20901 43551 15278 -78879 -64333 -50534 -12093
20035 -12093 -22102 -17039 403 36453 58251 61476 88061 -4749 -46500 -6765 27058 -34417
20023 -34417 -40255 4024 35809 7035 -17097 37810 69363 86301 24040 -22538 -52278 -57143
20011 -57143 9971 107023 147174 100092 139162 91149 -6849 13724 19123 49128 23453 -35016
19999 -35016 6443 28698 90095 30865 -66929 -60392 31907 16196 -6829 -28313 -38842 3233
$$ packed form
20082d0332Q7639N0909n7418j29777M1535M2985q0615l4250K9341N0920m5433
20071h4496L4602K9969M8585k2930o5181O184M3509J6438l7066M6569K1364J00269
20059A37816j225q6554n664k5028j7197L0533m14p8099n7389Q908Q7874Q8532
20047H2093j9079j03858L4007l226m0739P1703K2650k8273r4157J4546J3799L8441
20035a2093j0009N063J7442L6050K1798L225K6585r2810m1751L9735L3823o1475
20023c4417n838M4279L1785k8774k4132N4907L1553J6938o2261m6578k9740m865
20011e7143O7114R7052M0151m7082L9070m8013r7998K0573N399L0005k5675n8469
19999c5016M1459K2255O1397n9230r7794O537R2299j5711k3025k1484j0529M2075
$$ plain form
19987 3233 41111 42782 38622 72091 82270 10782 -18914 -89932 -126934 -91250 -72491 -20643
19975 -20643 -47623 -64289 -61911 7724 117024 21550 62926 29689 -69442 -68119 -75272 -51713
19963 -51713 -24716 -45568 -40747 -59593 -23901 3021 65313 61371 34512 -27211 -86564 -112904
19951 -112904 -112721 -42988 -24521 -93877 -55505 10485 18516 -2216 -48439 11665 29329 51139
19939 51139 46034 -9933 -86188 -33000 16307 36372 27658 -7422 -67689 -110088 -72253 -54722
19927 -54722 -108374 -105532 -24291 -66192 -109566 -117685 -106150 -30976 -46992 -76737 -57899 10412
19915 10412 43332 56180 57772 119073 49641 -4290 -14770 -31675 -60430 -89833 -54878 -36182
19903 -36182 14224 -62008 -83206 -142979 -200040 -123037 -80119 -25148 -15589 -40338 -24660 -75539
$$ packed form
19987C233L7878J671m160L3469J0179p1488k9696p1018l7002L5684J8759N1848
19975b0643k6980j6666K378O9635J09300r5474M1376l3237r9131J323p153K3559
19963e1713K6997k0852M821j8846L5692K6922O2292l942k6859o1723n9353k6340
19951a12904J83O9733J8467o9356L8372O5990Q031k0732m6223O0104J7664K1810
19939E1139n105n5967p6255N3188M9307K0065q714l5080o0267m2399L7835J7531
19927e4722n3652K842Q1241m1901m3374q119J1535P5174j6016k9745J8838O8311
19915A0412L2920J2848J592O1301o9432n3931j0480j6905k8755k9403L4955J8696
19903c6182N0406p6232k1198n9773n7061P7003M2918N4971R559k4749J5678n0879
$$ plain form
19891 -75539 -91354 -129692 -74886 -68363 -101326 -97930 -57892 -61311 -80981 -34001 -18768 -42700
19879 -42700 -34650 20129 58251 107845 77589 -4983 -69251 -108381 -131534 -83297 -97893 -150552
19867 -150552 -120011 -47611 -44634 -60703 -81030 -33890 2103 -5930 24812 47443 -22643 -32151
19855 -32151 -22080 -34177 -52157 -105424 -63887 889 9878 40813 60179 6117 4329 50128
19843 50128 56381 81850 35243 -4440 24942 16433 -109832 -206535 -185582 -142640 -92389 -78402
19831 -78402 -64605 -37797 -8680 -39143 -38662 -80057 -3291 72225 87543 99217 77905 35636
19819 35636 4265 32469 146866 154126 40994 -12343 20443 24566 -3127 2523 36851 12392
19807 12392 4271 9882 8308 29868 52912 11837 62014 75247 -21102 -82317 -99051 -180339
$$ packed form
19891g5539j5815l8338N4806O523l2963L396M0038l419j9670M6980J5233k3932
19879d2700Q050N4779L8122M9594l0256q2572o4268l9130k3153M8237j4596n2659
19867a50552L0541P2400K977j6069k0327M7140L5993q033L0742K2631p0086r508
19855c2151J0071j2097j7980n3267M1537O4776Q989L0935J9366n4062j788M5799
19843E0128O253K5469m6607l9683K9382q509j26265r6703K0953M2942N0251J3987
19831g8402J3797K6808K9117l0463M81m1395P6766P5516J5318J1674k1312m2269
19819C5636l1371K8204J14397P260j13132n3337L2786M123k7693N650L4328k4459
19807A2392q121N611j574K1560K3044m1075N0177J3233r6349o1215j6734q1288
$$ plain form
19795 -180339 -130660 -32227 -18155 -17770 -56748 -44639 -80803 -134652 -79755 -10745 3536 -4080
19783 -4080 159 -37397 -95761 -126565 -136969 -146680 -81153 -65324 -45231 20124 10695 55928
19771 55928 54595 15290 -1016 -46268 -9498 73523 96880 107780 79065 35330 -44313 -104138
19759 -104138 -106064 -36666 -1301 -42192 -58815 -84668 -30946 -40030 -50284 -48304 -63593 -118503
19747 -118503 -38371 38776 -22708 -166445 -119937 -55637 -98420 -95143 -51958 -72849 -111954
19736 -111954 -53192 -35069 -16361 -44669 -53603 -28868 -7199 -10562 -56061 -24865 64418 21065
19724 21065 -31483 -30581 -29509 24440 84166 41427 87006 76732 47568 110485 188596 122456
19712 122456 80584 94180 67116 64880 49111 327 -20408 11315 -28696 -142558 -168792
$$ packed form
19795a80339M9679R8433J4072L85l8978J2109l6164n3849N4897O9010J4281p616
19783d080M239l7556n8364l0804j0404r711O5527J5829K0093O5355r429M5233
19771E5928j333l9305j6306m5252L6770Q3021K3357J0900k8715m3735p9643n9825
19759a04138j926O9398L5365m0891j6623k5853N3722r084j0254J980j5289n4910
19747a18503Q0132P7147o1484j43737M6508O4300m2783L277M3185k0891l9105
19736a11954N8762J8123J8708k8308q934K4735K1669l363m5499L1196Q9283m3353
19724B1065n2548R02J072N3949N9726m2739M5579j0274k9164O2917P8111o6140
19712A22456m1872J3596k7064k236j5769m8784k0735L1723m0011j13862k6234
$$ plain form
19701 -168792 -174067 -128921 -27245 4875 31970 -20573 9307 42095 32071 -53232 -80022
19690 -80022 -8619 16744 -4106 39715 21349 -49254 -24270 20496 24749 50520 26516 51392
19678 51392 117429 52865 -66104 -94717 -107524 -107184 -51534 5320 68981 96589 2682 -78445
19666 -78445 -163616 -146929 -77376 -87692 -144732 -156219 -55971 -18005 -53331 -49183 -98441 -121968
19654 -121968 -101556 -98030 -71104 34388 37536 32451 -14756 -16028 -8044 -25684 -14800 -25740
19642 -25740 -83180 -56605 -8562 -20222 -56446 -17218 -33281 -24025 -42884 -70898 -49667 -65578
19630 -65578 -54197 -73106 -135048 -175622 -83663 -38223 -69287 -23130 -44835 -141359 -152007 -136470
19618 -136470 -12395 59095 15823 21099 -38184 -31548 11130 61609 44296 94297 60222 82446
$$ packed form
19701a68792n275M5146J01676L2120K7095n2543K9880L2788j0024q5303k6790
19690h0022P1403K5363k0850M3821j8366p0603K4984M4766M253K5771k4004K4876
19678E1392O6037o4564j18969k8613j2807L40N5650N6854O3661K7608r3907q1127
19666g8445q5171J6687O9553j0316n7040j1487J00248L7966l5326M148m9258k3527
19654a21968K0412L526K6926J05492L148n085m7207j272P984j7640J0884j0940
19642b5740n7440K6575M8043j1660l6224L9228j6063R256j8859k8014K1231j5911
19630f5578J1381j8909o1942m0574R1959M5440l1064M6157k1705r6524j0648J5537
19618a36470J24075P1490m3272N276n9283O636M2678N0479j7313N0001l4075K2224
$$ plain form
19606 82446 74146 35898 53602 29029 39683 33962 17696 5619 32421 42480 24361 -6795
19594 -6795 -7640 72967 125546 48933 12451 20390 51089 65276 -48195 -110991 4261 149006
19582 149006 99949 40434 1553 -15405 -20402 25161 56912 22303 -869 -31728 50979 38754
19570 38754 -11732 -56891 -47829 -72233 -56959 -10546 1625 -41785 -89446 -153 27698 77997
19558 77997 -23811 -96953 -64601 33326 41477 -41824 -22847 -15876 -5698 -21060 -75920 -106080
19546 -106080 -99676 -59263 -1640 -7204 23650 -28410 -26109 7896 19282 -56037 -121728 -140396
19534 -140396 -106050 -8355 -15425 -90404 -21887 46249 75368 50756 8201 84483 53923 10260
19522 10260 -514 27904 85477 35785 -65880 -58186 -57696 -5774 30425 -32981 -45546 -33229
$$ packed form
19606H2446q300l8248J7704k4573J0654n721j6266j2077K6802J0059j8119l1156
19594f795q45Q0607N2579p6613l6482P939L0699J4187j13471o2796J15252J44745
19582A49006m9057n9515l8881j6958m997M5563L1751l4609k3172l0859Q2707j2225
19570C8754n0486m5159R062k4404J5274M6413J2171m3410m7661Q9293K7851N0299
19558G7997j01808p3142L2352R7927Q151q3301J8977O971J0178j5362n4860l0160
19546a06080O404M0413N7623n564L0854n2060K301L4005J1386p5319o5691j8668
19534a40396L4346R7695p070p4979O8517O8136K9119k4612m2555P6282l0560m3663
19522A0260j0774K8418N7573m9692j01665P694M90N1922L6199o3406j2565J2317
$$ plain form
19510 -33229 -4718 10630 76366 88552 10905 -97392 -48397 -23442 -56935 -65952 -58751 -22081
19498 -22081 17216 33878 54400 2016 -34966 1861 -17859 -4639 5001 -14223 -85322 -138540
19486 -138540 -176718 -171826 -241120 -190623 -85768 -12456 38580 92254 57442 20671 4753
19475 4753 -53812 -12737 31088 6567 78906 89312 94009 107254 93655 69250 33234 30852
19463 30852 122059 129351 96516 37493 47801 80790 51980 -21451 -57025 -67496 -91504 -91782
19451 -91782 -67823 -79594 -65399 -23934 15774 19255 20228 40541 74444 15924 -32130 57997
19439 57997 51304 32176 -13594 -24187 -35635 -55186 5945 -3314 10170 12989 -35781 -85698
19427 -85698 -104334 -109166 -103795 -82895 21494 90538 50043 38147 21937 105274 155165 62800
$$ packed form
19510c3229K8511J5348O5736J2186p7647j08297M8995K4955l3493r017P201L6670
19498b2081L9297J6662K0522n2384l6982L6827j9720J3220R640j9224p1099n3218
19486a38540l8178M892o9294N0497J04855P3312N1036N3674l4812l6771j5918
19475D753n8565M1075M3825k4521P2339J0406M697J3245j3599k4405l6016k382
19463C0852R1207P292l2835n9023J0308L2989k8810p3431l5574j0471k4008k78
19451i1782K3959j1771J4195M1465L9708L481R73K0313L3903n8520m8054R0127
19439E7997o693j9128m5770j0593j1448j9551O1131r259J3484K819m8770m9917
19427h5698j8636m832N371K0900J04389O9044m0495j1896j6210Q3337M9891r2365
$$ plain form
19415 62800 -55767 -9236 46313 62491 -42600 -31509 9031 16619 42656 -4200 26223
19404 26223 25516 3735 -21597 6387 -55085 -98167 -85985 -26541 -27459 5253 46254 82552
19392 82552 40455 38425 37194 -39286 -70769 -78408 -87036 -141479 -185136 -116732 -22305 -62140
19380 -62140 30687 77384 53605 19488 80415 183669 159535 156911 161464 121500 115599 99148
19368 99148 23173 -74 62700 53147 -5110 89777 129904 42448 23345 -101480 -139009 -163818
19356 -163818 -179455 -198351 -111569 -74321 -81457 -50281 -33913 -45395 -42217 -63280 -42036 -51962
19344 -51962 34535 108505 68694 -46949 -69476 -89389 -50839 -54354 14684 -1192 -36516 40960
19332 40960 34522 2635 -68148 -115763 -38702 -25650 -19497 -68106 -122348 -151174 -122374 -86098
$$ packed form
19415F2800j18567M6531N5549J6178j05091J1091M0540P588K6037m6856L0423
19404B6223p07k1781k5332K7984o1472m3082J2182N9444r18L2712M1001L6298
19392H2552m2097k030j231p6480l1483p639q628n4443m3657O8404R4427l9835
19380f2140R2827M6697k3779l4117O0927J03254k4134k624M553l9964n901j6451
19368I9148p5975k3247O2774r553n8257R4887M0127q7456j9103j24825l7529k4809
19356a63818j5637j8896Q6782L7248p136L1176J6368j1482L178k1063K1244r926
19344e1962Q6497P3970l9811j15643k2527j9913L8550l515O9038j5876l5324P7476
19332D0960o438l1887p0783m7615P7061J3052O153m8609n4242k8826K8800L6276
$$ plain form
19320 -86098 -27963 28345 40863 2094 -33408 -24206 -15394 4233 77008 149127 106344 109012
19308 109012 152054 79690 60953 50682 54242 62583 73019 35586 61158 78249 60477 91529
19296 91529 35127 862 29150 70379 147524 150270 146772 97205 28702 59528 38726 -3393
19284 -3393 41226 39876 -67826 7146 18485 -27123 -75442 -67871 -48775 -41069 -54136 -22147
19272 -22147 33761 43402 74135 -30526 -35125 -59068 -33515 -16636 48073 10040 2458 23828
19260 23828 -38008 -13140 757 4339 60310 51601 -24448 -46129 -31628 11907 73545 85323
19248 85323 19592 -64586 -116478 -71720 -20645 -13969 9679 93412 159528 229532 199959 92591
19236 92591 -17472 22348 61993 15237 -39771 -13761 57681 84801 54367 60349 69379 91095
$$ packed form
19320h6098N8135N6308J2518l8769l5502R202Q812J9627P2775P2119m2783K668
19308A09012M3042p2364j8737j0271L560Q341J0436l7433K5572J7091j7772L1052
19296I1529n6402l4265K8288M1229P7145K746l498m9567o8503L0826k0802m2119
19284c393M4619j350j07702P4972J1339m5608m8319P571J9096P706j3067L1989
19272b2147N5908R641L0733j04661m599k3943K5553J6879O4709l8033p582K1370
19260B3828o1836K4868J3897L582N5971q709p6049k1681J4501M3535O1638J1778
19248H5323o5731q4178n1892M4758N1075O676K3648Q3733O6116P0004k9573j07368
19236I2591j10063L9820L9645m6756n5008K6010P1442K7120l0434N982R030K1716
$$ plain form
19224 91095 108146 129121 15078 -126506 -168628 -190079 -178107 -110163 -33730 -22351 -14226
19213 -14226 7157 24304 -94 22715 26082 74758 19543 -14519 -25863 37583 7094 -29595
19201 -29595 -14388 10373 62812 105954 70887 157919 181212 67023 13034 -7031 -14147 -15180
19189 -15180 16345 17550 49237 56046 -8216 -55862 -122268 -64342 -9060 67583 121041 54866
19177 54866 13014 37458 29418 -8415 42622 119038 53219 -72543 -141910 -161365 -183369 -190994
19165 -190994 -233197 -116408 -62055 -73539 -2452 51811 9980 -4818 -32404 3256 34218
19154 34218 37709 60735 61226 121916 76674 51292 13958 -24101 61781 25794 24666 44339
19142 44339 -3551 -79976 -58584 -69496 -100194 -72154 -59956 -54244 -24993 -77379 -129336 -104265
$$ packed form
19224I1095J7051K0975j14043j41584m2122k1451J1972O7944P6433J1379Q125
19213a4226K1383J7147k4398K2809L367M8676n5215l4062j1344O3446l0489l6689
19201b9595J5207K4761N2439M3142l5067Q7032K3293j14189n3989k0065p116j033
19189a5180L1525J205L1687O809o4262m7646o6406N7926N5282P6643N3458o6175
19177E4866m1852K4444q040l7833N1037P6416o5819j25762o9367j9455k2004p625
19165a90994m2203J16789N4353j1484P1087N4263m1831j4798k7586L5660L0962
19154C4218L491K3026M91O0690m5242k5382l7334l8059Q5882l5987j128J9673
19142D4339m7890p6425K1392j0912l0698K8040J2198N712K9251n2386n1957K5071
$$ plain form
19130 -104265 -43275 -28917 18647 20068 -39971 -102393 -41478 7808 21341 21337 103323 107403 52418
19117 52418 -15846 -35612 39746 84471 77036 46527 76217 33559 -45861 -12819 50141 44436
19105 44436 110706 190732 146026 61781 -11007 -36511 -72204 -9719 83247 87798 87581 58802
19093 58802 85756 104806 19274 -27259 47375 38461 -12535 -72368 -90577 -37882 64522 25565
19081 25565 -80100 -68985 -86220 -41486 -19214 7247 65047 13678 -88738 -97728 -78663
19070 -78663 -9154 -14133 -66271 -72456 -41219 8394 78939 59757 24437 91865 67187 18358
19058 18358 41743 51776 67137 -10018 -60849 59550 115286 106631 93021 67300 72863 76544
19046 76544 17890 4327 18703 51412 100270 74983 44726 59918 82089 102135 71651 64009
$$ packed form
19130a04265O0990J4358M7564J421o0039o2422O0915M9286J3533mQ1986M080n4985
19117E2418o8264j9766P5358M4725p435l0509K9690m2658p9420L3042O2960n705
19105D4436O6270Q0026m4706q4245p2788k5504l5693O2485R2966M551k17k8779
19093E8802K6954J9050q5532m6533P4634q914n0996n9833j8209N2695J02404l8957
19081B5565j05665J1115j7235M4734K2272K6461N7800n1369j02416q990J9065
19070g8663O9509m979n2138o185L1237M9613P0545j9182l5320O7428k4678m8829
19058A8358K3385J0033J5361p7155n0831J20399N5736q655j3610k5721N563L681
19046G6544n8654j3563J4376L2709M8858k5287l0257J5192K2171K0046l0484p642
$$ plain form
19034 64009 54565 60123 104355 157223 144945 110507 71738 94956 118639 140228 124500 81908
19022 81908 104796 68926 56222 69612 18013 42344 -41803 -46375 -189 66106 76697 77232
19010 77232 57038 24065 36325 116677 147410 164988 181397 174352 111259 157986 147855 208417
18998 208417 291210 205277 120875 109317 114089 198710 128563 82920 141775 138256 103324 127699
18986 127699 125361 168889 193072 161606 148396 182161 125575 91799 144698 62956 50411 113677
18974 113677 128137 87970 93375 124675 172640 133077 111458 67858 111008 216851 259969
18963 259969 222870 134741 58434 29194 17507 3892 33201 67531 102799 97366 117454 50233
18951 50233 -5505 -12128 5141 82423 129530 95740 118703 68623 45387 76415 103314 101655
$$ packed form
19034F4009r444N558M4232N2868j2278l4438l8769K3218K3683K1589j5728m2592
19022H1908K2888l5870j2704J3390n1599K4331q4147m572M6186O6295J0591N35
19010G7232k0194l2973J2260Q0352L0733J7578J6409p045o3093M6727j0131O0562
18998B08417Q2793q5933q4402j1558M772Q4621p0147m5643N8855l519l4932K4375
18986A27699k338M3528K4183l1466j3210L3765n6586l3776N2899q1742j2545O3266
18974A13677J4460m0167N405L1300M7965l9563k1619m3600M3150J05843M3118
18963B59969l7099q8129p6307k9240j1687j3615K9309L4330L5268n433K0088o7221
18951E0233n5738o623J7269P7282M7107l3790K2963n0080k3236L1028K6899j659
$$ plain form
18939 101655 103755 120894 89860 40870 18577 -41274 -34115 -37684 3547 31436 1533 11626
18927 11626 46651 114657 168945 142818 104427 17083 -6513 3048 50230 1677 57838 116205
18915 116205 68302 74810 99209 111350 105363 108615 65316 69643 55679 24557 1561 39970
18903 39970 84306 64504 76629 76552 39558 25415 79084 110160 114602 25483 -34056 -39115 45766
18890 45766 43651 34997 45970 96430 124940 98403 18125 -75553 -29397 133093 211915 264639
18878 264639 186439 90820 85305 59322 16961 -33638 21452 130880 103421 50141 20221
18867 20221 -5364 36241 107324 193627 138877 133915 40073 11402 45839 37658 36347 49475
18855 49475 60918 71931 121353 183382 113326 8494 -21472 29442 85158 61893 94129
$$ packed form
18939A01655K100J7139l1034m8990k2293n9851P159l569M1231K7889k9903J0093
18927A1626L5025O8006N4288k6127l8391q7344k3596R561M7182m8553N6161N8367
18915A16205m7903O508K4399J2141n987L252m3299M327j3964l1122k2996L8409
18903C9970M4336j9802J2125p7l6994j4143N3669L1076M442q9119n9539n059Q4881
18890D5766k115q654J0973N0460K8510k6537q0278r3678M6156J62490P8822N2724
18878B64639p8200r5619n515k5983m2361n0599N5090J09428k7459n3280k9920
18867B0221k5585M1605P1083Q6303n4750m962r3842k8671L4437q181j311J3128
18855D9475J1443J1013M9422O2029p0056j04832k9966N0914N5716k3265L2236
$$ plain form
18844 94129 64154 72271 101368 160581 126838 34202 11423 11345 51967 105113 107478 161148 107648
18831 107648 83498 11597 23161 44873 93973 134923 164106 154808 122508 75310 103368 84964
18819 84964 26880 28465 18178 -42160 -87069 8698 59443 128712 168851 137721 120047 138930
18807 138930 120929 118415 194630 193932 129290 97219 112222 163134 149480 79916 34847 64501
18795 64501 130266 162017 136456 116674 83408 75417 22696 -12609 45492 79584 26163 49044
18783 49044 119284 38170 10834 73021 98891 125929 225767 212504 227474 195090 213011 208052
18771 208052 228210 276319 363512 334898 259314 215368 209221 189957 236445 221537 124915 125657
18759 125657 163071 139437 144412 107971 36400 -95171 -27300 46125 42866 18137 -28471 -75306
$$ packed form
18844I4129k9975Q117K9097N9213l3743r2636k2779p8M0622N3146K365N3670n3500
18831A07648k4150p1901J1564K1712M9100M0950K9183r298l2300m7198K8058j8404
18819H4964n8084J585j0287o0338m4909R5767N0745O9269M0139l1130j7674J8883
18807A38930j8001k514P6215o98o4642l2071J5003N0912j3654o9564m5069K9654
18795F4501O5765L1751k5561j9782l3266p991n2721l5305N8101L4092n3421K2881
18783D9044P0240q1114k7336O2187K5870K7038R9838j3263J4970l2384J7921m959
18771B08052K0158M8109Q7193k8614p5584m3946o147j9264M6488j4908r6622P42
18759A25657L7414k3634M975l6441p1571j31571O7871P3425l259k4729m6608m6835
$$ plain form
18747 -75306 16636 51196 77854 41752 34795 97407 86328 69041 95242 63973 -13190 -20208
18735 -20208 -54666 -103704 -116628 -28591 -15057 -26525 37496 82854 123718 101557 113212 76684
18723 76684 9926 21054 151320 173161 188512 227029 143967 105351 95691 88861 200339 189697
18711 189697 92638 17173 -20719 -95403 -107138 -47669 -7491 -9864 33780 71524 103154 89897
18699 89897 84549 32965 -63006 -77100 -71501 -2528 62430 -1103 -25772 -75057 -75013 6910 3243
18686 3243 -29174 -43539 47435 24671 -18285 -53328 -27559 -37783 -15896 35442 64752 118197
18674 118197 160212 182010 162027 109612 116363 82845 50236 110054 187021 102182 19923 -25870
18662 -25870 37150 148148 166210 116068 34599 68599 89051 22860 -14876 31232 42215
$$ packed form
18747g5306R1942L4560K6658l6102o957O2612j1079j7287K6201l1269p7163p018
18735b0208l4458m9038j2924Q8037J3534j1468O4021M5358M0864k2161J1655l6528
18723G6684o6758J1128J30266K1841J5351L8517q3062l8616r660o830J11478j0642
18711A89697r7059p5465l7892p4684j1735N9469M0178k373M3644L7744L1630j3257
18699H9897n348n1584r5971j4094N599O8973O4958o3533k4669m9285M4Q1923l667
18686C243l2417j4365R0974k2764m2956l5043K5769j0224K1887N1338K9310N3445
18674A18197M2015K1798j9983n2415O751l3518l2609N9818P6967q4839q2259m5793
18662b5870O3020J10998J8062n0142q1469L4000K0452o6191l7736M6108J0983
$$ plain form
18651 42215 16431 51370 100586 34803 40622 72283 53076 78035 62646 -26970 -38969 -4574
18639 -4574 7564 32133 80144 90358 18987 8983 6575 23511 66628 62287 23975 -29756
18627 -29756 -14325 64096 45728 46909 32940 115785 90808 38174 76925 103951 101318 145020
18615 145020 112370 41857 57830 146197 187443 211554 243465 238700 189499 118621 60434 88300
18603 88300 169259 199941 175703 130620 133022 107553 170386 190031 142211 157307 98860 118897
18591 118897 152351 178988 139818 115558 68912 20979 -37920 -30305 -14854 2947 54492 49483
18579 49483 48712 26282 49005 -3111 3776 68603 165778 208435 199662 192777 247054 253255 117739
18566 117739 39286 6981 14707 25713 26227 -10736 14355 64478 81869 67459 47175 73815
$$ packed form
18651D2215k5784L4939M9216o5783N819L1661j9207K4959j5389q9616j1999L4395
18639d574J2138K4569M8011J0214p1371j0004k408J6936M3117m341l8312n3731
18627b9756J5431P8421j8368J181j3969Q2845k4977n2634L8751K7026k633M3702
18615A45020l2650p0513J5973Q8367M1246K4111L1911m765m9201p0878n8187K7866
18603H8300Q0959L0682k4238m5083K402k5469O2833J9645m7820J5096n8447K0037
18591A18897L3454K6637l9170k4260m6646m7933n8899P615J5451J7801N1545n009
18579D9483p71k2430K2723n2116O887O4827R7175M2657q773o885N4277O201j35516
18566A17739p8453l2305P726J1006N14l6963K5091N0123J7391j4410k0284K6640
$$ plain form
18554 73815 69737 17525 12600 40689 56243 7652 -829 9608 41727 146276 188511 128862
18542 128862 66562 94012 144748 86072 138811 184701 163699 133695 100122 128014 86401
18531 86401 51173 65721 41934 -7866 85746 158297 209965 190046 165706 148522 154338 139559
18519 139559 88554 32993 -6687 47749 88788 131150 158165 131302 150457 171498 216796
18508 216796 219336 217804 167664 124639 161704 207623 235799 290858 320066 350100 305950 271374
18496 271374 323345 356012 267601 258228 212344 187746 169772 204169 182721 170013 162125 184638
18484 184638 182066 164278 198206 172185 176790 229396 153072 86700 165168 248133 140606 26324
18472 26324 1399 102357 157049 152749 129030 122453 152066 152253 166735 89726 41341 64350
$$ packed form
18554G3815m078n2212m925K8089J5554m8591q481J0437L2119J04549M2235n9649
18542A28862o2300K7450N0736n8676N2739M5890k1002l0004l3573K7892m1613
18531H6401l5228J4548k3787m9800R3612P2551N1668j9919k4340j7184N816j4779
18519A39559n1005n5561l9680N4436M1039M2362K7015k6863J9155K1041M5298
18508B16796K540j532n0140m3025L7065M5919K8176N5059K9208L0034m4150l4576
18496B71374N1971L2667q8411r373m5884k4598j7974L4397k1448j2708p888K2513
18484A84638k572j7788L3928k6021M605N2606p6324o6372P8468Q2965j07527j14282
18472B6324k4925J00958N4692m300k3719o577K9613J87J4482p7009m8385K3009
$$ plain form
18460 64350 45034 90376 124951 112714 88348 92551 74707 66479 105640 117501 139621 148716
18448 148716 92780 86588 183431 170078 169329 90844 97814 105587 101748 138386 176336 176861 208058
18435 208058 188322 204827 210319 189087 173953 211034 243148 252441 243930 287167 201544 134233
18423 134233 119259 127329 163485 99255 10320 64883 115564 163883 105669 181831 185795 129599
18411 129599 158061 269695 262153 183680 141077 168622 133397 84325 70362 145257 193650
18400 193650 259526 179199 94833 136743 180705 169682 147414 126302 174440 307277 335436
18389 335436 268863 267303 252480 246751 146420 101300 107406 187514 163733 149399 156196 191114
18377 191114 235649 218378 213606 209838 182425 190510 204827 259488 294758 281952 271127 267547
$$ packed form
18460F4350j9316M5342L4575j2237k4366M203j7844q228L9161J1861K2120R095
18448A48716n5936o192R6843j3353p49p8485O970P773l839L6638L7950N25L1197
18435B08058j9736J6505N492k1232j5134L7081L2114R293q511M3237q5623o7311
18423A34233j4974Q070L6156o4230q8935N4563N0681M8319n8214P6162L964n6196
18411A29599K8462J11634p542p8473m2603K7545l5225m9072j3963P4895M8393
18400A93650O5876q0327q4366M1910M3962j1023k2268k1112M8138J32837K8159
18389C35436o6573j560j4823n729j00331m5120O106Q0108k3781j4334O797L4918
18377A91114M4535j7271m772l768k7413Q085J4317N4661L5270j2806j0825l580
$$ plain form
18365 267547 289642 299258 297119 239649 176813 191156 206455 243461 271722 285015 274914 240582
18353 240582 231195 195718 227496 230331 243153 311901 243212 181099 157546 191940 184844 208312
18341 208312 207714 158961 206708 153430 137048 227188 327437 285667 234295 192586 167788 247335
18329 247335 224846 189382 144483 215176 316601 304398 313900 346925 279628 196859 202669 263370
18317 263370 323821 341893 280632 253856 255262 211029 174423 202921 170191 190034 181113 245525
18305 245525 296271 225772 173227 240735 270116 240580 295179 300565 338801 313546 251984 203762
18293 203762 242202 244356 288132 325339 278349 355721 428698 402294 380454 433849 439056 351734
18281 351734 374392 400804 406595 378036 364348 307696 286799 308263 201684 187373 263951
$$ packed form
18365B67547K2095R616k139n7470o2836J4343J5299L7006K8261J3293j0101l4332
18353B40582r387l5477L1778K835J2822O8748o8689o2113k3553L4394p096K3468
18341B08312n98m8753M7747n3278j6382R0140J00249m1770n1372m1709k4798P9547
18329B47335k2489l5464m4899P0693J01425j2203R502L3025o7297q2769N810O0701
18317B63370O0451J8072o1261k6776J406m4233l6606K8498l2730J9843q921O4412
18305B45525N0746p0499n2545O7508K9381k9536N4599N386L8236k5255o1562m8222
18293B03762L8440K154M3776L7207m6990P7372P2977k6404k1840N3395N207q7322
18281C51734K2658K6412N791k8559j3688n6652k0897K1464j06579j4311P6578
$$ plain form
18270 263951 362839 379257 420997 462441 404115 387581 401974 410948 426553 404321 366947 418223
18258 418223 490116 474072 486200 558098 587325 526553 465336 510652 468959 464170 399688 395631
18246 395631 463320 485813 471841 470960 474743 521010 535013 550158 501567 447219 450578 437974
18234 437974 441678 480599 438208 389701 478058 547652 542345 522227 450374 460101 557504 574254
18222 574254 498456 494328 494452 498194 517117 582990 618612 576951 580749 576347 515035 528322 664576
18209 664576 655132 566927 584956 673713 709174 653298 697962 786336 813130 850883 833101 822533
18197 822533 775203 780562 816180 789558 737371 743305 740962 739842 807533 854254 859341 874378
18185 874378 824249 827611 906711 994766 1008183 1029114 1069051 1086675 1119184 1134230 1128423 1128690
$$ packed form
18270B63951R8888J6418M1740M1444n8326j6534J4393Q974J5605k2232l7374N1276
18258D18223P1893j6044J2128P1898K9227o0772o1217M5316m1693m789o4482m057
18246C95631O7689K2493j3972q81L783M6267J4003J5145m8591n4348L359j2604
18234D37974L704L8921m2391m8507Q8357O9594n307k0118p1853R727R7403J6750
18222E74254p5798m128J24L742J8923O5873L5622m1661L798m402o1312J3287J36254
18209F64576r444q8205J8029Q8757L5461n5876M4664Q8374K6794L7753j7782j0568
18197H22533m7330N359L5618k6622n2187N934k343j120O7691M6721N087J5037
18185H74378n0129L362P9100Q8055J3417K0931L9937J7624L2509J5046n807K67
$$ plain form
18173 1128690 1205242 1305407 1402895 1362479 1368333 1324158 1362665 1437564 1367981 1353358 1481037
18162 1481037 1575942 1639124 1657084 1682690 1757089 1847875 1869896 1947164 1995412 2069877 2222187
18151 2222187 2323363 2373485 2409407 2534072 2617071 2731162 2857055 2921255 3058757 3270992
18141 3270992 3421488 3594303 3721403 3849022 4033217 4231827 4472094 4683473 4972091
18132 4972091 5259165 5647507 6051399 6480755 6987376 7421028 7874297 8402229 8945607
18123 8945607 9507994 10175256 10887993 11604716 12264814 13110711 14110085 15210883 16498452
18114 16498452 18103021 20095834 22514847 25322893 28137279 30380628 31708185 32076783
18106 32076783 31988904 31807738 31039395 28962107 25770290 22324252 19133526 16474640 14322047
$$ packed form
18173A128690P6552J00165R7488m0416N854m4175L8507P4899o9583j4623J27679
18162A481037R4905O3182J7960K5606P4399R0786K2021P7268M8248P4465J52310
18151B222187J01176N0122L5922J24665Q2999J14091J25893O4200J37502K12235
18141C270992J50496J72815J27100J27619J84195J98610K40267K11379K88618
18132D972091K87074L88342M03892M29356N06621M33652M53269N27932N43378
18123H945607N62387O67262P12737P16723O60098Q45897R99374J100798J287569
18114A6498452J604569J992813K419013K808046K814386K243349J327557L68598
18106C2076783q7879j81166p68343k077288l191817l446038l190726k658886k152593
$$ plain form
18097 14322047 12632984 11251349 10091860 9097745 8330524 7669463 7099687 6668873 6243635
18088 6243635 5855965 5543028 5203391 4910212 4640115 4435694 4231605 4070606 3946072
18079 3946072 3789604 3607087 3474926 3341926 3190866 3147614 3082560 3057550 2970520 2908484
18069 2908484 2914048 2879214 2866778 2803134 2699218 2575137 2539387 2479965 2469437 2421184 2411717
18058 2411717 2334081 2284448 2203018 2100325 2006763 2043297 2045182 2035740 2085441 2143448 2148842 2123634
18046 2123634 2038254 1998086 1984287 1924577 1869085 1908896 1986402 1895958 1804064 1763928 1815373
18035 1815373 1854945 1823606 1846155 1876885 1817622 1759502 1780727 1750659 1646884 1648659 1677704
18024 1677704 1701104 1714952 1650114 1590283 1545923 1473168 1448820 1486616 1500689 1414751 1394790
$$ packed form
18097A4322047j689063j381635j159489r94115p67221o61061n69776m30814m25238
18088F243635l87670l12937l39637k93179k70097k04421k04089j60999j24534
18079C946072j56468j82517j32161j33000j51060m3252o5054k5010q7030o2036
18069B908484N564l4834j2436o3644j03916j24081l5750n9422j0528m8253r467
18058B411717p7636m9633q1430j02693r3562L6534J885r442M9701N8007N394k5208
18046B123634q5380m0168j3799n9710n5492L9811P7506r0444r1894m0136N1445
18035A815373L9572l1339K2549L0730n9263n8120K1225l0068j03775J775K9045
18024A677704K3400J3848o4838n9831m4360p2755k4348L7796J4073q5938j9961
$$ plain form
18013 1394790 1395801 1326077 1213820 1144309 1188281 1223347 1176925 1185300 1196958 1141947 1059255
18002 1059255 1009260 1010065 1077210 1105349 1111025 1055160 979069 968003 1009622 982967 955286 931387
17990 931387 909272 900832 855519 834034 847914 871748 864679 868815 882007 828490 732873 774878
17978 774878 802162 766091 830389 798839 861224 880403 784041 755610 723237 649276 552025
17967 552025 577326 626821 591409 637924 664209 610307 612224 598791 619820 529104 469032 480680
17955 480680 596520 622982 605672 631562 578830 503045 496531 438753 442992 494667 449913 427822
17943 427822 452103 384427 411857 453148 530995 595007 563892 518625 434935 407249 424188
17932 424188 394387 387793 423085 452673 466980 407941 401117 376435 336396 321806 343965 377783
$$ packed form
18013A394790J011o9724j12257o9511M3972L5066m6422Q375J1658n5011q2692
18002A059255m9995Q05O7145K8139N676n5865p6091j1066M1619k6655k7681k3899
17990I31387k2115q440m5313k1485J3880K3834p069M136J3192n3517r5617M2005
17978G74878K7284l6071O4298l1550O2385J9179r6362k8431l2373p3961r7251
17967E52025K5301M9495l5412M6515K6285n3902J917j3433K1029r0716o0072J1648
17955D80680J15840K6462j7310K5890n2732p5785o514n7778M239N1675m4754k2091
17943D27822K4281o7676K7430M1291P7847O4012l1115m5267q3690k7686J6939
17932D24188k9801o594L5292K9588J4307n9039o824k4682m0039j4590K2159L3818
$$ plain form
17920 377783 405537 426630 491145 568523 521482 435190 445994 488030 453201 431363 443606
17909 443606 447909 432899 417959 414880 402374 351257 313021 304508 352588 429863 454632 506867
17897 506867 473165 388769 348248 425360 453839 470517 450823 419728 453516 525350 493774
17886 493774 546188 574388 473664 475848 535001 503128 507373 516345 532567 644312 669394 606145
17874 606145 589439 628440 620193 674321 664683 610440 568819 611043 652294 631635 584201 507809
17862 507809 493277 448064 501676 612346 650370 597068 610436 566265 518271 559745 576361
17851 576361 634149 754630 754408 773463 766941 670175 646529 691161 594021 490517 494652 546186
17839 546186 581383 626055 687106 717983 705297 708290 674551 684286 700309 669744 697932 807294
$$ packed form
17920C77783K7754K1093O4515P7378m7041q6292J0804M2036l4829k1838J2243
17909D43606M303j5010j4940l079j2506n1117l8236q513M8080P7275K4769N2235
17897E06867l3702q4396m0521P7112K8479J6678j9694l1095L3788P1834l1576
17886D93774N2414K8200j00724K184N9153l1873M245Q972J6222J11745K5082o3249
17874F06145j6706L9001q247N4128r638n4243m1621M2224M1251k0659m7434p6392
17862E07809j4532m5213N3612J10670L8024n3302J3368m4171m7994M1474J6616
17851E76361N7788J20481k22J9055o522r6766k3646M4632r7140j03504M135N1534
17839E46186L5197M4672O1051L0877j2686K993l3739R735J6023l0565K8188J09362
$$ plain form
17827 807294 931983 976428 983177 1033759 1104085 1121244 1139212 1163614 1207044 1266455 1382116
17816 1382116 1439692 1405397 1416027 1418941 1480802 1494890 1534535 1588762 1668191 1728551 1765567
17805 1765567 1792744 1785813 1854341 1804760 1793588 1841034 1832132 1808565 1705987 1545025 1488505
17794 1488505 1466138 1472737 1421788 1400895 1376986 1387169 1396014 1368164 1350068 1239469 1074608
17783 1074608 938274 875595 944368 897101 865523 862754 887198 787508 723184 727718 755217
17772 755217 787324 806928 786405 708310 692747 729963 768964 747233 712164 685469 639539
17761 639539 671968 758797 798605 762353 732442 674396 659511 686919 719073 695083 695951 700693
17749 700693 584536 624420 669983 684204 638877 597383 595732 647569 674244 651773 677097
$$ packed form
17827H07294J24689M4445O749N0582P0326J7159J7968K4402M3430N9411J15661
17816A382116N7576l4295J0630K914O1861J4088L9645N4227P9429O0360L7016
17805A765567K7177o931O8528m9581j1172M7446q902k3567j02578j60962n6520
17794A488505k2367O599n0949k0893k3909J0183Q845k7850j8096j10599j64861
17783A074608j36334o2679O8773m7267l1578k769K4444r9690o4324M534K7499
17772G55217L2107J9604k0523p8095j5563L7216L9001k1731l5069k6695m5930
17761F39539L2429Q6829L9808l6252k9911n8046j4885K7408L2154k3990Q68M742
17749G00693j16157L9884M5563J4221m5327m1494j651N1837K6675k2471K5324
$$ plain form
17738 677097 681058 720530 648312 631569 727933 757567 682431 676949 706329 691928 725226 731092
17726 731092 725888 708113 716409 741366 722618 703373 665296 688544 723975 757631 841458 790930
17714 790930 786528 772731 753808 757908 719837 729513 726646 663593 610694 613751 634647 686308
17702 686308 745748 733191 697689 776863 760381 722446 661652 691056 752062 808438 821656
17691 821656 814925 743618 729037 715000 736269 692644 678954 674273 748838 718424 679371 644753
17679 644753 711524 724642 740090 767569 674917 676366 650628 636092 684889 807050 773600
17668 773600 741449 761300 627491 570197 693079 853480 941406 938300 919564 962584 870061
17657 870061 817644 780174 781590 783234 751044 737969 799532 801896 764284 752705 807044 835147
$$ packed form
17738F77097L961L9472p2218j6743R6364K9634p5136n482K9380j4401L3298N866
17726G31092n204j7775Q296K4957j8748j9245l8077K3248L5431L3656Q3827n0528
17714G90930m402j3797j8923M100l8071R676k867o3053n2899L057K0896N1661
17702F86308N9440j2557l5502P9174j6482l7935o0794K9404O1006N6376J3218
17691H21656o731p1307j4581j4037K1269m3625j3690m681P4565l0414l9053l4618
17679F44753O6771J3118J5448K7479r2652J449k5738j4536M8797J22161l3450
17668G73600l2151J9851j33809n7294J22882J60401Q7926l106j8736M3020r2523
17657H70061n2417l7470J416J644l2190j3075O1563K364l7612j1579N4339K8103
$$ plain form
17645 835147 859925 901752 869218 789805 810366 841668 781111 777470 782601 774601 772376 787676
17633 787676 735407 681899 688029 629545 592707 634924 686999 704230 779119 892419 908390
17622 908390 907215 820153 728271 710785 767491 728919 773966 830263 824600 716140 761530 787772
17610 787772 773274 756344 768718 804290 814975 830519 817183 796491 796236 822594 792606 796380
17598 796380 789360 758241 755860 773469 760608 817772 836288 878226 899518 825457 795683 779523
17586 779523 787614 815117 929475 965456 980332 971930 925244 901508 918076 946509 1062093
17575 1062093 1040309 930198 820784 884494 957330 941457 967737 974511 1006349 1036361 1000907
17564 1000907 999318 1094781 992882 961772 950481 954650 998187 1046748 1062597 1129378 1252650
$$ packed form
17645H35147K4778M1827l2534p9413K0561L1302o0557l641N131q000k225J5300
17633G87676n2269n3508O130n8484l6838M2217N2075J7231P4889J13300J5971
17622I08390j175q7062r1882j7486N6706l8572M5047N6297n663j08460M5390K6242
17610G87772j4498j6930J2374L5572J0685J5544j3336k0692k55K6358k9988L774
17598G96380p020l1119k381J7609j2861N7164J8516M1938K1292p4061k9774j6160
17586G79523Q091K7503J14358L5981J4876q402m6686k3736J6568K8433J15584
17575A062093k1784j10111j09414O3710P2836j5873K6280O774L1838L0012l5454
17564A000907j589R5463j01899l1110j1291M169M3537M8561J5849O6781J23272
$$ plain form
17553 1252650 1266500 1287468 1322815 1386436 1405948 1301270 1246998 1280242 1327424 1363457 1354470
17542 1354470 1337772 1458364 1516683 1481302 1483207 1529922 1586673 1543796 1463675 1536827 1555111
17531 1555111 1515095 1559436 1643833 1586238 1490193 1591784 1674917 1692277 1717984 1755672 1797522
17520 1797522 1770142 1790697 1823859 1873432 1906621 1863147 1846196 1819005 1839074 1887846 1937923
17509 1937923 1906348 1976323 2068933 2140883 2164507 2162895 2194445 2202465 2236456 2300641 2295123 2337320
17497 2337320 2409075 2560048 2690098 2811962 2984552 3129328 3222887 3345251 3412853 3472711
17487 3472711 3533300 3625307 3768776 3839402 3832310 3857652 3932481 4045974 4121385 4234976 4294756
17476 4294756 4380916 4432872 4412524 4425574 4521362 4457032 4288202 4161711 4028013 3901427
$$ packed form
17553A252650J3850K0968L5347O3621J9512j04678n4272L3244M7182L6033q987
17542A354470j6698J20592N8319l5381J905M6715N6751m2877q0121P3152J8284
17531A555111m0016M4341Q4397n7595r6045J01591Q3133J7360K5707L7688M1850
17520A797522k7380K0555L3162M9573L3189m3474j6951k7191K0069M8772N0077
17509A937923l1575O9975R2610P1950K3624j612L1550Q020L3991O4185n518M2197
17497B337320P1755J50973J30050J21864J72590J44776R3559J22364O7602N9858
17487C472711O0589R2007J43469P0626p092K5342P4829J13493P5411J13591N9780
17476D294756Q6160N1956k0348J3050R5788o4330j68830j26491j33698j26586
$$ plain form
17466 3901427 3819434 3809480 3791459 3792607 3789006 3721857 3676021 3577698 3426097 3333267 3284724 3250586
17454 3250586 3199669 3144492 3081609 2998797 2975759 2988626 3035942 3000169 2945903 2962665 2998940
17443 2998940 3126147 3182355 3217860 3259151 3224278 3192274 3193853 3262124 3300574 3388497 3391050
17432 3391050 3389548 3361209 3361343 3398849 3428587 3538239 3603630 3544436 3533687 3602929 3623887 3682639
17420 3682639 3665848 3693075 3659041 3662348 3778251 3815186 3882035 3892481 3924587 3967678 4008590
17409 4008590 4027535 4035623 4025163 3985046 4047471 3994056 4082897 4218606 4273034 4306181 4277992
17398 4277992 4263533 4378934 4516988 4572397 4497771 4528892 4625718 4696710 4662761 4717457 4765500
17387 4765500 4793816 4840270 4838274 4812483 4855911 4908381 4936468 4976685 4923469 4858409 4896906
$$ packed form
17466C901427q1993r954j8021J148l601o7149m5836r8323j51601r2830m8543l4138
17454C250586n0917n5177o2883q2812k3038J2867M7316l5773n4266J6762L6275
17443B998940J27207N6208L5505M1291l4873l2004J579O8271L8450Q7923K553
17432C391050j502k8339J34L7506K9738J09652O5391n9194j0749O9242K0958N8752
17420C682639j6791K7227l4034L307J15903L6935O6849J0446L2106M3091M0912
17409D008590J8945Q088j0460m0117O2425n3415Q8841J35709N4428L3147k8189
17398D277992j4459J15401J38054N5409p4626L1121R6826P0992l3949N4696M8043
17387D765500K8316M6454j996k5791M3428N2470K8087M0217n3216o5060L8497
$$ plain form
17376 4896906 4977786 4971322 4990713 5009876 5092507 5162167 5209054 5175844 5257182 5352937 5360957 5327608
17364 5327608 5404156 5533762 5664010 5755863 5855860 5941302 6021478 6127076 6208056 6324713
17354 6324713 6450450 6527065 6634532 6720747 6808298 6941196 7001580 7121337 7332330 7463285
17344 7463285 7589266 7776513 7952611 8078371 8261610 8555240 8680549 8805309 9049552
17335 9049552 9335644 9512437 9687210 9971807 10304125 10493523 10777166 11107524 11383996
17326 11383996 11674613 11943418 12311953 12723132 12993888 13325934 13772229 14183828 14628131
17317 14628131 15091695 15570345 16047758 16561963 17159920 17798784 18426916 19068412 19679780
17308 19679780 20296106 21055402 21953215 22864891 23769081 24812886 25922484 26953496 28093526
$$ packed form
17376D896906Q0880o464J9391J9163Q2631O9660M6887l3210Q1338R5755Q020l3349
17364E327608P6548J29606J30248R1853R9997Q5442Q0176J05598Q0980J16657
17354F324713J25737P6615J07467Q6215Q7551J32898O0384J19757K10993J30955
17344G463285J25981J87247J76098J25760J83239K93630J25309J24760K44243
17335I049552K86092J76793J74773K84597L32318J89398K83643L30358K76472
17326A1383996K90617K68805L68535M11179K70756L32046M46295M11599M44303
17317A4628131M63564M78650M77413N14205N97957O38864O28132O41496O11368
17308A9679780O16326P59296Q97813R11676R04190J043805J109598J031012J140030
$$ plain form
17299 28093526 29306817 30519710 31859146 33430751 35127329 36876525 38823916 40992489
17291 40992489 43194467 45557619 48082070 50862968 53950714 57125525 60507374 64156097
17283 64156097 68009202 72103622 76677231 81837141 87590892 94135359 101589172 110048170
17275 110048170 119615553 130202591 141596172 152623015 162007177 169577876 176326172
17268 176326172 183119008 189930137 195858059 200608050 205771728 213204540 223011937 233234671
17260 233234671 240840973 244442498 245182011 244915039 243640645 238902772 229197698 216554217
17252 216554217 204848416 196268031 190281689 184991243 178946552 172074187 165128566 158199564
17244 158199564 150091852 139466032 126752277 113932662 102443291 92758074 84686502
$$ packed form
17299B8093526J213291J212893J339436J571605J696578J749196J947391K168573
17291D0992489K201978K363152K524451K780898L087746L174811L381849L648723
17283F4156097L853105M094420M573609N159910N753751O544467P453813Q458998
17275A10048170R567383J0587038J1393581J1026843R384162P570699O748296
17268A76326172O792836O811129N927922M749991N163678P432812R807397J0222734
17260B33234671P606302L601525P39513k66972j274394m737873r705074j2643481
17252B16554217j1705801q580385n986342n290446o044691o872365o945621o929002
17244A58199564q107712j0625820j2713755j2819615j1489371r685217q071572
$$ plain form
17237 84686502 77807547 71965060 67020775 62746427 58987478 55727391 52846509 50204151
17229 50204151 47830891 45718820 43843603 42106355 40452508 38976062 37664836 36461545
17221 36461545 35281544 34200120 33218736 32281289 31357590 30584278 29916557 29306255 28714801
17212 28714801 28181287 27634121 27067271 26557354 26094171 25568973 25137507 24785643 24492653
17203 24492653 24165204 23914275 23670614 23297550 23043032 22824970 22692880 22515290 22286803
17194 22286803 22081725 21884936 21683141 21532371 21364360 21220042 21035713 20840537 20710333
17185 20710333 20576750 20483314 20429698 20247933 19988550 19737819 19446447 19081734 18923457 18725583
17175 18725583 18454399 18221399 18012770 17756875 17476326 17210733 16867717 16488534 16213640
$$ packed form
17237H4686502o878955n842487m944285m274348l758949l260087k880882k642358
17229E0204151k373260k112071j875217j737248j653847j476446j311226j203291
17221C6461545j180001j081424r81384r37447r23699p73312o67721o10302n91454
17212B8714801n33514n47166n66850n09917m63183n25198m31466l51864k92990
17203B4492653l27449k50929k43661l73064k54518k18062j32090j77590k28487
17194B2286803k05078j96789k01795j50770j68011j44318j84329j95176j30204
17185B0710333j33583r3436n3616j81765k59383k50731k91372l64713j58277j97874
17175A8725583k71184k33000k08629k55895k80549k65593l43016l79183k74894
$$ plain form
17166 16213640 15907332 15562616 15322767 15047705 14784410 14498311 14220037 13950591 13788289
17157 13788289 13564426 13356437 13083297 12904402 12666481 12471129 12360988 12199027 12003057
17148 12003057 11840061 11629831 11493882 11368869 11284948 11153989 11109487 11140866 11031392 10918749
17138 10918749 10827751 10704368 10547600 10506342 10385395 10342513 10273374 10191874 10110496 10088825
17128 10088825 10047623 10036214 9943992 9859828 9824450 9813370 9761565 9733815 9636539 9486382 9431579
17117 9431579 9293760 9249211 9197361 9172461 9137636 9053209 8996787 8989224 8990213 8931030 8948309 8933944
17105 8933944 8923442 8960245 8902297 8784397 8812254 8903199 8963935 8954674 8963027 8972037 8946500 8960290
17093 8960290 8997801 9093468 9187066 9220109 9239886 9203676 9174437 9187006 9194408 9224767 9328594
$$ packed form
17166A6213640l06308l44716k39849k75062k63295k86099k78274k69446j62302
17157A3788289k23863k07989k73140j78895k37921j95352j10141j61961j95970
17148A2003057j62996k10230j35949j25013q3921j30959m4502L1379j09474j12643
17138A0918749r0998j23383j56768m1258j20947m2882o9139q1500q1378k1671
17128A0088825m1202j1409r2222q4164l5378j1080n1805k7750r7276j50157n4803
17117I431579j37819m4549n1850k4900l4825q4427n6422p563R89n9183J7279j4365
17105H933944j0502L6803n7948j17900K7857R0945O0736r261Q353R010k5537J3790
17093H960290L7511R5667R3598L3043J9777l6210k9239J2569P402L0359J03827
$$ plain form
17082 9328594 9385664 9444310 9464819 9475358 9544673 9687580 9799054 9852084 9870573 9915911 9934682
17071 9934682 10011068 10160639 10257885 10356385 10458561 10560127 10744522 10962984 11086575 11276064
17061 11276064 11524209 11738201 11936639 12152417 12376897 12580130 12755147 13000613 13274479
17052 13274479 13508982 13702584 14012941 14281198 14568139 14881802 15177709 15449436 15754694
17043 15754694 16099879 16513936 16926334 17327167 17718996 18141925 18535011 18943956 19398847
17034 19398847 19886616 20358093 20880919 21420686 22004138 22645940 23187312 23792158 24419501
17025 24419501 25072792 25770595 26497556 27234936 27948277 28779921 29715988 30679771 31638094
17016 31638094 32645500 33684211 34777081 35944886 37236429 38550953 39936968 41410668
$$ packed form
17082I328594N7070N8646K0509J0539O9315J42907J11474N3030J8489M5338J8771
17071I934682P6386J49571R7246R8500J02176J01566J84395K18462J23591J89489
17061A1276064K48145K13992J98438K15778K24480K03233J75017K45466K73866
17052A3274479K34503J93602L10357K68257K86941L13663K95907K71727L05258
17043A5754694L45185M14057M12398M00833L91829M22929L93086M08945M54891
17034A9398847M87769M71477N22826N39767N83452O41802N41372O04846O27343
17025B4419501O53291O97803P26961P37380P13341Q31644R36067R63783R58323
17016C1638094J007406J038711J092870J167805J291543J314524J386015J473700
$$ plain form
17008 41410668 42962443 44567500 46267265 48035319 50072699 52325614 54600501 56943156
17000 56943156 59500541 62206296 65099170 68181958 71437719 74882483 78542850 82577469
16992 82577469 86942509 91636938 96646455 102076312 108023382 114452369 121503558 129114583
16984 129114583 137231258 145853281 155156223 165039860 175696726 187147963 199649422
16977 199649422 213449335 228981787 246717157 267071262 290566581 317928456 349559631
16970 349559631 385241456 423061951 458114163 485082755 502747943 514742430 524801715
16963 524801715 531860416 530830503 520392294 506628676 497071408 494550857 495687170 494206871
16955 494206871 486418572 474004235 460282783 444846912 422571972 389649460 349610698
$$ packed form
17008D1410668J551775J605057J699765J768054K037380K252915K274887K342655
17000E6943156K557385K705755K892874L082788L255761L444764L660367M034619
16992H2577469M365040M694429N009517N429857N947070O428987P051189P611025
16984A29114583Q116675Q622023R302942R883637J0656866J1451237J2501459
16977A99649422J3799913J5532452J7735370K0354105K3495319K7361875L1631175
16970C49559631L5681825L7820495L5052212K6968592J7665188J1994487J0059285
16963E24801715P058701j029913j0438209j3763618r557268k520551J136313j480299
16955D94206871p788299j2414337j3721452j5435871k2274940l2922512m0038762
$$ plain form
16948 349610698 309687587 274510467 245206991 220948594 200472483 182961190 167982405
16941 167982405 155109186 144114977 134713813 126403445 119012713 112383973 106510405 101317254
16933 101317254 96636156 92373137 88400639 84851964 81619770 78566205 75690003 73075411
16925 73075411 70659942 68428862 66301439 64401314 62742034 61138135 59627876 58286504
16917 58286504 56989128 55596261 54295180 53082250 51956876 50909837 49924273 49037951
16909 49037951 48189664 47404843 46667075 45927319 45237283 44647965 43993289 43427460 42904253
16900 42904253 42435351 41958752 41518429 41162783 40874655 40628267 40347568 40218244 40153685
16891 40153685 40004604 39789362 39484188 39071215 38617744 38135105 37683279 37192316 36826266
$$ packed form
16948C49610698l9923111l5177120k9303476k4258397k0476111j7511293j4978785
16941A67982405j2873219j0994209r401164q310368p390732o628740n873568n193151
16933A01317254m681098m263019l972498l548675l232194l053565k876202k614592
16925G3075411k415469k231080k127423j900125j659280j603899j510259j341372
16917E8286504j297376j392867j301081j212930j125374j047039r85564q86322
16909D9037951q48287p84821p37768p39756o90036n89318o54676n65829n23207
16900D2904253m68902m76599m40323l55646k88128k46388k80699j29324o4559
16891D0153685j49081k15242l05174m12973m53471m82639m51826m90963l66050
$$ plain form
16882 36826266 36553049 36173023 35775327 35349289 34786291 34105549 33363373 32640500 31781480
16873 31781480 30984490 30278690 29572322 28842811 28094264 27264652 26507720 25818960 25162173
16864 25162173 24524231 23880801 23262749 22733627 22199122 21617580 21010832 20456977 20000238
16855 20000238 19515130 18991570 18531670 18097469 17727424 17282266 16790869 16389912 16034451
16846 16034451 15693434 15280769 14904130 14538067 14159197 13839577 13530148 13208328 12898991
16837 12898991 12665082 12388794 12124977 11793875 11470607 11134393 10774998 10547462 10316974
16828 10316974 10055978 9751164 9426991 9143594 8965858 8819790 8629589 8340197 8015207
16819 8015207 7806750 7528803 7258513 7015685 6835191 6576502 6309554 6126693 5865630
$$ packed form
16882C6826266k73217l80026l97696m26038n62998o80742p42176p22873q59020
16873C1781480p96990p05800p06368p29511p48547q29612p56932o88760o56787
16864B5162173o37942o43430o18052n29122n34505n81542o06748n53855m56739
16855B0000238m85108n23560m59900m34201l70045m45158m91397m00957l55461
16846A6034451l41017m12665l76639l66063l78870l19620l09429l21820l09337
16837A2898991k33909k76288k63817l31102l23268l36214l59395k27536k30488
16828A0316974k60996l04814l24173k83397j77736j46068j90201k89392l24990
16819H015207k08457k77947k70290k42828j80494k58689k66948j82861k61063
$$ plain form
16810 5865630 5583040 5381563 5215783 5158968 5018600 4885166 4664850 4606399 4421732 4248559
16800 4248559 4166900 4088255 4009544 3944173 3906649 3875750 3759067 3634691 3600751 3558954 3523638
16789 3523638 3468414 3380116 3299829 3280386 3289316 3295593 3293282 3306752 3293885 3308484 3304474 3298277
16777 3298277 3262932 3200820 3143528 3095834 3051062 3139634 3188131 3163503 3154799 3161055 3130432 3092730
16765 3092730 3098852 3020808 2964658 3039364 3164542 3247709 3343043 3320878 3298968 3382847 3451660
16754 3451660 3446414 3388299 3452918 3434683 3438447 3442652 3505633 3628810 3668801 3642140 3646291 3707632
16742 3707632 3727281 3699311 3671242 3708921 3735857 3685727 3760066 3766437 3724517 3801820 3875786
16731 3875786 3909246 3858712 3847176 3891624 3994474 3974281 4009296 4090799 4077206 4134926 4161803
$$ packed form
16810E865630k82590k01477j65780n6815j40368j33434k20316n8451j84667j73173
16800D248559q1659p8645p8711o5371l7524l0899j16683j24376l3940m1797l5316
16789C523638n5224q8298q0287j9443Q930O277k311J3470j2867J4599m010o197
16777C298277l5345o2112n7292m7694m4772Q8572M8497k4628q704O256l0623l7702
16765C092730O122p8044n6150P4706J25178Q3167R5334k2165k1910Q3879O8813
16754C451660n246n8115O4619j8235L764M205O2981J23177L9991k6661M151O1341
16742C707632J9649k7970k8069L7679K6936n0130P4339O371m1920P7303P3966
16731C875786L3460n0534j1536M4448J02850k0193L5015Q1503j3593N7720K6877
$$ plain form
16720 4161803 4235264 4244503 4180519 4234319 4285413 4297151 4336765 4336045 4253932 4295084 4413385 4512742
16708 4512742 4512695 4452856 4382461 4338260 4257968 4086534 3969357 3885331 3847970 3764295 3689204
16697 3689204 3665682 3509047 3396854 3308757 3237585 3045418 2900983 2862299 2776951 2700064
16687 2700064 2692740 2657712 2649057 2639800 2615604 2590881 2522214 2424145 2404598 2340362 2330658 2340695
16675 2340695 2215150 2114019 2067239 2040159 2061996 2088467 2112588 2069506 2057378 2101089 2129117
16664 2129117 2063456 2040548 2005492 1909771 1849363 1804583 1813796 1835347 1850690 1951573 1977903
16653 1977903 1910233 1840335 1807995 1785320 1645508 1537217 1544908 1521441 1512876 1558529 1608513
16642 1608513 1582209 1493855 1379849 1385798 1355863 1296264 1341549 1312561 1340047 1339666 1270929 1238688
$$ packed form
16720D161803P3461R239o3984N3800N1094J1738L9614p20q2113M1152J18301R9357
16708D512742m7n9839p0395m4201q0292j71434j17177q4026l7361q3675p5091
16697C689204k3522j56635j12193q8097p1172j92167j44435l8684q5348p6887
16687B700064p324l5028q655r257k4196k4723o8667r8069j9547o4236r704J0037
16675B340695j25545j01131m6780k7080K1837K6471K4121m3082j2128M3711K8028
16664B129117o5661k2908l5056r5721o0408m4780R213K1551J5343J00883K6330
16653A977903o7670o9898l2340k2675j39812j08291P691k3467q565M5653M9984
16642A608513k6304q8354j14006N949k9935n9599M5285k8988K7486l81o8737l2241
$$ plain form
16630 1238688 1223718 1191599 1191738 1177119 1196358 1187136 1185933 1246424 1297728 1291972 1223966 1241908
16618 1241908 1212517 1210876 1225184 1133358 1106122 1147911 1117817 1059173 1129463 1107824 1094929
16607 1094929 1070923 1071647 1102576 1084066 1097773 1238528 1247257 1242824 1245367 1268826 1224440 1208014
16595 1208014 1271989 1289458 1294906 1258323 1192893 1144217 1201123 1332059 1350193 1342752 1330789
16584 1330789 1302793 1277370 1322855 1329277 1255249 1278881 1303692 1332643 1328083 1261529 1231511 1298442
16572 1298442 1340433 1327714 1276563 1211186 1147301 1156060 1162071 1202287 1191026 1246902 1239217 1288997
16560 1288997 1320947 1330415 1256605 1260803 1269973 1299413 1260969 1131325 1131337 1125367 1119302 1109373 1042688
16547 1042688 1042708 1032388 1063021 1045022 1016619 1082835 1077728 984067 938585 963939 983281 990442
$$ packed form
16630A238688j4970l2119J39j4619J9239r222j203O0491N1304n756o8006J7942
16618A241908k9391j641J4308r1826k7236M1789l0094n8644P0290k1639j2895
16607A094929k4006P24L0929j8510J3707J40755Q729m433K543K3459m4386j6426
16595A208014O3975J7469N448l6583o5430m8676N6906J30936J8134p441j1963
16584A330789k7996k5423M5485O422p4028K3632K4811K8951m560o6554l0018O6931
16572A298442M1991j2719n1151o5377o3885Q759O011M0216j1261N5876p685M9780
16560A288997L1950R468p3810M198R170K9440l8444j29644J2n970o065r929o6685
16547A042688K0j0320L0633j7999k8403O6216n107r3661m5482K5354J9342P161
$$ plain form
16535 990442 993841 972218 995833 999358 998185 1029733 990436 910616 835375 829640 834403 814846
16523 814846 789447 832410 881050 861834 834995 852636 831954 725621 685601 801031 901666
16512 901666 864104 770739 792894 830390 831059 725413 708432 814907 812349 750492 680698 632594
16500 632594 712190 764086 785701 808256 807475 722538 682018 746832 771942 832974 841438 859858
16488 859858 828598 788829 769704 825930 826317 824635 801765 846328 828332 810986 802170 853317
16476 853317 888285 985553 993191 989680 960894 1018480 1070590 1127868 1167427 1166958 1218802 1287475
16464 1287475 1318170 1335487 1414315 1519814 1616271 1723281 1704168 1802065 1885708 2048060 2251635
16453 2251635 2351357 2436567 2483781 2542673 2640872 2612094 2651216 2798479 2853679 2901256 3008878
$$ packed form
16535I90442L399k1623K3615L525j173L1548l9297p9820p5241n735M763j9557
16523H14846k5399M2963M8640j9216k6839J7641k0682j06333m0020J15430J00635
16512I01666l7562r3365K2155L7496O69j05646j6981J06475k558o1857o9794m8104
16500F32594P9596N1896K1615K2555p81q4937m0520O4814K5110O1032Q464J8420
16488H59858l1260l9769j9125N6226L87j682k2870M4563j7996j7346q816N1147
16476H53317L4968R7268P638l511k8786N7586N2110N7278L9559m69N1844O8673
16464A287475L0695J7317P8828J05499R6457J07010j9113R7897Q3643J62352K03575
16453B251635R9722Q5210M7214N8892R8199k8778L9122J47263N5200M7577J07622
$$ plain form
16442 3008878 3073996 3039611 3097557 3093271 3027242 2967389 2842053 2736407 2630879 2535079 2421531
16431 2421531 2361717 2307877 2182038 2130395 2142339 2108686 2023300 1910771 1689329 1469919
16421 1469919 1480110 1431052 1390023 1292705 1251990 1177708 1093558 986794 973720 1026695 1000337
16410 1000337 994407 947135 919019 922768 926871 867876 882678 876787 805378 818443 733082 682819
16398 682819 741172 794697 781577 766606 772702 811558 810417 884755 863486 665594 578137 569336
16386 569336 597434 633331 685865 714800 677835 641233 621020 584714 559546 553692 558183 571013
16374 571013 568426 483388 434095 412971 381888 429472 495896 557575 589164 503406 510846 526809
16362 526809 563276 600245 561117 609587 600753 573513 484426 455257 451632 467345 508588 517084
$$ packed form
16442C008878O5118l4385N7946m286o6029n9853j25336j05646j05528r5800j13548
16431B421531n9814n3840j25839n1643J1944l3653q5386j12529k21442k19410
16421A469919J0191m9058m1029r7318m0715p4282q4150j06764j3074N2975k6358
16410A000337n930m7272k8116L749M103n8995J4802n891p1409J3065q5361n0263
16398F82819N8353N3525j3120j4971O096L8856j141P4338k1269j97892q7457q801
16386E69336K8098L5897N2534K8935l6965l6602k0213l6306k5168n854M491J2830
16374E71013k587q5038m9293k1124l1083M7584O6424O1679L1589q5758P440J5963
16362E26809L6467L6969l9128M8470q834k7240q9087k9169l625J5713M1243Q496
$$ plain form
16350 517084 575089 561606 512858 480467 431240 358059 358011 343190 376084 357535 363346 309988
16338 309988 303440 341272 302688 327881 357528 401948 401313 421614 369302 308930 300507 321098
16326 321098 396716 399872 339423 301176 214864 185258 156638 164412 239990 313265 393398 395317
16314 395317 434098 359666 307119 391223 380484 261925 215836 219648 151211 172906 241528
16303 241528 240766 257607 238110 248376 263072 258000 292984 342914 285449 263468 258377 262371
16291 262371 297105 314546 267217 202951 257822 332769 347506 294772 216747 245192 230660
16280 230660 117631 142981 152931 176760 166253 149735 150621 231046 240688 263096 235277 239110
16268 239110 196330 239335 328514 269531 256547 283051 175838 154190 268512 278705 265654
$$ packed form
16350E17084N8005j3483m8748l2391m9227p3181m8j4821L2894j8549N811n3358
16338C09988o548L7832l8584K5193K9647M4420o35K0301n2312o0372q423K0591
16326C21098P5618L156o0449l8247q6312k9606k8620P774P5578P3275Q0133J919
16314C95317L8781p4432n2547Q4104j0739j18559m6089L812o8437K1695O8622
16303B41528p62J6841j9497J0266J4696n072L4984M9930n7465k1981n091L994
16291B62371L4734J7441m7329o4266N4871P4947J4737n2734p8025K8445j4532
16280B30660j13029K5350R950K3829j0507j6518Q86Q0425R642K2408k7819L833
16268B39110m2780M3005Q9179n8983j2984K6504j07213k1648J14322J0193j3051
$$ plain form
16257 265654 276845 211931 186419 187740 175548 170128 101957 124657 219570 259190 259802 207847
16245 207847 251596 339114 412836 298892 316375 325159 316411 274582 235128 237394 257448 312672
16233 312672 259783 230891 264358 269960 219475 244804 291575 241171 267064 285018 279912 225097
16221 225097 227994 278692 242009 155116 88990 84500 144260 206013 279398 271570 146163 70220
16209 70220 123676 108785 115891 136702 184420 164099 167935 194922 187442 103915 74230 86228
16197 86228 137146 228458 193238 145718 202686 211270 236818 186598 135814 114953 143776 219875
16185 219875 203404 152715 161595 194187 216260 211881 164404 152626 140603 146809 257392 348274
16173 348274 356439 320751 266027 221313 154863 45494 117841 211111 165565 100924 123009
$$ packed form
16257B65654J1191o4914k5512J321j2192n420o8171K2700R4913L9620O12n1955
16245B07847M3749Q7518P3722j13944J7483Q784q748m1829l9454K266K0054N5224
16233C12672n2889k8892L3467N602n0485K5329M6771n0404K5893J7954n106n4815
16221B25097K897N0698l6683q6893o6126m490N9760O1753P3385p828j25407p5943
16209G0220N3456j4891P106K0811M7718k0321L836K6987p480q3527k9685J1998
16197H6228N0918R1312l5220m7520N6968Q584K5548n0220n0784k0861K8823P6099
16185B19875j6471n0689Q880L2592K2073m379m7477j1778j2023O206J10583R0882
16173C48274Q165l5688n4724m4714o6450j09369P2347R3270m5546o4641K2085
$$ plain form
16162 123009 175725 121562 55926 21728 86383 64974 56347 129050 130648 21384 26524 69147
16150 69147 66968 107389 100737 151126 129161 88349 122504 101717 70791 77564 93534 72508
16138 72508 31908 31503 28215 69923 54082 47748 110932 149250 147132 124600 85601 -34589
16126 -34589 -58807 -26515 -65900 4112 128361 187294 179740 185273 212534 152964 77144 24357
16114 24357 54715 88912 115523 124547 64018 -42196 -31859 49770 11986 9636 25151 -8704
16102 -8704 4446 59044 106851 126318 56039 65151 86803 101032 42709 48851 39494 47790 63097
16089 63097 103049 66010 9190 64363 40620 94023 141279 144692 160370 144220 160778 194219
16077 194219 227555 223234 220768 141591 140196 110849 112641 128950 128221 136748 171635 148606 201416
$$ packed form
16162A23009N2716n4163o5636l4198O4655k1409q627P2703J598j09264N140M2623
16150F9147k179M0421o652N0389k1965m0812L4155k0787l0926O773J5970k1026
16138G2508m0600m05l288M1708j5841o334O3184L8318k118k2532l8999j20190
16126c4589k4218L2292l9385P0012J24249N8933p554N533K7261n9570p5820n2787
16114B4357L0358L4197K6611R024o0529j06214J0337Q1629l7784k350J5515l3855
16102h704J3150N4598M7807J9467p0279R112K1652J4229n8323O142r357Q296J5307
16089F3097L9952l7039n6820N5173k3743N3403M7256L413J5678j6150J6558L3441
16077A94219L3336m321k466p9177j395k9347J792J6309p29Q527L4887k3029N2810
$$ plain form
16064 201416 247588 208858 105115 55265 115584 174801 130862 123254 124620 119674 156210 215135
16052 215135 201880 139233 87261 67699 107865 179895 257234 253270 219081 148936 104624 145688
16040 145688 141917 77688 51554 38652 54404 89843 137350 168830 124403 156716 214740 188746
16028 188746 149592 90790 49293 60298 49451 58508 64136 122002 118581 154822 155220 165567
16016 165567 160878 88616 41494 34644 28242 26400 9025 15714 16095 -39775 -29743 48771 62750
16003 62750 50360 72794 108100 74144 79857 115984 128488 105829 37639 -18780 -9014 80535
15991 80535 90563 68204 69042 52549 8728 -46601 -58107 21317 65600 88404 69918 74449
15979 74449 52736 10582 -7627 37132 36589 70954 72007 13071 -54457 -47786 -98268 -149320
$$ packed form
16064B01416M6172l8730j03743m9850O0319N9217m3939p608J366m946L6536N8925
16052B15135j3255o2647n1972j9562M0166P2030P7339l964l4189p0145m4312M1064
16040A45688l771o4229k6134j2902J5752L5439M7507L1480m4427L2313N8024k5994
16028A88746l9154n8802m1497J1005j0847R057N628N7866l421L6241L98J0347
16016A65567m689p2262m7122o850o402j842j7375O689L81n5870J0032P8514J3979
16003F2750j2390K2434L5306l3956N713L6127J2504k2659o8190n6419R766Q9549
15991H0535J0028k2359Q38j6493m3821n5329j1506P9424M4283K2804j8486M531
15979G4449k1713m2154j8209M4759n43L4365J053n8936o7528O671n0482n1052
$$ plain form
15967 -149320 -51483 -45926 -63484 -10459 9369 97692 160472 178135 97798 -3246 -41249
15956 -41249 -68419 -55718 -13156 8468 62923 38663 -11270 -57988 9261 14128 -25275 -45762
15944 -45762 -28894 -36587 -36098 -20790 -34650 -70941 -11996 26420 101221 48496 47929 62668 102076
15931 102076 81353 58572 76291 52017 50441 43712 63811 122516 132604 93599 75663 60187
15919 60187 50649 48232 43650 119591 141619 203869 107786 52467 449 -31118 -58965 -80689
15907 -80689 -46470 -60756 -67472 4443 31524 89375 107560 112831 57832 -7911 -18781 -67002
15895 -67002 -21259 -24963 16029 29591 8079 -25903 12392 68509 70055 -16110 -86314 -64300
15883 -64300 -83408 -53740 13849 -6626 37195 -6135 30851 104212 54543 11718 -9529 46250
$$ packed form
15967a49320R7837N557j7558N3025J9828Q8323O2780J7663q0337j01044l8003
15956d1249k7170J2701M2562K1624N4455k4260m9933m6718O7249M867l9403k0487
15944d5762J6868p693M89J5308j3860l6291N8945L8416P4801n2725n67J4739L9408
15931A02076k0723k2781J7719k4274j576o729K0099N8705J0088l9005j7936j5476
15919F0187r538k417m582P5941K2028O2250r6083n5319n2018l1567k7847k1724
15907h0689L4219j4286o716P1915K7081N7851J8185N271n4999o5743j0870m8221
15895f7002M5743l704M0992J3562k1512l3982L8295N6117J546q6165p0204K2014
15883f4300j9108K9668O7589k0475M3821m3330L6986P3361m9669m2825k1247N5779
$$ plain form
15871 46250 163121 119454 95678 87385 72373 -4220 -3998 -1580 44414 21801 59019 105105
15859 105105 96971 143754 111147 61720 -17290 -125673 -144618 -92001 -46213 -30103 -26750 47815
15847 47815 107894 82241 62453 30134 20092 54261 93259 3845 9494 46472 -21082 -57984
15835 -57984 -49797 -65595 -71134 -71228 -57679 -11535 78162 136614 158424 163812 88200 171843 221817
15822 221817 236076 207135 84475 -24650 19846 98794 139370 138236 145802 122197 60568
15811 60568 38051 68174 146722 153838 62292 19771 40954 90886 19058 28596 69521 70958
15799 70958 43026 23149 11887 -77312 -122185 -95491 -53561 -27770 -80153 -35031 1987 -6697
15787 -6697 -43708 3116 10666 -26841 48818 88717 62480 54468 -18830 -117322 -117837 -38962 -76581
$$ packed form
15871D6250J16871m3667k3776q293j5012p6593K22K418M5994k2613L7218M6086
15859A05105q134M6783l2607m9427p9010j08383j8945N2617M5788J6110L353P4565
15847D7815O0079k5653j9788l2319j0042L4169L8998q9414N649L6978o7554l6902
15835e7984Q187j5798n539r4J3549M6144Q9697N8452K1810N388p5612Q3643M9974
15822B21817J4259k8941j22660j09125M4496P8948M0576j134P566k3605o1629
15811F0568k2517L0123P8548P116r1546m2521K1183M9932p1828R538M0925J437
15799G0958k7932j9877j1262q9199m4873K6694M1930K5791n2383M5122L7018q684
15787f697l7011M6824P550l7507P5659L9899k6237q012p3298r8492n15P8875l7619
$$ plain form
15774 -76581 -108985 -63164 -49043 -80132 -128647 -129682 -124561 -88356 13010 30006 22453 35171
15762 35171 11943 -69141 -96528 -22735 58411 40426 68860 -5858 -39739 -47611 -34827 2634
15750 2634 27675 2440 -1644 -17 21159 29015 -2717 39591 83502 19356 48591 124748
15738 124748 158872 76231 3582 -68070 -129694 -120970 -37545 -65080 25242 34863 -15438 -17063
15726 -17063 24719 90346 75746 76514 86695 82151 -8349 -40944 -61353 -43173 6078 20293
15714 20293 14221 -11277 -8861 52027 35077 27264 3275 -44810 -93217 -171616 -129862 2644
15702 2644 95377 64312 45824 23839 49600 58782 80605 100537 58829 -7920 -3854 17148
15690 17148 -39198 -25648 -67240 -70312 -76590 -137120 -209039 -139482 -116572 -94689 -3770 -6705
$$ packed form
15774g6581l2404M5821J4121l1089m8515j035N121L6205J01366J6996p553J2718
15762C5171k3228q1084k7387P3793Q1146j7985K8434p4718l3881p872J2784L7461
15750B634K5041k5235m084J627K1176P856l1732M2308M3911o4146K9235P6157
15738A24748L4124q2641p2649p1652o1624Q724Q3425k7535R0322R621n0301j625
15726a7063M1782O5627j4600P68J0181m544r0500l2595k0409J8180M9251J4215
15714B0293o072k5498K416O0888j6950p813k3989m8085m8407p8399M1754J32506
15702B644R2733l1065j8488k1985K5761R182K1823J9932m1708o6749M066K1002
15690A7148n6346J3550m1592l072o278o0530p1919O9557K2910K1883R0919k935
$$ plain form
15678 -6705 16395 58261 35744 51361 52417 98276 122882 132130 87916 -4071 -34257 64032
15666 64032 102589 19876 -87400 -76704 -54545 -33155 -41228 -46589 -100264 -109913 -100095 -128910
15654 -128910 -176956 -151160 -144725 -131503 -144969 -56291 -59106 -29337 -45007 -43580 -90254 -136121
15642 -136121 -114371 -54409 -33518 11233 33304 -30655 -49833 -6608 32031 45140 37400 35396
15630 35396 -59160 -85816 -53526 -70077 -83465 -62035 1799 38307 -53975 -4721 53401 22114
15618 22114 -21083 -71622 -21291 20851 -31092 -96867 -76065 21804 127510 125819 67330 51956
15606 51956 -65048 -103919 -63997 -82815 -100190 -111024 -57401 21500 60602 81330 77193 134343
15594 134343 194705 108396 -22254 -98925 -132092 -33953 48690 23937 -54159 -55101 7011 108545
$$ packed form
15678f705K3100M1866k2517J5617J056M5859K4606R248m4214r1987l0186R8289
15666F4032L8557q2713j07276J0696K2159K1390q073n361n3675r649R818k8815
15654a28910m8046K5796O435J3222j3466Q8678k815K9769j5670J427m6674m5867
15642a36121K1750N9962K0891M4751K2071o3959j9178M3225L8639J3109p740k004
15630C5396r4556k6656L2290j6551j3388K1430O3834L6508r2282M9254N8122l1287
15618B2114m3197n0539N0331M2142n1943o5775K0802R7869J05706j691n8489j5374
15606E1956j17004l8871L9922j8818j7375j0834N3623P8901L9102K0728m137N7150
15594A34343O0362q6309j30650p6671l3167R8139Q2643k4753p8096r42O2112J01534
$$ plain form
15582 108545 125609 88947 79965 104670 7165 -39462 -26615 -82051 -40667 50836 39947 -54799
15570 -54799 -54006 -135820 -139221 -233633 -221388 -87720 -64725 -45154 -75204 -106018 -38224 -22600
15558 -22600 -25213 -35503 -91122 -105549 -74619 -47722 12200 12196 40553 7461 -56730 -50693 -64901
15545 -64901 -62281 -126605 -221157 -133112 -51841 -20179 -82430 -78303 19428 39079 -16145 -77923
15533 -77923 -65487 -117512 -158545 -26278 36528 55775 -1425 -76300 -148441 -135627 -117979
15522 -117979 -85956 -65094 -21240 68149 15690 -69124 -140169 -130103 -115944 -53788 -56357 -93398
15510 -93398 -32316 18185 -34923 -88341 -67230 -85432 -18981 29956 16121 -53460 -62942 -87798
15498 -87798 -82686 -110160 -103724 -60431 70849 105562 44751 38 -24542 53328 57993 13139
$$ packed form
15582A08545J7064l6662q982K4705r7505m6627J2847n5436M1384R1503j0889r4746
15570e4799P93q1814l401r4412J2245J33668K2995J9571l0050l0814O7794J5624
15558b2600k613j0290n5619j4427L0930K6897N9922mK8357l3092o4191O037j4208
15545f4901K620o4324r4552Q8045Q1271L1662o2251M127R7731J9651n5224o1778
15533g7923J2436n2025m1033J32267O2806J9247n7200p4875p2141J2814J7648
15522a17979L2023K0862M3854Q9389n2459q4814p1045J0066J4159O2156k569l7041
15510i3398O1082N0501n3108n3418K1111j8202O6451M8937j3835o9581r482k4856
15498h7798N112k7474O436M3293J31280L4713o0811m4713k4580P7870M665m4854
$$ plain form
15486 13139 -97702 -163230 -167746 -121426 -44889 -38702 -31751 55180 7885 -33606 -34275 19391
15474 19391 96407 -10254 -149109 -124213 -36774 29842 5187 41142 65256 -9900 35926
15463 35926 42554 -39306 -27462 -33468 -116044 -80108 -52722 -75554 -3924 51837 14137 8869
15451 8869 49048 15710 -3490 -27024 346 61602 13185 -97448 -153424 -89275 -59778 -123882
15439 -123882 -95067 -24278 -43649 -51956 -2272 32047 12172 -39165 -39295 -88020 -143325 -106840
15427 -106840 -43065 -56411 -81556 -54140 -27881 8828 53652 73386 47951 15193 50412
15416 50412 129142 121795 96343 16099 -76115 -26339 77163 136181 126692 99563 82295 63431
15404 63431 13006 -1525 -14169 34480 66488 31360 15472 62311 105503 77357 8141 -14527
$$ packed form
15486A3139j10841o5528m516M6320P6537O187O951Q6931m7295m1491o69N3666
15474A9391P7016j06661j38855K4896Q7439O6616k4655L5955K4114p5156M5826
15463C5926O628q1860J1844o006q2576L5936K7386k2832P1630N5761l7700n268
15451H869M0179l3338j9200k3534K7370O1256m8417j10633n5976O4149K9497o4104
15439a23882K8815P0789j9371q307M9684L4319j9875n1337j30m8725n5305L6485
15427a06840O3775j3346k5145K7416K6259L6709M4824J9734k5435l2758L5219
15416E0412P8730p347k5452q0244r2214M9776J03502N9018r489k7129j7268j8864
15404F3431n0425j4531j2644M8649L2008l5128j5888M6839M3192k8146o9216k2668
$$ plain form
15392 -14527 28553 13843 24442 60194 -32126 -23165 -15709 -50463 -24273 11327 -6392 19499
15380 19499 -42707 -64688 -38646 -8820 -43585 -74307 -47874 11760 -7130 -61646 -91875 -56837
15368 -56837 -18057 13367 46172 -16281 2317 16707 42223 -15384 -98387 -136581 -133673 -61691
15356 -61691 8522 34638 92091 70803 3816 -30144 -40478 -36859 -7525 7482 26829 39685
15344 39685 20798 -1325 16133 12792 -10421 -38285 -111559 -131758 -80215 -125704 -132902 -72709
15332 -72709 -12333 -62739 -109265 -180205 -177979 -108039 -13582 11556 23169 -8589 -6711 -42490
15320 -42490 -89272 -91963 -156197 -90435 35798 98241 88925 75100 31602 -24341 -15195 -1730
15308 -1730 -6537 -93813 -116777 -81363 -32874 -28006 -3272 19764 -25467 -11147 -13609 -49490
$$ packed form
15392a4527M3080j4710J0599L5752r2320Q961P456l4754K6190L5600j7719K5891
15380A9499o2206k1981K6042K9826l4765l0722K6433N9634j8890n4516l0229L5038
15368e6837L8780L1424L2805o2453J8598J4390K5516n7607q3003l8194K908P1982
15356f1691P0213K6116N7453k1288o6987l3960j0334L619K9334J5007J9347J2856
15344C9685j8887k2123J7458l341k3213k7864p3274k0199N1543m5489p198O0193
15332g2709O0376n0406m6526p0940K226O9940R4457K5138J1613l1758J878l5779
15320d2490m6782k691o4234O5762J26233O2443r316j3825m3498n5943R146J3465
15308a730m807q7276k2964L5414M8489M868K4734K3036m5231J4320k462l5881
$$ plain form
15296 -49490 9002 69178 20685 -61028 -76142 -72687 -99733 -160795 -126308 -9618 55213 41013
15284 41013 -6771 -682 -13634 44839 89065 22575 16381 35837 79958 41226 28296 18461
15272 18461 -61072 -52102 -60907 -63285 -76378 -78422 -50451 13630 -58052 -88819 -101276 -68051
15260 -68051 23086 68744 56185 -5903 -12460 3738 614 63012 148000 63437 -28206 -43974
15248 -43974 -71969 -50499 -19948 -80088 -127886 -194537 -269052 -306689 -176026 -123809 -96722
15237 -96722 -23880 8246 -23163 -45707 -61997 -64944 -105407 -60993 -56037 -102010 -103805 1852
15225 1852 11662 -376 30594 54054 28661 -31012 -44721 -55908 -63831 -67101 3255 -2845 6774
15212 6774 2074 -68693 -85059 -136083 -74668 -70737 -164040 -207271 -200890 -216132 -180866 -83538
$$ packed form
15296d9490N8492O0176m8493q1713j5114L455k7046o1062L4487J16690O4831j4200
15284D1013m7784O089j2952N8473M4226o6490o194J9456M4121l8732j2930r835
15272A8461p9533Q970q805k378j3093k044K7971O4081p1682l0767j2457L3225
15260f8051R1137M5658j2559o2088o557J6198l124O2398Q4988q4563r1643j5768
15248d3974k7995K1470L0551o0140m7798o6651p4515l7637J30663N2217K7087
15237i6722P2842L2126l1409k2544j6290k947m0463M4414M956m5973j795J05657
15225A852R810j2038L0970K3460k5393n9673j3709j1187p923l270P0356o100R619
15212F774m700p0767j6366n1024O1415L931r3303m3231O381j5242L5266R7328
$$ plain form
15200 -83538 -48231 -98893 -163305 -182264 -114525 -7490 55066 158721 158314 83948 -16100
15189 -16100 -61250 -159583 -146756 -48089 -30907 -14019 -49692 -93076 -104501 -40593 -17770 75918
15177 75918 78129 7216 -46084 -55070 -46959 -7768 44907 157610 164688 138114 25775 -16228
15165 -16228 20172 -50333 -126187 -101646 -89393 -79418 -27455 22769 26924 -39342 -19338 33225
15153 33225 17956 4089 29607 31388 75388 44429 46239 9960 -7426 -30889 -89882 -87344
15141 -87344 -30364 45465 3272 31734 -10423 -52057 30753 10083 -79057 -58578 15121 60659
15129 60659 64918 32745 22537 -27078 -11624 -5759 24122 93811 74174 83767 66165 44696
15117 44696 3468 -10218 34080 46945 -53718 -49519 -38023 -72800 -99724 -61835 -97406 -122354
$$ packed form
15200h3538L5307n0662o4412j8959O7739J07035O2556J03655m07p4366j00048
15189a6100m5150r8333J2827R8667J7182J6888l5673m3384j1425O3908K2823R3688
15177G5918K211p0913n3300q986Q111L9191N2675J12703P078k6574j12339m2003
15165a6228L6400p0505p5854K4541J2253R975N1963N0224M155o6266K0004N2563
15153C3225j5269j3867K5518J781M4000l0959J810l6279j7386k3463n8993K538
15141h7344N6980P5829m2193K8462m2157m1634Q2810k0670q9140K0479P3699M5538
15129F0659M259l2173j0208m9615J5454N865K9881O9689j9637R593j7602k1469
15117D4696m1228j3686M4298J2865j00663M199J1496l4777k6924L7889l5571k4948
$$ plain form
15105 -122354 -9069 119115 136384 73054 10282 46452 10406 -95798 -131964 -137473 -127724
15094 -127724 -125777 -117857 -60218 -35862 -42514 -30352 -24105 -26616 -94241 -35495 8288 21933
15082 21933 -6420 -32310 -49595 -18482 7488 -7492 -3471 -49464 -42174 -20877 -40415 36701
15070 36701 55155 82393 51679 27930 -20060 6993 72415 102561 67616 76705 58948 31748
15058 31748 38761 -53325 -68428 -458 40415 -18229 -98165 -87371 -50928 -4492 8523 63152
15046 63152 70593 107864 168935 99265 71000 -5031 -147759 -145806 -120615 -45434 -33671 -72845
15034 -72845 -47151 16776 7060 -26918 -53319 -84079 -83216 -71176 -49316 -68097 -70725 -59568
15022 -59568 -14813 -31134 29190 83670 84032 83602 115139 90000 1542 -27509 -47190 -55600 10979
$$ packed form
15105a22354J13285J28184J7269o3330o2772L6170l6046j06204l6166n509R749
15094a27724J947P920N7639K4356o652J2162O247k511o7625N8746M3783J3645
15082B1933k8353k5890j7285L1113K5970j4980M021m5993P290K1297j9538P7116
15070C6701J8454K7238l0714k3749m7990K7053O5422L0146l4945R089j7757k7200
15058C1748P013r2086j5103O7970M0873n8644p9936J0794L6443M6436J3015N4629
15046F3152P441L7271O1071o9670k8265p6031j42728J953K5191P5181J1763l9174
15034g2845K5694O3927r716l3978k6401l0760Q63J2040K1860j8781k628J1157
15022e9568M4755j6321O0324N4480L62m30L1537k5139q8458k9051j9681q410O6579
$$ plain form
15009 10979 48357 -8495 -30797 -49574 -87552 -65582 -4067 47858 55228 16192 36761 7319
14997 7319 39187 11830 21733 3399 -35141 -14087 -34905 -85237 -42000 12841 74035 117535
14985 117535 -5558 42631 83459 44116 25384 -79386 -77879 -78080 -71325 -77623 -93683 -111210
14973 -111210 -121537 -63326 -114779 -136558 -5252 29399 77102 58731 5487 -127 53638
14962 53638 -9328 -7395 -35526 -83459 -56697 -35161 24463 17444 -2844 -53701 -20460 -23845
14950 -23845 9854 -6084 -38244 -76965 -74362 -39563 -30139 -98650 -102259 31651 90405 74527
14938 74527 59521 -1902 -33474 -34904 -91562 -162671 -194632 -246636 -204025 -136583 -115304 -77012
14926 -77012 -87238 -47032 -40147 -68599 -58052 -85259 -67405 12157 -28394 -151165 -144052 -178015
$$ packed form
15009A0979L7378n6852k2302j8777l7978K1970O1515N1925P370l9036K0569k9442
14997G319L1868k7357R903j8334l8540K1054k0818n0332M3237N4841O1194M3500
14985A17535j23093M8189M0828l9343j8732j04770J507k01O755o298j6060j7527
14973a11210j0327N8211n1453k1779J31306L4651M7703j8371n3244n614N3765
14962E3638o2966J933k8131m7933K6762K1536N9624p019k0288n0857L3241l385
14950b3845L3699j5938l2160l8721K603L4799R424o8511l609J33910N8754j5878
14938G4527j5006o1423l1572j430n6658p1109l1961n2004M2611O7442K1279L8292
14926g7012j0226M0206O885k8452J0547k7207J7854P9562m0551j22771P113l3963
$$ plain form
14914 -178015 -103248 -56947 -94254 -119865 -78308 -29922 -13745 19626 -72169 -140873 -122823
14903 -122823 -97658 -68962 5840 15267 4814 -7005 -24927 -32502 -54116 -2600 56512 39064
14891 39064 -12269 -18707 -35515 -43231 -29223 -42270 -22916 -1107 -35454 -137797 -158596 -104174
14879 -104174 -96142 -174465 -208888 -138594 -102088 -60615 -33857 -41925 -111140 -72310 -32419 -63925
14867 -63925 -101466 -97190 -28854 -7330 -23262 -27755 -100453 -187824 -89685 26955 88904 47159
14855 47159 14745 25574 -7566 -8401 -2859 412 10430 27087 34892 -798 -69413 -81988 -142882
14842 -142882 -137402 -99862 -102181 -147991 -124326 -100541 -39071 17767 -5316 -27861 -10318 43218
14830 43218 63230 38441 55191 57029 17817 17777 -49043 -104549 -73877 -29502 -76615 -119300
$$ packed form
14914a78015P4767M6301l7307k5611M1557M8386J6177L3371r1795o8704J8050
14903a22823K5165K8696P4802R427j0453j1819j7922p575k1614N1516N9112j7448
14891C9064n1333o438j6808p716J4008j3047J9354K1809l4347j02343k0799N4422
14879a04174Q032p8323l4423P0294L6506M1473K6758q068o9215L8830L9891l1506
14867f3925l7541M276O8336K1524j5932m493p2698q7371R8139J16640O1949m1745
14855D7159l2414J0829l3140q35N542L271J0018J6657P805l5690o8615j2575o0894
14842a42882N480L7540k319m5810K3665K3785O1470N6838k3083k2545J7543N3536
14830D3218K0012k4789J6750J838l9212m0o6820n5506L0672M4375m7113m2685
$$ plain form
14818 -119300 -76944 5079 18717 -22453 26345 39822 23249 65405 71670 13769 -32490 -49382
14806 -49382 -22909 19213 15572 25350 30036 104221 118868 83175 82250 67376 -562 15727 -6372
14793 -6372 -57610 -79176 -39456 8958 16605 -44435 -20139 4351 23176 -34914 -46324 -13753
14781 -13753 -11338 21543 -4899 27589 -33966 -48279 11892 10630 -15984 -58193 -26276 -61038
14769 -61038 -52702 -1767 11347 -18500 33550 28519 -1246 15705 46422 57351 71115 45564
14757 45564 53504 10973 -39171 41380 117452 60190 -16827 -7902 11683 23154 16924 111382
14745 111382 110396 90518 -2948 -36018 -696 24677 -59138 -80034 -91286 -54645 -45231 -68978
14733 -68978 -84298 -109704 -34044 21402 -4801 -10207 -16321 -52043 -543 8879 -344 34585
$$ packed form
14818a19300M2356Q2023J3638m1170M8798J3477j6573M2156O265n7901m6259j6892
14806d9382K6473M2122l641R778M686P4185J4647l5693r25j4874o7938J6289k2099
14793f372n1238k1566L9720M8414P647o1040K4296K4490J8825n8090j1410L2571
14781a3753K415L2881k6442L2488o1555j4313O0171j262k6614m2209L1917l4762
14769f1038Q336N0935J3114k9847N2050n031k9765J6951L0717J0929J3764k5551
14757D5564P940m2531n0144Q0551P6072n7262p7017Q925J9585J1471o230R4458
14745A11382r86j9878r3466l3070L5322K5373q3815k0896j1252L6641R414k3747
14733f8978j5320k5406P5660N5446k6203n406o114l5722N1500R422r223L4929
$$ plain form
14721 34585 24116 -3291 -36191 -108609 -57142 10440 30232 3122 -30836 5485 10582 -14222
14709 -14222 -77261 -105445 -44658 -77861 -35030 -21822 -41567 -71753 -119404 -158049 -79374 10931
14697 10931 -28954 -719 -32530 4836 -39803 -16258 22054 55789 10300 -21404 -61047 -84858
14685 -84858 -84535 -103856 -127455 -158749 -61587 -41691 -81744 -140234 -127570 -88762 -83349 -127622
14673 -127622 -151248 -70990 -4919 -41864 -47137 -70404 -43456 -56024 -101276 -159279 -121124 -74124
14661 -74124 -41802 -36956 -4452 47711 27064 43218 -5972 -45143 -34475 -21450 -5002 33701
14649 33701 -14379 -59409 -54614 -54567 -122823 -117739 -100699 -114398 -106869 -157166 -101243 -48222 -102902
14636 -102902 -97194 -51327 10855 13564 -20668 -97232 -150616 -77631 -80438 -94644 -90978 -98316
$$ packed form
14721C4585j0469k7407l2900p2418N1467O7582J9792k7110l3958L6321N097k4804
14709a4222o3039k8184O0787l3203M2831J3208j9745l0186m7651l8645P8675R0305
14697A0931l9885K8235l1811L7366m4639K3545L8312L3735m5489l1704l9643k3811
14685h4858L23j9321k3599l1294R7162J9896m0053n8490J2664L8808N413m4273
14673a27622k3626Q0258O6071l6945n273k3267K6948j2568m5252n8003L8155M7000
14661g4124L2322M846L2504N2163k0647J6154m9190l9171J0668J3025J6448L8703
14649C3701m8080m5030M795M7o8256N084J7040j3699P529n0297N5923N3021n4680
14636a02902N708M5867O2182K709l4232p6564n3384P2985k807j4206L666p338
$$ plain form
14624 -98316 -68248 -28812 7165 -17960 -37470 -56660 -53795 7329 34156 23586 71960 84944
14612 84944 42611 43234 23149 48465 93873 119022 98863 92303 23290 17821 -41953 -75148
14600 -75148 -71703 -60338 -40848 -90520 -90868 -6326 52401 89791 64651 46195 54696 73577
14588 73577 110044 102605 -6902 -87442 -53624 -27700 -51397 -1531 36268 36245 -31040 -60553
14576 -60553 -126476 -72057 15907 60594 38312 -16163 -21117 -35995 -24112 5927 50151 54581
14564 54581 -15146 -10877 38805 70092 102843 96164 18627 -13678 -12064 -65438 -126587 -171115
14552 -171115 -73156 26688 26588 -40034 -8313 -19498 -22403 -3631 -82821 -149778 -182544 -134014
14540 -134014 -127415 -128757 -81689 -72094 -47164 -84700 -123729 -65990 -53815 -1153 -14645 -87022
$$ packed form
14624i8316L0068L9436L5977k5125j9510j9190K865O1124K6827j0570M8374J2984
14612H4944m2333O23k0085K5316M5408K5149k0159o560o9013n469n9774l3195
14600g5148L445J1365J9490m9672l48Q4542N8727L7390k5140j8456Q501J8881
14588G3577L6467p439j09507q0540L3818K5924k3697M9866L7799k3o7285k9513
14576f0553o5923N4419Q7964M4687k2282n4475m954j4878J1883L0039M4224M430
14564E4581o9727M269M9682L1287L2751o679p7537l2305J614n3374o1149m4528
14552a71115R7959R9844j00o6622L1721j1185k905J8772p9190o6957l2766M8530
14540a34014O599j342M7068R595K4930l7536l9029N7739J2175N2662j3492p2377
$$ plain form
14528 -87022 -27580 59847 35440 -47615 -109105 -159415 -130708 -8272 9072 -58261 -88676
14517 -88676 -33073 46275 100811 92579 -13447 -24018 27906 32002 45377 -23049 -20031 29332
14505 29332 80059 -3863 -4348 -40584 12095 29769 15348 -27575 -23627 -17535 -31294 1433
14493 1433 16746 46861 14537 23091 45673 30063 33698 57789 -13266 -77820 29688 89913
14481 89913 82521 25369 28414 9761 -23444 19887 62009 118031 104926 117482 45442 19103
14469 19103 45368 19584 -15641 57932 12829 -6165 -40244 -66365 -8022 -7018 9777 -20687
14457 -20687 -47518 -27210 -69726 -102403 -85382 -31779 22290 127926 110570 -17047 -27490
14446 -27490 12742 52368 29135 -3942 -26920 -24682 21470 8943 -4959 -9119 -7985 32218
$$ packed form
14528h7022N9442Q7427k4407q3055o1490n0310K8707J22436J7344o7333l0415
14517h8676N5603P9348N4536q232j06026j0571N1924M096J3375o8426L018M9363
14505B9332N0727q3922m85l6236N2679J7674j4421m2923L948O092j3759L2727
14493A433J5313L0115l2324Q554K2582j5610L635K4091p1055o4554J07508O0225
14481H9913p392n7152L045j8653l3205M3331M2122N6022j3105J2556p2040k6339
14469A9103K6265k5784l5225P3573m5103j8994l4079k6121N8343J004J6795l0464
14457b0687k6831K0308m2516l2677J7021N3603N4069J05636j7356j27617j0443
14446b7490M0232L9626k3233l3077k2978K238M6152j2527j3902m160J134M0203
$$ plain form
14434 32218 41002 31979 -26009 21409 7553 -59577 -54152 -38646 27080 12499 -36008 -120134
14422 -120134 -113670 -8007 93746 104212 113385 80186 25929 48716 -27119 -59148 -34407
14411 -34407 -16663 849 48874 23238 -55382 -38905 10721 81359 107475 101665 12467 -29859
14399 -29859 -76767 -12714 -2502 -82382 -120271 -56845 18888 6409 -80329 -86004 -59614 -56069
14387 -56069 -77614 -82829 -19291 6369 -36120 -79952 -87685 -17083 34434 -7376 -59211 -60924
14375 -60924 -35128 -42235 -43558 -53131 -20066 82383 54852 5335 -6673 -77759 -94829 -98603
14363 -98603 -17946 5165 52424 52330 28206 -80275 -82059 -27514 31308 69784 66064 33116
14351 33116 1345 -3033 33307 -14248 -44388 19676 28795 13886 -42847 -14372 -3923 7160
$$ packed form
14434C2218Q784r023n7988M7418j3856o7130N425J5506O5726j4581m8507q4126
14422a20134O464J05663J01753J0466R173l3199n4257K2787p5835l2029K4741
14411c4407J7744J7512M8025k5636p8620J6477M9626P0638K6116n810q9198m2326
14399b9859m6908O4053J0212p9880l7889O3426P5733j2479q6738n675K6390L545
14387e6069k1545n215O3538K5660m2489m3832p733P0602N1517m1810n1835j713
14375f0924K5796p107j323r573L3065J02449k7531m9517j2008p1086j7070l774
14363i8603Q0657K3111M7259r4k4124j08481j784N4545N8822L8476l720l2948
14351C3116l1771m378L6340m7555l0140O4064R119j4909n6733K8475J0449J1083
$$ plain form
14339 7160 66219 79936 37199 -2407 10109 -2456 -12944 -2009 262 -24107 -76738 -130898
14327 -130898 -126496 -82119 -45271 -60893 -9569 127516 118492 57424 2145 21755 64234 59562
14315 59562 30929 18193 890 6488 -38568 2877 42226 46377 20356 -22148 -1514 44120
14303 44120 17595 -80745 -16093 10039 93413 182902 210243 112135 76755 61533 47994 37801
14291 37801 -32083 -42556 11438 55343 53906 -33531 -34970 -35204 -99993 -79774 -73549 -3952 -3316
14278 -3316 27113 101726 149106 167763 109356 -4726 36502 74615 104059 91643 -15883
14267 -15883 20420 20991 -26179 -12432 28140 15565 -65681 -77916 -44304 -11632 -48016 -87101
14255 -87101 -88996 -96742 -102943 -112599 -87702 -33259 -113870 -179270 -146087 -167564 -106099 -2674
$$ packed form
14339G160N9059J3717m2737l9606J2516j2565j0488J0935K271k4369n2631n4160
14327a30898M402M4377L6848j5622N1324J37085r024o1068n5279J9610M2479m672
14315E9562k8633j2736j7303N598m5056M1445L9349M151k6021m2504K0634M5634
14303D4120k6525r8340O4652K6132Q3374Q9489K7341r8108l5380j5222j3539j0193
14291C7801o9884j0473N3994M3905j437q7437j439k34o4789K0219O225O9597O36
14278c316L0429P4613M7380J8657n8407j14082M1228L8113K9444j2416j07526
14267a5883L6303N71m7170J3747M0572j2575q1246j2235L3612L2672l6384l9085
14255h7101j895p746o201r656K4897N4443q0611o5400L3183k1477O1465J03425
$$ plain form
14243 -2674 31178 21460 62555 17004 -29605 -31989 -2838 -40818 -37345 -24620 20521 53890
14231 53890 10722 4345 11479 -20542 59552 74042 5977 -56602 -101642 -134253 -140353 -93518
14219 -93518 -15440 -26037 -2877 80189 92487 58204 82137 124732 96122 70697 45509 29900
14207 29900 27038 108426 121053 67642 -26450 -34428 8920 170100 110735 73741 -9396 -56466
14195 -56466 -154591 -177666 -69080 -23361 35144 -2794 16850 92059 94664 57121 114673 136682
14183 136682 29042 -21966 -48484 -16197 -10954 -61155 -3137 63708 61878 -22078 -31556 72103
14171 72103 79583 39719 20504 9973 1432 47582 47065 -750 -24850 -46882 -45070 -9363 -25422
14158 -25422 -4619 112658 216022 121959 41603 616 -14461 -13593 5097 52740 54827 -33832
$$ packed form
14243b674L3852r718M1095m5551m6609k384K9151l7980L473J2725M5141L3369
14231E3890m3168o377P134l2021Q0094J4490o8065o2579m5040l2611o100M6835
14219i3518P8078j0597K3160Q3066J2298l4283K3933M2595k8610k5425k5188j5609
14207B9900k862Q1388J2627n3411r4092p978M3348J61180n9365l6994q3137m7070
14195e6466r8125k3075J08586M5719N8505l7938J9644P5209K605l7543N7552K2009
14183A36682j07640n1008k6518L2287N243n0201N8018O6845j830q3956r478J03659
14171G2103P480l9864j9215j0531q541M6150n17m7815k4100k2032J812L5707j6059
14158b5422K0803J17277J03364r4063q0356m0987j5077Q68J8690M7643K087q8659
$$ plain form
14146 -33832 -1521 75968 98659 101533 25529 -41205 -24444 -34087 -8645 18446 74941 121512
14134 121512 41528 43782 61810 -15999 -77843 -63970 -64115 -9158 57905 67240 51885 71132
14122 71132 17346 63018 79304 84223 85973 13257 -15641 -41045 3776 31654 53711 29129
14110 29129 1413 45852 57647 124140 59708 62129 48210 47160 58930 61022 88740 48374
14098 48374 104207 106148 57242 35186 80562 137724 171740 200940 244513 211683 72647 -25479
14086 -25479 -22384 -2075 -21957 -42489 -49290 -5755 -53045 44827 85763 -23424 -95027 -126598
14074 -126598 -91744 -97929 -116149 -130151 -132186 -70519 -73028 24417 42246 -13716 11917 -7940
14062 -7940 -75675 -43761 -85612 -91100 -75265 -36181 62804 157585 137973 54807 26400 -64432
$$ packed form
14146c3832L2311P7489K2691K874p6004o6734J6761r643K5442K7091N6495M6571
14134A21512p9984K254J8028p7809o1844J3873j45N4957O7063R335j5355J9247
14122G1132n3786M5672J6286M919J750p2716k8898k5404M4821K7878K2057k4582
14110B9129k7716M4439J1795O6493o4432K421j3919j050J1770K092K7718m0366
14098D8374N5833J941m8906k2056M5376N7162L4016K9200M3573l2830j39036r8126
14086b5479L095K0309j9882k0532o801M3535m7290R7872M0936j09187p1603l1571
14074a26598L4854o185j8220j4002k035O1667k509R7445J7829n5962K5633j9857
14062g940o7735L1914m1851n488J5835L9084R8985R4781j9612q3166k8407r0832
$$ plain form
14050 -64432 -62243 78679 71379 34241 20648 37492 83136 98357 129627 134333 74607 37589
14038 37589 100567 100314 115523 225501 230783 66687 48114 70461 107696 110913 48375 -2246
14026 -2246 -50832 12544 118204 98648 64988 71343 143040 80688 57307 95949 103451 95039
14014 95039 25449 -54188 -93825 -80452 -97657 -137652 -191921 -201658 -94659 -15023 -1708 -2949
14002 -2949 52799 120069 76043 87909 59677 44074 42248 77291 51536 -30110 -69346 -61728
13990 -61728 -13984 29768 -5003 16727 67352 79947 98650 95041 100949 119820 123846 84623
13978 84623 100646 63022 95080 102809 96153 87084 117860 97816 75149 45146 22224 34005
13966 34005 6274 -54948 -3003 98045 76724 30786 -764 -13470 7890 69305 129791
$$ packed form
14050f4432K189J40922p300l7138j3593J6844M5644J5221L1270M706n9726l7018
14038C7589O2978k53J5209J09978N282j64096j8573K2347L7235L217o2538n0621
14026b246m8586O3376J05660j9556l3660O355P1697o2352k3381L8642P502q412
14014I5039o9590p9637l9637J3373j7205l9995n4269r737J06999P9636J3315j241
14002b949N5748O7270m4026J1866k8232j5603j826L5043k5755q1646l9236P618
13990f1728M7744M3752l4771K1730N0625J2595J8703l609N908J8871M026l9223
13978H4623J6023l7624L2058P729o656r069L0776k0044k2667l0003k2922J1781
13966C4005k7731o1222N1945J01048k1321m5938l1550j2706K1360O1415O0486
$$ plain form
13955 129791 199224 133306 102494 148721 147753 109503 62022 70523 143049 167286 104197 28826
13943 28826 14828 82350 87720 54276 78920 54047 21082 46184 71789 62516 111724 109619
13931 109619 90926 140095 140440 215068 215985 166082 115565 167185 214371 187814 157200 143542
13919 143542 69914 4457 14024 63796 99287 96967 129568 118232 160384 214500 183927 122171
13907 122171 91020 188735 202560 159699 175783 179864 178206 177425 157891 124431 142683 123586
13895 123586 95141 133216 173104 212830 280090 244308 208725 170199 176650 194830 135050 84698
13883 84698 38332 134285 172993 187013 136075 138605 158422 157261 164462 152620 178712 101421
13871 101421 38132 15226 42011 35784 -14121 -7001 27446 48136 108043 48296 32278 35406
$$ packed form
13955A29791O9433o5918l0812M6227r68l8250m7481Q501P2526K4237o3089p5371
13943B8826j3998O7522N370l3444K4644k4873l2965K5102K5605r273M9208k105
13931A09619j8693M9169L45P4628R17m9903n0517N1620M7186k6557l0614j3658
13919A43542p3628o5457R567M9772L5491k320L2601j1336M2152N4116l0573o1756
13907A22171l1151R7715J3825m2861J6084M081j658p81j9534l3460J8252j9097
13895A23586k8445L8075L9888L9726O7260l5782l5583l8526O451J8180n9780n0352
13883H4698m6366R5953L8708J4020n0938K530J9817j161P201j1842K6092p7291
13871A01421o3289k2906K6785o227m9905P120L4447K0690N9907n9747j6018L128
$$ plain form
13859 35406 75141 81104 64613 49173 53305 42233 111704 128007 102771 46046 73469 106842
13847 106842 210919 158285 129925 40615 88217 149712 162572 134561 116420 87234 76569
13836 76569 23537 24911 104927 141402 171403 159653 156998 141017 111661 59851 50614 40639
13824 40639 126270 122646 95807 63343 77781 93555 107050 98781 48541 -20908 -57295 -23226
13812 -23226 41261 24753 46238 112822 182075 178373 180123 204202 188125 174351 178807 192713
13800 192713 281056 265890 246352 184309 170469 153152 179921 144995 141796 193920 226507 143074
13788 143074 92384 118812 157662 132968 91427 137234 100343 23212 25533 34137 31144 73203
13776 73203 87821 62812 3935 -5632 -2188 24536 62162 54581 86678 88463 129445 140002
$$ packed form
13859C5406L9735N963j6491j5440M132j1072O9471J6303k5236n6725K7423L3373
13847A06842J04077n2634k8360q9310M7602O1495J2860k8011j8141k9186j0665
13836G6569n3032J374Q0016L6475L0001j1750k655j5981k9356n1810r237r975
13824D0639Q5631l624k6839l2464J4438J5774J3495q269n0240o9449l6387L4069
13812b3226O4487j6508K1485O6584O9253l702J750K4079j6077j3774M456J3906
13800A92713Q8343j5166j9538o2043j3840j7317K6769l4926l199N2124L2587q3433
13788A43074n0690K6428L8850k4694m1541M5807l6891p7131K321Q604k993M2059
13776G3203J4618k5009n8877r567L444K6724L7626p581L2097J785M0982J0557
$$ plain form
13764 140002 116844 111900 86960 44008 58594 121949 142520 138067 149434 213753 262792 257827
13752 257827 214609 217564 193824 155020 188744 205154 134820 58270 -301 30275 104948 126363
13740 126363 99792 128849 123456 111890 107016 65318 51862 83502 123418 162465 194281 173854
13728 173854 205849 247138 231656 179459 143810 148157 201731 241879 218331 263352 328756 290370
13716 290370 336726 389154 353662 333233 261151 197430 212032 217819 205962 95497 38172
13705 38172 87828 135785 158312 138490 157231 238458 219758 194065 245300 197918 190557 263423
13693 263423 259103 200360 220085 237788 238285 257270 205075 217560 203865 178833 149630 148932
13681 148932 53848 73462 177142 226043 254774 280831 339747 343563 385273 401508 351634
$$ packed form
13764A40002k3158m944k4940m2952J4586O3355K0571m453J1367O4319M9039m965
13752B57827m3218K955k3740l8804L3724J6410p0334p6550n8571L0576P4673K1415
13740A26363k6571K9057n393j1566m874m1698j3456L1640L9916L9047L1816k0427
13728A73854L1995M1289j5482n2197l5649M347N3574M0148k3548M5021O5404l8386
13716B90370M6356N2428l5492k0429p2082o3721J4602N787j1857j10465n7325
13705C8172M9656M7957K2527j9822J8741Q1227j8700k5693N1235m7382p361P2866
13693B63423m320n8743J9725J7703M97J8985n2195J2485j3695k5032k9203o98
13681A48932r5084J9614J03680M8901K8731K6057N8916L816M1710J6235m9874
$$ plain form
13670 351634 294915 263154 201773 262594 318361 221120 167025 222943 232507 199893 202321 173773
13658 173773 220492 299232 306344 287727 202939 115177 126641 203042 190811 174438 221395 233157
13646 233157 151094 65365 96777 249752 334738 351214 313631 295416 297183 215321 272289
13635 272289 281662 183042 167608 227132 286816 363290 345982 277962 197749 137577 134219 104332
13623 104332 95923 172773 232314 269884 247588 237000 138814 154737 281713 260105 265621 254895
13611 254895 242995 171463 176480 270088 331375 316759 285963 296030 272654 243296 199876 139269
13599 139269 150918 220676 215306 196612 146895 102890 107168 126241 141323 204499 274898 213306
13587 213306 152319 128805 158797 201712 226342 233853 164718 205840 257650 244300 278114 267763
$$ packed form
13670C51634n6719l1761o1381O0821N5767r7241n4095N5918R564l2614K428k8548
13658A73773M6719P8740P112j8617q4788q7762J1464P6401j2231j6373M6957J1762
13646B33157q2063q5729L1412J52975Q4986J6476l7583j8215J767q1862N6968
13635B72289R373r8620j5434N9524N9684P6474j7308o8020q0213o0172l358k9887
13623A04332q409P6850N9541L7570k2296j0588r8186J5923J26976k1608N516j0726
13611B54895j1900p1532N017R3608O1287j4616l0796J0067k3376k9358m3420o0607
13599A39269J1649O9758n370j8694m9717m4005M278J9073J5082O3176P0399o1592
13587B13306o0987k3514K9992M2915K4630P511o9135M1122N1810j3350L3814j0351
$$ plain form
13575 267763 239035 257597 283555 309799 308035 384154 325203 238751 286274 339393 394618 376864
13563 376864 344405 259384 230597 301282 363803 406611 402710 376113 325238 312815 319623 334644
13551 334644 244208 241981 376230 424315 361638 342645 368031 449519 417019 363780 284139
13540 284139 320841 317521 336244 346939 336663 382187 461780 459249 436232 365690 317710 318978
13528 318978 268389 284809 307164 327516 248003 294065 356647 315965 253389 261528 298751 314696
13516 314696 336185 368402 308353 246488 331502 293440 292043 341343 393956 419421 392460 413489
13504 413489 412954 439551 452553 438919 363204 426059 449460 398801 386726 368960 387922 416535
13492 416535 372646 363076 411609 471066 534744 453734 298195 191527 223175 285492 403146
$$ packed form
13575B67763k8728J8562K5958K6244j764P6119n8951q6452M7523N3119N5225j7754
13563C76864l2459q5021k8787P0685O2521M2808l901k6597n0875j2423O808J5021
13551C34644r0436k227J34249M8085o2677j8993K5386Q1488l2500n3239p9641
13540B84139L6702l320J8723J0695j0276M5524P9593k531k3017p0542m7980J268
13528C18978n0589J6420K2355K0352p9513M6062O2582m0682o2576Q139L7223J5945
13516C14696K1489L2217o0049o1865Q5014l8062j397M9300N2613K5465k6961K1029
13504D13489n35K6597J3002j3634p5715O2855K3401n0659j2075j7766J8962K8613
13492D16535m3889r570M8533N9457O3678q1010j55539j06668L1648O2317J17654
$$ plain form
13481 403146 484976 522164 486779 449940 517244 556176 586241 548410 469911 441959 459898
13470 459898 435867 416884 427813 332058 343058 324721 375816 408033 475670 515500 479493
13459 479493 399404 409234 399958 405591 477683 544617 592233 500948 408481 398467 396760 409261
13447 409261 423130 402346 399166 362090 343391 434112 545537 610154 560125 497720 490044 384011
13435 384011 306756 384864 468297 510354 557959 542325 527156 516253 557804 598460 579335
13424 579335 526580 496786 567879 578325 561195 580117 565299 593857 517475 447973 527656
13413 527656 613356 578659 461750 426862 444822 519567 601331 640064 691586 655849 618486
13402 618486 562753 545100 429658 377192 454330 503464 582423 574666 516860 468478 548660
$$ packed form
13481D03146Q1830L7188l5385l6839O7304L8932L0065l7831p8499k7952J7939
13470D59898k4031j8983J0929r5755J1000j8337N1095L2217O7637L9830l6007
13459D79493q0089R830r276N633P2092O6934M7616r1285r2467j0014j707J2501
13447D09261J3869k0784l180l7076j8699R0721J11425O4617n0029o2405p676j06033
13435C84011p7255P8108Q3433M2057M7605j5634j5169j0903M1551M0656j9125
13424E79335n2755k9794P1093J0446j7130J8922j4818K8558p6382o9502P9683
13413E27656Q5700l4697j16909l4888J7960P4745Q1764L8733N1522l5737l7363
13402F18486n5733j7653j15442n2466P7138M9134P8959p757n7806m8382Q0182
$$ plain form
13391 548660 533217 491122 486695 543499 523111 558973 562854 598662 693776 734930 699101 676838
13379 676838 689963 630916 586541 588395 592132 638184 609327 602814 551719 482387 500418 480684
13367 480684 531799 518507 529828 559743 562172 583662 639581 669892 694498 648513 624840 611381
13355 611381 592510 591641 625431 535431 496658 532306 547388 613086 663847 596982 626044 630865
13343 630865 642699 661335 679858 609178 543849 555637 518514 524757 615264 733246 747538
13332 747538 751707 762283 713844 686289 666204 710097 726046 626692 656688 653977 694505 696436
13320 696436 724310 670030 682905 728158 763370 778404 736921 669613 681983 692563 690900 645035
13308 645035 651835 605468 612350 688605 711507 714193 671637 729721 779158 733805 739424 756860
$$ packed form
13391E48660j5443m2095m427N6804k0388L5862L881L5808R5114M1154l5829k2263
13379F76838J3125n9047m4375J854L737M6052k8857o513n1095o9332J8031j9734
13367D80684N1115j3292J1321K9915K429K1490N5919L0311K4606m5985k3673j3459
13355F11381j8871q69L3790r0000l8773L5648J5082O5698N0761o6865K9062M821
13343F30865J1834J8636J8523p0680o5329J1788l7123O243R0507J17982J4292
13332G47538M169J0576m8439k7555k0085M3893J5949r9354K9996k711M0528J931
13320F96436K7874n4280J2875M5253L5212J5034m1483o7308J2370J0580j663m5865
13308F45035O800m6367O882P6255K2902K686m2556N8084M9437m5353N619J7436
$$ plain form
13296 756860 753154 756960 703682 609318 642737 788554 789531 689916 607358 638409 720976 720594
13284 720594 742413 717761 686143 699385 674043 739530 809118 866786 843874 740047 788704
13273 788704 891770 865285 771588 741659 739770 713778 745566 843632 901573 904067 980227 1070381
13261 1070381 1012002 998213 963326 834533 753795 773445 811542 834203 870835 836242 863746
13250 863746 892898 914949 926505 878986 860490 862773 853060 778887 822726 926022 903073 902042
13238 902042 996543 1027779 1022688 928469 873847 923678 934329 877406 844929 884491 906078 921608
13226 921608 977387 987333 991505 985780 1007930 1012241 1012172 1016600 1012229 1041255 1077026 1082718 1091452 1068394
13212 1068394 1062523 1010793 1022864 1029460 985801 1058981 1046561 1067525 1164119 1152883 1093780 1064912
$$ packed form
13296G56860l706L806n3278r4364L3419J45817R77r9615q2558L1051Q2567l82
13284G20594K1819k4652l1618J3242k5342O5487O9588N7668k2912j03827M8657
13273G88704J03066k6485r3697k9929j889k5992L1788R8066N7941K494P6160R0154
13261A070381n8379j3789l4887j28793q0738J9650L8097K2661L6632l4593K7504
13250H63746K9152K2051J1556m7519j8496K283r713p4173M3839J03296k2949j031
13238I02042R4501L1236n091r4219n4622M9831J0651n6923l2477L9562K1587J5530
13226I21608N5779R946M172n725K2150M311o9M428m371K9026L5771N692Q734k3058
13212A068394n871n1730J2071O596m3659P3180j2420K0964R6594j1236n9103k8868
$$ plain form
13200 1064912 1093291 1124773 1113138 1129417 1178354 1218971 1198457 1167897 1210249 1227715 1237754
13189 1237754 1218264 1182906 1165392 1135281 1096411 1143915 1205821 1186399 1111760 1035946 1115367
13178 1115367 1117040 1080390 1104897 1166238 1190023 1106161 1106074 1203271 1194708 1187927 1244661 1281558
13166 1281558 1269769 1337315 1353267 1391599 1339538 1254135 1204308 1189227 1239004 1273808 1339362
13155 1339362 1445782 1477469 1491507 1424597 1414748 1351256 1254097 1277678 1344876 1405676 1402177
13144 1402177 1377551 1341770 1309053 1415736 1424789 1397738 1414044 1430468 1341646 1342699 1450583
13133 1450583 1490656 1458384 1441259 1433097 1378359 1355469 1404784 1411441 1395401 1418378 1424736 1462815
13121 1462815 1486417 1464535 1493935 1601297 1572123 1574810 1619742 1682679 1708537 1704989 1639608
$$ packed form
13200A064912K8379L1482j1635J6279M8937M0617k0514l0560M2352J7466J0039
13189A237754j9490l5358j7514l0111l8870M7504O1906j9422p4639p5814P9421
13178A115367J673l6650K4507O1341K3785q3862q7R7197q563o781N6734L6897
13166A281558j1789O7546J5952L8332n2061q5403m9827j5081M9777L4804O5554
13155A339362J06420L1687J4038o6910r849o3492r7159K3581O7198O0800l499
13144A402177k4626l5781l2717J06683R053k7051J6306J6424q8822J053J07884
13133A450583M0073l2272j7125q162n4738k2890M9315O657j6040K2977O358L8079
13121A462815K3602k1882K9400J07362k9174K687M4932O2937K5858l548o5381
$$ plain form
13110 1639608 1679201 1655952 1598621 1570629 1570506 1659807 1729429 1763470 1736418 1673664 1637549 1659554
13098 1659554 1688607 1801779 1845436 1805754 1768334 1718319 1779724 1829199 1764703 1748859 1752712
13087 1752712 1716135 1685350 1631037 1649423 1682932 1643343 1673260 1767429 1781359 1871171 1933103
13076 1933103 1945613 1959317 1992277 2030824 2032754 1957298 1966579 2073374 2045262 1992714 1960876
13065 1960876 1921397 1797932 1888812 2024778 2038054 2090456 2064379 2056229 2020273 2051171 2066224
13054 2066224 2113765 2206252 2244711 2274067 2281985 2189264 2160672 2099807 2068970 2101741 2200886
13043 2200886 2303097 2290480 2218056 2277647 2298741 2255417 2239218 2191913 2208407 2200139 2275456
13032 2275456 2368366 2392957 2406523 2434941 2406889 2365914 2318129 2346087 2424834 2442459 2504350
$$ packed form
13110A639608L9593k3249n7331k7992j23Q9301O9622L4041k7052o2754l6115K2005
13098A659554K9053J13172M3657l9682l7420n0015O1405M9475o4496j5844L853
13087A752712l6577l0785n4313J8386L3509l9589K9917R4169J3930Q9812O1932
13076A933103J2510J3704L2960L8547J930p5456R281J06795k8112n2548l1838
13065A960876l9479j23465R0880J35966J3276N2402k6077q150l5956L0898J5053
13054B066224M7541R2487L8459K9356P918r2721k8592o0865l0837L2771R9145
13043B200886J02211j2617p2424N9591K1094m3324j6199m7305J6494q268P5317
13032B275456R2910K4591J3566K8418k8052m0975m7785K7958P8747J7625O1891
$$ plain form
13021 2504350 2594301 2531903 2533537 2582316 2573609 2626459 2564668 2558911 2635253 2632107 2585555 2603087
13009 2603087 2613736 2639173 2719685 2801846 2761878 2806800 2938334 2945185 2941060 2955705 2881963
12998 2881963 2784017 2778398 2848076 2880545 2866490 2859695 2817868 2849953 2892145 2857432 2888415 2940503
12986 2940503 2945865 2928467 2966319 3045859 3088813 3005164 3053294 3016911 3087293 3188203 3211034
12975 3211034 3220141 3227705 3222404 3245101 3299528 3319593 3371864 3443619 3491204 3420879 3396309 3434459
12963 3434459 3450247 3418692 3448779 3461498 3490083 3448557 3470822 3574694 3645942 3669027 3627312
12952 3627312 3630233 3638065 3616801 3643596 3756009 3803968 3885698 3895118 3924779 3963963 3973417 4001432
12940 4001432 3956492 3937851 3958740 4042507 4102394 4086786 4071590 4060961 4066595 4086305 4070175
$$ packed form
13021B504350Q9951o2398J634M8779q707N2850o1791n757P6342l146m6552J7532
13009B603087J0649K5437Q0512Q2161l9968M4922J31534O851m125J4645p3742
12998B881963r7946n619O9678L2469j4055o795m1827L2085M2192l4713L0983N2088
12986B940503N362j7398L7852P9540M2954q3649M8130l6383P0382J00910K2831
12975C211034R107P564n301K2697N4427K0065N2271P1755M7585p0325k4570L8150
12963C434459J5788l1555L0087J2719K8585m1526K2265J03872P1248K3085m1715
12952C627312K921P832k1264K6795J12413M7959Q1730R420K9661L9184R454K8015
12940D001432m4940j8641K0889Q3767N9887j5608j5196j0629N634J9710j6130
$$ plain form
12929 4070175 4160317 4218604 4317594 4321078 4449852 4533649 4544442 4560396 4621342 4665244 4688281
12918 4688281 4718441 4732449 4800682 4858930 4810470 4808308 4901898 5072839 5136427 5154301 5141835
12907 5141835 5186404 5263607 5298637 5291452 5332293 5376963 5409229 5472009 5495253 5498504 5547151 5583028
12895 5583028 5627402 5745152 5902273 5995895 6050784 6091927 6196804 6170639 6222680 6318388 6311223
12884 6311223 6410545 6602159 6752343 6849260 6978445 7085582 7230481 7310601 7428650 7516685
12874 7516685 7648125 7715908 7728612 7762776 7687662 7652687 7664725 7706971 7777085 7742910 7705130
12863 7705130 7672556 7693366 7687416 7654093 7663990 7690891 7719682 7796238 7825155 7816405 7826402 7904885
12851 7904885 7986303 8004307 8019422 7982214 7995298 8135306 8276962 8321021 8353044 8388792 8416341
$$ packed form
12929D070175R0142N8287R8990L484J28774Q3797J0793J5954O0946M3902K3037
12918D688281L0160J4008O8233N8248m8460k162R3590J70941O3588J7874j2466
12907E141835M4569P7203L5030p185M0841M4670L2266O2780K3244L251M8647L5877
12895E583028M4374J17750J57121R3622N4889M1143J04877k6165N2041R5708p165
12884F311223R9322J91614J50184R6917J29185J07137J44899Q0120J18049Q8035
12874G516685J31440O7783J2704L4164p5114l4975J2038M2246P0114l4175l7780
12863G705130l2574K0810n950l3323R897K6901K8791P6556K8917q750R997P8483
12851G904885Q1418J8004J5115l7208J3084J40008J41656M4059L2023L5748K7549
$$ plain form
12840 8416341 8487857 8618615 8754856 8797728 8845059 8873490 8954927 9067940 9237758 9414423
12830 9414423 9442465 9502914 9642695 9736506 9765275 9794811 9884693 10038564 10175175 10257773 10268071
12819 10268071 10371268 10478996 10617144 10699365 10741088 10812622 10946320 11129814 11246776 11319577
12809 11319577 11459074 11599173 11727226 11803066 11843597 11997516 12123722 12232168 12346278 12510437
12799 12510437 12680762 12816388 12919191 13020293 13102947 13259231 13424597 13635561 13794148
12790 13794148 13836114 13953962 14072900 14332180 14527236 14642044 14848556 15103110 15294856
12781 15294856 15420223 15562311 15636054 15734991 16009472 16150903 16351849 16543962 16705850 16856151
12771 16856151 17070383 17278102 17472464 17648953 17819073 18065992 18369140 18551190 18692959
$$ packed form
12840H416341P1516J30758J36241M2872M7331K8431Q1437J13013J69818J76665
12830I414423K8042O0449J39781R3811K8769K9536Q9882J53871J36611Q2598J0298
12819A0268071J03197J07728J38148Q2221M1723P1534J33698J83494J16962P2801
12809A1319577J39497J40099J28053P5840M0531J53919J26206J08446J14110J64159
12799A2510437J70325J35626J02803J01102Q2654J56284J65366K10964J58587
12790A3794148M1966J17848J18938K59280J95056J14808K06512K54554J91746
12781A5294856J25367J42088P3743R8937K74481J41431K00946J92113J61888J50301
12771A6856151K14232K07719J94362J76489J70120K46919L03148J82050J41769
$$ plain form
12762 18692959 18888725 19132737 19433377 19658750 19835903 20012704 20221130 20519417 20810554
12753 20810554 21037229 21321945 21551754 21748550 22067553 22414101 22768435 23053788 23339604
12744 23339604 23606642 23868850 24116977 24432280 24829946 25224848 25529278 25813186 26148156
12735 26148156 26434600 26792899 27178438 27488222 27869805 28330621 28743871 29144195 29521682
12726 29521682 29914261 30390498 30844208 31283358 31792369 32273322 32721507 33164971 33635627
12717 33635627 34078989 34580760 35118002 35667202 36140892 36746074 37337956 37836906 38388735
12708 38388735 38982615 39626548 40308260 40912879 41560031 42229703 42914847 43682274 44409461
12699 44409461 45177069 45882194 46553586 47297553 48055715 48890234 49820043 50675045 51477154
$$ packed form
12762A8692959J95766K44012L00640K25373J77153J76801K08426K98287K91137
12753B0810554K26675K84716K29809J96796L19003L46548L54334K85353K85816
12744B3339604K67038K62208K48127L15303L97666L94902L04430K83908L34970
12735B6148156K86444L58299L85539L09784L81583M60816M13250M00324L77487
12726B9521682L92579M76237M53710M39150N09011M80953M48185M43464M70656
12717C3635627M43362N01771N37242N49200M73690O05182N91882M98950N51829
12708C8388735N93880O43933O81712O04619O47152O69672O85144P67427P27187
12699D4409461P67608P05125O71392P43967P58162Q34519R29809Q55002Q02109
$$ plain form
12690 51477154 52399696 53313337 54209600 55134253 56115610 57035908 58041618 59061133 60088412
12681 60088412 61104745 62203884 63255827 64275413 65381559 66522173 67655081 68871950
12673 68871950 70126374 71423146 72771027 74044266 75291584 76534145 77864138 79275951
12665 79275951 80626746 82022627 83369979 84774258 86243528 87741126 89285149 90825758
12657 90825758 92305753 93867379 95482458 97177315 98748959 100256203 101782418 103448207
12649 103448207 105003767 106531176 108115591 109726673 111292986 112821860 114349857 115857996
12641 115857996 117390409 119007775 120458284 121811054 123171473 124526914 125826892 127130125
12633 127130125 128380634 129513687 130696078 131868029 132947645 133953146 134845076 135692587
$$ packed form
12690E1477154R22542R13641Q96263R24653R81357R20298J005710J019515J027279
12681F0088412J016333J099139J051943J019586J106146J140614J132908J216869
12673F8871950J254424J296772J347881J273239J247318J242561J329993J411813
12665G9275951J350795J395881J347352J404279J469270J497598J544023J540609
12657I0825758J479995J561626J615079J694857J571644J507244J526215J665789
12649A03448207J555560J527409J584415J611082J566313J528874J527997J508139
12641A15857996J532413J617366J450509J352770J360419J355441J299978J303233
12633A27130125J250509J133053J182391J171951J079616J005501Q91930Q47511
$$ plain form
12625 135692587 136369883 137027278 137607066 138211447 138696719 138970829 139194253 139403123 139499940
12616 139499940 139516180 139510966 139430866 139200622 138868462 138508556 138014803 137447684 136813971 136070611
12606 136070611 135253419 134412356 133544363 132671182 131776723 130653103 129572355 128434250 127258251
12597 127258251 126009161 124739088 123439896 122056564 120744864 119418586 118060136 116639655
12589 116639655 115189959 113682895 112212692 110777175 109371157 107936094 106540577 105140884
12581 105140884 103728660 102293460 100860981 99426327 98075777 96704773 95309453 93950912
12573 93950912 92668008 91357541 89910428 88558304 87289031 86089411 84937657 83684360
12565 83684360 82484710 81336914 80139669 78952578 77839223 76706962 75614590 74519439
$$ packed form
12625A35692587O77296O57395N79788O04381M85272K74110K23424K08870R6817
12616A39499940J6240n214q0100k30244l32160l59906m93753n67119o33713p43360
12606A36070611q17192q41063q67993q73181q94459j123620j080748j138105j175999
12597A27258251j249090j270073j299192j383332j311700j326278j358450j420481
12589A16639655j449696j507064j470203j435517j406018j435063j395517j399693
12581A05140884j412224j435200j432479j434654j350550j371004j395320j358541
12573I3950912j282904j310467j447113j352124j269273j199620j151754j253297
12565H3684360j199650j147796j197245j187091j113355j132261j092372j095151
$$ plain form
12557 74519439 73459184 72451330 71441763 70520545 69576379 68642995 67611909 66613204 65654549
12548 65654549 64835766 64043718 63175149 62197940 61254149 60330224 59481869 58662774 57770687
12539 57770687 57000789 56323357 55534809 54868535 54105757 53299776 52562613 51814742 51151774
12530 51151774 50436147 49807250 49162616 48576380 48001556 47384165 46760997 46073003 45430245
12521 45430245 44817168 44152140 43524990 43044790 42504818 41940527 41382476 40839933 40187230
12512 40187230 39612466 39144726 38618579 38128374 37643304 37083179 36628523 36158789 35639760
12503 35639760 35121583 34616587 34159653 33819709 33359515 32966422 32590827 32100956 31610061
12494 31610061 31150693 30724828 30329370 29980774 29618178 29202398 28819731 28477306 28159496
$$ packed form
12557G4519439j060255j007854j009567r21218r44166r33384j031086r98705r58655
12548F5654549q18783p92048q68569r77209r43791r23925q48355q19095q92087
12539E7770687p69898o77432p88548o66274p62778q05981p37163p47871o62968
12530E1151774p15627o28897o44634n86236n74824o17391o23168o87994o42758
12521D5430245o13077o65028o27150m80200n39972n64291n58051n42543o52703
12512D0187230n74764m67740n26147m90205m85070n60125m54656m69734n19029
12503C5639760n18177n04996m56934l39944m60194l93093l75595m89871m90895
12494C1610061m59368m25865l95458l48596l62596m15780l82667l42425l17810
$$ plain form
12485 28159496 27785529 27410174 27157776 26843793 26457648 26062413 25778190 25539088 25265675
12476 25265675 24921834 24555262 24234228 23909063 23584515 23311439 23133123 22856755 22508606
12467 22508606 22193294 21959561 21663847 21373656 21060287 20726425 20604541 20485323 20283169
12458 20283169 20060097 19881249 19616059 19343862 19102175 18825818 18609254 18484879 18246144
12449 18246144 18007988 17826085 17632023 17338669 17204077 17082355 16911350 16701809 16545689
12440 16545689 16384100 16166444 16046910 15917804 15752278 15568584 15393346 15271603 15131838
12431 15131838 14989363 14812202 14689422 14483545 14330204 14233367 14205218 14078165 13943363 13787162
12421 13787162 13602617 13443060 13335497 13247052 13140650 13003584 12896365 12767404 12649045
$$ packed form
12485B8159496l73967l75355k52398l13983l86145l95235k84223k39102k73413
12476B5265675l43841l66572l21034l25165l24548k73076j78316k76368l48149
12467B2508606l15312k33733k95714k90191l13369l33862j21884j19218k02154
12458B0283169k23072j78848k65190k72197k41687k76357k16564j24375k38735
12449A8246144k38156j81903j94062k93354j34592j21722j71005k09541j56120
12440A6545689j61589k17656j19534j29106j65526j83694j75238j21743j39765
12431A5131838j42475j77161j22780k05877j53341r6837k8149j27053j34802j56201
12421A3787162j84545j59557j07563q8445j06402j37066j07219j28961j18359
$$ plain form
12412 12649045 12618324 12552760 12484360 12341178 12271335 12170623 12109305 12033194 11890744 11696717
12402 11696717 11579581 11500492 11488670 11366512 11282216 11189627 11149038 11045889 10911618 10892489
12392 10892489 10875139 10803031 10730774 10702235 10608037 10458069 10348073 10252681 10193738 10086181
12382 10086181 10040667 10019804 9965618 9920747 9944655 10012338 10054103 9886371 9785067 9747037 9707114
12371 9707114 9708525 9609311 9476190 9456581 9405261 9368161 9346466 9347005 9435148 9474976 9488834 9532219
12359 9532219 9575108 9624695 9641399 9677220 9566040 9462136 9305235 9211668 9053773 8917536
12349 8917536 8711122 8510134 8366528 8189545 8099519 8062426 8027194 7920171 7702001 7704920
12339 7704920 7748354 7677189 7577073 7502766 7422760 7403758 7392676 7338509 7232379 7111570 7014546
$$ packed form
12412A2649045l0721o5564o8400j43182o9843j00712o1318p6111j42450j94027
12402A1696717j17136p9089j1822j22158q4296r2589m0589j03149j34271j9129
12392A0892489j7350p2108p2257k8539r4198j49968j09996r5392n8943j07557
12382A0086181m5514k0863n4186m4871K3908O7683M1765j67732j01304l8030l9923
12371I707114J411r9214j33121j9609n1320l7100k1695N39Q8143L9828J3858M3385
12359I532219M2889M9587J6704L5821j11180j03904j56901r3567j57895j36237
12349H917536k06414k00988j43606j76983r0026l7093l5232j07023k18170K919
12339G704920M3434p1165j00116p4307q0006j9002j1082n4167j06130j20809r7024
$$ plain form
12328 7014546 6988166 7006141 6898624 6784108 6730280 6717608 6705184 6634838 6639773 6639066 6598505
12317 6598505 6511275 6485996 6436790 6379294 6370278 6277380 6202842 6146088 6080921 6074775 6059803 6014833
12305 6014833 5892177 5807988 5796984 5763730 5727788 5722262 5693444 5589147 5588555 5639555 5581510
12294 5581510 5571012 5541529 5439415 5440595 5439943 5396559 5285698 5264375 5309646 5270789 5221914
12283 5221914 5213142 5227846 5271005 5197650 5130939 5040876 5040775 5066752 4981121 4891804 4899073 4920070
12271 4920070 4909399 4834914 4789806 4805723 4838651 4757208 4628154 4529001 4538482 4609227 4549363
12260 4549363 4480007 4560623 4624388 4596097 4458410 4349933 4372115 4395664 4334468 4278282 4266314
12249 4266314 4241944 4236910 4215964 4213155 4248713 4299608 4299886 4282581 4189691 4138215 4124721 4111794
$$ packed form
12328G014546k6380J7975j07517j14516n3828j2672j2424p0346M935p07m0561
12317F598505q7230k5279m9206n7496r016r2898p4538n6754o5167o146j4972m4970
12305F014833j22656q4189j1004l3254l5942n526k8818j04297n92N1000n8045
12294E581510j0498k9483j02114J180o52m3384j10861k1323M5271l8857m8875
12283E221914q772J4704M3159p3355o6711r0063j01K5977q5631q9317P269K0997
12271D920070j0671p4485m5108J5917L2928q1443j29054r9153R481P0745n9864
12260D549363o9356Q0616O3765k8291j37687j08477K2182K3549o1196n6186j1968
12249D266314k4370n034k0946k809L5558N0895K78j7305r2890n1476j3494j2927
$$ plain form
12237 4111794 4091901 4056965 4029786 3986449 3947457 3981663 3967214 3831788 3769587 3806230 3811103
12226 3811103 3779405 3838545 3846811 3840969 3859471 3864693 3784448 3652053 3564397 3526959 3532740 3571750
12214 3571750 3552371 3522745 3524028 3491948 3557274 3578684 3512274 3569362 3626202 3530577 3476068
12203 3476068 3465770 3530433 3527036 3446030 3373388 3418092 3304051 3281724 3239454 3233915 3255232
12192 3255232 3234706 3237527 3154991 3146751 3185688 3179685 3170764 3173328 3128401 3197797 3145006 3049893
12180 3049893 3068354 3056738 3061589 2931332 2873256 2838360 2834961 2856731 2873364 2889794 2921491
12169 2921491 2894429 2858092 2888186 2942797 2961945 2970025 2864017 2816057 2877400 2874645 2807538
12158 2807538 2734138 2664967 2602232 2655418 2733403 2735503 2790947 2816265 2818273 2756578 2713513 2688962
$$ packed form
12237D111794j9893l4936k7179m3337l8992L4206j4449j35426o2201L6643M873
12226C811103l1698N9140Q266n842J8502N222q0245j32395q7656l7438N781L9010
12214C571750j9379k9626J283l2080O5326K1410o6410N7088N6840r5625n4509
12203C476068j0298O4663l397q1006p2642M4704j14041k2327m2270n539K1317
12192C255232k0526K821q2536q240L8937o003q921K564m4927O9396n2791r5113
12180C049893J8461j1616M851j30257n8076l4896l399K1770J6633J6430L1697
12169B921491k7062l6337L0094N4611J9148Q080j06008m7960O1343k755o7107
12158B807538p3400o9171o2735N3186P7985K100N5444K5318K008o1695m3065k4551
$$ plain form
12146 2688962 2581362 2586513 2596911 2554141 2498113 2471586 2520519 2505170 2427284 2418681 2427925 2372754
12134 2372754 2310762 2329429 2326338 2328359 2375877 2413838 2424610 2419321 2440810 2474398 2385998 2309888
12122 2309888 2357323 2360826 2357602 2375912 2418497 2445524 2427439 2313917 2255556 2188294 2129202
12111 2129202 2189895 2174876 2162081 2151009 2168550 2219054 2194768 2115351 2106197 2174724 2125982
12100 2125982 2091738 2106069 2181202 2158072 2192803 2187399 2111906 2028965 1954928 1936023 1957145
12089 1957145 1983964 2027041 2096812 2047934 2062296 2121414 2073493 2029210 1993595 2020577 2057250
12078 2057250 2027169 2000997 2032062 2020289 2064155 2057958 2026782 2010423 1926855 1927176 1893419 1975230
12066 1975230 1943773 1888809 1927502 2014380 1953336 1938499 1940148 2013927 2055982 2018989 2018915 1968823
$$ packed form
12146B688962j07600N151J0398m2770n6028k6527M8933j5349p7886q603R244n5171
12134B372754o1992J8667l091K021M7518L7961J0772n289K1489L3588q8400p6110
12122B309888M7435L503l224J8310M2585K7027j8085j13522n8361o7262n9092
12111B129202O0693j5019j2795j1072J7541N0504k4286p9417r154O8527m8742
12100B125982l4244J4331P5133k3130L4731n404p5493q2941p4037j8905K1122
12089A957145K6819M3077O9771m8878J4362N9118m7921m4283l5615K6982L6673
12078B057250l0081k6172L1065j1773M3866o197l1176j6359q3568L21l3757Q1811
12066A975230l1457n4964L8693Q6878o1044j4837J649P3779M2055l6993p4n0092
$$ plain form
12054 1968823 1957103 1854204 1816644 1812958 1814986 1915862 1889629 1875528 1800819 1753538 1806056
12043 1806056 1765425 1808224 1820406 1852040 1830487 1747624 1709639 1723180 1689515 1662769 1645114
12032 1645114 1601431 1541296 1529355 1577217 1612178 1586674 1635562 1682749 1719044 1750769 1671374
12021 1671374 1640754 1716398 1752445 1738957 1667985 1617808 1564283 1549771 1556722 1531967 1525875 1544534
12009 1544534 1522136 1541309 1560740 1502808 1520233 1576634 1607704 1568295 1612495 1647814 1600425
11998 1600425 1566319 1498452 1452573 1473102 1461650 1459784 1474287 1494016 1481200 1470374 1493502
11987 1493502 1508660 1480028 1398410 1321765 1321105 1330217 1351462 1373205 1367140 1412694 1446271 1485891
11975 1485891 1491182 1433080 1384813 1407495 1477753 1504457 1495830 1457037 1334744 1317225 1333243
$$ packed form
12054A968823j1720j02899l7560l686K028J00876k6233j4101p4709m7281N2518
12043A806056m0631M2799J2182L1634k1553q2863l7985J3541l3665k6746j7655
12032A645114m3683o0135j1941M7862L4961k5504M8888M7187L6295L1725p9395
12021A671374l0620P5644L6047j3488p0972n0177n3525j4512O951k4755o092J8659
12009A544534k2398J9173J9431n7932J7425N6401L1070l9409M4200L5319m7389
11998A600425l4106o7867m5879K0529j1452j866J4503J9729j2816j0826K3128
11987A493502J5158k8632q1618p6645o60R112K1245K1743o065M5554L3577L9620
11975A485891N291n8102m8267K2682P0258K6704q627l8793j22293j7519J6018
$$ plain form
11964 1333243 1312961 1343835 1388521 1380981 1429865 1348518 1303520 1256277 1281909 1352074 1353987 1337876
11952 1337876 1306897 1308626 1279854 1265927 1183191 1108480 1096786 1118306 1205306 1200290 1224391 1227108
11940 1227108 1233807 1249374 1254271 1200875 1220240 1273315 1221020 1175026 1158985 1175276 1167372 1242392
11928 1242392 1288101 1323185 1295967 1250683 1210676 1188642 1173566 1079881 1120299 1207100 1245823
11917 1245823 1197510 1156191 1094072 1114493 1104411 1104155 1120086 1093674 1087737 1054060 1039029 1007190
11905 1007190 967934 1030276 1127017 1188993 1205447 1174178 1136593 1038284 1055113 1068547 1192027
11894 1192027 1207241 1055937 992063 1052973 1128145 1127952 1115003 1155391 1180625 1187161 1245477 1214481
11882 1214481 1129611 1073681 1107563 1156135 1220161 1150771 1100374 1135013 1194740 1154678 1070729
$$ packed form
11964A333243k0282L0874M4686p540M8884q1347m4998m7243K5632P0165J913j6111
11952A337876l0979J729k8772j3927q2736p4711j1694K1520Q7000n016K4101K717
11940A227108O699J5567M897n3396J9365N3075n2295m5994j6041J6291p904P5020
11928A242392M5709L5084k7218m5284m0007k2034j5076r3685M0418Q6801L8723
11917A245823m8313m1319o2119K0421j0082k56J5931k6412n937l3677j5031l1839
11905A007190l9256O2342R6741O1976J6454l1269l7585r8309J6829J3434J23480
11894A192027J5214j51304o3874O0910P5172j93j2949M0388K5234O536N8316l0996
11882A214481q4870n5930L3882M8572O4026o9390n0397L4639N9727m0062q3949
$$ plain form
11871 1070729 1059574 1039300 987486 951676 914788 931587 967274 950879 1024433 985840 850456
11860 850456 936294 958743 969748 1071202 1162100 1120573 1076334 1021266 984910 1017314 969500
11849 969500 971363 998711 988332 1026553 1090733 1101128 1052939 1052979 1001856 935278 965313 910354
11837 910354 913579 960947 932201 913761 938124 921269 922904 959011 911318 894428 824186 806321
11825 806321 881328 885033 826549 818790 812575 768011 712408 801489 871637 868183 891867 886377
11813 886377 857529 876621 905315 947631 922788 933038 901225 858818 843116 892333 962498
11802 962498 1005551 1058298 1020857 899772 887427 887176 860597 901157 885688 819650 796289 796810
11790 796810 781974 799152 810871 842397 820011 774428 755864 763802 773395 835290 835901 831960
$$ packed form
11871A070729j1155k0274n1814l5810l6888J6799L5687j6395P3554l8593j35384
11860H50456Q5838K2449J1005J01454R0898m1527m4239n5068l6356L2404m7814
11849I69500J863K7348j0379L8221O4180J0395m8189M0n1123o6578L0035n4959
11837I10354L225M7368k8746j8440K4363j6855J635L6107m7693j6890p0242j7865
11825H06321P5007L705n8484p759o215m4564n5603Q9081P0148l454K3684n490
11813H86377k8848J9092K8694M2316k4843J0250l1813m2407j5702M9217P0165
11802I62498M3053N2747l7441j21085j2345k51k6579M0560j5469o6038k3361N21
11790G96810j4836J7178J1719L1526k2386m5583j8564P938R593O1895O11l941
$$ plain form
11778 831960 838385 762091 732766 768033 870973 808493 754050 761973 778625 791143 727903 662130
11766 662130 758134 791197 794056 758127 756028 714874 775112 864590 876568 878876 848242 799361
11754 799361 775282 803405 734937 672862 608701 627706 621746 674091 753652 718375 681402 654024
11742 654024 656181 664254 643096 721952 721787 749503 767958 740014 658387 677870 670602 647241
11730 647241 691497 659513 674728 660887 642225 651286 575387 537648 597861 588212 561906 630990
11718 630990 699794 690934 704976 657853 586795 533296 598019 612621 624098 634370 677984 695266
11706 695266 709042 743511 750437 700047 655000 648826 628364 584601 574804 602656 665931 729688
11694 729688 690363 615337 665665 726417 671991 629967 631810 659563 641489 652615 652948 662926
$$ packed form
11778H31960O425p6294k9325L5267J02940o2480n4443P923J6652J2518o3240o5773
11766F62130R6004L3063K859l5929k099m1154O0238Q9478J1978K308l0634m8881
11754G99361k4079K8123o8468o2075o4161J9005n960N2345P9561l5277l6973k7378
11742F54024K157Q073k1158P8856j65K7716J8455k7944q1627J9483p268k3361
11730F47241M4256l1984J5215j3841j8662R061p5899l7739O0213r649k6306O9084
11718F30990O8804q860J4042m7123p1058n3499O4723J4602J1477J0272M3614J7282
11706F95266J3776L4469O926n0390m5047o174k0462m3763r797K7852O3275O3757
11694G29688l9325p5026N0328O0752n4426m2024J843K7753j8074J1126L33R978
$$ plain form
11682 662926 664513 563456 567242 585306 577782 570048 491054 512614 506679 534852 538023 543194 668738
11669 668738 783246 752997 692077 646257 607968 548121 627865 694412 633005 633885 699223 737401
11657 737401 652601 562909 552846 558259 604546 549571 520082 518723 491394 491954 536377 623674
11645 623674 688257 624418 584880 694028 736585 675667 645949 636996 654062 653413 649533 641351
11633 641351 614817 620410 624748 596897 609697 584317 511863 543666 597939 620426 581531 526948
11621 526948 464715 423621 517866 559279 480756 523314 587163 580278 563140 594504 522796 440911
$$ packed form
11682F62926J587j01057L786J8064p524p734p8994K1560n935K8173L171N171J25544
11669F68738J14508l0249o0920m5820l8289n9847P9744O6547o1407Q80O5338L8178
11657G37401q4800q9692j0063N413M6287n4975k9489j359k7329N60M4423Q7297
11645F23674O4583o3839l9538J09148M2557o0918k9718q953J7066o49l880q182
11633F41351k6534N593M338k7851J2800k5380p2454L1803N4273K2487l8895n4583
11621E26948o2233m1094R4245M1413p8523M2558O3849o885j7138L1364p1708q1885
$$ [...]
##END NTUPLES=NMR SPECTRUM
##END=
