##TITLE=Analysis number 327109
Compound Code sb 00604
Project Code adrs
Chemist Name avocado
##JCAMPDX= 6.0         $$ Bruker NMR JCAMP-DX V2.0
##DATA TYPE= NMR SPECTRUM
##DATA CLASS= NTUPLES
##ORIGIN= Bruker BioSpin GmbH
##OWNER= nmr
$$ XWIN-NMR		Version 3.5
$$ Mon Mar 12 11:16:07 2007 GMT Standard Time (UT+0h)  MAYBRIDGE\nmr@NMR_250MHZ
##.OBSERVE FREQUENCY= 250.131544655141
##.OBSERVE NUCLEUS= ^1H
##.ACQUISITION MODE= SIMULTANEOUS (DQD)
##.ACQUISITION SCHEME= undefined
##.AVERAGES= 16
##.DIGITISER RES= 18
##SPECTROMETER/DATA SYSTEM= dpx250
##.PULSE SEQUENCE= zg30
##.SOLVENT NAME= CDCl3
##.SHIFT REFERENCE= (INTERNAL, CDCl3, 0, 16.522)
##AUDIT TRAIL= $$ (NUMBER, WHEN, WHO, WHERE, WHAT)
$$ ##TITLE= Audit trail, XWIN-NMR		Version 3.5
$$ ##JCAMPDX= 5.01
$$ ##ORIGIN= Bruker BioSpin GmbH
$$ ##OWNER= nmr
$$ C:\u/data/dgb/nmr/ADRS/640/pdata/1/auditp.txt
$$ ##AUDIT TRAIL=  $$ (NUMBER, WHEN, WHO, WHERE, WHAT)
(   1,<2007-03-12 11:15:45.58 +000>,<MAYBRIDGE\nmr>,<NMR_250MHZ>,
      <created by zg, POWCHK disabled, PULCHK disabled
       configuration hash MD5:
       49 4B E0 1D 92 C2 6B 37 9F E6 65 BC 52 41 86 1D
       data hash MD5: 64K
       BD B9 6B DA EE 71 FB 36 72 72 39 C7 C7 72 D0 0E>)
(   2,<2007-03-12 11:15:57.61 +000>,<MAYBRIDGE\nmr>,<NMR_250MHZ>,
      <Start of raw data processing
       ef LB = 0.3 FT_mod = 6 PKNL = 1 SI = 32K 
       data hash MD5: 32K
       90 7B 5F 1A B6 9F A7 82 79 40 09 AB 70 B3 D5 6A>)
(   3,<2007-03-12 11:15:59.50 +000>,<MAYBRIDGE\nmr>,<NMR_250MHZ>,
      <apk 
       data hash MD5: 32K
       BD E8 84 F7 1C FB 28 FA 8F E9 C3 D4 06 A0 C6 93>)
(   4,<2007-03-12 11:16:00.25 +000>,<MAYBRIDGE\nmr>,<NMR_250MHZ>,
      <abs ABSG = 5 
       data hash MD5: 32K
       A1 24 45 72 A8 FA 13 CF DE 9A 71 5A 8C 36 3F 7A>)
$$ ##END=
$$ 
$$ hash MD5
$$ BA AE CC E2 2F A6 D9 5A 5F DE 3B 5A D1 03 2A 80
##$RELAX= 
##$RELAX= 
##$RELAX= 
##$RELAX= 
##$RELAX= 
##$RELAX= 
##$RELAX= 
$$ Bruker specific parameters
$$ --------------------------
##$DU= <C:\u>
##$EXPNO= 640
##$NAME= <ADRS>
##$PROCNO= 1
##$TYPE= <nmr>
##$USER= <dgb>
##$AMP= (0..31)
100 100 100 100 100 100 100 100 100 100 100 100 100 100 100 100 100 100 
100 100 100 100 100 100 100 100 100 100 100 100 100 100 
##$AQSEQ= 0
##$AQ_mod= 3
##$AUNM= <au_zg>
##$AUTOPOS= <4 >
##$BF1= 250.13
##$BF2= 250.13
##$BF3= 250.13
##$BF4= 250.13
##$BF5= 500.13
##$BF6= 500.13
##$BF7= 500.13
##$BF8= 500.13
##$BYTORDA= 1
##$CFDGTYP= 0
##$CFRGTYP= 5
##$CHEMSTR= <none>
##$CNST= (0..31)
1 1 145 1 1 1 1 1 1 1 1 1 1 1 1 1 1 1 1 1 1 1 1 1 1 1 1 1 1 1 1 1 
##$CPDPRG= <>
##$CPDPRG1= <>
##$CPDPRG2= <>
##$CPDPRG3= <>
##$CPDPRG4= <mlev>
##$CPDPRG5= <mlev>
##$CPDPRG6= <mlev>
##$CPDPRG7= <mlev>
##$CPDPRG8= <mlev>
##$CPDPRGB= <>
##$CPDPRGT= <>
##$D= (0..31)
0 1 0 0 0 0 0 0 0 0.06 0 0 0 0 0 0 0.0002 0 0 0 0 0 0 0 0 0 0 0 0 0 0 
0 
##$DATE= 1173698144
##$DBL= (0..7)
120 120 120 120 120 120 120 120 
##$DBP= (0..7)
150 150 150 150 150 150 150 150 
##$DBP07= 0
##$DBPNAM0= <>
##$DBPNAM1= <>
##$DBPNAM2= <>
##$DBPNAM3= <>
$$ [...]
##$SUBNAM7= <"">
##$SUBNAM8= <"">
##$SUBNAM9= <"">
##$SW= 20.6930455092707
##$SWIBOX= (0..15)
0 0 3 0 0 0 0 0 0 0 0 0 0 0 0 0 
##$SW_h= 5175.983436853
##$TD= 65536
##$TD0= 1
##$TE= 683.16
##$TE2= 300
##$TE3= 300
##$TEG= 300
##$TL= (0..7)
0 120 120 120 120 120 120 120 
##$TP= (0..7)
150 150 150 150 150 150 150 150 
##$TP07= 0
##$TPNAME0= <>
##$TPNAME1= <>
##$TPNAME2= <>
##$TPNAME3= <>
##$TPNAME4= <>
##$TPNAME5= <>
##$TPNAME6= <>
##$TPNAME7= <>
##$TPOAL= (0..7)
0.5 0.5 0.5 0.5 0.5 0.5 0.5 0.5 
##$TPOFFS= (0..7)
0 0 0 0 0 0 0 0 
##$TUNHIN= 0
##$TUNHOUT= 0
##$TUNXOUT= 0
##$USERA1= <user>
##$USERA2= <user>
##$USERA3= <user>
##$USERA4= <user>
##$USERA5= <user>
##$V9= 5
##$VALIST= <valist>
##$VCLIST= <CCCCCCCCCCCCCCC>
##$VD= 0
##$VDLIST= <DDDDDDDDDDDDDDD>
##$VPLIST= <PPPPPPPPPPPPPPP>
##$VTLIST= <TTTTTTTTTTTTTTT>
##$WBST= 1024
##$WBSW= 4
##$XGAIN= (0..3)
0 0 0 0 
##$XL= 0
##$YL= 0
##$YMAX_a= 769164
##$YMIN_a= -731161
##$ZGOPTNS= <>
##$ZL1= 120
##$ZL2= 120
##$ZL3= 120
##$ZL4= 120
##$ABSF1= 16.522
##$ABSF2= -4.171173
##$ABSG= 5
##$ABSL= 3
##$ALPHA= 0
##$AQORDER= 0
##$ASSFAC= 0
##$ASSFACI= 0
##$ASSFACX= 0
##$ASSWID= 0
##$AUNMP= <proc_1d>
##$AZFE= 0.1
##$AZFW= 0.1
##$BCFW= 0
##$BC_mod= 0
##$BYTORDP= 0
##$COROFFS= 0
##$CY= 12.5
##$DATMOD= 1
##$DC= 0
##$DFILT= <>
##$DTYPP= 0
##$F1P= 14.0000005364418
##$F2P= -0.99999901652339
##$FCOR= 0.5
##$FTSIZE= 32768
##$FT_mod= 6
##$GAMMA= 0
##$GB= 0
##$INTBC= 1
##$INTSCL= 1
##$ISEN= 128
##$LB= 0.3
##$LEV0= 0
##$LPBIN= 0
##$MAXI= 10000
##$MC2= 0
##$MEAN= 0
##$ME_mod= 0
##$MI= 0
##$NCOEF= 0
##$NC_proc= -1
##$NLEV= 6
##$NOISF1= 0
##$NOISF2= 0
##$NSP= 0
##$NTH_PI= 0
##$NZP= 0
##$OFFSET= 16.522
##$PC= 1
##$PHC0= 233.9126
##$PHC1= -1.284632
##$PH_mod= 1
##$PKNL= yes
##$PPARMOD= 0
##$PSCAL= 4
##$PSIGN= 0
##$REVERSE= no
##$SF= 250.13
##$SI= 32768
##$SIGF1= 0
##$SIGF2= 0
##$SINO= 400
##$SIOLD= 32768
##$SREGLST= <1H.CDCl3>
##$SSB= 0
##$STSI= 32768
##$STSR= 0
##$SW_p= 5175.98343685301
##$SYMM= 0
##$S_DEV= 0
##$TDeff= 65536
##$TDoff= 0
##$TI= <Analysis number 999999
Compound Code 99
Book Reference 9
Project Code 9>
##$TILT= no
##$TM1= 0
##$TM2= 0
##$TOPLEV= 0
##$USERP1= <user>
##$USERP2= <user>
##$USERP3= <user>
##$USERP4= <user>
##$USERP5= <user>
##$WDW= 1
##$XDIM= 32768
##$YMAX_p= 405087875
##$YMIN_p= -19344
$$ End of Bruker specific parameters
$$ ---------------------------------
##NTUPLES= NMR SPECTRUM
##VAR_NAME=  FREQUENCY,     SPECTRUM/REAL,   SPECTRUM/IMAG
##SYMBOL=    X,             R,               I
##VAR_TYPE=  INDEPENDENT,   DEPENDENT,       DEPENDENT
##VAR_FORM=  AFFN,          ASDF,            ASDF
##VAR_DIM=   32768,         32768,           32768
##UNITS=     HZ,            ARBITRARY UNITS, ARBITRARY UNITS
##FACTOR=    0.157963299565203, 1,           1
##FIRST=     4132.6476996994, 0,             0
##LAST=      -1043.33573715361, 0,           0
##MIN=       -1043.33573715361, -19344,      0
##MAX=       4132.6476996994, 405087875,     0
$$ Real data points
##PAGE= N=1
##DATA TABLE= (X++(R..R)), XYDATA
$$ [...]
19026d50m088j331m42L776P58P9K301J397m033k277K832K693k68k360J03K267
19010I57J784N61n304p97K803N27O53r38l862k260j340L429N951K630n07j692
18994B595J483n88K84n66l613k053p40j078k900P54O07l56J302K721q99l031l33
18977f411R81M890K23K6p86j560q73j039k563J654K688K388L365k903m173J73
18961c920K322K246p15j427m35J200J73l264k100L425j510N95K998k477R76J217
18945f96N602k079o035j73K707K466j687j269j009j083m616O48J235L487J711
18930g91o11j139J448j671N92L308n49J430r17m10k268k830j46J646P33J625j770
18913b320Q78j465j13K987J300j097q51M68L419K036k259j362k570j68k1P49j537
$$ y = [-450, -4538, -5869, -6311, -2535, -1777, -1698, 603, 2000, -2033, -4310, -1478, 1215, 947, -1413, -1310, 957, 2741, 3302, -2002, -2799, 4, 531, 1184, 246, -3616, -5876, -7216, -3787, 2164, 4794, 4287, 2595, 4078, 3490, 3774, 3208, -405, -2458, -3198, -4276, -7176, -6422, -5815, -6171, -4869, -2148, -3047, -6078, -6411, -5430, -540, -317, -291, -1077, -2637, -3510, -4549, -7112, -5458, -2770, -382, 2983, 80, -4093, -3920, -1598, 648, -67, -1494, -1929, -729, -556, -3820, -5920, -2495, -4005, -3410, -412, -2889, -1913, -696, 4906, 2827, -3208, -3381, -674, 1792, 105, -1164, -2173, -3256, -7872, -7224, -5989, -2502, -791, -1402, -2541, -1093, -2764, -2172, 1136, 587, 2017, 1100, 690, -1578, -4408, -4554, -2908, -2175, -550, -2320, -1442, -2907, -3020, -33, 1267, 170, -681, -213, 3206, 5242, 2983, 1621, -949, -1117, -1138, -389, -1926]
18896a926l806R82L426Q3K929L145Q04k293q80l5k533K94q99j132l47J9R42J440
18878B13O01K5p24P66L866J382k593k412N34N87k635k373K97l316j022j387K812
18861e379L262K276P63p50M57J83J745M19K09M19J010m50j008j856k405M04k50
18844i51l931J033m30N28j755j376k643o68N967J296j444N54j738r55K215K245
18828b053k462k609J619L629Q46K58k237K530m44O07l126q02O49K922J282m41
18812A68o68j517n62L93n93p04J166K846j633J88N185N245m669m143j818L5k224
18795c305l428j051k30K319M615K092m461k642K743N632M34o74K33l149l989J962
18779b899M779J029j493K395j728k570J275K218L020O562K907L726J1914P840
$$ y = [-1926, -5732, -4750, -1324, -1241, 1688, 4833, 5637, 3344, 2464, 2429, -104, 190, -709, -1841, -2188, -2169, -1227, 213, 814, 839, 115, 881, 4747, 6129, 3536, 1124, 1658, 2245, -390, -2763, -2466, -5782, -6804, -8191, -5379, -2117, 159, 922, 172, 629, 812, 2557, 2976, 3185, 3604, 4614, 4164, 3156, 1300, -1105, -701, -951, -4882, -3849, -4279, -3751, -5506, -6882, -9525, -10193, -4226, -2930, -4374, -3820, -5558, -6513, -4298, -2053, -4515, -7124, -5505, -1876, -1030, -772, -3009, -479, -923, -316, -3442, -4244, -3595, -673, 609, 168, -500, -2017, -2579, -2186, -2779, -3483, -2317, 529, -1104, -916, 4269, 9514, 4845, 702, -1116, -1081, -3305, -6733, -7784, -8014, -5695, -1080, 1012, -3449, -6091, -3348, 2284, 2718, 2044, 2277, -872, -4861, -2899, 1880, 2909, 1416, 3811, 2083, -487, 788, 3006, 6026, 12588, 15495, 19221, 31135, 38975]
18765C8975p959j2423o884j350k696l167l152M97J295l17N03k401j891L000L302
18750E332r07l720j068J256l036k821j299j588J076j621O66J934K079K765L36
18735f16K86K645k972O08M155K74l115j696K37J45j394k925o13K714Q92J147N537
18718E309l06k911k121R86L24R3K26j948k948r95r8J058J528j028M21M66J649
18701b95N59J214o31l1J030K88m685j127O08j881J618K516J466K364J16k745j540
18684a156m191l164K010L500N164K748k249m356j446K710J760N23L591j303l639
18669E02K17K359k250R14M50l70M154o24k563r16j945L10K195j039j367L445L127
18652F599j781k998l448p21L6L141L645n92j374J490j541l036n00K817J244l47
$$ y = [38975, 31016, 18593, 11709, 10359, 7663, 4496, 1344, 1841, 3136, 2819, 3322, 921, -970, 2030, 5332, 4425, 705, -363, 893, -2143, -4964, -6263, -7851, -6775, -8396, -7730, -5796, -3717, -952, -616, -330, 2315, -657, -49, 4106, 4380, 1265, -431, -194, -49, -1443, -4368, -4981, -2267, -1375, -228, 5309, 5003, 2092, -29, 957, 1281, 1374, 1600, -348, -3296, -4291, -4389, -3331, -1803, -2831, -2410, -1944, -295, 264, 1478, 847, 816, 1846, 2134, -2551, -3678, -3070, -4951, -3333, -817, 649, 3013, 3129, 384, -1156, -5347, -8511, -6501, -3001, 2163, 4911, 2662, -1694, -3140, -430, 1330, 1853, 5444, 4141, 502, 719, 3078, 828, 1742, 2192, 1822, 5976, 5352, 2789, 1873, -72, 238, 2433, 1394, 27, 3472, 6599, 4818, 1820, -1628, -2349, -2313, 828, 4473, 3881, 2507, 3997, 2456, -580, -1080, 1737, 2981, 2634]
18636B634j732l107j675K10J876l27k53L334p17p1J061q4L288J380k401k738o66
18619A2q49N09N69J725j607m660L869N198j323k257j532o51m17R2j241j630M18
18602c775K477N39Q86L796j7l658J684j236j764J279k207j581K274P02K998J249
18586C646k979l341K207J957N16r26J313K431j168j927j586K25j804K95J522m64
18570h3J228l0P5j450j091m20J221K158L044l622J437L326j315m04o14k299J609
18553B770j72k59l892k062L160N6o38l371Q04P20j219j649K656O33J799K903J081
18536C320n136J133J41j346J057K48L570J338j135m444j843J639L493J552k262
18521A325Q25m52Q9j949j394p91N34l344M78K135L169r00j379K812Q77J687N71
$$ y = [2634, 902, -2205, -3880, -3670, -1794, -2121, -2374, 960, 243, 172, 1233, 1149, 4437, 5817, 3416, 678, 12, -837, -328, 241, 1966, 359, -4301, -432, 4766, 3443, 1186, -346, -997, -1414, -1322, -2563, -4193, -3775, -1298, -759, 127, 3923, 3906, 248, 1932, 696, -1068, 211, -1996, -3577, -1303, -601, 2397, 3646, 667, -2674, -467, 1490, 2006, 1080, 2393, 4824, 3656, 1729, 143, 368, -1436, -1141, 381, -83, 1145, 1115, 1190, -260, -1351, -1771, -550, 1608, 4652, 1030, 2467, 5793, 4478, 4074, 3460, 1161, 2770, 2598, 2339, -1553, -3615, -455, -399, -1037, -4408, -3604, -2884, -4103, -5752, -3096, -2463, -664, 2239, 3320, -1816, -683, -542, -1888, -831, -583, 2987, 4325, 3190, -1254, -3097, -1458, 2035, 3587, 1325, 2150, 1698, 1787, -162, -1556, -2347, -1813, -5157, -4679, -2544, 625, -275, -1654, 1158, 2035, 3722, 4293]
18504D293J333q07l814k449o87j097K026L399J061M15J584j087j443j207o02J163
18488B081L749k173k371l522J034Q0k532j484P18J233K856J483J275O05n125l535
18472e628J827J835j610j496J059M3R89P17N00j115L3J264j679L44N756j488j56
18455A195K120J51j564N5l433J105M75l417K81K83M53j371l125l133N368L791
18439g66j444j915j902K446L872m22q38k504j256K192O0J618K882J633J399k987
18423B068m901j489L624j020j335J229k605K384L487P22m86j064K113P66q48K893
18407E538n90k98l008j616J090j838J250M74j228k301k235l711j865J557J002
18392g779L869M477k122l560J770L16p08J73J075K718k5q90j975j658K744R47
$$ y = [4293, 5626, 4819, 1005, -1444, -2131, -3228, -1202, 2197, 3258, 3673, 5257, 4170, 2727, 1520, 918, 2081, 5830, 3657, 1286, -2236, -1202, -1122, -3654, -5138, -4420, -3187, -331, 1152, 2427, 3032, -2093, -5628, -3801, -1966, -3576, -5072, -4013, -3970, -2981, -2264, -1764, -2879, -2846, -1582, -3261, -2917, 2839, 1351, 1195, 3315, 3466, 1902, 1957, -1476, -371, 104, -3313, -3032, -2749, -2296, -3667, -6792, -9925, -4557, -766, -2210, -4125, -6027, -3581, 291, -131, -969, -3473, -4729, -2537, -2477, -859, 2023, 3656, 5055, 2068, -2833, -4322, -698, -1718, -3053, -1824, -4429, -2045, 1442, 2164, 1678, 614, 2727, 3493, 2645, 5538, 4948, 4650, 1642, 26, 1116, -722, 528, 1002, -226, -2527, -4762, -8473, -10338, -8781, -7779, -3910, 567, -1555, -5115, -3345, -3029, -3737, -3564, -2489, 229, 204, -686, -2661, -4319, -1575, -628]
18376f28K095J888r48l048l404J90J005M3N10q12J557m92j037R67J046L057K702
18359D691j880k291l007K509j081o91q0K554K992k909Q2K395j163k607r5k859
18343c440j073J30K62K667L54j247N18L409j835j503K107l744K75Q75q64K654
18327d55N18j589O40Q3l136n27K685P03j338o2l370M92N2J072J510L662J473m616
18309b203k022M160K495k517m823P22N82l654k444J498M28p32K11J263K113j85
18293e108Q2N58k949L925K891j543l566j377K842M366J681J32k788j334k077o96
18277d961J315K2p12R39l93q64P81L289Q25l634j602J925L169J78j787J192J968
18260A650m105j197j251k317j971J604K591k5j143J219k83j315J24L784J895J258
$$ y = [-628, 1467, 3355, 2407, -641, -4045, -3855, -2850, -2807, -2297, -3109, -1552, -2044, -3081, -2114, -1068, 1989, 4691, 2811, 520, -2487, 22, -1059, -1750, -1830, 724, 3716, 807, 889, 3284, 2121, -486, -581, -3440, -4513, -4383, -4121, -1454, -1100, -2347, -1829, 1580, -255, -1758, 349, -3395, -3120, -2245, -3109, -455, 63, -1526, -886, -803, -3939, -4466, -1781, -1078, -2416, -2478, -5848, -5356, -5304, -4232, -2722, 940, 2413, -2203, -4225, -65, 2430, -87, -4910, -4188, -3606, -7260, -9704, -8206, -7778, -8510, -8299, -7036, -4923, -5108, -5026, -4468, -7417, -3492, -601, -2144, -5710, -7087, -4245, 121, 1802, 1934, -854, -2188, -4265, -4961, -3646, -3624, -4336, -3397, -3790, -4654, -3873, -584, 241, -3393, -4995, -3070, 99, 277, -1510, -318, 1650, -2455, -3652, -4903, -7220, -9191, -7587, -4996, -5021, -6164, -4945, -5228, -6543, -6419, -2635, -740, 518]
18244E18K368P94n74j263j318O53j3K272J451Nl239l714j486o50J034k193O4P25
18226d566J717L733j835l176K40J249j165m46P84L272R96M83O86m786J606j355
18210b563k10m2J3J755j740k897j03J071p19O77M420K284M32k525n30J620m62
18193D81K490j268o16J384J670j775k091j050k975j842M94K229o06j718M0N666
18177E13J790k331j240o01N48k079j236j073J644M127K94l501j504j98J071J895
18161a881m23J765m824J529q83Q74k01m58J364K646J522P35k04J501l17n70L881
18144F056J790r34l137q56J800K522p74R35L224P991M589q7k408R42M19K436O245
18127C0753L780N537R282Q634Q873J2818J3902J6582K7458L2175M0138O3569Q5713
$$ y = [518, 2886, 3680, 3106, 1843, 525, 1178, 1165, 3437, 4888, 4893, 1654, -2060, -3546, -4196, -3162, -5355, -5291, -4566, -2849, 884, -951, -4127, -3887, -2638, -3803, -4249, -3465, -193, 803, 1286, 1972, -2814, -1208, -2563, -2773, -2815, -2802, -1047, -2787, -5684, -5787, -4716, -5435, -4758, -338, 1946, 2378, -147, -677, 943, 481, 2971, 1703, 1087, 2471, 4141, 2366, 275, -775, -3750, -5592, -5098, -2869, -3475, -5193, -5153, 513, 2303, -28, -1268, -1869, -1321, -3400, -4636, -5709, -4065, 62, 356, -3145, -4649, -4847, -3776, -1881, -2304, -539, -5363, -3834, -4717, -3843, -4044, -4502, -3138, -492, 1030, 1765, 1561, 3062, 2745, 2175, 6056, 7846, 6912, 3775, 2919, 4719, 7241, 6467, 7402, 10626, 18617, 23206, 23119, 20711, 21653, 22072, 24508, 30753, 34533, 40070, 49352, 57986, 66859, 79677, 93579, 110161, 137619, 169794, 209932, 273501, 359214]
18114C59214J18971K02061L72260O94085J306721K251036K555526p0191k616550
18105E173133k135680j097462n63226l31083k31239j66763j17610q6110o7385
18096C76575n4542m0903l6671l4004k5669k1364k0753j6432j5048j2249j0674
18085H8266n683q876j0214n305m845q8j197l180k249j778k421l939J049l357m751
18070C1432q24k526l59L279L179l474n325m037L41L14l12J211p98q9k292K47M01
18053B0368q77j147j044J678l304L01m74l382J37n13J099M31j713L183M72p44
18037A4471K052n5j285k902m562m66J287k769n887J394P86k449J010L938K981
18022G544r13j803L83j726J957Q46j145J313L869K06k942l182J414k365k067P8
$$ y = [359214, 478185, 680246, 1052506, 1746591, 3053312, 5304348, 7859874, 7789683, 5173133, 3037453, 1939991, 1376765, 1045682, 814443, 647680, 530070, 443960, 376575, 322033, 281130, 244459, 210455, 184786, 163422, 142669, 126237, 111189, 98940, 88266, 82583, 73707, 63493, 58188, 53343, 53255, 52058, 48878, 46629, 44851, 42430, 38491, 39540, 36183, 31432, 30608, 28082, 27723, 31002, 34181, 30707, 25382, 21345, 21686, 22000, 21688, 22899, 22101, 22012, 19720, 19967, 20368, 19491, 18344, 17300, 18978, 15674, 15975, 15501, 12119, 12256, 11743, 12842, 13273, 11560, 14743, 15215, 14471, 16523, 16468, 15183, 12281, 7719, 7253, 8540, 5771, -116, 1278, 2064, -385, 625, 4563, 7544, 6631, 4828, 5211, 3485, 5442, 6288, 5143, 6456, 10325, 10531, 7589, 4407, 5821, 3456, 1389, 1467]
18006A467k42J938K337j191p39M406j59j997L91L442j54k328k515j670k05N67
17990C348k28J805J059j862k047p01L549M326K877l467k795K023k871j278j677
17975B061K376r53k624j231L114p85j435j20K43p9L864K563k003j945k45J383
17959D184n015l027m43Q45K437N327K860k320M75K048m001m368k66J144Q27K98
17943A005K632P00j98J029j039j215k416K397K956J776J61m27J605l731k420J369
17927D184j634j079j522J434K935J539j36p25q83k002K677J691k543Q07Q38k694
17911B887m100j012J172R50N37N91j073J437j112J170k69j333L21Q67j671J390
17895G52J790j682n00L271k851l429j392j273J801k591r47J444oQ41K616j223
$$ y = [1467, 1225, 3163, 5500, 4309, 3570, 7976, 7817, 5820, 6211, 9653, 9499, 7171, 4656, 2986, 2781, 3348, 3120, 4925, 5984, 4122, 2075, 1374, 4923, 9249, 12126, 8659, 5864, 7887, 5016, 3738, 2061, 4437, 3484, 860, -371, 2743, 1958, 523, 403, 646, 567, 4431, 6994, 4991, 3046, 2801, 4184, -831, -3858, -4301, -3456, -1019, 4308, 7168, 4848, 5323, 7371, 3370, -998, -1264, -120, 707, 1005, 3637, 4337, 4139, 5168, 4129, 2914, 498, 2895, 5851, 7627, 7788, 7361, 8966, 5235, 2815, 4184, 2550, 1471, -51, 1383, 4318, 5857, 5721, 4996, 4113, 2111, 4788, 6479, 3936, 4743, 5581, 2887, -1213, -2225, -1053, -103, 434, 1025, -48, 1389, 277, 1447, 1178, -155, 166, 1033, -638, 752, 2542, 860, 360, 3631, 780, -2649, -4041, -5314, -3513, -6104, -7051, -5607, -5613, -4772, -2156, -3379]
17879c379O19m002J950J449L989j250k227r36K908j242j608n45j858l062L643
17864e551L264K862R10N36J007L14k366j701j163J036j87K294o36o39j965J887
17848i8J159m89L99l00j780r36j123P07K392R85R15j589K873J639r12K995J956
17831H793k210k690j503l429k556J308K301P59M34J677j889j696j447J767J171
17816G90J866M45l222l080L431Q69J36j809j670k196L26L694L01N93m87J773J263
17799C023J93j765k863j554j823k056j658K533L864j216L43J816J713R33j710
17784b27N76k30n7J158K42r57m491J839k728P44L220j436o68J702M252K827m178
17767A588r48J502k015j008J825R22J073j072K80J033J088L676o95k826j032p27
$$ y = [-3379, -2760, -6762, -4812, -3363, 626, -624, -2851, -3787, -879, -2121, -3729, -4274, -6132, -9194, -5551, -2287, 575, 1485, 2021, 3028, 3342, 976, -725, -1888, -852, -1039, 1255, 619, -20, -1985, -98, 1061, 572, 971, 671, -1109, -2045, -3168, -2461, -69, 916, 1831, 242, 3115, 4754, 3842, 6837, 8793, 6583, 3893, 2390, -1039, -3595, -2287, 14, 773, 1207, 2884, 995, -701, -2148, -381, 790, 2656, 3101, -121, -3201, 230, 1099, 1235, -574, -2244, -4440, -4114, -420, -119, 474, -13, 1760, 3023, 3216, 1451, -1412, -2966, -4789, -6845, -8503, -5970, -2106, -3322, -2979, -1163, 550, 1483, -227, 349, 119, 62, 1220, 1462, 505, -3986, -2147, -4875, -4131, -911, -2347, -3015, -1313, 2939, 5766, 1588, 640, 2142, 127, -881, 944, 1866, 2939, 1867, 2147, 3180, 4268, 7944, 7249, 4423, 3391, 2664]
17751B664O83o71p90p34k91k630j127R61M060K042o03j899j543J461k453k098
17735b968J508n05L96J70j196j688K09J742j96j374P46L725J595P92J510k771
17719A695q09K485k267R62N6m502r12j349J281L873J444k644p36K201J800k211
17703C67l264j958J044R36p85q99j733N00p88j634q04R22L007O15l63J321L526
17686A0K816M26m918k798K745K34N82J97K190n18k553P43L723N16j837K452j164
17669B846l601j125J828J990K592l706P11k459M92k09O59J850j234N7J064p03
17653A052j120k822Q84J953k06j400L475m3m471j414J526j014k482l892m366L443
17637a0897M060R37K647n06p79n4J11N064l337m087K36Q38K222J616Q05J213Q66
$$ y = [2664, 3347, 2676, 1886, 1152, 861, -1769, -2896, -1935, 2125, 4167, 3564, 1665, 122, 1583, -870, -2968, -1460, -1965, -1569, -1399, -2595, -4283, -4074, -2332, -2528, -3902, -3156, 569, 2164, 2956, 4466, 1695, 886, 3371, 1104, 2066, 2122, -2380, -3292, -4641, -3360, 513, 1957, -687, -1423, 778, 2578, 367, -2897, -4855, -3811, -2875, -3660, -4559, -6292, -5792, -6580, -8214, -9018, -8096, -5089, -4474, -4837, -3516, 10, 2826, 3252, -1666, -4464, -1719, -1485, -903, -706, 1484, 966, -1587, -844, 2879, 3395, 1558, 4010, 2846, -755, -1880, -52, 1938, 4530, 824, 1535, -924, -432, -641, 18, 1868, 634, 691, 1755, 1052, -68, -2890, -2006, -53, -259, -1659, 1816, 1773, -2698, -4112, -2586, -3600, -6082, -9974, -14340, -10897, -6837, -5900, -3253, -3759, -4538, -4592, -4481, 583, -2754, -6841, -6605, -5767, -3545, -1929, -1124, 89, 955]
17620I55n74j79mN92P19K257J536j328K180j262m842l225K40O16K900j290j294
17603b003P5J070k103l206j349L862N645J481K426LJ22l507j568M80J162j10L5
17586B515J942J90j325j758j756j748L101K344q99j499j766j927K616l705k214
17571e889k42M824J474l238k499L096J802J691k562L46L54o89J296j32k41k859
17555c468j046k376L888J850J551R49L38Q90l1J582l847k680j26M372l06j990
17539d50k285J639M975J055m028l235K43K722n77j888l95R33K389k077j810j567
17523d356K216J814q65n12j763o00Q41q22o61P48P38M3L307j754n603j443K094
17506f578L785J369j772K104l78k567J910K82J713M0J76j834l680j550m36J396
$$ y = [955, 381, 202, 198, 790, 1509, 3766, 5302, 3974, 6154, 4892, 50, -3175, -2935, -2319, 581, -709, -2003, -1928, -858, -2961, -6167, -7516, -3654, 1991, 3472, 5898, 5901, 6023, 2516, 948, 1428, 2590, 2480, 2515, 4457, 4647, 3322, 1564, -192, -1940, 1161, 3505, 2606, 1107, -659, -2586, 30, -3675, -5889, -6131, -1307, 167, -3071, -5570, -2474, -672, 1019, -1543, -1197, -843, -1532, -236, -368, -609, -3468, -4514, -6890, -3002, -1152, 399, 1348, 1686, 2576, 2545, 4127, 280, -2400, -2526, 1846, 1540, -450, -2735, -1096, 3879, 4934, 906, -2329, -2086, 636, 59, -1829, -2224, -1291, 1098, -979, -2789, -4356, -2140, -326, -1191, -1703, -3466, -4066, -3225, -4047, -4708, -3960, -3222, -3179, 128, -1626, -7229, -8672, -6578, -2793, -1424, -3196, -1092, -1470, -4037, -2127, -1845, -132, -92, 84, -1750, -5430, -6980, -7416, -6020]
17490f020J037j05K657J950j357k019k654P10J655K114J170j145j378j330O178
17475A463K394k361l285L194j878n490N26K551K752J972K096J584j316j728k171
17460C03n84K765J182l228l392k700R94L95J998K53K726P30N21K469J738R83J235
17443H388M611J4550J4544n191j5636j1995o963r06j004k243J118q73j085n86
17429c271J240K294J021N76J773R93l254M172J218M61j428j099j366L30J084k317
17413B427l431j038j309k22L953q04l204N10K987L33O28J315J215k878k346k395
17397d259m491M55m42J248L044k164q22K761N016n72k034j956P76J901j467K02
17381b804J494l19l32J693n21k021p94J637K69n34N31M1J079k567l336K156q85
$$ y = [-6020, -4983, -5088, -2431, -481, -1838, -3857, -6511, -5801, -4146, -2032, -862, -2007, -3385, -4715, 1463, 3857, 1496, -1789, 1405, -473, -5963, -5437, -2886, -134, 1838, 3934, 5518, 4202, 2474, 303, -281, 2484, 3666, 438, -2954, -5654, -4660, -4265, -2267, -2014, 712, 1442, 1963, 4432, 6170, 7153, 8388, 12999, 27549, 42093, 36902, 21266, 9271, 2308, 1402, 398, -1845, -727, -1600, -2685, -3271, -2031, 263, 1284, 1860, 3633, 4626, 1372, 5544, 6762, 7223, 5795, 4696, 3330, 3660, 4744, 2427, -1004, -2042, -3351, -3573, 380, -424, -3628, -3118, -131, 202, 830, 2145, 3360, 482, -1864, -4259, -8750, -8295, -8737, -7489, -4445, -6609, -7431, -4670, 346, -226, -2260, -4216, -3440, -1539, -3006, -2804, -1310, -1629, -1961, -268, -789, -2810, -3604, -1967, -1698, -2232, -1701, -1660, -581, -3148, -6484, -4328, -5213]
17364e213J557J495K324J76L154p26n423j81N21M219J462j652k790j407M19K622
17348E57j519J641J512N71m632l152N981N942L003l044k622q71P6J886l528l255
17332a454q70O68J568K269k402j715N55m132j302O519K547O28k412m30J474l658
17316b147Q63O22j988k340R46L212o08k528P49K956K418l84n438K744L186J26
17300B389j411l470n92L397k50K454k110k980J211K394p08J231K724N69l133m475
17284b760k223j271K197M849p89j512M630M081R64m607M77L047k597l221o46J335
17268A954j8K79p39p48O17Q15k911k484k292J237M01L002K92J977J60k246q87
17251a591k718K028J262K563k649l844J518K648P87k968j800j78j763J168j297
$$ y = [-5213, -3656, -2161, 163, 339, 3493, 2767, -2656, -2837, -2316, 1903, 3365, 1713, -1077, -2484, -2065, 557, -962, 679, 2191, 2762, -1870, -5022, 959, 6901, 9904, 6860, 4238, 3367, 3443, 5329, 1801, -1454, -2324, -1656, -88, 2181, -221, -1936, -1381, -5513, -6815, -296, 2251, 2879, 467, 37, 1511, -2147, -1284, -662, -2650, -4990, -4044, -832, -1440, -3968, -3219, -263, 2155, 1771, -3667, -923, 2263, 2389, 978, -2492, -3084, 313, 63, 2517, 407, -2573, -1362, 1032, 324, 1555, 4279, 4848, 1715, -2760, -4983, -6254, -4057, 792, 3, -1509, 3121, 7202, 8166, 3559, 4036, 7083, 4486, 1265, 619, 1954, 1936, 2215, 1476, 728, 1345, 2160, -751, -3235, -5527, -4290, -3889, -887, -595, 1382, 1542, -704, -1591, -4309, -2281, -1019, 1544, -1105, -4949, -3431, -783, 4, -2964, -4764, -4942, -6705, -5537, -6834]
17236f834J390L323M44K235j162J799K501j697n215l639J598J480J088M48j933
17221d174K78o11k002k24M705N243j433m656K285K985R12j642J62l335k484P46
17205c245R45K766m97k22j384j514J094j439o66K604l80k51j442k317K336K4l641
17188g229J873J976Q50K796k008k08K529j203M7J69m15J476K731N12p84k415n71
17171A26n9R34J081K215P95j515l076m341M52n32J185O229Q5j946J567j199J255
17154C256M15k449K887J070o626m490Q4m42j354L522L882j383j791M04L14j391
17138d092nK244K126Q19m2j405o91J686K265K412Q44j541l412k222j137j579J023
17121b707K801J613q94k403k296q36J281J671K913J23o13j198J554q65k17R19
$$ y = [-6834, -5444, -2121, -1677, 558, -604, 1195, 3696, 1999, -3216, -6855, -5257, -3777, -2689, -2241, -4174, -3896, -4507, -6509, -6733, -2028, 3215, 1782, -2874, -589, 2396, 3308, 1666, 1828, -1507, -3991, -3245, -2300, 466, -31, -253, -1637, -3151, -2057, -3496, -4162, -1558, -1938, -2189, -3631, -5948, -3612, -3588, -7229, -5356, -3380, -2530, 266, -1742, -1950, 579, -624, -577, -408, -823, 653, 3384, 3896, 3112, 697, 126, 67, 1001, 2082, 4297, 5092, 3577, 501, -3840, -3388, -3920, -2735, 3494, 3579, 1633, 3200, 2001, 3256, 3671, 1222, 4109, 5179, -1447, -5937, -5853, -6295, -7649, -4127, -245, -1628, -3419, -3015, -2701, -4092, -4097, -1853, 273, 1092, 1050, -355, -1046, 640, 2905, 5317, 6161, 4620, 1208, -1014, -2151, -3730, -2707, 94, 1707, 813, -1590, -3886, -4722, -3441, -1770, 1143, 1266, 653, -545, 1009, 144, -73, 846]
17105H46k912j265n34m75K870l10M81J967J391j149R38j350N19o77j060R69J462
17088A711j660R45K19K789j617j622k03m058J825K00j500j651K054j674M000L399
17072C157o16j302N25J769k373J137M836l691o76P87J8j745k982J559l7l426M91
17055b569J671q8J309J336j647p19k85L679K640N5q64j150r90k255j034j276J061
17038a126Oj641O5K564K349p75j614K171J366M620L131j951l053m883m184j813
17022d768J737P05j082L848q29p81n28j872K171j097k050J013n38K457j423k484
17006e521r8K075L056L56k176O25R4q79k141k577j774K939O216K773K025K730
16990G723m843j594J910J001l62J082K204M52k253j060J872j150N39k371k973
$$ y = [846, -2066, -3331, -3865, -4340, -1470, -1780, -1299, 668, 2059, 910, 1848, 498, 1017, 340, -720, 249, 1711, 51, 996, 1215, 4004, 2387, 765, 562, -3496, -1671, -1471, -2971, -4622, -2568, -4242, -242, 3157, 2541, 1239, 1764, 3533, 1160, 2297, 7133, 3442, 2766, 3553, 3571, 1826, -1156, 403, 366, -3060, -2569, -898, -986, 323, 1659, 12, -707, -992, 2687, 5327, 5382, 4518, 3368, 2378, 123, -911, -2187, -1126, -1120, -2761, -2696, -132, 2217, 1442, -172, 1999, 3365, 7985, 11116, 9165, 6112, 1229, -2955, -4768, -3031, -2326, -3408, 440, -389, -1170, -1698, -3570, -1399, -2496, -4546, -3533, -4071, -1614, -3037, -5521, -5619, -3544, -488, -132, -2308, -1683, -1589, -2468, -4609, -7186, -8960, -6021, 195, 2968, 4993, 7723, 2880, 1286, 3196, 4197, 3835, 4917, 7121, 7573, 5320, 4260, 6132, 4982, 5521, 3150, 177]
16975A77n41k141J912J108P17R5J352J757J015j928j980k900l122L12N92M163
16959E88k157l587j747P11Q45M513K564k098p1j706k704O50l167J38L635J506
16943b087K35r01J314m10j474K295P19j202K432J546l586N04L446l037j535k089
16927c830o77J082J50O17N89L58l678N70q7r89j901R60N07N04p6J78J558Q55k471
16908e781K5K767P86J447L376K01k817k1o0J670j405L34K389J482k132j345j243
16891c27q32L751O38m77K685N56j56j78j274l493k568O547k157j637R28l96P40
16874B350K52p18j274l266j263q7R70J943O6k793l715N88K831J154J15j418L064
16857a201j531L06K661j155q23L542k477r99K793J585l63M684l88j845P96l134
$$ y = [177, -364, -2505, -593, 515, 1232, 1327, 2679, 4436, 5451, 3523, 1543, -1357, -4479, -4167, -3575, 588, -1569, -5156, -6903, -6192, -5347, -834, 1730, -368, -439, -2145, -4849, -4199, -7366, -7228, -3593, -2087, -1852, -2753, -1439, -1849, -3323, -1028, -309, -1511, 921, 2467, -1119, -615, 2831, -206, -1741, -3830, -4507, -3425, -3275, -2658, -2069, -1711, -5389, -4819, -4906, -5895, -7796, -6836, -6329, -5825, -5901, -5723, -4165, -3310, -5781, -5756, -2989, -2203, -756, 2620, 2821, 4, -17, -77, 1593, 188, 522, 2911, 4393, 2261, 916, -327, -1159, 2592, 3230, 2753, 5438, 5994, 5838, 5660, 4386, 893, -1675, 4872, 2715, 1078, 2006, 1610, 2350, 2602, 1884, 610, -2656, -3919, -4006, -3036, -1093, -1027, -3820, -7535, -6947, -4116, -2962, -2847, -4265, -1201, -2732, -2426, 235, -920, -1743, 1799, -678, -1677, 1116, 2701, 2338, 7022, 6634, 4789, 5585, 2451]
16841B451k564N1K437K136R47m10n0j718l748k405n28j34J430j841O52k405j824
16824g523L459Q79K245P12m709j793L37K102J168O77J949P55k094k712k663J189
16808f022K366K866j246m133Q66L935m32m066k211j400L994Q494Q428m267n468
16793A704l078J57N36R83k705kP71j957J573q46q69J644j954j204n697q65K100
16776i709M695M711J059K708k021l445P12k737j689M778J644j815k705l50R11
16761c253K619j39p72j101J979L828P90O54K568k412j892j088J799p68l035j847
16745b070j030L06K108J222k885k06K195J083k413j876j487K416K780l066m212
16730g135L448J549o50K92n55k385J91L581J810M46m44j031Q1J282r47k066L06
$$ y = [2451, -113, -62, 2375, 4511, 5458, 5048, 4998, 3280, -468, -2873, -3401, -3535, -2105, -3946, -3294, -5699, -7523, -4064, -3185, -940, -228, -4937, -6730, -6393, -4291, -3123, -2446, -497, 258, -1836, -4548, -7211, -6022, -3656, -790, -2036, -6169, -5303, -1368, -1800, -5866, -8077, -9477, -5483, 3011, 11439, 7172, 1704, -1374, -1217, -681, 302, -2403, -2405, -1634, -3591, -2018, -2864, -3733, -2089, -4043, -5247, -10944, -11809, -9709, -5014, -303, 756, 3464, 1443, -2002, -1290, -4027, -5716, -938, 706, -1109, -3814, -4164, -3253, -634, -773, -1545, -2646, -667, 3161, 3951, 4605, 7173, 4761, 2869, 1781, 3580, 2812, -223, -2070, -3100, -2794, -686, 536, -2349, -2555, -360, 723, -1690, -3566, -5053, -2637, 143, -2923, -7135, -3687, -2138, -2788, -2496, -3051, -5436, -5245, -1664, 146, 592, 148, -883, -802, 480, -467, -2533, -2227]
16713b227j926j07K638j412j677J108K567j760m422L330M776L186r3j955j955
16698G1M82j724r09j98o94J527J621J611k512l526p29L301K470l88q15K416q54
16681A150j001J9l245j886N370L816m05j179O76K923k901QQ57m71l737j872j679
16664c557k798M868K254k293l033o31J74k378J150L39L416J749N22k3L60J474
16648A593j339l351R91L767K020j550j652j858k521P02K899k8M61q36n04j123
16632b329K635l659o49L933l70K046j492m236k84Q78j514j304l711L927M147j897
16616c879n73n45O51PJ295r03R38J577l66K68j747P24j918n039K623P366J302
16599A781O62l797l06n31k356j178p09K541l40l855j195J806K74q03J547J311
$$ y = [-2227, -4153, -4260, -1622, -3034, -4711, -3603, -1036, -2796, -7218, -3888, 888, 4074, 3981, 2026, 71, 553, -1171, -2080, -2278, -2972, -1445, 176, 1787, -725, -4251, -4980, -1679, 791, 403, -412, 2004, 1150, 149, 168, -3077, -4963, 407, 4223, 3818, 2639, 3315, 6238, 3337, 3345, 4202, 3731, -6, -1878, -3557, -6355, -1487, 767, -1526, -4559, -5190, -5016, -7394, -6244, -5905, -2489, -740, -218, -241, 119, 1593, 254, -3097, -2106, 1661, 3681, 2131, 479, -1379, -3900, -3198, -299, -327, 134, -702, -1206, -2329, 306, -3353, -4002, -69, -439, 1607, 115, -4121, -4405, -3527, -5041, -6345, -10056, -6129, -1982, -3879, -4452, -4997, -4346, -4339, -3044, -3947, -3009, -1432, -1798, -1530, -3277, -2553, -4471, -9510, -6887, 479, 1781, 2443, -1354, -1660, -2191, -4547, -5725, -6434, -3893, -4233, -8088, -9283, -7477, -7203, -8006, -6459, -5148]
16583e148J241m63K18K794j961j589Q32n53P73L616J694j548J571J361j235l6
16567A567R07J451j359m245k473J718j294l07P24P46j605j159J089R8J475J866
16551h01J918J193j724m966m70P34q76L30K772r7q54k954j933L971K20j447L390
16534a594K867j535Q65K396k142j758J024k38M22j49k441o70J813q41j486k707
16518f174J579L448l353l699J22J023K198Q86n36R64J446R82j040j061N176J23
16502B084m040j554j095K260k26r75K700L07Q46Q31k391j827M34L266j233j053
16486a666K008J081j063j846l526R43J230m94P41L700K99l465j955L42M509j204
16470c66m002J050J00J443j697q36J420P48J627Q09j661Q06P75m417O39l69j544
$$ y = [-5148, -3907, -4370, -4152, -1358, -3319, -4908, -4076, -4629, -3856, -240, 1454, -94, 1477, 2838, 1603, 1567, 2474, 3925, 2566, -1679, -4152, -2434, -3728, -4035, -3311, -2565, -4170, -5329, -4240, -4142, -2667, -801, 1117, 2310, 586, -4380, -4850, -4116, -4992, -4662, -1890, -1987, -2841, -5795, -7728, -3757, -3537, -4984, -1594, 1273, -262, 603, 2999, 857, -901, 123, -115, 307, 158, -2283, -2953, -1140, -1981, -3467, -6174, -4595, -1147, -4500, -8199, -8077, -7054, -4856, -3970, -4506, -3542, -2096, -1114, -2154, -3215, 1961, 2084, -1956, -3510, -4605, -2345, -2571, -3546, -846, -539, 307, 1138, -1253, -3080, -2646, 620, -613, -1666, 342, 1423, 360, -1486, -5012, -4069, -2839, -3333, -2592, 1108, 1407, -2058, -4013, -3671, 838, -366, -4368, -3318, -3218, -1775, -3472, -4308, -2888, -2140, -513, 296, -1365, -559, 216, -4201, -3562, -3931, -5475]
16453e475l248J487J284r08j711J006p64J658K827L96L281l97k096r1J103r22
16437b570n80K721L32l32L190j527n68l265k283K567O319L350k969l393k293J109
16421a92P40P80J519J154j298l635J619N074j718j727l532J152J628J629j992
16406A201l867j497M51j61J868J012K750j56m113l965J498M17q88J98j659j610
16390h521L860L251J194J338P60J472j795k936n016K7M255K62j386q87K933K055
16374H66K076J086J181l394J59o15k004q10Rn142R30M754L408p38l46r7m06j784
16356h67j904r29p62M19j315r38J639m11k552J299M816K872j055P36L56M64l759
16339a891j152L762J143Q17j727P71k778l384l041k575L368R78j833N242K523
$$ y = [-5475, -8723, -7236, -5952, -6860, -8571, -7565, -8329, -6671, -3844, -3448, -167, -564, -2660, -2751, -1648, -2570, -3150, -429, -97, -429, 2761, 1234, 666, -2599, -4882, -2315, 4004, 7354, 4385, 992, -1301, -192, 548, 1328, 2847, 4001, 2703, -932, 687, 5761, 4043, 2316, -1216, -64, 1564, 3193, 1201, -2666, -4163, -3712, -3873, -2005, -993, 1757, 1601, -2512, -6477, -4979, -4562, -5450, -5252, -6911, -8521, -4661, -1410, -216, 1122, 1882, 3354, 1559, -1377, -6393, -6366, -2111, -1849, -3235, -4122, -1189, 866, 2942, 4028, 5209, 1815, 1974, 1359, -645, -1455, -1446, -6588, -5658, -904, 2504, 1766, 1420, 1323, 917, -867, -2771, -3700, -4462, -4043, -5358, -6296, -4657, -5068, -7620, -6321, -1505, 1367, 312, 1048, 1404, 1868, -1891, -3043, 719, 1862, 2679, 952, 1723, -1055, -4439, -7480, -10055, -6687, -5709, -7542, -2300, 223]
16324B23Q60k253j45k95p80K87q84n07k413r11m62J033J182Q71K513k99j946J343
16306b583j27K082j868n521J081L007K468L92n23j631l634j011M34J284j024N83
16290f591L855K728k412K62j468R60K76L153j826l52J203j507J925j744k81j605
16274c424j580J049J756j342j44p64N711K747j632p74j559k530m855j337j464
16259a0142L25K721R15K52R42K188O68L169J038k912j001k055N74K293J365l058
16243b718p56K116J034J479j827j8j917j679m161Q83N685p96k683m553M84L547
16227e880K734j778n696l744O040K564k736J041L007q9J299P42j128j179j470
16212f273J473J861r4j336L96k061L672K897q97j122q21N76J661n58k168k540
$$ y = [223, 1083, -1170, -1315, -1610, -2390, -2103, -2987, -3494, -5907, -6818, -7280, -6247, -5065, -4194, -1681, -1980, -3926, -2583, -2710, -628, -2496, -8017, -6936, -3929, -1461, -1069, -1592, -3223, -6857, -7868, -7434, -6150, -7174, -6591, -2736, -8, -2420, -2158, -3626, -2666, -2390, 763, -1063, -1415, -212, -1719, 206, -1538, -1819, -3424, -5004, -3955, -2199, -3541, -3685, -4449, 1262, 4009, 2377, 1603, 44, -2486, -7341, -8678, -10142, -9817, -7096, -6181, -5929, -4987, -2799, -2131, 1038, 2076, -836, -1837, -3892, -3318, -1025, 340, -2718, -3474, -1358, -324, 1155, -672, -690, -2607, -4286, -8447, -7564, -1879, -2675, -5358, -9911, -9427, -5880, -3146, -4924, -10620, -14364, -8324, -5760, -8496, -7455, -4448, -4537, -3238, -2496, -3624, -4803, -6273, -4800, -2939, -3033, -4369, -3973, -6034, -2362, 535, -362, -1484, -2305, -1729, -68, -626, -2794, -5334]
16196e334j909l09J375J648m82j006q80R22L453L65l25K872O58J599p9N89l45
16179B812l01J377R86L59m420k451k861P16K939K552P70p91k136j496K511k097
16163a531j629L803N870n5K086o45l465Q97r92j185l524l376J068K089M94J56
16147F1l82P75L63J016k475l995k172J824r33J650K614k046J201o23L064K191
16131B133q01k279Q02M84P8k453j64q95j630k585N53N718K518m443j300j66k633
16114g063K440L390l304Q83J123K080J126K032k646L90l132m018M120K040J220
16099F81K63M7J070o51l407l663M77J154j942K328K940M93n823l687K215J901
16083e604J791K634J31l112k121J170L360L9K194O67k304Q68J822J604j782k54
$$ y = [-5334, -7243, -7552, -6177, -4529, -5011, -6017, -6897, -5975, -2522, -2157, -2482, 390, 1048, 2647, 2568, 3157, 2812, 2511, 3888, 4874, 5233, 813, -1638, -4499, -3783, -844, 1708, 2478, 1687, -449, -1945, 566, -1531, -3160, 643, 6513, 6458, 8544, 7899, 4434, 5331, 4339, 3154, -370, -3746, -2678, -589, -95, 61, -321, 454, 817, 1833, -642, -4637, -6809, -4985, -5918, -4268, -1654, -3700, -2499, -3122, -58, 2133, 1332, -947, -145, 339, 417, -2036, -2200, -3095, -4725, -7310, -6757, -1039, 1479, -2964, -4264, -4430, -7063, -4623, -1233, -4537, -3654, -2531, -451, 675, 2707, 61, 451, -2681, -6699, -2579, -539, 681, 944, 991, 2061, 1410, -1997, -5660, -5183, -4029, -5971, -3643, -703, -210, -6033, -9720, -7505, -5604, -3813, -1179, -1048, -4160, -6281, -5111, -1751, -1712, 482, 1149, -1155, -287, 1535, 3139, 1357, 1103]
16067A103J4L257K432l117k354O96J394j405j95K193L99k081l083l494N33K042
16051a666P4J858l30o26k866l591j504K27Q28L114p3p59J910Q95O41K329p91l25
16033f55j36k703k069K915J917o18q04q8J049M12oL097M93k387n073p03J058q21
16015e122j245l65j653J445J41n23o51P99P7M0L967k75l004n72M224l81k563j154
15997f815j188J843L918M651P24m447l380J230L848J377R6K06k736l491J894o27
15981b897p51J358M59k315L439L892l259m930k442L893Q38p21Q99M06Q58J872
15965E99k181m590l499K405L581M965N036J106J718m858o515l514K33p56n79J936
15949d913p34J005J05L013K446L887K60k21K610o621l640J103J172p51l765J2
$$ y = [1103, 1117, 4374, 6806, 3689, 1335, 2031, 3425, 2020, 1825, 4018, 4417, 2336, -747, -4241, -3708, -1666, -1592, 266, -64, -690, -3556, -7147, -8651, -8424, -7596, -4482, -4555, -5314, -3404, -2509, -1868, 461, -330, -655, -791, -3494, -5563, -2648, -731, -1349, -2153, -2241, -1192, -780, -786, 2311, 2804, 417, -4656, -5359, -4301, -5122, -6367, -6732, -8385, -6940, -6799, -7322, -7973, -7174, -7097, -7057, -3090, -3365, -6369, -6941, -2717, -3098, -5661, -6815, -8003, -6160, -2242, 2409, 3133, -1314, -4694, -3464, 384, 1761, 1857, 2063, -673, -4164, -2270, -2897, -3648, -2290, -1831, -4146, -707, 3185, -74, -5004, -7446, -3553, -2715, -3436, -2537, -2131, -1273, 599, -1582, -6172, -9671, -7266, -3685, 1280, 6316, 7422, 9140, 4282, -2233, -5747, -5514, -6270, -6849, -4913, -5647, -4642, -4537, -1524, 922, 4809, 5069, 4848, 7458, 837, -2803, -1700, -528, -1279, -5044, -5032]
15933e032Q98K526J600m17j11j262L264P14k81j790k353n06O34J89k394Q44m394
15916g871K314K357J442K105k816j908j369q13Q87J551j86k391k942J142L951
15901d547L249n23J986J971k432m147L83J248K748l5Q97Pl389q86J307J05k448
15884d506J900J23n1K202j215k627j408M84L294k98j082K29M820O9j056j782k566
15867c470n23j609j56J817m19K77o34j802j39M20r79M003L700J639k396p9j448
15850a798k682l366k34N93j528J962N205P67l732Q18J264j976J687K881J045N46
15834A452J927k125l076P61r70k87O71J78M721J490j63k239J274j183m02k501
15818d72k352O47L845j811l584N4j094J36K583J35J503k77j235k314P70J909J393
$$ y = [-5032, -4134, -1608, -8, -425, -536, -1798, 1466, 2180, 1899, 109, -2244, -2750, -2116, -1927, -4321, -3477, -7871, -5557, -3200, -1758, 347, -2469, -4377, -5746, -6559, -5672, -4121, -4307, -6698, -9640, -8498, -4547, -1298, -1821, 165, 2136, -296, -4443, -4060, -2812, -64, -99, 798, 805, -2584, -3470, -2163, -2058, -4506, -2606, -2483, -2534, -332, -1547, -4174, -5582, -5098, -1804, -2102, -3184, -2955, 1865, 1934, 878, -904, -3470, -3993, -5602, -5758, -3941, -4360, -4083, -4717, -6519, -6658, -6238, -7217, -3214, 486, 2125, -271, -350, -1798, -4480, -7846, -8080, -7487, -9015, -7053, -1848, -1081, -4813, -3995, -2731, -4707, -3020, -139, 906, 1452, 3379, 1254, -1822, -1061, -2031, -2318, -1647, -1469, 3252, 4742, 4579, 2340, 3614, 2431, 2029, -472, -2824, -2177, 1668, -143, -3727, -3673, -4767, -4631, -2048, -1913, -410, -687, -1922, -4236, -3466, -1557, -164]
15801a64J315L799k645l077O86j517K61J817k468K394R38k072K772m99j428o47
15785e35L73j882J569j607k493Q53n70m25J565r79j235Q55j543J109j367P82J713
15768c817j231K272j229J976l95J341m856k861J767j788L277K16N64J913J829
15753a022J519k744k122L157K516R88K48J002J05n372l897J054L025J180j258
15738a621k648O200K188m571n071K159J573k642J730J250K804j141P68K52j354
15723a24j363P01M49n09o71Q96j318P03J283j231k965p33M027j562j677K587L644
15706B137l574j881Q41q82k51j032J68K539K094l233k089L289j076P85L406J126
15690B367J159j757n768p97J45J702p71j550j952J133k99l405J39M652M36J013
$$ y = [-164, 1151, 4950, 2305, -772, -86, -1603, -1342, 475, -1993, 401, 1339, -733, 2039, 1540, 112, -535, -162, -2044, -475, -2082, -4575, -3722, -4292, -4717, -3152, -4131, -5366, -4511, -6054, -4945, -6312, -5530, -3817, -5048, -2776, -4005, -2029, -2424, -1083, -5939, -8800, -7033, -8821, -5544, -5328, -4764, -2851, -1022, 497, -2247, -4369, -1212, 1304, 2292, 2540, 3542, 3647, -1725, -5622, -4568, -1543, -363, -1621, -4269, 1931, 4119, -452, -5523, -3364, -1791, -4433, -2703, -1453, 1351, 210, 978, 1230, -124, -1487, -786, -337, -846, -1517, -621, -1939, -1236, 47, -1184, -4149, -4882, -855, -2417, -4094, -1507, 2137, -1437, -3318, -2477, -3359, -3610, -4642, -4474, -1935, 159, -3074, -5163, -1874, -2950, -2165, 1241, 2367, 3526, 1769, -3999, -4796, -4651, -2949, -3720, -5270, -7222, -6089, -6388, -9793, -9654, -5002, -4566, -3553]
15674c553l450j850m3L938K160J749J018Q65m29K069k108l082k266n06K980J442
15658a066J782K668j130q73m45m336k07Q64K612o32j867k176K264L366J578L995
15642F397j087l618k006k169K73Q82j161K174K813j57P25k92k524k044R26M952
15626D084r92j295r81J085K876l17n202l49j485l43J376J636l288j786J44r85
15610e822n15l062o90K03k01J789J751L140L067r00k188m06j016J831R45k274
15594d348k771K569K476k318n6k98L010j375n31O57J186K282m131k05J029k45
15578c069k008K737N50M361J528k239J609N82k585j407J303L859j891o76k773
15563a19J600K274j828k799M9k80l87J424n15j931M50k159R75k256J290J65Q91
$$ y = [-3553, -7003, -8853, -8896, -4958, -2798, -1049, -31, 834, 405, 2474, 366, -2716, -4982, -5488, -2508, -1066, 716, 3384, 2254, 1381, 936, -3400, -3607, -2743, -131, -763, -2630, -4806, -2542, 824, 2402, 6397, 5310, 1692, -314, -2483, -2210, -1328, -2489, -315, 2498, 2341, 3066, 2774, 250, -1794, -868, 4084, 3092, 1797, 816, 1901, 4777, 4460, -742, -1091, -2576, -2919, -1543, 93, -3195, -4981, -4837, -5822, -6337, -9399, -10089, -9886, -10087, -8298, -6547, -3407, -340, -1240, -3428, -3834, -4850, -3019, -2074, -4348, -7119, -4550, -2074, -4392, -4448, -4746, -1736, -3111, -3642, -2985, -1799, 483, -3648, -3853, -2824, -3069, -5077, -2340, -1790, 2571, 4099, 1860, 3469, 4051, 1466, 59, 1362, 5221, 3330, 2654, -119, 1481, 3755, 1927, -872, -823, -1103, -1490, -66, -581, -2512, -2062, -4221, -3246, -5502, -4212, -4047, -3156]
15546c156K982k025j398Q58J551J934r29k411P22J847l020J079M575l005P90j729
15530a335L012M163k481n377m17j64J85l178l9J174j345m229k86m36j716M913
15514g556L573N20o76K281n21k29K335J160l522k726M93p42M349J751k545j584
15498c639l91K68K246J110J540N791J084l314j525l201j962p73p55o89M7J340
15482b823Q40N16K50k130N5L429Q8j016j259K83L334J112j378j099n788q18P73
15465e631M15r69K580J688r89k38R38L762j331k005j546L03O40K292o33k55j028
15448b007j398l77r10n11L62j431J370L256J850n163l818J029K464L16M66p18
15432e220K872M081Q10k274j282K547L875k46k225k025M02j620k092k612P56l72
$$ y = [-3156, -174, -2199, -3597, -2739, -1188, 746, -183, -2594, -1872, -25, -3045, -1966, 2609, -396, 394, -1335, 1677, 5840, 3359, -2018, -2435, -2599, -2414, -5592, -5631, -4457, -5802, -10031, -10317, -10753, -12469, -7556, -3983, -3463, -4139, -1858, -2379, -2608, -273, 887, -2635, -5361, -4868, -5610, -1261, 490, -2055, -3639, -4030, -3762, -1516, -406, 1134, 6925, 8009, 4695, 3170, -31, -1993, -2766, -3521, -4210, -4163, -2823, -1983, -1467, -1217, -3347, -3292, 137, 225, -791, -2050, -1767, 1567, 2679, 1301, 202, -5586, -6404, -5631, -5216, -6185, -3605, -1917, -2906, -3144, -2206, 1556, 225, -1780, -3326, -3023, -2383, -91, -724, -979, -2007, -3405, -3782, -4692, -5203, -4841, -6272, -4902, -1646, 204, -4959, -8777, -7748, -5284, -4968, -4502, -5220, -2348, 1733, 2543, 269, -1013, 1534, 5409, 5163, 2938, 913, 1315, -305, -2397, -5009, -4253, -4625]
15416d625k639K248Q82K734L453M75j530P02k673K346j497m450j948K416N549
15401A443L480j117j002l245k002O73M26m658J91J085m262k392J835L070J96J444
15385d835J364L204J172n29k907n070j229K034k140k59N185J92j251l206m183
15370a2458J226K876K324M49p14J177Q3p05N83k197K633L24J058K692J648n08
15354D91k811j020L90J749K526k63r77O97j469p60L170J695j391J425j516l555
15338a619l456R90M120K517k815l239J9M387j479m848k132J588M691R06k592m671
15322g633j093K269J922K434J489K145j295Q55j948l408J82J791J952M32O1j781
15306a626O47K140J600k627q00k619j898j628k763L76k41p2J714K982J934R59
$$ y = [-4625, -7264, -5016, -4134, -1400, 2053, 2528, 998, 1700, -973, 1373, -124, -4574, -6522, -4106, 1443, 4923, 3806, 2804, -441, -2443, -1770, -1344, -6002, -5811, -4726, -8988, -11380, -9545, -6475, -6279, -4835, -3471, -267, 905, 376, -2531, -7601, -8830, -6796, -8936, -9195, -4010, -3818, -5069, -8275, -12458, -11232, -8356, -6032, -5583, -6297, -5120, -5037, -5742, -5159, -7356, -4723, -4399, -3341, -649, 999, 491, -2320, -3340, -2950, -1201, 1325, 1062, 85, 782, -687, -1447, 1723, 3418, 2027, 3452, 1936, -1619, -5075, -4085, 35, 2552, -263, -3502, -3483, 904, -575, -5423, -7555, -5967, -1276, -370, -2962, -7633, -8726, -6457, -4535, -2101, -612, 1533, 238, 1093, -855, -4263, -4081, -2290, -338, 94, 155, -1626, -979, 1161, 2761, 134, -666, -3285, -5183, -6811, -9574, -9198, -9439, -9511, -7797, -4815, -2881, -1922]
15290a922R00J846o04O41K005p49j314l157j031K274K349P6n50j256l934J460
15274b966R25j62j013K601J718J624j18j204q09k411K79j079j847j814j777L969
15258d084J528q32j569r25M69j031J594K967j836q13k38j710K99L656o74k50l400
15241f849j712K009N277r90N57J815n097K42M538L453l163k411J178m30j797r13
15225d293P82l725j502n41N929L403M501K47m230l610j172l576r56L097j376J517
15209e505l16K413M518Q42o86j04K4o54k94k66j172j181L739L58K394P78j88n790
15191a090l474j913j562J229N640K27j887o16J560r5j738k494L324L02L207j345
15175g25J078J977o91q27p79J91j274j925j506J827J628L92L27m74k524N89L33
$$ y = [-1922, -1022, 824, 220, 861, 2866, 2117, 803, -2354, -3385, -1111, 1238, 1314, 764, -492, -4426, -2966, -2041, -2203, -3216, -615, 1103, 2727, 2609, 1405, 596, -1815, -1536, -2615, -4462, -6276, -8053, -4084, -2556, -3388, -4957, -5882, -5413, -6444, -4850, -1883, -3719, -4532, -4770, -6480, -6181, -2525, -3199, -3449, -6849, -8561, -6552, -1275, -2265, -1708, 107, -4990, -4748, -210, 3243, 80, -2331, -1153, -1583, -3380, -4293, -3511, -7236, -8738, -9279, -3350, 53, 4554, 4801, 571, -3039, -4211, -7787, -8743, -5646, -7022, -5505, -5821, -3408, 1110, 1952, 1266, 1162, 1186, 532, 238, -28, -1200, -2381, 1358, 1716, 4110, 4888, 4700, -1090, -4564, -6477, -8039, -6810, -1170, -943, -2830, -3446, -1886, -1981, -3719, -6213, -2889, -2587, 620, -725, 353, 2330, 1639, 812, 33, 224, -1050, -2975, -4481, -2654, -1026, -634, -307, -781, -3305, -2716, -2383]
15158b383k145n34p53j153R28J946K964P83o433q895l669Q314Q240L066j964Q02
15142h86L68l67l872L4K733L57j483j273Q01L865P422J374m636o415k971J316
15126c633j097r42K478L136J711k261j002m3m119k025K994K839j589m538K735
15111e356M234P4N485K172l324K93L304k607l813K17j335j328J652R45j387l30
15095a104l625k344R43K983L388L445o43P98K391J327m932j588j484l522j217
15080e184K833O70L056l34k453l452n95K365j912M94j413K824L643M62J48J60
15064A312l714j349K401k072k773O27K49K636P96r91p59K400K289m93k7n68m080
15047d116m84j536P71M123K097j263k51j570k383J960K471q51Q71n28J785L74
$$ y = [-2383, -4528, -5062, -5815, -6968, -6040, -4094, -1130, -347, -6780, -15675, -19344, -11030, -2790, 276, -1688, -886, -518, -885, -4757, -4723, -1990, -1633, -3116, -4389, -3588, 277, 7699, 9073, 4437, -1978, -4949, -3633, -4730, -5672, -3194, -58, 1653, -608, -1610, -1653, -5772, -7797, -4803, -1964, -3553, -8091, -5356, -1122, -1048, 4437, 6609, 3285, 3578, 6882, 4275, 462, 679, -656, -1984, -332, 613, -774, -1104, -4729, -7073, -6130, -3147, 241, 3686, 3043, 3841, 6232, 7559, 2627, 1039, -445, -3967, -5184, -2351, -1681, 1375, 1041, -1412, -4864, -5459, -3094, -5006, -4512, -5925, -3101, 542, 1004, 1152, 1312, -2402, -3751, -1350, -3422, -6195, -5568, -5319, -2683, -1887, -2878, -3637, -1237, 1052, 559, 532, -36, -4116, -4600, -6136, -5365, -1242, 855, -408, -659, -2229, -4612, -2652, -181, -1032, -161, -689, 1096, 1470]
15031A470n63k409J376J329n168J287R11Q3j068n44M01J436p86J521J478m57l171
15014b874L72K689J176j450l18k559j285j082N5L373M73k618J336L016p96J375
14998H83J784q69k144K006M087k263n209j905J623K546L86j95l082K633J148K35
14982A664l01j816k009n25J606k062J449K559l476r38q87J000M320J287r07r3
14966H71J2m540K431L289p58k461M70J317J991l57k244k576k40K99J17l25L029
14949C25j475j726J482j291r80J028M893m91j852r97K22M127M201n63k249l21
14933D333l465R81M18M376K101k462m348n30J25k073J845J744l838K412J858l020
14917D57P69R90L747j429m326k914o54P14R45j007k018j87K558L64j362j43K748
$$ y = [1470, 907, -1502, -126, 1203, -3965, -2678, -1767, -1684, -2752, -3296, -2895, -1459, -2245, -724, 754, 297, -2874, -2502, 187, 1363, -87, -405, -2964, -4249, -5331, -5276, -1903, -1430, -4048, -2712, 304, -492, 883, 2667, 1798, -346, 1660, 5747, 3484, -1725, -3630, -2007, 539, 925, 730, -2352, 281, 1429, 1664, 1363, -453, -2462, -2987, -1381, -3443, -1994, 565, -2911, -3849, -4736, -3736, 584, 1871, 964, 871, 883, -3657, -1226, 2063, 1305, -1156, -686, 631, 2622, 2265, 21, -2555, -2795, -2496, -2379, -2704, 325, -1150, -2876, -1394, -2685, -3665, -2637, 2256, 1765, -87, -1084, -862, 3265, 7466, 6903, 4654, 4333, 868, 1849, 2267, 6643, 8744, 6282, 1934, 1404, 1529, -544, 1301, 3045, -793, 1619, 3477, 457, 1226, 2216, 5963, 4534, 208, -2706, -3360, -2646, -1701, -2708, -4726, -4913, -2355, -1991, -3353, -3496, -748]
14900g48j22j535J835jK060k093l434l651L024j369J176K019N4M31M66j546o81
14883d115j119L982j686k608R36Q56J597n91J843r26k840n47L2J384M524q28m724
14866d830n20K575R69k568l606j248K049k88P778K159l570n834k053M892L315
14851g80K765j957m029R10j311J755K200j050K310l12j136n086K63L546J40K083
14835C11N41k991k925K571R04J639J179j711K631j169k735l101J502k655K01l367
14819i175J67K269M155p19j312J14K350J693K933l545k585n00M39P05j056m119
14803h186K549O304L60m438j400p11J028R80P45K881L03n67m89l113l93K654N405
14786C912Q12l534o41R2k650m150j409J009L255L623j582j282J387K118j897l294
$$ y = [-748, -870, -2405, -570, -571, 1489, -604, -4038, -7689, -4665, -6034, -4858, -2839, -2785, -2354, -1888, -3434, -4115, -5234, -1252, -2938, -5546, -4610, -3754, -2157, -2748, -905, -1831, -4671, -5218, -5186, -3802, 722, -106, -4830, -5350, -2775, -1806, -4374, -7980, -9228, -7179, -7467, 311, 2470, -1100, -6934, -8987, -4095, -780, 1985, 28, -4001, -3091, -4402, -2647, -447, -1497, 813, 501, -635, -5721, -5458, -1912, -1772, 311, 852, -2139, -5064, -2493, -1589, 50, 1229, -482, 2149, 980, -1755, -4856, -3354, -6009, -5808, -9175, -9008, -6739, -2584, -3303, -4615, -4501, -2151, -458, 2475, -1070, -3655, -4155, -3716, -3011, -4067, -8186, -5637, 667, 1027, -3411, -4811, -5522, -4494, -3514, -2769, 112, 415, -152, -641, -3754, -4147, -1493, 3912, 4724, 1190, 549, 641, -2009, -6159, -7568, -6559, -3304, 319, -1263, -2545, -1158, 960, -937, -4231]
14770d231K893j253O33L55K165O53K489q12n057l017J98K533q05j944K437p47
14754c510j19o0j368J486N022R43j947o33k93K383J157m81l569N6j144j246K05
14737c118j420n15N096L450j62k547o95K007k231k322J658K526j395K848J522
14722D702j205J58p46k112o02q93k070j573K625J439Q00K109K398j160j294j778
14706G98q88M05l2l95p69L036J559j745m561N35L632N042J0054R005P390J447
14690C4513o13L628l856p156j0956j0551o237L33L720J393L734N91j780m247l127
14675f11r99K571n00j901m387l804J230P28J758R12J514l33Q35l75O64K262O022
14658E586l243m574K81O96K097J18k604m681k26m92J43K800p78j210n05l639j901
$$ y = [-4231, -1338, -2591, -1958, -1603, 562, 1215, 3704, 2892, -2165, -5182, -4984, -2451, -3256, -5200, -2763, -3510, -3629, -3689, -5057, -3571, 1451, 2394, 447, -186, -479, 1904, 3061, 2580, -989, -933, -2077, -3323, -3118, -4538, -5053, 43, 3493, 3331, 784, 89, 2096, -135, -2457, -799, 1727, 332, 3180, 4702, 3497, 3655, 2909, 797, 195, -698, -2768, -4341, -1716, -277, 523, 2632, 5030, 3870, 2576, 798, -90, 315, 283, -112, -881, 2155, 3714, 1969, -2592, -2057, 1575, 6617, 16671, 25676, 33066, 34513, 33900, 37528, 33672, 26516, 15560, 5009, -1228, -895, 2825, 4218, 7952, 8543, 6763, 2516, -611, -1610, 961, 461, -1440, -5827, -9631, -8401, -7673, -5915, -5003, -3489, -3822, -2987, -3362, -2698, -436, 5586, 2343, -2231, -1950, -1254, 843, 961, -1643, -6324, -6550, -7042, -6899, -4099, -4877, -6087, -6592, -10231, -12132]
14641a2132M155L463J386J163J132k509m104J585L939l71j02J088P58P12k776
14626b613P42K623K734M67m282j369j914k294J111lJ281J708O629j846k929p25
14610f80j764j579K122p47l856j683L84K425R99j58J655N385p64m353k557J309
14594c862L983J467L925L81Q74j427j440l703l697l281m36k224K784M399J367
14579h90J098l01k370J280J695r92k646m31O75M214j793q71O6k672p3J260K855
14562A04N75n32O33K490k560R8j158J456j111q5J619r14K494N183L175Q12j864
14545A0415r92l466m712j070l773P7J424J014J384l102l706J59K715O43k179k315
14529g484L025J07Q17J553k038j655n63K962J104j760K551J49k876k42j365K97
$$ y = [-12132, -7977, -4514, -3128, -1965, -833, -3342, -7446, -5861, -1922, -2293, -2395, -1307, -549, 163, -2613, -1871, 752, 3486, 3953, -329, -1698, -3612, -5906, -4795, -4798, -3517, -1809, 4820, 2974, 45, -680, -2444, -4023, -1901, -2648, -6504, -8187, -7803, -5378, -4379, -4537, -2882, 2503, 1739, -2614, -5171, -3862, 121, 1588, 5513, 5894, 6768, 5341, 3901, 198, -3499, -6780, -7216, -9440, -6656, -2257, -890, 208, -93, -2463, -1183, 512, -480, -3126, -3557, -2882, 1332, -461, -1332, -1266, -3938, -4011, -2751, 104, 679, 147, 780, 3270, 710, 808, -350, 1106, -5, -90, 1529, 615, 3109, 8292, 11467, 12279, 10415, 9423, 5957, 1245, 175, -3598, -3521, -2097, -1083, 301, -2801, -6507, -6348, -3633, -2990, -5169, -7484, -4459, -4352, -3535, -1982, -4020, -5675, -6238, -3276, -2172, -3932, -1381, -1232, -4108, -4350, -5715, -5418]
14513e418j674J706K961Q01l63L509L213M09k328J778j177m928j735Q51M297Q003
14497I905L406P54j457l660o063l793J068K49l276O83J34N34K385k845k828k903
14481g707j744J084K044L829L903r79R55J319j308k480j707M135o79K90M157j496
14465C616j192l149P69N319N966N118j216l975o288n656J691M659k267j513j668
14450B14j345L214l96L328r59j996j507j611J887O80M29J918m73j459J422K147
14434E493j766m275k531J230Q42k422j959P7J708O35J068j023j306r47j596m86
14418g258K580J687n91k732K536L663L02l377j320J550l131K938J503K67K10L030
14402A857J745m708N8j985N6j243J58J028K69L133J432k877j604O21j666k646
$$ y = [-5418, -7092, -5386, -2425, -1624, -1987, 1522, 4735, 5144, 2816, 4594, 3417, -1511, -3246, -2395, 1902, 9905, 13311, 14065, 12608, 8948, 2885, -908, 160, 409, -2867, -2184, -2050, -1516, 869, -1976, -4804, -7707, -9451, -8367, -6323, -2494, 1409, 430, 1385, 2704, 1396, -1084, -2791, 1344, 665, 955, 5112, 3616, 2424, -725, 44, 5363, 11329, 16447, 15231, 11256, 4968, -688, 1003, 5662, 3395, 1882, 214, -1131, 2083, 1687, 5015, 4056, 2060, 553, -1058, 829, 1509, 1938, 3856, 3383, 1924, 3346, 5493, 3727, -548, -3079, -1849, -1007, -3429, -5388, -5311, -3603, -2968, -1900, -2923, -4229, -5176, -6772, -7258, -4678, -2991, -3582, -6314, -3778, -115, 187, -3190, -4510, -2960, -6091, -3153, -1650, -1383, -1173, 1857, 3602, -1106, -1048, -3033, -2977, -4220, -4062, -3034, -2765, 368, 1800, -1077, -2681, -2060, -3726, -6372]
14386f372k36J669o70K54L58N27j014K150K20L14m512k493J967P695o23l554l088
14369g408j518L605J275o5L105K468k103P93j233k183K952J044Q99J304j443n27
14353I65n629L32L209J568K390J091k81j838l770j588K157N43j078J672k088k656
14337e001J563L665J684k271j953l076J720J915L433O59N15l213o028q15q57l
14321h063q2J731J745l041j35J608L108K5j917l54L56r21L289L402l83r22N63
14304Ik973J23P00R86J319L68l845n464M580L023K10n42j662J7k094J642L182
14287d21K580Q2q78j968k82J614k2j249J871K455k28j459l755M49j429M20K20
14270b000k778J346j185P52K609j07J120L751j999k798j167J250J669p4o466r14
$$ y = [-6372, -6608, -4939, -5609, -5355, -4997, -4470, -5484, -3334, -3114, -2800, -7312, -9805, -7838, -143, -766, -4320, -7408, -8926, -5321, -4046, -4111, -1006, 1462, -641, 152, -1081, -3264, -312, 732, 1631, 2935, 1492, 965, -4664, -4332, -1123, 445, 2835, 3926, 3645, 1807, -1963, -3551, -1394, -851, -1929, -257, -2345, -5001, -3438, 227, 1911, -360, -2313, -5389, -3669, -1754, 1679, 2338, 2853, -360, -6388, -7203, -8060, -8063, -8145, -6414, -4669, -7710, -7845, -6237, -3129, -3104, -5021, -5375, -5019, -5940, -2651, 751, 368, -554, 9, -2964, -2841, -2141, -1155, 164, 532, -3313, -8777, -4197, -1174, -964, -1506, -3168, -3151, -5245, -3603, -421, 2159, 2241, 1363, -605, -887, 727, 705, -544, 1327, 3782, 3554, 2095, -1660, -1211, -2640, -2220, -2000, -4778, -3432, -4617, -3865, -1256, -1363, -243, 3508, 1509, -1289, -2456, -1206, 463, 389, -6077, -6991]
14254f991L840J187j149L214N11J478L414r19j320o36j440m730m22K007K480n16
14238Hn975j070J360L883L245M56k442l269K27l83k14M032L262K627j588m816
14222f57K240J220q55J151o33K420J682j101j210J707L433L91J054j305k938m91
14206F108k408j956k638J187L368L604m21J569L861J412k426l624j548n2k568
14191C468q45Q25k566j792J618M178M709l57m31l767n214J51L257n64l261J9k009
14174b581l78J509Q17j186j294K915j806j095j864l11o20J211J361nn98k424Q89
14157e460L901L375q97j903q58K673p13L009n54K499k78o65j346k778N28L353
14141C886j007m267N59K855L167J612N48L430M121n85l666j780l433k127n94j202
$$ y = [-6991, -3151, -1964, -3113, 101, 612, 2090, 5504, 4585, 3265, 2629, 1189, -3541, -3963, -1956, 524, 8, -5967, -7037, -5677, -1794, 1451, 1907, -535, -3804, -3577, -3960, -4174, -142, 3120, 5747, 4159, -657, 1583, 2803, 1948, 3099, 2466, 4886, 6568, 5467, 4257, 5964, 9397, 9788, 10842, 9537, 6599, 6108, 3700, 1744, -894, 293, 3661, 7265, 6844, 8413, 12274, 13686, 11260, 7636, 6088, 6036, 3468, 2623, 3448, 882, -910, 708, 4886, 9595, 9238, 8807, 5040, -174, -23, 3234, 2670, -591, -572, -2581, -2959, -1450, -633, -1819, -3113, -198, -2004, -3099, -4963, -5274, -5894, -4683, -3322, -3327, -3925, -6349, -5460, -1559, 1816, 919, -984, -1842, 831, 118, 3127, 2573, 5072, 4794, 4129, 2783, 5, 533, 3886, 2879, -1388, -829, 2026, 5193, 6805, 7353, 10783, 14904, 14319, 10653, 8873, 5440, 3313, 2719, 1517]
14125A517K52J46l159j148O88J610K169N27m609l227k226L020L598L73j967n33
14109b969R83O76L036n23l917j100K106K834o10k838J106k135N627P788J912m791
14093G185n670j988P10M098L137j467k690m043l278j208k480Q68n91o33L053L406
14077a591Q14j843k463o35N30K235J97j884m0J14k013N05l048j778L147K153L064
14060b536r34k921K610J69K669n01j082L715M006K299P05j423l354j694Q94J023
14044C645p09o19M95K41J961q95j823J772j639Q99M067K270J342K613K417M945
14028B0982J0035K0938L1783M8378P3226P7292L5627l1477p4877p2118m5521k4814
14016F9454j6925j2281p045n519k582p876m634j291j965k150k36k478l065O78
$$ y = [1517, 1769, 1915, -1244, -2392, -1704, -94, 2075, 2602, -2007, -5234, -7460, -4440, -842, -469, -2436, -2969, -1986, -1310, 1726, 1203, -2714, -3814, -1708, 1126, 516, -2322, -1216, -3351, 2276, 10064, 11976, 7185, 1515, -473, 237, 4335, 7472, 6005, 3315, -728, -4006, -5214, -7694, -6826, -7417, -8050, -4997, -1591, -777, -2620, -5083, -5718, -5188, -2953, -2756, -4640, -4680, -4566, -6579, -6074, -9122, -10900, -7753, -5600, -2536, -3470, -6391, -3781, -3612, -943, -1444, -2526, 1189, 5195, 7494, 8199, 6776, 3422, 1728, 2622, 3645, 2936, 2317, 2812, 3053, 5014, 4119, 2296, 4068, 2429, 3328, 7395, 9665, 11007, 13620, 16037, 20982, 31017, 51955, 83738, 132116, 205342, 282634, 318261, 286784, 211907, 139789, 94268, 69454, 52529, 40248, 33203, 27684, 25102, 17226, 12592, 11301, 9336, 7186, 6950, 4472, 1407, 2085]
14002B085j547J034J287R34Q54N47n315m864L329K111r81l70K6K547o77J749n50
13985B199m366j967j813j45K599L576J344j131M29K623n53m462m688J820J309
13970c226j524O54o81j840L678j557k106L589O422P032K005M68n92q878n499P20
13954a335j531l17K926J091j25n709J523M123K68j862m922j40M295L453j358K048
13938B428n16j776J540q81l759O86J050K775L22k057K900J650L03k471l039k680
13922c525J545K804n026j432j712K174J040l42J896r19n585j350N479j764j068
13907g785O122M376J112q20J38k167j606r13J382j498J223N60q68j82L966J901
13891D941k139j243j293J459N39k049j05j152p13J336J339j488n41M947o80l034
$$ y = [2085, 538, 1572, 2859, 3793, 4647, 5194, -121, -4985, -1656, 455, -526, -896, -870, 1677, 1000, 2749, 2199, -2167, -4134, -5947, -6092, -3493, 83, 1427, 296, 725, 3348, 2795, -1667, -6355, -4535, -3226, -4750, -4096, -4777, -6617, -2939, -4496, -6602, -3013, 3409, 10441, 12446, 12914, 12322, 3444, -2055, -1335, -2866, -3183, -257, 834, 709, -5000, -3477, 646, 914, -948, -5870, -6010, -1715, 1738, 380, 2428, 1912, 136, 1676, 795, -2964, -2278, -1228, 1547, 1869, -188, 2712, 4362, 4665, 2194, -845, -3525, -1980, 824, -4202, -5634, -7346, -5172, -4132, -4474, -2578, -3497, -9082, -10432, -4953, -6717, -7785, -1663, 2713, 3825, 3005, 3143, 976, -630, -1543, -161, -1659, -436, 124, -744, -926, 3040, 4941, 2802, 1559, 266, 1725, 2264, 215, 110, -1042, -1755, -419, 920, -568, -1109, 3838, 3158, 124]
13875A24k976J594O288L707j245n504l896l138k678N30L381O519J294R14k398
13860B516m46j778K11J09P31M4k293r80j903J241O44K52K167P27K60L410K052
13843F964j155n52q72J91j533l430J157n30j090L334J389k111J246q73l2m8n856
13826c801n66M789j665j940L471J594k47l03j916k88J591k950o08J187k510J686
13810b476L663l280m355M164J050K411p88j745Q95M329O00n70j944n345k561L142
13794b810M424m820n87K399J619P80L07M39L58K322j178l729j710K689K968L39
13778C810r84j218K994k66m956l068O73M4Q78L33M40j370K618K984J802P3j830
13761B957J972r1k987j790J549K516L078k028k326J466j355k257P58J260J622
$$ y = [124, -2852, -1258, 5030, 8737, 7492, 1988, -1908, -5046, -7724, -7194, -3813, 2706, 4000, 4914, 2516, 2070, 292, 503, 612, 1343, 1387, -906, -1886, -3789, -2548, -1904, -1652, 515, 1242, 1502, 4912, 6964, 5809, 5257, 4385, 4576, 3043, -387, 770, 240, -850, 2484, 3873, 1762, 3008, 2135, 2103, 2055, -3801, -4367, 422, -1243, -3183, 288, 1882, 1635, 1332, -584, -872, 719, -2231, -2839, -1652, -4162, -2476, 1187, -2093, -6448, -2284, -1234, 1177, 389, -1356, -461, 3868, 4468, 3898, 1954, -3391, -5952, -2810, 1614, -3206, -3793, -1394, 225, 1005, 1312, 1751, 2109, 4431, 3253, -476, -2186, 503, 3471, 3810, 2826, 1608, 4602, 4336, -620, -3688, -3015, -2971, -2093, -1760, -1320, -2690, -72, 2912, 4714, 4787, 2957, 4929, 4838, 1851, 61, 1610, 4126, 7204, 5176, 2850, 4316, 2961, 704, 1462, 2722, 4344]
13746D344M388J226Q62o3M882M108r23Q31P072N809K941l779n038j1003q501l007
13730D149k872k558k095J730M53k568j16K313J027j870k566L085J535N71K310
13715B528K127j286m638l914O28K276L727K110l826L76L342K598j178j080j178
13700B612k188J755R79o843n978J142R97j467k965j493j455J098L302J302J634
13685g568q14o1R80K78m121l86O14J197O180M770J442l9k893j009k9P79M259K445
13667F024k217j258l31r95l27K42K635N742J207k361l276l37J357N33L55J263
13651H256Q54j047j393m68l054j835J841J97J083R40m52p12L12L2M3L34L296J404
13633I631K03m74K140J181L50n102Q91l71J174j005r35N476L259M121L227K789
$$ y = [4344, 8732, 9958, 10820, 10757, 15639, 19747, 18824, 19655, 26727, 32536, 35477, 31698, 26660, 15657, 7156, 4149, 1277, -1281, -3376, -1646, -1193, -3761, -3877, -1564, -537, -2407, -4973, -1888, -353, 218, 2528, 4655, 3369, -1269, -5183, -4555, -2279, 1448, 3558, -268, 108, 3450, 6048, 4870, 3790, 2612, 424, 2179, 3158, -3685, -9663, -8521, -7524, -8991, -11956, -13449, -14904, -13806, -10504, -9202, -7568, -8382, -8443, -7463, -7185, -11306, -11692, -11078, -9881, -3701, 1069, 2511, 2472, -421, -1430, -1459, -680, 3579, 6024, 3807, 2549, 2218, 1223, 896, 1138, 3773, 9515, 10722, 8361, 5085, 4748, 6105, 6638, 6993, 8256, 9110, 8063, 6670, 6202, 3148, 1313, 3154, 3351, 4434, 5374, 4922, 4210, 4522, 4554, 4597, 4931, 8227, 9631, 9834, 9360, 11500, 12681, 13031, 7929, 8820, 8449, 9623, 8618, 7683, 13159, 16418, 20539, 23766, 26555]
13617B6555N249N304J1140P530L765J184o397j6706j9114j3332k390j520j509
13604b41K698M071O14J130j7l518j31N53k34j583R63k880m98j707N49L939M816
13587H524j745j270K643K97K66j11o56L12N17k316K185J943J877N755K207k438
13571A7990l199k292J46l28j790K637N092J614N35m63k594k426J93n20j625j736
13555A1234M963N661J855K55R0L01L477k98k82o4K280M398M658M334K873L202
13539D8937j32n89k317j958K259N525J161L758M863O013N941L600o37M014O998
13524H7436R038J2844R216Q432O651M292Q275P202J0377J3375J4029J6692K6275
13511B34134K5876J8443J6831K1863L5162M4543N1565O0645P3765J02683J12586
$$ y = [26555, 31804, 37108, 48248, 55778, 59543, 60727, 54330, 37624, 18510, 5178, 2788, 1268, -241, 2457, 6528, 7142, 8272, 8255, 4737, 4606, 5159, 4925, 3342, 4305, 1425, 927, -780, -231, 3708, 8524, 6779, 5509, 8152, 8449, 8715, 8604, 7948, 8260, 8777, 6461, 8646, 10589, 12466, 18221, 20428, 17990, 14791, 12499, 12645, 12317, 10527, 13164, 18256, 19870, 20405, 19942, 17348, 14922, 15115, 14595, 12970, 11234, 16197, 21858, 23713, 23968, 24058, 24359, 27836, 27538, 27256, 27192, 29472, 33870, 38528, 42862, 45735, 48937, 48805, 48216, 45899, 43941, 46200, 51725, 52886, 56644, 61507, 67520, 73461, 77061, 76424, 80438, 87436, 96474, 109318, 118534, 126966, 133617, 137909, 146184, 153386, 163763, 177138, 191167, 207859, 234134, 260010, 278453, 295284, 317147, 352309, 396852, 448417, 509062, 582827, 685510, 798096]
13500G98096J14963J55183K29865L20818M38281N68088O41668N80624N02231O97843
13490E047660J354042K609926M830022Q521011J3384445J5955634J0024921l853967
13482E7873694j4364271j4749401r933287n705422l300198k028058j261555p70427
13474E761075n86294o60819p35753o63572n24826m12814l22922k53929k09654
13465A390492j69651j37032j10147r6393q1403p2160p1062o7115n9041m6228l4736
13454D45524k8189k7265k5454j9776k0252j5918k3202j9771j7418q498m980n952
13442B28849j2485j2234j0222r956j0805n866n869p337l457o707k713l878o519
13429A30801j2434q365j933J368R24j627o598m327j902j715k832l675k620J209
$$ y = [798096, 913059, 1068242, 1298107, 1618925, 2057206, 2625294, 3266962, 3847586, 4349817, 5047660, 6401702, 9011628, 13841650, 22362661, 35747106, 51702740, 61727661, 57873694, 43509423, 28760022, 18826735, 13121313, 9821115, 7793057, 6531502, 5761075, 5174781, 4513962, 3778209, 3114637, 2589811, 2176997, 1854075, 1600146, 1390492, 1220841, 1083809, 973662, 877269, 795866, 723706, 652644, 585529, 526488, 480260, 445524, 417335, 390070, 364616, 344840, 324588, 308670, 285468, 265697, 248279, 239781, 234801, 228849, 216364, 204130, 193908, 183952, 173147, 167281, 161412, 154075, 150618, 143911, 141198, 137320, 130801, 118367, 110002, 108069, 109437, 110361, 108734, 102136, 97809, 95907, 94192, 91360, 87685, 85065, 86274]
13415H6274j081r0J551j743M03m141k049l954p989j964k870k796J385j96j916
13400E8824l150m62n39l75J46m016q173k588J574L327J671P75r78J336O799m07
13384E3764m515p68J370N543O724O29J72N95k368j659m811l919J236k297l203
13369D6493R95k582j883L218N257N396J314K351L870K803l588j7339j8355j6183
13355A1767o208P97K732J356K877J847J326J914K049K945K544Q31l088Q44M23
13340B4956l034o80J017j351J048j478j088K29K661o65K24R92J596m515j714n92
13324A7606k011j563J408K415k052r49j974j225N248l15K25K061K263r58l228
13309A6951l026J424M64N98R03j835k344k73j24K426K312j266m485m441q71L985
$$ y = [86274, 85193, 85103, 86654, 84911, 85314, 81173, 79124, 75170, 67181, 65217, 62347, 59551, 60936, 60740, 58824, 55674, 55212, 54673, 54298, 54444, 50428, 42255, 39667, 41241, 44568, 46239, 47014, 46036, 47372, 54171, 53764, 49249, 48481, 49851, 55394, 62118, 62747, 62919, 63514, 61146, 59487, 54676, 50757, 51993, 49696, 46493, 47488, 44906, 43023, 46241, 51498, 56894, 58208, 60559, 64429, 67232, 63644, 46305, 27950, 11767, 5559, 6356, 9088, 10444, 13321, 15168, 16494, 18408, 20457, 23402, 25946, 26777, 23689, 24533, 24956, 21922, 21242, 22259, 20908, 21956, 20478, 19390, 19619, 22280, 21615, 21839, 22831, 24427, 19912, 18198, 17606, 15595, 14032, 15440, 17855, 15803, 14854, 12880, 11655, 16903, 16588, 16813, 18874, 21137, 20179, 16951, 13925, 15349, 15813, 16411, 17314, 15479, 13135, 12862, 12738, 15164, 17476, 16210, 11725, 7284, 6413, 10398]
13293A0398L276N760K286J460J362k11R14j479l199k928k14K878M468L440n18
13278B7693m877l28k667k001j224j831K21j652j043l622m110L34J046L202Q04
13263I945Q03K595J689l37k668K226K269o57k735k106j339J40o48j44m09N40J477
13246A0641J179j717k354L696M344K65J485L621O804L896j1l624J176l330n073
13231B0998l713j418J678K641k643l874l75m42k246m066j181L170L193M59K750
13216A4931p0K96J29j196j417J406k721n707k804k682P004N036J312J99j285k344
13200A0087m90K432j81p81L5J350L3l011n035Q30M532O39N6j161J573J008R37
13183A2853K402j125l511m48n31N5k30j439k777j980k71L13M68j51M24N41J213
$$ y = [10398, 13674, 19434, 21720, 23180, 24542, 24331, 25245, 23766, 20567, 17639, 17425, 20303, 24771, 28211, 27693, 22816, 22488, 19821, 17820, 16596, 14765, 14986, 13334, 12291, 8669, 4559, 4893, 5939, 9141, 9945, 10748, 13343, 15032, 14695, 12027, 14253, 16522, 15865, 13130, 11024, 9685, 9825, 9177, 9033, 8624, 9164, 10641, 11820, 10103, 7749, 11445, 15789, 16054, 17539, 21160, 27964, 31860, 31849, 28225, 29401, 26071, 20998, 17285, 15867, 17545, 20186, 17543, 13669, 13294, 12852, 10606, 6540, 5359, 8529, 11722, 12181, 14931, 14861, 15157, 15286, 14090, 12673, 14079, 11358, 5651, 2847, 165, 7169, 12205, 13517, 13716, 12431, 10087, 9597, 12029, 11848, 11067, 11102, 12452, 12485, 9474, 4439, 5269, 9801, 10440, 10496, 9335, 10908, 11916, 12853, 15255, 14130, 10619, 10171, 9640, 9695, 9465, 8026, 5249, 3269, 2998, 3311, 3779, 3628, 4052, 4593, 5806]
13166E806J453l368j936J205N12L149J063R94L17k821n92R64K980o60k924R22
13150G064P59K28k398j927k589j2L136P17Q85L140L762m18o59J959l880k837j152
13133E778O64N21j829K063K350L179N89m569m006J730k93j606R51j419J670n30
13117E243l97l03r9K861o79J260K490l037k139l9r59k266R88M39R74J699L76j670
13099D742N26L855J598j919j210M87j014K5P78l334q70J037K827M538K275k174
13083A2167k327k626K492K419J741l43r94P56l550k437j295j381L036J869j763
13068G764k502k262n52K977K753J094k303m10o76P16O69N79m690j587n63O43J974
13051C624L065j82N04m32n33m43k681K114K867m58l25j491l3Q87j622l29L215
$$ y = [5806, 7259, 3891, 1955, 3160, 3672, 6821, 7884, 8878, 9195, 6374, 5782, 6746, 9726, 9066, 6142, 7064, 7823, 8051, 5653, 3726, 1137, 1125, 4261, 4978, 5863, 9003, 12765, 12347, 11688, 13647, 9767, 6930, 5778, 6442, 6963, 5134, 7197, 9547, 12726, 13315, 8746, 4740, 6470, 6177, 4571, 5522, 4103, 5773, 5243, 4846, 4543, 4444, 7305, 6626, 7886, 10376, 7339, 5200, 5161, 4202, 1936, 2924, 3363, 4337, 6036, 6412, 4742, 5268, 9123, 10721, 8802, 7592, 8079, 7065, 7090, 7868, 4534, 3664, 4701, 7528, 12066, 14341, 12167, 9840, 7214, 9706, 12125, 13866, 13523, 12529, 13285, 9735, 7298, 6003, 4622, 7658, 9527, 7764, 5262, 3000, 2448, 5425, 8178, 9272, 6969, 6559, 5883, 6599, 7268, 7847, 3157, 1570, 1007, 1650, 3624, 6689, 6507, 7011, 6579, 6046, 5603, 2922, 5036, 7903, 7445, 7120, 5629, 5596, 6483, 4861, 4532, 7747]
13034G747q31j456l690J658L413P75J109k68q8L452j613J058n45k80R61L21k305
13017I418r35J065Nj754k182n29k72R16K60K514J166J992K118J679m524O7L334
13000A4338j619j367J138k075l184k563J952p18K486K789K59o117m272J3M461
12985E521J393r75L117K219l478P25l76q88Q09j516l5Q41K019R8k362n289J739
12968C562M654K138j093l53j94j518m271k344J597K311Q65K483o09J899j449j374
12952F304M194J709k025K460O887J811N14L166J0328J0570K0372M2459O0965P9518
12938B49232O0215p447o5013p4858n4671l0247j9115j1507p808n013k846n153
12926B5769m849l655k284m164k780k814L17q65J977L501k233o94j21K635l416
$$ y = [7747, 6916, 5460, 1770, 3428, 6841, 7616, 8725, 8457, 8369, 11821, 10208, 11266, 10721, 10441, 11402, 11723, 9418, 8483, 9548, 9553, 7799, 5617, 5088, 4816, 5732, 5992, 8506, 9672, 11664, 13782, 15461, 10937, 11004, 14338, 12719, 11352, 12490, 10415, 7231, 4668, 6620, 5902, 8388, 11177, 11436, 5319, 1047, 1060, 5521, 6914, 5939, 9056, 11275, 7797, 8522, 8146, 7258, 8067, 6551, 6516, 7357, 9376, 9474, 7112, 1823, 3562, 8216, 10354, 9261, 8908, 8714, 7196, 2925, 581, 2178, 4489, 5354, 7837, 7228, 9127, 7678, 6304, 10498, 12207, 10182, 12642, 19529, 21340, 21854, 25020, 35348, 45918, 66290, 108749, 169714, 249232, 309447, 302000, 236987, 162129, 107458, 77211, 58096, 46589, 38781, 33768, 30922, 25769, 20920, 17265, 14981, 10817, 8037, 5223, 5540, 4675, 6652, 10153, 7920, 7226, 7105, 9740, 6324]
12911F324o2K701J037J356j579j786K30j609K858M37j405n89j364k359j217K245
12895E218K663j085J328j653l84K190K93J783O225P413J2346J7124J5788J2895
12881H2144l701j5856j7262j3492o843m419k272k851l917k369o56J499K482J196
12867A3683k979j515K2k550k742j866M193O60k53O07m97m25L32L081m55n262N88
12850D622L570k253m047j09j977l194K81N614K912m30Pj054K278J537J525j710
12834G572k369k088R07J916Q9J701K41m78j848L843L846r88k357k986k306j261
12818C434l767k254J162M003J600q41n123j823N62j914j148L525N725P58k172
12803A727K111K765k627k991K263N229L154q05m250r71o58K615j488j896L043
$$ y = [6324, 6262, 8963, 10000, 11356, 9777, 7991, 8221, 6612, 9470, 9907, 8502, 7913, 6549, 4190, 2973, 5218, 7881, 6796, 8124, 6471, 6087, 8277, 8570, 10353, 16578, 23991, 36337, 53461, 69249, 82144, 78443, 62587, 45325, 31833, 24990, 20571, 18299, 15448, 11531, 9162, 8506, 10005, 12487, 13683, 10704, 9189, 9211, 6661, 3919, 2053, 6246, 6906, 6653, 7260, 6763, 6338, 6670, 9751, 9296, 4034, 4622, 8192, 5939, 1892, 1783, -194, -3388, -3107, 2507, 5419, 4989, 4996, 3942, 6220, 7757, 9282, 7572, 5203, 3115, 4022, 5938, 6027, 7728, 7969, 7491, 5643, 9486, 13332, 12344, 9987, 7001, 4695, 3434, -333, -2587, -1425, 2578, 4178, 3337, -1786, -3609, -3047, -4961, -6109, -2584, 3141, 3899, 1727, 3838, 6603, 3976, 985, 3248, 8477, 11631, 10826, 6576, 5605, 4947, 7562, 6074, 4178, 7221]
12788G221P371L235l574l494k394K153k74k223j370k15j860k75J248K332M576
12773A2457l483k802k642J27l41L93J217J21k264J015J03j668O77K967O16K547
12757I040N937Q033J0605J2980P660o932j2949j3743q812j38K850J514k117o61
12743A3267k078j349J767j00L79L104J687K690J1220K1379L4608N3232M8063j8586
12729A69283n7685m4864k2994r501m868j643m593m753j959j430j454n82M00J295
12715A4652j588j776j492l134l835L4N35K081K130P92J73j350L97J001j390J367
12699H597J645M56M02k820m45Q61J04L53J718j125j607j725P59L04j072j708J287
12682E984J414L83J993K118m268j536j091M72j705J413q68Q84J26J444J886J164
$$ y = [7221, 14592, 17827, 14253, 10759, 8365, 10518, 10244, 8021, 6651, 6436, 4576, 4301, 5549, 7881, 12457, 8974, 6172, 3530, 3657, 3316, 3709, 4926, 5047, 2783, 3798, 3901, 2233, 2910, 5877, 6493, 9040, 14977, 23010, 33615, 46595, 54255, 47323, 34374, 20631, 11819, 11681, 14531, 16045, 13928, 13267, 11189, 9840, 11607, 11507, 11886, 14990, 16677, 19367, 30587, 51966, 86574, 139806, 187869, 169283, 111598, 66734, 43740, 34239, 29371, 27728, 23135, 18382, 16423, 14993, 13539, 12957, 13357, 14652, 13064, 11288, 9796, 6662, 2827, 2861, 3396, 5477, 7607, 8399, 8572, 7222, 7619, 8620, 7230, 8597, 10242, 10698, 11100, 8280, 7835, 8696, 8800, 9153, 10871, 9746, 8139, 6414, 7173, 7477, 6405, 4697, 5984, 7398, 7781, 9774, 11892, 7624, 6088, 4997, 5469, 3764, 5177, 4309, 5193, 5319, 6763, 8649, 9813]
12666I813O45m50k177N68Q75k063K059L950R17r08l625l563k443J071J381p92
12650E258J520K755N66L71p4r99j286m454P09Q43k39M016L214l050j077r44j003
12633F126Q76P1p70J068r17J867J151J809k696j299n48q72j451o14P76J181J891
12616G649Rm46L62k962k784K162J791K072K287m81J505M03J759k463j946k376
12600F541M526K201K023K453l82o44J633O214J0360J0519K1047M2436O8468R0000
12586B67395K0083q5213q2648m5225k0579j1048p803n267n855k177N9J812l88
12573B3146K69j579k362r16j470m67l687l192J46K778L994K377J332K372L385
12558B6126N359Q776R058P140R252P980J324m069m61J0380J6183J9674L9278P6447
$$ y = [9813, 10458, 10008, 7831, 8399, 9274, 7211, 9270, 13220, 14137, 13229, 9604, 6041, 3598, 4669, 6050, 5258, 6778, 9533, 10099, 10470, 10396, 9397, 8111, 3657, 4366, 5209, 4970, 8986, 12200, 9150, 8073, 7129, 6126, 7002, 7073, 6303, 7371, 6454, 8321, 9472, 11281, 8585, 7286, 6738, 5866, 4415, 3801, 4577, 5758, 7649, 7658, 7212, 7574, 4612, 1828, 3990, 5781, 7853, 10140, 9659, 11164, 11567, 13326, 10863, 8917, 6541, 11067, 13268, 15291, 17744, 17362, 16718, 18351, 24565, 34925, 45444, 66491, 108927, 177395, 267395, 287478, 202265, 119617, 74392, 53813, 42765, 34962, 29695, 23840, 21663, 21722, 23534, 23146, 23415, 21836, 19474, 18558, 17088, 16621, 12934, 9742, 9888, 12666, 16660, 19037, 20369, 22741, 26126, 31485, 40261, 49319, 56459, 65711, 73691, 75015, 70946, 70485, 80865, 97048, 116722, 156000, 232447]
12544B32447J39190K42577L51586K01623j88173k01996K8408K23725J74101k28735
12534I74753l64966k22376j13003o1844m2261k6516k2632j8564j6067j0780q072
12523F7672n610m351m576J224N307j430l449n153m511o113p833n915k981k156
12509B0125j580o96j139r66m16j06k248R14L538l702l607J382l38J012J731j308
12493A2596K037K209j012L386J481p28m480m118k741K9J45o34p85J414K111j079
12477I831j412r89K710j035j84K665K350q50j994n2J091l93p91J331j394k782
12461H102q27K328N78j156m65j458J872L095o05k053k356L170K017J297K398k566
12445A3371n51j534m22k476R47p14M125M493J070Q5Q86K239J903J614j145p18
$$ y = [232447, 371637, 614214, 965800, 1167423, 979250, 777254, 805662, 1029387, 1203488, 974753, 609787, 387411, 274408, 212564, 170303, 143787, 121155, 102591, 86524, 75744, 67672, 62062, 57711, 53135, 54359, 59666, 58236, 54787, 49634, 45123, 39010, 31177, 25262, 22281, 20125, 18545, 17849, 16710, 15744, 15328, 15222, 12974, 13888, 17426, 13724, 10117, 11499, 11161, 12173, 13904, 12596, 14633, 16842, 15830, 19216, 20697, 19969, 15489, 11371, 8630, 8659, 8804, 8170, 7385, 8799, 10910, 9831, 8419, 7430, 10140, 9105, 8921, 11586, 13936, 13086, 11092, 11040, 12131, 11738, 10947, 12278, 10884, 8102, 7275, 9603, 10181, 9025, 8560, 7102, 8974, 12069, 11464, 9411, 7055, 10225, 12242, 13539, 15937, 13371, 12820, 11286, 10864, 8388, 9335, 8621, 12746, 17239, 18309, 18394, 19280, 21519, 23422, 25036, 23891, 23173]
12429B3173J099L170L326M224J1083K5883M1210N2591K5111l7078n4641l6918
12417F2233j6266q214l746o121n665l846N30J975K088m076k940l275M42Q39Q47
12402A4805N74m94n16j31J346N590L122m536k397k24j162j298l67J52l132k523
12386H809l25O70J497J944L246J338K1J910Q5k890j476J124J196l508K123o43
12370A5121o26Q72p52L522L883K968l18j33m265j637N6N76l5N96j063l194k819
12353A2752j880L029J688j385K012l76o01k947n723L40L78J120J607N96K251J557
12337A4418o74j417N52L5K329K932J884N82K91J166R55J084L102J374p12l321
12321B4580r4L542M132j310L033O484R790R916O491J723Q317J5765K2722K7926
$$ y = [23173, 24272, 27442, 30768, 34992, 46075, 71958, 113168, 165759, 190870, 153792, 99151, 62233, 45967, 37753, 34007, 27886, 22221, 18375, 18905, 20880, 22968, 18892, 15952, 12677, 13119, 13958, 14805, 15379, 14885, 14369, 14238, 15584, 21174, 24296, 19760, 17363, 17139, 15977, 14679, 14312, 14464, 11332, 8809, 8484, 9154, 10651, 12595, 15841, 17179, 17200, 19110, 19195, 16305, 14829, 15953, 17149, 13641, 15764, 15121, 14495, 15367, 14615, 18137, 22020, 24988, 24670, 24537, 20272, 18635, 18691, 19267, 19232, 19828, 18765, 15571, 12752, 10872, 13901, 15589, 14204, 16216, 15840, 15239, 12292, 6569, 6909, 7287, 8407, 10014, 10610, 12861, 14418, 13744, 12327, 12879, 12914, 15243, 18175, 20059, 20641, 20932, 22098, 23053, 24137, 27239, 28613, 27901, 24580, 24486, 28028, 32160, 30850, 33883, 40367, 50157, 60073, 66564, 68287, 76604, 92369, 115091, 143017]
12307A43017M5301O9943J14395K07179L73177O08360O62600O0890o37551o33286
12297A014025l68217j87750j06359p0089n1459l4865k2784j1881L416J8099L8314
12286B20450M6907K0115k9234n6993n4374l7249j7659j3828m810o077m734m111
12274E8403m855m422l574R32J011o3l335r516m376k094J357J248r98k132o241
12259B1345p10P156L477j711j351k644m074J862K152N45J418m10j63l318q09N805
12243B8570O748K157J999L927K69l54m918m955j437K931p28k292p737n37l760
12228A9883n038n9L131m63o22k06J398M15q67L746L168J179R57J581K087Q49P02
12211C1841k01k189l95J703K383L532R99j136l115k504l19j016j540N47j490k228
$$ y = [143017, 188318, 258261, 372656, 579835, 953012, 1561372, 2223972, 2284862, 1647311, 1014025, 645808, 458058, 351699, 281610, 230151, 195286, 172502, 160621, 164037, 182136, 220450, 267357, 287472, 258238, 201245, 146871, 109622, 91963, 78135, 73325, 67248, 62514, 58403, 53548, 49126, 45552, 46484, 47495, 47432, 44097, 34581, 30205, 28111, 29468, 30716, 29718, 27586, 21345, 20635, 27791, 31268, 29557, 28206, 25562, 21488, 23350, 25502, 26047, 27465, 27055, 26892, 23574, 22765, 28570, 35318, 37475, 39474, 43401, 43670, 43316, 38398, 33443, 32006, 34937, 34209, 31917, 24180, 23643, 19883, 14845, 14786, 17917, 17454, 16832, 16626, 18024, 18439, 17572, 21318, 24486, 25665, 26622, 28203, 30290, 31139, 31841, 31640, 29451, 29056, 30759, 33142, 36674, 37673, 36537, 33422, 30918, 30599, 29583, 28043, 28590, 27100, 24872]
12195B4872m211j831L020K328K305n39j295l088k446N012N647q60K131J99j955
12180B9289J30j690m656k985J551K303N627K944q42n89Q18K654L83o365L87M137
12164C3096K485N51J526k31n008m531m697L007O939r56q44j782J780K608K704
12149C6647L791M014K392K561N709M980J547m724o468j238M916N047K492J752
12135F3418K806M608K701K957O386O410J0074Q112R439Q510N954J2889J5234K5808
12121A85306L7033M3975N7094P5935J04776J63881K63931M37122O99283J038452
12111C106788J196859O16529n51484j085460q61705n81608m26075l17167k24637
12102H72040j51515j07429p8916n5703m1644k6115k1423k0522j7389j6255j3650
$$ y = [24872, 20661, 18830, 21850, 24178, 26483, 25944, 24649, 21561, 19115, 24127, 29774, 28914, 31045, 31244, 29289, 29419, 27729, 23073, 20088, 21639, 23942, 29569, 32513, 31671, 31082, 31900, 34554, 34937, 28572, 28959, 33096, 35581, 36132, 37658, 37427, 32419, 27888, 23191, 26198, 33137, 32181, 31337, 29555, 31335, 33943, 36647, 40438, 44452, 46844, 49405, 55114, 60094, 61641, 56917, 50449, 49211, 54127, 59174, 61666, 63418, 66224, 70832, 73533, 76490, 82876, 89286, 99360, 107472, 116911, 125421, 131375, 144264, 159498, 185306, 222339, 266314, 323408, 399343, 504119, 668000, 931931, 1369053, 2068336, 3106788, 4303647, 4920176, 4368692, 3283232, 2421527, 1839919, 1413844, 1096677, 872040, 720525, 613096, 534180, 478477, 436833, 410718, 389295, 368773, 351384, 335129, 321479]
12091C21479m084J175R131K5679L7447M6350N2968O6057R4715J42658K17727L34976
12079A346278N17166P83472J106567J170468L91216q44898j259801r56389n88711
12070A665368l73487k69230k08386j62611j23300r7352q5567o5784m9217m6821
12060A83613m2158k8024j3260K941Q831n57j3306o159L010q428j8922j2451N17
12047E5647K0336J9781J5935J2596M351j0767j5532j1048K168J0684N209j44p560
12034A01656n553j590K271R658O658K9o144j0969r042L82Q707J8903K3169J7698
12020A55833J342j0785j3970p991m762J761J309l889Q545J7444J9576L0924M6132
12007B41469P9150J34422J88552J71417J2577j71757j98945j23160p1450m9543
$$ y = [321479, 317395, 318570, 327701, 353380, 390827, 437177, 490145, 556202, 650917, 793575, 1011302, 1346278, 1863444, 2646916, 3753483, 4923951, 5315167, 4470269, 3210468, 2254079, 1665368, 1291881, 1022651, 814265, 651654, 528354, 431002, 345435, 279651, 230434, 183613, 141455, 113431, 100171, 103112, 111943, 111386, 98080, 91921, 94931, 86503, 67581, 55130, 55647, 75983, 95764, 111699, 124295, 128646, 117879, 102347, 91299, 93467, 104151, 109360, 109216, 101656, 96103, 94513, 96784, 106442, 113100, 113129, 106985, 96016, 86974, 87356, 96063, 114966, 138135, 155833, 157175, 146390, 132420, 124429, 119667, 121428, 122737, 118848, 127393, 144837, 164413, 195337, 241469, 320619, 455041, 643593, 815010, 827587, 655830, 456885, 333725, 262275, 212732]
11997B12732k5013j2097o546k223O000K0824K2923J3882Q971J0896K0849M6174
11985C17372P0168P1881L4695j3348o5390j35396j40449o1713j0657L750J2955
11974H3868J7607J8457Q034k769j2361o424M238R283J2723N347K798M838R941
11961A55580K938n605p269j224K932k522j132P326N823J830j031j463j756N694
11947A60121J8322K6012J8667N848m234n731J071j966n449j519J7501L4887L5907
11934B99437J1725k4489k7900j9450j6935q184P114M237N130J0502J6294K1674
11922B79155J7014J5355J8712J7672J5951N870K917P311J3129K2994L3243L7276
11910D86599L1452L08k5213j6958R761K1671J0260J1554L2800L2344L7393L5724
$$ y = [212732, 187719, 175622, 169076, 166853, 172853, 193677, 216600, 230482, 239453, 250349, 271198, 317372, 387540, 459421, 494116, 480768, 415378, 279982, 139533, 77820, 67163, 70913, 83868, 101475, 119932, 127966, 125197, 112836, 106412, 110650, 119933, 132656, 138003, 140801, 145639, 155580, 158518, 152913, 145644, 144420, 147352, 144830, 143698, 151024, 156847, 158677, 157646, 156183, 154427, 160121, 178443, 204455, 223122, 228970, 224736, 219005, 220076, 218110, 212661, 211142, 228643, 263530, 299437, 311162, 286673, 258773, 239323, 222388, 214204, 221318, 225555, 230685, 241187, 257481, 279155, 296169, 311524, 330236, 347908, 363859, 369729, 372646, 379957, 393086, 416080, 449323, 486599, 518051, 518359, 493146, 476188, 485949, 507620, 517880, 529434, 562234, 594578, 631971, 667695]
11898F67695K3693L0639M2659M5756N5753P6897Q9653O1944L3281L8382P2138
11887A238490J11088J43785J77056K31122K41714J05819M0900O2783O7971J30522
11877B551250K50413L44197L80518M19342N13779O92334R89554J320273J476220
11868H937880J095964O07235R17787J671278K518692L596300M983363P055533
11860C1384032J0850258J8205881L1684503N5063278Q8812654J10317296N8769973
11853D05087875n8064410j12985480q5240789m7938263k7254919j7324428j2079765
11846D4199821q673026o365510m819059l656638k743756j995319j365886j047954
11838A3532673j433352j790728j555720j190170r12183p08095n74528m73895m40883
$$ y = [667695, 691388, 722027, 764686, 810442, 866195, 943092, 1032745, 1094689, 1127970, 1166352, 1238490, 1349578, 1493363, 1670419, 1901541, 2143255, 2249074, 2289974, 2352757, 2420728, 2551250, 2801663, 3145860, 3526378, 3945720, 4459499, 5151833, 6141387, 7461660, 8937880, 10033844, 10641079, 11558866, 13230144, 15748836, 19345136, 24328499, 31384032, 42234290, 60440171, 92124674, 147187952, 236000606, 346317902, 405087875, 347023465, 234037985, 148797196, 100858933, 73604014, 56279586, 44199821, 35526795, 29161285, 24342226, 20685588, 17941832, 15946513, 14580627, 13532673, 12099321, 10308593, 8752873, 7562703, 6650520, 5942425, 5367897, 4894002, 4453119]
11829D453119m34420m08383l37739k46337k09158j89890j69820j66999j36625
11820B153748j13499j33227j51554j29980q5127m7294l6053n3374p3442p3352
11810A256846p0842p2747m7028k9323l0800l5966l6688l1019j4094k3300n3880
11799H11159p6833o0240j8733o30j4277k1176k3771l0965l2306k2745j1840O97
11787D98340j33p774n554l717m638j936k521n832j1104j8942k5387j6239r160
11774C85403j9240j8873o100q97n005j1600j8675j9767q978r999p237Q694K6577
11761B94303M2219L3667j4514m0839k9768j4228r581k900l606q652p667k40M531
11748B42725k11J803J768l260o880k062l14L256P209M411n751o513O233K5674
$$ y = [4453119, 4018699, 3610316, 3272577, 3026240, 2817082, 2627192, 2457372, 2290373, 2153748, 2040249, 1907022, 1755468, 1625488, 1540361, 1493067, 1457014, 1403640, 1330198, 1256846, 1186004, 1113257, 1066229, 1036906, 1006106, 970140, 933452, 902433, 888339, 865039, 811159, 734326, 674086, 655353, 654723, 640446, 619270, 595499, 564534, 532228, 509483, 497643, 498340, 498207, 490433, 484879, 481162, 476524, 474588, 472067, 466235, 455131, 436189, 410802, 394563, 385403, 366163, 347290, 341190, 340293, 335288, 323688, 305013, 285246, 276268, 266269, 259032, 267726, 294303, 336522, 370189, 355675, 314836, 285068, 270840, 261259, 258359, 254753, 246101, 238434, 238194, 242725, 242514, 244317, 246085, 242825, 235945, 233883, 233569, 236825, 244034, 248445, 242694, 236181, 242414, 268088]
11734B68088M3337M4097K8541J4913J35j8433p5920j33752r8324l3551N997J7235
11722F2363J3700J1574P779j753J796Q933J0254J2234J1606N720M899n031r717
11709A34357j5019j0113N65j53k072k40k90j187m86L465L183q10p634m16J122
11694A04272o294o046n488l185N61j699L42K713j587N98N636K793p177r411r603
11679F6425r919j340P838P081Q760K08r636q752L20O269N768l004j3446j5110
11665D1462o568P981K4068K2223K6514K9421R535j5910k4746r308Q449K938r31
11652A15128J4956K6913J7382J993r767j6458j3763j0943j4097j8305j6677j2161
11640F4201j4047r170m381k132l930p0j540K203J766M969Q099J0539J6192J2610
$$ y = [268088, 311425, 355522, 384063, 398976, 399111, 380678, 304758, 171006, 72682, 39131, 45128, 62363, 76063, 87637, 95416, 93663, 95459, 104392, 114646, 126880, 138486, 144206, 149105, 144074, 134357, 119338, 109225, 109790, 109637, 107565, 107325, 107035, 105848, 105362, 108827, 112010, 111200, 103566, 103150, 104272, 97978, 91932, 86444, 83259, 83820, 82121, 82463, 85176, 83589, 84187, 89823, 92616, 85439, 76028, 66425, 56506, 55166, 63004, 70085, 78845, 79053, 69417, 60665, 60985, 67254, 73022, 70018, 56572, 41462, 34894, 42875, 66943, 89166, 115680, 145101, 154636, 138726, 113980, 104672, 113121, 116059, 115128, 130084, 156997, 174379, 176372, 166605, 150147, 136384, 125441, 111344, 93039, 76362, 64201, 50154, 40984, 36603, 34471, 30541, 30471, 28931, 31134, 32900, 37869, 45968, 56507, 72699, 85309]
11626H5309K512m518q920j0481k438L905P171K465q30k256o727p330o272k248
11612D9342r62R97L955M427P063J1737R410O241K755j561p343q278n320O024M596
11597H3083M60n218k332o002q304r300m222L297L617J238j70N218M655l720r917
11582E2383n175n314m724K162J430m39k170J396J15j076j68L55K07j935O01j55
11566C7493q449n541k922M698N362N092k09L368N345M008J91k818k616j47L621
11551D6476O738J468q536j3029m313l30J528K095L129J082j82m088k785j644R05
11536B8514M27p24Q05L901O370L666j588p579o142k428N75J718k418K777L592
11521C1466O06j733j868J110L690J309l757k166J3j106m423O61J249j453r40J932
$$ y = [85309, 87821, 83303, 74383, 63902, 61464, 65369, 72540, 75005, 74175, 71919, 65192, 57862, 51590, 49342, 48380, 49377, 53332, 57759, 64822, 76559, 85969, 92210, 94965, 93404, 86061, 77783, 72463, 78487, 83083, 83543, 78325, 75993, 69991, 61687, 52387, 48165, 51462, 55079, 56317, 56147, 61365, 66020, 62300, 52383, 47208, 41894, 37170, 39332, 40762, 40323, 38153, 39549, 39664, 38588, 38420, 38775, 38982, 37047, 37648, 37493, 29044, 23503, 20581, 25279, 30641, 35733, 35524, 38892, 44237, 48245, 48436, 45618, 43002, 42855, 46476, 53214, 54682, 46146, 33117, 28804, 28474, 30002, 32097, 35226, 36308, 36126, 32038, 29253, 27609, 28514, 28941, 28217, 29022, 32923, 39293, 42959, 41371, 33792, 27650, 25222, 25797, 27515, 25097, 27874, 31466, 32072, 30339, 28471, 29581, 33271, 34580, 30823, 28657, 28670, 27564, 23141, 23802, 25051, 23598, 22658, 24590]
11505B4590J34m2J583L68O94K688K497m98k387r38k616j497O74N53J552N131K085
11488C4571L514M206j615p62M222J0037J2067R945P067r65o346n336m081k109
11474F4415K496P63k825m403o365r24m642r292q714m293r58K148L172l622l543
11459B3413m07J942J824P70l055n185k51K012j360J112L890K460n64j597J565
11444B6569M77j810J329J895L262j491n893n543j579J888j85N31j00m938J406
11429A5818K43M089P368L342P06m81j995k211J349L293O472P767O813P838P555
11414F7966P288Q948L615O973J1499J6271K5742L8381N4262R2654J67132L07239
11402H07970N26805P01177L43198m66964p00283m51810k40772j35425q3989n8431
$$ y = [24590, 24724, 24682, 26265, 26633, 27327, 30015, 32512, 32014, 29627, 28689, 26073, 24576, 25250, 25803, 27355, 32486, 34571, 38085, 42291, 40676, 39914, 44136, 54173, 66240, 76185, 83252, 82287, 75941, 70605, 66524, 64415, 66911, 67674, 64849, 60446, 54081, 53157, 48515, 39223, 30509, 26216, 25258, 27406, 30578, 26956, 23413, 23006, 24948, 26772, 27542, 24487, 19302, 19051, 21063, 19703, 20815, 24705, 27165, 26601, 25004, 26569, 27046, 25236, 26565, 28460, 31722, 30231, 24338, 18795, 17216, 19104, 18919, 19450, 19350, 14412, 15818, 16061, 20150, 27518, 30860, 31566, 31085, 29090, 26879, 28228, 31521, 37993, 45760, 52573, 60411, 67966, 75254, 84202, 87817, 94790, 106289, 122560, 148302, 186683, 240945, 333599, 500731, 807970, 1334775, 2035952, 2379150, 1912186, 1211903, 760093, 519321, 383896, 299907, 241476]
11392B41476m1136k9062k4203k3800j6618j0166o481l875j0557j2012n335r43
11380E7288m481n842m613r88K688k102j5k415k968k969k436K734J544l416M35
11365C2444r8j184J013o94p07K224l034k665k826j603q52L165K419k44k357l316
11349B1685k037o486Q69J202K307L151l940J156l352Q08L604K317q24n669m324
11334A0467j504K56k356M588P391K511l767P56J16J426k57r39P24k279p04L461
11318A9890K752k38j020l14l851j204K738m87M83o75J948J328j575J683L031M948
11302B9437N187L043p96k720j159J775J437j78K332j20K967K917L653N526P985
11287F1286O266J0129R076J0753J3463K2935K2283J8519K6955L8567O8007J17029
$$ y = [241476, 200340, 171278, 147075, 123275, 106657, 96491, 90010, 86135, 75578, 63566, 58231, 57288, 52807, 46965, 42352, 41364, 44052, 41950, 41935, 39520, 36552, 33583, 31147, 33881, 35425, 32009, 32444, 32346, 31162, 32175, 31481, 30774, 32998, 29964, 27299, 24473, 22870, 22018, 25183, 27602, 27358, 25001, 21685, 19648, 13162, 14031, 15233, 17540, 20691, 16751, 17907, 14555, 15363, 18967, 21284, 20460, 14791, 10467, 8963, 9219, 6863, 11451, 18842, 21353, 17586, 18342, 18458, 19884, 19627, 18688, 19412, 17133, 16429, 19890, 22642, 22404, 21384, 21070, 17219, 16015, 18753, 18266, 18749, 18074, 20022, 21350, 19775, 21458, 24489, 29437, 34624, 37667, 36871, 34151, 32992, 34767, 36204, 36026, 38358, 38238, 41205, 44122, 47775, 53301, 61286, 67552, 77681, 86757, 97510, 110973, 133908, 156191, 174710, 201665, 240232, 308239, 425268]
11275D25268K01656L54461N80191P46602N75133J80823M57j74097n61432p25075
11265A603987n46461l23082j89005j18430p8974n5392m0306l2864k4208j9462
11255A75803k1094j8723j6801j2500j2723j1152p771n197l391l340k548j821l316
11242E5426m603l883m840P89k627l067r67K114L665J09j173p06l847l252j347
11227C1791j743K039J09O97M337M42N8j008R66R64j87K666k049J939N872J787
11211D8680K392J316J117l83j644K211K031j57L303K155J141K598J335J851K637
11196G0583q04p79J356n70j557J417L284j503J486M265NJ015k216L027K002K978
11180H3989j812k06J186N71K144l35j36M336N354L18J738K409N047R261J4566
$$ y = [425268, 626924, 981385, 1561576, 2308178, 2883311, 3064134, 3064591, 2890494, 2329062, 1603987, 1057526, 734444, 545439, 427009, 348035, 292643, 252337, 219473, 195265, 175803, 154709, 135986, 119185, 106685, 93962, 82810, 75039, 69842, 66451, 63111, 60563, 58742, 55426, 50823, 46940, 42100, 42889, 40262, 37195, 36228, 38342, 42007, 42116, 40943, 40237, 36390, 33138, 31791, 30048, 32087, 32196, 32893, 37230, 37672, 37730, 36722, 37688, 38652, 38465, 41131, 39082, 41021, 46893, 48680, 51072, 52388, 53505, 53122, 51478, 53689, 55720, 55563, 58866, 61021, 62162, 64760, 66095, 67946, 70583, 69779, 69000, 70356, 69786, 68229, 69646, 72930, 71427, 72913, 77178, 77183, 78198, 75982, 79009, 81011, 83989, 82177, 81971, 83157, 83728, 85872, 85537, 85401, 89737, 95091, 95409, 97147, 99556, 104603, 113864, 128430]
11165A28430K0535K3673K7711L3835M7830Q1657J39574K46738M30800O40933O12529
11154B434245J81425j38041K0804J55720j94474o27264o24742l94551k19632j29556
11144D63934q8146o3036m7509m0379l4510k6809j9672j5144j5473j4708q306q064
11132H2178m603m838p035o220j425j454l100J629M530O145N748k064r660o183
11118E3648M218Q293m372r973p476k325j521k689l123j976j942L77q76l60j898
11103B8005M34L25j418j487J574P92K32k6J372J980O302J4625J8455J3585p76
11088H3974n332l955l947j121j1882j2696r300m037k705P5J375J667j16K06N41
11073C2747n331m193J169j150M28l459M295L058j588K690L851K97k746J712J297
$$ y = [128430, 148965, 172638, 200349, 234184, 282014, 363671, 503245, 749983, 1180783, 1821716, 2434245, 2615670, 2477629, 2498433, 2654153, 2459679, 1832415, 1207673, 813122, 593490, 463934, 375788, 312752, 265243, 224864, 190354, 163545, 143873, 128729, 113256, 98548, 90242, 82178, 77575, 72737, 65702, 59482, 58057, 56603, 53503, 55132, 59662, 65807, 71555, 69491, 59831, 53648, 57866, 66159, 61787, 51814, 44338, 42013, 40492, 37803, 34680, 32704, 30762, 31139, 30263, 29903, 28005, 28439, 28764, 27346, 25859, 27433, 28225, 28457, 28431, 29803, 31783, 38085, 52710, 71165, 84750, 83974, 78642, 74687, 70740, 69619, 57737, 45041, 35741, 31704, 28999, 29074, 30449, 32116, 32000, 32206, 32747, 27416, 23223, 24392, 23242, 23670, 20211, 24506, 27564, 25976, 28666, 32517, 32814, 30068, 31780, 33077]
11058C3077L737J0577J6077K1685L3044L7920K5801K52k1982k8248l0733k3579
11046G7628j6614q674l451l632m813m604j214j874j978k147k246k255J472M917
11032C0515O38k936j472K205N410P949R826J7236K7346L0952J3545r198l853L673
11018A31836j8105l1774k3096j4314p686j584j545j529m690r70N915O900L852
11005D3210J1772J3169J3350R69m083L713l483j5866j6830j0412n202r12l23k098
10991B6974k273o98k604j749l21l956K450P61O06J566l86L428L18k457n24n6J458
10974B2537P83j572j609J39J574K395j643m436L83k99K0p84j497L745L26j373
10958A8689j253R45l082N56R21k723L296K206k504j539K954M163j020j610K272
$$ y = [33077, 36814, 47391, 63468, 85153, 118197, 156117, 181918, 182170, 160188, 131940, 101207, 77628, 61014, 52340, 48889, 45257, 40444, 35840, 34626, 32752, 30774, 28627, 26381, 24126, 25598, 30515, 31153, 28217, 26745, 28950, 34360, 42309, 52135, 69371, 96717, 127669, 141214, 132016, 128163, 131836, 113731, 81957, 58861, 44547, 36861, 35277, 33732, 32203, 27513, 26543, 32458, 39358, 43210, 54982, 68151, 81501, 82470, 78387, 82100, 78617, 62751, 45921, 35509, 30307, 29395, 29072, 26974, 24701, 24003, 21399, 19650, 19329, 15373, 17823, 18584, 19190, 20756, 20370, 23798, 24116, 21659, 21135, 21079, 22537, 23320, 21748, 20139, 20278, 21852, 24247, 22604, 18168, 18551, 18252, 18272, 17488, 15991, 19736, 20062, 18689, 17436, 18381, 15299, 15855, 16776, 14053, 17349, 19555, 17051, 15512, 18466, 22629, 21609, 19999, 22271]
10943B2271m723j173M61j418J149J610j92P97J944K105o7j348m841q20J169j708
10927A5216j242j176M054M03p63J092K155L32l523l68Oo14J847L59l801j213R4
10910A2858M63J269L060K934j483j9O68K222L116K53j204l445j14q33j408O52
10894A8989m14j8L022n61J830N133M477L289r59J68L586p13n254n838m435k40
10878B2062K831k596m464l089Q14L996M549j928l198j665l064j812J35J528K178
10863A6277M237J391m16l531m794l60N57J979J564j019k725n25O35j255K783l
10847A4795L255O79q48l318R57K584m282k740J920L911M38L264L235J223J558
10832B6631K467N75J156l75o58j920l755J914j228m562pK353J149O52j697j333
$$ y = [22271, 17548, 16375, 16836, 15418, 16567, 18177, 17985, 18782, 20726, 22831, 22764, 21416, 16575, 15755, 16924, 15216, 13974, 12798, 16852, 17255, 16492, 17584, 19739, 20071, 16548, 16180, 16186, 15572, 17419, 17778, 13977, 12764, 12858, 13321, 14590, 17650, 20584, 19101, 19082, 19750, 21972, 25088, 25341, 24137, 20692, 20578, 19745, 18337, 18989, 18575, 18557, 21579, 21018, 22848, 27981, 32458, 35747, 34788, 34956, 38542, 37829, 32575, 26737, 22302, 22062, 24893, 22297, 17833, 14744, 15558, 19554, 24103, 22175, 18977, 17312, 14248, 12436, 12571, 14099, 16277, 20514, 21905, 21489, 17958, 13164, 12804, 13361, 15340, 16904, 15885, 13160, 12635, 13270, 12015, 14798, 14795, 18050, 18729, 17881, 14563, 15520, 18104, 13822, 11082, 13002, 16913, 17351, 20615, 23850, 25073, 26631, 29098, 29673, 30829, 30454, 29796, 27876, 24121, 26035, 24807, 20245, 20238, 22591, 23740, 24392, 22695, 21362]
10816B1362J899m80Q70k269k725j68L58L800R02L337n11Q23o82J79r54l235J32
10799B2638K837j126k683k496j278J164K228l85L395L997M50l431l209J812K637
10784B6550p87K305J642K66J455J156K55m66J466N174L586J65K281L542N288N928
10768E9806Q711J0885R463N105R296J7944K5480L4672N3019Q9125J56111K70993
10756G50610M45438O18965L93473l72512o58088m37582k32688j30480q2244n6694
10746B38198m3406l1053k3681j5936j0144j0146j0918j0360p905n676p193n105
10734E6675p444n43L88l899l281K19J263j424j528m413o446J178L692J814n33
10719C5718J340K798o4k129K31N875O092J231k892k376l163m293n015l710N29
$$ y = [21362, 23261, 22781, 23651, 21382, 18657, 18489, 18847, 22647, 23549, 26886, 26375, 27198, 26516, 26695, 25741, 22506, 22638, 25475, 24349, 21666, 19170, 17892, 19056, 21284, 20899, 24294, 28291, 28741, 25310, 22101, 23913, 26550, 25763, 28068, 29710, 29976, 31431, 32587, 32842, 32376, 33842, 39016, 42602, 42767, 45048, 48590, 53878, 59806, 68517, 79402, 88865, 93970, 103266, 121210, 146690, 181362, 234381, 323506, 479617, 750610, 1196048, 1815013, 2208486, 1835974, 1177886, 740304, 507616, 377136, 294892, 238198, 194792, 163739, 140058, 124122, 113978, 103832, 92914, 82554, 74649, 68973, 61780, 56675, 49231, 48688, 49076, 45177, 41896, 42115, 43378, 41954, 40426, 36013, 29567, 30745, 34437, 36251, 35718, 37058, 39856, 39792, 37663, 37894, 43769, 49861, 51092, 48200, 45824, 42661, 38368, 33353, 29643, 30172]
10704C0172J720K46m80K05o26m419k601j907l445N898M453j736K098L189j792
10689C0975l187j070J557K0K258K865J162J289n18J76j760n03k771k741j508r10
10673B5334m95j987N17j74J525L346K953L42L233K618k625l68N016N303j499O31
10657D3670q5k326m210p470q05j827M976Q109Q228L146M783O863J0319J2329R707
10642I5407J0375J2193J2554J6508L0342M2917O3332R1147J31386J72176J96608
10631H74945K23668K07756R4803K510p9227j92074k22815j96947j75323j37932
10621C99364r5802o3870m0087l0914k1007j3286j0554j4615q750o231n005n501
10609H3742p739q639p754k412m19m293R95Qj875l678R22J827O23j240l476j005
$$ y = [30172, 31892, 32138, 31658, 31863, 31237, 26818, 24217, 22310, 18865, 24763, 29216, 27480, 29578, 32767, 30975, 27788, 26718, 28275, 28295, 30553, 33418, 34580, 35869, 35351, 35527, 33767, 33264, 30493, 27752, 26244, 25334, 24839, 22852, 23369, 23195, 24720, 28066, 31019, 31361, 34594, 37212, 34587, 34219, 39235, 44538, 43039, 43670, 43585, 41259, 37049, 29579, 28774, 26947, 31923, 40032, 48260, 51406, 56189, 63052, 73371, 85700, 95407, 105782, 117975, 130529, 147037, 177379, 220296, 283628, 374775, 506161, 678337, 874945, 1098613, 1306369, 1401172, 1403682, 1324455, 1132381, 909566, 712619, 537296, 399364, 303562, 239692, 199605, 168691, 147684, 134398, 123844, 109229, 100479, 94248, 89243, 83742, 76003, 67364, 59610, 57198, 56779, 52486, 53481, 53489, 51614, 47936, 48858, 50685, 51308, 50068, 46592, 45587]
10593D5587l61K02j161k210M072M301L679l55j616l172n523m792k000J567R25
10578C9143L512n13o276k298r09O4k336J43O98O205K921j168j567j758j14Q82
10562C6629J314K470M551k5j889n34j66K032l337k290K579N633Q69j175l461n661
10546C7539Q95r7K287K518j65j720l85J709M61p85M156L253L32o176l444q100
10530C2278n387O61M853M062K29L051J819N04K960J39l189l972K330L173K371
10515D5882M665O039K1r522o349k682K993L619k234l833J537L180L503J237R16
10500D8972R86L34M110Q010J288n828m935J881Q273O291O916K565J499k870n063
10485G2429j569O47k17k355k288m913p24n96p51j058K378Q70N521M799L424K114
$$ y = [45587, 45226, 45428, 44267, 42057, 46129, 50430, 54109, 53754, 52138, 48966, 43443, 38651, 36651, 38218, 39143, 42655, 42142, 35866, 33568, 32659, 32723, 30387, 30530, 31228, 37433, 40354, 39186, 37619, 35861, 35747, 36629, 37943, 40413, 44964, 44939, 43050, 42516, 42350, 44382, 41045, 38755, 41334, 46967, 47836, 46661, 43200, 37539, 38434, 38337, 40624, 43142, 42977, 41257, 40872, 42581, 43042, 42257, 46413, 49666, 49998, 43822, 40378, 32278, 26891, 27552, 32405, 36467, 36696, 39747, 41566, 42070, 45030, 45169, 41980, 38008, 40338, 43511, 45882, 50547, 56586, 56607, 47085, 40736, 38054, 41047, 44666, 42432, 38599, 40136, 43316, 46819, 48056, 48972, 49958, 50292, 54402, 62412, 63700, 57872, 52937, 54818, 63091, 69382, 76298, 78863, 80362, 77492, 72429, 70860, 71507, 71290, 68935, 66647, 61734, 61010, 60414, 59663, 58605, 60983, 61853, 67374, 72173, 75597, 77711]
10469G7711N722O565Q441J6455J8945J3185J3275J8687K5164N3402K5454l8610
10457B44396o3880n0121k6757j2636n587j095K122N195N426K740p540j0468r992
10444G1803n927J444M916P893J3370J0556O648M62p502o667m73P833J7963K2731
10430A45050J6935R248Q496Q071Q316P135R188J5147Q138K395N2K494n378j1212
10416B24075j4862j3570j6092k4458j9337q892L15J1725P310q138q670O40p357
10403A22689j6255j6152k055J6758J9301J2597J2711M742m759j4371j4935j988
10391A18283J0424P374K819k257o774j403P033R837R494M635k780l573L408J2542
10377A69062K8885M0484L6704K2673L9556P4269P6092J5880p6496r9986o8194
$$ y = [77711, 83433, 89998, 98439, 114894, 133839, 147024, 160299, 178986, 204150, 257552, 283006, 244396, 180516, 130395, 103638, 91002, 85415, 84320, 86442, 91637, 97063, 99803, 92263, 81795, 71803, 65876, 67320, 72236, 80129, 93499, 104055, 110703, 111165, 103663, 96996, 96523, 104356, 122319, 145050, 161985, 171233, 179729, 187800, 196116, 203251, 212439, 227586, 235724, 238119, 238171, 240665, 235287, 224075, 209213, 195643, 179551, 155093, 135756, 126864, 127179, 138904, 146214, 138076, 129406, 130046, 122689, 106434, 90282, 88227, 104985, 124286, 136883, 149594, 154336, 149577, 135206, 120271, 118283, 128707, 136081, 138900, 136643, 129869, 128466, 135499, 145336, 154830, 159465, 156685, 153112, 156520, 169062, 197947, 238431, 275135, 297808, 337364, 411633, 487725, 503605, 427109, 327123, 258929]
10366B58929m4095k5960r258o064p843j655o79K650N420L11l587j458N51K078
10352A69340j178r456m839Q89L862O154R046J8830K2803K0452J4743J7798K7806
10339B96250L7789N8700O8486M2728l951n1918j13377j31449p1877j8104j07Q033
10327A21203J6881J4820J0892J380j0007p308m088N322R799M666j978j371L386
10314A63597O206O311M390M598K813O91J480N754J1004M756M164J18N96Q435J9690
10299B44603K2074J8405Q257j701n174j77k143n419m319P072J8894R090J089l794
10285C06757j40n29q736n136J2406J9332J1394J1881J9012K2244J9598J5681K1596
10272D45360K3969J6049J0895M836Q454J9269K8869L4883M6832M3260K4631K332
$$ y = [258929, 214834, 188874, 179616, 173552, 165709, 164054, 163375, 166025, 171445, 171756, 168169, 166711, 167262, 169340, 168162, 158706, 153867, 154756, 158618, 164772, 173818, 192648, 215451, 235903, 250646, 268444, 296250, 334039, 392739, 461225, 503953, 500002, 448084, 334707, 203258, 131381, 113277, 113170, 121203, 138084, 152904, 163796, 165176, 155169, 147861, 143773, 149095, 158894, 163560, 161582, 160211, 163597, 169803, 176114, 180504, 185102, 187915, 188606, 190086, 195840, 206844, 211600, 215764, 215882, 216478, 224913, 244603, 266677, 285082, 293339, 291638, 286464, 286287, 284144, 278725, 274406, 281478, 300372, 309462, 310551, 306757, 306617, 306088, 297352, 292216, 304622, 323954, 335348, 347229, 366241, 388485, 408083, 423764, 445360, 469329, 485378, 496273, 501109, 509563, 528832, 557701, 592584, 639416, 682676, 707307, 709639]
10260G09639L525K0250L7905M3510N3723Q3885J18437J85448L04247M87833P58479
10249B806881Q32709J03039p27311o76886l45778j64555r2404m9119O56N5396
10239A742628Q8237R7886J11306J48766J70944J82454J78315J54829J89065L01159
10229C365589M20814N00931N81653O98381Q53270J075179J267738J434183J602448
10220A1800186J377860R66698J274100K151205L319276M825585P002908J0686829
10212D3404647J7399183K9374645M9617885P8538313R9403523O3969535l6604408
10205C45103323r9735621q5314911n1309853k9878824j8903276j3040689r326510
10198C7593639o752511m957747l633286k598281j777686j272670j461057j908584
$$ y = [709639, 713164, 733414, 771319, 814829, 868552, 952437, 1070874, 1256322, 1560569, 2048402, 2806881, 3639590, 3742629, 3015318, 2338432, 1992654, 1828099, 1735695, 1686576, 1687232, 1742628, 1830865, 1928751, 2040057, 2188823, 2359767, 2542221, 2720536, 2875365, 3064430, 3365589, 3786403, 4287334, 4868987, 5567368, 6420638, 7495817, 8763555, 10197738, 11800186, 13178046, 14144744, 15418844, 17570049, 20889325, 25714910, 32717818, 43404647, 60803830, 90178475, 139796360, 218334673, 317738196, 381707731, 345103323, 245367702, 160052791, 108742938, 78864114, 59960838, 46920149, 37593639, 30841128, 25883381, 22250095, 19651814, 17874128, 16601458, 15140401, 13231817]
10190A3231817j816196j529098j315386j106553r15156p51679o08520n30760m90336
10181D168133m42075l64289k58314k12518j99159j73439j48869j02367o7195r8950
10171B100958j73808j92832j37934q5734o3771o5938o9477o1846o3457p4571o0542
10160A051048l6342l2877l9563m1557m5013l5732l8427n6353o4818m5941j5094
10149E99331j580o033j5148k0724k9173l1877k0330j0584r188o465q323n364J701
10136D36243n28k740l517p410r142j8418k3861j8325j5598k0030j2428L786J0004
10123C18036P479N220J6257K1218m792m1993n2352l0511o933L658O056o06r211
10110B31526n784l406k738j179k294l097m840n1l27l3Q64N25J099j217N126k469
$$ y = [13231817, 11415621, 9886523, 8571137, 7464584, 6549428, 5797749, 5189229, 4658469, 4168133, 3726058, 3361769, 3103455, 2890937, 2691778, 2518339, 2369470, 2267103, 2199908, 2100958, 1927150, 1734318, 1596384, 1510650, 1446879, 1380941, 1311464, 1249618, 1186161, 1111590, 1051048, 1014706, 981829, 942266, 900709, 855696, 819964, 781537, 725184, 660366, 614425, 599331, 597751, 591718, 576570, 555846, 526673, 494796, 474466, 463882, 454694, 448229, 439906, 434542, 436243, 435715, 432975, 429458, 422048, 412906, 394488, 370627, 352302, 336704, 316674, 304246, 308032, 318036, 325515, 330735, 346992, 368210, 363418, 321425, 269073, 238562, 231629, 235287, 241343, 240737, 231526, 225742, 222336, 219598, 218419, 216125, 213028, 208188, 208137, 207810, 207777, 208641, 209166, 210265, 209048, 214174, 211705]
10094B11705m051K243O760J205n793K829K1851L6139L8781K9130J6266k980j8832
10081C35253o4388j15273r6370m0720N60J6931J4272J0203K535n26J080L237J3093
10068G9887J5246O387j835J716o75o011q718p494l929l397k809k662p55k701k540
10053E9710L058J0724O040p564j183L836n635o435n157l482k928J152L696N628
10039F1460m88P11O735M174k047p322j1688k904N510J5684K5593L6244O0418J07729
10025B99809J59329P1665j33568j46356p7133n1446l9088j9010m904N662Q701
10014G3661J0898J6830J1900l927j1867q588K088J623J943J5026J9585J0651L501
10001A43324p439j1555j3317j2722q905j2860j6352j5780j0875j3119p414M52
$$ y = [211705, 207654, 209897, 216657, 217862, 212069, 214898, 236749, 272888, 311669, 340799, 357065, 354085, 335253, 270865, 155592, 59222, 18502, 19062, 35993, 50265, 60468, 63003, 62477, 63557, 66794, 79887, 95133, 101520, 99685, 101401, 100726, 94715, 85997, 78503, 74574, 71177, 68368, 65706, 64951, 62250, 59710, 62768, 73492, 79532, 71968, 70785, 74621, 68986, 62551, 57394, 53912, 50984, 52136, 55832, 61460, 60972, 61683, 68418, 72592, 70545, 63223, 51535, 48631, 54141, 69825, 95418, 131662, 192080, 299809, 459138, 530803, 397235, 250879, 173746, 122300, 83212, 64202, 59298, 64960, 73661, 84559, 101389, 113289, 109362, 97495, 88907, 90995, 92618, 94561, 109587, 129172, 139823, 143324, 135885, 124330, 111013, 98291, 89386, 76526, 60174, 44394, 33519, 20400, 12986, 13438]
9989A3438j996n090l753L56K754N784R008P127J4379P263k193m786j1301j0532
9975B0458J424J0416O104P683N189k948p296o580m518k349J35J567J05K925R515
9960D1830J2327R956M817O302p67r271j1654k247L729K336M15k537p874q053o831
9945C2478q221m498k776K418N761L232L687k51l641j942j980m165l473J961j332
9930A7258k619j033J616j352J899K880J955j796M2Q84l139p956j847J737J522
9915A0051J969L756L034l138L900M241N139K46j747l074R73L641M51n656p481
9900A6305m149M002O26j918j142q31j967J996r88r5p54L363Q69N63J676O981M67
9883B5004l077m770n372m260p27O27M81J619L905J232j536J639O390L343j581
$$ y = [13438, 11442, 6352, 2599, 2955, 5709, 11493, 20501, 27628, 42007, 49270, 47077, 42291, 30990, 20458, 21882, 32298, 38402, 46085, 51274, 48326, 41030, 34450, 29932, 27583, 27718, 29285, 29390, 32315, 41830, 54157, 64113, 68930, 75232, 74465, 65194, 53540, 51293, 55022, 57358, 57773, 55236, 47362, 39309, 32478, 24257, 19759, 16983, 19401, 25162, 28394, 32081, 31830, 28189, 26247, 24267, 20102, 16629, 18590, 17258, 14639, 13606, 15222, 13870, 15769, 18649, 20604, 18808, 18850, 19734, 16595, 8639, 6792, 8529, 10051, 12020, 15776, 18810, 15672, 19572, 23813, 28952, 29198, 27451, 24377, 25350, 28991, 29442, 23786, 16305, 12156, 16158, 16784, 14866, 13724, 12893, 10926, 12922, 11934, 11839, 11085, 14448, 15317, 15880, 17556, 24537, 25004, 21927, 17157, 11785, 7525, 6798, 7425, 7906, 9525, 13430, 14662, 13126, 14765, 21155, 24498, 22917]
9868B2917l935l13k74l863o785k724K394j741R83M69J43p37k714j668J752l6P88
9851D656J085L748O21j64l945m40n79m28K340L581N74j092K91J392m927n65O545
9834A2693J898o23J585o841q432l802m6L928L137M531O375L571J417j553P00N14
9818A9052j306l179O86j362o56j734j802o06L983N026j369l118j922j481N155
9803A5367L690J870J817K389k93Q22P013P649Q084O145L878M941O163J4131J8493
9788A02159K3376L7976N6812R4594J41291J87055K10261K33638J98050P5126j0148
9777A350190r2346j98689k19805j98133j75662j30979q2371n5989l7065l0509
9767A28642j5414q506q746p342n928o913q379j1812r485n693n456J343o660p227
$$ y = [22917, 18982, 18669, 18395, 14532, 7747, 5023, 7417, 5676, 6659, 7128, 7271, 6534, 3820, 2152, 3904, 3868, 4656, 5741, 9489, 10110, 9946, 6001, 5561, 4982, 4554, 6894, 10475, 11049, 9957, 10248, 11640, 6713, 6148, 12693, 14591, 13968, 15553, 8712, 280, -3522, -3568, 360, 3497, 8028, 14403, 17974, 19391, 17838, 18538, 19052, 17746, 14567, 15253, 13891, 13235, 11501, 9699, 9093, 13076, 18102, 16733, 13615, 11693, 10212, 15367, 19057, 20927, 22744, 25133, 24840, 25662, 32675, 40324, 48408, 54553, 58431, 63372, 69535, 83666, 102159, 125535, 163511, 220323, 314917, 456208, 643263, 853524, 1087162, 1285212, 1360338, 1350190, 1257844, 1059155, 839350, 641217, 465555, 334576, 252205, 196216, 159151, 128642, 113228, 104722, 95976, 88634, 82706, 75793, 67414, 55602, 46117, 40424, 34968, 36311, 29651, 22424]
9753B2424k108j938j554l38L474Q42j748J354M389Q85J060k790l925o450l367
9738A0210l639m23M84M92m54N19L066j390J342j065j7p13J983J775j295q6K671
9721A3460M2M16j998q76j746l48l305l419J27j377j85Q03K889O65p1M650Q30k545
9703H012j022k389J318m811J880k9n21J980k658j26o23L13K698L074K80l352l505
9686E19P47J492k040m327J440K821K777M59j565J441p00k087J054j494l02k41
9670fM20K910k51P45N79j001o31M79n29K754N6l91l363J433L067j668j974k741
9652a12j072J270j803Q7M659J768J162k081m47l321j719j776p67O337L651Q26
9636F662Q63j47n554k018J543j147N48N553K565r28j295M067J846m174l481o11
$$ y = [22424, 20316, 18378, 16824, 16486, 19960, 20802, 19054, 20408, 24797, 25682, 26742, 23952, 20027, 13577, 10210, 6571, 6148, 6632, 7124, 6670, 7189, 10255, 8865, 10207, 9142, 9125, 8412, 10395, 12170, 10875, 10789, 13460, 13502, 13918, 11920, 11044, 9298, 8950, 5645, 2226, 2353, 976, 791, 1594, 4483, 5148, 5077, 9727, 10557, 8012, 6990, 4601, 5919, 1108, 2988, 2959, 2438, 4418, 1760, 1634, 1011, 1324, 4022, 7096, 7376, 4024, 519, 1266, 2758, 718, -3609, -2169, 652, 3429, 3888, 2323, 3764, 3064, 977, 2031, 537, 235, -6, 414, 3324, 3073, 3818, 4397, 3396, 2765, 3244, 2715, 5469, 5525, 5134, 1771, 3204, 6271, 4603, 2629, -112, -1184, 86, -1717, -1630, 3029, 4797, 5959, 3878, 3431, 110, -1609, -3385, -4152, 2185, 5836, 6662, 7525, 7378, 1824, -194, 1349, 202, 750, 6303, 8868, 7940, 6645, 10712, 12558, 8384, 4903, 4292]
9620D292p19J220j068n00J008m704p59l56O27K497n456m493K415O23j390j155
9604g918J143L982K145J680J777L576o42p32j148j641K63q03J412O05j305N0P41
9587C185J654O77k225o38o38j570l531n83L45O534M949o07n05m112r38J286l078
9570B05k371l01L48J553L231Q29j554J20J209K367j272m522J331K545J679J351
9554F748k285l282l895J74M020L95k467l48o99L12L760M216r40k350k208j585
9538d34j39K346j553m334k265K879L097K202k196j632L860L415j283j891R09L027
9522F008j669m65r03J408L85j079k348M42L465J210l23k482N46k585l159N90o28
9505a587J186J905p51J418j807j588N666O309M08k301J822K730R61L644O543N773
$$ y = [4292, 3573, 4793, 3725, 3225, 4233, -471, -1230, -1586, -959, 1538, -3918, -8411, -5996, -5373, -6763, -7918, -6775, -2793, -648, 1032, 2809, 6385, 5743, 5011, 3863, 2222, 2485, 1682, 3094, 3699, 2394, 2444, 3185, 4839, 5516, 3291, 2653, 2015, 445, -3086, -3669, -3324, 3210, 8159, 7552, 7047, 2935, 1997, 3283, 205, -2166, -2467, -2119, -566, 2665, 3494, 1940, 2060, 3269, 5636, 4364, -158, 1173, 3718, 5397, 6748, 4463, 1181, -2714, -2540, 1480, 1875, -592, -940, -1639, -1327, 2433, 6649, 5709, 3359, 1151, -434, -573, 1773, 220, -4114, -6379, -3500, -403, 1799, -397, -2029, 1831, 5246, 3963, 2072, 2981, 6008, 4339, 3874, 2971, 4379, 4764, 3685, 1337, 1779, 5244, 6454, 6131, 3649, 4195, 1610, -1549, -959, -1587, -401, 1504, 753, 2171, 364, -1224, 4442, 10751, 11159, 8858, 10680, 13410, 14371, 18015, 24558, 30331]
9489C0331O534Q570J3534K1558L6356N2310O3560M7731K869m5576n7294m9767
9477A30716l5146k4851j6887j0681j1038n095l41m831o520J11r01j628m46M05
9463A2867j771n265J155L674n587k877L292K957j00k167l317k048J909L424K123
9448H269q71j043j884l838k965N3K272J844q88j331N099L573j896r62K102j148
9432F386m083J190L160J431o10l56J086l400J972M889j884l566K912k826O81k076
9416D906J115N69J235j324m304m004j557L880K248L151K205j150k784j799k02
9401B185n46P22k286J103J72k809J031K443o26l771q75O12K68J675J175j141m
9384f72r59k163J639J787j297O6j10J609P82k139k930M61p11k65L583J947R67
$$ y = [30331, 36865, 45435, 58969, 80527, 116883, 169193, 232753, 280484, 283353, 237777, 180483, 130716, 95570, 70719, 53832, 43151, 32113, 27018, 26677, 21846, 15326, 15437, 14536, 12908, 12462, 12867, 11096, 5831, 6986, 10660, 5073, 2196, 5488, 8445, 8345, 6178, 2861, 813, 2722, 6146, 8269, 7398, 6355, 4471, 633, -2332, -2279, -7, 1837, 949, -382, 4717, 8290, 6394, 5432, 7534, 6386, 2303, 3493, 6653, 8084, 7474, 7118, 8204, 4804, 6776, 11665, 9781, 6215, 9127, 6301, 6982, 4906, 6021, 6590, 7825, 6501, 2197, -1807, -3364, 516, 2764, 5915, 8120, 6970, 4186, 2387, 2185, 1639, 2361, 75, 1178, 1350, -1459, -428, 2015, 1389, -2382, -3257, -2645, -2377, -702, 473, -668, -672, -1631, -3794, -2155, -368, -1665, -1599, -1709, -100, 682, -1457, -4387, -3926, -4637, -4902, -1319, 628, 1595]
9367A595n47P41R15n071j410K018k765m17k037N80O40K138K2j075j00J682P79
9350b312j15j829J812J976o31q95q12k208j745M22K616L248K069q35j165M01p75
9333g78q27l400O40L138q00l957j632K125J218J277j681J099J276J593l0J36k027
9316b630M2K084K253k04p08j786j010k420j095J262M829J147m356m076j357L344
9300d681R6M01L96k04l16k460l48k453k235K364J417p14M73k154M15L326K405
9283d272l63o63J547J703j256k415K52J404o75P4m387n49L246J786M13K059J632
9266d64r55l813N0J505K610K92j802J72r49l13K743R52L988j732k734j502J961
9249IQ37l8m06j40n05J076j151o07O66k103K243J846j601k43k323L731L299k226
$$ y = [1595, 1048, 1789, 2704, -2367, -3777, -1759, -4524, -4941, -6978, -6398, -5758, -3620, -3598, -4673, -4773, -3091, -2312, -2427, -4256, -2444, -468, -1099, -1994, -2806, -5014, -6759, -6337, -3721, -473, 1596, 761, -404, -3, -778, -1605, -5005, -4365, -1227, -2027, -5984, -7616, -5491, -4273, -2996, -4677, -3578, -2302, -709, -739, -603, -2630, -2588, -504, 1749, 1545, 837, -949, -1959, -4379, -5474, -4212, 617, 1764, -2592, -6668, -8025, -4681, -4585, -4184, -3788, -3992, -4308, -6768, -7116, -9569, -11804, -9440, -8023, -8737, -8264, -10418, -10003, -6677, -4272, -4635, -5298, -3751, -2048, -3304, -5719, -5467, -4063, -4738, -4664, -9051, -9600, -6354, -4568, -4155, -2096, -464, -1419, -5232, -5182, -3677, -1067, -775, -2577, -2405, -3354, -3667, -924, 28, 4016, 2284, -450, -1952, 9, 846, 808, 402, 262, -243, 833, -318, -925, -259, -2362, -119, 1727, 126, -117, -2440, 1291, 4590, 2364]
9231B364m901j190Q77m47J420K594j177n44O09j41m09J699k449k580J517L482
9215G24P35J021l364m237K466J412j030l934J053L27j344j662j927L111J661L470
9199a518m59J426K241j40m219m76L826r8J781k65j556J88K13k404j866k445j231
9182g002L321L024j293K214r58N17Q45m204o95M088J45m133K555K39P10n94M12
9165h09L110j251m426p63J243L112j567L779J626l515p07J272j740M82J854k178
9149d78j154K227K761l05J637k125j708k51m17k224k90l74L78Q26M78N00l559
9132d078K162K370n71l657j036K891r49j087J566l60J380J500L396K088R41k420
9116D136l254n65L607J532M4r50j497l846j060K312K813k466l027m362j286J108
$$ y = [2364, -2537, -3727, -2850, -3297, -1877, 717, -460, -1004, -395, -536, -945, 754, -1695, -4275, -2758, 724, 1459, 2480, -884, -5121, -2655, -1243, -2273, -6207, -5154, -4827, -6171, -7833, -9760, -6649, -4988, -1518, -1977, -551, 1690, 1550, -2669, -3145, 681, 583, 2364, 2099, 543, 731, 944, -1460, -3326, -5771, -7002, -3681, -657, -1950, 264, -694, -177, 668, -3536, -4231, -143, 2, -4131, -1576, -1337, -627, -1221, -809, 2301, 1050, -3376, -4139, -2896, 216, -1351, 2428, 4054, 539, -168, 1104, -636, -154, 1700, -478, -1632, 595, 3356, 3051, 4688, 2563, 855, 604, 187, -2037, -2327, -2701, -2323, -1497, -1019, -519, -4078, -1916, 454, -117, -3774, -4810, -1919, -2868, -3955, -2389, -2749, -1369, 131, 3527, 5615, 6556, 4136, 882, 317, 3924, 5456, 5500, 4550, 3053, -793, -1853, 459, 3272, 806, -2221, -6583, -7869, -6761]
9100f761L53K496j185k956j499P85K066K847K166J652j814j024N46j385j287O40
9084d360L586J550m87j899Q86N8M65j451j13l126j35L420M40j333O53P22j03j48
9066a375r60L26L412p18l908l296N35L357K451Q26j880l775J16p28J843l44K913
9049a205K085j591K053o91j882j126j998k52L652M097k078l020J46P13n54P67
9033h84J199L174J882j262m079r76L93O96J166q50K41K6Q33j338l86j942J090
9016a017J667L028m27k556J592L479R51k625m843q18J337J483r00K010j14k760
9000e13j688J401K924j254k908m361r88K234j471J095K778M926K160k78l201l327
8984b471k724L99K174j504J574M32j988N26m21L05J589M48J092k487K235l28J658
$$ y = [-6761, -6408, -3912, -5097, -8053, -9552, -8767, -6701, -3854, -1688, -36, -1850, -2874, -2328, -3713, -5000, -4360, -774, 776, 289, -1610, -724, -666, -201, -1652, -1765, -4891, -5026, -1606, -1166, -2499, -1846, -1124, -1227, -1375, -2335, -2009, 1403, 685, -3223, -6519, -5984, -2627, -176, 650, -1230, -5005, -4889, -5617, -3774, -4118, -1205, 880, -711, 1342, 651, -1231, -2357, -4355, -4607, -955, 3142, 1064, -1956, -1810, -1097, -1651, -884, 315, 3489, 5371, 4109, 30, -946, -553, 143, 1309, 459, 700, 726, 1559, 221, -165, -2107, -1017, 650, 3678, 3251, 695, 2287, 5766, 6717, 4092, -751, -1569, -232, 1251, 351, 2361, 2247, -513, -2201, -800, 2124, 870, -2038, -6399, -7387, -5153, -6624, -5529, -2751, 2175, 4335, 4057, 856, -2471, -5195, -4796, -2622, -4126, -2552, -2120, -4108, -3582, -4003, -3698, -2109, -1661, -569, -3056, -821, -1149, 509]
8967E09K567J867j856J867Q21m237k520K326n66l978k635L198R22M518L221r44
8951E080j083L52j269M15j369l229l654n01M459K650o55q03j055o09l458O44N742
8934A657j447N2j125K280L899k980j146P43k903O2J596q05R26P59p7J547j952
8917A086k104R36K421J63J115n91r95J141J315q1k7j287j423N56O27J846k286
8900B412j262j29K428k946k092l63P71L406q61j26L34K686J89n297L845L792k381
8883D406n06j149q44Q53k172n74j580K885K016Q31j645l88K293j97j696J641l133
8866A041L18J925K983q41j63k702p5J386j733J448K287M857J113n641n3N361O430
8849A7941K946K317L45n49K678O293Q762J0099J2502J3844K4436L7703N3147N8760
$$ y = [509, 3076, 4943, 3087, 4954, 5775, 1538, -982, 1344, 778, -3200, -5835, -2637, -1715, 2803, 6024, 5080, 3997, 4349, 3080, 3495, 2126, -1103, -4757, -5258, -799, 1851, 1196, 393, -662, -1271, -4729, -4085, 1657, 210, 262, -863, 1417, 5316, 2336, 1190, 1933, -970, -908, 688, -117, 809, 1568, 1491, 3038, 1086, -1018, -82, 2339, 2502, 3617, 3026, 2031, 3172, 4487, 4406, 4379, 3092, 1669, 2225, 2852, 4698, 2412, 1150, 1021, 3449, 503, -1589, -1952, -1181, 2225, 1364, 1238, 1572, 4258, 4447, -850, 2995, 6787, 4406, 3900, 2751, 1907, 2760, 588, 14, -1566, 1319, 3335, 4166, 2521, 2133, 4426, 4229, 2533, 4174, 1041, 1359, 3284, 6267, 5426, 5263, 2561, 2486, 3872, 2139, 3587, 5874, 10731, 11844, 6203, 6150, 11511, 17941, 20887, 23204, 23549, 23000, 25678, 31971, 40733, 50832, 63334, 77178, 101614, 139317, 192464, 251224]
8835B51224N3079J7095l4298n9884n2142l7580k6289j7695j2260j3653o609n344
8823E5644n488n879K391j5l269L823M012j843J17L641O417N751P808Q682J6523
8808I8315K0277K5705L1581M9862P4597J15201J66042K00326J70382L4478j30605
8797H56161j93963j65258j19953q1599n6480m2913l0652k2667j9318j3546n704
8786A04108n818j2165p077k864l419n310J266J345M860O100Q306R756J1670J6431
8772A27189K7445L4911N3743Q1160J17393J63003J97103J56066P150j45985j97847
8761F21331j60585j09945p6783n3511l9668l0326k1760j9743j3438j0978q721
8750G5873p822r886l420k555o220k269j857j645j472O85P337R518M339N708P317
$$ y = [251224, 304303, 321398, 287100, 227216, 175074, 137494, 111205, 93510, 81250, 67597, 60988, 55644, 50156, 44277, 46668, 46653, 43384, 47207, 51219, 49376, 49493, 53134, 59551, 65302, 73110, 81792, 98315, 118592, 144297, 175878, 225740, 300337, 415538, 581580, 781906, 952288, 986766, 856161, 662198, 496940, 376987, 295388, 238908, 195995, 165343, 142676, 123358, 109812, 104108, 98290, 86125, 79048, 76184, 72765, 67455, 68721, 70066, 74926, 81026, 89332, 99088, 110758, 127189, 154634, 189545, 243288, 324448, 441841, 604844, 801947, 958013, 965163, 819178, 621331, 460746, 350801, 274018, 220507, 180839, 150513, 128753, 109010, 95572, 84594, 75873, 68051, 58165, 54745, 52190, 45970, 43701, 41844, 40199, 38727, 39412, 46749, 56267, 60606, 66314, 73631]
8735G3631K0648K3470L3602M8986N4606M2458l032m2176n2924m8840l8069k6976
8723H5384j7361j1744j1207l840o404l235m497l808j233P32j140l466l970p55
8709A3456k72l545k748L278l18k025k428j382K665k300J209m52N91k036r83K502
8693E212K949J256l996j541k660j920k772K571M343R35J685J139m680m494P4M203
8677B304K654J467k63l188k543r33o71j162M190L003R76o51j80j184r93J034j85
8660C675j306j695j064j267j932J128J425J432J211M808K322J39l477l533J113
8645B979m66j960m59J495j447l88K930n03j864r95k096J84L806j551K353N81p6
8628B523J444q66j933J89k616l759j860K379J189J034J639p71J21j95J197P31
$$ y = [73631, 94279, 117749, 151351, 200337, 254943, 297401, 294369, 252193, 199269, 150429, 112360, 85384, 68023, 56279, 45072, 41232, 34828, 31593, 27096, 23288, 22055, 22787, 21647, 18181, 14211, 13456, 13184, 9639, 6891, 10169, 9851, 7826, 5398, 4016, 6681, 4381, 5590, 5138, 5729, 3693, 2710, 5212, 8161, 9417, 5421, 3880, 1220, -700, -3472, -901, 3442, 4377, 6062, 7201, 2521, -1973, -1899, 2304, 4958, 6425, 6162, 2974, 431, -502, -1173, -2335, 1855, 4858, 5834, 5183, 5003, 3819, 2826, 3860, 3675, 2369, 674, -390, -1657, -3589, -2461, -1036, 396, 1607, 6415, 8737, 8876, 5399, 1866, 2979, 2513, 553, 94, 1589, 142, -246, 2684, 2181, 317, -678, -2774, -2590, 1216, -335, 2018, 2599, 2523, 3967, 3101, 1168, 1357, -1259, -5018, -6878, -4499, -3310, -2276, -637, -1408, -1287, -1482, -285, 446]
8612D46k435n352K795M780K165j575k763q03J197r36l4j124r27K760k80K768O572
8595G254L960K65m131n389k362M29J02N24k87L42L235RP83Q88r96R0K449M730
8577A1895L107j842p606m128k199M262K362L035l382j190J707K075L317K6n53
8562A0886j29N424R781q873j4546n143L054K002J683K733r92m029J4L358J305
8547F528j619p17J31K447L815q8l328k733k232l094J314K796K134O80l033m70
8531B531k458j614q1O40L572K177j475J013J114p89j007k738J765k899o39P5k267
8514c080m762L417L728j58L462J657j617j644k720L133j354l268j526L842L851
8499B961k692j981m375l13K906K254k429k429K969J641kM05l483o44K223J856
$$ y = [446, -1989, -7341, -4546, 234, 2399, 824, -1939, -2742, -1545, -2481, -2515, -3639, -4566, -1806, -2086, 682, 7254, 11214, 11479, 7348, 1959, -403, 26, 128, 652, 365, 707, 3942, 3951, 4734, 5622, 4626, 4716, 7165, 11895, 15002, 13160, 5554, 1426, -773, 3489, 5851, 8886, 5504, 4314, 6021, 8096, 11413, 11439, 10886, 10757, 16181, 25962, 17089, 2543, -2600, 454, 2456, 4139, 6872, 5880, 1851, 1865, 5223, 6528, 4909, 4192, 4323, 6770, 10585, 10497, 7169, 4436, 2204, -890, 424, 3220, 5354, 6034, 3001, 2531, 73, -1541, -1622, -982, 2590, 4767, 3292, 4305, 5419, 4630, 3623, 885, 2650, -249, -888, -813, -3080, -7842, -4425, -697, -855, 2607, 4264, 2647, 1003, -1717, 1416, 62, -3206, -4732, -890, 2961, 269, -1712, -6087, -6400, -3494, -1240, -3669, -6098, -3129, -1488, -1490, -1085, -4568, -5212, -2989, -1133]
8483a133M049P87j762n13j908k294k662l19K067n24M4J424J524Q43o48Q7k648
8466c586r49K17l1j0K221j574J694K557r9J769j346k578J004P17P06j217l059
8449c564k705K889K631k63J842J820j616j646k860J849m89l803K044L975j654
8434a550r44j116J919J944l481l232J875K617N40J760j340q83j678K63J456J380
8418d70J192j294k728j650K65j378R82M350M051j93l918K190q83L1k89j560q54
8401b156j040m111K261O319M715k615j474j034j349K277K391j33l410m151l94
8386c904K389J29J830K317m559l035k06J254L864K014J45q22J00K049J571l48
8370D788j470k542j522Q29L43j232j20j206p46q16K269K953J974R08L555j757
$$ y = [-1133, 2916, 3703, 1941, 1428, -480, -2774, -5436, -5755, -3688, -4212, -4168, -2744, -1220, -377, -1025, -938, -3586, -4535, -4318, -4349, -4359, -2138, -3712, -2018, 539, 440, 2209, 863, -1715, -711, 6, 712, -505, -3564, -6269, -3380, -749, -1012, 830, 2650, 1034, -612, -3472, -1623, -2112, -5915, -3871, 104, -1550, -2494, -3610, -1691, 253, -3228, -6460, -4585, -1968, -1428, 332, -1008, -1891, -3569, -3306, -1850, -470, 722, -572, -3300, -4950, -4685, -6063, -5081, -731, 3320, 3127, -791, 1399, 516, 547, 258, -1302, -2156, -3196, -7307, -5046, 1273, 5988, 3373, 1899, 865, -484, 1793, 4184, 4051, 641, -3510, -3904, -1515, -1386, 444, 2761, -1798, -4833, -5039, -3785, 79, 2093, 2238, 1416, 1516, 3565, 5136, 4788, 3318, 776, -746, 83, 426, -806, -926, -2132, -2878, -3694, -1425, 1528, 3502, 4410, 7965, 6208]
8354F208PJ654j821l222k570J30J370J00j635Q6O70M91J480K60o168l518M383
8337b095l05J268J593k760l951k647L512M101J639k789j629J371K626k251M92
8322a825Q6K005M506l850p80j515m721K092M293J485R13J807N71M25j153n167
8306h28n590m456J110M587J467k711r07K540M644J498j053j543k30j190j042L820
8290A16J725k070k791k620J485M905J300p58J5M17j219M10K017j949j860r62j086
8273b925l70o53n24K926L531j601J042m71k179j04j058M84K214K887K48j62P45
8256D030j690j215K571N93j524k988j279k894o59J444J917l091J249j117N49L700
8240d04K533j748k221o57K398L126k546K17o8l184j718J325K561j392r41N66L180
$$ y = [6208, 6215, 7869, 6048, 2826, 256, 386, 1756, 1856, 221, 307, 977, 1468, 2948, 3208, -2960, -6478, -2095, -2400, -1132, 461, -2299, -6250, -8897, -5385, -1284, 355, -2434, -4063, -2692, -66, -2317, -1825, -1739, 266, 4772, 922, 142, -1373, -6094, -4002, 291, 1776, 2689, 4496, 5067, 5492, 4339, -828, -6418, -10874, -9764, -5177, -3710, -6421, -7328, -4788, -144, 1354, 301, -1242, -1472, -2662, -3704, 116, 1841, -229, -3020, -5640, -4155, 750, 2050, 1292, 1307, 1724, 505, 915, 2932, 983, -877, -1839, -2925, -3295, -3948, -4472, -1546, 1985, 384, 1426, 955, -1224, -1328, -2386, -1902, 312, 3199, 3447, 3285, 4030, 2340, 1125, 3696, 4289, 2765, -223, -1502, -4396, -5055, -3611, -1694, -4785, -3536, -4653, -4104, -404, 2129, 381, -1840, -2497, -99, 3027, 481, 698, 630, -2554, -4272, -2947, -386, -1778, -2719, -2153, 1027]
8223A027K051l17j120j704O76k481o61N93L931k190l145l15J717K774q68k234
8207b266k92j375m82k120k841J025K84L77J021L379M421K482L83j146l969o99
8191a818p98l554j77L53J82L000M060J982r60k291j749L314q89k255J288L443
8175C131J772k95j32j694m831j930nJ389J482l71P2L864K126k631l66J736j005
8158B312r49k931Q98J474J378j081m26J214j284j827j625N88J084l039k957l2
8142g203q71J54J196j63J776J877J344J684K688j388l791m487k264k735L539J436
8126g208j145K824L286L49o37r0k162J193K150o22M10J856k491j079l9J930J81
8109a294M7l009r8K341J767K100l925k460K079L906n70o49j544J761l182q44M102
$$ y = [1027, 3078, 2761, 1641, -63, 613, -1868, -2529, -1936, 1995, -195, -3340, -3655, -1938, 836, -32, -2266, -2558, -3933, -4415, -6535, -9376, -8351, -8067, -7690, -6669, -3290, 1131, 3613, 3996, 2850, -1119, -1818, -2616, -6170, -6347, -5994, -5812, -2812, 1248, 3230, 2270, -21, -1770, 1544, 655, -1600, -312, 3131, 4903, 4608, 4476, 2782, -2049, -3979, -3984, -2595, -1113, -1484, -1412, 2452, 4578, 1947, 1581, 3317, 2312, 1363, -1568, -670, 804, 2182, 1101, 675, 1889, 605, -1222, -2847, -2259, -1175, -4214, -7171, -7203, -8074, -7920, -6724, -6887, -5111, -3234, -1890, -206, 2482, 1094, -2697, -7184, -9448, -12183, -8644, -7208, -8353, -5529, -2243, -1894, -2531, -2621, -4783, -3590, -1440, -2062, -1652, 204, -2287, -3366, -3405, -1475, -1294, -1247, -4256, -4354, -2013, -246, 1854, -2071, -4531, -2452, 1454, 884, 235, -1309, 452, -2730, -3574, 528]
8092E28K78k473K26j201j890r54J239M929L418j790q26q39J052J489k756K171
8076B601M232J705k82n426m544k993k204L943L305K289k192m036j086L019J628
8061d1l00p08J782L506K468J511j086m320m745K117J682l00J056q03j93L28p35
8044A219N81k566K827N96l43P65N77l034j894J14N04o2k19k728Q08J426j451l386
8026f266q6L842O70k240J614L057K47M9J269j529j3J245R39N47k46n48M72r11
8008B112M31K015P91k943J918J636l089j54J204j63j827p96k982K895J908L098
7992F054k873n45r1j268j765m830j519L334J218K043j021m81J771j67l97K384
7976A847K330J027k140q57m15L98j559J020M46J647J481M064k72k753m100J483
$$ y = [528, 806, -1667, -1441, -2642, -4532, -5486, -4247, 682, 4100, 2310, 1484, 645, 1697, 3186, 430, 2601, 6833, 8538, 8256, 2830, -1714, -4707, -6911, -2968, 337, 2626, 434, -3602, -4688, -1669, -41, -341, -1049, 733, 4239, 6707, 8218, 7132, 2812, -1933, 184, 1866, 1566, 2622, 1819, 1626, 1954, 1219, 1800, -766, 2061, 2657, 2314, 3079, 3656, 622, -1272, -1158, -654, -716, -935, -3663, -2855, -1429, -2880, -6266, -6352, -2510, -1840, -4080, -2466, 591, 838, 887, 2156, 627, 614, 1859, 2798, 3345, 3099, 2551, 3023, 2112, 2543, 4558, 5349, 2406, 4324, 5960, 2871, 2717, 3921, 3758, 1931, 1135, -1847, 1048, 2956, 6054, 3181, 2636, 2545, 1277, -488, -5318, -6837, -3503, -2285, -242, -1263, -1744, 27, -140, -537, 1847, 4177, 5204, 3064, 2207, 1792, 2190, 631, 1651, 2097, 3744, 5225, 9289, 9017, 6264, 2164, 3647]
7960C647m26j845K18k853K060o92j783K211J967J043k022j112Q04K126L519k80
7944F582j422R72K165l561p587J13N041k001J87M106K658K92j161j910l494j487
7928e07J424j336r19K342K171J174O62O60j474p9LO65j281n07j470J589j323K015
7910C809J4k297k145R54K924K507K002K16k20j593J587J539o74l660m926M548
7894D585L803K016l126j611j811p11j387k84K7J77K608K217k90J814l69k810m693
7877A55N22K136q70J596J820j507j160m38r83K190K079j908J338K701R10J344
7861I925l75j826j657m45k681m025q26M395J487j956K664j311j004J310q58o2
7845B755Q32K85J355m760j782L659k913J224m7j608J825n27j225m70M58K133M250
$$ y = [3647, 3221, 1376, 1594, -1259, 801, 109, -1674, 537, 2504, 3547, 1525, 413, 1217, 3343, 6862, 6582, 5160, 6132, 8297, 4736, -2851, -2738, 2303, 302, 489, 4595, 7253, 7545, 6384, 4474, 980, -507, 917, -419, -1338, 1004, 3175, 4349, 5011, 5671, 4197, 4118, 4121, 4786, 3505, 2998, 1528, 3117, 1794, 3809, 3823, 1526, -619, 335, 3259, 5766, 7768, 7984, 7764, 6171, 7758, 9297, 8623, 4963, 37, 4585, 8388, 10404, 7278, 5667, 3856, 3145, 1758, 1474, 1501, 1678, 4286, 6503, 6213, 8027, 7658, 4848, 155, 677, 2813, 1943, 3539, 5359, 3852, 2692, 2254, 1271, 3461, 5540, 3632, 4970, 7671, 8581, 9925, 9550, 7724, 6067, 5622, 2941, -1084, -1910, 2485, 3972, 2016, 4680, 3369, 2365, 3675, 2817, 2755, 3587, 3872, 5227, 467, -1315, 2344, -569, 655, 608, -1000, 825, 298, -927, -1397, -939, 1194, 5444]
7828E444J795L60j069j141J751M28k176j79m022j698J059k271J19K941J455p2
7812B724J449k229l176k602J316K635j038L953m27l775K67L62M43J634j605j881
7796a950l790M04L798K499M040K583O87j38m974J28J357j17n78l568K543J050
7780C974N36j355m189k170j338k570n1K633J185N43K653K625j384l329L83L404
7764A550K528R83J140k970l525o13p90k159j45L034P932J730m648l675L24K273
7748B969j029n575O75M884k953N21J366K658J341k707j095k341O98J00j692J247
7732i33L006j376j25k07j302K555j756j427K29m4j80j087J421J331K927r39j600
7715D93K26J210k28M35j628m1J083l487P93q31k810J487N35J903m93RJ037J166
$$ y = [5444, 7239, 7599, 6530, 5389, 7140, 7568, 5392, 5213, 1191, -507, 552, -1719, -1600, 1341, 2796, 2724, 4173, 1944, -1232, -3834, -2518, 117, -921, 3032, 2605, -1170, -903, -541, -98, 1536, -69, -1950, -5740, -5336, -1538, 961, 5001, 7584, 8271, 8133, 3159, 3287, 4644, 4527, 3949, 381, 2924, 3974, 4510, 3155, -1034, -3204, -4542, -7112, -7163, -4530, -3345, -2802, -149, 2476, 1092, -2237, -1854, 1550, 4078, 5061, 6201, 3231, -294, -907, -1697, -3856, -4001, -967, 6965, 8695, 4047, 372, 696, 2969, 1940, -3635, -2960, 1924, -1029, -508, 858, 3516, 4857, 2150, 1055, -1286, -588, -488, -2180, -933, 2073, 697, 572, 365, -937, 1618, -138, -1565, -1336, -1380, -1560, -2647, -1226, 105, 3032, 2093, 493, 719, 1929, 1701, 2136, 508, 467, 1550, -1937, -1144, -1975, -4785, -3298, -2763, -860, -1353, -1344, -307, 859]
7697H59j084L184J35j93J832J250j401r56j49q29o06N15O87J062R38Q6j983k524
7679H23l319k257L466K693L806n01l819o94q61j915J368m59k17K518J070k377
7663f75r01j556K216m31p22M59J797n08R79J384k848j380R51J23P64Q48L229J543
7645E272k993n056k417p74K461R209J190l273j422k646j376K455l59M74J588k78
7629B055o55l380m236k168N508N655m681j096K293K27M95j564k87k860K096N695
7613C097N44k248j200m828j510K758j416k58L99n19l23K385M190K099m36K55J
7596B990p1l400k388K046K030K91p9L48j420j004Q66K342o87m145K980k78q63
7579d42M90J365m229n050J053L571K986j03l808k336J839K554r47n26J040P91
$$ y = [859, -225, 2959, 3094, 2901, 4733, 5983, 4582, 3626, 3477, 2648, 2042, 2557, 3244, 4306, 5244, 5330, 3347, 823, -2496, -4753, -1287, 1406, 5212, 4711, 892, 198, -663, -2578, -1210, -1669, -1886, 632, 1702, -675, -1576, -3132, -916, -1347, -2069, -1610, 187, -321, 658, 2042, -806, -2186, -1235, -1112, -348, 500, 3729, 5272, 2279, -2777, -5194, -5968, -3507, 5702, 6892, 3619, 2197, -449, -1825, 630, 271, 745, 2333, 2055, 1400, -1980, -6216, -8384, -2876, 2779, -1902, -2998, -705, -478, 17, -1547, -1834, -4694, -2598, 3097, 3641, 1393, 193, -4635, -6145, -3387, -4803, -5061, -4662, -5181, -5504, -3119, 1071, 3170, 2734, 2989, 2990, 2919, -481, -2869, -823, 1207, 1498, 1419, 1767, 347, -657, 209, 2551, 1864, -2281, 699, 421, -442, 48, 1413, -2816, -7866, -6813, -3242, -256, -359, -4167, -6503, -4664, -2110, -3057, -3583, -2543, -1752]
7563a752m67K703m792k187K648j560j36K482P74k797K64N594N351j951k886j72
7547A116k154j727j525J245J213Q55J182p48m28j868J922K964K50K254j796l209
7531d54J223j329M872K198o229l270L698m94l385k130M010L182p36k032L50J608
7515A082k35K87K77J837k07k488J673j552k867m17k100J602M446K84k947J017
7499c08k715k371K657K043J612J684K471j732k942O71j141l376k270K785K601
7484c31q10J340l55k931m66J051J130k490m91r85K8M55K255k506k73L649Q22l48
7466a256K710p91l080M13n15o96J367J984J306J82r59l16l0m563j065k379O77
7449g011J230J605M152L428J43n71j332k189l088j319N560l04k059j486j070N60
$$ y = [-1752, -2219, 484, -4308, -6495, -3847, -5407, -5543, -3061, -2287, -5084, -4820, 774, 6125, 4174, 1288, 1116, -1038, -2765, -4290, -3045, -1832, -977, 205, -543, -971, -2839, -917, 2047, 2297, 4551, 2755, -454, 769, -560, 4312, 6510, 281, -2989, 709, 215, -3170, -5300, -1290, 1892, 1156, -876, -526, 1082, 847, 1134, 1411, 3248, 3041, 553, 2226, 674, -2193, -2610, -4710, -3108, 1338, 1622, -1325, -308, -3023, -5394, -2737, -694, 918, 2602, 5073, 3341, 399, 1070, -71, -3447, -5717, -2932, -331, -1141, 199, -156, -3087, -3553, -2502, -1372, -3862, -4353, -5338, -5310, -4855, -2600, -5106, -5379, -1730, -908, -1256, 1454, 663, -2417, -2004, -2519, -3215, -1848, 136, 1442, 1624, 665, 349, 319, -4244, -5309, -7688, -7011, -5781, -4176, -24, 3404, 3547, 2976, 1644, -545, -3633, -4952, 608, 304, -1755, -3241, -4311, -3751]
7433c751Q94j073K16J56m33j751K029J537j066K145K209J274J018kk8J202J91
7416D767k393k717J1J565o39j14l62M298J523k278k706J400k549k918j873J33
7400d852j095j409k078J499L267K06K621J557P33k54J766J228j945m641N51j807
7384d653Q45L414j000l946K569K662k452o76J933J551j93r99l326j526J383O475
7368B061L362J198k380m359q19K302k186l765R77L947K006K463n29l162K50N94
7352A960m180l976j172J505J500Q12P07J451K319o61l758j676j230R57p60J211
7336d991J304J404K220J52j237j58k13N74L656j616j461N50k125k675m26K153
7320b889L573K087K165k940k387n175K174M93K456R90O51O0o27j246L97R95l928
$$ y = [-3751, -2857, -3930, -3714, -3558, -3991, -5742, -3713, -2176, -3242, -1097, 1112, 2386, 3404, 3402, 3374, 4576, 4767, 2374, -343, -332, 1233, 594, 480, 118, 4416, 5939, 3661, 955, 2355, -194, -3112, -4985, -4852, -5947, -7356, -9434, -7935, -4668, -4462, -1841, -284, 449, 195, 1961, 3189, 1244, -3397, -2846, -4653, -3808, -394, -1394, -5340, -2771, -109, -2561, -3237, -1304, 247, 54, -945, -4271, -5797, -4414, 2061, 5423, 6621, 4241, -118, -937, 1365, -821, -4586, -3609, 338, 2344, 4807, 4278, 1116, 1366, 1960, -2220, -6196, -7368, -5863, -4363, -3551, -2844, -1393, 926, 265, -3493, -5169, -6399, -5442, -6202, -4991, -3687, -2283, -63, 89, -1148, -1306, -1519, -945, 2711, 1095, -366, 184, -1941, -4616, -5042, -2889, 684, 2771, 4936, 1996, -391, -5566, -3392, -2899, -443, 547, 1198, 1258, 631, -615, -218, 777, -3151]
7303c151q18J394N58o2j154q51p80L473J876J714k104l201O06L526K397k030p54
7286F39Q36j02n93L92j368l951l182J191N284R06J909j057m187l9N20J276J129
7269c97j0J396L071j97j504j858j414l035M42K756K222j881k577P13K775J581
7253B083k2k744n34k801p36K261M95K164n80K271L099k225J99J137j837l355j440
7236b565N85J847j262J139l3L44k002j305M59K471J247p16n31l362j223L528K176
7219G97K899J044J96n53p88k105o26r15j364k137q83p84n05K277P73k738K121
7202c291O37l597K872N401k080m3l543m96K399l089j428M4K380L546m00k589l54
7185c631M34J200k500K236l221l331J717J023J613L14J613K000P84j439K46J081
$$ y = [-3151, -3969, -2575, -2017, -2079, -3233, -4084, -4864, -1391, 485, 2199, 95, -3106, -2500, 1026, 3423, 1393, 639, 1475, 1373, 780, 1172, -196, -4147, -7329, -6138, -854, 52, 1961, 904, -3283, -3322, -2802, -1526, -397, -407, 989, 4060, 3863, 2359, 501, -913, -3948, -3506, -750, 1472, -409, -2986, -2273, 502, 2083, 2061, -683, -1217, -4018, -4754, -2493, -1998, 166, -414, 1857, 4956, 2731, 2930, 4067, 2230, -1125, -2565, -1980, -133, -1395, -256, -289, 55, -1947, -3252, -2793, -322, 925, 209, -322, -3684, -4907, -1379, 797, 3696, 4740, 4936, 4383, 3595, 1490, 864, -51, -1415, -3552, -4435, -5219, -5724, -3447, -2674, -5412, -3291, -2654, -6251, -3379, 2022, -58, -101, -3644, -4140, -1741, -4830, -6258, -6214, -3834, -288, -688, -3277, -3631, -3197, -1997, -4497, -2261, -5482, -8813, -7096, -6073, -4460, -4146, -2533, -533, 251, -1188, -942, 139]
7169A39L609q35l606k836j817L49J34J296l97m32K414K192l739K77M180J885n79
7152B234J208l813l428Q39r21J55K082K60R63M09k89j379R9j443r44r13O01j263
7134e543l173L772l95J960L546l71k972J375J17k489j214L524k74J643p57p93
7118b044J007p94l743k236R96L877l08J227K673K217J172j948p91r5l229m53r95
7101c467l031R82J415Q4J233p91J64K325J312L84K062J562k956k572k771J997
7085b068L796p05q21k446n17L18j178J407j79J821k958k421M191K208k166L296
7069A578M0k737L451J711p060j479J305K007j582J982L178J492m109k446K86L423
7053A040J135l163n188J358O510K524j912J077N13k149k795O94p73RN93J276K011
$$ y = [139, 3748, 2913, -693, -3529, -5346, -4997, -4863, -3567, -3964, -4396, -1982, 210, -3529, -3252, 928, 2813, 2234, 3442, -371, -3799, -2960, -3881, -3726, -1644, -1384, -421, -12, -301, -1680, -1581, -3024, -3968, -4881, -4280, -5543, -8716, -4944, -5339, -3379, 167, -204, -3176, -1801, -1684, -4173, -5387, -1863, -2137, -494, -1251, -2044, -1037, -1831, -5574, -7810, -6814, -2937, -3245, -2018, 655, 2872, 4044, 2096, 1305, 1210, -2019, -2472, -3467, -6498, -5516, -4101, -4017, -2784, -3575, -3411, -1086, 226, 610, 2672, 4234, 1278, -1294, -4065, -2068, 1728, 1023, 202, -2244, -2761, -2443, -3621, -2214, -2393, -572, -3530, -5951, -1760, 448, -1718, 1578, 1618, -1119, 2332, 4043, -3017, -4496, -3191, -1184, -2766, -784, 2394, 3886, -223, -2669, -2383, 1040, 2175, -988, -6176, -4818, 1692, 4216, 2304, 3381, 3894, 1745, -1050, -356, -1129, -1120, -527, 749, 2760]
7036B760k842k796k194K475K647j371j789Q94p9m35o9k004J494j38P3j351L408
7019a317L502j848j922J756R47n50k161j891K860M320j453n003l532q4K565K321
7003a490R68k179l604J579J637k132j726J011K314l436K468M832n28Q52J140k373
6987f67J606J094j107n71J370j089L546J745O16p73j555m228k169j438L94R20
6971b306o64J256r56J521P00J83q56k68m081L62K812j333j790Q76K064N53k276
6954d203N14J536J181r03j139K445R15l007Q03K55k465j80L388J172n87r1J409
6937A043l981k479K24j321r43O73k209j590L162O271p74K581K00j207P30o40l382
6920c642K195J511J082j906k4k84l751o418j249O016L446L439J206l424L04K437
$$ y = [2760, -82, -2878, -5072, -2597, 50, -1321, -3110, -2216, -2295, -2730, -2799, -4803, -3309, -3447, -3374, -4725, -1317, 2185, 337, -1585, 171, 1118, 568, -1593, -3484, -624, 3696, 2243, -2760, -6292, -6376, -3811, -1490, -522, -2701, -6305, -4726, -3089, -5221, -6947, -5936, -3622, -7058, -4590, 242, -286, 566, 1706, -667, 939, 2033, 926, 355, 1725, 636, 4182, 5927, 6543, 5770, 4215, -13, -2182, -3620, -3226, -2306, -2970, -1714, -2670, -1149, -449, -266, -1122, -1390, -5471, -5109, -2297, -3630, -5420, -4544, -2480, -1927, -4203, -3689, -2153, -972, -1875, -3014, -569, 346, -2661, -1858, -1603, -4068, -4248, -860, 312, -275, -366, 1043, -2938, -5417, -5193, -6514, -7457, -6784, -8993, -10583, -7421, -1150, -1924, 657, 857, -350, 380, -260, -3642, -1447, 64, 1146, -760, -784, -1068, -4819, -11237, -12486, -6470, -3024, 415, 1621, -1803, -1499, 938]
6904I38j926m729L405J444J450n91L31j57j536J003j761k551k841N480L322K781
6888D062M90m022j169J188m50J265N206l868l553l109l357J239Q25o21R34L161
6872a779L187j469m52M06P84J547k410N76J893j344j653K178K423L12J209n169
6856B39k565J919Q35j58k146N12j660L818K505J203O08Q31j039m862p51J699j562
6839e74L630L14j931q02O43l703m264N61K718q19m381N068K988j126P52o26j954
6822c506m770q26L032J314J433L46l238J934O331K396k145l67m74j136J57j487
6806a006j483j236n315j785K546K332L33R58J845p79P57J198j068K446K811j804
6790G50J194j545J094J477k383j363k983k432k345k90K980K712J247M34k5R29
$$ y = [938, -988, -5717, -2312, -868, 582, -9, 322, 165, -1371, -368, -2129, -4680, -7521, -2041, 1281, 4062, 4552, 530, -639, 549, 99, 1364, 6570, 2702, -851, -3960, -7317, -6078, -5253, -5874, -4940, -1779, 1408, -61, -513, -107, 677, 2224, -186, 390, 2283, 939, -714, 1464, 3887, 4199, 5408, 239, -2326, -407, 428, 270, -1876, -1364, -3024, 794, 3299, 4502, 5110, 5941, 4902, 40, -711, 988, -574, 3056, 3370, 1439, 637, 1280, -2423, -6687, -6126, -3408, -4227, -8608, -3540, -552, -1678, -926, -1552, -3506, -8276, -9102, -6070, -4756, -3323, -2977, -6215, -4281, 2050, 4446, 2301, 1934, 1460, 324, 481, -1006, -2489, -3725, -9040, -10825, -8279, -5947, -5614, -4656, -2811, -3590, -2833, -1635, -2703, -257, 2554, 750, 1944, 399, 1493, 2970, 587, -776, -3759, -6191, -8536, -8826, -5846, -3134, -1887, -1453, -1478, -549]
6774e49j587P92J378l447j288K158k10m58M433J487p07j018J277j722n594j487
6758f542M55N45K392M197J787J454J290k213j356l26k549o73k765j035R37j747
6742f149M528J143L22k561n362j570K723J937K221j80j123K088J505J860L545
6727D927j293K322L320j692l768j916K879j346M90K116r9j606k277J130O3j248
6711B002k810J291K006j874r74K298m80j581J778M0J25J007M14L610K04m665l254
6694h63n11N0k11M33k555p87M104R33J149k122l707L3K696j405L766L639k502
6677B140r19j587j648J510K30k957O3k459K846O17K117K434j990k095l660J357
6661d001j220m305K575L268J075K152k451O0r32K875R15j60j574K624J866L052
$$ y = [-549, -2136, -1344, 34, -3413, -4701, -2543, -2753, -3211, 1222, 2709, 2002, 984, 2261, 539, -5055, -6542, -6087, -5542, -3150, 1047, 2834, 4288, 5578, 3365, 2009, 1683, -866, -1539, -4304, -5339, -4402, -6149, -1621, -478, -156, -2717, -8079, -9649, -6926, -4989, -2768, -2948, -4071, -1983, -478, 1382, 4927, 3634, 5956, 9276, 7584, 3816, 1900, 4779, 3433, 3923, 6039, 5940, 4334, 2057, 3187, 3250, 2002, -808, 483, 2489, 615, -359, 1939, 1459, -122, 1656, 1696, 1821, 2828, 3242, 6852, 7056, 2391, -863, -1374, -1324, -1535, -1102, -3657, -4444, -340, 593, 1742, -380, -4087, -4054, -1358, -2763, 1003, 4642, 2140, 1221, -366, -2014, -504, -274, -3231, -3168, -5627, -2781, -2164, -47, 2387, 397, -1698, -5358, -4001, -5221, -9526, -6951, -3683, -2608, -456, -2907, -2847, -3779, -904, 11, -149, -1723, 901, 2767, 5819]
6645E819K225k117Q79j130k404l227J923l283n03K333k223l712n31k9L333m23
6629c070J141Q95k350K91m367n79K439K154r5M063j492k144K899J646J679l907
6613g97j396q50J621L157K192k802m447j223L205L008l314j402L99k937kK06M597
6596g85J632j850k414j459o7j221K175N236j303j910p60J666k20Q15j190l14J909
6579f0L807k238n35j055l100k49K437L543J508j179J139m740l210K82j261k810
6563g721J231M540O97j414J746J995m93K304j744l388l896k14O82j053J552J173
6547d003L28P48J153J383p24J35K491j271j712l822k649N126J984L50J639M58
6531A614K051l81m18k455j360l505j090M647R04l575k410J568N456K604k596k966
$$ y = [5819, 8044, 5927, 6806, 5676, 3272, 45, 1968, -1315, -1818, 515, -1708, -5420, -5951, -5980, -2647, -3070, -1929, -1034, -3384, -3093, -7460, -8039, -5600, -3446, -3541, 522, -970, -3114, -215, 1431, 3110, -797, -2193, -3043, -1422, 1735, 3927, 1125, -3322, -4545, -1340, 1668, -1646, -3048, -2649, -5586, -5588, -5382, -785, 847, -1003, -3417, -4876, -4943, -6164, -3989, 1247, -56, -1966, -2726, -1060, -1280, -465, -1655, -1969, -60, 3747, 1509, 974, -81, -3181, -3430, -993, 2550, 4058, 2879, 4018, -722, -3932, -3650, -4911, -7721, -6490, -1950, -1253, -2667, -921, 1074, 581, 2885, 1141, -2247, -6143, -6357, -5675, -6728, -5176, -4003, -3675, -2927, -1774, -391, -1115, -980, 1511, 240, -1472, -5294, -7943, -2817, -833, -483, 1156, 1614, 3665, 3284, 2866, 411, -949, -4454, -5544, -897, 7, -3568, -5978, -4410, 1046, 3650, 1054, -1912]
6515a912J044j204l059j265r87J856K6J879K627j648J36p76K911L754J246j21
6499D507j91m92J734k066m033n10k559k600r89J283K648m5l029P70m93M273L29
6482a463n54J706M06J854n718J182K346j96l901N1M440l1o06l565J693L151k459
6465a664j996L123j986j252J645K028k924j126P32p31J787K175J46k249k115J096
6449c311k294Q60J654K689J513l383k22j087k265q73L303M43j512L071Q32l598
6433d180j502K502J275J231J618j61r15j624K142J101l094j39K966m99j068O44
6417B97p53j353J093q30j76O68J614K086m49K339R34K03j491j961m333J156K498
6400A542L13P19k00q94K96j459J591J688l660j205q30J64J963j395m71J223R97
$$ y = [-1912, -868, -2072, -5131, -6396, -7383, -5527, -5501, -3622, -995, -2643, -2507, -3283, -372, 3382, 4628, 4507, 4316, 3824, 5558, 3492, -541, -1051, -3610, -6210, -7199, -5916, -3268, -3313, -6342, -5572, -6065, -1792, -1463, -2017, -311, 95, 1949, -3769, -2587, -241, -437, -4338, -4287, 153, 122, -484, -4049, -2356, 795, -1664, -3660, -537, -2523, -3775, -2130, -102, -3026, -4152, -3420, -4151, -2364, -189, -43, -2292, -4407, -3311, -5605, -4745, -3091, -402, 1111, -2272, -2494, -3581, -5846, -6719, -3416, -2973, -4485, -1414, -582, -4180, -5682, -3180, -1905, -674, 944, 783, -132, -1756, 386, 1487, -1607, -1746, 1220, 721, -347, 297, -456, -1809, -716, -1546, -1722, -1054, 560, 2646, 2197, 4536, 5470, 5673, 4182, 2221, -2112, -956, 1542, 1855, 2574, 2374, 1480, 1776, 317, 1908, 3596, -64, -1269, -2099, -1935, 28, -1367, -1838, -615, 382]
6383C82K96J600n22j396o48o53M2q54m828n40M566N482q5k981l678K45J121L430
6365I79j394M315M133l482m050k214j912R4j02p9O624K754l104j037j429q27M31
6348c00J293J602J229j910l150l89J406J960j30m288j235J821j573O65J865J019
6332a15J694K858l265m011j108J282M78J924M659k767l000m72P74l441p77K857
6316b430M582m92N64l17l420o99L99o13k362K212L916m72L138m72j685K224L244
6299G317k405m263k813J234P71J406J26k25j98M379N30o04J750m263j908N973
6283F807m66l618l503j570k228j769L608K107K433j389O5Ll043k626L035K063
6267i1N30j388j7q57m648j127R16K300o52J167k48K438j226J073M556j8p56k303
$$ y = [382, 678, 2278, 1756, 360, -288, -941, -899, -1753, -6581, -7121, -2555, 2927, 2842, -139, -3817, -3572, -2451, 979, -415, 3900, 8033, 4551, 501, -1713, -3625, -3531, -3633, -3712, 2912, 5666, 2562, 1525, 96, -731, -300, 993, 2595, 3824, 1914, -1236, -1625, -219, 1741, 1611, -2677, -3912, -2091, -3664, -2999, -1134, -115, 1579, 4437, 1172, -2839, -3947, -2665, -2187, -263, 4396, 1629, -1371, -1843, -1069, -4510, -5287, -2430, 2152, 1660, 2224, 1907, -1513, -2212, -1813, -2426, -4788, -2576, 1340, 868, 4006, 3534, 1849, 4073, 7317, 4912, 649, -2164, -930, -159, 1247, 1373, 1148, 950, 5329, 5859, 5255, 7005, 2742, 834, 6807, 6341, 2723, -780, -2350, -4578, -6347, -2739, -632, 1801, 412, 477, 480, -2563, -5189, -2154, -91, 439, -949, -966, -1823, -6471, -7598, -6682, -4382, -5034, -3867, -4115, -1677, -2903, -1830, 2726, 2708, 1952, -351]
6249c51k797j299l03J61N17k603O81j444j695J529K644K640M468j22l97j47k537
6232a055l35l087j972L672L647j815l799K758N837l56k511k922k107J404r0l369
6216f100j629r36J163M442L965r95k206L76J485K262J616J941M85j643n22J315
6200E019j576l88l572j935K804J008N44n21j052J251J436J617K540k037k289k022
6184H27L45j363L97K303j997N48j926J002L413J070m456m227j917q24n16j125
6168h446K155M850P63L32j202j051j903K131j45j566r35M574R72n116k391L571
6152c407N753O33r43j575q6n4M34m17O91P09m720k930Q78j532K557L738P25j977
6134a523J386N024j178o01q01R11j897m05K094N90o44l294j121K351M12Q50k613
$$ y = [-351, -3148, -4447, -4750, -4589, -4072, -6675, -5994, -7438, -9133, -7604, -4960, -2320, 2148, 2026, 1629, 1482, -1055, -1390, -4477, -6449, -2777, 870, -945, -4744, -1986, 3851, 3495, 984, -1938, -4045, -2641, -2731, -6100, -7729, -8665, -7502, -3060, 905, -90, -2296, -1920, -435, 1827, 3443, 5384, 5869, 4226, 3704, 5019, 3443, 3055, -517, -2452, 352, 1360, 1904, 1383, 331, 1582, 3018, 4635, 7175, 5138, 2849, 827, 1172, -191, 206, 2509, 512, 1060, -866, 136, 3549, 4619, 163, -4064, -5981, -6805, -7321, -8446, -6291, -1441, -678, -346, -1548, -2599, -4502, -2371, -2516, -4082, -5017, -443, 529, -4587, -6978, -3407, 2346, 2979, 2036, 461, 375, 321, 755, 338, 1029, 1738, -2982, -5912, -5034, -6566, -4009, -271, 454, -1523, -137, 4887, 3709, 3108, 2307, 3218, 1321, 916, 3010, 3600, 2956, -338, -1459, 892, 1304, 2154, -459]
6117d59n536k96L704L583K522j28M66p33m726l855k723K640K83k447J5N467J655
6100e68j546j423k201M80m60J853L04K856J902J35j096p20j236M74P04j520r67
6083c029j93J981K371K886L391j869J54q29k976L22j628l633l460j82M886K713
6067I05p50l757l79N1M59k06J878j172P23K123n77o75j082J224K67j262l17Q07
6049a740k75Q21O35j665O76K885J581N43j615l637l751q20M85L142N333J544K499
6032F641j162m415N35M81k685l97O04k408R62L624K112k359j983k179n400l931
6016a1960J401N912J286Q89K43l742K766J497j057l74k611j523K477L710K873
6001A787J380r73J990r71l151j378m316k017L303J866n46N17J076L250J232j209
$$ y = [-459, -5995, -6291, -2587, 996, 3518, 3390, 3856, 3123, -1603, -5458, -8181, -5541, -5258, -7705, -7690, -2223, -568, -2114, -3537, -5738, -5258, -5718, -3865, -3561, -705, 1197, 1332, 236, -484, -1720, -1246, -542, -2062, -3029, -3222, -1241, 1130, 4016, 7407, 5538, 5692, 4863, 1887, 2209, 581, -3052, -6512, -6694, -1808, 905, 155, -3602, -3981, -3930, -3471, -3677, -1799, -2971, -2248, -125, -702, -1377, -2459, -1235, -968, -2230, -2547, -1740, -2015, -1194, -559, -2224, -1548, 1337, 2918, 3461, 1846, -1791, -5542, -6362, -5877, -2735, 2598, 4142, 6641, 5479, 1064, 1599, 2080, -605, -1002, -398, -2806, -1844, 1780, 3892, 1533, -450, -2629, -8029, -11960, -10559, -4647, -3361, -2472, -2229, -5971, -3205, -1708, -2765, -3139, -5750, -7273, -4796, -1086, 1787, 3167, 2194, 4184, 3213, 62, -1316, -5632, -7649, -4346, -2480, -3026, -2509, -1433, 1817, 3049, 1840]
5985A840Q58j466k216l2N3M79j193J528J251j578n97j446l904O22K647L082M039
5968C967N53j066r71l561j881k331J208Q43J757J83M45j990J222O54M30k105m996
5951g639n93L7L166L691K104j51J776Q78j458m583m168L97J193k067j081J017
5935g481K926j77j052K010J974J881k658j357j847k710J422K821J124M634K770
5920D280k687j354L199J033k500j950j170M00J451J488M24j809k319n36j467L216
5904c01J314j157M52o31Q25j92o61K62k073l958j461N63k0L185m98L992K255q39
5886A057j203j829k951j081n10J476M624J547q60j853k263n487j819M873J373
5871d906N149N984k09o90k636l24K3M7j031j119k210m002j45J365L587L565j229
$$ y = [1840, 2698, 1232, -984, -1016, -963, -484, -1677, -149, 1102, -476, -1073, -2519, -6423, -5801, -3154, -72, 3967, 4520, 3454, 2483, -1078, -2959, -5290, -4082, -3239, -1482, -1299, -854, -2844, -1622, -968, -538, -2643, -7639, -8232, -8195, -5029, -1338, 766, 615, 2391, 3269, 1811, -2772, -6940, -6543, -5350, -7417, -8498, -7481, -4555, -4732, -5784, -3774, -1800, 81, -2577, -3934, -5781, -8491, -7069, -4248, -3124, 1510, 4280, 1593, 239, 3438, 4471, 1971, 21, -1149, -749, 702, 2190, 2614, 805, -1514, -2050, -3517, -301, 1013, -144, 308, -323, 502, 310, -351, -89, -2162, -6120, -7581, -7018, -7038, -3853, -4351, -359, 1896, 1057, -146, -1975, -4926, -6007, -6517, -5041, -417, 1130, 270, -1583, -3846, -9333, -11152, -6279, -4906, 243, 6227, 6018, 5328, 2692, 2368, 2391, 2438, 1407, 288, -1922, -5924, -6069, -4704, -1117, 2448, 1219]
5854A219L228K00p79j84p05n674j992J024j557L514P85L56m67j838j04j61O16
5837b519J022K777k425n20K25J962k024J043J843L363J165j055j750k273j5J186
5821B005j841J386J022J80l238j852R86Q93o26L49J156K620J820j734l348Q74
5805F52J690j119j290j709P32R00m80K701J443m161l479J853J311l422k650n79
5789g607L619M871J261p33K69K210j758n57J380K700Q16k168Q35m1j839J35l711
5772c18k432J687Q11k142N98K018K299k35l18J461J826K32P90k221l587l009k358
5755d898R31M170M159k635m843j420Q75M036N381j959m484j629k828j880O22K21
5739f181O40J735K57K186l42l181K48K324r75N87j683j590o48n72J296L044q44
$$ y = [1219, 4447, 4647, 3868, 3684, 2979, -2695, -4687, -3663, -5220, -1706, -921, -565, -1032, -2870, -2974, -3135, -2519, -1497, 1280, -1145, -1665, -1440, 522, -1502, -459, 1384, 4747, 5912, 4857, 3107, 834, 819, 2005, 164, 1550, 2572, 2752, -486, -2338, -1352, -459, -1085, -736, 420, 3040, 4860, 3126, -222, 652, 2342, 1223, -67, -1776, -1044, -144, -624, 2077, 3520, -641, -4120, -2267, -956, -4378, -7028, -7607, -3988, 883, 2144, 1411, 1680, 3890, 2132, 1575, 2955, 5655, 6471, 4303, 5138, 5097, 3258, 3393, -318, -2750, -1063, -252, -2394, -1796, 222, 2521, 2286, 1968, 3429, 5255, 5487, 6277, 4056, 469, -2540, -4898, -3967, 203, 4362, 1727, -3116, -4536, -3661, 375, 5756, 3797, -687, -2316, -5144, -7024, -6402, -6181, -5541, -3806, -3549, -1363, -1705, -4886, -4638, -2314, -3289, -2702, -4385, -5975, -6623, -7195, -5899, -2855, -3699]
5722c699j32k69J369K02J632P17J80J31q07n16L07j010L541J018l482k346j475
5705d639K066J767J46J49J221M448q34m235j412J593L59N41k648k400j960k46
5689f084J502m46q86j63P4J064K570K909Q92j381j873m532L404J104q98k21M473
5672A508K374l9j638p57k704k968q1M393q4l102L042J635l889l304J208K925j130
5655b611j889O5R23Q91R70R04j53r16K86J550r52j64k206o30M153J025j57l338
5637b249q06K761n60j024l57j727j089K727K093k59j740N32J14J596L564l37m361
5620a122l636k141J435L958K079P16k617j578j88J308M584k564J077J329p6p83
5604A781J811J823m43k612P74k718m789l52L014N369K38k346m216K693J823k832
$$ y = [-3699, -3831, -4100, -2731, -2529, -897, -180, 0, 131, -676, -1192, -885, -1895, 1646, 2664, -818, -3164, -4639, -2573, -806, -660, -511, 710, 5158, 4324, 89, -1323, 270, 629, 1170, -1478, -3878, -5838, -6084, -4582, -5028, -5914, -6077, -6003, -4939, -2369, 540, 1432, 51, -1822, -6354, -2950, -1846, -2744, -2965, 1508, 3882, 3843, 2205, 1448, -1256, -4224, -4305, 88, 4, -3098, -56, 1579, -2310, -5614, -4406, -1481, -2611, -4500, -4435, -3512, -2621, -1651, -747, -900, -1816, -1530, 20, -932, -1096, -3302, -3932, 221, 1246, 1089, -2249, -3055, -294, -854, -1878, -2235, -3962, -5051, -2324, -231, -490, -2230, -1698, -1584, 12, 3576, 3239, -1122, -4758, -6899, -5464, -1506, 573, 1289, -1328, -2906, -3094, -1786, 2798, 234, 1311, 2640, 2564, 1781, 3592, 5415, 4972, 2360, 3134, 416, -4373, -4725, -1711, 3658, 3896, 1550, -2666, 27, 1850, -982]
5588i82K196L252k723k274k022Q58J004j127j651k67J791q54j992Q96p10J344
5572c261q17Q15L49K107J593M39j313O98J461n72l588j533r71K011L704L855J84
5555E161k851k55P60j071l046k455r44L489J983l668k294K826K556K884j960j980
5539h65J238L52J040J188K96k289p9p01O39l39L63J619n57j012J499Kq79k286
5521g71j234M24L922l78n10j182M61L548j44o71N086k406j390L82j535j479o55
5504A468P93r89J844j540l338j029J68n72M452L053j565K31k093k814L9k3m64
5487b379k599m94n41j96K532K810K68Q71n25M545q96Q18K096p44l85j086l57l604
5469A34k715K11L811O260j467j776M26j350n043P29M395j447m467k207j769j172
$$ y = [-982, 1214, 4466, 1743, -531, -2553, -1695, -691, -1818, -3469, -3736, -1945, -2799, -4791, -3895, -4605, -3261, -4078, -3263, -2914, -807, 786, 1225, -88, 610, 2071, 1499, -2089, -3622, -4593, -2582, 1122, 4977, 5161, 2310, 2055, 2815, 1744, -1302, -3757, -4701, -1212, 771, -2897, -5191, -2365, 191, 3075, 1115, -865, 373, 725, 1765, 2953, 3249, 960, 881, 180, 819, 480, 843, 2462, 1905, 893, 2392, 2394, 1515, -771, -2005, -1581, 2341, 1963, 1453, 271, 732, 4280, 4136, 3465, 8551, 6145, 4755, 5137, 3602, 2123, 1468, 2261, 1272, 3116, 1576, -1762, -2791, -2623, -3195, 1257, 4310, 2745, 2976, 883, -1931, -1892, -1915, -2379, -4978, -5472, -6013, -6209, -3677, -867, -599, 272, -253, 4292, 3396, 4214, 6310, 5566, 5181, 4095, 3738, 134, -2581, -2370, 1441, 7701, 6234, 4458, 4884, 3534, -1509, -780, 3615, 2168, -2299, -4506, -6275, -7447]
5453g447j819K983J776J549L075p01Q63q5J489m272l178L49J589M750K012K56
5437C189l054l444k194K571L768n57P01m060n01L11K09J925J518J772o46j096
5421D12j28K59k98j852k050N11K257L302j191k517j489j477J588K590J600R59
5405B476j452j387Q79L311j469k978k934r89L362l4j27P7l516K25O29l177l275
5388a0379N38K478K689L458J499K544k514j429L10n20L843m4l859L075J614J067
5372D370l712p0k927j36J931Q2k41Q09o06j815j4K446J569L92J54k915k420k080
5354e183j194K760J033k818o5k219l529m67J962J996K628K014J590J692J481j293
5338C88k793l247K317M358K942k32k674N01J218p20q47n70l23l936j135L858j87
$$ y = [-7447, -9266, -6283, -4507, -2958, 117, -584, 279, 194, 1683, -2589, -5767, -5418, -3829, 921, 2933, 3189, 135, -3309, -5503, -2932, 836, 279, 980, -3080, -3581, -3270, -3061, -1136, 382, 2154, 1508, 412, 284, 543, 245, -1607, -3657, -3146, -889, 2413, 1222, -1295, -2784, -4261, -2673, -83, 1517, 2476, 1024, -363, 516, 3827, 2358, -620, -3554, -4543, -1181, -1215, -1342, -1265, -4781, -4556, -3927, -7104, -10379, -9841, -7363, -4674, -1216, 283, 2827, 313, -1116, -806, -1326, 2517, 2473, -1386, 1689, 3303, 4370, 658, 588, -2339, -2475, -544, -462, -703, 106, -500, -2315, -2329, 117, 1686, 2078, 2232, -683, -3103, -5183, -6377, -3617, -2584, -5402, -5467, -7686, -11215, -11682, -9720, -7724, -5096, -3082, -1492, 200, 1681, 388, -2405, -5652, -3335, 1023, 3965, 3733, 1059, 1560, 2778, 2058, 1211, 641, 318, -3618, -4753, -895, -1082]
5321a082n069p9J750J456q91M48K593L562M5k368k151m13L84J166O16l688n052
5304h773K66J382L563M19p56K006k66L152J358k023j256j704m168N27l78M31M127
5287b093K645p43j040N117J437j323K9J168J027J153K696l557p261j533p77N42
5271b513K811J251L79L413J253L39n352m630k78m42J29j336j561n94R60M015K786
5254F30r83J010N09l924K510O537K974j617m922o629j948O9j165J938M375J006
5238C70q54j941L71l1K078j827l478J462J13k510J324L654Q10k886k352O23K351
5221b723J348K85j867n1J106K509P10P92L534l520m571j742J928P93M71J388J343
5204A733j608m746j746K025L557m76K78k096J277K91p69j328j31O2M321k451j576
$$ y = [-1082, -6151, -6230, -4480, -3024, -3915, -3467, -874, 2688, 2733, 365, -1786, -2199, -1815, -649, -33, -3721, -8773, -8507, -7125, -3562, -3143, -3899, -1893, -2159, 993, 2351, 328, -928, -2632, -6800, -6273, -6651, -6220, -2093, 552, -191, -1231, 3886, 5323, 4000, 4029, 5197, 6224, 7377, 10073, 6516, -745, -2278, -3055, -2513, 298, 1549, 1928, 5341, 6594, 6933, 1581, -3049, -3327, -3769, -3640, -4976, -6537, -7131, -6171, -2156, 630, -353, 657, 1166, -2758, -248, 6289, 9263, 7646, 2724, -3905, -5853, -5784, -6949, -5011, -636, 370, -484, -2425, -2054, -2085, -7, -1834, -5312, -3850, -3737, -6247, -4923, -1269, -459, -3345, -5697, -5074, -2723, -1375, -1090, -2957, -3008, -1902, 607, 1317, 2109, 5643, 2123, -2448, -4190, -2262, -1469, -998, 390, 1733, 125, -4621, -6367, -4342, -785, -1261, -983, -3079, -1802, -1511, -2280, -3608, -3739, -3677, 644, -1807, -3383]
5187c383k390K869J960K295N70o90R45K643O39k678m785k998J700r99L48n90J145
5170c399M441L227p44k188m25M357J57j489P58j790j424J541n78j693k714n12
5154b475J635m4m29L09j087j343J811n63Q08L432j706K2M844K261j828j625m536
5137e14l202K914M666p2M27q3j590K63K41p66q19K483P82j655O03k892k092J479
5119A73J493K22j668J435K977J55j353p70N84J168j714r82j687k055J317K041
5103A336J312j452m53p89j211J82P28k671j001L460K179K448o172j270N505K349
5087D480k486K85n68l083J770p65J338J905k631J71J138l49j843J202m417m2j688
5070e583q85L972J351L353Q48j973r77k12m065r03J828J230N07j900j636l37L339
$$ y = [-3383, -5773, -2904, -944, 1351, 1921, 1231, 2176, 4819, 5458, 2780, -2005, -5003, -3303, -4302, -3954, -4544, -3399, 1042, 4269, 3525, 1337, 912, 5269, 5426, 3937, 4695, 2905, 1481, 3022, 2444, 751, -1963, -2475, -840, -884, -1313, -1004, -2091, -3434, -1623, -2186, -1378, 2054, 348, 370, 5214, 7475, 5647, 4022, -514, -3716, -802, 3864, 3792, 4219, 4136, 2546, 2809, 3050, 2284, 1465, 3948, 4730, 3075, 3678, 786, -1306, 173, 1666, 1888, 220, 1655, 4632, 4787, 3434, 2664, 3248, 4416, 2702, 1720, 33, -2022, -705, 1336, 2648, 1196, 743, -46, -1257, -1075, -347, -3018, -4019, -559, 1620, 4068, -2104, -3374, 2131, 4480, 1994, 2279, 1711, -1372, 398, -367, 971, 2876, 245, 416, 1554, 1205, -638, 564, -3853, -3895, -5583, -6468, -2496, -1145, 2208, 3056, 1083, 106, -106, -4171, -5074, -3246, -2016, -1509, -3409, -5045, -5382, -2043]
5053b043J239K371j050j997m437J169L135l127j98p1l09J864J120L89p17j588
5037d250J595J001l66l78j908l33J517L076L608Q69k861l037l39J816K930j078
5021A862J531q76m118r42P96j210J841J484M419k91k729J81j398P8J162K754K736
5004G280J711k305p20m258l768J901R28J308j437L563j171J351J232J31K37k421
4988C562k778k484j482r66J195J081K688j765k33P63J41k381o95K624K393j793
4972a30J88O67j506j637j5j472m411R20O33K068N225J219J284m99p86J79R01r56
4954A872j525j004q99l16N337J28r85p13m01N2p55l387L26K778Q2j907K599O30
4936A912j658m61J455k270k761J367K701k58p05J827K398J810p39k923j367k680
$$ y = [-2043, -804, 1567, 517, -1480, -5917, -4748, -1613, -4740, -4938, -5009, -5318, -3454, -2334, -1945, -2662, -4250, -2655, -1654, -2020, -2398, -4306, -4639, -3122, -46, 3562, 4431, 1570, -1467, -1806, 10, 2940, 1862, 3393, 2517, -1601, -2543, -1747, -2957, -1116, 368, 4787, 4496, 1767, 1948, 550, 628, 1790, 4544, 7280, 8991, 6686, 5966, 1708, -2060, -159, 769, 2077, 640, 4203, 3032, 4383, 5615, 5746, 5983, 3562, 784, -1700, -3182, -4148, -2953, -1872, 816, -949, -1182, -419, -278, -2659, -3354, -730, 1663, -130, 58, 725, -781, -2418, -2433, -3905, -8316, -7396, -6763, -4695, 530, 1749, 3033, 2534, 1748, 1927, 2828, 1872, 347, -657, -1556, -1872, 3465, 3593, 2608, 1895, 1494, 1546, 791, -2596, -2270, 508, 590, -1317, 1282, 1912, 254, -207, 1248, -1022, -3783, -2416, 285, 27, -678, 1149, 3547, 5357, 4618, 1695, 328, -2352]
4920b352p72K945l26J748J225K68m267j289K820M079O76j221J128k595k044k6
4904cn5j983l790J157L226p96k76L439O52m163j334k371j098l351l021J803Q271
4887c693N369O16O48L345j302m997n42K652J259J561L07k206k120J114k498l636
4871d123J760J509J435L09Q58J227l15o77k998k556K532K177R9m076j212M227
4855A76M12j44J554O96j070k590k355Q72n98k544l02J61J689M524k84j338J0k08
4837a339K017J704r31k757j765m01j131n54N765L653k789m317j566N73J380P31
4821a727L097M16l143j961j666M31J442K741N18p20O86K731l7J651k027k957j172
4804a697J222J23l75O89j662K83j032j437j075J647J20j086l626k534J808M689
$$ y = [-2352, -3124, -179, -505, 1243, 2468, 2736, -1531, -2820, 0, 4079, 4755, 3534, 4662, 2067, 23, -3, -58, -2041, -5831, -4674, -1448, -2244, -2520, 919, 1571, -2592, -3926, -6297, -7395, -10746, -13767, -11964, -3693, 1676, 2292, 2940, 6285, 4983, -14, -556, 2096, 3355, 4916, 5223, 3017, 897, 2011, -487, -4123, -2363, -854, 581, 890, 1748, 2975, 2660, 1983, -1015, -3571, -1039, 1138, 1237, -2839, -4051, 176, 588, 444, 1998, 2694, 1624, -966, -3321, -2449, -3047, -5591, -5893, -5732, -4043, 481, 197, -1141, -1131, -1339, 678, 2382, 1451, -1306, -3071, -3472, -4603, -5157, 608, 4261, 1472, -2845, -4411, -3838, -2458, -1727, 1370, 1786, -1357, -3318, -4984, -4553, -3111, -370, 148, -572, 114, 2845, 2808, 4459, 2432, -525, -1697, -475, -352, -727, -38, -1700, -1417, -2449, -3886, -4961, -3314, -3194, -4280, -7906, -10440, -8632, -3943]
4788c943J898L335K486R31P88j358j258N34k26m619J341J124k235j496j104L327
4772d75L090L586J0j699r48N354J570m041l066R05n52n133j282J98k393j76N82
4755d470Q50o05N57R8j999J309L90O93l62k897n126R91K997M111K422k8Q93M09
$$ y = [-3943, -2045, 1290, 3776, 4707, 5495, 4137, 2879, 3413, 3187, -1432, -91, 1033, -1202, -2698, -3802, -475, 2615, 6201, 6211, 4512, 3564, 8918, 10488, 6447, 3381, 4286, 3734, -1399, -2681, -2483, -4876, -5052, -4470, -3620, -4225, -3668, -3570, -5569, -4260, -3870, -3177, -3539, -6436, -11562, -10571, -7574, -3463, -1041, -1069, -176, 233]
$$ [...]
##END NTUPLES=NMR SPECTRUM
##END=
