##TITLE=Analysis number 327433
Compound Code sb 00672
Book Reference 148356
Project Code adrs flr03
Chemist Name jom
##JCAMPDX= 6.0         $$ Bruker NMR JCAMP-DX V2.0
##DATA TYPE= NMR SPECTRUM
##DATA CLASS= NTUPLES
##ORIGIN= Bruker BioSpin GmbH
##OWNER= nmr
$$ XWIN-NMR		Version 3.5
$$ Fri Mar 23 12:15:05 2007 GMT Standard Time (UT+0h)  MAYBRIDGE\nmr@NMR_250MHZ
##.OBSERVE FREQUENCY= 250.131544655141
##.OBSERVE NUCLEUS= ^1H
##.ACQUISITION MODE= SIMULTANEOUS (DQD)
##.ACQUISITION SCHEME= undefined
##.AVERAGES= 16
##.DIGITISER RES= 18
##SPECTROMETER/DATA SYSTEM= dpx250
##.PULSE SEQUENCE= zg30
##.SOLVENT NAME= DMSO
##.SHIFT REFERENCE= (INTERNAL, DMSO, 0, 16.522)
##AUDIT TRAIL= $$ (NUMBER, WHEN, WHO, WHERE, WHAT)
$$ ##TITLE= Audit trail, XWIN-NMR		Version 3.5
$$ ##JCAMPDX= 5.01
$$ ##ORIGIN= Bruker BioSpin GmbH
$$ ##OWNER= nmr
$$ C:\u/data/dgb/nmr/ADRS/1790/pdata/1/auditp.txt
$$ ##AUDIT TRAIL=  $$ (NUMBER, WHEN, WHO, WHERE, WHAT)
(   1,<2007-03-23 12:14:32.61 +000>,<MAYBRIDGE\nmr>,<NMR_250MHZ>,
      <created by zg, POWCHK disabled, PULCHK disabled
       configuration hash MD5:
       49 4B E0 1D 92 C2 6B 37 9F E6 65 BC 52 41 86 1D
       data hash MD5: 64K
       05 77 46 DB 53 AF D4 9D 01 7A 98 42 AB 1F B5 5B>)
(   2,<2007-03-23 12:14:52.91 +000>,<MAYBRIDGE\nmr>,<NMR_250MHZ>,
      <Start of raw data processing
       ef LB = 0.3 FT_mod = 6 PKNL = 1 SI = 32K 
       data hash MD5: 32K
       29 44 0E 8E 86 A0 C5 1E 0F 58 0F BE 1C 21 F0 BE>)
(   3,<2007-03-23 12:14:54.69 +000>,<MAYBRIDGE\nmr>,<NMR_250MHZ>,
      <apk 
       data hash MD5: 32K
       DD B8 AF 99 45 BF 61 11 5A B6 56 F7 0A 92 79 D8>)
(   4,<2007-03-23 12:14:55.57 +000>,<MAYBRIDGE\nmr>,<NMR_250MHZ>,
      <abs ABSG = 5 
       data hash MD5: 32K
       CD AF 4A D7 50 0F 22 93 1F F9 12 BF D9 1A A1 20>)
$$ ##END=
$$ 
$$ hash MD5
$$ F2 B2 72 57 62 40 3C 47 55 D0 B3 64 44 48 78 C2
##$RELAX= 
##$RELAX= 
##$RELAX= 
##$RELAX= 
##$RELAX= 
##$RELAX= 
##$RELAX= 
$$ Bruker specific parameters
$$ --------------------------
##$DU= <C:\u>
##$EXPNO= 1790
##$NAME= <ADRS>
##$PROCNO= 1
##$TYPE= <nmr>
##$USER= <dgb>
##$AMP= (0..31)
100 100 100 100 100 100 100 100 100 100 100 100 100 100 100 100 100 100 
100 100 100 100 100 100 100 100 100 100 100 100 100 100 
##$AQSEQ= 0
##$AQ_mod= 3
##$AUNM= <au_zg>
##$AUTOPOS= <31 >
##$BF1= 250.13
##$BF2= 250.13
##$BF3= 250.13
##$BF4= 250.13
##$BF5= 500.13
##$BF6= 500.13
##$BF7= 500.13
##$BF8= 500.13
##$BYTORDA= 1
##$CFDGTYP= 0
##$CFRGTYP= 5
##$CHEMSTR= <none>
##$CNST= (0..31)
1 1 145 1 1 1 1 1 1 1 1 1 1 1 1 1 1 1 1 1 1 1 1 1 1 1 1 1 1 1 1 1 
##$CPDPRG= <>
##$CPDPRG1= <>
##$CPDPRG2= <>
##$CPDPRG3= <>
##$CPDPRG4= <mlev>
##$CPDPRG5= <mlev>
##$CPDPRG6= <mlev>
##$CPDPRG7= <mlev>
##$CPDPRG8= <mlev>
##$CPDPRGB= <>
##$CPDPRGT= <>
##$D= (0..31)
0 1 0 0 0 0 0 0 0 0.06 0 0 0 0 0 0 0.0002 0 0 0 0 0 0 0 0 0 0 0 0 0 0 
0 
##$DATE= 1174652071
##$DBL= (0..7)
120 120 120 120 120 120 120 120 
##$DBP= (0..7)
150 150 150 150 150 150 150 150 
##$DBP07= 0
##$DBPNAM0= <>
##$DBPNAM1= <>
$$ [...]
##$SUBNAM7= <"">
##$SUBNAM8= <"">
##$SUBNAM9= <"">
##$SW= 20.6930455092707
##$SWIBOX= (0..15)
0 0 3 0 0 0 0 0 0 0 0 0 0 0 0 0 
##$SW_h= 5175.983436853
##$TD= 65536
##$TD0= 1
##$TE= 683.16
##$TE2= 300
##$TE3= 300
##$TEG= 300
##$TL= (0..7)
0 120 120 120 120 120 120 120 
##$TP= (0..7)
150 150 150 150 150 150 150 150 
##$TP07= 0
##$TPNAME0= <>
##$TPNAME1= <>
##$TPNAME2= <>
##$TPNAME3= <>
##$TPNAME4= <>
##$TPNAME5= <>
##$TPNAME6= <>
##$TPNAME7= <>
##$TPOAL= (0..7)
0.5 0.5 0.5 0.5 0.5 0.5 0.5 0.5 
##$TPOFFS= (0..7)
0 0 0 0 0 0 0 0 
##$TUNHIN= 0
##$TUNHOUT= 0
##$TUNXOUT= 0
##$USERA1= <user>
##$USERA2= <user>
##$USERA3= <user>
##$USERA4= <user>
##$USERA5= <user>
##$V9= 5
##$VALIST= <valist>
##$VCLIST= <CCCCCCCCCCCCCCC>
##$VD= 0
##$VDLIST= <DDDDDDDDDDDDDDD>
##$VPLIST= <PPPPPPPPPPPPPPP>
##$VTLIST= <TTTTTTTTTTTTTTT>
##$WBST= 1024
##$WBSW= 4
##$XGAIN= (0..3)
0 0 0 0 
##$XL= 0
##$YL= 0
##$YMAX_a= 349342
##$YMIN_a= -305781
##$ZGOPTNS= <>
##$ZL1= 120
##$ZL2= 120
##$ZL3= 120
##$ZL4= 120
##$ABSF1= 16.522
##$ABSF2= -4.171173
##$ABSG= 5
##$ABSL= 3
##$ALPHA= 0
##$AQORDER= 0
##$ASSFAC= 0
##$ASSFACI= 0
##$ASSFACX= 0
##$ASSWID= 0
##$AUNMP= <proc_1d>
##$AZFE= 0.1
##$AZFW= 0.1
##$BCFW= 0
##$BC_mod= 0
##$BYTORDP= 0
##$COROFFS= 0
##$CY= 12.5
##$DATMOD= 1
##$DC= 0
##$DFILT= <>
##$DTYPP= 0
##$F1P= 14.0000005364418
##$F2P= -0.99999901652339
##$FCOR= 0.5
##$FTSIZE= 32768
##$FT_mod= 6
##$GAMMA= 0
##$GB= 0
##$INTBC= 1
##$INTSCL= 1
##$ISEN= 128
##$LB= 0.3
##$LEV0= 0
##$LPBIN= 0
##$MAXI= 10000
##$MC2= 0
##$MEAN= 0
##$ME_mod= 0
##$MI= 0
##$NCOEF= 0
##$NC_proc= -5
##$NLEV= 6
##$NOISF1= 0
##$NOISF2= 0
##$NSP= 0
##$NTH_PI= 0
##$NZP= 0
##$OFFSET= 16.522
##$PC= 1
##$PHC0= 217.7327
##$PHC1= 9.735059
##$PH_mod= 1
##$PKNL= yes
##$PPARMOD= 0
##$PSCAL= 4
##$PSIGN= 0
##$REVERSE= no
##$SF= 250.13
##$SI= 32768
##$SIGF1= 0
##$SIGF2= 0
##$SINO= 400
##$SIOLD= 32768
##$SREGLST= <1H.DMSO>
##$SSB= 0
##$STSI= 32768
##$STSR= 0
##$SW_p= 5175.98343685301
##$SYMM= 0
##$S_DEV= 0
##$TDeff= 65536
##$TDoff= 0
##$TI= <Analysis number 999999
Compound Code 99
Book Reference 9
Project Code 9>
##$TILT= no
##$TM1= 0
##$TM2= 0
##$TOPLEV= 0
##$USERP1= <user>
##$USERP2= <user>
##$USERP3= <user>
##$USERP4= <user>
##$USERP5= <user>
##$WDW= 1
##$XDIM= 32768
##$YMAX_p= 388723285
##$YMIN_p= -826891
$$ End of Bruker specific parameters
$$ ---------------------------------
##NTUPLES= NMR SPECTRUM
##VAR_NAME=  FREQUENCY,     SPECTRUM/REAL,   SPECTRUM/IMAG
##SYMBOL=    X,             R,               I
##VAR_TYPE=  INDEPENDENT,   DEPENDENT,       DEPENDENT
##VAR_FORM=  AFFN,          ASDF,            ASDF
##VAR_DIM=   32768,         32768,           32768
##UNITS=     HZ,            ARBITRARY UNITS, ARBITRARY UNITS
##FACTOR=    0.157963299565203, 1,           1
##FIRST=     4132.6476996994, 0,             0
##LAST=      -1043.33573715361, 0,           0
##MIN=       -1043.33573715361, -826891,     0
##MAX=       4132.6476996994, 388723285,     0
$$ Real data points
##PAGE= N=1
##DATA TABLE= (X++(R..R)), XYDATA
$$ [...]
24489c6739j836k1325N8859K4422L7948m8183q416P2034N3414M2205m2664J5620
$$ -36739 -38575 -59900 -1041 23381 61329 13146 4730 76764 130178 172383 129719 145339
24477A45339j16908n8339L7283J307o3238q1033j07114M055n328j6063L3960R5887
$$ 145339 28431 -29908 7375 8682 -54556 -135589 -242703 -238648 -243976 -260039 -226079 -130192
24465a30192N7765R2967J2434L4094r2158o7541o9532P5278L2131j8241O3276
$$ -130192 -72427 20540 32974 67068 -25090 -92631 -162163 -86885 -54754 -72995 -9719
24454i719R8390k4347r6739j13458L0509m3481j22202M6072Q2494j5777J60971
$$ -9719 88671 64324 -32415 -145873 -115364 -158845 -281047 -234975 -152481 -168258 -7287
24443g287J21296o2243n7958Q864n8962n4911p0332N4509P2026K0148K8328m6598
$$ -7287 114009 51766 -6192 2672 -56290 -111201 -181533 -127024 -54998 -34850 -6522 -53120
24431e3120q9322Q913N1875j2426K4616L5443o6831K1628N5640P4845N1266j72902
$$ -53120 -142442 -133529 -81654 -94080 -69464 -34021 -100852 -79224 -23584 51261 102527 -70375
24419g0375q0461o0481L1496R5191J3921R2745L613m7630j1601o1947j6593P5535
$$ -70375 -150836 -211317 -179821 -84630 -70709 22036 25649 -21981 -33582 -95529 -112122 -36587
24407c6587O1934r5128n3367l1308k2130Q524Q3741K523M9409o0694K5749N3631
$$ -36587 25347 -69781 -123148 -154456 -176586 -168062 -84321 -81798 -32389 -93083 -67334 -13703
24395a3703k3327M0911J34452o8480p7468K3912M6951n85m1241l4760p0639L4215
$$ -13703 -37030 3881 138333 69853 -7615 16297 63248 62663 21422 -13338 -83977 -49762
24383d9762J18313o2177M5127m122j4994j13041j15497n8354l8610P6910L5048
$$ -49762 68551 6374 51501 47379 32385 -80656 -196153 -254507 -293117 -216207 -181159
24372a81159N4044l0516L3771J21247J0265K4772N4167J9639J0429k5191j1477
$$ -181159 -127115 -157631 -123860 -2613 7652 32424 86591 106230 116659 91468 79991
24361G9991o1983j26697o4704J20404Q0291L5259J60295N0960j66871l7948M2067
$$ 79991 18008 -108689 -173393 -52989 27302 62561 222856 273816 106945 68997 111064
24350A11064j0498J4467K8045P6002N240J7971k1810r9232o6840P104n7898j0983
$$ 111064 100566 115033 143078 219080 224320 242291 220481 121249 54409 61513 3615 -7368
24338g368j7617O995j16240k3237N4472R1688K5259M4116Q2722j02058l3547k8269
$$ -7368 -24985 -17990 -134230 -157467 -102995 -11307 13952 58068 140790 38732 5185 -23084
24326b3084P0909k3918j18183j4334P0917J6000P2246L2558j13562j04211L88
$$ -23084 47825 23907 -94276 -108610 -37693 -21693 50553 83111 -30451 -134662 -134274
24315a34274J36985K4131q1234j780O7983j03019n7340k0657R2101M6828l7673
$$ -134274 2711 26842 -54392 -56172 11811 -91208 -148548 -169205 -77104 -30276 -67949
24304f7949J8153q2830q1574J02215n9686k4470j15229N258P0953Q446P7152N1658
$$ -67949 -49796 -132626 -214200 -111985 -171671 -196141 -311370 -306112 -235159 -226713 -149561 -97903
24292i7903m6761k5338l6219L5762K23920J04117p2329n4762k8131L6286l8206
$$ -97903 -144664 -170002 -206221 -170459 53461 157578 85249 30487 2356 38642 436
24281D36j0271o5759j6943K5328L0795Q382j06673L4857p3768j24988N4231K1968
$$ 436 -9835 -75594 -92537 -67209 -36414 -28032 -134705 -99848 -173616 -298604 -244373 -222405
24269b22405L2850N0686k5543o2197j00073k0356N8864M2603J77073J22275q7187
$$ -222405 -189555 -138869 -164412 -226609 -326682 -347038 -288174 -245571 -68498 53777 -33410
24258c3410k08724j07588Q9583O1612M4397M4316Q5977N5849N6108o9794j05256
$$ -33410 -242134 -349722 -260139 -198527 -154130 -109814 -23837 32012 88120 18326 -86930
24247h6930J08596J07942p7032m8514Q840K0153j19692l1019n4077L5095p778
$$ -86930 21666 129608 52576 4062 12902 33055 -86637 -117656 -171733 -136638 -144416
24236a44416q3961Q2669k9622l1492N2629J27143Q0316j30N0547Q52j8033p0206
$$ -144416 -228377 -145708 -175330 -206822 -154193 -27050 53266 53136 103683 104535 86502 16296
24224A6296K5356j7221l0122j3138N1233K984J4161n5559j44708n5504M8008P1513
$$ 16296 41652 24431 -5691 -18829 32404 35388 49549 -6010 -150718 -206222 -158214 -86701
24212h6701n1016L7258Q0807r9809n8552J6980J10499L8634n7346n8414P3403
$$ -86701 -137717 -100459 -19652 -119461 -178013 -161033 -50534 -11900 -69246 -127660 -54257
24201e4257n6145N356Q279l0668O6422J0787O1906J78320n6051k0133j00329n6474
$$ -54257 -110402 -105046 -96767 -127435 -61013 -50226 11680 190000 133949 113816 13487 -42987
24189d2987J01227Q4432j41902J3058J6903Q6953Q7222j19805q8732N5436n7312
$$ -42987 58240 142672 770 13828 30731 117684 204906 85101 -3631 51805 -5507
24178e507p7147K3041p2787L8727K9621M8400m9520o51p2436M7037o3715j9865
$$ -5507 -82654 -59613 -132400 -93673 -64052 -15652 -65172 -65823 -138259 -91222 -154937 -174802
24166a74802P3127o2587J03007J85474n4314m5734l3550R234Q7566j08133m5655
$$ -174802 -101675 -164262 -61255 124219 69905 24171 -9379 -145 87421 -20712 -66367
24155f6367j14405j4091R2231N1317j6224N7258J07351J6656m5631l1678o3909
$$ -66367 -180772 -194863 -102632 -51315 -67539 -10281 97070 113726 68095 36417 -27492
24144b7492r879r0837K2344L532K5741J34663l1112n5768n2842K4942m2562q3181
$$ -27492 -37371 -128208 -105864 -102332 -76591 58072 26960 -28808 -81650 -56708 -99270 -182451
24132a82451j3535R369p0877J9405j2110j2156M6850J983j4709L7360J7859k1621
$$ -182451 -195986 -186617 -257494 -238089 -250199 -262355 -215505 -213522 -228231 -190871 -173012 -194633
24120a94633J5035K33q088P7767j00342R590Q5090p48j05104n4142K5222M1503
$$ -194633 -179598 -179365 -187453 -109686 -210028 -200438 -115348 -116096 -221200 -275342 -250120 -208617
24108b08617J00685P3534j46511p0102O5011J9644O3617L5369k92M8255P9065
$$ -208617 -107932 -34398 -180909 -251011 -186000 -166356 -102739 -67370 -67662 -19407 59658
24097E9658l3825j24121j8894Q1426J3756K1614J13988p7295j11882N3055o1123
$$ 59658 25833 -98288 -117182 -35756 -22000 -386 113602 36307 -75575 -22520 -83643
24086h3643q3984m5927J25330J42783j1871q714M9477o840j11824J134k2453M8507
$$ -83643 -167627 -213554 -88224 54559 42688 33974 83451 76611 -35213 -34079 -56532 -8025
24074h025J8928j45811j5238J89809J59082M5988j43738j79054k7912j1902O1302
$$ -8025 10903 -134908 -150146 39663 198745 244733 100995 -78059 -105971 -117873 -56571
24063e6571L706j1516j09996J7630J1572Q9185P6754M4440O2614K5643j02357
$$ -56571 -52865 -64381 -174377 -156747 -145175 -55990 20764 65204 127818 153461 51104
24052E1104r7062q712r5064m4169l1813J00056N5553l6131O842O0423K3427L4345
$$ 51104 -45958 -54670 -149734 -193903 -225716 -125660 -70107 -106238 -99396 -38973 -15546 18799
24040A8799Q554j56370n6447O7621J78451k7264M54L2041R1518q2200j88463R568
$$ 18799 27353 -129017 -185464 -117843 60608 33344 33798 65839 157357 75157 -113306 -103738
24028a03738J34067j1754P9731J36497M5568j6608J5728p9012j81086q6895j474
$$ -103738 30329 18575 98306 234803 280371 263763 279491 200479 19393 -67502 -68976
24017f8976K3266L1490P9904R7426K34p7315k2647o5271L1162M02p1396p646k7850
$$ -68976 -45710 -14220 65684 163110 163344 86029 63382 -1889 29273 29675 -41721 -49367 -77217
24004g7217l7394j06432m9547J8189Q4974J91798l651m5604q322j01676J3207
$$ -77217 -114611 -221043 -270590 -252401 -167427 24371 20720 -24884 -33206 -134882 -121675
23993a21675J28363J31298O3691m2085r605m8347L9808N9872r0878j28091Q783
$$ -121675 6688 137986 201677 159592 149987 101640 141448 201320 110442 -17649 -8866
23982h866J01917m1706M874J5421J02661r4426j22939L4729m9903K2491P4101
$$ -8866 93051 51345 56219 71640 174301 79875 -43064 -8335 -58238 -35747 38354
23971C8354l084K5343R1284L2626L3331p9207j39734l8184L358j20699j04253
$$ 38354 35270 60613 151897 184523 217854 138647 -1087 -39271 -35913 -156612 -260865
23960b60865Q0063Q0112p7448p8089P6148J40782N6636L9213L3637m9994j865
$$ -260865 -180802 -100690 -178138 -256227 -180079 -39297 17339 56552 90189 40195 38330
23949C8330p7149q3016k8990J00813L7405J14985N9200k2856L0504n3874M2379
$$ 38330 -38819 -121835 -150825 -50012 -12607 102378 161578 138722 169226 115352 157731
23938A57731M1051j19548k22673o3447J54993L7388n7453J12608L0556M5302m1947
$$ 157731 198782 79234 -143439 -206886 -51893 -14505 -71958 40650 71206 116508 74561
23927G4561L6426m9467o9002Q1451J67292o5145k6558q645J01172M718l0630K0825
$$ 74561 110987 61520 -7482 73969 241261 176116 149558 140913 242085 246803 216173 236998
23915B36998j3093j32416l7888M782n9263j66380O3634J30153O5825o225r5658
$$ 236998 223905 91489 53601 58383 -880 -167260 -103626 26527 92352 86127 -9531
23904i531j12538J2302R3093J38100j0086j41873j09621l1344M3645N4513J14721
$$ -9531 -122069 -109767 -16674 121426 111340 -30533 -140154 -171498 -127853 -73340 41381
23893D1381J03138M4473J4213p2952m9575M5790J9319k5965j08615j332O3290
$$ 41381 144519 188992 203205 130253 80678 126468 145787 119822 11207 9875 73165
23882G3165R8939N6062m2819m4249k1826P4193j0534q3745n6004n2971r2302l987
$$ 73165 172104 228166 185347 141098 119272 193465 182931 99186 43182 -9789 -102091 -106078
23870a06078P1378J2956P5940L7722j41536q4825J0223O7652j9861j7029P4841
$$ -106078 -34700 -21744 54196 91918 -49618 -134443 -124220 -56568 -76429 -93458 -18617
23859a8617K4446m0831o9008k5641N434l1161J41819M5408K6116l6221N9444n4970
$$ -18617 5829 -35002 -104010 -129651 -124217 -155378 -13559 31849 57965 21744 81188 26218
23847B6218p8060k11708p9415N3731O5233J11996Q9272n2767J1233m2931p6003
$$ 26218 -51842 -263550 -342965 -289234 -224001 -112005 -22733 -75500 -64267 -107198 -183201
23836a83201Q0136K71276O2758m0982n1030j9958j28729j68203O6496J93236O4134
$$ -183201 -103065 168211 230969 189987 138957 118999 -9730 -177933 -111437 81799 145933
23825A45933m9386p0949J135K0139r132q8436k2000O5878M9796P7648r407m5920
$$ 145933 96547 25598 26733 46872 37740 -50696 -72696 -6818 42978 120626 111219 65299
23813F5299j1243L7321j13463p8621l1041N4313o371m1769P9256R7998l0172j01026
$$ 65299 54056 91377 -22086 -100707 -131748 -77435 -83806 -125575 -46319 51679 21507 -79519
23801g9519n9232P7701n9961n919J23538O4167k3856K1951j12857m9939J01363
$$ -79519 -138751 -61050 -121011 -126930 -3392 60775 36919 58870 -53987 -103926 -2563
23790b563L3381M6693O9949m7551k7701m8797N4885o2356J3309M3000K6970j16588
$$ -2563 30818 77511 147460 99909 72208 23411 78296 15940 29249 72249 99219 -17369
23778a7369j4329J5395M2264K4180r388q5395k588O0785j3084j26354N1302j3478
$$ -17369 -31698 -16303 25961 50141 40753 -44642 -47230 13555 471 -125883 -74581 -88059
23766h8059r195K6599q851O6030J25817m7766j81682m8420J39152J32607m0456
$$ -88059 -97254 -70655 -79506 -13476 112341 64575 -117107 -165527 -26375 106232 65776
23755F5776p1362K8391j7072O9929k2186j1007M2555n6030j17999o1899N1297
$$ 65776 -5586 22805 5733 75662 53476 42469 85024 28994 -89005 -150904 -99607
23744i9607P501j13333K8413J61467J14488j8296l2455K7664K3693K5139o6168
$$ -99607 -92106 -205439 -177026 -15559 98929 80633 48178 75842 99535 124674 58506
23733E8506n254l0143r2494j5113L7222j2579o1326L890J6043M3253M5702m0243
$$ 58506 53252 23109 -69385 -84498 -47276 -59855 -121181 -117291 -101248 -57995 -12293 -52536
23721e2536o8492P8161J89541M0207O124R027p6579p9368l9250j8202o6717o006
$$ -52536 -121028 -42867 146674 186881 193005 202032 125453 46085 6835 -11367 -78084 -84090
23709h4090N6004j11285k5483N6700P465k8865Q3162L0L1931j3064p8210j8605
$$ -84090 -28086 -139371 -164854 -108154 -100689 -129554 -46392 -46362 -14431 -27495 -105705 -124310
23697a24310Q1540J18821k14531R6179J18233j12164O674J8457j2117o8898J6290
$$ -124310 -42770 76051 -138480 -42301 75932 -36232 -29558 -11101 -23218 -92116 -75826
23686g5826P1300J27978M7206m3523j81193o4692j8594O1479m1653m5636M6712
$$ -75826 -4526 123452 170658 127135 -54058 -118750 -137344 -75865 -117518 -163154 -116442
23675a16442l9635n2007M2597J47995K3463r6279l9517O4304Q0744p274m9838
$$ -116442 -156077 -208084 -165487 -17492 5971 -90308 -129825 -65521 15223 7949 -41889
23664d1889m5064o6966k6242m0073J8524P6280L0018M2507R3517L2395p2875l6522
$$ -41889 -86953 -153919 -180161 -220234 -201710 -125430 -95412 -52905 40612 73007 132 -36390
23652c6390j3387n0929l4768o6840Q324k4788M1965J09498n0840N5103J53085
$$ -36390 -49777 -100706 -135474 -202314 -193990 -218778 -176813 -67315 -118155 -63052 90033
23641I0033M6103m1316j33717m9616Q4647L2207p1961m5434J7859Q8940K214j50873
$$ 90033 136136 94820 -38897 -88513 -3866 28341 -43620 -89054 -71195 17745 19959 -130914
23629a30914p499O1797K0934K4O4579k0160k8771L7860l3888k6239K3961M1358
$$ -130914 -138413 -76616 -55682 -55658 8921 -11239 -40010 -2150 -36038 -62277 -38316 3042
23617C042m872j28319m1988O1727l2538M6006j4096L8530n9180l5731J9712l027
$$ 3042 -1830 -130149 -172137 -110410 -142948 -96942 -111038 -72508 -131688 -167419 -147707 -150734
23605a50734J23455o2086j25171O6918P6887O7335J18624Q5632j41716r1458l7092
$$ -150734 -27279 -89365 -214536 -147618 -70731 -3396 115228 200860 59144 -32314 -69406
23594f9406J0233J74971O7199q7069j21777j30341r3495K7608J05825N8423n038
$$ -69406 -59173 115798 182997 95928 -25849 -156190 -249685 -222077 -116252 -57829 -62867
23583f2867r3426r8710q934L8045J53881L8664m5004K7834J05648Q588q6610j87986
$$ -62867 -156293 -255003 -263937 -225892 -72011 -33347 -78351 -50517 55131 63719 -22891 -210877
23571b10877q2290J37549J63660N3496p5550q1512O2237J03248m7274J4605m9559
$$ -210877 -293167 -155618 8042 61538 -14012 -95524 -33287 69961 22687 37292 -12267
23560a2267L1359J8966q7603j9208J31447n0176j35518p5539Q8025J04777j2184
$$ -12267 19092 38058 -49545 -68753 62694 12518 -123000 -198539 -110514 -5737 -17921
23549a7921L0589J2792q5044j270Q3016J18481n6069j18258j13736N2300q207
$$ -17921 12668 25460 -59584 -60854 22162 140643 84574 -33684 -147420 -95120 -103327
23538a03327k1636J0181N3240k7837Q2689p2298J3239o1060L1339Q5372N1828
$$ -103327 -124963 -114782 -61542 -89379 -6690 -78988 -65749 -126809 -95470 -10098 41730
23527D1730R165m5644J052J7674j32091k1568K7797R8832Q5574k3306n7524K8329
$$ 41730 50895 5251 6303 23977 -108114 -129682 -101885 -3053 82521 59215 1691 30020
23515C0020N7030o7418j1543l9945n7161o3666o568R7277J53m3093K3426J4093
$$ 30020 87050 19632 8089 -31856 -89017 -152683 -159251 -61974 -61821 -104914 -81488 -67395
23503f7395j9670K649K3411k9479N2385J22157o4760m482q598P7410N7152k4014
$$ -67395 -87065 -84416 -61005 -90484 -38099 84058 19298 14816 6218 83628 140780 116766
23491A16766j02909J4822k2642L2500j46467j7653L6637L6098q350J6893k4432
$$ 116766 13857 28679 6037 38537 -107930 -125583 -88946 -52848 -61198 -44305 -68737
23480f8737j0027Q0091M1217l7425r6328K0893J4199J10976p7411k4082l9314
$$ -68737 -78764 1327 42544 5119 -91209 -70316 -56117 54859 -22552 -46634 -85948
23469h5948M4061K1719m3547K0569n1174J4776l8584j8825P3398K5739K2006k4416
$$ -85948 -41887 -20168 -63715 -43146 -94320 -79544 -118128 -136953 -63555 -37816 -15810 -40226
23457d0226P3238K2052l2454K7967J80095o956j26506j39903m9675J09133J23307
$$ -40226 33012 55064 22610 50577 230672 223716 97210 -42693 -92368 16765 140072
23446A40072M399r5526j562O3141m7192O5367K6783q2071j5126r9119j44140n291
$$ 140072 144471 48945 47383 110524 63332 128699 155482 73411 58285 -40834 -184974 -190265
23434a90265K7195O4204j35617n7434O2934J40789J28371M3840P3710k9192k9789
$$ -190265 -163070 -98866 -234483 -291917 -228983 -88194 40177 84017 157727 128535 98746
23423I8746k1668o5818L7311j18784K2434J49532K8633M6741l1943J9262O2308
$$ 98746 77078 11260 48571 -70213 -47779 101753 130386 177127 145184 164446 226754
23412B26754r4557p4739J3449K9741N6506R5394J4205p355p1036N5782J14477
$$ 226754 132197 57458 70907 100648 157154 252548 266753 259398 188362 244144 358621
23401C58621o0424j58902j85176k08066q4525l319J16794J01359J65512M7660
$$ 358621 298197 139295 -45881 -253947 -338472 -341791 -224997 -123638 41874 89534
23391H9534K256K917r71m4495K9651J45578j31563j54658o4700m225M1363n5880
$$ 89534 91790 94707 93736 49241 78892 224470 92907 -61751 -126451 -130676 -89313 -145193
23379a45193J38605K03770j818j45209j74758j22358J0450m703Q977Q4058k3452
$$ -145193 -6588 197182 195364 50155 -124603 -246961 -236511 -241214 -232237 -148179 -171631
23368a71631K15122J531k6630J42188Q4479K1155N0838L2702n8106p9677l0284
$$ -171631 43491 45022 18392 160580 245059 266214 317052 349754 291648 211971 181687
23357A81687M988o9651K8290n5466m4713P359N473R636M8967p2658k4264N2107
$$ 181687 186675 117024 145314 89848 45135 52494 57967 67603 116570 43912 19648 71755
23345G1755Q392J4485J2522j60835L8537k4995R223J32521l8837m5596l8537N0025
$$ 71755 80147 94632 107154 -53681 -15144 -40139 -30916 101605 62768 17172 -21365 28660
23333B8660P8346j40633j2859o516K4077K0932j5313o5033j08038m132N2644k3039
$$ 28660 107006 -33627 -46486 -53002 -28925 -7993 -23306 -88339 -196377 -200509 -147865 -170904
23321a70904r877n6498J7072k4838j2092J45210M3133J4699P6861L4802o8955
$$ -170904 -180781 -237279 -220207 -245045 -257137 -111927 -68794 -54095 22766 57568 -11387
23310a1387L6616R1146j9664K661r2352j6527J150l6669p030m7267l4828J6010
$$ -11387 25229 116375 96711 99372 7020 -9507 -8357 -45026 -52056 -99323 -134151 -118141
23298a18141L806N9547L9579l2012R1693p8307n7587N6286o0293n6270P3861l6190
$$ -118141 -114335 -54788 -15209 -47221 44472 -33835 -91422 -35136 -95429 -151699 -77838 -114028
23286a14028J29085M0271p5191n8101j14871l0775M8794j293N200P789Q8279K4058
$$ -114028 15057 55328 -19863 -77964 -192835 -223610 -174816 -176109 -170909 -163120 -74841 -50783
23274e0783j6415L1160L3945m1015R1468K48k9155J3578l2983p4728M1071K17186
$$ -50783 -67198 -36038 -2093 -43108 48360 48608 19453 33031 48 -74680 -33609 183577
23262A83577O6158j0580l9029L663j5161r7940q6869j608o0765j15788j912J60209
$$ 183577 249735 239155 200126 203789 188628 90688 3819 2211 -58554 -174342 -176254 -16045
23250a6045J11716L9028J38156R684n1438j25790q6305l7525m0640O292M3558
$$ -16045 95671 134699 272855 282539 231101 105311 19006 -18519 -59159 -52867 -9309
23239i309k5558l4918j5280N8889N6608j5737j1043J05436R2006k7041o8051R4874
$$ -9309 -34867 -69785 -85065 -26176 30432 14695 3652 109088 201094 174053 106002 200876
23227B00876n2322q9463k5471l5481j57734P128P0884O5107n8941n7082m3836
$$ 200876 148554 59091 33620 -1861 -159595 -152467 -81583 -16476 -75417 -132499 -176335
23216a76335l6072M6099m9268J39392J86074J0155O3971n0223q4453J17550j6425
$$ -176335 -212407 -166308 -215576 -76184 109890 120045 184016 133793 49340 166890 150465
23205A50465j77627m9734N1964K2355M4038j0747k963q2516j8124J0828P6528
$$ 150465 -27162 -76896 -24932 -2577 41461 30714 27751 -54765 -72889 -62061 14467
23194A4467J0890L0639J8663J1073M362n3456K716m4042l3544j7274N469J8222
$$ 14467 25357 55996 74659 85732 90094 36638 39354 -4688 -38232 -55506 -50037 -31815
23182c1815j1492P0501P3410L3150R653k694m0400j0245o3491O2840P0423O560
$$ -31815 -43307 27194 100604 133754 143407 140713 100313 90068 26577 89417 159840 166400
23170A66400L4106j8066j07609r5133k3954j53401k3588J50958P2767K0548q05
$$ 166400 200506 182440 74831 -20302 -44256 -197657 -221245 -70287 2480 23028 22223
23159B2223O8755K6712J9630j37L654J10889q9022l6109M5421l9042l3045k5492
$$ 22223 90978 117690 137320 137183 140837 251726 162704 126595 172016 132974 99929 74437
23147G4437m1480n1026M2115j8690o5290P8338P1940p8939r2427k1283n3803l1989
$$ 74437 32957 -18069 24046 5356 -59934 18404 90344 11405 -81022 -102305 -156108 -188097
23135a88097l34K1067R0847P2464M3157l7067j78370l4425J57304K35917J10874
$$ -188097 -188431 -167364 -76517 -4053 39104 2037 -176333 -210758 -53454 182463 293337
23124B93337p1489n2473l6692m8613l3931q6818Q6088m4877o3436k8696j9556
$$ 293337 221848 169375 132683 84070 50139 -36679 49409 4532 -58904 -87600 -107156
23113a07156N6987o1920k3097N6472J2811j38046r1615O54N5820O7833Q5955m3765
$$ -107156 -50169 -112089 -135186 -78714 -65903 -203949 -295564 -294910 -239090 -171257 -85302 -129067
23101a29067j05604J7266J6856O1655K0257j3071P6258N9534k842r1282k37269
$$ -129067 -234671 -217405 -200549 -138894 -118637 -131708 -55450 4084 1242 -90040 -327309
23090c27309j9856J00140P0915J48525O9564j38330j847O1683K9603L4335M313
$$ -327309 -347165 -247025 -176110 -27585 41979 -96351 -98198 -36515 -6912 27423 31736
23079C1736o991N5977L7957j5692j18417n5962N7729L3943o6800Q7785O8398p207
$$ 31736 24745 80722 118679 102987 -15430 -71392 -13663 20280 -46520 41265 109663 102456
23067A02456p5096P0468R479j00385O31L6178m3959J7549j9929P9937k8278M2533
$$ 102456 27360 97828 107307 6922 7553 43731 -228 17321 -2608 77329 49051 91584
23055I1584k6513k38731M1534M6580l7594J12202J05625j34251j71863k2024P1654
$$ 91584 65071 -173660 -132126 -85546 -123140 -10938 94687 -39564 -211427 -233451 -161797
23044a61797j6249L8014N6339M5223J67q396q4778p5578o0101N0601J50373O2591
$$ -161797 -178046 -140032 -83693 -38470 -38303 -46699 -131477 -207055 -267156 -216555 -66182 -3591
23032c591P9260R1503j7428o8390J0686m4141l6208j03819l1714K9151l6577J54974
$$ -3591 75669 167172 149744 81354 92040 47899 11691 -92128 -123842 -94691 -131268 23706
23020B3706K6295j83157j4310r914n2221j4513R4552J38504O7713R3823l2198
$$ 23706 50001 -133156 -147466 -157380 -209601 -224114 -129562 8942 76655 170478 138280
23009A38280p9421p6573q3581K8706M7076K0046J3187K5466M8937k8842J9188
$$ 138280 58859 -17714 -101295 -72589 -25513 -5467 7720 33186 82123 53281 72469
22998G2469L9865j13050j34096m6542O0625J57893Q6301m162J2593Q533r6924
$$ 72469 112334 -716 -134812 -181354 -120729 37164 123465 119303 131896 140429 43505
22987D3505j58032j27302R6562J1436J14355J00533M9800l3800j01194q4531Q3029
$$ 43505 -114527 -241829 -145267 -133831 -19476 81057 130857 97057 -4137 -88668 -5639
22976e639J6869n927M3107p998j02912n0954r8628N10K30042J59907r8716p6456
$$ -5639 11230 5303 48410 40412 -62500 -113454 -212082 -211572 18470 178377 79661 3205
22964C205r9120n8340M3926j72917P4510J67987N5477Q73K4324l3417q7041o434
$$ 3205 -95915 -154255 -110329 -283246 -208736 -40749 14728 15601 39925 6508 -80533 -86967
22952h6967N6322M183Q406M0722M1741n9478p4257j7183m6100O4407l3232o4084
$$ -86967 -30645 -26462 -18056 22666 64407 4929 -69328 -86511 -132611 -68204 -101436 -165520
22940a65520o1998J18719P6564M792l8201R0407Q2615J01513M771j15429K3506
$$ -165520 -227518 -108799 -32235 -27443 -65644 24763 107378 208891 213662 98233 121739
22929A21739k7352k5366o7445j6819N3875k2818j4020k7281m8485L3796Q9336
$$ 121739 94387 69021 1576 -15243 38632 15814 1794 -25487 -73972 -40176 49160
22918D9160k5956L1025n7311k6813o5102M9512J00479l0093p8061k3376N2813
$$ 49160 23204 54229 -3082 -29895 -94997 -45485 54994 24901 -53160 -76536 -23723
22907b3723p7511Q0174P879r3834M6228M9354q0740o8684o865K6473N2628L1714
$$ -23723 -101234 -21060 -13181 -107015 -60787 -11433 -92173 -160857 -167722 -141249 -88621 -56907
22895e6907j7630r2524n0918O1339J14866l6634K6193P4992o7287j5476P8766
$$ -56907 -74537 -167061 -217979 -156640 -41774 -78408 -52215 22777 -44510 -59986 18780
22884A8780k1869P4764M6852L443o362q6360j33962j3710J75615J06904n6053
$$ 18780 -3089 71675 118527 121970 115608 29248 -104714 -118424 57191 164095 108042
22873A08042r2532j82761J17940J84206J7911j42144q1907M649k6409o0670K03576
$$ 108042 15510 -167251 -49311 134895 152806 10662 -71245 -66596 -93005 -153675 49901
22862D9901J00460K2676P0872p3612n6318l5616o5624j25723N5952J08644L8175
$$ 49901 150361 173037 243909 170297 113979 78363 12739 -112984 -57032 51612 89787
22851H9787m4518k0926l8878l2771k8053l2635L6019j8380m9403k0627k7657q4252
$$ 89787 45269 24343 -14535 -47306 -75359 -107994 -71975 -90355 -139758 -160385 -188042 -272294
22839b72294J7563N9825J4878M0560l4768K9416P8530m1835J0757q3225P176J39017
$$ -272294 -254731 -194906 -180028 -139468 -174236 -144820 -66290 -108125 -97368 -180593 -173417 -34400
22827c4400J21203j7510l4501l426M3654j19889r5845j89N390N5479j1554N5227
$$ -34400 86803 69293 34792 31366 75020 -44869 -140714 -140903 -135513 -80034 -91588 -36361
22815c6361J24063P2863j01118p294L4658p9522m6347K0322o3355q919Q2988O3549
$$ -36361 87702 160565 59447 52153 86811 7289 -39058 -18736 -82091 -91010 -8022 55527
22803E5527J01501j37176K487J54500q331j14146j8864j31875j8087Q2845J32200
$$ 55527 157028 19852 22339 176839 168508 54362 35498 -96377 -114464 -31619 100581
22792A00581L5417q4292j13912j5231k0475j7396R776n6842L497K1488N5563k5862
$$ 100581 135998 51706 -62206 -77437 -97912 -115308 -105532 -162374 -158877 -137389 -81826 -107688
22780a07688n7275J06461R3684J0298L154n3036n6685Q5400m169M3839k0469o1307
$$ -107688 -164963 -58502 35182 45480 48634 -4402 -61087 24313 20144 63983 43514 -17793
22768a7793M3251J9331j8926j8393n2885n0472N1782J0216L9008O2253M7898j28538
$$ -17793 25458 44789 25863 7470 -45415 -95887 -44105 -33889 5119 67372 115270 -13268
22756a3268n1001q208M2740R8367q924k8410k876L7668k0442j3594l4904J3937
$$ -13268 -64269 -72477 -29737 68630 59706 31296 28420 66088 45646 32052 -2852 11085
22744A1085J11146M2182j7538n0492l3182M9117N6981q3088n3670O4588J1970
$$ 11085 122231 164413 146875 96383 63201 112318 169299 86211 32541 97129 109099
22733A09099j62170m6298J13123J09754L2730j45692j04669P1785J67841Q7391
$$ 109099 -53071 -99369 13754 123508 156238 10546 -94123 -22338 145503 232894
22723B32894j87027p7572j8234K4056k0429K8264n606p737o3789O95j07771M1925
$$ 232894 45867 -31705 -49939 -25883 -46312 -18048 -23654 -31391 -95180 -94485 -202256 -160331
22711a60331J27356k183R9682R6670j5666k1579o2061j51875j16255Q6393k2178
$$ -160331 -32975 -35158 64524 161194 145528 123949 61888 -89987 -206242 -119849 -142027
22700a42027L3230j5162j78065l3175M7943J02945K04K2064J13577O4576m8222
$$ -142027 -108797 -123959 -302024 -335199 -287256 -184311 -184107 -162043 -48466 16110 -32112
22689c2112k3410m2428M9739K4800M8833M836J282r179q6034q1874J13636j0788
$$ -32112 -55522 -97950 -48211 -23411 25422 30258 31540 22361 -63673 -145547 -31911 -42699
22677d2699j22457J0270k7933m8085J264J28475K09403M8044j97923j02066l8310
$$ -42699 -165156 -154886 -182819 -230904 -229640 -101165 108238 156282 -41641 -143707 -182017
22666a82017l1266L7914K2188l1937J6317J3921M9036l7447m7127P6936K2558
$$ -182017 -213283 -175369 -153181 -185118 -168801 -154880 -105844 -143291 -190418 -113482 -90924
22655i0924k7972J09709R5770R801j05750q1498J7574j7668M5362p3107Q8815
$$ -90924 -118896 -9187 86583 96384 -9366 -90864 -73290 -90958 -45596 -118703 -29888
22644b9888J36193J1241L8573M1598j94596j55821K1412n0172R298p2156K8354
$$ -29888 106305 117546 156119 197717 3121 -152700 -131288 -181460 -172162 -244318 -215964
22633b15964O2896Q4317n208P5030K8361k7867K4219r2933j32683L8140R4227
$$ -215964 -153068 -68751 -73959 1071 29432 1565 25784 -67149 -199832 -161692 -67465
22622f7465L3623j9285j09957j34657k4702J50679j3482J07819K52518J22476
$$ -67465 -33842 -53127 -163084 -297741 -322443 -171764 -185246 -77427 175091 297567
22612B97567n4841j4938L2366p4348n6289M2831J6529k698N056q3644j16030k1264
$$ 297567 242726 227788 260154 185806 129517 172348 188877 186179 191235 107591 -8439 -29703
22600b9703O4432J5459l3307j12813M5069J85310l786m7703o4566L090m0553q1166
$$ -29703 34729 50188 16881 -95932 -50863 134447 130661 82958 18392 21482 -19071 -100237
22588a00237p5338J01707M033L9649L816R0298L8299j4879j09400m0179m0294
$$ -100237 -175575 -73868 -69835 -30186 -26370 63928 102227 87348 -22052 -62231 -102525
22577a02525J02243k4712J7662J16572K2095j27029J19l5504J9788P2322M1105
$$ -102525 -282 -24994 -7332 109240 131335 4306 4425 -31079 -11291 61031 102136
22566A02136j04024M9373M4263n7495n6977R0351l0314n4056Q400o3867n5150
$$ 102136 -1888 47485 91748 34253 -22724 67627 37313 -16743 -8343 -72210 -127360
22555a27360M6580N7865P560J623J6335J31884Q0696J3419m7518j51328j3556
$$ -127360 -80780 -22915 -15355 -13732 2603 134487 215183 228602 181084 29756 16200
22544A6200L7447l9876j8334P1231j6119Q55o3783r6848n2644J5251K0770K9355
$$ 16200 53647 13771 -4563 66668 50549 51404 -12379 -109227 -161871 -146620 -125850 -96495
22532i6495J6604J30393r99j37410N9528R6377Q0881K7503n2257k7941m7093o3469
$$ -96495 -79891 50502 49503 -87907 -28379 67998 148879 176382 124125 96184 49091 -14378
22520a4378J23870M2391q1131j11915q2178P2754q83K3113k5546r6539M0381L9198
$$ -14378 109492 151883 70752 -41163 -123341 -50587 -51470 -28357 -53903 -150442 -110061 -70863
22508g0863P5677P6539P0628P4374o256j75212j36646K1438J3921n8767L413n6286
$$ -70863 4814 81353 151981 226355 220099 44887 -91759 -70321 -56400 -115167 -111754 -168040
22496a68040R157L3954l3054M8803Q7672Q7576p0760j38039n4466L7658O4467
$$ -168040 -158883 -124929 -157983 -109180 -21508 66068 -4692 -142731 -197197 -159539 -95072
22485i5072J16073K5935j42126j07779m0617K6850J14707L7429p9583j11106N0365
$$ -95072 21001 46936 -95190 -202969 -243586 -216736 -102029 -64600 -144183 -255289 -204924
22474b04924K9111J8302R4167O9736M7963j36743m8962j0597l0776J44025J1116
$$ -204924 -175813 -157511 -63344 6392 54355 -82388 -131350 -141947 -172723 -28698 -17582
22463a7582p478m0110N1809N7184Q147j07990j00746O339J24440j1613n3803j01873
$$ -17582 -25060 -65170 -13361 43823 51970 -56020 -156766 -150427 -25987 -37600 -91403 -193276
22451a93276p1383R1549J65919J31380J17560j4236j03991j7762p3895m6153q709
$$ -193276 -264659 -173110 -7191 124189 241749 227513 123522 105760 31865 -14288 -22997
22440b2997m7985l6369k9985K9998O0022N9357K9733J4897o0310n4711L7596k1319
$$ -22997 -70982 -107351 -137336 -107338 -47316 12041 41774 56671 -3639 -58350 -20754 -42073
22428d2073P2851R7107p0429M9108o5410j484Q4902L7629j44487j20762O8286
$$ -42073 30778 127885 57456 106564 41154 39670 124572 162201 17714 -103048 -34762
22417c4762Q8747p7701j0037L6514K3494K9406j8591N7326L9623o056J04251p912
$$ -34762 53985 -23716 -33753 2761 26255 55661 37070 94396 134019 127963 232214 224302
22405B24302q1620J30442n7315j13439R782n4697q7719k138J9877j8949M9466
$$ 224302 142682 273124 215809 102370 112152 57455 -30264 -32402 -12525 -31474 17992
22394A7992J12647P4556o7139j24493j08883J168K8391L885o6992K1802K7111
$$ 17992 130639 205195 138056 13563 -95320 -94152 -65761 -61876 -128868 -107066 -79955
22383g9955p0370j18262l5068Q4888K87558J31141n0717R771j6921j45927j0743
$$ -79955 -150325 -268587 -303655 -218767 68791 199932 149215 158986 142065 -3862 -14605
22372a4605N4389P3202J37738k5151n5135j31502o3405M3744q3578l4671Q9043
$$ -14605 39784 112986 250724 225573 170438 38936 -24469 19275 -64303 -98974 -9931
22361i931N4803q8021k9709R0969j8990n8868p1964J6052K9133J42185K7640m5001
$$ -9931 44872 -43149 -72858 18111 -879 -59747 -131711 -115659 -86526 55659 83299 38298
22349C8298l3751m9344q5082j3958M354N5639O6492j13379p3120M8906J71616
$$ 38298 4547 -44797 -129879 -143837 -139483 -83844 -17352 -130731 -203851 -154945 16671
22338A6671l5336j11100J289P9411K6274n1326J9509q9255r5528R0739Q489K899
$$ 16671 -18665 -129765 -128476 -49065 -22791 -74117 -54608 -143863 -239391 -148652 -140163 -137264
22326a37264j03706m5134L5677q178P7314J06548m5661j5794J06708l3146k4852
$$ -137264 -240970 -286104 -250427 -258605 -181291 -74743 -120404 -136198 -29490 -62636 -87488
22315h7488j57N9401L5193J3801K1434L1155q2286n2862J00398R9021n0023o4520
$$ -87488 -87645 -28244 6949 20750 42184 73339 -8947 -61809 38589 137610 87587 23067
22303B3067m185r1997o4856L4532M3458N0515o517O3033K3423K0768M2868O6780
$$ 23067 18882 -73115 -137971 -103439 -59981 -9466 -15983 47050 70473 91241 134109 200889
22291B00889q935j07615k982J27375J04363j26619p3749R071n7681m1672L8380
$$ 200889 191954 84339 81357 208732 313095 186476 112727 121798 64117 22445 60825
22280F0825m0048j27414K1896Q4769J01150K8137m046m2658Q266m5652p9610j29019
$$ 60825 20777 -106637 -84741 28 101178 129315 125269 82611 90877 45225 -34385 -163404
22268a63404K999J97199N6900j12780m8849j9456M8484J55967k2092M4515j3527
$$ -163404 -160405 36794 93694 -19086 -67935 -87391 -38907 117060 94968 139483 125956
22257A25956p5255M02M911q5748n1568P029k2184J1617M7556K5538R7584m665
$$ 125956 50701 51103 56014 -29734 -81302 -74273 -96457 -84840 -37284 -11746 85838 81173
22245H1173j11832k6927L8406J5225o6365l7197m9606K7470R7057r1308j2020
$$ 81173 -30659 -57586 -19180 -3955 -70320 -107517 -157123 -129653 -32596 -123904 -135924
22234a35924J23357P0012n6462j91703k3237j374j5711P4958L0559J6911R7656
$$ -135924 -12567 57445 983 -190720 -213957 -215331 -231042 -156084 -125525 -108614 -10958
22223a0958O5479k405n4834l4047J7547j82952p6060J16115l0737j48543J0433
$$ -10958 54521 52116 -2718 -36765 -19218 -202170 -278230 -162115 -192852 -341395 -330962
22212c30962N8163J7627J17517O9380N9813m7629o2458N7111K06818J9825l5674
$$ -330962 -272799 -255172 -137655 -68275 -8462 -56091 -118549 -61438 145380 165205 129531
22201A29531q579K879P1441m8792p4243J16745n5020k5996J1115j66622j35625
$$ 129531 120952 123831 195272 146480 72237 188982 133962 107966 119081 -47541 -183166
22190a83166O1669k2617J7360P7262j05869j20167N4010J11379j390k1785O325
$$ -183166 -121497 -144114 -126754 -49492 -155361 -275528 -221518 -110139 -111529 -133314 -126989
22179a26989J04689l9349q0219M9693L1934O1342K4291n8691j09776m8867J82851
$$ -126989 -22300 -61649 -141868 -92175 -60241 1101 25392 -33299 -143075 -191942 -9091
22168i091l918p0981j3321Q2470M3069m4637k2591N8044J09853L9281j18369k36451
$$ -9091 -13009 -83990 -97311 -14841 28228 -16409 -39000 19044 128897 168178 49809 -186642
22156a86642l1311l8448n8650J12066M1130j52628J13415N8560J20352O5494N8452
$$ -186642 -217953 -256401 -315051 -202985 -161855 -314483 -201068 -142508 -22156 43338 101790
22145A01790n7374j5499j7773K4207O1448m3163J4741r8094p5464Q3580R0000
$$ 101790 44416 28917 11144 35351 96799 53636 68377 -29717 -105181 -21601 68399
22134F8399p2755r0466o6928l0760P870K6616P4870Q0474n6918M1493r684R267
$$ 68399 -4356 -94822 -161750 -192510 -184640 -158024 -83154 -2680 -59598 -18105 -27789 -18522
22122a8522j12605j5052N4092j42126j6781n4500L9879R9170l268N5481M9909
$$ -18522 -131127 -146179 -92087 -234213 -250994 -305494 -265615 -166445 -169713 -114232 -64323
22111f4323Q4188L2752k2106J19316n1991q9745R185P6114j1134O4735K0083j10544
$$ -64323 19865 52617 30511 149827 97836 8091 17276 93390 82256 146991 167074 56530
22099E6530r2626j42145O606k0823J26813L6286l7977j0402n578L1252K4028p6311
$$ 56530 -36096 -178241 -171635 -192458 -65645 -29359 -67336 -77738 -83316 -52064 -28036 -104347
22087a04347M834R0234p1607k9103M9615n5459K4224K0029L477N8234k5112Q4804
$$ -104347 -99513 -9279 -80886 -109989 -60374 -115833 -91609 -71580 -68103 -9869 -34981 49823
22075D9823q94q3606j10481R5482J07286o2377K8558K9400J189k2628P0209L628
$$ 49823 48929 -34677 -145158 -49676 57610 -4767 23791 53191 54380 31752 101961 105589
22063A05589M4335k0269k7368l1362p4640M1423n0694m8784J31747r114O8290
$$ 105589 149924 129655 102287 70925 -3715 37708 -12986 -61770 69977 60863 129153
22052A29153p4988j30110R4717L4894m1146p7050k019N7337K073M6433P345k0663
$$ 129153 54165 -75945 18772 53666 12520 -64530 -66549 -9212 -7139 39294 46639 25976
22040B5976m0471l8433J15324J14720P9749r8545m0071k7684k9898j1132p252
$$ 25976 -14495 -52928 62396 177116 256865 158320 118249 90565 60667 49535 42283
22029D2283o4496q6763N6393J22685J27011o7496m2880k7656p2970q3344J9146
$$ 42283 -22213 -108976 -52583 70102 197113 129617 86737 59081 -13889 -97233 -78087
22018g8087K0228j1748n9724K294N3444O2164k6501l6256M153n3533J7178N3416
$$ -78087 -57859 -69607 -129331 -127037 -73593 -11429 -37930 -74186 -70033 -123566 -106388 -52972
22006e2972j32623J8180O8348J07533N7729r1322o3980O3971o669l8931j22700
$$ -52972 -185595 -167415 -99067 8466 66195 -25127 -89107 -25136 -31805 -70736 -193436
21995a93436P803O9328N7130L2793j10056j7601J60258M9194o1701K7478N8159
$$ -193436 -185633 -116305 -59175 -26382 -136438 -154039 6219 55413 -6288 21190 79349
21984G9349k5698r251j2683J2509k3743m957M266o3204Q056R467O0554L7043j01636
$$ 79349 53651 44400 31717 44226 20483 15526 19792 -43412 -35356 -25889 34665 71708 -29928
21971b9928p0848K0799M9874m5262n9268Q6558m746N9292M3809j02035o2554N9563
$$ -29928 -100776 -79977 -30103 -75365 -134633 -48075 -52821 6471 50280 -51755 -114309 -54746
21959e4746J58155j9265l9260O9254p134j09475o7775l4406j2467J23883Q2565
$$ -54746 103409 84144 44884 114138 107004 -2471 -70246 -104652 -117119 6764 89329
21948H9329o6795L2640K1286r1534O9411N2415j10280n5268N0202K9586m0681
$$ 89329 22534 55174 76460 -15074 54337 106752 -3528 -58796 -8594 20992 -19689
21937a9689l9579k5579Q496r1948N1389O7765o8538R5840Q1872N3605N2692j429
$$ -19689 -59268 -84847 -76351 -168299 -116910 -49145 -117683 -21843 60029 113634 166326 164897
21925A64897j69230j3965l7833J9884m7036m119L6569n246R848k142J3231l4442
$$ 164897 -4333 -18298 -56131 -36247 -83283 -87402 -50833 -56079 -46231 -48373 -35142 -69584
21913f9584L9768M3332j11584l9745J55736J90542j49321j10180o8686m7772R1407
$$ -69584 -29816 13516 -98068 -137813 17923 208465 59144 -51036 -119722 -167494 -76087
21902g6087J83544J367K4497J5545j4603l3220p9763m350J9286O4845j3778K8317
$$ -76087 107457 108824 133321 148866 134263 101043 21280 16930 36216 101061 87283 115600
21890A15600O6852j4962j9254L137N5600j51791j01975N4061M550o4547m7930
$$ 115600 182452 167490 148236 151373 206973 55182 -46793 7268 11818 -52729 -100659
21879a00659O9885J53253M8165q1718j32973q9834O9700L1652M906n8691r366
$$ -100659 -30774 122479 170644 88926 -44047 -133881 -64181 -32529 -27623 -86314 -95680
21868i5680Q9196L6138P8442Q4916q7570j85109l7498o7959O3046O1746l3346
$$ -95680 -6484 29654 108096 193012 105442 -79667 -117165 -185124 -122078 -60332 -93678
21857i3678M7577o8475K2750K07254j8237n9979j888k9300J2524N1186J00900
$$ -93678 -46101 -114576 -91826 115428 97191 37212 35324 6024 18548 69734 170634
21846A70634n7255k2200q1098k7231o8143j07223J5080K1277N7371o0793R0886
$$ 170634 113379 91179 10081 -17150 -85293 -192516 -177436 -156159 -98788 -159581 -68695
21835f8695L369J4926L3737J00901n2874L0179m3856j58812j3192J8845O7547
$$ -68695 -65326 -50400 -16663 84238 31364 61543 17687 -141125 -154317 -135472 -67925
21824f7925M0856l8315J0677l2458l7059j1488L6529M2901R3742P963J14667p4221
$$ -67925 -27069 -65384 -54707 -87165 -124224 -135712 -99183 -56282 37460 45423 160090 85869
21812H5869l5361r4898R001J44917P8884K1923m6452j02767K353n3721q868N5559
$$ 85869 50508 -44390 -35389 109528 188412 210335 163883 61116 63469 9748 880 56439
21800E6439q9017j92094M9407O0534K3821k3322K4980L1437j1415p9791L3655
$$ 56439 -32578 -224672 -175265 -114731 -90910 -114232 -89252 -57815 -69230 -149021 -115366
21789a15366M3509J62241o6198p2237R7883R2016p0597k9515p612m812J3825J9492
$$ -115366 -71857 90384 24186 -48051 49832 141848 71251 41736 34124 29312 43137 62629
21777F2629J1431j07696q1585j1987N9168J49555l7177j10003j4905L7316m0684
$$ 62629 74060 -33636 -115221 -127208 -68040 81515 44338 -65665 -80570 -43254 -83938
21766h3938q7912K327K1261O9123N2635k3306m1848P456L2913o3877R847N8378
$$ -83938 -171850 -169523 -148262 -79139 -26504 -49810 -91658 -84202 -51289 -115166 -105319 -46941
21754d6941m0434p0349M2551P0128j46971j12423N9850J67146J06955L4041n481
$$ -46941 -87375 -157724 -115173 -45045 -192016 -304439 -244589 -77443 29512 63553 58072
21743E8072M4341l0732j34553k25820O028J17061Q7176K4175M3455l8961j8742
$$ 58072 102413 71681 -62872 -288692 -282664 -165603 -78427 -54252 -10797 -49758 -68500
21732f8500p4806K7480J00840o3336M7191J1794j5389j48887q2637K7543Q3236
$$ -68500 -143306 -115826 -14986 -78322 -31131 -19337 -34726 -183613 -266250 -238707 -155471
21721a55471j6562O6700K44748N9406n4543q2568K7202Q305k7182l0436j65921
$$ -155471 -172033 -105333 139415 198821 144278 61710 88912 97217 70035 39599 -126322
21710a26322k633N6130J490N316J1398Q337P4041L4216L1017L9917P9638r3957
$$ -126322 -128955 -72825 -71335 -66019 -54621 -46284 27757 61973 92990 132907 212545 118588
21698A18588j07624M9639L782p726o5429J5955O9999L3256r3580j35097K5822
$$ 118588 10964 60603 64385 56659 -8770 7185 77184 110440 16860 -118237 -92415
21687i2415P6319M1759q8494j13482j1041N0920K9052r0047J29246J36474J8853
$$ -92415 -16096 25663 -62831 -176313 -187354 -136434 -107382 -197429 -68183 68291 87144
21676H7144J8669j02226j9140l207M4910N8960N055j39431M3034R6828j01884
$$ 87144 105813 3587 -15553 -18760 26150 85110 90165 -49266 -6232 90596 -11288
21665a1288p8187J3971p0377m0212p2228L5574J85733J43747l6531M1005k4506
$$ -11288 -89475 -75504 -145881 -186093 -258321 -222747 -37014 106733 70202 111207 86701
21654H6701n1164m0625J3023L230P1066L2019k6545k1998k4010N6638j44203m8364
$$ 86701 35537 -5088 7935 11165 82231 114250 87705 65707 41697 98335 -45868 -94232
21642i4232M5159O5913J7784q7617L8154N5877r150j48531n0611j7043l207J6243
$$ -94232 -49073 16840 34624 -52993 -14839 41038 31888 -116643 -167254 -184297 -187504 -171261
21630a71261N5264R4328p0639J6501O4147J16627l1815l9178k7831p1661k7977
$$ -171261 -115997 -21669 -92308 -75807 -11660 104967 73152 33974 6143 -65518 -93495
21619i3495Q601L6499R5991K681j3715n5836j10750r081q38n0127K6515L9661
$$ -93495 -84894 -48395 47596 50277 36562 -19274 -130024 -139105 -139943 -190070 -163555 -123894
21607a23894P21J25454L8063K0222n7402o0115k2751k5055K4328r0338L7155N8458
$$ -123894 -123173 2281 40344 60566 3164 -56951 -79702 -104757 -80429 -170767 -133612 -75154
21595g5154N149J10277j25091J8619O9701J2811m3953p6990r4392L2734K9207
$$ -75154 -70005 40272 -84819 -66200 3501 16312 -27641 -104631 -199023 -166289 -137082
21584a37082N6629n225n2229m135j113k1983P2709J11607N8804o2942o5088n0475
$$ -137082 -80453 -85678 -137907 -142042 -143155 -165138 -92429 19178 77982 15040 -50048 -100523
21572a00523n080K9458k7601o708l0847J9199j146p3396R1244R6734L5797J1408
$$ -100523 -105603 -76145 -103746 -110454 -141301 -122102 -123248 -196644 -105400 -8666 27131 38539
21560C8539m5629L7551Q926J9924j6182j8437j47073j31l6731L8256N6525J17345
$$ 38539 -7090 30461 39387 59311 43129 24692 -122381 -122512 -159243 -120987 -64462 52883
21548E2883k8891j0051r4000M64P5056r4984j38370J353m5651J04748L6519K553
$$ 52883 23992 13941 -80059 -79595 -4539 -99523 -237893 -236540 -282191 -177443 -140924 -138371
21536a38371M2731K253l884N8376P2087N5745J8776J7524M0166j70773j37812
$$ -138371 -95640 -93387 -97271 -38895 33192 88937 107713 125237 165403 -5370 -143182
21525a43182J1558N2370J3135R2285K6904j7343j52199L0180l2797N5143J00827
$$ -143182 -131624 -79254 -66119 26166 53070 35727 -116472 -86292 -119089 -63946 36881
21514C6881O7442j3358r7610k670J26989r9147J0160Q994J8403r5482j40444J6147
$$ 36881 104323 90965 -6645 -9315 117674 18527 28687 37681 56084 -39398 -179842 -163695
21502a63695R1957L0185o5879J35846L6426n4362N3174j8675o7987k7969k7399
$$ -163695 -71738 -41553 -107432 28414 64840 10478 63652 44977 -23010 -50979 -78378
21491g8378m2572J1134n0267P9275L3611J45494q914m3309m4445N421q379l3823
$$ -78378 -120950 -109816 -160083 -80808 -47197 98297 89383 46074 1629 7050 -1329 -35152
21479c5152N2711L3685K0860K090l0701m4316m2227j564j2869K0689q1944J5896
$$ -35152 17559 51244 72104 74194 43493 -823 -43050 -44614 -57483 -36794 -118738 -102842
21467a02842N9090M3991n2634J8815R1117O4210q6382j02698k7458j4470N3278
$$ -102842 -43752 239 -52395 -33580 57537 121747 35365 -67333 -94791 -109261 -55983
21456e5983J71863K345p2774j76676p3395L3022L5882P9080j4719j5717m4100
$$ -55983 115880 118225 45451 -131225 -204620 -171598 -135716 -56636 -71355 -87072 -131172
21445a31172N3428O3024j1158O1511P147j1070J3478l4688m4416M1053O3305l2353
$$ -131172 -77744 -14720 -25878 35633 42780 31710 45188 10500 -33916 7137 70442 38089
21433C8089p7616K02503j7729r5722L0972N2118K9246j30006R147l1406J01117
$$ 38089 -39527 162976 145247 49525 80497 132615 161861 31855 41002 9596 110713
21422A10713k877q6472J981J28184J3227K7222K1782l8126m1707n7460j55380
$$ 110713 107836 21364 23345 151529 164756 191978 213760 175634 133927 76467 -78913
21411g8913q8201J83842J48340n3253j2981j76890p9779p7279j5068M3902J39364
$$ -78913 -167114 16728 165068 111815 98834 -78056 -157835 -235114 -250182 -206280 -66916
21400f6916J0888p8465m3898K43061J33070L7828j11362j54873P1730L0825P1756
$$ -66916 -56028 -134493 -178391 64670 197740 235568 124206 -30667 41063 71888 143644
21389A43644J907J7497m9024o7550O5952L596p386o0406j3575l9688L840p393
$$ 143644 145551 163048 114024 46474 112426 116022 108636 48230 34655 -5033 -1193 -8586
21377h586m0500n2057J2494Q2161k6775p7858Q7794Q4828K3035j09723l3558M1183
$$ -8586 -49086 -101143 -88649 -6488 -33263 -111121 -23327 61501 84536 -25187 -58745 -17562
21365a7562P8153j99650k6006J56747O9174j4906j83624M3101J40751N2645M7961
$$ -17562 60591 -139059 -165065 -8318 60856 45950 -137674 -94573 46178 98823 146784
21354A46784l8703o6672n0076P2126L0526r4808j17530j44859q1402J2813R2830
$$ 146784 108081 41409 -8667 63459 93985 -823 -118353 -263212 -344614 -331801 -238971
21343b38971J59489l0952L4784J86668K7675o9848j43363j00287M8505J17642
$$ -238971 -79482 -110434 -75650 111018 138693 68845 -74518 -174805 -126300 -8658
21333h658j12874N4711O4235M8571P0025N4061k9733p9763o336m3763m7046N4317
$$ -8658 -121532 -66821 -2586 45985 116010 170071 140338 60575 54239 10476 -36570 17747
21321A7747N4166n6596j52704r2876J31361K01783k3268l7501j15079l1087M0338
$$ 17747 71913 15317 -137387 -230263 -98902 102881 79613 42112 -72967 -104054 -63716
21310f3716Q592l779K7716o2128j0828j5717R1051o2330q4571j3834N5169N0020
$$ -63716 -55124 -58903 -31187 -93315 -104143 -119860 -28809 -91139 -175710 -189544 -134375 -84355
21298h4355J2226l3752q176j5798L9816l245j45211m018J17641N6176O8959j28992
$$ -84355 -72129 -105881 -114057 -129855 -90039 -93284 -238495 -242513 -124872 -68696 263 -128729
21286a28729o1410J05455k8441m208J22087J65688M7105k03795j22600j14831
$$ -128729 -190139 -84684 -113125 -117333 4754 170442 217547 13752 -108848 -223679
21276b23679J11491Q3420j12430j65033k153Q9255m8280n2342J43446J04635J05338
$$ -223679 -112188 -28768 -141198 -306231 -308384 -219129 -267409 -319751 -176305 -71670 33668
21265C3668o0886q3754K2924P031M5631M2358k829R6087J4094m2056o1202k6983
$$ 33668 -27218 -110972 -88048 -81017 -35386 6972 4143 100230 114324 72268 11066 -15917
21253a5917Q3198K105p4573j16276J06768J16443J6605j08J4025j62554j26326
$$ -15917 67281 69386 -5187 -121463 -14695 101748 118353 118245 132270 -30284 -156610
21242a56610q9951O6401J53133R7286K6591N017q6545l4567J02942J5246p0227
$$ -156610 -246561 -180160 -27027 70259 96850 101867 15322 -19245 83697 98943 28716
21231B8716k3113j01680j1636j8347N2553J36296J19966l1608j16487p0543j289
$$ 28716 5603 -96077 -107713 -126060 -73507 62789 182755 151147 34660 -35883 -37172
21220c7172p546j48398l1233N1499P897P6631J02529J7283j2879j49370L6596
$$ -37172 -44718 -193116 -224349 -172850 -164953 -88322 14207 31490 18611 -130759 -94163
21209i4163N8873p5223J8749P1574j4754j45510J10265J78894J3022o8986k6407
$$ -94163 -35290 -110513 -91764 -20190 -34944 -180454 -70189 108705 121727 52741 26334
21198B6334O0560r9646m0075j04018n3955R3013K00295k5534j46291j47546m0486
$$ 26334 86894 -12752 -52827 -156845 -210800 -117787 82508 56974 -89317 -236863 -277349
21187b77349J39042M8429l2980K8664J6537R2728n705q3203J6121K0944n199P9146
$$ -277349 -138307 -89878 -122858 -94194 -77657 15071 9366 -73837 -57716 -36772 -41971 37175
21175C7175O1446k734j39647j15356n48M581N8722k968J58876n7678K884J10146
$$ 37175 98621 95887 -43760 -159116 -159664 -155083 -96361 -99329 59547 1869 4753 114899
21163A14899O7843l6457q8386j9209m6291R6120p336r1972k500R987j04274K2178
$$ 114899 182742 146285 57899 38690 -7601 88519 81183 -10789 -13289 -3302 -107576 -85398
21151h5398Q7289j3078J4415M2720j38956j50216J17459P3704M7492j2957r9338
$$ -85398 1891 -11187 3228 45948 -93008 -243224 -125765 -52061 -4569 -17526 -116864
21140a16864K1781P4580K8478k7887l5946N2336l3039m2219Q8905J8799p1841
$$ -116864 -95083 -20503 7975 -19912 -55858 -3522 -36561 -78780 10125 28924 -42917
21129d2917o3502N2644N788N3823J48777L0615r6087j37974M273r2608m457m6858
$$ -42917 -106419 -53775 -47987 5836 154613 185228 89141 -48833 -44560 -137168 -141625 -188483
21117a88483m6101L622J3600j15164J15473J26405M2665O0768J10590P2752k4339
$$ -188483 -234584 -230962 -217362 -332526 -217053 -90648 -47983 12785 123375 196127 171788
21106A71788j1432N2160p5073r0896p0795n2883q428P8658k9960J5158M5719J9330
$$ 171788 160356 212516 137443 46547 -24248 -77131 -85559 -6901 -36861 -21703 24016 43346
21094D3346j4912p2009Q3393J66902l4515r3431j51875o0607Q3847J58239n9064
$$ 43346 28434 -43575 39818 206720 172205 78774 -73101 -133708 -49861 108378 49314
21083D9314j28527o8565l6910J0878j39999N321R180k8061R4526J13635n8220
$$ 49314 -79213 -147778 -184688 -173810 -313809 -308488 -299308 -327369 -232843 -119208 -177428
21072a77428M245J3638J29683O8702o9818r7943Q4516J10492r1930L9393Q4742
$$ -177428 -173183 -159545 -29862 38840 -30978 -128921 -44405 66087 -25843 13550 98292
21061I8292n5038o7404k4455p5444k6736J1786O9332R4426N4755R866p9372m7839
$$ 98292 43254 -24150 -48605 -124049 -150785 -138999 -69667 24759 79514 89380 10008 -37831
21049c7831q8164o1476N0366L8505o4873j35085J04811J17148J36431j3485o7814
$$ -37831 -125995 -187471 -137105 -98600 -163473 -298558 -193747 -76599 59832 46347 -21467
21038b1467O2419J04461j14486j50082K638Q417j800J13346O9581m3505o7826
$$ -21467 40952 145413 30927 -119155 -116517 -108100 -109900 3446 73027 29522 -38304
21027c8304P4373M0677j6765K9230j40209l8766M0317J36112N3383r1217j37318
$$ -38304 36069 76746 59981 89211 -50998 -89764 -49447 86665 140048 48831 -88487
21016h8487o3009R1028K6356R3797N2875J8161p1573j05326M4165J6971n7733
$$ -88487 -151496 -60468 -34112 59685 112560 130721 59148 -46178 -2013 14958 -42775
21005d2775L7556k8780L3627R6811o8499l1435q6095M2664K3365l415R0997l6201
$$ -42775 -5219 -33999 -372 96439 27940 -3495 -89590 -46926 -23561 -26976 64021 27820
20993B7820r6004p9357K28624Q8520q6818j01550j1581j7722j06789J38019J6224
$$ 27820 -68184 -147541 81083 169603 82785 -18765 -30346 -48068 -154857 -16838 -614
20982f14j14212L4327p8484P2939J12102l3952M9446p7769n8908M7013L1787P7601
$$ -614 -114826 -80499 -158983 -86044 26058 -7894 41552 -36217 -95125 -48112 -16325 61276
20970F1276n8636J314M1360q7316r6188O6449M4887N6494J465K3595l2541j86277
$$ 61276 2640 3954 45314 -42002 -138190 -71741 -26854 29640 31105 54700 22159 -164118
20958a64118p3653Q0570J6467L7913j0089L1745M8783r565r0880j28435P9084
$$ -164118 -237771 -157201 -140734 -102821 -112910 -81165 -32382 -41947 -132827 -261262 -182178
20947a82178N1744J095M8359K8157l2483P3487R6565o5839j15815j08823o2895
$$ -182178 -130434 -129339 -80980 -52823 -85306 -11819 84746 18907 -96908 -205731 -268626
20936b68626J50744K21448J31515j21859j13340O3988j11946o2004K2834K1209
$$ -268626 -117882 103566 235081 113222 -118 63870 -48076 -110080 -87246 -66037
20926f6037n7135M9680l9936K0089M519L1118P6824Q821P8225k2184q8515j29128
$$ -66037 -123172 -73492 -113428 -93339 -88820 -57702 19122 27943 106168 83984 -4531 -133659
20914a33659m2358P6750P5368J9686L8668k2827p7898J4191J30535q163o391q50
$$ -133659 -176017 -99267 -23899 -4213 34455 11628 -66270 -52079 78456 70293 63902 63052
20902F3052k3959O4448l6692n6903N7689j4312j11329L9233j7095P102j8472o3777
$$ 63052 39093 103541 66849 9946 67635 53323 -58006 -18773 -35868 -28766 -47238 -111015
20890a11015l7072Q6213J61059j2185k0412j12351j9448r06N7210j8489l5207
$$ -111015 -148087 -61874 99185 87000 66588 -45763 -65211 -66117 -8907 -27396 -62603
20879f2603j3797k050J04005r6805L5102p51p8348k423L0263j741K8413n8844
$$ -62603 -76400 -78450 25555 -71250 -36148 -36899 -115247 -117670 -87407 -89148 -60735 -119579
20867a19579M9869L8710o050R1610N9944j01046j69088o6383L6220L7523K2240
$$ -119579 -69710 -31000 -37050 54560 114504 13458 -155630 -222013 -185793 -148270 -126030
20856a26030J06590O7568n2183m7534q2841N3453M1824J05309M4591M0734j7695
$$ -126030 -19440 48128 -4055 -51589 -134430 -80977 -39153 66156 110747 151481 133786
20845A33786L2953L0375k5098n4772n4843r2327J9176M5856P7098k9878K64l9932
$$ 133786 166739 197114 172016 117244 62401 -29926 -10750 35106 112204 82326 82590 42658
20833D2658j78376q5077J8511O6248K1137N9869N6521j4841R47l9273M867j5043
$$ 42658 -135718 -220795 -202284 -136036 -114899 -55030 1491 -13350 -12403 -51676 -46809 -61852
20821f1852q1316p8109j3054K2591N5739K4130J03098M0653n101L6096N6697q1269
$$ -61852 -143168 -221277 -234331 -211740 -156001 -131871 -28773 11880 6779 42875 99572 18303
20809A8303q134Q2298o5309q1961L992J1881r8963r601l5628n4499N1091P0555
$$ 18303 10169 92467 27158 -54803 -50811 -38930 -137893 -147494 -183122 -237621 -186530 -115975
20797a15975L7811P5721l2747j4891J16017K856J003O8874m1704q1334n9066N829
$$ -115975 -78164 -2443 -35190 -50081 65936 68792 69795 138669 96965 15631 -43435 -37606
20785c7606j18273L1878j7649J5618K8362m866l4851n4382K638M546m7647n8372
$$ -37606 -155879 -124001 -141650 -126032 -97670 -102536 -137387 -191769 -189131 -184585 -232232 -290604
20773b90604j3978J13120P7252J4946J8539j9522l7859P9635q469k8079N6267
$$ -290604 -304582 -191462 -114210 -99264 -80725 -100247 -138106 -58471 -66940 -95019 -38752
20762c8752j1376N8122J06191L7682p3665M478j3091K8310o5063k4441K8471K5452
$$ -38752 -50128 7994 114185 151867 78202 82680 69589 97899 32836 8395 36866 62318
20750F2318p4368k9215k8896j22032m7126J07843P7650J16437N6865J3642m678
$$ 62318 -12050 -41265 -70161 -192193 -239319 -131476 -53826 62611 119476 133118 128440
20739A28440q1293j40464j03938Q4371m6593l0299Q5438J91284k060K732r2108
$$ 128440 47147 -93317 -197255 -112884 -159477 -189776 -104338 86946 84886 87618 -4490
20728d490k2798n7516j01647j9308L1913N1768p4247l6869M2972J3505M0052l3832
$$ -4490 -27288 -84804 -186451 -205759 -173846 -122078 -196325 -233194 -190222 -176717 -136665 -170497
20716a70497K4310j45613n8812J57957M1378n9861j01676J9222k4653M8175K1497
$$ -170497 -146187 -291800 -350612 -192655 -151277 -211138 -312814 -293592 -318245 -270070 -248573
20705b48573K1175m8983P585P6611N6446O9174L5203l9210j4141N6999l5878j9786
$$ -248573 -227398 -276381 -268796 -192185 -135739 -66565 -31362 -70572 -84713 -27714 -63592 -83378
20693h3378m6487j31117N7111J57042m9340j44009l3668q0024J2038K42593Q4705
$$ -83378 -129865 -260982 -203871 -46829 -96169 -240178 -273846 -353870 -341832 -99239 -14534
20682a4534L8916J6371m5702l868N1566j4648O1689j52625r5663l7435R1964O9023
$$ -14534 24382 40753 -4949 -8817 42749 28101 89790 -62835 -158498 -195933 -103969 -34946
20670c4946l0718J4698k6930M7153K2716k033Q4414j06123K7805N7908q525k09697
$$ -34946 -65664 -50966 -77896 -30743 -8027 -10060 74354 -31769 -3964 53944 45419 -164278
20658a64278N4961n011J8382J42996J77327K0964j79290j71182j24787n899J22326
$$ -164278 -109317 -114328 -95946 47050 224377 245341 66051 -105131 -229918 -235817 -113491
20647a13491K1004o7146r9671M4307N7924K877o3448P5645J08413L3049M6116
$$ -113491 -92487 -159633 -259304 -214997 -157073 -154196 -217644 -141999 -33586 -537 45579
20636D5579p686j00943r308M166J9686N0619l3972j58504l7131J25913J2604k9843
$$ 45579 37893 -63050 -72358 -68192 -48506 2113 -31859 -190363 -227494 -101581 -88977 -118820
20624a18820J10338m2848l5951N5523J41802k4735j83968l251J5089l4547M9518
$$ -118820 -8482 -51330 -87281 -31758 110044 85309 -98659 -101910 -86821 -121368 -71850
20613g1850J11266j79369p6695J6732J07069J55224N2481q8710o0912j6081k9334
$$ -71850 39416 -139953 -216648 -199916 -92847 62377 114858 26148 -34764 -50845 -80179
20602h0179o8494K7818M0273k2086L1874L5473m885P5474k925j6060j11445m2732
$$ -80179 -148673 -120855 -80582 -102668 -70794 -35321 -40206 35268 32343 16283 -95162 -137894
20590a37894Q9650N7350j9327o5760J4494l1447o3977p4116J8990k4884m0291
$$ -137894 -48244 9106 -10221 -75981 -61487 -92934 -156911 -231027 -212037 -236921 -277212
20579b77212J517Q5865P0306k5127j1600J8082N7539O8903n2122N4232N7705l7008
$$ -277212 -275695 -189830 -119524 -144651 -156251 -138169 -80630 -11727 -63849 -9617 48088 11080
20567A1080p1535O8883r36q974p7029m3885k7727K0805k070Q7290k2055q7292
$$ 11080 -60455 8428 7492 -1482 -78511 -122396 -150123 -129318 -131388 -44098 -66153 -153445
20555a53445o079J6771M3375L7796K4806M4588L1518J2456J8274J3247j62579
$$ -153445 -159524 -142753 -99378 -61582 -36776 7812 39330 51786 70060 83307 -79272
20544g9272j8096J6361M0676m3503p116L9718J0846M82j2869n3897j2327j8305
$$ -79272 -97368 -81007 -40331 -83834 -90950 -51232 -40386 -39904 -52773 -106670 -118997 -137302
20532a37302Q3821m716p074J0241m038n3698R884M3865J1555m1986j4693M4359
$$ -137302 -53481 -58197 -65271 -55030 -59068 -112766 -102882 -59017 -47462 -89448 -104141 -59782
20520e9782Q5166j3549k8443j0542N1298K2942l6997J7638j7647K6209q8971N094
$$ -59782 25384 11835 -16608 -27150 24148 47090 10093 27731 10084 36293 -52678 -47584
20508d7584L5266j15689o9093R4267Q1491P7751J5169j32388n1354m4609l653
$$ -47584 -12318 -128007 -197100 -102833 -21342 56409 71578 -60810 -112164 -156773 -160426
20497a60426N4252J1935l2763J7547o8364j26408n5340J80033R8088m0525P7786
$$ -160426 -106174 -94239 -127002 -109455 -177819 -304227 -359567 -179534 -81446 -121971 -44185
20486d4185R1803l3740l6134o2603j2447J19969M1009N1153N8663j451q0117k9192
$$ -44185 47618 13878 -22256 -84859 -97306 22663 63672 114825 173488 172037 91920 62728
20474F2728J2294j27422q3755P6559J71064m8563j33910j7485J27588P2805j7669
$$ 62728 75022 -52400 -136155 -59596 111468 62905 -71005 -88490 39098 111903 94234
20463I4234J3788p1502q3791O1552J15929N339k8736p4229j24494K591J9339k6448
$$ 94234 108022 36520 -47271 14281 130210 135549 106813 32584 -91910 -89319 -69980 -96428
20451i6428j51623q4166J42621M0917m588K5625J11390J01571P195j19214M1061
$$ -96428 -248051 -332217 -189596 -148679 -153267 -127642 -16252 85319 92514 -26700 14361
20440A4361J502n7654j9092M1858N831l6138N203m5034J39360M5957O9312p3705
$$ 14361 15863 -41791 -60883 -19025 -13194 -49332 -44129 -89163 50197 96154 165466 91761
20428I1761o1263k7292J9440o1149o3374l5586K7003N1100p9933O5317L3220j38276
$$ 91761 30498 3206 22646 -38503 -101877 -137463 -110460 -59360 -139293 -73976 -40756 -179032
20416a79032o9488Q871k1737j6730J06610N5462K2870j757K20059K1440o9580
$$ -179032 -248520 -239649 -261386 -278116 -171506 -116044 -93174 -94931 125128 146568 76988
20405G6988P399j10857r9337o9337J262R1979J56825N0558j02310j45730J0515
$$ 76988 84387 -26470 -125807 -195144 -193882 -101903 54922 105480 3170 -142560 -132045
20394a32045L7992J41779J10193j12216r8404j0173L5291k6856L1047P26j9947
$$ -132045 -94053 47726 157919 45703 -52701 -62874 -27583 -54439 -23392 -22666 -42613
20383d2613n3986J02028J21616j07590l2318K22423m3575j44174K6761N6239j45842
$$ -42613 -96599 5429 127045 19455 -12863 209560 165985 21811 48572 104811 -41031
20372d1031j14408K9571O5031L3182K1674j53725p7950K9898k3172j2966R58K702
$$ -41031 -155439 -125868 -60837 -27655 -5981 -159706 -237656 -207758 -230930 -243896 -242938 -240236
20360b40236J18439J69533L2293r3899l4966m4707n4581M2438J60059R2807l4726
$$ -240236 -121797 47736 80029 -13870 -48836 -93543 -148124 -105686 54373 147180 112454
20349A12454P443J7033j9068q9363l9945j68374N6881J63395R5973Q5193j51213
$$ 112454 119897 136930 117862 28499 -11446 -179820 -122939 40456 136429 221622 70409
20338G0409k19353R8423O0109K2640j3388j7973p4112m6489p9060O8000P7148
$$ 70409 -148944 -50521 9588 32228 18840 867 -73245 -119734 -198794 -130794 -53646
20327e3646J50059P8518n4370j21111l2428J45270J14542p5761j20806l2780O0055
$$ -53646 96413 174931 120561 -550 -32978 112292 226834 151073 30267 -2513 57542
20316E7542M2700J3464l2847j05308j01851j25395O5376J32280J09289P323j60006
$$ 57542 100242 113706 80859 -24449 -126300 -251695 -186319 -54039 55250 62573 -97433
20305i7433j77300M84J24633K04461N7172K2334O0149L5481j72081k5031N8645
$$ -97433 -274733 -274249 -149616 54845 112017 134351 194500 229981 57900 32869 91514
20294I1514j02004k0062o689O8186j1126j5712J04627p7152j23714O4330J29477
$$ 91514 -10490 -30552 -37241 30945 19819 4107 108734 31582 -92132 -27802 101675
20283A01675p6070p7692j34300O5617p823L509m0216N8664P4229m7374k4200q5340
$$ 101675 25605 -52087 -186387 -120770 -128593 -125084 -165300 -106636 -32407 -79781 -103981 -189321
20271a89321Q5923N0975J7586m1567P3099N4538m0857j0003J8098j7128o6374
$$ -189321 -103398 -52423 -34837 -76404 -3305 51233 10376 373 18471 1343 -65031
20260f5031N2558M1415J8084j057j32031m6324k4555k8275J60720K01136P1734
$$ -65031 -12473 28942 47026 45969 -86062 -132386 -156941 -185216 -24496 176640 248374
20249B48374o7863j37196r103j23553K6392Q0312L7697r2136j4203Q8005k6499
$$ 248374 180511 43315 34212 -89341 -62949 17363 55060 -37076 -51279 36726 10227
20238A0227k2783J06155N4746j36638J3556o2101m68J530K9492l6858k604R6163
$$ 10227 -12556 93599 148345 11707 25263 -36838 -37306 -35776 -6284 -43142 -45746 50417
20226E0417J1292l9813j5436l12Q6504k4498l9554p893j14212O3123J6119K1119
$$ 50417 61709 21896 6460 6148 92652 68154 28600 20707 -93505 -30382 -14263 6856
20214F856J16775n6551o3464j3218K8498P74m3350O6614K1973j06550n9341n1345
$$ 6856 123631 67080 3616 -9602 18896 19670 -23680 42934 64907 -41643 -100984 -152329
20202a52329K3645M5463R5183K1337l3973m4247j9030K0782k1067L1347J3750
$$ -152329 -128684 -83221 11962 33299 -674 -44921 -63951 -43169 -64236 -32889 -19139
20191a9139M7586M2151P3892P1236J4424o3600j31607j7639J9293o9216m1097
$$ -19139 28447 70598 144490 215726 230150 166550 34943 17304 36597 -32619 -73716
20180g3716r4868K9305P3034L5737P0736p9531l5185k651L2873P5071n5163j08949
$$ -73716 -168584 -139279 -66245 -30508 40228 -39303 -74488 -77139 -44266 30805 -24358 -133307
20168a33307l5934Q0224J11169J1194m0145Q7046l5887q4994l5111p0249l6231
$$ -133307 -169241 -89017 22152 33346 -6799 80247 44360 -40634 -75745 -145994 -182225
20157a82225P7734j9992o0080M3049J38536m3960N3430M0404m4740l4197M4473
$$ -182225 -104491 -124483 -184563 -141514 -2978 -46938 6492 46896 2156 -32041 12432
20146A2432J05701k5747k6182J8445j23501K1061K7141j6813M8646m1415m7962
$$ 12432 118133 92386 66204 84649 -38852 -17791 9350 -7463 41183 -232 -48194
20135d8194M5438Q7217P9886r0499K1601M9942J6403p4350p2642Q703j54773r4310
$$ -48194 -2756 84461 164347 73848 95449 145391 161794 87444 14802 23505 -131268 -225578
20123b25578R1618J68081J29419J9323j48276L3186J1306j0952m3137R3738P903
$$ -225578 -133960 34121 163540 182863 34587 67773 79079 68127 24990 118728 126631
20112A26631M1248l0159n8614J28612n4532q2361q4200N828J2624l8574J44101
$$ 126631 167879 137720 79106 207718 153186 70825 -13375 -7547 5077 -33497 110604
20101A10604n7722m6351J4341m1628j5512p6113k8169N1302O1100J11251O9622
$$ 110604 52882 6531 20872 -20756 -36268 -112381 -140550 -89248 -28148 83103 152725
20090A52725Q4956J0178j62485K060L5176N832J8556P4514p8046M5801J22501
$$ 152725 237681 247859 85374 87434 122610 128442 146998 221512 143466 189267 311768
20079C11768j6627j7914P8843N2297J11028j55M3495J21576J15184p7832N3610
$$ 311768 295141 277227 356070 408367 519395 519240 562735 684311 799495 721663 775273
20068G75273l9436J53974J53589J29007M7525J6731r8413K1271J79402P0912j2395
$$ 775273 735837 889811 1043400 1172407 1219932 1236663 1138250 1159521 1338923 1409835 1397440
20057A397440o9122j17541r7497m0986P1660j374r9845q0499q2336j35602J53391
$$ 1397440 1328318 1210777 1113280 1072294 1143954 1142580 1042735 962236 879900 744298 897689
20046H97689K5775j57323j49221j51583r7124O3757k6713n2273j4355q6809r0723
$$ 897689 923464 766141 616920 465337 368213 431970 405257 352984 338629 251820 161097
20035A61097q2429M290J7478J26703O3543K9556J22914Q0070k0998m5511N0351
$$ 161097 78668 82958 100436 227139 290682 320238 443152 523222 502224 456713 507064
20024E07064q9362r235J35372J15477l0061P9821J40452Q5156K16868J53142L8554
$$ 507064 417702 408467 543839 659316 629255 709076 849528 934684 1151552 1304694 1343248
20013A343248J41519M8577q3444R5639m1243j34624K0292J04170M1512k4844m9756
$$ 1343248 1484767 1533344 1449900 1545539 1504296 1369672 1389964 1494134 1535646 1510802 1461046
20002A461046p4530j57735k44890j11398N752J58052m1797j28811r7163r7382
$$ 1461046 1386516 1228781 983891 872493 878245 1036297 994500 865689 768526 671144
19992F71144o5229J32719o2134q8219q3501j35024m3239n9288m6305j20272q4669
$$ 671144 605915 738634 676500 588281 504780 369756 326517 267229 220924 100652 15983
19981A5983J7148j8630K4128M650K4276p568k4478l6048O7431L0101R417k7516
$$ 15983 33131 14501 38629 43279 67555 59987 35509 -539 66892 96993 106410 78894
19969G8894r6488p6782r6643R6282P6315K2203Q318k4728R1796J0555m0142L5937
$$ 78894 -17594 -94376 -191019 -94737 -18422 3781 12099 -12629 79167 89722 49580 85517
19957H5517M8826K849J19791M2523m1026M45p0995k2905J35882P9775q3542k53090
$$ 85517 134343 137192 256983 299506 258480 258925 187930 165025 300907 380682 297140 44050
19945D4050l9477J3914P8985J3450M8107N8891o4591q2960l6783m0311n1102M8279
$$ 44050 4573 18487 97472 110922 159029 217920 153329 70369 33586 -6725 -57827 -9548
19933i548j2992n2130K3894P4467J58843R830j02889j6907Q2555Q0000l8336j24046
$$ -9548 -22540 -74670 -50776 23691 182534 192364 89475 72568 155123 235123 196787 72741
19921G2741j4456l9190r2002l8460k3695l5987N5682J36190j1945P1764j81556
$$ 72741 58285 19095 -72907 -111367 -135062 -171049 -115367 20823 8878 80642 -100914
19910a00914p7137J49700J84354N5244p300n7121k3392o5269p0422j3814J08616
$$ -100914 -178051 -28351 156003 211247 203947 146826 123434 58165 -12257 -26071 82545
19899H2545R0014o3790j0444P2660O9319R529j8035l3306o316M7868q689j15076
$$ 82545 172559 108769 98325 170985 240304 249833 231798 198492 192176 240044 231355 116279
19887A16279N4561R8880o67q4627r7986J0275L0725l6015p0835L8716N9041O350
$$ 116279 170840 269720 269053 184426 86440 96715 127440 91425 20590 59306 118347 124697
19875A24697r0496N2328L9261p3496K0386K5245m9126O2627p4143q6226r5915
$$ 124697 34201 86529 125790 52294 72680 97925 48799 111426 37283 -48943 -144858
19864a44858r398J22614R5716L1540m4047m0109R0356N955Q7392r3930j64155
$$ -144858 -154256 -31642 64074 95614 51567 11458 101814 107769 195161 101231 -62924
19853f2924n5611O8190K6902J3398l5808M0387J73340L0253p6987k92Q660r9310
$$ -62924 -118535 -50345 -23443 -10045 -45853 -5466 167874 198127 121140 120848 129508 30198
19841C0198N2908L6027L0818l3404K5842M2575N2793J6328N8200j21053P04N946
$$ 30198 83106 119133 149951 116547 142389 184964 237757 254085 312285 191232 191936 197882
19829A97882q0514l9991q1266q418j7458P2165O8687Q3946J0828J1888p2094n6582
$$ 197882 117368 77377 -3889 -12307 -29765 42400 111087 195033 205861 217749 145655 89073
19817H9073p1783M0119k4503P0287J44276L1995q8343m5821q0140P0588l1057
$$ 89073 17290 57409 32906 103193 247469 279464 191121 145300 65160 135748 104691
19806A04691o6780p5100K7837J20375N0463j03372j04888J47912J81997J19376
$$ 104691 37911 -37189 -9352 111023 161486 58114 -46774 101138 283135 402511
19796D02511K40381J76429k07987l12391j23844k0089L6803j40663j19370J41154
$$ 402511 642892 819321 611334 298943 175099 155010 191813 51150 -68220 72934
19786G2934K30287n333r3263L729J06537N3113J8020L5552K361q4860M3096K6726
$$ 72934 303221 297888 204625 208354 314891 368004 386024 421576 423937 339077 382173 408899
19774D08899l1281j02024M7131n3709o9084O386M7086R1141J32580m2701l3379
$$ 408899 377618 275594 322725 269016 199932 206318 253404 344545 477125 434424 401045
19763D01045r7189j34046J2490k8036j03723l6578P1128n0881m0486J9925P5485
$$ 401045 303856 169810 182300 154264 50541 13963 85091 34210 -6276 13649 89134
19752H9134j4159m6538M4235P426j3587k1070M8866R2566l1692l3249k602q0300
$$ 89134 74975 28437 72672 80098 66511 45441 94307 186873 155181 121932 119330 39030
19740C9030o5125K950K05201J47711J8543o699N296l1682p2167P1506K7249J7585
$$ 39030 -26095 -23145 182056 329767 348310 341611 346907 315225 243058 314564 341813 359398
19728C59398o816n2309p2092N4657K6524q1092o9416l861J05172J12515J274o8962
$$ 359398 352582 300273 228181 282838 309362 228270 158854 154993 260165 372680 373954 304992
19716C04992L6235P8096J345j444P245n634j84911j19127N9542K4291P4667p830
$$ 304992 341227 419323 420668 419224 426469 420835 235924 116797 176339 200630 275297 267467
19704B67467j93091M3990M5800J28652L1731j29412j00053j22049J01725J28517
$$ 267467 74376 118366 164166 292818 324549 195137 95084 -26965 74760 203277
19694B03277K2820j0561K5817p8419o4990L6970O192M9726K2518J32280J26916
$$ 203277 226097 215536 241353 162934 97944 134914 141106 190832 213350 345630 472546
19683D72546r226l768M5537q5049k0572j5020j2811R997L9874k6018j7349N5660
$$ 472546 463320 459552 505089 420040 399468 384448 371637 381634 421508 395490 378141 433801
19671D33801oj2069O5642K5193J46098L5549L3682J49451J21455J58914J94494
$$ 433801 433795 421726 487368 512561 658659 694208 727890 877341 998796 1157710 1352204
19660A352204J2180q877M95j815J81952K5034R17J27284J50167J6230N632J2231
$$ 1352204 1364384 1355507 1356002 1354187 1536139 1561173 1562090 1689374 1839541 1855771 1861403 1873634
19648A873634o801j7273j28601j18435j18132j9633l1528K844l0368j7963j9397
$$ 1873634 1866833 1849560 1720959 1602524 1484392 1464759 1433231 1436075 1405707 1387744 1368347
19637A368347r8245j14524m3744l0189J38149k0344q1011N5225m2461k7673L1335
$$ 1368347 1270102 1155578 1111834 1081645 1219794 1199450 1118439 1173664 1131203 1103530 1134865
19626A134865R830K3140o8094r2300p480J45707J60818J89383J29802J3776J16253
$$ 1134865 1144695 1167835 1099741 1007441 999961 1145668 1306486 1495869 1625671 1639447 1755700
19615A755700J25476N8835J10851K19557J31245J1834m3094J10685K46145K15507
$$ 1755700 1881176 1940011 2050862 2270419 2401664 2413498 2370404 2481089 2727234 2942741
19605B942741J35998J74647J08992J84498Q2047j3530N9473L1605j56638n6979
$$ 2942741 3078739 3253386 3362378 3546876 3628923 3615393 3674866 3706471 3549833 3492854
19595C492854j1996J7078J9298p9089k0237R5098q7180r9977j99307r0748j62385
$$ 3492854 3480858 3497936 3517234 3438145 3417908 3513006 3425826 3325849 3126542 3035794 2873409
19584B873409j93059j52406j7476J9738K4432J20495J45558J55264Q1573J36107
$$ 2873409 2680350 2527944 2510468 2530206 2554638 2675133 2820691 2975955 3057528 3193635
19574C193635J49969K94509L39678L42373L85604K80862L55311O18397N04027
$$ 3193635 3343604 3638113 3977791 4320164 4705768 4986630 5341941 5960338 6464365
19565F464365M84843O37929Q10342J206030J492392J546758J750813K340923K623857
$$ 6464365 6949208 7587137 8397479 9603509 11095901 12642659 14393472 16734395 19358252
19556A9358252L044801L417176M259100N306852O000782N290952N280625P988584
$$ 19358252 22403053 25820229 30079329 35386181 41386963 46677915 51958540 59947124
19548E9947124J2283410J6079855J7155076J5038050J5666681K1587896K9655088
$$ 59947124 72230534 88310389 105465465 120503515 136170196 157758092 187413180
19541A87413180L3528659K0563271k55414J175564J4513078K0987846J1532219
$$ 187413180 220941839 241505110 241249696 242425260 256938338 277926184 289458403
19534B89458403j4759470k6226903j5147637o507485q491905j6186428k0279274
$$ 289458403 274698933 248472030 233324393 226816908 218325003 202138575 181859301
19527A81859301k0086308j8514958j5106769j1302411q895082r471775j2841553
$$ 181859301 161772993 143258035 128151266 116848855 107953773 98481998 85640445
19520H5640445j3306425j0251067o962408n124296n126628n239760m649022l367263
$$ 85640445 72334020 62082953 55120545 49996249 44869621 39629861 34980839 31613576
19512C1613576k066299r76249j45627L20685J153261K349159L607561M947616
$$ 31613576 29547277 28571028 28425401 28746086 29899347 32248506 35856067 40803683
19504D0803683N744432O434057P381281Q974279J1178271J3110177J2184843Q527972
$$ 40803683 46548115 52982172 60363453 69337732 80516003 93626180 105811023 114338995
19496A14338995Q454281J3555837J9857489K2887144K1376556K0702247K5069690
$$ 114338995 122793276 136349113 156206602 179093746 200470302 221172549 246242239
19489B46242239K7206116K2103135J8432020K2028896K2816458L042661j7077058
$$ 246242239 273448355 295551490 313983510 336012406 358828864 361871525 344794467
19482C44794467j7673660q498948j932329j4876651l9134262m1229669k8479793
$$ 344794467 327120807 318621859 316689530 301812879 262678617 221448948 192969155
19475A92969155j7660860j5569155k1948235k4624025j9096357j2431813q631234
$$ 192969155 175308295 159739140 137790905 113166880 94070523 81638710 73007476
19468G3007476r020857j0210774q563030o108738m490985l910082m024517l736581
$$ 73007476 63986619 53775845 45212815 39104077 34613092 30703010 26678493 22941912
19460B2941912k970237k387017j922101j662615j200184j046344q36618p43626
$$ 22941912 19971675 17584658 15662557 13999942 12799758 11753414 10916796 10173170
19452A0173170q47412q23843o58085o08260l65983m03404m83473n86500m19508
$$ 10173170 9325758 8501915 7843830 7235570 6869587 6466183 5982710 5396210 4976702
19443D976702l76220k25742k14165l36875k76559J9329j40195j31750p9593p0649
$$ 4976702 4600482 4374740 4160575 3823700 3547141 3566470 3426275 3294525 3214932 3144283
19433C144283k8158o5305l9615P375O3215n4366J74422P2800p3144j33134m6723
$$ 3144283 3116125 3050820 3011205 3018580 3081795 3027429 3201851 3274651 3201507 3068373 3021650
19422C021650n3349k4800q8714j59354j8157j06695j74789o4941j06709k29834
$$ 3021650 2968301 2943501 2854787 2695433 2677276 2570581 2395792 2330851 2224142 1994308
19412A994308j70656j20k6973j36994N1091O6211j02002k09872m6033L9394K7869
$$ 1994308 1823652 1823532 1796559 1659565 1710656 1776867 1674865 1464993 1418960 1458354 1486223
19401A486223R5838r7977k56213k16567J36933Q5274j11436p4926J0P5162p2623
$$ 1486223 1582061 1484084 1227871 1011304 1148237 1233511 1122075 1047149 1047159 1122321 1049698
19390A049698N1389J07807l8438P4759m9786q7082Q1867R2556J35506J2677M4438
$$ 1049698 1101087 1208894 1170456 1245215 1195429 1108347 1190214 1282770 1418276 1430953 1475391
19379A475391J79197O3950J00598M5628J29919J91481R4243O0332J36420K2303
$$ 1475391 1654588 1718538 1819136 1864764 1994683 2186164 2280407 2340739 2477159 2499462
19369B499462j12003j57279m008m7077J5783k08840k71941j17676K7766J59622
$$ 2499462 2387459 2230180 2226172 2179095 2194878 1986038 1714097 1596421 1624187 1783809
19359A783809J41865l9258k98713l14391j76167p7250p2693n3637J3093r6620
$$ 1783809 1925674 1886416 1587703 1273312 1097145 1019895 947202 893565 906658 810038
19349H10038j34384l9675O3755J12652J14654K7472j7283j26605r5422K1278r5856
$$ 810038 675654 635979 699734 812386 927040 954512 937229 810624 715202 736480 640624
19338F40624r8478m6231J0156R1177M1493l6802m4551k2835r9371m819J30310
$$ 640624 542146 495915 506071 597248 638741 601939 557388 534553 435182 430363 560673
19327E60673r82k8852n7375J14573k5837j07104L7158M4674q7587o9393n1261
$$ 560673 559691 530839 473464 588037 562200 455096 492254 536928 449341 379948 328687
19316C28687q0606n0687K4990J27676J07674n180j18614k4180n913L7920l2591
$$ 328687 248081 197394 222384 350060 457734 452554 333940 309760 303847 341767 309176
19305C09176O2468K053k7564o4681P5655J99745J27359R9549k4837j25563n3283
$$ 309176 371644 373697 346133 281452 357107 556852 684211 783760 758923 633360 580077
19294E80077L572N073N2856L095l0754l7417L9191O7657J6611J84184J33107O0932
$$ 580077 583649 588722 641578 644673 613919 576502 615693 683350 699961 884145 1017252 1078184
19282A078184J46248J1231j9962j15316j00110j80752o7536M1668J6807N6017
$$ 1078184 1224432 1235663 1215701 1100385 1000275 819523 751987 793655 810462 866479
19272H66479k1957l7762j56675o2234j34338j32153Q1240J12829Q7320k4899j27331
$$ 866479 844522 806760 650085 587851 453513 321360 402600 515429 602749 577850 450519
19261D50519k4549j18220j33422o9426N3619J50826J55337k5254m0482j4126k3428
$$ 450519 425970 307750 174328 104902 158521 309347 464684 439430 398948 384822 361394
19250C61394J42992R3704n9178L901J15931J13048M5578R1566J53598M7975j6662
$$ 361394 504386 598090 538912 542813 658744 771792 817370 908936 1062534 1110509 1093847
19239A093847K4610n1771j5985M7771k6372m3264J63593j8594M065J04845q38
$$ 1093847 1118457 1066686 1050701 1098472 1072100 1028836 1192429 1173835 1177900 1282745 1281907
19228A281907k5361m5221j10275j8098M672p1120j44883r4257L1844l4832j26922
$$ 1281907 1256546 1211325 1101050 1082952 1087624 1016504 871621 777364 809208 774376 647454
19217F47454N3712J07337J6107k1885o0079p4114N0064K4750m0662m0568O7962
$$ 647454 701166 808503 824610 802725 742646 668532 718596 743346 702684 662116 730078
19206G30078N926Q1020J35758o9387P0023K9979p103j01401R6770L6622N2504
$$ 730078 736004 817024 952782 883395 953418 983397 976294 874893 971663 1008285 1060789
19195A060789O3036P5577J04478K4952K966m0710Q97M723Q184L2740J048N9047
$$ 1060789 1123825 1199402 1303880 1328832 1331798 1291088 1291985 1296708 1304892 1337632 1338680 1397727
19183A397727l3147o2361R7763P1023P3007J52861j8483l3535J24378J64843n421
$$ 1397727 1364580 1302219 1399982 1471005 1544012 1696873 1678390 1644855 1769233 1934076 1928655
19172A928655N7840O3936Q2007m7888r4882N9713J49159J12114J22639J4386K64019
$$ 1928655 1986495 2050431 2132438 2084550 1989668 2049381 2198540 2310654 2433293 2447679 2711698
19161B711698K03894L86997K72437K69171L93919N45414N88434N58781O34290
$$ 2711698 2915592 3302589 3575026 3844197 4238116 4783530 5371964 5930745 6565035
19152F565035P06138Q10051R13746Q98995J115176J246014J548243K029354K579837
$$ 6565035 7271173 8081224 8994970 9893965 11009141 12255155 13803398 15832752 18412589
19143A8412589L380771M312461M839297N016597N811875P678201R429181Q564514
$$ 18412589 21793360 26105821 30945118 35961715 41773590 49451791 58880972 67445486
19135F7445486P294667J0153678J6513778K2866178K5646693K5024628K5281180
$$ 67445486 74740153 84893831 101407609 124273787 149920480 174945108 200226288
19128B00226288L2832312M4885296M7036811K4303790M020638J1715278J8672690
$$ 200226288 233058600 277943896 324980707 349284497 353305135 365020413 383693103
19121C83693103N030182k3529386l1959417k4730865k5615762l0911968l0509047
$$ 383693103 388723285 365193899 333234482 308503617 282887855 251975887 221466840
19114B21466840k2861333j6273516j5834805j7706144j4770135r657969q177397
$$ 221466840 198605507 182331991 166497186 148791042 134020907 124362938 116185541
19107A16185541j1753386j4490826j3301911j0824376r365571q206771o850560
$$ 116185541 104432155 89941329 76639418 65815042 56449471 48242700 41392140
19100D1392140n152107l680102k532338j589965j006214n42173L9811P14751J502671
$$ 41392140 36240033 32559931 30027593 28437628 27431414 26889241 26929052 27643803 29146474
19091B9146474K554354M061307N511946O469912O903402P744925J0224046J2655396
$$ 29146474 31700828 35762135 41274081 47743993 54647395 62392320 72616366 85271762
19083H5271762J2598377R143553Q254911J2300402J6261993J6102621J4827636
$$ 85271762 97870139 107013692 115268603 127569005 143830998 159933619 174761255
19076A74761255J9150389K3254269J8749150J2885430J6207867K6108627K0009070
$$ 174761255 193911644 217165913 235915063 248800493 265008360 291116987 311126057
19069C11126057p379099k0484298j2218601m033383j7996081l7377914l5558241
$$ 311126057 303746958 283262660 271044059 267010676 249014595 211636681 176078440
19062A76078440k6515619k1508319j9036637j6270537j4002409j1101206p476034
$$ 176078440 149562821 128054502 109017865 92747328 78744919 67643713 60167679
19055F0167679n047853n000153o279932o129844n181252m622273l979631l240175
$$ 60167679 55119826 50119673 43839741 37709897 32528645 27906372 23926741 20686566
19047B0686566k681615k152663j795551j486514j152605r60859q47090q62490
$$ 20686566 18004951 15852288 14056737 12570223 11417618 10456759 9609669 8747179
19039H747179q71405p10269p71639n20145k82366l42178m60484l12704k93840
$$ 8747179 7875774 7165505 6393866 5873721 5591355 5249177 4788693 4475989 4182149
19030D182149k96585j95901k66879k17642k37551r4264Q6717L0080L1877q9214
$$ 4182149 3885564 3689663 3422784 3205142 2967591 2873327 2960044 2990124 3022001 2932787
19020B932787n8461j28388L7288J15479L7452J43573J86143P915L5990J86276
$$ 2932787 2874326 2745938 2783226 2898705 2936157 3079730 3265873 3273788 3309778 3496054
19010C496054K95062K73044J60330L8279P3678J68798M6486l3770j98152j51618
$$ 3496054 3791116 4064160 4224490 4262769 4336447 4505245 4551731 4517961 4319809 4168191
19000D168191M9429l1318k91203k43154k42553j73231k51864j30789p3954k4494
$$ 4168191 4217620 4186302 3895099 3651945 3409392 3236161 2984297 2853508 2779554 2755060
18990B755060M8416o6802k56757l19930j42493j33662j52702j13974m6989j14158
$$ 2755060 2803476 2736674 2479917 2159987 2017494 1883832 1731130 1617156 1570167 1456009
18980A456009l8463N4163k6544J2269n337j23032q2402k00139n8196P440j61168
$$ 1456009 1417546 1471709 1445165 1457434 1452097 1329065 1246663 1046524 988328 995768 834600
18969H34600j42515Q9615k0783l4451M585n3636k0947J11632M0176N2916J11986
$$ 834600 692085 781700 760917 726466 731051 677415 656468 768100 808276 861192 973178
18958I73178Q6035L6362k4297J9718J9586q340J11683P7163O6663n0802r5286
$$ 973178 1059213 1095575 1071278 1090996 1110582 1102242 1213925 1291088 1357751 1306949 1211663
18947A211663j04211J2646K6882M9259L5820m1447n7392P6348k2241o0379l5014
$$ 1211663 1107452 1120098 1146980 1196239 1232059 1190612 1133220 1209568 1187327 1126948 1091934
18936A091934m0054n6202P8176p782j21379k19428r8459j226L9445l1001N0229
$$ 1091934 1051880 995678 1073854 1066072 944693 725265 626806 625580 665025 634024 684253
18925F84253R617o5281l0613J03185j08811j22595J04682L3699j10294q2930M923
$$ 684253 693870 628589 597976 701161 592350 469755 574437 608136 497842 414912 419835
18914D19835K5526k9998m1436K0306M8436p5587j18266J7033r6876l0622J17212
$$ 419835 445361 415363 373927 394233 442669 367082 248816 265849 168973 138351 255563
18903B55563J53865L6579j15134j24953K6592K9385m3060P9940j06366N085M8694
$$ 255563 409428 446007 330873 205920 232512 261897 218837 298777 192411 197496 246190
18892B46190J20762l8919q3682k285j5284k0642J23764J47799J1226K8033r4006
$$ 246190 366952 328033 244351 242066 226782 206140 329904 477703 488929 516962 422956
18881D22956J527M8481q4518n5587l7173j36444n108L2621O395J30062m5727n0183
$$ 422956 424483 472964 388446 332859 295686 159242 154134 186755 193150 323212 277485 227302
18869B27302Q3861k0051M7037M4811J02724j01558K6127K2985k9716k5323j22260
$$ 227302 311163 291112 338149 382960 485684 384126 410253 433238 403522 378199 255939
18858B55939o6673P6054J01414Q2728N278j18189J8932J3681j6286j2339P3946
$$ 255939 189266 265320 366734 449462 454740 336551 355483 369164 352878 340539 414485
18847D14485q9928m2467j2568j865k2509J1843p3818j93713N5792J99067k3140
$$ 414485 324557 282090 269522 267657 245148 256991 183173 -10540 45252 244319 221179
18836B21179q6611j09855J06295N7088j06994j6691P6250l7169n029Q4440J06301
$$ 221179 134568 24713 131008 188096 81102 64411 140661 103492 98463 182903 289204
18825B89204Q247J15531k5313n3998p044r1693J9075J5339l9641o3166J31486
$$ 289204 297451 412982 387669 333671 326627 234934 254009 269348 229707 166541 298027
18814B98027Q0149k1239n6026r1057R894l5225j19958j12343J6988J47389m6104
$$ 298027 378176 356937 300911 209854 219748 184523 64565 -47778 -30790 116599 70495
18803G0495P9412J48550k8714m1055p569M7095J3387j2347p272j18668J387J3240
$$ 70495 149907 298457 269743 228688 221119 268214 281601 269254 261982 143314 144701 157941
18791A57941j7227L8783M0201O7036L574N726J19948J03437l4619r983q4698k1613
$$ 157941 140714 179497 219698 286734 290308 296034 415982 519419 484800 474817 390119 368506
18779C68506n0535j15175j6517m5936Q9903j41834n6880M6296J61783K7362q6022
$$ 368506 317971 202796 186279 140343 230246 88412 31532 77828 239611 266973 180951
18768A80951l3138O8899J5304J5492J28314N4584n1584j57884k0903K0154j6759
$$ 180951 147813 216712 232016 247508 375822 430406 378822 220938 200035 220189 203430
18757B03430J8747k3413j6435J66663j7549l8117q4320K6006k3926q1290L8154
$$ 203430 222177 198764 182329 348992 331443 293326 209006 235012 211086 129796 167950
18746A67950M8526q913O5104O5548p1485m2247m0889L3488J37799P6885n5723
$$ 167950 216476 207563 272667 338215 266730 224483 183594 217082 354881 431766 376043
18735C76043j5592M2890J31776J10575o273L7486L950j02252k4800K8768k01p9040
$$ 376043 360451 403341 535117 645692 639419 676905 680855 578603 553803 582571 582370 503330
18723E03330n4033q4266j9537J91881O0238l5299K724R50P479J8315Q0386l6116
$$ 503330 449297 365031 345494 537375 597613 562314 565038 565988 573467 591782 672168 636052
18711F36052O0126k1219K3053j521k7293L9768P125O058j03211j03517l7595k0279
$$ 636052 696178 674959 698012 696491 669198 708966 716091 722149 618938 515421 477826 457547
18699D57547j15661j18152J9651M802j2949P320k7767m9255j3082q6006R4549
$$ 457547 341886 223734 243385 248187 235238 242558 214791 165536 152454 66448 160997
18688A60997n7991Q0811J44672Q3310j09264m5516k1719K1909M6493J3559r7613
$$ 160997 103006 183817 328489 411799 302535 257019 235300 257209 303702 317261 219648
18677B19648l4395l9922m3693q2050O3275m5355L9975j1833n4254J24980J09017
$$ 219648 185253 145331 101638 19588 82863 37508 77483 65650 11396 136376 245393
18666B45393m0328J3569j0489j9936n4508K4109K6241M1650j4381K1313n7312
$$ 245393 205065 218634 208145 188209 133701 157810 184051 225701 211320 232633 175321
18655A75321p722l7794q4307P8057p4034M5324K1649R5876O4083J8150j95971
$$ 175321 167599 129805 45498 123555 49521 94845 116494 212370 276453 294603 98632
18644I8632j33300l3124Q298j9945n4014L0697J37490O8125L3498l3552O120Q5586
$$ 98632 -34668 -67792 -59494 -79439 -133453 -102756 34734 102859 136357 102805 108925 194511
18632A94511j45087O5630Q19L614J65084n9524r9106P464j29378M2721R2829J0321
$$ 194511 49424 115054 115873 119487 284571 225047 125941 133405 4027 46748 139577 149898
18620A49898J06264Q3749m6404j03730m2169J655J66026M4581m9338j3006Q5182
$$ 149898 256162 339911 293507 189777 147608 149263 315289 359870 310532 297526 382708
18609C82708J03219O3028Q7334J52694J96791J07495M8590J7900k3607J06478
$$ 382708 485927 548955 636289 788983 985774 1093269 1141859 1159759 1136152 1242630
18599A242630K6292J30J10418N3333j6031J44437J06363j55588m5469q8898r0270
$$ 1242630 1268922 1269052 1379470 1432803 1416772 1561209 1667572 1511984 1466515 1377617 1287347
18588A287347K5458l6504k33612j06502p5898j17083p4975j46756j60326m0964
$$ 1287347 1312805 1276301 1042689 936187 860289 743206 668231 521475 361149 320185
18578C20185Q531L8108n3398m3311r4607P8260R701r4329n7108L4871O5659L2648
$$ 320185 328716 366824 313426 270115 175508 253768 263469 169140 112032 146903 212562 245210
18566B45210J62691K2538q4095Q1839q4186o4835L7974P7026J21328K70871J90807
$$ 245210 407901 430439 346344 428183 343997 279162 317136 394162 515490 786361 977168
18555I77168J59042J8491M8074L4279O3289J0243j81405k82654k7140J18537j7070
$$ 977168 1136210 1154701 1202775 1237054 1300343 1310586 1129181 846527 819387 937924 920854
18544I20854R229m933L3075j5158Q3931j0374m2705Q5586Q4540m8712j8225j90352
$$ 920854 930083 925150 958225 943067 1026998 1016624 973919 1059505 1144045 1095333 1077108 886756
18532H86756m4260o3904j22417r7059k06822j22764l121O5416k0007L9615q0991
$$ 886756 842496 778592 656175 559116 352294 229530 226409 291825 271818 311433 230442
18521B30442j18213Q8851M088l8176j01023K5494j7621m8908j34174n6913Q4335
$$ 230442 112229 201080 205168 166992 65969 91463 73842 24934 -109240 -166153 -81818
18510h1818p5671M2962P8518O2445m016J8239L2548L7020j18230p8127K0321O514
$$ -81818 -157489 -114527 -36009 26436 22420 40659 73207 110227 -8003 -86130 -65809 -59295
18498e9295Q9435Q5416l5557n1639L6252o3869o0986o5665q8947j938J12807J12396
$$ -59295 30140 115556 79999 28360 64612 743 -60243 -125908 -214855 -216793 -103986 8410
18486H410K3299l2561N7020M6527j31085m5071K34130K2390j22190K6098k1420
$$ 8410 31709 -852 56168 102695 -28390 -73461 160669 183059 60869 86967 65547
18475F5547P0271M9952n1045j76834n6120M278J04018J23054j2343q529k5017
$$ 65547 135818 185770 134725 -42109 -98229 -93951 10067 133121 120778 112249 87232
18464H7232J8317L5708M1181j00403m8317j3025j7826l829j7139l706O6553R4515
$$ 87232 105549 141257 182438 82035 33718 20693 2867 -962 -18101 -21807 44746 139261
18452A39261q2748j38542r2414Q4499q4647Q6680O016j4574N620R9900J16468
$$ 139261 56513 -82029 -174443 -89944 -174591 -87911 -81895 -96469 -90849 9051 125519
18441A25519O5851J3973j3229J7386r6614o5041R8584L8494n0850j00013l493
$$ 125519 191370 205343 192114 209500 112886 47845 146429 184923 134073 34060 30567
18430C0567O8888k38498l7159L2591P9929P2385l4045r9483l1967J5694J09043
$$ 30567 99455 -139043 -176202 -143611 -63682 8703 -25342 -124825 -156792 -141098 -32055
18419c2055Q8619r2776j927K099m3590o8468K3542j5347k3470R1157M7482L15
$$ -32055 56564 -36212 -38139 -36040 -79630 -148098 -124556 -139903 -163373 -72216 -24734 -24419
18407b4419O8651R1772m7032o8288j9358M2612j7008m1294J7680O7381j12358
$$ -24419 44232 136004 88972 20684 1326 43938 26930 -14364 3316 70697 -41661
18396d1661o9413j5567m2694N6345K16283J30131l0054p9651k7692P0687Q1018
$$ -41661 -111074 -126641 -169335 -112990 103293 233424 203370 123719 96027 166714 247732
18385B47732m4342j2414q8382j43574j33079O11O2567P1224j18953k6204J51154
$$ 247732 203390 190976 102594 -40980 -174059 -173448 -110881 -39657 -158610 -184814 -33660
18374c3660K7939l981m6286o1385R7630M6092j07970p7655R2649Q5329K5493Q595
$$ -33660 -5721 -9702 -55988 -117373 -19743 26349 -81621 -159276 -66627 18702 44195 52790
18362E2790J20727J7913N542l310m6504P3165J6674j30374j016j06486p1971j10621
$$ 52790 173517 191430 196972 193662 147158 220323 236997 106623 105607 -879 -72850 -183471
18350a83471O1595P8569M7922l3939r3417o2453J4491Q0800M5968k489j01903
$$ -183471 -121876 -43307 4615 -29324 -122741 -185194 -170703 -89903 -43935 -46424 -148327
18339a48327J8835O6350O9776Q5272K754r0238o1803j053n0453n3820O8530Q2441
$$ -148327 -129492 -63142 6634 91906 94660 4422 -57381 -58434 -108887 -162707 -94177 -11736
18327a1736K0745M2608o147j35603J26714J01392k2540j6858j25344j37073L0499
$$ -11736 9009 51617 45470 -90133 36581 137973 115433 98575 -26769 -163842 -133343
18316a33343J52039K7558l9534r12r868L4304q471j2966N2212j01442M142m6411
$$ -133343 18696 46254 6720 5808 -4060 30244 21773 8807 61019 -40423 -36281 -82692
18304h2692n5608N9810O5818o152r305R1798j8420l8124q5528j212N9172m3661
$$ -82692 -138300 -78490 -12672 -18824 -28129 63669 45249 7125 -78403 -79615 -20443 -64104
18292f4104j5559k1046N8394M0116M6762p6336L7860L9884N9628O7067j4548r5757
$$ -64104 -79663 -100709 -42315 -2199 44563 -31773 6087 45971 105599 172666 158118 62361
18280F2361m3479Q6822p7151N2943Q0081o6559M9801L0529o0030J25439L8664
$$ 62361 18882 105704 28553 81496 161577 95018 144819 175348 115318 240757 279421
18269B79421j28531j05996q9660J0134J9644l3740k979k7606J19693P6693j3666
$$ 279421 150890 44894 -44766 -34632 -14988 -48728 -51707 -79313 40380 117073 103407
18258A03407J9561o0549N7682O2327k15719p6932K9503M9186O3774O8528m4926
$$ 103407 122968 62419 120101 182428 -33291 -110223 -80720 -31534 32240 100768 55842
18247E5842O3973J0880j54345m8297j03921K5825R7595J6347p021M5927R8846
$$ 55842 119815 130695 -23650 -71947 -175868 -150043 -52448 -36101 -43122 2805 101651
18236A01651M1357j56888M3539J37550n0230p3558J13446k4888M5957J4473j43666
$$ 101651 143008 -13880 29659 167209 116979 43421 156867 131979 177936 192409 48743
18225D8743j18792Q6885O2848N207m8654j02179l6870R1211K2037m4012r5170
$$ 48743 -70049 16836 79684 84891 36237 -65942 -102812 -11601 10436 -33576 -128746
18214a28746J68478N8514p6984N6915j2401L9761L0168l7530r8025O4782J45392
$$ -128746 39732 98246 21262 78177 65776 105537 135705 98175 150 64932 210324
18203B10324P3354P00m5291j08224J5262J8231K5722j8927l6184k0154p1179q1218
$$ 210324 283678 284378 239087 130863 146125 164356 190078 171151 134967 114813 43634 -37584
18191c7584p4127R9623R3002k7273l6852k9379Q4234O7113r4283q0846K0973J54555
$$ -37584 -111711 -12088 80914 53641 16789 -12590 71644 138757 44474 -36372 -15399 139156
18179A39156M3823J8770p1870q4601J46788M3640j06361j2049N5362J3694N6730
$$ 139156 182979 201749 129879 45278 192066 235706 129345 117296 172658 186352 243082
18168B43082q8689J1979N6726M3535J18922M9808J0490O9515Q9374M3460p1729
$$ 243082 154393 166372 223098 266633 385555 435363 445853 515368 604742 648202 576473
18157E76473j86235K5298l2607j25566J583N849Q7105k2633j282N1153j26650
$$ 576473 390238 415536 382929 257363 258946 264795 351900 329267 327985 379138 252488
18146B52488r0604q6717p0911m4078P2525N9120M9201R7023q8305p8187p968L8933
$$ 252488 161884 75167 4256 -39822 32703 91823 141024 238047 149742 71555 63587 102520
18134A02520p3474L4376J02816K9994k3553q7461j23231m7611P891p381R6135
$$ 102520 29046 63422 166238 196232 172679 85218 -38013 -85624 -77733 -85114 11021
18123A1021J41215J32514P4036j44297j43265j68159o0385N9776J32290K5213
$$ 11021 152236 284750 358786 214489 71224 -96935 -157320 -97544 34746 59959
18113E9959m7670l2566n1779o4867K6761N5663O0283k3985N6358n8724L6527J35759
$$ 59959 12289 -20277 -72056 -136923 -110162 -54499 5784 -18201 38157 -20567 15960 151719
18101A51719p0251n1768J4669J12417q5613j17898o2265o6104J5211M8335J5331
$$ 151719 81468 29700 44369 156786 71173 -46725 -108990 -175094 -159883 -111548 -96217
18090i6217k1075O3133J0167j556J75472M7200K0488M0602o4945q4637k0976L1669
$$ -96217 -117292 -54159 -43992 -45548 129924 177124 197612 238214 173269 88632 67656 99325
18078I9325j1889R1472j421p2749j7446M3302J9957j22146r6414M143M8725r225
$$ 99325 87436 178908 177487 104738 87292 130594 150551 28405 -68009 -63866 -15141 -24366
18066b4366l6844n1658J6250j2613L6277L9113N5130O5251p4574j39104j2622
$$ -24366 -61210 -112868 -96618 -109231 -72954 -33841 21289 86540 11966 -127138 -139760
18055a39760J10898P0966j7016n6051q3243L0773P3376M4629k1558n2570R2696
$$ -139760 -28862 42104 25088 -30963 -114206 -83433 -10057 34572 13014 -39556 53140
18044E3140P8356l8614J8560j2319K5460R616o3483o1118m581l1421m556J04348
$$ 53140 131496 92882 111442 99123 124583 134199 70716 9598 5017 -26404 -30960 73388
18032G3388K495k09730K6405J3166N2455K2815n0964M025O0012J06117J4766j07796
$$ 73388 75883 -133847 -107442 -94276 -41821 -19006 -69970 -65945 -5933 100184 114950 7154
18020G154k6783j04924N2684J32074l6932n4778j3734O4526O2210P1646L9105
$$ 7154 -19629 -124553 -71869 60205 23273 -31505 -45239 19287 81497 153143 192248
18009A92248l2953j57598o9317J04245p6949j6055L2081l9511L3172j8497k7438
$$ 192248 159295 1697 -67620 36625 -40324 -56379 -24298 -63809 -30637 -49134 -76572
17998g6572p851n9536k6163O8850L887l6764k0404l8081O123P8590j3464m8677
$$ -76572 -84423 -143959 -170122 -101272 -97385 -134149 -154553 -192634 -186511 -107921 -121385 -170062
17986a70062j13686J4314Q5124J1534L7992P0845N0324N3534j00508j91649k6057
$$ -170062 -283748 -269434 -184310 -172776 -134784 -63939 -13615 39919 -60589 -252238 -278295
17975b78295O0581J19962j7984M7745l4440k4810K3832P9222M1590r5020j36724
$$ -278295 -217714 -97752 -115736 -67991 -102431 -127241 -103409 -24187 17403 -77617 -214341
17964b14341l3504J23531O7971j63027O1112J29912j7566L7287O8829j08982j10717
$$ -214341 -247845 -124314 -56343 -219370 -158258 -28346 -45912 -8625 60204 -48778 -159495
17953a59495P1754R042j18824J12854O8457j5548m9009J8232K8404l2002m4169
$$ -159495 -87741 -78699 -197523 -84669 -16212 -31760 -80769 -62537 -34133 -66135 -110304
17942a10304j04561o3129R6700L3070M832J716K5345J33562l49m2183j01687k3432
$$ -110304 -214865 -277994 -181294 -148224 -143392 -141676 -116331 17231 16882 -25301 -126988 -150420
17930a50420M6107J37430R4888P0651m4531l3878J9133j42533l7505R5094R3624
$$ -150420 -104313 33117 128005 198656 154125 120247 139380 -3153 -40658 54436 148060
17919A48060p1483k7865p2189k7567N7680R967j2212l1Q0557J29829P6026J0325
$$ 148060 76577 48712 -23477 -51044 6636 16603 4391 4360 84917 214746 290772 301097
17907C01097j53184r3049j9093l1862L2803P7494J7186n918m8853p9185k4617
$$ 301097 147913 54864 35771 3909 36712 114206 131392 125474 76621 -2564 -27181
17896b7181L2076R2856O7382n1460m8253m340K8664n2568J6915J09058Q0123j98249
$$ -27181 4895 97751 165133 113673 65420 61080 89744 37176 54091 163149 243272 45023
17884D5023n7803M4470J10657j579n8053N7780J67110n078n9452j1272m0291J15515
$$ 45023 -12780 31690 142347 140768 82715 140495 307605 302527 243075 231803 191512 307027
17872C07027n9716m1531l2755j6956m7605k6243J23601q520j09697K0294l7897
$$ 307027 247311 205780 173025 156069 108464 82221 205822 197302 87605 107899 70002
17861G0002P848J2761j6866O3837J01498j17948j8229J26084J20560J08670j0504
$$ 70002 77850 90611 73745 137582 239080 121132 102903 228987 349547 458217 447713
17850D47713j43687p5455r3496Q3215J04615J2741j00685J665J41373J14798n5977
$$ 447713 304026 228571 135075 218290 322905 335646 234961 236626 377999 492797 436820
17839D36820j79962j1392p6765J68564P3314p5227k9939J4708j9952m8880q5200
$$ 436820 256858 245466 168701 337265 410579 335352 305413 320121 300169 251289 166089
17828A66089k687m6915q2096k0505P9888L2829k4563n0565j3540K8129q8952J35515
$$ 166089 163402 116487 34391 13886 93774 126603 102040 51475 37935 66064 -22888 112627
17816A12627j5450j36560j9267N3569j8525O9705Q337N9975j25642r689P1872
$$ 112627 97177 -39383 -58650 -5081 -23606 46099 54436 114411 -11231 -20920 50952
17805E0952K1607Q9292O2297o2220O652n8792k00773P9149P9397N8130M890j4798
$$ 50952 72559 161851 224148 161928 168580 109788 -90985 -11836 67561 125691 130581 115783
17793A15783k230Q9269j3072j38993n4269m9531N1278R1262J05458m4414j00062
$$ 115783 113553 202822 189750 50757 -3512 -53043 -1765 89497 194955 150541 50479
17782E0479o2451k467P81P1665J20497N0592q5477k5595L2326o308Q7285j7224
$$ 50479 -11972 -14439 -13658 58007 178504 229096 143619 118024 150350 144042 231327 214103
17770B14103M1542r4781m9754P1528J03310j36356j53977j30896o326J3040J19497
$$ 214103 255645 160864 111110 182638 285948 149592 -4385 -135281 -141607 -128567 -9070
17759i070J05200j1238m1097M5530p5409r2873o3899l6042j6347Q5399P9598m3278
$$ -9070 96130 84892 43795 89325 13916 -78957 -142856 -178898 -195245 -109846 -30248 -73526
17747g3526n8522L1406J9352J9310J02749k291O526k2756k1365r3236Q7770K7462
$$ -73526 -132048 -100642 -81290 -61980 40769 38478 45004 22248 883 -92353 -4583 22879
17735B2879j8575L3527j13300j4219m5166K4644Q8859J00922L1139j7627O9204
$$ 22879 4304 37831 -75469 -89688 -134854 -110210 -21351 79571 110710 93083 162287
17724A62287o7023L2356K2333m3982j7969k8080n59M1592R9897R1295n9477n6183
$$ 162287 95264 127620 149953 105971 88002 59922 59363 100955 200852 292147 232670 176487
17712A76487o177q1269j47507j02050l6900K6021J1832K3467k849P6881K0539
$$ 176487 170310 89041 -58466 -160516 -197416 -171395 -159563 -136096 -138945 -62064 -41525
17701d1525j70409K6288J06792N5478r6062j1287J2792q4401M5886N9324M5043
$$ -41525 -211934 -185646 -78854 -23376 -119438 -130725 -117933 -202334 -156448 -97124 -52081
17690e2081L1640K6526k2838k5472j9687m3820Q8900J8886N0304J5005M26r650
$$ -52081 -20441 6085 -16753 -42225 -61912 -105732 -16832 2054 52358 67363 67789 58139
17678E8139J3043m7377M3529l3407L846Q2354M0495l3949j5224o1428O3865o1298
$$ 58139 71182 23805 67334 33927 37773 120127 160622 126673 111449 50021 113886 52588
17666E2588L027J61438p6572k2213l5275o1844j9830n1500j2346K4470o3604l158
$$ 52588 55615 217053 140481 118268 82993 21149 1319 -50181 -62527 -38057 -101661 -104819
17654a04819L3686K0266J18575M6301L5377j17684o4349j18611n9030J528o9847
$$ -104819 -71133 -50867 67708 114009 149386 31702 -32647 -151258 -210288 -208760 -278607
17643b78607l7021M1732J50470J10322K3031O5031k1081n1364p0548p5940m4931
$$ -278607 -315628 -273896 -123426 -13104 9927 74958 53877 2513 -68035 -143975 -188906
17632a88906N4066J07796J63104p6896j11199k0109N7857o2181k2524l0714m9339
$$ -188906 -134840 -27044 136060 59164 -52035 -72144 -14287 -76468 -98992 -129706 -179045
17621a79045k556J82995O5725J7942l2768k6422o5059k1144J10876L1786r7816
$$ -179045 -181601 1394 67119 85061 52293 25871 -39188 -60332 50544 82330 -15486
17610a5486r4988k6267K8902L5611m8051M6140M7250K1394R2155J3364J906l937
$$ -15486 -110474 -136741 -107839 -72228 -120279 -74139 -26889 -5495 86660 100024 101930 97993
17598I7993m3288p2805N8416P6879j06122j25487O387K9589M0616M9523j08744
$$ 97993 54705 -18100 40316 117195 11073 -114414 -108027 -78438 -37822 11701 -97043
17587i7043p875J21681m3841L3263R0648J3853k8538Q6357K9879j33606j802J4592
$$ -97043 -104918 16763 -27078 6185 96833 110686 82148 168505 198384 64778 62976 77568
17575G7568K6432P9728k3021r1473M8274M6234n5281m1907J2087q7060J02974
$$ 77568 104000 183728 160707 69234 117508 163742 108461 66554 78641 -8419 94555
17564I4555m2055m0045r570K1290L8720J346j57603k9916J12634N4869p4843m4074
$$ 94555 52500 12455 2885 24175 62895 64241 -93362 -123278 -10644 44225 -30618 -74692
17552g4692J2756K5293N9740Q0628o700O1385O8485p4484o2411L0366N5809j00897
$$ -74692 -61936 -36643 23097 103725 97025 158410 226895 152411 90000 120366 176175 75278
17540G5278o6047Q9337K3894J1491j0178k8903L3201k2880J4563q8593K920J61292
$$ 75278 9231 98568 122462 133953 123775 94872 128073 105193 119756 31163 34083 195375
17528A95375J28989J9366j14662M3337R5138O836n47M4760k2840O2296M3674k3202
$$ 195375 324364 343730 229068 272405 367543 374379 373832 418592 395752 458048 501722 478520
17516D78520K3013j0150m6466P225M843n356n6506r320o9996O5032K8842l3626
$$ 478520 501533 491383 444917 452142 456985 451629 395123 385803 315807 380839 409681 376055
17504C76055l9591Q000O2237m0866k04411o9125M7475q3941r581P4899r341K0573
$$ 376055 336464 344464 406701 365835 161424 92299 139774 55833 46252 121151 111810 132383
17492A32383K45412Q693j30050j36751r6031j55672l3924l0275K1399M9598l032
$$ 132383 377795 386488 256438 119687 23656 -132016 -165940 -196215 -174816 -125218 -128250
17481a28250J78485K6373r0249k6780N69J3085J13240O4630j05851r1401k590
$$ -128250 50235 76608 -13641 -40421 -39852 -26767 86473 151103 45252 -46149 -48739
17470d8739j7735l3179O2905L4968m577n6020Q263J8024N57L1850K4589Q6962
$$ -48739 -66474 -99653 -36748 -1780 -6357 -62377 -54114 -36090 -35533 -3683 20906 107868
17458A07868J2840j68283j23929P6576M0775q3076q4367O2677J51698R8559q4266
$$ 107868 120708 -47575 -171504 -94928 -54153 -137229 -221596 -158919 -7221 91338 7072
17447G072m2694n5357k5311o845M1636m0545L2017Q5825k6577l7882p4671q183
$$ 7072 -35622 -90979 -116290 -123135 -81499 -122044 -90027 -4202 -30779 -68661 -143332 -151515
17435a51515k5589P7011J00149m3257n9182Q5683P8974R2575m7015p0097M9739
$$ -151515 -177104 -100093 56 -43201 -102383 -16700 62274 154849 107834 37737 87476
17424H7476L5770K0144q7304q0564L553J5996L9901j4526j5643m8065J531L264
$$ 87476 123246 143390 56086 -24478 -20925 -4929 34972 20446 4803 -43262 -41731 -38467
17412c8467J3624O7480l10p9280O589m0034l5607k281J9870j2765m860Q0986L5802
$$ -38467 -24843 42637 42327 -36953 -30364 -70398 -106005 -108286 -88416 -101181 -106041 -25055 10747
17399A0747o3570P1243p201j03857o4830N0502L1031R33O3977L1370r2783L0423
$$ 10747 -52823 18420 11219 -92638 -157468 -106966 -75935 -75002 -11025 20345 -72438 -42015
17387d2015J11402m6446j72919o6671L8167J36492M2158p8005J587J45526o9609
$$ -42015 69387 22941 -149978 -216649 -178482 -41990 168 -77837 -76250 69276 -333
17376c33j41951O8708P3562M1573m1452L2620P1164l1459l6506m7156q1551N4983
$$ -333 -142284 -73576 -14 41559 107 32727 103891 72432 35926 -11230 -92781 -37798
17364c7798R7534Q288j21605K8463j4767j17203J13765M4428K6042k17706j20692
$$ -37798 59736 68024 -53581 -25118 -39885 -157088 -43323 1105 27147 -190559 -311251
17353c11251R2864N9033J11852L3564m2923O6687p1306q4793P2130k6126m1750
$$ -311251 -218387 -159354 -47502 -13938 -56861 9826 -61480 -146273 -74143 -100269 -142019
17342a42019k8065O8023q085K0664r2564l4536M9779J20203O0114m5653p1796
$$ -142019 -170084 -102061 -110146 -89482 -182046 -216582 -166803 -46600 13514 -32139 -103935
17331a03935K5821K0631L4093o2969q1285M7407N9828M6368m6403l5673j18503
$$ -103935 -78114 -57483 -23390 -86359 -167644 -120237 -60409 -14041 -60444 -96117 -214620
17320b14620n9755M1828N1698O4604j120J34513K7021K8848j06688n3406J3618
$$ -214620 -274375 -232547 -180849 -116245 -117365 17148 44169 73017 -33671 -87077 -73459
17309g3459o6331N8863p306l5042L4600j0560L0375l375l9639O0915K3902o5390
$$ -73459 -139790 -80927 -88233 -123275 -88675 -99235 -68860 -72235 -111874 -50959 -27057 -92447
17297i2447R0382o9385m7411J41579M1597K0125R596P8261Q4500j3113j534m2286
$$ -92447 -2065 -71450 -118861 22718 64315 84440 94036 172297 256797 243684 242150 199864
17285A99864j52626j65780r9119J64429J83870J31699Q829q8844q5732m8100k8036
$$ 199864 47238 -118542 -217661 -53232 130638 262337 271166 182322 96590 48490 20454
17274B0454R1767q443k6134k2102R4751j67569j48491Q352k0846N2853l9935K9592
$$ 20454 112221 103778 77644 55542 150293 -17276 -165767 -157415 -178261 -125408 -165343 -135751
17262a35751J30889M7085n3972O92K0499J485o4327M9817K1075J8628r238j2472
$$ -135751 -4862 42223 -11749 -11057 9442 10927 -53400 -3583 17492 36120 26882 14410
17250A4410K728l5333j8043o6625L6881N2152k9612K892O1299O3243M739o0350
$$ 14410 17138 -18195 -36238 -102863 -65982 -13830 -43442 -40550 20749 83992 88731 28381
17238B8381k1575n3080j6354N124j34518k9575J57461O1405k17504J9880J8825
$$ 28381 6806 -46274 -62628 -57504 -192022 -221597 -64136 -2731 -220235 -200355 -181530
17227a81530L5705K8891O966k1517n6148P617J80036L46q7720l4609M0888m1438
$$ -181530 -145825 -116934 -109968 -131485 -187633 -180016 20 366 -87354 -121963 -81075 -122513
17215a22513o5337J4373R0562R1960L2018j10084j09197L995J04764J19629N9375
$$ -122513 -187850 -173477 -82915 9045 41063 -69021 -178218 -174223 -69459 50170 109545
17204A09545k6190q4129n2493k2400J00r2730N0043L3831J38460P2373o2049j04275
$$ 109545 83355 -774 -53267 -75667 -75567 -168297 -118254 -84423 54037 126410 64361 -39914
17192c9914r4411J09108J10381P7091R3306p5797O5753l4501n6438q6084O5922
$$ -39914 -134325 -25217 85164 162255 255561 179764 245517 211016 154578 68494 134416
17181A34416n6154j2590J840l0261o0140Q0685R0654j093l4608r6272K3947K8746
$$ 134416 78262 65672 67512 37251 -22889 57796 148450 147357 112749 16477 40424 69170
17169F9170j17787m6124O0457L5966J795j6576J0928p227j29823r854J57241M9170
$$ 69170 -48617 -94741 -34284 1682 3477 -13099 -2171 -9398 -139221 -149075 8166 57336
17157E7336N936J453k1212j00908m9339m168n6507L4806q466j02695k9188Q2497
$$ 57336 63272 64725 43513 -57395 -106734 -110902 -167409 -132603 -141069 -243764 -272952 -190455
17145a90455R6158L003o655r1881K2337J57750m5780l4046O9293n6952M4640n5657
$$ -190455 -94297 -91294 -97949 -189830 -167493 -9743 -55523 -89569 -20276 -77228 -32588 -88245
17133h8245J3372L92q3954N3013J11449j6819o7561P6860P4857r0284j28894k8308
$$ -88245 -74873 -74481 -158435 -105422 6027 -10792 -78353 -1493 73364 -16920 -145814 -174122
17121a74122J4458Q7635M3499j44716j45191J7784K4237L212o7957M4400J33021
$$ -174122 -159664 -72029 -28530 -173246 -318437 -300653 -276416 -273204 -341161 -296761 -163740
17110a63740P4108p6397J18126M0861N6336p4540l8765n3475m3118M9205k6626
$$ -163740 -89632 -166029 -47903 -7042 49294 -25246 -64011 -117486 -160604 -111399 -138025
17099a38025o0387M3772J05528l9344j4203M1742O4891l1020p3415q5125M530
$$ -138025 -198412 -154640 -49112 -88456 -102659 -60917 3974 -27046 -100461 -185586 -181056
17088a81056J3806J21528j0351j12848j65772N7144J29502K9191L810O5791J409
$$ -181056 -167250 -45722 -56073 -168921 -334693 -277549 -148047 -118856 -115046 -49255 -47846
17077d7846o833q4792l4456K35609J26874j36773l5803r473N7046j8793r1869
$$ -47846 -54679 -139471 -173927 61682 188556 51783 15980 6507 63553 44760 -47109
17066d7109j15947J8371K2509J06194m6091J516l9157J23487J05827M2310j9852
$$ -47109 -163056 -144685 -122176 -15982 -62073 -60557 -99714 23773 129600 171910 152058
17055A52058l1952j30539j01796o6626L9595J5209k2041N5063N9755J4858l1466
$$ 152058 120106 -10433 -112229 -178855 -139260 -124051 -146092 -91029 -31274 -16416 -47882
17044d7882o0941m0986q059J08464J00103j25054l1851O8931O4255p0877j24846
$$ -47882 -108823 -149809 -157868 -49404 50699 -74355 -106206 -37275 26980 -43897 -168743
17033a68743O6642P5583J00728N0576q5651j1669n6325N2265J4766j00414j29508
$$ -168743 -102101 -26518 74210 124786 39135 27466 -28859 23406 38172 -62242 -191750
17022a91750Q4380J50038P1805o8849O6570K3223j34099r2526P9634L1039J34826
$$ -191750 -107370 42668 114473 45624 112194 135417 1318 -91208 -11574 19465 154291
17011A54291N768j18663j10295M275O9350m102j2343j17695l2139L8749P2682
$$ 154291 160059 41396 -68899 -64624 4726 624 -11719 -129414 -161553 -122804 -50122
17000e0122j5014R0372Q372r5842k5082M8156J23539l3721n8776m9039o6621O105
$$ -50122 -65136 25236 33608 -62234 -87316 -39160 84379 50658 -8118 -57157 -123778 -117673
16988a17673L2837R1219P8456m2730j47934k7423R3119J4369K3888k2070J039
$$ -117673 -84836 6383 84839 42109 -105825 -133248 -40129 -25760 -1872 -23942 -22903
16977b2903P1495n904o4447o7205q0906O5589j0630j13381L4872m2775J09864
$$ -22903 48592 42688 -21759 -88964 -169870 -104281 -114911 -228292 -193420 -236195 -126331
16966a26331k6167O9554J0321l5136L3449K0815J35246J23388N9094o4088j26342
$$ -126331 -152498 -82944 -72623 -107759 -74310 -53495 81751 205139 264233 200145 73803
16955G3803J2836k9097p8872j28652m7206P2480K8647J5472Q8880K3384q7980
$$ 73803 86639 57542 -21330 -149982 -197188 -124708 -96061 -80589 8291 31675 -56305
16944e6305j1559o0102M9556K2008Q8337l893L3150L4937L8119m199K0700r5315
$$ -56305 -67864 -127966 -78410 -56402 31935 28042 61192 96129 134248 130049 150749 55434
16932E5434r3020p153J4097j23383k8373L3150Q1445J28715m4630m3509J5828
$$ 55434 -37586 -44739 -30642 -154025 -182398 -149248 -67803 60912 16282 -27227 -11399
16921a1399o7869r2498L2174J30832K6339r1997L2398j2393K3374r2251n0978
$$ -11399 -79268 -171766 -139592 -8760 17579 -74418 -42020 -54413 -31039 -123290 -174268
16910a74268N1255N3335m43j1343P3168r5670m4470Q6104m8767L7796N9774j7166
$$ -174268 -123013 -69678 -70121 -81464 -8296 -103966 -148436 -62332 -111099 -73303 -13529 -30695
16898c0695k3108K5909P5301J2095j48360j53439m5770K0444N2998O1852J08778
$$ -30695 -53803 -27894 47407 59502 -88858 -242297 -288067 -267623 -214625 -152773 -43995
16887d3995J08418M3294l4273j08405J59774M4408k3688n0131j73239j09925l2408
$$ -43995 64423 107717 73444 -34961 124813 169221 145533 95402 -77837 -187762 -220170
16876b20170J37257j54823p6751P3852J49083J02360j7042l379l3855o9022J0289
$$ -220170 -82913 -237736 -314487 -240635 -91552 10808 -6234 -9613 -43468 -112490 -102201
16865a02201P2002K6088o8156j0422M6578R8012J17997j08132o4978m3962J3491
$$ -102201 -30199 -4111 -72267 -82689 -36111 61901 179898 71766 6788 -37174 -23683
16854b3683J0569K7329N6944P3828j30348o5586P4904J6884k0161j66271L346
$$ -23683 -13114 14215 71159 144987 14639 -50947 23957 40841 20680 -145591 -142245
16843a42245J42340o2259L0637j1770J33022R8737j01832r2271l7132J1327R2749
$$ -142245 95 -62164 -31527 -43297 89725 188462 86630 -5641 -42773 -31446 61303
16832F1303l1726q0024k5791N6350j3902L4389j0505K6591q9031j02841m8653
$$ 61303 29577 -50447 -76238 -19888 -33790 599 -9906 16685 -72346 -175187 -223840
16821b23840N5166J2196Q4105n412k3963Q6454j7445n0070O5077M5707K8335j48411
$$ -223840 -168674 -156478 -72373 -77785 -101748 -15294 -32739 -82809 -17732 27975 56310 -92101
16809i2101r3632k9325L3254R5174r119j13744l7191l6576J53463Q9070j68J14016
$$ -92101 -185733 -215058 -181804 -86630 -95749 -209493 -246684 -283260 -129797 -40727 -40895 73121
16797G3121K2660N9873m4441j84576o3891P5961q647o9058K7593k1823m3223M0851
$$ 73121 95781 155654 111213 -73363 -137254 -61293 -69940 -138998 -111405 -133228 -176451 -135600
16785a35600j1022N1583m881J00160r639M2464K8498k281m7842q4055L4291M4888
$$ -135600 -146622 -95039 -99920 240 -9399 33065 61563 59282 11440 -72615 -38324 6564
16773F564N1224n9623o7716R9892J9601j2600P0140p4344M3674R2745J8640r9600
$$ 6564 57788 -1835 -69551 30341 49942 37342 107482 33138 76812 169557 188197 88597
16761H8597n0699O1650j18234l4218K7875J11142K6574L771j6526p7311q4993
$$ 88597 37898 99548 -18686 -52904 -25029 86113 112687 116458 99932 22621 -62372
16750f2372p7027M4859J01788K5324p5101l7579M4022J10384o5690j54890j7105
$$ -62372 -139399 -94540 7248 32572 -42529 -80108 -36086 74298 8608 -146282 -163387
16739a63387r293J06104o3256j07225l0210J04509R4110L8233Q3090q0637q302
$$ -163387 -172680 -66576 -129832 -237057 -267267 -162758 -68648 -30415 52675 -27962 -36264
16728c6264l1578O3705M0127k5517p8879K8696j26487o8240q9765Q6148N4021
$$ -36264 -67842 -4137 35990 10473 -68406 -39710 -166197 -234437 -324202 -238054 -184033
16717a84033R7645k3041n407M2811P9545k6236j03144O2367J6898k659m6409k7949
$$ -184033 -86388 -109429 -114836 -72025 7520 -18716 -121860 -59493 -42595 -45254 -91663 -119612
16705a19612J14422Q113K7746j2714J11016N6872o8254q612m7483L4047n3139
$$ -119612 -5190 2923 30669 17955 128971 185843 117589 108977 61494 95541 42402
16694D2402M3607k1842j87063j4272Q6086M7761N5664m8253k4128n4389K8701
$$ 42402 86009 64167 -122896 -137168 -51082 -3321 52343 4090 -20038 -74427 -45726
16683d5726Q9903m723r1012r750K4505l3104p1745n3768J02500Q8836o4955R0601
$$ -45726 44177 39454 -51558 -61308 -36803 -69907 -141652 -195420 -92920 -4084 -69039 21562
16671B1562p0113J341L2581k3973n5924l9530O3630L3341o3990J20201K2982o9681
$$ 21562 -48551 -47210 -14629 -38602 -94526 -134056 -70426 -37085 -101075 19126 42108 -27573
16659b7573j34772j7261R8279O9994r6268L7839o9140l1191O3356J3047j1641
$$ -27573 -162345 -179606 -81327 -11333 -107601 -69762 -138902 -170093 -106737 -93690 -105331
16648a05331l0431q4575j1049J29809n3180n272k6367k8404K3577P1484J52513
$$ -105331 -135762 -220337 -231386 -101577 -154757 -160029 -186396 -214800 -191223 -119739 32774
16637C2774J72875p3812j06351m4465r0422n2280M2502J08974R2755l336K599
$$ 32774 205649 131837 25486 -18979 -109401 -161681 -119179 -10205 82550 79214 81813
16626H1813O7033j7525n4493n4632o4130K457N7143K2700Q0792L6840p5288j9832
$$ 81813 148846 131321 76828 22196 -41934 -39477 17666 40366 121158 157998 82710 62878
16614F2878N2742n2582j5379N1542j7123l3479J1652l6016o6453l6928J9975K2879
$$ 62878 115620 63038 47659 99201 82078 48599 60251 24235 -42218 -79146 -59171 -36292
16602c6292k8765k659K008R4601O2528k6508l3152j0M4204N1310l7548l9604L0362
$$ -36292 -65057 -67716 -65708 28893 91421 64913 31761 31751 75955 127265 89717 50113 80475
16589H0475j9253l537m5059m3291r3158m8397Q0883J66924n0218k48964L7925
$$ 80475 61222 57685 12626 -30665 -123823 -172220 -91337 75587 25369 -223595 -185670
16578a85670J19853K9242L8219N0439P7358L2652Q8216r236L4885j03853n7325
$$ -185670 -65817 -36575 1644 52083 129441 162093 250309 241073 275958 172105 114780
16567A14780l1794j46606m7399J64090J55160m9737j12327p185j668j38308j6069
$$ 114780 82986 -63620 -111019 53071 208231 158494 46167 38982 37314 -100994 -117063
16556a17063K3140Q4618M2480r2901n9729l6552K5726q1043r739M6652j13830
$$ -117063 -93923 -9305 33175 -59726 -119455 -156007 -130281 -211324 -221063 -174411 -288241
16545b88241L7129M8649L5223J4623L4493J71636O0408k2013l2433p6240j3274
$$ -288241 -251112 -202463 -167240 -152617 -118124 53512 113920 91907 59474 -16766 -30040
16534c0040j462K5552j6630P2647p7468j02260j05862P456P5469m199m0885M2167
$$ -30040 -31502 -5950 -22580 50067 -27401 -129661 -235523 -228067 -152598 -156797 -197682 -155515
16522a55515Q6606L6320O205q4598P4916M5865L329j17771o5329M001m1082P3392
$$ -155515 -68909 -32589 -26384 -110982 -36066 9799 13128 -104643 -169972 -165971 -207053 -133661
16510a33661J20909k1569k3501K8649P1696K9571j1024p2853J37853o9544q4212
$$ -133661 -12752 -34321 -57822 -29173 42523 72094 61070 -11783 126070 56526 -27686
16499b7686m9217r6049J03251J28513N6615N6512n4857L0806l037q6130L7217
$$ -27686 -76903 -172952 -69701 58812 115427 171939 117082 147888 144851 58721 95938
16488I5938m6835K7008k8141k8776j16056k6406J51741L6620K1115j29553l3074
$$ 95938 49103 76111 47970 19194 -96862 -123268 28473 65093 86208 -43345 -76419
16477g6419L9328J59417K6451k079j9117j25359O9064J39486l1902q4246r0200
$$ -76419 -37091 122326 148777 146698 127581 2222 71286 210772 178870 94624 4424
16466D424m9464k585O9420O797j02802J8914O9591R0100l6649R35J8689j704j48776
$$ 4424 -45040 -47625 21795 28592 -74210 -55296 14295 104395 67746 68681 87370 85666 -63110
16453f3110j27995j4123N4714M8341j9151K8396J11364M1777K457o5613P44O9544
$$ -63110 -191105 -205228 -150514 -102173 -121324 -92928 18436 60213 62670 -2943 -2199 67345
16441F7345n3072j2983L9156n3764n9408j8697P2705N025J0159P257K3061m5070
$$ 67345 14273 1290 40446 -13318 -72726 -91423 -18718 -13693 -3534 3723 26784 -18286
16429a8286k0306R1160L9806j8181K0099j03608N0036j1625J396l1619n8689P8854
$$ -18286 -38592 52568 92374 74193 94292 -9316 40720 29095 30491 -1128 -59817 19037
16417A9037j0185j01845L4086Q8589k4651p7337P9636K9581n5616j00579M7483
$$ 19037 8852 -92993 -58907 29682 5031 -72306 7330 36911 -18705 -119284 -71801
16406g1801R3236k8177j5000q4587j9402M9546j878r6890M870L0668J95899Q8335
$$ -71801 21435 -6742 -21742 -106329 -125731 -76185 -78063 -174953 -170083 -139415 56484 144819
16394A44819l861l1504r6690r2112O2885p9671Q7186J62796l9828n4734q0915
$$ 144819 140958 109454 12764 -79348 -16463 -96134 -8948 153848 114020 59286 -21629
16383b1629R4597P6960n339j7207q9741o1937p4664n4188j22420O6144N0250K3752
$$ -21629 72968 149928 144589 127382 37641 -24296 -98960 -153148 -275568 -209424 -159174 -135422
16371a35422P8961J30924k8469n2398M7715k2339k8344j8395j84430m2722P8895
$$ -135422 -56461 74463 45994 -6404 41311 18972 -9372 -27767 -212197 -254919 -176024
16360a76024L5198M4436J23086J5984m4390J4639k9693l7366m7224q8806l85J21347
$$ -176024 -140826 -96390 26696 42680 -1710 12929 -16764 -54130 -101354 -190160 -190545 -69198
16348f9198m2661P2371J24801P0752k3410m8228n2955k1800j08952J9856J46212
$$ -69198 -111859 -39488 85313 156065 132655 84427 31472 9672 -99280 -79424 66788
16337F6788q3329r1520l4826L474J42088Q3493l632k9659l0466l8471j6549M3143
$$ 66788 -16541 -108061 -142887 -139413 2675 86168 82536 52877 22411 -16060 -32609 10534
16325A0534K4606j13n4553r0243p0500J8142L6137R821N5463R0831N125j7390
$$ 10534 35140 35027 -19526 -109769 -180269 -162127 -125990 -116169 -60706 30125 35250 17860
16313A7860m3739j9873Q1355M5069k07187q5638N0844M1047R5435J16025M3636
$$ 17860 -25879 -45752 35603 80672 -126515 -212153 -161309 -120262 -24827 91198 134834
16302A34834k0897k4620j27673L1454N8794j43173l3365R4233K2264r1135r12
$$ 134834 113937 89317 -38356 -6902 51892 -91281 -124646 -30413 -8149 -99284 -100196
16291a00196K1946o4848k59J06261O4036l8440l7058m7375o039n4448P8198J8875
$$ -100196 -78250 -143098 -143357 -37096 26940 -11500 -48558 -95933 -101972 -156420 -78222 -59347
16279e9347K9775Q5031J7527j43366k9957O5905n1727j7964J11559k6425M0088
$$ -59347 -29572 55459 72986 -70380 -100337 -34432 -86159 -104123 7436 -18989 21099
16268B1099P7562O3483n6049r8270p9878n2472K8253J17211P8815L4270j26506
$$ 21099 98661 162144 106095 7825 -72053 -124525 -96272 20939 99754 134024 7518
16257G518l9427P1478m7335o880N3238m4033j21134n8343R838L7820j549j3068
$$ 7518 -31909 39569 -7766 -14646 38592 -5441 -126575 -184918 -175080 -137260 -138809 -151877
16245a51877R8925M9928l0529q77P8405l9660j34783N0201J74231P4838k3958
$$ -151877 -52952 -3024 -33553 -34430 43975 4315 -130468 -80267 93964 168802 144844
16234A44844R3990K4446R759j21978q9429k4654o1199M3324J11516N496j6650
$$ 144844 238834 263280 273039 151061 61632 36978 -24221 19103 130619 136115 119465
16223A19465r5675n7726N0031l7241j64859p0127m9330Q0658M8227M6567l660
$$ 119465 23790 -33936 16095 -21146 -186005 -256132 -305462 -224804 -176577 -130010 -133670
16212a33670J11561J18934m2111K199J0197o3754p9561q0749P7940k962L4896
$$ -133670 -22109 96825 54714 56913 67110 3356 -76205 -156954 -79014 -81976 -47080
16201d7080J4920K4255K8599n0813J73807J57987k8290r8512r8695J268m935L6180
$$ -47080 -32160 -7905 20694 -30119 143688 301675 273385 174873 76178 77446 72511 108691
16189A08691j53626L198k645j30302j988M518n4577n386R2902O0300k4768m5975
$$ 108691 -44935 -41737 -44382 -174684 -176672 -172154 -226731 -232117 -139215 -78915 -103683 -149658
16177a49658M0041J56433l1533n2984l7159m7226l5235m8492R0325N3084q662
$$ -149658 -109617 46816 15283 -37701 -74860 -122086 -157321 -205813 -115488 -62404 -71066
16166g1066o3027Q988J19745N0443p8416l1349O8373J520l3643n6695n4055J11483
$$ -71066 -134093 -125105 -5360 45083 -33333 -64682 3691 5211 -28432 -85127 -139182 -27699
16154b7699o011j4085J28625R5905n7587K690k6145N1203o4335l160K8316L669
$$ -27699 -33710 -47795 80830 176735 119148 121838 95693 146896 82561 79401 107717 111386
16142A11386K9982Q168j40674k5972l3519k0420M1254K8691p4471k4778p7684
$$ 111386 141368 149536 8862 -17110 -50629 -71049 -29795 -1104 -75575 -100353 -178037
16131a78037n9158J5725J8144P5740j1842j3908P4967R7769n635M5380Q9270l6230
$$ -178037 -237195 -221470 -203326 -127586 -139428 -153336 -78369 19400 13765 59145 148415 112185
16119A12185k3525n6887p6792l3592q4242P0787P3955K0814J10599Q6367j76359
$$ 112185 88660 31773 -45019 -78611 -162853 -92066 -18111 2703 113302 199669 23310
16108B3310j23041J3419q0932l3554K06242N0673p1210l9617L4108N5016l5397
$$ 23310 -99731 -86312 -167244 -200798 5444 56117 -15093 -54710 -20602 34414 -983
16097i83n7845q0436k6711J6297Q4124N4027o6154J2037k550L9032O3557L333
$$ -983 -58828 -139264 -165975 -149678 -65554 -11527 -77681 -65644 -68194 -29162 34395 37728
16085C7728n4937j4927j22105r201j5953J7763J8683l6825j07352O0915M3496
$$ 37728 -17209 -32136 -154241 -163442 -179395 -161632 -142949 -179774 -287126 -226211 -182715
16074a82715J28646J03363p8300p7526K3235M1432n5761p4353n7413R34Q3236
$$ -182715 -54069 49294 -29006 -106532 -83297 -41865 -97626 -171979 -229392 -228458 -145222
16063a45222l8829j53512J0713J00235J45167P026j7053m981R764O132m7197j10986
$$ -145222 -184051 -337563 -326850 -226615 -81448 -74422 -91475 -96456 -86692 -80560 -127757 -238743
16051b38743p2993J83881J20509j1484m3378l6014q7566n0718l9468K9881O9480
$$ -238743 -311736 -127855 -7346 -18830 -62208 -98222 -185788 -236506 -275974 -246093 -176613
16040a76613J20721O6169p9503p3864J8849J31198K9340M7349n2408Q0908l7804
$$ -176613 -55892 10277 -69226 -143090 -124241 6957 36297 83646 31238 112146 74342
16029G4342n6003l3397N026q0638k8711m1375j2418j0873J15589j6714j07388
$$ 74342 18339 -15058 -10032 -90670 -119381 -160756 -173174 -184047 -68458 -85172 -192560
16018a92560o6391K2427J62505n6332L8997J5949L828L2106m6019J2439O5211
$$ -192560 -258951 -236524 -74019 -130351 -91354 -75405 -71577 -39471 -85490 -73051 -7840
16007g840m8129M7235J22458N6094L8054p8l8833n8359K8760l2459j621n041j3467
$$ -7840 -55969 -8734 113724 169818 207872 207794 168961 110602 139362 106903 105282 100241 86774
15994H6774L6133O9582n1686l2718p7280p5053j47407L6937J12288P0912m4048
$$ 86774 122907 192489 140803 108085 30805 -44248 -191655 -154718 -42430 28482 -15566
15983a5566o3669P0828n0854m2773k4996l4234L3032R2196j4101j2265L0730q097
$$ -15566 -79235 -8407 -59261 -102034 -127030 -161264 -128232 -36036 -50137 -62402 -31672 -39769
15971c9769J0785k0052P0210J5691k8669p2276J2257o3971n3902j02221K10248
$$ -39769 -28984 -49036 21174 36865 8196 -64080 -51823 -115794 -169696 -271917 -61669
15960f1669J18665q8764p9814j9781l1071k7099J33615K0624n330m7276L2816
$$ -61669 56996 -31768 -111582 -131363 -162434 -189533 -55918 -35294 -40624 -87900 -55084
15949e5084j06444k0049R4157j148n1761q505J2753N2821J9561N1741M7382o2825
$$ -55084 -161528 -181577 -87420 -88568 -140329 -148834 -136081 -83260 -63699 -11958 35424 -27401
15937b7401j7306l0024o064N1299q2385j20906k4167K36789J49252J5151n2468
$$ -27401 -44707 -74731 -80795 -29496 -111881 -232787 -256954 -20165 129087 144238 91770
15926I1770k7008J1065q4851p5975j0315O1405P4723o7928J9377l7100Q9469N5083
$$ 91770 64762 75827 -9024 -84999 -95314 -33909 40814 -27114 -7737 -44837 44632 99715
15914I9715l9627J1468q0405o4921m5033M6178J06310P9142j12673m5239r7055
$$ 99715 60088 71556 -8849 -73770 -118803 -72625 33685 112827 154 -45085 -142140
15903a42140N0902J85390L817k7988j13658L153Q2014k14257k55011J0537K70820
$$ -142140 -91238 94152 97969 69981 -43677 -40524 41490 -172767 -427778 -417241 -146421
15892a46421J30464p9504Q9396j3679k5236J70110Q7864j07437j26398L7293p5004
$$ -146421 -15957 -95461 -6065 -19744 -44980 125130 212994 105557 -20841 16452 -58552
15881e8552j16526J12662j0175n4998n4071n1932J77823K442l9175J06182l5156
$$ -58552 -175078 -62416 -72591 -127589 -181660 -233592 -55769 -53327 -92502 13680 -21476
15870b1476l2517N7086p8780N046m04n3744J6348M7848m6656L7679O6065l05q0133
$$ -21476 -53993 3093 -75687 -70641 -71045 -124789 -108441 -60593 -107249 -69570 -3505 -3810 -83943
15857h3943k9466q0684p2887M2941Q6195K3153M3687o6808m5773K10346l659o762
$$ -83943 -113409 -194093 -266980 -224039 -137844 -114691 -71004 -137812 -183585 26761 23102 16340
15845A6340J9576K2242k5569p4844l0198r3121O609J2131Q9568R2972O4508K1570
$$ 16340 35916 58158 32589 -42255 -72453 -165574 -158965 -146834 -57266 35706 100214 121784
15833A21784j10622p751N2298k978N0219m2460J05340R6388J004N230n1410j55153
$$ 121784 11162 3411 55709 52731 102950 60490 165830 262218 263222 268452 217042 61889
15821F1889k24191n9335l2468N2139Q3294L5743O9291M7889k0985J2138n8965
$$ 61889 -162302 -221637 -254105 -201966 -118672 -82929 -13638 34251 13266 25404 -33561
15810c3561j4526k1921O8955L4941m8550q0390k1146P1164J6824l9177j0652N6202
$$ -33561 -48087 -70008 -1053 33888 -14662 -95052 -116198 -45034 -28210 -67387 -78039 -21837
15798b1837Q4205l0201L7690Q9078l1205q0229j21033P8838J12026k8064r7512
$$ -21837 62368 32167 69857 158935 127730 47501 -73532 5306 117332 89268 -8244
15787h244q7919J7763O5487m4188l9552q4890l8296M0474N7837L9224P8746O6995
$$ -8244 -96163 -78400 -12913 -57101 -96653 -181543 -219839 -179365 -121528 -82304 -3558 63437
15775F3437p5553k2592l437m770L8100J07786k3906n1314j4017L9619k7368p0696
$$ 63437 -12116 -34708 -38145 -42915 -4815 102971 79065 27751 13734 53353 25985 -44711
15763d4711M8274q3131j50704K5850N9065K7457J33388J72275j6317j09399m4895
$$ -44711 3563 -79568 -230272 -204422 -145357 -117900 15488 187763 171446 62047 17152
15752A7152O0749O6154R324j28735o3700l2556k7061q4370P2358R1569N426l2064
$$ 17152 77901 144055 153379 24644 -39056 -71612 -98673 -183043 -110685 -19116 -13690 -45754
15740d5754m4825R8907o4017l2728O4279O7802J1005j9386M1165K0238q681m8238
$$ -45754 -90579 8328 -55689 -88417 -24138 43664 54669 35283 76448 96686 88005 39767
15728C9767o4795K5381j3846M8333L13o684K5884j9627p1340N6029n8630O261
$$ 39767 -25028 353 -13493 34840 35153 28469 54353 34726 -36614 19415 -39215 -32954
15716c2954j5622n4995J18141J90589o2938j7543L6414k7993k4175k7851M2898
$$ -32954 -48576 -103571 14570 205159 142221 124678 161092 133099 108924 81073 123971
15705A23971J3445p6732m6695l928k9479r209m5700P4094J12503o1169o3029J29924
$$ 123971 137416 60684 13989 10061 -19418 -28627 -74327 -233 112270 51101 -11928 117996
15693A17996P3884j20414j4173j7937q9100r6510k4236Q8115Q6503j0809q4076
$$ 117996 191880 71466 57293 39356 -49744 -146254 -170490 -82375 4128 -6681 -90757
15682i0757p4881J9764R2222k9575m4789Q3247P4374J48837J03354j6324j73280
$$ -90757 -165638 -145874 -53652 -83227 -128016 -44769 29605 178442 281796 265472 92192
15671I2192n8356R6799q2695j17456n498k8155m3545R9774j6935l7869L0941n8737
$$ 92192 33836 130635 47940 -69516 -75014 -103169 -146714 -46940 -63875 -101744 -70803 -129540
15659a29540J08783N4696J3949k2412M7208q988j39929N3088J16606j09805Q2987
$$ -129540 -20757 33939 47888 25476 72684 63696 -76233 -23145 93461 -16344 66643
15648F6643M4055O8081M7085q3610o0961M1608J04562j1658r5478n4032L7329
$$ 66643 110698 178779 225864 142254 81293 122901 227463 215805 120327 66295 103624
15637A03624N9154O0701m255r939m6219m396j9494m7876J01003L0211p0147j31503
$$ 103624 162778 223479 219224 209285 163066 158670 139176 91300 192303 222514 152367 20864
15625B0864j53641r3837J01887M7131M0281J75186J31571m5919j44072j44125
$$ 20864 -132777 -226614 -124727 -77596 -37315 137871 269442 223523 79451 -64674
15615f4674J4630N8130J6010O1780q133n5971P987n6814m9603J1825K742j1853
$$ -64674 -50044 8086 24096 85876 77743 21772 29759 -27055 -76658 -64833 -62091 -73944
15603g3944k429m870k0902O622j2950J898K6512L8579J2380l6403j37052k3473
$$ -73944 -76373 -81243 -102145 -95523 -108473 -106575 -80063 -41484 -29104 -65507 -202559 -226032
15591b26032P9085K1667K5827J10640p1711q7784M9549k2869k050O8888j42120
$$ -226032 -146947 -125280 -99453 11187 -60524 -148308 -98759 -121628 -123678 -54790 -196910
15580a96910l4372Q2526J19874K2534K211o5233j2124Q3123l399P0298M5733j11083
$$ -196910 -231282 -148756 -28882 -6348 -4137 -69370 -81494 1629 -1770 68528 114261 3178
15568C178J5764l7844m9181j3237j28560M3288R3187j789j32156M0731J44658
$$ 3178 18942 -18902 -68083 -81320 -209880 -166592 -73405 -75194 -207350 -166619 -21961
15557b1961L2069q9275k688K3816Q5510J81691J46925j5530l2941n0628r6572
$$ -21961 10108 -79167 -81855 -58039 27471 209162 356087 340557 307616 256988 160416
15546A60416j58874j04355m6654L6229q3891J7613Q0437P3828P1763o6039p9169
$$ 160416 1542 -102813 -149467 -113238 -197129 -179516 -99079 -25251 46512 -19527 -98696
15535i8696J11O3811J19461k1516j29708k9247n3309n5974R6923L912L2156n771
$$ -98696 -98585 -34774 84687 63171 -66537 -95784 -149093 -205067 -108144 -104232 -72076 -77847
15523g7847O1570m6218n9628M9466J05782j1497l0864Q3110m4995J1475P5464
$$ -77847 -16277 -62495 -122123 -72657 33125 21628 -9236 73874 28879 40354 115818
15512A15818k2836j8486J6968N4043l0821j21694K787Q1815q9811l1337J2328
$$ 115818 92982 74496 91464 145507 114686 -7008 -4221 77594 -12217 -43554 -31226
15501c1226M0756m8233M0536j9646K4417j9659K1587j9036L5699M4059n2381o8506
$$ -31226 9530 -38703 1833 -17813 6604 -13055 8532 -10504 25195 69254 16873 -51633
15489e1633p0615J2409J52023N5864j55028o1592o4101L2042P5867O5319K9074
$$ -51633 -122248 -109839 42184 98048 -56980 -118572 -182673 -150631 -74764 -9445 19629
15478A9629j141K2927k991r3164n8383M3730M1401N2099J5150l7742N0432L6189
$$ 19629 18488 41415 38424 -54740 -113123 -69393 -27992 24107 39257 1515 51947 88136
15466H8136o0255J23822q2839j46042R315k5783p8302O378k7932P5921Q2876n0393
$$ 88136 27881 151703 68864 -77178 -67863 -93646 -171948 -165570 -193502 -117581 -34705 -85098
15454h5098P935O1157M3155n20l7077j7369N5887J18089j15269m0567P5150L9586
$$ -85098 -77163 -16006 27149 26629 -10448 -27817 28070 146159 30890 -9677 65473 105059
15442A05059J08p2980j16314n4008P44n57L0393J27536O1541l2404r9185q0038
$$ 105059 105167 32187 -84127 -138135 -137391 -137948 -107555 19981 81522 49118 -50067 -130105
15430a30105K9566O4637R936o8757N9915N6788m3220p4533o0541O3207K4500R689
$$ -130105 -100539 -35902 -25966 -94723 -34808 21980 -21240 -95773 -156314 -93107 -68607 -58918
15418e8918k7649l9396K9607o2609q956L5354o3966j7739j2090J00764N9728j06793
$$ -58918 -86567 -125963 -96356 -158965 -167921 -132567 -196533 -214272 -226362 -125598 -65870 -172663
15406a72663O4820J92427q6992p8553n3807j6623l0806L3743L8066n3771j50291
$$ -172663 -107843 84584 -2408 -80961 -134768 -151391 -182197 -148454 -110388 -164159 -314450
15395c14450R0813J14133K561J01724O8090p2279n6323j3603J60293Q8675L949
$$ -314450 -223637 -109504 -106943 -5219 62871 -9408 -65731 -79334 80959 169634 173583
15384A73583j8528l6043j20756l8194R8771j5886q5256q0858L9284K187j66756
$$ 173583 155055 119012 -1744 -39938 58833 42947 -42309 -123167 -83883 -81696 -248452
15373b48452R1026L9939l8168L7645P7868L6994J24012k7346j65530j9607n1714
$$ -248452 -157426 -117487 -155655 -118010 -40142 -3148 120864 93518 -72012 -91619 -143333
15362a43333P9730O2009k5005j4446j1818R1033k0903r8556q55P0462J65519K0662
$$ -143333 -63603 -1594 -26599 -41045 -52863 38170 17267 -81289 -82144 -11682 153837 174499
15350A74499O7181l4794j14429L9956O931K9481j3575r9127Q0249J3703j03047
$$ 174499 241680 206886 92457 132413 139344 168825 155250 56123 136372 150075 47028
15339D7028k0213L6016J0677n8267p2535k0095o9065J6497L4321j5212J19665
$$ 47028 26815 62831 73508 15241 -57294 -77389 -146454 -129957 -95636 -110848 8817
15328H817M3885n8187p7176L43Q7611R162n5251j9579R072J115j29408J9592L3768
$$ 8817 52702 -5485 -82661 -82318 5293 14455 -40796 -60375 -51303 -50188 -179596 -160004 -126236
15315a26236Q9104P3021J02309J9341n8602m1719o503J2816J2250j24979j53525
$$ -126236 -37132 35889 138198 157539 98937 57218 50715 63531 75781 -49198 -202723
15304b02723Q1017J20660J3051o4948j5745R2203Q6873N4781o0399j15891l8783
$$ -202723 -121706 -1046 12005 -52943 -68688 23515 110388 165169 104770 -11121 -49904
15293d9904J46246o272j25201k5473O7314J8753O280r432j2031o0015j7569Q2788
$$ -49904 96342 90070 -35131 -60604 6710 25463 31743 22311 10280 -49735 -67304 15484
15281A5484k5104j47449j2319J182L5316L5914O9134k0082k8389M8815J25007
$$ 15484 -9620 -157069 -169388 -168206 -132890 -96976 -27842 -47924 -76313 -27498 97509
15270I7509K8569m3729J6064j2602O7104O9179o9105n0006O3978j59849j37217
$$ 97509 126078 82349 98413 85811 152915 222094 152989 102983 166961 7112 -130105
15259a30105K5681J48783Q5356N4945O2789l7089j61922n8324n5379O3781q9107
$$ -130105 -104424 44359 129715 184660 247449 210360 48438 -9886 -65265 -1484 -90591
15248i0591m1028J62781K37221o5119j71476j3133l5601J5659m9752l3547m5773
$$ -90591 -131619 31162 268383 203264 31788 18655 -16946 -1287 -51039 -84586 -130359
15237a30359Q4504O7684J7323J513k5616k6252Q286J6973J07904m7503j10920
$$ -130359 -45855 21829 39152 40665 15049 -11203 -2917 14056 121960 74457 -36463
15226c6463o0670K9317Q1474l5560N106L0134r4575J18322J170j1165r749j18952
$$ -36463 -97133 -67816 13658 -21902 -16796 13338 -81237 37085 38255 27090 17341 -101611
15214a01611k2299l7769k3358K7185J04878o685N157M1085m1672O3959Q5954O6187
$$ -101611 -123910 -161679 -185037 -157852 -52974 -59659 -54502 -13417 -55089 8870 94824 161011
15202A61011J02393K9262q2963j19360o5507j4705N166L8632j3137j00706k817
$$ 161011 263404 292666 209703 90343 24836 10131 15297 53929 40792 -59914 -62731
15191f2731Q1301O2220j035p1475j04108j02562k3814J39695J20325L4908o5899
$$ -62731 18570 80790 79755 8280 -95828 -198390 -222204 -82509 37816 72724 6825
15180F825P19p489J4202K0063n7084k9399K3369l5937J4319P3417R2124j81847
$$ 6825 7544 55 14257 34320 -22764 -52163 -28794 -64731 -50412 23005 115129 -66718
15168f6718j77211Q1172Q3414q8766j05590O1037O2182L7960Q1858O0362N9278
$$ -66718 -243929 -162757 -79343 -168109 -273699 -212662 -150480 -112520 -30662 29700 88978
15157H8978J07797q3410o982j43997m0674J1903j10493j02238M9587N5398Q2698
$$ 88978 196775 113365 106383 -37614 -78288 -66385 -176878 -279116 -229529 -174131 -91433
15146i1433L8163j12362r404k9848n2409R9707P8871P1080k4253K2347q601k4584
$$ -91433 -53270 -165632 -175036 -204884 -257293 -157586 -78715 -7635 -31888 -9541 -18142 -42726
15134d2726K3647N6502m6667n7249j3907J20896J1872q485m4881j18729k9995
$$ -42726 -19079 37423 -9244 -66493 -80400 40496 52368 43883 -998 -119727 -149722
15123a49722K7979L1651p3318k5909N2803K01830J9989k9392M1766L6487K6668
$$ -149722 -121743 -90092 -163410 -189319 -136516 65314 85303 55911 97677 134164 160832
15112A60832k5168n1437j33252K7303m5608J29562N0938R7777M7083l2183k1526
$$ 160832 135664 84227 -49025 -21722 -67330 62232 113170 210947 258030 225847 204321
15101B04321J7069m8202n8694L6188l1706O1350R3100R2285j11764n7192q6103
$$ 204321 221390 173188 114494 150682 118976 180326 273426 365711 253947 196755 110652
15090A10652j1399q2156p243N7760N9124p7152j36310m5282N6715J18201n0827
$$ 110652 99253 17097 9854 67614 126738 49586 -86724 -132006 -75291 42910 -7917
15079g917m6908N1483J8736L7543J5925n5680j44380K0988P7217K7038m0092M1639
$$ -7917 -54825 -3342 15394 52937 68862 13182 -131198 -110210 -32993 -5955 -46047 -4408
15067d408J26878N5414j9705n2659l9820Q3520n7031j05611R7589o8555L0983
$$ -4408 122470 177884 158179 105520 65700 149220 92189 -13422 84167 15612 46595
15056D6595o7042r7148J14633J9653O4110P4910j5267j96924m6327J15149p573
$$ 46595 -20447 -117595 -2962 16691 80801 155711 140444 -56480 -102807 12342 4769
15045D769j9690j36054j16466m2587J2763q463o6619J33393Q9216L0624m9263
$$ 4769 -14921 -150975 -267441 -310028 -297265 -305728 -372347 -238954 -149738 -119114 -168377
15034a68377o3725K9328J5872J16755n4002J60192R2389q2375n9371K1611M8751
$$ -168377 -232102 -202774 -186902 -70147 -124149 36043 128432 46057 -13314 8297 57048
15023E7048k6283q311Q1981O6979L1351j41834q7537O431P962n5608n3997n2530
$$ 57048 30765 22454 104435 171414 202765 60931 -26606 -20175 -12213 -67821 -121818 -174348
15011a74348p692M6735n3557J13916K6431J17237m4727p4058l911R691O9278P0017
$$ -174348 -182040 -135305 -188862 -74946 -48515 68722 23995 -50063 -53974 -44283 24995 95012
14999I5012n4414L0938k3519o3422q1261K4023J5189n0192N1694J11013q5108
$$ 95012 40598 71536 48017 -15405 -96666 -72643 -57454 -107646 -55952 55061 -30047
14988c0047R998K5871l0981j11082J762J9960P1043J4497l6724j994Q3180P7237
$$ -30047 -20049 5822 -25159 -136241 -134479 -114519 -43476 -28979 -65703 -67697 15483 92720
14976I2720m6940j8793k0761M169m5815L3742m1151l6847Q569j697l6931N4119
$$ 92720 45780 26987 6226 10395 -35420 -1678 -42829 -79676 -71107 -72804 -109735 -55616
14964e5616N5755p5690k3567m6684J0677P1033J19284J08108J1059n8340q6909
$$ -55616 139 -75551 -99118 -145802 -135125 -64092 55192 163300 174359 116019 29110
14953B9110n556k889Q1459o2767l9938j06624j8213R8185O6802N0809n0648k16815
$$ 29110 23554 20665 102124 39357 -581 -107205 -125418 -27233 39569 90378 39730 -177085
14941a77085j43400J03628J03604q8507o2450K7403J70158M3508l5420J97J03138
$$ -177085 -320485 -216857 -113253 -201760 -264210 -236807 -66649 -23141 -58561 -58364 44774
14930D4774O3722n2965q6570q6990n4217J61803P6084J7542p8915j22208j3265
$$ 44774 108496 55531 -31039 -118029 -172246 -10443 65641 83183 4268 -117940 -131205
14919a31205r9999l9359L4193J04096L5651N0751m4989j6665o2161N8502Q8282
$$ -131205 -231204 -270563 -236370 -132274 -96623 -45872 -90861 -107526 -169687 -111185 -22903
14908b2903K3233L1476R736N0359O6709K7804J6461j26300k18649R2018j3039
$$ -22903 330 31806 41542 91901 158610 186414 202875 76575 -142074 -50056 -63095
14897f3095O1334o4409j34868K6888N6534R3610J11190M1378q5188m8010l7644
$$ -63095 -1761 -66170 -201038 -174150 -117616 -24006 87184 128562 43374 -4636 -42280
14886d2280L069P5424O688L0226Q9636j19918o6430j6169J6139n5063J15627J12452
$$ -42280 -39211 36213 42901 73127 162763 42845 -23585 -39754 -23615 -78678 36949 149401
14874A49401q5697n2790J02657J79316J7938j46784m5142o2218j21484j96997
$$ 149401 63704 10914 113571 292887 310825 164041 118899 56681 -64803 -261800
14864b61800K1555Q2884K1467P8717J33820L1563r9546l9350p5347J05204R2301
$$ -261800 -240245 -157361 -135894 -57177 76643 108206 8660 -30690 -106037 -833 91468
14853I1468J79294l14j48333P3102O4804n8614p4333o847j14268m7470K3999J5581
$$ 91468 270762 270448 122115 195217 260021 201407 127074 120227 5959 -41511 -17512 -1931
14841a931l7880p6982M6794J17923q2944r031O3232k6845p8781N6921O6611k6010
$$ -1931 -39811 -116793 -69999 47924 -35020 -44051 19181 -7664 -86445 -29524 37087 11077
14829A1077J6843N1617q5222o6348N2493M5022N1806j9624L311j67797j05496
$$ 11077 27920 79537 -5685 -72033 -19540 25482 77288 57664 60975 -106822 -212318
14818b12318r1395l7080K4245O486R2710J2707Q4714L3855J05987m0790q8294
$$ -212318 -303713 -340793 -316548 -310062 -217352 -204645 -119931 -86076 19911 -20879 -109173
14807a09173L2850M5584j8742K1205Q3340O6342k4836L6429m3271L8743l4752
$$ -109173 -76323 -30739 -49481 -28276 55064 121406 96570 132999 89728 128471 93719
14796I3719m5968J4483n8133p3976J3212J03407R130j10763m1145l1566N2195
$$ 93719 47751 62234 4101 -69875 -56663 46744 55874 -54889 -96034 -127600 -75405
14785g5405K4847M7966O5431M7609J014K2864m0949j85235k4960P8070J0195j7276
$$ -75405 -50558 -2592 62839 110448 111462 134326 93377 -91858 -116818 -38748 -28553 -45829
14773d5829J59069O9349k94K5765m5811L2309r8933j86407n2100M6638q7427o9759
$$ -45829 113240 182589 182295 208060 162249 194558 95625 -90782 -142882 -96244 -183671 -253430
14761b53430K0793Q4132J9062K9827m7071N6330K8349J6968k6981J8833J0568
$$ -253430 -232637 -148505 -129443 -99616 -146687 -90357 -62008 -45040 -72021 -53188 -42620
14750d2620p5270K2283l8045n0426N7140J6193M2251J40494k2473M322j21069
$$ -42620 -117890 -95607 -133652 -184078 -126938 -110745 -68494 72000 49527 53849 -67220
14739f7220j18505k7931L8874J60931Q0280q4644l2696N9690k1159n89K08482
$$ -67220 -185725 -213656 -174782 -13851 66429 -18215 -50911 8779 -12380 -12969 195513
14728A95513J7035o3191j18597m3892M8532j52256q7276J18225J13153j0670m938
$$ 195513 212548 149357 30760 -13132 35400 -116856 -204132 -85907 27246 16576 11638
14717A1638j11231j16858J10903O5163j17103j1170R5753L4485j4811O4363O2880
$$ 11638 -99593 -216451 -105548 -40385 -157488 -168658 -72905 -38420 -53231 11132 74012
14706G4012m9736m6017P7572j20970j00951o234J59211O9889l3960j0584j4954
$$ 74012 24276 -21741 55831 -65139 -166090 -172324 -13113 56776 22816 12232 -2722
14695b722j36189l1070J5997M7223J7619m3211L9385j41475p2899J61699K38811
$$ -2722 -138911 -169981 -153984 -106761 -89142 -132353 -92968 -234443 -307342 -145643 93168
14684I3168Q3708j1391k6105j23443p4755L375j71563l4394J25486O7473M1808
$$ 93168 176876 165485 139380 15937 -58818 -55443 -227006 -261400 -135914 -68441 -26633
14673b6633M7453L5746l8487k8593l8721j46579Q2272R4870o540L5637P6754K2687
$$ -26633 20820 56566 18079 -10514 -49235 -195814 -113542 -18672 -25212 10425 87179 109866
14661A09866m842j39533j07959J49428J02949j4463q5397J9947K0185k519N1910
$$ 109866 105024 -34509 -142468 6960 109909 95446 10049 29996 50181 47662 99572
14650I9572L6409J6740n3545j4133O764M699L9704M1751l7007l6574q3638p2114
$$ 99572 135981 152721 99176 85043 91807 96506 136210 177961 140954 104380 20742 -51372
14638e1372j0116J11430J17494M6929j27179j42308j17734m6166k5072J6731J40603
$$ -51372 -61488 49942 167436 214365 87186 -55122 -172856 -219022 -244094 -227363 -86760
14627h6760P2817m1594L1012J4611N0116N0353n2149M44J0885o5612j65330l9703
$$ -86760 -13943 -55537 -24525 -9914 40202 90555 38406 38850 49735 -15877 -181207 -220910
14615b20910q945l3173K18655J25418K982K5433q9009m0582Q6278j1401o5221
$$ -220910 -229855 -263028 -44373 81045 84027 109460 20451 -20131 66147 54746 -10475
14604a0475j7263O0171K0659J8315l5010o1279j3257l9095j05764J2332p5042
$$ -10475 -27738 32433 53092 71407 36397 -24882 -38139 -77234 -182998 -170666 -245708
14593b45708J8505J08827K2899R8729M5138l8666M5265R0399r0852q0773J8763
$$ -245708 -227203 -118376 -95477 3252 48390 9724 54989 145388 54536 -26237 -7474
14582g474L3156l968N0678J03609o7694N0949n557j68560K423J10128r9974L5567
$$ -7474 25682 21714 72392 176001 108307 159256 153699 -14861 -12438 97690 -2284 33283
14570C3283P8577r672k4730o5575r5633L7452j6528l3537j1373j40794n0584K9976
$$ 33283 111860 102188 77458 11883 -83750 -46298 -62826 -96363 -107736 -248530 -299114 -269138
14558b69138K55954J16246j0331k4820j00500M25L4982M543l225J14385O5262
$$ -269138 -13184 103062 92731 67911 -32589 -32164 2818 7361 4136 118521 183783
14547A83783l1586j11988j67705p0516m3080J65508J9559O5330k0765o8124K2646
$$ 183783 152197 40209 -127496 -198012 -241092 -75584 -56025 9305 -11460 -79584 -56938
14536e6938N1n4609K8820J80463O298j29051L6960J33829o7534L3567N9650n599
$$ -56938 -56887 -111496 -82676 97787 104085 -24966 11994 145823 78289 111856 171506 165907
14524A65907j27977k13626o9575Q6606N4352L1129j0368J9511k6483P031L0247
$$ 165907 37930 -175696 -245271 -158665 -104313 -73184 -83552 -64041 -90524 -83493 -53246
14513e3246k4516J2442q5364K2824M1945N0321J01726L8801k4323j4480j12705
$$ -53246 -77762 -65320 -150684 -127860 -85915 -35594 66132 104933 80610 66130 -46575
14502d6575J4848J14608l4209k6208p3635n1529N066k0132j08021l3252L0216
$$ -46575 -31727 82881 48672 22464 -51171 -102700 -97634 -117766 -225787 -259039 -228823
14491b28823p632n2701M154J33450J84429L6689R1712j30427l8636K2297j30301
$$ -228823 -236455 -289156 -285002 -151552 32877 69566 161278 30851 -7785 14512 -115789
14480a15789l7824P5791j35735Q0344J61491M6249l6783J19136j8186m9686j60346
$$ -115789 -153613 -77822 -213557 -133213 28278 74527 37744 156880 138694 89008 -71338
14469g1338j95265R4971R1950Q9209k4783j08160L5219J55969L1541j915J8238
$$ -71338 -266603 -171632 -79682 9527 -15256 -123416 -88197 67772 99313 97398 115636
14458A15636r7991j30186Q7301l7246k02536j03600J46944J41907J70765M3157
$$ 115636 17645 -112541 -25240 -62486 -265022 -368622 -221678 -79771 90994 134151
14448A34151r8454M1815j21888p1096o0823Q8106R0008R8837Q0615n0603j51282
$$ 134151 35697 77512 -44376 -115472 -176295 -88189 1819 100656 181271 130668 -20614
14437b0614m0544L1293j992j03311j3670K4826Q4679J4287K4307m3909p7767k3275
$$ -20614 -61158 -29865 -31857 -135168 -148838 -124012 -39333 -25046 -739 -44648 -122415 -145690
14425a45690L981P824j6365Q9364J8885o7233L0225M2692q5641K201Q6563J48158
$$ -145690 -141709 -133885 -150250 -60886 -42001 -109234 -79009 -36317 -121958 -119757 -33194 114964
14413A14964m1480j39146o8808n91R3728L6313o0601k5797O2856O0449q147p2647
$$ 114964 73484 -65662 -134470 -135061 -41333 -5020 -65621 -91418 -28562 31887 23740 -48907
14401d8907L0456J4389N9807o0995q7416K8138O7349R616O1528Q3886O3738o2585
$$ -48907 -18451 -4062 55745 -5250 -92666 -64528 2821 12437 73965 157851 221589 159004
14389A59004O037j22278o8607L2547o04q1505k5198m0032j5874Q550r807O3264
$$ 159004 165041 42763 -25844 6703 6099 -75406 -100604 -140636 -156510 -147960 -157767 -94503
14377i4503P9930L080j32834K733J22504N9316j72888r1710M0975J9335M5789
$$ -94503 -14573 -11493 -144327 -141594 -19090 40226 -132662 -224372 -183397 -164062 -118273
14366a18273j4901O3655J05529l263Q491P5835m3427n1910J09101L8824j13733
$$ -118273 -133174 -69519 36010 32747 41238 117073 73646 21736 130837 169661 55928
14355E5928q2361j03925O4217N4186J61203K5489q3396m3727L440K1816m249M3410
$$ 55928 -26433 -130358 -66141 -11955 149248 174737 91341 47614 51054 72870 68621 112031
14343A12031m9755L4710j9274p8886P7451o5831j0278M9260q7540o7105J20411
$$ 112031 62276 96986 77712 -1174 76277 10446 168 49428 -38112 -105217 15194
14332A5194Q4227J38440l6209p720o3761J455k9570j58767N3114M2129k9661K2265
$$ 15194 99421 237861 201652 193932 130171 131626 102056 -56711 -3597 38532 8871 31136
14320C1136n3933p4958p326K05499J58092L6228m6405n9643J274K875l3929m3033
$$ 31136 -22797 -97755 -105081 100418 258510 294738 248333 188690 189964 192839 158910 115877
14308A15877j79127o8914N5482n4603Q6477J8461p2786L7706N9777l0121j4874
$$ 115877 -63250 -132164 -76682 -131285 -44808 -26347 -99133 -61427 -1650 -31771 -46645
14297d6645Q5657M2306j72970m6283J5351j515m378N4106K6746L7314q4879j934
$$ -46645 39012 81318 -91652 -137935 -122584 -124099 -128477 -74371 -47625 -10311 -95190 -97124
14285i7124J32233J07220R573J33796p3689p8094L4583L3789j42846n1854o9652
$$ -97124 35109 142329 151902 285698 212009 133915 168498 202287 59441 7587 -62065
14274f2065Q9091M9248N6596J05169p5392o1591p1115J6680J67720J9456j18833
$$ -62065 27026 76274 132870 238039 162647 101056 29941 46621 214341 233797 114964
14263A14964M1245J3266l6618l4071l020K2231k3027L1775l6545j40122O8773
$$ 114964 156209 169475 132857 98786 95766 117997 94970 126745 90200 -49922 18851
14252A8851J49115j7083k40102j82757J04581J15647Q323J86427R3468n4640p7003
$$ 18851 167966 150883 -89219 -271976 -167395 -51748 -43425 143002 236470 181830 104827
14241A04827j22525k1896o5768m1763M8076K4080n961J37862l6007K345J23456
$$ 104827 -17698 -39594 -105362 -147125 -99049 -74969 -80930 56932 20925 23270 146726
14230A46726l8465p6205K4769j6015R3589J58911Q71j82636q5116K3872k407k8032
$$ 146726 108261 32056 56825 40810 134399 293310 294181 111545 26429 50301 47894 19862
14218A9862P0037O382l1498m6591k5930O5592K6729n8670O4564J12165M375m2241
$$ 19862 89899 96281 64783 18192 -7738 57854 84583 25913 90477 202642 207017 164776
14206A64776j41389m6129M8446K6235n6142o385P6018M5184L8360j16216m059
$$ 164776 23387 -22742 25704 51939 -4203 -10588 65430 110614 148974 32758 28699
14195B8699j840o4095k5037r394k2697q9863R660o269P7600J73339J33708m5929
$$ 28699 26859 -37236 -62273 -71667 -94364 -184227 -174567 -180836 -103236 70103 203811 157882
14183A57882q1625j4093p5990J1966J83419R766n9685J8370o5248n5971M301n6633
$$ 157882 76257 62164 -13826 -1860 181559 191325 131640 150010 84762 28791 33092 -23541
14171b3541k05306p343J43740K9095M8556l2124M6448P3575m3203J1127L2316
$$ -23541 -228847 -236190 -92450 -63355 -14799 -46923 -475 73100 29897 41024 73340
14160G3340N0137q0233j90762M5936R6823M4583N0221P9543J5620j6554r735k505
$$ 73340 123477 43244 -147518 -101582 -4759 39824 90045 169588 185208 168654 158919 156414
14148A56414k1014P7633q4789o1564j8279P5434L7464J25868j04654j70354p8463
$$ 156414 135400 213033 128244 66680 48401 123835 161299 287167 182513 12159 -66304
14137f6304L9122K6958l520N3729O4349n2772q592l5172J3171N5991L090l0864
$$ -66304 -27182 -224 -3744 49985 114334 61562 52970 17798 30969 86960 90050 59186
14125E9186n0902o9052J5151M0847L1145n6963j08037l2755J68017N8006J6647
$$ 59186 8284 -60768 -45617 -4770 26375 -30588 -138625 -171380 -3363 54643 71290
14114G1290L9791k5671p5136K1297k4121k8729P7102p9040r566k5686p0361o7248
$$ 71290 111081 85410 10274 31571 7450 -21279 55823 -23217 -32783 -58469 -128830 -196078
14102a96078q2740N3883J19581J930L0660K7183J0684j3586Q4771M0694K8324
$$ -196078 -278818 -224935 -105354 -103424 -72764 -45581 -34897 -48483 36288 76982 105306
14091A05306R4493l3531o4642k3148O6797j1117j8177j01191o0918K5659Q4561
$$ 105306 199799 166268 101626 78478 145275 134158 115981 14790 -46128 -20469 64092
14080F4092J9118l3079P025O9514j2215j61504j54451L8831P4829O0047m056L2575
$$ 64092 83210 50131 57156 126670 114455 -47049 -201500 -162669 -87840 -27793 -31849 726
14068G26L0687P5958N8407q5015j25487j0243J53132J25125o6952j88386q1675
$$ 726 31413 107371 165778 80763 -44724 -54967 98165 223290 156338 -32048 -113723
14057a13723K6037J79781k3837j05233j34292K6510R1825N3123r645L2326O5753
$$ -113723 -87686 92095 68258 -36975 -171267 -144757 -52932 191 -9454 22872 88625
14046H8625J5209j14228L3869J32319P9466N0660j29491o3640K1905j72817k7059
$$ 88625 103834 -10394 23475 155794 235260 285920 156429 92789 114694 -58123 -85182
14035h5182M519l8178Q7290p3381p1993O6188J18356J40157r381j36251q2398
$$ -85182 -80663 -118841 -31551 -104932 -176925 -110737 7619 147776 138395 2144 -80254
14024h0254O1153k0171j04906L5022o5326n9656M9335J28209J7416M9790k5831
$$ -80254 -19101 -39272 -144178 -109156 -174482 -234138 -184803 -56594 -39178 10612 -15219
14013a5219M0307K5109j02297l9364Q080L4848r8443K287J49685M6705L3323n4634
$$ -15219 25088 50197 -52100 -91464 -83384 -48536 -146979 -144692 4993 51698 85021 30387
14001C0387r0591m6865M4466L5027n965M7563j06734K7613N06Q4596J5525j52249
$$ 30387 -60204 -107069 -62603 -27576 -33541 14022 -92712 -65099 -64593 20003 35528 -116721
13989a16721K2596K4247N1057J42159q0588k0946R9388n0730n909K0270k0050
$$ -116721 -94125 -69878 -18821 123338 42750 21804 121192 70462 64553 84823 64773
13978F4773m8244q0794k0049p5480L4792N2338j1136k3836k4151J33860K03255
$$ 64773 16529 -64265 -84314 -159794 -125002 -72664 -83800 -107636 -131787 2073 205328
13967B05328o3029q7990J8844K8983p4082j54265l7417K30604J54880o4714p4595
$$ 205328 142299 54309 73153 102136 28054 -126211 -163628 66976 221856 157142 82547
13956H2547k4301o2255m2352M9938K9433R0762K5732r3642n2517p1000o5630m3190
$$ 82547 58246 -4009 -46361 3577 33010 123772 149504 55862 3345 -67655 -133285 -176475
13944a76475m1034P6553J76023J304j59804o192J1844R5083J23439J72850L1400
$$ -176475 -217509 -140956 35067 36371 -123433 -129625 -117781 -22698 100741 273591 304991
13933C04991j26161j7589J3774j01538l7282P0397L2075j38369m4916o2046l5643
$$ 304991 178830 161241 175015 73477 36195 106592 138667 298 -44618 -106664 -142307
13922a42307R3935M8722J8691n5584L9639J15800L1774n7659K2389J04084P1528
$$ -142307 -48372 350 19041 -36543 3096 118896 150670 93011 115400 219484 291012
13911B91012j99824o7630M0597M2301j7033l7943n2482L5420J3285M0127r08p0047
$$ 291012 91188 23558 64155 106456 89423 51480 -1002 34418 47703 87830 86922 16875
13899A6875Q4260q4054p3780R8590N0446p9770r5557m686O2706L7202j8070m3294
$$ 16875 101135 17081 -56699 41891 92337 12567 -82990 -87676 -24970 12232 -5838 -49132
13887d9132p8572m7608P628R3365O8789J42103L503j61466j26202J7056J58749
$$ -49132 -127704 -175312 -167684 -74319 -5530 136573 140076 -21390 -147592 -130536 28213
13876B8213P8279j2285J72126L7103k25116j60279n3939k1970L8055K5720L851
$$ 28213 106492 94207 266333 303436 78320 -81959 -135898 -157868 -119813 -94093 -90242
13865i0242R2144l7655n9647L2055O9985J8744m7342j72515j32513P8707M9524
$$ -90242 1902 -35753 -95400 -63345 6640 25384 -21958 -194473 -326986 -248279 -198755
13854a98755K0556R6441J02771P5444K5984P8316M2595p9382j89314p6691M2161
$$ -198755 -178199 -81758 21013 96457 122441 200757 243352 163970 -25344 -102035 -59874
13843e9874n6405q0703J47706P1835k2362l4737M5519J2961k0352Q3584M6547
$$ -59874 -116279 -196982 -49276 22559 197 -34540 10979 23940 3588 87172 133719
13832A33719j5270j2109n6390n7456L2016l9211k1626o0388Q387J91276j01572
$$ 133719 118449 106340 49950 -7506 24510 -14701 -36327 -96715 -88328 102948 1376
13821A376l3296J35055P3440r6023o5615j75020o546j4365J06433J54243N5401
$$ 1376 -31920 103135 176575 80552 14937 -160083 -166629 -180994 -74561 79682 135083
13810A35083K7877K2634j21976j50027P6306j0112k5638J3920K8940j5243Q8305
$$ 135083 162960 185594 63618 -86409 -10103 -20215 -45853 -31933 -2993 -18236 70069
13799G0069n1347k9271O2716r862r5312p7200J06205J68434R2977j2540j6171
$$ 70069 18722 -10549 52167 42305 -53007 -130207 -24002 144432 237409 224869 208698
13788B08698j22099k3313L4746K7188m7722l3340o2694k7383j05634o8006J26819
$$ 208698 86599 63286 98032 125220 77498 44158 -18536 -45919 -151553 -219559 -92740
13777i2740J18654J24442K096m9394l5430n8694M0399m5813J2103O5730O1078
$$ -92740 25914 150356 152452 103058 67628 8934 49333 3520 15623 81353 142431
13766A42431j5723m4755q9467l6975k8739J23562J00664N7919o5490j20188N1535
$$ 142431 126708 81953 -7514 -44489 -73228 50334 150998 208917 143427 23239 74774
13755G4774J4508j13963N0694P9490K6729m7394L8807J53444l5197j49239m2294
$$ 74774 89282 -24681 26013 105503 132232 84838 123645 277089 241892 92653 50359
13744E0359j7053J6229n1529M8481m184J6085n532p219O5075P10j56758j45032
$$ 50359 33306 49535 -1994 46487 42303 58388 52856 45637 110712 111422 -45336 -190368
13732a90368M1314J23065J90277p4856j68374L5401p8927m711j8976J01521O4442
$$ -190368 -149054 -25989 164288 89432 -78942 -43541 -122468 -127179 -146155 -44634 19808
13721A9808l9785N3639J8040N87n1232m5505m5654P4287L3954r1162K6532P8340
$$ 19808 -19977 33662 51702 52289 1057 -44448 -90102 -15815 18139 -73023 -46491 31849
13709C1849O3568M7182j5284l8796O9544l8865p4045K9541p4412Q995K7898P2146
$$ 31849 95417 142599 127315 88519 158063 119198 45153 74694 282 9277 37175 109321
$$ [...]
##END NTUPLES=NMR SPECTRUM
##END=
