##TITLE=Analysis number 327676
Compound Code sb 00736
Book Reference 190539
Project Code adrs flro3
Chemist Name jom
+insols
##JCAMPDX= 6.0         $$ Bruker NMR JCAMP-DX V2.0
##DATA TYPE= NMR SPECTRUM
##DATA CLASS= NTUPLES
##ORIGIN= Bruker BioSpin GmbH
##OWNER= nmr
$$ XWIN-NMR		Version 3.5
$$ Fri Mar 30 10:58:02 2007 GMT Daylight Time (UT+1h)  MAYBRIDGE\nmr@NMR_250MHZ
##.OBSERVE FREQUENCY= 250.131544655141
##.OBSERVE NUCLEUS= ^1H
##.ACQUISITION MODE= SIMULTANEOUS (DQD)
##.ACQUISITION SCHEME= undefined
##.AVERAGES= 16
##.DIGITISER RES= 18
##SPECTROMETER/DATA SYSTEM= dpx250
##.PULSE SEQUENCE= zg30
##.SOLVENT NAME= D2O
##.SHIFT REFERENCE= (INTERNAL, D2O, 0, 16.522)
##AUDIT TRAIL= $$ (NUMBER, WHEN, WHO, WHERE, WHAT)
$$ ##TITLE= Audit trail, XWIN-NMR		Version 3.5
$$ ##JCAMPDX= 5.01
$$ ##ORIGIN= Bruker BioSpin GmbH
$$ ##OWNER= nmr
$$ C:\u/data/dgb/nmr/ADRS/2740/pdata/1/auditp.txt
$$ ##AUDIT TRAIL=  $$ (NUMBER, WHEN, WHO, WHERE, WHAT)
(   1,<2007-03-30 10:57:37.70 +100>,<MAYBRIDGE\nmr>,<NMR_250MHZ>,
      <created by zg, POWCHK disabled, PULCHK disabled
       configuration hash MD5:
       49 4B E0 1D 92 C2 6B 37 9F E6 65 BC 52 41 86 1D
       data hash MD5: 64K
       E8 4B 20 48 AF 5D 6C 6F A8 38 FD 4F B3 B0 00 A2>)
(   2,<2007-03-30 10:57:51.73 +100>,<MAYBRIDGE\nmr>,<NMR_250MHZ>,
      <Start of raw data processing
       ef LB = 0.3 FT_mod = 6 PKNL = 1 SI = 32K 
       data hash MD5: 32K
       EF E0 BA AD C6 F9 A9 D9 3A 34 3E 77 E0 6C 98 E6>)
(   3,<2007-03-30 10:57:54.73 +100>,<MAYBRIDGE\nmr>,<NMR_250MHZ>,
      <apk 
       data hash MD5: 32K
       AD 59 EA 88 23 A7 37 9B 09 B6 08 DF A6 9C 35 25>)
(   4,<2007-03-30 10:57:55.56 +100>,<MAYBRIDGE\nmr>,<NMR_250MHZ>,
      <abs ABSG = 5 
       data hash MD5: 32K
       AA 13 BB 72 8A E9 7C E3 69 39 36 EC 7C F6 8B 06>)
$$ ##END=
$$ 
$$ hash MD5
$$ 02 AC 14 39 F0 4E 88 41 75 82 52 EF 63 F6 BC 62
##$RELAX= 
##$RELAX= 
##$RELAX= 
##$RELAX= 
##$RELAX= 
##$RELAX= 
##$RELAX= 
$$ Bruker specific parameters
$$ --------------------------
##$DU= <C:\u>
##$EXPNO= 2740
##$NAME= <ADRS>
##$PROCNO= 1
##$TYPE= <nmr>
##$USER= <dgb>
##$AMP= (0..31)
100 100 100 100 100 100 100 100 100 100 100 100 100 100 100 100 100 100 
100 100 100 100 100 100 100 100 100 100 100 100 100 100 
##$AQSEQ= 0
##$AQ_mod= 3
##$AUNM= <au_zg>
##$AUTOPOS= <59 >
##$BF1= 250.13
##$BF2= 250.13
##$BF3= 250.13
##$BF4= 250.13
##$BF5= 500.13
##$BF6= 500.13
##$BF7= 500.13
##$BF8= 500.13
##$BYTORDA= 1
##$CFDGTYP= 0
##$CFRGTYP= 5
##$CHEMSTR= <none>
##$CNST= (0..31)
1 1 145 1 1 1 1 1 1 1 1 1 1 1 1 1 1 1 1 1 1 1 1 1 1 1 1 1 1 1 1 1 
##$CPDPRG= <>
##$CPDPRG1= <>
##$CPDPRG2= <>
##$CPDPRG3= <>
##$CPDPRG4= <mlev>
##$CPDPRG5= <mlev>
##$CPDPRG6= <mlev>
##$CPDPRG7= <mlev>
##$CPDPRG8= <mlev>
##$CPDPRGB= <>
##$CPDPRGT= <>
##$D= (0..31)
0 1 0 0 0 0 0 0 0 0.06 0 0 0 0 0 0 0.0002 0 0 0 0 0 0 0 0 0 0 0 0 0 0 
0 
##$DATE= 1175248656
##$DBL= (0..7)
120 120 120 120 120 120 120 120 
##$DBP= (0..7)
150 150 150 150 150 150 150 150 
##$DBP07= 0
##$DBPNAM0= <>
$$ [...]
##$SUBNAM7= <"">
##$SUBNAM8= <"">
##$SUBNAM9= <"">
##$SW= 20.6930455092707
##$SWIBOX= (0..15)
0 0 3 0 0 0 0 0 0 0 0 0 0 0 0 0 
##$SW_h= 5175.983436853
##$TD= 65536
##$TD0= 1
##$TE= 683.16
##$TE2= 300
##$TE3= 300
##$TEG= 300
##$TL= (0..7)
0 120 120 120 120 120 120 120 
##$TP= (0..7)
150 150 150 150 150 150 150 150 
##$TP07= 0
##$TPNAME0= <>
##$TPNAME1= <>
##$TPNAME2= <>
##$TPNAME3= <>
##$TPNAME4= <>
##$TPNAME5= <>
##$TPNAME6= <>
##$TPNAME7= <>
##$TPOAL= (0..7)
0.5 0.5 0.5 0.5 0.5 0.5 0.5 0.5 
##$TPOFFS= (0..7)
0 0 0 0 0 0 0 0 
##$TUNHIN= 0
##$TUNHOUT= 0
##$TUNXOUT= 0
##$USERA1= <user>
##$USERA2= <user>
##$USERA3= <user>
##$USERA4= <user>
##$USERA5= <user>
##$V9= 5
##$VALIST= <valist>
##$VCLIST= <CCCCCCCCCCCCCCC>
##$VD= 0
##$VDLIST= <DDDDDDDDDDDDDDD>
##$VPLIST= <PPPPPPPPPPPPPPP>
##$VTLIST= <TTTTTTTTTTTTTTT>
##$WBST= 1024
##$WBSW= 4
##$XGAIN= (0..3)
0 0 0 0 
##$XL= 0
##$YL= 0
##$YMAX_a= 326111
##$YMIN_a= -456466
##$ZGOPTNS= <>
##$ZL1= 120
##$ZL2= 120
##$ZL3= 120
##$ZL4= 120
##$ABSF1= 16.522
##$ABSF2= -4.171173
##$ABSG= 5
##$ABSL= 3
##$ALPHA= 0
##$AQORDER= 0
##$ASSFAC= 0
##$ASSFACI= 0
##$ASSFACX= 0
##$ASSWID= 0
##$AUNMP= <proc_1d>
##$AZFE= 0.1
##$AZFW= 0.1
##$BCFW= 0
##$BC_mod= 0
##$BYTORDP= 0
##$COROFFS= 0
##$CY= 12.5
##$DATMOD= 1
##$DC= 0
##$DFILT= <>
##$DTYPP= 0
##$F1P= 14.0000005364418
##$F2P= -0.99999901652339
##$FCOR= 0.5
##$FTSIZE= 32768
##$FT_mod= 6
##$GAMMA= 0
##$GB= 0
##$INTBC= 1
##$INTSCL= 1
##$ISEN= 128
##$LB= 0.3
##$LEV0= 0
##$LPBIN= 0
##$MAXI= 10000
##$MC2= 0
##$MEAN= 0
##$ME_mod= 0
##$MI= 0
##$NCOEF= 0
##$NC_proc= -4
##$NLEV= 6
##$NOISF1= 0
##$NOISF2= 0
##$NSP= 0
##$NTH_PI= 0
##$NZP= 0
##$OFFSET= 16.522
##$PC= 1
##$PHC0= 256.5678
##$PHC1= -55.90359
##$PH_mod= 1
##$PKNL= yes
##$PPARMOD= 0
##$PSCAL= 4
##$PSIGN= 0
##$REVERSE= no
##$SF= 250.13
##$SI= 32768
##$SIGF1= 0
##$SIGF2= 0
##$SINO= 400
##$SIOLD= 32768
##$SREGLST= <1H.D2O>
##$SSB= 0
##$STSI= 32768
##$STSR= 0
##$SW_p= 5175.98343685301
##$SYMM= 0
##$S_DEV= 0
##$TDeff= 65536
##$TDoff= 0
##$TI= <Analysis number 999999
Compound Code 99
Book Reference 9
Project Code 9>
##$TILT= no
##$TM1= 0
##$TM2= 0
##$TOPLEV= 0
##$USERP1= <user>
##$USERP2= <user>
##$USERP3= <user>
##$USERP4= <user>
##$USERP5= <user>
##$WDW= 1
##$XDIM= 32768
##$YMAX_p= 315302985
##$YMIN_p= -141068
$$ End of Bruker specific parameters
$$ ---------------------------------
##NTUPLES= NMR SPECTRUM
##VAR_NAME=  FREQUENCY,     SPECTRUM/REAL,   SPECTRUM/IMAG
##SYMBOL=    X,             R,               I
##VAR_TYPE=  INDEPENDENT,   DEPENDENT,       DEPENDENT
##VAR_FORM=  AFFN,          ASDF,            ASDF
##VAR_DIM=   32768,         32768,           32768
##UNITS=     HZ,            ARBITRARY UNITS, ARBITRARY UNITS
##FACTOR=    0.157963299565203, 1,           1
##FIRST=     4132.6476996994, 0,             0
##LAST=      -1043.33573715361, 0,           0
##MIN=       -1043.33573715361, -141068,     0
##MAX=       4132.6476996994, 315302985,     0
$$ Real data points
##PAGE= N=1
##DATA TABLE= (X++(R..R)), XYDATA
$$ [...]
19806C416j1539k1915J0973J3517j1317j532J8012L1432Q305r629r474R658n194
$$ 3416 -8123 -30038 -19065 -5548 -16865 -18397 -385 31047 39352 29723 20249 29907 24713
19793B4713j6672j9456O128J1020K1818J372j2361j9495k2815j5749K6501J1822
$$ 24713 8041 -11415 -5287 5733 27551 28923 16562 -2933 -25748 -41497 -14996 -3174
19781c174K7504K595j8212k5020j3965r025Q716K2247J973J4609m991j3190l4876
$$ -3174 24330 26925 8713 -16307 -30272 -39297 -30581 -8334 -6361 8248 3257 -9933 -44809
19768d4809M092Q516L248k379p583K0751K0882o962K819J9982K3932P720n344
$$ -44809 -40717 -32201 -28953 -31332 -38915 -18164 2718 -4244 -1425 18557 42489 50209 44865
19755D4865k7595k9470j1937j491R828J919N968J6814j9018j9201J7100K9058
$$ 44865 17270 -12200 -24137 -25628 -15800 -13881 -7913 8901 -10117 -29318 -12218 16840
19743A6840K6119j4144j3598J1126J0617l9080j5071j1533J4495J6042m928J525
$$ 16840 42959 28815 15217 26343 36960 -2120 -17191 -28724 -14229 1813 -3115 -1590
19731a590j488r319O062M653l970P526L2502p319l0522k3382j2463J4663L9031
$$ -1590 -3078 -12397 -6335 -1682 -5652 1874 34376 27057 -3465 -26847 -39310 -24647 14384
19718A4384M739j5900m016J1867r853j1619J825J5094J5063J1107P769j0217J0383
$$ 14384 19123 3223 -793 11074 1221 -10398 -8573 6521 21584 32691 40460 30243 40626
19705D0626j1903j0883O694n320j6040j7778j3790j0875J7285K1081J0759M141
$$ 40626 28723 17840 24534 19214 3174 -14604 -28394 -39269 -21984 -903 9856 13997
19693A3997P336J912P954l0192O877J9636K592J4055J3665k9459o632J4885Q044
$$ 13997 21333 23245 31199 1007 7884 27520 30112 44167 57832 28373 21741 36626 44670
19680D4670q66j2551k5126l3507j1168J7702L284J0802K0036K6312k8471l0023
$$ 44670 43804 31253 6127 -27380 -38548 -20846 -17562 -6760 13276 39588 11117 -18906
19668a8906K3548N468N453K642J64K3736j3123k1499l5030k9360J4333K4955K5383
$$ -18906 4642 10110 15563 18205 18369 42105 28982 7483 -27547 -56907 -42574 -17619 7764
19655G764K5351l812j067L0409J6300k1183j5025J8573O16k4595M929M1488J1723
$$ 7764 33115 29303 28236 58645 74945 53762 38737 57310 57926 33331 38260 79748 91471
19642I1471r889m5114n1156j6599j1046O091K3518J5560L644K9682o240P811j3411
$$ 91471 81582 36468 -14688 -31287 -42333 -36242 -12724 2836 6480 36162 29922 37733 24322
19629B4322J1136k0469Q849L535m1374j5208J2963M816Q974k2313l0561J0565
$$ 24322 35458 14989 23838 27373 -14001 -29209 -16246 -11430 -2456 -24769 -55330 -44765
19617d4765L1509J0952j3751m3183j4879J5518K818P791R828j9161R477J4000
$$ -44765 -13256 -2304 -16055 -59238 -74117 -58599 -55781 -47990 -38162 -57323 -47846 -33846
19605c3846J4100P608m138M164J069J6299p884L090k6448k635K1071k046L372
$$ -33846 -19746 -12138 -16276 -12112 -11043 5256 -2628 462 -25986 -28621 -7550 -9596 -6224
19592f224J1228j0346k1021j0593J5965J4085M831Q480O495j420j4126K5167M741
$$ -6224 5004 -5342 -26363 -36956 -20991 -6906 -2075 6405 12900 11480 -2646 22521 27262
19579B7262M171M837n9195j6378J0811K9251K3993j8338j0022J27j7550J9899
$$ 27262 31433 36270 -22925 -39303 -28492 759 24752 6414 -3608 -3481 -21031 -1132
19567a132N719J5005J9951k278j4361j1593j1978l30m592M29J4604R937j1551
$$ -1132 4587 19592 39543 37265 22904 11311 -667 -997 -5589 -5160 9444 19381 7830
19554G830p044Q981k576k2776m210l384k7738n401J8359O316K8642L449p467k2767
$$ 7830 786 9767 7191 -15585 -19795 -23179 -50917 -56318 -37959 -31643 -3001 448 -7019 -29786
19540b9786j4085K3253L5607l428l910J4707j9315j5753K0431O00k825J3873n828
$$ -29786 -43871 -20618 14989 11561 7651 22358 3043 -12710 7721 8321 5496 19369 13541
19527A3541K4891J3566k0609j0255J912J7072j1937k9313j733K6354j2907j587
$$ 13541 38432 51998 31389 21134 23046 40118 28181 -1132 -2865 23489 10582 8995
19515H995R777J743R739l2575K857n674P788p891J0958j4289l413J2332n862k411
$$ 8995 18772 20515 30254 -2321 536 -5138 2650 -5241 5717 -8572 -11985 347 -5515 -7926
19501g926M279L138J1755k675N405p811j9592k5372K009R643J2646J4575l946
$$ -7926 -3647 -509 11246 8571 13976 6165 -13427 -38799 -36790 -27147 -14501 74 -3872
19488c872O729m763r589k88L6421q38l25J5589j0142m7617j8224N578K350o189
$$ -3872 2857 -1906 -11495 -11783 24638 23800 23475 39064 28922 -18695 -36919 -31341 -28991 -35180
19474c5180R49K5679L5166Q692J7854K6163k2497n0956m8329l2213R927L9449
$$ -35180 -34231 -8552 26614 35306 53160 79323 56826 5870 -42459 -74672 -64745 -25296
19462b5296J5203j1355M432K4838J0834Q213n799K769j747J099j269R486j2374
$$ -25296 -10093 -21448 -17016 7822 18656 26869 21070 23839 22092 23191 21922 31408 19034
19449A9034k5914l7366q552J8692L4960m593N515Q121k1415j9027M2058j2710
$$ 19034 -6880 -44246 -52798 -34106 854 -3739 1776 9897 -11518 -30545 11513 -1197
19437a197k0265J6641r222k872K2384J2203J335o678J2002j0199j3144k7472P003
$$ -1197 -21462 -4821 -14043 -16915 5469 17672 19007 12329 24331 14132 988 -26484 -19481
19424a9481J4389k2830R196j5202k962L5152K2730K625n022j2114l3741J682j362
$$ -19481 -5092 -27922 -18726 -33928 -36890 -1738 20992 23617 18595 6481 -27260 -25578 -26940
19411b6940J4242K4491K0186Q796j646k1281l5647L719J2396J0579l4824K925
$$ -26940 -12698 11793 31979 40775 39129 17848 -17799 -14080 -1684 8895 -25929 -23004
19399b3004m823J6574J0884R934N485l27J8689K4508j5270k6650j4069k2383J7468
$$ -23004 -27827 -11253 -369 9565 15050 14723 33412 57920 42650 16000 1931 -20452 -2984
19386b984J6283l9168l5058J3842K1126K3848J1675j2831j9297j4101L0921L0271
$$ -2984 13299 -25869 -60927 -47085 -25959 -2111 9564 -3267 -22564 -36665 -5744 24527
19374B4527m107j9888P844N074j1514j6853l804j1380J7059J6887o804J0809J1660
$$ 24527 20420 532 8376 13450 1936 -14917 -18721 -30101 -13042 3845 -2959 7850 19510
19361A9510r927j9145K212r425R162Q719R527j021j6253j0345N077J5799j3989
$$ 19510 9583 -9562 -7350 -16775 -7613 1106 10633 9612 -6641 -16986 -11909 3890 -10099
19348a0099R67P207n67j0952o229J8330J3214m766l3360j0158J8499j4818q064
$$ -10099 -9132 -1925 -2492 -13444 -19673 -1343 11871 7105 -26255 -36413 -17914 -32732 -40796
19335d0796l961J0920K810l819J5002K2834N87J6227j6384N041j7561J86r201
$$ -40796 -44757 -33837 -31027 -34846 -19844 2990 3577 19804 3420 8461 -9100 -8914 -18115
19322a8115k0447J3216K1518p254J700p623J320j01j3227j0445J2469L2406q922
$$ -18115 -38562 -25346 -3828 -11082 -9382 -17005 -15685 -15786 -29013 -39458 -26989 5417 -3505
19309c505l0178n395Q591p76L6599J6367j0133n087M866J167j6882J0162j00J612
$$ -3505 -33683 -39078 -30487 -31263 5336 21703 11570 6483 11349 12516 -4366 5796 5696 7308
19295G308p061K2510k5409k0268K1418J8566j6117k8460O269n921j0750J4434
$$ 7308 247 22757 -2652 -22920 -1502 17064 947 -27513 -21244 -27165 -37915 -23481
19283b3481L0363J7286j4361k2879J7916J3255k4606j4396k3427M127J3973J3649
$$ -23481 6882 24168 9807 -13072 4844 18099 -6507 -20903 -44330 -40203 -26230 -12581
19271a2581J6977k2821R282J5703L490K7753P723n373j1514l3563l4054r927J7622
$$ -12581 4396 -18425 -9143 6560 10050 37803 45526 40153 28639 -4924 -38978 -48905 -31283
19258c1283K0194M799n595n149J8066K9667j5474m0013J5091J3520j6601j5444
$$ -31283 -11089 -6290 -11885 -17034 1032 30699 15225 -24788 -9697 3823 -12778 -28222
19246b8222J4380Q835K1362j6195N310J4734j2897K878n36m160J0395O238P76
$$ -28222 -13842 -5007 16355 160 5470 20204 7307 10185 9649 5489 15884 22122 22898
19233B2898j5097j4729p913K4514J1525K351k74m383j0436j3622l931O42J4931
$$ 22898 7801 -6928 -14841 9673 21198 23549 23275 18892 8456 -5166 -9097 -8455 6476
19220F476J6361j5246J4080K1091j9969k6406j4607k2575J3205K729K9165M7261
$$ 6476 22837 7591 21671 42762 22793 -3613 -18220 -40795 -27590 -24861 4304 51565
19208E1565o205l5578l2710k609K365J022k100r863J7835j4553M094N93J4068
$$ 51565 45360 9782 -22928 -25537 -23172 -22150 -24250 -34113 -16278 -30831 -26737 -26144 -12076
19195a2076O728J1282N207k2124K108r043k104J2263J08q595J913K7730Q893j7237
$$ -12076 -5348 5934 11141 -10983 -8875 -17918 -20022 -7759 -7651 -16246 -14333 13397 22290 5053
19181E053j3203M793l559K400J0558j4466n571J1539j011j217n393j3139j4293
$$ 5053 -8150 -3357 -6916 -4516 6042 -8424 -13995 -2456 -3467 -4684 -10077 -23216 -37509
19168c7509Q044J162K7380j396J4238J6211O221P120N346J7968k2502m9627j5250
$$ -37509 -29465 -28303 -923 -2319 11919 28130 34351 41471 46817 64785 42283 -7344 -22594
19155b2594J0173N987l559K0309N424l2297K073J770k1R944M590Q720K1380j417
$$ -22594 -12421 -6434 -9993 10316 15740 -16557 -14484 -12714 -12735 -2791 1799 10519 31899 30482
19141C0482k6576P057k3834j1735j4900J0863N833k5592M685j1352K3906L0040
$$ 30482 3906 10963 -12871 -24606 -39506 -28643 -22810 -48402 -43717 -55069 -31163 -1123
19129a123j97p634N982O644J0193k1092J5735K6433M679O734k1982l7439r29j3063
$$ -1123 -1320 -8954 -2972 3672 13865 -7227 8508 34941 39620 46354 24372 -13067 -13996 -27059
19115b7059j5735K0267K7103K6529l809j4542k3258n115j2923j822J888J9347
$$ -27059 -42794 -22527 4576 31105 27296 12754 -10504 -15619 -28542 -30364 -28476 -9129
19103i129K0987J0995J2601o20j4913l174q53K4208j5349l4681k1226R297L6254
$$ -9129 11858 22853 35454 34834 19921 16747 15894 40102 24753 -9928 -31154 -21857 14397
19090A4397R157l900j1264J3503r146J1670j4080k3576k986R342n795p602J3660
$$ 14397 23554 19654 8390 21893 12747 24417 10337 -13239 -16225 -6883 -12678 -20280 -6620
19077f620J9173j070O22j332J4624n993J5169l2055J5544k4625q634K0182N749
$$ -6620 12553 11483 12105 10773 25397 19404 34573 2518 18062 -6563 -15197 4985 10734
19064A0734Q344o236l302L895j0028q945M354L276L229R413P185O861R20j9248
$$ 10734 19078 12842 9540 13435 3407 -5538 -1184 2092 5321 14734 21919 28780 29700 10452
19050A0452p141K1180K3733r60j9956o8O272k3183k3890N973K5841J3056j2081
$$ 10452 3311 24491 48224 47264 27308 27240 33512 10329 -13561 -7588 18253 31309 19228
19037A9228j5712j1792J5633J7598j6421j2983k9929k084R306R193p191J6816
$$ 19228 3516 -8276 7357 24955 8534 -4449 -34378 -36462 -27156 -17963 -25154 -8338
19025h338J1019j5936j8326r90j4794K2074O926j5446o862J1939Q558J6534K4238
$$ -8338 2681 -13255 -31581 -32571 -47365 -25291 -18365 -33811 -40673 -28734 -20176 -3642 20596
19012B0596K5985j4117l6229m357K0220K8112K6730J2565j6425l4062m3193k0129
$$ 20596 46581 32464 -3765 -8122 12098 40210 66940 79505 63080 29018 -14175 -34304
19000c4304n305J5381K8574J6126o81j3126P792O232j8945k076R222R120L680
$$ -34304 -39609 -24228 4346 20472 19791 6665 14457 20689 1744 -332 8890 18010 21690
18987B1690l8566r036j2563q628N087K2561l75Q947J3743K135j3966l0217J0091
$$ 21690 -16876 -25912 -38475 -47103 -42016 -19455 -19830 -10883 2860 4995 -8971 -39188 -29097
18974b9097k781j3210J0173J7529M678P702k646J618K966J4293p27n578p77L424
$$ -29097 -31878 -45088 -34915 -17386 -12708 -5006 -7652 -6034 -3068 11225 10498 4920 4143 7567
18960G567Q229L168K4904J24j484J1877j3466k5639J1100q23k1960K769k2787
$$ 7567 15796 18964 43868 43992 42508 54385 40919 15280 26380 25557 3597 6366 -16421
18947a6421m6084j4530N754J464q554l459J1951J6768J6175L1705K0216J655j8272
$$ -16421 -62505 -77035 -71281 -69817 -78371 -81830 -69879 -53111 -36936 -5231 14985 16640 -1632
18934a632J7364J7873m26L351o286j0460K1327J1825j4926l4813r033k861K3266
$$ -1632 15732 33605 33179 36530 30244 19784 41111 52936 38010 3197 -5836 -8697 14569
18921A4569j4912k2547o593R510M5617K0183k9229j8398K8327p560m7396j7535
$$ 14569 -343 -22890 -29483 -19973 25644 45827 16598 -1800 26527 18967 -28429 -45964
18909d5964O487J5687j436l201K6215R928m579j2983K18j729j9873J488L258J1649
$$ -45964 -39477 -23790 -25226 -28427 -2212 7716 3137 -9846 -9628 -11357 -31230 -29742 -26484 -14835
18895a4835K3084j0494j4019j4507j0585L9059J4436m074m879j5840k783P807
$$ -14835 8249 -2245 -16264 -30771 -41356 -2297 12139 8065 3186 -12654 -15437 -7630
18883g630o147Q653R543j4787K777M917J3981j9656j4048J502j700M929k201R540
$$ -7630 -13777 -5124 4419 -10368 -7591 -2674 11307 -8349 -22397 -20895 -22595 -17666 -19867 -10327
18869a0327J3195K0420k2312j3276j7955K2187K4866q078j3527j3508n749n465
$$ -10327 2868 23288 976 -12300 -30255 -8068 16798 8720 -4807 -18315 -24064 -29529
18857b9529M094K6472J11L073J2816j6170l650l441j2683k428P738J5037j758
$$ -29529 -25435 1037 1148 4221 17037 867 -2783 -6224 -18907 -21335 -13597 1440 -318
18844c18Q146l899l7582J813N848M946N575J2887K4440P58k3966j7741J0858m912
$$ -318 7828 3929 -33653 -31840 -25992 -21046 -15471 -2584 21856 22614 -1352 -19093 -8235 -13147
18830a3147j2729k644K1225J5301n160L93k4860k8180l3K4359J2388L3428O575
$$ -13147 -25876 -28520 -7295 8006 2846 3239 -21621 -49801 -49834 -25475 -13087 20341 26916
18817B6916k9080k6952j2191P666K9091j288n621j6049J2814k0245R811L0264
$$ 26916 -2164 -29116 -41307 -33641 -4550 -5838 -11459 -27508 -14694 -34939 -25128 5136
18805E136r60m502q719J6833Q927j4066Q77o625k4758M850J0407l264M247m103
$$ 5136 4176 -326 -9045 7788 16715 2649 3526 -3099 -27857 -23007 -12600 -15864 -11617 -15720
18791a5720J9625j759J1386k969O750j5513k3613j3810M435p897j1955j671J9799
$$ -15720 3905 2146 13532 10563 17313 1800 -21813 -35623 -31188 -39085 -51040 -52711 -32912
18778c2912K687J4973p614n490o318j5191m347r192K2976K7452R124j3568K6250
$$ -32912 -30225 -15252 -22866 -28356 -34674 -49865 -54212 -63404 -40428 -12976 -3852 -17420 8830
18765H830L2947o43j9566j7396l697r632P828J1554J484J6252j7306q754j2852
$$ 8830 41777 41134 21568 4172 475 -9157 -1329 10225 11709 27961 10655 1901 -10951
18752a0951K518l3641l2450J2616J6710K5289n559n666R085j0103J5193r706M700
$$ -10951 -8433 -42074 -74524 -61908 -45198 -19909 -25468 -31134 -22049 -32152 -16959 -26665 -21965
18739b1965K4389n744j4726J448P069L049l045J8585K3330j2156k2348j7619O335
$$ -21965 2424 -3320 -18046 -16598 -9529 -6480 -9525 9060 32390 20234 -2114 -19733 -13398
18726a3398k3908P560J2746N880K6396J8010m988o74J2856j3589R010J0893j4757
$$ -13398 -37306 -29746 -17000 -11120 15276 33286 28298 27624 40480 26891 35901 46794 32037
18713C2037j3975L565k768l4853R558J9071j8660j0794L3384N337j4183j7298
$$ 32037 18062 21627 18859 -15994 -6436 12635 -6025 -16819 16565 21902 7719 -9579
18701i579k616J2330J0672p715l0963j7094J1174J1101J7858j0080l0810j2723
$$ -9579 -12195 135 10807 3092 -27871 -44965 -33791 -22690 -4832 -14912 -45722 -58445
18689e8445J3315J5955m936J1701N746J6341J1338l901m305K378K1373m360j4923
$$ -58445 -45130 -29175 -34111 -22410 -16664 -323 11015 7114 2809 5187 26560 22200 7277
18676G277R230M246j1934O351J0555J048k5109J364J4168j2680j5377J475J940
$$ 7277 16507 20753 8819 15170 25725 26773 1664 3028 17196 4516 -10861 -9386 -7446
18663g446j877J0821J2963j1661j6575o75M86j3496J4007L582O573L3525L2116
$$ -7446 -9323 1498 14461 2800 -13775 -14450 -13964 -27460 -13453 -9871 -3298 30227 62343
18650F2343m109p703k1908l0251j0276q592Q656J6897J4621l3178k7554O178K2452
$$ 62343 58234 50531 28623 -1628 -11904 -20496 -11840 5057 19678 -13500 -41054 -34876 -12424
18637a2424L8606K2132j2067k3763k619P351j9627j8270l8964j2261N6521J9984
$$ -12424 26182 48314 36247 12484 9865 17216 -2411 -20681 -59645 -71906 -15385 4599
18625D599N226P635M374m839k3743J548R514O056J2414k428j2905J0291p11j0198
$$ 4599 9825 17460 21834 16995 -6748 -5200 4314 10370 22784 20356 7451 17742 17031 6833
18611F833j6546o485J3976K756p440O762j9536l0968J9961L5671J1881r592k186
$$ 6833 -9713 -16198 -2222 534 -6906 -144 -19680 -50648 -30687 4984 16865 7273 5087
18598E087M412R130P608p598k5048j5290r07m912L8020J4927p52K4387j3494j8194
$$ 5087 9499 18629 26237 18639 -6409 -21699 -22606 -27518 10502 25429 24677 49064 35570 17376
18584A7376O252j0640l4932j7435J0457P518J2241K152P686J6426j9048j5493
$$ 17376 23628 12988 -21944 -39379 -28922 -21404 -9163 -7011 675 17101 -1947 -17440
18572a7440j9096O463n662J6436K9443J9076K438M756j1458k1287m553j2727L743
$$ -17440 -36536 -30073 -35735 -19299 10144 29220 31658 36414 24956 3669 -884 -13611 -9868
18559i868J9376L694k261j5180Q634p285j5256j3983k337J8373P759k5640j8277
$$ -9868 9508 13202 10941 -4239 4395 -2890 -18146 -32129 -34466 -16093 -8334 -33974 -52251
18546e2251j562p060N558L3823j7993j499K4045J7255r006j5059j8696J1917J8606
$$ -52251 -53813 -60873 -55315 -21492 -39485 -40984 -16939 316 -8690 -23749 -42445 -30528 -11922
18533a1922J9266j4304j3981j4281Q535J4770K898l319M165o269r863j899j0735
$$ -11922 7344 -6960 -20941 -35222 -26687 -11917 -9019 -12338 -8173 -14442 -24305 -26204 -36939
18520c6939J4494j4584o620J3524k416J8490L4946L3700m757l922l5509k0234
$$ -36939 -22445 -37029 -43649 -30125 -32541 -14051 20895 54595 49838 45916 10407 -9827
18508i827j7211k798J2571J067K845P110o941q964q496K6749k472k5948L5002
$$ -9827 -27038 -29836 -17265 -16198 -13353 -6243 -13184 -22148 -30644 -3895 -6367 -32315 2687
18495B687K3819O20J193l8998r027L7445J3872j4730N322K060r526l2665J1197
$$ 2687 26506 27126 28319 -10679 -19706 17739 31611 16881 22203 24263 14737 -17928 -6731
18482f731K3342j7765o767o650l86M472K3001N794m7568j7888J1606l733J1435
$$ -6731 16611 -1154 -7921 -14571 -14957 -10485 12516 18310 -29258 -47146 -35540 -39273 -27838
18469b7838J8466M870j1982O802m129n55J5987J4457J028m1457k0404K5869J6585
$$ -27838 -9372 -4502 -16484 -9682 -13811 -14366 1621 16078 17106 -24351 -44755 -18886 -2301
18456b301K144K718k0174k3442J8701L1450K8946m70m337k4310j4398n92Q605
$$ -2301 -157 2561 -17613 -41055 -22354 9096 38042 37572 33235 8925 -5473 -6065 2540
18443B540J432p75q74L522o393j4573q000Q955J1673m414q684Q222n921N284J9690
$$ 2540 3972 3197 2323 5845 -548 -15121 -23121 -14166 -2493 -6907 -15591 -7369 -13290 -8006 11684
18428A1684J3865p406j8008N006n302N8m121m1131q37J8323j3071o643J5815J7447
$$ 11684 25549 18143 135 5141 -161 -103 -4224 -45355 -46192 -27869 -40940 -47583 -31768 -14321
18414a4321n370j4862j9517L0152L1895P794o953q037m430j982J5034L053J166
$$ -14321 -19691 -34553 -54070 -23918 7977 15771 8818 781 -3649 -5631 9403 12456 13622
18401A3622K1248K6691l8120j6199N613j624J940Q681J4614K4805N129k0966j8480
$$ 13622 34870 61561 23441 7242 12855 11231 13171 21852 36466 61271 66400 45434 26954
18388B6954p303l3071j1958j0836j1955j2733K4703K6690J4239J6016N377j4872
$$ 26954 19651 -13420 -25378 -36214 -48169 -60902 -36199 -9509 4730 20746 26123 11251
18376A1251J536K3602J0907q986p375j5108L051J3531l298j1843j738m6k0023
$$ 11251 12787 36389 47296 38310 30935 15827 18878 32409 29111 17268 15530 15484 -4539
18363d539m877j206K035n059K747R55k570J7147n501n058m7534k2049J3129L9559
$$ -4539 -9416 -10622 -8587 -13646 -10899 -9944 -12514 4633 -868 -5926 -53460 -75509 -62380 -22821
18349b2821q434j4416K9784K4189k272o454p316j7547n737K8307J8894J3396J8248
$$ -22821 -31255 -45671 -15887 8302 6030 -424 -7740 -25287 -31024 -2717 16177 29573 47821
18336D7821N146k0796l6462j7073L4083k4068l1565J0271K0242J0399N38j8749
$$ 47821 52967 32171 -4291 -21364 12719 -11349 -42914 -32643 -12401 -2002 -1464 -20213
18324b0213M399L144j020K1876J5288l520j6692j1830l204J8530k5283l383L5824
$$ -20213 -15814 -12670 -13690 8186 23474 19954 3262 -8568 -11772 6758 -18525 -21908 13916
18311A3916j9225k0929j0791J8299j064J3386L255k282J4711J3218J1652o520
$$ 13916 -5309 -26238 -37029 -18730 -19794 -6408 -3153 -5435 9276 22494 34146 27626
18299B7626P090J5299l1558k6285O433j1380j1642J9850J8310o349q847j2863
$$ 27626 34716 50015 18457 -7828 -1395 -12775 -24417 -4567 13743 7394 -1453 -14316
18287a4316r16J1020k925j0239j347l452m058R350j547p638O728M848j1145l0724
$$ -14316 -15232 -4212 -7137 -17376 -18723 -22175 -26233 -16883 -18430 -26068 -19340 -14492 -25637 -56361
18273e6361j6554M3181N7157K0354k0302n40K375j5793O00k9921j154K4915j1500
$$ -56361 -72915 -29734 27423 47777 27475 26935 29310 13517 14117 -15804 -16958 7957 -3543
18260c543k5635r528P068j3981J4967N955J4109J7970J027L54P361m387K3476
$$ -3543 -29178 -38706 -31638 -45619 -30652 -24697 -10588 7382 8409 8763 16124 11737 35213
18247C5213k569n021l1845r408k5565L0638O151l0199j133O122J3033J6535J0269
$$ 35213 32644 27623 -4222 -13630 -39195 -8557 -2406 -32605 -33738 -27616 -14583 1952 12221
18234A2221j9522M7020J6110l4604j3005J6987Q487k8687l0638J931j3423k6643
$$ 12221 -7301 39719 55829 21225 8220 25207 33694 5007 -25631 -23700 -37123 -63766
18222f3766r755J0516J0654K1180J6077Q883J6312M365k9149k1254r559m333L1669
$$ -63766 -73521 -63005 -52351 -31171 -15094 -6211 10101 14466 -14683 -35937 -45496 -49829 -18160
18209a8160K0414j1006J1938J6022o406k4621l413k0874L1515L5918q16j2515
$$ -18160 2254 -8752 3186 19208 12802 -11819 -15232 -36106 -4591 31327 30511 17996
18197A7996q407k3697o762k380k0931k212J5391R324O486M571j5889k2103k1388
$$ 17996 9589 -14108 -20870 -23250 -44181 -46393 -31002 -21678 -15192 -10621 -26510 -48613 -70001
18184g0001J1731K0865J6178K9122J1817p050j4602n877O704j8814j7148J1527
$$ -70001 -58270 -37405 -21227 7895 19712 12662 -1940 -7817 -1113 -19927 -37075 -25548
18172b5548K1799k0298L390j727P571p897n419O047R083j6599j2430m8K0298O072
$$ -25548 -3749 -24047 -20657 -22384 -14813 -22710 -28129 -22082 -12999 -29598 -42028 -42076 -21778 -15706
18158a5706R90J3505J8503J5452k0577J1920j7387k4815R13R756K4459o316j2894
$$ -15706 -14716 -1211 17292 32744 12167 24087 6700 -18115 -17202 -7446 17013 10697 -2197
18145b197j576q788l067J1777n115R822K055K2612N18l8603J4910K4088K9957
$$ -2197 -3773 -12561 -15628 -3851 -8966 856 2911 25523 26041 -12562 2348 26436 56393
18132E6393l503o3532l1072J9937J6220p578J8361r896r308M8602K0655k3373
$$ 56393 52890 -10642 -41714 -21777 -5557 -13135 5226 -4670 -13978 34624 55279 31906
18120C1906j7685o438k69P908l070j6778J1183K223P106P158K795k5174J6K5496
$$ 31906 14221 7783 7514 15422 12352 -4426 6757 8980 16086 23244 26039 865 881 26377
18106B6377J5431K8439j4830l187K5782q984k7618l2110L800K4043j3845o216
$$ 26377 41808 70247 55417 52230 78012 69028 41410 9300 13100 37143 23298 17082
18094A7082j9086m080L3492m150k5444O633K7255j6818k6730p499m452J0516r866
$$ 17082 -2004 -6084 27408 23258 -2186 4447 31702 14884 -11846 -19345 -23797 -13281 -23147
18081b3147j0337K369J9458k411J3134N764j7784j0417L98J8645M136L3041k874
$$ -23147 -33484 -31115 -11657 -14068 -934 4830 -12954 -23371 -22973 -4328 -192 32849 29975
18068B9975p293j5980r710j2974k432M877j3139L722N11m651J0453Q969K951J059
$$ 29975 22682 6702 -3008 -15982 -18414 -13537 -26676 -22954 -22443 -27094 -16641 -7672 -4721 -3662
18054c662q109j1542J2513k518l176K2315j050o860O959j0358j7951K355P594
$$ -3662 -11771 -23313 -10800 -13318 -16494 5821 4771 -2089 4870 -5488 -23439 -21084 -13490
18041a3490L075Q947R892j3339j1871M314k5003k8607j5930K2225K7820M552J7380
$$ -13490 -10415 -1468 8424 -4915 -16786 -12472 -37475 -66082 -82012 -59787 -31967 -27415 -10035
18028a0035J9605k190p490k6410j3641J112r969K486j3082J6382j06J7078J9751
$$ -10035 9570 7380 -110 -26520 -40161 -39049 -49018 -46532 -59614 -43232 -43338 -26260 -6509
18015f509J4465L0579O995k3312L243k2485k0728J4357o470m6646K1321K9550
$$ -6509 7956 38535 45530 22218 25461 2976 -17752 -3395 -9865 -56511 -35190 -5640
18003e640J8802k8693l6899R141K1854j0006M098N603q177J1609K45L834J9573
$$ -5640 13162 -15531 -52430 -43289 -21435 -31441 -27343 -21740 -29917 -18308 -18063 -14229 5344
17990E344l261l302q797m346L13J1164O52k412m274p708j615j5068k3973k0640
$$ 5344 2083 -1219 -10016 -14362 -14049 -2885 -2233 -4645 -8919 -16627 -18242 -33310 -57283 -77923
17976g7923K125Q674J2497n244k451J1963j773p658J0530K4354k014j5200M077
$$ -77923 -75798 -67124 -54627 -59871 -62322 -50359 -52132 -59790 -49260 -24906 -26920 -42120 -38043
17963c8043j5239J6804K0344k2366j2571Q650L1495J2236j2027Q428j5722R308
$$ -38043 -53282 -36478 -16134 -38500 -51071 -42421 -10926 1310 -10717 -2289 -18011 -8703
17951h703O499l454L648j0022l784J6928j9355J4522K2844o408j9546j4789L649
$$ -8703 -2204 -5658 -2010 -12032 -15816 1112 -18243 -3721 19123 12715 -6831 -21620 -17971
17938a7971K6001J155k7942l195J7752l462m329q898K8717N522j5762j6150Q771
$$ -17971 8030 9185 -18757 -21952 -4200 -7662 -11991 -20889 7828 13350 -2412 -18562 -9791
17925i791q469p953L674J3156q326K2299k4814j2619K6060R261J311N541j4989
$$ -9791 -18260 -26213 -22539 -9383 -17709 4590 -20224 -32843 -6783 2478 3789 9330 -5659
17912e659l6225k2661L5377L917n82l95J46J2492P546L204Q607K0013K4391K722
$$ -5659 -41884 -64545 -29168 -25251 -25833 -26228 -26082 -13590 -6044 -2840 5767 25780 50171 52893
17898E2893k0161k4640o283K9475j1739l9645k9522J3868L536J6479j203k7248
$$ 52893 32732 8092 1809 31284 19545 -20100 -49622 -35754 -32218 -15739 -16942 -44190
17886d4190J5007J2397l164l2610Q064M9431R372M77o30k1465l8177j7903K2188
$$ -44190 -29183 -16786 -19950 -52560 -44496 4935 14307 14784 14154 -7311 -45488 -63391 -41203
17873d1203M046L396M440Q64Q581R96n455J2234L610R68j2331J8470j5474l2904
$$ -41203 -37157 -33761 -29321 -28457 -19876 -18880 -24335 -12101 -8491 -7523 -19854 -1384 -16858 -49762
17859d9762J1997M5415p694j9276R303J1949J3159p071l0025j7600L0109q762
$$ -49762 -37765 7650 -44 -19320 -10017 1932 15091 8020 -22005 -39605 -9496 -18258
17847a8258m5581P301J9965K4699K485j6155K951N900k5538q068j287K5493j2066
$$ -18258 -63839 -56538 -36573 -11874 -9389 -25544 -22593 -16693 -42231 -50299 -51586 -26093 -38159
17834c8159M003L009L2895k164O489j2092m039j8964J0362j5967j0382Q566l30
$$ -38159 -34156 -31147 1748 -416 6073 -6019 -10058 -29022 -18660 -34627 -45009 -36443 -36773
17821c6773J0470J2690K2449k25Q419j3296o2P251j4157n3965j2431K7163J4263
$$ -36773 -26303 -13613 8836 8611 17030 3734 3672 10923 -3234 -57199 -69630 -42467 -28204
17808b8204j9231l419J9342K6427O72j0409J5664k602o277J6922r675l0921j499
$$ -28204 -47435 -50854 -31512 -5085 -4413 -14822 842 -1760 -8037 8885 -790 -31711 -33210
17795c3210P732K5825N500k1411p407m523j2885K0287J9241o999k2613J3196M1219
$$ -33210 -25478 347 5847 -15564 -22971 -27494 -40379 -20092 -851 -7850 -30463 -17267 23952
17782B3952O796j2668k6689k392l0682L039K0222J1826K2699J2144k79k4613l1609
$$ 23952 30748 18080 -8609 -11001 -41683 -38644 -18422 -6596 16103 28247 27968 3355 -28254
17769b8254n30J591k347j1277K846j21J7659K0279J2177P780N398p235k5065l3630
$$ -28254 -28784 -27193 -29540 -40817 -37971 -38092 -20433 -154 12023 19803 25201 17966 -7099 -40729
17755d0729P831L0901q924j536o51j0047J8765L2927n358l7591j6954j4728J6354
$$ -40729 -32898 -1997 -10921 -12457 -13108 -23155 -4390 28537 23179 -14412 -31366 -46094 -29740
17742b9740R837J9813j1185r011n142K1301P529J5658r656j1350j3976j8372R78
$$ -29740 -19903 -90 -11275 -20286 -25428 -4127 3402 19060 9404 -1946 -15922 -34294 -33316
17729c3316n479J1712O461J1277P561j6746J4233q796l9360Q12J4437K3447m520
$$ -33316 -38795 -27083 -20622 -9345 -1784 -18530 -4297 -13093 -52453 -51641 -37204 -13757 -18277
17716a8277k2162q135N242K2926K6654o24k9335j6577J5101j1735l570j5650q962
$$ -18277 -40439 -48574 -43332 -20406 6248 5624 -23711 -40288 -25187 -36922 -40492 -56142 -65104
17703f5104K0743J1005j2686j5987R882L4519K6468j6670j7287l7512j2757k853
$$ -65104 -44361 -33356 -46042 -62029 -52147 -17628 8840 -7830 -25117 -62629 -75386 -78239
17691g8239J9198L4308j4019j6202L944K2892L0377N428K352r471j392j8169j8167
$$ -78239 -59041 -24733 -38752 -54954 -51010 -28118 2259 7687 10039 568 -824 -18993 -37160
17678c7160R686K024r909P195J6857k0079K402K6978K1948l5894k9230L2198M7539
$$ -37160 -27474 -25450 -35359 -28164 -11307 -31386 -28984 -2006 19942 -15952 -45182 -12984 34555
17665C4555P468k0113r850k3584k1160R464j2958k762m946o12k775M892R262K4724
$$ 34555 42023 21910 12060 -11524 -32684 -23220 -36178 -38940 -43886 -44498 -47273 -42381 -33119 -8395
17651h395J2035j2843J204o41L255r369o333K9858m411p019j0958l931K3610J7249
$$ -8395 3640 -9203 -7999 -8640 -5385 -14754 -21087 8771 4360 -2659 -13617 -17548 6062 23311
17637B3311n413J6786r659k5501O511J2036l810m8082l3235J2984J1984j8857
$$ 23311 17898 34684 25025 -476 6035 18071 14261 -33821 -67056 -54072 -42088 -60945
17625f0945J0322r822J8163K1485J2463J0299j3612o88j6475P466K2871j4854
$$ -60945 -50623 -60445 -42282 -20797 -8334 1965 -11647 -12335 -28810 -21344 1527 -13327
17613a3327l8376P202J7556N66j352O909K674M631K5803M179l535q385j3275j2749
$$ -13327 -51703 -44501 -26945 -26379 -27731 -20822 -18148 -13517 12286 16465 12930 4545 -8730 -21479
17599b1479k2383J753J5806O147j5168n917J4188j2749J830j4294J3299J3568
$$ -21479 -43862 -42109 -26303 -20156 -35324 -41241 -27053 -39802 -37972 -52266 -38967 -25399
17587b5399N987n52j918k493j1255j2297J6756J3251J5460n959o699N708J6554
$$ -25399 -19412 -19964 -21882 -24375 -35630 -47927 -31171 -17920 -2460 -8419 -15118 -9410 7144
17574G144K2696j0129p692P934L8743l14k0369k232P430j1314k0348q578j3181
$$ 7144 29840 19711 12019 19953 58696 58382 38013 35781 43211 31897 11549 2971 -10210
17561a0210J475L431L900O483n64N426P127j5917J75R294n915o094j473l1719
$$ -10210 -8735 -5304 -1404 5079 4515 9941 17068 1151 1326 10620 4705 -1389 -2862 -34581
17547c4581J2265R925O457J5870K060j9912j1992k1923L938K9232j1245j7837
$$ -34581 -22316 -12391 -5934 9936 11996 -7916 -19908 -41831 -37893 -8661 -19906 -37743
17535c7743l195M168L635K2270m474r347N88j4841o982R290p828Q815L6430J1964
$$ -37743 -40938 -36770 -33135 -10865 -15339 -24686 -24098 -38939 -45921 -36631 -44459 -35644 786 12750
17521A2750l533J0977M067L118l975k5341r034m31k794J9122j883k2102K7729
$$ 12750 9217 20194 24261 27379 23404 -1937 -10971 -11402 -14196 4926 3043 -19059 8670
17508H670J0743k9566j4283j702l314n089K979K8787J7589r922k1188j9973L155
$$ 8670 19413 -10153 -24436 -26138 -29452 -34541 -31562 -2775 14814 4892 -16296 -36269 -33114
17495c3114K5025M592j0040J8527J0521l442j2998J7115p426r914J2360O163l3221
$$ -33114 -8089 -3497 -13537 4990 15511 12069 -929 16186 8760 -1154 11206 17369 -15852
17482a5852n965j1972j9719J5272j6852k0978K9751K1969M843J7394j8599Q117
$$ -15852 -21817 -33789 -53508 -38236 -55088 -76066 -46315 -24346 -19503 -2109 -20708 -12591
17470a2591J1343j0449k5409N284J0419M530K4068O333k7272l0460n845Q172J4160
$$ -12591 -1248 -11697 -37106 -31822 -21403 -16873 7195 13528 -13744 -44204 -50049 -41877 -27717
17457b7717j699J5637J9279J7756P83m341j5245k4882L557l750m698J664Q605
$$ -27717 -29416 -13779 5500 23256 24039 19698 4453 -20429 -16872 -20622 -25320 -23656 -15051
17444a5051r116p870K0126m09j100n990J5822Q213r10K8570l2096j9158K3988
$$ -15051 -24167 -32037 -11911 -12320 -13420 -19410 -3588 4625 3715 32285 189 -18969 5019
17431E019k177m9773k4095K8486k101l753J0812K1937P177L54l160j5018J7013
$$ 5019 2842 -46931 -71026 -42540 -44641 -48394 -37582 -15645 -8468 -8114 -11274 -26292 -9279
17418i279J8818j1309j4287j240Q292n259k641k2882J4390M310j317l204p80J3033
$$ -9279 9539 -1770 -16057 -17297 -9005 -14264 -16905 -39787 -25397 -21087 -22404 -25608 -26388 -13355
17404a3355K6492j6158k6589O339J4481J2845j063J2571k727k3356j7822j8702
$$ -13355 13137 -3021 -29610 -23271 -8790 4055 2992 15563 12836 -10520 -28342 -47044
17392d7044m77L0035N3635l034q781k4533o874j7516p000K3730Q724j5169J6928
$$ -47044 -47521 -17486 36149 33115 24334 -199 -7073 -24589 -31589 -7859 865 -14304 2624
17379B624Q287l813M796L053R943J7721r07k6700j4165j0846J1047K7992J974
$$ 2624 10911 7098 11894 14947 24890 42611 41704 15004 839 -10007 1040 29032 31006
17366C1006P759K256l3129n328l4922k6248K0241m587L620j987K8578n540q528
$$ 31006 38765 41021 7892 2564 -32358 -58606 -38365 -42952 -39332 -41319 -12741 -18281 -26809
17353b6809p396K569P935p079J0104L248K2467J1858k1056k0823j331j346J0025
$$ -26809 -34205 -31636 -23701 -30780 -20676 -17428 5039 16897 -4159 -24982 -26313 -27659 -17634
17340a7634r798l10J5966K870j7094j6003L0188J0537k151o867j4670J4981J8593
$$ -17634 -27432 -27742 -11776 -8906 -26000 -42003 -11815 -1278 -3429 -10296 -24966 -9985 8608
17327H608K4199M348J3341n681k3525k6570J2347m858j5658j0397K1948J307L482
$$ 8608 32807 37155 50496 44815 21290 -5280 7067 2209 -13449 -23846 -1898 -591 2891
17314B891m795q65j4118j0251m15R560l460K7973k116j2461j1177j7881j6923
$$ 2891 -1904 -2769 -16887 -27138 -27553 -17993 -21453 6520 4404 -8057 -19234 -37115 -54038
17301e4038k2707J9260M1234j9014q723K5593J0406j0361o159r331R913K1195
$$ -54038 -76745 -57485 -16251 -35265 -43988 -18395 -7989 -18350 -24509 -33840 -23927 -2732
17289b732J3409k3959o952O609j7020j5002K5963J7494j6055j5700K919k8792
$$ -2732 10677 -13282 -20234 -13625 -30645 -45647 -19684 -2190 -18245 -33945 -31026 -59818
17277e9818J2355p049l3331k0922K2712J9536L001L638K2707K1296o663j5400
$$ -59818 -47463 -54512 -87843 -108765 -86053 -66517 -63516 -59878 -37171 -15875 -22538 -37938
17265c7938J772J5372k1149m913k307n120J9853J1452J2067p677k1615l506k3931
$$ -37938 -36166 -20794 -41943 -46856 -49163 -54283 -34430 -22978 -10911 -18588 -40203 -43709 -67640
17252f7640m24J7361K6598l176j9577J8461J2332p302k3091N649P299J7732m811
$$ -67640 -68064 -50703 -24105 -27281 -46858 -28397 -16065 -23367 -46458 -40809 -33510 -15778 -20589
17239b0589J537K2578P964n3928j5277J0144j1029J1394M6039M6623j6733l9631
$$ -20589 -19052 3526 11490 -42438 -57715 -47571 -58600 -47206 -1167 45456 28723 -10908
17227a0908k8868j6622K2265J2410M07j8568J8418j861q313o583p128J2685R702
$$ -10908 -39776 -56398 -34133 -21723 -21316 -39884 -21466 -23327 -31640 -38223 -45351 -32666 -22964
17214b2964r409q50j3523j4457L092K9666J6358p394O06j8473J7096J8661j4237
$$ -22964 -32373 -33223 -46746 -61203 -58111 -28445 -12087 -19481 -18875 -37348 -20252 -1591 -15828
17201a5828j1156j8002J9733P702k1287J0547O154l978q103P261L6141J4844j9033
$$ -15828 -26984 -44986 -25253 -17551 -38838 -28291 -22137 -26115 -34218 -26957 9184 24028 4995
17188D995j1992K6053j9360r163k5424p894k508j87N789j1595N739J1027J597
$$ 4995 -6997 19056 -304 -9467 -34891 -42785 -45293 -45480 -39691 -51286 -45547 -34520 -32923
17175c2923l2564q213o614K7767Q037j388j0807K993n639N316L0634p419l8889
$$ -32923 -65487 -73700 -80314 -52547 -44510 -45898 -56705 -53712 -59351 -54035 -23401 -30820 -69709
17162f9709J442M1213L7412J3845M833k6332l9496l5314J3434L0915N672p856
$$ -69709 -68267 -27054 10358 24203 29036 2704 -36792 -72106 -58672 -27757 -22085 -29941
17150b9941k923J7136j3613l273l648k1927q258L98O502p374J0007P243J8080
$$ -29941 -32864 -15728 -29341 -32614 -36262 -58189 -66447 -66049 -59547 -66921 -56914 -49671 -31591
17137c1591K1181j163l2140K9051K1840Q482j1172l4753k6249L3716J0756k334
$$ -31591 -10410 -11573 -43713 -14662 7178 15660 4488 -30265 -56514 -22798 -12042 -14376
17125a4376l9357j1221L8944j7728j8397J7260J2631n51j7068J0626K5964R07
$$ -14376 -53733 -64954 -26010 -43738 -62135 -44875 -32244 -32795 -49863 -39237 -13273 -12366
17113a2366Q57j205j1488J5113o061j9284l982j0189J674K4358K2830k3808k5238
$$ -12366 -11509 -12714 -24202 -9089 -15150 -34434 -38416 -48605 -46931 -22573 257 -23551 -48789
17100d8789r079L974J9933N4J9633J6410j8797k6018j7123O945J2484J5689L5874
$$ -48789 -57868 -53894 -33961 -33907 -14274 2136 -16661 -42679 -59802 -52857 -40373 -24684 11190
17087A1190p722n3352k368J6185j8168M053M246j5004L3152k592r662L0234J6764
$$ 11190 3468 -49884 -52252 -36067 -54235 -50182 -45936 -60940 -27788 -30380 -40042 -9808 6956
17074F956k9830M4J0782J0897L029l4642p140L5546L9231k0170k3575J853q739
$$ 6956 -22874 -22830 -12048 -1151 1878 -32764 -39904 -4358 34873 14703 -8872 -7019 -15758
17061a5758K8368J896J2973p42m23k6216l5920j5837j2926J0962K0603n307J3687
$$ -15758 12610 14506 27479 26737 26314 98 -35822 -51659 -64585 -53623 -33020 -38327 -24640
17048b4640J820k7456J667J4996K7548J1289j6821Q171l164M650k0073n769L067
$$ -24640 -22820 -50276 -48609 -33613 -6065 5224 -11597 -3426 -6590 -1940 -22013 -27782 -24715
17035b4715J4123j7568J1510o679k1989J755L4051q911k9150P324k558K0335l794
$$ -24715 -10592 -28160 -16650 -23329 -45318 -43563 -9512 -18423 -47573 -40249 -42807 -22472 -26266
17022b6266J3543J313k2061j0399Q982j96J7908L264n71J2078k2752j576L0397
$$ -26266 -12723 -11410 -33471 -43870 -34888 -35084 -17176 -13912 -14483 -2405 -25157 -26733 3664
17009C664m00j0557L146P212P274l3664o142r89j3607J5623j0395Q146K921n331
$$ 3664 3264 -7293 -4147 3065 10339 -23325 -29467 -30456 -44063 -28440 -38835 -30689 -27768 -33099
16995c3099J3081O969K1219J0638k9610j9513K3584J4416r543m1874j976M096
$$ -33099 -20018 -13049 8170 18808 -10802 -30315 -6731 7685 -1858 -43732 -45708 -41612
16983d1612N536n54J0679J0065q279k0797Q64P434n728K3104K4055N058r874K351
$$ -41612 -36076 -36630 -25951 -15886 -24165 -44962 -44098 -36664 -42392 -19288 4767 9825 -49 2302
16969B302J4664l639j5453j6803l0461J8977J1429N725r781L611J327j6903K875
$$ 2302 16966 13327 -2126 -18929 -49390 -30413 -18984 -13259 -23040 -19429 -18102 -35005 -32130
16956c2130K3700r004k5037o918j0458j9365J5665N277R014K2523j4122k5205
$$ -32130 -8430 -17434 -42471 -49389 -59847 -79212 -63547 -58270 -49256 -26733 -40855 -66060
16944f6060M998N438J3736K867l2857l0170K2745J4650o379Q341O286m24p646
$$ -66060 -61062 -55624 -41888 -39021 -71878 -102048 -79303 -64653 -71032 -62691 -56405 -56829 -64475
16931f4475n531N2J372L5973K9674P382l7931j1623L634j1771Q642K4057K1427
$$ -64475 -70006 -69954 -68582 -32609 -2935 4447 -33484 -45107 -41473 -53244 -44602 -20545 882
16918H82M391l3350m6972J4713J5488L41L1061K3332j3244q699j0161k4259M619
$$ 882 5273 -28077 -75049 -60336 -44848 -44507 -13446 9886 -3358 -12057 -22218 -46477 -41858
16905d1858q483q95Q893J6414K113K9076l4937j9336j1155K5431J3012o531L477
$$ -41858 -50341 -51236 -42343 -25929 -23816 5260 -29677 -49013 -60168 -34737 -21725 -28256 -24779
16892b4779J0828o911k3787j0540J0861J3988R499n810j4649k050k384j334K444
$$ -24779 -13951 -20862 -44649 -55189 -44328 -30340 -20841 -26651 -41300 -43350 -45734 -47068 -44624
16879d4624O431J7167J7964J4508J9646p839k6375j1751K3434O91k4900k4111
$$ -44624 -38193 -21026 -3062 11446 31092 23253 -3122 -14873 8561 9252 -15648 -39759
16867c9759l1798Q246L8107K731p129p837P835O628R844P764j8002k0147K8467
$$ -39759 -71557 -63311 -25204 -22473 -29602 -37439 -29604 -22976 -13132 -5368 -23370 -43517 -15050
16854a5050R800P346j9009q125O215J3975K9758J0359J342j0317n700k3534j3036
$$ -15050 -5250 2096 -16913 -25038 -18823 -4848 24910 35269 36611 26294 20594 -2940 -15976
16841a5976n136n431M137k9233p877J0347m69p80L820j412j8809L1516N176J4670
$$ -15976 -21112 -26543 -22406 -51639 -59516 -49169 -49638 -50418 -46598 -48010 -66819 -35303 -30127 -15457
16827a5457J9492j3180j4346j0987J5339o909K1047J452j0572K599m294J3362
$$ -15457 4035 -9145 -23491 -34478 -19139 -26048 -5001 -3549 -14121 -11522 -15816 -2454
16815b454o628j7791N708O654J1615k2290r820O957n392l0228o969q505k659J6283
$$ -2454 -9082 -26873 -21165 -14511 -2896 -25186 -35006 -28049 -33441 -63669 -70638 -79143 -81802 -65519
16801f5519p544j9932J1955L4930n12J173j4738K6364q529j1161N859K5610j5714
$$ -65519 -73063 -92995 -81040 -46110 -46622 -45449 -60187 -33823 -42352 -53513 -47654 -22044 -37758
16788c7758J2404K1063J2265K5456m268k3297k0076J990Q129k0394J8272M504
$$ -37758 -25354 -4291 7974 33430 29162 5865 -14211 -12221 -4092 -24486 -6214 -1710
16776a710r051K565j6266K113j227J949K6539j5575j6522J0686r885k8535J7632
$$ -1710 -10761 -8196 -24462 -22349 -23576 -21627 4912 -10663 -27185 -16499 -26384 -54919 -37287
16763c7287L002R937R85K673j2816k1482N320J0459J1585J6653m9249l0419J9455
$$ -37287 -34285 -24348 -23363 -20690 -33506 -54988 -49668 -39209 -27624 -10971 -60220 -90639 -71184
16750g1184L5293J1028J4598k41k0786k5480K5216J7278j2300k5311P813k4989
$$ -71184 -35891 -24863 -10265 -10506 -31292 -56772 -31556 -14278 -26578 -51889 -44076 -69065
16738f9065j8011L2278L4260R826o778k2337K679L3840K6941L504p045k719K067
$$ -69065 -87076 -54798 -20538 -10712 -17490 -39827 -37148 -3308 23633 27137 20092 17373 19440
16725A9440k4684l977J5732J237k1142K163R451n149j5792j4265Q701L745n716
$$ 19440 -5244 -9221 6511 7748 -13394 -11231 -1780 -6929 -22721 -36986 -28285 -24540 -30256
16712c0256o42P914k4104j696L8254K4605k58J1559j3973m378j3801k6951k4997
$$ -30256 -30898 -22984 -47088 -48784 -10530 14075 13817 25376 11403 7025 -6776 -33727 -58724
16699e8724o692L2365K7465j066k2252n40n868L4716M5024j6691J582j5164j6153
$$ -58724 -65416 -33051 -5586 -6652 -28904 -29444 -35312 -596 44428 27737 29319 14155 -1998
16686a998m0242l316O188j0514J6995n65M728J4416N911J825k4526j7508K295
$$ -1998 -42240 -45556 -39368 -49882 -32887 -33452 -28724 -14308 -8397 -6572 -31098 -48606 -46311
16673d6311j45j0044O348j58j762K2668Q413m072j4236k5159O189J449k1320r856
$$ -46311 -46456 -56500 -50152 -50310 -52072 -29404 -20991 -25063 -39299 -64458 -58269 -56820 -78140 -87996
16659h7996L5837M123j8493j4010K0804J8273R250K4354L390j9973j8050j1814
$$ -87996 -52159 -48036 -66529 -80539 -59735 -41462 -32212 -7858 -4468 -24441 -42491 -54305
16647e4305P48J2603K0805J4588P57k2781k3522r031k661K4419R506j5207J8758
$$ -54305 -53557 -40954 -20149 -5561 -4804 -27585 -51107 -60138 -62799 -38380 -28874 -44081 -25323
16634b5323O265J2319j530j9973k2447K91o783L0988J9370p63l5817j547p97M1956
$$ -25323 -19058 -6739 -8269 -28242 -50689 -50398 -57181 -26193 -6823 -7586 -43403 -44950 -45747 -3791
16620c791P798N732J486J2718m896m8105p33J8664j2514l160R105K4307k289j9176
$$ -3791 4007 9739 11225 23943 19047 -29058 -29791 -11127 -23641 -26801 -17696 6611 4322 -14854
16606a4854R596k38k034K2927K9655O233j4141n040j1991q022r401q952k2438
$$ -14854 -5258 -5496 -7530 15397 45052 51285 37144 32104 20113 12091 2690 -6262 -28700
16593b8700j1269l483K0769k6063J860k039m615j390J4199j223J8792J0499L752
$$ -28700 -39969 -43452 -22683 -48746 -46886 -48925 -53540 -54930 -40731 -41954 -23162 -12663 -8911
16580h911L782J7140J0491j9715k3060j1525N904k9709j1818J1328K7576k006
$$ -8911 -5129 12011 22502 2787 -20273 -31798 -25894 -55603 -67421 -56093 -28517 -30523
16568c0523K0418J704l5781k1883J8360o87r27O907J9729j4319o158M836k275
$$ -30523 -10105 -8401 -44182 -66065 -47705 -48392 -49319 -42412 -22683 -37002 -43160 -38324 -40599
16555d0599j154J4075O716q260R003J6398N708K005n059k0546J0658J9420n18
$$ -40599 -41753 -27678 -20962 -29222 -20219 -3821 1887 3892 -1167 -21713 -11055 8365 7847
16542G847p003j1521j5127J6883m101j6639k0843j2457J3057K8346J8330N517
$$ 7847 844 -10677 -25804 -8921 -13022 -29661 -50504 -62961 -49904 -21558 -3228 2289
16530B289j3772j8095K628M529j513J8973J7114L4738j225k2634j1645j6500j4753
$$ 2289 -11483 -29578 -26950 -22421 -23934 -4961 12153 46891 45666 23032 11387 -5113 -19866
16517a9866K424K3420m981O559O029K1090l1791m2598k0712k6619j450K8223J8409
$$ -19866 -17442 5978 997 7556 13585 34675 2884 -39714 -60426 -87045 -88495 -60272 -41863
16504d1863L1890K8257K82R329q567l7050k0749j2893k5091K7465p292J5016l903
$$ -41863 -9973 18284 18566 27895 19328 -17722 -38471 -51364 -76455 -48990 -56282 -41266 -45169
16491d5169K735M751j666J2807O214j4700j2647N112L498j4162p577J9710o806
$$ -45169 -42434 -37683 -39349 -26542 -20328 -35028 -47675 -42563 -39065 -53227 -60804 -41094 -47900
16478d7900k3776K6847J0634J1100j7649k2408K884K1928j4151l8363j1272N8260
$$ -47900 -71676 -44829 -34195 -23095 -40744 -63152 -60268 -38340 -52491 -90854 -102126 -43866
16466d3866J2969k6595l124O030J4133N429J7440p30o957j7111j2596J3754J6709
$$ -43866 -30897 -57492 -60616 -54586 -40453 -35024 -17584 -18314 -25271 -42382 -54978 -41224 -24515
16453b4515J3980J6938j2804j3116k1373k8508O634J4439L3106j3162k1952o872
$$ -24515 -10535 6403 -6401 -19517 -40890 -69398 -62764 -48325 -15219 -28381 -50333 -57205
16441e7205k1411j3167K9100M6542o927J0664j5832k8793j5206J4550Q899K7155
$$ -57205 -78616 -91783 -62683 -16141 -23068 -12404 -28236 -57029 -72235 -57685 -48786 -21631
16429b1631J0285k3324k1203N606K1955J4166k56L146k755L136Q024n288q665
$$ -21631 -11346 -34670 -55873 -50267 -28312 -14146 -14402 -11256 -14011 -10875 -2851 -8139 -16804
16416a6804R505n33q504k5266o936J4539o849J9240Q691M452p962j4163K8776
$$ -16804 -7299 -7832 -16336 -41602 -48538 -33999 -40848 -21608 -12917 -8465 -16427 -30590 -1814
16403a814p942q934M919j4791J1376k087k9077j7930j6462R01J5487L5001l803
$$ -1814 -9756 -18690 -13771 -28562 -17186 -19273 -48350 -66280 -82742 -81841 -66354 -31353 -35156
16390c5156p112j4140K6806K0519j6269k2441l268J0285J2845M298M413m50j4872
$$ -35156 -42268 -56408 -29602 -9083 -25352 -47793 -51061 -40776 -27931 -23633 -19220 -19670 -34542
16377c4542j1118J0399J4550J1507K1126J0145q571l1467k4793l682K0439K8706
$$ -34542 -45660 -35261 -20711 -9204 11922 22067 13496 -17971 -42764 -46446 -26007 2699
16365B699k7057P011J2682j468l0621k0281p871m718j8384J7973M0520J7192K260
$$ 2699 -24358 -17347 -4665 -6133 -36754 -57035 -64906 -69624 -88008 -70035 -29515 -12323 -10063
16352a0063P158K2988J0708K5802k9323m7721m7719J326K2837l562J105J6917
$$ -10063 -2905 20083 30791 56593 27270 -20451 -68170 -66844 -44007 -47569 -46464 -29547
16340b9547O614J4674K1832L417J8198Q342r250k5346l1384q844k6447l9774k1034
$$ -29547 -22933 -8259 13573 16990 35188 43530 34280 8934 -22450 -31294 -57741 -97515 -118549
16327a18549M1654K0177p19Q538O494K2967K2788j8601K6388J4838k1742p378
$$ -118549 -76895 -56718 -57437 -48899 -42405 -19438 3350 -15251 11137 25975 4233 -3145
16315c145j8090p538Q934r852J0026L0022j7103l9081O504n867J5774J8775j785
$$ -3145 -21235 -28773 -19839 -29691 -19665 10357 -6746 -45827 -39323 -45190 -29416 -10641 -12426
16302a2426j0513J164R05o538j4646J2588P812o1j7737j7244j2768K522J429j5790
$$ -12426 -22939 -21775 -20870 -27408 -42054 -29466 -21654 -21715 -39452 -56696 -69464 -66942 -65513 -81303
16288h1303R129L6220O118Q695q403k1476J6273L7038J0874j556q096j7615j9421
$$ -81303 -72174 -35954 -29836 -21141 -29544 -51020 -34747 2291 13165 11609 3513 -14102 -33523
16275c3523k1671j141K4890j3669o241K0729p315J4717K5319j845j354q054j6873
$$ -33523 -55194 -56335 -31445 -45114 -51355 -30626 -37941 -23224 2095 250 -1104 -9158 -26031
16262b6031j4685J4118K0549j6656j4137R571R899o895j055l686j091j780L653
$$ -26031 -40716 -26598 -6049 -22705 -36842 -27271 -17372 -24267 -25322 -29008 -30099 -31879 -28226
16249b8226K104j5248o580j0149j4586L2594J9768L052j1855k032J9493j9675
$$ -28226 -26122 -41370 -47950 -58099 -72685 -40091 -20323 -17271 -29126 -31158 -11665 -31340
16237c1340K2883L4301j548j1974m333k6033l6774j8315J9220n10J1349J3288
$$ -31340 -8457 25844 24296 12322 7989 -18044 -54818 -73133 -53913 -54423 -43074 -29786
16225b9786j206J2009K2678J7859o891l5500l7018J6330K1891M19j2858j6097
$$ -29786 -30992 -18983 3695 21554 14663 -20837 -57855 -41525 -19634 -19215 -32073 -48170
16213d8170k202K4693K0184m420m359k3582l498K0278J5938K0929j797l6085k885
$$ -48170 -50372 -25679 -5495 -9915 -14274 -37856 -41354 -21076 -5138 15791 13994 -22091 -24976
16200b4976J2056K007j4177Q254k1007m2231J8026K4087K8163o652j3046n391
$$ -24976 -12920 -10913 -25090 -16836 -37843 -80074 -62048 -37961 -9798 -16450 -29496 -34887
16188c4887J9617n995j7207K0347J9908j5457k4118J573O281o014J4428L5404
$$ -34887 -15270 -21265 -38472 -18125 1783 -13674 -37792 -36219 -29938 -35952 -21524 13880
16176A3880q458j1091j3215j8707n140p200k388K8638l237m298o040o807j3842
$$ 13880 5422 -5669 -18884 -37591 -42731 -49931 -52319 -23681 -26918 -31216 -37256 -44063 -57905
16163e7905J561J9308J1382n438p793j5315k1088K0464L0110r075j124J2545k928
$$ -57905 -56344 -37036 -25654 -31092 -38885 -54200 -75288 -54824 -24714 -33789 -34913 -22368 -25296
16150b5296J673q695J3275L274O672j1120q370J0159K7772M116J6634k0359m6283
$$ -25296 -23623 -32318 -19043 -15769 -9097 -20217 -28587 -18428 9344 13460 30094 9735 -36548
16137c6548j5260N261J2591J2523K2520J3867P849q5j4049k63M767k2505k0113
$$ -36548 -51808 -46547 -33956 -21433 1087 14954 22803 22718 8669 8406 13173 -9332 -29445
16124b9445l209N817L0205P766j0064j0118R936P014p935m7480j4436Q142M841
$$ -29445 -32654 -26837 3368 11134 1070 -9048 888 7902 -33 -47513 -61949 -53807 -48966
16111d8966J283J206Q625J5558L87k853o409J377J310j212R176p88k4979j9632
$$ -48966 -47683 -46477 -37852 -22294 -21907 -24760 -31169 -29792 -28482 -29694 -20518 -21306 -46285 -65917
16097f5917J661L7893K4175r755r124o3J26p805P129K9994j430Q620o534m328
$$ -65917 -64256 -26363 -2188 -11943 -21067 -21130 -21004 -28809 -21680 8314 6884 15504 8970 4642
16083D642r174L1758n596m6082j4462M641p731p353J3274L02j3591J4433K0315
$$ 4642 -4532 27226 21630 -24452 -38914 -34273 -42004 -49357 -36083 -35781 -49372 -34939 -14624
16070a4624P178q811j5532n076M7462J1133l3147n4109k3009N908j4099K1656
$$ -14624 -7446 -16257 -31789 -36865 10597 21730 -11417 -65526 -88535 -82627 -96726 -75070
16058g5070l664L64K399j7311K62O611L0149J2810J2944J7925P205k0768q177
$$ -75070 -78734 -78370 -75971 -93282 -93020 -86409 -56260 -43450 -30506 -12581 -5376 -26144 -34321
16045c4321r881J02p94L6315J7072m956K900K4324K4436k2391O796M668J0210
$$ -34321 -44202 -44100 -44894 -8579 8493 3537 6437 30761 55197 32806 39602 44270 54480
16032E4480m1514k5217O543j03k8489j5255P275p873L2177J9110q462j1973n55
$$ 54480 12966 -12251 -5708 -5811 -34300 -49555 -42280 -50153 -17976 1134 -7328 -19301 -19856
16019a9856J8952k1967j6378M321J9182Q277j9516j4871j0910K224K2098Q161
$$ -19856 -904 -22871 -39249 -34928 -15746 -7469 -26985 -41856 -52766 -50542 -28444 -20283
16007b0283k4377k3088J1604J668Q166J6295J8699J7635O583k0229j9819l035
$$ -20283 -44660 -67748 -56144 -54476 -46310 -30015 -11316 6319 12902 -7327 -27146 -30181
15995c0181J3680J8672j8750j3303j0166o697J225m200m535R782J3612J1365J4447
$$ -30181 -16501 2171 -16579 -29882 -40048 -46745 -45520 -49720 -54255 -44473 -30861 -19496 -5049
15982e049j0289j680q9j3462J1749J7288k4261L7084O439k3986j0510k998R320
$$ -5049 -15338 -17018 -17107 -30569 -18820 -1532 -25793 11291 17730 -6256 -16766 -19764 -10444
15969a0444J0404r552J7957J5139k7070m6076O431N776j053J0656P851r328p604
$$ -10444 -40 -9592 8365 23504 -3566 -49642 -43211 -37435 -38488 -27832 -19981 -29309 -36913
15956c6913J1100L688J6120J7267p150r505j330j0388l3q889j3043K5440m039
$$ -36913 -25813 -22125 -6005 11262 4112 -5393 -6723 -17111 -17144 -26033 -39076 -13636 -17675
15943a7675l1067L836J4909J2190N575k1179l690o434k0654Q769N250l287J0368
$$ -17675 -48742 -44906 -29997 -17807 -12232 -33411 -37101 -43535 -64189 -55420 -50170 -53457 -43089
15930d3089Q049R429J7128l0123l3087k8781M543M2901M0441J2745r857m94l2
$$ -43089 -35040 -25611 -8483 -38606 -71693 -100474 -95931 -53030 -12589 156 -9701 -10195 -10227
15917a0227M614K4079j3309J2593J06m6750n210K1556P058n868j6629J2799k217
$$ -10227 -5613 18466 5157 17750 17856 -28894 -34104 -12548 -5490 -11358 -27987 -15188 -17405
15904a7405J2838L137q154n360q707j449J7556j1953J090m414j586Q939O462j0720
$$ -17405 -4567 -1430 -9584 -14944 -23651 -25100 -7544 -19497 -18407 -22821 -24407 -15468 -9006 -19726
15890a9726k0311J3344Q2R657L4032L876q993k900k8182k2745k574n424M89K1043
$$ -19726 -40037 -26693 -26611 -16954 17078 20954 11961 9061 -19121 -41866 -44440 -49864 -49375 -28332
15876b8332L3453J5857k1615K3740Q053K67j4046k9085q637N777L257j2802j242
$$ -28332 5121 20978 -637 23103 31156 31423 17377 -11708 -20345 -14568 -11311 -24113 -25355
15863b5355j4416J9291K0288q847k4262k0106J9733J5266P282K281J0789k7129
$$ -25355 -39771 -20480 -192 -9039 -33301 -53407 -33674 -18408 -11126 -8845 1944 -25185
15851b5185l8756J4029K3219L3300L3101j3237L241K233k2831L064k346q690j5208
$$ -25185 -63941 -49912 -26693 6607 39708 26471 29712 31945 9114 12178 9832 1142 -14066
15838a4066q022J481J5583K7791l454k8064m476R911J3240p019J0234j2561p58
$$ -14066 -22088 -20607 -5024 22767 19313 -8751 -13227 -3316 9924 2905 13139 578 -180
15825a80R42j3158L306p103Q872j4781j9547k8349l952L6487L0733K498J4464
$$ -180 762 -12396 -9090 -16193 -7321 -22102 -41649 -69998 -73950 -37463 -6730 -4232 10232
15812A0232K5243j6068l0279j4578K742J574j1511K546K101K3391J4026j7257
$$ 10232 35475 19407 -10872 -25450 -22708 -21134 -32645 -30099 -27998 -4607 9419 -7838
15800g838l2782r152P117J7975m935j2985k7224K1170R451K6221J1664k8318j826
$$ -7838 -40620 -49772 -42655 -24680 -29615 -42600 -69824 -48654 -39203 -12982 -1318 -29636 -31462
15787c1462K7036M6010J0866k1180j0203j1962J4308l0490R13P524l5304q40L1173
$$ -31462 -4426 41584 52450 31270 21067 9105 23413 -7077 -6164 1360 -33944 -34784 -3611
15774c611L127o53J9847K2254O039k8634j7826L950L149M763k8237j6132P423
$$ -3611 -484 -1137 18710 40964 47003 18369 543 4493 7642 12405 -15832 -31964 -24541
15761b4541j1772L9965m495J4758L891j8259j7941K80K3552Q219j1130j1560j0064
$$ -24541 -36313 3652 -843 13915 17806 -453 -18394 -18114 5438 13657 2527 -9033 -19097
15748a9097o135J526L3149J202R350k5407M049L515j195j3662N257K4888j6203
$$ -19097 -25232 -23706 9443 10645 19995 -5412 -1363 2152 957 -12705 -7448 17440 1237
15735A237j8683q991L662J5983j2331k8468K5065j3144k45j8859J3448J7650q3
$$ 1237 -17446 -26437 -22775 -6792 -19123 -47591 -22526 -35670 -35915 -54774 -41326 -23676 -23759
15722b3759J0498M986k015k2755P283q259L545j4223Q449K4552K199J9017k067
$$ -23759 -13261 -8275 -10290 -33045 -25762 -34021 -30476 -44699 -36250 -11698 -9499 9518 7451
15709G451j2204J0105J0134k205q157O444j3698m3969J2719o533k6853M4408J7216
$$ 7451 -4753 5352 15486 13281 5124 11568 -2130 -46099 -33380 -39913 -66766 -22358 -5142
15696e142j1582p486k952q211J806O971M324k032j885K2118j1909j0578J0484
$$ -5142 -16724 -24210 -27162 -35373 -33567 -26596 -22272 -24304 -26189 -4071 -15980 -26558 -16074
15683a6074N32J6912M376l6389k2329j6614J5013J5328K550J0476P371J1700k4049
$$ -16074 -15542 1370 5746 -30643 -52972 -69586 -54573 -39245 -36695 -26219 -18848 -7148 -31197
15670c1197k2067j3668J2053M0102J7046k988L1892J7622j1704j5253o459l0491
$$ -31197 -53264 -66932 -54879 -14777 2269 -719 31173 48795 37091 21838 15379 -15112
15658a5112k1311J6708J9476q739j9734j4684j6499N244J3478j5452n731K8249
$$ -15112 -36423 -19715 -239 -8978 -28712 -43396 -59895 -54651 -41173 -56625 -62356 -34107
15646c4107J4607J7970k13K125J521K2801J1755k6065j4537K789l861k0315P053
$$ -34107 -19500 -1530 -1743 382 1903 24704 36459 10394 -4143 -1354 -5215 -25530 -18477
15633a8477O553J0585P543p370N480j0069m555l161J5253J2121O694K5628j1844
$$ -18477 -11924 -1339 6204 -1166 4314 -5755 -10310 -13471 1782 13903 20597 46225 34381
15620C4381l3790j5133j9302J0043R079l509N502m339R032O822K7126Q672n599
$$ 34381 591 -14542 -33844 -23801 -14722 -18231 -12729 -17068 -8036 -1214 25912 34584 28985
15607B8985l2847j6253L0499M271J7482O476j7587N971M130N821O345J7846k2920
$$ 28985 -3862 -20115 10384 14655 32137 38613 21026 26997 31127 36948 43293 61139 38219
15594C8219j4509J8224K0369k1134j8085N35O952l3393l3450j2053J87R45L0210
$$ 38219 23710 41934 62303 41169 23084 23619 30571 -2822 -36272 -48325 -48138 -47193 -16983
15581a6983J7994M137j3955R371K9037K760k595J4107r996k4050j104P215n604
$$ -16983 1011 5148 -8807 564 29601 32361 29766 43873 33877 9827 8723 15938 10334
15568A0334k682j0243m001q940K0929L701k2247J0714j6776J0558J4764J6721
$$ 10334 7652 -2591 -6592 -15532 5397 9098 -13149 -2435 -19211 -8653 6111 22832
15556B2832k752o283K0567j5877n759j8830j5280o477k24l987K6401J7837j4251
$$ 22832 20080 13797 34364 18487 12728 -6102 -21382 -27859 -28083 -32070 -5669 12168 -2083
15543b083j7106k284M145L532J693r951k6571L2104N757l1083J5790J6924Q464
$$ -2083 -19189 -21473 -17328 -13796 -12103 -22054 -48625 -16521 -10764 -41847 -26057 -9133 -669
15530f69Q438K214j1123j2506J8024j9057j4041K3871J9119P196j2520j4046j3749
$$ -669 7769 9983 -1140 -13646 4378 -14679 -28720 -4849 14270 21466 8946 -5100 -18849
15517a8849L476j2742J719J7211J0041J9305n705p234j6447m21k3665k623K4256
$$ -18849 -15373 -28115 -26396 -9185 856 20161 14456 7222 -9225 -9646 -33311 -35934 -11678
15504a1678J2783n682j9090J2710o550j222j4598K677K1245J4758j7342j7547
$$ -11678 1105 -4577 -23667 -10957 -17507 -18729 -33327 -30650 -9405 5353 -11989 -29536
15492b9536N840N940J4951K367Q68j9622L063j9550l1157N422L0250K1833J4427
$$ -29536 -23696 -17756 -2805 -438 430 -19192 -16129 -35679 -66836 -61414 -31164 -9331 5096
15479E096o409k6483J6715k039m35P211K1478L2375o457j3004j1898r145p581
$$ 5096 -1313 -27796 -11081 -13120 -13555 -6344 15134 47509 41052 28048 16150 7005 -576
15466e76j9987m906L6837K0244k0655p253o535j5053J941j8185j1106o151K4169
$$ -576 -20563 -25469 11368 31612 10957 3704 -2831 -17884 -15943 -34128 -45234 -51385 -27216
15453b7216L111K1177Q413J1476Q269r067p240j4804j1035K210R054K7775l9946
$$ -27216 -24105 -2928 5485 16961 25230 16163 8923 -5881 -16916 -14706 -5652 22123 -17823
15440a7823k2498J1042R022o442N151J231J0577L2012K6520J4249l203j8819o133
$$ -17823 -40321 -29279 -20257 -26699 -21548 -20317 -9740 22272 48792 63041 59838 41019 34886
15427C4886k6262l4277m469n74n586L6244L1633P522j0728N765j3662m3599k1259
$$ 34886 8624 -25653 -30122 -30696 -36282 -38 31595 39117 28389 34154 20492 -23107 -44366
15414d4366J2024N115p760j2859K4477J3258j0492j1099j6223L2832L5604J449
$$ -44366 -32342 -27227 -34987 -47846 -23369 -10111 -20603 -31702 -47925 -15093 20511 21960
15402B1960p076M049l1218P679J884l753J3023J0811J9074N926k0064j1507J0867
$$ 21960 14884 18933 -12285 -4606 -2722 -6475 6548 17359 36433 42359 22295 10788 21655
15389B1655Q31K801j2496L45O119J426L358r054k404p8J5388L121J7781j4751
$$ 21655 22486 25287 12791 13136 19255 20681 24039 14985 12581 12503 27891 31012 48793 34042
15375C4042k615J7859k5512k9308j1764J0267J991p972m6074j5907J9413J1851
$$ 34042 31427 49286 23774 -5534 -17298 -7031 -5040 -13012 -59086 -74993 -55580 -43729
15363d3729P115K1144K7692j4710J4077j4772j4230L0261N029j2832R454m059
$$ -43729 -36614 -15470 12222 -2488 11589 -3183 -17413 12848 17877 5045 14499 10440
15351A0440j1022K843J9896Q52j5075L4191M4424j9506l8260j8111J7065K694
$$ 10440 -582 2261 22157 23009 7934 42125 86549 67043 28783 10672 27737 30431
15339C0431n314M43p278k2198k2951J6160N0175J3501j235Q670q882j3922m1602
$$ 30431 25117 25560 18282 -3916 -26867 -10707 39468 52969 51734 60404 51522 37600 -4002
15326d002N651R423o50L5107O417K486j2345l1149k3737K201j354q111L0092j928
$$ -4002 1649 11072 10422 45529 51946 54432 42087 10938 -12799 -10598 -11952 -20063 10029 8101
15312H101j7828l29K6240J4578p044K742J3667k8663k1393Q68J8430K9924P756
$$ 8101 -9727 -10056 16184 30762 23718 26460 40127 11464 -9929 -9061 9369 39293 47049
15299D7049l1945k7136q253L3241K7526j925r603K511j7223J7318k0765O297J3706
$$ 47049 15104 -12032 -20285 12956 40482 38557 28954 31465 14242 31560 10795 17092 30798
15286C0798J2595j9411R178K5605k843k5320j6799p977N029K7473J6848o828j1061
$$ 30798 43393 23982 33160 58765 55922 30602 13803 5826 10855 38328 55176 48348 37287
15273C7287l80r147J1386J0230j8564p380J041q160K6131o902j3471L702J2992
$$ 37287 36907 27760 39146 49376 30812 23432 24473 16313 42444 35542 22071 25773 38765
15260C8765p57o603r309M286l450K443j333l970j6673O742K4444J893m321j8052
$$ 38765 38008 31405 22096 26382 22932 25375 24042 20072 3399 10141 34585 36478 32157 14105
15246A4105k7116L973k3705P11M8137M3408K88n205N41k2858j4888p590N839R641
$$ 14105 -13011 -9038 -32743 -32032 16105 59513 59801 54596 55137 32279 17391 9801 15640 25281
15232B5281J330n283j0463j6184J7114j763p387J6560k030j194Q528k0817j4080
$$ 25281 26611 21328 10865 -5319 11795 10032 2645 19205 17175 15981 24509 3692 -10388
15219a0388J5485k6j7530o885K2807K2490K1237J7108j1867K399j5634j7916q549
$$ -10388 5097 5071 -12459 -19344 3463 25953 47190 64298 52431 54830 39196 21280 12731
15206A2731o017j4279P64j080r264O398K5356P813L021p40l943K6409L925k9311
$$ 12731 6714 -7565 -6801 -7881 -17145 -10747 14609 22422 25443 24703 20760 47169 51094 21783
15192B1783k9533M5543K2693Q17j3836k7069r575q93J0001j6550j7452J0599l57
$$ 21783 -7750 37793 60486 61303 47467 20398 10823 9930 19931 3381 -14071 -3472 -3829
15179c829L2971L905j8446J1507q55m461K8578J1275k4583K9116K5853P84k3803
$$ -3829 29142 33047 14601 26108 25253 20792 49370 60645 36062 65178 91031 91815 68012
15166F8012p352j6140J809k3923j4182k321K5003K1630Q193m092j2459k1542R759
$$ 68012 60660 44520 46329 22406 8224 5903 30906 52536 60729 56637 44178 22636 32395
15153C2395J3393R998M0026K289k2096k3674j7335K663L103n054j1083r480j612
$$ 32395 45788 55786 95812 98101 76005 52331 34996 37659 40762 35708 24625 15145 13533
15140A3533p3J9582K1573Q819j5563J2025K3795J103k0691j5500j2941J3857k0104
$$ 13533 13460 33042 54615 63434 47871 59896 83691 84794 64103 48603 35662 49519 29415
15127B9415l970J8327J6423m1327K920L5170j9613m1455O600P352J4976P344J0294
$$ 29415 25445 43772 60195 18868 21788 56958 37345 -4110 2490 9842 24818 32162 42456
15114D2456M491M980K005O828J0006p080j2279q040Q646K2594M3q561n588n800
$$ 42456 46947 51927 53932 60760 70766 63686 51407 43367 52013 74607 74650 66089 60501 54701
15100E4701j122j0717j322L186L3453j6976k6729p477p229j8398Q181K3199p291
$$ 54701 53579 42862 41540 44726 78179 61203 34474 26997 19768 1370 9551 32750 25459
15087B5459J5861K0170K9286J3878k551J5677J8919l1091k8738q85J660o883n235
$$ 25459 41320 61490 90776 104654 102103 117780 136699 105608 76870 75985 77645 70762 65527
15074F5527n645l0670P677K2112m338J2706l157j9387J0360J268j5445o889K2870
$$ 65527 59882 29212 36889 59001 54663 67369 64212 44825 55185 56453 41008 34119 56989
15061E6989Q083l2927J4615J6018j4082R309J1113l974L912J4000N36r606j5381
$$ 56989 65072 32145 46760 62778 48696 58005 69118 65144 69056 83056 83592 73986 58605
15048E8605o18Q705j6148l8844K183J5886K0937q507j9684Q53J5647J6590m2172
$$ 58605 57987 66692 50544 11700 13883 29769 50706 42199 22515 23368 39015 55605 13433
15035A3433j1696K8344J6631K927J2700J7579o86j0210r370r637k9000J0941J0292
$$ 13433 1737 30081 46712 49639 62339 79918 79232 69022 59652 50015 21015 31956 42248
15022D2248R599L747k726p372l530p746K2957K7514K4767M845k9835l7985j8008
$$ 42248 51847 55594 52868 45496 41966 34220 57177 84691 109458 114303 84468 46483 28475
15009B8475J9265M4281R970J20K2419k369m8639k7189K09K7186M187J1961J1880
$$ 28475 47740 92021 101991 102111 124530 122161 73522 46333 46542 73728 77915 89876 101756
14996A01756k148o185J3680j7381K1418L17m0357l4991k026k458O69J2446J8014
$$ 101756 99608 93423 107103 89722 111140 111457 71100 36109 34083 31625 32294 44740 62754
14983F2754J3630J9223K372q862j0010N538R292q385K3741q014j3441j9901k872
$$ 62754 76384 95607 97979 89117 79107 84645 93937 85552 109293 101279 87838 67937 65065
14970F5065o956k991L9372M208J840o192p051O928J0541R0J3881K929j5944J2138
$$ 65065 58109 55118 94490 98698 100538 94346 87295 94223 104764 104854 118735 121664 105720 117858
14956A17858k748k0757j2272J3269l27J3274p710J108m526j3096l370j5119j069
$$ 117858 115110 94353 82081 95350 95023 108297 100587 101695 97169 84073 80703 65584 64515
14943F4515K2427m60P684L5561k8342j8401P834M85K7306K4020N609l2553j2233
$$ 64515 86942 86482 94166 129727 101385 82984 90818 91303 118609 142629 148238 115685 103452
14930A03452j213k6404k1693n606Q515K2917J0490K2426j1479p171Q805O647J7151
$$ 103452 102239 75835 54142 48536 57051 79968 90458 112884 101405 94234 103039 109686 126837
14917A26837r421M440K2453n298n7239j3688J4712R539l96P284j8195Q885L475
$$ 126837 117416 121856 144309 139011 81772 68084 82796 92335 91939 99223 81028 89913 93388
14904I3388k8463p338L4151J3506J4338r54l5245n109M303J2304L1562J2945k7555
$$ 93388 64925 57587 91738 105244 119582 118628 83383 78274 82577 94881 126443 139388 111833
14891A11833j2427J3791L170O609r276L761m41J4995j8878N486J4699o020N096
$$ 111833 99406 113197 116367 122976 113700 117461 117020 132015 113137 118623 133322 127302 132398
14878A32398O231N509k36j4359j6384L312M360j7189k7171O159R081M882j198
$$ 132398 138629 144138 143902 129543 113159 116471 120831 103642 76471 82630 91711 96593 95395
14865I5395K2284K7345Q756J559m518J937O539Q266o960k1016k7590j5947k487
$$ 95395 117679 145024 153780 155339 150821 152758 159297 167563 160603 139587 111997 96050 93563
14852I3563J8136j815Q184q85m017r54k0860K5393Q687l555O596m502J6451j0785
$$ 93563 111699 109884 118068 117183 113166 112212 91352 116745 125432 121877 128473 123971 140422 129637
14838A29637Q284K4581J4927J726k0891r672j659l0766j0200k59J0896J5658K5038
$$ 129637 137921 162502 177429 179155 158264 148592 146933 116167 105967 105708 116604 132262 157300
14825A57300k8386k5720J5046l937j3249o164J5108J3054L0569n757j0130n445
$$ 157300 128914 103194 118240 114303 101054 94890 109998 123052 153621 147864 137734 132289
14813A32289Q269J386k6o195R149Q262k3095j1560J2168o748j464K2882J4474
$$ 132289 140558 141944 141918 135723 144872 153134 130039 118479 130647 123899 122435 145317 159791
14800A59791J6378j0802L540J0954r67j0571p958q507K3906J0748R745O221k0053
$$ 159791 176169 165367 168907 179861 178894 168323 160365 151858 175764 186512 196257 202478 182425
14787A82425l1257r975J1898J6449K2151l235j7677j8866N258j8693J5126K4922
$$ 182425 151168 141193 153091 169540 191691 188456 170779 151913 157171 138478 153604 178526
14775A78526L261N031j542k7860m508J1966K2735O465j6012J4942k587l1894M532
$$ 178526 181787 186818 185276 157416 152908 164874 187609 194074 178062 193004 190417 158523 163055
14762A63055J5542M2085K0449N559k484j2281j6390O449J8889L657k6788k7041
$$ 163055 178597 220682 241131 246690 244206 231925 215535 221984 240873 244530 217742 190701
14750A90701j5862L151K1116L139M16j7919J593j1498K2066K8577O554J4440r75
$$ 190701 174839 177990 199106 202245 202661 184742 186335 174837 196903 225480 232034 246474 245499
14737B45499j9698j0623o570J4681J6384k6249o999q253j0348K7251j084K1316
$$ 245499 225801 215178 208608 223289 239673 213424 206425 198172 187824 215075 213991 235307
14725B35307K0584J8234k796K1362K786o323l083j570j5448k3505Q297J2190J4410
$$ 235307 255891 274125 271329 292691 295477 289154 286071 284501 269053 245548 253845 266035 280445
14712B80445p474j4671j8643O791L1493j4373l3343L0524M130n2K1764l298k0690
$$ 280445 272971 258300 239657 246448 277941 263568 230225 260749 264879 264827 286591 283293 262603
14699B62603j2952o934N780K3311M78N85M135k5864j5155K6710N36j2130J6359
$$ 262603 249651 242717 248497 271808 272286 272871 277006 251142 235987 262697 263233 251103 267462
14686B67462r039Q190K6959Q377p934l91J2317o215L4539k2334l055J9242j3252
$$ 267462 258423 266613 293572 301949 294015 293624 305941 299726 334265 311931 308876 328118 314866
14673C14866J1974j2873l1654j7483O115K3032J9457J7088j058k4140k150j0172
$$ 314866 326840 313967 282313 264830 270945 293977 313434 330522 329464 305324 303174 293002
14661B93002j1177K714n514K084j363r016L0618J1175P36k624M484j817k1699
$$ 293002 281825 284539 279025 281109 279746 270730 301348 312523 313259 310635 315119 313302 291603
14648B91603J146L6843R196R652J6290m2859l6791N445K1980k7911p703J2694
$$ 291603 292749 329592 338788 348440 364730 321871 285080 290525 312505 284594 276891 289585
14636B89585J4119K8897j277o112J7684Q292J3030m195m0013p197J4983J0895
$$ 289585 303704 332601 331324 325212 342896 351188 364218 360023 320010 312813 327796 338691
14624C38691j7908R992J3656L482O925K0668J5151M514N554J42j0280k7212j5879
$$ 338691 320783 330775 344431 347913 354838 375506 390657 395171 400725 400867 390587 363375 347496
14611C47496K501Q462N613J5431j934q044O771K0843Q211j832L107p702R139K4630
$$ 347496 349997 358459 364072 379503 377569 369525 376296 397139 405350 403518 406625 398923 408062 432692
14597D32692M043k0714k0836K3043L662k777L020o08J6852R130P377j1012j3980
$$ 432692 436735 416021 395185 418228 421890 419113 422133 421525 438377 447507 454884 443872 429892
14584D29892r069J1083P637J2842j416J3399K1204p191N48j1912k4450O749O095
$$ 429892 420823 431906 439543 452385 450969 464368 485572 478381 478929 467017 442567 449316 455411
14571D55411K1798K2024k9211j9156J6160j332l299m162J8393J4915l307l3250
$$ 455411 477209 499233 470022 450866 467026 465694 462395 458233 476626 491541 488234 454984
14559D54984j9182J4481K9882O767P60j1147p541K825K5356L5955J2027Q366k3024
$$ 454984 435802 450283 480165 486932 487692 476545 469004 471829 497185 533140 545167 553533 530509
14546E30509j1792K3239L9470j919k0899K765J8056K2786K30O925m464j8133j0422
$$ 530509 518717 541956 581426 579507 558608 561373 579429 602215 602445 609370 604906 586773 576351
14533E76351O123m354j2888l906K3228K8794p679j592j6874k5402M7302N2344
$$ 576351 582474 578120 565232 561326 584554 613348 605669 604077 587203 561801 609103 661447
14521F61447O581j2205Q386J3427l26k5362k7130r764K765K3037j0548j3147j466
$$ 661447 668028 655823 664209 677636 677310 651948 624818 615054 617819 640856 630308 617161 615695
14508F15695J0006J4909l356j146k915j4410O665l461m078L4418o158m7789O101
$$ 615695 625701 640610 637254 636108 633193 618783 625448 621987 617909 652327 646169 598380 604481
14495F04481K1539J5339J487P400J0022J1790P73m654o576R936J1336j2524J4567
$$ 604481 626020 641359 642846 650246 660268 672058 672831 668177 661601 671537 682873 670349 684916
14482F84916J7660L220k2112j0129Q963q30j4855L193M104L5920L334j4363k6417
$$ 684916 702576 705796 683684 673555 682518 681688 666833 670026 674130 710050 713384 699021 672604
14469F72604j6055j3366R416M6208K700J0021l935j0687J7442K6949P938l09L888
$$ 672604 656549 643183 652599 698807 701507 711528 707593 696906 714348 741297 749235 748926 752814
14456G52814K2141J5809K2493N730l607j562R102Q392r645m647j6833P65Q472
$$ 752814 774955 790764 813257 818987 815380 813818 822920 831312 821667 817020 800187 800952 809424
14443H09424K7066J9413j1671J852R943K1485K1733M429o482O414L4584p540N275
$$ 809424 836490 855903 844232 846084 856027 877512 899245 903674 897192 903606 938190 930650 935925
14430I35925o952J8460J8043k316P403K0184p036k5903R777l255K657O88Q819
$$ 935925 928973 947433 965476 963160 970563 990747 983711 957808 967585 964330 966987 967675 976494
14417I76494L594J0475J7450O48K1328J7800k9046k6838J2203K0805K8691P269
$$ 976494 980088 990563 1008013 1008661 1029989 1047789 1018743 991905 1004108 1024913 1053604 1060873
14405A060873k1319l35R151O324J840L1266M145l658K831J2437J3410J9142j7112
$$ 1060873 1039554 1039219 1048370 1054694 1056534 1087800 1091945 1088287 1091118 1103555 1116965 1136107 1118995
14392A118995O127K3485K0543m194m439k9676R86K1476K5573J6495O793o142P907
$$ 1118995 1125122 1148607 1169150 1164956 1160517 1130841 1131827 1153303 1178876 1195371 1202164 1196022 1203929
14379A203929J7480Q827k2945k3015K8890J7045J3264N400J7849K7868J2988J8718
$$ 1203929 1221409 1230236 1207291 1184276 1213166 1230211 1243475 1248875 1266724 1294592 1307580 1326298
14367A326298k5267k0868l986L896J0059J035J3852L0959P332J5818n710l706
$$ 1326298 1301031 1280163 1276177 1280073 1290132 1291167 1305019 1335978 1343310 1359128 1353418 1349712
14355A349712J5782L1476K5956N774J592m076J052O479K3616K3597J1029J094
$$ 1349712 1365494 1396970 1422926 1428700 1430292 1426216 1427268 1433747 1457363 1480960 1491989 1493083
14343A493083K2144J6114K193K4667L0389j0800j7864J5513K1932K7574L5765
$$ 1493083 1515227 1531341 1533534 1558201 1588590 1577790 1559926 1575439 1597371 1624945 1660710
14332A660710K1086l076K0374L8900J4597J4638m277n676M816M96R805J9583L1324
$$ 1660710 1681796 1678720 1699094 1737994 1752591 1767229 1762952 1757276 1762092 1762588 1772393 1791976 1823300
14319A823300J7959R02n111K7716K7137J7606K2489J7831M153K214K5712L5475
$$ 1823300 1841259 1842161 1837050 1864766 1891903 1909509 1931998 1949829 1953982 1956196 1981908 2017383
14307B017383Q153M622k626K1372L7103J9783n771K444K4999M2500l61K2187J1193
$$ 2017383 2025536 2030158 2027532 2048904 2086007 2105790 2100019 2102463 2127462 2169962 2169601 2191788 2202981
14294B202981K383P499M6559J0350j2446L2482J9298K6231K1134M6670O653L7838
$$ 2202981 2205364 2212863 2259422 2269772 2257326 2289808 2309106 2335337 2356471 2403141 2409794 2447632
14282B447632N9156L2443Q696rJ8544L6297M2500O4913J0657J7053K6034J5360
$$ 2447632 2506788 2539231 2547927 2547918 2566462 2602759 2645259 2710172 2720829 2737882 2763916 2779276
14270B779276N034L5280K8113o264K2747O2344J6114Q818J6496L067J5772N9114
$$ 2779276 2784310 2819590 2847703 2841439 2864186 2926530 2942644 2951462 2967958 2971025 2986797 3045911
14258C045911K7902Q562L5471L2483L6630M4339J2959R920K2458K8323K3492J8118
$$ 3045911 3073813 3082375 3117846 3150329 3186959 3231298 3244257 3254177 3276635 3304958 3328450 3346568
14246C346568J5776J9329L2293L6754j5124J7677L1196K0009R092K5906K5044
$$ 3346568 3362344 3381673 3413966 3450720 3435596 3453273 3484469 3504478 3513570 3539476 3564520
14235C564520K6356J6978J4875K3043L8937K2851J7450N979K1273N6180M9400
$$ 3564520 3590876 3607854 3622729 3645772 3684709 3707560 3725010 3730989 3752262 3808442 3857842
14224C857842L7647K9741K1136J0120K8384L8659J5814J6194M242K9120N3324
$$ 3857842 3895489 3925230 3946366 3956486 3984870 4023529 4039343 4055537 4059779 4088899 4142223
14213D142223L0563N8186J6703K8380Q1768P8738O2181N3126K9622J3850N3798
$$ 4142223 4172786 4230972 4247675 4276055 4357823 4436561 4498742 4551868 4581490 4595340 4649138
14202D649138O0997N3503K6190K5748O2515P0722M2392P0759P2523N6010L2173
$$ 4649138 4710135 4763638 4789828 4815576 4878091 4948813 4991205 5061964 5134487 5190497 5222670
14191E222670L6889N9167N0137L1077P1643P5856M5580O6035L7862O9983J03047
$$ 5222670 5259559 5318726 5368863 5399940 5471583 5547439 5593019 5659054 5696916 5766899 5869946
14180E869946P5062P2248Q7360J00499P8472N5825P3864O6239P8644O1198R1047
$$ 5869946 5945008 6017256 6104616 6205115 6283587 6339412 6413276 6479515 6558159 6619357 6710404
14169F710404J09911Q0179R8852Q6228J06970R5304J07671J17749J03065Q7458
$$ 6710404 6820315 6900494 6999346 7085574 7192544 7287848 7395519 7513268 7616333 7703791
14159G703791J03450Q5086P5835R5772R2989P4710R5471J30205Q6612J18432J12705
$$ 7703791 7807241 7892327 7968162 8063934 8156923 8231633 8327104 8457309 8543921 8662353 8775058
14148H775058R8604J27351J33238J14463J25436J15332J09968J15531J24860J39056
$$ 8775058 8873662 9001013 9134251 9248714 9374150 9489482 9599450 9714981 9839841 9978897
14138I978897J36074R8970Q1780O7123J26849J37191J23314J46759J45694J11461
$$ 9978897 10114971 10213941 10295721 10362844 10489693 10626884 10750198 10896957 11042651 11154112
14128A1154112J12595J52633J23416J39723J35283J74362J46351J55540J82043
$$ 11154112 11266707 11419340 11542756 11682479 11817762 11992124 12138475 12294015 12476058
14119A2476058J77401J72677J91284K19740K15312K08056K25358K26384K31869
$$ 12476058 12653459 12826136 13017420 13237160 13452472 13660528 13885886 14112270 14344139
14110A4344139K02674J92848K14074K61060K83035K61888K38886K62018K82136
$$ 14344139 14546813 14739661 14953735 15214795 15497830 15759718 15998604 16260622 16542758
14101A6542758K67874K54603K66763K88845K98135K81717L14547L15925L21351
$$ 16542758 16810632 17065235 17331998 17620843 17918978 18200695 18515242 18831167 19152518
14092A9152518L49753L64164L63262L35620L89812M11085M00495M16595M02672
$$ 19152518 19502271 19866435 20229697 20565317 20955129 21366214 21766709 22183304 22585976
14083B2585976M14694M47960M80906M80373M79565N09747N49723N41310N62884
$$ 22585976 23000670 23448630 23929536 24409909 24889474 25399221 25948944 26490254 27053138
14074B7053138N65873N81539O42249O57566O53389P01989P01814P43192Q16986
$$ 27053138 27619011 28200550 28842799 29500365 30153754 30855743 31557557 32300749 33117735
14065C3117735Q39154Q60110Q88773R25120R75881J025858J073053J100510J168699
$$ 33117735 33956889 34816999 35705772 36630892 37606773 38632631 39705684 40806194 41974893
14056D1974893J272885J320386J383496J448971J517527J571748J682743J778648
$$ 41974893 43247778 44568164 45951660 47400631 48918158 50489906 52172649 53951297
14048E3951297J834747J913976K033383K109936K174741K289290K436221K551342
$$ 53951297 55786044 57700020 59733403 61843339 64018080 66307370 68743591 71294933
14040G1294933K654247K802657K961416L080667L257597L492773L704355L926211
$$ 71294933 73949180 76751837 79713253 82793920 86051517 89544290 93248645 97174856
14032I7174856M214211M452530M697240M980209N236183N509479N713755N970837
$$ 97174856 101389067 105841597 110538837 115519046 120755229 126264708 131978463 137949300
14024A37949300O282504O657507P069528P570065Q195483Q906280R625854J0359913
$$ 137949300 144231804 150889311 157958839 165528904 173724387 182630667 192256521 202616434
14016B02616434J1129169J1935853J2673888J3262304J3633624J3555416J2785902
$$ 202616434 213745603 225681456 238355344 251617648 265251272 278806688 291592590
14009B91592590J1036812Q155688M315286K02609l513382o488619q636961j0180637
$$ 291592590 302629402 310785090 315100376 315302985 311789603 305300984 296664023 286483386
14001B86483386j1356227j2233099j2864722j3189430j3188538j2774296j2123883
$$ 286483386 275127159 262894060 250029338 236839908 223651370 210877074 198753191
13994A98753191j1297743j0435411r547782q704876p949827p265866o639166o026352
$$ 198753191 187455448 177020037 167472255 158767379 150817552 143551686 136912520 130886168
13986A30886168n489272n003111m549789m147672l813004l569450l343771l157143
$$ 130886168 125396896 120393785 115843996 111696324 107883320 104313870 100970099 97812956
13978I7812956l026211k894456k771629k693884k573504k441840k336122k248299
$$ 97812956 94786745 91892289 89120660 86426776 83853272 81411432 79075310 76827011
13970G6827011k149701k045629j976333j879921j779923j688199j588143j495655
$$ 76827011 74677310 72631681 70655348 68775427 66995504 65307305 63719162 62223507
13962F2223507j437888j335476j239799j138664j098954j011683r41089q55725
$$ 62223507 60785619 59450143 58210344 57071680 55972726 54961043 54019954 53164229
13954E3164229q11519p72086p36586o93340o46315o26467n75591n85148n69328
$$ 53164229 52352710 51580624 50844038 50150698 49504383 48877916 48302325 47717177 47147849
13945D7147849n30276n00818m75478m54010m29821m22365m40060m26916m24181
$$ 47147849 46617573 46116755 45641277 45187267 44757446 44335081 43895021 43468105 43043924
13936D3043924m62451m75403n05720n18765m96283m82155m82357m99996n15856
$$ 43043924 42581473 42106070 41600350 41081585 40585302 40103147 39620790 39120794 38604938
13927C8604938m99349n11416n00727n28881n09716m56570m54157m44302m22078
$$ 38604938 38105589 37594173 37093446 36564565 36054849 35598279 35144122 34699820 34277742
13918C4277742m12789m04005l76846l88578l88119l98310l68262l59843l75971
$$ 34277742 33864953 33460948 33084102 32695524 32307405 31909095 31540833 31180990 30805019
13909C0805019l71306l66774l47289l31122l17161l22051l14097l07425l44305
$$ 30805019 30433713 30066939 29719650 29388528 29071367 28749316 28435219 28127794 27783489
13900B7783489l20506k80255k95691l23952l39473k83049l04492l09285k85765
$$ 27783489 27462983 27182728 26887037 26563085 26223612 25940563 25636071 25326786 25041021
13891B5041021k89686k67823k49140k55019k51961k63979k87306k62516k47906
$$ 25041021 24751335 24483512 24234372 23979353 23727392 23463413 23176107 22913591 22665685
13882B2665685k20438k60668k91569k71597k59110k63619k53873k59762k83061
$$ 22665685 22445247 22184579 21893010 21621413 21362303 21098684 20844811 20585049 20301988
13873B0301988k44901k09243k41987k72929k20058k12120j93201j94248k12903
$$ 20301988 20057087 19847844 19605857 19332928 19112870 18900750 18707549 18513301 18300398
13864A8300398k07392j82697j96987k00604j85957j96884j78664j37839j46675
$$ 18300398 18093006 17910309 17713322 17512718 17326761 17129877 16951213 16813374 16666699
13855A6666699j73992j64701j66922j92002j74343j68152j92066j97133j68477
$$ 16666699 16492707 16328006 16161084 15969082 15794739 15626587 15434521 15237388 15068911
13846A5068911k04871j98658j88202k18876j92452j59520j73338k02431j84329
$$ 15068911 14864040 14665382 14477180 14258304 14065852 13906332 13732994 13530563 13346234
13837A3346234j49218j56497j50653j30840j42298j41181j41692j24393j17947
$$ 13346234 13197016 13040519 12889866 12759026 12616728 12475547 12333855 12209462 12091515
13828A2091515j15328j28573p9589j27056j30115j19132j15948j43820j13590
$$ 12091515 11976187 11847614 11768025 11640969 11510854 11391722 11275774 11131954 11018364
13819A1018364p9741r0549j08322r4090p3364j06037j35651p4875o1459j01712
$$ 11018364 10938623 10848074 10739752 10645662 10572298 10466261 10330610 10255735 10194276 10092564
13809A0092564j02969j08804j10076n6705q6544j12522o3627n6292p7865j03657
$$ 10092564 9989595 9880791 9770715 9714010 9627466 9514944 9451317 9395025 9317160 9213503
13799I213503o5145n3250r7183r8554p0783o3698o5000o6986r1290n1967p7185
$$ 9213503 9148358 9095108 8997925 8899371 8828588 8764890 8699890 8632904 8541614 8489647 8412462
13788H412462p3662r0680q5689o3886o8062n5822n8657p4296p2827o9166r1526
$$ 8412462 8338800 8248120 8162431 8098545 8030483 7974661 7916004 7841708 7768881 7699715 7608189
13777G608189o4235o5115o3043m7551l6649l0664p0413j04745q9892l4474l2493
$$ 7608189 7543954 7478839 7415796 7368245 7331596 7300932 7230519 7125774 7035882 7001408 6968915
13766F968915n0842l7254m4335l0952o2752m5251m1124m7096n4191l9926m3884
$$ 6968915 6918073 6880819 6836484 6805532 6742780 6697529 6656405 6609309 6555118 6515192 6471308
13755F471308n1904o9128n3555p6389n1063n8911n2190m2768m1304n9871o2581
$$ 6471308 6419404 6350276 6296721 6220332 6169269 6110358 6058168 6015400 5974096 5914225 5851644
13744E851644o7661k2200o1558l4215l5874k0174j6859l6736m3886l6249m3178
$$ 5851644 5783983 5761783 5700225 5666010 5630136 5609962 5593103 5556367 5512481 5476232 5433054
13733E433054j1136k5340n1600n6713k2715m3054n0726j0773m2922m1888k1850
$$ 5433054 5421918 5396578 5344978 5288265 5265550 5222496 5171770 5160997 5118075 5076187 5054337
13722E054337k7322j9923K979m8560m8415l2567j2776k908j0512m5185o5635l3545
$$ 5054337 5027015 5007092 5010071 4961511 4913096 4880529 4867753 4864845 4854333 4809148 4743513 4709968
13710D709968j5645m6854j5276j661j2344l3104o0016n6392r434k5719l2723j4057
$$ 4709968 4694323 4647469 4632193 4630532 4618188 4585084 4525068 4468676 4459242 4433523 4400800 4386743
13698D386743j4859l4218l3859j5111j617o132j7379n0686k3412J654m8621j6242
$$ 4386743 4371884 4337666 4303807 4288696 4287079 4280947 4263568 4212882 4189470 4191124 4142503 4126261
13686D126261R926k4986l3296j1535r390j8066j9005k9903j9952P165N718j6795
$$ 4126261 4136187 4111201 4077905 4066370 4056980 4038914 4019909 3990006 3970054 3977219 3982937 3966142
13674C966142o2804n4737o6378r042K7853j5325j2514q916n507k7446l2641o430
$$ 3966142 3903338 3848601 3782223 3773181 3801034 3785709 3773195 3764279 3758772 3731326 3698685 3692255
13662C692255j2016o066k9746k1788p984m0109k8037K487j1333k1738l8425l1566
$$ 3692255 3680239 3674173 3644427 3622639 3614655 3574546 3546509 3548996 3537663 3515925 3477500 3445934
13650C445934j8939j1070J409j0685j6042p959k2389l6734k4554k3912j8270r632
$$ 3445934 3426995 3415925 3417334 3406649 3390607 3382648 3360259 3323525 3298971 3275059 3256789 3247157
13638C247157k423L690M297m3095k9856n907K7702n35m5463k3361J3034j865l3938
$$ 3247157 3244734 3248424 3252721 3209626 3179770 3173863 3201565 3201030 3155567 3132206 3145240 3143375 3109437
13625C109437m7750l3569P044j0148J7298K3784r146m0277j8515k407p231n627
$$ 3109437 3061687 3028118 3035162 3025014 3042312 3066096 3056950 3016673 2998158 2995751 2988520 2982893
13613B982893k7234m0021k4726k2214m1044K4031N174l6716k1404J1250J1796
$$ 2982893 2955659 2915638 2890912 2868698 2827654 2851685 2856859 2820143 2798739 2809989 2821785
13602B821785l9791j8032L879N870k2241l0263m2581j6507J3057L910k2145l0000
$$ 2821785 2781994 2763962 2767841 2773711 2751470 2721207 2678626 2662119 2675176 2679086 2656941 2626941
13590B626941J8343P317k633K5121J5580k8099k6609l0257m9135k5654j5539j3412
$$ 2626941 2645284 2652601 2649968 2675089 2690669 2662570 2635961 2605704 2556569 2530915 2515376 2501964
13578B501964O772R702J0276M753j7822j4345j0594k1071j0773k2275q489J921
$$ 2501964 2508736 2518438 2528714 2533467 2515645 2501300 2490706 2469635 2458862 2436587 2428098 2430019
13566B430019N315l4562j9133j1417K6437L4152J9J7425j3828m5941k1476j2316
$$ 2430019 2435334 2400772 2381639 2370222 2396659 2430811 2430830 2448255 2434427 2388486 2367010 2354694
13554B354694j2111j5550J6582L839R58l393j0903P542j434R69j3080j7235q699
$$ 2354694 2342583 2327033 2343615 2347454 2348412 2345019 2334116 2341658 2340224 2341193 2328113 2310878 2302179
13541B302179j6358l720J0574Q350K4166q727k1143l1807l2463j3183r78l1526
$$ 2302179 2285821 2282101 2292675 2301025 2325191 2316464 2295321 2263514 2231051 2217868 2216890 2185364
13529B185364j2858P569J68l984R866J3370j8043j0307q701o531R721j1594r693
$$ 2185364 2172506 2180075 2180243 2176259 2186125 2199495 2181452 2171145 2162444 2155913 2165634 2154040 2144347
13516B144347k9931l0295r360J6247o532k8699k7313r526q317O779J4670L536
$$ 2144347 2114416 2084121 2074761 2091008 2084476 2055777 2028464 2018938 2010621 2017400 2032070 2035606
13504B035606q92l3251l5564J3835J5176k873J9442Q530j450j8614j3810k5353
$$ 2035606 2034714 2001463 1965899 1979734 1994910 1992037 2011479 2020009 2018559 1999945 1986135 1960782
13492A960782j2660Q424k3841k4002K7702J8736m713J5511R549j8016k0032j7788
$$ 1960782 1948122 1956546 1932705 1908703 1936405 1955141 1950428 1965939 1975488 1957472 1937440 1919652
13480A919652P675l1968N26J0150r147k8681j9306J4838q97k5568j9640J0278
$$ 1919652 1927327 1895359 1895885 1906035 1896888 1868207 1848901 1863739 1862842 1837274 1817634 1827912
13468A827912J6811J2416L0699n178j3989k0438j6462j7172k9433l8356j1786
$$ 1827912 1844723 1857139 1887838 1882660 1868671 1848233 1831771 1814599 1785166 1746810 1735024
13457A735024J0748N656l8225k8663J0993L9670q964J8678N994j0070j325k1322
$$ 1735024 1745772 1751428 1713203 1684540 1695533 1735203 1726239 1744917 1750911 1740841 1739516 1718194
13445A718194k5508j1168J063K736j4192Q620J7399J8401j3776k4964j2663M555
$$ 1718194 1692686 1681518 1682581 1685317 1671125 1679745 1697144 1715545 1701769 1676805 1664142 1668697
13433A668697K244O581j9807j5375k1097J1293L307K4346L3116k7625l6486k7145
$$ 1668697 1670941 1677522 1657715 1642340 1621243 1632536 1635843 1660189 1693305 1665680 1629194 1602049
13421A602049O589l706n209j2758J0300L3219n33q317l064j5578j4216l4240N538
$$ 1602049 1608638 1604932 1599723 1586965 1597265 1630484 1629951 1621634 1618570 1602992 1588776 1554536 1560074
13408A560074O585q195K425j501J6048J9108n367k6202j9037j7930k2721q390
$$ 1560074 1566659 1558464 1560889 1559388 1575436 1594544 1589177 1562975 1543938 1526008 1503287 1494897
13396A494897J0324K2625K6352j3070L22R882P823J7828m01l6839k3374J4393
$$ 1494897 1505221 1527846 1554198 1541128 1541450 1551332 1559155 1576983 1576582 1539743 1516369 1530762
13384A530762k4366L932l026j1745n965j3822J2873L092J0888K912r543N836Q596
$$ 1530762 1506396 1510328 1507302 1495557 1489592 1475770 1488643 1491735 1502623 1505535 1495992 1501828 1510424
13371A510424j3483l4895r71p11K991r521m878Q196K413j4009l4818q163J5378
$$ 1510424 1496941 1462046 1461075 1460364 1463355 1453834 1448956 1457152 1459565 1445556 1410738 1402575 1417953
13358A417953J069j1868k8836o299K3953o048J604K3119J6234j3171O846J550
$$ 1417953 1419022 1407154 1378318 1372019 1395972 1389924 1391528 1414647 1430881 1417710 1424556 1426106
13346A426106j689l502l6695L159K0020K0868m781k6327k8719K166p900K6755
$$ 1426106 1424417 1420915 1384220 1387379 1407399 1428267 1423486 1397159 1368440 1370606 1362706 1389461
13334A389461j0292k5813J965l075N854J1570k6707p099P391j1532p689q999J6769
$$ 1389461 1379169 1353356 1355321 1352246 1358100 1369670 1342963 1335864 1343255 1331723 1324034 1315035 1331804
13321A331804j2889L528k895J3189K0809N088l9108l2664J3710o408J0536j58
$$ 1331804 1318915 1322443 1319548 1332737 1353546 1358634 1319526 1286862 1300572 1294164 1304700 1304542
13309A304542K058k1454m4942n000n336K3847j915j0942P209O868M1674J7764
$$ 1304542 1306600 1285146 1240204 1235204 1229868 1253715 1251800 1240858 1248067 1254935 1296609 1314373
13297A314373k0857K442r808k1955j8115j3115q318r839K3048J1211P701j1703
$$ 1314373 1293516 1295958 1286150 1264195 1246080 1232965 1224647 1214808 1237856 1249067 1256768 1245065
13285A245065M29r382R723j6701k2103k6861j3223l064J230J0887L1187p789j4809
$$ 1245065 1245494 1236112 1245835 1229134 1207031 1180170 1166947 1163883 1165113 1176000 1207187 1199398 1184589
13272A184589j2784L2385L506j8559k6651J8191L6129L319l0023j8489q242J7167
$$ 1184589 1171805 1204190 1207696 1189137 1162486 1180677 1216806 1220125 1190102 1171613 1163371 1180538
13260A180538R095j4745k456j2375m999k8900k082J8692L1845J3767j0948K2579
$$ 1180538 1189633 1174888 1172432 1160057 1155058 1126158 1124076 1142768 1174613 1188380 1177432 1200011
13248A200011m447k8252j1721Q960r087O013j4776k4359l3633O412J8647K8628
$$ 1200011 1195564 1167312 1155591 1164551 1155464 1161477 1146701 1122342 1088709 1095121 1113768 1142396
13236A142396N4043J353j6844Q919o391k3589j5065j5674O952R540l1105q787
$$ 1142396 1196439 1197792 1180948 1189867 1183476 1159887 1144822 1129148 1136100 1145640 1114535 1105748
13224A105748k4317K1153K8008J5158k2073k5678j0154k318j424L1275j0807k4262
$$ 1105748 1081431 1102584 1130592 1145750 1123677 1097999 1087845 1085527 1084103 1115378 1104571 1080309
13212A080309r679j3857J4375J3644j2169p52p27m0875o941K6041L4639J5911
$$ 1080309 1070630 1056773 1071148 1084792 1072623 1071871 1071144 1030269 1023328 1049369 1084008 1099919
13200A099919K7705P466k7650l8973j7742K4737L0295O276k8069l1312R118K269
$$ 1099919 1127624 1135090 1107440 1068467 1050725 1075462 1105757 1112033 1083964 1052652 1061770 1064039
13188A064039J1985K3571j9719j8129J6740p144p285p51j6818l046K5382J3906
$$ 1064039 1076024 1099595 1079876 1061747 1078487 1071343 1064058 1063307 1046489 1043443 1068825 1082731
13176A082731O707j6101j7593j3432q374j8104o265J0109J2725J6386q653k2315
$$ 1082731 1089438 1073337 1055744 1042312 1033938 1015834 1009569 1019678 1032403 1048789 1040136 1017821
13164A017821J3168j1270j2597M078l225M447J911J9409r757j3850O274J8602
$$ 1017821 1030989 1019719 1007122 1011200 1007975 1012422 1014333 1033742 1023985 1010135 1016409 1035011
13152A035011j0884J1067j9242j3780j2377J880K2930K6499k3645q243N140l4813
$$ 1035011 1024127 1035194 1015952 1002172 989795 991675 1014605 1041104 1017459 1009216 1014356 979543
13140I79543m012L9472K5728j4756l0513k8971k2950J7511K2206O177m688k4858
$$ 979543 975531 1015003 1040731 1025975 995462 966491 943541 961052 983258 989435 984747 959889
13128I59889j5547R31r521j0939j2322R709L1398J1684l7329o698L9257K4066
$$ 959889 944342 945273 935752 924813 912491 922200 953598 965282 927953 921255 960512 984578
13116I84578l0588j5200J6828K5399L816j9623j0378J1892n011j3916j8229n535
$$ 984578 953990 938790 955618 981017 984833 965210 954832 966724 961713 947797 929568 924033
13104I24033J6176k810j4695k979Q427K2529k5744k4063K4648J771L1298J4434
$$ 924033 940209 937399 922704 919725 928152 950681 924937 900874 925522 927293 958591 973025
13092I73025k9678l6523j5356J0172j0332j061O238K380N227m269J212N503n396
$$ 973025 943347 906824 891468 901640 891308 890247 896485 898865 904092 899823 901035 906538 901142
13079I01142J2454r203j2618n049Q971K5672r094k0721k387J5612L1563K033n238
$$ 901142 913596 904393 891775 886726 895697 921369 912275 891554 889167 904779 936342 938375 933137
13066I33137p183k0597l478j2733j8361K598J2171P666k2992j3535K2821m636
$$ 933137 925954 905357 901879 889146 870785 873383 885554 893220 870228 856693 879514 874878
13054H74878K3692J3385k8948N415J1406K0880j0453o994j735J6132J257j5777
$$ 874878 898570 911955 883007 888422 899828 920708 910255 903261 901526 917658 918915 903138
13042I03138p829j0191K8438K2876N97k1059k1317j3562q789R398J245p824n228
$$ 903138 895309 885118 913556 936432 937029 915970 894653 881091 872302 881700 882945 875121 869893
13029H69893L600j0956k8821R031O661o190M032R542R20j6545J3717J8543M734
$$ 869893 873493 862537 833716 842747 849408 843218 847250 856792 857712 841167 854884 873427 878161
13016H78161m467m958M066J0397j5984J4375l564L153k2049k0637m490J1092j6086
$$ 878161 873694 868736 872802 883199 867215 881590 878026 881179 859130 838493 834003 845095 829009
13003H29009J0174J2662o225L348j2425J496l641M580Q92K2729k109R791j5222
$$ 829009 839183 851845 845620 848968 836543 838039 834398 838978 839870 862599 860490 870281 855059
12990H55059k8572n531j9687J4435Q400l0851j4468N788K5421K249K381J7471
$$ 855059 826487 820956 801269 815704 824104 793253 778785 784573 809994 812243 814624 832095
12978H32095q18j1048K701J0502J7870j0419n574J7462j1662j4331N626N356k933
$$ 832095 831277 820229 822930 833432 851302 840883 835309 852771 841109 826778 832404 837760 834827
12965H34827L935k7983j2128l0126j1005M4180K3597m480q073K500j834J8849
$$ 834827 838762 810779 798651 768525 757520 801700 825297 820817 812744 815244 813410 832259
12953H32259J522l2185k4471L2116J7806l285j7402j6338K191r07K054q974l45
$$ 832259 833781 801596 777125 809241 827047 823762 806360 790022 792213 791306 793360 784386 784041
12940G84041K948k2693N93K2596qq039k5047J6849q565R080J1440j0721q727R927
$$ 784041 786989 764296 764889 787485 787477 779438 754391 771240 762675 771755 783195 772474 763747 773674
12926G73674J3773J5204k0204l6867K0704L5315K1423j8579m6790p400J0388K7645
$$ 773674 787447 802651 782447 745580 766284 801599 823022 804443 757653 750253 760641 788286
12914G88286J7370P060j5450j9032n292p857j1503m589q097n73q189J519J8301
$$ 788286 805656 812716 797266 778234 772942 765085 753582 748993 740896 740323 732134 733653 751954
12901G51954J8525l500J2875Q028k9150N837k0281J9045J0186j8633p61L3944
$$ 751954 770479 766979 779854 787882 758732 764569 744288 763333 773519 754886 754125 788069
12889G88069L7152n058j3554O355k3052k1803l338j1953J6743K5095K2881j6777
$$ 788069 825221 820163 806609 812964 789912 768109 764771 752818 769561 794656 817537 800760
12877H00760k2018J3068j7633m44k3298k0123l153J8324L8836J8353k5568j6487
$$ 800760 778742 791810 774177 773733 750435 730312 727159 745483 784319 802672 777104 760617
12865G60617j9028L2414J2811j8547j8511k602k412l993N52J635m387j485l168
$$ 760617 741589 774003 786814 768267 749756 747154 744742 740749 741301 742936 738549 737064 733896
12852G33896l4227J0338K4993P150k118J691K9344J67k1449J7509j3651k0402
$$ 733896 699669 710007 735000 742150 740032 741723 771067 771234 749785 767294 753643 733241
12840G33241j1717K3974J2650j9536j2942p266n826K4640J491j4682Q782P447
$$ 733241 721524 745498 758148 738612 725670 718404 712578 737218 738709 724027 732809 740256
12828G40256j5938j4765J5379M027J6704M607j966j6249J5704r282j4080K7077
$$ 740256 724318 709553 724932 728959 745663 750270 748304 732055 747759 738477 724397 751474
12816G51474p263q024M1670O84k3056p595o332L131n89k1109j6777j5875J4644
$$ 751474 744211 736187 777857 778541 755485 747890 741558 744689 744100 722991 706214 690339 704983
12803G04983L1952L1793N316O79l915p026j4910l9672j0060M196j4373J2234K5372
$$ 704983 736935 768728 774044 774723 770808 763782 748872 709200 699140 703336 688963 701197 726569
12790G26569j6064J4193K2391m473J1717j1581P258J8488K2088k0829L226J2129
$$ 726569 710505 724698 747089 742616 754333 742752 750010 768498 790586 769757 772983 785112
12778G85112k1731m2222N318o450k2894K993J0574j4704n512K7340l357j284j1744
$$ 785112 763381 721159 726477 720027 697133 700126 710700 695996 690484 717824 714467 713183 701439
12765G01439J1931J1119K0791L9733j3958l3321j5706q291J1765j5993K1713P348
$$ 701439 713370 724489 745280 785013 771055 737734 722028 713737 725502 709509 731222 738570
12753G38570r82L650k1051L841L6778L192k0828J0132o315k2822j9242q082N091
$$ 738570 737588 741238 720187 724028 760806 763998 743170 753302 746987 724165 704923 696841 701932
12740G01932j8832l968P874q419J1007K9692K5607j5964k5161q903J0794P543
$$ 701932 683100 679132 687006 678587 689594 719286 744893 728929 703768 694865 705659 713202
12728G13202O143m667j2947o179M003r565k1223l0582K0391M4798K6150K7772
$$ 713202 719345 714678 701731 695552 699555 689990 668767 638185 658576 703374 729524 757296
12716G57296k9199j2697p843N376K0352L532J0545j2012o618j1426j8650o512
$$ 757296 728097 715400 707557 712933 733285 736817 747362 735350 728732 717306 698656 692144
12704F92144J2610L924j3760j3940O402J6480P156j3377m369K204j1679j2282
$$ 692144 704754 708678 694918 680978 687380 703860 711016 697639 693270 695474 683795 671513
12692F71513j1546J8467O212l24N012J3562K354J6442P418m2051j8358J8703R123
$$ 671513 659967 678434 684646 684322 689334 702896 705250 721692 729110 687059 668701 687404 696527
12679F96527j388P368J4604J722j1832k0426j6549J2291K5133j9905j6274J0119
$$ 696527 695139 702507 717111 718833 707001 686575 670026 682317 707450 687545 671271 681390
12667F81390J7770p49l2197K284k1081Q32K842J8327L153J237O748J7237K0103
$$ 681390 699160 698411 666214 668498 647417 648249 651091 669418 672571 673808 680556 697793 717896
12654G17896j9921M803P929j2388j9796k412j604K1964Q153l4064k851J7289K766
$$ 717896 697975 702778 710707 698319 678523 676111 674507 696471 704624 670560 667709 684998 687764
12641F87764k785J3919P69k3280j6059L9l539P624O612K5537k4352M120n514j10
$$ 687764 684979 698898 699667 676387 660328 660367 656828 664452 671064 696601 672249 676369 670855 670745
12627F70745J3770j840j363R193o128j2419k1184K605J8581q40J8504K0080k4143
$$ 670745 684515 682675 681312 690505 684377 671958 650774 653379 671960 671120 689624 709704 685561
12614F85561q098o911J2227l946J2578q233J6034M1091l741j6883r615l7108m1065
$$ 685561 677463 670552 682779 678833 691411 683178 699212 740303 736562 719679 710064 672956 631891
12601F31891J7055L2185k819j5053j134J7828J5954j6408j0600p159K797J2201
$$ 631891 648946 681131 678312 663259 662125 679953 695907 679499 668899 661740 664537 676738
12589F76738J2720P494j5462l3346K6159L3456k3094k0477J666O233j7512K948
$$ 676738 689458 696952 681490 648144 674303 707759 684665 664188 665854 672087 654575 657523
12577F57523R866p38Q629Q880L0523O753j9863K687R696j460O180P077K570q705
$$ 657523 667389 666651 675280 684160 714683 721436 701573 704260 713956 712496 718676 725753 728323 719618
12563G19618O40O089p475l6334k7819K263K711p604K1375L4233J3192k7794n563
$$ 719618 720258 726347 718872 682538 654719 656982 659693 652089 673464 707697 720889 693095 687532
12550F87532k015J4482M756n692M264l270m1517o826K9060J0270j4670J5396J2966
$$ 687532 685517 699999 704755 699063 703327 700057 658540 651714 680774 691044 676374 691770 704736
12537G04736k2873j7048K1446J0243k1684l4070N008L5180P833J6039m120l5242
$$ 704736 681863 664815 686261 696504 674820 640750 645758 680938 688771 704810 700690 665448
12525F65448r547n574k7803Q117J7093K520j0685p298L5144K4774K934J2443N622
$$ 665448 655901 650327 622524 630641 647734 650254 639569 632271 667415 692189 695123 707566 713188
12512G13188J1875L522j0531j8668j6010k9173q439K3678J3741L4571l16k312
$$ 713188 725063 728585 718054 699386 683376 654203 645764 669442 683183 717754 717438 715126
12500G15126J5978n702k2136j4017m138j5888J8108R656j8098k0720J374K3932
$$ 715126 731104 725402 703266 689249 685111 669223 687331 696987 678889 658169 659543 683475
12488F83475K4219O924L950R16k7034k5458P201L77K80J6735J6248J2816k4460
$$ 683475 707694 714618 718568 719484 692450 666992 674193 674570 674850 691585 707833 720649 696189
12475F96189l7294K3766L4893L6566m486j0265k3254k8464j713k546j785l429
$$ 696189 658895 682661 717554 754120 749634 739369 716115 687651 685938 683392 681607 678178
12463F78178n516K2950J0867j7248l0608k879L969q781N870o13j374r747J7959
$$ 678178 672662 695612 706479 689231 658623 655744 659713 650932 656802 656189 654815 645068 663027
12450F63027L1406j1965o449J6487J4595J9631j8278Q292J6343J212k8665M933
$$ 663027 694433 682468 676019 692506 707101 726732 708454 716746 733089 734301 705636 710569
12438G10569J1135O986P584L244N90j5771j0273P00J6988j0263K220q252k0208
$$ 710569 721704 728690 736274 739518 740108 724337 714064 714764 731752 721489 723709 715457 695249
12425F95249j319j7270k7385K7325K8437o262k6002j9656R875J4347J0567K855
$$ 695249 693930 676660 649275 676600 705037 698775 672773 653117 662992 677339 687906 690761
12413F90761L9234l570k7008j1531J8467j2692k8826m946K7701j2562l4119K5491
$$ 690761 729995 726425 699417 687886 706353 693661 664835 659889 687590 675028 640909 666400
12401F66400J6503N057K3085J2018j8129J4169K1492r385k8817o978J4023m591
$$ 666400 682903 687960 711045 723063 704934 719103 740595 731210 702393 695415 709438 704847
12389G04847k1726l5720J6401K2859l006q873J1495L7158M654j4671k8219j1688
$$ 704847 683121 647401 663802 686661 683655 674782 686277 723435 728089 713418 685199 673511
12377F73511j6638p793J9894j396L758R555J5949L196p822M3852M355j6941o822
$$ 673511 656873 649080 668974 667578 671336 680891 696840 700036 692214 736066 740421 723480 716658
12364G16658j2290j6407J3683R48j3939O010p725k9960J9498M2402R683j1927
$$ 716658 704368 687961 701644 702592 688653 694663 686938 656978 676476 718878 728561 716634
12352G16634j7655O924L9537m471J516L5352M016n375k1262j8022J3676L6790
$$ 716634 698979 705903 745440 740969 742485 777837 781853 776478 755216 737194 750870 787660
12340G87660R389j8016k159k2241R882J388p813k2699p512J0589j3916J3888Q054
$$ 787660 797049 779033 776874 754633 764515 765903 758090 735391 727879 738468 724552 738440 746494
12327G46494J6226R771k859k520Q761J1474j3620P643J1207l3299O890K2656J0316
$$ 746494 762720 772491 769632 767112 775873 787347 773727 781370 792577 759278 766168 788824 799140
12314G99140j4918J46N8457J7609m1160l2630J6090K678l6315k3561L4407J756
$$ 799140 784222 784368 842825 860434 819274 786644 802734 805412 769097 745536 779943 781699
12302G81699j7153J0626M2411M150j2673K2054o6K1685J2618J7686k3856j1729
$$ 781699 764546 775172 817583 821733 809060 831114 831048 852733 865351 883037 859181 847452
12290H47452K5956J0615j2407l7430q199O187J8866R855M865O307L65j7121o341
$$ 847452 873408 884023 871616 834186 825987 832174 851040 860895 865760 872067 872432 855311 848970
12277H48970N91o578P333K8211j5489k1503j3328k918k0684K6869J2054R71J0816
$$ 848970 849561 842983 850316 878527 863038 841535 828207 825289 804605 831474 843528 844499 855315
12264H55315o727L890K903L582J7164j3318l0447k8729R436K177M40K7178J6773
$$ 855315 848588 852478 855381 858963 876127 862809 832362 803633 813069 815246 815686 842864 859637
12251H59637j963o628k3985k1802Q356J6433K1053L1358j7590k998l4916K0948
$$ 859637 857674 851046 827061 805259 813615 830048 851101 882459 864869 861871 826955 847903
12239H47903K7643n667J2290j119k3582J9086J2978j1792k668n762R181K125q961
$$ 847903 875546 869879 882169 881050 857468 876554 889532 877740 875072 869310 878491 880616 871655
12226H71655k2465l5069J1938J4862K9283K4147j8217k3747N289J7116L1846L0342
$$ 871655 849190 814121 826059 840921 870204 894351 876134 852387 857676 874792 906638 936980
12214I36980l324l2799j5349j1211L693K7986J0498k6104l2463r834K6320K1376
$$ 936980 933656 900857 885508 874297 877990 905976 916474 890370 857907 848073 874393 895769
12202H95769J1694N542K9187L2354r879J3616j5142j5812J7815k1663j4794K8648
$$ 895769 907463 913005 942192 974546 964667 978283 963141 947329 965144 943481 928687 957335
12190I57335k7088j4157R205J0967p092N115K540J113k390m640N655j4546k627
$$ 957335 930247 916090 925295 936262 929170 934285 936825 937938 935548 930908 936563 922017 919390
12177I19390K3385j5690k6130R408L284K363J0445m800k1790K259K0985k3472
$$ 919390 942775 927085 900955 910363 913647 916010 926455 921655 899865 902124 923109 899637
12165H99637o651J2022J9267p250q186K0419J0218j7467O148J7443r089k2010
$$ 899637 892986 905008 924275 917025 908839 929258 939476 922009 928157 945600 936511 914501
12153I14501o556J6135L771r865N013k277j2337k341J8796M846J3328L188l4264
$$ 914501 907945 924080 927851 917986 922999 920722 908385 906044 924840 929686 943014 946202 911938
12140I11938J5337K5887j7899j4863J4936r715k600L846L2696l236o075l172Q386
$$ 911938 927275 953162 935263 920400 935336 925621 923021 926867 959563 956327 950252 947080 955466
12127I55466R708J9362M42k2756j7035m315L040j1648j926J9996M1627J8307p614
$$ 955466 965174 984536 984978 962222 945187 940872 943912 932264 930338 950334 991961 1010268 1002654
12114A002654j990j9585j5338J7965K5926n092P292j1814m719K4478J8133P088
$$ 1002654 1000664 981079 965741 983706 1009632 1004540 1011832 1000018 995299 1019777 1037910 1044998
12102A044998k8831m0510j1688M4297l971j9972J0192J1685J1616K5808L2107
$$ 1044998 1016167 975657 963969 1008266 1004295 984323 994515 1006200 1017816 1043624 1075731
12091A075731K3501L374j8105l969L7478K0960n4974k7247J034N71k0537J9011
$$ 1075731 1099232 1102606 1084501 1080532 1118010 1138970 1083996 1056749 1057783 1058354 1037817 1056828
12079A056828L9656O526q696k322K5647J9862J4880p76J4772k7383k0497j5493
$$ 1056828 1096484 1103010 1094314 1091992 1117639 1137501 1152381 1151605 1166377 1138994 1118497 1103004
12067A103004J0503J9937K1578K4358k37q445r879j3960J4411j881k1923n635
$$ 1103004 1113507 1133444 1155022 1179380 1179143 1170698 1160819 1146859 1161270 1159389 1137466 1131831
12055A131831K198J5163Q866K0020M601J8871J7608N022n032j9820l4235L9371
$$ 1131831 1134029 1149192 1158058 1178078 1182679 1201550 1219158 1224180 1219148 1199328 1165093 1204464
12043A204464Q707K6631M2866K791j0113k8578r119K4352N315j6838k0545l761
$$ 1204464 1213171 1239802 1282668 1285459 1275346 1246768 1237649 1262001 1267316 1250478 1229933 1226172
12031A226172J2024L7083K0710L746p993n482J2875J3499J1784j6668j4682J6335
$$ 1226172 1238196 1275279 1295989 1299735 1291742 1286260 1299135 1312634 1324418 1307750 1293068 1309403
12019A309403J5486M1410M4369J9860j3721j0802m753J1255O929K0351O698p424
$$ 1309403 1324889 1366299 1410668 1430528 1416807 1406005 1401252 1412507 1419436 1439787 1446485 1439061
12007A439061q620J8760J2811L3014J533J5782J0596K0127O443l950P727m630
$$ 1439061 1430441 1449201 1462012 1495026 1496559 1512341 1522937 1543064 1549507 1545557 1553284 1548654
11995A548654L4481O822j9707N915K4121p790j6147p301l250L2279K2785M1166
$$ 1548654 1583135 1589957 1570250 1576165 1600286 1592496 1576349 1569048 1565798 1598077 1620862 1662028
11983A662028R565j6444r530K3230J4471l388K5397K1476K3631J2022J270P847
$$ 1662028 1671593 1655149 1645619 1668849 1683320 1679932 1705329 1726805 1750436 1762458 1763728 1771575
11971A771575L35K1286P503j0421J7842J2160J9997K7450r977Q614K0830L9336
$$ 1771575 1771910 1793196 1800699 1790278 1808120 1820280 1840277 1867727 1857750 1866364 1887194 1926530
11959A926530M068o501L2651J5623J813L51M017J3222J4933K1214K1610P348O570
$$ 1926530 1930598 1924097 1956748 1972371 1974184 1974535 1978552 1991774 2006707 2027921 2049531 2056879 2063449
11946B063449Q395L6725N6971L6248M130L2084K4811J8564M189L3016N5343L902
$$ 2063449 2071844 2108569 2165540 2201788 2205918 2238002 2262813 2281377 2285566 2318582 2373925 2377827
11934B377827k376K7302K2480k416J0274L0042O766M6447L7869J7467K4396O654
$$ 2377827 2375451 2402753 2425233 2422817 2433091 2463133 2469899 2516346 2554215 2571682 2596078 2602732
11922B602732J6949M5543M3592L4719P279J7929M5229K8322N8844M3688K1877
$$ 2602732 2619681 2665224 2708816 2743535 2750814 2768743 2813972 2842294 2901138 2944826 2966703
11911B966703M0690J3504L8958N2062O5717L2154K1411N0627P5573O2406N1210
$$ 2966703 3007393 3020897 3059855 3111917 3177634 3209788 3231199 3281826 3357399 3419805 3471015
11900C471015M1012N0554N1330N9868P9209O8467N3318P8512R6786R1223P9043
$$ 3471015 3512027 3562581 3613911 3673779 3752988 3821455 3874773 3953285 4050071 4141294 4220337
11889D220337Q4963O1385Q2935R3602J04759Q1007Q7829J31584J38196J24914
$$ 4220337 4305300 4366685 4449620 4543222 4647981 4728988 4816817 4948401 5086597 5211511
11879E211511J18529J40235J46915J37653J42792J74336J91499J60365J39962
$$ 5211511 5330040 5470275 5617190 5754843 5897635 6071971 6263470 6423835 6563797
11870F563797K02298K25066K26141K28971K56282L00828K97487K94856L13278
$$ 6563797 6766095 6991161 7217302 7446273 7702555 8003383 8300870 8595726 8909004
11861H909004L58896L61999L85416M08703L89073L61659L21961L11578K89731
$$ 8909004 9267900 9629899 10015315 10424018 10813091 11174750 11496711 11808289 12098020
11852A2098020K35399K18676J78207J83538J56502J12613O6976J04815J08365
$$ 12098020 12333419 12552095 12730302 12913840 13070342 13182955 13249931 13354746 13463111
11843A3463111J16675J33437J64165K21820K65068K78605L08135L53409M04887
$$ 13463111 13579786 13713223 13877388 14099208 14364276 14642881 14951016 15304425 15709312
11834A5709312M36619M14397M14972L51000K81559K26844J02988K742n4800j28277
$$ 15709312 16145931 16560328 16975300 17326300 17607859 17834703 17937691 17940433 17885633 17757356
11824A7757356j71762k21037k84131l24050l58123l33439l15915k96465k59578
$$ 17757356 17585594 17364557 17080426 16756376 16398253 16064814 15748899 15452434 15192856
11815A5192856k03550j60920j08380p4572m8463k3114J4160J1824J2430K6630
$$ 15192856 14989306 14828386 14720006 14645434 14596971 14573857 14588017 14599841 14612271 14638901
11805A4638901K4153j6064l0432j01626j03400j34648j67622j21837j74523j86219
$$ 14638901 14663054 14646990 14616558 14514932 14411532 14276884 14109262 13987425 13812902 13626683
11795A3626683j86763j94387j74367r9633n5212p2461j0368m787O2838R5998J29945
$$ 13626683 13439920 13245533 13071166 12971533 12916321 12843860 12833492 12828705 12891543 12987541 13117486
11784A3117486J57324K11158K09436K65801K95835L20739L31950L59660L80903
$$ 13117486 13274810 13485968 13695404 13961205 14257040 14577779 14909729 15269389 15650292
11775A5650292L46096L55456L34213K91716K47780K09991J83147J25316Q6001
$$ 15650292 15996388 16351844 16686057 16977773 17225553 17435544 17618691 17744007 17830008
11766A7830008Q0642N7521K1061K2099M8211J06393J39422J56186K13423K54777
$$ 17830008 17910650 17968171 17989232 18011331 18059542 18165935 18305357 18461543 18674966 18929743
11756A8929743K99430L49627L93527L98491M01287M06977L71649L40401K73876
$$ 18929743 19229173 19578800 19972327 20370818 20772105 21179082 21550731 21891132 22165008
11747B2165008K03579R0016m3435k11366l37548m02196m86076n05306n28440n42086
$$ 22165008 22368587 22458603 22415168 22203802 21866254 21464058 20977982 20472676 19944236 19402150
11737A9402150n58080n31863m86433m47354l90173l25362k88951k47311j98092
$$ 19402150 18844070 18312207 17825774 17378420 16988247 16662885 16373934 16126623 15928531
11728A5928531j37007r8801j24240j37530j71171j83937j81145k21558k71195
$$ 15928531 15791524 15692723 15568483 15430953 15259782 15075845 14894700 14673142 14401947
11719A4401947l29771l80251m33180m48018m82486m76253m64421m55349m45245
$$ 14401947 14072176 13691925 13258745 12810727 12328241 11851988 11387567 10932218 10486973
11710A0486973m14977l82887l77934l28767k96706k99991k74176k42380k11524
$$ 10486973 10071996 9689109 9311175 8982408 8685702 8385711 8111535 7869155 7657631
11701G657631j90579j79622k01522j67919j21798j34528j43890j16236j29576
$$ 7657631 7467052 7287430 7085908 6917989 6796191 6661663 6517773 6401537 6271961
11692F271961j13211r9532r1976r1402j01291r1291j09749r3036p1676n5814q1258
$$ 6271961 6158750 6059218 5967242 5875840 5774549 5683258 5573509 5480473 5408797 5352983 5271725
11681E271725o1815o1566m6442m7042r1259n8651n6992p4961o7279n0495m3145
$$ 5271725 5209910 5148344 5101902 5054860 4963601 4904950 4847958 4772997 4705718 4655223 4612078
11670D612078l5356n4465o4775m6780l8389o0348n8216n0267l4314m9395m1397
$$ 4612078 4576722 4522257 4457482 4410702 4372313 4311965 4253749 4203482 4169168 4119773 4078376
11659D078376l8902m6984n7374n6484j8883k2339k1233k9496l4555n6855k7797
$$ 4078376 4039474 3992490 3935116 3878632 3859749 3837410 3816177 3786681 3752126 3695271 3667474
11648C667474n6756n3081k9847l2263r247k6563m8254m5971n4292m3556l8118
$$ 3667474 3610718 3557637 3527790 3495527 3486280 3459717 3411463 3365492 3311200 3267644 3229526
11637C229526j0975J6172k2778k4705k4335j5066k4951j3394n1941l7703k3687
$$ 3229526 3218551 3234723 3211945 3187240 3162905 3147839 3122888 3109494 3057553 3019850 2996163
11626B996163m3857m0822j4449J4171k5637k5230j1107m9648l4419j9940k7964
$$ 2996163 2952306 2911484 2897035 2911206 2885569 2860339 2849232 2799584 2765165 2745225 2717261
11615B717261J554P87k0071l9074k2126O730j0781n0240n6850N53r770k4587n924
$$ 2717261 2718815 2719602 2699531 2660457 2638331 2645061 2634280 2584040 2527190 2527743 2517973 2493386 2487462
11602B487462j4878k8926m7119l1820J8201j1585k8489k8947l3176p908k9412
$$ 2487462 2472584 2443658 2396539 2364719 2382920 2371335 2342846 2313899 2280723 2272815 2243403
11591B243403n0432k6187o827K1006j1318l0046j2370l1005l2193j0031J270k4702
$$ 2243403 2192971 2166784 2159957 2180963 2169645 2139599 2127229 2096224 2064031 2054000 2055270 2030568
11579B030568j321k9441m4290k2967j7211j2062l2689R696K910l675J9874r711
$$ 2030568 2029247 1999806 1955516 1932549 1915338 1903276 1870587 1880283 1883193 1879518 1899392 1889681
11567A889681m5928k1069k0743j1786O055q259j2553j6734Q972L839n812O668
$$ 1889681 1843753 1822684 1801941 1790155 1796210 1787951 1775398 1758664 1767636 1771475 1765663 1772331
11555A772331k0974N20k539k9753n2243K995K1662K8450l838j7307j7886q074
$$ 1772331 1751357 1751877 1749338 1719585 1667342 1670337 1691999 1720449 1716611 1699304 1681418 1673344
11543A673344L066Q601j654k3911k9362j5931j9981M638N402j5586P271J2130
$$ 1673344 1676410 1685011 1683357 1659446 1630084 1614153 1594172 1598810 1604212 1588626 1595897 1608027
11531A608027n956j1836k1419k6542k7186J5993L4896j1861K768j4525j9439L152
$$ 1608027 1602071 1590235 1568816 1542274 1515088 1531081 1565977 1554116 1556884 1542359 1522920 1526072
11519A526072P506J9254J8011l5190k9206Q92J6770R968l7597J4503K4364j2170
$$ 1526072 1533578 1552832 1570843 1535653 1506447 1507339 1524109 1534077 1496480 1510983 1535347 1523177
11507A523177k4805r337j0688Q824m545j9678J1825J3210r015p790n678k992J0696
$$ 1523177 1498372 1489035 1478347 1487171 1482626 1462948 1474773 1487983 1478968 1471178 1465500 1462508 1473204
11494A473204J9155k7047q119k4958k4083O422J8101Q288j8331j4590K720m460
$$ 1473204 1492359 1465312 1457193 1432235 1408152 1414574 1432675 1440963 1422632 1408042 1410762 1406302
11482A406302L4033J0927k3614k2923j3254l300q319L1121j9117P818L4495n554
$$ 1406302 1440335 1451262 1427648 1404725 1391471 1388171 1379852 1410973 1391856 1399674 1434169 1428615
11470A428615o188J3535N070q69j8648m991J7743j0537j0598K4317r57M359L190
$$ 1428615 1422427 1435962 1441032 1440163 1421515 1416524 1434267 1423730 1413132 1437449 1436492 1440851 1444041
11457A444041O484j8891l536O389j6482K470J1155K898O48J9638J2917J2827k2225
$$ 1444041 1450525 1431634 1428098 1434487 1418005 1420475 1431630 1434528 1435176 1454814 1467731 1480558 1458333
11444A458333q034J5215j955k0640m335l40R615N360R366L7935l64o713R045K108
$$ 1458333 1450299 1465514 1463559 1442919 1438584 1438244 1447859 1453219 1462585 1500520 1500156 1493443 1502488 1504596
11430A504596L185J8417K092O460L288J4358j4169Q72J2995M252m969q197n280
$$ 1504596 1507781 1526198 1528290 1534750 1538038 1552396 1538227 1539099 1552094 1556346 1551377 1543180 1537900
11417A537900L0614N377K2656n444n510j5321r697K907J9061J9204J9755Q844
$$ 1537900 1568514 1573891 1596547 1591103 1585593 1570272 1560575 1563482 1582543 1601747 1621502 1630346
11405A630346J1865m365k795j9171K7417J4188L6961J8211Q092O402M207K783
$$ 1630346 1642211 1637846 1635051 1615880 1643297 1657485 1694446 1712657 1720749 1727151 1731358 1734141
11393A734141N559K7364k0564k2096J3644O8773L5146L685j8528j5735J1028L6709
$$ 1734141 1739700 1767064 1746500 1724404 1738048 1806821 1841967 1845652 1827124 1811389 1822417 1859126
11381A859126J442j8199k5980J3332J6813J5916K7234K9918J7869K7585L514K471
$$ 1859126 1860568 1842369 1816389 1829721 1846534 1862450 1889684 1919602 1937471 1965056 1968570 1971041
11369A971041J4790L709J9076j5589J2724M4026L8762k399k4502K953K4151K7380
$$ 1971041 1985831 1989540 2008616 1993027 2005751 2049777 2088539 2086140 2061638 2064591 2088742 2116122
11357B116122J6849J0350l9638k9052L9250K9958J2709L536N154M3205L3945L618
$$ 2116122 2132971 2143321 2103683 2074631 2113881 2143839 2156548 2160084 2165238 2208443 2242388 2246006
11345B246006r065N297J6627L8176J2602L5755L4492K2855j3259j2386J2578L6837
$$ 2246006 2236941 2242238 2258865 2297041 2309643 2345398 2379890 2402745 2389486 2377100 2389678 2426515
11333B426515L2901M7728L1695K9963N0119K2879L0861K0102K9617J8936J3669
$$ 2426515 2459416 2507144 2538839 2568802 2618921 2641800 2672661 2692763 2722380 2741316 2754985
11322B754985K1393M4836L6753Q767J7882L9879K6155K9848K6924L1067O2260
$$ 2754985 2776378 2821214 2857967 2866734 2884616 2924495 2950650 2980498 3007422 3038489 3100749
11311C100749M1193L1062M9641N1129M2703N9590J9532L6102L3022J8223M8782
$$ 3100749 3141942 3173004 3222645 3273774 3316477 3376067 3395599 3431701 3464723 3482946 3531728
11300C531728Q6933Q2613O6673N4264O5550O0423Q5831P3765N7608Q0484Q4853
$$ 3531728 3618661 3701274 3767947 3822211 3887761 3948184 4034015 4107780 4165388 4245872 4330725
11289D330725J00543R9758J00561J07347J14097J15378J35080R4585R6193J53725
$$ 4330725 4431268 4531026 4631587 4738934 4853031 4968409 5103489 5198074 5294267 5447992
11279E447992J59433J63699J56861J61538J89779J89948J84925J91154K21802
$$ 5447992 5607425 5771124 5927985 6089523 6279302 6469250 6654175 6845329 7067131
11270G067131K35589K27344K47621K65048L08166L38812L33665L67267L94713
$$ 7067131 7302720 7530064 7777685 8042733 8350899 8689711 9023376 9390643 9785356
11261I785356M17750M46098M62936M85382N00228M89707L82334K16237J01331
$$ 9785356 10203106 10649204 11112140 11597522 12097750 12587457 12969791 13186028 13287359
11252A3287359L8453o0860r0669j11578j19626j51210j49763j20488o4729n448
$$ 13287359 13325812 13264952 13174283 13062705 12943079 12791869 12642106 12521618 12456889 12451441
11242A2451441K820P0366J51403K06463J93427K10309K04248J70793J23660l8767
$$ 12451441 12454261 12524627 12676030 12882493 13075920 13286229 13490477 13661270 13784930 13746163
11232A3746163j78887k28069k63001l02678l16916l58778l77947l79263l76821
$$ 13746163 13567276 13339207 13076206 12773528 12456612 12097834 11719887 11340624 10963803
11223A0963803l94362l72669k71421k25755j85626j95241j88557r1444m7340r7525
$$ 10963803 10569441 10196772 9925351 9699596 9513970 9318729 9130172 9038728 8991388 8893863
11213H893863m5932k8502J1378L5367J9480O1373R9794J31453R4386R6913R8605
$$ 8893863 8847931 8819429 8830807 8866174 8885654 8947027 9046821 9178274 9272660 9369573 9468178
11202I468178J10450J50551J91521K06775K30962K35671K14754K61698L08363
$$ 9468178 9578628 9729179 9920700 10127475 10358437 10594108 10808862 11070560 11378923
11193A1378923L16820L34306L51339L96611L69360M03164M91592N52907N82786
$$ 11378923 11695743 12030049 12381388 12777999 13147359 13550523 14042115 14595022 15177808
11184A5177808O31211O66016P33395P51678P95134P80378P10177N82659M66738
$$ 15177808 15809019 16475035 17208430 17960108 18755242 19535620 20245797 20828456 21295194
11175B1295194L58388K71577J52051j5161j61267k41189l00780l11239k72809
$$ 21295194 21653582 21925159 22077210 22062049 21900782 21659593 21358813 21047574 20774765
11166B0774765k49319k16282j26805n4100K8587J19966J65404K02181K54646K23847
$$ 20774765 20525446 20309164 20182359 20128259 20156846 20276812 20442216 20644397 20899043 21122890
11156B1122890Q3007n9777j98010l15795l96480m63987o00316o89282p44942q06628
$$ 21122890 21205897 21146120 20948110 20632315 20235835 19771848 19171532 18482250 17737308 16930680
11146A6930680q04788p57477p22079o98017o39397n80340n93964n41909m58326
$$ 16930680 16125892 15368415 14646336 13948319 13308922 12728582 12134618 11592709 11134383
11137A1134383l70859l42723k82656k41389k20441j95907j52125j49121j43769
$$ 11134383 10763524 10420801 10138145 9896756 9676315 9480408 9328283 9179162 9035393
11128I035393j02332p6945q2686p5865n0355n3492l0166k4021q60L774R311L3292
$$ 9035393 8933061 8856116 8773430 8697565 8647210 8593718 8563552 8539531 8538671 8542445 8551756 8585048
11116H585048K0477L3789M4498P1918J03241J13934J05535J38182J68197J99626
$$ 8585048 8605525 8639314 8683812 8755730 8858971 8972905 9078440 9216622 9384819 9584445
11106I584445K04540K18168K75629K79796K63866L41799L24123K92487L11475
$$ 9584445 9788985 10007153 10282782 10562578 10826444 11168243 11492366 11784853 12096328
11097A2096328K87286K43270J37869p09n5748j38945j56811j65230j57623j98745
$$ 12096328 12383614 12626884 12764753 12764044 12708296 12569351 12412540 12247310 12089687 11890942
11087A1890942j85605j68700j52537j20780q0417n8490R450O6555J21802R8730
$$ 11890942 11705337 11536637 11384100 11263320 11182903 11124413 11133863 11200418 11322220 11420950
11077A1420950O6071R4890J4346j16333k19447l00474l54303l72654l76203l85786
$$ 11420950 11487021 11581911 11596257 11479924 11260477 10960003 10605700 10233046 9856843 9471057
11067I471057l86361m19038m13577l87234l58357l27655l36703k91787k61107
$$ 9471057 9084696 8665658 8252081 7864847 7506490 7178835 6842132 6550345 6289238
11058F289238k27041j91091j75768j71150j67305j54740j46646r4441o6102q8622
$$ 6289238 6062197 5871106 5695338 5524188 5356883 5202143 5055497 4961056 4894954 4806332
11048D806332q3504j00374j01440j11430q9613q1451j14213r1168n8626n7871
$$ 4806332 4722828 4622454 4521014 4409584 4319971 4238520 4124307 4033139 3974513 3916642
11038C916642n8960o6319o4784n5148l1076j7077o4380n3768n0481j8565m3490
$$ 3916642 3857682 3791363 3726579 3671431 3640355 3623278 3558898 3505130 3454649 3436084 3392594
11027C392594n0540n7435j6454l2768o0921m7768l6152m4396k6597m1241k9967
$$ 3392594 3342054 3284619 3268165 3235397 3174476 3126708 3090556 3046160 3019563 2978322 2948355
11016B948355k7594l1336k5673l1457k9220J451k3867n9062l7974j9997j3961
$$ 2948355 2920761 2889425 2863752 2832295 2803075 2804526 2780659 2721597 2683623 2663626 2649665
11005B649665j6796l5304n2778k5754r718l948l8369o3358k8265r71j1956m3696
$$ 2649665 2632869 2597565 2544787 2519033 2509315 2505367 2466998 2403640 2375375 2374404 2362448 2318752
10993B318752k2561j921q738j8669n4139l0053m9921k9012O826l202l1821l4043
$$ 2318752 2296191 2294270 2285532 2266863 2212724 2182671 2132750 2103738 2110564 2107362 2075541 2041498
10981B041498o347N709q75q049l1136o709k6868k6848j6248k0265j4290m1641
$$ 2041498 2035151 2040860 2039985 2031936 2000800 1994091 1967223 1940375 1924127 1903862 1889572 1847931
10969A847931j718l353k8328k6908j3483k8020k7631q075o996j9347o624k6371
$$ 1847931 1846213 1842860 1814532 1787624 1774141 1746121 1718490 1710415 1703419 1684072 1677448 1651077
10957A651077k2209o888J3115n950l1406j1649j7536l0553n145n790j3776m250
$$ 1651077 1628868 1621980 1635095 1629145 1597739 1586090 1568554 1538001 1532856 1527066 1513290 1509040
10945A509040j5606P374j695l7319j3255R412k514q225j9697l3207m3106j1165
$$ 1509040 1493434 1500808 1499113 1461794 1448539 1457951 1455437 1447212 1427515 1394308 1351202 1340037
10933A340037k353m5767l53L6578L43m2304k1116Q62O245j4130j3019J1026N92
$$ 1340037 1337684 1291917 1291564 1328142 1328485 1286181 1265065 1265927 1272172 1258042 1245023 1256049 1256641
10920A256641k6282k7960j0857r006j0246J9490L534q906m0553k4189J6753Q961
$$ 1256641 1230359 1202399 1191542 1182536 1172290 1191780 1195314 1186408 1145855 1121666 1138419 1147380
10908A147380j2609l4142l5965j4790l987J2741L410q919K677J277J9440J702
$$ 1147380 1134771 1100629 1064664 1049874 1045887 1058628 1062038 1053119 1055796 1057073 1076513 1078215
10896A078215j5356p172n553J64j4623l8202m73K8605o309j4070k0141l950J3533
$$ 1078215 1062859 1055687 1050134 1050298 1035675 997473 997000 1025605 1019296 1005226 985085 981135 994668
10883I94668j3072J4501K3876j4631r005m989l7625l0694J5970K0246o801O628
$$ 994668 981596 996097 1019973 1005342 996337 991348 953723 923029 938999 959245 952444 959072
10871I59072j4044K625M51J6295j4666k3520O800j3896n003K1272m914j0440l6635
$$ 959072 945028 947653 948104 964399 949733 926213 933013 919117 914114 935386 930472 920032 883397
10858H83397L737J4689R110k859l1600j4587m306M535K4490P820j6746j5330o129
$$ 883397 887134 901823 910933 908074 876474 861887 857581 862116 886606 894426 877680 862350 856221
10845H56221J3781j4152p576J455P825K0577M407q510k5091J7222p232k8185j6083
$$ 856221 870002 855850 848274 849729 857554 878131 882538 874028 848937 866159 858927 830742 814659
10832H14659K4888J1351q663M331L1362p816l0769k805P396q241k6720j0905o462
$$ 814659 839547 850898 842235 846566 877928 870112 839343 836538 843934 835693 808973 798068 791606
10819G91606J6145M3140M466k9237J1854L1343K4239k6226k1530R43M976j8448
$$ 791606 807751 850891 855357 826120 837974 869317 893556 867330 845800 846743 851719 833271
10807H33271j3213m4954j531j783l786J9539K4158J3306J0611j6231j5272N178
$$ 833271 820058 775104 773573 771790 768004 787543 811701 825007 835618 819387 804115 809293
10795H09293K6371o232m0124k621L2784Q347r884K2934K1658n093j1456o4447
$$ 809293 835664 829432 789308 786687 819471 827818 817934 840868 862526 857433 845977 781530
10783G81530m1751K3120L8803J3982n561L7708K2370j1820k8797k1911l636M189
$$ 781530 739779 762899 801702 815684 810123 847831 870201 858381 829584 807673 804037 808226
10771H08226l31J620l3442k6134L1756L6074p254j753J1228j1590j4426j0141
$$ 808226 807895 809515 776073 749939 781695 817769 810515 808762 819990 808400 793974 783833
10759G83833o896j8934k502J2610J546L092L5196M197l2628J0490M604j0762J4798
$$ 783833 776937 758003 755501 768111 769657 772749 807945 812142 779514 790004 794608 783846 798644
10746G98644o590j6596J4834M664M031J1314k0617j3972J644J8285l142l806J841
$$ 798644 792054 775458 790292 794956 798987 810301 789684 775712 777356 795641 792499 788693 790534
10733G90534J6915J701N818N525L835n838J153p783L487J5416K1652J0787P985
$$ 790534 807449 809150 814968 820493 824328 818490 819643 811860 815347 830763 852415 863202 871187
10720H71187M794l350j2842k5912k3159K9333J5550J295j8834j7506J5068q873
$$ 871187 875981 872631 859789 833877 810718 840051 855601 856896 838062 820556 835624 826751
10708H26751j7919J4013M268r19j7307J5018L1671k6992o626o088r268J9822N545
$$ 826751 808832 822845 827113 826194 808887 823905 855576 828584 821958 815870 806602 826424 831969
10695H31969K615o435O110j957K3999r373k6425k1998l840j1871j4420M2620m376
$$ 831969 834584 828149 834259 832302 856301 846928 820503 798505 794665 782794 768374 810994 806618
10682H06618j6982j7871j8922q832K1246J9935O494m105j0963L320p320P089K2374
$$ 806618 789636 771765 752843 744011 765257 785192 791686 787581 776618 779938 772618 779707 802081
10669H02081J1127r503j5371P555N839J3822L612k460k3552o514O397J4205M756
$$ 802081 813208 803705 788334 795889 801728 815550 819162 816702 793150 786636 793033 807238 811994
10656H11994k3295R942j4403j3098J1154J600J1604L0785L3314k9700j2188j2129
$$ 811994 788699 798641 784238 771140 782294 783894 795498 826283 859597 829897 817709 805580
10644H05580O406j7287j0545m49R912J9375K8981K4902j8892j29L018k190K5801
$$ 805580 811986 794699 784154 783705 793617 812992 841973 866875 847983 847854 850872 848682 874483
10631H74483j0450l1528k7687p21M309j2554O889p0k90K8346j2720K185K2456
$$ 874483 864033 832505 804818 804097 808406 795852 802741 802671 802381 830727 818007 820192 842648
10618H42648l79R131K2420M873k1232k9304P615K7026l3120k8693J5102J9208
$$ 842648 842269 851400 873820 878693 857461 828157 835772 862798 829678 800985 816087 835295
10606H35295J3894j5204j8258J5729J1339K8988J7647k9261l4552k7984K2187
$$ 835295 849189 833985 815727 831456 842795 871783 889430 860169 825617 797633 819820
10595H19820J0223L624J5942J3320n620O774l956j3143N311P24p249M1339k7142
$$ 819820 830043 833667 849609 862929 857309 864083 860127 846984 852295 853019 845770 887109 859967
10582H59967j5554j7534N369j427L519J1122j7977l226k732r56J8608J5148o929
$$ 859967 844413 826879 832248 830821 834340 845462 827485 824259 821527 820571 839179 854327 847398
10569H47398N725o84K6278J2030l407R83k2291j3074R607M767j9618n134J5308
$$ 847398 853123 852439 878717 890747 887340 888323 866032 852958 862565 867332 847714 842580 857888
10556H57888K234k1040P385J8551K2182J2251K343k412k112J4390m185k87k1279
$$ 857888 860122 839082 846467 865018 887200 899451 901794 899382 897270 911660 907475 907188 885909
10543H85909J8754K0574j850m388k7839k7139j9665m304J4146K2006J1219j2871
$$ 885909 904663 925237 923387 918999 891160 864021 844356 840052 854198 876204 887423 874552
10531H74552Q312k2299l468Q349K6779J4644J7174N740N029j2864j2988j04K9008
$$ 874552 882864 860565 857097 865446 892225 906869 924043 929783 934812 921948 908960 908856 937864
10518I37864K4607O163k4698p377R982j1287K161n936j8406J2703J9373L688l43
$$ 937864 962471 968634 943936 936559 946541 935254 937415 931479 913073 925776 945149 948837 948494
10505I48494O409J6260K5716J4485o727O305J1538k5856J2422l87k1950r485J8537
$$ 948494 954903 971163 996879 1011364 1004637 1010942 1022480 996624 1009046 1008659 986709 977224 995761
10492I95761J0993j5045l653n500j937L527J8450J0809J0063N841m228J0435Q255
$$ 995761 1006754 991709 988056 982556 980619 984146 1002596 1013405 1023468 1029309 1025081 1035516 1043771
10479A043771K9639K0461p492l6879R611J7427p756k4430Q411K5677J1284J4230
$$ 1043771 1073410 1093871 1086379 1049500 1059111 1076538 1068782 1044352 1052763 1078440 1089724 1103954
10467A103954L760p96K2255K5365N782L449p867l949N859J3035R305j2786J5405
$$ 1103954 1107714 1106918 1129173 1154538 1160320 1163769 1155902 1151953 1157812 1170847 1180152 1167366 1182771
10454A182771J5232j7485k0945J6727J985R544L2266N358n439R662j1758o506
$$ 1182771 1198003 1180518 1159573 1176300 1178285 1187829 1220095 1225453 1220014 1229676 1217918 1211412
10442A211412J749O46j5473J7936n36O027J8158K9237K2223J119K7440L0534K4882
$$ 1211412 1213161 1213807 1198334 1216270 1215734 1221761 1239919 1269156 1291379 1292498 1319938 1350472 1375354
10429A375354k2602j7975Q525L3991J2951n88l240J1942R760K9341J9631K5189
$$ 1375354 1352752 1334777 1343302 1377293 1390244 1389656 1386416 1398358 1408118 1437459 1457090 1482279
10417A482279K7807R312M279K888q819J3641J3967L6237J6922J1820J4301j3209
$$ 1482279 1510086 1519398 1523677 1526565 1517746 1531387 1545354 1581591 1598513 1610333 1624634 1611425
10405A611425k5048k478J1355K2501K8708L2090L3666J1674O609L5233K5330Q370
$$ 1611425 1586377 1583899 1595254 1617755 1646463 1678553 1712219 1723893 1730502 1765735 1791065 1799435
10393A799435Q52R279R067K6626J4821J4203L2958L0045L8844M2016K3370J8332
$$ 1799435 1800287 1809566 1818633 1845259 1860080 1874283 1907241 1937286 1976130 2018146 2041516 2059848
10381B059848J9955K4169N2699K6484L7382K4211L8384L5563N1707L2843J0181
$$ 2059848 2079803 2103972 2156671 2183155 2220537 2244748 2283132 2318695 2370402 2403245 2413426
10370B413426N5547Q1055L9818N0925N6411N6692O9941M8192P6667R6247Q5063
$$ 2413426 2468973 2550028 2589846 2640771 2697182 2753874 2823815 2872007 2948674 3044921 3129984
10359C129984M1390O3817O9985J24348J02272P0554J35614J31983J47555J26832
$$ 3129984 3171374 3235191 3305176 3429524 3531796 3602350 3737964 3869947 4017502 4144334
10349D144334J24195R1077O7232J3268K0297J5973J3417j5900k503J6047K2034
$$ 4144334 4268529 4359606 4426838 4440106 4460403 4476376 4489793 4473893 4471390 4487437 4509471
10338D509471M2886M5566P1388N5211J14802J31637J28426Q4810J32550J96472
$$ 4509471 4552357 4597923 4669311 4724522 4839324 4970961 5099387 5184197 5316747 5513219
10328E513219J62081J41895J77791J60556Q8540K9068j7957j01143q6444j13262
$$ 5513219 5675300 5817195 5994986 6155542 6244082 6273150 6255193 6154050 6067606 5954344
10318E954344j23170q8264j02670j06590r4036p5045n6000j6211M075J3195J5024
$$ 5954344 5831174 5742910 5640240 5533650 5439614 5364569 5308569 5292358 5296433 5309628 5324652
10307E324652M2761Q3102J21186R5232J15824R1802J01267R1443N9745K3337J8089
$$ 5324652 5367413 5450515 5571701 5666933 5782757 5874559 5975826 6067269 6127014 6150351 6168440
10296F168440J9216k609k9390K7724K1408j9329j3272K4824P2615J02345J09493
$$ 6168440 6187656 6185047 6155657 6183381 6204789 6185460 6172188 6197012 6269627 6371972 6481465
10285F481465J38377J70200J91277K02800K37544K35464K04452K08166J36591
$$ 6481465 6619842 6790042 6981319 7184119 7421663 7657127 7861579 8069745 8206336
10276H206336P4634K5081j2607m6863m1107m3283m0229l2550J8279J0097L1262
$$ 8206336 8280970 8306051 8293444 8246581 8205474 8162191 8121962 8089412 8107691 8117788 8149050
10265H149050P5453O6341J15509J64105J98181K37738L00813L22695L97530M11789
$$ 8149050 8224503 8290844 8406353 8570458 8768639 9006377 9307190 9629885 10027415 10439204
10255A0439204L51607K65581J57303K3787j15098k29777k94414k64974k90580
$$ 10439204 10790811 11056392 11213695 11237482 11122384 10892607 10598193 10333219 10042639
10246A0042639l10163l43767l39148k65037k47911k47101j84385j18229p8536
$$ 10042639 9732476 9388709 9049561 8784524 8536613 8289512 8105127 7986898 7908362
10237G908362k3379R039L0409P8373P8386J26266J20943R1595O7632j1479j02886
$$ 7908362 7884983 7894022 7924431 8002804 8081190 8207456 8328399 8419994 8487626 8476147 8373261
10226H373261j43308j95609j91126j63856j79780k01430j87424j74435j79619
$$ 8373261 8229953 8034344 7843218 7679362 7499582 7298152 7110728 6936293 6756674
10217F756674j20100q6748q7686o2942p8965j2277L4090O5448Q2236Q2569L7757
$$ 6756674 6636574 6549826 6462140 6399198 6320233 6307956 6342046 6407494 6489730 6572299 6610056
10206F610056K4791K0402j8183m8228o4083n2080l7538n2844n8741m2609l2897
$$ 6610056 6634847 6655249 6637066 6588838 6524755 6472675 6435137 6382293 6323552 6280943 6248046
10195F248046p5256k9130j098L8513O5324P1407P9287J47394J83756J74180K04213
$$ 6248046 6172790 6143660 6142562 6181075 6246399 6317806 6397093 6544487 6728243 6902423 7106636
10184G106636K25923J59031R2410K8592o6520j33356j76891k12753k41178k28280
$$ 7106636 7332559 7491590 7584000 7612592 7546072 7412716 7235825 7023072 6781894 6553614
10174F553614k06830j95102j97396j98781j55612j42189r6992o2714n4711l5388
$$ 6553614 6346784 6151682 5954286 5755505 5599893 5457704 5360712 5297998 5243287 5207899
10164E207899k7108l704L4951M1651J8869Q85J9704j7678o4844j28309j16554
$$ 5207899 5180791 5177087 5212038 5253689 5272558 5273443 5293147 5275469 5210625 5082316 4965762
10153D965762j42951j65354j51719j46626j57202j46738j53907j61772j24412
$$ 4965762 4822811 4657457 4505738 4359112 4201910 4055172 3901265 3739493 3615081
10144C615081j31391j39247j18005o3687n5526n4325m7886j04187r5031l3291
$$ 3615081 3483690 3344443 3226438 3162751 3107225 3052900 3005014 2900827 2805796 2772505
10134B772505k4605m5937p0118m2798j3067k6642l5969k0091m0601j0541j9462
$$ 2772505 2747900 2701963 2631845 2589047 2575980 2549338 2513369 2493278 2452677 2442136 2422674
10123B422674k3223n2449l0589k5836j0069k0356k9818m3187j3297K85J182k9241
$$ 2422674 2399451 2347002 2316413 2290577 2280508 2260152 2230334 2187147 2173850 2174135 2175317 2146076
10111B146076K609k9765l0820k2074j825j4078j0332l8371l4513k4716M921M692
$$ 2146076 2148685 2118920 2088100 2066026 2064201 2050123 2039791 2001420 1966907 1942191 1947112 1951804
10099A951804J7748l3690k3683j6021l534O252q069m0288k1792j4496o452N424
$$ 1951804 1969552 1935862 1912179 1896158 1892624 1898876 1890807 1850519 1828727 1814231 1807779 1813203
10087A813203j1625m0981j5837k4923J0146j7664j8693k575Q537j2259J2367j0234
$$ 1813203 1801578 1760597 1744760 1719837 1729983 1712319 1693626 1691051 1699588 1687329 1699696 1689462
10075A689462j9741J230n375j1976J8240l3681k5065P585J3604k1867j1307j1347
$$ 1689462 1669721 1670951 1665576 1653600 1671840 1638159 1613094 1620679 1634283 1612416 1601109 1589762
10063A589762k4551j2439K1239o080J754j2964o030J6675J5212k2463o652m585
$$ 1589762 1565211 1552772 1574011 1567931 1569685 1556721 1550691 1567366 1582578 1560115 1553463 1548878
10051A548878k1101k1833P93L718q520J353k2730K969K5845N573q091k4074j9378
$$ 1548878 1527777 1505944 1506737 1510455 1501935 1503288 1480558 1483527 1509372 1514945 1506854 1482780 1463402
10038A463402j6280P677N229n597R739k1813j7240N069L270J5406M584j6910l7476
$$ 1463402 1447122 1454799 1460028 1454431 1464170 1442357 1425117 1430186 1433456 1448862 1453446 1436536 1399060
10025A399060k7226l464L262K4859K1068m85J9644J5224N114j6424j4264j5970
$$ 1399060 1371834 1368370 1371632 1396491 1417559 1417074 1436718 1451942 1457056 1440632 1426368 1410398
10013A410398l8179j6894J4460K7241J324k4556o268l1297K204J6467l630j6071
$$ 1410398 1372219 1355325 1369785 1397026 1398350 1373794 1367526 1336229 1338433 1354900 1351270 1335199
10001A335199M293o618j4156n004J984j699k394M231j333j1833J4648J2216k0501
$$ 1335199 1339492 1332874 1318718 1313714 1315698 1313999 1311605 1315836 1314503 1302670 1317318 1329534 1309033
9988A309033j7219n855L3909J6018j195l323J1487n752l1962O097L307L8796o209
$$ 1309033 1291814 1285959 1319868 1335886 1334691 1331368 1342855 1337103 1305141 1311238 1314545 1353341 1347132
9975A347132M250j0956j3459q433l467K2578L0403l3563K109J7039O759M4584
$$ 1347132 1351382 1340426 1326967 1318534 1315067 1337645 1368048 1334485 1336594 1353633 1360392 1404976
9963A404976j7361k0103J2812o33r793J2542L8993J1871k7858j2380j9249o920
$$ 1404976 1387615 1367512 1380324 1379691 1369898 1382440 1421433 1433304 1405446 1393066 1373817 1366897
9951A366897j5622J1413K7770L1890k5108j5738N4855J9879n570l06K6473R574
$$ 1366897 1351275 1362688 1390458 1422348 1397240 1381502 1436357 1456236 1450666 1450360 1476833 1486407
9939A486407r332R421J6711k688J4161k7635l54K6319M814j2511n799n472m501
$$ 1486407 1477075 1486496 1503207 1500519 1514680 1487045 1486691 1513010 1517824 1505313 1499514 1494042 1489541
9926A489541j3996l745K6960N718K0301L2526P282q63l570q018p31J0695J7731
$$ 1489541 1475545 1471800 1498760 1504478 1524779 1557305 1564587 1563724 1560154 1552136 1551405 1562100 1579831
9913A579831K1152q6R533J6597J9126P45R842K5019J7592n480q248l899M6454
$$ 1579831 1600983 1600897 1610430 1627027 1646153 1646898 1656740 1681759 1699351 1693871 1685623 1681724 1728178
9900A728178M0406J4824k0419k899L3975O035N472m622J2976J5008L0051L795
$$ 1728178 1768584 1783408 1762989 1760090 1794065 1800100 1805572 1800950 1813926 1828934 1858985 1862780
9888A862780K652O034P787J7223K3609j0563J76R935Q746j8492j4387J3885L0806
$$ 1862780 1865432 1871466 1879253 1896476 1920085 1909522 1909698 1919633 1928379 1909887 1895500 1909385 1940191
9875A940191m975k3354k2986L855M2283L9522l167L6950L7403J0867J132J5851
$$ 1940191 1935216 1911862 1888876 1892731 1935014 1974536 1971369 2008319 2045722 2056589 2057721 2073572
9863B073572L8638j3738k0515Q212L2717J5409o998K7016L9585J0219j7317K2575
$$ 2073572 2112210 2098472 2077957 2086169 2118886 2134295 2127297 2154313 2193898 2204117 2186800 2209375
9851B209375P794O735J7953L3807N2771K0383j834L819J6653L869K1004L4083
$$ 2209375 2217169 2223904 2241857 2275664 2328435 2348818 2346984 2350803 2367456 2371325 2392329 2426412
9839B426412N157j1787L0670M6307L8365K936J2191K2619J6696J7154K894J9730
$$ 2426412 2431569 2419782 2450452 2496759 2535124 2538060 2550251 2572870 2589566 2606720 2609614 2629344
9827B629344K3572M5166L766J4272L7286L1170K4745L0084K6691K3815K3473J5963
$$ 2629344 2652916 2698082 2701848 2716120 2753406 2784576 2809321 2839405 2866096 2889911 2913384 2929347
9815B929347K1053J7526L9240M3876M4533L7007K5253M1445N0814J7604J4645
$$ 2929347 2950400 2967926 3007166 3051042 3095575 3132582 3157835 3199280 3250094 3267698 3282343
9804C282343N1441N7538J1975K7098N9589Q0905L7378R156L1508O3858R5901Q1052
$$ 3282343 3333784 3391322 3403297 3430395 3489984 3570889 3608267 3617423 3648931 3712789 3808690 3889742
9792C889742O9381P7608L7176K7824O5691O1033P3939Q2152Q5821J01526P8758
$$ 3889742 3959123 4036731 4073907 4101731 4167422 4228455 4302394 4384546 4470367 4571893 4650651
9781D650651J20338R7750P6487O6347R4873J32597J27447J13020J15296R9797
$$ 4650651 4770989 4868739 4945226 5011573 5106446 5239043 5366490 5479510 5594806 5694603
9771E694603J22135J30551J87518J55290J28407J72921J64229J73031K22863K29265
$$ 5694603 5816738 5947289 6134807 6290097 6418504 6591425 6755654 6928685 7151548 7380813
9761G380813K24897K22938K10253K02447K16083K06105J99355K13975K07617K28129
$$ 7380813 7605710 7828648 8038901 8241348 8457431 8663536 8862891 9076866 9284483 9512612
9751I512612J98188K05072K03587J87267J80006J60325J99411K02369K10222K31442
$$ 9512612 9710800 9915872 10119459 10306726 10486732 10647057 10846468 11048837 11259059 11490501
9741A1490501K32886K51021K60379K48030K51419K96779K76979K42384K50760
$$ 11490501 11723387 11974408 12234787 12482817 12734236 13031015 13307994 13550378 13801138
9732A3801138K25505J86715J22732J02338J04724P2854M4401L7177J5729p255
$$ 13801138 14026643 14213358 14336090 14438428 14543152 14616006 14660407 14697584 14713313 14706058
9722A4706058j6232j1606m903k2438l3860ml539K7330M0688K8851L9320K1272
$$ 14706058 14689826 14678220 14673317 14650879 14617019 14617015 14613476 14640806 14681494 14710345 14749665 14770937
9710A4770937j7850k0388j1892r173o3505n7630j13991j37386j37660j19152j48272
$$ 14770937 14753087 14732699 14720807 14711634 14648129 14590499 14476508 14339122 14201462 14082310 13934038
9699A3934038j40056j72426k39975k16118j90580j46464j45412j25238j11778
$$ 13934038 13793982 13621556 13381581 13165463 12974883 12828419 12683007 12557769 12445991
9690A2445991r9447p6055j05384j01281m8867l1947m6207l7685j6323K2105N0907
$$ 12445991 12346544 12270489 12165105 12063824 12014957 11983010 11936803 11899118 11882795 11904900 11955807
9679A1955807J3112L3000J9322N3136P4794Q4673Q3666P5055Q8074J55102J64420
$$ 11955807 11968919 12001919 12021241 12074377 12149171 12233844 12317510 12392565 12480639 12635741 12800161
9668A2800161J52809J50372J72234J66729J67648J78662K31557J87389J95078
$$ 12800161 12952970 13103342 13275576 13442305 13609953 13788615 14020172 14207561 14402639
9659A4402639K08382K08854J88824K07717K19203K30809K15258K35948K24689
$$ 14402639 14611021 14819875 15008699 15216416 15435619 15666428 15881686 16117634 16342323
9650A6342323K69213K61429K69733K84269L00436L06776L05339K95532K47867
$$ 16342323 16611536 16872965 17142698 17426967 17727403 18034179 18339518 18635050 18882917
9641A8882917K21178K35981K04428J66823J26117R3286K8371q137k3457n6893
$$ 18882917 19104095 19340076 19544504 19711327 19837444 19930730 19959101 19950964 19927507 19870614
9631A9870614j09015j40415j54769j37532j24496j15530j30405r4936p0501p7260
$$ 19870614 19761599 19621184 19466415 19328883 19204387 19088857 18958452 18863516 18793015 18715755
9621A8715755q4038q7259p2332j07421j35512j54276j54241j68159j93782k22609
$$ 18715755 18631717 18544458 18472126 18364705 18229193 18074917 17920676 17752517 17558735 17336126
9611A7336126k71708l11502l60813l97574m13023m28439m53660m34461m20415
$$ 17336126 17064418 16752916 16392103 15994529 15581506 15153067 14699407 14264946 13844531
9602A3844531l91283l96828l46070l20646l07213l26124k94984k97320l12265
$$ 13844531 13453248 13056420 12710350 12389704 12082491 11756367 11461383 11164063 10851798
9593A0851798k40685k41577k50805k62673k67249k35173k45414k36514k37973
$$ 10851798 10611113 10369536 10118731 9856058 9588809 9353636 9108222 8871708 8633735
9584H633735k65015k59424k28325k30144k24120k06441k14906k27555k13627j81691
$$ 8633735 8368720 8109296 7880971 7650827 7426707 7220266 7005360 6777805 6564178 6382487
9574F382487j58049j29882j54731j55056r9305j27921j14512r2025j24931j05741
$$ 6382487 6224438 6094556 5939825 5784769 5685464 5557543 5443031 5351006 5226075 5120334
9564E120334p7570o4749n9970q2526q0241o9274m6943o9684p4838n6825m6581
$$ 5120334 5042764 4978015 4918045 4835519 4755278 4686004 4639061 4569377 4494539 4437714 4391133
9553D391133l4164o3031p1610l9885m8657n1960l1953k6192o4060o0681m7980
$$ 4391133 4356969 4293938 4222328 4182443 4133786 4081826 4049873 4023681 3959621 3898940 3850960
9542C850960j2515l3951n4720l6187m0596l7925l6497k6345m2654n4731l1481
$$ 3850960 3838445 3804494 3749774 3713587 3672991 3635066 3598569 3572224 3529570 3474839 3443358
9531C443358k8623n0393l9275p897l7855n6066j9023r590j4256j8689l4718m4352
$$ 3443358 3414735 3364342 3325067 3317170 3279315 3223249 3204226 3194636 3180380 3161691 3126973 3082621
9519C082621m6892j9836l8827l6167n9819l3890k90j3319l6272j0608l0530M105
$$ 3082621 3035729 3015893 2977066 2940899 2881080 2847190 2846900 2833581 2797309 2786701 2756171 2760276
9507B760276m322l3753l2875k5696k3012m4707k8664P23l4693k0245l3588J2192
$$ 2760276 2755954 2722201 2689326 2663630 2640618 2595911 2567247 2567970 2533277 2513032 2479444 2491636
9495B491636L491l1941k2737Q491j2994l7670o314k0215k6767j9333P858o152
$$ 2491636 2495127 2463186 2440449 2448940 2435946 2398276 2391962 2371747 2344980 2325647 2333505 2327353
9483B327353k2515j8402j0244q882k7626l8406q799p320j2375O793M523q307k8363
$$ 2327353 2304838 2286436 2276192 2267310 2239684 2201278 2192479 2185159 2172784 2179577 2184100 2175793 2147430
9470B147430l2627l971k781j3694k8480j9123r927k1367L7792j1110K841N592
$$ 2147430 2114803 2110832 2108051 2094357 2065877 2046754 2036827 2015460 2053252 2042142 2044983 2050575
9458B050575q240o597k0228j1960l2861q754J6676J935K3293J0930l1759k1514
$$ 2050575 2042335 2035738 2015510 2003550 1970689 1961935 1978611 1980546 2003839 2014769 1983010 1961496
9446A961496k0013l236J840P021K5082r193j4970J6180J6378M942N039j2406j7507
$$ 1961496 1941483 1938247 1940087 1947108 1972190 1962997 1948027 1964207 1980585 1985527 1990566 1978160 1960653
9433A960653p379j0896n587K1375N1356J4068k4635O44J2893n423l641R090k2235
$$ 1960653 1953274 1942378 1936791 1958166 2009522 2023590 1998955 1999599 2012492 2007069 2003428 2012518 1990283
9420A990283k8938m202L4980L7450K4197j548o217P406j487R567M061O881J514
$$ 1990283 1961345 1957143 1992123 2029573 2053770 2052222 2046005 2053411 2051924 2061491 2065552 2072433 2073947
9407B073947j7057m683L8936J0950r573J213P751K136R622r551o662K4605L4465
$$ 2073947 2056890 2052207 2091143 2102093 2092520 2093733 2101484 2103620 2113242 2103691 2097029 2121634 2156099
9394B156099M1813J0085K3906j7617O960K0276J783K7321J7451n683J2126K3063
$$ 2156099 2197912 2207997 2231903 2214286 2221246 2241522 2243305 2270626 2288077 2282394 2294520 2317583
9382B317583K3128J4019M6498J5032L3216O0817K0691q072K1759J9151Q125L8796
$$ 2317583 2340711 2354730 2401228 2416260 2449476 2510293 2530984 2522912 2544671 2563822 2571947 2610743
9370B610743L1887L0339K2118K3965K5963L6345J8141r13N2527N9716M0992N5019
$$ 2610743 2642630 2672969 2695087 2719052 2745015 2781360 2799501 2798588 2851115 2910831 2951823 3006842
9358C006842N5736K2539J7676P5465M7419K4770N8767L9290M9478N5959N5846
$$ 3006842 3062578 3085117 3102793 3178258 3225677 3250447 3309214 3348504 3397982 3453941 3509787
9347C509787O8253P5296P4621L5633P0810M6259M4194J14429J62092J04029O8566
$$ 3509787 3578040 3653336 3727957 3763590 3834400 3880659 3924853 4039282 4201374 4305403 4373969
9336D373969Q2874R1238R5909J02700J29456J54968J18675P7533J36311K04806
$$ 4373969 4456843 4548081 4643990 4746690 4876146 5031114 5149789 5227322 5363633 5568439
9326E568439K08309J82984J97768K05906K17006K18982K47524K60185K48366K44186
$$ 5568439 5776748 5959732 6157500 6363406 6580412 6799394 7046918 7307103 7555469 7799655
9316G799655K52894K41293K13553J68715N4479j3912l9197n5508q4636j04686
$$ 7799655 8052549 8293842 8507395 8676110 8730589 8716677 8677480 8621972 8537336 8432650
9306H432650j14820r1374q7564r8138r8862m5749m2225J5393K5805O2392J06318
$$ 8432650 8317830 8226456 8138892 8040754 7941892 7896143 7853918 7869311 7895116 7957508 8063826
9295H063826J38360J46552J58752J55378J47672J54854J41860P5133N1538k2886
$$ 8063826 8202186 8348738 8507490 8662868 8810540 8965394 9107254 9182387 9233925 9211039
9285I211039o1292n2141j15948j13667j42148j56328j55168j64491j88495j21905
$$ 9211039 9149747 9097606 8981658 8867991 8725843 8569515 8414347 8249856 8061361 7939456
9275G939456q8956r0133q8926l0234k9961m1726j8622J0933K4451N5336R6202
$$ 7939456 7850500 7760367 7671441 7641207 7611246 7569520 7550898 7561831 7586282 7641618 7737820
9264G737820J06351J29499J43592J40808J60022J42816J38921J99582J99133J82662
$$ 7737820 7844171 7973670 8117262 8258070 8418092 8560908 8699829 8899411 9098544 9281206
9254I281206K39659K83298K66490K62399L29594L66897L81208L88092L83750M34694
$$ 9281206 9520865 9804163 10070653 10333052 10662646 11029543 11410751 11798843 12182593 12617287
9244A2617287M41915M34446L91836L20371K39857J79464J83466J47680Q6042K6910
$$ 12617287 13059202 13493648 13885484 14205855 14445712 14625176 14808642 14956322 15042364 15069274
9234A5069274n4813n7225j4811M259l2030k7502j7575J4386M8078R8472J14803
$$ 15069274 15014461 14957236 14942425 14946684 14914654 14887152 14869577 14883963 14932041 15030513 15145316
9223A5145316J65003J94471J96301J90527J55996J06901Q4732O4168l2650n1575
$$ 15145316 15310319 15504790 15701091 15891618 16047614 16154515 16239247 16303415 16270765 16219190
9213A6219190p2845j00427j57074k61592k88270l30948l83192l88000l52930l13804
$$ 16219190 16146345 16045918 15888844 15627252 15338982 15008034 14624842 14236842 13883912 13570108
9203A3570108l11731k96339k96997k49452k33945k12060j52252j50375j23804
$$ 13570108 13258377 12962038 12665041 12415589 12181644 11969584 11817332 11666957 11543153
9194A1543153j49076j88526j94937j95881j87128j61197j48349j73135j63773
$$ 11543153 11394077 11205551 11010614 10814733 10627605 10466408 10318059 10144924 9981151
9185I981151j52614j24992r1276m2267m2034q935j6446j0777L4726J04572J13560
$$ 9981151 9828537 9703545 9612269 9570002 9527968 9519033 9502587 9491810 9526536 9631108 9744668
9174I744668J27200J61408J82975J56743J96376K37467K17991K19005J81253J56819
$$ 9744668 9871868 10033276 10216251 10372994 10569370 10806837 11024828 11243833 11425086 11581905
9164A1581905J21593R5620R5596Q7898P2969P1942N4887M0615O4008R0476R9906
$$ 11581905 11703498 11799118 11894714 11982612 12055581 12127523 12182410 12223025 12287033 12377509 12477415
9153A2477415J28724J60179J97486J98225J92591J42269J21089Q9827R3346N2971
$$ 12477415 12606139 12766318 12963804 13162029 13354620 13496889 13617978 13707805 13801151 13854122
9143A3854122K5523q271k0628n1641j46985k14345k45726k91493k52197k64616
$$ 13854122 13879645 13871374 13850746 13799105 13652120 13437775 13192049 12900556 12648359 12383743
9133A2383743k73484k37295k26649k23957j69363j47172j30403r2903q2817o6376
$$ 12383743 12110259 11872964 11646315 11422358 11252995 11105823 10975420 10882517 10799700 10733324
9123A0733324o2168j03552j21118j32466j72443j92878k38794k86211k86455l06286
$$ 10733324 10671156 10567604 10446486 10314020 10141577 9948699 9709905 9423694 9137239 8830953
9113H830953l29953l24673l01667k99229k74706k77655k70479k44042k21933k04445
$$ 8830953 8501000 8176327 7874660 7575431 7300725 7023070 6752591 6508549 6286616 6082171
9103F082171j71875j44034j34204j19975j02192p1169p8327q0347m9421m3807
$$ 6082171 5910296 5766262 5632058 5512083 5409891 5338722 5260395 5180048 5130627 5086820
9093E086820m2567l6178j6125j0824K0693r33k4690k1881M5432N7720M6700M3053
$$ 5086820 5044253 5008075 4991950 4981126 5001819 5000886 4976196 4954315 4999747 5057467 5104167 5147220
9081E147220M2246L5124J04144J07210J02958N7414N0008J4640M5833N1955J1384
$$ 5147220 5189466 5224590 5328734 5435944 5538902 5596316 5646324 5660964 5706797 5758752 5770136
9070E770136l2144n8671r3632j03204j00378j27777j33642j30498j31864q6242
$$ 5770136 5737992 5679321 5585689 5482485 5382107 5254330 5120688 4990190 4858326 4772084
9060D772084o3195n7684n0787o6931n4940j583N6059M5577K1861K6858K3887M0807
$$ 4772084 4708889 4651205 4600418 4533487 4478547 4476964 4533023 4578600 4600461 4627319 4651206 4692013
9048D692013K7014R638l8947q6339j01522j45664j27076j29411j46900j43618
$$ 4692013 4719027 4728665 4689718 4603379 4501857 4356193 4229117 4099706 3952806 3809188
9038C809188j40040j46079j86535j82936j64148j35285j29802j04217j17194j14141
$$ 3809188 3669148 3523069 3336534 3153598 2989450 2854165 2724363 2620146 2502952 2388811
9028B388811o0767k0913n3554p1604o7984n3550l9154m1255p2117k5627l6383
$$ 2388811 2328044 2307131 2253577 2181973 2113989 2060439 2021285 1980030 1907913 1882286 1845903
9017A845903k8903k3145n3710p3498n0290k2548N65j3997k3781n9321m2473K000
$$ 1845903 1817000 1793855 1740145 1666647 1616357 1593809 1594374 1580377 1556596 1497275 1454802 1456802
9005A456802j658j4319l1034l1151j0452k5857l8104l9174k1738l4912j4937k4544
$$ 1456802 1455144 1440825 1409791 1378640 1368188 1342331 1304227 1265053 1243315 1208403 1193466 1168922
8993A168922k7942k4921J396l5136j7508k575o805m2753o6941q099J4781Q066
$$ 1168922 1140980 1116059 1117455 1082319 1064811 1062236 1055431 1012678 945737 937638 952419 960485
8981I60485J9603k4931k8000j7313Q598N387k7185k4076j4051l1444j5951J8250
$$ 960485 980088 955157 927157 909844 918442 923829 896644 872568 858517 827073 811122 829372
8969H29372J9598k4825k8015q708r024m3055k4041J1318j2361n747r307K753k6672
$$ 829372 848970 824145 796130 787422 778398 735343 711302 722620 710259 704512 695205 697958 671286
8956F71286p907J2399k1449j1791j6631j6625j7288L042r411l1416p543R220j1651
$$ 671286 663379 675778 654329 642538 625907 609282 591994 595036 585625 554209 546666 555886 544235
8943E44235j2672K9l0048n025k0886j2118R708k363j5832l1324J298m403j3411
$$ 544235 531563 531592 501544 496519 475633 463515 473223 470860 455028 423704 425002 420599 407188
8930D07188k9715l2973p28R998M497K1566j3792m2991l0930R148L8830l125n400
$$ 407188 377473 344500 343772 353770 358267 379833 366041 323050 292120 301268 340098 336973 331573
8917C31573R466K8351l0185j0390k2220k9737o759J8370K0831r936j6338N361
$$ 331573 341039 369390 339205 328815 306595 276858 270099 288469 309300 299364 283026 288387
8905B88387K4652K559l1408K095J1481j0932j8256L495m489j0101j7322m668j1220
$$ 288387 313039 315598 284190 286285 297766 286834 268578 272073 267584 257483 240161 235493 224273
8892B24273j553J9582K3759j628l3818q755o772O755j4725R30J3198R736k0326
$$ 224273 222720 242302 266061 264433 230615 221860 215088 221843 207118 208048 221246 230982 210656
8879B10656j8378K731l13P216l902k2112j833N924j2719l7463J3340J0691K0869
$$ 210656 192278 195009 194696 201912 198010 175898 174065 179989 167270 129807 143147 153838 174707
8866A74707J2428J3296j9147m3674j3267l798N634l223L2868k1598o897j9337
$$ 174707 187135 200431 181284 137610 124343 120545 126179 122956 155824 134226 127329 107992
8854A07992J0198J5192K2245o81j7065j0117P752j3518j6800J1644K248k6555
$$ 107992 118190 133382 155627 154946 137881 127764 135516 121998 105198 116842 119090 92535
8842I2535J2031Q908K1406J1959K214Q144L426k8262j4252n928L5484K0015J7123
$$ 92535 104566 113474 134880 146839 149053 157197 160623 132361 118109 112181 147665 167680 184803
8829A84803l5024k6116k807J2921J94k4591j7062K5540L1498k453k1531L643r020
$$ 184803 149779 123663 120856 133777 133971 109380 92318 117858 149356 146903 125372 129015 119995
8816A19995J967j8232j6986J2326O135O10J412j0370L103J1747R830J0946k1371
$$ 119995 121962 103730 86744 99070 105205 105815 107227 96857 99960 111707 121537 132483 111112
8803A11112j6825K6690J0878j3716J4337J9701k1990j1207k061p9k5982p593J4346
$$ 111112 94287 120977 131855 118139 132476 152177 130187 118980 116919 116840 90858 83265 97611
8790I7611o461Q764K828k1941l6939j7289J9955K4191r346j6042m752M554J2261
$$ 97611 91150 99914 102742 80801 43862 26573 46528 70719 61373 45331 40579 45133 57394
$$ [...]
##END NTUPLES=NMR SPECTRUM
##END=
