##TITLE=Analysis number 327363
Compound Code sb 00741
Book Reference 22021
Project Code adrs flro3
Chemist Name jom
##JCAMPDX= 6.0         $$ Bruker NMR JCAMP-DX V2.0
##DATA TYPE= NMR SPECTRUM
##DATA CLASS= NTUPLES
##ORIGIN= Bruker BioSpin GmbH
##OWNER= nmr
$$ XWIN-NMR		Version 3.5
$$ Thu Mar 22 13:10:09 2007 GMT Standard Time (UT+0h)  MAYBRIDGE\nmr@NMR_250MHZ
##.OBSERVE FREQUENCY= 250.131544655141
##.OBSERVE NUCLEUS= ^1H
##.ACQUISITION MODE= SIMULTANEOUS (DQD)
##.ACQUISITION SCHEME= undefined
##.AVERAGES= 16
##.DIGITISER RES= 18
##SPECTROMETER/DATA SYSTEM= dpx250
##.PULSE SEQUENCE= zg30
##.SOLVENT NAME= DMSO
##.SHIFT REFERENCE= (INTERNAL, DMSO, 0, 16.522)
##AUDIT TRAIL= $$ (NUMBER, WHEN, WHO, WHERE, WHAT)
$$ ##TITLE= Audit trail, XWIN-NMR		Version 3.5
$$ ##JCAMPDX= 5.01
$$ ##ORIGIN= Bruker BioSpin GmbH
$$ ##OWNER= nmr
$$ C:\u/data/dgb/nmr/ADRS/1710/pdata/1/auditp.txt
$$ ##AUDIT TRAIL=  $$ (NUMBER, WHEN, WHO, WHERE, WHAT)
(   1,<2007-03-22 13:09:44.00 +000>,<MAYBRIDGE\nmr>,<NMR_250MHZ>,
      <created by zg, POWCHK disabled, PULCHK disabled
       configuration hash MD5:
       49 4B E0 1D 92 C2 6B 37 9F E6 65 BC 52 41 86 1D
       data hash MD5: 64K
       F8 74 DE 1E 0C C8 E3 DF 90 B4 DC 5D 53 20 F9 18>)
(   2,<2007-03-22 13:09:59.99 +000>,<MAYBRIDGE\nmr>,<NMR_250MHZ>,
      <Start of raw data processing
       ef LB = 0.3 FT_mod = 6 PKNL = 1 SI = 32K 
       data hash MD5: 32K
       1C 77 09 A6 EA AB 44 BF AF 27 78 9E 79 D9 33 B1>)
(   3,<2007-03-22 13:10:01.64 +000>,<MAYBRIDGE\nmr>,<NMR_250MHZ>,
      <apk 
       data hash MD5: 32K
       AE 40 9E D1 59 64 9F 92 EF ED 7A 75 E5 A4 3D 2A>)
(   4,<2007-03-22 13:10:02.50 +000>,<MAYBRIDGE\nmr>,<NMR_250MHZ>,
      <abs ABSG = 5 
       data hash MD5: 32K
       5D 8C 4A 15 1E FF 28 A0 B1 15 6C 9F D9 21 98 88>)
$$ ##END=
$$ 
$$ hash MD5
$$ E6 1B B9 52 AA 0A 62 6D 7D 9A 2F 6F 1D EA F3 CC
##$RELAX= 
##$RELAX= 
##$RELAX= 
##$RELAX= 
##$RELAX= 
##$RELAX= 
##$RELAX= 
$$ Bruker specific parameters
$$ --------------------------
##$DU= <C:\u>
##$EXPNO= 1710
##$NAME= <ADRS>
##$PROCNO= 1
##$TYPE= <nmr>
##$USER= <dgb>
##$AMP= (0..31)
100 100 100 100 100 100 100 100 100 100 100 100 100 100 100 100 100 100 
100 100 100 100 100 100 100 100 100 100 100 100 100 100 
##$AQSEQ= 0
##$AQ_mod= 3
##$AUNM= <au_zg>
##$AUTOPOS= <30 >
##$BF1= 250.13
##$BF2= 250.13
##$BF3= 250.13
##$BF4= 250.13
##$BF5= 500.13
##$BF6= 500.13
##$BF7= 500.13
##$BF8= 500.13
##$BYTORDA= 1
##$CFDGTYP= 0
##$CFRGTYP= 5
##$CHEMSTR= <none>
##$CNST= (0..31)
1 1 145 1 1 1 1 1 1 1 1 1 1 1 1 1 1 1 1 1 1 1 1 1 1 1 1 1 1 1 1 1 
##$CPDPRG= <>
##$CPDPRG1= <>
##$CPDPRG2= <>
##$CPDPRG3= <>
##$CPDPRG4= <mlev>
##$CPDPRG5= <mlev>
##$CPDPRG6= <mlev>
##$CPDPRG7= <mlev>
##$CPDPRG8= <mlev>
##$CPDPRGB= <>
##$CPDPRGT= <>
##$D= (0..31)
0 1 0 0 0 0 0 0 0 0.06 0 0 0 0 0 0 0.0002 0 0 0 0 0 0 0 0 0 0 0 0 0 0 
0 
##$DATE= 1174568980
##$DBL= (0..7)
120 120 120 120 120 120 120 120 
##$DBP= (0..7)
150 150 150 150 150 150 150 150 
##$DBP07= 0
##$DBPNAM0= <>
##$DBPNAM1= <>
$$ [...]
##$SUBNAM7= <"">
##$SUBNAM8= <"">
##$SUBNAM9= <"">
##$SW= 20.6930455092707
##$SWIBOX= (0..15)
0 0 3 0 0 0 0 0 0 0 0 0 0 0 0 0 
##$SW_h= 5175.983436853
##$TD= 65536
##$TD0= 1
##$TE= 683.16
##$TE2= 300
##$TE3= 300
##$TEG= 300
##$TL= (0..7)
0 120 120 120 120 120 120 120 
##$TP= (0..7)
150 150 150 150 150 150 150 150 
##$TP07= 0
##$TPNAME0= <>
##$TPNAME1= <>
##$TPNAME2= <>
##$TPNAME3= <>
##$TPNAME4= <>
##$TPNAME5= <>
##$TPNAME6= <>
##$TPNAME7= <>
##$TPOAL= (0..7)
0.5 0.5 0.5 0.5 0.5 0.5 0.5 0.5 
##$TPOFFS= (0..7)
0 0 0 0 0 0 0 0 
##$TUNHIN= 0
##$TUNHOUT= 0
##$TUNXOUT= 0
##$USERA1= <user>
##$USERA2= <user>
##$USERA3= <user>
##$USERA4= <user>
##$USERA5= <user>
##$V9= 5
##$VALIST= <valist>
##$VCLIST= <CCCCCCCCCCCCCCC>
##$VD= 0
##$VDLIST= <DDDDDDDDDDDDDDD>
##$VPLIST= <PPPPPPPPPPPPPPP>
##$VTLIST= <TTTTTTTTTTTTTTT>
##$WBST= 1024
##$WBSW= 4
##$XGAIN= (0..3)
0 0 0 0 
##$XL= 0
##$YL= 0
##$YMAX_a= 462611
##$YMIN_a= -425358
##$ZGOPTNS= <>
##$ZL1= 120
##$ZL2= 120
##$ZL3= 120
##$ZL4= 120
##$ABSF1= 16.522
##$ABSF2= -4.171173
##$ABSG= 5
##$ABSL= 3
##$ALPHA= 0
##$AQORDER= 0
##$ASSFAC= 0
##$ASSFACI= 0
##$ASSFACX= 0
##$ASSWID= 0
##$AUNMP= <proc_1d>
##$AZFE= 0.1
##$AZFW= 0.1
##$BCFW= 0
##$BC_mod= 0
##$BYTORDP= 0
##$COROFFS= 0
##$CY= 12.5
##$DATMOD= 1
##$DC= 0
##$DFILT= <>
##$DTYPP= 0
##$F1P= 14.0000005364418
##$F2P= -0.99999901652339
##$FCOR= 0.5
##$FTSIZE= 32768
##$FT_mod= 6
##$GAMMA= 0
##$GB= 0
##$INTBC= 1
##$INTSCL= 1
##$ISEN= 128
##$LB= 0.3
##$LEV0= 0
##$LPBIN= 0
##$MAXI= 10000
##$MC2= 0
##$MEAN= 0
##$ME_mod= 0
##$MI= 0
##$NCOEF= 0
##$NC_proc= -4
##$NLEV= 6
##$NOISF1= 0
##$NOISF2= 0
##$NSP= 0
##$NTH_PI= 0
##$NZP= 0
##$OFFSET= 16.522
##$PC= 1
##$PHC0= 219.2191
##$PHC1= 9.686314
##$PH_mod= 1
##$PKNL= yes
##$PPARMOD= 0
##$PSCAL= 4
##$PSIGN= 0
##$REVERSE= no
##$SF= 250.13
##$SI= 32768
##$SIGF1= 0
##$SIGF2= 0
##$SINO= 400
##$SIOLD= 32768
##$SREGLST= <1H.DMSO>
##$SSB= 0
##$STSI= 32768
##$STSR= 0
##$SW_p= 5175.98343685301
##$SYMM= 0
##$S_DEV= 0
##$TDeff= 65536
##$TDoff= 0
##$TI= <Analysis number 999999
Compound Code 99
Book Reference 9
Project Code 9>
##$TILT= no
##$TM1= 0
##$TM2= 0
##$TOPLEV= 0
##$USERP1= <user>
##$USERP2= <user>
##$USERP3= <user>
##$USERP4= <user>
##$USERP5= <user>
##$WDW= 1
##$XDIM= 32768
##$YMAX_p= 289638726
##$YMIN_p= -272391
$$ End of Bruker specific parameters
$$ ---------------------------------
##NTUPLES= NMR SPECTRUM
##VAR_NAME=  FREQUENCY,     SPECTRUM/REAL,   SPECTRUM/IMAG
##SYMBOL=    X,             R,               I
##VAR_TYPE=  INDEPENDENT,   DEPENDENT,       DEPENDENT
##VAR_FORM=  AFFN,          ASDF,            ASDF
##VAR_DIM=   32768,         32768,           32768
##UNITS=     HZ,            ARBITRARY UNITS, ARBITRARY UNITS
##FACTOR=    0.157963299565203, 1,           1
##FIRST=     4132.6476996994, 0,             0
##LAST=      -1043.33573715361, 0,           0
##MIN=       -1043.33573715361, -272391,     0
##MAX=       4132.6476996994, 289638726,     0
$$ Real data points
##PAGE= N=1
##DATA TABLE= (X++(R..R)), XYDATA
$$ [...]
27964 931512 999893 943372 909737 981025 987364 963296 952081 963498 981781 1020885 1052280 1067064
27952 1067064 1012611 997776 1040611 1040699 1015528 1041589 1006656 1008844 1073838 1069117 1106762 1142701
27940 1142701 1168482 1154873 1139496 1165612 1180675 1188382 1147140 1168524 1140336 1196811 1224021
27929 1224021 1203187 1213607 1204275 1212996 1303265 1414025 1398411 1323487 1327961 1325311 1358339 1351871
27917 1351871 1293333 1292018 1338395 1343566 1316908 1347772 1330791 1312709 1281394 1336650 1402213 1386925
27905 1386925 1393725 1420061 1449625 1464620 1421142 1379530 1405552 1454495 1475333 1512194 1547355
27894 1547355 1503410 1477304 1499354 1551865 1504489 1479177 1544916 1558792 1568391 1572820 1591191 1637789
27882 1637789 1637983 1644413 1655186 1624354 1677545 1692373 1690324 1751160 1759804 1753071 1685019 1734164
27870 1734164 1727607 1748948 1798970 1845525 1866457 1868094 1857890 1800811 1825111 1883591 1955506 1967966
27858 1967966 1986608 1968373 1936642 1961450 1949880 1957948 1978870 1960173 1985413 2001365 2090785
27847 2090785 2147873 2182050 2194596 2272900 2338799 2347807 2292007 2250616 2269398 2327057 2324620 2358177
27835 2358177 2370353 2361029 2340714 2323092 2341031 2392992 2375517 2443471 2470387 2500072 2525988
27824 2525988 2481271 2508173 2585764 2652721 2687000 2699909 2728936 2760732 2798610 2777928 2772373
27813 2772373 2804024 2792993 2789451 2828805 2912834 2911367 2956795 2976723 2987936 3019696 3057527 3085736
27801 3085736 3147514 3141333 3179623 3198042 3215487 3273843 3334445 3433698 3479188 3467435 3507621
27790 3507621 3563389 3598783 3648356 3640996 3685770 3659658 3695311 3699249 3738227 3795607 3807264 3828924
27778 3828924 3857174 3949835 4033299 4047691 4062620 4117122 4163023 4247920 4322928 4396067 4437045
27767 4437045 4405319 4444334 4561548 4651326 4712816 4853736 4861788 4865203 4886151 4899737 4927833
27756 4927833 5007058 5094536 5161993 5227771 5300052 5326351 5407071 5464947 5531527 5589625 5686278
27745 5686278 5820816 5897564 5955412 6026755 6072908 6137961 6247131 6335876 6358531 6386546 6453672
27734 6453672 6541702 6652837 6746971 6845226 6959641 7107287 7207242 7278141 7372298 7463281 7586131
27723 7586131 7624271 7713685 7819580 7935291 8003766 8169992 8356231 8455428 8553643 8639172
27713 8639172 8755420 8863693 9016603 9149393 9355682 9424822 9525193 9652273 9817222 9954969
27703 9954969 10086442 10187866 10294927 10378480 10524932 10727372 10901241 11082097 11226673 11372927
27693 11372927 11517542 11677468 11854332 12086203 12327603 12463799 12550707 12749101 12999893
27684 12999893 13200523 13344241 13476675 13682512 13906038 14154641 14352550 14545362 14697611
27675 14697611 14855711 15123675 15325348 15547375 15749526 15964900 16184119 16356034 16573845
27666 16573845 16815621 16986128 17193615 17416967 17576599 17851438 18119742 18290578 18496661
27657 18496661 18724374 18950656 19188316 19411074 19619908 19793352 19917922 20046559 20200007
27648 20200007 20360512 20560577 20707138 20862103 21064845 21289781 21478052 21607885 21731241
27639 21731241 21880951 22019018 22096606 22216905 22362164 22500426 22540952 22526700 22571027 22696763
27629 22696763 22823745 22865485 22922195 22944410 22991213 23003829 22978739 22923270 22840430 22778955 22794851
27618 22794851 22799106 22750993 22634075 22495490 22343520 22245173 22239390 22216141 22062647 21937433
27608 21937433 21787546 21636451 21512829 21353283 21189919 21027735 20833393 20626626 20410244
27599 20410244 20284550 20118015 19888292 19693954 19453629 19267387 19060842 18841824 18675268
27590 18675268 18445983 18238343 18023482 17752658 17525719 17235520 16992833 16846009 16733463
27581 16733463 16541346 16310633 16105292 15908452 15684479 15445956 15196152 14951752 14798662
27572 14798662 14618292 14431145 14249358 14003871 13760863 13640974 13466890 13294764 13130255
27563 13130255 12908877 12685162 12485409 12290644 12092622 11897765 11753337 11569557 11440750
27554 11440750 11273039 11088792 10922367 10720895 10580505 10471095 10322395 10193036 10034533
27545 10034533 9884059 9759493 9620593 9487616 9341703 9210436 9078070 8909000 8773928
27536 8773928 8635592 8470063 8361546 8289644 8210076 8122272 8057024 7942762 7837726 7703570
27526 7703570 7549985 7413360 7266410 7178249 7073012 6928241 6886945 6835849 6765969 6678755
27516 6678755 6608473 6513674 6420430 6318696 6245634 6136813 6060069 6046527 5970863 5845444 5783509
27505 5783509 5674906 5599209 5479594 5434250 5440879 5410893 5365112 5272717 5189523 5102875 4975299
27494 4975299 4865363 4775765 4754609 4714603 4669840 4619250 4646166 4571389 4526778 4477575 4380170
27483 4380170 4300503 4249401 4288502 4249444 4149406 4028130 3987441 3965395 3948514 3908458 3824728
27472 3824728 3726869 3666375 3647844 3636472 3672356 3622295 3606255 3532096 3500089 3437167 3430506
27461 3430506 3380884 3345684 3290112 3294619 3348996 3342462 3301281 3250296 3171160 3108810 3047092 2979192
27449 2979192 2981427 2993324 2962497 2937995 2937402 2894396 2855472 2847711 2735958 2684263 2656033 2632646
27437 2632646 2618406 2612033 2613253 2584315 2522477 2542526 2530312 2473863 2456740 2433554 2476047 2488479
27425 2488479 2430941 2379850 2333194 2295673 2350551 2375323 2257848 2167887 2106528 2110563 2173609
27414 2173609 2157493 2114765 2113830 2117255 2069847 2039114 2070737 2059463 2045808 2031518 2000945 1990825
27402 1990825 1999669 1952487 1830631 1843981 1874143 1840631 1813830 1860625 1840677 1750834 1724235
27391 1724235 1680975 1638584 1640041 1693918 1746339 1738232 1736337 1712839 1684814 1606440 1565459 1600425
27379 1600425 1635288 1532472 1508438 1537494 1493940 1477759 1534941 1529021 1535475 1513785 1476175
27368 1476175 1450996 1446773 1451544 1429052 1403064 1421094 1372593 1357497 1344530 1327771 1354804 1371535
27356 1371535 1385433 1310544 1249907 1218981 1237918 1245624 1200681 1175099 1185931 1158827 1171346
27345 1171346 1188093 1252500 1251037 1255550 1221068 1194821 1184649 1200889 1142397 1118441 1085490 1054521
27333 1054521 1061188 1101079 1091182 1079439 1090309 1132546 1152624 1163139 1140723 1123227 1102566 1098147
27321 1098147 1110164 1086199 1043825 1024946 1020482 1077633 1098501 1102396 1107946 1077890 1038902 1082794
27309 1082794 1087894 1096450 1091909 1030415 955245 888386 908149 896300 881229 919196 939410 912184
27297 912184 870402 867469 864165 866342 853280 857845 824070 834110 853985 877411 830653 787735
27285 787735 766256 775439 777431 767742 799175 828997 851848 831631 798235 801995 797392 806548 854304
27272 854304 859434 864196 826544 785156 775837 795317 751684 783079 796004 798448 825970 814712
27260 814712 778010 732098 752529 687248 669287 643441 710587 777055 802991 799840 722901 676722
27248 676722 686278 716197 699556 729175 743936 741404 666877 668191 643340 648192 716274 778646
27236 778646 735938 671454 677497 689412 684148 674788 629566 581940 546447 537360 637509 621770
27224 621770 564876 543070 530238 526495 531063 516818 530908 566896 565264 549422 534229 549714
27212 549714 544987 581990 559811 549722 564898 626994 613896 544606 512382 543673 594056 563816
27200 563816 557696 571681 531205 464877 495656 522324 478981 485030 499550 489283 455663 492928
27188 492928 501046 479792 453148 491972 447746 399094 387504 393522 410779 433796 403511 454958
27176 454958 417431 336076 297614 316012 395787 422817 401134 410680 421449 440260 481085 478364
27164 478364 447660 461580 451632 449995 465622 515840 542606 532484 471298 448084 453687 500674
27152 500674 537927 488468 426566 428298 379132 393855 447295 402472 375488 429637 422128 436052
27140 436052 400398 395309 439509 448766 433411 388442 330944 343126 327735 345102 415644 449441
27128 449441 428448 441309 409071 447836 473781 437888 378630 379287 316025 299906 311954 276991
27116 276991 265385 282605 338505 411757 415315 355248 324649 308301 282806 354116 398680 427640
27104 427640 399623 388549 371080 291367 296395 295369 322887 329647 343736 305476 309842 316720
27092 316720 279428 220707 283262 293911 281380 341193 323567 299626 288528 277710 295225
27081 295225 310120 290514 349211 400344 428944 387686 320668 240456 199857 173651 203559
27070 203559 247091 289530 313999 300850 296683 322404 340426 309160 270420 221292 216790 272115
27058 272115 303671 286910 307611 250031 213745 240055 250182 226553 201115 217702 236485
27047 236485 221585 232053 328568 316893 297704 302503 238680 258490 231120 236237 239862 203777
27035 203777 255606 312180 281699 279625 303176 280414 291192 283451 211239 234212 252802 278955
27023 278955 268590 279939 258030 201340 235686 274239 279236 309772 291380 258136 275552 295513
27011 295513 297691 265902 244047 272930 274258 278369 349253 319945 270804 264926 259314 241420
26999 241420 249670 244163 262565 260187 251526 244585 233340 274585 268512 249486 225051 271111 326094
26986 326094 309763 281499 269717 259134 209451 172233 153352 171195 225398 210134 167801
26975 167801 218225 213962 165433 191044 248242 250950 269170 243631 197145 146266 169148 151300
26963 151300 175596 226894 222873 238310 258148 264598 220482 175214 141396 172317 205681 170056
26951 170056 178521 146377 111275 145232 180158 177883 158177 177543 162876 137992 135959 173276
26939 173276 225436 243976 216364 143883 190972 218414 168406 132119 189559 252585 263079
26928 263079 235939 175260 180412 205643 207916 159101 161898 156772 155507 183133 180990 199264 178180
26915 178180 180206 205125 169779 119085 131278 120032 140104 155738 158853 170642 212581 153062
26903 153062 140341 140194 206257 205943 161745 129839 154948 170487 184589 159591 136309 157888
26891 157888 191505 248574 255934 153472 104613 107764 121465 139251 58271 47110 124373 83573
26879 83573 101480 145570 182797 145559 127104 115530 95233 51626 56036 97550 49851 74086
26867 74086 122557 139662 95830 54718 85253 152688 114578 99529 166363 172970 158066 155505
26855 155505 149146 164490 160942 201642 200024 213697 114174 119800 163846 123104 68046 69888
26843 69888 136719 170204 177069 159557 132000 98530 114940 139375 123441 145290 164560 66485
26831 66485 82291 102394 100887 90818 115843 109506 82691 64319 47831 93461 132584 205219
26819 205219 197998 130234 82281 87608 127500 138416 155384 176581 176270 172600 185138 234434
26807 234434 225132 211860 151776 113401 105316 106782 89391 92576 114470 162917 153258 131224
26795 131224 125158 94033 73172 108088 159792 124138 65493 5572 70700 99050 93854 123158
26783 123158 86256 82692 133764 90007 78611 97167 141786 98767 68267 59528 103180 60942
26771 60942 -31024 -14454 24411 39609 72446 79180 57709 28346 64844 99566 118997 128111
26759 128111 77753 64841 64729 80497 79938 61890 70175 96122 129408 132905 106471 144145 176499
26746 176499 137086 107736 113826 80524 72107 94409 83957 98457 82776 58783 83629 54659
26734 54659 97804 182092 157244 169085 120038 114774 192038 160334 118156 84638 94311 126951
26722 126951 81701 73063 47983 -2464 -44842 26456 83548 112322 80565 32713 34828 38387
26710 38387 49181 75307 76024 82016 86684 117600 133227 173597 187870 172327 116554 113669 159176
26697 159176 161855 113593 110938 116657 134994 109793 130430 181970 151999 166244 152613 135667
26685 135667 120820 95052 52504 66033 72551 90813 65189 102692 133299 121937 98190 107439
26673 107439 35685 67529 74221 45560 21138 34378 109560 139078 100918 145397 66306 14663
26661 14663 18767 82682 113929 124097 155946 196957 166416 106653 119477 102089 71434 56025
26649 56025 27350 52266 62912 57681 82024 136035 136582 130385 112568 114440 130090 118124 120018
26636 120018 105094 79362 59415 59076 85527 86725 31909 43606 -25883 -51316 -54926 -3780
26624 -3780 50121 59156 112515 199417 209673 151859 98610 78350 86894 68694 57686 53218
26612 53218 75044 83828 81365 67531 85474 115388 100890 27016 25625 77097 59931 52040
26600 52040 26186 25218 81300 95449 73467 63245 47330 53620 33760 84946 107540 123003
26588 123003 114714 112708 120227 101352 119503 119761 48091 -7762 7906 34322 90828 66729
26576 66729 39257 39521 55084 38202 74668 68911 3674 -12855 14980 18821 60266 44135
26564 44135 32719 42664 22393 -7637 45024 81538 86773 22235 41101 50219 36490 17294
26552 17294 36016 16081 -20882 -2154 72229 -2414 -33895 2859 22403 52127 83994 119615
26540 119615 121898 95140 112906 134417 111960 75305 137753 170387 180069 153183 120826 118388
26528 118388 128269 115930 110140 155616 106423 33538 57809 69746 74634 -11905 -19268 42075
26516 42075 7254 -29176 7137 -63019 -42242 -21670 -31703 -48151 -87984 -100203 -50093 8764
26504 8764 22955 105477 50878 -30705 -25808 -3809 31517 90840 114930 138192 108043 57357
26492 57357 37795 65734 72791 87443 116894 90728 96353 47818 31032 -21002 -36077 15731
26480 15731 51932 66594 51615 77005 48498 35640 73064 72257 9586 -25268 18050 50118
26468 50118 63809 99925 122755 127764 109304 56665 68679 94839 63955 59680 60466 73744
26456 73744 73872 47102 60087 13842 -6592 -10580 -2975 -10932 -20805 7527 79392 80964 66439
26443 66439 104013 101619 101095 101559 39837 20716 81975 92572 60349 64289 82216 51316 71384
26430 71384 45660 11954 -6692 28704 4734 -3276 -3519 15442 69416 111853 118273 67217
26418 67217 27381 9259 57731 81201 96706 139028 128344 107847 87557 24633 -5422 29291
26406 29291 55158 60039 79947 58044 46307 39611 23687 12257 34046 39270 85103 113778
26394 113778 87224 108676 92800 38797 13109 70212 84306 14962 -25721 -24084 -16746 -5272
26382 -5272 31121 88154 98586 36079 8711 31222 -13236 6504 -6262 -41806 -64440 6918
26370 6918 21828 2450 -65805 -3659 78353 109479 98206 37216 -34986 -58901 -54066 -42873
26358 -42873 -27949 -84830 -52283 -51665 -29261 -15756 11170 -44483 -79477 -53937 -15251 -728
26346 -728 -52692 -21726 54639 100229 104640 124497 98390 49645 -2508 -79156 -68438 -24202
26334 -24202 -39804 -49539 -73488 -142440 -114332 -41405 -573 5139 37070 20855 -59472 -83232
26322 -83232 -61315 -37337 13712 26500 -8807 27297 -1895 20807 76909 71828 27725 22872
26310 22872 -6912 -21561 -21518 -37670 14614 70990 57427 48097 3677 7678 15382 36999 76950
26297 76950 102020 101275 91060 56705 44378 47744 9507 8453 12239 22585 47892 73491 95170
26284 95170 69731 39345 10321 -21294 -25716 -98710 -123784 -8094 41497 57495 49409 65218
26272 65218 41768 -2517 -18874 -52917 -83177 -104871 -110543 -85624 -34083 6735 66468 29251
26260 29251 -16601 -2696 -222 32381 8967 -44118 -24661 43423 45355 -16867 -40710 -41146
26248 -41146 -40115 -10575 1076 8566 38909 55185 19030 -26360 -14673 52795 95128 166293
26236 166293 118460 59263 24745 6000 31241 19415 36201 29647 56522 56744 55273 17145
26224 17145 -2047 -26864 -113368 -89034 -30336 60669 24025 35504 2040 -66007 -9833 6462
26212 6462 -21743 -68953 -14787 37037 51018 71677 26925 33733 19436 17210 -28312 -56269
26200 -56269 -58518 -3947 21107 13625 -11583 -50821 -88256 -48397 -22890 -33941 -92704 -111990
26188 -111990 -151721 -125724 -135873 -99470 -23312 -1455 -1417 -42160 -37569 -11910 31041 13463
26176 13463 -2693 -4058 -25011 -100872 -49929 -30415 -24233 -8970 -35246 -69289 -37009 13575
26164 13575 96105 93416 127057 166200 188153 142987 137027 82803 43267 103527 143971 111091
26152 111091 59401 -18789 -93187 -72785 -40953 -28721 -39319 -38043 -25146 -79197 -56688 -28120
26140 -28120 -79300 -91931 -105003 -98680 -6476 25860 -18502 -21721 -2481 -10361 32971 33483 20305
26127 20305 66746 111317 88001 56817 117967 156699 131932 65454 29597 -21684 -25030 44461
26115 44461 25321 13078 16401 4099 12970 -22846 -24364 -13787 -8154 -27331 -61877 -26273
26103 -26273 -20884 53113 91925 97150 61486 51746 54920 46155 50705 65093 51718 5900 53805
26090 53805 31485 -28903 -63703 -4765 2666 -6929 -20167 -27259 23391 -13852 -45631 -67603
26078 -67603 -50358 -3997 73314 64803 62965 3070 -507 66567 31841 -5836 -11495 20496
26066 20496 43264 55707 41266 7988 -82359 -103813 -77932 -59739 -40149 -9923 49082 36202
26054 36202 19797 58015 39962 50698 25688 18399 40175 47447 6909 -38455 22010 58532
26042 58532 41976 -44377 -36280 -19126 26494 62282 53624 46981 36413 111326 101103 78115
26030 78115 118079 126867 110586 115403 73414 54667 34323 52067 16977 -44216 -100067 -81303
26018 -81303 -30689 52366 63433 21386 -34711 -71650 -91623 -80905 -75832 -66350 -41586 -18374
26006 -18374 -31210 -43567 -79302 -8285 19179 77426 84336 49329 52383 91687 24994 20907
25994 20907 89040 105667 87335 91722 52147 51664 37128 27005 23225 24216 21583 86400 32300
25981 32300 -47505 -59746 17627 10188 12432 61406 41612 830 -12764 -49652 -113014 -52489
25969 -52489 7373 20791 56559 89178 107500 133326 91724 5059 20404 9651 45639 61061
25957 61061 29628 17264 38246 54453 59841 93450 88257 76972 91443 144110 100619 49879
25945 49879 -8068 -46685 -35983 -19600 20521 -11069 -47808 -53747 28651 61647 45676 27999
25933 27999 -1502 2177 -2473 -12322 -51963 -5543 31304 80637 -18703 -60809 -5415 -12449
25921 -12449 2421 48279 86856 52399 30195 8578 -19135 -12808 22891 5509 -85605 -45632
25909 -45632 29403 58900 -1893 -24892 10362 51288 22310 -23767 -11418 -8893 18684 -9997
25897 -9997 9555 55686 47116 81192 74852 59308 26715 -8627 -21848 -13459 -19399 -58687 -46051
25884 -46051 -20608 -8687 -39353 -31063 -69727 -37389 19911 39196 63400 19545 38502 32882
25872 32882 52312 63519 32268 3652 12107 41521 81191 40442 5050 -55206 -80569 -24529
25860 -24529 -504 -6082 -47114 -36432 -41581 -19780 22544 119537 98301 -6594 21380 62412
25848 62412 88364 100906 112763 117174 87779 14475 49071 4713 -20925 -44704 -69349 -56404
25836 -56404 -14802 26476 112519 137893 115994 85300 80988 66710 62091 20067 34647 67342
25824 67342 121545 106189 85062 10512 -52702 -60845 -21921 -48811 -912 -29967 -30040 -48270
25812 -48270 -49673 -80362 6272 115865 180618 150268 79811 47496 71966 77293 75441 57682
25800 57682 -9986 1354 -12195 61442 106411 112004 10706 -30732 -36813 -58237 -34631 5110
25788 5110 20413 -16703 651 19658 29169 59371 41775 -3344 15260 42756 -994 -29918
25776 -29918 -21271 46276 69112 102106 140718 96305 49048 43881 87489 106824 71687 7352
25764 7352 -22211 -59929 -38786 5156 -44835 -31065 -11793 7313 15402 46313 51566 -17318
25752 -17318 -48494 -41644 -21663 -787 44130 74615 60949 58937 25318 -2319 17068 7855
25740 7855 24000 -25968 -10536 29511 4332 32203 48564 -31812 -39100 -3597 15456 -24337
25728 -24337 -12069 -39841 -62558 -59258 -28388 -13205 -22840 14649 15357 43453 55665 1794
25716 1794 -59555 -72435 -356 29795 3189 -19759 -33405 -44962 -6957 -15201 -31764 -30111
25704 -30111 -69425 -132191 -85427 -15619 -5244 -7520 -41173 -12637 19117 39667 26829 -54444
25692 -54444 -42780 -13019 -67120 -76114 -82790 -52105 -23402 -6338 -4627 9710 6048 -11138
25680 -11138 13495 52563 11937 -16929 -27682 -785 -51158 -54220 -64822 -100470 -67868 -43282
25668 -43282 -40105 21250 2993 -52352 -34296 38095 58084 88334 116354 92419 53823 37643
25656 37643 14877 42144 51406 82330 39029 -30107 -54032 -101963 -107370 -122722 -76549 -35115
25644 -35115 -30302 -25217 -70584 -52603 -23651 -21057 -30666 -23315 1979 -5259 30474 56168 86387
25631 86387 34754 51 -35053 -44632 -56137 -22457 -38950 -49915 -73302 -55561 -75612 -38379
25619 -38379 -53706 -11133 70573 80187 32313 -15920 -27796 785 -23050 -60594 -90978 -61534
25607 -61534 -26752 -8446 -69437 -81469 -97892 -119594 -87815 16751 55109 13769 -1504
25596 -1504 -13251 -11959 47832 94131 67555 29430 -8664 -80196 -89751 -136754 -186215 -129692
25584 -129692 -128539 -105916 -73188 -6370 -40721 -27029 -25203 -52791 -57477 -29438 -34144 -62378
25572 -62378 -73762 -79873 -82904 -91043 -70633 -21975 50608 28047 -3355 -51244 -67595 -55716
25560 -55716 -17942 -20854 12525 76000 60611 23724 -15811 -9088 -845 36723 -418 -17040
25548 -17040 -12994 1377 25643 -25371 -54397 -31792 -111041 -173967 -189877 -160856 -59729 -34352
25536 -34352 -81112 -88651 -11615 53820 36036 14871 37099 7530 -64451 -99431 -68612 -53168
25524 -53168 -57209 -31254 -3606 -6345 18517 44113 26705 -24041 -18886 1266 21080 22440
25512 22440 -19112 -42322 -28632 -68418 -61636 -32980 -19301 -75362 -84666 -117404 -71710 -48476
25500 -48476 -32485 -66125 -83633 -94432 -114593 -93685 -35841 11192 4849 -73767 -147077 -105174
25488 -105174 -70689 1671 55921 46145 6851 6510 90649 103249 44987 -102 26204 55134
25476 55134 24790 -38149 -31285 1363 5390 -12770 7993 -11778 -29409 -17524 -27303 -20795
25464 -20795 16315 -7745 39533 14583 -49079 -96540 -140386 -92219 -9050 6080 -27436 -22055
25452 -22055 13458 848 -13198 -31711 -21865 -37627 -66274 -37988 -18842 -23047 -65523 -3385
25440 -3385 26399 2225 -13719 -855 -4704 -30548 -110158 -89927 -32459 -71033 -47375 -17447
25428 -17447 27989 88790 109383 97297 -3203 -50398 20746 89904 97894 139992 146798 87141
25416 87141 -20394 -51645 -89809 2600 70699 89812 63546 44376 20159 17722 -13576 4806
25404 4806 83517 107788 96316 18763 -33829 1085 10102 -26558 30730 69197 -2018 -84217
25392 -84217 -94026 -86658 16761 64698 -381 -20027 -17030 24549 57611 30250 -36950 -47539
25380 -47539 -14568 14632 5573 -3896 75996 77637 35190 14235 6911 -17596 3742 20679
25368 20679 -24093 -21773 50564 51817 73947 105342 30051 -78325 -35745 74313 36169 -16847
25356 -16847 -39249 -73514 -65413 -26654 -46916 -59619 -3853 40934 56413 -26453 -64117 -12643
25344 -12643 -14987 -41745 -41121 10560 43301 25337 44874 30397 -3809 -43691 -81143 -115898
25332 -115898 -82488 -33576 63686 72356 29655 35947 15306 -42591 -42727 34811 49557 -5145
25320 -5145 23193 48805 13869 17296 44773 31452 52367 65927 -24193 -11684 9235 70446
25308 70446 66325 31111 6776 -39649 -45026 -82950 -88252 -52435 -50553 -109534 -129695 -35323
25296 -35323 3904 -38523 -95668 -114810 -66868 -83980 -81955 8635 10750 -25364 -67412 -6350
25284 -6350 43891 46827 481 -35662 -19227 54309 48957 -2281 -46147 -21406 -37767 -15687
25272 -15687 7092 -34140 -8092 -24282 -21991 -43309 -33475 -19928 18754 48100 25302 -33040
25260 -33040 -90665 -75392 -100542 -120722 -140982 -136366 -108955 -47740 13642 -30390 -34000 -144
25248 -144 25568 -774 6048 29590 60153 29585 12290 -6948 -75763 -41761 -27289 -41158
25236 -41158 -14131 25237 30789 5425 -15995 22556 32226 -1458 -41285 -19510 -42256 -46818
25224 -46818 -59134 -76619 -61088 -84050 -39673 -31123 -33528 8030 12613 -40681 -12463 -13891
25212 -13891 -64082 -66272 -80030 -39053 5105 9122 -19685 -57158 -61726 -17754 8071 30504
25200 30504 35020 7322 -24840 -31191 -24510 -23174 -13050 -38848 -20919 11401 35988 8358
25188 8358 -58817 -94286 -42228 925 23928 37572 35386 -26757 -56238 -45016 -35871 -21135
25176 -21135 -52532 -49892 -23896 -25447 -52982 -54351 -90647 -51146 -54529 -126850 -130429 -86426 -86499
25163 -86499 -52973 35231 32422 19766 28730 47130 42516 10209 -942 -3437 -45663 -60459
25151 -60459 -36930 -22287 -14648 -30373 -95573 -115083 -101690 -64992 -39204 423 3929 715
25139 715 17563 40761 50100 42807 25021 73162 61161 34762 -29901 -38671 -26851 -46710 -25761
25126 -25761 -9160 -42589 7259 -28576 -89886 -73054 -17717 3856 45546 1243 21286 29166
25114 29166 -14528 -11681 6878 -27500 -71294 -81305 -38256 -22645 30217 21160 -32552 -25491
25102 -25491 27360 6842 -31255 -17005 1781 42587 73534 28944 -6311 31633 13521 28329
25090 28329 57327 63791 -15954 -68058 -77003 -79941 -65141 -84667 -99174 -83394 -67459 -31021
25078 -31021 -23242 -69041 -64672 -87776 -99349 -115566 -172024 -163478 -115718 -39577 -64013 -29169
25066 -29169 35825 33298 15447 -10123 -57133 -30927 -9063 -5337 -5427 -54138 -92642 -62635 -60172
25053 -60172 -30656 630 12913 59018 12488 -54363 -34646 37646 69092 40162 3752 4906
25041 4906 24053 -28133 -68628 -61585 -53448 -84000 -88567 -16368 11537 17054 46048 40603 31912
25028 31912 -66528 -72723 -35768 26943 -22424 -73337 -22780 25 22642 67994 15263 -19476
25016 -19476 -43865 -10460 -19455 8144 7338 17243 -12032 -26962 -49078 -93297 -85933 -29319 60789
25003 60789 129967 105450 59664 85544 13924 -244 -2665 -51619 -16430 -33280 -61386 -45725
24991 -45725 -35362 -25927 7362 71033 46866 6907 -26116 11000 39949 20635 -32389 45050
24979 45050 18359 -28278 9842 26838 1908 20745 23593 21475 24190 45595 67427 57982
24967 57982 46187 4821 8964 -11914 -29697 -12381 -52496 -77191 -85516 -38870 4829 17670
24955 17670 1426 4267 38599 124636 103624 4780 -35114 -46560 -17536 -3731 -7616 -31998
24943 -31998 -44525 -74094 -25777 -5353 54762 58356 -24513 -9161 16592 6806 -55653 -130471
24931 -130471 -154167 -130924 -87461 -49857 -37425 -26658 747 27579 74001 76658 34115 2823
24919 2823 -14545 -9067 -12645 -58059 -78495 -72264 -63854 -57172 -7889 8372 32853 19944 -23415
24906 -23415 -18909 -27247 -49689 -78201 -42863 -3111 -76592 -57354 -67367 -83308 -80753 -80768 -88966
24893 -88966 -79334 -61017 -75183 -100697 -102116 -10470 17160 -2058 23329 15672 -43356 -32558
24881 -32558 2204 -52917 -111058 -56650 -30106 -68935 -86981 -90892 -94883 -60044 -38502 -79479
24869 -79479 -60002 -17862 -35281 -10859 11877 37212 104870 124160 52436 -25559 15587 60340
24857 60340 9754 -14663 -31304 -14230 -27945 -36426 -16635 37035 21345 -13468 -4585 -5090
24845 -5090 -22365 23726 34580 89 -14015 -53548 -112403 -83180 -31438 17836 20118 -27352
24833 -27352 -50407 5840 52097 83918 87784 21179 -33029 -34504 -26600 12200 22617 5964
24821 5964 -3218 27206 48233 32672 48604 47921 34372 -9074 -50064 -70620 -90149 -104693
24809 -104693 -101953 -54595 4442 48666 46056 25042 -20532 -42180 -80476 -117261 -120476 -37639
24797 -37639 19262 42104 72635 61170 71465 55255 34230 -37449 -92211 -105780 -58397 -59855
24785 -59855 -61595 20931 52632 12361 27604 17907 -28695 -27331 -4350 -5408 -17342 -40108
24773 -40108 -22074 -7483 -10360 -34422 -68864 -43781 -17738 59957 33155 -4835 -23105 -6692
24761 -6692 7947 -1739 -61344 -127119 -83407 16083 20016 -44680 -59977 -75509 -73915 -142658
24749 -142658 -155631 -93832 -47026 -17841 -58347 -90591 -94136 -83654 -80300 -55512 -81647 -101768
24737 -101768 -85781 -60909 -32096 -4473 73505 58201 98292 72048 24653 6813 -27547
24726 -27547 -13931 16598 35697 34503 14195 -11408 -6182 -59296 -74586 -84198 -108065 -88674
24714 -88674 -63923 -23844 -18211 -14067 3437 3102 -37836 -55550 -374 34750 58416 64426 7666
24701 7666 -11177 35683 45681 13064 46717 57055 30855 7838 9522 18537 3211 -40369
24689 -40369 -95079 -49901 31031 42993 28713 44151 59793 71710 82728 80417 26754 33802
24677 33802 21532 839 -42602 -95494 -119821 -90390 -87767 -80822 -36704 -12793 -17067 52724
24665 52724 88189 -6258 -58778 -43276 838 13181 20439 -20055 -56937 -6727 -31874 -55463
24653 -55463 7283 43427 32242 3303 9320 -9641 29118 3440 37703 73525 31098 43449
24641 43449 75872 77361 8905 -72228 -39038 11088 -2705 35969 41282 72826 35735 32917
24629 32917 109794 94620 44453 17656 13336 -48039 -24819 -7216 -5359 -12130 9497 -23998
24617 -23998 -65094 -44250 -68943 -51864 -31095 27479 34204 14517 -12207 -9471 26746 58984
24605 58984 81905 46703 316 -30670 -59895 -65324 -62188 -9835 32116 42462 56261 63825
24593 63825 78825 103014 20799 -8583 38596 31385 51730 77042 86343 79953 50221 34037
24581 34037 27325 40106 65072 45972 -41283 -38215 -9234 8863 23911 7704 -45384 -18130
24569 -18130 10226 -16531 -26395 -9811 19525 12433 -40192 -33698 2435 16823 -21653 -54534
24557 -54534 -17474 16058 5214 14184 -20822 -86988 -75443 -84802 -83732 -30746 -27840 -71482
24545 -71482 -125135 -127708 -96752 -41407 22938 45171 -5953 -7120 35681 48459 63715 89024
24533 89024 50665 -14060 -43094 -33299 -82624 -110280 -145710 -93551 -98880 -85721 -78993 -64185
24521 -64185 -30239 3200 -11012 -955 24705 4864 19615 -7856 25351 42795 64223 23364
24509 23364 -9758 13858 20440 36404 78696 83288 69068 -10498 -61414 -26527 -19084 -12631
24497 -12631 10682 50079 14987 1598 -5017 19959 58492 29555 -28585 -38310 -13740 16013
24485 16013 888 -28686 -30440 -66103 -43670 -7750 18646 22944 -3736 2776 4047 50223
24473 50223 53137 53387 20474 -2227 10504 38399 46670 41994 19708 -9743 82018 151065 87024
24460 87024 27176 -24959 -19176 30555 56699 33126 468 -24092 -8601 -6219 6977 23281
24448 23281 28406 -11546 -45002 -49985 -45004 15160 -36599 -42498 -52101 -72079 -65272 -79245 -111722
24435 -111722 -32481 68618 84661 105953 59733 29414 91710 118046 92179 33001 -18549
24424 -18549 -1180 3870 9849 -15665 -111919 -110159 -76713 -60311 -38304 -34339 -41998 -37816 -39427
24411 -39427 -25981 -18561 7503 -3170 -6042 748 -16455 -24614 -70369 -32451 -37830 -80236 -91322
24398 -91322 -42642 -2604 -10272 -64026 -86343 -117912 -133089 -82843 -72808 -86810 -78460 -60659
24386 -60659 1878 51110 101079 121561 39111 37697 73103 76011 17375 -2216 -8097 -32295
24374 -32295 -28905 -29134 -67750 -67790 -10925 -18044 -25904 25340 63543 47709 57026 37628 -1515
24361 -1515 -15882 -29518 -66805 -7915 -1911 -31517 -2461 -22102 -23009 -24216 2261 27249 31439
24348 31439 8571 25736 23861 -5306 -15626 35810 52008 26908 16713 50737 7923 -38768
24336 -38768 -45538 -78986 -90651 -26881 863 23241 29299 13712 232 59362 56759 -7001
24324 -7001 -40114 -26948 2208 14707 -6837 -47626 -79046 -55062 -50047 -56122 -64474 -30205
24312 -30205 -383 38112 41339 -2681 4738 -9379 -23243 -24326 -23543 -19003 -82196 -111816 -151231
24299 -151231 -116721 -74211 -9500 -6917 -43754 2274 -19638 12125 53432 12626 -60954 -37227
24287 -37227 -2440 44756 33010 5143 7572 -8931 -62937 -76583 -50725 -27965 -26145 -29713
24275 -29713 -40431 37896 41523 29030 25136 25275 26251 44948 47786 10288 -18670 48440 66903
24262 66903 73479 70930 36129 -23050 -39467 -2859 13406 -8181 -32329 -31631 -75240 -109590
24250 -109590 -46172 -7399 -5793 -48180 -83037 -72401 -25079 -44418 -63609 -38557 -47343 517
24238 517 935 12539 24714 15043 -4373 680 -13463 -37088 -54045 -13225 -5792 -2802 -34444
24225 -34444 -6568 4905 29815 12106 13124 -9701 -80292 -104044 -94193 -106243 -134774 -125944
24213 -125944 -104573 -39617 -55036 -96502 -109101 -31225 43049 54502 42290 21794 10264
24202 10264 -27774 -32837 5596 71057 93791 92268 124444 117025 139552 114397 51604 19931
24190 19931 38296 22254 12158 -9019 8560 43731 100015 123211 84856 22808 8576 11333
24178 11333 -11125 40233 83272 27546 -52576 -100609 -132761 -43625 36257 13576 -41844 -45152
24166 -45152 -9503 27433 -28820 -58703 -55967 -20505 -1143 -38274 -68621 -65108 -74040 -76969
24154 -76969 -36955 61714 73605 -6085 -16718 -50192 -62438 -48488 -50955 -38912 -36962 -73821
24142 -73821 -29506 50333 110409 71529 63527 105436 82825 -24327 -62458 -48213 -64570 -49677
24130 -49677 -25246 11309 42879 80122 51878 56614 46967 -2159 -23732 -53285 -59273 -16505
24118 -16505 -16860 -66971 -63242 -45995 30133 103817 40153 19127 -9735 31946 2922 4321
24106 4321 53254 31582 -20586 -28786 -204 50398 53061 22767 -24943 -20808 -26371 -46756 -35567
24093 -35567 -46757 -14717 48878 23801 26259 76397 47912 -22795 -99489 -109089 -102589 -98065
24081 -98065 -26716 19815 7206 5515 -19476 -9927 -30907 -32650 -942 48122 100272 126169
24069 126169 98927 33631 41613 95632 84902 63958 -32740 -91853 -30010 38007 30062 -62649
24057 -62649 -3298 -1414 13026 -1629 28889 42311 32933 -12524 -39639 -88868 -89059 -93829 -84889
24044 -84889 -67142 -74503 -76844 5301 54150 32595 13919 -29721 -51809 -2783 -275 -19412
24032 -19412 20516 45603 39679 -1802 8577 4221 -41941 -51963 -54137 -33738 -50914 -60413
24020 -60413 -59210 -50115 -29450 -5666 9662 -3575 -36245 -65173 -60673 -25956 -3664 54887
24008 54887 31271 38214 35116 -29178 -11957 -912 -16686 -43026 -52239 -61635 -57140 -51555 -38708
23995 -38708 21158 38527 15315 -61741 -147259 -131494 -37598 35119 1343 -17790 -12828 -98447
23983 -98447 -58101 13345 28558 4837 -4304 -8070 -17016 -25659 -6493 -1631 -68043 -60565 -35574
23970 -35574 -71880 -6618 47915 40739 -21874 -45297 -55117 -90827 -106376 -39047 16363 -3220
23958 -3220 -14659 -42756 -101508 -60506 -60057 -28979 19550 -2592 -39971 -35185 -29805 -10385 7495
23945 7495 -2479 -42176 -61240 -85134 -38568 -20837 -56633 3846 -30919 -38391 -25969 -29905
23933 -29905 2906 -21201 -35225 -68735 -96463 -74609 -53454 -57127 -10731 30842 32549 -10316
23921 -10316 -23807 -35461 -30489 -54377 -53446 -77231 -83595 -86977 -56828 -49348 -22715 -51764 -32356
23908 -32356 -388 23261 -9220 -35269 -58613 -60088 -60989 -37041 4311 35505 80408 86747
23896 86747 89485 28882 -23445 -24615 -30105 -36757 -5915 -29957 -81880 -72525 12418 37525 -44130
23883 -44130 -125460 -134732 -109422 -13890 6664 18212 19229 46117 15105 -37344 -90320 -114772
23871 -114772 -85148 -28561 4639 31108 62022 78287 85740 57222 -3234 -7190 8766 2028
23859 2028 -1925 7018 -6365 -26547 -61379 -72152 -116715 -110779 -36083 -32926 -28466 17113 4730
23846 4730 35523 40191 -2790 -7936 274 -10081 -42729 -65368 -34709 11219 45307 -35607
23834 -35607 -68389 -102692 -87356 -37060 -28388 -87737 -73323 -17817 -7415 13940 -9754 -58781
23822 -58781 -103605 -67457 -19932 -1175 6404 10249 -6839 -17976 14359 -14748 -89685 -44872
23810 -44872 30465 87728 66909 25734 26162 78754 65937 70994 72717 89242 21683 -50113
23798 -50113 -122637 -109018 -91514 -67471 -67240 -43511 14665 65614 77865 75802 73865 87450
23786 87450 40288 9761 -51510 -67035 -30465 4744 47502 65 -6109 821 12689 2320
23774 2320 -45608 -42085 -86072 -94783 -48164 1032 38370 -5527 -100127 -127977 -97320 -81881
23762 -81881 -95062 -123974 -172484 -153647 -122032 -81319 -40643 -52511 -136722 -131898 -94288 -72421
23750 -72421 -15568 6239 -36542 -49165 -19432 -2121 -63554 -49376 -33134 -55798 -92865 -132377
23738 -132377 -103803 -135300 -134438 -63330 -60071 -67016 -98607 -50584 -32105 -41308 -8304 11494
23726 11494 31119 22830 43880 -32689 -92191 -64721 -17987 41666 7845 -68478 -49041 -8632
23714 -8632 -5178 -43624 -38060 -25239 -6340 3420 -44649 -118261 -87658 -12994 30636 -21387
23702 -21387 -23341 8140 24245 9135 -82849 -121947 -86120 -62856 -57605 -43329 9978 34518
23690 34518 -46749 -82706 -29393 22984 7562 -15350 25043 78101 93853 77300 25178 19672
23678 19672 56266 110359 68086 -3840 23025 7870 17440 -3351 -28515 17534 82129 100372
23666 100372 108198 84629 30888 12330 -36207 -31841 2162 -10182 -20793 -17889 -28087 34754
23654 34754 35372 25080 103722 97873 51428 64771 73075 48637 -13803 -2770 10246 5062 -8564
23641 -8564 -68164 -89496 -97639 -50285 -13796 -8956 24122 14740 -3995 -29968 -23758 25745 17772
23628 17772 3456 8051 -52183 -46850 18168 53547 63394 51192 37217 30392 23044 -11070 24980
23615 24980 19035 31551 50694 19562 -7200 -68700 -77759 -105875 -78132 -10179 -9461 2541
23603 2541 10277 -30385 -26080 -18734 -14474 -65512 -42610 -26866 -46309 -21462 -3876 23300 9489
23590 9489 -30734 -20082 -2314 -89377 -50098 4433 -8112 -62236 -111779 -95681 -7639 16098
23578 16098 1044 -14066 -37387 -46231 -2636 -3003 -48173 -84140 -57681 -11859 -4198 -13308 5538
23565 5538 43874 62566 72216 32930 45088 6404 -64385 -48659 6906 21599 15609 31114
23553 31114 -17693 -10286 -7349 -49678 -62421 -67440 -65322 -31057 -18169 -49488 -109662 -110377 -56446
23540 -56446 -69979 -87314 -82885 -103590 -113437 -107961 -45292 -32054 -44002 -48057 -59104 -65617 -83347
23527 -83347 -136066 -136545 -88798 -55025 -100742 -111959 -55577 -29216 31579 54556 9016 -80090
23515 -80090 -121799 -67159 -43641 1011 30140 33712 6407 -45839 -58927 16317 3874 -30987
23503 -30987 -59673 -66727 -95145 -70374 -40071 -3777 573 -38022 -5057 30180 30358 5846
23491 5846 -8565 -38780 3718 6973 -23619 17750 78147 46383 -10586 -97157 -92751 -53424
23479 -53424 -58198 -70744 -114869 -92546 -22545 -33618 -63882 -69211 -50629 -64858 -41943 -25702
23467 -25702 -16380 -23876 -89868 -73247 -54264 -64365 -72647 -51035 8793 -17966 -38122 -84179
23455 -84179 -70590 -1669 25255 61162 17861 -13677 -37548 -40492 -6488 -4825 915 42188
23443 42188 116306 181584 120552 33738 3917 -29754 -67991 -42176 -68237 -75119 -62535 -17551
23431 -17551 -19658 -66149 -130817 -74648 -57581 -59114 3858 49875 18019 -41456 -91747 -72993
23419 -72993 -14225 -29302 -63435 12558 79113 104407 75095 71651 39186 75370 130435 88052
23407 88052 21242 20186 13081 33456 -9278 -65059 -25120 3960 -45698 -78174 -104369 -110139
23395 -110139 -113732 -40448 -48721 -39868 3972 34939 33525 4252 -52880 -82233 -32883 29859
23383 29859 54009 -17162 -42877 -59950 -46166 -32589 3415 10832 -10355 -41198 -37556 -47649
23371 -47649 -7801 2936 -24551 -54010 -2787 -47 26125 18419 -43572 -34360 -10142 18232
23359 18232 23655 -10484 -63779 -70990 -62103 -85813 -96323 -101877 -94626 -80223 -49798 -15747 22443
23346 22443 2699 12126 27655 13190 8055 -3101 -400 26191 41592 55939 63674 41296
23334 41296 65015 46433 3843 10063 -2132 -30333 24000 9746 22741 -4836 -25985 17033
23322 17033 10518 -20469 -37607 -40208 -15094 53919 45084 7919 14624 9621 45491 151 -16871
23309 -16871 9345 15509 14256 7994 -27225 -25965 27124 -26455 -47087 -31006 36462 34898 17089
23296 17089 -15355 17916 -11777 11406 27991 -8946 -1019 -31261 -24433 -26290 -43791 -99294
23284 -99294 -112570 -98112 -20471 18538 47850 -17805 -96334 -65802 -4818 -32328 -59193 -49304
23272 -49304 -34223 9080 41983 4692 -38979 -34024 -16639 22061 21184 3446 27791 3190
23260 3190 -20117 -43749 -115385 -94911 -32956 65475 99322 -501 -52482 -104274 -61037 -50037
23248 -50037 -17637 11980 -8364 -55954 -90327 -50178 -14908 -38803 -45783 -41954 -97097 -68969
23236 -68969 -63272 -47085 -40511 -15462 -5958 -6164 17031 31716 72779 64436 40211 58531 65465
23223 65465 -3302 -4012 -4982 24427 -22212 -41519 -42326 29888 120630 138117 46698 -10391 -4756
23210 -4756 -50780 -14705 -272 -33814 -45277 -52930 -94634 -60851 -968 35564 -17959 -25726
23198 -25726 -49470 -46117 -93206 -67709 -92056 -94803 -53876 957 -23772 1935 1942 -62352 -96566
23185 -96566 -75340 5423 74163 79713 59290 40390 -22179 -58106 -55796 -71403 -61962 -62138 -131776
23172 -131776 -125402 -103252 -116268 -104397 -63216 -61202 -61467 -51656 -55677 -39255 -2227 -12744 -76405
23159 -76405 -70768 -19658 -28915 4871 1074 13976 -6193 -12840 -80731 -96826 -37921 59339
23147 59339 123947 91473 -30569 -91462 -47068 41042 105392 108415 84479 22427 -25514 25228
23135 25228 63619 97736 67987 -52352 -32473 58510 107145 115181 61990 30873 -13833 -22725
23123 -22725 -6482 -27625 -6539 -147 -3860 -31592 -90562 -98774 -59621 -37979 -9874 41139
23111 41139 -34542 -68611 -37791 -30992 -20837 -5331 -9397 -12299 -44680 22267 11475 42402
23099 42402 42453 47979 48961 8273 -60251 -104057 -88711 7926 53358 3063 -46314 -2899 6044
23086 6044 -34767 -71412 -29095 -351 -19696 -44344 -27813 -53208 -55376 -66669 -5955 18108
23074 18108 -13037 -31615 -4513 21587 76887 134353 72350 17124 -23014 -62274 -66421 -121972
23062 -121972 -145324 -97315 -60899 -70179 -30795 32160 52697 46639 27353 29881 -26190 -121857
23050 -121857 -113306 -66096 -103258 -98740 -90415 -120664 -85182 -21150 43105 68894 31924 50
23038 50 -40339 -73632 -73081 -24589 21501 39444 1311 -25820 -17328 58422 46229 -26260 -36407
23025 -36407 51416 39806 -54281 -63344 -17858 2082 -52561 -85262 -24605 -21479 -51017 7821
23013 7821 5510 -61594 -103623 -25224 5808 -13557 -51373 -48732 6042 -18161 -56457 -22652
23001 -22652 1357 5591 22208 23995 -48707 -60917 -1603 49993 87006 96434 82472 54104
22989 54104 18970 -39807 -44819 -6798 -29871 -88707 -126280 -149926 -113733 -38587 -59115 -48992
22977 -48992 -42020 -59073 -46555 40753 61516 39879 37677 -2286 -27554 -67876 -28748 6853
22965 6853 5678 -34761 -27755 -11244 5377 36410 28813 -29162 -18606 29705 3235 -41043
22953 -41043 -42613 -84410 -44673 33411 61405 47449 28308 -5341 1997 190 33222 24684
22941 24684 -63918 -54177 -75594 -106746 -75590 -58388 -95052 -32477 14999 -57203 -78622 -23540
22929 -23540 19376 23334 39700 49864 12012 -14167 -18385 4601 -31340 -36269 -4973 16810
22917 16810 -16032 -23224 -12353 -37476 -17933 1633 -8513 -3114 -31477 -54399 -118110 -154328
22905 -154328 -149365 -55204 -3618 -13641 -41601 -25603 -49416 -32357 37833 70698 63353 64771
22893 64771 48855 18507 11984 16557 12199 20120 1291 11477 44726 45998 95412 69792 13779
22880 13779 -2416 12575 29451 8702 12980 -3149 -19510 31320 89079 107894 51196 32383
22868 32383 18525 42544 100013 23217 -84338 -102450 -26002 27094 7689 -8952 672 -32713
22856 -32713 -65615 -36647 -24934 9472 27351 -18772 -1210 491 36782 28609 -15362 -58290
22844 -58290 -41142 31697 62329 74423 -11968 -33815 1315 44668 70709 26070 -12872 -38101
22832 -38101 -88815 -59060 -6585 -33757 -32817 -53760 -42414 11526 67517 48018 76972 57442
22820 57442 25641 -55655 -72189 -101685 -95223 -23254 40659 -17827 -90365 -112885 -85545 -17012
22808 -17012 30158 -2162 -37552 -25297 -43122 -7719 -9723 -6953 -5833 -22824 -7274 -4130
22796 -4130 -45108 -69998 -23176 12318 8402 -22363 -46847 -44600 27545 118997 124091 60389
22784 60389 -25765 -55821 -82047 -60999 1038 -24397 -36619 -64618 -41463 -2014 25737 40798
22772 40798 -10421 -103141 -130607 -70397 -80794 -79021 -100671 -116330 -160793 -205480 -178300 -164588
22760 -164588 -102157 -42400 -94510 -85223 -36895 -3166 -19977 -22473 -6027 13166 21655 -7329
22748 -7329 -9970 8644 -44190 -31257 38386 16713 -64266 -95221 -109394 -70281 -27815 -56141
22736 -56141 -89095 -75881 -61868 -134510 -90884 -62862 -76695 -58925 -11139 -39231 -50361 -3528
22724 -3528 8960 18249 30670 53027 76999 64456 -5416 -67056 -12620 11506 -31268 -12140
22712 -12140 -3492 -34446 1340 -13335 -12512 54666 83788 62752 -102 -59065 -115088 -143915
22700 -143915 -81431 -76493 -81450 -19925 8865 54616 87428 148279 146797 100522 53928 -11074
22688 -11074 4073 -31647 -91541 -107458 -63782 -21917 -38999 -27950 -13987 -32203 -69525 -52704
22676 -52704 -37076 59547 72418 21707 -74946 -125567 -101854 -51623 -76996 -156107 -205676 -196082
22664 -196082 -107961 -40723 -56337 -19513 -39171 -48924 -81741 -22389 19063 -9276 51805 93850
22652 93850 88018 82964 113723 83473 41750 15021 32871 51519 27668 55688 111855 64736
22640 64736 -47751 -103806 -49012 -5799 -8136 -946 -21745 -41076 -23879 -27441 -52820 -101320
22628 -101320 -131579 -97375 -34426 243 -50116 -49942 -7015 -24721 -44605 -42684 -14076 -17915
22616 -17915 -14286 -33996 -24183 51657 68490 33188 40584 2631 13658 10169 2 -20074
22604 -20074 -476 6603 4456 48404 55058 37022 31308 78893 53348 -29475 -61759 -47770
22592 -47770 24388 69280 77428 39239 -10383 -44025 -42873 -37760 -45159 -68486 -74668 -105646 -157369
22579 -157369 -152181 -98498 -38058 -42976 -23697 -29704 -18417 -9551 7869 -18969 -23233 -64073
22567 -64073 -74132 -5785 32931 -26516 -34738 -47952 -7645 60521 26245 -971 -15032 -28546
22555 -28546 -20606 -5240 10755 -38224 -63791 10686 51286 44907 -16320 -20536 -31546 -27896
22543 -27896 -33442 -66268 -33019 -41331 -57830 -66050 -75896 -127798 -117870 12382 5201 -59512 -165321
22530 -165321 -148415 -123313 -114080 -48031 43611 -22727 -32264 -34902 -47140 -68580 -117227 -132693
22518 -132693 -129774 -148597 -151294 -156370 -180785 -191089 -156805 -127403 -111313 -75924 -87355 -92060
22506 -92060 -6212 13808 13564 -14056 -18525 -11265 -49010 -80949 -55597 -18143 -34978 -34884 -19548
22493 -19548 -33828 -43612 -22664 -33250 -59841 15063 112200 84121 19152 169 11432 63751
22481 63751 95109 82261 68549 35388 -19984 -72616 -4270 55106 54964 48961 -8446 -39341
22469 -39341 -7534 44818 21399 -17542 -50681 -74868 -93113 -89183 -42989 -17641 32024 32303
22457 32303 -2639 5939 17598 17495 -16324 -46150 -87968 -77467 -51637 -54395 -58567 -56374 -77385
22444 -77385 -76738 -79513 -124548 -71005 5957 41638 8818 28184 10092 28583 20458 25083 17289
22431 17289 -10450 -45229 -84889 -71134 -11593 -10696 -60865 -4668 19694 20996 9996 17109
22419 17109 -11888 -92317 -127433 -97159 -44999 7352 67714 67225 66490 49059 24098 -15702
22407 -15702 12357 37974 40346 51918 -24334 -21075 -19811 -21365 44457 31891 -26529 -27772 9662
22394 9662 2895 34193 4546 30780 46073 -13139 -38326 -106476 -161360 -98677 -5745 14781
22382 14781 34848 36498 55036 92366 56351 -42985 -53685 -67783 -35218 -17088 -22321 -48108
22370 -48108 -44215 -21925 -9143 -20927 12397 -10672 -51170 -72126 -24361 27908 5062 -81719
22358 -81719 -59511 -18018 -9717 -796 -57749 -84239 -146382 -145760 -90104 -83208 -66775 -16073 -2264
22345 -2264 -41838 -60891 7899 29083 37976 44230 69170 -22874 -48329 -40917 -19752 -6745
22333 -6745 27509 71276 44970 37231 33365 15372 -18975 -14606 26657 55923 88371 66762
22321 66762 61035 46657 72456 23482 -23804 -5856 33274 32149 16023 18987 -4666 -2405
22309 -2405 8161 -14082 -19624 6107 18991 -13206 -30056 -62753 -59020 -427 13862 48960
22297 48960 29020 35784 3704 1434 14869 19136 20174 24913 47664 -27125 -54592 -62755 -20543
22284 -20543 -29148 -25838 -47407 -95955 -106642 -83243 -66777 -54696 66966 70486 -31890 -38028
22272 -38028 -68019 -39439 -53342 -98450 -97350 -29241 -42302 -63017 -63153 -44675 -35860 -55412
22260 -55412 -85368 -86760 -88894 -85353 -105188 -109510 -70966 -6535 51610 11964 2165 -17311 -17213
22247 -17213 -39856 -107506 -89631 -21957 50957 21140 -28674 -42997 -73421 -132756 -153449 -142160
22235 -142160 -125413 -90748 -90459 -126724 -126814 -95776 -99831 -91961 -51369 -116330 -169437 -194047 -160933
22222 -160933 -122746 -108875 -55751 -58061 -19171 -51872 -101071 -82075 -48561 -17803 7897 -28423
22210 -28423 -79626 -47927 11473 -19390 -51514 -93360 -111396 -31459 31237 41929 2036 -11981
22198 -11981 37587 48265 1068 2979 35965 74978 79319 35519 8866 3911 -13654 -44163
22186 -44163 -12158 -8026 -41826 -105390 -171058 -136022 -149184 -139277 -83771 -48520 -71599 -149926
22174 -149926 -138428 -117899 -109785 -103657 -99398 -193975 -107164 -36669 25947 34788 27527 24377 68317
22161 68317 91294 50962 -13692 -39366 -29745 5371 -23088 -58483 -60499 7862 20631 -34042
22149 -34042 -70979 -75332 -29827 -32777 -45143 -22829 35813 54073 89757 41641 -7225 24660
22137 24660 44859 54943 38714 451 -44835 -93271 -116432 -131549 -107083 -98005 -64449 -56562
22125 -56562 -18464 32040 49366 52563 50028 69838 64217 -26234 -35620 -37353 11408 -3536 -21956
22112 -21956 -15012 -6194 -60356 -19772 -10626 -22213 35618 55341 20000 15864 -39510 -77320
22100 -77320 -71282 -60252 -59614 -15514 -4862 17922 3659 -37607 -40517 10925 75121 75485 69730
22087 69730 22065 -18573 50542 22435 6571 -9963 -29468 -18067 8869 -22784 -65425 -46850
22075 -46850 -9806 -8699 -19683 4484 28394 -3968 -17244 -32433 -52536 -75010 -57435 -77580
22063 -77580 -103122 -66353 -17305 -12630 -49511 -103613 -130662 -113173 -112640 -149078 -111824 -43988
22051 -43988 -102558 -70297 -36876 -9864 -26292 -40238 -54368 -53751 -42780 -37008 -52161 -63849
22039 -63849 -99036 -79448 5335 77963 98803 41741 27429 62550 72141 -22018 -26826 -67506
22027 -67506 -94068 -77900 -13203 -3392 -51550 -79300 -70703 -17580 -37612 -36606 -42639 -34575 42648
22014 42648 79241 46063 1408 -102417 -147932 -68508 -35273 -47507 -26555 -27812 37265 82213
22002 82213 59928 30424 21630 -3933 15485 16204 11934 68671 52116 7479 9134 -79698 -43875
21989 -43875 1159 15753 45818 86867 124641 90219 49030 -7755 -53135 -58650 -58218 -55172
21977 -55172 -63639 -69309 -82613 -85206 -29441 552 74751 69269 -38113 -30734 43107 39113 -2953
21964 -2953 -16926 -436 6936 -5939 -24470 -40137 -48310 34278 39527 17495 41573 12240
21952 12240 -58216 4304 42931 32808 -21474 -29402 -48113 -20720 5303 45671 38401 -50072
21940 -50072 -38006 -24875 -29530 -19617 -21493 -5262 42067 28703 53668 23251 -7863 -71580
21928 -71580 -49298 17364 18384 50886 94336 117975 65105 64760 34777 -34772 -54496 -29054
21916 -29054 17216 61939 112707 89146 55497 -33041 -64869 -77450 -118975 -90264 -54141 -81752
21904 -81752 -76803 -27859 9098 3395 -27840 -14809 -44739 -43496 -52685 -58368 -39309 -31989 -52118
21891 -52118 -33830 -33630 -56226 4864 9814 -56417 -56304 -72160 -62078 -47000 -33441 -46213 -21873
21878 -21873 -18416 -9586 18301 -31134 -52505 -40671 5072 33465 35000 31415 23071 14493 34109
21865 34109 45786 -32927 -17187 53420 91040 73278 30817 174 33178 -3688 -30811 -9814
21853 -9814 -7774 19159 -3412 -21822 19919 -970 -14798 32391 68964 64546 -15210 -88297
21841 -88297 -73911 -25351 68676 40678 -31303 1798 33560 5307 -69801 -100128 -75118 -48926
21829 -48926 -49830 -47482 -21704 6464 -32023 -19498 90841 113316 76214 31536 17089 -1034
21817 -1034 -12726 -51288 -52671 -37764 -50526 -52712 -60010 -83147 -33939 -24846 -24023 5389 79146
21804 79146 63435 10927 -16183 2972 -23690 -40822 17716 9278 -19659 3451 -17070 -11329
21792 -11329 2389 44635 79799 73584 30378 -10927 -37693 -10107 33488 14818 5198 33989
21780 33989 36281 9828 7835 -57627 -91616 -61041 -52319 -65287 30318 14712 17081 -288
21768 -288 33592 25768 40819 -28877 -61344 17546 49215 61609 49605 -10005 -83128 -51144
21756 -51144 -20116 -65169 -84567 -69938 -18827 32217 37333 -5563 9732 -12509 15557 45272
21744 45272 55687 38913 24853 22571 -14985 -27717 -60632 -3318 18871 25251 25417 77958
21732 77958 76630 16608 -47457 12870 39681 12962 6672 34240 -12975 -65890 -59116 -21654
21720 -21654 -51186 -103612 -20181 55141 89002 51729 4930 -47866 -59002 -41756 -57128 -42166
21708 -42166 -43214 -17218 21558 -4077 -24069 -20087 25858 77908 66886 63399 54491 32712
21696 32712 16380 -18728 -13859 28240 -8241 -82824 -3986 -327 1251 33380 48511 26957
21684 26957 13902 -7185 30395 37695 -30770 -41985 -28897 -76093 -105564 -78475 -113923 -77515
21672 -77515 -85433 -15099 40651 78416 97414 -14632 -75657 -95638 -67412 -25373 -43074 -23912
21660 -23912 22299 -8931 12289 54123 123738 132492 83214 42052 24867 15097 36803 79393
21648 79393 41815 25449 35541 -3 -15480 7454 41410 29431 -6483 -11348 -32781 -82720
21636 -82720 -80026 -812 32791 77961 116655 11016 -86705 -40473 13160 56832 46185 5508
21624 5508 -26659 -66138 -38410 53847 90017 27721 -11599 -36460 -5733 -59611 -81973 -79917
21612 -79917 -89506 -69883 -57598 -37304 -43907 -27933 8993 19085 9057 -15983 -22566 -4130
21600 -4130 9015 32518 40173 45245 18400 1393 -89588 -100642 -117910 -143148 -84800 -55309
21588 -55309 -91936 -145531 -92793 -98082 -118925 -116756 -104832 -150101 -161547 -70144 -41516 -47104
21576 -47104 -33377 -23064 12211 51692 97076 39208 11039 -19201 -4514 12651 2573 -7815
21564 -7815 -24684 633 -6198 11123 33553 12366 -31577 24200 42344 36343 -14563 43863
21552 43863 72874 67253 59147 56921 34144 16911 68205 53628 -18860 -43528 -12634 7578
21540 7578 -17900 -31672 8784 16050 46684 41127 22337 -35814 -27387 12037 10909 45177 85486
21527 85486 -5816 -4952 -1344 49530 58657 44877 13763 51141 31807 -31415 -58474 -20066
21515 -20066 -26366 -22446 -88063 -39349 16063 -15347 -27921 10812 60492 76620 31468 49431
21503 49431 52212 27253 -468 -58539 -75152 -17145 56561 100154 55564 3878 -70655 -41557
21491 -41557 -44898 -45796 -78571 -100440 -58989 -46481 -75585 -80985 -9064 49244 50019 -15981 -3894
21478 -3894 2936 -61826 -66261 -24871 31043 33575 21116 6580 -23479 -31979 -22869 23350 30552
21465 30552 -1808 30096 20902 34634 49262 78278 70145 101261 102617 109872 127787 159189
21453 159189 92933 -37238 -112974 -57568 -33313 -86576 -131180 -105491 -46117 -30144 -30276 -14307
21441 -14307 -12241 -3526 27610 16982 -7042 -15592 -35420 -31981 -39136 -45852 -11189 1444 16087
21428 16087 54613 51571 -27180 -49550 3098 46265 19623 -9584 -5019 -73912 -67276 14572
21416 14572 18542 -6079 -64289 -124928 -172884 -157922 -119303 -81969 -26815 12912 9723 100875
21404 100875 85081 -5091 -96821 -118994 -83760 -42374 -64834 -88856 -73038 4314 8170 13942
21392 13942 48137 35197 -20425 -28358 -30574 -45177 -87963 -85507 -8551 75663 117762 65538
21380 65538 4663 -47229 -25623 11078 67617 103506 105650 111607 105822 66779 34037 -9370
21368 -9370 31383 30542 -15834 3918 52221 -2986 -23401 16550 -44935 -47655 -53519 -53714 -2816
21355 -2816 59681 792 -14005 -12718 15926 452 -46841 -75058 -65907 -40829 -60581 19285
21343 19285 30994 6862 11252 24484 -12909 42427 20769 19241 -17065 12732 53562 40986
21331 40986 37714 51590 80862 29806 8189 -24156 -79593 -37245 -27206 -35209 -16418 -40159
21319 -40159 -13817 -37240 -48570 -54926 -55247 19890 64210 27503 -4088 3326 -1128 -29563 26820
21306 26820 53962 90585 125505 82855 53730 -40161 -94930 -138121 -118968 -112713 -96406 -41425
21294 -41425 -43213 -67925 -30987 -16356 -38551 -56448 -102406 -137969 -110621 -101628 -102199 -84844
21282 -84844 -64506 -58008 -73530 -37712 17436 78282 67598 21186 17080 64048 40970 6520
21270 6520 5598 88130 89484 74335 101282 141421 121383 112967 43252 -9237 -21487 -3820 10490
21257 10490 227 -48386 -108119 -123232 -91011 -75160 -6660 30204 7845 -45028 -89675 -101723
21245 -101723 -49818 -14428 -21910 -82892 -71852 -31623 919 2659 -12603 -18142 297 -245
21233 -245 -22676 -7530 -269 31946 23963 18466 -28563 -68994 -75957 -142011 -143632 -100229 -64230
21220 -64230 -36412 -17614 3690 41172 40201 79868 84746 29947 3098 -51082 -4892 -43485
21208 -43485 -125713 -141777 -131212 -77222 -1659 35754 63362 85505 36253 7863 -1359 646
21196 646 50244 52806 14155 12690 -36881 -44248 -26955 -16381 -1238 -7995 9532 783 48185
21183 48185 -16771 -53960 -27081 -34390 19097 30475 9335 -31362 29541 43569 901 2579
21171 2579 57266 72032 23034 48996 50772 13306 -2609 -7375 -39855 -77851 -77379 -61117 -43111
21158 -43111 -44261 -25257 5398 -591 -16513 -21269 -36184 -59983 -50365 -32924 -27003 -63985 -86499
21145 -86499 -86961 -107106 -108087 -35175 -4076 8678 -43285 -29810 42212 92720 59528 27514
21133 27514 -14473 -47749 -20300 -53915 -58682 -52119 -48384 -25002 -26202 -85067 -40350 3407
21121 3407 -46607 -98210 -124535 -109248 -90523 -46677 -73845 -42471 -2543 72739 20606 26035
21109 26035 666 2474 -19949 -35818 -17050 24816 -10537 -44702 -70161 -109027 -122565 -121722
21097 -121722 -107929 -113696 -73591 14018 16112 55635 96828 41334 17737 7341 -18624 -21276
21085 -21276 -23409 -15148 6987 23518 -23295 -59603 -28092 60769 42380 54709 86402 72728
21073 72728 81041 103780 61167 -19250 8739 57922 -7422 -50293 -9916 8137 -8185 -8398
21061 -8398 30079 2545 -28882 -16109 13447 7520 30006 40570 13526 -3523 40260 -2631
21049 -2631 -4179 -20814 -58967 -62346 -35774 16665 -29048 -86957 -128598 -117594 -116642 -121061 -65900
21036 -65900 -71860 -70662 -22406 57611 70026 14188 -2667 -69275 -70052 -31734 -12010 27619
21024 27619 30577 17271 -12302 -11585 -26058 -72058 -48541 43765 62092 55082 -2041 36060
21012 36060 74885 80345 52588 -30016 -119120 -102967 -55430 23685 56647 4066 -39660 -99167
21000 -99167 -31050 -51392 -16956 21651 37934 6403 505 200 17353 91212 124956 110033
20988 110033 47139 39448 60148 28123 26584 7769 17964 33538 49017 85277 93671 86928
20976 86928 74297 27999 6632 -31721 -12659 51555 38756 7904 -2621 -27762 1804 78094
20964 78094 118553 111191 82969 80439 101584 65062 100766 125457 127805 113841 52257 20265
20952 20265 21172 -21140 -52256 3408 54990 51896 12589 6045 -20053 -30217 -51331 -69423
20940 -69423 -59932 -6109 -59019 -60058 -40965 -80048 -123635 -109022 -16486 46121 19333 57442
20928 57442 100851 74237 16774 -42870 -110613 -100314 -63001 25366 23347 -24946 -21715 -46128
20916 -46128 -44195 -21836 -27191 -13299 -20944 -36324 -33296 -16657 -18773 -6821 -15454 1765 9998
20903 9998 3737 46261 72324 38929 489 -2360 -10984 -69217 -100496 -95872 -51231 -49881 -38897
20890 -38897 39275 32332 34374 24751 -8097 -67371 -98690 -134837 -101990 -80439 -60798 -43912
20878 -43912 13894 4470 -27571 -71890 -60772 -13385 -18119 -119183 -112905 -5468 39009 59987
20866 59987 80545 26987 -41487 -20679 -28266 -84194 -105421 -146383 -91768 -81876 -111546 -87690
20854 -87690 -66207 -17576 6072 -11331 25299 20737 40859 59139 34989 -17017 -86485 -164593
20842 -164593 -150807 -68656 -47420 -12764 28343 -19143 -49831 -37265 -973 -29038 -62294
20831 -62294 -35866 -18475 -21323 6232 24940 -25944 -41625 -50945 -68996 -27543 -33946 8412
20819 8412 -13239 -44540 -20323 -18546 -80356 -79111 -92168 -89763 -74313 -32518 -23068 -21036 -1627
20806 -1627 -35680 -73091 -39930 24389 61355 112881 86688 50811 6097 50679 38728 7653
20794 7653 -9235 34788 63346 57241 56445 41757 -41093 -38793 -7293 -21313 -12267 -23965 -36468
20781 -36468 17469 90571 83406 -4933 -14648 41907 16241 17250 35854 -2477 -3169 8959 2742
20768 2742 -55533 -76031 -56204 8182 -21686 -21537 -52915 -86009 -113576 -82083 1614 50381
20756 50381 -16846 -35407 19650 -19410 -9185 4803 -3908 -45038 -47681 -118822 -112526 -118570
20744 -118570 -30929 12321 10953 -48172 -57853 -29147 -42326 -66324 -110861 -138187 -102221 -22305
20732 -22305 -33956 -15095 -16488 36299 -18243 -84484 -81491 -20454 -381 -15936 -16775 49195
20720 49195 76793 95189 89245 39405 -21925 -61915 -96700 -70104 -104435 -142755 -63314 11401
20708 11401 -12480 -18701 18863 36889 -6684 5966 -55628 -122586 -53713 -15774 -46678 -115685
20696 -115685 -90080 -74743 -90323 -84172 -72834 -35878 19950 2041 -51204 -65843 -17203 -22655
20684 -22655 -52857 -1524 42899 83077 82487 -21934 -35941 -16503 30919 16211 -30395 -56556
20672 -56556 26669 69092 78485 63105 57409 81545 73626 87206 95839 28069 -8468 -23675
20660 -23675 -17138 34962 61904 36652 26299 58244 86940 49802 5816 15675 -31179 -21719
20648 -21719 17724 -23802 -45175 -32134 -45123 -73092 -40020 27449 34046 24201 56823 45323
20636 45323 13400 5334 -5275 -1549 -13111 31019 59576 84180 35917 38130 36148 22997
20624 22997 61942 99743 104408 87599 92395 36522 -21103 -64462 -99955 -21745 -1227 -26004
20612 -26004 -21614 -5560 1224 -7968 -61337 -63476 -23539 -10112 21015 87221 55242 -11166
20600 -11166 -36744 -23989 -30730 -70638 -116739 -94629 -76089 -74194 -36677 13509 21452 36728
20588 36728 19419 -34838 -43065 -41611 -110461 -117705 -56697 -12829 39402 68836 40169 72686
20576 72686 119344 61567 44333 3226 -79357 -148193 -160049 -112636 -103379 -61729 -2635 -13799
20564 -13799 -12960 -1888 -48104 -71411 -1850 69900 110394 103711 3493 -713 8655 -32046
20552 -32046 -9263 -2711 50951 91625 94686 50724 -4695 -11835 -15029 -40717 -3407 12864
20540 12864 -6905 -6154 -50956 -84937 -49045 -36756 18199 87184 107237 87665 65721 699
20528 699 -39517 -1465 63986 52980 19705 70929 70289 85846 81228 123325 149989 108728 119343
20515 119343 70661 26151 -8287 -40534 507 -15863 -51631 -67765 -108533 -93081 -147112
20504 -147112 -105189 -9264 9622 32445 26052 7488 45693 30071 27323 33774 -11067 -38361
20492 -38361 -10553 29364 31263 -14993 -53599 -33056 -64474 -34330 -35866 -18775 -12353 -585
20480 -585 12866 5606 -21305 -65679 -36496 -41685 -44335 -29791 24943 95158 54400 -21906 -27644
20467 -27644 -5054 -13328 -48781 -62994 -65247 -25251 -7814 5737 -32311 -40494 -53598 -65205
20455 -65205 -58526 -87294 -111336 -66760 -101550 -94696 -78398 -32758 -45721 -65793 5953 56887
20443 56887 22075 55786 28282 -5504 -9033 -61056 -83510 -88877 -90644 -102342 -27418 2950
20431 2950 -65 -12869 -47041 -16336 7076 -2981 60471 107709 52727 -52925 -46760 -19923
20419 -19923 -4784 -17226 -57599 -61494 -39832 -23467 -76324 -92344 -99916 -53488 -356 25653
20407 25653 45578 101532 110610 59354 48403 -19941 -30994 34527 65111 85371 123369 109333
20395 109333 80426 61840 48603 -3343 -31049 -13368 21820 84210 89274 33238 15348 52889
20383 52889 25565 -17910 -16926 -16663 -64041 -48739 4450 19370 33703 71701 113384 130925
20371 130925 74817 25600 -12159 -89466 -116899 -63060 -83417 -62835 -50236 -91535 -81886 -68776
20359 -68776 -65601 -57124 -19123 25858 -19336 -24868 -42106 -32033 -34575 -52324 -42332 -61776 -57300
20346 -57300 -40032 -29303 -33220 -80466 -132080 -151298 -128008 -94824 -48413 -23064 -29696 14823
20334 14823 24860 29639 27880 20474 -5399 -53222 -25569 -80944 -118657 -46391 -6508 -24508
20322 -24508 -51826 -49689 6519 15209 2648 -46046 -31274 -41440 -143338 -205342 -168774 -149972
20310 -149972 -114682 -75369 -68042 -18393 28628 44056 -10449 -13964 -48038 -23595 -34702 -53001
20298 -53001 -49688 -52935 -21668 11635 55167 124850 132883 105681 117720 142482 98276 99582
20286 99582 64596 55710 47981 -5443 -38337 -21273 15043 22224 -10999 -25258 -30959 -54017
20274 -54017 -85433 -66004 12793 -41750 -52473 -20233 -17519 -52126 -32434 -8954 15777 11703
20262 11703 -23241 -67000 -22262 52288 67267 44260 -618 60241 89786 43715 9913 15094
20250 15094 5322 12769 -25433 -95040 -126808 -90903 -56127 13298 36025 47158 41232 60797
20238 60797 76314 66625 39402 2296 -45578 -59785 -4376 26633 36849 -16811 -458 1070
20226 1070 -6504 -21071 -377 -38726 -84262 -84748 -76745 -59833 -9417 -29828 -86981 -49024 -5278
20213 -5278 11974 25017 -12989 -77117 -107459 -80552 -76650 -26366 1127 -36159 -64652 -97738
20201 -97738 -52628 23779 115416 61217 -5105 26822 39920 20316 50480 18762 -8741 25550
20189 25550 7754 -28097 -44611 -27368 39499 47338 -17268 -14758 30457 77301 83535 31140
20177 31140 6995 52536 4005 2324 33283 28398 13113 20435 19387 -4520 -4873 -50865 -38901
20164 -38901 55710 49765 -31378 -75143 -88293 -56703 -45988 17464 48420 -19621 -49757 -41408
20152 -41408 1926 5920 -14905 4359 41658 62190 86327 80784 53786 -1247 -56098 -57150
20140 -57150 -41390 -16654 -16300 -19982 -26423 -5638 -16645 2448 27506 36798 97615 85677 19682
20127 19682 -4178 15000 -8061 -37929 44937 69369 29741 -3856 -10858 -30326 6703 81553
20115 81553 52142 22882 28708 55919 40150 54112 52058 39702 9648 10555 -18806 -28214 -13251
20102 -13251 4733 9013 15862 110545 95723 36357 21671 7568 8814 15019 -3907 -57835
20090 -57835 -38269 20151 64338 42453 63376 49803 786 -43505 -79177 -1241 62040 88417
20078 88417 64660 35324 9498 2122 17636 16435 396 -15708 -6842 17321 83149 44630
20066 44630 18863 72840 91173 37340 5416 35608 -21251 1960 91350 107485 56737 59771
20054 59771 62588 48487 54623 66070 46771 8526 -19385 4603 55418 47449 41719 73677
20042 73677 40649 10900 49142 53926 74213 73519 -16500 -40148 -29059 -24026 17201 43645
20030 43645 61400 14293 15674 -1413 -39281 -35149 -59700 -9320 59657 30359 -24850 30035
20018 30035 29802 -33743 -37894 -71671 -74754 16061 73113 85259 118285 122074 95754 44314 13661
20005 13661 3445 -46479 -16673 13370 -25969 -49998 11896 -2819 -33162 12526 69322 88091
19993 88091 116264 88323 45280 46135 -24237 31905 58254 2538 -35383 -24968 -18206 -44536
19981 -44536 -17906 2538 44428 76207 24513 -19473 -58791 -56892 -19584 17936 10689 19071
19969 19071 9273 -41219 -43586 43094 79393 56125 20945 44878 46615 62221 53668 38170
19957 38170 -28321 -15627 3122 32119 47190 -25958 -73093 -42015 29477 54929 64308 13511
19945 13511 -15338 -29571 -11247 37044 45489 15243 30313 30248 11875 26456 -28212 -54578
19933 -54578 -7922 47462 25992 30398 71231 97179 85732 41300 -16186 -52848 -111811 -181237
19921 -181237 -110362 -35955 244 25638 10658 -17139 -38121 -24409 -11890 -26446 -37305
19910 -37305 -1827 -11814 -75166 -95184 -85617 -51233 31274 -9365 -46105 47939 57484 -16158
19898 -16158 -60129 -41928 -775 65979 98169 58919 -13948 -40620 19102 66777 59543 15626
19886 15626 92639 163314 141308 66005 -2986 30560 3389 -24036 471 11662 22448 67954
19874 67954 70110 988 40914 25490 -26328 14086 32671 38447 48417 -4314 -56986 -11891
19862 -11891 -10750 -485 6826 31002 29553 370 991 22263 68184 84523 47641 -1222 -9433
19849 -9433 32412 44674 63310 26195 -36255 -48446 -31482 -54469 -92293 -82522 -6364 -24417
19837 -24417 -29366 -80260 -6554 56868 90273 89244 20818 -3546 23268 42216 100748 70570
19825 70570 34488 -14374 -57930 -51332 11999 8487 -7223 -1203 17273 -37358 -90920 -90048 -85743
19812 -85743 -65244 32271 88949 22860 17730 35281 39376 7841 40082 61291 75437 46710
19800 46710 84352 192658 257955 288442 296226 225915 199623 145218 83057 76111 92013 49196
19788 49196 17838 64294 75438 50293 20308 65006 35989 32156 51877 59746 27883 -6013
19776 -6013 -991 69390 54244 57540 45016 9749 -5927 31986 48583 56135 -19862 -11848 -24655
19763 -24655 -22887 24972 40872 -8884 -41394 -65925 -124218 -95467 -21111 6802 13598 36195
19751 36195 53412 -21499 -121865 -96066 -68037 -33585 -47063 -29077 23771 64546 105277
19740 105277 52735 71304 136515 127748 65100 45100 43283 -5054 -39906 -40358 -21934 17864
19728 17864 37012 -10940 -25751 10772 24503 -19961 -12102 -14868 22498 46310 24774 37853
19716 37853 -17134 -24822 -20695 -3182 -12986 28613 64720 67233 20050 23434 -17250 -28516 6715
19703 6715 65729 65740 8082 -37049 -90143 -67551 -3916 11228 3989 -27485 -53762 -32387 -5506
19690 -5506 14116 18923 8974 -62125 -86810 -43952 -8789 15403 23395 -6809 -3239 42190 69493
19677 69493 60144 16089 34192 32589 45018 55323 58434 130208 121780 72249 104759 192613
19665 192613 238032 262490 256839 305554 394818 426663 377726 330800 279365 238434 195821 221300
19653 221300 257367 250011 273876 284471 265567 295547 288534 204415 180471 174877 131156 122792
19641 122792 178915 172837 112910 68399 -12528 -49788 -32030 17968 49767 77713 95204 80187
19629 80187 46885 20606 2332 -18185 13008 30538 119947 170359 118383 96242 97573 176566
19617 176566 282564 385469 490550 547897 514662 519344 514995 521181 488554 438920 448899 413720
19605 413720 443726 523488 611563 722598 788482 730117 559921 411707 328313 295216 235527
19594 235527 210311 222557 214525 172881 164764 130551 94542 106818 90914 143398 200504 168221
19582 168221 139713 127730 150166 154648 145706 77718 56657 45258 52329 93441 163432 182468
19570 182468 183262 178428 185869 296920 332727 332450 369082 382704 346877 297514 244973 216595
19558 216595 247541 289738 336820 323428 335664 387278 373021 359849 282774 233296 234512 255470
19546 255470 204268 146186 113081 65155 89513 139988 100018 85640 50131 26244 67246
19535 67246 72715 96019 126882 114543 79915 102032 112780 123554 155043 107025 98141 134712
19523 134712 69840 54213 75376 51642 91334 153946 109391 72325 101052 135459 137607 155891
19511 155891 154957 157893 138772 78864 53997 27305 16223 39660 84239 112552 79518 62264
19499 62264 48880 59743 100162 98669 46494 7595 31542 12504 31583 26922 47063 48666
19487 48666 3757 91465 136072 167788 135637 25366 80819 151706 114512 101621 105994 85549
19475 85549 60773 47572 50097 32205 -17740 -25354 45920 61303 84132 109306 102027 74832
19463 74832 63935 44778 75927 67761 72699 82681 110038 81056 40814 35842 59838 65862 86745
19450 86745 95033 72079 81314 92159 145951 170996 147559 85128 75989 35740 53156 55120
19438 55120 35419 -22546 -32354 35887 66641 50151 25563 17332 27565 44321 94420 63875
19426 63875 53140 99815 53756 -16698 12213 39730 20160 -1086 -14879 5999 33970 69380
19414 69380 106087 129362 110879 49196 48673 66926 103968 77365 55665 102064 176101 228123
19402 228123 217456 169486 198374 208809 195166 188425 219145 171190 166068 170259 124843 108014
19390 108014 154016 174453 150378 158463 181459 101939 108290 151563 125661 82836 58996 82725
19378 82725 192568 188476 146166 135955 135730 111991 96874 148157 172533 171962 139314 209890
19366 209890 305016 349631 381565 356394 336523 276799 235550 210129 217703 216059 229005 281426
19354 281426 291770 288011 290558 308136 321953 344975 377266 362495 256313 301777 370168 354758
19342 354758 376119 354098 284433 203835 170407 257652 297600 290590 299183 239629 144037 162651
19330 162651 229266 206869 219984 267148 276815 229718 244679 258105 240840 243848 257466 269551
19318 269551 241373 207585 242658 328681 445637 533778 565666 617174 623319 605563 571320
19307 571320 533081 503616 515959 471232 420898 390145 393351 428227 450353 483522 480193 449121
19295 449121 451652 480356 497508 443874 436833 414929 373269 321619 356185 386939 359096 326428
19283 326428 321153 304137 333489 364992 413107 446313 453197 439939 468228 538039 485529 440381
19271 440381 447128 466600 470523 531644 595870 630392 657449 680506 691214 660238 637478 571606
19259 571606 572042 581184 671460 698723 690793 667408 591686 507276 566914 572382 532669 522804 510326
19246 510326 562048 576985 567759 580521 608775 614893 594171 569432 537575 495770 499167 501519
19234 501519 492564 565722 630368 709668 713486 690256 700655 762968 748914 689212 641897 559300
19222 559300 530968 642503 691502 731153 747851 768120 768889 748905 748902 748705 740549 708907 624944
19209 624944 543158 561977 590429 529146 569108 601980 623816 641474 644472 688127 752711 781326
19197 781326 790356 833208 836520 841160 831559 831776 835710 817532 887175 839480 806638 829072 912860
19184 912860 989472 1049584 1145728 1208990 1289803 1385312 1471285 1550035 1655786 1785524 1873486
19173 1873486 1996659 2127216 2237147 2335209 2394558 2409194 2391747 2421366 2595574 2753693
19163 2753693 2898098 3036432 3219171 3431166 3625698 3926852 4199255 4554176 5033982
19154 5033982 5753484 6809048 8217125 10195221 13018326 17077426 22936544 31144876
19146 31144876 41162135 50037271 54518474 55016596 52139909 45462977 37544419 31636949
19138 31636949 28837291 29120944 32745305 39936556 49827084 59009439 62970433 61355527
19130 61355527 54955438 44835456 34317392 26055108 20344698 16506036 13893834 12069913
19122 12069913 10722390 9724034 9045263 8673986 8482286 8457617 8588132 8803064 8992686
19113 8992686 9106710 9351788 9609314 9893879 10357840 11032194 12022563 13532690 15693503
19104 15693503 18795673 23282460 29754419 38784632 50871210 65683513 81911322 95877789
19096 95877789 101587619 98672630 92572719 85132289 76720732 70468527 67854175 67890084
19088 67890084 70703217 78678608 93060428 110345286 122107152 123811795 117462345 103221340
19080 103221340 82729557 62407711 46791816 36017149 28661213 23486926 19756243
19073 19756243 17084194 15158061 13774167 12798893 12112808 11466444 10909580 10385416 9919458
19064 9919458 9569414 9328785 9262873 9330684 9583850 10104955 11038490 12569550 14853662
19055 14853662 18334261 23003045 27798576 30228722 29745831 28950174 30334621 34838976
19047 34838976 42218866 50563348 55645744 54804433 49650356 43153843 38331774 37226144
19039 37226144 40509213 47675432 56433044 62113467 62775012 60759599 55958840 47319357
19031 47319357 37523916 29317192 22973164 17947246 14138606 11368180 9404657 7950690
19023 7950690 6875231 6076716 5438719 4931658 4501904 4162197 3846833 3560672 3325665
19014 3325665 3079812 2867819 2673896 2472142 2294286 2168963 2055558 1980898 1933159 1941443
19004 1941443 1933981 1890579 1761695 1600315 1472225 1398222 1339869 1291315 1200492 1114490 1080386
18993 1080386 1064698 1025279 1053493 1073629 1097366 1084361 1027070 998128 935210 814541 743370
18982 743370 854061 868169 846876 753016 646810 592124 610365 606895 596768 635373 639841
18971 639841 611274 490973 402222 370599 448265 530098 530400 570725 568848 515818 569733 576874
18959 576874 544192 534345 547952 503863 505913 568103 595207 565825 553671 554119 592153 650117
18947 650117 633600 631846 674944 692513 667721 649366 645789 523288 443370 503826 521769 446849
18935 446849 423203 530895 599496 586043 503949 465717 414432 404539 405668 368766 332964 296657
18923 296657 273736 287403 382424 448017 422219 362538 404155 439549 433786 379460 353704 392745
18911 392745 402642 422461 421935 390152 410496 398298 409206 387126 346773 317070 267835 266649
18899 266649 290233 272415 260130 247210 274753 357819 339245 286490 279893 310801 266151 193155
18887 193155 212494 229839 224527 235209 310745 307387 292295 304211 310972 269172 244294 265627
18875 265627 307687 289332 326286 309707 285325 242930 294564 391116 380006 330091 384096
18864 384096 422014 438279 397261 453716 448162 389662 389391 413560 414703 396490 403628 418305
18852 418305 439662 416655 420783 455125 539709 535870 440450 432517 442727 434215 392665 403342
18840 403342 440032 487362 484705 448366 534833 594003 614533 639257 688659 739580 804749 765594
18828 765594 759511 791317 826020 878058 958034 1050074 1051453 1080679 1125996 1102935 1123842 1132810
18816 1132810 1125449 1063464 1077047 1135127 1258960 1438435 1515732 1578782 1746595 1907778 2177918
18805 2177918 2583318 3051166 3628949 4533869 5918758 7916313 11013511 15747164 22735047
18796 22735047 30880012 34812716 30435573 22580363 16575747 13201811 11586891 11173135
18788 11173135 11853186 13868731 17783718 23969647 31608733 35433614 30616883 22130537
18780 22130537 15698288 11921606 9725130 8352850 7413079 6770114 6407742 6390643 6623433
18771 6623433 7246375 8190893 9687127 12022039 15669593 21405425 29457297 37406375
18763 37406375 38537190 31761861 23983706 19143523 16843280 16256206 16836117 18746164
18755 18746164 22644752 29461430 40159915 53432601 63013452 66181678 63984666 55050910
18747 55050910 44394442 38088496 37267808 41349319 49004909 55645074 55164870 50265987
18739 50265987 48128538 50995844 54894583 52723848 45074616 38804805 37452852 41216575
18731 41216575 47909276 50766852 44404014 34167135 26188681 21460164 19069151 18018248
18723 18018248 17894759 18797249 20889124 24783712 31590736 42106437 53795781 58057655
18715 58057655 53084482 48294477 49230313 54387662 57648365 54037207 45989075 38763186
18707 38763186 35235753 36089224 41025820 49326858 57814327 62639637 64432466 62447328
18699 62447328 57671592 56424221 61490015 67503176 64934976 54098916 42054816 32654386
18691 32654386 26651711 23572749 22806363 24103427 27630175 33993966 42954417 50306943
18683 50306943 48578838 38769204 28575570 21653283 17396025 14607883 12654628 11262377
18675 11262377 10278975 9741407 9666166 10053684 10987578 12585627 15052134 18971243 25224721
18666 25224721 34564817 45488328 51150461 45581224 34457538 25312999 19785372 17072275
18658 17072275 16258630 17045728 19533031 24242520 31807660 40913027 45825844 40932621
18650 40932621 30402051 21111882 14977338 11158514 8695182 6978087 5697971 4710710
18642 4710710 3987614 3501043 3166988 2919467 2699068 2513213 2310093 2053831 1845347
18633 1845347 1747436 1658405 1657701 1651575 1593916 1496643 1379553 1372841 1450713 1525119 1522493 1526721
18621 1526721 1486727 1475332 1440224 1438393 1321494 1193859 1107190 1005575 916220 826801 771862
18610 771862 797008 808137 772914 711057 629465 553310 556678 562759 496485 414571 368051 376479
18598 376479 420563 421651 502631 468186 464478 506290 554713 538919 506734 486659 524996 602973
18586 602973 641641 620115 551009 513540 505688 536838 527163 512352 579608 701670 901775
18575 901775 1028532 1078179 1064158 996283 881951 771873 691718 605424 528019 533581 619255
18564 619255 734539 756497 799155 886429 913737 888076 791083 649775 518999 468604 481655
18553 481655 463536 443066 398039 421714 411475 446677 471639 387800 393468 353417 340477 397466
18541 397466 507357 564368 535139 591933 594023 507773 439348 425654 390138 401484 455808
18530 455808 499781 520474 564822 614895 600389 577831 631065 739440 871748 843504 731696
18519 731696 602194 503095 449883 375201 384698 401007 383721 439920 515003 515137 551570 548705
18507 548705 481929 440472 443706 446796 377290 341025 392303 440313 396033 347606 341846 368621
18495 368621 348523 334139 356799 337853 322308 269764 262901 304430 324428 371652 427466 423045
18483 423045 424765 363882 313832 270668 318781 418919 404072 403173 420668 431168 421902 434111
18471 434111 447839 408383 412451 389011 352053 324580 309559 278910 293773 309757 313816 257211
18459 257211 167985 162470 232088 243860 230921 201669 204146 227539 205102 263184 287431 354581
18447 354581 389250 349721 281691 250082 296023 313409 317032 309203 265146 258468 235005 261916
18435 261916 257623 205483 260695 303636 337578 374135 369638 358944 271352 180401 174226 160760
18423 160760 194355 281944 355163 415049 382942 352887 396893 469819 422217 351612 377169
18412 377169 402085 304924 280892 333824 330577 301741 318713 382407 423770 419745 438642 431440
18400 431440 397744 354830 341272 372238 343756 318155 365077 402856 399473 312868 283781 287941
18388 287941 296900 308045 289952 300873 324193 296434 318131 310361 289064 312175 343300 353026
18376 353026 351063 320703 306413 323820 352801 362792 379602 386438 359240 355835 405245 396583
18364 396583 409460 401177 376211 421064 460371 430726 467716 503833 472557 413443 422155 461966
18352 461966 524905 553510 520299 507367 562053 547181 497298 554838 542525 513826 546198
18341 546198 521318 514598 508689 573397 614129 622877 575788 540769 589083 700963 775019 701425
18329 701425 676702 654107 644325 602525 620355 667801 698911 748629 765273 727910 746020 846773
18317 846773 842005 770148 769133 814605 855328 839258 800879 827894 906314 890007 879550 911556
18305 911556 994858 1071287 1112936 1176156 1179418 1183747 1198201 1238002 1264477 1358907 1461037 1504129
18293 1504129 1589326 1688682 1833863 2020706 2233918 2364090 2481789 2594605 2722502 2847439
18283 2847439 3021804 3254355 3519306 3846676 4274629 4782678 5412084 6106756 6778403
18274 6778403 7582548 8767907 10263384 12260989 15150320 19496472 26069490 35505291
18266 35505291 47352248 58064048 65786883 71932408 74315984 73852956 77735132 88269226
18258 88269226 97343416 97014277 90852048 80199120 63745124 47302626 35480862 28202056
18250 28202056 23843237 21344267 20211560 20181636 21251861 23642991 27772730 34377688
18242 34377688 44899653 60850574 81424847 99394572 106382653 99160016 85393443
18235 85393443 77371885 79808001 89790371 97437245 93019779 76695729 56960200 41480060
18227 41480060 31655349 25789123 22236797 19991624 18638966 17940019 17704248 17963227
18219 17963227 18841283 20341530 22505345 25794063 30948027 38802585 49454513 60233499
18211 60233499 67853358 72345388 72235408 68971333 69243636 75879262 84558879 88055864
18203 88055864 85525820 78282413 67517856 58332613 54390726 56110243 63487457 77772658
18195 77772658 101234498 135147992 173731608 201080599 211015842 220806911 243558852
18188 243558852 270551905 288464603 289638726 263731169 215597410 167493220 131192553
18181 131192553 102079991 77575932 59297881 46634528 37865984 31650053 27124139
18174 27124139 23725472 21162143 19112200 17540449 16362079 15495197 14869591 14515659
18166 14515659 14114304 13615180 13063977 12552343 12099004 11693818 11366218 11031138 10801334
18157 10801334 10721521 10720172 10902988 11276594 11915046 12807033 14118757 16148816 19127833
18148 19127833 23492657 29879294 39514063 53714774 71993545 90256998 103912875
18141 103912875 114415653 125432105 141096347 163688009 178632264 168655144 141389879
18134 141389879 113840578 91501436 72203289 56976726 45613679 35851372 27795193
18127 27795193 21902161 17813232 14885918 12727698 11053362 9791797 8851604 8119990
18119 8119990 7620024 7311698 6869007 6354197 5793556 5219435 4720192 4370900 4190915
18110 4190915 4033734 3800236 3462364 3099295 2853689 2609450 2408390 2283038 2137794
18101 2137794 1994822 1838876 1696580 1611860 1517261 1414334 1295199 1300107 1327622 1281618
18091 1281618 1271041 1185332 1145559 1115180 1077500 1057551 995450 925666 892574 927697 948448
18080 948448 893596 850208 852363 847263 824700 757059 677118 645055 630271 603250 578810 616090
18068 616090 672600 663707 706093 705887 701750 634024 608296 663488 692886 698580 691483 666503 594501
18055 594501 528877 472375 398278 391265 420563 426350 477515 474173 485308 538040 492525 355504
18043 355504 337417 393583 323940 325731 350866 259777 240094 241174 279261 290391 234906 207111
18031 207111 231822 279930 289987 209552 184633 275221 406569 366446 289898 282774 323786
18020 323786 335997 351300 290112 206926 176073 193736 202129 244621 295040 282535 244200 252638
18008 252638 293584 267081 211456 182750 197133 168778 177436 182160 192521 244565 283276 307695
17996 307695 247874 199522 192605 158899 224109 267300 234726 133132 69350 30430 39609 66041
17984 66041 84703 128930 141812 155367 162554 168995 115127 129308 138429 175515 112016 68990
17972 68990 68616 107297 116773 97809 101730 113626 119587 115461 94417 35701 35552 85892 84228
17959 84228 46280 119483 112188 94098 121767 135005 124680 110657 105295 145100 135326 103035
17947 103035 116105 122494 154457 129065 69490 17324 55 72408 76974 80360 43956 40168
17935 40168 19646 -1182 -2320 24967 41068 38026 48657 74373 70574 69313 138953 173521
17923 173521 193612 199590 188169 179062 154413 162887 129965 38683 69124 107545 108210 89089
17911 89089 81915 107620 86385 28650 -17494 -33924 -20807 -34278 -20649 3032 22124 47923
17899 47923 69728 74996 15171 -8250 -23138 -27729 43515 111788 109792 54344 78898 164045
17887 164045 167573 118053 90593 90413 90769 122480 163815 144581 113317 84110 52791 23094
17875 23094 72503 105484 83855 42143 55982 92877 97471 109233 54311 47203 36059 22453
17863 22453 74826 99624 74681 27512 73820 118115 100285 44846 70950 47501 41791 -18564
17851 -18564 -39583 -27882 42026 151216 139621 66435 31793 37888 81465 38342 -30398 -21938
17839 -21938 -22601 -7478 96542 106344 -15250 -50583 -66811 -46959 -31620 -11817 105389 88470
17827 88470 29595 23458 -17921 -2658 78394 135728 126871 60367 72199 82582 30213 -16426
17815 -16426 -40053 -58542 -25063 -21668 -11166 29392 67912 71450 92028 114532 86788 73795
17803 73795 84389 60235 -7572 11341 75043 91098 61552 60876 106504 78896 2939 -28574
17791 -28574 32658 64883 99079 97509 41921 -31099 -55109 -51293 -22663 -7635 19528 56844
17779 56844 -20617 -34725 27869 69058 122042 109263 40099 -2251 -26717 -13944 -23407 -70534
17767 -70534 -150733 -173928 -105149 -29295 -26873 -46291 -37559 7443 68974 85247 29116 50826
17755 50826 52379 49753 70383 67310 42681 9160 42198 58091 83137 161448 137864 148802
17743 148802 204702 256407 338526 382649 384778 424650 385955 317126 359740 380312 376815 404234
17731 404234 374559 292114 269813 224692 172882 136267 125754 178964 218176 230324 224847 297688
17719 297688 371691 365183 452748 521358 552361 508761 430457 372846 430363 446546 458807 436267
17707 436267 363979 290113 233807 178102 143992 141197 127646 150060 95972 64985 61456 82079
17695 82079 104218 148804 142113 101176 91059 193875 268036 348576 408737 435924 401324 370002
17683 370002 340219 354600 345127 362719 369798 378449 350043 329372 287443 340283 472878 591266
17671 591266 723403 823468 1006632 1154116 1179806 1186318 1176737 1153773 1142588 1180076 1255917
17660 1255917 1149898 937399 690076 517935 445548 371817 301593 293405 234486 200551 152819
17649 152819 83776 77123 69806 89496 51628 -9251 44145 57526 76791 115998 99490 40414
17637 40414 11602 47094 93123 76741 74394 36413 48443 110108 124549 135961 128830 130932
17625 130932 165110 227283 349365 428128 480851 526002 554814 600159 635823 693159 727205
17614 727205 744209 718541 666640 597700 580665 544286 516908 421473 324739 242310 116846
17603 116846 84298 62575 22232 5865 11027 5672 87953 107598 49440 44232 46737 38373
17591 38373 48272 89186 40625 38353 21899 -748 -8742 -74131 -41809 -18082 -20661 -25649 -10519
17578 -10519 -869 -7319 -33400 -112375 -122954 -67652 -2183 18468 9016 -43069 -86804 -18130
17566 -18130 38170 15078 -58667 -118276 -100148 -26088 29488 90335 115103 69499 16261 -4388
17554 -4388 -39320 -12995 60608 92915 67857 77723 147768 127830 53656 24297 52748 70205
17542 70205 42508 -3705 -24328 3075 44027 33647 -40800 -60355 -1769 52350 74265 54338
17530 54338 -9504 -80531 -104187 -49088 5993 17333 -31277 -69074 -93504 -69047 -62315 -35412
17518 -35412 -22135 -10573 -8242 -2440 69023 119085 126930 74072 35792 29812 55699 29237
17506 29237 61129 54184 46648 23614 31725 46428 77692 87725 78673 44544 -14850 -28649
17494 -28649 800 35809 106624 103305 110169 51182 -16891 28743 48874 14835 -17717 -60853
17482 -60853 -53426 -77204 -89293 -107255 -83584 -71391 -66947 6169 51682 52676 47678 59065 52391
17469 52391 64627 71797 -13376 -55088 -2991 60981 63761 38474 11559 -21236 -38773 -44329
17457 -44329 -48220 -41440 -293 28401 -4507 -41498 -61804 -57033 -62962 -18003 -12848 7840 23880
17444 23880 52261 1699 -34157 37695 86246 48299 -42100 -82630 -94651 -76289 -26114 -13104
17432 -13104 -47941 -67558 -45529 -66173 -59543 -41098 -50299 -59100 -64016 -56426 16285 84746 79052
17419 79052 3642 -13546 -26556 54825 73612 110899 123618 4291 -120101 -94795 -94585 -113530
17407 -113530 -73570 -82900 -40290 -22417 -17347 -29657 -24075 -29407 3775 12792 -21617 -33538
17395 -33538 -47606 -24177 -23759 -29739 2047 -649 -53529 -57440 -43391 -33111 12741 -8234 -83200
17382 -83200 -38799 -47636 -94761 -49351 -20247 -55960 -88731 -108351 -134842 -128516 -102759 -77814
17370 -77814 -1689 64543 78172 65205 51012 60977 13287 9756 11201 -28756 -53604 -22041
17358 -22041 18293 2682 -31655 -102119 -82537 -22744 -12481 20722 60920 34816 26668 -27282
17346 -27282 -64596 -63615 -62045 -73787 -58448 -84458 -92310 -73041 24671 75923 70809 50718 20481
17333 20481 7159 -37349 -38980 -17171 31660 -9062 -32831 -65592 -63481 -44238 -32892 -38475
17321 -38475 -72927 -44942 -13502 -28675 4669 42239 74412 65743 56014 51816 40093 38285
17309 38285 66588 59201 30504 -20742 -11402 53209 91912 45061 -21392 -14990 -2412 25828
17297 25828 -24239 -29922 -9940 -59359 -83359 -50525 -39362 -50275 -6922 -16 30010 59464
17285 59464 -162 -48213 -77224 -70857 -42049 -4138 44522 76508 48035 3072 -33446 -54282
17273 -54282 -37808 -65 -8515 1806 4535 2819 21022 -19511 -10468 3364 -11483 -24292
17261 -24292 9825 29089 -21479 -62259 -56300 -91767 -128923 -64523 -13092 52868 103672 78234
17249 78234 56305 23255 53064 56292 68409 109673 121084 127941 29118 -11255 16305 56305
17237 56305 22603 47626 39968 -29148 -54885 -49651 -68111 -80860 -68286 -26237 -50009 -56450
17225 -56450 -10508 5004 30525 -14643 -56172 -51101 -48824 -22240 27386 83399 54893 -19262
17213 -19262 -80815 -87933 -21970 20295 2621 18948 96071 77780 75071 37937 55353 61911
17201 61911 48436 33583 33728 -26373 -35963 -56951 -49439 4751 -36577 -19906 40667 96328
17189 96328 63967 42673 23727 -22834 -22780 -34535 -7959 27368 32623 -23746 -80848 -98327
17177 -98327 -133026 -112475 -87633 -77623 -60705 -26664 3856 -33924 -56701 -53177 -34342 -42920
17165 -42920 -84549 -77312 -84688 -98600 -109866 -126076 -99367 -62672 -35314 8869 13264 15956
17153 15956 12844 -34906 -25603 -38879 -94502 -45911 -63254 -78428 -48502 -42108 -85088 -60002
17141 -60002 -73617 4117 22012 23391 -3594 -40357 -43468 -45619 -22977 -38020 -48693 -56328
17129 -56328 -22533 -5536 21895 74216 54050 -13840 -24640 -21116 -26419 -50985 -85511 -77881
17117 -77881 -6417 31661 -19051 -36664 -13001 -67076 -127628 -161544 -152160 -129431 -84668 -47407
17105 -47407 -18868 -98137 -141167 -155446 -116957 -175164 -198789 -85858 -35137 -53050 -26143
17094 -26143 -12679 -13348 -31958 -41169 -39783 -71199 -53166 -13048 -67629 -62903 -67947 -37617 -50259
17081 -50259 -65920 -58409 -59802 -52281 -49098 -40027 -33960 -50233 -52376 -53948 -29527 -20512 -52414
17068 -52414 -76000 -41706 -54387 -86119 -76369 -102001 -66415 -4071 -17211 -21432 -54450 -55536
17056 -55536 -42792 -47391 -27017 -5322 -2809 -37896 -62225 -51368 -39087 -38303 -32967 -36717 -28482
17043 -28482 -16460 1731 -12383 -22681 -22866 -4260 16009 60914 60578 46618 28669 -11678
17031 -11678 -24955 -6324 4784 20804 47150 25659 -16108 -18856 -21785 -31530 30683 91752
17019 91752 94663 32827 -14010 -14478 -9564 -39822 -36295 -49911 -59718 -74958 -33200 -22900 12850
17006 12850 -37492 -88838 -48189 -16379 9749 -33341 -53171 7780 34805 14420 -41896 -59300
16994 -59300 -81417 -69765 -110221 -125311 -80983 -115254 -91944 -43547 -68421 -32255 -10036 6806
16982 6806 46141 61432 73929 17670 -42358 -63535 -40306 4458 28747 12999 46670 16705
16970 16705 -56528 -80458 -29470 -846 -29751 -69247 -80333 -51926 -5269 -1729 13565 50490
16958 50490 42762 3134 -49465 10485 47647 66144 78457 21025 -26077 -19234 37060 115147
16946 115147 52514 -15172 -20581 12577 17777 5828 -39431 -27831 -26204 -85902 -83586 -66684
16934 -66684 -98974 -144520 -112766 -60968 -18120 -5822 -60605 -31185 12313 506 -58660 -76491
16922 -76491 -113581 -124209 -104861 -57079 -27970 9936 3863 -18240 -9749 -621 20339 16977
16910 16977 59415 51387 20385 -45472 -17825 14794 9196 -13829 -94581 -80899 -31969 -49385
16898 -49385 -31929 -33336 -32202 -51654 -71520 -94800 -54571 -24702 -43545 -18199 14022 -45652
16886 -45652 -37604 -54774 -104729 -148594 -76933 -39769 -54912 -69159 -44912 16630 37813 50621
16874 50621 31644 35825 30126 -48 -24178 -34315 -69268 -79976 -49805 -43821 -55153 -71738
16862 -71738 -66963 -64949 -97668 -125782 -154522 -94632 -23942 14220 -20511 16032 36180 3674
16850 3674 -7404 -33941 -52402 -11684 -10993 -2578 -32772 -78845 -132814 -112389 -61910 10964
16838 10964 12747 27536 41620 76205 107708 115571 113050 67225 38724 53653 30669 18343
16826 18343 -44796 -17562 73859 43920 54651 85582 63287 59271 22460 14924 49207 45763
16814 45763 -16745 10904 64247 84615 61872 51121 39957 59116 96128 31249 -41578 -94844
16802 -94844 -80844 -51180 -69229 -102172 -122079 -60371 -18608 -25816 4481 9627 -29717 -33454
16790 -33454 -111644 -175591 -130466 -100682 -130553 -121823 -98981 -13825 34084 9633 14278 37466
16778 37466 24344 -65997 -61308 -48589 -65967 -96318 -90179 -44940 28685 9453 8284 52011
16766 52011 51548 38487 68151 30607 5397 -19028 -16054 43293 52125 56148 38184 41104 18576
16753 18576 -14984 24097 32200 43767 31385 -3924 -58949 -78045 -31016 -13776 -6440 -29223
16741 -29223 -100758 -121 82293 38802 -20308 6626 -2982 -16851 -17067 -7553 -15690 -16172 9434
16728 9434 5023 -18212 -20783 5425 14042 -2654 -41385 -9234 33680 28532 14918 -72816 -88294
16715 -88294 -105883 -45384 -61265 -94469 -77374 -28647 40218 47758 34689 12551 30307 32873
16703 32873 57251 102477 40387 20376 50479 63739 13435 42029 69451 91074 104606 96981
16691 96981 25118 -23340 -19391 -33191 -21080 -10311 -17308 -37712 -31366 -12482 -38421 -50447
16679 -50447 -92010 -81289 -8577 -29845 -68384 -78841 -119856 -116109 -39353 31474 -12796 -25631
16667 -25631 19951 28712 56863 87852 67364 20465 9809 -29565 -22744 -6094 -4228 -19989
16655 -19989 -31746 -18352 56907 29898 -20695 -140089 -139500 -92459 -42611 -42216 19253 49129
16643 49129 44168 34189 36389 34515 -12776 -40131 -36534 -46291 -105752 -130498 -72927 -66740 -62800
16630 -62800 -21731 -35690 -56100 -62102 -88469 -63241 18524 17594 23973 -13563 23289 32283 -9452
16617 -9452 12153 23572 22840 -101570 -110947 -68516 -66822 -98479 -56058 -20230 -30548 -12354
16605 -12354 -55765 -98580 -91893 -79834 -37374 -49872 -19233 -4278 -25772 -47731 -47265 -73703
16593 -73703 -50370 -76500 -36005 -5473 -37583 -52933 -91098 -92487 -70335 -75039 -76170 -48976
16581 -48976 -44478 -58979 -16675 4176 -86958 -114757 -67054 -19304 -12134 -14179 28022 8423
16569 8423 -45978 -2857 -11689 1565 -31183 -37239 -37681 -17128 27542 33837 22895 -58307 -19033
16556 -19033 -7877 17039 63235 43362 20703 11101 -25457 -58849 -72258 -47902 -34962 -9231
16544 -9231 -31519 -60518 -61019 -16982 46691 63073 36147 34826 32852 19369 36109 28632 16766
16531 16766 16371 29857 6834 367 78911 46267 -9330 -24967 30820 13761 -46797 -49274
16519 -49274 -45922 -59240 -110444 -126578 -67701 12721 -35902 -78803 -20255 17149 -2314 35402
16507 35402 57785 54168 38386 65482 44070 -3120 -3222 23280 14914 898 -34757 -61049
16495 -61049 -66729 -82457 -67459 -57587 -43227 -59945 -33469 -59212 -23573 61471 66131 73441
16483 73441 45346 34236 -1222 -6366 31283 60155 25187 29664 60460 78192 45089 2706
16471 2706 3916 19909 -13700 -19919 -16220 -40096 -79234 -86931 -27006 -47889 -87566 -111878 -100393
16458 -100393 -100016 -101758 -39934 17210 35428 50037 29643 32064 71184 24812 -23625 -78494
16446 -78494 -101760 -121506 -90304 -59310 -78424 -71330 -59297 6838 57863 14524 -44282 -74667
16434 -74667 -68712 -67812 -63540 -57526 -85372 -98279 -58041 -6243 -54392 -79207 -49750 -63317 -102058
16421 -102058 -47848 -39439 -32167 -5641 -21791 -61290 -50756 -5182 -54809 -72498 -72525 -121007
16409 -121007 -119657 -87992 -65267 -41499 -34701 -53817 -92354 -22065 46342 44816 66279 56289
16397 56289 -2424 -47434 -13877 18203 7571 -25435 -34387 -97022 -117595 -45803 37380 32558
16385 32558 9347 -22238 -46935 -16448 -3345 38006 10448 29319 942 -66776 -61679 -33136
16373 -33136 -13792 -12542 -17713 -62201 3357 -1902 11206 27382 -9941 -40209 -45969 -17497
16361 -17497 -52143 -80642 7470 64221 69180 12065 19392 -3476 -23782 -12299 -10680 21014
16349 21014 -10548 -36524 -49939 -39019 -87560 -77151 -42794 -63615 -85350 -49437 -45649 -9819
16337 -9819 -25069 -39200 -30173 -55316 -22838 -4518 29773 3316 -21351 -34881 -56937 -10126
16325 -10126 -3951 9389 67270 35814 -79278 -135503 -127231 -100966 -134265 -108256 -96459 -109894
16313 -109894 -47140 -26830 -18057 -17909 -45094 -7540 -36292 -95559 -95095 -28691 53636 91495
16301 91495 80585 88788 25365 -7262 1525 33306 47734 67385 -10251 -33448 24522 31329
16289 31329 -19274 -44183 -56061 -61639 -139589 -121587 -118694 -86750 -99395 -77768 -48803 -16471
16277 -16471 -55666 -64614 -45778 -26502 -11508 -3440 -1449 20841 59306 30472 -38897 -119974
16265 -119974 -142512 -125299 -114852 -88946 -6405 -7100 -54651 -40759 -24366 -23586 6583 -12018
16253 -12018 -953 22820 8723 -477 -21308 -103997 -152669 -46315 19274 -14094 -55006 -78059
16241 -78059 -97537 -84720 -75646 -70971 -63211 1425 8330 32975 50230 -3182 -23155 -4318
16229 -4318 -32045 -11699 -1785 -21548 -31110 -53104 -76871 -43890 -26247 -61278 -29450 -14551
16217 -14551 -20601 -43267 -42877 -78501 -66266 -38930 -15775 5586 2676 36528 17224 -26588
16205 -26588 -12950 14078 -5711 -18049 31100 18871 6289 8925 19352 45830 44788 -25092
16193 -25092 -43569 -44325 -107097 -134424 -158639 -108190 -84025 -18335 -13095 -12728 -58630 -49046 -65113
16180 -65113 -70336 -31923 -55263 -59018 -44382 -26102 -12 6827 43120 38994 -3759 -23087
16168 -23087 -58842 -43372 -19498 27615 477 12401 22499 21790 12380 4845 -12679 -82518
16156 -82518 -67957 -11843 21818 9991 29339 -6662 -79136 -96884 -67117 -12015 -33600 -47883
16144 -47883 -34461 -37444 -49574 -84731 -51172 -76699 -85555 -69253 -58267 -85240 -136619 -109139
16132 -109139 -72169 -93370 -52487 6774 11152 -1508 25292 -5099 -54253 -116936 -81160 -82569
16120 -82569 -88115 -63747 -4426 10083 31834 20298 -26381 -81442 -93622 -35649 -51453 -77008
16108 -77008 -78321 -51499 -33528 -42329 -47829 -52328 -107361 -119413 -96540 -146779 -102880 -20017
16096 -20017 23783 50601 5020 -39340 50903 126075 128520 90739 8238 -22828 -48946 -56033
16084 -56033 -39248 -37895 -39306 6453 -266 24205 33764 4708 -40937 -62705 -65064 -87467 -35689
16071 -35689 -1081 -11052 -51835 -63320 -78421 -61117 -29613 36510 66251 34248 -38073 -92406
16059 -92406 -36256 -11862 40437 68057 -17403 -22984 -13062 11390 75496 75085 41129 -26156
16047 -26156 -47065 -7915 -26543 -56411 -36422 -47572 -68024 -59957 -80120 -111186 -62008 -36707
16035 -36707 -70979 -98787 -73780 -38480 -28591 -57786 -21749 16340 -30988 -107927 -74103 -10495
16023 -10495 52921 60773 108213 114794 79968 23545 -57898 -122377 -63551 17086 37483 -12590
16011 -12590 37399 82212 34053 -25067 -76929 -85930 -20870 -16556 -4433 -47718 -38437 5486
15999 5486 22411 13450 2418 -19025 -38238 -9099 111348 141153 108597 76616 72015 51091
15987 51091 -8144 11443 35650 34796 2803 -11941 11063 12057 81671 104869 36207 39787 48637
15974 48637 -21968 -85264 -80653 -2313 12877 -5213 43238 34719 -5801 -17788 46413 48747
15962 48747 51745 65277 18669 -27646 -60534 -84764 -83009 -52368 -16758 -66281 -89429 -25974
15950 -25974 -55122 -108276 -60923 43945 56713 -49934 -102716 -113743 -120598 -77074 -71598 -62279
15938 -62279 -12898 13976 6800 11617 42988 60987 32562 15575 -1873 -12777 -34024 -3008
15926 -3008 -15825 13878 38405 -17098 -23202 -40458 -52373 -11144 -8425 -46777 -64404 3022
15914 3022 85051 106271 73981 31580 18819 -26186 3983 14489 -17722 -42668 20605 69858
15902 69858 83788 42769 82784 117281 132521 110577 79483 121023 94682 38285 11841 -15446
15890 -15446 17292 9929 35494 16580 -9625 -13525 -30671 11851 63696 77874 50008 31185
15878 31185 24120 57781 21484 -1956 -5364 14236 29184 -12510 -45097 -58262 -65659 -48537
15866 -48537 4883 44651 15081 35745 20160 5502 37184 -16437 -73735 -79362 -112149 -109437
15854 -109437 -100535 -160320 -79244 -5036 -56997 -81131 -55483 -5834 32890 41087 5153 -61758
15842 -61758 -133960 -157669 -94849 -10559 -24367 -25025 16470 56476 84084 66951 19942 8013
15830 8013 39912 58610 29359 28124 -55629 -92338 -73432 -43751 -47267 38533 57565 34104
15818 34104 3586 1470 -2544 -71305 -63661 29326 45975 79421 126862 122554 30536 44827
15806 44827 80736 29339 -8031 -52668 -98399 -57459 -85518 -58493 -38398 -70659 -50494 9947
15794 9947 94399 89673 8092 -53250 -35266 -43299 -44011 17540 102908 69845 -4899 -35239 8028
15781 8028 45532 42426 25461 43271 26169 28105 53534 31006 -9608 -6548 30173 27801 3043
15768 3043 -15122 -51646 -69506 56071 100327 52780 59816 29000 -26822 -63822 -27735 10370
15756 10370 15876 -22581 10129 97561 77422 -14279 -41842 -38265 19506 31085 6618 -45735
15744 -45735 -40500 -70095 -88155 -57167 -17949 4159 -23978 -29383 -27309 -15693 -40867 -38321
15732 -38321 -30932 7926 -25155 -41147 -11873 19885 -27957 -29706 -7100 -38033 -9296 -934
15720 -934 -45965 -103197 -74013 10287 9366 -58013 -116232 -95749 -33006 -33595 -105187 -59158 -62402
15707 -62402 -43109 -45213 -46994 -18457 -5426 -15180 -70073 -48197 -56557 -79244 -151743 -182045
15695 -182045 -168298 -160049 -71443 -21304 -59400 -53370 -87125 -61404 12187 32017 17927 7414
15683 7414 -8440 -42657 -3981 66300 78574 69481 61379 16989 -65910 -90324 -132488 -137443
15671 -137443 -88543 -84031 -64742 -58913 -17450 14646 22416 17681 -61150 -130559 -135848 -35554
15659 -35554 -45769 -53584 26088 33211 23142 22525 -23717 -37339 -77838 -65111 -58591 -64615 -20974
15646 -20974 19058 30088 29093 41539 47324 45582 25599 14412 -1060 -7757 -25592 -40112 -24520
15633 -24520 592 -40327 -60989 -89754 -60838 -100221 -59243 -73167 -68494 -118755 -104362 -92348
15621 -92348 -82006 -105584 -104268 -62044 -35259 -69673 -126705 -109599 -80972 -55991 3744 -75003
15609 -75003 -132313 -117719 -89648 -113658 -86335 -11698 21689 43592 23385 -23568 -66699 -63635
15597 -63635 -7750 29786 14398 51529 40917 -27238 -48175 393 15181 -14321 -33827 -29377
15585 -29377 -6746 32935 40186 8033 46586 59943 37985 -69266 -59717 -65249 -43120 -58951
15573 -58951 -32684 29521 23109 -11769 -12983 -46095 8652 89947 65688 1849 -39552 -27918
15561 -27918 -19026 -18432 -11328 17364 67456 60812 60115 85872 13789 -34591 -46250 -41331 4379
15548 4379 33482 10795 -33073 -42754 -46742 4813 48748 44286 61918 33034 8652 -5596
15536 -5596 -37856 -47831 -18946 42314 129522 124992 75135 84762 22519 -99708 -70987 -326
15524 -326 41516 71094 62435 60655 46833 30640 32866 65317 37422 23444 15096 -7631 -33281
15511 -33281 -74870 -60313 -32423 -56277 -92205 -68258 -48651 -35792 -32457 -46718 -71124 -63949
15499 -63949 23026 47056 17777 -18504 -34204 17336 21568 29599 54092 -27256 -26028 -14295
15487 -14295 -13170 22484 56969 -7277 -29707 -23042 -6805 -17704 -74645 -114128 -49602 -7088
15475 -7088 -63084 -123464 -93779 -71197 -67561 -50922 -15904 9212 -24765 -949 -352 -24277
15463 -24277 -40632 -81581 -114719 -108492 -57141 -31108 -46062 -83083 -36313 43797 23326 7920
15451 7920 -13183 5490 12039 -18937 -7829 -22509 -32371 -50201 -80954 -43254 -49278 -30844
15439 -30844 -42544 -26116 -47637 -39409 36490 -3572 -3481 -58615 -63139 -14236 -71865 47204
15427 47204 61421 12253 -73488 -68331 -78492 -50830 6950 -19136 -42674 -21433 11285 -40427
15415 -40427 16269 39414 -10526 -46608 -52728 -41956 -36236 1717 -6148 -1801 -4057 -24164 3262
15402 3262 55355 25022 4232 -46098 -52385 -80449 -72260 -49523 9202 49944 12129 27623
15390 27623 -47468 -82479 -43403 -69994 -54002 -12191 36281 41551 59967 62435 44466 16541
15378 16541 -27390 -78767 -79618 -65223 -38208 -12808 -42366 -154779 -129646 -75253 -54839 -93827
15366 -93827 -79685 -45010 27928 56416 10947 -35593 -81339 -83114 -62959 -29734 -20394 -47627
15354 -47627 -17797 6656 -15771 -37223 -56618 -82984 -41967 -44751 -82641 -89573 -33019 -27361
15342 -27361 8435 42449 58651 10899 -5422 -19360 -46996 12863 50302 51761 53442 -9592
15330 -9592 -20061 -49564 -22254 48981 76223 107417 85466 46349 49930 61292 73274 28541
15318 28541 47244 21654 51386 79768 52083 66656 69069 -7147 -56425 -71063 -137468 -99366
15306 -99366 -66905 -61679 -97510 -103570 -97762 -55376 37054 23938 -15833 -9507 34675 29884 -22904
15293 -22904 -80772 -72309 -63519 -39931 -6845 -371 -38190 -17397 33236 43932 45670 -9939
15281 -9939 -28171 -55608 -89184 -124279 -134792 -106348 -83348 -87241 -50516 -25405 3115 -7271
15269 -7271 -54008 -22287 -21010 -94447 -128963 -151063 -165957 -141162 -122057 -67239 -74361 -83819
15257 -83819 -47328 -34279 -41622 -14882 -46147 -16668 -14830 1910 -53063 -67768 -38677 1249
15245 1249 -21565 -38557 -66927 -111297 -100434 21291 85799 74744 55627 45418 28576 -12182
15233 -12182 18407 21574 -21161 -41825 -35645 -6437 23315 -3865 -33870 -15681 33310 41239
15221 41239 56739 51862 -17609 -84960 -78311 -80750 -68890 -59605 -92368 -67657 -46482 -14337
15209 -14337 6306 46725 -7706 -34458 33968 67762 49559 34797 43946 39912 -2126 10717
15197 10717 -23135 23330 -1376 -27746 -34214 -35320 -19235 10313 45832 93348 77866 9123
15185 9123 -8900 -14213 2309 21252 8287 8999 -38550 -11533 21062 47064 70344 80571
15173 80571 13268 -57677 -61393 -59242 -56035 -74501 -49871 12736 67408 104049 73176 52612
15161 52612 55774 95247 86039 45315 39017 73876 6986 -20684 -19780 -22143 -38846 7347 54902
15148 54902 69538 18881 22748 26377 -48547 -94840 -43260 -68783 -65434 19422 56285 79748
15136 79748 87851 59066 92078 80357 -591 -21302 52728 33596 22969 84147 81659 61049
15124 61049 23795 -25201 -8613 33464 37052 -258 -47341 -43701 -21916 27475 60056 53787
15112 53787 26926 33487 59204 58524 75904 24842 2434 6613 2612 18152 31186 39466 50635
15099 50635 13915 -46591 -41508 -2579 -9107 44280 49157 17051 10213 17932 -20995 -20618 -18487
15086 -18487 3447 -11602 37681 33695 -6321 50756 120110 90510 56322 54024 41249 39121
15074 39121 3933 2472 -11862 -10408 -34190 12068 50059 24753 -12524 -24898 1729 -5021
15062 -5021 -24113 -52346 -64353 -92727 -117564 -82742 -41127 -23175 -26030 -16837 17219 -8977
15050 -8977 -33847 -28054 -48937 -62923 -28660 22469 -8147 -10141 -12670 -15899 50397 -43180 -52705
15037 -52705 6362 19034 -17056 -8465 -7952 -16969 25409 -15507 -48750 -24991 -30585 -15155 51220
15024 51220 84973 111306 79662 -5585 -12454 619 -17399 -9271 -23215 14908 43776 20615
15012 20615 45432 86363 60001 14624 7636 -20627 24450 29342 -6249 -14818 -68692 -112255
15000 -112255 -109626 -100182 -98718 -58908 24492 125497 118948 54390 25022 18234 24073 29284 16291
14987 16291 24752 74969 64926 64844 28827 21505 27866 60271 15716 -9237 1399 58804 103934
14974 103934 20642 -39812 -67536 -66924 -49422 -33686 -18342 27464 -25491 -52383 -52069 -51580 -66702
14961 -66702 -40901 4937 7591 4859 -52929 -94972 -122314 -77003 -21594 -1022 -16717 -4257
14949 -4257 -14736 -39110 -9970 -65410 -49368 -50368 -76262 -30891 -699 -35297 -7142 25863
14937 25863 -25949 1850 1501 -15599 2902 -6722 -88776 -106163 -70456 -30244 -55728 -39945
14925 -39945 20671 9772 -38263 -16075 -43489 -40736 17578 39590 56330 17896 32987 84351
14913 84351 67327 37017 18989 -37972 9762 79290 73073 122742 99035 19202 63482 64178
14901 64178 -580 -33332 -43259 -3492 24657 10240 -10756 -39661 -26603 -27114 -52049 -86871
14889 -86871 -67846 -64966 -24735 1959 -50492 -26952 -875 7759 27111 56826 50214 -1747
14877 -1747 -76854 -120775 -110446 -42133 -84333 -84014 -76690 -109157 -118889 -121964 -66719 -63894 -73844
14864 -73844 -61958 -79016 -30295 29671 24404 42966 -26105 -80121 -22317 43554 105169 88198
14852 88198 64451 52602 57074 78511 60384 60149 31021 -25230 -34610 -7688 -36493 -89957
14840 -89957 -94268 -63153 -35230 -3697 15395 -26514 -9057 -37213 -407 36826 129313 131215
14828 131215 77839 71108 -557 27950 99722 91663 46190 53713 53111 40066 42315 6735 15410
14815 15410 23186 -11721 20190 8298 -23903 -34956 -54006 5393 -47204 -63501 -50648 -53992
14803 -53992 -84958 -119584 -152809 -143458 -94913 -30612 -30352 -60418 -30578 -53551 -37762 -78172
14791 -78172 -127134 -106366 -95779 -64165 -45260 -82757 -27706 33707 -25941 -70570 -6342 4373
14779 4373 -2279 -59093 -73003 -57207 -40624 -13954 -11702 -56559 -104634 -42639 -5060 -12900
14767 -12900 -18343 34989 13047 -62763 -119887 -140138 -81132 -17023 7104 46028 -21931 -32945
14755 -32945 -38319 -36824 -31863 -35366 -31461 15604 -335 12283 17613 21090 -21690 -6856 -400
14742 -400 16369 8584 7639 62275 95373 38574 17047 19888 -23583 -92166 -94838 -73623 -32428
14729 -32428 22752 -10418 -56530 -14710 -3538 -21659 -30911 -5264 35834 42521 74560 78824
14717 78824 38289 51878 123710 76368 12939 -28394 6464 21459 -37573 -71287 -77617 -101603
14705 -101603 -63643 -15572 1271 27941 48970 52531 23336 -19840 -3396 -60549 -65223 -98911
14693 -98911 -89742 -67732 -39695 -3902 -11674 -22075 -1148 -36463 -31642 16305 62626 48468
14681 48468 37731 60699 32648 -52714 -41391 -33412 -113779 -119858 -15986 45488 11387 -63089
14669 -63089 -59456 -64709 -100418 -93664 -60222 -46211 -41507 -13470 22636 48899 56280 -15964 -33017
14656 -33017 399 35679 54873 20207 2499 24318 6642 929 55375 96870 48821 24788
14644 24788 -23182 -61565 -36861 -66816 -57144 -11809 32204 -3653 -12814 1022 35592 74002
14632 74002 90338 71917 61495 55817 -47458 -72233 -63510 -46571 -38619 -49989 -51749 -125881
14620 -125881 -112979 -77440 -62761 -51299 -36274 -89373 -188692 -200248 -169968 -178013 -218063 -217675
14608 -217675 -150746 -125864 -88547 -87488 -20394 -37053 -52196 -67649 -46555 -13873 5309 1531
14596 1531 -31133 -111451 -53154 -41647 -15725 15094 7134 58914 69228 53490 44264 2817
14584 2817 1086 18155 37377 32592 90822 113285 97900 92817 99942 99891 38718 28868 -18134
14571 -18134 -10069 -49836 -23629 -32416 -64093 -31469 36957 -50863 -75287 -88745 -99549 -101369
14559 -101369 -72680 -71375 -18709 32026 104994 82132 72277 61874 61156 47706 -3445 809
14547 809 28764 39194 23661 42448 14081 -13157 21460 -15676 -54374 -59791 -14625 44838
14535 44838 98513 118336 21469 -29668 -13777 23076 37005 35434 15974 -23539 -15428 -15066
14523 -15066 10139 -35426 -60596 -24044 -32861 -62616 -24809 48758 12523 25903 67246 54969
14511 54969 45370 62239 89128 19645 -59121 -36624 -25386 -59488 -24158 2753 12971 -14777
14499 -14777 -73762 -20966 25820 41960 15403 35727 39447 61687 18497 9948 23442 19755
14487 19755 -26091 -51744 -7047 19676 4309 -22331 31828 64702 59304 97884 76426 61994
14475 61994 56046 26870 1862 -25435 7141 17095 -17911 -36466 -22401 -25219 -36610 -77432
14463 -77432 -118341 -114741 -44515 -22823 43756 61539 26512 41680 53436 26908 -1603 17059
14451 17059 5655 -7147 -17587 -26190 -15727 -8445 15411 7295 -7124 -37754 -98801 -49597
14439 -49597 -34253 -70129 -73601 -62917 26992 47354 2072 -12377 9190 9180 -5159 64767
14427 64767 87345 5366 -120991 -124488 -23664 85165 76902 25369 -96 30539 14993
14416 14993 -12174 9079 31880 26182 50996 32822 -18440 -52615 -94751 -82825 -56227 664
14404 664 9725 5570 -15203 -51066 -35015 -70841 -105260 -42797 40975 -6751 -22719 9574
14392 9574 41222 54408 4428 -48105 -38283 -10337 -8581 11450 18120 -13926 -52924 -17134
14380 -17134 -2075 59785 44591 -7144 55543 80653 43966 30277 16885 9861 13398 32866
14368 32866 12051 66298 106467 75313 31652 17699 64585 6789 10074 68757 -56 -51095
14356 -51095 48505 56799 28438 -29435 -15478 27697 44142 86783 103554 56469 40308 7670
14344 7670 -12100 -23674 -20336 -47414 -53660 -71666 -74358 -37302 7302 43416 24120 35144
14332 35144 60408 112889 88759 62166 -25126 -91968 -77564 -72956 -68757 -37469 32005 85838
14320 85838 57648 49584 9410 -22741 40094 111404 138838 100889 49498 -1549 11076 81676
14308 81676 78816 7934 -13214 -19495 -89044 -141343 -208737 -188158 -55017 26565 78114 43356
14296 43356 3272 -45374 15980 82325 45421 -39382 -92117 -69044 -70733 -65147 -57474 -86433
14284 -86433 -74777 -24352 -2780 -34452 -37960 -573 4149 29501 -3826 -58802 -120160 -61747
14272 -61747 -31381 -43398 -71476 -27716 18360 1533 40719 17782 20237 22784 11332 -10398
14260 -10398 -29964 10373 70592 12489 -13185 -32819 -55708 -8155 -34901 -6468 20288 58063
14248 58063 31105 36756 71078 47174 17440 -1652 19876 35230 -15635 -3136 53788 91483
14236 91483 55004 8174 43651 25131 -25561 -10909 18487 35511 91369 127313 84782 73533
14224 73533 40567 45028 12364 -8792 5681 57007 68851 51254 -15554 18742 49412 28640
14212 28640 29372 39289 9203 39027 69251 28471 19304 11079 -2466 28877 7018 -79902 -80708
14199 -80708 -12731 7910 17509 25166 42899 -29660 -60654 -59506 -31441 14702 15911 -28223
14187 -28223 -17943 -23205 -45333 -37556 -31689 -25024 36990 48986 40232 -11323 -23535 -51949 24645
14174 24645 53711 13125 20892 61371 103930 105036 65603 76284 62735 56787 81681 108492
14162 108492 66621 103092 89461 48816 37811 -4379 -40352 23368 51451 48083 17373 -6832
14150 -6832 19447 35386 5635 -18287 -26673 -1445 43595 55539 48900 -2181 53991 113430
14138 113430 126036 45704 14188 23029 5681 -59238 -79110 -1723 5675 -33735 -14169 1339
14126 1339 -16290 -23711 -1899 -28837 -31250 -65083 -61789 -59399 -9603 33807 39442 26664 13523
14113 13523 -36718 -72727 17395 62637 73043 100125 45886 -7717 -39334 -23007 22577 37967
14101 37967 56644 40305 26898 70413 107231 43949 -32962 -22911 14807 47032 -23382 -13767
14089 -13767 58830 43981 45402 76877 56048 15181 4893 12007 -12588 -16919 -9356 -5427 -27380
14076 -27380 -18162 52756 13110 -28729 -74997 -43872 10261 62059 67316 40505 -8056 -32727
14064 -32727 -13470 35254 42022 -9485 -47729 -53938 -3670 76926 79817 65779 82002 78619
14052 78619 95870 352 -75072 -42005 -33626 -70232 1795 31448 -8655 13743 44659 70794
14040 70794 78189 80375 65309 40620 12358 -15128 -42324 -72097 -77660 -38157 8018 98551
14028 98551 51363 -27091 -18833 -65996 -26997 -24698 -42062 3295 2093 14893 13442 31371
14016 31371 50631 8232 -38816 9719 -7919 -23718 -45611 -87352 -54920 -14710 -31558 -25688
14004 -25688 -2651 7829 -6685 -68882 -66975 -769 37407 12815 9007 29321 -31745 -45600
13992 -45600 4066 29716 9656 61962 93007 27841 -23875 -66400 -29227 13974 66102 100162
13980 100162 62725 98671 140903 111776 44008 -53159 -59615 -61697 5503 61374 22876 -14104
13968 -14104 -48671 -3744 -35346 -42496 3216 8517 -30567 -35436 -49026 -3668 -11262 -71701
13956 -71701 -65072 -6506 -5083 -823 27110 43605 69076 62356 38522 56592 -102 50339
13944 50339 69750 52338 -49228 -125841 -104401 -66805 -77705 -24698 41505 88701 117945
13933 117945 89516 14682 5234 59967 52033 48010 60997 36935 56157 78096 55679 -13031
13921 -13031 -22598 -5985 2888 -77038 -124806 -91585 -92029 -64822 11288 52815 80660 92984
13909 92984 8148 -13721 6745 -1134 24673 29198 14810 -11055 65330 35961 46067 27053
13897 27053 36849 74292 51823 45696 36705 31802 9301 -17692 44928 97910 48897 -29931
13885 -29931 -10341 -39963 -1041 43283 16939 34101 13914 -20689 1440 33287 22706 5619
13873 5619 -3389 -27022 -24929 -43334 -69750 -102999 -103721 -107903 -84594 -51241 -46556 -52731 -24563
13860 -24563 -41793 -10094 4570 32389 6057 -28008 -50481 5975 45571 27347 -20915 -53414
13848 -53414 -1997 67320 80186 42085 15442 -19555 -20421 10548 -11086 -24603 -1791 54889
13836 54889 64908 41189 44477 -3879 -20697 -2165 3351 36916 28572 11648 17951 41845
13824 41845 -34173 -77633 -15590 46946 -6105 -70038 -40122 8325 73161 37755 23727 -2743
13812 -2743 165 8202 -1591 -32648 24656 44658 9654 -35203 21523 45079 27526 29654 3462
13799 3462 19193 81741 50412 9743 29278 37794 33162 19327 25878 69343 32794 49555
13787 49555 79957 27702 -76901 -91948 -31815 451 -4230 14906 -22764 -3786 10545 23733
13775 23733 47821 55303 66940 -13574 -39362 -32323 -19956 32776 49085 47767 10553 -50492
13763 -50492 -60025 -46129 -46414 -71777 -128450 -102204 -48519 -77244 -102055 -111297 -18999 145828
13751 145828 111917 23861 12560 33061 94696 101988 43853 36584 58816 53776 -17069 -60670
13739 -60670 -32089 27278 62062 70286 50852 16064 -15336 -47749 -67660 -71050 -70733 -74717 -21531
13726 -21531 13775 24490 9554 -5637 -19673 -19935 -31059 -70810 -77826 -46101 -53653 -39030
13714 -39030 11735 39081 54228 25482 72689 86441 45193 -14435 -18085 48741 33983 -15779
13702 -15779 50896 86521 50407 -7329 -35471 20236 15634 26315 31383 24641 29005 101697
13690 101697 113733 36860 21408 76097 82558 96370 86214 69497 62598 52941 -23419 -20690
13678 -20690 13478 -33567 -52930 -80 -42795 -123656 -94901 -32706 -14552 5276 69744 54475
13666 54475 49306 72549 39361 11919 32833 74657 114633 104979 103706 50244 -22054 15867
13654 15867 30612 23895 8655 9051 3896 -1070 12307 65289 80573 61995 13629 -40396 -33165
13641 -33165 -69877 -19127 33463 45737 50173 69389 46705 57116 52185 16848 40822 82008
13629 82008 102683 112530 114947 127338 85073 15818 4019 6083 -72712 -93208 -94584 -44264
13617 -44264 3256 -1663 6164 17845 1430 -45412 13607 46553 54206 -771 10376 15865
13605 15865 11133 32347 48931 55659 42936 89492 153698 127256 87096 89314 104409 28172
13593 28172 47918 49252 -28286 -22625 61490 61840 59708 58876 52761 69227 144325 99903 94933
13580 94933 119988 109938 55276 54438 84794 91945 100142 62081 35243 39474 49535 40601 75310
13567 75310 23666 57692 122847 106817 99759 114572 151705 163050 117672 92858 113905 122382
13555 122382 97903 24078 -1185 -31580 -26469 -62304 -73375 -7232 59971 83850 48648 -24715
13543 -24715 -11284 -33036 -13296 20419 83654 56174 94501 66055 51665 59402 12751 -71431
13531 -71431 -106386 -78718 -21980 -9631 -35262 32422 100137 79548 87463 -12082 -28006 21296
13519 21296 -5061 -30761 -41475 5544 16729 8193 -28211 10634 38439 -18344 -23720 -49750
13507 -49750 -29854 -61125 -13242 69211 86525 68880 19030 -18172 -32153 -18673 19783 48632
13495 48632 60321 59797 23130 18511 39514 52404 48973 47857 12098 12830 -20057 -77187 -72257
13482 -72257 -64015 -28977 22091 41703 40291 32340 -22146 -21057 -253 -16992 35117 65560
13470 65560 69706 56098 65528 86284 14444 -37753 -15169 79321 77725 49216 20849 38766
13458 38766 42017 63752 65675 31232 -18828 -17099 -80949 -36378 7080 1752 -29981 -22062 44405
13445 44405 49579 33914 75106 105191 77649 28146 -13606 39867 16170 -26997 -56849 -45356
13433 -45356 -19977 18813 90030 73045 36257 66203 68489 51590 774 -69350 3445 33982
13421 33982 10139 99442 161396 147260 104390 82219 120837 193341 177903 144654 114768 80891
13409 80891 37483 23762 35533 73592 81737 77652 59922 33591 -19388 -34519 9343 54537
13397 54537 93582 141144 150601 42680 -15859 -11176 55633 87725 93858 109351 77028 32603
13385 32603 28614 18108 33531 29626 50533 -10280 -88719 -79594 -48067 -15967 26585 33379
13373 33379 9328 51888 49799 51184 48648 31261 66755 50960 -2832 58314 91007 77482
13361 77482 37400 17421 75656 96440 22275 -20773 -54510 -49492 -17351 -9552 -4600 -11631
13349 -11631 -21533 7486 36412 31055 25176 29177 -10559 15871 67179 36550 35403 94679 85516
13336 85516 10347 11365 257 43558 66585 41767 64325 36500 27863 9191 -62376 -25849
13324 -25849 -3496 24859 6642 58612 62710 8255 11583 45364 64082 17175 -13129 -6561
13312 -6561 -12285 -9139 -69943 -41762 -12144 6705 -18497 -35562 -70472 -23465 14403 40565
13300 40565 65465 78920 106784 181677 215566 263883 205706 113355 119085 147094 137328 82090
13288 82090 68493 22970 32623 117863 107625 56890 28399 73808 106893 94202 63707 60974
13276 60974 131326 145475 96717 55226 84175 122089 157572 118129 92319 116911 132054 131072
13264 131072 112443 103069 22058 10963 -428 -10642 24569 67275 71168 68053 77815 107197
13252 107197 144928 107517 76998 85249 104671 81535 71452 33875 3086 14536 93935 133852
13240 133852 150620 101565 69626 -44409 5017 27674 45113 78647 114220 138026 104181
13229 104181 35879 8101 -256 43828 85545 117562 113545 139318 134324 79402 47375 9774
13217 9774 44774 72261 155941 144703 91916 74534 120086 130876 141583 102328 99109 76442
13205 76442 85384 88611 72308 31589 25352 86059 115026 142141 125881 132790 98250 106293 143423
13192 143423 174075 224561 166654 112288 90520 94932 64707 81049 50172 36739 92496 53744
13180 53744 44639 105575 91701 78183 38037 12971 83624 112504 123572 69481 79771 127079
13168 127079 114276 111500 125841 136009 147563 131484 67608 29318 17267 15375 19274 77398
13156 77398 99723 91361 82576 46762 37061 65981 98498 67749 13612 20809 270 78774
13144 78774 145420 152838 138719 135735 130522 80614 68742 78999 126020 75217 23741 42442
13132 42442 43121 2505 80300 152006 108470 52888 72131 86120 109727 88677 54009 7911
13120 7911 10148 46356 29145 111436 136520 112378 82969 86541 69525 68327 107398 48608
13108 48608 -32037 9374 41498 66215 27627 31799 74085 126355 106078 58548 59348 45180
13096 45180 25126 51261 111678 123839 111196 54983 -25103 -64769 -7088 99924 93942 50949
13084 50949 49797 36404 -10227 31706 63891 57585 21780 42799 12574 42821 85505 28059
13072 28059 4581 -15435 -45754 -19900 -11709 -24601 -90665 -80680 -62797 -64824 -352 38526
13060 38526 50810 65430 67606 55794 31262 8407 -32588 -50264 -44682 -18635 42925 126781
13048 126781 146387 148895 154611 123337 94223 120174 140926 131917 94972 112553 80514 55927
13036 55927 15078 -23001 6125 99912 149018 147484 165169 153793 137165 85219 101879 32045
13024 32045 20229 40512 89042 84022 61958 111380 110883 139089 111671 120673 115209 62653 -7339
13011 -7339 16984 50151 82807 93585 108929 108201 152510 189609 225379 135588 152131 177580
12999 177580 115194 99164 104892 103456 92181 81035 66128 50461 93212 83707 83465 130390
12987 130390 158239 145351 111294 82663 125729 180574 179336 145400 117570 139573 120234 78770
12975 78770 65737 41967 34660 99041 76930 61055 85569 63308 21393 39606 85250 103793
12963 103793 106160 45209 37578 43018 6964 33230 86368 150308 107549 84614 118057 83306
12951 83306 52343 74696 118547 107491 110694 166395 148968 121801 116044 100760 40619 44644
12939 44644 88071 71623 93436 131734 125995 65198 120705 168616 214244 238636 273402 244245
12927 244245 142287 46770 35691 62554 50595 60483 102476 65432 16924 -14772 28614
12916 28614 81103 50737 79872 94231 148618 172963 143616 101653 104278 134117 120445 164265
12904 164265 169624 94396 61663 58054 43786 74487 91925 78862 112925 165885 188357 78473
12892 78473 -13388 15775 7870 70167 100804 87882 93596 93272 121221 133194 141893 163007 148488
12879 148488 148773 80791 86153 151023 197320 174418 126014 80651 45898 92872 90328 42690
12867 42690 95296 84261 60769 67873 92420 113173 150630 97027 78981 73685 117473 116933
12855 116933 34234 -2144 12191 28583 4269 21575 22040 69725 124531 147123 214028 263516
12843 263516 176804 99290 78743 96908 149326 125593 135430 144241 148499 168949 134595 99348
12831 99348 71825 148140 198053 204261 179351 148073 79184 64358 72509 64200 68593 114895
12819 114895 173091 164710 116880 113779 150100 157956 187887 214358 173688 155350 134165 218899
12807 218899 227884 210089 141827 108528 125474 138857 111284 59460 74946 96992 84086 114926
12795 114926 129511 131198 213063 241419 230115 225113 180065 212246 197155 193784 211979 161555
12783 161555 140879 213457 206191 201903 162904 151141 151371 156292 192184 193920 168173 202754 197217
12770 197217 153170 129384 177360 184985 207814 153575 123355 165301 169787 172752 182634 205042
12758 205042 239188 189021 181425 174517 146747 177604 246177 246904 184374 177197 129495 191842
12746 191842 298461 254533 195809 164861 179317 175993 147150 160176 189201 229377 245526
12735 245526 223418 215573 147392 93816 92238 88040 117918 133672 137317 150664 149594 101680
12723 101680 156254 232851 231265 225980 285393 279202 228457 159214 168942 131374 83748 150025
12711 150025 188041 132613 106890 166595 190431 138699 122499 107874 87094 157107 210507
12700 210507 250147 247993 207971 144981 115259 65336 78853 112805 143220 111521 99285 189852
12688 189852 222313 212237 212181 228022 225468 249417 245225 266368 333792 326773 303398 287127 216654
12675 216654 182850 208553 239977 259831 265393 261942 313905 308077 338710 255610 144214 136779
12663 136779 182406 137587 109914 109662 141153 215330 273863 259351 184919 165049 174481 182300
12651 182300 203227 141354 82507 115833 138250 142112 135374 135968 152218 137920 82001 126602
12639 126602 137031 138138 168736 233008 229417 206387 269597 261487 312135 310906 272910 213934
12627 213934 186592 216991 242046 192795 180097 186818 253871 298257 342582 315253 325015 327154
12615 327154 286791 262053 183303 145926 206812 248643 233965 177222 172503 211561 212471 251903
12603 251903 284813 328429 306751 332895 286801 258307 287957 221786 150117 199537 298933
12592 298933 327483 281422 241946 216305 214988 226160 204183 231912 246426 240465 232846 251087
12580 251087 268434 292627 311889 343475 306254 271205 215543 196477 190188 230428 310792 380319
12568 380319 412651 325712 273946 260852 239834 265598 272996 258770 304631 322387 360292 391514
12556 391514 428675 459623 436725 402595 411719 387946 347831 291875 271870 316188 327498 322019
12544 322019 318365 274881 262428 256847 236322 209398 204410 198867 255575 266015 260129 252279 283867
12531 283867 258353 222778 206209 266604 361960 403516 398276 344240 244373 289125 275939 297781
12519 297781 305828 295920 270074 290401 279828 252231 286857 321063 358909 359681 320759 329985
12507 329985 309250 306164 311682 267258 262952 246239 245682 246251 246721 248292 252253 254797 351741 345106
12493 345106 262532 206960 298319 315004 309685 344153 363807 399225 405565 320080 314092 376598
12481 376598 369049 361909 389469 415788 442210 427280 420693 423613 417701 398727 389201 397477 431575
12468 431575 392554 360928 357318 400941 451977 423143 352729 356565 361810 391967 403324 378853
12456 378853 389888 376902 372913 397096 444011 468750 468103 453175 405448 416455 424585 389510
12444 389510 403490 408646 360478 389345 484803 454193 392670 394344 439413 393628 386871 386216
12432 386216 383177 460754 517511 479978 468783 425433 423557 493205 555752 574653 567691 523222
12420 523222 464565 477778 455520 423937 410192 468688 454911 500491 489112 441843 453433
12409 453433 412174 420494 438882 444411 453536 445264 468323 518267 525052 588186 557053 464855
12397 464855 468473 520785 517629 530817 520081 518306 540709 534251 518527 518467 539017 500421 500102
12384 500102 529606 495028 471744 565633 634513 601890 616708 662347 627568 615315 611883 623673
12372 623673 584003 577129 526279 528056 580607 597527 646381 598120 503958 474211 496861 518816
12360 518816 553624 606576 626259 575183 575083 614696 595801 594631 558702 536414 580467 636436
12348 636436 640912 682078 632797 597804 621486 638470 640067 604928 627135 674291 720614 727144
12336 727144 706084 657064 701730 724096 724917 612046 581695 595211 587597 538424 537365 560353
12324 560353 601943 562491 604394 653023 632023 620515 652187 688797 700197 649558 665055
12313 665055 723617 738875 770117 749445 704989 693354 707264 762547 781924 733584 724439 808883
12301 808883 830661 838440 827684 801215 850238 858784 885150 891758 936189 902040 864242 887951
12289 887951 969031 966757 903237 849871 838715 893626 834348 837789 849928 848545 841588 896097
12277 896097 959528 964761 906778 903056 906649 910818 879129 909295 916951 948885 962683 958461 951152
12264 951152 933602 946426 946030 955041 1019823 1035720 1091007 1054802 1041689 1036199 992848 994660
12252 994660 988121 1013610 1033037 1037346 1003974 1031948 1058149 1077920 1108958 1105232 1188508 1246245
12240 1246245 1250166 1195151 1200909 1257697 1239086 1162813 1174302 1211373 1228817 1246153 1241185 1200445
12228 1200445 1219373 1242868 1250965 1279666 1244336 1238169 1245282 1219022 1230140 1251075 1295142 1305241
12216 1305241 1322391 1344689 1426162 1454302 1434415 1363655 1303562 1324603 1390205 1439399 1491547
12205 1491547 1472103 1405811 1392279 1351629 1410923 1472146 1548980 1499235 1393490 1393552 1474275 1506645
12193 1506645 1543252 1595522 1620557 1609863 1581307 1581463 1618092 1649521 1661942 1728786 1775475 1762787
12181 1762787 1771211 1791529 1783301 1747330 1696777 1677883 1729524 1840768 1865810 1851367 1833613
12170 1833613 1860399 1879314 1864150 1821299 1808051 1856822 1859669 1896321 1928484 1981912 2056677
12159 2056677 2094795 2054975 2043374 2064733 2046344 2127892 2257105 2247527 2197555 2142165 2123534
12148 2123534 2127521 2152226 2215856 2276752 2243597 2263634 2309855 2248376 2228589 2267565 2297391
12137 2297391 2344834 2346918 2359077 2331864 2384135 2469964 2502552 2478494 2512272 2549602 2529263
12126 2529263 2533742 2633089 2668060 2704854 2734868 2744094 2674618 2662544 2698483 2759565 2783324 2831709
12114 2831709 2909522 2978884 3016276 2996849 3036514 3049187 3037041 3060258 3116483 3142523 3202695
12103 3202695 3235942 3242563 3173868 3149226 3162207 3209821 3272150 3333552 3415790 3490130 3536836
12092 3536836 3568434 3584480 3525933 3513447 3525150 3605348 3698922 3710394 3749327 3799601 3887704
12081 3887704 3910217 3941102 3959772 3943383 3953399 4025762 4064118 4084685 4151599 4217052 4285798
12070 4285798 4352514 4434009 4546832 4611996 4606655 4587802 4625762 4637861 4668735 4700153 4763550
12059 4763550 4823457 4841836 4894582 4933643 5028402 5098997 5174214 5228276 5215932 5212545 5271965
12048 5271965 5351882 5449701 5504868 5537405 5630337 5770764 5784479 5739189 5768183 5866072 5947209
12037 5947209 6020407 6069765 6109950 6171142 6178342 6252964 6312985 6370448 6406954 6452504 6526392
12026 6526392 6609903 6635887 6714284 6786338 6858395 6966098 7061546 7126752 7210683 7315087 7355528
12015 7355528 7400545 7446708 7434763 7449503 7550898 7717531 7813414 7837984 7863646 7929612 7952137
12004 7952137 8059299 8131017 8214661 8276320 8273656 8342329 8461401 8579398 8615117 8656081 8732523
11993 8732523 8821750 8887953 8972199 9029671 9039959 9115390 9151325 9097721 9155941 9328893 9405427
11982 9405427 9461487 9521169 9620720 9669274 9747822 9733163 9736798 9738138 9776385 9818658 9887760 9992817
11970 9992817 10069241 10048527 10088501 10111804 10057898 10002216 10055799 10134146 10135774 10151563 10148641 10201022
11958 10201022 10242564 10221623 10212835 10295527 10326396 10282477 10305810 10336662 10324079 10315625 10311901 10287994
11946 10287994 10266053 10273091 10250790 10284188 10342700 10335703 10311559 10268014 10258152 10198666 10134703 10125980
11934 10125980 10077616 10007335 9988036 9993338 10008431 10004856 9986527 9902618 9812004 9785751 9788234 9728127
11922 9728127 9647018 9614975 9604914 9515120 9447892 9454742 9377671 9363329 9271233 9172578 9134060
11911 9134060 9020166 8942926 8970722 8889908 8868257 8824473 8740568 8646474 8533989 8457907 8393213
11900 8393213 8321744 8268941 8247557 8216739 8174485 8098638 8028719 7959487 7853317 7801890 7689444
11889 7689444 7639766 7568291 7519000 7447564 7352643 7264293 7250766 7196180 7155126 7132751 7056783
11878 7056783 6984671 6889455 6825418 6769130 6725798 6638505 6601623 6552368 6527410 6522412 6423607
11867 6423607 6305370 6137686 6104358 6067920 5976489 5973555 5942189 5894140 5797234 5720224 5678540
11856 5678540 5601914 5533380 5535889 5521887 5486137 5421148 5327327 5235906 5219159 5184203 5091778
11845 5091778 5067231 5033600 4999986 4937942 4910811 4838321 4783888 4749230 4652628 4582447 4487225
11834 4487225 4440316 4463577 4492078 4456526 4437489 4394280 4326364 4331058 4269839 4187965 4093062
11823 4093062 4072167 4062616 4007796 3966935 3978713 3893073 3845188 3873363 3874569 3799957 3732372 3731493
11811 3731493 3699477 3656399 3564601 3473417 3453612 3424881 3369929 3359376 3356418 3334293 3375875
11800 3375875 3389501 3273465 3188295 3182849 3136102 3128373 3053716 3008735 3017162 2976916 2991555 2977663
11788 2977663 2890156 2857630 2884071 2881344 2888021 2869061 2827551 2816867 2768609 2775659 2764786 2734806
11776 2734806 2698476 2622680 2576839 2577879 2548316 2534144 2472984 2468745 2511627 2435935 2405790 2424851
11764 2424851 2439744 2471822 2400838 2333742 2327367 2354858 2291681 2253029 2264807 2210709 2196825
11753 2196825 2162012 2151397 2122875 2179508 2201392 2173585 2172489 2140414 2035940 2004795 2002359
11742 2002359 1985405 1943020 1919764 1919250 1906697 1848431 1829736 1847840 1789604 1696998 1711680 1797224
11730 1797224 1882955 1886223 1765089 1705853 1677379 1685589 1669787 1632727 1695306 1691424 1602834 1584257
11718 1584257 1579481 1604771 1612661 1609114 1654651 1662253 1598390 1495081 1398553 1372439 1449481 1472457
11706 1472457 1512679 1509039 1461255 1464470 1472637 1468332 1512410 1532563 1533484 1532670 1503502 1470032 1420549
11693 1420549 1382623 1337561 1337938 1371769 1370028 1334948 1335205 1378913 1370678 1292974 1261229 1235497
11681 1235497 1246679 1285953 1264048 1264344 1257082 1190457 1160054 1217310 1271217 1271855 1265578 1244448
11669 1244448 1225944 1225988 1205023 1183570 1146971 1140874 1123886 1135898 1121902 1094529 1100804 1147661
11657 1147661 1152412 1113666 1130970 1175749 1129761 1081177 1051900 983608 974397 962211 898010 943601
11645 943601 999065 1045991 1057686 1061561 1053059 993702 968186 957945 996254 999596 1009495 999328
11633 999328 1013289 975517 919028 861778 821983 843357 886496 963296 953382 865755 854194 856000
11621 856000 834874 838409 850107 893092 907261 854170 832276 809198 809125 780949 783651 839399
11609 839399 851739 851933 883914 901523 858725 809890 795559 830173 840219 852277 833272 738765
11597 738765 705837 728674 686252 659050 670200 725262 747115 769629 733077 626985 649017
11586 649017 709848 721455 697067 734047 802899 752889 723824 692237 653959 684027 645477
11575 645477 599928 651840 597139 550411 592392 583903 594947 632652 655278 630870 577313 608297
11563 608297 631391 632077 658609 671000 613640 580013 598151 696466 717927 686707 632012 651582
11551 651582 677409 644842 621978 679359 663912 632211 628760 641692 659955 637190 642308 694708
11539 694708 660611 659426 694463 680340 631942 602320 637713 626186 572176 528628 546624 552276
11527 552276 511173 426403 398520 411528 515248 525554 579301 675805 571703 503234 506242
11516 506242 504241 490260 553384 574918 482202 410848 456758 537498 583689 538822 468179 412233
11504 412233 442776 470544 498129 526121 473624 471220 477659 445980 446953 424837 423757 445886
11492 445886 444109 436584 491414 508179 506829 503281 501921 469246 493382 468974 481586 566060
11480 566060 523927 507396 479236 465575 431742 374331 416170 486882 512068 477010 479279 437960
11468 437960 432145 388399 379850 385512 416657 388719 402514 439488 431623 448827 500122 451705
11456 451705 366255 383222 465775 444027 409577 340755 308850 309677 330905 363168 368841 409905
11444 409905 413264 438356 503406 490678 411836 404270 397450 335704 286111 252401 280275 331687
11432 331687 358879 380350 338431 347662 402151 451021 429704 367272 360962 355220 375920 319089
11420 319089 282841 293031 305991 374934 375666 363432 353954 350225 357032 301955 260301 277445
11408 277445 259569 247191 320800 330606 269127 297846 343799 377217 390753 405389 396398 326700
11396 326700 249711 267228 298491 307285 291073 322074 337790 298248 282101 295103 288642 265215
11384 265215 223891 232392 260290 303093 348597 331434 338463 360615 316521 253561 278429 298130
11372 298130 288046 275883 272858 298538 280694 273857 321154 346198 333689 307722 314853 354266
11360 354266 368749 312572 299829 305825 318744 271073 232402 322553 377893 315686 277380 222487
11348 222487 181881 251597 300253 254313 229480 214935 197955 177232 205673 214105 258908 317617
11336 317617 302780 290729 335575 303368 282349 216907 209471 239575 258316 287685 251700 199037
11324 199037 207312 255535 217674 236289 273565 260633 229706 204592 216234 205670 164017 145656
11312 145656 189713 194185 182396 190442 189251 167317 191822 263142 275499 221764 159362 159465
11300 159465 201121 252405 272443 277787 300688 258695 173491 156682 157901 157725 111796 93049
11288 93049 94564 151671 196007 228668 216312 182485 200951 156852 165396 214810 229197 237240
11276 237240 214948 205091 161471 214140 213782 237368 235477 220591 156619 160972 183166 181801 167049
11263 167049 101567 115843 127640 156019 132361 100372 180866 213547 227333 226635 123133 122878
11251 122878 126458 89273 154461 153705 171159 208929 231380 219894 260569 271737 237460 152978
11239 152978 61316 50313 84484 116212 36137 -28886 6373 95703 117783 89804 92610 130573
11227 130573 162563 205631 172282 156524 148699 146233 148755 155114 163540 178567 200264 198521 148177
11214 148177 112766 94701 61545 70573 134550 157948 80596 63981 152981 157859 112586 101723
11202 101723 106526 121858 138254 122869 115203 108044 97818 117240 153854 122412 97236 113216
11190 113216 118259 92647 167056 141051 87711 107991 156485 187387 175304 163513 117301 68769
11178 68769 21136 32266 91330 130655 87176 85196 166059 217470 255009 252537 206759 170224
11166 170224 139627 143247 145741 164045 188494 161433 149869 156495 183050 197950 209038 115229
11154 115229 66019 75927 82235 134743 164229 204172 186820 115761 152672 180287 123415 121962
11142 121962 146434 145529 115715 45105 50511 91588 75067 78695 163913 175329 171037 110644
11130 110644 91336 106272 64196 81323 128861 91861 52612 83086 89732 90695 161896 186970
11118 186970 157081 142588 184524 192881 183836 147561 179925 175508 76966 83728 136852 133099
11106 133099 108176 147903 162595 178798 160940 145553 79357 72779 146952 155085 147445 159727
11094 159727 96469 76728 75525 78939 59502 63031 37592 56244 80353 107410 82613 104255
11082 104255 175215 179118 161016 154684 121175 111310 150946 140653 106090 95503 110103 141520
11070 141520 122373 110163 133728 114352 92838 100512 89115 54373 3743 7210 -3098 55893
11058 55893 85039 123516 143865 158763 65603 43622 86944 190660 224436 245529 280762
11047 280762 287445 297906 281868 282511 365578 430069 392264 330779 339708 374677 397878 420384
11035 420384 512832 587393 676960 708635 682167 599378 520602 528703 523224 512467 521970 647615
11023 647615 776260 823917 916555 945740 912422 811995 715683 639415 598002 544922 521356
11012 521356 594134 658499 727872 737550 687259 680972 570204 481872 495220 442059 409870 364954
11000 364954 346270 336611 287966 257501 245212 286635 274428 243109 186764 183594 158052 64621
10988 64621 47389 70823 12985 -2923 75403 111368 89043 13189 45634 76989 22295 26501
10976 26501 51705 56032 105959 119477 128010 90874 52662 6967 12257 54082 30634 -154
10964 -154 7879 23578 32720 58472 74645 67836 64134 60271 19264 -12957 1178 40709 43774
10951 43774 73556 102760 86930 71959 47996 53424 74899 49683 10673 19913 56285 52876
10939 52876 42173 -62 1543 89623 123141 118319 149413 157985 137504 144263 86930 36287
10927 36287 72477 126551 142085 76201 25309 22608 -40371 -15106 -10509 31161 17613 17953
10915 17953 81210 30933 21465 -6294 14833 26576 -32215 -48779 -5897 49874 18756 -26229
10903 -26229 1146 43984 52687 10662 -16623 12563 21843 40355 48990 40331 58899 91069
10891 91069 61730 107911 151984 105075 47185 110410 178182 148237 90738 50447 54700 114906
10879 114906 61710 10069 33648 81417 26244 23098 32629 52499 10749 -33227 -7372 9489
10867 9489 39610 37944 58962 84648 110164 78299 89374 100483 88211 43463 22007 70995
10855 70995 77078 86174 58282 69721 50840 92151 145689 97163 56107 33178 28796 54383
10843 54383 84592 65005 49398 10500 -17227 19210 19466 -20683 -35928 7555 20243 3158
10831 3158 26015 50452 96296 71958 20967 61139 75108 72677 69904 67900 68830 78931 58540
10818 58540 17778 -9283 -10556 20889 50234 132564 148313 146012 158725 167528 160807 116576
10806 116576 76337 44706 -10383 6497 -52945 -10736 85152 98929 151784 132291 63417
10795 63417 15413 23819 27386 -295 31229 11852 25319 -406 -27006 31162 50078 59324
10783 59324 62112 30436 -19479 -54740 -9503 53520 98246 118809 44762 -18176 13616 63922
10771 63922 4800 -24826 -59957 -14885 49207 78523 164448 166353 141805 131074 104734 38013
10759 38013 20807 24056 75594 41319 67077 94235 96713 78704 82010 63400 52516 49323
10747 49323 59270 28514 40573 101924 158562 177519 154564 121477 118056 163126 219026 151909
10735 151909 117648 92771 71419 110111 147650 164679 130319 155824 117020 139555 142524 56511
10723 56511 77489 53538 42780 62319 52437 70946 50262 75246 134363 121047 76160 58643
10711 58643 40210 29933 26580 -17373 -53171 21432 113060 95512 80618 49856 48827 72908
10699 72908 130413 107879 77457 8257 -50978 -58114 -7792 14243 17661 3346 12593 -1344
10687 -1344 -44530 -6580 76714 132866 87402 54123 -5950 13152 72190 45211 -9884 4420
10675 4420 64165 160715 189842 192427 185014 118349 121512 170860 205341 275195 271557 232048 181301
10662 181301 185352 191286 210975 256488 258961 171809 235897 328068 349994 359165 341008 335970
10650 335970 368660 481431 514628 520996 571952 588375 652043 764031 858776 961009 967008
10639 967008 995321 1083938 1203932 1395284 1594681 1847282 2129948 2468967 2813571 3142089
10629 3142089 3424800 3684982 3964294 4423745 4991963 5789644 6898469 8415074 10445931
10620 10445931 13339279 17360381 22650499 29397678 37424409 45581089 51542989 53538070
10612 53538070 51990360 48987540 46543786 46034677 48197055 53514357 62490667 75539546
10604 75539546 91931356 108263484 118433622 117991151 108832665 97147306 87947435 83366946
10596 83366946 83890147 89844577 101445710 118538216 139478865 158839160 167737652 160396268
10588 160396268 141301620 119953645 102718215 91436174 85910990 85702811 90378776
10581 90378776 99275625 110500640 119841814 121231814 111936858 95638781 78884684 65617246
10573 65617246 56693774 51598409 49609991 50113888 52362468 55200232 56687604 54851362
10565 54851362 49019981 40786118 32570744 25712632 20422006 16580626 13724053 11508562
10557 11508562 9809564 8556508 7560375 6724701 6066601 5524139 5017305 4528652 4228111
10548 4228111 3896138 3578523 3341730 3191511 3011223 2786666 2577779 2418646 2271324
10539 2271324 2165465 2026233 1888962 1792074 1756156 1673038 1639696 1656546 1570490 1416982
10529 1416982 1326646 1339739 1323377 1335248 1276392 1194803 1185131 1217339 1181562 1072404 981372
10518 981372 964330 976804 1021039 935043 873186 875820 905540 892037 896515 907422 821303 748566
10506 748566 778657 763457 799910 824292 779550 840840 826267 808307 809433 736367 694260 685237
10494 685237 632938 580418 615889 643801 616285 567531 570883 551804 564830 515992 528592 525216
10482 525216 501402 506130 469989 471698 465483 432422 386887 378675 410336 414137 412078 418436 427356
10469 427356 445780 419937 475721 533824 539340 500926 532596 560708 530300 469201 524580 495392
10457 495392 452205 437922 357140 316079 334071 386382 378997 388343 402448 369209 425097 482884
10445 482884 514867 455722 384977 357651 395974 404345 397189 394576 415328 396657 307141 315733
10433 315733 301292 303917 329446 294152 280292 284332 301261 257847 286415 343963 294955 259484
10421 259484 286195 287623 222632 202902 253396 269427 231678 223084 264252 314712 275524 224340
10409 224340 244041 212477 184575 186408 115219 43134 37337 76257 124848 168252 214180 212475
10397 212475 207876 192611 247033 213126 229262 283272 258530 196026 221954 224510 205328 212866
10385 212866 206202 240988 179871 136933 168375 200834 162719 170177 217526 187780 165388 183895
10373 183895 164118 151686 178479 162385 133952 193700 196220 186280 187134 216218 202980 189677
10361 189677 145633 107722 81421 42598 89996 109010 82855 81231 162302 176197 179022 183350
10349 183350 151020 139613 142952 187852 159992 197894 210855 197720 210597 188292 215875 295980
10337 295980 259805 203178 199597 207534 211394 219433 191818 258415 219971 203774 195266 223159
10325 223159 190445 127106 138780 148871 202832 188450 144724 88183 44102 108724 111958 113107
10313 113107 122902 154622 153542 151381 124218 136453 142757 89375 76483 105258 128117 131389
10301 131389 97395 51800 12530 60253 84063 48021 84701 176005 91846 68204 94712
10290 94712 117360 171378 180052 179733 183466 192942 206667 196403 165924 244165 222617 177609 156472
10277 156472 106674 92261 88438 83706 134948 166857 241731 278662 277310 221831 186786 186659
10265 186659 190622 155449 220823 248256 164128 139664 144821 170969 208091 234652 151559 129245
10253 129245 178709 184400 187805 142229 152075 182197 107389 51171 57905 73380 56119 75235
10241 75235 84753 61173 65658 97005 90514 67614 40079 4419 20266 109659 112014 119595 161221
10228 161221 163271 141695 116750 88456 64441 40998 8162 9249 49159 92634 108313 61942
10216 61942 60895 76534 78529 15404 149 29594 -4860 51218 103683 104331 100902 67631 58025
10203 58025 64958 95756 162290 215663 180110 188441 201899 211275 169007 133824 86308 96047
10191 96047 149300 139635 89731 88034 136809 184641 154626 185583 180796 179981 226071 277500 299313
10178 299313 338007 445615 496445 433177 364467 360775 387976 423592 501482 584524 648568
10167 648568 638615 622597 646735 674861 639479 568389 532245 530890 572591 570633 632545 757474
10155 757474 861376 930658 953968 891780 793129 654677 507570 487763 508091 530181 538251
10144 538251 595099 723250 759795 753605 704264 608647 491407 438558 395267 333894 330519
10133 330519 346518 341013 362398 419880 428625 385931 334559 310521 301571 269824 211301 158830
10121 158830 179716 165741 123317 71503 84301 82745 81615 109210 135139 61370 5877 -22798
10109 -22798 31190 29615 49089 19162 -33334 -24512 40129 66884 67101 48165 53218 31889 -29265
10096 -29265 -10077 22252 75396 32003 35075 15252 -22928 -33617 -44818 -33168 -10784 -1695
10084 -1695 -1133 19769 110039 83388 69320 115200 147849 124881 122168 127443 147885 144952 140719
10071 140719 119770 82679 103008 142816 110579 49247 42487 46650 40406 31556 19719 -60031
10059 -60031 -1090 58019 56357 62584 54560 62178 88100 97076 103921 30697 -11530 6162 -3703
10046 -3703 59339 110314 42012 29205 44978 79476 108773 164516 165450 79163 -5598 -60355
10034 -60355 -104665 -74623 -7426 -21865 -54971 -20874 22169 50512 -7416 7515 28914 69015
10022 69015 31077 -28656 23428 58324 39906 16855 50392 65732 73478 94156 83022 72870
10010 72870 -29692 -30315 31594 90121 138420 147510 95512 14001 -18822 24542 42477 85536
9998 85536 97668 91078 56615 83767 112040 99684 67093 16917 28625 13861 49379 86556
9986 86556 113979 24210 22773 91035 101732 108085 97573 82717 128644 102466 72989 72574 52932
9973 52932 90446 124658 98980 76426 25297 12013 35247 78918 118057 121140 94433 94965
9961 94965 103540 95330 63646 54943 117180 115278 82453 46619 51329 62193 71258 43131 -5293
9948 -5293 -21271 61318 88667 51596 32285 89672 118353 127050 114131 116525 115031 85498 82731
9935 82731 8931 74971 146368 164793 198135 237619 209948 202973 253776 440836 673920 944647
9923 944647 849523 512746 287092 213816 188137 122940 110680 132552 139173 113761 80498
9912 80498 65649 113539 113591 97784 69545 91494 42354 32791 51453 55240 71791 98085 116217
9899 116217 76479 46157 67374 70122 22802 -16892 56042 106966 114238 55939 44815 24512
9887 24512 -16190 -75262 -88487 4832 90244 100255 146647 102068 50062 52168 30319 7564
9875 7564 -17389 25064 111537 147042 172549 160506 103020 91609 56789 47923 39765 9334
9863 9334 -67214 -99121 -26988 -4420 29617 -24754 3821 27611 65020 72191 50059 33658
9851 33658 18846 -25295 -59410 -49525 8053 38016 39080 45082 51128 15730 -18683 6888 39665
9838 39665 28094 -8941 -34059 7979 31849 -2749 -14903 14107 87011 146575 151656 149744
9826 149744 136613 91055 75138 53976 61935 100969 67177 35857 -57955 -108323 -80011 -72021
9814 -72021 -96649 -82250 -14363 7751 -42638 -131880 -155043 -81877 -12967 23874 65495 68786
9802 68786 35809 -64153 -142262 -142112 -124239 -92723 -62697 -5574 96051 142014 124319 108683
9790 108683 102881 36258 63882 60154 102237 89962 41793 9315 -18817 -55556 -26511 -516
9778 -516 91773 151561 126464 48757 24598 71524 90653 79419 75608 61267 88894 84570 34791
9765 34791 31325 54631 54929 40326 13758 24749 44387 17129 16052 61910 30313 31196 38379
9752 38379 58994 40361 68010 87690 28975 -28738 738 14530 -7285 5064 22884 48561
9740 48561 105854 131999 114044 76009 26043 -67386 -134391 -76413 -64224 -63157 -30058 33593
9728 33593 108189 160746 115145 56372 10189 20193 60765 33613 45184 19135 -31527 -46492
9716 -46492 -1834 16981 40844 82161 58118 27946 -18922 -62459 -75016 -100883 -96273 -61805
9704 -61805 -42902 26933 31083 -8691 -19829 -53440 -94126 -105250 -83112 -51616 -39959 -45701
9692 -45701 -23163 9653 49210 61906 17997 10329 58943 20271 33264 47602 59300 39839
9680 39839 30529 41884 38520 46712 44006 83060 64479 12504 20727 70921 93348 98394 74537
9667 74537 48567 65472 77512 117000 147928 120394 127943 156539 160789 146982 147879 177303 241655
9654 241655 374309 572264 829546 1146364 1562824 1761821 1445347 980174 659690 439651
9644 439651 278782 150415 74277 72785 13944 16360 55632 31899 -14680 19674 87348 106901
9632 106901 119766 99800 60822 39316 33451 54063 70920 109735 93982 32765 -4428 25105
9620 25105 20621 9488 -26145 -49185 -76990 -44611 -49712 -9649 13849 37043 76878 97327
9608 97327 38690 5427 -22765 -9363 31101 65160 53136 48515 6551 -84108 -154127 -87531
9596 -87531 -45833 -3291 62498 93866 75055 31803 -24398 -65285 -113065 -70973 -61729 -74919
9584 -74919 -128377 -115062 -75813 -3014 70894 82932 72956 36129 -8098 -8377 -39613 -67351
9572 -67351 -37101 -4208 -6348 -12629 11210 8379 29796 37240 19518 53113 79049 49152 38726
9559 38726 37904 23600 -45248 -51922 -39604 -28591 34387 48366 -12558 -65303 -96157 -65843
9547 -65843 -16158 -7943 -12621 -12979 -6702 -30403 -37254 -20296 -8898 -39017 -134270 -90393 -81770
9534 -81770 -126284 -25208 714 63841 105694 34984 -6367 41589 41362 -76048 -107720 -59651
9522 -59651 -33005 -28733 2907 82423 75872 22782 516 787 4810 24373 44569 43582 42019
9509 42019 42805 23809 -6013 -16190 -40915 -36016 -10498 35146 13834 -64064 -86782 -60141
9497 -60141 -27457 10235 17873 47989 51868 53674 60901 41408 -15741 -31356 -38463 -69560 -57593
9484 -57593 -10442 -45196 -33292 -26443 -48508 -48527 -11134 45331 55288 53901 20427 18711 23146
9471 23146 23100 35429 40390 67186 12084 11946 26488 10668 2 -8913 -47519 12089 52352
9458 52352 60673 22781 -28832 -14931 -11281 2234 -39763 -63163 -3119 51398 39789 34879
9446 34879 50065 10731 -27620 -25012 -28749 12016 36126 -39702 -24025 -25358 -36732 -10648
9434 -10648 -8200 -79614 -80911 -70710 -77177 -6095 -410 28527 155519 168987 139799 81565
9422 81565 63662 62468 93801 50792 23424 31288 -11589 -19363 13005 69573 33022 22585
9410 22585 -61501 -38342 -9865 12920 20538 44623 5627 -29739 25424 36871 28970 17767
9398 17767 -73950 -110653 -53133 -53954 -72593 -44999 -19100 -11063 -5823 -1977 -42474 -1948 23997
9385 23997 -12861 -9659 67011 109602 84036 30009 7998 -37598 -5274 47483 71372 115089
9373 115089 79504 43044 -14369 19163 48578 -35590 -46917 -21650 24536 44830 -13997 -6956
9361 -6956 -17624 -11260 21008 -10425 -48846 -57604 -55735 -33097 13939 42599 45227 58752 54465
9348 54465 41092 27562 18645 -35326 -55498 -45969 -6793 -25860 16077 74602 15669 -24486
9336 -24486 -54632 -92484 -61530 -44028 -26593 1303 6407 -132 -7155 1102 46628 59699 70116
9323 70116 7717 -24171 -56468 -94217 -61938 -6064 -24244 -56406 -97958 -74913 -43608 -8392
9311 -8392 3068 21922 36479 48554 49608 -2140 2036 47111 61560 56920 44661 580 -25567
9298 -25567 -29510 -17978 31785 33008 42655 25978 33436 -24605 -23444 -39441 -20053 -71733 -99360
9285 -99360 -83683 -28128 -26020 -42743 -23320 -25814 29847 80431 48610 21619 -55603 -61469
9273 -61469 -14400 61175 62381 -14891 -16781 -65894 -83923 -89086 -125657 -68301 -64506 -30357 -42330
9260 -42330 -66355 -34502 -16640 5542 32897 53312 11262 -31726 -51493 -58603 -16110 48747
9248 48747 46899 -18233 -70572 -67708 -68619 -42917 -9699 33110 45615 24239 3037 27219 55974
9235 55974 -13116 -92278 -131714 -74144 -3948 -26299 -18010 -38498 -73696 -64780 -59412 -54981 -80072
9222 -80072 -41895 18975 19707 51902 54739 55003 36534 21965 -8221 -33320 -36841 7768 19312
9209 19312 -13433 12863 80044 74793 54895 22942 29857 54158 18975 24748 26621 19093 -22992
9196 -22992 -23248 -5010 -18904 -49633 -41644 -48360 -73839 -39778 -4350 -37541 2308 -25834 -26749
9183 -26749 -17654 1448 -5447 -17903 -1308 54022 37587 -16191 2863 56575 129528 151767
9171 151767 141607 92344 5134 36168 83405 131601 111749 83297 16000 -43974 -50180 -56833
9159 -56833 -26981 -66964 78 81929 61094 43374 54946 53612 49024 51549 26369 43926
9147 43926 57713 10600 20098 11577 45580 -14930 -62271 -47074 -53607 -8113 33297 56822
9135 56822 -11125 -25772 -39233 -51541 -50426 -89079 -96327 -39213 -9509 -10691 -22725 -28119 -33508
9122 -33508 -29370 4718 9905 57832 27905 -27709 -2243 25006 27303 -7531 -64095 -70367 -29755
9109 -29755 33619 33996 17938 -8888 -53284 26297 60253 49682 -14745 -55936 20649 13580
9097 13580 -23906 14992 14076 -21428 19582 -37332 -47948 -81104 -110126 -48747 -23943 17941
9085 17941 22589 41181 12943 -17732 5310 46163 83144 105441 88711 -3665 -42378 -25128
9073 -25128 -12435 -29371 -35657 -83663 -80739 -49120 -51401 -33391 -18171 -7868 12811 27013
9061 27013 -2233 -66148 -58538 -7180 10054 -11296 -39573 -57428 -46237 -24637 7275 23182
9049 23182 34905 42273 65546 35049 45480 69425 57615 49105 50330 66240 8119 -41029
9037 -41029 -71394 -48449 -68245 -30524 16822 16969 -20657 -75948 -71417 -11371 34868 34848 -25970
9024 -25970 -112381 -85949 -45863 -28068 -63590 -30497 62328 54352 -5012 -26997 -55947 -73622
9012 -73622 -46383 -53299 -76604 -105545 -59389 -52580 -80093 -26256 -5615 -36410 8618 48499
9000 48499 74409 89480 90865 16665 -2042 3288 555 64405 65903 19809 -59687 -79747 -42482
8987 -42482 -3268 70218 88971 71133 59263 50308 44683 -10239 -17053 26562 43721 60037
8975 60037 43847 67165 92355 27959 -67052 -133177 -114239 -84515 -50353 -12451 -41741 -18335
8963 -18335 25847 41392 14346 -32713 -62770 19967 63577 8122 -39368 -40232 -31112 -32778 -22167
8950 -22167 26680 92836 41597 -27009 9846 10971 24682 15278 -3847 -52518 -79482 -71185
8938 -71185 -66486 -55535 -77992 -35426 7262 75529 96287 74596 -3154 2399 -2300 -48109
8926 -48109 -38155 -23213 14438 -17534 31151 81021 30052 -92969 -124993 -76854 -16888 -22367
8914 -22367 17091 -25829 -52042 -6981 53576 33642 -15171 17884 55286 47808 -7033 -11236
8902 -11236 9980 -53801 -77948 -46724 -30040 -18029 44659 69099 56131 49720 50197 27903
8890 27903 -8825 2701 -10420 -32497 48180 83723 98810 65423 -25664 -39177 11183 25121
8878 25121 -25855 -56010 -138669 -115616 -26371 56826 53521 32445 -32843 -57030 -62672 -115619
8866 -115619 -58927 26388 -14630 -60705 -37593 50239 68640 14194 -27266 -10903 -45784 -84856
8854 -84856 -93713 -96782 -71620 -95059 -80712 11017 35230 26238 68475 78497 112229 63088
8842 63088 -21461 -50112 -40969 -49638 -101508 -117156 -75143 -118602 -144347 -85036 -15819 -9425
8830 -9425 14 35415 12418 -24636 -22612 -9491 -2351 -37311 -21949 -55371 -8911 52380 20422
8817 20422 -15772 -37256 -24031 6419 -19708 -20539 -41626 -75368 -46513 45771 34547 19108
8805 19108 -7121 7981 -2242 14145 -619 4391 29085 27729 34364 36854 70131 67196 89534
8792 89534 169912 154065 124636 98894 58544 11782 3225 -18158 14008 7041 23054 16198
8780 16198 -88838 -88614 -36666 -30543 -55680 -27682 -6510 12451 -24087 -57940 -6850 36341
8768 36341 -1909 38684 13241 -52593 -9523 28321 14150 27579 47624 33464 7077 -42442
8756 -42442 -87864 -66585 7188 54870 89369 82432 62270 46475 87265 15792 -78257 -87167
8744 -87167 -42818 -2417 43808 59014 34274 -20786 -50172 -76391 -56081 12263 -18511 -47322
8732 -47322 -94247 -81201 -64140 -25699 1759 -5342 -28569 -43364 -34268 -53956 -4888 69704
8720 69704 80981 66072 54742 45310 41188 52144 83226 51306 -23741 -26269 -20188 26579 4095
8707 4095 23515 47301 11654 -38348 4343 25245 4523 31419 -11823 -61184 -68383 -49928
8695 -49928 66120 135126 88066 -30007 -66356 -49298 -51010 -46288 6386 34877 27047 11618
8683 11618 36399 59055 106907 126908 132751 99329 39089 -15420 -5835 30839 51609 65754
8671 65754 84159 136850 158095 108861 39970 19303 36904 71477 79215 83177 106998 95021
8659 95021 87980 38455 81010 75745 109585 24595 -24902 -9095 11654 7927 -4569 11475
8647 11475 68117 94492 107533 81435 9013 18826 61700 40815 30689 26857 -20541 -8334
8635 -8334 59584 131792 154650 143610 88125 121205 133643 92211 63641 28181 17570 -46611
8623 -46611 -65884 -88667 -74358 -54896 -45755 -17869 82412 87439 103470 93075 65617 58478
8611 58478 23149 -20639 -13761 18863 401 -22710 25513 36811 -14884 -35657 -70230 -57165
8599 -57165 -30044 -57119 -45535 -78159 -75413 -21473 -14316 -55003 -70377 -6898 40697 72050
8587 72050 66411 45382 2778 33037 63777 18387 34051 34921 -8034 -33438 -52228 -77517
8575 -77517 -95823 -113400 -84473 2988 23884 -37002 -82249 -10372 17180 18559 20317 39050
8563 39050 20072 20153 45689 33207 1923 -26456 -32691 -4030 19076 28955 3886 57318 92521
8550 92521 73570 39420 2130 65576 133342 114969 72344 41156 -10639 -4987 -20095 -38364
8538 -38364 -30735 -78046 -82110 -42777 -14208 14459 42186 74970 106488 116543 103112 60444
8526 60444 7619 -3621 -26425 17495 4748 -23010 -46717 -67498 -104624 -68150 -52728 -71876
8514 -71876 -79109 -108404 -84557 -11496 -5016 -12771 32251 30465 59439 22333 -32752 -57848 -63627
8501 -63627 -18676 20466 42924 42802 43252 1086 35665 52611 89099 71002 13237 4002 -39039
8488 -39039 -52779 -55971 -79934 -31591 20301 24690 -41853 -42641 1344 8839 -25962 -34764 8289
8475 8289 15725 25789 62049 62383 85436 63164 -27829 -46700 -55359 -86950 -70373 -96847 -138747
8462 -138747 -113837 -78001 -25627 4775 14865 17169 4331 30849 21601 -2147 52572 68147
8450 68147 40889 66415 88842 35233 -22711 33512 83353 82697 99019 126080 86917 45930
8438 45930 2561 31448 17420 -42666 -21426 -10157 6784 -2035 -12231 3396 34197 10881
8426 10881 18654 24732 18534 47839 47672 22019 -9720 -10988 33111 -3386 -41595 -22655 -11013
8413 -11013 -22426 -1177 -18045 -5958 -16094 -44175 -73341 -7436 56833 -7718 -47013 -77986
8401 -77986 -46042 -2289 41062 36151 42322 -4960 -8448 6487 -13028 -22541 -38843 -25092 46287
8388 46287 50621 64839 35413 -26615 -27824 -41160 -61658 -63289 -30439 -22936 -11360 50871 66298
8375 66298 -14528 -14845 -6341 -72952 -128101 -92101 -59032 -21161 -16996 -27063 -51062 -1162 47408
8362 47408 10446 -11150 18601 -6592 -82725 -113620 -59025 68212 125617 38011 5209 11397
8350 11397 9633 -8583 -72387 -74643 -37931 -19161 -13593 -33176 -62319 -41746 -88688 -128449
8338 -128449 -110010 -76819 -29805 -36243 -38569 -35027 8165 -18056 -24561 -23086 -2039 56688 50717
8325 50717 32743 72100 88801 99856 -10712 -112202 -64209 -105622 -95088 -57259 -88085
8314 -88085 -50423 -34980 -73637 -7887 11136 -75262 -63803 35387 85225 -1235 -103405 -83358
8302 -83358 -55908 -94710 -70437 -35977 34023 98780 90370 78862 65723 98970 91953 63289
8290 63289 39683 -32677 -26667 -27543 1831 4408 16249 4052 39084 83097 21657 -27094 18637
8277 18637 38748 7377 19731 -38651 -90157 -89925 -62636 -48920 -60370 -12477 76233 162033
8265 162033 140441 68243 1427 -51503 -54453 -79895 -63770 -31618 11072 13337 -33293 -6768
8253 -6768 -24184 -85200 -103740 -53343 -5307 6717 -61806 -43125 -6585 -59110 -39396 -45606
8241 -45606 -63998 -12964 -8076 -32144 8574 21102 6777 3014 18528 17591 28329 48597 41264
8228 41264 -18312 -20135 10871 39758 58090 16110 -21072 -38202 -55462 -74940 -29998 40663
$$ [...]
##END NTUPLES=NMR SPECTRUM
##END=
