##TITLE=Analysis number 326916
Compound Code sb 00768
Project Code adrs
Chemist Name alfa
##JCAMPDX= 6.0         $$ Bruker NMR JCAMP-DX V2.0
##DATA TYPE= NMR SPECTRUM
##DATA CLASS= NTUPLES
##ORIGIN= Bruker BioSpin GmbH
##OWNER= nmr
$$ XWIN-NMR		Version 3.5
$$ Thu Mar  1 12:14:44 2007 GMT Standard Time (UT+0h)  MAYBRIDGE\nmr@NMR_250MHZ
##.OBSERVE FREQUENCY= 250.131544655141
##.OBSERVE NUCLEUS= ^1H
##.ACQUISITION MODE= SIMULTANEOUS (DQD)
##.ACQUISITION SCHEME= undefined
##.AVERAGES= 16
##.DIGITISER RES= 18
##SPECTROMETER/DATA SYSTEM= dpx250
##.PULSE SEQUENCE= zg30
##.SOLVENT NAME= CDCl3
##.SHIFT REFERENCE= (INTERNAL, CDCl3, 0, 16.522)
##AUDIT TRAIL= $$ (NUMBER, WHEN, WHO, WHERE, WHAT)
$$ ##TITLE= Audit trail, XWIN-NMR		Version 3.5
$$ ##JCAMPDX= 5.01
$$ ##ORIGIN= Bruker BioSpin GmbH
$$ ##OWNER= nmr
$$ C:\u/data/dgb/nmr/ADRS/40/pdata/1/auditp.txt
$$ ##AUDIT TRAIL=  $$ (NUMBER, WHEN, WHO, WHERE, WHAT)
(   1,<2007-03-01 12:14:22.43 +000>,<MAYBRIDGE\nmr>,<NMR_250MHZ>,
      <created by zg, POWCHK disabled, PULCHK disabled
       configuration hash MD5:
       49 4B E0 1D 92 C2 6B 37 9F E6 65 BC 52 41 86 1D
       data hash MD5: 64K
       A8 09 E5 57 92 08 88 5F D6 15 03 3A 8E F0 30 01>)
(   2,<2007-03-01 12:14:34.33 +000>,<MAYBRIDGE\nmr>,<NMR_250MHZ>,
      <Start of raw data processing
       ef LB = 0.3 FT_mod = 6 PKNL = 1 SI = 32K 
       data hash MD5: 32K
       57 1F 17 AE 3F 18 68 47 C1 4B E6 8B A7 15 CB C8>)
(   3,<2007-03-01 12:14:36.13 +000>,<MAYBRIDGE\nmr>,<NMR_250MHZ>,
      <apk 
       data hash MD5: 32K
       94 F4 1D E8 5E 03 82 45 65 A1 4C C9 F9 55 9D 1C>)
(   4,<2007-03-01 12:14:36.96 +000>,<MAYBRIDGE\nmr>,<NMR_250MHZ>,
      <abs ABSG = 5 
       data hash MD5: 32K
       14 0B 61 B5 14 BE 3E 7D 44 8C 33 18 31 31 7D AB>)
$$ ##END=
$$ 
$$ hash MD5
$$ 6E 3C 5B 51 E4 12 00 76 BE EE 66 BB 21 72 F1 46
##$RELAX= 
##$RELAX= 
##$RELAX= 
##$RELAX= 
##$RELAX= 
##$RELAX= 
##$RELAX= 
$$ Bruker specific parameters
$$ --------------------------
##$DU= <C:\u>
##$EXPNO= 40
##$NAME= <ADRS>
##$PROCNO= 1
##$TYPE= <nmr>
##$USER= <dgb>
##$AMP= (0..31)
100 100 100 100 100 100 100 100 100 100 100 100 100 100 100 100 100 100 
100 100 100 100 100 100 100 100 100 100 100 100 100 100 
##$AQSEQ= 0
##$AQ_mod= 3
##$AUNM= <au_zg>
##$AUTOPOS= <56 >
##$BF1= 250.13
##$BF2= 250.13
##$BF3= 250.13
##$BF4= 250.13
##$BF5= 500.13
##$BF6= 500.13
##$BF7= 500.13
##$BF8= 500.13
##$BYTORDA= 1
##$CFDGTYP= 0
##$CFRGTYP= 5
##$CHEMSTR= <none>
##$CNST= (0..31)
1 1 145 1 1 1 1 1 1 1 1 1 1 1 1 1 1 1 1 1 1 1 1 1 1 1 1 1 1 1 1 1 
##$CPDPRG= <>
##$CPDPRG1= <>
##$CPDPRG2= <>
##$CPDPRG3= <>
##$CPDPRG4= <mlev>
##$CPDPRG5= <mlev>
##$CPDPRG6= <mlev>
##$CPDPRG7= <mlev>
##$CPDPRG8= <mlev>
##$CPDPRGB= <>
##$CPDPRGT= <>
##$D= (0..31)
0 1 0 0 0 0 0 0 0 0.06 0 0 0 0 0 0 0.0002 0 0 0 0 0 0 0 0 0 0 0 0 0 0 
0 
##$DATE= 1172751260
##$DBL= (0..7)
120 120 120 120 120 120 120 120 
##$DBP= (0..7)
150 150 150 150 150 150 150 150 
##$DBP07= 0
##$DBPNAM0= <>
##$DBPNAM1= <>
##$DBPNAM2= <>
##$DBPNAM3= <>
$$ [...]
##$SUBNAM7= <"">
##$SUBNAM8= <"">
##$SUBNAM9= <"">
##$SW= 20.6930455092707
##$SWIBOX= (0..15)
0 0 3 0 0 0 0 0 0 0 0 0 0 0 0 0 
##$SW_h= 5175.983436853
##$TD= 65536
##$TD0= 1
##$TE= 295.16
##$TE2= 300
##$TE3= 300
##$TEG= 300
##$TL= (0..7)
0 120 120 120 120 120 120 120 
##$TP= (0..7)
150 150 150 150 150 150 150 150 
##$TP07= 0
##$TPNAME0= <>
##$TPNAME1= <>
##$TPNAME2= <>
##$TPNAME3= <>
##$TPNAME4= <>
##$TPNAME5= <>
##$TPNAME6= <>
##$TPNAME7= <>
##$TPOAL= (0..7)
0.5 0.5 0.5 0.5 0.5 0.5 0.5 0.5 
##$TPOFFS= (0..7)
0 0 0 0 0 0 0 0 
##$TUNHIN= 0
##$TUNHOUT= 0
##$TUNXOUT= 0
##$USERA1= <user>
##$USERA2= <user>
##$USERA3= <user>
##$USERA4= <user>
##$USERA5= <user>
##$V9= 5
##$VALIST= <valist>
##$VCLIST= <CCCCCCCCCCCCCCC>
##$VD= 0
##$VDLIST= <DDDDDDDDDDDDDDD>
##$VPLIST= <PPPPPPPPPPPPPPP>
##$VTLIST= <TTTTTTTTTTTTTTT>
##$WBST= 1024
##$WBSW= 4
##$XGAIN= (0..3)
0 0 0 0 
##$XL= 0
##$YL= 0
##$YMAX_a= 567206
##$YMIN_a= -411060
##$ZGOPTNS= <>
##$ZL1= 120
##$ZL2= 120
##$ZL3= 120
##$ZL4= 120
##$ABSF1= 16.522
##$ABSF2= -4.171173
##$ABSG= 5
##$ABSL= 3
##$ALPHA= 0
##$AQORDER= 0
##$ASSFAC= 0
##$ASSFACI= 0
##$ASSFACX= 0
##$ASSWID= 0
##$AUNMP= <proc_1d>
##$AZFE= 0.1
##$AZFW= 0.1
##$BCFW= 0
##$BC_mod= 0
##$BYTORDP= 0
##$COROFFS= 0
##$CY= 12.5
##$DATMOD= 1
##$DC= 0
##$DFILT= <>
##$DTYPP= 0
##$F1P= 14.0000005364418
##$F2P= -0.99999901652339
##$FCOR= 0.5
##$FTSIZE= 32768
##$FT_mod= 6
##$GAMMA= 0
##$GB= 0
##$INTBC= 1
##$INTSCL= 1
##$ISEN= 128
##$LB= 0.3
##$LEV0= 0
##$LPBIN= 0
##$MAXI= 10000
##$MC2= 0
##$MEAN= 0
##$ME_mod= 0
##$MI= 0
##$NCOEF= 0
##$NC_proc= -3
##$NLEV= 6
##$NOISF1= 0
##$NOISF2= 0
##$NSP= 0
##$NTH_PI= 0
##$NZP= 0
##$OFFSET= 16.522
##$PC= 1
##$PHC0= 74.38883
##$PHC1= 6.527924
##$PH_mod= 1
##$PKNL= yes
##$PPARMOD= 0
##$PSCAL= 4
##$PSIGN= 0
##$REVERSE= no
##$SF= 250.13
##$SI= 32768
##$SIGF1= 0
##$SIGF2= 0
##$SINO= 400
##$SIOLD= 32768
##$SREGLST= <1H.CDCl3>
##$SSB= 0
##$STSI= 32768
##$STSR= 0
##$SW_p= 5175.98343685301
##$SYMM= 0
##$S_DEV= 0
##$TDeff= 65536
##$TDoff= 0
##$TI= <Analysis number 999999
Compound Code 99
Book Reference 9
Project Code 9>
##$TILT= no
##$TM1= 0
##$TM2= 0
##$TOPLEV= 0
##$USERP1= <user>
##$USERP2= <user>
##$USERP3= <user>
##$USERP4= <user>
##$USERP5= <user>
##$WDW= 1
##$XDIM= 32768
##$YMAX_p= 500238960
##$YMIN_p= -324949
$$ End of Bruker specific parameters
$$ ---------------------------------
##NTUPLES= NMR SPECTRUM
##VAR_NAME=  FREQUENCY,     SPECTRUM/REAL,   SPECTRUM/IMAG
##SYMBOL=    X,             R,               I
##VAR_TYPE=  INDEPENDENT,   DEPENDENT,       DEPENDENT
##VAR_FORM=  AFFN,          ASDF,            ASDF
##VAR_DIM=   32768,         32768,           32768
##UNITS=     HZ,            ARBITRARY UNITS, ARBITRARY UNITS
##FACTOR=    0.157963299565203, 1,           1
##FIRST=     4132.6476996994, 0,             0
##LAST=      -1043.33573715361, 0,           0
##MIN=       -1043.33573715361, -324949,     0
##MAX=       4132.6476996994, 500238960,     0
$$ Real data points
##PAGE= N=1
##DATA TABLE= (X++(R..R)), XYDATA
$$ [...]
18982C71310J3713O310P96p05n72L078R029N214R092J2241Q945P806J6426M124
18968D66807J174K456J348n810n63j089o826J796K004l218M059P960K666N874
18954D78638Q130M138L054j660P518J698J327n128p75Q25N928J2249K387k522
18940E15807j003J115K884L972O686m720n76O595R362K405Q346Q442L048P875
18926E70238P397J0519K253j336L133P019O177O377P496L487O006J4637R297L548
18912F56248k182N621Q044P854r150k059N672J7376K4092J7070N271K322K189
18899G38368O841R4P472J1474N740J0339J2468P796N779J3517J3538O2Q210J3115
18885H54813J3613J2632J3978R780J0450O392J4115J1859J5236J5315J6437J1490
$$ y = [371310, 385023, 391333, 392129, 391424, 390852, 393930, 402959, 408173, 417265, 429506, 438451, 446257, 462683, 466807, 467981, 470437, 471785, 465975, 465412, 464323, 457497, 459293, 461297, 458079, 462138, 470098, 472764, 478638, 486768, 490906, 493960, 492300, 499818, 501516, 502843, 497715, 496940, 497765, 503693, 515942, 518329, 515807, 514804, 515919, 518803, 522775, 529461, 524741, 524165, 530760, 540122, 542527, 550873, 559315, 562363, 570238, 577635, 588154, 590407, 589071, 592204, 599223, 605400, 611777, 619273, 622760, 628766, 643403, 652700, 656248, 654066, 659687, 667731, 675585, 666435, 664376, 670048, 687424, 711516, 728586, 733857, 736179, 738368, 745209, 745303, 752775, 764249, 769989, 780328, 792796, 800592, 806371, 819888, 833426, 833488, 841698, 854813, 868426, 881058, 895036, 904816, 915266, 921658, 935773, 947632, 962868, 978183, 994620, 1006110]
18873A006110M066J5034J8850J4556K6811J9538J6990K1839K0483K3301K8749
18862A216327L3666K5455K2310J6997J8852K4521K2148J4046J2486K0318J8879
18851A446005K2259K6958K6979K6452K1368K3510J5605Q297J5336K2301K2417
18840A677487K2073J9882K5659L0792K9743L2562L5276L5266L7826L7154L6171
18829B019891L3599M0314M7932M5064L8555M6326M9803M4040M1731N8669O9156
18818B535080O5688P0186O8659O3695O9625O3284O8832Q3405R6075J11386J29783
18807C425698J52483J63106J61164J24520O1389L0352J2417j728K2865O1704J11447
18796D325417J39469J54173J63728J39416Q3932M5378K0741J374J0931M6780O7527
$$ y = [1006110, 1010176, 1025210, 1044060, 1058616, 1085427, 1104965, 1121955, 1143794, 1164277, 1187578, 1216327, 1249993, 1275448, 1297758, 1314755, 1333607, 1358128, 1380276, 1394322, 1406808, 1427126, 1446005, 1468264, 1495222, 1522201, 1548653, 1570021, 1593531, 1609136, 1617433, 1632769, 1655070, 1677487, 1699560, 1719442, 1745101, 1775893, 1805636, 1838198, 1873474, 1908740, 1946566, 1983720, 2019891, 2053490, 2093804, 2141736, 2186800, 2225355, 2271681, 2321484, 2365524, 2407255, 2465924, 2535080, 2600768, 2670954, 2739613, 2803308, 2872933, 2936217, 3005049, 3088454, 3184529, 3295915, 3425698, 3578181, 3741287, 3902451, 4026971, 4088360, 4118712, 4131129, 4129401, 4152266, 4213970, 4325417, 4464886, 4619059, 4782787, 4922203, 5006135, 5051513, 5072254, 5073628, 5084559, 5131339, 5198866]
18785E198866P5958Q7633J00178J02931J15891J09565J02901J08951J15090J13225
18775F231189J12301J16095J11980J14136J26467J23461J32584J38168J36403
18766G342784J41376J32393J24659J39039J37980J43223J60128J74162J89742
18757H685486J91939J85835J61211J14262P3002N5925M7132O5484R0241J20709
18747I791226J44190J55639J48398J22853P4361L0093m539l0018j9851N846J3359
18736A0431557K2886K9158L2859L0702K9784K6027K3071K1788J4974J1901M834
18725A0679541O857O256o356o608K52m602p986j8409k5208l1815m0735m1111l1221
18712A0478855k8258m5483n1420n7010n8593o0694o8071q3294q2685q8071q1787
$$ y = [5198866, 5274824, 5362457, 5462635, 5565566, 5681457, 5791022, 5893923, 6002874, 6117964, 6231189, 6343490, 6459585, 6571565, 6685701, 6812168, 6935629, 7068213, 7206381, 7342784, 7484160, 7616553, 7741212, 7880251, 8018231, 8161454, 8321582, 8495744, 8685486, 8877425, 9063260, 9224471, 9338733, 9411735, 9467660, 9514792, 9580276, 9670517, 9791226, 9935416, 10091055, 10239453, 10362306, 10436667, 10466760, 10462221, 10432203, 10412352, 10418198, 10431557, 10454443, 10483601, 10516460, 10547162, 10576946, 10602973, 10626044, 10647832, 10662806, 10674707, 10679541, 10686398, 10692654, 10686298, 10679690, 10679942, 10675340, 10667354, 10648945, 10623737, 10591922, 10551187, 10510076, 10478855, 10450597, 10405114, 10353694, 10296684, 10238091, 10177397, 10109326, 10026032, 9943347, 9855276, 9773489]
18701I773489q6950j03947r3504j02472j07751j01637j02834j09301j04947j19988
18691H740158j15792j14347j16467j20108j11849j26731j28134j23541j14220
18682G668969j14658j20071j14736j11365j15762j18849j17687j16025j21607
18673F618209j20860j16987j13211j16987j18945j22818j20111j13195j14445
18664E560650j14111j04041j03754j04457j03479r7712r6326r0301q3099p6839
18654D586531o9054o8733p6080r6788j02263j00165j04370j05895r2412o6507
18644C704264n1720m4387m6419n7611p1039q5650j01491j03950j00682q2066p4032
18633B885217o5129o9867o4373o0986n6658m9680m6693m4538n7354n5170l8661
$$ y = [9773489, 9686539, 9582592, 9489088, 9386616, 9278865, 9177228, 9074394, 8965093, 8860146, 8740158, 8624366, 8510019, 8393552, 8273444, 8161595, 8034864, 7906730, 7783189, 7668969, 7554311, 7434240, 7319504, 7208139, 7092377, 6973528, 6855841, 6739816, 6618209, 6497349, 6380362, 6267151, 6150164, 6031219, 5908401, 5788290, 5675095, 5560650, 5446539, 5342498, 5238744, 5134287, 5030808, 4933096, 4836770, 4746469, 4663370, 4586531, 4517477, 4448744, 4372664, 4275876, 4173613, 4073448, 3969078, 3863183, 3770771, 3704264, 3652544, 3608157, 3561738, 3504127, 3433088, 3347438, 3245947, 3141997, 3041315, 2959249, 2885217, 2820088, 2750221, 2685848, 2624862, 2568204, 2518524, 2471831, 2427293, 2369939, 2314769, 2276108]
18622B276108m3609m4766m5988m4242l4935l1217l6505m4623l5458k7000l7101
18611A850664l5635k7527l1126k4380j8488p351j518j514J2346N767j1852l2408
18599A676978m1851m1200m8533l8641k0127j1849L540J0941j884n037k2774l1614
18587A427949n4596n9409m6426l8598l7855k6155j6594j7825k0387j4711q239
18576A087154j0161j3620p913j0114k4843j9807j1543j3481j1550j1622j2858
18565I39642j1458j2781j3004q395j4765j7123j9331j1705p580m125q873j2419
18553G98083j6522j1589j4274r401q935o785r450k583q551n790l907j6112j2918
18540F71266l230L078p668j0278n700q023J223j363r242o009l79j1760j7386q636
$$ y = [2276108, 2232499, 2187733, 2141745, 2097503, 2062568, 2031351, 1994846, 1950223, 1914765, 1887765, 1850664, 1815029, 1787502, 1756376, 1731996, 1713508, 1706157, 1704639, 1703125, 1715471, 1721238, 1709386, 1676978, 1635127, 1593927, 1545394, 1506753, 1486626, 1474777, 1478317, 1489258, 1487374, 1482337, 1459563, 1427949, 1373353, 1313944, 1267518, 1228920, 1191065, 1164910, 1148316, 1130491, 1110104, 1095393, 1087154, 1076993, 1063373, 1055460, 1045346, 1020503, 1000696, 989153, 975672, 964122, 952500, 939642, 928184, 915403, 902399, 894004, 879239, 862116, 842785, 831080, 823500, 819375, 810502, 798083, 781561, 769972, 755698, 746297, 737362, 730577, 721127, 718544, 709993, 704203, 700296, 684184, 671266, 668036, 671114, 663446, 653168, 647468, 639445, 640668, 639305, 630063, 624054, 623675, 611915, 594529, 585893]
18526E85893N088J050J646p218l132l130r511o462o365n319m001q336j1578m769
18512E23856j0048k736K265o518j1006q230m425j787j629j2124j4157o331n262
18499D41868j163p439m745P062J2692J5105J141M798K096k874k319r869r414q21
18485D46118N950J0975Q697K980K796K897O80L824m457j5042j7165j0177n669
18472D32407o489j3581p547N43n049o571n883n229J515K111p745j11J460k51n575
18457C74005k535K822L767l810L026Q624J8349J8808J2715J5992M708Q573N50
18444D65594n294j5459j5618j957M703J0763O117J456M308M50L69o755j2948p620
18430D28109J84J3080M152k05j319M616O473m334n886K736M193P107J4977J0389
$$ y = [585893, 590981, 592031, 593677, 586459, 583327, 580197, 570686, 564224, 557859, 552540, 548539, 540203, 528625, 523856, 513808, 511072, 513337, 506819, 495813, 487583, 483158, 481371, 479742, 467618, 453461, 447130, 441868, 440705, 433266, 428521, 435583, 448275, 463380, 464521, 469319, 471415, 468541, 466222, 456353, 446939, 446118, 452068, 463043, 471740, 474720, 477516, 480413, 481093, 484917, 480460, 465418, 448253, 438076, 432407, 425918, 412337, 404790, 405333, 400284, 393713, 387830, 382601, 384116, 386227, 378482, 378371, 379831, 379580, 374005, 371470, 374292, 378059, 374249, 377275, 385899, 404248, 423056, 435771, 451763, 456471, 465044, 465594, 460300, 444841, 429223, 427266, 431969, 442732, 448849, 450305, 454613, 455063, 455432, 448677, 435729, 428109, 428293, 441373, 445525, 445320, 444001, 448617, 455090, 450756, 444870, 447606, 451799, 458906, 473883, 484272]
18416D84272J0423k812m073Q2k429j0347m273q705j4467P79Q254k08K949P272
18402D66717J5519M931j518J1556J5521K3976L1772L0827M6067N1242M1819K9974
18390G68403J7743J2183J0096J0311K3560L8320N0159N2971O4479O5854O3896
18379A177975O4545Q1633R8253J26508J80244K48615L73231N57226Q19532J208574
18369D936336J722063K244279K509571K280543J558594N66605l4715k28854o62288
18360A4892134j301359j215569k00090R22317J542221J493546Q53893o7585n92719
18351A6326789q55596j465782k290479k444998j871835j246196q32526n68097
18343D751280m01592k83963k03116j49672j14172r0683o4817o8540o8526n4139
$$ y = [484272, 494695, 491883, 487810, 487892, 485463, 475116, 470843, 462138, 447671, 448450, 456704, 456496, 459445, 466717, 482236, 487167, 485649, 497205, 512726, 536702, 568474, 599301, 645368, 696610, 738429, 768403, 786146, 798329, 808425, 818736, 842296, 880616, 930775, 983746, 1048225, 1114079, 1177975, 1242520, 1324153, 1422406, 1548914, 1729158, 1977773, 2351004, 2908230, 3727762, 4936336, 6658399, 8902678, 11412249, 13692792, 15251386, 15817991, 15783276, 15554422, 14892134, 13590775, 12375206, 12175116, 13097433, 14639654, 16133200, 16987093, 16919508, 16326789, 15471193, 14005411, 11714932, 9269934, 7398099, 6151903, 5319377, 4751280, 4349688, 4065725, 3862609, 3712937, 3598765, 3508082, 3443265, 3374725, 3306199, 3252060]
18333C252060l0500P949Q0551J68967K84362M52817O80722J000990J466959K061724
18323I426601K594118K784439K454485J650903P54081M68958N64857M40716L86302
18314B1525460J291110K733068L566632L243069J953913N76403n66997j507478
18306C2815180k486039l029459k698794j482169k08321K97958l8904p77326j124475
18297B1267651j298229j943347k802875k860416k193992j521322j086344q14103
18289F747023o33664n04252l86238l05122k39856j93759j73383j63827j48091
18280C998831j14006p9120k6554L6060R9070J90391L57191O23076J009757J537962
18270G632658K175975K730502K872599K423467J429434K96222k24089m64525j090092
$$ y = [3252060, 3221560, 3229509, 3310060, 3479027, 3763389, 4216206, 4896928, 5897918, 7364877, 9426601, 12020719, 14805158, 17259643, 18910546, 19664627, 20133585, 20698442, 21139158, 21525460, 22816570, 25549638, 29116270, 32359339, 34313252, 34889655, 34322658, 32815180, 30329141, 27299682, 24600888, 23118719, 22910398, 23208356, 23169452, 22392126, 21267651, 19969422, 18026075, 15223200, 12362784, 10168792, 8647470, 7561126, 6747023, 6113359, 5609107, 5222869, 4917747, 4677891, 4484132, 4310749, 4146922, 3998831, 3884825, 3805705, 3779151, 3815211, 3914281, 4104672, 4461863, 5084939, 6094696, 7632658, 9808633, 12539135, 15411734, 17835201, 19264635, 19560857, 19336768, 18872243, 17782151]
18261A7782151j714194j240428Q5968J284253J763165J471534N83958m07218q55277
18252A8753912j210400k063065k913428k816961k065485j390793r46041o73973
18244D673766m89916l68221k89990k51383k28676k10113k10404j94621j86496
18235B243946j87115j70153j44736j19095r8123p7586o1557n3272m2086k0617
18225A269606k1956l9573o8603j02410j15876r8302o4773m0290j1546P930J0234
18214G24441K4790K2567q340n7756q8757q2560n3397l0511j9022k2807k1909j9082
18202C67657j8030k2071j2594j5397j2320j2633o843m731r816j4780n684k084
18190B30674j1676n229j328q808r627j672k444N22n246K247j191l904N515J0139
$$ y = [17782151, 16067957, 14827529, 14913497, 16197750, 17960915, 19432449, 20016407, 19609189, 18753912, 17543512, 15480447, 12567019, 9750058, 7684573, 6293780, 5347739, 4673766, 4183850, 3815629, 3525639, 3274256, 3045580, 2835467, 2625063, 2430442, 2243946, 2056831, 1886678, 1741942, 1622847, 1524724, 1447138, 1385581, 1332309, 1290223, 1269606, 1247650, 1208077, 1139474, 1037064, 921188, 822886, 758113, 717823, 706277, 714207, 724441, 749231, 771798, 763458, 705702, 616945, 534385, 480988, 450477, 431455, 408648, 386739, 367657, 349627, 327556, 314962, 299565, 287245, 274612, 267769, 263038, 253222, 238442, 232758, 230674, 218998, 213769, 212441, 203633, 194006, 192334, 189890, 190412, 185166, 187413, 186222, 182318, 187833, 197972]
18176A97972K672N867J553j6j467l563j1793l303Q100l536N47J1712P657n690
18162B06712r383k810M381o467j1409j1931m739j89L189j327M262l183l368J287
18148A65025L430O58l946O80L187l211j326K590q5j134P74J4986O341N814Q925
18133B02708O524L571L558J1037P898J6692L1591L2472J7867K0485J8744K6428
18121C99575L9168M6409M5859N9898Q3022J17888J84422K98759M54089P12499
18111B441588J143876J746969K222405K064070J059891p26008k744819k508439
18103D699533j462929q04063m89900l34980k24582j60843j11180p6562m5414l2018
18093I57062l5116o6488p5832p7195p0098o3372n5449m5703m3249l6140k4410
$$ y = [197972, 200644, 206511, 208064, 208048, 206581, 203018, 191225, 187922, 196022, 192486, 193033, 204745, 212402, 206712, 197329, 194519, 198900, 192433, 181024, 169093, 164354, 164165, 167354, 166027, 170289, 167106, 163738, 165025, 168455, 169113, 165167, 165847, 169034, 165823, 164497, 167087, 167002, 165868, 166642, 181628, 187969, 193783, 202708, 209232, 212803, 216361, 227398, 235296, 251988, 283579, 316051, 333918, 354403, 373147, 399575, 438743, 485152, 531011, 590909, 673931, 791819, 976241, 1275000, 1729089, 2441588, 3585464, 5332433, 7554838, 9618908, 10678799, 9952791, 7207972, 4699533, 3236604, 2432541, 1942641, 1607661, 1383079, 1222236, 1111056, 1034494, 989080, 957062, 921946, 855458, 779626, 702431, 632333, 568961, 513512, 467809, 424560, 388420, 364010]
18082C64010j0162j8654j4971j2544j0274m482p470j4786j3715j8128k0633j9137
18070A99054L153P56r34O038L628o230j4736j2393j2216r819m618r568j1660l943
18056A26512k482Q00q847o364L7k328k987j781L535m634n817m119l63K628k194
18041I1596K330j62l459q415l578m041L73K331P377J0060k152q565j667M188R52
18026H7168q103n892l964k489m142L815J0231o543n875k370M975J2368J153j537
18012G8795j282j428m688L126J5540M209n177n08l476l178m815l126m466l5R49
17997G0440m695r514l135L084L630K914M367q400n649P949O101r901p481j823
17983D7887K13P117l419n376k382J312P844j370n52J118M140M852M194m416j0334
$$ y = [364010, 353848, 335194, 320223, 307679, 297405, 292923, 285453, 270667, 256952, 238824, 218191, 199054, 202207, 202963, 202029, 208067, 211695, 205465, 190729, 178336, 166120, 156301, 151683, 142115, 130455, 126512, 124030, 124830, 115983, 109619, 109656, 107328, 104341, 102560, 106095, 101461, 95644, 91525, 91162, 93790, 91596, 93926, 93764, 90305, 81890, 78312, 74271, 74644, 76975, 84352, 94412, 92260, 83695, 82028, 86216, 87168, 79065, 73173, 69209, 66720, 62578, 66393, 76624, 70081, 64206, 61836, 66811, 79179, 80332, 78795, 77513, 76085, 71397, 74523, 90063, 94272, 89095, 88587, 85111, 81933, 77118, 73992, 69526, 69491, 70440, 65745, 56231, 53096, 56180, 59810, 62724, 67091, 58691, 53042, 60991, 67092, 57191, 49710, 47887, 48100, 55217, 51798, 46422, 44040, 45352, 53196, 51826, 51274, 52392, 56532, 61384, 65578, 61162, 50828]
17968E0828K590N240k802m826L384N514j138k602l612l069N47r02N423L484l666
17953E4393r80M912L203m302N470O503j769o828m470o667o404L26M201m623k858
17938D0107O939K886q527J079L360K997N41k000j636N581j895j121j686k42K824
17923D9207L316l52j459M09M889o36o695l441k127k23Q08k939j648l914J263M690
17907D1148j953J438k859o112J020K460K015j996Q073M819n110p99L11j832l777
17892C6846O671j909k20L765J187n108Q15k183K332J586p057K723M245K705r92
17877D5406K118K787n661K802O560N249k785K056N311P225R045Q874R717k24L001
17862A01481O828O118P122n587j2633J412l110j456K110M380L835J68J87j296
$$ y = [50828, 53418, 58658, 55856, 51030, 54414, 59928, 58790, 56188, 52576, 49507, 50054, 49152, 54575, 58059, 54393, 53413, 58325, 61528, 57226, 62696, 69199, 67430, 60602, 56132, 49465, 43061, 43387, 47588, 42965, 40107, 47046, 49932, 41405, 42484, 45844, 48841, 49382, 47382, 45746, 51327, 49432, 48311, 46625, 46383, 49207, 52523, 52171, 50712, 51121, 56010, 55374, 48679, 45238, 43111, 42888, 43696, 40757, 39109, 35195, 36458, 41148, 39195, 40633, 37774, 31662, 32682, 35142, 37157, 35161, 43234, 48053, 42943, 42144, 42455, 40623, 36846, 43517, 41608, 41388, 45153, 46340, 41232, 42047, 39864, 42196, 43782, 36725, 39448, 43693, 46398, 45406, 47524, 50311, 44650, 47452, 54012, 59261, 56476, 58532, 63843, 71068, 80113, 88987, 98704, 98480, 101481, 108309, 114427, 121549, 115962, 103329, 104741, 101631, 100175, 102285, 106665, 110500, 110668, 110855, 109559]
17848A09559n395j0543o114r628n825j812r591q891O55K579l600p301k294J286
17834D3085O597M848l158n512L517k268J0468J0287L420m826J850J1449J0036
17821H9793J3650J5044J5906R745j063k102O207N80l811R754K0076K0205K0084
17808B14068M204m903M52k337j1061j8878j3642k727k010o710k225l227o519j2721
17794A31764j3920j5071j8585r991o199r059o149k159K603L236j206j213n019
17781D9032n544m083L762J12J555M23r041K783N108L522R415M855J4592J3644
17767I0135K1149K0269J5055P253k646p748l808j0901k1135m341J0109P813Q274
17754A29478P911J074K29p515j2658j2729j0815j0790r241K552q173p733q214
$$ y = [109559, 104164, 93621, 87507, 77879, 72054, 70242, 60651, 51760, 52415, 54994, 51394, 44093, 41799, 43085, 49682, 54530, 51372, 45860, 49377, 47109, 57577, 67864, 71284, 66458, 68308, 79757, 89793, 103443, 118487, 134393, 144138, 143075, 140973, 147180, 147760, 143949, 153703, 173779, 193984, 214068, 218272, 213369, 213821, 211484, 200423, 181545, 167903, 165176, 163166, 156456, 154231, 151004, 144485, 131764, 117844, 102773, 84188, 74197, 67998, 58939, 52790, 50631, 53234, 56470, 55264, 54051, 49032, 43488, 39405, 43167, 43279, 44834, 45257, 36216, 38999, 44107, 47629, 57044, 61899, 76491, 90135, 111284, 131553, 146608, 153861, 151215, 143467, 139659, 128758, 107623, 103282, 113391, 121204, 129478, 137389, 138463, 138692, 131177, 118519, 105790, 94975, 84185, 74944, 77496, 69323, 61590, 53376]
17741E3376p494K764L240K06r378m930M750L132n748O32K976J655O38k852k280
17726D0687J71k024L596L04n124L262J305O388L341j129J516P018R59M398J1586
17711G6254J1186J0168J5571K1566K6639L0050K2641K1204J8777J1497O768P953
17699B80274j073L92N467r032j5678j7862l1950l2682k1535k6179j6495q882p835
17686I6930j0748k971o819N162L78j766P756K510m866J845p077n390J38n665k506
17671F6911M822Q804j558k375k216J284j921J900K096K807O752J3358J3316K3389
17657A37369L0061M0293N9993P4147R1191R6549R0458P2748N4854L1565J6947
17646G96175J2281J0131J0378m922k6348o9984r2908r6060r0884p6552o2523l8820
$$ y = [53376, 45882, 48646, 51886, 52092, 42714, 37784, 42534, 45666, 39918, 40550, 43526, 45181, 45819, 42967, 40687, 40858, 38834, 42430, 42734, 37610, 40872, 42177, 48565, 51906, 50777, 52293, 59311, 60270, 64668, 76254, 87440, 97608, 113179, 134745, 161384, 191434, 214075, 235279, 254056, 265553, 272321, 280274, 279201, 279593, 285060, 276028, 260350, 242488, 210538, 177856, 156321, 130142, 113647, 104765, 96930, 86182, 83211, 76392, 81554, 81932, 80166, 87922, 90432, 85566, 87411, 80334, 74944, 75082, 69417, 66911, 71733, 80537, 78979, 76604, 74388, 75672, 73751, 75651, 77747, 80554, 87306, 100664, 113980, 137369, 167430, 207723, 267716, 341863, 433054, 529603, 620061, 692809, 747663, 779228, 796175, 808456, 818587, 828965, 824043, 797695, 727711, 634803, 538743, 447859, 371307, 308784, 269964]
17634B69964k9001k2999j2331j4456j8426j1911m146M801O949J0149J1466J3509
17622B03568Q044K983K235j3342r200J2444J1198N572m399j7310k3826k9718j8856
17609A29393o390m901K497K237O237J4039K7244M4294M2844N1616O2619O0506
17597D32235N7266L7013J5421Q32L831K701k42j0235k5688l9635n8130n9800n6159
17584B99410m5012k6437k0063p288R078J1976P788J2283R465P45M308J2460K6732
17571B95445J5362L825j4334k3063k5080j0932q657j0262j6138k3954k9075l2359
17559A20778k1534j1053j2191l469K003o245j1841m15J831J063l995k485k763
17546D9684M364J627m043l380M716L039p354m804M78J3969L131j1167m725N077
$$ y = [269964, 240963, 217964, 205633, 191177, 172751, 160840, 156694, 161495, 168444, 178593, 190059, 203568, 211612, 214595, 216830, 203488, 194288, 206732, 217930, 223502, 219103, 201793, 177967, 148249, 129393, 123003, 118102, 120599, 122836, 129073, 143112, 170356, 214650, 257494, 309110, 371729, 432235, 489501, 526514, 541935, 542767, 546598, 549299, 549057, 538822, 513134, 473499, 415369, 355569, 299410, 254398, 227961, 207898, 200610, 209688, 221664, 229452, 241735, 251200, 251945, 256253, 268713, 295445, 310807, 314632, 300298, 277235, 252155, 241223, 232566, 222304, 206166, 182212, 153137, 120778, 99244, 88191, 76000, 72531, 74534, 68289, 56448, 56033, 57864, 58927, 54932, 52447, 49684, 54048, 55675, 51632, 48252, 52968, 56007, 48653, 43849, 44327, 58296, 61427, 50260, 45535, 50612]
17532E0612J4080J8089J2053J8688K4679J7493J3309N568L409J079N333K7922
17520B12314M0683N2572N4041L4675K5725P06k8064l9301k5186K761J5744J4498
17508C61168o500m1927n6243n4671m3548k1020j3315j5803j4693P69Q280m988
17496I7509n965m54p87J823n535l940k213k043k63l571o151k667J057K030J589
17481G0419M966O504L788R898J7622J4519K6595M6085N4505O4053P6075P5168
17469D70197M9948L1761J9144R336j413j636q76J808k3312l4923n7001p5123o8881
17456C19029n6980l6128j6040j0605j1698j3060j5042j4434m947m851p858k574
17444A24812N487L614M494M531R888p466j6943j6676j5948j0554K990l805m674
$$ y = [50612, 64692, 82781, 94834, 113522, 138201, 155694, 169003, 174571, 177980, 179059, 184392, 212314, 252997, 305569, 359610, 394285, 420010, 420716, 392652, 353351, 328165, 330926, 346670, 361168, 354668, 312741, 256498, 201827, 158279, 137259, 123944, 108141, 93448, 94217, 102497, 97509, 91544, 91090, 90303, 92126, 86591, 82651, 80438, 78395, 78132, 74561, 68410, 65743, 66800, 68830, 70419, 75385, 81889, 85677, 95575, 113197, 127716, 154311, 200396, 254901, 318954, 395029, 470197, 520145, 551906, 571050, 580386, 578973, 577337, 576461, 578269, 554957, 520034, 463033, 387910, 319029, 262049, 225921, 209881, 199276, 187578, 174518, 159476, 145042, 140095, 135244, 127386, 124812, 130299, 133913, 138407, 142938, 152826, 145360, 128417, 111741, 95793, 85239, 88229, 84424, 79750]
17431G9750k67K848M581R041J2156K0739K9831M0160M3965M3827K6960k968k0755
17418B89868j3908l931K0030J3849M847j1585m2651n0845m2450k8427j9182q641
17406A06974m906j898n536o06r161p452O43m628n171j1098k001K76J029j94j835
17391E4436n945N249J254o262K4l658J877J152j216L88q839j145K381K883J889
17376D4468L101r12k201M62k633L398k652k073O11k075L260M792J008R44n625
17361D3873P686J728m729O31J346J652L736k202q45J80m858o722q745l613K630
17346C1748j117l085n682o706O68J642K87L943J950N784J7680J5540J4712J5122
17332I2486J1253J0376J3308J1829J6916J9521J0323O645j99k566j0674j3180
$$ y = [79750, 79483, 82331, 86912, 95953, 108109, 128848, 158679, 198839, 242804, 286631, 313591, 310623, 289868, 275960, 272029, 292059, 305908, 310755, 299170, 256519, 205674, 163224, 134797, 115615, 106974, 102068, 100170, 94634, 94028, 84867, 77415, 78058, 73430, 68259, 57161, 55160, 55436, 56465, 56271, 54436, 48491, 53740, 54994, 48732, 48756, 45098, 46975, 48127, 46911, 47299, 38460, 37315, 39696, 42579, 44468, 47569, 46657, 44456, 44918, 42285, 45683, 43031, 40958, 41569, 39494, 42754, 47546, 48554, 49498, 43873, 51559, 53287, 48558, 49189, 50535, 52187, 55923, 53721, 52876, 53056, 48198, 41476, 32731, 29118, 31748, 30631, 27546, 21864, 15158, 15826, 17468, 17755, 21698, 23648, 29432, 47112, 62652, 77364, 92486, 103739, 114115, 127423, 139252, 156168, 175689, 186012, 192657, 192458, 189892, 179218, 166038]
17320A66038p934M72N845K041l068K456L732m192j155P120J795j22o293l986o55
17305A62094N837L691l996Q17p74pn099k644j689o925K0N118o437j013Q27M339
17289A54159j159n77M264m103p58P142J0582K0631J9206Q596O577J4957K0758
17276B60275Q160J0345R011J2212J3791J3086M818j474l308n289l589j0630j2806
17263B94602n66M001k372K036J0092L769L927k110L803N733R446P523O824Q996
17249C55704J1337N714N035J4631J5358J2793J1921J6266J6122K2589M1169N6096
17237E84735O1902N6876N7386M1277N1819O3884P7061R2447J03258R5993Q5894
17226A372532P9001Q9764J03925J14110J28712J39540J75385K15547K74200L56913
$$ y = [166038, 158104, 158576, 164421, 166462, 163394, 165850, 169582, 165390, 164235, 171355, 173150, 173028, 166735, 162749, 162094, 167931, 171622, 167626, 168443, 167669, 167662, 162563, 159919, 158230, 151305, 151325, 156443, 150006, 148993, 149820, 154159, 153000, 152423, 156687, 152584, 151826, 158968, 169550, 190181, 209387, 217983, 224560, 239517, 260275, 268435, 278780, 287791, 300003, 313794, 326880, 331698, 330224, 326916, 321627, 318038, 307408, 294602, 294036, 298037, 295665, 297701, 307793, 311562, 315489, 313379, 317182, 322915, 332361, 339884, 346708, 355704, 367041, 372755, 377790, 392421, 407779, 420572, 432493, 448759, 464881, 487470, 528639, 584735, 646637, 703513, 760899, 802176, 853995, 917879, 994940, 1087387, 1190645, 1286638, 1372532, 1451533, 1541297, 1645222, 1759332, 1888044, 2027584, 2202969, 2418516, 2692716, 3049629]
17216C049629M95545O87980R72772J393676J975137K719093L561116M339551M881813
17207B4076312M982552M551036L781285K764511J918252J341416R72760P30647
17199D5118771J34580p58114k062353l440520m510017n115840n001921m438209
17191A9926377l597933k718268j980862j414483j008262p44052n93120n25869
17183G343528m93439m67420m32925l75204l31266k94703k75555k63619k48826
17174D160571k27039j89110j37383j01051q1602n4744l1537n110M2822J01680
17164C477497J64710K58523L95975N85643Q64907J254931J793442K483816L272631
17155A4552075L994947M493378M577482M169320L413603K405472J575840J001828
$$ y = [3049629, 3545174, 4233154, 5205926, 6599602, 8574739, 11293832, 14854948, 19194499, 24076312, 29058864, 33609900, 37391185, 40155696, 42073948, 43415364, 44388124, 45118771, 45253351, 44495237, 42432884, 38992364, 34482347, 29366507, 24364586, 19926377, 16328444, 13610176, 11629314, 10214831, 9206569, 8462517, 7869397, 7343528, 6850089, 6382669, 5949744, 5574540, 5243274, 4948571, 4673016, 4409397, 4160571, 3933532, 3744422, 3607039, 3505988, 3424386, 3369642, 3338105, 3332995, 3375817, 3477497, 3642207, 3900730, 4296705, 4882348, 5747255, 7002186, 8795628, 11279444, 14552075, 18547022, 23040400, 27617882, 31787202, 35200805, 37606277, 39182117, 40183945]
17147D0183945O45202M41596o6464q09470j931648l111198m063564m601197m506834
17138B2180368m015901l251736k426834j722884j205005q77677o97820n89276
17130G393235n28495m64899l98697l38106l02241k94072k86681k72226k38878
17121D268940j95211j07686j2442P8945J97388L69472O39596J032438J602305
17112G873745K410428L426553M337173M473235L320690R16216j724224k665311
17104B2368505j375139O02193J721155J353922m51903k925164m381419l992466
17096A2919684k762564j741703j120457q02666o37809n14126l94618k82522j91945
17087D471274j49966j49485j62206j55959j33956j10162r7528r5035p5148m4832
$$ y = [40183945, 40829147, 41270743, 41204279, 40394809, 38463161, 35351963, 31288399, 26687202, 22180368, 18164467, 14912731, 12485897, 10763013, 9558008, 8680331, 7982511, 7393235, 6864740, 6399841, 6001144, 5663038, 5360797, 5066725, 4780044, 4507818, 4268940, 4073729, 3966043, 3953601, 4032546, 4229934, 4599406, 5239002, 6271440, 7873745, 10284173, 13710726, 18047899, 22521134, 25841824, 26758040, 25033816, 22368505, 20993366, 21595559, 23316714, 24670636, 24218733, 21293569, 16912150, 12919684, 10157120, 8415417, 7294960, 6492294, 5854485, 5340359, 4945741, 4663219, 4471274, 4321308, 4171823, 4009617, 3853658, 3719702, 3609540, 3512012, 3416977, 3341829, 3296997]
17077C296997j370M3339R2630J47778K29227L49484N40222Q33636J271359J892142
17067H695444K747482L817904M746324M927283L985023K135265O15504J130006
17059C2800235L302492M859061M170787J098619k857327n186091m594832k284339
17051C1308605n22184n31615k157810m214886m912345m002838k708989j763962
17043A0493976j198268q96118p33129o40957n33019m44609l70469l32922l26769
17034E017716l13349k88718k67899k36190k20523k11144j74283j35927j05072
17025C064611n6830r018N1318J41408K85529M74349P51302J160313J740373K540568
17015A0143923L437939L980957L592943K002803m09311k184357j892113j79449
$$ y = [3296997, 3295627, 3338966, 3431596, 3579374, 3808601, 4158085, 4698307, 5531943, 6803302, 8695444, 11442926, 15260830, 20007154, 24934437, 28919460, 31054725, 31670229, 32800235, 36102727, 40961788, 45132575, 46231194, 43373867, 38187776, 33592944, 31308605, 30786421, 30254806, 28096996, 23882110, 18969765, 14966927, 12257938, 10493976, 9295708, 8399590, 7666461, 7025504, 6492485, 6047876, 5677407, 5344485, 5017716, 4704367, 4415649, 4147750, 3911560, 3691037, 3479893, 3305610, 3169683, 3064611, 3007781, 2998763, 3050081, 3191489, 3477018, 3951367, 4702669, 5862982, 7603355, 10143923, 13581862, 17562819, 21155762, 23158565, 22749254, 20564897, 18672784, 18493335]
17007A8493335J327061J653248N79435j538407l564248m039930l134163k024705
16999G751626j284533q73074o62382n43089m48692l56992k75573k06729j90950
16990B909612j87148j87264j93162k00780j88238j70057j45713j16962j06708
16981A413580r7187r6419j05257r8377r1417p8340o9577o5681n5616l8979k9742
16970E86988l2610l2987k7079k2423j7778k7034k2978j5539j3961j6946j9357
16959C38296j4074j1894q866o690o851r411j1954j4414p637j0187j3698j2999
16947B09621p103n307J78j982j5224j4083k945p452j0153m694o500p972r913q166
16933A08305l564P48L473j079l366K394J346O505R687j250j226l111J121K674
$$ y = [18493335, 19820396, 21473644, 22053079, 20514672, 16950424, 12910494, 9776331, 7751626, 6467093, 5594019, 4931637, 4388548, 3939856, 3582864, 3307291, 3100562, 2909612, 2722464, 2535200, 2342038, 2141258, 1953020, 1782963, 1637250, 1520288, 1413580, 1316393, 1219974, 1114717, 1016340, 924923, 846583, 777006, 711325, 655709, 616730, 586988, 554378, 521391, 494312, 471889, 454111, 427077, 404099, 388560, 374599, 357653, 338296, 324222, 312328, 303462, 296772, 289921, 280510, 268556, 254142, 246505, 236318, 222620, 209621, 202518, 197211, 197389, 195407, 180183, 166100, 163155, 155703, 145550, 140856, 134356, 126384, 116471, 108305, 104741, 105489, 108962, 107883, 104517, 106911, 108257, 114762, 124449, 123199, 121973, 118862, 119983, 122657]
16919A22657J614j307n310j014M767O52n424k647J360Q290k048p097N96j19o44
16904A14326j194l70r895l707l218M81k024K480L653r87Q49j701o899n296j632
16889H4866m892K17K018j252k213K848J466j30J960Q48m837o381k898J571O325
16874G9516L157P917J897K541l729q853r464J235J910J190K063n450k010n283
16860F6637J34L673n746k374Q823P653K906j234m318l467j232k802j224K242L348
16845G3019m277l477k093n236p242k268K133k843R08O415L295r37n30M38j260
16830E6045L22M33j663k009k958l443J422N96j018n378K266K070J42p147n909
16815C3771L02J6405Q750m529k019J666n434J815n20l553l312n860k275O38K689
$$ y = [122657, 124271, 122964, 117654, 116640, 121407, 122059, 116635, 113988, 115348, 123638, 121590, 114493, 115089, 114970, 114326, 113132, 112762, 102867, 99160, 95942, 96423, 94399, 96879, 100532, 99545, 100394, 98693, 91794, 86498, 84866, 79974, 80191, 82209, 80957, 78744, 81592, 83058, 82928, 84888, 85736, 80899, 74518, 71620, 73191, 79516, 82673, 90590, 92487, 95028, 91299, 82446, 72982, 74217, 76127, 77317, 79380, 73930, 71920, 66637, 66771, 70444, 64698, 62324, 71147, 78800, 81706, 80472, 76154, 72687, 71455, 68653, 67429, 69671, 73019, 68742, 65265, 63172, 57936, 50694, 48426, 50559, 47716, 48624, 55039, 58334, 57397, 56867, 57305, 56045, 56367, 56800, 55137, 53128, 50170, 46727, 48149, 48745, 47727, 42349, 44615, 46685, 46827, 39680, 33771, 34073, 50478, 59228, 54699, 52680, 54346, 48912, 50727, 50207, 46654, 43342, 37482, 35207, 35845, 38534]
16800C8534J773P305k731m645K053P933j033j244L257m438l396P07j196Q99l297
16785D0481M371M010l632L803o030K139m942o971r232P924M140J193n196j854
16771C0204K645O051J923m458l719q622m179M239M800J1243J511q359q723M712
16757B9268j337Q944O66l947j534l963k569J303O258M337n081l279J054l646l874
16742B2600n012j212M620j003N56l486J284n309J46L712O378k0k505j3874M389
16727A1264J321K454K456n91r81Q418R24N81P055N742J353J727q64m078k275L780
16711C8286O481j212L205P859J4938J5340K4148L0658L1488L0214K2368K0562
16699B44335N035N637j529m865j856j713r533j6852j9615k6077l1198j7409j2954
$$ y = [38534, 40307, 47612, 44881, 40236, 42289, 50222, 49189, 47945, 51202, 46764, 43368, 44075, 42879, 43778, 40481, 44852, 48862, 45230, 49033, 43003, 45142, 40200, 33229, 23997, 31921, 36061, 37254, 32058, 30204, 32849, 38900, 40823, 36365, 32646, 24024, 19845, 24084, 28884, 40127, 41638, 33279, 24556, 29268, 27931, 36875, 37541, 33594, 32060, 28097, 25528, 26831, 33089, 37426, 32345, 29066, 30120, 26474, 22600, 17588, 16376, 20996, 19993, 20549, 17063, 18347, 13038, 13184, 16896, 23274, 23254, 20749, 6875, 11264, 12585, 15039, 17495, 16904, 15923, 24341, 25265, 25846, 32901, 38643, 39996, 41723, 40859, 36781, 34506, 38286, 44767, 43555, 46760, 54619, 69557, 84897, 109045, 139703, 171191, 201405, 223773, 244335, 249370, 255007, 253478, 248613, 246757, 245044, 235511, 218659, 199044, 172967, 141769, 124360, 111406]
16686A11406j8325j5298q555j3392p212o222r608L17m548k204j045O30l9J711
16672B7616N238P205l721j595Q87m6J380p40J397N013M588K607K563j1730q853
16657C1809M428L583Q376P433P281J3887K3470K9849K5896J6212J7645J9990J1709
16644B21568P308L634K75j1739p770n655j1770k1896k1643j7350k3361j6081q512
16631H7008n174j2514j4665o303j55k463M165M713k776p726k623j600k88o260
16617C3339m087k248M002j69j05M7j1133k824J009k576J864O802L786O82p783
16602B0606j976O614P442J841J764m610j953P273J1856J1763J2474K6216K0155
16589A19465J1721J275j318k839l292j305M373Q097N740q183k2744j5799j4221
$$ y = [111406, 93081, 77783, 69228, 55836, 48624, 42402, 32794, 33111, 28563, 26359, 25314, 25944, 25905, 27616, 32854, 40059, 36338, 34743, 35630, 35584, 36964, 36224, 37621, 42634, 47222, 49829, 52392, 40662, 31809, 36237, 39820, 48196, 55629, 62910, 76797, 100267, 130116, 156012, 172224, 189869, 209859, 221568, 228876, 232510, 232785, 221046, 213276, 207621, 195851, 173955, 152312, 134962, 111601, 95520, 87008, 81834, 69320, 54655, 48352, 48197, 45734, 49899, 54612, 51836, 44110, 41487, 39887, 39599, 33339, 29252, 27004, 31006, 30837, 30732, 30779, 19646, 16822, 17831, 15255, 17119, 23921, 27707, 28389, 20606, 18630, 25244, 32686, 34527, 36291, 31681, 29728, 37001, 48857, 60620, 73094, 99310, 119465, 131186, 132461, 131143, 128304, 125012, 123707, 128080, 136177, 141917, 133734, 110990, 95191, 80970]
16576H0970j3414j5691n529k542o324N07N715K047r05q292j911j557r156l329
16562B0589o412j743K763m68l16L098k6J00N377M902O180L483R58P627J0073J2677
16546F8862J7833K0999K2889K0889J2041P504Q999K4732J9782J1146m57j4261
16534B20958k1432j5256j3089n926j231j1711k3108k4851j9388j6063j2674m969
16522E1260o982p616k300j784P254j809o517K804p18n048o746m420m436r175N962
16507I729N652m1N5O112Q465L055j738N05N941J0836O708Q771J3669J5786J1388
16492A04893N201O338j599o223M31J1343J731o074j5200j8743k0811j2298j1446
16479C7543m474j0116n962l283J938N666Q709O43n345n405N88o540l263O110M155
$$ y = [80970, 67556, 51865, 46336, 43794, 37470, 37977, 43692, 45739, 44834, 36542, 34631, 33074, 23918, 20589, 14177, 12434, 15197, 14729, 14413, 17511, 17485, 17585, 22962, 27864, 34044, 37527, 38485, 46112, 56185, 68862, 86695, 107694, 130583, 151472, 163513, 171017, 180016, 204748, 224530, 235676, 235219, 220958, 199526, 184270, 171181, 165255, 164024, 152313, 129205, 104354, 84966, 68903, 56229, 51260, 44278, 36662, 34362, 32578, 39832, 38023, 31506, 34310, 33592, 28544, 21798, 17378, 12942, 3767, 9729, 15381, 15340, 15395, 21507, 29972, 33027, 31289, 31794, 37735, 48571, 55279, 64050, 77719, 93505, 104893, 110094, 116432, 114833, 108610, 109041, 120384, 122115, 116041, 100841, 82098, 61287, 48989, 37543, 33069, 22953, 16991, 13708, 15646, 21312, 30021, 30664, 25319, 19914, 20502, 13962, 10699, 16809, 20964]
16464B0964m612J872l132m076k581l49J339p30M10k253n691k528M286j342N135
16449F712O089K068k721n520k042K805N20n762m354M607M762r691L940O503l735
16434D181q891J145L955Q15L706K952l072j515j051o03j18m65m688Q07J695J713
16418E66k961P44K978J353j364J732N81o356q049m476l831k01O906M104K79M88
16402g507Q086m780m076J312L135K613p883m723M909O501l204Q041N643k325j531
16387D211n473k183k3N22O80n954m546L013K145Q83O587J911K389L818m168J568
16371E380L936l041q708j357k132k010k009M834J2348k858o748j621j998n309
16357a1293R08J967N378l848l374J422K818L745N157r05j383N84K173J200k300
$$ y = [20964, 16352, 18224, 15092, 11016, 8435, 8086, 9425, 8695, 9105, 6852, 1161, -1367, 2919, 1577, 6712, 12801, 14869, 12148, 6628, 4586, 7391, 7911, 2149, -2205, 2402, 7164, -2527, 1413, 7916, 4181, -4710, -3565, 390, 1205, 4911, 7863, 4791, 3276, 2225, 1622, 1504, 1039, -3649, -2842, -1147, 566, -2395, -1651, 1327, 2680, 1316, 3048, 3629, -2727, -10776, -15252, -19083, -19284, -12378, -8274, -7995, -7507, 579, -4201, -8277, -6965, -3830, -1217, -9100, -13823, -8914, -2413, -5617, 2424, 8067, 5742, 4211, -1262, -3445, -3468, -2946, -2266, -8220, -12766, -9753, -7608, -6725, -138, 1773, 4162, 7980, 3812, 5380, 9316, 6275, -2433, -3790, -5922, -7932, -9941, -5107, 7241, 4383, -2365, -3986, -5984, -11293, -10385, -8418, -3040, -6888, -10262, -8840, -6022, -2277, 2880, 1975, 592, 1176, 3349, 4549, 2249]
16342B249l315k977J598j156Q181L754j294K133r024j678L619l741K222l341K525
16327b45l900n98l972l628l560K765O008J555K143M550L210k355m021l36M91L877
16311A984n073l311l081P044N082m639j855K676J364p622q02O191R09j0457j1153
16296b2743M187M859M835l019J334L589K284O204j790L316K05r34p075k27J986
16281b989J578N092L756J70K452j948k206r907m264K565J860n482Q76K212k011
16266h246m107N851Q076K655M237o429q219l739J639R477P652o387p74K13J44
16251B043n066n665M729P116r49L67R76j496n804o504J839m08m867M61O35K052
16235a0541m757l777j255Q981J2205O000n816l628L388K20K9o802k835L340L688
$$ y = [2249, -1066, -4043, -2445, -3601, 4580, 8334, 7040, 9173, 149, -1529, 2090, -1651, 571, -2770, -245, -4145, -4743, -8715, -12343, -15903, -13138, -7130, -5575, -3432, 1118, 4328, 1973, -2048, -2384, -1893, 1984, -3089, -6400, -9481, -2437, 2645, -1994, -3849, -1173, 191, -7431, -8233, -2042, -1133, -11590, -22743, -18556, -13697, -8862, -11881, -10547, -6958, -4674, 1530, -260, 3056, 3261, 2327, -4748, -4975, -2989, -1411, 3681, 7437, 7607, 10059, 8111, 5905, -4002, -8266, -5701, -3841, -9323, -8447, -6235, -8246, -12353, -6502, 1574, 4229, 8466, 2037, -6182, -9921, -8282, 1195, 8847, 2460, 1686, 1899, 2043, -3023, -8688, -3959, 3157, 2208, 2575, 3551, 2055, -3749, -10253, -8414, -8822, -13689, -13228, -12593, -10541, -15298, -19075, -20330, -11349, 856, 6856, 1040, -2588, 800, 1020, 1049, -5753, -8588, -5248, -1560]
16220a560r997K099J0617J476l632q832J623l512J491P91K479M087K60K371J970
16205A731K458k833m108m254p329Q748L217l870M515M244N43j118l030J174K188
16190B276k51Q81K214q05n291r066N106j100k540J031L867J720o240J633o9L47
16174f287n748J44O094J183j134j091n160L035K506J116Q747J457l81j741q97
16159A843j728k077j358L3k048j288J96l34n214J747L135J564k351m726j791K791
16143a1606O692m45L771m0k604J791r45m378m692J088n82M290j594o825M699M273
16127g107j765P88L153r621j442o388j110Q616P375J269J130O447J593k937l040
16112c039m847j203M98l029L40M201J318N913L245j084l924j731J776l015j147
$$ y = [-1560, -11557, -9458, 1159, 2635, -997, -9829, -8206, -11718, -10227, -9436, -6957, -2870, -2610, -239, 1731, 4189, 1356, -2752, -7006, -14335, -5587, -2370, -6240, -1725, 2519, 3062, 1944, -1086, 88, 2276, 2025, 2906, 5120, 4315, -976, -10042, -4936, -6036, -8576, -7545, -3678, -1958, -8198, -6565, -6634, -6287, -12035, -11891, -5797, -4614, -5748, -6839, -11999, -8964, -6458, -5342, 3405, 4862, 4481, 2740, 1843, 115, -1962, -3320, -3287, -5335, -6623, -6427, -6761, -11975, -10228, -7093, -5529, -7880, -12606, -14397, -11606, -4914, -5359, -1588, -1628, -4232, -2441, -3386, -7764, -12456, -11368, -11950, -7660, -9254, -16079, -11380, -7107, -8872, -8084, -4931, -14552, -15994, -22382, -23492, -14876, -7501, -6232, -5102, 1345, 2938, 1, -3039, -7886, -9089, -8591, -11620, -11280, -7079, -5761, 152, 3397, 2313, -1611, -3342, -1566, -4581, -5728]
16097e728M56k423L72L726J709j507J052k960L547M690n909o804o114K080K177
16082a1636m309R196L176q63J205K978o671n225l412J1149k49J994O362j243k230
16067B22j014k418p283k790j76N978K062j06J030M037Q74m35p73m911k712j734
16051a0149J817R74m94L061j356j444K274N920j584L265j527k332K160J843m527
16036b099q750R19O224P241N758p726l826j162L921O562l630j924j799o546k413
16021i250R065R220m630p758l410K829O691Q37m568J201P55L775o745L37P968
16006F317N43k188o000n166k928q44L77j721q00J401Q02o07L402O594n289j477
15990g584j05J971M877L107m280q574k039J438k3l781q64L688Q034P307l013J786
$$ y = [-5728, -5272, -7695, -7323, -3597, -1888, -3395, -2343, -5303, -1756, 2934, -2975, -9779, -15893, -13813, -11636, -15945, -6749, -3573, -4436, -3231, -253, -6924, -12149, -15561, -4412, -4661, -2667, 3695, 2452, 222, -792, -3210, -10493, -13283, -13459, -7481, -5419, -5525, -4495, -458, 416, -19, -792, -5703, -8415, -10149, -8332, -7358, -7852, -4791, -6147, -7591, -5317, 603, -981, 2284, 757, -1575, 585, 2428, -2099, -10849, -9930, -3706, 3535, 9293, 1567, -2259, -3421, 500, 7062, 3432, 1508, -291, -6837, -9250, -185, 9035, 4405, -3353, -6763, -3934, 2757, 3594, -974, 227, 982, 4757, -1988, -1651, 6317, 6860, 4672, -1328, -6494, -9422, -10266, -9889, -11610, -12410, -11009, -10207, -10814, -7412, -818, -6107, -7584, -7689, -5718, -841, 2266, -2014, -10588, -12627, -11189, -11212, -14993, -15857, -12169, -4135, 3172, 159, 1945]
15974A945J555p397r806n929p64Q202Q461L668m594q183M576l120q16K569M779
15959d854N318L192j619j493m984n049P60J49L768L492j893k019M24J974q418
15944a1252p504K850M377j342L565L103J08J743k315m202L819P092J251m652l052
15929f411mJ291l996L57J210L672m836K794k453j360N53J732J379L427P116J535
15913F006m371m933O64j427k854L963k857j2893k436P936O024P141J838j731j0750
15898a0680k036J497K219J82j682m000K535K369L642r63M785O705m894K1O003
15883E703j076j1508j591J325J425j044M137O75L137L082N770k551q144K769K257
15868D366p48N06N16k485l846k325j377L399J099n65l905k922N921J987J752J855
$$ y = [1945, 3500, -3897, -13703, -19632, -20396, -12194, -3733, -65, -4659, -12842, -8266, -11386, -12202, -9633, -4854, 464, 3656, 2037, 544, -4440, -9489, -8729, -8580, -4812, -1320, -3213, -5232, -4808, -2834, -11252, -18756, -15906, -11529, -12871, -9306, -6203, -6095, -4352, -6667, -10869, -7050, 42, 1293, -3359, -6411, -6415, -5124, -9120, -8763, -7553, -3881, -8717, -5923, -8376, -9736, -9183, -7451, -6072, -2645, 4471, 6006, 1635, -3298, -2634, -4061, -6915, -2952, -5809, -18702, -21138, -13202, -7178, -37, 1801, 70, -10680, -12716, -11219, -9000, -8818, -10500, -14500, -11965, -9596, -5954, -6917, -2132, 4573, -321, -300, 5703, 4627, -6881, -8472, -7147, -5722, -6766, -2629, -1954, 1183, 4265, 10035, 7484, -660, 2109, 4366, 3618, 4124, 4640, 2155, -1691, -4016, -5393, -1994, -895, -1460, -5365, -8287, -2366, -379, 1373, 3228]
15852C228m417n272p927l425P257N178L011P80K021L126j581L53k87J618l323
15837C40m127K081O419l909L8l106J642L747J619L711J728m755M801M989j2158
15822C060m868l725l383J607N253M743J193P56l024L371j992l235O45l094n49
15807c242O552N232J691N033l092n551j702K696j754o0n765q94K707K360J400
15792E611k692j87j878J641P81k262j27L452N068L74j138j482J235q106L728Q97
15776D915l255K009Q558o8q689p590l456N350Q351K614n17M116n087K207k321
15761G137j554K931l038k095J782kM7l728L917P723N719j1471j451K32J607p58
15745F998L833L08l58k24j092L587O08P188O29p523k099l875m056m792p40O424
$$ y = [3228, -1189, -6461, -14388, -17813, -10556, -5378, -2367, -1587, 434, 3560, 1979, 2332, 2045, 3663, 340, -3787, -1706, 4713, 804, 842, -2264, -622, 3125, 4744, 8455, 10183, 5428, 10229, 15218, 3060, -1808, -5533, -8916, -7309, -2056, 2687, 3880, 4636, 1612, 4983, 2991, -244, 401, -2693, -3242, 3310, 8542, 10233, 15266, 12174, 6623, 4921, 7617, 5863, 5803, 38, -856, 1851, 4211, 5611, 2919, 2732, 854, 2495, 3276, 1014, 887, 4339, 9407, 9781, 8643, 7161, 8396, 290, 4018, 4915, 1660, 3669, 12227, 12159, 3470, -4120, -7576, -2226, 6125, 8739, 8222, 12338, 7251, 9458, 7137, 5583, 8514, 5476, 3381, 5163, 5161, 5208, 1480, 5397, 13120, 18839, 7368, 5917, 6149, 7756, 6998, 10831, 11139, 10781, 10557, 9465, 13052, 13660, 20848, 21477, 13954, 11855, 7980, 3924, -868, -1608, 4816]
15729D816Q446O720M231M102J190q605N606L4K31Q295L761o741j102k019K444
15714C1409j999j798m046p221j586O276K608l83Q039N084L74r450j5236n101J39
15699G109o019N31J2171J1115J1963Q530l978r86K128J355K666l481m197k918
15685C5989L614j531j479j32K407m016m522n254k898M287N583M216K517J346k031
15670C8096n654j2291p256L178N427M122M733R59M161o464p481K8M108j993J134
15655B4807M434P113k088q696J465k289j083K049J687j953k957m870j382L615
15641A9852K830j832j083k8M787J132m117J346j316M992K663p126q045k463K954
15626A4546J709O13m196o064j013J474J09O656j529j3497o091O331L719Q90j569
$$ y = [4816, 13262, 19982, 24213, 28315, 29505, 20900, 26506, 26540, 26771, 35066, 38827, 32086, 30984, 28965, 31409, 29410, 27612, 23566, 16345, 14759, 21035, 23643, 23260, 31299, 36383, 36757, 27307, 12071, 6970, 7109, 1090, 1621, 13792, 24907, 36870, 45400, 41422, 40436, 42564, 43919, 46585, 43104, 38907, 35989, 39603, 38072, 36593, 36461, 38868, 34852, 30330, 25076, 22178, 26465, 32048, 36264, 38781, 40127, 38096, 32442, 20151, 12895, 16073, 21500, 25622, 30355, 31314, 35475, 29011, 21530, 21558, 25666, 23673, 24807, 29241, 36354, 34266, 25570, 27035, 24746, 23663, 25712, 27399, 25446, 22489, 17619, 16237, 19852, 22682, 20850, 19767, 19739, 24526, 25658, 21541, 22887, 21571, 26563, 29226, 22100, 14055, 11592, 14546, 16255, 16868, 12672, 6608, 5595, 7069, 7178, 13834, 12305, -1192, -7283, -952, 2767, 3657, 2088]
15611B088n853j123J2426R784j643n943j104K191n182Q30o2K826o02l606R17L60
15595F304N616K713o625p033r75N251J007k154n877l17M028K129L081J378O066
15580A4592N63k657m374L084L005j537k602l769j533k542J236R06n486k706q25
15565d645m970k43O045L852J000k50Q03P319J532j40M195j891m749j817J744O71
15549H456j769o07k140L440n972m556M499M080p130L35J148n142M42M402L784
15534C270M67k161K902n179j648q116k337O65O76K455M941l179K114o094l407
15519a4631M607K189K959N310J058l265j453L313L703j687L436k34m944q083L299
15504d423M351L77j13J07J396j113j404L083J582o303k471r188j890n25K561k134
$$ y = [2088, -3765, -4888, 7538, 17322, 15679, 9736, 8632, 10823, 5641, 6471, 6409, 9235, 8633, 5027, 5944, 6304, 11920, 14633, 8008, 975, 0, 5251, 6258, 4104, -1773, -2090, 1938, 4067, 7148, 8526, 14592, 15155, 12498, 8124, 11208, 14213, 12676, 10074, 6305, 4772, 2230, 3466, 4372, -1114, -3820, -4645, -9615, -9858, -3813, 39, 1039, 789, 1592, 8911, 10443, 10303, 14498, 12607, 7858, 6041, 7785, 8456, 6687, 6080, 3940, 7380, 1408, -3148, 1351, 5431, -1699, -1364, -216, -5358, -4916, -514, 3270, 3737, 1576, 4478, -701, -2349, -10465, -12802, -12137, -11461, -9006, -4065, -7244, -5130, -11224, -14631, -10024, -7835, -4876, 434, 1492, -1773, -3226, 87, 3790, 2103, 5539, 5305, 361, -7722, -4423, -72, 305, 192, 299, 1695, 582, -822, 2261, 3843, -2460, -4931, -14119, -16009, -16534, -13973, -16107]
15488a6107P30K774K218L755m372m449k991k733P173P737l969J812j957j398R7
15473a1680l581K503Q560J900J706k426K446j487l937K12m150k292N347Q38K110
15458c931O49l897m096L952q1K86O064o838J086K309j151J10P815l995n433M412
15442b739n553m261k761P827O871n59OJ416k684K198L310l694R94N53j98j192
15426d66k470J05O02P41k674m486n37l233j248K335L192J322O919j399j765N275
15410B213n420j235k616j853Q5n171m334O716M017p083J711M491l746K76L433
15395h516m01j229R897M613l472n648q147l243O722K606n933l681K117K447J474
15380a0394L938q74k871M831J534M463l061o889J475l505l363O275M419k579o126
$$ y = [-16107, -15377, -12603, -10385, -6630, -11002, -15451, -18442, -21175, -14002, -6265, -10234, -8422, -10379, -11777, -11680, -15261, -12758, -4198, -2298, -592, -3018, -572, -2059, -5996, -5784, -9934, -12226, -6879, -6041, -3931, -3282, -7179, -11275, -7323, -7404, -7118, -1054, -7892, -6806, -4497, -5648, -5538, 2277, -1718, -7151, -2739, -8292, -12553, -15314, -7487, -616, -1175, -1169, 247, -2437, -239, 3071, -623, 371, 924, 726, -466, -2936, -2831, -2229, -1488, -4162, -8648, -9185, -12418, -13666, -11331, -8139, -6817, 102, -1297, -3062, 2213, -3207, -4442, -7058, -8911, -8826, -13997, -18331, -11615, -7598, -14681, -12970, -8479, -12225, -11949, -8516, -8917, -10146, -249, 4364, 892, -4756, -12903, -16146, -9424, -6818, -12751, -16432, -14315, -11868, -10394, -6456, -7330, -10201, -5370, -3836, 627, -2434, -9323, -7848, -11353, -14716, -8441, -4022, -6601, -12727]
15365a2727j083K951N461k675k542m008N585K659M47P088n883k899R05k185j770
15350a0676O32M928n26K96p19N419N817m321q5Q941q109o409M36K388L437L247
15334D696j752q467j173l453m392j321N77J640mO333J733l287M923L882k034p313
15318i412j245L870j392l075n427K026P463J755J035o245K886j675n314K853K561
15303i336K073M841j217l841n262m039n023Q430R286K429j244j179rm68l573n814
15287a3946L342P42l389k182K679q40j056K11M388L189j43k309l264L760r90K126
15271g682N774L310k968K39J408N385O354J493m703j3548r116k276M426M595p253
15256a4562k197L554L189m60O8M287j049P63K344R646k719j3586l496Q381K726
$$ y = [-12727, -13810, -10859, -5398, -8073, -10615, -14623, -9038, -6379, -5932, 1156, -4727, -7626, -6721, -8906, -10676, -10044, -5116, -5642, -5346, -6065, -646, 5171, 850, 765, 9706, 1597, -4812, -4376, -1988, 1449, 4696, 2944, -5523, -6696, -10149, -14541, -15862, -15285, -13645, -13649, -7316, -5583, -8870, -3947, -65, -2099, -9412, -10657, -6787, -8179, -11254, -16681, -14655, -7192, -5437, -4402, -10647, -7761, -9436, -14750, -11897, -9336, -7263, -2422, -3639, -7480, -12742, -16781, -21804, -13374, -4088, -1659, -2903, -4082, -4091, -4559, -8132, -13946, -10604, -9862, -13251, -15433, -12754, -13594, -14650, -14439, -10051, -6862, -7005, -9314, -12578, -8818, -9808, -7682, -1908, 1402, -1566, -1327, 81, 5466, 11820, 13313, 8610, -4938, -14054, -16330, -11904, -7309, -14562, -16759, -13205, -10016, -10476, -10408, -6121, -7170, -6407, -4063, 5583, 2864, -10722, -14218, -5837, -3111]
15241c111q48l848l671p188J300O255J1808J815o049p05J928m552n295k863L179
15226a1845N01k573j070l485M116N769L187J48M18n075J932J039l16J492J461
15211d301k285J844o899P10L544j46n053K160K506O29J742j739n528N62Q326J
15195c927q265m33L821O193J662k922M988l027j487l518l327R80R149N049o89
15180D247n635K7l444j050m17k316m915N91L677L697P998j897p443l953n32j678
15164a3043j654Q36N284M849K115k589l505n463L058n004M444M097L461m920j869
15149i903J543j532J002J150l184k394R399P603q93q846p039j960l86n367K891
15134a7916K683J877O93k944o15L524L17l858J67N84J71j545M63Q21K582K563
$$ y = [-3111, -3959, -7807, -11478, -18666, -17366, -11111, 697, 2512, -3537, -4242, -2314, -6866, -12161, -15024, -11845, -11344, -13917, -14987, -18472, -14356, -8587, -5400, -5252, -4834, -9909, -7977, -6938, -7254, -5762, -4301, -6586, -4742, -11641, -10931, -7387, -7533, -12586, -10426, -7920, -7291, -5549, -7288, -12816, -12254, -3928, -3927, -12192, -12625, -8804, -2611, -949, -3871, 1117, -1910, -3397, -6915, -10242, -9262, -113, 4936, 4247, -1388, -1361, -4805, -5855, -6272, -8588, -13503, -12912, -9235, -5538, 2460, 563, -6880, -10833, -11365, -13043, -14697, -13861, -8577, -3728, -1613, -4202, -7707, -13170, -10112, -15116, -10672, -6575, -3114, -8034, -9903, -8360, -9892, -8890, -7740, -10924, -13318, -3919, 3684, 2791, -6055, -13094, -15054, -15440, -20807, -17916, -15233, -13356, -12663, -15607, -16222, -12698, -12381, -16239, -16072, -15488, -15317, -16862, -16399, -15578, -12996, -10433]
15118a0433K53L849J994L170K019Q47l750j686j799k46P47K604J57Q78j613k551
15102e560j697K486J8O23r560N943N710L106n439m756M590L421J712j602j35O90
15086d50M96R85O55j288J075P099k873p584j082j40J025j501k427k326l428n713
15070a7477P46m97J448J741O254P619m481r999M51L149M48j890q95N793L171M286
15054a33l798K014K212k810P91l686j631K109k249m68M597r3q27K125m157n865
15038a1869N717O321k468o61l913n50Q38j656m057K778K064j641N89K364n422
15023a1566n756P609L177m445l136O751k090Q25J2133L793m720k386J353m624
15009c082J385k042L97J701k108n668l656P129J795q97l52j412K384J063l278
$$ y = [-10433, -10180, -6331, -4337, -1167, 852, 1699, -2051, -3737, -5536, -5782, -5035, -2431, -2274, -1396, -3009, -5560, -7257, -4771, -4753, -4130, -13690, -7747, -2037, 1069, -4370, -9126, -4536, -1115, 597, -1005, -1140, -450, 46, 1031, 1686, 398, 1473, 8572, 5699, -1885, -2967, -3107, -2082, -3583, -6010, -8336, -11764, -17477, -16731, -17228, -15780, -14039, -7785, -166, -4647, -14646, -14195, -11046, -10598, -12488, -13383, -7590, -4419, -133, -3931, -1917, 295, -2515, -1724, -5410, -7041, -4932, -7181, -7649, -3052, -3145, -3972, -1847, -6004, -11869, -6152, 169, -2299, -2960, -6873, -7423, -6585, -8241, -12298, -9520, -7456, -9097, -8508, -6144, -11566, -17322, -9713, -6536, -10981, -14117, -7366, -9456, -8631, 3502, 7295, 2575, 189, 1542, -3082, -1697, -3739, -3342, -1641, -3749, -9417, -13073, -5944, -4149, -5046, -5398, -6810, -4426, -3363, -6641]
14994f641n752j738k267J57R121k5q293m265J957R45j329M992M524O180N453n705
14978b686n245m900Q57N765M797k47l377K093o145n40J896J448K300M681J77K422
14962C296q404j0807j343J0599O572N525r744q129K990j665m201l56K626k941
14948a5982k158k95M022l284M415j29k350L841m27J399j879m102M707K151K614
14933g457P869O021L71j772o375m644L041m349J004J1652K558p095o200m272l884
14918a3532o623L444Q668J937J75n212R07P336L882L28o769k463k760n989n665
14903b2336k49O131N661M971R80Q04r85k262j669O80K981N961K152j610n638N07
14887c921P848N183m000m856q440n743R25J423N422O860M108j867r742j503O432
$$ y = [-6641, -12393, -14131, -16398, -16241, -7120, -7145, -15438, -19703, -17746, -16801, -18130, -13138, -8614, -2434, 3019, -2686, -7931, -12831, -11974, -6209, -1412, -1659, -5036, -2943, -9088, -9628, -7732, -6284, -3984, 697, 874, 3296, -5108, -15915, -17258, -6659, -87, 5438, -4306, -12435, -9445, -11110, -15311, -15667, -13041, -15982, -18140, -18435, -14413, -17697, -13282, -13411, -15761, -11920, -12347, -10948, -12827, -16929, -12222, -10071, -7457, 412, 6433, 6804, 5032, -1343, -5987, -2946, -7295, -6291, 5361, 7919, 824, -5376, -9648, -13532, -20155, -16711, -8043, -6106, -5931, -11143, -10236, -2900, 982, 1310, -5459, -7922, -10682, -16671, -22336, -22585, -16454, -10793, -5822, -4842, -4038, -5023, -7285, -8954, -8274, -5293, 668, 2820, 1210, -4428, -3921, 3927, 9110, 5110, 254, -8186, -13929, -13004, -11581, -6159, 701, 4809, 2942, -6800, -8303, -1871]
14872a871O677o97m859l683J120l629l428l146M71o70O233K328J228N153M75j595
14856A07M95R11N2k313o05K106N97o774j956j776K302O896O57k210n841j27J351
14839f128j836Q251j145J541m29l424l531k146K697j611J153j875Q96j574n220
14824a4381l7O65M768n74l610o962K436J080R3J1290P524K877j098K244o478o404
14808f567q89k185J843L60k072N369M265L662L99o206O6o55m880j798K175m633
14792a1746m107O686L440k473p388l776K745J441L925J98k95M493O98K8R25R07
14776d299K218K735l551q832m777OR49K157k527k985j042K669N982Q27p47m886
14760a6103K788M945L871j0318j820j339N756N010L156J723J287n56p009p655
$$ y = [-1871, 4806, 4109, -750, -4433, -3313, -6942, -10370, -13516, -13045, -13715, -7482, -5154, -3926, 1227, 1702, 107, 602, 1513, 1565, -748, -1353, 753, 1350, -5424, -7380, -9156, -6854, 42, 699, -1511, -7352, -7479, -6128, -7964, 287, -858, 683, 254, -3170, -6701, -8847, -6150, -7761, -6608, -8483, -7587, -9161, -14381, -14418, -13753, -8985, -9559, -13169, -20131, -17695, -16615, -16522, -5232, 2292, 5169, 4071, 6315, -163, -6567, -7456, -9641, -7798, -7438, -9510, -4141, 124, 3786, 4185, -2021, -1955, -2610, -7490, -9288, -7113, -11746, -15853, -9167, -5727, -8200, -15588, -19364, -16619, -15178, -11253, -11055, -11350, -6857, -6159, -6131, -5206, -4299, -2081, 654, -2897, -11729, -16506, -16500, -15551, -13394, -15921, -18906, -19948, -17279, -11297, -10470, -11217, -16103, -13315, -8370, -4499, -14817, -16637, -17976, -12220, -7210, -4054, -2331, -1044, -1600, -8609, -16264]
14746a6264k613K50J263j160N051N301J605L199k64O97L760L542k517r99k401
14731a550j375j719j453m39q102j717L281K750K73J481k687L696L944l699n732
14716a3048l287k02O696J969n669k446N023K310J293l377l445P058L915K29K820
14701a61Q99j9m921k33r62m348o636L273m580P10N400L062l54J202k020j260l720
14684a4668k438O63J925j218N128J701M182r330J611O058N560k885k013n723j027
14669a2474L72P174K258N100m095R87N518K497j290n030J291j048n22J304j079
14654I63J675m049o799m619L013J961N379J030m68r44K47L198j75l433R91k365
14638d395l285R57k869j901j754K167J192J127k95j234J720L157R52l075K556
$$ y = [-16264, -18877, -18627, -17364, -18524, -13473, -8172, -6567, -3368, -3632, -2935, 825, 4367, 1850, 851, -1550, -2925, -4644, -6097, -6536, -14638, -16355, -13074, -10324, -10051, -8570, -11257, -7561, -3617, -7316, -13048, -16335, -16537, -9841, -7872, -13541, -15987, -10964, -8654, -7361, -10738, -14183, -7125, -3210, -2981, -161, 738, 719, -4202, -4435, -5397, -9745, -16381, -13108, -17688, -16978, -11578, -8516, -8870, -7668, -9688, -10948, -14668, -17106, -16443, -14518, -15736, -10608, -8907, -4725, -14055, -12444, -6386, -826, -3711, -5724, -11447, -12474, -12102, -4928, -2670, 2430, -1665, -678, 4840, 7337, 6047, 1017, 2308, 1260, 738, 2042, 963, 2638, -1411, -8210, -12829, -9816, -7855, -2476, -1446, -1914, -2858, -2611, 587, 412, -3021, -2030, -4395, -7680, -6723, -9592, -11493, -13247, -11080, -9888, -8761, -9056, -10290, -8570, -5413, -4461, -7536, -4980]
14623d980N02K41N109l830l330O44n329K265k17l889j297k800O744P066l198j651
14607g950j937j922o75P30P24N532l794k701m31M036K484q96M519K17m80o88p992
14590a1224m040J304R958M549j772k229K663K189j861p138J046M718R6j893J06
14575c528n967k821m709M9M802J1528k404Q6L534l370n968M472J54j931M794N362
14559D083L180o475k082O114j0039k670P78l126K466K483j85J208N016q86o24
14544g59L657k856n351k627P73n023K652M78m02J000n40p40j036k27m717m066
14528a9784P193P079j570n11k951p005j831j649j709K479N365m04j26P647N629
14513b148k580O92P94j342J329o999l013n24k62L425L853M344J296n176k163L751
$$ y = [-4980, -4478, -4237, 872, -2958, -6288, -5644, -10973, -8708, -8925, -12814, -14111, -16911, -10167, -3101, -6299, -7950, -9887, -11809, -12484, -11754, -11030, -5498, -9292, -11993, -12424, -8388, -5904, -6800, -2281, -2064, -2544, -3232, -11224, -15264, -13960, -4002, 547, -1225, -3454, -791, 1398, -463, -7601, -6555, -1837, -1741, -3634, -3528, -9495, -12316, -17025, -16976, -12174, -646, -3050, -2964, 570, -2800, -8768, -4296, -4142, -6073, -1279, 4083, 7263, 788, -1294, 4820, -5219, -7889, -7111, -10237, -7771, -5288, -5473, -4265, 751, -135, -759, 2898, 42, -5309, -7936, -7163, -12186, -9534, -9056, -9458, -8458, -8998, -9738, -10774, -11001, -15718, -19784, -12591, -5512, -7082, -7593, -10544, -17549, -19380, -21029, -22738, -20259, -14894, -15298, -15424, -7777, -2148, -4728, -4036, -3242, -4584, -3255, -10254, -13267, -13791, -14053, -10628, -6775, -2431, -1135, -6311, -8474, -4723]
14497d723J205j891l437K293O474k84M34J731k467l873j726l088n37K377N638
14482a874N264k207l984K180M759n880N390L602o111o384l335J070j932K177j032
14467h297j639K999k687L116N3m83l103L230n48Q520M83l274j823j255L126K439
14451H57q40p24j215J530j111n572k158J283K602j184l143j082L362L570J933
14436a892L091J629k556n731j925m294J23P310M143o825j883J311k011J197J532
14421f781L331J85K321J080j502p805K785l073j116j957K20N627J830q636l023
14406a6514O982J049k81N291N521L214n757l179k231j344m367J435M032k765k708
14391a1622M195m03L290R33r615q83J483M44P710M047j438k827J135k821j113
$$ y = [-4723, -3518, -5409, -8846, -6553, -79, -363, 71, 1802, -665, -4538, -6264, -9352, -9889, -7512, -1874, 3390, 1183, -2801, -621, 4138, -1742, 3648, 7250, 1139, -5245, -8580, -7510, -9442, -7265, -8297, -9936, -6937, -9624, -6508, -6455, -6938, -10041, -6811, -7359, 1161, 1644, -1630, -3453, -4708, -1582, 857, 17, -707, -1922, -392, -1503, -7075, -9233, -7950, -5348, -6532, -9675, -10757, -7395, -3825, -1892, 1199, 2828, 272, -5459, -7384, -11678, -11555, -4245, -102, -6927, -8810, -7499, -9510, -8313, -6781, -3450, -3265, -944, 136, -1366, -9171, -6386, -9459, -10575, -12532, -12312, -6685, -4855, -13491, -16514, -9532, -8483, -8764, -3473, 2048, 5262, -495, -3674, -5905, -7249, -11616, -10181, -6149, -8914, -11622, -7427, -7830, -4540, -3607, -13222, -14105, -12622, -12178, -4468, -421, -1859, -4686, -3551, -6372, -7485]
14376g485N48K927O050n046K196J017K677j858p58L014k97o503o324J829Q064
14361E1M020k798o751K454J146p473m562j749M158l235O902J900J304j783K93
14346f123n49J383m842K569m435l062Q299l94p014N77k278k363R07j756l812J096
14330b1797Q892Q068L91k035j031j066k085K851K549l377o57M168p58L334J526
14315a027M590p585l434m33L242O151L135L391L573j1994q737J225K883k174K935
14300d259n209p011L018N377q24j683L894K082k343m066J40M653M371K009p33
14285e84k741K308M150k986o321j1633l299L218R52Q848j897k272N781O763J261
14270A548q961j365M604m252q757k80q63J21L486P266n423k460n756m64N618J130
$$ y = [-7485, -6937, -4010, 2040, -3006, -810, 207, 2884, 1026, 268, 3282, 2985, -3518, -9842, -8013, 51, 4071, 1273, -5478, -3024, -1878, -9351, -13913, -15662, -11504, -14739, -7837, -5937, -4633, -6416, -6123, -6672, -5289, -10131, -7562, -11997, -15059, -6760, -7154, -14168, -13591, -15869, -18232, -17325, -19081, -22893, -21797, -12905, -4837, -4446, -6481, -7512, -8578, -10663, -7812, -5263, -8640, -9297, -5129, -5887, -2553, -1027, 3563, -4022, -7456, -7889, -4647, 1504, 4639, 8030, 11603, -391, -9128, -7903, -5020, -7194, -4259, -9468, -16479, -13461, -8084, -8908, -10591, -6697, -4615, -6958, -11024, -10884, -6231, -1860, 149, -584, -3325, -1017, 3133, 147, -6174, -17807, -21106, -17888, -16936, -8088, -9985, -12257, -6476, 287, 1548, -7413, -8778, -4174, -8426, -17183, -17463, -18326, -18205, -14719, -7453, -12876, -15336, -21092, -21556, -15938, -14808]
14254a4808o345L083O553L738L577j064J425L523N557j701m314j545k356j478
14240f155K41n77l394K000N546n491j574k492N169K575n344m488L512J2881J5831
14225A8240K3818J8655N505j7541k8264j7877j0093n364Q686M955j869L88J952
14212A191j78K346j581l107J446L353j252k248k389m201m266k554Q10k041J376
14197a3295J069l127L663K2994K7306K4689L048j2770k7247k5426r818l001J547
14184a0368M343R72p40M6p58L21L877k052K87n520j790M138N455J374M516k620
14168A481J168m048p39l38j0384l869O495K047k090p023j056J759j442M41N951
14153a1647O752N574l560K590n10K655L319J412j940q716k6K38m218M106j309
$$ y = [-14808, -21153, -18070, -11517, -7779, -4202, -5266, -3841, -318, 5239, 3538, -776, -2321, -4677, -6155, -5914, -6491, -9885, -7885, -2339, -7830, -9404, -11896, -6727, -4152, -9496, -13984, -10472, 2409, 18240, 42058, 60713, 66218, 48677, 20413, 2536, -7557, -12921, -4235, 720, -1149, -761, 1191, 1013, 3359, 1778, -1329, 117, 3470, 2218, -30, -2419, -6620, -10886, -13440, -12630, -14671, -13295, -12226, -15353, -11690, 11304, 38610, 63299, 66347, 53577, 26330, 904, -8914, -11915, -10368, -6025, -5053, -5793, -5747, -6505, -6184, -2307, -4359, -4072, -9592, -11382, -7244, -1789, -415, 4101, 1481, 2649, -1399, -2138, -2476, -12860, -16729, -10234, -8187, -10277, -17300, -18356, -16597, -18039, -17598, -11647, -4895, 679, -2881, -291, -801, 1854, 5173, 6585, 4645, -4071, -4097, -3859, -8077, -3971, -5280]
14138e280o600M857J282l398K684J133k758J72n339j549J1998K561K310L487L99
14123E959l535k391j380P650K616l858m174K52K376P30P91o195n031j280P229
14108b41N213j0681n006J488m738L474K635q674R78j6M69o59r81N353K41O34j73
14091a0684k622L430O309K046k695k321L461J507L026m702p107j214J221M03N143
14076d799M703k472J48P96M057L702m631l226N813m378o126m051M55M035K630
14061c344m03K152j156p88J339m617m268l323N228k102M18P376j418K646j52n347
14045g759p360J921L029l80k261K40m1k209M937P106M064j618p521q066L98L953
14029a1567J622r09l352r744n146N059K265O530P426M068k349j375l107L929M788
$$ y = [-5280, -11880, -7023, -5741, -9139, -6455, -5322, -8080, -7908, -13247, -14796, -2798, -237, 2073, 5560, 5959, 2424, 33, -1347, 6303, 8919, 5061, 887, 1139, 3515, 4245, 5036, -1159, -6190, -7470, -241, 4972, -5709, -10715, -9227, -13965, -10491, -7856, -16530, -15552, -15568, -15099, -15758, -16739, -11386, -11145, -10511, -10684, -13306, -9876, -3567, -1521, -4216, -6537, -3076, -1569, 1457, -3245, -10352, -11566, -10345, -9942, -4799, -96, -2568, -2420, -1624, 2433, 6135, 1504, -1722, 4091, -287, -6413, -10464, -10009, -5974, -3344, -3747, -1595, -2751, -3539, -2200, -6817, -11085, -14408, -9180, -11282, -10864, -3488, -4906, -2260, -2412, -7759, -15119, -13198, -10169, -10549, -12810, -12570, -12611, -14820, -9883, -2777, 1287, -331, -7852, -15918, -15520, -11567, -9945, -10854, -14206, -23950, -29096, -24037, -21772, -15242, -7816, -3748, -6097, -7472, -10579, -6650, -1862]
14014a862o94o223k1L721J074M610l779R203L847n360j109M262K438k327k085
13999E695M234o440m206P225p55l882O331M007n558m774l031j419K309L989k804
13984I21j356j355n205K727J770Q70P362l707m06k204m573Q4J449P59L270K630
13968C036r36l727q88j463r8m973J303N702k402k558M301J595m285n667M620N633
13952h07P207J763J908m916l039l393k676j1048N066J0130j082l045L963k262
13938b231R5J553k956q942O07J953O56M895L754k481R66l43m908j560K432J635
13922d875l190N814L754j880l830j2210L291Q151J490l996l995L109N216m793
13908g944J839l896j590o84K874L022J146L555j268m681j025j070K729p40j506
$$ y = [-1862, -2556, -8779, -8800, -5079, -4005, 605, -3174, 6029, 9876, 4516, 3407, 7669, 10107, 7780, 5695, 9929, 3489, -717, 6508, 5753, 1871, 8202, 12209, 6651, 1877, -1154, -2573, -264, 3725, 921, -435, -1790, -6995, -4268, -2498, -1628, 5734, 2027, 1621, -583, -5156, -5072, -3623, -2864, 406, 3036, 2100, -1627, -2515, -3978, -4076, -9049, -7746, -2044, -4446, -7004, -2703, -1108, -5393, -11060, -6440, -807, 6400, 8163, 10071, 5155, 2116, -1277, -3953, -15001, -9935, 195, -887, -3932, 31, -2231, -2136, -583, -3539, -12481, -11874, -9921, -9265, -4370, -616, -3097, -2131, -2474, -7382, -8942, -6510, -4875, -8065, -2251, 1503, -377, -4207, -16417, -13126, -4975, -3485, -7481, -11476, -8367, -3151, -7944, -6105, -10001, -11591, -12275, -9401, -6379, -5233, -1678, -2946, -7627, -8652, -9722, -6993, -7733, -9239]
13893i239L932J450K325M335J003M761n986l534j383l784m599m02j274J882J419
13878i094M816K305j010j11N09L149o71k446N624j847k534L654Q084k359n335
13863B734O60l641K341K88m099J97R09k352J433L485K67o67q62n876J41K498j463
13846d007j834n632m519J0171J971k598P224K386l662p891r76M550N479K115k505
13831B72l645n455N857J379J673M127m830k716q5j58Q842M558j237l024l657k570
13815f69q046m813N299M057L89Q699j664o039j291q0m807l715q41m579L869P772
13799f459N157L511M18m237K99M777L774M914L87m221Q80M144J126m189Q42k660
13783H463p144m211j698J801J145j530K722o22P14O43k449k186M203N961L504
$$ y = [-9239, -5307, -3857, -1532, 2803, 3806, 8567, 2581, -953, -2336, -6120, -10719, -11121, -12395, -10513, -9094, -4278, -1973, -2983, -3094, -2585, 564, -107, -2553, 3071, 1224, -1310, 2344, 10428, 8069, 2734, 3394, -247, 2094, 2382, -1717, -1520, -611, -2963, -1530, 1955, 2222, 1555, 693, -5183, -5042, -2544, -4007, -5841, -11473, -15992, -5821, -3850, -6448, 776, 3162, -500, -8391, -9367, -4817, 662, 2777, 272, -3373, -8828, -2971, -1592, 81, 4208, -622, -3338, -3423, -3581, 5261, 9819, 8582, 5558, 1901, -669, -8715, -13528, -8229, -4172, -3783, 4916, 3252, -2787, -4078, -4158, -8965, -12680, -13521, -18100, -14231, -6459, -1302, 2209, 2627, -1610, -1311, 3466, 7240, 12154, 12541, 8320, 9200, 13344, 14470, 10281, 11123, 8463, 1319, -2892, -4590, -2789, -1644, -3174, -452, -1074, -360, 283, -2166, -4352, -149, 5812, 9316]
13768I316m711o278n192j566L752P099K281o346n459O088j280J051J655k793p996
13753a0379K767K939j18N736P28Q931n713p545p02j417l576K683j678p366j823
13738a6533O218q53Q256K435j665L77k69P20j898l14K060Q72r1P810l845p181
13722c901q822J893O867M40n122k612o725J0784O291L433J678k323K00J423p901
13707d397l042J0663j73J841J91n955k603m274j227M503j976o721k225M447N945
13692e003M988N870L982m052Q4K659m845J57M185n446o939K742O609k47p2J920
13676F592j952n861O29O918k325k104j208K781Q212p371o367L337L426M803K220
13661A1730q08n046R40o325K388M931J233m74M741L221m906j88l012j1242r565
$$ y = [9316, 4605, -1673, -6865, -8431, -4679, 2420, 4701, -1645, -7104, -1016, -2296, -1245, 410, -2383, -10379, -7612, -4673, -4791, 945, 1673, 10604, 4891, -2654, -3356, -4773, -8349, -5666, -7344, -14710, -16533, -10315, -11168, -2912, -477, -2142, -1765, -2034, -1314, -3212, -3526, -1466, -594, -685, 7125, 3280, -3901, -12723, -10830, -3963, -3523, -8645, -11257, -17982, -7198, -907, 2526, 4204, 1881, 2081, 3504, -4397, -7439, 3224, 3051, 4892, 5083, -872, -3475, -7749, -8976, -4473, -6449, -13170, -15395, -10948, -5003, -15, 5855, 9837, 5785, 5869, 8528, 3683, 3840, 8025, 2579, -4360, -1618, 4991, 4744, 4672, 6592, 4640, -1221, -592, 6326, 4001, 1897, 689, 3470, 11682, 4311, -2056, 1281, 4707, 9510, 11730, 10922, 5876, 6816, 491, 2879, 7810, 9043, 8569, 13310, 16531, 11625, 11437, 8425, -2817, -12382]
13646a2382O296Q022N2m974o84N161k230L853R899K245L004j253o029q594m155
13631a769l061L700l63J351O99L972j274p34n629O429q51n799j843l597m50M439
13615d780P859K669J118M477J253o821n497k014J536K420j791l394M89N439L463
13600F426j42j025k023L791J214n176m085j411M66L557K532m914l625k758k931
13585a0104J567Q028O382m318Q25o624n356J92P730J2698L907q48n038k570p89
13570E682J307l12L006k223l787l328J902M041l48m8J964r160m789j432M388M305
13554A168O388L598p743q895K779L256j941N911l312l344K599P575m043j1052
13540g056j333J654n875L196J2313M953k662J755l595K786J019J750K151j0527
$$ y = [-12382, -6086, 1936, 1988, -2986, -3670, 1491, -739, 3114, 13013, 15258, 18262, 17009, 10980, 2386, -1769, -4830, -1130, -1493, -142, 557, 4529, 3255, 2521, -3108, 3321, 2470, -3329, -5172, -8769, -9219, -4780, 3079, 5748, 6866, 11343, 12596, 5775, 278, -1736, -200, 2220, 429, -2965, -2476, 2963, 6426, 6284, 5259, 3236, 7027, 8241, 3065, -1020, -2431, -1965, 1592, 4124, -790, -4415, -7173, -10104, -8537, -509, 5873, 1555, 2380, -4244, -9600, -9408, -1678, 11020, 14927, 14079, 9041, 6471, 5682, 6989, 6677, 9683, 7460, 3673, 345, 2247, 6288, 5940, 5892, 7856, -1304, -6093, -7525, -3137, 1168, 7556, 11154, 3411, -5484, -2705, 551, -1390, 4521, 1209, -2135, 464, 8039, 3996, -7056, -8389, -6735, -12610, -9414, 2899, 7852, 5190, 6945, 3350, 6136, 7155, 8905, 11056, 529]
13526E29p398r441m779N160P926J1043L550p552M815j412o172p522L751N891N875
13511D264J0755J324l317p960p298j172K518L504k017M924K149j657j148q13m698
13496f42l672Q90L863j574L727K409o43R63j448J482O62J719l906M476j975J375
13480G706K070j561M071m557m013M533o078l074J462J831J627k823K552K813N037
13465A1596M922j036j224k165q22k921j548L046M059j0727o88n18L279l193l591
13450a531N980J3198q100j2019L097j899J966L565K53M807J1719l002r219j244
13436G571O026o324j0174p150j002J0170J4541M684l056m549j0400o818L257O296
13422C072j42j188Q12R483p372p135Q16m054J617M530m766P02K147M209L623J415
$$ y = [529, -6869, -16310, -21089, -15929, -8003, 3040, 6590, -962, 3853, 2441, -3731, -11253, -7502, -1611, 4264, 15019, 16343, 13026, 5066, -2232, -3404, -886, 2618, 601, 5525, 7674, 6017, 4869, 4056, -642, -4314, -3424, 439, -1135, 2592, 5001, 4358, 5321, 3873, 5355, 6017, 7736, 3830, 8306, 6331, 7706, 9776, 8215, 12286, 7729, 3716, 8249, 2171, -903, 559, 2390, 4017, 1194, 3746, 6559, 11596, 16518, 15482, 14258, 12093, 11271, 8350, 6802, 9848, 13907, 3180, 2492, 1974, 5253, 2060, -1531, 4449, 17647, 9547, -2472, 625, -1274, 692, 4257, 4510, 9317, 21036, 18034, 8815, 7571, 13597, 7273, -2901, -10051, -11053, -883, 13658, 18342, 15286, 10737, 337, -6481, -3224, 3072, 2930, 1742, 2554, 12037, 4665, -2470, -1654, -5708, -4091, 439, -4327, -3625, -1478, 2731, 6354, 7769]
13406G769J49N479l640n699l168o645M172N938k341M323o06N639J240p363m611
13391F36k830k363N13r73J508J495k004k435R120M412m17R63l289m543J6J300
13375A109K243r93l381l009O159j62M083O194O77k28j1281M984M036L546Q615
13360B2592l594n707p796q294M424j369K54j503l512n08Q335K542o712p301n739
13345a3888J741L660L111j760O015N980M309j080q79k391R32m227J15l328J666
13330b4M706K913L733R11k341j690J671M189m229n507o841o059k573J177J58O748
13314c058O718K625k315k510k698k931J086N519K280j666J640K721k638l709L049
13299D113J604J404P78M6l351K338p13P143J338l047l171l607q871N082N04k972
$$ y = [7769, 7918, 13397, 9757, 4058, 890, -5755, -1583, 4355, 2014, 6337, 5731, 11370, 12610, 5247, 636, -2194, -4557, -4044, -5017, -3509, -2014, -4018, -6453, 2667, 7079, 6662, 7625, 4336, -207, -191, 1109, 3352, 2359, -1022, -4031, 2128, 1966, 6049, 12243, 12920, 12692, 1411, 6395, 10431, 13977, 22592, 18998, 13291, 5495, -2799, 1625, 256, 510, -993, -4505, -5013, 3322, 5864, -848, -8149, -13888, -12147, -8487, -5376, -7136, -1121, 4859, 9168, 8088, 7209, 4818, 5750, 1523, 1638, -1690, -24, 4682, 7595, 11328, 12239, 9898, 8208, 9879, 14068, 9839, 4332, -2509, -8568, -11141, -9964, -9806, -3058, 3660, 6285, 3970, 1460, -1238, -4169, -3083, 2436, 4716, 3050, 4690, 7411, 4773, 1064, 4113, 5717, 7121, 7899, 7945, 4594, 6932, 6219, 13362, 14700, 11653, 8482, 4875, -3996, 1086, 1590, -1382]
13283a382N570Q032j07R90Q273J0256m165p499L773k897L435q59M000Q494P209
13268D3123J3083r30M62j294o257j4490q596j826o745l589q35L176k725N982M321
13253B2860r001L601O34j310m135l747N677k79n612m064l658M396M123O170j235
13238A4420k127k750O728O339O150M729R534l149j3447j4185m83L888O626O12
13224B2885P467N476o706J364N448l206k077J497J417p745j139R17m657l797n062
13209A2082j592J2613P133jP217k3k918J888J840N071k111N677K851N231M459
13194E9417O628J1535J074R683J9212J8858K3394K9192K7844M2876O3297J00234
13182D13244J60699K43008L57857N02257N63655M61947J57582l41151p02309n86053
$$ y = [-1382, 4188, 12220, 12113, 13103, 21376, 31632, 27467, 19968, 23741, 20844, 24279, 23420, 27420, 35914, 43123, 56206, 55276, 55738, 54444, 48187, 33697, 25101, 23275, 16530, 12941, 12106, 15282, 12557, 18539, 22860, 13859, 17460, 18094, 16784, 12649, 8902, 14579, 14300, 8688, 4624, 966, 5362, 9485, 15655, 14420, 12293, 9543, 16271, 22610, 28760, 33489, 43023, 39874, 26427, 12242, 11759, 15647, 22273, 22885, 30352, 35828, 29122, 30486, 35934, 32728, 30651, 32148, 33565, 25820, 24681, 25598, 20941, 17144, 12082, 10490, 23103, 30236, 30235, 37452, 37429, 34511, 36399, 38239, 43310, 41199, 46876, 49727, 54958, 59417, 66045, 77580, 78654, 88337, 107549, 126407, 149801, 178993, 206837, 249713, 313010, 413244, 573943, 816951, 1174808, 1677065, 2240720, 2702667, 2860249, 2519098, 1816789, 1230736]
13172A230736l55645k11127j35096q3585n4895m0959k5315k5688k6154j5572j7687
13161B39013k5002k9798j5915j0089j6116j4980p431j1446j3981q856q555p794
13149F9050p418j0905p828p526k059J813j225M104K856o27n38r25j587l281n148
13134B8756o91N964L371k248L958l640L87L14N058L897L9J22j2189r238k361o867
13118A4632K988L169J055O586K137J712k809m073n379n00r14n551j398m653j085
13103E917P952M137N837L535M328K536L136L269k881l562m126p74p755p831L35
13088A4053r50p19N362l017K120k747R57O863R84m108o901l166J117m639r034
13073c825K186L984M982L219m465k505L719k664j171L320O469L211k298m010J054
$$ y = [1230736, 875091, 663964, 528868, 445283, 390388, 349429, 324114, 298426, 272272, 256700, 239013, 214011, 184213, 168298, 158209, 142093, 127113, 119682, 108236, 94255, 85399, 76844, 69050, 61632, 50727, 42899, 35373, 33314, 35127, 33902, 38006, 40862, 40235, 39697, 38772, 37185, 33904, 28756, 28065, 34029, 37400, 35152, 39110, 35470, 35857, 36171, 41229, 45126, 45165, 45287, 33098, 23860, 21499, 14632, 17620, 20789, 21844, 28430, 30567, 32279, 29470, 25397, 20018, 19518, 18604, 13053, 11655, 7002, 5917, 13869, 18006, 23843, 27378, 31706, 34242, 37378, 40647, 37766, 34204, 30078, 29304, 21549, 13718, 14053, 13103, 12384, 17746, 14729, 16849, 14102, 15059, 21922, 22906, 18798, 11897, 8731, 9848, 5209, -3825, -1639, 2345, 7327, 10546, 6081, 3576, 7295, 4631, 3460, 6780, 13249, 16460, 14162, 10152, 11206]
13058A1206O03P281k088L847N71J674Q979Q847Q033L681L387O956R779K529n810
13043F9475m744o121k195j0559j0083r35K119K931N177n690k507q610l416j515
13029B3327l622J249M336p30j826j399N575L438L141Q539r9N645k313l78n62m276
13013D0045l125n443O6N10j310n534o29J96N705l179L103L133o779J78l444M021
12997B7514Q312R383K998n006r265j5286j3970n133j396k900N494J2411J3661
12984B6817M125l18j288J288M650J3289J2788P190N492M927L4913P5012O4035
12971B52920M6611N8547R107o8301p1655m6318l3223k7303k924n18o638l540j510
12958A05255m779n417j0371r197j0650J076K83L011L953l78r316j0852J0343O550
$$ y = [11206, 11809, 19090, 17002, 20849, 21420, 23094, 32073, 40920, 48953, 52634, 56021, 62977, 72756, 75285, 69475, 64731, 58610, 56415, 45856, 35773, 34838, 36957, 39888, 45065, 39375, 36868, 28258, 24842, 23327, 19705, 20954, 25290, 24560, 22734, 21335, 26910, 30348, 33489, 42028, 41929, 47574, 45261, 44883, 44321, 40045, 36920, 31477, 31543, 32053, 30743, 25209, 24580, 24776, 30481, 27302, 30405, 33538, 26759, 26937, 23493, 27514, 35826, 45209, 48207, 43201, 33936, 18650, 4680, -453, -1849, -4749, 745, 13156, 26817, 30942, 30624, 29336, 30624, 35274, 48563, 61351, 68541, 74033, 78960, 113873, 188885, 252920, 299531, 358078, 367185, 298884, 227229, 180911, 147688, 120385, 117461, 116943, 110305, 106765, 105255, 100476, 95059, 84688, 75491, 64841, 65917, 66200, 69211, 73164, 72786, 63470, 52618, 62961, 69511]
12944F9511J401j371J815R502P944J327m060j07J2977J4282J8169Q470q542j5417
12930A15901j3263j2230p694J117N203J0800R367r157j5151j5637j8175j5725
12918C5356j1291p138k619r10n825p063R5m174p339j242m668J0641K6188K2286
12904D2297K065o846n269R875K1162K1722Q574L043J2539M415p973j4527j3600
12891G7477p720J39l696n628m792l741n174n109l137J534l10j3441j7594q925
12877a17j633O048P841J848J5631J1617J2325K1339L1403N750j8635k1000j9474
12864E2943p192L507j046K217j463p873j5423j3076j6322j5560j7468l1286m7470
12851a15512n0512o1835p5449k1641K32670O44181P31065M12145J63491j13047
$$ y = [69511, 70912, 69541, 71356, 80858, 88802, 90129, 86069, 85962, 98939, 113221, 131390, 139860, 131318, 115901, 102638, 90408, 82714, 83831, 89034, 99834, 109201, 100044, 84893, 69256, 51081, 35356, 24065, 16927, 14308, 13398, 7573, 510, 605, -3569, -10908, -12150, -16818, -6177, 20011, 42297, 44362, 37516, 32247, 42122, 63284, 85006, 93580, 96623, 109162, 113577, 105604, 91077, 77477, 69757, 69896, 66200, 60572, 55780, 52039, 46865, 41756, 38619, 40153, 39843, 26402, 8808, -117, -1750, 4298, 12139, 13987, 29618, 41235, 53560, 74899, 106302, 112052, 93417, 72417, 52943, 45751, 49258, 48212, 50429, 48966, 41093, 25670, 12594, -3728, -19288, -36756, -68042, -115512, -166024, -227859, -303308, -324949, -92279, 551902, 1282967, 1695112, 1858603, 1745556]
12841A745556l88219l02331j40919n8412n0774n6911n0757k6885k584K480Q977
12830F79221J4165P869P427J3426J7232J5470K0335K5731L7266L4432L0650J9739
12818I22963J6690K3364N4609Q5156J32410K14810L25931M95013P57766J133467
12808D162179J427094J332445P10852l77477j603847j606358j015655n87780l49493
12799B091960k25921j61350j04641o3850l5665j5755j0576k9259o8621p2226o6927
12788A237169m9313j1337K610J579n224o379j5091k6974k7037l8384k3925L465
12776A041159N865K0088M3946N9485O9719O5786N4326J8500j2669j5216j727J2820
12764A362082L5511M4126N2745O6237Q8551J16069J24023J25756J37070J47728
$$ y = [1745556, 1357337, 1055006, 914087, 855675, 804901, 747990, 697233, 670348, 667764, 670244, 679221, 693386, 701255, 708682, 722108, 739340, 754810, 775145, 800876, 838142, 872574, 903224, 922963, 939653, 963017, 1017626, 1102782, 1235192, 1450002, 1775933, 2270946, 3028712, 4162179, 5589273, 6921718, 7632570, 7255093, 5651246, 4044888, 3029233, 2441453, 2091960, 1866039, 1704689, 1600048, 1536198, 1500533, 1484778, 1474202, 1444943, 1376322, 1304096, 1237169, 1187856, 1176519, 1179129, 1180708, 1175484, 1169105, 1154014, 1127040, 1100003, 1061619, 1037694, 1041159, 1047024, 1067112, 1111058, 1170543, 1240262, 1306048, 1360374, 1378874, 1366205, 1350989, 1349262, 1362082, 1397593, 1441719, 1494464, 1560701, 1649252, 1765321, 1889344, 2015100, 2152170, 2299898]
12754B299898J37860J26065J37778J71664K16117K77750L62439M13586L79696
12745D522853K62641Q5875j5468R6036K70200L68222L92688M65378N93758P27499
12735G769682Q96587J077462J313207J586394J974725K498082L030480L493765
12727B3640384M009639M788387O399380R683822J4997251K3120103L5342151N3414014
12719A75395131P7555859R7377254R3148683N6762033l892677q9966079j21063160
12712B85317044q7101099n2183545l1981826k1021952j4498256j0147904p042010
12705F1340452m703590k958036k018516k219765l649618m606072m581833m120670
12697C2482352l520690l006253k640741k355216k049161j778432j533652j313126
$$ y = [2299898, 2437758, 2563823, 2701601, 2873265, 3089382, 3367132, 3729571, 4143157, 4522853, 4785494, 4871369, 4855901, 4951937, 5222137, 5590359, 5983047, 6448425, 7042183, 7769682, 8666269, 9743731, 11056938, 12643332, 14618057, 17116139, 20146619, 23640384, 27650023, 32438410, 38837790, 48521612, 63518863, 86638966, 121981117, 175395131, 252950990, 350328244, 443476927, 500238960, 496346283, 406380204, 285317044, 198215945, 146032400, 114050574, 93028622, 78530366, 68382462, 61340452, 56636862, 53678826, 51660310, 49440545, 45790927, 41184855, 36603022, 32482352, 28961662, 25955409, 23314668, 20959452, 18910291, 17131859, 15598207, 14285081]
12689A4285081j144606j059202j003563r11654p93371p14375o55702n87929n50550
12680F864129n15004m54475l75639l39829l15617k66594k39382k36332k07092
12671C914165j87125j86978j83894j86201j88609j89418j89913j83964j59908
12662B258155j34403j07621p4258n4143n4673o1114o6072p2815q9148r2378r6728
12651A354802r1906q2339o7678n3975m4005l4421l1892k7760m0342m7307n5297
12640G77880n6475n3109l9941k6504j7225k3727k5752k0743k3088l1997k3792
12629D35527j6197k7313k8742j2535j5175q135O028J2094J1873M297J305p667
12617C55360j4504j1149j7602l4115l9665m2662l3381o094k175o232o66l679j347
$$ y = [14285081, 13140475, 12081273, 11077710, 10166056, 9372685, 8658310, 8002608, 7414679, 6864129, 6349125, 5894650, 5519011, 5179182, 4863565, 4596971, 4357589, 4121257, 3914165, 3727040, 3540062, 3356168, 3169967, 2981358, 2791940, 2602027, 2418063, 2258155, 2123752, 2016131, 1941873, 1887730, 1833057, 1771943, 1705871, 1633056, 1543908, 1451530, 1354802, 1262896, 1180557, 1112879, 1058904, 1014899, 980478, 948586, 920826, 880484, 833177, 777880, 721405, 668296, 628355, 601851, 584626, 560899, 535147, 514404, 491316, 459319, 435527, 419330, 392017, 363275, 350740, 335565, 327430, 333458, 345552, 357425, 361722, 363027, 355360, 340856, 329707, 312105, 277990, 238325, 195663, 162282, 156188, 154013, 147781, 147115, 143436, 142089]
12604A42089K36p443j1843j6998j7692l997M971J4976l24l2484l3690l7086l1814
12591c1099K691J3703l4587j8915J15368K08499J53022M0192j1405j6431j7261
12580D03777j7287j5072k2670j5077r335j0401j404Q663J3510J0900R702J1156
12568C66462J718J675o022r15k529k088O67M340K2019J5229R447J0618K620j0989
12554D12252n433n505k0955k3347r501o101j1479N2N438j2298k1808j5647l885
12541B81783j3001j3324o209n091j1412j2151q508k147N019J4392J6069J2998
12529B58418P099j2360j8966J542K5914K3276P43j3627j7846j2755m379O834K689
12516B46582j0602j0911j5939k2450k0929j4091l955j2316j3351n809K378P740
$$ y = [142089, 142325, 134882, 123039, 106041, 88349, 84352, 89323, 104299, 103975, 71491, 37801, 715, -31099, -28408, -14705, -49292, -68207, 47161, 255660, 408682, 448874, 437469, 421038, 403777, 386490, 371418, 348748, 333671, 324336, 313935, 312531, 321194, 334704, 345604, 355306, 366462, 368180, 369855, 363833, 362918, 360389, 358301, 358968, 363308, 385327, 400556, 410003, 420621, 423241, 412252, 406819, 401314, 380359, 357012, 347511, 341410, 329931, 329983, 335421, 323123, 301315, 285668, 281783, 268782, 255458, 249249, 244158, 232746, 220595, 212087, 209940, 214959, 229351, 245420, 258418, 265517, 253157, 234191, 235733, 261647, 284923, 285666, 272039, 254193, 241438, 237059, 243893, 246582, 235980, 225069, 209130, 186680, 165751, 151660, 147705, 135389, 122038, 116229, 118607, 126347]
12504A26347L72k199J678j0463j1338p023l296K721J0786J3333M468j1390j7128
12491I6868j1411M023J2537J4040J623l966k964n412k58m9K433j093n411K975
12477A03935j216j4612j1234q161r27p762j258O604P038K0632J4591j2771k0825
12464G4034r610j4246k224K9883L9150L7620K0186q289j4495j8942j1492k766
12452A18809n817l722l476J040Q295N389N332N777j43q81k089L92o367j3926j4227
12437I4386j642N799P239n799j680m274Q92k389N723l60l586J762N149P330n491
12422A03059o703l097m743p670r223m852o569n560k449n518R78J2979O937O115
12408G3684M252P052j549n826L544M389k316r884r564j820k783k448J065L552
$$ y = [126347, 126719, 124520, 126198, 115735, 104397, 97374, 94078, 96799, 107585, 120918, 125386, 113996, 96868, 85457, 89480, 102017, 116057, 117680, 113714, 110750, 105338, 105080, 105031, 107464, 106371, 100960, 103935, 102719, 88107, 76873, 68712, 67785, 60023, 58765, 65369, 72407, 93039, 107630, 94859, 74034, 64424, 50178, 47954, 77837, 116987, 154607, 174793, 166504, 152009, 133067, 121575, 118809, 112992, 109270, 105794, 106834, 115129, 120518, 125850, 131627, 131484, 130603, 128514, 128906, 122539, 108613, 94386, 92744, 98543, 105782, 99983, 98303, 94029, 94921, 92532, 98255, 97895, 94309, 96071, 101220, 108550, 103059, 96356, 93259, 88516, 80846, 71623, 66771, 60202, 54642, 52193, 46675, 47653, 60632, 67569, 73684, 77936, 84988, 83439, 77613, 81157, 85546, 83230, 73346, 63782, 61962, 59179, 56731, 57796, 61348]
12394F1348J948l432k942j786j3384j2611q160k243K78l031N599M582R42R572
12380C6680N690J235L183N332N885K011k282K276j185m040p53O808M783n005o748
12365E3870n86K754N717l331L925N422M158m35j636n199p071k801k641k093o789
12350D3264j415J2154J655K156j093l06j1729k416O407J269r11k092P03j798J332
12335D7180k07n133J170O416l152P21O427N538L240R46p634q339o044j961j631
12320C7537q587k068L759L261p280L964j865l401N870J353j023j730K429K824
12306C5043O141K428j090K06O59m958J64J4880K404j954J443k752n111n793N078
12291D6788R122O047J104J135P874J579l747o584l862r26n60N906Q186M977J237
$$ y = [61348, 63296, 59864, 56922, 55136, 41752, 29141, 20981, 18738, 19016, 15985, 21584, 26166, 27108, 36680, 42370, 43605, 46788, 52120, 58005, 60016, 57734, 60010, 58825, 54785, 54032, 60840, 65623, 60618, 53870, 53284, 56038, 61755, 58424, 62349, 67771, 71929, 71494, 69858, 64659, 57588, 54787, 52146, 50053, 43264, 41849, 54003, 55658, 57814, 56721, 56415, 44686, 42270, 48677, 49946, 49035, 46943, 47646, 45848, 47180, 46973, 41840, 43010, 49426, 46274, 46995, 53422, 58960, 62200, 63146, 55512, 47173, 41129, 39168, 37537, 28950, 26882, 30641, 33902, 26622, 30586, 28721, 25320, 31190, 32543, 31520, 29790, 32219, 35043, 41184, 43612, 42522, 42728, 43387, 38429, 38593, 53473, 55877, 53923, 55366, 52614, 47503, 41710, 46788, 55910, 61957, 63061, 64196, 72070, 73649, 69902, 63318, 59456, 58530, 57970, 63876, 72062, 77039, 78276]
12276G8276k659M94M228j203L00Q227O098O494m02k708k233p036Q904N393R110
12261A11283J9287J6912J5902K6367K7486L7311N6920Q6009J42924K31512L47340
12250A119253M99952N80034M78637J75237l16429o70399n82615l70068k27888
12241F85714j41754r3566o4917l8417j6202j7460j2337o940j5436k1515l0053
12230B27117k5152k1158j3963j2260j9885j1935o21j2372j3701p131j7003q271
12218F3665K437n669j412q640o194o099q434K429M975J614L336M92K092o41q96
12203D3055j0936j2153m990p002j317Q485J826N275O806J116K329O335j938r663
12189B7228r844O526O465L149j683j926k414l761r73J124L076J29n237k693q31
$$ y = [78276, 75617, 76111, 80339, 79136, 79436, 87663, 93761, 100255, 99853, 97145, 94912, 87876, 96780, 102173, 111283, 130570, 147482, 163384, 189751, 217237, 254548, 311468, 397477, 540401, 771913, 1119253, 1619205, 2199239, 2677876, 2853113, 2536684, 1866285, 1283670, 913602, 685714, 543960, 450394, 385477, 347060, 330858, 313398, 301061, 294121, 278685, 257170, 227117, 201965, 180807, 166844, 154584, 134699, 122764, 122143, 109771, 96070, 88939, 71936, 63665, 66102, 60433, 59021, 50381, 44187, 38088, 29654, 32083, 37058, 38672, 42008, 42500, 44592, 43951, 43055, 32119, 19966, 14976, 7974, 6657, 15142, 16968, 22243, 29049, 30165, 32494, 38829, 36891, 27228, 17384, 23910, 30375, 33524, 31841, 29915, 27501, 23740, 22767, 23891, 26967, 27096, 21859, 19166, 18335]
12174A8335M012L978l918m301Q52M550j752j30P871K808r690m604P42o024k332
12159A0397O87n360j274j125q13m552J2151J0313K231P628j798q22m819l568l125
12144A6151l290m776J0683J2234L32m872L17Q299j731o676n338m181J838l171
12130A5819n720O346J0583K417R4m929o346k353O666N04o285m491Q306R577n121
12115B5067j0019K798P912k377m795M045R428j614q678k866q57k128n41J102J199
12100A7676Q08P38K219m445o955q333j332P209J0407L935M3l405K7N024k015j635
12084A9966k115l339J778L509M193l82l215o291k95J532j800R05l201k615m917
12069C713q98P750Q618l829l619r039N105p08L445M074j236O09j465Q58o556j001
$$ y = [18335, 22347, 26325, 22407, 18106, 18958, 23508, 21756, 21626, 29497, 32305, 22615, 18011, 18753, 12729, 10397, 11084, 5724, 4450, 3325, 2512, -2040, 10111, 20424, 22655, 30283, 28485, 27663, 22844, 19276, 16151, 12861, 8085, 18768, 31002, 31334, 26462, 26779, 35078, 33347, 26671, 21333, 17152, 18990, 15819, 10099, 16445, 27028, 29445, 29539, 24610, 18264, 15911, 22577, 23081, 16796, 12305, 20611, 30188, 25067, 15048, 17846, 25758, 23381, 18586, 22631, 32059, 30445, 21767, 18901, 18044, 15916, 15375, 16477, 17676, 18484, 19222, 21441, 16996, 10041, 1708, 376, 7585, 17992, 21927, 21970, 18565, 18592, 23616, 21601, 19966, 17851, 14512, 16290, 19799, 23992, 23610, 20395, 14104, 13809, 15341, 13541, 14446, 11245, 8630, 3713, 2815, 10565, 19183, 15354, 11735, 2696, 7801, 7093, 10538, 14612, 13376, 13985, 12520, 13378, 6822, 5821]
12053E821L080K2j256l017K711K116L737p021l801q29L583J603o317J677R420
12038A1529J817L69l497n965K89N065J028J319o371J921P644K7r84l005L290L690
12022A8166J19p931J595K034l8J691J748O13n656q493L793R376q33K450L267l767
12006A8134j804n52m769m752N92l388l904K133M8l456J466m15l071K178L834L950
11990F224k466j402L917n783J378K855P203J949j556m126M780k596q976k390O750
11975E761Q319O91L41M54K09p43j296K211m763j83J256l080K401O047o07J803
11959A8821J811l79n054L279k791Q92K0l557k902j667N912K629m875J444M181
11944A7764Q344p03q525o168k144l106k779m74M67P132Jo599Q07J242L775N031
$$ y = [5821, 8901, 8923, 7667, 4650, 7361, 9477, 13214, 6193, 2392, 1563, 5146, 6749, 432, 2109, 11529, 13346, 13715, 10218, 4253, 4542, 9607, 10635, 11954, 5583, 7504, 15148, 15175, 14191, 11186, 14476, 18166, 18285, 10354, 11949, 13983, 13945, 15636, 17384, 17997, 12341, 3848, 7641, 17017, 16184, 18634, 21901, 18134, 16330, 15778, 11009, 6257, 6849, 3461, -443, 1690, 1738, -1718, -252, -667, -3738, -1560, 2274, 6224, 3758, 2356, 6273, 490, 1868, 4723, 11926, 13875, 12319, 8193, 12973, 10377, 1401, -989, 5761, 14080, 14771, 15112, 15566, 15775, 15032, 13736, 15947, 11184, 11001, 12257, 9177, 11578, 17625, 17018, 18821, 20632, 20253, 15199, 18478, 15687, 16579, 16599, 13042, 10140, 8473, 14385, 17014, 12139, 13583, 17764, 26108, 25405, 16880, 10712, 8568, 5462, 2683, 2209, 2676, 9808, 9809, 3210, 4017, 5259, 9034, 14065]
11928A4065M414l367n616k349n977m445k80L8l92K243K642R33M961J994n07J428
11912I785O7n238q320q09M927R277R271J17K057n625k662l123l639j071m118Q830
11896I726j721L686n3n680p593k67M509M470J731L587N289L812l774j355J72j697
11880A4842J18m755L934K163n302j378J885P028j420j510J753k155q42r12J774
11865A5223M695l01r602m601J117P187O88j0375L669Q985L667m931p333n607K132
11850D613J622r33K184K345K704J292j0260n017j981J230n457Q266o213l191R130
11835C34k493N45m339P067Q38n514N989k101k196L55k780J29J1484Q197k344m672
11819H499q214m986P088k438q92J564P243N043K48K356J843j358L011k406m247
$$ y = [14065, 18479, 15112, 9496, 7147, 1170, -3275, -3555, -3517, -3909, -1666, 976, 1909, 6870, 8864, 8357, 9785, 9852, 4614, -3706, -4515, 412, 9689, 18960, 19077, 21134, 15509, 12847, 9724, 6085, 5014, 896, 9726, 8005, 11691, 11638, 5958, -1635, -1902, 2607, 7077, 8808, 12395, 17684, 21496, 17722, 16367, 16539, 14842, 14960, 10205, 14139, 16302, 11000, 9622, 11507, 18535, 17115, 15605, 17358, 15203, 14361, 13449, 15223, 19918, 19617, 10015, 5414, 6531, 13718, 14406, 4031, 7700, 16685, 20352, 15421, 8088, 2481, 4613, 6235, 5302, 7486, 9831, 12535, 13827, 3567, -1450, -3431, -2201, -7658, 608, -5605, -8796, 334, -2159, -1614, -5953, 1114, 1952, -3562, 2427, 326, -1870, -1515, -4295, -4166, 7318, 15515, 13171, 8499, 285, -4701, 2387, -51, -943, 621, 7864, 12907, 13155, 15511, 17354, 15996, 19007, 16601, 12354]
11804A2354q453j650K0L335P663n65j242j0438n361N46L815L084J139O308K233
11789A2788O155J287r078q423J318j713L503O13J126n724l41N795K005r373M54
11774C92J1071M523k985k265j321k966j264N474k06R51j171P438L488O321P365
11759C4845n67j394o534l196k44K107J284k747j0467J343P183J484r53o487M768
11744B0425M011k930J121k380J87l059J556Q32m288j843N69l939m43O327P259
11729B3405p27M021M488L994K086l258R65n540k935j741M821L693k545k070L42
11714B8999k435l221K138N46J94k01J713L054L067J2139Q83j0719p308o103k490
11699B0256j440m28K695j50p38K106J782J220n226q08J813n696j774M515J1381
$$ y = [12354, 3901, 2251, 2271, 5606, 13269, 12704, 11462, 1024, -4337, -3791, 24, 3108, 4247, 10555, 12788, 18943, 20230, 11152, 2729, 4047, 2334, 5837, 6450, 7576, 1852, 1511, 7306, 9311, -62, 392, 11463, 15986, 13001, 10736, 9415, 6449, 5185, 10659, 10453, 11404, 10233, 17671, 21159, 27480, 34845, 34278, 32884, 26350, 23154, 22910, 25017, 26301, 23554, 13087, 14430, 21613, 23097, 22144, 15657, 20425, 24436, 21506, 22627, 20247, 20434, 17375, 18931, 19763, 15475, 13632, 14201, 10262, 9819, 16146, 23405, 22678, 26699, 31187, 35181, 37267, 34009, 34974, 29434, 26499, 24758, 29579, 33272, 30727, 28657, 28999, 26564, 23343, 25481, 26027, 26221, 26020, 27733, 30787, 33854, 45993, 46876, 36157, 28849, 22746, 20256, 18816, 18388, 21083, 20933, 20195, 22301, 24083, 25303, 20077, 19269, 21082, 15386, 13612, 18127, 29508]
11684B9508J2276J142j101O316J9082J6794J4625J8349K8390M6638N1346P8612
11672C21977J15214J54242J81711J84491J50293M8215o4308j59944j95634j71497
11662E64760j30891r1052n6746l6942k7157k5792j6863r229l906n027p924o716
11650A46515k328l776O04M656L966J0882J5092K4456M6134P3195J06316J45403
11638E71115J78149J86385J50805O8626m7859j37143j79040j83180j52110j03827
11628C51921o4544l8167k5147j9335r590j4305j5431o152k654j0764q311m177
11616A33344m564j2776q164j2119j9087j4896m551l01k373j777k668M10K225m57
11602E2246j076l650j215k792o083k337p304J992K814k852O14L30n08K516k485
$$ y = [29508, 41784, 42926, 41825, 48141, 67223, 84017, 98642, 116991, 145381, 192019, 243365, 321977, 437191, 591433, 773144, 957635, 1107928, 1156143, 1091835, 931891, 736257, 564760, 433869, 342817, 286071, 249129, 221972, 196180, 179317, 170088, 166182, 161155, 153231, 146515, 144187, 140411, 141015, 145671, 149637, 160519, 175611, 200067, 246201, 319396, 425712, 571115, 749264, 935649, 1086454, 1155080, 1107221, 970078, 791038, 607858, 455748, 351921, 287377, 249210, 224063, 204728, 195138, 180833, 165402, 159250, 156596, 145832, 137521, 133344, 128780, 116004, 107840, 95721, 76634, 61738, 57187, 56886, 54513, 52736, 50068, 50478, 52703, 52246, 51170, 47520, 46305, 43513, 37430, 35093, 27789, 29781, 32595, 29743, 30357, 30687, 30179, 32695, 30210]
11587C0210K135J475K739n870J008L346N398R303M204J694J0166O159p915k855
11573F1197P047N907p391j0376m280j783l566o999o121n672r72J661J133J083
11559C0868M079L363p172l147o17j328j875j799M871R314J568l574J203J091N282
11544D2127J0916o29k810M222O444j603p136q305n719n445j836q43J462R99r01
11529C0943j276N404k316J304P2o002n724N938J632m653P02M94O035L997j301
11514C5249P71K124L397q589p789N265J1961L861L454K643K732M173N36j804O941
11499F4925J2243J4384L1213K9708K0394L035j0102k1155j8689j4306q355n737
11487I7558j1854r271o048p284n785m107k845o247l14N172Q654L31M498O851K426
$$ y = [30210, 32345, 33820, 36559, 30689, 31697, 35043, 40441, 49744, 53948, 55642, 65808, 71967, 64052, 61197, 68244, 74151, 66760, 56384, 52104, 50321, 46755, 39756, 33635, 27963, 26991, 28652, 29785, 30868, 34947, 38310, 31138, 27991, 27374, 26046, 24171, 22372, 27243, 36557, 38125, 34551, 35754, 36845, 42127, 53043, 52414, 49604, 53826, 60270, 58667, 51531, 43226, 37507, 32062, 30226, 29383, 30845, 31844, 30943, 29667, 35071, 32755, 34059, 34131, 28129, 22405, 28343, 29975, 25322, 26024, 26518, 32553, 36550, 35249, 36020, 38144, 41541, 32952, 25163, 30428, 42389, 46250, 49704, 52347, 55079, 59252, 59788, 57984, 64925, 77168, 91552, 122765, 152473, 172867, 175902, 165800, 144645, 125956, 111650, 103295, 97558, 85704, 76433, 70385, 63101, 57316, 53209, 50364, 44117, 43803, 48975, 57629, 57960, 62458, 69309, 71735]
11472G1735L54P14M916K939L793J6409K8165L0674K3576J4701R744j097j2896
11459A93727k1742k2229j4626o981j1902n803n868r595n492m552q452m609l953
11446F7923j901k239r944q464k847J749k305m914j0310j1120K043k509J547O621
11432B3330J4491M639P725K418k475N945L569Q009N458L328l127M637k547o070
11418F9330r23J0236n426j0597m394n840p252j2359j2228j748L267n332l804o520
11404F410K708k453j1992r124K614J2060J3903J2644J1298O928M529O798P950
11391F4273M008j173J515l992m905l421p176p894o357o575l687j0222j9042j3576
11377a8224j4454k1989k5184j4889K5809R9272J77898K16076J99122J22393J9503
$$ y = [71735, 72089, 72803, 77719, 80658, 84451, 100860, 129025, 159699, 183275, 197976, 207720, 206623, 193727, 171985, 149756, 135130, 128149, 116247, 110444, 104576, 94981, 89489, 84937, 76485, 71876, 67923, 66022, 63783, 53839, 45375, 42528, 44277, 41972, 37058, 26748, 15628, 17671, 15162, 16709, 23330, 37821, 42460, 50185, 52603, 50128, 56073, 59642, 67651, 73109, 76437, 73310, 77947, 75400, 69330, 68407, 78643, 73217, 62620, 58226, 52386, 45134, 32775, 20547, 18799, 22066, 16734, 12930, 6410, 9118, 6665, -5327, -14451, -11837, 223, 14126, 26770, 38068, 44996, 49525, 56323, 64273, 68281, 67108, 68623, 64631, 59726, 56305, 49129, 41235, 34878, 28303, 24616, 14394, -4648, -18224, -32678, -54667, -79851, -94740, -68931, 30341, 208239, 424315, 623437, 745830, 765333]
11366G65333n2200q3100p5765m6302k2665j7131j9901k7310l1100j9037j0582
11355C60240p173l257p144q16O206m070k752m737p666o828k0122k5870k4391k5683
11341B25937K431Q2102J62676K13434K09088J46530M8620k8263p4054q6714o4406
11330H37381l3061l0648j9976j3519o821j043j465P405Q774J058P761J0177j186
11317G64837K823J0127l794l288Q18p16M301O622K649O000P362J0436O965N077
11303H20219J1357J3601J6596K5094K9984L9934L0801L0400K1884J2399J2938
11292A065207Q437K796J0512J9866K9184L4743L3071L9131M7398O0967O6110P6570
11280A493992Q2363R3255R2385Q4392P8117P1636P5597P8951P5648Q6231J07447
$$ y = [765333, 713133, 630033, 554268, 507966, 485301, 468170, 448269, 420959, 389859, 370822, 360240, 353067, 349810, 342666, 341850, 348056, 343986, 341234, 336497, 328831, 322003, 301881, 276011, 251620, 225937, 228368, 310470, 473146, 686580, 895668, 1042198, 1090818, 1062555, 988501, 901787, 837381, 804320, 773672, 753696, 740177, 733356, 732313, 730848, 738253, 747027, 748085, 755846, 766023, 764837, 767660, 777787, 773993, 770705, 771523, 770807, 775108, 781730, 784379, 790379, 797741, 808177, 815142, 820219, 831576, 845177, 861773, 886867, 916851, 956785, 987586, 1017986, 1039870, 1052269, 1065207, 1073644, 1076440, 1086952, 1106818, 1136002, 1170745, 1203816, 1242947, 1290345, 1351312, 1417422, 1493992, 1576355, 1669610, 1761995, 1846387, 1924504, 1996140, 2071737, 2150688, 2226336, 2312567, 2420014]
11269B420014J26097J50057J90876K19935K43063K69635L02932L42759L94529
11260D659897M68369N45056O50119P93773R88675J220555J514155J856331K264317
11251A4961247K818227L733770N239568P662314J1415211J6918407K4257296L2124692
11243A19130732L7212325L5467309K3979749L602804j7705658l2579893l8007521
11236A31099847l2949348k3222010j5151731r949292o701518m572441l112713
11229C5440794k119798j518751j248902j204060j213558j135765q68118m46060
11221B5685782O7985O55893J329473K260651L703372N949069R375439J4440895
11213F3468559K1354122K9305293L5472584L5808232K7020899Q557697j3237055
$$ y = [2420014, 2546111, 2696168, 2887044, 3106979, 3350042, 3619677, 3922609, 4265368, 4659897, 5128266, 5673322, 6323441, 7117214, 8105889, 9326444, 10840599, 12696930, 14961247, 17779474, 21513244, 26752812, 34415126, 45830337, 62748744, 87006040, 119130732, 156343057, 191810366, 215790115, 219392919, 201687261, 169107368, 131099847, 98150499, 74928489, 59776758, 49827466, 43125948, 38553507, 35440794, 33320996, 31802245, 30553343, 29349283, 28135725, 26999960, 26131842, 25685782, 25753767, 26409660, 27739133, 29999784, 33703156, 39652225, 49027664, 63468559, 84822681, 114127974, 149600558, 185408790, 212429689, 220987386, 207750331]
11206B07750331k9781284l7630718l4976719k5797211j7116820j1304483p699982
11199D3443114n370173l803193k755431k125825j861385j865941j989529k100153
11191B1571484k089665j954449j759357j550306j359472j193166j050653r11705
11183I702711p94385p01316o28387n73748n14640m82671m47223m01824l60619
11174D797898l19678k88519k52379k16649j91812j66911j50854j26707j05412
11165B978977r1807p9823n5221l4729r365J0662L5805R3088K09406L89610O76352
11154D122955J094713J647487K198193K360895J773843L51187j517889k670118
11146I361266k469939j682201j060281o82922m64875l25106k36973j77075j37086
$$ y = [207750331, 177969047, 140338329, 105361610, 79564399, 62447579, 51143096, 43443114, 38072941, 34269748, 31514317, 29388492, 27527107, 25661166, 23671637, 21571484, 19481819, 17527370, 15768013, 14217707, 12858235, 11665069, 10614416, 9702711, 8908326, 8207010, 7578623, 7004875, 6490235, 6007564, 5560341, 5158517, 4797898, 4478220, 4189701, 3937322, 3720673, 3528861, 3361950, 3211096, 3084389, 2978977, 2887170, 2807347, 2752126, 2717397, 2708032, 2718694, 2754499, 2847587, 3056993, 3446603, 4122955, 5217668, 6865155, 9063348, 11424243, 13198086, 13549273, 12031384, 9361266, 6891327, 5209126, 4148845, 3465923, 3001048, 2675942, 2438969, 2261894, 2124808]
11137B124808j15778j12494j14521j32240j42488j36726j18096r8754r4634q4073
11127I75004o8908o3098n8318n8152n2220l6854m3323l9539m1549m6122m3008
11116D23913k4076j8411j4846P877K4035L9718N5679L8902j126j8550k7420k9983
11104D55712l0501k3341j5633m039r081j2918j1000j5750J489l478l604l130j2289
11091C12437p62q643m257j1122p543q398q947m554p254l979Q083K8257M3205N1725
11077C78248L8046J5787j267j1792j3083m974r498j1018r387j2083j5409n624
11065C37946O764Q84q957j2198k140J147K441M62N88j88K10j003N944P799R948
11050C49647Q522O444k037k117o506j0206j1986j0896r027m158j0718j2711p404
$$ y = [2124808, 2009030, 1896536, 1782015, 1649775, 1507287, 1370561, 1252465, 1153711, 1059077, 975004, 906096, 842998, 784680, 726528, 674308, 637454, 594131, 554592, 513043, 466921, 423913, 399837, 381426, 366580, 374457, 398492, 438210, 493889, 532791, 531665, 513115, 485695, 455712, 425211, 401870, 386237, 382198, 373117, 360199, 349199, 333449, 334938, 331460, 327856, 324726, 312437, 311675, 303032, 298775, 287653, 280110, 271712, 262765, 258211, 250957, 246978, 255061, 283318, 326523, 378248, 416294, 432081, 430814, 419022, 405939, 400965, 391467, 380449, 371062, 358979, 343570, 337946, 344710, 345594, 336637, 324439, 322299, 323446, 325887, 326349, 326937, 326749, 326959, 325956, 331900, 339699, 349647, 358169, 364613, 362576, 360459, 353953, 343747, 331761, 320865, 311838, 307680, 296962, 284251, 276847]
11037B76847j1909j7996j0759j3707p622K779J325K948m516j3715j3115q971j985
11024A79604L562K709J775O625L951J1L928P355o46j281j0795q058k443J67O225
11009A92689l792o329p760m773l262q351j1051j0655n937M238o138j0270n445
10996A13164L395L710j82K403O892J070p820q869k751K826N948P427J5145N534
10982A47892J123M874m39j2923m436P19l886R19K87K78n59N05J511n15o022k255
10966A27073j407p087l998k968L049j499M77q07k093o944l285J343K111P766J5509
10951A27240J5078N961k230q648q774j584L801p610p439Q70k907P614k22j0515
10937A10635m053Q87P76N121R168m420p377N75K169o77n878m915l921k360J92
$$ y = [276847, 264938, 246942, 236183, 222476, 214854, 217633, 218958, 221906, 217390, 203675, 190560, 181589, 179604, 183166, 185875, 187650, 194275, 198226, 198237, 202165, 209520, 208874, 207593, 196798, 188740, 186297, 186464, 192689, 188897, 182568, 174808, 170035, 166773, 158422, 147371, 136716, 130779, 135017, 128879, 118609, 113164, 116559, 120269, 120087, 122490, 129382, 130452, 122632, 113763, 111012, 113838, 119786, 127213, 142358, 147892, 149015, 153889, 153450, 140527, 136091, 136810, 132924, 133843, 134130, 134408, 133849, 134354, 135865, 135350, 129328, 127073, 125666, 118579, 114581, 111613, 114662, 113163, 113640, 112833, 110740, 103796, 100511, 101854, 103965, 111731, 127240, 142318, 148279, 146049, 137401, 128627, 127043, 130844, 123234, 115795, 116665, 113758, 121372, 121150, 110635, 106582, 107469, 108245, 113366, 122534, 118114, 110737, 111312, 113481, 112804, 106926, 102011, 98090, 95730, 95922]
10922I5922m917p299m203M036M115j001j972J993r78m446j0626o247m388K333
10908F2322m263n153P474J566J581J0275R042Q964J124l32j593o915k173K658
10894H4577o38p95p391p288M88P96L111k249K648M219p222j593J209m074j3035
10879E2763o860j698J34K750K069O030N514J542j275J15j240j724K861L594j198
10864F3377m506n501k854M691L527L04J752L510L650J827P17m970O49R36m501
10849F2608n356n162k602q276l601k074P886J4893J56Q58k13n723k602k72L881
10834E4401Q585N482J8p403k20M077K244J2273P011l871j282J1269J1350P232
10820A11166P372P020O498J3587J8487L6401M6097O5068J05196J50443J82231
$$ y = [95922, 91005, 83706, 79503, 83539, 87654, 86653, 84681, 86674, 85696, 81250, 70624, 64377, 59989, 62322, 58059, 52906, 60380, 61946, 63527, 73802, 82844, 91808, 92932, 92600, 91007, 84092, 81919, 84577, 83939, 83144, 75753, 68465, 68953, 69749, 72860, 70611, 73259, 77478, 70256, 68663, 69872, 65798, 52763, 45903, 44205, 44339, 47089, 49158, 55188, 60702, 62244, 60969, 61084, 59844, 58120, 60981, 64575, 63377, 58871, 53370, 50516, 55207, 58734, 59038, 60790, 64300, 67950, 69777, 70494, 65524, 66173, 67109, 62608, 57252, 52090, 49488, 41212, 37611, 35537, 43423, 58316, 58472, 59330, 59117, 53394, 50792, 50520, 54401, 62986, 68468, 68486, 61083, 60863, 64940, 67184, 79457, 86468, 82597, 81315, 92584, 103934, 111166, 118538, 125558, 132056, 145643, 164130, 200531, 246628, 311696, 416892, 567335, 749566]
10809G49566J96574J63949Q3445l4090j39020j89029j85056j46390r7391o5136
10799C37422m0500k7302j7545j0144j3644o618p054o678n667j3222j4593M60R228
10786A84143O130P875K1366K7609L9554N6777Q7666J30127J69356J95469J67789
10775A093861R4150j5571j23097j86075j96582j57323j05014p2131m5137k7661
10765B59420k5872j4002j3189j1041r799j7714j2469k0038p077m947o031r260
10753A07981r30k130j2787j2796k373Q34j207q192q626j852r104m271m450q036
10739C2061l398N356p40k178O98m947j02O688P549o255r89P236O165l093l123
10724D0928o322Q31P400Q051M949J4123J0195k94k386m120o402p891o964o814
$$ y = [749566, 946140, 1110089, 1193534, 1159444, 1020424, 831395, 646339, 499949, 402558, 337422, 296922, 269620, 252075, 241931, 228287, 221669, 214615, 207937, 202270, 189048, 174455, 174915, 184143, 190273, 198148, 219514, 247123, 286677, 343454, 431120, 561247, 730603, 926072, 1093861, 1188011, 1172440, 1049343, 863268, 666686, 509363, 404349, 332218, 287081, 259420, 233548, 219546, 206357, 195316, 185517, 167803, 155334, 135296, 128219, 123272, 117241, 107981, 107051, 104921, 92134, 79338, 76965, 77799, 76592, 68400, 59774, 57922, 48818, 44547, 40097, 32061, 28663, 34019, 33279, 31101, 31799, 26852, 26750, 33438, 40987, 34732, 33743, 40979, 47144, 44051, 40928, 34606, 35437, 42837, 50888, 55837, 69960, 80155, 79861, 77475, 73355, 66953, 59062, 52098, 45284]
10710D5284k231l055p431L998j277l89J160j182l688j131K724L947m812j304j688
10695B8925l389k193n163k80J072M070L537q175l409n25n761N782k675L521R514
10680B4851k235m393L659L2L755L667k318m054K020j005k182ML58L667K706J367
10664B9899k294o558j951l946m133L517M7J965K542Q7J177Q4J775J924K540K218
10648B8893K222J850m52k511P44r35k981p193m973k86J280l860R079M587m421
10633B1043o408m526P29k85j299R213K398j457m961L216p232m831J937K019Q376
10618A7932P131K856J306k102j147j055J65o808J293p24K952J365J363O303L619
10603C4449L122n647m317N875l790q648o187m832M672M601r838p840j307j061
$$ y = [45284, 43053, 39998, 32567, 36565, 35288, 34899, 36059, 34877, 31189, 30058, 32782, 36729, 31917, 30613, 28925, 25536, 23343, 18180, 17900, 18972, 23042, 26579, 18404, 14995, 14470, 8709, 14491, 11816, 15337, 24851, 22616, 18223, 21882, 21914, 25669, 29336, 27018, 22964, 24984, 23979, 21797, 21801, 22159, 25826, 28532, 29899, 27605, 21047, 19096, 15150, 11017, 14534, 14581, 16546, 19088, 19175, 20352, 20436, 22211, 24135, 26675, 28893, 31115, 32965, 32513, 30002, 30746, 29811, 26830, 19637, 14664, 14378, 15658, 11798, 20877, 25464, 21043, 14635, 10109, 10838, 10553, 9254, 18467, 20865, 19408, 14447, 17663, 10431, 5600, 7537, 9556, 17932, 25063, 27919, 29225, 27123, 25976, 24921, 25086, 18278, 19571, 18847, 21799, 23164, 24527, 30830, 34449, 37571, 31924, 27607, 33482, 29692, 21044, 14857, 10025, 14697, 19298, 9460, 1620, 313, -748]
10589g48j129O442J572P688K572l029o848m85L631K978M217Q299n54n140j830
10574A7636N007p41K072k079k795J01j0147m993P884J603L976L098l562k439N94
10559A5215L18J0j836m853n65l258l138K16L710J051j504N936J3430O42o558p070
10543A1746J321P443j491k443k506n118J915j212K330K490l875n277L118J1352
10529A9793j226l542k927Q82l758J136J0335N687j737k316n4r644j600N042l55
10514A5716J962m479J262k25M965m752m428l069n96p50L463m150l967K171L459
10499F582l512M096p7m321j717K973M011K92J068m69m012l696O328J956J272o435
10483D339n439K281L807l677K753J633m001n874k417p50P234M837L066n46r86
$$ y = [-748, -1877, 4565, 6137, 13825, 16397, 13368, 6520, 6035, 9666, 12644, 16861, 25160, 24606, 19466, 17636, 22643, 21902, 23974, 21895, 19100, 19201, 9054, 4061, 11945, 13548, 17524, 20622, 17060, 14621, 15215, 15533, 15543, 13707, 8854, 8289, 5031, 1893, 2109, 5819, 6870, 5366, 11302, 24732, 25374, 18816, 11746, 13067, 20510, 19019, 16576, 14070, 8952, 10867, 9655, 11985, 14475, 10600, 5323, 8441, 19793, 18567, 15025, 12098, 12980, 9222, 10358, 20693, 26380, 24643, 22327, 22273, 12629, 11029, 16071, 15716, 17678, 13199, 14461, 14236, 19201, 14449, 10021, 6952, 6356, 5606, 9069, 4919, 952, 3123, 6582, 3070, 7166, 7089, 2768, 1051, 4024, 8035, 8327, 9395, 8926, 4914, 1218, 7546, 9502, 10774, 4339, -1100, 1181, 4988, 1311, 4064, 5697, 1696, -4178, -6595, -7345, -111, 4726, 7792, 7246, 6260]
10468F260j014k927m64J0109O38k366J271J259l962j658l250O443J442l529j264
10453F988j834O146M871l502j487K602o949l904R5m307P938j41l182M100P035
10438A4469o109n35K636p27K9n587p818J661K343O597j98j12o532L675R129M694
10422A7615j329k108l7r75K01j548j332q485k71J227p67j313L731o40n612M825
10406C182R520o910p111J672J769K4J254k39O32K86n39J076O412K561p203M58
10390F844P85K202M186J871j1225p343P91P527Q901m179Q27m618P66P65r0N293
10374A3303M5j389K885M775j750l6l74k872k274k626j581p964L060L124K542l490
10358E378J264k298M595k392r22L52R212o32q621n013k538J265J102L290j913
$$ y = [6260, 5246, 2319, 1855, 11964, 12602, 10236, 11507, 12766, 8804, 7146, 3896, 10339, 11781, 8252, 6988, 5154, 11300, 16171, 12669, 11182, 13784, 6835, 2931, 3026, -1281, 6657, 6516, 3334, 7434, 14469, 8360, 7825, 10461, 9734, 9763, 4176, -3642, -1981, 362, 6959, 6761, 6649, 117, 3792, 12921, 17615, 16286, 14178, 14141, 13166, 13367, 11819, 10487, 2002, 1731, 2958, 2191, 878, 4609, 3969, -1643, 3182, 12702, 5792, -1319, 353, 2122, 2146, 3400, 3161, 3793, 4079, 3540, 4616, 11028, 13589, 6386, 6844, 7629, 9831, 14017, 15888, 4663, -2680, -1889, 5638, 14539, 10360, 11187, 6569, 7335, 8100, 8010, 13303, 13348, 11959, 14844, 19619, 17869, 17833, 17459, 14587, 12313, 9687, 8106, 142, 3202, 6326, 8868, 5378, 6642, 4344, 8939, 6547, 5625, 5977, 15189, 14557, 5936, 923, -1615, -350, 752, 4042, 2129]
10343B129k803l713L621R042O145n79j984K01n141l442k268M161O024j72k259
10328H962k167o777n584N83M505M743K255m294o63k117L892J509K947o912m565
10313c683L43n13P754J586J656P135j849j625N18l006k343M003r20N471J964L39
10297A6830k332j47p525o695N097J750J173n532n010J341k58j63j933Q94L473
10282I63K094Q71J888m211P315J690r913l593O800j03J747J406l267M081L142
10267A0910J568N370k29K067J374j476m678r450N89l97n018N576J676j1376R61
10252b533L865n018m988M606K256p65M500L319j30l543j161m240R45l048K584
10237c351L772M454J153m838k378L32O403P416J016J419k604m401m353l310l575
$$ y = [2129, -674, -4387, -766, 8276, 14421, 13842, 11858, 12059, 6918, 3476, 1208, 5369, 11393, 11221, 8962, 6795, 18, -5566, -4983, -478, 4265, 6520, 2226, 1563, -554, 3338, 4847, 7794, 882, -3683, -3340, -3853, 3901, 5487, 7143, 14278, 12429, 10804, 11322, 8316, 5973, 9976, 9056, 14527, 16491, 16830, 14498, 14351, 6826, 131, 5228, 6978, 8151, 2619, -2391, -1050, -1308, -1471, -3404, -2510, 963, 3057, 3928, 5816, 1605, 8920, 10610, 697, -2896, 3904, 3801, 5548, 6954, 3687, 7768, 10910, 12478, 17848, 17619, 19686, 21060, 19584, 14906, 5456, 6045, 5648, 630, 6206, 7882, -3494, -2533, 1332, -3686, -8674, -4068, -1812, -2577, 1923, 5242, 5112, 1569, 408, -3832, -2887, -5935, -3351, 421, 4875, 6028, 1190, -1188, -856, 5547, 12963, 13979, 15398, 12794, 8393, 4040, 730, -2845]
10222b845K985P32n023n325K347P513L36j293J2475M845l436j0165p957M904J867
10207A960N653O876N580n483r368O03J300m526J360L672k319j498M5k177K965
10192D643L340N739L662r215q705l438J0184Q011l362q434p103M748O314Q43J659
10177H886M807M82N23o384R91N158n983l749J223L177p18l06n259o30o259l502
10161g543O785Q46J276n770r205N901O755L929n486k454K936Q918m38K152m372
10146D230k817L437M7J34L48L428q68M95r43m254m2M747k077k311n31L483M116
10129A0622o242n408l09J544N153J335k643l671J222J0225N438m899L418j679
10115A4106l792nj783N030j144k032j993J286q44r997J954P376Q438j743l552
$$ y = [-2845, 140, 872, -4151, -9476, -7129, 384, 720, -573, 11902, 16747, 13311, 3146, -4811, 93, 1960, 7613, 14489, 20069, 14586, 5218, 5821, 7121, 2595, 3955, 7627, 5308, 3810, 3855, 1678, 4643, 7983, 13722, 17384, 8169, -536, -3974, 6210, 14221, 10859, 2425, -4678, 70, 6384, 7227, 8886, 13693, 14175, 14698, 8314, 9305, 14463, 8480, 4731, 5954, 9131, 8413, 8107, 2848, 2218, -4041, -7543, -758, 88, 1364, -4406, -13611, -7710, -955, 2974, -2512, -4966, -2030, 6888, 6450, 8602, 4230, 1413, 4850, 4897, 5031, 5379, 8807, 7939, 8434, 7491, 3237, 3195, 7942, 5865, 3554, 3023, 6506, 10622, 4380, -1028, -1337, 207, 5360, 6695, 4052, 381, 1603, 11828, 17266, 12367, 15785, 14106, 10314, 10309, 8526, 13556, 12412, 10380, 8387, 9673, 8829, -1168, 786, 8162, 16600, 14857, 11305]
10100A1305o7j020j405l307o956j127J983P167K627m395l117L236j783k708k822
10085b389N43M554J900p837j087M870l440M88l779n460m955O7N014J917M444M190
10069i60L114k561n234K766M099L212N791J452m257j712J773L242l878J985L776
10054A2608P086K526R965J1488M1J163q318j5763q866q409j53n560l201J091N973
10039A671N109N06L369M133k726l86p724k485K25N214j0560o409L205j347l387
10024a1592N907J779L2O574l15R85L327m097o104k946L526L436m187P2n078p683
10008a6364p10J961R738P56n252R245O541j1k197k711l124J879O05n698r97L695
9992b644K209J782J562M855k55k176J253J355l341j602L134K236m618j459K044
$$ y = [11305, 11238, 10218, 8813, 5506, -1450, -2577, -594, 6573, 9200, 4805, 1688, 4924, 3141, 433, -2389, -1846, 2708, 4608, -3229, -4316, 554, -2886, -2398, -6177, -11637, -16592, -16525, -11511, -9594, -5150, -960, 2154, -407, -5641, -2875, 1224, 4436, 10227, 11679, 7422, 5710, 7483, 10725, 6847, 8832, 12608, 19694, 22220, 32185, 43673, 43714, 44877, 36559, 20796, 11930, 3521, 3368, -2192, -5393, -4302, 1671, 6780, 7286, 10655, 14788, 12062, 11676, 3952, 1467, 1692, 6906, -3654, -10063, -6858, -8205, -11592, -5685, -3906, -3874, 2700, 2385, 3370, 6697, 2600, -3504, -6450, -2924, 512, -3675, -3603, -8681, -16364, -17074, -15113, -5375, -4619, -9871, -626, 5915, 5904, 3707, 996, -2128, -249, 356, -5342, -6339, -2644, -435, 1347, 2909, 7764, 7509, 5333, 6586, 7941, 4600, 2998, 6132, 8368, 3750, 2291, 4335]
9977D335q37q595j403J649j174P813k682Q05j554n196j422K231M26N92l89O048
9961F47j361l816O762K936n35N858J28j758L02j844k028o116j636k446o509J1423
9945GL637m117J2795k019J261l768p448m271k686m628k555M529L565N385j900
9930b213n8M80l679J807R088L260K635j837p887P531J1460K551K231O396K698
9915C4463J3379L513R76J223m447j1440o491p793o966l484J947j376n990n397
9901B117P05J689L071P69l338R028k14R8j218p576j505o01J310L455Q154k531
9885A3413q521J642m133l791M864j153p358Q89O93K739Q187L48k104l980N011
9870F746K044L432M016l057p751L7m996J604L478J06n33K948K892r687j847j567
$$ y = [4335, 3498, -5097, -6500, -4851, -6025, 1788, -894, -89, -1643, -6839, -8261, -6030, -5604, -5012, -5401, 647, -714, -4530, 2232, 5168, 4633, 10491, 10619, 8861, 9163, 7319, 5291, -825, -2461, -4907, -11416, 7, 3644, -473, 12322, 10303, 11564, 7796, 348, -3923, -6609, -11237, -13792, -9263, -5698, -313, -2213, -2271, -1791, -5470, -3663, 5425, 8685, 11320, 9483, 1596, 9127, 20587, 23138, 25369, 31765, 34463, 47842, 51355, 52331, 53554, 49107, 37667, 31176, 23383, 16417, 12933, 14880, 13504, 7514, 2117, 2822, 4511, 7582, 8351, 5013, 14041, 13827, 13925, 12707, 5131, 3626, 3025, 4335, 7790, 15944, 13413, 4892, 6534, 2401, -1390, 3474, 2321, -5037, -4148, -3455, -716, 7471, 7819, 5715, 1735, 6746, 8790, 12222, 16238, 13181, 5430, 5467, 471, 2075, 5553, 5659, 5126, 8074, 10966, 1279, -568, -2135]
9854b135L980m743j707M112n43O031j605K439K745p008n850k184J370M720L07
9839g1J222J458M628K000m780j796k930l500k440J701O35p07N962l355j891K584
9823a280N675Q646k341p541P59J579J426l961n287O461l245M137O439k643l136
9808E688m027l960J356J755j951q984P867L550k1n526k141N568k837k5P610P836
9792A1758r042o568L517K015j876j727J577k468k338Q43P192M968p635q597K45
9777h136M346j897j411P307L412m332j689J354N152K387N143J2393o07j0669q151
9762D602m155k114O074r33J439L274m284k265j94L330k554p079j0312O055K879
9747f237m854k790Q063J514m614J783L385L472O408N827K93K79P216Q813J323
$$ y = [-2135, 1845, -2898, -4605, -493, -1036, 4995, 3390, 5829, 8574, 1566, -4284, -6468, -5098, -378, -71, 1151, 2609, 7237, 9237, 4457, 2661, -269, -3769, -6209, -4508, -3873, -4580, 1382, -1973, -3864, -1280, 4395, 13041, 10700, 3159, 3918, 5497, 6923, 2962, -2325, 4136, 891, 5028, 11467, 8824, 5688, 1661, -2299, -943, 812, -1139, -10123, -2256, 1294, 1273, -4253, -6394, -826, -3663, -3688, 3922, 11758, 2716, -3852, -335, 1680, -196, -1923, -346, -2814, -5152, -4309, 2883, 7851, 216, -8381, -8136, -3790, -5687, -7098, 209, 3621, -711, -2400, -1046, 4106, 6493, 11636, 24029, 23422, 12753, 4602, 447, -1667, 4407, 3474, 4913, 8187, 3903, 1638, 1444, 4774, 2220, -4859, -15171, -9116, -6237, -11091, -13881, -5818, -4304, -8918, -7135, -3750, -278, 6130, 11957, 12250, 12529, 19745, 28558, 29881]
9732B9881o441n542m956p663m188J92O52J515l704R93K510n474n69j04o293K314
9716f877K328n4o481M708L288m104L178K173q756n225m590N397J0771R597M959
9701A0312P637j87p885r463k375k903N412L62Q395K597q421L299l175n659r11
9686b965m087K681L147j922m467q41K818J101J0558L284q175q626j376O850l972
9671e992n54P588J843r0M892Q127o07j2204j2314n882Q346N717O11O196L590J0408
9655A9675m47j0218l510q9k253k83K834j640p406o691m90N665m898n544R454O836
9639I95l11J508p292o311j271L364M421k312R319M998j2344j0364N982J827j137
9624h928j688O519o82q11R64m974O241P041m304j330K822P219p53n176L153J998
$$ y = [29881, 23440, 17898, 12942, 5279, 1091, 1283, 1935, 3450, -254, 739, 3249, -2225, -2794, -2898, -9191, -6877, -4549, -4603, -11084, -6376, -3088, -7192, -4014, -1841, -10597, -15822, -20412, -15015, -4244, 5353, 10312, 17949, 17762, 9877, 414, -1961, -4864, 548, 910, 9305, 11902, 3481, 6780, 3605, -2054, -2965, -7052, -4371, -1224, -3146, -7613, -8454, -5636, -4535, 6023, 9307, 1132, -7494, -8870, -2020, -5992, -6546, 1042, 2885, 2795, 7687, 15814, 15207, 3003, -9311, -15193, -6847, -1130, -519, 5677, 9267, 19675, 19228, 9010, 5500, 5411, 3158, 2875, 5709, 4069, -3337, -10028, -10518, -4853, -9751, -15295, -5841, 995, 684, 2192, -5100, -11411, -12682, -9318, -4897, -7209, 2110, 7108, -5236, -15600, -9618, -7791, -8928, -10616, -4097, -4779, -5590, -4626, -9600, -3359, 3682, -622, -1952, 870, 8089, 7336, 2160, 5313, 7311]
9608G311o10m379K086o31M161r3J083k908o538l748K58N512P059o581j610m779
9592d407M101j506r93j068O58K368r76Q90o15K893N464n90j734k74q3L670k538
9575E260N384l850j472k614j677N403j573n367q62p20n28j290M484N030k47J22
9559E483j746L696L246n113m798Q90J327k180J0031L568k38j685q18n109l818
9544B736K861K185k018m118M206m967k860L174N107j816p36j816n255J991m190
9529e516P27K042k340k746l49r98L270l43j679M619K271K834O203L316l391J588
9513I508q05l107l368m021j372J194J680M156N199L598J673K10o628q726p966
9498h775k437L652K248l638o314L329J3323O834L198r26j071l254M593O140r310
$$ y = [7311, 6701, 2322, 4408, 3777, 7938, 7845, 8928, 6020, -518, -4266, -4008, 1504, 8563, 1982, 372, -4407, -306, -1812, -2805, -3873, -3215, -847, -1823, -933, -1548, 1345, 6809, 6219, 4485, 4211, 4128, 7798, 5260, 10644, 6794, 5322, 2708, 1031, 6434, 4861, -506, -1368, -2088, -2616, -3906, 578, 5608, 5361, 5483, 3737, 7433, 10679, 5566, 768, 1658, 2985, 805, 10836, 14404, 14166, 12481, 11663, 6554, 2736, 5597, 7782, 5764, 1646, 5852, 885, -1975, 1199, 6306, 4490, 3754, 1938, -3317, -1326, -5516, -4789, -2747, -5087, -7833, -8182, -9180, -5910, -6253, -7932, -3313, -1042, 1792, 7995, 11311, 7920, 9508, 8703, 5596, 2228, -1793, -3165, -1971, -291, 3865, 9064, 12662, 14335, 14545, 7917, -809, -8775, -11212, -7560, -5312, -8950, -15264, -11935, 1388, 8222, 11420, 10494, 9423, 6169, 10762, 16902, 7592]
9483G592o018m018j54Q460M763m882m831l352N332P692m450k081K090O172k392
9468I923p890K527k35J867K602R36k46n472K048L759o421m724L968N486k549l402
9452B177n686K233j359K623m090J480j034L31K326L34J549K64L91j900M87P73
9436H99k127Q23L396N453k96l598m548J956J546k844j267M27l33l037n802M759
9420d593K96o208l043n23M66K867J588J367P921Q202o488K82J850m266n867J52
9404e997N018P148p36P31J396j902j781j792J386N93q022k752k113o190L096M946
9388f971M516j059N32l319M063Q82j775k357J995j950p00M145k735j573L928N164
9372B786P075n531k947j992o431j287O367L951N120j453k318j927o782r33J91
$$ y = [7592, 1574, -2444, -2598, 5862, 10625, 5743, 912, -2440, 2892, 10584, 6134, 4053, 6143, 12315, 9923, 2033, 4560, 4325, 6192, 8794, 9730, 9484, 4012, 6060, 9819, 3398, -1326, 2642, 8128, 5579, 2177, -3509, -1276, -2635, -12, -4102, -2622, -3656, -3325, -999, -665, 884, 1148, 1539, -361, 126, 899, -1228, -405, 2991, 8444, 8148, 4550, 2, 1958, 3504, 660, -607, -180, -513, -3550, -9352, -4593, -4297, -10505, -13548, -14071, -13605, -10738, -9150, -7783, 138, 8340, 1852, 2134, 3984, -282, -6149, -5997, -979, 6169, 5433, 6164, 7560, 5658, 3877, 2085, 3471, 4064, -3958, -6710, -8823, -15013, -11917, -6971, -2455, -3514, -2982, -6301, -2238, -1356, -3131, -5488, -3493, -5443, -6143, -1998, -4733, -6306, -2378, 2786, 9861, 4330, 1383, -609, -7040, -8327, -1960, 1991, 7111, 5658, 3340, 1413, -5369, -6302, -6111]
9357f111N45J3067j439l732J461j058J676j895n517l451K646k101r326M027J6413
9342E205P590k055J966n188k457N937J107J082K990k762m752k996J803k061J000
9327F409l577J338P702m86j094m718j1001k614O63L792M665P061l052j684M336
9312G740J194m496m163m800j84K411J904K544J245M587M16q717k644N876K164
9297E077P918J839l538M962o945n785K459L03O521J893n255N172p04j127k221
9282A0569l123n08m548m735M184o90N620L589L441N624P06m716m622m325L541
9267A0007O78l835K499J668J196N302J318p717n501N312P059o04M97m49l410J806
9251A5826J095K295k893p38K013j803J612k976K251j422N103M577L472P398L912
$$ y = [-6111, -5566, 7501, 6062, 2330, 3791, 2733, 4409, 2514, -3003, -6454, -3808, -5909, -15235, -11208, 5205, 12795, 10740, 12706, 7518, 5061, 10998, 12105, 13187, 16177, 13415, 8663, 5667, 7470, 5409, 6409, 2832, 4170, 11872, 11386, 10292, 5574, -5427, -8041, -7378, -3586, 1079, 8140, 5088, 3404, 7740, 8934, 4438, 275, -4525, -4709, -2298, -394, 2150, 3395, 7982, 8398, -319, -2963, 2913, 5077, 12995, 14834, 11296, 16258, 9313, 3528, 5987, 6290, 12811, 14704, 9449, 14621, 13917, 12790, 10569, 7446, 6938, 2390, -2345, 1839, 1149, 6769, 10358, 13799, 19423, 20129, 15413, 10791, 6466, 10007, 10685, 6850, 9349, 11017, 12213, 17515, 18833, 11116, 5615, 10927, 17986, 17382, 17879, 17430, 14020, 15826, 16921, 19216, 16323, 15585, 17598, 15795, 17407, 14431, 16682, 15260, 20363, 24940, 28412, 35810, 39722]
9236C9722M062N226J1193P947J981Q937Q979J0293Q101J2048J6172J7822L8642
9223A91125N3842P1032R9679J59944K55826L97696N87798P69581Q04921N68174
9213C959618N9967p04087j032072p42788m28688k51666j65656j14744p9533n7379
9203D42972l9424k6320j2181j0548k3184k6359l7949l0420k6185j6510k0956j5861
9191A57075j7189j9339j1820q597q160n547m432j524q512l194m208m108q638r573
9177D2234m055O028Q75k263j0638p683k154l189o69n664O411Q476j60k698o15
9162B4236J553k757j842N471Q57n453j3404j877P122q750o587K469M999j625k795
9147A617L068M445o950j028J590o92K590M251j812k869J177j001k548j454m087
$$ y = [39722, 43784, 49010, 60203, 68150, 70131, 79068, 88047, 98340, 106441, 118489, 134661, 152483, 191125, 244967, 315999, 415678, 575622, 831448, 1229144, 1816942, 2586523, 3391444, 3959618, 4019585, 3315498, 2283426, 1540638, 1111950, 860284, 694628, 579884, 500351, 442972, 403548, 377228, 365047, 354499, 331315, 304956, 267007, 236587, 210402, 193892, 172936, 157075, 139886, 120547, 108727, 100130, 91970, 86423, 81991, 80467, 71955, 68761, 64553, 60445, 51807, 42234, 38179, 44207, 45082, 42819, 32181, 24498, 22344, 19155, 18486, 12822, 19233, 27709, 27549, 24851, 24236, 25789, 23032, 21190, 26661, 27518, 22065, 8661, 6784, 13906, 5156, -1431, 1038, 6037, 4412, 1617, 4685, 9130, 2180, 1152, 2742, 2050, 4640, 8891, 7079, 4210, 5387, 4386, 1838, 384, -3703]
9132c703k692K941O218O851o264m716L22O576k084o15J286M475K128l441p071
9117B11O52N820j469m772n98M025l272O36O057N760o95p246m655l647K21L285
9101C13J664k251n249l555J906J118J435O388L406K124q320q16K770k249l305
9086d621J369J9L975J502l176j417R4m119J784L040r16M245J40k076L254K775
9070E872K768R55R06L60j162J163R39M39J3K5M831K621j851j065q217m420m168
9053IL077K575j581J174n78l827l148l317k418m811M781L007O630K939n823j918
9037c229m441M324L056k564p071q30l75o033K675K853P468P036J238k611O423
9022G919j26q060O20M111p138O088M240k849q60N53L985n014k156O457k716n461
$$ y = [-3703, -6395, -3454, 2764, 9615, 3351, -1365, -1043, 5533, 3449, 2834, 4120, 8595, 10723, 7282, 211, 863, 6683, 5214, 442, -156, 3869, 597, 1233, 7290, 13050, 12355, 5109, 454, -3193, -2972, 313, 1977, -274, -5523, -9078, -7172, -6054, -4619, 1769, 5175, 7299, -1021, -1837, 933, -1316, -4621, -3252, -3233, 742, 2244, -932, -2349, -2255, -6374, -4590, -1550, -2466, 1779, 1919, -157, 3097, 5872, 8640, 9595, 10501, 10861, 9699, 10862, 11801, 12240, 12253, 12278, 17109, 19730, 17879, 16814, 8597, 4177, 9, 3086, 5661, 4080, 5254, 4676, 849, -2299, -5616, -8034, -12845, -8064, -5057, 1573, 4512, -1311, -3229, -7670, -3346, -290, -2854, -9925, -10755, -11130, -17163, -14488, -11635, -4167, 2869, 4107, 1496, 7919, 7793, -267, 353, 4464, -2674, 3414, 7654, 4805, 3945, 4498, 8483, 3469, 1313, 7770, 5054, -407]
9006d07L218j237m477n21L470J618m946J985K644J584k47O12m843l259j370P23
8990e453O780N859l592o271l46J107l550l733O122N102R554q65j1149n911q224
8975a4570J108J299M465N591r26L942J771l587KJ052j371l664K556J769L242k552
8959A27M956K199n24k605Q50j192k073l198R248J687k31r191j81J010K938k64
8943C556p506J74R365k2L417n363o761L416k79K373M295K117l073m939k172q309
8927i711K191N764l195K734L372J089J932m597j219J000k372N693r72p415L971
8912a735L6p1N910k647l096O68O785J284M159J452L5j165j0394Q27R72M827j347
8895F500k570l292n55p56k551J544M747K408k550J042l21K259j262k724M430K423
$$ y = [-407, 2811, 1574, -2903, -3424, 46, 1664, -3282, -1297, 1347, 2931, 2684, 3296, -1547, -4806, -6176, -5453, 1327, 7186, 3594, -2677, -3023, -1916, -5466, -9199, -3077, 2025, 11579, 10714, -435, -6346, -14570, -13462, -12163, -7698, -2107, -3033, 909, 2680, -907, -905, 147, -1224, -4888, -2332, -563, 2679, 127, 5083, 7282, 6758, 4153, 5003, 3811, 1738, -1460, 7788, 9475, 9244, 53, -128, 882, 3820, 3556, -3950, -3776, 5589, 5567, 8984, 3621, -3140, 276, -3, 2370, 6665, 8782, 5709, 770, -1402, -9711, -7520, -1756, -4951, -2217, 1155, 2244, 4176, -421, -1640, -640, -3012, 2681, 1709, -5706, -1735, -1699, -1770, 4140, 1493, -1603, -935, 5850, 7134, 11293, 12745, 12780, 11615, 1221, 2048, 3020, 7847, 6500, 3930, 638, 83, -673, -3224, -1680, 3067, 5475, 2925, 3967, 3646, 5905, 4643, 1919, 6349, 8772]
8879H772k598J059l143n978n303p194m222K320K461N438K274J243l334k658k20
8864a1083K618P744k646n816k977Q261P593J532k836j366J362k034l02R47P570
8849H567m921n475l112k040l312m890M103J4090K543j339n095q330o562n20N409
8834a0884L694N7K931j151K30R41M424M292j632J995o52M080K212m009j1481K394
8818b559l78O236j354o197l927j975J645j272q14P961K835o68L660j033p862q780
8802a4482K149j272P59P276O451J08o054n451k75O263O329J697m721k82J980L100
8786C575M268q954n102k00O654N471l52m999j461m16R031N800j489p924R79L629
8770H510P752p320r015k196L315L867J603m077k881m493L083O998J895l359p379
$$ y = [8772, 6174, 7233, 4090, -1888, -7191, -14385, -18607, -16287, -13826, -8388, -6114, -4871, -8205, -10863, -11083, -8465, -721, -3367, -9183, -12160, -3899, 3694, 5226, 2390, 1024, 2386, 352, 50, 997, 8567, 3646, -1829, -4941, -6981, -10293, -15183, -11080, 3010, 5553, 4214, -881, -9211, -15773, -16293, -10884, -7190, -7133, -4202, -5353, -5123, -4182, 242, 4534, 2902, 4897, 4245, 8325, 10537, 6528, -4953, -2559, -2937, 3299, 1945, -4252, -8179, -10154, -8509, -9781, -10595, -2634, 201, -467, 3193, 2160, -5702, -14482, -12333, -13605, -12846, -5570, 881, 989, -5065, -10516, -10791, -4528, 1801, 3498, -1223, -1505, 475, 3575, 7843, -1111, -6213, -6413, 241, 5712, 5360, 361, -1100, -1516, 7515, 13315, 11826, 3902, 4881, 8510, 16262, 8942, -73, -2269, 1046, 4913, 6516, 2439, -442, -4935, -1852, 5146, 7041, 3682, -3697]
8755c697m549k163l089J892R698p61k399L67O115J166L743m031k447P17l595J216
8739a817J352L957N971j218k09M485l253m145j505N903L484p270m913q457p083
8724a4718N914Q461M843j127n051K36m106J433M629L353J810o354o213j261L51
8709g800L769M420o163K331M183J1648J2764p066r268n584n758J079O310K877
8695G742O80j939j360k179m440L056L487L808l666J070M978J1783K285r304o914
8680I087R59l573j487p205j361R880R81p538r50K226j072L368K00m23j1493Q725
8664C24J0527n837p267L242M006j451J080n5J491l139j057K409j898k442M878
8649D811n07l77K321j065L266l566n960N529P387M391p39o286p346L35P357N012
$$ y = [-3697, -8246, -10409, -13498, -11606, -1908, -2669, -5068, -4701, 1414, 2580, 6323, 2292, -155, 562, -3033, -1817, -465, 3492, 9463, 8245, 8036, 12521, 9268, 5123, 3618, 9521, 13005, 5735, 822, -7635, -14718, -8804, -343, 4500, 3373, -1678, -1442, -5548, -4115, 514, 3867, 5677, -677, -6890, -8151, -7800, -4031, 389, -5774, -3443, 740, 12388, 25152, 18086, 8818, 3234, -2524, -1445, 4865, 7742, 8422, 6483, 5123, 2944, -1496, 1560, 5047, 8855, 5189, 6259, 11237, 23020, 25305, 16001, 9087, 10046, 6473, 4986, -2219, -3580, 6300, 7281, -257, -1207, 1019, -53, 3315, 3515, 3092, -8401, 324, 10851, 5014, -2253, 989, 4995, 3544, 4624, 4569, 6060, 2921, 1864, 4273, 2375, -67, 4811, 4304, 3927, 6248, 5183, 8449, 4883, -1077, 4452, 11839, 16230, 15491, 9205, 1859, 2194, 9551, 14563]
8633A4563p23o010n459M71J739J942K8k359k495P88N137O72j343N436j0012p123
8617d748Q38O261k043J286J610n221J534J055j502k438j352o03K737L787n200
8602c999l794O774j620m889R303O475k499j592n550k38q027j034m555M091O68
8587a0486M95L743k48L847P304K100o082j988k609M447M467N29q4K018M478l833
8571H098j328k066o375k938J04L343p25O034J793n945J9P773l648m804n72n228
8555f465j352L669J1208K48k791l546j186j206K456J096k261K323P902M066q63
8540A3298L104P16k910j869k033o910p263J112K227K847n1j213M281K663K455
8525A0454j334p636k974N11k076L018K619K268n751l017n680r74K403j911M403
$$ y = [14563, 13840, 7830, 2371, 2842, 4581, 6523, 6551, 4192, 1697, 2485, 7622, 8294, 6951, 12387, 2375, -4748, -3910, 2351, 308, 1594, 3204, -2017, -483, 572, -930, -3368, -4720, -5323, -2586, 1201, -3999, -7793, -1019, -2639, -7528, 1775, 8250, 5751, 4159, -1391, -1629, -9656, -10690, -15245, -11154, -10486, -9991, -6248, -6496, -2649, 4655, 6755, 673, -1315, -3924, 523, 4990, 5519, 5435, 7453, 11931, 8098, 6770, 4704, -1671, -4609, -4505, -1162, -1887, 4147, 5940, -5, 14, 7787, 4139, -665, -1237, -6465, -7817, -4148, 7060, 7308, 4517, 971, -215, -1421, 1035, 2131, -130, 2193, 10095, 14161, 13298, 16402, 17118, 14208, 12339, 10306, 3396, -3867, -2755, -528, 2319, 2268, 1055, 5336, 7999, 10454, 9120, 1484, -1490, -979, -3055, -37, 2582, 4850, -901, -3918, -9598, -10572, -8169, -10080, -5677]
8510e677j238l713O650L212L072o15k839j713o094O598Q197L914O49p682J79M177
8494G077o05n196k323l040l235M06L918K094n28K638n791j862j477k013K21N450
8478d266J0977J293n44M731j387r44K097p827l427j884L627j060l561j284l582
8463g041j251M498J130n71K496j274l362J909N7N030J872m944o204J406j541O53
8447g137j816M847L425j851L37k572l889O969n445J112N610L932P415k425j581
8432F931J28P38k805J300j424J053o040q81K822o279l920J2889J93k525m674k172
8416d666j834m425N182Q996j237j913M000l68m890J467K159j2307R933J0226m918
8401E405l949o598L496Q533N55l247n517M821K808j157r272K298l16K08K023j879
$$ y = [-5677, -6915, -10628, -3978, -766, 2306, 1691, -1148, -2861, -8955, -2357, 5840, 9754, 10403, 2721, 2900, 7077, 6472, 1276, -1047, -4087, -7322, -6916, -2998, -904, -1432, 1206, -4585, -6447, -7924, -9937, -9716, -4266, 6711, 8004, 7460, 12191, 10804, 9860, 11957, 4130, 703, -1181, 2446, 1386, -2175, -3459, -7041, -8292, -3794, -2664, -3235, -739, -2013, -5375, -3466, -3409, 1621, 3493, -1451, -7655, -6249, -7790, -7137, -8953, -4106, -681, -2532, -2195, -4767, -8656, -1687, -7132, -6020, -410, 3522, 10937, 8512, 6931, 7059, 7797, 4992, 6292, 4868, 5921, -119, -1000, 1822, -4457, -8377, 4512, 4705, 2180, -2494, -4666, -6500, -10925, -5743, 3253, 2016, 103, 4103, 3735, -1155, 312, 2471, -9836, 97, 10323, 5405, 1456, -5142, -1646, 6887, 7442, 4195, -1322, 3499, 6307, 5150, -4122, -1824, -2140, -1932, 91, -1788]
8385a788o274M788M166q292l852J421K274M278K835r49O112N0q674J748O285J0293
8369A4421O336P332l211q334p850n143l610p429j216q000M952N578M636j549J457
8354a630N846n262n214N199J1o393J494L619N081J253n904q635m225k529K351
8339a4938O487J3393K538j869r17j914K16L0m753J503O131j110j5512L678J0045
8324C008O150m051l387J271L282K466L949k413m337o178J056J642n026p106m76
8309a0150P581M110J857k636j0442m556o81N758m65L298j941J97m847Q965P319
8294C367L810j32k124q98R14j733k850m865L569N426M088N267J462N230j980n250
8278A3301p430l167l491l740L419j10K750j394k405k526o343O820M138n101m196
$$ y = [-1788, -8062, -3274, 892, -7400, -11252, -9831, -7557, -3279, -444, -1393, 4719, 4769, -3905, -2157, 4128, 14421, 20757, 28089, 24878, 16544, 8694, 3551, -59, -7488, -8704, -16704, -11752, -6174, -1538, -3087, -1630, 4216, -1046, -6260, -1061, -1050, -7443, -5949, -2330, 2751, 4004, -1900, -10535, -14760, -17289, -14938, -8451, 4942, 7480, 5611, 4694, 2780, 2996, 3026, -1727, -224, 5907, 4797, -10715, -7037, 3008, 9158, 5107, 1720, 2991, 6273, 8739, 12688, 10275, 5938, -240, 816, 2458, -2568, -9674, -10150, -2569, 1541, 3398, 762, -9680, -14236, -14917, -9159, -9624, -6326, -8267, -8070, -12917, -3952, 3367, 7177, 7045, 4921, 4023, 4937, 3204, 354, -4511, -942, 4484, 8572, 13839, 15301, 20531, 18551, 13301, 5871, 2704, -787, -4527, -1108, -1218, 1532, 138, -2267, -4793, -11136, -4316, -178, -5279, -9475]
8263i475m437p59m733l958k356N36M827N576Q815K465k954L542K56l138J950k768
8247f611M74j276l64M581R98j307M244j536M795N727n9O427K883l567l873n562
8231E974r37n383l078M257J5j185m692m317m629kp14J078J589J712N955n84K951
8214a990L602J105K542M39K136j671k215o349l878p198L49N601J397m350M162
8199f318q35O92K063k364k676o66k137O473K954j971K594p5l999j137L695J122
8183b585j830J855N00n008L51J3356M932k741J590l897p696r15l205r44m08k95
8167f940O259J037K295M720p105m837l504N249M126m667q740N649Q489O084L747
8152A1862J88j635k363n132m346k297j321N212J0098K878p243o777j389m628L707
$$ y = [-9475, -13912, -14671, -19404, -23362, -25718, -25182, -20355, -14779, -5964, -3499, -6453, -2911, -2655, -5793, -3843, -6611, -6137, -7413, -7777, -3196, -2198, -3505, 739, -797, 3998, 9725, 9666, 16093, 18976, 15409, 11536, 5974, 5037, -346, -3424, 833, 848, -337, -5029, -9346, -13975, -13977, -14691, -13613, -12024, -10312, -4357, -4941, -1990, 1612, 2717, 5259, 5698, 7834, 6163, 3948, -2401, -6279, -13477, -13128, -7527, -6130, -10480, -6318, -7153, -6461, -4398, -6762, -9438, -10104, -12241, -5768, -2814, -4785, -2191, -2266, -6265, -7402, -3707, -2585, -4415, -2560, -2060, -7068, -6717, 6639, 11571, 8830, 10420, 6523, -1173, -2088, -5293, -6237, -6645, -6940, -681, 356, 2651, 7371, 266, -4571, -8075, -2826, 1300, -3367, -12107, -6458, 2031, 8115, 11862, 12050, 10415, 8052, 2920, -1426, -3723, -5044, 168, 10266, 13144, 5901, -876, -2265, -6893, -3186]
8137c186M865L996l211j883R503J091j32o233q241o158n468K666J2901O903J157
8122H570m01j800j329p664J098O465k30q502m533k931n118J157J0682k280L724
8107c092L67j628L331j824M080n79n225n117m693R662L098j39J805K329L241j058
8091D558O943n479n735o326o296J816J153J442L104k569n575L932M519K08p61
8076e066J853K92q05K274j473j407O349q94n62J701o397J544j456n856k177M60
8060a1620O69R424J2128J639o662n325K192M710J173j933l345L930k094k802j472
8045F12m309m258P896P873J99K380l978o116m145m404o55J1054M826o131k995
8030b151Q55k952k977J789j872k271P54L140O301K409k406j162K860p33m119j15
$$ y = [-3186, 1679, 5675, 2464, 581, 10084, 11175, 11043, 4810, -3431, -9589, -15057, -12391, 510, 7413, 8570, 8169, 6369, 5040, -2624, -1526, 4939, 4709, -3793, -8326, -11257, -16375, -15218, -4536, -6816, -3092, -2725, -4353, -1022, -2846, 1234, 655, -4570, -9687, -14380, -4718, -1620, -1759, 46, 2375, 5616, 4558, 11501, 6022, 287, -6039, -12335, -10519, -9366, -7924, -4820, -7389, -12964, -9032, -4513, -4305, -5066, -3213, -2921, -3726, -1452, -2925, -4332, 2017, 1123, 561, 2262, -4135, -2591, -4047, -9903, -12080, -11620, -10951, -1527, 10601, 12240, 5578, 253, 2445, 7155, 8328, 6395, 3050, 6980, 4886, 2084, 612, -3697, -7955, -59, 7814, 8013, 10393, 6415, 299, -3846, -8250, -8905, 2149, 6975, 844, -2151, -1296, -4248, -7225, -5436, -7308, -9579, -8825, -5685, 616, 3025, 619, -543, 2317, 1584, -2535, -2650]
8014b650R642j995j1747O05K626M6R294O647j868m426l440K643M493L310r906
7999C274j274O312k124%o68l75l355K442Q42o875n809K563N943M437k071k616
7983F46m29q89O723k139l911q90K712J568P729m13l059l628k655n44M140J997
7967F958l676J638K691k529k322M556p830k06j841P31K880o658m885L092K153
7952e248M249M234J804n80m972M523Q909k67J808n179Q03Q38j693J308l514q744
7936a721r33J381L865J796k679k22l720J309L898k580k44j026J020L045O777J000
7920A0966k950k627N322J869l979r490q227M329Q494K822r598l427J2444K914
7906H862n436j259n418l126L786K617j334l759R192K032j364j763L599n906k928
$$ y = [-2650, 6992, 4997, -6750, -6145, -3519, -3473, 5821, 12468, 10600, 6174, 2734, 5377, 9870, 13180, 3274, 2000, 8312, 6188, 6188, 5520, 5145, 1790, 4232, 5074, -1801, -7610, -5047, 896, 5333, 3262, 646, 217, -672, 6051, 3912, 1, -889, 1823, 3391, 11120, 10707, 7648, 4020, 1365, 821, 4961, 6958, 3282, 4920, 7611, 5082, 2760, 7316, -514, -720, -2561, -1830, 1050, -5608, -10493, -7401, -5248, -999, 3235, 5039, 4459, -513, 4010, 12919, 12652, 14460, 9281, 10084, 10922, 9229, 10537, 7023, -1721, -2654, -1273, 2592, 4388, 1709, 1487, -2233, -924, 2974, 394, 150, -876, 144, 3189, 9966, 10966, 8016, 5389, 10711, 12580, 8601, -889, -9116, -4787, 3707, 6529, -3069, -6496, 5948, 8862, 3426, 2167, -3251, -6377, -2591, 26, -1308, -5067, 4125, 6157, 4793, 3030, 6629, 723, -2205]
7891b205m82j746k340p398j073J0253J1109j661q825J927j551m141k956m226J230
7876a4085L998J032L915K083N594q125n472J217j62k847N892M635P910N116m462
7861F239q650J347M081K042J88l621q390k67N628L856o56r85j403J727J800J499
7845D435J071l720p382k126M728o87m21o050l658P319L696N995P388n827o207
7830a446l00M31o16m123o026L642J871J753o034k673K848j949O2P993O802n43
7814A692L465O926J685o045m418p97M09l274j219j463r450k553M924K013M348
7799c757P036J484m502p241m084J560N69o5J259k663n075L059M287K826m478Q634
7783a151O255n40R66J044p016j3547r08N298N084N022k764p212j2331l030Q303
$$ y = [-2205, -2687, -4433, -6773, -14171, -15244, -4991, 6118, 4457, -4368, -2441, -3992, -8133, -11089, -15315, -14085, -10087, -9055, -5140, -3057, 2537, -5588, -11060, -9843, -10005, -12852, -6960, -2325, 5585, 10701, 6239, -2411, -1064, 3017, 5059, 5247, 1626, -6764, -7031, -1403, 2453, 1797, 812, -591, 1136, 2936, 4435, 5506, 1786, -5596, -7722, -2994, -3681, -4102, -10152, -13810, -6491, -2795, 3200, 10588, 4761, -1446, -1746, -1315, -1931, -6054, -12080, -8438, -6567, -4814, -10848, -13521, -10673, -12622, -12560, -4567, 2235, 1692, 5157, 12083, 13768, 7723, 3305, 2508, 2917, -357, -1576, -3039, -12489, -15042, -10118, -8105, -3757, 3279, 4763, 261, -6980, -11064, -9504, -8935, -9000, -7741, -10404, -15479, -12420, -8133, -5307, -9785, -1151, 5104, 4564, 5530, 6574, -442, -13989, -14897, -9599, -4515, 507, -2257, -9469, -21800, -24830, -16527]
7768a6527L800k305K890O131L936O225n532q650K451J947j318n062J657L572J664
7753e121R8J089K84L762j670j659k315n347j173Q772L611n382m602l43k672P871
7737d797L576K369n970l451k321l005J490O372J238K625P104J820m2l438L259
7722F829K61m854m496m190L44J163q83N547k802k260N272p9k42j977o196n451
7706a4014k486k503n066K62O263O112J904J039q04K466p93l333p49N471k121O390
7690a962J1811N444o996q058o376q28N420J253J949l23n573n740k345l280K358
7675a3246K197m296j326k725J952q00Q169R216R077j25N24k33m17j249k001k001
7659B716L604N00p072l654m32l487K652N001M545j721n171M894n388n705n111
$$ y = [-16527, -12727, -15032, -12142, -6011, -2075, 4150, -1382, -10032, -7581, -5634, -6952, -12014, -10357, -6785, -5121, -5023, -3934, -3650, 112, -1558, -3217, -5532, -10879, -12052, -3280, 331, -5051, -9653, -9996, -12668, -4797, -1221, 1148, -4822, -8273, -10594, -13599, -12109, -5737, -4499, -1874, 5230, 7050, 7008, 3570, 6829, 7090, 2236, -2260, -6450, -6106, -4943, -5826, -279, -3081, -5341, -69, -148, -390, -2367, -8563, -14014, -16500, -19003, -24069, -23807, -17544, -11432, -9528, -8489, -9293, -6827, -7620, -10953, -11702, -6231, -8352, -1962, 9849, 15293, 8297, 239, -6137, -6965, -1545, -292, 1657, 1334, -4239, -9979, -12324, -15604, -13246, -11049, -15345, -16671, -19396, -17444, -18244, -10075, -859, 8218, 8093, 8617, 8384, 7967, 6718, 4717, 2716, 6320, 6820, -252, -3906, -4338, -7825, -5173, -172, 4373, 2652, -2519, 2375, -3013, -8718, -13829]
7644a3829j101N639M134j367l937k830J547O515p71l230K569N105O772m093r025
7629g902q69m636j854m377K783Q525Q724O165j899o891k184m058q45M621O879
7614B182J878r53L653m084j2550k506J1017Q475m444k927k945k477p56Q431K653
7599D647o115J590k943p30j051m113O966M79k0J081k696k497M592j312l379q81
7583f382O941N715l658j90p021o005J979N867L133o38L926n591n650j457n5M179
7567d907N380K495O278p788k387M394N058q89j0273J9J359L572j669l484N781
7552B939P919m621j191o12r21M244n423m929j747P355M013j0665n652K29l166
7537a2228J951O979R448J301l7n679M061J404j193J455n226k036P27k127n357
$$ y = [-13829, -14930, -9291, -5157, -6524, -10461, -13291, -11744, -5229, -6000, -9230, -6661, -1556, 5216, 1123, -7902, -8771, -13407, -15261, -19638, -16855, -8330, 394, 6559, 4660, -2231, -4415, -8473, -9318, -4697, 2182, 4060, 3107, 6760, 2676, -9874, -12380, -1363, 7112, 2668, -259, -3204, -5681, -6437, 1994, 4647, -1468, 122, -2821, -3551, -4602, -8715, -1749, -1270, -1290, -209, -2905, -5402, -810, -2122, -5501, -6382, 559, 6274, 2616, 2426, -4595, -10600, -8621, -2754, 379, -259, 3667, -1924, -7574, -9031, -9086, -4907, 473, 2968, 9246, 1458, -929, 3465, 8523, 7634, -2639, -2620, -1261, 2311, 642, -2842, 2939, 10858, 6237, 5046, 4434, 3513, 7757, 2334, -2595, -4342, 3013, 7026, -3639, -9291, -9062, -12228, -10277, -3298, 6150, 7451, 7414, 1735, 5796, 7200, 6007, 7462, 2236, 200, 927, -1200, -6557]
7522f557O910J473p73j928l607n444N208K135K439m007j266L525K076j751j915
7507c482j780k671j37j027p03M73r56R392L035l622L431n561K641O688l255J894
7491D360M299k299m334l878p585r89R101Q824K570p11q302P05M782m01n315j033
7475b06l13J285J123m595n33Q93J931R399O147r599j2549k842Q745o00O24q18
7459a908m191k349m025k620J023k399O784N895M356M1k520P00j538n02J154N495
7443C396M160k792j949M129p239k738J428j164l361L64J633r15J203K863m46k609
7427d037L09N539o641j814J293K205J553n262L164J144L470j032n634M003J1147
7412I407J411k47L093L391l171J337K544o697n380p426J697N745O940qJ682l823
$$ y = [-6557, 353, 1826, 1053, -875, -4482, -9926, -4718, -2583, -144, -4151, -5417, -1892, 184, -1567, -3482, -5262, -7933, -8070, -9097, -9800, -9327, -10283, -891, 2144, -1478, 1953, -3608, -967, 5721, 2466, 4360, 8659, 6360, 2026, -1852, -9437, -10426, -1325, 7499, 10069, 9358, 1056, 1761, 6543, 6142, 827, -206, -519, 766, 1889, -2706, -3239, -2346, -415, 8984, 15131, 5532, -7017, -9859, -1114, -1714, -1090, -1908, -6099, -8448, -12473, -15093, -14070, -16469, -9685, -3790, 566, 607, -1913, -1213, -2751, -3253, -2099, 3396, 7556, 4764, 2815, 6944, -295, -3033, -1605, -2769, -6130, -5766, -4133, -5048, -3845, -982, -1428, -4037, -3728, 1811, -4830, -6644, -5351, -3146, -1593, -6855, -3691, -2547, 923, -109, -5743, -1740, 9407, 10818, 10571, 13664, 17055, 13884, 15221, 17765, 11068, 5688, -1738, -41, 5704, 12644, 12636, 14318, 10495]
7396A0495p212N151L724o005j182q821o193M820M813l536O026L497k687k475p837
7381g422O731j802r60K983j549M351J956m25m354m639n663J304M917N310j193
7366d55l848K551l814K093L518l211m468L432P110k583q479k080M101N699M136
7351C702J103p200M25L532K628l037o155l213K349K190M718o47o674K895k998
7336f382m115l87K808o062j042N164k57N723J238L581L815k768p522J564j817
7321f459K235K168o27N412R704L466o43m126q052n200J445K2k500n851p18Q80
7305h844J357J63O47L668L255R147K690n39n364o212M136K3r44J259o418j110
7289c086O57o92M226k889j5374J19k435k517O904N755N59p872K123N918p313R509
$$ y = [10495, 3283, 8434, 12158, 6153, 4971, -3850, -10043, -5223, -410, -3946, 2080, 5577, 2890, 415, -7422, -691, -2493, -3453, -470, -2019, 2332, 4288, 3863, -491, -5130, -10793, -9489, -4572, 738, -455, -4303, -1752, -5566, -3473, 45, -3166, -7634, -4202, 2908, 325, -8154, -10234, -6133, -434, 3702, 4805, -2395, -1970, 1562, 4190, 1153, -5002, -8215, -5866, -3676, 1042, 395, -6279, -3384, -6382, -10497, -10884, -8076, -14138, -15180, -10016, -10273, -4550, -3312, 269, 4084, 1316, -6206, -4642, -6459, -4224, -2056, -2683, 2729, 12433, 15899, 15256, 11130, 3078, -2122, -677, -655, -3155, -9006, -9724, -8844, -7487, -7324, -6677, -3009, 246, 9393, 12083, 11544, 6180, -32, 4104, 4127, 3183, 4442, -1976, -3086, -2429, -3121, 1105, -1784, -17158, -17039, -19474, -21991, -15087, -9332, -8773, -16645, -14522, -8604, -15917, -6408]
7273f408P966m06j968j583m061m373M28k161M1N376l565p957R294O050l55K621
7257a061K248q149n150L270kk456L552O45N23R75N751M776l961M012J239L348
7241I560j514o77n938M769N712J309L70m431j08o745j341K799p729K30j519O40
7225d613j10m997l405L831n001q7O620R32k691R13J807o0O2L682r04L919O455
7208F353k746J298m180l416j37R5k579N604K971j766K156K450k230o786L44J813
7192g56O724l802m845j96l608k425l610n446j228N519P493O6k52k652l844M235
7176h627Q249M566o053j0257j215M865n33k436M192M585J844k792q60L70j569
7161e671j93l18P722J276m10j758K889J23n336k536j175k1O696L420k406J081
$$ y = [-6408, 1558, 1152, -816, -2399, -6460, -10833, -10405, -12566, -12525, -7149, -10714, -18671, -9377, -3327, -3682, -1061, 1187, -6962, -12112, -8842, -8844, -11300, -7748, -7103, -6580, -5605, 146, 4922, 961, 4973, 6212, 9560, 8046, 7369, 1431, 6200, 11912, 13221, 13591, 9160, 9052, 2307, 966, 3765, -3964, -3734, -5253, -4613, -4723, -9720, -13125, -9294, -14295, -14382, -7762, -6830, -9521, -8608, -6801, -6861, -6799, -3117, -4021, -102, 6353, 3607, 4905, 725, -2691, -2828, -2733, -5312, 292, 3263, 1497, 3653, 6103, 3873, -2913, -2569, -756, 5968, 2166, -2679, -2875, -6483, -8908, -12518, -17964, -19192, -13673, -6180, -6114, -6366, -9018, -12862, -8627, -378, 4188, -1865, -12122, -13337, -8472, -9005, -11441, -7249, -2664, -820, -3612, -4472, -4102, -5671, -5864, -6182, 1540, 2816, 2406, 648, 3537, 3660, -1676, -4212, -5387, -5408, 1288, 4708, 2302, 3383]
7145C383l422J557k376l133O425J225l531k232P8M185L727J744n109j749J432
7130B204n381J939J148j298l80n941p52O353n57k438K332P33J785N258m850l843
7114c688Q097J376k914p0L924K125k06j0581q806j007l969l343N977k720Q997
7099f808P646K496m888j620L007k409J222N122j449n847o912p22O64K553K14j57
7083g888J559J513o77n899L366N467k839j874n576m02k226Q083K081m652N09N111
7067d344J134K301m68j347O91L082M072L237j138O330J947n329q326k585L629
7052B886n03r58k092l598K360O253j55j847j102k655l399L32M34j363O784K409
7036C786j607k817j60M013Q903P19r911m748J055K161J293M679Q55j47J329o970
$$ y = [3383, -39, 1518, -858, -3991, 2434, 3659, 128, -2104, -2026, 2159, 5886, 7630, 2521, 772, 2204, -3177, -1238, -90, -1388, -1768, -7709, -8461, -2108, -2665, -5103, -2771, -2038, -253, 5005, 155, -3688, 4409, 5785, 2871, 2801, 6725, 8850, 8644, -1937, -10743, -11750, -15719, -19062, -13085, -15805, -6808, 838, 3334, -1554, -3174, -167, -2576, -1354, 3768, 2319, -3528, -10440, -11162, -10498, -7945, -7731, -7888, -6329, -4816, -5493, -11392, -8026, -2559, -5398, -7272, -12848, -13250, -15476, -7393, -5312, -9964, -9455, -4344, -3210, -909, -1377, -2724, -2033, 1049, 5121, 8358, 7220, 13550, 15497, 10168, 1842, -743, 2886, 2383, 1425, -667, -4265, -1905, 4348, 4193, 2346, 1244, -1411, -4810, -4478, -4044, -5407, 1377, 3786, 2179, -638, -798, 3215, 12118, 12837, 2926, -1822, -767, 1394, 2687, 7366, 8221, 8074, 9403, 2433]
7020B433n98J821K219K281l220p33o418n271O263K141q322n73O812N951l689o519
7004e422m669P345P198R77M785j11m988k205o052l712K90P2M928M488k96L41j926
6987A043L979O63p857j232O079j0162n905M213K101K5N127O735j000j058k703
6972D8j897o287r21n037m843O120N752K688j253o114k842n41O275Q039J875k928
6956a866m095P301K139o245J395J0329R409k930q957n946l669k870R269O162L028
6941A2454m030j391k728l379k295o29k40k732k599j126k887J727K390j66K916
6926d715J963M548K626l445m780J110K567n727q34O89L610q67K68o300M984O248
6910A945N106L81o816p02K574j142k348l52k924n239L359K740k110J163L899L480
$$ y = [2433, 1835, 3656, 5875, 8156, 4936, 4203, -2215, -7486, -1223, 918, -7404, -7977, -1165, 4786, 1097, -5422, -10091, -2746, 4452, 5429, 10214, 10103, 5115, 2910, -3142, -6854, -6564, -6492, -1564, 2924, 2628, 2969, 1043, 5022, 5685, -2172, -3404, 2675, -7487, -13392, -9179, -7078, -7053, -1926, 4809, 3809, 2751, 48, -1849, -8136, -9057, -14094, -18937, -12817, -7065, -4377, -5630, -11744, -14586, -15127, -8852, -813, 1062, -1866, -5961, 1340, 3479, -2766, -1371, 8958, 18367, 15437, 6480, 534, -3135, -6005, 3264, 9426, 12454, 8424, 7033, 4305, 926, -1369, -1998, -2238, -4970, -7569, -8695, -11582, -9855, -7465, -7631, -4715, -2752, 1796, 4422, 977, -3803, -2693, -126, -5853, -6687, -5998, -2388, -3255, -2987, -9287, -4303, 1945, 7051, 7432, 616, -86, 2488, 1346, -1002, -1354, -4278, -9517, -6158, -3418, -5528, -4365, -466, 3014]
6894C014L298N37m999k069m94l814K058L634l238l46N0J091M047m35k153L87o898
6877f330n284Q107J640L028n174m968P356Q590j943j0881L95N50k021J309r42
6862f568K988J2n93m143M719J566j11N9q10j000R02M98R876J162m968m154n833
6845f398L579M035j903l047l371k116L257P16K682M053j835l096M53K544K263
6830A816P36r50J529r505q102L836M260N448j425j163M58N243L240M242K462N776
6814A7901L669l264p05q595n014P27k067m0l573n116J456N603o735J162J01L234
6798a256J025n399r850p73P907O192O481P193J001l339K718j187K015l105J508
6783A1131j811m813N42O171M680p880j2306J62P30P95O28k635o490p742M447L801
$$ y = [3014, 6312, 6849, 1850, -219, -713, -4527, -2469, 1165, -2073, -2419, -2369, -1278, 2769, 2334, 181, 568, -6330, -11614, -3507, -1867, 1161, -4013, -8981, -1625, 6965, 5022, -5859, -5464, -4914, -6935, -5626, -6568, -3580, -3568, -4161, -8304, -3585, -2019, -2130, -2071, -2881, -3881, -2979, -2481, 7395, 8557, 3589, -565, -6398, -2819, 1216, -687, -3734, -7105, -9221, -5964, -5248, -2566, 1487, -348, -3444, -2991, -447, 1816, 2552, 1602, 3131, -6374, -14476, -10640, -6380, -932, -2357, -3520, -3062, 2181, 5421, 9663, 12125, 17901, 21570, 18306, 17601, 9006, 3992, 4719, 2652, 2612, -961, -6077, -4621, 982, -5753, -4591, -4490, -1256, -231, -5630, -15480, -16253, -8346, -2154, 4327, 11520, 12521, 9182, 11900, 10713, 12728, 9623, 11131, 9320, 4507, 5049, 11220, 15900, 8020, -4286, -4124, -3394, -2599, -1971, -4606, -11096, -18838, -14391, -10590]
6767a0590l51J478J210K586o69M160K35O006R37j231K034L164L997m19K222o133
6751H636l345k967J016p25k520l168J545k412l312k363M450K70o620J92L716O002
6735a605n263p239L722P081j763J604L895P74O54Q84J640m931O17O705r50q62
6719D963L431L891o566n457m520J248J824m02k125n62m886j929K567J730j327
6704h120J986J779K544L725J155o982m78N76K601j267K224l36p334n328j38M555
6688h838M677J211J29k592J812o03p005l876J327P266M054j0881P192Q760n937
6673c304p431j684K511J1111J2009L055o365q873q771K117K857K081l338m853
6659h878j930k428J529L485L413K762L854o636o046O367R591j92L374j098l39
$$ y = [-10590, -10941, -9463, -8253, -5667, -6336, -2176, -1941, 4065, 5002, 3771, 5805, 8969, 12966, 12547, 14769, 8636, 5291, 2324, 3340, 2615, 95, -3073, -1528, -3940, -7252, -9615, -5165, -4895, -11515, -11323, -7607, -1605, -6868, -14107, -10385, -3304, -5067, -3463, 432, 1206, 1860, 2744, 4384, -547, 70, 6775, 5825, 4963, 8394, 12285, 5719, 262, -4258, -3010, -1186, -1588, -3713, -4275, -9161, -11090, -8523, -6793, -8120, -6134, -4355, -1811, 1914, 3069, -3913, -4391, -3815, -1214, -2481, -257, -593, -7927, -13255, -13393, -8838, -4161, -2950, -2821, -5413, -3601, -4204, -11209, -15085, -13758, -6492, -2438, -13319, -6127, 2633, -3304, -10735, -12419, -9908, 1203, 13212, 16267, 9902, 1029, -7742, -5625, -2768, -687, -4025, -8878, -10808, -13236, -11707, -8222, -4809, -2047, 1807, -4829, -10875, -4508, 5083, 4891, 8265, 7167, 6828]
6644F828p335j329j294P43l218L57Q90P616n003j796j07j115O251K275k929J236
6628B070m899p208K579o68M79Q767M792q262o605j564L815K940K968N09K176n251
6612c362M383j118r84r62K436j398p994o939O77P745k811K917K573M950L989p511
6596c409l67O062k300p894J064j195o3J683N258O016l938p83j282J081M994P55
6580E682J666M65k393m953l246K601j707n60m486q243k968J159L265O295M601
6565b822O531n594q105J0557P740L018n462k807j409j070n556J511l696J309L693
6550b162j163M059L820K86k994k289r07p71K259m584l756m352L543O053K53o306
6534i011n55k146P09M496k514l005K282L638N904M10j000o249M042R15l031k747
$$ y = [6828, -507, -1836, -3130, -2387, -5605, -5248, -4358, 3258, -1745, -3541, -3648, -4763, 1488, 3763, 834, 2070, -2829, -10037, -7458, -8126, -7647, 1120, 5912, -2350, -8955, -10519, -6704, -3764, -796, -287, 1889, -3362, 1021, -97, -1081, -2043, 393, -1005, -8999, -15938, -15261, -7516, -10327, -7410, -4837, 113, 4102, -3409, -3776, 2286, -14, -7908, -6844, -8039, -8102, -6419, -1161, 4855, 917, 134, -1148, -67, 4927, 5682, 7348, 7813, 5420, 467, -2779, -178, -1885, -2445, -6931, -15174, -18142, -16983, -13718, -7423, -2822, 3709, -1885, -9990, 567, 8307, 11325, 5863, 3056, 1647, 577, -4979, -3468, -7164, -5855, -2162, -3325, 734, 4554, 4840, 1846, -443, -1350, -2121, 138, -4446, -8202, -12554, -9011, -2958, -2705, -9011, -9566, -11712, -11003, -6507, -9021, -12026, -9744, -6106, -202, 208, -792, -7041, -2999, -2084, -5115, -7862]
6518g862j181J024L01p18l180N202M306M3j399P93j346m25N071M47m561N35j475
6501d425j442P514j106j062M43k889j258J208k882j527M328P626L40m456k105
6486a693M596Q26k88J694M001p900m789P73m41J408j120J991M183R269j566p927
6470C017k8K258L544m151j909n013l84m020p48N644J571J777q363K057M741k452
6454b459q005M48K52L241P104O706M166k138k184p24J256m408j750m176j296r08
6438d875Q40K947k271M497N31m76L517K57l254P78j615j267O63J018l066m789
6422f565j545K170r195L556R601O397o49r591q1K657N7P38m900k028P99L166O047
6405F34J182l462o790L487J801n310r9M421m571K718J850l812k962l097M698J460
$$ y = [-7862, -9043, -8019, -7718, -8436, -11616, -6414, -2108, -2065, -3464, -2671, -4017, -4442, 629, 1076, -3485, -2950, -4425, -5867, 1647, 541, -521, -78, -2967, -4225, -3017, -5899, -7426, -3098, 4528, 4868, 412, -1693, 2903, 3729, 3441, 5135, 9136, 1236, -3553, -2780, -3221, -1813, -2933, -942, 3241, 12510, 10944, 3017, 2989, 5247, 8791, 4640, 2731, -2282, -2666, -6686, -7434, -1790, -219, 1558, -6805, -4748, -7, -2459, -10464, -10016, -9764, -6523, 581, 7287, 11453, 9315, 7131, 6407, 7663, 3255, 1505, -2671, -3967, -4875, -4035, -1088, -3359, 1138, 1669, 1193, 4710, 4967, 1713, 2491, 876, -391, 272, 1290, -1776, -6565, -8110, -5940, -15135, -11579, -1978, 4419, 3770, -5821, -5902, -3245, -3188, -2450, -7350, -9378, -8579, -5413, 634, 1816, -1646, -8436, -4949, -3148, -8458, -8557, -4136, -8707, -5989, -4139, -7951, -10913, -14010, -9312, -7852]
6389g852M976J464j09J59l427m215P01O079j73N685k731m971M54r4l495o221k547
6372a6317P022Q739k078k319n502K13l639J231L656p199o328j459M743O060Q48
6357a2329M564O730n656l775l376O80L858j485R18N35P720K319O67K358P91L595
6341H114k213K927l949p587n595k023J470M960Q542M527k36M640n377r453N27
6326g26N447l294l355L506P198J047J940K988l70m611p557j1363p438L270O166
6311g152J1476p480j0876j526J737Q215Q620l595n009J368j197L252K65j940j32
6296c974n835J175M419Q548M844M140k899j6417o732O254k013k190J792K666R144
6281B922L692J502K011j431m722l860m246l476O727Q813k99L10m23M370l077n593
$$ y = [-7852, -2876, -1412, -1521, -1362, -4789, -9004, -8303, -2224, -2397, 3288, 557, -4414, -3960, -4054, -7549, -13770, -16317, -9295, -556, -2634, -4953, -10455, -10242, -13881, -12650, -8994, -16193, -22521, -23980, -19237, -13177, -12329, -7765, -1035, -6691, -10466, -13842, -13162, -9304, -10789, -9871, -9336, -1616, 703, 1370, 3728, 4519, 8114, 5901, 8828, 4879, -2708, -8303, -10326, -8856, -3896, 4646, 9173, 8937, 13577, 8200, -1253, -726, 4721, 1427, -1928, 1578, 8776, 9823, 11763, 14751, 14381, 9770, 2213, -9150, -16588, -13318, -7152, 4324, -3156, -14032, -15558, -13821, -5606, 3014, -581, -5590, -4222, -5419, -2167, -1902, -3842, -3974, -9809, -8634, -4215, 4333, 9177, 13317, 10418, -5999, -12731, -6477, -8490, -10680, -8888, -6222, 2922, 6614, 8116, 10127, 8696, 3974, 114, -4132, -7608, -881, 7932, 7633, 7943, 7520, 11890, 8813, 3220]
6265C220O896K179p694k993n509q72L107L699l623k670J339l228k51r18O89N636
6249i93o329K948P953m151p280J156P283K672R63m595m894l762L632N582o4l333
6233c212n160K984L250K907M247K24r078p757J490O974k841M57N096M403l032
6218I52j769J753o23j335j1328R06l10k702k323M99O494M320m64K286R34Q462
6202E752K367r367l221L40M38n42k304l78L222J24N094l156o614r16Q99N395Q599
6185E732K884l856N901J549k516n946o958M51k91L00P422K918k375J475R27J547
6169I164k87n154o91l413N75P81o204J287M393J491q97j407L171L850N883m496
6153H046o189k742j458K173j620j581j771l47m167p460J765J0454L149k234J037
$$ y = [3220, 10116, 12295, 4601, 1608, -3901, -4773, -1666, 2033, -1590, -4260, -2921, -6149, -6400, -7318, -6629, -993, -7322, -4374, 3579, -572, -7852, -6696, 587, 3259, 4222, -373, -5267, -9029, -5397, 185, 121, -3212, -8372, -5388, -2138, 769, 5016, 5240, -3838, -11595, -10105, -3131, -5972, -5515, -419, 3984, 952, -817, 936, 313, -1022, -12350, -11444, -11754, -14456, -16779, -16280, -9786, -5466, -5930, -3644, -2710, 5752, 8119, -1248, -4469, -4129, -3691, -4233, -6537, -6915, -3693, -3569, 1525, -1631, -8245, -9161, -8262, -2867, 5732, 8616, 4760, 10661, 12210, 9694, 3748, -3210, -2759, -3050, -2750, 4672, 7590, 5215, 6690, 7617, 9164, 8877, 3723, 3032, -381, 194, 975, -5229, -3942, 451, 1942, 1045, -362, 2809, 6659, 12542, 8046, 1857, -885, -2343, -170, -1790, -3371, -5142, -5489, -9656, -17116, -15351, -4897, -1748, -3982, -2945]
6138b945M740k527o454k368o58l558R499Q932k068m645m841n216O369J6L087N067
6122B430l211r201n265K385L295j294J500P67m042k36J2164P746l275m909K919
6107A773l813M26J068n868l29J795k699R83L96k799k4M636O600k107m108R5q95
6090d870N909O538n561q226o514J07L537O880J99p17j166j753l644l950j497Q686
6074f042N877j805l636k333K758l843l099N458J477K815J915M985l145K006k011
6059A377m750J980m64n30n336L027P111K328J168n618J40R84k065m004J686N394
6043B428k529m240l330J240K136N074P12m582m732K861P491j254n94R01j532J133
6027A183M115J213l804k235L613J813m050n84N013l178k583j1158r38J0873Q463
$$ y = [-2945, 1795, -732, -7186, -9554, -10212, -13770, -4271, 4661, 2593, -2052, -6893, -12109, -5740, -5724, -2637, 2430, -781, -9982, -15247, -12862, -9567, -10861, -9361, -8594, -12636, -12872, -708, 7038, 3763, -1146, 1773, -2040, -1614, -546, -6414, -6743, -4948, -7647, -6664, -6268, -9067, -9091, -4455, 2145, 38, -4070, -3975, -4870, 1039, 7577, 2016, -6210, -12724, -12617, -9080, -2200, -2001, -2718, -3884, -5637, -9281, -13231, -14728, -6042, -165, -1970, -5606, -7939, -5181, -9024, -12123, -6665, -5188, -2373, -458, 4527, 1382, 3388, 1377, -3373, -1393, -1857, -2387, -7723, -4696, 2415, 4743, 5911, 293, 433, 1417, -648, -4652, -2966, 2428, -101, -4341, -7671, -6431, -4295, 779, 1491, -3091, -7823, -4962, 2529, 1275, 681, 1582, 50, 1183, 5298, 6511, 2707, 472, 4085, 5898, 1848, 1264, 6277, 3099, 516, -10642, -11580, -707, 7756]
6012G756l36m237m246k841k26K159M946L901N802q477o902k16J3166L008p472
5997E785n798J961K237p783N222m439l609L177L532m234M549N618l330l48l38
5982B202J591j408K941J011K654n789l981L247j068r44j405M93r671k621K353
$$ y = [7756, 7420, 3183, -1063, -3904, -4130, -1971, 2975, 6876, 12678, 4201, -2701, -2917, 10249, 13257, 5785, -13, 1948, 4185, -3598, 1624, -2815, -6424, -3247, 285, -3949, 600, 6218, 2888, 2540, 2202, 3793, 2385, 5326, 6337, 8991, 3202, -779, 2468, 1400, 456, -949, -456, -10127, -12748, -10395]
$$ [...]
##END NTUPLES=NMR SPECTRUM
##END=
