##TITLE=Analysis number 316534
Compound Code cc 26702
Book Reference 449/70
Project Code adrs
Chemist Name davee
##JCAMPDX= 6.0         $$ Bruker NMR JCAMP-DX V2.0
##DATA TYPE= NMR SPECTRUM
##DATA CLASS= NTUPLES
##ORIGIN= Bruker BioSpin GmbH
##OWNER= nmr
$$ XWIN-NMR		Version 3.5
$$ Thu Jan 19 11:33:39 2006 GMT Standard Time (UT+0h)  MAYBRIDGE\nmr@NMR_250MHZ
##.OBSERVE FREQUENCY= 250.131544655141
##.OBSERVE NUCLEUS= ^1H
##.ACQUISITION MODE= SIMULTANEOUS (DQD)
##.ACQUISITION SCHEME= undefined
##.AVERAGES= 16
##.DIGITISER RES= 18
##SPECTROMETER/DATA SYSTEM= dpx250
##.PULSE SEQUENCE= zg30
##.SOLVENT NAME= CDCl3
##.SHIFT REFERENCE= (INTERNAL, CDCl3, 0, 16.4513)
##AUDIT TRAIL= $$ (NUMBER, WHEN, WHO, WHERE, WHAT)
$$ ##TITLE= Audit trail, XWIN-NMR		Version 3.5
$$ ##JCAMPDX= 5.01
$$ ##ORIGIN= Bruker BioSpin GmbH
$$ ##OWNER= nmr
$$ C:\u/data/dgb/nmr/ADRS/14910/pdata/1/auditp.txt
$$ ##AUDIT TRAIL=  $$ (NUMBER, WHEN, WHO, WHERE, WHAT)
(   1,<2006-01-19 11:33:04.70 +000>,<MAYBRIDGE\nmr>,<NMR_250MHZ>,
      <created by zg, POWCHK disabled, PULCHK disabled
       configuration hash MD5:
       62 19 C7 07 E1 42 D1 B7 37 6C 3D D0 77 39 F9 E6
       data hash MD5: 64K
       98 2D ED 0C 31 B9 55 8E E7 88 38 74 26 66 48 7B>)
(   2,<2006-01-19 11:33:24.09 +000>,<MAYBRIDGE\nmr>,<NMR_250MHZ>,
      <Start of raw data processing
       ef LB = 0.3 FT_mod = 6 PKNL = 1 SI = 32K 
       data hash MD5: 32K
       1B 7A 75 4B 4E AB 46 00 67 5C 0E F7 09 77 73 F4>)
(   3,<2006-01-19 11:33:26.30 +000>,<MAYBRIDGE\nmr>,<NMR_250MHZ>,
      <apk 
       data hash MD5: 32K
       00 F6 DA BC EF 46 B5 DD 90 51 AF 6F 01 C9 43 A4>)
(   4,<2006-01-19 11:33:27.14 +000>,<MAYBRIDGE\nmr>,<NMR_250MHZ>,
      <abs ABSG = 5 
       data hash MD5: 32K
       74 B8 AF 29 26 91 4D 03 2C C0 E2 09 A2 67 B2 C1>)
$$ ##END=
$$ 
$$ hash MD5
$$ 29 C2 EF 19 6F 1F 60 87 6A 0A 5B C0 BE 65 BD 8C
##$RELAX= 
##$RELAX= 
##$RELAX= 
##$RELAX= 
##$RELAX= 
##$RELAX= 
##$RELAX= 
$$ Bruker specific parameters
$$ --------------------------
##$DU= <C:\u>
##$EXPNO= 14910
##$NAME= <ADRS>
##$PROCNO= 1
##$TYPE= <nmr>
##$USER= <dgb>
##$AMP= (0..31)
100 100 100 100 100 100 100 100 100 100 100 100 100 100 100 100 100 100 
100 100 100 100 100 100 100 100 100 100 100 100 100 100 
##$AQSEQ= 0
##$AQ_mod= 3
##$AUNM= <au_zg>
##$AUTOPOS= <34 >
##$BF1= 250.13
##$BF2= 250.13
##$BF3= 250.13
##$BF4= 250.13
##$BF5= 500.13
##$BF6= 500.13
##$BF7= 500.13
##$BF8= 500.13
##$BYTORDA= 1
##$CFDGTYP= 0
##$CFRGTYP= 5
##$CHEMSTR= <none>
##$CNST= (0..31)
1 1 145 1 1 1 1 1 1 1 1 1 1 1 1 1 1 1 1 1 1 1 1 1 1 1 1 1 1 1 1 1 
##$CPDPRG= <>
##$CPDPRG1= <>
##$CPDPRG2= <>
##$CPDPRG3= <>
##$CPDPRG4= <mlev>
##$CPDPRG5= <mlev>
##$CPDPRG6= <mlev>
##$CPDPRG7= <mlev>
##$CPDPRG8= <mlev>
##$CPDPRGB= <>
##$CPDPRGT= <>
##$D= (0..31)
0 1 0 0 0 0 0 0 0 0.06 0 0 0 0 0 0 0.0002 0 0 0 0 0 0 0 0 0 0 0 0 0 0 
0 
##$DATE= 1137670383
##$DBL= (0..7)
120 120 120 120 120 120 120 120 
##$DBP= (0..7)
150 150 150 150 150 150 150 150 
##$DBP07= 0
##$DBPNAM0= <>
##$DBPNAM1= <>
$$ [...]
##$SUBNAM7= <"">
##$SUBNAM8= <"">
##$SUBNAM9= <"">
##$SW= 20.6930455092707
##$SWIBOX= (0..15)
0 0 3 0 0 0 0 0 0 0 0 0 0 0 0 0 
##$SW_h= 5175.983436853
##$TD= 65536
##$TD0= 1
##$TE= 294.16
##$TE2= 300
##$TE3= 300
##$TEG= 300
##$TL= (0..7)
0 120 120 120 120 120 120 120 
##$TP= (0..7)
150 150 150 150 150 150 150 150 
##$TP07= 0
##$TPNAME0= <>
##$TPNAME1= <>
##$TPNAME2= <>
##$TPNAME3= <>
##$TPNAME4= <>
##$TPNAME5= <>
##$TPNAME6= <>
##$TPNAME7= <>
##$TPOAL= (0..7)
0.5 0.5 0.5 0.5 0.5 0.5 0.5 0.5 
##$TPOFFS= (0..7)
0 0 0 0 0 0 0 0 
##$TUNHIN= 0
##$TUNHOUT= 0
##$TUNXOUT= 0
##$USERA1= <user>
##$USERA2= <user>
##$USERA3= <user>
##$USERA4= <user>
##$USERA5= <user>
##$V9= 5
##$VALIST= <valist>
##$VCLIST= <CCCCCCCCCCCCCCC>
##$VD= 0
##$VDLIST= <DDDDDDDDDDDDDDD>
##$VPLIST= <PPPPPPPPPPPPPPP>
##$VTLIST= <TTTTTTTTTTTTTTT>
##$WBST= 1024
##$WBSW= 4
##$XGAIN= (0..3)
0 0 0 0 
##$XL= 0
##$YL= 0
##$YMAX_a= 413181
##$YMIN_a= -460645
##$ZGOPTNS= <>
##$ZL1= 120
##$ZL2= 120
##$ZL3= 120
##$ZL4= 120
##$ABSF1= 16.45126
##$ABSF2= -4.241913
##$ABSG= 5
##$ABSL= 3
##$ALPHA= 0
##$AQORDER= 0
##$ASSFAC= 0
##$ASSFACI= 0
##$ASSFACX= 0
##$ASSWID= 0
##$AUNMP= <proc_1d>
##$AZFE= 0.1
##$AZFW= 0.1
##$BCFW= 0
##$BC_mod= 0
##$BYTORDP= 0
##$COROFFS= 0
##$CY= 12.5
##$DATMOD= 1
##$DC= 0
##$DFILT= <>
##$DTYPP= 0
##$F1P= 14.0000005364418
##$F2P= -0.99999901652339
##$FCOR= 0.5
##$FTSIZE= 32768
##$FT_mod= 6
##$GAMMA= 0
##$GB= 0
##$INTBC= 1
##$INTSCL= 1
##$ISEN= 128
##$LB= 0.3
##$LEV0= 0
##$LPBIN= 0
##$MAXI= 10000
##$MC2= 0
##$MEAN= 0
##$ME_mod= 0
##$MI= 0
##$NCOEF= 0
##$NC_proc= -2
##$NLEV= 6
##$NOISF1= 0
##$NOISF2= 0
##$NSP= 0
##$NTH_PI= 0
##$NZP= 0
##$OFFSET= 16.45126
##$PC= 1
##$PHC0= 240.4251
##$PHC1= 5.806899
##$PH_mod= 1
##$PKNL= yes
##$PPARMOD= 0
##$PSCAL= 4
##$PSIGN= 0
##$REVERSE= no
##$SF= 250.130017692624
##$SI= 32768
##$SIGF1= 0
##$SIGF2= 0
##$SINO= 400
##$SIOLD= 32768
##$SREGLST= <1H.CDCl3>
##$SSB= 0
##$STSI= 32768
##$STSR= 0
##$SW_p= 5175.98343685301
##$SYMM= 0
##$S_DEV= 0
##$TDeff= 65536
##$TDoff= 0
##$TI= <Analysis number 999999
Compound Code 99
Book Reference 9
Project Code 9>
##$TILT= no
##$TM1= 0
##$TM2= 0
##$TOPLEV= 0
##$USERP1= <user>
##$USERP2= <user>
##$USERP3= <user>
##$USERP4= <user>
##$USERP5= <user>
##$WDW= 1
##$XDIM= 32768
##$YMAX_p= 354016430
##$YMIN_p= -346448
$$ End of Bruker specific parameters
$$ ---------------------------------
##NTUPLES= NMR SPECTRUM
##VAR_NAME=  FREQUENCY,     SPECTRUM/REAL,   SPECTRUM/IMAG
##SYMBOL=    X,             R,               I
##VAR_TYPE=  INDEPENDENT,   DEPENDENT,       DEPENDENT
##VAR_FORM=  AFFN,          ASDF,            ASDF
##VAR_DIM=   32768,         32768,           32768
##UNITS=     HZ,            ARBITRARY UNITS, ARBITRARY UNITS
##FACTOR=    0.157963299565203, 1,           1
##FIRST=     4114.95385807492, 0,            0
##LAST=      -1061.02957877809, 0,           0
##MIN=       -1061.02957877809, -346448,     0
##MAX=       4114.95385807492, 354016430,    0
$$ Real data points
##PAGE= N=1
##DATA TABLE= (X++(R..R)), XYDATA
$$ [...]
17087d329N897p650p175P190J3549K1785k446K151j6236r837O386j2303j3974
17074a6992L381K3377j2509k539J439j6924Q231L8192N469n37j0728k0806N754
17061D808J1093j2226k6433m682J8329N412o869J0518J2537J0165J2200q281k0738
17048E833k8879m747j0801l713P894j9902Q153R256j887M375K564K0771J4211
17035C128j33o652J1944j572L824M430j1196l27p77P074J245r018j4093K205j8935
17020b8853r367L040j6283J4007M100K3336N407o503j7170O429j9586k5518r829
17007g6790J3819M7441J4928n259n398r60J1871j1553Q942P226q627j1887M487
16994a1760l136j5595l515K049M087j1044J0127J1610K392n413k1544R702K2954
$$ plain form
17087 -4329 1568 -6082 -13257 -6067 7482 29267 26821 28972 12736 2899 9285 -3018 -16992
17074 -16992 -13611 9766 -2743 -5282 -3843 -20767 -12536 25656 31125 30588 19860 -946 4808
17061 4808 15901 3675 -22758 -27440 -9111 -3699 -10568 -50 12487 22652 34852 26571 5833
17048 5833 -23046 -27793 -38594 -42307 -34413 -54315 -46162 -36906 -38793 -34418 -31854 -11083 3128
17035 3128 2995 -3657 8287 6715 10539 14969 3773 3446 2669 9743 10988 1970 -12123 -9918 -28853
17020 -28853 -38220 -35180 -51463 -37456 -33356 -10020 -4613 -11116 -28286 -21857 -41443 -66961 -76790
17007 -76790 -62971 -15530 -602 -5861 -11259 -12219 -348 -11901 -2959 4267 -4360 -16247 -11760
16994 -11760 -14896 -30491 -34006 -31957 -27870 -38914 -28787 -17177 -14785 -20198 -41742 -32040 -9086
16981i086o203j4054J8209K4602K841j9865l2511M852K0452J2195q338j2940j389
16968b1235J1314m168J1852j3176n259N869O215k058N246J7521J776j2108N835
16955G624K965j8165M960J3045j4368j3074l496L083q929k4749L916m60L314J2291
16941c2043N136o732M618k880J6329K7744j09M644k1054p074Q919n609l2812N810
16927c5113K1393j404k949J0561J6324L937k4652O211K4712p459k7019m785N835
16914a4408k814p734Q31J0046K6535L595j499J431j0953K050m356j1342J1454
16901B836J6658q876q334M954j3892j8905P464J2813k6668k102K2338K3365l367
16888H284p294r764l1721R242K713j6317k7303J2865M1160M560j1417q699k0008
$$ plain form
16981 -9086 -15289 -29343 -11134 13468 16309 -3556 -36067 -31215 -10763 1432 -6906 -19846 -21235
16968 -21235 -9921 -14089 -2237 -15413 -20672 -14803 -8588 -10646 -5400 12121 13897 1789 7624
16955 7624 10589 -7576 -2616 10429 -3939 -17013 -20509 -17426 -26355 -51104 -47188 -47648 -44334 -32043
16941 -32043 -26907 -33639 -29021 -31901 -15572 12172 12063 16707 -4347 -11421 -2502 -8111 -40923 -35113
16927 -35113 -13720 -15124 -18073 -7512 8812 12749 -11903 -5692 19020 11561 -15458 -20243 -14408
16914 -14408 -17222 -24956 -24125 -14079 12456 16051 14552 15983 5030 7080 2724 -8618 2836
16901 2836 19494 10618 2284 7238 -6654 -25559 -18095 -5282 -31950 -34052 -11714 11651 8284
16888 8284 990 -8774 -40495 -31253 -28540 -44857 -72160 -59295 -18135 -13575 -24992 -33691 -53699
16875e3699j943N006J7885J7480P410j8517K0482n93N993k042K069P185m822l873
16861a979p48k5268k286J879j8119K1337L6004J6246k3607l6106j8397K3822J3560
16848a3662p361q274J503N278j1475j10j0652K6333M391P92K0679n823N799K2544
16834B9962l3351q575J4173O246q106l201n081j9266l30m468O869K5231P579J428
16820I110j7303J6100L5595P832j9472k4189m046j0331j2503Q603L0647J621R377
16807C1041j0590o596j2061j9119J7980J3054j1803j0953r289P221J7086j3663
16795g692L264O108K8225n849O887m214m804p637j992j4906p874J4086J5972J836
16781B1410p263j490k1535q770K9958J0332J1442m869J610k523k7521k1661J0151
$$ plain form
16875 -53699 -55642 -50636 -32751 -15271 -7861 -26378 -5896 -6489 -496 -2538 -469 6716 1894 -1979
16861 -1979 -2727 -27995 -30281 -28402 -46521 -25184 10820 27066 3459 -32647 -51044 -27222 -13662
16848 -13662 -21023 -29297 -27794 -22516 -33991 -34101 -44753 -18420 -14029 -13237 7442 1619 7418 29962
16834 29962 -3389 -11964 2209 8455 349 -2852 -7933 -27199 -27529 -31997 -25128 103 7682 9110
16820 9110 -8193 7907 43502 51334 31862 7673 3627 -6704 -19207 -10604 20043 21664 31041
16807 31041 20451 13855 1794 -17325 655 13709 1906 -9047 -18336 -11115 5971 -7692
16795 -7692 -4428 1680 29905 24056 30943 26729 21925 14288 12296 -2610 -10484 3602 19574 21410
16781 21410 14147 12657 -8878 -17648 12310 22642 34084 29215 30825 28302 781 -20880 -10729
16768a0729j7461N415K7728R178k0842j0530o96q877k3149q115L0289K5930N503
16755C644N00o056K1456L505j6024l486o904k6497j0184P304P866p170J2811J6404
16741b831K5103K0027k9311l5004j0891k800N154k0791L245M758n593R431L1313
16728h190M916J0795Q730J415k7416j5855J4933J1178L3358J9012m272k017k3138
16715B3449k1110j511N975j1179N544Q137m771K1940j199l2840p729P300j3702
16702b1696K9074L1830K094n066j4329N7k0529l2923p42o457L958K5888K8472
16689A9631J8255Q321k7234k4939J0401L0956O819r106j881k0680o94j3603N2
16676c702l629L249R278K847L91r940j2092l0095k754o547O594m483J5906M0359
$$ plain form
16768 -10729 -28190 -22775 4953 14131 -6711 -17241 -17937 -26814 -49963 -58078 -27789 -1859 3644
16755 3644 4144 -1912 19544 23049 7025 3539 -3365 -29862 -40046 -32742 -24876 -32046 -19235 -2831
16741 -2831 22272 42299 12988 -22016 -32907 -35707 -30553 -51344 -48099 -43341 -48934 -39503 -8190
16728 -8190 -3274 7521 16251 17666 -9750 -25605 -10672 506 33864 52876 48604 46587 23449
16715 23449 2339 828 6803 -4376 1168 9305 4534 26474 25275 -7565 -15294 -7994 -21696
16702 -21696 7378 39208 41302 36236 21907 21964 1435 -31488 -32230 -38687 -34729 -8841 19631
16689 19631 37886 46207 18973 -5966 4435 35391 42210 33104 31223 10543 9849 -3754 -3702
16676 -3702 -7331 -4082 5196 8043 8434 -1506 -13598 -43693 -46447 -52994 -46400 -50883 -34977 5382
16662E382k71o824J1225m983j5776q170j3182k889J6544K4476j622j8952K629
16649a2413J3670j2711J0183J4035J1782j3753j1940J6672l334j3993L0043L7381
16637F5622l737j2362j7527j6769k988J0406k5305n0612M266O700J0604m540K7009
16624i233L7742j5704m1236r519J1469K1448K654j4270P33K3741p535r849P284
16611b275q444q836J4058O450j3695j7151N654L205L21O127J3618J668k7308n222
16597c1830L4865L2288m360j6044n082j504j5483l7473J1747K3543J32N869j1398
16584a4730k1115J6694R37n984K704p38N582m21j0026P175J0782Q854j1530m1320
16570e3136J0881K3822q908J2277Q842J0247j2895J9882l983J1889K2933O086
$$ plain form
16662 5382 5111 -1713 9512 4529 -11247 -19417 -32599 -35488 -18944 5532 3910 -15042 -12413
16649 -12413 1257 -11454 -1271 12764 24546 10793 -1147 15525 12191 -1802 28241 65622
16637 65622 61885 49523 31996 15227 12239 22645 -2660 -53272 -49006 -42306 -31702 -36242 -9233
16624 -9233 28509 12805 -28431 -37950 -26481 -5033 -2379 -16649 -15916 7825 290 -9559 -2275
16611 -2275 -10719 -19555 -5497 953 -12742 -29893 -24239 -21034 -20713 -14586 -968 700 -26608 -31830
16597 -31830 3035 35323 30963 14919 9837 8333 -7150 -44623 -32876 -9333 -9201 -3332 -14730
16584 -14730 -35845 -19151 -18214 -24198 -21494 -22232 -16650 -17071 -27097 -19922 -9140 -286 -11816 -53136
16570 -53136 -42255 -18433 -27341 -15064 -6222 4025 -8870 11012 7029 18918 41851 47937
16558D7937m6417q67L469Q403Q799l3498l7271m563L1094Q376j4220K6077p741
16545a0422j1136j8845J38J9427n951q442P734N45n330J1036K7059O941j223k315
16531I216N485j9549Q219K444K285K1237j1710J23r728n488k1874K138j1617J7807
16517a1012J4113p667J554p964R412L377k841o588q120J693K3409M669m854J5470
16503B4651o452J243J5808k0398n598p715J7281p775k2414N550K1182m538j9197
16490h372m865J7567l898O859P300J1357o63q562k0494J3435K9842P48k8679k6081
16476a4506k6372p684K5848K6516O374j6300j338J0437J9539J1232k0138n5024
16464d1416k0963K0133r82K6184K1649j8412k1063o105K5549O776N203k0900k1972
$$ plain form
16558 47937 1520 653 4122 12525 21324 -12174 -49445 -54008 -22914 -14538 -28758 -2681 -10422
16545 -10422 -21558 -40403 -40265 -20838 -26789 -35231 -27497 -26952 -32282 -21246 5813 12754 11531 9216
16531 9216 14701 -4848 3371 5815 8100 29337 17627 17750 8022 2534 -19340 -17202 -28819 -11012
16517 -11012 3101 -4566 -3012 -10976 -1564 1813 -1028 -7616 -15736 -14043 9366 14035 9181 24651
16503 24651 18199 19442 35250 14852 9254 1539 18820 11045 -11369 -5819 15363 10825 -8372
16490 -8372 -13237 4330 432 7291 14591 25948 25285 16723 -3771 9664 39506 40254 11575 -14506
16476 -14506 -40878 -48562 -22714 3802 10176 -6124 -7462 2975 22514 33746 13608 -41416
16464 -41416 -62379 -42246 -43228 -17044 4605 -13807 -34870 -40975 -15426 -8650 -3447 -24347 -46319
16451d6319J5934R75j3273J370J3737J7933o754J5077J2791K611j2614j4026n911
16438a8469p509L386Q697J3576M414K831j8226q476j3393Q745n553L694J0501
16425a5782R11q941m126R925Q35O059O072J5591j0333k4097j0019K7287J5635
16412I017Q111q128n275M744J2536J802J0876K197p239q426p569k4083j4377j0515
16398c6329j9989J5562L5756m937R618K2801q256l1439j7234M8417O412j6168
16386D214j5145L48L0603K3547K2409j098j7176l96L242k2314p569O027J939k92
16372B8339l0782j8504Q9J3165N618p612J8541K3725J3758M328n600j5900J8111
16359D7276K6926o743M919o632q222L053j6644j6220k5032j7617q304r662Q886
$$ plain form
16451 -46319 -30385 -29410 -42683 -41313 -27576 -9643 -16397 -1320 11471 14082 1468 -12558 -18469
16438 -18469 -25978 -22592 -13895 -319 4095 6926 -11300 -19776 -33169 -24424 -29977 -26283 -15782
16425 -15782 -14871 -23812 -27938 -18013 -17178 -11119 -5047 10544 211 -23886 -33905 -6618 9017
16412 9017 17128 9000 3725 8469 21005 22807 33683 35880 28641 20215 12646 -11437 -25814 -36329
16398 -36329 -56318 -40756 -5000 -9937 -319 22482 14226 -17213 -34447 13970 20382 4214
16386 4214 -10931 -10583 20020 43567 65976 64878 47702 47306 50548 28234 20665 26692 28631 28339
16372 28339 -2443 -20947 -20858 -7693 -2075 -9687 8854 32579 46337 50665 45065 29165 47276
16359 47276 74202 67459 72378 65746 57524 60577 43933 27713 2681 -14936 -23240 -32902 -24016
16346b4016L2574N531j1162j544J7558J1442k1240j2571l472K412l402J5442J1459
16333A9011J7274m860o161O997p362j0810q795j0267j1084L048M869l488p695
16320a9323K666J307j2865K0325m737p215K575q642J2163R5n049M626l75J2749
16306a700j3622l3557l876J4394L920k003R685k864j4455J3123Q655J418J3454
16293g428J3694k901j1448J543K0603p417j5555K4593j0983k2794k5008R57O915
16280c5229n770K0459L4003j1951l3q132j6102j6484Q105l911m863J6443p684
16267c1149R906M5164k0327k2653P818m608N235K40j0400m262K457J0405K727
16254i447m709j3289k6927n460K4944N062K0546J1142K7349J1828p410l26r002
$$ plain form
16346 -24016 8558 14089 2927 1383 18941 30383 9143 -3428 -6900 -4488 -7890 7552 19011
16333 19011 36285 31425 25264 32261 24899 14089 5294 -4973 -16057 -13009 -8140 -11628 -19323
16320 -19323 -16657 -15350 -28215 -7890 -12627 -19842 -17267 -25909 -13746 -13651 -18700 -14074 -14449 -1700
16306 -1700 -15322 -48879 -52755 -38361 -34441 -36444 -26759 -29623 -44078 -30955 -22300 -20882 -7428
16293 -7428 6266 3365 -8083 -6540 14063 6646 -8909 15684 4701 -18093 -43101 -42144 -35229
16280 -35229 -40999 -20540 13463 1512 1479 -6653 -22755 -39239 -31134 -35045 -39908 -23465 -31149
16267 -31149 -21243 23921 3594 -19059 -11241 -15849 -10614 -10374 -20774 -25036 -22579 -12174 -9447
16254 -9447 -14156 -27445 -54372 -59832 -34888 -29826 -9280 1862 29211 41039 33629 33303 24301
16241B4301k293j2307k9503r130J194M2979J7651n233k405k1950K834K697o220
16228B615J2289K963J116m0303p612R753M110M738L3978J401l1340m4943j3827
16215f5062K9978J5575K0450J6484k2728l730J6263K3289j0310K209N243l1971
16203d310L264j6899J6486M304l5134j4586K9758K3864j382k7556J5868J8132
16191A1809r403j7132m231J3912L3736r923o409j3097K4522J3932L291j437m440
16178C5130j4818Q83j3154N402M185j9270r578J6706K0933L2133J215m3282j0537
16165E948J646r698j104K004p775j9081K453L260j746J4163J5458k40N765J6550
16151B7603k472k2933o298P519J4748j2032J0070j9317o544r561n718K0490K4665
$$ plain form
16241 24301 22008 9701 -19802 -28932 -27738 15241 32892 27659 25254 3304 6138 8835 2615
16228 2615 14904 17867 18983 -21320 -28932 -19179 -15069 -10331 23647 25048 -6292 -51235 -65062
16215 -65062 -35084 -19509 941 17425 -5303 -9033 7230 30519 20209 22418 27661 -4310
16203 -4310 -1046 -17945 -1459 2845 -32289 -46875 -17117 6747 5365 -22191 -6323 11809
16191 11809 2406 -14726 -18957 -5045 28691 18768 12359 -738 23784 37716 41007 39570 35130
16178 35130 20312 21195 8041 13443 17628 -1642 -11220 5486 26419 58552 59767 16485 5948
16165 5948 7594 -2104 -3208 -1204 -8979 -28060 -25607 -22347 -24093 -9930 5528 5288 11053 27603
16151 27603 25131 2198 -4100 3419 18167 6135 16205 -3112 -9656 -19217 -24935 -4445 20220
16138B0220J2451j1443q549N788j8855k2985J1200K5442j5325r407r78M141p290
16125a5590p141k7400k070K6223J8329j4511K831r001J5569O487M119r222l0771
16112d2148P64P528j5136o253L069j0331l664M5698K8907Q027j2953M792J6038
16099B4338J2448j2045l6645j3441M808Q340J2671o694k677j9829J3004J3449
16087b273j617R468J1163l2881K388O973k4846j5081J1849K4381J8282j1592J3274
16074I488K5127P066n580k7774J3165j5570r14k2555J2341J1883J8935k0420m340
16061H52o435R506j8164m84K7639K1835j6372m5731k7854n829J2511J8750J8259
16048a1517J0777k0722J0335q825R839J7270j0139k0030j0828J7130J0479J5824
$$ plain form
16138 20220 32671 21228 12679 18467 -388 -23373 -12173 13269 -2056 -11463 -12441 -8300 -15590
16125 -15590 -22731 -50131 -52201 -25978 -7649 -22160 -19329 -28330 -12761 -6274 -2155 -11377 -42148
16112 -42148 -41384 -33856 -48992 -55245 -52176 -62507 -66171 -20473 8434 16461 3508 8300 24338
16099 24338 36786 24741 -11904 -25345 -20537 -12197 474 -6220 -8897 -28726 -15722 -2273
16087 -2273 -3890 5578 16741 -16140 -13752 -6779 -31625 -46706 -34857 -10476 7806 -3786 9488
16074 9488 34615 41681 36101 8327 21492 5922 5008 -17547 -5206 6677 25612 5192 852
16061 852 -5583 3923 -14241 -14725 12914 34749 18377 -27354 -55208 -61037 -48526 -29776 -11517
16048 -11517 -740 -21462 -11127 -19952 -10113 7157 -2982 -23012 -33840 -16710 -6231 9593
16036I593J1722l291o043k1594j6928j6767P486j752M66p600p782K9896K6416
16023C822j3674L471J1592l48j2284J8741R119K1401p926o025N09j0108l4303
16010a6013k0302O645K6978R311Q124k2113J5999o047N332K0209n1886m6715P360
15997f3118M3356J3969Q351K8189m012j9208R488l1422R668J227j3860N780J1386
15984b06K4799k4853k9159o296J3825L368J7034j7701r568J2541n046j8748Q594
15971c1416N122P510l096q029J2269N967k757K3955J487k3147L415Q193M950K3531
15957B7954j1477M232l871j5754P023J6094j9431l6646O300J5455r134K7275L352
15944A1372j3033K550j2476K6455K786r605o901L5438o347K577R164j8676q17
$$ plain form
16036 9593 21315 18024 11981 -9613 -26541 -43308 -35822 -37574 -37108 -44708 -52490 -22594 3822
16023 3822 -9852 -6381 5211 4863 -7421 11320 20439 41840 33914 27889 28398 18290 -16013
16010 -16013 -36315 -29670 -2692 6619 14743 -7370 8629 2582 7914 28123 -23763 -70478 -63118
15997 -63118 -19762 -5793 2558 30747 26735 7527 17015 -14407 -4739 -3512 -17372 -11592 -206
15984 -206 24593 -260 -29419 -35715 -21890 -18522 -1488 -19189 -28757 -16216 -21262 -40010 -31416
15971 -31416 -26294 -18784 -21880 -29909 -17640 -11673 -14430 9525 11012 -12135 -8720 -527 4423 27954
15957 27954 16477 20709 16838 1084 8107 24201 4770 -31876 -25576 -10121 -19255 8020 11372
15944 11372 -1661 889 -11587 14868 17654 8049 1148 36586 30239 32816 41980 23304 22487
15931B2487K098P410l0149l0290m25K1335J2884j1317j6503k795j2409Q310N683
15918b3681n153K3153J2542J8332J0460j7007p764r363k689J0499J2842j5696
15906F475p812K0844J8542j4863j2144O547k875p700K6590J0274o520j2916j3524
15893A0918l0260P501l880K6258J4622k3358m048K698j5107L567l088q794K788
15880b0183L446j406O117J1154n407J1303m494o461q363J1909N26J6974j2951
15867B164k4700J5629K9170J023r212Q77j489J7141j2838k1180m047J2470o122
15854a114J0065q996k257k6091J1935K2508J6875N206k1754k0932m841k0379n231
15841d5006l841M323O664J7701J688P765r466k7340j4k183K167M5988q556J2957
$$ plain form
15931 22487 24585 31995 1846 -28444 -28869 -7534 5350 -5967 -22470 -25265 -37674 -29364 -23681
15918 -23681 -28834 -5681 6861 25193 35653 18646 10882 1519 -1170 9329 22171 6475
15906 6475 -1337 19507 38049 23186 11042 17589 14714 7014 33604 43878 37358 24442 10918
15893 10918 -19342 -11841 -15721 10537 25159 1801 -2247 451 -14656 -11089 -14177 -22971 -20183
15880 -20183 -16737 -18143 -12026 -872 -6279 5024 530 -5931 -14294 -2385 -1859 15115 2164
15867 2164 -22536 -6907 22263 23286 14074 14951 13462 30603 17765 -3415 -7462 5008 -1114
15854 -1114 8951 -45 -2302 -28393 -16458 6050 22925 28131 6377 -14555 -19396 -39775 -45006
15841 -45006 -48847 -44524 -37860 -20159 -18471 -10706 -20172 -47512 -47526 -49709 -47542 -1554 -10110 2847
15827B847K2283j1395k4756J1889Q858p642k9210j756J4456K0069j3381m516j6382
15814b8636K0031J2577j6582k1112J6080o044j7504j1025J6527L7347J3379k2044
15802g006j0564l636o699l322j9979q402l837R73M1629J1422q720M424J2653L157
15788B093L170K4666j4147l733l548J3076O832L962j1196l70n297J2192K6861
15775E4561p080j0891J6426J0001j4770K500K5852q826j4387k146k569m1430j3150
15762e909j505N158L108J7981j7681l6670J0118R649Q263j301m946L3826n101
15749A4990N131l174k1982o216J3288n59K5342J725M151J0023l2406q521J8224
15736B0016k4285n901J724J2176M140R386q135j2677q116j1571N45p83N517N902
$$ plain form
15827 2847 25130 13735 -11021 868 9726 2084 -27126 -28882 -14426 5643 -7738 -12254 -28636
15814 -28636 -8605 3972 -12610 -33722 -17642 -23686 -41190 -52215 -35688 1659 15038 -7006
15802 -7006 -17570 -21206 -27905 -31227 -51206 -59608 -63445 -62472 -20843 -9421 -18141 -13717 -1064 2093
15788 2093 5263 29929 15782 12049 8501 21577 28409 32371 21175 20805 15508 27700 54561
15775 54561 47481 36590 53016 63017 48247 50747 76599 67773 53386 51240 48671 7241 -5909
15762 -5909 -7414 -2256 852 18833 1152 -35518 -25400 -15751 -7488 -8789 -13735 20091 14990
15749 14990 20121 16947 -5035 -11251 2037 1478 26820 28545 32696 42719 10313 1792 20016
15736 20016 -4269 -10170 -8446 3730 7870 17256 9121 -3556 -11672 -23243 -22698 -23481 -17964 -12062
15722a2062n415J9621J8926l087j8828k5575L651J1636J0055N610J0493J2388
15710B7413r597n253j2066k1499J341Q321j7122q822K9784J7788j6439P169j4984
15697a3966k6005R926r339P102J1485P819L568j2221l37K9065L7209o488k6198
15684A1620k2779r027K26J8703K0081O795l513P203j3307j3470J3964J8769j1130
15671B4135k0155p264J6275N145J410r131l4552N51J2994j7118l0929k747J0073
15658e1313N3441J6948o642k8973o556J4533J2055J66J5821j9337m882J1591J4991
15645B1843o777j0447n47J233l338R69m585J0418K0530j4390j4187r31K2187O66
15631B2644k8013j9253m125J6051P024Q706J0117j8921k441K1195q653j9401j2251
$$ plain form
15722 -12062 -17477 2144 21070 17983 -845 -26420 -22769 -11133 -1078 4532 15025 27413
15710 27413 17816 12563 497 -21002 -19661 -11340 -28462 -37284 -7500 10288 -6151 1018 -13966
15697 -13966 -39971 -30045 -39384 -32282 -20797 -12978 -9410 -21631 -21968 7097 44306 37818 11620
15684 11620 -11159 -20186 -19960 -1257 18824 25619 22106 29309 16002 2532 16496 35265 24135
15671 24135 3980 -3284 12991 18136 19546 10415 -24137 -23586 -10592 -27710 -58639 -61386 -51313
15658 -51313 2128 19076 12434 -16539 -23095 -8562 3493 3659 19480 143 -4739 6852 21843
15645 21843 15066 4619 4072 5305 1967 2936 -1649 8769 29299 14909 722 -209 21978 22644
15631 22644 -5369 -24622 -28747 -12696 -5672 3034 13151 -5770 -8211 12984 4331 -15070 -27321
15618b7321l7149K1295K6277o509J7602K4122k1078k6953p156J6001j0415J5563
15606a5721K540O14K3013L5438J0861j5581k9234j5522R70N054m655p894j3922
15593b4039J138J2088J1195J8457k7326j1728J3440L4915J1358m3566k8978K0518
15581a2528K6251P884j3645Q14k4424k320O1091N250k4144j7260n0226j4999L8830
15568a9426J2244K3235k2964j5962J2296J7165o747o986k266j9817J0304L7994
15556A9070J0947l3642l0219q030K6392M0479L5648j2691k0361j0392k4190k2699
15544b9688j1738M757K9124j1280j191K855n753r236J0130O603j13k7046j1269
15531e3845K0832J0325l017J338J478L702P673p942n642K1598J6046J4472l482
$$ plain form
15618 -27321 -64470 -43175 -16898 -23407 -5805 18317 -2761 -29714 -36870 -20869 -31284 -15721
15606 -15721 -13181 -12567 10446 45884 56745 41164 11930 -3592 -2622 2432 -2223 -10117 -24039
15593 -24039 -22901 -10813 382 18839 -8487 -20215 -6775 28140 39498 -4068 -33046 -12528
15581 -12528 13723 21607 7962 8776 -15648 -17968 43123 48373 24229 6969 -43257 -58256 -19426
15568 -19426 -7182 16053 -6911 -22873 -10577 6588 -159 -7145 -9411 -29228 -18924 19070
15556 19070 30017 -3625 -33844 -41874 -15482 24997 60645 47954 27593 17201 -6989 -29688
15544 -29688 -41426 -36669 -7545 -18825 -20016 -17161 -22914 -32150 -22020 -15417 -15530 -42576 -53845
15531 -53845 -33013 -22688 -25705 -24367 -22889 -19187 -11514 -19456 -25098 -3500 12546 27018 23536
15518B3536m686j5527j2135L784K550l736J7389r409l0041j218J8047K6531j3111
15505A974j8059l1818R274K1850Q174J5130K1300J4726K966j9770j3197M560j9085
15492a975j8628k2947J7095J676J0729L1985K1141j6240k1300J3930j3434j6169
15480a4137P325m882j1049L7357M0220K946k9305l3349O48K262p179p098k7790
15467d4031Q153J2635R879j9697J5674Q324L062l8000J2148J5707j1654p560p316
15454d2676K4276K0138J1847k532k9036j308j099j1182J006J815K1676K1465n047
15441I343m935j1697m75L229l648K2276P245K0274k8383j7996k855j2759k1863
15428d2244J6166Q346k2230k8338l289L328K3832K9934n302P966K554j3368l2259
$$ plain form
15518 23536 18850 3323 -8812 -5028 -2478 -6214 11175 1766 -28275 -29493 -11446 15085 1974
15505 1974 -16085 -47903 -38629 -16779 -8605 6525 27825 42551 45517 25747 12550 17110 -1975
15492 -1975 -20603 -43550 -26455 -24779 -14050 17935 39076 22836 1536 15466 2032 -14137
15480 -14137 -6812 -11694 -22743 14614 54834 57780 28475 -4874 -4226 -1964 -9143 -16241 -44031
15467 -44031 -35878 -23243 -13364 -33061 -17387 -9063 -6001 -44001 -31853 -16146 -27800 -35360 -42676
15454 -42676 -18400 1738 13585 11053 -17983 -19291 -20390 -31572 -30566 -28751 -7075 14390 9343
15441 9343 4408 -7289 -7764 -4535 -8183 14093 21338 41612 13229 -4767 -7622 -20381 -42244
15428 -42244 -26078 -17732 -39962 -68300 -71589 -68261 -44429 -14495 -19797 -11831 -9277 -22645 -54904
15415e4904M952K3468J8276J9921j2375l685R804O47K634j5730j7620K7453J6805
15402A9646j1650j4154k1797j6522K8744R090J3052J5112k6545q529j1135k0680
15390d5368K9059j02K350j3596q764R733K3449r87M540q802l649o14R148K3045
15376A9442K2524Q829k1236J3034K2427l1820j8139n157J307K6764Q831m913q130
15363C3763j5318k6534O812k084j136j6454k2901m95K9063J6742n69j8310k851
15350b0272J5545J6957k1469k3880M238K098L543L6308k7049l4820K5627M3735
15338B0561K611k9522j5318O205L2553K263M345J6635k5936k7008l804j708m154
15325b2277J4J5853l263K3204J1376r853k369n1J3585m989j2190m295k4346j2104
$$ plain form
15415 -54904 -49952 -26484 -8208 11713 -662 -4347 5457 6104 8738 -6992 -24612 2841 19646
15402 19646 7996 -6158 -27955 -44477 -15733 -6643 6409 21521 -5024 -13553 -24688 -45368
15390 -45368 -16309 -16411 -14061 -27657 -36421 -26688 -3239 -4226 314 -8488 -12137 -12751 -3603 19442
15376 19442 41966 50795 29559 42593 65020 33200 15061 9904 11211 37975 46806 41893 33763
15363 33763 18445 -8089 -1277 -3361 -4497 -20951 -43852 -44347 -15284 1458 889 -17421 -20272
15350 -20272 -4727 12230 -9239 -33119 -28881 -26783 -23240 13068 -13981 -48801 -23174 20561
15338 20561 23172 -6350 -21668 -15463 17090 19353 23698 40333 14397 -12611 -16415 -18123 -22277
15325 -22277 -22263 -6410 -9673 13531 24907 15054 12685 12634 26219 21230 9040 4745 -19601 -31705
15311c1705K496L4033o763j946K425p087p539m890J6951N811l610M365Q662J4916
15297B6119r323p647M485q964L796r224j9500P528j0724L685L7920N342r629k8900
15283a5036j4964R172M635k916M708J2851J1521J2454k885p870O225J3440q172
15270B3163k0845J6578K2087O647J6788j5749k5653j2416j4280k150K56Q631j2166
15257i109j5900k936K0549J8527j7576k2330J4122K9409N80j6673L0201K1686
15245E0550l0747p737J7780J339m8069m4112J2073K6214K295l318j4599J9786
15233a8545Q944j1799J040K2647J989K765R259K971j0134l4449K526K9029P444
15220A3687j6242K5012O779k8951j0083J5897K3268n54j5665j0275K891J1223
$$ plain form
15311 -31705 -29209 4824 -1939 -3885 -1460 -8547 -16086 -20976 -4025 1786 -1824 2541 11203 26119
15297 26119 16796 9149 13634 4670 8466 -758 -20258 -12730 -23454 -19769 18151 23493 13864 -15036
15283 -15036 -30000 -20828 -16193 -19109 -14401 -1550 9971 22425 19540 11670 17895 31335 23163
15270 23163 2318 18896 40983 47630 64418 48669 23016 10600 -3680 -5830 -5574 3057 -9109
15257 -9109 -25009 -27945 -7396 11131 -6445 -28775 -14653 14756 15336 -1337 28864 50550
15245 50550 19803 12066 29846 31185 -16884 -60996 -48923 -22709 -20414 -23732 -38331 -18545
15233 -18545 -9601 -21400 -20360 2287 4276 7041 16300 19271 9137 -25312 -22786 6243 13687
15220 13687 -2555 22457 29236 285 -9798 6099 29367 28813 13148 2873 5764 16987
15208A6987o729j2573q969j1267Q155J0403J5949L802M181j1553l535K2122J0565
15195C7538r229k3106j7144j0765j29J1406M3943J3276l9515k1430k6010P594
15183c3571K3407J2386k5292J2981P645o167K3612M982k3873j627J338q94l126
15170h199k073J4395J8099o845j0844k307R105J8418N783k8785j8391m679J3642
15157b681J4431j2654l1710J72J7957k842j7442r904p604M613J0579M871L3489
15144A275J6971j0038k8790J1132J6963j9707J6973J6576k5274p303k505n780
15132a9507N47o7K3430J1749l122R425J6326L494q333j7509J2248R846q546l9664
15118i683n769J1470p565M155J8529k5189j840L197K6459j0011J8604j3353j0779
$$ plain form
15208 16987 10258 -2315 -11284 -22551 -14396 -3993 11956 15758 19939 8386 4851 26973 37538
15195 37538 28309 5203 -11941 -22706 -22835 -11429 32514 45790 6275 -15155 -41165 -33571
15183 -33571 -10164 2222 -23070 -10089 -2444 -8611 15001 19983 -3890 -5517 -4179 -5073 -8199
15170 -8199 -10272 4123 22222 15377 4533 2226 11331 29749 35532 6747 -11644 -16323 -2681
15157 -2681 11750 -904 -32614 -32442 -14485 -17327 -34769 -44673 -52277 -47664 -37085 -32214 1275
15144 1275 18246 8208 -20582 -9450 7513 -12194 4779 21355 -3919 -11222 -13727 -19507
15132 -19507 -18960 -19027 4403 16152 13030 22455 38781 42275 33942 16433 28681 38527 29981 -9683
15118 -9683 -15452 -3982 -11547 -7392 11137 -14052 -15892 -12695 13764 3753 22357 9004 -1775
15105a775j0183J7363o333j4476j534R637K822L833J6247K5027p473j2923o696
15092A3536Q726m397n313j6893J171J3011K0054j4820j3236J6356k1255k0715
15080b3775J854q621j509Q990J4830m308J0408j128j3998J1525r863j1293m330
15067c1218M397O029J7557L3778J0535k6360r791K0558J7996j5503J3069R397
15055E0444m152j554n478k6700j1385Q409Q327N622l86n510r429k581l248r413
15041g034q584J6316J5008K604k0890j0236K1795K1525K528r279k2002J7062J1883
15028C0696N899j4138Q255M162j9508k5284J2061K0189j2308j7610K7612p478
15016A2548j4335p175J5474k1609o689j001L6641M7380j961j5095k6918q996Q177
$$ plain form
15105 -1775 -11958 5405 -928 -15404 -16938 -7301 -4479 -646 15601 40628 33155 20232 13536
15092 13536 22262 17865 12552 -4341 -3170 9841 29895 15075 1839 18195 -3060 -23775
15080 -23775 -21921 -30542 -32051 -23061 -8231 -12539 -2131 -3259 -17257 -5732 -15595 -26888 -31218
15067 -31218 -26821 -20792 -3235 30543 41078 14718 4927 25485 43481 27978 41047 50444
15055 50444 46292 44738 39260 12560 1175 9584 17911 23533 23147 17637 8208 5627 2379 -7034
15041 -7034 -15618 698 15706 18310 -2580 -12816 8979 30504 33032 23753 1751 18813 30696
15028 30696 36595 22457 30712 34874 15366 -9918 2143 22332 10024 -7586 20026 12548
15016 12548 -1787 -8962 6512 -15097 -21786 -22787 13854 61234 59273 44178 17260 8264 16441
15003A6441r188N340O436j0465J0491K3016P863j0892r483j9698j4811J5862J119
14990A2031j8445r462L223m068P640J9473J1629o949r373K566k6075l5M352J3478
14976a5K7249l9847j1820m01Q109J6544k396j2744j5390q711J577N654O723J499
14962b3969J3958J9946J8776r069j3938j6690J2153j0019j4449R099q595N638
14950a7159N335r798O299J7333J6558p984q152p818O081L155J7322j2796J4550
14937B2926P176k5045k5166m615J0830M155q193M322P088n207J7653k3456k385
14924a9917K099K6145q165J6101R186k5462k0183k1685o980J3384L8213J6813
14912A9549k0480Q544K617l5666R587J7796J4408L497K92j4211j9843k6867j3037
$$ plain form
15003 16441 7253 12593 19029 8564 19055 42071 49934 39042 29559 9861 -4950 10912 12031
14990 12031 -6414 -15876 -12653 -16721 -9081 10392 22021 15072 5699 8265 -17810 -17845 -13493 -15
14976 -15 27234 -12613 -24433 -24834 -16725 -181 -2577 -15321 -30711 -39422 -37845 -32191 -25468 -23969
14962 -23969 -10011 9935 28711 19642 5704 -10986 1167 -8852 -23301 -14202 -22797 -17159
14950 -17159 -11824 -21622 -15323 2010 18568 10584 2432 -5386 695 3850 21172 8376 22926
14937 22926 30102 5057 -20109 -24724 -13894 -9739 -17932 -13610 -6522 -11729 5924 -17532 -19917
14924 -19917 -17818 8327 162 16263 25449 -13 -20196 -41881 -48861 -35477 2736 19549
14912 19549 -931 7613 10230 -25436 -15849 1947 16355 19852 20144 5933 -13910 -40777 -53814
14899e3814j4093J7927K4911Q456q459J3468J3517l190L5557p872l2708j6936
14887b3236J3621K0223J2631j1355k2510J6309J1005J1431q549l6239R423k172
14875i418L9997K571j1285l984j5206J230J2656j1075k0703j5471K0122R333J1171
14862I938m776J8302K1573J4104M38k3282l6754m543j1886K5468K2645m865k3647
14849B715q666J0023l883J2789P041j9275j2009j3924k691k735L148K2950l727
14836h244K1008l4459m237K3590k94o948j4173j6835O270K9188M2776K909r791
14823C0760q651m523N386J984o652O893J6738L854j3820L215O54m038j3732r708
14809H360k0986j0998N462K1536J8146Q988m60K6530J0210j4280j6047j2067M084
$$ plain form
14899 -53814 -67907 -49980 -25069 -16613 -25072 -11604 1913 -1277 34280 26408 -6300 -23236
14887 -23236 -9615 10608 23239 11884 -10626 5683 16688 28119 19570 -16669 -7246 -9418
14875 -9418 30579 33150 21865 17881 2675 3905 16561 5486 -15217 -30688 -10566 -1233 9938
14862 9938 5162 23464 45037 59141 59579 36297 -457 -5000 -16886 8582 31227 26362 2715
14849 2715 -5951 4072 189 12978 20019 744 -11265 -25189 -27880 -30615 -27467 -4517 -8244
14836 -8244 12764 -21695 -25932 -2342 -2636 -9584 -23757 -40592 -34322 -5134 37642 40551 30760
14823 30760 22109 17586 22972 24956 18304 25197 41935 45789 31969 35184 35838 31800 18068 8360
14809 8360 -12626 -23624 -18162 3374 21520 30508 30048 56578 66788 52508 36461 24394 28478
14796B8478q467P180J6525J362o125k1923m517k340K2320n78k1629J5686j0123
14783A5849o394R617Q006j4812L414J4163J5621j7897j5859J1577n447p003O858
14770A7693k1568m540l6n455P284J4649q713j1221p671j3373j0894m458J7520
14757c0783K9203J141J0766O376M345J9317j4623p703j0231K727j6819p023k157
14744a5464j4000J1520J3218P200J0044Q656m938m8147k4794P711j968R233o285
14731d8014P0J6952q664p865J8926M0139O591J9058o741P620J3390j0302j1091
14718C0069q206K2903J1871J2007l113l2745m7118j1496j2644k943N279J5940
14706b0196J8774J6584K7329J301k5351q952l836J1859J8864j7705l3882k6420
$$ plain form
14796 28478 20011 27191 43716 45078 38953 17030 12513 10173 32493 31915 10286 25972 15849
14783 15849 9455 19072 27078 12266 15680 29843 45464 27567 11708 23285 17838 10835 17693
14770 17693 -3875 -8415 -8451 -13906 -6622 8027 -686 -11907 -19578 -32951 -43845 -48303 -30783
14757 -30783 -1580 -439 10327 16703 21048 40365 25742 18039 7808 10535 -6284 -13307 -15464
14744 -15464 -29464 -17944 -4726 2474 12518 21174 16236 -31911 -56705 -48994 -50962 -41729 -48014
14731 -48014 -47944 -30992 -39656 -47521 -28595 11544 18135 37193 30452 38072 51462 41160 30069
14718 30069 21863 44766 56637 68644 65531 32786 -14332 -25828 -38472 -41415 -36136 -20196
14706 -20196 -1422 15162 42491 43792 18441 9489 5653 17512 36376 18671 -15211 -41631
14694d1631p14L5836K3527j285n2251l460J7724P541J2711J0343L91j5249j7820
14681b4337J4695L9614J4222l0702j5942K6800J2802l4689k9231K3530J0227M467
14669A1456j8433l3532K749J9776K388o116P072o954J8783j2082J989M728J4044
14656E868J3599n14k6812k1463P070K2390j2205k4091K3476M0476K74j3619k7185
14643a2736m216N790L048J4145j40L71J765R86J094k1893l693k5944Q865m119
14629c6677Q499K9906K0111M369k4446j5336M351j6734J0153M6071K6181k830
14617E3618o537K263k5752j7179l942J0870J812k279j1142P439q454p432l835
14604a0550m84R633n475R019m849q602l302o26k4642K671J3624l515k2613J3955
$$ plain form
14694 -41631 -42345 -6509 17018 15733 -36518 -39978 -22254 -14713 -2002 8341 8732 -6517 -24337
14681 -24337 -9642 29972 44194 13492 -2450 24350 37152 2463 -26768 -3238 6989 11456
14669 11456 -6977 -40509 -37760 -17984 -15596 -21712 -14640 -21594 -2811 -14893 -12904 -8176 5868
14656 5868 19467 18953 -7859 -29322 -22252 138 -12067 -36158 -12682 27794 28068 14449 -12736
14643 -12736 -16952 -11162 -8114 6031 5891 6262 8027 9013 10107 -11786 -15479 -41423 -32558 -36677
14629 -36677 -28178 1728 21839 26208 1762 -13574 -9223 -25957 -15804 30267 56448 53618
14617 53618 47081 49344 23592 6413 2471 13341 15153 12874 1732 9171 717 -6715 -10550
14604 -10550 -11034 -1401 -6876 2143 -2706 -11308 -14610 -15236 -39878 -37207 -23583 -27098 -49711 -35756
14590c5756K5848K1405J2220j0203k6792j8403M379q172L115K947Q790P178j6036
14577b9480J9124J1735N682l2558m0111J9801J8825o556k647K3189R270J0903
14565G177j5528j500j2919J5350m816L860j5956J5157J2707J2408k8957n404J7790
14552f31J6651j2172L125k245O707j1492j1984r700O24P671M308k8076o285K5059
14538a8440P102j1724K440J2423j1496M230K0391K213m068j5165J3151k367j5637
14525a6947k1212j6885o522j3506J3170K2886K8981m880J1564J5449N991k0929
14513b840j6587J9014j373N754l3373j7980j6591L1829R179j5512L949N684J961
14500b6886r290N557J0192j593L2853J7903l106k0854P748j0460k0990L958l277
$$ plain form
14590 -35756 -9908 11497 23717 13514 -13278 -31681 -27302 -35474 -32359 -29412 -20622 -13444 -29480
14577 -29480 -10356 1379 7061 -25497 -65608 -45807 -26982 -33538 -36185 -12996 -3726 7177
14565 7177 -8351 -9851 -22770 -7420 -12236 -8376 -24332 -9175 3532 15940 -13017 -18421 -631
14552 -631 16020 3848 6973 4728 11435 -57 -12041 -21741 -21117 -13446 -9138 -37214 -43499 -18440
14538 -18440 -11338 -23062 -20622 -8199 -19695 -15465 4926 7139 3071 -12094 1057 -1310 -16947
14525 -16947 -38159 -55044 -61566 -75072 -61902 -39016 -10035 -14915 -3351 12098 18089 -2840
14513 -2840 -19427 -413 -1786 3968 -29405 -47385 -63976 -32147 -22968 -38480 -34531 -28847 -26886
14500 -26886 -36176 -30619 -20427 -22020 10833 28736 25630 4776 12524 2064 -18926 -14968 -18245
14487a8245r418R210J4480R943j6995J351R083p282K1794j4607m184l935P455
14474a350J7430J6500Q13k1330K835J4677j3807j8476n911J8726J1880j8613k202
14461A172k7682m35J198P221J1907J9777j0179O841l371J3273k5380j2475J1156
14448f977K6218m500l268j230j1508o948J1058l593p460J5703l31P284K1733J0073
14434D6254l0682k3397j658k594J0939J6857o698J0558k113R014k521K765N041
14421C1765k2898k2442N422P13P117K1158k300j4723M881O154o424j1435k8120
14408c1132K9488M171R274J402j0665k015o94R18l282r143k0161O865j4188Q392
14394c0770o957K953K2713L3296M580k0333m305m516m0254n103R015J5524K6542
$$ plain form
14487 -18245 -27663 -18453 -3973 5970 -11025 -9674 -591 -7873 13921 -686 -4870 -8805 -1350
14474 -1350 16080 32580 33393 12063 14898 29575 15768 -2708 -8619 10107 21987 3374 1172
14461 1172 -26510 -26945 -25747 -18526 -6619 13158 2979 9820 6449 19722 -5658 -18133 -6977
14448 -6977 19241 14741 11473 10243 -1265 -8213 2845 -748 -8208 7495 7164 14448 36181 46254
14434 46254 15572 -7825 -9483 -12077 -1138 15719 9021 19579 17466 26480 23959 26724 31765
14421 31765 8867 -13575 -8153 -7440 -323 20835 18535 3812 8693 14847 8423 -3012 -31132
14408 -31132 -1644 2527 11801 13203 2538 523 -171 747 -2535 -11678 -31839 -24974 -39162 -30770
14394 -30770 -37727 -34774 -12061 21235 25815 5482 1177 -3339 -43593 -48696 -39681 -24157 2385
14381B385J0415k915p098m208K066p833j17j784J3925l188j0892J1284J3078J7287
14367C2405r305j9943Q904L3740P699j8391k2310k900K3662R247M424j4988j9923
14354A2321j0437p002K9941O30J684j352L480j5047P438r773k562P729K091k1241
14340b100j1031j2049L562J9876n078q07L0338K6492M024j8739j202P436l474
14327C7248l1366k2246l598j734J613M609o168r123J501K1444L1223R401j667
14314C1137n341n474K2607J0850L094j3253j900l3194m3978o662K4597r548j341
14301b8406K6277o078r923L033J9429J4481O26n630P47j316j0954j755l162m95
14287c126l4804k6786L3049K9942K358P073L5235J6647k435j5142m730J1862Q183
$$ plain form
14381 2385 12800 9885 2787 -1421 645 -7188 -7305 -9089 4836 1648 -9244 2040 15118 32405
14367 32405 23100 3157 12061 45801 53500 35109 12799 9899 33561 42808 47232 32244 12321
14354 12321 1884 -5118 24823 25453 27137 25785 29265 14218 21656 11883 9321 17050 19141 -2100
14340 -2100 -13131 -25180 -21618 -1742 -6820 -7627 22711 49203 53227 34488 33286 40722 37248
14327 37248 5882 -16364 -19962 -21696 -20083 -15474 -21642 -30765 -29264 -7820 23403 32804 31137
14314 31137 25796 20322 42929 53779 56873 43620 41720 8526 -35452 -42114 -17517 -27065 -28406
14301 -28406 -2129 -8207 -18130 -15097 4332 18813 19439 13809 14556 13240 2286 531 -2631 -3126
14287 -3126 -37930 -64716 -31667 -1725 633 7706 42941 59588 57153 42011 37281 49143 57326
14274E7326q449k8098q465J0718K022l111M0367J780j2917l70R19L889Q186r47
14260F2850l1884o03N180j8650p680n445P946q672J546m535p297N116K0603m164
14246A4311o002n585q613R129p547K985L057O414l094j8001R944k10J4199J4144
14232B5131k8983k7759J4114j7916J2245L1751k4534l441J1814p804j2008J4704
14220a2686N057l8560Q238J4684K0099J2621M848k1188j2410J15K0076l836j4092
14207a7034K1830j636j178L580J9894K8183k2503j9135o662j0556l0949k078P954
14194c0290L8578J3362l2996O088K337l5584p171J3873L662M654J0317Q405j1936
14181a6701J3897R9k0479j4650J772j1381J3819K8185J7014Q31j7705p327j84
$$ plain form
14274 57326 48877 20779 12314 23032 25054 21943 62310 64090 51173 50803 51722 55611 63797 62850
14260 62850 30966 30363 35543 16893 9213 3768 11714 3042 4588 53 -7244 -2128 18475 14311
14246 14311 8309 2724 -5889 3240 -4307 -1322 1735 8149 5055 -12946 -3002 -3212 10987 25131
14232 25131 -3852 -31611 -17497 -35413 -23168 8583 -15951 -19392 -7578 -15382 -27390 -12686
14220 -12686 -7629 -46189 -37951 -23267 -3168 9453 14301 -6887 -19297 -19182 894 -2942 -17034
14207 -17034 4796 3160 1982 5562 25456 53639 31136 12001 5339 -5217 -36166 -38244 -30290
14194 -30290 8288 21650 -11346 -5258 -2921 -38505 -45676 -31803 -28141 -23487 -13170 -4765 -16701
14181 -16701 -2804 -2705 -23184 -37834 -36062 -47443 -33624 -5439 11575 12406 -5299 -12626 -12810
14168a2810R556m094m595P922J2257K082k7394p616R837k9702o684J7529J6752
14155a6960L360K409o007P114o916J1543J7391k653J81L624j861p991Q033k5220
14141a3953j4242N736L7460J6036l1414j3038r122p707K149O312P907J8811o725
14128a790k912R393J5527j2979k7477k9634m386J5326j3877L485L3993J0654j1956
14115a6633j786k3926L953J6151N535L850J7304J3829o65k0094J3825R218l98
14102B0163k79k0002k1291J8236K5133R232o303k3744k809l242r4R873K5957Q003
14088C8833k2959k5510j0812J5525J3630J9848n135M454K4158m124j5400O845
14076C9353m70k0978J2589K1440j7648l8274O998o660k0101J4878n053J4330O079
$$ plain form
14168 -12810 -3254 -7348 -11943 -4021 8236 10318 -17076 -24692 -14855 -44557 -51241 -33712 -16960
14155 -16960 -13600 -11191 -17198 -10084 -17000 -5457 11934 9281 9462 13086 11225 3234 11267 -13953
14141 -13953 -28195 -22459 15001 31037 -377 -13415 -22537 -30244 -28095 -21783 -13876 4935 -1790
14128 -1790 -4702 4691 20218 7239 -20238 -49872 -54258 -38932 -52809 -49324 -15331 -4677 -16633
14115 -16633 -18419 -42345 -38392 -22241 -16706 -12856 4448 18277 17612 -2482 11343 20561 20163
14102 20163 19884 -118 -21409 -3173 21960 31192 24889 1145 -1664 -4906 -5000 4873 30830 38833
14088 38833 15874 -9636 -20448 -4923 8707 28555 23420 27874 52032 47908 32508 39353
14076 39353 38883 17905 30494 51934 34286 -3988 3010 -3650 -23751 -8873 -13926 404 6483
14063F483M89o954O331n19Q926J1155k6180j5725J4728k819k920J6992K847k0359
14049g525k4386m980L8070K2208n423j1150j0932O601J3578q397j3539K1432M760
14036B0317N209J5738j8037m5801l9152J6883J143j2J1850K904k457J4641j368
14023a8142o957j7780L226J3737J3427J0291K3943P235J9074k5787m9871j3068
14011d0672j807k231p330K1479K2330K696J940n557j198j8984K9395O20l3852
13998c3171m27J8667J8632J1389j4705o161J643J126J7410r390k8140j1725j5871
13985e0723J6595L9836K0862k6412n116K167R205N732j2331P940J1792K3609J6304
13972E9460m8826j8716O036j0640j2362K277l317J4089J9912m729l5187j00M5739
$$ plain form
14063 6483 6972 18 6349 5830 14756 25911 -269 -15994 -1266 -4085 -7005 9987 12834 -7525
14049 -7525 -31911 -36891 1179 23387 17964 6814 -4118 2483 16061 7664 -5875 15557 20317
14036 20317 25526 41264 23227 -22574 -61726 -44843 -43700 -43712 -31862 -28958 -31415 -16774 -18142
14023 -18142 -25099 -42879 -39653 -25916 -12489 -2198 21745 28980 48054 22267 -27604 -40672
14011 -40672 -42479 -44710 -52040 -30561 -8231 -5535 -3595 -9152 -10350 -29334 61 681 -33171
13998 -33171 -33598 -14931 3701 15090 385 -5776 -4133 -3007 14403 5013 -23127 -34852 -50723
13985 -50723 -34128 5708 26570 158 -4958 -2791 6414 12146 -185 7755 19547 43156 59460
13972 59460 10634 -8082 -2046 -12686 -25048 -22771 -26088 -11999 7913 3184 -32003 -32103 13636
13959A3636L0156j3747k134j0075K81q359k1526j6739J9255J961m009J3908R643
13946A2251n051N105j7154k4900O999K416J4246L5907M842Q894R946j9401k4050
13933A0050k047k414k3941O362K5319j1399k0816j2077O403J4715J4540p634l2673
13920c5612O294L3144K4079j6724k9553K150J4515m43j7296N702J4831j2694P772
13907c835j399P194K3814j022k0312K0360j427L849j6834Q998O978J5162J9033
13894F0559N083j2694r458l0015j9994J702R726J4474q827p215J4982P514p760
13881A8077q668k4220r349J1264K8130J5486N96j9406r940O653J2146O677k093
13868B5353k5864o476J2565J2170j0679J8825q896l3081k436J1553J9582L3580
$$ plain form
13959 13636 43792 30045 27911 17836 18117 9758 -11768 -28507 -9252 -7291 -11300 2608 12251
13946 12251 7200 12305 -4849 -29749 -22750 -20334 -6088 29819 34661 43555 53501 34100 10050
13933 10050 8003 5589 -18352 -11990 13329 1930 -18886 -30963 -24560 -9845 4695 -2939 -35612
13920 -35612 -29318 3826 27905 11181 -18372 -16222 -1707 -2150 -19446 -13744 1087 -11607 -3835
13907 -3835 -5234 1960 25774 24752 4440 24800 23373 27222 10388 19386 26364 41526 60559
13894 60559 65642 52948 43490 13475 -6519 -4817 4909 19383 10556 3341 18323 25837 18077
13881 18077 9409 -14811 -24160 -12896 15234 30720 31316 11910 1970 8623 20769 27446 25353
13868 25353 -511 -6987 5578 17748 7069 25894 16998 -16083 -18519 -6966 12616 46196
13856D6196J3372l6185k8992Q049k074k660j3929j6969M140J3402K3749j7318
13844i219R899K084k6500k586J0653R809J3317k1640j3169P291L938J0754R228
13831C859j0721j5607r998J2364m763p955K3524J5457j577Q625o670N119K1282
13818C2939j8423K795j8278k9075J2110J2131q94J7656J5307j0028p284j2463
13806c507Q419K3603R636k976n606l422k765J710J3854Q854k4526k4169q770k549
13792a2214K534M3657J992J2670j652k0060j7328O121J1042k4429j0907q572Q209
13779h937J9248P658N023P725n806k4900k9706J1826j2685j6863J7942j0272R971
13766b9776Q476j889k3292k998O787N837J9033O537K795j0554J0610J8125K4212
$$ plain form
13856 46196 59568 23383 -5609 2440 366 -2294 -16223 -33192 -29052 -15650 8099 -9219
13844 -9219 680 2764 -23736 -26322 -15669 -5860 7457 -14183 -27352 -20061 -16123 -5369 3859
13831 3859 -6862 -22469 -32467 -20103 -24866 -32821 -9297 6160 4583 13208 6538 11657 32939
13818 32939 14516 17311 -967 -30042 -17932 -5801 -6695 10961 26268 16240 8956 -3507
13806 -3507 4912 28515 38151 35175 29569 26147 23382 25092 38946 47800 23274 -895 -9665 -12214
13792 -12214 -9680 33977 35969 48639 46987 26927 9599 15720 26762 2333 -8574 -17146 -8937
13779 -8937 10311 17969 22992 30717 24911 11 -29695 -17869 -30554 -47417 -29475 -39747 -29776
13766 -29776 -21300 -23189 -46481 -49479 -42692 -36855 -17822 -11285 -8490 -19044 -8434 9691 33903
13753C3903j2524L071O637j5574k3208n061J1647J1770p409J655k23N566J6793
13740B7043J2165j4836j7469j3646M786O210J8315J4658K0297j9116l7746M382
13728E043J6994m359R269k1386J1852K011p216J0704M000j8476m0579k5646K6841
13715c0948J1378N519K0271N306j7567j6110J0773K1451Q003k5358J4748J1717
13703A9183q286j1096k8914k4586J80K3947M2091o139j960k9319O576P06n475
13690b3092Q672K9980j0539k1496L2807K3027k1461P69j86n916K405L083j5257
13677B796j904r284l49j593K0833L380j5733m160q227K6048J1816r815j6182L889
13663A515Q126j8281Q873n090j4126j5258O617M8122j0624q181J0442L668J130
$$ plain form
13753 33903 21379 24450 31087 15513 -7695 -12756 -1109 10661 3252 4907 4684 10250 27043
13740 27043 39208 24372 6903 -6743 -1957 4253 22568 37226 57523 38407 661 5043
13728 5043 22037 17678 26947 5561 17413 19424 12208 22912 26912 8436 -32143 -57789 -30948
13715 -30948 -19570 -14051 6220 11526 -6041 -22151 -11378 10073 18076 -7282 7466 19183
13703 19183 10897 -199 -29113 -53699 -53519 -29572 12519 6380 4420 -24899 -18323 -17617 -23092
13690 -23092 -14420 15560 5021 -16475 16332 39359 17898 18667 18481 12565 14970 18053 2796
13677 2796 892 -8392 -8741 -10334 10499 13879 -1854 -6014 -14241 11807 23623 13808 -2374 1515
13663 1515 9641 -8640 233 -4857 -18983 -34241 -27624 20498 9874 1693 12135 15803 16933
13650A6933j0357j2627K501J2631r124P674N105N54k401j029j6709K6599Q859
13637B8609n547j4426l1841j7359r08J7431J3741j5707l180l073J4105J5096l093
13624f152J0975J0412P0j7891j425J6333r101j0503J411l063K470L459j6742k5987
13610d5734K1875K1862m516j0042O687K391J1j3267J8165M128k3665j2286j747
13597c6138N031J2720L1806J0661k1543K298K1050o173O40J0636j541l921O666
13584C2192M814J872J3273j0906l077O575j9075P672L100J5724p967j856l550
13571C8791p993O987l979k9563j8266p30J5531K8133O501P729l328l2649M721
13558A1885N465J3090L0057l1322m0586M875J8297N744j966j8324K8024J8569
$$ plain form
13650 16933 6576 -6051 -3550 9081 -43 7631 12736 13290 10889 9860 -6849 19750 28609
13637 28609 23062 8636 -23205 -40564 -41472 -24041 -10300 -26007 -29187 -32260 -18155 -3059 -6152
13624 -6152 4823 15235 15305 -2586 -4011 12322 3221 -7282 -5871 -8934 -6464 -3005 -19747 -45734
13610 -45734 -23859 -1997 -6513 -16555 -9868 -7477 -7466 -20733 -2568 1560 -22105 -34391 -36138
13597 -36138 -31107 -18387 13419 24080 2537 4835 25885 19712 20352 30988 29447 25526 32192
13584 32192 37006 38878 52151 41245 38168 44743 25668 33340 36440 52164 44197 42341 38791
13571 38791 30798 37785 33806 4243 -14023 -14753 778 28911 35412 43141 39813 7164 11885
13558 11885 17350 30440 60497 29175 -11411 -6536 11761 17505 15539 -2785 25239 43808
13546D3808k5287l0453k2314J2472J0686p434j6024m811M231L4004J0087j5357
13534f392O172K8955O63k5959j0262J161j3115k522O919r293K0985J4262k653
13521H921k1836R873k0965r975K3483N465k049J743J1306J2587P601L788j0838
13508A9104k8187n676j65J5796K0226j82k0969K047j0072m56J1389j8934l1480
13495d7559k1785J4271N569J7809R580Q237J1349O037o770j1342j8149J1837M4453
13482B3537j343j2765q200J4658r450L265J4016j7162q903J2110k033j7513k737
13469a2520j984J6116j1132o888J9108K2653J7436j3529k5528k078j1816O884
13457c278J9863o316k6635p208J5243O272P094n062k6800N112j1768j9413J8101
$$ plain form
13546 43808 18521 -11932 -34246 -21774 -11088 -18522 -34546 -39357 -35126 -1122 8965 -6392
13534 -6392 -220 28735 29398 3439 -6823 -5662 -18777 -21299 -14380 -23673 -2688 11574 8921
13521 8921 -12915 -3042 -24007 -33982 -10499 -5034 -7083 -5340 5966 18553 26154 29942 19104
13508 19104 -9083 -14759 -14924 872 21098 20916 -53 1994 -8078 -8534 2855 -16079 -47559
13495 -47559 -69344 -55073 -49504 -31695 -22115 -13878 -2529 3508 -3262 -14604 -32753 -20916 23537
13482 23537 22194 9429 1229 15887 6437 9702 23718 6556 -2347 9763 7730 -9783 -12520
13469 -12520 -14504 1612 -9520 -16408 2700 25353 42789 29260 3732 1654 -10162 -3278
13457 -3278 16585 10269 -16366 -23574 -8331 -2059 5035 -27 -26827 -21715 -33483 -52896 -34795
13444c4795m638J0635M8530K7570p370j9467k3303k5625k619J0621L0770J3432
13432B3741J0039n975j3029l40j9728j725J2595j4826n266m0179j1082J0875K5520
13419b9380J0975L417N223K6768o43r405K3354q574M36l9871k9262J1142K67K8938
13405f615J7104J1805l3092j5401K1812K010r81j3220J617J9630q453k2041J7270
13392h555R419L2967J4653k2445l6720M155K2470J6799N87k4167k4043J4188J501
13379H09j2277p497J6004j7923j0605N620N393J1271j3276q608J5912M400Q817
13366a960K4414p089k205j9248M758J2841Q164J0814k5217k0129J1761J6138q132
13353D910j033P244L775k0583j5831J4347J9399k2355r482J0188L5197r946j2779
$$ plain form
13444 -34795 -39433 -28798 19732 47302 39932 20465 -2838 -28463 -31082 -20461 10309 23741
13432 23741 33780 27805 14776 14436 -5292 -7017 5578 -9248 -14514 -54693 -65775 -54900 -29380
13419 -29380 -18405 -14988 -9765 17003 16360 6955 30309 21735 22171 -17700 -46962 -35820 -35553 -6615
13405 -6615 10489 22294 -10798 -26199 -4387 -2377 -3358 -16578 -14961 4669 -3784 -25825 -8555
13392 -8555 864 33831 48484 26039 -10681 -6526 15944 32743 33330 9163 -14880 -692 809
13379 809 -11468 -18965 -2961 -20884 -31489 -25869 -20476 -9205 -22481 -31089 -15177 -10777 -1960
13366 -1960 22454 15365 13160 -6088 -1330 11511 19675 30489 5272 -14857 -3096 13042 4910
13353 4910 3877 11121 14896 -5687 -21518 -7171 12228 -10127 -19609 -9421 25776 15830 3051
13340C051R374j690r00k9350m963K226K7863J4301K198k7259R123K379R743q781
13326G315N245q174p167J1057O126o478l3880k078J6078M504J8344J1897l5610
13313a2821q386K5840j0814p035r787K0414j3156k6947Q652K3461J4494J5309
13301A9224j1338m779K8491j0472j2200K1776J4047j0274k1366P284n50k877M80
13288A7446J5547j2138j5259r380j1013R650K1870L2363J8229k506k6440q052
13276C0317n007k6807j7501K5984P086l1924k087q004K46j37L297o513J4441O080
13262a0529l652L7156K1854l0986j9261J1716n195K841j5514j8793M699J9392
13250f272J5991J168m325M49K55J173n109J502L075N144n076J1700j5640j1332
$$ plain form
13340 3051 12425 10735 9835 -19515 -24478 -22252 5611 19912 22110 -5149 3974 6353 16096 7315
13326 7315 12560 4386 -2781 8276 14402 7924 -25956 -28034 -11956 -7452 10892 22789 -12821
13313 -12821 -21207 4633 -6181 -13216 -23003 -2589 -15745 -42692 -34040 -10579 3915 19224
13301 19224 7886 3107 31598 21126 8926 30702 44749 34475 13109 20393 19843 16966 17446
13288 17446 32993 20855 5596 -3784 -14797 -5147 16723 49086 67315 64809 38369 30317
13276 30317 25310 -1497 -18998 6986 14072 -17852 -19939 -27943 -27697 -27834 -24537 -31050 -16609 -10529
13262 -10529 -14181 22975 44829 13843 -5418 6298 1103 3944 -11570 -30363 -25664 -6272
13250 -6272 9719 10887 6562 7011 7266 8439 3330 4832 7907 13051 7975 19675 4035 -7297
13236g297m176n396O864J6326j072j6353o129K650J5424q463n550m668J031Q817
13222g992k4024j4147N5148L88j1055J3488K258k7762P305K07j7260k0702k8132
13209g2280o072J7304o420K266L6425N122j7114j4880m683Q198K7657Q34R606
13196a4037Q875r012O133K1853J068j0390j8317Q922r289j118j90K2935L0260
13183C7693J8170J1039o674j8419j4553J0149L353n572k2825r645O423k6404J8340
13170A075j9620k4876L5281j1041n725j5902p460J4804K3482n458P147L8892J1208
13157D1807k2131j9933L10P637J4529j7810j1347R839j4851J698q977N135J8729
13144D635K0900j6441j8862j4359o191J9326J6698J0719K8348j8884k2276J8087
$$ plain form
13236 -7297 -11473 -16869 -10005 6321 5249 -11104 -17233 -14583 841 -7622 -13172 -17840 -16809 -7992
13222 -7992 -32016 -46163 8985 9373 -1682 11806 14064 -13698 -6393 -6186 -23446 -44148 -72280
13209 -72280 -78352 -61048 -67468 -65202 -28777 -23655 -40769 -55649 -60332 -52134 -24477 -23643 -14037
13196 -14037 -5162 -14174 -8041 13812 14880 4490 -13827 -4905 -14194 -15312 -15502 7433 37693
13183 37693 55863 66902 60228 41809 27256 37405 40758 35186 12361 2716 9139 -17265 1075
13170 1075 -18545 -43421 -8140 -19181 -24906 -40808 -48268 -33464 -9982 -15440 -8293 30599 41807
13157 41807 19676 -257 53 7690 22219 4409 -6938 2901 -11950 -10252 -19229 -14094 4635
13144 4635 25535 9094 -9768 -24127 -30318 -10992 5706 16425 44773 25889 3613 21700
13132B1700K5570k810j9630j9274J0740q780N39J2981k8183m8N17J779Q529N125
13118H755J3560r3j0697J2724K0277j4732j9501j9694O2J7830R446j323j8130
13105a516j3847K944M961J0711J3834N375K81R868M78j0046M212k131r732r826
13091E566j9830q509j3531J069J8244J1532J0254L933J2903L833n27k816L283
13078B5404m011p555k459J2576j5708k135J1144j1680k2841j7679J1333J4400
13066i211R411j1232J1719K913m623P123K0100p294j843Q204j4607O404j9547
13053b483J3532J6856K0684j4140m7110r283l982j4483K9156M1699O249o824j1864
13040A8007r015j7187P472K4512J455l077L23j6969j2005k5391K4483J8149R608
$$ plain form
13132 21700 47270 44460 24830 5556 16296 7516 8055 21036 -7147 -7195 -6678 -4899 3630 8755
13118 8755 22315 22222 11525 24249 44526 29794 10293 -9401 -9339 8491 17937 16614 -1516
13105 -1516 -15363 -12419 -7458 3253 17087 22462 22743 32611 33089 23043 27255 25124 15392 5566
13091 5566 -14264 -22773 -36304 -35235 -16991 -5459 4795 8728 21631 25464 24937 22121 25404
13078 25404 21393 13838 11379 23955 8247 6112 17256 5576 -17265 -34944 -23611 -9211
13066 -9211 200 -11032 687 3600 -1023 6100 26200 18906 17063 25267 10660 17064 -2483
13053 -2483 11049 27905 48589 34449 -12661 -21944 -25926 -40409 -11253 30446 36695 29871 18007
13040 18007 8992 -8195 -723 23789 25244 22167 22490 5521 -6484 -31875 -7392 10757 20365
13027B0365r614j1819J981k1003k2587M4172L8983J2300j7302k1624o118j438
13015F296l51J6229J3740k6859l2226J4117K1220j0923k2421l3516k1714J8042
13003e8366K918K5507K7602J5916j7909j9619M201J8963J297p620j2059K435O790
12990i944j7734j0480J1832J5036L78k2747p482J0857J5936k909k8975j1373o712
12977f4317L6250J4494Q309q601q518K253k6422K4339K8312J1506L6488j9940
12965C4153m0675l2M227j5948j7400J6770j0712N5052K9848j2744q685l7440j9809
12952b3395O798N374l138J8412k4164n504J2440j9701Q432K2487L019J762K276
12939E098m163k2812o225L1690J2909J0901k0295j3449K506J6478J3823L743k0006
$$ plain form
13027 20365 10751 -1068 913 -20090 -42677 1495 40478 52778 35476 13852 7734 6296
13015 6296 5945 22174 35914 9055 -23171 -9054 12166 1243 -21178 -54694 -76408 -58366
13003 -58366 -55448 -29941 -2339 13577 -4332 -23951 -19750 -787 510 -7110 -19169 -16734 -9944
12990 -9944 -27678 -38158 -26326 -11290 -10912 -33659 -41141 -30284 -14348 -17257 -46232 -57605 -64317
12977 -64317 -28067 -13573 -5264 -13865 -22383 -20130 -46552 -22213 6099 17605 54093 34153
12965 34153 -6522 -6554 -2327 -18275 -35675 -18905 -29617 25435 55283 42539 33854 -3586 -23395
12952 -23395 -16597 -11223 -14361 4051 -20113 -25617 -13177 -32878 -24446 -1959 1060 2822 5098
12939 5098 935 -21877 -28102 3588 16497 27398 7103 -6346 -3840 12638 26461 30204 10198
12926A0198k7063j4288j6617K2338K6572j0354j574n529n642N385R668j957L381
12913e482M856J6957o948n729J1251j0953k6055l436J0821L5731J7038Q324m381
12900D1994K3130j6025k2951j1762J9640j0944l8190k6897o362J4145J9969j4187
12888b8440j6962J1043M6226K4280J4677j1204j1387k2294J352J7388R777j5639
12876A8817Q47j6333q710R220M630J9004j6251j2843j4384J3727k476k3734J381
12863b7105n06P352J4349j6690L045k446J7996N70n3j0807K642N171n537j0793
12849b2812P255K2297m245j3213J5422L915o318j9457Q445K6480k3548k9058N982
12836b8855K6668Q731J0748k76k4962q123j1669n706J0418j1019n39j1107K6286
$$ plain form
12926 10198 -16865 -31153 -47770 -25432 1140 -9214 -10788 -16317 -21959 -16574 -6906 -8863 -5482
12913 -5482 -626 16331 9383 3654 14905 3952 -22103 -25539 -14718 21013 38051 46375 41994
12900 41994 65124 49099 26148 14386 34026 23082 -15108 -42005 -48367 -34222 -14253 -28440
12888 -28440 -45402 -34359 11867 36147 50824 39620 28233 5939 7291 24679 34456 18817
12876 18817 19664 3331 -5379 3841 8471 27475 11224 -1619 -16003 -2276 -4752 -28486 -27105
12863 -27105 -27611 -20259 -5910 -22600 -19555 -22001 -4005 -3435 -3488 -14295 -11653 -6482 -12019 -22812
12849 -22812 -15557 6740 2495 -10718 4704 8619 2301 -17156 -8711 17769 -5779 -34837 -28855
12836 -28855 -2187 6544 17292 17016 -7946 -16069 -27738 -33444 -23026 -34045 -34584 -45691 -19405
12823a9405O486q50J7722j176l4344o107j2084l154J5574K4525J0800j1575M868
12810h720R423K66j1955j6660J6011K7050J3847j9620j8166o31J1113n400K4590
12797B1148J4779l904n352J2195Q389k6422j8008p427J4667J7218j2762l0318
12785a5797k5776K4487j182R932j2342o017L3078N1589n583k5414Q359k4976j4266
12772c908K6642K1621j779j6897k2743k5929k0994J396K3295J2033K2054R916
12760B4707J1691q588j9343p634L265J5972M013k3122j199p969m824J5150J2395
12747A4514L615j6567j5592j2214q921J7599J3219K1429O686j8075l5150K6670
12735b787K6739O69m189o258J8334n114l9403k4839k4136J651j2015K0273K0536
$$ plain form
12823 -19405 -12919 -13769 3953 2777 -31567 -37674 -49758 -52912 -37338 -12813 -2013 -13588 -8720
12810 -8720 703 969 -10986 -27646 -11635 15415 29262 9642 -8524 -9155 1958 -3442 21148
12797 21148 35927 32023 26671 38866 47255 20833 2825 -4602 10065 27283 14521 -15797
12785 -15797 -41573 -17086 -18268 -8336 -20678 -26695 6383 57972 52389 26975 35334 10358 -3908
12772 -3908 22734 44355 42576 25679 2936 -22993 -43987 -42591 -19296 -7263 14791 24707
12760 24707 36398 27810 8467 833 4098 20070 24083 961 -238 -8207 -13031 2119 14514
12747 14514 18129 1562 -14030 -26244 -35165 -17566 -4347 17082 23768 5693 -29457 -2787
12735 -2787 23952 24621 20432 14174 32508 27394 -12009 -36848 -60984 -59333 -71348 -51075 -30539
12722c0539J1760p484p091J1640k209J8510J0586R366Q733j5957j7452L037R623
12709B523k924l512n476k226N60j5796n641j4708j3430j0101K3438M3608j1400
12696a5085J0820l413j9387p510j7853R970K6506j0105k3881K1813L2926K5086
12684B9887J7709M065j7572j8145k738Q092j0743j1166j1289K2843L4449j9962
12672B5430k1032k0632J4041J4823q259J4511J478N200j697K4903L2526N08k9381
12659E2419m1022K345m185P18P043J4591L589k3091j0027j0947J0197j4622j7866
12646c0858Q441j0148k5220J3446L4418K1450o083k2612N050J9884L1456o874
12634C2350j6969O222m515l3122j4341L0869P318j8971P947p174o878K900J0625
$$ plain form
12722 -30539 -18779 -26263 -33354 -21714 -23923 -5413 5173 14539 23272 7315 -10137 -7100 2523
12709 2523 -401 -3913 -9389 -11615 -11055 -26851 -32492 -47200 -60630 -70731 -47293 -3685 -15085
12696 -15085 -4265 -7678 -27065 -34575 -52428 -42458 -15952 -26057 -49938 -28125 4801 29887
12684 29887 47596 51661 34089 15944 13206 21298 10555 -611 -11900 10943 45392 25430
12672 25430 4398 -16234 -2193 12630 4371 18882 20360 25560 23863 48766 81292 81800 52419
12659 52419 11397 13742 9557 10275 17318 31909 35498 12407 2380 -8567 1630 -12992 -30858
12646 -30858 -22417 -32565 -57785 -44339 -9921 11529 5446 -17166 -12116 7768 39224 32350
12634 32350 15381 21603 17088 -16034 -30375 494 7812 -11159 -3212 -10386 -17264 -14364 -3739
12621c739J7466L508n936O523l944p698k085L982J2659L950L264q815k0098j1098
12607a2061Q75J3119J1065j6196K1827R301O924q315r495m33M641L592p907J5841
12593C2778J3427j9184M474L498o994k094n950m436k0439j1420J8498K4715J9977
12580D6850R435J6062n921m8303k3887M656J1621J319J1411j1236Q705O97l2624
12567a1215k1612M931m716R504J3921J5328Q241J7105o360P339l017k0941J472
12554I980P251J0674m122m401M244Q805p251M456p782l0748J229J0070R302k4383
12540a2676k9212L775L0784J378J1744j7656L6612J0382Q892R875M361j1156k9917
12527A7186j981J4551Q900k3137m691k4212j6958j3087k1979M225M2430J5629
$$ plain form
12621 -3739 13727 17235 11299 17822 13878 6180 4095 8077 20736 24686 27950 19135 -963 -12061
12607 -12061 -11186 1933 12998 -3198 18629 27930 34854 26539 17044 16611 21252 24844 16937 32778
12593 32778 46205 27021 31495 34993 27999 25905 19955 15519 -4920 -16340 2158 26873 46850
12580 46850 56285 72347 66426 18123 -5764 -1108 10513 11832 23243 12007 20712 21409 -11215
12567 -11215 -32827 -27896 -32612 -23108 -9187 6141 14382 31487 25127 32466 29449 8508 9980
12554 9980 17231 27905 23783 19382 23626 32431 25180 29636 21854 -8894 -7665 2405 11707 -12676
12540 -12676 -41888 -38113 -7329 -5951 5793 -11863 24749 35131 44023 53898 58259 47103 17186
12527 17186 15205 29756 38656 15519 10828 -13384 -30342 -43429 -65408 -61183 -18753 -3124
12515c124m601J0613o883l4015n993K6922L1622o762O96J9216p380k6004j6469
12502b2162j0614J8322k155p277J6989J7939J3019R577J4556j7604j9867P641
12490A8364O356j0379j4106q273Q77M111J3303N954j5307j857J7092j7196p740
12477h801j3095j7723J6712K5653N5k2892j0124M014R991K0096J7943j3537j434
12464F858k2615k5277Q108N472k6569K2574N213J100j9584M668O032J8493k5296
12451d0823J7520P658O231k846Q42j9939j8590J0975J3921J4990j330j3463m296
12438b9150K744J2044l787J2291n978J1633L0809K9298n063j5340k5787m3403
12426b9689j3411L5757P444k6180Q187L2244J2169k381K498N443K6598k3554p342
$$ plain form
12515 -3124 -7725 2888 -3995 -38010 -44003 -17081 14541 7779 8475 27691 20311 -5693 -22162
12502 -22162 -32776 -14454 -16609 -23886 -6897 11042 24061 33638 48194 30590 10723 18364
12490 18364 24720 14341 235 -8038 -7161 -3050 10253 16207 900 -957 16135 -1061 -8801
12477 -8801 -21896 -39619 -22907 2746 2801 -20091 -30215 -26201 -16210 3886 21829 8292 6858
12464 6858 -15757 -41034 -32926 -27454 -54023 -31449 -26236 -25136 -44720 -40052 -34020 -15527 -40823
12451 -40823 -23303 -15645 -9414 -12260 -11418 -31357 -49947 -38972 -25051 -10061 -11391 -24854 -29150
12438 -29150 -26406 -14362 -18149 -5858 -11836 -203 30606 59904 54841 39501 13714 -29689
12426 -29689 -43100 -7343 101 -26079 -17892 14352 26521 24140 26638 32081 58679 35125 27783
12413B7783n658l209l005k5394q987J2730J0108K1849J1200l2339j2461J5325
12401G942n96J8142r811j0965j3285o947L287J448k0431j0692K7620L9474o159
12388A9027P261Q31j1912J4931L442j7754j0459q729n488J1025N810l627J3142
12375A7500j3326J2214R30l5347r632J190k2278K831K7652J8769J3886J4483o108
12362B2764o118k814k4781P144J6760j8134K0141L652j9532P30J7668m032o068
12349G380R575k4107J4442j422l4360m044O779M254M380M3912K5120j4804l2350
12336D755j5857k4928K670K1395l72M305j9430m605K1572j4k8939j6296n800J6734
12322d4810K6727L4251O37o963j3894L511K3724j1125K4407J9268j6864j7442
$$ plain form
12413 27783 22125 18916 15911 -9483 -18470 -5740 4368 26217 37417 5078 -7383 7942
12401 7942 7346 25488 15677 4712 -8573 -15520 -12233 -10785 -31216 -41908 -14288 25186 19027
12388 19027 26288 27119 15207 30138 33580 15826 5367 -3362 -8850 2175 7985 4358 17500
12375 17500 4174 16388 17318 -18029 -27661 -26471 -48749 -45918 -18266 503 14389 28872 22764
12362 22764 16646 13832 -10949 -3805 12955 -5179 14962 18614 -918 -188 17480 13448 7380
12349 7380 16955 -7152 7290 5868 -28492 -32536 -25757 -21503 -17123 26789 51909 37105 4755
12336 4755 -11102 -36030 -33360 -11965 -12337 -8032 -27462 -32067 -10495 -10509 -39448 -55744 -61544 -44810
12322 -44810 -18083 16168 16805 9842 -4052 -541 23183 12058 36465 55733 38869 21427
12310B1427R200J0753k3481j8964J6475k491r125J6355j4300k3739k339j9745
12298c9974j436M1766l093j0371K858L009k238m399P86M835R002J7531M24l3231
12284a4531p897L0599p8k0356K0318j3070l014n525J3611O119K7333K8773J9732
12271H2014M472k7376j4872j531m0639j5543j8700m46L1636K3035r139k4141j338
12258a2568J7020J8749j3774r837r621K7533L983K6927J0395P370l549j2634l1085
12245A8909l2332q43K1266j8693j0694K1097m517k6170j0970R263M550J0486M404
12232a4244J3988J864r451j4814K2037K2742o781k3371k5865K392q575j3950J9773
12219c4255L2590j8720j3482r945N211K1580K4216J9289J6948J2296l4525k0908
$$ plain form
12310 21427 30627 41380 17899 -1065 15410 12919 3794 20149 5849 -17890 -20229 -39974
12298 -39974 -41410 356 -2737 -13108 -10250 -7241 -9479 -13878 -13092 -8257 745 18276 18700 -14531
12284 -14531 -22428 8171 8093 -12263 8055 -5015 -8029 -13554 57 6176 33509 62282 82014
12271 82014 86486 59110 44238 42707 2068 -13475 -32175 -32621 -985 22050 12911 -11230 -12568
12258 -12568 4452 23201 9427 -410 -10031 17502 21485 48412 58807 66177 62628 49994 18909
12245 18909 -13423 -14266 7000 -11693 -22387 -1290 -5807 -31977 -42947 -33684 -29134 -18648 -14244
12232 -14244 -256 1608 -7843 -22657 -620 22122 15341 -8030 -33895 -31503 -40078 -54028 -34255
12219 -34255 -1665 -20385 -33867 -43812 -38601 -17021 7195 26484 43432 55728 21203 295
12207B95k179j1228j1935K8720K5255k5753r119K3657P123J170q324J0383Q866
12194C6931J0625j2542m5817j1466J1206j3306K181M1864L2680N644p103N521
12182E6418M754o181r696m8477m2521J4889K5725l823r885j5899m55k233Q527
12169b8857K737L813N679J7417N847p254n403n697R517J4571n157q364P800n710
12155I39j7929j5702J1192j2045r453J4818J0896J0416J540K4525J1070M527k1295
12142A3499J7170K804k1325l383j0104l95j8747K201K2501K0613K6094j767N020
12129E4181q213p597k3537k8021k4667L655l905j3343K4161J3441J4058m561J1111
12116F763n03O986O111k2250l8383j4638l3189J0656K8257J7484O034j1246l4033
$$ plain form
12207 295 -1884 -13112 -25047 3673 28928 3175 -5944 17713 24836 26006 17682 28065 36931
12194 36931 47556 35014 -10803 -22269 -11063 -24369 -22188 19676 52356 58000 50897 56418
12182 56418 61172 54991 45295 -3182 -45703 -30814 -5089 -8912 -18797 -34696 -35151 -37384 -28857
12169 -28857 -26120 -22307 -16628 789 6636 -618 -6021 -11718 -2201 12370 7213 -1151 6649 939
12155 939 -16990 -32692 -21500 -33545 -42998 -28180 -17284 -6868 -5328 19197 30267 34794 13499
12142 13499 30669 33473 12148 8765 -1339 -1734 -20481 -18280 4221 24834 50928 49161 54181
12129 54181 45968 38371 14834 -13187 -37854 -34199 -38104 -51447 -27286 -13845 213 -4348 6763
12116 6763 6260 13246 19357 -2893 -41276 -55914 -89103 -78447 -50190 -32706 -26672 -37918 -71951
12103g1951R401K5937o312N243M0855J8702J6610m430j3187n982k073m03j1367
12090A043p751j6919j2960P026J9810P829j2278l700O252k9940m450L6475J2195
12077B632j7267k560L6631R295k0536j4700k2797r724K5266L5994q654j1524j070
12064I86j2838l455O181M596J4234j8251j4306L40J5703J806k4988j9915k40J0658
12050c9489K5069K4482o032Q758j1503J6647J296J0211R806J571k9856J0790R041
12037C0791r521J0613k7653r968m49k833J2300J4056N084m0502J0369J3915N858
12024A2060K5873j1122j6405j1852P792m350l511j5635j1581J0251J9595j192
12012g7k2401o014K9601J5420O250j1269j0292Q160j4799k4849k0955M510L6981
$$ plain form
12103 -71951 -62550 -36613 -42925 -37682 3173 21875 38485 34055 20868 14886 12813 12410 1043
12090 1043 -6708 -23627 -36587 -29561 -9751 -1922 -14200 -17900 -11648 -41588 -46038 -9563 2632
12077 2632 -14635 -17195 19436 28731 8195 -6505 -29302 -39026 -13760 22234 13580 2056 986
12064 986 -11852 -15307 -9126 -4530 9704 -8547 -22853 -22513 -6810 -5004 -29992 -49907 -50147 -39489
12050 -39489 -14420 10062 4030 12788 1285 17932 19228 29439 39245 40816 10960 21750 30791
12037 30791 21270 31883 4230 -5738 -6187 -9020 3280 17336 22420 -18082 -7713 6202 12060
12024 12060 37933 26811 10406 -1446 6346 1996 -1515 -17150 -28731 -18480 1115 -77
12012 -77 -22478 -28492 1109 16529 22779 11510 1218 9378 -5421 -30270 -51225 -46715 -9734
11999i734J5512J380n92J3885n459j1528j1817j8267K930P97K6125K6097l35j4020
11985A4974j8854M091O95o180P08J2139o91j4717l1733j5394L2681K9208O653
11972A3580J277J462r437l4590k4011K0720J1461L1184M011k6401M562J2147J693
11959G658o316O254j0374K7210J1831r042N249O573r436o599j680O451r352M706
11945B3133J8207j650n267j692K7370O310l9989m4107M840L4665k277P294M873
11932C1710j7234J221r931R310m793k6572j7828L448J1570O569J2870p201k0240
11919b7101m255K7603K7297k7770j4495k326P582l92m875R365L571o721p135J3393
11905f259L5070Q241j4548J6854r18j4507j1605k380R612n5328M302n138N697
$$ plain form
11999 -9734 5778 7158 6566 20451 14992 3464 -8353 -26620 -23690 -22893 3232 29329 28994 14974
11985 14974 -3880 211 906 -5274 -4566 7573 6882 -7835 -39568 -54962 -22281 6927 13580
11972 13580 14857 16319 6882 -27708 -51719 -30999 -19538 11646 15657 -10744 -6182 5965 7658
11959 7658 1342 7596 -2778 24432 36263 27221 32470 39043 29607 23008 21328 27779 18427 23133
11945 23133 41340 39690 34423 32731 60101 66411 26422 -17685 -12845 21820 19543 26837 31710
11932 31710 14476 15697 5766 15076 10283 -16289 -34117 -30669 -19099 -12530 340 -6861 -27101
11919 -27101 -31356 -3753 23544 -4226 -18721 -21047 -13465 -13857 -18732 -9367 -5796 -12517 -19652 -6259
11905 -6259 28811 37052 22504 39358 38440 23933 12328 9948 19560 -35768 -31466 -36604 -30907
11892c0907J6687j7237J9597J3468j0952N111J0530O868j3507l9769J2762L7588
11880A0239K1568K1458m465k293m967k382O792l592j6644k335k0819N831L0903
11867C9294M443M17j5548m458k687R50M341j1367p452R99J1566p061J924r318
11853F043J2808J7954k3937k0914n359K3867K4969k0795J0870j3497j5166K377
11841g80M625j2949j3514j3859K0089J5131j3083q188J0388R764p369P992p63
11828b516J1045k462m6097k078L1565J1083m88j5525J4628j813j7795P794J3391
11815G32N763J4612k372k3618j7101R77j5752K640Q729J8542j3795Q020J6932
11802D309M397M930k2561m783J1220q600m3541m605K6932K8407O29J2636O166
$$ plain form
11892 -30907 -14220 -31457 -11860 1608 -9344 -4233 6297 13165 -342 -40111 -27349 10239
11880 10239 31807 53265 48800 46507 41540 39158 45950 42358 25714 23379 2560 8391 39294
11867 39294 43737 44154 28606 24148 21461 22411 26752 15385 7933 8932 20498 13437 15361 6043
11853 6043 18851 36805 12868 -8046 -13405 10462 35431 14636 25506 12009 -3157 -780
11841 -780 3845 -9104 -22618 -36477 -16388 -1257 -14340 -22528 -12140 -2376 -9745 -1753 -2516
11828 -2516 8529 6067 -40030 -42108 -10543 540 52 -15473 -845 -2658 -20453 -12659 732
11815 732 6495 21107 18735 -4883 -21984 -21007 -36759 -34119 -25390 -6848 -20643 -12623 4309
11802 4309 8706 13636 -8925 -13708 -2488 -11088 -54629 -59234 -32302 -3895 -3266 9370 15536
11789A5536p227k3582L827n22J037L126R131l060J1742N937j786k70l0309j9786
11775c6206k0383L7400L3964N444j0599K0372J5469k9348k3370J2196J5100K5972
11763D6011m482j6077O843Q18j1786k195j7530m037K284r303J0689K9495R139
11750C9869k6092k2074J557j8406K929k2730m724K2982J8007J0259K7430m434
11738B4573k7564R463o63K2345M969P203j4669N882M998r778m23P255q642q549
11724A6400j218K0368K5971j8079o694P616k5137k4587j1275M5906J3325l0988
11712A1608q330K8233n671j4292n9n107j1751M372l280P456L4295J4268j7998
11699C3744j5673q04j5295p903m48J597k730N103k7057j2520m565j0462J5456
$$ plain form
11789 15536 8309 -15273 -11446 -11968 -10931 -7805 1326 -1734 10008 15945 14159 13889 -16420 -36206
11775 -36206 -56589 -19189 14775 20219 9620 29992 45461 16113 -7257 4939 20039 46011
11763 46011 41529 25452 32295 33113 21327 19132 1602 -2435 -151 -9454 1235 30730 39869
11750 39869 13777 -8297 -6740 -25146 -22217 -44947 -49671 -26689 -8682 1577 29007 24573
11738 24573 -2991 6472 5809 28154 33123 40326 25657 31539 36537 26759 26336 33591 24949 16400
11724 16400 15182 35550 61521 43442 36748 44364 19227 -5360 -16635 29271 42596 11608
11712 11608 3278 31511 25840 11548 11489 6382 -5369 -997 -4277 3179 37474 51742 33744
11699 33744 18071 17267 1972 -5931 -6379 -4782 -7512 -2409 -29466 -41986 -46551 -57013 -41557
11686d1557K3400R291j5982k4733Q340N0911K4351j7660j3932J0174J182K388
11674A6173K1846j611k9456K022L649J7002J6731k4925j1631L3646m59k399n298
11661C5290j3625l519M427J2399j2481l795J0121k9227k441kk1952K0707l557
11648g655j9499k0314P341M241K0450J7584q670k2004k8780J0302L2505K0732
11636F233K5457K0143n164j1506o586J4935J0507j5591k4202j8771j286J76J6523
11623A0868K7446J5956j5891k534J488k0224j4981l7773k171J5512J0281l150
11611a5173l712j705J6323J1077K0511J0582o438j6757p545K079P375l24o231
11598A0062K9812o542n1830o930j5653J9639K0146k312K1181J1388l824l697l0163
$$ plain form
11686 -41557 -18157 -8866 -24848 -49581 -41241 9670 34021 16361 2429 12603 13785 16173
11674 16173 38019 36408 6952 8974 12623 29625 46356 21431 9800 43446 42987 40588 35290
11661 35290 21665 18146 22573 34972 22491 18696 28817 -410 -2851 -2853 -24805 -4098 -7655
11648 -7655 -27154 -47468 -40127 -35886 -15436 2148 -6522 -28526 -57306 -47004 -14499 6233
11636 6233 31690 51833 46669 35163 28577 43512 54019 38428 14226 -4545 -5831 -5655 10868
11623 10868 38314 54270 38379 35845 37333 17109 2128 -35645 -37816 -22304 -12023 -15173
11611 -15173 -18885 -20590 -4267 6810 27321 37903 31465 14708 7163 9242 16617 16293 10062
11598 10062 39874 33332 -18498 -25428 -41081 -21442 -1296 -3608 17573 28961 25137 21440 -8723
11585h723O448J9777N566j0099q725J3301q259k7603o011L2655J6818j3548k3143
11572a1546j2283J0402J1776l3537J345K450K5232K6254J2990P130p736J03r155
11559B3425K17L020j0321o57M354k4536P37N722k3617k5481M42P072J1261L4698
11545F336l054O09j669J6601j3928K815J7997k9195j2717N358l334j3634m76L001
11531b5290J3314J3874K2976J9712R218j6488k627j2386k7637O436K8080K4437
11519E3619L387j1692k488p355k3929p184j927R410k1925k900L6358L252j4147
11506A2479j87J7463r850l1978r458o241R146L2584l420k4125J1227j2283j9485
11493c4128K1643R937R499j3240Q757r21N16J0896P820n650o904K6739J36r191
$$ plain form
11585 -8723 -2275 17502 23068 12969 4244 17545 9286 -18317 -24328 8327 25145 11597 -11546
11572 -11546 -23829 -13427 -1651 -35188 -33843 -31393 -6161 20093 33083 40213 32477 32580 23425
11559 23425 23642 26662 16341 15684 20038 -4498 -3761 1961 -21656 -47137 -46695 -39623 -28362 6336
11545 6336 3282 3891 2222 18823 4895 7710 25707 -3488 -16205 -10847 -14181 -27815 -28291 -25290
11531 -25290 -11976 1898 24874 44586 53804 37316 34689 22303 -5334 1102 29182 53619
11519 53619 57006 45314 42826 35471 11542 4358 2431 11841 -10084 -12984 23374 26626 12479
11506 12479 12292 29755 19905 -12073 -21531 -27772 -18626 13958 10538 -13587 -2360 -14643 -34128
11493 -34128 -12485 -2548 6951 -6289 2468 1547 2063 12959 20779 15129 8225 34964 35100 25909
11479B5909L274J5818Q283q805J2868J2812k7227k3961J8306k510o312l512o037
11466A8906j5726J2484K786N573k459l961L4848R447l0568j6540j7608j0593M2381
11453B8970J5581n211L04M259m180j6747k0950k0681j2311R345Q906J6919J475
11440E679J4630J2309J5268o867k4669j2431J1157Q625L806K883R220M290j6171
11427B7729k5506Q452L0303K4815K1053Q811m0990k0845M2557N9333O6897K9390
11415B31999m8691n9957l0639m2062n573J2902J0605j8638J6843R406j5315r797
11403E1083j2301k2774M288K4346N051r662k2559k7127j265L654J0314o655M910
11390A303J9244J2391O409J3546L628L536q884n727K4738J4676k9932l0854j9805
$$ plain form
11479 25909 29183 45001 53284 44479 57347 70159 42932 18971 37277 34767 28455 24943 18906
11466 18906 3180 15664 18450 24023 21564 17603 52451 61898 31330 14790 -2818 -13411 28970
11453 28970 44551 39340 39644 43903 39723 22976 2026 -18655 -30966 -21621 -12715 4204 5679
11440 5679 20309 32618 47886 41019 16350 3919 15076 23701 27507 30390 39610 43900 27729
11427 27729 2223 10675 40978 65793 86846 95657 54667 33822 76379 135712 202609 231999
11415 231999 183308 123351 92712 50650 45077 57979 68584 49946 66789 76195 60880 51083
11403 51083 38782 16008 20296 44642 49693 40031 17472 -9655 -10920 -7266 3048 -3607 1303
11390 1303 20547 32938 39347 52893 56521 60057 51173 45446 70184 84860 54928 24074 4269
11377D269J8091J5489R411J6867L5157M5972J3697L1133N0174O5118R9965J50039
11365E55382K66241N25623N36292j6262l18443l01335l84179l25046j52539n8345
11355C27389q8534p5074m4846k9794j9878j9611J0264M994K358q726k9767k0402
11343H373j1987O0O573L213J4495L3313J6448m154j2726N952m46j482l917l350
11329E0365k9300j3081j5923J3935n436J7422m692o367M645J5027K182K186k344
11316B8619k4033J5145J6141K8676l245l8347j7505j3957j603O966J7540J8566
11304C2963j3398P198K678j1280p144M212O369P140j8156N947K2856Q183k2940
11291B4628j400K5882p374j9120K825K0120l8787k4835o072K6036R880O7m517
$$ plain form
11377 4269 22360 37849 47260 64127 99284 145256 158953 190086 240260 305378 405343 555382
11365 555382 821623 1347246 1883538 1867276 1548833 1247498 863319 538273 385734 327389
11355 327389 238855 163781 118935 89141 69263 49652 59916 64910 67268 58542 28775 8373
11343 8373 -3614 -3554 3019 6232 20727 54040 70488 66334 53608 59560 59114 57632 53715 50365
11329 50365 21065 7984 -7939 5996 560 17982 13290 6923 11568 26595 28777 30963 28619
11316 28619 4586 19731 35872 64548 61303 22956 5451 -8506 -10109 -3143 14397 32963
11304 32963 19565 26763 29441 18161 11017 15229 21598 28738 10582 16529 39385 47568 24628
11291 24628 23228 49110 41736 22616 25441 45561 6774 -18061 -24133 1903 11783 11850 7333
11278G333k697n338j202L5530J9411J953k5876K869k9348n613K3351j2122k767
11265E484L4113J5689j4526P439K3795N9986L5065K320p331l8396l6355m0698
11253D6585n4985l532M5534K1874J0610q929q526j653m278q054J2922n878M021
11240D5711n39K360q274k2616J3592J7921n415k2907k14J836P448K553J9653j3714
11226C7395l807j9491j471J4355j7380n521k818L387n999R048K1354j1481j3647
11213C924j433J4286K0415J8169L1739L6518K8782J1155M5441P0070n1605l6979
11201A90482K1137j5417m3593j1479k1869l2430j1691J2927K7433r714l8723k5035
11189D2028k1781n511K1793l908r355L0312O2859J2917k1772l3660k8966k0299
$$ plain form
11278 7333 4636 -702 -1904 33626 53037 54990 29114 31983 2635 -2978 20373 8251 5484
11265 5484 39597 55286 40760 48199 71994 131980 167045 169365 162034 123638 87283 46585
11253 46585 -8400 -11932 33602 55476 66086 57157 48631 46978 42700 34646 47568 41690 45711
11240 45711 45172 47532 39258 16642 30234 48155 42740 19833 19619 21455 28903 31456 51109 37395
11226 37395 33588 14097 12626 26981 9601 4080 1262 4649 -1350 7698 29052 17571 3924
11213 3924 2491 16777 37192 55361 87100 123618 152400 163555 208996 279066 227461 190482
11201 190482 211619 196202 152609 141130 119261 86831 75140 88067 115500 105786 67063 42028
11189 42028 20247 14736 36529 32621 23266 53578 116437 129354 107582 73922 44956 24657
11177B4657K5009M447p335j2201M734K587j2033K7016Q163m2793p906L5106R788
11164E9239K689k0574j9708n512o250m783L1968Q181m4346J980J3828J0891N2801
11151H0404J2904l8181j9404M905j1607J4959N2154M1061K1270J2275N3066J15549
11139C39355Q4180l2796l4477o1531o9102k7063k4420m1946P22K1112j7018l0654
11127A06362k776J7841J192L287j3101O547J0761k9607k7935N774j1381k4982
11115D1982J3606P784m898J953M39L5642M4622L7283N3593M7326O088M148O741
11102B96309P009o0646m4862k9651l9134l7178m1669j5944p088P078K734k6106
11090A0852J2260N165k893M746L3567P828q874k4642k9755n3700j20138o0610
$$ plain form
11177 24657 49666 54113 46778 34577 39311 41898 29865 56881 65044 22251 14345 49451 59239
11164 59239 61928 41354 21646 16134 9884 5101 37069 45250 904 2884 16712 27603 80404
11151 80404 93308 55127 35723 40628 29021 43980 96134 137195 158465 170740 223806 339355
11139 339355 423535 390739 356262 294731 225629 198566 174146 132200 132922 154034 137016 106362
11127 106362 103586 121427 122619 125906 112805 119352 130113 100506 72571 78345 66964 41982
11115 41982 55588 63372 58474 60427 60866 96508 141130 178413 232006 279332 285420 289568 296309
11102 296309 303318 242672 197810 168159 129025 91847 50178 34234 27146 34224 36958 10852
11090 10852 23112 28277 25384 30130 63697 71525 62651 38009 8254 -45446 -165584 -226194
11078b26194Q7271J90214K42902R4153l4601k188l7483l0983k7264k7499j3827
11067B14501M339j1877l3751K1677J5665j0469k29O825J6909J0569j2651L2914
11055B54422k087k0608q073J1068N803l923P746K3359N417j4796l168P714o005
11042B56869m041M266m163K651K0393j7602N489J9776j4697p624l9617l5579N681
11029A91802K7420K6529O6020L9237N007l8995k5063L644J5684N917Q325P5550
11017D01077L9363l910p060j4691k9342M078K3057J5463J9785M4628P4127N3702
11005F20277J8422K0678M828N497K1552K2643O4297K7853j1372l1514P244M3056
10993H13461P0570Q3422Q7575N8340M4128N8741O6444M3571N1414R6185J44761
$$ plain form
11078 -226194 -138923 51291 294193 388346 353745 351557 314074 283091 255827 228328 214501
11067 214501 218840 206963 173212 194889 210554 200085 199856 206681 223590 234159 221508 254422
11055 254422 252335 231727 223654 234722 240525 236602 244348 267707 273124 258328 255160 262874 256869
11042 256869 252828 257094 252931 255582 275975 258373 263862 283638 268941 261317 221700 186121 191802
11029 191802 219222 245751 311771 351008 356015 317020 291957 295601 311285 317202 325527 401077
11017 401077 440440 436530 429470 414779 385437 389515 412572 428035 447820 492448 566575 620277
11005 620277 638699 659377 664205 669702 691254 713897 778194 806047 794675 763161 770405 813461
10993 813461 884031 967453 1055028 1113368 1157496 1216237 1282681 1326252 1377666 1473851 1618612
10982A618612J01675P5737R9022R9410J47226J87873K22111L92427O94802R07896
10972D546791N24904n8653q3658l4605R2735L12110M30808N65419Q45061J146663
10962H287575J405553J916245K573892L033014L182304M217962O365699R917128
10954D0899372J6144969K7851997N3070892R9262963J11937286M848951o2994975
10947B91021455n7283682o7325094n7351047l4316149k0191101j3615886j0032405
10940C0906091p335709n588712l920756k640265j984446j487114j193526r41580
10932E813983p09300n39730m41848l25312k32887N537L67913M01217k53137n43855
10922C542581n05891n23872m44706l13217k56634j82934j26850q9213q7051q4563
$$ plain form
10982 1618612 1720287 1796024 1895046 1994456 2141682 2329555 2551666 2944093 3638895 4546791
10972 4546791 5071695 5013042 4929384 4894779 4987514 5299624 5730432 6295851 7140912 8287575
10962 8287575 9693128 11609373 14183265 17216279 20398583 24616545 30982244 40899372
10954 40899372 57044341 84896338 137967230 237230193 349167479 354016430 291021455
10947 291021455 233737773 166412679 109061632 74745483 54554382 40938496 30906091
10940 30906091 23570382 17981670 14060914 11420649 9436203 7949089 6755563 5813983
10932 5813983 5104683 4564953 4123105 3797793 3564906 3570443 3938356 4339573 4086436 3542581
10922 3542581 3036690 2512818 2068112 1754895 1498261 1315327 1188477 1099264 1012213 927650
10912I27650o3145p4723p4928m0311O606j12p659k3407J6267j7743o1340p5172
10900E11983n5721k7461M894k3167k3911o4898o8607p868K5075j504K8268K7690
10888C24773j3599n12k076k1564j9527j3930j7515k7014q14L768K850K3971j0108
10875B28703n4497k8627l299j9711K359J4459J7025K1038l325k328M25l8506k5028
10862A08688k2999J1249J80m676j415o054K149L941k1008m5507J8924O389J0774
10849F0635J8900K2910J3146Q5360N2164k1391m3862k9198n0711l1115M389R293
10837I0520k1764j9892j2575K1999r420l0494l3886K7985k617o1875l8677j9735
10825a10431k3905P7921J66286J28979J05843L9810m0769p8801q5122l6267j0856
$$ plain form
10912 927650 864505 789782 714854 674543 681149 681037 673378 649971 666238 648495 587155 511983
10900 511983 456262 428801 433695 410528 386617 321719 253112 245244 270319 268815 297083 324773
10888 324773 311174 310662 308586 287022 267495 253565 236050 209036 208222 211990 214840 238811 228703
10875 228703 174206 145579 142280 122569 124928 139387 156412 177450 174125 171797 172222 133716 108688
10862 108688 85689 96938 97118 92442 91027 84973 87122 91063 70055 24548 43472 49861 60635
10849 60635 79535 102445 115591 200951 253115 231724 187862 158664 107953 76838 81227 90520
10837 90520 68756 48864 36289 58288 48868 18374 -15512 12473 9856 -52019 -90696 -110431
10825 -110431 -134336 -56415 109871 238850 344693 384503 343734 264933 179811 143544 132688
10814A32688J3050j5663r177Q995J1572j1009l950k4172l3453J1532J9323l730
10802I6006k444l4957m8310j9115j8404O424J0709o0202m2715Q053J4865J9281
10790g0809K1066K9769J1013K84K5540K0116J2990M188o136n044J5411j9236j9316
10777A9836m741j9636j4077k220J3774J6624j529k8196j7289O62K459k5007k0319
10764g9659j336j7972p3820q4820q8841M7227J30250R0161N2107K2386J1055J0440
10752A7178K6770J3337o459l1416j7809n184J5462K545K837R19j1360l269k0901
10739a7350j6619J4032R252J7968o189p677K2209k71k414K3628O749j6989p724
10726A8605K240J004J2849K4617K7004l4635k5133K038m288J08P623j6259N943
$$ plain form
10814 132688 145738 130075 120898 129893 141465 130456 126506 102334 68881 80413 99736 96006
10802 96006 93562 58605 10295 -8820 -27224 -20800 -10091 -70293 -113008 -104955 -90090 -70809
10790 -70809 -49743 -19974 -8961 -8677 16863 36979 49969 54157 48021 42977 58388 39152 19836
10777 19836 15095 -4541 -18618 -20838 -7064 9560 8031 -20165 -37454 -36792 -34333 -59340 -79659
10764 -79659 -80995 -98967 -172787 -257607 -346448 -299221 -168971 -78810 -26703 -4317 6738 17178
10752 17178 43948 57285 50826 19410 1601 -3583 11879 14424 17261 18180 6820 3551 -17350
10739 -17350 -33969 -19937 -10685 7283 1094 -6583 15626 15355 12941 36569 43318 26329 18605
10726 18605 20845 21849 34698 59315 86319 51684 26551 28589 24301 24409 32032 15773 21716
10713B1716K1654n795j2601r671j5205l3015N102K653M960L869J2854K7889J9566
10700D3976j1752P749L1471j4623k8244J5811M432J2411j4177k2733n814q731
10688I776J4336j798J7413J1212K1751L8940r022m6245o169P885o521j7828J9075
10675E2805q66K74j4873j5139K250O760k182J5143K359j3480K753M842K61k1564
10661A9343p354K2150r387k7263L0504O529j6495n3783k3109K6024J7306k385
10649a7920J7234j5553J0145K6679K0934l8406o5225m8186k053l9194M037M0866
10637a06642L8595K5689K4713M1195K2820P727j8143k297K196k2803j3644k823
10625c417p561P583l130J2831J1929k2416j8730K959K703q768N016J0024M110
$$ plain form
10713 21716 43370 37575 24974 15303 98 -32917 -27815 -25162 -20202 -16333 -3479 24410 43976
10700 43976 32224 39973 71444 56821 28577 44388 48820 61231 47054 24321 18507 9776
10688 9776 24112 22314 39727 50939 72690 111630 102608 56363 50194 58079 51558 33730 52805
10675 52805 51939 52213 37340 22201 24451 31211 29029 44172 46531 33051 35804 40646 40907 19343
10661 19343 11989 34139 24752 -2511 27993 34522 18027 -35756 -58865 -32841 -15535 -17920
10649 -17920 -686 -16239 -6094 20585 41519 3113 -62112 -110298 -112351 -151545 -147508 -106642
10637 -106642 -68047 -42358 -17645 23550 46370 54097 35954 33657 35853 13050 -594 -3417
10625 -3417 -10978 -3395 -6525 6306 18235 -4181 -22911 -19952 -17249 -26017 -21001 -10977 -6867
10612f867K0404O810O236q934j917k2736m6453L806L9828p525Q710O237Q770l1164
10598b4795k6942l459R745n98O697L6190J0120j9713K315j162o217J3784K0951
10585A6916K7018J3740l3060k237r946j8140J5151K4560q306k1188k6343j3339
10573c5174k0666J1406J1606J6896J8095J2068Q38l2400l0447j4787m3N5949K8919
10560B2260R566M281q047k2318j614J1308J1192M653n062o634L1634Q858j4698
10547D5379n2L569k118k4443K0328R667K7286L7103N860J2745M0574Q1516J13180
10534C70594J98669L43207N64457M66285j56791l24216l17148l56556k54481j34999
10524C99021j03801j00415n3565j6858k4501n2459j0469L678O794j425p684J3931
$$ plain form
10612 -6867 13537 20347 26583 17649 15732 -7004 -53457 -49651 -9823 -17348 -8638 -2401 6369 -24795
10598 -24795 -51737 -55196 -45451 -46049 -39352 -3162 6958 -12755 -10440 -11602 -17819 -4035 16916
10585 16916 43934 57674 24614 22377 12431 -5709 9442 34002 25696 4508 -21835 -35174
10573 -35174 -55840 -44434 -32828 -15932 2163 14231 15069 -17331 -47778 -62565 -62608 -6659 22260
10560 22260 31826 36107 28060 5742 4128 15436 26628 31281 26219 19585 51219 60077 45379
10547 45379 45327 48896 46778 22335 42663 52330 79616 116719 122579 135324 175898 257414 370594
10534 370594 569263 912470 1476927 1943212 1786421 1462205 1145057 788501 534020 399021
10524 399021 295220 194805 141240 124382 99881 47422 36953 40631 47425 46000 38316 52247
10512E2247j2313k1014Q724J4723j9125l1978k21k212N587Q083O261J3330j5242
10499F850J423L7323O586l0591k4843J8242k5587k9509l425K6146K2518J1262
10487A6395K894k5692m0314m3597m7807j4961J2307K1439K8097J3440N382K6132
10475d6285J1768O686J4823l354l650J6295J8411k2143j392R822k891J195j3435
10462a4150J4409J6743k0027j5720Q906L1233J9786J1506J0574K767j5698N322
10450E5651j2262j8437p956L750K154N206l3128k0827j5324j090K5992K8820J0534
10437B3083o56j3106l941j2193M421P76L218N517O91j7539m978n107K6933J5016
10423B2135Q300j1862N895Q436q861j0374m089n617q675J0189n759j246J15j0477
$$ plain form
10512 52247 39934 18920 27644 42367 23242 -8736 -8957 -11169 -5582 2501 8762 22092 6850
10499 6850 8273 45596 52182 21591 -3252 14990 -10597 -40106 -43531 -17385 5133 16395
10487 16395 19289 -6403 -46717 -90314 -138121 -153082 -140775 -119336 -91239 -77799 -72417 -46285
10475 -46285 -34517 -27831 -13008 -16362 -20012 -3717 14694 -7449 -8841 981 -1910 -715 -14150
10462 -14150 259 17002 -3025 -18745 -9839 21394 41180 52686 63260 66027 50329 55651
10450 55651 43389 24952 16996 20746 22900 28106 -5022 -25849 -41173 -42263 -16271 12549 23083
10437 23083 22427 9321 5380 -6813 -2392 -1616 1602 7119 7810 -9729 -14707 -19814 7119 22135
10423 22135 30435 18573 24468 32904 24043 13669 9580 3963 -4712 5477 -282 -1528 -1413 -11890
10409a1890K883K3813J6841K6674k7288o135P457j8615j1082m820o020R660q553
10396g075N72M10k3103R243K4436l1412p964l373p255o41N779J5372J4270J8212
10382G471J3109k0351k3561k4290j0307J1413L0731J2271j0635n835q738J2282
10370a6440J9483J6747k167J193k3860k9074J2766J0510j6849r403N990J9737
10358a1367L050r812j9471O3L7030j4107k1752J1693L1187L5626L5198N562L099
10345H5999n687k385N4548O1712P1913O2727J00367J20706Q6821L1389K6478J0344
10333G04932n495m1613p1901o6224n1167n6202q3239o9909o5906o3244m7968j9447
10321F2617K067j5851j1570q41n552r906k1374J5122K5303l010j4135k5824j1144
$$ plain form
10409 -11890 -9007 14806 31647 58321 31033 24898 32355 13740 2658 -2162 -8182 1478 -7075
10396 -7075 -6503 -6093 -29196 -19953 4483 -26929 -34893 -38266 -45521 -46162 -40383 -25011 -10741 7471
10382 7471 20580 229 -23332 -47622 -57929 -46516 -15785 -3514 -14149 -19984 -28722 -16440
10370 -16440 3043 19790 17623 18816 -5044 -34118 -21352 -10842 -27691 -37094 -31104 -11367
10358 -11367 -8317 -18129 -37600 -37537 -507 -14614 -36366 -24673 6514 42140 77338 82900 85999
10345 85999 80312 77927 132475 194187 266100 328827 429194 549900 636721 668110 694588 704932
10333 704932 699437 657824 585923 519699 468532 412330 329091 259182 193276 130032 82064 62617
10321 62617 64684 48833 37263 36422 30870 20964 -410 14712 40015 37005 22870 -2954 -14098
10308a4098n890K0226J2780m163P566j856r893r886p808k511j5038J25k03J0695
10294a9954L1975N2902J0909m2513k6846K1003J7088k0134j7175k8592M665M599
10282a2073j0785J8662K1749l004P47j204o170J6151m833L894j5299k6730n783
10269b4678K0431j2389j6699j9489m570J8850N4764J2277k194O294l0654k118
10257a75o865l106k252k318j5165j2642L3120J3447j0139K0560P766k2202l617
10244c588K106j051N888k0474K0677P51k2243P436O777j3357J324l17L005p514
10230b0580J691J5140P597O698R043k6108k0145J851L85m271K1973J7130k763
10217G641k2152o277L0652K6101J516p023j0166J517j030J8281J0783j5785j4354
$$ plain form
10308 -14098 -19988 238 13018 8855 16421 14565 4672 -5214 -13022 -15533 -30571 -30446 -30649 -19954
10294 -19954 12021 64923 75832 33319 6473 27476 44564 24430 7255 -21337 -16672 -12073
10282 -12073 -22858 -4196 17553 14549 15296 14092 7922 24073 19240 23134 7835 -18895 -24678
10269 -24678 -4247 -16636 -33335 -52824 -57394 -38544 16220 28497 26303 32597 1943 -175
10257 -175 -7040 -10146 -12398 -14716 -29881 -42523 -9403 4044 -6095 14465 22231 29 -3588
10244 -3588 -1482 -2533 3355 -17119 3558 4309 -17934 -10498 -3721 -17078 -15754 -16071 -13066 -20580
10230 -20580 -18889 -3749 3848 10546 19589 -6519 -26664 -24813 -24428 -28699 -6726 10404 7641
10217 7641 -14511 -20788 9864 35965 37481 30458 20292 21809 20779 39060 49843 34058 19704
10204A9704J4149M904k2997m890j4770k6935J2924J3248J0832o906J687p386k060
10191h496J2099O356J0026l419j0685j7681m6521P761L2814K5279J7482j6553
10179H462K2079j8160l9301l1423J9230K5062K2546n521k2083j9177J633q036
10167d4689N061J2096k3823K044J7219K8169j6341l526j0846N234J3388R321r132
10154a5825m260o083k5573J0370J1844R129J2652k3518m753j2611K5602K4515
10142A489k916k0577m506K563k1892j8831J4779K165J4813N964j9991J1716J2597
10129b2627j1621K700J7401J0809j4344l0396K03L6958K8105o206l5971k2490
10117d7479j1589K508N3712K1951P317m506j5725j658K875P202K024N312j8571
$$ plain form
10204 19704 33853 38757 15760 10870 -3900 -30835 -17911 -4663 6169 -737 950 -6436 -8496
10191 -8496 3603 9959 19985 16566 5881 -11800 -58321 -50560 -17746 7533 25015 8462
10179 8462 30541 12381 -26920 -58343 -39113 -14051 8495 2974 -19109 -38286 -36653 -44689
10167 -44689 -39628 -27532 -51355 -49311 -32092 -3923 -20264 -23790 -34636 -29402 -16014 -6693 -15825
10154 -15825 -20085 -26168 -51741 -41371 -29527 -20398 -7746 -31264 -36017 -48628 -23026 1489
10142 1489 -1427 -22004 -26510 -23947 -45839 -64670 -49891 -47726 -32913 -26949 -46940 -35224 -22627
10129 -22627 -34248 -31548 -14147 -3338 -17682 -48078 -47875 -10917 17188 10982 -24989 -47479
10117 -47479 -59068 -56560 -2848 19103 26420 21914 6189 4531 7406 14608 16632 21944 3373
10104C373k3455R522O672L4632O891j3910m917k5039k5159q728j8537q694O532
10091f0817L2348R893K632J0631J2093l588k6453J7041K137j5126L371J8812l0645
10078b7671j7561K2622l72P51R12r418J8949O719o950m191K2277J1672P422j9387
10064E774k0561J4897R910J4174j9269k803J3487M991j2498n731j770j3676j1767
10051b4842j5661K1808N2858J6548J8334R112j6809m8407j199J0863J1085l0122
10039C568k8792r452J4622q95J7122L2882r3q233R369j4638l964j0142r847n364
10025a3857j3880K7234K7913J256l387k010R61L2528J7165n2676m7495o592r891
10012d2731J6256L6859r861l4777J1923L9951L0857p412j9753j0360j9060L918
$$ plain form
10104 3373 -20082 -10560 -3888 30744 37635 23725 18808 -6231 -31390 -40118 -58655 -67349 -60817
10091 -60817 -28469 -18576 -15944 -5313 6780 3192 -23261 -6220 -4083 -19209 -15838 2974 -27671
10078 -27671 -45232 -22610 -22982 -22231 -21319 -30737 -11788 -5069 -12019 -16210 6067 17739 25161 5774
10064 5774 -14787 110 10020 24194 4925 2122 15609 20600 8102 2371 601 -13075 -24842
10051 -24842 -40503 -18695 34163 50711 69045 78157 61348 12941 11742 22605 33690 3568
10039 3568 -25224 -34676 -20054 -20949 -3827 29055 28962 20729 30098 15460 11496 1354 -8493 -13857
10025 -13857 -27737 -503 27410 28666 25279 23269 24230 56758 73923 21247 -26248 -32840 -42731
10012 -42731 -26475 10384 523 -34254 -22331 17620 48477 41065 21312 10952 -8108 -4190
10000d190j0540K8511Q412j1776j2246m29j1623L2060J3715j6540j4756j6555
9988a5957m059O356J1870K2556J6631j0941O188j0793m184K8701J3475k9612l4526
9975d295j9088l1896J9365L9607K2809j7707k2967J3948j1865O124L1506R208
9963C4749Q155j3153k0112q240j6575J9391L2212n93k662j5946l8313l364N045
9950a9406Q118K7381J8972L2086j368k1865O907K0755l9258p197L7314r332j1764
9937D1343M558p359l4178j7429J2818j1575o611j824Q836p839l550K7068K8550
9924C2808k8245O339M227m93n103m301l751l10L056j1900M55K7015k2726R276
9910F347K53j3390k581l365k694l734Q438m248k202M794O726j1917j6579n081
$$ plain form
10000 -4190 -14730 13781 22193 10417 -1829 -2258 -13881 18179 31894 15354 598 -15957
9988 -15957 -20016 -13660 -1790 20766 37397 26456 32644 21851 17667 46368 59843 30231 -4295
9975 -4295 -23383 -55279 -35914 3693 26502 8795 -14172 -224 -12089 -5965 25541 34749
9963 34749 42904 29751 9639 1399 -15176 4215 36427 35834 33172 17226 -21087 -24451 -19406
9950 -19406 -11288 16093 35065 67151 65783 43918 50825 71580 32322 25125 62439 53107 41343
9937 41343 45901 38542 4364 -13065 -247 -11822 -18433 -20257 -11421 -19260 -22810 4258 32808
9924 32808 4563 10902 15129 14636 9533 5232 1481 1171 4227 -7673 -7218 19797 -2929 6347
9910 6347 6600 -6790 -9371 -12736 -15430 -19164 -10726 -14974 -17176 -12382 -5656 -17573 -34152 -39233
9896c9233p136N051k730J5491J7026L9726O694j6968k6585n03q572K161N855n71
9882a0294j6337J1410J9156j7746J1684L227N05j196J9131j182J2298J1671l0162
9869A2165j7304R997O244l062j4842k7345K3618K0669j7068J384J7604j3328j9327
9856b0595J3472L6965J8628L864l708K898J1441n550k9852m936l279L94j4662
9843E080J9089p277K159J0815m502j3207j3121k3884j0890R884L2791J6945k31
9830B3651j7912O402M418k2256k362M913K37j5606k1988J9584J2079N75l116K709
9816h672L735l190K696o026o697k727J4814q271N339J2678k058r920j5902J8984
9802e217n177n795J5028j0002r766j5428o574J4760Q892p04N331j0691R415J9270
$$ plain form
9896 -39233 -46369 -41318 -44048 -28557 -11531 28195 34889 17921 -8664 -9167 -17739 -15578 -9723 -10294
9882 -10294 -26631 -15221 3935 -13811 -2127 1100 1605 409 19540 18358 30656 42327 12165
9869 12165 -5139 4858 11102 8040 -6802 -34147 -10529 10140 -6928 -5544 12060 -1268 -20595
9856 -20595 -7123 29842 48470 52334 48626 51524 62965 57415 27563 22627 19348 19742 5080
9843 5080 24169 16892 19051 29866 25364 12157 -964 -24848 -35738 -25854 6937 23882 23651
9830 23651 5739 12141 16559 -5697 -8059 -3146 -2909 -18515 -40503 -20919 -8840 -8265 -11381 -8672
9816 -8672 -4937 -8127 -5431 -11457 -18154 -20881 -6067 -14338 -8999 3679 1621 -8299 -24201 -5217
9802 -5217 -10394 -16189 -1161 -11163 -20929 -36357 -42931 -28171 -19279 -19983 -14652 -25343 -15928 3342
9788C342J8649l3447j6495Q814N333k6961N926j8060j0620J5939J2025J6406k2233
9775d1382q497K0006o829j7057J7317Q930K1988R014l812j0753J7275J5143O883
9762B8226j197N906n568Q994N777L219N085J1131l4287k6419O572p046M629K2442
9748B7464j3714j4206n803k518j9728R606K9390l513m357L027k2497j513Q889
9735i473M1055K1169j3513j0300j117J0664M789O351j5045p867R69j5465k598
9722I619o907r200L939K1639m79l269J4461j1839J3952N889o904k0406k3922j7196
9708c0623N165J3071J8977K1757l862R878j5165j6707n712O274J1378L450j4032
9695C849q296J0251j3368j892j6909j0833K1193J0483j3489J5992L3284J5878
$$ plain form
9788 3342 21991 -11456 -27951 -19137 -13804 -40765 -34839 -52899 -63519 -47580 -35555 -19149 -41382
9775 -41382 -49879 -29873 -36702 -53759 -36442 -27512 -5524 3490 -322 -11075 6200 21343 28226
9762 28226 27029 32935 27367 36361 42138 45357 50442 61573 27286 867 7439 393 5022 27464
9748 27464 13750 -456 -6259 -8777 -28505 -18899 10491 6978 2621 5648 -16849 -18362 -9473
9735 -9473 31582 52751 39238 28938 27821 38485 43274 49625 34580 26713 27682 12217 9619
9722 9619 2712 -6488 -2549 19090 18611 15342 29803 17964 31916 37805 30901 10495 -13427 -30623
9708 -30623 -25458 -12387 6590 28347 24485 34363 19198 2491 -3221 3053 14431 17881 3849
9695 3849 -4447 5804 -7564 -9456 -26365 -37198 -16005 -5522 -19011 -3019 30265 46143
9683D6143n02k1727j3837K0804j074j6596j2924q527J8490j5632j1704J5625K0862
9670A9401Q096j4892J4415P67N949j4456J1601N701O645q589o8L354j3697j8906
9656E321K5762K7493l029j5764o5403j2680j5974k5008K0723K8994J1022K3631
9644E088K8246k7408l1758l135j8613o921R123L1887R692p140J662Q066l85K526
9630I30j5844j0420J3918J7057L092M430O082j5401Q092k6393j3957o60N216J451
9616b2407J2903J6151J1193Q029K4319j3925k3492j3538O869J3055m308l0645
9604a5796j5827K7104K7898J6032L235j0848o507j8979j5286J3121J0493j868
9592A2772L544j608M553L5336L62j6036p097o939r219k872j7104m878l971p89
$$ plain form
9683 46143 45641 23914 10077 30881 29807 13211 287 -8240 10250 -5382 -17086 -1461 19401
9670 19401 27497 12605 27020 27787 33736 19280 30881 36582 43227 34638 34570 37924 24227 5321
9656 5321 31083 58576 55547 39783 -25620 -38300 -54274 -79282 -58559 -29565 -18543 5088
9644 5088 33334 5926 -25832 -28967 -47580 -54501 -45378 -13491 -3799 -10939 -9277 -1211 -1596 930
9630 930 -14914 -25334 -11416 5641 8733 13163 19245 3844 11936 -14457 -28414 -29074 -23858 -22407
9616 -22407 -9504 6647 17840 25869 50188 36263 12771 -767 6102 19157 14849 -15796
9604 -15796 -31623 -4519 23379 39411 42646 31798 25291 6312 -8974 4147 14640 12772
9592 12772 16316 14708 19261 54597 54959 38923 31826 24887 15668 12796 -4308 -9186 -13157 -13946
9578a3946J1561p233n802J3170J6004J328L044K9960J2525l3547r483j2890J2622
9565A7313J0993J6599k579j6183j7942K1921J5403k4339R791L7398n662j7631
9553D5082l3379M02j797k2300l460K9268M295j3380K4204J783j7153O651m723
9540A5493K163k0482J9474J2177J0803J3361L930p442p058j578k8313k0954J7198
9527H772K7301j3606j3341l1650j0822P336J5333L679K633L263R941Q174j1235
9514E778K08m135R307J1804q107j2147j1745J850J9709l588N686j2646J3520J2935
9500B8429j813J978J4950O56J0682m368j6201j5727P984j575o594k7940O275N4254
9486E0990m349j4304p642j7755J3813o154L6951L2951k7870o1727K3359K0645
$$ plain form
9578 -13946 -2385 -9618 -15420 -2250 13754 15082 18126 48086 60611 27064 17581 4691 17313
9565 17313 28306 44905 42326 26143 8201 30122 45525 21186 30977 68375 62713 45082
9553 45082 11703 12105 10308 -11992 -15452 13816 18111 4731 28935 30718 13565 20216 15493
9540 15493 17656 -2826 16648 28825 39628 52989 56919 49477 42419 40841 12528 -8426 8772
9527 8772 36073 22467 9126 -22524 -33346 -26010 -10677 -6998 -4365 -1102 8839 17013 5778
9514 5778 5986 1851 11158 22962 14855 2708 -9037 -7187 12522 8934 14620 1974 15494 28429
9500 28429 26616 28594 43544 44200 54882 50514 34313 18586 26570 24995 18401 -9539 -3264 50990
9486 50990 46641 32337 24695 6940 20753 14599 51550 84501 56631 -5096 18263 38908
9474C8908k0935M120k511K917J171K1012J6002n363N750o74j7390l784J9713J4257
9460G3193k3326j3368P049J102m557p604r367j7745J8110K0664L5719k88j4849
9447F4733R529K5698q50l4402j691K642r720j0038q88l489o619M2587r915l5936
9433C1641k2680K0426R282m983L3153o235k4354R488k0077L218J4247r722j3084
9420B0320j9886J7912j2267J05J0527Q989L3484p160p052R432L680J6190K2704
9407I6978q178Q62o495j2226j1493q584l599l369j8625M301m772j3572P334Q213
9393B6775l388J4050K0047j6295p225L2969j658j3128p364j8072p922J0925J1635
9380D1349K7842K0347j0713j8199r141q918J2426L108j90Q202O373J716j0442
$$ plain form
9474 38908 17973 22093 19582 22499 23670 44682 60684 55321 61071 60397 43007 39223 58936 73193
9460 73193 49867 36499 43548 44650 40093 32489 23122 5377 23487 44151 79870 79582 64733
9447 64733 74262 99960 99110 64708 63017 65659 55939 45901 45013 41524 34905 77492 67577 31641
9433 31641 8961 29387 38669 33686 66839 60604 36250 45738 25661 28879 43126 33404 20320
9420 20320 434 18346 6079 6184 16711 25700 59184 52024 44972 54404 58084 74274 96978
9407 96978 88800 89662 83167 70941 59448 50864 47265 43896 25271 29572 24800 11228 18562 26775
9393 26775 23387 37437 57484 41189 33964 66933 65275 52147 44783 26711 18789 29714 41349
9380 41349 69191 89538 78825 60626 51485 42567 54993 58101 57911 66113 72486 74202 63760
9367F3760p194O5j9942j0571J8339m570J9217L1669M280p711R582m234j313j0125
9353H1252L926j3296l826l871m27P586P908k405j7162j4033J5338m148p671q544
9339D0627l1J3593j4166kK7558O392N837N850O63j1568L4546R277m707q878J4128
9324A19119k1652P42n743M9L535l34o84J680j3026J5842L3052q52O481J0995q427
9309A40777j1181j9411j9769l332n714J8975k0981M648J1043K008O501P015N958
9296A16537J4225Q657J720n884K784K3899p049k0212j7433n363P441J6061J7634
9283A53017k4228j7243K5691J9304r771k7944k0033K0044J4823K6494Q043J4220
9271A82417J0876o586J3252K0129Q942m857k4983j183k4850M9605K9926j6366
$$ plain form
9367 63760 56566 56631 36689 26118 44457 39887 59104 90773 95053 87342 96924 92690 91377 81252
9353 81252 85178 71882 68056 64185 63758 71344 79252 76847 59685 45652 60990 56842 49171 40627
9339 40627 40596 54189 40023 40021 67579 73971 79808 85658 86321 74753 109299 118576 113869 104991 119119
9324 119119 97467 98209 92466 92515 96050 95716 95032 96712 83686 99528 132580 131728 138209 149204 140777
9309 140777 129596 110185 90416 87084 81370 100345 79364 84012 95055 97063 103564 110579 116537
9296 116537 130762 139419 141139 135255 138039 161938 154889 134677 117244 111881 119322 135383 153017
9283 153017 128789 111546 137237 156541 146770 118826 98793 118837 133660 160154 168197 182417
9271 182417 193293 186707 199959 220088 229030 224173 199190 198007 173157 222762 252688 236322
9259B36322o982n608k3590j1987K1427K169l732p496K865L8361Q17J810j609j0558
9245B32209J5581m133R689K6972J7453r99J6627J7858J517J6621o623j2558k8491
9232C01723n63J6155P975K0333K0844q509N607J4179K9268J2731J215j596J3981
9219D33343J4811P913K0257o857J725K520j2508J0607K6971P582K5890K4449J9607
9206E76310P657k9164L6889L9690N577N267M1568M4273J2834q266L099K4059M9867
9193H09660M7179R993O28J1618K5936L7409J4611r129J7735O262J2419L8386N1117
9180A073824N5123K6536J6392J6085P823M7753O3001J9652M7608L7417J4354K5799
9168A451367N4646O8692N2694L8560K0830L6181P7040M1220J6985Q2924P2904
$$ plain form
9259 236322 229340 223732 200142 188155 209582 211751 208019 200523 203388 241749 242566 244376 242767 232209
9245 232209 247790 243657 253346 280318 297771 296772 313399 331257 332774 349395 342772 330214 301723
9232 301723 301160 317315 325290 345623 366467 357958 363565 377744 407012 419743 420958 419362 433343
9219 433343 448154 456067 476324 469467 471192 473712 461204 471811 498782 506364 532254 556703 576310
9206 576310 583967 554803 591692 631382 636959 642226 683794 728067 740901 732635 735734 759793 809660
9193 809660 856839 866832 867460 879078 905014 942423 957034 947905 965640 971902 984321 1022707 1073824
9180 1073824 1128947 1155483 1171875 1187960 1195783 1243536 1306537 1326189 1373797 1411214 1425568 1451367
9168 1451367 1506013 1574705 1627399 1665959 1686789 1722970 1800010 1841230 1858215 1941139 2014043
9157B014043O0218J6221J1228K6522K9929M4892N0184N2285L3540N5248J6613
9146B410923N308J9296J2300J4130L0986K362k2119l620j946J901l2272k620Q488
9133B443117j7551j3829j6794n5164l2017k6505j9982j5330n5594n3441o4535
9122B072375m0057l2398m4380l5914o4159m9039l6321l0184l2179k9018m3400
9111A635326m1365m9337m4034m4836n4357l2303l3070k3101j8711l3545l5487
9100A225180l7083o1025l2533k9098m1609j3052j2833j5394l3416l1002j647l1161
9088H85327j8921k4819q013k1297l4989o619l0827m1582j8800k1193j5638M116
9076F46745n190m232K931J863l4014l6563k7301j6184M501k366j7174k3403j7922
$$ plain form
9157 2014043 2074261 2090482 2101710 2128232 2158161 2203053 2253237 2305522 2339062 2394310 2410923
9146 2410923 2416231 2435527 2447827 2461957 2492943 2495305 2473186 2469566 2467620 2469521 2437249 2434629 2443117
9133 2443117 2425566 2411737 2394943 2339779 2307762 2281257 2261275 2245945 2190351 2136910 2072375
9122 2072375 2032318 1999920 1955540 1919626 1855467 1806428 1770107 1739923 1707744 1678726 1635326
9111 1635326 1593961 1544624 1500590 1455754 1401397 1369094 1336024 1312923 1294212 1260667 1225180
9100 1225180 1188097 1127072 1094539 1065441 1023832 1010780 997947 982553 949137 918135 916488 885327
9088 885327 866406 841587 833574 812277 777288 770669 739842 698260 679460 658267 642629 646745
9076 646745 641555 637323 640254 642117 608103 571540 544239 528055 532556 530190 513016 489613 471691
9063D71691j6230j8190P517k3316P677J8623k2136J99J4510n382j1525l0159r973
9050C83306J148J021m7522m2076J1238k575N447K418l028K955j2883M769n101
9037B99117j7239m64J8346R906j671L83o193j6086m1508j4104L124K306j537P490
9023B41870j8405K0453l888k4446j2405k9102j2440K9887O130m167j0075r099
9011A74313j2886o623k327p050J353k957J5195Q186p982k339N712K3807k466Q914
8997A92850J0512J0025l3729l2193m001q633j6596k278L2342L5021N811m1119
8985A48012n973k3615k2053P886K9145j8781j3970j8223Q194l720k374j6200j3340
8972E4988M83K2152j015L361j2520m298K124n197j9094J7914M2607J8144q617
$$ plain form
9063 471691 455461 437271 444788 421472 429149 447772 425636 425835 440345 434963 423438 393279 383306
9050 383306 384454 385475 337953 295877 307115 304540 309987 312405 309377 312332 299449 304218 299117
9037 299117 281878 281414 299760 309666 307995 308378 302185 286099 244591 230487 233611 235917 234380 241870
9023 241870 223465 243918 240030 215584 203179 174077 161637 191524 197654 193487 183412 174313
9011 174313 161427 154804 152477 145427 146780 143823 159018 167204 159222 156883 162595 186402 183936 192850
8997 192850 203362 213387 179658 147465 143464 134831 118235 115957 148299 183320 189131 148012
8985 148012 142039 118424 96371 104257 133402 114621 100651 82428 90622 86902 84528 68328 54988
8972 54988 55471 77623 76608 79969 67449 63151 65275 60078 40984 58898 101505 119649 111032
8959A11032J1741j4496r998k1872q425l719r368J4495o654q161l393k1927p370
8946B1885J6010J5068J9361K718J6603K8433K7149L171k5145r915j1419l2334
8934G1585m2222J4667L9589J2019P996M725l7100k0072P866J1328M066K5284k668
8921I7063l1557k035K1079O707p134q772r510j094m069k897J2585p322J6744K0529
8907A00317R480J0012l8043k7739k7j2720Q892j9174m380k082L126L5412q248
8894E4826j472J3211K5516N068k9672j4222K787K7782J538J481k1162K216j3432
8881E4465m0905K347k758j4459J7318j6782j3657O194K7251K6238O868j7882J8822
8868E3060k136k2470m797Q398J155n537k9108j6699M667R044M5000R285L83q009
$$ plain form
8959 111032 122773 108277 98279 76407 67982 64263 54895 69390 62736 54575 51182 29255 21885
8946 21885 37895 52963 72324 75042 91645 120078 147227 150398 125253 115338 103919 71585
8934 71585 29363 44030 83619 95638 103634 108359 71259 51187 59053 70381 74447 99731 97063
8921 97063 65506 63471 84550 91257 84123 75351 65841 64747 60678 57781 70366 63044 79788 100317
8907 100317 109797 119809 81766 54027 54000 41280 50172 30998 26618 24536 27662 63074 54826
8894 54826 53354 66565 92081 97149 67477 53255 56042 83824 85362 86843 65681 67897 54465
8881 54465 13560 15907 13149 -1310 16008 -774 -14431 -8237 19014 45252 52120 34238 53060
8868 53060 50924 28454 23657 32055 33210 27673 -1435 -18134 -13467 -4423 40577 49862 50245 42236
8854D2236K3892J2236k8433o542J0216j1217K15j1039j6101J2295J3981q266K523
8841C5996m206j9097P709p396K3887Q479l692J0708L182q490k9378l46M6o251
8827A1151N713J544O114R181j0067J0353j1300q133J9130Q263m033M622J0175
8814E2713O192l3882m4347J0237J3057L640J3460K7588J4654O871o74k4858n1411
8801f760r081L7570J3914K0456l143j2494k7687q481K7155N755m6709j0992J2921
8788g576J2785J8509jK1379J168n746J4136p060k3662M471R451m004j1900L1857
8774E3807M296j6677k6378j7050j5851N498K5751o230k0295L115K9561L536n318
8761A7765o637L739j3614L287R250L5944K1643l2437q517J4250k4671j9002J0887
$$ plain form
8854 42236 66128 78364 49931 43389 53605 42388 42603 31564 15463 27758 41739 33473 35996
8841 35996 31790 12693 20402 13006 36893 45372 41680 52388 55570 47080 17702 17356 17402 11151
8827 11151 16864 18408 24522 33703 23636 33989 22689 14556 33686 41949 37916 42538 52713
8814 52713 58905 25023 -19324 -9087 3970 7610 21070 48658 63312 70183 69509 44651 -6760
8801 -6760 -15841 21729 35643 56099 52956 40462 12775 4294 31449 37204 -9505 -20497 -7576
8788 -7576 5209 23718 23717 45096 46264 40518 54654 47594 23932 28403 37854 33850 21950 53807
8774 53807 58103 41426 15048 -2002 -17853 -12355 13396 7166 -13129 -10014 19547 23083 17765
8761 17765 11128 14867 1253 4540 13790 49734 71377 38940 30423 44673 20002 1000 11887
8748A1887K3001J1213k0585k4384j700O326K0912N231O46J6630R017j5542k0532
8735B2120J4852k7355M299J6405M023P016J5988j9361j9198k3830J5826K4901
8723C5686l83j0770o946K4200J0448m252M206L056k3678l8140j7288J9167K6352
8710B1658J3834K5808K1388k9056j483q560r2J2163O44k8621n79J0108J6036j1709
8696D1539k3093k7894l777P316K9648K2181j5085j9398l908J291K2984K455k6275
8683G984k6102K4602L9336p300l059J2575m2777k3304J8345J603j8944J895K0386
8670E240J1995J2423O687j2467J1292J4471J2004j894l2929j6921j3466J7416
8658A3851K575n69J3125n494j3524j5766R005P732J2818R897j2188J9564k1325
$$ plain form
8748 11887 34888 46101 25516 1132 -568 5758 26670 31901 32547 49177 58194 42652 22120
8735 22120 36972 9617 13916 30321 34344 41360 57348 37987 18789 -5041 10785 35686
8723 35686 35303 24533 17587 41787 52235 47983 52189 55245 31567 -6573 -23861 -4694 21658
8710 21658 35492 61300 82688 53632 52149 43589 43497 55660 56304 27683 27104 37212 53248 41539
8696 41539 18446 -9448 -13225 -5909 23739 45920 30835 11437 7529 8820 31804 34259 7984
8683 7984 -18118 6484 45820 38520 35461 48036 5259 -18045 300 1903 -17041 -15146 5240
8670 5240 17235 29658 36345 23878 35170 49641 61645 59751 26822 9901 -3565 13851
8658 13851 16426 15857 28982 23488 9964 -5802 3203 10935 23753 33650 21462 41026 19701
8645A9701L63L0746J9348K204K675j5464n716L134j6146R821J4002o346p905j2005
8631C8412K220J0664J5575k1254j0388Q938O418m637k0570j11J0953n189k8464
8618B567j1547J3385K0072N823m955N2341J8342M637j6781N120J3262J990J3752
8605A18008J3648Q855l7317p825K5006o837J2989k473p53K2356K2121j191m416
8592A62171Q144n610j525l4814k458K6000N803k6096k3724k4252O604L607Q759
8579A02609n287l6159o855n431n717L565J6129P294p483k421k743Q046o385j941
8565E7221q865P920j3870j0715j581O174K95m0756k7722M730K6092O024J4081
8552A9028K0150J8783J7741K744j4677m1623l7442M682Q998r096K665J6882J7413
$$ plain form
8645 19701 20064 50810 70158 72362 75037 59573 53857 56991 40845 50666 64668 58322 50417 38412
8631 38412 40632 51296 66871 45617 35229 44167 50585 45948 25378 25267 36220 31031 2567
8618 2567 -8980 4405 24477 30300 25345 77686 96028 100665 83884 89004 102266 104256 118008
8605 118008 131656 140511 103194 95369 120375 113538 126527 124054 123301 145657 167778 166587 162171
8592 162171 170315 164705 163180 128366 125908 151908 157711 131615 107891 83639 90243 93850 102609
8579 102609 97322 61163 54308 48877 43160 46725 62854 70148 62665 60244 57501 65547 59162 57221
8565 57221 48356 56276 42406 31691 30110 36284 36579 -4177 -31899 -27169 -1077 4947 19028
8552 19028 39178 57961 75702 78446 63769 22146 -15296 -10614 -1616 -10712 -8047 8835 26248
8539B6248K73J8446R133j1775q806K079J0839n592l5443n919M02q121Q206J8220
8525A8190L2742J2889l2118j1546j0395r169o495j0324l888K1081J0197j2904
8513a740j2787J0963J6508K1559j1767k9998R714L2834R196n300r269k1150p615
8500A148l177J0646n210k616L9345j8516j6585O630K9487j9071k5264j7140O439
8487a3884K121J5657j5565q259j1891j0231j7146J7831K5304Q719k246K0258J4782
8474B5450J8977o099m616k9656l0285J3162J1403N046k106J2291O733k158N36
8461A8678J4439O859k46J326j307N637K146l7876k448J8761O081m717J9367r728
8447C6972k7617j239L0930J2767l3478j7919L431J2943k3128J0890J4468M871
$$ plain form
8539 26248 26521 44967 54100 42325 33519 35598 46437 40845 5402 -517 -115 -8236 -30 18190
8525 18190 50932 63821 31703 20157 9762 593 -5902 -16226 -20114 967 11164 -1740
8513 -1740 -14527 -3564 12944 34503 22736 -7262 2452 35286 44482 39182 29913 8763 1148
8500 1148 -2029 8617 3407 791 40136 21620 5035 11665 41152 22081 -3183 -20323 -13884
8487 -13884 -11763 3894 -11671 -19930 -31821 -42052 -59198 -41367 -16063 -7344 -9590 10668 25450
8474 25450 44427 38328 33712 4056 -26229 -13067 -1664 3382 1276 13567 20300 18142 18678
8461 18678 33117 39976 39730 41056 39749 45386 47532 9656 7208 25969 32050 27333 46700 36972
8447 36972 9355 8116 39046 51813 18335 416 3847 16790 -6338 4552 19020 23891
8435B3891o906j9827L916J4738J0132j0401k5863R201J855j1640M008J840R185
8422D129J859Q225P800k2039j9465j2180J3109K9871M644l331N404N26p597Q670
8408A9625k3679j8018J0073K2298R64j5063K0245K742j5862K251l690l7794j4595
8395e0503M3566j5392l919J9948m051j6021L1369p605j2811p546K4982N622j0374
8382b735m842k9206R578J8761J7239J0236P673q125j3486n376K8165r645N649
8369B3886m91j003j2798j2885N631o428j7644k1910J2766K3590K3551n229q456
8356B580J7287K6266K561p940J5746k2845j5806j1499n54R990Q222R423o736p880
8342A8815j1912j1963j6650J8580k977J619k3117n411K8474K0972j4709j2401
$$ plain form
8435 23891 16985 -2842 1074 15812 25944 15543 -10320 -1119 736 -10904 -6896 -5056 4129
8422 4129 5988 14213 22013 -26 -19491 -31671 -18562 11309 15953 12622 18026 18552 10955 19625
8408 19625 -4054 -22072 -11999 10299 11263 -3800 16445 19187 3325 5576 1886 -35908 -50503
8395 -50503 -6937 -22329 -26248 -6300 -10351 -26372 4997 -2608 -15419 -22965 2017 7639 -2735
8382 -2735 -7577 -36783 -27205 -8444 8795 19031 26704 18579 5093 -283 27882 18237 23886
8369 23886 23395 22392 9594 -3291 2340 -4088 -21732 -43642 -30876 -7286 16265 11036 2580
8356 2580 19867 46133 48694 40754 56500 33655 17849 6350 5796 15786 24008 33431 26695 18815
8342 18815 6903 -5060 -21710 -3130 -6107 -4488 -27605 -33016 -4542 16430 1721 -10680
8330a0680j6900k193J0605M1021j2252k6702j6887P354L0722j019m352J5486L993
8317A8196K3482N751j6168J3683Q93l2312k9662N393q572n745J2028K6221N24
8304A3712M904j1741k3173P214j568K0646K3383J2970l0799m775O588j8163j053
8291a855J5554k0362k3651j1830j5796J1218P437J6228J4088J1181J2207Q175
8279B2594j9025q650J3835L594J3175J3039m2863j7179K8149J3086J6354o938
8267B9171j8400O724L2158m582l3206j3504Q887K2471l0323p915K715k5528J867
8254b9465K7842M4184O147j1795n40o855m469k8162j335R538j08j2833K1564K0956
8240C4669Q847J357J5173o988l3670n532J951Q946j1983j2159l651J1182K1608
$$ plain form
8330 -10680 -27580 -29773 -19168 21853 9601 -17101 -33988 -26634 4088 3069 -1283 14203 18196
8317 18196 41678 47429 31261 44944 45837 13525 -16137 -10744 -19316 -25061 -13033 13188 13712
8304 13712 18616 6875 -16298 -9084 -10652 9994 33377 46347 15548 10773 17361 -802 -1855
8291 -1855 13699 -6663 -30314 -42144 -57940 -46722 -39285 -23057 -8969 2212 14419 22594
8279 22594 3569 -5081 8754 12348 25523 38562 -4301 -21480 6669 19755 36109 29171
8267 29171 10771 17495 49653 45071 11865 -1639 7248 29719 -604 -8519 -5804 -31332 -29465
8254 -29465 -1623 42561 48708 36913 36373 29518 25049 -3113 -4448 5090 4982 -7851 13713 34669
8240 34669 43516 44873 60046 53058 19388 13856 15807 24753 12770 611 -3040 8142 29750
8227B9750r973l0965J2886Q826M965j8260J9262J067j0496J852J6853L2296j6092
8214D1971k0420n082Q745j8932j5818J3012J8523P624j4873j2082q092p790o038
8201a9252r366j7094L906J1357K5709M3863P668j5789k0984q354O366J4623P847
8188C0500q573j896j6647k8681q603J6418j1731P801J6752K5984l316j8751j400
8175b143O948J0699K1028R532j0347M615j8300J3785k5236l3358J3901K2987q778
8162E333K002K728r94Q357M54k9487j7641J0922N478M977j333M591p203M675J9572
8147A2431N497k3545j8879l62J3664L3131J0203l8389l8040K3959M0946n946j7109
8134b439M837J7331r050k5327j3025r017Q487N724j007O628P330Q560j7418n397
$$ plain form
8227 29750 19777 -11188 1698 10524 15489 -2771 16491 17558 7062 8914 25767 58063 41971
8214 41971 21551 16469 25214 6282 -9536 3476 21999 29623 14750 2668 -5424 -13214 -19252
8201 -19252 -28618 -45712 -41806 -30449 -4740 39123 46791 31002 10018 1664 8030 22653 30500
8188 30500 21927 20031 3384 -25297 -33900 -17482 -29213 -21412 -4660 21324 18008 -743 -2143
8175 -2143 4805 15504 36532 46064 35717 40332 22032 35817 10581 -22777 -8876 14111 5333
8162 5333 7335 10063 9069 17426 17880 -11607 -29248 -18326 -12848 -7871 -9204 -4613 -11816 -7141 12431
8147 12431 17928 -5617 -24496 -24858 -11194 21937 32140 -6249 -44289 -20330 20616 14670 -2439
8134 -2439 2398 19729 10679 -14648 -27673 -36690 -28203 -22479 -23486 -16858 -9528 -968 -18386 -23783
8120b3783J8444j394Q452K1287k184k585j7105J9313J8379k7096j7079o131q103
8107a9585K1128O233j7558J0112k148j4288o530k3616j723J9758J9437Q734M133
8094D087J8562l905Q87j8802O087j0426m0861q806Q285M1771j5012o039K4183
8081A1k3186j1339K0079J7738k515L473l941K0500r906j4177K3617n779j4734
8068a59k297J7066N383K687j1779p698k626J4458J5116r729k2890n304J5208j9865
8054a2429K496K0654L345k2543q016J2494k5835J2345L0051N487P244P167K4391
8041E6851k0168m2452j4624l424o659j8815N734K1434J5359m368m4l766M164k719
8027a3497J5667J9709L658j6211J47q642j9283K1346J1128n66J5522j4014K78
$$ plain form
8120 -23783 -5339 -6733 1719 23006 20822 18237 1132 20445 38824 11728 -5351 -11482 -19585
8107 -19585 1543 7776 -9782 330 -1818 -16106 -22636 -46252 -47975 -28217 -8780 -46 4087
8094 4087 22649 18744 19631 829 6916 -3510 -44371 -53177 -44892 -3121 -18133 -24172 11
8081 11 -23175 -34514 -14435 3303 788 4261 320 20820 10914 -3263 20354 14575 -159
8068 -159 -2456 14610 19993 22680 10901 3203 577 15035 30151 20422 -2468 -7772 7436 -12429
8054 -12429 -9933 10721 14066 -8477 -16493 -3999 -29834 -17489 12562 18049 25293 32460 56851
8041 56851 36683 -5769 -20393 -23817 -30476 -49291 -43557 -22123 -6764 -11132 -11176 -14942 -10778 -13497
8027 -13497 2170 21879 25537 9326 9473 831 -18452 2894 14022 13456 28978 14964 15242
8014A5242l531J526p750p353Q877J1006o569M992n637Q382Q813j0187j4612k454
8000G45J2913J3655O118r90l5180l838r334J2528J5448J8115k669K1690q784k503
7986C7914j8858j1215n364R74j6959l97j61J6172N6206m016l1750J163n382k886
7972A5441L607j3670k2523O359K7081K541P615J60j5635k9062j3364K4333M4434
7959C7317K994l9703l4254N478L2150J1663P506k536O470r297k0638j384j314
7946e548l256o84N475m530J2443j700n090q076J6357K1910M550l615L0l63j1336
7931A6567l7045k2933L4438J5003J5582K1640l76O390j8823R279O470K825J1475
7918F0492j3853j2041m505j3968R549R956L15j860J2113J484k7490j7404L131
$$ plain form
8014 15242 11711 13237 5487 -1866 7011 18017 11448 16440 10803 19185 27998 17811 3199 745
8000 745 13658 27313 33431 32441 -2739 -6577 -15911 -3383 12065 30180 27511 49201 40417 37914
7986 37914 19056 7841 2477 3451 -13508 -13905 -14066 2106 58312 54296 22546 23709 18327 15441
7972 15441 19048 5378 -17145 -10786 16295 18836 26451 26611 10976 -18086 -31450 -7117 37317
7959 37317 40311 608 -33646 -28168 3982 15645 23151 20615 27085 17788 -2850 -4234 -5548
7946 -5548 -8804 -9488 -4013 -8543 3900 2200 -2890 -10966 5391 27301 31851 28236 28266 27903 16567
7931 16567 -20478 -43411 -8973 6030 21612 43252 42876 49266 30443 39722 46192 49017 60492
7918 60492 46639 34598 30093 16125 25674 35630 35945 34085 46198 47682 20192 2788 5919
7905E919N126j2168m720k0291n032J7171K9904k973o792j727R089p087j9649j5840
7891b9070K78j2716P09J4216J1592M835j0965k776k443J7451K1216J935q612j7159
7877a1509K1002q092k3119J4766J2928M058Q891N328n06k2121j3465K136j3456
7864b3159J3166J1701p430m942r179L851j9880K094m913r887J9931L7177N849
7851A4379k2144O46j750k452J8133K2273Q326N241N293j9201j199l808P358N262
7837C6357q439j991p840M340q364J764n044k1648J4364n191j4583L729J8859j2234
7823e921j8533j7019K7898J2785k1748K5980M6793r923m8122j9239K0299Q096
7811A346K853L2964k294l3981k2136J0271J0793Q706m096q490k6650j4430j3068
$$ plain form
7905 5919 11045 -1123 -5843 -26134 -31166 -13995 15909 12936 6144 4417 13506 6419 -13230 -29070
7891 -29070 -28792 -41508 -40799 -26583 -14991 -10156 -21121 -23897 -26340 -8889 12327 14262 5650 -11509
7877 -11509 9493 1401 -21718 -6952 5976 10034 18925 24253 23747 1626 -11839 -9703 -23159
7864 -23159 -9993 1708 -5722 -10664 -19843 -15992 -35872 -33778 -38691 -48578 -28647 8530 14379
7851 14379 -7765 -7119 -8869 -11321 6812 29085 37411 42652 47945 28744 27545 23737 31095 36357
7837 36357 27918 25927 18087 22427 14063 15827 10783 -10865 3499 -1692 -16275 -12546 6313 -5921
7823 -5921 -24454 -41473 -13575 -790 -22538 3442 50235 40312 -7810 -27049 -6750 1346
7811 1346 4199 37163 34869 888 -21248 -10977 -184 8522 4426 -4064 -30714 -45144 -58212
7798e8212M188L3498R274P816M6075L1815N304m734k0531Q39k2366l2455k7331
7785b6820R121J4531N50j0333o392L6669r49j5001l07J0504j7625j8199j2993
7772c7244J3698J2012M584J2769K413k0449j5206R472K9116n824k508j2562j6093
7759b5822K861n9J7718M428j1518j186M445K2819J4416J3132l545m72j3387j4864
7745H966J4290p999m3351k5742K72J2537K2212K5844J7832m009k491k9600k2070
7732c3309J9053o859p089k1824o655K1743k660L25K7905P094j5589J7859P68m099
7718c337q666q537K3130J1130J3187K343o623r879J9497P017L034r125P055o241
7704C3985j9827k5401R290l646k5810j2839K6475R134j0966K1271J9769J358j8743
$$ plain form
7798 -58212 -54024 -20526 -11252 -3436 42639 74454 79758 75024 54493 55332 32966 511 -26820
7785 -26820 -17699 -3168 -2618 -12951 -19343 17326 16377 1376 1069 11573 -6052 -24251 -37244
7772 -37244 -23546 -11534 -6950 5819 8232 -12217 -27423 -17951 11165 5341 2833 -9729 -25822
7759 -25822 -22961 -23020 -5302 -874 -12392 -13578 -9133 13686 28102 41234 37689 37217 23830 8966
7745 8966 23256 15257 -28094 -53836 -53564 -41027 -18815 7029 24861 20852 18361 -11239 -33309
7732 -33309 -14256 -21115 -28204 -50028 -56683 -34940 -37600 -37275 -9370 -2276 -17865 -6 762 -3337
7718 -3337 -12003 -20540 2590 13720 26907 29250 22627 12748 32245 39262 42296 33171 40226 33985
7704 33985 14158 -11243 -1953 -5599 -31409 -44248 -17773 -8639 -19605 1666 21435 22793 4050
7691D050j1318j7030j299L1148n898j0756q599n489J1007K5268j1023j0644q084
7678a8667J3632j6151J2428L3819j8673j8433j333L0204k179l858k52j6477j5731
7665b1671K4036j3416r697L1552l0479r975M800P722K1113Q041k2583p68J4505
7652C180j9571j0436N638j6822L2338N7875J5148k6277k4963J5404j0727p855
7640A2932o820j600N456j3206J350k535r42j6376r532R04k091k70R769j2520j1916
7625d7397K864J2375L3252P987P931k370k634k2459j461N658K488p396Q171J8139
7611A5148N149j5146j6418J7793J7474j6894L0179J9615j5367k2491o392l906
7599H744k3513j9832j4846Q623J0363P383j173j1461j982J9794l303l768K3416
$$ plain form
7691 4050 -7268 -24298 -25597 5551 -347 -11103 -19702 -25191 -14184 11084 61 -10583 -18667
7678 -18667 -5035 -21186 -8758 25061 6388 -12045 -13378 16826 14647 10789 10537 -5940 -21671
7665 -21671 2365 -11051 -20748 10804 -19675 -29650 -24850 -17128 3985 12026 -10557 -11325 3180
7652 3180 -16391 -26827 -21189 -38011 -5673 52202 67350 41073 16110 31514 20787 12932
7640 12932 6112 4512 9968 -3238 -1888 -4423 -5365 -21741 -31273 -30369 -32460 -32730 -22961 -35481 -47397
7625 -47397 -44533 -32158 1094 9081 17012 14642 12008 -10451 -11912 -6254 -3766 -11162 -2991 15148
7611 15148 20297 5151 -11267 6526 24000 7106 37285 56900 41533 19042 12650 8744
7599 8744 -14769 -34601 -49447 -40824 -30461 -23078 -24251 -35712 -37694 -17900 -21203 -24971 -1555
7586a555K2853L5549p719j8975j065J1679j0538q168k4196j8416j3787O846j5594
7573d3086Q939q656M764R216n619J2044K4073J3844J8150j1317n320n582M764
7560A6214q522j2903k0602j2667k019J9081K9233M010k4165k2955L108n19J5371
7547a7335j0849q450N398L7239N805J1172J1135q655j1998j6928j28j4318j0197
7534b8109k138R361J4038J8901p717j3878j7902j3077J0108K8556O474j0557R561
7521C621K1928j4997l6593o475o591L100J2737J1249P577J8728j9141k4043j9509
7508d8409J025j4974P163K7831J2451L2459l388k433N428J0279j8498k4740o601
7495b2407j4047N211J2964M522j6352J1223l0430l5999o207J3914L4233L7948
$$ plain form
7586 -1555 21298 56847 49128 30153 29088 40767 30229 22061 -2135 -20551 -34338 -27492 -43086
7573 -43086 -34147 -42803 -38039 -28823 -34442 -22398 1675 15519 33669 22352 17032 11450 16214
7560 16214 7692 -5211 -25813 -38480 -40499 -21418 7815 11825 -12340 -35295 -32187 -32706 -17335
7547 -17335 -28184 -36634 -31236 6003 11808 22980 34115 25460 13462 -3466 -3594 -17912 -28109
7534 -28109 -30247 -20886 -6848 12053 4336 -9542 -27444 -40521 -30413 -1857 4617 -5940 3621
7521 3621 25549 10552 -26041 -32516 -39107 -36007 -23270 -12021 -4444 14284 -4857 -28900 -48409
7508 -48409 -47384 -62358 -55195 -27364 -14913 17546 14158 11725 17153 27432 8934 -15806 -22407
7495 -22407 -36454 -31243 -18279 -13757 -30109 -18886 -49316 -85315 -91522 -77608 -43375 -5427
7483e427k883Qj6797q836K2220Q239j8391J350q756o073L0520R863j1922p125
7469a4010l221k800l335k632j7657j1386r909K3992P34J1518L4175p12J184K2049
7455B7990m660J5567j8578l0346J5027M44j3759K0004J9046N92r713K659j3915
7442A0358J499J4258l44J7863n313j2817J429J234J1073O847k9442m0211k50L0214
7428F398J7909j7632k2303J6736P745J9030K1954m008k8670J0025M534j3733k0045
7415b060r644k6J8069N067j4549k1797m535L3763R72o343j8303j0929K0934o17
7401i998P872N227J799J9163j0403l8746M766M126J3941P632J5721p837l5182
7388b1919J0779p057j4598p101Q858L252j6674j2161m493K5499K3744K5162j6346
$$ plain form
7483 -5427 -8310 -8302 -25099 -33935 -11715 -3476 -21867 -20517 -29273 -35346 -4826 5037 -6885 -14010
7469 -14010 -17231 -20031 -23366 -25998 -43655 -55041 -64950 -40958 -40224 -28706 5469 4757 5941 27990
7455 27990 23330 38897 20319 -10027 5000 5444 -8315 11689 30735 31327 21614 24273 10358
7442 10358 11857 26115 25771 43634 38321 25504 26933 28167 39240 46087 16645 -23566 -23816 6398
7428 6398 24307 6675 -15628 1108 8853 27883 49837 45829 17159 27184 31718 17985 -2060
7415 -2060 -11704 -11730 6339 11406 -3143 -24940 -29475 4288 5260 -1083 -19386 -30315 -9381 -9998
7401 -9998 -2126 3101 4900 24063 13660 -25086 -20320 -16194 -2253 5379 21100 13263 -21919
7388 -21919 -11140 -18197 -32795 -39896 -31038 -27786 -44460 -56621 -61114 -35615 -11871 13291 -3055
7375c055k0223l3590O662O183K2419K9836K666j6235J725k558l8376m110L613
7362d5043K2819K9733Q783l647L3492P638l1676k4667l616k1966k405L7409J5583
7349B2437k5782k3925L815J476K180K8505k0009k3134k795J7015K6884N569L017
7336A5253N408r490J0315j7346j6478P496J805J317j0375J1821J7774k4438n44
7323g482P338m045j3840M853P578l1275Q082J7760N124L6750k469j2430j7830
7310a886q619m132j0696l989k312J4381J7921o75L794K015L066l685n852l078
7296c747L997p52L255J5704R046j8462k8419L901Q219J5903k960j6676r396J8818
7282a569K892R685N972r41k8180K2711J2878j979j8002K835o381k7181P017j1431
$$ plain form
7375 -3055 -23278 -56868 -50206 -44023 -21604 8232 10898 -5337 -3612 -6170 -44546 -48656 -45043
7362 -45043 -22224 7509 16292 12645 46137 53775 22099 -2568 -6184 -28150 -30555 6854 22437
7349 22437 -3345 -27270 -23455 -21979 -19799 8706 -11303 -34437 -37232 -20217 6667 12236 15253
7336 15253 20661 11171 21486 4140 -12338 -4842 -3037 -1720 -12095 -274 17500 -6938 -7482
7323 -7482 -144 -4189 -18029 -13176 -5598 -36873 -28791 -11031 -5907 30843 28374 15944 -1886
7310 -1886 -10505 -14637 -25333 -29322 -31634 -17253 668 -7 3787 5802 8868 5183 -669 -3747
7296 -3747 250 -502 2753 18457 27503 9041 -19378 -15477 -7258 8645 5685 -10991 -20387 -1569
7282 -1569 1323 11008 16980 16039 -12141 10570 23448 21469 3467 6302 -79 -27260 -20243 -31674
7268c1674l76K2058Q77k1816m947J1822j853J403J034L1376J4928j6176k508J8790
7254B2938M999j3041l414p821K0281j7915M037J74J0447k327J5134j2197J0596
7241C1891J6013r955j7052o4m166m934o297M945K5731j1896j6866P587p78j3046
7227A113m189Q421o647J4953L134J3089P406P315q097k8821j3829J5202P296N153
7213B1499R444p844J7631m099J168q954k1675k3234M840M474K305O284m564J6679
7199A3954m770m654l069j8440j032O110o469k4057j4281J1804O040j2616j3610
7186f5090K2396J9819l166J3531j5194p586J3628m666n491o583J3885j2040J2355
7173b4202K4690K343P935J4308o292O303j3497k4085j395K567k6099J3784J6498
$$ plain form
7268 -31674 -32050 -9992 -9115 -30931 -35878 -24056 -25909 -24506 -23472 7904 22832 6656 4148 22938
7254 22938 27937 14896 11482 3661 23942 6027 10064 10238 20685 18358 33492 21295 31891
7241 31891 47904 37949 20897 20833 16667 11733 5436 10381 36112 24216 7350 14937 14159 1113
7227 1113 -3076 5345 -1302 13651 16785 29874 37280 44595 36498 7677 -6152 9050 16346 21499
7213 21499 30943 23099 40730 36631 37799 28845 7170 -16064 -11224 -6750 -4445 1839 -2725 13954
7199 13954 9184 4530 1461 -16979 -18011 -11901 -18370 -42427 -56708 -44904 -38864 -51480 -65090
7186 -65090 -42694 -22875 -26041 -12510 -27704 -35290 -21662 -26328 -31819 -38402 -24517 -36557 -24202
7173 -24202 488 2831 10766 25074 18782 25085 11588 -12497 -13892 -11325 -37424 -23640 -7142
7160g142p299R836J9996j1190J187J693J6498J6932j332N677j2246j3638k4335
7147e363J2095j5959r11k7082N451r342j4601L780J9152k146n018R300q358n998
7133d5000J8081K8406J2335l0456k1724j9955m022K4649P845K612K5380J7937
7121A6088L863j3673J0160L0724J383l1407j9852k701J7718j2194j949j2498j1896
7108b6234J4346K8897J5365k0769j7174O398j8822P088L426j718K1592J1318j6730
7095F983O819J4167j6739k4371k3852k3264j5207Q319M9851K4004p437o32j1651
7082a3010k4615N407K8247J0014j5639N886O36J593R025j7751q906M172j1668
7069b6609j2329J2931l975j8907j8011J4276K7676J0754J9469j7363p247q646
$$ plain form
7160 -7142 -14441 -4605 15391 4201 5388 7081 23579 40511 39179 44856 32610 18972 -5363
7147 -5363 6732 -9227 -10138 -37220 -31769 -41111 -55712 -51932 -32780 -34926 -39944 -30644 -39002 -45000
7133 -45000 -26919 1487 13822 -16634 -38358 -58313 -62335 -37686 -29841 -27229 -1849 16088
7121 16088 19951 6278 16438 47162 48545 17138 -2714 -5415 12303 109 -1840 -14338 -26234
7108 -26234 -11888 17009 32374 11605 -5569 829 -17993 -10905 -7479 -9197 12395 23713 6983
7095 6983 13802 27969 11230 -13141 -36993 -60257 -75464 -67145 -17294 6710 -727 -1359 -13010
7082 -13010 -37625 -32218 -3971 6043 -9596 -3710 -3074 -1481 7544 -10207 -19113 -14941 -26609
7069 -26609 -38938 -26007 -29982 -48889 -66900 -52624 -24948 -14194 5275 -12088 -19335 -27981
7057b7981K4313L3086j5744j6733j8257L724p884j9298q571J5616p47k813K3204
7044a8085R528k7856k1195K7976L7937K1921j0421k4503k1918J2975R857k7276
7032c1060j0482K9413j885Q64K0196L437o905j6564J6844J9606k2855j0113J1614
7019B110M226q835O18J984O420L727p306J2952J0616L527J0702L4596R837k0050
7005F5124l9692m3887j0875R982L0762r649k1229O647M085M258J7034n691j9585
6992a2716o082j7371N647j919l236K2588J0808J5675j5457k667j3019J398J8314
6979A963L8945j1137q503j0632k6092j1885j7245o331j3225L3736P893k2997K203
6966d3307N354J8737J4028p182R812M361j3276q281r639J8981J0463j9966j7629
$$ plain form
7057 -27981 -3668 29418 13674 -3059 -21316 -17592 -25476 -44774 -53345 -37729 -38476 -41289 -18085
7044 -18085 -8557 -36413 -57608 -29632 8305 30226 19805 -4698 -26616 -13641 -3784 -31060
7032 -31060 -41542 -12129 -14014 -13150 7046 10483 3578 -12986 3858 23464 609 -9504 2110
7019 2110 6336 -2499 -1881 103 6523 10250 2944 15896 26512 30039 40741 75337 85174 65124
7005 65124 25432 -18455 -29330 -19348 11414 1765 -19464 -12817 -8732 -4474 12560 6869 -12716
6992 -12716 -18798 -36169 -30522 -32441 -35677 -13089 -2281 13394 -2063 -4730 -17749 -16351 1963
6979 1963 40908 29771 21268 10636 -15456 -27341 -44586 -50917 -64142 -30406 -22513 -45510 -43307
6966 -43307 -37953 -19216 -5188 -12370 -2558 1803 -11473 -19754 -29393 -10412 51 -19915 -37544
6953c7544K0424j214r300p523j8937J7522L4643L8148J8434J0884k3625k9047
6941A2865p015L092J150N59M231j0862n816j0635m56M471j7931K951J0615p396
6927b0177k041L389M2209J2773k5030k9723j1179O157o913n799K1951K5510j164
6914I963k0592r418Q671K3173j957j2680J3258J305k619q712K658q612J6105O901
6900A7444q657n169j0774q494J072k6816j2831o63O617J2172k140J0704J6591
6887a0944Q978j2041j1305j1638R215J088K366R58K0360K862j1961P789j3542
6874a7815k187p473M622J5808m9K185j2616p205r965L38J8195J1400j5615J1715
6860h662N187k812k3659l724J108J0860P88M243O518K5022m25J1686J561j9781
$$ plain form
6953 -37544 -17120 -18334 -27634 -35157 -54094 -36572 -1929 36219 54653 65537 41912 12865
6941 12865 5850 8942 10092 10651 14882 4020 -1796 -12431 -12887 -8416 -26347 -23396 -12781 -20177
6927 -20177 -22218 -18829 23380 36153 11123 -18600 -29779 -23622 -30535 -36334 -14383 11127 9963
6914 9963 -10629 -20047 -11376 11797 9840 -2840 10418 11723 9104 392 3050 -5562 10543 17444
6900 17444 8787 3618 -7156 -15650 -14578 -41394 -54225 -54888 -48271 -36099 -38239 -27535 -10944
6887 -10944 -1966 -14007 -25312 -36950 -27735 -26647 -24281 -23323 -2963 -101 -12062 -4273 -17815
6874 -17815 -20002 -27475 -22853 -7045 -7094 -4909 -17525 -24730 -34695 -34357 -16162 -4762 -20377 -8662
6860 -8662 -3475 -6287 -29946 -33670 -32562 -21702 -20914 -16671 -10153 14869 14444 26130 27691 7910
6846G910M01J5096j4138r848R786N157j4840q608r12j5596j9515J0870J6300K2309
6832D372J1949J666J0192Q501j8944n566j510j8563p620j3981Q073J6590l467
6819h308j966J1104K1429K4466j4181l6152R274J6385q444j3406p514J4004J5675
6806B2366k2660q701J6844N605J6983r297j8540l825R46K7775N093P382N440p471
6792C7940j2602k873M990J1121l305j529j6282j9075N283n502J2265K8641J4652
6779E3724q894r353j4745M254j6424O905n800M001j0394l3360j8021K949J6273
6766b8885J5866Q204P460J6752J8228J7579j2845q369p103O002m779R51O189l928
6752C1322l126r583j3711j2658k9966L149j019K3933M3853R73j0548J21K1399
$$ plain form
6846 7910 8311 23407 9269 -579 9207 14364 -476 -9084 -9996 -25592 -45107 -34237 -17937 4372
6832 4372 16321 17987 28179 36680 17736 12170 10660 -7903 -15523 -29504 -21431 -4841 -8308
6819 -8308 -10274 830 22259 46725 32544 -3608 5666 22051 13607 201 -7313 6691 22366
6806 22366 -294 -8995 7849 13454 30437 21140 2600 -1225 -279 27496 32589 39971 45411 37940
6792 37940 25338 22465 27455 38576 35271 33742 17460 -1615 3668 -1834 10431 39072 53724
6779 53724 44830 35477 20732 24986 8562 15467 9667 13668 3274 -30086 -48107 -45158 -28885
6766 -28885 -13019 -4815 2645 19397 37625 55204 42359 33990 26887 32889 28110 29061 35250 31322
6752 31322 28196 18613 4902 -7756 -37722 -34573 -35592 -11659 32194 33167 22619 22740 44139
6739D4139J1205q981n38L503k0812j7980K233K1441R858J3529k4505O758J8349
6726E8199J1410K6718O0312Q9600N8198Q1560J68852K81007L24384R1242j61964
6715A089518k08037k40565k01698j26670j03908m9678l6143m0559j8852L05k6573
6704C7140l2509k9249j6236J9049J2810L8916m006J759M6007K0582p211m2560
6692D4492l4606R509r596k2287J3710J6790j8901j0374L915o432m251j9427J8699
6679a8759J9793r964J8277Q753j3817J5056L608J2592j670j3300n835l300m307
6666G127p646R49n61r44N188L572j4892J9684J2123m2105J1404K6659j4058j540
6652D960j3131j512P147k8857j0234L380J615n462J6799O3356L485k7344l727
$$ plain form
6739 44139 55344 46363 45825 49328 28516 10536 12769 34210 44068 57597 33092 39850 58199
6726 58199 69609 96327 156639 246239 304437 385997 554849 835856 1160240 1251482 1089518
6715 1089518 881481 640916 439218 312548 208640 158962 122819 82260 63408 63713 37140
6704 37140 4631 -24618 -40854 -21805 -8995 29921 25915 27674 73681 94263 87052 44492
6692 44492 9886 19395 9799 -12488 1222 18012 -889 -11263 -7348 -13780 -18031 -37458 -18759
6679 -18759 1034 -8930 9347 18100 4283 19339 22947 35539 33869 20569 14734 11434 7127
6666 7127 -519 430 -131 -1075 4113 7685 -7207 12477 24600 -17505 -6101 20558 6500 4960
6652 4960 -8171 -9683 -2536 -31393 -41627 -38247 -36632 -42094 -25295 38061 41546 14202 10475
6639A0475N155J843K3527k4286m5034L420J444k057j637J9271j3R648J4790J541
6625A8087j3947j2050m6345j0979K6983L485k295n039O747l168M223K9664Q44
6612c790j6974J9619r492j2148J5303J1330L925L812l155J115K713k6686J903
6599a2525K7408J5766k8697j5307j815j852O041r9J9224J4333p843j36j0123J6305
6585B0680M183j6428n465J1847j2395q758l7355K46P830J1307J430j2757J1947
6572b3688K154O633J8326J0921r7J652j5290k908q412R178p428j6398n604p458
6558c8419N723J7859J2252j348K1623K3654k1465l0624j2151J8621Q032j4129
6546a0372k7646n424K4260o237j6293j563J6441j6796R817K903n245L77o688j9807
$$ plain form
6639 10475 15630 17473 41000 16714 -28320 -24900 -23456 -25513 -27150 -7879 -7892 1756 16546 18087
6625 18087 4140 -7910 -54255 -65234 -38251 -34766 -37061 -42100 -35353 -38521 -34298 -4634 -3790
6612 -3790 -20764 -1145 -10637 -22785 -7482 3848 7773 11585 8430 9545 12258 -14428 -12525
6599 -12525 14883 30649 1952 -13355 -15170 -17022 -10981 -11080 8144 22477 14634 14498 4375 20680
6585 20680 24863 8435 2970 14817 2422 -6336 -43691 -43445 -35615 -24308 -22878 -35635 -23688
6572 -23688 -21534 -14901 3425 14346 14249 15901 611 -2297 -10709 -1531 -8959 -25357 -30961 -38419
6558 -38419 -32696 -14837 -2585 -3933 17690 41344 19879 -10745 -22896 -4275 3757 -10372
6546 -10372 -38018 -43442 -19182 -25419 -41712 -43275 -26834 -43630 -33813 -30910 -36155 -35778 -42466 -62273
6532f2273L165L2762K3558J8061J3211J2048P296K070j4702n479j7925k5022M19
6519a2811q454k2050J1364j846j7370o137J6631L4247M881j6674J1387R265j5117
6506a2684j9189J4548n085m290p813j1924P352J2367q495J1817M880K1268j7365
6493a4613J1118M069k2518j1487n001j198N405m212M681K0725n268n417J7534
6480f182K4459p618N460q648m460J7821q600j8919K5348L5993k2225j7474J3207
6467B8162m053j5047k1069r996J1425J0392n615j5142R627J1992j7769M973J0188
6454a932n610r85J310k8215j5991K4190k468J1715j8656l2989l960O569K7486
6441c9536J8117P001J1257n862N114J2243m361l009j0805o21K5304K3164O03j9620
$$ plain form
6532 -62273 -59108 -26346 -2788 15273 28484 40532 47828 49898 35196 29717 11792 -13230 -12811
6519 -12811 -21265 -43315 -31951 -33797 -51167 -57304 -40673 -6426 -1545 -18219 -6832 2433 -12684
6506 -12684 -31873 -17325 -22410 -26700 -34513 -46437 -39085 -26718 -35213 -23396 -18516 2752 -14613
6493 -14613 -3495 574 -21944 -33431 -38432 -39630 -34225 -38437 -33756 -13031 -18299 -23716 -6182
6480 -6182 18277 10659 16119 7471 3011 20832 12232 -6687 18661 54654 32429 14955 28162
6467 28162 24109 9062 -12007 -22003 -10578 -186 -5801 -20943 -11316 676 -17093 -12120 -1932
6454 -1932 -7542 -8527 -7217 -35432 -51423 -27233 -29701 -17986 -36642 -69631 -73591 -67022 -39536
6441 -39536 -21419 -14418 -3161 -9023 -3909 8334 3973 964 -9841 -10462 14842 38006 38609 18989
6427A8989k8874j6178K9333J7367k5813l7356K527K1296M14r43R376n687k5311
6414d0860r909L8431M6537n579k3601O40p031r322n855J4710p46r890K6178j5670
6400a967q12M2112R5k4198j7137o144l413L178q140O587K7737Q114l2034N887
6386a35o674j1120J6839O622k2435j2815j1217K2173K4035J9781k8740o640Q910
6373a416o2J0275p19q251j2140q576J3090K658p287J7995j5599N419K232J418
6359i63M810K9154l0720k0905J5019J8368J506q801J6943K39k6689K2311o555
6346A3717k5096N981J4437J1704j0934Q759J4172r382k3854k7297J5922N854P87
6333e230J5724J0204j6852j5815J0686p184j4091j2222K5713j910r11J5394K063
$$ plain form
6427 18989 -9885 -26063 3270 20637 -5176 -42532 -40005 -18709 -18295 -19238 -9862 -15549 -40860
6414 -40860 -50769 -12338 34199 28620 5019 5659 -1372 -10694 -16549 -1839 -2585 -12475 13703 -1967
6400 -1967 -2779 39333 39428 15230 -1907 -8051 -11464 -8286 -16426 -9839 17898 26012 -6022 -135
6386 -135 -6809 -17929 -1090 5532 -16903 -29718 -40935 -18762 5273 25054 -3686 -10326 -1416
6373 -1416 -1478 8797 8078 -173 -12313 -20889 -7799 -5141 -12428 5567 -10032 -4613 -2381 -963
6359 -963 3847 33001 2281 -18624 -3605 14763 16269 7468 24411 24650 -2039 20272 13717
6346 13717 -11379 -5398 9039 20743 9809 18568 32740 23358 -496 -27793 -11871 -6017 -5230
6333 -5230 10494 20698 3846 -11969 -1283 -8467 -22558 -34780 -9067 -10977 -11888 3506 5569
6320E569j6666j0135J8635J8397p021O512O593O961r865k5487j3787K0582j2022
6307a1734J544J633k8018j2929L6479K3766j1062L301n202P598k900k4683l748
6294b5955K3609r477J387J3865n993k66O871Q607K2055l036j3362n654J9793k976
6280B9468j6188k3244k0777K0013P299p204k1641j9135q103M4120J0009j5268
6268b0651M588j3569l1423M78M505m161l869L7278K4159m340K0831j5720p235
6255i129j686j4203k639N733j9563L209L3772R375j2120k7631j0376M820M3384
6242B946k1782J8013J3269P038J1006k7331j7160N789k232K2683P337K286k93
6229B1569k5384j738K1325P223p675J701k2528K208j6492j4358J248M89K3634
$$ plain form
6320 5569 -11097 -21232 -2597 15800 8779 15291 21884 28845 18980 -6507 -20294 288 -11734
6307 -11734 -10190 -8557 -36575 -49504 -13025 10741 -321 2980 -2222 5376 2476 -22207 -25955
6294 -25955 -2346 -11823 -10436 3429 -2564 -2830 4041 12648 34703 31667 18305 12651 32444 29468
6280 29468 13280 -9964 -30741 -10728 -3429 -10633 -32274 -51409 -59512 -15392 -5383 -20651
6268 -20651 -16063 -29632 -61055 -60577 -56072 -60233 -64102 -26824 -2665 -7005 13826 -1894 -9129
6255 -9129 -10815 -25018 -27657 -21924 -41487 -38278 -4506 4869 -7251 -34882 -45258 -40438 2946
6242 2946 -18836 -823 12446 19484 30490 3159 -14001 -8212 -10444 12239 19576 21862 21569
6229 21569 -3815 -5553 15772 22995 15320 17021 -5507 -3299 -19791 -34149 -32901 -32412 -8778
6216h778K7666J9561j0635j6332l335m1874k9567K0451L3649M5338p172l3918
6204d946j1666k234N205L178o115o989J0614m179l443J153Q928L9170R157m4547
6190f714l1138J1373l56M717J855l724J196M204N930p520n542j2655k5053M545
6176e8882L6829n983J5228q58j2760M358J269J9385r805k8809J8400J6907R320
6163D599q344K1374o243k3605j4713l586K1044k0515O752Q588k1916M897k6261
6150e7929o000P489M957M1747J4550j1004J2504Q142k5312J1627J5092o76j1531
6137C656j1885K3287o937j5772j4569K6623k132k772m061j0056R103l414l7056
6124d5985j2306L904M0589J0505m883q391j1337L360K6240N699j5978j1586L9765
$$ plain form
6216 -8778 18888 38449 27814 11482 8147 -33727 -63294 -42843 -9194 36144 28972 -4946
6204 -4946 -16612 -18846 -13641 -10463 -16578 -23567 -12953 -17132 -20575 -19422 -10494 28676 37833 -6714
6190 -6714 -37852 -26479 -26835 -22118 -20263 -23987 -22791 -18587 -12657 -20177 -25719 -38374 -63427 -58882
6176 -58882 -22053 -28036 -12808 -13666 -26426 -22068 -20799 -1414 -11219 -40028 -21628 -4721 4599
6163 4599 -3745 17629 11386 -12219 -26932 -30518 -9474 -29989 -23237 -14649 -36565 -31668 -57929
6150 -57929 -63929 -56440 -51483 -9736 4814 -6190 6314 14456 -10856 771 15863 15187 3656
6137 3656 -8229 15058 8121 -7651 -22220 4403 2271 -501 -4562 -14618 -5515 -8929 -45985
6124 -45985 -58291 -54387 -13798 -3293 -8176 -16567 -27904 -24544 1696 7395 -8583 -20169 19596
6111A9596K850j6133J0514k827k5944m697J0360K3235n186Q713P466o290j8172
6098C485J0062O360j4814k4127J6388J8077J544q072l336P383j2034k0890M643
6085a5331p47k1865K5279J1100o029L984j76J2597k7810p602O700j2068j9578
6072e1546j5939M017N9286O374k4320j0799p975L355K2303k810j0606j6718L2464
6059a2914J0724m636R964j6972k1290J9443J8762q522m281J7950L505p60L636
6046A4609l2042k0372K3472K670r731q902j5124n963j3557K2986K7831j5943k2988
6033e3054J258N7Q965K3835p032K7432J3829l2209M93J89l797q73j1432m818K4739
6018a2418r573J6974M679j5944j9520M250o062j9081l885J7789K5528J3182P248
$$ plain form
6111 19596 22446 6313 16827 14000 -11944 -16641 -6281 16954 11768 20481 27947 21657 3485
6098 3485 13547 19907 5093 -19034 -2646 15431 16975 8903 5567 12950 916 -19974 -15331
6085 -15331 -16078 -37943 -12664 -1564 -7593 -3609 -3785 8812 -18998 -26600 -19900 -31968 -51546
6072 -51546 -67485 -63468 -4182 2192 -22128 -32927 -40902 -37547 -15244 -18054 -28660 -45378 -12914
6059 -12914 -2190 -6826 3138 -13834 -35124 -15681 3081 -5441 -9722 8228 11733 10973 14609
6046 14609 -17433 -37805 -14333 -11663 -21394 -30296 -45420 -51383 -64940 -41954 -14123 -30066 -53054
6033 -53054 -51796 -51739 -42774 -18939 -25971 1461 15290 -16919 -16426 -16237 -20034 -20907 -32339 -37157 -12418
6018 -12418 -21991 -5017 -338 -16282 -35802 -31552 -37614 -56695 -60580 -42791 -17263 -4081 3167
6005C167J5213n439K1293O282k0729O339O291j6915j286L080j8042p371J216J0628
5991C727k5544p432L502N652J7563p003j7185J7142J8828j22n648J98o079O207
5977C806l815k613k4955m114K5685L744O654m97o926j8772O782r420K5243L9410
5963D0212J6100j4973l1884O275j547l349k3464M929J6752j2646r310J6718Q797
5950A2610k0307q043K4163o568r279N614k8622M782R005J57k7898j6289M1414
5937a9261J8689j3946l854j6518K5421R972J7428L431l9166j2936r23N907L8319
5924A2563O985j3963j388Q977j3853j1568O657J2734R95j0725j1584J1135k3792
5911b6827j9092J6206k260K9505O123L981M853K056J863m512J017K1166j4429
$$ plain form
6005 3167 18380 12941 34234 40516 19787 26126 32417 15502 14216 17296 -746 -8117 -6901 3727
5991 3727 -21817 -29249 -25747 -20095 -2532 -9535 -26720 -9578 9250 9128 3480 3678 -2401 3806
5977 3806 -9 -2622 -27577 -31691 -6006 -2262 4392 3895 -3031 -21803 -15021 -24441 802 40212
5963 40212 56312 41339 9455 15730 14183 10834 -12630 -7701 9051 -3595 -12905 3813 12610
5950 12610 -7697 -15740 8423 1855 -7424 -1810 -30432 -25650 -16645 -16488 -44386 -60675 -19261
5937 -19261 -572 -14518 -18372 -34890 -9469 503 17931 21362 -17804 -30740 -31663 -25756 12563
5924 12563 19548 5585 4197 13174 -679 -12247 -5590 7144 8139 -2586 -14170 -3035 -26827
5911 -26827 -45919 -29713 -31973 -2468 3655 7636 12489 14545 16408 11896 12913 34079 19650
5898A9650l6366k4949M738L6723Q179j5884k0758J1315L0381l2238l3407n381
5886e7997k7198P156L3218L4606N345j311k1043j3021J9652j5680k8448k2113
5874h6834J1288K0717K3865K3086J6536j8111n779o244l589j5359J3678K7868
5862A122J910j1445N860K6247K3286n072j2793n802J2868k1280j0273l180j9716
5849a8268J1471J8113r30J0987K507k2000j3543p194K012L363r615k916J9204
5836f809O030J0496M0876q17j2782j8222Q480Q735j2708k4096j2579M485N033
5823c878l412P403k26K2541n849r351j3653j2166N857m681j600J3459k956j2854
5809b1366M403J3791L1565O729j5760n3188l022J2714L818J8116J133k7797Q82
$$ plain form
5898 19650 -16716 -41665 -36927 -204 7975 -7909 -28667 -17352 13029 -19209 -52616 -57997
5886 -57997 -85195 -78039 -44821 -10215 -4870 -6181 -27224 -40245 -20593 -36273 -64721 -86834
5874 -86834 -75546 -54829 -30964 -7878 8658 -9453 -15232 -21476 -25065 -40424 -26746 1122
5862 1122 3032 -8413 -2553 23694 46980 41908 29115 23313 36181 14901 4628 1448 -18268
5849 -18268 -6797 11316 10386 21373 23880 1880 -11663 -18857 -16845 -13482 -23097 -26013 -6809
5836 -6809 -779 9717 50593 49776 36994 18772 27252 35987 23279 -817 -13396 -8911 -3878
5823 -3878 -7290 113 -113 22428 16579 7228 -6425 -18591 -12734 -17415 -19015 -5556 -8512 -21366
5809 -21366 -16963 -3172 28393 35122 19362 -33826 -36848 -24134 -20316 -2200 -1067 -28864 -27982
5796b7982L7921K3297j4030j9681O04P91k9339O661L6927J0687k1823O306J1095
5783B1434P999Q013j3543k6341R098n591N135J961o585j8737J8515J6004l183
5770A4179j9946N244K199J8755j5857k214P393R193r912J1075K1473m166m046
5757C3370k7499m2622J827M703J5414O350l445J5338J2947j5442L39J5990K0051
5744C7321j7390j0683j0932R392r837j643J9778j9177r320j1872k3743J1791l016
5731c9331L595L892K4274K3396J7600j3330n518j99N052J7142j5311j8098O785
5718I949K7830n360l6593k5231J9111j091j8133j1J7543K2270K4605l1171r944
5705f226R567p544p292j5259m584J4763O587J9434k232L79M905K2533n217k5687
$$ plain form
5796 -27982 9939 33236 19206 -475 129 920 -28419 -21758 15169 25856 4033 10339 21434
5783 21434 29433 37446 23903 -2438 6660 1069 6204 8165 1580 -17157 1358 17362 14179
5770 14179 -5767 -523 1676 20431 4574 2360 9753 18946 9034 20109 41582 37416 33370
5757 33370 5871 -36751 -34924 -30221 -14807 -8457 -11902 3436 16383 941 1280 17270 37321
5744 37321 19931 9248 -1684 7708 -2129 -3772 16006 -3171 -12491 -24363 -48106 -36315 -39331
5731 -39331 -35736 -31844 -7570 15826 33426 20096 14578 14379 19431 36573 21262 3164 9949
5718 9949 37779 32419 -4174 -29405 -10294 -11385 -29518 -29529 -11986 10284 34889 3718 -6226
5705 -6226 3341 -4203 -11495 -26754 -31338 -16575 -9988 9446 7214 7593 12498 35031 29814 4127
5691D127k4507r966J6952r012K3259k128M314r912k4015N476N346J4487k518k1618
5677b9715N949K1465J0319k253k687J5238q674K94O289J6670j4950J2068O260
5664C6273m1701j808L3010R095M982k2148o315j4287j4924J1873r319j6707J0036
5651b1940l818J3929j0602J7906j733j8193J9522M227j5206N482P05J4737J4015
5638A9031k3085O723J1336l603k740M487k5595Q130K3825o731R79J6027r5Q85
5624B9574p503k2292O844J3002o798m086K2996O021M516k0004k2846j0776k0133
5611c1485J8393K5950j4296j4519P741J4543K2947N040j4292j9170p276R571p196
5598d049P687L0174p761o999K7247k4041j4743O467O324l0957l002K9043k83j3634
$$ plain form
5691 4127 -20380 -30346 -13394 -22406 853 -1275 3039 -6873 -30888 -25412 -20066 -5579 -8097 -29715
5677 -29715 -23766 -2301 8018 5765 3078 18316 9642 9936 16225 32895 17945 30013 36273
5664 36273 -5428 -7236 25774 34869 39851 17703 11388 -2899 -17823 -5950 -15269 -31976 -21940
5651 -21940 -25758 -11829 -22431 -4525 -6258 -24451 -4929 -702 -15908 -10426 -9721 5016 19031
5638 19031 -4054 2669 14005 10402 7662 12149 -13446 -5316 18509 11778 12757 28784 28689 29574
5624 29574 22071 -221 6623 19625 12827 8741 31737 37758 42274 22270 -576 -11352 -31485
5611 -31485 -13092 12858 -1438 -15957 -8216 6327 29274 34314 20022 852 -6424 3147 -4049
5598 -4049 3638 33812 26051 19052 46299 22258 7515 13982 20306 -10651 -13653 15390 15107 1473
5584A473j5411o900n312J9520J9541j2177k000J7372J6785r399r000q822J892
5571G562r347p608p625o40J6902m073P010q131j3376J4526J2893j0894k3602J3115
5557a3288m265Q165K7328K6333k5806Q566j4384k5463j1660J993J3471L6480K654
5544C0124l5561j5970J5256J660n892J3733p896j7824K1281L7620K4915r905k873
5531D8668j5763k2253j2329k2577K791J1807J1683k8811l059q859N612J4159o720
5518b5651M875J8761j9755p345K8444j0552l0058J2150N903m896Q625K8683K5
5505I209k4803j563l440q314j0892j6105K2969K4983J9604J022N566j2850k0961
5492a5575Q901J5306j5929j7411j2968q111J6957J5243k1734k5463J2740J4077
$$ plain form
5584 1473 -13938 -20838 -26150 -6630 12911 734 -1266 16106 32891 23492 14492 5670 7562
5571 7562 -1785 -9393 -17018 -17658 -756 -4829 2181 -5950 -19326 -4800 8093 -2801 -26403 -13288
5557 -13288 -17553 -9388 17940 44273 18467 27033 12649 -12814 -24474 -22481 -9010 27470 30124
5544 30124 -5437 -21407 -6151 -4491 -10383 3350 -4546 -22370 -1089 36531 61446 51541 48668
5531 48668 32905 10652 -1677 -24254 -21463 -9656 2027 -26784 -29843 -38702 -33090 -18931 -25651
5518 -25651 -20776 -2015 -21770 -29115 -671 -11223 -41281 -29131 -23228 -28124 -19499 9184 9209
5505 9209 -15594 -17157 -20597 -28911 -39803 -55908 -32939 -7956 11648 12670 18236 5386 -15575
5492 -15575 -6674 8632 -7297 -24708 -37676 -45787 -28830 -13587 -35321 -60784 -48044 -33967
5480c3967O861K4021J5924q037J3969j5561j4013M603L002L17k2337J2460P810
5467d948j5323N419L400J3223l149q322o724J5241j9678j5460L7273J8085m2j06
5453A8889l8929l0217K4863R279N223L149j7116k05k4989J5399L304O924K469
5440b1957K233L48k1780L443j7894j0398J2106K6858L3892J6467o512l4246m254
5427b1694K63J0834r695O170K5739J9764q445j6910J720L6954J072p429K762J895
5413D3000j4546k449J8166p770q675l508J7649k0770j9931K516J2853L009K419
5400B1963j9753j4454j1832L767O164J9604j5747k3763k1624l563P341J7831o876
5387d0942J9465J4924R98K300j1980M589k979M588O99R150K4861J7225n409j5411
$$ plain form
5480 -33967 -27106 -3085 12839 4802 18771 3210 -10803 -6200 -3198 -2881 -25218 -12758 -4948
5467 -4948 -20271 -14852 -11452 1771 -1378 -9700 -16424 -1183 -20861 -36321 952 19037 18995 18889
5453 18889 -20040 -50257 -25394 -16115 -10892 -7743 -24859 -25064 -50053 -34654 -31350 -24426 -21957
5440 -21957 -19724 -19376 -41156 -37713 -55607 -66005 -53899 -27041 6851 23318 16806 -17440 -21694
5427 -21694 -21431 -10597 -20292 -14122 11617 31381 22936 6026 7746 44700 45772 38343 41105 43000
5413 43000 28454 26005 44171 36401 27726 24218 41867 21097 1166 3682 16535 19544 21963
5400 21963 2210 -12244 -24076 -20309 -14145 5459 -10288 -34051 -55675 -59238 -51897 -34066 -40942
5387 -40942 -21477 -6553 -5555 -3255 -15235 -10646 -13625 -9037 -8338 812 25673 42898 37489 22078
5373B2078l3772j1459j8540k0980J7200K3288K6111j4039J6932K8113J9206P61
5361E4899k5647m5510k2095L528J2080J0898J6686O740k49J175j5818k4962j6383
5348d4658J2352j3896N301K6697K356J2003n414m6746q883K4926l68M627K1822
5335i881J654K936J2126j233L6516M209j2235L4707q103k3860k9536O351o494
5322G157p953K428p747j7135n951j125k4100J1855M503K9144N235m766K5891M063
5308B1499k3278m420J877O543L882K0660k8217n351M899M247k0819O038p283j2321
5294c2044o484k330r436M982K4096l659n25j9717P793J9568J9021j8137P344K833
5280f695j0582R306R156J721J7799k1060o872K1666J008J9778m614k0841j19M674
$$ plain form
5373 22078 -11694 -23153 -41693 -62673 -45473 -22185 3926 -10113 6819 34932 54138 54899
5361 54899 29252 -16258 -38353 -34825 -22745 -11847 4839 11579 11330 12505 -3313 -28275 -44658
5348 -44658 -32306 -46202 -40901 -14204 -11848 155 -5259 -52005 -60888 -35962 -36330 -31703 -9881
5335 -9881 -8227 -5291 6835 5602 42118 46327 34092 68799 60696 36836 7300 13651 7157
5322 7157 -796 1632 -6115 -23250 -29201 -30326 -54426 -42571 -38068 -8924 -3689 -8455 17436 21499
5308 21499 -1779 -6199 -4322 2221 6103 26763 -1454 -6805 -1906 2341 -18478 -12440 -19723 -32044
5294 -32044 -38528 -40858 -50294 -45312 -21216 -24875 -25400 -45117 -37324 -17756 1265 -16872 -9528 -6695
5280 -6695 -17277 -7971 1185 2906 20705 -355 -7227 14439 15447 35225 30611 9770 9651 14325
5266A4325r635j6534j7919J7175j10q616J6579J8769l686p23K7250j5173r254
5253A2448k4878l632j330r122j908J5350J5662j7224k3311O181j733M611k0883
5240d9769m306K5177L127o81R458J9073P208j3653J454K7156M148l7434o471J7051
5226A538Q107K6333j8390l8695R63j390J2766j7816j0412j1740J324j9183M281
5213f2314K3793J9169K5110M670N625K3227j0534k8786Q367J8595j1916o883N845
5200A3968k6488J904n557r454j5008J3059J0712Q77o755J7326O471j6513N490
5187i968L1997k5172j8383K2653M947j7774l3r820k259L544Q058J0754k7349J7
5173b8788j0674K4718K4782l4074j9152M746J2797Q184N350p306k217L517J4178
$$ plain form
5266 14325 4690 -11844 -29763 -12588 -12698 -21314 -4735 14034 10348 9625 36875 21702 12448
5253 12448 -12430 -16062 -17392 -26514 -28422 -13072 2590 -14634 -37945 -31764 -33497 -28886 -49769
5240 -49769 -54075 -28898 -25771 -26452 -16994 2079 9287 -4366 -2912 24244 28392 -9042 -15513 1538
5226 1538 9645 35978 17588 -21107 -20144 -21534 -8768 -26584 -36996 -48736 -47412 -66595 -62314
5213 -62314 -38521 -19352 5758 10428 16053 39280 28746 -40 8327 26922 15006 8123 13968
5200 13968 -12520 -10616 -16173 -25627 -40635 -27576 -16864 -15987 -22742 -5416 1055 -15458 -9968
5187 -9968 22029 -3143 -21526 1127 6074 -11700 -11733 -21553 -23812 -20268 -12210 -1456 -28805 -28788
5173 -28788 -39462 -14744 10038 -24036 -43188 -38442 -25645 -17461 -12111 -19417 -21634 -18117 -3939
5160c939J7752N036n134J4378l39m867j1758k1566l480k1179M328J478K231k4633
5146e1692q334n943K8877K3421K8231K2016j9943j1921j984M743q23j4410J4369
5133F607J3250k5514j8970o323N134j1618j2889N230L9667N7l283P00l671l200
5119a4823q884M352j1608j8453j1343L860K4529K7579j0551r573K2092K0568r759
5106G986J6936j7697Q43n200j9859l700O824K2324L7364r332l0134J2051J807
5093B0213k6097q660m430l866K0010p036j0762K1478K6459Q547k5740J2477P011
5080B9604o270L711j1573k3785J0000m544l736l186J8434Q438q613k5371m862
5067b1753K2230J6401M29j5620l6954j6676J2978M8356l292k2361l3739J3345
$$ plain form
5160 -3939 13813 18849 13715 28093 27754 22887 11129 -10437 -13917 -35096 -30768 -29290 -27059 -51692
5146 -51692 -60026 -65969 -37092 -13671 14560 36576 16633 4712 2728 7471 6648 -7762 6607
5133 6607 19857 -5657 -24627 -30950 -25816 -37434 -50323 -45093 -5426 -5369 -8652 -7952 -11623 -14823
5119 -14823 -23707 -19355 -30963 -49416 -60759 -56899 -32370 -4791 -15342 -24915 -2823 17745 7986
5106 7986 24922 7225 8068 2868 -16991 -20691 -13867 8457 45821 36489 6355 18406 20213
5093 20213 -5884 -14544 -18974 -22840 -2830 -9866 -20628 850 27309 35856 10116 22593 29604
5080 29604 23334 27045 15472 -8313 1687 -2857 -6593 -9779 8655 17093 8480 -16891 -21753
5067 -21753 477 16878 17307 1687 -35267 -51943 -38965 9391 6099 -16262 -50001 -36656
5055c6656J7446N341l665J1117N513k9693J0858Q762L107k939J7082l589q999
5042f315K0782K2848K2346k0488j8545J3841M542J6177o938k3511k0575p704J520
5029b020O0J994L0649K532o944k0866j4187M830J501j4970Q255j278L048k270
5015i666L727O525n24J884r785k1673J7710j978K0158j4515l3794M322L0098J2593
5001E082N017j5531o162m310J3452l909N222K0582j9715r451k600l3725R020K5157
4987a1871J5423O470j8634k4883N476J990J9295J422Q953L437j3242R117N541
4974H494O433l502k6192q946N975J5511j0048L149J9978j8238j1680l902O519
4961a6449J3553j905j7715j7759J3657J0885j3458m038m772L6248J473j458J014
$$ plain form
5055 -36656 -19210 -13869 -17534 -6417 -904 -30597 -19739 -10977 -7870 -10809 6273 2684 -6315
5042 -6315 14467 37315 59661 39173 20628 34469 39011 55188 48250 24739 4164 -3540 -2020
5029 -2020 -1960 34 30683 33215 26271 5405 -8782 -3952 -2451 -17421 -9166 -10444 -7396 -9666
5015 -9666 -5939 586 62 1946 -7839 -29512 -11802 -13780 6378 -8137 -41931 -37609 -7511 5082
5001 5082 10099 -5432 -11594 -15904 -2452 -6361 -1139 19443 -272 -9723 -12323 -46048 -37028 -11871
4987 -11871 3552 10022 -8612 -33495 -28019 -26029 -6734 -5312 3641 7078 -6164 2953 8494
4974 8494 14927 11425 -14767 -23713 -17738 -2227 -12275 -9126 10852 -7386 -19066 -22968 -16449
4961 -16449 -2896 -4801 -22516 -40275 -26618 -15733 -29191 -33229 -38001 -1753 -280 -1738 -724
4948g24l271l110m239m05o034n123M334M752J1495K8777j8518k2933j8699j6017
4934d9715J3456K8814j3558q114J2788l066n80k1175K998J619J5237J6553M979
4921B36P635j601N469K001j4292J2599m043N653P771j1000j0762j4333j5183J3417
4907a6433j3640m134J3359J4882J4741k0014r905j8012K6308M4404L172k4270
4895A0458j0540M516P904L44j0930j2313j7051j2641J7735L0598M0000j0593k5
4882C7462k5745k1202O473n99l360N578J5402p739k207k6777L439J6102O95m259
4868f737j1293j1899J1559J2206J3263J5279n179J9088K6625j762j9432O274k6031
4855B1961l9156q965J3290Q568l202m836M887J0803J9562j948K1389J1018J2601
$$ plain form
4948 -724 -3995 -7105 -11344 -11749 -17783 -22906 -18572 -13820 -2325 26452 7934 -14999 -33698 -49715
4934 -49715 -36259 -7445 -21003 -29117 -16329 -19395 -19975 -41150 -38152 -36533 -21296 -4743 236
4921 236 7871 6270 11739 13740 -552 12047 8004 13657 21428 10428 -334 -14667 -29850 -16433
4907 -16433 -30073 -34207 -20848 -5966 8775 -11239 -21144 -39156 -12848 31556 34728 10458
4895 10458 -82 4434 12338 12682 1752 -10561 -27612 -40253 -22518 8080 48080 37487 37462
4882 37462 11717 -9485 -3012 -3611 -6971 -1393 14009 6270 4063 -22714 -19275 -3173 -2478 -6737
4868 -6737 -18030 -29929 -18370 -6164 7099 22378 17199 36287 62912 61150 41718 47992 21961
4855 21961 -17195 -26160 -12870 -4302 -7504 -12340 -7453 3350 22912 20964 42353 53371 65972
4842F5972j1734k809m4760j1823J6347J4402j0812j4697J6486j029Q349K2720
4830D6612p432k3168j2523j8836J0146L7532J6910j2089j1400J1094k3456k7875
4818a4485o762R481Q588L207J1471k482Q289J0290j8843j7907K067k815k0036
4805b9937k849J1454j1229k0133P514L0328K637k3451P543J647J6695K4530J6836
4792C1585Q316N055K364k2731k2834J37J2547n12j4756j8218N004L7336J994r899
4778A5388k0210l832r471O69J2042K1134n47j3502j787k67M986j6773Q725k5043
4764b8488O279J3428Q825O326r867j0656j8969J451j939M179L7349J0982m057
4751A4843K263j0663j2928J1067j219l717j4334j5596J780k9820r415K1133J4270
$$ plain form
4842 65972 54238 51429 6669 -5154 11193 25595 14783 86 16572 15543 23892 46612
4830 46612 39180 16012 3489 -15347 -5201 32331 49241 37152 25752 36846 13390 -14485
4818 -14485 -21247 -11766 -3178 29 11500 9018 17307 27597 8754 -9153 -7086 -9901 -29937
4805 -29937 -32786 -21332 -32561 -52694 -45180 -14852 -12215 -35666 -28123 -26476 -9781 14749 31585
4792 31585 39901 44956 47320 24589 1755 1892 14439 13927 -829 -19047 -14043 23293 25287 15388
4778 15388 -4822 -8654 -18125 -17456 -5414 15720 15173 1671 -116 -383 4603 -12170 -3445 -28488
4764 -28488 -22209 -8781 44 6370 -3497 -14153 -33122 -31671 -33610 -29431 7918 18900 14843
4751 14843 17106 6443 -6485 4582 3363 -354 -14688 -30284 -28504 -58324 -67739 -46606 -32336
4738c2336M797j1292K23K7789K5108J3267J3935r976j1430q213q632k0088J0117
4725f731L5426K5249j7636k4230J73J1361k1373k7783j5161J2587q128j1195J2889
$$ plain form
4738 -32336 -27539 -38831 -38608 -10819 14289 27556 41491 31515 20085 11872 3240 -16848 -6731
4725 -6731 28695 53944 36308 12078 12251 23612 2239 -25544 -40705 -28118 -36246 -47441 -34552
$$ [...]
##END NTUPLES=NMR SPECTRUM
##END=
