##TITLE=Analysis number 317608
Compound Code cc 26709
Book Reference 449/80
Project Code adrs
Chemist Name davee
##JCAMPDX= 6.0         $$ Bruker NMR JCAMP-DX V2.0
##DATA TYPE= NMR SPECTRUM
##DATA CLASS= NTUPLES
##ORIGIN= Bruker BioSpin GmbH
##OWNER= nmr
$$ XWIN-NMR		Version 3.5
$$ Mon Feb 27 10:17:12 2006 GMT Standard Time (UT+0h)  MAYBRIDGE\nmr@NMR_250MHZ
##.OBSERVE FREQUENCY= 250.131544655141
##.OBSERVE NUCLEUS= ^1H
##.ACQUISITION MODE= SIMULTANEOUS (DQD)
##.ACQUISITION SCHEME= undefined
##.AVERAGES= 16
##.DIGITISER RES= 18
##SPECTROMETER/DATA SYSTEM= dpx250
##.PULSE SEQUENCE= zg30
##.SOLVENT NAME= CDCl3
##.SHIFT REFERENCE= (INTERNAL, CDCl3, 0, 16.522)
##AUDIT TRAIL= $$ (NUMBER, WHEN, WHO, WHERE, WHAT)
$$ ##TITLE= Audit trail, XWIN-NMR		Version 3.5
$$ ##JCAMPDX= 5.01
$$ ##ORIGIN= Bruker BioSpin GmbH
$$ ##OWNER= nmr
$$ C:\u/data/dgb/nmr/ADRS/16900/pdata/1/auditp.txt
$$ ##AUDIT TRAIL=  $$ (NUMBER, WHEN, WHO, WHERE, WHAT)
(   1,<2006-02-27 10:16:39.79 +000>,<MAYBRIDGE\nmr>,<NMR_250MHZ>,
      <created by zg, POWCHK disabled, PULCHK disabled
       configuration hash MD5:
       84 BC 41 DB A1 6E 1D 46 DA 25 12 A5 C1 ED C5 3A
       data hash MD5: 64K
       40 9A 4D 49 0F 7D 74 4C ED A1 CE EE 46 E7 2B 4E>)
(   2,<2006-02-27 10:16:53.87 +000>,<MAYBRIDGE\nmr>,<NMR_250MHZ>,
      <Start of raw data processing
       ef LB = 0.3 FT_mod = 6 PKNL = 1 SI = 32K 
       data hash MD5: 32K
       EA 87 B2 B8 2B AC 3E AB 2C 92 24 FE C9 62 7A F9>)
(   3,<2006-02-27 10:16:56.04 +000>,<MAYBRIDGE\nmr>,<NMR_250MHZ>,
      <apk 
       data hash MD5: 32K
       82 4A 2E BB E5 8F 6F B6 D4 3D 94 92 2A 45 1F 6F>)
(   4,<2006-02-27 10:16:56.78 +000>,<MAYBRIDGE\nmr>,<NMR_250MHZ>,
      <abs ABSG = 5 
       data hash MD5: 32K
       A4 CC 00 D3 F3 65 B8 53 9C 52 4A 20 58 6B 6F 7C>)
$$ ##END=
$$ 
$$ hash MD5
$$ E4 F9 E5 DC 76 78 18 DE C4 8C 7D E7 4D D1 02 64
##$RELAX= 
##$RELAX= 
##$RELAX= 
##$RELAX= 
##$RELAX= 
##$RELAX= 
##$RELAX= 
$$ Bruker specific parameters
$$ --------------------------
##$DU= <C:\u>
##$EXPNO= 16900
##$NAME= <ADRS>
##$PROCNO= 1
##$TYPE= <nmr>
##$USER= <dgb>
##$AMP= (0..31)
100 100 100 100 100 100 100 100 100 100 100 100 100 100 100 100 100 100 
100 100 100 100 100 100 100 100 100 100 100 100 100 100 
##$AQSEQ= 0
##$AQ_mod= 3
##$AUNM= <au_zg>
##$AUTOPOS= <7 >
##$BF1= 250.13
##$BF2= 250.13
##$BF3= 250.13
##$BF4= 250.13
##$BF5= 500.13
##$BF6= 500.13
##$BF7= 500.13
##$BF8= 500.13
##$BYTORDA= 1
##$CFDGTYP= 0
##$CFRGTYP= 5
##$CHEMSTR= <none>
##$CNST= (0..31)
1 1 145 1 1 1 1 1 1 1 1 1 1 1 1 1 1 1 1 1 1 1 1 1 1 1 1 1 1 1 1 1 
##$CPDPRG= <>
##$CPDPRG1= <>
##$CPDPRG2= <>
##$CPDPRG3= <>
##$CPDPRG4= <mlev>
##$CPDPRG5= <mlev>
##$CPDPRG6= <mlev>
##$CPDPRG7= <mlev>
##$CPDPRG8= <mlev>
##$CPDPRGB= <>
##$CPDPRGT= <>
##$D= (0..31)
0 1 0 0 0 0 0 0 0 0.06 0 0 0 0 0 0 0.0002 0 0 0 0 0 0 0 0 0 0 0 0 0 0 
0 
##$DATE= 1141035398
##$DBL= (0..7)
120 120 120 120 120 120 120 120 
##$DBP= (0..7)
150 150 150 150 150 150 150 150 
##$DBP07= 0
##$DBPNAM0= <>
##$DBPNAM1= <>
$$ [...]
##$SUBNAM7= <"">
##$SUBNAM8= <"">
##$SUBNAM9= <"">
##$SW= 20.6930455092707
##$SWIBOX= (0..15)
0 0 3 0 0 0 0 0 0 0 0 0 0 0 0 0 
##$SW_h= 5175.983436853
##$TD= 65536
##$TD0= 1
##$TE= 293.16
##$TE2= 300
##$TE3= 300
##$TEG= 300
##$TL= (0..7)
0 120 120 120 120 120 120 120 
##$TP= (0..7)
150 150 150 150 150 150 150 150 
##$TP07= 0
##$TPNAME0= <>
##$TPNAME1= <>
##$TPNAME2= <>
##$TPNAME3= <>
##$TPNAME4= <>
##$TPNAME5= <>
##$TPNAME6= <>
##$TPNAME7= <>
##$TPOAL= (0..7)
0.5 0.5 0.5 0.5 0.5 0.5 0.5 0.5 
##$TPOFFS= (0..7)
0 0 0 0 0 0 0 0 
##$TUNHIN= 0
##$TUNHOUT= 0
##$TUNXOUT= 0
##$USERA1= <user>
##$USERA2= <user>
##$USERA3= <user>
##$USERA4= <user>
##$USERA5= <user>
##$V9= 5
##$VALIST= <valist>
##$VCLIST= <CCCCCCCCCCCCCCC>
##$VD= 0
##$VDLIST= <DDDDDDDDDDDDDDD>
##$VPLIST= <PPPPPPPPPPPPPPP>
##$VTLIST= <TTTTTTTTTTTTTTT>
##$WBST= 1024
##$WBSW= 4
##$XGAIN= (0..3)
0 0 0 0 
##$XL= 0
##$YL= 0
##$YMAX_a= 446888
##$YMIN_a= -542464
##$ZGOPTNS= <>
##$ZL1= 120
##$ZL2= 120
##$ZL3= 120
##$ZL4= 120
##$ABSF1= 16.522
##$ABSF2= -4.171173
##$ABSG= 5
##$ABSL= 3
##$ALPHA= 0
##$AQORDER= 0
##$ASSFAC= 0
##$ASSFACI= 0
##$ASSFACX= 0
##$ASSWID= 0
##$AUNMP= <proc_1d>
##$AZFE= 0.1
##$AZFW= 0.1
##$BCFW= 0
##$BC_mod= 0
##$BYTORDP= 0
##$COROFFS= 0
##$CY= 12.5
##$DATMOD= 1
##$DC= 0
##$DFILT= <>
##$DTYPP= 0
##$F1P= 14.0000005364418
##$F2P= -0.99999901652339
##$FCOR= 0.5
##$FTSIZE= 32768
##$FT_mod= 6
##$GAMMA= 0
##$GB= 0
##$INTBC= 1
##$INTSCL= 1
##$ISEN= 128
##$LB= 0.3
##$LEV0= 0
##$LPBIN= 0
##$MAXI= 10000
##$MC2= 0
##$MEAN= 0
##$ME_mod= 0
##$MI= 0
##$NCOEF= 0
##$NC_proc= -3
##$NLEV= 6
##$NOISF1= 0
##$NOISF2= 0
##$NSP= 0
##$NTH_PI= 0
##$NZP= 0
##$OFFSET= 16.522
##$PC= 1
##$PHC0= -108.3562
##$PHC1= 6.106116
##$PH_mod= 1
##$PKNL= yes
##$PPARMOD= 0
##$PSCAL= 4
##$PSIGN= 0
##$REVERSE= no
##$SF= 250.13
##$SI= 32768
##$SIGF1= 0
##$SIGF2= 0
##$SINO= 400
##$SIOLD= 32768
##$SREGLST= <1H.CDCl3>
##$SSB= 0
##$STSI= 32768
##$STSR= 0
##$SW_p= 5175.98343685301
##$SYMM= 0
##$S_DEV= 0
##$TDeff= 65536
##$TDoff= 0
##$TI= <Analysis number 999999
Compound Code 99
Book Reference 9
Project Code 9>
##$TILT= no
##$TM1= 0
##$TM2= 0
##$TOPLEV= 0
##$USERP1= <user>
##$USERP2= <user>
##$USERP3= <user>
##$USERP4= <user>
##$USERP5= <user>
##$WDW= 1
##$XDIM= 32768
##$YMAX_p= 365301165
##$YMIN_p= -160933
$$ End of Bruker specific parameters
$$ ---------------------------------
##NTUPLES= NMR SPECTRUM
##VAR_NAME=  FREQUENCY,     SPECTRUM/REAL,   SPECTRUM/IMAG
##SYMBOL=    X,             R,               I
##VAR_TYPE=  INDEPENDENT,   DEPENDENT,       DEPENDENT
##VAR_FORM=  AFFN,          ASDF,            ASDF
##VAR_DIM=   32768,         32768,           32768
##UNITS=     HZ,            ARBITRARY UNITS, ARBITRARY UNITS
##FACTOR=    0.157963299565203, 1,           1
##FIRST=     4132.6476996994, 0,             0
##LAST=      -1043.33573715361, 0,           0
##MIN=       -1043.33573715361, -160933,     0
##MAX=       4132.6476996994, 365301165,     0
$$ Real data points
##PAGE= N=1
##DATA TABLE= (X++(R..R)), XYDATA
$$ [...]
16166a0529L1466m640j6648L1618M8734k1463l1231O177j5638l8916r683J4205
16154a6548K4490J6800r04J0060k0797k4479l6951m8284k9118J0987P5713L5725
16142c306J1270J7488J9473j7206j4785k8038m3906r831J1156J8123q371m0806
16130h8739K0005J2864J5954j9315l2321L7772K1109L1663J6009J4601k1271k5877
16118a7546l0113k0493K5454J9396p400k8788K7837K3688K374l2088l4145L5233
16106c6591n382m7Q746j915L6949L512K2570j0689m559K4708M2502j1259j8420
16093E0125m1783L963j1148n1825J3917r235n765J2814L581N3763J025l2803q952
16080b2323q58J2809K484L831M328k2424J5340K8648l7523j5237p513j6767L7938
$$ plain form
16166 -10529 20937 16297 -351 31267 80001 58538 27307 33484 17846 -21070 -30753 -16548
16154 -16548 7942 24742 23838 33898 13101 -11378 -48329 -96613 -125731 -114744 -39031 -3306
16142 -3306 7964 25452 44925 27719 12934 -15104 -59010 -68841 -57685 -39562 -47933 -88739
16130 -88739 -68734 -55870 -39916 -59231 -91552 -53780 -32671 -1008 15001 29602 8331 -17546
16118 -17546 -47659 -68152 -42698 -23302 -30702 -59490 -31653 -7965 -5591 -37679 -71824 -36591
16106 -36591 -41973 -42020 -33274 -35189 1760 5272 27842 17153 12594 37302 79804 68545 50125
16093 50125 8342 12305 1157 -50668 -36751 -45986 -51751 -38937 -35356 18407 19432 -13371 -22323
16080 -22323 -23181 -10372 -7888 -4057 271 -22153 -6813 21835 -15688 -30925 -38438 -55205 -17267
16067a7267M7387L9859M2513K8302n4338k3938k2762m9594k9495k4520L4094J3366
16055a6393M030N120K6280J2874j4000j7123R567k7255l8791P404K026K7653J241
16042a7367n048J3883J6054j9485k7990L4316O0152R548m515q319j8762n910n3845
16029b7288k0460l2983J6460M1308J6026j4191l8115J408J6312j7413P751K636
16017d8549m679n1600J8745L0618N1131J105M3704j0345o3213P774M393K0905
16005a1p321P517n1407r920q194j5741L14n308M236M7110O255k1788j6313P275
15991f3296L6350J7708j5914L5970J8785l9440K4414l2924k076N2135K6690k4592
15979C3810N643j6806J6053J9230J6280j6668j9107j6787J9851J4671m6934n0783
$$ plain form
16067 -17267 30120 69979 112492 140794 86456 62518 39756 -9838 -39333 -63853 -29759 -16393
16055 -16393 -12363 -7243 19037 31911 17911 788 10355 -16900 -55691 -48287 -46261 -18608 -17367
16042 -17367 -22415 -8532 7522 -11963 -39953 -5637 54515 64063 59548 51229 32467 26557 -27288
16029 -27288 -47748 -80731 -64271 -22963 -6937 -21128 -59243 -57835 -41523 -58936 -51185 -48549
16017 -48549 -53228 -104828 -86083 -55465 -4334 -3229 40475 30130 -33083 -25309 -20916 -11
16005 -11 -7332 185 -51222 -61142 -69336 -85077 -84763 -90071 -85835 -38725 -32470 -54258 -70571 -63296
15991 -63296 -26946 -9238 -25152 10818 29603 -9837 14577 -18347 -20423 31712 58402 33810
15979 33810 39453 22647 38700 57930 74210 57542 38435 21648 41499 56170 9236 -41547
15967d1547M699j7587m8854p793K2950r5Q296K054K6435L1840K9188K277j4376
15954b513j1689M4605L2478m114j9433l9373m2655K6579R097k1178N591K1586
15942a019j4789l6152r920J0690K2708K802L04J6876q652k5698m015k859N1981
15929B257R97j3038n560L4077j4069j7129M7699k6648k9610r022j4700k91J9551
15916b5486n536L0016J5275J0065L9266l8005n1312m3251j0999o667K869M1286
15904d2479M76J859j6216J3018M0920J1082j2337l4031j845L0213Q483j9291L203
15891a6945j3184J4501L1975j6023r860N850p8486k6467L6365M5456J7520k2990
15879c2288j9274J9069L1199P406l92K1667k5721k9558m0133M512O7460P2925
$$ plain form
15967 -41547 -36848 -54435 -103289 -111082 -88132 -88227 -79931 -77877 -51442 -19602 9586 11863 -2513
15954 -2513 -14202 30403 62881 58767 39334 -39 -42694 -16115 -7018 -28196 -22605 -1019
15942 -1019 -15808 -51960 -61880 -51190 -28482 -25680 -25376 -8500 -17152 -42850 -46865 -49724 2257
15929 2257 3254 -9784 -15344 18733 4664 -12465 35234 8586 -21024 -30046 -44746 -45037 -25486
15916 -25486 -31022 -1006 14269 24334 63600 25595 -25717 -68968 -79967 -86634 -83765 -42479
15904 -42479 -42003 -40144 -56360 -43342 -2422 8660 -3677 -37708 -39553 -9340 -857 -20148 -16945
15891 -16945 -30129 -15628 16347 324 -9536 -3686 -82172 -108639 -72274 -26818 -9298 -32288
15879 -32288 -51562 -32493 -1294 6112 5720 27387 1666 -27892 -68025 -63513 3947 76872
15867G6872J2495j4952m0128n8464m5484k8669k496L6512J1558R270l0786J1668
15855f2604L7582J4483O656K317O814m387l284l0232j8089j2931K3250L4793J6499
15842A0867J509k4959N0012o322j0947j9150j6742J411k2510R257J869l7985L5713
15829b7977L8400j4666Q930k9515k1812j3641M620J2869l299M7038K1798j0897
15817A1848J0195M2759P248j4518m482m4451k891j7586j3789O722j7509J2355
15805b4099M9332j5670j1010J884K3008l3850l5364L790l5748N0592N5746m7975
15793a9364k5029k0721R896M0211k991n6969n632k7083K9137N8871N594L7703
15781B3623q695p525k5218Q120J2533J5459k4613j4635K9872K992o8887J8343
$$ plain form
15867 76872 89367 74415 34287 -24177 -69661 -98330 -100826 -64314 -52756 -43486 -74272 -62604
15855 -62604 -25022 -10539 -3883 -1566 5248 861 -2423 -32655 -50744 -63675 -40425 -5632 10867
15842 10867 12376 -12583 37429 31107 20160 1010 -15732 -14321 -36831 -27574 -25705 -63690 -27977
15829 -27977 10423 -4243 4687 -24828 -46640 -60281 -55661 -42792 -46091 947 22745 11848
15817 11848 22043 64802 72050 57532 53050 8599 5708 -11878 -25667 -18945 -36454 -24099
15805 -24099 25233 9563 -1447 437 23445 -10405 -45769 -41979 -77727 -27135 28611 -19364
15793 -19364 -44393 -65114 -55218 -15007 -17998 -74967 -80599 -107682 -78545 -19674 -14080 23623
15781 23623 14928 7403 -17815 -9695 2838 18297 -6316 -20951 8921 11913 -56974 -38631
15769c8631P0579O84j0416M0295O412n2000K30J1072q994j3797l1437n223q229
15756c9455k891K0692J6985J1688N029L3299K4648J2710m9124o8523J3941J4767
15744f234r828K1169L1087l2323j7424J1079K8389K3758k0204J7038k804j5694
15732B8009l7651k7405J5652N3966J4545n9028k4451j9200L737M7354j0571j1387
15720b6430K7932O910k5068m599l3632K2907N6246K6651j3052k0418M134J4411
15708C5992j0900J1806Q952K228j6845k7501j4175K520L9927J5481K3533m0107
15696C0911p222j3441l32j6052m556M1640J0734L8847j2213P05k0200j6586k2953
15683I282Q106K7155j7557k1718m5997R241O573L86m231K1867p846j9234K28J4395
$$ plain form
15769 -38631 31948 32632 22216 62511 68923 16923 17153 28225 19231 5434 -26003 -31226 -39455
15756 -39455 -42346 -21654 -4669 7019 12048 45347 69995 82705 33581 -34942 -21001 -6234
15744 -6234 -16062 5107 36194 3871 -13553 -2474 25915 49673 29469 46507 43703 28009
15732 28009 -9642 -37047 -21395 32571 47116 -11912 -36363 -55563 -51826 -4472 -15043 -26430
15720 -26430 1502 8412 -16656 -21255 -54887 -31980 24266 50917 37865 17447 21581 35992
15708 35992 25092 36898 45850 48078 31233 3732 -10443 -7923 32004 47485 71018 30911
15696 30911 23689 10248 9916 -6136 -10692 30948 41682 80529 68316 69021 48821 32235 9282
15683 9282 17388 44543 26986 5268 -40729 -31488 -24915 -24529 -28760 -6893 -14739 -33973 -33745 -19350
15669a9350K362k0945j2831j4012J7874J1502p451J1393k0422n4344J6165L3829
15657e6230J4656K6833J2345j2875P188P26J8433l8848p761j3658K7523q142K3262
15644f548J5857K1754M0295N896J7196n075j2995m6515l1730j3115l0222L6368
15632h834J6860M4406k420k6511K88k6262j4390k7131J5065o237j9142L2715R868
15619a1725j070k278j7532l4463q495K7361L6735k7220m089m431O774K0710k821
15606b2544L1043o229J6972k4354J6546r289l2144j8115O157L0591m213j0320
15594b5899K3272j1087M1188j7679M47O512P923j2002m0131j6495p788j6633N1974
15581a6398L5481k8700l5271M3527L2776J51j1746J7089K809K043k393L6212k1020
$$ plain form
15669 -19350 -16988 -37933 -50764 -64776 -46902 -35400 -42851 -31458 -51880 -106224 -90059 -56230
15657 -56230 -41574 -14741 -2396 -15271 -8083 -7357 11076 -27772 -35533 -49191 -21668 -29810 -6548
15644 -6548 9309 31063 71358 77254 94450 89375 76380 29865 -1865 -14980 -45202 -8834
15632 -8834 8026 52432 50012 23501 23789 -2473 -16863 -43994 -28929 -35166 -54308 -21593 -11725
15619 -11725 -12795 -15073 -32605 -67068 -75563 -48202 -11467 -38687 -42776 -47207 -40433 -19723 -22544
15606 -22544 8499 2270 19242 -5112 11434 2145 -29999 -48114 -41957 -11366 -15579 -25899
15594 -25899 -2627 -13714 27474 9795 10242 16754 24677 12675 -27456 -43951 -51739 -68372 -16398
15581 -16398 19083 -9617 -44888 -1361 31415 31566 19820 36909 39718 41761 39368 75580 54560
15568E4560l4863m6865K6180N8179L9415k9901l1193K8572m574l1588J0k6243
15556A689J4688m667l0548q558n3458K4836K8347K900K4624J8054k8458l770o924
15543b1245j6635J8732j0188j6970K220k0409L0335j8864m0142j2324k493L3041
15531g4942K6500j0567J8759K0668N6053m331l0123j5056k4179K528L6050J0181
15519A1541N397m578j1574M754m8621k2838K9217M1050M215K158j2850J4289K1112
15506C3272o769O066k345k799L2241l26m689j9994k8907k6099J6211m5994K9339
15493b0793k65k6255p38L7891M1456J922l581J6458N3292o5430p6108j2832l7098
15480i2081j0767J4718M1635J0309R214l6117k0658R771J0123l174K4515K5513
$$ plain form
15568 54560 19697 -27168 -988 57191 96606 66705 35512 64084 59510 27922 27932 1689
15556 1689 16377 11710 -18838 -27396 -80854 -56018 -27671 -24771 -147 17907 -10551 -14321 -21245
15543 -21245 -37880 -19148 -29336 -46306 -44086 -64495 -34160 -53024 -93166 -105490 -107983 -74942
15531 -74942 -48442 -59009 -40250 -19582 36471 32140 2017 -13039 -37218 -34690 1360 11541
15519 11541 16938 12360 786 5540 -43081 -65919 -36702 4348 8563 10721 -2129 12160 33272
15506 33272 26503 32569 30224 27425 59666 59340 54651 34657 5750 -20349 -4138 -50132 -20793
15493 -20793 -21058 -47313 -48051 -10160 31296 33218 29637 46095 99387 33957 -42151 -54983 -92081
15480 -92081 -102848 -88130 -46495 -36186 -26972 -63089 -83747 -73976 -63853 -67027 -42512 -16999
15468a6999J1421M708j6092L1682L8341m5102j3341l3293j864L2831j3424L435
15456a7697j8810J217J9139n2148j3355P332K2139k3296k1546J2248M943L6821
15444d3013L2065M5709L1914j2378J367m1448k1305J3320K0994l1644n2631l5653
15432i2703N009L7513J7759K1041M219K3232K4485l2664l3394K130Q676r263K966
15419b0994R694M7871j5019k6397K5522K8197k0730j7745k652J3548j4349o1931
15407e4985M3880j4652L0442J31J0172k5326l7961M5213P4663l064n4202R07M426
15394A9644m1279k6525R413M3834Q559j3753m8267l3558j445M2651J343k9732
15382f9115o730J0593l2776k6375M8826L5009K0892k5066k3216n135n740N2463
$$ plain form
15468 -16999 -5578 -870 -16962 14720 53061 7959 -5382 -38675 -40539 -7708 -21132 -17697
15456 -17697 -36507 -35290 -16151 -68299 -81654 -74322 -52183 -75479 -97025 -84777 -79834 -43013
15444 -43013 -10948 34761 66675 54297 55664 14216 -7089 6231 27225 -4419 -57050 -92703
15432 -92703 -87694 -50181 -32422 -11381 -7162 16070 40555 7891 -25503 -23373 -14697 -23960 -20994
15419 -20994 -11300 36571 21552 -4845 20677 48874 28144 10399 7747 21295 6946 -54985
15407 -54985 -11105 -25757 4685 4816 14988 -10338 -48299 -3086 71577 68513 14311 15218 19644
15394 19644 -21635 -48160 -38747 5087 13646 -107 -48374 -81932 -83377 -40726 -39383 -69115
15382 -69115 -75845 -65252 -98028 -124403 -75577 -40568 -19676 -44742 -67958 -73093 -78833 -26370
15370b6370L2481O88n6135k6356p739M7239L4455k8044k4668K4681L2524m7540
15358d4784l6886L430O1459K9711r983r998o802l0555k9869M2546J7343k406j1128
15345b7922j5506j6695n741j4894j3772J9331K7222K9183P11n017K5702N7181
15333E9783j6388k8152j1498l4493J7118L6620n874j9709m3320j02K1219n184
15321b9980J046O7J9634K5097m1204l9376J287q690J8723K6650O1908k4684k4321
15308a3843K9851j8527l0907n2495m2692N7260P8798j9242J7969L4160j8175k1440
15296G17P793M4676k03l8173J5733l0112k7771j9006J4925N0496K7633j5869M638
15283C5477K756L9950p824k7374k3385n660j3481k4591k2511j7232L5363N0691
$$ plain form
15370 -26370 6111 6799 -49336 -75692 -83431 -36192 -1737 -29781 -54449 -29768 2756 -44784
15358 -44784 -81670 -78240 -16781 12930 2947 -7051 -13853 -44408 -74277 -31731 -14388 -16794 -27922
15345 -27922 -43428 -60123 -65864 -80758 -94530 -75199 -47977 -18794 -18083 -23100 2602 59783
15333 59783 43395 15243 3745 -30748 -13630 22990 17116 -2593 -45913 -46015 -24796 -29980
15321 -29980 -28934 -28867 -9233 15864 -25340 -64716 -63429 -72119 -53396 -26746 35162 10478 -13843
15308 -13843 16008 -2519 -33426 -85921 -128613 -71353 7445 -11797 6172 40332 22157 717
15296 717 8510 53186 52983 14810 30543 431 -27340 -46346 -31421 19075 46708 30839 35477
15283 35477 38233 78183 70359 42985 19600 13940 459 -24132 -46643 -63875 -28512 22179
15271B2179j0335l0544m304L516l5722n1287K7151K8701l0721l230K4202N9077
15259a317P432o009o906K3316M7763k9673l6032p818L0712k0688m431r736K1046
15246G659K1181o6732m4441O226M6773p876k1339j8946L6528L5240L582j0504
15234a2649l5703J5324L4315J6143j8788m7689j4519P523P8055O1809N672k1561
15222F7932j0122k5392k5056j4776J0461m913j3801m6587n880L6307K069o814
15210c6572k9390L786O2460N1792k210l6322j3044J0448J4397k2682j0325j1991
15198a9653K412R455j0674k535M255k6341j379k4650j3025L4853J287m189L0515
15185a9669L7629L3975J8309L4986k1107l4650j7845j2431M2852k0005J2316N3768
$$ plain form
15271 22179 11844 -18700 -23004 -19488 -55210 -106497 -79346 -50645 -81366 -84596 -60394 -1317
15259 -1317 6115 106 -6800 16516 64279 34606 -1426 -9244 21468 780 -3651 -13387 7659
15246 7659 28840 -37892 -82333 -76107 -29334 -37210 -58549 -77495 -40967 -5727 -2145 -12649
15234 -12649 -48352 -33028 1287 17430 -1358 -49047 -63566 -56043 22012 83821 89493 67932
15222 67932 57810 32418 7362 -7414 3047 -1866 -15667 -62254 -68134 -31827 -29758 -36572
15210 -36572 -65962 -62176 284 52076 49866 13544 500 10948 25345 2663 -7662 -19653
15198 -19653 -17241 -7786 -18460 -20995 -16740 -43081 -44460 -69110 -82135 -47282 -45995 -50184 -19669
15185 -19669 17960 51935 70244 105230 84123 49473 31628 19197 62049 42044 54360 108128
15173A08128p654j9828j099o5293l5434j9712N108j3551j8277N4957L7471L7416
15161F2232j6916l6608k1944K3618j656k2941M2827k0301P467j2836j4207N643
15149e622j495j5246k667J7846L5307M669j8340K6136k8590k5128p397l151N5331
15136C1653l649m8981l0751L3715N8622m899n2274R229J5538J9444O76k3056O0620
15123F5887J1194l2927l6595j3542J8520K8797j0943k0733j2321l4836k3562l0512
15111i1573O7164M5154j9433J8463O72k9386K1134q495J2956j3644j7106N103
15099h991j714p767j0479k074j1917k8632P554M256J1522O467l07R2L0935k3710
15085c4765J2191M9583K3040M518k4469j6619J5033j3304k854M990k4739p475
$$ plain form
15173 108128 100474 80646 79547 14254 -21180 -40892 -35784 -49335 -67612 -12655 24816 62232
15161 62232 45316 8708 -13236 10382 8726 -14215 28612 8311 15778 2942 -11265 -5622
15149 -5622 -7117 -22363 -25030 -7184 28123 32792 14452 40588 11998 -13130 -20527 -23678 31653
15136 31653 28004 -20977 -51728 -18013 40609 35710 -16564 -7335 8203 27647 28323 5267 65887
15123 65887 77081 44154 7559 -5983 12537 41334 30391 9658 -2663 -37499 -61061 -91573
15111 -91573 -24409 20745 1312 19775 20447 -8939 12195 3700 16656 3012 -14094 -8991
15099 -8991 -10705 -18472 -28951 -31025 -42942 -71574 -64020 -59764 -48242 -41775 -42082 -41990 -11055 -34765
15085 -34765 -22574 27009 50049 54567 30098 13479 28512 15208 12354 17344 -7395 -14870
15073a4870n587j6309rL0377J6943K6454L0785j720o6075j7087j7326P724J8289
15060h411L7920L0843k3107k8191j1131N810l284Q245m85L0469N513J6486m7709
15047A2968l5652k9016K9365J7479l6292R561J2036J8599m4200j9068N1018o136
15035a9338L8104K7334j4679j2635J0961K0479J627l846M3234R339m6247o214
15023D8119L6078J253l2009m4747J5852P79q125j8359M28J4890P214j2365j2654
15010c646J2091j4297k0632j2647L8079K4505J9121l1069j4841L6840M4440j0877
14998F7067m0559j0348l7253k7877Q427L2208r52J596k556k5066j2390K7422K5724
14985E443k442j35M049k128J520J2485J2239l5640k2893j3400J3067p804R801
$$ plain form
15073 -14870 -20457 -36766 -36775 -6398 10545 36999 67784 66064 -11 -17098 -34424 -26700 -8411
15060 -8411 29509 60352 37245 9054 -2077 3733 449 8694 8209 38678 44191 60677 12968
15047 12968 -22684 -51700 -22335 -4856 -41148 -31587 -19551 -952 -45152 -64220 -13202 -19338
15035 -19338 18766 46100 31421 18786 29747 50226 51853 48007 91241 100580 54333 48119
15023 48119 84197 85450 53441 8694 24546 25325 17200 -1159 -731 14159 21373 9008 -3646
15010 -3646 8445 -5852 -26484 -39131 -1052 23453 42574 11505 -3336 33504 77944 67067
14998 67067 26508 16160 -21093 -48970 -40543 -8335 -9287 -7691 -10247 -35313 -47703 -20281 5443
14985 5443 3001 2866 6915 4787 6307 18792 31031 -4609 -27502 -40902 -27835 -35639 -25838
14972b5838L9657J8295q761j1605M0146n250m2241j6298j3801j0305O1489L7290
14960F2778l0553j0547k0764j3981k6017l0874L490k5592m633J0285k2501J925
14948a06984M7161L3517p051J3004J4570j3475k6517k666K6216N561J6578r302
14936i388r363K5534j8552L4325r314k5008M3001K2270l5712k4351j739l157N386
14923f068K2968r120k1898J6210K9835J4864m1169k575R000J7654j7679L460j2954
14910B528n0162n34O038r303M7378K2615L125m8740n3790j1013K40M8164K5809
14897a7645N9165L3007k3554j1742l3708p328N892M684k1439l6958j3489L8428
14885b4687J4043n884j7552K1498L4422k4938j4468L331k7909k2382M8370J3703
$$ plain form
14972 -25838 13819 32114 23353 11748 51894 46644 4403 -11895 -25696 -36001 25488 62778
14960 62778 32225 21678 914 -13067 -39084 -69958 -66468 -92060 -96693 -86408 -108909 -106984
14948 -106984 -59823 -26306 -33357 -20353 -5783 -19258 -45775 -48441 -22225 -16664 -86 -9388
14936 -9388 -18751 6783 -11769 22556 13242 -11766 31235 53505 17793 -6558 -8297 -11454 -6068
14923 -6068 16900 7780 -14118 2092 31927 46791 5622 3047 12047 29701 12022 15482 2528
14910 2528 -47634 -48168 -42130 -51433 -4055 18560 21685 -27055 -80845 -91858 -91618 -43454 -17645
14897 -17645 41520 74527 50973 39231 5523 -1805 4087 8771 -12668 -49626 -63115 -24687
14885 -24687 -10644 -16528 -34080 -12582 21840 -3098 -17566 -14235 -42144 -64526 -16156 -2453
14873b453l2510j8370N361k1733K2413J7471k061p1282k030K7204M8579J343K3233
14860d835j3202M4174j9579Q290m299j2719k1516m368r591K6896J7991m428M046
14847F860l5052n1727k3245L0095k3734J7604J5249L203J2386J839j6126J8677
14835d3971L1260J6618o68J8442o78j1703l5278j3631J7332J7467L7208o497m3380
14822a7479o1771K3311M9588J6771j6824n2284k5149j5318N0223L3700m075j3341
14810c2648J8326k6480J7750L5571k936l2242j1487R041k1569J1112O2667l434
14798B3671k5074n2205l2104P3816K8496k3764k1185O939K8239o584k1172k0449
14786d1376p609r761K3516L293P239M7743J8407J138l2730m0225k1309J1810k7602
$$ plain form
14873 -2453 -34963 -53333 -47972 -69705 -47292 -29821 -31882 -103164 -105194 -77990 -29411 -28068 -4835
14860 -4835 -18037 26137 6558 14848 10549 -2170 -23686 -28054 -37645 -10749 7242 2814 6860
14847 6860 -28192 -79919 -103164 -73069 -96803 -79199 -63950 -60747 -48361 -46522 -62648 -43971
14835 -43971 -12711 3907 3239 21681 21003 9300 -25978 -39609 -22277 -4810 32398 25901 -17479
14822 -17479 -79250 -55939 -6351 10420 -6404 -58688 -83837 -99155 -48932 -15232 -19307 -32648
14810 -32648 -14322 -40802 -23052 12519 9583 -22659 -34146 -25105 -46674 -35562 27105 23671
14798 23671 -1403 -53608 -85712 -11896 16600 -7164 -28349 -21410 6829 245 -20927 -41376
14786 -41376 -48985 -58746 -35230 -31937 -24698 23045 41452 42590 9860 -30365 -51674 -39864 -67466
14773f7466m6494N9744M8744K9864q043n523k4413o502n8369J1000m4316k8860
14761a40634Q9254N8942K5808n8170p5548J4852N9177L1260l468K7253M1189k4121
14749D5794l9164m5132L949O3343M0235j2081n2024l066j4762J1387J7633J6475
14737C2587Q125j1255k0424K3379l630J6777j470m8098O019J5680J6218l239l6847
14724f178K4504K9538j9505j0678l6049j9189j1717j6672K1015j6567m056Q402
14712e7152p474j9029J6735O1220L9388k928l7290o559j6025n484k9052l5541
14700i9191L7810J6522m3909J626k5354k1946J11453K1622k9255N07K4846K1707
14688A6438j9302n5313K3027K1151J8084j3912p72K3665p023n6604Q399P0148
$$ plain form
14773 -67466 -113960 -54216 -5472 24392 16349 10826 -13587 -20089 -78458 -67458 -111774 -140634
14761 -140634 -51380 7562 33370 -24800 -100348 -85496 -26319 4941 1473 28726 69915 45794
14749 45794 6630 -38502 -34553 28790 69025 56944 4920 1854 -12908 -1521 16112 32587
14737 32587 40712 29457 9033 32412 28782 45559 44089 -4009 2010 17690 33908 30669 -6178
14724 -6178 18326 47864 28359 17681 -18368 -37557 -49274 -65946 -44931 -61498 -65554 -57152
14712 -57152 -64626 -83655 -66920 -5700 33688 30760 -6530 -13089 -29114 -34598 -63650 -99191
14700 -99191 -61381 -44859 -88768 -87142 -112496 -134442 -22989 -1367 -30622 -30115 -5269 16438
14688 16438 -2864 -58177 -35150 -13999 4085 -9827 -10599 13066 6043 -50561 -42162 27986
14676B7986l0324l0545P937K468M0570L3255j7154k4427k2617m2133K0503M849
14664b9632k186L437k4194n723M404K0681L7504k7082L646M628M7708l5936p867
14651a0612M2520n505o1132j7318K9845K4758K0713R708k4879J70L3627J0470
14639E2365j8478L767N800j0080K6856K1215n4860m7720K0723J0968P847M763
14627B3166N8589L1752m5259l7761l0418l3342J8728J9504J0726k6362k568j9867
14615c3112Q882Q737j6031j333k37K0462L6956J9585n7172q358J2527l1123l4762
14602g4979L2845K2664j3308m3523j3740L2149j3515j4311K9017j1157j30L5625
14590c2363M6583J345j3867q368P244J859Q225N336K5441J8094J185K8231K8755
$$ plain form
14676 27986 -2338 -32883 -24946 -22478 18092 51347 34193 9766 -12851 -54984 -34481 -29632
14664 -29632 -31818 -28381 -52575 -58298 -53894 -33213 4291 -22791 -19145 -14517 33191 -2745 -10612
14651 -10612 31908 26403 -34729 -52047 -22202 2556 23269 32977 8098 8268 41895 52365
14639 52365 33887 37654 43454 33374 60230 81445 26585 -21135 -412 10556 18403 23166
14627 23166 81755 113507 68248 30487 69 -33273 -14545 4959 15685 -10677 -13245 -33112
14615 -33112 -24230 -15493 -31524 -32857 -33094 -12632 24324 43909 -13263 -21621 -9094 -40217 -74979
14602 -74979 -42134 -19470 -32778 -76301 -90041 -57892 -71407 -85718 -56701 -67858 -67988 -32363
14590 -32363 14220 15565 1698 -6670 574 2433 10658 15994 41435 59529 60714 88945 117700
14577A17700k4904K2953J1921j8822j4951P2961Q8917J02693J56995J74506J78372
14566H68341L05889L71033M51708M00617K80068J22190L1856j92081l52640l62717
14556A924264l45516l32897k84301k06056j66547j28201q1202l9381k1582k0005
14546B98576l4306m5635o1306p0303l2840k0995K0258K3488k4213m1939J1895
14535B2680P525J3121n303k3234J2481L0141j7568p769j8742M9479K1693l1275
14523E3229J7705q204j446o767m1860m0147L5603M2135L947k5967m6434l6884
14511e5090j0555J6017N3389L044j0861J2777L1782K1438J4704J4028k2607m230
14499F3836K7897l1n5979p753j7439j2058J2521L3690j5515l0593Q525j1859j6375
$$ plain form
14577 117700 92796 115749 127670 108848 93897 166858 255775 358468 515463 689969 868341
14566 868341 1174230 1545263 1996971 2397588 2677656 2799846 2831702 2639621 2286981 1924264
14556 1924264 1578748 1245851 961550 755494 588947 460746 379544 340163 318581 298576
14546 298576 264270 218635 157329 87026 54186 33191 53449 76937 52724 10785 22680
14535 22680 30205 43326 38023 14789 27270 57411 39843 32074 13332 62811 84504 53229
14523 53229 70934 62730 61284 54517 12657 -27490 8113 50248 54195 28228 -18206 -55090
14511 -55090 -65645 -49628 3761 6805 -4056 8721 40503 61941 76645 90673 68066 63836
14499 63836 91733 91702 35723 27970 10531 -1527 10994 44684 29169 -1424 7101 -4758 -21133
14486b1133J3012l551L2665j1072m5919k2360J270P477M6096N677l9316K5413
14474a1741P592k0047N3581L9159j2888k3767N58j8438m91l5564O142J5091k5841
14461b6654J0919r465J0373j9290M5214M5835k5587j3378l099n8111J2797K7200
14449c246Q377l855K2956K961J9950N46J3227l398k9966J974k1332J2008K6872
14436D7074k9119K7158O212r320j5056J5731k1469J9244j7570m6568m3470n977
14424g3130K6434j7049p07J4625O7053L3220m3118m651L9912O2192K9301L0924
14412A65006k8403m7515p624P009j2274n6904K145J1827j9088n3891J1580N4062
14400B5930j0606k0729Q998K994K8325l7499L3781L8102K557m0444K3472J8576
$$ plain form
14486 -21133 -8121 -11672 20993 9921 -35998 -58358 -57088 -49611 -3515 2162 -37154 -11741
14474 -11741 -4149 -24196 29385 68544 55656 31889 32447 14009 13518 -22046 -15904 -813 -26654
14461 -26654 -15735 -25200 -14827 -34117 11097 56932 31345 17967 14868 -43243 -30446 -3246
14449 -3246 5131 1276 24232 27193 47143 47689 60916 57518 27552 29526 8194 20202 47074
14436 47074 17955 45113 51325 42005 26949 42680 21211 40455 22885 -23683 -67153 -73130
14424 -73130 -46696 -63745 -64452 -49827 17226 50446 7328 2677 42589 104781 134082 165006
14412 165006 136603 89088 81464 88473 76199 19295 21440 33267 14179 -39712 -28132 25930
14400 25930 15324 -5405 3593 6587 34912 -2587 31194 69296 71853 31409 54881 73457
14388G3457K039j0150j836l5756K2562J8942j069q85R59o199J484J7586K2800
14375A03934P426J762J3794P4407P4906N0006Q2705L9810j3438J6785J7097k4687
14363D44507n6840r333j727j6377n8279m1464n9953m4952m3706j7626P996l401
14351I8845K8217j1930r808L7015J2599o5178j5267N0558K4986J9075r331j6535
14339A43246J3162M4145M8982K9585N2948J9949L9278L0172N3373L9317l7385
14328D76772m5700r112m6353k2161l4258l305k8852l3953l0686l9234l6941L3861
14316A80078k4216n2931m6400n3836M311J8201K270k2589J8296J4705M8648K5752
14304A12289M793m561n1619l5581r849L0035k3167j8562Q870K9072L383J5280
$$ plain form
14388 73457 75496 65346 63510 27754 50316 69258 68189 67304 68263 62064 63548 81134 103934
14375 103934 111360 113122 126916 201323 276229 326235 408940 448750 435312 452097 469194 444507
14363 444507 387667 378334 376607 360230 301951 260487 200534 155582 111876 94250 102246 98845
14351 98845 127062 115132 105324 142339 154938 89760 74493 125051 150037 169112 159781 143246
14339 143246 156408 200553 249535 279120 332068 352017 391295 421467 474840 514157 476772
14328 476772 431072 421960 375607 353446 319188 315883 287031 253078 222392 183158 146217 180078
14316 180078 155862 102931 56531 2695 7006 25207 27477 4888 23184 37889 86537 112289
14304 112289 117082 112521 60902 25321 15472 45507 22340 3778 12648 41720 45103 60383
14292F0383j7151j8755k3203j5399N7105L5230j5423l0950P996j2001O653p500
14280B6985l8384k3068K103P998J7267j6730N5947K4234q4005j9457L4397r347
14268b2060j569L8660j3622m932L3819k1045L0038Q70J2319j1286j1025j6405
14256A3762P432k3565k7194J2991J4274Q216j7373Q725L8528j5690k6472j0935
14244a7301N531L1915J9136K0012j904K416l3374R175j372K6746K3054m4699k4040
14231A5295K549K2242N0006J3324n670n2873k8250n335r660J1557m0283j6647
14219d3745K8193K9658R985m831k7267l2523j1615p77J1058q3k544Q517J6976
14206a8998K5153J9284L639k1903J6851K6262l0861k8741O512j0664k8747j0205
$$ plain form
14292 60383 43232 24477 1274 -14125 42980 78210 62787 31837 39833 27832 34485 26985
14280 26985 -11399 -34467 -32364 -24366 -7099 -23829 32118 56352 -27653 -47110 -12713 -22060
14268 -22060 -23629 15031 1409 -3523 30296 9251 39289 40159 52478 41192 30167 13762
14256 13762 21194 -2371 -29565 -16574 -2300 5916 -11457 -2732 35796 20106 -6366 -17301
14244 -17301 -11770 20145 39281 59293 57389 59805 26431 35606 34234 60980 84034 39335 15295
14231 15295 17844 40086 90092 103416 97746 44873 16623 11288 1628 13185 -27098 -43745
14219 -43745 -15552 14106 24091 19260 -8007 -40530 -52145 -52922 -41864 -41947 -44491 -35974 -18998
14206 -18998 6155 25439 29078 7175 24026 50288 19427 -9314 -2802 -13466 -42213 -52418
14194e2418k846J8051L9402R444K5907J1827J1078K279P382k4875K281k6231K9823
14181E1104L6962L6869L742J7447j1291q994K722m2376K228K8240O046K6225L113
14168A52037k05M0741o598p0492k8975J9558L7061M846k2127j0763l8552r256
14156F7275j2877k083j9026M2845J6867R262k2848r136J0601n5674k2561q590
14144e945Q458N2617J0359R487l519j9709l3248L1440L8793L9072p872m333O778
14131A22378j1556k4533j9317p075J8067J6342n1810k7024K8856q664K6344J6165
14119G8173K920J3411j5684n3475j6542M6741J5359L4208l5860Q57K5575K0048
14107A15731M59r246l9118m4737J0333K3663P587J1394J6776K2469N559J8267
$$ plain form
14194 -52418 -55264 -37213 2189 11633 37540 49367 60445 62724 70106 45231 47512 21281 51104
14181 51104 88066 124935 128677 146124 134833 125839 128561 86185 88413 116653 122699 148924 152037
14168 152037 151832 192573 185975 115483 86508 106066 143127 147973 125846 115083 76531 67275
14156 67275 54398 52315 33289 76134 93001 102263 79415 70279 80880 25206 2645 -5945
14144 -5945 2513 55130 65489 74976 71457 51748 18500 49940 88733 127805 119933 115600 122378
14131 122378 110822 86289 66972 59897 77964 94306 42496 15472 44328 35664 62008 78173
14119 78173 81093 94504 78820 25345 8803 55544 70903 105111 69251 70108 95683 115731
14107 115731 116190 106944 67826 23089 33422 57085 64672 76066 92842 115311 120870 139137
14095A39137l3951j3300N1367M9975n450k9668K8516o931K6465J8241M6781N5992
14083C27174k41O7588N4131K2820N6969L9179L0789L7753N7014J5394l0248J416
14071F79738m5339n8117o3474m0427l5150PJ0927l3241q29l4575K678n6206n0609
14058B75383n3510j7215K5727L8466j9406n5742P106Q0332O8846K4451N588N8039
14046D38065M7218N9808J014P4864N7799J8910m5708k8491J0813j6752q898j2312
14034E96330m1506q7215p8659l5440j8219J481m3298n5812p219J2303q424m7021
14022A87301n085K1720k6462k1939Q380l4773j6392K9892j4879J495l437N16R045
14009A35382K2478J7247J7159J9531j4467N006R815J5366n8239j0497j743L0344
$$ plain form
14095 139137 105186 91886 143253 193228 187778 158110 186626 179695 206160 224401 271182 327174
14083 327174 326933 394521 448652 471472 528441 567620 598409 636162 693176 708570 678322 679738
14071 679738 634399 576282 512808 472381 437231 437238 448165 414924 414095 379520 382198 325992 275383
14058 275383 221873 204658 230385 268851 249445 193703 200809 281141 349987 374438 380026 438065
14046 438065 485283 545091 546105 620969 678768 697678 651970 623479 634292 617540 608642 596330
14034 596330 554824 467609 388950 353510 335291 336772 293474 237662 230443 242746 234322 187301
14022 187301 182216 203936 177474 155535 163915 129142 112750 142642 127763 129258 125821 126337 135382
14009 135382 157860 175107 192266 211797 197330 202336 212151 227517 169278 158781 157038 187382
13997A87382P651j7801k9580J8817K7025m788J6423N2616L88j107n001j9207n071
13984B27747N9842M7872J543k9458j7756J0023O177K5044K9919L6689P7413K7396
13972E02451J9492N9243O9547J6469m5554K4840M3907J8370L6982L7549j898L4222
13960H15620L0283K0731K8408M3057J3573m972L9351Q2477J11603Q4827R1721
13949A356679R4971P3168J24252J30761J19029J45213K00458K53370K77624K88581
13939C064106L58224M35703M63919N43318O80130Q18184R89097J171837J401357
13930I925875J743851K192912K767512L525783M500644N570992O681093P651245
13922D4559907Q237561Q244508P436086N886132L728869J186452j485593l736234
$$ plain form
13997 187382 195033 177232 147652 166469 193494 188706 205129 257745 258133 257026 252025 232818 227747
13984 227747 287589 335461 337004 307546 289790 299813 305990 331034 360953 397642 475055 502451
13972 502451 521943 581186 650733 667202 621648 646488 690395 708765 745747 783296 781398 815620
13960 815620 845903 866634 895042 938099 951672 946700 986051 1068528 1180131 1264958 1356679
13949 1356679 1451650 1524818 1649070 1779831 1898860 2044073 2244531 2497901 2775525 3064106
13939 3064106 3422330 3858033 4321952 4865270 5545400 6363584 7352681 8524518 9925875
13930 9925875 11669726 13862638 16630150 20155933 24656577 30227569 36908662 44559907
13922 44559907 52797468 61041976 68478062 74364194 78093063 79279515 77793922 74057688
13914G4057688n445948o467318o831507o645909o048538n156634m318382l554701
13906B9588751k797594k201330j796124j417441j089620q26373n87543l22205
13898A8550521p1923J32609M39516O46247R22165J234963J574256K130299K762877
13889B8321530L489662M433517N430570O377707P186248P597498P291039O242913
13881G6370684M464592K107499o01160l362579n571822p084094p964847q176767
13873E0181506p685471o789926n781547m759421l855905l116690k488219k015298
13865A3689029j675904j391491j151686j028679q75295p63678o04624n53252n15637
13856E128783m43718m03086l11896k54941k37385j82488j81624k02532j32049
$$ plain form
13914 74057688 68611740 62144422 55312915 48667006 42618468 37461834 33143452 29588751
13906 29588751 26791157 24589827 22793703 21376262 20286642 19460269 18872726 18550521
13898 18550521 18478598 18611207 19050723 19696970 20619135 21854098 23428354 25558653 28321530
13889 28321530 31811192 36244709 41675279 48052986 55239234 62836732 70127771 76370684
13881 76370684 80835276 82942775 82341615 78979036 73407214 66323120 58358273 50181506
13873 50181506 42496035 35706109 29924562 25165141 21309236 18192546 15704327 13689029
13865 13689029 12013125 10621634 9469948 8441269 7565974 6802296 6197672 5644420 5128783
13856 5128783 4685065 4281979 3970083 3715142 3477757 3295269 3113645 2911113 2779064
13847B779064p6806p2623l8417o8192n4975m3217j4226k3547l1521o8215j20612
13836B166713j27785m4886o381J1618O8510K64153M73356N75142O97058P10424
13826D787922N22251L73813K1786l84844o72127o98864p22913o04476n16059l81364
13816A725125k72059k08874j56337r4664l6749k1274j8954q1077o6787m784l6251
13805G27315m3056o6400m1927J7544l3494n5784m5740j8830o98M3898J365n9712
13793D24481k2589k0160J8896L4099o072k7929k3621l870N818j9355k9771k1673
13781C08254J0453J1510J436L77k6859K78m1496m2808K4022k801k3318k7968L125
13768A94205J4962P814j6089m821P626K17m719l014p396J111J7619m462l202j5216
$$ plain form
13847 2779064 2702258 2629635 2591218 2523026 2468051 2424834 2410608 2387061 2355540 2287325 2166713
13836 2166713 2038928 1994042 1987661 1999279 2067789 2331942 2805298 3380440 4077498 4787922
13826 4787922 5310173 5683986 5705772 5320928 4648801 3949937 3227024 2622548 2106489 1725125
13816 1725125 1453066 1244192 1087855 993191 956442 935168 916214 835137 768350 763566 727315
13805 727315 684259 617859 575932 593476 559982 504198 458458 439628 438930 482828 484193 424481
13793 424481 401892 381732 400628 434727 428655 400726 377105 373235 379053 359698 329927 308254
13781 308254 318707 330217 331653 332030 305171 305449 263953 221145 245167 242366 219048 191080 194205
13768 194205 209167 216981 200892 196071 203697 203914 199195 196181 188785 189896 207515 203053 199851 184635
13754A84635j0523K9973K8149l6950k1533j490j7546j4632J1997k1345m5145L850
13742H9440N2493k063J5870j9266j0029K0390J6555k0842K1363p166K1066k1981
13730A55830N332K274q486j8854j9562K3688k5158l9539n693M749J1150K4829
13718A10560M0630j7428k3412l8962J2862j0969r110J041r048J9391J5507j9497
13706G1565l153j7933k0676N740M4796r141O598j3480J5923K5370n384k5969j067
13693G3189L9285l4437k1164l1218k404J8558K5246J8271M3720N322l6869m966
13681I2533k3056r897l51P003j4654m5112l8050J242K3307K3581j2180L2146o028
13668C0484m9344J2214J7932k6967K0028k4700j2166k1935J8768L3961j0167R150
$$ plain form
13754 184635 174112 204085 232234 195284 173751 172261 154715 140083 152080 130735 85590 89440
13742 89440 141933 139870 155740 136474 126445 146835 163390 142548 163911 156745 177811 155830
13730 155830 161162 163436 154950 136096 116534 140222 115064 75525 69832 74581 85731 110560
13718 110560 151190 133762 110350 71388 84250 73281 64171 65212 56164 75555 91062 71565
13706 71565 68412 50479 29803 35543 80339 71198 77796 64316 80239 105609 100225 74256 73189
13693 73189 112474 78037 56873 25655 23251 41809 67055 85326 129046 134368 97499 92533
13681 92533 69477 59580 59229 66232 51578 6466 -31584 -30342 -7035 16546 4366 36512 30484
13668 30484 -18860 -6646 11286 -15681 4347 -20353 -32519 -54454 -35686 -1725 -11892 -2742
13656b742M37J4116L4449K092n204J386j6585p461K3629p671j6634K761K9185
13643E1758m5695P084P9268K0851l4496j4876j513N964k1451j8123n22j749j7989
13630H511L3572k8367j2221l548m789L9571n808o692L0053Q191k3331l6202o078
13617g138k2720L1791K435r998n509j6559N7436P3627l276J7040K6336m674R291
13604A48082r492j6780R592m0509q2566J2645p280p41j3934l396M9440j1719q842
13591B4500K6947Q71l2524j8945K082L6747K1445p429J2395J461o3707j5734n853
13578a7744K4284r258j1825M1214J7707K7632o0091k354N1354L5464J3720l0818
13566G9285M177K8047K4150O830R75l5000K7166M1139M1592l378L1740J15622
$$ plain form
13656 -2742 -2305 11811 46260 48352 43148 44534 27949 20488 44117 36446 19812 22573 51758
13643 51758 6063 13147 92415 113266 78770 63894 62381 68345 46894 28771 28249 26500 8511
13630 8511 42083 13716 1495 -2053 -6842 32729 26921 20229 50282 58473 35142 -1060 -7138
13617 -7138 -29858 1933 4368 -5630 -11139 -27698 29738 103365 100089 117129 143465 138791 148082
13604 148082 138590 121810 131402 90893 8327 20972 13692 12951 -983 -4379 45061 33342 24500
13591 24500 51447 52318 19794 849 2931 39678 61123 53694 66089 67550 3843 -11891 -17744
13578 -17744 6540 -2718 -14543 26671 44378 72010 11919 9565 60919 96383 110103 79285
13566 79285 83462 111509 135659 142489 143464 108464 135630 176769 218361 214983 246723 362345
13554C62345J32546J19033J85541J26061R0398Q1984N0002p1058p9838j31721
13544H65293j72988j37487r9419j15381o3119l3383n7163l1888l6526j8835J8719
13533A17823j2926N240q514r627K9215l3731m9375j1332J652J6383k4196j8304
13521B308r60K0026O8842r492m2585j7833L5209O052N1436L7008o1223p1174J7917
13508C5531K4815n757k2060j9293J3352l002j2209N559l735K8504L1626j4644
13496E8687l962K6853j5235n5023k606l765N201J5593Q627J0226M4339J2290j7859
13483H3366p695L6878J0173n6623j9784o643J7633L1920J507J4410O829J7055
13471A29026m156O377j0824M5358O2925J2465J0873L1292L2826L2368K2619K1310
$$ plain form
13554 362345 494891 613924 799465 925526 1015924 1097908 1147910 1076852 997014 865293
13544 865293 692305 554818 455399 340018 276899 243516 186353 154465 117939 99104 117823
13533 117823 104897 110137 101623 91996 121211 87480 38105 26773 28425 44808 20612 2308
13521 2308 1348 21374 90216 80724 38139 20306 55515 61567 113003 150011 88788 17614 35531
13508 35531 60346 54589 32529 13236 26588 23586 11377 16936 13201 41705 73331 58687
13496 58687 54725 81578 66343 11320 8714 4949 10150 25743 34370 44596 88935 101225 83366
13483 83366 75671 112549 122722 66099 46315 39672 57305 89225 90732 105142 111971 129026
13471 129026 124870 131247 120423 165781 228706 241171 252044 283336 316162 348530 371149 392459
13459C92459P282O459k0766k2973j0163j2360j0864l0776j2035k1657k8407k0892
13447B15307k2325o745J0951m5080j2223J4478J6915K0691n853J3278N9207J8910
13435B77511K8784M0524K0012M8658Q4292K3830l7173Q415Q964M7260m8107l6009
13423D66961r25j0499N683o8150m1402n3926m5316l1867j8235j4554j9111r152
13411A59507K9155o002m2417j2282k7343O8155O3304M3276j4588O140J7782l4604
13399B50083j7845M5817p880m4806j0691k9728j0261j5151j3220l3687l3900k3576
13387E5155l020k121k0871k898k0936j2255j894J1222k0977K2328O680N766M3071
13374E9250K8974k469l0397j6810j3551r830j5001K4698P173O013J3748m4973
$$ plain form
13459 392459 399741 406200 385434 362461 352298 339938 329074 298298 286263 264606 236199 215307
13447 215307 192982 186237 197188 152108 139885 154363 171278 191969 186116 199394 258601 277511
13435 277511 306295 346819 366831 415489 499781 523611 486438 494853 503817 551077 502970 466961
13423 466961 466036 455537 461220 393070 351668 297742 252426 220559 202324 187770 168659 159507
13411 159507 188662 182660 140243 127961 100618 168773 232077 275353 260765 266905 284687 250083
13399 250083 232238 278055 270175 225369 214678 184950 174689 159538 146318 112631 78731 55155
13387 55155 52135 50014 29143 26245 5309 -6946 -8840 2382 -18595 3733 10413 16179 59250
13374 59250 88224 85755 55358 38548 24997 15167 166 24864 32037 38050 51798 6825
13362F825j9670j2515l0658k3994m910O282K0779K0438K0973k1687n1426J5969
13350g3594P3187K9890Q534j5018k2388l6828m088K8187K9872m64K586m2377l9167
13337f1668P108N7819M7296L823k7740m4818k2685P782J4126j7700O718K3922
13325f017J9332k6601k430J5685N3343J4216l3908j6508k8235j2113j8141P643
13313c3734N6594j0478k6828L7831r161n097P358k82K5594m7995k7927P028J0452
13300a6645n353r057J7063J7164K7168j8169l1876N660M5369r323l08L26o637
13287A5382l5780P132O0463L1457j8727l2162N584j2412j7497p3048o6899L0779
13275a05728J4946r962L8062O2717K4809K1709J4678Q605J5528k8946l9811m2570
$$ plain form
13362 6825 -12845 -25360 -56018 -80012 -84922 -78640 -57861 -37423 -16450 -38137 -89563 -73594
13350 -73594 -407 29483 38017 22999 611 -36217 -40305 -12118 17754 17290 19876 -22501 -61668
13337 -61668 -54560 3259 50555 54378 26638 -18180 -40865 -33083 -18957 -36657 -29939 -6017
13325 -6017 13315 -13286 -15716 -31 53312 67528 33620 17112 -11123 -23236 -41377 -33734
13313 -33734 22860 12382 -14446 23385 14224 9127 16485 16203 41797 -6198 -34125 -27097 -16645
13300 -16645 -21998 -31055 -13992 3172 30340 12171 -19705 -14045 31324 22001 21693 22019 15382
13287 15382 -20398 -13266 47197 78654 59927 27765 33349 20937 3440 -69608 -136507 -105728
13275 -105728 -90782 -100744 -62682 35 24844 46553 61231 69836 85364 56418 16607 -25963
13263b5963J4191P003l5681N5742O0769j1585k709m2036k9003l3605k0824M8019
13251a5682L9073M863k2479j8229j5263K6299K1419k5930k3870l426K3122J7826
13239G723m2946k7206J7525K8833k4864K318J0015K0407m664P268K2933r161n689
13226B492m3171k9863L6051L1868k2003m350J6482M557j9769K2639O2596l2163
13214B5366m1295N0538J8337m548k9325m707K2166l2540j0574K5371M1095J2915
13202G2799j1403j0437J1035Q09Q918J9226k6250k7196j499K5198O967j2925m954
13189E0288m146J8263j3834M448O0239K287n8124l2071k0486m131R289J2167j3686
13176A0503k467P989m761j6194m119P478N762k8365j8259j4319J6769M6106K768
$$ plain form
13263 -25963 -11772 -4769 -40450 15292 76061 64476 61767 19731 -9272 -42877 -63701 -15682
13251 -15682 23391 28254 5775 -12454 -27717 -1418 20001 -5929 -29799 -33225 -10103 7723
13239 7723 -35223 -62429 -44904 -16071 -40935 -38617 -28602 -8195 -12859 -5591 17342 8181 2492
13226 2492 -40679 -70542 -34491 -2623 -24626 -28976 -12494 -7937 -27706 -5067 57529 25366
13214 25366 -15929 34609 52946 48398 19073 14366 36532 3992 -6582 18789 59884 72799
13202 72799 61396 50959 61994 62803 71721 90947 64697 37501 36002 61200 68167 55242 50288
13189 50288 46142 64405 50571 55019 115258 117545 59421 27350 6864 2733 12022 24189 10503
13176 10503 8036 16025 11264 -4930 -9049 -1571 4191 -24174 -42433 -56752 -39983 6123 8891
13163H891N803O846N986K2231J9475p621K2588L0704O8739R2719M8081K2284j1734
13150C34992j205J1063r0525p3484m6523o4341q9013m500k2593K1537M1687J0118
13138B7213k5810o0585L5156K337K5172L7166K3998r444m7818l864k5317j2168
13126c3964N0627p166P488m995J568L169k3154N186j4019R21K7225L256M5483
13113F1625m06M4127J6990k166M6947P3388J6340j7806j4699k146n4714n7553
13101A09927j9568m1754j9653O2761L7111n950j5625K156j8395m4910l4518J4553
13089B6135M2391M0706l9802n1838l8593k1868k712L3507K7882K7481m7606k5736
13077c0053K4038K6257J935J8747J2022J9215m2209l95N4470l9873l5720M8291
$$ plain form
13163 8891 14694 21540 27526 49757 69232 61611 84199 114903 183642 276361 324442 346726 334992
13150 334992 333787 344850 254325 180841 134318 69977 -19036 -23536 -46129 -24592 17095 27213
13138 27213 1403 -59182 -24026 -21689 3483 40649 64647 55203 7385 3521 -21796 -33964
13126 -33964 16663 9497 16985 11990 13558 16727 -6427 -1241 -15260 -14339 12886 16142 61625
13113 61625 61219 105346 122336 120170 167117 240505 256845 239039 224340 222194 167480 109927
13101 109927 90359 48605 28952 91713 128824 122874 107249 109405 91010 46100 11582 26135
13089 26135 68526 109232 69430 17592 -21001 -42869 -45581 -12074 15808 43289 -4317 -30053
13077 -30053 -6015 20242 22177 40924 52946 72161 29952 29557 84027 44154 8434 56725
13065E6725P6054m225j6454Q459L1820j3696R229j0433J5801l9010p5377m8511
13053i618m219j3975l1587N243L6742p362k3488K8506K8936m3410o0463L7102
13041e7593O3530J2238j2295k301R866j6742k2673M0614J7159j7271l0463j1527
13029b7458J6555K8435L6545l9957K2785k2991r9836m834K8103N3983L8075J3068
13017D2473J9766j6058n5328j5736q109k4751O7378L7629J5123P924k0588k3663
13005B6060K683K2581l9720l9899m0247j6254J7339M512k3629j3657J1557M7635
12993d1039O137j4844Q977J6526j7706n5651j850K8575L8489K7290l0571o1622
12981i7289p301O6118L6038m3557m8420r157K0906L0187L2746J1239k0141q076
$$ plain form
13065 56725 132779 128554 112100 120559 152379 138683 147912 137479 153280 114270 38893 -9618
13053 -9618 -13837 -27812 -59399 -54156 -17414 -24776 -48264 -19758 9178 -34232 -94695 -57593
13041 -57593 5937 18175 5880 3579 13445 -3297 -25970 14644 31803 14532 -15931 -27458
13029 -27458 -10903 17532 54077 14120 36905 13914 -85922 -90756 -62653 -8670 29405 42473
13017 42473 62239 46181 -9147 -24883 -32992 -57743 9635 47264 62387 70311 49723 26060
13005 26060 28743 51324 11604 -28295 -68542 -84796 -67457 -62945 -86574 -100231 -88674 -41039
12993 -41039 -34902 -49746 -40769 -24243 -41949 -97600 -99450 -70875 -32386 -5096 -35667 -97289
12981 -97289 -104590 -38472 -2434 -45991 -94411 -103568 -82662 -52475 -19729 -8490 -28631 -36707
12969c6707K6468R278Q923k4566K8936m0166k5380K0533L1259p827p384k4993
12957d1626L3831J8019k3025J510L480J2061o060K928K3609K9173L3490k7677
12945E9713j008O877m0119m1861j1116m6566K5820q659N780K3070K4275k568r414
12932a5776L0729O1995k3078k6307q0327J3812M4952p606l190J4810J7262J9333
12920D6609j651p455K946N966q374j8732K4445p20j5272L028j390l2055j0661
12907a3316j2794l2432k9625K1156L6917m572j5111K4494K1749k9815j1865L1667
12895a3547l6117l3458p261J7435k1261k5972P730M3991K952k1672r529L9919
12883e6790L1205M1033K0105j0239k0047q940j3769l5600k0703L3434L995q275
$$ plain form
12969 -36707 -10239 -961 7962 -16604 12332 -27834 -53214 -32681 -1422 -9249 -16633 -41626
12957 -41626 -7795 10224 -12801 -11291 -7811 4250 -1810 1118 24727 53900 87390 59713
12945 59713 58705 65582 25463 -16398 -27514 -74080 -48260 -56919 -51139 -28069 -3794 -6362 -15776
12932 -15776 14953 76948 53870 27563 -52764 -38952 6000 -1606 -4796 10014 27276 46609
12920 46609 44958 37503 40449 46415 38041 19309 43754 43034 27762 30790 29400 -2655 -13316
12907 -13316 -26110 -58542 -88167 -67011 -30094 -34666 -49777 -25283 -3534 -33349 -45214 -13547
12895 -13547 -49664 -83122 -90383 -72948 -94209 -120181 -112451 -68460 -65508 -87180 -96709 -56790
12883 -56790 -25585 15448 35553 25314 5267 -3673 -17442 -53042 -73745 -40311 -36316 -44591
12871d4591O082K3802j4338j8740K2769J4802L1289k4843n5499j611K1411K6188
12859a3279j968J4990k8010o917K416K717J8269P542k0069K0606j4785j2031k3621
12846e4140J285J9489q491j4062o15j1568Q561O248j9615K9963P872J1669m3386
12833f6790n274N9285L2555k2401k5442K2267j4521L646J2065L1919P23j3072
12821A4960m3131k65k4839j7856L9013j1486K1212K7634L934j6874l0281k0738
12809e8717P852L6182J7452J1785m651k6173K270L7080J0917n3911k3977J9359
12797b4532l1084M596K5963l9747K145K0761J024M5147J3107p551L8131p128M410
12784D5242l5262n5847K5534J5123J9195R00o188K3309k7505j8827p483K220J4576
$$ plain form
12871 -44591 -38509 -14707 -29045 -47785 -25016 -10214 21075 -3768 -59267 -60878 -39467 -13279
12859 -13279 -15247 -257 -28267 -35184 -32768 -30051 -11782 -4240 -24309 -3703 -18488 -30519 -54140
12846 -54140 -52855 -33366 -41857 -55919 -56534 -68102 -59541 -53293 -72908 -42945 -35073 -23404 -66790
12833 -66790 -72064 -12779 19776 -2625 -28067 -5800 -20321 -16675 -4610 27309 28032 14960
12821 14960 -28171 -28436 -53275 -71131 -32118 -43604 -22392 5242 9176 -7698 -37979 -58717
12809 -58717 -50865 -14683 2769 14554 9903 -16270 -14000 23080 33997 -19914 -43891 -24532
12797 -24532 -55616 -51020 -25057 -64804 -62659 -41898 -40874 4273 17380 9829 47960 40832 45242
12784 45242 9980 -45867 -20333 -5210 13985 14885 8697 32006 4501 -14326 -21809 -19589 -5013
12771e013P012K6127m0030o733L956J0547J5941m1869k7384N4753K5289j1688
12759A0908Q466P335l448M6869K017l2972l118k4571j5734n858n046o584j0026
12746c1762J8579O0241L655l9248j4318m259j7870q085K2963r35r11L656j0127
12733a8421m889L7654J2956P601O306j3742m0821P624L0402j1169q072n6769j0267
12720f1607J6394J3966N792j764M85Q810L2890j7988K6471n997l1037l2321J703
12707d4203j7783m47N8198L9978k778k3396j6359J9709J5709k6017k6275m959
12695b8623m032K2779k520k4305m7241N188P032J7869R399J2161J5917j5172j2797
12682d4345j5651J5785M0482J9657L5474k8342k8847n1432m124j452J0345j9357
$$ plain form
12771 -5013 1999 28126 -11904 -18637 -14681 -4134 11807 -30062 -57446 -2693 22596 10908
12759 10908 19374 26709 23261 70130 72147 39175 36057 11486 -4248 -10106 -15152 -21736 -31762
12746 -31762 -13183 47058 50713 11465 -2853 -7112 -24982 -33067 -10104 -11039 -11950 -8294 -18421
12733 -18421 -23310 14344 27300 34901 41207 27465 -13356 -5732 24670 13501 5429 -51340 -61607
12720 -61607 -45213 -31247 -25455 -27219 -26734 -17924 14966 -3022 23449 17452 -13585 -45906 -44203
12707 -44203 -61986 -62433 -4235 35743 32965 9569 -6790 12919 28628 2611 -23664 -28623
12695 -28623 -32655 -9876 -12396 -36701 -83942 -78754 -71722 -53853 -44454 -32293 -16376 -31548 -44345
12682 -44345 -59996 -44211 -3729 15928 51402 23060 -5787 -57219 -61343 -62795 -52450 -71807
12670g1807K9964J8495k3611q415j2309L0619P368m132L130Q2289m5761j2993
12658g163O861l0871m538M1208L1747K0216p904j1888q732n534n7573l586L213
12645c4544r392K8142J0508j4504m4238J3654M1493P4369q542K829j9570k6187
12633A4018K721q945j3870O1125m2971n4677j1810J7229J6566j6885j3857l5458
12621h6814K0858K3580K3347j8164l7419l081N5777M1552p462n048j7853J0130
12609e97o126J9124j8535J0513L5560n0484l1151J1431J2957M2015K3245O476
12597E4428M039j2070J7449j459K7187j2152l8531J9828M2427k7387j1305o0084
12585B370m5665J2758J5803k341j6117M3642K9438k1992J6623O259k6528o949
$$ plain form
12670 -71807 -41843 -23348 -46959 -55374 -67683 -37064 -29696 -33828 -30698 51591 5830 -7163
12658 -7163 -302 -31173 -35711 5497 37244 57460 49556 37668 28936 23402 -34171 -37757 -34544
12645 -34544 -43936 -15794 -5286 -19790 -64028 -50374 -8881 65488 56946 59775 40205 14018
12633 14018 16739 7794 -6076 55049 12078 -42599 -54409 -37180 -20614 -37499 -51356 -86814
12621 -86814 -65956 -42376 -19029 -37193 -74612 -77693 -21916 19636 12174 7126 -10727 -597
12609 -597 -6723 12401 -6134 4379 39939 -10545 -41696 -30265 -17308 24707 47952 54428
12597 54428 58467 46397 63846 62387 89574 77422 38891 58719 101146 73759 62454 2370
12585 2370 -43295 -30537 -14734 -17075 -33192 10450 39888 17896 34519 40778 14250 7301
12573G301M3158J0469m0278J003K0404J4475p830q757K0785J3256l794n9650J4416
12560B4958J2998J3141Q738j4059k7810l928j9492k7370L7155J7732m041J1652
12548B9674r901l1467k4218K7110J3130J4775q600j5997J2509k482j4742k8447
12536c8656n902J7148J3052J877R893J0434j2995R912n0425N030L1132K0945K0605
12523C2050J1175L0972P241l7717l3558R266M3961P255m4145j1928m336L968N776
12510A9980L2195j7735l4349L648J9770L0261m112K1774J2661J4697j0625k1029
12498F7136j0506m3845O406j0949k2100K608n838J3807P330L1445m6300o7187
12486g7993n780M2560k5m627K3901N123M551J6238j3095J2963R652L0250m0330
$$ plain form
12573 7301 50459 60928 20650 21653 42057 56532 48702 39945 60730 73986 70192 10542 24958
12560 24958 37956 51097 59835 45776 17966 14038 -5454 -32824 4331 22063 18022 29674
12548 29674 19773 -11694 -35912 -8802 4328 19103 10503 -5494 7015 4533 -10209 -38656
12536 -38656 -44558 -27410 -14358 -12481 -2588 7846 -5149 4763 -45662 -40632 -9500 11445 32050
12523 32050 43225 74197 81438 43721 10163 19429 63390 70645 26500 14572 10236 14204 19980
12510 19980 52175 34440 91 3739 23509 53770 49658 71432 84093 98790 88165 67136
12498 67136 56630 12785 19191 8242 -13858 -11250 -17088 -3281 4049 35494 -10806 -77993
12486 -77993 -83773 -41213 -41238 -45865 -21964 -16841 -12290 3948 -9147 3816 13468 43718 3388
12473C388l6671K222K250N294J7961M4113K0129l575m754m0914j5805K238m215
12460h339m634N0568L9958j2296l3522L3938O90n1837p3237j9881N968M3388R92
12447b8244J3534n68R895l208l707L396j0386j627k285k1029p06M0853k2470k7220
12433e3772R134l31L6918K3984M1497j2044o321p924R619j5092l0432k5470k4132
12420e4366N8166K9108Q47K653K0533o755n170Q537l1592l3853k279J0375j795
12407e591j5793p45J6573L1394j3374j914J3073M821j8841m2791l9804Q250L3831
12394c0911n836j961N691p304K0124L2992N6510n340m0389J5014L4316M0618n7070
12381E6454l5239n604K2121k3789n15M5372m1219j7453P403J9670o569m2633j0691
$$ plain form
12473 3388 -33283 -31061 -28811 -23517 -5556 38557 58686 55111 50357 9443 -6362 -4124 -8339
12460 -8339 -12973 37595 77553 65257 31735 65673 66363 14526 -58711 -78592 -72624 -29236 -28244
12447 -28244 -14710 -15278 -5383 -8591 -12298 -8902 -19288 -20915 -23200 -44229 -44935 -4082 -26552 -53772
12433 -53772 -44638 -44969 -8051 15933 57430 45386 39065 31141 40760 25668 -4764 -30234 -54366
12420 -54366 3800 32908 33755 36408 56941 50186 45016 53553 21961 -11892 -14171 -3796 -5591
12407 -5591 -21384 -22129 -5556 25838 12464 10550 23623 28444 9603 -33188 -72992 -64742 -30911
12394 -30911 -36747 -38708 -33017 -40321 -20197 12795 69305 63965 23576 38590 72906 113524 56454
12381 56454 21215 15611 37732 13943 13428 58800 17581 128 7531 27201 20632 -22001 -32692
12368c2692L701K1666J2624j0414m628J2242J8231R958r453k6723q408o765P553
12355a3108L62M9054l10n1530l9698L7392o677k8777L3479K5134R373k2840l2443
12342d0589N9198J9094J1611J1412j1979J4254k056j0241m3646J4140N379J9136
12330D5713J8331m8837j2965j3487J2022r4j9136j547k8244J0921M8296L3201
12318D4174J680k98r208R272K5954K2585l6387k3814j2622k3009J9536L3435J383
12305E2681n525n8961Q386P2332P356r371J5710q575L0326N874j9886k1979m5091
12292B3277k8439J8835L7277L5857J3341m6502n1324j3044m018j2594k3135L7574
12280a2895L8602J020M608L4634l2142n5195m8004K722K1803P8610M1175k2549
$$ plain form
12368 -32692 -28991 -7325 5299 -5115 -9743 2499 20730 30688 21235 -5488 -13896 -20661 -13108
12355 -13108 -12746 36308 35998 -15532 -55230 -17838 -24515 -53292 -19813 5321 14694 -8146 -40589
12342 -40589 18609 37703 49314 60726 48747 63001 60945 50704 7058 21198 26577 45713
12330 45713 64044 15207 2242 -11245 777 683 -18453 -20000 -48244 -37323 10973 44174
12318 44174 45854 45556 36348 45620 71574 94159 57772 33958 21336 -1673 17863 51298 52681
12305 52681 47156 -11805 -3419 68913 76269 66898 82608 74033 104359 110233 90347 68368 23277
12292 23277 -5162 13673 50950 86807 100148 53646 2322 -10722 -14740 -27334 -50469 -12895
12280 -12895 25707 26727 31335 65969 33827 -21368 -69372 -66650 -44847 33763 74938 52389
12268E2389m2035r074o170o949P529P919o726J2064O9151L487L156j0909k4211
12255D9621j2712l739k6047M945J7049j8780J2441L3361k4455k2308k4353j4133
12243b9110J0299J0619o0926k7709L1393J2136p034M1753K3338j295K7205J3914
12231D4583J7454l0082o1509m6696J4859k0017L6646O2674l7747l5857p508L4832
12219b8368O0465J9688m473j5447m064P020k8916J2759k43j3167J997L4448M0560
12206H2259q508m9461k6808l224p654L0730O6049L444l9256m1489J6060L901L9570
12193F5613N8900l1027m3613l3472r45K2497l71n303j392m7549l3773j4885J8800
12180d6520J55L4619L4113m607m9054M351J6698L4374L170K7374P645l0357m8804
$$ plain form
12268 52389 10354 1280 -4890 -11839 -4310 3609 -3117 8947 78098 81585 84741 73832 49621
12255 49621 36909 33170 7123 12068 29117 10337 22778 56139 31684 9376 -14977 -29110
12243 -29110 -18811 -8192 -69118 -96827 -65434 -53298 -60332 -18579 4759 3464 30669 44583
12231 44583 62037 31955 -29554 -76250 -61391 -81408 -44762 17912 -19835 -55692 -63200 -28368
12219 -28368 32097 51785 47312 31865 27801 34821 5905 18664 18421 5254 7251 41699 82259
12206 82259 73751 24290 -2518 -5742 -13396 17334 83383 86827 47571 6082 22142 26043 65613
12193 65613 124513 93486 49873 16401 15456 37953 37582 32279 30887 -16662 -50435 -65320 -46520
12180 -46520 -46365 -11746 22367 17760 -31294 -26943 -10245 24129 27299 54673 62318 31961 -16843
12167a6843l0116L1458L07j8838N5336L9088l584l9510j0222M0479J2455k3039
12155C6971j5540l068m493K4818J4674J5541J3767P089L827m785j6030J6522j9387
12142F9906P134L4883j9892k2397k2667p45k3310J7016p00M5682K559k8300n4871
12129D298k7226M6728M8139j961j4857N859J8435j7807p232K4053M6101K113Q396
12116A35039j5479k8429j3609j50k4850J05J4108N6101J8149n7223n6416k969
12104B4377l6644j2160P6785M2911L0451n249J2660n7484o393l8672j0967R018
12092B8633j1881j4135L1676M0455j9221l4378k05m830N544K9078K3774K4246
12080I8756m863K7647L0621N165j0986k9169n0445k3106j916M4157N1601j2702
$$ plain form
12167 -16843 -46959 -15501 -15194 -34032 21304 60392 56808 17298 7076 47555 60010 36971
12155 36971 21431 18363 13870 38688 53362 68903 82670 89759 93586 88801 72771 89293 69906
12142 69906 77040 111923 92031 69634 46967 46222 22912 39928 39228 84910 87469 59169 4298
12129 4298 -22928 23800 71939 69978 55121 60980 79415 61608 54376 78429 124530 126643 135039
12116 135039 119560 91131 77522 77372 52522 52627 66735 122836 140985 83762 27346 24377
12104 24377 -12267 -24427 52358 95269 125720 120471 133131 75647 69254 30582 19615 28633
12092 28633 16752 2617 34293 74748 55527 21149 20944 16114 21658 50736 74510 98756
12080 98756 93893 121540 152161 157326 146340 117171 66726 43620 41704 85861 137462 124760
12068A24760q602N30L4087K4074K2334K6781Q5127Q8618J49002L00443M90343
12057A337497O18329L68444j8261j83463k47571l81125m26743l28110j36015q8469
12047E14513j16913n8358p1282n3081j4260j8745k2488K1102L0072L215M305k0193
12035A97887k3953l164m4443k8272J3839J5379o220k5755L237J2127j3044J5696
12023A13314l80J231m417K2068J6023M369k4878p888l3121j5891k2747K2779l7337
12010C3125k19j9585k0228M6541K4381O6639M108l1515m0651l7804j2715K4173
11998C6250J1905m897j141P151K2499L4256k0622N258P620n1573k2582M4131R660
11985G7915J9098l6548l2970R044J0525L6911M1229j3462J1494l652n224j5674
$$ plain form
12068 124760 116158 116688 150775 174849 197183 223964 309091 397709 546711 847154 1337497
12057 1337497 1955826 2324270 2306009 2122546 1874975 1493850 1067107 738997 602982 514513
12047 514513 397600 339242 267960 214879 200619 181874 159386 180488 210560 213775 218080 197887
12035 197887 173934 170770 126327 98055 111894 127273 121053 95298 98535 110662 97618 113314
12023 113314 112934 114165 109748 131816 147839 152208 127330 119442 86321 70430 47683 70462 33125
12010 33125 32906 13321 -6907 39634 64015 130654 134762 103247 62596 24792 12077 36250
11998 36250 48155 43258 42117 49268 71767 106023 85401 90659 98279 46706 24124 68255 77915
11985 77915 97013 60465 27495 36539 47064 83975 125204 111742 123236 119584 114360 98686
11973I8686k0140j1305j2942K944L633J1554k5205J5372J4884l6308j0013J1648
11961D2808p373N1921O5916j354j29n182j7494K5726Q535m2020J7941k936k8795
11948A07564m0484N353p266J5051n29k0497k9984L7693M9334L0468r26p4922n1687
11935A9168k3826O7136M4372j4413k7056l5402O5626K8496m76j0351k7611R309
11923I4972k5169O747K3582M3557p909l2930m0612J7033L2605r358Q009M353P489
11910A22369N655j2367J4203J8916K9489J2474k4557k1045m1508M3989K0760k5426
11898A42952n457J8393r982l7205k904J0563L963k6585L939K9768j8846L711k3513
11885H8797j5411L5652j6579K2825L4465L5306J1571K1008k124j4889j6629q768
$$ plain form
11973 98686 78546 67241 54299 57243 60876 72430 47225 62597 77481 41173 31160 42808
11961 42808 35435 87356 153272 151918 151789 146607 129113 154839 163374 121354 139295 136359 107564
11948 107564 67080 72433 65167 80218 79689 59192 29208 66901 116235 146703 145777 70855 19168
11935 19168 -4658 62478 106850 92437 65381 29979 95605 124101 123625 113274 85663 94972
11923 94972 69803 76550 100132 143689 135780 102850 62238 79271 111876 102518 110527 114880 122369
11910 122369 128024 115657 129860 148776 178265 190739 166182 145137 103629 147618 168378 142952
11898 142952 137495 155888 145906 108701 105797 116360 120323 93738 97677 127445 108599 112310 88797
11885 88797 73386 109038 92459 115284 149749 185055 196626 217634 215510 200621 183992 175224
11873A75224P692K5531k465R280r713J9954J040k038R546K9824M4733j3495R169
11860C04282j8763K5882L0814k783P990j430L8523L7913j2595M37p027J8080K8222
11847D49545O5964j692l262L2034n6404J7125L5229L7766M4698R2345M9813k452
11835G60709O8207J04140K5710k081J5174P4872J46641J26927J14280J05155J20069
11824A659803J79215J58491J53999K54776K82359L42592M26013N03717N52867
11815D513832O60748P90782R87355J236009J428678J678574J804353J853983J785404
11806A6739718J442513Q76387K23049l64269q71090j206774j458926j502220j421641
11797A2456747j243999j058623q89926p76327n90081m64981m19574l95939k38603
$$ plain form
11873 175224 182916 208447 205982 215262 205549 225503 226543 224505 234051 263875 308608 295113 304282
11860 304282 285519 311401 342215 339432 347422 345992 384515 422428 409833 410270 403243 421323 449545
11847 449545 515509 513817 510555 542589 486185 503310 538539 576305 621003 713348 763161 760709
11835 760709 828916 933056 958766 956685 971859 1046731 1193372 1320299 1434579 1539734 1659803
11824 1659803 1839018 1997509 2151508 2406284 2688643 3031235 3457248 3960965 4513832
11815 4513832 5174580 5965362 6952717 8188726 9617404 11295978 13100331 14954314 16739718
11806 16739718 18182231 19058618 19281667 18917398 18046308 16839534 15380608 13878388 12456747
11797 12456747 11212748 10154125 9264199 8487872 7897791 7432810 7013236 6617297 6378694
11788F378694j18832l1540M9366J14436J61999K22172L31475M72619O26703P18050
11778H925142Q88780J163539J435416J783641K155375K662992L250633L848347
11770B6113865M199642M155545L472175K154456N35593j032544k327129l277128
11762C3994475l774254l814331l517465l134334k585580k093830j728264j446203
11754A1900214j233317j004248p97889o35307n24860m07612k98103k70055k28278
11745F500545j42506K607L0663J12401K35307L07206L98580N45557O55219Q03238
11735I448817R89034J163794J357070J451601J379082J235328Q69158L05570k98247
11726A7901207q00362j229802j552168j641071j562610j477721j272036j083903
$$ plain form
11788 6378694 6259862 6228322 6277688 6392124 6554123 6776295 7107770 7580389 8207092 8925142
11778 8925142 9813922 10977461 12412877 14196518 16351893 19014885 22265518 26113865
11770 26113865 30313507 34469052 37941227 40095683 40631276 39598732 37271603 33994475
11762 33994475 30220221 26405890 22888425 19754091 17168511 15074681 13346417 11900214
11754 11900214 10666897 9662649 8864760 8229453 7704593 7296981 6998878 6728823 6500545
11745 6500545 6358039 6360646 6391309 6503710 6739017 7046223 7444803 7990360 8645579 9448817
11735 9448817 10437851 11601645 12958715 14410316 15789398 17024726 17893884 18199454 17901207
11726 17901207 17100845 15871043 14318875 12677804 11115194 9637473 8365437 7281534
11718G281534q74693p41352o41794n38323m55362m43125l72518k78210k52692
11709B683465k53808j93147j59474j13123j29050j01066j29130j40014j15685
11700A348968r5186l3879n8485q4991m4907l3980o8186n9838r167m1578n450m1675
11688G71646o6034j1456n113n5384j00658l0766r905k1468j7691J4598O292m4922
11676D29139q792O330k2268L2588J3140K3757k0271q685l0154l3808m2004J343
11664C40315M7456L7420l6998J7528k9020n4495k4161j656n005L477j3833j1711
11652B69317j1314k936L8674l4910o0223m8478K6948L0855L6501K5960R319Q068
11640B87781P955p1908l4010K6286J366l828m480l9719p621L1467M2527J4426
$$ plain form
11718 7281534 6406841 5665489 5023695 4485372 4030010 3586885 3214367 2936157 2683465
11709 2683465 2429657 2236510 2077036 1963913 1834863 1733797 1604667 1464653 1348968
11700 1348968 1253782 1219903 1161418 1076427 1031520 997540 929354 869516 860349 818771 813321 771646
11688 771646 705612 694156 689043 633659 533001 502235 492330 470862 453171 467769 474061 429139
11676 429139 420347 426677 404409 436997 450137 473894 453623 444938 414784 380976 338972 340315
11664 340315 387771 425191 388193 405721 376701 322206 298045 296389 291384 294861 281028 269317
11652 269317 258003 255067 293741 258831 198608 150130 177078 207933 244434 270394 279713 287781
11640 287781 295736 223828 189818 216104 217470 213642 209162 169443 161822 193289 235816 250242
11628B50242j32m5759m931Q447M335k93l4320j8612L1039J4466k042q034k9362
11615A65044o0252j3143j3407M8990O01j5833J1973k2927n145K0186P269M1202
11603A64558k889k6415K0842L3375R115j0350o0265l524k6187k2953l7165n908
11591C2234j4716J3168J8240J1444M9272K9319j5821n9072k2237j3610p723m4908
11579b4410M5496N4408P508L5813O591k8722N738K4338j1401q586k997J7415j9818
11566A01373j9353j608j6248J992j470k7752Q025K7699o9142J309M0688J767O820
11553E4100O0675o183j5748k5357l2645k9049J8540l441K5189M4572K0186j6620
11541I4219m7551J7872J2289n6953m4874m133J7203M8741m516M8867O4752j0452
$$ plain form
11628 250242 250110 204351 199420 207867 212202 211909 177589 158977 190016 204482 202440 194406 165044
11615 165044 104792 91649 78242 127232 127833 112000 123973 101046 95901 116087 123356 164558
11603 164558 161669 135254 156096 189471 198586 188236 127971 124447 98260 75307 38142 32234
11591 32234 17518 30686 48926 60370 109642 138961 123140 64068 41831 28221 20498 -24410
11579 -24410 21086 75494 83002 118815 125406 96684 102422 126760 115359 106773 103776 121191 101373
11566 101373 82020 80412 64164 66156 64686 36934 44959 72658 3516 4825 45513 47280 54100
11553 54100 114775 108592 92844 67487 34842 5793 24333 20892 46081 90653 110839 94219
11541 94219 46668 64540 76829 19876 -24998 -29131 -11928 36813 32297 81164 145916 135464
11529A35464j2534q20k9250l6094j4869l3936j7022l072o519P754K6825L1554
11517D7481N7909N750k860K7388k8437j9715M453N647m8003k0365m9354j0708
11505c0814j2503J4995R074L0027K375N5855J4511m0604k3349m9636J251L9736
11493A0918n838l7892R706O095m2439p084K9040m876O297N0288j344j5812j8100
11480b1041J6972K671J6323J5342k017k4380k2694n39N714l5721L0225K9611J7425
11467B7891N4466p503k6682O677l532m487j2154l1509k3979r126j2928J7034K5541
11454b91r01L845L9471m313J4121j7857m5801l8945N6027r734l467K0804P271
11441B0230j1210j3887P467N1032m2299l4458j7866j627j3086o601j8520j5757
$$ plain form
11529 135464 122930 122110 92860 56766 41897 7961 -9061 -12133 -18652 -10898 15927 47481
11517 47481 105390 111140 108280 135668 107231 87516 91969 97616 49613 29248 -20106 -30814
11505 -30814 -43317 -28322 -19248 10779 13154 69009 83520 42916 19567 -30069 -28818 10918
11493 10918 5080 -32812 -23106 -17011 -59450 -66534 -37494 -42370 -36073 14215 12871 -2941 -21041
11480 -21041 -4069 -1398 14925 30267 28250 3870 -18824 -19363 -13649 -49370 -19145 10466 27891
11467 27891 82357 74854 48172 54849 51317 46830 34676 3167 -20812 -29938 -42866 -25832 -291
11454 -291 -1192 2653 42124 37811 51932 34075 -11726 -50671 5356 -4378 -7845 12959 20230
11441 20230 9020 -4867 2600 53632 11333 -23125 -40991 -42618 -55704 -62305 -80825 -96582
11429i6582N7373p273K235L5684L8779j4158k1547J0341K6307l0885K3614M4784
11417F8672r503j1624j7669r913l7817P807J4351L571l286J0996J404r004J0750
11404A8735l260K385J3860L1495N262N829j7050n188m993J4831N5210M5712k4756
11391A38072p4084o5034r875k6260J6749O5232m2148k0960L3982M424m083J3770
11379B9785N058l2606j8371J7573K1730K891J6546K9016K1550l8039k29N876j9201
11366D1579j3051K03K7936L2788m5096j25P002l6157L955l842J3174j5620k1046
11353h300P300k3256J1581K5277J7044j5048k5059j3309J8782J2231o442j6136
11341a5335j1279k0911J1368K8887O3765M709n4957N310K4939J3575j8077k8428
$$ plain form
11429 -96582 -39209 -46482 -44247 -8563 30216 16058 -5489 4852 31159 274 23888 68672
11417 68672 59169 47545 29876 19963 -17854 -10047 4304 7875 4589 15585 16989 7985 18735
11404 18735 15475 17860 31720 63215 68477 74306 57256 52068 47075 61906 117116 162828 138072
11391 138072 63988 -1046 -10921 -37181 -20432 44800 2652 -18308 15674 20098 16015 29785
11379 29785 34843 2237 -16134 1439 23169 26060 42606 71622 93172 55133 54904 60780 41579
11366 41579 28528 28731 56667 89455 44359 44234 51236 15079 19034 15192 28366 12746 -8300
11353 -8300 -1000 -24256 -12675 12602 29646 14598 -10461 -23770 -4988 7243 801 -15335
11341 -15335 -26614 -47525 -36157 -7270 56495 61204 6247 11557 36496 50071 31994 3566
11329C566J4298K4300l673K0026O704k4909n0517l5816J7377M4821J7843l719
11317C0301R564K3758n1811J611J1646l5992j7063q322N791j3580j560N78L8518
11304f561M9448J9607j9796k5090M3446L2187r964j8884l6996J0777J5836j5540
11292C8470K9484l8617p258j4997q319K7359L0863O8468N9261l3427l8909j3490
11280I8888l2391R69m166k3917J3787J3379l3104p191n700K1876k5027J9031M4481
11267H0915j0721j3254K2956M153l3647K1567P081J5009r384o941m3621m7600
11255a3487j6880J6040L730N871J1966j6185K1775J4685k4414l3241J920O7079
11243C8859r69k2988j0870j15N211m2686R997O3742K6924m2598j9502L4545K9986
$$ plain form
11329 3566 17864 42164 38491 58517 65221 40312 -10205 -46021 -28644 16177 34020 30301
11317 30301 39865 63623 11812 13423 25069 -10923 -27986 -36308 -30517 -44097 -45657 -45079 -6561
11304 -6561 42887 62494 42698 17608 61054 93241 83277 64393 27397 38174 54010 38470
11292 38470 67954 29337 22079 7082 -1237 26122 56985 125453 184714 151287 112378 98888
11280 98888 66497 67466 63300 39383 53170 66549 33445 26254 20554 42430 17403 36434 80915
11267 80915 70194 56940 79896 84049 50402 71969 79050 94059 84675 77734 34113 -13487
11255 -13487 -30367 -14327 -10597 -4726 7240 -8945 12830 27515 3101 -30140 -28220 38859
11243 38859 37890 14902 4032 3917 9128 -33558 -23561 40181 67105 24507 5005 39550 69536
11230F9536r709K8849N3564L2913l4197r7421m4612n07N1571j1878l6122J3554
11218A5541K58Q42j5529l8284O01P568j7005M47j5242K9405L988P63L4384n033
11204B704r428L4642Q011p0070p356L2435M3894j1124n5375m3715j9518K1366
11192g3534J4663J8487J0806m1118L183K3273K6376P787k7262N882Q345j1293
11180c4405P391M2453k7419j5547n210j7564K7910P033j3069J8092K6433j6916
11168h18l4695J021p19O0126j5545p9339j8136K4345L34k893L9664j4190j6459
11155e7304J7790L710o769M8055J5322k0677J090m0675m2050M112M81J2669K1089
11142d3157M8195J8856m5860j0670J1341J7559J3253j4722K5455M0354J3528k6125
$$ plain form
11230 69536 59827 88676 142240 175153 140956 43535 -1077 -1584 49987 38109 1987 15541
11218 15541 15799 16641 1112 -37172 -36571 -29003 -46008 -45561 -60803 -31398 -27410 -26647 7737 2704
11204 2704 -6724 27918 35929 -34141 -41497 -9062 34832 23708 -31667 -75382 -94900 -73534
11192 -73534 -58871 -40384 -29578 -70696 -67513 -44240 -17864 -10077 -37339 -31457 -23112 -34405
11180 -34405 -27014 15439 -11980 -27527 -32737 -50301 -22391 -15358 -28427 -10335 16098 -818
11168 -818 -35513 -34492 -35211 24915 9370 -69969 -88105 -63760 -63426 -66319 -26655 -40845 -57304
11155 -57304 -39514 -35804 -42573 5482 20804 127 1217 -39458 -81508 -77396 -76915 -64246 -43157
11142 -43157 5038 23894 -21966 -32636 -21295 -3736 9517 -5205 20250 60604 74132 48007
11130D8007n2484J9830K1425r630p838j0704J8689L0885k5319m6319l2295m1111
11118h6864J5092K8606Q791j9078K5098K4288J5331k7484L3062L4009k2006k7755
11106A090R443P174J8886J5424K0028j0863k3721j2260q775J5433K3369k7489
11094B7739J458L1008l4534n555K37k3903l1844J3744P413l741Q445j8367k17
11081b8117K9915L9815J5595k0925J0943m6505L4090L3033K6737l3437k2468k0010
11069A8666Q615j8808l0709j8833L6745L4821j4033k6077L4712L7159M2293L6871
11057A41422k3690j7835J965k7531l432r047l8188L0658K7113m8043j8552m0987
11045b6147J3145K2468l058l0773J6445K050j2284L6903M250L0064l2447j5951
$$ plain form
11130 48007 -4477 15353 36778 27148 19310 8606 27295 58180 32861 -13458 -45753 -86864
11118 -86864 -71772 -43166 -34375 -53453 -28355 -4067 11264 -16220 16842 50851 28845 1090
11106 1090 10533 17707 36593 52017 72045 61182 37461 25201 16426 31859 55228 27739
11094 27739 29197 60205 25671 20116 20353 -3550 -35394 -21650 -14237 -17978 -9533 -27900 -28117
11081 -28117 1798 41613 57208 36283 47226 721 34811 67844 94581 61144 38676 18666
11069 18666 27281 8473 -22236 -41069 -4324 30497 16464 -9613 25099 62258 104551 141422
11057 141422 117732 99897 101862 74331 70899 61852 23664 54322 81435 33392 14840 -26147
11045 -26147 -13002 9466 6408 -24365 -7920 -5870 -18154 18749 22999 53063 20616 4665
11033D665j2623k6399J0035R055k59k0156j053Q596K8734J3379J7631p306o364
11020A7935j5232r799O26K1361K79M9340K3013m6044k9751j1378L3015l174Q209
11007C8400j8000J7652j204k5540N580l0838J0134R573L345m026n083O5654J7878
10994H3525l0314m1702J3905k315J3657N1285L94l0890m8903o6975r089j8812
10982h6234K1010L9983J9345m6469j588N2955M1750k4087N531K2120m5301l9073
10970d0058K4953P414M680k0508m064N347k9867j1189M3451J9964R971n408q864
10957d178J4743J7007k9759M219J3133L2627l0332l6082L0701L8633L3225m6677
10945C7260n1032k2472p387l845J9426R864n749j1707K4530J48k4764k612K0612
$$ plain form
11033 4665 -7958 -34357 -24322 -15267 -15526 -35682 -36735 -28139 595 13974 31605 24299 17935
11020 17935 2703 -7096 -6470 14891 15170 64510 87523 41479 11728 350 33365 30191 38400
11007 38400 20400 38052 36848 11308 16888 -13950 -3816 5757 9102 5076 -7 65647 83525
10994 83525 53211 11509 25414 23099 36756 88041 88435 57545 8642 -58333 -67422 -86234
10982 -86234 -65224 -25241 -5896 -52365 -53953 -998 40752 16665 22196 44316 -985 -40058
10970 -40058 -15105 -7691 -3011 -23519 -27583 -22236 -52103 -63292 -19841 123 10094 4686 -4178
10957 -4178 10565 27572 -2187 2032 15165 47792 17460 -18622 12079 50712 83937 37260
10945 37260 -13772 -36244 -43631 -47476 -28050 -18186 -23935 -35642 -11112 -10964 -35728 -38340 -17728
10932a7728k639L3050J5257k3646J4920K9521k3797o650k6747N832M9369P4608
10920A21350P943n7685k2946n824n251l1788J3215K7352j7301n1832k0464k4679
10908f7910Q080j1101L9404K0170J9893k0100j095j3419K5512K5562K8566K0349
10896G3911R147l1177J1820J9899l1772k9263k7252n366r304J1754P876K3064
10884B3337K0000m782L664k9793J9945K0415M2688r97n4459K747k229l15R392
10871D9613q845K2797n4596o822p057R762L207j4507J4316K5145k4939N64L9257
10858D7895L4698j5721l5662J551P9076K9451k8680O095m15m2987N342K2857k1504
10845H1996J76K4331J3681J6926n0786l9611L0364J5656N782p126k8763j2606
$$ plain form
10932 -17728 -20367 12683 27940 4294 19214 48735 24938 18288 -8459 -2627 46742 121350
10920 121350 129293 71608 48662 42838 37587 5799 19014 46366 29065 -22767 -43231 -67910
10908 -67910 -59830 -70931 -31527 -11357 8536 -11564 -12659 -26078 -566 24996 53562 73911
10896 73911 83058 51881 63701 83600 51828 22565 -4687 -10053 -19357 -7603 273 23337
10884 23337 43337 38555 42219 12426 32371 52786 95474 94477 40018 42765 40536 40221 49613
10871 49613 40768 63565 8969 2147 -4910 4852 8059 -6448 7868 33013 8074 8638 47895
10858 47895 82593 66872 31210 32761 111837 141288 112608 118703 118288 75301 80643 103500 81996
10845 81996 82172 106503 120184 137110 86324 46713 77077 92733 98515 91389 62626 50020
10833E0020K7492L4136l8677o388J5680J2621L2645k417K2629k056R364N2734
10821B07783J6897M4211O893J5375L6857J20891J57318K15998K11947K72666K75238
10810A582074K32670N7780j9298o8970k04412k60889l02453k80897j65206j04507
10800D65892n0958p4419p3065o0562m1567r5n339L6274l9574l6584Q835M1782
10788A70620P300j9869k3449k934O219p3862n9376j5238j1237K5064N8790J1820
10776G3848n935N6019N2707K68n4136J3507m7211m1125j3569k5579J108J8074
10764B7976L0462j9293J8432M0316j6843m348o1880j1906J035L894K7603j7121
10752A8327K4079l774j3842K3178K8547n641j897L032j6485k9594n3990l8829
$$ plain form
10833 50020 77512 111648 72971 66583 82263 94884 127529 125112 147741 145685 155049 207783
10821 207783 224680 268891 275784 291159 328016 448907 606225 822223 1034170 1306836 1582074
10810 1582074 1814744 1872524 1853226 1784256 1579844 1318955 1016502 735605 570399 465892
10800 465892 414934 340515 267450 206888 165321 165226 159887 196161 156587 120003 128838 170620
10788 170620 177920 158051 134602 131668 137887 64025 4649 -10589 -21826 3238 62028 73848
10776 73848 67913 123932 176639 176907 122771 136278 89067 47942 34373 8794 9902 27976
10764 27976 58438 39145 57577 97893 81050 76702 14822 2916 3951 7845 35448 18327
10752 18327 42406 38632 24790 47968 76515 70874 68977 72009 55524 25930 -28060 -66889
10740f6889J1470M8157K483J1878j9993k5964o046M7581j0508K6510j5934l4445
10728c1700K1107P0943J365l7693M0095P2915r82m2783m8291m3782m0889k8017
10716f7712l8139J2602L9592Q1321K7148q156P35Q225J7635J6827J6031k2679
10704H3430k7755k5752M9765M6437j3217m0353l4789o2330M1840M8890L4434J2276
10692A12876J5593j7396O87L425j2002R1L2335k392j4724l1335j5300J1757K7426
10679A11041K6509j5893l318j9389L95J5268k608k42J5311J0956j8718J2128n702
10666A25738Q543J3103l841K9145M501j7397J3276L1740O632o954L5981K7581
10654B68048K4132m8428m6274j8902J2709l2448j6610j1060L47K6059J2222n9226
$$ plain form
10740 -66889 -55419 -7262 -4779 7099 -12894 -38858 -44904 2677 -7831 18679 2745 -31700
10728 -31700 -10593 60350 61715 24022 64117 137032 136050 93267 44976 1194 -39695 -67712
10716 -67712 -105851 -93249 -53657 27664 54812 46656 47391 55616 73251 90078 106109 83430
10704 83430 55675 29923 79688 126125 112908 72555 37766 -24564 17276 66166 100600 112876
10692 112876 128469 111073 111760 115185 103183 103274 135609 133217 118493 87158 71858 83615 111041
10679 111041 137550 121657 118339 98950 99345 114613 112005 111763 127074 138030 119312 131440 125738
10666 125738 134281 147384 143543 172688 177189 159792 173068 204808 211440 204486 240467 268048
10654 268048 292180 243752 197478 178576 191285 158837 142227 131167 131514 157573 169795 110569
10642A10569k0773P49l6046N5278L1482m010l9770n8779J0914L4353R938j4309
10630G9596m947M1584J7108K2438J4743n347l1712l5943m713M0180M853o138J2108
10617A43810M1941J6461M4403j584k8675k1983k0957j7195n2857l4184L9117L6908
10605A45205L8509m856n8416r166k7648k5173q102l2471J7643m5637K5360R979
10593B5227J335J7292N0058K1064K5465J2135k1062K465N2887O7223j6816k4829
10581B12444L0944r191n7298p544M1533j6213j3548K0909k0044m5463j1075k0463
10569A04991l7127j0664N0389J7600M2168L7164L2586K7165M5858l1203j877O6049
10557C43099Q630m1992q699j9662n0205j4276k5671J1525k4680m3962M893k3458
$$ plain form
10642 110569 89796 90545 54499 109777 141259 137249 97479 38700 49614 83967 93905 79596
10630 79596 74649 116233 133341 155779 170522 165175 133463 97520 92807 132987 137840 131702 143810
10617 143810 185751 202212 246615 245031 216356 194373 173416 156221 103364 69180 108297 145205
10605 145205 183714 178858 120442 111276 83628 58455 50353 17882 35525 -10112 15248 25227
10593 25227 26562 43854 93912 114976 140441 152576 131514 133979 186866 254089 237273 212444
10581 212444 243388 234197 176899 169355 210888 194675 181127 202036 181992 136529 125454 104991
10569 104991 67864 57200 107589 125189 167357 204521 237107 264272 310130 278927 277050 343099
10557 343099 351729 309737 301038 281376 231171 216895 191224 202749 178069 134107 139000 115542
10545A15542M5538K7438n63l0278J0257J0011j1295J7993j7275l336J5834J0740
10533A90606J5570j1912l5277m2648l3827M453J2809J3370J5788k957M1802J2665
10521A80442J6416L1130O338m5554k5441l9253j1445K1862L4968M7262P4419Q8829
10509C79973N5963n129K4504P032n8754M809R88k4296k5550l701k5756K2045K197
10496C54325j6158M8230N9244K8987Q7999j709J6941K4298J8440K0802n786j2032
10484F23581J7149J8856J6429P0546L7610L8724J29099J28040K15870L78617M49377
10473B123898O29664P70604Q74406Q14836M49613L0591k71865n11671p00477o15041
10463C594558m82688l43787k28347n823J27539L01764N07709P59499J120737J349529
$$ plain form
10545 115542 161080 188518 187955 157677 167934 177945 166650 184643 167368 164032 179866 190606
10533 190606 206176 194264 158987 116339 82512 86965 99774 113144 128932 125975 167777 180442
10521 180442 196858 227988 234326 188772 163331 124078 112633 134495 169463 216725 291144 379973
10509 379973 435936 430807 455311 462343 403589 408398 409386 385090 359540 355839 330083 352128 354325
10496 354325 338167 386397 445641 474628 562627 560918 577859 602157 620597 641399 635613 623581
10484 623581 640730 659586 676015 746561 784171 822895 951994 1080034 1295904 1674521 2123898
10473 2123898 2753562 3524166 4398572 5213408 5663021 5693612 5421747 4910076 4209599 3594558
10463 3594558 3111870 2768083 2539736 2533913 2661452 2963216 3470925 4230424 5351161 6700690
10453F700690J446941J251793O20501j9674m97872r79564j205685j089240r97816
10444E230074q08866n52350l53810k18281r7401m6256m944P8899K03086K43063
10434C673214K80673L90550M30297M57164M58631L95803M07653M71470M65799
10425G431254M41922L77178M23739M71092O50600P57871J042107J387462J776443
10416A4759668K185075K781437L541828M612167O276575R018144J3574649K0929338
10408G7678881L1824857M3633574N1141689N5717149N6417927L8897434R989654
10401C65301165j1159674k9014567m6194697n3359494m9266281m1454984l3100807
10394A01750661k4416721j6983611j1693388q332812o236670m777180l837980
$$ plain form
10453 6700690 8147631 9399424 10019925 10000251 9502379 8522815 7317130 6227890 5230074
10444 5230074 4421208 3868858 3515048 3296767 3199366 3153110 3148166 3227065 3430151 3673214
10434 3673214 3953887 4344437 4774734 5231898 5690529 6086332 6493985 6965455 7431254
10425 7431254 7873176 8250354 8674093 9145185 9795785 10553656 11595763 12983225 14759668
10416 14759668 16944743 19726180 23268008 27880175 34156750 43174894 56749543 77678881
10408 77678881 109503738 153137312 204279001 259996150 316414077 355311511 365301165
10401 365301165 354141491 325126924 278932227 225572733 176306452 134851468 101750661
10394 101750661 77333940 60350329 48656941 40324129 34087459 29310279 25472299
10387B5472299l164373k568971k070773j623091j249084r77051p59243o16379
10379A2443334o39316o65636p03256p63263p82529q09729p79805o92751n60688
10370F046361m24001l96651l66523k82452l14611k53145k09394j87675j50786
10361C461123j25536j67406j80817j93653j73561j80410j14725j41469r4761o2150
10351B026635o1111m6092o2358j08048p2439j01182j9341m4429p5384n9707j1208
10340A365336l1351j16668l1111l2365o3756k2540L393L9513J5041o6718m7363
10329A011411r568l5192l4787k2996l3073k3642J208m4726q5386n2565j5411k4841
10317F30432L2499j3767l29M4173P828n8816M464M153j2847K1516M0406P807j9327
$$ plain form
10387 25472299 22307926 19738955 17668182 16045091 14796007 13818956 13059713 12443334
10379 12443334 11804018 11138382 10435126 9671863 8889334 8079605 7299800 6607049 6046361
10370 6046361 5622360 5225709 4859186 4576734 4262123 4008978 3799584 3611909 3461123
10361 3461123 3335587 3168181 2987364 2793711 2620150 2439740 2325015 2183546 2088785 2026635
10351 2026635 1965524 1919432 1857074 1749026 1676587 1575405 1556064 1511635 1436251 1376544 1365336
10340 1365336 1333985 1217317 1186206 1153841 1090085 1067545 1070938 1110451 1125492 1058774 1011411
10329 1011411 1001843 966651 931864 908868 875795 852153 853361 808635 723249 670684 655273 630432
10317 630432 662931 649164 648835 693008 700836 642020 646484 650637 637790 659306 699712 707519 688192
10304F88192o2223k0539p44K81J0846j0896l6590j1956K9700K6096l8323l2530
10292E41314k2655R681M3702k2324j3385m9661J9632l8732k7438M5996M1568J0780
10280E38478M4462Q9618N0337K3092l5623r270J5932n8838l2248l1527o8332m6113
10268D79968J0119q382m5883k744j1490l6401K497J0814j0065R027J4934r133
10256D03261j4458p0741k3477r883J2840J5131J4682K7750k1630p7606j4815J1997
10244B53051q447k0551l9132j4662P2241M5802M2223J8927L802j5326j2850p8037
10232B47041m4423K6400K2593K2583m5057r968O1970O16j1182l1052k7638L5434
10220B47317K5460n060l1172N49L8393N6862N1692K5886J2120r20K5083n721k9461
$$ plain form
10304 688192 625969 605430 604686 604967 615813 604917 568327 556371 586071 612167 573844 541314
10292 541314 518659 528340 572042 549718 536333 486672 506304 467572 440134 486130 527698 538478
10280 538478 582940 672558 722895 745987 710364 701094 717026 658188 625940 594413 526081 479968
10268 479968 490087 481705 435822 433078 421588 385187 387684 398498 388433 397460 412394 403261
10256 403261 388803 318062 294585 284702 297542 312673 327355 355105 333475 255869 241054 253051
10244 253051 244604 224053 184921 170259 242500 288302 330525 349452 353254 337928 325078 247041
10232 247041 202618 229018 251611 274194 229137 219169 281139 281755 270573 239521 211883 247317
10220 247317 272777 267717 236545 237094 275487 332349 384041 409927 422047 421127 446210 440489 411028
10207D11028p010k7372l9325n0458m644k4465m9833n2846l911M8668k0460l7528
10195A41844L0528J2019K0520m671l884j8960L233J3144k6803j1487J3059j3678
10183A54864L6951k3857j2157j4746j873K7469M0573K3830l055N9105K6769o6141
10171B47732j07326j3623L9865M7009M156j1250N7207M0137J0732N0532O9889
10160D35060L4612J16057K05013K71891M44060N01301N57871M71218K00608k3333
10150C214358k22803m30798n12800m27914m00044k88645j88346r9449q3551m0545
10140E19463p6995m7891j6668l3842J1883j2397n6223j2209m0211l6832j7302
10129A80776O1248o98J7006J1914k7579K856J2042j2898l6531o3551m1509J2811
$$ plain form
10207 411028 404018 376646 337321 286863 282219 257754 207921 155075 151164 199832 179372 141844
10195 141844 172372 184391 204911 200240 196356 177396 180629 193773 166970 155483 168542 154864
10183 154864 191815 167958 155801 141055 139182 166651 207224 231054 227999 287104 313873 247732
10171 247732 140406 126783 166648 213657 217813 206563 263770 303907 314639 365171 435060
10160 435060 469672 585729 790742 1062633 1506693 2007994 2565865 3037083 3237691 3214358
10150 3214358 2991555 2560757 2047957 1620043 1219999 931354 743008 643559 560008 519463
10140 519463 442468 394577 377909 344067 355950 343553 287330 275121 234910 198078 180776
10129 180776 242024 241326 258332 270246 242667 245523 257565 244667 208136 144585 103076 115887
10117A15887k6945j9048M4308j6439l857p693N167k628j8133j8486J4549M7246
10105A13928j2583R653L8797M1083K8495m2702k3230K1084n259k3167R681L755
10093A59535k1653q219L5607p361O850J8451k7055j1182o238J471M8674J0356
10081A99236l2340j8125J4419L4380M0478n3202j2793p360k720K3565k87m7608
10069A37643m279L2535r870O176L3050k4103k167j9831k5812j6256l1051R165
10057H5200K6849j8445L0055K0102J3005l6819j002j4872K9019J103p701M9984
10045A76478J8475k9232K2777L2815n837K0564o782j5752k1305N7621j2700p0635
10033A66487l0267j7764P817N0822N762l3546k0821j4811K272m814J2115k5612
$$ plain form
10117 115887 88942 69894 114202 97763 93906 86213 91380 88752 70619 52133 66682 113928
10105 113928 101345 110998 149795 190878 219373 176671 153441 174525 169266 146099 155780 159535
10093 159535 137882 129663 165270 157909 164759 183210 156155 144973 138735 140206 188880 199236
10081 199236 166896 148771 163190 197570 238048 184846 172053 164693 161973 185538 185251 137643
10069 137643 133364 165899 156029 162205 195255 171152 168985 149154 123342 107086 76035 85200
10057 85200 112049 93604 123659 143761 156766 119947 118945 104073 133092 134195 126494 176478
10045 176478 194953 165721 188498 221313 215476 236040 229258 213506 192201 249822 237122 166487
10033 166487 136220 118456 126273 177095 182857 149311 128490 113679 115951 111137 123252 97640
10021I7640L7269L8289J3863j1224j9117j171K4951K8508j3827j1443m4725J0663
10009A49676K4342J8632K887j480j8258k0996k044L3814L8111K8769J2777J01012
9997C67242J00509J58466K14210K90722L14358L32962K25450P1996r5683j57399
9987A822833j78525k30638k75742k74929k20834j13344j12673r7161k2959m4342
9977B51686m3003l3700J635J8358K1553J17k1712M499K591K0705n6752o4133N974
9964A07818p686M2228L5478N919k5963j6531M2067K3562n48J7501J173L786j9719
9951B09085R734K455q050k7198L3141P5158P7283N6551R2706J32703K37677L61958
9939A253203O68898J115606J450477J164089K57035l59390o86987r54689j020709
$$ plain form
10021 97640 134909 173198 187061 175837 156720 155549 180500 209008 195181 183738 139013 149676
10009 149676 174018 192650 195537 194057 175799 154803 152759 186573 224684 253453 266230 367242
9997 367242 467751 626217 840427 1131149 1445507 1778469 2003919 2075915 1980232 1822833
9987 1822833 1644308 1413670 1137928 862999 642165 528821 416148 318987 296028 251686
9977 251686 208683 174983 176618 194976 216529 216646 194934 199433 202024 222729 165977 101844 107818
9964 107818 100132 142360 177838 183757 157794 141263 183330 206892 206344 223845 225018 228804 209085
9951 209085 218819 221274 213224 186026 219167 294325 371608 428159 520865 653568 891245 1253203
9939 1253203 1922101 3037707 4488184 5652273 5909308 5549918 4862931 3908242 2887533
9930B887533q58701n87012l58801k49618j67638j44164r3509k7935k8867m6621
9920C24667l3754p679l3220Q776n5080k6088K2533J650j5183k4429n163J9451
9908A76481p501p2173J1988M1524j2169L427j5141k4773O589J7459L084J6768
9896A45563j0293j8589m65p848L9131K641J5820P319m1078P562K6555k0097j3207
9883A33014J8295M453l3742K8773J4440k0905j2746k8919l6331J7110L8331j6090
9871A05683k6284K0646K3474m330m558j5636R87P525K4270O952J4904l3855r546
9858A10232j5035J8523L8308J355K0042Q643M846N8124Q1766J38437K59299L71749
9846A096289K71972O5411j36842k08260k33400k23037j90755j15157m3439l0539
$$ plain form
9930 2887533 2028832 1441820 1083019 833401 665763 521599 428090 400155 371288 324667
9920 324667 290913 283234 250014 258790 203710 177622 200155 201805 186622 162193 157030 176481
9908 176481 168980 96807 108795 150319 138150 141577 126436 101663 108252 125711 128795 145563
9896 145563 135270 116681 116216 108368 147499 150140 165960 173279 132201 139763 166318 146221 133014
9883 133014 151309 155762 122020 150793 165233 144328 131582 102663 66332 83442 121773 105683
9871 105683 79399 100045 123519 119189 114631 98995 99982 107507 131777 138729 153633 119778 110232
9858 110232 95197 113720 152028 153383 173425 182068 186914 245038 326804 465241 724540 1096289
9846 1096289 1368261 1433672 1296830 1088570 855170 632133 441378 326221 282782 252243
9836B52243m3720m1978n2118K1464L4080k883k0178P54l1632k754k2318J4854
9824A05814k3537K4214O002n2918K7410K8234j5093l8426K7873L9207k3254J8147
9812A23673j2057j5818Q213Q083J5612j1002m1493k1060k4097j755j0983q867
9800H449N8199N0563j3782j4885m973P01j8060l5736j2685J8272m118N43K9405
9787F1893L916L343O2139J8273J4779l0353k2700N1634L0093L1158L1408K9912
9775B85495N8427O1472J13420J68290J58977J24571j7199j04906j29915j24902
9765E93730j26550j10083j25343r2983k1890L2221o652o841l5014k3601k0881
9754E6113L2838L5286j8314p312q935k8052j6445O31l4148L3477J7464K6378J1414
$$ plain form
9836 252243 208523 166545 114427 135891 169971 167088 146910 147664 116032 113278 90960 105814
9824 105814 82277 106491 112493 59575 86985 115219 100126 61700 89573 128780 105526 123673
9812 123673 111616 95798 104011 112094 127706 116704 75211 54151 30054 28299 17316 8449
9800 8449 66648 117211 103429 88544 83571 84272 66212 30476 17791 36063 31945 32488 61893
9787 61893 65809 69152 131291 149564 164343 133990 111290 162924 193017 224175 255583 285495
9775 285495 343922 405394 518814 687104 846081 970652 953453 848547 718632 593730
9765 593730 467180 357097 231754 138771 116881 149102 142450 135609 100595 76994 56113
9754 56113 88951 124237 105923 98611 89676 61624 45179 45810 11662 45139 62603 88981 100395
9741A00395P793K1823M265l9871m9565k8192K4435L553K3499M0114J5275k1276
9729A02248n5071l8265j971j5401m0539J7322O4121L1399N787J3486l4891J6054
9717F4279K9591Q104m8538l9130j3832M1243J2443j9341K7438m459M1194J3567
9705A12559m0508j3979l4116j2699O273J4155J8970J4853r874j9428k0800J4375
9693B9781L0M508K0774J6879L390k4726j8687N422J3828J709k7609N816M4182
9680G5297J9181j7144o019N074p735o0222m4336J7372L7897L0061l513j2569J2870
9667D6214j5488K4910n717n006r162k618J6641k5581k4143j0896p628l8496K7469
9654b9501N422J6472L8164J8185M7580J206k8620L1672K7873L160j5498l0236
$$ plain form
9741 100395 108188 130011 134276 94405 44840 16648 41083 44636 68135 108249 123524 102248
9729 102248 47177 8912 6941 -8460 -48999 -31677 32444 63843 69630 83116 48225 64279
9717 64279 93870 101974 53436 14306 474 41717 54160 34819 62257 57798 98992 112559
9705 112559 72051 58072 23956 11257 17530 31685 50655 65508 55634 36206 15406 29781
9693 29781 29811 34319 55093 71972 75362 50636 31949 37371 51199 52908 25299 31115 75297
9680 75297 94478 77334 71315 76389 68654 8432 -35904 -18532 19365 49426 45913 33344 46214
9667 46214 30726 55636 49919 44913 35751 33133 49774 24193 50 -10846 -18474 -56970 -29501
9654 -29501 -24079 -7607 30557 48742 96322 97528 68908 100580 128453 131613 116115 85879
9642H5879m1781L120J1214j1361l9485n990Q512n328K5799M3119k0632J8424P185
9629G8675j490K8384j16k4361P1524L5439o749p336m417k4812n1645O586m082
9616I5600l1275k4121k4471J8923O9949M686J793O337n5940j741J021Q856N7292
9603A26909J6346k8811m2764p335p057K4064O859L8073K280k1776L018j0591M3975
9590A43190j3716k9096J436o1361n738O0394K1975K0991K2757k3169J14j5682
9578A22095K2787K718j3609n247K5709N9473J1868L0235L6254k033O476k1573
9566B75153m4772j3311k464J0799n1651J370R5454K1117L39j1057K1004J1845
9554C13826K088P848J4039q762j0606m4021J6712N9311J9052M935J6086K9117
$$ plain form
9642 85879 44098 47218 58432 47071 7586 1596 10108 4780 30579 73698 53066 71490 78675
9629 78675 77185 105569 105453 81092 152616 188055 181306 173970 169553 144741 93096 99682 95600
9616 95600 64325 40204 15733 34656 104605 109291 111084 117421 61481 59740 60761 69617 126909
9603 126909 143255 114444 71680 64345 57288 81352 88211 126284 128564 106788 109806 99215 143190
9590 143190 129474 100378 101814 40453 34715 95109 117084 138075 160832 137663 137777 122095
9578 122095 144882 147600 133991 128744 154453 213926 225794 256029 292283 290250 296726 275153
9566 275153 230381 217070 214606 225405 173754 175124 270578 291695 292034 280977 301981 313826
9554 313826 315914 323762 337801 329039 318433 274412 291124 350435 369487 374422 390508 419625
9542D19625J4659M2291K1180M0423O762L3083L46J2271P7972P6226K9418L4601
9530H08857J1066N1841P8767N4853P3082P9194R2948O8375M8235R2580Q7201P5990
9518A622989L3706O8724R7127N0518M9439O1318N7964P1292K6782R512m2908j6705
9506B089758m0759n1821q5428n8614L772l6573j10786p6172n6039n1928r8216
9495A427194q2653r5066o9413p4439m8612n2371n4088O264o3058o0426l9101l9465
9483G54766l7956o0913n7510j8599n231j3651j6372m7794l3448l0017N2269q107
9471D77437p4342M29j3633L0358j6675p2546m5774Q300j3959l7040m1913J8216
9459B18858j0954J2518K3856K7388J8414R390l7924l6645l008l3858l8054k6635
$$ plain form
9542 419625 434284 476575 497755 538178 544940 578023 578369 590640 668612 744838 774256 808857
9530 808857 819923 871764 950531 1005384 1078466 1157660 1250608 1318983 1367218 1459798 1546999 1622989
9518 1622989 1656695 1725419 1822546 1873064 1922503 1983821 2041785 2113077 2139859 2149371 2106463 2089758
9506 2089758 2048999 1997178 1911750 1853136 1856908 1820335 1709549 1633377 1577338 1525410 1427194
9495 1427194 1344541 1249475 1180062 1105623 1057011 1004640 950552 956816 893758 833332 794231 754766
9483 754766 716810 655897 598387 579788 574557 560906 544534 496740 463292 433275 485544 477437
9471 477437 403095 403524 389891 420249 403574 331028 285254 293554 279595 242555 200642 218858
9459 218858 207904 220422 244278 271666 290080 299470 261546 224901 221893 188035 149981 123346
9447A23346J9677M9121K202l7904l8499J8544J4268k5961o768L4584J7502k1153
9435A48959m1010j6744j4995M348m637j3048K0467K5705J8057m3010j5216M1709
9423A10585l3153n884j6977p326l011J9435k221l871R095K0449P138R18k8309
9410F6868q610M5430K6470J8419L404j6071k5278l0793j2765j2884O38m0049J4470
9397B9249L1267J0068j427J5753K707q892L333K3409J1384K4810k3934n4372K8178
9384I1533M8285M904j9489k0067l4650J6867l255l9603l7186j2297L6724M515
9372C6281j5947K8706J7933J5284J3672k7077l0343M204L999j5204J790P659K3890
9359F4847K3010J4439j3778m3302j6331k074j6527O775k8338L2853L903j8233
$$ plain form
9447 123346 143023 192144 194346 156442 117943 136487 150755 124794 118026 152610 170112 148959
9435 148959 107949 91205 76210 80558 75921 62873 83340 109045 127102 84092 68876 110585
9423 110585 77432 71548 54571 47245 44234 63669 61448 57577 66672 87121 94259 95177 66868
9410 66868 58258 103688 130158 148577 151981 135910 110632 79839 67074 54190 54828 14779 29249
9397 29249 60516 70584 69157 84910 87617 78725 82058 105467 116851 141661 117727 63355 91533
9384 91533 139818 144722 125233 105166 70516 87383 84128 44525 7339 -4958 31766 36281
9372 36281 20334 49040 66973 82257 95929 68852 38509 42713 46712 31508 33298 40957 64847
9359 64847 87857 102296 88518 45216 28885 26811 10284 17059 -11279 21574 25477 7244
9347G244j3838K5974l2632L02R221J0651L3990K6942j2882J7926k5254j3684J2740
9334D6700l246o0904r098J3884J6984K1462N521J1688n831k1881J9927m892M3072
9321G3386L0346J2929j3289n7659m0369J924K0072R857K4302L822j4981k3312
9309B7028j0086K0117o731j1075L271L0451M0150J0487k0473k8586R877Q685o563
9296F6552K4735l1916j4925J6236J0841L6385M2853q390n0704o8884k0446l464
9284a127j7348O587N0697K0879o1685k3950L7355K7600J2131k796N195l8871k532
9271A2135N6991J8050K5645k657m0013m1703J7381K532k8706q833N0401r372l2958
9258A8893L324M7651K9656r409l2814j5340k1196O722J0627J2065j0292m2670
$$ plain form
9347 7244 -6594 19380 -13252 -12950 -3729 6922 40912 67854 54972 72898 47644 33960 46700
9334 46700 43454 -17450 -26548 -12664 4320 25782 31303 42991 37160 15279 35206 30314 73386
9321 73386 103732 116661 103372 45713 5344 7268 27340 37197 61499 65321 50340 27028
9309 27028 16942 37059 30328 19253 22524 52975 93125 103612 83139 54553 64430 73115 66552
9296 66552 91287 59371 44446 60682 71523 107908 150761 142371 91667 22783 2337 -1127
9284 -1127 -18475 -11888 38809 59688 -1997 -25947 11408 39008 51139 48343 53538 14667 12135
9271 12135 69126 87176 112821 110164 70151 28448 45829 48361 19655 10822 61223 51851 18893
9258 18893 22217 69868 99524 90115 57301 41961 20765 27487 38114 50179 39887 -2783
9246b783K0411J3452o311j6944L91N551l831m924J9494K3159L0774l310N575J9995
9232A00699k3685J4996J5963j9461n0607k0093k82l4989j8851j4649K7086J1870
9220a2003L8490P878M196L1839l7298r807j9036k8994J834J0621k531K2378J2720
9207B0287J6147J1050Q825m103L4652l8248l1855J1519J4858r458k1539J1935
9195B4070K8516k4055j056J9878j8650k4022j6209j879J3737M4056L0795J2484
9183H7665M8504m7833l3888M2502L9012Q113l9435n8696P192k998L1167P459o0081
9170B8683J0815J655J1764m0492k4579L5737J6767R131K1362k6211K7061j2734
9158E8959r7858j0390K9L1986L6029K856l6268j0058k223J1171O786M570M0509
$$ plain form
9246 -2783 17628 31080 24769 7825 8216 13767 9936 5012 24506 47665 78439 75129 80704 100699
9232 100699 77014 92010 107973 88512 37905 17812 17530 -17459 -36310 -50959 -23873 -12003
9220 -12003 26487 34365 38561 70400 33102 23295 4259 -24735 -22901 -12280 -14811 7567 20287
9207 20287 36434 47484 56309 52206 86858 48610 16755 28274 43132 33674 12135 24070
9195 24070 52586 28531 27475 47353 28703 4681 -11528 -13407 330 44386 75181 87665
9183 87665 136169 88336 54448 96950 135962 144075 104640 45944 53136 50138 81305 88764 28683
9170 28683 39498 41153 52917 12425 -12154 23583 40350 49481 70843 44632 71693 58959
9158 58959 -38899 -49289 -49260 -17274 18755 21611 -14657 -24715 -26938 -15767 -8981 -4411 36098
9145C6098K7921m2923k2193r880K6086N0563r526O378j6295j2637j4960l0497
9133a1865l4617O5373M080l1719L816M7460j1024l2702R294L6559k2888K3016
9121D4783P4698m626m6910L7134M1973k6624l1723n9463n4176K3639L301J955
9109C961N6525j7137N648l517l5215j001O826K0416k5180k4726M3880P1720p6022
9096B6178p0705k7947L6103R811r317K3878J7004M6887J1556r873O366n627K283
9083E6597j6677K0213n888l4455k7464k6516k6226L2759l525k7170K3228K822
9071c2302j2416j0196N5267M811l0944k4482J326M0830L192l1316M2983j0896
9059d143j166N980P2375J6058n611J2106m1381n2426l4066L0119K9147j9517R951
$$ plain form
9145 36098 64019 21096 -1097 -10977 15109 65672 56146 62524 46229 33592 18632 -11865
9133 -11865 -46482 18891 22971 -8748 -4932 42528 31504 -1198 8096 44655 21767 44783
9121 44783 119481 114855 67945 105079 147052 120428 88705 29242 -24934 -1295 2006 3961
9109 3961 60486 43349 48997 45480 10265 9264 16090 36506 11326 -13400 30480 102200 26178
9096 26178 -44527 -72474 -36371 -26560 -35877 -11999 5005 51892 63448 53575 59941 54314 56597
9083 56597 39920 60133 54245 19790 -7674 -34190 -60416 -27657 -31182 -58352 -35124 -32302
9071 -32302 -44718 -54914 353 5164 -25780 -50262 -48936 -8106 -4914 -36230 6753 -4143
9059 -4143 -5309 671 73046 89104 83493 95599 54218 1792 -32274 -2155 26992 7475 17426
9046A7426L6069j0599j968j7375K9090L681l4034k4604J7086J7303k1914J2819
9034B2980K466L5114k4948O374J9865r939j0937L1219L8515J987j3633l6097l3010
9021B9956k7157m921q486L514k195N8706J9670j2503m4505j4249j6607j3522o604
9008c8903J308o009R828L29l0701n983M0843K7721k9961k6693O2624k430K1533
8995B3506Q331M686J0591j9246l749j569L612j5356l5332J1901M5880k2641m0974
8982c0360J9773j5604k9900l3353J9507M4576K2309j1076m1434M3916N9855R931
8970E8140P06o7984j8624j2484P076K126k4953q04Q885M6315M0786l976p904r681
8956A7624J0801N8527J9345j7998j9880K880J8441O394o0980j6731p562l8783
$$ plain form
9046 17426 53495 42896 40928 23553 52643 56324 22290 -2314 14772 32075 10161 22980
9034 22980 25446 60560 35612 41986 61851 51912 40975 72194 110709 112696 99063 62966 29956
9021 29956 2799 -2122 -10608 -7094 -9289 49417 69087 56584 12079 -2170 -18777 -32299 -38903
9008 -38903 -37595 -43604 -33776 -33447 -64148 -70131 -29288 -1567 -31528 -58221 4403 1973 23506
8995 23506 31837 36523 47114 27868 24119 22550 26162 10806 -24526 -12625 33255 10614 -30360
8982 -30360 -10587 -26191 -56091 -89444 -69937 -25361 -3052 -14128 -55562 -11646 48209 58140
8970 58140 58846 -9138 -27762 -40246 -33170 -31044 -55997 -56801 -47916 -1601 39185 35209 27305 17624
8956 17624 28425 86952 106297 88299 68419 71299 89740 96134 35154 18423 10861 -27922
8944b7922J1392M1838k890l9370M481K2466M5949j1438j3045l1517k8507J7717
8932a0846K9533K2979M3995j5131M830L1015p587o1874m4402J4150j4466k4851
8920c2655J3062M6559J7901r431j190m4082k5458K4233L5675o117m3266k505P4864
8907D7590L7433r557m0886k5137m1580J8602M3652O1045J3378L5432r446l1916
8895I8610j8620j4306j9110k2018M0667J2774j0976m4905p538P5540J8416k5496
8883H3038l2021J9498L4155k0130k9852o582k1814J3663j6710k9293M3927N0376
8871H8255j3214n7280n9210l9927K5997O2457J2870j1657m7791J7007L8611M8239
8859F4357o882k5962l0722l0824Q166M523J6483q0n056j2072k0844O504j9309
$$ plain form
8944 -27922 -16530 25308 22418 -16952 -12471 9995 55944 44506 31461 -56 -28563 -10846
8932 -10846 18687 41666 85661 70530 75360 106375 98788 36914 -7488 6662 -7804 -32655
8920 -32655 -19593 26966 44867 35436 34246 -9836 -35294 -11061 24614 18497 -24769 -27274 47590
8907 47590 85023 75466 34580 9443 -32137 -13535 30117 91162 104540 139972 130526 98610
8895 98610 79990 65684 46574 24556 65223 77997 67021 22116 14578 90118 108534 83038
8883 83038 51017 70515 104670 84540 54688 48106 26292 39955 23245 -6048 37879 88255
8871 88255 75041 17761 -41449 -81376 -55379 7078 19948 8291 -39500 -22493 16118 64357
8859 64357 57475 31513 791 -30033 -21867 -17344 -861 -941 -5997 -18069 -38913 -32409 -51718
8846e1718j9840o731j3050P4743K3261J8769J9454R649J6295o399j2085L286L6708
8833I2342J1685q690l9810l0570L068J1928N460J7227l5264N091K6989o3534j4951
8820a9029J6251J2137n867j3316j8638N31M399q447K2779M209j6483J1408j9987
8807c0053P97J2329K5295j385K9150L4614k1760J9619Q624n0045l1741n663J5934
8794E715J0852k6851K0488K6595k8279n011l9438K226p519J9780K869J1501K3355
8781A6283R981M545k2574j9819M9017K9174l2174k4978j3709n7844P892K1457
8769c2749n979j2310P671n787k114L2517k9232Q811M0724P209J055P977l1710
8756a3917R209j7029m762P572j651P789L7707O7296l8930m7434k4938J4473j5217
$$ plain form
8846 -51718 -71558 -78289 -91339 -16596 6665 25434 44888 54537 70832 64433 52348 55634 92342
8833 92342 104027 95337 55527 24957 28025 39953 45413 62640 27376 32467 59456 -4078 -19029
8820 -19029 -2778 9359 3492 -9824 -28462 -27931 -23532 -31979 -9200 -4991 -21474 -10066 -30053
8807 -30053 -29256 -16927 8368 6983 36133 70747 48987 68606 77230 27185 -4556 -10219 5715
8794 5715 16567 -10284 10204 36799 8520 3509 -35929 -33703 -41222 -21442 -18573 -7072 16283
8781 16283 26264 30809 8235 -11584 37433 66607 34433 9455 -4254 -62098 -54206 -32749
8769 -32749 -38728 -51038 -43367 -49154 -51268 -18751 -47983 -39172 1552 8761 9816 17793 -13917
8756 -13917 -4708 -21737 -26499 -18927 -20578 -12789 24918 92214 53284 5850 -19088 -4615 -19832
8743a9832l7671J4815N1133L4050j7921j8086q816j8773j8871Q732R045r375O0354
8730B8784N0343n838L210P911j6397L0384K3869l8844J2455K1535J4651j4713
8718A17350o3440j05032j7306N1256O352o043O8232N409J5937l3321J0418j5313
8706C4499k0708o1983k2904o945M3463L7783l326j8501r096K168j1924L2356K9609
8693B4491J4461j6917j2727L950o878k893k2116k3350j7301K8955L5970J8571
8681B4216J1180R413J372O419k267N9232L7815j6725o2566m0166M0737J3077o8423
8668A3314k3823N72L0436J9514K6478j4212j8734l7596R772M2563M1163L9986
8656A29433l4023k3802j5076M78L7492j5867o220K4921J0246j0345N5914Q2079
$$ plain form
8743 -19832 -57503 -42688 8445 42495 24574 6488 -2328 -21101 -39972 -31240 -22195 -31570 28784
8730 28784 79127 73289 76499 84410 68013 98397 122266 83422 95877 117412 132063 117350
8718 117350 53910 -51122 -68428 -17172 -10820 -16863 51369 56778 72715 39394 49812 34499
8706 34499 13791 -48192 -71096 -78041 -34578 3205 -121 -18622 -27718 -25550 -37474 -5118 24491
8693 24491 38952 22035 9308 13258 6380 3487 -18629 -41979 -59280 -30325 5645 24216
8681 24216 35396 44809 46181 52600 50333 109565 147380 130655 68089 27923 68660 81737 13314
8668 13314 -10509 -9937 20499 40013 66491 52279 33545 -4051 5721 48284 89447 129433
8656 129433 95410 71608 56532 57010 94502 78635 72415 97336 107582 97237 153151 235230
8644B35230R7225N5118j0528J9770k9105p1899m3838l9006k8524L890m8323l9794
8632A00216j9455l9472r674Q536m34P720L7498q991K0378l8456j5890P2802J6081
8619A30859k2733j5288M4800L1330l6624m5694j2773j9360j9835j1046O0567J8242
8607A02445j2878j8944Q662K0935M8158K7810L5075R7941J71733J98742N9549
8596G39228k7126p8033j03647j31483j29914m4642j9763j4587J1003l3151n6347
8585A11538j2836J436j8387J9609J2559k3382O363j0239j8104M0883K0199M3907
8573A73546M2698j178L230k763l0542J1671j7546p0001j5701l7519k982L6713
8561H9626J3593j5870M203l455J0703K4102L8952P0787R0721N0388p669m712o3733
$$ plain form
8644 235230 332455 387573 377045 396815 367710 295811 251973 212967 184443 188333 140010 100216
8632 100216 80761 41289 31615 40151 39717 47437 84935 75944 96322 57866 41976 114778 130859
8619 130859 108126 92838 137638 168968 132344 86650 73877 54517 34682 23636 84203 102445
8607 102445 89567 70623 79285 100220 148378 176188 211263 309204 480937 679679 739228
8596 739228 712102 634069 530422 398939 269025 224383 204620 190033 201036 167885 111538
8585 111538 98702 100138 81751 101360 113919 90537 96900 86661 68557 109440 129639 173546
8573 173546 216244 215066 218296 215533 184991 196662 179116 109115 93414 55895 52913 89626
8561 89626 103219 87349 91552 88097 98800 122902 161854 232641 323362 373750 366081 361369 297636
8548B97636q5348l3902m8625l8361o5342q542k8932J1658J0711K7337L428p634
8536C4084J48K174j1788k589L7751K7330J7373q91R974j0833M456k2164k6715
8523E8310j7420J4930j4944j9549M541N888j1859l963K8761k1566k4796R091p782
8510c58K6798J3764k7592m09k8008r463l1558K6454K4933K2686l1915m4633L9309
8497a9992R329Q386P085k2401J0169K0320k0191m2610k8828J3700L9966K1291
8485c776L5720l8320J321k9312J8547J1159n3060l753O0649N814J8131J7552l1696
8472H976N550L0120N601l3021j7299l622l6724k3405K2419K6894l189J6015M1323
8459C9638o816o838J8869j1630K264J4040m8750J2008K7218j479j1026J8593j3741
$$ plain form
8548 297636 212288 178386 129761 91400 26058 17516 -11416 242 10953 38290 41718 34084
8536 34084 34232 36406 24618 22029 59780 87110 104483 103592 113566 102733 107189 85025 58310
8523 58310 40890 55820 40876 21327 25868 31756 19897 15934 44695 23129 -1667 7424 -358
8510 -358 26440 40204 12612 12203 -15805 -25268 -56826 -30372 -5439 17247 -14668 -59301 -19992
8497 -19992 -10663 -2277 4808 -17593 -7424 12896 -7295 -49905 -78733 -65033 -25067 -3776
8485 -3776 31944 -6376 -5055 -34367 -15820 -4661 -57721 -61474 -825 4989 23120 40672 8976
8472 8976 14526 44646 50247 17226 -73 -3695 -40419 -63824 -41405 -14511 -17700 -1685 39638
8459 39638 32822 25984 44853 33223 35487 49527 777 12785 40003 38524 27498 46091 32350
8446C2350N98K7477L0705j9335o3967M655M6154j4404J5736O925k0657m3855R773
8433A2155Q54P005k8966K1490L7169L4548l328n3396J424L9429J5787J3102k1775
8420G5498j9503k2733j7842K0004J1068J0869m098n4473j2252j513q544K4717
8408A198j1510N135m7714l564l104j3083o0900j5796M5617M0394j966M3765K1377
8395a51k6870K5619m2391J4367j468n0380M8356M9084j9485q781J8418m402k044
8382a28K7785M2335j0090n0768K81k3510j7590L2829r146l2594J3456M07P548
8369a9185Q517L3293j379j0007j642l3611l4980J7157M6375R711O102J6797K5359
8356F2507l4796j2257k3756J833m352k398P1P310M201N791K2126j2555l4392k5744
$$ plain form
8446 32350 32948 60425 91130 71795 7828 12483 58637 44233 59969 66894 46237 2382 12155
8433 12155 13009 20014 -8952 12538 49707 84255 80927 27531 28955 68384 84171 97273 75498
8420 75498 55995 33262 15420 35424 46492 57361 53263 -1210 -13462 -14975 -23519 1198
8408 1198 -10312 -5177 -52891 -56455 -59559 -72642 -133542 -149338 -103721 -63327 -65293 -21528 -151
8395 -151 -27021 -1402 -43793 -29426 -30894 -81274 -32918 16166 -3319 -12100 6318 1916 -128
8382 -128 27657 69992 59902 9134 9415 -14095 -31685 1144 -8002 -40596 -27140 -26733 -19185
8369 -19185 -10668 22625 21246 11239 9597 -24014 -58994 -41837 4538 14249 20351 37148 62507
8356 62507 27711 15454 -8302 -6469 -10821 -13219 -13148 -5838 -1637 4154 26280 13725 -20667 -46411
8342d6411P195K4806J5354n970K405L6459k5098Q138J6815k5122q6L2772j6706
8329B4551k481J6918L0595k9323q69J0672n4853k2590K1185m0267r886M0888k6438
8316d1898Q49K4591R055j8781M0040L7030l123j0636O622l146L3046k9960k5257
8303A8432J1479M125l5125k3064k4231m871j5789J710J8673K8048M020k9339N503
8290d0429j1240K5324k2035K483J1573O8265K4310l1653n4810j7022p859L1168
8278b1925K1801j9145J9955n785m730n5152j5284K3479K0402M058P593K0122N5502
8265E0891Q168j8641l2483K1074J1133R733k7243n04O401j86j9669l1031o355
8252b8712K5724J7505j8958j6428K9283N997l558k9444j1532P472l3874P328K5014
$$ plain form
8342 -46411 -39216 -14410 944 -5026 -2621 33838 8740 16878 33693 8571 8485 41257 24551
8329 24551 22070 38988 69583 40260 39391 50063 -4790 -27380 -6195 -46462 -56348 -15460 -41898
8316 -41898 -41049 -16458 -7403 -26184 13856 50886 47763 37127 43749 40603 73649 43689 18432
8303 18432 29911 34036 -1089 -24153 -48384 -53255 -69044 -67334 -48661 -20613 -16593 -45932 -40429
8290 -40429 -51669 -26345 -48380 -45897 -34324 33941 58251 26598 -28212 -45234 -53093 -21925
8278 -21925 -124 -19269 686 -5099 -9829 -64981 -80265 -56786 -36384 -32326 -24733 -4611 50891
8265 50891 59059 40418 7935 29009 40142 49875 22632 22128 28529 28343 8674 -22357 -28712
8252 -28712 -2988 14517 -4441 -20869 8414 14411 10853 -18591 -30123 -22651 -56525 -49197 -24183
8239b4183l211J4142L3900L930j9996j7099j472q495l3611K4677j459j59Q353
8226b4683J8888k839j4538K4861N095J8596M6370J1630n7598J026o69k6888l5032
8213c5781K4297K4748J395k5480l908r915l944l361L5538J7773N9411N138m6589
8200C9322l3269n1469k799J8207K8428l3552J7495N8357K5741o2235l9878j7580
8188e3232N928K6047J9569k3293J7355k6728j1106M0080L5276L829j2172P667
8176B9220J8490k2697o489k5988j9784K2190J0588K4832J6088J3215k2041k1151
8164A6473p28p507j9541k835J3903j8291l0691r780N255J5975N587k5970J4969
8151d3181L7706l512L734K8847J3555L551k2530q412n9071j6544P191K1132K0318
$$ plain form
8239 -24183 -27394 -13252 20648 24578 4582 -12517 -13989 -22484 -56095 -31418 -32877 -33036 -24683
8226 -24683 -5795 -8634 -23172 1689 6784 25380 71750 83380 25782 26808 26139 -749 -35781
8213 -35781 -11484 13264 14659 -10821 -14729 -24644 -28588 -31949 3589 21362 80773 85911 39322
8200 39322 6053 -45416 -48215 -30008 -1580 -35132 -17637 40720 66461 4226 -35652 -53232
8188 -53232 -47304 -21257 -1688 -24981 -7626 -34354 -45460 -5380 29896 33725 21553 29220
8176 29220 47710 25013 18524 -7464 -27248 -5058 5530 30362 46450 59665 37624 16473
8164 16473 15745 8238 -11303 -14138 -235 -18526 -49217 -58997 -53742 -37767 -32180 -58150 -43181
8151 -43181 -5475 -8987 -5253 23594 37149 40700 18170 9758 -49313 -65857 -58666 -37534 -17216
8138a7216J3131l193l0613n829j076k105M2493L2262n324m1241l1062J4052L4529
8125a192J6298K125j0372J1165j7277j1461J2379l2957r082K7243N932q550J6939
8112A190k5478K69K8096j3102J41Q870J1008o759J7196N848j1662L46k3017l2577
8098c9631L2406J392q719J1350p37j1508q617M1039j5789k412o978j221k088J2876
8084A363q4M0779K0753n3047l8160K813J2971j0681K4746l529l385m1711o861
8071e4033m656L0735K2081M473J065P532j7446j8938J092L5650m1182P488L7866
8058A1727Q001j8984j0663K172n946m7884o576L3104L490K387K7941j4346k9574
8045d5151j337L7924N2488k663K315o894k580L0770O716m6465L038K7224m2622
$$ plain form
8138 -17216 -4085 -7278 -37891 -43720 -44796 -46901 -4408 27854 22530 -18711 -49773 -35721 -1192
8125 -1192 15106 17231 6859 18024 747 -10714 1665 -31292 -40374 -13131 -7199 -15749 1190
8112 1190 -24288 -24019 4077 -9025 -8884 -14 10994 4235 21431 27279 15617 15963 -7054 -39631
8098 -39631 -7225 -5833 -14552 -3202 -3939 -15447 -24064 16975 1186 -1226 -8204 -9425 -11513 1363
8084 1363 1279 42058 62811 9764 -28396 -25583 -12612 -23293 1453 -2076 -5461 -47172 -54033
8071 -54033 -58689 -27954 -5873 -1400 -335 7197 -10249 -29187 -28095 7555 -33627 -26139 11727
8058 11727 19728 744 -9919 -7747 -13693 -61577 -68153 -35049 -31559 -29172 -1231 -15577 -45151
8045 -45151 -46488 -8564 43924 41261 43576 36682 34102 64872 71588 25123 28161 55385 12763
8032A2763j8603K8590L4045J2445J630K506l9969n4366k5967K3808M2661K652
8020B2195j6476j8764J0731j6507L718J7960J3325l1000j1501o385l0979j0914
8008g4597P8899K4152l979j8519m2067k0761M7218J1555J1489K3188R683k654
7996D3607n6833Q250N3472J5853l255k7504n9961N952o773q458j7870K6602m022
7983c0940k5195j8057K4038J1256J6176m7076o754j7739o43Q1261M5113m1021
7971i581L7808o564l7274k3862j8343K4914K9994N363J0842l9197K2820j4402
7959a7482M571M2097J2746J3669o89k9670j7518L4878k311J3049j5563j8227O601
7946B6151Q29p4j1078J4294j2299l0768k5907L8943K6471k6659l1487K633n300
$$ plain form
8032 12763 -5840 22750 56795 69240 70870 73376 33407 -20959 -46926 -23118 19543 22195
8020 22195 5719 -13045 -2314 -18821 -15103 2857 16182 -14818 -26319 -32704 -63683 -74597
8008 -74597 4302 28454 24475 5956 -36111 -56872 -9654 1901 13390 36578 46261 43607
7996 43607 -13226 -4976 48496 64349 61094 33590 -26371 -20419 -27192 -35650 -53520 -26918 -30940
7983 -30940 -56135 -74192 -50154 -38898 -22722 -69798 -76552 -94291 -94934 -13673 31440 -9581
7971 -9581 28227 21663 -15611 -39473 -57816 -32902 -2908 2455 13297 -25900 -3080 -17482
7959 -17482 -12911 29186 41932 55601 54912 25242 7724 42602 40291 53340 37777 19550 26151
7946 26151 26980 26906 15828 30122 17823 -12945 -38852 91 26562 -97 -31584 -28951 -34251
7933c4251N912J8237K1172K5848k9620K3908J2774l3813l1912j7051m961L8888
7921d869L0458k1807j5411o234L2390Q980m0449k4639J1597K7488l4397j7400
7909e4293O0354L7000o6288m6263j702k1754L7258N6955j7622J2108L2351q856
7897A9248m5393k1686k1396R471K5184P494J4522L8890K2422k6812m6479J4M5685
7884B1164R054Q947p9381P295L0663Q099l118j629M5818L5385o8472q0673q971
7871g5819P2423K615N745M3727k0593k8924l9066l3340K0783M4137K7748R227
7859B8663q906j2057J842j0509q652o022J3219k4420K7296J14j8999r161M9100
7846B1508m183l8227l688N98L0761L9954R6589p776r4536l6556j61Q32j7257l9969
$$ plain form
7933 -34251 -28339 -10102 11070 36918 7298 31206 43980 10167 -21745 -38796 -43757 -4869
7921 -4869 25589 3782 -11629 -17863 14527 23507 -16942 -41581 -29984 -2496 -36893 -54293
7909 -54293 6061 43061 -23227 -69490 -71192 -92946 -55688 1267 -16355 -4247 28104 19248
7897 19248 -26145 -47831 -69227 -59756 -34572 -27078 -12556 26334 48756 21944 -24535 -24521 21164
7884 21164 30218 39165 -40216 -32921 -2258 5841 2723 1094 46912 82297 13825 -66848 -75819
7871 -75819 -3396 -781 4964 48691 28098 -826 -39892 -73232 -52449 -8312 19436 28663
7859 28663 19757 7700 9542 -967 -9619 -15641 -2422 -26842 454 568 -18431 -27592 21508
7846 21508 17325 -20902 -24590 -23992 6769 46723 143312 135536 41000 4444 4283 5115 -12142 -52111
7832e2111r667K3802J6323J8553l7363J5314J097j2217J1808J378k6202M5252
7820d033L7325m7836m8810L9623L7108J9176m8225l3853P624N068r509P02J9728
7807b5912k564J9361M2541L2273p1144n0701J0532m1009K5175L5249L2547k4448
7795a8100J2880J0637j1085M229j2337q555n4065o003r688n140M9571L3759J0576
7782c321J0283K41j0665J4005O870n1973k8491K280K4418K5016K6801K9001j7215
7769B7250l6026k240n448q540K8474K2071j5740N4815J5899k2397K518j8693j6189
7756B5754K1706j9026n9072K929m462J6653M7564L3153l9473l3374k9138P53k053
7743c8086k0984K0443J1386k0416m572K1083J4196k3787k8900J3676J5301J8013
$$ plain form
7832 -52111 -61778 -37976 -21653 -3100 -40463 -25149 -24052 -36269 -24461 -23083 -49285 -4033
7820 -4033 33292 -14544 -63354 -23731 13377 32553 -15672 -49525 -41901 -36833 -46342 -45640 -25912
7807 -25912 -28476 -9115 33426 65699 -5445 -56146 -45614 -86623 -61448 -26199 6348 -18100
7795 -18100 -5220 5417 -5668 -1439 -13776 -22331 -76396 -82399 -92087 -97227 -47656 -13897 -3321
7782 -3321 6962 7203 -3462 10543 17413 -34560 -63051 -60771 -36353 -11337 15464 44465 27250
7769 27250 -8776 -11016 -16464 -25004 3470 25541 9801 64616 80515 58118 60636 41943 25754
7756 25754 47460 28434 -30638 -27709 -32171 -15518 32046 65199 25726 -7648 -36786 -36033 -38086
7743 -38086 -59070 -38627 -27241 -47657 -52229 -31146 -16950 -40737 -69637 -55961 -40660 -22647
7731b2647O5787J2300J8815k732k8153l4001L9786J3601o5554o1389M093K0375
7719c9719M4064L1948m2130p1286p448M9871L3862m0162L618K5242K738k1465
7707c0867j0793L3765M2360m5745l0367m9943j8446N5512O84j5214J0813K385
7695e5856L367K6483j1466j3792K7873L4262N5812l7610o6988K3697M488r117
7683a8847J1797n978l595l2710l1928K8413q509K7703L3030R883O290L5363J5814
7670F6726k8440o832J0502J7616n291j1487k3243L6968r844p099J936m4313J0511
7657G710N3543o833n4504r712k188L4949k7206l491M534J3525M396m1371J3708
7644a2940K2236L3208K7018k5149o3068J791L4369R060j2021R505N301q0013m1928
$$ plain form
7731 -22647 43140 55440 74255 71523 43370 9369 49155 62756 -2798 -64187 -60094 -39719
7719 -39719 4345 36293 -5837 -77123 -84571 -34700 -838 -41000 -37382 -12140 -9402 -30867
7707 -30867 -41660 -7895 34465 -11280 -41647 -91590 -110036 -54524 -53840 -69054 -58241 -55856
7695 -55856 -52489 -26006 -37472 -51264 -23391 10871 66683 29073 -37915 -14218 -9730 -18847
7683 -18847 -7050 -13028 -16623 -49333 -81261 -52848 -61357 -33654 -624 9259 15549 50912 66726
7670 66726 38286 31454 41956 59572 54281 42794 19551 56519 46675 39576 41512 -2801 7710
7657 7710 61253 54420 -84 -9796 -11984 22965 -4241 -7732 -3198 10327 14723 -26648 -12940
7644 -12940 9296 42504 69522 44373 -18695 -16904 17465 26525 14504 24009 29310 -50703 -92631
7631i2631r240p097l276J3576L5847N3638j5599j5823j0011l814L8260j1j2280
7618b8461J1665l5369k936N4334K1488k221k0703K777m328n2101o776J543M1720
7605a9368J282O604K1546J2784l2369K0847K159k9349m2560M3073M2740J3047
7593D0436l0852r273K3290n8533k4534K0182N4047p559r840o909J4370m0546q895
7580d4616J3955q175N1216K7142k0791j2603j5121L4073J3199j8979L8731l0291
7568B7740j0801J7068J2263Q158J37o7737o282K5256k2721M921K3692j286n7078
7555d6670k0701K8687O5549L1124j627j4384J4024q973J9517L5244K6468q603
7543A19655n7067j4696L716m6197O602k4463l6920k617j0830O0143M3789K8416
$$ plain form
7631 -92631 -101871 -108968 -112244 -98668 -62821 -9183 -24782 -40605 -50616 -54430 -16170 -16181 -28461
7618 -28461 -16796 -52165 -55101 -767 20721 18500 -2203 574 -3754 -55855 -62631 -61088 -19368
7605 -19368 -18086 -11482 10064 22848 -9521 11326 13485 -15864 -58424 -15351 27389 40436
7593 40436 9584 311 23601 -34932 -59466 -39284 14763 7204 -2636 -9545 4825 -35721 -44616
7580 -44616 -30661 -38836 12380 39522 18731 6128 -8993 25080 38279 19300 58031 27740
7568 27740 16939 34007 46270 54428 54565 -13172 -19454 5802 -16919 -11998 11694 10408 -46670
7555 -46670 -67371 -38684 26865 57989 56362 41978 56002 47029 66546 101790 128258 119655
7543 119655 62588 47892 51608 5411 12013 -12450 -49370 -51987 -62817 -2674 41115 69531
7531F9531j6949j7413j3458k1406l436l925k8172R693K386k1435M912K0780P197
7518a1695j4944O80J0888R511q938p453j5648k6060J1326m002L8098M2835l797
7505B0801n3984n6505O912K3536J0049L768l541L7892K0015n969K1890L5765j9354
7492D1275n8781k2280N425K1314K0050K2418K6532l567m2221j1236N748l5528
7480c0851m4082J3j6214k8627L854L6848L1282L7633l2818j5802J8306J4682J6456
7467i320l6540K9696L7093l0312j9169l9095Q344o308j6957N6924j6414l5702
7455g7760o659M4461L1399P790K2004K3591Q378l6355l094N111m3989j1166j1375
7442d7664j6758J8750J7330m7368K738M9735K0147j904k9241L1910K1305n6580
$$ plain form
7531 69531 52582 35169 21711 305 -3131 -7056 -35228 -25535 -23149 -44584 -39672 -18892 -11695
7518 -11695 -26639 -25959 -15071 -5560 -14498 -21951 -37599 -63659 -52333 -56335 -18237 24598 20801
7505 20801 -33183 -89688 -82776 -59240 -49191 -45423 -48964 -11072 8943 2974 24864 60629 41275
7492 41275 -17506 -39786 -34361 -13047 7003 29421 55953 52386 10165 -1071 4677 -30851
7480 -30851 -74933 -74920 -91134 -119761 -115907 -79059 -47777 -10144 -42962 -58764 -40458 -25776 -9320
7467 -9320 -45860 -16164 20929 -9383 -28552 -67647 -59303 -65611 -82568 -25644 -42058 -77760
7455 -77760 -84419 -39958 -8559 -769 21235 44826 53204 16849 13755 18866 -25123 -36289 -47664
7442 -47664 -64422 -45672 -28342 -75710 -72972 -23237 -3090 -4994 -34235 -2325 18980 -37600
7430c7600m9479R638j5361N362K7365k724n335L3185J7063j190J97M6759l03o3712
7416c6135k6605j4084q690M1998J7488m794L9189M3667j8923o3177j0291P803
7404c2554j2845k2684j3515J5575Q969M5252M4196M09q311Q307k036j1158o7043
7391d7438O05J9633j9443K0665J4389J5170O913J8901k4000p732j6735k5115M2949
7378a238j8426r527L6896l3035k3173k2579k655k8343K1264L7804K001l604N808
7365c8807l751L2945L1673P458m2000Q461J2518k8045j8147K9754l632j9290l2173
7352f3036m2840n397L6636R357M2590M0380m099k8275K987j5474j5129K2931J5463
7339c906p714P812J0556m71J5393K0879k7240l9583J365K8714K7484K0763k8912
$$ plain form
7430 -37600 -87079 -77441 -92802 -87440 -60075 -62799 -68134 -34949 -17886 -19076 -18879 27880 27577 -36135
7416 -36135 -62740 -76824 -85514 -43516 -26028 -30822 8367 52034 33111 -30066 -40357 -32554
7404 -32554 -45399 -68083 -81598 -66023 -57054 -11802 32394 32803 24492 32799 30763 19605 -47438
7391 -47438 -46833 -27200 -46643 -25978 -11589 3581 10494 29395 5395 -2337 -19072 -44187 -1238
7378 -1238 -19664 -29191 7705 -25330 -48503 -71082 -73737 -102080 -80816 -43012 -41011 -44615 -38807
7365 -38807 -42558 -9613 22060 29518 -12482 -4021 8497 -19548 -37695 -7941 -11573 -30863 -63036
7352 -63036 -105876 -111273 -74637 -65280 -22690 17690 13591 -14684 -11697 -27171 -42300 -19369 -3906
7339 -3906 -11620 -3808 6748 6277 21670 42549 15309 -24274 -22909 5805 33289 54052 25140
7326B5140l4206J1752j2830r075P411L2608L7372K2689j6886j7002n5661j4989
7314b3677K6229j2857L069k890J1855J1865k2660k1172j2193j687N011M862J7024
7301a7221k0592J882K3484O9052P643o6584k2710j1155J7832M9936K5162l9162
7289A7567l2224m8468p930P084J1219K4557M4155j1831n5155J7678j3972n1914
7277i9234K814M3351J4017m619j0099l1678L8858M1768m568o674J4195k4530J8569
7264g830k130J6487l854L647R011p923m8321j3279j1272L6890J8904k2058j3677
7251d5405m273Q2662R301m5540K9556j2878j1031K9360k6737k372P426P452L1851
7238D9372J3601n5681m0898J3143K2605j5871k3708q314M0498M0608l8262L1803
$$ plain form
7326 25140 -9066 2686 -10144 -19219 -11808 20800 58172 80861 63975 46973 -8688 -23677
7314 -23677 2552 -10305 -7236 -10126 1729 13594 -9066 -30238 -42431 -44118 -39107 -34245 -17221
7301 -17221 -37813 -35931 -12447 56605 64248 -2336 -25046 -36201 -18369 31567 56729 17567
7289 17567 -14657 -63125 -71055 -63971 -52752 -28195 15960 4129 -51026 -33348 -47320 -99234
7277 -99234 -96420 -53069 -39052 -43671 -53770 -85448 -46590 -4822 -9390 -16064 -1869 -26399 -7830
7264 -7830 -9960 6527 2673 6320 15331 7408 -40913 -54192 -65464 -28574 -9670 -31728 -45405
7251 -45405 -49678 32984 42285 -3255 26301 13423 2392 31752 5015 2643 10069 17521 49372
7238 49372 62973 7292 -33606 -20463 2142 -13729 -37437 -45751 -5253 35355 -2907 28896
7226B8896p000m704K839K1111N678K8335K7756m550k5678o554k7330j9097J198
7213B0900P274L049N7809j7540l9611M862m1407q188q241j3087k1689J20M483
7200e1266L7714N5219L6092k6979m6817j0552o732N381j838L6698M0239J7814
7188H4973k0674O150k0146k2194l2595Q427J6651p244o419j8823O650Q695M866
7175H317j762k9556K5519J5271J736L6114k7624o8473k5823J6245q32N086n896
7162e1678k3310L953l282K4327k350l064K5950L9386K3361p0719L0553J8156k0654
7149i371k3209L4518J8417l9831l1319k8386L9953N0613O326l0806r72R902k8706
7136c2871k8422Q233N80K9132Q285N400l90M688L596l1415m0534J4207K1098O011
$$ plain form
7226 28896 21896 17192 20031 41142 46820 75155 102911 98361 72683 66129 38799 19702 20900
7213 20900 28174 31223 89032 71492 31881 36743 -4664 -12852 -21093 -34180 -55869 -55749 -51266
7200 -51266 -13552 41667 77759 50780 3963 -6589 -13321 -7940 -9778 26920 67159 84973
7188 84973 64299 70449 50303 28109 -4486 3941 20592 13348 6929 -11894 -5244 3451 8317
7175 8317 6555 -23001 2518 17789 19525 55639 28015 -40458 -66281 -50036 -50868 -45782 -51678
7162 -51678 -74988 -71035 -74317 -49990 -52340 -55404 -29454 9932 33293 -37426 -6873 11283 -9371
7149 -9371 -32580 1938 20355 -19476 -50795 -79181 -39228 11385 17711 -13095 -14067 -4165 -32871
7136 -32871 -61293 -53060 -52480 -23348 -15063 -9663 -10053 -5365 -1769 -33184 -73718 -59511 -38413 -32402
7122c2402k9231n1536m739K0909K4658L7315J1084R821J7157j5477n2334k3037
7110h7812J5030N2065J9348k443j1469l7186p98J5537J3252j8517j0684J1627
7098d2050L9251M3166n4575k227L6072J7759j9634J36N29k4685J8155K1445N0172
7085H3514l0307o426k0426J555l773j5926r087n2327m7805K5746M4554L7855j6082
7072h935k6246q773K1316K7951M523J3559K697k2342j7791N311J1662O562o780
7059B714r113q91K8148l0549j9597j439J1823J5777Q067k7982k5049j1241J5951
7046d3381p743J7853M4961N435J1554n997L4494m04p163n647n6437n1625j4669
7033g8769k392J2011J8289J0656J6556J366k1071r934j2771j564N2226P736N121
$$ plain form
7122 -32402 -61633 -113169 -117908 -96999 -72341 -35026 -23942 -14121 3036 -12441 -64775 -87812
7110 -87812 -72782 -20717 -1369 -3812 -15281 -52467 -53265 -37728 -24476 -42993 -53677 -42050
7098 -42050 -2799 40367 -14208 -16435 19637 37396 17762 17898 18427 -6258 11897 33342 83514
7085 83514 53207 46781 26355 27910 24137 8211 -876 -53203 -101008 -75262 -30708 7147 -8935
7072 -8935 -35181 -43954 -22638 5313 9836 23395 26092 3750 -14041 -8730 2932 9494 2714
7059 2714 -6399 -7290 20858 -9691 -29288 -30727 -18904 -3127 4940 -23042 -48091 -59332 -43381
7046 -43381 -51124 -33271 11690 17125 28679 22682 57176 56772 49609 43962 -12475 -64100 -78769
7033 -78769 -81161 -69150 -50861 -40205 -23649 -22283 -43354 -53288 -66059 -67623 -15397 -7661 -2540
7020b540k0227m5385l525N3j3355k3865K3697O974n882P170M8539R533L4862J1105
7006B7154Q705j2550j9347j5311J0743M3472K474j6178k2190l6446K7218r358
6994a1614J581J3079n8225n1953L9673N98r379KP158K7397L2727J423L922K2164
6980A8553q781n7276K472L2067L2375k0486N6675R98j6150j7008M574J3540L7711
6967G9264L520l9926q217o783j8269M2739K2223r317L878k8905k9404k1326j1826
6954b2349M1939j309j5852M922J1753K1104P279l7746n5440m612l8147O3820J7363
6941g275J6954l0163l604K122M841M468P176j9117j2125l4753M47L0635L4343
6928f051K815K3775l223J4443Q983K0103K8079k9587m1599M4305L0533m4710n7405
$$ plain form
7020 -2540 -22767 -68152 -71677 -71624 -84979 -108844 -85147 -78173 -84055 -76885 -28346 -18813 16049 27154
7006 27154 35859 23309 3962 -11349 -606 42866 45340 29162 6972 -29474 -2256 -11614
6994 -11614 -10033 3046 -55179 -107132 -67459 -66861 -76240 -76238 -69080 -41683 -8956 -7533 -3611 18553
6980 18553 9772 -47504 -45032 -12965 19410 -1076 55599 56597 40447 23439 28013 41553 79264
6967 79264 82784 42858 34641 27858 9589 52328 74551 65234 69112 40207 10803 -10523 -22349
6954 -22349 19590 18281 2429 7351 19104 40208 47487 9741 -45699 -50311 -88458 -24638 -7275
6941 -7275 9679 -20484 -24088 -21966 -17125 -12657 -5481 -24598 -36723 -71476 -71029 -40394 -6051
6928 -6051 -3236 20539 17316 31759 40742 60845 88924 59337 17738 62043 92576 47866 -9539
6915i539k4753L8277q657O187L5992K936n4035k1154J6485j2243q384O783p754
6902c9859n282o550k5091j6635K4934L16J4681k6177r429m231M6541O457l3658
6889g3983N6712M5890q582j3043m061J016Q146k0188o313J2026l9547n712J2605
6876c5034L1134n334N833j6176j9570l5530k1052L843M6837j2249j6227j4419
6864h7944j197j8891q981K6879L0418j5858j2995J8512M3203L197q346j563l200
6851c6766K3237L2275l100j851j1540j4946O03j2161k7320j8501K6480L8487N4383
6838D9280j4323m8693l8312k8114J4219m261k740J1314N8321M971m850J6112k6360
6825a3436j8410j1992j7995j3513j5318Q591M5630J0967J2742N344l465j257m6845
$$ plain form
6915 -9539 -34292 3985 -4672 1515 37507 40443 -13592 -34746 -18261 -30504 -38888 -32105 -39859
6902 -39859 -45141 -51691 -76782 -93417 -68483 -68167 -53486 -79663 -89092 -93323 -46782 -40325 -73983
6889 -73983 -17271 28619 20037 6994 2933 3949 12095 -8093 -14406 -2380 -41927 -47639 -35034
6876 -35034 -3900 -9234 -3401 -19577 -39147 -74677 -95729 -91886 -45049 -57298 -73525 -87944
6864 -87944 -89141 -108032 -117013 -90134 -59716 -75574 -88569 -70057 -26854 -23657 -32003 -33566 -36766
6851 -36766 -13529 18746 15646 13795 2255 -12691 -12088 -24249 -51569 -70070 -43590 -5103 49280
6838 49280 34957 -13736 -52048 -80162 -65943 -70204 -72944 -61630 -3309 1662 -3188 12924 -13436
6825 -13436 -31846 -43838 -61833 -75346 -90664 -82073 -36443 -25476 -12734 -7390 -10855 -12112 -58957
6812e8957k9531j2064L3422L8951J569k7174J84K9472K4380L2635k6805l1447
6800b5365Q247K8023P231R465J3038O663n901m9060O5368R404l7337L166o884
6787B6058l674n154l9591k7172J090M4453J0924m4202j9060l182K712j2915k584
6774g2297K0812K374j1251J4008J944k2757M888M4672L1999k3863R486j1147K701
6761h431l3282k0868L9793K3590P750K067l1860m0652j6490J804N808R917l3960
6748i4814j9924K9146K7846K0731L6713j2798j9507N3986M2047k1716M509k6740
6736A9479l1318k1640J9157K9145j2672K5267l5917m4243j558J3662l6415J9806
6724e7247L8403J095n0042J2328M7493j3120q632N7942M7430M1438m0572m2898
$$ plain form
6812 -58957 -88488 -100552 -67130 -28179 -26610 -53784 -53600 -24128 252 32887 6082 -25365
6800 -25365 -17118 10905 18136 27601 40639 47302 41401 -7659 57709 67113 29776 32942 26058
6787 26058 22384 17230 -22361 -49533 -48443 -3990 6934 -37268 -56328 -59510 -56798 -69713 -72297
6774 -72297 -51485 -49111 -60362 -46354 -44410 -67167 -62279 -17607 14392 -9471 15 -11132 -8431
6761 -8431 -41713 -62581 -22788 802 8552 10619 -21241 -61893 -78383 -76579 -70771 -60854 -94814
6748 -94814 -114738 -85592 -57746 -37015 -302 -13100 -32607 21379 63426 41710 46219 19479
6736 19479 -11839 -33479 -14322 14823 2151 27418 -8499 -52742 -54300 -40638 -77053 -57247
6724 -57247 -18844 -17749 -67791 -55463 -7970 -21090 -29722 28220 75650 117088 76516 33618
6712C3618k2774j1237j1118J4017J5006k1087k9800j6247l9057R743K7408L0583
6700b0945K0778L998K6737k101n2119k7j3473J012k9578Q371j8940k631L4846
6687d4072J7824O125P0224k189l3308m4962J1891P440J055j7770K1065K9731q949
6674A4105j2115k3138k3528K925P101L6246K2314m291l4792j828m0422M099P48
6661e2576m0955R518P1479M4560o8500k0228J9598K4955K2809K9205J4069R732
6649F3666J5161l1572j6408o939l3872J8941N993j9987k0166j8879P37o416j4207
6636f3948J3827K1785k7465N260K6990J2202L7711p072j0544l6675l9758J3771
6624e3916O489n745r403p489K4418p995K0194N905q660L3667L8044J1456K617
$$ plain form
6712 33618 10844 -393 -11511 2506 17512 -3575 -33375 -49622 -88679 -78936 -51528 -20945
6700 -20945 -167 3831 30568 28467 -23652 -23679 -37152 -36140 -65718 -57347 -76287 -78918 -44072
6687 -44072 -26248 -20123 50101 47912 14604 -30358 -18467 -11027 -9972 -27742 -6677 23054 14105
6674 14105 1990 -21148 -44676 -41751 -34650 1596 23910 19619 -15173 -17001 -57423 -53324 -52576
6661 -52576 -93531 -84013 -12534 32026 -36474 -56702 -37104 -12149 10660 39865 53934 63666
6649 63666 78827 47255 30847 23908 -9964 8977 14970 -5017 -25183 -44062 -43325 -49741 -63948
6636 -63948 -50121 -28336 -55801 -50541 -23551 -11349 26362 19290 8746 -27929 -67687 -53916
6624 -53916 -47427 -53172 -62575 -70064 -45646 -53641 -33447 -27542 -36202 -2535 35509 46965 49582
6611D9582l5757r2751m64J5588M3399M0366n047o10l0205j5636L6985P71p85q280
6597b844j5122j150J928K2017m2329J5086L1571l8114j0320J9597P383J5621k8721
6584b5397j5756P398q064l3304K2156J9974J1059L6115L0538O512j2138j9975
6572A9118o448J8155l5241n0193j9369L2600L4113M907P28j8882l804j6404j5744
6559e6464j3951J0551P917K3778k5757j2213p534m5579M978N9441J4891p932R380
6546c8494K6445j8815M1494K1601k6891m4550L041J1855m761J557M1063K7416
6534D0961j5377j2250k0780l8505o7070Q593J19091N8331l5364j7100J4188J1902
6522D6620k5597j4650j0686K276j126Q595m588J2259J139k6514L3875M983m3187
$$ plain form
6611 49582 13825 -78926 -79390 -63802 -20403 19963 14916 14306 -15899 -31535 5450 6221 5436 -2844
6597 -2844 -17966 -19116 -17188 4829 -37500 -22414 9157 -28957 -39277 -19680 -12297 3324 -25397
6584 -25397 -41153 -33755 -41819 -75123 -52967 -32993 -21934 14181 44719 51231 39093 19118
6572 19118 12670 30825 -4416 -54609 -73978 -41378 -7265 -2358 -1630 -20512 -24316 -40720 -56464
6559 -56464 -70415 -59864 -51947 -28169 -53926 -66139 -73673 -119252 -114274 -54833 -39942 -47874 -38494
6546 -38494 -12049 -30864 10630 32231 5340 -39210 -36169 -24314 -29075 -27518 13545 40961
6534 40961 25584 13334 -7446 -45951 -113021 -104428 14663 72994 37630 20530 34718 46620
6522 46620 21023 6373 -4313 -2037 -3163 5432 844 13103 14242 -12272 21603 26586 -16601
6509a6601Q253Q360j2107r822M666M7552K6945j5993m6505j1954J2849j5450n7761
6496g7568M9356M4032l4539k5977J3867J9008K4294o208l355O991j6254j1344
6484a7697l6388K7769M0981M12l5169J5416K2751j2409K1708j2119l5707J0690
6472i762k8462O976j5299j9926J6600L8789J5589j1649l30k4761j6229J7480J4536
6459a6448J7433K445m6491q755K3290K3248j106j047m308j4667R204J7180o296
6446f318L8286K4685k3335L0156J5808o2582k1470J496j8237l7360N129M8943
6434d799J1452J4336N0079j620l0362q860o4328Q074M6119p481L108J2129m49
6421B7398m2840m2469j72k2651K7351P222M2781M0508N0879J9027l9147n1133
$$ plain form
6509 -16601 -8348 12 -12095 -21917 -17251 30301 57246 41253 -5252 -17206 -4357 -19807 -77568
6496 -77568 -28212 15820 -18719 -44696 -30829 -11821 12473 6265 2910 9901 -6353 -17697
6484 -17697 -54085 -26316 14665 15077 -20092 -4676 18075 5666 27374 15255 -20452 -9762
6472 -9762 -38224 -31248 -46547 -66473 -49873 -11084 4505 -7144 -7474 -32235 -48464 -30984 -16448
6459 -16448 985 3430 -43061 -51816 -28526 -5278 -6384 -7431 -11739 -26406 -17202 -22 -6318
6446 -6318 31968 56653 33318 63474 79282 16700 -4770 -3274 -21511 -58871 -53742 -4799
6434 -4799 6653 20989 71068 69448 39086 30226 -34102 -26028 20091 12610 15718 27847 27398
6421 27398 -15442 -57911 -58083 -80734 -53383 -46161 -3380 37128 88007 107034 67887 16754
6409A6754l8917K0252O802j6731p312P588O610j1795j5469Q448K7583M0480l8773
6396E520j2829K0049J9502J6336K1754j751o523j5959n1473m6494K2522o036m3106
6383g8488J1170K9273J2742k706O69j2504r329m6290O386N3782P6072K3186j3788
6370E0175K912m2985k3023L5848K7852m3482k0548p67J7500l2120j7156N1778
6358E984J9396J3531L953m4898l0927J5412M1219O1559k742o6623J014k082m5947
6345c1151J0316p721K7297M9701J8928J0991l4466k5887l2305l4273K9263j1758
6333c1065k4526L3301j8525k1317P2086L1855k1030k7097N727K2019j2269l6555
6321b7396r433O6851K0802l8924K0660N0406n8155o4534r239J8640p269K0268
$$ plain form
6409 16754 -22163 -1911 4891 -11840 -19152 -11564 -4954 -16749 -32218 -23770 3813 44293 5520
6396 5520 -7309 12740 32242 48578 70332 68581 62058 46099 -5374 -51868 -29346 -35382 -78488
6383 -78488 -67318 -38045 -25303 -28009 -27340 -39844 -49173 -95463 -89077 -35295 40777 63963 50175
6370 50175 53087 10102 -12921 22927 50779 7297 -13251 -14018 3482 -28638 -45794 5984
6358 5984 25380 38911 42864 -2034 -32961 -17549 23670 85229 82487 15864 16878 14796 -31151
6345 -31151 -20835 -28556 -1259 48442 67370 78361 43895 18008 -14297 -48570 -19307 -31065
6333 -31065 -55591 -22290 -40815 -62132 9954 41809 20779 -6318 -591 21428 9159 -27396
6321 -27396 -36829 30022 50824 11900 32560 82966 24811 -39723 -48962 -30322 -37591 -17323
6309a7323L4759j2554K2320p04J1525l325j7422r368L696K700q606k2184j9607
6296c6093k0572j8271K4023M4163L8451J7842l1161o4630O496l391L1022k4230
6284c6351n0680M4846J9595Q273J8209l751k146k3500M87M8469m282j6883n3903
6271e1617q342J1398J518J6356o008l3098k5768Q2848M0266n4876k9309j448m575
6258f2655p981J9902K2769l7408j9405N4764L6355L671j8266j8424k7324L907
6246e0095j3872j520M5975J568m791j6354n126K9157J5146K1451j2382l1166l716
6233b5725R288O034k563l9664J8839R711j7046j3026M6529L5709n3621j4510K3935
6220a6110K5356n0176K864J5306k5957j2929K284L041j3854K5382k754R533N705
$$ plain form
6309 -17323 17436 4882 27202 26498 38023 34698 17276 7908 11604 14304 5698 -16486 -36093
6296 -36093 -56665 -74936 -50913 -6750 31701 49543 18382 -46248 -39752 -43143 -12121 -36351
6284 -36351 -87031 -42185 -22590 -14317 3892 141 -2005 -25505 -25018 23451 19169 2286 -51617
6271 -51617 -59959 -48561 -47043 -30687 -36695 -69793 -95561 -12713 27553 -27323 -56632 -58080 -62655
6258 -62655 -70636 -50734 -27965 -65373 -84778 -30014 6341 10012 -8254 -26678 -54002 -50095
6246 -50095 -63967 -65487 -19512 -17944 -22735 -39089 -44215 -15058 88 21539 9157 -22009 -25725
6233 -25725 -16437 -10403 -12966 -52630 -33791 -24080 -41126 -54152 -7623 28086 -25535 -40045 -16110
6220 -16110 9246 -40930 -38066 -22760 -48717 -61646 -59362 -56321 -70175 -44793 -47547 -38014 -32309
6207c2309N484R152r113j9969k0554K1660N3038K1856j1636k4668k3042q305J4362
6194b4044j1507Q968n867J8356N3038K709m1277m5174J6325M3911Q532k2622O106
6181G454J0166J7981p668m2593l7348L319K2929K0631O462k9237k2065M1990L3984
6168B6005J094j7962M1522M9083N271n1234q483k0035n7732K594l3587Q736K8783
6155b5945j876K3206j7j5817l0906J0753J1889k1011O027L6518M0181j515j8146
6142A3341r727l3279r208M3863N041n827m455l3491k2880J4770M3981M2314n5751
6129a1308K747P665j9449M1071N7055j5607m9876k9269k570N660P57J9655L6771
6116D3302j0650q783k7482L2128O897K0447L5397J2823o4030j2252k9643k6621
$$ plain form
6207 -32309 -26825 -17673 -26786 -46755 -67309 -45649 7389 29245 17609 -7059 -30101 -38406 -24044
6194 -24044 -35551 -26583 -32450 -14094 38944 41653 376 -44798 -28473 15438 23970 1348 7454
6181 7454 17620 35601 27933 -14660 -52008 -48689 -25760 -5129 1333 -27904 -49969 -7979 26005
6168 26005 27099 9137 50659 99742 105013 53779 45296 25261 -32471 -29877 -63464 -54728 -25945
6155 -25945 -27821 -4615 -4632 -20449 -51355 -40602 -28713 -49724 -43697 -7179 33002 31487 13341
6142 13341 3614 -29665 -38873 4990 10031 4204 -251 -33742 -56622 -41852 2129 44443 -11308
6129 -11308 -8561 -896 -20345 20726 77781 62174 12298 -16971 -19541 -13881 -13124 6531 43302
6116 43302 32652 23869 -3613 28515 35412 55859 91256 104079 40049 27797 -1846 -28467
6104b8467J208p271j0503n110k5425j3111M5070Q461j5011J9791J6576j2355q343
6091c4490j8909o617j863L7460L631m5312M3367N0929J5270k2743J3394j7125
6079A6992j2928j8444j9435O6156N2301K5004j9002l5293m4234k2943k3428l3094
6067f8348P5210N5889j5238o9038k1000J1949L1879o357k2295J2460L1385J7109
6055C3605P761n8670m8445K5888N362n5475r723J7322M0550J2062k6639o948q186
6042g1536j6621q467Q998L1675N8232O0685m482r772q425p0017j1895K7526N9209
6029D5110J0555l9353k2846J9966l1511l0606k355j1749j4734J6057J8419l814
6017d6861j964J6761K1257o665J8572N84J4654k8890R91K8234k1235n3664R808
$$ plain form
6104 -28467 -27259 -34530 -45033 -50143 -75568 -88679 -43609 -35148 -50159 -30368 -13792 -26147 -34490
6091 -34490 -53399 -60016 -61879 -24419 -20788 -66100 -22733 28196 43466 20723 34117 16992
6079 16992 4064 -14380 -33815 32341 84642 109646 90644 55351 11117 -11826 -35254 -68348
6067 -68348 6862 62751 47513 -21525 -42525 -30576 1303 -5054 -27349 -14889 16496 33605
6055 33605 41366 -17304 -65749 -39861 -34499 -89974 -99697 -82375 -41825 -29763 -56402 -63350 -71536
6042 -71536 -88157 -96624 -87626 -55951 2281 62966 58484 48712 40287 -29730 -41625 -14099 45110
6029 45110 55665 16312 -6534 13432 -18079 -48685 -51040 -62789 -77523 -61466 -43047 -46861
6017 -46861 -48825 -32064 -10807 -17472 1100 1684 16338 -12552 -11561 16673 -4562 -58226 -48418
6004d8418P7698O210q131k0202K9765n367r125N87p99l1111K6664J4787j9867
5991A2691n7673n2025L1672l21J0504K8083o059%N734j6586k7891M0893J7674
5978a3304j1367L7235O994m3568k0719o2601k3894K4006J209j9114L2504M0747
5966e1872K6733M1735N094k0802J0947j8923r410J1072K0535k9011j6751J5888
5954a4765J7895J9677j9052k307r338k487K4679m9659j2680K2583L557j2934J3258
5941b1573j2264J2705L1277l245O337k4356J860p903K315K071p11L969k238k4589
5927c6345j6153n606K5654M013N834M754L8026O93n334j1429k1733J2613r490
5914a4503j9370J4678k8950k4124N9162P326j2849k1833k401l1479J4760K9244
$$ plain form
6004 -48418 29280 35490 27359 7157 36922 31555 22430 23017 22218 -8893 17771 32558 12691
5991 12691 -44982 -97007 -65335 -65656 -55152 -27069 -33128 -33128 -27394 -43980 -71871 -30978 -13304
5978 -13304 -24671 12564 19558 -24010 -44729 -107330 -131224 -107218 -106009 -125123 -92619 -51872
5966 -51872 -25139 16596 21690 888 11835 -7088 -16498 -5426 15109 -13902 -30653 -14765
5954 -14765 3130 22807 3755 1448 -7890 -10377 14302 -35357 -48037 -25454 -21897 -34831 -21573
5941 -21573 -33837 -21132 10145 6900 13237 -11119 -9259 -17162 -14847 -12776 -13487 -9518 -11756 -36345
5927 -36345 -52498 -58104 -32450 -28437 -22603 -17849 20177 20870 15536 4107 -17626 -5013 -14503
5914 -14503 -33873 -19195 -48145 -72269 -13107 -5781 -18630 -40463 -42864 -74343 -59583 -30339
5902c0339J0385m4002j4972N1211N1708r365M5786K0125J4402k49j3727m1201
5890C9762j4354o87o366j7765q48M0627K5259k6526K7165l8857o9635k3607J1750
5877e4082K1220M1751K2773L5636P350q9537k5093k0941j2605J9524p872L5118
5865b6758K8420l0983Q402J2107m7953l351J7214j4023k158Q569M4645J4605j7017
5852h281j6098Q491K2632o2840J5061M8547k8984j6115L1644J2341J7809k7111
5840b904l1268J9667r295j3563Q54N7143L4829N779n0569o2580l3078K4689l289
5827f3585j2340N3365L1519j6766N203J6570l8173K6920L3940M2096l029m9932
5815B5788m0487O505l769j4487R595K8805N0747l2419o5647K5898N7965q025m93
$$ plain form
5902 -30339 -19954 -63956 -78928 -27717 23991 14626 60412 80537 94939 94690 80963 39762
5890 39762 25408 24721 18355 590 -258 40369 65628 39102 66267 27410 -42225 -65832 -54082
5877 -54082 -32862 8889 31662 67298 74648 -14889 -39982 -60923 -73528 -54004 -61876 -26758
5865 -26758 1662 -29321 -20919 -8812 -56765 -60116 -42902 -56925 -59083 -50514 -5869 8736 -8281
5852 -8281 -24379 -15888 6744 -56096 -41035 7512 -21472 -37587 -5943 6398 24207 -2904
5840 -2904 -34172 -14505 -23800 -37363 -36509 20634 55463 61242 10673 -51907 -84985 -60296 -63585
5827 -63585 -75925 -22560 8959 -7807 -2604 13966 -24207 2713 36653 78749 75720 25788
5815 25788 -14699 -8194 -11963 -26450 -16855 11950 62697 30278 -35369 -9471 48494 40469 39976
5802C9976n082n2817k5839N9965P163r396R837j6002J8112K1007k2414j41l7546
5789a3177l0569M7602K761j0104K4382K3224Q460J8027j5208l2317j71P000j392
5776B8518j8823j3636J7094K151k1805k69r441q79K2318M7669M442m9256n2192
5763d4109j4116j1230K5919J9586j0410M1905k594J3553q177m7010J1673P674
5751a7336M588L187M299Q184p710J1149K1607k111k4432j2703L8908K8057j2412
5738D3275l0325k2716J4231l4705N346L335K9372J7894j1067j5116l2505j3000
5726d5981L1868j1288j8314n275K4171M8633K3096m4044n8680l0726L7032M7427
5714b081j4616m986K7335k051N47q033k4162m5889j8952k9798J4149K2088J7289
$$ plain form
5802 39976 34894 -17923 -43762 16203 23366 13970 23807 7805 25917 46924 24510 24369 -13177
5789 -13177 -43746 3856 6617 -3487 20895 44119 52579 70606 55398 23081 22910 29910 28518
5776 28518 9695 -3941 13153 15304 -6501 -6770 -16211 -17090 5228 52897 57339 8083 -44109
5763 -44109 -58225 -69455 -43536 -23950 -34360 7545 4951 18504 10327 -36683 -25010 -17336
5751 -17336 -12748 -9561 -5262 2922 -4788 6361 27968 25857 1425 -11278 27630 55687 43275
5738 43275 12950 -9766 4465 -30240 -24894 -21559 7813 25707 14640 -476 -32981 -45981
5726 -45981 -14113 -25401 -43715 -48990 -24819 23814 46910 2866 -55814 -86540 -49508 -2081
5714 -2081 -16697 -21683 5652 3601 4148 -3885 -28047 -73936 -92888 -122686 -108537 -86449 -69160
5701f9160N2948M701J3543j5488l4L4322n1849j143K0865L147q857n295l9692
5688f1992L925M9617J8702p155m1724j4015m746j873P2774J8142m45m6249j76
5675a5215j4727l1819l4573M5760N3958K4595l6620j2285L933K0389k9051p04
5663b6359k8261K1550p87M506L0900r12l0051J4090m787j5904L2223L010n311
5650f093J9933L4445k145r306K3211j5187l310k5219k1289q346k57k6969Q356
5637c2176K8655q568o5976j9025K2083k260j290k132J8511O7849J1169K4128k4469
5624A6499j9740l2528J2668K5814L145m8269j536L2717K7161J0272j3164K0462
5612C3501N235K469k2661k6590j3571K0157K8390r181J2606M372K655J3791k5287
$$ plain form
5701 -69160 -16212 -11511 2032 -13456 -13490 20832 -31017 -32160 -11295 -8148 -17005 -22300 -61992
5688 -61992 -58067 -8450 10252 3097 -38627 -52642 -57388 -59261 13513 31655 31210 -15039 -15215
5675 -15215 -29942 -61761 -96334 -50574 3384 27979 -8641 -20926 -16993 3396 -25655 -26359
5663 -26359 -54620 -33070 -33857 -29351 1549 637 -29414 -15324 -20111 -36015 -3792 -782 -6093
5650 -6093 13840 48285 46140 36834 60045 44858 41548 16329 -4960 -13306 -13563 -40532 -32176
5637 -32176 -3521 -12089 -78065 -97090 -75007 -77267 -78557 -80689 -62178 5671 16840 40968 16499
5624 16499 -3241 -35769 -23101 2713 5858 -42411 -43947 -11230 15931 26203 13039 33501
5612 33501 38736 41205 18544 -8046 -21617 -1460 26930 17749 30355 34727 37382 51173 25886
5599B5886j7970k2877q509J4938L9792J4243l2035r392L3908J6599J3192j799
5587F5976J2150m0483n0240j1571L851J2032j3865K626K0376K1672R436J3593
5575D5553l2892j2548p467l3230R357N5747k1752l0300J9741l0557m5519q738
5563i2605K9367K7779K3026L7679m4355k6052K4664l486j4888K7082J4150m0736
5551c8375j1934j5012j003J8263M446J8548N4008K6531m3029j0062k8414R270
5539a6763K2122Q446k1977k3603K1828L5337M572j1727n758l9035L1915J7318
5527B2675M9650l9965k6121j5907K6755L3891M8864L709l0969k4148l6405k8421
5515a6392J1573n457k3011l9472o196K8292M3489l2425J1009L9479J7516J609
$$ plain form
5599 25886 7916 -14961 -23470 -8532 31260 45503 13468 4076 37984 54583 67775 65976
5587 65976 78126 37643 -12597 -24168 -20317 -8285 -22150 -19524 852 22524 31960 45553
5575 45553 12661 113 -7354 -40584 -31227 24520 2768 -27532 -7791 -38348 -83867 -92605
5563 -92605 -63238 -35459 -12433 25246 -19109 -45161 -20497 -23983 -38871 -11789 2361 -38375
5551 -38375 -50309 -65321 -66324 -48061 -43615 -25067 28941 55472 12443 2381 -26033 -16763
5539 -16763 5359 13805 -8172 -31775 -9947 25390 29962 18235 12477 -26558 5357 22675
5527 22675 72325 32360 6239 -9668 17087 50978 99842 103551 72582 48434 12029 -16392
5515 -16392 -4819 -10276 -33287 -72759 -78955 -50663 -7174 -39599 -28590 10889 28405 30014
5503C0014j1619j8895m072L6711J3935m1203n4747K6429K5841J4677j0461k215
5491D395K351m442M1030L8003l877k4328k3315R440m0242l4563n809j7149K9123
5478b9383K9892M7473l0709J3679K0517o1343l8887J1443R761O083L666O919J3017
5465B128n938j2695L043j597M377n137J307L1289j8717Q004M1905J6328l9435
5452B4862m180P210R40Q723m726k6052j8107L8312J1495n4539k3188M0621M517
5439E888J6032J5129P106r708j9734k7470l9707j5976Q610M8146L053R230j6459
5426a5860K5611K6683l6118k8359J4000L6667j017K8060N742R96j4749j1180J4562
5413D5038m6177o0934l9917n665N0526L4150L5618j5622o3670K3697J4829m2403
$$ plain form
5503 30014 18395 -500 -4572 32139 46074 4871 -49876 -23447 2394 17071 6610 4395
5491 4395 6746 2304 43334 81337 77460 53132 29817 39257 -985 -35548 -41357 -58506 -29383
5478 -29383 509 47982 17273 30952 51469 -9874 -48761 -37318 -27557 -21474 -17808 -10889 2128
5465 2128 -3810 -16505 -13462 -15059 -10682 -15819 -14512 16777 -1940 6064 47969 64297 24862
5452 24862 20682 27892 28832 37555 32829 6777 -11330 26982 38477 -16062 -39250 1371 5888
5439 5888 21920 37049 44155 34447 14713 -12757 -52464 -68440 -59830 -11684 -8631 599 -15860
5426 -15860 9751 36434 316 -28043 -14043 22624 21607 49667 55409 56405 41656 30476 45038
5413 45038 -1139 -62073 -101990 -107655 -57129 -22979 12639 -2983 -66653 -42956 -28127 -70530
5401g0530M166K3700J628O6137J3959n320P023k4942l9259N5589L9359n1338m2473
5388b2301k0351k0553j5197k8372J8282M1800l356M4991k1120l5664N2926J5050
5376F135k9345J5079N332m5399K1472N9567J553K5215k6157O4k7369j3465N84
5363f734L1536K4701m44r414k4296k0962Q766M2926K1324o0784m6392N183l5999
5350g0589l0858N6627N1165L7857M1192J9229j7957n0183j51O020l5830K3852
5338C0374p498K759J2353P864q023J2531J1237l8415p9135J0348P0531k1162k6532
5325b2768J3179n18l5625J4283L6101K0853J6425j5583L2084j4388J8503k4051
5313C8495j5934O78j1680l4518n7351k2651L0502L6301J3278M5592K5658j3482
$$ plain form
5401 -70530 -66364 -42664 -41036 25101 39060 33740 40763 15821 -23438 32151 71510 20172 -22301
5388 -22301 -42652 -63205 -78402 -106774 -88492 -46692 -50048 -5057 -26177 -61841 -8915 6135
5376 6135 -23210 -8131 -2799 -48198 -26726 32841 34394 59609 33452 33516 6147 -7318 -6734
5363 -6734 24802 49503 49059 39645 15349 -5613 3153 46079 67403 6619 -39773 -34590 -70589
5350 -70589 -101447 -44820 6345 44202 85394 104623 86666 36483 36332 42352 6522 30374
5338 30374 22876 25635 37988 45852 37829 50360 61597 23182 -55953 -45605 24926 3764 -22768
5325 -22768 -9589 -10107 -45732 -31449 4652 25505 41930 26347 58431 44043 62546 38495
5313 38495 22561 23239 11559 -22959 -80310 -102961 -72459 -36158 -22880 22712 48370 34888
5301C4888n9232O2304K1871p3296j8639J7346k6954M104k1435k608J7778J9189
5289b4684J5753m6766K819L8404Q406j0555J8195O184m3208l4355K0163J4818
5277c4826O2298J6344K0546j182l783k2468n1435j140P204N2471M9458k0961n0170
5264B2356m3552J2966K6671L9522j6772J548k1168q4846o0074k7154L8539O3192
5252d8772L0984Q271L1588l1366l8993K4577L3756j7372L1040j7630n8609j9585
5240g2111K1527M3958J8556M397K3885j6151j4031J3082J5690J6360L647m3837
5228A4972l7667K5219J9923L7114K9659n375k4593l5340k0191M016J1587j2530
5216F794l8582n391L3137m037m9936J431p459k4114K3847K3711O013O92J2222
$$ plain form
5301 34888 -24344 37960 59831 -13465 -32104 -14758 -41712 -37608 -59043 -61651 -43873 -24684
5289 -24684 -8931 -55697 -52878 -14474 -6068 -16623 1572 7756 -35452 -69807 -49644 -34826
5277 -34826 27472 43816 64362 63180 59397 36929 -14506 -15646 -8442 44029 93487 72526 22356
5264 22356 -21196 -8230 18441 57963 41191 42739 21571 -63275 -123349 -150503 -111964 -48772
5252 -48772 -17788 -9517 22071 -9295 -48288 -23711 10045 -7327 23713 6083 -52526 -72111
5240 -72111 -50584 -6626 11930 16327 40212 24061 10030 23112 38802 55162 58809 14972
5228 14972 -22695 2524 22447 59561 89220 83845 59252 23912 3721 7737 19324 6794
5216 6794 -31788 -37179 -4042 -8079 -58015 -56584 -64043 -88157 -64310 -40599 -34586 -33894 -21672
5203b1672J5087p956M228j0844j6420N444k9792j0642L4980P19J9809R326K1164
5190A3431q884J4695k3380j4174M4657O658k4980j0129J3339k146M073k3332J1157
5177I85l696k5444l2L9967M3933Q080k6828l3418L81k385l2431j1908L1545j933
5163a3184N058k8528k9137j6718N4911J6164j6407l156n432L1713K883M2981K788
5150D3936k2598J161m3554m6027N765L5246K526Q160J3300L878j4733j5224j3715
5137d1879L9279J7253N424Q951j0281J1728l936j0604k8085j9619q087j0945n1671
5124a02472o258J2629l300J4643M3216O4903N471l2862O870J3809k3542J6350
5112I457J926J0910L2084j3065o496M3709M5354j7876k6661l507j2199j6327m5000
$$ plain form
5203 -21672 -6585 -14541 -10313 -21157 -37577 -32133 -61925 -72567 -37587 -36868 -17059 -7733 13431
5190 13431 4547 19242 -4138 -18312 26345 33003 8023 -2106 11233 9087 13160 -10172 985
5177 985 -2711 -28155 -28187 11780 55713 63793 36965 3547 3928 1543 -30888 -42796 -11251 -13184
5163 -13184 -8126 -36654 -65791 -82509 -27598 -11434 -27841 -30997 -36429 -4716 -1833 41148 43936
5150 43936 21338 22499 -21055 -67082 -61317 -26071 -23545 -15385 -2085 1793 -12940 -28164 -41879
5137 -41879 -2600 14653 20077 29028 18747 30475 26539 15935 -12150 -31769 -39856 -50801 -102472
5124 -102472 -108730 -96101 -99401 -84758 -41542 23361 28832 -4030 2840 16649 -6893 9457
5112 9457 11383 22293 54377 41312 34816 78525 123879 106003 79342 75835 63636 47309 2309
5099B309n699O257N476L0126M2297j5571k7011n4282j3747j8436J9582O4703n8779
5086b2775o6614m0214J7126K1338p722M089M7519L0566K0767L4602j4522n6024
5074c1864N092N044L1474K9699J8824k9736k4941j3086m9137l827L238L4533K0058
5061d629J5592l5326k8161k7577M0243k1439K7963P2242L2489l3524p769R879
5049C9983j6415j8108K0016J8927l3094l8169k704J9671L954l3124j1588L3917
5037a6734J3166j0138j1382K0381k4315k4019k7680m185N1369O3744N260o587
5025B8880j8156q261k9596j6453L6024L7210J0504J218Q165j7494M157N227n4277
5012a2852j9902k4995K8235J6435O504m209l1353k8910L9140M9500k3742m3243
$$ plain form
5099 2309 -3390 2867 8343 38469 80766 65195 38184 -16098 -29845 -48281 -28699 36004 -22775
5086 -22775 -89389 -129603 -112477 -91139 -98861 -94772 -47253 -16687 4080 38682 24160 -31864
5074 -31864 -26772 -21728 9746 39445 58269 28533 3592 -9494 -58631 -62458 -59220 -24687 -4629
5061 -4629 10963 -24363 -52524 -80101 -39858 -61297 -33334 38908 71397 37873 30104 39983
5049 39983 23568 5460 25476 44403 11309 -26860 -29564 -9893 -5939 -39063 -50651 -16734
5037 -16734 -3568 -13706 -25088 -4707 -29022 -53041 -80721 -84906 -33537 30207 35467 28880
5025 28880 10724 2463 -27133 -43586 -7562 29648 40152 41370 49535 32041 36198 41425 -12852
5012 -12852 -32754 -57749 -29514 -13079 -6575 -10784 -42137 -71047 -31907 17593 -6149 -49392
5000d9392j449L5214K77K2308k8298K3834L0206L3534J0695p5037l2153N0594
4988B0333K2313J8981k3702m2499j601J3957M7322J1393q294j6673k2704l0034
4976a1208n6553m7502l3231K8301O7261J2547k6334P918M5792j2084j2003J0922
4964b6174L491L684k8148k2108j848L0756O0140p842K8141J2058J0680l7364K0110
4951D5576m8617l9831r486k3451J4326K2193J9394L1009N6970k2157m2530k4150
4939b0754N1053K4307k1149n048J8764r595n2775k8198Q644M4973j2278l312K2523
4926A7155J6554J6627o1426n5597n279m228N918L0861l089J4620M882j7385j870
4913d2257j8553k5105j6801L4050L1073K0252m717j7319M1816K7493j8817l357
$$ plain form
5000 -49392 -50841 -15627 -15350 6958 -21340 2494 32700 66234 76929 1892 -30261 20333
4988 20333 42646 61627 37925 -4574 -6175 7782 55104 66497 58203 41530 18826 -11208
4976 -11208 -67761 -115263 -148494 -120193 -52932 -40385 -66719 -58801 -13009 -25093 -37096 -26174
4964 -26174 -22683 -18999 -47147 -69255 -71103 -40347 19793 11951 40092 52150 62830 25466 45576
4951 45576 -3041 -42872 -52358 -75809 -61483 -39290 -19896 11113 68083 45926 3396 -20754
4939 -20754 30299 54606 33457 28409 47173 37578 -15197 -43395 -34751 10222 -2056 -5368 17155
4926 17155 33709 50336 -11090 -66687 -71966 -76194 -70276 -39415 -42504 -27884 -23002 -40387 -42257
4913 -42257 -60810 -85915 -102716 -68666 -37593 -17341 -22058 -39377 2439 29932 11115 7758
4901G758j3161j6869k9587Q593L7905K2033l8359j7890L1322Q74J0484K6170k8386
4888H87j6432k0110P74j3359N679Q4589J6470j7758M918q062q333M1732k6759
4875D4236j5671k9848k2814P524K0174O4747M9897j927m1042n4490k4912m827
4863h953J3937n1763k4752M3447l9352o1402L3933L4425l6407J130O6412L3736
4851D391o212m7921j6912L8447l527j0169J0926q990j0619M7942J9440m5512l1990
4838f0706J4864K9263J8674r541q184j1953n904k5009J1101N5059L9643J9852
4826F7159L7096k5148k9675Q081k4664m3908n7754K3144N4311J5310j5042r9956
4814i1046J7205N4491J3140Q892j8187k1311j00L2465K2540J8296O127J4425J0881
$$ plain form
4901 7758 -5403 -22272 -51859 -43266 -5361 16672 -21687 -39577 -8255 -7381 3103 29273 887
4888 887 -15545 -35655 -34881 -48240 -42561 42028 58498 40740 45658 37596 29263 70995 44236
4875 44236 28565 -1283 -24097 -16573 3601 68348 118245 116318 75276 20786 -4126 -8953
4863 -8953 4984 -46779 -71531 -28084 -67436 -128838 -94905 -60480 -96887 -95757 -29345 4391
4851 4391 -1821 -49742 -66654 -28207 -31734 -41903 -30977 -39967 -50586 -2644 16796 -28716 -60706
4838 -60706 -45842 -16579 2095 -7446 -15630 -27583 -33487 -58496 -47395 7664 47307 67159
4826 67159 104255 79107 49432 57513 32849 -11059 -68813 -45669 8642 23952 8910 -91046
4814 -91046 -73841 -19350 -6210 2682 -15505 -36816 -36916 -4451 18089 36385 42512 56937 67818
4801F7818p083k7076n3143K4234R026K140L0304O174L266J2161k5050k2840j3451
4788F480j9910N5091J2562j9081l2814l3027R965M1696K6429L218N040l4108j8407
4775C134j3280k1525N5451K4817j8676K2541o226n508n371j009k6233K107P847
4762A8069J4618k9477n6867j3559L3800j7444J2335L6989J9904j0514M474j5915
4750c587j7172o226k0650K0443J7125J4416J0690l3132j7941K38R407N8514K2765
4737E4890j8753J2436j8439m0320l304M8555J670j4365n6902q588J1941J5063
4725a6116K4289J2936L9072l502l5188J0650k2954j8092k2536j9824P218K4689
4713a9358J2430J8563J8160j9977L5516J081m5079K551l5885j512j1667j3282
$$ plain form
4801 67818 60735 33659 -19484 4750 13776 15916 46220 52394 55660 67821 42771 19931 6480
4788 6480 -13430 41661 54223 35142 2328 -30699 -20734 20962 47391 50609 55649 21541 3134
4775 3134 -10146 -31671 23780 48597 29921 52462 46236 40728 35357 34348 8115 10222 18069
4762 18069 32687 3210 -53657 -67216 -33416 -50860 -38525 -1536 18368 7854 12328 -3587
4750 -3587 -20759 -26985 -47635 -27192 -10067 4349 15039 -18093 -36034 -35796 -26389 32125 54890
4737 54890 36137 48573 30134 -10186 -13490 35065 36735 22370 -34532 -43120 -31179 -16116
4725 -16116 8173 21109 60181 56679 21491 32141 9187 -8905 -31441 -51265 -44047 -19358
4713 -19358 -6928 11635 29795 9818 45334 46415 1336 3887 -31998 -33510 -45177 -58459
4701e8459l6365L6248K2167k3672J636L1044Q764q697L148j9137j1883J7507k7103
4688f4802j8025J7747J78q919L080J1988J9154n236N686N6411j6232J7787P016
4675B5833k7455k0063K0037K9085L824j649j0968J2673J8808j1961k6980l0300
4663a9116L5829M0866k3733n1037k462O336O956R610M6813K9042m866n1064k3774
4650f00k9564j1226p99k256l4755m2672n382P324K5045M6637K7020Q210J8217
4637E199J0326l8989k3558J1077K3096k2921O27J7167J7022K7571l4344n6859
4625f4586O109L4615j7721j7334n722k4725k6529N068J9686J8607J7785q52M7422
4612h177Q155m3359j3756J7221K3993L8635j338p586j3166j7377l570P286K8480
$$ plain form
4701 -58459 -94824 -58576 -36409 -60081 -58445 -27401 -18637 -27334 -24186 -43323 -55206 -37699 -64802
4688 -64802 -82827 -65080 -64902 -73821 -70741 -58753 -39599 -44835 -39149 17262 1030 18817 25833
4675 25833 -1622 -21685 -1648 27437 31261 29612 18644 31317 50125 38164 11184 -19116
4663 -19116 16713 57579 33846 -17191 -19653 -13317 -6361 3249 50062 79104 74238 23174 -600
4650 -600 -30164 -41390 -42189 -44445 -79200 -121872 -127254 -119930 -94885 -48248 -21228 -13018 5199
4637 5199 15525 -23464 -47022 -35945 -12849 -35770 -35143 -17976 -954 26617 -7727 -64586
4625 -64586 -58477 -23862 -41583 -58917 -64639 -89364 -115893 -110825 -91139 -72532 -54747 -55599 -8177
4612 -8177 -22 -43381 -57137 -39916 -15923 22712 21374 13788 622 -16755 -20325 -13039 15441
4599A5441o953L68j7364L9968Q874l0433J449J4101l58n0655K468m2410M2782
4586b2722R529j9463j790j7280n540K1457K3504K7161m6505m213K7891J2563l4563
4573b9971J683j0955l7647L2258K0569J0754l4122O354M4726P973P112K7764j3982
4560C2516m3280J6703m2667j9J6748L5790n4119k1230o16j7721j3612K4585K1099
4547d5823l006m083k0773N607L4178K286K4006n827L0369K074J8535J9919j2189
4534D5273o3168k5882L1812N1870K4604N942k2072l9604k4688J2019K1351J7860
4522C5317r453p890l4066j0201n6858J3605N6291K4946K4860K120l3163l9894
4510c4386k1344K2580K4944J5285j3741J1752j1512J6446J9150j2424M794j6291
$$ plain form
4599 15441 8488 8856 -8508 31460 40334 9901 11350 25451 25093 -25562 -23094 -65504 -22722
4586 -22722 -13193 -32656 -34446 -51726 -57266 -35809 -12305 14856 -31649 -35862 -7971 4592 -29971
4573 -29971 -28288 -39243 -76890 -44632 -24063 -13309 -47431 -41077 3649 11622 18734 46498 32516
4560 32516 -10764 5939 -36728 -36747 -19999 15791 -38328 -59558 -60174 -77895 -91507 -66922 -45823
4547 -45823 -48829 -52912 -73685 -68078 -33900 -31614 -7608 -13435 16934 19008 37543 57462 45273
4534 45273 -17895 -43777 -11965 39905 64509 70451 48379 8775 -15913 -3894 17457 35317
4522 35317 25864 17974 -16092 -26293 -83151 -69546 -13255 11691 36551 38671 5508 -34386
4510 -34386 -55730 -33150 -8206 7079 -6662 5090 -6422 10024 29174 16750 21544 5253
4498E253k547J3130J9353L0824J7767m8076j5020j7468K7941K1743Q333l4713
4486B6520n3165j6593J8894K3621M4093j599K338l497J418j5124m1458L129J7514
4473F091J2206J9700k2342o339m6233m8432n679K6248Q92K956L6619K7734K989
4460F410k2681k6885J3186L581l682j8286k7442k937J6832J4829O4793l0644p2794
4447h5720L2439K6113M4742J571m3148j3450k5625k2047L9442O081j8371K1365
4435c6608L0569K1857m464K2804o845N950q41j8250J2245M4213N735j1719m1323
$$ plain form
4498 5253 2706 15836 35189 66013 83780 35704 20684 3216 31157 52900 61233 26520
4486 26520 -26645 -43238 -24344 -723 43370 41771 44109 40612 42030 26906 -14552 -11423 6091
4473 6091 18297 37997 15655 9316 -36917 -85349 -91028 -64780 -63888 -60932 -24313 3421 6410
4460 6410 -16271 -43156 -29970 -26389 -30071 -48357 -75799 -78736 -61904 -47075 17718 -12926 -85720
4447 -85720 -53281 -27168 17574 19145 -24003 -37453 -63078 -85125 -45683 -39602 -57973 -36608
4435 -36608 -6039 15818 11354 34158 27313 33263 32422 14172 26417 70630 76365 64646 23323
$$ [...]
##END NTUPLES=NMR SPECTRUM
##END=
