##TITLE=Analysis number 317430
Compound Code cc 26713
Book Reference 449/78
Project Code qc-cat
Chemist Name davee
##JCAMPDX= 6.0         $$ Bruker NMR JCAMP-DX V2.0
##DATA TYPE= NMR SPECTRUM
##DATA CLASS= NTUPLES
##ORIGIN= Bruker BioSpin GmbH
##OWNER= nmr
$$ XWIN-NMR		Version 3.5
$$ Mon Feb 20 14:57:03 2006 GMT Standard Time (UT+0h)  MAYBRIDGE\nmr@NMR_250MHZ
##.OBSERVE FREQUENCY= 250.131544655141
##.OBSERVE NUCLEUS= ^1H
##.ACQUISITION MODE= SIMULTANEOUS (DQD)
##.ACQUISITION SCHEME= undefined
##.AVERAGES= 16
##.DIGITISER RES= 18
##SPECTROMETER/DATA SYSTEM= dpx250
##.PULSE SEQUENCE= zg30
##.SOLVENT NAME= CDCl3
##.SHIFT REFERENCE= (INTERNAL, CDCl3, 0, 16.4659)
##AUDIT TRAIL= $$ (NUMBER, WHEN, WHO, WHERE, WHAT)
$$ ##TITLE= Audit trail, XWIN-NMR		Version 3.5
$$ ##JCAMPDX= 5.01
$$ ##ORIGIN= Bruker BioSpin GmbH
$$ ##OWNER= nmr
$$ C:\u/data/dgb/nmr/ADRS/16340/pdata/1/auditp.txt
$$ ##AUDIT TRAIL=  $$ (NUMBER, WHEN, WHO, WHERE, WHAT)
(   1,<2006-02-20 14:56:10.37 +000>,<MAYBRIDGE\nmr>,<NMR_250MHZ>,
      <created by zg, POWCHK disabled, PULCHK disabled
       configuration hash MD5:
       84 BC 41 DB A1 6E 1D 46 DA 25 12 A5 C1 ED C5 3A
       data hash MD5: 64K
       08 D7 32 1A 3F 87 D1 83 5A 71 AB 5D 21 C0 22 A3>)
(   2,<2006-02-20 14:56:32.79 +000>,<MAYBRIDGE\nmr>,<NMR_250MHZ>,
      <Start of raw data processing
       ef LB = 0.3 FT_mod = 6 PKNL = 1 SI = 32K 
       data hash MD5: 32K
       19 AA 24 65 BF 0E 69 27 C2 1B 0E 6B 9C 42 4C F5>)
(   3,<2006-02-20 14:56:37.32 +000>,<MAYBRIDGE\nmr>,<NMR_250MHZ>,
      <apk 
       data hash MD5: 32K
       6A 28 25 FB 8B 9F B6 69 BD 3D FB 1F 84 C4 2D 36>)
(   4,<2006-02-20 14:56:38.93 +000>,<MAYBRIDGE\nmr>,<NMR_250MHZ>,
      <abs ABSG = 5 
       data hash MD5: 32K
       3F 2E F3 DE 43 A0 7D 42 9E A9 BB 2A 89 A1 FC 7A>)
$$ ##END=
$$ 
$$ hash MD5
$$ 0C 6B 32 35 94 82 4B 83 36 B2 15 51 58 CC 06 94
##$RELAX= 
##$RELAX= 
##$RELAX= 
##$RELAX= 
##$RELAX= 
##$RELAX= 
##$RELAX= 
$$ Bruker specific parameters
$$ --------------------------
##$DU= <C:\u>
##$EXPNO= 16340
##$NAME= <ADRS>
##$PROCNO= 1
##$TYPE= <nmr>
##$USER= <dgb>
##$AMP= (0..31)
100 100 100 100 100 100 100 100 100 100 100 100 100 100 100 100 100 100 
100 100 100 100 100 100 100 100 100 100 100 100 100 100 
##$AQSEQ= 0
##$AQ_mod= 3
##$AUNM= <au_zg>
##$AUTOPOS= <39 >
##$BF1= 250.13
##$BF2= 250.13
##$BF3= 250.13
##$BF4= 250.13
##$BF5= 500.13
##$BF6= 500.13
##$BF7= 500.13
##$BF8= 500.13
##$BYTORDA= 1
##$CFDGTYP= 0
##$CFRGTYP= 5
##$CHEMSTR= <none>
##$CNST= (0..31)
1 1 145 1 1 1 1 1 1 1 1 1 1 1 1 1 1 1 1 1 1 1 1 1 1 1 1 1 1 1 1 1 
##$CPDPRG= <>
##$CPDPRG1= <>
##$CPDPRG2= <>
##$CPDPRG3= <>
##$CPDPRG4= <mlev>
##$CPDPRG5= <mlev>
##$CPDPRG6= <mlev>
##$CPDPRG7= <mlev>
##$CPDPRG8= <mlev>
##$CPDPRGB= <>
##$CPDPRGT= <>
##$D= (0..31)
0 1 0 0 0 0 0 0 0 0.06 0 0 0 0 0 0 0.0002 0 0 0 0 0 0 0 0 0 0 0 0 0 0 
0 
##$DATE= 1140447369
##$DBL= (0..7)
120 120 120 120 120 120 120 120 
##$DBP= (0..7)
150 150 150 150 150 150 150 150 
##$DBP07= 0
##$DBPNAM0= <>
##$DBPNAM1= <>
$$ [...]
##$SUBNAM7= <"">
##$SUBNAM8= <"">
##$SUBNAM9= <"">
##$SW= 20.6930455092707
##$SWIBOX= (0..15)
0 0 3 0 0 0 0 0 0 0 0 0 0 0 0 0 
##$SW_h= 5175.983436853
##$TD= 65536
##$TD0= 1
##$TE= 294.16
##$TE2= 300
##$TE3= 300
##$TEG= 300
##$TL= (0..7)
0 120 120 120 120 120 120 120 
##$TP= (0..7)
150 150 150 150 150 150 150 150 
##$TP07= 0
##$TPNAME0= <>
##$TPNAME1= <>
##$TPNAME2= <>
##$TPNAME3= <>
##$TPNAME4= <>
##$TPNAME5= <>
##$TPNAME6= <>
##$TPNAME7= <>
##$TPOAL= (0..7)
0.5 0.5 0.5 0.5 0.5 0.5 0.5 0.5 
##$TPOFFS= (0..7)
0 0 0 0 0 0 0 0 
##$TUNHIN= 0
##$TUNHOUT= 0
##$TUNXOUT= 0
##$USERA1= <user>
##$USERA2= <user>
##$USERA3= <user>
##$USERA4= <user>
##$USERA5= <user>
##$V9= 5
##$VALIST= <valist>
##$VCLIST= <CCCCCCCCCCCCCCC>
##$VD= 0
##$VDLIST= <DDDDDDDDDDDDDDD>
##$VPLIST= <PPPPPPPPPPPPPPP>
##$VTLIST= <TTTTTTTTTTTTTTT>
##$WBST= 1024
##$WBSW= 4
##$XGAIN= (0..3)
0 0 0 0 
##$XL= 0
##$YL= 0
##$YMAX_a= 665869
##$YMIN_a= -804794
##$ZGOPTNS= <>
##$ZL1= 120
##$ZL2= 120
##$ZL3= 120
##$ZL4= 120
##$ABSF1= 16.46586
##$ABSF2= -4.227312
##$ABSG= 5
##$ABSL= 3
##$ALPHA= 0
##$AQORDER= 0
##$ASSFAC= 0
##$ASSFACI= 0
##$ASSFACX= 0
##$ASSWID= 0
##$AUNMP= <proc_1d>
##$AZFE= 0.1
##$AZFW= 0.1
##$BCFW= 0
##$BC_mod= 0
##$BYTORDP= 0
##$COROFFS= 0
##$CY= 12.5
##$DATMOD= 1
##$DC= 0
##$DFILT= <>
##$DTYPP= 0
##$F1P= 14.0000005364418
##$F2P= -0.99999901652339
##$FCOR= 0.5
##$FTSIZE= 32768
##$FT_mod= 6
##$GAMMA= 0
##$GB= 0
##$INTBC= 1
##$INTSCL= 1
##$ISEN= 128
##$LB= 0.3
##$LEV0= 0
##$LPBIN= 0
##$MAXI= 10000
##$MC2= 0
##$MEAN= 0
##$ME_mod= 0
##$MI= 0
##$NCOEF= 0
##$NC_proc= -3
##$NLEV= 6
##$NOISF1= 0
##$NOISF2= 0
##$NSP= 0
##$NTH_PI= 0
##$NZP= 0
##$OFFSET= 16.46586
##$PC= 1
##$PHC0= 239.8779
##$PHC1= 8.628131
##$PH_mod= 1
##$PKNL= yes
##$PPARMOD= 0
##$PSCAL= 4
##$PSIGN= 0
##$REVERSE= no
##$SF= 250.13001404076
##$SI= 32768
##$SIGF1= 0
##$SIGF2= 0
##$SINO= 400
##$SIOLD= 32768
##$SREGLST= <1H.CDCl3>
##$SSB= 0
##$STSI= 32768
##$STSR= 0
##$SW_p= 5175.98343685301
##$SYMM= 0
##$S_DEV= 0
##$TDeff= 65536
##$TDoff= 0
##$TI= <Analysis number 999999
Compound Code 99
Book Reference 9
Project Code 9>
##$TILT= no
##$TM1= 0
##$TM2= 0
##$TOPLEV= 0
##$USERP1= <user>
##$USERP2= <user>
##$USERP3= <user>
##$USERP4= <user>
##$USERP5= <user>
##$WDW= 1
##$XDIM= 32768
##$YMAX_p= 385478856
##$YMIN_p= -68229
$$ End of Bruker specific parameters
$$ ---------------------------------
##NTUPLES= NMR SPECTRUM
##VAR_NAME=  FREQUENCY,     SPECTRUM/REAL,   SPECTRUM/IMAG
##SYMBOL=    X,             R,               I
##VAR_TYPE=  INDEPENDENT,   DEPENDENT,       DEPENDENT
##VAR_FORM=  AFFN,          ASDF,            ASDF
##VAR_DIM=   32768,         32768,           32768
##UNITS=     HZ,            ARBITRARY UNITS, ARBITRARY UNITS
##FACTOR=    0.157963299565203, 1,           1
##FIRST=     4118.6058847462, 0,             0
##LAST=      -1057.37755210681, 0,           0
##MIN=       -1057.37755210681, -68229,      0
##MAX=       4118.6058847462, 385478856,     0
$$ Real data points
##PAGE= N=1
##DATA TABLE= (X++(R..R)), XYDATA
$$ [...]
$$ plain form
16200 5566 16 3457 -593 -15097 -22092 -9740 758 -2654 -3631 -21855 -20351 -15900 -17925 -11087
16186 -11087 -22002 -28401 -23199 -20240 -22562 -26633 -18966 -6931 -10214 -4265 -3337 -13487 -27754 -26635
16172 -26635 -15595 -11049 -3623 371 2180 -5980 -9678 -9720 -5565 -10189 -14630 -20290 -26756 -15717
16158 -15717 6087 18897 28753 17632 1679 -9379 -19999 -13931 -9262 -15351 -26972 -14863
16146 -14863 -4347 -5964 -15637 -902 4586 14674 11307 6465 5749 12396 26610 34794 34276 34112
16132 34112 24748 30043 35648 35506 18466 23281 37312 30868 15463 6202 6275 -829 -3399 -3262 10050
16117 10050 -6419 -9860 -712 770 -5063 -8215 -9348 -8522 -7565 -7692 5276 3225 1883 -16201
16103 -16201 -34965 -40238 -36711 -29405 -26891 -13243 -3681 -6066 -22290 -36857 -42305 -34693 -27593
$$ packed form
16200E566n550L441m050j4504o995J2352J0498l412r77j8224J504M451k025O838
16186a1087j0915o399N202K959k322m071P667J2035l283N949R28j0150j4267J119
16172b6635J1040M546P426L994J809q160l698m2M155m624m441n660o466J1039
16158a5717K1804J2810R856j1121j5953j1058j0620O068M669o089j1621J2109
16146a4863J0516j617r673J4735N488J0088l367m842p16O647J4214Q184n18j64
16132C4112r364N295N605j42j7040M815J4031o444j5405r261P3p104k570J37J3312
16117A0050j6469l441R148J482n833l152j133Q26R57j27J2968k051j342j8084
16103a6201j8764n273L527P306K514J3648R562k385j6224j4567n448P612P100
$$ plain form
16090 -27593 -19590 -26786 -25511 -27749 -39413 -37963 -30123 -16586 -13978 -13783 -5769 -2745 -7859 -19652
16076 -19652 -26527 -9601 -3011 -757 557 -11364 -16806 -16782 -24258 -22228 -13999 -3581 13407 13284
16062 13284 7159 6700 11061 11409 1931 -2688 5262 -221 -16128 -12159 -4574 3424 -1768 -2182 -6469
16047 -6469 -7564 -13370 -14206 -705 -6515 -12361 -13251 -15137 -13698 -15347 -18736 -8494 -26982 -38390
16033 -38390 -25230 -9055 -10685 -12353 -13248 -13670 -13004 -13923 -11389 -10193 -10008 -11398 -22358 -25740 -20507
16018 -20507 -18769 -19265 -27868 -27273 -6489 190 3246 -6519 -24080 -38536 -25520 -14527 -8261 -14542
16004 -14542 -24341 -16875 535 -7382 -23282 -18674 -20987 -30188 -26363 -14915 -6739 -5002 -9250 -26197
15990 -26197 -31997 -30379 -41670 -48040 -31318 -28979 -17704 -28230 -24111 -5871 -8523 -29559 -24234
$$ packed form
16090b7593Q003p196J275k238j1664J450P840J3537K608J95Q014L024n114j1793
16076a9652o875J6926O590K254J314j1921n442K4p476K030Q229J0418J6988j23
16062A3284o125m59M361L48r478m619P950n483j5907L969P585P998n192m14m287
16047f469j095n806q36J3501n810n846q90j886J439j649l389J0242j8488j1408
16033c8390J3160J6175j630j668q95m22O66r19K534J196J85j390j0960l382N233
16018b0507J738m96q603N95K0784O679L056r765j7561j4456J3016J0993O266o281
16004a4542r799P466J7410p917j5900M608k313r201L825J1448Q176J737m248j6947
15990b6197n800J618j1291o370J6722K339J1275j0526M119J8240k652k1036N325
$$ plain form
15977 -24234 -21621 -20617 -26343 -12208 -5722 4259 10407 -20 -10814 -19718 -21410 -8238 -3057
15964 -3057 4838 11870 24205 30814 17700 12850 415 -13451 -19964 -17196 -8214 -2099 337 -6506
15950 -6506 -20559 -22087 -14922 -10518 -620 -8136 -20220 -32732 -33205 -24661 -16118 -18925 -14990 -30159
15936 -30159 -42038 -39292 -36773 -33630 -28934 -10733 3437 2623 -17859 -38143 -35027 -40232 -32793
15923 -32793 -25005 -771 1686 1206 1711 5040 3570 -4143 -14995 -7948 -3808 1250 12432 4303
15909 4303 -1073 -5041 -23106 -16739 13 5786 6254 -8992 -28257 -28745 -18327 -15498 -27682 -18570
15895 -18570 -20130 -23976 -28554 -29517 -21363 -20750 -17107 -12311 -22971 -28953 -20414 -6916 -13247 -15428
15881 -15428 -13876 -15995 -24200 -23719 -17809 -3165 5414 1022 -1347 -10452 -8132 2285 3854 12774
$$ packed form
15977b4234K613J004n726J4135O486R981O148j0427j0794q904j692J3172N181
15964c057P895P032J2335O609j3114m850j2435j3866o513K768Q982O115K436o843
15950f506j4053j528P165M404R898p516j2084j2512m73Q544Q543k807L935j5169
15936c0159j1879K746K519L143M696J8201J4170q14k0482k0284L116n205P439
15923c2793P788K4234K457m80N05L329j470p713j0852P047M140N058J1182q129
15909D303n376l968j8065O367J6752N773M68j5246j9265m88J0418K829j2184R112
15895a8570j560l846m578r63Q154O13L643M796j0660n982Q539J3498o331k181
15881a5428J552k119q205M81N910J4644Q579m392k369r105K320J0417J569Q920
$$ plain form
15867 12774 320 -17256 -6621 3240 3672 4829 -6808 -16972 -20676 -8150 2658 1044 -5079
15854 -5079 -11818 -9889 -10820 -18756 -15889 -16971 -25175 -32549 -26891 -16480 -16811 -17061 -23789 -29034 -24063
15839 -24063 -21924 -30591 -13334 -6869 -8414 -8655 -17045 -15031 -7712 -6859 -9987 -8551 3868 8049
15825 8049 -2145 -104 10096 -11637 -21572 -20836 -19073 -11121 -8349 -27439 -34401 -26136 -27909 -23105
15811 -23105 -21008 5451 7022 -4255 10689 23158 21649 13715 -3478 -686 -7513 -8317 -4380
15798 -4380 -16037 -17571 -18370 -3127 -16 -994 -3490 -807 -4371 -14027 -27090 -24857 -18478 -12420
15784 -12420 -13165 -9704 -11957 -17768 -13559 -5433 -1577 -2682 -3913 -16805 -2208 -14849 -24752 -35380
15770 -35380 -35749 -28807 -16819 -10521 -5495 -8188 -15796 -25543 -16418 3472 13453 11942 743 -833
$$ packed form
15867A2774j2454j7576J0635R861M32J157j1637j0164l704J2526J0808j614o123
15854e079o739J929r31p936K867j082q204p374N658J0411l31k50o728n245M971
15839b4063K139q667J7257O465j545k41q390K014P319Q53l128J436J2419M181
15825H049j0194K041J0200k1733r935P36J763P952K772j9090o962Q265j773M804
15811b3105K097K6459J571j1277J4944J2469j509p934j7193K792o827q04L937
15798d380j1657j534p99J5243L111r78k496K683l564r656j3063K233O379O058
15784a2420p45L461k253n811M209Q126L856j105j231j2892J4597j2641r903j0628
15770c5380l69O942J1988O298N026k693p608r747R125J9890R981j511j1199j576
$$ plain form
15756 -833 -1997 -627 611 -5843 -15785 -10528 -14022 -24426 -28440 -30226 -30234 -22397 -10281 -2372 -4228
15741 -4228 -3512 -17078 -22864 -6798 -9154 -20305 -20102 -28842 -9987 1585 1102 822 -4852 -310
15727 -310 6472 -10384 -3293 -277 -6188 -842 -12479 -5186 -13934 -34720 -38073 -28783 -22168 -26151
15713 -26151 -31758 -21440 -15728 -12773 -10803 3721 852 -1849 -7110 -5290 -8505 -13423 -17852 -11636
15699 -11636 -5987 2622 3553 13981 10504 -9735 -15591 -14093 -11838 -6872 -6315 -3427 7066 1445
15685 1445 -4119 -1745 -2510 -13127 -21448 -19214 -10129 -8460 -1304 -2716 -1411 -5735 -16812 -30817
15671 -30817 -19717 -19326 -16539 -19889 -30902 -22407 -16125 -17715 -27876 -5352 -7544 -984 -217 -9990
15657 -9990 -16407 -22306 -30832 -23519 -25061 -24391 -24548 -27316 -16793 -9635 -16278 -11653 -2197 -5583 -14221
$$ packed form
15756h33j164J370J238o454r942N257l494j0404m014j786qP837J2116P909j856
15741d228P16j3566n786J6066k356j1151K03q740J8855J1572m83k80n674M542
15727c10O782j6856P091L016n911N346j1637P293q748k0786l353R290O615l983
15713b6151n607J0318N712K955J970J4524k869k701n261J820l215m918m429O216
15699a1636N649Q609R31J0428l477k0239n856J498K255M966N57K888J0493n621
15685A445n564K374p65j0617q321K234R085J669P156j412J305m324j1077j4005
15671c0817J1100L91K787l350j1013Q495O282j590j0161K2524k192O560P67r773
15657i990o417n899q526P313j542O70j57k768J0523P158o643M625R456l386q638
$$ plain form
15642 -14221 -20671 -13527 -12269 -9363 -16776 -22686 -18968 -26525 -20975 -20096 -30817 -27254 -21162 -25079
15628 -25079 -17258 -8864 -4284 -13649 -27074 -41146 -33087 -26550 -20788 -13409 -3835 -1927 -901 2891
15614 2891 -4939 -12620 -18609 -23046 -16710 -12120 -10104 1264 -8396 -22472 -36426 -26116 -26866 -26116
15600 -26116 -24801 -19996 -14417 -9036 -5277 -3865 -13216 -12719 -18565 -27574 -30178 -26798 -24406 -19618 -26513
15585 -26513 -34375 -32001 -33827 -43944 -50575 -36141 -19129 -17523 -32093 -32206 -19139 -19916 -28679 -24376
15571 -24376 -21688 -21543 -12472 -2523 5428 -5785 -13359 -2899 -6681 -19389 -18523 -7443 -6801 -17262
15557 -17262 -22584 -26287 -25981 -21858 -11340 -9993 -10694 1279 10316 888 -19014 -30986 -31541 -38309
15543 -38309 -46575 -39308 -18074 -25469 -21234 -9915 -10992 -13554 -21139 -12869 -7889 -6920 -1825 -243
$$ packed form
15642a4221o450P144J258K906p413n910L718p557N550Q79j0721L563O092l917
15628b5079P821Q394M580r365j3425j4072Q059O537N762P379R574J908J026L792
15614B891p830p681n989m437O336M590K016J1368r660j4076j3954J0310p50P50
15600b6116J315M805N579N381L759J412r351M97n846r009k604L380K392M788o895
15585b6513p862K374j826j0117o631J4434J7012J606j4570j13J3067p77q763M303
15571b4376K688J45R071R949P951j1213p574J0460l782j2708Q66J1080O42j0461
15557a7262n322l703L06M123J0518J347p01J1973R037r428j9902j1972n55o768
15543c8309q266P267K1234p395M235J1319j077k562p585Q270M980R69N095J582
$$ plain form
15529 -243 -9720 2569 2544 -12564 -15305 -23361 -24847 -30096 -39816 -41166 -41851 -29582 -22294 -31819 -40521
15514 -40521 -42449 -48667 -40572 -28021 -3802 4630 -8880 -17871 -33888 -39462 -37658 -32670 -26153
15501 -26153 -19937 -4607 1775 -22414 -47150 -44990 -39549 -34932 -42996 -24198 -19313 -32219 -45407
15488 -45407 -43297 -48951 -56843 -60637 -56832 -58353 -68229 -65728 -54347 -52611 -65269 -68211 -55508 -57281
15474 -57281 -55406 -38731 -17762 -10257 -18760 -17111 -5776 9520 7600 6700 6018 -6720 -14144 -26322
15460 -26322 -37284 -32832 -25924 -28706 -28484 -23045 -29743 -40101 -28418 -20058 -20722 -20901 -8216 -3132
15446 -3132 -7238 5898 15889 10841 -6321 -26721 -35327 -33439 -27162 -13332 -13389 -26917 -14942 -8122
15432 -8122 -10390 -16663 -11489 -14406 -5516 -5428 -4727 -4150 -3138 -591 -6095 -21568 -38317 -40190 -35460
$$ packed form
15529b43r477J2289k5j5108k741q056j486n249r720j350o85J2269P288r525q702
15514d0521j928o218Q095J2551K4219Q432j3510q991j6017n574J804M988O517
15501b6153O216J5330O382k4189k4736K160N441M617q064J8798M885j2906j3188
15488d5407K110n654p892l794L805j521r876K501J1381J736j2658k942J2703j773
15474e7281J875J6675K0969P505q503J649J1335J5296j920r00o82j2738p424j2178
15460b6322j0962M452O908k782K22N439o698j0358J1683Q360o64j79J2685N084
15446c132m106J3136R991n048j7162k0400q606J888O277J3830n7j3528J1975O820
15432h122k268o273N174k917Q890Q8P01N77J012K547n504j5473j6749j873M730
$$ plain form
15417 -35460 -27336 -30564 -24583 -21802 -26916 -42305 -41645 -46055 -44962 -33057 -8449 2660 10570 2156
15403 2156 3143 10656 13161 13798 9737 -2488 -15920 -20819 -14217 -19277 -13797 -4284 -13038 -23630
15389 -23630 -27603 -36726 -50706 -49303 -41351 -33094 -15329 -5992 -3060 574 -17513 -34185 -28942
15376 -28942 -17546 -5194 -14302 -19803 -21703 -27779 -42425 -35977 -20278 -23545 -24546 -24442 -30533 -25397
15362 -25397 -20118 -17630 -7008 -8608 -9305 -630 -4913 -15847 -5496 -832 -12654 -18703 -26210 -41134
15348 -41134 -35858 -29640 -34609 -26283 -24104 -34478 -42887 -44963 -34150 -29859 -16691 -3309 5569
15335 5569 -3712 -21458 -41533 -48368 -56220 -48569 -27988 -13963 -22602 -20031 -24332 -26872 -15628
15322 -15628 -14873 -1946 -3371 -15448 -21458 -12906 -2555 -11906 -30216 -32917 -8995 -712 -8705
$$ packed form
15417c5460Q124l228N981K781n114j5389O60m410J093J1905K4608J1109P910q414
15403B156R87P513K505O37m061j2225j3432m899O602n060N480R513q754j0592
15389b3630l973r123j3980J403P952Q257J7765R337K932L634j8087j6672N243
15376b8942J1396J2352r108n501j900o076j4646O448J5699l267j001J04o091N136
15362b5397N279K488J0622j600o97Q675m283j0934J0351M664j1822o049p507j4924
15348d1134N276O218m969Q326K179j0374q409k076J0813M291J3168J3382Q878
15335E569r281j7746k0075o835p852P651K0581J4025q639K571m301k540J1244
15322a5628P55J2927j425j2077o010Q552J0351r351j8310k701K3922Q283p993
$$ plain form
15309 -8705 549 5749 -363 -11835 -26772 -33114 -35689 -32261 -21271 -27701 -27627 -31017 -41600 -37881
15295 -37881 -31309 -26791 -27059 -22860 -27915 -23472 -22979 -32998 -46680 -48084 -46147 -57945 -52535 -26910
15281 -26910 -17639 -29713 -32372 -40415 -23503 -15362 -23183 -10057 -7018 -4989 -5960 -6985 -14340 -19686
15267 -19686 -18765 -23862 -32206 -22903 -10282 -3981 -4440 -10165 -14472 -17874 -29189 -28141 -31185 -29053
15253 -29053 -34570 -44114 -43762 -32677 -41845 -28712 -21532 -12367 -7560 -8672 -14405 -16397 -11972 -1703
15239 -1703 -2258 -1345 -2179 -18288 -22445 -15450 -4804 5731 4837 -1762 -3316 -14783 -1731 3963
15225 3963 -19787 -29115 -28236 -11346 -1450 -9541 -13757 -4354 -14358 -30641 -23448 -16922 -23913 -23015
15211 -23015 -20776 -20562 -15855 -19303 -18513 -12665 -28156 -30766 -38777 -33285 -30786 -27135 -19089 -19080 -19085 -25584
$$ packed form
15309h705R254N200o112j1472j4937o342k575L428J0990o430P4l390j0583L719
15295c7881O572M518k68M199n055M443M93j0019j3682j404J937j1798N410K5625
15281b6910R271j2074k659q043J6912Q141p821J3126L039K029r71j025p355n346
15267a9686R21n097q344R303J2621O301m59n725m307l402j1315J048l044K132
15253b9053n517r544L52J1085r168J3133P180R165M807j112n733j992M425J0269
15239a703n55R13q34j6109m157O995J0646J0535q94o599j554j1467J3052N694
15225C963k3750r328Q79J6890R896q091m216R403j0004j6283P193O526o991Q98
15211b3015K239K14M707l448P90N848j5491k610q011N492K499L651Q046Rno499
$$ plain form
15195 -25584 -27004 -29168 -21477 -28643 -32102 -31583 -31719 -30439 -18295 -13566 -15134 -19376 -30708 -31061 -16264
15180 -16264 -17587 -22002 -14460 -16225 -17548 -13819 -11794 -23212 421 6216 -3867 -9723 -14253 -20232
15166 -20232 -9979 -2506 4273 -678 8985 18796 8625 -2271 -10122 -12790 -10257 -14052 -13066 -7189
15152 -7189 4690 -2043 -3803 -10778 2815 11645 2855 1459 -12627 -22781 -24952 -12768 -11808 -20897
15138 -20897 -23249 -14135 -18531 -24163 -18839 -14105 -17017 -21161 -16702 -13584 -5514 -3870 -12936 -13271 -25490
15123 -25490 -30599 -17735 -30102 -34705 -24210 -24556 -30190 -36382 -34290 -28013 -35428 -42053 -42283 -31250
15109 -31250 -19042 -15205 -9648 -7776 3945 9046 2461 -1460 -11915 -25536 -29945 -14488 -8093
15096 -8093 -19857 -20443 -22776 -30296 -27832 -33005 -40971 -22845 -8818 515 2736 -5359 -1495 -8539
$$ packed form
15195b5584j420k164P691p166l459N19j36J280J2144M729j568m242j1332l53J4797
15180a6264j323m415P542j765j323L729K025j1418K3633N795j0083n856m530n979
15166b0232J0253P473O779m951R663R811j0171j0896p851k668K533l795R86N877
15152g189J1879o733j760o975J3593Q830q790j396j4086j0154k171J2184R60r089
15138b0897k352R114m396n632N324M734k912m144M459L118Q070J644r066l35j2219
15123b5490n109J2864j2367m603J0495l46n634o192K092O277p415o625k30J1033
15109c1250J2208L837N557J872J1721N101o585l921j0455j3621m409J5457O395
15096h093j1764n86k333p520K464n173p966J8126J4027R333K221q095L864p044
$$ plain form
15082 -8539 -13789 -9304 -14800 -9986 -12858 -14030 -20820 -9490 3072 5787 -2401 -10126 -23567 -28803
15068 -28803 -18782 -29753 -20693 -1451 -283 -9303 -9026 -14921 -23746 -39031 -41354 -32961 -35309 -35890
15054 -35890 -39839 -41002 -36037 -33467 -21190 -2316 1957 -5834 -8669 -5256 -12612 -14114 -6315 -8484
15040 -8484 -11790 -6963 4492 1198 -5406 -3450 2687 2879 -3144 -14894 -20371 -3669 -12765 -32589
15026 -32589 -17725 -5102 -2424 -12475 -18092 -8229 7199 1802 -4350 -8255 621 -1039 -11104
15013 -11104 -1844 -12068 -25227 -26294 -24856 -23392 -16243 -28209 -27431 -17620 -21448 -21722 -27991 -17461
14999 -17461 -24113 -30612 -24259 -23021 -20333 -17543 -22985 -28260 -16241 -17315 -18982 -15229 -3033 -6141
14985 -6141 -17595 -17741 -7039 -5381 1476 -2039 571 12506 6953 12757 19305 10617 3400 -9040
$$ packed form
15082h539n250M485n496M814k872j172o790J1330J2562K715q188p725j3441n236
15068b8803J0021j0971R060J9242J168r020K77n895q825j5285k323Q393k348n81
15054c5890l949j163M965K570J2277J8874M273p791k835L413p356j502P799k169
15040h484l306M827J1455l294o604J956O137J92o023j1750n477J6702r096j9824
15026c2589J4864J2623K678j0051n617R863J5428n397o152l905Q876j660j0065
15013a1104R260j0224j3159j067J438J464P149j1966P78R811l828k74o269J0530
14999a7461o652o499O353J238K688K790n442n275J2019j074j667L753J2196l108
14985f141j1454j46J0702J658O857l515K610J1935n553N804O548q688p217j2440
$$ plain form
14971 -9040 -11236 -11034 -2498 3550 7468 7169 -8790 -10433 21373 44064 21043 -736 4900 17914
14957 17914 23354 24027 26718 30028 40272 61123 76656 89966 96288 88190 104339 126326 133711
14944 133711 150256 188604 230336 268867 312168 412850 539646 672649 822080 969836
14934 969836 1111325 1198476 1213623 1173912 1082701 963408 828562 684593 575731 500307
14924 500307 445934 396812 367441 320573 268829 246520 229933 196414 161861 142795 142471 139265
14912 139265 127549 120589 94552 81236 85946 86935 87931 79074 78501 70066 56254 48180 52585 52998
14898 52998 60237 56750 48976 45610 50600 55487 54569 51123 35798 34485 33773 39979 33854 29867 28911
14883 28911 8136 3893 8251 -4502 809 6420 5105 -9875 -14699 -3637 15184 20188 6855
$$ packed form
14971i040k196K02Q536O048L918k99j5959j643L1806K2691k3021k1779N636J3014
14957A7914N440O73K691L310J0244K0851J5533J3310O322q098J6149K1987P385
14944A33711J6545L8348M1732L8531M3301J00682J26796J33003J49431J47756
14934I69836J41489Q7151J5147l9711r1211j19293j34846j43969j08862p5424
14924E00307n4373m9122k9371m6868n1744k2309j6587l3519l4553j9066l24l206
14912A39265j1716o960k6037j3316M710R89R96q857n73q435j3812q074M405M13
14898E2998P239l487p774l366M990M887r18l446j5325j313p12O206o125l987r56
14883B8911k0775m243M358j2753N311N611j315j4980m824J1062J8821N004j3333
$$ plain form
14870 6855 -5531 2879 11108 5231 6392 4814 -6269 -4027 1701 3406 -6223 5572 -4732 -3269
14856 -3269 361 -6825 5881 -4039 -22571 -6140 -3263 7629 15925 2873 -6361 -2748 14697
14843 14697 -3110 -7390 1834 -344 -6196 1128 -1382 -15506 -10701 -17745 -17382 -5244 -4030 -12007
14829 -12007 -22122 -20630 -12500 -1163 -2971 -17930 -14252 -10834 -16784 -25765 -38508 -25495 -16215
14816 -16215 -9248 -216 5994 -3229 -11666 -13450 294 7428 3452 5621 -760 5605 3300 -12128
14802 -12128 -28949 -36629 -33370 -18815 -20695 -7042 -10511 -9846 -24987 -35200 -29234 -19383 -9468
14789 -9468 -7659 -2726 -3355 -5224 -10533 -21672 -34150 -29920 -29286 -21478 -9129 -6041 -21366 -18256
14775 -18256 -13860 -6678 -9748 -12344 -12861 -9669 -12542 -21254 -18529 -10931 -17943 -16704 -17105 -11657 -18695
$$ packed form
14870F855j2386Q410Q229n877J161j578j1083K242N728J705r629J1795j0304J463
14856c269L630p186J2706r920j8532J6431K877J0892Q296j3052r234L613J7445
14843A4697j7807m280R224k178n852P324k510j4124M805p044L63J2138J214p977
14829a2007j0115J492Q130J1337j808j4959L678L418n950q981j2743J3013R280
14816a6215O967R032O210r223q437j784J3744P134l976K169o381O365k305j5428
14802a2128j6821p680L259J4555j880J3653l469O65j5141j0213N966R851R915
14789i468J809M933o29j869n309j1139j2478M230O34P808J2349L088j5325L110
14775a8256M396P182l070k596n17L192k873q712K725P598p012J239m01N448p038
$$ plain form
14760 -18695 -17256 -2186 11271 -5596 -9108 550 -8057 -13023 -19170 -12214 -8243 -25029 -17838
14747 -17838 -24807 -48579 -41230 -36769 -33127 -30617 -26631 -25436 -20158 -25611 -37138 -36487 -21734 -16591
14733 -16591 -20877 -24538 -28962 -26412 -15554 -23322 -14443 -10379 -25034 -21921 -15428 -5651 -9230 -4222
14719 -4222 -8930 -4591 7141 5835 -1569 -9188 -6337 -3383 192 5633 4096 8977 13706 14299 30305
14704 30305 15691 24729 31507 30312 33447 29683 18500 14877 14176 11247 18171 13411 9099 1282
14690 1282 2100 12745 2111 -17021 -21150 -14296 -19976 -18551 -22635 -20954 -7207 5114 7826 9688
14676 9688 6208 -882 -5139 -13486 -6362 14772 20484 12237 14191 8890 -611 -359 -9316 -23510
14662 -23510 -21556 2604 11436 9068 6195 12399 11177 35 -3211 11404 15128 23391 27268 10278
$$ packed form
14760a8695J439J5070J3457j6867l512R658q607m966o147O956L971j6786P191
14747a7838o969k3772P349M461L642K510L986J195N278n453j1527O51J4753N143
14733a6591m286l661m424K550J0858p768Q879M064j4655L113O493R777l579N008
14719d222m708M339J1732j306p404p619K851K954L575N441j537M881M729N93J6006
14704C0305j4614R038O778j195L135l764j1183l623p01k929O924m760m312p817
14690A282Q18J0645j0634j9132m129O854n680J425m084J681J3747J2321K712J862
14676I688l480p090m257q347P124K1134N712q247J954n301r501K52q957j4194
14662b3510J954K4160Q832k368k873O204j222j1142l246J4615L724Q263L877j6990
$$ plain form
14648 10278 14746 25166 28341 15727 17271 26820 43688 42794 24707 27362 22051 44437 42085
14635 42085 37434 28203 22653 19784 1895 8015 3058 -15065 -25469 -26186 -17208 616 -2575 -15773
14621 -15773 -17316 -9288 -9895 -18754 -22274 -15985 -10444 -14602 -16702 -20532 -11215 15052 13415 8071
14607 8071 2102 -11129 -1417 12315 9520 7416 -6063 -3034 1492 1930 4958 10539 9119 -11605
14593 -11605 -22442 -18144 -11811 -19880 -17430 -13670 -11139 -144 10865 6686 -335 8090 903 -5441
14579 -5441 -7286 1255 -625 -353 -7638 -11722 -15027 -9221 -3023 -4466 -23003 -38230 -42225 -45717
14565 -45717 -31795 -24642 -16301 -6005 -17388 -28224 -15256 5627 23317 31759 21255 -1264
14553 -1264 -25635 -25479 -18203 -21616 -20866 -24162 -15619 -23293 -26282 -10401 20995 21645 12095 -3272
$$ packed form
14648A0278M468J0420L175j2614J544R549J6868q94j8087K655n311K2386k352
14635D2085m651r231n550k869j7889O120m957j8123j0404p17Q978J7824l191j3198
14621a5773j543Q028o07q859l520O289N541m158k100l830R317K6267j637n344
14607H071n969j3231R712J3732k795k104j3479L029M526M38L028N581j420k0724
14593a1605j0837M298O333q069K450L760K531J0995J1009m179p021Q425p187o344
14579e441j845Q541j880K72p285m084l305N806O198j443j8537j5227l995l492
14565d5717J3922P153Q341J0296j1383j0836J2968K0883J7690Q442j0504k2519
14553a264k4371J56P276l413P50l296Q543p674k989J5881L1396O50r550j5367
$$ plain form
14539 -3272 -16602 -26692 -28288 -15172 -7760 -15960 -24239 -24507 -11895 4199 8924 11157 9683 23412
14525 23412 37704 41795 44068 36972 40276 51361 64033 68665 76794 86836 96003 108553 122210
14512 122210 132159 140070 135149 132128 125728 107463 91539 77913 71398 61682 55793 53853 54833 43838
14498 43838 33916 20867 10807 11825 19841 23808 22062 11890 5003 1705 -7862 -14609 -18383 -24315
14484 -24315 -25540 -21317 -18253 -14681 -30386 -33589 -23976 -28312 -21180 -17632 -23944 -22302 -17250 -18039
14470 -18039 -24342 -24684 -23339 -22892 -22619 -26094 -19006 -14948 -4871 4041 5435 -1625 2715 -6927 -16127
14455 -16127 -13719 -21117 -20630 -3930 -598 -6856 -30560 -25476 -23906 -25492 -14251 -1037 -1608 -1856
14441 -1856 1789 9376 13212 392 -21199 -35361 -39157 -30449 -23256 -20842 -21360 -5196 -13368 -25844
$$ packed form
14539c272j3330j0090j596J3116P412q200q279k68J2612J6094M725K233j474J3729
14525B3412J4292M091K273p096L304J1085J2672M632Q129J0042R167J2550J3657
14512A22210R949P911m921l021o400j8265j5924j3626o515r716n889j940R80j0995
14498D3838r922j3049j0060J018Q016L967j746j0172o887l298r567o747l774n932
14484b4315j225M223L064L572j5705l203R613m336P132L548o312J642N052p89
14470a8039o303l42J345M47K73l475P088M058J0077Q912J394p060M340r642r200
14455a6127K408p398M87J6700L332o258k3704N084J570j586J1241J3214n71k48
14441a856L645P587L836j2820k1591j4162l796Q708P193K414n18J6164q172j2476
$$ plain form
14427 -25844 -33970 -36504 -31964 -19068 -21588 -33656 -37501 -31972 -18886 -14821 -18079 -18342 -13091 -2098
14413 -2098 -2031 -6188 -6657 4086 -692 1090 2695 5357 20670 26933 24944 25246 23971 19235 9099
14398 9099 1430 -2791 -13238 -17580 1212 -80 -7642 -15332 -2493 -9189 -17959 -7499 -3511 -359
14384 -359 3343 -1852 -6661 -10967 -17520 41 -5934 -12137 -17463 -20469 -24842 -17413 -2066 80
14370 80 1074 -5701 -21601 -30691 -29203 -34242 -40282 -43734 -18674 -17633 -22733 -25485 -20199 -23295 -37173
14355 -37173 -26275 -31912 -39649 -25975 -11624 -4721 -2998 -9367 707 8526 14631 4121 -5633
14342 -5633 -1585 1153 5689 3906 -3154 -4716 -11007 -5133 494 -3325 -19654 -35282 -37532 -26653
14328 -26653 -19831 -16908 -30562 -24590 -16456 -14962 3003 12217 -3072 -9401 -5797 -2013 -1526 34
$$ packed form
14427b5844q126k534M540J2896k520j2068l845N529J3086M065l258k63N251J0993
14413b098O7m157m69J0743m778J782J605K662J5313O263j989L02j275m736j0136
14398I099p669m221j0447m342J8792j292p562p690J2839o696q770J0460L988L152
14384c59L702n195m809m306o553J7561n975o203n326l006m373P429J5347K146
14370H0R94o775j5900r090J488n039o040l452K5060J041n100k752N286l096j3878
14355c7173J0898n637p737J3674J4351O903J723o369J0074P819O105j0510r754
14342e633M048K738M536j783p060j562o291N874N627l819j6329j5628k250J0879
14328b6653O822K923j3654N972Q134J494J7965R214j5289o329L604L784M87J560
$$ plain form
14314 34 -5780 -8537 -9166 3238 15565 18773 14794 4196 4387 6751 8561 127 -6711 2946 -8157
14299 -8157 -2808 -15162 -12786 -12842 566 5164 4906 -2576 -8648 -10793 -14597 -32137 -26209 -14248
14285 -14248 3785 -3174 3225 2281 3619 10036 6117 13683 15670 11052 14329 17955 34432 44985
14271 44985 52086 51990 73531 88204 108856 135564 151889 161546 178620 199803 209996 206276 206803
14258 206803 198301 172974 144452 127607 125110 125478 116744 108953 109683 125329 122639 105549 107048
14245 107048 112822 105780 93340 82450 78479 106660 124948 136143 142228 156350 163435 172629 190632
14232 190632 225124 270692 298556 324053 333304 346988 355949 351025 342321 334632 329830 305714 275386
14219 275386 244558 220744 190596 164089 159408 158726 151542 134974 121810 107907 100711 86900
$$ packed form
14314C4n814k757o29J2404J2327L208l979j0598J91K364J810q434o838R657j1103
14299h157N349j2354K376n6J3408M598k58p482o072k145l804j7540N928J1961
14285a4248J8033o959O399r44J338O417l919P566J987m618L277L626J6477J0553
14271D4985P101r6K1541J4673K0652K6708J6325R657J7074K1183J0193l720N27
14258B06803q502k5327k8522j6845k497L68q734p791P30J5646k690j7090J499
14245A07048N774p042j2440j0890l971K8181J8288J1195O085J4122P085R194J8003
14232A90632L4492M5568K7864K5497R251J3684Q961m924q704p689m802k4116l0328
14219B75386l0828k3814l0148k6507m681o82p184j6568j3164j3903p196j3811
$$ plain form
14207 86900 90619 88831 85908 95314 91673 93965 113209 118538 110907 125981 126788 125834 132102 148411
14193 148411 161799 188507 208079 210677 213564 209695 188519 163657 153634 141528 128266 103637
14181 103637 90428 105658 113176 86372 54685 48205 44204 39804 46746 49345 40971 30533 34230
14168 34230 47742 45542 42823 38893 46125 48287 48140 56530 54567 50008 38385 32453 24244 27350
14154 27350 25794 22755 20957 14535 7723 -2081 -936 316 -20021 -7506 3072 12687 9332 11501
14140 11501 18790 22840 22986 1859 2586 20199 18937 13128 -2479 -16132 -12008 -20401 -22925 -6466
14126 -6466 -402 6043 25170 38668 29723 10001 9985 21803 22400 14113 7354 12498 35897 54193
14112 54193 49196 47721 60089 68523 66992 73510 82461 88019 90234 103387 114009 124445 152400
$$ packed form
14207H6900L719j788k923R406l641K292J9244N329p631J5074Q07r54O268J6309
14193A48411J3388K6708J9572K598K887l869k1176k4862j0023j2106j3262k4629
14181A03637j3209J5230P518k6804l1687o480m001m400O942K599q374j0438L697
14168C4230J3512k200k719l930P232K162j47Q390j963m559j1623n932q209L106
14154B7350j556l039j798o422o812r804J145J252k0337J2515J0578R615l355K169
14140A1501P289M050J46k1127P27J7613j262n809j5607j3653M124q393k524J6459
14126f466O064O445J9127J3498q945j9722j6J1818N97q287o759N144K3399J8296
14112E4193m997j475J2368Q434j531O518Q951N558K215J3153J0622J0436K7955
$$ plain form
14099 152400 175847 204409 228066 265963 293023 314990 348351 388459 409419 420097 428811 452158
14087 452158 471186 472694 487747 502837 488580 475207 467291 434786 414050 393981 369839 327292
14075 327292 298687 284510 281708 278626 266713 237901 221365 211749 191951 182424 175856 157462
14063 157462 143744 136770 123731 120840 125511 126831 115185 92688 82284 80297 66506 52452
14051 52452 42009 41623 41296 33672 25710 28862 33116 30905 33422 30027 23912 28284 21873 7549
14037 7549 10157 9382 3903 -3801 -9136 -4252 6759 14820 6486 -7383 -15062 -10733 -16534 -19432
14023 -19432 -19138 -12714 -10133 -7586 3307 17417 6713 -1970 -2720 4701 20623 5834 7134 2274
14009 2274 -1418 -3395 3018 17513 18852 3035 10334 19997 15737 -5230 -2927 -5092 -13260 -3828
$$ packed form
14099A52400K3447K8562K3657L7897K7060K1967L3361M0108K0960J0678Q714K3347
14087D52158J9028J508J5053J5090j4257j3373p916l2505k0736k0069k4142m2547
14075C27292k8605j4177k802l082j1913k8812j6536r616j9798r527o568j8394
14063A57462j3718o974j3039k891M671J320j1646k2497j0404j987j3791j4054
14051E2452j0443l86l27p624p962L152M254k211K517l395o115M372o411j4324
14037G549K608p75n479p704n335M884J1011Q061q334j3869p679M329n801k898
14023a9432K94O424K581K547J0893J4110j0704q683p50P421J5922j4789J300m860
14009B274l692j977O413J4495J339j5817P299R663m260k0967K303k165q168R432
$$ plain form
13995 -3828 199 -13877 -14084 2710 -9460 1960 1575 -11910 -5035 -203 3258 1834 -2997 4059
13981 4059 8599 1038 59 2377 -12569 -17544 -5852 -5586 -7984 3284 5491 958 2547 -3757
13967 -3757 -23776 -15523 -4455 1920 -632 6467 -243 95 -3636 -3920 8242 725 -3121 9495
13953 9495 159 -15545 336 31641 36303 11302 -8663 -770 4062 9286 16818 18388 6113
13940 6113 -7736 -1803 1284 -7665 -10688 -13729 -10263 -5856 -4019 -20334 -19665 2287 14853 8774
13926 8774 1207 -9121 -5656 -3460 -7444 -8960 -6498 2196 -697 7411 11332 22867 17748 9545
13912 9545 6668 6004 -13794 -706 4422 -2549 -8013 -6534 261 -4287 6234 6365 5764 11712 17007
13897 17007 11058 13593 1785 482 1818 -12157 -10083 -1106 4690 9906 8005 15702 33902 31570
$$ packed form
13995c828M027j4076k07J6794j2170J1420l85j3485O875M832L461j424m831P056
13981D059M540p561r79K318j4946m975J1692K66k398J1268K207m533J589o304
13967c757k0019Q253J1068O375k552P099o710L38l731k84J2162p517l846J2616
13953I495r336j5704J5881L1305M662k5001j9965P893M832N224P532J570j2275
13940F113j3849N933L087q949l023l041L466M407J837j6315O69K1952J2566o079
13926H774p567j0328L465K196l984j516K462Q694k893Q108L921J1535n119q203
13912I545k877o64j9798J3088N128o971n464J479O795m548J0521J31o01N948N295
13897A7007n949K535j1808j303J336j3975K074Q977N796N216j901P697J8200k332
$$ plain form
13883 31570 18391 14862 3838 5107 -303 -2232 8270 7852 5377 9425 9023 1605 1823 -1795
13869 -1795 2989 390 -8787 -14799 -5379 -4674 4353 -4654 -1422 11274 23147 10892 11618 16255
13855 16255 7673 8643 11070 18056 23903 32704 31252 21202 9990 14246 13675 4887 16463 17000
13841 17000 21537 41519 52621 43162 41250 47429 54639 55352 40598 22790 8812 7621 27023
13828 27023 46860 62312 71475 73738 87925 80561 84822 91303 105471 121766 129858 139620 157809
13815 157809 173343 185656 202242 240369 277298 324818 381530 449020 522012 604581 714791
13804 714791 874646 1066750 1322618 1607175 1911769 2219790 2496565 2672529 2741505 2739797
13794 2739797 2636001 2422865 2183994 1930965 1677039 1450722 1269301 1123348 1025718 938263
$$ packed form
13883C1570j3179l529j1024J269n410j929J0502m18k475M048m02p418K18l618
13869a795M784k599r177o012R420P05R027r007L232J2696J1873j2255P26M637
13855A6255q582R70K427O986N847Q801j452j0050j1212M256n71q788J1576N37
13841A7000M537J9982J1102r459j912O179P210P13j4754j7808j3978j191J9402
13828B7023J9837J5452R163K263J4187p364M261O481J4168J6295Q092R762J8189
13815A57809J5534J2313J6586L8127L6929M7520N6712O7490P2992Q2569J10210
13804G14791J59855J92104K55868K84557L04594L08021K76775J75964O8976j708
13794B739797j03796k13136k38871k53029k53926k26317j81421j45953r7630q7455
$$ plain form
13784 938263 833420 750959 669178 612170 563709 519862 485169 445136 396937 357565 341549
13773 341549 325486 288054 262467 257118 247023 234700 224420 200008 170839 146041 127321 128117
13761 128117 130547 136452 132528 133450 121866 116656 120167 140847 143978 138557 117874 100032 103973
13748 103973 117981 108717 102055 125563 124823 130635 132059 129384 133979 133461 132189 150013 187252 206368
13734 206368 199711 189824 180221 183569 197049 193763 174044 157070 165295 168092 151934 132884 124887
13721 124887 123570 112828 114233 112423 113946 118384 115648 106900 109261 121576 122828 140264 149879
13708 149879 146882 148333 146544 149969 152020 163361 172021 184367 189264 195061 192243 203312 210690
13695 210690 198992 182247 169394 144528 124372 108423 95585 101983 99090 99314 116255 127995
$$ packed form
13784I38263j04843q2461q1781n7008m8461m3847l4693m0033m8199l9372j6016
13773C41549j6063l7432k5587n349j0095j2323j0280k4412k9169k4798j8720P96
13761A28117K430N905l924R22j1584n210L511K0680L131n421k0683j7842L941
13748A03973J4008r264o662K3508p40N812J424k675M595n18j272J7824L7239J9116
13734B06368o657r887r603L348J3480l286j9719j6974Q225K797j6158j9050p997
13721A24887j317j0742J405j810J523M438k736q748K361J2315J252J7436R615
13708A49879k997J451j789L425K051J1341Q660J2346M897N797k818J1069P378
13695B10690j1698j6745j2853k4866k0156j5949j2838O398k893K24J6941J1740
$$ plain form
13683 127995 128229 118187 104888 109088 102008 100817 98168 85969 77424 73900 89835 97945 92480
13670 92480 87027 97852 106502 110132 114745 105140 104043 102276 110972 110312 122338 129936 134996 140848
13656 140848 140339 138932 143440 158388 154835 172634 181919 183707 190135 187842 179293 179303 173727 176590
13642 176590 187889 205849 222732 207623 204268 207621 213204 227398 217157 210232 212984 208857 226957
13629 226957 218398 209578 221083 236643 231857 234747 232479 232681 224967 234809 261997 273129 290423
13616 290423 327828 360136 403586 455750 508425 576365 678630 762324 834395 891444 933533
13605 933533 965258 978716 978788 946428 900613 847137 787455 725808 655353 584496 549087 529310
13593 529310 519061 514612 495243 477290 475763 496436 513974 532516 556420 604702 653072 711699
$$ packed form
13683A27995K34j0042j3299M200p080j191k649j2199q545l524J5935Q110n465
13670I2480n453J0825Q650L630M613r605j097j767Q696o60J2026P598N060N852
13656A40848n09j407M508J4948l553J7799R285J788O428k293q549J0n576K863
13642A76590J1299J7960J6883j5109l355L353N583J4194j0241o925K752m127J8100
13629B26957q559q820J1505J5560m786K890k268K02p714R842K7188J1132J7294
13616B90423L7405L2308M3450N2164N2675O7940J02265Q3694P2071N7049M2089
13605I33533L1725J3458P2l2360m5815n3476n9682o1647p0455p0857l5409j9777
13593E29310j0249m449j9369j7953j527K0673J7538J8542K3904M8282M8370N8627
$$ plain form
13581 711699 781836 844903 927717 1023763 1129342 1237466 1343831 1452998 1523368 1576897 1621869
13570 1621869 1621211 1593053 1539889 1470362 1382964 1273694 1170611 1080415 1005603 917589 846073
13559 846073 782103 724116 678291 631189 576321 514970 474227 434367 396878 360971 348691
13548 348691 345026 330618 296651 256569 242399 230629 191421 187692 187314 180904 175190 157148 136526
13535 136526 144919 141615 137706 127399 117097 104961 96524 104557 109529 95408 85171 92249 88061
13522 88061 81764 81003 81978 93960 88676 79498 84626 80096 77565 84583 87860 81136 77791 78849 76443
13507 76443 86622 84524 85312 95971 99904 107579 114871 127319 134618 146888 155316 148449 139644 138130
13493 138130 138421 149492 157820 156425 170320 176081 165953 170919 187888 212707 239651 264870 289188
$$ packed form
13581G11699P0137O3067Q2814R6046J05579J08124J06365J09167P0370N3529M4972
13570A621869o58k8158n3164o9527q7398j09270j03083r0196p4812q8014p1516
13559H46073o3970n7987m5825m7102n4868o1351m0743l9860l7489l5907j2280
13548C48691l665j4408l3967m0082j4170j1770l9208l729l78o410n714j8042k0622
13535A36526Q393l304l909j0307j0302j2136q437Q033M972j4121j0237P078m188
13522H8061o297p61R75J1982n284r178N128m530k531P018L277o724l345J058k406
13507G6443J0179k098P88J0659L933P675P292J2448P299J2270Q428o867q805j514
13493A38130K91J1071Q328j395J3895N761j0128M966J6969K4819K6944K5219K4318
$$ plain form
13480 289188 319855 355542 407029 432971 456971 490561 512525 512472 517843 527281 528329 504584 475499
13467 475499 458138 416971 390417 359358 338144 330867 327626 327233 317176 318053 333500 350221 359516
13454 359516 387978 417768 437846 447521 472232 493930 521503 548728 567126 585935 595867 607474
13442 607474 628614 629157 631051 629611 629012 622952 608568 576807 538895 513450 484820 453231 406675
13429 406675 363657 338006 322610 307693 290462 262556 236504 224515 220741 225517 211459 203594
13417 203594 194932 187505 184750 184454 177121 170782 154685 153400 159830 170759 177090 174850 177960 179687
13403 179687 179823 187160 206394 225388 235801 264835 295195 326791 354886 392121 452537 520032
13391 520032 606668 718158 859808 1020559 1192757 1371074 1551677 1718718 1861318 1968471
$$ packed form
13480B89188L0667L5687N1487K5942K4000L3590K1964n3N371R438J048k3745k9085
13467D75499j7361m1167k6554l1059k1214p277l241l93j0057Q77J5447J6721R295
13454C59516K8462K9790K0078R675K4711K1698K7573K7225J8398J8809R932J1607
13442F07474K1140N43J894j440n99o060j4384l1761l7912k5445k8630l1589m6556
13429D06675m3018k5651j5396j4917j7231k7906k6052j1989l774M776j4058p865
13417B03594q662p427k755k96p333o339j6097j285O430J0929O331k240L110J727
13403A79687J36P337J9234J8994J0413K9034L0360L1596K8095L7235O0416O7495
13391E20032Q6636J11490J41650J60751J72198J78317J80603J67041J42600J07153
$$ plain form
13381 1968471 2026599 2012705 1949039 1854714 1718870 1576563 1418491 1280284 1177433 1091389
13371 1091389 1004395 923978 866537 819568 774024 754242 746637 739031 736910 741769 744050 767869
13359 767869 814903 878261 957336 1055944 1175177 1302731 1470433 1658196 1823932 1931586
13349 1931586 2021917 2078960 2085096 2042038 1950752 1805835 1636810 1477798 1329148 1185825
13339 1185825 1050669 930555 824344 739457 665862 609027 562510 509759 462068 408409 364102
13328 364102 323932 295611 297506 290380 266020 260619 239741 206677 182896 182773 180099 175301 175060
13315 175060 162885 142956 119917 135429 133351 132573 126926 121167 136642 155291 154232 136047 122645
13302 122645 114743 106763 102287 103067 94565 99645 108501 89709 82512 75083 82875 93956 95398 80383
$$ packed form
13381A968471N8128j3894o3666r4325j35844j42307j58072j38207j02851q6044
13371A091389q6994q0417n7441m6969m5544j9782p605p606k121M859K281K3819
13359G67869M7034O3358P9075R8608J19233J27554J67702J87763J65736J07654
13349A931586R0331N7043O136m3058r1286j44917j69025j59012j48650j43323
13339A185825j35156j20114j06211q4887p3595n6835m6517n2751m7691n3659m4307
13328C64102m0170k8321J895p126k4360n401k0878l3064k3781j23k674m798k41
13315A75060j2175j9929k3039J5512k078p78n647n759J5475J8649j059j8185j3402
13302A22645p902p980m476P80q502N080Q856j8792p197p429P792J1081J442j5015
$$ plain form
13288 80383 61592 72202 88222 96591 100242 92867 74040 78434 81172 84732 86913 70148 65531
13275 65531 64686 73762 68121 72764 80760 81852 82799 81233 89830 90581 77381 87121 80600 77478 83096
13260 83096 77475 78201 78253 66314 64233 65111 64527 55606 50152 44698 42025 60292 54954 56694 61027
13245 61027 72330 77678 73396 71733 72890 70223 77507 84723 87902 97864 126359 170052 192837
13232 192837 204871 211877 223301 225102 227318 212623 192451 183031 170409 154424 151952 140209
13220 140209 123905 131311 136901 131913 117755 95702 85793 84645 76916 75418 71554 59318 46315
13207 46315 40806 40850 50817 62545 66244 51741 38721 42924 54418 55808 63520 59392 55452 55968
13193 55968 57754 41135 31230 44214 53447 51480 48886 55886 55462 52667 46095 56152 68600 53053
$$ packed form
13288H0383j8791J0610J6020Q369L651p375j8827M394K738L560K181j6765m617
13275F5531q45R076n641M643P996J092R47j566Q597P51j3200R740o521l122N618
13260H3096n621P26N2j1939k081Q78n84q921n454n454k673J8267n338J740M333
13245F1027J1303N348m282j663J157k667P284P216L179R962K8495M3693K2785
13232A92837J2034P006J1424J801K216j4695k0172r420j2622j5985k472j1743
13220A40209j6304P406N590m988j4158k2053r909j148p729j498l864j2236j3003
13207D6315n509M4R967J1728L699j4503j3020M203J1494J390P712m128l940N16
13193E5968J786j6619r905J2984R233j967k594P000m24k795o572J0057J2448j5547
$$ plain form
13179 53053 46186 43353 47084 41162 31142 24435 26894 29506 52755 53750 40172 27644 25141 33425
13165 33425 44733 65419 59508 65351 57281 53871 45037 49069 53398 50256 60297 55997 60642 67581
13151 67581 85161 99114 108395 95888 80966 83064 95127 85601 85858 78563 73227 75939 66099
13138 66099 72810 70358 55000 51714 48044 37232 52252 63153 63535 65354 68540 45524 56056
13125 56056 68195 70379 74005 68697 70311 64793 70973 68169 69902 68100 66245 70868 83915 109823
13111 109823 123196 115571 117589 147573 195452 245232 257754 241446 210643 173294 153999 137043
13099 137043 116930 97312 97442 104782 108333 102868 88480 72668 76234 76375 72368 68526 67550 62787
13085 62787 56370 59286 64249 64984 57062 44977 58613 69242 60452 55191 54931 50075 53532 67511
$$ packed form
13179E3053o867k833L731n922j0020o707K459K612K3249R95j3578j2528k503Q284
13165C3425J1308K0686n911N843q070l410q834M032M329l142J0041m300M645O939
13151F7581J7580J3953R281j2507j4922K098J2063r526K57p295n336K712r840
13138F6099O711k452j5358l286l670j0812J5020J0901L82J819L186k3016J0532
13125E6056J2139K184L626n308J614n518O180k804J733j802j855M623J3047K5908
13111A09823J3373p625K018K9984M7879M9780J2522j6308l0803l7349j9295j6956
13099A37043k0113j9618J30P340L551n465j4388j5812L566J41m007l842r76m763
13085F2787o417K916M963P35p922j2085J3636J0629q790n261k60m856L457J3979
$$ plain form
13071 67511 71736 70789 82483 86831 92120 101210 107689 137857 174482 214530 241855 261521 253934
13058 253934 231461 211556 182381 147370 126128 123389 109280 91372 64307 58541 50184 52385
13046 52385 55457 64594 70118 58563 57685 61773 63530 59110 57229 41726 44312 55548 69242 80543
13032 80543 68907 56087 48584 48272 66467 77011 69973 57558 45098 43239 59484 73678 75230
13019 75230 80219 82436 96647 117540 132207 123176 99908 85547 91887 96433 82887 69543 73632
13006 73632 62881 46832 37931 44193 53463 46817 41712 48908 37017 30145 34906 49303 45759
12993 45759 33209 26953 26586 26483 27344 24836 29151 36909 49152 47244 44970 45325 44505 43916 35861
12978 35861 32065 45184 49880 30455 46073 59568 52939 44582 40522 54535 66856 55567 50618
$$ packed form
13071F7511M225r47J1694M348N289R090O479L0168L6625M0048K7325J9666p587
13058B53934k2473j9905k9175l5011k1242k739j4109j7908k7065n766q357K201
13046E2385L072R137N524j1555q78M088J757m420j881j5503K586J1236J3694J1301
13032H0543j1636j2820p503l12J8195J0544p038j2415j2460j859J6245J4194J552
13019G5230M989K217J4211K0893J4667r031k3268j4361O340M546j3546j3344M089
13006G3632j0751j6049q901O262R270o646n105P196j1891o872M761J4397l544
12993D5759j2550o256l67j03Q61k508M315P758J2243j908k274L55q20n89q055
12978C5861l796J3119M696j9425J5618J3495o629q357m060J4013J2321j1289m949
$$ plain form
12965 50618 44572 43199 35190 31627 35885 31964 26219 43882 57677 63407 62051 51061 39328
12952 39328 38020 34948 43034 57022 73606 74789 67935 68703 57326 66805 81716 84026 67954
12939 67954 61838 67377 70746 55063 44831 45249 67302 73347 77701 82841 98427 101778 103768 97221
12925 97221 109795 132018 150867 147756 140554 128539 133946 143046 155310 162201 168974 168715 167939 183465
12911 183465 182276 169339 170935 182835 192328 201147 228221 255062 274471 309159 345051 366493
12899 366493 416090 483785 569596 676972 792513 902425 1013821 1093118 1152165 1185960 1203498
12888 1203498 1183422 1123570 1048659 957679 863303 779446 698641 635699 589074 547376 502298
12877 502298 473677 459672 446981 436086 402109 366477 338423 319805 312714 302056 293798 295287
$$ packed form
12965E0618o046j373q009l563M258l921n745J7663J3795N730j356j0990j1733
12952C9328j308l072Q086J3988J6584J183o854P68j1377R479J4911K310j6072
12939F7954o116N539L369j5683j0232M18K2053O045M354N140J5586L351J990o547
12925I7221J2574K2223J8849l111p202j2015N407R100J2264O891O773k59p76J5526
12911A83465j189j2937J596J1900R493Q819K7074K6841J9409L4688L5892K1442
12899C66493M9597O7695Q5811J07376J15541J09912J11396P9297N9047L3795J7538
12888A203498k0076n9852p4911r0980r4376q3857q0805o2942m6625m1698m5078
12877E02298k8621j4005j2691j0895l3977l5632k8054j8618p091j0658q258J489
$$ plain form
12865 295287 288244 278245 271057 259709 244896 240011 242626 253845 262065 260735 280261 278522 280777
12852 280777 312469 336555 365768 401882 418247 439102 449148 467240 493926 492627 498317 498383
12840 498383 508312 501551 492052 481413 450101 430980 412416 381102 343154 317142 315183 303239
12828 303239 285120 284150 273034 261480 254314 249250 227907 225945 233937 243174 245792 249067 253843
12815 253843 278425 304108 332373 326090 325234 314718 310291 312583 313732 305145 306158 307263 307090 318086
12801 318086 328373 349946 345030 330609 319225 318865 314041 300394 287436 279987 268528 259790 267828
12788 267828 286515 303196 304006 302905 309571 323531 338339 346889 362266 384337 416551 442381
12776 442381 466117 501081 532254 570056 606998 652938 698585 741443 797783 884310 965407
$$ packed form
12865B95287p043r999p188j1348j4813m885K615J1219Q220j330J9526j739K255
12852B80777L1692K4086K9213L6114J6365K0855J0046J8092K6686j299N690O6
12840D98383R929o761r499j0639l1312j9121j8564l1314l7948k6012j959j1944
12828C03239j8119r70j1116j1554p166n064k1343j962P992R237K618L275M776
12815B53843K4582K5683K8265o283q56j0516m427K292J149q587J013J105j73J0996
12801C18086J0287K1573m916j4421j1384l60m824j3647j2958p449j1459q738Q038
12788B67828J8687J6681Q10j101O666J3960J4808Q550J5377K2071L2214K5830
12776D42381K3736L4964L1173L7802L6942M5940M5647M2858N6340Q6527Q1097
$$ plain form
12765 965407 1071018 1187654 1296246 1384730 1420843 1422957 1411870 1365404 1301379 1240433 1160370
12754 1160370 1083262 1041999 1009473 977438 937527 895039 869990 859884 865865 871311 898708 946058
12742 946058 1001717 1084985 1201110 1336025 1501467 1671875 1831237 1964362 2027975 2024233
12732 2024233 1983585 1948611 1939062 1952332 1979693 2034353 2083167 2106351 2107889 2069472 2003837 1912316
12720 1912316 1816828 1740467 1688191 1633981 1592883 1579309 1558827 1519519 1491382 1476760 1461296
12709 1461296 1450585 1477655 1541398 1645609 1809816 2008191 2232222 2490568 2736061 2934888
12699 2934888 3066879 3113805 3071528 2995431 2897460 2786970 2680333 2580485 2509270 2433251 2347715
12688 2347715 2246703 2133032 1992345 1837551 1703056 1584159 1484273 1387618 1305794 1267486
$$ packed form
12765I65407J05611J16636J08592Q8484L6113K114j1087m6466o4025o0946q0063
12754A160370p7108m1263l2526l2035l9911m2488k5049j0106N981N446K7397M7350
12742I46058N5659Q3268J16125J34915J65442J70408J59362J33125O3613l742
12732B024233m0648l4974r549J3270K7361N4660M8814K3184J538l8417o5635r1521
12720A912316r5488p6361n2276n4210m1098j3574k0482l9308k8137j4622j5464
12709A461296j0711K7070O3743J04211J64207J98375K24031K58346K45493J98827
12699B934888J31991M6926m2277p6097r7971j10490j06637r9848p1215p6019q5536
12688B347715j01012j13671j40687j54794j34495j18897r9886r6655q1824l8308
$$ plain form
12678 1267486 1219976 1186304 1159892 1143880 1145413 1174110 1206183 1244556 1303016 1367777 1458642
12667 1458642 1584055 1738811 1887885 2018513 2108682 2125941 2082812 1993162 1866312 1735672
12657 1735672 1617559 1513361 1425798 1353539 1279115 1213002 1151278 1077341 1016704 976464 957795
12646 957795 945458 936253 918531 898744 883617 858770 843779 837201 834404 811016 781459 773778
12634 773778 788323 792452 790563 783656 778858 780873 788772 777901 777774 792385 782230 783404 771203
12621 771203 761687 769680 759507 753250 751587 759246 747803 724104 724622 733770 761836 785292 807442
12608 807442 826206 842628 838963 836158 838908 849616 877699 894049 894211 930293 952338 971190
12596 971190 1009589 1043380 1072764 1095340 1103948 1083144 1044513 1008227 956755 914092 885419 879629
$$ packed form
12678A267486m7510l3672k6412j6012J533K8697L2073L8373N8460O4761R0865
12667A458642J25413J54756J49074J30628R0169J7259m3129q9650j26850j30640
12657A735672j18113j04198q7563p2259p4424o6113o1724p3937o0637m0240j8669
12646I57795j2337r205j7722j9787j5127k4847j4991o578k797k3388k9557p681
12634G73778J4545M129j889o907m798K015P899j0871j27J4611j0155J174j2201
12621G71203r516P993j0173o257j663P659j1443k3699N18R148K8066K3456K2150
12608H07442J8764J6422l665k805K750J0708K8083J6350J62L6082K2045J8852
12596I71190L8399L3791K9384K2576Q608k0804l8631l6286n1472m2663k8673n790
$$ plain form
12584 879629 870463 861226 864134 862765 878707 902213 932740 984531 1062669 1156599 1254258 1406144
12572 1406144 1578567 1762801 1972533 2146092 2245924 2263095 2207029 2095247 1972974 1846715
12562 1846715 1753518 1674613 1615661 1582765 1573903 1555777 1534941 1508123 1491237 1459643 1432465
12551 1432465 1420505 1420340 1428595 1452433 1491642 1552118 1631938 1721572 1814356 1907190 2002285 2099675
12539 2099675 2220760 2399384 2625986 2878211 3172268 3489256 3789487 4031610 4137686
12530 4137686 4114885 4002913 3830586 3639954 3440429 3272942 3146442 3055380 2991450 2962305
12520 2962305 2944941 2947220 2967971 3005077 3035339 3094011 3168468 3249276 3350952 3483504 3633284
12509 3633284 3798087 3967324 4153806 4342959 4518676 4706226 4922222 5165919 5450529
$$ packed form
12584H79629r166r237K908j369J5942K3506L0527N1791P8138R3930R7659J51886
12572A406144J72423J84234K09732J73559R9832J7171n6066j11782j22273j26259
12562A846715r3197p8905n8952l2896q862j8126k0836k6818j6886l1594k7178
12551A432465j1960j65Q255K3838L9209O0476P9820Q9634R2784R2834R5095R7390
12539B099675J21085J78624K26602K52225K94057L16988L00231K42123J06076
12530D137686k2801j11972j72327j90632j99525j67487j26500r1062o3930k9145
12520B962305j7364K279K0751L7106L0262N8672P4457Q0808J01676J32552J49780
12509C633284J64803J69237J86482J89153J75717J87550K15996K43697K84610
$$ plain form
12500 5450529 5779772 6168309 6611166 7098790 7615521 8134409 8596024 8989078 9348267
12491 9348267 9704881 10123359 10654859 11320152 12151740 13180486 14417083 15872920 17555313
12482 17555313 19519699 21774521 24378599 27417476 31023903 35359463 40707612 47382992
12474 47382992 55844408 66635204 80265927 96929909 116192854 137099045 158782471
12467 158782471 179728402 196525000 206540452 210869705 210307226 202826494 188664273
12460 188664273 171418471 153481201 135666611 118944707 104239416 91811845 81414383
12453 81414383 72601003 65027581 58483452 52760169 47676426 43159318 39145084 35582695
12445 35582695 32385076 29538866 26994471 24718546 22660825 20828991 19189494 17699798
$$ packed form
12500E450529L29243L88537M42857M87624N16731N18888M61615L93054L59189
12491I348267L56614M18478N31500O65293Q31588J028746J236597J455837J682393
12482A7555313J964386K254822K604078L038877L606427M335560N348149O675380
12474D7382992Q461416J0790796J3630723J6663982J9262945K0906191K1683426
12467A58782471K0945931J6796598J0015452M329253n62479p480732j4162221
12460A88664273j7245802j7937270j7814590j6721904j4705291j2427571j0397462
12453H1414383q813380p573422o544129n723283n083743m517108m014234l562389
12445C5582695l197619k846210k544395k275925k057721j831834j639497j489696
$$ plain form
12437 17699798 16330481 15100778 13976717 12929264 12000328 11151335 10384836 9682924 9039855
12428 9039855 8454667 7927067 7438496 6985451 6580853 6189006 5826561 5501789 5193497
12419 5193497 4918571 4679452 4458999 4238496 4047549 3878597 3711316 3559816 3414532
12410 3414532 3270309 3144558 3008460 2878242 2752504 2655368 2559679 2479472 2417181 2367870
12400 2367870 2329541 2304295 2279960 2267437 2274316 2274990 2255504 2225483 2179214 2137142 2078080 2004161
12388 2004161 1940603 1862204 1797245 1750630 1708760 1676613 1664694 1648920 1618360 1579222 1545139
12377 1545139 1524529 1498172 1468549 1430505 1402207 1376424 1341184 1307464 1259411 1219543 1187735
12366 1187735 1164722 1137836 1129613 1137853 1143288 1152819 1170337 1187959 1206273 1199274 1211517 1215851
$$ packed form
12437A7699798j369317j229703j124061j047453r28936q48993p66499p01912o43069
12428I039855n85188n27600m88571m53045m04598l91847l62445l24772l08292
12419E193497k74926k39119k20453k20503j90947j68952j67281j51500j45284
12410C414532j44223j25751j36098j30218j25738r7136r5689q0207o2291m9311
12400B367870l8329k5246k4335j2523O879O74j9486l0021m6269m2072n9062p3919
12388B004161o3558p8399o4959m6615m1870l2147j1919j5774l0560l9138l4083
12377A545139k0610k6357k9623l8044k8298k5783l5240l3720m8053l9868l1808
12366A187735k3013k6886q223Q240N435R531J7518J7622J8314o999J2243M334
$$ plain form
12354 1215851 1208395 1202443 1192008 1178991 1150246 1142753 1126932 1095003 1065882 1034715 997364 929890
12342 929890 853018 781688 696341 653124 604986 542692 520515 525911 533775 537170 549132 579306
12330 579306 601282 613668 630951 632724 624917 638604 663070 678428 688512 699260 710918 716847
12318 716847 712229 698868 680638 668225 647489 628723 618673 608489 610672 592692 543551 532813
12306 532813 535947 529695 507077 508847 504802 492447 484631 479813 473957 450423 440455 432587 432074 438159
12292 438159 444378 445715 451363 461144 459275 456554 456654 454596 444244 443316 451506 447876 444230 453182
12278 453182 444211 435963 430061 432761 439286 429075 405847 396740 392169 377601 366385 360396 354016
12265 354016 337076 310074 305833 299124 300450 311341 306857 303718 314764 321078 310586 306139 317330
$$ packed form
12354A215851p456n952j0435j3017k8745p493j5821l1929k9121l1167l7351o7474
12342I29890p6872p1330q5347m3217m8138o2294k2177N396P864L395J1962L0174
12330E79306K1976J2386J7283J773p807J3687K4466J5358J0084J0748J1658N929
12318G16847m618j3361j8230j2413k0736j8766j0050j0184K183j7980m9141j0738
12306E32813L134o252k2618J770m045j2355p816m818n856k3534r968p868n13O085
12292D38159O219J337N648R781j869k721J00k058j0352r28Q190l630l646Q952
12278D53182q971q248n902K700O525j0211k3228r107m571j4568j1216n989o380
12265C54016j6940k7002m241o709J326J0891m484l139J1046O314j0492m447J1191
$$ plain form
12252 317330 321382 331030 327757 312206 306404 320113 328423 316260 310082 296064 287068 264805 269148
12239 269148 274443 283142 282118 275208 278266 276525 281449 275419 281646 292063 283400 263848 253565
12226 253565 260236 264938 261892 266284 289251 292865 291608 296120 294549 289232 272991 264734 265382 276804
12212 276804 275831 259043 246111 251429 262923 250992 234832 236386 226894 225994 237874 237001 223520
12199 223520 215328 209944 218868 212113 206983 214112 214737 213399 216697 219257 209783 205389 193821 214684
12185 214684 240385 220542 200873 187608 172443 169185 182972 171650 172185 171879 171050 171801 175037
12172 175037 163072 167742 168988 170041 161262 165674 167899 155276 158128 167889 164067 161187 157490 154231
12158 154231 145475 150333 152804 143300 143577 148412 150125 162534 151118 143105 144899 145710 150602 152126
$$ packed form
12252C17330M052R648l273j5551n802J3709Q310j2163o178j4018q996k2263M343
12239B69148N295Q699j024o910L058j741M924o030O227J0417q663j9552j0283
12226B53565O671M702l046M392K2967L614j257M512j571n317j6241q257O48J1422
12212B76804r73j6788j2932N318J1494j1931j6160J554r492r00J1880q73j3481
12199B23520q192n384Q924o755n130P129O25j338L298K560r474m394j1568K0863
12185B14684K5701j9843j9669j3265j5165l258J3787j1322N35l06q29P51L236
12172A75037j1965M670J246J053q779M412K225j2623K852R761l822k880l697l259
12158A54231q756M858K471r504K77M835J713J2409j1416q013J794Q11M892J524
$$ plain form
12144 152126 140516 126314 135261 151165 153284 158314 165627 150619 143035 131790 129880 117591 101956
12131 101956 88329 102091 106040 111179 120635 120001 118531 122579 126317 106883 90169 81279 87462
12118 87462 92339 102836 107428 103130 96271 94147 84777 93966 90473 91480 92850 84954 85144 92421
12104 92421 94296 97220 103569 99386 96968 95620 81416 85165 94550 99054 102614 108472 94467 81446
12090 81446 84621 96264 106740 118117 125727 112625 100494 104234 120044 108188 106416 102793 91159
12077 91159 83956 79396 93995 108062 117928 118225 120333 102772 97715 102061 99025 110276 111841 120272
12063 120272 123163 116260 113611 111830 112780 105539 105205 118864 123882 132337 149867 167854 189387 204562
12049 204562 216680 231316 249358 276804 289666 308038 333175 381335 438303 505377 581672
$$ packed form
12144A52126j1610j4202Q947J5904K119N030P313j5008p584j1245j910j2289j5635
12131A01956j3627J3762L949N139R456o34j470M048L738j9434j6714q890O183
12118H7462M877J0497M592m298o859k124r370R189l493J007J370p896J90P277
12104I2421J875K924O349m183k418j348j4204L749R385M504L560N858j4005j3021
12090H1446L175J1643J0476J1377P610j3102j2131L740J5810j1856j772l623j1634
12077I1159p203m560J4599J4067R866K97K108j7561n057M346l036J1251J565Q431
12063A20272K891o903k649j781R50p241l34J3659N018Q455J7530J7987K1533J5175
12049B04562J2118J4636J8042K7446J2862J8372K5137M8160N6968O7074P6295
$$ plain form
12038 581672 675949 787674 903643 1002127 1079040 1107320 1119012 1125160 1102420 1026095 939895
12027 939895 856689 761738 667598 595504 528178 468471 432041 400565 360334 323119 286913
12016 286913 266477 240145 235070 204742 179463 164446 154384 139552 121102 117186 114763 103879
12004 103879 98699 83663 86359 91918 91184 91675 93347 112499 133786 129675 104567 105636 99211 99805
11990 99805 110004 95124 83703 92233 94999 101735 96799 100553 103882 110017 112899 98652 94594
11977 94594 106821 115178 109469 94345 84905 85191 87721 85443 89002 81455 68497 68588 66671 67333 68734
11962 68734 72104 77402 91218 104241 99351 98646 97697 96864 87532 87428 79339 65606 58391 65432 60077
11947 60077 56370 63316 57576 63882 70665 59424 50055 50095 57217 48458 50708 53627 48222 55886 52072
$$ packed form
12038E81672R4277J11725J15969R8484P6913K8280J1692O148k2740p6325q6200
12027I39895q3206r4951r4140p2094o7326n9707l6430l1476m0231l7215l6206
12016B86913k0436k6332n075l0328k5279j5017j0062j4832j8450l916k423j0884
12004A03879n180j5036K696N559p34M91J672J9152K1287m111k5108J069o425N94
11990I9805J0199j4880j1421Q530K766O736m936L754L329O135K882j4247m058
11977I4594J2227Q357n709j5124r440K86K530k278L559p547j2958R1j917O62J401
11962F8734L370N298J3816J3023m890p05r49q33r332j04q089j3733p215P041n355
11947F0077l707O946n740O306O783j1241r369M0P122q759K250K919n405P664l814
$$ plain form
11932 52072 47867 55231 59571 54404 45323 32795 26236 36857 52456 54456 57197 59321 59228 45148
11918 45148 42089 44681 53963 57166 37627 42977 31500 28496 45688 51038 38988 27173 13859
11905 13859 25963 53494 48560 41462 33666 24645 34051 44778 43583 59211 54672 35067 33788
11892 33788 42524 53425 50827 36276 45611 42327 37545 46003 42804 40526 29182 36199 40673 33767
11878 33767 32136 42190 42739 32156 46385 48927 37500 25310 37289 45781 56013 70361 72578
11865 72578 56831 52509 62768 77628 82156 71568 76534 88861 95187 91924 90365 89000 83050
11852 83050 69158 69531 71139 86348 79094 57067 45287 46383 55227 62688 65144 66776 78236
11839 78236 80766 68038 66814 72828 76506 75893 81822 87710 92537 102520 88323 74097 70768 64343
$$ packed form
11932E2072m205P364M340n167r081j2528o559J0621J5599K000K741K124r3j4080
11918D5148l059K592R282L203j9539N350j1477l004J7192N350j2050j1815j3314
11905A3859J2104K7531m934p098p796r021R406J0727j195J5628m539j9605j279
11892C3788Q736J0901k598j4551R335l284m782Q458l199k278j1344P017M474o906
11878C3767j631J0054N49j0583J4229K542j1427j2190J1979Q492J0232J4348K217
11865G2578j5747m322J0259J4860M528j0588M966J2327O326l263j559j365n950
11852H3050j3892L73J608J5209p254k2027j1780J096Q844P461K456J632J1460
11839G8236K530j2728j224O014L678o13N929N888M827R983j4197j4226l329o425
$$ plain form
11825 64343 54006 59120 68123 73387 73316 82535 75327 67152 66459 65871 64937 67965 71673 88484 101951
11810 101951 99337 100336 92965 83883 81911 72512 80728 94310 115072 120461 121667 114997 125383 121577
11796 121577 116115 114208 117354 109762 99242 94739 113593 136119 128421 124223 126109 130929 141194
11783 141194 140176 138648 146653 155823 148313 134776 127423 127519 131737 126115 124869 120812 126125 123883
11769 123883 117823 117741 137290 150269 146778 144703 147138 133779 118176 112822 124169 135890 143598
11756 143598 141929 136852 142588 147283 147475 124874 119787 134427 147312 129492 115512 131418 152576
11743 152576 177212 203293 245160 270439 279896 290556 277093 247405 219594 200358 186324 178797
11731 178797 186574 176188 150632 136653 135080 126356 112977 113051 120417 114508 115806 118275 116152 122124
$$ packed form
11825F4343j0337N114R003N264p1R219p208q175o93n88r34L028L708J6811J3467
11810A01951k614R99p371r082j972r399Q216J3582K0762N389J206o670J0386l806
11796A21577n462j907L146p592j0520m503J8854K2526p698m198J886M820J0265
11783A41194j018j528Q005R170p510j3537p353R6M218n622j246m057N313k242
11769A23883o060q2J9549J2979l491k075K435j3359j5603n354J1347J1721P708
11756A43598j669n077N736M695J92k2601n087J4640J2885j7820j3980J5906K1158
11743A52576K4636K6081M1867K5279R457J0660j3463k9688k7811j9236j4034p527
11731A78797P777j0386k5556j3979j573q724j3379P4P366n909J298K469k123N972
$$ plain form
11717 122124 119539 120365 126916 121653 115987 102003 94432 91460 83618 85545 87524 85544 84250 71411
11703 71411 65424 72287 84209 104512 130944 141214 122691 119067 106122 111545 109498 101283 93091
11690 93091 67590 48978 44345 56446 55965 58787 60008 53740 50204 64822 57296 49978 43570 32219
11676 32219 57062 60400 50823 53552 58929 52006 42315 25638 18072 15224 8720 6235 5317 19300
11662 19300 25680 12057 5112 7388 12040 15808 28391 43668 46723 51977 41254 38064 33178
11649 33178 30769 44177 56152 43348 41105 28929 26374 35349 28621 33809 38672 40406 45110
11636 45110 45783 43013 39819 42027 47850 43292 44292 50972 55357 57110 64240 65502 81477 78334
11622 78334 69283 72418 64334 59259 58041 56989 50024 28935 38254 38887 38079 30272 37603 33871 32196
$$ packed form
11717A22124k585Q26O551n263n666j3984p571k972p842J927J979j980j294j2839
11703G1411n987O863J1922K0303K6432J0270j8523l624j2945N423k047q215q192
11690I3091k5501j8612m633J2101m81K822J221o268l536J4618p526p318o408j1351
11676C2219K4843L338r577K729N377o923r691j6677p566k848o504k485r18J3983
11662A9300O380j3623o945K276M652L768J2583J5277L055N254j0723l190m886
11649C3178k409J3408J1975j2804k243j2176k555Q975o728N188M863J734M704
11636D5110O73k770l194K208N823m558J000O680M385J753P130J262J5975l143
11622G8334r051L135q084n075j218j052o965k1089R319O33q08p807P331l732j675
$$ plain form
11607 32196 28293 37067 18593 8227 29314 29549 38875 44709 35561 34865 37365 28640 22095 29111
11593 29111 33655 30030 38180 42423 28489 22425 15574 17087 30636 25733 14403 34376 45065
11580 45065 43336 39539 40642 39699 35756 32476 31104 35166 24714 29450 31338 17791 17823 21899 6821
11565 6821 -130 12182 27974 40567 46283 38144 22553 11962 5831 9356 17138 17905 24506 27212
11551 27212 33610 38269 38909 38670 33485 31044 32589 40266 38513 40792 42088 39480 18162 7296
11537 7296 6867 18798 42110 48872 37391 23880 13085 25612 50828 50146 46113 54986 56438
11524 56438 50684 64093 65436 60833 49115 28758 32354 42437 43263 54439 57107 43626 31377
11511 31377 11080 5338 -6496 187 -3452 -5931 9216 2781 964 -3521 2942 -2037 8510
$$ packed form
11607C2196l903Q774j8474j0366K1087K35R326N834r148o96K500q725o545P016
11593B9111M544l625Q150M243j3934o064o851J513J3549m903j1330J9973J0689
11580D5065j729l797J103r43l943l280j372M062j0452M736J888j3547L2M076j5078
11565F821o951J2312J5792J2593N716q139j5591j0591o131L525P782P67O601K706
11551B7212O398M659O40k39n185k441J545P677j753K279J296k608k1318j0866
11537G296m29J1931K3312O762j1481j3511j0795J2527K5216o82m033Q873J452
11524E6438n754J3409J343m603j1718k0357L596J0083Q26J1176K668j3481j2249
11511C1377k0297n742j1834O683l639k479J5147o435j817m485O463m979J0547
$$ plain form
11498 8510 10037 3043 7578 13105 23129 25338 28615 18075 7463 7646 5541 9392 7982 3123
11484 3123 13105 7325 4411 12605 10679 851 -15643 -15153 -5077 351 -10384 -9180 -16932 -20628
11470 -20628 -20530 -18512 -23265 124 31158 32431 21612 12766 15126 18171 20684 30857 31398 34112
11456 34112 46224 36647 28658 20699 29336 28949 33900 47323 35927 29509 30286 28227 22929 4493
11442 4493 6999 18300 26961 25714 14130 8562 11713 14763 15187 16771 18802 19529 11315 5324 8937
11427 8937 9505 2927 13552 12804 17400 14450 20031 24931 28367 22413 26405 28542 8065 661 -2315
11412 -2315 15802 25836 23694 22052 17076 14601 20330 21638 16698 -2193 1502 3949 3467 10936
11398 10936 11049 11599 8865 -173 -9090 4218 20400 18150 23013 20923 24682 16160 6466 3471
$$ packed form
11498H510J527o994M535N527J0024K209L277j0540j0612J83k105L851j410m859
11484C123R982n780k914Q194j926r828j6494M90J0076N428j0735J204p752l696
11470b0628R8K018m753K3389L1034J273j0819q846K360L045K513J0173N41K714
11456C4112J2112r577p989p959Q637l87M951J3423j1396o418P77k059n298j8436
11442D493K506J1301Q661j247j1584n568L151L050M24J584K031P27q214n991L613
11427H937N68o578J0625p48M596k950N581M900L436n954L992K137k0477p404k976
11412b315J8117J0034k142j642m976k475N729J308m940j8891L695K447m82P469
11398A0936J13N50k734r038q917J3308J6182k250M863k090L759q522r694k995
$$ plain form
11384 3471 10093 11487 7492 18268 24337 21640 20093 4642 -16542 -19154 -7371 10291 14686
11371 14686 -1021 -4461 -999 3998 5394 6224 24154 31332 37184 27566 21452 10772 -4399 -12249
11357 -12249 -12658 1654 15768 11849 9588 12138 19323 14599 34024 47916 49835 47200 23044
11344 23044 4572 -1565 3588 9463 7035 -1611 -3019 4171 11089 10358 12596 12366 20419 23579 14081
11329 14081 8856 -3596 2467 10255 14568 11996 999 -919 8313 11758 9859 8630 10740 19302
11315 19302 15168 10151 5580 6572 9940 28989 50882 52755 55720 64725 57213 53188 54156 57062
11301 57062 47165 45445 39589 49218 57076 42247 32931 40200 44542 44295 36899 30010 28987 25785
11287 25785 32525 30332 32138 27458 27179 29598 32042 39089 43227 52118 58316 60058 54714 66228
$$ packed form
11384C471O622J394l995J0776O069k697j547j5451k1184k612J1783J7662M395
11371A4686j5707l440L462M997J396Q30J7930P178N852r618o114j0680j5171p850
11357a2249m09J4312J4114l919k261K550P185m724J9425J3892J919k635k4156
11344B3044j8472o137N153N875k428q646j408P190O918p31K238k30Q053L160r498
11329A4081n225j2452O063P788M313k572j0997j918R232L445j899j229K110Q562
11315A9302m134n017m571R92L368J9049K1893J873K965R005p512m025R68K906
11301E7062r897j720n856R629P858j4829r316P269M342k47p396o889j023l202
11287B5785O740k193J806m680k79K419K444P047M138Q891O198J742n344J1514
$$ plain form
11273 66228 75975 82330 88894 95890 104494 115595 134943 147630 145365 144591 131285 105230 91475
11260 91475 90898 88236 73619 61558 55957 49541 54846 55038 41351 44065 42187 41577 55133 66999
11246 66999 65645 57467 43943 30470 19520 32918 40210 51044 49054 55764 56402 57644 67662
11233 67662 79465 89482 90494 97507 90692 86267 88126 85964 89252 90563 98026 97612 93419 88987
11219 88987 92789 105400 129447 157951 164092 171404 201118 284569 398173 514576 617156 671282
11207 671282 692270 688182 637864 545849 448339 376339 333374 303004 264053 240722 217952 202812
11195 202812 175601 134097 115203 102090 100853 104064 105592 107081 104791 101322 88917 99869 100619
11182 100619 89795 72702 77925 85961 88037 95277 98693 102627 95002 92981 89689 67895 60304
$$ packed form
11273F6228R747O355O564O996Q604J1101J9348J2687k265p74j3306k6055j3755
11260I1475n77k662j4617j2061n601o416N305J92j3687K714j878o10J3556J1866
11246F6999j354q178j3524j3473j0950J3398P292J0834j990O710O38J242J0018
11233F7662J1803J0017J012P013o815m425J859k162L288J311P463m14m193m432
11219H8987L802J2611K4047K8504O141P312K9714Q3451J13604J16403J02580N4126
11207F71282K0988m088n0318r2015r7510p2000m2965l0370l8951k3331k2770j5140
11195B02812k7211m1504j8894j3113j237L211J528J489k290l469j2405J0952P50
11182A00619j0824j7093N223Q036K076P240L416L934p625k021l292k1794p591
$$ plain form
11169 60304 68701 78423 65550 48368 34571 35825 36781 45643 56112 57691 56660 60236 68153 71268
11155 71268 72596 65879 51723 34154 33892 38056 34473 48507 51515 49112 44982 59071 83371
11142 83371 90932 76866 88154 101314 114297 124974 124509 111338 116033 117662 119806 132431 139435
11129 139435 133615 126552 124305 115535 120170 119714 126077 126709 133443 143750 149762 166500 183996 217665
11115 217665 263132 336840 445331 555200 630781 646741 639649 651985 646642 576864 480311
11104 480311 401764 351154 299896 260744 222492 211028 213415 196535 166254 149651 150900 169595
11092 169595 178580 164490 138994 130603 117484 105067 105400 116324 110030 94420 78399 69052 84223
11079 84223 90973 76012 74226 74328 56662 35851 32283 47547 47985 35321 29806 24307 18807 27404
$$ packed form
11169F0304Q397R722j2873j7182j3797J254R56Q862J0469J579j031L576P917L115
11155G1268J328o717j4156j7569k62M164l583J4034L008k403m130J4089K4300
11142H3371P561j4066J1288J3160J2983J0677m65j3171M695J629K144J2625P004
11129A39435n820p063k247q770M635m56O363O32O734J0307O012J6738J7496L3669
11115B17665M5467P3708J08491J09869P5581J5960p092J2336n343o9778r6553
11104D80311p8547n0610n1258l9152l8252j1464K387j6880l0281j6603J249J8695
11092A69595Q985j4090k5496q391j3119j2417L33J0924o294j5610j6021r347J5171
11079H4223O750j4961j786J02j7666k0811l568J5264M38j2664n515n499n500Q597
$$ plain form
11065 27404 27727 23227 32421 35485 35692 34395 34933 43702 39043 29576 30425 50564 55770 56136 54490
11050 54490 53135 66249 67338 67774 60752 63750 77680 72920 61814 59600 62678 60989 62260 67786
11036 67786 74428 80907 94021 90629 92662 86493 83088 78181 80828 71803 57907 52066 64301 71343
11022 71343 59677 62623 68699 56384 59835 71930 60913 43331 52744 52865 68423 80062 81509
11009 81509 79474 56697 57269 68550 76465 71066 61471 51221 47135 45570 51463 56189 70389 85287
10995 85287 87063 91671 92928 106494 112347 123092 126250 121325 123609 127561 138182 125259 103478
10982 103478 79775 70942 68261 74058 65272 76136 80953 80022 79533 75538 89446 116474 117705 106536
10968 106536 109716 100593 90397 89834 95653 94408 88915 78416 78433 80710 90024 96462 98461 89166
$$ packed form
11065B7404L23m500R194L064K07j297N38Q769m659r467Q49K0139N206L66j646
11050E4490j355J3114J089M36p022K998J3930m760j1106k214L078j689J271N526
11036F7786O642O479J3114l392K033o169l405m907K647r025j3896n841J2235P042
11022G1343j1666K946O076j2315L451J2095j1017j7582R413J21J5558J1639J447
11009H1509k035k2777N72J1281P915n399r595j0250m086j565N893M726J4200J4898
10995H5287J776M608J257J3566N853J0745L158m925K284L952J0621j2923k1781
10982A03478k3703q833k681N797q786J0864M817r31m89l995J3908K7028J231j1169
10968A06536L180r123j0196n63N819j245n493j0499J7K277R314O438J999r295
$$ plain form
10954 89166 79231 68591 63577 68074 83055 75824 81697 81890 96282 89346 77838 93274 126744
10941 126744 130058 114845 104794 93941 86950 90830 79649 71503 56242 58564 76086 92966
10929 92966 94745 89012 99702 108832 118362 123611 109890 94675 88717 81552 83304 90319 78006
10916 78006 66215 71792 79377 80206 81321 82646 66753 63662 65985 74702 73698 78866 85229 77721
10902 77721 80312 74281 62813 51959 51525 50061 53848 54238 44279 44552 52194 57620 54369 62514 72131
10887 72131 78605 89381 102653 103694 118166 126258 131544 131840 129407 116524 122048 117932 119928 132343
10873 132343 140418 155439 181812 207677 227168 237228 216136 182157 158781 136505 117456 104431
10861 104431 112357 119293 117122 116477 118011 108799 113951 115461 108437 112042 125130 122143 111402 100681
$$ packed form
10954H9166r935j0640n014M497J4981p231N873J93J4392o936j1508J5436L3470
10941A26744L314j5213j0051j0853o991L880j1181q146j5261K322J7522J6880
10929I2966J779n733J0690R130R530N249j3721j5215n958p165J752P015j2313
10916G8006j1791N577P585Q29J115J325j5893l091K323Q717j004N168O363p508
10902G7721K591o031j1468j0854m34j464L787L90r959K73P642N426l251Q145R617
10887G2131O474J0776J3272J041J4472Q092N286K96k433j2883N524m116J996J2415
10873A32343Q075J5021K6373K5865J9491J0060k1092l3979k3376k2276j9049j3025
10861A04431P926O936k171o45J534r212N152J510p024L605J3088k987j0741j0721
$$ plain form
10847 100681 120839 136920 150041 163184 164612 176959 174600 162707 163634 172516 186242 198769
10835 198769 221110 250022 273913 314429 341838 376368 431918 508731 605293 710535 844981
10824 844981 1013450 1203038 1363235 1492115 1511424 1448316 1322180 1196292 1077383 977091
10814 977091 907278 862617 818167 791450 756197 729825 727171 721988 703755 676332 653522 633909
10802 633909 620141 599324 592641 592255 608403 620901 633979 674817 738459 820022 915335 1042778
10790 1042778 1201425 1424193 1681582 1948598 2186347 2394048 2546656 2596262 2511377 2350435
10780 2350435 2145653 1920431 1723744 1577649 1451039 1341904 1254278 1166917 1096302 1043802
10770 1043802 987702 939532 891316 852423 809739 793012 776790 754250 736808 746719 748136 748294
$$ packed form
10847A00681K0158J6081J3121J3143J428J2347k359j1893R27Q882J3726J2527
10835A98769K2341K8912K3891M0516K7409L4530N5550P6813R6562J05242J34446
10824H44981J68469J89588J60197J28880J9309o3108j26136j25888j18909j00292
10814I77091o9813m4661m4450k6717l5253k6372k654n183j8233k7423k2810j9613
10802F33909j3768k0817o683l86J6148J2498J3078M0838O3642Q1563R5313J27443
10790A042778J58647K22768K57389K67016K37749K07701J52608M9606q4885j60942
10780B350435k04782k25222j96687j46095j26610j09135q7626q7361p0615n2500
10770A043802n6100m8170m8216l8893m2684j6727j6222k2540j7442R911J417J58
$$ plain form
10758 748294 755907 759849 775857 795519 852175 918078 1004868 1125353 1268909 1410247 1528748
10747 1528748 1602901 1599948 1528348 1394770 1252763 1143556 1054207 984506 909782 862806 824357
10736 824357 780480 742661 715849 691030 655298 634010 624113 600096 576476 575148 582546 577821
10724 577821 585597 600968 613893 641054 657076 678403 701487 742409 779714 798714 790100 773302
10712 773302 772222 785062 823844 883349 969525 1114566 1318835 1585168 1874377 2161365 2449471
10701 2449471 2743371 2915634 2861682 2640929 2410763 2155445 1908168 1695901 1533477 1404192
10691 1404192 1322413 1279871 1259142 1263657 1311755 1403138 1547565 1726473 1921421 2083934 2144735
10680 2144735 2079269 1938187 1769257 1612975 1487499 1380319 1276085 1156919 1039066 924705
$$ packed form
10758G48294P613L942J6008J9662N6656O5903Q6790J20485J43556J41338J18501
10747A528748P4153k953p1600j33578j42007j09207q9349o9701p4724m6976l8449
10736H24357m3877l7819k6812k4819l5732k1288r897k4017k3620j328P398m725
10724E77821P776J5371J2925K7161J6022K1327K3084M0922L7305J9000q614j6798
10712G73302j080J2840L8782N9505Q6176J45041K04269K66333K89209K86988K88106
10701B449471K93900J72263n3952k20753k30166k55318k47277k12267j62424j29285
10691A404192q1779m2542k0729M515M8098R1383J44427J78908J94948J62513O0801
10680B144735o5466j41082j68930j56282j25476j07180j04234j19166j17853j14361
$$ plain form
10670 924705 841179 771041 714261 661006 631191 590087 551455 525225 481984 446168 436325 422795
10658 422795 411205 407360 411490 411956 402378 424148 437170 428497 438737 462793 478514 493456 515710
10645 515710 541606 561495 565457 548411 540257 536255 529563 503259 460777 438373 413613 401640
10633 401640 383479 370391 356887 349737 340391 330223 333496 334612 318904 312832 322522 333324 345753
10620 345753 345922 359977 389358 417204 421693 425705 418385 409582 405557 394522 406473 388869 376225
10607 376225 377138 373942 370974 362225 356955 379145 386731 397380 387479 392119 409426 417925 421371 439350
10593 439350 454941 462183 474373 490443 486098 468022 465044 483187 496413 516604 523009 529170
10581 529170 548114 557074 565385 561862 566255 549010 552869 552626 552070 548871 544926 543519 548175 559397
$$ packed form
10670I24705q3526p0138n6780n3255k9815m1104l8632k6230m3241l5816r843j3530
10658D22795j1590l845M130M66r578K1770J3022q673J0240K4056J5721J4942K2254
10645E15710K5896J9889L962j7046q154m002o692k6304m2482k2404k4760j1973
10633D01640j8161j3088j3504p150r346j0168L273J116j5708o072R690J0802J2429
10620C45753J69J4055K9381K7846M489M012p320q803m025j1035J1951j7604j2644
10607C76225R13l196k968q749n270K2190P586J0649r901M640J7307Q499L446J7979
10593D39350J5591P242J2190J6070m345j8076k978J8143J3226K0191O405O161
10581E29170J8944Q960Q311l523M393j7245L859k43n56l199l945j407M656J1222
$$ plain form
10567 559397 584101 594290 611250 626220 649835 689431 730958 771970 817827 879247 953626
10556 953626 1049258 1165224 1316869 1482818 1688418 1930925 2171594 2362242 2426714 2387039
10546 2387039 2285799 2173854 2025916 1901468 1801819 1741758 1709505 1690318 1676905 1668161 1667349
10535 1667349 1641670 1599426 1536604 1486159 1460755 1440752 1446255 1479110 1509955 1565294 1670593
10524 1670593 1809913 2017298 2316004 2691163 3131152 3606951 4062092 4389099 4553415
10515 4553415 4600637 4568363 4465518 4323360 4131965 3876740 3577400 3274940 2985119 2706326
10505 2706326 2454199 2250396 2068881 1917216 1791428 1684735 1594379 1517762 1446689 1398660
10495 1398660 1345864 1313648 1294520 1286269 1270223 1255593 1236764 1222279 1209338 1207450 1225882 1254037
$$ packed form
10567E59397K4704J0189J6960J4970K3615L9596M1527M1012M5857O1420P4379
10556I53626R5632J15966J51645J65949K05600K42507K40669J90648O4472l9675
10546B387039j01240j11945j47938j24448r9649o0061l2253j9187j3413q744q12
10535A667349k5679m2244o2822n0445k5404k0003N503L2855L0845N5339J05299
10524A670593J39320K07385K98706L75159M39989M75799M55141L27007J64316
10515D553415M7222l2274j02845j42158j91395k55225k99340l02460k89821k78793
10505B706326k52127k03803j81515j51665j25788j06693r0356p6617p1073m8029
10495A398660n2796l2216j9128q251j6046j4630j8829j4485j2941j888J8432K8155
$$ plain form
10483 1254037 1293690 1358490 1463757 1596991 1750136 1914648 2053687 2125701 2082239 1942510
10473 1942510 1776648 1622617 1492721 1378468 1299491 1233048 1185196 1146456 1115294 1079175
10463 1079175 1065866 1037904 1026031 1032361 1036710 1057916 1085627 1121171 1155221 1220358 1295954 1381264
10451 1381264 1458277 1533743 1591004 1633231 1662405 1675303 1656262 1601482 1540582 1483991 1452004
10440 1452004 1439355 1453565 1488546 1552671 1621152 1699101 1810227 1940628 2088292 2262002
10430 2262002 2429916 2582152 2679938 2713365 2696592 2634486 2539417 2415398 2269300 2127373
10420 2127373 1966238 1798356 1632680 1504778 1407558 1332888 1299134 1306452 1310506 1335971 1390997
10409 1390997 1461407 1531449 1607902 1703870 1812408 1956461 2098377 2250139 2370185 2466979
$$ packed form
10483A254037L9653O4800J05267J33234J53145J64512J39039P2014m3462j39729
10473A942510j65862j54031j29896j14253p8977o6443m7852l8740l1162l6119
10463A079175j3309k7962j1873O330M349K1206K7711L5544L4050O5137P5596Q5310
10451A381264P7013P5466N7261M2227K9174J2898j9041n4780o0900n6591l1987
10440A452004j2649J4210L4981O4125O8481P7949J11126J30401J47664J73710
10430B262002J67914J52236R7786L3427j6773o2106r5069j24019j46098j41927
10420B127373j61135j67882j65676j27902r7220p4670l3754P318M054K5465N5026
10409A390997P0410P0042P6453R5968J08538J44053J41916J51762J20046R6794
$$ plain form
10399 2466979 2494969 2454722 2405684 2350219 2314781 2297636 2312588 2356662 2416631 2516353 2643678
10388 2643678 2785851 2952153 3130459 3299627 3448340 3557183 3599639 3585406 3538356 3458445
10378 3458445 3347462 3231313 3138337 3065580 2995348 2971034 2975544 3005687 3072255 3169705 3301553
10367 3301553 3467484 3695649 3991369 4355611 4808422 5386157 6086862 6888269 7792495
10358 7792495 8678466 9386647 9976782 10430605 10481090 10074117 9521584 8952770 8333044 7730002
10348 7730002 7227296 6879308 6679734 6571181 6512605 6533312 6640990 6801715 7046118 7386953
10338 7386953 7792279 8247519 8730439 9236553 9773128 10354704 10972642 11640923 12323173
10329 12323173 13016125 13736952 14374964 14817409 15185014 15583533 16009498 16537106 17248953
$$ packed form
10399B466979K7990m0247m9038n5465l5438j7145J4952M4074N9969R9722J27325
10388B643678J42173J66302J78306J69168J48713J08843M2456j4233m7050p9911
10378C458445j10983j16149r2976p2757p0232k4314M510L0143O6568R7450J31848
10367C301553J65931K28165K95720L64242M52811N77735P00705Q01407R04226
10358G792495Q85971P08181N90135M53823N0485m06973n52533n68814o19726o03042
10348G730002n02706l47988j99574j08553n8576K0707J07678J60725K44403L40835
10338G386953M05326M55240M82920N06114N36575N81576O17938O68281O82250
10329A2323173O92952P20827O38012M42445L67605L98519M25965N27608P11847
$$ plain form
10320 17248953 18116158 19099727 20205424 21440061 22734321 23978196 25157877 26477976
10312 26477976 28058940 29997898 32476385 35674046 39731782 44849625 51389317 59791649
10304 59791649 70698540 85267142 105106148 132170457 168101248 212187214 258933198
10297 258933198 301624006 340525729 373612247 385478856 370148044 343235336 312288066
10290 312288066 274259236 233501279 197701514 169094558 146729034 128904646 114150874
10283 114150874 101636900 90754245 81085562 72530795 65041074 58566170 53033724 48318277
10275 48318277 44280745 40787596 37710253 34981719 32475461 30066591 27740239 25569768
10267 25569768 23536904 21612740 19840888 18244761 16820243 15526980 14371036 13359759
$$ packed form
10320A7248953Q67205R83569J105697J234637J294260J243875J179681J320099
10312B6477976J580964J938958K478487L197661M057736N117843O539692Q402332
10304E9791649J0906891J4568602J9839006K7064309L5930791M4085966M6745984
10297B58933198M2690808L8901723L3086518J1866609j5330812k6912708l0947270
10290C12288066l8028830m0757957l5799765k8606956k2365524j7824388j4753772
10283A14150874j2513974j0882655r668683q554767p489721o474904n532446m715447
10275D8318277m037532l493149l077343k728534k506258k408870k326352k170471
10267B5569768k032864j924164j771852j596127j424518j293263j155944j011277
$$ plain form
10259 13359759 12459272 11636349 10872933 10157658 9501870 8910025 8391172 7905656 7446976
10250 7446976 7010679 6601832 6214424 5853767 5523943 5215846 4934431 4679530 4444416
10241 4444416 4235297 4044549 3882095 3731136 3593559 3470075 3330658 3193249 3086603
10232 3086603 2987241 2900587 2828205 2763306 2698846 2639527 2592185 2570175 2537834 2502352 2467971
10221 2467971 2439935 2431069 2429519 2416805 2383175 2337477 2303917 2268758 2228006 2168491 2132703 2086715
10209 2086715 2042134 1993751 1941865 1885505 1848911 1809010 1764667 1727052 1678937 1626294 1594729
10198 1594729 1563875 1524708 1485264 1449205 1439206 1433599 1422550 1386412 1375247 1380051 1382367 1387540
10186 1387540 1409195 1435791 1471474 1499844 1537729 1570664 1600852 1631666 1658574 1665001 1658079 1630811
$$ packed form
10259A3359759r00487q22923p63416p15275o55788n91845n18853m85516m58680
10250G446976m36297m08847l87408l60657l29824l08097k81415k54901k35114
10241D444416k09119j90748j62454j50959j37577j23484j39417j37409j06646
10232C086603r9362q6654p2382o4899o4460n9319m7342k2010l2341l5482l4381
10221B467971k8036q866j550j2714l3630m5698l3560l5159m0752n9515l5788m5988
10209B086715m4581m8383n1886n6360l6594l9901m4343l7615m8115n2643l1565
10198A594729l0854l9167l9444l6059r999n607j1049l6138j1165M804K316N173
10186A387540K1655K6596L5683K8370L7885L2935L0188L0814K6908O427o922k7268
$$ plain form
10174 1630811 1557821 1442763 1314791 1143130 969022 818608 724733 683598 653607 679959
10164 679959 736034 805404 869160 918105 944438 938809 928350 910610 904608 897318 899835 919494
10152 919494 934615 962341 980875 1010209 1029411 1040162 1048339 1054289 1062571 1061148 1047645 1017684
10140 1017684 979167 936654 908133 894166 877045 868298 855769 857523 830067 814355 804291 784657
10128 784657 757753 741930 724742 708239 706262 704217 709571 712913 730178 749958 762172 777044
10116 777044 788276 803251 805095 781794 782062 786686 790179 789922 785063 783227 776851 749743 729204
10103 729204 693397 667832 655266 630130 592412 571896 559773 535880 511017 495260 493141 496215
10091 496215 490185 469954 468638 477963 506343 525244 517567 518167 533389 538860 531767 528676 522385
$$ packed form
10174A630811p2990j15058j27972j71661j74108j50414r3875m1135k9991K6352
10164F79959N6075O9370O3756M8945K6333n629j0459j7740o002p290K517J9659
10152I19494J5121K7726J8534K9334J9202J0751Q177N950Q282j423j3503k9961
10140A017684l8517m2513k8521j3967j7121q747j2529J754k7456j5712j0064j9634
10128G84657k6904j5823j7188j6503j977k045N354L342J7265J9780J2214J4872
10116G77044J1232J4975J844k3301K68M624L493k57m859j836o376k7108k0539
10103G29204l5807k5565j2566k5136l7718k0516j2123k3893k4863j5757k119L074
10091D96215o030k0231j316R325K8380J8901p677O00J5222N471p093l091o291
$$ plain form
10078 522385 521758 516352 507898 488726 469912 463760 486002 517676 541378 564097 585208 619892
10066 619892 654818 664922 689932 714330 700178 677261 659823 621869 588363 580851 581551 587356
10054 587356 584553 569959 560397 541206 545463 551132 541652 518827 510325 506502 496860 497805 495293 493052
10040 493052 484302 482820 477791 468822 464685 468117 475032 470845 460008 456122 450645 448175 446997 445654
10026 445654 451555 459816 464491 481192 486247 493646 504976 505932 504028 497028 487250 487999 477518 492667
10012 492667 496056 474187 459353 452545 442191 442012 445870 445651 458221 481121 488034 494750 522968
9999 522968 548343 577872 594464 625512 656651 697192 743930 838363 969645 1149980 1404727
9988 1404727 1800713 2346309 2919382 3031734 2573074 2106529 1763184 1518162 1356732 1266907
$$ packed form
10078E22385o27n406q454j9172j8814o152K2242L1674K3702K2719K1111L4684
10066F19892L4926J0104K5010K4398j4152k2917j7438l7954l3506p512P00N805
10054E87356k803j4594r562j9191M257N669r480k2825q502l823r642R45k512k241
10040D93052q750j482n029q969m137L432O915m187j0837l886n477k470j178j343
10026D45654N901Q261M675J6701N055P399J1330R56j904p000r778P49j0481J5149
10012D92667L389k1869j4834o808j0354j79L858k19J2570K2900O913O716K8218
9999E22968K5375K9529J6592L1048L1139M0541M6738R4433J31282J80335K54747
9988A404727L95986N45596N73073J12352m58660m66545l43345k45022j61430q9825
$$ plain form
9978 1266907 1228962 1182273 1123295 1044231 979421 925170 866847 818209 777378 748957 711165
9967 711165 683647 663296 637509 615485 600463 584940 576396 561422 541718 526823 520880 501791
9955 501791 492274 476586 455589 452364 446659 460018 461977 449501 464877 473564 497825 514607 529052
9942 529052 541589 533829 516947 509939 512475 505573 491951 492906 476481 455100 451705 467821 478363
9929 478363 489688 500631 501806 492965 486768 475908 480456 497073 524318 534995 554319 574088
9917 574088 581669 595420 587275 569226 545549 522626 512019 519072 520525 521226 516118 518019 516988
9904 516988 518448 517399 523867 533393 539688 546022 569629 600673 626743 646954 679538 738159 822686
9891 822686 938544 1085210 1273644 1512672 1771126 2005799 2230907 2434047 2553949 2509643
$$ packed form
9978A266907l7945m6689n8978p9064o4810n4251n8323m8638m0831k8421l7792
9967G11165k7518k0351k5787k2024j5022j5523q544j4974j9704j4895n943j9089
9955E01791r517j5688k0997l225n705J3359J959j2476J5376Q687K4261J6782J4445
9942E29052J2537p760j6882p008K536o902j3622R55j6425k1381l395J6116J0542
9929D78363J1325J0943J175q841o197j0860M548J6617K7245J0677J9324J9769
9917E74088P581J3751q145j8049k3677k2923j0607P053J453P01n108J901j031
9904E16988J460j049O468R526O295O334K3607L1044K6070K0211L2584N8621Q4527
9891H22686J15858J46666J88434K39028K58454K34673K25108K03140J19902m4306
$$ plain form
9881 2509643 2363941 2201474 2009547 1787219 1581501 1421476 1294938 1201029 1121421 1057399
9871 1057399 997405 945837 904782 865910 842630 828542 844102 838387 815665 798509 788304 778858
9859 778858 761827 741799 716977 713947 710494 700048 687017 660595 636731 614101 607043 592095
9847 592095 568810 562766 538700 515857 486316 458214 451516 434390 424445 423397 421513 402000 392081
9834 392081 397850 397450 391765 406765 422340 432436 431566 438903 432882 428298 429806 425414 425076 440280
9820 440280 441517 431505 430160 427057 405617 414520 429372 432717 437474 441505 432533 428991 457132
9807 457132 495081 507272 525321 548685 588123 644049 699656 801910 944522 1123907 1342367
9796 1342367 1496354 1505480 1381296 1210573 1049244 920605 828864 776219 738458 717628 700708
$$ packed form
9881B509643j45702j62467j91927k22328k05718j60025j26538r3909p9608o4022
9871A057399n9994n1568m1055l8872k3280j4088J5560n715k2722j7156j0205r446
9859G78858j7031k0028k4822l030l453j0446j3031k6422k3864k2630p058j4948
9847E92095k3285o044k4066k2843k9541k8102o698j7126r945j048j884j9513r919
9834C92081N769m00n685J5000J5575J0096q70P337o021m584J508m392l38J5204
9820D40280J237j0012j345l103k1440Q903J4852L345M757M031q972l542K8141
9807D57132L7949J2191J8049K3364L9438N5926N5607J02254J42612J79385K18460
9796A342367J53987R126j24184j70723j61329j28639r1741n2645l7761k0830j6920
$$ plain form
9785 700708 688333 664141 654996 654711 640342 630042 639667 647524 655427 683836 710211 734789 781058
9772 781058 844471 926143 1058017 1229474 1440076 1630197 1697920 1605117 1447198 1300603
9762 1300603 1194645 1115669 1066074 1034506 1004583 986401 974800 992582 1020956 1060676 1109167
9751 1109167 1144248 1157378 1193086 1254423 1316724 1346202 1345000 1328112 1314390 1326397 1359419 1416258
9739 1416258 1520837 1662899 1861738 2130673 2511901 3033654 3740224 4679125 5787337
9730 5787337 6915239 7810716 8128451 7782269 7006036 6089350 5240267 4553255 4030873
9721 4030873 3662348 3358846 3094400 2861303 2656761 2472419 2306372 2166467 2037599 1905434
9711 1905434 1794650 1710498 1628274 1545508 1485655 1445687 1414823 1366609 1302736 1235256 1174039
$$ packed form
9785G00708j2375k4192r145k85j4369j0300R625P857P903K8409K6375K4578M6269
9772G81058O3413Q1672J31874J71457K10602J90121O7723r2803j57919j46595
9762A300603j05958p8976m9595l1568k9923j8182j1601J7782K8374L9720M8491
9751A109167L5081J3130L5708O1337O2301K9478j202j6888j3722J2007L3022N6839
9739A416258J04579J42062J98839K68935L81228N21753P06570R38901J108212
9730E787337J127902Q95477L17735l46182p76233r16686q49083o87012n22382
9721D030873l68525l03502k64446k33097k04542j84342j66047j39905j28868j32165
9711A905434j10784q4152q2224q2766n9853l9968l0864m8214o3873o7480o1217
$$ plain form
9700 1174039 1113965 1056340 1008183 964939 930983 901862 880496 854531 836041 818625 801875
9689 801875 792439 790568 768544 748721 747277 744619 754578 758087 759742 760028 760598 758559 749419 736058
9675 736058 740129 754825 763457 770814 753143 754006 756974 747305 743529 740877 737284 735948 744947 731382
9661 731382 715458 705077 680148 654832 655602 635299 616806 623059 624444 624915 627892 628822 629249 626861
9647 626861 637997 653330 663936 659279 656066 659760 673942 680246 688361 693916 717680 738547 736326
9634 736326 751730 752248 746552 740497 716015 704791 725138 746535 740147 745250 742518 732910 728005
9621 728005 723969 723626 728889 740871 736609 747477 751415 763906 766866 771272 770064 764733 762713 767123
9607 767123 771709 784264 805683 827357 837916 853959 839210 822593 826972 830035 819068 811670
$$ packed form
9700A174039o0074n7625m8157m3244l3956k9121k1366k5965j8490j7416j6750
9689H01875r436j871k2024j9823j444k658R959L509J655K86N70k039r140j3361
9675G36058M071J4696Q632P357j7671Q63K968r669l776k652l593j336Q999j3565
9661G31382j5924j0381k4929k5316P70k0303j8493O253J385M71K977R30M27k388
9647F26861J1136J5333J0606m657l213L694J4182O304Q115N555K3764K0867k221
9634G36326J5404N18n696o055k4482j1224K0347K1397o388N103k732r608m905
9621G28005m036l43N263J1982m262J0868L938J2491K960M406j208n331k020M410
9607G67123M586J2555K1419K1674J0559J6043j4749j6617M379L063j0967p398
$$ plain form
9595 811670 821288 829460 829443 828741 831379 829729 827561 823727 811659 802768 788295 785282 787900 780867 777386
9580 777386 768955 773602 781309 787950 807060 815504 827507 860783 894794 927727 956844 1003697 1047810
9567 1047810 1089659 1146146 1205515 1296438 1418529 1602223 1822462 2015629 2030913 1863746
9557 1863746 1668232 1495200 1348263 1254732 1205719 1174432 1144862 1113341 1081471 1032986 994989
9546 994989 954847 918189 912508 903818 895962 872125 855728 860541 848482 843505 857965 862493 870474
9533 870474 886894 895804 896840 904362 908003 915212 916512 917714 922481 929260 962493 981171 986776 976900
9519 976900 968336 956152 954743 948958 948370 945082 943994 941500 933252 922447 906004 889130 870307
9506 870307 851295 837587 838142 834576 829941 834153 844389 842609 840542 845025 852206 874083 925581
$$ packed form
9595H11670R618Q172j7p02K638j650k168l834j2068q891j4473l013K618p033l481
9580G77386q431M647P707O641J9110Q444J2003L3276L4011L2933K9117M6853M4113
9567A047810M1849N6487N9369R0923J22091J83694K20239J93167J5284j67167
9557A863746j95514j73032j46937r3531m9013l1287k9570l1521l1870m8485l7997
9546I94989m0142l6658n681q690p856k3837j6397M813j2059m977J4460M528P981
9533H70474J6420Q910J036P522L641P209J300J202M767O779L3233J8678N605r876
9519I76900q564j2184j409n785n88l288j088k494q248j0805j6443j6874j8823
9506H70307j9012j3708N55l566m635M212J0236j780k067M483P181K1877N1498
$$ plain form
9493 925581 989705 1043940 1073621 1081768 1073001 1075293 1079918 1071130 1067263 1059042 1051183 1050739 1050961 1055760
9479 1055760 1083596 1102932 1132447 1149719 1142455 1111735 1075609 1048908 1039998 1035928 1035496 1034667 1040044
9466 1040044 1036350 1015024 1016954 1005374 988080 973108 973081 981254 982189 991243 990648 986976 983941 992478
9452 992478 1006248 1023505 1037254 1049901 1054480 1063618 1073767 1075859 1077949 1090435 1092464 1107612 1132952
9439 1132952 1147102 1162982 1174343 1174503 1166448 1161595 1166563 1181453 1193824 1207014 1232544 1248661
9427 1248661 1255207 1250276 1226431 1206034 1213361 1205422 1189814 1192214 1194737 1193223 1199634 1200529 1196993 1185939
9413 1185939 1189042 1192924 1194001 1192931 1192111 1206163 1224536 1242486 1235480 1237310 1246067 1243890 1245797 1247550
9399 1247550 1238115 1250124 1265824 1272319 1296664 1323711 1332690 1335393 1329196 1326804 1325884 1320166 1327180
$$ packed form
9493I25581O4124N4235K9681Q147q767K292M625q788l867q221p859m44K22M799
9479A055760K7836J9336K9515J7272p264l0720l6126k6701q910m070m32q29N377
9466A040044l694k1326J930j1580j7294j4972k7Q173R35R054n95l672l035Q537
9452I92478J3770J7257J3749J2647M579R138J0149K092K090J2486K029J5148K5340
9439A132952J4150J5880J1361J60q055m853M968J4890J2371J3190K5530J6117
9427A248661O546m931k3845k0397P327p939j5608K400K523j514O411Q95l536j1054
9413A185939L103L882J077j070q20J4052J8373J7950p006J830Q757k177J907J753
9399A247550r435J2009J5700O495K4345K7047Q979K703o197k392r20n718P014
$$ plain form
9386 1327180 1325398 1333059 1339597 1336090 1342408 1360802 1371366 1372527 1397947 1410546 1413784 1444291 1469240
9373 1469240 1481500 1500346 1503239 1508771 1518869 1525366 1551438 1591310 1604732 1621704 1634777 1631940
9361 1631940 1633706 1649657 1671218 1699295 1727169 1745915 1758866 1774813 1795538 1821609 1858281 1868322
9349 1868322 1888676 1926997 1955548 1988167 2034118 2067637 2110926 2139717 2161743 2168106 2174100 2177382
9337 2177382 2192277 2214368 2217071 2227818 2252764 2273324 2302296 2351549 2391394 2412519 2429730 2455387
9325 2455387 2490449 2527160 2565016 2599082 2636462 2666220 2700988 2729603 2761446 2808639 2838134
9314 2838134 2865033 2894172 2931130 2962514 3000900 3040866 3072986 3111141 3154590 3204610 3246920
9303 3246920 3288593 3333632 3386364 3435898 3487040 3538076 3595779 3668957 3719046 3775965 3833980
$$ packed form
9386A327180j782P661O538l507O318J8394J0564J161K5420J2599L238L0507K4949
9373A469240J2260J8846K893N532J0098O497K6072L9872J3422J6972J3073k837
9361A631940J766J5951K1561K8077K7874J8746J2951J5947K0725K6071L6672J0041
9349A868322K0354L8321K8551L2619M5951L3519M3289K8791K2026O363N994L282
9337B177382J4895K2091K703J0747K4946K0560K8972M9253L9845K1125J7211K5657
9325B455387L5062L6711L7856L4066L7380K9758L4768K8615L1843M7193K9495
9314B838134K6899K9139L6958L1384L8386L9966L2120L8155M3449N0020M2310
9303C246920M1673M5039N2732M9534N1142N1036N7703P3178N0089N6919N8015
$$ plain form
9292 3833980 3888897 3949507 4011781 4070621 4141898 4214059 4296923 4380130 4442805 4506873 4592550
9281 4592550 4666316 4727516 4801220 4904020 4996967 5084469 5177599 5277721 5388368 5501009 5597017
9270 5597017 5701500 5804526 5908908 6029848 6158271 6286838 6413232 6547151 6690563 6834352
9260 6834352 6983949 7132385 7282066 7446140 7610748 7769520 7944277 8141900 8349779 8545037
9250 8545037 8732543 8939854 9163102 9397395 9635994 9889594 10144797 10392650 10653177 10939510
9240 10939510 11228882 11519437 11815358 12129492 12458396 12791461 13145600 13507780 13876197
9231 13876197 14267303 14679660 15100743 15519021 15957339 16433667 16941063 17439478 17956663
9222 17956663 18499070 19064049 19653777 20264171 20877131 21517929 22199110 22891666 23616545
$$ packed form
9292C833980N4917O0610O2274N8840P1277P2161Q2864Q3207O2675O4068Q5677
9281D592550P3766O1200P3704J02800R2947Q7502R3130J00122J10647J12641R6008
9270E597017J04483J03026J04382J20940J28423J28567J26394J33919J43412J43789
9260F834352J49597J48436J49681J64074J64608J58772J74757J97623K07879J95258
9250H545037J87506K07311K23248K34293K38599K53600K55203K47853K60527K86333
9240A0939510K89372K90555K95921L14134L28904L33065L54139L62180L68417
9231A3876197L91106M12357M21083M18278M38318M76328N07396M98415N17185
9222A7956663N42407N64979N89728O10394O12960O40798O81181O92556P24879
$$ plain form
9213 23616545 24361799 25118603 25896664 26693550 27529650 28372700 29220955 30099713 30999928
9204 30999928 31902489 32820574 33727852 34656739 35595848 36515002 37425113 38324548 39234091
9195 39234091 40126267 40977363 41795976 42571146 43297054 43974600 44620660 45201268 45708182
9186 45708182 46136342 46493491 46776499 46974959 47076707 47103204 47052117 46920175 46719748 46447113
9176 46447113 46081427 45654115 45163375 44618540 44001833 43353569 42669432 41934211 41179895
9167 41179895 40395449 39581318 38735059 37875518 37014944 36142842 35276104 34418171 33534284
9158 33534284 32654917 31791245 30944444 30099618 29278444 28474417 27678511 26899678 26132506
9149 26132506 25371440 24626484 23925294 23247405 22592844 21956629 21343495 20742233 20153981
$$ packed form
9213B3616545P45254P56804P78061P96886Q36100Q43050Q48255Q78758R00215
9204C0999928R02561R18085R07278R28887R39109R19154R10111Q99435R09543
9195C9234091Q92176Q51096Q18613P75170P25908O77546O46060N80608N06914
9186D5708182M28160L57149K83008J98460J01748K6497n1087j31942k00427k72635
9176D6447113l65686m27312m90740n44835o16707o48264o84137p35221p54316
9167D1179895p84446q14131q46259q59541q60574q72102q66738q57933q83887
9158C3534284q79367q63672q46801q44826q21174q04027p95906p78833p67172
9149B6132506p61066p44956p01190o77889o54561o36215o13134o01262n88252
$$ plain form
9140 20153981 19573408 19013731 18477222 17951241 17437838 16944190 16486917 16037896 15599160
9131 15599160 15168523 14763087 14384909 13982053 13601155 13239876 12907858 12586322 12281653
9122 12281653 11979584 11695175 11405004 11116341 10846419 10594892 10340946 10086650 9852173
9113 9852173 9626933 9414543 9208165 8994461 8796197 8623477 8433079 8243034 8058159 7870203
9103 7870203 7692173 7502648 7338348 7195732 7049434 6899998 6745449 6613987 6476230 6348331
9093 6348331 6219920 6110568 6007272 5904093 5792712 5700969 5595706 5492941 5373253 5286181
9083 5286181 5198788 5103169 5023354 4938609 4865018 4780689 4696354 4620815 4545689 4486181 4420696
9072 4420696 4347482 4266112 4185935 4123642 4049968 3980808 3912041 3835836 3790939 3738242 3681954
$$ packed form
9140B0153981n80573n59677n36509n25981n13403m93648m57273m49021m38736
9131A5599160m30637m05436l78178m02856l80898l61279l32018l21536l04669
9122A2281653l02069k84409k90171k88663k69922k51527k53946k54296k34477
9113I852173k25240k12390k06378k13704j98264j72720j90398j90045j84875j87956
9103G870203j78030j89525j64300j42616j46298j49436j54549j31462j37757j27899
9093F348331j28411j09352j03296j03179j11381r1743j05263j02765j19688q7072
9083E286181q7393r5619p9815q4745p3591q4329q4335p5539p5126n9508o5485
9072D420696p3214q1370q0177o2293p3674o9160o8767p6205m4897n2697n6288
$$ plain form
9061 3681954 3611853 3565361 3513495 3461637 3421110 3379164 3325083 3270103 3216492 3167688 3108082
9050 3108082 3051736 3015972 2966778 2924790 2882183 2839976 2814191 2795108 2751117 2692827 2656562
9039 2656562 2638025 2616889 2600801 2568904 2552208 2526124 2503226 2465071 2435840 2426337 2405108 2382037
9027 2382037 2333320 2292515 2263297 2243324 2214096 2175575 2145886 2118767 2098413 2074941 2044888
9016 2044888 2018254 1979115 1960986 1948232 1930526 1906078 1881315 1854323 1819690 1800582 1794764 1789533
9004 1789533 1755877 1731727 1726048 1716112 1700290 1686395 1661726 1657063 1642245 1622023 1610542 1587831
8992 1587831 1581619 1572731 1552490 1533772 1528559 1529901 1511021 1492293 1477221 1452865 1431416 1413104
8980 1413104 1391207 1368299 1365549 1364148 1356238 1346527 1334354 1333713 1321191 1306941 1284057 1253293 1244728
$$ packed form
9061C681954p0101m6492n1866n1858m0527m1946n4081n4980n3611m8804n9606
9050C108082n6346l5764m9194m1988m2607m2207k5785j9083m3991n8290l6265
9039B656562j8537k1136j6088l1897j6696k6084k2898l8155k9231r503k1229k3071
9027B382037m8717m0805k9218j9973k9228l8521k9689k7119k0354k3472l0053
9016B044888k6634l9139j8129j2754j7706k4448k4763k6992l4633j9108n818n231
9004A789533l3656k4150n679r936j5822j3895k4669m663j4818k0222j1481k2711
8992A587831o212q888k0241j8718n213J342j8880j8728j5072k4356k1449j8312
8980A413104k1897k2908k750j401p910r711j2173o41j2522j4250k2884l0764q565
$$ plain form
8967 1244728 1241639 1247975 1245865 1220690 1209950 1194970 1179617 1185593 1185919 1176444 1160889 1139009 1132918
8954 1132918 1135505 1109488 1092391 1079863 1074760 1072904 1055604 1039306 1033384 1034329 1022346 1016408 1006165
8941 1006165 1006456 1007784 1008084 1005113 999914 997964 992370 983384 954230 951625 933178 919725 902809 903053
8927 903053 904122 912849 911750 900838 882933 886867 881080 879858 875622 870967 867287 856487 843173
8914 843173 846346 840303 831289 816825 810687 812954 812321 805813 806931 812582 820997 818545 807409 794760
8900 794760 788647 778257 749728 749828 765128 767321 742717 733217 737316 731118 721089 718886 724029
8887 724029 715253 705743 703316 701450 694975 689226 686228 679791 679384 670660 666197 658418 652794 644068 643802
8872 643802 652818 639332 632698 618044 604599 604770 612233 604500 607103 601701 595115 591187 578980 568278
$$ packed form
8967A244728l089O336k110k5175j0740j4980j5353N976L26r475j5555k1880o091
8954A132918K587k6017j7097j2528n103j856j7300j6298n922R45j1983n938j0243
8941A006165K91J328L00k971n199j950n594q986k9154k605j8447j3453j6916K44
8927I03053J069Q727j099j0912j7905L934n787j222m236m655l680j0800j3314
8914H43173L173o043r014j4464o138K267o33o508J118N651Q415k452j1136j2649
8900G94760o113j0390k8529J00J5300K193k4604r500M099o198j0029k203N143
8887G24029q776r510k427j866o475n749k998o437m07q724m463p779n624q726k66
8872F43802R016j3486o634j4654j3445J71P463p733K603n402o586l928j2207j0702
$$ plain form
8858 568278 571041 579608 579950 569633 568304 579609 585743 580878 579412 579301 581055 577567 587423 592934
8844 592934 591083 591390 580267 584796 593153 585508 571768 558490 561026 573205 577091 590589 607409
8831 607409 626087 637379 621147 607079 597970 586731 581302 563579 552182 537757 521446 521304
8819 521304 509403 512495 505563 492985 498664 504804 499937 486338 474330 477118 477141 466178 451172
8806 451172 441078 445490 451648 440619 436264 433206 431132 426278 433950 442740 447547 450614 435716 420251
8792 420251 416413 422055 430623 424161 419598 419247 424442 404005 411238 418196 404765 392919 388739 383315
8778 383315 401373 415599 425174 407262 394392 399588 417452 420996 412018 396939 391286 390933 397345
8765 397345 383705 375854 380795 385841 384860 375138 361352 350395 344007 348965 347147 363875 377568
$$ packed form
8858E68278K763Q567L42j0317j329J1305O134m865j466j11J754l488R856N511
8844E92934j851L07j1123M529Q357p645j3740j3278K536J2179L886J3498J6820
8831F07409J8678J1292j6232j4068r109j1239n429j7723j1397j4425j6311j42
8819E21304j1901L092o932j2578N679O140m867j3599j2008K788K3j0963j5006
8806D51172j0094M412O158j1029m355l058k074m854P672Q790M807L067j4898j5465
8792D20251l838N642Q568o462m563l51N195k0437P233O958j3431j1846m180n424
8778C83315J8058J4226R575j7912j2870N196J7864L544q978j5079n653l53O412
8765C97345j3640p851M941N046r81r722j3786j0957o388M958j818J6728J3693
$$ plain form
8752 377568 362321 355251 348730 355609 363361 359161 346807 337902 326205 303383 301451 309484 321087
8739 321087 328049 322100 318309 317326 308265 314606 319846 316394 316576 312432 312096 304602 299594 302097 298994
8724 298994 302240 307791 309858 311245 305007 313706 308045 311916 296113 294837 296731 295110 305337 324821
8710 324821 342736 352598 342964 333043 331764 319820 317534 324108 315497 318353 321676 313157 300396 292374
8696 292374 295390 314675 323182 324656 322975 318461 318293 320069 304383 302414 293918 303774 308923 313422
8682 313422 324808 343790 361300 384486 392787 392816 377649 358694 347654 338563 337177 337902 336900
8669 336900 342882 341325 332244 332766 336350 333663 335223 333699 317185 305616 308979 305702 301435 295118
8655 295118 298357 292839 297794 293593 274470 267884 260411 261408 271822 266040 262522 252852 243177 253344
$$ packed form
8752C77568j5247p070o521O879P752m200j2354q905j1697k2822j932Q033J1603
8739C21087O962n949l791r83r061O341N240l452J82m144l36p494n008K503l103
8724B98994L246N551K067J387o238Q699n661L871j5803j276J894j621J0227J9484
8710C24821J7915R862r634r921j279j1944k286O574q611K856L323q519j2761q022
8696B92374L016J9285Q507J474j681m514j68J776j5686j969q496R856N149M499
8682C13422J1386J8982J7510K3186Q301K9j5167j8955j1040r091j386P25j002
8669C36900N982j557r081N22L584k687J560j524j6514j1569L363l277m267o317
8655B95118L239n518M955m201j9123o586p473R97J0414n782l518r670r675J0167
$$ plain form
8641 253344 267263 277897 278906 277030 272719 265072 265668 272882 268893 268007 261511 253776 249738 265972
8627 265972 269513 266192 259241 257667 259576 265095 261089 254832 238227 224870 234601 237836 245051 235051
8613 235051 235510 247722 255666 260554 256031 261854 251985 247223 257074 264495 268384 269207 279485 298159
8599 298159 312460 339557 387503 433569 486798 502185 478285 430180 387785 351139 320912 312887
8587 312887 314869 311364 306249 306052 290086 286273 287225 296046 300606 288247 278985 284454 297484 294446
8573 294446 296625 293293 275660 270778 280957 281136 286048 296082 315768 326547 319150 316969 326374
8560 326374 334505 346330 363366 392138 423114 451582 488483 533932 597688 694781 817566 901966
8548 901966 880852 787147 693909 637513 596386 566543 541823 527988 524737 535906 541453 543226
$$ packed form
8641B53344J3919J0634J009j876m311p647N96P214l989q86o496p735m038J6234
8627B65972L541l321o951j574J909N519m006o257j6605j3357R731L235P215j0000
8613B35051M59J2212P944M888m523N823r869m762R851P421L889Q23J0278J8674
8599B98159J4301K7097M7946M6066N3229J5387k3900m8105m2395l6646l0227q025
8587C12887J982l505n115j97j5966l813R52Q821M560j2359r262N469J3030l038
8573B94446K179l332j7633m882J0179J79M912J0034J9686J0779p397k181R405
8560C26374Q131J1825J7036K8772L0976K8468L6901M5449O3756R7093J22785Q4400
8548I01966k1114r3705r3238n6396m1127k9843k4720j3835l251J1169N547J773
$$ plain form
8536 543226 565377 604399 662895 746640 873508 1041141 1212975 1370976 1475627 1436089 1290758
8525 1290758 1121450 971036 855702 773376 709703 658644 625546 579910 538554 495449 456014
8514 456014 438021 435354 440329 445280 444194 449449 469291 513849 578090 664652 760233 815589 811039
8501 811039 736348 632033 555996 500858 475661 450675 426787 395450 372267 345598 330743
8490 330743 324778 323288 314266 308373 297681 289625 264894 248532 248725 246535 229963 226193 218343 216131
8476 216131 230206 240222 247085 225340 200472 180592 180907 186416 179278 173509 172206 170621 166896
8463 166896 170337 167197 153902 145887 163600 183663 182007 178758 181826 177486 186606 188890 179280 181386
8449 181386 188766 190897 193303 201268 191323 191971 193206 191246 181501 176953 169272 167066 174759 175149 165318
$$ packed form
8536E43226K2151L9022N8496Q3745J26868J67633J71834J58001J04651l9538j45331
8525A290758j69308j50414j15334q2326o3673n1059l3098m5636m1356m3105l9435
8514D56014j7993k667M975M951j086N255J9842M4558O4241Q6562R5581N5356m550
8501H11039p4691j04315p6037n5138k5197k4986k3888l1337k3183k6669j4855
8490C30743n965j490r022n893j0692q056k4731j6362J93k190j6572l770p850k212
8476B16131J4075J0016O863k1745k4868j9880L15N509p138n769j303j585l725
8463A66896L441l140j3295q015J7713K0063j656l249L068m340R120K284r610K106
8449A81386P380K131K406P965r945O48J235j960r745m548p681k206P693L90r831
$$ plain form
8434 165318 155784 153307 165518 173779 172282 165443 175924 172850 166303 163895 160151 167937 181509 187040
8420 187040 178655 165203 156572 163913 174680 161906 145483 153038 159791 168593 172459 169201 170213
8407 170213 180090 183255 177383 157451 152061 148427 137891 146988 164250 169348 172357 170452 166888 169587
8393 169587 167293 172339 178236 162429 160839 172402 183873 175409 162786 150101 143862 159627 173938
8380 173938 181773 195275 192065 176305 158028 141793 149415 171151 177160 153569 144890 146064 151288
8367 151288 154893 156918 165420 172067 162944 161755 164320 176676 181229 172502 166785 166084 165053 146268
8353 146268 138934 140873 146722 153950 160384 164570 172765 177025 174857 168234 159678 154434 147992 150889
8339 150889 151559 147550 157425 157896 150491 150829 152948 144271 127993 121222 123755 124379 113029 118541 129998
$$ packed form
8434A65318r534k477J2211Q261j497o839J0481l074o547k408l744P786J3572N531
8420A87040q385j3452q631P341J0767j2774j6423P555O753Q802L866l258J012
8407A70213R877L165n872j9932n390l634j0536R097J7262N098L009j905l564K699
8393A69587k294N046N897j5807j590J1563J1471q464j2623j2685o239J5765J4311
8380A73938P835J3502l210j5760j8277j6235P622K1736O009k3591q679J174N224
8367A51288L605K025Q502O647r123j189K565J2356M553q727n717p01j031j8785
8353A46268p334J939N849P228O434M186Q195M260k168o623q556n244o442K897
8339A50889O70m009R875M71p405L38K119q677j6278o771K533O24j1350N512J1457
$$ plain form
8324 129998 145114 151590 141239 135993 136608 127545 121605 116403 129842 168064 195249 188141 168831
8311 168831 163533 160364 149238 143554 139369 136698 132801 134603 131110 133806 138679 132496 122134 123460
8297 123460 125011 119266 120133 125004 128799 126044 113918 103338 115921 114203 117845 119658 115271 112438
8283 112438 102693 112104 117034 107486 105774 102254 96706 101520 101391 114229 137460 154782 160538 152405
8269 152405 139230 124374 119313 112747 101078 98621 105395 91708 88833 95682 95514 82595 78501
8256 78501 78555 82900 87026 92015 102771 126613 138551 134400 133965 120765 115138 109345 107005 112288
8242 112288 120377 110633 100782 102338 100495 95671 97541 110300 118682 107236 99097 101292 105680 111351
8228 111351 135658 157988 135453 122956 119839 110761 106475 101349 92708 87727 93819 82461 81558
$$ packed form
8324A29998J5116O476j0351n246O15r063n940n202J3439L8222K7185p108j9310
8311A68831n298l169j1126n684m185k671l897J802l493K696M873o183j0362J326
8297A23460J551n745Q67M871L795k755j2126j0580J2583j718L642J813m387k833
8283A12438r745R411M930r548j712l520n548M814j29J2838K3231J7322N756q133
8269A52405j3175j4856n061o566j1669k457O774j3687k875O849j68j2919m094
8256G8501N4M345M126M989J0756K3842J1938m151m35j3200n627n793k340N283
8242A12288Q089r744r851J556j843m824J870J2759Q382j1446q139K195M388N671
8228A11351K4307K2330k2535j2497l117r078m286n126q641m981O092j1358r03
$$ plain form
8215 81558 98635 113036 107768 94309 91476 93212 102357 105194 87515 96871 86956 91489 100891 89244
8201 89244 78945 87441 91406 94380 89462 82425 83812 83065 79343 80050 82537 78637 79753 72352 74984
8186 74984 90902 100450 109839 124091 136370 129985 116919 111254 100346 102100 91004 82884 74840
8173 74840 73187 80510 84614 101500 101059 93134 96101 94598 78288 76131 77701 87698 79090 64820
8159 64820 62521 68831 84136 90049 80015 72620 68649 78245 73851 75670 60293 62286 73458 69524
8145 69524 74881 92306 79818 61072 69136 70412 59067 52434 50620 51221 51036 67273 87777 99444
8131 99444 102014 102328 104458 137564 147823 154558 162177 144150 134189 129283 113623 114675 103558 90947
8117 90947 85427 78728 82814 76593 76781 71379 70518 70995 73084 73275 63270 61763 80550 82712 75255
$$ packed form
8215H1558J7077J4401n268j3459k833J736R145K837j7679R356r915M533R402j1647
8201H9244j0299Q496L965K974m918p037J387p47l722P07K487l900J116p401K632
8186G4984J5918R548R389J4252J2279o385j3066n665j0908J754j1096q120q044
8173G4840j653P323M104J6886m41p925K967j503j6310k157J570R997q608j4270
8159F4820k299O310J5305N913j0034p395l971R596m394J819j5377J993J1172l934
8145F9524N357J7425j2488j8746Q064J276j1345o633j814O01j85J6237K0504J1667
8131I9444K570L14K130L3106J0259O735P619j8027r961m906j5660J052j1117j2611
8117I0947n520o699M086o221J88n402q61M77K089J91j0005j507J8787K162p457
$$ plain form
8102 75255 51746 45112 68441 66084 66648 68232 70016 68569 70561 69315 54070 41357 50023 64470
8088 64470 64895 57400 64184 73727 64263 59102 58087 51510 54544 51548 46561 56245 56508 64295 64573
8073 64573 74296 76832 83632 91086 84622 79227 74840 63084 74516 67767 66308 64701 66231 64724
8059 64724 59337 59838 62660 77392 83508 87971 89623 87836 77805 65766 61336 65331 61439 66798
8045 66798 65473 71979 81395 74008 70389 58370 49177 55214 53936 53656 52961 73439 91480 89000
8031 89000 77832 77899 76878 69691 63068 67824 72699 71600 87193 89909 89564 89042 97879 101412 105169
8016 105169 117624 117363 106493 107685 111663 100308 86315 80542 82785 91809 86058 60651 56544
8003 56544 54604 57961 68419 66616 72098 67971 63606 63537 64504 57664 66076 79882 89248 97106 113564
$$ packed form
8102G5255k3509o634K3329k357N64J584J784j447J992j246j5245j2713Q666J4447
8088F4470M25p495O784R543r464n161j015o577L034k996m987R684K63P787K78
8073F4573R723K536O800P454o464n395m387j1756J1432o749j459j607J530j507
8059F4724n387N01K822J4732O116M463J652j787j0031j2039m430L995l892N359
8045F6798j325O506R416p387l619j2019r193O037j278k80o95K0478J8041k480
8031H9000j1168O7j021p187o623M756M875j099J5593K716l45n22Q837L533L757
8016A05169J2455k61j0870J192L978j1355j3993n773K243R024n751k5407m107
8003E6544j940L357J0458j803N482m127m365o9R67o840Q412J3806R366P858J6458
$$ plain form
7988 113564 109534 102727 86935 80922 90692 90923 81631 82361 82062 80404 71511 72828 80004 73036 80828
7973 80828 80547 78319 78449 81953 87280 82335 84643 87150 81764 77936 85050 89252 75957 75001 102415
7958 102415 114214 118676 114587 105903 105667 110499 111658 102685 99517 96071 94181 79041 66646 61407
7944 61407 61189 69866 75755 89420 82311 84925 104381 110757 120129 115682 110475 115758 110534 93843
7930 93843 98087 94459 84019 75282 78322 86833 83277 77436 68832 57827 70190 77441 65738 56280
7916 56280 62432 65496 67985 74146 92075 100964 99753 98690 91124 84996 90048 89391 101321 94468
7902 94468 79593 68116 77197 74061 81162 92779 101932 108306 108788 117798 128417 132562 136395 132553
7888 132553 131273 131940 104469 78202 73004 82943 78178 60976 52944 56973 61639 64476 68484 66967
$$ packed form
7988A13564m030o807j5792o013R770K31r292P30k99j658q893J317P176o968P792
7973H0828k81k228J30L504N327m945K308K507n386l828P114M202j3295r56K7414
7958A02415J1799M462m089q684k36M832J159q973l168l446j890j5140j2395n239
7944F1407k18Q677N889J3665p109K614J9456O376R372m447n207N283n224j6691
7930I3843M244l628j0440q737L040Q511l556n841q604j1005J2363P251j1703r458
7916E6280O152L064K489O161J7929Q889j211j063p566o128N052o57J1930o853
7902I4468j4875j1477R081l136P101J1617R153O374M82R010J0619M145L833l842
7888A32553j280O67k7471k6267n198R939m765j7202q032M029M666K837M008j517
$$ plain form
7874 66967 61821 72606 78104 64807 63259 61192 52043 45037 55468 65346 67830 63768 62965 60346
7860 60346 61658 50542 50977 66292 89329 82490 73441 73105 68986 71747 86071 90579 83131 74549
7846 74549 69318 92580 85971 66086 63011 74879 64107 66723 73161 65821 57240 46311 33715
7833 33715 43706 40929 33873 27041 29091 27725 27344 51043 56659 55616 59991 69728 70630 58002 64150
7818 64150 60473 52542 39408 36558 30349 29632 18904 20519 31123 47570 36782 29459 29837 31019
7804 31019 40146 44473 52202 54411 56939 59720 46497 32402 46064 40446 39931 33606 33125 39755
7790 39755 60912 77511 66669 59789 59918 55000 47736 43126 50798 38182 34979 47454 40049 38212
7776 38212 33044 34664 39117 42190 36292 27601 6941 2673 12970 20054 20881 25986 23447 38889
$$ packed form
7874F6967n146J0785N498j3297j548k067r149p006J0431R878K484m062q03k619
7860F0346J312j1116M35J5315K3037o839r049l36m119K761J4324M508p448q582
7846G4549n231K3262o609j9885l075J1868j0772K616O438p340q581j0929j2596
7833C3715R991k777p056o832K050j366l81K3699N616j043M375R737R02j2628O148
7818F4150l677p931j3134k850o209p17j0728J615J0604J6447j0788p323L78J182
7804C1019R127M327P729K209K528K781j3223j4095J3662n618n15o325m81O630
7790C9755K1157J6599j0842o880J29m918p264m610P672j2616l203J2475p405j837
7776C8212n168J620M453L073n898q691k0660m268J0297P084Q27N105k539J5442
$$ plain form
7762 38889 44456 40891 30409 25729 20096 17395 28433 38305 34094 42309 45099 41329 34093 24584
7748 24584 22133 27265 27613 17421 8108 18307 16106 13256 10891 12888 6840 11033 10884 17673 18301
7733 18301 34807 42697 42828 31935 33809 30813 19083 32676 24865 13538 14492 7659 11754 12467
7719 12467 18032 15386 14079 19306 37231 29209 25242 37755 37995 29789 30608 30525 32142 23813 29435
7704 29435 45091 33671 23860 15069 7240 29121 39946 28182 23861 28220 30814 21537 16314
7691 16314 18469 34639 51737 54306 38322 32478 28901 21282 22629 30840 60787 56469 34015
7678 34015 37850 50309 48109 37283 23179 35587 32077 22062 17486 29680 29850 32147 23156
7665 23156 28055 31358 29923 35342 25764 23967 30037 35369 24633 31300 28058 23116 39952 49908
$$ packed form
7762C8889N567l565j0482m680n633k701J1038R872m211Q215K790l770p236r509
7748B4584k451N132L48j0192r313J0199k201k850k365J997o048M193j49O789O28
7733A8301J6506P890J31j0893J874k996j1730J3593p811j1327R54o833M095P13
7719A2467N565k646j307N227J7925q022l967J2513K40q206Q19q3J617q329N622
7704B9435J5656j1420r811q791p829K1881J0825j1764m321M359K594r277n223
7691A6314K155J6170J7098K569j5984n844l577p619J347Q211K9947m318k2454
7678C4015L835J2459k200j0826j4104J2408l510j0015m576J2194J70K297q991
7665B3156M899L303j435N419r578j797O070N332j0736O667l242m942J6836R956
$$ plain form
7651 49908 44646 55384 63694 58422 63095 59906 34662 22750 19732 22971 29314 33588 37379 46417
7637 46417 32466 12873 17799 19034 29913 28237 33709 50727 52527 30230 26913 22106 25551
7624 25551 25240 14162 9767 12121 10182 12528 21065 27086 31616 34316 32168 32616 28312 24561 19711
7609 19711 21653 32287 33896 35909 27750 18418 18794 21155 35906 38766 39460 33024 20825 16561
7595 16561 28093 28854 23340 25723 38956 40841 25431 7099 12860 13960 25822 32178 33197 31232
7581 31232 21561 17581 13548 13628 22815 28055 37646 41938 45537 36119 16938 36633 46660 56974
7567 56974 46952 45279 45910 30557 24355 25276 20104 6557 -2691 9927 19034 15393 7149 27
7553 27 2954 13313 18888 25542 35244 23276 13293 5838 6413 9096 22075 21430 31592 39608 35796
$$ packed form
7651D9908n262J0738Q310n272M673l189k5244j1912l018L239O343M274L791R038
7637D6417j3951j9593M926J235J0879j676N472J7018J800k2297l317m807L445
7624B5551l11j1078m395K354j939K346Q537O021M530K700k148M48m304l751m850
7609A9711J942J0634J609K013q159r332L76K361J4751K860O94o436j2199m264
7595A6561J1532P61n514K383J3233J885j5410j8332N761J100J1862O356J019j965
7581C1232r671l980m033Q0R187N240R591M292L599r418j9181J9695J0027J0314
7567E6974j0022j673O31j5353o202R21n172j3547r248J2618R107l641q244p122
7553B7K927J0359N575O654R702j1968r983p455N75K683J2979o45J0162Q016l812
$$ plain form
7538 35796 32149 22390 19981 28051 30863 29699 18208 15703 11988 14929 5070 42 2879 -4850
7524 -4850 -8785 -8922 -6807 8827 17033 29764 42834 43510 41229 39428 47323 37118 26504 8213
7510 8213 7109 20573 20987 15415 24144 17462 19897 19436 26540 23568 19370 13246 426 12935 12948
7495 12948 13852 19481 24480 32073 35573 30831 17066 19585 14800 6815 7983 16605 12339 20229 21864
7480 21864 14327 5141 7771 14365 15712 18090 17317 4852 10254 11111 15673 23723 28735 35446 40859
7465 40859 29535 40733 45723 28537 32441 41348 35693 10721 4389 6996 5470 10109 26360
7452 26360 45731 41655 26558 21416 13599 10180 9853 11821 13194 9392 16718 28025 20865 15088
7438 15088 21917 21198 7859 7585 12528 14699 16415 9584 16492 14993 7588 5037 21684 35655
$$ packed form
7538C5796l647r759k409Q070K812j164j1491k505l715K941r859n028K837p729
7524d850l935j37K115J5634Q206J2731J3070O76k281j801P895j0205j0614j8291
7510H213j104J3464M14n572Q729o682K435m61P104k972m198o124j2820J2509J3
7495A2948R04N629M999P593L500m742j3765K519m785p985J168Q622m266P890J635
7480B1864p537r186K630O594J347K378p73j2465N402Q57M562Q050N012O711N413
7465D0859j1324J1198M990j7186L904Q907n655k4972o332K607j526M639J6251
7452B6360J9371m076j5097n142p817l419l27J968J373l802P326J1307p160n777
7438A5088O829p19j3339k74M943K171J716o831O908j499p405k551J6647J3971
$$ plain form
7424 35655 33066 23701 11769 1128 13358 28648 26119 19111 25970 45168 29377 18382 19168
7411 19168 6077 17270 19138 12251 10832 23828 10603 2595 15273 4065 -2667 27 -859
7398 -859 -2120 3404 6171 19939 19615 8081 8730 9671 22983 14117 17047 15159 11056 10615 18742
7383 18742 22589 13514 1870 -10159 -4306 1423 7039 8007 2019 10484 18744 15674 27772 20974
7369 20974 11735 17587 21146 32712 23093 5878 -89 896 5558 9680 11012 -3764 10072 22973
7355 22973 20609 17989 29330 17726 13947 3855 -3870 7015 18184 14560 4208 1948 7870
7342 7870 7532 4774 16754 30332 15650 8047 3302 9327 9949 19605 34986 24332 13125 10930
7328 10930 -6500 -13422 -1794 19630 22179 15059 3874 -279 7453 -2104 -4027 -6625 1450 7787
$$ packed form
7424C5655k589r365j1932j0641J2230J5290k529p008O859J9198j5791j0995P86
7411A9168j3091J1193J868o887j419J2996j3225q008J2678j1208o732K694q86
7398h59j261N524K767J3768l24j1534O49R41J3312q866K930j888m103m41Q127
7383A8742L847r075j1644j2029N853N729N616R68n988Q465Q260l070J2098o798
7369B0974r239N852L559J1566r619j7215n967R85M662M122J332j4776J3836J2901
7355B2973k364k620J1341j1604l779j0092p725J0885J1169l624j0352k260N922
7342G870l38k758J1980J3578j4682p603m745O025O22R656J5381j0654j1207k195
7328A0930j7430o922J1628K1424K549p120j1185m153P732r557j923k598Q075O337
$$ plain form
7314 7787 5638 -1241 -2471 9293 12365 8680 23759 13082 5918 14233 18733 33703 27738 24618
7300 24618 30689 22789 22847 24072 13636 12276 27050 29986 13288 2047 1236 11549 8741 18968
7286 18968 25464 27939 31722 21816 7438 10437 13621 14104 15984 14106 6644 5265 6763 -2214 4110
7271 4110 15470 25261 29511 25751 12933 4258 6707 18884 16574 739 -9336 -15448 -304
7258 -304 14581 24647 16392 20424 37947 54443 40573 23568 20233 22164 33573 43920 29047
7245 29047 11658 9171 5273 10018 12032 14549 19349 23221 13240 -16585 -8971 21283 29613 14070
7231 14070 4054 -8437 -15557 -19280 -10815 16430 25528 20671 15062 5236 1414 4610 -4331 5474
7217 5474 7366 16881 19774 7190 16804 24351 8148 -4858 -8066 -9554 -12787 -4947 -1722 1596
$$ packed form
7314G787k149o879j230J1764L072l685J5079j0677p164Q315M500J4970n965l120
7300B4618O071p900N8J225j0436j360J4774K936j6698j1241q11J0313k808J0227
7286A8968O496K475L783r906j4378K999L184M83J880j878p462j379J498q977O324
7271D110J1360R791M250l760j2818q675K449J2177k310j5835j0075o112J5144
7258c04J4885J0066q255M032J7523J6496j3870j7005l335J931J1409J0347j4873
7245B9047j7389k487l898M745K014K517M800L872r981k9825P614L0254Q330j5543
7231A4070j0016j2491p120l723Q465K7245R098m857n609r826l822L196q941R805
7217E474J892R515K893j2584R614P547j6203j3006l208j488l233P840L225L318
$$ plain form
7203 1596 -3154 -971 13991 18770 14548 12605 18503 16882 15494 24839 18958 11607 -4535 -11717
7189 -11717 4515 17027 15892 10755 17933 12623 20232 13436 3716 -5190 7956 12446 -754 4885
7175 4885 20613 28508 13508 24553 35905 28903 23548 23184 27032 19681 19199 18542 17741 15076 14589
7160 14589 1767 -8723 5951 21569 5579 4443 5297 8756 1962 2630 10416 7212 13183 22467
7146 22467 7736 6176 6155 -5599 -9230 -8986 -11980 -5314 132 12050 8593 22 8940 13963 20206
7131 20206 29285 35498 27930 27179 22265 15595 6530 9435 9262 15697 21850 16922 28424 22889 13535
7116 13535 -103 1136 6612 4547 11058 24273 17066 8322 10820 -1925 5416 20958 19535 22429
7102 22429 31960 42998 42904 28997 20990 16582 -1086 9209 16552 21909 23201 17998 9424 -3947
$$ packed form
7203A596m750K183J4962M779m222j943N898j621j388R345n881p351j6142p182
7189a1717J6232J2512j135n137P178n310P609o796r720q906J3146M490j3200N639
7175D885J5728P895j5000J1045J1352p002n355l64L848p351m82o57q01k665m87
7160A4589j2822j0490J4674J5618j5990j136Q54L459o794O68P786l204N971R284
7146B2467j4731j560k1j1754l631K44k994O666N446J1918l457q571Q918N023O243
7131B0206R079O213p568p51m914o670r065K905j73O435O153m928J1502n535r354
7116A3535j3638J239N476k065O511J3215p207q744K498j2745P341J5542j423K894
7102B2429R531J1038r4j3907q007m408j7668J0295P343N357J292n203q574j3371
$$ plain form
7088 -3947 4691 13134 7735 6304 18584 28066 17948 11247 18734 22679 22236 20197 14970 7336 5136
7073 5136 -1379 -5343 -1552 3709 4768 11238 21971 13196 2879 3546 11674 14451 22 -14623
7059 -14623 -13258 -5008 2142 1150 12361 22890 21372 14535 12088 11377 20522 17038 9911 2802 -5623
7044 -5623 -13377 -22091 -23760 1736 12312 14311 16497 17419 27101 25571 26068 13990 12297 10623 12501
7029 12501 3425 -5490 -7400 5049 12990 20633 20408 12101 5190 830 -1490 -5605 6132 21424
7015 21424 7075 -1976 7877 4506 -6716 -3441 -4503 -17257 -5377 11081 15465 24420 16536
7002 16536 13171 27796 30570 15312 5746 27799 36676 31194 28018 14463 10442 6211 12458 16810
6988 16810 8785 3466 18772 41709 20566 234 -7965 2982 16582 13379 13541 23610 17355
$$ packed form
7088c947Q638Q443n399j431J2280R482j0118o701P487L945m43k039n227p634k200
7073E136o515l964L791N261J059O470J0733q775j0317O67Q128K777j4429j4645
7059a4623J365Q250P150r92J1211J0529j518o837k447p11R145l484p127p109q425
7044e623p754q714j669K5496J0576J999K186R22R682j530M97j2078j693j674J878
7029A2501r076q915j910J2449P941P643k25q307o911m360k320m115J1737J5292
7015B1424j4349r051R853l371j1222L275j062j2754J1880J6458M384Q955p884
7002A6536l365J4625K774j5258r566K2053Q877n482l176j3555m021m231O247M352
6988A6810q025n319J5306K2937k1143k0332q199J0947J3600l203J62J0069o255
$$ plain form
6975 17355 10802 2450 1876 1111 4178 13010 17691 21840 25146 18512 18309 12102 18943 13777 11525
6960 11525 4936 -3231 -10556 -2706 3493 -5553 -5005 -4782 -446 7364 15304 5305 1878 3230 -1650
6945 -1650 8099 13417 11760 13393 17335 16859 5990 -2771 -1891 -9453 -5388 4257 19606 18690 13038
6930 13038 9618 12384 8634 3645 3565 5746 -11615 -11605 -121 -2843 -7661 -7380 -8114 -13640 -10644 8338
6914 8338 20244 32808 27818 29137 31265 28291 37097 31619 14417 15522 10762 13816 15440 8410
6900 8410 10100 -13017 -9564 1438 13675 23564 12568 5442 2275 5145 3592 -6549 -724 3944
6886 3944 -927 -3600 -4556 -5882 -8412 -6038 2718 -5653 -4363 -6903 -11744 -812 6942 11542 1758
6871 1758 -674 963 575 5129 712 -10456 -4427 6834 9583 4201 4640 -4802 -12499 -11669 -4636
$$ packed form
6975A7355o553q352n74p65L067Q832M681M149L306o634k03o207O841n166k252
6960A1525o589q167p325P850O199r046N48K23M336P810P940r999l427J352m880
6945a650R749N318j657J633L942m76j0869q761Q80p562M065R645J5349r16n652
6930A3038l420K766l750m989q0K181j7361J0J1484k722m818K81p34n526K996J8982
6914H338J1906J2564m990J319K128k974Q806n478j7202J105m760L054J624p030
6900H410J690k3117L453J1002J2237R889j0996p126l167K870j553j0141N825M668
6886C944m871k673r56j326k530K374Q756q371J290k540m841J0932P754M600r784
6871A758k432J637l88M554m417j1168O029J1261K749n382M39r442p697Q30P033
$$ plain form
6856 -4636 -4634 -13517 -6677 102 -14997 -5917 -4192 2369 17979 15874 7005 1312 -9769 -14953 -10654
6841 -10654 922 9924 3215 3300 -1679 4944 -13147 -22655 3294 5016 5748 6669 4766 -6111 -27508
6826 -27508 -13553 3950 -379 4439 11756 18098 10389 9379 12750 14015 27454 27982 25224 27225
6812 27225 25155 26822 28562 22849 17037 28528 27231 18803 9171 -3011 -4772 1772 3024 -4027
6798 -4027 -2767 7418 14501 16241 17893 19682 14367 9047 8938 15853 26875 28857 19855 19457 16878
6783 16878 18177 -4931 -13009 -5228 9165 26385 34734 14917 -473 -731 -5558 3873 9084 10710
6769 10710 17041 19343 11237 6969 -6048 -12156 -3136 -16 -1639 14866 13587 15713 12706 2187
6755 2187 5309 9839 17020 2111 -8920 6718 6400 10020 12492 853 -4153 2237 4027 -4128
$$ packed form
6856d636Kq883O840O779j5099R080J725O561J5610k105q869n693j1081n184M299
6841a0654J1576R002o709Q5m979O623j8091r508K5949J722P32R21j903j0877k1397
6826b7508J3955J7503m329M818P317O342p709j010L371J265J3439N28k758K001
6812B7225k070J667J740n713n812J1491j297q428r632j2182j761O544J252p051
6798d027J260J0185P083J740J652J789n315n320j09O915J1022J982r002l98k579
6783A6878J299k3108q078P781J4393J7220Q349j9817j5390k58m827R431N211J626
6769A0710O331K302q106m268j3017o108R020L120j623J6505j279K126l007j0519
6755B187L122M530P181j4909j1031J5638l18L620K472j1639n006O390J790q155
$$ plain form
6741 -4128 6 13867 8935 1419 1909 -6368 -17613 -3485 2874 4744 6461 -5494 -16342 -10035
6727 -10035 -2567 14273 22542 17072 16617 34035 42943 43050 37816 33702 37051 38143 58797 81041
6713 81041 68054 52579 46291 54634 53954 69542 74745 93491 113496 122082 157065 177413 212822
6700 212822 265067 327095 410852 514972 658634 804214 869873 798103 663012 532561 431112
6689 431112 361231 304819 251302 227281 210366 195024 181256 169919 147079 137070 117941 104573
6677 104573 93626 84878 68628 68287 66123 67600 72787 67417 50473 47204 39486 41919 32136 23700
6663 23700 25548 34289 32443 34120 34232 27030 14483 18938 18610 26327 37637 40440 43245 29734
6649 29734 22442 21620 14923 15174 5273 5821 7473 -476 -9979 -10794 -4143 5271 6861 -2371 -12544
$$ packed form
6741d128M134J3861m932p516M90q277j1245J4128O359J870J717j1955j0848O307
6727a0035P468J6840Q269n470m55J7418Q908J07n234m114L349J092K0654K2244
6713H1041j2987j5475o288Q343o80J5588N203J8746K0005Q586L4983K0348L5409
6700B12822N2245O2028Q3757J04120J43662J45580O5659p1770j35091j30451j01449
6689D31112o9881n6412n3517k4021j6915j5342j3768j1337k2840j0009j9129j3368
6677A04573j0947q748j6250l41k164J477N187n370j6944l269p718K433r783q436
6663B3700J848Q741j846J677J12p202j2547M455l28P717J1310K803K805j3511
6649B9734p292q22o697K51r901N48J652p949r503q15O651R414J590r232j0173
$$ plain form
6634 -12544 -13728 -14293 -1248 999 13963 8269 1118 6196 11421 747 2073 4545 -415 9677
6620 9677 11052 5905 -9434 -11418 1842 10566 3390 7745 4040 1597 12686 13094 -4413 -23615
6606 -23615 -21288 -8893 -1369 8025 27314 10724 -9537 -15358 -14178 -15315 -2192 -4087 -5404
6593 -5404 -2443 -1427 -3145 2302 13583 7227 -2055 -16893 6233 20423 16573 11473 -1691 -3371
6579 -3371 -10075 -4214 10886 18186 14470 -9208 -6114 -7473 -23615 -21331 -10527 -10059 -3828 3765
6565 3765 -5831 2438 16745 20922 12891 4014 -2595 8083 32817 40160 25910 18680 21928 18219
6551 18219 10856 11546 6303 5487 5348 4708 6407 6156 9947 5696 -3312 -11538 -13731 -4917 3180 7928
6535 7928 -4699 -4670 8528 12780 23028 11165 -2025 30 -2284 2204 -14398 -7319 13543 12366
$$ packed form
6634a2544j184n65J3045K247J2964n694p151N078N225j0674J326K472m960J0092
6620I677J375n147j5339j984J3260Q724p176M355l705k443J1089M08j7507j9202
6606b3615K327J2395P524R394J9289j6590k0261n821J180j137J3123j895j317
6593e404K961J016j718N447J1281o356r282j4838K3126J4190l850n100j3164j680
6579c371o704N861J5100P300l716k3678L094j359j6142K284J0804M68O231P593
6565C765r596Q269J4307M177q031q877o609J0678K4734P343j4250p230L248l709
6551A8219p363O90n243q16j39o40J699k51L791m251r008q226k193Q814Q097M748
6535G928j2627K9J3198M252J0248j1863j3190K055k314M488j6602P079K0862j177
$$ plain form
6521 12366 7390 11237 17379 13742 6445 9738 -4016 6100 5944 -6 2439 -2014 -6345 -6674 7271
6506 7271 13759 11887 18362 11463 -602 -5791 -14739 -9909 -1397 -1792 -2399 1584 -10462 -206 4528
6491 4528 4955 -2993 -9936 -3170 8040 10310 16371 15295 -2024 -295 16119 13298 12674 5688 2269
6476 2269 -12151 4348 20773 5499 -149 -10880 -10713 152 9278 12118 -874 1048 -545
6463 -545 -9157 -6266 -2419 2106 7300 12929 19449 17012 2559 -14796 -6539 912 8535 18540
6449 18540 21566 22567 551 -13958 -7633 8364 12478 -5472 -13826 -9493 2104 7335 465
6436 465 4829 -1380 -2108 4844 4988 3378 -6873 -10853 -9501 -2197 -8480 -19285 -14751 -14875 -25281
6421 -25281 -15581 1172 -8912 -16446 -11745 -3839 -6208 -1666 11853 10745 16089 14851 23377 26265
$$ packed form
6521A2366m976L847O142l637p297L293j3754J0116j56n950K445m453m331l29J3945
6506G271O488j872O475o899j2065n189q948M830Q512l95o07L983j2046J0256M734
6491D528M27p948o943O766J1210K270O061j076j7319J729J6414k821o24o986l419
6476B269j4420J6499J6425j5274n648j0731J67J0865R126K840j2992J922j593
6463e45q612K891L847M525N194N629O520k437j4453j7355Q257P451P623J0005
6449A8540L026J001k2016j4509O325J5997M114j7950q354M333J1597N231o870
6436D65M364o209p28O952J44j610j0251l980J352P304o283j0805M534j24j0406
6421b5281R700J6753j0084p534M701P906k369M542J3519j108N344j238Q526K888
$$ plain form
6407 26265 23899 33218 28537 17615 9167 5828 -4657 -9892 -13828 -5134 -8537 -9969 -4433 -5082
6393 -5082 -16299 -11294 -8429 -1160 12981 8512 3878 16368 16457 10005 -3590 2938 -322 7120
6379 7120 -2734 5353 13682 8550 11358 15700 20522 18280 7762 919 7531 5899 1711 10014 2251
6364 2251 7661 25437 28785 12035 2225 -5872 1553 -5168 -18466 -19487 -14919 -16402 -11542 41
6350 41 6204 -6028 -2332 6476 -236 -7558 -9151 159 12800 12340 -4695 -8458 -10657 -16297 -2409
6335 -2409 4806 -3372 -4126 -8843 -17477 -13560 -2693 5980 2850 -8711 -23987 -34043 -16681 -13548
6321 -13548 -18424 -16097 -18734 -20737 -21195 -31825 -17955 -14194 -7786 14514 17023 15091 11697 3228
6307 3228 -9627 -13308 -2892 10415 9347 -7483 -16103 -10571 -10789 4126 8201 -9285 -17999 -10820
$$ packed form
6407B6265k366R319m681j0922q448l339j0485n235l936Q694l403j432N536o49
6393e082j1217N005K865P269J4141m469m634J2490Q9o452j3595O528l260P442
6379G120r854Q087Q329n132K808M342M822k242j0518o843O612j632m188Q303p763
6364B251N410J7776L348j6750r810q097P425o721j3298j021M568j483M860J1583
6350D1O163j2232L696Q808o712p322j593R310J2641m60j7035l763k199n640J3888
6335b409P215q178p54m717q634L917J0867Q673l130j1561j5276j0056J7362L133
6321a3548m876K327k637k003m58j0630J3870L761O408K2300K509j932l394q469
6307C228j2855l681J0416J3307j068j6830q620N532k18J4915M075j7486q714P179
$$ plain form
6293 -10820 -14216 -23090 -19687 -20892 -25448 -34885 -38741 -36456 -18511 -7067 -15059 -14413 -4642 -8102
6279 -8102 -6673 2732 -4828 -17588 -26749 -16495 -1865 5041 858 -3411 -6136 7637 14472 16072
6265 16072 4187 331 206 -5845 -15572 -21708 -24188 -22331 -9856 -308 -5668 -14881 -15273 -3416
6251 -3416 -2094 -19625 -14864 -15627 -17405 -12712 3715 4813 -9897 -5740 4716 -11153 -12088 -6466
6237 -6466 -11721 -8545 7673 15071 13741 -2380 -27580 -29723 -23049 -13979 -11722 -8285 2571 14276
6223 14276 21124 13842 7610 6532 -1928 -9514 3291 8111 -18089 -25851 -6786 -1821 1591 -2010
6209 -2010 -13382 -13675 -7612 10632 16146 5650 2478 -6032 -8130 -5585 -10867 -521 14103 8048
6195 8048 146 839 12647 6897 13082 23868 12074 -10655 -20032 -17054 -7114 1287 -1489 -10234
$$ packed form
6293a0820l396q874L403j205m556r437l856K285J7945J1444p992O46R771l460
6279h102J429R405p560j2760r161J0254J4630O906m183m269k725J3773O835J600
6265A6072j1885l856j25o051r727o136k480J857J2475R548n360r213l92J1857
6251c416J322j7531M761p63j778M693J6427J098j4710M157J0456j5869r35N622
6237f466n255L176J6218P398j330j6121k5200k143O674R070K257L437J0856J1705
6223A4276O848p282o232j078q460p586J2805M820k6200p762J9065M965L412l601
6209b010j1372k93O063J8244N514j0496l172q510k098K545n282J0346J4624o055
6195H048p902O93J1808n750O185J0786j1794k2729r377K978R940Q401k776q745
$$ plain form
6181 -10234 3017 8032 6814 9225 18121 17670 3081 -10350 -5418 -3088 4334 -8308 -8831 -7763
6167 -7763 -5381 -11682 -9841 209 -3002 -8777 -8000 -1445 5903 13739 13000 17239 34023 33965 33012 23225
6151 23225 9922 -5532 -589 7205 6408 665 -9547 -1947 -2815 -3797 -6580 -10069 -3384 -733 6814
6136 6814 5472 9762 15413 9380 6774 11490 8674 1187 -17148 -19537 -16776 -18879 -18077 -524 11705
6121 11705 4628 -9118 -16798 -8920 -14780 -17625 -10283 -3840 -1420 2667 -8563 10619 24764 16875
6107 16875 14715 -779 -6299 -6694 -13375 1955 15592 14925 26565 27665 32768 11379 2970 24369
6093 24369 24646 13390 6149 -16079 -8520 -6120 -22232 -19298 -16535 -3372 10803 14579 11375 9577
6079 9577 6845 7621 7275 4153 9698 8529 1212 -4153 -624 7096 3787 242 3714 -16783 -22785
$$ packed form
6181a0234J3251N015j218K411Q896m51j4589j3431M932K330P422j2642n23J068
6167g763K382o301J841J0050l211n775P77O555P348P836p39M239J6784n8r53r787
6151B3225j3303j5454M943P794p97n743j0212P600q68r82k783l489O685K651P547
6136F814j342M290N651o033k606M716k816p487j8335k389K761k103Q02J7553J2229
6121A1705p077j3746p680P878n860k845P342O443K420M087j1230J9182J4145p889
6107A6875k160j5494n520l95o681J5330J3637o67J1640J100N103k1389q409K1399
6093B4369K77j1256p241k2228P559K400j6112K934K763J3163J4175L776l204j798
6079I577k732P76l46l122N545j169p317n365L529P720l309l545L472k0497o002
$$ plain form
6064 -22785 -33235 -40795 -27168 -20671 -21356 -15984 -16366 -2104 -8304 -8500 1016 -9122 -21130 -27149
6050 -27149 -19602 -7774 -4998 -5850 -8699 -15593 -33547 -43185 -27507 -17333 -6841 3449 -5875
6037 -5875 -10967 -9860 -2251 1948 8634 -6273 -11771 -6916 -7321 -7959 -879 -10864 -20290 -15034 -10156
6022 -10156 -10635 -9901 -4682 1034 4164 -2393 -16559 -18267 -4098 13399 12662 10330 8572 10018 2263
6007 2263 4946 9042 -1420 -9934 -12056 -2908 1906 7351 586 -4248 2152 4907 -13293 -20950
5993 -20950 -16682 -27696 -15164 1313 4502 -8883 -23551 -17062 -290 3496 -2562 -15088 -8108
5980 -8108 -5358 -3016 16111 10277 6224 11887 2053 -6546 -6361 -12874 -17294 -11756 2900 17909
5966 17909 19839 21729 9732 -5091 -4918 279 -7573 -10010 -24293 -32374 -29608 -20987 -20517 -30241
$$ packed form
6064b2785j0450p560J3627O497o85N372l82J4262o200j96R516j0138j2008o019
6050b7149P547J1828K776q52k849o894j7954r638J5678J0174J0492J0290r324
6037e875n092J107P609M199O686j4907n498M855m05o38P080r985r426N256M878
6022a0156m79P34N219N716L130o557j4166j708J4169J7497p37k332j758J446p755
6007B263K683M096j0462q514k122R148M814N445o765m834O400K755j8200p657
5993b0950M268j1014J2532J6477L189j3385j4668O489J6772L786o058j2526O980
5980h108K750K342J9127n834m053N663r834q599J85o513m420N538J4656J5009
5966A7909J930J890j1997j4823J73N197p852k437j4283q081K766Q621M70r724
$$ plain form
5952 -30241 -34512 -49951 -42738 -27782 -28870 -19665 -19766 -10045 -2447 -9318 -2134 4635 6809 296
5938 296 -9692 -5372 -6779 -16235 -21922 -19022 -26229 -12435 7278 12904 4414 6436 5656 7724 10630
5923 10630 8712 10421 9705 1632 -11980 -14989 -14499 -9971 -6105 1706 8855 15212 13524 -3605 -10820
5908 -10820 -4615 -5554 -16365 -17748 -22240 -15883 -11590 -16803 -29126 -24929 3983 13297 -11502 -25381
5894 -25381 -23176 -26863 -26981 -27619 -25274 -29509 -25020 -22360 -8198 -5588 -13506 -16078 -18101 -17595 -14067
5879 -14067 -8752 -7853 -11322 -9647 -19942 -12561 -11380 -6324 3391 6548 -390 -7257 -10796 -18599 -6567
5864 -6567 2798 -3119 -9762 -7654 148 3307 6094 10494 3640 2338 -8814 -4479 -5679 343 7186
5849 7186 9606 7882 8480 4328 1573 10548 9329 3670 3326 12857 -186 -13606 -6374 -10059 -16328
$$ packed form
5952c0241m271j5439P213J4956j088R205j01R721P598o871P184O769K174o513
5938B96r988M320j407r456n687K900p207J3794J9713N626q490K022p80K068K906
5923A0630j918J709p16q073j3612l009M90M528L866P811P149O357j688j7129p215
5908a0820O205r39j0811j383m492O357M293n213j2323M197K8912R314k4799j3879
5894b5381K205l687j18o38K345m235M489K660J4162K610p918k572k023N06L528
5879a4067N315Q99l469J675j0295P381J181N056R715L157o938o867l539p803J2032
5864f567R365n917o643K108P802L159K787M400o854j302j1152M335j200O022O843
5849G186K420j724N98m152k755Q975j219n659l44R531j3043j3420P232l685o269
$$ plain form
5834 -16328 -27012 -20577 -13348 -15196 -9953 -12113 171 10992 18821 19389 304 5219 16007 18163
5820 18163 2607 2290 14290 16674 22912 35805 41820 29851 15807 8532 16071 -854 703
5807 703 4309 11779 8834 2375 1657 -6282 -2781 -10799 -17014 -9210 -19285 -23572 -5639 -1124 -8322
5792 -8322 -10198 -6438 4522 -1090 -138 -6071 -17538 -14126 -9264 -11331 -14889 -14228 -16540 -8251 -4236
5777 -4236 -4481 -14558 -12875 -23140 -29832 -22615 -21313 -1538 -1154 -4982 -4245 -13769 -14623 -1754 7685
5762 7685 -3497 -3511 -3991 -4619 4619 -12093 -17113 -18138 -8111 7794 4775 -22074 -20396 -2536
5748 -2536 -7290 -15026 -2281 5536 7037 -3360 -778 -4412 6794 18336 26029 10171 1616 -2235
5734 -2235 -13457 -13480 -4694 -1387 -15751 -9198 -6798 -10872 -14382 -17124 -15984 -3683 15430 13189
$$ packed form
5834a6328j0684O435P229j848N243k160J2284J0821P829N68j9085M915J0788K156
5820A8163j5556l17J2000K384O238J2893O015j1969j4044p275P539j6925J557
5807G03L606P470k945o459p18p939L501q018o215P804j0075m287J7933M515p198
5792h322j876L760J0960n612R52n933j1467L412M862k067l558O61k312Q289M015
5777d236k45j0077J683j0265o692P217J302J9775L84l828P37r524q54J2869R439
5762G685j1182j4m80o28R238j6712n020j025J0027J5905l019k6849J678J7860
5748b536m754p736J2745P817J501j0397K582l634J1206J1542P693j5858q555l851
5734b235j1222k3Q786L307j4364O553K400m074l510k742J140J2301J9113k241
$$ plain form
5720 13189 4927 14951 23079 15221 2975 -14497 -17009 -8798 -22153 -12822 8460 10600 -1176
5707 -1176 -19414 -14435 -384 -10183 -8249 3334 12049 5528 -1338 -11056 -13660 -11891 -2753 1714
5693 1714 1733 -4375 -9594 -20260 -14636 -15712 -20920 -24792 -19629 -12795 -2280 -9054 -14875 -5225 8148
5678 8148 23526 16170 14205 23210 1950 -11630 178 -10233 -19543 4029 18732 11510 8284
5665 8284 9033 5401 18180 27278 11468 1202 2805 -3396 -6733 20942 34396 15470 193
5652 193 -2685 11101 5998 -3937 592 -5887 -8497 -5633 -16394 -15324 -9341 -1965 641 -2384 -13399
5637 -13399 -7133 -1602 3043 -10477 -17065 -9527 -24309 -23675 -12888 -11221 -14868 -14712 -18993 -17413
5623 -17413 -7760 -5074 -7851 -12687 -26168 -28366 -7521 -3936 -4686 -4029 -11871 -18214 -27164 -10771
$$ packed form
5720A3189q262J0024Q128p858j2246j7472k512Q211j3355R331K1282K140j1776
5707a176j8238M979J4051r799J934J1583Q715o521o866r718k604J769R138M467
5693A714J9o108n219j0666N624j076n208l872N163O834J0515o774n821R650J3373
5678H148J5378p356j965R005k1260j3580J1808j0411r310K3572J4703p222l226
5665H284P49l632J2779R098j5810j0266J603o201l337K7675J3454j8926j5277
5652A93k878J3786n103r935M529o479k610K864j0761J070N983P376K606l025j1015
5637a3399O266N531M645j3520o588P538j4782O34J0787J667l647J56m281J580
5623a7413R653K686k777m836j3481k198K0845L585p50O57p842o343q950J6393
$$ plain form
5609 -10771 -22122 -26194 -16099 -15916 -9342 12482 23140 23240 11360 19603 13176 10553 -626 14272
5595 14272 19574 14642 8931 -2859 -12764 -531 -1218 -5811 -16540 -19049 -10846 -108 9192 -1904
5581 -1904 -6665 -14707 -14987 -12817 -17221 -34073 -40823 -29251 -23439 -20597 -11402 -15228 -6981 -2213 -6037
5566 -6037 -14795 -25379 -29024 -14798 -12901 -31870 -42439 -38824 -33903 -34222 -24497 -19556 -17546 -15923
5552 -15923 3709 10671 17577 15528 -1463 -23871 -17737 -12537 5336 7251 2271 5685 9219 5614
5538 5614 65 -3916 -5362 -7165 -13255 -17120 -11627 -12940 -13673 -16632 -15799 -11243 -2216 -3289 -8565
5523 -8565 -4425 -3106 -9875 -8228 -147 -8558 -16336 -29527 -32774 -25368 -21112 -19979 -17615 -10124 -20623
5508 -20623 -16974 -24258 -16150 -4924 -9500 -11605 -11766 -3399 -21653 -27000 -14676 -9268 -1647 4897
$$ packed form
5609a0771j1351m072J0095J83O574K1824J0658J00j1880Q243o427k623j1179J4898
5595A4272N302m932n711j1790r905J2233o87m593j0729k509Q203J0738R300j1096
5581a904m761q042k80K170m404j6852o750J1572N812K842R195l826Q247M768l824
5566f037q758j0584l645J4226J897j8969j0569L615M921l19R725M941K010J623
5552a5923J9632O962O906k049j6991k2408O134N200J7873J915m980L414L534l605
5538E614n549l981j446j803o090l865N493j313p33k959Q33M556R027j073n276
5523h565M140J319o769J647Q081q411p778j3191l247P406M256J133K364P491j0499
5508b0623L649p284Q108J1226m576k105j61Q367j8254n347J2324N408P621O544
$$ plain form
5494 4897 16904 17136 7884 -6850 -16368 -10561 -12615 -9849 -3946 2837 7815 1486 -2472 -6196 -5601
5479 -5601 13460 11675 1492 -7527 -9633 -7226 -11164 3005 6391 5107 2422 3793 9100 4359
5465 4359 5859 1138 -7498 4113 19602 32895 28822 21881 13092 29642 39068 29033 13510
5452 13510 2344 -14338 -10017 234 -5937 -10877 -8257 -22159 -14558 -11975 -15314 -12233 -18143 -15041
5438 -15041 -10998 -10037 -3533 -1330 -11993 -19209 -28978 -26792 -10802 12703 11121 3267 11292 19775
5424 19775 10632 -2041 -13393 -13156 -14707 -18942 -16178 -22969 -17598 -11404 -21695 -27525 -11795 573
5410 573 2649 -2314 -16903 -27364 -33987 -40032 -37878 -37407 -19795 -14171 -11185 -3974 -7555 -9387 -3219
5395 -3219 -920 -21445 -31453 -34248 -42585 -41309 -37664 -36305 -41155 -36804 -33951 -23736 -12153 832
$$ packed form
5494D897J2007K32r252j4734r518N807k054K766N903O783M978o329l958l724N95
5479e601J9061j785j0183r019k106K407l938J4169L386j284k685J371N307m741
5465D359J500m721q636J1611J5489J3293m073o941q789J6550R426j0035j5523
5452A3510j1166j6682M321J0251o171m940K620j3902P601K583l339L081n910L102
5438a5041M043R61O504K203j0663p216r769K186J5990K3505j582p854Q025Q483
5424A9775r143j2673j1352K37j551m235K764o791N371O194j0291n830J5730J2368
5410E73K076m963j4589j0461o623o045K154M71J7612N624K986P211l581j832O168
5395c219K299k0525j0008k795q337J276L645J359m850M351K853J0215J1583J2985
$$ plain form
5381 832 8508 -3538 -16657 -19101 -15083 -15969 -14839 -17812 -7105 -8966 -7774 -2583 2156 -1289 -2434
5366 -2434 -5706 -10267 -5300 4797 11713 -8361 -23414 -24842 -20522 -13615 -30 1258 -10756 -20748
5352 -20748 -19820 2762 5691 4464 2921 8636 742 7979 6760 -3560 -21723 -26291 -9805 -1839
5338 -1839 -2465 -7035 -22454 -18116 -3300 -9345 -31771 -40033 -25489 -4284 10413 -1940 -16734
5325 -16734 -19248 -6707 -2636 523 -5556 -4584 1164 3112 4019 3776 1347 -6362 -12800 -14955 -13063
5310 -13063 -31535 -24997 -4718 -2914 1720 13532 18730 4278 -7758 -11788 -14865 -11051 -6613
5297 -6613 11979 22939 15714 1869 -11952 -13107 -23725 -10809 -2092 -947 -4044 -8186 9832
5284 9832 16424 18487 10589 626 -2991 1120 -3406 -8108 -7771 -5905 1596 -2788 -1355 6202 4210
$$ packed form
5381H32P676j2046j3119k444M018q86J130k973J0707j861J192N191M739l445j145
5366b434l272m561M967J0097O916k0074j5053j428M320O907J3585J288j2014r992
5352b0748R28K2582K929j227j543N715p894P237j219j0320j8163m568J6486P966
5338a839o26m570j5419M338J4816o045k2426q262J4544K1205J4697j2353j4794
5325a6734k514J2541M071L159o079R72N748J948R07k43k429p709o438k155J892
5310a3063j8472O538K0279J804M634J1812N198j4452j2036m030l077L814M438
5297f613J8592J0960p225j3845j3821j155j0618J2916Q717J145l097m142J8018
5284I832O592K063p898r963l617M111m526m702L37J866P501m384J433P557j992
$$ plain form
5269 4210 -2843 -340 -1218 -4417 2129 2488 6322 17672 20802 12961 12805 13549 2554 -2936 301
5254 301 -11175 -6543 -14362 -7685 8950 10124 13557 12634 6311 5381 -5102 -5428 -1321 -14422 -14442
5239 -14442 -11500 -5367 -3215 2819 15325 21794 24222 24366 14614 3112 8661 15541 11333 -372
5225 -372 -1723 -9644 -6808 -1798 97 -8542 -18562 -15539 -5917 10511 12914 -9168 -11577 -463
5211 -463 -6313 -15930 -14747 -2637 -7129 -21962 -11766 -1185 2361 263 -982 -5899 -6249 3907
5197 3907 -17177 -26811 -15725 1175 10643 13814 8339 -2142 -10172 -5865 -13369 -6195 2026 -2869
5183 -2869 -2351 -11228 3166 4827 713 -11657 -19991 -16057 -21768 -22869 -25268 -22739 -11828 4318
5169 4318 2284 -9039 -22407 -29132 -32321 -13533 1279 -4235 -5709 -5196 11512 25588 24370 5013
$$ packed form
5269D210p053K503q78l199O546L59L834J1350L130p841j56P44j0995n490L237
5254C01j1476M632p819O677J6635J174L433r23o323r30j0483l26M107j3101k0
5239a4442K942O133K152O034J2506O469K428J44r752j1502N549O880m208j1705
5225c72j351p921K836N010J895q639j0020L023R622J6428K403k2082k409J1114
5211d63n850r617J183J2110m492j4833J0196J0581L546k098j245m917l50J0156
5197C907k1084r634J1086J6900R468L171n475j0481q030M307p504P174Q221m895
5183b869N18q877J4394J661m114j2370q334L934n711j101k399K529J0911J6146
5169D318k034j1323j3368o725l189J8788J4812n514j474N13J6708J4076j218j9357
$$ plain form
5155 5013 2448 -4771 -5357 -4943 -286 7597 -2647 -16709 -6740 -4425 -19761 -10512 -2475 -6865 -6226
5140 -6226 -15757 -27597 -18874 -8951 -16690 -18593 -19479 -4876 9390 14880 17626 22661 31170 29047
5126 29047 2399 -17882 -19867 -20876 -25409 -11429 10001 21528 12016 3092 1492 9364 19864
5113 19864 23324 6883 -13422 -22828 -19114 -12053 -10425 -11814 -28287 -29097 -32251 -29344 -31203 -28760
5099 -28760 -19584 -3635 -11560 -13912 -16584 -21453 -10189 -10641 -19825 -20867 -20580 -13450 -540 4887
5085 4887 2720 -8753 -17170 -27111 -25797 -25206 -17825 -15328 -30816 -23605 -19813 -27255 -31744 -28964 -15847
5070 -15847 -10452 -20675 -26817 -25556 -13546 2374 4658 905 -4254 -10747 -2298 7123 12202 26219
5056 26219 26956 5189 -16226 -6188 575 1248 5073 6814 11799 11438 -4997 -15798 -20768 -17041
$$ packed form
5155E013k565p219n86M14M657P883j0244j4062R969K315j5336R249Q037m390O39
5140f226r531j1840Q723R923p739j903q86J4603J4266N490K746N035Q509k123
5126B9047k6648k0281j985j009m533J3980K1430J1527r512q924j600P872J0500
5113A9864L460j6441k0305r406L714P061J628j389j6473q10l154K907j859K443
5099b8760R176J5949p925k352k672m869J1264m52r184j042K87P130J2910N427
5085D887k167j1473q417r941J314N91P381K497j5488P211L792p442m489K780J3117
5070a5847N395j0223o142J261J2010J5920K284l753n159o493Q449R421N079J4017
5056B6219P37k1767k1415J0038O763O73L825J741M985l61j6435j0801m970L727
$$ plain form
5042 -17041 -11217 -22338 -12820 -12927 -14034 -15888 -5948 -3060 -6819 -1658 -12024 -14410 -19280 -14206
5028 -14206 3404 5750 -6097 -13394 -10372 -8703 6639 4635 7335 13196 14265 16232 19821 22645
5014 22645 20181 33164 15740 1109 26880 39953 19028 15698 13611 15936 4975 -10841 -18425
5001 -18425 -25808 -14924 -3038 -11010 -15363 -8377 -10 960 -13960 -13502 -7689 -10013 -15685 -5738
4987 -5738 -360 -14097 -16062 -7944 -2075 5762 4879 -4458 7142 6598 -5594 -16230 -6587 5368
4973 5368 11801 -2019 -13596 -11616 -5015 742 253 -3648 9595 20545 23782 14429 13218 -79
4959 -79 -4886 -5358 -679 823 -9341 -5452 -17553 -4183 5144 9058 19190 9815 13595 11277 1471
4944 1471 -14180 -16477 -6685 -11786 -13449 -13726 -11258 -10459 -2780 3178 3449 13386 5294 13086 3090
$$ packed form
5042a7041N824j1121R518j07j107j854R940K888l759N161j0366k386m870N074
5028a4206J7610K346j1847p297L022J669J5342k004K700N861J069J967L589K824
5014B2645k464J2983j7424j4631K5771J3073k0925l330k087K325j0961j5816p584
5001a8425p383J0884J1886p972m353O986Q367R70j4920M58N813k324n672R947
4987e738N378j3737j965Q118N869P837q83r337J1600n44j2192j0636R643J1955
4973E368O433j3820j1577J980O601N757m89l901J3243J0950L237r353j211j3297
4959g9m807m72M679J502j0164L889j2101J3370R327L914J0132r375L780k318r806
4944A471j5651k297R792n101j663k77K468P99P679N958K71R937q092P792r996
$$ plain form
4929 3090 -12733 -4514 -7017 -12774 -4038 -6952 6456 5012 -584 -4613 2645 6759 -13802 -22219
4915 -22219 -24953 -20561 -9985 -20985 -12564 -8719 -5863 793 13707 9801 8488 13971 17443 -5869
4901 -5869 -11090 -4128 -14251 -13305 -1574 -4905 -11336 -13895 -18575 -7291 -4529 -10994 -18068 -25497
4887 -25497 -25807 -12872 -9812 -11508 -23726 -23810 -25861 -25862 -13644 -849 5727 8183 -9621 -10802 -8320
4872 -8320 -2727 -8938 -11959 -5488 4663 -2498 -11100 -11369 6390 7271 -5022 -9729 -12291 -12535 -7169
4857 -7169 -1878 2394 -1068 1645 3020 11505 5282 -4223 -4687 -5462 342 -6780 -6396 -10925 4541
4842 4541 17087 9424 -2335 -2139 96 -3222 -12865 -2785 3820 5124 -4595 -6491 -11505 2443
4828 2443 8334 12121 14407 643 -9254 -11242 -9148 -7066 -5899 -8461 -31624 -35923 -16407 -2847
$$ packed form
4929C090j5823Q219k503n757Q736k914J3408j444n596m029P258M114k0561q417
4915b2219k734M392J0576j1000Q421L845K856O656J2914l906j313N483L472k3312
4901e869n221O962j0123R46J1731l331o431k559m680J1284K762o465p074p429
4887b5497l10J2935L060j696j2218q4k051jJ2218J2795O576K456j7804j181K482
4872h320N593o211l021O471J0151p161q602k69J7759Q81j2293m707k562k44N366
4857g169N291M272l462K713J375Q485o223r505m64p75N804p122L84m529J5466
4842D541J2546p663j1759J96K235l318r643J0080O605J304r719j896n014J3948
4828B443N891L787K286j3764r897j988K094K082J167k562k3163m299J9516J3560
$$ plain form
4814 -2847 -5282 -59 13942 3736 -1662 6729 18506 17159 19735 14380 6168 -11586 -18263 -4625
4800 -4625 12047 10006 27187 17653 4706 -9184 -24667 -14072 -11241 -21895 -12769 -1250 -3357
4787 -3357 -9481 -1634 2279 -9583 -8859 -5802 -1610 -11056 -10460 -2403 5827 15513 17222 17717 11585
4772 11585 10516 7428 15405 464 -8704 -11101 -10333 -12354 -13085 -8259 3650 2078 -16948 -21826
4758 -21826 -11736 -2230 -1670 -12412 -30880 -29974 -19157 -13669 -12934 -11672 -6053 -238 4267 8052
4744 8052 8394 7912 -4911 -7337 9875 20411 8518 -4757 -14678 -19785 -23713 -9768 -14012 -18549
4730 -18549 -32159 -26170 -12976 -12518 987 2934 -2864 -7583 -6119 -13379 -21087 -23433 -21633 -17003
4716 -17003 -14771 -21560 -17424 -21549 -16988 -11807 -6316 -4822 -14958 -23076 -26631 -28636 -13112 -22023
$$ packed form
4814b847k435N223J4001j0206n398Q391J1777j347K576n355q212j7754o677J3638
4800d625J6672k041J7181r534j2947j3890j5483J0595K831j0654R126J1519k107
4787c357o124P847L913j1862P24L057M192r446N96Q057Q230R686J709M95o132
4772A1585j069l088P977j4941r168k397P68k021p31M826J1909j572j9026m878
4758b1826J0090R506N60j0742j8468R06J0817N488P35J262N619N815M505L785
4744H052L42m82j2823k426J7212J0536j1893j3275r921n107l928J3945m244m537
4730a8549j3610N989J3194M58J3505J947n798m719J464p260p708k346J800M630
4716a7003K232o789M136m125M561N181N491J494j0136q118l555k005J5524q911
$$ plain form
4702 -22023 -22839 -14227 -10521 -1234 2049 -9990 -4546 3688 20017 6417 -20349 -21672 -11038 -17262
4688 -17262 -23488 -13809 -8474 513 -22 -10045 -12193 -11848 -10869 -15186 -17896 -13067 -255 6818 9318
4673 9318 11415 9232 13374 14796 10262 -888 -5204 5290 -2620 2404 -2952 -5345 -8508 -2955
4659 -2955 -1457 -3113 9144 2939 -5350 -1296 691 -1723 -17128 -25915 -27411 -38156 -28098 -11288
4645 -11288 -3617 -3022 11396 7435 -2681 -18656 -21552 -9166 -90 -1562 -7360 -7816 -11357 -14160
4631 -14160 9142 20922 19429 6257 -15863 -24417 -10485 -3342 1951 95 1158 -817 -1015 -1871
4617 -1871 -5553 -16903 -28477 -14053 6111 12172 -382 4090 13742 23564 20351 14843 11254 15719
4603 15719 27006 23733 2977 -13833 -5572 4516 5221 8605 -3688 -14662 -19748 -23099 -13771
$$ packed form
4702b2023q16Q612L706R287L283j2039N444Q234J6329j3600k6766j323J0634o224
4688a7262o226R679N335Q987n35j0023k148L45R79m317k710M829J2812P073K500
4673I318K097k183M142J422m534j1150m316J0494p910N024n356k393l163N553
4659b955J498j656J2257o205q289M054J987k414j5405q787j496j0745J0058J6810
4645a1288P671N95J4418l961j0116j5975k896J2386R076j472n798m56l541k803
4631a4160K3302J1780j493j3172k2120q554J3932P143N293j856J063j975j98q56
4617a871l682j1350j1574J4424K0164O061j2554M472R652R822l213n508l589M465
4603A5719J1287l273k0756j6810Q261J0088P05L384j2293j0974n086l351R328
$$ plain form
4590 -13771 -6248 -12930 -14718 -21440 -31673 -26111 -17839 -7723 -508 6486 5979 1839 -13402 -13698
4576 -13698 -1420 3824 2391 -9407 -998 5788 8679 -2008 -7900 -3426 -2809 -10709 -4227 -1934
4562 -1934 -7023 -6470 -17951 -31281 -19293 -20704 -24534 -25735 -20795 -16235 -14967 -14049 -12732 -16892 -23910
4547 -23910 -16997 -11863 -11751 -16900 -4489 1723 6890 1524 -1819 -8757 -6325 2657 -4618 -5252 -9515
4532 -9515 -15806 -17747 -16673 -19426 -22292 -14521 -3094 9315 7915 948 -3838 -349 5015 -6995
4518 -6995 -7985 11585 23092 12868 -5543 -8789 -4368 -6312 2329 15415 19155 16230 5503 -15876
4504 -15876 -20782 -30061 -10452 9374 -1703 -7876 -7122 -12991 -12570 -3828 287 -9040 -24025 -18089
4490 -18089 3085 5558 10556 2958 -2015 -2526 -15196 -22283 -17758 -11810 1830 1766 -9820 -11490
$$ packed form
4590a3771P523o682j788o722j0233N562Q272J0116P215O994n07m140j5241k96
4576a3698J2278N244j433j1798Q409O786K891j0687n892M474O17p900O482K293
4562a934n089N53j1481j3330J1988j411l830j201M940M560J268R18J317m160p018
4547b3910O913N134J12n149J2411O212N167n366l343o938K432Q982p275o34m263
4532i515o291j941J074k753k866P771J1427J2409j400o967m786L489N364j2010
4518f995r90J9570J1507j0224j8411l246M421j944Q641J3086L740k925j0727k1379
4504a5876m906r279J9609J9826j1077o173P54n869M21Q742M115r327j4985N936
4490a8089K1174K473M998p598m973n11j2670p087M525N948J3640o4j1586j670
$$ plain form
4476 -11490 -29814 -37378 -19926 -7907 -8149 4876 2716 -12835 -10867 3738 9645 17316 8551
4463 8551 6249 658 -3580 -1133 -14320 -20731 -997 20629 24334 28305 31666 29639 15066 6202
4449 6202 -3847 -9466 -10796 -2099 -257 -24501 -20536 -11608 1828 -1116 -5324 -10087 -13918 -13302
4435 -13302 -8643 -5321 -6763 -5088 -1786 -10489 -25550 -21000 -20113 -2756 -8023 -19895 8111 17482
4421 17482 18424 4155 7617 3654 -5730 -8957 -8743 -8073 -8064 -6546 -642 -8468 -8612 -5335 -10841 -21639
4405 -21639 -24804 -29168 -35438 -30161 -20281 -9322 -9675 -19687 -9944 6347 5503 7397 -1786 -2538 343
4390 343 3341 -8617 5539 11853 1600 -3629 8349 11564 9159 7813 -5089 -16114 -5616
4377 -5616 8916 12660 5481 13959 6886 9968 8343 876 6460 12567 2901 6330 5314 11834 5554
$$ packed form
4476a1490j8324p564J7452J2019k42J3025k160j5551J968J4605N907P671q765
4463H551k302n591m238K447j3187o411J9734K1626L705L971L361k027j4573q864
4449F202j0049n619j330Q697J842k4244L965Q928J3436k944m208m763l831O16
4435a3302M659L322j442J675L302q703j5061M550Q87J7357n267j1872K8006R371
4421A7482R42j4269L462l963r384l227K14O70RJ518N904p826j44L277n506j0798
4405b1639l165m364o270N277R880J0959l53j0012R743J6291q44J894r183p52K881
4390C43K998j1958J4156O314j0253n229J1978L215k405j346j2902j1025J0498
4377e616J4532L744p179Q478p073L082j625p467N584O107r666L429j016O520o280
$$ plain form
4362 5554 7875 14381 -1092 2701 9965 14016 7946 -4621 -6816 -9605 -10011 -8286 -2679 177 3319
4347 3319 -2787 -5651 -5366 -1758 -3875 -4783 -9814 -12932 -21935 -32600 -29407 -17393 -2542 501 -5367
4332 -5367 -7442 -11527 616 10097 8155 3486 -4633 -15852 -12826 -11038 -13897 -9217 -5233 -9554
4318 -9554 -5195 5052 5159 13353 1060 -20112 -24269 -6502 6821 13186 7667 2497 1384 6221
4304 6221 16326 6143 -6298 -12845 -14322 -10486 -20164 -18651 -13944 1839 8253 -983 -5114 -20642
4290 -20642 -13830 -11604 4705 -12529 -30660 -22988 -7866 -6579 8120 5685 -8904 -8101 -8399 -4364
4276 -4364 -3216 -3131 -4961 -4404 4288 3698 6593 6735 -563 -133 645 5393 4036 1011 -6958 -15773 -18543
4259 -18543 -9621 -4260 -11776 -13157 -6100 1683 8783 15241 9371 12459 7022 -2259 -13283 -2270
$$ packed form
4362E554K321O506j5473L793P264M051o070j2567k195k789m06J725N607K856L142
4347C319o106k864K85L608k117r08n031l118r003j0665L193J2014J4851L043n868
4332e367k075m085J2143R481j942m669q119j1219L026J788k859M680L984m321
4318i554M359J0247J07Q194j2293k1172m157J7767J3323O365n519n170j113M837
4304F221J0105j0183j2441o547j477L836r678J513M707J5783O414r236m131j5528
4290b0642O812K226J6309j7234j8131P672J5122J287J4699k435j4589Q03k98M035
4276d364J148Q5j830N57Q692n90K895J42p298M30P78M748j357l025p969q815k770
4259a8543Q922N361p516j381P057P783P100O458n870L088n437r281j1024J1013
$$ plain form
4245 -2270 -8264 -7972 -3871 -9898 -23553 -40000 -20045 -12240 -24497 -33185 -23948 -9453 440 2709
4231 2709 2388 -571 -6796 -8552 -7135 -10778 -13895 -4328 -3601 -6876 3445 7443 7889 11107 4753
4216 4753 -15935 -31249 -31711 -27890 -13752 -6541 2918 6692 6858 11085 7131 -10160 -22725 -18354
4202 -18354 -11753 -7803 -11914 -7692 -7050 -9013 -737 2385 -9143 -45 -1749 -4675 -5577 -4382 3615
4187 3615 5900 -4459 -15972 -10468 -15544 -27245 -33710 -21179 -16889 -25302 -28619 -30627 -28270 -16075
4173 -16075 -1050 -8296 -14688 -18534 -17895 -3133 11766 7801 11100 16400 9318 2850 -9951 -17489
4159 -17489 -11347 -11361 14015 28208 18306 12719 14211 16067 -10448 -11520 -15313 -8613 879 2318
4145 2318 1896 -1783 -9845 -2071 -1434 -8209 -10518 -1940 2073 -4818 -15696 -9155 -10453 -14539 -9187
$$ packed form
4245b270n994K92M101o027j3655j6447J9955P805j2257q688R237J4495R893K269
4231B709l21k959o225j756J417l643l117R567P27l275J0321L998M46L218o354
4216D753k0688j5314m62L821J4138P211R459L774J66M227l954j7291j2565M371
4202a8354O601L950m111M222O42j963Q276L122j1528R098j704k926r02J195P997
4187C615K285j0359j1513N504n076j1701o465J2531M290q413l317k008K357J2195
4173a6075J5025p246o392l846O39J4762J4899l965L299N300p082o468j2801p538
4159a7489O142j4K5376J4193r902n587J492J856k6515j072l793O700R492J439
4145B318m22l679q062P774O37o775k309Q578M013o891j0878O541j298m086N352
$$ plain form
4130 -9187 -17712 -14595 -771 7112 17435 13456 -2272 -15821 -32360 -32110 -15163 -11483 -16202 -22131
4116 -22131 -30532 -27021 -8932 898 -2382 -16947 -25521 -28307 -11306 -5147 -8588 4435 13169 -1882
$$ packed form
4130i187q525L117J3824P883J0323l979j5728j3549j6539K50J6947L680m719n929
4116b2131q401L511J8089R830l280j4565q574k786J7001O159l441J3023Q734j5051
$$ [...]
##END NTUPLES=NMR SPECTRUM
##END=
