##TITLE=316690	cc 26724	449/68	adrs	davee
##JCAMPDX= 6.0         $$ Bruker NMR JCAMP-DX V2.0
##DATA TYPE= NMR SPECTRUM
##DATA CLASS= NTUPLES
##ORIGIN= Bruker BioSpin GmbH
##OWNER= nmr
$$ XWIN-NMR		Version 3.5
$$ Tue Jul 11 13:48:47 2006 GMT Daylight Time (UT+1h)  MAYBRIDGE\nmr@NMR_250MHZ
##.OBSERVE FREQUENCY= 250.131544655141
##.OBSERVE NUCLEUS= ^1H
##.ACQUISITION MODE= SIMULTANEOUS (DQD)
##.ACQUISITION SCHEME= undefined
##.AVERAGES= 1
##.DIGITISER RES= 18
##SPECTROMETER/DATA SYSTEM= dpx250
##.PULSE SEQUENCE= zg30
##.SOLVENT NAME= CDCl3
##.SHIFT REFERENCE= (INTERNAL, CDCl3, 0, 16.522)
##AUDIT TRAIL= $$ (NUMBER, WHEN, WHO, WHERE, WHAT)
$$ ##TITLE= Audit trail, XWIN-NMR		Version 3.5
$$ ##JCAMPDX= 5.01
$$ ##ORIGIN= Bruker BioSpin GmbH
$$ ##OWNER= nmr
$$ C:/u/data/dgb/nmr/ADRS/15170/pdata/1/auditp.txt
$$ ##AUDIT TRAIL=  $$ (NUMBER, WHEN, WHO, WHERE, WHAT)
(   1,<2006-01-25 10:36:54.85 +000>,<MAYBRIDGE\nmr>,<NMR_250MHZ>,
      <created by zg, POWCHK disabled, PULCHK disabled
       terminated by command 'halt'
       configuration hash MD5:
       62 19 C7 07 E1 42 D1 B7 37 6C 3D D0 77 39 F9 E6
       data hash MD5: 64K
       19 1C B0 9A 28 84 67 D8 3E 49 27 32 6A A7 6B 7B>)
(   2,<2006-01-25 10:37:01.48 +000>,<MAYBRIDGE\nmr>,<NMR_250MHZ>,
      <Start of raw data processing
       ef LB = 0.3 FT_mod = 6 PKNL = 1 SI = 32K 
       data hash MD5: 32K
       A4 36 DB AA 36 08 63 4E 5A 80 70 02 DE D7 2B 7E>)
(   3,<2006-01-25 10:37:03.46 +000>,<MAYBRIDGE\nmr>,<NMR_250MHZ>,
      <apk 
       data hash MD5: 32K
       09 44 C6 07 58 A6 4C 39 FD 07 42 CC 35 0E 9A 54>)
(   4,<2006-01-25 10:37:04.40 +000>,<MAYBRIDGE\nmr>,<NMR_250MHZ>,
      <abs ABSG = 5 
       data hash MD5: 32K
       BB 8A 19 F0 D5 AB 7E 2F 76 4C A1 31 3B 2D C1 23>)
$$ ##END=
$$ 
$$ hash MD5
$$ 9D D4 A7 B7 4F 6C 1C 13 FE EE 7C 2C F4 AC 5F 0A
##$RELAX= 
##$RELAX= 
##$RELAX= 
##$RELAX= 
##$RELAX= 
##$RELAX= 
##$RELAX= 
$$ Bruker specific parameters
$$ --------------------------
##$DU= <C:\Restored>
##$EXPNO= 15170
##$NAME= <ADRS>
##$PROCNO= 1
##$TYPE= <nmr>
##$USER= <dgb>
##$AMP= (0..31)
100 100 100 100 100 100 100 100 100 100 100 100 100 100 100 100 100 100 
100 100 100 100 100 100 100 100 100 100 100 100 100 100 
##$AQSEQ= 0
##$AQ_mod= 3
##$AUNM= <au_zg>
##$AUTOPOS= <9 >
##$BF1= 250.13
##$BF2= 250.13
##$BF3= 250.13
##$BF4= 250.13
##$BF5= 500.13
##$BF6= 500.13
##$BF7= 500.13
##$BF8= 500.13
##$BYTORDA= 1
##$CFDGTYP= 0
##$CFRGTYP= 5
##$CHEMSTR= <none>
##$CNST= (0..31)
1 1 145 1 1 1 1 1 1 1 1 1 1 1 1 1 1 1 1 1 1 1 1 1 1 1 1 1 1 1 1 1 
##$CPDPRG= <>
##$CPDPRG1= <>
##$CPDPRG2= <>
##$CPDPRG3= <>
##$CPDPRG4= <mlev>
##$CPDPRG5= <mlev>
##$CPDPRG6= <mlev>
##$CPDPRG7= <mlev>
##$CPDPRG8= <mlev>
##$CPDPRGB= <>
##$CPDPRGT= <>
##$D= (0..31)
0 1 0 0 0 0 0 0 0 0.06 0 0 0 0 0 0 0.0002 0 0 0 0 0 0 0 0 0 0 0 0 0 0 
0 
##$DATE= 1138185413
##$DBL= (0..7)
120 120 120 120 120 120 120 120 
##$DBP= (0..7)
150 150 150 150 150 150 150 150 
##$DBP07= 0
##$DBPNAM0= <>
##$DBPNAM1= <>
##$DBPNAM2= <>
##$DBPNAM3= <>
$$ [...]
##$SUBNAM7= <"">
##$SUBNAM8= <"">
##$SUBNAM9= <"">
##$SW= 20.6930455092707
##$SWIBOX= (0..15)
0 0 3 0 0 0 0 0 0 0 0 0 0 0 0 0 
##$SW_h= 5175.983436853
##$TD= 65536
##$TD0= 1
##$TE= 293.16
##$TE2= 300
##$TE3= 300
##$TEG= 300
##$TL= (0..7)
0 120 120 120 120 120 120 120 
##$TP= (0..7)
150 150 150 150 150 150 150 150 
##$TP07= 0
##$TPNAME0= <>
##$TPNAME1= <>
##$TPNAME2= <>
##$TPNAME3= <>
##$TPNAME4= <>
##$TPNAME5= <>
##$TPNAME6= <>
##$TPNAME7= <>
##$TPOAL= (0..7)
0.5 0.5 0.5 0.5 0.5 0.5 0.5 0.5 
##$TPOFFS= (0..7)
0 0 0 0 0 0 0 0 
##$TUNHIN= 0
##$TUNHOUT= 0
##$TUNXOUT= 0
##$USERA1= <user>
##$USERA2= <user>
##$USERA3= <user>
##$USERA4= <user>
##$USERA5= <user>
##$V9= 5
##$VALIST= <valist>
##$VCLIST= <CCCCCCCCCCCCCCC>
##$VD= 0
##$VDLIST= <DDDDDDDDDDDDDDD>
##$VPLIST= <PPPPPPPPPPPPPPP>
##$VTLIST= <TTTTTTTTTTTTTTT>
##$WBST= 1024
##$WBSW= 4
##$XGAIN= (0..3)
0 0 0 0 
##$XL= 0
##$YL= 0
##$YMAX_a= 23212
##$YMIN_a= -30863
##$ZGOPTNS= <>
##$ZL1= 120
##$ZL2= 120
##$ZL3= 120
##$ZL4= 120
##$ABSF1= 16.522
##$ABSF2= -4.171173
##$ABSG= 5
##$ABSL= 3
##$ALPHA= 0
##$AQORDER= 0
##$ASSFAC= 0
##$ASSFACI= 0
##$ASSFACX= 0
##$ASSWID= 0
##$AUNMP= <proc_1d>
##$AZFE= 0.1
##$AZFW= 0.1
##$BCFW= 0
##$BC_mod= 0
##$BYTORDP= 0
##$COROFFS= 0
##$CY= 12.5
##$DATMOD= 1
##$DC= 0
##$DFILT= <>
##$DTYPP= 0
##$F1P= 14.0000005364418
##$F2P= -0.99999901652339
##$FCOR= 0.5
##$FTSIZE= 32768
##$FT_mod= 6
##$GAMMA= 0
##$GB= 0
##$INTBC= 1
##$INTSCL= 1
##$ISEN= 128
##$LB= 0.3
##$LEV0= 0
##$LPBIN= 0
##$MAXI= 10000
##$MC2= 0
##$MEAN= 0
##$ME_mod= 0
##$MI= 0
##$NCOEF= 0
##$NC_proc= -7
##$NLEV= 6
##$NOISF1= 0
##$NOISF2= 0
##$NSP= 0
##$NTH_PI= 0
##$NZP= 0
##$OFFSET= 16.522
##$PC= 1
##$PHC0= -107.9422
##$PHC1= 6.406861
##$PH_mod= 1
##$PKNL= yes
##$PPARMOD= 0
##$PSCAL= 4
##$PSIGN= 0
##$REVERSE= no
##$SF= 250.13
##$SI= 32768
##$SIGF1= 0
##$SIGF2= 0
##$SINO= 400
##$SIOLD= 32768
##$SREGLST= <1H.CDCl3>
##$SSB= 0
##$STSI= 32768
##$STSR= 0
##$SW_p= 5175.98343685301
##$SYMM= 0
##$S_DEV= 0
##$TDeff= 65536
##$TDoff= 0
##$TI= <Analysis number 999999
Compound Code 99
Book Reference 9
Project Code 9>
##$TILT= no
##$TM1= 0
##$TM2= 0
##$TOPLEV= 0
##$USERP1= <user>
##$USERP2= <user>
##$USERP3= <user>
##$USERP4= <user>
##$USERP5= <user>
##$WDW= 1
##$XDIM= 32768
##$YMAX_p= 493465643
##$YMIN_p= -1990958
$$ End of Bruker specific parameters
$$ ---------------------------------
##NTUPLES= NMR SPECTRUM
##VAR_NAME=  FREQUENCY,     SPECTRUM/REAL,   SPECTRUM/IMAG
##SYMBOL=    X,             R,               I
##VAR_TYPE=  INDEPENDENT,   DEPENDENT,       DEPENDENT
##VAR_FORM=  AFFN,          ASDF,            ASDF
##VAR_DIM=   32768,         32768,           32768
##UNITS=     HZ,            ARBITRARY UNITS, ARBITRARY UNITS
##FACTOR=    0.157963299565203, 1,           1
##FIRST=     4132.6476996994, 0,             0
##LAST=      -1043.33573715361, 0,           0
##MIN=       -1043.33573715361, -1990958,    0
##MAX=       4132.6476996994, 493465643,     0
$$ Real data points
##PAGE= N=1
##DATA TABLE= (X++(R..R)), XYDATA
$$ [...]
15560a68958O3499p7874J43776k2897j15744r1173Q4086l7115m8763j7934K28036
$$ -168958 -105459 -183333 -39557 -62454 -178198 -269371 -185285 -222400 -271163 -289097 -61061
15549f1061K14535J69405j25310n9547n6584r8012j06668j53112j26223l444M06537
$$ -61061 153474 322879 197569 138022 81438 -16574 -123242 -276354 -402577 -406021 516
15538E16P0868J39458K38172j63479k28161j24501J51990N2493M7491k13717j13490
$$ 516 71384 210842 449014 285535 57374 -67127 84863 137356 184847 -28870 -142360
15527a42360P0699J2879j80443m8150K12400J72170j74320o3511J05409n9970
$$ -142360 -71661 -58782 -239225 -287375 -74975 97195 -77125 -140636 -35227 -95197
15517i5197P5061K5974L8308k8212l4937m9944R2926J13197Q7980R8050R4272
$$ -95197 -20136 5838 44146 15934 -19003 -68947 23979 137176 225156 323206 417478
15506D17478n3471j36844p1242L0587k9745J81522O8671k9806r8429J5554N0417
$$ 417478 364007 227163 155921 186508 156763 338285 406956 377150 278721 294275 344692
15495C44692L1788o7019K5781j19000l3046k0195o4310J6320p4583j11642J37252
$$ 344692 376480 309461 335242 216242 183196 163001 98691 115011 40428 -71214 66038
15484F6038O6833l667j26573j82419j17723J01882N6130P6792k66997J11178J88660
$$ 66038 132871 129204 2631 -179788 -297511 -195629 -139499 -62707 -329704 -218526 -29866
15473b9866N8344j28003L6372P2199m9264j89402J99057K35962J70816p9000r3330
$$ -29866 28478 -99525 -63153 9046 -40218 -229620 -30563 205399 376215 297215 203885
15462B03885J4776k61741l84909L5282R9780p0393j578K05677J39388J16268P2244
$$ 203885 218661 -43080 -427989 -392707 -292927 -363320 -364898 -159221 -19833 96435 168679
15451A68679j30015M4659J11130M9033K3455j62838k66422J71652L4277J01698
$$ 168679 38664 83323 194453 243486 266941 104103 -162319 9333 43610 145308
15441A45308P2668j09033J08639J34946o1760P003q0996J5482j58354p8401l9668
$$ 145308 217976 108943 217582 352528 290768 297771 216775 232257 73903 -4498 -44166
15430d4166k6621J18896K49864J52539M3492k19473m7896l8251q3785Q6492N0288
$$ -44166 -70787 48109 297973 450512 494004 274531 226635 188384 104599 191091 241379
15419B41379J98872k96388l06513k2302P0301N1418n9399O8942j6979l41804J65956
$$ 241379 440251 143863 -162650 -184952 -114651 -63233 -122632 -53690 -70669 -412473 -246517
15408b46517M63819K11917j33690l44005q1253L1907j52110j09745M0390k4582
$$ -246517 217302 429219 295529 -48476 -129729 -97822 -249932 -359677 -319287 -343869
15398c43869J65427n7841L09597j63130r3033J5638m8088L8563L20163j7249j23686
$$ -343869 -178442 -236283 73314 -89816 -182849 -167211 -215299 -176736 143427 126178 2492
15387B492j25449j01295l7758K5472k20749M160J64363L13971R6897j33870l0974
$$ 2492 -122957 -224252 -262010 -236538 -457287 -453127 -288764 25207 122104 -11766 -42740
15376d2740Q0456m1237r6277j35905J785N4152J38527M4892j53466R6575J25449
$$ -42740 37716 -3521 -99798 -235703 -233918 -179766 -41239 3653 -149813 -53238 72211
15365G2211J28970j74972j02581R8955j6461q3723k61770J07403L5632p3355K17084
$$ 72211 201181 26209 -76372 22583 6122 -77601 -339371 -231968 -196336 -269691 -52607
15354e2607K25798K3520O8389k72878l22110J01507J10729J56029P9572k36606
$$ -52607 173191 196711 265100 -7778 -329888 -228381 -117652 38377 117949 -118657
15344a18657P5338R9827j8127j56999j14389M0780q029j28471R1944M2798J26139
$$ -118657 -43319 56508 38381 -118618 -233007 -192227 -200256 -328727 -236783 -193985 -67846
15333f7846j33998m6347L16685K72791j18988l49741m8391K32199j8607J44453
$$ -67846 -201844 -248191 68494 341285 222297 -127444 -175835 56364 37757 182210
15323A82210l32300j50851J10714K6239O7126k2140J49102m7645j21393q1130
$$ 182210 -150090 -300941 -190227 -163988 -96862 -119002 30100 -17545 -138938 -220068
15313b20068L1203L9378n4961j21057k3557J19808j38817j60855K57886L01236
$$ -220068 -188865 -149487 -204448 -325505 -349062 -229254 -368071 -528926 -271040 30196
15303C0196J51866j03657j83385k02232k17887J82751N7662L26724M66569q2700
$$ 30196 182062 78405 -104980 -307212 -525099 -342348 -284686 42038 508607 425907
15293D25907j91512k90019j9697m9088K69076N9235J04091K12284n548p0217Q5786
$$ 425907 234395 -55624 -75321 -124409 144667 203902 307993 520277 514729 444512 530298
15282E30298j44030k28445k45231k03J21206L02473K38421N5566K5282j37697
$$ 530298 386268 157823 -87408 -87611 33595 336068 574489 630055 655337 517640
15272E17640l31587j12289K22321m6887l8249j30901l18495k020M1022J57367
$$ 517640 186053 73764 296085 249198 210949 80048 -238447 -240467 -199445 -42078
15262d2078K23570J25533j33617l5449j52440M1375j45471k7321J6844k0999P6926
$$ -42078 181492 307025 173408 137959 -14481 26894 -118577 -145898 -129054 -150053 -73127
15251g3127N2885R8080K58024k7495j13180r6411j12456j08543l7578p6519M2129
$$ -73127 -20242 77838 335862 308367 195187 98776 -13680 -122223 -159801 -236320 -194191
15240a94191L18405L2073j44448K5850j88893K4944l6780J45962R2142j35948
$$ -194191 124214 156287 11839 37689 -151204 -126260 -163040 -17078 75064 -60884
15230f0884j74375k6640J38032j18545q49N068J45289J64085j08129j35879M0673
$$ -60884 -235259 -261899 -123867 -242412 -243261 -238193 -92904 71181 -36948 -172827 -132154
15219a32154J24060J82343K0479j55699j37193J61246r220j78048N6888Q1392
$$ -132154 -8094 174249 194728 39029 -98164 63082 53862 -124186 -67298 14094
15209A4094j14372p2326K0797J38147R7218j62063l4688K36448n5779k35570k5950
$$ 14094 -100278 -172604 -151807 -13660 83558 -78505 -113193 123255 67476 -168094 -194044
15198a94044k7811l6539J67788K03322p0470j08599p7423J05217K92790J89124
$$ -194044 -221855 -258394 -90606 112716 42246 -66353 -143776 -38559 254231 443355
15188D43355r5896m06132R219K25215N7926N1771l59218r0612J55037J48591N7880
$$ 443355 347459 -58673 -49454 175761 233687 285458 -73760 -164372 -9335 139256 197136
15177A97136M133k73985j46377K05449j51664o6486J15149r6754K57510j10020
$$ 197136 201269 -72716 -219093 -13644 -165308 -231794 -116645 -213399 44111 -65909
15167f5909K7241P5753j66305j36219J34588N104l9325O3829J14974N7675o3816
$$ -65909 -38668 37085 -129220 -265439 -130851 -125747 -165072 -101243 13731 71406 7590
15156G590p7058O4695r7750m05766J37742J49003M8952k2579j79870J01880K0462
$$ 7590 -69468 -4773 -102523 -508289 -370547 -221544 -172592 -195171 -375041 -273161 -252699
15145b52699J09248K34587l1247O0409Q1948J15042k20692j70943J77142O3222
$$ -252699 -143451 91136 59889 120298 202246 317288 96596 -74347 102795 166017
15135A66017P9062M781p0471K48549J98579j17851j11583j67525j16524J11082
$$ 166017 245079 249860 179389 427938 626517 508666 397083 229558 113034 224116
15125B24116k8711q1741j22866q5673n7263J49311K59532K54391k66826l46143
$$ 224116 195405 113664 -9202 -94875 -152138 -2827 256705 511096 244270 -101873
15115a01873k57796L9862q5386r8181J71189Q183O1293L21665K50212j1684l20792
$$ -101873 -359669 -319807 -405193 -503374 -332185 -324002 -262709 58956 309168 297484 -23308
15104b3308k83675J54630K63792K19274r5695k28867O6304j00588k98607J78581
$$ -23308 -306983 -152353 111439 330713 235018 6151 72455 -28133 -326740 -148159
15094a48159J37156j16144L0253R9482J49097p837j06899n0561J4372r3108j99784
$$ -148159 -11003 -127147 -96894 2588 151685 143848 36949 -13612 760 -92348 -292132
15083b92132j48102o0609P2864J86458N5670R4121L42217J35091j32765k90206
$$ -292132 -440234 -500843 -427979 -241521 -185851 -91730 250487 385578 252813 -37393
15073c7393n1844k30886K74257L16253J38748J97886k79162L8072k9621k02625
$$ -37393 -89237 -320123 -45866 270387 409135 607021 327859 365931 336310 133685
15063A33685j29796j06110k9866N7170R6405K52675j03691l94187q9337R7449
$$ 133685 3889 -102221 -132087 -74917 21488 274163 170472 -223715 -313052 -215603
15053b15603m4841j89428j6241K02935j28295Q6810K92262N2631r4336K02433
$$ -215603 -260444 -449872 -466113 -263178 -391473 -304663 -12401 40230 -54106 148327
15043A48327J17889l92958P0066J37793J74925M736j65394j31535O7116J30110
$$ 148327 266216 -126742 -56676 81117 256042 260778 95384 -36151 30965 161075
15033A61075J27488j97354j25990k40067J26173K42989j34709n7594J74896L01287
$$ 161075 288563 91209 -34781 -274848 -148675 94314 -40395 -97989 76907 378194
15023C78194o5456k40980j549J64758l0459p7900J10250M8428j59399r9398P9333
$$ 378194 312738 71758 70209 234967 204508 126608 236858 285286 125887 26489 105822
15012A05822j43586L5718j33672j48734L04632L4699J74207J22281j13676k24133
$$ 105822 -37764 -2046 -135718 -284452 20180 54879 229086 351367 237691 13558
15002A3558j78661J32928R4620o0606j2120M6041K9397J28918K37386n0790k68573
$$ 13558 -165103 -32175 62445 1839 -10281 35760 65157 194075 431461 380671 112098
14991A12098j21200K2761o044L6878r449o8436P7394K36619J25239j37301j45433
$$ 112098 -9102 13659 7615 44493 35044 -33392 44002 280621 405860 268559 123126
14980A23126q1678j94989J60968L0334K09178o330j46789o0055J01848R0468j04290
$$ 123126 41448 -153541 7427 37761 246939 240609 93820 33765 135613 226081 121791
14969A21791j45771j21320K13586o4524l1903P4930K03506l9671M2370M0931o0763
$$ 121791 -23980 -145300 68286 3762 -28141 46789 250295 210624 252994 293925 233162
14958B33162k19615j25903l7466J28300j38550J9335N9719j5656m2004j96240
$$ 233162 13547 -112356 -149822 -21522 -160072 -140737 -81018 -96674 -138678 -334918
14948c34918j51315m9136J70829L76039K97511r7407k74736j08966J03434L0022
$$ -334918 -486233 -535369 -364540 11499 309010 211603 -63133 -172099 -68665 -38643
14938c8643K31628j97917Q2311q5005k26295j71989Q7537K09049j10256N4897
$$ -38643 192985 -4932 77379 -7626 -233921 -405910 -318373 -109324 -219580 -164683
14928a64683K01243J6349r6011k35004k34645j38655J02704o8608L3830L55088
$$ -164683 36560 52909 -43102 -278106 -512751 -651406 -548702 -617310 -583480 -228392
14918b28392J99073O4290j98452j26556J51624o0109j4372P7232q6896n7168Q6994
$$ -228392 -29319 34971 -163481 -290037 -138413 -198522 -212894 -135662 -222558 -279726 -192732
14907a92732P6391J73638r4880k02576J56501K03773J69452M15093P9487l42313
$$ -192732 -116341 57297 -37583 -240159 -83658 120115 289567 704660 784147 441834
14897D41834k6984k31482j17723J4104j33453k93746Q9142M3244k31466k7540
$$ 441834 414850 183368 65645 79749 -53704 -347450 -258308 -215064 -446530 -474070
14887d74070K21228K75458P3495J4494J0186J3556l5118m5538j39811j87473Q3182
$$ -474070 -252842 22616 96111 110605 120791 134347 99229 53691 -86120 -273593 -190411
14876a90411K84640r1149p734K60723P7970l97563p4785K91344p4545k13300J80451
$$ -190411 94229 3080 -4654 256069 334039 -63524 -138309 153035 78490 -134810 45641
14865D5641j08212j24629m4981k5686j14084L5251K19435k9603k81155k17157
$$ 45641 -62571 -187200 -232181 -257867 -371951 -336700 -117265 -146868 -428023 -645180
14855f45180J55667M3784J06922J03778k6155J34910L8918M7764n15j60349N3357
$$ -645180 -489513 -445729 -338807 -235029 -261184 -126274 -87356 -39592 -40107 -200456 -147099
14844a47099J28034J21945K58266r7101N0330j41597j78608q8205N7786o7617
$$ -147099 -19065 102880 361146 264045 314375 172778 -5830 -94035 -36249 -103866
14834a03866j48124j2098o2023J26448J29760J25443R9356J0500J0784J2843j63763
$$ -103866 -251990 -264088 -326111 -199663 -69903 55540 154896 165396 176180 189023 25260
14823B5260J43844K4371j67850j60947m654J19573j15560N8768J35451q574K44974
$$ 25260 169104 193475 25625 -135322 -139976 -20403 -135963 -77195 58256 49682 294656
14812B94656N3393k91281J7222J34677k35345p2029j9588Q839q0323M4268J22201
$$ 294656 348049 56768 73990 208667 -26678 -98707 -118295 -109456 -189779 -145511 -23310
14801b3310l10726j81500J65925K26868P6793q3399J95143J3630J45939Q588j73599
$$ -23310 -334036 -515536 -349611 -122743 -45950 -129349 65794 79424 225363 233951 60352
14790F0352M1276Q8471j28789J05984L8130n7581J4213Q5010p1552j04258O4977
$$ 60352 101628 190099 61310 167294 205424 147843 162056 247066 175514 71256 136233
14779A36233J01655P4376m6193J31830j82655o4585k4995j71377q4451K91865
$$ 136233 237888 312264 266071 397901 215246 150661 125666 -45711 -130162 161703
14769A61703K35907j80185j58071N3067q1907o1878j11949K07548l28292q8276
$$ 161703 397610 217425 59354 112421 30514 -31364 -143313 64235 -264057 -352333
14759c52333R3306J7125R4263j8079o5645K19781n4406J763o4082m5377l1036
$$ -352333 -259027 -241902 -147639 -165718 -231363 -11582 -65988 -64225 -128307 -173684 -204720
14748b04720N2300k52290k1740M12704K3389j7404L9950k80767J2268J76939Q5195
$$ -204720 -152420 -404710 -426450 -13746 9643 -7761 32189 -248578 -236310 -59371 25824
14737B5824R0072m9562k6844j80446k05436n9810O2817J45410K22764L41666j413
$$ 25824 115896 66334 39490 -140956 -346392 -406202 -343385 -197975 24789 366455 365042
14726C65042j99586k06538O0283J79472O3096l517P0160j26684j37658K43675
$$ 365042 165456 -41082 19201 198673 261769 258252 328412 201728 64070 307745
14716C07745P5319k74851l41537n8678J14914j0459r2920k0812R4845R4842J8375
$$ 307745 383064 108213 -233324 -292002 -177088 -187547 -280467 -301279 -206434 -111592 -93217
14705i3217j65898j16487r1531K80846K70288K2730M023j06946N8008o9302j12172
$$ -93217 -259115 -375602 -467133 -186287 84001 106731 110754 3808 61816 -7486 -119658
14694a19658k42508J33980J01387Q745O1134L8583q1256M8488J64006k10064l83606
$$ -119658 -362166 -228186 -126799 -118054 -56920 -18337 -99593 -51105 112901 -97163 -480769
14683d80769q2496M45165N99721k7974k40157K8341L07123M8510k29056j68041
$$ -480769 -563265 -118100 481621 453647 213490 241831 548954 597464 368408 200367
14673B00367j62709J10049K1067j53222M6244m5860n6567j41576K08158L66493
$$ 200367 37658 147707 168774 15552 61796 15936 -40631 -182207 25951 392444
14663C92444J80405p2984j49352l39712j59875J69057j7503j30873j12107p6548
$$ 392444 572849 499865 350513 10801 -149074 19983 2480 -128393 -240500 -317048
14653c17048m5014p4146r2410R1872N3591J62111K49147O0864m3167r3502p8447
$$ -317048 -362062 -436208 -528618 -436746 -383155 -221044 28103 88967 45800 -47702 -126149
14642a26149K512J15277L5089o7488J23288P6982p5979q4678L753n26j26869j28550
$$ -126149 -123637 -8360 26729 -40759 82529 159511 83532 -1146 2607 2081 -124788 -253338
14630b53338J34554J02113j30284j33589J60505j00733O7282Q7657j56712k41885
$$ -253338 -118784 -16671 -146955 -280544 -120039 -220772 -153490 -65833 -222545 -464430
14620d64430j73953J66070J28194n3177L0241L63510J83014j27177l32905l4273
$$ -464430 -638383 -472313 -344119 -397296 -367055 -3545 179469 52292 -280613 -314886
14610c14886N2095p3090L16703K10463r7623m9125O8878L00479M826l17402k34602
$$ -314886 -262791 -335881 -19178 191285 93662 44537 113415 413894 418720 101318 -133284
14599a33284J09852K5228p7870k7469q046K5661k02588j08718p1192L1777R3951
$$ -133284 -23432 1796 -76074 -103543 -111589 -85928 -288516 -397234 -468426 -436649 -342698
14588c42698L54663K98432K84833l4852L461j98501J3102J40186k08565r9609
$$ -342698 11965 310397 595230 560378 563839 365338 378440 518626 310061 210452
14578B10452J5855N9242l7610j20312J7722K9147q251j8819l5330p312j07156
$$ 210452 226307 285549 247939 127627 145349 174496 166245 147426 112096 104784 -2372
14567b372K0342N0504q7494J32807J36495j09378k8741r7806m87184P1217K61766
$$ -2372 17970 68474 -19020 113787 250282 140904 112163 14357 -472827 -401610 -139844
14556a39844K26504O0503j2241O8316J7997N6031J20299j07624j27080l50324
$$ -139844 86660 147163 134922 203238 221235 277266 397565 289941 162861 -187463
14546a87463o9051K40886j4833p6647K26348M885o3482j14446j59092L3466J43751
$$ -187463 -256514 -15628 -30461 -107108 119240 124125 60643 -53803 -212895 -179429 -35678
14535c5678J62947p3867K5590L94069N5996j68548j0159K2819m8484q1903o8864
$$ -35678 127269 53402 78992 473061 529057 360509 350350 373169 324685 242782 173918
14524A73918M4292J19728J0997j12117j79464n527q4970o8262M0807n015n5878
$$ 173918 218210 337938 348935 236818 57354 51827 -33143 -101405 -60598 -65613 -121491
14513a21491q1559k27454M1986J74288l2573K27808R1434j11974R7453J01826
$$ -121491 -203050 -430504 -388518 -214230 -246803 -18995 72439 -39535 57918 159744
14503A59744K41444k07198k57146m3429J75716k80783m55Q4204r6876k63108k250
$$ 159744 401188 193990 -63156 -106585 69131 -211652 -212107 -127903 -224779 -487887 -490137
14492d90137K57989K38053J06123K0091J06939J00572l08017j25519k16325J35211
$$ -490137 -232148 5905 112028 132119 239058 339630 31613 -93906 -310231 -175020
14482a75020L0085n2982J36820P7357J57503O1485n8290q4670M4799J75318J575
$$ -175020 -144935 -197917 -61097 16260 173763 235248 176958 92288 137087 312405 313980
14471C13980j25839k56774j99629p5781K2748L210k2612O2684J72984j22585m4282
$$ 313980 188141 -68633 -268262 -344043 -321295 -318085 -340697 -278013 -105029 -227614 -271896
14460b71896R4581O8420P3407J8774p8090p7480J14716j46723l46301m762J07240
$$ -271896 -177315 -108895 -35488 -16714 -94804 -172284 -57568 -204291 -550592 -555354 -448114
14449d48114P6283J88370J49309n6549k83253j53931L57527K66864m5820j86713
$$ -448114 -371831 -183461 -34152 -90701 -373954 -527885 -170358 96506 50686 -136027
14439a36027R2162J74014J9225n1623Q9549j1974j47134j16856j63517o8499J38180
$$ -136027 -43865 130149 149374 97751 187300 175326 28192 -88664 -252181 -320680 -182500
14428a82500O3323O2371P6450J79705J5742m2080J54307k3622J54374k57096k51917
$$ -182500 -119177 -56806 19644 199349 215091 173011 327318 303696 458070 200974 -50943
14417e0943P1091J48399j67333j53288j11026R1795J48227L3633j14003j74557
$$ -50943 20148 168547 1214 -152074 -263100 -171305 -23078 10555 -103448 -278005
14407b78005r7327N9798J80885J61615m9990j17976K33931O0053J99654L8888
$$ -278005 -375332 -315534 -134649 26966 -23024 -141000 92931 152984 352638 391526
14397C91526l3303n1329K05994N1951k50075l20410j17460j4086J10089L7089
$$ 391526 358223 306894 512888 564839 314764 -5646 -123106 -137192 -27103 9986
14387I986K36784j19309j6645n1891K4676J20760j9602o1297k11630J43687J05793
$$ 9986 246770 127461 110816 58925 83601 204361 184759 123462 -88168 55519 161312
14376A61312L5570J1038O4084o7168j00183R9371J46624j76022j50924N321j41518
$$ 161312 196882 207920 272004 204836 104653 204024 350648 174626 23702 29023 -112495
14365a12495k03344J28849L24199j78584l202K34482R8668M4272j08158j72386
$$ -112495 -315839 -186990 137209 -41375 -44577 189905 288573 332845 224687 52301
14355E2301N3525o3832k68581K6091q0352P3116Q6467N8173K03932j10930j53222
$$ 52301 105826 41994 -226587 -200496 -280848 -207732 -121265 -63092 140840 29910 -123312
14344a23312l515J9286j36937L9944N5841K6735K59731L5694j88155j07529j4139
$$ -123312 -126827 -107541 -244478 -204534 -148693 -121958 137773 173467 -14688 -122217 -136356
14333a36356J70446K97571K2359P7088p6346j62519j91203j01411r855p429K06298
$$ -136356 34090 331661 354020 431108 354762 192243 1040 -100371 -110226 -117655 88643
14322H8643K4965j69605j51712M0677p3523N3223L07746L48216J08463k8314k3669
$$ 88643 113608 -55997 -207709 -167032 -240555 -187332 120414 468630 577093 548779 525110
14311E25110J9496P5607K22147M69046J16526m28407o6107m8450l37342o44816
$$ 525110 544606 620213 842360 1311406 1427932 999525 933418 884968 547626 -97190
14301i7190k12917K31287J61997q9504k29221r5094J03730L2270J02615J83042
$$ -97190 -310107 -78820 83177 -6327 -235548 -330642 -226912 -194642 -92027 91015
14291I1015m5417k43642k5151N0896P9040K7122r3977j8234P5495J38301Q2756
$$ 91015 45598 -198044 -223195 -172299 -93259 -66137 -160114 -178348 -102853 35448 118204
14280A18204p6514J08732j03729l18916o7169J48328K5353J34025o9983k42542
$$ 118204 41690 150422 46693 -272223 -339392 -191064 -165711 -31686 -101669 -344211
14270c44211R4409K03350J14012o4355m0816k19086L6616m5058o800j0677K10463
$$ -344211 -249802 -46452 67560 3205 -37611 -256697 -220081 -265139 -271939 -282616 -72153
14259g2153j35398r6996M3272N4340n486P3728L2877q3443k04317O9162P7251
$$ -72153 -207551 -304547 -261275 -206935 -212421 -138693 -105816 -189259 -393576 -324414 -247163
14248b47163M0661J11566P1131L3011p3482J07895P1605J49797O6664l48720r8712
$$ -247163 -206502 -94936 -23805 9206 -64276 43619 115224 265021 331685 -17035 -115747
14237a15747j69420j5971o6286M0816J69568L96279J23256j57095k21884J34350
$$ -115747 -285167 -301138 -367424 -326608 -157040 239239 362495 205400 -16484 117866
14227A17866N8053j21287o163k1792n826j53013q7591P7681J40270J52239j72331
$$ 117866 175919 54632 48469 26677 20851 -132162 -219753 -142072 -1802 150437 -21894
14216b1894m34848j02393L01923J90906Q2829j53467J92637j77208k33741r099
$$ -21894 -456742 -559135 -257212 -66306 16523 -136944 55693 -121515 -355256 -364355
14206c64355K69124O9666M648N2311l4223N948r8641R6685k03153j55284k20904
$$ -364355 -95231 -25565 -20917 31394 -2829 3119 -95522 1163 -201990 -357274 -578178
14195e78178K78477J73551K9318P0436p8294j23416J81838r961k56825K71032
$$ -578178 -299701 -126150 -96832 -26396 -104690 -228106 -46268 -56229 -313054 -42022
14185d2022J40362j00792J07261M754K0945k07629j47026o7220O5724K58439K18532
$$ -42022 98340 -2452 104809 109563 130508 -77121 -224147 -291367 -225643 32796 251328
14174B51328O0094m3046j21065j72556k84744J4273L29183K71109m2841k59856
$$ 251328 311422 268376 147311 -25245 -309989 -295716 33467 304576 261735 1879
14164A879r7363r6328J02423J27981j7251J53014J68333j992J18787k70768l35252
$$ 1879 -95484 -191812 -89389 38592 21341 174355 342688 340696 459483 188715 -146537
14153a46537k05138J25053o4593O1334M4968n2550M7385P4065M7989J03006J1863
$$ -146537 -351675 -226622 -291215 -229881 -184913 -237463 -190078 -116013 -68024 34982 46845
14142D6845M4518p129Q9904J09290k36370j75413J67781L2893j08929j04771J88811
$$ 46845 91363 84234 174138 283428 47058 -128355 39426 72319 -36610 -141381 47430
14131D7430O8351j85673o8892p9201j71468Q6831J24126m4508j26654K78K44756
$$ 47430 115781 -69892 -138784 -217985 -389453 -302622 -178496 -223004 -349658 -349380 -104624
14120a04624L14158Q5011o3085j18226Q4124K49127j1153j28907K517j20519k26212
$$ -104624 209534 294545 231460 113234 197358 446485 435332 306425 308942 188423 -37789
14109c7789r041K50272J76838m6642q3547q3368J85393k25562l55090L52303L72141
$$ -37789 -46830 203442 380280 333638 250091 166723 352116 126554 -228536 123767 495908
14098D95908J57544l28863k24907O0054N0976L6073j93999l1794K520j18096R9270
$$ 495908 653452 324589 99682 159736 210712 246785 52786 20992 23512 -94584 4686
14087D686r5636r3721R9472m6567k56059R738K92274J57279l7141o7108N6356
$$ 4686 -90950 -184671 -85199 -131766 -387825 -378087 -85813 71466 34325 -32783 23573
14076B3573j58180j69557p5305J03780J67710L3902j71143J06822L5420o477r8142
$$ 23573 -134607 -304164 -379469 -275689 -107979 -74077 -245220 -138398 -102978 -109455 -207597
14065b07597q6644n464J13882m3811q8731q5510K41425J13025o8657J13163K85991
$$ -207597 -294241 -299705 -185823 -229634 -318365 -403875 -162450 -49425 -118082 -4919 281072
14054B81072O754k26999j95861k916k92435m9545J15937m1396L0436N4226R1740
$$ 281072 287826 60827 -135034 -137950 -430385 -479930 -363993 -405389 -374953 -320727 -228987
14043b28987J5576K65066K19508j78044j79048j3980k2431K17977R5816J81726
$$ -228987 -213411 51655 271163 93119 -85929 -99909 -122340 95637 191453 373179
14033C73179j97422k45324J35423k58569m1327J58575J25099J1895j81194J36229
$$ 373179 175757 -69567 65856 -192713 -234040 -75465 49634 61529 -119665 16564
14023A6564J7517R3172O2510L5326R056J48224K30540J17751k02688K5293j64461
$$ 16564 34081 127253 189763 225089 234145 382369 612909 730660 527972 553265 388804
14012C88804l144k27428j48488j02991l171L3319R9049K10243J95780k0660l51161
$$ 388804 385660 158232 9744 -93247 -96418 -63099 35950 246193 441973 421313 70152
14001G0152k58259k15263J47629J55567m6871j97302J41203N7008n7890J8945
$$ 70152 -188107 -403370 -255741 -100174 -147045 -344347 -203144 -146136 -204026 -185081
13991a85081K21003L8124k33998j25151j90389M3304J82839r0986l28751j29238
$$ -185081 35922 74046 -159952 -285103 -475492 -432188 -249349 -340335 -669086 -798324
13981g98324J32294K70738K34730P294m9064J0520Q0087q7294r0464n0261J42242
$$ -798324 -666030 -395292 -160562 -153268 -202332 -191812 -111725 -199019 -289483 -339744 -197502
13970a97502J63257K28959K51226Q9530J66744K99680J75809m1475l01662l78142
$$ -197502 -34245 194714 445940 535470 702214 1001894 1177703 1136228 834566 456424
13960D56424j28204k51121j88287K4382J06440L5430o0387J56009K08043n3630
$$ 456424 328220 77099 -111188 -86806 19634 55064 -5323 150686 358729 305099
13950C05099j68742J8262j7616L4162O4576J89209J52780k19635k83504Q6015
$$ 305099 136357 154619 137003 171165 235741 424950 577730 358095 74591 160606
13940A60606J72906J44737p1713o4791J56166P1979j67248j03882K10575q2491
$$ 160606 333512 478249 406536 341745 497911 569890 402642 298760 509335 426844
13930D26844j90738N1711j8276L5774L3390K9049J3665j77345j35799q1758K86985
$$ 426844 236106 287817 269541 305315 338705 367754 381419 204074 68275 -13483 273502
13919B73502K42281O7305q404J1829L4648r2270p3815j70412k60171M38200J63139
$$ 273502 515783 583088 574684 586513 621161 528891 455076 284664 24493 462693 625832
13908F25832p0028M8754q0110Q0585l5187N7732R6729L14156J04089j42008M385
$$ 625832 555804 604558 524448 605033 569846 627578 724307 1038463 1142552 1000544 1004929
13897A004929P2627p8382J08921J99154J26800J70373K84480N04596K25769k4375
$$ 1004929 1077556 999174 1108095 1307249 1434049 1604422 1888902 2393498 2619267 2594892
13887B594892K91858K68314l42812l49573k94471k37370k47116k74741l17829
$$ 2594892 2886750 3155064 2812252 2462679 2168208 1930838 1683722 1408981 1091152
13878A091152j51958r7290R2849J37929j33575k66556k07586n8898L7819J90372
$$ 1091152 939194 841904 934753 1072682 939107 672551 464965 406067 443886 634258
13868F34258N5785J15794K29240J6728O5368K73581L12346J66320J63663K6379
$$ 634258 690043 805837 1035077 1051805 1117173 1390754 1703100 1869420 2033083 2059462
13858B059462J78107M67026K22673M4653m3602M317L60084O37456N69132P30626
$$ 2059462 2237569 2704595 2927268 2971921 2928319 2932636 3292720 3930176 4499308 5229934
13848E229934Q10768J122547J378673J298662J175076J210559J402804J731715
$$ 5229934 6040702 7163249 8541922 9840584 11015660 12226219 13629023 15360738
13840A5360738K581232M071954O268412J0119308J6793215K6295973L8056328
$$ 15360738 17941970 22013924 28282336 38401644 55194859 81490832 119547160
13833A19547160M8260882N4492801M6647886K3219325l12637k5353168m6888037
$$ 119547160 167808042 222300843 268948729 292168054 291855417 266502249 219614212
13826B19614212n5376932m8999244l8157588k5624025j5276800q904592n197815
$$ 219614212 164237280 115238036 77080448 51456423 36179623 27275031 22077216
13819B2077216l448040k411321j861829j461898j537494j318879j090815j300628
$$ 22077216 18629176 16217855 14356026 12894128 11356634 10037755 8946940 7646312
13811G646312j213458j080857o84492m32369l36257p31917o53334o6847l53755
$$ 7646312 6432854 5351997 4667505 4235136 3898879 3166962 2513628 2446781 2093026
13802B093026L1527L2620j63205J20754l7209k98393m31761j81937K2153j51216
$$ 2093026 2124553 2157173 1993968 2114722 2077513 1779120 1347359 1165422 1187575 1036359
13792A036359J50653Q7642K91969L36801j82437j96090o8357k29012R7268J91532
$$ 1036359 1187012 1274654 1566623 1903424 1720987 1524897 1456540 1227528 1324796 1516328
13782A516328j34686N6689j87922l3564j59149j69667j12966r8731j37194j5969
$$ 1516328 1381642 1438331 1250409 1216845 1057696 888029 775063 676332 539138 523169
13772E23169j6503J45576J38846j25138o0762L8461L71340l77455k43205J15275
$$ 523169 506666 652242 791088 665950 605188 643649 1014989 637534 394329 509604
13762E09604l8981K51471l22974l8045N2916o7452j26393n6971J14098j27146
$$ 509604 470623 722094 399120 361075 413991 346539 220146 163175 277273 150127
13752A50127j03179J16215J12690M1787p1073Q5424J91803j37305k50049L9367
$$ 150127 46948 163163 275853 317640 246567 331991 523794 386489 136440 175807
13742A75807R6342J26363R7644n5642k0912p2668k77494j0575L15235O1355j81100
$$ 175807 272149 398512 496156 440514 419602 346934 69440 58865 374100 435455 254355
13731B54355k6229J03085n3650k42633j01878J95904q4642j37759j55636K08763
$$ 254355 228126 331211 277561 34928 -66950 128954 44312 -93447 -249083 -40320
13721d0320J06678J56021k5782k69581j62393M0797Q4537K04369J29400J26355
$$ -40320 66358 222379 196597 -72984 -235377 -194580 -110043 94326 223726 350081
13711C50081Q5790j21936m1752k7002J47763l81958j96681K3343L4079m4387n8785
$$ 350081 435871 313935 272183 245181 392944 10986 -185695 -162352 -128273 -172660 -231445
13700b31445P2208j47299m95606l10340R0063K39521L61629K40729Q4611K95748
$$ -231445 -159237 -306536 -802142 -1112482 -1022419 -782898 -421269 -180540 -95929 199819
13690A99819K12286Q9961J27571m8086j01230m31313P9749N9359K15540K60457
$$ 199819 412105 502066 629637 581551 480321 49008 128757 188116 403656 664113
13680F64113J4101L23341L7765l03064j34130k04272q9393l0369p7198J12469
$$ 664113 678214 1001555 1039320 736256 602126 397854 308461 278092 200894 313363
13670C13363j42611l47813j04778K47781J21526J7723L5784l5753j23620M0721
$$ 313363 170752 -177061 -281839 -34058 87468 105191 140975 105222 -18398 22323
13660B2323L2122j25371k6610k44036J04683R9767P5014k26473j78998N6990j00759
$$ 22323 54445 -70926 -97536 -341572 -236889 -137122 -62108 -288581 -467579 -410589 -511348
13649e11348j82692j35360J16494M04455R2979j68805j68612q7999l1388J18674
$$ -511348 -694040 -829400 -712906 -308451 -215472 -384277 -552889 -640888 -672276 -553602
13639e53602O7190K48337N3100r799n874J02141K01257R9375j95467k8922L25715
$$ -553602 -486412 -238075 -184975 -194774 -200648 -98507 102750 202125 6658 -22264 303451
13628C03451K250l04900j19684k43678K21276P1686J86874J04894P4146m9997
$$ 303451 305701 801 -118883 -362561 -141285 -69599 117275 222169 296315 246318
13618B46318o8988j02372j41939j03981J04107j03353J13150K89010J00018p2817
$$ 246318 177330 74958 -66981 -170962 -66855 -170208 -57058 231952 331970 259153
13608B59153j58890k55256k65214j76011K31512L46137l7553q2478L49126j7931
$$ 259153 100263 -154993 -420207 -596218 -364706 -18569 -56122 -138600 210526 192595
13598A92595j5709K00505K5192k14164j74882j39107l37756o6043J88159J95299
$$ 192595 176886 377391 402583 188419 13537 -125570 -463326 -529369 -341210 -145911
13588a45911l9071K067j78850n5032j9341m8642K69045M29286l0722k19401n5304
$$ -145911 -184982 -182915 -361765 -416797 -436138 -484780 -215735 213551 182829 -36572 -91876
13577i1876J48990j83234K82059p7088k03513M7544Q6160l1919k5974J55106J2211
$$ -91876 57114 -126120 155939 78851 -124662 -77118 9042 -22877 -48851 106255 118466
13566A18466Q7014O1594J00091l40971L967J84878K89132J12696l33003j53465
$$ 118466 205480 267074 367165 26194 30161 215039 504171 616867 283864 130399
13556A30399n52k95493j53418j8904K6872m2068l9952N2052J0283r0020K33220
$$ 130399 129847 -165646 -319064 -337968 -311096 -353164 -393116 -341064 -330781 -420801 -187581
13545a87581K74161O0376K09047j6020J6849l4164k38475n8041j80990L7881O3767
$$ -187581 86580 146956 356003 339983 356832 322668 84193 26152 -154838 -116957 -53190
13534e3190K4368J85655K16098k07817j06009q864o5903j74247j31942p2125J07569
$$ -53190 -28822 156833 372931 165114 59105 50241 -15662 -189909 -321851 -393976 -286407
13523b86407k8789k5419J27018J945n1395p3968J75244n304J42234K31858J51867
$$ -286407 -315196 -340615 -213597 -211652 -263047 -337015 -161771 -167075 -24841 207017 358884
13512C58884K14113j2113J9743j98336p1294j96572r597Q6407j25019k44196k58158
$$ 358884 572997 560884 580627 382291 310997 114425 104828 191235 66216 -177980 -436138
13501d36138j49485K23072K31330J38376M419k22629q6699j56160o1280r4967
$$ -436138 -585623 -362551 -131221 7155 11574 -211055 -297754 -453914 -515194 -610161
13491f10161n8730K27495L20004Q2390q9654o3801l9249K15377R5022m8978j87318
$$ -610161 -668891 -441396 -121392 -39002 -128656 -192457 -231706 -16329 78693 29715 -157603
13480a57603M6194K5487j47891K91415J39126r9165R9926J2905k39107k32168
$$ -157603 -111409 -85922 -233813 57602 196728 97563 197489 210394 -28713 -260881
13470b60881q7004l8080o0966N6261L51946K54180n5442j4826j66587P2714J21601
$$ -260881 -347885 -385965 -446931 -390670 -38724 215456 160014 145188 -21399 51315 172916
13459A72916J84244Q7958j8141r7737k71389l63277O9722J77043K4670K55628
$$ 172916 357160 445118 426977 329240 57851 -305426 -235704 -58661 -33991 221637
13449B21637K16823o2676P6736j69105q5027J12822R3118k0165q3919r9181J46623
$$ 221637 438460 375784 452520 283415 198388 311210 404328 384163 300244 201063 347686
13438C47686N4449j07519j02092k55751K2161L13888n2962k45845k28444j40429
$$ 347686 402135 294616 192524 -63227 -41066 272822 219860 -25985 -254429 -394858
13428c94858n5278J03938J50043k9712K53142J03287m0134r6874j35003j50464
$$ -394858 -450136 -346198 -196155 -225867 27275 130562 90428 -6446 -141449 -291913
13418b91913J4635J35741o3785j36280J52910Q2789K29963j15088j98026R4352
$$ -291913 -277278 -141537 -205322 -341602 -188692 -105903 124060 8972 -189054 -94702
13408i4702q3282J7744L01123P3777J0445o3014m3710o7987j1287m3766o1260
$$ -94702 -177984 -160240 140883 214660 225105 162091 118381 50394 39107 -4659 -65919
13397f5919J33295P2657j01068J00324r0667k85316J75923J84191K42459j8119
$$ -65919 67376 140033 38965 139289 48622 -236694 -60771 123420 365879 347760
13387C47760l33987k81646P5522K46104K06368j18524k87950q2747J96117K02797
$$ 347760 13773 -267873 -192351 53753 260121 141597 -146353 -229100 -32983 169814
13377A69814R8410j77270l4925L7270J59687K14769K6703q9572k41855n4283j0876
$$ 169814 268224 90954 56029 93299 252986 467755 494458 404886 163031 108748 97872
13366I7872j85780r5867R510j26584K71452Q6583J2275m4624M440J47889k01951
$$ 97872 -87908 -183775 -174265 -300849 -29397 57186 69461 24837 29277 177166 -24785
13355b4785l255L52397J01604O5298L6877J95714K32280K79546K07224n6281K9793
$$ -24785 -28040 324357 425961 491259 528136 723850 956130 1235676 1442900 1386619 1416412
13344A416412l414o5913l54769l77587J01259J45497j36611k11190p9746M9737
$$ 1416412 1412998 1347085 992316 614729 715988 861485 724874 513684 433938 483675
13334D83675l9907l0654j46399k11955r279J36789k2597K59820K35979k02054
$$ 483675 443768 413114 266715 54760 45481 182270 159673 419493 655472 453418
13324D53418k46117r7737k2842J70235n5393k13099k52328M3584J15276k1836
$$ 453418 207301 109564 86722 256957 201564 -11535 -263863 -220279 -105003 -126839
13314a26839l625k7888j93394J34647J93712K88363K63214j38279k65787k40799
$$ -126839 -130464 -158352 -351746 -217099 -23387 264976 528190 389911 124124 -116675
13304a16675J6870K85118J16422k52790j97967l2485K3349j00116M7433K37840
$$ -116675 -99805 185313 301735 48945 -149022 -181507 -158158 -258274 -210841 26999
13294B6999J56889r0486j21997K23170N2068j91107J06539K9218l33853K1799
$$ 26999 183888 93402 -28595 194575 246643 55536 162075 191293 -142560 -120761
13284a20761o776o785L16569J21978J66873K7179j96440O2882k33123k29603P2552
$$ -120761 -127537 -134322 182247 304225 471098 498277 301837 364719 131596 -98007 -25455
13273b5455q1425r6255K46652j5457j35286m3689j55212R1748J79779K28039j74382
$$ -25455 -106880 -203135 43517 28060 -107226 -150915 -306127 -214379 -34600 193439 19057
13262A9057K6518o8752J3849J53681p7829l7951N6324O5322K87704J54332r2835
$$ 19057 45575 -23177 -9328 144353 66524 28573 84897 150219 437923 592255 499420
13251D99420n90594j87418K24840m7737M0890j2826p7951n8936J23261n7628r0210
$$ 499420 -91174 -278592 -53752 -101489 -60599 -73425 -151376 -210312 -87051 -144679 -234889
13240b34889J982k71961N2573K03877J92022K75872l1688j39915m3633O7631K17472
$$ -234889 -232907 -504868 -452295 -248418 -56396 219476 187788 47873 4240 71871 289343
13229B89343k60199k98436N133J74638J26487m0267j77271k08090k25763J32437
$$ 289343 29144 -269292 -264159 -89521 36966 -3301 -180572 -388662 -614425 -481988
13219d81988J94559q2878o3761j43949N10349J56383k72497j23756K34545J08272
$$ -481988 -287429 -370307 -434068 -578017 -67668 88715 -183782 -307538 -72993 35279
13209C5279l68319k13144K61881J09888J90057J54314L0183l6098j23907K02156
$$ 35279 -333040 -546184 -284303 -174415 15642 169956 200139 164041 40134 242290
13199B42290k27470k8053k58660k49438L4400J81339k51817J12257L24491N2939
$$ 242290 14820 -13233 -271893 -521331 -486931 -305592 -557409 -445152 -120661 -67722
13189f7722o7328r7118j9618N2845J76991N2103M3924k43182J23659L4319M1404
$$ -67722 -135050 -232168 -251786 -198941 -21950 30153 74077 -169105 -45446 -11127 30277
13178C0277n1619O4223K97532K03700j55024m399j44620J21383J24343j81900
$$ 30277 -21342 42881 340413 544113 389089 384690 240070 361453 485796 303896
13168C03896j94634l27719J3783J17350O0438J87342J23340L23640K5973n18351
$$ 303896 109262 -218457 -204674 -87324 -26886 160456 283796 607436 633409 115058
13158A15058k44035k328j18637m0145R2767J70864P0974j7111K0719o9573J04162
$$ 115058 -128977 -131305 -249942 -290087 -197320 -26456 44518 27407 48126 -21447 82715
13147H2715M2545O6982p4549m0655j90881j57460m162J20631O6794j17624O8122
$$ 82715 125260 192242 117693 77038 -113843 -271303 -275465 -154834 -88040 -205664 -137542
13136a37542Q1799q3917K66397J77699o6641J46287l41920j80815j9519m25k1158
$$ -137542 -55743 -139660 126737 304436 237795 384082 42162 -138653 -158172 -158597 -179755
13125a79755M5529L9826j01640j35440K36020J4081n5621j27817L5922R4329j7282
$$ -179755 -134226 -94400 -196040 -331480 -95460 -81379 -137000 -264817 -228895 -134566 -151848
13114a51848J28946J33715L4354o117j83695Q2979j33769l7562N7173J40999K6822
$$ -151848 -22902 110813 145167 139050 -44645 38334 -95435 -132997 -75824 65175 91997
13103I1997Q771J3990Q996L1592p680M2409K43067k64476l74196p7207K7421R7859
$$ 91997 100768 114758 123754 155346 147666 190075 433142 168666 -205530 -282737 -255316 -157457
13091a57457J8946K778k19813J50429N3307r0240J20587k6306j97098J16537J52682
$$ -157457 -138511 -135733 -355546 -205117 -151810 -242050 -121463 -147769 -344867 -228330 -75648
13080g5648n2932o8211j13739K2310M0027R2039J39823L9686q9569J44270j56108
$$ -75648 -128580 -196791 -310530 -288220 -248193 -156154 -16331 23355 -66214 78056 -78052
13069g8052l109L22022j3015j9311j4249k96796m6561J51852N7687m3843k37719
$$ -78052 -81161 240861 227846 208535 194286 -102510 -149071 2781 60468 16625 -221094
13058b21094M9987K70825Q1795j94331j14863J8692L6499L64421O8495j30403
$$ -221094 -171107 99718 181513 -12818 -127681 -108989 -72490 291931 360426 230023
13048B30023J35626j61903k21795k9129j44747J21700N1744N1766O2148m0278
$$ 230023 365649 203746 -18049 -47178 -191925 -70225 -18481 33285 95433 55155
13038E5155j78549m1127K07491l0025R582K51965j21248k51012o2600O8789K30847
$$ 55155 -123394 -164521 42970 12945 22527 274492 153244 -97768 -160368 -91579 139268
13027A39268K8494J09294l7853k41355J30055J26432k42292j67721Q9965l49671
$$ 139268 167762 277056 239203 -2152 127903 254335 12043 -155678 -65713 -415384
13017d15384j13137J0645L53489J48203p6764P628j06340L9862L8633R2318j08023
$$ -415384 -528521 -517876 -164387 -16184 -92948 -85320 -191660 -151798 -113165 -20847 -128870
13006a28870r1373k5096K61439J40472J09063R3303J4194n2773K0380M5523k41848
$$ -128870 -220243 -245339 16100 156572 265635 358938 373132 320359 340739 386262 144414
12995A44414j04187P1026j18057K55810j6042j04254r0387k13174l04885l0954
$$ 144414 40227 111253 -6804 249006 232964 128710 38323 -174851 -479736 -510690
12985e10690J42362J52091J1268K87648K48296j2842j80351j30200o0671M7580
$$ -510690 -368328 -216237 -204969 82679 330975 318133 137782 7582 -53089 -5509
12975e509p114L05976J6349O1692j02834k46992j05010j11292q1595M35728L64204
$$ -5509 -12623 293353 309702 371394 268560 21568 -83442 -194734 -276329 159399 523603
12964E23603l10912j7934J11078r8449m7799P9857Q2137k38568l74896L3746J8332
$$ 523603 212691 194757 305835 207386 159587 239444 321581 83013 -291883 -258137 -239805
12953b39805K78465P0354j29738k47883J3537J74100K81018q5596l29314Q4294
$$ -239805 38660 109014 -20724 -268607 -255070 -80970 200048 114452 -214862 -130568
12943a30568L14561n4106k82799j75326L6044N224N9811j18343J34584K56274
$$ -130568 183993 129887 -152912 -328238 -292194 -286970 -227159 -345502 -210918 45356
12933D5356K8931l13935J4873J21394o8775k8065R0420K37673j7635k2331m1867
$$ 45356 74287 -239648 -224775 -103381 -172156 -200221 -109801 127872 110237 87906 46039
12922D6039J4171p2514j81529K67268O2291L8835J7812Q4909m1264j76005K4932
$$ 46039 60210 -12304 -193833 73435 135726 174561 192373 277282 236018 60013 84945
12911H4945J68537j12237j21329j87993Q0762N7267J10159k060Q3307P1968k58078
$$ 84945 253482 141245 19916 -168077 -87315 -30048 80111 78051 161358 233326 -24752
12900b4752j15518K96637J48583j36970j99046j21074k27562m253Q1721K01224
$$ -24752 -140270 156367 304950 167980 -31066 -152140 -379702 -383955 -302234 -101010
12890a01010o595J03646J57222l4676L0751j93203J4825l5624k91004K09844M02379
$$ -101010 -107605 -3959 153263 118587 149338 -43865 -29040 -64664 -355668 -145824 256555
12879B56555K6957j63599o4365K5593L0183j28268j69796J47627q3576n1812j9627
$$ 256555 283512 119913 55548 81141 111324 -16944 -186740 -39113 -122689 -174501 -194128
12868a94128j45795j37003Q8420K61776M9382P714L64897J6180k03729L8072J11640
$$ -194128 -339923 -476926 -388506 -126730 -77348 -69634 295263 311443 107714 145786 257426
12857B57426k00244j11753L27271p7401j23299N263n6084p3499k7764j61881j72473
$$ 257426 57182 -54571 272700 195299 72000 77263 21179 -52320 -80084 -241965 -414438
12846d14438J07501R4663L2574O1747m3114j89766K52388Q5211L0448L5590P246
$$ -414438 -306937 -212274 -179700 -117953 -161067 -350833 -98445 -13234 17214 52804 60050
12835F0050N9312j33377j07368J5690p0580m1723K6641r6012j08859O5398q3822
$$ 60050 119362 -14015 -121383 -105693 -176273 -217996 -191355 -287367 -396226 -330828 -414650
12824d14650J01746J37598K36277J44229Q9521J83500N9110j60123j06720J63994
$$ -414650 -312904 -175306 60971 205200 294721 478221 537331 377208 270488 434482
12814D34482j93041j40433M0907J26372L7158N065n4198k9748l63401j17180o9232
$$ 434482 241441 101008 141915 268287 305445 310510 256312 226564 -136837 -254017 -323249
12803c23249p6986K35703L06963j27673r3556j67684k21453m665n5828j01515
$$ -323249 -400235 -164532 142431 14758 -78798 -246482 -467935 -472600 -528428 -629943
12793f29943M638L35834O9402O2475K11074N1801P768j5754n3467j44354K0557
$$ -629943 -625305 -289471 -220069 -157594 53480 105281 113049 97295 43828 -100526 -79969
12782g9969k01298k73133J04039Q4635R6410r5518l1658p8699K61232P4972P8117
$$ -79969 -281267 -554400 -450361 -365726 -269316 -364834 -396492 -475191 -213959 -138987 -60870
12771f0870K91161J19850j39488m6033K25871O1528j39805j86617K6311j71372
$$ -60870 230291 350141 210653 164620 390491 452019 312214 125597 151908 -19464
12761a9464r9707k23938L20240K80738k59895M4799J57280j97051j93785P4883
$$ -19464 -119171 -343109 -22869 257869 -2026 42773 200053 3002 -190783 -115900
12751a15900J89190K00134L6270J30693J68732j92372l35603q1499l3338j0627
$$ -115900 73290 273424 309694 440387 609119 416747 81144 -355 -33693 -44320
12741d4320M5877J49528k69692k35282k22715K38344M77903J50389l6518k71228
$$ -44320 1557 151085 -118607 -353889 -576604 -338260 139643 290032 253514 -17714
12731a7714j4624o0696o6629J79165J10651j37798l31816J77041J53995J15395
$$ -17714 -32338 -93034 -159663 19502 130153 -7645 -339461 -162420 -8425 106970
12721A06970m7699K3800p2540J53781j3427r5243j9264k3035j9404L2764m2484
$$ 106970 59271 83071 10531 164312 150885 55642 36378 13343 -6061 26703 -15781
12710a5781j45335l62955K8103J82637J18063M5184L35832j40104p2742O8661
$$ -15781 -161116 -524071 -495968 -313331 -195268 -150084 185748 45644 -27098 41563
12700D1563p1022J08130q8688O7441J48695l1427N4901j89405o0963k6447k35207
$$ 41563 -29459 78671 -10017 57424 206119 174692 229593 40188 -20775 -47222 -282429
12689b82429p8367K02877J93274P8491j56734l74102o6808M51144K62961j76791
$$ -282429 -360796 -157919 35355 113846 -42888 -416990 -483798 -32654 230307 53516
12679E3516j32387l8595p8856j95344k3031n6993O0176q3278l248O6227M2385
$$ 53516 -78871 -117466 -196322 -391666 -414697 -471690 -411514 -494792 -498040 -431813 -389428
12668c89428J62783J05735j88939l2313J11239m5886J76217P8245l5278J4777
$$ -389428 -226645 -120910 -309849 -342162 -230923 -276809 -100592 -22347 -57625 -42848
12658d2848J11078q137r4321Q4787N5717q2095j75161k54016K3701J57056J05703
$$ -42848 68230 60093 -34228 50559 106276 24181 -150980 -404996 -381295 -224239 -118536
12647a18536j66203L0727O4827j13544J93644J62867Q696j17031J15454J27216
$$ -118536 -284739 -254012 -189185 -302729 -109085 53782 62478 -54553 60901 188117
12637A88117j27518P5622J62984N7597n9205J22979j54160j41665r6379J2544
$$ 188117 60599 136221 299205 356802 297597 420576 266416 124751 28372 40916
12627D0916p0420j00710k1931P1348N1359j11913O7051L24778l6336j60295l75894
$$ 40916 -29504 -130214 -152145 -80797 -29438 -141351 -74300 250478 214142 53847 -322047
12616c22047J0202K37819J76033N3597j32315K43137j651j67902j535Q3528K62562
$$ -322047 -311845 -74026 102007 155604 23289 266426 264775 96873 95338 178866 441428
12605D41428k05217l33763j39779J85094J52269k20401k63210J28959j2479M3202
$$ 441428 236211 -97552 -237331 -52237 100032 -120369 -383579 -254620 -267099 -223897
12595b23897Q9308M665J46031O7961j99375o0545j27k03761R3578l4499N06P5309
$$ -223897 -134589 -129924 16107 84068 -115307 -175852 -175979 -379740 -286162 -320661 -320155 -244846
12583b44846Q3029j26536L8216K70904q6479M4993J78891R9553j38507j3995O7462
$$ -244846 -161817 -288353 -250137 20767 -65712 -20719 158172 257725 119218 105223 172685
12572A72685r3982k23084J74414k6056k59432O490J47319K0736J53345k90094
$$ 172685 78703 -144381 30033 3977 -255455 -248965 -101646 -80910 72435 -217659
12562b17659l58990j52668M06953M08154J87946k48384j25982k95328K1324j36930
$$ -217659 -576649 -729317 -322364 85790 273736 25352 -100630 -395958 -374634 -511564
12552e11564M6177J41992R9192k05304M2626K14224J4135J06122P3492J06869
$$ -511564 -465387 -323395 -224203 -429507 -386881 -172657 -158522 -52400 21092 127961
12542A27961M2700J77075M3542J54610q1857k44336k57565j21231M2049k27344
$$ 127961 170661 347736 391278 545888 464031 219695 -37870 -159101 -117052 -344396
12532c44396J58489J62495J61010J81608P8478j72075j12419P1829j08002L8577
$$ -344396 -185907 -23412 137598 319206 397684 225609 113190 185019 77017 115594
12522A15594J69026J07762l6623J05622q3711j83687l90599j36083J20497J92724
$$ 115594 284620 392382 355759 461381 377670 193983 -196616 -332699 -212202 -19478
12512a9478N7565j32395R4301j47421M4712M3973O1010l5505k01712N7702J54158
$$ -19478 38087 -94308 -7 -147428 -102716 -58743 2267 -33238 -234950 -177248 -23090
12501b3090J96408k7586q2265N4954j36824j58314L3510m6253J18690J47301K03377
$$ -23090 173318 145732 63467 118421 -18403 -176717 -143207 -189460 -70770 76531 279908
12490B79908n1464k37073j99973k17240J746j1284k28543M8285J80355K51529
$$ 279908 228444 -8629 -208602 -425842 -424096 -435380 -663923 -615638 -435283 -183754
12480a83754k405j0954J58097L9163K9988J55448j55941k18921j11879K64222
$$ -183754 -186159 -197113 -39016 147 30135 185583 29642 -189279 -301158 -36936
12470c6936m837j39832K5953l376J07136J5928O4928M3718J17184k01842n0211
$$ -36936 -41773 -181605 -155652 -159028 -51892 -35964 28964 72682 189866 -11976 -62187
12459f2187J68381Q7321j09880J17289M3193k61533k2145L8117r3100p654l2261
$$ -62187 106194 193515 83635 200924 244117 -17416 -39561 -1444 -94544 -102198 -134459
12448a34459L0034J87323J21026j5139j88539P6426J65431k2666k70615l5136
$$ -134459 -104425 82898 203924 188785 246 76672 242103 219437 -51178 -86314
12438h6314L4168J35886J06383k89767j09508j18269o8174K81295K85672j11803
$$ -86314 -52146 83740 190123 -99644 -209152 -327421 -395595 -114300 171372 59569
12428E9569j27786P5291k4065J38583l892j87736o9477R4954R2498R9987K812
$$ 59569 -68217 7074 -16991 121592 117700 -70036 -139513 -44559 47939 147926 150738
12417A50738K4784k120j11400j04540k15656R0909j6073k60712k043J11553j9228
$$ 150738 175522 173402 62002 -42538 -258194 -167285 -183358 -444070 -446113 -334560 -353788
12406c53788J30868L95409p92l2168P7364j42181Q1637O3280j77021j4732P8632
$$ -353788 -222920 172489 171697 139529 216893 74712 156349 219629 42608 27876 106508
12395A06508j2393J80327J51555J48651P3377k40703j93494j49398j03478J00237
$$ 106508 94115 274442 425997 574648 648025 407322 213828 64430 -39048 61189
12385F1189K02310r6017k36678l7579J17532k0053L5935j62283p1723J40892L52912
$$ 61189 263499 167482 -69196 -106775 10757 -9296 26639 -135644 -207367 -66475 286437
12374B86437n4166L8615j97875k4092J23329K39640J07724k74675l15014j54674
$$ 286437 232271 270886 73011 48919 172248 411888 519612 244937 -70077 -224751
12364b24751r2099J53519L74323m8803m3422q7204l13373r5724K64775J99170
$$ -224751 -316850 -163331 210992 162189 118767 31563 -281810 -377534 -112759 86411
12354H6411q6610j96244Q22K77130J86369m758j36647k21090J67649J24138O0392
$$ 86411 -199 -196443 -195621 81509 267878 263120 126473 -94617 73032 197170 257562
12343B57562j64210k24980j86388K9695R1558K37808K2676j16293k32017j928
$$ 257562 93352 -131628 -318016 -288321 -196763 41045 63721 -52572 -284589 -286517
12333b86517m1568J77978r443p8355q7189j84255J90222K25559L0173L5386R1691
$$ -286517 -328085 -150107 -159550 -237905 -325094 -509349 -319127 -93568 -63395 -28009 63682
12322F3682j3640j45890m8600k9529N8418K45k05196q4021M32505M8503j23663
$$ 63682 50042 -95848 -144448 -173977 -115559 -115314 -320510 -404531 27974 76477 -47186
12311d7186K5904k20616k4421l5689k07988r5691L54503K84812j54660o113m4606
$$ -47186 -21282 -241898 -266319 -302008 -509996 -605687 -251184 33628 -121032 -127145 -171751
12300a71751J98082M50025O6107j53755m5013j92060l11179j24919K40317J81252
$$ -171751 26331 476356 542463 388708 343695 151635 -159544 -284463 -44146 137106
12290A37106P3951L7088r3022m5543K7128R8624j46596O2671J12223K75852k02463
$$ 137106 211057 248145 155123 109580 136708 235332 88736 151407 263630 539482 337019
12279C37019j66940k11Q2770r1772k1536j34744j58156L26102q1751j4220L0258
$$ 337019 170079 169868 252638 160866 139330 4586 -153570 172532 90781 76561 106819
12268A06819K7976J49586p3438J2379J05193O398j75761j88601j8650l6661P917
$$ 106819 134795 284381 210943 223322 328515 334913 159152 -29449 -48099 -84760 -76843
12257g6843l8060n4580O6085K19175l9804j51130J48587j15739N613m0455R54
$$ -76843 -114903 -169483 -103398 115777 75973 -75157 73430 -42309 -36696 -77151 -76197
12246g6197Q8628m6945n1495J57792m8251j13873L6128q0087m4186J53693Q2702
$$ -76197 12431 -34514 -86009 71783 23532 -90341 -54213 -134300 -178486 -24793 57909
12235E7909j1202J45449k5513j61336j13859l6448j67479K1857J58669j49272
$$ 57909 46707 192156 166643 5307 -108552 -145000 -312479 -290622 -131953 -281225
12225b81225J6409J54476J9787j38793n6630Q195J46049K60896p3304L7172M8625
$$ -281225 -264816 -110340 -90553 -229346 -285976 -277781 -131732 129164 55860 93032 141657
12214A41657k93642j49797J82670p0274p1394J96464K00302J34216m3867o9706
$$ 141657 -151985 -301782 -119112 -189386 -260780 -64316 135986 270202 226335 156629
12204A56629k43752r1380J56095l0789k65546N0535J47292j7659k56083J70552
$$ 156629 -87123 -178503 -22408 -53197 -318743 -268208 -120916 -138575 -394658 -224106
12194b24106Q9445n4907j82015J17560J8285K42167J94355j20613m6771l0642
$$ -224106 -134661 -189568 -371583 -254023 -235738 6429 200784 80171 33400 2758
12184B758k47644J0345J33121j72496l1974M2511J91583j68577j88983L5239K13252
$$ 2758 -244886 -234541 -101420 -273916 -305890 -263379 -71796 -240373 -429356 -394117 -180865
12173a80865J71309j8981p4313j97521k1402j5828K2731Q9586N3293J37274k22609
$$ -180865 -9556 -28537 -102850 -300371 -321773 -337601 -314870 -225284 -171991 -34717 -257326
12162b57326k08190j1197K89398J23466k14743n3156p0329j14335l10048p4566
$$ -257326 -465516 -476713 -187315 -63849 -278592 -331748 -402077 -516412 -826460 -901026
12152i01026L78970L72472q4251j13985L5022J11434q206N0649P7073k6992r9465
$$ -901026 -522056 -149584 -233835 -347820 -312798 -201364 -209570 -158921 -81848 -108840 -208305
12141b08305j52103K1809N9930M01347J19462l5033j42571r6770J28254p8705
$$ -208305 -360408 -338599 -278669 122678 242140 207107 64536 -32234 96020 17315
12131A7315P2862l8785K314j21685r0666K9160J13483j5962J26100q2602k4153
$$ 17315 90177 51392 53706 -67979 -158645 -129485 -16002 -31964 94136 11534 -12619
12120a2619L9911k3652j96654j81597Q1145k52979P1392J47670R6513k8706j40591
$$ -12619 27292 3640 -193014 -374611 -293466 -546445 -475053 -327383 -230870 -259576 -400167
12109d00167j18803j0887J47556j86884j19456L39479L62061K15548j22227j67506
$$ -400167 -518970 -529857 -382301 -569185 -688641 -349162 12899 228447 106220 -61286
12099f1286R9839n762l10268J27471J14471J36025k75974Q6316J14653J60554
$$ -61286 38553 32791 -277477 -150006 -35535 100490 -175484 -89168 25485 186039
12089A86039q2052k82388j4752K37920P4055j3562n7309n4603l5745p9983j36411
$$ 186039 103987 -178401 -193153 44767 118822 105260 47951 -6652 -42397 -122380 -258791
12078b58791p0686R1895j9135L6069r0548J54223J94686M1859j04960m9957l6982
$$ -258791 -329477 -237582 -256717 -220648 -311196 -156973 37713 79572 -25388 -75345 -112327
12067a12327J16426k34004j73174M2027J04262J285K9651J58084L58084m4756
$$ -112327 4099 -229905 -403079 -361052 -256790 -255505 -225854 -67770 290314 245558
12057B45558l1167J270j30178R5871K26083j7959m24010k80583O0961m8981J66662
$$ 245558 214391 215661 85483 181354 407437 389478 -34532 -315115 -254154 -303135 -136473
12046a36473K01653P0960J48287K0258p9408J24365j33855p6945L0351j8030P2814
$$ -136473 65180 136140 284427 304685 225277 349642 215787 138842 169193 151163 223977
12035B23977j16562j89428n2110j21749J06419K11081L3937m1660l8879J6684
$$ 223977 107415 -82013 -134123 -255872 -149453 61628 95565 53905 15026 31710
12025C1710k2182j53144Q2909K79691J30074p0272n1332k92549l29073J33231
$$ 31710 9528 -143616 -60707 218984 349058 278786 227454 -65095 -394168 -260937
12015b60937J15358J48257Q5348k09662j91131q4734J84309J70024M2154j96073
$$ -260937 -145579 2678 88026 -121636 -312767 -397501 -213192 -43168 -1014 -197087
12005a97087k3752J45032K8319q8939J57162J68882p9461k11550n56m6070J06221
$$ -197087 -220839 -75807 -47488 -136427 20735 189617 110156 -101394 -101950 -148020 -41799
11994d1799K17887j83903j89628J3769J48450J52191K39506j40456j01594k96039
$$ -41799 176088 -7815 -197443 -183674 -35224 116967 356473 216017 114423 -181616
11984a81616j73679l30756J45617L76665P5112j14924j29923j11262J12814K22611
$$ -181616 -355295 -686051 -540434 -163769 -88657 -203581 -333504 -444766 -331952 -109341
11974a09341M68282n3206k78869Q495K7939N5800j12024j81400l0315R2858p6197
$$ -109341 358941 305735 26866 35361 63300 119100 7076 -174324 -204639 -111781 -187978
11963a87978J87956O5381k86139j7269k25828O6545K54719j04265P6738K79660
$$ -187978 -22 65359 -220780 -238049 -463877 -397332 -142613 -246878 -170140 109520
11953A09520L01612J54519j86012r8949k29248J48145J27797j76182q4344J89328
$$ 109520 411132 565651 379639 280690 51442 199587 327384 151202 66858 256186
11943B56186J84120R8340j95867L2168j80837l22559l23257j43024J34513M71017
$$ 256186 440306 538646 342779 374947 194110 -128449 -451706 -594730 -460217 10800
11933A0800Q9339P2998j81433r5283O4976K17536k8573q6757M5991J41468k10821
$$ 10800 100139 173137 -8296 -103579 -38603 178933 150360 63603 109594 251062 40241
11922D0241n0601K60873k4225p4454p5186j42236N8394J89889p8406P025K21014
$$ 40241 -10360 250513 226288 151834 76648 -65588 -7194 182695 104289 111314 332328
11911C32328R7326N1320l14637m81682k64890J17942K34366J11040K20687r9935
$$ 332328 429654 480974 166337 -315345 -580235 -462293 -227927 -116887 103800 3865
11901C865O4110q5045j90837M8724L9569l59730j59953O5906K27711N2115J5935
$$ 3865 67975 -17070 -207907 -159183 -119614 -479344 -639297 -573391 -345680 -293565 -277630
11890b77630Q4188N03481o5946r7917k1482j73926K0032o1353J39171J07100l1289
$$ -277630 -193442 310039 244093 146176 124694 -49232 -29200 -90553 48618 155718 124429
11879A24429R861j77199J51505m1912k24399K0657M85580L31022J10701l62163
$$ 124429 134290 -42909 108596 66684 -157715 -137058 348522 679544 790245 428082
11869D28082k68549j79795q5230R3092O3335l13470K5799K84230P6623Q0066n5751
$$ 428082 159533 -20262 -105492 -12400 50935 -262535 -236736 47494 124117 204183 148432
11858A48432j00657P6740j8883R1478p0045p9229j25942J98773J56382p5845M4166
$$ 148432 47775 124515 105632 197110 127065 47836 -78106 120667 277049 201204 245370
11847B45370O7649M5888k8199k59313j52628J03237J46234L1222r299p2535q2237
$$ 245370 313019 358907 330708 71395 -81233 22004 168238 199460 190161 117626 35389
11836C5389j61598j27541j72057L2624j1245N306M4312P563J69314j40724L7715
$$ 35389 -126209 -253750 -425807 -393183 -404428 -399122 -354810 -347247 -177933 -318657 -280942
11825b80942J98773J89143O3265j38259j54159Q7918r9093j70545K62032K53136
$$ -280942 -82169 106974 170239 31980 -122179 -34261 -133354 -303899 -41867 211269
11815B11269o7322k38927J27748L9287m15767Q1633J88154j24970K15713R8505
$$ 211269 143947 -94980 32768 72055 -343712 -262079 -73925 -198895 16818 115323
11805A15323j92037r9683J25844P3731J9316j8185k12390j55740O6921o2351J98410
$$ 115323 -76714 -176397 -50553 23178 42494 24309 -188081 -343821 -276900 -339251 -140841
11794a40841L92226m3256m4326N7034l8767j16351j98863R282K32788K44162j29169
$$ -140841 251385 208129 163803 220837 182070 65719 -133144 -123862 108926 353088 223919
11783B23919j22667n1273k455p8733l07375l6336k655J6885r7587J8793J81653
$$ 223919 101252 49979 47524 -31209 -338584 -374920 -377575 -360690 -458277 -439484 -257831
11772b57831K10566j3604R5005j54349n0581Q3872J00030j76123m7369J09867
$$ -257831 -47265 -60869 34136 -120213 -170794 -86922 13108 -163015 -210384 -100517
11762a00517N4756m9791r9384m6428Q4011K23442J34367p2J64853J26895k12028
$$ -100517 -45761 -95552 -194936 -241364 -157353 66089 200456 200384 365237 492132 280104
11751B80104j14750j16503P0911M5253j37929m7168K44190j07613l14948J18737
$$ 280104 165354 48851 119762 165015 27086 -20082 224108 116495 -198453 -79716
11741g9716K80921K06152k66818j41569J99400j37510j45902J31566J03952J27536
$$ -79716 201205 407357 140539 -1030 198370 60860 -85042 46524 150476 278012
11731B78012n4736l90320j05401k8911J634J95404O1818j52519o7956R803j67834
$$ 278012 223276 -167044 -272445 -301356 -299722 -104318 -42500 -195019 -262975 -253172 -421006
11720d21006J64153R4093n7937k5458L78812J52929j0835j84612n1676j40054
$$ -421006 -256853 -162760 -220697 -246155 132657 285586 274751 90139 38463 -101591
11710a01591n79K93477m3603L6377q1897j4863O469n7928n2838m5001l0464P7481
$$ -101591 -102170 191307 147704 184081 102184 87321 93790 35862 -16976 -61977 -92441 -14960
11698a4960P4466k5240j50124M9524K01777n4053j83181j05648o788j18582r708
$$ -14960 59506 34266 -115858 -66334 135443 81390 -101791 -207439 -214227 -332809 -342517
11687c42517j5828j34560K30596L53298K29478j44368r5072m3322J02187p3236
$$ -342517 -358345 -492905 -262309 90989 320467 176099 81027 37705 139892 66656
11677F6656k15617k32521R0729K19507j19560l453N6350K57132R4691p8629m09353
$$ 66656 -148961 -381482 -290753 -71246 -190806 -194259 -137909 119223 213914 135285 -274068
11666b74068m05953J52602K28233q4300R2189J91442j48665n3789j04961q1874
$$ -274068 -680021 -527419 -299186 -383486 -291297 -99855 -248520 -302309 -407270 -489144
11656d89144M2516K25298K27529j47297K28585J15591N9763r0843k17678k98685
$$ -489144 -446628 -221330 6199 -141098 87487 203078 262841 171998 -45680 -344365
11646c44365M1832K65390M0915k58365p3607R2883L45975Q2258p8444j21639Q2631
$$ -344365 -302533 -37143 3772 -254593 -328200 -235317 110658 192916 114472 -7167 75464
11635G5464k46569j09353L26324J36897k00203j74974J17043J28247J58396j69941
$$ 75464 -171105 -280458 45866 182763 -17440 -192414 -75371 52876 211272 41331
11625D1331j20254o9661J34788J17482P6190M5586j06262O5781J4881k78930k27803
$$ 41331 -78923 -148584 -13796 103686 179876 225462 119200 184981 199862 -79068 -306871
11614c06871K01920J81661j24631r3915K7462J74933J37207j88717j08931J56822
$$ -306871 -104951 76710 -47921 -141836 -114374 60559 197766 9049 -99882 56940
11604E6940K13242L9011j30022j98304j64175l6458m7637K08559J97346l1409
$$ 56940 270182 309193 179171 -19133 -183308 -219766 -267403 -58844 138502 107093
11594A07093j99907j13707N3809j92522j64056M9868O5635L8398M15133J17868
$$ 107093 -92814 -206521 -152712 -345234 -509290 -459422 -393787 -355389 59744 177612
11584A77612j80148m5213K95821k02263J2316J19010j85225k38431r7185k573
$$ 177612 -2536 -47749 248072 45809 58125 177135 -8090 -246521 -343706 -346279
11574c46279J55442J61439J20587j76389l8948j40924l0660N3287J65391J36344
$$ -346279 -190837 -29398 91189 -85200 -124148 -265072 -295732 -242445 -77054 59290
11564E9290L652m6140k1666j33442K33660K05683n8349m59796J7938K58803M7557
$$ 59290 62942 16802 -4864 -138306 95354 301037 242688 -217108 -199170 59633 107190
11553A07190R6644k7634L3039j76790m81402j0042K24523K03551K42558k9116
$$ 107190 203834 176200 209239 32449 -448953 -458995 -234472 -30921 211637 182521
11543A82521l17959P726J185M6885q0037j54515j5123m5524J37606J19657l6058
$$ 182521 -135438 -127712 -126527 -79642 -159679 -314194 -329317 -374841 -237235 -117578 -153636
11532a53636L6327R8116O2445j65857J3426o2090q5665P9742Q7454p5232L02668
$$ -153636 -117309 -19193 43252 -122605 -109179 -171269 -256934 -177192 -89738 -164970 137698
11521A37698p817j94196k58817j0994J29915N7388k01651l5392Q1981J3860K06703
$$ 137698 129881 -64315 -323132 -334126 -204211 -146823 -348474 -383866 -301885 -288025 -81322
11510h1322K43525J62136N069p1532k06056P0541K17484k52893j83393K26262
$$ -81322 162203 324339 329408 257876 51820 122361 339845 86952 -96441 129821
11500A29821J80650j3473m69690l02277J51345K18795n7514p5395K13836j7294
$$ 129821 310471 296998 -172692 -474969 -323624 -104829 -162343 -237738 -23902 -41196
11490d1196j66246k12968K3622J81784q3988j57813N2655J34634l0870L5829m4084
$$ -41196 -207442 -420410 -396788 -215004 -298992 -456805 -404150 -269516 -300386 -264557 -308641
11479c08641J34029J15341r664j59975J78584J06639l8118n0766j12267K39081
$$ -308641 -174612 -59271 -68935 -228910 -50326 56313 18195 -32571 -144838 94243
11469I4243K19666j12246j33247k09921L0269R2357n6887J6776J01152r0823J75289
$$ 94243 313909 201663 68416 -141505 -111236 -18879 -75766 -58990 42162 -48661 126628
11458A26628m924m1514p3689J44943j20549m20966O4187J19912J74257L26441
$$ 126628 121704 80190 6501 151444 30895 -390071 -325884 -205972 -31715 294726
11448B94726j26543j96112k50320m8889J15587n2241m1819K40399J04388k06696
$$ 294726 168183 -27929 -278249 -327138 -211551 -263792 -305611 -65212 39176 -167520
11438a67520L7834q9178P2031L6562Q3216R3824l77330k28054K14133K87085L3289
$$ -167520 -129686 -218864 -146833 -110271 -27055 66769 -310561 -538615 -324482 -37397 -4108
11427d108J37989Q2747j15903j40115R692K72237j5646k87910j78126j44096K16640
$$ -4108 133881 216628 100725 -39390 -29698 242539 226893 -61017 -239143 -383239 -166599
11416a66599K84343J09035j18837k33326P0044m9291J81619p3784m984o5053j04147
$$ -166599 117744 226779 107942 -125384 -55340 -104631 76988 3204 -1780 -66833 -170980
11405a70980J22915J36700J33976l0243p6287R1387j60655j63616j08541k22636
$$ -170980 -48065 88635 222611 192368 116081 207468 46813 -116803 -225344 -447980
11395d47980J01576L8116K7956J99046Q8710j08607j2024K99380Q6394q6084k71811
$$ -447980 -346404 -308288 -280332 -81286 7424 -101183 -113207 186173 272567 186483 -85328
11384h5328K603q2753P1047k9436p0244p4457j8690k0711K15318J22713l6534
$$ -85328 -82725 -165478 -94431 -123867 -194111 -268568 -287258 -307969 -92651 30062 -6472
11373f472l55419J5544P7775K56464J71344l3228j55872r8390J1685k34683J58515
$$ -6472 -361891 -346347 -268572 -12108 159236 126008 -29864 -128254 -116569 -351252 -192737
11362a92737J21632R3882K00370O3933O6234j48618K8255j91520j36523o75J81234
$$ -192737 -71105 22777 223147 287080 353314 204696 232951 41431 -95092 -95767 85467
11351H5467J28652j7597Q4007P1650m1984j3803J66929k07628k95216j6239j02414
$$ 85467 214119 196522 280529 352179 310195 296392 463321 255693 -39523 -55762 -158176
11340a58176j06366M6586j45014l1930q1980J37487P1253q9311J77827N760k45565
$$ -158176 -264542 -217956 -362970 -394900 -476880 -339393 -268140 -357451 -179624 -173864 -419429
11329d19429R2784R3456n7157p0933J91504n9269K26539O8813j14818J25933r6459
$$ -419429 -326645 -233189 -290346 -361279 -169775 -229044 -2505 66308 -48510 77423 -19036
11318a9036J02111Q5744K12508M1548j32905k15587j16142j06532P2586j37515
$$ -19036 83075 168819 381327 422875 289970 74383 -41759 -148291 -75705 -213220
11308b13220Q952J31586R9570Q9228m0871J14562k4283K5477l91980l69735K9810
$$ -213220 -204268 -72682 26888 116116 75245 189807 165524 191001 -200979 -570714 -540904
11297e40904J41820J33486K31490j47161j60862M8754L17128M0535j67023J32315
$$ -540904 -399084 -265598 -34108 -181269 -342131 -293377 23751 64286 -102737 29578
11287B9578J80193p4684M800q8007j23492J87081K13124j58392k02564K661K7015
$$ 29578 209771 135087 139887 51880 -71612 115469 328593 170201 -32363 -29702 -2687
11276b687k72190o1729J09126J28246J45536q2131R876j71421k6715J32224J57716
$$ -2687 -274877 -336606 -227480 -99234 46302 -35829 -25953 -197374 -224089 -91865 65851
11265F5851N8393j06452k74938l87261N6259j467J00445M3370n2289M15647L19590
$$ 65851 124244 17792 -257146 -644407 -588148 -589615 -489170 -445800 -498089 -82442 237148
11254B37148j11711m49836J26123L48631L5826j10485J20217N775o5630r7559
$$ 237148 125437 -324399 -198276 150355 186181 75696 195913 201688 136058 38499
11244C8499J41300q6454j02596j53902j42817M8567j23597L6946K17763K1889
$$ 38499 179799 93345 -9251 -163153 -305970 -257403 -381000 -344054 -126291 -104402
11234a04402j63408J62430J29248Q2966p557k38032j18640J01763J40805k44136
$$ -104402 -267810 -105380 23868 106834 99277 -138755 -257395 -155632 -14827 -258963
11224b58963O0479K2493k04537J19015K7659j88757j3463Q9494k479J35929j77181
$$ -258963 -198484 -175991 -380528 -261513 -233854 -422611 -436074 -346580 -349059 -213130 -390311
11213c90311J6994R9392M133j32175J17945j25543K2710l0946J43948J1269J6136
$$ -390311 -373317 -273925 -269792 -401967 -284022 -409565 -386855 -417801 -273853 -262584 -246448
11202b46448R4890L7016k009O4217l0368q4165j6259K95191K21928j43434o9227
$$ -246448 -151558 -114542 -116551 -52334 -82702 -166867 -183126 112065 333993 190559 121332
11191A21332L5173j29660k05030m7900N4796J30118n1072K1904K51058K63996
$$ 121332 156505 26845 -178185 -226085 -171289 -41171 -92243 -70339 180719 444715
11181D44715k69752o6397n7798k06466Q1099K46605j15210k69539o8148K93106
$$ 444715 174963 108566 50768 -155698 -74599 172006 56796 -212743 -280891 12215
11171A2215R9010k25086j03134j59668N9464L73625M3166j51948M4818L00270
$$ 12215 111225 -113861 -216995 -376663 -317199 56426 99592 -52356 -7538 292732
11161B92732R9100j50644q0718m28347l40473j20796J92263K07235O0465J09249
$$ 292732 391832 241188 160470 -267877 -608350 -729146 -536883 -329648 -269183 -159934
11151a59934m0840r0340L59537J02727n6812P8711p0219k04368K02786q9730M0917
$$ -159934 -200774 -291114 68423 171150 114338 193049 122830 -81538 121248 31518 72435
11140G2435K92216O6050l66291k41653k63242J61361J39805J9689r9233Q0691
$$ 72435 364651 430701 64410 -177243 -440485 -279124 -139319 -119630 -218863 -138172
11130a38172K74747k0652j10022N8686n5663j7817k23963j32967J33431r4535
$$ -138172 136575 115923 5901 64587 8924 -8893 -232856 -365823 -232392 -326927
11120c26927r094K6473k3349J42659J25072m1908l4123j6331n9624L5053n6369
$$ -326927 -336021 -309548 -332897 -190238 -65166 -107074 -141197 -157528 -217152 -182099 -238468
11109b38468M20811J32453l74017M9153l5037j17136k09340p0183L4561J82448
$$ -238468 182343 314796 -59221 -10068 -45105 -162241 -371581 -441764 -407203 -224755
11099b24755J9559K138N696L6949l3778j48976j14250K07080N74978Q8280j72665
$$ -224755 -205196 -203058 -197362 -160413 -194191 -343167 -457417 -250337 324641 412921 240256
11088B40256j34317j96170j05191J04852K83106J15015j04010K719M3890j62988
$$ 240256 105939 -90231 -195422 -90570 192536 307551 203541 206260 250150 87162
11078H7162l14074R7941P4454j64307J43736J19054M8663K23837J2932P1255r4674
$$ 87162 -226912 -128971 -54517 -218824 -75088 43966 92629 316466 329398 400653 305979
11067C05979j59002m55893o8653n9172J01225K72105L38135p7543j25038q9590
$$ 305979 146977 -308916 -377569 -436741 -335516 -63411 274724 197181 72143 -17447
11057a7447l06482j74065K48773k9896q0595J34963q9578M0737M7147J45882J71985
$$ -17447 -323929 -497994 -249221 -279117 -359712 -224749 -314327 -273590 -226443 -80561 91424
11046I1424J98688k91790j22114J48484K18268J47119j55586k01611P4972J5868
$$ 91424 290112 -1678 -123792 24692 242960 390079 234493 32882 107854 123722
11036A23722m1540k017o7921j54502n5223l5330K12136n6240r1083J11422M6108
$$ 123722 82182 80165 12244 -142258 -197481 -232811 -20675 -76915 -167998 -56576 -10468
11025a0468j46338K69517j24741k01827L6298K05378K12715j79235l6885q7154
$$ -10468 -156806 112711 -12030 -213857 -177559 27819 240534 61299 24414 -62740
11015f2740o4662O0318k26410J15718J5850k2795p0260P320L27066N3350j76451
$$ -62740 -127402 -67084 -293494 -177776 -161926 -184721 -254981 -247661 79405 132755 -43696
11004d3696k13117K60833J17413n2468j07204N0575L5836p7762k41326k08598
$$ -43696 -256813 4020 121433 68965 -38239 12336 48172 -29590 -270916 -479514
10994d79514j6748q0144K4264J66546J56895L23310Q2622r2283J12293p0886l64758
$$ -479514 -496262 -576406 -552142 -385596 -228701 94609 177231 84948 197241 126355 -238403
10983b38403n9964K43060K93937k27481r5748K01231o4327j54412J35637J34162
$$ -238403 -298367 -55307 238630 11149 -84599 116632 52305 -102107 33530 167692
10973A67692p2835J6077p3117m0758p5220J47850n2812n7594K5146N7463o1511
$$ 167692 94857 110934 37817 -2941 -78161 69689 16877 -40717 -15571 41892 -19619
10962a9619k15983Q7716Q8585J48039K27330o2137r1463L3571j30582K7019k71498
$$ -19619 -235602 -147886 -59301 88738 316068 253931 162468 196039 65457 92476 -179022
10951a79022k395P4233R9614k51653j77563K45775K13844q3429K6989q570J25785
$$ -179022 -181417 -107184 -7570 -259223 -436786 -191011 22833 -60596 -33607 -42177 83608
10940H3608K5413j8379K27969Q0378n00855k90773J02270J61809J47261K33445
$$ 83608 109021 90642 318611 398989 -101866 -392639 -290369 -128560 18701 252146
10930B52146Q7055j83792M4001J4799k78777j45973j84802m4157j859Q4844L70298
$$ 252146 339201 155409 199410 214209 -64568 -210541 -395343 -439500 -441359 -356515 13783
10919A3783j61919k14130R0294j249m1298J3475J31270K7717O1609j44951K82085
$$ 13783 -148136 -362266 -271972 -273221 -314519 -301044 -169774 -142057 -80448 -225399 56686
10908E6686J49584R6409L6204r3034j08375P5907j31430k12063J11068j63659
$$ 56686 206270 302679 338883 245849 137474 213381 81951 -130112 -19044 -182703
10898a82703j25028K06336r0276N4949K32106J84178K00432K1960l33183j5146
$$ -182703 -307731 -101395 -191671 -136722 95384 279562 479994 501954 168771 153625
10888A53625J9361O87r2298j41002P8291K25905L4638K79248k53429j31226r4993
$$ 153625 172986 173673 81375 -59627 18664 244569 279207 558455 305026 173800 78807
10877G8807L0238Q3445p9112R018M9164K99918K26442M53999M66625M32461M74532
$$ 78807 109045 192490 113378 122396 171560 471478 697920 1151919 1618544 2051005 2525537
10866B525537q9002l50998m40872n22031n24175m06620K1356K27724j21971J5295
$$ 2525537 2436535 2085537 1644665 1122634 598459 191839 213195 440919 318948 334243
10856C34243k15151k52018J73381J69825J22093l53662m0547k31735j97372J48183
$$ 334243 119092 -132926 40455 210280 332373 -21289 -61836 -293571 -490943 -342760
10846c42760Q5765k4850L3692K7539K5368j7532m9622M6267M068j04724k66296
$$ -342760 -256995 -281845 -248153 -220614 -195246 -212778 -262400 -216133 -212065 -316789 -583085
10835e83085L9429K61433J48592j17420J06903k7578K9920l1542J43159L5689
$$ -583085 -543656 -282223 -133631 -251051 -144148 -171726 -141806 -173348 -30189 5500
10825E500j7959R3380j08913j09051j40473M6551J67337j3433p2005J10416j27031
$$ 5500 -12459 80921 -27992 -137043 -277516 -230965 -63628 -77061 -149066 -38650 -165681
10814a65681l06736j65840j8620J83176J23240j28312R2425L0405k05077K79675
$$ -165681 -472417 -638257 -656877 -473701 -350461 -478773 -386348 -355943 -561020 -281345
10804b81345K38866j15744j54373J44635K33333k8263j23313l5045k37744n3304
$$ -281345 -42479 -158223 -312596 -167961 65372 37109 -86204 -121249 -358993 -412297
10794d12297K47959N1148j83930j59859q153j8635J18723J95038o4173j29542
$$ -412297 -164338 -113190 -297120 -456979 -465132 -483767 -365044 -170006 -234179 -363721
10784c63721p1031P7160K06885M6569L1558P4968R6172K5564L6o0537j57214k8023
$$ -363721 -434752 -357592 -150707 -104138 -72580 2388 98560 124124 124160 63623 -93591 -121614
10772a21614r0980l7735J01919R8507M1304R8139m11951j63854k308J03539K20854
$$ -121614 -212594 -250329 -148410 -49903 -8599 89540 -322411 -486265 -488573 -385034 -164180
10761a64180l3886J14693j26014k66023k55004P9000K31227K66311J62164k46420
$$ -164180 -198066 -83373 -209387 -475410 -730414 -651414 -420187 -153876 8288 -238132
10751b38132j42460N7336K760K105J78590L25021K6195j70825j92463J45768K1018
$$ -238132 -380592 -323256 -320496 -318391 -139801 185220 211415 40590 -151873 -6105 14913
10740A4913J25635K07897j77002P9794n2403J2057K01039j39049l25610J11240
$$ 14913 140548 348445 171443 251237 198834 210891 411930 272881 -52729 58511
10730E8511L04037j52382l940o0400J01382k10122j74072k41686j51727K75083
$$ 58511 362548 210166 206226 145826 247208 37086 -136986 -378672 -530399 -255316
10720b55316J65268k5218J97361K64070M6082j50818j52061j19889Q8370j51045
$$ -255316 -90048 -115266 82095 346165 392247 241429 89368 -30521 57849 -93196
10710i3196k96322L3504K61022j63804k2011Q6267J0111p3169o7500K0093k81207
$$ -93196 -389518 -356014 -94992 -258796 -280807 -194540 -184429 -257598 -325098 -305005 -586212
10699e86212n4230J58699j48386J4332K13791J63416k81320j82855N0278L9095
$$ -586212 -640442 -481743 -630129 -615797 -402006 -238590 -519910 -702765 -652487 -613392
10689f13392n1885O0849J29043l3044m9155j09638j87644O6076K45498K02039
$$ -613392 -665277 -604428 -475385 -508429 -557584 -667222 -854866 -788790 -543292 -341253
10679c41253L3954O3627J92246j76537k6863J15113l27942l27326J15509K23285
$$ -341253 -307299 -243672 -51426 -227963 -254826 -139713 -467655 -794981 -679472 -456187
10669d56187L47141j50408O1875K59730K8417k01119r9092j75271j86465k22570
$$ -456187 -109046 -259454 -197579 62151 90568 -110551 -209643 -384914 -571379 -793949
10659g93949j58949J87864K46737l1039o1871j46525J42871L73529K55328J47169
$$ -793949 -952898 -765034 -518297 -549336 -611207 -757732 -614861 -241332 13996 161165
10649A61165L9973J88185P4897l03463q635k5932P723r0615m2728K68014K35278
$$ 161165 201138 389323 464220 160757 152122 126190 133913 43298 570 268584 503862
10638E03862Q7352o5409K16344j647q2305j44195J25121J19476O2444n6407J39609
$$ 503862 591214 525805 742149 740502 658197 514002 639123 758599 821043 764636 904245
10627I04245k41989m87937k72600r7982n7614j58492p7098j1146Q3831j27267
$$ 904245 662256 174319 -98281 -196263 -253877 -412369 -489467 -500613 -416782 -544049
10617e44049p7657m6640k47021k48606o487M4739K73121K18283K74200L15731
$$ -544049 -621706 -668346 -915367 -1163973 -1170460 -1125721 -852600 -634317 -360117 -44386
10607d4386k136k67448j31326k33298j1539J20839j6230J97906K19869M53037
$$ -44386 -46522 -313970 -445296 -678594 -690133 -569294 -585524 -387618 -167749 285288
10597B85288K47099J31758M90148L84801q5771l01549p6365l04350j56928l27739
$$ 285288 532387 664145 1154293 1539094 1453323 1151774 1075409 771059 614131 286392
10587B86392r4698K53626L22713J14345q5857p4738j07512k3844Q8838j03791
$$ 286392 191694 445320 768033 882378 796521 721783 614271 590427 679265 575474
10577E75474j63216J21223K61009j20693k09845K13021J27404k92147r6242K7602
$$ 575474 412258 533481 794490 673797 463952 676973 804377 512230 415988 443590
10567D43590j082M5977J95767l8870j39629J66614R9993q7333j84018j15582o652
$$ 443590 442508 488485 684252 645382 505753 672367 772360 685027 501009 385427 378775
10556C78775j3918l60699p7047J70420J04088q8543J50911R2537M6779J08003
$$ 378775 364857 4158 -72889 97531 201619 113076 263987 356524 403303 511306
10546E11306J80368k16430k54897k67659n2713J56183j0299k04851n687M8731
$$ 511306 691674 475244 220347 -47312 -100025 56158 45859 -158992 -164679 -115948
10536a15948K42726O5111J11472k71437j09937J32007r123L44333K53577q2509
$$ -115948 126778 191889 303361 31924 -78013 53994 44871 389204 642781 560272
10526E60272n5761j98150j32213J19883k23544J8747O3425J85740K62497K27523
$$ 560272 504511 306361 174148 294031 70487 89234 152659 338399 600896 828419
10516H28419n3308j55985r9m9735m14655j51680q8997Q5344j37861p5791m8303
$$ 828419 775111 619126 619027 569292 154637 2957 -86040 -696 -138557 -214348 -262651
10505b62651J46511M5994j73668N2912K46433k6166K44084N58167K91582J01051
$$ -262651 -116140 -70146 -243814 -190902 55531 29365 273449 831616 1123198 1224249
10495A224249K61611K53794R3556M09658M54194K48768N6287K8263K52565N35881
$$ 1224249 1485860 1739654 1833210 2242868 2697062 2945830 3002117 3030380 3282945 3818826
10485C818826O74858R22351P01408O72024O21540K53810L79923K78351N77244
$$ 3818826 4493684 5416035 6117443 6789467 7411007 7664817 8044740 8323091 8900335
10476H900335Q64620J101619J659190J859871K276527L373824M690625N962177
$$ 8900335 9764955 10866574 12525764 14385635 16662162 20035986 24726611 30688788
10468C0688788Q649040J3519844K2826677L8383114O2028487Q5721397R3807970
$$ 30688788 39337828 52857672 75684349 114067463 176095950 261817347 355625317
10461C55625317Q5951649N1888677j3463937o9377795r4259083r4136089p8757036
$$ 355625317 441576966 493465643 480001706 410623911 316364828 222228739 143471703
10454A43471703n1985622k9920090j6641561r485602n990265m279831l488487
$$ 143471703 91486081 61565991 44924430 35438828 29448563 25168732 21680245
10447B1680245l319751k918149k520212j708694j345389j136930n86494n17492
$$ 21680245 18360494 15442345 12922133 11213439 9868050 8731120 8144626 7627134
10439G627134j49995j76810Q5662l27893p22247p81368p47283p03967n85707l49152
$$ 7627134 7477139 7300329 7385991 7058098 6335851 5554483 4807200 4103233 3517526 3168374
10429C168374j82824M24604J161644J504428J553415J399390J481324J175242
$$ 3168374 2985550 3410154 4571798 6076226 7629641 9029031 10510355 11685597
10421A1685597j59878r16148j293292j593701j395376j131946j139756o88488
$$ 11685597 11525719 10609571 9316279 7722578 6327202 5195256 4055500 3367012
10413C367012k87246j87839m3481m8941l25346l71238n2347l49267k60122p0804
$$ 3367012 3079766 2891927 2848446 2799505 2474159 2102921 2050574 1701307 1441185 1370381
10403A370381j05735J02924J22224J98160L7851j34662q328l9341m4877J6085
$$ 1370381 1264646 1367570 1489794 1687954 1725805 1591143 1582815 1543474 1498597 1514682
10393A514682j43462j51597j02968o7108P2934q717K9340l8580J41615K15339
$$ 1514682 1371220 1219623 1116655 1049547 1122481 1113764 1143104 1104524 1246139 1461478
10383A461478q2149r3003l77259K2632J94826j12794J7367j77075P778k84261
$$ 1461478 1379329 1286326 909067 931699 1126525 1013731 1031098 854023 861801 577540
10373E77540m00490j64286J7854l3565K8854J54195L28230R9892J57304j70191
$$ 577540 177050 12764 30618 -2947 25907 180102 508332 608224 765528 595337
10363E95337J15397j01150p3718n0614k67844o2242K58531o5074k25090N643j95987
$$ 595337 710734 609584 535866 485252 217408 155166 413697 348623 123533 129176 -66811
10352f6811J00834L71197k42959l75861J38524K34566j58536j39112J30821n9520
$$ -66811 34023 405220 162261 -213600 -75076 159490 954 -138158 -7337 -66857
10342f6857M3970L37671q0962p4975q435q9332j73307j33575p9346j79762M6492
$$ -66857 -22887 314784 233822 158847 150412 61080 -112227 -245802 -325148 -504910 -458418
10331d58418J4402j79847m9529m48598m92673l76295K09105M31848P21669M28371
$$ -458418 -444016 -623863 -673392 -1121990 -1614663 -1990958 -1781853 -1350005 -628336 -199965
10321a99965K67315J94753k849K26437k95107j51118R0296o8644m6519K58669
$$ -199965 67350 262103 259254 485691 190584 39466 129762 61118 14599 273268
10311B73268L40087N0954K62938J23998R372N7520N7831j98470k2576Q8551o6061
$$ 273268 613355 664309 927247 1051245 1060617 1118137 1175968 977498 954922 1043473 977412
10300I77412n9226j55925j98413O365j63246j89141k4950Q5654j20074q0908k57736
$$ 977412 918186 762261 563848 570213 406967 217826 192876 278530 158456 77548 -180188
10289a80188m5405J59104n8607j39861K8049n9154m8336j09086J52730L70797
$$ -180188 -225593 -66489 -125096 -264957 -236908 -296062 -344398 -453484 -300754 70043
10279G0043J43236j91686J05152O5191m19626l74815o9189K18217K25794K34433
$$ 70043 213279 21593 126745 191936 -227690 -602505 -671694 -453477 -227683 6750
10269F750K36288j27130j30570K54775K91433K27910k65280j14264O9494O7522
$$ 6750 243038 115908 -14662 240113 531546 759456 494176 379912 449406 516928
10259E16928J54944j0357l79658l34534K74532K20458j37275j28050n7535K3580
$$ 516928 671872 661515 281857 -52677 221855 442313 305038 176988 119453 143033
10249A43033M5428J42950Q0765l02890J0121P0493o6019J84474J16099j42702
$$ 143033 188461 331411 412176 109286 119407 189900 123881 308355 424454 281752
10239B81752k85193R7820o2145J2094J34234K62529J41462J12599J07787j39937
$$ 281752 -3441 94379 32234 44328 178562 441091 582553 695152 802939 663002
10229F63002l91624N759K84068K90838j08194k70590j74409r77J3998k9967o7013
$$ 663002 271378 277137 561205 852043 743849 473259 298850 297873 311871 281904 214891
10218B14891j62667O0824j93263q2182J87736m1591m4383P4174K8118J43502n784
$$ 214891 52224 113048 -80215 -162397 25339 -16252 -60635 13539 41657 185159 179375
10207A79375p2442m1081L4948N5067m4817K17365K56114j77706m55974l24596
$$ 179375 106933 65852 100800 155867 111050 328415 584529 406823 -49151 -373747
10197c73747L1383K18020K67807R8864J00150J4128L4178k5594Q2823p4795P4124
$$ -373747 -342364 -124344 143463 242327 342477 356605 390783 365189 448012 373217 447341
10186D47341k40779j49716k62474J70873o175k33584O921L23284J37367j55175
$$ 447341 206562 56846 -205628 -34755 -40930 -274514 -267593 55691 193058 37883
10176C7883o0847j31084n1211J86289J42480Q7791j71135J82323M5375j19968
$$ 37883 -22964 -154048 -205259 -18970 123510 211301 40166 222489 267864 147896
10166A47896K1141K56672L13958j4307l06361l08178j21250n1885J18597J31799
$$ 147896 169037 425709 739667 725360 418999 110821 -10429 -62314 56283 188082
10156A88082J3000J15868Q4368J40105j40452j18060J32731L54495o997l06930
$$ 188082 201082 316950 401318 541423 400971 282911 415642 770137 763140 456210
10146D56210j75680j6887J43240K59914o7484j82197R8192j56526j83611J4257
$$ 456210 280530 263643 406883 666797 599313 417116 515308 358782 175171 189428
10136A89428k06963o643K35884J86708j9854j07806M9272K07278J9779l1702j1571
$$ 189428 -17535 -24178 211706 398414 378560 270754 320026 527304 547083 515381 503810
10125E03810j50288j41076J93896J57334j18399l1109j22810k56253j02748l3152
$$ 503810 353522 212446 406342 563676 445277 414168 291358 35105 -67643 -100795
10115a00795r2228O573O5044L013M6724p2808l5345K7725L35740J90415j40550
$$ -100795 -193023 -186450 -121406 -118393 -71669 -144477 -179822 -152097 183643 374058 233508
10104B33508k11218J12611P3205J16026J7294J59342O239J8910j45518j44665
$$ 233508 22290 134901 208106 324132 341426 500768 507007 525917 380399 235734
10094B35734o7751j4692m9641Q8382j39708r1701q2695J18603K17243k8052J40394
$$ 235734 167983 153291 103650 192032 52324 -39377 -122072 -3469 213774 185722 326116
10083C26116K13294J13341q3612l03198j40215l01576j78073K6600J56875J86319
$$ 326116 539410 652751 569139 265941 125726 -175850 -353923 -327323 -170448 15871
10073A5871n5136k36418k1655P4617J15486K81047N8430N5704J4240J3101k52040
$$ 15871 -39265 -275683 -297338 -222721 -107235 173812 232242 287946 302186 315287 63247
10062F3247O634R0794k86658P4704K21224Q5862p0063J76993L43255J87970L80524
$$ 63247 69881 160675 -125983 -51279 169945 255807 185744 362737 705992 893962 1274486
10051A274486J37232M07346M65554R1209K41302R1875j84704m29025m93482m03772
$$ 1274486 1411718 1819064 2284618 2375827 2617129 2709004 2524300 2095275 1601793 1198021
10041A198021m10581j94444n9613l0570q5774j41129n4812K385j03697j13340
$$ 1198021 787440 592996 533383 502813 417039 275910 221098 223483 119786 6446
10031F446j01178o4775r1444k7213J11239J78658j16339J64111K87385L4010R9613
$$ 6446 -94732 -159507 -250951 -278164 -166925 11733 -104606 59505 346890 380900 480513
10020D80513n2131l07334j37238j12405p0328O4874J18560J57106J15393j04543
$$ 480513 428382 121048 -16190 -128595 -198923 -134049 -15489 141617 257010 152467
10010A52467M8914J66628l8988j93649J14114R9559K03655P2690K62099j54430
$$ 152467 201381 368009 329021 135372 249486 349045 552700 625390 887489 733059
10000G33059n0135O921j58312j50695j13768L9613p2505k14022j94372J4492Q2273
$$ 733059 682924 689845 531533 380838 267070 306683 234178 20156 -174216 -159724 -77451
9989g7451k46333j2007O8335K26258n016j21389J76709P5831R4352j22864L1241
$$ -77451 -323784 -335791 -267456 -41198 -46214 -167603 9106 84937 179289 56425 87666
9978H7666l12774k02803M0934J77393K04832k9948n1945j19316K96511L67044
$$ 87666 -225108 -427911 -386977 -209584 -4752 -34700 -86645 -205961 90550 457594
9968D57594K6060m1232j4762m3754n0049k25708k15136R0413J2772j61292O9985
$$ 457594 483654 442422 427660 383906 333857 108149 -106987 -16574 -3802 -165094 -95109
9957i5109p9351j60730m1210O6665J86006J24790K9147o2990p1981Q9643M7527
$$ -95109 -174460 -335190 -376400 -309735 -123729 1061 30208 -32782 -104763 -15120 32407
9946C2407K04175J77094j35413j00210k10913O6283K22305j12307j65135j57718
$$ 32407 236582 413676 278263 178053 -32860 33423 255728 143421 -21714 -179432
9936a79432p757J19947O5872P4392O4856Q968J52113K94785m9147j62242l15143
$$ -179432 -187189 -67242 -1370 73022 137878 146846 298959 593744 544597 382355 67212
9925F7212j11636P6576R1873q5N9344J45330J5062j02334j69284j0311P8860J81875
$$ 67212 -44424 32152 124025 123940 183284 328614 343676 241342 72058 61747 140607 322482
9913C22482J3878n2654m0836J68173j05659k28897o6392r7545N0746L6464r8808
$$ 322482 336360 283706 242870 411043 305384 76487 10095 -87450 -36704 -240 -99048
9902i9048l8378o9686J10241K66721K14846k4964j56285o286M7828j09797J7418
$$ -99048 -137426 -207112 -96871 169850 384696 359732 203447 197161 244989 135192 152610
9891A52610j98073K4205L23117L3358o5739l33464j95923J29409L00886J7979
$$ 152610 -45463 -21258 301859 335217 269478 -63986 -259909 -130500 170386 188365
9881A88365J86687J91729K4049k25126j73914m3371J8983Q1420p6066j88279j85601
$$ 188365 375052 566781 590830 365704 191790 148419 167402 248822 172756 -15523 -201124
9870b01124J73701Q4098q5935R2179K17166Q5691k2281J60676j23353r3543j16442
$$ -201124 -27423 56675 -29260 62919 280085 365776 343495 504171 380818 287275 170833
9859A70833M7681M1532O3117J16567j45715k8379J4925r4017Q6426K13572J4048
$$ 170833 218514 260046 323163 439730 294015 265636 280561 186544 272970 486542 500590
9848E00590j02593m2658k52772J08033J06286j04057j01093L9603J485k3425O0733
$$ 500590 397997 355339 102567 210600 316886 212829 111736 151339 152824 129399 190132
9837A90132J23571K8712L0877q3406L8550j33884k65924p6652j5334L7662J27974
$$ 190132 313703 342415 373292 289886 328436 194552 -71372 -148024 -163358 -125696 2278
9826B278J2890j64619Q2183J7758j41898k2981J19688M95898J00865j56112k15473
$$ 2278 15168 -149451 -67268 -49510 -191408 -214389 -94701 401197 502062 345950 130477
9815A30477j90799j62803N6801L273J10898O1012L8627j81050j13298J64277J79140
$$ 130477 -60322 -223125 -166324 -163051 -52153 8859 47486 -133564 -246862 -82585 96555
9804I6555k3456O2629J73896J02867r5488r829J05654l019K38805p6375j17062
$$ 96555 73099 135728 309624 412491 317003 307174 412828 409809 648614 572239 455177
9793D55177M5822J37288l0977N1225k57090j67985k56022r3358P0247J50028j41046
$$ 455177 500999 638287 607310 658535 401445 233460 -22562 -115920 -45673 104355 -36691
9782c6691k66996R0424M74563J86654N5521M6067j56837r4014k52440j85194j13583
$$ -36691 -303687 -213263 261300 447954 503475 549542 392705 298691 46251 -138943 -252526
9771b52526J71044J05364R0347j19965R3493J36404M657k26007j43796L9366o9632
$$ -252526 -81482 23882 114229 -5736 87757 224161 228818 2811 -140985 -101619 -171251
9760a71251j4602M9144J49101J73167K4384n2245j03883n6533j42841j11025O3511
$$ -171251 -185853 -136709 12392 185559 209943 157698 53815 -2718 -145559 -256584 -193073
9749a93073J67710J9284O8106r5095J19092J59068Q3264J57003r8112k12590J88955
$$ -193073 -25363 -6079 62027 -33068 86024 245092 328356 485359 387247 174657 363612
9738C63612Q7337j07781m97677n7914K70614l4392p6118J16668Q2393J28809L3144
$$ 363612 450949 343168 -154509 -212423 58191 23799 -52319 64349 146742 275551 308695
9727C08695j38487j61296j40513n7587K15872J45703J0628m8294M1800k16648
$$ 308695 170208 8912 -131601 -189188 26684 172387 183015 134721 176521 -40127
9717d0127J36052M2427j8593l7903k11026j68188O1187K7383O2699L42184O1934
$$ -40127 95925 138352 119759 81856 -129170 -297358 -236171 -208788 -146089 196095 258029
9706B58029j46330P1269k0651J22111l2383k44589Q280K63680J69381k46581N8173
$$ 258029 111699 182968 162317 284428 252045 7456 15736 279416 448797 202216 260389
9695B60389j68691p3584J94573N0253o9622j76865k9566j14345o5325K35166L13632
$$ 260389 91698 18114 212687 262940 193318 16453 -13113 -127458 -192783 42383 356015
9684C56015Q0974J59100J69494j24923k27082j40955l8705K62773p3734k82310
$$ 356015 436989 596089 765583 640660 413578 272623 233918 496691 422957 140647
9674A40647J15678k52794o5455M4453j07799p6473K5027J84925l6895J60862o6700
$$ 140647 256325 3531 -61924 -17471 -125270 -201743 -176716 8209 -28686 132176 65476
9663F5476k46432j88953J3051M2551j40066K25957K08910J13199r6680N4431Q6954
$$ 65476 -180956 -369909 -356858 -314307 -454373 -228416 -19506 93693 -2987 51444 138398
9652A38398l58757j67794J2772K87504J62221k6529n02352j98620K72263L45573
$$ 138398 -220359 -388153 -375381 -87877 74344 47815 -454537 -653157 -380894 -35321
9642c5321J66900R4777n4663r4173J02700l43J47580O9344r6931J12785K5885
$$ -35321 131579 226356 171693 77520 180220 179877 327457 396801 299870 412655 438540
9631D38540k90709k36989K427K80165K01271l0188j72805j73148l6909l085j80651
$$ 438540 147831 -89158 -86731 193434 394705 364517 191712 18564 -18345 -21430 -202081
9620b02081j22886K14698J70900P529l9251K70856J56249r4054j67463m9937r1106
$$ -202081 -324967 -110269 60631 68160 28909 299765 456014 361960 194497 144560 53454
9609E3454j03252J47624J3823n5620k31830r1086J25563K52877n0495j01129j8509
$$ 53454 -49798 97826 111649 56029 -175801 -266887 -141324 111553 61058 -40071 -58580
9598e8580K02555o054o488P6958o0620n6846J26262k80233K17642K99685l19971
$$ -58580 143975 137921 131433 208391 147771 90925 217187 -63046 154596 454281 134310
9587A34310l57734k6908N284J47002J70690K44760k26137l12117k2202j2487L5013
$$ 134310 -223424 -250332 -245048 -98046 72644 317404 91267 -220850 -243052 -255539 -220526
9576b20526J13558N9276j34203r9621J87850J74460j2513k33463P1191K2495J75373
$$ -220526 -106968 -47692 -181895 -281516 -93666 80794 68281 -165182 -93991 -71496 103877
9565A03877J23437j00673l7948j71799k41927k14381J68790K95139J08004Q6678
$$ 103877 227314 126641 88693 -83106 -325033 -539414 -370624 -75485 32519 119197
9555A19197j30612J76258K51383K27815n8461r0127k8936l25623n4610J08516
$$ 119197 -11415 164843 416226 644041 585580 495453 466517 140894 86284 194800
9545A94800k1547l6335q0814j66229J34746j7960p0052j8222O7217j17590n9838
$$ 194800 173253 136918 56104 -110125 24621 6661 -63391 -81613 -14396 -131986 -191824
9534a91824m6980J62657J05920q3544N480J2974k7785N5522o4707j07224r5783
$$ -191824 -238804 -76147 29773 -53771 -48291 -35317 -63102 -7580 -72287 -179511 -275294
9523b75294N9728j34561N6941K31724j49557J5657K40979j38152J37777K5135
$$ -275294 -215566 -350127 -293186 -61462 -211019 -195362 45617 -92535 45242 70377
9513G0377J19464J23688q9724l8484J1959k4757p9810k88038j18988K6563Q1992
$$ 70377 189841 313529 223805 185321 197280 172523 92713 -195325 -314313 -287750 -205758
9502b05758K29081J12865k54895L7421J05364j27877o332J23852q5620L0304J91659
$$ -205758 23323 136188 -118707 -81286 24078 -103799 -110131 13721 -71899 -41595 150064
9491A50064L65955P50l05774j78698L27030M0441M976J8015O4847j46354r1373
$$ 150064 516019 516769 210995 32297 359327 399768 404744 422759 487606 341252 249879
9480B49879J19016k78814j17512J06789j01870J73886l0942j89398j90049l0197
$$ 249879 368895 90081 -27431 79358 -22512 151374 120432 -68966 -259015 -289212
9470b89212N6996K52710m7739j40998M0215P4503K9120j45724k4061N6071j6309
$$ -289212 -232216 20494 -27245 -168243 -128028 -53525 -24405 -170129 -194190 -138119 -154428
9459a54428L3793O1376L36575K24743j21674J7811M817j35428j30599R9827j36387
$$ -154428 -120635 -59259 277316 502059 380385 398196 403013 267585 136986 236813 100426
9448A00426r6947J34633J16641J86705j1785j15533M4610k789k09924J37836J42618
$$ 100426 3479 138112 254753 441458 429673 314140 358750 355961 146037 283873 426491
9437D26491j92584l3866K61795N8606o6385K317r4827L1560o8430q0605j0510
$$ 426491 233907 200041 461836 520442 454057 456374 361547 393107 324677 244072 233562
9426B33562k71010J56477O9813l20283J1576K35491P3652k7737j41116j26308
$$ 233562 -37448 119029 188842 -131441 -119865 115626 189278 161541 20425 -105883
9416a05883k61877J02863J68694J04945r2975m1403K2304o9803K2831O5127q1215
$$ -105883 -367760 -264897 -96203 8742 -84233 -125636 -103332 -173135 -150304 -85177 -166392
9405a66392M4498J05362n4266K60146L4800K1534l615j62180j43494N541q9029
$$ -166392 -121894 -16532 -70798 189348 224148 245682 242067 79887 -63607 -58066 -147095
9394a47095r4514K1192K04654R4738j2022j32117K932P3528L52094K31872j32780
$$ -147095 -241609 -220417 -15763 78975 66953 -65164 -62232 11296 363390 595262 462482
9383D62482k56525N857j85j8680j33712l6628L28167L5432r0782m9872l39913
$$ 462482 205957 211814 211629 192949 59237 22609 350776 386208 295426 245554 -94359
9372i4359l63574j2000K72466J34229n4275J31171N7206l3435J84624J34575K08484
$$ -94359 -457933 -469933 -197467 -63238 -117513 13658 70864 37429 222053 356628 565112
9361E65112j16419L2100q3080l62686o7719J81803J99222J60279m4154j02213
$$ 565112 448693 480793 397713 35027 -32692 149111 348333 508612 464458 362245
9351C62245o6161j22437j03248j92023K72538J65117j31980m6890J33271J48190
$$ 362245 296084 173647 70399 -121624 150914 316031 184051 137161 270432 418622
9341D18622j4346k73330j46864J0405p3872J62374L66832j17501l8287J54992
$$ 418622 404276 130946 -15918 -5513 -79385 82989 449821 332320 294033 449025
9331D49025p4506r8113k27311N0789P1884M6861R4894o5075j20471Q8385J5800
$$ 449025 374519 276406 49095 99884 171768 218629 313523 248448 127977 216362 232162
9320B32162j23279m7095J68565K52719J97721j03228k11837J02124j73566l47580
$$ 232162 108883 61788 230353 483072 680793 577565 365728 467852 294286 -53294
9310e3294J33070K20254J29140J34810O8576j47377j08432m6552k27386K39039
$$ -53294 79776 300030 429170 563980 632556 485179 376747 330195 102809 341848
9300C41848j04993J22615P9334Q900R705J37177J07461J12075k57824N545q421
$$ 341848 236855 359470 438804 447704 457409 594586 702047 814122 556298 561843 553422
9289E53422k69442N1343k2136o2224J84591l8693Q3493l4016R2630K55890q1569
$$ 553422 283980 335323 313187 250963 435554 396861 480354 446338 538968 794858 713289
9278G13289j07089r4409O8560O375k6533l03642J81541L2396J30595Q5255O0199
$$ 713289 606200 511791 580351 586726 560193 256551 438092 470488 601083 686338 746537
9267G46537M466J54524J20227l28965j63680p6748k24341P1202L18527M4306q2731
$$ 746537 751003 905527 1025754 696789 533109 456361 232020 303222 621749 666055 583324
9256E83324L0484p7360R0835P7538K0461j84345J47526M5685l1447Q828j13152
$$ 583324 613808 536448 627283 704821 725282 540937 688463 734148 702701 711529 598377
9245E98377k09212J15933M8918l0837K08013K14503p6315O3483L47675R5570n102
$$ 598377 389165 505098 554016 523179 731192 945695 869380 932863 1280538 1376108 1371006
9234A371006K4577m0239J45922L45117L16007J56551P5681k8770R7798K11647
$$ 1371006 1395583 1355344 1501266 1846383 2162390 2318941 2394622 2365852 2463650 2675297
9224B675297O8912J46464j42915m984J78555J93350M8691K31705J95152J76933
$$ 2675297 2744209 2890673 2747758 2742774 2921329 3114679 3163370 3395075 3590227 3767160
9214C767160K59152M20105M58942N9541K88848M56566K43747L69687M75510L51453
$$ 3767160 4026312 4446417 4905359 4964900 5253748 5710314 5954061 6323748 6799258 7150711
9204G150711M26503N53650L98834M74340L81686K70408M43176L31416J13912j50532
$$ 7150711 7577214 8130864 8529698 9004038 9385724 9656132 10099308 10430724 10544636 10394104
9194A0394104k37341M1588N6586j74782n27679k52051j30016m27806k29413k55797
$$ 10394104 10156763 10198351 10254937 10080155 9552476 9300425 9170409 8742603 8513190 8257393
9184H257393l03762n76832n59757l65228k95507l96952l10044m97201j95005l50985
$$ 8257393 7953631 7376799 6817042 6451814 6156307 5759355 5449311 4952110 4757105 4406120
9174D406120k3417k75702j12133k43835m03020l59023k38150j78901J978j69841
$$ 4406120 4382703 4107001 3994868 3751033 3348013 2988990 2750840 2571939 2573917 2404076
9164B404076k69111k8910j94386k86292j05424J1686Q3637j4557m1212O6293P7692
$$ 2404076 2134965 2106055 1911669 1625377 1519953 1531639 1615276 1600719 1559507 1625800 1703492
9153A703492l7524p0763j80508o4609J03481l7191l9245j59241o5134k1067P9254
$$ 1703492 1665968 1595205 1414697 1350088 1453569 1416378 1377133 1217892 1152758 1131691 1210945
9142A210945o9969l32328K33597k2297j36289j45309m1392n4637K4570j60967
$$ 1210945 1140976 808648 1042245 1019948 883659 738350 696958 642321 666891 505924
9132E05924j31991N9226M0969j05738N7732O4178K3431K38711R1163j67111k26185
$$ 505924 373933 433159 474128 368390 426122 490300 513731 752442 843605 676494 450309
9121D50309n2585j6969M2863K17151j0054r485m3558j42441k8097p1879K09113
$$ 450309 397724 380755 423618 640769 630715 621230 577672 435231 407134 335255 544368
9110E44368N0101l4736j33268l9481k6091N6738j18323R464j58251N7286j72743
$$ 544368 594469 559733 426465 386984 360893 417631 299308 308772 150521 207807 35064
9099C5064K0291q4066j3250m8108J2512L4037Q6936Q9358J14631o0327j72867
$$ 35064 55355 -28711 -41961 -90069 -77557 -43520 43416 132774 247405 187078 14211
9088A4211j57418K51626K885k4101l6392O0634J5424j13399M2108K2410J95646
$$ 14211 -143207 108419 111304 87203 50811 111445 126869 13470 55578 77988 273634
9077B73634N4360O6253q7270p9263j4776J05183Q781K0099J58880m4784j24661
$$ 273634 327994 394247 306977 227714 212938 318121 326902 347001 505881 461097 336436
9066C36436j03340N7184l0989k03226O1516k4990j3569M8222k3160j9398Q2106
$$ 336436 233096 290280 259291 56065 117581 92591 79022 127244 104084 84686 166792
9055A66792O3490N7050K6926J2725O3j59642l06259m4827J50855K06630Q4574
$$ 166792 230282 287332 314258 326983 327046 167404 -138855 -183682 -32827 173803 258377
9044B58377p2857j44198J734j56855j68288L18Q4506K17429j28300R9537J43260
$$ 258377 185520 41322 43056 -113799 -282087 -281769 -197263 20166 -108134 -8597 134663
9033A34663k5896j83685o5839J81704k36099K7149J71091J54812j33312j30728
$$ 134663 108767 -74918 -140757 40947 -195152 -168003 3088 157900 24588 -106140
9023a06140J12770J35565m0457j82926l44723o9794J25427m079M19942K32563
$$ -106140 6630 142195 101738 -81188 -425911 -495705 -370278 -374357 45585 278148
9013B78148j72272j1976N9938j13900p8545j00803N511J8685k07967P2748J05210
$$ 278148 105876 93900 153838 39938 -38607 -139410 -133899 -115214 -323181 -250433 -145223
9002a45223K39206Q8887k2945M7633j17721k2013L4079j49329j73132J18421k0311
$$ -145223 93983 182870 159925 207558 89837 67824 101903 -47426 -220558 -102137 -122448
8991a22448J35436j06311k25085j65058Q3965J70451L07434K16729j37717N2871
$$ -122448 12988 -93323 -318408 -483466 -399501 -229050 78384 295113 157396 210267
8981B10267n9657q745j66875Q4090Q3424q1244M6601j66980p2765o2271K02451
$$ 210267 150610 141865 -25010 59080 142504 61260 107861 -59119 -131884 -194155 8296
8970H296j4983l6704r6950j821K72713J6307r6519j44771k1756K60956J20563
$$ 8296 -6687 -43391 -140341 -142162 130551 146858 50339 -94432 -116188 144768 265331
8959B65331K12998k05685j94243K7799j24882R514J47090q081k25501j88929M9293
$$ 265331 478329 272644 78401 106200 -18682 -9168 137922 129841 -95660 -284589 -235296
8948b35296M58788K6127j79387q9536m5985j8203Q8033K5892K3342j56583K967
$$ -235296 223492 249619 70232 -19304 -65289 -83492 4541 30433 53775 -102808 -99841
8937i9841K3265n4451r1732k23774J14561K60652J881l7750K42719K60916J975
$$ -99841 -76576 -131027 -222759 -446533 -331972 -71320 -69439 -107189 135530 396446 398421
8926C98421k18182r5254J27331O6167P71j22932k16631L2578K39715J88564J6509
$$ 398421 180239 84985 212316 278483 279254 156322 -60309 -27731 211984 400548 417057
8915D17057k1651j94921Q129J23337j69645q4896P5549J14692j64545P215O0070
$$ 417057 395406 200485 208614 331951 162306 77410 152959 267651 103106 110321 170391
8904A70391o7444j54765O6843q2268j95686Q1934J23488K61969J10388j62812
$$ 170391 102947 -51818 15025 -67243 -262929 -180995 -57507 204462 314850 152038
8894A52038k86153j76002O8554R0454J68193r5363J40402J18929m8814l4081L3820
$$ 152038 -134115 -310117 -241563 -151109 17084 -78279 62123 181052 132238 98157 131977
8883A31977j41905N7549k3794j38765l4795j55223J27855q2173K64582J15812
$$ 131977 -9928 47621 23827 -114938 -149733 -304956 -177101 -259274 5308 121120
8873A21120j62186o8814K70577q3625J50793J91649j81747J6734j19281j54577
$$ 121120 -41066 -109880 160697 77072 227865 419514 237767 254501 135220 -19357
8863a9357l9783j01721q7294k5377m3584q75k8942j8131J10293J31527k36892
$$ -19357 -59140 -160861 -248155 -273532 -317116 -317991 -346933 -365064 -254771 -123244 -360136
8852c60136J88318J90784l563j8370k04971O3182O3371P6972J15676p7099j03616
$$ -360136 -171818 18966 15403 -2967 -207938 -144756 -81385 -4413 111263 34164 -69452
8841f9452j46179j35232M4549N8419J57994p1325q184K4312r1544N1725J61742
$$ -69452 -215631 -350863 -306314 -247895 -89901 -161226 -169410 -145098 -236642 -184917 -23175
8830b3175L10173j38482j90069k9849n408M2852O6359K9219J70219L51458r8039
$$ -23175 286998 148516 -41553 -71402 -76810 -33958 32401 61620 231839 583297 485258
8819D85258j78871L7056j23210j60437j90759l3207J60063j46192o3522L31513
$$ 485258 306387 343443 220233 59796 -130963 -164170 -4107 -150299 -213821 117692
8809A17692K0590l70179j52163J44489J43206K42962J74076l3183K30461k03716
$$ 117692 138282 -231897 -384060 -239571 -96365 146597 320673 287490 517951 314235
8799C14235m37132P9822k8823n3068p0490M01670K37687k34293j74558n6946L4486
$$ 314235 -122897 -43075 -71898 -124966 -195456 206214 443901 209608 35050 -21896 12590
8788A2590R9932r8200L2136L5502N0692P8715r7441j17957O5911l5728k0960O546
$$ 12590 112522 14322 46458 81960 132652 211367 113926 -4031 61880 26152 5192 11738
8776A1738j24098j10175o8212p9533L8723K23780J51970n4074O0838K08523l2072
$$ 11738 -112360 -222535 -290747 -370280 -331557 -107777 44193 -9881 50957 259480 227408
8765B27408p9880m5818R1596j37970m9541M0908K612r7017j0691J42317J0589
$$ 227408 147528 101710 193306 55336 5795 46703 49315 -47702 -58393 83924 94513
8754I4513l24481j51932L19931L91900r0549j51263q6361j83122L5052r2465J69575
$$ 94513 -229968 -381900 -61969 329931 239382 88119 1758 -181364 -146312 -238777 -69202
8743f9202J07337j06182q7205o1896J11421L04663J59662N6079N6644r016k08584
$$ -69202 38135 -68047 -155252 -217148 -105727 198936 358598 414677 471321 462305 253721
8732B53721k64634J98621J22468J08398J83231J77223r0347l93738J4821j68989
$$ 253721 -10913 187708 310176 418574 601805 779028 688681 294943 309764 140775
8722A40775k86719J76384K7249l1331J16933J10517j9592J13376J09678k05670
$$ 140775 -145944 30440 57689 26358 143291 253808 234216 347592 457270 251600
8712B51600j23933k58676j98396j20621j07726j08458K39469J56310j55257K33506
$$ 251600 127667 -131009 -329405 -450026 -557752 -666210 -426741 -270431 -425688 -192182
8702a92182J90510j05848k16041j78840J72655J36305j37559J35996K07927L1361
$$ -192182 -1672 -107520 -323561 -502401 -329746 -193441 -331000 -195004 12923 44284
8692D4284J84137J07772J6426K5663k0072j00887j68113j75896Q8115q8807j00409
$$ 44284 228421 336193 352619 378282 358210 257323 89210 -86686 1429 -87378 -187787
8681a87787L1436J20386p6587j4590L40680p5566j20221o4973k80768k2694J27639
$$ -187787 -156351 -35965 -112552 -127142 213538 137972 17751 -47222 -327990 -350684 -223045
8670b23045N0920K30137K95980j35009p8895r269J54791N4234Q8094j35106m9438
$$ -223045 -172125 58012 353992 218983 140088 130819 285610 339844 427938 292832 243394
8659B43394j49078j90331p3364K21671K97985k98464K1660Q0595N1937k4894J30651
$$ 243394 94316 -96015 -169379 52292 350277 51813 73473 154068 206005 181111 311762
8648C11762P1470K2042j0939k51167p0985J53549K08478O985j15002l70129j84065
$$ 311762 383232 405274 394335 143168 72183 225732 434210 441195 326193 -43936 -228001
8637b28001k4324J52608K6502K97083P5646l26769j90435K86630J85741l25997
$$ -228001 -252325 -99717 -73215 223868 299514 -27255 -217690 68940 254681 -71316
8627g1316o3336K52822J03459Q2263J66882K19053l21103m22185p6498K31987
$$ -71316 -134652 118170 221629 303892 470774 689827 368724 -53461 -129959 102028
8617A02028J14295J16716K45529n4337j97281j82876O3437o0585o0168J5138N7627
$$ 102028 216323 333039 578568 524231 326950 144074 207511 146926 86758 101896 159523
8606A59523L53164J77871J2940p6371j68888q8684q0166n5270J20368j14135J44583
$$ 159523 512687 690558 703498 627127 458239 369555 289389 234119 354487 240352 384935
8595C84935j62436k622K0259j03838O1870O0918m6354K4753j42877l19027J2923
$$ 384935 222499 219877 240136 136298 198168 259086 212732 237485 94608 -224419 -211496
8584b11496J02871m7912N655J28044K92567Q2750l3226J34847j20115k23591j09800
$$ -211496 -108625 -156537 -150882 -22838 269729 352479 319253 454100 333985 110394 594
8573E94q533J92599k42695r7147R6556R0690k98442J16848K75154N2353j12572
$$ 594 -7939 184660 -58035 -155182 -58626 32064 -266378 -149530 125624 177977 65405
8562F5405J39261Q3457p2793m8479j41248j65099n3743j84589J02868K03737J67877
$$ 65405 204666 288123 215330 166851 25603 -139496 -193239 -377828 -274960 -71223 96654
8551I6654J02406J3558k59282l73768k32514Q0919K50817K31777J4558j56857
$$ 96654 199060 212618 -46664 -420432 -652946 -572027 -321210 -89433 -74875 -231732
8541b31732j9049J39898O1620O8819p7957N7617M8713L979j4481N6711n5261J5950
$$ -231732 -250781 -110883 -49263 19556 -58401 -784 47929 51908 37427 94138 38877 54827
8529E4827L00522n6399k42300p1446R4103J02700j14594l8357M1227N3433Q9775
$$ 54827 355349 298950 56650 -14796 79307 182007 67413 29056 70283 123716 213491
8518B13491k44732Q338P6676J4268o717j86104J6900K47211j61676j7199k08661
$$ 213491 -31241 -22903 53773 68041 61324 -124780 -107880 139331 -22345 -39544 -248205
8507b48205N2072J21147J66403O0846l3949k40178j62597l7521M1039K55709l52050
$$ -248205 -196133 -74986 91417 152263 118314 -121864 -284461 -321982 -280943 -25234 -377284
8496c77284J2406J89077J97246O8528j74684L7459K4242j62211P3614J75011l4576
$$ -377284 -364878 -175801 21445 89973 -84711 -47252 -23010 -185221 -111607 63404 28828
8485B8828M7585k76784N4204J73596o8236k02015J61143O9448J79811J76969m9641
$$ 28828 76413 -200371 -146167 27429 -40807 -242822 -81679 -12231 167580 344549 294908
8474B94908j01763k57260l7503J42480J92063Q1637J03653M2228l25521j63938
$$ 294908 193145 -64115 -101618 40862 232925 314562 418215 460443 134922 -29016
8464b9016L80231R1584J33195j04624k74772l72343J67144K16508l09029o0654
$$ -29016 351215 442799 575994 471370 196598 -175745 -8601 207907 -101122 -161776
8454a61776K83074k9587P0366P3072k19946j78723l3024J82411J78363J82700
$$ -161776 121298 91711 162077 235149 15203 -163520 -196544 -14133 164230 346930
8444C46930N3003J28662j49358k00675m8716m6297M5894k31600K42733Q8929R5951
$$ 346930 399933 528595 379237 178562 129846 83549 129443 -102157 140576 229505 325456
8433C25456J08861n4510M6815k82883l4091O1848L5130K1371j51827p4670N5672
$$ 325456 434317 379807 426622 143739 109648 171496 206626 227997 76170 1500 57172
8422E7172j61089J0741k8943k4229K15815P7946j79788j40167N0451k50809K7244
$$ 57172 -103917 -93176 -122119 -146348 69467 147413 -32375 -172542 -122091 -372900 -345656
8411c45656J52123K67555K65028K20911p9204k02658n9036n9293J00039r3293
$$ -345656 -193533 74022 339050 559961 480757 278099 219063 159770 259809 166516
8401A66516j29912r7294j68179J85479M8928K72164o1328l14330O449R7942k05763
$$ 166516 36604 -60690 -228869 -43390 5538 277702 216374 -97956 -91507 6435 -199328
8390a99328Q9223J47343j44436k42082J22367J01890l4214J17325L1839l8610
$$ -199328 -110105 37238 -107198 -349280 -226913 -125023 -159237 -41912 -10073 -48683
8380d8683j96281j1731J86523J99537J01899K1072n4005P5785j1279k919j30263
$$ -48683 -244964 -256695 -70172 129365 231264 252336 198331 274116 262837 259918 129655
8369A29655j30551P1154p8132O4902J24833K13432k38728m02820O0969Q2805J20309
$$ 129655 -896 70258 -7874 57028 181861 395293 156565 -246255 -185286 -102481 17828
8358A7828K44916k0145N9715j10278q7958j61650k3028K56698M7601N5487M4912
$$ 17828 262744 242599 302314 192036 104078 -57572 -80600 176098 223699 279186 324098
8347C24098k78862r1435J16852r3107j31605o5325N5486p374M5792J30724j84048
$$ 324098 45236 -46199 70653 -22454 -154059 -219384 -163898 -171272 -125480 5244 -178804
8336a78804M8344J19262J67469L8059o9537p5080O3253Q0292K28679j42652k11688
$$ -178804 -130460 -11198 156271 194330 124793 49713 112966 193258 421937 279285 67597
8325F7597O3004J41985l58425p6896k8370j18438K4515j60678J4610N5003K20329
$$ 67597 130601 272586 -85839 -162735 -191105 -309543 -285028 -445706 -431096 -376093 -155764
8314a55764J35547R4722J69175j53613n3846K45107J40810k25466j05502M5623
$$ -155764 -20217 74505 243680 90067 36221 281328 422138 196672 91170 136793
8304A36793l0401J58917j11604l15546J96810J37562l6653j24394p7488j05593
$$ 136793 106392 265309 153705 -161841 34969 172531 135878 11484 -66004 -171597
8294a71597l5460J18822L8262K82970J66032j48058q1766j46406k9986l975r7834
$$ -171597 -207057 -88235 -49973 232997 399029 250971 169205 22799 -7187 -11162 -108996
8283a08996j1308O2126J6694L18211J0580K043j28971j01625n141R2427J46285
$$ -108996 -120304 -58178 -41484 276727 287307 289350 160379 58754 53613 146040 292325
8272B92325j16386m12584J31432k2166J11869r1719O0010J86326j51571m2638
$$ 292325 175939 -236645 -105213 -127379 -15510 -107229 -47219 139107 -12464 -55102
8262e5102Q7612L100l72176J6459K033J48423J13685r3951O2568o8792J30877
$$ -55102 32510 35610 -336566 -320107 -318074 -169651 -55966 -149917 -87349 -156141 -25264
8251b5264J07498j31325j36129J07900J42470j32967J60366J36300M5867k6861
$$ -25264 82234 -49091 -185220 -77320 65150 -67817 92549 228849 274716 247855
8241B47855j99067J52872N6725p1844l1786J70150j08608K7456j07400J4681j16717
$$ 247855 48788 201660 258385 186541 154755 324905 216297 243753 136353 151034 34317
8230C4317n8359M629q9238J44260J57389o854r8259j19129J05249j73243L5676
$$ 34317 -24042 -19413 -108651 35609 192998 186144 87885 -31244 74005 -99238 -63562
8219f3562J12885L2684k57422k59445J14649J83942j80063k45712L6961M8554
$$ -63562 49323 82007 -175415 -434860 -320211 -136269 -316332 -562044 -525083 -476529
8209d76529N6939J34939J69011R8693j07438J44118J43115n7218j4593j22656
$$ -476529 -419590 -284651 -115640 -16947 -124385 19733 162848 105630 91037 -31619
8199c1619j97031M3546N4367j01571J85785J9001R7770k2659N3131L1222r0930
$$ -31619 -228650 -185104 -130737 -232308 -46523 -27522 70248 47589 100720 131942 41012
8188D1012L3635N0288j20104K9862K2257J76528k3304m12730Q2470M4461p599
$$ 41012 74647 124935 4831 34693 56950 233478 210174 -202556 -120086 -75625 -83224
8177h3224Q4342J80410q524j02767J37748q4829j52395M9282N3397M5877K22230
$$ -83224 1118 181528 173004 70237 207985 123156 -29239 20043 73440 119317 341547
8166C41547O0498j59251l16249m1593R7752K49591O5774k24089j44639l4090j432
$$ 341547 402045 242794 -73455 -115048 -17296 232295 298069 73980 -70659 -104749 -106181
8155a06181n1185R7306M9655Q4859r7506J69763j08543N0734m9377j82395J96334
$$ -106181 -157366 -60060 -10405 74454 -23052 146711 38168 88902 39525 -142870 53464
8144E3464J9147j43715k24684J27052K49936J88051R582k38614j16963m8091n6478
$$ 53464 72611 -71104 -295788 -168736 81200 269251 278833 40219 -76744 -124835 -181313
8133a81313K58659J90244p6r9437j51347p0696K7071r7800J66496o5443p520J87596
$$ -181313 77346 267590 267514 168077 16730 -53966 -26895 -124695 41801 -23642 -31162 156434
8121A56434j40621j73953k13241J31086L63910K58865n0127k31940q7859K39162
$$ 156434 15813 -158140 -371381 -240295 123615 382480 332353 100413 12554 251716
8111B51716N5817L5160m8527j48030J5368j81854m9162m832L2333J61153j30136
$$ 251716 307533 342693 294166 146136 161504 -20350 -69512 -74344 -42011 119142 -10994
8100a0994J48381L28697o0063p3248k98973q1949J27083j48715j06676k4287J99710
$$ -10994 137387 466084 406021 332773 33800 -48149 78934 -69781 -176457 -200744 -1034
8089a034M9050k78222m6950N0910J08456l3398o0302L04225L09405N2316k7499
$$ -1034 48016 -230206 -277156 -226246 -117790 -151188 -211490 92735 402140 454456 426957
8078D26957l16677k98611J61453Q0757m7496p029j61826p4317M21394R1844p7455
$$ 426957 110280 -188331 -26878 53879 6383 -646 -162472 -236789 184605 276449 198994
8067A98994j520j04520j06694J9499j42900m0881J4102k7398j4529j08858K7000
$$ 198994 197474 92954 -13740 5759 -137141 -178022 -163920 -191318 -205847 -314705 -287705
8056b87705J94666L3355m4891L9308n3508Q2439N2021P8548J22832O3773j01803
$$ -287705 -93039 -59684 -104575 -65267 -118775 -36336 15685 94233 217065 280838 179035
8045A79035j17759J59769J07360j01120K32763o4142k06967K9388J71010O1869
$$ 179035 61276 221045 328405 227285 460048 395906 188939 218327 389337 451206
8035D51206n6896n4245Q7267L2305n0459j84232j21614k19606j13279J54252J53810
$$ 451206 394310 340065 427332 459637 409178 224946 103332 -116274 -229553 -75301 78509
8024G8509p7062p3466p2933J26369J76155n8488M209J47927K32700j37405j89041
$$ 78509 1447 -72019 -144952 -18583 157572 99084 103293 251220 483920 346515 157474
8013A57474R752J57673R3410j729j32537L22646L46014J10304j71035k20499k91057
$$ 157474 167226 324899 418309 416580 284043 606689 952703 1063007 891972 671473 380416
8002C80416m21347J93489J34535j17568k19908m8667Q0598J88657J55406Q4345
$$ 380416 -40931 152558 287093 169525 -50383 -99050 -18452 170205 325611 409956
7992D09956l36083j70907q7204p0320J58703j3952K36105K04339n7788j4045j31483
$$ 409956 73873 -97034 -184238 -254558 -95855 -109807 126298 330637 272849 258804 127321
7981A27321L2K50823M0307j79678J7702R6078m8009j03086k1623K8825P0575K4800
$$ 127321 127353 378176 418483 238805 256507 352585 304576 201490 179867 208692 279267 304067
7969C04067J25157J21822j19013Q6833R3574q0400J7496j69910l4088k6956J6414
$$ 304067 429224 551046 432033 518866 612440 532040 549536 379626 345538 318582 334996
7958C34996j03539J33556P8907j60764r8944L8212Q5572J45888n0016j56195J07782
$$ 334996 231457 365013 443920 283156 184212 222424 307996 453884 403868 247673 355455
7947C55455m6777l6775J09293j57993k63956M0065O3332j19486J45204L462J26265
$$ 355455 308678 271903 381196 223203 -40753 -688 62644 -56842 88362 91824 218089
7936B18089k4971j37536q330k3093k52867N849J35284K10831J07720k41546j1831
$$ 218089 193118 55582 47252 24159 -228708 -222859 -87575 123256 230976 -10570 -22401
7925b2401n4645K05378K6176J73894j11376O7641j33838J25511K271K2084k70205
$$ -22401 -77046 128332 154508 328402 217026 284667 150829 276340 278611 300695 30490
7914C0490L323J81950j4902j01757k74417j3307L21859J97031j38537n5489P5476
$$ 30490 33813 215763 200861 99104 -175313 -188620 133239 330270 191733 136244 211720
7903B11720P9883r2178j07219r2942j06082J66188J22451j33295n1688k46775
$$ 211720 291603 199425 92206 -736 -106818 59370 181821 48526 -3162 -249937
7893b49937j27102K09915M37070P1621j06547J64775n5957J43908m495l37857
$$ -249937 -377039 -167124 269946 341567 235020 399795 343838 487746 483251 145394
7883A45394P1595J56955k82672k11078j17425K04085K55922j20051q4089O5919
$$ 145394 216989 373944 91272 -119806 -237231 -33146 222776 102725 18636 84555
7873H4555M2208N3562j27759q0282o8413K73175J38690k42759j74383K02294p3241
$$ 84555 126763 180325 52566 -27716 -96129 177046 315736 72977 -101406 100888 27647
7862B7647k55641K8795J21717j48672r8929K23449L8422k121j13691N1124l6599
$$ 27647 -227994 -199199 -77482 -226154 -325083 -101634 -63212 -65333 -179024 -127900 -164499
7851a64499R0014K9893J6687M1358N6057L9561K892j73408j11170p597P522o43
$$ -164499 -74485 -44592 -27905 13453 69510 109071 111963 -61445 -172615 -180212 -172690 -173333
7839a73333o0014j09116k98608j5677J98514J36771K66564j6575j42362k9675
$$ -173333 -233347 -342463 -641071 -656748 -458234 -321463 -54899 -71474 -213836 -243511
7829b43511J45272j11155L101J98394P7274o8713K8722k60607o0204k4643J23406
$$ -243511 -98239 -209394 -206293 -7899 69375 662 29384 -231223 -291427 -316070 -192664
7818a92664M8431L08180J24255J21145n1448j73509p4103J66344J79188j23560
$$ -192664 -144233 163947 288202 409347 357899 184390 110287 276631 455819 332259
7808C32259j54767k59648q6807K04087j01399j34042p8803J44962J06448q9570
$$ 332259 177492 -82156 -168963 35124 -66275 -200317 -279120 -134158 -27710 -117280
7798a17280m799j50675j2568J50708l1143J06915J27392k55277k1855L0085J4425
$$ -117280 -122079 -272754 -285322 -134614 -165757 -58842 68550 -186727 -208582 -178497 -164072
7787a64072m5852K1392J13129J20332L1585j36265l5145j6564M3392j12324j27524
$$ -164072 -209924 -188532 -75403 44929 76514 -59751 -94896 -111460 -68068 -180392 -307916
7776c07916m5725R09J41070R6268P2602Q965J52685R9605K4770J2j43526k68546
$$ -307916 -353641 -352732 -211662 -115394 -42792 -33827 118858 218463 243233 243245 99719 -168827
7764a68827j76l6832j15778L03197J02055l30598m5254R2662j04478k4165L78063
$$ -168827 -169003 -205835 -321613 -18416 83639 -246959 -292213 -199551 -304029 -328194 49869
7753D9869J01036L3183J7926Q8970K4978K9330l22937k36574J58751n6924l24717
$$ 49869 150905 184088 202014 290984 315962 345292 22355 -214219 -55468 -112392 -437109
7742d37109K04354J98189m7738j05432p6191k05853m0226P9067j26249N7119L63009
$$ -437109 -232755 -34566 -82304 -187736 -263927 -469780 -510006 -430939 -557188 -500069 -137060
7731a37060k0444K46500J21350m3148N1261j18697j41688K02670j08003j25507
$$ -137060 -157504 88996 210346 167198 218459 99762 -41926 160744 52741 -72766
7721g2766J22615Q4439J28150N7469j65971p3441K0716O336o9531o7339q0335
$$ -72766 49849 134288 262438 319907 153936 80495 101211 107547 38016 -29323 -109658
7710a09658m0403J21465m3476k34582Q5291j30956n034N5487J97192j7072K15827
$$ -109658 -150061 -28596 -72072 -306654 -221363 -352319 -357353 -301866 -104674 -121746 94081
7699I4081r846j48038L39776j95147k01384l0555M1686j4690O8808K04545j25389
$$ 94081 84235 -63803 275973 80826 -120558 -151113 -109427 -124117 -55309 149236 23847
7688B3847j68054j07034J66678R9144j68165n9989J12389k9609J88709q9625l4505
$$ 23847 -144207 -251241 -84563 14581 -153584 -213573 -101184 -130793 57916 -31709 -66214
7677f6214O8800k8718o6749K07694o8122j47809j35528L8996R4834n1952K61099
$$ -66214 2586 -26132 -92881 114813 46691 -101118 -236646 -197650 -102816 -154768 106331
7666A06331l1228j86533O2194l1928J53539K28503j7412k33926l47169J10162
$$ 106331 75103 -111430 -49236 -81164 72375 300878 283466 49540 -297629 -187467
7656a87467K65140K15624l34099l18390k14190j52624K35588N67887j29079k61971
$$ -187467 77673 293297 -40802 -359192 -573382 -726006 -490418 77469 -51610 -313581
7646c13581J73157P788k42145r355J04373J89159K46740j49328p0944J57887N5005
$$ -313581 -140424 -132636 -374781 -384136 -279763 -90604 156136 6808 -64136 93751 148756
7635A48756R5702M5891j32047l4968j35236n4545L6114Q8606L08097J37646j55377
$$ 148756 244458 290349 158302 123334 -11902 -66447 -30333 58273 366370 504016 348639
7624C48639k13693m7955m1984q4285j54097k3556K02011J33969K33936R9979r2378
$$ 348639 134946 86991 45007 -39278 -193375 -216931 -14920 119049 352985 452964 360586
7613C60586k07658j40843m0680k0863p205p5838n4312N9272K86396n1641J7185
$$ 360586 152928 12085 -28595 -49458 -56663 -132501 -186813 -127541 158855 107214 124399
7602A24399J37593L2760k89832j57048j46572k39339r4926J48474K81099q4897
$$ 124399 261992 294752 4920 -152128 -298700 -538039 -632965 -484491 -203392 -288289
7592b88289J72498j1753J62876K71247M5895J21987q5399j23833r2978p3204k11112
$$ -288289 -115791 -127544 35332 306579 352474 474461 389062 265229 172251 99047 -112065
7581a12065J1492l04948R4818L47466Q4120j62821N3997J58658l57339k60885
$$ -112065 -100573 -405521 -310703 36763 120883 -41938 12059 170717 -186622 -447507
7571d47507J95741K420N0531L39150l3761m6972J35060j8834j28000j72887j96111
$$ -447507 -251766 -249346 -198815 140335 106574 59602 194662 175828 47828 -125059 -321170
7560c21170k91994k354J64980J94053J9993K50000K95633k6412j51576R051K4160
$$ -321170 -613164 -615518 -450538 -256485 -236492 13508 309141 282729 131153 140204 164364
7549A64364j27999j13619J16791K4785j88716q3929k9263K12223j1628j3709J57816
$$ 164364 36365 -77254 39537 64322 -124394 -208323 -237586 -25363 -36991 -50700 107116
7538A07116J00220N030N3521n704l74380j15046N3300J80446j3365R6034K5749
$$ 107116 207336 212366 265887 260183 -114197 -229243 -175943 4503 -8862 87172 112921
7527A12921j0069j31531m480p312P0660n353j47723R8769J70994l2569L8450j3084
$$ 112921 102852 -28679 -33159 -40471 30189 24836 -122887 -24118 146876 114307 152757 139673
7515A39673j1047J94488k43397j92084M4853k26203K88824K95990j25391J4290
$$ 139673 128626 323114 79717 -112367 -67514 -293717 -4893 291097 165706 179996
7505A79996k5717p7112j28711J1621j51779k75896j25241J53007K35336J13600
$$ 179996 154279 77167 -51544 -39923 -191702 -467598 -592839 -439832 -204496 -90896
7495i0896o4628j49047j7684M8209J05332J1941m9000r0578N7506J84660K8737
$$ -90896 -155524 -304571 -322255 -274046 -168714 -156773 -205773 -296351 -238845 -54185 -25448
7484b5448K55N501J38380r887k5787j3886l11848l6213j63073j7452Q2148m8241
$$ -25448 -25193 -19692 118688 108801 83014 69128 -242720 -278933 -442006 -459458 -377310 -425551
7472d25551J15050J89473K49740j33342j93666p4343J22396J43171o3922n2114
$$ -425551 -310501 -121028 128712 -4630 -198296 -272639 -150243 -7072 -70994 -123108
7462a23108K13832K77652l52299q3466J30414j27003L582J07793k18155R9517
$$ -123108 90724 368376 16077 -67389 63025 -63978 -60396 47397 -170758 -71241
7452g1241K16946k4674j51798k36015J21373P8636j77590J4732J33849J83819
$$ -71241 145705 121031 -30767 -266782 -145409 -66773 -244363 -229631 -95782 88037
7442H8037m727p0097J77132K5172J25485j59556k16250J90391K11984J13664j47429
$$ 88037 83310 13213 190345 215517 341002 181446 -34804 155587 367571 481235 333806
7431C33806p1919J32428j72234j18727J42834N8690j47477n1057j19494k33744
$$ 333806 261887 394315 222081 103354 246188 304878 157401 106344 -13150 -246894
7421b46894J60332K55577l2334j6469O1897L8137J27403j79423n3221q9850j97932
$$ -246894 -86562 169015 136681 120212 182109 220246 347649 168226 115005 25155 -172777
7410a72777N6387q6884q7175O4119L80612L0957m1007j78978J51694r5943Q5381
$$ -172777 -116390 -203274 -290449 -226330 154282 185239 144232 -34746 116948 21005 106386
7399A06386j59124k32290k14943K18369K63559j77960j05282J13868r6059J13560
$$ 106386 -52738 -285028 -499971 -281602 -18043 -196003 -301285 -187417 -283476 -169916
7389a69916j72179M2566K09802R3264J64186p3508j18724k18338L2388J70157
$$ -169916 -342095 -299529 -89727 3537 167723 94215 -24509 -242847 -210459 -40302
7379d0302r1009K8110o928k29021J24806K6054J06637J35118q6837q9667J7466
$$ -40302 -131311 -103201 -110129 -339150 -214344 -188290 -81653 53465 -33372 -123039 -105573
7368a05573J3136K67705n153j28819K6901j44239J09178K52990L5829k41106j60543
$$ -105573 -92437 175268 170115 41296 68197 -76042 33136 286126 321955 80849 -79694
7357g9694J8078J01923j6793m3143j25843o1317J68110J5099r4671K36572N0544
$$ -79694 -61616 40307 23514 -19629 -145472 -206789 -38679 -23580 -118251 118321 168865
7346A68865l1791j29488p5287Q0223K1529O3398l38045j73220J2986L0476J17624
$$ 168865 137074 7586 -67701 12522 34051 97449 -240596 -413816 -400830 -370354 -252730
7335b52730K64480k3434j87962L62054J19057K1318k98197n7601J70533O9856
$$ -252730 11750 -11684 -199646 162408 281465 302783 4586 -53015 117518 187374
7325A87374p8073j2100L1166j58754k4606J35374O137k22603r4181N8868k53384
$$ 187374 109301 97201 128367 -30387 -54993 80381 86518 -136085 -230266 -171398 -424782
7314d24782K10758J64153p069j49649p3964M4267L09190K42485P5080k34887j48266
$$ -424782 -214024 -49871 -56940 -206589 -280553 -236286 72904 315389 390469 155582 7316
7303G316k0139j25299M6405L04498J84829L7255j25597j54781j98370J24600j4647
$$ 7316 -12823 -138122 -91717 212781 397610 434865 309268 154487 -43883 80717 66070
7292F6070J62403O3015r0646j6190k7878J8760O2610k77957j51883J09158K42089
$$ 66070 228473 291488 200842 184652 156774 175534 238144 -39813 -191696 -82538 159551
7281A59551J4643j61653J48903R3091k5638o1131j06116k0762O6226n8284J31455
$$ 159551 174194 12541 161444 254535 228897 167766 61650 40888 107114 48830 180285
7270A80285K13603j60457k98797j91323K21053K30416O7707m431j70349M1404
$$ 180285 393888 233431 -65366 -256689 -35636 194780 262487 258056 87707 129111
7260A29111q5852k93034J4684j84339l0006J96102J19665L3081J70739N0472k03843
$$ 129111 43259 -249775 -235091 -419430 -449436 -253334 -133669 -100588 70151 120623 -83220
7249h3220p282J66628o4311P9158o0697M2794J13041k31194N5964Q2429J56015
$$ -83220 -90502 76126 11815 90973 30276 73070 186111 -45083 10881 93310 249325
7238B49325j13109j37924j39519k99917j99029K22748O31254J57243K1109o4519
$$ 249325 136216 -1708 -141227 -441144 -640173 -417425 213829 371072 392181 327662
7228C27662J2741k66855q7398m8660Q3276L19772k449l8546k15346k07335J1966
$$ 327662 340403 73548 -13850 -62510 20766 340538 338089 299543 84197 -123138 -111172
7217a11172J0452l4372P8447k7558J3407J18025R8926k15640j3885K621J28720
$$ -111172 -100720 -135092 -56645 -84203 -70796 47229 146155 -69485 -83370 -80749 47971
7206D7971j86443q5007K37755L43668l6772M2328m9877q6802r585q9669J1518
$$ 47971 -138472 -223479 14276 357944 321172 363500 313623 226821 217236 127567 139085
7195A39085r2352k67606K28937l2724k15736R5078r1141k69629P1323K77587J01321
$$ 139085 46733 -220873 8064 -24660 -240396 -145318 -236459 -506088 -434765 -157178 -55857
7184e5857J64240M1328m6950J25086J1856l2010r3505m6832r3151r8230j5490
$$ -55857 108383 149711 102761 227847 239703 207693 114188 67356 -25795 -124025 -139515
7173a39515k7878o5377J44625K22000M6965J6317j22787N1205M4712l27329k94905
$$ -139515 -167393 -232770 -88145 133855 180820 197137 74350 125555 170267 -157062 -451967
7162d51967m3627M38025P8984l04177k24016j80095J64378M24420L5102K16040
$$ -451967 -495594 -57569 21415 -282762 -506778 -686873 -522495 -98075 -62973 153067
7152A53067o521n4157k90169J0038K8057l0744J23078J36859P4237j57345J7222
$$ 153067 146546 92389 -197780 -187742 -159685 -190429 -67351 69508 143745 -13600 3622
7141C622N1193l7029K9018L9772k20841O4380P5995j36192j06124Q3195k3639
$$ 3622 54815 17786 46804 86576 -134265 -69885 6110 -130082 -236206 -153011 -176650
7130a76650J30892O2608j34259j05365O2037K5909k9699K45109J20187R7902k1785
$$ -176650 -45758 16850 -117409 -222774 -160737 -134828 -164527 80582 200769 298671 276886
7119B76886M7785r6376j33129R429J03844K03364R5039j46989j68855o5468M2574
$$ 276886 324671 228295 95166 104595 208439 411803 506842 359853 190998 125530 168104
7108A68104j2116j04499J17014l3366P4126N4594L0540l01090k49353J68281m9052
$$ 168104 155988 51489 168503 135137 209263 263857 294397 -6693 -256046 -87765 -136817
7097a36817p8881j25555j35194M6726Q9505Q5384p546J94438M1287r6547l485
$$ -136817 -215698 -341253 -476447 -429721 -340216 -254832 -262378 -67940 -26653 -123200 -126685
7086a26685K55310J79898m2856O7705J63920K7503k58105k48307K559K81114J37671
$$ -126685 128625 308523 265667 333372 497292 524795 266690 18383 20942 302056 439727
7075D39727j32321l24848r0502J80706K1617o7298j75296K4896K40265j68570
$$ 439727 307406 -17442 -107944 72762 94379 27081 -148215 -123319 116946 -51624
7065e1624n0204J15502j50551K7106r3518q8167m0883K63621J27826k02650q8869
$$ -51624 -101828 13674 -136877 -109771 -203289 -291456 -332339 -68718 59108 -143542 -232411
7054b32411j00679j00373j29808J79924K2803J19619k0556L83979l0394l04441
$$ -232411 -333090 -433463 -563271 -383347 -360544 -240925 -261481 122498 92104 -212337
7044b12337Q7973J27379R5520M6326L5373N285k0711L626L5218j94033p3037m3279
$$ -212337 -124364 3015 98535 144861 180234 185519 164808 168434 203652 9619 -63418 -106697
7032a06697j27891j7573J38742j05733j7683P9381J44057J16151j55418O4518
$$ -106697 -234588 -252161 -113419 -219152 -236835 -157454 -13397 102754 -52664 11854
7022A1854P6456k6435J43429j71055k82881P0490P7928j11523j49572J92376K3659
$$ 11854 88310 61875 205304 34249 -248632 -178142 -100214 -211737 -361309 -168933 -145274
7011a45274K09899L1028j3222j0090K4787J83032j25943J11436r5899j82117j04151
$$ -145274 64625 95653 82431 72341 97128 280160 154217 265653 169754 -12363 -116514
7000a16514j2567m4822j25027K11952J68063j16446Q6525N3010P306K46552O6421
$$ -116514 -129081 -173903 -298930 -86978 81085 -35361 51164 104174 111480 358032 424453
6989D24453p8407k85015k55050K06060K09954k47691j00298n0631k5765O4285
$$ 424453 346046 61031 -194019 12041 221995 -25696 -125994 -176625 -202390 -138105
6979a38105K26634O6218N0996l6243m16436J56406j03092j31008J4940N0831K11486
$$ -138105 88529 154747 205743 169500 -246936 -90530 -193622 -324630 -309690 -258859 -47373
6968d7373J73484J32812m1647j20104j56491j68116q3795J34991L08187K65869
$$ -47373 126111 258923 217276 97172 -59319 -227435 -311230 -176239 131948 397817
6958C97817K04699J31253j17524j65252k53739k3020q1748p0274J4196j05389
$$ 397817 602516 733769 616245 450993 197254 174234 92486 22212 36408 -68981
6948f8981J07906O1102K8687N5089N0862r5976j56196J20711q3662j42444j6550
$$ -68981 38925 100027 128714 183803 234665 138689 -17507 103204 19542 -122902 -139452
6937a39452J88130K4902Q225m7263j93413j00281Q4692J2168k09027L36205M27962
$$ -139452 48678 73580 81805 34542 -158871 -259152 -174460 -162292 -371319 -35114 392848
6926C92848n7712j0256l7528k07675l7638N0394j22227J70528o505j79426p6867
$$ 392848 335136 324880 287352 79677 42039 92433 -29794 140734 134229 -45197 -122064
6915a22064l6004J43081L5806m8999K034K4473J159J03206j9432l73259J38589
$$ -122064 -158068 -14987 20819 -28180 -26146 -1673 -514 102692 83260 -289999 -151410
6904a51410K15821p6327n9557l67616k00497J87970J89485l5237P3241Q9637R7019
$$ -151410 64411 -11916 -71473 -439089 -639586 -451616 -262131 -297368 -224127 -134490 -37471
6893c7471o7604J96715J46210J55220j0712j62085J773J76941j79466k19037k27771
$$ -37471 -105075 91640 237850 393070 382358 220273 222046 398987 219521 484 -227287
6882b27287J24511J38706r0371j66635l4059p750L73443M9111j08603P34j30862
$$ -227287 -102776 35930 -54441 -221076 -255135 -262885 110558 159669 51066 51800 -79062
6871g9062N9923K64642J8770n4730J21061j92457k22639J20848O8559j65202R9830
$$ -79062 -19139 245503 264273 209543 330604 138147 -84492 36356 104915 -60287 39543
6860C9543J48559r350R9807J39479j15507k90201j38078r3580j15467m909K52092
$$ 39543 188102 178752 278559 418038 302531 12330 -125748 -219328 -334795 -339704 -87612
6849h7612J15203l7022m7661K16027m09019k04975J08459K47569K17838L5789
$$ -87612 27591 -9431 -57092 158935 -250084 -455059 -346600 -99031 118807 154596
6839A54596j31484q9389J47107k671j64032k75585L2466J61453K22417P8322j56816
$$ 154596 23112 -66277 80830 78159 -85873 -361458 -328992 -167539 54878 133200 -23616
6828b3616M1911M7820l6748r3252K2901p1899R1952J61446K62546k63419o9153
$$ -23616 18295 66115 29367 -63885 -40984 -112883 -20931 140515 403061 139642 70489
6817G0489k8058j59621R2341p4288O387j18242j47724J32383Q6067n4759K58342
$$ 70489 42431 -117190 -24849 -99137 -92750 -210992 -358716 -226333 -140266 -195025 63317
6806F3317J17644K68707K7965p2576m25006j83717P8036J29075j65346q6370J50453
$$ 63317 180961 449668 477633 405057 -19949 -203666 -125630 3445 -161901 -248271 -97818
6795i7818K08012m4437J80230J38321j75772j49259j07391J2395r9064j43324
$$ -97818 110194 65757 245987 384308 208536 59277 -48114 -35719 -134783 -278107
6785b78107K7104j23222R4025J51817K4312K40552P2691J61667K93997k02344
$$ -278107 -251003 -374225 -280200 -128383 -104071 136481 209172 370839 664836 462492
6775D62492j39387k20005Q484L7884K3588j23671Q0257K04064M0924j99019j9807
$$ 462492 323105 103100 111584 149468 173056 49385 129642 333706 374630 175611 155804
6764A55804J63151L30l65565j43630j27907p8859K99724L38249k23702j79324
$$ 155804 318955 319285 -46280 -189910 -317817 -396676 -96952 241297 17595 -161729
6754a61729P0339j19294j66860Q7153p6238j27600J9127j4909J35756L46364J15144
$$ -161729 -91390 -210684 -377544 -290391 -366629 -494229 -475102 -490011 -354255 -7891 107253
6743A07253j06999j59260j9928L3280K27109k1743p8588J995k9569n9867L4137
$$ 107253 254 -159006 -178934 -145654 81455 59712 -18876 -16881 -46450 -106317 -72180
6732g2180O7603k24980M998Q6700J00876r9908R3311p4566J03272r8449J95889
$$ -72180 -4577 -229557 -224559 -137859 -36983 -136891 -43580 -118146 -14874 -113323 82566
6721H2566K7556j16807O2537O8680p7012j80769r1979m6604j36840j5344K69485
$$ 82566 110122 -6685 55852 124532 47520 -133249 -225228 -271832 -408672 -424016 -154531
6710a54531M07138O4097j04729J01687Q6694j94231K1886k4435k60441j35943
$$ -154531 252607 316704 211975 313662 400356 206125 228011 203576 -56865 -192808
6700a92808N0579j6718j75314N106J58817J88656K11479K5137l3998j00891K00972
$$ -192808 -142229 -158947 -334261 -329155 -170338 18318 229797 254934 220936 120045 321017
6689C21017R4604r8946k39945j56449q9034J11884J11509k17505o9942K3084r0632
$$ 321017 415621 316675 76730 -79719 -168753 -56869 54640 -162865 -232807 -209723 -300355
6678c00355J33472Q8016J3414l8090J32443J87484j82626l1067J1350r562j95623
$$ -300355 -166883 -78867 -65453 -103543 28900 216384 33758 2691 14041 4479 -191144
6667a91144K9562L7491j8506P1547j17082K62428J1821k38773R1135Q3121K17656
$$ -191144 -161582 -124091 -142597 -71050 -188132 74296 86117 -152656 -61521 21600 239256
6656B39256O4018j24647j41134R3618j09713J60844l2520M0465p2686j85498j10484
$$ 239256 303274 178627 37493 131111 21398 182242 149722 190187 117501 -67997 -178481
6645a78481q735J68255j24602j54132q3800K10329K55683R0557k8750m5981J63233
$$ -178481 -187216 -18961 -143563 -297695 -381495 -171166 84517 175074 146324 100343 263576
6634B63576P5148m7192j15934k26026p1201o4206J29374J87342R6473l7842l6023
$$ 263576 338724 291532 175598 -50428 -121629 -185835 -56461 130881 227354 189512 153489
6623A53489r605R8913J31169q4464l55534j63230J31677j24778R138R3878J04167
$$ 153489 143884 242797 373966 289502 -66032 -229262 -97585 -222363 -213225 -119347 -15180
6612a5180j96230J10779J63245j73094k65831l5441j39595M9160J9890R7292O237
$$ -15180 -211410 -100631 62614 -110480 -376311 -411752 -551347 -502187 -482297 -385005 -378768
6601c78768l4971K18990L11328Q9184q4380J86001j85810k93969k56684k6745
$$ -378768 -413739 -194749 116579 205763 121383 307384 121574 -172395 -429079 -455824
6591d55824J95199J94715M6114J6314L3626j62551J18011p5963J61421L3431Q7314
$$ -455824 -260625 -65910 -19796 -3482 30144 -132407 -14396 -90359 71062 104493 191807
6580A91807m5200k31297K958j32239K845J95282L8290j8965j496m1275o2713J29592
$$ 191807 146607 -84690 -81732 -213971 -211126 -15844 22446 3481 1985 -39290 -102003 27589
6568B7589L4845J53442j74632q0260L1437O0220j27082j58276j13275K55618K11583
$$ 27589 62434 215876 41244 -39016 -7579 52641 -74441 -232717 -345992 -90374 121209
6557A21209q2800n0712j59736l92798J54504K90028R4575n4539J54881j07381
$$ 121209 38409 -12303 -172039 -564837 -410333 -120305 -25730 -80269 74612 -32769
6547c2769j93724J88194J52573J35284o0560n6408n0241J86853L4587k44079k5878
$$ -32769 -226493 -38299 114274 249558 188998 132590 82349 269202 303789 59710 33832
6536C3832N7334K59865O0095J66442m21611k23282P2585k30459j77188J89968
$$ 33832 91166 351031 411126 577568 155957 -67325 5260 -225199 -402387 -212419
6526b12419N2230P1470J18012N2455J17890k8068r6613j60810q0635P7002k33
$$ -212419 -160189 -88719 29293 81748 199638 171570 74957 -85853 -166488 -89486 -89719
6515h9719K39953K27820O6803o3838N7142n0332j57300o0417j37560p5827J77548
$$ -89719 150234 378054 444857 381019 438161 387829 230529 170112 32552 -43275 134273
6504A34273L8099j24688K23758K73652j75552k32833j30264k38539k22845K29508
$$ 134273 172372 47684 271442 545094 369542 136709 6445 -232094 -454939 -225431
6494b25431K88349L22455P7739k76820J22726K52548j59818j50876j28599j07325
$$ -225431 62918 385373 463112 186292 309018 561566 401748 250872 122273 14948
6484A4948N1252j72897j40083R0892J59539L21603j13056k03800j05724j79142
$$ 14948 66200 -106697 -246780 -155888 3651 325254 212198 8398 -97326 -276468
6474b76468P052r857J47850k53810n6381J03706j2799J32198M8156l8850M2053
$$ -276468 -269416 -279273 -131423 -385233 -441614 -337908 -350707 -218509 -170353 -209203 -167150
6463a67150L25728P7004p318O720m22015K6016J81631K65650J4110o2210j45854
$$ -167150 158578 235582 228264 234984 -187031 -161015 20616 286266 300376 238166 92312
6452I2312k84771L9870l3191j93080k1455L12318P3509J75408J5359K039k8754
$$ 92312 -192459 -152589 -185780 -378860 -400315 -87997 -14488 160920 176279 178318 149564
6441A49564j38217J88518J39232J75514m547k31406K8239j27175j17319O4900
$$ 149564 11347 199865 339097 514611 510064 278658 306897 179722 62403 127303
6431A27303J9156k34631Q9100N3246q9826j50964p7757o7429J95232J48730N9499
$$ 127303 146459 -88172 928 54174 -35652 -186616 -264373 -331802 -136570 12160 71659
6420G1659J56092K03574j30171l10479Q835K3996j07064P2408J75077R9346j93736
$$ 71659 227751 431325 301154 -9325 -490 23506 -83558 -11150 163927 263273 69537
6409F9537P245J63684j3331P7450j29497j93408J37325N3317j75877K4779j24931
$$ 69537 76782 240466 227135 304585 175088 -18320 119005 172322 -3555 21224 -103707
6398a03707m9719K23177n9351j20269o3774K1533J58662j44900q7013L4449J87746
$$ -103707 -153426 69751 10400 -109869 -173643 -152110 6552 -138348 -225361 -190912 -3166
6387c166K6876l0783k3742R7529N8475M7321R3168j31888q401L6570j85476j46334
$$ -3166 23710 -7073 -30815 66714 125189 172510 265678 133790 125389 161959 -23517 -169851
6375a69851j84325j21873K37296J40356j6862j11958R1462j72440o9869K59974
$$ -169851 -354176 -476049 -238753 -98397 -115259 -227217 -135755 -308195 -378064 -118090
6365a18090q0635l76547k3157K19998J56740J71969l7318j49768j39l6496R5512
$$ -118090 -198725 -575272 -598429 -378431 -221691 -49722 -87040 -236808 -236947 -273443 -177931
6354a77931j628j73084j87169J92005P7778N2492P6254J17342k9204J43538J41652
$$ -177931 -179559 -352643 -539812 -347807 -270029 -217537 -141283 -23941 -53145 90393 232045
6343B32045N3599K991n0252q0271j15127j35873L5660K45641J12622O477j0384
$$ 232045 285644 288635 238383 158112 42985 -92888 -57228 188413 301035 307512 297128
6332B97128k13910k45908N4725Q0343j48681j29998j050J25198J16401J08194
$$ 297128 83218 -162690 -107965 -27622 -176303 -306301 -307351 -182153 -65752 42442
6322D2442j209r295p1616R7788J9843j63758p1999m9249K3224K06272J89599k5811
$$ 42442 41233 31938 -39678 58110 77953 -85805 -157804 -207053 -183829 22443 212042 186231
6310A86231j24637o498K19871k413p3063j8829j31290N1595n3958k6422J09949
$$ 186231 61594 55096 274967 272554 199491 180662 49372 100967 47009 20587 130536
6299A30536j65654J92906L54443j75120j94508n5312n5268J10479Q6280k5390
$$ 130536 -35118 157788 512231 337111 142603 87291 32023 142502 228782 203392
6289B03392k12709j22421P7520k5314J632q8193k15462R8613J85736k4105j05710
$$ 203392 -9317 -131738 -54218 -79532 -77900 -166093 -381555 -282942 -97206 -121311 -227021
6278b27021l873J60343K04872j68095j33393M1449o8114l79821J3259K00943L7877
$$ -227021 -230894 -70551 134321 -33774 -167167 -125718 -193832 -573653 -560394 -359451 -321574
6267c21574n4825J63575L49893K53812m5053j20975k47177k10468j36626L622
$$ -321574 -376399 -212824 137069 390881 345828 224853 -22324 -232792 -369418 -365796
6257c65796K13159M71000K7429r9688q7820j57729k30145l6631J28624J34697
$$ -365796 -152637 318363 345792 246104 158284 555 -229590 -266221 -137597 -2900
6247b900P7693n1752k31279j58592L3740L4715L79834P4901j08902j51112j51449
$$ -2900 74793 23041 -208238 -366830 -333090 -298375 81459 156360 47458 -103654 -255103
6236b55103O3480J49592P7437l119j05166J34453J50443k23175q7681J52497j64969
$$ -255103 -191623 -42031 35406 32287 -72879 61574 212017 -11158 -98839 53658 -111311
6225a11311K5937K89148n8683M544k4422J92947j258l672O859j63045J21427L15137
$$ -111311 -85374 203774 145091 149635 125213 318160 316902 313230 320089 157044 278471 593608
6213E93608k16725n1377L2445J96730L0225m84969n79463N7297K40915k9228k69427
$$ 593608 376883 325506 357951 554681 584906 99937 -479526 -422229 -181314 -210542 -479969
6202d79969J12418J96633K70670p5397q0236m7081M9309L8912K11976o2873k02103
$$ -479969 -367551 -170918 99752 24355 -55881 -102962 -53653 -14741 197235 134362 -67741
6191f7741l7003o9051k07347j32656L90293j43604J67947K41889p6385Q941J44763
$$ -67741 -104744 -173795 -381142 -513798 -123505 -267109 -99162 142727 66342 75283 220046
6180B20046r493j28102k83533J97569R7910n3043j7510j8865K8301n4045M1511
$$ 220046 210553 82451 -201082 -3513 94397 41354 23844 4979 33280 -20765 20746
6169B0746Q5158j1649r571R4029p7184R2792k45221j66375r11K04660j4941j55487
$$ 20746 105904 94255 84684 178713 101529 194321 -50900 -217275 -218186 -13526 -28467 -183954
6157a83954M9899j03309q0274j90181K02967L9077j1647L43822L18613l1014k50858
$$ -183954 -134055 -237364 -317638 -507819 -304852 -265775 -277422 66400 385013 353999 103141
6146A03141l35180p5818K01751K05071l6222p4949l7658j19657Q5450K4788j29436
$$ 103141 -232039 -307857 -106106 98965 62743 -12206 -49864 -169521 -84071 -59283 -188719
6135a88719K7420j6747K39923N39m9465M6407n0376l799R7193j43387r7492o3163
$$ -188719 -161299 -178046 61877 62416 12951 59358 8982 5183 102376 -41011 -138503 -201666
6123b01666o67j1344o1555j2572J24264j31276m8410N0479K38570K35885J20510
$$ -201666 -202333 -213677 -275232 -287804 -163540 -294816 -343226 -292747 -54177 181708 302218
6112C02218k68385l9077J59234j70445j57667p8138o8278J80003K54008p1120
$$ 302218 33833 -5244 153990 -16455 -174122 -252260 -320538 -140535 113473 42353
6102D2353k48130j56855q8947J94186K28913J02253K54566J59573j74437l06752
$$ 42353 -205777 -362632 -451579 -257393 -28480 73773 328339 487912 313475 6723
6092F723K36529J6608k24086N4889j2224N1793j2927j12425J48566p9976k19794
$$ 6723 243252 259860 35774 90663 78439 130232 117305 4880 153446 73470 -146324
6081a46324k22513J96881K98479r3742J37737K95133k90610l09175l39053k9681
$$ -146324 -368837 -171956 126523 32781 170518 465651 175041 -134134 -473187 -502868
6071e02868J4756k3169J32225J01782L08542K64222k49315L37L24230j23953j71891
$$ -502868 -488112 -511281 -379056 -277274 31268 295490 46175 46512 370742 246789 74898
6060G4898k4941l66188j01136L30704K268K7031k0057k67594N8794j5301J32129
$$ 74898 49957 -316231 -417367 -86663 -84395 -57364 -77421 -345015 -286221 -301522 -169393
6049a69393O3159J25235J24172N9727J38144q1043l10601j14654k16592j0966
$$ -169393 -106234 19001 143173 202900 341044 260001 -50600 -165254 -381846 -392812
6039c92812J89810J29880R1903O2621j22981r6913Q5286j06919l9643O3861L41373
$$ -392812 -203002 -73122 18781 81402 -41579 -138492 -53206 -160125 -199768 -135907 205466
6028B05466R3910k29301j51176J604p4354J8881n4901J42714r4553m7716k09203
$$ 205466 299376 70075 -81101 -79497 -153851 -134970 -189871 -47157 -141710 -189426 -398629
6017c98629q9687J27338J80277P7691j38764K7180J07438p9238J92176K04763
$$ -398629 -488316 -360978 -180701 -103010 -241774 -214594 -107156 -186394 5782 210545
6007B10545j08477n7075J37356k00602l7805O4075P9380J919q0348j23598J472
$$ 210545 102068 44993 182349 -18253 -56058 8017 87397 89316 8968 -114630 -113158
5996a13158L9370m4606j60033n8782m8734K44755m9118o9904K42456k36785j60386
$$ -113158 -73788 -118394 -278427 -337209 -385943 -141188 -190306 -260210 -17754 -254539 -414925
5985d14925M2918k18528q5666N7371K99704l226L81560K36423o5458l22227l3749
$$ -414925 -372007 -590535 -676201 -618830 -319126 -322352 59208 295631 230173 -92054 -125803
5974a25803n7736j88104j48690J88709J25376K54084J50838M058k29312q8010
$$ -125803 -183539 -371643 -520333 -331624 -206248 47836 198674 202732 -26580 -114590
5964a14590k0238j17160n3722J83570O2635K24177k12482j70350j51336J66853
$$ -114590 -134828 -251988 -305710 -122140 -59505 164672 -47810 -218160 -369496 -202643
5954b02643K51393K15298k18075k16151l0613L6925J40471n5468J7122j7060p1319
$$ -202643 48750 264048 45973 -170178 -200791 -163866 -23395 -78863 -61741 -78801 -150120
5943a50120j05026P3360O4774o1389K05773o4726p2899p922K8371j70709J54535
$$ -150120 -255146 -181786 -117012 -178401 27372 -37354 -110253 -118175 -89804 -260513 -105978
5932a05978J49296j94550p0959J10048L7112J70867L53866J22856j74525q5704
$$ -105978 43318 -151232 -222191 -112143 -75031 95836 449702 572558 398033 312329
5922C12329q2187j37927k15302J82661K2753p9398r9614J96522K69341K0702k25482
$$ 312329 230142 92215 -123087 59574 82327 2929 -96685 99837 369178 389880 164398
5911A64398q7184n6058l3420j54998P2446J10220J67418l01246j43507p0810p06
$$ 164398 77214 21156 -12264 -167262 -94816 15404 182822 -118424 -261931 -332741 -333447
5900c33447K38225P5772R5435j59439j59450J03751L0484k2987K01298M12316
$$ -333447 -95222 -19450 75985 -83454 -242904 -139153 -108669 -131656 69642 481958
5890D81958Q683j68103o5496k00092j04123k28642q8800R6578K01664K23464J35087
$$ 481958 490641 322538 257042 56950 -47173 -275815 -364615 -268037 -66373 157091 292178
5879B92178J0152p771n5119K9785k5126k41288k42320J06267J66434k64278r806
$$ 292178 302330 294559 239440 269225 244099 2811 -239509 -133242 33192 -231086 -240892
5868b40892L18756K82519K12499l59043q3169j68566n8766K33630O5447k9326
$$ -240892 77864 360383 572882 213839 130670 -37896 -96662 136968 202415 173089
5858A73089j59391L457p6940J25718R3185j14302j27924j54364P7919O3327J23496
$$ 173089 13698 17155 -59785 65933 159118 44816 -83108 -237472 -159553 -96226 27270
5847B7270O1242m727N0645j30621k3332M0626r4030J53936J13593j63774j70664
$$ 27270 88512 83785 134430 3809 -19523 21103 -72927 81009 194602 30828 -139836
5836a39836J05072K10184J60677m0549k11473k23067m2812K4147M1N4041K0246
$$ -139836 -34764 175420 336097 295548 84075 -138992 -181804 -157657 -157616 -103575 -83329
5825h3329K01223l4892j80027k55609J14887L35320M2795Q1534R0992R0115j04344
$$ -83329 117894 83002 -97025 -352634 -237747 97573 140368 221902 312894 403009 298665
5814B98665k51310r3278k21953P2505J66703J60671Q7919P8685j39875k43150
$$ 298665 47355 -45923 -267876 -195371 -28668 132003 219922 298607 158732 -84418
5804h4418j24095J23500K1015j59188J23388K91302M3833j81592j12535N6765
$$ -84418 -208513 -85013 -63998 -223186 -99798 191504 235337 53745 -58790 -2025
5794b025L4851p9422j23143L0939j3834J2167J28424J26824Q4266j14834k22269
$$ -2025 32826 -46596 -169739 -138800 -152634 -140467 -12043 114781 199047 84213 -138056
5783a38056o6862m0982K26853K65311J18122j21082l30815m3826J86251J14778
$$ -138056 -204918 -245900 -19047 246264 364386 243304 -87511 -131337 54914 169692
5773A69692j41417j30267j34271J52078R3996k2212l21P3133N5168j2592n4621
$$ 169692 28275 -101992 -236263 -84185 9811 -12401 -12722 60411 115579 102987 48366
5762D8366p3275M496j05177k65215J5885j03259J68174R4208O9595J00642J11179
$$ 48366 -24909 -20413 -125590 -390805 -374920 -478179 -310005 -215797 -146202 -45560 65619
5751F5619k08833l12505j22268J27974R0138P3134K6405M2648J986j38319k45936
$$ 65619 -143214 -455719 -577987 -450013 -359875 -286741 -260336 -217688 -215702 -354021 -599957
5740e99957J01761L10231k1358J48953K83999L9625k61618k4041K44355K2633
$$ -599957 -498196 -187965 -209323 -60370 223629 263254 1636 -22405 221950 244583
5730B44583j54404l25487j41011l5089J47215K63377L02324k56793l45647K09873
$$ 244583 90179 -235308 -376319 -411408 -264193 -816 301508 44715 -300932 -91059
5720i1059L51716M6862m88796R7188K38281Q8337j24695O824j08534J48351K12349
$$ -91059 260657 307519 -181277 -84089 154192 242529 117834 124658 16124 164475 376824
5709C76824J6306j64135O343J78913M0486j31115o5458j56073l42051K9412K21191
$$ 376824 393130 228995 235338 414251 454737 323622 258164 102091 -239960 -210548 10643
5698A0643k96040j13709J64019L10895j1169N6556k2479m07428J14752J02595
$$ 10643 -285397 -399106 -235087 75808 64639 121195 98716 -308712 -193960 -91365
5688i1365k41128j2095K01976J38230O7411k2323K33773K21944l12040l63368
$$ -91365 -332493 -344588 -142612 -4382 63029 40706 274479 496423 184383 -178985
5678a78985J77403K48848p9026m59494j24273J69476o7864O5095K03053M5855
$$ -178985 -1582 247266 168240 -291254 -415527 -246051 -313915 -248820 -45767 88
5668H8K63001J37124q5091m58867p9413q5398k5894R3229J80334J41659q8320
$$ 88 263089 400213 315122 -143745 -223158 -308556 -334450 -241221 -60887 80772 -7548
5657g548r2206j43593p0138J35537J22988j40219O5971j3675j04104Q9421l5934
$$ -7548 -99754 -243347 -313485 -177948 -54960 -195179 -129208 -142883 -246987 -157566 -193500
5646a93500J68808J88454r5106k45280k40180o6858N1109j3735J023m8070J41368
$$ -193500 -24692 163762 68656 -176624 -416804 -483662 -432553 -446288 -445265 -493335 -351967
5635c51967l1712r029J40378J27416q7149O07q6520j39562n8578K08830O9510
$$ -351967 -383679 -392708 -252330 -124914 -212063 -211456 -297976 -437538 -496116 -287286 -217776
5624b17776M9868n8989Q418p8256j17963J00359M4333j23133L4182J66950P5146
$$ -217776 -167908 -226897 -218479 -296735 -414698 -314339 -270006 -393139 -358957 -192007 -116861
5613a16861O3202k2666n2753K5813J47528L5413o9220J27345k9969n969p532p3265
$$ -116861 -53659 -76325 -129078 -103265 44263 79676 10456 137801 107832 101863 94331 21066
5601B1066j4236J86787k2432p1837k95631j57851J56240J54980P7675N8157L7496
$$ 21066 6830 193617 171185 99348 -196283 -354134 -197894 -42914 34761 92918 130414
5590A30414l7418m5922k1527k07044J32473J79065j19085l38069q8044K3966K29319
$$ 130414 92996 47074 25547 -181497 -49024 130041 10956 -327113 -415157 -391191 -161872
5579a61872K29311m2119J0463o1829R0434o937R326L769j00588K7336k21264j63479
$$ -161872 67439 25320 35783 -26046 64388 57451 66777 70546 -30042 -2706 -223970 -387449
5567c87449P9212K05484M4246M6322p753K421m4001m4030j33122J7304J55854
$$ -387449 -308237 -102753 -58507 -12185 -19938 -17517 -61518 -105548 -238670 -221366 -65512
5556f5512M1793R9336R7587o0186m2422P8786j06989j22540J13055J28406J7484
$$ -65512 -23719 75617 173204 113018 70596 149382 42393 -80147 32908 161314 178798
5545A78798R0983N9238j62003l25883j01177J49942r965n4648k26123r1269n5174
$$ 178798 269781 329019 167016 -158867 -260044 -110102 -120067 -174715 -400838 -492107 -547281
5534e47281Q4508K20852J18371N4037J300r8630n7746n8321J21874J09821J65499
$$ -547281 -462773 -241921 -123550 -69513 -68213 -166843 -224589 -282910 -161036 -51215 114284
5523A14284J5585M8074P5424k08043j32580J39650J49875L5484o3620m5649L0870
$$ 114284 129869 177943 253367 45324 -87256 52394 202269 237753 174133 128484 159354
5512A59354Q0153J24890K9829j3801j17735j25387j21840q7083O7796J46784K90672
$$ 159354 239507 364397 394226 380425 262690 137303 15463 -71620 -3824 142960 433632
5501D33632M07851l33521l63032j4399j33037J766L5129k5487r7425k04721J11811
$$ 433632 841483 507962 144930 130531 -2506 -740 34389 8902 -88523 -293244 -181433
5490a81433P9109M38748L57974k29831r5690j64461n7553m3430j47528K00163
$$ -181433 -102324 336424 694398 464567 368877 204416 146863 103433 -44095 156068
5480A56068L39615P6324q2508j32499k98192j61864M1498J63040j13191k23675
$$ 156068 495683 572007 489499 357000 58808 -103056 -61558 101482 -11709 -235384
5470b35384q884P6430R9336J10543j19953m9111n172J51716J84878J06118k48430
$$ -235384 -244268 -167838 -68502 42041 -77912 -127023 -132195 19521 204399 310517 62087
5459F2087l4885J18435M792j56521j22157k01586q8924l2322K46978L5149j68667
$$ 62087 27202 145637 150429 -6092 -128249 -329835 -418759 -451081 -204103 -168954 -337621
5448c37621J78554J47199J44276N1576J12140K57118R3542k39669l12168O7855
$$ -337621 -159067 -11868 132408 183984 296124 553242 646784 407115 94947 162802
5438A62802M4557J25150k0984R547j11687j4580m1840k7556l8830p5785j34286
$$ 162802 207359 332509 311525 321072 209385 194805 152965 125409 86579 10794 -123492
5427a23492K016j25473J63140M6470Q7683o5440J4113J85543K0298p8984n947
$$ -123492 -121476 -246949 -83809 -37339 50344 -15096 -983 184560 204858 125874 119927
5416A19927j16307p441J52138r0166j27128n1066j3193J06252Q9015O6378l987
$$ 119927 3620 -3821 148317 58151 -68977 -120043 -133236 -26984 62031 128409 124422
5405A24422K8181J78411j67220k35252J44578q8996J11596J32516k769o0104j48919
$$ 124422 152603 331014 163794 -71458 73120 -15876 95720 228236 225467 165363 16444
5394A6444j61841j17150P3458K59144q1462k59195K386l5814j67079J39382Q7519
$$ 16444 -145397 -262547 -189089 70055 -11407 -270602 -268216 -304030 -471109 -331727 -244208
5383b44208J8062K03250n949L9298O8788o4361j06096O5694J89408j40508m8906
$$ -244208 -226146 -22896 -28845 10453 79241 14880 -91216 -25522 163886 23378 -25528
5372b5528q3185J57823L8573j26111L6044l0674j39259L9690R5613o5994n0820
$$ -25528 -108713 49110 87683 -38428 -2384 -33058 -172317 -132627 -37014 -103008 -153828
5361a53828n4607j88362J69056M8571j74063m6189N0449J0731j27541k0524J36466
$$ -153828 -208435 -396797 -227741 -179170 -353233 -399422 -348973 -338242 -465783 -486307 -349841
5350c49841J28501J48990N1773j1597J14478L8644J30641Q0724m3019n3508M5338
$$ -349841 -221340 -72350 -20577 -32174 82304 120948 251589 332313 289294 235786 281124
5339B81124K90692r3877k81667j41258R2906J07741j9854j22090M2818K71089
$$ 281124 571816 477939 196272 55014 147920 255661 235807 113717 156535 427624
5329D27624J25931j22787n6671P7327k17706L8844J29707k05140k84883L2893
$$ 427624 553555 430768 374097 451424 233718 272562 402269 197129 -87754 -54861
5319e4861K6326j04965P7720k22461J11538K58267r7921n353K84445l7512R2907
$$ -54861 -28535 -133500 -55780 -278241 -166703 91564 -6357 -11710 272735 235223 328130
5308C28130j56109k18398n7393J10762K22246j68496k46960q9164J538J71255
$$ 328130 172021 -46377 -103770 6992 229238 60742 -186218 -275382 -273844 -102589
5298a02589P2154K58368Q4424R1926M7054j93123q9627L381k0489j30207N4283
$$ -102589 -30435 227933 312357 404283 451337 258214 168587 171968 151479 21272 75555
5287G5555K0166Q4667p7932N9231J89260l41345Q4034Q9655J09195o6724J67461
$$ 75555 95721 180388 102456 161687 350947 9602 93636 183291 292486 225762 393223
5276C93223N6656j83556j51052j58640K8637J4008J5421J37625J14649j29267
$$ 393223 449879 266323 115271 -43369 -14732 -724 14697 152322 266971 137704
5266A37704j72335l19427q1290J93168J26243Q9059k51045l4663J8240J79540
$$ 137704 -34631 -354058 -435348 -242180 -115937 -26878 -277923 -312586 -294346 -114806
5256a14806M7924Q6476q5729l8487J92182K5347j09083p8655J46149p7409j2920
$$ -114806 -66882 19594 -66135 -104622 87560 112907 3824 -74831 71318 -6091 -19011
$$ [...]
##END NTUPLES=NMR SPECTRUM
##END=
