##TITLE=Analysis number 319607
Compound Code cc 26746
Book Reference 449/94
Project Code adrs
Chemist Name davee
##JCAMPDX= 6.0         $$ Bruker NMR JCAMP-DX V2.0
##DATA TYPE= NMR SPECTRUM
##DATA CLASS= NTUPLES
##ORIGIN= Bruker BioSpin GmbH
##OWNER= nmr
$$ XWIN-NMR		Version 3.5
$$ Mon May 22 12:19:04 2006 GMT Daylight Time (UT+1h)  MAYBRIDGE\nmr@NMR_250MHZ
##.OBSERVE FREQUENCY= 250.131544655141
##.OBSERVE NUCLEUS= ^1H
##.ACQUISITION MODE= SIMULTANEOUS (DQD)
##.ACQUISITION SCHEME= undefined
##.AVERAGES= 16
##.DIGITISER RES= 18
##SPECTROMETER/DATA SYSTEM= dpx250
##.PULSE SEQUENCE= zg30
##.SOLVENT NAME= CDCl3
##.SHIFT REFERENCE= (INTERNAL, CDCl3, 0, 16.522)
##AUDIT TRAIL= $$ (NUMBER, WHEN, WHO, WHERE, WHAT)
$$ ##TITLE= Audit trail, XWIN-NMR		Version 3.5
$$ ##JCAMPDX= 5.01
$$ ##ORIGIN= Bruker BioSpin GmbH
$$ ##OWNER= nmr
$$ C:\u/data/dgb/nmr/ADRS/4850/pdata/1/auditp.txt
$$ ##AUDIT TRAIL=  $$ (NUMBER, WHEN, WHO, WHERE, WHAT)
(   1,<2006-05-22 12:18:32.66 +100>,<MAYBRIDGE\nmr>,<NMR_250MHZ>,
      <created by zg, POWCHK disabled, PULCHK disabled
       configuration hash MD5:
       84 BC 41 DB A1 6E 1D 46 DA 25 12 A5 C1 ED C5 3A
       data hash MD5: 64K
       11 02 55 31 42 A6 F4 21 E5 9A 0F 2B C4 CD 8F DC>)
(   2,<2006-05-22 12:18:52.17 +100>,<MAYBRIDGE\nmr>,<NMR_250MHZ>,
      <Start of raw data processing
       ef LB = 0.3 FT_mod = 6 PKNL = 1 SI = 32K 
       data hash MD5: 32K
       C0 7E A5 40 A8 C7 64 BD E4 D2 B0 5E 61 7E 9B 8C>)
(   3,<2006-05-22 12:18:53.87 +100>,<MAYBRIDGE\nmr>,<NMR_250MHZ>,
      <apk 
       data hash MD5: 32K
       3A A3 27 EB 99 47 67 3F A0 F4 38 BA E4 B4 2E D7>)
(   4,<2006-05-22 12:18:54.59 +100>,<MAYBRIDGE\nmr>,<NMR_250MHZ>,
      <abs ABSG = 5 
       data hash MD5: 32K
       C8 9F 52 F8 88 77 62 CC E8 2A 0E 1B 8E FE AC C2>)
$$ ##END=
$$ 
$$ hash MD5
$$ A1 02 D8 A7 27 BD EA 75 F5 B3 E5 75 F3 ED 7D B4
##$RELAX= 
##$RELAX= 
##$RELAX= 
##$RELAX= 
##$RELAX= 
##$RELAX= 
##$RELAX= 
$$ Bruker specific parameters
$$ --------------------------
##$DU= <C:\u>
##$EXPNO= 4850
##$NAME= <ADRS>
##$PROCNO= 1
##$TYPE= <nmr>
##$USER= <dgb>
##$AMP= (0..31)
100 100 100 100 100 100 100 100 100 100 100 100 100 100 100 100 100 100 
100 100 100 100 100 100 100 100 100 100 100 100 100 100 
##$AQSEQ= 0
##$AQ_mod= 3
##$AUNM= <au_zg>
##$AUTOPOS= <24 >
##$BF1= 250.13
##$BF2= 250.13
##$BF3= 250.13
##$BF4= 250.13
##$BF5= 500.13
##$BF6= 500.13
##$BF7= 500.13
##$BF8= 500.13
##$BYTORDA= 1
##$CFDGTYP= 0
##$CFRGTYP= 5
##$CHEMSTR= <none>
##$CNST= (0..31)
1 1 145 1 1 1 1 1 1 1 1 1 1 1 1 1 1 1 1 1 1 1 1 1 1 1 1 1 1 1 1 1 
##$CPDPRG= <>
##$CPDPRG1= <>
##$CPDPRG2= <>
##$CPDPRG3= <>
##$CPDPRG4= <mlev>
##$CPDPRG5= <mlev>
##$CPDPRG6= <mlev>
##$CPDPRG7= <mlev>
##$CPDPRG8= <mlev>
##$CPDPRGB= <>
##$CPDPRGT= <>
##$D= (0..31)
0 1 0 0 0 0 0 0 0 0.06 0 0 0 0 0 0 0.0002 0 0 0 0 0 0 0 0 0 0 0 0 0 0 
0 
##$DATE= 1148296711
##$DBL= (0..7)
120 120 120 120 120 120 120 120 
##$DBP= (0..7)
150 150 150 150 150 150 150 150 
##$DBP07= 0
##$DBPNAM0= <>
##$DBPNAM1= <>
$$ [...]
##$SUBNAM7= <"">
##$SUBNAM8= <"">
##$SUBNAM9= <"">
##$SW= 20.6930455092707
##$SWIBOX= (0..15)
0 0 3 0 0 0 0 0 0 0 0 0 0 0 0 0 
##$SW_h= 5175.983436853
##$TD= 65536
##$TD0= 1
##$TE= 294.16
##$TE2= 300
##$TE3= 300
##$TEG= 300
##$TL= (0..7)
0 120 120 120 120 120 120 120 
##$TP= (0..7)
150 150 150 150 150 150 150 150 
##$TP07= 0
##$TPNAME0= <>
##$TPNAME1= <>
##$TPNAME2= <>
##$TPNAME3= <>
##$TPNAME4= <>
##$TPNAME5= <>
##$TPNAME6= <>
##$TPNAME7= <>
##$TPOAL= (0..7)
0.5 0.5 0.5 0.5 0.5 0.5 0.5 0.5 
##$TPOFFS= (0..7)
0 0 0 0 0 0 0 0 
##$TUNHIN= 0
##$TUNHOUT= 0
##$TUNXOUT= 0
##$USERA1= <user>
##$USERA2= <user>
##$USERA3= <user>
##$USERA4= <user>
##$USERA5= <user>
##$V9= 5
##$VALIST= <valist>
##$VCLIST= <CCCCCCCCCCCCCCC>
##$VD= 0
##$VDLIST= <DDDDDDDDDDDDDDD>
##$VPLIST= <PPPPPPPPPPPPPPP>
##$VTLIST= <TTTTTTTTTTTTTTT>
##$WBST= 1024
##$WBSW= 4
##$XGAIN= (0..3)
0 0 0 0 
##$XL= 0
##$YL= 0
##$YMAX_a= 424290
##$YMIN_a= -617119
##$ZGOPTNS= <>
##$ZL1= 120
##$ZL2= 120
##$ZL3= 120
##$ZL4= 120
##$ABSF1= 16.522
##$ABSF2= -4.171173
##$ABSG= 5
##$ABSL= 3
##$ALPHA= 0
##$AQORDER= 0
##$ASSFAC= 0
##$ASSFACI= 0
##$ASSFACX= 0
##$ASSWID= 0
##$AUNMP= <proc_1d>
##$AZFE= 0.1
##$AZFW= 0.1
##$BCFW= 0
##$BC_mod= 0
##$BYTORDP= 0
##$COROFFS= 0
##$CY= 12.5
##$DATMOD= 1
##$DC= 0
##$DFILT= <>
##$DTYPP= 0
##$F1P= 14.0000005364418
##$F2P= -0.99999901652339
##$FCOR= 0.5
##$FTSIZE= 32768
##$FT_mod= 6
##$GAMMA= 0
##$GB= 0
##$INTBC= 1
##$INTSCL= 1
##$ISEN= 128
##$LB= 0.3
##$LEV0= 0
##$LPBIN= 0
##$MAXI= 10000
##$MC2= 0
##$MEAN= 0
##$ME_mod= 0
##$MI= 0
##$NCOEF= 0
##$NC_proc= -3
##$NLEV= 6
##$NOISF1= 0
##$NOISF2= 0
##$NSP= 0
##$NTH_PI= 0
##$NZP= 0
##$OFFSET= 16.522
##$PC= 1
##$PHC0= 170.5113
##$PHC1= 3.621736
##$PH_mod= 1
##$PKNL= yes
##$PPARMOD= 0
##$PSCAL= 4
##$PSIGN= 0
##$REVERSE= no
##$SF= 250.13
##$SI= 32768
##$SIGF1= 0
##$SIGF2= 0
##$SINO= 400
##$SIOLD= 32768
##$SREGLST= <1H.CDCl3>
##$SSB= 0
##$STSI= 32768
##$STSR= 0
##$SW_p= 5175.98343685301
##$SYMM= 0
##$S_DEV= 0
##$TDeff= 65536
##$TDoff= 0
##$TI= <Analysis number 999999
Compound Code 99
Book Reference 9
Project Code 9>
##$TILT= no
##$TM1= 0
##$TM2= 0
##$TOPLEV= 0
##$USERP1= <user>
##$USERP2= <user>
##$USERP3= <user>
##$USERP4= <user>
##$USERP5= <user>
##$WDW= 1
##$XDIM= 32768
##$YMAX_p= 300623031
##$YMIN_p= -98940
$$ End of Bruker specific parameters
$$ ---------------------------------
##NTUPLES= NMR SPECTRUM
##VAR_NAME=  FREQUENCY,     SPECTRUM/REAL,   SPECTRUM/IMAG
##SYMBOL=    X,             R,               I
##VAR_TYPE=  INDEPENDENT,   DEPENDENT,       DEPENDENT
##VAR_FORM=  AFFN,          ASDF,            ASDF
##VAR_DIM=   32768,         32768,           32768
##UNITS=     HZ,            ARBITRARY UNITS, ARBITRARY UNITS
##FACTOR=    0.157963299565203, 1,           1
##FIRST=     4132.6476996994, 0,             0
##LAST=      -1043.33573715361, 0,           0
##MIN=       -1043.33573715361, -98940,      0
##MAX=       4132.6476996994, 300623031,     0
$$ Real data points
##PAGE= N=1
##DATA TABLE= (X++(R..R)), XYDATA
$$ [...]
16481A57K71J48J4362j507j5562J288J0644K4858m870m112k8287J7637K1101k0142
16467A5986k293N978j5325m168j250j143l484j817J4579J0972J4621k037j2872
16454A7747k533j4942o05J0891M574J2309k8255j7937L935j1955R279J8970L350
16441D828K359m557L029O904q18m200K306o155l703J7107O323m656N395j1100
16427A3062l4305J4949j728k6188q760m839O193K4984K755J4826M490J708o481
16414F66j5475Q057p265K1378P319O356l7962p836r70J2987J4996j6367L1252
16401A7136J1159k3058j1333J653J031R506M627j4214k0251J1952J5593J1884
16389A5685k0233j5680J7703j741O023J9952m125q915q897R706j2390o872J5702
$$ y = [157, 428, 576, 14938, 13431, -2131, -843, 9801, 34659, 29789, 25677, -2610, 15027, 36128, 15986, 13693, 19671, 4346, 178, -1072, -2215, -5699, -7516, 7063, 18035, 32656, 30619, 17747, 15214, 272, -333, 10558, 15132, 27441, -814, -18751, -14816, -26771, -17492, 1478, 4828, 7187, 2630, 5659, 12563, 11745, 7545, 9851, 3696, -7, 17100, 23423, 18767, 24162, 13062, -21243, -6294, -8022, -34210, -42970, -47809, -41616, -16632, -13877, 949, 5439, 7147, 666, -14809, -6752, -14017, 7361, 14680, 21036, -16926, -24762, -25732, -12745, 2251, -14116, 17136, 28295, 5237, -6096, -4443, -3412, 6094, 10721, -3493, -23744, -11792, 3801, 15685, -4548, -20228, -2525, -4266, 1757, 21709, 17584, 8669, -228, 9478, -2912, -9784, 5918]
16376E918J7j2759k639K2107L291l598j2518j3570j0119J0230J8838O535j7115
16363e382J3205J4766J707j6960m143m659k1116n945K3172j1052J3659J6435P186
16350B0873M313j2461j295J1615K915r999N453R095M191o099j6391j1674N491
16337F027r50P39J322k87P842n89r764k7706k695J5466J3208m049P131p895M961
16322B761J0185J796O337L286m2383r807J2846K0363l863n425J3760K0374p34
16309B9496k1271k7009M465N721P796m514m393R756M923O159P321k5640j6807
16296b3997J0514J6916q85k1692k0596P011k1133J6745J8538j737j1518J3492
16284a8342M2686K0995j9173j9747R993J5355J2224j7531P258L772n006o975J1559
$$ y = [5918, 5935, -6824, -9463, 12644, 15935, 12337, -181, -13751, -23870, -13640, 5198, 11733, -5382, 7823, 22589, 24296, 7336, 3193, -1466, -22582, -28527, -5355, -16407, -2748, 13687, 20873, 25186, 12725, 11430, 23045, 25960, 15961, 21414, 30509, 34700, 28601, 12210, 536, 6027, 5077, 5816, 7138, 6851, 14693, 14104, 4340, -23366, -26061, -10595, 2613, -1436, 5695, -2200, 2761, 12946, 14742, 21079, 24365, -18018, -27825, -14979, 5384, 1521, -3904, 9856, 30230, 29496, 8225, -18784, -14319, -8598, -802, -5316, -9709, 47, 4970, 11129, 18450, -7190, -23997, -13483, 3433, 2548, -19144, -39740, -32729, -53862, -37117, -18579, -20316, -31834, -18342, 24344, 45339, 26166, 6419, 16412, 31767, 43991, 26460, 33718, 37490, 32484, 25509, 37068]
16271C7068l319j2221J2516L824j2509j2529O441n272j8098j0415Q926J6865m362
16258F915l706O77N408l008j0750M390M028l2424N176J2535Q716j6962j9757k0399
16244e9161Q480J8384K913k299q977n588j098r38K1502J8070J9805n829l916n473
16230d125O92K4109J7063q828j1506j659J4591j0914p951L057j3936R206N107
16217A4906k338q992l573J721q712N170K516J0808j3214J0355J5110o768p503
16204I486K4930l753k1873j1120o304J1963r572m0037O3L0646J2033m159q769
16191a6466k196p541K6840j737j3869J0430L073l628J6612l252o685N327P521
16178A4429P034J0593R805k8120j6094k02P808p620P090o588j2137m708j4505
$$ y = [37068, 33749, 21528, 34044, 37868, 25359, 12830, 19271, 13999, -4099, -14514, -5588, 11277, 6915, 3209, 3886, 9294, 6286, -4464, -74, 3954, -28470, -23294, -10759, -2043, -19005, -38762, -59161, -50681, -32297, -29384, -31683, -40660, -46248, -47346, -48284, -26782, -8712, 11093, 5264, 1348, -4125, -3433, 20676, 37739, 28911, 17405, 15746, 30337, 19423, 11472, 14529, 593, 9799, 14906, 12568, 3576, 3, 1724, -6988, -1818, 698, 11506, -1708, 8647, 23757, 16989, 9486, 34416, 30663, 8790, -2330, -8634, 3329, -6243, -46280, -46217, -15571, -3538, -7697, -16466, -18662, -26203, 637, -1100, -14969, -4539, -1466, -5094, 11518, 8266, 1581, 6908, 14429, 21463, 32056, 41861, 13741, -2353, -2555, 5253, -2367, 4723, -1865, -14002, -18710, -33215]
16165c3215m52N343J4263N080K7803J1243N067O543k0399j7801n997J2727K443
16152A2648o330j2486R81R162l515J1245R893j1616j6493l829M015q337o083j6840
16138c7585J1342o45m262R627l116P330P004k8947k5421K3981O142J8020J5176
16125a354J1046o936r484q803j4125j6908J6208J9616P007Q514K935M061K0595
16112C2372O555j1604j2656k54j089J0844o054l240j2273m1466Q802J4300k0715
16099c6478Q240M6618k0666k2320K1198J4221l154N312j2780k8577j160N919r642
16086c3269L6043K4741j3084j0840N532M887J1668j6934k3624j6391K9155J8157
16074A6041l3861J0042K2299l649r75J2871O896r116o762k432O478K060k2797
$$ y = [-33215, -33667, -28324, -14061, -8981, 18822, 30065, 35132, 41675, 21276, 3475, -2522, 10205, 12648, 6318, -6168, -5187, 3975, 460, 11705, 21598, 9982, -6511, -10340, -6325, -14662, -20745, -37585, -26243, -26888, -31150, -21523, -24639, -17309, -10305, -39252, -64673, -40692, -34550, -16530, -1354, 9692, 2756, -6728, -15531, -29656, -46564, -30356, -10740, -3733, 4781, 7716, 11777, 32372, 38927, 27323, 14667, 14413, 13324, 24168, 18114, 14874, 2601, -38865, -30063, -15763, -36478, -28238, 18380, -2286, -24606, -3408, 10813, 7659, 12971, 191, -28386, -29546, -23627, -33269, 2774, 27515, 14431, 3591, 9123, 14010, 25678, 8744, -14880, -31271, -2116, 16041, -17820, -7778, 14521, 10872, 9897, 22768, 29664, 20548, 13786, 11354, 17832, 19892, -2905]
16061b905p53j876j061J2192n676j3721j3532J2012K0888j4877l876r380M896
16048a7669J9218M790N549k7992R322o166j7970l642q027N045K442K3465P078
16035d557j05J0458k0566j3809m162l842J5402k478j64q171N735k2900J020R417
16021c8722J8549O364q146J6289K9837J1656k1128j2315j4782j4707k996O754
16009b3347J0659J5260K3721j5610k1009J3626L491N863K0848j741j0256J2106
15997C3611r483j0497R426p070l835j9511o344J050J4531N860j4191l1245J7241
15984b0457J8786j4080Q263J5918j1416j4173r974K1359J3838l000j368J5103
15972A8799j8928j6100k6838Q888J5792K384l0890k6158K2827R449J8995K0428
$$ y = [-2905, -3658, -5534, -6595, 5597, -79, -13800, -27332, -15320, 5568, -9309, -13185, -22565, -17669, 1549, 6339, 11888, -16104, -6782, -12948, -30918, -34560, -42587, -37542, -35100, -11635, -4557, -4662, 5796, -14770, -28579, -32741, -36583, -21181, -23659, -23823, -31994, -26259, -49159, -48139, -38722, -20173, -13809, -21955, -5666, 24171, 35827, 14699, 2384, -12398, -27105, -30101, -23347, -12688, 2572, 26293, 10683, -10326, 3300, 6791, 12654, 33502, 31761, 21505, 33611, 24128, 13631, 23057, 15987, 12152, -7359, -13703, -12653, 1878, 7738, -6453, -37698, -20457, -1671, -15751, -7488, 8430, -2986, -17159, -27133, -5774, 8064, 5064, 3696, 18799, -129, -16229, -43067, -34179, -18387, -16003, -46893, -73051, -50224, -40775, -21780, -1352]
15960a352J5460R748l2263l2962P645O84p851N051M555p843m117J9302J8177j3245
15946a9011k0526r159L839m533J927O715K3920M3797K025J2263J5228j0632j1526
15933C4327L405N391J6414q423k8358m1167q370J406M359M934j3226R316P315
15920a2677J7487J7603K054j5703l1490j1651L455J8049Q783q164o843n603J456
15907b3244J2262R686p51q480k753L1986L160j1731r359J97N574n405J0136j7084
15893e806j2816Q376J5148J3912k494M539O499p978p167l5815J2559K7532K5060
15880D1549J842P91j7189j6275j8049k8351J6031J5865O77j5247l743M427J4532
15867c140J6045l879q780N146Q611j5013k4053m603L1677L0334j856J4128k587
$$ y = [-1352, 14108, 23856, -8407, -41369, -33724, -33040, -40891, -35840, -31285, -39128, -43245, -23943, -5766, -19011, -39537, -48696, -44857, -49390, -47463, -40748, -16828, 26969, 28994, 41257, 56485, 45853, 34327, 37732, 43123, 59537, 51114, 22756, -18411, -26781, -25375, -21016, -16082, -29308, -19992, -12677, 4810, 22413, 24467, 8764, -22726, -34377, -30922, -12873, -4090, -12254, -19097, -24700, -23244, -10982, -1296, -2047, -10527, -13280, 18706, 21866, 10135, 776, 973, 6547, 1142, 11278, -5806, -18622, -10246, 4902, 18814, 16320, 20859, 27358, 19380, 12213, -23602, -11043, 16489, 41549, 43391, 44182, 26993, 10718, -7331, -35682, -19651, -3786, -3109, -18356, -22099, -17672, -3140, 12905, 9026, 246, 5392, 14003, -1010, -25063, -29666, 2011, 32345, 30489, 44617, 42030]
15854D2030j9359m894J0516N001j2828O352J5083N705L952j3109l0755l317j1328
15841f951j311J2737k2407J150K0156n76j8801m155k996o976q663k22r542p478
15827e6035L3719J7238P102O027J5833j1709k3171J6534J837p158j6575M70K1983
15814F095O632J131N073l170R789k559j8901r022Q156J3456l259r308Q559N85
15800A3257L09K579O561m220o096K4589J2120O058l2482j8134J3743J1019j5760
15787A3543j1739P576P834J0228J082j3087r995j45P633k0077J551p122l171j6777
15773c2666J5815J5759O964N616J8085n168j0599j1208l448j1658j563K1265k2457
15760a5263M74j1983N634P509J2360j0743j4790j9373k62L738K1272p942j6482
$$ y = [42030, 22671, 17777, 28293, 33294, 20466, 26818, 41901, 47606, 51558, 38449, 7694, 4377, -6951, -8262, 4475, -17932, -16782, 3374, 2798, -16003, -20158, -23154, -30130, -38793, -39015, -48557, -56035, -22316, -5078, 2024, 8051, 23884, 12175, -10996, 5538, 7375, 217, -16358, -15888, 6095, 12727, 13858, 18931, 15761, 25550, 22991, 4090, -4932, 3224, 16680, 13421, 4113, 12672, 13257, 13566, 16145, 22706, 18486, 12390, 36979, 49099, 55157, 22675, 4541, 18284, 29303, 13543, 1804, 9380, 17214, 27442, 28524, 15437, 5442, 5297, 12930, -7147, -5596, -12718, -15889, -32666, -16851, -1092, 5872, 11488, 29573, 24405, 13806, 2598, -850, -12508, -14071, 7194, -15263, -14789, -26772, -21138, -13629, -1269, -12012, -26802, -46175, -46437, -42699, -21427, -29369, -45851]
15747d5851J8139J6222R318K9719Q489j629J7107K357o549k4675n999l981K547
15734A5214l878l6425j6544Q771K5937Q484O275m902k241L553K7830R224j6612
15721B4686j5539j7632l86K2313J1237l2974K1313J5857O419n689j0090L360k1547
15708A328k6895N540K2974P709o456r152O280K5905r003J099L20k8171M110p26
15694e138L974k3233j2431L0646M161k5433K521M608J0301o786M674N46q662J4472
15680e780J3992P158n48k8552R365k6780m6M576N55K1915j1551O68K094j6266
15666b9200J1693J6840J2343k500n976K773J0044O832Q265j0630j968J5109j0801
15653B2824l7657j1111J3258J6980J1605l618j0928o697j1645O819J219o940J3430
$$ y = [-45851, -27712, -11490, -2172, 27547, 36036, 34407, 51514, 53871, 47322, 22647, 16648, 12667, 15214, 11336, -25089, -41633, -32862, -6925, 1559, 7834, 2932, 691, 4244, 32074, 41298, 24686, 9147, -8485, -8871, 13442, 24679, -8295, 13018, 28875, 35294, 29605, 19515, 22875, 1328, -25567, -20027, 2947, 10656, 4200, -4952, 1328, 27233, 18230, 19329, 19649, -8522, -4412, -5138, -1164, -24397, -36828, -6182, -2021, -27454, -24933, -20325, -10024, -16810, -12136, -11590, -20252, -5780, 8212, 15370, 14822, -13730, -4365, -31145, -31191, -26615, -26060, -4145, -15696, -15028, -12934, -29200, -17507, -667, 11676, 9176, 3200, 5973, 16017, 22849, 31114, 20484, 18516, 33625, 22824, -14833, -25944, -12686, 4294, 15899, 12281, 1353, -5344, -16989, -10170, -8951, -15891, -2461]
15640b461M613j2019n270K1418J1938O855M7649P765k4883j784k016q563k3683
15627A9559l6638j2893J6545J063j0260O386K500j1824P077J2578j352o757J5896
15614A880j2747k0992J2201K2320J1839j7153k0678J1902J0589R256L3361j2066
15602B9712J4161Q545J014J9580p388k7543k3155J0038J3493L257j0235p514j6071
15589G894Q044n813L787r75k190j4631k290N405j5084Q849Q500o286j0056J5430
15575E84J0882p721j3652j4794n685J2730J4321n523L0280j087j1819o197k8469
15562b6150j7868L7554O739k166p84K990j1311N14Q048o582K50J0574o364o337
15548a0893p995j38m377o604k99J2057K0555j5763o515N596J8702J1411j3103
$$ y = [-2461, 2152, -9867, -15137, 6281, 18219, 25074, 72723, 80488, 55605, 53821, 51805, 43242, 19559, -17079, -29972, -13427, -12364, -22624, -16238, -13738, -25562, -18485, -5907, -7259, -14016, 1880, -10867, -31859, -19658, 2662, 14501, -2652, -23330, -11428, -839, 8417, 41778, 29712, 43873, 52418, 53432, 73012, 65624, 38081, 14926, 24964, 38457, 41714, 31479, 23965, 7894, 15938, 10125, 13912, 12937, 10747, -3884, -6174, -769, -15853, -7004, 1496, -4790, -14846, 584, 11466, 3745, -9907, -24701, -30386, -17656, -3335, -8858, 21422, 20335, 8516, 2319, -26150, -44018, -6464, 275, -1891, -2675, 315, -10996, -10482, -2434, -9016, -8766, 1808, -4556, -10893, -18888, -19026, -23403, -30007, -30306, -18249, 2306, -13457, -19972, -14376, 4326, 15737, 2634]
15535B634q327j4870M430K681M106j827j6077K1575J7919m1j6658k255j1278m262
15521b2250k320J0177J2522M561j4906q25o444k5159j133J3607K550J2913K645
15508a4062N043J0121k9330j3884M685J4958J1093O427j0344l644J9524J7779
15496A8366J1815J719j6002l6373m0661J8533m026K0932r255j9460L137n919O088
15483e1106K1652J0393j192J1931m901j9050N837L12j1191p806J3459J2210k5742
15470d5194k080J881M654J7149j0005J4338L175J8522p83Q966k018j785O115k5978
15456a3043M658K5769K5869N761l0017l5253K770J1048J3038p337k921j6806K438
15443a4026j5751p406k6054J0161N8679J3853N607k2226j3837J2125J1490j0658
$$ y = [2634, -5693, -20563, -16133, -13452, -9346, -11173, -27250, -5675, 12244, 12203, -4455, -6710, -17988, -22250, -24570, -14393, -1871, 2690, -12216, -13041, -19485, -44644, -45777, -32170, -29620, -16707, -14062, -9019, 1102, -28228, -42112, -37427, -22469, -11376, -4949, -15293, -18937, 587, 18366, 30181, 31900, 15898, -20475, -61136, -42603, -46629, -25697, -34952, -54412, -51275, -57194, -51106, -29454, -19061, -20253, -8322, -13223, -32273, -26436, -26124, -37315, -45121, -31662, -19452, -45194, -47274, -45393, -40739, -23590, -33595, -19257, -16082, 2440, 1657, 10623, 8605, 6820, 12935, -13043, -8385, 17384, 43253, 49014, 18997, -16256, -13486, -2438, 10600, 3263, 342, -16464, -14026, -29777, -37183, -63237, -53076, 5603, 19456, 25063, 2837, -11000, 1125, 12615, 1957]
15431A957j3023k8912k014L714m842J1188M809j1478J8530m546N961m506R547
15418a3615j9213l242J6500L206K5011K8255N067l365p317q021M558j3765j5407
15405a348l453p089k5733J1881P234p432K2001R065j5719j0874L68L524j3001
15392c0576L23J7093R631j1386j3447r302K8106J3527P470j1458j455K4578O897
15379C0001k361O52k5849j811j2797J9165J4899R4L589P348O084j5819R780j5363
15365A7612J5963j5885l3902l0556o685Q037m683K237L4237K0359O463l5735j9129
15352d1667k6873Q491M0538N954Q519j6908j1542J7063J0388j7144K50J7333K8069
15339B2471p963k966J302p315l019o417J4951K190j5977j1360K129j0475J150
$$ y = [1957, -11066, -39978, -41992, -38278, -43120, -31932, -27123, -38601, -20071, -24617, -18656, -23162, -13615, -32828, -36070, -19570, -16364, 8647, 36902, 41969, 38604, 31287, 23266, 27824, 14059, -1348, -4801, -11890, -37623, -25742, -18508, -25940, -3939, 5126, -10593, -21467, -21099, -17575, -30576, -30253, -13160, -3529, -14915, -28362, -37664, -9558, 3969, 11439, -19, -1474, 23104, 30001, 27640, 28292, 2443, 632, -12165, 7000, 21899, 21993, 25582, 32930, 39014, 23195, 32975, 17612, 33575, 17690, -16212, -46768, -53453, -45416, -50099, -47862, -13625, 6734, 13197, -22538, -41667, -68540, -60049, -19511, -13557, -5038, -21946, -33488, -16425, -6037, -23181, -22931, -5598, 22471, 14508, 11542, 12844, 5529, 2510, -3907, 11044, 13234, -2743, -14103, -11974, -22449, -21299]
15326b1299N202O161L1736K0496k4746k6463k5249j994q970o705J2538J2652O024
15313b0617j7587K0760r872j1240o989J5706p342l741r72r153O232K3549R256
15300a2010O141k387j2311K0519O984J894k4798q984J1731M04q459L884Q869n799
15286a4322l3201J2160K3396J264k721P206j3092J5912P299j0425l092p850J3288
15273d178K9593n779j0262l4168J186l565N033L9666o860r840o830J985J8574
15260A4555n812m778R187R343j6544K129n413j9232P245L563m830k8427R645L3846
15246D477J596J353J8783n020r562J3037r493k1360O226n41r849J760j842J0542
15232A07j2015j9500o502K5984Q693J283P685L670q882o649j8024J2858l90K94
$$ y = [-21299, -16097, -9936, 21800, 42296, 17550, -8913, -34162, -36156, -45126, -51831, -39293, -26641, -20617, -38204, -17444, -27316, -38556, -45545, -29839, -37181, -40922, -41894, -51047, -44815, -21266, -12010, -5869, -8256, -20567, -48, 6936, 8830, -15968, -24952, -13221, -12817, -21276, -17392, -8523, -14322, -47523, -35363, -11967, -10703, -13424, -6218, -19310, -3398, 3901, -6524, -9616, -17466, -4178, 25415, 19636, 9374, -24794, -23608, -27173, -22140, 17526, 10666, 826, -6004, -4019, 14555, 8743, 3965, 13152, 22495, 5951, 8080, 2667, -16565, -9320, -5757, -10587, -39014, -29369, 4477, 6073, 7426, 26209, 21189, 11627, 24664, 15171, -6189, 37, -504, -10353, -8593, -10435, 107, -11908, -31408, -37910, -11926, -3233, -1950, 5735, 9405, 523, -6126, -24150, -11292, -11682, -11388]
15218a1388j1902J8296Q592J7182J6053j936o952k2364j9328j1644p347J5177
15206a7561M369J1496J5372L345k8470K434R08j8319J9450J3486J1166J6875J4386
15193D8937q481r049k5932p402j9232k6807O222K9496L8693l384j3792k7399P278
15180a0852N192M816O15n737J5906n890j9909Q77k1011j6689K7769K2074O897
15167D058K2280p212q986m445K73L00m114j8866K85l69O056J6041M348P121L5328
15152E2098o439p406l451o353n932p080k7686k7129K3539K1707j1822m471J2J125
15138i288J8212K917N188q282J2860L189j1878o884l5783Q542j1072j2499K7032
15125a7746l519K351J2655L128j2691K4070o737P725r673l3412Q690R447Q898
$$ y = [-11388, -23290, -4994, 3598, 20780, 36833, 34897, 27945, 5581, -13747, -25391, -32738, -17561, -13192, -1696, 13676, 17021, -11449, -9015, -8107, -26426, -6976, 6510, 17676, 34551, 48937, 40456, 31407, 5475, -1927, -21159, -47966, -41744, -12248, 26445, 23061, 9269, -18130, -10852, -5660, -844, -229, -5966, 9940, 4050, -15859, -14982, -35993, -52682, -24913, -2839, 4058, 26338, 19126, 10140, 5695, 5968, 6268, 2154, -16712, -16427, -16796, -10740, 5301, 9649, 16770, 52098, 45659, 38253, 34802, 28449, 22517, 15437, -12249, -39378, -15839, 5868, -5954, -10425, -10413, -9288, 8924, 11841, 17029, 8747, 21607, 24796, 12918, 6034, -29749, -21207, -32279, -44778, -17746, -21265, -18914, -6259, -3131, -15822, 8248, 1511, 9236, -437, -33849, -25159, -15712, -6814]
15112f814N53j223J3757k1184J996J8575M083l5671J1083J1626j0150j3921n918
15099c3208n518P36K207O83K1727O740l484l351K2248J1656O244J623K630q989
15085B1944m786l0483N070J3684R100k2346j0716J5860l845r694O294j6886o226
15072c3030J9591Q397P015M041K67J546j7592r77J7390J7244o961j5478j4995
15059a3542J719J1907O922J4163L262M9j2141K449M011j9057p831R056Q809J249
15045A1025J5200O52r565M387j0856j885q292k0734o370j4784J7798j1644P448
15032b7620J4496R71q567j0475K384L5538j5532j4144j7925L058m683N955q964
15019d5508p824K687K732j324o600L593J8420O196J173M902K8164R01l2696l5119
$$ y = [-6814, -6261, -7484, 6273, -14911, -12915, 5660, 9743, -25928, -14845, -3219, -13369, -27290, -33208, -38726, -37990, -35783, -35100, -13373, -6633, -10117, -13468, 8780, 20436, 26680, 28303, 30933, 21944, 17158, -13325, -8255, 5429, 14529, -7817, -18533, -2673, -6518, -16212, -9918, -26804, -33030, -13439, -5042, 1973, 6014, 6281, 7827, -9765, -10742, 6648, 23892, 16931, 1453, -13542, -11823, 84, 7006, 21169, 24431, 24480, 12339, 14788, 18799, -258, -8089, 967, 9776, 11025, 26225, 26877, 17312, 21699, 10843, 8958, 666, -20068, -26438, -41222, -23424, -35068, -27620, -13124, -12153, -20720, -31195, -28811, 6727, -8805, -22949, -40874, -37816, -42499, -36544, -45508, -53332, -50645, -47913, -49237, -55837, -52244, -33824, -27628, -26455, -21553, 6611, 7512, -25184, -60303]
15005f0303m465K122K0479J8812m469L566J0696O381r62r833J4352J5863J7658
14992B9897o77j7724P47J1120j2763q110O142j2842j9327o046n075M0236J4608
14979B0186m510r976k6038q226Q173K7413K3527q891l8892j3675k1523j6378M202
14966f4608K2676K7598K9124J2704R296p127j4787j4271K2424Q777j1035j5585
14954E186k1707n989R445Q5J4281k1429k8947R369K7082k155m582K6471R770j9759
14940b879k4471p253J3741M662M94p947l736k603J4080J5919M342J6279J0529
14927C1157k9384j4765J855j0514p105l386J7522J1960J0582j2269J3365K8691
14915C7709k0457m8172l5461r347P992p1K0842L3516R655k165j0680j8180J7812
$$ y = [-60303, -64768, -62646, -42167, -23355, -27824, -24258, -13562, -7181, -8143, -17976, -3624, 12239, 29897, 29220, 11496, 12243, 23363, 10600, 2490, 8632, -4210, -23537, -29583, -34658, 5578, 20186, 15676, 5700, -20338, -28564, -20391, 7022, 30549, 21658, -17234, -30909, -52432, -68810, -64608, -41932, -14334, 14790, 27494, 36790, 29663, 14876, 605, 23029, 31806, 20771, 5186, -16521, -22510, -13065, -12980, 1301, -20128, -49075, -39706, -12624, -14779, -19361, 7110, 16880, -2879, -27350, -34603, -20862, -16200, -15706, -23653, -27389, -29992, -15912, 7, 4349, 20628, 31157, 1773, -12992, -11137, -21651, -28756, -32142, -14620, -2660, 7922, -4347, 9018, 37709, 17252, -30920, -66381, -75728, -67736, -67807, -46965, -13449, -3794, -5959, -16639, -34819, -17007]
14902a7007j0833J2653M842j4954Q037K0616P968k342K2871J2878j644k0638k7822
14889e375o951K231M162l143k283p808Q114j3974J353J6393K1098k2519j224J0232
14875C06P117M24J1217j5621m579n436k0322p00j4544r373J6703L3394q831k5858
14861c6103J2334j4389J3938J6970J5507K7837k2577l5582j0460j9944M289J6236
14849c1944J6076j341k9217k1638Q650P601K1123K7122J1985l829j4601p315k230
14836a9558J2229n587n655K817k5556j8985M5862J8732l270m469k60J6334J5504
14823B8138k1958j7804j8369N13L684K3044R137Q815j5017r329j3729j1221o758
14810d0854J6689L0008Q922q904k6591j882p050j100J8160j326k1253o109O420
$$ y = [-17007, -27840, -15187, -10345, -25299, -17262, 3354, 11322, 8980, 31851, 44729, 43085, 22447, -5375, -12326, -10095, -5933, -9076, -11359, -19167, -11053, -25027, -23674, -7281, 13817, -8702, -9926, 306, 7423, 7847, 19064, 3443, -1136, -6572, -26894, -27594, -42138, -51511, -34808, -1414, -10245, -36103, -23769, -38158, -24220, -7250, 8257, 36094, 13517, -22065, -32525, -52469, -48180, -31944, -15868, -17209, -46426, -68064, -59414, -51813, -30690, -3568, 8417, 4588, -10013, -17328, -19558, -7329, -12916, -18571, -15754, -41310, -60295, -14433, 4299, 1029, -3440, -3700, 12634, 28138, 6180, -11624, -29993, -29480, -25796, -2752, 6385, 15200, 183, -9146, -22875, -34096, -40854, -24165, 5843, 14765, 5861, -20730, -22612, -29662, -30762, -12602, -13928, -35181, -41290, -34870]
14797c4870K3927O061j2228J6105K872J5925j639j3968R748p836L984J8014k135
14784B3960j2297M821r809O102j0273l1945l220q07n845K0153j4467K3253K522
14771g852k680Q654R567J3158J0434m822j1985l91m79j8598j3831j5680K7287
14758g218n944j5042K592j0731m933J1660L7628j3510j1454J6990J0192p211j0286
14745g267P131l121n804P062J9859j255j267k0194k3726Q236p60J95k0679Q224
14731c3366J7257J5635L981j2622j1806Q34p189J3634j5991M851O5j4955K9106
14718a0566q60K151J1894O897o282j1988n698N693K4352P53P871j0862q989P181
14704A1547k463j108j9144k4861j4225n754J1395L611L029K3353J408j3218l630
$$ y = [-34870, -10943, -4882, -17110, -1005, 1867, 17792, 16153, 2185, 11933, 4097, 8081, 26095, 23960, 11663, 16484, 6675, 12777, 2504, -29441, -32661, -33468, -39313, -19160, -33627, -10374, -7852, -10532, -1878, 7689, 20847, 31281, 26459, 14474, 14083, 13604, -4994, -18825, -34505, -7218, -13162, -28204, -25612, -36343, -41276, -29616, 8012, -5498, -16952, 38, 10230, 3019, -7267, -136, -3257, -9061, -1999, 17860, 16605, 15338, -4856, -28582, -20346, -21106, -20911, -41590, -33366, -16109, -474, 3507, -9115, -20921, -20087, -27276, -13642, -29633, -24782, -24717, -39672, -10566, -11426, -9275, 2619, 9516, 3234, -8754, -14452, -8759, 15593, 16346, 24217, 13355, 4366, 11547, 9084, 7976, -11168, -36029, -50254, -56008, -44613, -41002, -37973, -14620, -13212, -26430, -30060]
14691c0060J9554K8474l640j8798j4610Oq17L715j3236j9384J2700J6604K5204
14678E712j9445p803k1813n232J8889J7225p92M897k797o669o036r19M862K3105
14664C184N148j3493n959J4861J3712M152k0001j6934j6878j0959R068J0266o400
14651c0233J6007R179L375j1273j9496k3602j0090J0008J5338o951K604J0006
14639c5128J4269J6377P850r046k770J488K9476Q224j7393j769J2985j569k1975
14626A019Q979J6136L3249J0021k8588k4526l3155j2472l458L345k6251J7269
14614c8432L586j6390J2123K3695K4378M329k0982j3293K4990k0531k2309k681
14602d1517q420K4015J0247J5199o906k8987j9670K6194L1303M5723J0824J5189
$$ y = [-30060, -10506, 17968, 14328, -4470, -19080, -19074, -19891, -16176, -29412, -48796, -36096, -19492, 5712, -13733, -21536, -43349, -48581, -29692, -12467, -13259, -8362, -11159, -17828, -23864, -24783, -19921, 3184, 8332, -5161, -11120, 3741, 17453, 21605, 1604, -15330, -32208, -43167, -34099, -23833, -30233, -14226, -5047, -1672, -12945, -32441, -56043, -66133, -56125, -40787, -47738, -45134, -35128, -20859, -4482, 3368, -5678, -8448, -6960, 22516, 30740, 13347, 11578, 24563, 22994, 1019, 9998, 26134, 59383, 69404, 40816, 16290, -16865, -29337, -32795, -29450, -55701, -38432, -34846, -51236, -39113, -15418, 8960, 13289, -7693, -20986, 4004, -16527, -38836, -41517, -49937, -25922, -15675, -476, -7382, -36369, -56039, -29845, 1458, 47181, 58005, 73194]
14590G3194j9563l0518p958n119J967r969k9787K3956J0297j1021o515j3465j4969
14577c9470n605M967K802O282J0520K0904P263p676P537r002J2767J930m4781
14564c1562m583J3240K927q866J4268K406K2777N15k405j0370K0573j6882k0333
14551a8295J5869Q082J6798M488j2172k0359k9302J0279J6038R062J560n723L949
14538B74L464l745j0897k3711J8085J6201J344J607J0825l424O313j6783j5591
14525a6038j9511J0828p097J6N556M4279M118n729m027j6285Q920J2383J0341
14512B7754j6018m5371O822L5128p91k3415j5952m02J0554N332J3759r076P884
14499c792J5917k4363J3487l373k1752R023L539j1869o366J894J9690K068r317
$$ y = [73194, 53631, 23113, 15155, 10036, 12003, 2034, -27753, -3797, 6500, -4521, -11036, -24501, -39470, -45075, -40108, -37306, -31024, -20504, 400, 7663, -13, 7524, -1478, 11289, 13219, -31562, -36145, -22905, -19978, -28844, -14576, -12170, 10607, 11122, 8717, -1653, 18920, 2038, -18295, -2426, 5656, 22454, 26942, 14770, -5589, -34891, -24612, -8574, 488, 2048, -3675, 274, 3738, -7, -10904, -34615, -16530, -329, 1015, 2622, 13447, 10023, 16336, -447, -16038, -35549, -24721, -31818, -31802, -26246, 18033, 22151, 16422, 12395, -3890, 5030, 17413, 27754, 11736, -33635, -26813, 8315, 7524, -15891, -31843, -32245, -21691, -16359, -2600, -11676, -3792, 12125, -12238, 1249, -2124, -23876, -14853, -11314, -23183, -29549, -27655, -7965, -5897, -15214]
14486a5214j1235J259j6142N767p909J627o263j0393J6289L6198P557j3519J1017
14473i61r480j0656k0817J2300R211J3198K6326M99l0824j3818k5559k0405k3275
14460i4261J6338P376J4719J885q282K5594M0J3144o43n079J1886P258j2411J0501
14446a1935k56l774K1204J2270L459r792l3181j0060M15j3950p873J9546M907
14433b9020J6261l60k1889Q066O303J031J3416M986N394j5328j7176J1521J2957
14420c838r94q583J7987k7570k1030J4979r619j0764J6929K3814o394p189J6972
14407e300J6088P193r691j181J1530M939o244J1077j1850l2045n303J4215N760
14394h12K0512N530L389J742j8521k4715k2409j888L0944L545j9104r821k763
$$ y = [-15214, -26449, -25190, -41332, -35565, -43474, -41847, -48110, -58503, -42214, -6016, 1541, -11978, -961, -10441, -21097, -41914, -29614, -20403, -7205, 19121, 19620, -11204, -25022, -50581, -70986, -94261, -77923, -70547, -55828, -53943, -62225, -36631, -36591, -23447, -24090, -29169, -17283, -10025, -22436, -11935, -12191, -15965, 5239, 17509, 20968, 11176, -22005, -32065, -31650, -45600, -53473, -33927, -29020, -12759, -13119, -35008, -26942, -20639, -19608, -6192, -1206, 4188, -11140, -28316, -16795, -3838, -4832, -13415, 4572, -22998, -44028, -29049, -38668, -49432, -32503, -8689, -15083, -22272, -5300, 10788, 17981, 8290, 7109, 18639, 23578, 17334, 28411, 16561, -15484, -20787, -6572, -812, 19700, 25230, 28619, 30361, 11840, -12875, -35284, -37172, -6228, -2683, -21787, -31608, -34371]
14381c4371J2062L284Q047p805l641J356J6582O748Q114M335Q392k4356k1964
14368b3217k8548J0960j060L0884N3080K0250j7444l0129l343L6104K180k1463
14356B8254j7561j0L877j3791O701J2211K3808J5339k1418n3834l1844J3569n089
14343c9788Q169m842J2603J5718J1401M120j7529o201j0416M865J2489n190n125
14330a9726q328j23m607o951o791Q236J7360n843P558M674j1835Q974J8277k0339
14316a9464p385M711k221Q515J1696J4790q401k1079J006K4538Q878O738k9396
14303g074j0537M339n82k1222l1263j2221J3340J14j676K0978K9370J4357p606
14290i683n015j2001J9557J1956j8254j224P99J1155M411k0399N618J3128K2390
$$ y = [-34371, -22309, -19025, -10978, -18783, -22424, -21068, -4486, 2262, 10376, 14711, 23103, -1253, -23217, -51765, -40805, -41865, -10981, 42099, 62349, 44905, 14776, 11433, 47537, 49717, 28254, 10693, 10683, 14560, 769, 7470, 19681, 43489, 58828, 37410, -16424, -48268, -34699, -39788, -31619, -36461, -23858, -8140, 3261, 7381, -10148, -16349, -26765, -21900, -9411, -14601, -19726, -28054, -28177, -32784, -39735, -46526, -38290, -20930, -26773, -19215, -14541, -26376, -17402, 875, -19464, -26849, -22138, -24359, -15844, -4148, 10642, 2241, -18838, -17832, 6706, 15584, 22322, -7074, -17611, -13272, -13854, -35076, -66339, -78560, -65220, -65106, -66782, -45804, -16434, -2077, -9683, -14698, -26699, -7142, 4814, -13440, -14664, -13865, -2710, 1701, -18698, -13080, 48, 22438]
14277B2438P34k2551l343J6706J7421j7198o900J220m844J4342q838j8240j0863
14264a9916M593J5640k5779N287O991K2622j875r463n034M480p658O915j0865
14251a4062k4878k2997k0275Q052L3125j704k0328J4000O845J3546P729j9208
14239d0155k7389K2165L1308J5906O918o187R218J8838j9322l931p577o073k537
14226h818k719K0711j1439k2972j2345N593M961j703J0519J0993M077o704k1906
14213c1752P243J7933J723R556k9741j2434L6620J9285j3126k5664k857L629n041
14200b4626K432k197M230j173L054K0728k069J0478J184j1870j6927l154j4075
14187c3985l785n066K009m937n480M73N294L583L903j7050n390P978P089J4855
$$ y = [22438, 23172, 621, -2722, 13984, 31405, 14207, 7307, 8527, 3683, 18025, 9187, -9053, -19916, -15323, 317, -25462, -20175, -13184, 9438, 7563, -1900, -6934, -2454, -10112, -3197, -14062, -38940, -61937, -82212, -74160, -41035, -42739, -63067, -49067, -42222, -28676, -20947, -40155, -67544, -45379, -14071, 1835, 8753, 2566, 11784, 30622, 11300, 7369, -208, -6281, -8818, -11537, 9174, -2265, -25237, -37582, -31989, -27028, -28731, -18212, -7219, -3142, -9846, -31752, -24509, -6576, -4853, 4703, -25038, -37472, -852, 18433, 5307, -20357, -23214, -19585, -24626, -22194, -24391, -20161, -21334, -18280, 2448, 379, 10857, 12041, 171, -16756, -19910, -33985, -37770, -42836, -40827, -45764, -51244, -50771, -45477, -41894, -37991, -55041, -60431, -52453, -45364, -30509]
14173c0509O26j0390k7781J643J3446K6936K3916L116K632k4331M482J3953l200
14160e461j3317j3401L864L25J7034M136r275N160l202J14q539L903j910P346
14146a3223J3079r308l3269O164K8845j0020j7004J7089J9669J1297p652q518
14134b851j6762k560k839J3392o186N751o943J306K0417K0096j4802j5494J7391
14121I916J9313j9900l0272j0562j9964J0122J2764J0055J7340N064k41k2118
14109a8483J4072j163n586O512k711j2691L039R367l9917l1623R421K3228O24
14096d5911J0156K6275K4243R830j4838j8166J41J027k3232l841K1564L413l804
14083a3143j852O013M753O293K1131l662j7987J7815J5385k6725j5797j1027o199
$$ y = [-30509, -29883, -40273, -68054, -66411, -52965, -26029, -2113, 1003, 3635, -20696, -16214, -2261, -5461, -18778, -32179, -28315, -27990, -10956, -6820, -16095, -10935, -14137, -14023, -22562, -18659, -20569, -13223, -144, -9452, -42721, -36557, -7712, -17732, -34736, -17647, 2022, 13319, 5667, -2851, -19613, -22173, -25012, -11620, -17806, -12055, -18998, -17692, 2725, 22821, 8019, -7475, 9916, 29229, 9329, -20943, -31505, -51469, -41347, -28583, -18528, -1188, 3876, 3635, -18483, -4411, -5574, -11160, -4648, -7359, -20050, -17011, -7644, -47561, -79184, -69763, -46535, -45911, -35755, -9480, 14763, 24593, 9755, -8411, -8270, -7243, -30475, -34316, -12752, -9339, -13143, -14995, -8982, -4229, 2064, 23195, 19533, 1546, 19361, 34746, 8021, -7776, -18803, -25002]
14070b5002k394K8691P826l0436j0907J1915Q69n693o740l746N203P733J6886
14057e795K334r316j2470j469K691J2867L160P456R535k0615j4037J1426j1480
14044b5713k305N3974K4113j2308j9550j1667j1895r108k4697K9457N802l667
14032g564p894n130p064j3863L5777K5975j1162M782j2260J214K0269n289j9740
14019a949j7642k5051l364J5228R522p888K827r555K961J1664J0196K0171M137
14006A1257j2964j149k6373j6474K3518K3393j3577j8230q746Q171J1507M046
13994a5621J8187r641k1779J9158j6302r81J241n526n506L4501J813k0869P259
13981a4066L180N642j4174k0972J1182K6117K0507J1222O370k4081m589K41r952
$$ y = [-25002, -27396, 1295, 9121, -21315, -32222, -20307, -19438, -25131, -31871, -35617, -30414, -22681, -5795, -3461, -12777, -25247, -26716, -24025, -11158, -7998, -542, 8993, -11622, -25659, -14233, -25713, -28018, 25956, 50069, 37761, 18211, 6544, -5351, -14459, -39156, -9699, -3897, -7564, -15458, -20588, -27652, -41515, -5738, 20237, 9075, 13857, 1597, 2811, 23080, 17791, -1949, -19591, -44642, -48006, -32778, -23256, -31144, -28317, -37872, -34911, -23247, -13051, 7120, 11257, -1707, -2856, -29229, -45703, -22185, 1208, -12369, -30599, -39345, -31174, -19667, -15621, 2566, -7075, -28854, -9696, -25998, -26979, -25738, -31264, -36770, -2269, -456, -21325, -14066, -10886, -5244, -19418, -40390, -29208, -3091, 17416, 28638, 35008, 10927, 6338, 6579, -3373]
13968c373o724k183K449O899J5785j8908N598O243p388K451m457r905K2896r63
13954H420j0657p686m630J2218N315N838L5923L6311j4505l0866j8854k7908J1583
13941E02M761Q85J6143j878j007J7190j998k0657m421p483j3778M06o334L4378
13927A6709K7727R589k243k6061p438q3k0999l864j4435k6640L9233N2441o463
13914C7473N145N524J5792k6959l7553k199K184Q703j8709j3223K2104K0627M102
13901B3011J2474r89l0844M180J4445K2966J7254n617k5280j1095J0558j0642
13889B0421j4416K0537J4714n312k151j3965J3131k2547l4002K2830Q4L125j459
13876I90j2994J6067l838p121n8p638n448j3984K1125K1125J4749j0126k8452
$$ y = [-3373, -10097, -12280, -9831, -2932, 12853, -6055, -457, 5786, -1602, 849, -3608, -13513, 9383, 8420, -2237, -9923, -14553, -2335, 2980, 8818, 44741, 81052, 66547, 35681, 16827, -11081, 502, 5263, 6148, 22291, 20413, 19406, 36596, 34598, 13941, 9520, 2037, -11741, -11335, -17669, 16709, 44436, 54025, 51782, 25721, 18283, 18200, -2799, -6663, -21098, -47738, -8505, 43936, 37473, 42618, 48142, 63934, 36975, -578, -2777, -593, 8110, -10599, -23822, -1718, 18909, 23011, 35485, 34496, 3652, 7832, 22277, 45243, 62497, 56880, 31600, 20505, 31063, 20421, 6005, 26542, 41256, 35944, 33793, 19828, 32959, 10412, -23590, -760, -676, 2449, 990, -12004, 4063, 225, -6896, -6954, -14592, -20040, -34024, -12899, 8226, 22975, 12849, -15603]
13863a5603j6594M222J1256m525J15O59N247J0786J0779j5210j5038o007O098
13850b3815J8339O88N594j6013j1213L2672K2209j2204j4322k2466K563J8316
13838C48j848j7773N923K4078K6449J0217j5535m0455j1074Q63k634J5573p741
13825a3609J3504K4087q255j0628r053p136K8857P74j3904j7452J6897J4003q609
13812I476j8211J0484M350r647M76J5895J1275j5711j2029j2249J072k5921j2208
13799e2948J7812J2961O680L446O445lJ0113K0367k618j0408j1432J463Q74K282
13785E034k010R018J9558Q913L056l261k2634m08R809j6999j0493J297o945r630
13771a5695J8369J556j6727j4492j1295J5493O043K4162L1135k728j2846j2895
$$ y = [-15603, -32197, -27975, -16719, -21244, -21129, -20470, -15223, -4437, 6342, -8868, -23906, -29913, -23815, -5476, -4788, 806, -15207, -26420, 6252, 28461, 16257, 1935, -20531, -17968, 348, -1500, -19273, -13350, 10728, 37177, 47394, 31859, -8596, -19670, -18807, -21441, -5868, -13609, -105, 23982, 15727, 5099, -3954, -11090, 17767, 18541, 4637, -12815, 4082, 18085, 9476, -8735, 1749, 6099, -3548, -3072, 12823, 24098, 8387, -3642, -15891, -14819, -40740, -52948, -35136, -22175, -15495, -12049, -5604, -5607, 4506, 24873, 22255, 11847, 415, 1878, 2752, 5034, 3024, 12042, 31600, 40513, 43569, 40308, 17674, 17266, 27075, 10076, -417, 880, -6065, -15695, 2674, 4230, -12497, -26989, -38284, -22791, -16748, 7414, 38549, 35821, 22975, 10080]
13759A0080k9440k1482K1333J2369j6221l472J3388K3623j2023n537J5403M738
13747A2759J634j31O452J796j9808j1554J313j00J871l514K3160J7839N561j5939
13733B1339j0577N673j0582k67o15K812o297r28k538J3562M115J0680p212P978
13719B7143j9910k2306Q193k291Q654J333j2092k380J7204K1639J6724J67j3411
13706B8667p237p278J206o044q03K8395J374M427k043P55Q075j2736j2161J4689
13692C9286M069O470J9326k2959k4113K4163K1333M191J9593P924K0780L9604
13680A59667L1358Q34P484J449J0453Q09L868j0353M998K359m4072l6130k9333
13667A03391k2731Q867o856L274o489n982n642Q570m3558j714J7767K304J0282
$$ y = [10080, -19360, -40842, -19509, -7140, -23361, -26833, -13445, 10178, -1845, -7382, 8021, 12759, 14393, 14262, 20714, 22510, 2702, -8852, -7539, -7639, -5768, -9282, 13878, 31717, 37278, 21339, 10762, 16435, 5853, 5586, 4971, 7783, 1486, 558, -1980, 11582, 15697, 26377, 19165, 27143, 7233, -15073, -6880, -9171, -517, 816, -11276, -13656, 3548, 25187, 41911, 42078, 28667, 21430, 14152, 15358, 9314, 8511, 36906, 38280, 42707, 40664, 41419, 49494, 36758, 24597, 39286, 43355, 49825, 69151, 46192, 22079, 46242, 67575, 71766, 91359, 99283, 120063, 159667, 191025, 191859, 199343, 200792, 211245, 212054, 215922, 205569, 210567, 212926, 168854, 132724, 103391, 80660, 89527, 82671, 85945, 79456, 73474, 67832, 76402, 32844, 31130, 48897, 51201, 61483]
13654F1483k950M993p044q754K992J966j5593K471k5865m538J7320o81k1921L544
13640G423K0173r107n619L97M085K5888K3294j2636Q845O117j6177k1191k8437
13627C055j2120L1385k253O144J3772K1807o482J9306R954R098L2254K0288p343
13614A38865J040l435k4423k3125k859o811J2517K3946l1389m3786n914N671r860
13601C0437O037J150k571J3885M0319J0586J5388j6767l6311M50j6154j174M5588
13588I0863r05k4963M685J080j080N789J4879o778O072k713j147P330n51p233
13574H5328j1128o029k7181j6607K4716O19k2132J8741J2761j6813P27j5892l7407
13561a0297j1540o996O978L2132K8232L154J0987k0986j6546K895n05L61j1851
$$ y = [61483, 58533, 63526, 56482, 47728, 50720, 52686, 37093, 39564, 13699, 9161, 26481, 25800, 3879, 7423, 27596, 18489, 12870, 13267, 17352, 43240, 66534, 53898, 62743, 68860, 52683, 31492, 3055, -9065, 22320, 20067, 26211, 39983, 61790, 55308, 74614, 84568, 93666, 125920, 146208, 138865, 139905, 136470, 112047, 88922, 86063, 79252, 91769, 115715, 84326, 40540, 34626, 40297, 30437, 36474, 37624, 35053, 48938, 89257, 99843, 115231, 98464, 62153, 62603, 46449, 45275, 90863, 89958, 64995, 69680, 70760, 69680, 75469, 90348, 83570, 89642, 86929, 85782, 93112, 92561, 85328, 74200, 68171, 40990, 24383, 49099, 49718, 27586, 46327, 59088, 42275, 43002, 27110, -10297, -21837, -28833, -21855, 10277, 38509, 41663, 52650, 31664, 15118, 18013, 17508, 17869, 6018]
13548F018k2723J5057L6385J5776k789J16J6753J9734k6383l4830q770m013l988
13535F343k805m371J8927J6915M999Q935j5048R850l386j8103J9976L0022N329
13522G7583r568n394J0180k4406k2883R230J4953J9424k286J3441o286l229q312
13509F2447M642J8483K7140Q935K6356k0573J2887R730j3950j9895k6215l346
13497H6641L807R635q803j3591n865J1029j5195k8473J9626J919J765P811n952
13484F4354j8010K066j3000L018n921j0624j1978J2586O039J2299k00n518j2953
13471B2158j9K3145p780j1892J1508J2275J177K895l729m112k9568o232Q609K1002
13457C9437j7788R63O959j0694J5098P370O618j8045p551k689J9294J0896J3241
$$ y = [6018, -16705, -1648, 34737, 50513, 47724, 47840, 64593, 84327, 57944, 23114, 14344, 10331, 6343, 3538, -833, 18094, 35009, 40008, 48943, 33895, 43745, 40359, 22256, 42232, 72254, 77583, 68015, 62621, 72801, 48395, 25512, 34742, 49695, 69119, 66833, 80274, 73988, 70759, 62447, 67089, 85572, 112712, 121647, 148003, 127430, 140317, 150047, 136097, 116202, 89987, 86641, 90448, 100083, 91280, 77689, 71824, 82853, 67658, 39185, 58811, 60730, 62495, 70306, 64354, 46344, 48410, 35410, 38428, 32507, 21883, 9905, 22491, 28530, 40829, 40629, 35111, 22158, 22139, 45284, 37504, 25612, 37120, 49395, 50572, 53467, 49738, 45626, 16058, 9826, 18435, 39437, 21649, 22612, 29571, 18877, 33975, 41345, 47963, 29918, 22367, 19678, 38972, 49868, 63109]
13444F3109Q361K92j7258m157J544j2523j7130j4386J4686K4504j8810J0396N5836
13431I4464Q753J4956J87o053j4245l408R024Q860n582R21k7115P642l126m6489
13417C8789j8506K259P105k440J7283J7737p566j4938m279O396j4543j1684J4143
13404B9756K6261P076J0403N562k1630j5675J6976K2849j792J3120o943l911j255
13391H0797K0967L1766J9076j326j8840nl930k0700r779j885N35j4045l9111q48
13377D2672L3095M494k3807j6080j6167j4286J1816K088O245K0951K754p728j2123
13364C3924J0698J786O074j0982j7433J783K550j888J097m39J3380J9298Q19j6248
13350D4419l458J8865J8666l3429j6170k477N074k1453N805r747l946n155M1406
$$ y = [63109, 71470, 71762, 54504, 50347, 51891, 39368, 22238, 7852, 22538, 47042, 28232, 38628, 94464, 103217, 118173, 118360, 112307, 98062, 94654, 103678, 112538, 106956, 107877, 80762, 88404, 85278, 38789, 20283, 22542, 29647, 27207, 44490, 62227, 54661, 39723, 35444, 41840, 27297, 15613, 29756, 56017, 63093, 73496, 79058, 57428, 41753, 58729, 81578, 79786, 92906, 85963, 82052, 80797, 101764, 133530, 152606, 151280, 132440, 132435, 128505, 107805, 98026, 96141, 96676, 82631, 43520, 42672, 75767, 80261, 56454, 40374, 24207, 9921, 21737, 23825, 30070, 51021, 53775, 46047, 33924, 44622, 46408, 52482, 41500, 24067, 25850, 28400, 26512, 27609, 27170, 40550, 59848, 60667, 44419, 40961, 59826, 78492, 45063, 28893, 26416, 31490, 10037, 15842, 6095, 2149, -3006, 38400]
13337C8400J5820r434K656K3631n079j0221j2201J7382J9340o989J5217J448p222
13324H2748o585j1700R503j4499k590L009J719N814j8076q248k3812j846M883
13311B0320m847O985J2757j3303O78K6580o250J8308j554j4656J413P777l0943
13298B3265j1609J3171j5635q040J4954J4740K9063m355K195j1599k368J025j5908
13285B8899j3314k1131O385Q178m167Q286M2517N880j7069j224j205j4067J8098
13272D6066P885j4935m479j429O01k3838p721J2632K2793r042n073J4280K6264
13259F4004k6671j4771K7049N567l515P157j9905k1945P664j5738J8720L0401
13247E8017j1259l5976j6028O156J0937J2403J4134l082j2776l5874M846K878
$$ y = [38400, 54220, 44786, 47442, 71073, 65994, 55773, 43572, 60954, 80294, 73305, 88522, 89970, 82748, 76163, 64463, 73966, 59467, 56877, 59886, 61605, 67419, 49343, 41095, 17283, 15437, 20320, 15473, 22458, 35215, 21912, 22590, 49170, 42920, 61228, 59674, 45018, 46431, 54208, 23265, 11656, 24827, 9192, 1152, 16106, 30846, 59909, 55554, 57749, 46150, 43782, 44807, 28899, 15585, -5546, 839, 9017, 4850, 13136, 55653, 61533, 44464, 43240, 42035, 27968, 46066, 53951, 39016, 34537, 33108, 33709, 9871, 2150, 14782, 37575, 28533, 23460, 37740, 64004, 37333, 22562, 49611, 55178, 51663, 58820, 38915, 16970, 24634, 8896, 27616, 58017, 46758, 10782, -5246, 910, 11847, 24250, 38384, 35302, 22526, -13348, -8502, -5624]
13235e624P462K5370J553k7343K877L425p757J6161L6763R832J0803j0742J5242
13222G8022K506J2626o412N200K4125J79m122o94j2100j6766l3425j2752N329
13209D1716j5666K70n987K346J1659K6706n055j4095l3982j1544K639o170K4401
13196A7238R126K014J4834p85p735j6557K0431J0029K9420J6447L432K56K956
13183A01106r715k1117l1521k9517j9702J3126P683R403J6381r08M26k1240j3737
13170F68K3449J2095j8821j0436J8356J3783k0241n875J8921n237R297R04n009
13157C1854q178k0256j2379M770J196L364p197K0857Q421J8682K2327j9727k398
13144D1336R783r663k6626o19J0157n626m2076M896K5691J4603J3803r020r833
$$ y = [-5624, 1838, 27208, 28761, 1418, 4295, 7720, -37, 16124, 52887, 62719, 73522, 62780, 78022, 80528, 93154, 86742, 91942, 116067, 116246, 112124, 111430, 99330, 82564, 49139, 36387, 41716, 26050, 26320, 20333, 22679, 34338, 61044, 55989, 41894, 7912, -3632, -993, -7163, 17238, 26364, 28378, 43212, 42427, 34692, 18135, 38566, 48595, 78015, 94462, 97894, 98150, 101106, 91391, 70274, 38753, 9236, -10466, 2660, 10343, 19746, 36127, 35219, 35645, 14405, 668, 24117, 36212, 17391, 6955, 25311, 39094, 18853, 12978, 31899, 26662, 35959, 36863, 31854, 23676, 3420, -8959, -4189, -2993, 371, -6826, 14031, 22452, 41134, 63461, 43734, 41336, 51119, 41456, 14830, 14211, 24368, 18742, -23334, -18438, 7253, 21856, 35659, 26639, 16806]
13131A6806q266k1713q054K9840M1694K779j1919J4248j207l7969j8961P047j4668
13118a0343k213K6402k3087J437j33R322K568J3147J1965j4219q336J8006K6264
13105E0780k277l1892J5828J5434q163O557K1167J873J8569J2322O438K884j1139
13092I8381l6956j1285j3162j9560J3173l924m52K907P611J0630k6926L314J4242
13079C7993j6386L15J2356J1574l28j6882j2512j2301M120M2872j2293n156J5160
13066D8532O4R083j7425m796j3664k6092r456R93J0213K482j0263P594M3875p647
13052C3493k01k6401j0664K8328L743j0952M14l0513r562J5712J4869J5411r120
13039A4557j6261o171P789L158J4574p350K058j9831K4915J9035K0417p356k6141
$$ y = [16806, 8540, -13173, -21227, 8613, 50307, 53086, 41167, 55415, 54208, 16239, -2722, 4325, -10343, -12556, 13846, -9241, -7804, -7937, 1385, 3953, 17100, 29065, 14846, 6510, 24516, 50780, 48503, 16611, 32439, 47873, 39710, 46267, 67434, 69307, 87876, 100198, 106636, 109520, 98381, 61425, 50140, 36978, 17418, 30591, 26667, 26215, 29122, 36733, 47363, 20437, 23751, 37993, 21607, 21922, 34278, 45852, 45524, 28642, 16130, 3829, 7949, 50821, 38528, 33372, 48532, 48596, 57679, 40254, 35458, 21794, -4298, -13754, -12761, -2548, -66, -10329, -2735, 41140, 33493, 33292, 6891, -3773, 24555, 28298, 17346, 17760, -12753, -22315, -6603, 8266, 23677, 14557, -1704, -7875, -86, 3072, 17646, 10296, 12354, -7477, 17438, 36473, 56890, 49534, 23393]
13026B3393j631j1426p703J8553K4579l88j2643K519K1897n076p349R632l448
13013E0909j0517j7206j9708J947J5912J1340k794j0396J9769L832R351K915l007
13000E2347j1576l3879o854P956L091J2236J3894r463j965J3219q558K6388K038
12987E8874k9444p755M901p13J5922k4535r582k42K3659J9975K255j7701K9579
12974F5193k0808j1500k570p708r862J8574J505j8439j5859o501j08K6537J7856
12961C6310m0949k5348K3340M1960R923j5403o165J4311J5668J901o044l1147
12949A8357R735J3255J2011j7080k2885k1817J86J9529j0175n788L961k1946O969
12936a5688J2879K4189K2052n14j8086k1732K828J5097M317j329J9477J327r733
$$ y = [23393, 21762, 10336, 2633, 21186, 45765, 45377, 32734, 35253, 57150, 52074, 44725, 54357, 50909, 40392, 23186, 3478, 5425, 21337, 32677, 29883, 19487, 39256, 43088, 52439, 55354, 52347, 40771, 6892, 38, 7994, 11085, 23321, 37215, 27752, 25787, 39006, 30448, 56836, 58874, 29430, 21675, 26576, 25863, 41785, 17250, 7668, 7426, 31085, 51060, 53315, 35614, 65193, 44385, 32885, 30315, 22607, 12745, 31319, 32824, 14385, -1474, -7975, -8083, 18454, 36310, -4639, -29987, -6647, 35313, 45236, 29833, 23668, 37979, 53647, 55548, 49504, 18357, 28092, 41347, 53358, 36278, 13393, -8424, -8238, 11291, 1116, -4672, -711, -22657, -15688, -2809, 21380, 43432, 42918, 24832, 3100, 5928, 21025, 25342, 24013, 43490, 44817, 35084]
12923C5084J3997l3458K077K1012j0393k2910k685L684k493J0106P679q77o973
12910A3850j1946J900J2734p400L128j6766o012k0691J2147L0543J2624m483J6467
12897C6095K5898n276k7984K9q659n026j8473L3996k254l5998K0873K3429r893
12884B6757k8886q630J4463j0087J2657J4595m282j371L100N111O200m111Q536
12871C4052N940m001J2064j0614J5811j7654q169R126J0883O453j1183l2481Q045
12858A8272J5741J1589L642J50l6962j6860k582K6256k28j548J849J9190k1317
12845A7192n227N131j3507P823p133j0379m184L1696M63N497K0433N488j7757
12832C5536p002p597J646Q800J5884R341k1495j2737o224j4045j9368J3750J0895
$$ y = [35084, 49081, 15623, 17700, 38712, 28319, 5409, 2724, 6408, 3915, 14021, 21700, 20823, 13850, 1904, 3804, 16538, 9138, 12266, -4500, -10512, -31203, -19056, 11487, 24111, 19628, 36095, 61993, 56717, 28733, 28762, 20103, 15077, -3396, 30600, 28346, -7652, 13221, 36650, 26757, -2129, -10759, 3704, -6383, 6274, 20869, 16587, 15216, 18316, 23427, 29627, 25516, 34052, 39992, 35991, 48055, 37441, 53252, 35598, 27429, 36555, 47438, 53891, 42708, 10227, 18272, 34013, 45602, 49244, 49394, 12432, -4428, -7010, 19246, 19018, 17470, 19319, 38509, 17192, 11965, 17096, 3589, 11412, 4279, -6100, -10284, 21412, 21875, 27372, 47805, 53293, 35536, 28534, 20937, 22583, 31383, 47267, 56608, 35113, 22376, 16152, 2107, -17261, -3511, 7384]
12819G384J67L1307r453n484r292O664l683k0652k7552J0283M0853P559J9662
12806D7763P659L8J8535J5341l9Q587M5243J4515N40Q198k840J2879L7065M7687
12792B61171J00629R3578Q8210P1785O0899N9439J8982j9787k8158n3195p4058
12781E79495r3840p4294o7724o0568l4826k9548l8023k3086M486r635j621j2097
12769A38719p650m222j2849r686p015J2932k2470q313j7172J1270J8264J2087
12757A03895M942j684j4405j2871m931N764o020J1013k3677j7351j3550J2757
12745D3882K923J1674Q668k0782l54J3658j9725n985R792Q914p208j6538k4170
12732D749K0409J0587Q681J4097j7996q851q801N601N690J1707Q88o58l3387p494
$$ y = [7384, 7551, 38858, 29405, 23921, 14629, 21293, 17610, -3042, -30594, -20311, 20542, 28101, 47763, 55422, 55460, 73995, 89336, 89297, 97884, 143127, 157642, 158182, 166380, 163540, 176419, 213484, 261171, 361800, 455378, 543588, 615373, 676272, 735711, 754693, 734906, 706748, 653553, 579495, 485655, 411361, 343637, 283069, 248243, 218695, 180672, 157586, 162072, 152437, 150816, 138719, 131069, 126847, 113998, 104312, 97297, 110229, 87759, 79446, 62274, 73544, 91808, 103895, 108837, 107153, 92748, 79877, 74946, 80710, 74690, 85703, 62026, 44675, 31125, 43882, 46805, 58479, 67147, 46365, 46011, 59669, 39944, 33959, 43751, 52665, 45457, 28919, 4749, 25158, 35745, 44426, 58523, 40527, 31676, 22875, 28476, 34166, 45873, 46761, 46103, 12716, 5222]
12718E222J8980J8131P667R124r11j4241k4392r356K8239J8008j9940K1120J159
12705E8810J566J3759o323Q969M426p81l2681J937J9597k052j5663k4433P482
12692C4613n918j6406R613n236l912K9663J7700q8k5092j9208j0260m513J1535
12679A2491j5357j8776L983O998Q707J0691l113m147m923k7908p99k150N143J9175
12665i985J5144J6595N823K3987K7505K0933p64p099j0534p669m476l414J230
12652F7276j5521j6338k34K0478j0911j1726M370L5626L4451J0406k2033l294
12640I2550k6906k330J5629J8919Q148J8977J2142N1030N9196M7759O1193O6083
12628D22390L6143K6980J6730K2580k2620l7191m2063k9418l4588l6746l8742
$$ y = [5222, 24202, 42333, 50000, 59124, 58213, 43972, 19580, 10224, 38463, 56471, 36531, 57651, 58810, 60376, 74135, 67812, 76781, 81207, 80426, 47745, 49682, 69279, 67227, 51564, 27131, 34613, 28695, 12289, 21902, 16666, 12754, 42417, 60117, 60029, 34937, 15729, 5469, 956, 12491, -2866, -21642, -17659, -10661, -1954, 8737, 5624, 1477, -3446, -31354, -32153, -34303, -29160, -9985, 5159, 21754, 27577, 51564, 79069, 100002, 99238, 92139, 81605, 73936, 69460, 66046, 67276, 51755, 35417, 35183, 55661, 44750, 33024, 37394, 73020, 107471, 117877, 95844, 92550, 65644, 63314, 78943, 97862, 106010, 124987, 137129, 188159, 247355, 295114, 356307, 422390, 458533, 485513, 502243, 524823, 502203, 465012, 422949, 393531, 358943, 322197, 283455]
12617B83455m4952n387o832l0422j0366j7335j8147P505K3755k1124l167k2187
12605A34796j0459j1142k5602k5972K1238j81P307N781K140K5025J2236l805j5245
12592A16117j9806j414K5160l165M632o228k4360j0741p282p284J3869j8066R528
12579G0960J808k4151k351k18j1308q812J7483m41m50K783j6524n462N599j287
12565B7629K3567K1989j1620j370k732n084k0899N050K9696L1511j0750L440M247
12552I4674k9606q900m775J1107j5958P332j2198j9371J5109J6623K2517J1410
12540H7964o589k6139J2702L4111j3845j3119M362R665K6724j8287j1039j7407
12528F9103R367L5648m291k5243K1548K1258o709j3259j1963q390J4908K0987
$$ y = [283455, 238503, 233116, 226284, 195862, 185496, 168161, 150014, 157519, 181274, 160150, 156983, 134796, 124337, 113195, 87593, 61621, 82859, 82678, 89985, 95766, 97906, 122931, 135167, 131362, 116117, 96311, 94897, 120057, 116892, 121524, 115296, 90936, 80195, 72913, 65629, 79498, 61432, 70960, 72768, 48617, 46266, 46048, 34740, 25928, 43411, 42970, 42520, 45303, 28779, 23317, 28916, 27629, 51196, 73185, 61565, 60195, 57463, 52379, 31480, 36530, 66226, 97737, 86987, 90427, 94674, 65068, 56168, 51393, 62500, 46542, 53874, 41676, 22305, 37414, 54037, 76554, 87964, 81375, 55236, 67938, 102049, 88204, 75085, 79447, 89112, 115836, 97549, 86510, 69103, 78470, 114118, 109827, 84584, 106132, 127390, 120681, 107422, 95459, 87069, 101977, 122964]
12516A22964J4871q85r229q220l4336j9202k930K0028J9768o843k6832M424j1282
12503F2296J2386J3188J0603L8811K5371J9879j1087J1541L3723L5983K2622K4903
12491C00219J1160j4997L873P531n791j0959m1676k0629M848J4188o207j5757
12479B25803M901J9501J2635J8241j7972K40L2966p649l363j5371L2227J6596
12467C18755m205m074O937k4699L94k1021j1245J8008J5203K729r105L014P382
12454B98073K8536J4077j5784j5445J5602K0979J6852J0103L7974K7239Q552p736
12442D39022O181l383j7766R054o319J2610q57J319J9660K3037K9941j268Q369
12429E19600J5924K1444J1205J0032j0354P466L230j5171J9159R487K9685L4965
$$ y = [122964, 137835, 136950, 127721, 119501, 85165, 65963, 63033, 83061, 102829, 95986, 69154, 73578, 62296, 74682, 87870, 98473, 137284, 162655, 182534, 171447, 182988, 216711, 252694, 275316, 300219, 311379, 296382, 300255, 307786, 301995, 291036, 249360, 228731, 233579, 247767, 241560, 225803, 230704, 250205, 262840, 281081, 263109, 263349, 296315, 288666, 285303, 269932, 302159, 318755, 314550, 310476, 317413, 292714, 293108, 272087, 260842, 278850, 294053, 296782, 287677, 290691, 298073, 326609, 340686, 324902, 309457, 325059, 346038, 362890, 372993, 410967, 438206, 446758, 439022, 445203, 441820, 424054, 433108, 426789, 439399, 438542, 439861, 459521, 482558, 512499, 511231, 519600, 535524, 556968, 568173, 578205, 567851, 575317, 578547, 563376, 582535, 592022, 621707, 656672]
12417F56672L4828K2106m831K4732M0008K0782K9361N1222L9217K0727J5053M3295
12405I93172R2754N9576P0777M5436M0406Q3592O6331L5531R7155J00853P8518
12394A764101J07704J46511J73511J66859K28343K56975K95991L48152L88106
12385C876253M66785N46839O21654P16103Q41037R72501J117431J279943J521781
12376A1960327J926737K557063L491693M843354O707324R065312J1717414J4472873
12368F6742097J6663273J7176430J5998681J3866698R469699K313606l809624
12361A38420860p764590j2231703j5921916j6094032j4227435j2127538r728104
12354E0325542p279204n252837l846571k891811k355066j995674j715774j585024
$$ y = [656672, 691500, 713606, 708775, 733507, 773515, 794297, 823658, 874880, 914097, 934824, 949877, 993172, 1085926, 1145502, 1216279, 1261715, 1302121, 1385713, 1452044, 1487575, 1584730, 1685583, 1764101, 1871805, 2018316, 2191827, 2358686, 2587029, 2844004, 3139995, 3488147, 3876253, 4343038, 4889877, 5511531, 6227634, 7068671, 8041172, 9158603, 10438546, 11960327, 13887064, 16444127, 19935820, 24779174, 31486498, 40551810, 52269224, 66742097, 83405370, 100581800, 116580481, 130447179, 139916878, 142230484, 138420860, 130656270, 118424567, 102502651, 86408619, 72181184, 60053646, 50325542, 43046338, 37793501, 33946930, 31055119, 28700053, 26704379, 24988605, 23403581]
12346B3403581j497644j385003j252879j132890j030421r58113q73846p67923
12338A4504862o97955o04128n57602n12749m63858m56035m13596m07217l77326
12329A0014396l42185l47493l20887k95392k34632j82820j84331j64109j75044
12320G767503j70813j44376j30431j41257j82096k16017k26939k27097k52872
12311F075605k63214k42371k19656j89110k06343j62153j57317j12960j30757
12302D391724j57471j39744j13274j07553j31513r1652q5141j29571r7475n9278
12292C279052q3607o9583r0640r0254q9316q3035q1223m2301o0564n4007o6277
12281B468245q3727n5074n2034l0431l0619m9387p3668n3478o2207o7786p1651
$$ y = [23403581, 21905937, 20520934, 19268055, 18135165, 17104744, 16146631, 15272785, 14504862, 13806907, 13202779, 12645177, 12132428, 11668570, 11212535, 10798939, 10391722, 10014396, 9672211, 9324718, 9003831, 8708439, 8473807, 8290987, 8106656, 7942547, 7767503, 7596690, 7452314, 7321883, 7180626, 6998530, 6782513, 6555574, 6328477, 6075605, 5812391, 5570020, 5350364, 5161254, 4954911, 4792758, 4635441, 4522481, 4391724, 4234253, 4094509, 3981235, 3873682, 3742169, 3650517, 3565376, 3435805, 3338330, 3279052, 3195445, 3125862, 3035222, 2944968, 2855652, 2772617, 2691394, 2649093, 2588529, 2534522, 2468245, 2384518, 2329444, 2277410, 2246979, 2216360, 2166973, 2093305, 2039827, 1977620, 1909834, 1838183]
12270A838183m4273k6136k8204m4554l8437j7607n0252n8017l8122l2444n3503
12259A406634n2399k8362j2511j5162l8532l9490q601j8571k4050j185k2811K719
12247A147679R85k2080m277j9033j6046K399k066r599n141l9769k3463N028j3614
12234A001003m470J2749l5214m0191j5021k9333k4229n5205m5758p131q845l1039
12222G17316j5298K1022r867J0245q743N258N7608J6286O65k6727p9598q5079
12210F03088l5797n3065m2126l7292j8939k2592l226M333P929k6740j9912J4634
12198C70295o008N949M121j848j2701q496J8805O839j8105l5070p863j7323r646
12185B88949J9444J9102K037m406J465O650J3106J3147k5610k2443j2602m606
$$ y = [1838183, 1793910, 1767774, 1739570, 1695016, 1656579, 1638972, 1588720, 1530703, 1492581, 1460137, 1406634, 1354235, 1325873, 1313362, 1298200, 1259668, 1220178, 1211577, 1193006, 1168956, 1167771, 1144960, 1147679, 1148664, 1126584, 1122307, 1103274, 1087228, 1089627, 1087561, 1077962, 1072821, 1033052, 1009589, 1014617, 1001003, 996533, 1009282, 974068, 933877, 918856, 889523, 865294, 810089, 764331, 757200, 748355, 717316, 702018, 723040, 713173, 723418, 714675, 719933, 777541, 793827, 794492, 767765, 688167, 603088, 567291, 514226, 472100, 434808, 415869, 393277, 390051, 394384, 402313, 375573, 355661, 370295, 364287, 370236, 374357, 372509, 359808, 351312, 370117, 376956, 358851, 323781, 315918, 298595, 288949, 308393, 327495, 329532, 325126, 326591, 333241, 346347, 359494, 333884, 311441, 298839, 294233]
12173B94233J9616Q214O745m216J3393O083K902j0838k2182j8181m292J3608p627
12160B97458j3463p798R624m157J3277N741k7334l2657k3617o9J5231J7682k322
12147B47596l833q519k0448j3207J4487K776J0411P604j6970o010j8049k7096
12135A68742M158j2344p671J7545K9041J9220P050J9441k135j257k3009r994J3599
12122B22386K3170N593j6300k4814q667K2055J9744Q976r049j3770k1612Q766
12110B16478m051k8228k7009O050o026N61L660P258J1839K7219O762O46l409P698
12096B19448j0247n255N141m538j2177P728j5778j0836J23q514r578j5142j5002
12083A25373l550o936k748J0821k719N574N449M085k1892O37n544p771J4486j0158
$$ y = [294233, 313849, 322063, 328808, 324592, 337985, 344068, 346970, 336132, 313950, 295769, 291477, 305085, 297458, 283995, 276197, 285821, 281664, 294941, 300682, 273348, 240691, 217074, 217005, 232236, 249918, 247596, 243763, 235244, 214796, 201589, 216076, 218852, 229263, 236867, 219897, 213887, 195838, 168742, 172900, 160556, 152885, 170430, 199471, 218691, 225741, 245182, 243047, 241790, 218781, 208787, 222386, 245556, 251149, 234849, 210035, 201368, 223423, 243167, 252143, 243094, 229324, 207712, 216478, 212427, 184199, 157190, 163240, 157214, 157775, 161435, 168693, 180532, 207751, 214513, 215159, 211750, 219448, 209201, 203946, 209087, 204549, 192372, 200100, 184322, 173486, 173609, 165095, 155517, 140375, 125373, 121823, 114887, 112139, 122960, 120241, 125815, 131264, 135349, 113457, 114094, 108550, 100779, 115265, 105107]
12069A05107k872R47l4478j0924p189N883p090K2230M1940L4635J3881J8318P011
12056A87399L0928N0321M9115q284l1664k3043n202l2368K574L11O84r098n019
12043B06654K0676j0627j3527r67j5186l1300j7708K1259p625j4420J1117J7178
12031A65524q855k7122j4733J801j660K6295P193j7282n498J0918K2420P762l6522
12018A30241m0039q494J224j3334O686q19J0972K0676J2836J8660J2807J6105
12006A67521k454j457P23j7628k4867N411o803P260k860l5999K5328K7304M627
11993A46106k1717K401r246n505R539K0934J7506j6799k7175l730K9844P902j5712
11980A34348P353k6555k2879k354O168K2291J5632J44j2343J2833j8114j6125
$$ y = [105107, 102235, 103182, 68704, 57780, 50591, 56474, 49384, 71614, 113554, 148189, 162070, 180388, 187399, 218327, 268648, 317763, 309479, 277815, 254772, 249570, 217202, 219776, 220087, 220771, 211673, 206654, 227330, 216703, 203176, 202209, 187023, 155723, 138015, 159274, 151649, 137229, 148346, 165524, 156669, 129547, 114814, 116615, 114955, 141250, 148443, 131161, 125663, 136581, 159001, 166763, 130241, 90202, 81708, 82932, 69598, 76284, 75465, 86437, 107113, 119949, 138609, 151416, 167521, 165067, 163610, 164333, 146705, 121838, 127249, 120446, 127706, 124846, 88847, 114175, 141479, 146106, 124389, 126790, 117544, 112039, 121578, 142512, 160018, 143219, 116044, 112314, 142158, 150060, 134348, 141701, 115146, 92267, 89913, 96081, 118372, 134004, 134148, 121805, 134638, 116524, 100399]
11968A00399L8332J2949o855R027J9894J559k1176k7451l575J0062J6058K5957
11956A75180O680n806j5060O405K8178l424O210K7536L3632J0987L0117M8151
11944C48786M7965N1343O8727J02645Q4641J41748J62692J29724J26066J54301
11934A418638J19697R6065J20318J98532K99532L81470N43352P01769Q83922J022539
11924E785834J045975R51799P33044M38130R1678k76929n93660q35576r69039
11915F371256r57372q71469p55124o13075m48896l23931k38139j75827j61538
11906A825885j02700j03445q2721q7977r9042r3388o9121n5948o2212j9880k4138
11895A025313p4808m4348n4377n2544k1983k2096k9273m7273l7376j2745j0422
$$ y = [100399, 138731, 151680, 144825, 153852, 173746, 175305, 154129, 126678, 123103, 133165, 149223, 175180, 181860, 176054, 160994, 167399, 195577, 192153, 198363, 225899, 259531, 270518, 300635, 348786, 396751, 448094, 516821, 619466, 704107, 845855, 1008547, 1138271, 1264337, 1418638, 1538335, 1634400, 1754718, 1953250, 2252782, 2634252, 3177604, 3879373, 4763295, 5785834, 6831809, 7783608, 8516652, 8954782, 9046460, 8769531, 8175871, 7340295, 6371256, 5413884, 4542415, 3787291, 3174216, 2725320, 2401389, 2163250, 1987423, 1825885, 1723185, 1619740, 1537019, 1449042, 1350000, 1256612, 1187491, 1131543, 1069331, 1049451, 1025313, 950505, 906157, 851780, 799236, 777253, 755157, 725884, 678611, 641235, 628490, 618068]
11884F18068j0172P52j5424k3039m4308l0042j7833j812R835k1009k0681j1351
11872D32984P504k9387j9879j2875o901j616J6070k59j2861n3707j9767L269J575
11859C04150Q091k6774M61k091j4739m721M436J8864o134k5301r866j1108k3325
11846B11943k7509j154J2595J5274J0540j2941o695K66j0384l2181j1100L121
11834A51775J5863K027j8901j4633J7332o117j950j2697j2947N85K0575K3010
11822A63922j1488k7681J3402K4594L496o400k2778j8443j9965O130J3664L3063
11810A51516J8264j8823r058j094k336j0345j2938O87r819j5400m285J0421K9401
11797A26191J3373r705j4522j368n764K1067k5064p708J5247K742j863o670j1352
$$ y = [618068, 607896, 608648, 593224, 570185, 525877, 495835, 478002, 476190, 486025, 465016, 444335, 432984, 440488, 411101, 391222, 378347, 371446, 369830, 385900, 385641, 372780, 319073, 299306, 302575, 304150, 312241, 285467, 285928, 283837, 269098, 264377, 268813, 287677, 281543, 256242, 246376, 235268, 211943, 184434, 183280, 195875, 211149, 221689, 208748, 202053, 202319, 191935, 159754, 148654, 151775, 167638, 169665, 150764, 136131, 153463, 147346, 145396, 132699, 119752, 120337, 140912, 163922, 152434, 124753, 138155, 162749, 166245, 159845, 137067, 118624, 98659, 104789, 118453, 151516, 169780, 150957, 141899, 140805, 138469, 128124, 115186, 115873, 106054, 90654, 86369, 96790, 126191, 139564, 129859, 115337, 113969, 108205, 129272, 104208, 96500, 111747, 114489, 112626, 105956, 94604]
11784I4604l7586k1918Q540K8816O502j0410j1270K5325K5330p010m1348q590
11772E0985K0483j816J1271K6922n851k3787j287j2931J3270p213m794M539Q31
11759G0622j7421j2812P883J0453k2840O483J4978k604j3402J6009J2058N969
11747G5376j4430k472j0584J5246j6973k1534R322R098N507K5924N029j2150j0671
11734E6688m587q59J9526J6898Q972j0738J509p981k8345j2379j0944Q041J0959
11721D6760O414j5529k1035J0572K4087J5172J1252N665O185l2152k6028l108
11709B8255J096J6622K1873j2377K1690J5002p43r428q797J234j6119k2497p777
11696B8034J0069K3884J1516R470P122R371J1488L020j8560l147n515j7073O949
$$ y = [94604, 57018, 35100, 43640, 72456, 78958, 68548, 57278, 82603, 107933, 100923, 59575, 50985, 71468, 69652, 80923, 107845, 101994, 78207, 76920, 63989, 77259, 70046, 65252, 69791, 70622, 53201, 40389, 48272, 58725, 35885, 42368, 57346, 54742, 41340, 57349, 69407, 75376, 60946, 58474, 47890, 63136, 46163, 24629, 33951, 43049, 48556, 74480, 79509, 67359, 56688, 52101, 51242, 70768, 87666, 96638, 85900, 87409, 79428, 51083, 38704, 27760, 35801, 46760, 53174, 37645, 16610, 27182, 51269, 66441, 77693, 83358, 89543, 57391, 31363, 28255, 29351, 45973, 67846, 55469, 77159, 92161, 91418, 81990, 73193, 74427, 58308, 35811, 28034, 38103, 61987, 73503, 82973, 90095, 99466, 110954, 113974, 95414, 92267, 86752, 69679, 76628]
11683G6628L871j2204k0633j84j5775R947K5054j2316p041J0456j2206j2660K7309
11670F0246J4030j7505M763L271j9510k281O512j7556R568R136J3918P796o96
11657G1692P539J557j902j6013j2210k8853K6815K9698L70j606k2817j4807J3914
11644E3377J3510R858l026o700K1131J2334K980j5166r435J9315M406l127l7598
11631F1859o907j743k4137j2837J4899K7682J0446J7741R994j3648j36Q502J1054
11618A02769n264k0309m556j2761K557J303j9570r390L9410J2689k0702J9443
11606H5619L7451O29m963K4127J172o66j6374M237n186j4630q901J2404P51M71
11592A16141j403o62q023o68r195N622J7508O566M8641K1435J8301J8099M9363
$$ y = [76628, 80499, 68295, 47662, 47478, 31703, 41650, 66704, 54388, 47347, 57803, 45597, 32937, 60246, 74276, 56771, 61534, 64805, 45295, 43014, 49526, 31970, 41538, 50674, 64592, 72388, 71692, 79231, 80788, 78886, 62873, 50663, 21810, 48625, 78323, 78693, 77087, 54270, 39463, 53377, 66887, 76745, 73719, 67019, 88150, 100484, 103464, 88298, 78863, 98178, 102584, 99457, 61859, 54952, 53209, 29072, 16235, 31134, 58816, 69262, 87003, 96997, 83349, 83213, 91715, 102769, 97505, 77196, 72640, 59879, 62436, 63739, 44169, 34779, 74189, 86878, 66176, 85619, 123070, 123699, 118736, 142863, 144035, 143369, 126995, 131232, 126046, 111416, 102515, 114919, 115670, 116141, 114738, 114076, 106053, 105385, 96190, 101812, 119320, 125886, 174527, 195962, 214263, 232362, 281725]
11579B81725N8131O5687R7856R4568L1087j1438l4067o2346j03086p2344n5296
11568B90477m3706k4709j5130m882j0439n850O720r005j4183J4578J8708K8038
11556B30617K5929M2379O3911Q6163P7197P1687J3573J5463N743m8194o3177o8167
11544D53124o6819o4121l1933j0857k5494k5133K140J2321q90j8300l2709j3211
11532A78118j5526O448J1213j7828r657k277R870K0846j3876Q719J5287j0142
11520A81195j4249q512m0452q597J3561j3672j2074j3253n222M015j644j984M5020
11507A24132K2421l539j6480j6194M598J0925p069J3473L1945Q055j75N077k1553
11494A55616Q393j7103j8049P460J7242p237k7144k2670k3089j5285l761J3183
$$ y = [281725, 339856, 405543, 503399, 597967, 629054, 617616, 583549, 521203, 418117, 345773, 290477, 246771, 222062, 206932, 202050, 191611, 185761, 192481, 183476, 169293, 183871, 202579, 230617, 256546, 298925, 362836, 448999, 526196, 597883, 611456, 626919, 632662, 584468, 521291, 453124, 386305, 322184, 290251, 279394, 253900, 228767, 230907, 243228, 242338, 224038, 191329, 178118, 162592, 169040, 180253, 162425, 152768, 150491, 160361, 181207, 167331, 176050, 191337, 181195, 166946, 158434, 117982, 109385, 122946, 109274, 97200, 83947, 78725, 82740, 81096, 79112, 124132, 146553, 143014, 126534, 110340, 114938, 125863, 118794, 132267, 164212, 172267, 172092, 177169, 155616, 164009, 146906, 128857, 136317, 153559, 146322, 119178, 96508, 73419, 58134, 54373, 67556]
11482F7556j0060R276l30K3729J2031O86O997r152J674j2988j1885l513k2480
11469E1541j390n656K767Q657K2923N767J6673j381L138m033j83p83m414P827
11455A01453O832p400J8899q708N10l290j8570L429P72Q136L4220l3260k5199
11442G7824K0061L0788O989p476J5665K8644L4362J6402J5580L7772q287l7434
11430B30890j5646J64l1166n0978l6495j4514l0843o852K8815J1517j375Q139
11418I1656j9501j082J4817l788n471Q029Q09j3564j0635M579k514k620K788N855
11404F9358J0691k07L1342J0346j6079l0578j3682J871Q423P130K3553L293R440
11391A14901j0794O192K5630L2163L9930N9186N5198R1758Q2882P3800J01628
$$ y = [67556, 57496, 66772, 66442, 90171, 102202, 102888, 109885, 100733, 102407, 89419, 77534, 74021, 51541, 50151, 44495, 47262, 55919, 78842, 84609, 101282, 99901, 103039, 99006, 98823, 98040, 93626, 101453, 108285, 100885, 119784, 111076, 111586, 108296, 89726, 93155, 93927, 102063, 136283, 103023, 77824, 97885, 128673, 135662, 128186, 143851, 172495, 206857, 223259, 238839, 276611, 268324, 230890, 215244, 215408, 184242, 133264, 96769, 82255, 51412, 44560, 73375, 84892, 83517, 91656, 72155, 71073, 85890, 82102, 76631, 84660, 85469, 71905, 61270, 65849, 63335, 60715, 63503, 69358, 80049, 79842, 111184, 121530, 105451, 74873, 61191, 63062, 71485, 78615, 102168, 105461, 114901, 104107, 110299, 135929, 168092, 208022, 267208, 322406, 414164, 497046, 570846, 672474]
11380F72474L9034j2159r1832j06966p4438q7759m4996l3325m0401k6300l5511
11369A57821k596k947j6470q415J2454K5571r271k9502J2571P337p944l341l1963
11356A03305P818J6972j9199j1027L450k0000k8491k7479o494N3420K8824j9614
11344H1485r391k4285j1675P336J7833K908J1970K6767K118o143P84K972j48L0726
11330A33257J0283j8056j1858q29m787q394L07o836j8268j5769K5774J6622p313
11317I4133n282p267p077k7899O906r181l364R759j1307k259J3378p564J1227
11304E4203l202m091j2382r649J5987K0943O336O716N096N866n530Q423J716j2092
11290G8340p926pp927p729K8243J0018N907K3062J3726k6777O580k766k595L6875
$$ y = [672474, 711508, 699349, 607517, 500551, 426113, 338354, 293358, 260033, 219632, 193332, 157821, 155225, 152278, 135808, 127393, 139847, 165418, 156147, 126645, 139216, 146553, 138609, 135268, 103305, 111123, 128095, 108896, 97869, 101319, 81319, 52828, 25349, 18855, 72275, 101099, 81485, 72094, 47809, 36134, 43470, 61303, 64211, 76181, 102948, 105066, 98923, 99707, 102679, 102531, 133257, 143540, 125484, 113626, 112797, 108010, 99616, 99923, 93087, 74819, 59050, 84824, 101446, 94133, 88851, 81584, 74507, 46608, 53514, 44333, 40969, 50728, 39421, 37162, 50540, 42976, 54203, 51001, 46910, 34528, 24879, 40866, 61809, 68145, 74861, 79957, 85823, 80293, 88716, 90432, 78340, 70414, 70407, 62480, 54751, 82994, 93012, 98919, 121981, 135707, 108930, 115510, 112744, 110149, 147024]
11276A47024K5079Q714L7920J9291r279l893L2026R225K8539K5179j4059m3674
11264B62092l8273j3566k8343l3115k6654p830j040M972n646j7419j2788j605
11252H0785M525R447m806K504k038J4321j5381k595J6384l0196j8381J3561M0042
11239A08172k165k335J7614K3328n431l4382j8962K458J5412k719j3688j252k5423
11226F0627K0699J0503K70P229j640L931p485j1256P909k784j98L146p346L673
11212H7278R333J4060J8946J8075j2427j0902j2482P847j731L187J674r153K515
11199A16220L1948J9575O999Q362J9545K6267J3959K901k2681k1926m8998l0914
11187A21257k5390j8433k557J0730K4581J4127J0347l069j1148j5153L962o313
$$ y = [147024, 172103, 180817, 218737, 238028, 228749, 224856, 256882, 266107, 294646, 319825, 305766, 262092, 223819, 210253, 181910, 148795, 122141, 114311, 113271, 118243, 112597, 95178, 82390, 80785, 85310, 94757, 89951, 92455, 90417, 104738, 89357, 86762, 103146, 72950, 54569, 68130, 108172, 106007, 103672, 121286, 144614, 139183, 104801, 85839, 88297, 103709, 100990, 87302, 86050, 60627, 81326, 91829, 92099, 99328, 97688, 101619, 94134, 82878, 90787, 88003, 87805, 90951, 83605, 87278, 96611, 110671, 129617, 147692, 135265, 124363, 111881, 119728, 117997, 121184, 122858, 113705, 116220, 148168, 167743, 174742, 183104, 202649, 228916, 242875, 245776, 223095, 201169, 152171, 121257, 95867, 77434, 74877, 85607, 110188, 124315, 134662, 131593, 120445, 105292, 109254, 102941]
11175A02941P34j5546n005Q427K1943p335j4857k8815N06K5189K5400L5100K7738
11162A76420M3075N4430L5170p78j2610k8901m0469Q176O230m3586l6268j6458
11150A44431k1029k0002j4431l465K501P752J6719k0717P114J5538J3490k1009
11138A06892k4047O080L62m784R771M183J2434q52K7828L0212K4354M2957J6688
11125B52078q317O755k0582m3509j1100m2656L842J021j9750k0942k2208O277
11113H0909j2j7918M0675J6372J6582o508n002J5169j3377l1283j1287J3518O521
11100A04359k3595O023L841j0291O77k9476r712J0148L2719m254j9775P148K2365
11087I0177J4705j3530j0408M727L754q73q663J3144L0655k6142l4174k641K9448
$$ y = [102941, 103675, 88129, 83124, 91551, 113494, 106159, 91302, 62487, 62993, 88182, 113582, 148682, 176420, 219495, 273925, 309095, 308317, 295707, 266806, 226337, 234513, 240743, 197157, 160889, 144431, 123402, 103400, 88969, 85504, 88005, 95757, 112476, 91759, 98873, 114411, 127901, 106892, 82845, 88925, 89287, 84503, 94274, 98457, 110891, 110039, 137867, 168079, 192433, 235390, 252078, 243761, 250516, 229934, 186425, 175325, 132669, 136511, 137532, 117782, 96840, 74632, 80909, 80897, 62979, 103654, 120026, 136608, 130100, 125098, 140267, 126890, 95607, 84320, 97838, 104359, 80764, 86787, 90628, 80337, 81014, 51538, 41826, 51974, 84693, 80439, 60664, 67812, 90177, 104882, 91352, 80944, 85671, 89425, 88552, 79889, 93033, 123688, 97546, 63372, 60731, 90179]
11074I0179M051L929J2300r734l761K99j550k8925n46q60j2950j756O775R673
11060F7124O139m345J2882r58o469J0863L443n260R456N191K1027j5452p710o366
11046H9565p824q822p709o772o197J0522J834p144M8223L7903P047K507P173k6781
11032A33525p428j3003j1063J6092j3025j1967l160J7451K3033K1175r803n892
11020A35935k5764p432J8878K1138J199Q404k7931j4198J1000J3463M761J4595
11008A54048L2530J2812p677N155J3259k60n830l7363k4548n038J0526r158j7086
10995A21370J0202J1312j5780p261O987l033L343J0223k429n319j4715p870J3508
10982A20538j6171m342J9249j3240Q024R119L01M431N004J3025j9083l740L7664
$$ y = [90179, 94230, 98159, 110459, 100725, 96964, 97263, 95713, 66788, 66242, 65382, 52432, 50676, 57451, 67124, 73263, 68918, 81800, 80842, 74373, 85236, 88679, 83419, 92875, 98066, 119093, 103641, 95931, 89565, 81741, 72919, 65210, 58438, 52241, 62763, 64597, 57453, 105676, 143579, 150626, 153133, 160306, 133525, 126097, 113094, 102031, 118123, 105098, 93131, 89971, 107422, 130455, 151630, 141827, 135935, 110171, 102739, 121617, 142755, 143954, 152358, 124427, 110229, 121229, 134692, 139453, 154048, 186578, 199390, 191713, 196868, 210127, 209867, 204037, 166674, 142126, 137088, 147614, 138456, 121370, 131572, 142884, 127104, 119843, 126830, 123797, 127140, 137363, 134934, 129615, 114900, 107030, 120538, 104367, 100025, 119274, 106034, 114058, 123177, 123478, 127909, 132913, 145938, 126855, 123115, 160779]
10969A60779j973k8843m477l147L15j3596L1J3034P994k2001k1104m601J1600
10956I4011N373o641n187L8962O668j4240j4850L81P870N961J830Q090j093j1455
10942A15680n683j8451J653K0018L4450Q519J1296K1773m794R265o330R672J0036
10929B07104J360q275L3331M4089K1723Q980M9502P7060J00984J73721K07148
10918I16727K44147K25395J79798R8546n6694k35021k96723k46667j45987r2217
10908E91304o3636n3327l3822k9013n741p595M753j722J376J5804k697l0312k1671
10895C63701j8013k1850j9710j1563j8936k019J9262l5836m3377k2757J7978M629
10883B11509j6092l651j530k2409l016K325j8066O768Q611P991q565r918J3092
$$ y = [160779, 158806, 129963, 125486, 122339, 122654, 109058, 109089, 122123, 130117, 108116, 87012, 82411, 94011, 99384, 92743, 87556, 126518, 133186, 118946, 104096, 104477, 112347, 118308, 120138, 128228, 127135, 115680, 109997, 91546, 93199, 113217, 147667, 156186, 167482, 189255, 184461, 193726, 187396, 197068, 207104, 208464, 200189, 233520, 277609, 299332, 308312, 357814, 434874, 535858, 709579, 916727, 1160874, 1386269, 1566067, 1664613, 1607919, 1372898, 1076175, 829508, 683521, 591304, 527668, 474341, 440519, 411506, 405765, 398170, 402923, 401201, 402577, 418381, 415684, 385372, 363701, 345688, 323838, 304128, 292565, 273629, 271610, 290872, 255036, 211659, 188902, 206880, 211509, 195417, 191766, 190236, 167827, 164811, 167136, 149070, 155838, 164449, 172440, 163875, 153957, 167049]
10870A67049o350J8912K1461q63j3830j8632j9120R17n591p346j8501M586q144
10857A14548R034O587J4730K2621j690j2881J5577j0023j6508J0283j4912k2120
10845A15246R469J6617K2085J8648p673j3670K1465P000j9018k598K329K638k069
10832A70469N056l003J7829j211l918O846l615K833j3273P212n922k7593j1649
10819A40061L3399J6026K379R178M555j7535k7084j8200k7995j4212n002R618
10807A05188l8400j1934R014j2931j3072J3189N5774M0489M7459M7771L0358J4884
10795B87789K6579L25O871P823k268j3649j6540n072l726J7519L4832m196K0790
10782C57077L2895J7447M0254Q6776J23450J75730K21933K15780J84451J30996
$$ y = [167049, 160699, 179611, 201072, 200209, 186379, 167747, 148627, 149544, 143953, 136607, 118106, 122692, 114548, 123582, 130169, 144899, 167520, 165830, 152949, 168526, 158503, 141995, 152278, 137366, 115246, 124715, 141332, 163417, 182065, 174392, 160722, 182187, 189187, 170169, 167571, 169900, 172538, 170469, 175525, 172522, 190351, 189140, 185222, 192068, 188453, 191286, 178013, 185225, 179303, 151710, 140061, 173460, 189486, 191865, 201043, 205598, 188063, 160979, 142779, 114784, 100572, 95570, 105188, 66788, 54854, 63868, 50937, 37865, 51054, 106828, 147317, 194776, 242547, 272905, 287789, 314368, 314693, 321564, 329387, 327119, 313470, 296930, 291858, 288132, 305651, 340483, 336287, 357077, 389972, 407419, 447673, 534449, 657899, 833629, 1055562, 1271342, 1455793, 1586789]
10772A586789N9174j5643j31485k04117j95045j89987j57870j29806j08027n9750
10762D54233l654j8785k4055j0111k9137Q043M1641J6671k2051m1739k7780o42
10750C42634p923j5337Q70M278L563j5081J4926K369k4643m9974j3634R076Q834
10737B59958j4670j6832K4211J0837K5873p745L358p232L665j166j6936j3999
10725B49322M383k0090j4250M117J3354R866L0901J7499o253j027l0671n421J4224
10712B65954P125P672L1909M392m0581l8944l9181k6914m674j112L641J7084P062
10699A93433l1000m486L4824K2105j4134M166r846l0310j0235J7891m086L3356
10687B01678L2185P122k2340m4176l6090k4895j0133j5601L69K4855j5821M380
$$ y = [1586789, 1645963, 1630320, 1498835, 1294718, 1099673, 909686, 751816, 622010, 513983, 454233, 450579, 431794, 407739, 397628, 368491, 376534, 418175, 434846, 412795, 371056, 343276, 342634, 334711, 319374, 320244, 324522, 328085, 313004, 327930, 330299, 305656, 255682, 242048, 251124, 259958, 245288, 228456, 252667, 263504, 289377, 281632, 284990, 277758, 281423, 280257, 263321, 249322, 253705, 233615, 219365, 223482, 236836, 246702, 277603, 295102, 288849, 287822, 257151, 251730, 265954, 273079, 280751, 312660, 317052, 276471, 237527, 198346, 171432, 166758, 165646, 169287, 186371, 193433, 162433, 157947, 192771, 214876, 200742, 204908, 195062, 164752, 154517, 172408, 168322, 201678, 233863, 240985, 218645, 174469, 138379, 113484, 103351, 87750, 88119, 112974, 97153, 101533]
10675A01533J2323L0024Q290K5722K3689J635J9628J151q14J7243K6898L4684
10663C02006J4374N132O841L6953K2522R176J1110M055K2900J5774J6120n0939
10651D16024n3820k1613j2279j3116k4002m020K0587J2558L447K1095L595j9219
10639C29237m0809k0743l935j4741j3984J545K2872M6787K6880n414N9235Q1913
10627D68843P8567N3084N5293L8537N4719J3686l272l1553m7269j1690J2591K88
10615F81824p251j5200r12j0866k686m9284j8116M539j4125j069J6645j774J244
10602E82969J348l2270p623J9623J0155K306J4323K7974J267l608j0568j7158
10590E88738N893o184J9784J6080p016J7003R345N224K1931J5955J3982J6135
$$ y = [101533, 113856, 143880, 152170, 177892, 201581, 203216, 222844, 223995, 223181, 240424, 267322, 302006, 316380, 321512, 328353, 365306, 387828, 397004, 408114, 412169, 435069, 450843, 466963, 416024, 362204, 340591, 328312, 315196, 291194, 287174, 307761, 320319, 323766, 344861, 348456, 329237, 288428, 267685, 263750, 249009, 235025, 236570, 259442, 306229, 333109, 327695, 386930, 468843, 547410, 600494, 655787, 694324, 749043, 762729, 759457, 727904, 680635, 668945, 681536, 681824, 674573, 659373, 658461, 647595, 644909, 595625, 577509, 582048, 567923, 566854, 583499, 581725, 582969, 584317, 552047, 544424, 564047, 574202, 576508, 590831, 618805, 620072, 616464, 605896, 588738, 594631, 588447, 608231, 624311, 617295, 634298, 643643, 648867, 670798, 686753, 700735, 716870]
10578G16870o51K283k1948j9777N788J7771J3010L3399K2009k0702k002n457K1863
10565G62456M4233L6573l115n765J4831K2232L5899j0936N818J7448K950K2221
10553I44845P820L0352O6999P0019P5195P3954L6161K0530K9542L5437L8798N0476
10541A480128O2402Q9603R9526J19072J17650P3294O8351M0509N6090P6110O5005
10530B347740J00876J21334J28914J58581J87162K27839K55176L02971L68248
10521D198841L86563M52517N49914O58428P28101P53588P44581P69138Q08713
10512A0050384Q31954R84935J250139J699502K392499L314312M488350O183225
10504C1195300Q785522J2826652J9083154K8375360M0061693M9123411M8266769
$$ y = [716870, 716219, 718502, 696554, 676777, 682565, 700336, 713346, 746745, 768754, 748052, 746050, 740593, 762456, 806689, 843262, 840147, 834382, 849213, 871445, 907344, 896408, 902226, 919674, 922624, 944845, 952665, 983017, 1050016, 1120035, 1195230, 1269184, 1305345, 1325875, 1355417, 1390854, 1429652, 1480128, 1542530, 1632133, 1731659, 1850731, 1968381, 2041675, 2110026, 2150535, 2206625, 2282735, 2347740, 2448616, 2569950, 2698864, 2857445, 3044607, 3272446, 3527622, 3830593, 4198841, 4585404, 5037921, 5587835, 6246263, 6974364, 7727952, 8472533, 9241671, 10050384, 10882338, 11867273, 13117412, 14816914, 17209413, 20523725, 25012075, 31195300, 39980822, 52807474, 71890628, 100265988, 140327681, 189451092, 237717861]
10497B37717861L8923036K3982134o496285m6481684o1566219m9058906l2303478
10490A04716459k0669491j3558910r264383o667017n042497l965428l316718k912914
10482C9319101k540713k193221j900612j689559j520859j469085j547583j579230
10474B4878239j452498j248924j055688r23088q07429p52606o74572o39140n97779
10465A6726515n55129n68432n58334n91690n99905n54383m93527m31735l66854
10456A2006526l31808k96124l05439k84749k10634j81279k06119k24319j94170
10447I771885k28927k20139k60051k93531k89867k51642k32380k39748k02351
10438G553249j90077j94556j76645j50275j43732j20561j01125r3444j19716r8694
$$ y = [237717861, 276640897, 300623031, 294126746, 247645062, 186078843, 137019937, 104716459, 84046968, 70488058, 61223675, 54556658, 49514161, 45548733, 42232015, 39319101, 36778388, 34585167, 32684555, 30994996, 29474137, 28005052, 26457469, 24878239, 23425741, 22176817, 21121129, 20198041, 19390612, 18638006, 17963434, 17324294, 16726515, 16171386, 15602954, 15044620, 14452930, 13853025, 13298642, 12805115, 12373380, 12006526, 11674718, 11378594, 11073155, 10788406, 10577772, 10396493, 10190374, 9966055, 9771885, 9542958, 9322819, 9062768, 8769237, 8479370, 8227728, 7995348, 7755600, 7553249, 7363172, 7168616, 6991971, 6841696, 6697964, 6577403, 6476278, 6382834, 6263118, 6164424]
10428F164424r1570o8665o0369q7749m0970l7700L1986Q7033J79546K42901K40187
10417F559054K02073J22358L8300n5860j61259j98552j50261j39477j20511j03508
10407E992357p2789j06334j64331j63294j33525j29015j06774n6585j8313K5071
10397E066468Q0099J40705J87493K66026L63297M02054M94286N37103N03746N12704
10387H553981M62255M13186M18964N73710P58235R89309J310978J725373K322599
10378A7528590L123462M369187O289473R326698J4086903K0472331K7044911L3273829
10370A35515384L9788916M1029437L0696474J9446230J1090976r506526l2534749
10363B35526142l5521323l3406724l4091245k9087873k0504504j3680682r161475
$$ y = [6164424, 6072854, 6004189, 5943820, 5856071, 5815101, 5777401, 5809387, 5896420, 6075966, 6318867, 6559054, 6761127, 6883485, 6921785, 6865925, 6704666, 6506114, 6355853, 6216376, 6095865, 5992357, 5919568, 5813234, 5648903, 5485609, 5352084, 5223069, 5116295, 5059710, 5041397, 5066468, 5146567, 5287272, 5474765, 5740791, 6104088, 6506142, 7000428, 7537531, 8041277, 8553981, 9016236, 9429422, 9848386, 10422096, 11180331, 12169640, 13480618, 15205991, 17528590, 20652052, 25021239, 31310712, 40637410, 54724313, 75196644, 102241555, 135515384, 175304300, 216333737, 247030211, 266476441, 277567417, 268060891, 235526142, 200004819, 166598095, 132506850, 103418977, 82914473, 69233791, 60072316]
10356F0072316o383269m709000l804999l325187k904157k540749k250117j969301
10348C2185537j731538j493369j281054j162403j101595j014560r63328j036358
10340B2401332j031685r18428r00261q59021p51281o78651o20120n70375n56253
10331A5515257n66520n31029m80335m68375m10807l50674l42038l62719l15706
10322A1687054l02132l17718l27180l24688l12716l40410l14946k58660k37708
10313H950896k24482j94681j81947j38093j24608j19237p4977l7000m74L5943
10303G891340P6277Q8321P9610l8957j39982k37945l42655l72505l28345k69593
10293F405566j99361j55147j34257j06880q0626q0299j45120j61860j95043j88214
$$ y = [60072316, 53689047, 48980047, 45175048, 41849861, 38945704, 36404955, 34154838, 32185537, 30453999, 28960630, 27679576, 26517173, 25415578, 24401018, 23437690, 22401332, 21369647, 20451219, 19550958, 18691937, 17940656, 17262005, 16641885, 16071510, 15515257, 14948737, 14417708, 13937373, 13468998, 13058191, 12707517, 12365479, 12002760, 11687054, 11384922, 11067204, 10740024, 10415336, 10102620, 9762210, 9447264, 9188604, 8950896, 8726414, 8531733, 8349786, 8211693, 8087085, 7967848, 7892871, 7855871, 7855397, 7891340, 7967617, 8055938, 8135548, 8096591, 7956609, 7718664, 7376009, 7003504, 6675159, 6405566, 6206205, 6051058, 5916801, 5809921, 5729295, 5648996, 5503876, 5342016, 5146973, 4958759]
10283D958759j60300j19239q8930q8904p3018o2629n7039p2024o6841m1807m8067
10272D079961p4690p4344m9614p7557p2028o3928m4941m0233r084j9623J1287
10261C565206K8373L4550M9023Q4907J13395J15654J18850R7677R1145J10335
10251D409115J34677J69836K84386M47906O70521R48288J389523K103337L110462
10242A3668051M329679N435057N806385N089056L361846L23103l615481o254847
10234B8142849o255246m762474l221379k114430j436976j021739p34191n78140
10226H018274m55485l75538l36880l31310k72571k37135k03890k32646k16674
10217E356145j87654j90256j77077j26632r3021j25330j17183j00806p9825l5603
$$ y = [4958759, 4798459, 4679220, 4590290, 4501386, 4428368, 4365739, 4308700, 4236676, 4169835, 4128028, 4079961, 4005271, 3930927, 3881313, 3803756, 3731728, 3667800, 3622859, 3582626, 3573542, 3553919, 3565206, 3593579, 3628129, 3677152, 3762059, 3875454, 3991108, 4109958, 4207635, 4298780, 4409115, 4543792, 4713628, 4998014, 5445920, 6116441, 7064729, 8454252, 10557589, 13668051, 17997730, 23432787, 29239172, 34328228, 37690074, 38013177, 34397696, 28142849, 21887603, 17125129, 13903750, 11789320, 10352344, 9330605, 8596414, 8018274, 7562789, 7187251, 6850371, 6519061, 6246490, 6009355, 5805465, 5572819, 5356145, 5168491, 4978235, 4801158, 4674526, 4581505, 4456175, 4338992, 4238186, 4158361, 4122758]
10207D122758k6569k3840k5335k0084J0140K9613N4974L9262O6526P2758O0466
10196D360669L5606J275O752K4555Q9260J41479J63332J95909J98215J43237P6907
10185E437196M909j3389M2213O4499Q8031R5212P7923R1938P8155P7378J32493
10174F176558J41934J95359K16535K53285K51533K71034L27335L72901L91281
10165H597755M28771M84806M78815N36559O12000O78762P48839P97470Q50222
10156A4213999R22269R76145J066122J151867J260248J307963J370139J412367
10148B3681119J410655J416825J405520J307718J195927R97424P80386N38435
10140C2734009K88390K9944k14096m00862o22014q30343r95283j098492j196637
$$ y = [4122758, 4096189, 4072349, 4047014, 4026930, 4037070, 4066683, 4121657, 4160919, 4227445, 4300203, 4360669, 4396275, 4397550, 4404302, 4428857, 4518117, 4659596, 4822928, 5018837, 5217052, 5360289, 5437196, 5442105, 5428716, 5470929, 5535428, 5623459, 5718671, 5796594, 5888532, 5966687, 6044065, 6176558, 6318492, 6513851, 6730386, 6983671, 7235204, 7506238, 7833573, 8206474, 8597755, 9026526, 9511332, 9990147, 10526706, 11138706, 11817468, 12566307, 13363777, 14213999, 15136268, 16112413, 17178535, 18330402, 19590650, 20898613, 22268752, 23681119, 25091774, 26508599, 27914119, 29221837, 30417764, 31415188, 32195574, 32734009, 33022399, 33052343, 32838247, 32437385, 31815371, 30985028, 29989745, 28891253, 27694616]
10131B7694616j299200j311078j283729j213695j154208j094575j000898r05099
10123A8432134q43001q25299p84984p23790o62888o20491n78306n37308n05840
10114A2350227m95249m48975m18978m04306l86932l78986l38849l17967l29803
10105H830182l34353l00145k55937k46382k36188k28655j84561j79845j58634
10096F705482j40164j34137j04887j03565j21398j43408k12538k32823k28675
10087E283887k15296j52688j18055j25955j19452j04034q7750q9140p2833k4584
10077D174100j5867K8064P7289J26782J87318J46339Q7461l099j93420k98633
10067D316334l12538j98026j11168q8740q4086r7056j48211j27231j02403j47219
$$ y = [27694616, 26395416, 25084338, 23800609, 22586914, 21432706, 20338131, 19337233, 18432134, 17589133, 16763834, 15978850, 15255060, 14592172, 13971681, 13393375, 12856067, 12350227, 11854978, 11406003, 10987025, 10582719, 10195787, 9816801, 9477952, 9159985, 8830182, 8495829, 8195684, 7939747, 7693365, 7457177, 7228522, 7043961, 6864116, 6705482, 6565318, 6431181, 6326294, 6222729, 6101331, 5957923, 5745385, 5512562, 5283887, 5068591, 4915903, 4797848, 4671893, 4552441, 4448407, 4360657, 4271517, 4198684, 4174100, 4158233, 4186297, 4263586, 4390368, 4577686, 4724025, 4811486, 4808387, 4614967, 4316334, 4003796, 3805770, 3694602, 3605862, 3521776, 3424720, 3276509, 3149278, 3046875, 2899656]
10057B899656j01268n2491p9831j00303p5013o5307n6123o3536p8482n9498k7543
10046B140261l8087m9124m6331o4259l1866k5633n3365m4395l5424O583k1795
10035A736565k6747j7511m320j9127n0958m8702k5003j1956k6963q4113m0708
10024A380457k5159m8217l8213j5282k8771k9073j624P142o81p119l2733J051
10012A161778L773r537m1160k0873k9704l1003l972k706j8151j2266k3352j1493
10000I61334k139j7745k2087l0222r350j8821j3529j9742J808j4653l0098k1504
9988G63252o814n342l1090j4989j737J794J1930k0474l1886J5520o138l0401j0817
9975F32808J9054R660j3364k2148j3793M781K2243J3470K5951K6566K3698J5915
$$ y = [2899656, 2798388, 2745897, 2666066, 2565763, 2490750, 2425443, 2369320, 2305784, 2227302, 2167804, 2140261, 2102174, 2053050, 2006719, 1942460, 1910594, 1884961, 1831596, 1787201, 1751777, 1758360, 1736565, 1709818, 1692307, 1687987, 1668860, 1617902, 1569200, 1544197, 1532241, 1505278, 1421165, 1380457, 1355298, 1307081, 1268868, 1253586, 1224815, 1195742, 1194118, 1201260, 1200579, 1193460, 1160727, 1161778, 1165551, 1156014, 1114854, 1093981, 1064277, 1033274, 1029302, 1026596, 1008445, 996179, 972827, 961334, 959195, 941450, 919363, 889141, 879791, 860970, 847441, 827699, 829507, 814854, 784756, 763252, 756438, 751096, 720006, 705017, 703280, 705074, 717004, 696530, 664644, 680164, 674026, 643625, 632808, 651862, 661522, 648158, 626010, 612217, 616998, 639241, 652711, 678662, 705228, 728926, 744841]
9963G44841N1991P6391J05236J44135K02879K17777J96977J28754P7268M22j45485
9952A801186j87881j88868j81703j81116j39554r0055n9403k2112j0391l3579
9942G06524n3029j7102j5367j7906N504j8767k8809k5307k4569R355j9554N496
9930E06469K0546j1128n368o451l0009j8044J4447J6226P188M2021M9552Q1028
9918F66477P1648Q6163N3368K4722k4561p8472p9448p2053o3616n7915l1882j5043
9906D79388l5220l3760L592k2168j28P929q819j2844O933k12k5464k3762M746
9893C40211M003r377l258K1664N660j388j3934j3635j1668l349O132J2948q20
9880C33189K512L144k2192Q30M389J7284J5624J0890P927n819Q198l1479l0202
$$ y = [744841, 796832, 873223, 978459, 1122594, 1325473, 1543250, 1740227, 1868981, 1946249, 1946671, 1801186, 1613305, 1424437, 1242734, 1061618, 922064, 832009, 772606, 750494, 740103, 706524, 653495, 636393, 621026, 603120, 608624, 589857, 561048, 535741, 511172, 520527, 500973, 506469, 527015, 515887, 510519, 504068, 474059, 456015, 470462, 486688, 493876, 535897, 585449, 666477, 738125, 824288, 877656, 902378, 877817, 799345, 719897, 647844, 584228, 526313, 494431, 479388, 444168, 410408, 414000, 391832, 391704, 399633, 390814, 377970, 384903, 384691, 359227, 335465, 340211, 344214, 334837, 331579, 353243, 358903, 357515, 343581, 329946, 318278, 314929, 321061, 334009, 333189, 335701, 338845, 316653, 317483, 321872, 339156, 354780, 365670, 373597, 367778, 375976, 344497, 314295]
9867C14295m238o597j7693j5605P133K8806J2007R92j0966J4077J9670l5040j6832
9854B90009n407j1545K630J7679k999k633Q033l083p332j7119j7206K47K3227
9841B74501J6891K1003L2515K2831K6215J8235J650J3569j4355k1035l0479k6760
9829C34781k4455L331k1137j2636r594R505J3634j047L9611N3421J1629j8545
9817C78498l515J4608J5017L2742J1096o789m2518j8094j4010K3384j623k7852
9805C60944l1762J914L936J1205J7295k779R479L606m471K044L0503L6436J5209
9792D53559j0845J7439L7862K5281J0768K7423O7306N1884N4272P1908Q4518O3255
9780I54630O3132O6729O3018R4377J16148J12022J35023J79050K27256K67556
$$ y = [314295, 310057, 303460, 285767, 270162, 277295, 306101, 318108, 319100, 308134, 322211, 341881, 306841, 290009, 284602, 273057, 275687, 293366, 290367, 287734, 295767, 292684, 285352, 268233, 251027, 251274, 274501, 291392, 312395, 344910, 367741, 393956, 412191, 413841, 427410, 413055, 392020, 361541, 334781, 310326, 313657, 292520, 279884, 270290, 279795, 293429, 292382, 331993, 385414, 397043, 378498, 374983, 389591, 404608, 437350, 448446, 441657, 399139, 381045, 367035, 390419, 388796, 360944, 329182, 331096, 335032, 346237, 363532, 360753, 370232, 373838, 369367, 371411, 401914, 438350, 453559, 442714, 460153, 498015, 523296, 534064, 561487, 628793, 680677, 734949, 806857, 891375, 954630, 1017762, 1084491, 1147509, 1241886, 1358034, 1470056, 1605079, 1784129, 2011385, 2278941]
9770B278941L41289L93187M71522N56788N84924O21823N72067M88186L23739R1031
9760F723497j88407l80803m76924n08833n06985m95206m41970l66168l07056k61959
9750B789186j96299j84165j78077j33366j19712j25357j15976j02053q8098p8480
9740A467603o6090n1851o8501o5254l9036m6008n6022l8780j0600l1340n0238
9729I43883l7625n4356k6209k8641j6660j1466N772p516N376J3162j8535m697
9717G62488M039j9753j9812m0584n1091j0402l3118l2765j9147j2800o382j2543
9705E08130m6292j1216k3472l0876N272J7749J7722k1116l5530p643J0568O129
9693C89425j5809j8199k1580Q472J10l0567m5278k9621P626Q10m327P892J7685
$$ y = [2278941, 2620230, 3013417, 3484939, 4041727, 4626651, 5248474, 5820541, 6308727, 6632466, 6723497, 6535090, 6154287, 5677363, 5168530, 4661545, 4166339, 3724369, 3358201, 3051145, 2789186, 2592887, 2408722, 2230645, 2097279, 1977567, 1852210, 1736234, 1634181, 1546083, 1467603, 1401513, 1349662, 1281161, 1215907, 1176871, 1130863, 1074841, 1036061, 1025461, 994121, 943883, 906258, 851902, 825693, 797052, 780392, 768926, 774698, 767182, 772558, 785720, 767185, 762488, 766527, 746774, 726962, 686378, 635287, 624885, 591767, 559002, 539855, 527055, 520673, 508130, 461838, 450622, 427150, 396274, 401546, 419295, 437017, 415901, 380371, 372728, 383296, 389425, 373616, 355417, 333837, 342309, 342419, 311852, 266574, 236953, 244579, 245389, 241062, 248954, 266639]
9680B66639J8852k863j7430j1770j4214k085R389k2898o43N502q593l8778k7865
9667A53243K61K69J4899K9575J4747j3090p059l712r848N653n211m503k5248j3967
9653A36009n170q77p17J3237k16J105j8133q466J6484m431l0107P95Q667q299
9639I9881M57J1108L6047R464m575l4089j6025O036q967K8768L1269l4149o553
9626A18672m486p252j0087j4112j74j4235j9705j2159Q281K6973r828n716p290
9613D8882L1061j7925k3025R364K8813L0226P172j6497k2414J0911M284j067j2921
9600G6864n677N935j4608M507r974N244o077J982N823l711L068R896n024j5830
9586E2418N455j847k1918m509j5613K0169L3489r483J7833p994k9252j4946J1240
$$ y = [266639, 285491, 282628, 265198, 253428, 239214, 237129, 246518, 223620, 222977, 228479, 219886, 181108, 153243, 153504, 153773, 168672, 198247, 212994, 199904, 192845, 189133, 179285, 184938, 179727, 175224, 149976, 136009, 130839, 129962, 129245, 142482, 142266, 143371, 125238, 116772, 133256, 128825, 98718, 99513, 108180, 99881, 100338, 111446, 147493, 156957, 152382, 118293, 102268, 108304, 99337, 128105, 159374, 125225, 118672, 114186, 106934, 96847, 82735, 82561, 68326, 48621, 36462, 44743, 71716, 61888, 56172, 48882, 79943, 62018, 38993, 48357, 77170, 107396, 114568, 98071, 75657, 86568, 90852, 89785, 76864, 71187, 77122, 62514, 67021, 57047, 62291, 56214, 58196, 64019, 60308, 63376, 73272, 68248, 52418, 57873, 56026, 34108, 29599, 13986, 34155, 67644, 58161, 75994, 68000, 38748, 23802, 35042]
9573C5042M4387J5736m463k4264Q162L203r318l606R515J3409P215J2539j5423
9560I2134q656J4642L239j3447k2348k7682j4469J7723J7210J66j1589j953k1928
9547B3042j245J2509M876P124k5806n03K8229J6900M381k0298j8024j444Q284
9534C8025K677j8798K355J1357N554n540j9075J0062J8117K0899j7069j6781k191
9521B9592K202j870J0615J4671J9231R655j0614p731q152j2860K711j3255p323
9508B6872n474J6843K7454j4785p432K019p999j983J7747J5058j8938N20K96J32
9494E0330j8382j2632L623K2333P403N615j5967k2690j5980k906J0692L7307J7090
9481F5836j5613k1530j3357m854L2053k295k4979K2494J8071k4167k3960J2858
$$ y = [35042, 79429, 95165, 90702, 66438, 74600, 77803, 68485, 64879, 74394, 87803, 95018, 107557, 92134, 83478, 98120, 101359, 87912, 65564, 37882, 23413, 41136, 58346, 58512, 46923, 44970, 23042, 21797, 34306, 39182, 46306, 20500, 19997, 48226, 65126, 69507, 49209, 31185, 29741, 38025, 40702, 21904, 24259, 35616, 41170, 35630, 16555, 26617, 44734, 65633, 48564, 31783, 29592, 31794, 29924, 40539, 55210, 74441, 84096, 73482, 65751, 57599, 44739, 47450, 34195, 26872, 21398, 38241, 65695, 50910, 43478, 45497, 37498, 35515, 53262, 68320, 49382, 49902, 50198, 50330, 31948, 19316, 22939, 45272, 52675, 58290, 42323, 19633, 3653, 747, 11439, 48746, 65836, 50223, 28693, 15336, 10482, 42535, 40240, 15261, 37755, 55826, 31659, 7699, 20557]
9469B0557l390L3273L087j7524j0107K0022P831r224k6432k777J1713j0922j6812
9456g05J4000R29k0716Q516L857R764L0106J4251j1961m592j1740q432R562J9565
9442E2404j2481K4694l601k5237j2581N840K4693J1471m611m424K0114m632j6353
9429E5296k082k593N051j6206j9981N325j899j3374j0078j0260K5633P854O378
9416B9064O166k787J903L504o821j986k858K1616n442l656j4357j4003j5341k0093
9402b5091r824J3167K9628K6426l251J4554Q52j6038j6195k1378K6489Q435j565
9389B6209l319J057L958p633r263j3163L770J3845L4068K255M171j1276j1643
9376C3036j6166r038K0635J8748J1621j0833k5450o994Q952J1231R54K297K191
$$ y = [20557, 17167, 50440, 53527, 36003, 25896, 45918, 53749, 44525, 18093, 15316, 27029, 16107, -705, 13295, 14224, -6492, 2024, 5881, 15645, 45751, 60002, 48041, 43449, 31709, 23277, 32839, 52404, 39923, 64617, 61016, 35779, 23198, 29038, 53731, 65202, 60591, 56167, 76281, 71649, 55296, 53214, 50621, 55672, 39466, 19485, 24810, 22911, 9537, -541, -10801, 14832, 22686, 29064, 35230, 32443, 34346, 37850, 31029, 29043, 26185, 47801, 42359, 38703, 24346, 10343, -4998, -25091, -34915, -21748, 7880, 34306, 31055, 45609, 46461, 30423, 14228, -7150, 19339, 27774, 26209, 22890, 23947, 27905, 20272, 11009, -2154, 1616, 15461, 49529, 51784, 55955, 44679, 33036, 16870, 7832, 28467, 47215, 58836, 48003, 22553, 15559, 24511, 35742, 36696, 38993, 41184]
9363D1184k6402R384J3328O267j302j5711K1154K7566N484j2462k6871k2621k1973
9350b975J2927P208j4748K5270R176j3997p151j1898L081J369p67j1580j5477
9337a9562J5583R401M009K7374J0449k010n885K2177J1778J2004j6332m6733k5930
9324c677j655K621J7494o953M430j669r804M926K2720K3009R340O806J020k0155
9310D8453r571K895n231j6520J745J8178J1562m224K206k856m977j5432K114L711
9296C2053l4271R650L7221p328j042J2446K9355K2944M535J6586l6829j4869j0438
9283F0013j6784j3319J7515k484j3579r454K8316j3664q642j493o565J2547J7107
9270D9514J4943o229p217L6642n423k7681j3966P596J7302j1015r317J6565n176
$$ y = [41184, 14782, 24166, 37494, 43761, 42459, 26748, 47902, 75468, 80952, 68490, 41619, 18998, -2975, 9952, 17160, 2412, 27682, 36858, 22861, 15710, 3812, 6893, 8262, 7495, -4085, -19562, -3979, 5422, 9431, 36805, 47254, 45244, 39359, 61536, 73314, 85318, 68986, 22253, -3677, -5332, -2711, 14783, 7830, 12260, 10591, 787, 5713, 28433, 51442, 60782, 67588, 68608, 48453, 38882, 41777, 36546, 20026, 21771, 39949, 51511, 47287, 49493, 46637, 41660, 26228, 28342, 32053, -2218, 7432, 44653, 37325, 36283, 48729, 78084, 101028, 105563, 122149, 85320, 70451, 60013, 43229, 29910, 47425, 44941, 31362, 21908, 50224, 36560, 27918, 26425, 19860, 32407, 49514, 64457, 58228, 51011, 87653, 82230, 54549, 40583, 48179, 65481, 54466, 45149, 61714, 56538]
9257E6538j6899j0134j357j3020j522N693k040K3375o558M621j4445o48J2836
9244C6440j5974r728M959q810o838P750L0459J8145r994m429q350K6629J1062
9231G1321l0953j7229j0993p364R94j5182R549R503K485p338n730J410K6495M1101
9217F8069N951R281r559j6868j2514k675J3802n068m120K2103N228J787k1j8120
9203E7276L946n263k2135R739k568M003M658k6896J0381n443Q419L3299K5400
9190I4816k376L4k8183j9499j2023L4241K7287K41M604R466j3521j2261n571p542
9176F9713j1377r290J0403J0612R927J4796J9458n6j437n733J1303M417k6572
9163I6164l127Q357o695J6437J8574J5283L276m625m355n817p469J9966R064L365
$$ y = [56538, 39639, 29505, 28148, 15128, 13606, 19299, 17259, 40634, 34076, 38697, 24252, 23604, 36440, 20466, 10738, 15697, 6887, 49, 7799, 38258, 56403, 46409, 41980, 33630, 60259, 71321, 40368, 23139, 12146, 4782, 5776, -9406, 143, 9646, 12131, 4793, -937, 473, 26968, 68069, 74020, 83301, 73742, 56874, 44360, 41685, 55487, 50419, 46299, 68402, 73630, 75417, 75396, 57276, 61222, 55959, 33824, 43563, 40995, 44998, 49656, 22760, 33141, 27698, 36117, 69416, 94816, 92440, 92474, 64291, 44792, 32769, 67010, 94297, 94538, 99142, 108608, 95087, 82826, 77255, 69713, 58336, 49046, 59449, 70061, 79988, 94784, 114242, 114186, 112749, 107016, 118319, 122736, 96164, 93037, 101394, 94699, 111136, 129710, 144993, 148269, 143644, 139289, 133472, 126003, 145969, 155033, 158398]
9149A58398K9855J4237j8712p653j6785j7369k1263K1239l586M082J8813l668
9137A57588l46K771j9034j7334l3051k6194L563J9858M815K0019k596o207q65
9124A02987k6137K182M746J3372J8737J3452j8925l1699Q072q02j0954o158K2541
9111I1414l429j3191K0289Q039k1399k9634R676K3822M320q936J4034r232p104
9098G8669l2402r03K5231q071m527J3934j3386q27R989J7893J9504P151n862l1028
9084G5365k111j0030J436l02m178k2442j3809M475M6202n244n907K2831M220j143
9070H9363m969j0117J1071l685l667r359k748L73m511L594K91M461n351J52J2778
9055G7676l736k5624j3708J5230O623K4159J383k1866mM2441j4369l2184q525
$$ y = [158398, 188253, 202490, 183778, 176125, 159340, 141971, 120708, 141947, 138361, 142443, 161256, 157588, 157242, 160013, 140979, 123645, 90594, 64400, 67963, 87821, 92636, 112655, 110059, 103852, 102987, 76850, 79032, 83778, 97150, 115887, 129339, 110414, 78715, 86787, 85985, 75031, 68873, 91414, 87985, 74794, 95083, 103122, 81723, 52089, 61765, 85587, 89907, 80971, 95005, 85773, 78669, 46267, 45364, 70595, 62524, 57997, 71931, 58545, 57718, 67707, 85600, 105104, 112255, 106393, 75365, 73254, 63224, 64660, 64358, 60180, 37738, 23929, 28404, 74606, 69362, 63455, 86286, 90506, 89363, 84394, 74277, 85348, 81663, 77996, 68637, 65889, 66262, 61751, 65345, 65636, 70097, 64746, 64898, 77676, 73940, 48316, 34608, 49838, 56461, 80620, 82003, 60137, 60133, 102574, 88205, 56021, 47496]
9042D7496J8510j0814j9841J7724J7129J3847J7880j7991j3987J1593j5952l217
9030F2377j0449L179o335j8182L1478L5720j2305j3917m747r137m254Q434l879
9017E7983r928n776m094J7998j7736J1404K6487j0703j0098j8792j4258J4456
9005C6943j0192J2405R087L606K6477K1942Q385l1892l0671l0144o33J0853o330
8992A9836J4577J542q134O201K4711k8028M322j508j7504j0375J2308J8047J2359
8979D8354k31j7708n232N088n864j3705R285M728J0593J0346N892q227j6104L332
8965C0547J123j1494j0353p920J8238P288p038J3551M73L572J1782J5211n757
8952E9223o968j6578m094m544n360Q43j6627r961J2005K8064Q147k142j3748r404
$$ y = [47496, 66006, 55192, 35351, 53075, 70204, 84051, 101931, 83940, 69953, 81546, 65594, 62377, 51928, 55107, 48772, 30590, 62068, 97788, 85483, 71566, 66819, 57682, 53428, 61862, 57983, 48055, 42279, 38185, 56183, 38447, 49851, 76338, 65635, 55537, 36745, 22487, 36943, 26751, 39156, 48243, 51849, 78326, 100268, 108653, 76761, 46090, 15946, 15313, 26166, 19836, 34413, 35955, 27821, 34022, 58733, 30705, 35027, 33519, 16015, 5640, 17948, 35995, 48354, 48123, 30415, 25183, 30271, 24407, 10702, 19987, 24715, 35308, 45654, 51546, 43319, 27215, 30547, 31670, 20176, 9823, 1903, 20141, 27429, 20391, 33942, 34415, 37987, 49769, 64980, 59223, 52255, 35677, 31583, 27039, 21679, 22522, 5895, -4066, 7939, 36003, 44150, 42008, 28260, 18856]
8938A8856Q586J6108n659l1304k0395K9782K3829O561J620k2432j7890j9968k8067
8925d0373J1794J0891J2037M399J2761J9111Q816K021o618n403J7952j2742k5964
8912H682k5960R41J1853Q346K3419J2731r786j3274j1784O634o210K4388j5888
8899A4092p34O85k6707L467J6749k279J59O52p07p535o43K6466N444L448p747
8884B4810K4302J7179j9483m397N616Q923J3022j8505j1698n680M248j6456K646
8871B4527j4745J0240J2533O451j9423j2921j9278q684K1483O570P404J6461Q960
8858C9578j7983o745k443l112Q054J2938J4304O59J2936k4152l890p628N02p730
8844A5288O399R5j2732O646J5755o907l383Q421k206J0197J9559K40j217j0647
$$ y = [18856, 27442, 43550, 37891, 6587, -13808, 15974, 39803, 46364, 47984, 25552, 7662, -12306, -40373, -28579, -17688, -5651, -1252, 11509, 30620, 39436, 41457, 34839, 29436, 47388, 34646, 8682, -17278, -16337, -4484, 3862, 27281, 40012, 30226, 16952, 5168, 11802, 5592, 29980, 14092, 13358, 14043, -12664, -9197, 7552, 5273, 5432, 6084, 5377, -2158, -2801, 23665, 29109, 32557, 24810, 49112, 66291, 46808, 42411, 48027, 56950, 69972, 51467, 39769, 34089, 38337, 21881, 24527, 9782, 20022, 32555, 39006, 19583, 6662, -12616, -21300, 183, 6753, 14157, 30618, 39578, 21595, 14850, 12407, 9295, 17349, 30287, 44591, 45250, 58186, 34034, 30144, 22516, 23018, 15288, 21687, 21782, 9050, 15696, 31451, 24544, 21161, 29582, 27376, 37573, 57132, 57372, 56155, 45508]
8830D5508k4387N266J1722j394m571j4061K5954J784j9802m446Q882P148q634
8817B8969J1206j2275l4377j860N207j1740J1477J7305J9118O998R702r279k5456
8804A4995j1149o012j4761P919L3526r222o946J9364J224J1828j497M613j3123
8791C0759k7743j8961L5985J9800k0800m111K9814J705r593o382k4003q347m890
8778f767j070J0256k58J8999K2724j8084k8246K3585K2068J3925j7037r655k1334
8765I106k3081K4204J0321J4900Q978N228q548j0398l460K0654J7014j2695j3859
8752C8364p41J6779P763J8657l3913J184j181N032P135k781j3249l0128N665J4590
8738C3176L8986j0755l1220o609R201k4887j1113K1697J3183J3819J7700J0850
$$ y = [45508, 21121, 26387, 38109, 36715, 32144, 18083, 44037, 45821, 26019, 21573, 30455, 37603, 28969, 40175, 27900, -6477, -8337, -3130, -14870, -3393, 13912, 33030, 40028, 49730, 40451, 14995, 3846, -2166, -16927, -9008, 24518, 15296, 8350, 27714, 28938, 40766, 39269, 43882, 30759, 3016, -15945, 20040, 39840, 19040, 14929, 44743, 46448, 36855, 30473, 6470, -1877, -6767, -7837, 2419, 2161, 21160, 43884, 25800, -2446, 21139, 43207, 57132, 40095, 30440, 9106, -13975, 10229, 20550, 35450, 44428, 49656, 41108, 30710, 27250, 47904, 64918, 52223, 38364, 37623, 54402, 62165, 80822, 46909, 48093, 46912, 51944, 59079, 56298, 43049, 12921, 18586, 33176, 72162, 61407, 30187, 23578, 32779, 7892, -3221, 18476, 31659, 45478, 63178, 74028]
8726G4028m012J4615p658j9919K1342j985j1513J759J6552l1700k8447j3141j1102
8713a181J4550K4839J0249j0524l005J0138J3491J6789j3253j2120J2021J1975
8701G3969J4204j7271J4369J074k6755q536P069M810J1832K758j3342l966P583
8688F7798r522O473J0727n45J1870J1507K2160J6221l208j1435n446n71n75j5375
8674A00079j2684n07M867J0597R365j2254k7360j7674J6821R079K8610J6038m251
8661A20726k6640N442J8630o748M046R032O821l5867k8202j3918N772R333J4031
8648H2458Q276m773j5463l608L2J6611P309l724Q795k2857j0757L3078J7620J1311
8634A24308L1342J3694n954n3212n5924R073L4347J7159j7890L866N067j1424
$$ y = [74028, 70016, 84631, 76973, 57054, 78396, 76411, 64898, 66657, 83209, 51509, 23062, 9921, -1181, 13369, 38208, 48457, 37933, 34928, 45066, 58557, 75346, 62093, 49973, 61994, 73969, 88173, 70902, 85271, 86345, 59590, 51054, 58123, 62933, 74765, 77523, 64181, 60215, 67798, 58276, 64749, 75476, 74931, 86801, 98308, 120468, 136689, 133481, 122046, 116600, 116029, 115454, 100079, 87395, 86888, 91755, 102352, 111717, 99463, 72103, 54429, 71250, 80329, 108939, 124977, 120726, 94086, 99528, 118158, 111410, 115456, 124488, 131309, 95442, 67240, 53322, 59094, 68427, 82458, 90734, 85961, 70498, 66890, 66922, 83533, 90842, 87118, 95913, 73056, 62299, 95377, 112997, 124308, 155650, 169344, 163390, 110178, 54254, 63327, 97674, 114833, 96943, 100809, 105876, 94452]
8622I4452O850j1223K1065J094j5468J643k7021k532L6282J6552J9071k169j6007
8609A22589l3436M624j417K4452K8354J2758j967j3915q741P487J4204o124m063
8596A44805J3399K2924J7071O0655L765j1295K5440L9224J3095j5877l5559q468
8584B69179R201j463o651n312J1587j824R554J0573l3064j8656j0729k5987k5303
8571A81105k0274J1888J0078J096j2203j8019k6081o109j4348L302Q969l563o897
8558A08944j3015M57r027j3806O387J8652j4593q722J2424J6255J5075K4688K1851
8545A65570J6190J9784l5716j5309O409r497p183l6449j8873K285j3749j4606
8533E8856M628J2592K5366O870j4154Q81o634k6653k6183j0956p513O69J2156
$$ y = [94452, 101302, 90079, 111144, 112238, 96770, 98413, 71392, 68860, 105142, 121694, 140765, 138596, 122589, 89153, 93777, 92360, 116812, 145166, 157924, 155957, 142042, 133301, 140788, 154992, 148868, 144805, 158204, 181128, 198199, 258854, 262619, 251324, 276764, 315988, 329083, 313206, 277647, 269179, 278380, 276917, 270266, 264954, 276541, 274717, 284271, 294844, 261780, 243124, 232395, 206408, 181105, 160831, 172719, 182797, 183893, 171690, 153671, 127590, 121481, 107133, 110435, 119404, 115841, 108944, 95929, 96386, 87359, 73553, 79940, 98592, 83999, 75277, 87701, 103956, 119031, 143719, 165570, 181760, 201544, 165828, 150519, 156928, 147431, 140248, 103799, 84926, 87211, 73462, 58856, 63484, 76076, 101442, 108312, 94158, 95039, 88405, 61752, 35569, 24613, 17100, 17769, 29925]
8520B9925L5916N749K52n584M330M803M321j5071j385r96j97r586R771j372P982
8505F8858j3890j0098j8620J799K2759L4330K0494j300K959l7071j638j0476R53
8492E9059L4368J9041K005Q177P629J8427k108k1363p353l6869q163K6785k3124
8479G6511j7494R716P372J1255q058m545j3850J5783N629J0970j831j4877k0451
8466E6130j0005r494l726l2117k4079J7307K5790K9404R447j5666q246J5703O194
8453E6642N056l057j1643P51j6680J2642J9964Q015J6319m14k4752L791P892p521
8439F7005N959J3587K4083J2289K4555Q897O27K9992O194p301m292j2655q109
8426A60831J4513M7185L3533L8175M0981M1245M3205M6006N694J6021K5122K3532
$$ y = [29925, 65841, 71590, 71842, 66258, 70588, 75391, 79712, 64641, 63256, 62260, 62063, 52477, 62248, 60876, 68858, 54968, 44870, 26250, 28049, 50808, 85138, 105632, 104332, 107291, 70220, 68582, 58106, 59059, 93427, 112468, 114473, 122650, 130279, 148706, 146598, 125235, 117882, 81013, 72850, 99635, 76511, 59017, 68733, 76105, 87360, 79302, 74757, 60907, 76690, 82319, 93289, 91458, 76581, 56130, 46125, 36631, 32905, 788, -23291, -5984, 19806, 49210, 58657, 42991, 34745, 50448, 56642, 61698, 58641, 46998, 47749, 31069, 43711, 63675, 71690, 88009, 87595, 62843, 66634, 74526, 67005, 72964, 86551, 110634, 122923, 147478, 156375, 157002, 186994, 193188, 185887, 181595, 168940, 160831, 175344, 222529, 256062, 294237, 335218, 376463, 419668, 465674, 471368, 487389, 512511, 536043]
8414E36043l225L1687J4968j4740j8823l2464m4420r214l1282l8189k4672l0527
8402C35142m5056k2407o566R952l040K724o052K987J604j786K23m91M917P754
8388B79905K8964P422J5173Q849o399j7044k5384P172N7526R638O410K8539M2164
8375D42935R0806R6759P7375P0997M5350l4665j05232p4558p2495l7625j1533
8364D88114l5653k8602j4967p789l0843n2811l5407m0257j3114l093j128j7302
8352B07148q994j3870J0053j434k2149j8679p47j1817J335j956J5482K6041k3725
8339A56688k1727J7577q252M951M988m2630j2331J3676K9854L4317J073K5454
8327B03638o15n065O602L5192L982k6364r661o516k7466o669O774K9240k8858
$$ y = [536043, 532818, 564505, 579473, 564733, 545910, 513446, 469026, 459812, 428530, 390341, 365669, 335142, 290086, 267679, 261113, 271065, 268025, 270749, 264697, 267684, 269288, 267502, 267725, 267234, 272151, 279905, 308869, 316291, 331464, 340313, 333914, 316870, 291486, 298658, 356184, 365822, 372232, 400771, 442935, 533741, 630500, 707875, 778872, 824222, 789557, 684325, 609767, 537272, 499647, 488114, 452461, 423859, 408892, 401103, 370260, 317449, 282042, 241785, 228671, 225578, 224450, 207148, 198154, 184284, 194337, 192903, 170754, 152075, 151328, 139511, 140846, 138890, 154372, 180413, 156688, 134961, 152538, 144286, 149237, 154225, 111595, 99264, 112940, 142794, 177111, 178184, 203638, 203023, 197958, 204560, 239752, 243734, 217370, 207709, 201193, 173727, 167058, 173832, 203072, 174214]
8314A74214m5437l6597k3027J4632K4461j2518j0264K3822L326j3547j5543l403
8302H0119N739j4974l379n037o974N784J2914J3801j036m6239k6024J4997J4659
8289D4350j0318J118K892j2871J0918J4274Q760l6595p906J6030L129k1045k0342
8276g606N120J1457N628o122M140J8565r793l742m178R36j511K2361L7112J8586
8262I0953n818M460q485r678m3436k3675q816n618J8879J4099P027n553j50p410
8248A6779L966R742j1660p034j5199k791J9030J8265j184l718J297O881m647k0762
8234H965l360K7982J1160j6082k0362r844O861J8502K65q714o589N484k9379N467
8220i644R900M656J8253k115j3840k794K1101K952J3419R184j3842l49j4234K3340
$$ y = [174214, 128777, 92180, 69153, 83785, 108246, 95728, 85464, 109286, 112612, 99065, 83522, 80119, 85858, 70884, 67505, 62468, 55494, 61278, 74192, 87993, 86957, 40718, 14694, 29691, 44350, 34032, 35150, 38042, 25171, 36089, 50363, 59123, 22528, 14622, 30652, 33781, 12736, -7606, -2486, 8971, 14599, 8477, 12617, 31182, 21389, 17647, 13469, 14405, 12894, 35255, 72367, 90953, 85135, 89595, 81110, 71432, 27996, 4321, -4495, -10113, 8766, 22865, 29892, 24339, 24189, 16779, 20745, 30487, 18827, 11793, -3406, -6197, 12833, 31098, 29914, 26196, 27493, 34374, 29727, 8965, 5605, 33587, 44747, 28665, 8303, -1541, 5320, 23822, 24087, 15373, 8784, 14268, -15111, -9644, 256, 4912, 23165, 21050, 7210, 4416, 25517, 28469, 41888, 51072, 37230, 36881, 22647, 45987]
8206D5987K2444p825k0981j2733j1180J811j9067j7186M8371P210l8173N296R042
8193A3016j714M568J6925j754l206m192k061j0418o051j5503Q205K2468J0499
8180C0782j4078R183Q894m1493r248R383r157J8945O109P652N99r293j3503J7438
8166A2213O548m97K6959m20J532K30M10k733j9952j7495N535K8480N515M204J6409
8151F6938P483P882l475j627J1947o61j7386j4830L988J334Q140Q133K3657J6849
8137A18372l0524j7099J166l1731m250J4762o819j8372J9159J700L254j7087j1749
8124B0782K2072m544n677J1697n451J8763k2971k0855K1377L3014R497J1010j7354
8111G1360k478L4766J266J414K7767J0075o730k63R055J5950J5259L989m5040
$$ y = [45987, 68431, 60606, 39625, 26892, 15712, 17523, -1544, -18730, 29641, 36851, -1322, 3974, 13016, 11302, 15870, 32795, 31041, 27835, 23643, 21582, 11164, 5113, -10390, -2185, 20283, 30782, 16704, 25887, 34781, -6712, -15960, -6577, -15734, 3211, 9320, 16972, 17571, 8278, -5225, 12213, 18761, 18264, 45223, 44803, 46335, 46565, 46975, 44242, 24290, 6795, 12330, 40810, 46325, 50529, 66938, 74421, 82303, 78828, 77201, 89148, 88487, 71101, 56271, 60259, 61593, 69733, 77866, 101523, 118372, 87848, 70749, 71915, 40184, 35934, 50696, 43877, 25505, 44664, 46364, 49618, 32531, 20782, 42854, 38310, 32633, 44330, 38879, 57642, 34671, 13816, 35193, 68207, 77704, 88714, 71360, 68882, 103648, 104914, 106328, 134095, 144170, 137440, 137177, 146232, 162182, 177441, 181430, 136390]
8098A36390l4817j2412M951N629l904J637r576M31K1117j2506R282Q299R055J5485
8084A39061k1787k3328k8888j7832p817q544J114L2685J2153n728q539J9204k120
8071G9634m898J9526J4165J0523L315K592l1595j357P279p420L3994K4520j4961
8058A35317J6648L6978R822m548k522r580j0383j1285j6669R411j0403j9396q861
8045A14529j4067J4602K0288l20j0121j1640o994P427K4199m066j9525L808k6085
8032I2035j2483j5524J325K2778K8398p917r574N702L3921j1544P956k0743j4490
8019I9840o333L700K5116J1690N507P067j7224P300J1657L356J0416K6047J3360
8006B01499l735r684j4232k8068P320m068P767L767q907j3851m299Q377L444j5141
$$ y = [136390, 101573, 89161, 94112, 99741, 95837, 97474, 87898, 88329, 109446, 96940, 106222, 114521, 123576, 139061, 117274, 93946, 65058, 47226, 39409, 30865, 31979, 64664, 76817, 71089, 62550, 81754, 79634, 74736, 94262, 108427, 118950, 122265, 124857, 93262, 91905, 99184, 91764, 125758, 150278, 135317, 151965, 188943, 198765, 194217, 191695, 182115, 171732, 160447, 143778, 153189, 142786, 123390, 114529, 100462, 115064, 135352, 135032, 124911, 113271, 106277, 113704, 137903, 133837, 114312, 118120, 92035, 79552, 64028, 65353, 88131, 116529, 108612, 99038, 104740, 138661, 127117, 135073, 114330, 99840, 93507, 97207, 122323, 134013, 139520, 146587, 129363, 136663, 148320, 151676, 162092, 188139, 201499, 197764, 188080, 173848, 145780, 153100, 149032, 156799, 160566, 151659, 137808, 133509, 141886, 145330, 130189]
7992A30189j6692m895N550j4235j29m918p35k214k415M05j2388j4318k2761J2177
7978E2621J5995J4022n638r120K2365M60j5354J3830q686j3041j070J0459Q861
7965H5704J9035J6037j9637m5476J0273J9065J5375k2983j5913j3565J4327J1819
7953G4061l633M412J1087K3660j8867m382J0619j6570k197Q00l241n704j7999
7940E2046j2435J313n779K51j7818k944K0437J312q318j6384J1619j196r681o02
7926A1821q37r481k4328Q64J0090R397M719R694n789j846J312J906P382K0218
7912C5122j0413k5963r585J6792J0979n781M702j3356M906j9723K369J0703P506
7899H258R097J1766k8379j2904Q226K0434N237J3918J0819j3078j3843j2316K334
$$ y = [130189, 113497, 108602, 114152, 99917, 99788, 94870, 94135, 91921, 89506, 89911, 77523, 63205, 40444, 52621, 68616, 82638, 77000, 67880, 90245, 90705, 75351, 89181, 80495, 67454, 66384, 76843, 85704, 104739, 120776, 101139, 55663, 65936, 85001, 100376, 77393, 61480, 47915, 62242, 74061, 70428, 74840, 85927, 109587, 90720, 86338, 96957, 80387, 78190, 78990, 75749, 70045, 52046, 39611, 40924, 35145, 35396, 17578, 14634, 35071, 36383, 28065, 11681, 23300, 22104, 12423, 11821, 10984, 1503, -22825, -21961, -11871, -2474, 2245, 11939, 6150, 4304, 5616, 7522, 14904, 35122, 24709, -1254, -10839, 5953, 16932, 11151, 15853, 2497, 7403, -12320, -9951, 752, 8258, 17355, 29121, 742, -12162, -3936, 16498, 21735, 35653, 46472, 33394, 19551, 7235, 9569]
7886I569J4680J1940O468o661j1270n323P603n182m91Q75O295m712j3880J891
7872A1802j4293k765j0538J3216N063K2848m801k6976j8082J0411J5686K0003
7860B1574j0971J1860N576k5576o350M807L0817J9628k9166n828J6681L622K2610
7847E9284K533m3463l139R094J3278p996l954l921q05q27n694k101J1800j7268
7833F821j3881r009j0276M983k975J598L338K8914l506k4590J62J378Q439J9432
7819A0828j1867k5126r431J3082N771M458n133k978J923o087L2173J6305k3532
7806C86j7763k0366J7062K5502R406O251J1684k3121k8111m691m611M042l637
7793b7967J0628n029R038Q539J3874l0712j1736J7134p588p323L082J2475J148
$$ y = [9569, 24249, 36189, 42657, 35996, 24726, 19403, 27006, 21824, 21333, 22208, 28503, 23791, 9911, 11802, -2491, -5256, -15794, -2578, 2485, 25333, 20532, -6444, -24526, -14115, 1571, 21574, 10603, 22463, 28039, 2463, -3887, 920, 31737, 51365, 22199, 16371, 33052, 36674, 59284, 61817, 18354, 15215, 24309, 37587, 29591, 25637, 21716, 20911, 20084, 14390, 12289, 24089, 6821, -7060, -16069, -26345, -21362, -24337, -22739, -19401, 9513, 6007, -18583, -18421, -17043, -8604, 10828, -1039, -26165, -35596, -22514, -16743, -12285, -17418, -20396, -18473, -24560, 7613, 23918, 386, -17377, -37743, -20681, 4821, 14227, 20478, 32162, 9041, -19070, -23761, -28372, -24330, -27967, -17339, -22368, -13330, -4791, 9083, -21629, -33365, -16231, -23819, -31142, -28060, -15585, -14437]
7780a4437j0441P267J2353J362N477N898m577K7072J6929l2098j7948O423q010
7767d730j7082R874K9829j1062j8745j78L930m315J2171J3219j0518l2990j3746
7754d4343J8565J3061J2574j3665j1438J39J9270j632j0558l590J7116K1524j6762
7741B61r1J0785J2436N737j9918j6256n554K0023J4879p860L269k5695r126K514
7727a4596K4136J3647J7116m238k3377k3059j4918J008K528j3473M21J7501k1159
7714c8463j072K0273O96k629n636J7304J1935K3036j0099j2402r33N286l520j768
7700B008J3703J5837K6542j112j9715l7800k3062r5J2155m031m685R235R313K5073
7686B3366J0428M369l0474m8275J2888K1213M173P792j3567j1553J1597M0798
$$ y = [-14437, -24878, -17611, -5258, -3896, 1581, 7479, 2902, 29974, 46903, 14805, -3143, 3280, -4730, -21812, -11938, 17891, 6829, -11916, -12094, -8164, -12479, -308, 12911, 2393, -30597, -44343, -25778, -12717, -143, -13808, -25246, -25107, -5837, -7469, -18027, -21617, -4501, 17023, 261, 170, 10955, 23391, 29128, 9210, -7046, -12600, 7423, 22302, 14442, 17711, -7984, -17110, -14596, 9540, 23187, 40303, 36065, 12688, -10371, -25289, -24281, -21753, -35226, -34805, -17304, -38463, -39535, -19262, -18566, -21195, -26831, -9527, 2408, 25444, 15345, 2943, 2010, 7296, 3776, 2008, 15711, 31548, 58090, 56978, 37263, -537, -23599, -23694, -11539, -15570, -20255, -11020, -1707, 23366, 33794, 38163, 7689, -40586, -27698, -6485, -2312, 5480, -8087, -19640, -8043, 32755]
7674C2755J8312K585K190k2012l5387l282p738N006J2627j3104O875k3812j9631
7661d4616N286J6684K0100m767k0338Q122Q460k217k3373j453l416Q163p68J965
7647c2168K7728j5042j93k32l446j1825J4523J2287J3635J8429j0335q064j699
7634C598l1286r63K785K960J835L4622J9750l937q776j9094l672P95k2416J1495
7620a2304q348J3140M783J9043J9991l182k81j4027j0791M112j0447j2101n990
7607a6402n696R563L3175m901l2117j1205j4202J791K2165n451j4545J9322J1331
7594g172k4529j4711n711K6355j8083O811K4790j777K3197R164j6243j1480M483
7581d906k3045o15J7078M34p276m524J4080J6852O014j5833m629J1672K1835k4477
$$ y = [32755, 51067, 53652, 55842, 33830, -1557, -4839, -12577, -7571, 5056, -8048, -1173, -24985, -44616, -39330, -22646, -2546, -7313, -27651, -19529, -11069, -13286, -36659, -38112, -41528, -33365, -34133, -32168, -4440, -19482, -19675, -19907, -23353, -35178, -20655, -8368, 5267, 23696, 13361, 5297, 3598, -27688, -28651, -25866, -22906, -21071, 13551, 33301, 29364, 20588, 1494, -2178, -1383, -23799, -12304, -20652, -7512, -2729, 16314, 36305, 33123, 32842, 18815, 8024, 12136, 1689, -10412, -16402, -22098, -12535, 20640, 15739, -16378, -27583, -41785, -39994, -17829, -23280, -37825, -18503, -7172, -31701, -46412, -52123, -25768, -43851, -37040, -12250, -14027, 9170, 18334, 2091, -9389, -4906, -27951, -28566, -11488, -11054, -18330, -22854, -8774, 8078, 14092, -1741, -6370, 5302, 27137, 2660]
7567B660n526J3863L1660k9970m0499o221J1377K1384Q761k4508j1149j8421K5113
7554b1476K7774m736Q766K1699r2o281k5121q313k1765n08J929K3984m70j2998
7540a7608K1555K5939j749l8270k6477L404J2505O64K716J0155L62j3682K2629
7527B143N293N150n044P70k524k810l329J1377j3247p22j6042O650J6491q552
7513d396R630j1389k9286K0729J9983j2658j3080J4071J8607r499k9701O64p010
7500c3335p547j63M8225K3571j7553j1209k3974r20j8133k5070m907L036J9680
7487d8299j108K6575K9182l721j8714r193J1186K048m210K143J564o545J1144
7474g948m633O205n00M72P007l558k1644J6498J736J2518P916k7522J100N034
$$ y = [2660, -2866, 10997, 42657, 12687, -27812, -34033, -22656, -1272, 7489, -17019, -28168, -46589, -21476, 6298, 1562, 10328, 32027, 31935, 25654, 533, -7780, -29545, -30053, -28124, -4140, -4610, -17608, 3947, 29886, 28137, -10133, -36610, -33206, -20701, -20037, -17321, -7166, -6804, -20486, 2143, 7436, 12586, 7542, 8312, 5788, 2978, -351, 11026, -2221, -2943, -18985, -12335, 4156, -4396, 5234, -6155, -35441, -14712, 5271, -7387, -20467, -6396, 12211, 2712, -26989, -26325, -33335, -40882, -41045, 7180, 30751, 13198, 1989, -21985, -22905, -41038, -66108, -71015, -67979, -48299, -49407, -22832, 6350, 2629, -16085, -25278, -14092, -12044, -16254, -14111, -12547, -19092, -7948, -12581, -6376, -6876, -6404, 603, -2955, -24599, -8101, -6365, 6153, 14069, -13453, -12353, -7319]
7460g319k0706K1140K6827q135J7296q702m1886l3161q235J4995J5852r458l556
7447d5048L0723O773p617j184P164l391J3382K183l704M557p902k9246J0838L0412
7433G940m291J1294q216k4317M86j28L4329L7057J3739j3423m4650l0579k053
7420b2812K534K1290J4440K144K810j5678l4944o054O309K3538K408j8242j8535
7407d0792J1676R578L6115j2349l0481R530J620K1329j518j1506l852O68o741
7394a6723Q431K8016j8115l1635J256L9890p930r992R538k771J4736j4114k6135
7381b5548J3918K3301j3924j0065K51P790k226j6663l179J313K0576J3577L084
7368A2205k9568n21r272q642Q486N307J0764k871J7279j79q161O236j8001k12
$$ y = [-7319, -28025, -6885, 19942, 11807, 29103, 20401, -21485, -54646, -62881, -47886, -32034, -41492, -45048, -14325, -7552, -15169, -16353, -9189, -12580, 802, 2985, -719, 3838, -4064, -33310, -22472, 7940, 3649, 14943, 6727, -17590, -17104, -17232, 17097, 54154, 67893, 54470, 9820, -20759, -22812, -20278, 1012, 15452, 17596, 20406, 4728, -30216, -36270, -29961, -6423, -4015, -22257, -40792, -29116, -19538, 16577, 4228, -26253, -16723, -15103, 6226, 4708, -6798, -10650, -9982, -16723, -8292, 19724, 1609, -30026, -28770, 11120, 3190, -6802, 2736, -35, 14701, 587, -25548, -11630, 11671, -2253, -12318, -12067, -4277, -6503, -23166, -26345, -25032, -4456, 9121, 12205, -17363, -17884, -27156, -35798, -27312, -22005, -11241, -14112, 3167, 2988, -5173, 1063, -16938, -17150]
7354a7150J5701J129O828r73L802l039l249m94j1500j7706l353R783M600L721
7340a1900j7611j4128l79L2276J0207J615k4425k0058P678K0597j636L000j1752
7327b6516N549m733l687j010n805m222J8823K8074m512J42N926j1231J0825J3101
7313B0724J2035j0325R877J700j8935k0737j6146j3808q757m080O925j9735K6901
7300c4361L3312q363j4086j825k520J9992J2740j3927k0799J5253N875J0101L09
7287A701j8406P119J4013j3012j6334j2119R376R391J3034O916l123n833m072
7274a1349k506q501j8464M330J7016j6010r679J2943p039r894P690K8897j1348
7261b3914n467J9607j6634m811M814Jq442Q445m484j0556J5653J0232j938q993
$$ y = [-17150, -1449, -320, 6508, 5535, 9337, 6298, 3049, 2555, -8945, -26651, -30004, -20221, -15621, -11900, -29511, -43639, -44018, -11742, -1535, 80, -24345, -44403, -36725, -16128, -17764, -14764, -26516, -20967, -25700, -29387, -30397, -36202, -40424, -21601, 6473, 1961, 2103, 8029, -3202, 7623, 20724, 32759, 22434, 32311, 34011, 15076, -5661, -21807, -35615, -44372, -48452, -41527, -61262, -34361, -1049, -9412, -23498, -25323, -27843, -7851, 4889, -9038, -29837, -14584, -8709, 1392, 1701, -16705, -9586, 4427, -8585, -24919, -37038, -27662, -18271, -5237, 1679, -1444, -7277, -11349, -13855, -22356, -40820, -36490, -19474, -35484, -45163, -32220, -39259, -49153, -41463, -12566, -23914, -29381, -9774, -26408, -31219, -26405, -26404, -34846, -26401, -30885, -41441, -25788, -15556, -17494, -26487]
7247b6487P926O903p805j151K9244K3428k667q38m584q020j779j7189r633J0100
7233b552J3952j5361k585L3752J7719p172P804j4409m7082j2396J2268Q600L346
7220d116Q289j7807j1872R19N236J8791L504J262M092j7665K121k4244J750Q131
7206b1609N680j2877P242P399o093k5563r099L4560J0725j5545j7706l3832O810
7193f9908J8941O628J7506K2155J2680k37j1016o227j25J9710j2799r682K6711
7180A4337J8142l010N832k2649j9703k1631k1451J0778K2691K4666J5626l5490
7168a1862k8650j535R764J3126K4489J6279M514j8538j6452m295l123j0266O621
7155a9928J4386M333P762J2759J3800j0083j5873m375j055l070j4421J0274K4915
$$ y = [-26487, -18561, -11658, -19463, -20614, 8630, 32058, 29391, 28553, 23969, 15949, 14170, -3019, -12652, -2552, 11400, -3961, -6546, 27206, 44925, 37753, 45557, 31148, -15934, -28330, -16062, -7462, -4116, 4173, -13634, -25506, -24587, -19351, -560, 2944, 4206, 8298, -9367, -7246, -31490, -29740, -21609, -15929, -28806, -21564, -14165, -20258, -45821, -54920, -20360, -9635, -25180, -42886, -76718, -69908, -50967, -44339, -26833, -4678, 8002, 7765, -3251, -9478, -9603, 10107, -2692, -12374, 14337, 32479, 29469, 35301, 12652, -7051, -28682, -50133, -39355, -16664, 8002, 23628, -11862, -40512, -42047, -32283, -19157, 5332, 21611, 26125, 7587, -8865, -13160, -16283, -26549, -19928, -5542, -1209, 6553, 19312, 33112, 23029, 7156, 2781, 1726, -1344, -15765, -5491, 19424]
7142A9424L584k981M405O266k1120k8273n051J774o239j3567L862l486r351N077
7128d5676J1920P710J3870L939K6355j2029j82J5440j041j0773o262l7191j534
7115c5454J7539Q137J3396L8919J9855l1600k4999k1602J6892L832j986M0705
7103D3634M6827k1859m8204k0255r149k731J6466J1720l1462r546J670K2831J3981
7090A3923K4548q861j1261k0110o869j410N713j4210r744j613l573J1836J7551
7077d080p609K735J0960J9234p512J0891r671k0063n829J441K315J1911L081J2633
7063B0437J5324j4985k7340L018o558L3392O751j1945p341j6074p495J4597Q70
7050B651J8208k800k918l142J7681L372l1679j1533J838M319q637J4057j9315
$$ y = [19424, 23008, 20027, 24432, 30698, 9578, -18695, -23746, -21972, -28211, -41778, -37916, -41402, -50753, -45676, -33756, -26046, -12176, -8237, 18118, 6089, 5907, 21347, 20306, 9533, 3271, -33920, -35454, -17915, -9778, 3618, 42537, 62392, 30792, 5793, -15809, 1083, 4915, 2929, 43634, 90461, 68602, 20398, 143, -9006, -11737, 4729, 16449, -15013, -24559, -22889, -58, 13923, 38471, 29610, 18349, -1761, -8630, -10040, -4327, -18537, -28281, -29894, -33467, -21631, -4080, -11689, -8954, 2006, 21240, 13728, 24619, 14948, -5115, -10944, -9503, -7188, 4723, 7804, 20437, 35761, 20776, -6564, -3546, -10104, 23288, 30039, 18094, 10753, -5321, -12816, 1781, 2651, 20859, 18059, 15141, 11999, 29680, 33052, 1373, -10160, -8322, -4003, -12640, 1417, -17898]
7037a7898N781j5138j1338J928K1610K947k6218k512R981K1439J359n954r658
7024b3671K0879J2863l768K7506M505k1348J507J3387L820j3865o393J3460K9386
7011E8268k6510k4294j5101j0361J4464j2093k1590R678K596m004K0550L72j2780
6998b0805l331n503q303L2194K2948j7441l054J8898j4330j8103j6592j6741j1385
6985f1548K0105R288j3240K235K0835Q791q03N079k1391j1859J0724P811j75J0544
6971a3604m287j0305p765J9729J2000K5647L1278j3593k4441j6979K0076j6203
6959A553k5240j512K2453q90J1476J8176j6355J8473K2435p836j5330j1515j6322
6946d34J1180q921O480J6524J3971k414j199j3905j4157q629k717L369j777j1738
$$ y = [-17898, -12117, -27255, -38593, -36665, -15055, -12108, -38326, -40838, -30857, -9418, -8059, -14013, -23671, -2792, 10071, 6303, 33809, 38314, 16966, 18473, 31860, 35680, 21815, 15422, 28882, 58268, 31758, 7464, -7637, -17998, -3534, -15627, -37217, -27539, -24943, -28947, -8397, -8025, -20805, -24136, -29639, -37942, -5748, 17200, -241, -3295, 15603, 1273, -16830, -33422, -50163, -61548, -41443, -32155, -45395, -43160, -22325, -13534, -14337, -9258, -30649, -42508, -31784, -23973, -24148, -13604, -17891, -28196, -35961, -16232, -4232, 21415, 52693, 39100, 14659, -2320, 17756, 1553, -23687, -25199, -2746, -3636, 7840, 26016, 9661, 28134, 50569, 42733, 27403, 15888, -434, 10746, 1825, 8305, 24829, 38800, 36386, 35187, 21282, 7125, -1504, -4221, -852, -2629, -14367]
6932a4367j1743l7975Q088K4764K3076j4291L985K2189j4860l7163J187N872j568
6919d2806N699J7724m315J9597o071K144K010n886M770m840l484R455O41L19N481
6904D38k195p76n616o03R701k1987J4197R190j2722l940o318r954j1508Q177j783
6889c5699O08M681n495m554J4273k3612R994K114j512J71J054L3542J3995n824
6875C736q765r174q427j684K699j2834J0256J6452k261J172j5020M52J9246n742
6861i894q475q546K1465O891M024L373M242r882J3882J138j0411r275m7661R43
6847d8186K7510J2363q364Q992k3261j9665L9608L9856j5791j2463m172J9K1299
6834A7745P32m15j7909J4230J4916k1344Q800j167j0247k4718j451J6773k9869
$$ y = [-14367, -26110, -64085, -55997, -31233, -8157, -22448, -18463, 3726, -11134, -48297, -47110, -41238, -42806, -37107, -19383, -23698, -4101, -10172, -8028, -6018, -11904, -7134, -11974, -15458, -6003, -5362, -5043, 438, -1757, -2533, -8149, -8752, 949, -21038, -6841, 2349, -10373, -14313, -20631, -30585, -42093, -33916, -35699, -35091, -30410, -35905, -40459, -26186, -49798, -39804, -37690, -39202, -39031, -37977, -4435, 9560, 3736, -5029, -14203, -22630, -24314, -21615, -34449, -24193, -7741, -10002, -8830, -23850, -23398, -4152, -9894, -18369, -26915, -5450, 1441, 5465, 8838, 13080, 3198, 17080, 18218, 7807, -1468, -49129, -48186, -20676, -8313, -16677, -7685, -30946, -50611, -11003, 28853, 13062, 599, -3573, -3554, 17745, 18477, 18062, 153, 14383, 29299, 7955, 16755, 15588, 5341, -19377, -20828, -4055, -33924]
6821c3924M178J2307J2345p589n787k179M349Q450M97J453K860L0759r076M586
6807B3229j3465j3649O667j0928p920j735j119q41n338q849J1404K3857r23j0188
6793i798N186J9077J7393J1043j4421l7647k4574o215R794P510j8258J4642L4268
6780H000l1342R634N696M695j991j7044o178j1559P20J9202M837Q564K297J1001
6766F532o800k751n129P15r976K9797L837j0771L079P210N933k109l2641r330
6752b2404L2179l294J2089k280k9920r662J5800J8141n051M071R055K9831K9755
6739G8310M658m2065j2068K222R838J7237l977q332j1061r827n802J5056L4185
6726F8374K0918j797j2765q978j342P586J5359J7629P667j0474N36o753j4764
$$ y = [-33924, -29746, -17439, -5094, -12683, -18470, -20649, -16300, -7850, -7353, -5900, -3040, 27719, 18643, 23229, 9764, -3885, 2782, -8146, -16066, -17801, -18920, -19761, -25099, -33948, -22544, 1313, 390, -9798, -4612, 14465, 31858, 42901, 28480, -9167, -33741, -39956, -30162, -22652, -40910, -26268, 8000, -23342, -13708, -8012, -3317, -5308, -22352, -28530, -40089, -39369, -20167, -15330, -6766, -4469, 6532, -268, -3019, -8148, -7433, -17409, 12388, 16225, 5454, 8533, 15743, 21676, 19567, -13074, -22404, 9775, 6481, 18570, 16290, -13630, -23292, -7492, 10649, 5598, 9669, 18724, 48555, 78310, 82968, 40903, 28835, 31057, 40895, 58132, 54155, 45823, 34762, 24935, 19133, 34189, 68374, 89292, 87495, 74730, 65752, 64410, 71996, 87355, 104984, 112651, 102177, 102713, 95960, 81196]
6713H1196k4825j5750k3973L933K4549q293k261J0511l467O850N209j0336k7404
6700A5939o652J4401M2589N956l7680m3217k0758l269R756L6147N078J0605j5939
6687A2956j6608j2856J1779L4815j2231j0095K1057L53p398n393m384k5434K073
6674a1366J8941M0p362l296p883J785m237O981J2284o678j0021r954J8458J1494
6660I186K2136O268k1903L382j037k4602j2561j797O344J4481n865J726Q819O712
6646A1289J7612o131j7464m470Q247p596k232M184K2961j0077l4493r462M81j1609
6632c8760Q600P357R786J1082M532j0541J3614J7272q766l0995k4085l663O444
6619c8123q29Q703K7112N477N816n476j1720l0510J2019J9783R619j6861L391
$$ y = [81196, 56371, 40621, 16648, 20581, 45130, 36837, 34576, 45087, 41620, 48470, 53679, 43343, 15939, 9287, 23688, 66277, 72233, 34553, -8664, -29422, -32691, -22935, 13212, 18290, 28895, 12956, -3652, -16508, -4729, 30086, 17855, 7760, 28817, 29170, 21772, 16379, 11995, -13439, -11366, 7575, 7615, 253, -3043, -10926, -9141, -13378, -6397, 5887, -791, -10812, -20766, -2308, 9186, 31322, 37590, 15687, 19069, 18032, -6570, -19131, -20928, -14584, -103, -5968, -4242, 4577, 11289, 28901, 22770, 5306, 836, 9083, 1487, -745, 3439, 26400, 16323, -18170, -27632, -27151, -38760, -30160, -22803, -13017, -1935, 2597, -7944, 5670, 22942, 14176, -16819, -40904, -44567, -38123, -38952, -30249, -3137, 2340, 8156, 2680, -9040, -39550, -27531, -7748, 1871, -14990, -11599]
6606a1599K2665K6693k6722j3888J2095j7885o883Q399K1989R941j8208k7092
6594b0495j742J1732L516J3613K655Q148j809J0567j4378k7767j4883L6236J4890
6581B0283J4752o483k2215j825j1611p960k5722m518M924L7743m501l1795J866
6568c7062M725K734N424R213M008p227l2195p273K6989L6835k6993l1361K2863
6555b9320N511j8186m618K5723K9908j1095j0550K8525Q456k5786K049j5921K3000
6542G696J844O895J3674l811l6412m066J2876L831j5155O109l07J5434q797k631
6528b820R192K6844J8073J540j3320k2059k7684k8880P872J4584J6046p99j0569
6515a1980j4438K242j6187k979J0049J2992J0780J6748n442j7386k0939J5615
$$ y = [-11599, 11066, 37759, 11037, -2851, 9244, -8641, -15524, -7125, 14864, 24805, 6597, -20495, -22237, -10505, -6989, 6624, 9279, 17427, 15618, 26185, 11807, -15960, -30843, 5393, 20283, 35035, 28552, 6337, 4512, -7099, -15059, -40781, -45299, -40375, -2632, -7133, -38928, -37062, -32337, -29603, -24179, -14966, -10958, -18185, -50380, -57653, -30664, 6171, -20822, -52183, -29320, -23809, -41995, -46613, -20890, 9018, -2077, -12627, 15898, 24354, -1432, 617, -15304, 7696, 9540, 16435, 30109, 26298, -10114, -14180, -1304, 2527, -12628, -6519, -6826, 8608, -189, -2820, 6372, 33216, 51289, 52829, 39509, 17450, -10234, -39114, -31242, -16658, -612, -1411, -11980, -26418, -24176, -40363, -43342, -33293, -20301, -9521, 7227, 1785, -15601, -36540, -20925]
6503b0925K159J3373J3214k0005j5805Q585J378J2792K988K114j1039k744n081
6490a8996p647R252J4816Q355j815J494r881M53M710q229j3843J2791K2728n137
6476I051n676l0305o958J4446P960j6209J9309M0672J3409m404j2086j1557j5149
6463B503l8529p354K5942P699j7886P218J7440m655Q665M233J2124l595p827r819
6449c841j5379p461J8951M437j3090j2725q999K35K6122J1820J1367J1924m3873
6436b0512l2049J8064K2149J9819J7468J6240k155j5140j0541j8176n455l758
6424a4046Q963O83q363J4780o29Q289j4043n770j3601J7127k5627k4528J7039
6411c9726K6262J0455J167j6795j0109j0391M035j185J493k964p355O971L152
$$ y = [-20925, -18766, -5393, 7821, -12184, -27989, -19404, -18026, -5234, -2246, -132, -11171, -13915, -18996, -26643, -17391, -2575, 5780, 3965, 5459, -4422, -3969, 741, -7488, -21331, -8540, 14188, 9051, 3375, -26930, -33888, -19442, -11482, -27691, -8382, 32290, 45699, 41295, 29209, 17652, 2503, -36026, -43380, -17438, -9739, -27625, -20407, -2967, -7622, 1043, 5276, 17400, 13805, 5978, -3841, -19220, -26681, -7730, -3293, -16383, -29108, -38107, -37872, -11750, 70, 11437, 23361, -20512, -52561, -34497, -12348, 7471, 24939, 41179, 39024, 23884, 13343, -4833, -10288, -14046, -5083, -4400, -12763, 2017, 1388, 9677, -4366, -10136, -23737, -6610, -32237, -56765, -39726, -13464, -3009, -1842, -18637, -28746, -39137, -35102, -36287, -34794, -37758, -45113, -38142, -34990]
6398c4990R421l926o395Q098R070J4868N906l7935j0580Q564K1436J4412Q238
6385F187j7721J2598J2960q989k7487O548M706j5604n754p355J2613K2208k1201
6372b6291j1468J9877K7840J2630j0000j2620m5335P281N592j0053J028J0325
6360c1194Q51J3659L7017l597l0739L154L0592j2810j8701K951j5093j4529k5228
6347f3667K2676K0662P023k2935k3691k5663m949K6871K2527J1893k514j6649
6335d8416K2167J1070M166j3380p125l936M363K8759j082j2822J512j3735k4101
6322e2560L3418J1996k549j4544O772P39j5758J691J536K2559K2254p615l5802
6309b7863j4946J4113L4586J1950n92j5580N845J9602k7976q297J0941j167j6963
$$ y = [-34990, -25569, -29495, -35890, -27792, -18722, -3854, 2052, -35883, -46463, -37899, -16463, -2051, 6187, -11534, 1064, 14024, 5035, -22452, -15904, -11198, -26802, -32556, -39911, -27298, -5090, -26291, -37759, -17882, 9958, 22588, 12588, -32, -45367, -38086, -32494, -42547, -41519, -31194, -30343, -16684, 20333, 16736, -14003, -10849, 19743, 6933, -11768, -8817, -23910, -38439, -63667, -40991, -20329, -13306, -36241, -59932, -85595, -90544, -63673, -41146, -29253, -31767, -48416, -26249, -15179, -11013, -24393, -31518, -35454, -31091, -2332, -3414, -16236, -14724, -28459, -52560, -19142, -7146, -9695, -24239, -17467, -16728, -32486, -30795, -29259, -6700, 15554, 7939, -27863, -42809, -28696, 5890, 17840, 17248, 1668, 7513, 27115, -861, -9158, 1783, 616, -16347]
6296a6347j5185r755N253J3068M699J6991o92n315K5262K672k7906j2836K9014
6283H923K7057j1259j1965M086O070n540J2919j582j8271j8003j2577j3830K1431
6270a2541n407q667J174K2961R21J6398m24R239l857m203q978l0310n653L909
6256b5438J1991L7940k070k5791o43O992L517o184K976j5471j2756J5981N673
6243c283N880J7025K1648J380j7264j0072l556O358j4349j4274n460N377q070
6230a8660k2627R166L078m07o411k0100M3871K3083j3055q371k3298n057l891
6217d2679p512J4033j8458n588J8247L5188Q106k1091j0594K1033j032O271P993
6204C917j3396M652j5347k5646K2242K6550n42K1291k9300R091J1544J8652m265
$$ y = [-16347, -31532, -41287, -36034, -22966, -18267, -1276, -1968, -7283, 17979, 20651, -7255, -20091, 8923, 35980, 24721, 12756, 16842, 22912, 17372, 30291, 28709, 10438, -7565, -20142, -33972, -12541, -17948, -26615, -25441, -2480, -1559, 14839, 14415, 23654, 19797, 15594, 6616, -23694, -29347, -25438, -13447, 24493, 22423, -3368, -4011, 2981, 6498, 314, 3290, -12181, -24937, -8956, -3283, 2597, 19622, 41270, 42650, 25386, 15314, 11758, 18116, 3767, -10507, -15967, -10590, -18660, -41287, -32121, -29043, -29450, -35861, -55961, -12090, 10993, -2062, -10433, -33731, -38788, -42679, -50191, -36158, -54616, -60204, -41957, -6769, 1337, -19754, -30348, -9315, -10347, -4076, 3917, -9479, -4827, -20174, -45820, -23578, 2972, 2430, 23721, -5579, 3512, 15056, 33708, 29443]
6191B9443k4069j606k0133l554O786j6676k3091J2593J1166n072N746J6744J8442
6178F719J5883n866j4267k0138K6012P054j3591j7404L708O642J1428j0965J07
6165d678K6201J8808o65k5150p046j766r595j8392j9651O387L4948M090k0538
6152a7047j5760L3650N934J1930p737j2307k2825j1499P899J2995k47J174q051
6139b1891k784K11N152p799m564J7886J4865Q377j8768j7849J0892K0944K0380
6126B5052J2264R035j0313k8109p164q256m931n2j0949K1154L0874m465j349j7643
6112E148p08r014j6183j4600J3347J9432q241j1081J5373r742k7524j635M156
6099d1272L386K0507L4050K8335q929k9666j6901q337O830N825K3386o026l3418
$$ y = [29443, 5374, 3768, -16365, -19919, -13133, -29809, -52900, -40307, -29141, -34213, -28467, -11723, 6719, 22602, 16736, 2469, -17669, 8343, 15397, 1806, -15598, -11890, -5248, 6180, -4785, -4678, 21523, 40331, 39666, 14516, 7470, 5704, -3891, -22283, -41934, -35547, -599, 3491, -17047, -32807, 843, 6777, 18707, 10970, -1337, -24162, -35661, -27762, -14767, -15014, -13840, -21891, -24675, -24464, -19312, -27111, -31675, -13789, 1076, 9453, -9315, -27164, -16272, 4672, 25052, 37316, 46351, 36038, 7929, 765, -7491, -12422, -12474, -23423, -2269, 28605, 24140, 22791, 5148, 4440, -4574, -20757, -35357, -22010, -2578, -10819, -21900, -6527, -16269, -43793, -45428, -41272, -37886, -17379, 16671, 45006, 36077, 6411, -10490, -18827, -11997, -6172, 17214, 11188, -22230]
6086b2230n544J0711J2902l947r638j9548L931K4732q760l1144M264J592O139
6073c6540j688O599Q912J7750O419p343n811K2349K5194k703J020j9289k8297
6060a3428r256N306J3308k0551j0640K6379R835q455m48K1296L0069j2263o243
6047B4909j7743j9283J2247K562j5851j1639j5766k0218J3920J6758j3043j3464
6035e6611M2150J7775J5640n247j5457O579k932m638L345o10J259j0299k2858
6022c1904j6361J2673J3525n958O859M735j6294m660O320o539K7291N811j7590
6009b2092r318J3195q739j373J4115J3696k478j5823R099Q55N886N781j0686j958
5995i840O598m850j8822J6030J7104k0167j4480J0642j4053r137M24O070k1038
$$ y = [-22230, -27774, -17063, -4161, -8108, -17746, -37294, -33363, -8631, -17391, -48535, -44271, -42679, -36540, -38228, -31629, -22717, -4967, 1452, -5891, -11702, 10647, 35841, 33138, 34158, 14869, -13428, -22684, -17378, -4070, -24621, -35261, -8882, 953, -7502, -7950, 13346, 43415, 31152, 24909, 7166, -12117, 130, 2692, -13159, -24798, -40564, -60782, -46862, -30104, -43147, -56611, -14461, 3314, 18954, 13707, -1750, 4829, 1897, -2741, 604, -6, 1253, -9046, -31904, -48265, -35592, -22067, -28025, -21166, -16431, -32725, -37385, -31065, -37604, -10313, -4502, -22092, -31410, -18215, -26954, -28327, -14212, -516, -2994, -18817, -9718, -8863, -2977, 2804, -7882, -9840, -3242, -8092, -26914, -10884, 6220, -13947, -28427, -17785, -31838, -40975, -40551, -34481, -55519]
5982e5519M838J9927J9412J7906l98j6744k3273j8319j412K94K7508J7251K756
5969e773p948J9831J9392l1145j7514K3679P763j3595j1643Q483m218N369K1387
5956A4068j6685k837P160r40O501K3645j2183k0766j9342J0559o281k8715J0735
5943c5081L1608K3022j0583l957M025j2288j4498m170P323k643M57k5474k253
5930d4512L086J394K1854M0473O11j7345k5113j6207R587q328l113N974j2514
5917d4153j2263n10K5792J9774J0499N696j6497k949k78K596j0546J5641O92K2147
5903A5641P056k0942k7129l7292j1658K4992J7882L0569O133k7153J1510Q244
5891b147K652O366Q878R494K146j0565j0485q583j7163M038L134N365j1111K1434
$$ y = [-55519, -50681, -30754, -11342, 6564, 6166, -10578, -33851, -52170, -53582, -53288, -25780, -8529, -5773, -13721, 6110, 25502, -5643, -23157, 522, 8285, -5310, -16953, -8470, -12688, -7319, 14068, -2617, -5454, 1706, 766, 7267, 30912, 18729, -2037, -21379, -10820, -17101, -45816, -35081, -3473, 19549, 8966, 5009, 9034, -3254, -17752, -21922, -14599, -17242, -16785, -42259, -44512, -41426, -40032, -18178, 22295, 22906, 5561, -19552, -35759, -26172, -34500, -37613, -31639, -44153, -56416, -56926, -31134, -11360, -861, 4835, -11662, -14611, -14889, -12293, -22839, -7198, -6506, 15641, 22697, 1755, -25374, -62666, -74324, -49332, -31450, -881, 5252, -21901, -10391, -2147, 505, 6871, 15749, 25243, 27389, 16824, 6339, -2244, -19407, -15369, -12235, -6870, -17981, 3453]
5877C453J4043j719j5309K854n847k5413j1183K0400K3932P458j712j0114j3248
5864a2405J5208N805j1614k137L112j9825j4379l250J0669J8239m59o481J0056
5851g461N764r935q435L70J047Q114J7765R670l100j7609k9541J9918J2364q743
5837i812p290l763O99R171J52j496J898j8043j6110K0438J7191N682L0712J7257
5823D6686o316j7344k6014o700K0120P345k3969p688n207p92K2897K9j6939Q829
5809e063j8184j2809k0949j1583K5285M3076n880l0016r033R137J0359O008J616
5796a8036R843R126j8141p214K978O53n300M137p080N977q96J000p517p918K234
5781c6154k6471k492N3354J9097j28j6527k0738j2139K129J9491K5940M840n150
$$ y = [3453, 17496, 15777, 468, 3322, -2525, -27938, -39121, -18721, 5211, 12669, 10957, 843, -12405, 2803, 8608, -3006, -5143, -2031, -21856, -36235, -39485, -28816, -10577, -11036, -17517, -7461, -1697, -11632, -20067, -19697, -18650, -10536, 7229, 16899, 13799, -3810, -33351, -13433, -1069, -9812, -17102, -20865, -20166, -10995, -10843, -12339, -10441, -28484, -44594, -24156, -6965, -1283, 29429, 46686, 40370, 23026, -2988, -9688, 10432, 17777, -6192, -13880, -19087, -19879, 3018, 3047, -13892, -5063, -23247, -36056, -57005, -68588, -43303, -227, -6107, -36123, -45156, -36019, -25660, -19652, -18036, -8193, 933, -17208, -24422, -21444, -20791, -26091, -21954, -29034, -23057, -23953, -22953, -30470, -38388, -36154, -62625, -65117, -11763, 7334, 7206, -9321, -30059, -42198, -40069, -20578, 5362, 10202, 5052]
5768E052m0572J7883R710r673J1378J8195j0437j2837M372j2533J3562m1010J2731
5755c4179J9658j8260J236J7204K7647Q474j2701o164J6276N137k0242j1770J5730
5742H046k1012k1206P08J6982K131p217j5877m665o33L632P682J9392P778l286
5728g545l8508n358L2631J4734J5655q507J4290j3073p070j215j6705O830K3668
5715I827R091j35L300o310J8299j8720k2623j5717l091R180J3343l156k7227j5793
5701d9732J4990j994R174K8273j3216j2256J6466J8301J6098j8404l3996L013
5689b3283P206J3072j0204J0614J8363k8508P634J4607R707j4988K217J573l4935
5676b6925j5780L2576N746j0589P267p120m218k325K6300R293K4284J2686j544
$$ y = [5052, -35520, -17637, -7927, -17600, -6222, 11973, 1536, -11301, -6929, -19462, -5900, -46910, -34179, -14521, -32781, -31545, -14341, 13306, 21780, 9079, 2915, 19191, 24328, 4086, -7684, 8046, -12966, -34172, -33464, -16482, -14351, -21568, -37445, -42110, -42743, -39111, -31429, -12037, -4259, -7545, -46053, -51411, -18780, -4046, 11609, 3102, 17392, 4319, -2751, -3966, -20671, -13841, 9827, 18918, 18783, 22083, 15773, 34072, 15352, -7271, -22988, -26079, -16899, -3556, -6712, -33939, -49732, -34742, -36736, -27562, 711, -12505, -24761, -8295, 10006, 26104, 7700, -26296, -23283, -16077, -3005, -13209, -2595, 15768, -12740, -5106, 9501, 19208, 4220, 6437, 8010, -26925, -42705, -10129, -4383, -14972, -7705, -14825, -19043, -21368, 4932, 14225, 38509, 51195, 49651]
5663D9651o720k5563K444K1979j093j2881j0657j4021j4112p743j7152p180m935
5650d7983K4699K8925O800j592K3650O857q276j2459j4820k1399q626N347K4386
5637E509J3247k637k5136p729m471R157K2287o411j7341p636l307N273K2517K768
5623F090q152J9982J8659k3643N42J6329k846l0877K313J844l102p208J4214J1722
5609A5867k9708j313p316L719j9255N312N094l199J2155J2994K6951O12n851j0487
5595E575J5140k7660j9088j4065k2504J3037L3838K3895p163j2033P157l0194
5583c4065j2564J100L156K034k665n821M057R149P964P207r606L29Q862J9592
5569a271n28J2117j9659m8503K1361K8297Q245N149L9519j6031l1403J660j2220
$$ y = [49651, 42931, 17368, 19812, 41791, 40698, 27817, 17160, 3139, -10973, -18716, -35868, -43048, -47983, -23284, 5641, 12441, 10849, 34499, 41356, 33080, 20621, 5801, -15598, -24224, -18877, 5509, 18756, 16119, -9017, -16746, -21217, -12060, 10227, 3816, -13525, -21161, -24468, -19195, 3322, 6090, -2062, 17920, 36579, 12936, 13478, 29807, 26961, -3916, -1603, 241, -2861, -10069, 4145, 15867, -13841, -15154, -22470, -18751, -38006, -32694, -27600, -30799, -18644, -5650, 21301, 21913, 16062, 5575, 20715, -6945, -26033, -40098, -62602, -49565, -15727, 8168, 1005, -11028, -3871, -34065, -46629, -45529, -42373, -40339, -43004, -48825, -44768, -35619, -27655, -20448, -30054, -29725, -20863, -1271, -1799, 10318, -9341, -57844, -36483, -8186, 59, 5208, 44727, 28696, -2707, -1047, -13267]
5556a3267p015j4160j7307J9597K4606J5024o740j6096P040P185j6339Q173K317
5543f982l480j0436R828K6043K1542o564k5119q416r042k612R324P893J557k8873
5529b5337j6902J452J1009J2384J7892K0610j6948M960j6243o726p539J0288J1353
5516B53l211J0310Q276J0009J2358l1879O122j733j6575m316O492J4021j5753
5503e626M701J8072k9535k6997L842N080K1672K0726j0015j9993m688K088J1483
5490i190K838j203j4643J0497J6749J4201Q65j8754j3663n8728J7706J7168j119
5477c7276K6287J8893J5060j0401p547J2276N35k4465j7180R00J2379j4421k022
5464b6982K347j909j257P510O087L99K4570L831n427Q250r694p350l46j6975k3554
$$ y = [-13267, -20282, -34442, -51749, -32152, -7546, 7478, 738, -15358, -8318, -1133, -17472, -9299, -6982, -10462, -20898, -11070, 14973, 36515, 29951, 4832, -3584, -12626, -15238, -5914, 1979, 3536, -25337, -42239, -40787, -29778, -17394, 498, 21108, 4160, 9120, -7123, -13849, -21388, -11100, 253, -2958, 7352, 15628, 25637, 37995, 6116, 12238, 10505, -6070, -10386, -3894, 10127, -5626, -925, 17147, -12388, -39385, -35543, -30463, -8791, 11935, 1920, -18073, -22761, -20673, -9190, -6352, -7555, -22198, -11701, 5048, 19249, 20114, 1360, -12303, -71031, -53325, -36157, -37276, -10989, 7904, 22964, 12563, 5016, 17292, 17827, -6638, -23818, -22918, -10539, -24960, -26982, -24635, -26544, -27801, -20291, -14204, -13805, 10765, 14596, 9169, 17419, 7725, 375, 29, -16946, -40500]
5449d0500K810O569l965j5495K8626J6303j0484R4J1365k0255j4197P762J7271
5436a4096J5273J7304j69j8673l624k440K062Q896m218J9056l020k4331m9188
5423e7168N188J4630K5162J3173j3985j324L9113P711Q726j4802m792L111J2601
5410C7344k3408k0022j5535k3164l595J1437R891K2J1004K6724K7261n977j6648
5397A5334j6863j5361j7503Q783N247K0570J0894m673Jp976J8064J652j8461J1986
5383A1694q711m5166j1226J9868K8271L1415K2090j8197j5558K0075j1938j3902
5371H715o711r096n075K482q010j1972J1290K5213j5012m01n457o335j526j7814
5357c9709j4142Q248K5838K511K564n151j2360Q202L6993K8058j5582M787k866
$$ y = [-40500, -37690, -31121, -35086, -50581, -21955, -5652, -16136, -16042, -4677, -24932, -39129, -31367, -14096, 1177, 18481, 18312, -361, -3985, -6425, -4363, 4533, 315, 19371, 16351, -7980, -57168, -51980, -37350, -12188, 985, -13000, -14324, 24789, 32500, 41226, 26424, 21632, 24743, 37344, 13936, -6086, -21621, -44785, -48380, -36943, -27052, -27030, -16026, 10698, 37959, 31982, 15334, -1529, -16890, -34393, -25610, -20363, 207, 11101, 6428, 6429, -1547, 16517, 18169, -292, 11694, 2983, -42183, -53409, -33541, -5270, 26145, 48235, 30038, 14480, 34555, 22617, 8715, 2004, -7092, -12167, -9685, -17695, -29667, -18377, 6836, -8176, -8577, -14034, -20369, -21895, -39709, -53851, -45603, -19765, -17254, -14690, -19841, -32201, -23999, 12994, 41052, 25470, 30257, 27391]
5344B7391O468k27O591K308M137j8223k3645j0215L64j2553l96J1031J461j6154
5330b1662j3525r786N13J3652n842J6159j7702J3532K4197j8975j7116J4187J4511
5317g857k008Q281j0374k5283k1660R703K9212J0350k0558j4933J9260J0485r201
5304b4583j8334l225l263K5307J8716j946o872j2298k3696M778M1545l272j4391
5291b1534K2827q627k4804Q288K0049Q027J223n933J4851L623L582l680p041l5682
5277b4831J0400J3575j813J2532J71k1000k735J058j561p447J659J6513J3296
5264I817K728k3329m488J751j1230j0020q861K620l814J4558J0768k279L6853
5251A5074L439l695j6067j1763l677J783L0741K121n931j9038j196J0206j328
$$ y = [27391, 33859, 33632, 40223, 42531, 46668, 28445, 4800, -5415, -5051, -17604, -18000, -6969, -5508, -21662, -35187, -44973, -44460, -30808, -36650, -20491, -38193, -24661, -464, -19439, -36555, -22368, -7857, -9865, -1584, -11958, -37241, -58901, -49198, -19986, -9636, -30194, -45127, -25867, -15382, -24583, -42917, -46142, -49405, -24098, -5382, -7328, -14200, -26498, -50194, -45416, -3871, -7143, -21534, 1293, -7334, -32138, -23850, -3801, 4226, 5449, -484, 14367, 17990, 21572, 17892, 10851, -24831, -14431, -856, -2669, 9863, 10034, -10966, -13701, -12643, -14204, -21651, -19992, -3479, 9817, 12545, -10784, -15272, -13521, -24751, -34771, -43632, -41012, -44826, -30268, -19500, -21779, 15074, 18513, 14818, -1249, -13012, -16689, -14906, 15835, 17956, 12025, -7013, -8209, 1997, 669]
5238F69K606m535Q648L2770L848k2340m479M164k2176L901P854K860O087q55j3752
5223E270k976J9214M122n469R27p393j6460k2707j7701J1285r35J2028J8275j7552
5209b0072l1576r19L1131J0261L705j274j0934j3586O405L271j1079J1722J4178
5196h767M100j1462m777P701J8922q985j5109J8536J8869K0502R183k0624k7602
5183D87j8425k571R474J723p298K0351o8P32K573J0900O653J263q230R853J0486
5168C7903j3668k0486j1530O481j9187k443J6897J8138k6759j4514J1729J6843
5156e96K3702k2530k4741j2122j0499J0100K6732J2697m40j1032J2374Q801m553
5143G893K757N098O376m218j6719j4986J3998J882n824J3514j4625k0111J0018
$$ y = [669, 3275, -1260, 7388, 40158, 44006, 21666, 17187, 21351, -825, 3076, 10930, 13790, 19877, 19022, 5270, 2294, 21508, 25630, 20161, 21088, 13695, -2765, -25472, -43173, -31888, -32823, -20795, -2520, -20072, -51648, -52567, -21436, -11175, -7470, -8744, -19678, -33264, -26859, -23588, -34667, -22945, -8767, -4667, -16129, -20906, -13205, 5717, -3268, -18377, 159, 19028, 39530, 48713, 28089, 487, -17938, -20509, -11035, -9312, -16610, 3741, 3673, 4405, 6978, 17878, 24531, 25794, 17564, 27417, 37903, 24235, 3749, -7781, -1300, -20487, -22930, -6033, 12105, -14654, -29168, -17439, -596, 23106, 576, -24165, -36287, -46786, -36686, -9954, 2743, 2303, -8729, 3645, 12446, 7893, 10650, 15748, 22124, 17906, 1187, -13799, 199, 2081, -3743, 9771, -4854, -24965, -14947]
5130a4947M918M595P224J0886N94J5703L29k2983k7311o951L5378L6920J2296
5117E6651l9365N549L48l756j1013j6472J2001j745p001j899n213j3647J0596
5104a4966K6792J7626k1012r683j1028j4974l336K0695N62n230j1741k393R828
5091a8860J6711l333k990Q812k070k0665j4910K0135R467M632P836r78j882J2871
5077A4776j6555j8562O320L514M707R127j220r190j2702r778k8220k613K0078
5064d0318J9423r473n125N911j1129r078J5387J0297L3489j1481l710j0981k2166
5051c8954j0796J2959K0022J9826N835j2716R106J5722N96k8659j1891J0944l465
5038a1471n004j0442p460J3752J6709Q808P830k415k5043k486Q886l075J6186
$$ y = [-14947, -10029, -5434, 1790, 12676, 13270, 28973, 29302, 6319, -20992, -27943, 7435, 44355, 56651, 17286, 22835, 23183, 19427, 8414, -8058, 3943, 2198, -4803, -6702, -11915, -25562, -14966, 11826, 29452, 8440, -1243, -12271, -27245, -30581, -9886, -9324, -14554, -26295, -28688, -18860, -2149, -5482, -8472, 340, -1730, -22395, -37305, -17170, -7703, -3071, 4765, 3787, 1905, 14776, -1779, -20341, -14021, -10507, -5800, 3327, 2107, -7083, -19785, -29563, -57783, -60396, -40318, -20895, -30368, -35493, -29582, -40711, -49789, -34402, -24105, 9384, -2097, -5807, -16788, -38954, -49750, -36791, -16769, 3057, 8892, -3824, 5282, 21004, 21600, -7059, -18950, -8006, -11471, -16475, -26917, -34377, -20625, -3916, 4892, 12722, 10307, -14736, -17222, -8336, -11411, 4775]
5025D775J5700j3992j9218j8087j2029m704J7107L2951J3847j6268j1414j5420
5013b6752J2423R328J5239K6565j3938o908J39l8439q883M7616K7219j7198k7543
5000a132j2691Q698J8300k8285r642L126K1758J6117J0951J912k555k2727m50
4987C380J0199J9619Q311k4407l0265n119j7662J2964R879P985J3898O251J51
4974A5184O591O18j5055k3558j0938J9483o649r700J4355Q304R340Q569k1082
4961d538j0973l3818K8547L1638M020J3152J1336J0347j8624m0100k589J7752
4949F150q7n918N637j7445J5731J5811j1988j7798m910j1775P899J1626K521j9210
4935b3756k0077j4579J2824Q101J1372M5613L20k4078l9979l883M4800q722p508
$$ y = [4775, 20475, 6483, -12735, -30822, -42851, -47555, -30448, 2503, 16350, 82, -11332, -26752, -14329, -5001, 10238, 36803, 22865, 15957, 16096, -22343, -31226, 16390, 43609, 26411, -1132, -13823, -5125, 13175, -15110, -24752, -21626, 132, 16249, 27200, 29112, 26557, 3830, 3380, 13579, 33198, 41509, 17102, -13163, -18282, -35944, -22980, -13101, -5116, 8782, 15033, 15184, 21775, 22393, 7338, -16220, -27158, -7675, -14324, -24024, -9669, -1365, 7975, 16544, -4538, -15511, -49329, -20782, 10856, 14876, 28028, 39364, 49711, 31087, -9013, -11602, 6150, 6063, 145, 5782, -11663, 4068, 19879, 7891, -9907, -14817, -26592, -18693, -7067, -4546, -23756, -43833, -58412, -45588, -37487, -26115, 19498, 19818, -4260, -44239, -48122, -3322, -12044, -19552]
4922a9552j0528r58j4615l161L1212M4325J0507j0053k2367j3024J2389N660j6327
4909f492Q55j0502R427L0297L866k3098o304J6275q341m547k1215K674P101J0082
4895G8j2184k2767K4410J5658J0176K2540o319Q07q81p509k0184k1810N669L0125
4881A7809P750q410j5422k0191Q350L7860q216R260N617j6822J1739R263j9155
4868A9432j4082j9568Q856J4453j2968j8495J767O31r354J3627M429j1549J990
4855b0831r390j5010Q444J3648L439L969K1186K1388N401M179j6945j4606j8355
4842a3483N182J064k0789l837l512J8291J419L503o883m690J4733J8836j0238
4829d04k2171k099J5170j814O033L5340K991k2221k4914l254K9649j2138J435
$$ y = [-19552, -30080, -31038, -45653, -48814, -17602, 26723, 37230, 27177, 4810, -8214, 4175, 9835, -6492, -5637, -16139, -6712, 23585, 27451, 4353, -1951, 14324, 5983, 1436, -19779, -17105, -10004, 78, -12106, -34873, -10463, 5195, 15371, 37911, 31592, 32399, 31518, 24009, 3825, -17985, -12316, 17809, 25559, 17149, 1727, -18464, -10114, 27746, 19530, 28790, 34407, 17585, 29324, 38587, 19432, 5350, -14218, -5362, 9091, -3877, -22372, -20605, -19974, -29328, -15701, -11272, -22821, -20831, -30221, -45231, -36787, -23139, -19700, -15731, 5455, 26843, 32244, 36423, 19478, 4872, -13483, -8301, -7237, -28026, -31863, -35375, -17084, -15665, -12162, -19045, -23735, -9002, 9834, -404, -22575, -24674, -9504, -11318, -5285, 30055, 33046, 10825, -14089, -17343, 12306, 168, 1603]
4816A603j2239j9821P184j0354P628M427n711j7482m3997J0892K3535P289J93
4803d6853L3119O432k7466O146J2014j3052K7370Q775k2895j3827N883K2279L9332
4790C7257n183j1496p434R082N747j4338j8291l2496j7923K8496K5799p452J181
4777g051J7869K1647J5955k733q813k674p260J6986L1654j5083k0241n1203j2945
4764b3892K820K4047M831j4135j1166Q350K4238O816k0776o064p216K096k5867
4751c5918J3716j7824k289J4328J3310j6563j0115m995j441L5244R804j2580j3574
4738b8897J7285p186N40J7061Q724l550n830m582k208L295n973r868L822J6567
4724h00J7625j0401n049J6913j065l7521j0312K663m912K8434j728j5763J390
$$ y = [1603, -10636, -30457, -23273, -33627, -25999, -21572, -27283, -44765, -88762, -77870, -54335, -47046, -46853, -13734, -7302, -34768, -28622, -16608, -29660, -2290, 6485, -16410, -30237, -24354, -2075, 37257, 32074, 20578, 13144, 22226, 27973, 13635, -4656, -37152, -55075, -26579, -780, -8232, -7051, 10818, 32465, 48420, 45687, 36874, 34200, 26940, 43926, 75580, 60497, 40256, -10947, -23892, -21072, 2975, 7806, -6329, -17495, -9145, 15093, 21909, 1133, -4931, -12147, -10051, -35918, -22202, -40026, -42315, -27987, -14677, -31240, -41355, -46350, -47791, -12547, -2743, -15323, -28897, -11612, -18798, -18258, -1197, 7527, 3977, -1853, -6435, -8643, -5348, -11321, -21189, -17367, -800, 16825, 6424, 1375, 18288, 17223, -20298, -30610, -27947, -32859, -4425, -6153, -21916, -20526]
4711b0526N679p901j9748j2875m275R742L621K271L160j263N129J6357N055J9260
4697C686j139Q984J1427J951l2069m3108j8432J0815L2620l863k7686J4534J4594
4684b7686K1945J8609Q166J7942j6850l7540j709J8645J0468m055m711j071j8962
4671a6809J3112O715n9j679l101J137j343p490q343j089k38J6605j931k1256P310
4656a8459J6997J2859n431j498K46j9870m711k571P952k0104j249K1344q14n240
4642b0549q53J6429p484k3339n482R160r784J9905K4614L216j7818pO479j7247
4628b2760k5369N2875L3439j3935k3457k277J5951L0518k911k4148q610J8274
4616B7590n992k1705J977P964J3840j7136j0186q128J4077Q406k570k1350O749
$$ y = [-20526, -14847, -22748, -42496, -55371, -59646, -49904, -46283, -44012, -40852, -42115, -36986, -20629, -15574, 3686, 2547, 11531, 22958, 24909, -7160, -50268, -68700, -57885, -25265, -29128, -56814, -42280, -27686, -5741, 12868, 21034, 38976, 22126, -15414, -17123, 1522, 11990, 7935, 3224, 2153, -16809, -3697, 3018, 2959, 1280, -1821, -684, -2027, -9517, -17860, -18949, -19187, -2582, -4513, -25769, -18459, -1462, 11397, 5966, 4468, 4714, -15156, -19867, -22438, -14486, -34590, -35839, -14495, -15309, -20549, -21402, -4973, -12457, -35796, -41278, -32118, -41902, -21997, 2617, 5833, -11985, -11992, -5513, -22760, -48129, 4746, 38185, 24250, 793, -1484, 14467, 44985, 42074, 17926, 9316, 27590, 21598, -107, 1870, 9834, 23674, 6538, -3648, -11776, 2301, 10707, 8137, -13213, -6464]
4603f464K930p618j8373k4016J8445J8708r443m782O764J881J938K7896K5381
4590C3247k599k6856k8899Q27O053r837j281K9419k840K474K7277n74k2083k1012
4576a6684j23J5076Q251j2759j9086j5256j730J2298L9451J0156K175M87r84p001
4562A4271o534l4274j1854K5237Q412p033j0357K9602q199M83J3190j8649J185
4549d520j3575o578n346L36J2582M867m242O304J9617o7r0j6184J3247o279k5425
4534b5353N461K8018K6961p240l3895q415J2334K8593O759p550r072m291k2910
4521a0600J3390K4388r694j9634J489J4734K3115Q805o657j9341P149M16R385
4508C6945j8184j1191j2458N920n537k382m288Q268J6871l09Q507j3953j4924
$$ y = [-6464, -3534, -11152, -29525, -53541, -35096, -16388, -25831, -30613, -23849, -21968, -20030, 7866, 33247, 30648, 3792, -25107, -24280, -18227, -28064, -29345, 74, -2766, -292, 26985, 26411, 4328, -16684, -16807, -1731, 6520, -6239, -25325, -40581, -42311, -30013, 9438, 19594, 21769, 22256, 21272, 14271, 7737, -26537, -38391, -13154, -4742, -11775, -22132, 7470, -729, -246, 12944, -5705, -4520, -18095, -24673, -30019, -29683, -17101, -12234, -16476, -10172, 9445, 9378, 9288, -6896, 6351, 72, -25353, -19892, 8126, 35087, 27847, -6048, -14463, -2129, 26464, 33223, 25673, 16601, 12310, -10600, 2790, 27178, 17484, -2150, -661, 14073, 37188, 45993, 39336, 19995, 27144, 27560, 36945, 18761, 7570, -4888, 1032, -4505, -6887, -11175, -2907, 13964, 13655, 22162, 8209, -6715]
4495f715J0229L563J0129R386j0409k7141K9529J762k2812j1128j7536n330k0821
4482e7294n892J0754K0598J7155j1761k7320J9195Q299L940o63j0082J6278J0527
$$ y = [-6715, 3514, 7077, 17206, 26592, 16183, -10958, 18571, 20333, -2479, -13607, -31143, -36473, -57294, -63186, -52432, -31834, -14679, -26440, -53760, -34565, -26266, -22326, -22989, -33071, -16793, -6266]
$$ [...]
##END NTUPLES=NMR SPECTRUM
##END=
