##TITLE=Analysis number 316557
Compound Code cc 26813
Book Reference 461/20
Project Code adrs
Chemist Name toml
##JCAMPDX= 6.0         $$ Bruker NMR JCAMP-DX V2.0
##DATA TYPE= NMR SPECTRUM
##DATA CLASS= NTUPLES
##ORIGIN= Bruker BioSpin GmbH
##OWNER= nmr
$$ XWIN-NMR		Version 3.5
$$ Thu Jan 19 14:28:21 2006 GMT Standard Time (UT+0h)  MAYBRIDGE\nmr@NMR_250MHZ
##.OBSERVE FREQUENCY= 250.131544655141
##.OBSERVE NUCLEUS= ^1H
##.ACQUISITION MODE= SIMULTANEOUS (DQD)
##.ACQUISITION SCHEME= undefined
##.AVERAGES= 16
##.DIGITISER RES= 18
##SPECTROMETER/DATA SYSTEM= dpx250
##.PULSE SEQUENCE= zg30
##.SOLVENT NAME= CDCl3
##.SHIFT REFERENCE= (INTERNAL, CDCl3, 0, 16.522)
##AUDIT TRAIL= $$ (NUMBER, WHEN, WHO, WHERE, WHAT)
$$ ##TITLE= Audit trail, XWIN-NMR		Version 3.5
$$ ##JCAMPDX= 5.01
$$ ##ORIGIN= Bruker BioSpin GmbH
$$ ##OWNER= nmr
$$ C:\u/data/dgb/nmr/ADRS/14940/pdata/1/auditp.txt
$$ ##AUDIT TRAIL=  $$ (NUMBER, WHEN, WHO, WHERE, WHAT)
(   1,<2006-01-19 14:27:55.98 +000>,<MAYBRIDGE\nmr>,<NMR_250MHZ>,
      <created by zg, POWCHK disabled, PULCHK disabled
       configuration hash MD5:
       62 19 C7 07 E1 42 D1 B7 37 6C 3D D0 77 39 F9 E6
       data hash MD5: 64K
       DC 7E 0B 68 74 78 46 33 2E 0B 14 75 00 0A 5D 6A>)
(   2,<2006-01-19 14:28:10.64 +000>,<MAYBRIDGE\nmr>,<NMR_250MHZ>,
      <Start of raw data processing
       ef LB = 0.3 FT_mod = 6 PKNL = 1 SI = 32K 
       data hash MD5: 32K
       6C D4 48 B1 F8 9C 57 44 F4 36 E9 0A AF 5E 46 E8>)
(   3,<2006-01-19 14:28:13.31 +000>,<MAYBRIDGE\nmr>,<NMR_250MHZ>,
      <apk 
       data hash MD5: 32K
       1D 7A 1D 00 AE 0E 29 04 91 E5 F1 F2 BE B7 58 34>)
(   4,<2006-01-19 14:28:14.14 +000>,<MAYBRIDGE\nmr>,<NMR_250MHZ>,
      <abs ABSG = 5 
       data hash MD5: 32K
       86 83 5E F6 29 4B 30 F6 B8 B5 07 13 17 E2 76 D0>)
$$ ##END=
$$ 
$$ hash MD5
$$ F6 94 F4 79 E3 24 0A E5 2D 4A F5 A2 20 33 45 DF
##$RELAX= 
##$RELAX= 
##$RELAX= 
##$RELAX= 
##$RELAX= 
##$RELAX= 
##$RELAX= 
$$ Bruker specific parameters
$$ --------------------------
##$DU= <C:\u>
##$EXPNO= 14940
##$NAME= <ADRS>
##$PROCNO= 1
##$TYPE= <nmr>
##$USER= <dgb>
##$AMP= (0..31)
100 100 100 100 100 100 100 100 100 100 100 100 100 100 100 100 100 100 
100 100 100 100 100 100 100 100 100 100 100 100 100 100 
##$AQSEQ= 0
##$AQ_mod= 3
##$AUNM= <au_zg>
##$AUTOPOS= <53 >
##$BF1= 250.13
##$BF2= 250.13
##$BF3= 250.13
##$BF4= 250.13
##$BF5= 500.13
##$BF6= 500.13
##$BF7= 500.13
##$BF8= 500.13
##$BYTORDA= 1
##$CFDGTYP= 0
##$CFRGTYP= 5
##$CHEMSTR= <none>
##$CNST= (0..31)
1 1 145 1 1 1 1 1 1 1 1 1 1 1 1 1 1 1 1 1 1 1 1 1 1 1 1 1 1 1 1 1 
##$CPDPRG= <>
##$CPDPRG1= <>
##$CPDPRG2= <>
##$CPDPRG3= <>
##$CPDPRG4= <mlev>
##$CPDPRG5= <mlev>
##$CPDPRG6= <mlev>
##$CPDPRG7= <mlev>
##$CPDPRG8= <mlev>
##$CPDPRGB= <>
##$CPDPRGT= <>
##$D= (0..31)
0 1 0 0 0 0 0 0 0 0.06 0 0 0 0 0 0 0.0002 0 0 0 0 0 0 0 0 0 0 0 0 0 0 
0 
##$DATE= 1137680874
##$DBL= (0..7)
120 120 120 120 120 120 120 120 
##$DBP= (0..7)
150 150 150 150 150 150 150 150 
##$DBP07= 0
##$DBPNAM0= <>
##$DBPNAM1= <>
$$ [...]
##$SUBNAM7= <"">
##$SUBNAM8= <"">
##$SUBNAM9= <"">
##$SW= 20.6930455092707
##$SWIBOX= (0..15)
0 0 3 0 0 0 0 0 0 0 0 0 0 0 0 0 
##$SW_h= 5175.983436853
##$TD= 65536
##$TD0= 1
##$TE= 294.16
##$TE2= 300
##$TE3= 300
##$TEG= 300
##$TL= (0..7)
0 120 120 120 120 120 120 120 
##$TP= (0..7)
150 150 150 150 150 150 150 150 
##$TP07= 0
##$TPNAME0= <>
##$TPNAME1= <>
##$TPNAME2= <>
##$TPNAME3= <>
##$TPNAME4= <>
##$TPNAME5= <>
##$TPNAME6= <>
##$TPNAME7= <>
##$TPOAL= (0..7)
0.5 0.5 0.5 0.5 0.5 0.5 0.5 0.5 
##$TPOFFS= (0..7)
0 0 0 0 0 0 0 0 
##$TUNHIN= 0
##$TUNHOUT= 0
##$TUNXOUT= 0
##$USERA1= <user>
##$USERA2= <user>
##$USERA3= <user>
##$USERA4= <user>
##$USERA5= <user>
##$V9= 5
##$VALIST= <valist>
##$VCLIST= <CCCCCCCCCCCCCCC>
##$VD= 0
##$VDLIST= <DDDDDDDDDDDDDDD>
##$VPLIST= <PPPPPPPPPPPPPPP>
##$VTLIST= <TTTTTTTTTTTTTTT>
##$WBST= 1024
##$WBSW= 4
##$XGAIN= (0..3)
0 0 0 0 
##$XL= 0
##$YL= 0
##$YMAX_a= 574242
##$YMIN_a= -476411
##$ZGOPTNS= <>
##$ZL1= 120
##$ZL2= 120
##$ZL3= 120
##$ZL4= 120
##$ABSF1= 16.522
##$ABSF2= -4.171173
##$ABSG= 5
##$ABSL= 3
##$ALPHA= 0
##$AQORDER= 0
##$ASSFAC= 0
##$ASSFACI= 0
##$ASSFACX= 0
##$ASSWID= 0
##$AUNMP= <proc_1d>
##$AZFE= 0.1
##$AZFW= 0.1
##$BCFW= 0
##$BC_mod= 0
##$BYTORDP= 0
##$COROFFS= 0
##$CY= 12.5
##$DATMOD= 1
##$DC= 0
##$DFILT= <>
##$DTYPP= 0
##$F1P= 14.0000005364418
##$F2P= -0.99999901652339
##$FCOR= 0.5
##$FTSIZE= 32768
##$FT_mod= 6
##$GAMMA= 0
##$GB= 0
##$INTBC= 1
##$INTSCL= 1
##$ISEN= 128
##$LB= 0.3
##$LEV0= 0
##$LPBIN= 0
##$MAXI= 10000
##$MC2= 0
##$MEAN= 0
##$ME_mod= 0
##$MI= 0
##$NCOEF= 0
##$NC_proc= -3
##$NLEV= 6
##$NOISF1= 0
##$NOISF2= 0
##$NSP= 0
##$NTH_PI= 0
##$NZP= 0
##$OFFSET= 16.522
##$PC= 1
##$PHC0= 94.9718
##$PHC1= -11.84035
##$PH_mod= 1
##$PKNL= yes
##$PPARMOD= 0
##$PSCAL= 4
##$PSIGN= 0
##$REVERSE= no
##$SF= 250.13
##$SI= 32768
##$SIGF1= 0
##$SIGF2= 0
##$SINO= 400
##$SIOLD= 32768
##$SREGLST= <1H.CDCl3>
##$SSB= 0
##$STSI= 32768
##$STSR= 0
##$SW_p= 5175.98343685301
##$SYMM= 0
##$S_DEV= 0
##$TDeff= 65536
##$TDoff= 0
##$TI= <Analysis number 999999
Compound Code 99
Book Reference 9
Project Code 9>
##$TILT= no
##$TM1= 0
##$TM2= 0
##$TOPLEV= 0
##$USERP1= <user>
##$USERP2= <user>
##$USERP3= <user>
##$USERP4= <user>
##$USERP5= <user>
##$WDW= 1
##$XDIM= 32768
##$YMAX_p= 429902419
##$YMIN_p= -53723
$$ End of Bruker specific parameters
$$ ---------------------------------
##NTUPLES= NMR SPECTRUM
##VAR_NAME=  FREQUENCY,     SPECTRUM/REAL,   SPECTRUM/IMAG
##SYMBOL=    X,             R,               I
##VAR_TYPE=  INDEPENDENT,   DEPENDENT,       DEPENDENT
##VAR_FORM=  AFFN,          ASDF,            ASDF
##VAR_DIM=   32768,         32768,           32768
##UNITS=     HZ,            ARBITRARY UNITS, ARBITRARY UNITS
##FACTOR=    0.157963299565203, 1,           1
##FIRST=     4132.6476996994, 0,             0
##LAST=      -1043.33573715361, 0,           0
##MIN=       -1043.33573715361, -53723,      0
##MAX=       4132.6476996994, 429902419,     0
$$ Real data points
##PAGE= N=1
##DATA TABLE= (X++(R..R)), XYDATA
$$ [...]
21665 1717 1598 -1958 -4319 -4052 -3682 -3215 500 2135 3474 1892 -717 -876 538 468 6845 11088
21649 11088 11766 12399 18561 16249 7571 5485 8241 8464 8091 10291 10429 8611 5627 2047 635 4645
21633 4645 2309 1562 2054 1643 969 3098 1822 2667 7910 3338 1224 1152 32 6011 4689 -109
21617 -109 1488 2157 5557 6999 7348 4868 2891 5566 -267 -1785 5321 7342 3713 1313 -1954
21602 -1954 -2086 -385 2725 8528 7541 1446 -725 -301 275 -286 -2734 -6644 -4673 -6546 136 4557
21586 4557 3469 2543 5075 5812 2171 2142 5257 3392 3576 2271 4147 5044 8032 11009 11252 10038
21570 10038 4875 -1655 -1433 -893 -4402 -4640 -2296 5490 4813 829 200 -1337 -1918 192 5481 4756
21554 4756 3003 -270 -2446 -7972 -8268 -1607 1780 -1711 1123 4402 4835 3378 4443 6045 1138
21539 1138 -683 1271 3521 1395 1958 137 -1883 -2132 -2723 1619 6689 2972 -604 -7168 -10820
21524 -10820 -6756 -4489 -2942 1871 5362 3723 3797 4343 7057 6586 1956 -917 -2613 3331 7556
21509 7556 805 -1188 813 555 1999 5067 8556 1232 -3780 -5596 -5653 -5967 -3493 -3388 -3103 710
21493 710 1529 5707 5439 5044 8023 8094 6599 7501 7576 1769 -1870 1887 7660 5381 6183 3332 3964
21476 3964 6737 9200 7898 3519 -905 2808 2157 3670 7975 10958 8059 2046 295 3733 832
21461 832 3104 6046 5404 6669 12867 13831 5218 1706 2064 8915 7929 8477 5796 3262 7114 7705
21445 7705 6428 5766 5293 5219 6130 4921 2581 4137 2468 2197 -5032 -9457 -6257 -1083 3 -950
21429 -950 949 -320 -9872 -9466 -4754 -2321 -2791 -1377 3754 -1798 1717 2211 3983 3141 4031 2297
21413 2297 3071 2632 5063 9048 6635 5315 568 -2515 632 5693 10434 12677 9472 5106 5850
21398 5850 3874 2624 -572 -128 5173 6345 5980 8405 11341 9176 3355 -297 2622 7410 1704
21383 1704 -1287 -2853 -5833 -5364 -4575 -7491 -8142 -7110 728 1030 -1874 2499 8530 5455 4208 3579
21367 3579 3218 6796 7234 7183 7792 8482 8121 10148 11542 13156 10544 10396 9592 6793 2867 2599 2435
21350 2435 1571 4671 7941 3824 2863 3593 3585 657 38 2150 2773 -3 -6898 -10171 -6881 -1041 3515
21333 3515 1350 1455 207 2390 4701 1280 -1444 -3258 -604 260 8067 10204 8994 3694 7128
21318 7128 10137 10266 6302 4029 6289 5778 8488 9316 7709 7217 4114 2205 6262 8912 7110 4971
21302 4971 5008 -2747 -1269 2642 6960 10203 6756 955 -2554 3138 4091 1868 -5413 -2103 -1430 963
21286 963 2725 8471 7654 5574 6593 8083 4847 4207 3512 399 1382 11398 14919 12232 8166 5546
21270 5546 3917 1758 3893 3513 1118 -1448 -7886 -10028 -965 -970 518 -263 -2278 -6256 -4589 -377
21254 -377 -561 170 -2389 -5597 -5455 1138 5083 3714 1923 -2637 -5339 -1615 4611 1238 -3344 -3562
21238 -3562 3456 -3201 -4148 -3034 -7131 -5826 -5025 -856 1056 -1564 -7585 -8963 -1794 1804 1720 725
21222 725 857 -2841 -1402 -2879 -7258 -5649 -781 -850 -522 3280 3882 4899 -1309 -4816 -7083 -6498
21206 -6498 -8194 -3631 131 1017 2386 -180 151 -2056 -4581 -2396 1530 3198 5498 6411 3444
21191 3444 1802 1677 -546 -2355 926 345 116 4364 11408 10607 2698 -1018 1882 6580 2504 -13
21175 -13 -1156 -2654 -7165 -11605 -9616 -8648 -814 2883 352 -252 -261 5724 7151 5783 7486 10806
21159 10806 7726 2666 3620 3803 1004 1426 3580 1159 -5939 -11472 -11223 -8204 -6161 -973 -1936 -1778
21143 -1778 400 -2496 -737 3860 2395 -5003 -9715 -6401 -1294 2249 3938 3591 384 -1980 -971
21128 -971 2592 2030 6818 9382 5507 -1542 -986 77 2334 1098 2429 773 -4004 -3318 2393 2899
21112 2899 3382 3649 2993 -2757 -2681 217 1992 -4301 -5998 -4625 -7695 -9261 -9298 -7013 -5289 -8817
21096 -8817 -11574 -12335 -13754 -9396 -717 1830 5233 1386 -5885 -4018 -1932 1499 4131 5878 4823
21081 4823 7050 10858 12137 5685 3385 3826 2775 6394 10232 9951 7591 4723 2254 251 5196
21066 5196 8067 5518 3468 -3629 -618 5026 8750 7130 6877 5584 4731 -3660 -6178 -8412 -11886
21051 -11886 -10552 -9363 -7487 -1962 -3265 -4525 -2255 -2525 -5016 -5221 -2624 -49 -1523 -3077 -1521
21036 -1521 -1215 -749 3538 8263 5747 607 -5020 -3278 1384 -4700 -10311 -4117 -1185 2935 4157
21021 4157 1924 2703 3093 -2287 -1562 1022 2541 3580 6065 4941 984 4124 4276 4257 2013 -2328
21005 -2328 1561 7119 8066 3816 2815 531 4474 5044 3489 4233 1070 -2401 -2321 735 3020 4284
20989 4284 3655 4157 3729 2560 5941 3752 5032 8504 9257 4700 975 -5049 -7709 -9926 -6014 -3920
20973 -3920 946 5227 3537 -2239 -3245 -5735 -10301 -10925 -9177 -15341 -13391 -9330 -7084 -5478 -1031
20958 -1031 -2746 -7530 -6503 -4580 -1018 1907 -80 -4085 -1553 2594 20 -2155 -3053 -2951 -5011
20943 -5011 -47 1965 -3201 -3864 -5022 -2994 -626 -2726 -5916 -6120 -2349 -724 -1106 -2212 -1682 -2615
20927 -2615 -2713 -6446 -1891 7167 8732 8418 11435 12617 7496 5065 5702 6032 6153 -142 -3235 -3112
20911 -3112 946 138 -1224 3375 1304 -6044 -4348 -2027 -163 3163 2135 -2897 -5439 -5564 -7341
20896 -7341 -10088 -10009 -4053 -4066 -4310 -6925 -8236 -7564 -4184 -3360 -8188 -11571 -12263 -11219 -7663 -6975 -5105
20879 -5105 -5170 -4192 -211 905 4139 4703 341 -2294 -2411 -1529 -395 123 -1817 521 2569 8052
20863 8052 8761 3454 -86 -3541 309 -373 2317 -744 -695 -2242 -871 -1701 41 -359 -1448 -3409
20847 -3409 -5424 -1299 -755 -2025 -6754 -5697 -4804 -2616 -2689 -2492 -3994 -1731 2063 3435 1365 2205
20831 2205 -1532 -4205 -6615 -3360 -2064 -3103 -1227 4544 -254 -5621 -1270 5 -2041 -6745 -7447
20816 -7447 -8965 -6126 2624 6029 3690 3673 2064 -1251 1415 3056 27 -3587 -896 644 -5097
20801 -5097 -8186 -6319 -4010 -3334 -3038 -9188 -9264 -14348 -12777 -6977 -6456 -1640 1809 7 611 200
20785 200 -357 -33 -986 -7079 -7553 -4157 -3019 -2794 -4603 -8036 -3664 1693 4435 6173 6074 5246 7180
20768 7180 3540 3165 4007 1003 -4009 -5392 -1174 3103 -2725 -3426 818 4498 9058 9546 6293 1224
20752 1224 -3302 -668 2206 3983 2936 4405 6415 5154 2840 1305 2298 5995 5330 2270 3595
20737 3595 4263 2142 -516 3447 3967 -2195 -3652 -1648 -2040 -4093 -1078 -1101 -509 1608 -1977 -2224
20721 -2224 -1198 3160 5245 1011 -3452 -2476 -294 2472 4332 1141 -144 -2308 -408 3400 4257
20706 4257 2662 -570 1000 3804 2849 494 -1217 -1750 -1992 -1777 -316 -435 -1435 -404 2744 2143
20690 2143 1719 1290 3201 6192 2998 628 1765 -2216 -3014 -1838 -362 -590 -7873 -13555 -9673 -7624
20674 -7624 -6842 -5076 -1395 -1810 -531 1981 973 -1441 -1070 -5620 -4956 -223 -1548 -1337 -4757 -4396
20658 -4396 -7079 -8260 -4989 1822 5550 5742 1932 1270 4064 2847 5061 5255 9508 12399 7602
20643 7602 5836 4364 2567 7098 8866 6760 6080 5134 3358 439 -2938 -6077 756 7062 8118
20628 8118 8805 4553 -2081 -2691 -2378 -1284 799 -4040 -1919 2159 -1809 -6126 -5441 -296 1970 1299
20612 1299 -519 -805 -4803 -6132 -4076 -2917 -3212 -1684 -2633 -1166 3323 7580 8361 6152 229 -5390
20596 -5390 -7847 -3385 3126 4390 1 -4177 -663 -4438 -2209 -3254 1519 4713 6211 6177 2282
20581 2282 5167 9335 8986 8116 2349 1199 -522 4129 1431 3554 768 -3257 -5816 -7770 -3804
20566 -3804 -634 1089 2340 6663 11774 10650 7972 1201 1471 -2600 -2235 -2518 -1739 -1076 938 92
20550 92 1991 -1839 -3653 2506 -314 464 4330 4831 2006 3863 -66 -578 -1835 -3054 -1979 -1648
20534 -1648 -3841 -393 2650 3378 4030 6217 2474 3681 2105 3541 -603 -2444 -5423 -11399 -6170
20519 -6170 1048 2939 -1778 -7810 -6216 -4236 -6852 -7018 -6086 -6826 -6308 -5105 -6964 -8660 -7867 -5459
20503 -5459 -7484 -6106 -2112 -1407 -1748 -1596 -2571 -1923 -3228 -4642 -5097 -3278 -1906 -2222 340 3373
20487 3373 -356 1209 -1538 -3994 -2670 -5745 -6256 -5550 -1338 -1656 -1334 2767 1766 2352 5201 4558
20471 4558 1187 -2306 974 8129 2647 -2583 -6159 -7916 -4694 -101 -804 6320 12236 8277 5616
20456 5616 731 -2276 -1555 719 4519 7124 6749 9906 8137 4986 4454 5795 6289 928 -272 -1531
20440 -1531 -7914 -6852 -3 588 -4544 -6019 -2512 -1571 -5987 -6343 -1694 3050 5266 5866 1515 30
20424 30 -4073 -2256 -2493 -5098 -2975 783 1341 1695 505 -3948 1466 4858 8196 2837 -2386 868
20408 868 2033 -416 -2211 1477 5153 2742 -2637 -1901 1096 4067 3334 2569 3356 -518 -2002 -2350
20392 -2350 -4627 -5061 -3116 -2751 -6462 -10629 -9339 -1751 598 -2145 -11530 -11854 -12315 -12299 -9209 -7628
20376 -7628 -6197 -4069 -3880 -3897 -1942 1438 767 -1576 -3383 -1941 -17 2187 476 -8688 -9466 -8836
20360 -8836 -8857 -6866 -807 1989 306 -3190 -2321 -1835 -3101 401 700 -1023 -4425 -1789 2029 1541
20344 1541 2032 -2308 -4781 -7730 -8564 -4677 -3472 -3447 -1992 -5137 -6240 -6273 -2677 -8350 -10801 -9936
20328 -9936 -5761 -1638 -2294 -486 -1956 -1279 -313 1003 3285 1581 0 1564 622 -99 -1471 -4265
20312 -4265 -6293 -3176 -1082 -1726 483 1510 -152 -2711 1004 2744 -1420 -4619 3278 2997 3745
20297 3745 7654 8831 2655 -2977 -6040 -8626 -2800 -276 32 -2867 -3420 1636 7848 4891 6014
20282 6014 9611 10440 9041 3612 -2924 -5904 -7008 -7384 -4233 -2205 1173 3682 3949 2157 4397
20267 4397 2845 2083 124 703 5312 7271 6005 3311 2917 -360 -8429 -7729 -7317 -6059 -6358 -9416
20251 -9416 -9803 -4887 -1822 -2284 -6829 -4693 -1341 -5417 -5409 -1347 6683 3955 1499 2176 2383 4646
20235 4646 5820 5360 4956 2538 4611 4736 2980 4540 4057 4118 5726 3507 2158 -2207 -804 2282
20219 2282 1474 -1995 -138 2572 4986 5860 7583 7082 4083 728 508 3683 9332 4234 1860 -1304
20203 -1304 -53 60 -487 -993 -2671 -8054 -3820 1579 -353 -2738 -5655 -4366 -5321 -7322 -3694 -86
20187 -86 -283 4417 8155 9801 4341 1870 1370 -5264 -4694 -3777 146 1668 213 1858 3114 579
20171 579 4723 6996 3664 -6273 -8294 -2371 -300 -3722 -5113 -1601 -2277 3937 5446 2343 3991
20156 3991 2137 -1053 -1660 -5298 -3885 -109 859 -7183 -12071 -4771 -5175 -11261 -8073 -3009 -1946
20141 -1946 -3918 -3275 -5007 -1987 346 2107 14 -668 1963 1137 -4247 -8235 -8598 -4864 -4796 -3498
20125 -3498 313 -1261 -125 1588 -3240 -1571 236 -5593 -3490 447 3525 84 -4784 -1310 -2029
20110 -2029 -4495 -7074 -9549 -10703 -7818 -5252 -3786 -843 934 4686 6487 6595 2208 3570 7876
20095 7876 5248 1214 -904 -901 -3439 -4404 -5561 -7130 531 9427 11862 11760 9798 6942 3258 3459
20079 3459 4697 1508 3142 5451 3137 2406 4288 4792 7433 11627 10676 5527 -2996 -9214 -9210 -3276
20063 -3276 -123 -3338 -8247 -9236 -8885 -9309 -8878 -1375 2452 -3720 -7035 -9126 -4461 3356 -376 -3073
20047 -3073 -4329 -666 541 -1541 -2762 2555 1129 -5576 -3793 1632 3748 4640 3765 3328 -5585
20032 -5585 -4870 2404 410 -878 410 -4996 -5949 -836 -1734 -2792 1626 2820 1796 4474 1991
20017 1991 -1431 -2190 -1104 -1414 166 -1234 522 1712 -2283 -2923 -2763 -4435 1156 3649 80 -9961
20001 -9961 -9017 -2741 -4844 -5760 -6885 -5919 -5443 -8132 -8684 -6730 -5348 -4048 -2841 -5420 -2330 4267
19985 4267 6730 2750 -2843 -5518 -4010 -1014 -1472 -1082 -37 -1872 -6981 -5004 -5034 -5453 -7410 -4470
19969 -4470 -3879 -2678 -1667 -4683 -8606 -9434 -3978 -4764 -5037 -4607 -4083 -566 -2534 -7159 -10084 -5544
19953 -5544 556 1624 3857 6189 6532 2108 3338 2948 3184 8756 10764 7036 212 -5376 -5408 -6657
19937 -6657 -3790 -3133 938 636 -1898 -3986 -4335 -1586 -1464 -5274 -4199 -8508 -7850 -2789 3543 1294
19921 1294 -2194 -28 4358 4164 1819 1490 -2070 -4442 -3922 2592 1185 -6725 -10956 -9068 -3322
19906 -3322 -2869 -2836 -7974 -7708 -5062 -5606 -1210 -465 1325 5095 3969 1938 -988 -1039 -1878 -2959 -1803
19889 -1803 1115 6369 5760 7642 6328 1074 -2421 -1535 5846 7042 2972 958 -1710 -848 -7116
19874 -7116 -7687 -2398 -53 615 2127 600 32 -1385 -7627 -7670 -4599 -3386 -1124 3312 790 418
19858 418 -860 -5281 -6548 -8916 -7439 -3845 -2104 -5763 -5383 1039 4310 1174 -5151 -4311 2898
19843 2898 935 -3899 -5975 -7475 -10588 -10028 -8837 -9342 -1638 522 -2334 -540 218 -4360 -7819
19828 -7819 -7393 -7860 -6701 -5461 -7484 -7234 -9797 -5925 -1575 -1997 -101 2540 2331 2815 1907 -2780
19812 -2780 -6518 -9835 -5199 -3892 -3490 386 -936 2963 -332 3122 3512 -3053 -2691 -1203 -4725
19797 -4725 -5025 -3662 -1442 -64 7079 8978 4648 2154 3126 1174 -7808 -9355 -9664 -6808 -2632
19782 -2632 -144 -4481 -4765 -175 4679 626 -3491 -256 -1979 -2712 -1468 1635 886 -3888 -9106
19767 -9106 -10013 -6294 -1533 588 4044 3478 2743 5074 -4554 -7291 -6111 -4434 -6644 -11689 -11784 -8138
19751 -8138 -3662 -8136 -10142 -9308 -6702 -3387 -2271 -3887 2611 1722 -1965 -2274 1054 2508 1491
19736 1491 1634 223 1130 -1582 -3893 2212 1888 1358 5152 -2241 -2982 -2797 -55 3823 6711 6448
19720 6448 2381 22 2688 3356 1488 2619 -724 -4083 -3554 2807 7183 6901 7276 1069 -2337 -2815
19704 -2815 -1869 333 -2016 -1458 -2612 -3938 1509 3061 2869 8652 10998 5532 1172 -2474 -6000
19689 -6000 -7446 -4396 2602 5224 4566 4514 6663 3633 2254 382 -2662 -7668 -11640 -11411 -6691 -3208
19673 -3208 -5202 -2692 2025 -465 -5350 -8680 -11845 -7502 -2085 481 -1322 1186 1519 2400 3347
19658 3347 172 -1700 -4797 -6475 -7647 -2977 -3522 -723 -540 -1178 -595 -2141 -1579 1896 4107 -585
19642 -585 -4659 -2947 1926 -1962 -2393 -1814 -3630 -1203 938 1994 -3603 -5865 731 4937 6048
19627 6048 8557 6207 5651 -237 3058 6445 5127 7391 7046 3424 2684 -1733 -8119 -8154 -5395 -6378
19611 -6378 -6521 -4399 -1049 752 -2882 496 3840 1749 904 -1296 -7475 -8694 -6238 -375 -1088
19596 -1088 -2635 -3001 -2656 725 5816 5434 3823 -1804 1309 3169 -2636 2163 2777 1386 2872 -1134
19580 -1134 -659 5675 5110 374 -2141 -443 -2249 -796 -374 2691 -1825 -7178 -4371 -3806 -1139 -382
19564 -382 121 350 -163 -3579 -6254 -3288 -3971 -4167 -5384 -1149 -3150 -1653 4219 7196 3546 -3744
19548 -3744 -5562 -169 5092 8719 2789 2482 3820 3772 3835 1689 162 1137 -2218 -1788 2462 5438
19532 5438 2517 -2561 -3273 -859 928 118 492 1171 6757 12209 8818 4599 -168 474 -252 760
19516 760 -202 -4362 -5104 -3518 -9624 -8350 -1924 2826 6843 7606 2789 -1973 -2277 -3197 -3088 -5857
19500 -5857 -9619 -9743 -5443 -1410 -3744 -9092 -5461 509 -5783 -11174 -10554 -8983 -6670 -10148 -5997
19485 -5997 -3836 -4863 -4530 -6805 -11722 -8982 -4844 -1466 1389 -627 -9068 -9083 -2448 1636 2224 2838
19469 2838 4366 1468 -3996 -8512 -7386 -7922 -6685 -7008 -12367 -14617 -10665 -5094 -592 -1275 -6739
19454 -6739 -7679 -1227 -3489 -3796 -6281 -4359 -2481 399 -218 1792 -1087 -1369 2139 1070 -4716 -9257
19438 -9257 -10531 -11055 -7257 -1502 195 423 -1470 -1202 -6485 -2715 -83 -144 -1576 4233 5638 -552
19422 -552 -1444 2086 3323 101 -3942 -3092 -2185 3707 4703 624 -1654 382 200 -18 -1884 -256
19406 -256 -183 -656 -426 -1957 -6205 -5898 -1752 -2450 -1752 -4100 -4999 -3121 -2385 1903 -381 -5744 -9119
19389 -9119 -7883 -7627 -2724 -2195 -7411 -10041 -10342 -10340 -8752 -7048 -5352 -2428 -2067 -1912 -2456 -281 -2766
19372 -2766 -6551 -5443 -4257 -3436 -1844 -523 5534 12456 15011 13861 12644 17311 18028 11735 13781
19357 13781 17659 14939 10599 10298 9037 11016 12472 12379 8580 7511 11938 10673 8944 10322 8797
19342 8797 5796 11590 11327 7222 4180 1513 3535 5545 3702 4413 1360 3774 6592 11056 11968
19327 11968 9861 5845 551 -635 259 1840 1278 2329 -2999 -6026 645 2324 1839 -3319 -1871
19312 -1871 -2290 -3305 865 -463 -2742 1873 2258 4055 1732 -1963 -344 1743 3671 5263 10677
19297 10677 8569 2773 5294 8470 7847 11574 13005 15204 15537 15725 17463 14836 16970 15803 10852
19282 10852 10187 11888 12128 12880 16871 21107 25066 29334 28601 25969 20882 20020 16557 14467 12888 6417
19266 6417 6340 10290 8325 4389 2724 -1234 4682 8699 8854 8222 8772 6933 2443 956 -2593 -5348
19250 -5348 -1202 2458 1548 -4463 -7318 -5347 -2210 -1419 -4633 -6327 -6331 -3723 -7029 -6613 -1588 2109
19234 2109 -1036 -4996 -3254 1207 204 -2897 -1363 875 2154 3323 4365 2101 2717 -714 -4932
19219 -4932 -2986 4070 5293 5537 1773 1818 1105 1973 3846 3556 3892 6803 6064 4921 5453 2619 -1988
19202 -1988 -3888 -4124 -718 8705 14190 8855 4254 6782 9520 6789 5763 7160 9900 10248 8393
19187 8393 4846 -673 -2989 -4468 -2227 -1389 -1649 -2795 2448 4939 11554 10937 9691 5789 6448 9428
19171 9428 12727 13825 8280 9225 5280 3808 6115 6005 2304 1615 5568 12271 11303 12840 19235 17784
19155 17784 15376 14214 12981 10779 16665 25752 25532 18933 19977 22392 23127 24179 25736 29861 32023
19140 32023 31311 37435 43788 49861 56577 66428 76707 84037 91162 100106 112265 124976 139448 156426
19126 156426 176026 200492 232660 270625 303672 341328 390763 437638 490443 547295 600861
19115 600861 649177 691937 728232 758083 774953 775207 769006 750596 720695 680793 638130 593495
19103 593495 544605 487637 432117 389230 349336 314615 277526 247391 223137 201089 185050
19092 185050 171292 158969 146766 135722 122907 115824 113804 102907 91740 83623 80001 69226
19080 69226 65247 65306 64444 60081 56350 51128 48293 47726 44515 41982 40437 37699 39688 37283 39013
19065 39013 39846 33406 22802 20294 29874 32959 30945 30016 30180 29217 28487 24360 24459 26923 26982 29499
19049 29499 30521 27355 26035 21552 17520 12747 8919 10272 13579 15424 16935 13104 8979 10025
19035 10025 13842 14940 12839 6302 4316 3476 4748 5356 4753 8040 10457 9893 7601 6251 8167
19020 8167 8019 7908 5392 10276 8511 8226 6082 5780 2011 4578 7186 8074 8215 8099 5775 8555
19004 8555 12733 11575 7023 1881 5783 10259 9398 3743 3029 6935 14443 16169 14839 14705 7679
18989 7679 9232 15581 10726 9004 7578 2851 2696 6538 6766 9828 6831 2187 2239 21 5924 7399
18973 7399 6742 10431 13079 8794 2647 -1944 -1573 -1480 -4266 -2236 3708 6409 2485 4400 2892 7402
18957 7402 7462 1887 4685 5898 4062 3817 4300 -137 -235 -1954 -1530 -479 -1975 -4619 1287 9133
18941 9133 6398 3395 5828 7461 9245 4197 4509 5081 1892 -2668 -3827 -2437 -231 3551 6007
18926 6007 5559 3839 6912 5500 1967 5642 4563 -633 -4899 -4607 -5322 -4247 3543 3389 1493 2088
18910 2088 4961 4004 3220 1563 -259 2294 5150 6467 5971 6991 7203 -1746 -4131 -4398 -2332 1278
18894 1278 1637 -1029 4077 6430 -342 -1374 105 100 -760 -1333 987 3513 -523 413 4372 4777 3277
18877 3277 1052 74 144 1489 839 3806 2965 -2438 -4053 3557 5425 6061 8846 7639 6019 3189
18861 3189 1793 1928 673 571 1455 -1372 -3273 -3934 -4224 2935 6408 -751 -2320 -132 4027 3052
18845 3052 -1237 -919 2121 3233 1166 -2270 -1108 -37 2546 33 2620 180 -2080 -1451 -4089
18830 -4089 -1552 5790 3801 4948 8913 2267 -1577 -3591 -1363 -220 -3784 -2513 -2144 -5429 -3755
18815 -3755 1241 1569 -9 -1649 -1379 -3818 -5158 -1072 4668 2622 -1092 665 -1678 -3039 666
18800 666 2699 4824 2011 -4637 -3209 -2927 -2891 -5925 -3220 1940 3664 4904 114 -410 2871 3838
18784 3838 960 -4448 -5706 -5298 -5973 -3031 -1245 2273 1494 504 -78 -700 -7983 -5142 -937 984
18768 984 8599 22127 34438 42664 33509 30999 27471 17323 11071 4094 -1469 -2518 -1975 -2028 -96
18753 -96 110 -673 1656 1176 -4253 -3464 -1771 -5645 -6467 -7969 -5636 -1958 -1472 -1348 -922 -1544 -1125 -5302
18735 -5302 -4256 -6696 -8262 -4577 -4000 -6631 -8864 -6896 -3109 1077 3049 -334 -372 -1743 -490
18720 -490 5284 6904 -1031 -1399 3427 950 -1303 1253 -1713 487 -654 -4555 -5448 -2463 781
18705 781 4570 5046 2541 -425 -3317 -3229 3103 9148 9710 3848 -2522 -5287 201 4510 2437 6293
18689 6293 9094 4751 918 -2382 -5138 1113 2892 -4030 -5580 -4580 1658 8055 10831 3290 -484
18674 -484 -2238 -127 3102 4258 -920 -1772 -4826 -7158 -682 2442 2220 145 -794 -33 613 207
18658 207 4552 3086 163 3590 5293 6051 8004 8420 13075 15144 19281 25603 39798 51768 71026
18643 71026 88495 102314 111089 114718 112057 107732 95656 77914 60811 48100 37393 25745
18631 25745 16801 17590 15935 12592 13655 10432 8357 5635 4468 6649 10813 10302 10853 10262 9607 7451
18615 7451 8238 7640 6908 3664 5135 4095 1138 2451 5723 5836 4825 4506 6725 7293 3903 968
18599 968 1078 19 -2088 1947 532 -722 454 1552 2467 2448 -41 -1592 728 1991 1153 -5836
18583 -5836 -6293 -2422 -3536 -7426 -4292 2352 -2036 -6326 -5967 -647 3599 4588 2065 77 -161 -3381
18567 -3381 -4962 -8773 -9970 -9142 -10354 -6103 -4073 -2770 -7016 -9048 -9264 -8582 -6358 -5635 -4330 -2047
18551 -2047 -1307 -178 -683 4196 3669 -951 1597 1636 1304 1367 4955 4750 5438 5239 3505 433 -2599
18534 -2599 -3723 1555 4403 -13 -7471 -13705 -15322 -14648 -10523 -6395 -7295 -10087 -8759 -7686 -5839
18519 -5839 -818 4064 3848 3529 1983 3006 -1678 -96 -847 96 -1965 -3828 -448 2886 2409 690
18503 690 1370 892 -3120 -1952 2786 1208 -2744 -3219 2520 3385 88 -2959 -1280 -3850 -8354 -7581
18487 -7581 -1079 1701 -823 2828 3210 2329 -2666 1075 2434 -2926 -8059 -12832 -9570 -5027 -870
18472 -870 2592 1233 2141 4070 840 -1870 -4566 -6643 -2630 2949 6324 5730 6236 3268 -544 -4467
18456 -4467 -6366 -7005 -6247 -4804 -7994 -12532 -5582 1865 6899 5539 583 -733 -815 -1833 -2154 -4608
18440 -4608 -5184 -3533 -3720 -7870 -9947 -11924 -9196 -8381 -9309 -7167 -10096 -10702 -8461 -6345 -2566 -5006
18424 -5006 -5380 -8871 -8016 -2305 -1996 243 -80 -5202 -8499 -6202 893 3469 4325 -90 -2248 -6345
18408 -6345 -8040 -8384 -10909 -7492 -7022 -8609 -10917 -12752 -4473 -2973 -5845 -2116 51 -4996 -5652
18393 -5652 -4171 -3823 -5371 -4457 -1118 -3837 -5895 -4412 -1485 4030 6254 4604 -2230 -10349 -9738
18378 -9738 -5303 -8244 -6873 -3609 -6180 -4831 -6104 -5298 -2529 3659 4248 3340 1253 -2683 -4770
18363 -4770 -7439 -7471 -9117 -2862 2612 2271 -2691 -6453 -6746 -7432 -10910 -8699 -5190 -5836 -6110 -5825 -9528
18346 -9528 -3451 203 1400 594 -1502 -2634 -9112 -9438 -7695 -8488 -10627 -10789 -9124 -7908 -8818 -7376
18330 -7376 -4009 -4769 -4395 -1373 -1257 -4174 -7203 -11947 -9977 -7471 -2237 -2824 67 101 -5207 -9619
18314 -9619 -9837 -6301 -10513 -11263 -6154 -3491 -4885 -7717 -6680 -6644 -10770 -9263 -8814 -9431 -8088 -5446
18298 -5446 -10079 -12596 -12276 -10951 -1647 472 -134 -6334 -10267 -6651 -7875 -13849 -9716 -7128 -8768
18283 -8768 -8193 -3063 -1453 -3380 -4983 -5416 -3463 -4207 -7707 -6986 -7399 -10495 -8394 -3855 -4177 -8447
18267 -8447 -13275 -11789 -7579 -7214 -11099 -13786 -14233 -12254 -13067 -16891 -15775 -11088 -9661 -10595 -10423 -14488
18251 -14488 -18431 -19054 -21309 -20660 -15663 -11894 -13366 -12008 -10617 -10828 -6524 -3256 -6453 -7619 -6533
18236 -6533 -8772 -11964 -17068 -20034 -15138 -10672 -7286 -5977 -6212 -4975 -6772 -8075 -3438 -157 1058
18221 1058 2485 3502 215 -4407 -6919 -9634 -18640 -20933 -10885 -1508 -2087 -486 -1224 -646 -3108
18206 -3108 -2791 -4138 2441 7053 5887 6585 9257 13717 16546 19177 19926 20988 23559 24373 18006 12851
18190 12851 11929 18075 18266 19989 25411 25193 19173 14354 11139 7138 7861 4903 1079 -161 -1058 2630
18174 2630 4695 1925 -444 -1796 -5693 -6903 -11716 -15301 -11265 -8069 -10272 -16664 -14233 -11064 -8713
18159 -8713 -6665 -5827 -11120 -9691 -6530 -10148 -14250 -9558 -12096 -11403 -4937 -8492 -10242 -10477 -13813
18144 -13813 -12615 -8420 -5447 -6086 -3976 -151 1306 1850 -2476 -2763 -226 1120 3394 9914 14464
18129 14464 21808 25995 26899 30556 33160 36539 46437 67982 86448 97854 112897 136006 152883
18116 152883 179902 226335 280479 350887 450756 581297 776042 1089475 1635633 2702991
18106 2702991 4889191 7382700 6973303 5830794 5229784 4456402 3156072 2062071 1400262
18097 1400262 1009394 755291 586892 469792 389812 336385 294914 261893 229265 201435
18087 201435 175188 157901 150661 147042 137813 125500 115515 110830 106665 100101 90272 83946 85711
18074 85711 89029 87168 80460 77867 68755 64276 58271 52670 54588 55822 54968 49329 41056 40457 39367
18059 39367 41579 43237 39246 40415 42508 42476 41070 34992 33810 31150 30683 29705 24362 24181 25838 31828
18043 31828 35245 36564 36155 31728 29190 30387 29878 28304 23317 23669 27592 29486 28749 26357 29672
18028 29672 31628 28607 26546 23886 25936 23999 19576 17487 19502 18735 16965 18196 20642 23810 25443
18013 25443 23054 17270 16858 21249 18208 15402 13915 8883 9167 12289 8227 9864 15997 15993 15627 15798
17997 15798 16610 22301 19815 17534 18249 18600 20367 20567 22295 18500 18512 19181 14041 10053 8736 7661
17981 7661 5563 4981 4065 6960 12052 12832 12628 11792 10323 15380 12297 9970 9119 11425 18745 14385
17965 14385 7030 4832 7222 6488 12657 16797 13956 12011 9179 11514 10857 16946 17237 13765 10588
17950 10588 4888 6419 8653 12477 12982 12136 14842 15784 14554 11729 10125 9319 6672 10294 9748 6243
17934 6243 4419 6852 4466 1616 1665 6578 5746 4331 10895 14207 14164 14617 17053 16773 20376 15455
17918 15455 14302 11525 3454 3449 4523 6971 8691 8276 5930 2426 -69 1915 3661 4424 -1500 -4408
17902 -4408 628 3974 5146 5941 537 -5354 -7378 -3714 -5816 -5627 2113 6196 1526 568 565 -1757
17886 -1757 2660 4643 7180 7703 5384 4644 8316 5927 6058 6626 3638 -55 -3546 -4118 1015 4911
17870 4911 4627 2476 5452 6349 6030 6951 7621 6423 6847 6363 3968 -234 1483 -5272 -2368 4591
17854 4591 6908 7771 12023 14192 10724 7232 5918 8225 9122 9392 8806 9654 7621 9047 8876 5311
17838 5311 9688 13515 14473 15219 11391 10352 6821 2476 -1766 192 1388 2794 6604 6910 10134
17823 10134 8929 4532 6153 5249 3671 5193 174 -2158 1998 4280 -1594 -4397 -3204 -1893 3527
17808 3527 293 -1690 2387 -224 -2913 -2237 744 3845 204 -3677 -3481 -556 1321 618 3875
17793 3875 4543 1050 -2566 -2059 -4887 -3993 4099 6692 5501 -866 -1079 1051 5647 7469 5087 -840
17777 -840 -4523 -10252 -9812 -8487 -7817 -6905 -3690 -161 2768 2526 124 -2091 -2054 2134 370 -2802
17761 -2802 -3110 266 -2477 -7206 -5106 -7179 -6125 -1006 -4605 -8299 -7777 -4723 -876 1751 1850 3006
17745 3006 2652 1659 3991 5132 4716 5358 4966 4379 8306 6204 7976 9316 8815 9395 13497 11309 3110
17728 3110 4269 4387 5111 2180 2686 3534 3666 8243 11226 6620 6230 5399 950 6248 9902 6438
17712 6438 -115 -887 5276 3951 572 5608 2781 -1116 876 -577 745 2297 5829 3662 54
17697 54 -1195 2656 549 -1229 -1738 4555 7552 7879 8464 8290 6428 4353 2597 1048 3836 4362
17681 4362 1127 -998 -491 838 1352 1177 4514 7391 12951 10460 5690 451 -2944 -868 -5331
17666 -5331 -6679 -5890 -6012 -4501 -2668 -1614 -1207 -439 -137 -3124 -2142 3641 3132 497 1486 -2707 -5549
17649 -5549 -4652 -1349 -432 1220 4802 3347 -309 -1858 -2675 -5669 -9360 -6397 878 2022 5558
17634 5558 8035 7742 7884 2317 2822 5580 10265 6192 -359 559 7162 10201 4395 7448 7512 4736
17618 4736 4080 5949 9155 13194 8552 5033 1424 4419 6745 7164 6584 3203 2088 688 4400
17603 4400 4982 8783 13435 8011 -747 -4215 -4381 -228 -1916 -4939 -1769 105 -1039 1909 2135
17588 2135 620 768 6356 5826 7204 15634 22060 25910 28712 28397 32983 41669 45800 45386 47573 48995
17572 48995 45568 46086 39630 33630 30670 29429 25900 20449 17651 22853 23181 16674 11518 11200 13299
17557 13299 12108 4121 645 4341 6785 7837 11192 11373 7576 3645 -2325 -4083 -4594 -5011 -6479
17542 -6479 -6646 -7252 -6638 -2908 -1322 -2147 -2075 -5102 -1514 -2711 2178 292 -2270 -1461 2387 3293 1502
17525 1502 -3529 -3747 -1297 217 1793 9431 9937 8251 7240 5039 655 -3001 -1597 4552 1285
17510 1285 -1236 -4707 -5895 -4045 1766 1048 4474 4544 1127 -964 4704 5288 4669 4903 2145 1317
17494 1317 547 -2682 -2404 1020 2914 -1571 -4652 -1644 -1957 -658 -1179 -1131 -1523 -16 -30 5114 10139
17477 10139 3969 -1897 -2943 -887 -1041 -1061 -4010 -7317 -6609 998 8474 6786 6924 2389 1472 3718
17461 3718 5391 5947 5502 1747 -2079 -7036 -11115 -8583 -3345 1670 4415 1833 -687 3034 4514
17446 4514 474 -2538 -4760 -3168 -1096 -839 4745 10811 19970 31397 37497 38004 33397 28886 24551
17431 24551 16333 10260 6024 297 -1627 -151 2482 6180 11929 10678 4632 3360 -1261 -3711
17417 -3711 -598 353 -5256 -6111 1624 2091 -1068 52 379 471 -4893 -10314 -5887 3229 7235 8359
17401 8359 5314 -114 -4635 -3573 -2351 2033 3461 -513 -6473 -10933 -7650 3459 4759 1452
17387 1452 1190 1640 7923 9706 6994 5426 4214 3592 3739 3916 6473 2753 4561 4674 1690 3763
17371 3763 2029 -1731 -2993 -1597 -219 2509 2401 -3647 -100 -3190 -1187 1647 6954 4620 -1258
17356 -1258 -2622 1671 3290 1481 -1944 -4248 863 -426 -4182 -8028 729 6985 8395 1181 -623
17341 -623 6572 6835 4205 2095 -465 4277 13373 19312 27638 34815 34402 36020 34985 31418 28392
17326 28392 31880 37072 42788 44827 41990 42664 38777 34507 29420 25777 27009 33733 28660 22458 23003
17311 23003 20107 20019 19010 12869 3840 68 1618 477 305 -501 -1997 -5603 -6788 -7050 -6058 -4739
17295 -4739 -4144 2319 9746 6949 1434 558 807 -925 -2076 -1056 -1331 -5602 -3072 -2774 -4127 -5383
17279 -5383 -1733 501 -4519 -4673 -2263 -853 1102 -767 -4040 -4780 -873 -1261 -1744 -870 4320 1677
17263 1677 3864 2081 -3866 -4665 -2313 -1635 -361 3202 3 -3602 -4678 -8015 -7765 -8154 -6068 -4147
17247 -4147 -6281 -2773 -758 680 1129 3064 2656 -1699 205 4359 6217 1833 405 -1264 1884
17232 1884 5427 4279 -1436 -221 -395 -2300 1599 6421 7036 4431 2781 -2571 -1840 -1930 975 3670
17216 3670 2312 2154 6093 7951 1393 -4542 -4249 -260 -2959 -9749 -11265 -5067 -3366 -1057 5243
17201 5243 8847 5438 5341 3056 -3742 -4354 -3020 -2531 1144 -703 4473 4179 1772 440 1295 4123
17185 4123 5300 66 594 1097 -1285 -5647 -4345 -5729 -7900 -10445 -9643 -3882 427 -4751 -10130
17170 -10130 -12691 -14905 -13039 -10153 -5841 -4034 1666 1106 -605 -2784 -9145 -10161 -9337 -4741 -5016
17155 -5016 -7650 -10351 -7297 -7456 -7737 -7099 -5616 -2840 -3755 -3078 -6953 -9473 -6749 -412 6808 3661
17139 3661 -1990 -6657 -6047 -1494 -3121 -3333 -2934 -149 -3770 -3051 -423 2873 -977 -3427 -1654 -1886
17123 -1886 251 -1092 2306 1832 4194 2520 -3210 -2542 1474 -746 923 162 -2145 -1847 -3045 -1589
17107 -1589 -5170 -5649 -1716 -5098 -6278 -6659 -3414 -1640 3489 6628 4793 1321 4931 3263 6621
17092 6621 6409 2495 1192 988 4114 7133 10994 5773 1024 4233 5953 2628 1475 7105 7968
17077 7968 800 -111 -2127 -1206 1096 242 -4140 -4489 -3069 1171 2846 -202 -298 -835 -804 -796 2141 5099
17059 5099 2622 5418 5027 -1752 616 4410 2020 -1851 -1497 -1728 -1551 -5592 -8311 -6481 -2023 2612
17043 2612 2796 -1924 -3724 -8716 -11199 -5758 -846 629 714 -3906 -5650 2344 4037 2338 4735
17028 4735 3954 207 3369 4007 1589 2165 3524 1619 1313 1747 1480 -29 -3871 -7163 -3914 -3564
17012 -3564 -1501 -1175 -5204 -3277 -3932 1868 7135 5357 754 3642 6385 2677 4318 6997 6899 2770
16996 2770 -3007 -3088 -5202 -4538 -643 2137 -1667 -2827 2992 6163 10182 8840 3818 2236 3437
16981 3437 258 -3336 -3641 -11581 -10850 -5956 -3622 -3801 -3968 -78 -2043 -3912 -7728 -7735 -6031 -5358 -4892
16964 -4892 -8029 -7454 -14513 -17456 -11893 -5752 -4556 875 2322 3891 6139 5548 5558 1721 -186 -1889
16948 -1889 1395 2926 -499 860 3839 391 755 -335 -4438 -4896 -4400 -4000 -5597 -4812 -5279 -10074
16932 -10074 -8064 -5273 -3142 -2873 -244 3728 3454 3406 6565 4169 1088 -3412 -6071 -7464 -5721
16917 -5721 -3355 -557 -3163 -8117 -10134 -6200 -4324 -3588 -4692 -8195 -5654 1738 2643 1337 5074
16902 5074 5608 4443 5204 1845 -1108 706 3621 3712 4657 5672 7640 4501 3226 5658 3128 3067
16886 3067 1128 366 993 -525 -4434 -3254 1029 1874 -1194 -4252 -4788 1069 5552 7620 6175 7416
16870 7416 4582 412 1851 -2850 -6993 -1410 4108 7752 8544 6932 3048 -24 -1527 -2975 -818
16855 -818 2359 2882 1084 -1731 -2529 -4546 -4203 -2266 -6835 -8634 -8662 -6956 -8255 -8595 -6413 -2123
16839 -2123 -2881 -2099 -662 -2006 -8113 -9472 -4720 -1940 780 4932 5096 7504 5639 2819 4171
16824 4171 2714 2507 5692 5054 4217 4348 -558 -5421 -4981 861 2689 3650 7684 3774 233 -351
16808 -351 -2787 1303 -1889 -1630 -3416 -2315 -2610 -3736 -237 -1349 -1242 3447 2964 5395 3970 3995
16792 3995 4810 317 -271 -308 2994 -118 -6061 -8064 -5783 -146 367 1142 2613 -1532 -1504 -1373 -3670
16775 -3670 -1563 -611 -4425 -6917 -5661 -245 6302 6190 2908 -57 -454 -3283 1416 4503 3298
16760 3298 3589 -293 -4416 -714 3188 1725 1802 -1393 -1883 -1300 1177 -216 4193 3813 -6568 -4722
16744 -4722 -1336 -3648 -291 -3139 -3424 -6604 -7922 -5365 -2863 2714 510 2463 1190 2060 5172
16729 5172 156 2633 2934 -2549 -3898 -6823 -10447 -8292 -1436 1885 -2038 -1210 3748 5317 2776
16714 2776 807 3498 5051 4088 4651 2928 1078 -5259 -4504 -946 -12 362 -3555 -1753 1457 -2227
16698 -2227 -4242 -4393 -4 95 -7888 -7398 -4653 -470 3898 5820 5462 8281 7703 9946 4724 -772
16682 -772 -190 2845 5621 3806 690 2422 2620 661 -318 -1847 -5167 -3819 455 2361 27 1250
16666 1250 3842 2763 2145 1611 -3751 -7563 -6715 -1093 1716 4846 4908 -1443 -67 210 1616 5009
16650 5009 4809 4056 3541 396 -2122 -6282 -2829 1639 6807 7869 5947 2126 2869 -999 1763 2640
16634 2640 5000 5935 -3606 -5298 -2137 -3279 -3204 -1842 -1142 1458 -3759 -1520 3175 -26 188 5397
16618 5397 10310 6719 1171 -2387 -1880 -2214 -427 2107 1631 -1361 1567 9735 7639 4432 6642
16603 6642 8451 5011 2795 5395 6977 9482 11425 7651 37 -2118 -2471 -531 2110 4405 1453
16588 1453 778 3887 2253 -5782 -8881 -2929 1399 -4130 -954 -999 -3093 1381 2967 -910 1336
16573 1336 3124 486 -1237 1571 6297 11757 7093 3019 2376 2423 2314 1318 -4981 -5287 -6290 -7124
16557 -7124 -7507 -6566 -1467 2662 2766 7673 10042 13242 11424 4404 4459 3312 675 348 5723 6003
16541 6003 3815 2088 1150 229 -568 -2572 -1014 3917 8934 9334 2086 -2318 -3345 -1086 4113 3287
16525 3287 -342 -3160 -6672 -4154 3129 5991 1834 5613 8299 6580 2705 606 -1380 -5066 -6623
16510 -6623 -4292 -571 410 -269 3303 2015 4580 7630 4734 737 3400 1808 2146 2835 9658 9158
16494 9158 6771 10675 17328 12709 5239 -109 -698 2601 6503 12002 11756 6751 2091 1124 3476
16479 3476 6618 6181 3124 6422 9758 9386 10708 10283 6541 2442 3671 4078 4142 6625 5073 3350
16463 3350 -1451 1136 446 -1662 290 3202 5307 6113 7411 812 2278 7195 3095 -776 -6017
16448 -6017 -7039 -2630 6922 8754 11517 12459 8954 2613 -1748 -5649 331 5762 7002 10296 10819
16433 10819 6087 4959 6926 2938 2888 3969 1373 2498 838 91 2012 -489 407 703 2566 -365
16417 -365 -1786 -3837 -4032 854 2925 695 660 -1263 797 -487 -1625 -2627 -1724 -5037 -7423 -5937
16401 -5937 -8834 -9342 -3160 -2429 -2855 -2212 1019 2747 2250 1784 -2675 616 6640 1619 2413 1861 2384
16384 2384 -317 855 -146 -2548 1538 840 -4144 -2152 3119 5229 580 -1589 -2450 -4971 -6930
16369 -6930 -3720 -3699 -5198 -7124 -7653 -6640 -3162 3063 3490 1986 1165 -233 -993 -4757 -5870 -3351
16353 -3351 -55 5810 8158 7086 3499 3488 -412 1743 -2857 -5281 -6219 -7090 -5658 -1515 1023 2711
16337 2711 -2552 -8825 -10268 -1131 2845 2467 3187 2531 -1132 -1388 -277 -3411 -5487 -5584 -7822 -9336
16321 -9336 -8220 -10152 -10107 -8248 -6592 110 1988 1733 6805 9305 6224 1912 -5183 -10907 -6547
16306 -6547 2017 1252 1349 -3471 -2840 -1753 -2288 -1214 -2306 -4454 -4862 -6349 -6921 -3095 -1741 345
16290 345 3008 1702 797 1794 2660 4111 155 1 4372 4952 7598 6615 6379 9016 2785 -914 1056
16273 1056 1063 -4931 -3469 7627 6533 -1772 -2307 2544 -3004 -6287 -4223 5474 10818 10158 9752 6302
16257 6302 2081 2940 7039 4251 -2742 -2120 2779 4322 2438 2964 442 1094 3340 2784 1537 1303
16241 1303 1110 -869 -7284 -9073 -5457 -1775 610 -1115 -2953 -5255 -7229 -6873 -8275 -9495 -5547
16226 -5547 -9522 -11356 -7622 -5629 -9035 -5323 -3309 3045 1398 -2282 -1236 -472 90 1427 182
16211 182 1694 1901 4568 9073 6259 5225 3580 1822 206 759 -3760 -1916 -4057 -6851 -6677 -9841
16195 -9841 -8666 -8274 -7710 -5516 -6626 -5766 -3473 -6896 -10218 -8722 -6880 -829 1010 -2683 -2842 -3518
16179 -3518 -3419 -3089 -1378 -3591 -2782 -587 3296 1967 1070 3810 4796 5001 4804 4549 4291 -264 -141
16162 -141 -1290 -706 2339 -672 -7370 -8083 -6332 -2785 -2113 -1282 4742 6068 1880 3133 1176 -2132
16146 -2132 -1986 70 1036 246 -1101 -1413 -3155 -4373 -4653 -4489 -3103 -5618 -10997 -12920 -11472 -9732
16130 -9732 -7488 -801 -1068 -284 -3393 -7895 -7440 -12330 -9526 196 409 1732 4672 2515 -2886 -4439
16114 -4439 -3438 -3210 -3880 -1873 -5878 -3826 -1423 -269 -4588 -6832 576 3462 2645 396 1740
16099 1740 514 1505 1426 2319 4726 5096 1515 -5064 -6997 -5859 -1441 -1813 -3085 -2951 -8933 -6090
16083 -6090 -2962 -1613 -886 3551 8453 7858 4246 215 -3916 -4205 -6708 -5583 -4037 -735 -4663
16068 -4663 -6349 -8654 -8859 -8248 -11146 -14008 -11219 -6275 -10798 -11261 -7146 -9995 -11591 -10188 -11413
16053 -11413 -14124 -7457 -1655 -3465 -3733 -2338 -1714 -5806 -13880 -13114 -6828 -5384 -4963 -732 -1944
16038 -1944 -6169 -7517 -2434 821 -1237 292 2155 -3392 -10903 -12294 -8587 -8511 -7191 -5094 -495
16023 -495 -53 -2256 -8621 -11564 -11242 -8887 -5926 -4074 -4451 -1879 124 -842 -6402 -4156 -1443 2796
16007 2796 1751 3123 1631 -3544 -4322 -1948 -2788 -487 1937 3067 7574 5907 6734 8030 4256
15992 4256 4178 8617 11254 7353 2048 5105 7913 7116 1720 -265 -449 -2372 -1781 1922 -4692 -10540
15976 -10540 -10175 -11702 -9510 -6601 -1942 -1245 -4214 -6157 -4993 -3694 -1557 1103 3857 3857 -3176 -4078
15960 -4078 -6055 -8922 -8414 -6697 -9796 -7080 -1939 686 -3118 -2339 -3161 -4617 -3487 2511 6828
15945 6828 2663 -1015 1245 3567 3565 -3901 -7626 -7794 -938 -258 -5938 -10016 -2748 -1815 -3279 -4539
15929 -4539 -4180 216 -1961 -2778 -2253 -2836 -2939 -857 4718 1216 -2441 -2449 -2973 -4026 -6453 -9183 -9030
15912 -9030 -4581 -376 -2120 -7984 -16002 -11724 -13411 -12698 -9056 -5679 -6075 -6209 -8296 -10115 -5178
15897 -5178 -6982 -9180 -7700 -7360 -8435 -5406 -2950 -6046 -4569 -2063 446 1984 -2868 -8446 -11286
15882 -11286 -15473 -11837 -5002 -958 -985 -2227 -1240 -963 -3912 -8026 -11074 -9879 -11477 -15870 -15223 -11051
15866 -11051 -9916 -7031 -7590 -4445 1164 -1549 -4468 -4226 -9041 -6807 -5853 -4284 -4994 -5920 -6593 -4324
15850 -4324 -6759 -11968 -15898 -9719 -2797 -6139 -9383 -9301 -13009 -13773 -11071 -8663 -7302 -6353 -3814 -3463
15834 -3463 -5816 -6211 -4538 -1666 -1834 -2917 -2262 -3925 -6428 -4971 -3517 -5700 -1805 1590 1197 1608
15818 1608 2900 6063 7807 8789 929 -4552 -5229 -8884 -8483 733 2226 -739 -1195 -3925 -9043 -11427
15802 -11427 -11238 -10528 -7302 -2318 -2513 -9807 -3507 -3002 -3134 1344 -2376 -8893 -6094 -6625 -11467 -12097
15786 -12097 -13343 -14980 -10090 -10490 -8921 -7429 -8560 -6791 -7408 -5898 -1619 -1991 -11685 -6502 -1179
15771 -1179 -2326 -5763 -10202 -10853 -5289 -1556 1245 -384 -2 4790 6125 2134 -103 -3071 -3960
15756 -3960 -4669 -3989 -6298 -5829 -4965 -1242 -484 -652 -7517 -11385 -11985 -6873 -3673 -2871 2127 2333 -6163
15739 -6163 -9077 -9405 -8229 -8075 -9102 -10517 -12870 -11314 -11172 -5826 -593 -4386 -9151 -4207 779
15724 779 2560 -1127 -1003 -6495 -13048 -15679 -9926 -5734 -4706 -3612 -2482 -1493 -2786 -2904 -735 -1658
15708 -1658 -2643 -6517 -7986 -4118 -6143 -7403 -4915 -2086 -3887 -4888 -1705 -838 -2385 -708 1471
15693 1471 4983 2221 -297 -1179 -1078 -3424 -887 -413 1575 240 1179 637 -670 -547 -7791 -15245
15677 -15245 -16031 -12263 -6797 -1295 370 1773 4297 2270 601 -5769 -9440 -4150 -3449 -3168 -1842
15662 -1842 -1039 -2574 -5221 -9631 -11407 -5188 -6499 -5567 -6395 -5370 -4737 -6207 -3051 3332 2661 -2345
15646 -2345 -3258 469 4505 4162 3302 5645 7835 5105 1390 179 -1194 -4804 -4282 -7039 -10795 -8141
15630 -8141 -2226 -2493 -4453 -6767 -12235 -16145 -12390 -8095 -684 -754 -2793 -4709 -6299 -5124 -3604
15615 -3604 2364 6034 5385 1993 -1794 1477 -3557 -4981 -7560 -2457 2579 3320 3572 -272 -5536
15600 -5536 -2216 -1451 -3667 -6738 -8251 -11638 -14968 -13222 -16493 -17019 -5983 1966 4545 7437 7578
15585 7578 6600 4958 -1062 -3721 -2181 -30 1643 5282 5900 4443 11538 9895 5079 2451 1417
15570 1417 1775 -1134 -1499 1084 4112 6670 6738 4489 889 -2491 2491 5260 4004 4038 -113 637
15554 637 4404 6051 5599 2082 3862 6884 4363 3134 -911 -2641 -1919 1178 6107 3258 1390
15539 1390 700 -55 2730 3294 2847 -1647 568 7494 12084 12310 6204 2636 541 -1498 -2708 -5010
15523 -5010 -7108 -8856 -8548 -4655 -2598 -1480 2550 1387 1174 507 345 -1018 -4059 -5552 -4135 -5639
15507 -5639 -10139 -16547 -16049 -9767 -8045 -8376 -1554 -2545 -7794 -11441 -12071 -7338 -5245 -521 1203 2427
15491 2427 -549 -5024 22 5172 -1892 -6303 -8709 -7529 -2877 -1825 -2525 -795 2706 440 -645
15476 -645 -2199 -3570 -2995 -2753 -4527 -10156 -12242 -9908 -921 2671 -353 -699 -309 -4056 -6613 -3322
15460 -3322 1397 1998 4120 6188 4174 191 -1376 -3030 -6747 -5565 -6199 -2206 -1716 -7755 -7055 -4394
15444 -4394 -587 2721 5050 5446 4199 1867 4882 4825 -1398 -3985 -4313 -5222 -6372 -7107 -6812 -8322
15428 -8322 -8900 -6722 -1646 -1260 615 2035 1578 199 2291 4027 1892 -11 3795 4240 1975 1605
15412 1605 4351 4156 3979 2794 1876 -1875 -2525 3092 -34 -3893 -2922 -2180 -4097 -2333 -2604 -285
15396 -285 2989 7028 9798 7244 2617 -569 1174 6072 6638 9789 9307 10650 11331 9091 5719 2183
15380 2183 -165 -1750 -3248 -6106 -5860 -8915 -3964 -1284 -542 -2594 -6931 -2510 5523 5497 3862 7604
15364 7604 2963 -58 2754 -1054 -2316 -2180 -2304 364 -953 -3029 2560 1668 5635 6082 1674 1787
15348 1787 315 1452 -2014 -1274 3267 4433 4066 398 -2158 2257 4940 3191 570 2451 1872
15333 1872 4576 2090 1164 -95 -2055 -3299 1422 861 285 -2668 -7280 -5439 -4472 -6487 -8425 -10751
15317 -10751 -12787 -10784 -7290 -10461 -14251 -15128 -11925 -6576 -1615 1850 5792 2082 -756 1662 -2369
15302 -2369 -4824 -2163 -2660 -4738 -4428 -3177 2747 7041 5518 6655 10201 10052 10362 5812 5802 5744 3531
15285 3531 6410 4087 4662 5627 8341 3759 2257 5780 5056 2799 -37 2300 -1266 -5993 -8194
15270 -8194 -3280 3261 1212 2478 -480 -2273 -5671 -8347 -8365 -3196 2565 4158 -5075 -6530 -3549
15255 -3549 -2604 -252 2970 2238 3276 5183 3170 -6 -4893 -717 -3927 -6712 -3230 -1698 -673
15240 -673 4494 4048 4454 4590 1525 1329 1443 -1395 -3216 -1638 -655 1127 5424 5640 2345 2873 7077
15223 7077 6114 3842 1237 2763 3575 3251 3735 5547 6493 6992 2996 -194 -3303 -2784 -195 -943 -5967
15206 -5967 -4522 -2096 -10038 -6703 -2274 -4709 -9906 -9654 -6282 -2675 -1054 -5230 -7812 -6208 -7963
15191 -7963 -8932 -13946 -14534 -18159 -18015 -8799 -6432 -3941 -4346 -9215 -12437 -16795 -12261 -4427 -3087 -4617
15175 -4617 -2169 5909 2428 2511 2463 347 672 2206 3154 2670 -2600 -5745 -3796 -4652 -1473 2038 -672
15158 -672 41 8249 5561 2678 4501 1454 -2960 -2086 -2616 -124 2382 3186 -1563 -3918 -5546 -3536
15142 -3536 -1357 -5387 -7145 -7699 -7049 -10024 -8743 -4710 -8343 -7056 -8810 -9838 -9476 -4101 -980
15127 -980 2 794 2475 3692 47 -320 4545 4055 2704 -198 933 227 -1972 -420 578 -3103
15111 -3103 -4630 -3708 -1798 590 1359 3475 4113 2472 -529 -697 19 3643 753 -966 103 -5220
15095 -5220 -5420 600 1079 6689 6281 8673 5350 2832 1554 3127 4630 3425 246 -2686 -4567
15080 -4567 -3908 -2197 -5680 -9458 -11167 -10057 -9216 -8130 -5104 -4281 -2000 4388 4116 1353 -3937 -2042
15064 -2042 155 -1820 -4029 -298 929 1275 2037 490 -1991 -3670 -4837 -7110 -4208 -4605 -8257
15049 -8257 -5790 -4075 -1490 -1670 -4645 955 5430 5991 5796 2904 4720 7542 7034 5255 5546 3608
15033 3608 3697 1037 -5473 -3071 269 3907 6232 4632 5440 5026 4719 -5303 -4892 -666 1176 7403
15017 7403 11688 6592 2171 1831 -2938 -5006 -7389 -5406 -2980 -514 655 -1570 -4253 -3686 -1403
15002 -1403 -6665 -9322 -6517 -4419 -5689 -11886 -12470 -9861 -9301 -14969 -13509 -10561 -1779 3212 1956
14987 1956 -47 -4083 -4247 -4241 -7527 -6174 -1863 -2831 -3318 -1542 195 4 -1507 -3217 -3756 -4424 -4600
14970 -4600 -7672 -8515 -7148 -6102 -2188 -1120 -854 -2554 -1524 -3431 -4385 528 -955 -3624 -4287 447
14954 447 3508 3605 503 -854 -69 -2800 -6749 -9236 -9642 -10233 -9777 -3847 -4347 -9562 -11197 -11926 -6191
14937 -6191 -7617 -7605 -10549 -9998 -12890 -11260 -9512 -4596 -546 -48 -961 -3972 -3573 -1441 -2159 -5016
14921 -5016 -4338 -2513 -1926 44 1615 3119 4349 1640 522 4794 1839 -4764 -4687 -994 1330 2123
14905 2123 -1165 1585 2107 5036 5559 3749 3097 3494 -110 786 362 -692 1076 -4073 -2758 575
14889 575 471 -3517 -6798 -2409 3841 3026 1941 -3357 -7541 -8477 -5225 -7437 -10642 -6675 -5657 -8177
14873 -8177 -9379 -4297 -4530 -3813 -5484 -6826 -6954 -8471 -891 1440 619 221 -4208 -5069 -3949 708
14857 708 1849 1017 2298 -406 -1095 -5220 -8299 -8296 -5124 -6846 -6313 -2917 -609 -6511 -9543 -4332
14841 -4332 -1652 -3827 -1236 5206 4491 3956 -1708 -423 4697 6982 8595 5779 640 3080 3346
14826 3346 23 1899 3842 2948 4959 1365 500 -894 -1167 3699 5358 3965 1980 2589 2067 -5734
14810 -5734 -8943 -9131 -7888 -6148 -7996 -11185 -8339 -2941 -590 -1189 -755 2162 2649 1789 -252 -3065
14794 -3065 -7431 -14049 -12042 -8330 -6209 -1431 2315 -2266 -2310 -4981 -6699 -6954 -8005 -11755 -9221
14779 -9221 -1307 2902 1621 522 -3346 -2925 -2210 -5314 -3127 -1166 841 557 -2683 -304 5254
14764 5254 3424 1755 2202 1711 -1149 -1922 -6307 -8720 -7431 -5774 -7756 -9365 -7646 -4997 -4675 -7080
14748 -7080 -5303 -3485 -1586 -603 -3752 -5927 -6474 -4423 -5889 -9055 -8342 -9745 -7775 -3868 1022
14733 1022 617 -1817 3248 8253 4013 -356 1387 914 -177 -576 -1059 -321 -317 -1866 -1365 -4514 -5390
14716 -5390 -5378 414 1137 -2604 -3451 -5099 -5300 -5515 -7468 -9193 -5161 -2478 -537 -1702 -577 2133
14700 2133 822 -2122 -4603 -4297 -4576 -5546 -3530 -437 1067 627 -3142 -10867 -9125 -5164 -8710 -8756
14684 -8756 -8313 -2935 -5087 -8891 -8269 -5101 -3523 -2096 1615 3300 2556 5399 9438 12246 15235
14669 15235 10994 4390 791 422 4407 5921 821 1741 3801 310 294 98 -508 -5975 -3257 717
14653 717 -2076 -5739 -6739 -4544 -3813 -1170 790 -3701 -5669 -7476 -10559 -13373 -15024 -12851 -7310
14638 -7310 -2622 594 2120 146 -4201 43 -483 -4689 -9323 -8005 -12475 -13240 -8497 -7105 -7453
14623 -7453 -4985 -4127 -6178 -6140 -4507 -1128 3395 1281 -4409 -7062 -4215 -5965 -6405 -8630 -5398 1539
14607 1539 -928 -1556 -2370 -7582 -11203 -9557 -7130 -3366 -2667 1186 3867 5475 730 -3787 -7061
14592 -7061 -5209 -8055 -8657 -13575 -9428 -10420 -14607 -17585 -13558 -8265 -6680 -3303 -4044 -3675 -5253 -9022
14576 -9022 -8332 -5637 -4320 -6628 -4221 -2690 539 2708 -586 -2553 -5333 -7078 -5292 -4661 -4775
14561 -4775 -1354 -575 2232 561 -1630 -3481 -3656 -1201 2971 -1280 -2882 -4277 -3595 69 -1779
14546 -1779 -7529 -6313 -3799 -2564 -9480 -10645 -9366 -15702 -16207 -6847 -5799 -8096 -9436 -6646 -5485
14531 -5485 -7408 -5180 -4426 -4934 -9478 -10706 -11260 -8027 -10971 -9958 -4420 -1149 -3926 -8180 -3881
14516 -3881 -753 -1216 -3228 -3356 -5549 -5106 -1693 2130 2539 -2596 -4852 -5711 -4782 -7442 -5892 -8067
14500 -8067 -18126 -14589 -12179 -10808 -9209 -974 -4020 -8567 -8059 -10561 -4489 -513 -3513 -3973 -6260
14485 -6260 -13810 -13750 -4244 -1689 268 1539 -3577 -3642 -3411 -2346 688 -2063 -468 525 -7345 -10493
14469 -10493 -8368 -10194 -12704 -11336 -12877 -8992 -764 -3505 -8457 -10960 -13126 -12286 -11147 -7813 -7076
14454 -7076 -9071 -5027 -2427 -5577 -6799 -9451 -9380 -12163 -14976 -9798 -6832 -8201 -4038 -1060 -1567
14439 -1567 -2387 2195 1630 -5276 -9611 -3744 -4681 -5392 -8051 -8942 -11158 -6217 -2982 -3358 -11228 -8553
14423 -8553 -2966 1118 -364 -1769 -93 -7653 -8071 -6086 -4403 -5977 -4015 -1959 -3674 -5386 -6673
14408 -6673 -7097 -4495 -2564 -4918 -8976 -5071 -3620 -4777 -8366 -6572 -6925 -10374 -9329 -7719 -5060
14393 -5060 -6153 -6751 -2975 387 -837 -2911 -5638 -7864 -5316 -5878 -8069 -6368 -9128 -12742 -8492
14378 -8492 -2198 -4846 -12717 -14068 -12666 -13329 -6308 -5466 -9747 -8861 -4291 -4312 -4013 -4267 -5541 -6822
14362 -6822 -13425 -11677 -7631 -8586 -4023 -2705 -8781 -7868 -4224 -2362 -3426 -8139 -9368 -9267 -7054
14347 -7054 -3726 -6635 -1170 -487 -6768 -6242 -5721 -4073 -5523 -9221 -11781 -8053 -6731 -4874 -9639
14332 -9639 -9740 -10009 -11956 -7805 -5703 -9524 -8183 -2805 208 -3980 -6976 -1834 2462 -1529 -9658
14317 -9658 -6260 465 -562 -4747 -3338 -2460 -6103 -12445 -15333 -3085 804 -912 1175 7344 8770
14302 8770 3167 -4572 -11051 -11293 -8103 -11077 -12376 -17104 -15123 -6788 -1858 -4864 -12645 -13335 -7415
14287 -7415 -2789 -3884 -524 -798 -4581 -5885 -2650 2499 1858 -3924 -9992 -12654 -9810 -7420 -6928
14272 -6928 -5872 -6264 -5811 -9971 -9268 -6865 -10798 -14033 -15490 -16437 -13931 -10909 -4464 -7119 -8755 -6297
14256 -6297 -8787 -10138 -9239 -8274 -6871 -7125 -5182 -2360 -3217 -246 6378 -62 -2184 -516 -1040 -295
14240 -295 1381 1774 -2167 -5553 -9486 -8450 -3230 -5274 -4108 -4596 -3473 -4893 -2678 -218 -1775
14225 -1775 -5365 -2863 1719 2887 -2076 -3191 -717 -1309 -4626 -8034 -1855 -5037 -6041 -1469 5076
14210 5076 1219 -1424 -2133 -86 -3153 666 7945 8215 5272 4411 6796 10114 15212 17713 19098
14195 19098 28198 43785 58016 78665 108235 141369 170137 195662 212415 217023 207846 190867
14183 190867 168508 137811 105143 74879 60651 47829 39598 30704 25104 24493 21145 16995 15228
14170 15228 16917 13473 7815 7132 8435 8567 7332 3214 610 2327 3224 4887 3134 561 -4245
14155 -4245 -3725 1216 2257 -854 -6033 -5941 -1270 3263 -350 -1861 -6335 -9935 -9981 -10859 -9264 -9076
14139 -9076 -5179 -5014 -6703 -6215 -5035 -2755 1140 1718 -206 -1322 1762 -1563 -8038 -12199 -10365
14124 -10365 -9623 -4749 278 2000 1134 635 1855 -1497 -136 1405 1023 -956 1754 6219 6418 4593
14108 4593 2615 1457 2655 -1304 -5624 -4835 -2275 -6487 -5982 -3155 -2534 -3695 -7749 -1692 8880
14093 8880 8838 2182 6486 20296 23437 12673 10011 19628 10760 -6820 -3663 7026 916 -8817
14079 -8817 -8537 -3063 -3228 -8795 -8805 -2769 3386 4572 -2192 -4959 -5096 -6402 -3323 -1082 -1640 -2966
14063 -2966 -2132 1253 -1582 -2988 -1691 -1200 -2795 -2779 -3483 -3081 -4038 -703 -233 -5188 -6448 -3551 -1180
14046 -1180 1383 -332 -4584 -6386 -6205 -4366 -7186 -5835 -1302 3555 3179 98 2612 1252 -3844
14031 -3844 -3064 -3578 -10769 -13158 -10140 -8651 -5476 -3518 -3883 -7337 -7703 -5573 -6953 -5470 -3405 -2058
14015 -2058 -2430 -4968 -4165 1783 5125 2036 -465 4535 4070 -4721 -8067 -5070 -2214 -6763 -9426
14000 -9426 -6295 -6231 -8969 -8283 -6492 -8108 -7824 -3770 -4089 -5660 -6815 -7636 -7456 -4505 -2089 -7920
13984 -7920 -11696 -13232 -14224 -16374 -13891 -9518 -7020 505 2912 939 173 2545 4656 561 -3213
13969 -3213 -6002 -1372 -1736 3756 6809 -587 -3746 -3062 -2352 -1726 -861 -1090 -3677 -5724 -5559 -7847
13953 -7847 -12622 -14050 -12682 -13593 -11616 -10494 -21805 -21575 -15183 -10782 -3652 -3337 -5118 -4571 -5092 -5358
13937 -5358 -1120 -5056 -5593 -7338 -7941 -5314 -7587 -7106 -7868 -7573 -4646 -4075 -1698 619 -1213 -61
13921 -61 -3382 -8598 -12898 -7591 -5161 -9651 -8713 -5835 -7051 -10209 -8551 -7628 -7268 -998 164 1675
13905 1675 955 -1350 54 2905 -2044 -6081 -4847 -5158 -3049 114 1940 4554 8175 11666 18130
13890 18130 16950 14677 14934 15270 15721 13950 14357 12277 9929 5899 -161 -3238 -1873 -5755 -3661
13875 -3661 1440 3782 6370 5603 2863 1277 -1872 -7420 -12789 -12027 -11437 -25013 -30212 -23224 -18354
13860 -18354 -19187 -8026 -252 -3532 -3291 -1790 3764 7513 6746 5052 2986 486 -6375 -10660 -11604
13845 -11604 -7430 -4784 -1337 457 264 -802 -1895 3847 2597 1992 1956 447 -318 4795 3057 -6694
13829 -6694 -9967 -7808 -6216 -3155 -2750 -1596 -1339 -5519 -12630 -11884 -9796 -5177 -3308 -3350 -5587 -5402
13813 -5402 -5465 -5854 -4584 -4913 -6878 -5538 -4954 -3169 -330 -807 -125 1112 -4625 -3983 -2602 -4155 -2262
13796 -2262 942 -1845 -1062 731 3668 6554 -4098 -6861 -3356 -2674 2559 3973 3398 1182 -2088
13781 -2088 -866 -2699 -3442 -2088 612 3947 -263 -4284 -3116 277 765 1670 1355 -2206 -5522 -4576
13765 -4576 -2811 1284 672 -3987 -104 2630 325 -3555 -2592 -2632 1245 166 -1340 -4593 -5600 -2924
13749 -2924 633 -1556 742 3908 7252 4826 571 3309 4189 3367 131 -1330 -2412 -6560 -6814
13734 -6814 -3919 -2044 4188 3114 695 -2241 -760 -76 1224 -1096 244 108 -2301 -495 -737
13719 -737 -2846 -1318 -517 -1470 2400 147 -1403 463 -2383 -4955 -3967 922 3123 -398 -1151 1820
13703 1820 148 1179 2397 3284 -659 -258 942 6192 4593 3552 5526 3588 -2244 -4424 -2667
13688 -2667 76 -1476 -7497 -9052 -9743 -9337 -8866 -9282 -10313 -7395 1482 -1095 -6341 -8875 -7762 -13217
13672 -13217 -11588 -9049 -12621 -10254 -10392 -13862 -11236 -9485 -6017 -7668 -7342 -7304 -8543 -10595 -11708
13657 -11708 -3923 -6366 -5435 -3061 -4728 -4762 -7750 -11378 -11255 -9518 -5651 -4995 540 778 -2166 2255
13641 2255 5568 6440 9661 9286 9186 8727 12051 12756 9008 4206 3429 -150 201 465 -3555 -2200 1378
13624 1378 4953 1929 2279 683 3188 7381 7464 5661 3912 -1031 -3561 -5011 -3527 -9742 -12109
13609 -12109 -12280 -8624 -4120 -596 -282 -4423 -4004 626 -3637 -2430 -673 -1515 42 -5110 -2668
13594 -2668 -3449 -5366 -6743 -5131 -4403 -3869 -3390 -3469 -5801 -5743 -3930 -1025 -3423 -3830 -2922 -3097 -5006
13577 -5006 -1639 -3337 -8465 -10602 -7800 -2609 819 -488 653 -142 -3587 -5039 -9927 -9600 -4394
13562 -4394 -402 -313 859 3208 5127 2627 2635 -1670 -4542 -2325 -1402 -1409 3334 3481 536 -5390 -6535
13545 -6535 -4977 -4730 -4074 -1253 -1538 -1885 -1586 -3115 -5494 -7804 -6576 -6215 -5017 -7089 -3543 -510
13529 -510 -3122 -7348 -9103 -7728 -2498 -3039 -902 -227 581 -1970 -1761 -4743 -5241 -1269 -4284 -9065
13513 -9065 -10739 -12765 -9584 -7017 -2769 -1733 1980 2018 800 -3202 -3700 107 2698 6483 14023
13498 14023 7040 2015 -322 -554 2531 4982 -276 1875 7067 7784 9791 9998 14913 18849 20272
13483 20272 15994 11356 10475 11074 12392 12111 20174 22192 23319 24501 28062 40921 46391 45970 49967
13468 49967 58042 72478 85354 98411 115256 130278 148345 167643 193221 218222 244707 287594
13456 287594 335368 394764 476223 599251 785114 1060090 1422121 1817049 2297697 2926092
13446 2926092 3420452 3630468 3869757 4065697 3841181 3401684 3011317 2573016 2047971
13437 2047971 1582830 1223256 937126 709210 554704 449818 369891 313923 275826 238366
13427 238366 206122 180178 157033 143573 131181 120380 109260 95858 83889 75896 69066 64707
13415 64707 62554 54794 48636 46151 51504 49524 45073 42974 41629 40009 41101 37362 34122 35664
13401 35664 35077 34458 37139 39704 39336 41743 41264 33974 33428 33396 34774 33283 29919 28530 27797 27206 23350
13384 23350 24489 19541 14012 11097 12021 15814 14841 14328 13248 15032 16678 13871 14107 19183 17066
13369 17066 8827 7803 13527 17007 13187 9074 8105 9995 7413 10144 9515 15256 17227 18681 19564
13354 19564 20283 19014 20784 28544 31293 29737 26870 22019 20798 18306 17041 14826 9697 9968 12028
13339 12028 14108 14544 16243 14391 7710 7495 8063 7816 8278 5829 3317 8426 10960 12776 8229 5964
13323 5964 6641 10814 8908 11200 9341 10710 9662 12665 15400 15774 11505 10935 12992 13582 17147 22971
13307 22971 32155 38684 36301 33556 26412 16823 12161 13947 13317 12865 14280 11048 14948 19398 20500
13292 20500 20370 13743 5592 2751 7951 8351 5032 9631 13548 15032 12194 5464 709 -593 956
13277 956 310 1358 4683 5659 5675 8405 2502 636 8243 8342 2323 7599 10328 7914 9372 11208
13261 11208 15695 16098 15045 10835 5498 3968 4161 6577 7674 6963 10750 16280 13911 4418 1267
13246 1267 886 1854 2348 7456 7791 8094 12110 12313 11265 11577 21484 28162 32202 35866 49100 64392
13230 64392 83653 108604 141200 169049 186245 201931 204563 185777 162780 141666 118939 97681
13218 97681 74616 59029 44306 34625 26372 19208 18059 15449 18457 19379 15668 14629 17117 14329
13204 14329 10081 5976 6094 2280 1837 2244 1891 -3558 -2396 910 1683 1997 -1236 -984 -1407 2986
13188 2986 6875 9622 10136 8809 9591 4901 106 1697 3551 5284 2691 38 -210 -3974 -4040 -1287
13172 -1287 2539 4230 3381 2676 1790 4685 1328 -4681 -1102 6085 12058 14520 9303 7368 10845
13157 10845 12440 11013 5555 -364 -1502 -1702 3720 10159 7907 1786 1179 5942 8386 7011 1234
13142 1234 5956 9016 4870 4028 874 6966 10464 5442 4255 3375 2234 3455 5518 5750 4219
13127 4219 8927 9302 9408 8299 6461 4248 -1931 -614 3096 7971 6174 1980 -121 1790 7210
13112 7210 10621 12948 13043 14447 19378 16276 17601 18800 17881 11356 9371 9429 4591 7159 9270 10032
13096 10032 6928 5228 8460 9026 3953 2023 5472 9597 11960 13735 10584 12793 9549 4428 7549
13081 7549 7290 9555 12627 12808 13885 11421 14358 10350 790 2368 4673 7068 8475 4239 1882
13066 1882 1826 -240 -3493 -1066 7269 10453 7848 6265 5303 2006 4344 5701 7487 10814 14087
13051 14087 16189 19226 21998 24989 27912 30573 27605 23282 19220 15901 19623 22281 20029 16031
13037 16031 14520 16927 21351 27074 28217 34946 39825 48301 51588 54983 59917 59082 56288 56051 58239
13022 58239 65633 72492 73234 78220 83251 89355 89536 87538 90878 90504 89008 85337 83832 74741 69463
13007 69463 64331 58641 54478 48962 44135 42430 44078 37579 31306 34479 35100 35831 34074 36535 40402
12992 40402 39215 33997 27986 22855 20216 16334 12450 14952 16288 14225 10162 7662 8759 10697
12978 10697 9339 6466 3470 4246 7424 7656 7603 8399 8789 8852 4485 3349 8897 11504 8980 6499
12962 6499 1232 1823 394 -2173 637 4686 6600 7021 3024 1256 1014 3538 6281 5013 4229 1064
12946 1064 -4417 -5505 -7249 -6532 -878 4344 5486 8064 11705 8162 3347 4368 8349 10211 11043
12931 11043 11779 9632 8038 5595 7403 12240 14959 14341 14357 17296 13120 5112 2848 1786 3793
12916 3793 7117 4479 5936 8131 10225 12619 8006 5716 1578 1777 -2620 512 4413 4148 3926
12901 3926 7819 10372 10745 10455 8443 6895 10159 6130 4305 8636 10489 8880 7652 6849 8678
12886 8678 11556 10411 12777 10663 8203 7513 7011 3543 1346 6688 9735 8682 10298 14693 12594
12871 12594 16921 13737 10463 6098 6565 1217 4355 4107 921 -1479 -3113 -8276 -5916 1979 3713
12856 3713 1019 2971 2434 3064 6743 8286 4913 2199 3133 5935 3777 6181 4802 4995 2149 -1125
12840 -1125 -1192 -606 -178 4368 5600 -344 -4583 -7719 -1849 -1431 -6771 -8485 -11011 -10943 -5047 -768
12824 -768 3017 2354 195 -1198 827 7253 9856 11228 14346 14278 11127 14579 17799 17124 18080 11762
12808 11762 7949 5877 3074 -233 -1279 2525 3957 -1286 -4342 -421 709 -2697 -2142 2744 4374
12793 4374 3829 1613 48 -465 -4106 -6910 -3140 2185 3958 712 -5216 -6509 -2022 3626 3099
12778 3099 5801 6511 6116 6412 5328 657 1679 3577 3056 1149 -2578 -2432 1090 1206 -58 1950
12762 1950 2108 -1730 -5428 -3756 -574 -531 -305 1958 2844 5028 10040 7726 6254 6525 9657 9414
12746 9414 6523 2667 5081 6852 4330 112 141 383 3804 8122 793 941 2930 29 730 694
12730 694 -635 -418 1582 -164 2311 -50 -5264 -7712 213 2828 6552 4403 5145 12736 18221
12715 18221 20125 16284 10243 7463 9088 6793 3415 2045 1665 1397 558 -846 3912 2662 5614
12700 5614 8860 3917 7671 11772 11119 4810 2398 2123 2080 3799 7506 7281 1402 748 2201 5116
12684 5116 -3554 -5625 -1277 -636 -5491 -3338 708 1163 1114 -3286 -1210 -2544 -3832 885 1589 6031
12668 6031 10344 12150 12460 13187 11032 8785 9182 4980 5334 4486 5978 6982 3287 2169 2573 2594 6906
12651 6906 8391 12519 21831 23169 17791 13718 19981 22995 20787 24230 22275 19319 20520 23024 26356
12636 26356 25550 23128 21444 18913 17578 16739 15753 13103 13422 15687 18182 18930 20099 16435 14970 13964
12620 13964 13257 9954 8154 6071 5231 -638 -3129 -2060 -3522 -947 4266 -479 -5696 -6955 -6186
12605 -6186 558 10204 18261 20606 20236 26361 34925 36591 39865 45193 47238 42433 38187 36889 29082
12590 29082 21644 18052 17109 6925 3689 16085 21232 20163 28177 37054 43384 53514 67628 74081
12576 74081 79105 88488 98452 102876 118549 136822 159034 188956 227247 275671 352778 466019
12564 466019 594243 725336 895799 1101372 1241787 1302608 1380240 1448376 1386658 1241034
12554 1241034 1112440 980191 807131 637742 499194 388918 302249 235705 193577 163589
12544 163589 139328 120918 104621 92259 83564 73133 63177 50331 43246 37346 35128 32702 32936
12531 32936 31811 27694 20566 21367 22200 22042 25084 28778 27044 26430 32247 35142 32281 32554 38358 41231
12515 41231 44376 50133 50264 45328 41214 46350 53208 53982 46369 41901 41591 39415 34408 27427 24480
12500 24480 25539 19520 17294 16987 17045 18902 19032 23250 26078 25441 21386 21965 23193 25342 24154 23174
12484 23174 21672 22193 19935 15301 8939 6779 9978 11936 12486 14175 14017 17442 16361 13210 14856
12469 14856 15263 14931 17684 23456 26843 28619 29531 33710 34458 34026 29949 25381 24033 21013 12446 8216
12453 8216 12730 19839 21700 29407 35310 41040 53131 58412 56115 60331 68527 68293 58550 52111 55112
12438 55112 56135 56674 54455 49297 49943 51462 47995 44839 40830 43288 43925 42581 41926 41422 46051 48946
12422 48946 48754 50108 51890 57184 61721 65005 70248 73134 70603 69362 71744 71069 64398 63331 61576
12407 61576 55517 52382 45251 40608 43709 41463 42258 40266 42298 44099 50151 65859 79859 91402
12393 91402 114284 139368 151375 165155 179750 189906 188896 188662 185168 167935 150918 134101
12381 134101 116205 100583 87834 78687 64112 54864 57236 56866 53615 55753 56989 50977 40570
12368 40570 41209 39464 37570 45059 61276 57671 50755 67487 81777 68269 68547 83021 74694 55159
12354 55159 49539 42516 31454 30825 29437 24990 25161 20014 26959 31568 33475 32768 30279 25097 24631
12339 24631 22532 15777 9844 14082 21760 30805 32657 35084 38639 38091 35565 31995 29300 21640 23103
12324 23103 25941 17964 14247 16623 13027 6132 4543 6489 3909 -1063 -5411 -6391 -10978 -8932 -4358
12309 -4358 3170 14318 16815 11732 9849 14112 19369 19767 20593 18340 20170 14973 10448 8171 3811
12294 3811 -2354 -7557 -15882 -21013 -18443 -23909 -30685 -36230 -31622 -25826 -13276 2167 19717 44304
12280 44304 84257 133657 184990 225258 237681 231926 201191 156374 116328 76206 36786 3060
12268 3060 -23917 -44136 -49472 -48130 -53723 -46221 -8647 36228 68106 110888 171881 232402 289419
12255 289419 341384 382802 420828 453806 462677 459690 460265 448387 424899 398853 375958 354012
12243 354012 327900 308667 299004 287087 279655 280562 281815 282371 286146 298070 306796 311861 321231 334128
12229 334128 337744 339268 342712 342203 339526 339630 338346 340836 346919 353043 354826 359622 370622 382298
12215 382298 391986 404723 420695 430233 447495 464400 471734 481687 498692 510642 516947 527430
12203 527430 539804 548467 557799 574425 589748 609864 634762 648439 669685 698218 727635 745822
12191 745822 777041 800469 819417 841294 869091 895932 925657 964134 1008730 1062611 1121927
12180 1121927 1189706 1270583 1348581 1422834 1499204 1583228 1670968 1765682 1861169 1960266 2069385
12169 2069385 2188940 2312211 2453543 2624948 2814611 3023414 3266049 3555171 3879336
12160 3879336 4247184 4682986 5192532 5789792 6507405 7368582 8360724 9498009 10852117
12151 10852117 12400495 14077835 16003881 18290979 20917210 24061426 28162892 33686928
12143 33686928 41387124 52711947 69581967 91893131 115069018 140149297 174722974
12136 174722974 210556536 226042583 232831188 248234057 255357791 235861961 209797286
12129 209797286 189328613 164625557 132928754 104165396 81825131 63712011 48989978
12122 48989978 37988953 30323521 25068046 21199082 18129700 15800311 14025579 12444636
12114 12444636 11002145 9817759 8839872 7969431 7206560 6575732 6046720 5590433 5196489
12105 5196489 4853511 4543539 4256766 4002052 3779057 3569095 3360842 3175440 3009146
12096 3009146 2847460 2702834 2574761 2460783 2363384 2281792 2206308 2125495 2040866 1960391
12086 1960391 1887122 1822571 1762561 1704324 1648437 1596748 1549636 1498368 1435137 1376937 1327232
12075 1327232 1280249 1234059 1188603 1145223 1108163 1074368 1042971 1011340 977804 941783 907037
12064 907037 873724 848159 827933 802854 778643 761191 744521 728272 709978 691249 678825
12053 678825 667696 655859 653683 655276 651475 648068 657928 672937 672913 653330 627682 603655 570176
12040 570176 534285 507290 484071 466466 458095 447046 436222 425999 425037 427634 421083 414670 410721
12027 410721 405682 393435 384077 374909 368555 364456 361164 350735 342666 340191 337017 332132 325701 319540
12013 319540 326775 343994 356439 382239 413760 439106 469415 515612 563758 584279 597551 612313
12001 612313 612886 597451 575763 556970 534672 508482 484224 468079 452947 443935 438454 432188
11989 432188 430841 433305 427173 419442 412451 409397 410024 408788 399888 395146 391293 385922 379488 372555
11975 372555 357672 350388 340406 330785 320881 309350 302717 294369 293352 289578 285315 280865 280779 281652
11961 281652 283692 282147 277458 272941 272314 272270 272578 271285 268089 272394 276439 275518 271452 262609 260959
11946 260959 262170 261773 256694 250803 246251 244019 238437 233195 229948 228083 222706 220844 218323 215698
11932 215698 214038 213573 213071 212357 209849 207857 205856 201972 196708 192764 189485 182489 177894 176277 173125
11917 173125 164686 156205 159117 157103 154443 172804 182578 180740 187192 201269 191152 182031 189850
11904 189850 186423 167189 156266 157072 144529 133667 132744 132309 131897 131017 130259 132838 142711 154057
11890 154057 160302 158733 164819 169759 170948 170586 168530 169466 172141 168374 164628 160067 159064 152558 143606
11875 143606 139578 133398 130477 128829 129409 132189 130181 128520 133420 136917 130991 127197 119895 110660
11861 110660 104299 102623 102237 101912 93941 86326 85889 83528 83604 87114 94870 96028 93545 90933 86325
11846 86325 85534 88737 89544 91075 96156 96344 101441 106371 98906 89238 86390 95128 93987 90506 86603
11831 86603 80922 78086 74470 70326 64867 62758 62764 64998 69218 77205 84270 90654 100348 103450 104737
11816 104737 105477 111610 115325 112339 114355 106977 102946 101350 93564 88709 88259 90401 95925 94765 92286
11801 92286 93310 91384 92632 89627 87954 88596 94024 98523 96820 96632 100446 105779 106432 111885 114810
11786 114810 110073 107652 105006 102889 103985 101705 95403 97186 101456 98373 97005 98271 96166 98403
11772 98403 102885 100412 96878 96146 99076 95559 91110 90801 93786 102183 104170 98184 90796 90585 89297
11757 89297 87086 84697 81629 81142 78850 77684 80747 79167 78860 81522 83973 81613 84571 87984 92291
11742 92291 96722 94372 95132 97348 100246 101447 103956 106188 108234 114289 116520 118420 125675 130091 123807
11727 123807 115541 111593 114399 121525 129674 139139 149201 159707 165023 169477 176690 186593 203080
11714 203080 223448 249754 288413 341956 421731 527603 647522 789266 971026 1182784
11704 1182784 1318192 1368364 1440653 1502658 1432597 1283714 1152335 1011146 835061 668907
11694 668907 534845 429397 344161 283365 243493 209947 182360 167413 151256 134304 126417
11683 126417 124133 114275 114756 117217 110030 106929 114696 113557 112990 114200 107918 104318 100376 95967 100690
11668 100690 100490 102060 101050 96614 92359 100331 106713 106034 108448 108277 104988 104437 101471 95230 92558
11653 92558 90911 88237 84820 86024 84708 81187 79676 82534 78888 71871 72069 74022 73884 73445 74877
11638 74877 77016 82750 88725 95524 102013 102258 99377 95141 91253 86674 87184 84238 75716 69513 73532
11623 73532 79008 80473 79075 75851 75430 70544 64957 70876 78045 78615 79662 76713 77123 77411 73020
11608 73020 72619 74956 74297 70075 72516 66111 67033 70556 70935 69455 65531 66427 68891 66574 63026 65044
11592 65044 69383 77912 79972 81897 78545 75571 71403 68312 69784 71459 69599 66208 62247 64071
11578 64071 65986 66170 66550 66825 62603 60316 63686 68854 68274 66571 66511 65902 67643 70951 69986 63606
11562 63606 64624 68830 75871 75469 73876 69254 68002 68759 68469 66962 66895 67513 64002 62886 63662 66467
11546 66467 68265 67112 69367 69574 72702 81892 89647 95857 96080 101562 103107 100807 96260 91630 86833
11531 86833 80345 72491 72037 71050 64294 63686 67362 73393 75904 75755 73296 67771 67025 68351 73002 71171
11515 71171 68529 69859 67860 68654 65822 67834 65817 64096 64720 68429 69506 68403 68233 68886 68562 69161
11499 69161 70237 65625 63539 64081 67412 68364 63663 60970 65940 66521 68185 71996 72361 70752 69809 65623
11483 65623 67824 69369 67883 66012 64129 63947 67434 64178 63252 68398 67490 60700 58329 60531 62004
11468 62004 59127 56609 56556 59474 62215 67283 70127 73108 78662 82728 79667 80820 82729 81999 78401
11453 78401 80811 83017 78861 73769 74040 66842 62820 68399 71029 68420 68876 71576 67155 63979 63861
11438 63861 64344 62967 60718 62396 65364 64918 62972 63501 60187 57912 57412 60971 67257 67056 65302 65050
11422 65050 63556 61901 64257 74231 84641 84728 84330 91536 93607 88543 87843 87129 87397 82136 78424 73396
11406 73396 77193 78071 72185 67313 65870 64689 63543 62057 59453 56252 53423 52436 57512 58846 55522
11391 55522 53366 55322 59536 57350 56846 57982 56183 54136 56229 59670 62491 63851 64172 62191 56523
11376 56523 59810 59962 62491 66559 66813 63147 62833 62268 61898 64726 64322 60191 62671 66873 67489 67076
11360 67076 67235 63524 58705 59093 58603 53987 55453 56221 60293 62609 64259 59258 57135 53656 54776
11345 54776 63008 66479 61633 60989 63789 65207 67818 66721 67517 65005 64894 66907 64692 66180 66602
11330 66602 62013 56307 54231 55456 58298 65343 65678 66633 68752 73440 73968 70963 69192 68082 66756
11315 66756 67241 67448 63748 61626 63325 71308 68304 59278 60929 62762 57740 60599 63419 66944 62138
11300 62138 64110 66856 62724 63583 63414 62554 63109 63215 61389 60294 61951 62438 66855 66450 60699 61989
11284 61989 67531 67216 62507 61055 65643 65302 63836 66764 63703 64897 66828 64846 59971 61928 69805
11269 69805 71456 69748 70694 70026 70427 69198 68871 68740 70471 73203 73725 69129 61126 59602 57807 59935
11253 59935 61332 61026 61573 66446 66064 66302 65047 61653 61902 62326 63502 74500 79162 71746 66255 64119
11237 64119 68166 68382 69433 71688 67834 63721 69761 70070 66482 67233 72121 70324 68469 69705 70827
11222 70827 71217 74261 72500 71018 73837 72623 66993 61537 61545 59071 64497 67486 63844 67111 68621
11207 68621 70487 75745 75036 72034 71746 67077 72206 74748 78839 77175 77262 78364 80871 83352 81683
11192 81683 85378 84934 88371 82413 76746 74475 77523 75157 69624 68752 70293 69532 69746 65238 66651
11177 66651 72143 76716 77264 73753 73578 71676 73075 77687 74808 71056 74349 78977 77805 77510 80646
11162 80646 80692 80099 81634 78478 77714 79709 82640 86922 81892 78630 80320 85147 87233 90050 93313
11147 93313 93585 92156 93999 97741 99254 95982 95415 100908 104424 112534 115736 114621 115863 119277 126847
11132 126847 133634 138341 144215 152601 162341 178440 188091 200475 220289 240869 260599 286307 319992
11119 319992 354075 397391 444385 492821 561801 660454 783870 964348 1246360 1726935 2565711
11108 2565711 3805603 4956810 5607518 6148012 6469294 5932067 4864211 3888002 3032935
11099 3032935 2214594 1555659 1111490 830242 654015 536641 461709 410676 362451 321080
11089 321080 284389 251026 226994 207487 192564 179432 174223 166625 158940 149258 141937 136606 132924
11076 132924 132061 131083 129920 127780 120286 116097 112662 112507 107153 105385 106288 103039 97205 91916 94745
11061 94745 95323 98462 97872 95743 93891 93028 93057 92504 90085 92423 94759 94972 94941 94614 90903 93907 103186
11044 103186 107151 105517 105269 105250 102938 100134 99832 97394 97593 104570 103539 98813 104659 108216 105231
11029 105231 103923 104297 107623 113166 114600 111058 113076 112863 112768 117974 122203 122647 121087 122789 121665
11014 121665 123496 120702 118247 120593 128679 138008 146442 153793 161596 168671 179767 189431 194696 208354
11000 208354 223870 240984 258945 279025 298175 331850 381496 437363 502958 587716 692246
10989 692246 831291 1042135 1384527 1986864 3006941 4181295 4781570 4928844 5352677
10980 5352677 5912914 5708211 4753294 3841858 3127070 2408935 1725658 1217684 894655
10971 894655 687795 558566 470009 399106 343023 306255 278282 252918 226176 205673 186147
10960 186147 174671 172324 169436 163343 157792 154038 153855 154699 151579 154348 152601 148200 144897 143308
10946 143308 139115 131379 126063 122661 121661 117640 118390 118072 113772 113524 115469 115663 118917 121589 114003
10931 114003 113187 111130 110047 110400 111944 115793 113604 105643 102146 101161 100332 98296 100020 101596 100220
10916 100220 102427 102700 102950 101396 96712 93647 96138 99008 98881 94380 90134 90049 96754 98965 97504
10901 97504 96238 93153 89490 95985 95426 94044 90661 92561 95449 101433 107532 115169 133294 148953
10887 148953 148108 143485 144624 151086 154561 150492 138903 133813 122379 114578 107756 96697 91906 98847
10873 98847 102132 102209 98861 93383 93975 98209 103107 103559 101641 97463 96171 101937 105884 105947 112043 123712
10857 123712 142155 148120 147969 150992 155762 157874 156591 146236 136679 132254 123574 108998 101823 101308
10843 101308 95153 94347 91773 85064 84349 88347 89156 88527 89888 86684 82868 80406 83095 87246 89406
10828 89406 89640 87349 88077 95040 94616 91264 89853 96086 104540 105496 100650 96990 96738 97791 97851 98209
10812 98209 91163 89676 94495 99968 95557 93205 92251 92781 98089 104417 103753 102044 99441 97228 98177
10797 98177 103423 105303 100173 95893 94616 95044 99281 103585 103623 104662 107301 105758 106180 105617 104973 104114
10781 104114 98929 99083 103978 107289 108969 104930 107598 106482 103749 99058 99341 102042 99310 97932 98076
10766 98076 103401 107396 106303 109131 115524 116301 113032 113993 109570 105086 105559 110856 110501 108763 107841 102195
10750 102195 99789 100437 104398 106136 107732 105833 107592 108250 108159 109909 112377 106318 99347 100061 98651
10735 98651 101448 105882 106877 109706 115248 115761 114992 112901 113116 111728 106852 101781 100383 100653 101976 102029
10719 102029 106041 109509 112378 111756 111809 118188 122363 122519 124751 127578 128233 124551 121003 121337 124903 123405
10703 123405 124500 128959 132757 136799 141584 138946 136382 132330 126764 127643 127894 133689 136325 135866 138866
10688 138866 136376 140127 139190 140926 140965 145307 149308 153057 159169 162403 155827 155037 153019 147695 141833
10673 141833 137614 138848 144048 149859 155313 161498 164789 163469 163664 161411 161202 151455 142248 132983 127766
10658 127766 120913 118283 111751 108460 109036 111696 112973 112663 111515 111810 118677 129856 138185 146080 154928
10643 154928 162802 167867 166094 166013 166003 164289 156772 155445 149861 144441 144050 141670 140384 145520 145942 142345
10627 142345 148508 157624 161394 166113 164046 164005 163630 165974 163468 164171 163186 165532 168243 171904 177617
10612 177617 181706 186255 194736 203269 210358 213097 214550 216451 222254 229735 243020 254555 265495
10599 265495 282781 302864 332327 368291 411414 473378 572422 715106 925390 1204481 1521378
10588 1521378 1917228 2258596 2443058 2597924 2577268 2345057 2061744 1752194 1415322 1106793
10578 1106793 863238 672201 536391 442848 377400 330035 296737 269508 249757 236550 227414
10567 227414 217150 210464 209375 212172 222503 228398 228731 230068 228950 227199 222966 217377 214642 214068
10553 214068 213721 207148 204021 197437 186215 181845 179574 183175 185814 192865 201610 206159 209032 211646
10539 211646 215752 214129 210926 198458 187985 188162 189520 185807 182708 184567 182111 181503 180328 177174
10525 177174 176506 175872 171979 170435 172721 175451 179752 186218 188479 189505 193353 202847 211139 221181
10511 221181 236783 253358 273147 289374 299178 305662 304646 297233 279551 262751 247957 230463
10499 230463 213135 203751 198363 192101 191183 201094 212531 223401 232937 243665 259105 269055 272006
10486 272006 270452 268429 269472 270657 267616 266373 260609 261007 265181 264293 260744 253814 245522 243187 246652
10471 246652 248929 253038 256434 260103 262948 269799 271966 276459 283663 288652 293387 300327 302692 299096
10457 299096 295511 296308 297630 299139 299393 294829 292408 285482 284229 278989 270466 268241 271779 273639 277623
10442 277623 287986 300316 314680 336239 364153 394445 419499 440725 468122 497513 503826 515798
10430 515798 510264 478939 450960 413872 374998 334456 308702 293806 289656 286392 297253 316184
10418 316184 333552 345484 348630 350567 343582 323305 309444 316471 311616 310595 326545 332443 333364
10405 333364 342120 343680 337386 339289 331022 320163 317979 310073 306389 311072 311525 310565 316047 326927
10391 326927 329564 325562 318548 313648 315536 313982 311662 310568 318770 326672 338114 353328 367901
10378 367901 385887 401500 414096 427839 437413 446283 460632 472403 482715 510209 545349 596206
10366 596206 670517 770405 902540 1083807 1298175 1519934 1764339 2008234 2163456 2258464
10356 2258464 2327873 2280489 2132704 1962252 1758790 1510257 1277048 1075955 894518 744579
10346 744579 641821 566748 510538 469649 438752 415714 397990 385896 374873 356593 337108
10335 337108 328553 325285 318834 318702 323448 324644 323087 321877 320034 312550 312429 314790 309763 309165 307688
10320 307688 308825 308730 313497 320051 324870 326037 330720 340308 327705 302272 281290 268081 257115
10307 257115 268596 322271 385763 452709 544887 621415 670228 718356 747344 768381 773909 774934
10295 774934 784895 792242 792907 799502 809547 817935 827088 835640 841410 849709 868174 889286 917229
10282 917229 946781 969290 983801 991883 998517 1007439 1012279 1010670 1016852 1019736 1020279 1025487 1034534 1040112
10268 1040112 1051671 1063627 1079228 1089918 1105678 1130191 1162603 1193833 1218633 1243382 1271374
10257 1271374 1300852 1328048 1360666 1389850 1412894 1434400 1460571 1482962 1512152 1550489 1578264
10246 1578264 1605693 1634505 1654693 1674157 1705514 1742800 1775557 1824578 1881934 1935048 1986735
10235 1986735 2041101 2093040 2140962 2188819 2234690 2289103 2356621 2442021 2545813 2652071 2770069
10224 2770069 2899291 3038816 3180453 3312581 3465104 3630773 3811203 4025992 4263406
10215 4263406 4519183 4809662 5100789 5390363 5718000 6088592 6493959 6998811 7630035
10206 7630035 8345330 9150023 10086700 10962774 11822905 12771648 13642107 14517925 15542289
10197 15542289 16732196 18117170 19771088 21780050 24231760 27227544 31026539 35891527
10189 35891527 42176579 50560691 61996310 78085843 101852193 137380047 184858585
10182 184858585 237486274 300063794 362435588 393799002 417511435 429902419 403616203
10175 403616203 361762986 316213932 261761663 205755785 158865345 120992651 91382491
10168 91382491 69869387 54464653 43418832 35270251 28993421 24115486 20351049 17404162
10160 17404162 15144884 13452838 12214329 11344225 10749431 10389461 10094555 9724820 9390781
10151 9390781 8926845 8287873 7638193 6990420 6319499 5709847 5192290 4730100 4339046
10142 4339046 4009582 3706693 3452041 3230017 3018902 2832590 2672960 2528932 2399322
10133 2399322 2293792 2204837 2124309 2055374 1997774 1938065 1879430 1819005 1756321 1693401 1625132
10122 1625132 1549407 1473765 1406623 1352427 1308006 1262826 1220633 1181294 1146720 1103762 1052243
10111 1052243 1008366 957714 907245 869061 832767 799366 775055 756339 732082 716096 706027
10100 706027 694868 689175 690911 680987 671501 663867 648039 628851 614799 601177 578143 556929
10088 556929 532359 500070 470090 444858 422578 420903 429160 452285 499936 550680 602652 677024
10076 677024 756229 827159 908570 990245 1051988 1110310 1153635 1177026 1192703 1184076 1165160 1149291
10064 1149291 1142028 1150486 1167359 1172844 1202428 1254124 1271030 1253474 1252696 1273420 1289520 1303143
10052 1303143 1333396 1378996 1431923 1471569 1501177 1523626 1528825 1506886 1483283 1456243 1430085
10041 1430085 1415278 1402543 1404099 1421710 1445158 1471799 1510635 1559040 1620208 1686442 1762759
10030 1762759 1847057 1936791 2033699 2132657 2226718 2337471 2454285 2563257 2710232 2914866
10020 2914866 3195902 3573504 4088082 4703317 5342437 6077385 6808865 7250691 7549311
10011 7549311 7720754 7501185 7066837 6575632 5949903 5281501 4695545 4194810 3786010
10002 3786010 3493938 3300251 3185448 3138709 3139941 3170480 3225610 3308510 3415001 3534142
9992 3534142 3662143 3810626 3975862 4151585 4342403 4550788 4781954 5051100 5368466 5738705
9982 5738705 6179777 6707652 7340680 8083665 8913655 9847567 10920543 12060260 13236774
9973 13236774 14556444 15982729 17486553 19209894 21259990 23697932 26639293 30334994
9965 30334994 35101047 41307639 49712790 61629836 78314887 99982383 127482830 163164985
9957 163164985 201812830 238980998 279791876 317924898 338104568 350560708 359637247
9950 359637247 348874643 323254293 295478252 261606215 220034654 180331144 145158141
9943 145158141 113540499 87179772 67027728 51961778 40776830 32643324 26821862
9936 26821862 22581222 19396183 17006991 15183414 13771455 12705837 11831450 11050520
9928 11050520 10409948 9793068 9117753 8463909 7836666 7196769 6577058 6016656 5505826
9919 5505826 5046596 4645052 4297964 3999284 3725504 3485404 3272306 3079034 2906919 2748846
9909 2748846 2608631 2481093 2363623 2258579 2162663 2076454 1989409 1916339 1841124 1765058 1696140
9898 1696140 1628791 1560830 1486795 1420372 1359234 1303170 1251268 1202148 1157224 1115062 1083625
9887 1083625 1052640 1016766 985492 955630 914218 875616 841138 803124 764798 730428 699852
9876 699852 671263 650510 632290 606548 587994 570709 554198 551654 546314 534439 526723 521285
9864 521285 514847 508287 498645 491867 478461 458705 444129 434038 423739 414339 415742 431117 448486
9851 448486 430233 410318 394941 376794 360102 343174 333931 324898 309711 306247 302228 294321 287909
9838 287909 287154 280201 273609 272406 273946 273725 275546 285283 298565 324171 371234 425092 467459 511823
9824 511823 561490 606182 634081 646814 645349 630321 613173 597216 579614 555499 533770 512354
9812 512354 495134 480670 464102 453858 449332 445918 440548 435368 431790 427389 421312 414016 409181
9799 409181 403218 397827 395068 393472 392881 386409 372697 362120 358891 356761 354045 348899 342881 336130
9785 336130 337608 348321 355276 361250 372362 390782 404855 420523 443943 467456 503139 557395
9773 557395 635080 750352 930359 1185786 1483558 1841371 2240785 2485126 2632397 2708025
9763 2708025 2552705 2269204 1965709 1627357 1290791 1014455 796922 638397 517396 426531
9753 426531 364620 319777 288488 262882 239298 228213 215277 207492 201757 192247 190293 187123 181155
9740 181155 174859 163980 149011 137822 136079 124991 119036 121565 121100 121297 125726 134492 133789 139367
9726 139367 148332 152168 154650 155423 152779 146392 134477 124897 121834 119955 118622 116517 120968 130754
9712 130754 141648 160704 187372 219731 267211 339108 450892 586150 661474 636043 579520
9701 579520 524854 454540 378250 314360 266832 234881 219707 214070 215984 219924 216650 206922 200688
9688 200688 192598 194464 203665 220305 247555 274701 274644 256352 233061 211133 195095 175119 161926
9675 161926 156539 159037 154319 145296 128617 111548 102788 91325 80319 74866 72115 68805 64847
9662 64847 66493 65840 66199 64486 60130 61126 62515 64782 67449 62583 54818 44926 33089 28042 20702
9647 20702 15275 15082 12780 6207 8153 11760 19416 30349 36878 46995 61192 74524 80717 78497
9633 78497 78994 85699 86828 89202 89274 79934 74224 69744 67656 66426 60858 61120 61876 62869 63550 69264
9617 69264 72595 71267 73550 77774 81324 85065 87028 90417 93235 97798 103635 113741 120343 118758
9603 118758 117176 122529 126669 124722 117813 112928 105292 101091 93381 87663 88287 90266 89985 88084 89922
9588 89922 103890 111333 118999 124043 123822 128243 135376 145770 160367 176334 191774 225999 280940
9575 280940 356623 481312 698100 1010836 1183695 1175835 1156441 1130128 1014692 828691 669241
9564 669241 545183 445488 363787 304049 269894 259221 253206 252436 263135 281663 303750 337968
9552 337968 383696 447217 541533 663241 828792 1043830 1262582 1487082 1741073 1944304
9542 1944304 2049978 2134821 2147432 2029168 1852524 1663153 1431396 1191005 989478 824120
9532 824120 689100 593326 525641 475314 434831 401240 379591 379399 391685 381326 355360 334669
9520 334669 323774 310066 289176 261437 237325 219706 198701 172760 153675 137210 121064 107664
9508 107664 105144 98951 87253 81073 72920 70863 62216 56036 52235 52057 53611 54878 52602 50904
9494 50904 48787 45013 41153 37607 42490 42763 38538 40264 42794 46311 47295 51781 58916 65958 73388
9479 73388 79985 83163 83482 85184 86622 90685 87228 80714 78368 73539 68658 61095 56179 51451 49547
9464 49547 53880 51968 50781 49438 49086 49534 49727 45101 45220 48370 47857 45165 45124 51102 52259 49015
9448 49015 47781 50700 48681 48582 48435 43463 39071 44166 47921 51670 55086 54243 52137 53087 54289 54958
9432 54958 55030 57823 58789 53408 51893 59246 57872 48820 41125 43163 44301 43287 43490 47067 49402 49742
9416 49742 55512 55123 60461 64080 62989 61990 65825 63225 67911 71501 71086 69011 71488 71424 71657 68964
9400 68964 70543 71415 67750 65019 63838 59230 57455 60183 66397 63257 62903 60698 52437 53091 53868 52349
9384 52349 53423 56758 58357 62575 67110 68122 69039 69645 69961 69401 67155 69084 71901 69685 66175 63761
9368 63761 61741 64175 67055 67851 65743 72052 77774 78037 75209 75192 72298 70056 64628 68398 70475 64290
9352 64290 64932 69573 64517 62685 68923 74924 73476 70236 73655 77222 75356 76648 77914 77700 76242
9337 76242 72094 70475 67886 65570 66523 65276 68086 71888 70595 71409 74186 73393 72306 69831 70468 74367
9321 74367 81609 86622 82127 84319 84445 82297 81885 83141 84077 84902 82895 83764 85253 83298 84048 86690
9305 86690 84261 80655 81895 88307 94791 94226 92014 95644 94120 94615 93595 96621 92562 93928 92000
9290 92000 88717 84721 85546 86911 89029 87512 85170 83347 88011 89476 83191 80959 83360 88220 91661
9275 91661 90260 85943 78284 77850 83350 83326 81438 83235 85892 85696 91517 96784 95406 90142 88960 89046
9259 89046 86287 88457 95679 96932 92389 92203 88909 87324 92708 92578 93811 94690 93883 95612 101568 106693
9243 106693 107875 104414 99576 94780 103855 104838 102100 104040 106281 105614 106208 106128 110913 110659 109418 107863
9227 107863 106638 97471 93075 90650 92367 94081 97946 103728 103493 98407 98285 101108 103946 105876 106968
9212 106968 108174 106214 103507 102653 103477 103255 99558 101525 101560 101466 102959 100915 97052 98939 102910 101103
9196 101103 100132 105044 102529 99509 99256 102818 106748 110370 109190 112894 118631 120116 117605 118738 121447
9181 121447 120167 118858 121685 119588 118169 120058 116777 120084 121906 123506 128005 133322 134713 141321
9167 141321 138869 132737 136754 134430 130397 134168 144116 146320 148846 146595 138779 133521 129498 125122
9153 125122 130255 136204 135748 137807 138665 137807 137946 141156 147064 146215 142632 140565 137002 141509 141979 138504
9137 138504 137454 140638 143280 145323 147241 147514 147460 143724 146752 146003 145616 146508 142750 143399 143242 142900 142830
9120 142830 145263 146018 143504 143149 143113 144463 153176 156195 153004 153967 153510 157344 163526 162981 161322 162895
9104 162895 162106 163576 168414 165174 163320 162222 164424 165367 168613 168672 164237 169130 169238 168296 168408 164980
9088 164980 168396 176105 181268 177846 178073 180586 184334 181399 183093 184237 182084 185594 184929 182985 186048
9073 186048 189344 192638 194595 191652 191279 193848 197768 201828 202175 201207 204026 208016 208478 211650 209664
9058 209664 206847 204389 206368 212688 217539 217251 216166 220448 226100 227571 223709 220789 223225 227401 232069
9043 232069 239077 243051 245414 249787 252599 251350 252195 258778 258174 254848 254357 251302 249375 249278 252170 259983
9027 259983 264818 264905 268206 267897 273879 275780 271209 274506 276026 275807 278472 281377 280049 282534 284620
9012 284620 286361 286435 279576 278773 281844 286172 290977 291388 290588 293525 301732 304343 304482 303712 307442 308307
8996 308307 303967 303446 307538 313956 318263 319723 328522 339451 344792 350678 352698 359258 368442 370765
8982 370765 371762 377939 380896 385487 389318 390726 391562 387921 388155 386703 384292 383244 378075 377739 382992
8967 382992 383760 380152 376971 375902 377170 378744 375228 374602 374317 375860 377163 377336 386606 390624 394061
8952 394061 396514 400097 402203 396447 396990 403966 409913 411680 409181 412375 411283 411047 409372 407972 409718
8937 409718 413381 414640 417930 419417 421203 418429 419274 425893 428303 432349 436610 442228 450634 458463 460218
8922 460218 457878 459162 464013 466143 470010 474158 480009 483498 484922 489597 490922 495989 494405 497034
8908 497034 496057 499570 503296 506226 510112 509842 513423 521250 527143 531076 540131 554032 560686 563235 562369
8893 562369 564444 569106 580621 588992 586953 583562 587656 595278 607195 614726 619206 624822 629739 634596
8879 634596 638863 649579 658381 663389 670167 675577 682082 687636 695101 705060 716410 727050 738738
8866 738738 747342 756116 767001 772896 780749 796145 807993 822059 838698 856511 877269 890848
8854 890848 910535 933941 961780 987856 1011418 1037774 1066891 1094094 1118897 1144958 1169533 1187389
8842 1187389 1208262 1229957 1257943 1287360 1312377 1329292 1344966 1365762 1384280 1406253 1432029
8831 1432029 1455335 1481426 1506976 1537106 1563896 1589298 1617950 1651798 1687209 1725910 1757683
8820 1757683 1785361 1812622 1845455 1879686 1916207 1954563 1994672 2036937 2073904 2109385 2150403
8809 2150403 2195568 2246141 2298411 2349220 2397040 2448802 2509358 2573408 2635752 2702899 2769280
8798 2769280 2831165 2893811 2963948 3041461 3117931 3199990 3283551 3369887 3457344 3552335 3653879
8787 3653879 3764847 3875132 3990476 4104780 4226746 4359361 4497590 4644422 4796668 4954423
8777 4954423 5118877 5297083 5492970 5698912 5909753 6134734 6373054 6623543 6894957 7183838
8767 7183838 7484587 7802814 8147325 8508199 8899363 9319355 9763546 10243599 10766407 11325698
8757 11325698 11930778 12589612 13293995 14059461 14892727 15797603 16787114 17869122 19053504
8748 19053504 20351403 21772570 23335494 25056037 26949482 29044712 31360264 33918633
8740 33918633 36758649 39902059 43374052 47222229 51485745 56180192 61314046 66884985
8732 66884985 72860689 79155986 85631983 92090549 98257386 103785424 108322106 111526280
8724 111526280 113131512 112995586 111125905 107678329 102913742 97164472 90773443 84073314
8716 84073314 77343932 70808456 64614187 58839808 53543226 48729883 44387881 40486498
8708 40486498 36986962 33864273 31072390 28580313 26352553 24348176 22551922 20932186
8700 20932186 19472088 18158745 16962705 15876570 14890630 13987580 13156469 12394067 11692866
8691 11692866 11048130 10448308 9896708 9385668 8907800 8463852 8045537 7656913 7298327
8682 7298327 6966503 6655110 6366977 6098953 5844424 5603709 5376460 5160438 4954609 4760613
8672 4760613 4576770 4401038 4230183 4072523 3927842 3786747 3649543 3521582 3403083 3291694
8662 3291694 3186551 3082129 2989451 2895605 2807311 2723635 2643553 2565690 2484278 2405099 2328611
8651 2328611 2258255 2192187 2130257 2065998 2008165 1950489 1896923 1845525 1795144 1748618 1705283
8640 1705283 1662905 1620463 1581676 1546973 1512726 1471017 1424341 1383441 1352273 1323035 1293537
8629 1293537 1268206 1240101 1211012 1183602 1165031 1142726 1119890 1101439 1075029 1048898 1030978
8618 1030978 1010988 991190 976126 960873 949401 943731 938628 932301 914675 893931 876905 863896
8606 863896 845630 833986 822417 811883 800645 792310 792863 792734 793880 794514 789324 783855 775974 771689
8592 771689 766146 759945 753198 747493 734419 719214 703650 686657 673276 661563 650424 642092 633895
8579 633895 625844 617377 609332 603320 596218 589541 582061 574881 571016 562879 553462 541418 538062 540448
8565 540448 529102 518022 511191 498223 483623 473461 458911 446378 442772 438832 433199 428155 422150
8552 422150 409179 404293 397611 393958 396265 386867 379134 374224 367875 360664 359012 358808 358064 354552 346043
8537 346043 337335 329400 320799 316376 317528 316124 311688 302083 298442 298323 297597 292976 283905 277452 274836
8522 274836 270758 266514 263035 255735 250089 244508 237120 231671 226238 227711 226504 227271 228343 221738 214672
8507 214672 209201 211839 209876 204632 201552 199667 203179 201554 194770 191270 188973 185702 188885 190028
8493 190028 186234 177036 173242 171757 171776 171550 166380 161593 165386 168616 168318 160716 160661 165440 166104 168864
8477 168864 166990 169029 169690 162509 158890 157891 153986 154148 150384 144396 146455 143780 137969 134955 134522
8462 134522 134910 134618 131499 127165 122494 115162 116515 118209 107951 94315 86759 80892 73222 74101 82530
8447 82530 79946 77940 82224 89768 93888 96160 98418 93803 95411 91749 86442 84062 85354 84913 84061
8432 84061 88003 88335 92718 96144 95918 101035 102748 100108 99791 104629 124849 156173 162969 149251 140736
8417 140736 127515 112239 102873 94445 85075 81746 80399 78139 78501 81842 84842 87241 86926 82730
8403 82730 79760 77269 78578 73219 74669 75557 74072 73211 68152 66799 65909 68446 70020 70442 71552 69182
8387 69182 68550 72407 79112 83759 87430 92622 96977 108440 129643 170476 234021 277680 264454
8374 264454 236889 212656 178711 143234 121717 102485 83700 72795 62991 57155 55631 59142
8362 59142 60528 56809 54831 55037 60816 60450 60501 59372 59086 54991 50430 49626 46754 35252 35905 41069
8346 41069 40664 37637 31580 29678 33979 37893 40011 35877 42179 47079 53570 57953 72660 99249
8332 99249 136200 152733 146344 131777 116360 101629 85034 68059 59681 60177 62978 59514 51847
8319 51847 46090 43863 45800 45956 49835 49676 48535 56918 58550 49664 42686 39374 35687 31836 31749 31667
8303 31667 33223 33505 33621 33409 35776 41491 44180 51342 59181 58530 59810 59537 58216 52049 38554 38799
8287 38799 37418 38209 34796 33954 30096 23402 20583 23242 23184 24832 27702 24533 18742 12942 9611 11094
8271 11094 11381 18866 22048 25354 25428 26545 29289 22038 21752 16426 16167 19008 21244 25005 24321 23782
8255 23782 24671 25115 29194 36544 51201 70479 91183 112798 119523 116790 106288 89032 69957
8242 69957 52602 43892 35333 29838 29028 29339 28760 24157 18385 9799 -1069 -9339 -15059 -9985 -1035
8227 -1035 5940 4437 12462 32558 37538 21986 16532 21900 6508 -6058 -6013 -10185 -15311 -8295
8213 -8295 -1370 1889 7103 15233 23937 27720 22047 17985 16349 18015 32657 49337 55790 56129 55625
8198 55625 47572 37919 26708 23872 21589 14647 11483 8950 8473 10972 11047 11070 8725 6564 4803 3254
8182 3254 3072 4291 5488 11887 8709 3663 -783 -3267 -5164 -5533 564 8890 6845 2649 -3224
8167 -3224 -5539 -3108 238 -1356 -1181 4518 4069 -521 140 3824 6731 11591 11627 12828 8970 7463
8151 7463 4063 5349 3931 -4201 -9446 -3075 -1122 -7385 -8412 -2285 92 -1891 -6322 -3953 -1088
8136 -1088 -2907 -6082 -7425 -10273 -12388 -2202 -3578 -2131 -3087 -10721 -13822 -8354 -6270 -7754 -3716
8121 -3716 2638 7046 9568 5799 2070 -2945 -3396 -3142 3801 8285 8344 3938 4443 5614 1619 -4847
8105 -4847 -6684 -2512 -1180 -2920 -2968 -3207 -2911 1788 224 -1483 -6015 -4928 2388 347 -627 45
8089 45 -1958 -2160 79 -616 -367 -369 -669 1895 -1779 -3204 172 2512 426 -839 -4200 -4927 -6163
8072 -6163 -5969 -4795 -6016 -2340 -4601 -6712 -5864 -3600 -8487 -16637 -21809 -16643 -6870 -7422 -5118 -2864
8056 -2864 -4165 -2577 2664 2715 359 2190 3079 -3164 -4622 -4122 -5436 -9768 -12210 -18221 -19527 -12499
8040 -12499 -10209 -13394 -13908 -9175 -5424 -3768 -2038 -1909 -134 -4131 -6379 -1981 742 3354 2122
8025 2122 -394 1064 4151 4926 4302 1921 5387 8263 5664 10514 5641 596 -1084 -939 -1950 -4617
8009 -4617 -2238 -8319 -14821 -14396 -12823 -6600 -9884 -7271 8249 18248 17981 31380 46036 30449
7995 30449 17242 22237 13264 -2483 2257 6517 -1296 -8705 -15223 -16611 -16453 -15462 -12562 -11864 -17929
7980 -17929 -19291 -15946 -13656 -20665 -19053 -17535 -17159 -10714 -3995 -6378 -7576 -8696 -7604 -10387 -7128
7965 -7128 -3698 -1779 -4088 -2092 -2243 -2764 -2164 -6174 -6478 -9358 -13070 -14554 -15810 -14959 -13727 -12070
7949 -12070 -12168 -8842 -6933 -9301 -7176 -3554 -7203 -6818 -5931 -5390 -5667 -8925 -10351 -13632 -12516 -10455
7933 -10455 -6679 -4194 -1426 -1776 -8058 -8821 -2244 -8066 -12603 -14435 -17488 -19031 -15834 -16429 -18001
7918 -18001 -13093 -12005 -15917 -12224 -4451 -3856 -7157 -7740 -6903 -5145 -2275 1010 -1348 -1968 -1739 -4916
7902 -4916 -2979 -672 684 1140 1466 -3713 -5236 -2415 -4157 -4291 -3996 -4865 -5372 -8683 -11958 -10770
7886 -10770 -1702 -1123 -6200 -7627 -8060 -6586 -6131 -7313 -8856 -10692 -12270 -11130 -11194 -13247 -12739 -9538
7870 -9538 -9730 -12671 -13964 -13121 -15081 -11038 -5237 -1542 -2626 -7035 -3738 557 621 -847 -7097 -3694
7854 -3694 -4609 -4490 -4833 -3880 -4303 -1040 -840 -3651 -5209 -322 -171 723 -312 -1031 4093 2163 1415
7837 1415 259 1890 -3359 -7442 -6025 -5377 -3806 -3559 -6537 -7167 -3314 -4511 -10717 -11222 -8928 -1328
7821 -1328 2194 241 -1072 -6516 -2572 2484 349 -2082 -2003 -4216 -5952 -6182 -5379 -3079 -2912 -3861
7805 -3861 -1460 1262 3617 1470 -844 3842 7526 2775 -1423 -23 3476 2773 -458 3095 -1195
7790 -1195 -3624 -2390 -8000 -7131 -266 2456 4470 4516 3015 -3968 -4217 -5002 -1853 -1130 -1356 -1433 -6121
7773 -6121 -6128 -6819 -9435 -13398 -11705 -12507 -13401 -13315 -9538 -8772 -6925 -2424 -412 2815 -3714 -6141 -1324
7756 -1324 -582 -7896 -9126 -6641 -6984 -5118 -1383 -6350 -7206 -2438 -1401 -6860 -7884 -11067 -13771 -8971
7740 -8971 -675 4704 3660 -1683 -2541 -844 -4938 -5781 -8911 -9241 -5464 -985 130 -8997 -13342 -14391
7724 -14391 -12835 -7965 -6794 -9428 -9729 -9582 -7376 -7402 -8512 -9384 -8978 -5352 -814 6796 7459 3414
7708 3414 3065 1422 2443 -920 -751 -2697 -4751 -7400 -8066 -5143 -4702 808 1274 -5704 -12052 -8503
7692 -8503 -3176 -3396 -5461 -6071 -3557 -5072 -9652 -10418 -3555 -1208 -3501 -8246 -5442 -9105 -17353 -17965
7676 -17965 -11280 -7414 -3457 -7079 -13961 -11854 -4154 2487 1186 -3416 -7042 -5611 -3603 -5908 -6420
7661 -6420 -8496 -10839 -13950 -7644 -9813 -16361 -16069 -15350 -16221 -14478 -10837 -13987 -11415 -8216 -8763 -5000
7645 -5000 -7752 -13193 -16269 -10234 -6746 -6857 -7526 -6494 -5671 -3938 -1486 -2733 -5136 -8726 -10756 -9309
7629 -9309 -7744 -8119 -12155 -11595 -7277 -4097 -8769 -3771 -2534 -6137 -6680 -5184 -6441 -6525 -5573 -4115
7613 -4115 -3092 -11086 -14320 -14849 -17351 -15731 -19390 -17014 -15105 -9972 -1013 2552 -918 -5655 -9161
7598 -9161 -15512 -22884 -22964 -16652 -14283 -17651 -13778 -9903 -11317 -12378 -14411 -16921 -13374 -3762 -6669
7583 -6669 -12494 -12286 -13824 -13461 -11001 -13397 -12983 -11816 -10066 -11001 -7513 -4731 -4528 -6031 -5546 -8288
7567 -8288 -12751 -11501 -7232 -8453 -8238 -7429 -4795 -6256 -6600 -4816 -7728 -12511 -14095 -16406 -11437 -7457
7551 -7457 -6552 -6012 -5806 -14080 -15481 -13714 -17791 -12668 -7456 -11333 -14851 -14622 -18612 -17913 -18191 -12986
7535 -12986 -12541 -11769 -10095 -8780 -3166 -5910 -10183 -10330 -12538 -12911 -10514 -5394 -7443 -3919 4749 5402
7519 5402 4199 -1486 -5092 -11633 -12258 -11865 -11439 -11443 -11877 -10889 -11175 -9524 -7333 -7517 -9456 -13158 -14019 -13425
7501 -13425 -11101 -7276 -5907 -6892 -10852 -13700 -10552 -8585 -4169 -2988 -4236 -11223 -14097 -16891 -20659
7486 -20659 -15531 -11324 -8749 -13491 -16341 -17230 -15654 -9523 -9149 -10299 -8951 -10518 -16175 -18139 -10665
7471 -10665 -6899 -6181 -4620 -9285 -8930 -7686 -12899 -18654 -17539 -19410 -18994 -17272 -14676 -9634 -8000
7456 -8000 -11853 -10059 -6379 -8198 -14303 -19770 -21168 -22456 -20305 -18296 -17573 -15128 -13862 -11157 -11296
7441 -11296 -14199 -9331 -7020 -8269 -5726 -2628 -4321 -2434 2931 -1416 -4862 -10735 -9363 -15291 -18774
7426 -18774 -18686 -18651 -15408 -9297 -10332 -16208 -12498 -13275 -17177 -15878 -13555 -13648 -9702 -7916 -5285 -3217
7410 -3217 -3748 -5052 -3718 -6729 -6328 -3280 -8293 -8991 -6219 -3053 -5419 -9507 -9174 -8097 -10642 -10383
7394 -10383 -10267 -8192 -4814 -6680 -9675 -8563 -3564 -1955 -7290 -8021 -4839 -6045 -9038 -8898 -6867
7379 -6867 -4295 -2592 -125 -1260 -2732 2132 4564 2076 -1128 -2523 -3227 -3400 -4122 -5392 -8931 -8686
7363 -8686 -11614 -9236 -6487 -8335 -9911 -11662 -12026 -13116 -15473 -16253 -13190 -8665 -13706 -9521 -6318
7348 -6318 -5180 -5677 -757 -800 -5662 -9757 -10772 -12280 -12407 -13427 -10179 -9205 -9472 -6556 -5752 -5581 -8383
7331 -8383 -8719 -12261 -13063 -7552 -2982 1477 3326 -4681 -8565 -4477 -6648 -8247 -7378 -5412 -3046 -3802
7315 -3802 -4058 -6512 -6967 -8185 -9327 -9426 -3244 138 3135 5077 2180 511 -3586 -7194 -6757 -5148
7299 -5148 -7981 -14295 -16304 -15823 -12843 -4860 -3724 -7201 -7574 -3748 -8251 -7604 -6673 -2687 -6165 -5199
7283 -5199 -6330 -10163 -12364 -14719 -10872 -10758 -9965 -5743 -3902 -4173 -3155 2235 5646 3462 -2711 -3302
7267 -3302 -5688 -4916 -4259 -7052 -1443 -1478 -5081 -4083 -1535 -5455 -8985 -10954 -11520 -10325 -2850 -219
7251 -219 -1414 -4058 -238 -2705 -6619 -4785 -4525 -4297 -4230 -3676 -3829 -2530 -5428 -5417 -6337 -5753 -679 -1235
7233 -1235 -6093 -6054 -4860 -4323 -4660 -4484 -3777 -1318 844 -1545 -2259 -2154 -6799 -7158 -5318 -2653 -5515
7216 -5515 -7060 -6775 -7872 -7433 -10303 -12122 -8789 -13281 -21511 -20307 -11115 -3043 -4823 -5224 -10696 -8748
7200 -8748 -8316 -10401 -10768 -12247 -9568 -10466 -10147 -6021 -8010 -15828 -14130 -12989 -9975 -12271 -15758 -13184
7184 -13184 -6753 -7498 -8197 -8622 -5762 -9478 -9756 -4465 -4602 -4771 -6702 -9984 -9866 -4821 -6265 -10069
7168 -10069 -7818 -7849 -3223 -1764 -2175 -5197 -6685 -6690 -7018 -5477 -6822 -9014 -8161 -11039 -8251 -8806 -12291
7151 -12291 -11419 -7951 -5825 -6698 -6134 -11305 -8362 -1614 -3837 -4374 -8395 -10981 -13920 -9186 -9456 -6398
7135 -6398 -7802 -9570 -6292 -7856 -14369 -15981 -13031 -17209 -15505 -8182 -4086 -6944 -9173 -10668 -9747
7120 -9747 -8360 -6537 -4462 -6072 -5248 -3482 -3393 -2992 -8191 -10039 -6002 -5934 -3656 907 1510 -7103 -12251
7103 -12251 -8746 -7083 -11190 -8275 -3958 340 -5026 -8967 -13266 -13973 -13099 -12637 -11600 -9422 -5430
7088 -5430 -6888 -6133 312 -674 -2365 885 2227 -5429 -8402 -8700 -8132 -7938 -7608 -8750 -3654 -1433
7072 -1433 -858 -4279 -4035 -228 -386 -1121 -6375 -7279 -9309 -7366 -10386 -14540 -14594 -11612 -7629 -7589 -11302
7055 -11302 -13115 -11104 -6709 -1271 -2851 -4731 -6883 -7634 -7211 -10934 -7193 -5281 -5242 -12659 -16312 -13403
7039 -13403 -9309 -3471 -571 1684 -1322 -7152 -4692 -3194 -4658 -5866 -5144 -6351 -3450 -5108 -5271
7024 -5271 -5935 -4689 -4787 -6011 -11029 -12667 -13720 -12369 -6746 -1887 -6523 -4915 -1380 1300 3040 1253
7008 1253 2104 -1962 -2000 -4666 -1041 -3734 -4265 -3124 365 -2425 -8340 -8979 -12109 -14217 -12720 -7083
6992 -7083 -4579 -4583 -3993 -11500 -17788 -18454 -15958 -14264 -6341 -1839 -5196 -5040 -1066 1618 5540 7410
6976 7410 5574 3338 147 -3997 -2950 -7188 -9649 -6963 -8808 -7596 -8021 -4442 -422 -2402 -1629
6961 -1629 -3738 -5361 -6263 -10742 -11948 -8445 -3169 -8887 -11499 -7921 -5462 -1078 -804 -2579 -7214
6946 -7214 -7329 -6482 -6518 -7576 -15379 -18022 -12952 -9198 -7974 -5280 -6243 -5285 -5424 -4587 -4780 -7632 -8393
6929 -8393 -2554 -1547 -3589 -8063 -6554 -1659 -1763 -7505 -11268 -13474 -11785 -9447 -1728 6282 4538
6914 4538 -3964 -7829 -4032 -5602 -9344 -9593 -10414 -10384 -9681 -9993 -7749 -11196 -10866 -3308 -860 -1423 -5123
6897 -5123 -5365 -3077 -422 -2863 -2720 -6941 -4404 -4349 -5386 -4618 -1400 -223 711 2012 3887 -1444
6881 -1444 -6143 -7661 -10613 -7252 -10332 -11905 -11099 -9490 -12116 -10972 -10646 -3916 -131 -514 -290 390
6865 390 1204 -876 -4164 -6650 -10030 -4966 -801 -2122 -1747 1765 615 -6037 -3263 -2217 -3280 -4782
6849 -4782 -5122 -5629 -6108 -5929 -6844 -7255 -6153 -5032 -2074 -6141 -4832 -4751 -6512 -11819 -11999 -9207 -8000
6832 -8000 -5394 -3332 -3664 -3822 -2210 -436 145 -5368 -6488 -2784 768 -260 -2336 -4125 -7017 -802
6816 -802 -4538 -6615 -3559 -2698 -3908 -9057 -10869 -7132 -6350 -6413 330 1390 -2600 -8599 -10388 -8001
6800 -8001 -45 2741 -3927 -9982 -11103 -8615 -5513 -4639 -2888 -5592 -4474 -4182 -6780 -8345 -3289
6785 -3289 -2508 -5536 -9011 -6575 -2862 -5044 -5834 -1160 1207 3182 1286 -6486 -6392 -1211 -1603 1083
6769 1083 2740 2431 4369 3840 8014 7894 1845 -4267 -8835 -6340 -6686 -9500 -12379 -9680 -8443 -12919
6753 -12919 -15671 -15725 -14728 -8124 -8514 -4313 -844 2976 4984 5539 3020 -5589 -1555 -2071 -4829 367
6737 367 783 -5558 -4378 -5891 -8397 -7770 -5336 -5563 -3960 -3853 -4827 -7387 -5631 -5988 -15496 -14257 -10855
6720 -10855 -8237 -11053 -12456 -9837 -9596 -4422 -4973 -5530 2146 2034 1992 -925 -5149 -5578 -5443 -6343 -4588
6703 -4588 -1908 -3250 -3166 -5266 -9081 -9018 -7128 -5932 -4694 -3507 -7335 -11093 -7914 -3399 -341 3111
6687 3111 880 413 1151 -3075 -7691 -3178 -519 -1181 -1703 -2802 -2827 -10129 -12392 -13875 -13678 -14374 -16112
6670 -16112 -15777 -11767 -12078 -6987 -3549 -6412 -3216 3041 3238 2278 6534 4603 2333 -1831 -1610 -390
6654 -390 -3263 -6083 -6158 -6070 -1051 -2887 -3830 -3303 -3701 -2489 -285 -3210 -6683 -5859 -6669 -5886 -2690 -3103
6636 -3103 -1363 -3514 -8648 -5668 -3037 -5918 -8584 -11354 -12696 -6965 -1731 -2223 -5267 -8462 -9896
6621 -9896 -9496 -10189 -11029 -6724 826 3776 3988 4809 4218 3895 3950 -5 -4710 -1809 6880 2508 -2867
6604 -2867 1713 3133 609 -2619 -467 -1473 -583 2859 1978 3231 1875 -645 3312 1334 -3802
6589 -3802 -11424 -12071 -9809 -9189 -5118 -449 4415 6013 619 -7423 -7350 -7137 -3933 -5232 -7089 -6030
6573 -6030 -2951 -5062 -4635 -3888 -5833 -4796 -1917 1679 -2763 -9457 -4583 -2366 -788 -1148 1271 3213
6557 3213 -2268 -4112 -4748 -5733 -2445 2671 6685 7445 4622 4567 3533 -979 3804 7289 9514 10367
6541 10367 18532 27308 23815 18528 19791 19423 16949 12473 6263 -3490 2290 3132 -2672 -3538 -2589 -3228
6525 -3228 -6827 -7486 -5095 -1847 -1042 3565 7609 5348 -1332 -8290 -12849 -12545 -8740 -4500 337 4542
6509 4542 5685 2755 442 -298 -3101 -6309 -2585 -3568 -5505 -6483 -4944 -2563 -1288 -2920 3820 4306
6493 4306 -51 -2220 -6173 -11297 -13049 -9509 -7441 -16647 -19288 -17863 -16330 -11253 -8935 -7563 697
6478 697 10200 9137 5231 4063 -743 312 289 2055 2563 1454 5429 2584 -5089 -7783 -1622 4636
6462 4636 6046 7033 3463 744 -3212 -219 2037 -2568 -4864 -4020 -5173 -6836 -2820 -1823 -1139 -3362
6446 -3362 -3147 -3729 438 7300 6525 5065 2444 -2714 -3003 -845 -814 -3345 -7420 -3931 946 1306 1245
6429 1245 665 -480 -4429 -7911 -9979 -10963 -10080 -6069 -3594 -4073 -4910 -9006 -10305 -10138 -8245 -2547
6413 -2547 -5636 -5684 -2354 -4244 -404 -587 -2274 -3099 -5154 -3551 -1259 -4276 -469 6275 6055 5849
6397 5849 575 -6581 -6015 -2802 -4229 -1608 1445 2230 1554 -2816 -5327 -8762 -7569 -8639 -12184 -6873
6381 -6873 -3318 -2604 -3349 -5610 -5671 -7180 -7736 -9377 -7165 -9631 -13411 -10560 -9029 -10974 -12262 -10133
6365 -10133 -5982 -8336 -9496 -8917 -3115 -1961 -145 -1392 -4218 -1744 -6374 -9138 -8558 -7223 -6001
6350 -6001 -4758 -4123 -3626 -3981 -5772 -4995 -7626 -9532 -8136 -4269 -3370 -6304 -7098 -5965 -5667 -3714 2884
6333 2884 5138 3279 2978 4865 4475 -1043 -6858 -11114 -11852 -8525 -13007 -16572 -11375 -9002 -12541 -12308
6317 -12308 -8186 -6873 -5570 -5859 -5613 -4211 -3640 -3808 -4026 -3525 -1593 -5321 -7559 -4161 811 -1446
6301 -1446 -858 -435 -2099 -1041 -2914 -3111 -791 -1953 -4762 -7042 -5276 -1451 -2159 -2838 1458 1671
6285 1671 1685 1303 1386 -3171 -7038 -10058 -11492 -8332 -7319 -1619 -2048 -5243 -7226 -6897 -10136 -12475 -10575
6268 -10575 -9320 -4818 -709 -2194 -1826 1393 3194 -10 1442 8489 5077 1984 -346 -4770 -6438
6253 -6438 -9613 -8223 -2858 -1369 -1331 -2414 -7656 -3533 -2544 261 -241 0 437 -924 216 3178
6237 3178 -2808 -4317 3266 6087 6024 4473 -4208 -8574 -8471 -4999 -6207 -14446 -16557 -13420 -9869 -12931
6221 -12931 -14749 -10009 -5400 -8993 -10586 -7624 967 945 -3316 -5549 -4879 1114 3742 1719 2324 2160
6205 2160 172 656 -541 1478 2480 -262 -39 1796 -179 -2878 -1859 -1265 -2675 -1969 -1725 399
6189 399 -5357 -9156 -3130 -2240 -2110 -4467 -3708 -2010 -1516 -4819 -5496 -6650 -13187 -15600 -9395 -6547
6173 -6547 -6793 -4899 876 -2795 -6409 -5077 -2113 3808 3380 -259 -694 856 4528 1454 -2899 -3279
6157 -3279 -3166 -2411 -8527 -9954 -13082 -8147 -2104 -821 -1976 -1833 -1425 -1255 -930 -4093 -5153 -2195
6141 -2195 -4071 -724 2048 1891 -2694 -3755 -1586 4582 2209 1957 2949 3673 2873 4386 2303 1527
6125 1527 1507 1562 1682 2888 4759 1184 1025 -1259 2913 5116 5042 -1900 -6837 -9296 -11032 -12354 -8042
6108 -8042 -1896 -123 -2471 650 2260 2423 2856 5350 4563 -149 317 3491 7879 6367 7142 7581
6092 7581 8090 3397 -1610 -7748 -10437 -3293 655 -5323 -6012 -3585 -5287 -3714 -6950 -10352 -10489 -6346
6076 -6346 -1764 4782 4518 1206 -3483 2054 9078 10150 5190 145 -602 -2876 -6335 -3187 -3904 -3973
6060 -3973 -2099 -1904 -885 -1849 -1196 -2489 -2193 -1407 -587 -181 -4341 -5572 -8982 -8669 -20681 -25687 -17548
6043 -17548 -19302 -24300 -17750 -11796 -18625 -18070 -9165 -7556 -8123 -5340 3570 -511 -6821 -8212 -5743
6028 -5743 -5298 -4542 -167 -1163 -3705 115 2393 2884 2141 3860 4341 6228 6330 7463 5857 -765 -5026
6011 -5026 -2865 618 -2437 -1991 -263 409 -3136 -6930 -6446 -2482 -208 669 62 -479 3030 3174 48
5994 48 -1613 -1547 -1634 -2971 -6226 -9596 -10437 -10002 -6977 -4625 -2425 -247 1361 -674 -7325 -8192 -8829
5977 -8829 -3314 2645 6410 7439 1009 1011 2734 4799 -402 -9344 -7168 -2388 3832 2829 3391 2796
5961 2796 3665 6776 5523 3492 -2238 -4404 943 130 -1349 -3235 -1730 -1270 -4344 -5948 -4422 -3893
5945 -3893 -3776 1333 -2112 -7122 -6151 -3054 -4548 -1903 -724 -2011 -2352 1770 3010 -1385 -3482 -524
5929 -524 4901 4750 -1473 -5649 -3447 -6616 -5729 -3955 -2882 -3582 -7917 -3540 4525 2755 -2327 -159
5913 -159 969 2405 152 -3308 933 -3469 -7762 -5147 -3135 -2572 -5264 -7955 -7931 -7954 -1651 -1564 -3227
5896 -3227 170 4786 9487 6375 1286 35 187 2193 719 614 4460 7356 4403 -1941 -3155
5881 -3155 -6444 -2600 4110 3266 3065 4635 3868 618 3031 339 -732 1492 2281 -4018 -7607 -6592
5865 -6592 -5553 -3139 -20 -3318 -8394 -10903 -6939 -6567 -8833 -12039 -10661 -6232 -3146 -6291 -4628
5850 -4628 -4237 -4925 -619 2810 409 -326 -1604 -4827 -3058 174 -1936 -2294 -2577 4158 7422 5862
5834 5862 2458 -517 573 1482 -1206 -978 -536 -4094 -6601 -7626 -8015 -6195 -5230 49 -19 1865 2923
5817 2923 4707 -801 -5725 4139 3816 -1162 -3167 -3775 -6707 -1412 3756 5312 7728 4819 1216
5802 1216 3988 -317 14 4244 6625 1729 992 7722 8309 5689 2554 6279 1511 3215 6395 4345
5786 4345 862 -2569 -2952 -4134 -4148 -871 4030 5879 -2895 -8439 -3636 -5021 -802 5906 6019 1896
5770 1896 1041 4780 6334 8344 5684 -294 -1923 2445 3249 3282 -347 -6451 -3819 -716 -3933 -1228
5754 -1228 3306 6594 5253 5868 5944 4483 4784 3200 302 3141 2416 328 730 3389 1530 -3323
5738 -3323 -5535 576 965 5050 7481 7899 8851 7189 6327 5314 1850 -548 741 2477 4206 4437
5722 4437 -587 -5505 -4782 -2838 -1551 4325 1661 -1779 -475 6174 10983 10243 11183 7929 8030 2953
5706 2953 2297 4584 2794 1798 73 4593 5687 3081 -917 -3332 -1943 -4082 -4433 -1545 12 1716
5690 1716 5371 2521 3292 6393 9451 8568 4969 1584 4314 7232 5507 2343 7714 4564 -4017
5675 -4017 -4221 -4400 -5962 -4637 -1880 -1938 -3324 -2198 -1719 -1258 2594 3538 911 3940 2005 4198 6871
5658 6871 1784 2656 -13 25 5067 6409 3290 -2409 -3845 -3783 -2891 -2967 -1514 702 7289 3917 1981
5641 1981 7332 2948 -426 965 1718 -2738 -5889 1174 4351 5107 5937 5660 -1776 -7680 -8979 -7812
5625 -7812 -5789 -7783 -8111 -3624 -5388 -5138 -7439 -11267 -8439 -6528 -8806 -7600 -5352 -3422 2593
5610 2593 6524 5652 5369 -1426 -2240 2940 3165 1331 -738 -331 5536 7939 7466 6200 8230 6755
5594 6755 6866 8855 10120 7189 7779 7956 6848 9068 6755 586 -3208 -1677 -532 2108 1978 1332
5578 1332 164 -879 -4393 -5448 -2645 -1602 -3386 -5352 -6639 -6180 -3205 -7078 -7092 -2232 2707 5867
5562 5867 7460 7928 6016 1487 -2209 572 4327 2993 -901 567 1251 -1069 -3446 2585 5677
5547 5677 3602 4897 2770 2005 -547 -1884 -3960 -7108 -8626 -2198 389 902 2813 102 743 185
5531 185 3421 4421 2783 -3863 -6746 -3119 -5657 -6051 -1569 3545 5056 3742 28 -1712 594
5516 594 4001 5196 -4823 -9706 -3876 -325 6026 7762 7149 7495 6047 2045 5260 381 2735
5501 2735 2292 3381 562 -1726 -1294 663 2847 1298 3917 1536 -1866 -3335 -1733 636 -2177
5486 -2177 -2335 1392 6008 6324 2117 481 -983 -3766 -5435 -4214 -2257 579 -133 -1935 -2337 4523
5470 4523 6386 5490 6543 3034 -31 -515 1191 -690 985 1357 -544 -1401 1492 -1433 -3137 -3641
5454 -3641 -2012 -3342 -3030 -1986 1707 4855 2800 2032 -515 -2988 -8913 -4773 -1406 564 -2742
5439 -2742 -3377 616 -547 -2128 -4086 3758 9063 6282 6251 5620 -1336 -4918 -4326 -4885 -6402 -7116 -1268
5422 -1268 3970 -1498 -5269 -2146 -141 193 -1875 -6356 -7774 -5102 -2880 1616 5771 6963 7694
5407 7694 -988 -5254 -4076 -5250 -2288 -2563 -4823 -5273 -2227 -2634 -168 1965 5017 4893 1002 -5994
5391 -5994 -8489 -6345 -3770 -2306 381 2501 1706 27 2841 19 2224 1973 1117 -2662 -7188 -7007
5375 -7007 -5594 -6061 -7523 -5044 -1407 -769 -2625 -5020 -5187 1102 8276 7408 6742 3900 3491 6617
5359 6617 2069 -46 6128 9915 7688 4692 919 -1735 -1124 3927 -1651 -3585 -2184 688 3841
5344 3841 5470 3694 140 -4050 -5108 -5288 -3310 -2786 -8194 -11489 -8989 -7058 -4302 -2946 -2620 -2516
5328 -2516 1220 6656 9858 8444 4442 -28 -2320 -5176 -9156 -8223 -7626 -5967 3380 7127 7263 10820
5312 10820 12904 9768 2674 -25 -2069 -3067 -423 2902 795 284 -386 797 3966 1477 -1156
5297 -1156 -2587 -2980 3436 4335 -52 -1027 2147 5480 6476 5670 3552 472 2003 3041 -1179 -2779
5281 -2779 -1932 -1293 -2167 2412 8010 10949 6973 2882 -1830 957 4434 4611 3585 6089 5372 2306
5265 2306 1549 4790 -1311 -8217 -6790 -5094 2309 9472 7160 8573 7058 5930 4600 1025 -1143
5250 -1143 -1893 -5550 -2444 -878 -730 1720 2516 -3236 -222 7619 9319 8108 3120 3166 3956 2720
5234 2720 5235 6553 4099 9220 8648 3289 -1373 1928 2699 3925 2682 676 -202 -2661 750 -532
5218 -532 -3396 -1249 2961 9781 10823 11724 8868 8667 7538 6771 7058 8232 7826 9019 8604 7271 3838
5201 3838 3781 2571 1511 -399 1337 3562 5885 5034 3101 -1109 -1517 363 -2588 -4939 -2354 2665
5185 2665 397 -2495 -3307 5106 5142 -1096 -511 574 279 -116 -3139 -637 -3472 -4447 943 2257 1370
5168 1370 4814 3811 1124 -1436 -1375 391 256 3590 6465 5574 5270 192 2150 6146 10774 11671
5152 11671 9475 10911 10164 7911 1648 -740 -1681 -2830 -4027 656 7736 11753 12808 11630 9212
5137 9212 6018 2867 1914 -55 -1964 -1607 1341 -876 -1150 1455 3507 2392 5270 2603 -3541 -4967
5121 -4967 -4440 -8989 -8482 -7233 -4562 -1873 1043 -2652 1937 10446 10172 5561 1346 160 -1711 4223
5105 4223 5000 7699 6071 2747 2986 907 2223 2787 3116 8657 16771 12707 6181 2729 -13 -2812
5089 -2812 350 2487 -5401 -8407 -4547 -832 -2239 -1066 1381 4297 5629 5431 41 -2550 -3012
5074 -3012 -1444 2641 2974 807 4837 5895 6253 5498 3011 7494 11471 10156 7445 6801 7064 6310
5058 6310 6265 5649 5690 2859 -839 -810 -1540 -3408 354 218 813 -944 -2491 -1281 3727 5686 3541
5041 3541 259 -3426 1845 7633 9250 9220 5546 1796 1771 3854 5348 2123 4070 6064 6619 5084
5025 5084 1283 435 3683 3690 2260 -214 2497 4149 -1392 -2221 -1433 -861 489 296 -701 -2433 119
5008 119 4058 1299 72 719 3320 1405 3010 3388 4098 2369 2560 4021 1632 869 1248 1461 -1238
4991 -1238 -2327 -687 -3502 -6216 -3588 751 62 3114 7252 2785 1211 3519 775 1227 2966
4976 2966 678 -193 2181 3593 3920 4600 5442 4735 1865 530 4376 6055 550 -290 4659 6298
4960 6298 6521 2766 2647 6038 7011 5550 -3823 -1172 2621 1309 -1940 -343 1856 1578 2726 1018
4944 1018 -5766 -6978 -3755 -8493 -10729 -5017 -1592 962 2291 1982 -1614 -4926 -2975 -3980 -1621
4929 -1621 -5103 -4774 -3713 -1742 -1012 -66 2960 7080 5227 1981 1654 2358 1441 6995 7660 1530 -3006
4912 -3006 -5936 -7191 -5405 -3378 -4855 613 4767 2783 -468 -44 3193 4422 622 -964 1866
4897 1866 1738 436 -748 -3714 710 3091 3950 457 -1168 2155 2652 3827 3899 -613 -116 3044
4881 3044 4549 9920 13952 10492 9618 7592 5483 755 -2126 882 3798 5979 6868 5070 804
4866 804 434 2870 5414 5734 5752 3411 3313 3429 8749 8798 7937 4868 1792 2310 2942 1916 2345 2055 3498
4847 3498 4225 3100 5197 7647 8877 6699 10376 5818 5666 8863 6861 3314 265 3006 4485
4832 4485 3483 2713 1349 346 898 -1036 2930 3095 8024 5265 3149 368 -1535 -892 3333 7766
4816 7766 4722 -2907 -264 3007 6253 8119 8032 3543 726 3024 5807 6763 2318 -1725 2585 2660
4800 2660 132 2312 4627 605 117 538 152 2035 5316 9901 8658 3327 -407 4712 6423 5518
4784 5518 3302 7008 6869 4686 6643 9296 9798 9823 5345 -1 -2353 -1931 -851 1123 2626 -1449
4768 -1449 1810 3447 7953 12610 9649 3138 -1139 -637 -2511 -4808 -2953 4096 11969 14649 11942
4753 11942 7034 6256 6588 1456 3285 6728 8928 9553 7470 3775 4664 10125 12210 9351 5048 1517
4737 1517 117 -3904 -4613 -3097 2531 3296 3783 6435 5947 2366 -2530 1471 6481 9505 8046 5605
4721 5605 5473 -232 -2039 90 1379 3642 -682 -11468 -13441 -7472 -1849 -890 -1925 -985 -470 -5308
4705 -5308 -7916 -2936 -956 -369 4075 5118 5420 5823 7572 4039 676 -1756 -5273 -5535 -3531 -4927
4689 -4927 -7111 -7991 -8413 -8462 -2167 -535 1486 1150 -247 146 4361 8263 5376 2426 5147 3145
4673 3145 -2120 -3276 -1108 853 -3048 -176 576 158 -4059 -4659 -6426 -3910 -563 2637 3192 2642
4657 2642 5965 4601 354 -4063 -6286 -8332 -11242 -4685 -2561 -3121 -1371 2978 1150 -505 -3636
4642 -3636 303 6338 6566 2933 1576 2575 1298 1582 3365 -824 -4412 -6074 -2522 887 4210 3815
4626 3815 2809 7373 11092 6125 5867 4544 4069 5431 3598 -1619 -823 1189 6070 7242 3396 2054
4610 2054 6109 3388 5634 5470 1847 2930 5690 2421 -702 -246 -5229 -7275 -5517 -3105 -5598
4595 -5598 -9557 -9834 -9646 -1728 1714 3386 4514 6252 5435 2042 5863 6420 7994 4986 2487 1209
4579 1209 2257 2973 2717 6524 1691 891 4233 2168 678 2336 1456 -3130 -6635 1032 4244 2961
4563 2961 6177 3880 2296 963 4945 12794 11927 10022 4956 -475 -594 1588 2099 2627 1841 5649
4547 5649 9816 6625 4416 5064 3212 49 -668 3526 9393 10892 13330 13531 10961 11496 13988 15710
4531 15710 8319 2377 2310 3055 8569 5747 -297 -3352 -2692 858 825 1239 4663 10340 7979 6541
4515 6541 8305 2376 -1397 -1678 -1768 3229 6615 6109 4422 699 3569 3886 4017 3661 4654 1700 -3439
4498 -3439 -2806 -2125 -2697 937 -1627 -2204 7556 8795 11757 12810 14052 11828 5488 6700 8647 14314
4482 14314 14762 9500 8789 8430 6621 -446 5390 8396 10432 8206 4335 4425 10313 10332 8417 3566
4466 3566 166 1749 27 -3568 -6384 -4785 -5362 1259 3663 181 -135 4783 2685 1389 2532
4451 2532 2745 3660 6163 7398 5864 9267 9694 6951 1885 -4157 -2675 -39 3600 3544 -3046 -5709
4435 -5709 -6277 -6519 -6335 -6358 -304 5333 4636 4137 2719 1660 5408 6572 4179 -205 -258 1159 924
4418 924 912 -1093 -4434 -5511 -6956 -5737 -4862 542 -586 -3662 -1592 -436 1706 7570 8782 6649
4402 6649 -1632 -610 2978 -564 -2270 -6697 -8611 -3302 -4224 -3254 2374 2362 3905 6095 3787 4814
4386 4814 9511 8471 1524 -3308 -6175 -2659 3381 6008 9418 10163 10294 3729 376 -856 -696 4198
4370 4198 3916 6274 5198 8878 8357 8765 12604 12935 9924 7779 3749 7679 14997 15470 11597 9373
4354 9373 10575 10968 10693 10759 8146 3255 1032 3508 7658 9313 11051 6896 5223 4609 5685 6380
4338 6380 7993 10479 10727 9862 12087 7338 3214 4014 6100 7047 10364 8232 5564 -257 1882 -1751
4322 -1751 -4611 -1033 1711 7088 12925 10267 5185 -188 -5148 -3199 -1411 -5779 -6655 -2015 879
4307 879 -924 -1158 -2090 -1449 -1076 307 3265 6010 9947 432 -8621 -7895 -2678 1915 2985 -3541
4291 -3541 556 807 973 2618 6941 4419 1510 4084 7453 12189 11596 9042 9913 12431 13306 11608
4275 11608 5453 4381 4894 -42 -2470 -2556 1786 3578 869 -498 303 1488 -429 -2136 -4525 -6835
4259 -6835 -4206 5643 7257 6418 5869 4484 2166 -211 931 5324 8507 9771 5147 3933 2148
4244 2148 -598 -3243 -3802 2921 6022 5476 5777 1997 -1289 -2124 2195 2876 -534 -711 -812 175 -3875
4227 -3875 -1312 4934 6976 8548 11565 8316 7481 5092 3898 -1978 -6284 -5262 1053 5502 830
4212 830 -126 -2225 -3491 6563 14340 15918 8185 3756 5233 6219 7629 5135 821 912 4647 7849
4196 7849 6082 6633 3962 1676 2565 5074 5374 7282 7167 10223 8068 7294 8214 5804 3177 1427
4180 1427 -1779 -3333 -1928 -1680 -1234 -1235 -2487 -3116 -4791 -4229 -2930 -5360 -2452 570 -2158 -9077 -7108
4163 -7108 1154 -247 -1655 -5160 -6959 -5839 -1534 -1678 -1664 -1394 -4162 -2826 -4047 -1217 3243 8050
4147 8050 6841 3226 5891 1826 539 105 2725 4105 7016 6823 4655 1946 1123 3772 3342 2407
4131 2407 6191 6498 7424 3939 1828 465 -819 330 5100 7628 5019 5015 8819 10169 8725 9609
4115 9609 7337 5206 6772 2655 -3044 4300 7930 7826 6909 7597 4532 948 3130 2237 2644 7798
4099 7798 10486 10689 8065 7257 8203 10955 8580 4777 1047 -8080 -7682 -2314 2479 11919 15350 12496
4083 12496 7645 6293 4398 8560 5952 3415 6713 10293 7713 9835 10341 10084 6681 4145 4466
4068 4466 4625 2144 -1504 613 -1628 1246 8981 10514 7162 9666 11459 9263 5629 23 -1549
4053 -1549 1216 1761 2463 2698 6462 3568 2932 1376 2424 1122 1186 6911 8883 6772 6036 9581 8019
4036 8019 3933 2642 3819 3888 762 -1210 -2936 -4824 -2869 -1899 -3255 -3144 -1922 -3666 -7113 -1602
4020 -1602 -2162 -2065 -1393 1352 2328 1626 8662 15224 11997 10978 9270 9526 9109 8595 6738 7858 6671
4003 6671 1167 1119 1171 -945 -3124 3831 6491 5671 1887 -421 218 4083 4249 2617 723 991 5427
3986 5427 6595 282 -3665 -1638 -1591 -1808 -1661 -4361 -10072 -8825 -4757 -3135 -3236 2527 254 -7568
3970 -7568 -5594 -4721 -6200 -6606 -4803 646 5929 8362 9118 8852 4833 2067 199 -1074 -886 3206
3954 3206 5003 3697 3583 3095 3196 3591 -1342 -1049 -1086 -4345 -372 8008 16465 13942 3418 -3453
3938 -3453 -1082 -334 2715 3129 2800 -1994 -2117 1774 2616 4820 6749 2777 3869 4137 6440 6376 6036
3921 6036 5882 8124 4374 -2349 -938 4791 5459 6980 6871 4214 7 -1527 -3928 -6400 -6249 -2761
3905 -2761 -1958 54 -1097 -4389 -2168 -1733 -3307 545 2677 343 -3410 -4843 -2713 818 1142 -2756
3889 -2756 -288 4189 4433 2025 3835 6626 6727 9510 11467 11230 10293 7696 4357 6044 6247 6359
3873 6359 9216 8690 6323 7747 9140 8293 4723 6123 7485 9343 7334 3231 735 -3951 -3573 -4331
3857 -4331 -3699 -2487 -325 4202 2489 1406 2604 2554 -442 -4548 -7158 -3851 -2237 -606 5538 8035
3841 8035 12508 3811 3070 4622 4410 6482 8418 7849 6614 5784 3143 5000 2891 2095 3645 -3301
3825 -3301 -5200 -1547 -735 -5532 -5412 -1836 -571 1527 1716 92 2151 2872 -644 -2475 -8321 -7310
3809 -7310 -457 3583 3288 2096 3073 1845 1137 -3148 -3630 -3990 -125 1910 3872 2164 3078 1124
3793 1124 12 2881 4088 1150 2352 3495 1244 -2181 2559 4430 6376 9811 5202 2641 5735
3778 5735 6244 10452 15340 15397 12931 10422 2730 -617 -1446 -2771 383 492 3102 7128 5284 6857
3762 6857 5970 -2566 -3267 1954 -247 -5421 -1224 714 -539 859 1124 -793 -2489 704 697 -56 1040
3745 1040 87 -1761 3033 5773 5098 7666 10154 11206 6676 2011 1712 4219 7831 6552 8509 12918
3729 12918 11342 10723 13121 8001 1713 151 -620 5758 10070 14520 14561 12118 12087 14815 18432 13340
3713 13340 6659 2978 -2397 -3058 -2805 -868 1352 1863 5072 5629 4455 -1623 2197 4365 -40 702
3697 702 3140 -486 816 -2019 -4494 -6372 -5502 -3168 -5166 -5673 -3665 415 2504 -13 -107 -1477
3681 -1477 -5091 -6085 -4880 -2211 -2159 -4837 -5271 1245 -3752 -3582 -704 -2534 1330 3140 1702 -27
3665 -27 745 -6868 -8691 -5176 -1586 167 1407 4705 8463 11261 10922 6069 7461 9271 7953 5605
3649 5605 3842 3772 4024 5020 5277 3514 -527 -2869 4003 10091 6710 5140 2439 -4145 -9598 -12160
3633 -12160 -11087 -3420 1492 5952 3385 195 1244 5836 9515 6685 5290 5565 7809 6920 11214
3618 11214 9134 9029 8099 13283 12984 13762 14469 11590 12770 5806 602 2793 4551 3356 2026 418
3602 418 -257 963 1173 5819 6593 4182 5208 1348 2050 5572 5640 8934 7856 6714 8239 8769 9182
3585 9182 6080 -1532 -3452 -5587 -3419 -731 4090 5934 3908 1441 -2342 -8203 -11478 -7042 -4746
3570 -4746 -3620 -29 -623 -2084 -3359 1142 1276 -1850 -2937 -606 -647 -290 1932 2464 2467 195 -384
3553 -384 -552 2316 1821 4482 3359 7255 11187 9848 10033 6299 6051 3961 -214 87 2286 4672
3537 4672 7378 7719 6273 5443 4691 2171 3757 11308 6562 3415 -655 -923 -3824 -1347 -3265 -5292
3521 -5292 -2258 -16 -103 2884 -597 -2089 -2077 -612 3063 1197 -591 -4671 -5438 -264 8407 12010
3505 12010 9560 9028 12140 7105 781 671 1024 3756 6254 3914 1981 4164 3968 1270 -764 3159
3489 3159 6754 8792 10434 9526 7346 2365 -3536 -4023 -1010 -1782 1481 751 -562 -1750 -4903 -8325
3473 -8325 875 4677 4345 -591 2373 3030 817 -4381 -10333 -6097 -255 3458 1445 -2953 364
3458 364 1122 -339 1330 -3539 -3211 -1058 -1137 47 -1233 -5996 -3946 294 -1228 388 3546 6006
3442 6006 5987 2575 -1258 -1792 2533 94 -2871 -3364 -1718 1156 3864 4693 1932 2411 4990 4011 -535
3425 -535 -2161 -5023 304 -104 1414 3417 -1285 -2670 -1467 167 3447 5538 4593 1234 -1346 -1074
3409 -1074 736 508 -1737 1153 4808 2755 5873 6727 5433 2052 241 -742 2026 6050 4389 4178
3393 4178 2863 1439 1422 6926 12236 10106 13447 10955 3047 -367 -3855 -2764 -1673 1404 4178
3378 4178 1600 -800 -3528 -2394 -2123 242 -603 -2385 -1696 3719 7970 4599 6 -2497 -618 2186
3362 2186 -3124 251 7584 8166 8467 15424 13099 12268 5824 4221 6808 4082 1971 1362 -1453 2127
3346 2127 752 4979 3161 -536 2236 6866 6583 4974 5595 6865 8088 7356 5445 4796 4717 973
3330 973 -2303 2435 5907 3291 -3191 -1592 1814 1634 -161 308 1259 3015 4664 7030 10738 8301
3314 8301 4718 3655 6188 8897 7375 2897 4753 6985 7058 4866 3518 2733 354 -1971 -1671 -3731
3298 -3731 -5976 -9934 -6117 -1196 2138 7300 7941 7017 8270 14316 13285 9044 7612 9909 7158
3283 7158 -424 -1140 1656 588 -2033 1791 5403 7941 8371 8317 6562 2939 -1449 -234 2019 5010
3267 5010 6311 4958 7549 2788 1902 -993 -3831 -1453 310 1643 569 -1364 -3254 -8487 -8424 -5097
3251 -5097 2324 -1334 -1730 6139 6461 4369 4881 8185 7510 2904 36 -4985 -437 5577 4588 5554
3235 5554 10569 7186 4155 4896 5601 4631 2424 3862 6499 8436 3240 5134 5296 5199 10338 9520 8241
3218 8241 10414 12703 9462 6403 655 240 -1127 -836 736 1850 2610 1406 2938 3743 3767 2514
3202 2514 2744 1495 -3828 -5859 -6022 -5529 -6869 -3647 -2095 -2843 -666 571 -1036 2937 4611 6004
3186 6004 7511 6802 1912 654 6645 7526 7003 6196 2138 2764 6993 10949 12607 10759 4949 7258
3170 7258 13000 11192 5445 5029 6338 1991 -413 471 1239 1771 488 5137 3515 -3693 -2838 1470
3154 1470 2953 2468 2590 7983 7212 3973 4344 5663 4109 7589 11260 13699 10598 8453 6531 8325
3138 8325 3756 2143 3840 3089 4501 7563 11633 14562 13206 10486 9498 5113 976 1255 4154 1445
3122 1445 -1044 -3804 -227 5036 3445 -919 -2898 -3339 -9997 -10712 -6294 -6598 -4321 -663 1501 536
3106 536 -3176 -4818 -4887 -4198 -3467 -6923 -6017 -4238 -1746 -3161 -7403 -9449 -6823 -5291 -1702 -304
3090 -304 -817 -2791 -3592 3705 6161 8101 7635 7511 10984 11165 11149 3407 2267 538 -1408 -331 -1754
3073 -1754 1556 7522 6951 6061 6649 3302 4175 6481 7140 3242 489 1951 7 -2379 -2637 -3811
3057 -3811 -841 3836 5118 -1041 1595 3302 -354 -4821 -5044 -1949 13 1855 4142 4437 3681 2567
3041 2567 263 4587 7242 6389 -3751 -6374 -4215 -1593 1246 5225 3999 6072 8296 9412 8276
3026 8276 3811 125 1964 -921 -5136 -3069 -467 4397 5472 1172 3248 9031 7201 2547 3176
3011 3176 4809 12936 14886 11363 10426 9777 7389 4929 5151 9533 13897 13095 5444 2426 -1621 -5364
2995 -5364 -7874 -5735 -3608 -718 4033 7816 3938 -1312 3262 7423 11149 13045 13341 11320 10924
2980 10924 12240 9261 3728 -2247 -3789 5408 10162 7744 1532 -1250 -960 -1235 -245 -464 461 3187
2964 3187 3047 6157 10676 11048 6026 1830 -1595 -5894 -4946 -4626 -12108 -12731 -3291 2177 5352 5231
2948 5231 7517 4780 8071 7170 5287 3501 4977 3542 2538 2656 2251 1241 -923 -1088 3304 4531
2932 4531 2931 -575 2702 751 -1274 552 -2594 -6050 -3339 1686 967 4021 8099 9667 8552
2917 8552 7787 9009 3950 1836 5315 3956 304 -3537 -2483 1191 1665 -404 -4167 -3928 49 1398
2901 1398 551 -3088 -860 2369 5492 2986 2263 49 1824 4191 2093 1244 4355 5211 8466 6409
2885 6409 5744 3484 5117 3726 2475 -229 -1540 1775 5441 1791 1612 4098 1128 2037 5166 5001
2869 5001 2995 664 5420 4507 914 4210 8939 6646 -32 -2914 -2570 -921 -1735 740 2611 545
2853 545 -1463 -3755 -5220 -4872 -632 1320 2519 2427 3268 3129 4835 8318 12139 13821 13420 6107 7432
2836 7432 14477 10683 3273 1539 5312 9246 7944 1743 -6973 -8183 -5991 -3083 -22 7454 9757
2821 9757 8391 -1486 -20 4296 4685 -3432 -4329 -763 -2939 -8215 -9891 -10304 -6162 -5288 -5894 -10491
2805 -10491 -8088 -7334 -8313 -1174 -2335 -5295 -1595 -984 -2974 -4074 -4767 -1456 184 2900 2749 2074
2789 2074 2117 2360 1862 591 1445 6989 6782 7953 -1642 -7035 -1165 3604 3987 4840 6235 1845 -2766
2772 -2766 -2873 899 1651 -663 -2860 -8298 -9006 -5599 -7802 -4155 -1847 1422 2745 6969 7965 5867
2756 5867 8492 5498 -2903 -5184 -6291 -3793 -854 -2822 -6008 -4862 -3472 2041 6409 1671 1795
2741 1795 -4059 -5860 -4082 -3355 -673 5597 1823 971 1152 -1035 -1775 1536 963 1882 339 467 180
2724 180 2680 4814 2871 903 2652 5815 4793 6281 3258 996 1630 3474 4511 6313 10877
2709 10877 10426 10652 8749 7963 3439 57 3166 5019 4125 2469 4342 5401 5291 436 -4552 43
2693 43 5863 7742 3165 1252 -72 -279 1414 4995 6423 964 -50 -533 512 3220 4015 2806
2677 2806 -4631 -1260 493 -3482 -7683 -5889 -5263 -4044 -6743 -4511 -2917 3861 1052 2075 2453
2662 2453 7878 8992 4986 -443 2087 2344 -1609 -4060 -2553 -836 4286 5120 6576 3450 -2076
2647 -2076 296 -1930 -974 -161 -2327 -3941 -379 439 3700 5986 5000 4164 666 -1587 1995 11037
2631 11037 11255 5337 1136 5565 7191 6716 2815 -2876 -4000 -1855 -755 -2614 -2519 -6803 -6616 -5010
2615 -5010 -4751 -6238 -7044 -8220 -519 1983 1257 2446 4707 7328 6959 6465 1864 1766 4991 2956 6317
2598 6317 12251 14389 13214 9461 6235 6725 6483 5343 3097 1215 36 -5377 -5349 -2543 13 -1325
2582 -1325 -1307 996 3577 6798 8077 6302 6024 5647 3957 5552 6529 7422 6419 7953 6174 10046
2566 10046 11225 11343 8714 7008 7627 1506 4654 9852 12543 11604 5892 2946 1164 -3204 -2801 1377
2550 1377 6877 10712 11599 5410 -756 -4274 -9832 -12674 -7812 -7196 -3956 -4198 -3141 -45 2482 3491
2534 3491 5750 9200 10928 12853 8696 12185 17418 11080 4305 3022 4311 10173 13625 14253 16353
2519 16353 13513 8369 8327 8951 5266 -2933 -2426 1653 2574 -87 1374 3751 5387 2440 8374 8018
2503 8018 900 -77 -994 1048 3936 6669 3628 1160 -2198 -1223 -471 104 -598 720 955 677 -621
2486 -621 6 1277 703 4518 8039 6328 3048 1587 1453 3747 5615 3771 7352 9796 12424 7984
2470 7984 2839 1127 3669 6763 10234 7489 6380 8174 9100 5164 -458 -4144 -6504 -5894 -3886
2455 -3886 -1620 -176 1716 6938 7632 6595 4832 2350 4335 -1268 -6719 -4030 -1632 -2890 -5299
2440 -5299 -4423 -4273 -4551 516 886 4019 7112 7020 4377 2747 -730 -1570 -2232 -3770 -1457 859 259
2423 259 -2004 -5733 -1719 2244 3941 5209 5881 4525 7199 6536 10051 7342 2302 640 -323 2204
2407 2204 2596 3064 1103 74 3205 2652 634 854 635 1736 -362 -871 2068 4122 5172 5996 9177
2390 9177 10970 11857 7559 4865 -4238 -9920 -5315 3199 2969 374 287 -1472 -2067 -994 6005 2772
2374 2772 -1111 -3336 -6369 -10270 -14408 -16001 -15207 -10194 -1435 -2824 -2324 2809 637 -5366 -5137 -7200
2358 -7200 -6346 -4688 -5048 -8032 -7306 -4410 -3028 -1507 747 2031 9207 10606 2599 -1465 -5206 -4219
2342 -4219 -1549 1010 -2762 -7775 -7521 -4774 -2216 -1999 -633 11 -1227 240 1087 3759 7271 10444
2326 10444 8222 3574 -711 -681 -840 -1061 2201 5175 6902 7499 6440 4094 5592 4454 -2727 -2268
2310 -2268 3088 2769 2684 2520 -2449 -7718 -7063 -3369 5971 7136 4186 1146 -237 5322 7345 2485
2294 2485 -311 1013 -2927 -4029 -3017 -886 4440 7911 8630 4633 575 1074 6897 11254 10163
2279 10163 10844 10664 10677 5577 3488 7480 9147 8536 8587 4536 1606 4360 4704 -1453 1373 2369 669
2262 669 3439 5006 5016 4919 3785 1251 1832 2321 -1127 -3791 2186 4406 484 1265 320 -430 -5963
2245 -5963 -5870 -3601 -3754 -6413 -6407 -381 3367 4214 2213 -568 -4156 -6814 -2091 1827 7608 7516 5203
2228 5203 3251 959 -41 -1806 3933 3046 3325 4760 4746 4074 7031 10587 8793 8568 4905 1633
2212 1633 3046 4923 13461 16132 14339 11106 6425 2129 161 8778 10469 6364 1680 3907 6358
2197 6358 7309 7458 -906 -2202 -1834 3602 4357 5258 -2255 -5655 -4955 -3814 -4723 -3787 195 1447 4463
2180 4463 4056 1215 4111 7054 8986 894 -6572 -4710 -430 -1176 -2553 -951 416 -3045 -1634
2165 -1634 2322 469 -2498 2792 6385 2599 690 2960 1644 -58 -1813 789 2030 -898 -3796
2150 -3796 -1580 -2966 -1581 -1712 -6225 -4170 -3395 -7982 -11713 -8813 -8670 -10196 -10131 -6197 1258 4347
2134 4347 5028 43 -5425 -10729 -8325 -2868 -2761 -2321 -3396 -597 4362 7577 7840 7335 4059 4369
2118 4369 6127 2482 -1938 -2436 2257 -232 -1727 -1347 1800 441 2395 3869 2038 4771 5326 3728
2102 3728 3535 1013 4046 5060 270 -5076 -7264 -3317 1604 4227 3766 2373 3357 6382 7772 4852
2086 4852 118 -3548 2418 3756 -992 -325 3082 4858 6113 1795 3047 2475 -1894 -2912 -5231
2071 -5231 -558 2316 1621 3219 -1082 -3252 -3223 -7299 -4252 -122 -2461 -4576 -4874 -1576 -1040 -2436
2055 -2436 -3153 -3318 -4010 3117 849 93 5589 10963 7017 1787 2303 -537 -1002 -2668 -5276 -7645
2039 -7645 -4647 -954 751 3996 7849 4054 1755 4161 267 3025 3526 3356 5415 2713 6147
2024 6147 3740 -2350 -7585 -8337 -1800 129 1138 -3723 944 6353 6250 6119 5353 5008 1366 -4264
2008 -4264 -5636 -8130 -6534 -6655 -6944 -3797 160 -882 -4714 -6339 442 4459 1034 307 1162 3763
1992 3763 8211 9230 8035 4659 482 -198 0 1170 3089 -1627 -4321 -3292 557 2611 208
1977 208 -1927 -977 541 2321 -1329 -4219 -7441 -7499 -10644 -11820 -5074 1383 115 -4539 -8671 -3893
1961 -3893 -4289 -3842 -865 1531 3425 4939 5377 1157 1389 2220 -1862 2503 3145 2118 6445 10376
1945 10376 2956 -889 -1271 1670 1386 -6670 -6638 -3103 453 650 -1159 -978 2834 4101 4126 6332 6152
1928 6152 5810 5791 5519 3163 4019 4278 6346 10552 10190 7539 5771 3520 2177 -4022 -4636 -2739 -3768
1911 -3768 -2412 -2811 -2267 3392 6975 4532 116 -5018 -5500 -501 -859 -6633 -7460 -3101 -1912 30
1895 30 8727 9107 3329 1571 455 2724 -927 -4434 1916 3767 474 -3362 -1664 685 955 1168
1879 1168 6227 6635 7064 6950 1823 6492 8387 5179 7647 7190 6071 4535 -1823 -3964 -691 3561
1863 3561 2180 -404 -547 -1709 -3986 -2193 -1764 3625 -171 -1603 -1739 -1870 1032 168 -71 -5647
1847 -5647 -7699 -5200 -434 6485 4808 3842 -346 -2890 -1853 -828 1902 -2527 -5832 -12567 -13766
1832 -13766 -11067 -8100 -4990 -4523 -5120 -981 3803 8124 1779 -3432 -5294 -4818 -1099 611 -1192
1817 -1192 -2664 -2018 1570 4869 3830 3020 -645 -1467 -5654 -6805 -2645 -1287 -6042 -8915 -6992 -6206
1801 -6206 -4687 -3589 -3475 -2852 -2767 -478 -1202 -4047 -4769 -157 -189 -1652 2867 2342 -2661 -4341 -5187
1784 -5187 -2526 594 197 -2228 -3047 -2075 671 -1058 729 1369 -501 -6571 -2168 205 -1365 -2688
1768 -2688 1756 -498 -3314 -2936 -3719 -3306 -1045 -2470 -1093 -955 -5184 -3231 -1647 -5555 -7786 -8289
1752 -8289 -3286 -2317 -2860 -1683 -1376 -958 -1266 -526 -1841 -6660 -6285 -10725 -12639 -8866 -7744 -7641 -3246
1735 -3246 -3697 -5039 -5406 -4541 -3197 1881 5865 2203 1126 -260 4336 8864 6656 1698 2095 625
1719 625 -215 4362 6560 5216 6273 4937 6331 5371 985 176 -5388 -9679 -6393 3816 9450 11247
1703 11247 7534 3994 3515 2566 212 -942 2590 772 -676 1016 -1485 -4105 -1961 -2410 -5492
1688 -5492 -9651 -7206 -3599 939 4091 2283 1198 2179 1345 -199 1253 -3250 -8877 -5472 -1958
1673 -1958 -705 1521 710 -3050 -5922 -7048 -3625 -5420 -1614 2187 -319 -1255 1327 5421 4857 4204
1657 4204 3320 2422 -5406 -8619 -3095 -2067 -6823 -6067 -4165 -5246 -7409 -8158 -4280 -4372 -6305 -5569 -4662
1640 -4662 -5835 -9135 -14643 -13407 -7628 -8849 -6773 -6088 -5102 -7535 -5094 -3104 -4896 -2553 -3213 -6127
1624 -6127 -705 2011 2936 2232 1824 -249 -5182 -4222 -2968 -7608 -9071 -9227 -5888 -4757 -5477 -3809
1608 -3809 -3187 -3464 -5940 -8077 -4237 -3445 519 3966 1148 -4407 -4461 635 334 4659 5840 3697
1592 3697 3084 1727 -1429 -3672 343 1207 -4876 -8311 -3322 3307 7165 5980 5798 4061 -2211 -1851
1576 -1851 -46 334 -4981 -5928 -4624 -4205 -695 -2149 -465 -24 -3369 -4182 -2022 -722 2094 -2087
1560 -2087 156 1669 -2231 2698 3461 950 684 -4006 -790 751 2247 3012 522 -1870 -796 1848
1544 1848 -48 -1693 -1480 -2212 -2788 158 5688 4445 381 329 -2801 -8617 -14468 -9985 -452 -1424
1528 -1424 -3563 -3800 -3015 -1750 -340 2271 227 -4278 -7242 -8843 -7878 -5975 -2208 -1994 -2516 -5481
1512 -5481 -8292 -9230 -5578 -1167 1591 3167 4459 4513 4439 3658 1625 -734 757 4579 3780 -3121 -4167
1495 -4167 -3678 -4980 1426 6168 5107 438 -1452 -629 6790 9432 6640 370 4982 5558 3905 6789
1479 6789 4421 -1571 -7188 -5465 -2529 -5129 -10677 -11743 -9825 -6811 -700 239 2695 2141 3761
1464 3761 3901 1487 92 1262 -3920 -11660 -9997 -7214 -7870 -6971 -7148 -9677 -7844 -5345 -2978 -595
1448 -595 -1603 -158 -4753 -8660 -2752 -562 -170 -2680 -4866 2124 4222 628 -780 -582 -7082 -11196
1432 -11196 -9538 -6702 -9068 -5963 47 1111 -5203 -6780 -10498 -12616 -13644 -11367 -7850 -2153 -1448
1417 -1448 -575 421 -4248 -7358 -6397 -5674 -5355 -5255 -3596 -6600 -10259 -12749 -14372 -13887 -8719 -3560 -269
1400 -269 4269 2918 -1815 -2664 -2044 -3689 -7031 -8685 -4532 -2328 -3624 -4024 -2625 788 116 -1905
1384 -1905 -4999 -6964 -9106 -9681 -12214 -4220 -6843 -7141 -7467 -9375 -6746 -6829 -6611 -2170 -1550 847 -589
1367 -589 1265 2881 -2942 -6301 -7601 -10112 -7698 -8691 -7088 -7773 -9941 -3947 186 3429 7126 4980
1351 4980 3775 -2345 -11339 -9804 -7764 -969 2106 -3301 -4086 -2032 -2734 -5180 -7312 -8588 -5804
1336 -5804 -3042 -782 -545 1145 1635 3305 1893 -3731 -7590 -4999 -4233 -29 1600 3389 2361 1347
1320 1347 2441 3044 -1327 -5848 -6475 -6767 -9191 -7294 -3118 987 -569 -1259 -3634 -1557 -4582 -10185
1304 -10185 -7355 -5548 -6297 -2766 -1041 3035 4560 931 413 4952 3789 3924 -2718 -4047 -3813 2412
1288 2412 4445 6669 6261 1235 -1201 -5498 -5659 -4625 -8318 -5787 -2577 -6108 -11436 -11659 -8779 -7659
1272 -7659 -4880 -1557 -3094 -6128 -9478 -4912 -3959 -3590 -6579 -9576 -12548 -10661 -6870 -4624 -6137
1257 -6137 -4893 -2548 -1205 -1640 -5643 -7803 -5859 -2689 3419 1517 -5436 -6475 -4639 -7840 -5377
1242 -5377 -4373 -5214 -6713 -1989 3067 4555 4856 1946 650 -2955 -1532 -1747 3897 9391 8736 3085
1226 3085 -2132 -2266 2518 3098 -2741 -641 2917 2386 3706 2176 -804 -7214 -5824 -2497 -4447 -2562
1210 -2562 -1561 -2370 -4533 -742 662 -611 -3983 -1774 3448 -1805 -2313 -3303 -5972 -6505 -7940 -6235
1194 -6235 -2399 3090 5833 1053 -5366 -3025 513 -1491 -3563 -2319 -2519 -783 -2038 -8981 -8541
1179 -8541 -284 -1070 -5813 -10012 -6187 -6162 -4259 2085 2777 784 -799 -2334 995 -2813 -9978 -5946
1163 -5946 -1690 3600 2695 -4529 -12390 -18718 -18639 -12690 -7405 -2673 -3587 -3717 -5208 -6913 -8554 -2215
1147 -2215 -530 1093 5429 9822 3873 -1899 -3698 -1281 -2459 -4117 -7928 -12919 -13269 -13271 -7383 -5927
1131 -5927 -11806 -13057 -12063 -8805 -5890 -2653 396 -3057 -6149 -7442 -11327 -3876 -2169 -4350 -885
1116 -885 384 -110 -1688 -4008 -6019 -7647 -2075 -439 -2160 1799 915 -2888 -5463 -6783 -5910 5
1100 5 4851 3404 0 -4027 -4079 -3862 -9268 -6424 -4001 -7607 -12684 -11452 -6645 -7354 -6177 -1070 2642
1083 2642 -3177 -1860 508 -245 -1862 -7260 -7336 -8260 -9158 -9305 -11422 -12270 -6773 -9100 -12917 -10297 -9610
1066 -9610 -12220 -8802 -4266 -3896 -4288 150 3168 -1731 -1690 -4306 -8016 -9156 -4069 -4901 -8723 -9755
1050 -9755 -9158 -5182 -6651 -5039 867 -4410 -11219 -12303 -14186 -16098 -11094 -3657 -2294 -4860 -6025
1035 -6025 -5767 -2822 -2628 384 2554 -995 -5488 -5192 -5242 -7764 -10080 -12811 -13146 -6657 -356 -477 -1540
1018 -1540 -3026 -8046 -11368 -10744 -8339 -4939 -1799 180 1021 -1990 -8153 -8790 -8661 -7157 -8543 -8511
1002 -8511 -6722 -6905 -6919 -7538 -4693 -1323 -2256 -3840 1617 1957 -1421 -2788 -3891 -3221 2624 4275 3479
985 3479 2291 1434 -1179 -2231 -266 -1161 1418 -140 -51 -3690 -1805 942 299 -2736 -5000 -2526
969 -2526 -3100 -951 1846 -681 -3203 -8215 -5336 -2991 -742 -2586 -4478 -1626 931 -314 -1393
954 -1393 -2038 1931 -852 -2964 -384 1869 1389 -3321 -2914 -1389 -2195 -4655 -7858 -6611 -8062 -11735
938 -11735 -5929 -1901 -2233 -2814 -1771 2124 1296 -4187 -2654 -1756 -4163 -5123 -8173 -7904 -7254 -8603 -12058
921 -12058 -13367 -12677 -16235 -14500 -15154 -18029 -12277 -5735 -5362 -11515 -9949 -8932 -6754 -1286 -1024 -4194
905 -4194 -10489 -7868 -6397 -6612 -8417 -9903 -9173 -7299 -4918 1730 -240 -3861 -3635 -2385 -1931 -2504
889 -2504 -1639 2105 5485 5440 4900 -3693 -9282 -7224 -7587 -8012 -3273 1965 1534 -1099 -711 -728 -262 711
871 711 339 965 3414 5622 2961 -1928 -3082 -3950 -4329 -8536 -11047 -11003 -12521 -11286 -8850 -4298 -5166
854 -5166 -6134 -8058 -12850 -14485 -13875 -10496 -9170 -7901 -6876 -11798 -15527 -15151 -14091 -12821 -11047 -11676
838 -11676 -13487 -11580 -9435 -9025 -9320 -5938 -5769 -7966 -10233 -11825 -1594 291 -6903 -9194 -9784 -9344
822 -9344 -4595 -9818 -10650 -8828 -7430 -6933 -12671 -15576 -13208 -13418 -9323 -7290 -10770 -8384 -2503 -6418
806 -6418 -5478 -2828 -229 -1643 560 -1615 -572 1203 -1496 -2190 -3325 -4682 -7276 -6456 -4940 -6218
790 -6218 -4873 -2221 -4412 -5878 -3759 -3066 -2271 -2791 -7586 -7223 -7630 -5891 -7034 -4905 423 -1469
774 -1469 -4405 -8492 -9004 -8751 -5208 -1146 553 342 -1772 -4542 -6778 -6023 -5617 -5564 -5856 173 2304
757 2304 2263 453 -938 -1528 -5554 -6941 -6891 -10071 -12372 -12688 -13376 -11902 -10549 -10007 -6790 -8207 -12859
740 -12859 -12618 -14506 -13224 -10818 -8617 -6429 -4872 -6491 -5497 -3266 -1675 -1541 -1406 1473 -613 -3185
724 -3185 -4797 -3073 -3187 -8693 -11273 -6374 -3434 -1533 -2105 -5060 -3681 -2560 -3332 -3734 -1869 -529
708 -529 -1245 -3385 -7374 -7136 -9287 -5091 -1550 -1812 -4750 -13084 -17816 -14123 -11744 -11243 -15575 -14374
692 -14374 -10955 -7996 -6717 -6623 -7447 -4882 -3271 -8476 -13121 -8736 -10509 -11394 -11043 -5252 -5288 -6017 -5993
675 -5993 -6300 -3763 1977 -1406 -5370 -7891 -7974 -6192 -7257 -3362 -1723 2172 1455 -3961 -9293 -7556
659 -7556 -7381 -8161 -5985 -11870 -11919 -3125 399 939 -2049 -4245 -734 222 -8301 -12326 -7816 -5066 -3352
642 -3352 -5884 -3019 -2111 218 -1780 -2301 -2039 262 3522 1806 -2410 -2660 -2176 -4531 -2159 -2440 -1798
625 -1798 -1861 -2200 -2879 -8910 -10005 -10265 -8211 -10643 -7305 -12356 -16239 -16162 -14954 -13191 -9366 -6412 -6062
608 -6062 -2866 -108 -6194 -10198 -13298 -12836 -9951 -10477 -8218 -5399 -4037 -10675 -11006 -7364 -11220 -11556
592 -11556 -8576 -11612 -9751 -8262 -7643 -2542 -4233 -7755 -4402 -8788 -11855 -9846 -3508 -3062 -2976 60
576 60 -240 -2367 -6345 -4317 -3465 -8375 -7740 -6084 -468 -870 -7967 -10658 -7640 -7577 -6204 -5832 -7720
559 -7720 -9012 -6326 -4840 -660 3221 -966 -2218 -2918 -6013 -6879 -10109 -13330 -12279 -7309 -5066 -2592
543 -2592 -10685 -7439 -4759 -5232 -2890 -4430 -2692 -3989 -3486 -8252 -11977 -10706 -13456 -14648 -15203 -14724
527 -14724 -12055 -6505 -3211 -4558 -385 -3264 -6834 -2754 4404 1179 -4855 -6026 -7003 -9255 -10593
512 -10593 -9386 -14220 -14451 -11698 -11078 -9181 -9293 -7234 -8444 -5927 541 1399 -3216 -1615 -3247 -6444
496 -6444 -8563 -4242 -7374 -9900 -6189 -4492 -1072 1965 -66 899 -5567 -7965 -14184 -12005 -8942
481 -8942 -4951 -1943 -5410 -4894 -9710 -8339 -7640 -9525 -9231 -8970 -7337 -6680 -10175 -16053 -14499 -15245 -11019
464 -11019 -10371 -11530 -11238 -11688 -8627 -7584 -9927 -7473 -5745 -4188 543 214 -1560 -4969 -3901 -5901
448 -5901 -5171 -9784 -7214 -9706 -12166 -9532 -11127 -9183 -8926 -9898 -13157 -12342 -8529 -8088 -7354 -5219 -8979
431 -8979 -8365 -4836 -4648 -3747 -2920 -2762 -2884 -5515 -9851 -8114 -3324 -5449 -6733 -4845 -1173 -1558 -7060
414 -7060 -9764 -8596 -9975 -8886 -9044 -8705 -9526 -8353 -9735 -12155 -9119 -9993 -12877 -15048 -12406 -9131
398 -9131 -4296 -3610 -5006 -11614 -15101 -12422 -9671 -11100 -11092 -5679 -4338 -7076 -6708 -10193 -14631 -16921
382 -16921 -15847 -15474 -14125 -12037 -8165 -7127 -5566 -2161 -4001 -6586 -9466 -8464 -10814 -12208 -12364
367 -12364 -11904 -7946 -7033 -4590 -7034 -8366 -9166 -7448 -4015 -3412 -5582 -4028 -4926 -7099 -6757 -8032
351 -8032 -10584 -7697 -11025 -12125 -6819 -4241 -3863 -1684 -5510 -9494 -11370 -14615 -13085 -13749 -10200 -4578
335 -4578 -8496 -14635 -14738 -9333 -7096 -5172 -598 -2325 -4251 -3304 -1103 -1698 -4625 -2740 -3426 -5869
319 -5869 -2196 -951 -3879 -7682 -7357 -8749 -10112 -7502 -6429 -8016 -4339 -1200 -8336 -14209 -13228 -12422
303 -12422 -9308 -5835 -6727 -10024 -3538 -905 -597 -2814 -7735 -11674 -12477 -10955 -4547 -4673 -8562 -12050
287 -12050 -9942 -7330 -2704 -6227 -6188 -4979 -6889 -7612 -5951 -3177 -1206 -2753 -2691 -2512 -3894 -7892
271 -7892 -4841 -3310 -4363 -9827 -14622 -11202 -2756 -1825 -5693 -7128 -5979 -8282 -8209 -9693 -9877 -9417
255 -9417 -8445 -10292 -12034 -9038 -5367 -6403 -6645 -4968 -4996 -5662 -6017 -6760 -10674 -12814 -13189 -12916 -8595
238 -8595 -2741 -4789 -10511 -10998 -7170 -9642 -14368 -11659 -11531 -13179 -12301 -11215 -13180 -8590 -4201 -4639
222 -4639 -4341 -3636 -6806 -6433 -7184 -5288 -319 667 -1286 -3543 -896 -2287 -7737 -8772 -9640 -12382 -13610
205 -13610 -8744 -3758 -3705 -4209 -9234 -11256 -8405 -8852 -8369 -5430 -8389 -8654 -10879 -6872 -4642 -5514 -8929
188 -8929 -11244 -11508 -11089 -10687 -14416 -15744 -16368 -13542 -10851 -4614 -4823 -10922 -10427 -10037 -13127 -16166 -16811
171 -16811 -10996 -9627 -8178 -5312 -3388 -6353 -7660 -9239 -9748 -9174 -5810 -6608 -9168 -7425 -6557 -5743
155 -5743 -3573 -5098 -2999 -1961 -1639 -2425 -6550 -6384 -3599 -4214 -3585 -399 -1402 -3800 -5485 -4659 -2186
138 -2186 -2595 -3419 -10048 -11366 -9039 -9255 -8476 -10118 -12139 -14156 -14886 -14980 -15608 -14812 -10623 -15045 -15917 -13008
120 -13008 -12817 -9892 -6618 -4959 -7915 -12557 -14648 -14948 -14011 -11507 -11882 -12256 -11492 -8360 -7296 -8721
104 -8721 -8120 -8323 -12932 -16094 -12649 -10171 -3890 -4346 -7793 -10853 -9763 -11076 -10405 -9957 -11038 -9145
88 -9145 -9260 -16061 -20266 -20257 -17813 -14778 -14530 -13092 -9542 -9471 -13569 -17183 -17222 -12642 -11092 -10665 -7965 -5786
70 -5786 -5863 -7622 -10257 -11395 -9985 -6876 -2965 -3809 -6299 -7854 -9010 -10302 -8720 -10180 -11954 -11288
54 -11288 -10014 -7467 -3594 -2459 -1483 -2438 -3397 -4102 -6543 -6884 -8750 -12398 -13174 -9891 -9312 -8429 -12102
37 -12102 -13319 -13438 -13144 -10129 -10904 -11563 -9736 -7052 -9792 -11222 -11702 -10505 -9897 -9670 -10375 -10127 -8426
20 -8426 -9328 -8678 -3028 -1247 -3150 -7994 -12568 -12842 -8166 -6048 -4642 -5899 -8143 -5019 -5240 -11019
4 -11019 -9674 -5824 -5547 -9759
0 -9759
$$ Imaginary data points
##PAGE= N=2
##DATA TABLE= (X++(I..I)), XYDATA
32767 -35037 -30972 -28979 -27517 -27610 -29535 -29576 -26780 -25402 -21929 -20012 -19029 -21527 -21206 -22017 -22118 -18531
32751 -18531 -14586 -12648 -11832 -12907 -18583 -19176 -14205 -11993 -12796 -12210 -10033 -10611 -9967 -12293 -9263 -8023
32735 -8023 -5844 -3533 -1482 2569 3868 6196 8116 9835 8276 9597 9485 8760 7336 8827 13972
32720 13972 14727 14368 11096 9942 15390 18601 18880 19620 20911 21409 22657 23057 23453 24331 25896 26929
32704 26929 25982 25879 29362 32011 30687 31906 34650 36090 35427 32540 36532 46252 46094 43674 45456
32689 45456 45137 44557 44793 49565 51741 52274 54238 54176 54703 59223 59928 57853 57034 54381 52905 55454 59094
32672 59094 61567 60974 62306 62519 63019 66443 64888 62837 66090 67703 69951 72779 70019 67118 68963
32657 68963 72940 74833 74805 74930 77999 80590 83466 82550 81081 82976 82369 82753 82411 86751 87160 85672
32641 85672 90050 92802 90444 90948 93017 90508 88890 93956 93177 92397 92165 92039 94567 94023 94015 94819 94830
32624 94830 98559 105409 104834 102984 105895 107251 109134 110336 107109 107523 108169 109749 113118 112196 113110 115666
32608 115666 119692 117925 114263 112651 115421 117802 120897 118193 118155 121252 125517 128956 128565 130336 130477
32593 130477 126529 127684 131239 132447 131750 134412 135009 134648 133724 134871 136717 139017 139480 140408 139693 141218
32577 141218 140453 138290 142095 141018 142567 143236 144301 146805 148637 149002 147965 148016 149734 152255 148017
32562 148017 148628 151321 154366 154440 152757 149096 150730 155305 155698 157739 159813 161652 162025 162184 163214 161510
32546 161510 160715 164090 167304 166748 165764 169022 165266 161670 160845 158911 159067 163606 163842 160495 160338 165788
32530 165788 174156 175333 176428 176209 177961 184780 185301 180456 181713 182273 180644 178824 182006 185161 186305
32515 186305 186302 182721 183127 186758 185055 185702 192099 192860 188555 189399 196436 197801 193070 194713 194018 194447
32499 194447 194932 195896 192106 189444 189336 191006 195068 196643 197056 196630 195481 195924 197736 202213 207350 208353
32483 208353 209129 207875 207189 209742 205006 203712 202226 204252 209047 204219 201912 204394 204077 206718 211588
32468 211588 210135 209290 209865 208679 209648 210476 210662 215173 220954 220745 221003 227821 224779 217971 216442 213932
32452 213932 210773 210311 210683 215538 219531 218887 217599 216266 217006 215332 214428 215748 221448 228162 230365
32437 230365 227767 226084 226160 228577 222514 224697 227403 230040 231754 230702 228818 231623 231978 232991 236726
32422 236726 239112 236417 231733 228563 230756 232243 233501 229573 229232 232916 237409 242679 244169 241058
32408 241058 236582 235085 237489 240346 241147 241046 242559 242676 241186 238950 243818 243003 242720 237891 229516
32393 229516 228660 229571 233686 239553 242224 242604 245283 246837 244052 241900 248991 248787 246343 244454 247564
32378 247564 253617 253575 250838 241807 238127 242680 246655 249343 249229 250255 251163 254019 248284 245421 252712
32363 252712 254029 256581 256959 252632 251241 256666 258733 253916 247463 246539 249668 251524 250419 248732 248380
32348 248380 247900 250500 250286 248147 251639 256927 258158 257682 255084 254859 258063 266829 267856 261976 261907 260609
32332 260609 260970 261358 264875 264289 264301 262772 267179 269656 265304 263014 262203 260005 262594 267230 263527 258204
32316 258204 252834 252467 257039 261613 264897 263535 259287 255668 260165 264024 263840 263793 262327 262718 265117
32301 265117 262748 261020 264633 269836 268414 268606 266763 269624 268166 267601 267290 266296 267083 267136 267379 269553
32285 269553 269904 270746 272819 271280 268880 267330 267830 271072 273136 272441 269694 271382 277039 276802 272271
32270 272271 269189 268598 269931 270487 269780 269576 273392 271409 264444 262059 269469 274280 270852 272402 268550
32255 268550 267149 269689 274655 276508 277056 278120 279700 279587 280380 280712 281138 278728 275939 274723 276342
32240 276342 272097 271916 280168 279636 275061 275030 274877 271251 272067 269174 268282 270723 271258 273475 277201 282482
32224 282482 287422 288097 282228 277040 274235 273204 275137 282036 285235 287102 287815 289739 289689 286723 282188
32209 282188 285666 289752 287400 283245 280575 279052 274936 275947 279037 282729 283433 282749 277957 278652 281187
32194 281187 280997 279794 278164 277555 276757 275779 273588 275241 280577 276574 273882 278741 282104 281820 281588 280888
32178 280888 285261 288590 284797 286079 288721 288973 282772 281315 284474 286702 285895 290559 289140 288834 286228
32163 286228 286757 286326 283820 280152 278682 280418 284301 285946 281357 274671 274104 281018 291385 291490 288017
32148 288017 288621 286342 279393 278696 280262 282507 284855 287313 289337 292483 293810 293619 295676 294391 290300
32133 290300 283834 278911 280476 284864 287271 291013 296340 295337 292108 289195 284235 282481 284242 289027
32119 289027 289953 283643 281388 284157 286586 287131 284495 285770 283429 279608 277553 280331 285455 292426 298453
32104 298453 295046 294726 292241 289432 286827 287724 285268 282663 285122 289124 290217 289878 288455 286573 287969
32089 287969 291763 290359 288316 282037 280468 281549 283596 286437 290433 293579 290583 289292 288922 290138
32075 290138 295236 292337 292578 293266 293038 289757 290790 288579 288034 288031 289366 287323 289579 287243 286354 285890
32059 285890 281470 285023 287784 284550 282606 281027 280800 281927 283476 285259 289898 289844 289244 289402 289235 289087
32043 289087 291939 294799 290947 285489 285491 285866 287290 287185 288196 288624 288412 287132 287285 289153 288329 288067 290042
32026 290042 288701 285614 284809 285915 291290 294186 287681 282570 284281 284353 283318 280853 279929 288303 290482
32011 290482 286652 288987 289390 291286 294320 293372 293107 294901 293471 292295 287516 285523 289079 294656 294523
31996 294523 294417 292472 291541 289896 291669 293493 294906 297359 298790 298360 295967 292403 291650 289667 288179
31981 288179 285131 282489 285561 285720 289513 291191 289882 289188 285016 282479 282131 290316 289593 289240 293659
31966 293659 294348 292361 292180 292507 297055 293927 287328 288805 287957 288714 289004 289772 291355 291528 291342 289198
31950 289198 290970 294629 294271 289438 289399 291498 295483 297126 292590 287470 287610 287808 285227 286179 288457 288023
31934 288023 289467 290977 287637 284764 283393 283631 294159 297319 300801 298249 294775 297899 297839 293049 290271
31919 290271 286691 287176 287467 285926 292093 293853 293692 296482 298341 296407 295277 292261 291184 292237 290747
31904 290747 289714 285960 290815 292894 294676 292715 290450 291544 294860 296013 297115 295461 290266 285067
31890 285067 281034 283623 286886 292282 292121 289623 289195 289454 290727 290245 295306 296780 296083 293711 289373
31875 289373 291087 295664 293635 289708 287706 292524 293549 293856 296015 293287 291038 290946 294191 291632 293405
31860 293405 294352 293729 289074 287472 288018 291979 293137 291645 289801 295082 298234 291623 287363 287157 288625
31845 288625 286898 289232 294933 298953 299128 297791 299390 296674 292182 288967 288925 290284 289896 290633 289288
31830 289288 285420 283786 287067 290060 288023 282874 287269 289685 289369 291352 295763 297054 299834 301885
31816 301885 301072 300492 295530 290871 289145 290833 291294 290367 287841 288466 288441 291917 293841 293453 288292 286840
31800 286840 286804 284559 286620 287867 291952 291536 291381 294672 295851 294768 289241 293310 296990 299440 300101
31785 300101 297461 295399 291206 288090 291120 287764 289093 289691 289766 290665 292297 294422 290027 288364 292510
31770 292510 294548 293183 292259 292735 290032 290114 287983 287715 293201 293492 299066 302983 298432 293202 291169 286988
31754 286988 288133 286450 285654 288661 288199 292199 298815 297151 296579 298167 295322 292453 294009 295056 297622
31739 297622 296454 293748 294551 293443 289392 293801 298545 297963 294546 289629 289364 289379 292558 294815 294272 295010
31723 295010 300018 303897 301239 292981 294006 297413 295649 293706 296826 297584 294741 294928 295524 295349 293725
31708 293725 290714 293018 294268 293870 294097 295950 299725 298719 296922 293539 285379 283178 287470 285887 286547
31693 286547 286279 290299 295154 290334 292647 293883 296513 300562 302905 301574 302361 306317 299285 293685 292885
31678 292885 292213 287694 285295 292142 294268 293589 295504 296101 288350 286263 289422 293881 293196 292202 292728 292747
31662 292747 293872 299035 301250 295514 296165 294436 289478 292358 294404 293269 298665 302584 303105 302557 298799
31647 298799 296521 298905 294881 294895 294058 294209 293915 292769 294890 293053 292019 294022 295018 292218 288980 289499
31631 289499 292026 291462 291488 289977 290434 289692 290936 287255 287334 291895 295004 296460 292834 292680 293296 295341
31615 295341 295808 294360 296157 297112 293688 292089 293515 292611 294026 301317 300053 292501 291097 295320 297715
31600 297715 297333 296982 293709 299600 304520 308426 305464 298186 296468 294441 290563 293360 294128 298532 298422
31585 298422 294187 289073 288122 291723 301311 302782 298579 298681 297869 296400 296246 294417 293982 291367 294049
31570 294049 296013 295695 291354 287758 284428 282445 284420 288964 289034 292289 296144 292163 292802 295035 291331
31555 291331 291414 291972 293071 294245 295258 297224 296286 297506 301867 300714 301175 302298 304019 301940 298744
31540 298744 298627 296956 299245 293495 293283 288204 286379 293496 297346 296686 300088 306134 306453 305410 305988
31525 305988 304246 300745 299693 298660 296124 296138 296269 296763 293370 285133 278492 280485 286793 290390 293583
31510 293583 295834 298393 297055 291084 293962 291407 290465 294532 293897 296828 301392 300158 294845 292429 294834
31495 294834 298474 298050 296251 296322 294102 297879 299448 297139 291247 291868 292773 291899 294567 296058 297164 298754
31479 298754 294665 293000 298119 300195 296574 294165 300908 303422 298673 300545 299432 295774 297006 295368
31465 295368 294045 294259 291960 292819 297856 301838 305453 298600 292373 295379 296440 296714 294647 292256 293340
31450 293340 291593 295200 292560 289888 293802 297673 296891 295617 295771 297628 297388 296272 299508 299562 301942
31435 301942 302237 303111 301558 302285 301827 300360 301261 300930 300247 304313 302784 299664 299611 301822 304466 303819 299996
31418 299996 295754 293586 295816 294354 295215 294728 297004 297935 294701 291049 295378 294535 297488 297902 293777
31403 293777 297326 298167 297354 299629 298502 293421 287932 290355 298256 301788 298129 297418 299667 300454 299465
31388 299465 303470 303555 296005 291874 295814 297824 295899 296512 296108 296167 298800 298312 297271 293334 293597 298151
31372 298151 306152 310499 309729 308050 304229 298518 300486 300006 296006 296615 297001 295592 297123 300739 299471
31357 299471 297433 295663 297042 295892 297426 300799 301348 300028 298277 299524 300028 301084 296693 294650 297942
31342 297942 295604 295514 294856 297887 301433 302049 302582 306027 305594 298085 293007 295409 300683 300575 293725 296510
31326 296510 297728 298940 297736 297622 299964 299522 296374 296051 298153 303113 306591 298708 296225 298012 295980
$$ [...]
##END NTUPLES=NMR SPECTRUM
##END=
