##TITLE=Analysis number 316093
Compound Code cc 26824
Book Reference 461/18
Project Code adrs
Chemist Name toml
##JCAMPDX= 6.0         $$ Bruker NMR JCAMP-DX V2.0
##DATA TYPE= NMR SPECTRUM
##DATA CLASS= NTUPLES
##ORIGIN= Bruker BioSpin GmbH
##OWNER= NMR
$$ XWIN-NMR		Version 3.5
$$ Thu Dec 15 15:10:14 2005 GMT Standard Time (UT+0h)  MAYBRIDGE\NMR@NMR_250MHZ
##.OBSERVE FREQUENCY= 250.131544655141
##.OBSERVE NUCLEUS= ^1H
##.ACQUISITION MODE= SIMULTANEOUS (DQD)
##.ACQUISITION SCHEME= undefined
##.AVERAGES= 16
##.DIGITISER RES= 18
##SPECTROMETER/DATA SYSTEM= dpx250
##.PULSE SEQUENCE= zg30
##.SOLVENT NAME= CDCl3
##.SHIFT REFERENCE= (INTERNAL, CDCl3, 0, 16.522)
##AUDIT TRAIL= $$ (NUMBER, WHEN, WHO, WHERE, WHAT)
$$ ##TITLE= Audit trail, XWIN-NMR		Version 3.5
$$ ##JCAMPDX= 5.01
$$ ##ORIGIN= Bruker BioSpin GmbH
$$ ##OWNER= NMR
$$ C:\u/data/dgb/nmr/ADRS/13920/pdata/1/auditp.txt
$$ ##AUDIT TRAIL=  $$ (NUMBER, WHEN, WHO, WHERE, WHAT)
(   1,<2005-12-15 15:09:14.29 +000>,<MAYBRIDGE\NMR>,<NMR_250MHZ>,
      <created by zg, POWCHK disabled, PULCHK disabled
       configuration hash MD5:
       62 19 C7 07 E1 42 D1 B7 37 6C 3D D0 77 39 F9 E6
       data hash MD5: 64K
       13 3F 9F 52 06 58 08 8F 74 8C 5B D9 CC 3A 5E 0E>)
(   2,<2005-12-15 15:09:37.07 +000>,<MAYBRIDGE\NMR>,<NMR_250MHZ>,
      <Start of raw data processing
       ef LB = 0.3 FT_mod = 6 PKNL = 1 SI = 32K 
       data hash MD5: 32K
       2D C3 81 1A B9 53 92 88 81 8D B1 8E 06 20 E1 18>)
(   3,<2005-12-15 15:09:43.23 +000>,<MAYBRIDGE\NMR>,<NMR_250MHZ>,
      <apk 
       data hash MD5: 32K
       DC D3 00 99 C7 82 98 07 07 70 18 CC E8 E5 27 66>)
(   4,<2005-12-15 15:09:44.99 +000>,<MAYBRIDGE\NMR>,<NMR_250MHZ>,
      <abs ABSG = 5 
       data hash MD5: 32K
       A2 28 9F 53 B1 B7 22 C6 26 AA 9B C0 FB 4A D4 0A>)
$$ ##END=
$$ 
$$ hash MD5
$$ 69 C8 65 BE E7 AF E0 B4 47 17 D7 F1 30 1E B4 17
##$RELAX= 
##$RELAX= 
##$RELAX= 
##$RELAX= 
##$RELAX= 
##$RELAX= 
##$RELAX= 
$$ Bruker specific parameters
$$ --------------------------
##$DU= <C:\u>
##$EXPNO= 13920
##$NAME= <ADRS>
##$PROCNO= 1
##$TYPE= <nmr>
##$USER= <dgb>
##$AMP= (0..31)
100 100 100 100 100 100 100 100 100 100 100 100 100 100 100 100 100 100 
100 100 100 100 100 100 100 100 100 100 100 100 100 100 
##$AQSEQ= 0
##$AQ_mod= 3
##$AUNM= <au_zg>
##$AUTOPOS= <32 >
##$BF1= 250.13
##$BF2= 250.13
##$BF3= 250.13
##$BF4= 250.13
##$BF5= 500.13
##$BF6= 500.13
##$BF7= 500.13
##$BF8= 500.13
##$BYTORDA= 1
##$CFDGTYP= 0
##$CFRGTYP= 5
##$CHEMSTR= <none>
##$CNST= (0..31)
1 1 145 1 1 1 1 1 1 1 1 1 1 1 1 1 1 1 1 1 1 1 1 1 1 1 1 1 1 1 1 1 
##$CPDPRG= <>
##$CPDPRG1= <>
##$CPDPRG2= <>
##$CPDPRG3= <>
##$CPDPRG4= <mlev>
##$CPDPRG5= <mlev>
##$CPDPRG6= <mlev>
##$CPDPRG7= <mlev>
##$CPDPRG8= <mlev>
##$CPDPRGB= <>
##$CPDPRGT= <>
##$D= (0..31)
0 1 0 0 0 0 0 0 0 0.06 0 0 0 0 0 0 0.0002 0 0 0 0 0 0 0 0 0 0 0 0 0 0 
0 
##$DATE= 1134659352
##$DBL= (0..7)
120 120 120 120 120 120 120 120 
##$DBP= (0..7)
150 150 150 150 150 150 150 150 
##$DBP07= 0
##$DBPNAM0= <>
##$DBPNAM1= <>
$$ [...]
##$SUBNAM7= <"">
##$SUBNAM8= <"">
##$SUBNAM9= <"">
##$SW= 20.6930455092707
##$SWIBOX= (0..15)
0 0 3 0 0 0 0 0 0 0 0 0 0 0 0 0 
##$SW_h= 5175.983436853
##$TD= 65536
##$TD0= 1
##$TE= 294.16
##$TE2= 300
##$TE3= 300
##$TEG= 300
##$TL= (0..7)
0 120 120 120 120 120 120 120 
##$TP= (0..7)
150 150 150 150 150 150 150 150 
##$TP07= 0
##$TPNAME0= <>
##$TPNAME1= <>
##$TPNAME2= <>
##$TPNAME3= <>
##$TPNAME4= <>
##$TPNAME5= <>
##$TPNAME6= <>
##$TPNAME7= <>
##$TPOAL= (0..7)
0.5 0.5 0.5 0.5 0.5 0.5 0.5 0.5 
##$TPOFFS= (0..7)
0 0 0 0 0 0 0 0 
##$TUNHIN= 0
##$TUNHOUT= 0
##$TUNXOUT= 0
##$USERA1= <user>
##$USERA2= <user>
##$USERA3= <user>
##$USERA4= <user>
##$USERA5= <user>
##$V9= 5
##$VALIST= <valist>
##$VCLIST= <CCCCCCCCCCCCCCC>
##$VD= 0
##$VDLIST= <DDDDDDDDDDDDDDD>
##$VPLIST= <PPPPPPPPPPPPPPP>
##$VTLIST= <TTTTTTTTTTTTTTT>
##$WBST= 1024
##$WBSW= 4
##$XGAIN= (0..3)
0 0 0 0 
##$XL= 0
##$YL= 0
##$YMAX_a= 966765
##$YMIN_a= -961764
##$ZGOPTNS= <>
##$ZL1= 120
##$ZL2= 120
##$ZL3= 120
##$ZL4= 120
##$ABSF1= 16.522
##$ABSF2= -4.171173
##$ABSG= 5
##$ABSL= 3
##$ALPHA= 0
##$AQORDER= 0
##$ASSFAC= 0
##$ASSFACI= 0
##$ASSFACX= 0
##$ASSWID= 0
##$AUNMP= <proc_1d>
##$AZFE= 0.1
##$AZFW= 0.1
##$BCFW= 0
##$BC_mod= 0
##$BYTORDP= 0
##$COROFFS= 0
##$CY= 12.5
##$DATMOD= 1
##$DC= 0
##$DFILT= <>
##$DTYPP= 0
##$F1P= 14.0000005364418
##$F2P= -0.99999901652339
##$FCOR= 0.5
##$FTSIZE= 32768
##$FT_mod= 6
##$GAMMA= 0
##$GB= 0
##$INTBC= 1
##$INTSCL= 1
##$ISEN= 128
##$LB= 0.3
##$LEV0= 0
##$LPBIN= 0
##$MAXI= 10000
##$MC2= 0
##$MEAN= 0
##$ME_mod= 0
##$MI= 0
##$NCOEF= 0
##$NC_proc= -2
##$NLEV= 6
##$NOISF1= 0
##$NOISF2= 0
##$NSP= 0
##$NTH_PI= 0
##$NZP= 0
##$OFFSET= 16.522
##$PC= 1
##$PHC0= 93.36212
##$PHC1= -9.547753
##$PH_mod= 1
##$PKNL= yes
##$PPARMOD= 0
##$PSCAL= 4
##$PSIGN= 0
##$REVERSE= no
##$SF= 250.13
##$SI= 32768
##$SIGF1= 0
##$SIGF2= 0
##$SINO= 400
##$SIOLD= 32768
##$SREGLST= <1H.CDCl3>
##$SSB= 0
##$STSI= 32768
##$STSR= 0
##$SW_p= 5175.98343685301
##$SYMM= 0
##$S_DEV= 0
##$TDeff= 65536
##$TDoff= 0
##$TI= <Analysis number 999999
Compound Code 99
Book Reference 9
Project Code 9>
##$TILT= no
##$TM1= 0
##$TM2= 0
##$TOPLEV= 0
##$USERP1= <user>
##$USERP2= <user>
##$USERP3= <user>
##$USERP4= <user>
##$USERP5= <user>
##$WDW= 1
##$XDIM= 32768
##$YMAX_p= 449098428
##$YMIN_p= -312565
$$ End of Bruker specific parameters
$$ ---------------------------------
##NTUPLES= NMR SPECTRUM
##VAR_NAME=  FREQUENCY,     SPECTRUM/REAL,   SPECTRUM/IMAG
##SYMBOL=    X,             R,               I
##VAR_TYPE=  INDEPENDENT,   DEPENDENT,       DEPENDENT
##VAR_FORM=  AFFN,          ASDF,            ASDF
##VAR_DIM=   32768,         32768,           32768
##UNITS=     HZ,            ARBITRARY UNITS, ARBITRARY UNITS
##FACTOR=    0.157963299565203, 1,           1
##FIRST=     4132.6476996994, 0,             0
##LAST=      -1043.33573715361, 0,           0
##MIN=       -1043.33573715361, -312565,     0
##MAX=       4132.6476996994, 449098428,     0
$$ Real data points
##PAGE= N=1
##DATA TABLE= (X++(R..R)), XYDATA
$$ [...]
16886g084n449j921L591M490l373L698M041L947O552L152j691M956l703p989m188
16871i71J233K286R05J982o122j455N6L832l472j155m029k305M144k005J761O866
16855A551K289o846l51j948L298N853k075m814n413L896K761j73R10j0977p022
16840a9061P84P463P366K254m099n682O338O378o301n268M7J257L618q724k256
16825a5886P947Q134N781R82j836n421l17n09p296n45j179M749k5n738n71L183
16809h547n53J0757P757L22l063j222K542j866o815K229n83N716J353n574O067
16794H520L471j331o376q564m176o52m366M997N269Q644N379m238p623p195N542
16779b699M666k537n571j268L946L962M66j660k992j772k982o156N00R801k624
$$ plain form
16886 -7084 -12533 -14454 -10863 -6373 -9746 -6048 -2007 1940 8492 11644 9953 14909 11206 3217 -971
16871 -971 262 2548 3453 5435 -687 -2142 -2086 1746 -1726 -2881 -6910 -9215 -5071 -7076 -5315 1551
16855 1551 3840 -3006 -3357 -5305 -2007 3846 1771 -3043 -8456 -4560 -1799 -1972 -1062 -12039 -19061
16840 -19061 -18277 -10814 -3448 -1194 -5293 -10975 -4637 1741 -4560 -9828 -9781 -8524 -4906 -13630 -15886
16825 -15886 -7939 195 5976 6958 5122 -299 -616 -1125 -8421 -8966 -10145 -5396 -5421 -11159 -11730 -8547
16809 -8547 -9100 1657 9414 9736 6673 5451 7993 6127 -688 1541 958 6674 8027 2453 8520
16794 8520 11991 10660 4284 -4280 -8456 -9108 -13474 -8477 -3208 5436 10815 6577 -1046 -8241 -2699
16779 -2699 1967 -570 -6141 -7409 -3463 499 965 -695 -3687 -5459 -8441 -14597 -14097 -4296 -6920
16764f920m69j048L857M890nl645O258K590j615p754r83l33K757k527n679k798
16748a3424N563J973R04M729N190j201O537j415l219j207Q6k786r858j545J584
16733h089J309J916k60k598r09J54j825j550M478M375k615l421N593J0019qO10
16717G179j0337k271J778Q172O042n56l838n901m205M38p608l842M824N679K062
16702b384L35N624l232m023M320J568k454j610L168J466m828q119j832P413L845
16687g43m17j449q85K734j964k747N522J976o462r649m207L409M75Q137j798j228
16671i296O473J468n561J348j415j3094l3O161m20L025L228P552M851r222o466
16656a1401n37K503p347r83J1719L583K068l297O790M77M688J501m636m694p892
$$ plain form
16764 -6920 -7389 -8437 -4580 310 305 -3340 2918 5508 3893 -3861 -4844 -5177 -2420 -4947 -10626 -13424
16748 -13424 -7861 -5888 -4984 -255 4935 3734 10271 8856 5637 4430 4516 1730 -8128 -9673 -8089
16733 -8089 -6780 -4864 -5124 -7722 -8631 -8477 -10302 -11852 -7374 -2999 -5614 -9035 -3442 6577 6569 7179
16717 7179 -3158 -5429 -3651 4521 10563 10007 6169 268 -3937 -3499 -11107 -14949 -10125 -4446 -2384
16702 -2384 -2049 3575 343 -3680 640 2208 -246 -1856 1312 2778 -2050 -10169 -12001 -4588 -743
16687 -743 -1160 -2609 -3494 -760 -2724 -5471 51 2027 -4435 -14084 -18291 -14882 -14407 -6270 -8068 -9296
16671 -9296 -2823 -1355 -6916 -5568 -6983 -20077 -20110 -13949 -14369 -11344 -8116 -564 4287 -4935 -11401
16656 -11401 -11938 -9435 -16782 -17765 -6046 -2463 -395 -3692 3098 3575 8263 9764 5128 434 -7458
16641g458k469J708N525N212L693o978m175Q116N402o195j397K641M23q123k631
16626f706M476J658M596j295L594j40l173q07n625j613M340J305k915J799Q536
16611H030k140p757n704P114K932J887J2051K006n285k335j0228m885K672j137
16597b779N697N433K059l295M850L128k677n649J198N030j977J656M927q993k683
16582E925J371L137n908m333K536O45k082l304J727l215j985J195J283K718P45
16567D55j108o648l451k726n83N665L177Q591L649n623j2133n766J2328O316O000
16552H143K102L859l93k610J465o712m496K599N677M968j636j039l978o947j094
16537i2O588O067m23M530k023m193j2924m186K509O717P33O365L42q38o77o436
$$ plain form
16641 -7458 -9927 -8219 -2694 2518 6211 -767 -4942 3174 8576 2381 984 3625 4048 -4075 -6706
16626 -6706 -2230 -572 4024 2729 6323 6183 3010 2203 -3422 -5035 -695 610 -2305 -506 8030
16611 8030 5890 -1867 -7571 -457 2475 4362 16413 18419 13134 10799 571 -4314 -1642 -2779
16597 -2779 2918 8351 10410 7115 11965 15093 12416 6767 7965 12995 11018 12674 17601 8608 5925
16582 5925 7296 10433 4525 192 2728 3373 1291 -2013 -286 -3501 -5486 -4291 -3008 -290 455
16567 455 -653 -7301 -10752 -13478 -14061 -8396 -5219 3372 7021 1398 -10735 -16501 -4173 2143 8143
16552 8143 10245 14104 13711 11101 12566 5854 1358 3957 9634 14602 12966 11927 7949 1002 -92
16537 -92 6496 12563 12140 16670 14647 10454 -2470 -6656 -4147 2570 3303 9668 10010 9172 8495 2059
16521B059j063j733r62L079O08l176j092J0464J580m264m272J666N066N219N507
16506A8686m363m042n298q108j015M133J170O561Q92Q36j499m295j278k205J539
16491A714N481L493l346j210Q18M994j447l515j019l432L725k292k186j028q997
16476h247l476j064k305L452L612K921p66n84l759J43J921O772L591m548j1828
16461a4165p6M141K437n560m62M149J584l10J719P26k45J02J040J809o776O644
16445c243J2423j864l073N8k584O057M977j943m252k82J663o967j445m897L426
16430a946M144n2k681m788K600N509j668q04J861l584l314l347O080N857l133
16415G34L840r92p367j314J505K506L117P57n619p019p092k909K450K612R468
$$ plain form
16521 2059 996 -737 -1699 1380 1988 -1188 -2280 8184 9764 5500 1228 2894 7960 13179 18686
16506 18686 14323 10281 4983 -3125 -4140 -7 1163 7724 8616 9452 7953 3658 2380 175 1714
16491 1714 7195 10688 7342 6132 6950 11944 10497 6982 5963 2531 6256 3964 1778 750 -8247
16476 -8247 -11723 -12787 -15092 -11640 -8028 -5107 -5873 -6457 -10216 -10073 -8152 -1380 2211 -2337 -14165
16461 -14165 -14241 -10100 -7663 -13223 -13685 -9536 -7952 -8262 -6543 -5817 -6062 -5960 -4920 -3111 -9887 -3243
16445 -3243 9180 7316 4243 4301 1717 7774 12751 10808 6556 6274 7937 970 -475 -5372 -1946
16430 -1946 2198 2146 -535 -5323 -2723 2786 1118 314 2175 -1409 -4723 -8070 -1990 3867 734
16415 734 4574 3582 -3785 -5099 -3594 -1088 2029 2786 -2833 -9852 -16944 -19853 -17403 -14791 -5323
16400e323L666m878k045K657L255O769K101j62n136n112M656L026J812j761J311
16385D836k208j326p259k758K185J639R970K88o909j814m565L426O13n354m748
16370a3984K140M889k788O064j266J255N869L216k195K764K055j650n123J016
16356B262M082p706j1254j741K524n30M833K672l51j594K777K005J873n683n250
16341a1081O077P022P315K698k88L304J2p65r731n013k347j687m376n21J922K977
16325d482R992P908o892j4946L327N125k545O03m028n252k338K595M829M075m51
16310b480j034K718J893n809k626J1084J179p795p391j472L053L156L487j908
16296c945M667L154P18q10J673m241r652J447J473K999P59j354p68K178n25R34
$$ plain form
16400 -5323 -1657 -6535 -8580 -5923 -2668 4101 6202 6040 904 -4208 448 3474 5286 3525 4836
16385 4836 2628 1302 -5957 -8715 -6530 -4891 5079 5367 -1542 -3356 -7921 -4495 -3882 -9236 -13984
16370 -13984 -11844 -6955 -9743 -3679 -4945 -3690 2179 5395 3200 5964 8019 6369 1246 2262
16356 2262 6344 -1362 -12616 -14357 -11833 -12363 -7530 -4858 -5209 -6803 -4026 -2021 -148 -5831 -11081
16341 -11081 -5004 2018 9333 12031 11743 15047 15059 14294 4563 -450 -2797 -4484 -8860 -9381 -7459 -4482
16325 -4482 5510 13418 6526 -8420 -5093 32 -2513 -1910 -5938 -11190 -13528 -10933 -6104 -2029 -2480
16310 -2480 -3514 -796 1097 -4712 -7338 3746 4925 -2870 -10261 -11733 -8680 -5524 -2037 -3945
16296 -3945 722 3876 4594 3784 5457 1216 -8436 -6989 -5516 -2517 -1758 -3112 -3880 -1702 -2227 -1293
16280a293m028L013j230J13l648o78N072J989M321j981Q316P95p61n942K852n202
16264A708r820l527K992N365n896L699J223k168O376P727n38m284m263m981p35
16249g122P610k680J073K485k059M33J488k623M15J159m88j172m362n547k236
16234a3626N79N271P758M456o528k733j723m981L883m077j646M104Q502P557j023
16219E773j269O860K757r965q228N848j285M192J14m795K461J2668P488p667j1258
16204C694k656m861j967J303o792J04l64j409M923J854O162k025j1300r354P480
16189a5208O590K305R1K738q22p2K393M776J836o059J655N187r76j205j84K374
16173E419J805k872o595p218N666M834L96J610k606L90L187k492l950R388N453
$$ plain form
16280 -1293 -5321 -2308 -3538 -3425 -7073 -7751 -2679 -690 3631 1650 9966 10761 10000 4058 6910 1708
16264 1708 -8112 -11639 -8647 -3282 -9178 -5479 -4256 -6424 -48 7679 7141 2857 -1406 -6387 -7122
16249 -7122 488 -2192 -1119 1366 -693 -260 1228 -1395 -980 179 -309 -1481 -5843 -11390 -13626
16234 -13626 -13047 -7776 -18 4438 -2090 -4823 -6546 -11527 -7644 -11721 -13367 -9263 -761 6796 5773
16219 5773 4504 11364 14121 4156 -4072 1776 491 4683 4797 2 2463 15131 22619 14952 3694
16204 3694 1038 -3823 -5790 -4487 -11279 -11175 -11539 -12948 -8025 -6171 -9 -2034 -13334 -22688 -15208
16189 -15208 -8618 -6313 -6222 -3484 -4306 -4378 -1985 2791 4627 -1432 223 5410 4434 3229 3045 5419
16173 5419 7224 4352 -2243 -9461 -3795 1039 1435 3045 439 829 4016 1524 -2426 6962 12415
16158A2415l559m889L714K522j077n897k380J613M221K062j4515o090M532M655
16144b673O07m389J151L77l154M798J05J690K936m198n70p61k471O747J908j273
16128H30K360Q05n470m255j764j058O497N291j292O59p191q512K20K391L119L808
16112c562K148q302o68J0790K876o058l03Q32n722j663j268j331L223K357N19
16097f132j195M074Q44O56o1m105L29m080M44L105k97j711k294K835J931j267
16081f924q76N186l709J506M717L139n218m95n218k456m238M456q32N485M318
16066a159q51o198l098J822q9M811O263j233n060n636m75J988j166j126K208K339
16050f660P73j513j18k388p90k997o404N978R126j495j033N569M806M204l625
$$ plain form
16158 12415 8856 3967 7681 10203 9126 3229 849 2462 6683 8745 -5770 -11860 -7328 -2673
16144 -2673 -2066 -6455 -5304 -4927 -8081 -3283 -3178 -1488 1448 -2750 -3320 -4081 -6552 195 2103 830
16128 830 3190 3995 -1475 -5730 -7494 -8552 -2055 3236 1944 2603 -4588 -13100 -12880 -10489 -7370 -3562
16112 -3562 -1414 -9716 -10384 406 3282 -2776 -3079 -2247 -7969 -9632 -10900 -12231 -9008 -6651 -6132
16097 -6132 -7327 -3253 -2409 -1753 -1814 -5919 -5590 -9670 -9226 -6121 -6418 -8129 -10423 -7588 -5657 -6924
16081 -6924 -7800 -2614 -6323 -4817 -100 3039 -2179 -2674 -7892 -10348 -14586 -10130 -10962 -5477 -1159
16066 -1159 -2010 -8208 -11306 -9484 -9573 -4762 1501 268 -4792 -10428 -10903 -8915 -10081 -11207 -8999 -6660
16050 -6660 -5887 -7400 -7518 -9906 -10696 -13693 -20097 -14119 -4993 -6488 -7521 -1952 2854 7058 3433
16035C433l056J193R90N395J3169j0524r024L123M979p212j1180k323K205l73
16021i205n797O396P800M667Q445l856q931m731j391M012L211J193n852o076L204
16006f911Q738J495j186L645K49j075M502n612P64L476K111o269n862n84M683
15991B164Q169K209m921o509l016p594R03M902J29R47O108n370k291l586p83Q529
15975a0R9Q16p570m410n45K352O140J8K019J31n45k592l941K184P933M513p932
15958a340m862K679K09K971M068N530m645J311M832n001j386j440j814L024K225
15943F361J247l940N920J12p607M17P532o863q635o0J437Q677R40o247k040J262
15927a487J018n724k897K49M66J084N39K219O786k73n774n314k118L872K484O811
$$ plain form
16035 3433 377 1570 2560 7955 21124 10600 1576 4699 9678 2466 -8714 -11037 -8832 -9205
16021 -9205 -15002 -8606 -806 3861 12306 8450 -481 -5212 -6603 -2591 620 1813 -4039 -10115 -6911
16006 -6911 1827 3322 2136 5781 6030 4955 9457 3845 4609 8085 10196 3927 -1935 -2519 2164
15991 2164 10333 12542 7621 1112 -1904 -9498 -8595 -3693 -3564 -2617 3491 -1879 -4170 -7756 -8539 -10
15975 -10 89 905 -6665 -11075 -11620 -9268 -3128 -3110 -1091 -960 -1505 -4097 -8038 -5854 2079 6592 -1340
15958 -1340 -6202 -3523 -3314 -343 3725 9255 4610 5921 10753 5752 4366 2926 1112 4136 6361
15943 6361 7608 3668 9588 9700 2093 2510 10042 3179 -5456 -5516 -4079 4598 5538 -709 -2749 -1487
15927 -1487 -469 -6193 -9090 -8841 -8375 -7291 -6752 -4533 2253 1980 -3794 -9108 -11226 -7354 -4870 1941
15911A941k139o291l714j76Q453M872K067M096j527m42M587M219r566j0648m51
15896d719N697L108K140Q628R998n529n966j0251o281K090j268m460J930q65k853
15881h601L320M580n65j187L868K088o555K413M968J618n252n879k274J746L923
15866a789m124q24K055j484J101O87J57j420M423l458q460L725k37m629K278J75
15850a1824k21J182Q327Q120k213j586J318N21M761p410k168K151n073p505J098
15835a0522N362K107k245J212K310r277l376P072p51K6p11M673M844o32J501n744
15819d151k999N550k74M839J065Q96J229K412o157L259Q421p51k032N056J114
15804A7477q186l519j281l796R062K453n348j385K509M456L533L80N900q216p350
$$ plain form
15911 1941 -198 -6489 -10203 -10379 -1926 2946 5013 9109 7582 7140 11727 15946 6380 -4268 -4719
15896 -4719 978 4086 6226 14854 24852 19323 13357 3106 -3175 -1085 -2353 -6813 -4883 -5748 -8601
15881 -8601 -5281 -701 -1266 -2453 1415 3503 -3052 -639 4329 5947 695 -5184 -7458 -5712 -1789
15866 -1789 -5913 -6737 -4682 -6166 -5065 -4378 -4221 -5641 -1218 -4676 -13136 -9411 -9648 -14277 -11999 -11824
15850 -11824 -12045 -10863 -2536 5584 3371 1785 3103 3624 8385 975 -1193 958 -4115 -11620 -10522
15835 -10522 -5160 -3053 -5298 -4086 -1776 -11053 -14429 -7357 -8108 -8082 -8793 -4120 724 92 1593 -4151
15819 -4151 -7150 -1600 -1874 2965 4030 4926 6155 8567 2410 5669 14090 13339 11307 16363 17477
15804 17477 9291 5772 4491 695 9757 12210 6862 5477 7986 12442 15975 16355 22255 14039 6689
15789F689J562k94K655j32J333k889j508L654J175p981l085J075O179N658p369
15774F722J558J575J392n11M579k861l735m855j467k570l004l097l154K364R016
15759A952k05j877o93J02M005J813K907k448n807r905l288L306J798k211K116
15744h435R020m46l666J7763J101o344k115K893J935M04k870J481L39l951k332
15729D777m817J968j066j909N36L413l840J00J235J436j350M693R85k343l789
15714B9N930j492n043K623M114o51k416O756r57k863M660M140P386R090J2501
15699D3807J0275N204N176O531J1183N695L880n7O099K821k299j088M105M90m389
15684I7433q491j0462j1456n957o543o867o336j2385j3090k450M923l773m250
$$ plain form
15789 6689 8251 7957 10612 10480 11813 8924 7416 11070 12245 4264 1179 2254 8433 14091 6722
15774 6722 8280 9855 11247 10736 15315 12454 8719 3864 2397 -173 -3177 -6274 -9428 -7064 1952
15759 1952 1747 -130 -823 -721 3284 5097 8004 5556 -251 -10156 -13444 -10138 -8340 -10551 -8435
15744 -8435 585 139 -3527 14236 15337 8993 6878 9771 11706 12110 9240 10721 11060 7109 4777
15729 4777 -40 1928 862 -1047 -511 2902 -938 -838 397 1833 483 5176 6161 3818 29
15714 29 5959 4467 -576 2047 6161 5510 3094 9850 8893 6030 10690 14830 22216 31306 43807
15699 43807 54082 59286 64462 70993 82176 87871 91751 91694 97793 100614 98315 97227 101332 101822 97433
15684 97433 88942 78480 67024 61067 54524 47657 41321 28936 15846 13396 18319 14546 10296
15671A0296j453m345k950O511K675p616j2361k550M977l926m398J116J838P956
15657d230R909O088l839o263q395N74L469j66k24J750M603l635N400L355k140
15642F256k315J009J481p83L387K354n315o24n003p530J207J875k915K651N661
15627A396Q085j245p165n083K157n319j79j345M88O001M791k215J245N736j549
15612E799o672n901l827L384O867R528M669l700n136J365J740p701r239O806J446
15597e72j062o76L263Q470k001m901K473n80p931o322J986k130L863L538j823
15582d405K56M33K566M173P210k004q791m612j448L125M237K714j621p562l374
15567i103l780p024k179N478Q051O012L375J610P387K768n799M48l177r166J612
$$ plain form
15671 10296 8843 4498 1548 8059 10734 3118 -9243 -11793 -6816 -10742 -15140 -14024 -12186 -4230
15657 -4230 5679 11767 7928 1665 -6730 -6156 -2687 -2853 -3077 -1327 3276 -359 5041 8396 6256
15642 6256 3941 4950 6431 5648 9035 11389 6074 5450 447 -7083 -5876 -4001 -6916 -4265 1396
15627 1396 9481 8236 1071 -4012 -1855 -7174 -7353 -8698 -8210 -2209 2582 367 1612 7348 5799
15612 5799 -873 -6774 -10601 -7217 -350 9178 13847 10147 5011 6376 8116 415 -8824 -2018 -572
15597 -572 -1634 -2310 953 9423 7422 2521 4994 4414 -3517 -9839 -7853 -9983 -6120 -2582 -4405
15582 -4405 -4149 -3716 -1150 3023 10233 8229 -562 -5174 -6622 -3497 740 3454 1833 -5729 -9103
15567 -9103 -12883 -19907 -22086 -16608 -8557 -2545 830 2440 9827 12595 6796 7244 4067 -5099 -3487
15552c487k11j081M390N11K385J902l749k759J412P43J143j099Q31J0478K336
15537A3745n536l459m028o242M26M295K104o11J898k584o28o326J542M291K77
15522h36o354n892l271O041J440l102k416L041L170N58M59K87k228K719K306r40
15506e018M75l920M292r76K330p99j213m86K270M092P33J00O51o057m351j273
15490i150P38M988Q98j560m009K072j452l449Q200k349J660k04K826O28J897k600
15474h66K737K890p428o384k431J110k8J359P057K328n746m205M589k21j182j22
15458f543l327L396l833k480L445J424k626M925Q540Q704n315j174M04n069m845
15443d374R421J536r086K834n913l326K486K72m666J524N785k060Q99o56j521
$$ plain form
15552 -3487 -3698 -4779 -389 122 2507 4409 660 -2099 -687 56 1199 100 931 11409 13745
15537 13745 8209 4750 722 -5520 -5094 -799 1305 694 2592 8 -620 -6946 -5404 -1113 -836
15522 -836 -7190 -13082 -16353 -10312 -8872 -11974 -14390 -11349 -8179 -7621 -7162 -6875 -9103 -6384 -4078 -5018
15506 -5018 -4543 -8463 -4171 -5147 -2817 -3616 -4829 -5315 -3045 1047 1780 1880 2531 -3526 -7877 -9150
15490 -9150 -8412 -3424 -2526 -4086 -8095 -6023 -7475 -10924 -2724 -5073 -3413 -3617 -791 -163 1734 -866
15474 -866 1871 4761 -2667 -9051 -11482 -10372 -10400 -9041 -1984 344 -5402 -9607 -5018 -5239 -6421 -6543
15458 -6543 -9870 -6474 -10307 -12787 -9342 -7918 -10544 -5619 2921 11625 6310 5136 5540 471 -4374
15443 -4374 5047 6583 -2503 331 -5582 -8908 -6422 -6150 -10816 -9292 -3507 -5567 -4668 -5324 -6845
15428f845M199J182m66Q80M803J415n84k705o211J489k32q20q47m675l180L363
15412i234O77N47K207L924J780K69K35q10J502K635j607o043j154R335M493m702
15396D054j4553R85M709N662J075L627l500j704Q627M45m831n216K64k827p74
15381c957J052M1p17R05m675l735J100J947M741n05q21J294P64M578j412o303
15365e703k588o620j695N893j167o579n247R431R491r124k035M902M305j494l961
15350a2191p48K119M512L213j685M67O347J925n834J666J308l03K108N13L27L074
15334F818j405l898j360P52j764j835j278p75j852J0989L191k668O83R94n428
15319A164l31o422n672K663j610J0322R392Q09k851K64j02k406L215Q34o546m264
$$ plain form
15428 -6845 -2646 -1464 -1930 -1050 3753 5168 4584 1879 -4332 -2843 -3075 -3895 -4742 -9417 -12597 -9234
15412 -9234 -8557 -8010 -5803 -1879 -99 170 405 -405 1097 3732 2125 -3918 -5072 4263 8756 4054
15396 4054 -10499 -9514 -4805 857 1932 5559 2059 355 8982 9427 4596 -620 -356 -3183 -3957
15381 -3957 -2905 -2864 -3581 -2676 -7351 -11086 -9986 -8039 -3298 -3803 -4624 -3330 -2566 2012 600 -5703
15365 -5703 -8291 -14911 -16606 -10713 -11880 -18459 -23706 -14275 -4784 -13908 -15943 -11041 -6736 -8230 -12191
15350 -12191 -12939 -10820 -6308 -3095 -4780 -4313 2034 3959 -1875 -209 1099 796 2904 3417 3744 6818
15334 6818 5413 1515 155 907 -857 -2692 -3970 -4745 -6597 4392 7583 4915 5598 6592 1164
15319 1164 833 -5589 -11261 -8598 -10208 114 9506 10315 7464 7728 7626 5220 8435 9269 2723 -1541
15303a541L992Q21n770J818K533m602j17N024N854o318M89m277m3M431J014p192
15287c884m401L077N880k908l497L996K386l226o876N809L917k335j993l853q99
15272h807M528O591j04k98M756M096P83n618j415o284k150J2413O523k800p168
15257E046m880o54L713o219r35J949N784N445j046M30J99p301m200R7M099k094
15241e67q741L498k869k629j135K702J3451O620j449p185k588m167l53N434j009
15226i87o995r52P453N274M60J012j205p20l127j248m044P08j071J159N66k673
15210f390K005j152J690M606j81l546K683j734M40n005o877K734J869l654J736
15195a0776J0264K126q53J367r531r686M70N779L549R25m382J675M336m042o549
$$ plain form
15303 -1541 2451 3272 -2498 -680 1853 -2749 -2866 2158 8012 1694 2183 -2094 -2137 2294 3308 -3884
15287 -3884 -8285 -5208 672 -2236 -5733 -1737 649 -2577 -9453 -3644 273 -2062 -4055 -7908 -8807
15272 -8807 -4279 2312 2208 1910 6666 10762 11545 5927 4512 -1772 -3922 8491 15014 12214 5046
15257 5046 166 -488 3225 -2994 -3929 -1980 3804 9249 8203 8633 8832 1531 -2669 -2572 1527 -567
15241 -567 -9308 -5810 -8679 -11308 -12443 -9741 3710 10330 8881 1696 -892 -5059 -5412 22 -987
15226 -987 -7982 -8934 -1481 3793 4253 5265 4060 3340 213 -1035 -5079 -4371 -5442 -4283 -3717 -6390
15210 -6390 -4385 -5537 -3847 759 578 -2968 -285 -2019 -1579 -6584 -13461 -10727 -8858 -12512 -10776
15195 -10776 -512 1614 761 2128 -7403 -17089 -16619 -10840 -7291 -6366 -10748 -9073 -4737 -8779 -15328
15180a5328N080N762k721J418j729n674K074N857l94J141J060k563m887j138L028
15165i014N269j269K568O677r76L456m136k018N304m424n057K334l63K955P68
15150B074n727M160l322K462L062l666k889RJ763J180k656k599O984L012l093
15135G54L180j751K364J333Q71J2n89m721K55L464k800Q75l502l575m127J064
15119f893o65J191K007l754k565J533P977k76l30k159N797J133n884p807Q40M724
15103e131J757J4321m176p033n219n356k616l607K403N65P794M268p045l490L475
15088i090M531k236Q36K507J642n478r24K14L537Q929N648l527j3084m285L450
15073g330l789j958O119O34o60K837M724Q435p30N105L25q362m529L523J710N750
$$ plain form
15180 -15328 -10248 -4486 -7207 -5789 -7518 -13192 -11118 -5261 -5655 -4514 -3454 -6017 -10904 -12042 -9014
15165 -9014 -3745 -5014 -2446 4231 3255 6711 2575 557 5861 1437 -3620 -1286 -1649 1306 2074
15150 2074 -3653 507 -2815 -353 2709 -957 -3846 -3837 -2074 -894 -3550 -6149 835 3847 754
15135 754 3934 2183 4547 5880 6751 6763 6174 1453 1708 5172 2372 3247 -255 -3830 -7957 -6893
15119 -6893 -7558 -6367 -4360 -8114 -10679 -9146 -1169 -1445 -1775 -3934 1863 2996 -2888 -10695 -9855 -5131
15103 -5131 -3374 10947 6771 -262 -5481 -10837 -13453 -17060 -14657 -14092 -6298 -2030 -9075 -12565 -9090
15088 -9090 -4559 -6795 -5959 -3452 -1810 -7288 -8212 -7998 -4461 4468 10116 6589 -6495 -10780 -7330
15073 -7330 -11119 -13077 -6958 -6324 -6984 -4147 577 9012 8282 13387 13712 5350 821 4344 6054 11804
15057A1804n001k241N553l477r054Jk147P624Q24o087j507L251l946J643j486
15042d246o68L506j850j179j557n70l341j225M913K31M037j290j912p106k04R164
15026c297O526m968J930k613j285M002O940R98m964j1068l604R35l071n09M471
15011i577m17J466J476M271Q606L911m078j88k390n962q51L004J147k564J192
14996i54N85m562q120J135J447l888o16J0186j645k915n6M867O3q877m500j213
14980a9063k581l891K49J1362R576o254L299J1585n82l056J78k223R4K905m370
14965b772l591p66M352N389p825j3759j739j059L913N238j540o726O265P062L583
14950c975K230K368o55m05j689L224P46l29P462j448o118m953J114N502o913q612
$$ plain form
15057 11804 6803 4562 10115 6638 -2416 -2415 -4562 3062 3886 -2201 -3708 -457 -4403 -2760 -4246
15042 -4246 -4914 -1408 -3258 -4437 -5994 -6564 -9905 -11130 -6217 -5986 -1949 -3239 -5151 -12257 -12461 -3297
15026 -3297 3229 -1739 191 -2422 -3707 295 7235 8233 3269 -7799 -11403 -10468 -13539 -14048 -9577
15011 -9577 -9994 -8528 -7052 -2781 5825 9736 5658 5470 3080 -2882 -3733 -729 418 -2146 -954
14996 -954 -369 -4931 -13051 -11916 -10469 -14357 -14973 -4787 -6432 -9347 -9403 -4536 -4473 -13350 -17850 -19063
14980 -19063 -21644 -25535 -25286 -13924 -4348 -10602 -7303 4282 3700 644 822 -1401 -1307 1598 -2772
14965 -2772 -6363 -7129 -2777 2612 -5213 -18972 -20711 -21770 -17857 -12619 -14159 -20885 -14620 -7558 -3975
14950 -3975 -1745 623 -32 -437 -2126 1098 1844 1515 8977 7529 1411 -3542 -2428 3074 -3839 -12451
14934a2451k212Q773P988K758o671k535R955K991N842L005m485l920n079m107
14920a48j420j742q4n283k62N946L190n538q85K461m322K310J2079N77j109M548
14904A0318m963k143k143m305j446p284L749J1399P388o278o645L206l169l181
14890e497m199l837j405L209P843J704J853J429O529R02l920m637o832n89N899
14875a548l745k448M189J38O767K108k216o050M282M750O08m694n548k856L019
14860c244L989L66j841m091J516j723K916Q99k492K944J679j246O11j569N04m297
14844e079M633k655n799j869k69j106J754q51O218j983j350N42K142J8j844K019
14828e479K841N00j132m695P479k424j1508n336M255P470l752O456M925Q46r83
$$ plain form
14934 -12451 -14663 -5890 2098 4856 -1815 -4350 5605 8596 14438 17443 12958 9038 3959 -148
14920 -148 -1568 -3310 -3394 -8677 -8939 -2993 197 -5341 -6226 -3765 -8087 -5777 6302 6879 5770 10318
14904 10318 5355 3212 1069 -3236 -4682 -11966 -8217 3182 10570 4292 -2353 853 -2316 -5497
14890 -5497 -9696 -13533 -14938 -11729 -3886 -2182 -329 1100 7629 8531 4611 -26 -6858 -7447 -1548
14875 -1548 -5293 -7741 -3552 -3414 3353 5461 3245 -2805 1477 6227 6835 2141 -3407 -6263 -3244
14860 -3244 745 1111 -730 -4821 -3305 -5028 -2112 -1213 -3705 -761 918 -328 283 -1286 -782 -5079
14844 -5079 -446 -3101 -8900 -10769 -11038 -12144 -10390 -11241 -5023 -7006 -8356 -7814 -5672 -5654 -7498 -5479
14828 -5479 -2638 -2138 -3270 -7965 -486 -2910 -14418 -19754 -15499 -8029 -11781 -5325 -400 446 -537
14813e37n313j290P848p683J5o87l416L689N263k587L113L885k81R39k716J038
14797A280j067K378P541r67j032l411r588j605O291N651O600k36p460l416q007
14782g048J421P742N91j252j400L043J772o366L095L410l535m361J098l931J768
14767c953J865m000l740j004K591O538O705m499p458L429R80R31K673l064r737
14752a1743j579J258k993l509O85O484K655K789L983Q165p420n983j800j1244
14738b0252O979L746L854Q226K585k960k688k718j191J988K587o158p354Q154
14724e202M217K493K664L952r479m527k573K027K268n784p599k329K305J0734
14710f833k78m794J2293l272n988J06o23l29J982K744O802j786k825p345m910
$$ plain form
14813 -537 -5850 -7140 708 -6975 -6960 -7647 -11063 -7374 -2111 -4698 -1585 2300 2019 2958 242 1280
14797 1280 213 2591 10132 9165 8133 4722 -4866 -6471 -180 5471 12071 11835 4375 959 -7048
14782 -7048 -5627 2115 2706 1454 54 3097 4869 -1497 1598 5008 1473 -2888 -1790 -5721 -3953
14767 -3953 -2088 -6088 -9828 -10832 -8241 -1703 5002 503 -6955 -3526 -2546 -1615 1058 -2006 -11743
14752 -11743 -13322 -12064 -15057 -18566 -17881 -11397 -8742 -5953 -1970 6195 -1225 -7208 -9008 -20252
14738 -20252 -13273 -9527 -5673 2553 5138 2178 -510 -3228 -4419 -2431 156 -6002 -13356 -5202
14724 -5202 -985 1508 4172 8124 -1355 -5882 -8455 -6428 -4160 -9944 -17543 -19872 -17567 -6833
14710 -6833 -7111 -11905 388 -2884 -8872 -8766 -9389 -9718 -7736 -4992 1810 24 -2801 -10146 -15056
14695a5056k069K763P224M055l644J040l417k846m356J074K763M811j638j244
14681a0540O233L593M209j984l196J590L140m320l837j749j495N072l790q988
14667a6062k305M410J698N971j379L597K489N474k284J607K416p922m495N341
14653a444J401j437J836j652L784l573J68k045r812O37O70M29P651N668J737m79
14637C539j360n660k606j183M476L850m429j376O326n66l550K239o108j443k36
14622h087m041j157N844N337j27J316n492p662l176O405J696L130J099M31k583
14607g067j827q48j778R181N774k326j1418n221K930L533j108M113J3422l848
14593C512k80K363O163r090q539N123J849J884j002m155n533j416j23r78L969
$$ plain form
14695 -15056 -17125 -14362 -7138 -3083 -6727 -5687 -9104 -11950 -16306 -15232 -12469 -7658 -9296 -10540
14681 -10540 -4307 -714 3495 1511 -1685 -95 3045 -1275 -5112 -6861 -8356 -3284 -7074 -16062
14667 -16062 -18367 -13957 -12259 -6288 -7667 -4070 -1581 3893 1609 3216 5632 -2290 -6785 -1444
14653 -1444 -43 -1480 356 -1296 2488 -1085 -917 -2962 -12774 -12137 -11467 -11038 -3387 2281 4018 3539
14637 3539 2179 -3481 -6087 -7270 -2794 1056 -3373 -4749 1577 1011 -2539 -300 -6408 -7851 -8087
14622 -8087 -12128 -13285 -7441 -2104 -2231 -915 -6407 -14069 -17245 -10840 -9144 -6014 -4915 -4484 -7067
14607 -7067 -8894 -9742 -11520 -2339 3435 1109 -10309 -15530 -12600 -9067 -10175 -6062 7360 3512
14593 3512 3232 5595 11758 2668 -5871 -748 1101 2985 1983 -2172 -7705 -9121 -9244 -10222 -6253
14578f253j412j376L297M068K827K491J395m051n290q430M161Q264L945j397j369
14563H70j860n690R23L692N671k044j785q541n043p25K59N401L21j878j156k797
14547a4382m94J108o416R49Q560l001K537O297M151k790r937p71M07P48N412O232
14531a390J130m463o564n269J998N020L509j780n329o638L912J2667O229n52n432
14516b952n801K432j438m316N266J1636q81K993J425o347l708l804M217l54m213
14501e845q06P55k398K127k279j264j190m062K003j182J266R341K923L937N88
14486C914J047O20M146L089j253p67n880m12J763j709J301K677q509k002N641
14471C666j868p351k154M261J899K081p658l23M904k226m198m11l714o221K665
$$ plain form
14578 -6253 -7665 -9041 -5744 -1676 1151 3642 5037 986 -4304 -12734 -8573 -309 3636 2239 870
14563 870 -990 -6680 -5757 -2065 3606 1562 -223 -8764 -13807 -14532 -14273 -8872 -8551 -10429 -11585 -14382
14547 -14382 -14876 -13768 -20184 -19235 -10675 -13676 -11139 -4842 -691 -3481 -13418 -14189 -13782 -13034 -7622 -1390
14531 -1390 -260 -4723 -11287 -16556 -14558 -9538 -6029 -7809 -13138 -19776 -15864 -3197 3032 2480 -2952
14516 -2952 -8753 -6321 -7759 -12075 -6809 4827 3946 6939 8364 2017 -1691 -5495 -1278 -1632 -5845
14501 -5845 -6651 -5896 -8294 -6167 -8446 -9710 -10900 -14962 -12959 -14141 -12875 -3534 -611 3326 3914
14486 3914 4961 5581 9727 12816 11563 10796 4916 4504 6267 4558 5859 8536 27 -1975 3666
14471 3666 1798 -5553 -7707 -3446 -1547 534 -7124 -7447 -2543 -4769 -8967 -9378 -13092 -19313 -16648
14456a6648o44L664J186L309M578L796O893j639o906L888P20m121N888N332n757
14441C539q856J620L290k30o664k810J422L633M532M825l874o886J739L494J316
14426I0K50k893L308N855N04l105o877N383K857k830j562K247R41l662j575N7
14410a012J989J716L543K647P564l217n747J758K567J994j804M595O843p348k672
14395A3416l039O507q35k594j888k251k512j324N452l110k450k029q77L30j712
14380A084N328m184p246p132J228N414J540N407P104j624p059n8Q16k89J796J538
14364C663k725p798m060J493L055n05L767j487J64l297N709L43m74K821Q1l829
14348c079l801J348M907k874K104j25M6J267q60j053j437N95J456l383r22p518
$$ plain form
14456 -16648 -17292 -13628 -12442 -9133 -4555 -759 6134 4495 -2411 1477 2197 -1924 3964 9296 3539
14441 3539 -5317 -3697 -407 -637 -7301 -10111 -8689 -5056 -524 4301 427 -6459 -4720 -1226 90
14426 90 340 -2553 755 6610 7114 4009 -2868 2515 5372 2542 980 3227 4168 506 -1069 -1012
14410 -1012 977 2693 6236 8883 16447 13230 7483 9241 11808 13802 11998 16593 23436 16088 13416
14395 13416 10377 16884 16049 13455 11567 9316 6804 5480 10932 7822 5372 3343 2466 2796 1084
14380 1084 6412 2228 -5018 -12150 -10922 -5508 -3968 1439 8543 6919 -140 -198 618 329 2125 3663
14364 3663 938 -6860 -10920 -9427 -6372 -6877 -3110 -4597 -4433 -7730 -2021 -1678 -2152 669 750 -3079
14348 -3079 -6880 -5532 -625 -3499 -1395 -1520 -1474 -207 -1067 -2120 -3557 -2962 -1506 -4889 -5811 -13329
14332a3329o822m066M921M905K290O470K77K507k803K880o34Q588K637J0954R395
14317B8170R583J3198J3770J044M881M99l212n671j3468m078j589p925j2415j1822
14303A0965j2800j1462K956M537M565O921J163l903L30J0120J71r946n054L661
14289B224M24p315j381k635j830m585L391M849K534J654l451m388L785K583l634
14274g775M13l186J847L795N185K637m744m276o129l479J534K407M954J388k374
14259g803K34q653p046j017j736K464O883O079m50j18N89Q49N939R872o251j7590
14243a7755o170P568M807J445N911J807J073k740q2M231m166q722N029M319L872
14228D27n844Q71K543R2k642n19p1j1363K04J0277r68m264o245k878n80Q59J851
$$ plain form
14332 -13329 -20151 -24217 -19296 -14391 -12101 -5631 -5354 -2847 -5650 -2770 -3404 5184 7821 18775 28170
14317 28170 37753 50951 64721 65765 70646 71145 67933 62262 48794 44716 43127 35202 22787 10965
14303 10965 -1835 -13297 -10341 -5804 -1239 5682 6845 2942 3272 13392 13563 3617 -1437 2224
14289 2224 2648 -4667 -6048 -8683 -10513 -15098 -11707 -6858 -4324 -2670 -6121 -10509 -6724 -4141 -7775
14274 -7775 -7362 -10548 -8701 -4906 279 2916 -1828 -6104 -12233 -15712 -14178 -11771 -6817 -5429 -7803
14259 -7803 -7569 -16222 -23268 -24285 -26021 -23557 -16674 -10595 -11045 -11163 -10574 -9725 -3786 6086 -165 -17755
14243 -17755 -23925 -16357 -11550 -10105 -4194 -2387 -1314 -4054 -4136 95 -4071 -12793 -7764 -3445 427
14228 427 -5417 -4546 -2003 -1911 -4553 -5072 -5143 -16506 -16302 -6025 -6993 -11257 -17502 -20380 -20960 -20101 -18250
14211a8250P483O550J331K248j601J13n004k485j065j413K239p42K175N290l855
14196f986j45m787K7k051k630K126J741n342l270P172J0339m915p205j248L246
14181a3928l685l826P562j973L667j066P485k62q433j182K853P089n348N471O876
14166A300l197L483R48p816L201R19k114k520j349J702K912M150n294l847M89
14151g033N09k48K630n626n132j651n648K248M227O414N825K242O437r987o335
14136a1128n037n380N122J067m72K744l332M778j10m269J041L298L987o90n927
14121a4308k089l238O927J0475J101r45l980k363L845J56m636m88M29p406j995
14106a8515J916L659R745P267K831j61k930R67o74J061K336M180m052n279O257
$$ plain form
14211 -18250 -10767 -4217 -2886 -638 -2239 -2126 -7130 -9615 -10680 -12093 -9854 -10596 -8421 -3131 -6986
14196 -6986 -7131 -11918 -11891 -13942 -16572 -14446 -12705 -18047 -21317 -14145 -3806 -8721 -15926 -17174 -13928
14181 -13928 -17613 -21439 -13877 -15850 -12183 -13249 -5764 -6026 -14459 -15641 -12788 -5699 -11047 -5576 1300
14166 1300 -1897 1586 2534 -5282 -2081 -1162 -3276 -5796 -7145 -5443 -2531 1619 -3675 -7522 -7033
14151 -7033 -6524 -6772 -4142 -9768 -14900 -16551 -22199 -19951 -15724 -9310 -3485 -1243 5194 -4793 -11128
14136 -11128 -16165 -21545 -16423 -15356 -15828 -13084 -16416 -11638 -11748 -16017 -14976 -11678 -7691 -8381 -14308
14121 -14308 -16397 -19635 -12708 -2233 -1132 -2077 -6057 -8420 -4575 -4419 -9055 -9543 -9114 -16520 -18515
14106 -18515 -16599 -12940 -3195 4072 6903 6742 3812 4779 4105 5166 7502 11682 7630 2351 8608
14091H608N67j0881L160O981j254K308N211M54M394k71n33m553j568L295N638
14076B1556O659J4771J0339O858R349J2216J6138K1780K9646L5202O3296R5670
14064C43480J38257J91787K30928K56630K25596J42605J00382m253j04039j56710
14054A364663j99605j96365j83997j65906j39448j08930p5595n1259l9747k7117
14044A76694k3248j8321j9267j2062p832l361j3945r308p972j1735j6354o284
14032B7005m002n415m325L798M656k369K549r03K904K688j157j909K69K498m109
14017B2178j36o587m207q968o163L744J989k413k031l664L336L891k473k00O813
14002E109J199O784j33l347j308O114N466m926l645o143m859o241K399n136q888
$$ plain form
14091 8608 9175 -1706 1454 8435 7181 9489 14700 15154 19548 19277 18744 14191 12623 15918 21556
14076 21556 28215 42986 53325 60183 69532 81748 97886 119666 149312 184514 247810 343480
14064 343480 481737 673524 904452 1161082 1386678 1529283 1629665 1625412 1521373 1364663
14054 1364663 1165058 968693 784696 618790 479342 370412 294817 243558 203811 176694
14044 176694 153446 135125 115858 103796 95964 92603 78658 69350 61378 49643 33289 27005
14032 27005 23003 17588 13263 17061 21717 19348 21897 20994 23898 26586 25429 23520 23789 26287 22178
14017 22178 22042 15455 11248 2280 -3883 -139 1850 -563 -2594 -6258 -2922 969 -1504 -1704 5109
14002 5109 6308 13092 12959 9612 8304 14418 19884 14958 11313 5170 311 -5930 -3531 -8667 -17555
13987a7555n51K009j033j230K473O037M601L273K16L022M724l505l26J764k353
13972A566n782N818r72j655k844m925J359N754o42L508O458N065o909o401K982
13957B380K229j987N490k578n016k401l793l936k71l240j512R74j434L586K455
13942i054J777K966K602r26n476m721n351M095K149k553K491K742Q74l43L000
13927e728K837P183O491L385O633q48k591p164m722r904K453j925M044K302N637
13912H083R475j320k489K173k456M32l502p217o815K897J3702P859Q320R642Q198
13897D6982M072J3925K4927L1469L0596K7404K3194P598m704n729j1179k7603
13885A60952l3235m1531l3526l1351k1988j9471p719k778n406p559J016l182o794
$$ plain form
13987 -17555 -18106 -16097 -17130 -18360 -15887 -9850 -5249 -1976 -1760 1262 5986 2481 2155 3919 1566
13972 1566 -4216 1602 630 -1025 -3869 -8794 -7435 -1681 -2323 1185 7643 12708 5799 -602 2380
13957 2380 4609 2622 8112 5534 518 -1883 -5676 -9612 -9883 -13123 -14635 -13661 -15095 -11509 -9054
13942 -9054 -7277 -4311 -1709 -2635 -8111 -12832 -18183 -14088 -11939 -14492 -12001 -9259 -8385 -8728 -5728
13927 -5728 -2891 4292 10783 14168 20801 19953 17362 10198 5476 -4428 -1975 -3900 144 2446 8083
13912 8083 17558 16238 13749 15922 13466 13898 10396 3179 -3636 -739 12963 20822 29142 38784 46982
13897 46982 51054 64979 89906 121375 151971 179375 202569 210167 205463 199734 188555 160952
13885 160952 127717 86186 52660 21309 -679 -20150 -27869 -30647 -36053 -43612 -42596 -45778 -52572
13872e2572J614K721n267k619J915j8m33l824l492j678L937J870O342J2779J2387
13857b6338J0827O164M684j717Q44J806L136L077J862M649p91M868J4163Q493
13843C5727O751J3572J0858K406o80J957P120O058J1967J4281J480L566J3639
13830A28702M618k637n938j3731j3419j2149j9874j5707k759k114m39p886q426
13817B8241k428l182n838j0797r179l842l772J394P688l14m028j215k099o013
13803a5384J09l276p159o132j1551n702k329j06L581R911L978o077J844O669O24
13788c1000q696o129K022q77j561j219n036r513L602J1882J171J327O994k849
13774c9882P652j68q22l432j1872p814N287k807m985J397R217N001O707J2267
$$ plain form
13872 -52572 -50958 -48237 -53504 -56123 -54208 -54226 -54659 -58483 -61975 -63653 -59716 -57846 -51504 -38725 -26338
13857 -26338 -15511 -9347 -4663 -6380 -5536 -3730 -594 2483 4345 8994 8203 13071 27234 35727
13843 35727 42478 56050 66908 69314 68634 70591 77711 83769 95736 110017 111497 115063 128702
13830 128702 133320 130683 124745 111014 97595 85446 65572 49865 47106 44992 44553 36667 28241
13817 28241 25813 22631 16793 5996 -3183 -7025 -10797 -9403 -1715 -2029 -6057 -7272 -9371 -15384
13803 -15384 -15275 -18551 -25710 -31842 -43393 -49095 -51424 -51530 -47949 -38038 -34060 -40137 -38293 -31624 -31000
13788 -31000 -39696 -45825 -43803 -44680 -46241 -47460 -52496 -62009 -58407 -46525 -45354 -44027 -37033 -39882
13774 -39882 -32230 -32398 -33220 -36652 -48524 -56338 -51051 -53858 -58843 -57446 -48229 -43228 -36521 -24254
13760b4254R753J7789O185L739k187P671J2511J3296o8j337M503j6600j3585q976
13746H440q278r306k651L679O713O704Q969R819J695O647L686O984J4442J1154
13732F8697L848J1467K0288K1393J3962P910Q665O383O795j989p815n663M406
13719A58347J6057L0739M1102O3221Q2071Q5262J25525J17914P0090P2126N4183
13708I16637K8528m3489p5703o1317p8594q7929q3614o4705n0047m5202l6892
13697C17673l7540k4206j8505j2011j6645j6686m205j1085l20J616j1712r648
13685A56726pJ8908K0951K8120L9996M4897M8580K6707J6254P971p035j1524k4436
13672C66108j8891j1933j7143j6242j3619r834j1002m952l58P90n140l610J431
$$ plain form
13760 -24254 -14501 3288 9473 13212 11025 18696 31207 44503 44435 43098 47601 31001 17416 8440
13746 8440 162 -9144 -11795 -8116 -1403 5301 14270 24089 25784 32431 36117 43101 57543 68697
13732 68697 72545 84012 104300 125693 139655 147565 156230 162613 169408 167419 159604 153941 158347
13719 158347 174404 205143 246245 309466 391537 476799 602324 720238 790328 862454 916637
13708 916637 945165 901676 825973 764656 686062 598133 514519 449814 399767 354565 317673
13697 317673 280133 255927 237422 225411 208766 192080 187875 176790 176470 178086 166374 156726
13685 156726 156719 175627 196578 224698 264694 309591 358171 384878 401132 409103 402068 390544 366108
13672 366108 347217 335284 318141 301899 288280 278446 267444 262492 262134 262924 257784 254174 255605
13659B55605l067L723N208O060P475Q352K179M629J1515K0965K1633J4569J8414
13646C77260J5132J7620K1289L0383K9240K3984L2400L0024K3784K9463K3668
13635F54247K1079J5780J8669L6331L3130L2600M2408M5393L8565M3562L4692
13624A016456K7320L3105L1813M3429M7268M5728N4352P3806P7941J08084J31382
13613A690684J58983J74840J88698K15977K36204K50432K74209L06732L65586
13604C862345M20507N06452O22444Q06558J009849J247638J533175J767735J852385
13595A3629088K118375K433941K751206L469184M610185O480756R812588J5535778
13587F0841101K4456906L3453003L9269732M7351859M3018531K4564087J9153607
$$ plain form
13659 255605 252538 256261 261469 267529 275004 283356 285535 290164 301679 322644 344277 358846 377260
13646 377260 392392 410012 431301 461684 490924 514908 547308 577332 601116 630579 654247
13635 654247 675326 691106 709775 746106 779236 811836 854244 899637 938202 981764 1016456
13624 1016456 1043776 1076881 1108694 1152123 1199391 1245119 1299471 1373277 1451218 1559302 1690684
13613 1690684 1849667 2024507 2213205 2429182 2665386 2915818 3190027 3496759 3862345
13604 3862345 4282852 4789304 5411748 6218306 7228155 8475793 10008968 11776703 13629088
13595 13629088 15747463 18181404 20932610 24401794 29011979 35492735 45305323 60841101
13587 60841101 85298007 118751010 158020742 205372601 248391132 272955219 292108826
13580B92108826K845786j8334835k6386285l3203500l4919386l4307063l1775586
13573A16027957k5752997k0240614j5163892j0417403o987864m948550l724088
13566B8792549k971258k554754k295799k067732j878236j693482j526036j348529
13558A2456723j173256j016882q72156p62815o52405n56422m90881m47085l99155
13549F085666l57817l33676l12010k92412k76101k63765k45104k36733k28934
13540C539114k08399k04674j90893j76106j65137j45357j14128j10642j08519
13531B115259q7352q3338r0639q3862q8642p8150o7381o1416n2171m7041m7076
13520A328191m1827l9234l4418l3028l5540l1559k8061k6229k5687l2131l3928
$$ plain form
13580 292108826 294954612 276619777 250233492 217029992 182110606 147803543 116027957
13573 116027957 90274960 70034346 54870454 44453051 37465187 32516637 28792549
13566 28792549 25821291 23266537 20970738 18903006 17024770 15331288 13805252 12456723
13558 12456723 11283467 10266585 9394429 8631614 7979209 7422787 6931906 6484821 6085666
13549 6085666 5727849 5394173 5082163 4789751 4513650 4249885 4004781 3768048 3539114
13540 3539114 3330715 3126041 2935148 2759042 2593905 2448548 2334420 2223778 2115259
13531 2115259 2027907 1944569 1853930 1770068 1681426 1603276 1535895 1474479 1422308 1375267 1328191
13520 1328191 1286364 1247130 1212712 1179684 1144144 1112585 1084524 1058295 1032608 1000477 966549
13509I66549l0554k6620k6705k8688k3811j9562j7512k2883k6242k2790k4056
13498F97126k4432k5894k6870k3532j4761j2626j3363j4133j5089n569o707q246
13486E05904n56J425j232R405L659J2661J6289n587n456l066k0152k0009r181
13473D84104j5079k0319j5433j3523j6412r461n493o766o764j1668K172o381n956
13460C53021j67l040j2624k6277j2495j0587l246j452N286J5503j310L74O398
13447C09384p760o165j3196m594K44p980o838o899n139j0887j3441m702m127J725
13433B19625P838J5142M959J135L686J2806P089K36K942k331L114k5P710l510
13419B80416m132J3554J3201R00P833J80m642j1292o597j5927k1778j1025L468
$$ plain form
13509 966549 935995 909375 882670 853982 830171 810609 793097 770214 743972 721182 697126
13498 697126 672694 646800 619930 596398 581637 569011 555648 541515 526426 520857 514150 505904
13486 505904 505348 506773 505541 514946 518605 531266 547555 541968 536512 533446 513294 493285 484104
13473 484104 469025 448706 433273 419750 403338 393877 388384 381618 374854 363186 365358 358977 353021
13460 353021 352854 349814 337190 310913 298418 287831 284585 283133 288419 303922 302612 302986 309384
13447 309384 301624 295459 282263 277669 277913 269933 263095 256196 251057 240170 226729 222027 217900 219625
13433 219625 227463 242605 247564 248699 252385 265191 272280 272516 275458 273127 276241 276216 283926 280416
13419 280416 276284 289838 303039 303939 311772 311952 307310 296018 289421 273494 251716 240691 244159
13406B44159k339j13o493n171m31J1474K1329J0579P262N406J0076j31k710L51
13392B93248m395R26P761j2753r723j241N164n881k864K331L423L162N74o470
13378B73262k765k720o463l618n714r122r952o241o510J457j603q570J511P848
13364B20800N703j898p562m622q321p140q11k149m123p094n150o231J86J1267
13350A82855J055m967q32j979J549R276m624j0678J286J935j2270o447k971j577
13336A51611o09J9m365M002J5281J1520J4739K0630R163n529j5680p182j167k894
13322A89539j9390j1059o586q549k900j668O07j77N206o70m00o144M984J1177
13308A53970O135l401k815p74N691J3135J0705j512R169O570n869p582L5j130
$$ plain form
13406 244159 241820 241707 235214 230043 229612 241086 262415 272994 280256 285662 295738 295607 292897 293248
13392 293248 288853 289779 297540 284787 275064 273823 278987 273106 270242 272573 275996 279158 279732 273262
13378 273262 270497 267777 261314 257696 251982 242860 232908 226667 220157 221614 220011 211441 212952 220800
13364 220800 226503 224605 217043 212421 204100 196960 196149 194000 189877 182783 177633 171402 171588 182855
13350 182855 183910 178943 178111 176132 177681 186957 182333 171655 172941 174876 162606 156159 153188 151611
13336 151611 151002 151021 146656 150658 165939 177459 192198 212828 221991 216462 200782 193600 192433 189539
13322 189539 170149 159090 152504 143955 141055 139387 139994 139817 145023 144353 143953 137809 142793 153970
13308 153970 160105 156704 153889 153115 158806 171941 182646 181134 190303 196873 191004 183422 183457 182327
13294A82327j800K81k912K392J009l762o17k111j171q569n319K912m182q153j9772
13279A30553k3921k8367l4954l9107k8049k8500k0483j0590j0980O664J8632J4098
13267e5004K1178K5884J7441J7010J0309N836R611J2188M629L608J3143O868J860
13254I4561j840L104O05j854j326n388J220l458n002k911j400R677o48l947M236
13239H5629N171M440p31L850j083l91m99J614k50K141K182N20K426K864P838q017
13223A07704o491p083o777j654k956l156k80N464N665P961q14n930j087Q075M194
13208A02835l131o217k882N699j053p675m442N072R493L34m970p93J419J231o162
13193H8758j2440m926k022L09K142K966K071L943O73O537m291j955O823P986O184
$$ plain form
13294 182327 180527 180808 177896 180288 181297 177535 176918 174807 173636 165067 159748 162660 158478 150325 130553
13279 130553 106632 78265 43311 4204 -23845 -52345 -72828 -83418 -94398 -87734 -69102 -55004
13267 -55004 -33826 -7942 9499 26509 36818 42654 52265 64453 69082 72690 85833 92701 94561
13254 94561 92721 95825 96430 94576 93250 87862 89082 85624 80622 77711 76311 85988 85340 81393 85629
13239 85629 90800 95240 94509 98359 97276 96885 96386 98000 97750 99891 102073 102593 105019 107883 115721 107704
13223 107704 101213 94130 87353 85699 82743 79587 79307 84771 90436 98397 97583 91653 90566 98641 102835
13208 102835 99704 93487 90605 96304 95251 87576 83134 88206 97699 98033 93063 92270 93689 94920 88758
13193 88758 76318 71392 69370 69679 71821 74787 76858 80801 81474 88011 83720 81765 88588 96574 102758
13178A02758K197j389n34M18J004k399j1194o037n557M254R728l254j1257l939
13164G4799o118J972N932j962L234O527j02n246p947P339R295K316j723O260j53
13149I4423m144L137N77q485J021k242K645K68K204n961q258j520J746L041l185
13134G5267L812k040J0088O526K061K150l330j0242J426N832K506J0594J67r37
13120A03880J330M845K219L606K015Q21P484J347P246J8598J1078R163J8427J2608
13106B04667K7339M3971O3217Q9407J37698J93326K26243K66224K21403J36012
13096A609507R2380n009j08627j57719j92751j93809j96336j72637j39777r8963
13086D36259p4483n2094l8090k4420j6057j6349j3775p283o533j0349q110j4311
$$ plain form
13178 102758 104955 103566 103032 103450 104454 102055 90861 84824 79267 83521 93249 89995 78738 74799
13164 74799 68681 70653 76585 74623 77857 84384 84282 79036 71089 78428 87723 90039 88316 94576 94423
13149 94423 90279 93416 93993 85508 86529 84287 86932 87200 89404 83443 75185 73665 75411 78452 75267
13134 75267 79079 77039 87127 93653 95714 97864 94534 84292 85718 91550 94056 104650 104817 103880
13120 103880 105210 110055 112274 115880 117895 118716 126200 127547 134793 153391 164469 173632 192059 204667
13106 204667 232006 275977 339194 428601 566299 759625 985868 1252092 1473495 1609507
13096 1609507 1701887 1696878 1588251 1430532 1237781 1043972 847636 674999 535222 436259
13086 436259 361776 309682 271592 247172 231115 214766 200991 193708 187175 176826 168716 154405
13074A54405n515n124j0109j1586k494k283m443r165p541j75J933N063K184o252
13060I8898n348n207J079L595P97j608j173N783l949l912q475j0763L024P556
13046H0297L600q57J880m710l835j707M108o620L497k158q87L438k566o16k878
13031F9986k888J0484O488l536m734r81j528N329K653l017j134r700n117J343
13017F3648M213J03k955j22o247m376P077J594o14K900K223L031J034p985r30
13002F2594M572K280M660n872k667n262j79Q262j166l409J083p21m023r93q19
12987E8340k307m342M766L751J501J451L451l66J312q2j857p7m316j88k023L729
12971F2743j346j970j737j998J29Q418M164n409k003j482L805K111J557J003J162
$$ plain form
13074 154405 148890 143766 133657 122071 119577 117294 112851 103686 96145 95970 97903 102966 105150 98898
13060 98898 93550 88343 89422 93017 93814 92206 91033 96816 92867 88955 80480 69717 72741 80297
13046 80297 83897 83040 84920 80210 76375 74668 78776 72156 75653 73495 72608 76046 73480 72864 69986
13031 69986 67098 77582 84070 80534 75800 74819 73291 78620 81273 78256 77122 67422 62305 63648
13017 63648 67861 67964 65009 64887 58640 54264 61341 62935 62321 65221 67444 70475 71509 63524 62594
13002 62594 67166 69446 74106 68234 65567 60305 60126 68388 67222 63813 64896 64175 60152 59159 58340
12987 58340 56033 51691 56457 60208 61709 63160 66611 66245 67557 67475 65618 65541 61225 61037 59014 62743
12971 62743 61397 59427 57690 55692 55821 64239 68403 62994 60991 59509 63314 65425 66982 67985 69147
12956F9147j145L391r26j34m329k100R73L810m240n63j345Q48K243j750l465k635
12940E7780m440K483K304l176j705J187m119l081J63Q251K859N119Q229p778n342
12925E8734k217M431L71l80L406J613P96J641n86O03k062j110K768j341l836k957
12909E9874O153L488l437m027P027n554m283k688j335J3597J3905K828k540n353
12895G7655p582k013n45J792N219k6k576k644Q56n773m524k065l218l961L041
12880E3636m257l410M333j928J655J847K243M011l655l766L922P51k628M492j266
12865E5980k277j673L322P976N167m073N896K85J385m376K934l698j947k683j140
12850F1078k078R2K094o203p490P816R760p229j162m80j767n083K561O288M253
$$ plain form
12956 69147 68002 71393 70467 70333 66004 63904 64877 68687 64447 63884 62539 63387 65630 63880 60415 57780
12940 57780 53340 55823 58127 54951 53246 54433 50314 47233 47396 55647 58506 63625 71854 64076 58734
12925 58734 56517 60948 61319 60939 64345 65958 66754 68395 67809 68412 66350 65240 68008 66667 62831 59874
12909 59874 66027 69515 66078 62051 69078 63524 59241 56553 55218 68815 82720 85548 83008 77655
12895 77655 70073 68060 67515 69307 74526 74500 71924 69280 70136 64363 59839 57774 54556 50595 53636
12880 53636 49379 45969 50302 48374 50029 51876 54119 58130 54475 50709 54631 55382 52754 57246 55980
12865 55980 53703 52030 55352 63328 68495 64422 70318 70603 71988 67612 70546 66848 64901 62218 61078
12850 61078 59000 59092 61186 54983 47493 55309 65069 57840 56678 56198 54431 49348 51909 58197 62450
12835F2450J54p11j253M937K813k857k222n176J652k097M918J2370m102k386J310
12820F9800M521K900l152j2144p948k255M272J952j265l438j9j541P05N6j094
12805E1350k199k67R646K919k87m645j0442m7J030j120k160O482n444p82Q346
12790E2380M808j606m116m734M863Q741j836q566Q84q27l01N245Q182j279k766
12775E9072m68J001p128j197P962K255k383p969P472M252N345k115r436j207O695
12760F2151K444k589p78j141J649m475j375O797K791l082O49k086o643l305K692
12745E3699n621K148L931k597O72L766k318m320n94n51K232J426m369k575O717
12730E1646L180K82j602M622L567m240n015m076p426K885N392J57j877l854L820
$$ plain form
12835 62450 62604 61893 60640 65577 68390 65533 63311 58135 59787 57690 62608 74978 70876 68490 69800
12820 69800 74321 77221 74069 61925 53977 51722 55994 57946 56681 53243 53224 51683 52388 52444 51350
12805 51350 49151 48884 58530 61449 61162 56517 46075 46028 47058 45938 43778 50260 44816 44034 52380
12790 52380 57188 55582 51466 46732 51595 60336 58500 49934 50818 49991 49690 54935 63117 61838 59072
12775 59072 58604 59605 52477 51280 59242 61497 59114 51145 58617 62869 68214 66099 56663 55456 62151
12760 62151 64595 62006 61228 60087 61736 57261 55886 62683 65474 62392 63041 60955 54312 51007 53699
12745 53699 48078 50226 54157 51560 52232 55998 53680 49360 48766 48215 50447 51873 47504 44929 51646
12730 51646 54826 55108 53506 58128 61695 57455 52440 48364 40938 43823 49215 49372 47495 43641 47461
12715D7461R240L737k782n583l764o74l089N921J095m954k523j234j145j215K337
12700D2828l51O685O092P578k559j631j1136J676l816n31L305n956N938R400M567
12685F2089o631l149J968K212m2n534P394L685l982k360J748j17l920m777j515
12670D7069l960K198N237J651J886j739M66M183n348l670l967k94j508K92O58
12655D3154j606J392K986n43k636p22N220Q619J751m871l688M77N685j678P008
12640F0548L980J053p634p217L080J673Q94M360K329n53k502l995l075q43m54
12625E1644K390K8J334p046K115Q151k394k762k004J2689O93n082k83q288j713
12610D9472k317JJ928l93L445Q997j691K202l187q167j946M825J611m059K520
$$ plain form
12715 47461 56701 60438 57656 52073 48309 47635 44546 50467 51562 46608 44085 42851 41706 40491 42828
12700 42828 42477 49162 55254 62832 60273 58642 47506 49182 45366 44835 48140 42184 48122 57522 62089
12685 62089 55458 52309 54277 56489 56447 50913 58307 61992 58010 55650 57398 57281 53361 48584 47069
12670 47069 43109 45307 50544 52195 54081 52342 52808 56991 51643 47973 44006 43712 42204 42496 43154
12655 43154 41548 42940 45926 45383 42747 42025 47245 55864 57615 52744 49056 49533 55218 53540 60548
12640 60548 64528 65581 57947 50730 53810 55483 56377 60737 63066 62513 60011 56016 52941 52098 51644
12625 51644 54034 54062 55396 48350 50465 58616 56222 53460 51456 64145 64838 59756 59473 51185 49472
12610 49472 47155 47156 49084 48691 52136 61133 59442 61644 58457 50290 48344 53169 54780 50721 53241
12595E3241M778l128K850M517J056n736l841o544M396L234k088L839p93M189K122
12580F2092N666k050q895M082M598J107L808j111l577o345n272M33O979N368m906
12565F1977p806m976j201P458O678n34n662l548r01P297J654l615n794K530O6
12550E3623J82j451P172O636L841P176N08j069R81K44J265m665k316J0255O896
12535H9278j562l219p775l358P73o119o730J487M548L433P36M928m414j680m952
12520F5374L529J181o342M369M664j551K784l755p13L603P11j04j147k351L157
12505G3409L576J630n050j0952p018N377N750J262l598N791L317J197k603R15
12491G3003n032j706O706O215N43n098o750L152J668J552j872l203l913l250J042
$$ plain form
12595 53241 58019 54891 57741 62258 63314 57578 53737 47193 51589 54823 52735 56574 55781 59970 62092
12580 62092 67758 65708 56813 60895 65493 66600 70408 69297 65720 59375 54103 54536 61515 66883 61977
12565 61977 54171 49195 47994 55452 62130 61596 55934 52386 51485 58782 60436 56821 51027 53557 53623
12550 53623 53805 52354 59526 66162 70003 77179 77687 76618 77599 77843 79108 74443 72127 82382 89278
12535 89278 87716 84497 76722 73364 74137 68018 61288 62775 67323 70756 71492 76420 72006 70326 65374
12520 65374 68903 70084 63742 68111 72775 71224 74008 70253 69540 73143 73854 73750 72603 70252 73409
12505 73409 76985 78615 73565 62613 55595 60972 66722 67984 64386 70177 73494 74691 72088 73003
12491 73003 67971 66265 72971 79186 79729 74631 67881 71033 72701 74253 72381 69178 65265 62015 63057
12476F3057j07J98J183j064m851Q92l286O562M0J718l700J747N034P607J839o905
12460F9964k619j199j55o048l761J514L62J516J051L493Q039Q96k004m59m112
12445F6478p420k496k36P51Q825J540k741m186K397M549K112q359r43j143P379
12430F6507P922p72p845m589J377r31r77P758q50K39M641N601l495o619k083n50
12414F5334n85j105l141k517J646M004l618R774O986K144K414K555l039R807M264
12399I4923l465j167k081k159N168k256q469l374K533l946k032O261M631N072
12385H9639K727m468m493L547J103m339m376m76O761J189o190m188o318k054k565
12370F5499N330L989r66L729N122k237j408K499O794n7K754M721J636o534m011
$$ plain form
12476 63057 62950 63148 64331 63267 58416 59308 56022 62584 62624 64342 60642 62389 67423 75030 76869 69964
12460 69964 67345 66146 65991 59943 56182 57696 58058 59574 60625 64118 72157 73053 71049 70590 66478
12445 66478 59058 56562 56326 57077 65902 67442 64701 60515 62912 67461 69573 61214 60271 59128 66507
12430 66507 74429 73657 65812 61223 62600 61669 60692 68450 67600 67839 72480 78081 74586 67967 65884 65334
12414 65334 64749 63644 60503 57986 59632 63636 60018 69792 76778 78922 81336 83891 80852 90659 94923
12399 94923 91458 90291 88210 86051 91219 88963 80494 77120 79653 75707 73675 79936 84567 89639
12385 89639 92366 87898 83405 86952 88055 83716 79340 78864 85625 86814 80624 76436 70118 68064 65499
12370 65499 70829 74818 73852 77581 82703 80466 79058 81557 88351 88294 91048 95769 97405 90871 86860
12355H6860J447J0141J828m416M70Q247O125k070j623m642K10O523J731k995q247
12340I9589m993J825L669J711j091p386n069R916M296K090K262K626o39o62P243
12325A15387K843n302n406j213M418Q970p1K380j438j730M541L732J647l005n993
12310A19760k402M94r857k712j647J766M937J569j324J526l887k003M921j673
12296A09468k693L143N039m802l277l892M73N211K924k151r61j402M421N448N123
12281A22072M660k237j556O717N813l851l088M278j240Q0m168k144J67J1p563
12266A17951J368M890o4k110j474m424Q417N696l330K306L340R700M27q189n523
12251A28981k496L81L915K026L43l660K031k769K551N496O03Q54R16P881O767
$$ plain form
12355 86860 88307 98448 100276 95860 96330 104577 110702 108632 107009 102367 102577 109100 110831 107836 99589
12340 99589 94596 96421 100090 101801 100710 93324 88255 98171 102467 104557 106819 109445 108806 108144 115387
12325 115387 118230 112928 107522 106309 110727 119697 119626 122006 120568 118838 123379 127111 128758 125753 119760
12310 119760 117358 117852 107995 105283 103636 105402 110339 111908 110584 112110 108223 106220 111141 109468
12296 109468 106775 109918 114957 110155 106878 102986 103459 108670 111594 109443 108482 107080 111501 116949 122072
12281 122072 126732 124495 122939 129656 135469 131618 128530 132808 131568 131648 127480 125336 125503 125514 117951
12266 117951 119319 124209 124145 122035 120561 116137 124554 130250 126920 129226 132566 142266 142693 134504 128981
12251 128981 126485 126866 130781 132807 133150 129490 131521 128752 131303 136799 137402 138256 139172 147053 153820
12236A53820L319r288J179M036M528M092R19l554K923L205j088K578l336J034
12222A64367J720n082K613j737m855N072j426j166J2757K343N383L187j291k928
12208A78957m720l146J184K106j55K164L807O79N721J985k581l321K993J1576
12194A97249Q67m647j445O146m101n427Q60Q011K638L384Q97j017K683J992R036
12179B17126J0698M07m639r7M595L315o219r34J325K800q22L193N15m147K343
12164B29459L730K202K1L311M290O813q83m034J523K333k834O41K40n233k302
12149B39277J2560L095J921Qm458k200k097r278k595M724M661O425K135Q398O693
12134B69269O60R85l512k508m29K185k091P34l680l448Q97o16p491j668J793J741
$$ plain form
12236 153820 157139 147851 149030 153066 157594 161686 162605 159051 161974 165179 164091 166669 163333 164367
12222 164367 166087 161005 163618 161881 157026 162098 160672 159506 172263 174606 179989 183176 181885 178957
12208 178957 174237 171091 172275 174381 174226 176390 180197 180876 186597 188582 186001 182680 185673 197249
12194 197249 198116 193469 192024 198170 194069 188642 189502 197513 200151 203535 204432 203415 206098 208090 217126
12179 217126 227824 228231 223592 223495 228090 231405 225186 224252 225577 228377 227555 230748 231263 227116 229459
12164 229459 233189 235391 235412 238723 243013 249826 248943 244909 246432 248765 245931 246572 246812 241579 239277
12149 239277 251837 254932 256853 256861 252403 250203 248106 238828 236233 240957 245618 252043 254178 262576 269269
12134 269269 269929 270914 267402 264894 264465 266650 264559 265293 261613 258165 259062 258446 250955 249287 251080 252821
12118B52821K291m50P600n354l563K873q47k650m354k253l615J1090R828k918
12104B60499o091j073L162k96q562Q68m596m734p481j843J474l124M116L554q137
12089B27736p20M586p649p174K873m083K513P76P34J277r401m645K475R529M83
12074B19310o790l197m090M482J681M559l44q410m908O57J624k037j288j925r42
12059A98382K455n97l612n89m9m467m79m91n777m376R47p961l187M467K468N395
12043A82529j040q37K233K14l46j2828m700K950L749O19J63j089j716l103m488
12028A62310j883l998J215L836o797n861J344K911j998P175k64j346J358M00N344
12013A63746K0l998l853r479q584r108k324N396k91l94P229K706L237m620k919
$$ plain form
12118 252821 255112 254662 262262 256908 253345 256218 255371 252721 248367 246114 242499 253589 263417 260499
12104 260499 254408 253335 256497 256201 247639 248507 243911 239177 231696 229853 231327 228203 232319 235873 227736
12089 227736 227016 231602 223953 216779 219652 215569 218082 218858 219592 220869 211468 206823 209298 218827 219310
12074 219310 212520 209323 205233 209715 211396 215955 215611 207201 202293 202950 204574 202537 201249 199324 198382
12059 198382 200837 200240 196628 196039 195990 191523 191044 190553 184776 180400 181347 173386 170199 174666 177134 182529
12043 182529 181489 180652 182885 183099 182753 169925 165225 168175 171924 172543 172706 171617 169901 166798 162310
12028 162310 160427 156429 157644 161480 154683 148822 150166 153077 151079 158254 157990 156644 158002 158402 163746
12013 163746 163766 159768 155915 146436 137852 128744 126420 131816 131525 131131 138360 141066 144303 139683 136764
11998A36764N57N084J65p893o227N358j5j781j295q183n956L348J258j658k526
11983A17000l82J12K279J816k080m696M204K003l937k42k948m799l858m170L432
11968A03734O538J809J220J741K947l250k247j755q273j884J828L251K338j819
11954A06178k345L099K586J18M47j886l468n288j355j204o597O126P350k716p395
11939I3650K9J08l459l818j39Q921J206j369j684m516J773J865l272n527j217
11924H2551n902O015O312J676P011M081M022r087m638q4O75L091j237r473k408
11909H2605R596k498o227J249P92m342k760N798K118J056j381m661o697J141L917
11894G9706O21K700M590l336n24K351o153k348R93J520M938Q987p42j0105m894
$$ plain form
11998 136764 137321 142405 142570 134677 128450 133808 133793 132012 130717 122534 116578 119926 121184 119526 117000
11983 117000 116618 116730 119009 120825 118745 114049 118253 120256 116319 116077 113129 108330 104472 100302 103734
11968 103734 110272 112081 113301 115042 117989 114739 112492 110737 102464 100580 102408 105659 107997 106178
11954 106178 103833 106932 109518 109636 110083 108197 104729 99441 98086 96882 90285 96411 103761 101045 93650
11939 93650 93679 93787 90328 86510 86371 95292 96498 95129 93445 88929 90702 92567 89295 83768 82551
11924 82551 76649 82664 88976 90652 97663 101744 105766 96679 92041 91957 92632 95723 94486 85013 82605
11909 82605 92201 89703 83476 84725 85517 81175 78415 84213 86331 87387 86006 81345 74648 75789 79706
11894 79706 80327 83027 87617 84281 83757 86108 79955 77607 78600 80120 85058 94045 93303 83198 78304
11879G8304J331M685K206m613p674N79p08K682J863N928K226j2367k475N538Q425
11864H5930j880r397M544P117Q619n100m743L102m198m101r96m175L949M163o201
11849G6633j016M032k079J771j325o160j256j265q00N90L776N127L291j758M667
11834H4228p15l425n718m013n024J869K965N973M235j183l342k067r00k976J018
11819G0925j620J983l07m965O91K663J808J916j717K912l941N700J847J958K996
11804H2849r11m380n606K420l485q524M729J0217K55r057q926j054p86O063N616
11789F9420j880l028M899K711K320j060L254M883q163r889l921R01M43M815R209
11774G4914N423N35n876k260o558j1037j00J538l531k452N498L475N153O39l185
$$ plain form
11879 78304 79635 84320 86526 81913 74239 74818 74110 76792 78655 84583 86809 74442 71967 77505 85930
11864 85930 84050 74653 79197 86314 94933 89833 85090 88192 83994 79893 78897 74722 78671 82834 76633
11849 76633 75617 79649 77570 79341 78016 71856 70600 69335 68535 69125 72901 78028 81319 79561 84228
11834 84228 83513 80088 74370 70357 65333 67202 70167 76140 80375 79192 75850 73783 72883 69907 70925
11819 70925 69305 71288 70981 66016 66707 69370 71178 73094 71377 74289 70348 76048 77895 79853 82849
11804 82849 81938 77558 71952 74372 70887 62363 67092 77309 77564 68507 59581 58527 57741 63804 69420
11789 69420 67540 64512 69411 72122 74442 73382 76636 81519 73356 63467 59546 60447 60890 65705 74914
11774 74914 80337 80872 74996 72736 66178 55141 55041 56579 53048 50596 56094 59569 64722 65361 62176
11759F2176J703R82N425Q525n266l136k682L291k520k735j615n525o71Q120J607
11744F7679K32k620r51N772l28k973m34L518q07j74l240k966j058P515K957p186
11728F4936o816k111j816R07j529m445M438p854j969J0440m734j93N763Q642k115
11713F1544J694R634p54p537l428n425k23k693K895J05J653p085k113k169Q040
11698E4138R791M033r48L100J247N60K41o50q86m604O46Q097P71k464q62P44j208
11681G1746k990O20o11n612r082Q199Q925N129m329k576O334k733K389O214O438
11666H8061O596L409O98M459M62m265j02j100k030m227k231r707r246J378M83
11651G2638p14J449j364J65j292m405l721K769R964N4l729j82q061k570K73K677
$$ plain form
11759 62176 63879 64861 70286 78811 73545 70409 67727 71018 68498 65763 64148 58623 57952 66072 67679
11744 67679 67911 65291 64340 70112 69784 66811 66377 69895 69088 68914 65674 62708 61650 69165 72122 64936
11728 64936 58120 56009 54193 55100 53571 49126 53564 45710 43741 54181 49447 49254 55017 63659 61544
11713 61544 63238 72872 72118 64581 61153 55728 55505 52812 55707 55812 57465 50380 48267 46098 54138
11698 54138 63929 67962 67014 70114 71361 71921 72162 71512 70626 66022 66668 74765 75536 73072 72210 72954 71746
11681 71746 68756 69376 68765 63153 54071 62270 71195 76324 71995 69419 75753 73020 75409 81623 88061
11666 88061 94657 98066 98764 103223 103685 99420 99318 98218 96188 91961 89730 80023 70777 72155 72638
11651 72638 71924 73373 72009 72174 70882 66477 62756 65525 75489 75543 71814 71632 63571 61001 61274 63951
11635F3951O491L961q841q585J102l617P671N276l172J220m231mJ4n44J412q04
11619F1300j80N487l040m764l16K279O19K42M355j839J243j518M337o83l631j887
11603F2004k671k684J626O543J489l55K276k315o745K716k33r523m150J027j015
11588D7990N41M066Q098k154j06P054l43j200k26Q284m484q737K004N667J587
11573F8041l840m945O21O45K555k178n533O595O141l970n177K492J713P22j432
11558F2450l595k471K141P837N750l231j327n475J078k269J2M873j21l573N770
11543F7849J450n014J995O889j100r257j167M246N280m78n104j137M233p169m848
11528E6668M207j301l411K992P447M158l700l75J836K583L92N077l352J176p7
$$ plain form
11635 63951 70442 74403 65562 56977 58079 54462 62133 67409 64237 65457 61226 61222 61236 60692 62104 61300
11619 61300 61120 66607 63567 58803 58487 60766 61385 61627 65982 64143 65386 63868 68205 67522 63891 62004
11603 62004 59333 56649 58275 64818 66307 65952 68228 65913 59168 61884 61651 52128 47978 49005 47990
11588 47990 48531 52597 60695 58541 58435 65489 65146 63946 63720 72004 67520 58783 60787 66454 68041
11573 68041 64201 59256 59877 60522 63077 60899 55366 61961 68102 64132 58955 61447 63160 63882 62450
11558 62450 58855 56384 58525 66362 72112 68881 67554 62079 63157 60888 60900 65773 65652 62079 67849
11543 67849 69299 64285 66280 73169 72069 62812 61645 65891 71171 70693 65589 64452 68685 61516 56668
11528 56668 60875 59574 56163 59155 66602 70760 67060 66685 68521 71104 71496 76573 73221 74397 74320
11513G4320n920m043n421o214M209O519J213m113o116N334R739L299m004o873
11499F1929l74N806O105m425m982k567J863l508P720O330n599n769p83l841K79
11484E8184Q303j805p539O078K572m018O29M359P213j89j0637m107J677j342K013
11469F1391l139l462K931l845K911J120l961K299l195m784m648J378Q095L838
11455E6929N567L875p328O31Q615M538J036l725o73M083j1030j146J0097M189
11441G5658K831j034m124r414J28O502K29r53O354j443q440j796N041M987J958
11426G6484M49Q888O72l612J710l566o974L809J563N355P31k716m927k073p962
11411F7831K356M291R9M656l757M30p123p995M433Q116k374o5m994J639J836M100
$$ plain form
11513 74320 68400 64357 58936 52722 56931 63450 64663 60550 54434 59768 69507 72806 68802 61929
11499 61929 61555 67361 73466 69041 64059 61492 63355 59847 67567 73897 68298 62529 61746 57905 58184
11484 58184 66487 64682 57143 63221 65793 61775 62404 66763 73976 73787 63150 59043 60720 59378 61391
11469 61391 58252 54790 57721 53876 56787 57907 53946 56245 53050 48266 43618 44996 53091 56929
11455 56929 62496 66371 59043 59674 68289 72827 73863 70138 69465 73548 62518 61372 71469 75658
11441 75658 78489 77455 73331 63917 64045 70547 70776 69823 76177 74734 66294 64498 69539 74526 76484
11426 76484 76933 85821 86493 82881 84591 81025 74051 77860 79423 84778 85509 82793 77866 75793 67831
11411 67831 70187 74478 74577 79233 75476 75906 68783 60788 65221 73337 70963 70898 65904 67543 69379 73479
11395G3479n77n620m140k720K87j920N49O30J60P478R690n776n218J887J86Q4
11379F8459k166J65J551M860N929k694m417n503j521j574K339l988n330k724j753
11364E1633K106l008q67L726K047N222M926Q83J116N658M329L432l351j476n134
11349G1242k226O015K256o834j724J302M104q11k776N582l129n522k264l703P29
11334F2241K67J4526M504n994k107J804J391J73K675J066Q4J1J2m050j806J772
11318G6569n59k257n233L277L464j723k082q42L625Q57j743l743k002m108o726
11303E6774k527P410O098m06M88M256j429K163m497J448M744k912O18J986J376
11288G5590J102n654k316l199k724O034N431k90O423k417p460K540K762k297O42
$$ plain form
11395 73479 72902 67282 63142 60422 60709 58789 59338 59968 60128 67606 77296 71520 66302 68189 68375 68459
11379 68459 66293 66458 68009 72869 78798 76104 71687 66184 64663 63089 65428 61440 56110 53386 51633
11364 51633 53739 50731 49864 53590 55637 60859 65785 66668 67784 73442 77771 81203 77852 76376 71242
11349 71242 69016 75031 77287 70453 68729 70031 74135 73324 70548 76130 73001 67479 65215 61512 62241
11334 62241 62508 77034 81538 75544 73437 75241 76632 76805 79480 80546 80630 80641 80653 76603 74797 76569
11318 76569 76010 73753 68520 71797 75261 73538 71456 70614 74239 75096 73353 69610 67608 63500 56774
11303 56774 54247 61657 67755 67349 67837 72093 70664 72827 68330 69778 74522 71610 72228 74214 75590
11288 75590 76692 71038 68722 65523 62799 68833 74264 73974 80397 77980 70520 73060 75822 73525 74167
11273G4167K844K000J016n532p517l884P178J0636M307p799K027L54l70k99J238
11258H0366m226o07K300L235L896L782k429M612J92q326J385J083k652K808J860
11243H7279j39j298o184l839k133j243K230q81O922R23L854k992o689K706Q907
11228H7423P162l867n192l746L630o835m163Q83J017R56o774K31M267M221r70
11213G8243P907Q75l08K601o46p862r805o069O672L034M426l884J429K015M38
11198G9066n65N121k330Q234O761n106k264l93O30j0140m454n713r84M751M604
11183G7218k226n012k078N981j374N20j764L644O380J487o810m020N052Q080K879
11168H7957J371o35j78p046L698L349o114q848Q192M765qm296K298L295O11K718
$$ plain form
11273 74167 77011 79011 80027 74495 66978 63094 70272 80908 85215 77416 79443 79797 79427 79128 80366
11258 80366 76140 75533 77833 81068 84964 88746 86317 90929 91121 82795 84180 85263 82611 85419 87279
11243 87279 87140 85842 79658 75819 73686 72443 74673 73792 80714 81637 85491 82499 75810 78516 87423
11228 87423 94585 90718 85526 81780 85410 78575 74412 75295 76312 77268 70494 70725 74992 79213 78243
11213 78243 86150 87025 86717 89318 88672 80810 71005 64936 71608 74642 79068 75184 76613 78628 79066
11198 79066 78501 83622 81292 89526 96287 91181 88917 88524 89154 79014 74560 68847 67863 72614 77218
11183 77218 74992 69980 67902 73883 72509 73029 71265 74909 81289 82776 75966 71946 76998 85078 87957
11168 87957 89328 88693 88515 81469 85167 88516 82402 73554 81746 86511 86503 82207 84505 87800 88411 91129
11152I1129k171M592J549k890J412p132p008O381J0962J434p493j40m21j611j595
11137H6998j058j615l427O810Q603K7K667l753k951N202n100l544J483j151k502
11122H6689j712M699N258k632j90k675j853q492j035M204M115N12j552M415L358
11107I3109J850J352J674o013Q99N839N574j409l311r46L868N154p629l535Q88
11092I7364l893r86P98m968k395q666q31Q490O407L434o67m993R707N159M153
11077A08113m307r269o498j164O701k696L952j095O724L714j986O55K939Q70q540
11062I8113k890K425n741k519o618P413r3R05K216q69k79K767m058p67l644L50
11046H6711P709K246m168K803N43n189j796j534K592K698k75k067qK141K835k414
$$ plain form
11152 91129 88958 93550 95099 92209 93621 86489 79481 85862 96824 98258 90765 90625 90204 88593 86998
11137 86998 85940 84325 80898 87708 96311 96338 99005 95252 92301 97503 92403 88859 90342 89191 86689
11122 86689 84977 89676 94934 92302 92112 89437 87584 79092 78057 82261 86376 86888 85336 89751 93109
11107 93109 94959 96311 97985 91972 92871 98710 104284 102875 99564 98618 102486 107640 100011 96476 97364
11092 97364 93471 92485 93283 88315 85920 77254 76423 84913 91320 94754 94087 89094 98801 103960 108113
11077 108113 103806 94537 88039 86875 93576 90880 94832 93737 100461 104175 102189 102844 105783 106653 98113
11062 98113 95223 97648 91907 89388 82770 90183 90090 90995 93211 92342 92063 94830 90772 90005 86361 86711
11046 86711 94420 96666 92498 95301 95844 90655 88859 87325 89917 92615 92340 90273 90265 92406 95241 92827
11030I2827R05Q83o210O125M788p053j326j355m814J399O64L316L133K432K25
11015I5939M125N037N128J711J143J40o376n454m45P89k406k201m653L353N448
11000A01278Q355m306L329r16J130m48J748J410p73M989j521r121o770k649O129
10985A01864N342K165J919l773J042j179j887M104k16r131L972P741J63p340m882
10970I9904M968N803P719m191J198P239P770L665p668k588r96k138r14o141l006
10955A10624j602p661n775P14O234k827l645K218Q234M964L620J618o387k720
10941A07609L311O372Q58m230l208Q95N398N887p21O729n51n522m193K403Q55
10926A21892k29j194N579k855j3080M467K118j603J328o83l635M722M703k472
$$ plain form
11030 92827 93732 94615 88405 94530 99318 92265 90939 89584 84770 86169 86833 90149 93282 95714 95939
11015 95939 100064 105101 110229 111940 113083 113223 106847 101393 100948 101737 99331 97130 92477 95830 101278
11000 101278 109633 105327 108656 107740 108870 108422 110170 111580 110807 115796 114275 105154 98384 95735 101864
10985 101864 107206 109371 111290 107517 108559 107380 105493 109597 109381 100250 104222 111963 112126 104786 99904
10970 99904 104872 110675 118394 114203 115401 122640 130410 134075 126407 123819 122823 120685 119771 113630 110624
10955 110624 109022 101361 95586 96300 102534 99707 96062 98280 106514 111478 115098 116716 110329 107609
10941 107609 110920 117292 118150 113920 110712 111607 117005 122892 122171 128900 128349 122827 118634 121037 121892
10926 121892 121663 120469 126048 123193 110113 114580 116698 115095 116423 115740 112105 116827 121530 119058
10912A19058k398N363Q554K607R81O96n140j0891l101J933L106P608J840M214
10898A34430m225j0233n062M304Q241J792K729N818m475k484j437k574p016j555
10884A18253M191J0949O998n845o153r58M81M497j704K133J726n958m192m786
10870A19632J494O910O997K895k440j076K102l976L095J276o5k17K536N223o576
10855A37810k437M384L9J707l802o577j737K560M84l406J885O423Q79M662N294
10840A48168o84P000l669j513K001n531k526N246m25n775n268O574N405K702J853
10825A53558J576P67l614j498J936M467k662j370P27n65J091M936L903m931N579
10810A63900J343m17R37k390o708j598k036L113p826L12j586n35K036L410k506
$$ plain form
10912 119058 116660 122023 130577 133184 134165 134861 129721 118830 115729 117662 120768 128376 130216 134430
10898 134430 130205 119972 114910 119214 127455 129247 131976 137794 133319 130835 129398 126824 119808 118253
10884 118253 122444 133393 140391 134546 128393 127435 127916 132413 130709 132842 134568 128610 124418 119632
10870 119632 121126 128036 135033 137928 135488 134412 136514 132538 135633 136909 136844 136627 139163 144386 137810
10855 137810 135373 139757 139796 141503 137701 131124 129387 131947 132431 129025 130910 137333 138212 142874 148168
10840 148168 147484 154484 150815 149302 151303 145772 143246 148492 148067 142292 137024 143598 149003 151705 153558
10825 153558 155134 155901 152287 150789 152725 157192 154530 153160 153887 153322 154413 159349 163252 158321 163900
10810 163900 165243 164826 165763 163373 156665 155067 153031 156144 148318 148630 147044 146509 148545 151955 149449
10795A49449j597M743P415QJ251J022M608Q023Q334L317p47R74J692J723K275
10780A92490Q675J2270J0844J8588K3500J0047p212o898m828J948n669r539q76
10767B43340M792Q870J7477K2321J8868K4945L5280L6804M9858P4075J20496J82305
10755H39431K72745L37882L94863L98927K41794J67204K3145j63778k38774l11586
10745A961853l15453k95886k68907k12749j67630j28196q2205o0678l7028k8019
10735C65102j6472m153r430j5398j2500j5136j3944l963p071n668j601n049m039
10722B50678k90K788j625o495n995p346J287l877k615j344o782j4413r679j810
10708A92482L220p38N309M736O589r48J287N585p327o299J407K717J849m85p041
$$ plain form
10795 149449 147852 152595 160010 160018 161269 162291 166899 174922 183256 186573 185826 186800 188492 190215 192490
10780 192490 201165 213435 224279 242867 266367 276414 269202 262304 257476 259424 253755 244216 243340
10767 243340 248132 257002 274479 296800 315668 340613 375893 412697 462555 536630 657126 839431
10755 839431 1112176 1450058 1844921 2243848 2485642 2652846 2675991 2512213 2273439 1961853
10745 1961853 1646400 1350514 1081607 868858 701228 573032 490827 430149 393121 365102
10735 365102 348630 344477 335047 319649 307149 292013 278069 274106 267035 261367 259766 254717 250678
10722 250678 250388 253176 251551 245056 239061 231715 233002 229125 226510 225166 218384 203971 194292 192482
10708 192482 195702 194964 200273 205009 211598 210650 211937 217522 210195 203896 205303 208020 209869 209384 202343
10693B02343L306J1271K676l109O326P631P825j847l519Q611l40k891M953O418
10679B49654j289m788l402O36P775J303K230J431O4m273p044J471j227L062Q083
10664B53686K685L805Q822J1201J1695J6308J9853J9341K7545L7023M1626M1483
10652D95073M6192L6001N972l710p016l5978m2220n1205n1202m9136l8730l1118
10640B72923j8092j9602j0767k655j63J1166J1021J8168K0347J1908N439o269
10628B93424j3044j1828j2360j8770j8776j3704l5J334R057Q358R595R447J2166
10615B54864R076k552R076R414O821J3471J5749O231J2418K3929J8762J7624K4195
10602D19078K0698J9726O925J4011Q063K1127K5973J7829M9845M6048M9719N5796
$$ plain form
10693 202343 205649 216920 219596 216487 222813 230444 238269 236422 232903 241514 241174 238283 243236 249654
10679 249654 248365 243577 240175 240811 248586 249889 252119 253550 253614 249341 242297 243768 242541 245603 253686
10664 253686 256371 260176 268998 280199 291894 308202 328055 347396 374941 411964 453590 495073
10652 495073 541265 577266 583238 579528 572512 536534 494314 443109 391907 342771 304041 272923
10640 272923 254831 235229 224462 221807 221644 232810 243831 261999 282346 294254 299693 293424
10628 293424 280380 268552 256192 237422 218646 204942 204907 206241 215298 223656 233251 242698 254864
10615 254864 263940 261388 270464 279878 286699 300170 315919 322150 334568 358497 377259 394883 419078
10602 419078 439776 459502 466427 480438 488501 509628 535601 553430 603275 649323 699042 754838
10590G54838N0478O4840J00228J30510J94616K41659K66378L01211K53042J61919
10580B519719J13260l7750j40681k01755k64369k68777k65929k35472j91431j56563
10570H70252j24158q7769o6925n2854l1935j9512j3039k0609k2866j7453k4482
10559C88650j8242p698N125j356N31J690l821k420P06r26o867j2825o687r498
10545C26362j2363j5023l634K752P050J3080J8169J8422J6230J6201R387l319
10533C93314o045K174q267k832L242K872K243J481J0360J1718J0481J1021N874
10520D37636Q489R986J5529L714j0084J482N164J2263J557N000J89j0256j1456
10507D69213j1427p880q879j016N418J4252K4144J7679J1674J6257K2416J6981
$$ plain form
10590 754838 805316 870156 970384 1100894 1295510 1537169 1803547 2104758 2357800 2519719
10580 2519719 2632979 2595229 2454548 2252793 1988424 1719647 1453718 1218246 1026815 870252
10570 870252 746094 658325 591400 538546 506611 487099 474060 453451 430585 413132 388650
10559 388650 370408 362710 367835 366479 367010 368700 364879 362459 363165 362239 355372 342547 335860 326362
10545 326362 313999 298976 295342 298094 305144 318224 336393 354815 371045 387246 396633 393314
10533 393314 387269 389443 381176 378344 381586 384458 386701 388182 398542 410260 420741 431762 437636
10520 437636 446125 456111 471640 475354 465270 466752 471916 484179 485736 490736 490925 480669 469213
10507 469213 457786 449906 441027 440011 445429 459681 483825 501504 513178 529435 551851 568832
10495E68832J6287J9088K1504K7954M0150N1817N0575L4760M2048M4380L3118
10484I50513K5200K1148N985J7870K2192j0120m4215m1487k6126p910J0136J6050
10472I39236P705M0676K9849K53L2338n757J0456J6770O438L0653M6132P5241
10460A229990J01178J36593J61087J11495P9480L4528n2061r5249j23354j22358
10450A461329j16901j14313j00965p3829n6933l7967j7426j6753M163J5570K2016
10439I67991L4562L4432L8426M6545M7484L3893K1307K3080J6948J8778L3067
10428A316513J4816J6277L2634J3642J1456N749n482J943k280j0975P688J2570
10416A414551k428K836J8052K0744J4994K4255L7972M0074N3830O5720N4630N3130
$$ plain form
10495 568832 585119 604207 625711 653665 693815 745632 796207 830967 873015 917395 950513
10484 950513 975713 996861 1002846 1020716 1042908 1032788 988573 947086 920960 913050 923186 939236
10472 939236 946941 987617 1017466 1017719 1050057 1044300 1054756 1071526 1077964 1108617 1154749 1229990
10460 1229990 1331168 1467761 1628848 1740343 1819823 1854351 1802290 1707041 1583687 1461329
10450 1461329 1344428 1230115 1129150 1055321 998388 960421 942995 926242 930405 945975 967991
10439 967991 1002553 1036985 1075411 1121956 1169440 1203333 1224640 1247720 1264668 1283446 1316513
10428 1316513 1331329 1347606 1380240 1393882 1405338 1411087 1405605 1407548 1405268 1394293 1401981 1414551
10416 1414551 1412123 1414959 1433011 1453755 1468749 1493004 1530976 1571050 1624880 1690600 1745230 1798360
10404A798360O2400N5258L7805M3851M7572M0606M3651N0741N9084P1768O5273
10393B376369P3678Q2819P0137O8231Q0210Q6070Q5756Q7132Q2075P0001P2707
10382C235185P4483Q9662J09883J12529J42808J76478K06314K54903L10752L66605
10372E079602M48816N53275O71036P54621Q58732Q38195P43724P64471O58145
10363A1370617O08825P15342Q93245J139963J319964J516193J941404K513646
10355B2019199L179242M000497N035311O581741Q826382J2286120J8178370K8152527
10347A08259389M2794475N5644599O4246355P3323142N3313623L0943451K0573394
10340D49098428j5196479l4744103m5075409n3446378n2304053n1315659m4776863
$$ plain form
10404 1798360 1860760 1916018 1953823 1997674 2045246 2085852 2129503 2180244 2239328 2311096 2376369
10393 2376369 2450047 2532866 2603003 2671234 2751444 2837514 2923270 3010402 3092477 3162478 3235185
10382 3235185 3309668 3399330 3509213 3621742 3764550 3941028 4147342 4402245 4712997 5079602
10372 5079602 5528418 6081693 6752729 7507350 8366082 9204277 9948001 10712472 11370617
10363 11370617 11979442 12694784 13588029 14727992 16047956 17564149 19505553 22019199
10355 22019199 25198441 29198938 34234249 40815990 49642372 61928492 80106862 108259389
10347 108259389 151053864 206698463 270944818 344267960 397581583 428525034 449098428
10340 449098428 433901949 399157846 354082437 300636059 248332006 197016347 152239484
10333A52239484l5864347k7882067j9830536j3478543r363943o812512n155691
10326C3851845m034869l224468k648975k201451j824682j501808j231756j005849
10318A6177987q18562q09557p83576p83176r01610q98986q87095q47326p72059
10309H676040o95125o01194n26990m40330l79752l35658k97281l04750k84611
10300D810349k72661k95635k57566k52036k44092k11524j87365j64712j45723
10291B779035j21812r5421o8237l7446m5581l6752n6338r7294q5979j05547j06331
10280A922297j02157j01144r0774p9753o8289m9988l4604k3572j1276j8579j6566
10269A325595q379q020k742j414J442j162j2359j9391k6043j1036r057j9679k8563
$$ plain form
10333 152239484 116375137 88493070 68662534 55183991 45820048 39007536 33851845
10326 33851845 29816976 26592508 23943533 21742082 19917400 18415592 17183836 16177987
10318 16177987 15359425 14549868 13766292 12983116 12081506 11182520 10295425 9448099 8676040
10309 8676040 7980915 7379721 6852731 6412401 6032649 5696991 5399710 5094960 4810349
10300 4810349 4537688 4242053 3984487 3732451 3488359 3276835 3089470 2924758 2779035
10291 2779035 2657223 2561802 2493565 2456119 2410538 2373786 2317448 2220154 2134175 2028628 1922297
10280 1922297 1820140 1718996 1628222 1548469 1480180 1430192 1395588 1372016 1360740 1342161 1325595
10269 1325595 1317216 1309196 1306454 1305040 1306482 1305320 1292961 1273570 1247527 1236491 1227434 1207755 1179192
10256A179192k4665j1709l973n152p10L651J0275L307N541K4997K8293L3247N1052
10243A293346M2192M2883M0220M3611M8965M5543L8491M0816M6890N5294N4643
10232A792894L8341K5673K6039L0264L7507L5869M5128O4053O3899O0794P1516
10221B291977P2785O1018P1680O8054N9171P3773R2859R9253J15102J46321J54602
10210C306595J63864K11962K23488K56166L03933L47036M16156M95645N91898
10201F316743P01843Q14783Q83692R86179J021917R71398J024106J018185J044756
10192A4783602J223026J472848J847387K342102K949140L779211M788849O219173
10184C9405338Q549595J2152994J7904489K5392270L4228136M5401943N0337190
$$ plain form
10256 1179192 1154527 1142818 1138845 1133693 1132983 1136634 1146909 1150216 1155757 1180754 1209047 1242294 1293346
10243 1293346 1335538 1378421 1418641 1462252 1511217 1556760 1595251 1636067 1682957 1738251 1792894
10232 1792894 1831235 1856908 1882947 1913211 1950718 1986587 2031715 2095768 2159667 2220461 2291977
10221 2291977 2364762 2425780 2497460 2565514 2624685 2698458 2791317 2890570 3005672 3151993 3306595
10210 3306595 3470459 3682421 3905909 4162075 4466008 4813044 5229200 5724845 6316743
10201 6316743 7018586 7833369 8717061 9703240 10725157 11696555 12720661 13738846 14783602
10192 14783602 16006628 17479476 19326863 21668965 24618105 28397316 33186165 39405338
10184 39405338 47954933 60107927 78012416 103404686 137632822 183034765 233371955
10177B33371955N1177731N3241086L5628923K2156346J0460816j4397391k5519428
10170C66120038l6304402m4849213m5196536m4705574l9548926l3082935k6837942
10163I5594510k0216400j4790440j0785646p819151n779983m472258l536718k854226
10155B5339688k314527j907028j576503j359358j260722j141723j122714j125008
10147A3532105j071799j047654r80969q79727p93478p14202o31132n52598m99578
10138F360968m48876m15650l79690l59226l40977l17682l00506k72639k50917
10129C274805k31916k10287j77702j48870j45773j46705j31037j22851j17393
10120A842271j11073j07697r5847q8454q1521o9841o0276m9698m2030m4308l7876
$$ plain form
10177 233371955 284549686 337790772 373419695 395576041 406036857 391639466 366120038
10170 366120038 329815636 284966423 239769887 195064313 155515387 122432452 95594510
10163 95594510 75378110 60587670 49802024 41982873 36202890 31730632 28193914 25339688
10155 25339688 23025161 21118133 19541630 18182272 16921550 15779827 14657113 13532105
10147 13532105 12460306 11412652 10431683 9551956 8758478 8044276 7413144 6860546 6360968
10138 6360968 5912092 5496442 5116752 4757526 4416549 4098867 3798361 3525722 3274805
10129 3274805 3042889 2832602 2654900 2506030 2360257 2213552 2082515 1959664 1842271
10120 1842271 1731198 1623501 1527654 1439200 1357679 1287838 1227562 1177864 1135834 1091526 1053650
10109A053650l2111k6597l3749l4841l7831l6347l6961m1222m8759m3189k6692
10098F55351k5606l2756l1274k5076k2873k5972j7836k0036j9645j7940j6714
10087C99623j9088j4401k2216l2405k9515k2210j3378j5413N23J2827J3482J3012
10075B70841J1533P147J0118j961K697L573r76j4890j9258j2654j0551p459n724
10062B32436n220k917k019K27p259r509n659j713o248j4844j0854r125j6106j4946
10048A26244r985q382p547j695J0334N206O713j6041l5225k9403m4991o0633o3813
10035a29218n7438o1331l3793j8965j1820N336J0286K6803L4565K9140L0691K9755
10023a45989L3018K9278K2214K2087K1006J7940J9267J2604M405R307P801J0272
$$ plain form
10109 1053650 1021539 994942 961193 926352 888521 852174 815213 773991 725232 682043 655351
10098 655351 629745 596989 565715 540639 517766 491794 473958 453922 434277 416337 399623
10087 399623 380535 366134 343918 311513 281998 259788 246410 230997 231520 244347 257829 270841
10075 270841 282374 289521 299639 297678 300375 303948 302972 288082 268824 256170 245619 238160 232436
10062 232436 227216 224299 222280 222507 215248 205739 200080 198367 192119 177275 166421 157296 141190 126244
10048 126244 116259 107877 100330 98635 108969 114175 120888 104847 69622 40219 -4772 -65405 -129218
10035 -129218 -186656 -247987 -281780 -300745 -312565 -307229 -296943 -270140 -235575 -206435 -175744 -145989
10023 -145989 -112971 -83693 -61479 -39392 -18386 -446 18821 31425 35830 45137 52938 63210
10011F3210J0124P599M308m71n486k0182j4070n096q996q279p714j0767m189J3133
9997A3124J2235J3712Q656Q889J7885J6981J4750O073o102L032L674Q960J5672
9984A37541m573p28m112l81M738O864J6501M141j82M355o032L41r788q884j1749
9969A28052j0946m257n028q905j4192K642N448o192j010R300O750k82J618j33
9955A02865K704J41l816l034j045L221m906p681L510Q620N010J1342K1863K2404
9941A61198J4379J9063K7223L5879M4733N8504Q0344J24070J95366K82041L37918
9930A380718M02896L69827K17774J54797k7676j93659k51554k90420k95665k80076
9920A186962k38836j77007j28440p8521j6784O8748J57490J34052j5940j18766
$$ plain form
10011 63210 73334 80933 85241 84770 79284 59102 45032 39936 30940 22661 14947 4180 -9 13124
9997 13124 25359 39071 47727 56616 74501 91482 106232 112305 106203 109235 112909 121869 137541
9984 137541 132968 132240 128128 127747 132485 139349 155850 159991 159809 164164 158132 158473 148685 139801 128052
9969 128052 117106 112849 107821 98916 84724 87366 92814 86622 85612 94912 101662 101380 102998 102865
9955 102865 105569 105710 101894 98860 97815 101036 96130 88449 91959 100579 105589 116931 138794 161198
9941 161198 175577 194640 221863 257742 302475 360979 441323 565393 760759 1042800 1380718
9930 1380718 1783614 2153441 2371215 2526012 2498336 2304677 2053123 1762703 1467038 1186962
9920 1186962 948126 771119 642679 564158 547374 616122 773612 907664 891724 772958
9910G72958r3470m5722m8491q7567j16119q3572m8073l0915l0595l0051j7127
9899A41256j3562q076k971J103Q228j787P04R94P85J726j371q468o554J614n1
9884A13570m615r499q021n447k286o978j1842r857j931j0032j7587k6742l0575
9871c1842m6289m3257m6937m8281l4591k8986j2020k230N101J5148J8460K8117
9859b27607L2612K3712K1341J9859J9401K0027K1068K0686J1429J0413J0640J326
9847a5093J816O321k9K382k317q541L72P855K937J66P354R677J4136L2690M2057
9832A01783L8452k54j1179k200J2472K8508J9094k8599l8083k4673j3430j2637
9820F9254k0408k0746k678l949p380p448j0288L563O363k68k87k22l61k335o860
$$ plain form
9910 772958 679488 633766 585275 497708 381589 298017 249944 219029 188434 158383 141256
9899 141256 127694 119618 116647 117750 125978 124191 124895 125889 126674 128400 127029 118561 112007 113621 113570
9884 113570 108955 99456 91435 85988 83702 76724 64882 55025 53094 43062 25475 -1267 -31842
9871 -31842 -78131 -121388 -168325 -216606 -251197 -280183 -292203 -294433 -289332 -274184 -255724 -227607
9859 -227607 -194995 -171283 -149942 -130083 -110682 -90655 -69587 -48901 -37472 -27059 -16419 -15093
9847 -15093 -13277 -6956 -6985 -4603 -6920 -15461 -15089 -7234 -4297 -4131 3223 12900 27036 59726 101783
9832 101783 140235 139981 128802 126602 139074 167582 186676 158077 119994 95321 81891 69254
9820 69254 48846 28100 25422 21473 14093 6645 -3643 -80 6283 6015 5728 5506 5145 2810 -4050
9805d050n168O861N88n8L982L584l176q827l020N113j141L47q037p149R694J5750
9789E293M282k104l922P045J952R249O482J894K34J3652J3942J0986J1146J0740
9775I0871J7493K4938K1320M0582O2980Q1893J18125J66820K17481K72712K85512
9764A400727L16313K70116J70316J13909k2425j24612j96499k63839k68896k58900
9754A136210k38776k03179j62924j18836q7969o9672m5941l5409j9868k3850k1275
9743A08511j1317p280k341j121P185Q348K05q726p256n060q03R519J175j6003
9729G5036j9263j6580n470p187o820j828l465q373m330m193k583o528P827P166
9715C409P938l00l901r663l484j118n434j0625j327J803n883m975M025n071l637
$$ plain form
9805 -4050 -9218 -2357 -1769 -1827 2155 5739 2563 -6264 -9284 -4171 -5312 -4965 -13002 -20151 -10457 5293
9789 5293 9575 7471 3549 10594 12546 21795 28277 30171 30405 44057 57999 68985 80131 90871
9775 90871 108364 133302 154622 195204 258184 340077 458202 625022 842503 1115215 1400727
9764 1400727 1717040 1987156 2157472 2271381 2248956 2124344 1927845 1664006 1395110 1136210
9754 1136210 897434 694255 531331 412495 324526 254854 208913 173504 153636 129786 108511
9743 108511 97194 89914 87573 86452 93637 101985 102190 93464 86208 81148 80345 89864 91039 75036
9729 75036 55773 39193 33723 26536 19716 17888 14423 6050 1720 -2473 -5056 -11584 -3757 3409
9715 3409 11347 11047 7146 -2517 -6001 -7119 -12553 -23178 -24505 -22702 -28585 -33560 -29535 -34606 -38243
9700c8243k175l215Q97k162J590k123L836N340l254j596K369K43L11Q969R135
9685b0078R55L747M018l641j784m107n147j154K459K193k000j136K932M243k13
9670a8713q692m836O343k40p28O010k93m001n410J211j329l361J724M640q8M71
9654b7292k182N493M08p407O360M545o152k891m491j6P109M660j0629K019m2n607
9638c6115K989J523l745K59J060J726m322n398L816O523N075N839l278j746J247
9623b4547o9n789J806l448j824L520J414M662l411l886M829p751L658k090m567
9608c7493q204J615Q107L59J336m43J524P67K770n93J54O524n25m266n440j699
9592c5507k254k484M24J612M17j760K682j046J881J334K00J475N10K170k513K861
$$ plain form
9700 -38243 -40418 -43633 -42736 -44898 -43308 -45431 -41595 -36255 -39509 -41105 -38736 -38493 -38182 -29213 -20078
9685 -20078 -19123 -15376 -11358 -14999 -16783 -20890 -26037 -27191 -24732 -22539 -24539 -25675 -22743 -18500 -18713
9670 -18713 -27405 -32241 -25898 -26138 -26866 -20856 -21149 -25150 -30560 -29349 -30678 -34039 -32315 -27675 -27763 -27292
9654 -27292 -29474 -23981 -23573 -30980 -24620 -20075 -26227 -29118 -33609 -33625 -26516 -21856 -32485 -30466 -30508 -36115
9638 -36115 -33126 -31603 -35348 -35089 -34029 -32303 -36625 -42023 -38207 -31684 -26609 -20770 -24048 -25794 -24547
9623 -24547 -24616 -30405 -28599 -32047 -33871 -30351 -28937 -24275 -27686 -31572 -26743 -34494 -30836 -32926 -37493
9608 -37493 -45697 -44082 -35975 -35616 -34280 -34723 -33199 -32432 -29662 -30255 -30101 -23577 -24102 -28368 -33808 -35507
9592 -35507 -37761 -40245 -39821 -38209 -37792 -39552 -36870 -37916 -36035 -34701 -34501 -33026 -32516 -30346 -32859 -29998
9576b9998P81k030m210p794P992J501k062M494L685j258k086L839j479p960K648
9561c3937K603l077J323R31j001M08l500j950m229L835O69N938p59o614L425M459
9545c1476R539P454l882p199j053J816j54K996m36j4072j998P527l533J930Q892
9530b3649J875j462n59J334l087k71n906l482j941j730J616L461M866P994l00
9515b1241n614j582l412P69j949l78Q06K119K597N071O642M237J404o133o419
9500b3083m540K570L659K930O97L274K095L66m538J816J350l494m061p74j757
9485b3490J134J393n434j194j084O811L692j362l271n752J046P566K786p47k779
9470b0685q28P589L664r006n087l434j803P20Q513J460k786l414l05j917L778
$$ plain form
9576 -29998 -29217 -31247 -35457 -43251 -35259 -33758 -35820 -31326 -27641 -28899 -30985 -27146 -28625 -36585 -33937
9561 -33937 -31334 -34411 -33088 -32157 -33158 -32750 -36250 -38200 -42429 -38594 -37925 -31987 -32746 -39360 -35935 -31476
9545 -31476 -21937 -14483 -18365 -25564 -26617 -24801 -24955 -21959 -22395 -36467 -38465 -30938 -34471 -32541 -23649
9530 -23649 -21774 -23236 -23795 -22461 -25548 -25819 -31725 -35207 -37148 -38878 -37262 -33801 -28935 -20941 -21241
9515 -21241 -26855 -28437 -31849 -31080 -33029 -33407 -32601 -30482 -27885 -22814 -16172 -11935 -10531 -16664 -23083
9500 -23083 -27623 -25053 -21394 -18464 -17767 -14493 -12398 -12032 -16570 -14754 -13404 -16898 -20959 -21733 -23490
9485 -23490 -22356 -20963 -26397 -27591 -28675 -21864 -18172 -19534 -22805 -28557 -27511 -19945 -17159 -17906 -20685
9470 -20685 -21513 -13924 -10260 -19266 -24353 -27787 -29590 -28870 -20357 -18897 -21683 -25097 -25402 -27319 -23541
9455b3541Q14m528K10J947L171k479k398m655l114m300M031M215o971m467P523
9440c4542M164M935q553R45O614J396K703l395L930k42j401m40J38k040j189J297
9424b5680N63K824J165J249M750j735q39N855p7k471p252r095o291q082M60J2746
9408c1910O454K262j585K98L487Q42L632p03k130k078m750N91n253o172m785N414
9392c6386K166J278p91L425k772j019K586J977m402J271L871k465N270K420k244
9377b5815L491K355l089q856n085M100M580K701j746m42j56j370N625O979k979
9362a9707K909r83n500p677L431l326N123k199n414O078J1384j959j0923Q10l364
9347c1317l056N559O639m082o840o372O28J97L992j799O41O978J1029L86P10q734
$$ plain form
9455 -23541 -22727 -27255 -27045 -25098 -21927 -24406 -26804 -31459 -34573 -38873 -34842 -30627 -37598 -42065 -34542
9440 -34542 -30378 -25443 -33996 -33051 -26437 -25041 -22338 -25733 -21803 -22045 -23446 -23886 -23748 -25788 -26977 -25680
9424 -25680 -25117 -22293 -21128 -19879 -15129 -16864 -17703 -11848 -11925 -14396 -21648 -30743 -37034 -45116 -44656 -31910
9408 -31910 -25456 -23194 -24779 -24481 -20994 -20152 -16520 -17223 -19353 -21431 -26181 -25590 -30843 -37015 -41800 -36386
9392 -36386 -34220 -32942 -33733 -30308 -33080 -34099 -31513 -29536 -33938 -32667 -28796 -31261 -25991 -23571 -25815
9377 -25815 -22324 -19969 -23058 -31914 -36999 -32899 -28319 -25618 -27364 -27806 -27962 -29332 -23707 -16728 -19707
9362 -19707 -16798 -17781 -23281 -30958 -27527 -30853 -25730 -27929 -33343 -27265 -15881 -17840 -28763 -27953 -31317
9347 -31317 -34373 -28814 -22175 -26257 -33097 -39469 -38841 -38644 -34652 -36451 -35810 -28832 -17803 -17417 -16707 -25441
9331b5441O13K433n231j3j291P08L19L159L581K800l489p660K979R671K383j873
9315a6352m627k230q66m951k700L162J57P161Q719J242o744O00j682n196R74M884
9299a8449j695K618P92P036m759m548J341J74M497j141o91L508M715J22n999j0497
9283b2976m377o40j016n76l503K909L089n21N636M740o965k822J530j400L982
9268b2910M875m452m902j157Q227P417P248l426o862n481m333P274J361K830p49
9253a5040k832j056M48M208l173k537k39k707o614N623M802K898P56J501J264
9238a2698k540q91m190l263j483j401O242n118j253Q075L693n759p58P74Q27j331
9222b1074N518L283m467M620n30R39p25m334p2J473M841m30O946l289m984Q1Q81
$$ plain form
9331 -25441 -24828 -22395 -27626 -27639 -28930 -28222 -27903 -24744 -21163 -18363 -21852 -29512 -26533 -16862 -14479 -16352
9315 -16352 -20979 -23209 -24075 -29026 -31726 -28564 -28407 -21246 -12527 -11285 -18029 -17429 -19111 -24307 -23333 -18449
9299 -18449 -20144 -17526 -16734 -9698 -14457 -19005 -17664 -17490 -12993 -14134 -14825 -11317 -6602 -6480 -12479 -22976
9283 -22976 -27353 -27993 -29009 -29585 -33088 -30179 -27090 -27611 -21975 -17235 -24200 -27022 -25492 -26892 -22910
9268 -22910 -18035 -22487 -27389 -28546 -20319 -12902 -5654 -9080 -15942 -21423 -25756 -18482 -17121 -14291 -15040
9253 -15040 -17872 -18928 -18480 -14272 -17445 -19982 -20221 -22928 -29542 -23919 -19117 -16219 -15463 -13962 -12698
9238 -12698 -15238 -16129 -20319 -23582 -25065 -26466 -20224 -25342 -26595 -18520 -14827 -20586 -21344 -20570 -19743 -21074
9222 -21074 -15556 -12273 -16740 -12120 -12650 -11711 -12436 -16770 -16842 -15369 -10528 -10958 -4012 -7301 -12285 -12204 -11323
9205a1323M170j132k584p582n303K012l327J153J912j337K219M339Q17r598k154
9190b7718L358P14q78l87j105j771P138M606J716j247l251p867o147k839N736
9175b9942M876N902m643J502N153J3j687N867K408m018l047j714L684Kj828m767
9159b2239k029p60J863m760Q77P126K044M244k456k419P128R36M901o054l907
9144a5505M712K511m699o11J0268J227r551k458M292M346o871o724m490j478Q25
9129b4206M766R563O586m348n845p654M92k28k083p41O74r95J675K33q15N486
9113a7440K949l118n267k989j270O143K797n959l317M802R192J68l227j052J302
9098a6286j013L35L83K548m773k965M28N483K225l537r28n116L540O226p44J236
$$ plain form
9205 -11323 -7153 -8285 -10869 -18451 -23754 -21742 -25069 -23916 -22004 -23341 -21122 -16783 -15966 -25564 -27718
9190 -27718 -24360 -23646 -24524 -24911 -26016 -27787 -20649 -16043 -14327 -15574 -18825 -26692 -32839 -35678 -29942
9175 -29942 -25066 -19164 -23807 -22305 -17152 -17139 -18826 -12959 -10551 -14569 -17616 -19330 -15646 -15644 -17472 -22239
9159 -22239 -24268 -25028 -23165 -27925 -27048 -19922 -17878 -13634 -16090 -18509 -11381 -10445 -5544 -11598 -15505
9144 -15505 -10793 -8282 -12981 -13592 -3324 -2097 -11648 -14106 -9814 -5468 -12339 -19063 -23553 -25031 -24206
9129 -24206 -19440 -9877 -3291 -7639 -13484 -21138 -20646 -20874 -22957 -23698 -23024 -24019 -22344 -22111 -22926 -17440
9113 -17440 -14491 -17609 -22876 -25865 -27135 -20992 -18195 -24154 -27471 -22669 -13477 -13309 -16536 -17588 -16286
9098 -16286 -17299 -16964 -16581 -14033 -18806 -21771 -21343 -15860 -13635 -17172 -18100 -23216 -19676 -13450 -14194 -12958
9082a2958K145K318n635m931n888M21L919J437q91n731J368Ml196J1271R895j191
9066g643o158R26p996P28O50M12k940k143j671Q77O751q59j715o225R02L990M067
9049a8047q652r76N861N485M016L769M199j987j061j63r082o69K517K139J0256
9034b395p249J925j84o293j490r74K805k688k73N564k072m125k715M887l78m550
9018b0205L555L866n465m022O827K740j311l855k709R44J091q44M414J1010L88
9003c576J885o705m968l84K771M092n30n118q133o512m327N297M605l108R13K489
8987b1309l949J960J104O32L837P35n234n206K630J0493K118j975M917J670o904
8972a4481p631L478N391l261M312P406n177r479l668J604L459P522L659K461K123
$$ plain form
9082 -12958 -10813 -8495 -14130 -19061 -24949 -24528 -20609 -19172 -20063 -25794 -24426 -24422 -27618 -16347 -6452 -7643
9066 -7643 -13801 -12875 -20871 -20143 -19493 -19081 -22021 -24164 -25835 -24958 -18207 -19066 -20781 -27006 -26104 -22114 -18047
9049 -18047 -26699 -27675 -21814 -16329 -12313 -8544 -4345 -6332 -7393 -7556 -16638 -17307 -14790 -12651 -2395
9034 -2395 -9644 -7719 -7903 -14196 -15686 -16660 -13855 -16543 -16816 -11252 -13324 -17449 -20164 -15277 -15655 -20205
9018 -20205 -16650 -12784 -18249 -22271 -15444 -12704 -14015 -17870 -20579 -19635 -18544 -19388 -14974 -3964 -3576
9003 -3576 -1691 -8396 -13364 -13748 -10977 -6885 -7415 -12533 -20666 -27178 -31505 -26208 -21603 -24711 -23798 -21309
8987 -21309 -25258 -23298 -22194 -21562 -17725 -16990 -22224 -27430 -24800 -14307 -12189 -14164 -9247 -7577 -14481
8972 -14481 -22112 -18634 -13243 -16504 -12192 -4786 -9963 -19442 -23110 -21506 -18047 -10525 -6866 -4405 -2282
8957b282r166q504M901Q442n722m021l157o807L265P273l472j121J24m505k155
8942b6907K514j458J591N862L981J302j529R64l184j502J734L708L501L884p18
8927f257r981o426K455O668P30L451l622l800k679j367k105q184L278J561P5N26
8911b5677J805N834N233l57n854j25J790L428l220K179K603k050L139P217J0126
8896F071n63l120M026L326l039m155j926m67k642j1603m21N057j0343O4N839k523
8880a6419K005P824n871M15K416K448o476q13K448O804P323k853q389n322k516
8865a6976p999P23m064k317N445L403N007K116J575K86N028k631j0975p695N802
8850b3272L778J526L290L087Q554R57l525P124M022j780m270o633m185j744P613
$$ plain form
8957 -2282 -11448 -19952 -15051 -6609 -12331 -16352 -19509 -26316 -23051 -15778 -19250 -20371 -20247 -24752 -26907
8942 -26907 -24393 -25851 -24260 -18398 -14417 -13115 -14644 -13680 -16864 -18366 -16632 -12924 -9423 -5539 -6257
8927 -6257 -16238 -22664 -20209 -13541 -12811 -9360 -12982 -16782 -19461 -20828 -22933 -31117 -27839 -26278 -26203 -25677
8911 -25677 -23872 -18038 -12805 -13162 -19016 -19141 -17351 -13923 -17143 -14964 -12361 -14411 -11272 -4055 6071
8896 6071 5508 2388 6414 9740 6701 2546 620 153 -2489 -14092 -14513 -9456 -19799 -19735 -13896 -16419
8880 -16419 -14414 -6590 -12461 -12046 -9630 -7182 -13658 -14471 -12023 -5219 2104 -749 -9138 -14460 -16976
8865 -16976 -24975 -24252 -28316 -30633 -25188 -21785 -16778 -14662 -13087 -12801 -7773 -10404 -21379 -29074 -23272
8850 -23272 -19494 -17968 -14678 -11591 -3037 -2080 -5605 1519 5541 3761 -509 -7142 -11327 -13071 -5458
8835e458K454N46k209r77l700n021k385K018P020L147m529l765k490k245l796
8820b1390k385J0320K875n461p293M9L261J827K61K311N905O11k340J792m870
8805a4527k949P416Q873j078r790M587J378Q69M63l304j880k9J328k398J342n3
8789i752M645M39k490k661l512K887R742P140P127R317O171j146o356k448o404
8774A2699j0994l254l138K517m136O60P04m935P820K261Q91k718r47N46n256K51
8758g029j295p18j028p801o34n25L179N167J589k750M25j03N108O50q837l800
8742a8402M007l437M488L591N677K0869J9996J1159M322m731q152r927j1907j2905
8728D648q018k333j528K77l281K006O403K248m69l153k457O18p728K262k632q09
$$ plain form
8835 -5458 -3004 -2458 -4667 -5644 -9344 -14365 -16750 -14732 -7712 -4565 -9094 -12859 -15349 -17594 -21390
8820 -21390 -23775 -13455 -10580 -16041 -23334 -23285 -20024 -18197 -17936 -15625 -9720 -9109 -11449 -9657 -14527
8805 -14527 -17476 -10060 -1187 -2265 -12055 -7468 -6090 -5221 -4758 -8062 -9942 -9971 -8643 -11041 -9699 -9752
8789 -9752 -5107 -4668 -7158 -9819 -13331 -10444 -702 6438 13565 22882 29053 27907 21551 19103 12699
8774 12699 1705 -1549 -4687 -2170 -6306 -5646 -4942 -9877 -2057 204 1095 -1623 -2570 -2024 -7280 -7029
8758 -7029 -8324 -9042 -10070 -17871 -18505 -19030 -15851 -10684 -9095 -11845 -11420 -11523 -6415 -5765 -14602 -18402
8742 -18402 -14395 -17832 -13344 -9753 -4076 16793 36789 47948 52270 47539 39387 29460 17553 4648
8728 4648 -3370 -5703 -7231 -6954 -10235 -8229 -1826 422 -47 -3200 -5657 -5039 -12767 -10505 -13137 -13946
8712a3946k922n459j40O981J766R099O083n008m117q049m697Q737Q083K51q952
8697a2290l084P706J720L487k255L859Q857J0480L314M212P42q75m678j072k421
8682A7702j1791l951r427j636j854J220l518j277N608O020m069K194O523M165
8668E909M374J029j1377o310j373j399N294L616q915k840M074K384N44k239q395
8653a5624k926N590K614K072R17m301L99l487m077J595O271L484m726k635P361
8638g473L124n131j076L180R803K64l614j378K754k629n510P307J337k520P020
8623E458J0381L678j16M424k279r194l525o910l619J12J045k163J384K004l83
8608B97K106m210k323R44L398K044L49N8r7j20k36k124M306P554m824l569j577
$$ plain form
8712 -13946 -16868 -22327 -22467 -15486 -13720 -4621 1462 -3546 -7663 -15712 -20409 -11672 -3589 -3338 -12290
8697 -12290 -15374 -7668 -5948 -2461 -4716 -857 8000 18480 21794 26006 26748 25873 21195 20123 17702
8682 17702 5911 1960 -7467 -9103 -10957 -9737 -13255 -14532 -8924 -2904 -6973 -4779 1744 5909
8668 5909 10283 11312 -65 -6375 -7748 -9147 -3853 -237 -9152 -11992 -7918 -5534 -4990 -7229 -15624
8653 -15624 -18550 -12960 -10346 -8274 -7357 -11658 -11259 -14746 -18823 -17228 -10957 -7473 -12199 -14834 -7473
8638 -7473 -4349 -9480 -10556 -7376 2427 2691 -923 -2301 453 -2176 -7686 -379 958 -1562 5458
8623 5458 15839 19517 19401 23825 21546 12352 8827 1917 -1702 -1590 -545 -2708 -1324 680 297
8608 297 2403 -1807 -4130 -3186 212 2256 2605 2663 2566 2446 2210 86 4392 11946 7122 3553 1976
8591A976j23j83N608j99j22n851Q642L762q144j4005l849P341M233L97N28J0442
8575A0453M369k765K763K322k445n605M90r76q992p41M302m734j277N662K665
8560E491M010k252m953K13m721o79j455O831n590J296N469L897J547k981l879
8545B244m38M685p5n489M40R246J3106L893M023L837j222j539J872J628J0381
8530D6592J2360N553Q701N261J5530J7435J0803k923p107j0052j2719j9246j2914
8517E7274j0326p288o649q910j714m249l518q936m291k783K471m730k358J113
8503d894L883O980n47L305Q87k742k445l874K75N02K45o823k821o109k709R567
8487g320M931K71j8j775j53L695K763l034M071J346L0q19k861j847l123n342j494
$$ plain form
8591 1976 1853 1670 7278 7079 6957 1106 9748 13510 5366 -8639 -12488 -5147 -914 -517 11 10453
8575 10453 14822 12057 14820 17142 14697 9092 9582 8606 -386 -1127 3175 -1559 -2836 2826 5491
8560 5491 9501 7249 2296 2509 -2212 -2891 -4346 2485 -3105 -1809 3660 7557 9104 6123 2244
8545 2244 1806 6491 6416 927 1367 10613 23719 27612 31635 35472 34250 32711 34583 36211 46592
8530 46592 58952 64505 73206 78467 93997 111432 122235 119312 112205 102153 89434 70188 57274
8517 57274 46948 39660 33011 24101 22387 18138 14620 5684 1393 -1390 1081 -3649 -6007 -4894
8503 -4894 -1011 5969 5422 8727 9614 6872 4427 553 828 1330 1575 -5248 -8069 -14178 -16887 -7320
8487 -7320 -2389 -2118 -2136 -3911 -4064 -369 2394 -640 3431 4777 4807 3988 1127 -720 -3843 -9185 -10679
8470a0679m194k867j1493M207J0842L596J59P98k25m190K701J157j86j59P12L652
8454f169K681K096L002l178k115r40j172l874J541L743R9l773l792L660L788K182
8438b221k60K519M861k656k266K919L651l454n950o749l909p65l861l90p74P113
8422a2192O755j080J535O322O461j149k096l036j556o89j692O296L346k789n298
8407h62l204n14k530L1M178O111k355p438l504k01k463j314L221P794K199n84
8391a435J121J312r43m796n309L539L94o554P27l004J363R071L985O09j608m627
8375f155q85K248j283J24n263n640j223J998K027k584n80J276j083J785M821n821
8359a6238k054M887Q024O256j462m001J950l85j773p03P259m374k547k88l93o210
$$ plain form
8470 -10679 -14873 -17740 -29233 -25026 -14184 -10588 -10429 -9631 -9856 -14046 -11345 -10188 -10374 -10533 -9821 -6169
8454 -6169 -3488 -1392 1610 -1568 -3683 -4623 -5795 -9669 -8128 -4385 -4286 -8059 -11851 -8191 -4403 -2221
8438 -2221 -2481 38 4899 2243 -23 2896 6547 3093 -2857 -9606 -13515 -14280 -18141 -18531 -19305 -12192
8422 -12192 -5437 -6517 -4982 1340 7801 6652 4556 1520 -36 -725 -2417 3879 7225 4436 -862
8407 -862 -4066 -4580 -7110 -7079 -2901 3210 855 -6583 -10087 -10288 -12751 -14065 -10844 -3050 -851 -1435
8391 -1435 -314 998 55 -4741 -10050 -6511 -6117 -12671 -11944 -14948 -13585 -4514 -529 80 -1528 -6155
8375 -6155 -7040 -4792 -6075 -5951 -11214 -16854 -18077 -16079 -14052 -16636 -17216 -15940 -17023 -15238 -10417 -16238
8359 -16238 -18292 -13405 -5381 875 -587 -4588 -2638 -3023 -4796 -5499 1760 -2614 -5161 -5449 -5842 -12052
8343a2052j820M632P189J460n032n979J791L801o164j575J912N625L580m969L514
8328d087J488K324m298k666m625m04Q3Q7P40J523o281O159M099k120n76J606M425
8311b523o342M106j487O39K860j273m963K922J618o18k260L974L181J961K600
8296D395j893L374Q91J037p45k145K357M769O83m239O51k571r630j23M048Q42
8280A701L090O190n273r93k14n460p932J101L364M226k099M68l746j78j985k240
8264i980J914M347n054j495k547j348J711j866L519L079k249J389J400j900n506
8249a4586j21P689K015n232j232J041O670Q489J520n384l237p758j286P683O17
8234c112o681J572l570n786j565J284L0K578O524Q896k584j45m043n822K177j701
$$ plain form
8343 -12052 -13872 -9240 -2051 -591 -5623 -11602 -9811 -6010 -12174 -13749 -11837 -6212 -2632 -7601 -4087
8328 -4087 -2599 -275 -4573 -7239 -11864 -12268 -12185 -12098 -11358 -9835 -16116 -9957 -5858 -7978 -8554 -6948 -2523
8311 -2523 -8865 -4759 -6246 -5607 -2747 -4020 -8983 -6061 -4443 -5061 -7321 -3347 -166 1795 4395
8296 4395 2502 5876 6767 7804 7059 4914 7271 12040 12723 8484 9135 6564 -3066 -3189 859 1701
8280 1701 4791 10981 5708 4715 4501 -959 -8891 -7790 -4426 -200 -2299 -1831 -5577 -5755 -7740 -9980
8264 -9980 -8066 -3719 -8773 -10268 -12815 -14163 -12452 -14318 -10799 -7720 -9969 -8580 -7180 -9080 -14586
8249 -14586 -14707 -7018 -5003 -10235 -11467 -10426 -3756 4733 6253 869 -2368 -10126 -11412 -3729 -3112
8234 -3112 -9793 -8221 -11791 -17577 -19142 -17858 -17828 -15250 -8726 170 -2414 -2559 -6602 -12424 -10247 -11948
8218a1948M139O602J017J487l250M910M9l066K20K81k237m398n502k853K823O581
8202e145m64l075q734k800m58O993Q149l429n652k262K247O019N086M900l752
8187b377l578j338M7j419k457l62J455O767L120J55Q89j676J414o96k560m343
8171f959n147n194K073J0610J834J381J793m298m288J780P269N250j273r391p021
8156a1581K657O412l077j565P082M196r85M579M31m205m225k508O81R596k601
8141D887J321q656p563q75J2551J1554l110q62m690o246p4n868l298Q406N935
8126C412L015p081M78l432l249j112j393o833n704L213J3095O803L502J661m165
8111B210j1039l893K388o595j232N708O588j814L001K533j470k961j329N507J671
$$ plain form
8218 -11948 -7809 -1207 -190 1297 -1953 2957 3006 -60 160 441 -1796 -6194 -11696 -14549 -11726 -5145
8202 -5145 -5609 -8684 -17418 -20218 -20676 -13683 -5534 -8963 -14615 -16877 -14630 -8611 -3525 1375 -2377
8187 -2377 -5955 -7293 -7246 -8665 -11122 -11484 -10029 -3262 -142 13 902 -774 640 -56 -2616 -6959
8171 -6959 -12106 -17300 -15227 -4617 -2783 -1402 391 -3907 -8195 -6415 854 6104 4831 -4560 -11581
8156 -11581 -8924 -2512 -5589 -7154 -72 4124 3139 7718 8149 3944 -281 -2789 -2108 7488 4887
8141 4887 6208 -2448 -10011 -10886 1665 13219 10109 9247 4557 -1689 -1763 -7631 -10929 -2523 3412
8126 3412 6427 -654 -176 -3608 -6857 -7969 -9362 -16195 -21899 -18686 -5591 1212 4714 6375 2210
8111 2210 -8829 -12722 -10334 -16929 -18161 -12453 -5865 -7679 -4678 -2145 -3615 -6576 -7905 -2398 -727
8096g27J113m096j921M043o58J521Q398N645l257o000k638j253l623O053K072
8081D672j393n701j525J0436O657K04m190o605m823Q11J104L302O978j0391o967
8066g431M752J465k300M729K183k208M309j103O64j0907l642O270j346o7K506
8051b126l82J290O360K024p3J888L59q187O896P563N399K300l965j536l628l594
8035A0588m592m74N769j206l119L75p434k833N43L449K339Q44o491K37J219k642
8019c428R02N408n554m498L592O736K306l127M610L185k506n877j1011K388P258
8004C84o8n707n115J268Q855K264j095K026K797J382l84J388J09J126j674j962
7988E594l983Q958N49n039LM00o494q120M718O134j688J63L909k550l965Q75j443
$$ plain form
8096 -727 386 -3710 -5631 -1588 -2246 -725 7673 13318 10061 4061 1423 170 -3453 2600 4672
8081 4672 3279 -2422 -3947 6489 13146 13350 9160 2555 -2268 -1457 -353 2949 9927 -464 -7431
8066 -7431 -2679 -1214 -3514 1215 3398 1190 5499 4396 5060 -5847 -9489 -3219 -4565 -4632 -2126
8051 -2126 -2508 -1218 5142 7166 7093 8981 9340 1153 8049 15612 21011 23311 19346 17810 14182 10588
8035 10588 5996 5522 11291 10085 6966 7341 -93 -2926 -2383 1066 3405 4249 -2242 -2005 -786 -3428
8019 -3428 -2526 2882 -2672 -7170 -3578 3158 5464 2337 6947 10132 7626 1749 -9262 -6874 384
8004 384 316 -5391 -10506 -9238 -383 1881 786 2812 5609 6991 6607 7995 8104 9230 7556 5594
7988 5594 1611 10569 11118 6079 6082 6482 -12 -8132 -3414 2720 1032 1195 5104 2554 -1411 -536 -1979
7971a979L009R21J189j785p537j535J253L248M160l09J201k479J015N73J16J474
7955B535P085m67q975n812M819l298m005j57O64K327M789J608O663M67K035M603
7939A4881n267o938j86K670O233k599O41j505K929j938m480J21Q057L676r09j423
7923A3963M133O759K033j0722j1597o927N606O51p34R22l605R74P56j944q938
7908h670k938N174K886RJ623R073j731j107l300L877L968O23m432l554k488l537
7892d524R98P64J168j096N278O052j728k168O710L247o162J438P54L459l533n631
7876E026o527p870J074M17M70K754M273J300L713R33o234j60j404K659K146K005
7860D575m710o226o207O61K320J946P53J727K008J2589O746j1535p716M403M700
$$ plain form
7971 -1979 1030 1951 3140 1355 -6182 -7717 -6464 -3216 944 635 1836 -643 372 945 1061 2535
7955 2535 9620 9153 178 -5634 -815 -4113 -8118 -8275 -7611 -5284 -495 1113 7776 8243 10278 14881
7939 14881 9614 2676 2490 5160 11393 8794 9435 7930 10859 8921 4441 4562 12619 16295 15386 13963
7923 13963 18096 24855 26888 16166 4569 -2358 3248 3899 3165 4087 482 1456 2212 268 -8670
7908 -8670 -11608 -6434 -3548 -3539 -1916 7157 5426 4319 1019 4896 8864 9487 5055 1501 -987 -4524
7892 -4524 -3526 -2762 -1594 -2690 2588 8640 6912 4744 11454 14701 8539 9977 10731 14190 10657 5026
7876 5026 -1501 -9371 -8297 -7880 -7410 -4656 -383 917 4630 5563 -671 -831 -2235 424 2570 4575
7860 4575 -135 -6361 -12568 -11907 -9587 -7641 -6888 -5161 -3153 9436 16182 4647 -3069 1334 6034
7845F034M600n9p384k924o149j171Q27l824J341P613K354L161P86k9m584m041
7829c449K965M135L599L087l746n45K140j746n101p388j87J136P398l081O186
7814E403j410n902k279L208j963o79J159O9L947L18J578r088p316n52O93K577
7798a0237Q904Q714J098m543l88O884m409m548J533m943o890O451L445k069l147
7783d145M262P781j896o207l835k439j44P102J105n278j736K761M393N159N097
7768A1980K193r554o693M915j217j176M017q95n212j067j153N472j668k171L64
7753a865M790j832q894J891J277Q82L319M703q41q067o463M734O08o56j900N344
7737b970j40j927O80p424q293q952L694J685O796N922L773K139m221L239K46N742
$$ plain form
7845 6034 10634 10575 3191 267 -5882 -7053 -6226 -10050 -8709 -1096 1258 4419 5205 5176 592 -3449
7829 -3449 -484 3651 7250 10337 6591 6046 8186 6440 1339 -6049 -6236 -5100 2298 -783 5403
7814 5403 3993 -1909 -4188 -980 -2943 -3622 -2463 -2394 1553 1871 3449 -5639 -12955 -13507 -12814 -10237
7798 -10237 -1333 7381 8479 3936 3548 10432 6023 1475 3008 -1935 -8825 -2374 1071 -998 -4145
7783 -4145 117 7898 6002 -205 -4040 -6479 -6623 479 1584 -3694 -5430 -2669 1724 6883 11980
7768 11980 14173 4619 -2074 2841 1624 448 4465 3570 -1642 -2709 -3862 1610 -58 -2229 -1865
7753 -1865 2925 1093 -7801 -5910 -4633 -3751 -432 4271 3430 -4637 -11100 -6366 -5758 -6414 -8314 -2970
7737 -2970 -3110 -5037 -4357 -11781 -20074 -29026 -25332 -23647 -16851 -10929 -7156 -5017 -9238 -5999 -5753 -11
7721a1K788k74q55j110J428o864k715O417L395l855l837K56j533m282R61O162
7705c929n988l032K320n80J046p633j65Q007O122J605l180m498j746j838Q11L40
7689a2338K671J3629Q3N10j964k763l279J096L460J70Q66j103L017j265N20k087
7673A223o241m459l495Q03Q069N568l993j975K276k639Q11N61p70J934O67k779
7657d439m123o5L293m00M299k090k478O292n6r617o209j028K742J564N504J320
7641e491m017J197j834l299J216N652j437K520L885q322p242K104P597l22k473
7626a0266l172M00L391N448N016j206J739j531m622m495J981l350K393M499L47
7611c428L386J972j729m04n034o531j524J795O216N618k070k419M69k847o389
$$ plain form
7721 -11 2777 2503 1648 538 1966 -4898 -7613 -1196 2199 -1656 -5493 -5237 -6770 -11052 -10091 -3929
7705 -3929 -9917 -12949 -10629 -11209 -10163 -17796 -17961 -9954 -3832 -2227 -5407 -9905 -11651 -13489 -12678 -12338
7689 -12338 -9667 3962 4045 4555 2591 -172 -3451 -2355 1105 1275 2141 1038 4055 2790 3310 1223
7673 1223 -5018 -9477 -12972 -12169 -4100 1468 -2525 -4500 -2224 -4863 -4052 -3491 -4261 -2327 -1660 -4439
7657 -4439 -8562 -8627 -5334 -5734 -1435 -3525 -6003 289 233 -9384 -15593 -16621 -13879 -12315 -6811 -5491
7641 -5491 -9508 -8311 -10145 -13444 -12228 -6576 -8013 -5493 -1608 -9930 -17172 -15068 -7471 -7793 -10266
7626 -10266 -13438 -13038 -9647 -4199 817 -389 1350 -181 -4803 -9298 -7317 -10667 -8274 -3775 -3428
7611 -3428 -42 1930 201 -203 -5237 -11768 -13292 -11497 -5281 337 -1733 -4152 -3683 -6530 -12919
7596a2919R04P181M293r37n731m545k75k398n73k024j263Q522K812J230o76P40
7580e659P416Q01k702k503m370q304J249P523M59j009J737O301lq422j0540M497
7564a3529L844J974m469m753M308L131K020L069O274j0843q705P419L667l515
7550a0108l453J959M762l954j978L270K724R97J581J828Q51m061p76j411o2J118
7534f713q75L079n93r892N110O644P635n42o111r38l237L013l178r683m22J512
7518a5191J2217J105l250p050L600L38L676M435K762j664l189k925m273M527N173
7503B91l106N82k556o024l091M472P040k138l786O83N485m92k566K984O07r31
7487b546j9j143M282L906J714j0312k303M501M086M434l548k680J186J896M7k051
$$ plain form
7596 -12919 -12015 -4834 -541 -1478 -7209 -11754 -12029 -14427 -15000 -17024 -18287 -9765 -6953 -5723 -6399 -5659
7580 -5659 1757 2558 -144 -2647 -7017 -15321 -14072 -6549 -6090 -7099 -5362 939 936 -7486 -18026 -13529
7564 -13529 -9685 -7711 -12180 -16933 -12625 -9494 -7474 -4405 1869 -8974 -17679 -10260 -6593 -10108
7550 -10108 -13561 -11602 -6840 -10794 -12772 -9502 -6778 -5781 -4200 -2372 -1521 -5582 -6358 -7769 -7831 -6713
7534 -6713 -7588 -4509 -5102 -14994 -9884 -3240 4395 3853 -2258 -3196 -6433 -3420 -6598 -16281 -16703 -15191
7518 -15191 -2974 -1869 -5119 -12169 -8569 -8231 -4555 -120 2642 978 -2211 -5136 -9409 -4882 291
7503 291 -2815 -2233 -4789 -10813 -13904 -9432 -2392 -4530 -8316 -7633 -2148 -2640 -5206 -2222 -1615 -2546
7487 -2546 -2565 -3708 574 4480 6194 -4118 -6421 -1920 2166 6600 3052 372 1558 3454 3501 1450
7471A450m366j721K290n086O566N811L730L348k975k725J739r599l64L555l896
7456b243m344O471K706q58r323l143k02j109p83l368K264j098k88O451N452k718
7440f133o899O438Q972P213k192M51k680L816n032l799j0564j0054m94r8M548
7425a6507R106k628L811R208m59m92J48n112J15j930n680K679n30k623O948N795
7409A849k15l388k423k539N148K343J685k882m55Q56j998l288j795N716Q166l469
7393C311p17J741J000m137R83j164l671p330J288J615K946L11n97m566K639J5275
7377H927O12m761k602j756p425K94K94L88r49j47K672O506q09o740o602M882M751
7360b465j009K173O409N420k247P34j4112m454m84L858N142K274l114m428o797
$$ plain form
7471 1450 -2916 -4637 -2347 -7433 -867 4944 8674 12022 9047 6322 8061 -1538 -1902 1653 -2243
7456 -2243 -6587 -116 2590 1732 -7591 -10734 -10936 -12045 -12828 -16196 -13932 -15030 -15318 -8867 -3415 -6133
7440 -6133 -13032 -6594 2378 9591 7399 7850 5170 8986 3954 155 -10409 -20463 -20957 -21055 -16507
7425 -16507 -7401 -10029 -6218 2990 2531 2039 2187 -2925 -2810 -4740 -10420 -7741 -8271 -10894 -3946 1849
7409 1849 1634 -1754 -4177 -6716 -1568 775 2460 -422 -877 -21 -2019 -5307 -7102 -1386 6780 3311
7393 3311 2594 4335 5335 1198 2181 1017 -2654 -9984 -8696 -7081 -4135 -3824 -4421 -8987 -6348 8927
7377 8927 9539 4778 2176 420 -7005 -6711 -6417 -6029 -6978 -7125 -4453 2053 1244 -5496 -12098 -7216 -2465
7360 -2465 -3474 -1301 5108 10528 8281 9015 -5097 -9551 -10035 -6177 -1035 1239 -1875 -6303 -13100
7345a3100R37O810P035J175o191K822J468j032J771j65o997R95M042O514L42j3196
7329f770q297M846L538m225J516N397K843O388j338o037q623K825M298o2k450
7314f151M116J768m408k924q745j195N239l960Q03J0168M904N339l03M38l435
7299A654m687K010J894j399m535k345l362L168L466P4J116K286L988n151J082
7284g41q68n706p279n689O544J0001L909m68k13n046k767k568K565k260R33o916
7268a6569m396P222P745N96K583j038Q82r27L398K205J290n15M919K624L660j036
7252A2643j0904N48M189k161K34M263n105j625L998m831n341Q823K932n149n50
7237A964k029K150k182j86K549P351m673j1804r090J925N534K592N642L022o109
$$ plain form
7345 -13100 -12163 -5353 1682 2857 -3334 -512 956 -76 1695 1530 -5467 -4472 -430 6084 6426 -6770
7329 -6770 -15067 -10221 -6683 -10908 -9392 -3995 -1152 5236 3898 -2139 -10762 -7937 -3639 -3701 -6151
7314 -6151 -2035 -267 -4675 -7599 -16344 -17539 -12300 -16260 -15457 -5289 -385 4954 4651 5089 1654
7299 1654 -3033 -1023 871 -528 -5063 -7408 -10770 -7602 -4136 -4062 -2946 -660 3328 -1823 -741
7284 -741 -1609 -7315 -14594 -20283 -13739 -3738 171 -297 -510 -5556 -8323 -10891 -8326 -10586 -9653 -16569
7268 -16569 -20965 -13743 -5998 -5402 -2819 -3857 -2975 -3902 -504 1701 2991 2476 7395 10019 13679 12643
7252 12643 1739 2287 6476 4315 4549 8812 3707 2082 6080 1249 -4092 4731 7663 2514 1964
7237 1964 -65 2085 -97 -283 2266 9617 4944 -6860 -15950 -14025 -8491 -5899 -257 2765 -3344
7222c344J432O765j202n482r03j673O773l63m493k896m11L210M571n493k900o065
7206a2474N815N6M384k640L658L806j522n190l572n517n786J545K106L758L133
7191h440k862l012j346K023k396N861M921K771j403p304o431j677r65k165j857
7176b4282N368N717k732l168J0038j586J581J762K832j670m726p005K215P64q69
7161a5761R903N387n018m174k432j431N485k849Q5M080l396k615O2j292L065K378
7145h523L829N431N124l583q686p568M362L085J863L86K930l849n08M355j0141
7130a1493m584N825p08J2l62N193R91J060N483j510k513o749r419J321P390L630
7114f433J0722K519l519j3615p924l048O124N783L750K482M336J2180P78q291
$$ plain form
7222 -3344 -1912 4853 3651 -1831 -2734 -4407 2366 2003 -2490 -5386 -5797 -2587 1984 -3509 -6409 -12474
7206 -12474 -6659 -6603 -2219 -4859 -1201 2605 1083 -4107 -7679 -13196 -18982 -17437 -15331 -11573 -8440
7191 -8440 -11302 -14314 -15660 -13637 -16033 -10172 -5251 -2480 -3883 -11187 -17618 -19295 -20260 -22425 -24282
7176 -24282 -18914 -13197 -15929 -19097 -9059 -10645 -9064 -7302 -4470 -6140 -10866 -17871 -15656 -14892 -15761
7161 -15761 -5858 -471 -5489 -9663 -12095 -13526 -8041 -10890 -10805 -6725 -10121 -12736 -12674 -13966 -10901 -8523
7145 -8523 -4694 737 5861 2278 -6408 -13976 -9614 -6529 -4666 -4280 -1350 -5199 -5707 -1352 -11493
7130 -11493 -16077 -10252 -10960 -10948 -11310 -6117 -5126 -4066 1417 -93 -2606 -9355 -18774 -17453 -10063 -6433
7114 -6433 4289 6808 3289 -10326 -18250 -21298 -15174 -9391 -5641 -3159 1177 13357 14135 5844
7100E844K59k057q237r334K841P150J0360O509l872o755j122K530k660q48J70
7085G78J96j713O36k175o186K965O685L316J100o75m590o146k156J224K678J764
7069b299k413J75M486l889j950m953K518O881j109j751R628K995l572k836L353
7054E264k856J728J971M350J047j1232j0377r35R4l361j756M656O449M39j697
7039f216j01j29j542P375O564k698j871L197R49J34k718q217k912J254o474M756
7023h649O480K939K775L458j836m184j553k640k116J43J740k105k538m84O990
7008a580K768K188M170M711n043j330L604o643p702J489N174j60n34m6J678k749
6992en294J023K541m40Q9J693m035P394M841L03n449o764j376L602P129j669N5
$$ plain form
7100 5844 6103 4046 -4191 -13525 -10684 -3534 6826 13335 9463 2708 1586 4116 1456 608 778
7085 778 974 -739 -103 -2278 -8464 -5499 1186 4502 5602 4927 337 -5809 -7965 -6741 -4063 -2299
7069 -2299 -4712 -4537 -51 -3940 -5890 -10843 -8325 -1444 -2553 -4304 5324 8319 4747 1911 5264
7054 5264 2408 4136 6107 10457 11504 272 -10105 -11040 -10946 -14307 -16063 -11407 -4958 -4519 -6216
7039 -6216 -6317 -6446 -7988 -613 5951 3253 1382 4579 5528 5662 2944 -5273 -8185 -6931 -13405 -8649
7023 -8649 -2169 770 3545 7003 5167 983 -570 -3210 -5326 -5183 -3443 -5548 -8086 -8570 -1580
7008 -1580 1188 3376 7546 12257 7214 5884 9488 2845 -4857 -3368 1806 1646 1112 1066 2744 -5
6992 -5 -5299 -4276 -1735 -2175 -2086 -393 -4428 2966 7807 8110 2661 -4103 -5479 -1877 5252 3583 3638
6975C638J369O163J843J347k508O21o970q816o034n925K580M975rO561o556m044
6959a1765L857L964j398l840K389K437J575j620r65J409L104p98L535L223o019
6944i12j621m10J938j50j991P705P763P631Q580O389o299m071j356r593q932M263
6928H934k575j0805p45L825L905n278m138k09O172O222k404l483p196j108N713
6913c170Q362M17p407n163M674J358J94j230j0378j361k59N575N272K910k876
6898c082o48Q71m151o063l746Q529J4201n33k785l796o561l239k422J818Q40M976
6882e791L073O978k280p137l525K146j421n331M516L759J248K51Q292L356m064
6867D070l827K731j244j479l775m269Q003M949N052j120o644k964K636l432l158
$$ plain form
6975 3638 5007 11170 13013 14360 11852 12473 5503 -3313 -9347 -15272 -12692 -7717 -7726 -1165 -7721 -11765
6959 -11765 -7908 -3944 -5342 -9182 -6793 -4356 -2781 -4401 -5366 -3957 -853 -1651 1884 5107 -912
6944 -912 -2533 -2943 -1005 -1155 -3146 4559 12322 19953 28533 34922 28623 24552 23196 13603 4671 8934
6928 8934 6359 -4446 -5191 -1366 2539 -2739 -6877 -7086 -914 5308 2904 -579 -7775 -8883 -3170
6913 -3170 5192 5609 -1798 -6961 -2287 -929 -735 -1965 -12343 -13704 -13963 -8388 -3116 -206 -3082
6898 -3082 -3730 -2859 -7010 -13073 -16819 -8290 5911 5378 2593 -1203 -7764 -11003 -13425 -11607 -10767 -5791
6882 -5791 -2718 4260 1980 -5157 -8682 -6536 -7957 -13288 -8772 -5013 -3765 -3514 4778 8134 4070
6867 4070 243 2974 1730 251 -3524 -7793 210 5159 10211 9091 2447 -517 2119 -1313 -4471
6852d471K502L228N801j680l580L183M118J475J199J034k900n698j804o05j562
6837B40M267k400L234J3847J055m783j781r435k672l44L186j996n756n64n546
6822i448j671l928K76J0322N995P5L380o771k464J607m454l420j551N15N958O480
6806I01N623o448j1255k653K853o452K269J2586J68Q42n08J212m38k255l249k130
6790h934K650P570R2o125M277N557L48k66j649n25R81K474o13o01L839l4r684
6773f43p568J686N139k518k857L584M094L325k806l016n673K418N144k48o494
6758f433L911K442J090n721J573L633j576J325L652J099m069j157N017K934P61
6743H481o039j428J140O62P439N69k946K453J30k692L362P00j630o28K323K960
$$ plain form
6852 -4471 -1969 1259 7060 5380 1800 4983 9101 10576 11775 12809 9909 4211 2407 1802 240
6837 240 4507 2107 5341 19188 20243 15460 13679 4244 1572 1228 4414 2418 -3338 -3902 -9448
6822 -9448 -11119 -15047 -14771 -4449 1546 1621 5001 -1770 -4234 -2627 -7081 -10501 -12052 -11537 -5579 901
6806 901 6524 76 -11179 -13832 -10979 -17431 -15162 -2576 -2408 -1566 -2074 -862 -1300 -3555 -6804 -8934
6790 -8934 -6284 1286 1378 -4747 -470 5087 5435 5169 3520 2995 3976 6450 5837 5236 9075 9041 -643
6773 -643 -8211 -6525 -1386 -3904 -6761 -3177 917 4242 1436 -1580 -7253 -4835 309 61 -6433
6758 -6433 -2522 -80 1010 -4711 -3138 495 -1081 244 3896 4995 926 -231 4786 7720 8481
6743 8481 2442 1014 2154 2816 10255 10824 7878 10331 10461 7769 11131 11831 10201 9573 11896 14856
6727A4856K513j3746m032K410R00j989m242N673M995r27Q19l646q1M171L969N835
6711A7478j0167j084j542k006l940J198M231l793l984J451k000o05J308J638J638
6696a79l365j420P068K143J470k397l662k266O852P766m518p204m285m97p35r39
6680f168N115J584m457K754P94l191j915J0647M419j659k423k299J115N958K771
6665A3045K939m02j53M370N99j65q29p135k278O173q38j155q140k617P94l86j383
6648B439m961L938j237O204j745n222n096k942N005J1807k837K110J767q87n530
6633B813J302k177j949q53p708O208j655m65K870p101o756J84M653J177M250N258
6617E1m956n20L750J187m16m457q995l505P465L420l630p67O54j351M788K122
$$ plain form
6727 14856 17369 3623 -409 2001 2901 912 -3330 2343 7338 6411 7230 3584 3503 7674 11643 17478
6711 17478 7311 6227 4685 2679 -1261 -63 4168 375 -3609 -2158 -4158 -4763 -3455 -1817 -179
6696 -179 -3544 -4964 2104 4247 5717 3320 -342 -2608 4244 12010 7492 288 -3997 -4494 -5229 -6168
6680 -6168 -1053 531 -3926 -1172 -378 -3569 -5484 5163 9582 7923 5500 3201 4316 10274 13045
6665 13045 15984 15582 15429 19799 20398 20233 19404 12269 9991 16164 15326 14171 6031 3414 4208 3822 2439
6648 2439 -2522 1416 179 6383 4638 -584 -5680 -8622 -3617 8190 5353 7463 9230 8343 2813
6633 2813 4115 1938 -11 -864 -8572 -2364 -4019 -4484 -1614 -8715 -15471 -15287 -10634 -9457 -5207 51
6617 51 -4905 -5425 -1675 -488 -904 -5361 -14356 -17861 -10396 -6976 -10606 -11373 -10719 -12070 -7282 -5160
6601e160M49J696l990o588j052J694J496L672M363O1m213J785k82j05j644k395
6585a0213N449R817N365l37K458N171n043m459J507J527j223o120q442k067k548
6570i158J476m23j207M806l266k522L16j794J0533N818k552j400j395J16L661
6555C009m090l897J999N175N62l087l776N081N832l18o359r73q28J281n51n876
6539f816n861O55L15J929l103o646M142J802L495J207L79q123j104M657J2400
6524f72N811k991n125L06l96M47K007o380p349j603N540J0639J0237K372l341
6509I502l936o552j507o19m183Q15M516L6k120k521n460N757O101N527K469j053
6493F772o789j1947n46R088O669M022r64k381J887j0653k878k052R705O631k414
$$ plain form
6601 -5160 -4711 -3015 -7005 -13593 -14645 -12951 -11455 -7783 -3420 -3359 -7572 -5787 -6069 -6174 -7818 -10213
6585 -10213 -4764 5053 10418 10081 12539 17710 12667 8208 9715 11242 10019 3899 -4543 -6610 -9158
6570 -9158 -7682 -8105 -9312 -4506 -7772 -10294 -9978 -11772 -1239 4579 2027 627 -768 -652 3009
6555 3009 -1081 -4978 -2979 2196 2758 -329 -4105 976 6808 6490 131 -842 -1670 -389 -940 -6816
6539 -6816 -12677 -12022 -11707 -9778 -12881 -19527 -15385 -13583 -10088 -8881 -8502 -16625 -17729 -13072 -672
6524 -672 5139 2148 -2977 -2671 -3067 -2620 -613 -6993 -14342 -15945 -10405 234 10471 12843 9502
6509 9502 5566 -986 -2493 -3112 -7295 -6480 -1964 -1928 -4048 -6569 -12029 -6272 -171 5356 7825 6772
6493 6772 -17 -11964 -12510 -3422 3247 7269 6305 3924 5811 -4842 -7720 -9772 -67 6564 4150
6478D150k351n713k019J679K620n214J361N94p37L32O655K879k591n666n94m245
6462h860p80M641M797l446O8P117O687q96j0318n389M781K898j821l494P57K069
6446a189L755J1048L4J017j374n183l662o587n281J126n34M236O091L205j519
6431E183J762J3q778k185M024L973n501K028k561r26m273j744k313M52M974O058
6415A86k655k838l321K733M20J170l666P00k159N09K933K033O036L53k454m250
6399d270J63O103l459m816n714J953Q311L959l168m562Q223L615k937j485K007
6384C923p155k922Q879j438m168K715J627n714j346Q058Q38O11l395j84o93l968
6368d332k602p823k149K496J561N097N856L300J981M818Q46k529l568J023K658
$$ plain form
6478 4150 1799 -3914 -5933 -4254 -1634 -6848 -5487 -4893 -5630 -5298 1357 4236 1645 -4021 -4615 -8860
6462 -8860 -9640 -4999 -202 -3648 -3580 3537 10224 9328 -990 -6379 -1598 1300 -521 -4015 -3258 -1189
6446 -1189 2566 13614 13648 14665 13291 8108 4446 -2141 -7422 -6296 -6830 -2594 3497 6702 5183
6431 5183 6945 6958 -1820 -4005 19 3992 -1509 519 -2042 -2968 -7241 -8985 -11298 -10846 -5872 186
6415 186 -2469 -5307 -8628 -5895 -5475 -4305 -7971 -7271 -9430 -8921 -5988 -3955 2081 2434 -20 -4270
6399 -4270 -4107 1996 -1463 -6279 -11993 -10040 -1729 2230 -938 -5500 2723 6338 3401 1916 3923
6384 3923 -3232 -6154 2725 1287 -2881 -166 1461 -4253 -5599 2459 3297 3908 513 329 -364 -4332
6368 -4332 -6934 -14757 -16906 -14410 -12849 -7752 -1896 1404 3385 8203 9049 6520 2952 3975 6633
6353F633J543m384O810o327p284L357L41j580n884L143M568o07r45Q68r82R00
6337A70K416j917j384m637l495N311K383k448L964K430n01K077q76N244o14m947
6321C176m881L611J166J028N32k008J618k55J547L039l731j173L932M27k375K259
6305G912K130j384m774j0608J36L911l50l360l127j248l517k266j101l575Q786
6290a2435N740J386L249j795J788j30k678M225l43m254O142K740m401m052k274
6275g092m322l432J323L026O073j18P928M205K091J224k61k638l473j962J883
6260D455J342l02L55j251j608L22n54m734O75R95p15J396m804J648n33M770L665
6243E122l22m596J537P528N786r547o807P07o11j582j275m157o37J827J988j802
$$ plain form
6353 6633 8176 3792 10602 4275 -3009 348 689 -891 -6775 -3632 936 329 -616 252 -730 170
6337 170 2586 669 -715 -5352 -8847 -3536 -1153 -3601 363 2793 2292 4369 3493 8737 8123 3176
6321 3176 -1705 1906 3072 4100 4632 2624 4242 3987 5534 8573 4842 3669 7601 8028 5653 7912
6305 7912 10042 8658 3884 -6724 -6588 -2677 -3027 -6387 -9514 -10762 -14279 -16545 -17646 -21221 -12435
6290 -12435 -6695 -5309 -2060 -3855 -2067 -2197 -4875 -650 -993 -5247 895 3635 -766 -4818 -7092
6275 -7092 -11414 -14846 -13523 -10497 -4424 -4542 3386 7591 9682 10906 10645 8007 4534 2572 4455
6260 4455 5797 5495 5850 4599 2991 3313 2759 -1975 -1300 -305 -1020 376 -4428 -2780 -3313 1457 5122
6243 5122 4800 204 1741 9269 15055 5508 -1299 -592 -1203 -2785 -4060 -8217 -8854 -7027 -5039 -6841
6227f841L109K799k591N178O004l827p063n850J294Q709K99o43m005n990j017
6212a0435R43K268J098Q850K232K399n687k606m617k647m73K583P1N042l337r96
6196e312N589P579j038K408l813j0001M152j899P48M484L785p48o33M9k188m533
6180a371K345m93M116Q986q21m661K389J080j0167L165Q008K573p363r497j403
6165c114N805M126r92q387j229J0737P438J28n589j0374n378N801K013K732J983
6150E700P833k712r330J065j990j80Q968J191k730O316L797k787m3K688j1510
6135F276o374n605K331k263N99n820J514N536L096M48k086q63J424n981P19Q779
6119A730M507N779k76J448R52o182o577m652l653j343J1388K903n089m199j56
$$ plain form
6227 -6841 -3732 -933 -3524 1654 7658 3831 -3232 -9082 -7788 921 1220 577 -3428 -9418 -10435
6212 -10435 -9492 -7224 -6126 2724 4956 7355 1668 -938 -5555 -8202 -8675 -6092 -6021 -979 -4316 -5312
6196 -5312 277 7856 6818 9226 5413 -4588 -436 -2335 -1587 2897 6682 5934 5301 5350 3162 -1371
6180 -1371 974 481 4597 13583 12762 8101 10490 11570 1403 4568 12576 15149 7786 -1711 -3114
6165 -3114 2691 6817 5825 -2562 -3791 6946 14384 14512 8923 -1451 -6829 -1028 985 3717 5700
6150 5700 13533 10821 1491 2556 566 386 9354 10545 7815 14131 17928 15141 15098 17786 6276
6135 6276 -98 -5703 -3372 -5635 -5036 -10856 -9342 -3806 -710 -262 -2348 -3211 -1787 -7768 -7049 1730
6119 1730 6237 12016 11740 13188 14140 7958 1381 -3271 -6924 -8267 3121 6024 935 -3264 -3420
6104c420O79j865M40L428L884L537n53m325r41M056J445r211N93J003M44m69L15
6087i60p832M226K890q39j637p83K424J030M98m0o811n214l581M883L357N387
6071c002N085j948m18k154K748j462K461m192L488J678m653J664K29Q79O132k118
6055D417P077M460n558p575Q70L086q62K646l107j238k490J313o327J629J826
6040A67p3l694N914N963j771l875k990o968j037j942M780O631l213k570K710M861
6024B893O278J41n177p449N79K057O495K328J596L0O94J636q759r104n7M149j727
6007c397l80J1942n113k095p982j1252K438O117K215M362P827K27q84n256J846
5992F15L905O59M043L549n101n019q088J333P403j369k140l893L918L30q091j0445
$$ plain form
6104 -3420 -2741 -4606 -4166 -738 3146 6683 6130 1805 864 4920 6365 -2846 -2253 -1250 -806 -1275 -960
6087 -960 -8792 -4566 -1676 -2515 -4152 -4935 -2511 -1481 -983 -1023 -7834 -13048 -16629 -11746 -8389 -3002
6071 -3002 2083 135 -283 -2437 311 -1151 1310 -2882 606 2284 -2369 -705 -476 403 6535 4417
6055 4417 11494 15954 10396 2821 3691 6777 5915 8561 5454 4216 1726 3039 -3288 -1659 167
6040 167 94 -3600 2314 8277 6506 2631 -359 -7327 -8364 -10306 -5526 1105 -2108 -4678 -1968 2893
6024 2893 9171 9312 4135 -3314 -2735 -678 5817 8145 9741 9771 10465 12101 3342 -5762 -5819 -1670 -3397
6007 -3397 -3777 8165 3052 957 -7025 -18277 -15839 -9722 -7507 -3145 4682 4909 4025 -1231 615
5992 615 4520 5179 9222 12771 7670 2651 -5437 -4104 3299 1930 -210 -4103 -185 145 -7946 -18391
5976a8391K84L984P596K568K443R58O889M04p33K125M350j324o87m115P936N67
5960A4854k577R57r06M936m257M42l350m204L242J3m217R5J873j211l378k461
5944a49K685J933j542l896r09k909N45n27J077J70n021k349N607M534p72L035
5928A512k1o713K493Q547J214m53J152K263k085o775k16N842K259O061l41n546
5912I193n50l395l701l640K683P34l397J010j029n670J423J135n382L124P195
5897b67L34J293p498n910m017O058N037K428K736L049Q5m763N093K860k634L216
5881G100J020M131j303m321k428L796m220R25k77N65k987j703k692N695L09k120
5865A490o741q51k421N657O946M633j532M985o717m963J100K088j472J457m080
$$ plain form
5976 -18391 -18107 -14123 -6527 -3959 -1516 -558 6331 6735 6002 8127 12477 11153 10466 6351 14287 14854
5960 14854 12277 13234 12328 17264 13007 13449 10099 5895 9137 9150 4933 5028 6901 5690 2312 -149
5944 -149 2536 4469 2927 -969 -1878 -4787 -4242 -4769 -3692 -3522 -8543 -10892 -5285 -751 -1523 1512
5928 1512 1491 -5222 -2729 5818 7032 6579 7731 9994 7909 1134 918 6760 9019 15080 14739 9193
5912 9193 8643 5248 1547 -2093 590 1324 -2073 -1063 -2092 -7762 -6339 -5204 -10586 -7462 -267
5897 -267 67 1360 -6138 -12048 -16065 -10007 -4970 -2542 194 3243 3328 -1435 3658 6518 3884 7100
5881 7100 8120 12251 10948 6627 4199 7995 3775 4700 4423 4988 2001 298 -2394 3301 3610 1490
5865 1490 -5251 -6102 -8523 -2866 4080 8713 7181 12166 5449 486 1586 3674 2202 3659 -421
5850d21Q13l51K347o75K902L307J645n123k621N681j346l679l874n484P05j533
5834g707N195M455N64J921K298p910k246j60k365M059L295j000J962O226K331
5819A0918n41K93N312l98r97M46J196L516j394p764J443J178n029K659J333m980
5803G191m393l293k570p638R93K564l03k473M723J0376m51k240J755k286k359
5788d04k976k85K843J622l865m854l80R86L062k629o25J404l2R012N10j1071n785
5771a3467L098m39n514J649P529k185l030q427Q777R87l197J641P441N909O984
5756G756n18m321m565l18j881k322L7K28J0741N405p062m474k543n394J846K922
5740d463j027J604q64P051l181L109k631l89o160m13P296m446l317q65l730p67
$$ plain form
5850 -421 392 41 2388 1713 4615 7922 9567 4444 1823 7504 6158 2479 -1395 -6879 -6174 -7707
5834 -7707 -2512 1943 2507 4428 6726 -1184 -3430 -3590 -5955 -1896 1399 399 2361 8587 10918
5819 10918 10377 10670 15982 15584 14587 15033 16229 19745 18351 10587 12030 13208 8179 10838 12171 7191
5803 7191 2798 -495 -3065 -10703 -9710 -7146 -7449 -9922 -5199 5177 4726 2486 4241 1955 -404
5788 -404 -3380 -3665 -822 800 -3065 -7919 -8299 -7313 -4251 -6880 -7505 -6101 -6133 2879 3389 -7682 -13467
5771 -13467 -10369 -10808 -16322 -14673 -7144 -9329 -12359 -20786 -12009 -11022 -14219 -12578 -5137 772 7756
5756 7756 7238 2917 -1648 -1966 -3847 -6169 -6132 -5904 4837 10242 3180 -1294 -3837 -9231 -7385 -4463
5740 -4463 -5490 -3886 -4750 2301 -880 2229 -402 -791 -6951 -7364 -68 -4514 -7831 -8696 -12426 -13193
5724a3193J5058J1665j733o64n87n231k297L394n125l944K886p096j430N493K352
5709d52L70q30m917j648M83P757L345K640m288l321j20M379J095k201o95j983
5693c86J426N434K686O07n810m203J727n00M774k061o053k2K731M051J105j064
5677D442j5N699M141k518m293n374n338n922K181L685P155N288k917j696P56k164
5661C110j680J448J609O621r328o13l05L97J554J835P14K172K961n206o255n565
5645f531J869O171p8M165o74l798J807R39N06m503Q87r01l85Q33K806K158Q546
5628A3817O313m037k103q226m99o703p823j621Q296Q23J483L050L667n750P2R317
5612A0076O754J218o812l70Q14l766J767K414o419m234j1574M993M608L738K873
$$ plain form
5724 -13193 1865 13530 11797 11133 10546 5315 3018 6412 1287 -2657 229 -6867 -8297 -2804 -452
5709 -452 -82 -912 -5829 -7477 -6994 763 4108 6748 2460 -861 -981 3398 4493 2292 1597 -386
5693 -386 1040 6474 9160 9767 3957 -246 1481 981 5755 3694 -2359 -2381 350 4401 5506 4442
5677 4442 4427 10126 14267 11749 7456 2082 -3256 -9178 -6997 -3312 3843 9131 6214 4518 5274 3110
5661 3110 1430 2878 4487 11108 1780 1167 862 1259 2813 4648 5362 7534 10495 5289 -966 -6531
5645 -6531 -4662 1509 1431 5596 4922 1124 2931 3870 4376 -127 760 -141 -526 307 3113 5271 13817
5628 13817 20130 16093 13990 5764 5265 -1438 -9261 -10882 -2586 -1763 -280 2770 6437 687 759 10076
5612 10076 16830 18048 11236 10866 11680 7914 9681 12095 5676 1442 -10132 -5139 -531 3207 6080
5597F080J312m733l924n059J867K285p859M203K081j552P3K548l680Q439J3270
5582A5351P9m824m844p248L435m19l25m916l259N708k109N358M936o130l36J268
5566A725O388n12O156o170q56j845m767q536k349O546O193J913j539L625P17n183
5550A506N842J393k777o038m15l948K692M054j945k796L830M47o039N72K562O732
5534E672N485m630n511q76O861n70q62R32o650n743R278O094j776n991o537k307
5518g131k704M130J2178N506K430j0715p700M597k148O715P063k059p103o995
5504c936l840J569j874L678N137l690p55n37l749m234N92K905Q173P064j946o194
5488a637O377K803j007k716l321m781j111j407K13K740O852O453o430p531r37
$$ plain form
5597 6080 7392 2659 -1265 -6324 -4457 -2172 -10031 -5828 -3747 -5299 -5226 -2678 -6358 2081 15351
5582 15351 15430 10606 5762 -1486 1949 1530 1205 -3711 -6970 -1262 -3371 1987 6923 793 457 1725
5566 1725 8113 7601 13757 7587 6731 4886 119 -8417 -10766 -4220 1973 3886 2347 5972 6689 1506
5550 1506 7348 8741 5964 -74 -489 -4437 -1745 2309 364 -2432 1398 1845 -4194 -3622 -1060 5672
5534 5672 11157 6527 1016 140 7001 6431 5569 6501 -149 -5892 3386 9480 7704 1713 -4824 -7131
5518 -7131 -9835 -5705 6473 11979 14409 3694 -4006 591 -1557 5158 12221 10162 3059 -3936
5504 -3936 -7776 -6207 -8081 -4403 734 -2956 -3711 -4248 -7997 -12231 -11639 -8734 -561 6503 4557 -1637
5488 -1637 4740 7543 6536 3820 499 -4282 -5393 -6800 -6587 -3847 3005 9458 3028 -4503 -5440
5473e440j458M614L756P69k449R07N16o43L022k395K705l312n538O70K728J492
5457e6m537J955N133Q77j030o238J951N871r493l151L478n704P286j03k209J944
5441d026L733K170O95k770l022j637k711N22o22o736K952J1122M70r04J455l390
5425b699M31N91o93q067N071L985n752M578J582k847K41O093Q437P494k406q306
5409G733j94r941n864K493R035K493N378J761k755n068j773p630m607N911N590
5394B562J627j831L499J860M043n989J103j214q83O20p43n803n64L95L135r26
5378H91j728Q0l656K082O871K844l176K837l655m000M23j067r17j225o792k49
5362a0437M97l33M408p232J15L911N632K644K286J2326K201o945l446O44L46N57
$$ plain form
5473 -5440 -6898 -2284 1472 2241 -208 699 1215 572 3594 1199 3904 592 -4946 -4276 -1548 -56
5457 -56 -4593 -2638 2495 3372 2342 -3896 -1945 3926 -5567 -8718 -5240 -10944 -3658 -3761 -5970 -4026
5441 -4026 -293 1877 2572 -198 -3220 -4857 -7568 -7046 -7668 -14404 -11452 -330 140 -764 691 -2699
5425 -2699 -2268 -1677 -2370 -10437 -5366 -1381 -7133 -2555 -973 -3820 -3579 2514 10951 18445 16039 7733
5409 7733 7539 -2402 -8266 -5773 3262 5755 11133 12894 10139 5071 3298 -4332 -8939 -3028 2562
5394 2562 4189 2358 5857 7717 11760 5771 6874 5660 4777 5397 4654 -1149 -1713 -1318 1817 891
5378 891 -837 -757 -4413 -2331 4540 7384 4208 7045 3390 -610 -187 -1254 -2171 -3396 -10188 -10437
5362 -10437 -9940 -10273 -5865 -13097 -12982 -9071 -3439 -795 1491 13817 16018 9073 5627 6271 6617 7174
5346G174j051J937M368N56n77p16J031n921l041l772L007l16K495J19j457j125
5330B711m128M51J770L720q24L251J354J406l507r452m279M661J679m108K805
5315b490j424K752Q313L95m613l136J215J2049m79k697p59K293n771j650j767
5300B231l956k615K519P11m950n695J121J817O283J114k008L128J0514N494o553
5285I155p1n22j856M42q944p77L381O694l437L184J733m399K163k012o392j885
5269c543K171N599o34O94m394m375L85K716K332q17r913m112O467N078P306L435
5253H395l786r3K188M549J888r189m12o482n785K29M675J469L145M2j388q581
5237i136M169J3114N185r294p999L980K68L256K440l649M627j74n33J269L73j11
$$ plain form
5346 7174 6123 8060 12428 12984 12407 11691 12722 6801 3760 -12 2995 2679 5174 5293 3836 2711
5330 2711 -1417 -966 804 4524 3700 6951 8305 9711 6204 -3248 -7527 -2866 -1187 -5295 -2490
5315 -2490 -3914 -1162 7151 7546 2933 -203 1012 13061 12582 9885 9126 11419 5648 3998 2231
5300 2231 -1725 -4340 -1821 -1110 -6060 -11755 -10634 -8817 -2534 -1420 -3428 -300 10214 15708 9155
5285 9155 9084 8562 6706 7148 -1796 -2573 808 7502 4065 7249 8982 4583 6746 4734 -1658 -3543
5269 -3543 -1372 4227 3593 4287 -107 -4482 -4097 -1381 951 134 -9779 -13891 -7424 -2346 4960 8395
5253 8395 4609 4516 6704 11253 13141 3952 3540 -2942 -8727 -8498 -3823 -2354 791 833 -555 -9136
5237 -9136 -4967 8147 13332 4038 -3961 19 287 3543 5983 2334 6961 6787 6254 7523 7896 7785
5221G785n128j318j697p041N936J133p4m024M481J392l274J866n80L388P291L761
5205A3897l312L03q474l193J886j413K582K021k540j280j040L087M797l59J048
5190H010k42L006q193K36q94N592P003k594r480k272M830O673j269n765j0184
5175e543O410K119O066M933m43j1379r068m053J923j064P35P626P623K413ok485
5159E807j792J819l722L15p40K132J096n74n756j949K546O660K906l277K020k333
5143E158j316N475L270J456M867j962k668l056q470k830k419l557J984N427M155
5128E514N149J595j12K591n351p929o914L041M247K157K112o287J085J807k176
5113E29R48k624j360M281pM769m73j42k786m924j999J108O486N48M692l309K792
$$ plain form
5221 7785 2657 1339 -358 -7399 -1463 -330 -404 -4428 53 1445 -1829 37 -543 2845 10136 13897
5205 13897 10585 10888 2414 -779 1107 -306 2276 4297 1757 477 -563 2524 7321 6962 8010
5190 8010 7768 10774 2581 2817 1923 7515 14518 11924 2444 172 5002 11675 10406 4641 -5543
5175 -5543 867 2986 9052 13985 13542 2163 -6905 -10958 -9035 -10099 -9364 -1738 5885 8298 8292 5807
5159 5807 4015 5834 2112 2427 1687 3819 4915 4341 -1415 -3364 -818 5842 8748 5471 7491 5158
5143 5158 3842 9317 12587 14043 18910 16948 14280 11224 2754 -76 -2495 -6052 -4068 1359 5514
5128 5514 10663 12258 12146 14737 9386 1457 -5457 -2416 1831 3988 6100 -187 898 2705 529
5113 529 1477 -1147 -2507 1774 1767 6536 6063 5921 3135 -1789 -3788 -2680 3806 4354 9046 5737 8529
5096H529P069p536n868k139n195M684j076o564l115Q218P629k786o339L35K416
5081a738Q98j027P261M999L144p776k179l72l382J596k274l320J768L108L081
5066C787k350o075J0000J0858k915p096r194R43L445m410m56M41P57j344K09N738
5050B338l346m323J949N377N566O54l527K143k641r635J968P075K231L06k850
5035C285j690m28O22o37L677Q355l452m939Q12m236k86M847j319r6J567J482K823
5018A0387K087J393p354K502o83o156N431J171n096M48K802j0232l321j228N122
5003b727O66J318j7K248J679k430O59j105p46M086l959n356J22j89P47n194l10
4986a0508N501L707o81J518j111j073K597N100J947M333P81l137P81M519K886
$$ plain form
5096 8529 15598 8062 2194 55 -5140 -456 -1532 -8096 -11211 -2993 4636 1850 -4489 -4154 -1738
5081 -1738 -840 -1867 5394 10393 13537 5761 3582 3210 -172 1424 -850 -4170 -2402 706 3787
5066 3787 1437 -4638 5362 16220 13305 6209 -2985 -2042 1403 -3007 -3463 -3022 -2265 -3609 -3400 2338
5050 2338 -1008 -5331 -3382 1995 7561 8215 4688 6831 4190 -5445 -3477 3598 5829 6135 3285
5035 3285 1595 1167 1789 1152 4829 13184 9732 4793 5605 1369 1083 5930 4611 4515 6082 7564 10387
5018 10387 12474 13867 6513 9015 8332 2176 7607 8778 3682 4130 6932 -3300 -6621 -7849 -2727
5003 -2727 -2061 -743 -760 1488 3167 737 1396 291 -455 3631 -328 -5684 -5562 -5751 -5004 -10198 -10508
4986 -10508 -5007 -1300 -1981 -463 -1574 -2647 -50 5050 6997 11330 12111 8974 9755 14274 17160
4971A7160r517n582m134L145J0178M552P92o753m125k728q801l368n94P130L335
4956F90m207l096j407O025O795J067P714J99j1366n246N600N4J00k876K980N499
4940H525j757L681r27K766J417m231n337P29L931K305k986O4j571J124m843p847
4924d957o96K791l138M534R90K237L22j006k939L984J516m295j721j467n25R390
4908E020R91L02O972K2j2094m584K036J862j813m288n754O078O413j579O515k875
4892C224m041q76j140j091Q88M787N30j133K288J771L210j197k786o871k931M669
4876f99P725l060l340k857J54M034N249k438q07N1J754J66J068K442k913m224
4860B305k831K193j292R63J964n832l02L397k120m41J674M72K916Q339J1130p04
$$ plain form
4971 17160 7643 2061 -2073 1072 11250 15802 16594 9841 5716 2988 -5813 -9181 -9775 -2645 690
4956 690 -3517 -6613 -8020 -1995 4800 5867 13581 13780 2414 -2832 2768 2822 2922 46 3026 8525
4940 8525 6768 10449 9522 12288 13705 9474 4137 4866 8797 11102 8116 8180 6609 7733 2890 -4957
4924 -4957 -5653 -2862 -6000 -1466 -476 1761 2083 1077 -1862 2122 3638 -657 -2378 -3845 -4370 5020
4908 5020 6011 6313 13285 13307 1213 -3371 -1335 527 -1286 -5574 -11328 -5250 1163 -416 6099 3224
4892 3224 -817 -1693 -2833 -3924 -3036 1751 2281 1148 3436 5207 8417 7220 4434 -2437 -5368 -699
4876 -699 7026 3966 626 -2231 -2077 1957 7206 4768 3961 4012 5766 5932 7000 9442 6529 2305
4860 2305 -526 1667 375 1338 3302 -2530 -2832 565 -1555 -1996 -322 150 3066 11405 22535 21831
4844B1831j1023k350P83J52N611J653o769m052M363O406K694m076k692r744o906
4829d119K961k672j020N828L979j643k407R85L811n198N31Q87M495j540o665j237
4813c024K102q44j153n642P85M985R802K074jj624J265J978k970o196L715O786
4797A2038n88m809k291l127J762K484j668M466j722n220j394k447K417M305K774
4782F980n191m034m937j364J136r42Q923L678m238k724l403J816L776R64J667
4767B107r64o24l425l63jl982J788O283K239k628K338J763l460K629j382n068
4751b750o6J901p378l469R503J726K55n087K99j264p207K024l623P471R479O622
4735H436k416p43l868l061m867L012K67N093J729k202M84J352n532l006k093j926
$$ plain form
4844 21831 10808 8458 9241 9393 15004 16657 9888 5836 10199 16605 19299 15223 12531 2787 -4119
4829 -4119 -1158 -3830 -4850 978 4957 3314 907 1892 5703 505 1036 1923 6418 4878 -1787 -3024
4813 -3024 -922 -1766 -2919 -8561 -7776 -2791 7011 9085 9084 7460 8725 10703 7733 1537 5252 12038
4797 12038 11450 6641 4350 1223 2985 5469 3801 8267 6545 1325 -69 -2516 -99 4206 6980
4782 6980 1789 -2245 -7182 -8546 -7410 -8352 571 4249 11 -2713 -6116 -4300 -524 440 2107
4767 2107 1143 519 -2906 -3269 -3270 -7252 -5464 819 3058 430 2768 4531 1071 3700 2318 -2750
4751 -2750 -2816 -915 -8293 -11762 -2259 -533 -278 -5365 -5066 -6330 -13537 -11513 -15136 -7665 1814 8436
4735 8436 6020 5277 1409 -1652 -6519 -3507 -3240 1853 3582 1380 1864 3216 -2316 -5322 -7415 -9341
4719i341N761L599m678l430Q202K540J889o090n962j433J858J895K879M931N84
4704C204p8k542K030r24o085L478L790j300k275J449M541m268m387L495J395L742
4688E265L057j1621j147P770L344o517k772j622j125k504K944R72O901P294l574
4673F665m852L286K01J874o410j698n63m526j974M393N322P7O138L00l852p799
4657c418o335k743J133M713K974l417P098L897n66k485R83n795l28P550M99l658
4641A02P27m807K307M119m058p071N457M697k677k296l1L835K573K589M8m617
4625H97m54l079L535L455k425J485L431l383r830j829K612L166L726j9J44n89
4609H43n280L147M281L405M296k798n43k310o35M731o209l131k751n770L063N799
$$ plain form
4719 -9341 -3580 19 -4659 -8089 113 2653 4542 -1548 -7510 -8943 -7085 -5190 -2311 2620 3204
4704 3204 3126 584 2614 1690 -4395 -917 2873 1573 -702 747 5288 1020 -3367 128 1523 5265
4688 5265 8322 -3299 -4446 3324 6668 151 -2621 -4243 -5368 -7872 -4928 -3956 2945 10239 6665
4673 6665 1813 5099 5300 7174 764 -934 -1497 -6023 -7997 -3604 1718 1795 7933 8233 4381 -3418
4657 -3418 -9753 -12496 -11363 -6650 -3676 -7093 5 3902 3336 851 1834 -3961 -4289 3261 3760 102
4641 102 829 -3978 -1671 2448 -1610 -8681 -3224 1473 -1204 -3500 -3531 304 2877 5466 5514 897
4625 897 443 -2636 899 4354 1929 3414 6845 3462 -6368 -8197 -5585 -2419 1307 1288 1432 843
4609 843 -4437 -1290 2991 6396 10692 7894 7351 5041 4406 9137 2928 -203 -2954 -8724 -5661 138
4593A38M104J700K372k445L263L072k988m265m084M763K290n606k096n150k155
4578g087N854k65j469k645K571J823j888Q417j411n431j880N313J540j868p683
4563f109L565Q711O271J816K702K976n326p98m029l140l466K173J057n654l129
4548b380Q067j303j849K21n560l041K668P454N342K606j375p422J258J958L965
4533A0609k106j3219N12J285L198n609j994K618j741L543K687k130m255P19K60
4518e623N62O55n40J642J141j722P33K551L8Q75j204K37j72M118M223p2o422N1
4500A071M385l678o053j737L748O322J119K175K266j2025m117L511K772M387j364
4485B782o85j112P487M113m635n799q34P309O450m654m573o537k952k858r11P696
$$ plain form
4593 138 4242 5942 8314 5869 9132 12204 9216 4951 867 5630 7920 2314 218 -4932 -7087
4578 -7087 -1233 -1498 -2967 -5612 -3041 -1218 -3106 5311 3900 -1531 -3411 1902 3442 1574 -6109
4563 -6109 -2544 6167 12438 14254 16956 19932 14606 13808 9779 6639 3173 5346 6403 749 -2380
4548 -2380 5687 4384 2535 2756 -2804 -5845 -3177 4277 9619 12225 10850 3428 4686 6644 10609
4533 10609 8503 -4716 -4204 -2919 279 -5330 -7324 -4706 -6447 -2904 -217 -2347 -6602 -5883 -5623
4518 -5623 -5061 -4406 -4946 -3304 -2163 -3885 -3152 -601 -563 312 -892 -655 -827 3291 7514 7442 1020 1071
4500 1071 5456 1778 -4275 -6012 -2264 4058 5177 7352 9618 -2407 -6524 -3013 -241 4146 2782
4485 2782 2097 985 8472 12585 7950 2151 1317 8626 15076 10422 5849 -688 -3640 -6498 -7409 287
4469B87L24j605m014L79N721p226O008o04r95q74j101L776p71N66M528L322m941
4452B780J313M409k335M919j085M90k174n48K389K037l130n526k478r045k127
4437a0111P308k156j347J502j705M044N110j124p498J603o214J825o07J021N600
4422b749J753p045n958k636P873Q162k542L618O593L76M02M527k757k471K464
4407I610k304K21P894J407R97J486k38o797L244L073M2K764n891p464p184P019
4391G879J761Q20J483q03n193l543J305Q34J320N248P56j599p630J757M210n060
4375C545n196k101L095M950P38J566N670L773P02p034q610l509O08Q97N016L405
4359G515K902n976j83k1m92O117l21l705L18m218k144k124k430M43M263j056P07
$$ plain form
4469 287 611 -994 -5008 -4629 1092 -6134 -126 -730 -1725 -2599 -3700 76 -695 -129 4399 7721 2780
4452 2780 4093 8502 6167 11086 10001 10491 8317 7769 10158 12195 9065 3539 1061 -7984 -10111
4437 -10111 -2803 -4959 -6306 -4804 -6509 -2465 2645 1521 -5977 -4374 -10588 -8763 -9370 -8349 -2749
4422 -2749 -996 -8041 -13999 -16635 -8762 -600 -3142 476 7069 7445 7847 12374 9617 7146 9610
4407 9610 7306 7527 15421 16828 17825 19311 19073 12276 15520 18593 18635 21399 15508 8044 860 7879
4391 7879 9640 10460 11943 11140 5947 2404 3709 4543 5863 11111 11867 10268 2638 4395 8605 3545
4375 3545 -1651 -3752 -657 4293 5031 6597 12267 16040 16742 9708 1098 -2411 -1803 -906 4110 7515
4359 7515 10417 4441 4258 4237 3745 9862 9541 5836 6154 1936 -208 -2332 -4762 -4319 -56 -1112 -405
4342d05J215j277L504K675l207J754J674l948j151N147K452n941L083P304Mp465
4326E418L384R08m503l833n09l345O034N4m5k394k327K504M203Q768r660j2680
4310h023n608K266M205K421P812O363l4m415n904J216j053n603K073N953K392
4295D061L040K72p917k309M352M465j616j601m72m431M936L994o235M349L545
4280H433N294j868q25q530j683J508l633J510L694Q59p30m686L873M113j1196
4265c867R91n411P1N270m036j711J243K449O011M514r79J419K725n335n815l170
4249e631j685m473M953Q981k05l837M954K856j02N141O5k305k232k609n201M742
4233C412nj142l874n551N80k624M841P825K790o50l855J868M694q364o783K290
$$ plain form
4342 -405 810 -467 3037 5712 2505 4259 5933 1985 834 5981 8433 2492 5575 12879 12883 5418
4326 5418 8802 9710 5207 1374 865 -2480 3554 3608 3563 1169 -1158 1346 5549 14317 4657 -8023
4310 -8023 -13631 -11365 -7160 -4739 3073 9436 9402 4987 -917 299 -754 -6357 -4284 1669 4061
4295 4061 7101 7373 -544 -2853 1499 5964 4348 2747 2275 -2156 2780 6774 539 4888 8433
4280 8433 13727 11859 11034 2504 821 2329 -1304 206 3900 4759 4029 -657 3216 7329 -3867
4265 -3867 -2876 -8287 -8216 -2946 -6982 -8693 -7450 -5001 1010 5524 4545 5964 8689 3354 -2461 -5631
4249 -5631 -7316 -11789 -6836 2145 1940 -1897 3057 5913 5811 10952 11017 8712 6480 3871 -1330 3412
4233 3412 3407 2265 -1609 -7160 -6580 -9204 -4363 3462 6252 5602 1747 3615 8309 -55 -6838 -4548
4217d548K601K094R165O245N91n117N212j96n744J205r22j982o643j196N531J07
4201F403K531L392n006j601m638l008O447L545N987P936m808j0534q278k618K154
4186b096j57P122M016n750K67j065p135P84N952l945k591N13l153K869N165J728
4170B524o442l688q8k529k674J1699L154l845r30K407M127Q13K029N731p980j018
4154C290k745l819P057J764L212N203m908q078K134l509n263O922j852k843l509
4139f944l375l272P574O067j060m616M812k690K882N824K044K236n85o4j369J323
4123H787m573j3648M994O378K275l70q327J734l17J719K521J272m146o74Q645
4108F270L309n387L168j404k480j384N569j995R93K969J378l465j647Q49l856
$$ plain form
4217 -4548 -1947 147 9312 15557 16148 11031 16243 16047 10303 11508 10586 8604 1961 765 6296 6403
4201 6403 8934 12326 7320 5719 1081 -1927 4520 8065 14052 21988 17180 6646 -1632 -4250 -2096
4186 -2096 -2253 4869 8885 3135 3402 2337 -4798 -4014 1938 -2007 -4598 -4085 -7238 -4369 796 2524
4170 2524 -3918 -7606 -7694 -10223 -12897 -1198 1956 -1889 -2819 -412 3715 4528 6557 12288 4308 3290
4154 3290 545 -3274 3783 5547 8759 13962 9054 976 3110 -399 -5662 1260 -592 -3435 -6944
4139 -6944 -10319 -13591 -6017 50 -1010 -5626 -814 -3504 -622 5202 7246 9482 8897 8833 7464 8787
4123 8787 4214 -9434 -4440 1938 4213 3843 -4484 -2750 -3067 -1348 1173 2445 -1701 -2375 6270
4108 6270 9579 4192 7360 5956 3476 2092 7661 5666 6659 9628 11006 7541 5894 6743 2887
4093B887j71K966j489j08K92J165N368j186O233l46n280J516o0L027m752J102
4077A1164k837o215m283O290O785j256o959M25K428o577p38L164j532j411p35
4062b287L001N829L034j469j819r23l478n652N778K805k24o099j506O944O05Q855
4046A3394l481r458K389M361p24n042k919j920N071K643l027j542k189J063O572
4031E191M521K485j803m910l504j759j551k910l195N973L587N353L410j900j591
4016G397m722o116N433M204N191L033j385o37m718p257p61J871m889m43j604k81
4000e684P161M756n885n118M223O349L814m824n596N900L316k515O552J000j529
3985A1920j981j581k25k602P14k433l142l968J082j865J047j994m619O2L449O426
$$ plain form
4093 2887 2716 5682 4193 4085 4377 5542 10910 9724 15957 15611 10331 11847 11787 14814 10062 11164
4077 11164 8327 2112 -2171 4119 10904 9648 2689 3114 5542 -1035 -1773 1391 -141 -1552 -2287
4062 -2287 714 6543 9577 8108 6289 5366 1888 -3764 2014 4819 4595 -1504 -3010 3934 4539 13394
4046 13394 9913 455 2844 7205 6481 1439 -1480 -3400 1671 4314 1287 -255 -2444 -1381 5191
4031 5191 9712 12197 10394 5484 1980 221 -1330 -4240 -7435 -1462 2125 7478 10888 8988 7397
4016 7397 2675 -3441 1992 6196 11387 14420 13035 12398 7680 423 -338 1533 -3356 -3799 -5403 -5684
4000 -5684 1477 6233 348 -4770 -547 5802 9616 4792 -804 5096 8412 5897 12449 13449 11920
3985 11920 9939 8358 8133 5531 6245 3812 670 -3298 -2216 -4081 -3034 -5028 -9647 -9585 -6136 290
3969B90N065Q09j364P32k936L061O848j700m330J189k486o964k700L822L57m397
3953d704L792N427O026J776n670l072k537K963K976j566p564m211m170m413M884
3938a0063O124K81j694j053k772m35J0504N867j632M618N296q50r807j968J210
3923C626n531J069J164K440R85L769n053l506l103J137l543K255N344J004j285
3908G72J190n164k562K181P630O620J62j556k286K319N3n728k98o13p747L937
3892a090P82L84k717J955J3177j050o754j843L532l142o183q37J1169N589j789
3877A1183m802J767q71r209J411Q665r93p449M163N907J704N134L933k333p870
3862A0340p910n626N776O068J495q782j968K646k591n5j295M037Q63K384J537
$$ plain form
3969 290 5355 6164 4800 5532 2596 5657 12505 10805 6475 7664 5178 -1786 -4486 -664 -307 -4704
3953 -4704 -912 4515 10541 12317 6647 3575 1038 4001 6977 5411 -2153 -6364 -10534 -14947 -10063
3938 -10063 -3939 -3658 -5352 -6405 -9177 -9612 892 6759 5127 9745 15041 14191 4384 2416 3626
3923 3626 -1905 -836 328 2768 3753 7522 2469 -1037 -4140 -3003 -6546 -4291 1053 2057 772
3908 772 1962 -3202 -5764 -3583 4047 10667 10829 9273 6987 9306 9359 3631 3333 2720 -5027 -1090
3892 -1090 -308 76 -2641 -686 12491 11441 4687 2844 6376 3234 -2949 -3786 7383 12972 11183
3877 11183 6381 8148 7277 -1932 -521 8144 7151 -298 3865 9772 11476 16610 20543 18210 10340
3862 10340 2430 -3196 2580 8648 10143 1361 -607 2039 -552 -607 -1902 2135 2998 5382 6919
3847F919n496m631m212l741L541Q847L949J401O197L807J083m757p290o571m154
3832e108M319l59j251M339k130K766N266r88M964J1941j461j3834k907k625O480
3817I412L643k934j643l405L270L122n658K824M827N155o279m703Q982L086l8
3802A9661o65m790l179O205P111j945n742k835p238j304K074n291l255l076k071
3787f340L455M120M98P56l007J707N225K979N802q69j712k061m582l400l779K599
3771A391M080J431o554o357L541O47k834k319j348P220M326n248O298k099m114
3756a939k594O368M217m818J277K914M160J63m021q247o708J944P76P954P681
3741I127j834j0336j479k50L862K215K806r39K428K041M716o958j0462O34j197
$$ plain form
3847 6919 1423 -3208 -7420 -11161 -7620 1227 5176 6577 12774 16581 17664 12907 5617 -954 -5108
3832 -5108 -789 -1148 -2399 1940 -190 2576 7842 6854 11818 23759 22298 8464 5557 2932 9412
3817 9412 13055 10121 8478 5073 8343 11465 5807 8631 13458 18613 12334 7631 16613 19699 19661
3802 19661 18996 14206 11027 17232 24343 22398 16656 13821 6583 5279 7353 2062 -1193 -4269 -6340
3787 -6340 -2885 1235 1733 2489 -518 1189 6414 9393 15195 14326 12614 10553 5971 2571 -1208 1391
3771 1391 5471 6902 348 -6009 -2468 -1821 -4655 -6974 -8322 -1102 3224 -2024 4274 2175 -1939
3756 -1939 -4533 1835 6052 1234 2511 5425 9585 9748 5727 -2520 -9228 -7284 -6508 1446 9127
3741 9127 7293 -3043 -4522 -4772 -910 1305 4111 3172 5600 7641 12357 5399 -5063 -4429 -5626
3726e626J113r19k078M273n47L274K008j827l565k489Q380K853J910J016m324
3711C452k613p5n22k629k26M582Q114K453m74K44O344j3271j0725L909m172n687
3695a1296K067P735M739q16m27Q111P610M40p411r82l601J351k55j943r74L022
3679G370o47L74M224m590M746r11l844k498K307K547j071k705l303J506j644n104
3663c243N647L864Q330m479n974n629J321M406L349n039j893L915l427R86N324
3648G458J918p289j503J336k325N91J754K40P176K715m955P65K005m708l482k330
3632f34N705P654O11m534p11m64o717J905N439J008o892k042K842P6O359j983
3616G622q040L477p23J372J32K60N767m46k769J020j318l459j0073m363Q470O954
$$ plain form
3726 -5626 -4513 -5432 -7510 -3237 -3784 -510 1498 -329 -3894 -6383 1997 4850 6760 7776 3452
3711 3452 839 764 242 -2387 -2613 1969 10083 12536 12062 12306 18650 5379 -5346 -1437 -5609 -11296
3695 -11296 -9229 -1494 3245 2429 2002 10113 17723 18163 10752 9770 6169 7520 7265 5322 4348 7370
3679 7370 6723 7097 11321 6731 11477 10566 6722 4224 6531 9078 8007 5302 1999 3505 1861 -3243
3663 -3243 2404 6268 14598 10119 4145 -1484 -163 4243 7592 2553 660 4575 1148 2134 7458
3648 7458 9376 2087 584 1920 -405 186 1940 2180 9356 12071 7116 7881 9886 5178 1696 -634
3632 -634 5071 12725 13336 8802 8091 7627 910 2815 8254 9262 2370 328 3170 3246 9605 7622
3616 7622 -418 3059 2336 3708 3840 4100 9867 9421 6652 7672 6354 2895 -7178 -11541 -3071 3883
3600C883n95m646j227L428K145k473j1277j189R339P228l880m096O923l045j0929
3585a0411L38P545K487M57R16P459O074M235m39p718r046k517k237L70L08l005
3569e184J914N896J968k109k134m543K89Rj032P496M981R03J43K319k455l203
3553E258j42l843L985l90K044J041l510o72J403Q80o39K23m728p335M767K855
3537A197P50k3Q98K654r71l992n144j416L042K635k453J838j999J587O767K069
3521G439J563l436j1833n169O618L196M8l332j525L240N555n23o33K993m85J249
3505D965k76K34L001k192k083p166k95J046P356K456l195n403n823Q998K731m668
$$ plain form
3600 3883 3288 -1358 -2585 843 2988 515 -10762 -11951 -2612 4616 736 -3360 3563 518 -10411
3585 -10411 -10073 -2528 -41 416 1332 8791 14865 19100 18661 10943 1897 -620 -2857 -2487 -2179 -5184
3569 -5184 -3270 2626 4594 2485 351 -4192 -3903 -3894 -4926 2570 7551 8454 8597 10916 8461 5258
3553 5258 5116 1273 5258 4868 6912 7953 4443 3771 5174 6054 5415 5638 910 -6425 -1658 1197
3537 1197 1947 1924 2822 5476 4505 513 -4631 -6047 -3005 -370 -2823 -985 -2984 -1397 5370 7439
3521 7439 9002 5566 -6267 -11436 -4818 -1622 -1574 -4906 -6431 -3191 2364 1841 1208 4201 3716 4965
3505 4965 4689 4923 7924 5732 3649 -3517 -3812 -2766 4590 7046 3851 -1552 -7375 1623 4354 -314
$$ [...]
##END NTUPLES=NMR SPECTRUM
##END=
