##TITLE=Analysis number 315392
Compound Code cc 26846
Book Reference 382/120/1
Project Code adrs
Chemist Name simons
##JCAMPDX= 6.0         $$ Bruker NMR JCAMP-DX V2.0
##DATA TYPE= NMR SPECTRUM
##DATA CLASS= NTUPLES
##ORIGIN= Bruker BioSpin GmbH
##OWNER= NMR
$$ XWIN-NMR		Version 3.5
$$ Thu Nov 17 11:44:26 2005 GMT Standard Time (UT+0h)  MAYBRIDGE\NMR@NMR_250MHZ
##.OBSERVE FREQUENCY= 250.131544655141
##.OBSERVE NUCLEUS= ^1H
##.ACQUISITION MODE= SIMULTANEOUS (DQD)
##.ACQUISITION SCHEME= undefined
##.AVERAGES= 16
##.DIGITISER RES= 18
##SPECTROMETER/DATA SYSTEM= dpx250
##.PULSE SEQUENCE= zg30
##.SOLVENT NAME= CDCl3
##.SHIFT REFERENCE= (INTERNAL, CDCl3, 0, 16.522)
##AUDIT TRAIL= $$ (NUMBER, WHEN, WHO, WHERE, WHAT)
$$ ##TITLE= Audit trail, XWIN-NMR		Version 3.5
$$ ##JCAMPDX= 5.01
$$ ##ORIGIN= Bruker BioSpin GmbH
$$ ##OWNER= NMR
$$ C:\u/data/dgb/nmr/ADRS/12550/pdata/1/auditp.txt
$$ ##AUDIT TRAIL=  $$ (NUMBER, WHEN, WHO, WHERE, WHAT)
(   1,<2005-11-17 11:43:29.40 +000>,<MAYBRIDGE\NMR>,<NMR_250MHZ>,
      <created by zg, POWCHK disabled, PULCHK disabled
       configuration hash MD5:
       62 19 C7 07 E1 42 D1 B7 37 6C 3D D0 77 39 F9 E6
       data hash MD5: 64K
       B5 40 75 39 FC 8D 00 1D 96 51 DF 87 DE 32 8D 77>)
(   2,<2005-11-17 11:43:53.62 +000>,<MAYBRIDGE\NMR>,<NMR_250MHZ>,
      <Start of raw data processing
       ef LB = 0.3 FT_mod = 6 PKNL = 1 SI = 32K 
       data hash MD5: 32K
       AB 5B D6 5C F7 1B EC 21 A9 34 50 41 7A 9C 65 6E>)
(   3,<2005-11-17 11:43:59.59 +000>,<MAYBRIDGE\NMR>,<NMR_250MHZ>,
      <apk 
       data hash MD5: 32K
       DF 52 F8 BC B7 1C 7D 23 B3 A4 8A C1 67 94 14 12>)
(   4,<2005-11-17 11:44:01.25 +000>,<MAYBRIDGE\NMR>,<NMR_250MHZ>,
      <abs ABSG = 5 
       data hash MD5: 32K
       51 F9 27 28 DC A4 88 F0 6D 4A AF D2 C1 DA 7B DF>)
$$ ##END=
$$ 
$$ hash MD5
$$ 08 39 8E 7F 06 BA 18 88 76 80 F3 E9 8E 80 09 7C
##$RELAX= 
##$RELAX= 
##$RELAX= 
##$RELAX= 
##$RELAX= 
##$RELAX= 
##$RELAX= 
$$ Bruker specific parameters
$$ --------------------------
##$DU= <C:\u>
##$EXPNO= 12550
##$NAME= <ADRS>
##$PROCNO= 1
##$TYPE= <nmr>
##$USER= <dgb>
##$AMP= (0..31)
100 100 100 100 100 100 100 100 100 100 100 100 100 100 100 100 100 100 
100 100 100 100 100 100 100 100 100 100 100 100 100 100 
##$AQSEQ= 0
##$AQ_mod= 3
##$AUNM= <au_zg>
##$AUTOPOS= <20 >
##$BF1= 250.13
##$BF2= 250.13
##$BF3= 250.13
##$BF4= 250.13
##$BF5= 500.13
##$BF6= 500.13
##$BF7= 500.13
##$BF8= 500.13
##$BYTORDA= 1
##$CFDGTYP= 0
##$CFRGTYP= 5
##$CHEMSTR= <none>
##$CNST= (0..31)
1 1 145 1 1 1 1 1 1 1 1 1 1 1 1 1 1 1 1 1 1 1 1 1 1 1 1 1 1 1 1 1 
##$CPDPRG= <>
##$CPDPRG1= <>
##$CPDPRG2= <>
##$CPDPRG3= <>
##$CPDPRG4= <mlev>
##$CPDPRG5= <mlev>
##$CPDPRG6= <mlev>
##$CPDPRG7= <mlev>
##$CPDPRG8= <mlev>
##$CPDPRGB= <>
##$CPDPRGT= <>
##$D= (0..31)
0 1 0 0 0 0 0 0 0 0.06 0 0 0 0 0 0 0.0002 0 0 0 0 0 0 0 0 0 0 0 0 0 0 
0 
##$DATE= 1132227806
##$DBL= (0..7)
120 120 120 120 120 120 120 120 
##$DBP= (0..7)
150 150 150 150 150 150 150 150 
##$DBP07= 0
##$DBPNAM0= <>
##$DBPNAM1= <>
$$ [...]
##$SUBNAM7= <"">
##$SUBNAM8= <"">
##$SUBNAM9= <"">
##$SW= 20.6930455092707
##$SWIBOX= (0..15)
0 0 3 0 0 0 0 0 0 0 0 0 0 0 0 0 
##$SW_h= 5175.983436853
##$TD= 65536
##$TD0= 1
##$TE= 294.16
##$TE2= 300
##$TE3= 300
##$TEG= 300
##$TL= (0..7)
0 120 120 120 120 120 120 120 
##$TP= (0..7)
150 150 150 150 150 150 150 150 
##$TP07= 0
##$TPNAME0= <>
##$TPNAME1= <>
##$TPNAME2= <>
##$TPNAME3= <>
##$TPNAME4= <>
##$TPNAME5= <>
##$TPNAME6= <>
##$TPNAME7= <>
##$TPOAL= (0..7)
0.5 0.5 0.5 0.5 0.5 0.5 0.5 0.5 
##$TPOFFS= (0..7)
0 0 0 0 0 0 0 0 
##$TUNHIN= 0
##$TUNHOUT= 0
##$TUNXOUT= 0
##$USERA1= <user>
##$USERA2= <user>
##$USERA3= <user>
##$USERA4= <user>
##$USERA5= <user>
##$V9= 5
##$VALIST= <valist>
##$VCLIST= <CCCCCCCCCCCCCCC>
##$VD= 0
##$VDLIST= <DDDDDDDDDDDDDDD>
##$VPLIST= <PPPPPPPPPPPPPPP>
##$VTLIST= <TTTTTTTTTTTTTTT>
##$WBST= 1024
##$WBSW= 4
##$XGAIN= (0..3)
0 0 0 0 
##$XL= 0
##$YL= 0
##$YMAX_a= 469174
##$YMIN_a= -602604
##$ZGOPTNS= <>
##$ZL1= 120
##$ZL2= 120
##$ZL3= 120
##$ZL4= 120
##$ABSF1= 16.522
##$ABSF2= -4.171173
##$ABSG= 5
##$ABSL= 3
##$ALPHA= 0
##$AQORDER= 0
##$ASSFAC= 0
##$ASSFACI= 0
##$ASSFACX= 0
##$ASSWID= 0
##$AUNMP= <proc_1d>
##$AZFE= 0.1
##$AZFW= 0.1
##$BCFW= 0
##$BC_mod= 0
##$BYTORDP= 0
##$COROFFS= 0
##$CY= 12.5
##$DATMOD= 1
##$DC= 0
##$DFILT= <>
##$DTYPP= 0
##$F1P= 14.0000005364418
##$F2P= -0.99999901652339
##$FCOR= 0.5
##$FTSIZE= 32768
##$FT_mod= 6
##$GAMMA= 0
##$GB= 0
##$INTBC= 1
##$INTSCL= 1
##$ISEN= 128
##$LB= 0.3
##$LEV0= 0
##$LPBIN= 0
##$MAXI= 10000
##$MC2= 0
##$MEAN= 0
##$ME_mod= 0
##$MI= 0
##$NCOEF= 0
##$NC_proc= -3
##$NLEV= 6
##$NOISF1= 0
##$NOISF2= 0
##$NSP= 0
##$NTH_PI= 0
##$NZP= 0
##$OFFSET= 16.522
##$PC= 1
##$PHC0= -65.90851
##$PHC1= -0.7408208
##$PH_mod= 1
##$PKNL= yes
##$PPARMOD= 0
##$PSCAL= 4
##$PSIGN= 0
##$REVERSE= no
##$SF= 250.13
##$SI= 32768
##$SIGF1= 0
##$SIGF2= 0
##$SINO= 400
##$SIOLD= 32768
##$SREGLST= <1H.CDCl3>
##$SSB= 0
##$STSI= 32768
##$STSR= 0
##$SW_p= 5175.98343685301
##$SYMM= 0
##$S_DEV= 0
##$TDeff= 65536
##$TDoff= 0
##$TI= <Analysis number 999999
Compound Code 99
Book Reference 9
Project Code 9>
##$TILT= no
##$TM1= 0
##$TM2= 0
##$TOPLEV= 0
##$USERP1= <user>
##$USERP2= <user>
##$USERP3= <user>
##$USERP4= <user>
##$USERP5= <user>
##$WDW= 1
##$XDIM= 32768
##$YMAX_p= 470576458
##$YMIN_p= -19170
$$ End of Bruker specific parameters
$$ ---------------------------------
##NTUPLES= NMR SPECTRUM
##VAR_NAME=  FREQUENCY,     SPECTRUM/REAL,   SPECTRUM/IMAG
##SYMBOL=    X,             R,               I
##VAR_TYPE=  INDEPENDENT,   DEPENDENT,       DEPENDENT
##VAR_FORM=  AFFN,          ASDF,            ASDF
##VAR_DIM=   32768,         32768,           32768
##UNITS=     HZ,            ARBITRARY UNITS, ARBITRARY UNITS
##FACTOR=    0.157963299565203, 1,           1
##FIRST=     4132.6476996994, 0,             0
##LAST=      -1043.33573715361, 0,           0
##MIN=       -1043.33573715361, -19170,      0
##MAX=       4132.6476996994, 470576458,     0
$$ Real data points
##PAGE= N=1
##DATA TABLE= (X++(R..R)), XYDATA
$$ [...]
$$ plain form
17045 -6598 -2338 -1139 -1386 -1005 -4219 -10040 -11625 -10128 -4897 -5765 -6056 -7931 -6011 -8600 -4131 3112
17029 3112 4735 3126 2707 6706 6564 5078 -309 571 -54 -3424 -4682 -4180 -4271 -4644 -2308 -1445 840
17012 840 5523 6605 4644 3000 1210 -889 767 2753 1701 -991 -3095 -618 -862 -2062 2448
16997 2448 7168 5502 4041 -1432 -2868 634 -1291 634 -1319 -608 730 -600 -4112 -3172 -2107
16982 -2107 -2425 -2130 -2549 -3049 -2068 -3814 456 5821 4042 5990 8255 4200 37 -983 -70 767
16966 767 -1741 -5781 -5598 -3551 -6697 -9536 -9118 -5054 -6018 -5981 -947 1317 2236 3062 2719 -577 -4965
16949 -4965 -5117 -4498 -2268 -166 -254 -284 -1062 -2890 -2230 -1850 -1 2470 2455 -1100 -3394 -4120 -5758 -4330
16931 -4330 -423 2297 1977 1808 -51 -4121 -1983 959 1760 1995 970 -1897 -2822 -5604 -4043 -781
$$ packed form
17045f598M260J199k47L81l214n821j585J497N231q68k91j875J920k589M469P243
17029C112J623j609m19L999j42j486n387Q80o25l370j258N02r1l73K336Q63K285
17012H40M683J082j961j644j790k099J656J986j052k692k104K477k44j200M510
16997B448M720j666j461n473j436L502j925J925j953P11J338j330l512R40J065
16982b107l18K95m19n00R81j746M270N365j779J948K265m055m163j020R13Q37
16966G67k508m040J83K047l146k839M18M064r64L7N034K264R19Q26l43l296m388
16949d965j52O19K230K102q8l0p78j828O60L80J849K471j5l555k294p26j638J428
16931d330L907K720l20j69j859m070K138K942Q01K35j025k867r25k782J561L262
$$ plain form
16915 -781 -1326 -2190 869 6342 9284 9038 9523 12852 14744 12847 11848 13898 9409 2971 1055 83
16899 83 -1533 1192 -390 1424 2965 1511 3481 -349 -2824 -2020 -4401 -5490 -7153 -8902 -6682
16884 -6682 -317 -289 1067 1797 401 -623 -188 -255 -177 -1753 2514 -1159 -3475 -3514 -2907 -6920 -8199
16867 -8199 -8911 -10427 -8801 -10135 -7361 -4050 -2820 -2469 -3447 -7599 -6923 -5277 -4073 -4291 -7856 -6585
16851 -6585 -7292 1307 6603 3934 2083 1574 -1062 -4067 -1894 -2357 -4024 -943 1349 3290 2448 2321
16835 2321 2730 2084 -961 1370 2225 1384 -1402 -2474 2299 5646 1493 1268 -1446 -3546 -1629 2394
16819 2394 4888 5459 5916 2495 -982 -2134 -5284 -6779 -7685 -5701 -4074 -4174 -7391 -9928 -7345 -3212
16803 -3212 -3147 803 2622 759 381 -1283 -1415 -1962 -1222 2375 7122 6524 9073 8310 5205 2474 -1709
$$ packed form
16915g81n45q64L059N473K942k46M85L329J892j897r99K050m489o438j916r72
16899H3j616K725j582J814J541j454J970l830k475Q04k381j089j663j749K220
16884f682O365K8J356P30j396j024M35o7P8j576M267l673k316l9O07m013j279
16867h199p12j516J626j334K774L311J230L51r78m152O76J646J204k18l565J271
16851f585p07Q599N296k669j851n09k636l005K173m63j667L081K292J941q42j27
16835B321M09o46l045K331Q55q41k786j072M773L347m153k25k714k100J917M023
16819B394K494N71M57l421l477j152l150j495r06J984J627j00l217k537K583M133
16803c212O5L950J819j863l78j664j32n47P40L597M747n98K549p63l105k731m183
$$ plain form
16786 -1709 -781 -3603 -5312 -3618 -3865 -828 1776 4010 6926 9721 6825 2148 -2741 -3998 -6331
16771 -6331 -10651 -10187 -6772 -2293 1761 1624 413 -1378 -2717 -2106 -1766 -950 -4425 -5701 -635 -824
16755 -824 -3016 -7153 -3458 -495 -1021 -1234 -1310 -3576 -5580 -8927 -6667 -7663 -6889 -5479 -6847 -3869
16739 -3869 -1833 -4049 -4573 -4917 -2534 2423 6587 3578 -1301 -1478 -1703 2028 1030 605 -2783 -4735
16723 -4735 -4208 -1709 -2278 -6356 -5090 -3609 -7185 -4976 2718 3080 3293 2985 -913 -2266 147 554
16707 554 3973 1740 2767 2773 4829 7011 5483 5844 7733 9482 2729 -1982 -7362 -2360 5852 5775
16691 5775 1415 -736 -5081 -4328 -2380 1019 2104 -1954 -2135 316 -3492 -2931 -3375 -1858 -6072 -11643
16675 -11643 -10068 -7383 -1612 871 -374 -1951 -2553 -5047 -5907 -4267 -4714 -6713 -10926 -12121 -9894
$$ packed form
16786a709R28k822j709J694k47L037K604K234K916K795k896m677m889j257k333
16771f331m320M64L415M479M054j37j211j791j339O11L40Q16l475j276N066j89
16755h24k192m137L695K963n26k13p6k266k004l347K260r96P74J410j368K978
16739c869K036k216n24l44K383M957M164l009m879j77k25L731r98m25l388j952
16723d735N27K499n69m078J266J481l576K209P694L62K13l08l898j353K413M07
16707E54L419k233J027OK056K182j528L61J889J749o753m711n380N002Q212p7
16691E775m360k151m345P53J948L399J085m058j81K451l808N61m44J517m214n571
16675a1643J575K685N771K483j245j577o02k494q60J640m47j999m213j195K227
$$ plain form
16660 -9894 -6647 -7651 -5672 -4260 -4032 -2569 -2618 -2788 -2737 -2110 -1470 -4645 -6867 -5542 -4155 -2577 -4444
16643 -4444 -3424 -4982 -3332 -2652 737 94 -1552 -4071 -5696 -5873 -3433 -1860 -2709 540 1646 526
16627 526 287 981 3434 7489 4953 1610 -3074 -3979 -3477 766 6228 5743 -1410 -2216 -256 -1103 -8279
16610 -8279 -10360 -6308 -3169 -2212 3832 6639 6623 3843 3026 833 -6563 -8755 -3431 -2901 -762 3130
16594 3130 1321 -275 -3099 -4126 -1869 2425 6387 6841 1344 -3578 -6307 -3652 260 1755 2895
16579 2895 582 -1252 -433 491 -2265 -5768 -5057 765 1883 1326 3 -3701 -6722 -5112 -1738 -5476
16563 -5476 -4820 -572 1968 3392 -1302 -3432 -2210 954 1043 2292 2807 4404 2975 772 712 -1831
16547 -1831 -2871 -2449 -427 -103 -54 -1101 3132 5057 6799 9976 11760 9590 4871 1453 575 2539
$$ packed form
16660i894L247j004J979J412K28J463m9j70N1O27O40l175k222J325J387J578j867
16643d444J020j558J650O80L389o43j646k519j625j77K440J573q49L249J106j120
16627E26k39O94K453M055k536l343m684r05N02M243N462m85p153q06J960q47p176
16610h279k081M052L139R57O044K807j6k780q17k193p396k192N324N30K139L892
16594C130j809j596k824j027K257M294L962M54n497m922k729K655L912J495J140
16579B895k313j834Q19R24k756l503P11N822J118n57j323l704l021J610L374l738
16563e476O56M248K540J424m694k130J222L164Q9J249N15J597j429k203o0k543
16547a831j040M22K022L24M9j047M233J925J742L177J784k170m719l418q78J964
$$ plain form
16531 2539 727 322 346 1994 -659 -1903 -3840 -4244 -2951 -2438 -908 183 -2608 -974 3995 4358
16515 4358 580 2367 -158 -3147 -1822 -3388 -1822 -1028 -1256 -645 735 94 -619 2645 5931 3500
16499 3500 2365 722 -2624 -3641 494 3565 1332 76 -3259 -7469 -2293 3173 2494 -1668 -2177
16484 -2177 -2795 181 -1065 -4690 -5803 -1924 2737 3631 4476 4141 2633 147 623 191 -345 2188
16468 2188 2066 -445 -322 2001 6818 5076 -366 -2255 -2601 -3357 -3411 -1574 -1764 -1161 -602 2572 4076
16451 4076 5696 4596 1424 13 -12 -2397 -1109 842 356 -3139 -1307 1590 -807 440 2331
16436 2331 1500 2200 3830 -1855 -5135 -5481 -6125 -10142 -6868 -1404 -1629 -621 3878 655 -3970 -4441
16420 -4441 -1568 -664 -477 856 2039 6691 4481 727 4052 3764 3562 3894 -686 1464 2545 2269
$$ packed form
16531B539j812m05K4J648k653j244j937m04J293N13J530J091k791J634M969L63
16515D358l778J787k525k989J325j566J566P94k28O11J380o41p13L264L286k431
16499C500j135j643l346j017M135L071k233j256l335m210N176N466o79m162n09
16484b177o18K976j246l625j113L879M661Q94Q45l35j508k486M76m32n36K533
16468B188j22k511J23K323M817j742n442j889l46p56n4J837j90O03N59L174J504
16451D076J620j100l172j411k5k385J288J951m86l495J832K897k397J247J891
16436B331q31P00J630n685l280l46o44m017L274N464k25J008M499l223m625m71
16420d441K873R04J87J333J183M652k210l754L325k88k02L32m580K150J081k76
$$ plain form
16404 2269 3924 4644 6781 7683 5241 4609 6905 3028 3787 6215 7237 4127 -45 -1452 -2778 -2417
16388 -2417 -880 -933 799 4914 5497 7016 10520 7477 4570 1935 -1743 -1098 -489 -3983 -4402 -2679
16372 -2679 -2296 -3472 -4055 -3761 -1498 -2441 -1661 1201 1055 -2169 -5438 -7375 -5300 -6817 -4283 -4367 -2437
16355 -2437 224 3364 4353 4753 -1360 -3409 -5370 -5464 -3572 1275 3521 -621 -4700 -6897 -6324 -4239
16339 -4239 -1326 -121 186 -1368 -1685 -1497 -4446 -5491 -3911 -289 1098 -3611 -6677 -3292 -4273 -3512
16323 -3512 -1386 398 -1628 -4396 -5479 -6595 -7665 -4693 935 -1124 -1169 -2247 -1325 -722 869 -2565
16307 -2565 -2510 -2204 -1339 -2076 -3518 -1396 -812 679 -4212 -3847 -828 -3422 -7814 -7707 -6237 -10791 -11357
16290 -11357 -4993 -2200 -3731 -4401 -1068 -29 584 3664 2097 1119 -5183 -8855 -6936 -3213 -3661
$$ packed form
16404B269J655P20K137R02k442o32K296l877P59K428J022l110m172j407j326L61
16388b417J537n3J732M115N83J519L504l043k907k635l678O45O09l494m19J723
16372b679L83j176n83K94K263r43P80K862j46l224l269j937K075j517K534q4J930
16355b437K661L140R89M00o113k049j961r4J892M847K246m142m079k197N73K085
16339d239K913J205L07j554l17J88k949j045J580L622J387m709l066L385r81P61
16323c512K126J784k026k768j083j116j070K972N628k059m5j078R22O03J591l434
16307b565N5L06Q65p37j442K122N84J491m891L65L019k594m392J07J470m554n66
16290a1357O364K793j531o70L333J039O13L080j567r78o302l672J919L723m48
$$ plain form
16275 -3661 -4099 -7788 -9475 -9776 -10229 -9421 -3395 -197 -1298 -1598 1084 915 596 -521 -2617 -6095
16259 -6095 -9273 -10208 -10462 -9841 -10172 -9114 -8185 -4829 -2624 -279 -707 1162 968 3090 4385 7835
16243 7835 9257 6086 388 -1240 893 285 -5272 -5970 -4113 -1993 -1334 -3384 -3523 -3841 -268 20
16227 20 3630 2115 94 -226 -1237 -2011 -4317 -5343 -5119 -447 4678 5147 822 353 -1372 317
16211 317 4751 3878 -1424 -11 3355 330 -1946 -3488 -5472 -2457 -273 -1990 -4403 -3388 -3255
16196 -3255 -1477 -968 -2547 -6637 -4925 -2615 -4632 -7186 -7555 -4452 -653 -1387 -3115 -3716 -7254 -6623
16180 -6623 -4161 -5044 -9148 -11549 -11663 -9268 -6268 -2495 -1172 1501 2753 5083 8558 7256 -304
16165 -304 -6189 -5490 -2920 -597 -485 983 -2214 -3623 -1344 -2655 -3930 -3175 -677 -445 -1503 -609
$$ packed form
16275c661m38l689j687l01m53Q08O026L198j101l00K682j69l19j117k096l478
16259f095l178r35k54O21l31J058R29L356K205K345m28J869j94K122J295L450
16243G835J422l171n698j628K133o08n557o98J857K120O59k050j39l18L573K88
16227B0L610j515k021l20j011p74k306j026K24M672N125M69m325m69j725J689
16211C17M434q73n302J413L366l025k276j542j984L015K184j717k413J015J33
16196c255J778N09j579m090J712K310k017k554l69L103L799p34j728o01l538O31
16180f623K462q83m104k401j14K395L000L773J323K673J252K330L475j302p560
16165c04n885O99K570K323J12J468l197j409K279j311j275P55K498K32j058Q94
$$ plain form
16149 -609 -1771 1027 1353 -887 -2582 -947 650 875 -2408 -2032 843 2196 -3031 -7482 -6984 -3243
16133 -3243 -2575 -3914 -6327 -10000 -7299 1141 6008 6229 5900 1744 1703 1296 574 -2599 -6014 -6410 -4286
16116 -4286 -2691 -5361 -5769 -4694 -3570 -3966 -1252 77 -211 656 -2701 -6603 -10446 -11886 -9402 -4648
16100 -4648 -2841 -1991 -3353 -2611 -4202 -6493 -3892 -4289 -2064 -1160 912 536 -3706 -3810 -1666 118
16084 118 2353 -1519 -5455 -5108 -6357 -6653 -3058 -2187 -356 360 52 -4570 -8654 -6364 -2074 -2219
16068 -2219 -3311 -4598 -3021 831 1933 1446 -829 -1176 -492 -2227 -3310 -3579 -5234 -2134 -665 -586
16052 -586 575 2424 1272 1354 -770 -2010 -3615 -7153 -7634 -8071 -6290 -5251 -2151 -960 -5045 -9573
16036 -9573 -9231 -8079 -9333 -10253 -3775 -3740 -1948 975 4125 5721 1396 -1580 -3104 -5156 -2860 -297
$$ packed form
16149f09j162K798L26k240j695J635J597K25l283L76K875J353n227m451M98L741
16133c243O68j339k413l673K701Q440M867K21l29m156m1m07p22l173l415l96K124
16116d286J595k670m08J075J124l96K714J329k88Q67l357l902l843j440K484M754
16100d648J807Q50j362P42j591k291K601l97K225R04K072l76m242j04K144J784
16084A18K235l872l936L47j249k96L595Q71J831P16l08m622m084K290M290j45
16068b219j092j287J577L852J102m87k275l47O84j735j083k69j655L100J469P9
16052e86J161J849j152Q2k124j240j605l538m81m37J781J039L100J191m085m528
16036i573L42J152j254r20O478L5J792K923L150J596m325k976j524k052K296K563
$$ plain form
16020 -297 -6038 -8980 -5778 -3020 -1382 -2036 -849 1319 -1361 -882 -3482 -3896 -3825 -2534 -5256 -6982
16004 -6982 -6196 -4000 -5318 -8008 -4176 -2673 -5672 -6523 -6724 -5402 -2774 1265 124 -3545 -2851 -1808
15988 -1808 -3387 -8186 -9616 -5493 -5268 -8805 -7380 -5113 -7472 -9991 -6774 -3535 -2292 -3758 -103
15973 -103 -3206 -5331 -3750 -3297 -4357 -7898 -10882 -12869 -14149 -7439 -6612 61 1308 -483 -808 -1410
15957 -1410 -6756 -6962 -5664 -6705 -5935 1682 2598 327 -2704 120 -2455 -524 1337 -1496 -2624
15942 -2624 -611 214 -3354 -4483 -5575 -5380 -6330 -6813 -7422 -10324 -14687 -12615 -8315 -6335 -9634 -10661
15926 -10661 -10715 -6167 -4140 -4892 -7925 -11296 -8347 -2818 -4166 -5859 -8224 -9620 -5096 -1906 -4779
15911 -4779 -9102 -10020 -6977 -7390 -4629 -2541 -1942 -1132 -2459 -3836 -1570 643 -1470 -38 516 -1200
$$ packed form
16020b97n741k942L202K758J638o54J187K168k680M79k600m14P1J291k722j726
16004f982P86K196j318k690L832J503k999q51k01J322K628M039j141l669O94J043
15988a808j579m799j430M123K25l537J425K267k359k519L217L239J243j466L655
15973a03l103k125J581M53j060l541k984j987j280O710Q27O673J247j791l25o02
15957a410n346k06J298j041P70P617R16k271l031K824k575J931J861k833j128
15942b624K013Q25l568j129j092J95r50m83o09k902m363K072M300J980l299j027
15926a0661n4M548K027p52l033l371K949N529j348j693k365j396M524L190k873
15911d779m323r18L043m13K761K088N99Q10j327j377K266K213k113J432N54j716
$$ plain form
15895 -1200 944 3610 3294 4929 7604 6596 3336 1516 2152 4010 4599 1468 -3014 -2255 257 2742
15879 2742 7654 2938 254 -987 -1924 -5419 -5274 -6036 -4003 -851 2160 4216 -71 -5320 -8496
15864 -8496 -8874 -7869 -7805 -8519 -5018 824 1643 -1689 -2150 744 2143 -1169 -1930 -3253 -2852 -4731 -2963
15847 -2963 -3560 -7188 -12344 -11933 -7161 -4518 -6026 -6568 -4903 -4771 -7992 -9391 -7310 -4221 -489 1850
15831 1850 3510 1765 2727 -183 -2347 -1531 -2774 -2576 -4230 -4282 -4612 -2876 -2801 -2147 1308 19 -1858
15814 -1858 -2951 -6178 -5376 -2875 2663 4510 2313 -646 -1765 -957 2300 -471 -5053 -6080 -3431
15799 -3431 1150 864 1704 4498 3202 2829 3980 2058 59 -929 -176 -400 -332 -14 2595 1694 -1543
15782 -1543 -3140 -4087 -2173 -2377 -5730 -6279 -4922 -7221 -9315 -7375 -2652 -1508 456 2618 -150
$$ packed form
15895a200K144K666l16J635K675j008l260j820O36J858N89l131m482P59K512K485
15879B742M912m716k684j241r37l495J45p62K033L152L011K056m287n249l176
15864h496l78J005O4p14L501N842Q19l332m61K894J399l312p61j323M01j879J768
15847b963n97l628n156M11M772K643j508n42J665J32l221j399K081L089L732K339
15831A850J660j745R62k910k164Q16j243J98j654n2l30J736P5O54L455j289j877
15814a858j093l227Q02K501N538J847k197k959j119Q08L257k771m582j027K649
15799c431M581k86Q40K794j296l73J151j922j999r88P53k24O8L18K609r01l237
15782a543j597r47J914k04l353n49J357k299k094J940M723J144J964K162k768
$$ plain form
15767 -150 -2902 -966 -3244 -792 2954 5373 2963 1364 -394 143 -3170 -4378 -2697 -2935 844
15752 844 2900 -469 -1188 -800 -2400 -2910 -2780 -929 -383 2988 1539 -1951 -1789 -3848 -6840 -5779
15736 -5779 -5614 -4748 -3508 -7861 -10643 -15062 -13474 -10465 -11102 -10219 -9476 -9593 -7573 -11095 -12237 -7630
15720 -7630 -4789 -2634 35 -1223 -2911 -4829 -4272 -3482 -3277 -8122 -4915 326 -4491 -3919 -1428 -700
15704 -700 -4997 -8734 -9126 -6505 -8496 -13455 -12488 -6730 -8974 -11022 -10362 -6617 -3727 586 -269 -1603
15688 -1603 -2574 -9557 -13024 -11377 -6803 -1856 -2323 -4527 -5115 -3224 -2349 -3391 -4840 -2054 -1189 -2439
15672 -2439 -3246 -1949 -1281 -4402 -6760 -9236 -12163 -10528 -10170 -7315 -9816 -8963 -4055 -3585 -5418 -4468
15656 -4468 -6571 -3266 -2332 -4353 -6975 -8069 -4056 -2699 -3689 -3389 -6983 -9999 -8081 -4757 -3999 -7924
$$ packed form
15767a50k752J936k278K452L746K419k410j599j758N37l313j208J681k38L779
15752H44K056l369p19L88j600n10J30J851N46L371j449l490J62k059k992J061
15736e779J65Q66J240m353k782m419J588L009o37Q83P43j17K020l522j142M607
15720g630K841K155K669j258j688j918N57P90K05m845L207N241m817N72K491P28
15704g00m297l737l92K621j991m959R67N758k244k048O60L745K890M313q55j334
15688a603r71o983l467J647M574M947m67k204n88J891Q75j042j449K786Q65j250
15672b439q07J297O68l121k358k476k927J635L58K855k501Q53M908M70j833R50
15656d468k103L305R34k021k622j094M013J357r90L00l594l016J918L324P58l925
$$ plain form
15640 -7924 -7777 -4892 -6725 -7989 -5863 -7152 -7558 -3447 -4263 -3898 -2541 -1645 -1108 -124 1097 225 -599
15623 -599 -741 376 -1517 -2235 626 -2006 -2075 -611 -2095 -3854 -5742 -7333 -5774 -7873 -8794 -6112
15607 -6112 -4232 -3415 -2611 185 3854 4637 2774 -1476 -4768 -4806 -2963 -3501 -2289 -2145 -890 1883
15591 1883 583 -1049 1138 202 193 -1408 -1451 -3426 -5911 -3649 -5399 -8580 -7416 -6184 -7502 -6575
15575 -6575 -4016 -3739 -5034 271 2035 783 -132 -2661 -5058 -6088 -9754 -6085 -3325 -3313 -5078 -2991
15559 -2991 -2121 -5375 -4427 -3205 -4344 -4598 -4845 -4106 -7565 -11775 -7961 -7706 -5149 -5046 -4798 -4060 -3871
15542 -3871 454 2107 2108 -585 -4694 -6285 -1778 -115 -1001 -383 -44 -3760 -5041 -1287 79 -2426
15526 -2426 -3595 -2291 -5244 -4829 -4639 -4462 -7876 -8012 -7270 -5507 -4037 -1678 30 -209 -2205 -66
$$ packed form
15640g924J47K885j833j264K126j289m06M111q16L65J357Q96N37R84J221q72q24
15623e99j42J117j893p18K861k632o9J464j484j759j888j591J559k099r21K682
15607f112J880Q17Q04K796L669P83j863m250l292l8J843n38J212J44J255K773
15591A883j300j632K187r36rj601m3j975k485K262j750l181J164J232j318R27
15575f575K559K77j295N305J764j252r15k529k397j030l666L669K760J2j765K087
15559b991Q70l254R48J222j139k54k47P39l459m210L814K55K557J03K48P38J89
15542c871M325J653Jk693m109j591M507J663q86O18L39l716j281L754J366k505
15526b426j169J304k953M15J90J77l414j36P42J763J470K359J708k39j996K139
$$ plain form
15510 -66 -2120 -2814 -2642 -3779 -2998 -1638 -1595 -5392 -9324 -9489 -10031 -6748 -7560 -4358 -3642 -7224 -5286
15493 -5286 -2750 -7680 -10998 -8402 -7076 -6577 -3882 -438 -177 -2503 -1477 -1712 -7031 -6796 -3496 -6220
15477 -6220 -12303 -11313 -8215 -4060 -5353 -4738 -1576 -2550 -3283 -5033 -7986 -7281 -1794 1598 -700 -2807
15461 -2807 -600 2630 4425 3635 -343 -4869 -4452 -1697 -2347 -1782 -1866 -1513 -808 -3373 -5139 2311 4224
15444 4224 3464 3542 -115 -3457 -8378 -4871 -2144 2335 3811 1707 -939 -1326 -576 -4805 -3318 -3989
15428 -3989 -5913 -3746 -3055 -3835 -4945 -5268 -5383 -3665 -1622 -3868 -6681 -6050 -6072 -8538 -7716 -5424 -5080
15411 -5080 -4167 -3058 -1349 -2153 -3497 -4555 -4600 -4483 -1680 27 -3987 -8852 -10695 -11713 -7148 -3970
15395 -3970 -3671 -6391 -6817 -9311 -11837 -8945 -6734 -6823 -4764 -1928 2757 440 -3553 -654 -312 -262
$$ packed form
15510f6k054o94J72j137P81J360M3l797l932j65n42L283q12L202P16l582J938
15493e286K536m930l318K596J326M99K695L444K61k326J026k35n319K35L300k724
15477f220o083R90L098M155j293O15L162r74p33j750k953P05N487L392k298k107
15461b807K207L230J795p90l978m526M17K755o50N65q4L53P05k565j766P450J913
15444D224p60P8l657l342m921L507K727M479J476k104k646l87P50m229J487o71
15428c989j924K167O91p80j110l23j15J718K043k246k813O31k2k466Q22K292L44
15411e080R13J109J709q04j344j058m5J17K803J707m014m865j843j018M565L178
15395c970K99k720m26k494k526K892K211q9K059K836M685k317l993K899L42N0
$$ plain form
15379 -262 -3527 -1020 1128 -806 1797 -2549 -5666 -4498 -6242 -6115 -4450 -2276 -3601 -5511 -6632
15364 -6632 -5034 -1926 -2724 -5004 -6048 -4132 -2849 -3982 -3085 582 1514 1770 1078 -2627 -1316 -558
15348 -558 -2516 -6167 -6479 -7233 -6483 -5333 -3880 -2632 -3478 -7044 -4604 -1709 -4629 -5609 -6452 -2749
15332 -2749 -2482 -4174 -3901 -3479 -4033 -3824 560 4983 6795 2766 -2744 -1842 -465 239 -1724 -5288
15316 -5288 -7164 -9462 -10358 -9976 -8717 -7637 -6920 -8003 -5674 -1417 1231 2517 1289 -1991 -4893
15301 -4893 -6989 -11760 -12925 -9232 -7909 -4269 -3470 -2211 -590 88 -1882 -3259 -5751 -6050 -5796 -4409
15285 -4409 -2265 -5562 -6403 -7957 -8687 -7625 -3495 -2323 -2107 -6579 -6296 -7800 -6628 -3101 -3638 -3913
15269 -3913 -1186 2370 1281 -1457 -533 3624 3762 2065 1987 1349 -764 -3719 -836 668 -835 -1757
$$ packed form
15379b62l265K507K148j934K603m346l117J168j744J27J665K174j325j910j121
15364f632J598L108p98k280j044J916J283j133Q97L667R32K56o92l705J311P58
15348e58j958l651l12p54P50J150J453J248q46l566K440K895k920r80q43L703
15332b749K67j692K73M22n54K09M384M423J812m029n510R02J377P04j963l564
15316e288j876k298q96L82J259J080P17j083K329M257K648J286j228l280k902
15301d893k096m771j165L693J323L640P99J259J621O78j970j377k492k99K54J387
15285d409K144l297q41j554p30J062M130J172K16m472K83j504J172L527n37k75
15269c913K727L556j089k738R24M157J38j697p8o38k113k955K883J504j503r22
$$ plain form
15253 -1757 -1861 -166 -593 -3125 -3252 -5516 -6749 -5651 -7184 -4099 -216 -296 -346 -2260 -2988 -4526 -4826
15236 -4826 -383 3423 283 -5666 -8113 -5780 37 3814 4469 1680 2010 1777 5194 6156 3030 1948
15220 1948 1184 155 -383 -407 2554 -1446 -9304 -13300 -13111 -12479 -10216 -9273 -8992 -5081 -2655 -3998 -4461
15203 -4461 -1254 -3170 -5077 -5588 -6765 -7814 -6962 -4794 -2270 -2713 -6020 -3947 -2570 -3162 -2929 -3062
15187 -3062 -4931 -4363 -2257 -4383 -7348 -9758 -2527 3658 6092 6083 3962 3955 -1492 -6487 -7534 -5303
15171 -5303 -5350 -7934 -9768 -8050 -5808 -3505 -3561 -3336 -2961 -852 -801 -2630 -4650 -3224 -1422 95 -456
15154 -456 -1278 -1934 -2478 -2506 -4689 -5122 -1710 -1612 -6969 -9094 -6872 -6484 -4343 -7397 -10123 -4756 -6863
15137 -6863 -6819 -4880 -5707 -7155 -6640 -7647 -7734 -4067 -3069 -4852 -6125 -6467 -6333 -3681 -5140 -9099 -10348
$$ packed form
15253a757j04J695m27k532j27k264j233J098j533L085L883q0n0j914p28j538l00
15236d826M443L806l140n949k447K333N817L777O55k789L30k33L417R62l126j082
15220A948p64j029n38k4K961m000p858l996J89O32K263R43K81L911K426j343m63
15203d461L207j916j907n11j177j049Q52K168K524m43l307K073J377n92K33j33
15187c062j869N68K106k126k965k410P231O185K434rk121pn447m995j047K231
15171e303m7k584j834J718K242K303n6K25L75K109N1j829k020J426J802J517n51
15154d56q22o56n44k8k183m33L412R8n357k125K222L88K141l054k726N367k107
15137f863M4J939q27j448N15j007q7L667R98j783j273l42J34K652j459l959j249
$$ plain form
15120 -10348 -8491 -9792 -11236 -10247 -6250 -2541 -3228 -6645 -3899 -2782 48 1584 5116 4472 -1066
15105 -1066 -1604 414 -351 -2894 -5859 -4759 2773 2276 953 -729 -1921 -1369 -3079 -5408 -3238 -1199
15089 -1199 -7431 -9458 -11553 -16773 -14911 -13353 -10431 -5650 -9342 -8616 -9063 -9719 -9143 -1843 -311 -3026
15073 -3026 -1085 1696 1900 -1426 -2901 -2712 -5610 -13517 -14331 -10695 -8505 -10293 -12499 -14666 -18581
15058 -18581 -13474 -7808 -7659 -9097 -8421 -8772 -6720 -6669 -4284 -3370 -4423 -8033 -9304 -4712 -3204 -3448
15042 -3448 -3692 -5098 -6378 -8405 -9028 -5096 -4937 -5529 -1716 -223 757 -2417 -6779 -6036 -2968 1201
15026 1201 2652 2342 -3677 -5735 -2684 -4113 -8599 -7811 -1829 -1893 -7917 -12953 -12753 -10481 -8493 -10215
15010 -10215 -8148 -9048 -8725 -6551 -3344 -2666 -4990 -9060 -10551 -12659 -12869 -8406 -6695 -2951 350
$$ packed form
15120a0348J857j301j444R89L997L709o87l417K746J117K830J536L532o44n538
15105a066n38K018p65k543k965J100P532m97j323j682j192N52j710k329K170K039
15089a199o232k027k095n220J862J558K922M781l692P26m47o56N76P300J532k715
15073c026J941K781K04l326j475J89k898p907q14L636K190j788k206k167l915
15058a8581N107N666J49j438O76l51K052N1K385R14j053l610j271M592J508k44
15042c448k44j406j280k027o23L932J59n92L813J493R80l174m362P43L068M169
15026A201J451l10o019k058L051j429m486P88N982o4o024n036K00K272J988j722
15010a0215K067r00L23K174L207O78k324m070j491k108k10M463J711L744L301
$$ plain form
14995 350 1442 -937 -3531 -3087 -4452 -7323 -7734 -10096 -9186 -9907 -8235 -8197 -9515 -11802 -15026 -13012
14979 -13012 -3354 -2755 -5981 -8732 -9761 -7722 -8996 -7995 -8568 -5063 -73 1561 2155 1390 -438
14964 -438 270 -2280 -4716 -8746 -6010 -1751 -3327 -3607 -5514 -1665 1328 -1983 -4149 -7566 -8458 -5073
14948 -5073 -4857 -4105 -4382 -6481 -7314 -3723 -74 1357 29 -3207 -4942 -3380 -4507 -3109 -6260 -4961
14932 -4961 -5296 -5060 -7706 -5930 -6450 -5313 -6051 -3921 -5483 -6716 -4685 -4428 -5394 -2394 -3842 -6868
14916 -6868 -6687 -4095 -3472 -4820 -5702 -7334 -4318 -2387 -1392 -2684 -2381 1047 4149 5019 3282 -2971
14900 -2971 -3651 2530 5475 4983 3209 4631 4183 3368 2977 -447 -3640 -4525 -4872 -7862 -8044 -2808 -1084
14883 -1084 -3207 -2340 -2938 -4424 -5154 -5658 -6513 -8047 -10085 -9681 -8419 -7544 -11712 -8955 -6052 -1189
$$ packed form
14995C50J092k379k594M44j365k871m11k362R10p21J672L8j318k287l224K014
14979a3012R658N99l226k751j029K039j274J001n73L505M990J634N94p65j828
14964d38P08k550k436m030K736M259j576k80j907L849K993l311k166l417q92L385
14948e073K16P52k77k099q33L591L649J431j328l236j735J562j127J398l151J299
14932d961l35K36k646J776n20J137p38K130j562j233K031K57r66L000j448l026
14916f868J81K592O23j348q82j632L016J931R95j292L03L428L102Q70j737o253
14900b971o80O181K945m92j774J422m48q15l91l424l193q85l47k990j82N236J724
14883a084k123Q67n98j486p30n04q55j534k038M04J262Q75m168K757K903M863
$$ plain form
14867 -1189 -76 -3447 -2850 -6276 -8360 -9172 -10514 -12970 -6039 -1926 -2455 -4142 -4687 -5568 -4541 -1875
14851 -1875 -999 -297 541 -4316 -11447 -12082 -9810 -10023 -9296 -6373 -2897 -4625 -6936 -5955 -7541 -8049 -9284
14834 -9284 -8595 -3914 -3511 -11035 -12951 -13296 -11079 -2911 -798 -1990 -6882 -10550 -7893 -3415 2403
14819 2403 -2058 -9634 -12829 -6713 -4374 -5338 -5069 -5200 -5375 -1410 -3766 -5419 -8908 -14181 -11161 -8398
14803 -8398 -8801 -9705 -9349 -9375 -5152 -4941 -2676 -3436 -6995 -6972 -7835 -10358 -8182 -8674 -9331 -6795 -3927 -4343
14785 -4343 -5257 -3132 3260 3962 1172 -4382 -6981 -7133 -3679 -99 -2192 -2110 1169 2212 3003 4339
14769 4339 3801 1480 -3693 -6405 -11552 -11502 -7553 -4659 -2860 -3852 -4436 -4288 -4293 -1705 -1693 -2440 -5487 -1858
14751 -1858 -5072 -9707 -10386 -10478 -6333 -7127 -7516 -11758 -11554 -9513 -8507 -8344 -2955 -2674 -5468 -4605 -3771
$$ packed form
14867a189J113l371N97l426k084q12j342k456O931M113n29j687n45q81J027K666
14851a875Q76P02Q38m857p131o35K272k13P27K923L476j728k311R81j586n08j235
14834i284O89M681M03p524j916l45K217Q168K113j192m892l668K657M478N818
14819B403m461p576l195O116K339r64K69j31j75L965k356j653l489n273L020K763
14803h398m03r04L56k6M223K11K265p60l559K3q63k523K176m92o57K536K868m16
14785d343r14K125O392P02k790n554k599j52L454L580k093Q2L279J043P91J336
14769D339n38k321n173k712n147N0L949K894J799r92n84J48nK588J2p47l047L629
14751a858l214m635o79r2M145p94l89m242K04K041J006J63N389K81k794Q63Q34
$$ plain form
14734 -3771 -3953 -3921 -4435 -4665 -4858 -3671 -1602 -3098 -4720 -4664 -2743 2122 2831 3362 -596 -1148 -421 -1602
14716 -1602 1400 3339 -576 -3208 -7558 -8608 -8513 -7534 -8980 -7658 -7586 -6503 -8963 -13265 -11505 -9468
14700 -9468 -5117 1059 -879 -5836 -10420 -5645 -2756 -3387 -7724 -11961 -8267 -3774 -4120 -6051 -9328
14685 -9328 -4942 -1319 992 -3542 -7787 -7903 -5397 -6848 -6700 -5327 -5053 -6359 -6278 -3700 -5106 -6731
14669 -6731 -4117 -6186 -8305 -10539 -8682 -10203 -12727 -13033 -12169 -9585 -4682 -3735 -1825 -121 4808
14654 4808 2507 -3305 -5747 -3746 -3582 -5134 -7665 -9014 -9687 -10267 -12493 -15311 -14707 -7794 -7404 -5375
14638 -5375 -4103 -7350 -7576 -2302 -718 -5212 -7084 -5388 -6314 -5434 -6186 -3794 1822 825 -3057 -855
14622 -855 1412 2885 2141 1488 773 -1391 -4275 -8326 -8278 -5827 -2700 -1142 -4888 -7238 -6190 -3849
$$ packed form
14734c771j82L2n14k30j93J187K069j496j622N6J921M865P09N31l958n52P27j181
14716a602L002J939l915k632m350j050R5R79j446J322P2J083k460m302J760K037
14700i468M351O176j938m957m584M775K889o31m337m237L694M493l46j931l277
14685i328M386L623K311m534m245j16K506j451J48J373K74j306Q1K578j406j625
14669f731K614k069k119k234J857j521k524l06Q64K584M903R47J910J704M929
14654D808k301n812k442K001J64j552k531j349o73n80k226k818O04O913L90K029
14638e375J272l247k26N274J584m494j872J696r26Q80p52K392N616r97l882K202
14622h55K267J473p44o53p15k164k884m051M8K451L127J558l746k350J048K341
$$ plain form
14606 -3849 -2561 4474 6937 4785 3642 5185 2956 -3800 -3735 -984 274 -581 -1458 -3083 -3543 -1397
14590 -1397 -4266 -4847 -7284 -5647 -6852 -5728 -4872 -2564 204 1054 -941 -1774 -1916 1165 179 -120
14574 -120 -2470 -2136 -3506 -4349 -3919 -8247 -15159 -19170 -18366 -12671 -9476 -6865 -7879 -10699 -8684 -7023
14558 -7023 -5032 -197 -1091 -2931 -3298 -2443 -6262 -5747 -3199 -636 -2061 -4682 -8388 -8634 -10754 -12997
14542 -12997 -8342 -453 -1601 -6302 -8039 -7876 -8943 -10023 -7087 -6840 -8192 -8460 -7124 -5121 -8356
14527 -8356 -9538 -10329 -10461 -13398 -11884 -8271 -10025 -10749 -5595 -2653 -4479 -8497 -8838 -10099 -4198 927
14511 927 -146 -1838 -3255 -4411 -4682 -2943 -1227 -649 -6574 -10733 -10146 -7320 -3406 -2419 -4423 -3853
14495 -3853 91 776 1005 1343 1879 1567 458 -3836 -3952 -3773 -8113 -11716 -11606 -9018 -8811 -6484 -6188
$$ packed form
14606c849J288P035K463k152j143J543k229o756O5K751J258q55q77j625m60K146
14590a397k869n81k437J637j205J124Q56K308K768Q50j995q33j42L081r86k99
14574a20k350L34j370q43M30m328o912m011Q04N695L195K611j014k820K015J661
14558g023J991M835q94j840l67Q55l819N15K548K563j425k621l706k46k120k243
14542a2997M655P889j148m701j737J63j067j080K936K47j352k68J336K003l235
14527h356j182p91j32k937J514L613j754p24N154K942j826m018l41j261N901N125
14511I27j073j692j417j156k71J739J716N78n925m159N87K826L914R87k004N70
14495c853L944O85K29L38N36l12j109m294j16J79m340l603J10K588K07K327K96
$$ plain form
14478 -6188 -9757 -8863 -8971 -9832 -6157 -3012 -2822 637 2442 2519 -1271 -4769 -3311 -4948 -5874 -6835 -9103
14461 -9103 -8822 -9619 -10269 -4925 -7505 -6501 -4035 -4529 -6395 -8564 -7617 -6941 -6278 -4554 -3362 -3972 -3653
14444 -3653 -1443 -2551 -2166 215 607 1294 815 -319 -2011 -2788 -2812 -4783 -8155 -6965 -6757 -8219 -4684
14427 -4684 -116 -755 -3147 -6066 -2513 -1449 -2708 -4321 -3631 -3553 -1997 -5381 -9067 -10425 -7101 -5712
14411 -5712 -5416 -6557 -6642 -9135 -11582 -11640 -10222 -9292 -9378 -7323 -4750 -3979 -5165 -3531 -4131 -8479 -10756
14394 -10756 -12230 -12570 -12003 -10769 -11287 -12248 -10153 -6657 -4288 -1803 -639 -5655 -5805 -6601 -5559 -7011
14378 -7011 -7670 -6659 -6933 -9325 -8546 -3200 -671 763 -3107 -6049 -7302 -8736 -9221 -8335 -4598 -5465
14362 -5465 -5040 -6849 -9420 -9701 -7133 -4550 -4129 -6537 -7535 -10253 -9743 -10196 -6817 -4780 -4502 -4292 -4811
$$ packed form
14478f188l569Q94j08q61L675L145J90L459J805P7l790l498J458j637r26r61k268
14461i103K81p97o50N344k580J004K466m94j866k169R47O76O63J724J192o10L19
14444c653K210j108L85K381L92O87m79j134j692p77k4j971l372J190K08j462L535
14427d684M568o39k392k919L553J064j259j613O90P8J556l384l686j358L324J389
14411e712K96j141q5k493k447n8J418R30q6K055K573P71j186J634o00m348k277
14394a0756j474l40N67J234n18r61K095L496K369K485J164n016j50p96J042j452
14378g011o59J011k74k392P79N346K529J434l870k942j253j434m85Q86L737q67
14362e465M25j809k571k81K568K583M21k408r98k718N10m53L379K037K78K10n19
$$ plain form
14345 -4811 -5738 -7168 -6046 -2850 -1494 -2614 -1440 451 714 1568 2337 1507 -2065 -4008 -1612 -2354
14329 -2354 -3987 -5680 -7000 -7760 -8215 -4341 -1064 -614 -2635 -5627 -4918 -6331 -8608 -10188 -9944 -5931
14313 -5931 -2156 528 -1290 -240 -2230 -3796 -2095 -3479 -6428 -10193 -11304 -11524 -8869 -7053 -3108
14298 -3108 -3067 -8292 -8208 -2244 -4713 -6392 -4999 -5739 -4789 -6854 -4299 -5588 -9424 -10811 -11895 -10500
14282 -10500 -3729 -125 -476 -3599 -3627 -4816 -3228 -4406 -5510 -2954 -3648 -6225 -6626 -586 1441 922
14266 922 -2760 -6160 -5435 -7032 -9420 -9642 -11610 -13454 -8967 -7783 -10258 -8003 -5571 -6471 -5341 -5452
14250 -5452 -5796 -8286 -9128 -7840 -6146 -8062 -5713 -2617 -5034 -4236 -1889 -30 360 -3121 -5411 -3448
14234 -3448 -3917 -2024 -2363 -6568 -8469 -7479 -7264 -8948 -7607 -7856 -8734 -6449 -5140 -5901 -4278 -1144
$$ packed form
14345d811r27j430J122L196J356j120J174J891K63Q54P69q30l572j943K396p42
14329b354j633j693j320p60m55L874L277M50k021k992P09j413k277j580K44M013
14313e931L775K684j818J050j990j566J701j384k949l765j111k20K655J816L945
14298c108M1n225Q4N964k469j679J393p40R50k065K555j289l836j387j084J395
14282a0500O771L604l51l123k8j189J588j178j104K556o94k577m01O040K027n19
14266I22l682l400P25j597k388k22j968j844M487J184k475K255K432r00J130j11
14250e452l44k490q42J288J694j916K349L096k417P98K347J859L90l481k290J963
14234c448m69J893l39m205j901R90K15j684J341k49q78K285J309p61J623L134
$$ plain form
14218 -1144 -3668 -7244 -5458 -2405 -3774 -3484 -4809 -8107 -10209 -8834 -9309 -11090 -10996 -9194 -6318 -5587
14202 -5587 -4023 -4239 -3373 -6750 -7760 -10843 -7681 -5298 -5055 -6747 -6627 -9651 -12790 -12656 -11105 -5708
14186 -5708 -3711 -4526 -1469 -1508 -6134 -10061 -10020 -13703 -14737 -14517 -13351 -13008 -13665 -11284 -7560 -2827 -1771
14169 -1771 -4129 -3371 -5029 -5966 -5782 -5139 -4931 -9503 -10194 -7458 -3760 -1729 -3732 -5592 -2563 1161
14153 1161 -481 -5705 -5912 -6220 -3132 -2878 -6533 -6574 -3593 -4481 -4809 -4794 -5088 -2175 637 -4076 -10848
14136 -10848 -11170 -8975 -6986 -3950 -2171 1605 1722 -481 -2561 -7407 -12072 -12572 -7866 -2762 -1196
14121 -1196 -3085 -2911 -2452 -3316 -2823 -1426 -3030 -3167 -6621 -7370 -7692 -11361 -15320 -14762 -12441 -10522 -6988
14104 -6988 -7267 -7976 -4376 -6224 -7634 -9882 -7150 -5239 -4722 -6737 -10979 -11425 -5964 -2092 -2867 -5513
$$ packed form
14218a144k524l576J786L053j369K90j325l298k102J375m75j781R4J802K876P31
14202e587J564k16Q66l377j010l083L162K383K43j692J20l024l139J34J551N397
14186e708J997q15L057l9m626l927M1l683j034K20J166L43o57K381L724M733J056
14169a771k358P58j658r37J84O43K08m572o91K736L698K031k003j860L029L724
14153A161j642n224k07l08L088K54l655m1K981q88l28J5k94K913K812m713o772
14136a0848l22K195J989L036J779L776J17k203k080m846m665n00M706N104J566
14121a196j889J74M59q64M93J397j604j37l454p49l22l669l959N58K321J919L534
14104f988k79p09L600j848j410k248K732J911N17k015m242m46N461L872p75k646
$$ plain form
14088 -5513 -2845 967 4539 2885 -1508 -1334 -3286 -6303 -5647 -4529 -4005 -6529 -7897 -6240 -6279 -8077
14072 -8077 -5065 -3293 -7737 -9011 -6473 -3367 -3398 -4021 -7538 -8234 -7861 -7858 -7291 -4715 -6021 -5866 -5973
14055 -5973 -9239 -9422 -5640 -2145 -1599 1236 141 -1883 -6460 -6922 -8523 -12026 -10695 -6257 -285
14040 -285 -3490 -7337 -6016 -6622 -10863 -9062 -4091 -5412 -6951 -5713 -4150 -6526 -7490 -6562 -3774 -4719
14024 -4719 -7638 -9584 -11720 -7970 -5129 -6152 -4704 -2646 -3056 -5313 -8653 -8440 -4672 -794 -3697
14009 -3697 -4393 -533 2603 588 2279 1274 -380 2842 5694 3554 1037 -2370 -2827 -2446 -2854 -1285
13993 -1285 -3081 -4979 -1423 -1100 -2422 -515 2428 -3613 -7309 -7455 -8203 -5885 -5197 -6222 -5462 -5940
13977 -5940 -12498 -13373 -9736 -8719 -8741 -7364 -10211 -9605 -6575 -6492 -7852 -5952 -6015 -7539 -5631 -4541 -4677
$$ packed form
14088e513K668L812L572j654m393J74j952l017O56J118N24k524j368J657l9j798
14072h077L012J772m444j274K538L106l1o23l517o96L73LN67K576j306J55j07
14055e973l266j83L782L495N46K835j095k024m577m62j601l503J331M438N972
14040b85l205l847J321o06m241J801M971j321j539J238J563k376r64R28K788r45
14024d719k919j946k136L750K841j023J448K058m10k257l340K13L768L878k903
14009c697o96L860L136k015J691j005j654L222K852k140k517l407m57L81m08J569
13993a285j796j898L556L23j322J907K943o041l696j46p48K318O88j025P60m78
13977e940o558q75L637J017k2J377k847O06L030Q3j360J900o3j524J908J090j36
$$ plain form
13960 -4677 -4741 -4340 -688 1392 -522 -3592 -294 -908 -4934 -2778 -761 -1903 -3302 -5302 -1951 -3138
13944 -3138 -4780 -6053 -4844 -7176 -8682 -7955 -5434 -5690 -8618 -8410 -12992 -13086 -13746 -14830 -11612 -4628
13928 -4628 -3483 -6366 -10535 -10510 -12179 -8397 -6728 -12814 -10258 -7414 -6440 -6623 -5324 -5571 -6522 -3697
13912 -3697 -4407 -4922 -7092 -9473 -7037 -7835 -10372 -6604 -3448 -2467 -219 3317 5592 501 -2050 -3302
13896 -3302 -2027 -424 -846 -2092 -4898 -7333 -6373 -6123 -10397 -9407 -6094 -2392 2967 1408 1123 1668
13880 1668 2574 2099 -2063 811 336 3388 1997 1639 2061 1094 -334 2723 2425 1544 -927 -3019 -2582
13863 -2582 -6072 -8306 -8940 -8347 -10665 -11456 -11938 -8714 -3647 -3139 -4633 -2282 -1728 283 -1017 -2151
13847 -2151 -2529 -6818 -6868 -4467 -4374 -8827 -8478 -7427 -8568 -10849 -9439 -6654 -3760 -2472 -1746 -2440 -187
$$ packed form
13960d677o4M01L652K080j914l070L298o14m026K156K017j142j399k000L351j187
13944c138j642j273J209k332j506P27K521k56k928K08m582r4o60j084L218O984
13928d628J145k883m169K5j669L782J669o086K556K844R74j83J299k47r51K825
13912c697p10n15k170k381K436p98k537L768L156R81K248L536K275n091k551j252
13896c302J275J603m22j246k806k435R60K50m274R90L313L702N359j559k85N45
13880A668R06m75m162K874m75L052j391l58M22r67j428L057k98q81k471k092M37
13863b582l490k234o34N93k318p91m82L224N067N08j494K351N54K011j300j134
13847b151l78m289n0K401R3m453L49J051j141k281J410K785K894J288P26o94K253
$$ plain form
13830 -187 2829 985 2496 1989 -866 -694 -1715 -5628 -10006 -9202 -8633 -5367 -4225 -2986 -5661 -4232
13814 -4232 -2710 -2536 -6649 -5726 -4183 -970 -188 2888 3747 6512 4356 1387 -579 -3098 -3517 -1651
13798 -1651 -42 -4934 -11614 -11097 -4641 2454 2431 1565 -4767 -10477 -9914 -3340 1626 1476 4055 3125
13782 3125 2256 -449 -1995 1243 122 -3619 -2777 -3807 -6418 -7326 -8035 -8921 -3700 -2904 -109 99
13766 99 -552 -3107 -3894 -1266 1749 135 -1681 -3897 -4270 -6988 -9904 -9161 -10340 -8404 -6892 -12928
13750 -12928 -13674 -10323 -7660 -6392 -6553 -7258 -3897 -1991 -251 -4463 -3372 -3275 -2771 -2811 -2778 -8172 -10012
13733 -10012 -5722 -3593 -1069 1395 1121 -2233 -2002 -1215 -487 -134 1313 -1997 -6510 -6579 -4427 -5728
13717 -5728 -5373 -3313 -4549 -3303 -1480 -3949 -5646 -6888 -9751 -8594 -8525 -7269 -5511 -5416 -5450 -938
$$ packed form
13830a87L016j844J511n07k855J72j021l913m378Q04N69L266J142J239k675J429
13814d232J522J74m113R23J543L213P82L076Q59K765k156k969j966k519m19J866
13798a651J609m892o680N17O456P095k3q66o332n710N63O574M966j50K579r30
13782C125q69k705j546L238j121l741Q42j030k611r08p09q86N221P96K795K08
13766I9o51k555p87K628L015j614j816k216l73k718k916P43j179J936J512o036
13750a2928p46L351K663J268j61p05L361J906J740m212J091R7N04m0L3n394j840
13733a0012M290K129K524K464k74l354K31P87P28L53J447l310m513o9K152j301
13717e728L55K060j236J246J823k469j697j242k863J157O9J256J758R5l4M512
$$ plain form
13701 -938 -494 1221 3724 1367 -998 -5062 -9723 -8586 -3681 -896 -1477 -6799 -13139 -10459 -6896
13686 -6896 -5295 -6171 -7064 -9518 -11371 -11129 -7270 -7936 -11416 -7788 -4042 -3076 -940 264 -1150 -3929
13670 -3929 -4254 -5829 -4186 -899 -360 -1676 4207 7630 4822 -3599 -6052 -5907 -4911 -6944 -4421 -1847
13654 -1847 -2526 -3642 -5720 -4936 4407 9110 7159 2428 -2916 -4768 -3535 -4191 -4794 -9745 -6236 -3284
13638 -3284 -4117 -2966 -2784 -4863 -4625 -1016 -1596 -2029 -2165 -2823 -4465 -6038 -5173 -2074 15 250 -3022
13621 -3022 -556 6350 8555 6187 -2713 -5147 -4016 -3374 -5446 -4905 -2274 -844 -1927 -2528 -3279 -2055
13605 -2055 -2961 -4572 -4540 -4615 -2767 -5153 -4928 -2631 -2836 -4197 -1157 507 -2158 -4542 -1653 1978
13589 1978 5164 4050 76 -316 -4052 -5329 -1327 -2591 -5327 -6847 -4993 -6591 -7733 -6106 -4996
$$ packed form
13701i38M44J715K503k357k365m064m661J137M905K785n81n322o340K680L563
13686f896J601q76q93k454j853K42L859o66l480L628L746R66K136J204j414k779
13670c929l25j575J643L287N39j316N883L423k808q421k453J45R96k033K523K574
13654a847o79j116k078P84R343M703j951m731n344j852J233o56o03m951L509K952
13638c284q33J151J82k079K38L609n80m33j36o58j642j573Q65L099K089K35l272
13621c022K466O906K205k368q900k434J131O42k072N41K631J430j083o01p51J224
13605b055r06j611L2p5J848k386K25K297k05j361L040J664k665k384K889L631
13589A978L186j114l974l92l736j277M002j264k736j520J854j598j142J627J110
$$ plain form
13574 -4996 -1495 -2150 -10397 -15590 -11759 -4240 -1929 -2476 -2181 -501 2061 809 2334 3796 3614 3529
13558 3529 4307 8155 4964 554 2517 1868 -3657 -4848 -1246 -2437 -7475 -6721 -7800 -7173 -7124 -8646
13542 -8646 -8552 -7356 -8536 -8664 -6939 -7714 -9407 -7948 -5905 -3918 -1592 540 3061 3356 4026 274
13526 274 2585 2326 -827 -837 1957 -69 -6716 -5406 -2656 -502 -2812 -2179 1137 -833 -5766 -8480
13510 -8480 -8642 -8822 -8135 -8150 -5652 -2420 -2861 -2433 -117 1736 91 -5545 -6296 -8675 -7728 -3127 -790
13493 -790 -1723 585 1991 -124 -3912 -3964 -3165 -3136 -4283 -5215 -7757 -5126 -402 868 -3536 -5563 -7395
13476 -7395 -6166 -8098 -9488 -10589 -7447 -5138 -4668 -4459 -4294 -6053 -3364 1387 3918 3383 1715 -1049
13460 -1049 -5831 -5728 -2798 -1857 -5635 -6841 -7158 -921 -1062 -5118 -5808 -6046 -7567 -2563 7909 10873
$$ packed form
13574d996L501o55q247n193L831P519K311n47K95J680K562j252J525J462j82q5
13558C529P78L848l191m410J963o49n525j191L602j191n038P54j079O27M9j522
13542h646R4J196j180j28J725p75j693J459K043J987K326K132K521K95O70l752
13526B74K311k59l153j0K794k026o647J310K750K154k310O33L316j970m933k714
13510h480j62j80O87j5K498L232m41M28K316J853j645n636p51k379R47M601K337
13493g90r33K308J406k115l788n2P99K9j147r32k542K631M724J270m404k027j832
13476g395J229j932j390j101L142K309M70K09J65j759K689M751K531n35j668k764
13460a049m782J03K930R41l778j206l17O237j41m056o90k38j521N004J0472K964
$$ plain form
13444 10873 11859 18196 31976 51907 72263 96925 115457 134387 144451 149549 151222 140541 118350
13431 118350 96872 73074 54615 41702 33876 29143 25369 19791 20711 19626 15835 12352 12922 10076
13417 10076 5979 6202 2972 3390 291 -6288 -10113 -7033 -5042 -2548 -374 236 3898 2035 -1413
13402 -1413 -3924 -3367 -4156 -1463 188 2517 -976 -8736 -4134 -2004 -5198 -5589 -219 -852 -3223 -6715
13386 -6715 -9339 -6443 -5918 -6902 -7383 -8526 -4289 -5895 -7077 -11818 -10437 -6988 -4580 564 -2593
13371 -2593 -3811 -3154 -2443 -2709 -6612 -7704 -7979 -9881 -10802 -9386 -6804 -5854 -3387 -2943 -791 3475
13355 3475 5628 7635 5150 3393 4965 3855 -124 -1402 85 -663 -2826 -2525 -3834 -4217 -4782 -511
13339 -511 1556 -533 -113 -2476 -3077 -4683 -5386 -4644 -5686 -3083 -2370 -2542 -1243 1469 6694 6578 4588
$$ packed form
13444A0873R86O337J3780J9931K0356K4662J8532J8930J0064N098J673j0681k2191
13431A18350k1478k3798j8459j2913p826m733l774n578R20j085l791l483N70k846
13417A0076m097K23l230M18l099o579l825L080J991K494K174O10L662j863l448
13402a413k511N57p89K693J651K329l493p760M602K130l194l91N370o33k371l492
13386f715k624K896N25r84m81j143M237j606j182m741J381L449K408N144l157
13371b593j218O57P11k66l903j092k75j902r21J416K582R50K467M44K152M266
13355C475K153K007k485j757J572j110l979j278J487p48k163L01j309l83n65M271
13339e11K067k089M20k363o01j606p03P42j042K603P13j72J299K712N225j16j990
$$ plain form
13322 4588 -1141 -2518 -318 3325 2184 -1565 -1071 2620 1656 1576 -1000 -4294 -7026 -4966 -4925 -5567
13306 -5567 -2456 -222 881 791 1176 -2046 547 1853 -3317 -7883 -7737 -3858 2890 2336 -847 -2175
13290 -2175 -1222 -141 1972 3462 390 1072 2361 -885 -645 1282 -2197 -3701 -2361 -2630 -3227 -292
13274 -292 416 1360 759 -2070 -379 3795 3964 3514 4737 5517 8558 7491 4494 886 2517 3390 2693
13257 2693 6168 7533 6044 2824 2559 3567 1812 5111 6444 7487 7131 6190 3986 1154 4557
13242 4557 6872 5017 6050 4574 8125 15996 20859 18537 14578 11841 8910 7558 8067 5691 2221
13227 2221 4079 2877 -2496 -1989 -3271 -1453 -3291 -5026 -4388 -5230 -2669 -3639 -1771 -652 -2091 -1837
13211 -1837 792 2171 972 -920 1428 2372 -511 -5 2537 2293 2556 2921 2827 2499 417 -3958 -3883
$$ packed form
13322D588n729j377K200L643j141l749M94L691r64q0k576l294k732K060M1o42
13306e567L111K234J103r0L85l222K593J306n170m566J46L879O748n54l183j328
13290b175R53J081K113J490l072O82J289l246K40J927l479j504J340k69n97K935
13274b92P08R44o01k829J691M174J69m50J223P80L041j067k997l608J631Q73o97
13257B693L475J365j489l220k65J008j755L299J333J043l56r41k204k832L403
13242D557K315j855J033j476L551P871M863k322l959k737k931j352N09k376l470
13227B221J858j202n373N07j282J818j838j735O38q42K561r70J868J119j439K54
13211a837K629J379j199j892K348R44k883N06K542k44K63L65r4l28k082m375P5
$$ plain form
13194 -3883 -2674 -2633 -2434 -3619 -4235 -3793 -78 3870 2340 7903 6691 1728 -2052 -2394 -2507 -249
13178 -249 2623 3065 -2710 -2540 -1023 -1568 332 3256 2070 2075 7693 5831 3520 4008 3014 2598 3860
13161 3860 7683 8909 5385 3583 4419 2484 1245 -301 2614 2097 270 -31 70 -70 3149 5231
13145 5231 5757 5322 3200 6470 8001 5682 3161 4146 3262 2139 2282 2700 2953 3939 6798 5590 2963
13128 2963 447 -287 -95 -3517 -5700 -6191 -3731 -1711 -3504 -5194 -393 1529 2570 1517 -1479
13113 -1479 -2479 703 4971 7065 7044 8109 5605 4029 4874 4585 5750 9216 7985 5290 4661 4402
13097 4402 869 723 3502 4218 5213 5027 757 -1859 -3552 -5272 -8580 -8005 -8153 -6462 -295 4276
13081 4276 10876 12195 9952 3734 -287 -856 4068 4553 3932 382 -261 4798 7145 5495 2901 -2594
$$ packed form
13194c883J209M1J99j185o16M42L715L948j530N563j212m963l780l42j13K258
13178b49K872M42n775J70J517n45J900K924j186NN618j862k311M88r94m16J262
13161C860L823J226l524j802Q36j935j239j546K915n17j827l01J01j40L219K082
13145E231N26m35k122L270J531k319k521R85q84j123J43M18K53R86K859j208k627
13128B963k516p34J92l422k183m91K460K020j793j690M801J922J041j053k996
13113a479j000L182M268K094k1J065k504j576Q45k89J165L466j231k695o29k59
13097D402l533j46K779P16R95j86m270k616j693j720l308N75j48J691O167M571
13081D276O600J319k243o218m021n69M924M85o21l550o43N059K347j650k594n495
$$ plain form
13065 -2594 -3571 -2682 -4541 -5277 -5455 -5144 -1087 525 647 2429 3493 3615 4325 5307 4688 4126 -1811
13048 -1811 -3632 572 1358 -1998 -1763 3273 635 -116 5691 6332 3200 3400 4038 3101 1322 2165 3105
13031 3105 1616 3389 2063 1283 2759 5643 8708 11876 8973 7416 8050 9476 6012 3385 988
13016 988 90 -1971 -502 1586 2344 2994 5962 5830 2905 2143 3199 6699 6918 6355 7370 4301 -866
12999 -866 1083 -217 -173 1575 232 -2539 -315 -1674 -93 1489 2906 2552 -25 1335 2881 -453
12983 -453 -1167 -2392 -1601 303 108 -1434 517 969 571 -1590 164 27 -323 914 3583 2843 5795
12966 5795 7650 6082 2738 3006 1095 707 2061 1227 2640 7982 10075 7126 7812 7956 5244 3177
12950 3177 1443 3996 3944 2659 3913 3600 3000 3962 1425 -1796 -2219 1398 3477 5046 2735 4075
$$ packed form
13065b594r77Q89j859p36j78L11M057J612J22J782J064J22P10R82o19n62n937
13048a811j821M204P86l356K35N036k638p51N807O41l132K00O38r37j779Q43R40
13031C105j489J773j326p80J476K884L065L168k903j557O34J426l464k627k397
13016I88q98k061J469K088P58O50K968j32k925p62J056L500K19n63J015l069n167
12999h66J949j300M4J748j343k771K224j359J581J582J417l54k577J360J546l334
12983d53p14j225P91J904j95j542J951M52l98k161J754j37l50J237K669p40K952
12966E795J855j568l344K68j911l88J354q34J413N342K093k949O86J44k712k067
12950C177j734K553n2j285J254l13o00R62k537l221m23L617K079J569k311J340
$$ plain form
12934 4075 5526 5314 5587 2509 -80 1728 3853 1661 1195 450 3218 4788 3356 3338 6557 4965
12918 4965 898 5649 8781 8582 4552 590 -6698 -8189 -2217 2599 1262 2026 2969 1105 -1905
12903 -1905 -3198 -1140 1549 -654 426 278 1702 -1060 -1550 2441 6591 7422 8622 5182 1788
12888 1788 9260 8187 1768 -673 2409 2344 333 734 810 -69 -461 -537 -1512 -2148 -3486 -3038 -5445 -6653
12870 -6653 -7010 -5791 -3822 -6855 -4865 -1735 -1947 2018 5229 3464 2975 1366 -195 1833 2644 1935
12854 1935 3218 3352 3134 -730 1041 1818 4528 2297 4492 3781 1617 -210 -2064 -385 -4992 -10026
12838 -10026 -6852 -2315 -4806 -7421 -7259 -3412 -288 1182 2344 1922 4876 5316 4809 4972 2961 -168
12822 -168 -1393 -1249 693 -700 -1388 892 3117 223 1180 1775 781 3602 10217 9920 5191 5107 4036
$$ packed form
12934D075J451k12K73l078k589J808K125k192m66p45K768J570j432j8L219j592
12918D965m067M751L132j99m030l962p288j491N972M816j337P64R43j864l010
12903a905j293K058K689k203J080j48J424k762m90L991M150Q31J200l440l394
12888A788P472j073o419k441L082o5k011M01P6q79l92p6r75o36j338M48k407j208
12870f653l57J219J969l033J990L130k12L965L211j765m89j609j561K028Q11p09
12854A935J283J34k18l864J771P77K710k231K195p11k164j827j854J679m607n034
12838a0026L174M537k491k615J62L847L124J470J162m22K954M40n07J63k011l129
12822a68j225J44J942j393o88K280K225k894R57N95r94K821O615k97m729q4j071
$$ plain form
12805 4036 1071 -2551 -1571 3279 4291 2445 -1985 -5465 -8989 -5625 337 -101 2561 1969 3651
12790 3651 3423 2833 3424 1030 -1554 -2582 -2956 954 3654 2895 2942 7227 10215 7824 6945 1818 -40
12773 -40 -674 -2732 -3970 -3055 -2399 734 -2446 -2980 -912 2119 -338 -55 772 507 713 2965 6346
12756 6346 6254 6851 10744 11604 8710 4980 3641 3416 2077 1762 1561 2974 7113 5447 1178 2196
12740 2196 1175 -209 1624 2402 2044 2442 2729 5371 3204 1448 7118 12325 10674 13710 19832 14565
12724 14565 9342 7381 944 -1744 -1211 2407 4104 4139 6573 5958 3769 3929 4178 4080 4346 5000 2461
12707 2461 5452 5979 5423 5775 8636 10797 13313 11575 12066 8488 1218 -3176 -2383 -2443 -607 591
12691 591 2536 5816 8606 9922 7367 8355 7328 5573 4019 3107 -648 -1888 -1434 3343 3903 5959
$$ packed form
12805D036k965l622R80M850J012j846m430l480l524L364N962m38K662n92J682
12790C651k28n90N91k394k584j028l74L910K700p59M7M285K988k391q79n127j858
12773d0o34k058j238R15O56L133l180n34K068L031k457K83Q27k65K06K252L381
12756F346r2N97L893Q60k894l730j339k25j339l15k01J413M139j666m269J018
12740B196j021j384J833P78l58L98K87K642k167j756N670N207j651L036O122n267
12724A4565n223j961o437k688N33L618J697L5K434o15k189J60K49r8K66O54k539
12707B461K991N27n56L52K861K161K516j738M91l578p270m394P93o0J836J198
12691E91J945L280K790J316k555R88j027j755j554r12l755j240M54M777N60K056
$$ plain form
12675 5959 6323 3051 2985 -329 -5032 -208 3942 5050 5936 5718 2848 3862 6169 7471 5907 3000
12659 3000 5096 6532 7797 6311 7788 7543 11296 10325 11949 13005 14481 17161 15078 13686 11967
12644 11967 10277 10807 10725 10672 10439 6455 7171 9237 7239 4242 2892 2903 6478 5194 154 -3722 -1575
12627 -1575 -195 2850 7110 10695 13754 8148 3759 5922 8075 5723 9908 12991 14936 9479 6315
12612 6315 7878 6492 5026 6843 9772 8878 6363 6116 11164 7907 4786 4815 8046 11465 13302 19120
12596 19120 25267 29418 27588 23387 22826 20394 16241 10215 10926 11581 9834 9588 8390 9256 14316 13586
12580 13586 10003 10386 5305 939 -406 -631 500 3786 6261 5463 4069 6458 10374 10105 8434
12565 8434 6777 6486 9773 7925 5519 9734 12852 13512 14499 16454 18806 18712 18680 16355 16987 18401 19576
$$ packed form
12675E959L64l272o6l314m703M824M150J108Q86k18k870J014K307J302j564k907
12659C000K096J436J265j486J477k45L753r71J624J056J476K680k083j392j719
12644A1967j690N30q2n3k33l984P16K066j998k997j350J1L575j284n040l876K147
12627a575J380L045M260L585L059n606m389K163K153k352M185L083J945n457l164
12612F315J563j386j466J817K929q94k515k47N048l257l121K9L231L419J837N818
12596A9120O147M151j830m201n61k432m153o026P11O55j747k46j198Q66N060p30
12580A3586l583L83n081m366j345k25J131L286K475p98j394K389L916k69j671
12565H434j657k91L287j848k406M215L118O60R87J955K352r4l2k325O32J414J175
$$ plain form
12548 19576 18707 16245 15836 14571 9589 5595 5976 1542 3239 8111 8532 5669 1664 163 442 2521
12532 2521 4042 4337 9491 10739 15514 16470 14399 13503 11219 6613 7563 7803 8898 7816 8682 13946
12516 13946 10400 7037 4772 8269 11839 10715 9028 13142 13914 16030 11275 14486 21481 17521 14904
12501 14904 17704 17892 13967 14184 15603 12506 6643 5793 6781 8700 16129 17046 14473 12862 10913 11704
12485 11704 13068 13785 14789 16023 18200 12786 9862 13248 17996 19175 16108 12154 9736 10920 14738
12470 14738 14572 13037 12472 10941 9565 9971 11027 13265 13488 11873 10343 12049 14874 15416 19939 17595
12454 17595 13204 11681 8611 4102 1933 1299 -823 -3078 -2775 288 -435 1139 -1289 1601 7020
12439 7020 9729 16003 24446 30177 34715 40985 46321 52887 61407 72153 81811 94734 109014 119063
$$ packed form
12548A9576q69k462m09j265m982l994L81m434J697M872M21k863m005j501K79K079
12532B521J521K95N154J248M775R56k071q96k284m606R50K40J095j082Q66N264
12516A3946l546l363k265L497L570j124j687M114P72K116m755L211O995l960k617
12501A4904K800J88l925K17J419l097n863q50R88J919P429R17k573j611j949P91
12485A1704J364P17J004J234K177n414k924L386M748J179l067l954k418J184L818
12470A4738j66j535n65j531j376M06J056K238K23j615j530J706K825N42M523k344
12454A7595m391j523l070m509k169o34k122k255L03L063p23J574k428K890N419
12439G020K709O274Q443N731M538O270N336O566Q520J0746R658J2923J4280J0049
$$ plain form
12425 119063 129642 141714 160409 183813 222457 278275 349732 449118 566034 699198 840930
12414 840930 976609 1078578 1136758 1147199 1117038 1035495 913062 780408 647964 522446
12404 522446 414757 331414 269537 225558 195501 170308 149740 136870 132024 122998 109792 101538
12392 101538 93228 86494 81818 76083 72560 73303 73861 70295 68758 63937 58319 56547 52651 48039 44266
12377 44266 45825 46075 48643 47996 49405 53265 56789 60225 58366 59084 65639 67060 64086 66454 76046
12362 76046 96204 124662 148852 161381 159181 147652 131762 115177 97129 84456 70441 61540
12350 61540 55000 48108 44812 40744 38850 36726 33127 29129 29273 37979 39454 38249 36799 36518 36892
12335 36892 39204 41044 42366 42535 42628 40881 40268 36850 36961 37017 37794 39024 34490 33356 37639 41674
$$ packed form
12425A19063J0579J2072J8695K3404L8644N5818P1457R9386J16916J33164J41732
12414H40930J35679J01969N8180J0441l0161q1543j22433j32654j32444j25518
12404E22446j07689q3343o1877m3979l0057k5193k0568j2870m846r026j3206q254
12392A01538q310o734m676n735l523P43N58l566j537m821n618j772l896m612l773
12377D4266J559K50K568o47J409L860L524L436j859P18O555J421k974K368R592
12362G6046K0158K8458K4190J2529k200j1529j5890j6585j8048j2673j4015q901
12350F1540o540o892l296m068j894k124l599l998J44Q706J475j205j450k81L74
12335C6892K312J840J322J69R3j747o13l418J11N6P77J230m534j134M283M035
$$ plain form
12319 41674 42936 43537 45184 46734 50318 58148 61267 62696 60873 63911 72992 72592 74124 80258 89622
12304 89622 96196 98315 103424 107005 103348 100550 92678 85221 79050 67482 54585 37482 22444
12291 22444 12745 3467 -2512 -4624 -4345 -633 -517 -1818 -3409 -2628 -3120 -2935 108 3365 4277 4620
12275 4620 3674 3868 -486 -149 4173 7077 10903 12919 18738 32107 42035 47252 50104 55566 63996
12260 63996 71323 80107 92791 106552 116907 126828 140537 150101 156434 159277 156915 152450 146418
12247 146418 136843 126678 116621 107307 104088 102768 100399 101770 102635 104363 114362 114250 113146 111981
12233 111981 104823 101357 95149 88370 80019 73412 67502 65679 66803 67647 66356 66053 69806 73146 77853
12218 77853 82173 88309 83946 79654 73600 71477 76133 77802 74598 70262 69353 70509 67770 65589 66875
$$ packed form
12319D1674J262O01J647J550L584P830L119J429j823L038R081m00J532O134R364
12304H9622O574K119N109L581l657k798p872p457o171j1568j2897j7103j5038
12291B2444r699r278n979k112K79L712J16j301j591P81m92J85L043L257R12L43
12275D620r46J94m354L37M322K904L826K016N819J3369R928N217K852N462Q430
12260F3996P327Q784J2684J3761J0355R921J3709R564O333K843k362m465o032
12247A46418r575j0165j0057r314l219j320k369J371Q65J728R999j12j104j165
12233A11981p158l466o208o779q351o607n910j823J124Q44j291l03L753L340M707
12218G7853M320O136m363m292o054k123M656J669l204m336r09J156k739k181J286
$$ plain form
12203 66875 73800 82497 88817 90309 93329 97911 99097 100135 96180 90038 87581 88107 89134 89574 95109
12188 95109 99244 95095 99896 105043 100654 97682 95214 90956 83101 73588 71398 73739 78662 87030
12174 87030 93211 96829 100118 110801 125648 133613 136413 133947 133539 130331 131070 128995 131161 132817
12160 132817 128867 124513 122239 118688 111991 105990 106364 106201 101776 100388 101053 100732 103528 102339 98813
12145 98813 100430 101476 105037 107424 104686 104637 105237 109830 111755 109477 114392 122575 129463 138423 147622
12130 147622 156612 175158 197432 218827 234180 247201 256764 256664 253191 241282 228651 223426 219093
12117 219093 210499 208753 216576 230395 249406 270198 285308 295671 305034 312734 309298 300177 289166
12104 289166 273193 256874 244167 232004 219407 208741 200100 194382 191385 191046 196218 203032 208987
$$ packed form
12203F6875O925Q697O320J492L020M582J186J038l955o142k457N26J027M40N535
12188I5109M135m149M801N147m389k972k468m258p855r513k190K341M923Q368
12174H7030O181L618L289J0683J4847P965K800k466m08l208P39k075K166J656
12160A32817l950m354k274l551o697o001L74j63m425j388O65l21K796j189l526
12145I8813J617J046L561K387k738m9O00M593J925k278M915Q183O888Q960R199
12130A47622Q990J8546K2274K1395J5353J3021R563j00l473j1909j2631n225m333
12117B19093q594j746P823J3819J9011K0792J5110J0363R363P700l436r121j1011
12104B89166j5973j6319j2707j2163j2597j0666q641n718k997l39N172O814N955
$$ plain form
12091 208987 216076 222211 229184 241564 254635 265888 276455 284252 290446 302375 315002 329954
12079 329954 343872 352581 356576 362027 371740 380379 390096 398730 406649 419158 429822 440703 452197
12066 452197 462728 468358 472407 477639 485877 487691 486597 489207 499238 513335 525184 548198 573327
12053 573327 598634 622444 646454 670495 693880 710958 727148 746713 768379 792801 816099
12042 816099 840291 868423 906509 951327 998416 1044916 1097511 1159883 1223804 1287752 1348972
12031 1348972 1409912 1477610 1543713 1605435 1675811 1758912 1850895 1951882 2070867 2207594 2367551
12020 2367551 2553864 2766677 3006048 3288425 3616811 3996018 4438061 4970238 5614795
12011 5614795 6389562 7308220 8379401 9620892 11025418 12603354 14401184 16485230
$$ packed form
12091B08987P089O135O973J2380J3071J1253J0567P797O194J1929J2627J4952
12079C29954J3918Q709L995N451R713Q639R717Q634P919J2509J0664J0881J1494
12066D52197J0531N630M049N232Q238J814j094K610J0031J4097J1849K3014K5129
12053E73327K5307K3810K4010K4041K3385J7078J6190J9565K1666K4422K3298
12042H16099K4192K8132L8086M4818M7089M6500N2595O2372O3921O3948O1220
12031A348972O0940O7698O6103O1722P0376Q3101R1983J00987J18985J36727J59957
12020B367551J86313K12813K39371K82377L28386L79207M42043N32177O44557
12011E614795P74767R18658J071181J241491J404526J577936J797830K084046
$$ plain form
12003 16485230 18989545 22169352 26439202 32398141 40926316 53135525 69787625 90416083
11995 90416083 113590138 138660873 164332258 185269238 196830789 201006032 199727967
11988 199727967 189956471 171033938 147562994 123531635 100473193 79665775 62452381
11981 62452381 49325331 39830236 33067704 28170950 24515425 21675456 19340674 17307966
11973 17307966 15492054 13862856 12385261 11042104 9841795 8799179 7910554 7151397
11965 7151397 6503234 5951398 5480295 5069624 4702950 4371580 4073125 3797884 3542623
11956 3542623 3305619 3086176 2884233 2696186 2530862 2385996 2254282 2137146 2030500
11947 2030500 1933434 1841784 1759152 1682809 1613744 1550329 1480907 1414827 1358315 1307780 1257434
$$ packed form
12003A6485230K504315L179807M269850N958939Q528175J2209209J6652100K0628458
11995I0416083K3174055K5070735K5671385K0936980J1561551M175243j278065
11988A99727967r771496j8922533k3470944k4031359k3058442k0807418j7213394
11981F2452381j3127050r495095o762532m896754l655525k839969k334782k032708
11973A7307966j815912j629198j477595j343157j200309j042616q88625p59157
11965G151397o48163n51836m71103m10671l66674l31370k98455k75241k55261
11956C542623k37004k19443k01943j88047j65324j44866j31714j17136j06646
11947B030500r7066r1650q2632p6343o9065o3415o9422o6080n6512n0535n0346
$$ plain form
11936 1257434 1203739 1154966 1107036 1069288 1036482 1002156 972311 951221 930003 903085 874726
11925 874726 839058 802991 776027 746926 716810 697050 679312 660026 642333 628917 613993
11914 613993 596212 573875 548321 528423 511415 490807 473541 457885 448332 432835 420032 405935
11902 405935 394917 388013 385300 385513 380865 379086 379659 381748 385208 388898 397166 402706 408844 418359
11888 418359 425709 427891 422484 417651 403657 388140 372881 356994 343044 330876 320815 311075
11876 311075 301916 293318 286749 275131 266245 259962 254751 254950 262187 271937 277090 286978 302446 314190
11862 314190 315734 309316 299169 285279 265593 247312 225064 210687 200106 194461 191808 190527
11850 190527 188687 187290 192159 198647 199305 199301 201682 204167 207323 205426 206537 211763 214183 207399 198923
$$ packed form
11936A257434n3695m8773m7930l7748l2806l4326k9845k1090k1218k6918k8359
11925H74726l5668l6067k6964k9101l0116j9760j7738j9286j7693j3416j4924
11914F13993j7781k2337k5554j9898j7008k0608j7266j5656r553j5497j2803j4097
11902D05935j1018o904k713K13m648j779N73K089L460L690Q268N540O138R515
11888D18359P350K182n407m833j3994j5517j5259j5887j3950j2168j0061r740
11876C11075r159q598o569j1618q886o283n211J99P237R750N153R888J5468J1744
11862C14190J544o418j0147j3890j9686j8281k2248j4377j0581n645k653j281
11850A90527j840j397M869O488O58mK381K485L156j897J111N226K420o784q476
$$ plain form
11835 198923 194118 188823 184304 180685 176352 175023 172741 170462 167525 165577 164048 161398 158057 150698
11821 150698 142493 139724 132159 121857 111629 108405 109652 110876 109983 113073 114451 116195 118144 122427
11807 122427 128272 133629 139997 147094 154587 159945 161650 160406 153273 155607 169587 188766 218511
11794 218511 249341 257619 232466 199485 171451 152422 145068 134642 127533 118474 114596 114468 118313
11781 118313 125970 140959 169333 188046 176994 158336 137407 123348 117778 114357 108221 104344
11769 104344 100906 100592 96774 90679 89762 90721 90362 87685 81207 80812 84359 91453 99110 100915 100416 102449
11753 102449 107181 110126 113227 117388 118085 115529 111807 107333 102193 102338 105152 103140 101445 102149 102454
11738 102454 102603 101778 102764 103995 99590 94236 90417 94023 97054 96964 94577 94004 92917 92141 88156 82139
$$ packed form
11835A98923m805n295m519l619m333j329k282k279k937j948j529k650l341p359
11821A50698q205k769p565j0302j0228l224J247J224q93L090J378J744J949M283
11807A22427N845N357O368P097P493N358J705j244p133K334J3980J9179K9745
11794B18511L0830Q278k5153l2981k8034j9029p354j0426p109r059l878j28L845
11781A18313P657J4989K8374J8713j1052j8658k0929j4059n570l421o136l877
11769A04344l438l14l818o095r17R59l59k677o478l95L547P094P657J805m99K033
11753A02449M732K945L101M161O97k556l722m474n140J45K814k012j695P04L05
11738A02454J49q25R86J231m405n354l819L606L031r0k387n73j087p76l985o017
$$ plain form
11722 82139 81621 89483 89180 84214 80413 81969 83461 82978 86709 96469 100381 104021 104406 97694 96497
11707 96497 98843 97671 96039 96915 99373 106227 111507 114866 115632 116816 116802 117280 117230 117200 110830 105912 101084
11690 101084 96050 86537 72192 60930 50525 42505 30424 20089 10359 5566 3746 2546 1081
11677 1081 437 -2782 -2801 503 2635 5863 9922 14048 22365 33515 37671 45825 52615 58831 63170
11662 63170 64648 61556 60359 60232 60918 60674 61571 61532 60770 63186 66353 69894 71882 74686 74645 80458 86597
11645 86597 92884 106240 123249 143854 162226 176311 187352 189563 185103 182218 177400 160678 142343
11632 142343 127970 114501 101836 91377 84306 80080 77762 74255 75107 75985 73573 73943 74081 75455
11618 75455 75795 77451 76370 74675 70732 69466 70726 70207 67870 63061 59607 55335 55852 57102 51113
$$ packed form
11722H2139n18P862l03m966l801J556J492m83L731R760L912L640L85o712j197
11707I6497K346j172j632Q76K458O854N280L359P66J184j4M78n0l0o370m918m828
11690A01084n034r513j4345j1262j0405q020j2081j0335r730m793j820j200j465
11677A081o44l219j9L304K132L228M059M126Q317J1150M156Q154O790O216M339
11662F3170J478l092j197j27O86k44Q97l9p62K416L167L541J988K804m1N813O139
11645H6597O287J3356J7009K0605J8372J4085J1041K211m460k885m818j6722j8335
11632A42343j4373j3469j2665j0459p071m226k318l507Q52Q78k412L70J38J374
11618G5455L40J656j081j695l943j266J260n19k337m809l454m272N17J250n989
$$ plain form
11603 51113 47977 49330 48716 55161 57518 62139 67166 68978 65735 62102 64682 70590 70890 70819 74561
11588 74561 79037 79468 84611 89463 94209 94784 95732 100914 109648 119543 131234 145252 158465 173240
11574 173240 193218 218640 252281 295161 359581 447374 559325 688935 831269 976806 1104346
11563 1104346 1181200 1216056 1211237 1150988 1040630 916154 787425 662888 552962 466700
11553 466700 410937 382280 367736 365944 374595 398629 431869 467639 508437 556807 613656 689327
11541 689327 790737 933618 1152957 1474782 1921318 2502981 3203324 3988543 4793277 5515442
11531 5515442 6047146 6325703 6315259 6014895 5462109 4737070 3948562 3184152 2511323 1955245
11521 1955245 1526212 1216594 999155 845574 735631 653049 589935 537528 491845 447358
$$ packed form
11603E1113l136J353o14O445K357M621N027J812l243l633K580N908L00p1L742
11588G4561M476M31N143M852M746N75R48N182Q734R895J1691J4018J3213J4775
11574A73240J9978K5422L3641M2880O4420Q7793J11951J29610J42334J45537J27540
11563A104346P6854L4856m819o0249j10358j24476j28729j24537j09926q6262
11553D66700n5763k8657j4544j792Q651K4034L3240L5770M0798M8370N6849P5671
11541F89327J01410J42881K19339L21825M46536N81663P00343P85219Q04734P22165
11531E515442N31704K78557j0444l00364n52786p25039p88508p64410o72829n56078
11521A955245m29033l09618k17439j53581j09943q2582o3114n2407m5683m4487
$$ plain form
11511 447358 399221 355822 319489 283160 251598 228187 209646 192417 171329 159151 154898 145707
11499 145707 135562 128995 123059 119125 117098 112034 107218 101203 97019 95712 91397 89175 84540 78533
11485 78533 79816 77696 74672 74172 68552 62766 65187 68886 68285 64710 63181 62903 60707 67611 68245
11470 68245 65753 62920 63686 63151 61562 58787 57440 54964 53591 51263 52637 55635 58397 57143 56746
11455 56746 56657 58886 55486 54758 57783 58626 54418 50904 44321 43481 46572 46050 48376 46476 44575 46903
11439 46903 48626 48647 49621 48850 46910 47395 44816 42076 43288 43706 44737 40017 38258 37017 36088 36256
11423 36256 40875 41035 39434 37823 43169 47060 50299 54453 55503 54836 53700 54772 53085 49198 48057
11408 48057 45387 41598 41321 41399 40578 45023 46275 44268 41449 40230 37799 35608 32589 27300 30269
$$ packed form
11511D47358m8137m3399l6333l6329l1562k3411j8541j7229k1088j2178m253r191
11499A45707j0145o567n936l934k027n064m816o015m184j307m315k222m635o007
11485G8533J283k120l024n00n620n786K421L699o01l575j529k78k196O904O34
11470F8245k492k833P66n35j589k775j347k476j373k328J374K998K762j254l97
11455E6746q9K229l400p28L025Q43m208l514o583q40L091n22K326j900j901K328
11439D6903J723K1R74p71j940M85k579k740J212M18J031m720j759j241r29J68
11423C6256M619J60j601j611N346L891L239M154J050o67j136J072j687l887j141
11408D8057k670l789k77P8q21M445J252k007k819j219k431k191l019n289K969
$$ plain form
11393 30269 32724 35606 37543 38565 41735 41383 43433 40440 36151 37201 40360 37297 35849 38046 42641
11378 42641 41942 38241 38255 38425 38108 36771 36274 35177 33122 31216 33357 40314 44060 44872 46080 39592
11362 39592 38231 35443 30876 26490 21793 19969 22039 25734 24859 24396 28126 32079 29097 31073 37504
11347 37504 42996 46624 47546 50285 49537 48516 51212 54022 51166 45916 47127 48627 45710 47255 47281
11332 47281 44920 42536 40313 39139 36021 38279 37519 36684 38083 39283 35145 33466 32916 34426 35353
11317 35353 36640 36986 35678 35479 37884 37302 40749 43531 40832 34204 35702 32143 31673 33750 34327 38310
11301 38310 37228 35113 38343 38714 39673 42177 45702 44860 41666 43631 40500 37356 37289 37541 34388 30653
11285 30653 29162 32463 32724 36382 36802 38381 40866 43027 45262 45948 44940 44775 45186 45359 43125 40243
$$ packed form
11393C0269K455K882J937J022L170l52K050k993m289J050L159l063j448K197M595
11378D2641o99l701J4J70l17j337m97j097k055j906K141O957L746Q12J208o488
11362C9592j361k788m567m386m697j824K070L695q75m63L730L953k982J976O431
11347C7504N492L628R22K739p48j021K696K810k856n250J211J500k917J545K6
11332D7281k361k384k223j174l118K258p60q35J399J200m138j679n50J510R27
11317C5353J287L46j308j99K405n82L447K782k699o628J498l559m70K077N77L983
11301C8310j082k115L230L71R59K504L525q42l194J965l131l144o7K52l153l735
11285C0653j491L301K61L658M20J579K485K161K235O86j008j65M11J73k234k882
$$ plain form
11269 40243 38153 34823 35245 38620 39145 36610 39955 41764 42506 40073 38878 40958 45417 45355 42024 37615
11253 37615 37684 36534 37281 40216 38629 36998 37047 38162 42401 39658 39234 40703 40330 37675 38705 36314
11237 36314 35955 36649 35370 37069 37290 33848 34081 37917 39143 39333 40922 46915 53911 52654 54150 60537
11221 60537 69133 76334 80110 78001 70882 63431 61337 54782 48524 47875 42408 37506 40579 42985 46840
11206 46840 51330 57525 63667 71778 86689 100268 107693 102873 88617 74546 68357 62678 58529
11193 58529 51879 46077 48762 52055 53274 50720 46688 43981 37422 36731 37518 40590 39341 39822 39179
11178 39179 39222 41284 44179 44510 40954 42284 46002 45899 41738 41156 44194 42708 43235 46220 45141 39126
11162 39126 39425 41931 44642 49336 51811 49155 42729 47499 51959 47507 45413 44478 42797 41907 42676
$$ packed form
11269D0243k090l330M22L375N25k535L345J809P42k433j195K080M459o2l331m409
11253C7615O9j150P47K935j587j631M9J115M239k743m24J469l73k655J030k391
11237C6314l59O94j279J699K21l442K33L836J226J90J589N993O996j257J496O387
11221F0537Q596P201L776k109p119p451k094o555o258o49n467m902L073K406L855
11206D6840M490O195O142Q111J4911J3579P425m820j4256j4071o189n679m149
11193E8529o650n802K685L293J219k554m032k707o559o91P87L072j249M81o43
11178C9179M3K062K895L31l556J330L718j03m161n82L038j486N27K985j079o015
11162C9126K99K506K711M694K475k656o426M770M460m452k094r35j681q90P69
$$ plain form
11147 42676 39782 37417 38434 37855 39821 42466 45675 46014 49763 51744 49144 48252 48009 47676 45490 41420
11131 41420 35944 34483 39643 41576 40026 38110 38061 41336 40798 42432 44352 45938 42930 42071 43891
11116 43891 45810 50135 56586 65880 76743 83606 84989 86848 90749 86858 84640 80544 75189 69025
11102 69025 65139 60860 55465 53368 57324 55408 51501 48801 48902 47251 45294 45316 45968 46433 45910 43298
11086 43298 48895 59424 66412 68963 76064 85043 88384 87050 85546 78698 73150 68639 64172 62694
11072 62694 63687 65447 67795 76387 85010 86184 85005 77577 65848 55953 52464 56936 58386 61590
11058 61590 66765 64708 59038 55390 51990 49806 51007 55283 58347 56877 55481 48177 44560 44213 45883
11043 45883 46226 47449 50848 59879 60505 63833 72365 80295 84949 81017 70197 62013 56102 51885 49231
$$ packed form
11147D2676k894k365J017n79J966K645L209L39L749J981k600q92k43l33k186m070
11131D1420n476j461N160J933j550j916m9L275n38J634J920J586l008q59J820
11116D3891J919M325O451R294J0863O863J383J859L901l891k218m096n355o164
11102F9025l886m279n395k097L956j916l907k700J01j651j957K2O52M65n23k612
11086D3298N597J0529O988K551P101Q979L341j334j504o848n548m511m467j478
11072F2694R93J760K348Q592Q623J174j179p428j1729r895l489M472J450L204
11058F1590N175k057n670l648l400k184J201M276L064j470j396p304l617l47J670
11043D5883L43J223L399R031O26L328Q532P930M654l932j0820q184n911m217k654
$$ plain form
11028 49231 49173 47541 47073 46469 46111 49593 50473 52784 52633 55115 55059 53267 52569 49425 48290 48542 48260
11011 48260 47830 49585 48434 51342 54388 54856 53555 58658 63250 66945 64943 59744 57988 57895 58164 57349
10995 57349 55039 57014 57008 61209 63170 62239 61284 60578 61947 63435 61411 59281 55170 51949 48990 47021
10979 47021 43456 43348 47656 48912 48517 50602 54160 50931 46838 47490 48585 45233 44451 46729 49759
10964 49759 55765 58782 60856 66327 71416 71965 73100 72300 73396 70971 65555 59456 59576 60562 62721
10949 62721 62361 59494 56070 54224 52598 53010 54017 56678 57075 56303 51677 52544 52032 51752 54286 54049
10933 54049 54713 58424 64810 67503 71389 72642 74374 73321 75549 76206 77239 78261 73789 70654 64660
10918 64660 58822 57576 58464 58736 57260 60809 61891 64254 67907 77145 77578 83110 87521 89835 86340
$$ packed form
11028D9231n8j632m68o04l58L482Q80K311j51K482n6j792o98l144j135K52k82
11011D8260m30J755j151K908L046M68j301N103M592L695k002n199j756r3K69q15
10995E7349k310J975oM201J961r31r55p06J369J488k024k130m111l221k959j969
10979D7021l565j08M308J256l95K085L558l229m093O52J095l352p82K278L030
10964D9759O006L017K074N471N089N49J135q00J096k425n416o099J20R86K159
10949F2721l60k867l424j846j626M12J007K661L97p72m626Q67n12k80K534k37
10933E4049O64L711O386K693L886J253J732j053K228O57J033J022m472l135n994
10918F4660n838j246Q88K72j476L549J082K363L653R238M33N532M411K314l495
$$ plain form
10903 86340 81473 77371 73050 64924 60657 57868 56998 55327 59163 63185 66031 65405 68572 72267 72112
10888 72112 74137 79346 87214 90465 89947 86289 86085 89597 89872 88984 84246 84446 87702 91733 100838 106813
10872 106813 107941 104718 94033 88720 85942 79850 76427 70104 68353 67212 70428 72033 72627 70451
10858 70451 68587 66834 70320 80554 85699 85500 84082 84079 93174 99616 93315 88709 81993 79089 78535
10843 78535 77470 76884 78517 77155 77969 81536 82775 83320 84345 88134 88682 83307 83839 84080 83212 86295
10827 86295 90959 95303 102480 112488 121922 134248 154207 171682 180177 183308 175039 159474 141936
10814 141936 129258 122574 114226 108615 108315 108470 108537 105688 106031 106758 104558 106044 108190 108514 112694 115362
10798 115362 112478 109694 108651 107161 114761 129593 149867 167633 185663 191076 187097 182515 164174
$$ packed form
10903H6340m867m102m321q126m267k789q70j671L836M022K846o26L167L695j55
10888G2112K025N209P868L251n18l658k04L512K75q88m738K00L256M031R105N975
10872A06813J128l223j0685n313k778o092l423o323j751j141L216J605N94k176
10858G0451j864j753L486J0234N145j99j418lR095O442o301m606o716k904n54
10843G8535j065n86J633j362Q14L567J239N45J025L789N48n375N32K41q68L083
10827H6295M664M344P177J0008R434J2326J9959J7475Q495L131q269j5565j7538
10814A41936j2678o684q348n611l00J55O7k849L43P27k200J486K146L24M180K668
10798A15362k884k784j043j490P600J4832K0274J7766J8030N413l979m582j8341
$$ plain form
10785 164174 144755 123172 113302 106261 97289 90014 87744 86268 87002 90598 95390 95374 93056 89961
10771 89961 89313 82223 74240 68181 70584 74804 77949 81204 75871 73846 75809 78576 79492 77726 78880
10756 78880 81351 83800 88506 86376 84150 85002 92147 93370 92912 92000 90942 89961 92504 88794 89415 96468
10740 96468 98285 100490 104731 110862 117387 122574 127429 125453 121859 122783 123371 124780 122671 121885 114285
10725 114285 105311 105776 100936 91926 84302 83828 87533 87826 88945 88424 87263 88031 87706 88628 88492 91801
10709 91801 95514 92342 89933 90061 93569 96824 99414 96835 99470 102018 101461 94630 87301 87004 86580
10694 86580 86289 84288 82434 80673 76464 78994 82417 79792 83752 92486 104297 116755 128763 142667
10680 142667 154942 167044 178196 183652 193930 201453 207338 209832 221224 233641 242343 261828
$$ packed form
10785A64174j9419k1583r870p041q972p275k270j476P34L596M792j6k318l095
10771H9961o48p090p983o059K403M220L145L255n333k025J963K767R16j766J154
10756G8880K471K449M706k130k226Q52P145J223m58r12j058r81K543l710O21P053
10740I6468J817K205M241O131O525N187M855j976l594R24N88J409k109p86p600
10725A14285q974M65m840r010p624m74L705K93J119n21j161P68l25R22j36L309
10709I1801L713l172k409J28L508L255K590k579K635K548n57o831p329k97m24
10694H6580k91k001j854j761m209K530L423k625L960Q734J1811J2458J2008J3904
10680A42667J2275J2102J1152N456J0278P523N885K494J1392J2417Q702J9485
$$ plain form
10668 261828 290137 323695 367547 425916 507026 627975 816102 1109427 1550816 2131849
10658 2131849 2654802 2775945 2434589 1891233 1390017 1023541 785499 626302 513996
10649 513996 437554 381034 342611 310834 283988 259851 237770 227681 219801 218090 212954 204286
10637 204286 198232 189081 181910 173705 161550 153924 149458 139026 129133 126345 129072 132264 138186 149207
10623 149207 155774 168192 182826 192248 199324 203319 203391 203682 198955 194733 196539 197898 201467 207044
10609 207044 217352 223825 224995 227436 225389 222841 218981 217547 222094 236571 253849 273539 300778
10596 300778 342316 398599 484942 628595 847072 1137988 1483280 1872376 2207241 2356713
10586 2356713 2398857 2290758 2001464 1660262 1313142 1005245 768503 609269 507856 436732
$$ packed form
10668B61828K8309L3558M3852N8369Q1110J20949J88127K93325M41389N81033
10658B131849N22953J21143l41356n43356n01216l66476k38042j59197j12306
10649E13996p6442n6520l8423l1777k6846k4137k2081j0089p880j711n136q668
10637B04286o054r151p171q205j2155p626m466j0432r893k788K727L192N922J1021
10623A49207O567J2418J4634R422P076L995P2K91m727m222J806J359L569N577
10609B07044J0308O473J170K441k047k548l860j434M547J4477J7278J9690K7239
10596C00778M1538N6283Q6343J43653K18477K90916L45292L89096L34865J49472
10586B356713M2144j08099k89294l41202l47120l07897k36742j59234j01413p1124
$$ plain form
10576 436732 388553 351174 318636 294267 275943 261037 251246 247139 241869 237463 234239 241528 250649
10563 250649 260673 269437 271728 273450 273726 268153 269802 271972 274930 279524 282468 287052 298081 317257
10549 317257 340097 349881 339185 318467 280039 237621 211442 196818 179329 158386 143041 135024
10537 135024 128051 132054 142355 149786 156987 165612 171488 171677 172796 174062 166901 163926 159889 158154
10523 158154 158984 162031 161444 161384 166371 176192 181908 179610 177302 185379 193522 206969 218300 223015 230821
10508 230821 250310 271855 283927 290119 302727 320518 339262 347187 356124 369210 381494 386818
10496 386818 381878 371342 364787 369240 377305 389555 404993 423285 436258 434559 423960 403626
10484 403626 374218 334073 289864 256791 236712 220649 204167 187576 172121 157940 151341 156722
$$ packed form
10576D36732m8179l7379l2538k4369j8324j4906r791m107n270m406l224P289R121
10563B50649J0024Q764K291J722K76n573J649K170K958M594K944M584J1029J9176
10549C17257K2840R784j0696k0718l8428m2418k6179j4624j7489k0943j5345q017
10537A35024o973M003J0301P431P201Q625N876J89J119J266p161k975m037j735
10523A58154Q30L047n87o0M987R821N716k298k308Q077Q143J3447J1331M715P806
10508B30821J9489K1545J2072O192J2608J7791J8744P925Q937J3086J2284N324
10496C86818m940j0536o555M453Q065J2250J5438J8292J2973j699j0599k0334
10484D03626k9408m0145m4209l3073k0079j6063j6482j6591j5455j4181o599N381
$$ plain form
10472 156722 176575 201840 223751 237342 239678 233469 221654 214525 211352 211174 211886 213872 213792 215941
10458 215941 218643 222841 228016 239810 254268 266923 276979 286806 306048 325081 336694 344204
10446 344204 347398 348841 352627 360539 370812 382976 398092 407782 407561 413352 417347 414560 414481 416898
10432 416898 405892 388891 367711 343583 329101 330716 343234 364820 393914 427954 462251 474153
10420 474153 467606 453549 443561 433953 430331 442927 462252 483304 502697 520619 533811 535127
10408 535127 527517 514689 504650 499545 492637 491549 486990 487471 504917 535160 576454 635385 711475
10395 711475 794267 903156 1054229 1254908 1492714 1733744 1972914 2192362 2329929 2385066
10385 2385066 2385301 2284000 2101232 1892978 1669870 1445369 1260393 1127784 1039523 1002037
$$ packed form
10472A56722J9853K5265K1911J3591K336o209j1815p129l173j78P12J986q0K149
10458B15941K702M198N175J1794J4458J2655J0056R827J9242J9033J1613P510
10446C44204L194J443L786P912J0273J2164J5116R690k21N791L995k787p9K417
10432D16898j1006j7001k1180k4128j4482J615J2518K1586K9094L4040L4297J1902
10420D74153o547j4057r988r608l622J2596J9325K1052J9393J7922J3192J316
10408E35127p610j2828j0039n105o908j088m559M81J7446L0243M1294N8931P6090
10395G11475Q2792J08889J51073K00679K37806K41030K39170K19448J37567N5137
10385B385066K35j01301j82768k08254k23108k24501j84976j32609q8261l7486
$$ plain form
10375 1002037 1001599 1000187 993414 990999 959488 869851 739822 617953 549390 538864 568134 631268
10363 631268 709134 769649 818200 872439 916974 925067 901733 864094 832861 808109 790192 776061
10351 776061 761368 748402 738927 722162 703616 689070 683928 692245 717997 757983 814339 880057
10339 880057 940130 995176 1032646 1045875 1041116 1020689 984876 951332 937353 937798 950395 970858
10327 970858 989848 1015174 1036801 1051694 1071072 1100432 1131330 1168204 1207157 1240674 1294861
10316 1294861 1384532 1500730 1632635 1718121 1722073 1692106 1639730 1564882 1492354 1429462 1411788
10305 1411788 1476321 1572213 1687681 1824022 1966618 2095759 2188089 2268483 2322053 2349675
10295 2349675 2362880 2359231 2341331 2328784 2319097 2299731 2288803 2295012 2342683 2432654 2540753 2641672
$$ packed form
10375A002037m38j412o773k415l1511q9637j30029j21869o8563j0526K9270O3134
10363F31268P7866O0515M8551N4239M4535Q093k3334l7639l1233k4752j7917j4131
10351G76061j4693j2966r475j6765j8546j4546n142Q317K5752L9986N6356O5718
10339H80057O0073N5046L7470J3229m759k0427l5813l3544j3979M45J2597K0463
10327I70858J8990K5326K1627J4893J9378K9360L0898L6874L8953L3517N4187
10316A294861Q9671J16198J31905Q5486L952k9967n2376p4848p2528o2892j7674
10305A411788O4533R5892J15468J36341J42596J29141R2330Q0394N3570K7622
10295B349675J3205l649j7900j2547r687j9366j0928O209M7671Q9971J08099J00919
$$ plain form
10283 2641672 2734302 2822113 2922680 3037704 3162824 3290014 3433802 3588288 3735970 3876736
10273 3876736 4018067 4181933 4402759 4683156 5021740 5406998 5821518 6266063 6760932
10264 6760932 7330540 8002574 8819957 9846746 11117844 12620751 14192921 15531613 16591313
10255 16591313 17686597 19126522 21092186 23766405 27385706 32207547 38550543 46863190
10247 46863190 57941906 73359298 95908045 129979321 181709840 257108332 353475988
10240 353475988 441610891 470576458 425953279 341213695 253095004 182633582 133416198
10233 133416198 100377283 77862925 62066273 50770103 42582742 36522450 31882096
10226 31882096 28181566 25173365 22775997 20962851 19641184 18512955 17188842 15634796
$$ packed form
10283B641672R2630Q7811J00567J15024J25120J27190J43788J54486J47682J40766
10273C876736J41331J63866K20826K80397L38584L85258M14520M44545M94869
10264F760932N69608O72034Q17383J026789J271098J502907J572170J338692J059700
10255A6591313J095284J439925J965664K674219L619301M821841O342996Q312647
10247D6863190J1078716J5417392K2548747L4071276N1730519P5398492R6367656
10240C53475988Q8134903K8965567m4623179q4739584q8118691p0461422m9217384
10233A33416198l3038915k2514358j5796652j1296170q187361o060292m640354
10226C1882096l700530l008201k397368j813146j321667j128229j324113j554046
$$ plain form
10218 15634796 14116548 12824048 11782336 10934288 10227273 9654996 9221934 8936704 8795560
10209 8795560 8790663 8920696 9160495 9487701 9893430 10219685 10437685 10654985 10767344 10851554
10199 10851554 11040612 11362846 11899102 12726151 13884681 15462969 17605437 20455673 24228574
10190 24228574 29319553 36351324 46413392 61484473 84794916 120353084 169338257
10183 169338257 225383200 286533461 345498463 374976551 385129886 381452127 345652903
10176 345652903 293580587 237542559 182089852 134993588 99657578 75301540 58879775
10169 58879775 47554257 39471196 33464742 28859314 25226661 22269947 19810938 17736555
10161 17736555 15994150 14574496 13473597 12629368 12009879 11585046 11204900 10719611 10221483
$$ packed form
10218A5634796j518248j292500j041712q48048p07015n72277m33062k85230j41144
10209H795560m897J30033K39799L27206M05729L26255K18000K17300J12359Q4210
10199A0851554J89058L22234N36256Q27049J158530J578288K142468K850236L772901
10190B4228574N090979P031771J0062068J5071081K3310443L5558168M8985173
10183A69338257N6044943O1150261N8965002K9478088J0153335l677759l5799224
10176C45652903n2072316n6038028n5452707m7096264l5336010k4356038j6421765
10169E8879775j1325518q083061o006454m605428l632653k956714k459009k074383
10161A7736555j742405j419654j100899q44229o19489m24833l80146m85289m98128
$$ plain form
10152 10221483 9615266 8856333 8095196 7361132 6686816 6105107 5597321 5162867 4788921
10143 4788921 4448722 4148936 3894495 3670222 3472779 3311752 3176007 3061094 2954477
10134 2954477 2835604 2710448 2592269 2479724 2364678 2254573 2150904 2051302 1961621 1889435
10124 1889435 1842414 1818876 1812772 1801814 1776409 1761940 1755333 1747001 1758513 1774604 1766635 1742398
10112 1742398 1704636 1648276 1585365 1504697 1429778 1380582 1335005 1282687 1234794 1197989 1172905
10101 1172905 1152655 1134006 1116147 1087526 1058615 1028061 995521 972676 949620 929692 919842
10090 919842 912617 906690 908402 917573 917727 912083 893948 861745 832126 826921 845045 869840 892040
10077 892040 907858 919011 931314 939298 942068 936135 921735 901275 877977 856553 841970 837704
$$ packed form
10152A0221483o06217p58933p61137p34064o74316n81709n07786m34454l73946
10143D788921l40199k99786k54441k24273j97443j61027j35745j14913j06617
10134B954477j18873j25156j18179j12545j15046j10105j03669r9602q9681p2186
10124A889435m7021k3538o104j0958k5405j4469o607q332J1512J6091p969k4237
10112A742398l7762n6360o2911q0668p4919m9196m5577n2318m7893l6805k5084
10101A172905k0250j8649j7859k8621k8911l0554l2540k2845k3056j9928r850
10090I19842p225n927J712R171J54n644j8135l2203k9619n205J8124K4795K2200
10077H92040J5818J1153J2303P984K770n933j4400k0460k3298k1424j4583m266
$$ plain form
10065 837704 840011 845481 849466 852246 849114 843454 829752 820511 832339 857888 905270 961690 1020301
10052 1020301 1064691 1081897 1097047 1091666 1063149 1028139 996086 979471 998855 1018486 1035896
10041 1035896 1074851 1124160 1167072 1206789 1246888 1281889 1314523 1350874 1380064 1408671 1444355
10030 1444355 1491568 1554980 1634487 1715058 1791243 1868984 1948171 2024846 2106731 2190026 2276772
10019 2276772 2379695 2498769 2630265 2785174 2959043 3139435 3339303 3578773 3860091
10010 3860091 4200860 4624405 5142486 5741149 6403042 7138154 7891461 8625559 9405510
10001 9405510 10238468 11143975 12234634 13620225 15370959 17605952 20560690 24517016
9993 24517016 29860638 37362948 48223344 63844048 85268645 113086902 148326452
$$ packed form
10065H37704K307N470L985K780l132n660j3702r241J1828K5549M7382N6420N8611
10052A020301M4390J7206J5150n381k8517l5010l2053j6615J9384J9631J7410
10041A035896L8955M9309M2912L9717M0099L5001L2634L6351K9190K8607L5684
10030A444355M7213O3412P9507Q0571P6185P7741P9187P6675Q1885Q3295Q6746
10019B276772J02923J19074J31496J54909J73869J80392J99868K39470K81318
10010C860091L40769M23545N18081N98663O61893P35112P53307P34098P79951
10001I405510Q32958R05507J090659J385591J750734K234993K954738L956326
9993B4517016N343622P502310J0860396J5620704K1424597K7818257L5239550
$$ plain form
9986 148326452 188118403 226721785 264862741 298625483 316269609 322421623 320935075
9979 320935075 303956519 276689348 247070570 215954879 184917637 155192851 126356021
9972 126356021 99931365 77855527 61036880 48908421 40181857 33736877 28862639
9965 28862639 25095117 22147093 19820822 17968087 16479930 15273886 14250032 13320775
9957 13320775 12467135 11605878 10705652 9815315 8968212 8179768 7466553 6839550 6286948
9948 6286948 5800989 5377831 5006545 4668183 4364335 4094943 3851640 3626314 3416843 3219478
9938 3219478 3037737 2879828 2736006 2584504 2439920 2296970 2157393 2040774 1953011 1885852
9928 1885852 1822072 1757069 1691551 1624736 1571729 1524350 1472721 1433069 1397001 1357251 1321882
$$ packed form
9986A48326452L9791951L8603382L8140956L3762742J7644126O152014j486548
9979C20935075j6978556k7267171k9618778l1115691l1037242k9724786k8836830
9972A26356021k6424656k2075838j6818647j2128459q726564o444980m874238
9965B8862639l767522k948024k326271j852735j488157j206044j023854r29257
9957A3320775q53640q61257r00226q90337q47103p88444p13215o27003n52602
9948F286948m85959m23158l71286l38362l03848k69392k43303k25326k09471j97365
9938C219478j81741j57909j43822j51502j44584j42950j39577j16619q7763o7159
9928A885852o3780o5003o5518o6815n3007m7379n1629l9652l6068l9750l5369
$$ plain form
9917 1321882 1300793 1277189 1251166 1227893 1197951 1172438 1146396 1128854 1116569 1111533 1113025 1118178
9905 1118178 1126461 1134156 1145239 1156292 1151611 1118149 1056189 983935 913540 858581 810618 771697
9893 771697 749033 737218 728513 724336 724223 715602 705860 700624 699350 697762 690909 685925 686065 682284
9879 682284 674189 660499 640930 610264 568531 524440 483050 445504 415480 392275 382913 377795
9867 377795 374713 372427 366990 360775 355662 353509 347894 343650 353096 367178 384640 406783 425869
9854 425869 442752 450145 457951 459123 445221 429336 408043 383814 371318 357757 346034 336275
9842 336275 328862 327102 331266 347740 368884 388069 404659 425909 450193 467161 477094 477826 481789
9829 481789 481552 478286 477238 484471 494288 518052 554151 603351 680428 800299 995663 1309596
$$ packed form
9917A321882k1089k3604k6023k3273k9942k5513k6042j7542j2285n036J492N153
9905A118178Q283P695J1083J1053m681l3462o1960p2254p0395n4959m7963l8921
9893G71697k2664j1815q705m177j13q621r742n236j274j588o853m984J40l781
9879F82284q095j3690j9569l0666m1733m4091m1390l7546l0024k3205r362n118
9867C77795l082k286n437o215n113k153n615m244R446J4082J7462K2143J9086
9854D25869J6883P393P806J172j3902j5885k1293k4229j2496j3561j1723r759
9842C36275p413j760M164J6474K1144J9185J6590K1250K4284J6968R933P32L963
9829D81789k37l266j048P233R817K3764L6099M9200P7077J19871J95364L13933
$$ plain form
9817 1309596 1771016 2349278 2816364 2838339 2429526 1876884 1385747 1028161 794196 645733
9807 645733 542420 470244 419443 386435 357745 331898 313365 301640 299216 306419 317801 327893
9795 327893 337023 343293 349288 352466 345980 334982 318151 300367 283745 267464 257803 254518 245744
9782 245744 245266 248523 258421 274339 294601 317183 348531 391649 460194 569706 745543 1003407
9770 1003407 1321468 1682501 2069047 2312302 2401271 2380553 2158579 1827682 1484767 1166121
9760 1166121 909930 727654 611300 533416 483853 446467 410853 373520 336888 304812 274713
9749 274713 244855 228816 218292 211788 208914 207536 209243 210536 211269 213903 212284 215038 224083 232258
9735 232258 235198 238108 241206 242927 246255 246199 243053 240219 233584 232696 235958 233546 228564 229332 227175
$$ packed form
9817A309596M61420N78262M67086K1975m08813n52642m91137l57586k33965j48463
9807F45733j03313p2176n0801l3008k8690k5847j8533j1725k424P203J1382J0092
9795C27893R130O270N995L178o486j0998j6831j7784j6622j6281r661l285q774
9782B45744m78L257R898J5918K0262K2582L1348M3118O8545J09512J75837K57864
9770A003407L18061L61033L86546K43255Q8969k0718k21974l30897l42915l18646
9760A166121k56191j82276j16354p7884m9563l7386l5614l7333l6632l2076l0099
9749B74713k9858j6039j0524o504k874j378J707J293P33K634j619K754R045Q175
9735B32258K940K910L098J721L328n6l146k834o635q88L262k412m982P68k157
$$ plain form
9720 227175 222782 221295 221625 220797 214674 203203 195852 189634 185779 184887 179908 175476 173301 170307 172039
9705 172039 176809 181414 187234 189511 190929 190972 192463 191880 189173 186473 186348 186000 183027 181070 182516 187045
9689 187045 190529 191459 196191 196876 193209 189436 187208 180791 172447 159817 138190 118508 105319 86668
9675 86668 67961 48879 35495 26467 16943 9268 6693 2785 -1415 -730 -299 2244 10666 16974
9661 16974 25897 32988 42321 52016 55690 59978 65128 71500 76622 76637 81042 85719 85676 85518 82781 79121
9645 79121 81515 82605 82246 83428 89197 91389 94735 96144 95259 95160 94203 93160 93309 91222 89734 91836
9629 91836 93192 92812 97558 95458 94584 95109 90977 83516 76390 73320 69850 63888 62075 59714 58716 57876
9613 57876 58938 56777 55872 59554 62785 65946 67370 70647 69611 69447 72454 73318 75153 73016 77457
$$ packed form
9720B27175m393j487L30q28o123j1471p351o218l855q92m979m432k175k994J732
9705A72039M770M605N820K277J418M3J491n83k707k700j25l48k973j957J446M529
9689A87045L484R30M732O85l667l773k228o417q344j2630k1627j9682j3189j8651
9675H6668j8707j9082j3384r028r524p675k575l908m200O85M31K543Q422O308
9661A6974Q923P091R333R695L674M288N150O372N122J5M405M677m3j58k737l660
9645G9121K394J090l59J182N769K192L346J409q85r9r57j043J49k087j488K102
9629I1836J356l80M746k100q74N25m132p461p126l070l470n962j813k361r98q40
9613E7876J062k161r05L682L231L161J424L277j036j64L007Q64J835k137M441
$$ plain form
9598 77457 80912 81493 86003 92903 100429 107588 107104 107527 110658 118565 122710 125646 136899 150832 168313
9583 168313 186500 216738 261103 323723 415261 542223 709849 920093 1149760 1383135 1627361
9572 1627361 1824485 1932154 1989466 1977417 1869501 1695828 1488916 1263133 1047117 842168
9562 842168 660680 519528 417336 349582 299055 266284 248520 240322 236210 239130 244665 248531
9550 248531 243491 230470 213142 191991 168297 147008 132778 122972 115273 109043 106333 114796 121070
9537 121070 122793 125879 123282 125702 125613 123028 122322 119891 113687 110453 109727 104467 98700 96359 96901 95251
9521 95251 96619 96433 99964 108531 118980 137548 161418 192422 230663 264436 287017 295336 287230
9508 287230 268468 244516 221182 197863 178314 163265 150019 134307 118425 104547 93865 84325
$$ packed form
9598G7457L455N81M510O900P526P159m84M23L131P907M145K936J1253J3933J7481
9583A68313J8187L0238M4365O2620R1538J26962J67626K10244K29667K33375K44226
9572A627361J97124J07669N7312j2049j07916j73673k06912k25783k16016k04949
9562H42168j81488j41152j02192o7754n0527l2771j7764q198m112K920N535L866
9550B48531n040j3021j7328k1151k3694k1289j4230r806p699o230k710Q463O274
9537A21070J723L086k597K420q9k585p06k431o204l234p26n260n767k341N42j650
9521I5251J368j86L531Q567J0449J8568K3870L1004L8241L3773K2581Q319q106
9508B87230j8762k3952k3334k3319j9549j5049j3246j5712j5882j3878j0682r540
$$ plain form
9496 84325 76332 69252 66036 69755 69645 68347 69495 68929 65295 63502 63457 65909 70582 73914 74953 75080
9480 75080 72925 73454 71851 68906 70395 68468 68628 72292 72149 69704 67549 67338 71515 68426 63253 62610
9464 62610 64558 62388 63974 69008 69710 67936 64722 61523 62106 56635 56613 57283 58652 63474 64520 62418
9448 62418 60564 62097 64283 69908 75081 73970 71630 72548 72805 66163 63797 65009 68092 66822 65110
9433 65110 68044 71346 70594 65779 61942 59068 57417 60375 61408 61073 62908 60929 57519 55973 54168
9418 54168 54832 56816 56164 60166 67120 71763 72662 75756 78358 82866 83946 86734 91335 91700 91084 88698
9402 88698 88090 85893 85355 88159 88380 83785 80912 76877 78409 75575 73748 78053 81801 82304 82972 84038
9386 84038 85471 86483 84413 85534 84446 85029 84002 80867 77325 78612 81728 81971 81339 77973 76342
$$ packed form
9496H4325p993p080l216L719j10j298J148n66l634j793m5K452M673L332J039J27
9480G5080k155N29j603k945J489j927J60L664j43k445k155k11M177l089n173o43
9464F2610J948k170J586N034P02j774l214l199N83n471k2O70J369M822J046k102
9448F2418j854J533K186N625N173j111k340R18K57o642k366J212L083j270j712
9433F5110K934L302p52m815l837k874j651K958J033l35J835j979l410j546j805
9418E4168O64J984o52M002O954M643Q99L094K602M508J080K788M601L65o16k386
9402H8698o08k197n38K804K21m595k873m035J532k834j827M305L748N03O68J066
9386H4038J433J012k070J121j088N83j027l135l542J287L116K43o32l366j631
$$ plain form
9371 76342 74803 70546 71388 71513 70516 72633 78274 77610 71423 68555 71234 70576 71574 74340 75578 75941
9355 75941 73699 71294 71954 70723 70086 69668 71263 71344 73098 72027 74961 74990 73363 75066 74627 77766 72780
9338 72780 71201 69693 66049 66301 67222 69842 69779 66207 66351 67992 65544 63518 64590 63221 64973 66894
9322 66894 67411 70131 74911 75482 74434 73847 70780 67433 66070 67097 70133 68292 70128 71206 69606
9307 69606 69325 68322 68347 70333 72971 69414 65403 65583 61968 58995 57992 61896 66813 62847 60770 56595
9291 56595 55725 57913 61588 63712 62798 61208 62999 63737 61790 62301 61436 60879 63260 63550 61851 60794
9275 60794 63818 68213 68453 65827 65757 59974 58567 57710 60589 63567 61540 56773 57019 58214 58249 57374 54598
9258 54598 56485 56500 53674 58686 60783 61718 67963 72649 71420 70345 71272 74652 74473 72381 75912 76779
$$ packed form
9371G6342j539m257Q42J25r97K117N641o64o187k868K679o58R98K766J238L63
9355G5941k242k405O60j231o37m18J595Q1J754j071K934K9j627J703m39L139m986
9338G2780j579j508l644K52R21K620o3l572J44J641k448k026J072j369J752J921
9322F6894N17K720M780N71j048n87l067l347j363J027L036j841J836J078j600
9307F9606k81j003K5J986K638l557m011J80l615k973j003L904M917l966k077m175
9291E6595q70K188L675K124r14j590J791P38j947N11q65n57K381K90j699j057
9275F0794L024M395K40k626p0n783j407q57K879K978k027m767K46J195L5q75k776
9258E4598J887J5k826N012K097R35O245M686j229j075R27L380j79k092L531Q67
$$ plain form
9242 76779 74098 77123 72723 70050 68617 63254 58201 59514 64682 66623 68349 67182 61424 59639 63806
9227 63806 64440 65362 64567 65254 67841 68005 66225 67269 69541 67919 68721 68477 73112 71007 65445 66774
9211 66774 72937 78795 80939 78405 73537 76085 79888 77880 76077 77100 78063 81561 83605 82390 83461
9196 83461 86357 87302 87141 88342 90162 89539 88482 86306 86505 87560 84996 83158 81881 84991 84439 82509
9180 82509 82292 84686 83814 84152 87348 91016 93007 95054 99626 97891 91878 90377 91284 94068 92848 87845
9164 87845 88480 90784 91647 89411 90596 92040 91472 91528 92719 91612 90026 91341 94759 95046 92320 92932
9148 92932 97418 98269 96900 97328 98778 99138 99884 98367 97934 100638 101478 101776 103810 99402 94766 94288 97376
9131 97376 98113 102598 103535 102022 99386 93231 92989 94591 98031 105887 106695 104055 100287 95417 94425 98187
$$ packed form
9242G6779k681L025m400k673j433n363n053J313N168J941J726j167n758j785M167
9227F3806O34R22p95O87K587J64j780J044K272j622Q02k44M635k105n562J329
9211F6774O163N858K144k534m868K548L803k008j803J023R63L498K044j215J071
9196H3461K896R45j61J201J820o23j057k176J99J055k564j838j277L110n52j930
9180H2509k17K394q72L38L196L668J991K047M572j735o013j501R07K784j220n003
9164H7845O35K304Q63k236J185J444n68N6J191j107j586J315L418K87k726O12
9148I2932M486Q51j369M28J450L60P46j517m33K704Q40K98K034m408m636m78L088
9131I7376P37M485R37j513k636o155k42J602L440P856Q08k640l768m870r92L762
$$ plain form
9115 98187 101341 103698 107151 103477 103012 102186 97717 96451 96134 100132 98765 98220 96065 96132 96330 91675
9099 91675 91931 91346 89418 91222 91690 95996 95752 92653 89448 87139 87586 87860 87559 88777 86501 84193
9083 84193 90120 94169 95098 94106 94471 89376 83678 85542 92013 89088 89536 91697 92994 95139 99043 99480
9067 99480 99372 98850 94547 94734 96408 98669 97507 99431 98962 97185 97444 98003 97880 98499 97974 94238 96204
9050 96204 101240 99103 99482 96876 96429 96235 98439 96861 96028 95893 97658 100638 100386 99774 105560 107532
9034 107532 106038 103248 103982 102559 101946 99474 97897 99422 103127 104714 108219 113511 111862 112499 112427 110568
9018 110568 109945 109139 110173 114022 116458 112714 108466 107613 107580 111179 114663 115184 113726 113101 112897 116315
9002 116315 118165 117988 118466 123647 126001 125222 126607 125103 125849 129102 127934 129040 128505 126508 128339 130001
$$ packed form
9115I8187L154K357L453l674m65q26m469j266l17L998j367n45k155O7J98m655
9099I1675K56n85j928J804M68M306k44l099l205k309M47K74l01J218k276k308
9083H4193N927M049R29r92L65n095n698J864O471k925M48K161J297K145L904M37
9067I9480j08n22m303J87J674K261j162J924m69j777K59N59j23O19n25l736J966
9050I6204N036k137L79k606m47j94K204j578q33j35J765K980k52o12N786J972
9034A07532j494k790P34j423o13k472j577J525L705J587L505N292j649O37p2j859
9018A10568o23q06J034L849K436l744m248q53l3L599L484N21j458o25k04L418
9002A16315J850j77M78N181K354p79J385j504P46L253j168J106n35j997J831J662
$$ plain form
8986 130001 128258 125221 126374 127308 126200 127860 131797 130508 128567 134010 134488 135255 135820 131660 131886 136535
8970 136535 139636 140746 140002 142340 139628 136862 136210 137728 139235 142588 145242 147927 146761 145127 144139
8955 144139 139386 140901 142549 145587 147293 149840 152406 152999 154578 157743 161009 158620 158767 159498 159650
8940 159650 159152 162470 161244 156860 158341 161504 162289 161484 162383 165602 165877 169327 176126 179193 175997 171186
8924 171186 168480 165656 168485 175714 176115 175910 178696 182198 186626 189350 191420 192352 192773 190443 192883
8909 192883 195247 202108 200228 196097 196963 198529 197671 198939 200314 198406 197102 198896 200708 200429 204604
8894 204604 206689 208002 208410 212844 215850 219147 223507 225484 225647 229197 230322 231851 230958 232052 228181
8879 228181 226118 228290 231689 232505 230812 228003 227691 231562 240529 236340 232555 231049 232323 233302 235511
$$ packed form
8986A30001j743l037J153R34j108J660L937j289j941N443M78P67N65m160K26M649
8970A36535L101J110p44K338k712k766o52J518J507L353K654K685j166j634r88
8955A44139m753J515J648L038J706K547K566N93J579L165L266k389J47P31J52
8940A59650m98L318j226m384J481L163P85q05Q99L219K75L450O799L067l196m811
8924A71186k706k824K829P229M01k05K786L502M428K724K070R32M21k330K440
8909A92883K364O861j880m131Q66J566q58J268J375j908j304J794J812k79M175
8894B04604K085J313M08M434L006L297M360J977J63L550J125J529q93J094l871
8879B28181k063K172L399Q16j693k809l12L871Q967m189l785j506J274R79K209
$$ plain form
8864 235511 239390 241364 242664 246811 251707 253542 252276 251317 254024 256203 259872 262152 257918 260924 264480
8849 264480 265406 268569 274049 276311 276264 281078 283162 280428 282044 285096 285433 287802 291438 295861 301346
8834 301346 304384 301485 300688 304989 310447 312955 313736 318855 323390 321244 319714 323352 329682 335549 339254
8819 339254 340458 340761 339342 338439 342873 345951 348232 348967 348005 352573 356818 357347 358837 359795 365026 372320
8803 372320 373699 376203 373711 373888 379720 386192 390642 391676 391436 391869 395930 402413 407434 410247 417363
8788 417363 416840 415677 416161 418597 423871 430674 436832 439772 434978 439216 447678 455406 460245 464231 466784
8773 466784 472826 480481 483910 485059 483690 488592 491368 499652 507678 512055 523196 530967 534700 536995
8759 536995 540602 547432 555569 563393 567085 573088 580125 585912 588086 596787 604995 611120 613265 617312
$$ packed form
8864B35511L879J974J300M147M896J835j266r59K707K179L669K280m234L006L556
8849B64480R26L163N480K262m7M814K084k734J616L052L37K369L636M423N485
8834C01346L038k899p97M301N458K508P81N119M535k146j530L638O330N867L705
8819C39254J204L03j419r03M434L078K281P35r62M568M245N29J490R58N231P294
8803C72320J379K504k492J77N832O472M450J034k40M33M061O483N021K813P116
8788D17363n23j163M84K436N274O803O158K940m794M238Q462P728M839L986K553
8773D66784O042P655L429J149j369M902K776Q284Q026M377J1141P771L733K295
8759E36995L607O830Q137P824L692O003P037N787K174Q701Q208O125K145M047
$$ plain form
8745 617312 627958 636010 643820 652246 661152 668883 675421 681390 687972 696025 707162 715444 725352 738283
8731 738283 746890 755664 767937 778019 788755 794876 801943 808711 819794 831106 842296 857491 868658
8718 868658 876874 888961 906501 920232 929774 939322 949707 965226 980397 992531 1004519 1021967
8706 1021967 1039486 1054790 1073360 1089865 1109725 1126497 1142869 1160395 1179501 1195046 1214306
8695 1214306 1230746 1243392 1263790 1286220 1307891 1326804 1341488 1361611 1385638 1409238 1437600
8684 1437600 1465050 1494207 1524993 1551817 1581609 1614246 1646217 1675452 1708456 1740379 1772189
8673 1772189 1808947 1845855 1876977 1912663 1950170 1985418 2020454 2060391 2106847 2149378 2194691
8662 2194691 2240365 2285572 2330980 2381345 2433717 2486233 2545714 2605809 2668862 2732502 2797012
$$ packed form
8745F17312J0646Q052P810Q426Q906P731O538N969O582Q053J1137Q282R908J2931
8731G38283Q607Q774J2273J0082J0736O121P067O768J1083J1312J1190J5195J1167
8718H68658Q216J2087J7540J3731R542R548J0385J5519J5171J2134J1988J7448
8706A021967J7519J5304J8570J6505J9860J6772J6372J7526J9106J5545J9260
8695A214306J6440J2646K0398K2430K1671J8913J4684K0123K4027K3600K8362
8684A437600K7450K9157L0786K6824K9792L2637L1971K9235L3004L1923L1810
8673A772189L6758L6908L1122L5686L7507L5248L5036L9937M6456M2531M5313
8662B194691M5674M5207M5408N0365N2372N2516N9481O0095O3053O3640O4510
$$ plain form
8651 2797012 2866887 2935482 3004466 3074036 3151867 3233405 3313389 3395795 3481971 3574072 3666903
8640 3666903 3763500 3859940 3961983 4072393 4182798 4294007 4407743 4533695 4664108 4792119
8630 4792119 4929566 5075099 5223054 5377236 5541175 5711485 5886250 6065516 6249849 6444323
8620 6444323 6644481 6850451 7066977 7294037 7524313 7759843 8003849 8257660 8520861 8786285
8610 8786285 9062636 9348599 9640887 9936795 10240929 10550543 10863877 11179437 11497086 11817664
8600 11817664 12144243 12466171 12785059 13097062 13403717 13700698 13987760 14269434 14535161
8591 14535161 14779467 15009197 15214607 15399741 15552982 15680295 15781018 15852772 15890492 15900668
8581 15900668 15885852 15839122 15762095 15658774 15528374 15373650 15197084 14992837 14761677 14510159
$$ packed form
8651B797012O9875O8595O8984O9570P7831Q1538P9984Q2406Q6176R2101R2831
8640C666903R6597R6440J02043J10410J10405J11209J13736J25952J30413J28011
8630D792119J37447J45533J47955J54182J63939J70310J74765J79266J84333J94474
8620F444323K00158K05970K16526K27060K30276K35530K44006K53811K63201K65424
8610H786285K76351K85963K92288K95908L04134L09614L13334L15560L17649L20578
8600A1817664L26579L21928L18888L12003L06655K96981K87062K81674K65727
8591A4535161K44306K29730K05410J85134J53241J27313J00723P1754L7720J0176
8581A5900668j4816m6730p7027j03321j30400j54724j76566k04247k31160k51518
$$ plain form
8571 14510159 14243644 13965149 13678135 13382273 13070861 12757420 12440546 12122288 11810927
8562 11810927 11492566 11173398 10859645 10553028 10250577 9951793 9657569 9372482 9095162
8553 9095162 8820461 8555072 8297209 8047077 7805334 7569737 7343019 7122075 6906572 6699925
8543 6699925 6500727 6302213 6108981 5926955 5754580 5590433 5426979 5271801 5127430 4987642
8533 4987642 4854940 4721637 4585427 4457732 4336444 4219269 4106214 3992571 3882945 3780666
8523 3780666 3680462 3581186 3491755 3404469 3316620 3232658 3149800 3069350 2995250 2926708 2859539
8512 2859539 2790493 2722320 2654207 2596187 2540881 2483586 2423974 2369624 2323611 2275602 2223755
8501 2223755 2176088 2136576 2098444 2050799 1999357 1954305 1917807 1886180 1853918 1820107 1789797
$$ packed form
8571A4510159k66515k78495k87014k95862l11412l13441l16874l18258l11361
8562A1810927l18361l19168l13753l06617l02451k98784k94224k85087k77320
8553I095162k74701k65389k57863k50132k41743k35597k26718k20944k15503k06647
8543F699925j99198j98514j93232j82026j72375j64147j63454j55178j44371j39788
8533D987642j32702j33303j36210j27695j21288j17175j13055j13643j09626j02279
8523C780666j00204r9276q9431q7286q7849q3962q2858q0450p4100o8542o7169
8512B859539o9046o8173o8113n8020n5306n7295n9612n4350m6013m8009n1847
8501B223755m7667l9512l8132m7645n1442m5052l6498l1627l2262l3811l0310
$$ plain form
8490 1789797 1762052 1732791 1700050 1664538 1631923 1603701 1577281 1545908 1518656 1507059 1499884 1481549
8478 1481549 1446875 1413035 1384779 1360358 1337594 1316808 1297514 1277701 1254206 1230975 1205005
8467 1205005 1178649 1156968 1140611 1121894 1106867 1093547 1078198 1061147 1045826 1030224 1020216
8456 1020216 1008270 992955 973225 952019 936377 923119 908784 897742 888714 878592 872171 865442
8444 865442 855072 842281 829825 821416 812671 802838 793122 785471 783201 775477 766844 765068 770876 778844
8430 778844 778125 770996 765949 758125 737912 713567 694851 680405 672162 664020 654633 645739 642600 641590
8416 641590 637891 633505 632245 628176 622925 615969 607118 597662 588416 580585 568063 561045 557706 554212
8402 554212 548910 541340 529281 520698 516189 509358 502341 495282 487833 485003 482775 480681 474790 470405
$$ packed form
8490A789797k7745k9261l2741l5512l2615k8222k6420l1373k7252j1597p175j8335
8478A481549l4674l3840k8256k4421k2764k0786j9294j9813k3495k3231k5970
8467A205005k6356k1681j6357j8717j5027j3320j5349j7051j5321j5602j0008
8456A020216j1946j5315j9730k1206j5642j3258j4335j1042r028j0122o421o729
8444H65442j0370j2791j2456q409q745r833r716p651k270p724q633j776N808P968
8430G78844p19p129n047p824k0213k4345j8716j4446q243q142r387q894l139j010
8416F41590l699m386j260m069n251o956q851r456r246p831j2522p018l339l494
8402E54212n302p570j2059q583m509o831p017p059p449k830k228k094n891m385
$$ plain form
8388 470405 471255 473572 474993 474183 470588 463642 460182 457091 450384 442141 435949 430650 427426 420372 415529
8373 415529 415368 415060 410042 407456 409719 404661 394050 392071 389499 382322 375474 370783 363226 355948 353693
8358 353693 353773 351725 354260 357459 357061 359445 359963 357801 355356 348002 343707 338306 331181 328464 326763
8343 326763 326106 326699 325664 328742 324125 324586 329698 330331 327620 325174 323420 316748 310005 302519 295177
8328 295177 288573 285314 279328 274404 276761 278320 277473 273175 269444 265127 263075 259040 248914 245107
8314 245107 244407 241755 242016 243802 245340 246581 248460 244112 244225 243727 241913 240059 236467 235308 234876 233201
8298 233201 228797 221974 221084 225118 220104 209598 205415 202915 202778 205121 205246 210684 212279 209011 205251
8283 205251 203989 199393 197240 195984 192349 189533 190626 191321 189380 186262 189517 187226 182707 178597 175990
$$ packed form
8388D70405Q50K317J421q10l595o946l460l091o707q243o192n299l224p054m843
8373D15529j61l08n018k586K263n058j0611j979k572p177o848m691p557p278k255
8358C53693Q0k048K535L199l98K384N18k162k445p354m295n401p125k717j701
8343C26763o57N93j035L078m617M61N112O33k711k446j754o672o743p486p342
8328B95177o604l259n986m924K357J559q47m298l731m317k052m035j0126l807
8314B45107p00k652K61J786J538J241J879m348J13m98j814j854l592j159m32j675
8298B33201m404o823q90M034n014j0506m183k500j37K343J25N438J595l268l760
8283B05251j262m596k153j256l635k816J093O95j941l118L255k291m519m110k607
$$ plain form
8268 175990 178761 177488 174767 172615 174296 171675 168911 169766 171073 169064 167798 161456 154222 151320 155222
8253 155222 154752 154525 157356 157219 159236 159565 159555 159329 160442 164394 168882 165568 160235 157497 154871 153242
8237 153242 148902 146271 147329 150544 154952 158073 159794 156588 154024 149352 139500 136875 137403 135395 134344
8222 134344 128375 121720 118961 121491 127654 131016 129323 133535 137054 138920 143018 154469 171562 193666
8208 193666 207667 210760 197816 180229 162849 152574 143667 141923 144323 146478 145778 142207 141425 140954
8194 140954 140054 136525 132527 132300 128216 120914 120538 119269 114904 112513 115053 117844 117558 118397 116991 115043
8178 115043 112844 106751 106503 106883 109270 110212 110018 116208 121414 126650 133823 140036 153406 181269 218331
8163 218331 259689 273292 249235 209243 169257 141948 124397 114203 111594 111457 105012 102192 104597
$$ packed form
8268A75990K771j273k721k152J681k621k764Q55J307k009j266o342p234k902L902
8253A55222m70k27K831j37K017L29j0k26J113L952M488l314n333k738k626j629
8237A53242m340k631J058L215M408L121J721l206k564m672r852k625N28k008j051
8222A34344n969o655k759K530O163L362j693M212L519J866M098J1451J7093K2104
8208A93666J4001L093j2944j7587j7380j0275q907j744K400K155p00l571p82m71
8194A40954r00l529l998k27m084p302l76j269m365k391K540K791k86Q39j406j948
8178A15043k199o093k48L80K387R42j94O190N206N236P173O213J3370K7863L7062
8163B18331M1358J3603k4057l9992l9986k7309j7551j0194k609j37o445k820K405
$$ plain form
8150 104597 106560 108008 106061 102689 103155 102713 98469 97116 95116 93421 95959 98298 98517 100105 106165
8135 106165 116808 121668 121727 120257 112268 103191 100456 98500 99650 100798 99396 97969 97660 100458 103021
8120 103021 110821 125954 142646 157161 154105 137510 120413 106635 95224 84253 77045 73777
8108 73777 74000 73648 71571 70551 72186 68800 73195 81370 84458 85200 83861 87002 94046 100510 107702
8093 107702 117744 124389 120466 109910 100111 90453 86122 80976 78359 76701 74376 78416 83870 84688
8079 84688 81450 77489 73269 69404 73147 76417 72449 71523 72000 67036 66324 66066 65172 64094 61205 60526
8063 60526 62055 61358 59781 56320 55787 57305 56929 59280 60517 63749 67678 64236 63830 66466 65224 67159
8047 67159 68654 67035 65279 62608 61246 59074 57929 56438 55535 54909 53314 47834 51584 55130 50150
$$ packed form
8150A04597J963J448j947l372M66m42m244j353k000j695K538K339K19J588O060
8135A06165J0643M860N9j470p989r077k735j956J150J148j402j427l09K798K563
8120A03021P800J5133J6692J4515l056j6595j7097j3778j1411j0971p208l268
8108G3777K23l52k077j020J635l386M395Q175L088P42j339L141P044O464P192
8093A07702J0042O645l923j0556r799r658m331n146k617j658k325M040N454Q18
8079H4688l238l961m220l865L743L270l968r26M77m964p12k58q94j078k889o79
8063F0526J529o97j577l461n33J518l76K351J237L232L929l442m06K636j242J935
8047F7159J495j619j756k671j362k172j145j491r03o26j595n480L750L546m980
$$ plain form
8032 50150 48415 50122 50172 48372 48679 50487 51678 52337 52607 52049 52029 54998 57929 53568 52778 53322 55467
8015 55467 56458 55540 51790 48808 50374 53234 49777 47729 48520 53232 59702 59363 56602 54888 51379 51776
7999 51776 50816 50632 47379 46411 46825 47311 47318 49328 46683 45064 47079 47301 46439 43719 41283 46468 48394
7982 48394 50528 49104 44667 44988 44901 44608 47078 49186 47920 48445 50417 48919 46714 48942 48563 43666
7966 43666 41915 41055 44211 42690 44615 48288 48874 51082 50022 44871 45725 47711 48172 47432 46025 44078
7950 44078 42993 42729 45876 46125 47184 45927 44915 42520 37423 38182 39980 36904 38865 41958 44059
7935 44059 38226 36268 35880 38785 38217 34670 34226 33888 41418 45185 44843 43188 45049 42805 40557 42852
7919 42852 40278 34593 29850 31443 31753 31672 28319 26808 26472 31164 37238 34853 34278 36367 38220 36966
$$ packed form
8032E0150j735J707N0j800L07J808J191O59K70n58k0K969K931m361p90N44K145
8015E5467R91r18l750k982J566K860l457k048P91M712O470l39k761j714l509L97
7999E1776r60j84l253r68M14M86PK010k645j619K015K22q62k720k436N185J926
7982D8394K134j424m437L21q7k93K470K108j266N25J972j498k205K228l79m897
7966D3666j751q60L156j521J925L673N86K208j060n151Q54J986M61p40j407j947
7950D4078j085k64L147K49J059j257j012k395n097P59J798l076J961L093K101
7935D4059n833j958l88K905n68l547m44l38P530L767l42j655J861k244k248K295
7919D2852k574n685m743J593L10q1l353j511l36M692O074k385n75K089J853j254
$$ plain form
7903 36966 35559 33993 35565 38525 38435 36121 34114 31929 30275 31643 32320 32659 32921 29117 28415 29646
7887 29646 30364 31769 32859 36192 37757 38350 40583 40122 38976 37572 35988 31355 29758 34987 39501
7872 39501 38770 38051 37534 39039 37764 38151 35774 34277 35344 36775 35127 29183 32669 40374 42096 38922
7856 38922 44459 45517 44715 49708 52757 54073 53422 49308 43760 43839 47450 50128 49876 49331 49880 50494 45120
7839 45120 40359 40513 41523 40210 40947 44621 46471 47777 43067 42861 44947 45491 44197 43696 42835 42071
7823 42071 42948 42567 38831 34189 32778 36588 38544 37107 38066 39126 44310 45080 47163 46535 45242 46945
7807 46945 45426 44016 42032 41333 38514 39428 43396 49440 49937 45188 41149 38728 38594 37189 34847 33444
7791 33444 33658 31017 31006 32644 32530 31444 34739 36948 35950 38103 35535 34319 37518 36402 39107 40276
$$ packed form
7903C6966j407j566J572K960r0k314k007k185j654J368O77L39K62l804p02J231
7887B9646P18J405J090L333J565N93K233m61j146j404j584m633j597N229M514
7872C9501p31p19n17J505j275L87k377j497J067J431j648n944L486P705J722l174
7856C8922N537J058q02M993L049J316o51m114n548P9L611K678k52n45N49O14n374
7839D5120m761J54J010j313P37L674J850J306m710k06K086N44j294n01q61p64
7823D2071Q77l81l736m642j411L810J956j437R59J060N184P70K083o28j293J703
7807D6945j519j410j984o99k819R14L968O044M97m749m039k421j34j405k342j403
7791C3444K14k641j1J638j14j086L295K209r98K153k568j216L199j116K705J169
$$ plain form
7775 40276 40975 38830 38241 35777 33113 34978 39697 42415 40811 39991 38136 39564 40027 38610 37488 39879
7759 39879 38949 35909 33992 30526 28599 28414 30260 29560 29085 30259 27974 25718 27444 28577 27696 24399
7743 24399 25481 27411 30773 28195 27478 27768 27752 29589 30846 34318 39574 36313 33050 30802 28447 25201
7727 25201 28101 27869 26936 29851 28716 26294 25532 23091 24976 28401 29667 31581 32998 35806 37444
7712 37444 34858 30821 31982 33427 32989 30382 34207 34064 32272 29953 26218 26247 27521 27551 27392 26951 27206
7695 27206 27311 26642 26245 24169 20101 17243 21144 22835 24503 24950 24580 22960 22223 21318 16286 16673 16497
7678 16497 17235 12721 13624 18127 19971 20600 23019 24491 21983 22050 20546 17477 14659 14566 16937 17975
7662 17975 16754 16373 20303 18776 17289 15626 15005 15304 14649 18440 22982 24860 23336 22029 23242 24662
$$ packed form
7775D0276O99k145n89k464k664J865M719K718j604q20j855J428M63j417j122K391
7759C9879r30l040j917l466j927j85J846p00m75J174k285k256J726J133q81l297
7743B4399J082J930L362k578p17K90j6J837J257L472N256l261l263k248k355l246
7727B5201K900k32r33K915j135k422p62k441J885L425J266J914J417K808J638
7712C7444k586m037J161J445m38k607L825j43j792k319l735K9J274L0j59m41K55
7695B7206J05o69l97k076m068k858L901J691J668M47l70j620p37r05n032L87j76
7678A6497P38m514R03M503J844O29K419J472k508O7j504l069k818r3K371J038
7662A7975j221l81L930j527j487j663o21K99o55L791M542J878j524j307J213J420
$$ plain form
7646 24662 25392 24298 21260 18578 14913 12422 11853 10298 15615 17492 17020 15767 17143 16437 14614 15971
7630 15971 15274 16896 14696 13885 14903 18049 22515 21466 14823 15251 14562 12266 13133 13701 13478 14029 12872
7613 12872 13669 13436 19251 20105 15073 11881 13138 16029 18852 15798 14338 13641 11549 11454 8374 8804
7597 8804 12217 13006 9061 7957 8093 10803 15766 16534 16950 13122 13144 13160 13699 9333 5929 3398 4446
7580 4446 7934 10698 12529 12194 10350 9530 7141 5199 5975 7789 9870 13734 17017 15569 15158 15413
7564 15413 15892 15883 12761 11039 7075 3863 7423 9254 4639 2985 8048 12664 13151 10290 15829 16143
7548 16143 14966 13310 10321 8521 7767 10215 12475 12521 14307 14944 11796 10771 10311 14996 17850 18930
7532 18930 19218 18862 19329 19694 15429 13268 13131 14786 16753 16516 19231 18423 18779 17697 19257 22749 23475
$$ packed form
7646B4662P30j094l038k682l665k491n69j555N317J877m72j253J376p06j823J357
7630A5971o97J622k200q11J018L146M466j049o643M28o89k296Q67N68k23N51j157
7613A2872P97k33N815Q54n032l192J257K891K823l054j460o97k092r5l080M30
7597H804L413P89l945j104J36K710M963P68M16l828K2J6N39m366l404k531J048
7580D446L488K764J831l35j844q20k389j942P76J814K081L864L283j448m11K55
7564A5413M79rl122j722l964l212L560J831m615j654N063M616M87k861N539L14
7548A6143j177j656k989j800p54K448K260M6J786O37l148j025m60M685K854J080
7532A8930K88l56M67L65m265k161j37J655J967k37K715q08L56j082J560L492P26
$$ plain form
7515 23475 25268 23061 20382 20761 18311 14472 14442 13048 12688 10969 8902 8590 8859 13059 14455 13366
7499 13366 14970 13010 11718 11193 11694 15853 17331 16382 12952 9584 10945 11687 12912 11607 9280 5195
7483 5195 6512 9548 10797 12995 11159 11797 11731 12953 11099 11897 13405 10890 7111 8692 10088 10261
7467 10261 13909 13643 8495 7387 5269 8490 8466 7392 7137 7288 7482 9001 9747 10426 3231 3847 6266
7450 6266 8137 7514 9443 14539 14312 12340 9100 8325 8588 9621 9787 12793 15789 12988 7828 9775
7434 9775 10129 4501 6836 8932 10819 14250 13882 13883 11525 8560 8573 11470 15578 13469 10184 9720 10633
7417 10633 6764 8504 6029 3350 4025 6217 7199 8543 9801 9852 10770 10629 10619 8695 6615 1489 -2205
7400 -2205 4061 6850 9155 12600 14289 14421 15274 17207 19801 16423 12719 9409 4954 2892 2935 4712
$$ packed form
7515B3475J793k207k679L79k450l839l0j394l60j719k067l12K69M200J396j089
7499A3366J604j960j292n25N01M159J478r49l430l368J361P42J225j305k327m085
7483E195J317L036J249K198j836O38o6J222j854P98J508k515l779J581J396J73
7467A0261L648k66n148j108k118L221k4j074k55J51J94J519P46O79p195O16K419
7450F266J871o23J929N096k27j972l240p75K63J033J66L006K996k801n160J947
7434I775L54n628K335K096J887L431l68Jk358k965J3K897M108k109l285m64R13
7417A0633l869J740k475k679O75K192R82J344J258N1R18j41j0j924k080n126l694
7400b205O266K789K305L445J689J32Q53J933K594l378l704l310m455k062M3J777
$$ plain form
7384 4712 6500 7348 4618 5142 5896 4969 7815 10479 8878 7000 4932 6008 9942 7824 9925 11570
7368 11570 11493 10711 14847 14681 13814 16908 18631 11887 5739 6154 5948 7266 4994 7430 5304 5804 6208
7351 6208 4356 3905 4780 9527 10203 11711 13012 9837 8450 9132 10802 10249 7575 9439 7693 4432
7335 4432 3468 5813 9791 12984 15696 14760 8559 5625 3801 4932 6350 7153 7936 5926 7000 7270
7319 7270 4856 4318 6697 8439 5443 7071 6378 1741 -317 -1279 1623 5543 7233 7314 12104 12974
7303 12974 14658 12255 10859 7025 6774 10905 12804 10426 7309 3994 5185 5730 4829 5468 6377 5494
7287 5494 5329 2808 3541 8242 7508 5885 7602 11421 13386 10376 7292 2350 3596 -414 -1165 1109
7271 1109 6964 10607 9261 6010 5472 6025 7663 8252 5793 3560 3868 3635 8208 9785 4881 1891
$$ packed form
7384D712J788Q48k730N24P54r27K846K664j601j878k068J076L934k118K101J645
7368A1570p7p82M136j66q67L094J723o744o148M15k06J318k272K436k126N00M04
7351F208j852m51Q75M747O76J508J301l175j387O82J670n53k674J864j746l261
7335D432r64K345L978L193K712r36o201k934j824J131J418Q03P83k010J074K70
7319G270k414n38K379J742k996J628o93m637k058r62K902L920J690Q1M790Q70
7303A2974J684k403j396l834k51M131J899k378l117l315J191N45r01O39R09q83
7287E494j65k521P33M701p34j623J717L819J965l010l084m942J246m010p51K274
7271A109N855L643j346l251n38N53J638N89k459k233L08k33M573J577m904k990
$$ plain form
7255 1891 5606 6721 6398 6458 6196 9564 9437 7112 7648 7631 10603 9216 11053 10072 4925 5856 9760
7238 9760 8618 5441 3659 5203 5528 3868 1195 2605 4073 6920 8960 7454 5156 8198 9498
7223 9498 9034 9343 8248 5634 7277 10311 9682 4962 4403 8050 10639 8341 9491 9380 6454 1583
7207 1583 374 2327 4854 4625 4712 2893 6276 8489 8690 9378 8542 3355 2586 5378 6660 3100 4294
7190 4294 5772 6403 4169 1132 -1384 -5874 -4921 -1832 -3843 -3439 -5704 -4352 -2659 -3282 597 2227
7174 2227 1156 602 2655 4008 4263 5816 8385 5786 5399 2802 3345 1984 -432 31 -931 -1790 -2198
7157 -2198 259 1476 3342 6409 5499 4400 -43 -3144 -3019 -787 3453 6864 9046 8643 6899 7108
7141 7108 6706 795 -5039 -5905 -3615 -302 4041 3866 -1577 -4644 -4121 -7411 -8283 -3643 -1060 1307
$$ packed form
7255A891L715J115l23O0k62L368j27k325N36j7K972j387J837r81n147R31L904
7238I760j142l177j782J544L25j660k673J410J468K847K040j506k298L042J300
7223I498m64L09j095k614J643L034o29m720n59L647K589k298J150j11k926m871
7207A583j209J953K527k29Q7j819L383K213K01O88q36n187p69K792J282l560J194
7190D294J478O31k234l037k516m490R53L089k011M04k265J352J693o23L879J630
7174B227j071n54K053J353K55J553K569k599l87k597N43j361k416M63r62q59m08
7157b198K457J217J866L067r10j099m443l101J25K232M240L411K182m03j744K09
7141G108m02n911n834q66K290L313M343j75n443l067N23l290q72M640K583K367
$$ plain form
7125 1307 1565 4407 6167 6612 6254 5062 1151 -163 -321 -1034 285 2215 8182 10489 9832 6517
7109 6517 7026 4769 3133 2541 1850 3264 3587 625 365 3167 4684 3912 5967 8397 8430 8583 9233
7092 9233 6079 2067 -1882 -933 -2131 665 3597 -320 -3273 -2434 668 4344 5180 2822 1242 -2129
7076 -2129 -2461 -326 1432 3343 3736 6386 4960 2895 4041 6004 6273 5299 4560 6536 4881 181
7060 181 -710 786 2378 627 1097 1195 13 922 4901 6392 7497 6461 7259 7194 5847 3524 683
7043 683 -482 1084 3639 4326 4488 1000 -2292 2496 5490 4102 4930 4663 1626 2321 5406 5782 1775
7026 1775 -2883 -3200 -3828 -1361 1650 3826 5145 1743 1412 782 -1331 -1018 80 -417 501 2475 4886
7009 4886 6739 6807 4005 479 781 3339 1222 -2637 -4190 1095 468 -1906 1612 2777 1648 -755
$$ packed form
7125A307K58K842J760M45l58j192l911j314j58p13J319J930N967K307o57l315
7109F517N09k257j636n92o91J414L23k962k60K802J517p72K055K430L3J53O50
7092I233l154m012l949R49j198K796K932l917k953Q39L102L676Q36k358j580l371
7076b129l32K135J758J911L93K650j426k065J146J963K69r74p39J976j655m700
7060A81q91J496J592j751M70R8j182R09L979J491J105j036P98o5j347k323k841
7043F83j165J566K555O87J62l488l292M788K994j388Q28k67l037O95L085L76m007
7026A775m658l17o28K467L011K176J319l402l31o30k113L13J098m97R18J974K411
7009D886J853O8k802l526L02K558k117l859j553N285o27k374L518J165j129k403
$$ plain form
6993 -755 -2534 -721 5453 8374 10691 9674 8593 8926 6828 6247 3874 4203 9062 7309 6061 8014
6977 8014 6369 2960 1923 2748 5952 5092 3535 4994 6589 5792 4640 2569 -597 3012 8658 12223
6961 12223 11700 6876 6522 5438 4149 2774 4056 6920 6235 6106 5727 5842 8113 4166 3098 5210
6945 5210 5071 5332 4048 2422 5375 11830 9904 10052 8013 7237 8957 8178 7454 8762 9020 4768 6244
6928 6244 5573 6380 2580 -281 1580 4225 6062 5434 3194 3146 7424 8961 7631 6892 4452 2573
6912 2573 3473 1730 3417 3244 4471 3296 -1683 -1645 -392 1953 1469 -392 3225 3779 4425 3763 3732
6895 3732 4219 4197 4672 4586 -2617 -2870 588 2436 3645 1534 -448 2253 2043 2192 2370 4250 5362
6878 5362 6201 5803 4153 5516 8873 6016 3606 3350 1826 2690 3208 3721 1614 1695 2627 2541 1573 3341
$$ packed form
6993g55j779J813O174K921K317j017j081L33k098n81k373L29M859j753j248J953
6977H014j645l409j037Q25L204q60j557J459J595p97j152k071l166L609N646L565
6961A2223n23m824l54j084j289j375J282K864o85j29l79J15K271l947j068K112
6945E210j39K61j284j626K953O455j926J48k039p76J720p79p24J308K58m252J476
6928F244o71Q07l800k861J861K645J837o28k240m8M278J537j330p39k440j879
6912B573R00j743J687j73J227j175m979L8J253K345m84j861L617N54O46o62l1
6895C732M87k2M75q6p203k53L458J848J209k111j982K701k10J49J78J880J112
6878E362Q39l98j650J363L357k857k410k56j524Q64N18N13k107Q1R32q6r68J768
$$ plain form
6860 3341 3710 4095 4680 4826 2657 -3932 -3109 3162 5789 5383 952 4822 4462 2662 5449 9134 12852
6843 12852 11581 5352 2005 -321 -1351 557 297 2654 2426 5050 4972 4946 7213 7334 6316 3759
6827 3759 3456 161 396 2731 2570 4442 8643 5664 3912 1502 836 2225 1892 1828 5733 6027 7117
6810 7117 9186 8926 2156 -2756 -1065 -871 -2572 -1550 2045 1426 2403 2908 2026 2397 3965 3504 -690
6793 -690 -5700 -8236 -6888 -1943 -523 -1696 -579 2265 2662 467 -7405 -7084 -2832 -711 -2510 -5811
6777 -5811 -3056 -3561 -3756 -4505 -1926 -887 2703 1956 6880 7573 6672 6215 5855 7509 8058 4571 3446
6760 3446 4037 3239 -1066 -189 -340 1388 4409 2827 -114 1858 4747 3493 4480 652 -2667 167
6744 167 6059 3820 2252 -2006 -560 -143 -175 -3192 -1200 4920 8058 6586 3743 -963 -741 3792
$$ packed form
6860C341L69L85N85J46k169o589Q23O271K627m06m431L870l60j800K787L685L718
6843A2852j271o229l347k326j030J908k60K357k28K624p8k6K267J21j018k557
6827C759l03l295K35K335j61J872M201k979j752k410o66J389l33o4L905K94J090
6810G117K069k60o770m912J691J94j701J022L595o19R77N05q82L71J568m61m194
6793f90n010k536J348M945J420j173J117K844L97k195p872L21M252K121j799l301
6777e811K755n05j95p49K579J039L590p47M924O93r01m57l60J654N49l487j125
6760C446N91p98m305Q77j51J728L021j582k941J972K889j254R87l828l319K834
6744A67N892k239j568m258J446M17l2l017J992O120L138j472k843m706K22M533
$$ plain form
6728 3792 7161 8113 11187 8942 5959 8021 3756 2501 4333 2331 -1298 -1198 2323 3724 3338 5043
6712 5043 4958 1822 2742 4510 4697 3569 1426 230 -2332 -4412 -2764 3439 2336 107 2049 3980
6696 3980 5666 6309 7150 7180 4046 1661 2458 4672 4800 5483 4460 2595 811 1359 4051 4932 3622
6679 3622 3166 1478 198 2057 1991 2318 4001 1952 5303 7019 10535 7804 842 1566 6644 6665 5504
6662 5504 4823 6905 6818 7146 6137 2651 -2337 -2203 -2482 -2446 -638 -3787 -8149 -5683 -5243 -7616 -2931
6645 -2931 -2731 -4905 -2353 -2796 -2419 -610 -16 1300 -221 -228 390 2410 2718 5184 3493 2020 2964
6628 2964 7552 5613 1330 845 -2305 -1534 -2753 -2009 -1960 -1005 -3515 -1928 -2418 -3529 -3597 564 3639
6611 3639 873 -1911 -1087 1870 -119 -750 115 3508 8656 7592 139 -3171 -840 -4631 -4851 -2605
$$ packed form
6728C792L369R52L074k245k983K062m265j255J832k002l629J00L521J401l86J705
6712E043q5l136R20J768J87j128k143j196k562k080J648O203j103k229J942J931
6696C980J686O43Q41L0l134k385P97K214J28O83j023j865j784N48K692Q81j310
6679C622m56j688j280J859o6L27J683k049L351J716L516k731o962P24N078K1j161
6662E504o81K082q7L28j009l486m988J34k79L6J808l149m362K466M40k373M685
6645b931K00k174K552m43L77J809N94J316j521pO18K020L08K466j691j473R44
6628B964M588j939m283m85l150P71j219P44M9R55k510J587m90j111o8M161L075
6611C639k766k784Q24K957j989o31Q65L393N148j064p453l310K331l791k20K246
$$ plain form
6595 -2605 -960 -2088 -1431 -383 -1044 -2583 1916 5555 6400 2926 3751 3830 -845 -3887 -3054 -3371 191
6578 191 3060 954 -1322 -2000 -1009 3206 6939 7320 6317 6463 2846 -166 2238 3468 5281 3424
6562 3424 -754 -2814 2515 4866 6654 8084 7857 10460 12397 15517 16143 18808 22955 27502 34096
6547 34096 38933 42825 47373 44488 33919 25806 18811 16348 15763 13625 12925 8271 700 3637 4920
6532 4920 3856 2833 -643 -2416 -809 542 4467 6054 3145 -267 -1439 -987 -1806 -4645 -3772 -3113
6516 -3113 -5618 -6490 -2987 -1692 -3643 -4765 -3577 -608 -646 -2526 -3155 -2735 -2540 -3106 -1838 2720 2654
6499 2654 -1525 -1055 3353 2435 1366 1184 -701 -5322 -3527 -2351 -3006 -929 -475 -2920 -2222 -2567 -2034
6482 -2034 -1972 -2915 -5817 -7106 -7222 -5193 -85 784 3219 6438 4962 1309 2602 2093 -2059 486
$$ packed form
6595b605J645j128O57J048o61j539M499L639Q45l474Q25P9m675l042Q33l17L562
6578A91K869k106k276o78R91M215L733L81j003J46l617l012K404J230J813j857
6562C424m178k060N329K351J788J430k27K603J937L120O26K665M147M547O594
6547C4096M837L892M548k885j0569q113o995k463n85k138p00m654p571K937J283
6532D920j064j023l476j773J607J351L925J587k909l412j172M52q19k839Q73O59
6516c113k505q72L503J295j951j122J188K969l8j880o29M20J95n66J268M558o6
6499B654m179M70M408r18j069j82j885m621J795J176o55K077M54k445O98l45N33
6482b034O2r43k902j289j16K029N108Q69K435L219j476l653J293n09m152K545
$$ plain form
6466 486 2006 490 -2369 -3354 -4916 -4417 -3235 -3618 -5937 -7675 -4628 -1339 -966 3601 2658 -1933
6450 -1933 -3220 -1526 39 3512 3837 2585 852 3941 1569 2011 2771 693 -2884 390 1093 2999
6434 2999 968 3495 5884 4675 -211 -3401 -2281 -1655 -564 -1910 -1865 -2219 -2133 -1398 -2641 -6012 -5992
6417 -5992 -921 1092 -252 -2102 -599 -1816 -2585 -7261 -9050 -4639 -2857 -2844 -2154 -414 1379 3771
6401 3771 5762 331 -207 3338 4922 2926 -642 -837 -2630 -1070 1066 -220 -4375 -8654 -9445 -2789
6385 -2789 -2215 -3860 -1268 2285 2814 3394 5573 4085 626 3633 2416 -1054 -1688 382 415 3155
6369 3155 8923 7929 3017 1143 -4849 -3734 3274 2248 -83 -2257 -3891 -6006 -4116 -730 -1170
6354 -1170 -3761 -5252 -1569 -3498 -4114 -3394 -4190 -6055 -4223 -4918 -7694 -11758 -11638 -8623 -7780 -7817 -5593
$$ packed form
6466D86J520j516k859r85j562M99J182l83k319j738L047L289L73M567r43m591
6450a933j287J694J565L473L25j252j733L089k372M42P60k078l577L274P03J906
6434B999k031K527K389j209m886l190J120O26J091j346M5l54Q6P35j243l371K0
6417e992N071K013j344j850J503j217p69m676j789M411J782J3O90J740J793K392
6401C771J991n431n38L545J584j996l568j95j793J560K136j286m155m279p91O656
6385b789N74j645K592L553N29N80K179j488l459L007j217l470o34K070L3K740
6369C155N768r94m912j874n992J115P008j026k331k174j634k115J890L386m40
6354a170k591j491L683j929o16P20p96j865J832o95k776m064J20L015Q43l7K224
$$ plain form
6337 -5593 -463 3419 1758 -641 -1222 -3242 -6363 -3320 2250 4571 1921 2995 4106 1283 452
6322 452 5417 4720 2640 -1508 -1887 -2397 -299 -814 -2843 -2615 1825 4416 755 659 666 1487 5421 4175
6304 4175 -1888 -1714 1283 3510 1271 1584 586 -3017 802 3838 328 -3204 -110 -3564 -8758 -9253
6288 -9253 -5124 -2458 -3138 -2151 1351 4157 5267 2493 512 2239 3311 4137 192 -5179 -7561 -3400
6272 -3400 -78 -815 -529 2672 5027 3554 651 967 -2650 -661 307 1943 1889 1415 -1584 -4066 -4645
6255 -4645 -3710 15 -1872 -2301 -1429 -1525 -1753 159 1347 3399 3485 2898 -1807 -2873 -2488 -2131 -3245 -1613
6237 -1613 -2875 -2333 945 2547 520 2521 2807 -845 -1671 -5318 -6504 -3064 -886 -2337 -4049 -1786
6221 -1786 4395 6778 3486 -847 -3339 355 2202 2719 -188 566 1014 1134 -587 -1251 262 -1237
$$ packed form
6337e593N130L882j661k399n81k020l121L043N570K321k650J074J111k823q31
6322D52M965o97k080m148l79n10K098n15k029K28M440K591l661r6PQ21L934j246
6304D175o063J74K997K227k239L13r98l603L819L036l510l532L094l454n194m95
6288i253M129K666o80R87L502K806J110k774j981J727J072Q26l945n371k382M161
6272c400L322p37K86L201K355j473k903L16l617J989R68J636n4m74k999k482n79
6255d645R35L725j887m29Q72r6k28J912J188K052Q6n87m705j066L85L57j114J632
6237a613j262N42L278J602k027K001K86l652q26l647j186L440K178j451j712K263
6221a786O181K383l292m333k492L694J847N17k907P54M48J20j721o64J513j499
$$ plain form
6205 -1237 -3195 -1392 -159 1473 305 -3017 -1992 840 300 2693 384 -1884 -1043 453 -674
6190 -674 -1597 891 1113 -2356 -3729 -2667 -2896 -3981 -245 -244 5676 6929 4248 -315 -913 2251 2038
6173 2038 -1097 -957 -608 313 1360 -777 1390 3653 2201 249 -822 -144 935 2487 -399 912
6157 912 2151 2114 2525 2120 -672 -877 -1138 -1929 -862 899 -197 -496 1790 2408 5125 4097 2153
6140 2153 -1246 -4139 -1477 698 -2449 -738 1177 1638 1304 2685 2474 1347 1319 1344 1758 1387 1668
6123 1668 2098 301 -1630 1763 3365 3349 6561 6558 6742 10707 12739 8082 9273 7113 9388 9363 8762
6106 8762 5427 -639 -3627 -542 -991 -2611 1661 4792 2497 193 -677 -1722 -731 -1293 -5072 -2265
6090 -2265 121 -4206 -4421 -2023 -4860 -2807 -3092 -7025 -5466 -3579 3396 4937 4752 4146 1992 47
$$ packed form
6205a237j958J803J233J632j168l322J025K832n40K393k309k268Q41J496j127
6190f74r23K488K22l469j373J062k29j085L736JN920J253k681m563n98L164k13
6173B038l135J40L49R21J047k137K167K263j452j952j071O78J079J552k886J311
6157I12J239l7M11m05k792k05k61p91J067J761j096k99K286O18K717j028j944
6140B153l399k893K662K175l147J711J915M61l34J381k11j127k8K5M14l71K81
6123A668M30j797j931L393J602j6L212lJ84L965K032m657J191k160K275k5o01
6106H762l335o066k988L085m49j620M272L131k295k304q70j045R91n62l779K807
6090b265K386m327k15K398k837K053k85l933J559J887O975J541j85o06k154j945
$$ plain form
6074 47 -648 -1837 -487 1243 3635 -848 -5070 -1790 -566 -1934 -1373 1118 3279 -589 -4095 -2176
6058 -2176 1253 2964 2224 166 1973 -21 -399 682 -438 694 3935 1105 -3394 -3246 -1155 -2325
6042 -2325 -2018 -2335 -5780 -7495 -7104 -6548 -8303 -3525 183 -2357 448 2841 1883 3689 4654 15
6026 15 -15 2706 1459 1326 1449 2457 3445 6086 1818 44 2103 2623 461 716 816 4978 6472
6009 6472 5549 3569 3404 5540 2734 2894 1792 2386 1497 -565 -1890 -1304 -6262 -4630 162 -808 -5178
5992 -5178 -8477 -6696 -5803 -5550 -8206 -8088 -1537 2160 -3045 -5383 -94 3289 4322 2028 -703 -2286
5976 -2286 -5220 -4738 -2149 -2573 -2469 -2488 -1302 -2869 -3950 -6166 -2368 -2974 -6889 -7006 -508 -690 -4294
5959 -4294 -6908 -9054 -6408 -7182 -4337 -433 1627 1975 5284 5203 1403 220 -1097 -801 -354 3433
$$ packed form
6074D7o95j189J350J730K392m483m222L280J224j368N61K491K161l868l506J919
6058b176L429J711p40k058J807j994l78J081j120J132L241k830m499J48K091j170
6042b325L07l17l445j715L91N56j755M778L708k540K805K393r58J806R65m639
6026A5l0K721j247j33J23J008R88K641m268j774K059N20k162K55J00M162J494
6009F472r23j980j65K136k806J60j102N94q89k062j325N86m958J632M792r70m370
5992e178l299J781Q93K53k656J18O551L697n205k338N289L383J033k294k731j583
5976b286k934M82K589m24J04j9J186j567j081k216L798o06l915j17O498j82l604
5959d294k614k146K646p74K845L904K060L48L309q1l800j183j317K96M47L787
$$ plain form
5943 3433 5915 5046 -619 -4083 -7945 -7313 -6323 -3561 951 154 -1680 2094 4010 4419 3952 715
5927 715 -975 -5227 -4853 -2053 1516 182 -430 -1016 -4319 -3664 -1819 790 5575 6931 3718 4995
5911 4995 4786 3202 -824 -3052 -2504 -3706 -3260 -1551 -233 -4275 -3319 1973 5107 4226 5733 3714
5895 3714 -480 -6065 -6308 -3613 229 -673 -620 1983 4413 6327 6984 1893 -2202 -2760 2511 -596
5879 -596 -4942 -4528 -3189 -173 -2886 -1433 1810 1081 394 940 82 966 -1063 -2002 -3062 -2113 -79
5862 -79 4499 4911 2344 1231 2224 4150 -494 -1160 -1323 -1253 -479 -1225 -4703 -3652 -1580 24 -4582
5845 -4582 -7260 -7204 -5352 -6192 -5330 -3081 -4486 -3655 1100 2482 -355 -1291 1081 3469 -1249 -3265
5829 -3265 -4505 -5294 1364 2705 -963 -6339 -4682 -3531 -4008 -6858 -4020 -6317 -6434 -5352 -4000 -2810
$$ packed form
5943C433K482q69n665l464l862O32R90K762M512p97j834L774J916M09m67l237
5927G15j690m252L74K800L569j334o12n86l303O55J845K609M785J356l213J277
5911D995k09j584m026k228N48j202M46J709J318m042R56N292L134q81J507k019
5895C714m194n585k43K695L842r02N3K603K430J914O57n091m095n58N271l107
5879e96m346M14J339L016k713J453L243p29o87N46q58Q84k029r39j060R49K034
5862g9M578M12k567j113R93J926m644o66j63P0P74p46l478J051K072J604m606
5845d582k678N6J852q40Q62K249j405Q31M755J382k837r36K372K388m718k016
5829c265j240p89O658J341l668n376J657J151m77k850K838k297j17J082J352J190
$$ plain form
5813 -2810 448 950 355 -1238 -1443 -1552 -578 319 2227 3520 4320 2672 121 -308 3646 2356 3850
5796 3850 1304 875 1034 2827 5276 2189 2117 -2966 -3879 -2797 1354 8109 8736 7814 7757 8770 10093
5779 10093 7170 4237 7255 9795 6763 7645 8671 6896 8084 5965 -240 -2045 2636 -381 -4615
5764 -4615 -7184 -4202 627 2456 1316 1617 2621 -121 -143 316 -224 -2138 -102 -294 -272 1652 302
5747 302 -1187 -563 -487 167 1647 -2356 -4629 -6181 -5231 -5913 -6545 -4736 3345 2672 491 2572 1328
5730 1328 2096 3043 -971 -2409 1351 368 -662 -5257 -6693 -6162 -5647 -9898 -11217 -8220 -3847 -3600
5714 -3600 -2159 2765 4409 5571 3249 782 2032 1829 5260 7413 2112 322 3409 1682 96
5699 96 1805 3231 2686 3858 5101 4973 3088 -895 -2861 -2836 -3454 -1134 846 1007 1006 -397 368 1369
$$ packed form
5813b810L258N02n95j593k05j09R74Q97J908J293Q00j648k551m29L954j290J494
5796C850k546m29J59J793K449l087p2n083r13J082M151O755O27r22n7J013J323
5779A0093k923k933L018K540l032Q82J026j775J188k119o205j805M681l017m234
5764d615k569K982M829J829j140L01J004k742k2M59n40j914K036j92K2J924j350
5747C02j489O24P6O54J480m003k273j552R50o82o32J809Q081o73k181K081j244
5730A328P68R47m014j438L760r83j030m595j436N31N15m251j319K997M373K47
5714c600J441M924J644J162k322k467J250k03L431K153n301j790L087j727j586
5699I6J709J426n45J172J243j28j885l983j966K5o18K320J980J61jj403P65J001
$$ plain form
5681 1369 2684 1916 3413 3691 6540 2306 -1735 -3303 -2951 667 736 -151 -970 -4849 -7981 -9075 -7800
5664 -7800 -9911 -7972 -5882 -5280 -7722 -6721 -3017 -2812 -3612 -870 1626 1950 3164 3199 286 747 -2253
5647 -2253 -5070 -3906 -3211 -5063 -7245 -898 -1894 -3154 2576 3203 2994 4814 6103 5846 259 -1454
5631 -1454 -439 -727 2669 900 -2687 -3891 -1380 -2500 -6498 -4825 -845 -1047 -801 2136 5819 4178
5615 4178 3719 3997 3375 1463 -2694 -4860 -1868 828 2793 603 -995 -2724 -6736 -7803 -5137 -4231
5599 -4231 -3327 -512 -1098 -850 1884 4899 4837 3282 635 -5015 -3478 2527 5187 2359 1703 1964 -945
5582 -945 -2687 -4692 -644 -324 -1204 -1922 222 1094 -1652 -248 4889 7344 2883 -814 -1386 -4525
5566 -4525 -6290 -2565 -2330 -3710 -2336 -1393 -3803 -8809 -10131 -6110 -2146 -926 -1722 168 -50 -612
$$ packed form
5681A369J315p68J497K78K849m234m041j568L52L618O9q87q19l879l132j094J275
5664g800k111J939K090O02k442J001L704K05q00K742K496L24J214L5k913M61l000
5647b253k817J164O95j852k182O347r96j260N730O27k09J820J289k57n587j713
5631a454J015k88L396j769l587j204K511j120l998J673L980k02K46K937L683j641
5615D178m59K78o22j912m157k166K992K696J965k190j598j729m012j067K666R06
5599d231R04K815n86K48K734L015o2j555k647n650J537O005K660k828o56K61k909
5582i45j742k005M048L20q80p18K144Q72k746J404N137K455m461l697n72l139
5566d525j765L725K35j380J374R43k410n006j322M021L964J220p96J890k18n62
$$ plain form
5550 -612 -1841 -3719 -1825 725 -292 23 -2112 1408 5121 4542 1668 -433 733 -1607 -4463 -3702
5534 -3702 -2766 -923 -1178 -2839 -855 -3795 -8408 -6633 -1476 -800 -1339 -3411 -8046 -6591 -2186 -670
5518 -670 -1896 -2816 -1438 -1339 -3240 -17 678 -1354 -1274 -1316 -1204 -436 -3032 -388 303 -402 -3869 -6029
5500 -6029 -4819 -4703 -1604 2002 3466 5429 -101 -4033 -3605 -3161 -2905 1305 -904 -2904 1679 4289
5484 4289 4137 1823 -3868 -3062 -4454 -3414 -1443 -1660 -2469 -1740 452 -1620 -6032 -3684 -1757 -1
5468 -1 1189 2331 -758 -1406 113 261 -3740 -3454 -3523 -3655 -4129 -2224 337 2186 2234 -2345 -8779 -11752
5450 -11752 -9682 -7173 -3821 -1121 1622 -1328 -182 862 -714 1651 -881 -3409 -3166 -344 -666
5435 -666 -858 2632 1020 1155 4057 5480 3859 178 -154 431 2742 4177 2039 2231 544 -436 -2828
$$ packed form
5550f12j229j878J894K550j017L15k135L520L713n79k874k101J166k340k856P61
5534c702R36J843k55j661J984k940m613J775N157O76n39k072m635J455M405J516
5518f70j226r20J378R9j901L223O95k032Q0m2J12P68k596K644O91p05l467k160
5500f029J210J16L099L606J464J963n530l932M28M44K56M210k209k000M583K610
5484D289j52k314n691Q06j392J040J971k17q09P29K192k072m412K348J927J756
5468aJ190J142l089o48J519J48m001K86o9j32m74J905K561J849M8m579o434k973
5450a1752K070K509L352K700K743k950J146J044j576K365k532k528K43K822l22
5435f66j92L490j612J35K902J423j621l681l32N85K311J435k138J92j687r80k392
$$ plain form
5418 -2828 -1294 -2368 -5015 -447 1834 -803 -383 -1379 -5559 -8752 -6797 -5634 -4542 929 4290
5403 4290 506 -6581 -6205 -5359 -2264 1479 -1480 -2357 -2849 -5104 -5225 -5786 -3738 -2136 884 870 227
5386 227 -198 -3346 -5777 -6881 -9577 -10349 -10532 -6314 -2445 -3142 -2858 -361 2754 -1107 -2465 -3278 -5050
5369 -5050 -5960 -6428 -5580 -6922 -6034 333 2782 2778 1269 4846 10390 10154 6056 942 2544 4135 4463
5352 4463 5577 5849 5447 5642 4326 1055 -3287 -6110 -7914 -6445 -4822 -2539 -3869 -2702 -2627 -5706
5336 -5706 -7349 -7503 -6974 -6492 -5066 -4437 -6048 -404 -2312 -3420 -1905 -5577 -5527 -3299 -1285 -1943 351
5319 351 -1480 -368 3087 1792 1735 896 329 -2679 -3339 -4766 -4183 -5080 -7056 -4347 -2685 1264 3307
5302 3307 2007 930 -821 -2369 -2195 -1278 929 5843 3763 2295 4465 6254 4988 3205 -58
$$ packed form
5418b828J534j074k647M568K281k637M20r96m180l193J955J163J092N471L361
5403D290l784p087L76Q46L095L743k959q77m92k255j21n61K048J602L020j4o43
5386B27m25l148k431j104k696p72j83M218L869o97K84K497L115l861j358q13j772
5369e050r10m68Q48j342Q88O367K449mj509L577N544k36m098n114J602J591L28
5352D463J114K72m02J95j316l271m342k823j804J469J623K283j330J167P5l079
5336e706j643j54N29M82J426O29j611N644j908j108J515l672N0K228K014o58K294
5319C51j831J112L455j295n7q39n67l008o60j427N83q97j976K709J662L949K043
5302C307j300j077j751j548J74R17K207M914k080j468K170J789j266j783l263
$$ plain form
5287 -58 -1027 1813 1328 349 -4302 -8396 -5797 -7537 -10295 -6881 -6012 -6961 -6715 -3942 -5584 -4212 1201
5270 1201 2125 6786 9197 7630 5744 2463 1083 1712 2771 3384 1677 2345 4804 5805 4462 3673
5254 3673 -1158 -1292 706 -382 -4820 -5710 -1121 -3444 -5868 -4840 -3624 -4982 -5502 -1662 178 -1113
5238 -1113 -4885 -7101 -2357 258 218 873 -1170 -559 1440 4072 3541 1645 -5103 -4188 13 445 2504
5221 2504 1009 -2986 -4769 -2498 -904 -867 -1591 -2336 -2565 -5352 -9084 -9195 -9217 -11601 -11418 -5654 -1547
5204 -1547 381 -941 -3416 -2350 1137 -1429 -6058 -3036 -2108 -5153 -8578 -8404 -8949 -7657 -2047 -3922
5188 -3922 -3491 53 -2394 -6270 -5367 -4172 -2800 -2139 -6498 -9816 -6064 -1988 649 1951 -2346 -2433
5172 -2433 -1701 99 3145 1457 1018 -2123 -3987 -403 -1245 -6058 -7746 -9230 -6682 -2643 -1679 -5242
$$ packed form
5287e8r69K840m85r79m651m094K599j740k758L414Q69r49K46K773j642J372N413
5270A201R24M661K411j567j886l281j380O29J059O13j707O68K459J001j343p89
5254C673m831j34J998j088m438q90M589k323k424J028J216j358n20L840J840j291
5238a113l772k216M744K615m0O55k043O11J999K632n31j896o748R15M201M32K059
5221B504j495l995j783K271J594L7p24p45k29k787l732j11k2k384J83N764M107
5204a547J928j322k475J066L487k566m629L022R28l045l425J74n45J292N610j875
5188c922M31L544k447l876R03J195J372O61m359l318L752M076K637J302m297q7
5172b433P32J800L046j688m39l141j864L584q42m813j688j484K548M039R64l563
$$ plain form
5156 -5242 -5028 -2583 -1065 1560 -3551 -6063 -4315 -2750 -4337 -3163 -1475 546 664 -641 165 -2613
5140 -2613 -5185 -5357 -6146 -8664 -6533 -5304 -2464 164 872 -3680 -3107 -2258 -2018 -1529 -1755 1332 -1812
5123 -1812 -3331 -2725 -1057 987 1697 -2217 -3430 -7332 -8585 -2754 1023 3174 5348 7686 3235
5108 3235 -739 -1013 2272 -1613 -5389 -5717 -6926 -5748 -2916 -5366 -5834 -2294 -699 -1650 -837 1462
5092 1462 -262 370 3885 1997 -2204 -5555 -5965 -3559 3615 5840 4754 4392 4759 10 -1933 -2702
5076 -2702 -5505 -8765 -6864 -4375 -4845 -3590 1341 3478 3302 1109 -446 -2342 -377 -1263 -8353 -7903
5060 -7903 -3048 156 587 -106 848 -5198 -6079 -5798 -2248 -598 -566 1598 1543 1921 4831 5090 5535 -2208
5042 -2208 -3709 426 1379 1597 1381 2926 3833 4161 1962 3733 4858 3434 4964 4075 7597 2393
$$ packed form
5156e242K14K445J518K625n111k512J748J565j587J174J688K021J18j305Q06k778
5140b613k572j72p89k518K131J229K840K628P08m552N73Q49K40M89k26L087l144
5123a812j519O06J668K044P10l914j213l902j253N831L777K151K174K338m451
5108C235l974k74L285l885l776l28j209J178K832k450m68L540J595r51Q13K299
5092A462j724O32L515j888m201l351m10K406P174K225j086l62L67m749j943p69
5076b702k803l260J901K489m70J255M931K137j76k193j555j896J965q86p090M50
5060g903M855L204M31o93R54o046q81K81L550J650L2K164n5L78K910K59M45p743
5042b208j501M135R53K18k16J545R07L28k199J771J125j424J530q89L522n204
$$ plain form
5026 2393 1281 -547 261 888 3825 3110 -479 -3030 -4341 -3665 -2916 -204 1414 477 2269 1707 1905
5009 1905 146 3204 1611 833 4462 6112 3394 3959 1937 -1993 188 3206 2229 4253 4346 1202
4993 1202 -752 3107 5132 4759 3518 3280 707 -2793 -3132 3228 6270 8677 7030 1300 823 2095
4977 2095 2871 2172 463 -159 -4146 -1897 104 -932 503 -1154 -5540 -6885 -1810 2603 2828 378
4961 378 -1314 -1153 -4924 -4464 -2231 -516 -4539 -8458 -6498 -2058 2433 1750 -3349 -5414 -1108 -1178
4945 -1178 2923 4316 4541 2034 330 2422 1201 -783 1135 1788 -1998 -6758 -3324 1688 -276
4930 -276 -2764 -3545 -823 -2544 -3555 274 -246 -1325 -1873 -3397 -4884 -2487 -1698 -1870 -1224 -4771 -9746
4913 -9746 -8062 -3420 -1467 -290 -336 1666 -1246 -4393 -5728 -7126 -6033 -9103 -7908 -5913 -6420 -4143
$$ packed form
5026B393j112j828Q08O27K937p15l589k551j311O76P49K712J618r37J792n62J98
5009A905j759L058j593p78L629J650k718N65k022l930K181L018r77K024R3l144
4993A202j954L859K025l73j241k38k573l500l39O360L042K407j647n730m77J272
4977B095P76o99j709o22l987K249K001j036J435j657m386j345N075M413K25k450
4961C78j692J61l771M60K233J715m023l919J960M440M491o83n099k065M306p0
4945a178M101J393K25k507j704K092j221j984J918O53l786m760L434N012j964
4930b76k488p81K722j721j011L829n20j079n48j524j487K397P89j72O46l547m975
4913i746J684M642J953J177m6K002k912l147j335j398J093l070J195J995n07K277
$$ plain form
4897 -4143 1039 2389 -72 1313 2234 2108 -438 -1874 -2257 289 448 -847 -627 -1660 -5189 -1458
4881 -1458 795 1176 3747 3849 4255 1 -2733 -4955 787 1684 2744 1782 223 2153 1001 -1669
4865 -1669 237 2172 2864 2992 1517 -1738 -2677 -4770 -3326 -1506 -4526 -5681 -6752 -5905 -5990 -5550 -4584
4848 -4584 -5671 -7430 -8769 -9099 -6692 -1837 -239 370 1855 -2930 -5768 -5418 -4839 -3013 -4131 -4228
4832 -4228 -3906 -1318 4366 6469 4429 -2038 -1988 12 -1061 -2471 -2197 -1173 -4003 -3175 -2006 -6331
4816 -6331 -10003 -10671 -9076 -9806 -8045 -5167 -2092 2368 4510 3924 -1445 -2028 -1742 -481 2788 2580
4800 2580 -1588 -2440 -3647 -4423 -4637 -4731 -2188 -1826 -1558 -5111 -7791 -5361 -7479 -6311 -2290 -3319 -4692
4783 -4692 -1242 -2790 -5824 -9642 -4192 1136 1209 1218 3018 2630 780 -3423 -1476 -959 -2798 -1971 1891
$$ packed form
4897d143N182J350k461J385R21j26k546j436l83K546J59j295K20j033l529L731
4881a458K253L81K571J02M06m254k734k222N742Q97J060r62j559J930j152k670
4865a669J906J935O92J28j475l255r39k093J444J820l020j155j071Q47q5M40R66
4848d584j087j759j339l30K407M855J598O09J485m785k838L50N79J826j118r7
4832d228L22K588N684K103k040o467N0K000j073j410K74J024k830Q28J169m325
4816f331l672o68J595p30J761K878L075M460K142n86n369n83K86J261L269k08
4800B580m168q52j207p76k14r4K543L62K68l553k680K430k118J168M021j029j373
4783d692L450j548l034l818N450N328P3RJ800l88j850m203J947N17j839Q27L862
$$ plain form
4766 1891 3458 1829 2183 648 2449 -10 -1712 -623 2937 4134 2875 3031 -568 -2344 774
4751 774 1976 2348 3254 5445 5591 4466 1447 -1615 -7170 -5790 -1334 2004 5571 5816 5431 1809
4735 1809 1241 4876 3349 2374 -3068 -5817 -5573 -3554 -6946 -7565 -8183 -4686 -4408 -5049 -5186 -4567 -5866
4718 -5866 -5847 -3253 -2209 -2701 -340 2196 3844 5051 5030 6490 4126 -88 215 -570 -2218 -1312 3590
4701 3590 3974 2272 5396 7084 6575 3871 -127 -1645 363 -214 -2353 -6597 -7323 -3454 -5203 -6827
4685 -6827 -7916 -7057 -5540 -5461 -5926 -6199 -5736 103 -543 2572 6748 5085 3634 3072 3338 2876 2269 4683
4667 4683 5519 4963 3853 -1036 -3944 -4097 -3325 -3856 -2259 -2679 -4750 -894 -4103 -5476 -2312 1351
4651 1351 -324 -3690 716 2575 1936 -2022 -6062 -1716 1584 -855 -2802 -4560 -4123 -3076 -3080 -3552
$$ packed form
4766A891J567j629L54j535J801k459j702J089L560J197j259J56l599j776L118
4751G74J202L72R06K191J46j125l019l062n555J380M456L338L567K45l85l622
4735A809n68L635j527r75n442k749K44K019l392o19o18L497K78o41j37O19j299
4718e866J9K594J044m92K361K536J648J207k1J460k364m214L03p85j648R06M902
4701C590L84j702L124J688n09k704l998j518K008n77k139m244p26L869j749j624
4685f827j089Q59J517P9m65k73M63N839o46L115M176j663j451n62K66m62o07K414
4667D683Q36n56j110m889k908j53P72n31J597m20k071L856l209j373L164L663
4651A351j675l366M406J859o39l958m040M346L300k439j947j758M37J047mm72
$$ plain form
4635 -3552 -1892 1734 1447 542 -2730 -4724 -2168 -1622 -2753 -5959 -7073 -5395 -5390 -4490 -2853 -1411 241
4618 241 1216 808 986 2013 1711 -2917 -4294 -5013 -4026 -3340 -101 -192 2442 4427 2972 3856 3026 -1665
4600 -1665 -1955 -499 -3124 -6004 -4384 -6150 -6454 -5005 -4228 -2185 31 -3928 -7346 -7676 -9623 -7370
4584 -7370 -7738 -7690 -6818 -3169 1212 -747 785 -414 -2769 -3940 -4738 -9503 -9194 -4775 -3740 -5223
4568 -5223 -2787 -877 -3064 -6637 -6980 -6374 -5843 -5714 -5762 -4035 -3388 -4508 -5482 -4265 -407 -2420 -3427
4551 -3427 -5631 -4311 -1099 -2655 -6249 -6407 -5967 -7164 -5693 -6406 -5316 -3364 -4832 -4751 -3917 1347
4535 1347 2332 -1041 -5735 -6800 -6919 -7620 -7878 -4916 -1605 3695 6276 5654 2103 -3631 -2866 -4065
4519 -4065 -7007 -6158 -3568 -3225 -2250 -1550 1064 1164 -3477 -9211 -7066 -3717 -6010 -10098 -8277 -6201
$$ packed form
4635c552J660L626k87r05l272j994K556N46j131l206j114J678NR00J637J442J652
4618B41R75m08J78J027l02m628j377p19R87O86L239r1K634J985j455Q84q30m691
4600a665k90J456k625k880J620j766l04J449P77K043K216l959l418l30j947K253
4584g370l68M8Q72L649M381j959J532j199k355j171p98m765L09M419J035j483
4568e223K436J910k187l573l43O06N31J29m8J727O47j120r74J217L858k013j007
4551c427k204J320L212j556l594j58M40j197J471p13J090J952j468Q1Q34N264
4535A347R85l373m694j065j19p01k58K962L311N300K581o22l551n734P65j199
4519d065k942Q49K590L43R75P00K614J00m641n734K145L349k293m088J821K076
$$ plain form
4503 -6201 -4195 -2053 -1479 -3817 -2327 1082 3860 271 -5169 -6745 -2369 -3243 -4698 -6387 -2320
4488 -2320 -1451 419 -1671 -5029 -3120 -1481 701 2871 -1995 -2339 -2379 -4532 -8750 -6199 -2855 -838
4472 -838 3940 2907 996 -1235 -2870 -3853 -1563 -3651 -1349 -1401 1438 1922 321 1599 -3068 -8863
4456 -8863 -6063 -2018 -3572 -1606 -3194 -5252 -7052 -3222 -4631 -7892 -4802 -2723 -3290 -3129 -2481 -2253
4440 -2253 -3663 -1976 525 1934 -714 -1111 38 1794 -940 -5373 -2886 -2649 -4103 -3642 -658 1877
4424 1877 625 -14 -969 -2082 -3968 -3902 -262 595 -1394 -2101 -1913 -1726 636 5198 1464 -3260 -5083
4407 -5083 -2683 40 3528 1193 540 -1644 -4497 -5172 -3877 -2123 -1364 -1292 -2186 -3178 -5381 -5391 -3789
4390 -3789 133 706 -377 -2672 -5589 -3715 -4170 -5150 -6607 -7880 -6446 -5926 -7721 -9624 -8358 -5409
$$ packed form
4503f201K006K142N74k338J490L409K778l589n440j576M376q74j455j689M067
4488b320Q69J870k090l358J909J639K182K170m866l44m0k153m218K551L344K017
4472h38M778j033j911k231j635r83K290k088K302n2K839M84j601J278m667n795
4456h863K800M045j554J966j588k058j800L830j409l261L090K079n67J61O48K28
4440b253j410J687K501J409k648l97J149J756k734m433K487K37j454M61K984K535
4424A877j252o39r55j113j886O6L640Q57j989p07J88J87K362M562l734m724j823
4407e083K400K723L488k335o53k184k853o75J295J754P59P2q94r92k203j0J602
4390c789L922N73j083k295k917J874m55r80j457j273J434N20j795j903J266K949
$$ plain form
4374 -5409 -3055 -1465 3543 6438 10510 10568 7803 4873 5687 2026 1217 3878 2603 -1901 538 1776
4358 1776 4232 3884 1466 1000 3650 1392 -1381 1542 1619 -1581 -1936 -459 -3705 -2424 -70 -3334
4342 -3334 -1555 3297 454 -1784 -2611 -1786 3117 6458 4663 2895 2618 122 -1641 -6015 -5174 -6094
4326 -6094 -10127 -5981 -6953 -5177 -5862 -3722 -977 -1377 -897 1152 1033 1213 1621 -469 118 1885 1476
4309 1476 -344 -4388 -8426 -4558 1036 3794 2926 1187 1846 5386 3415 -511 -3636 -4331 -1662 -591
4293 -591 -1468 -2015 -3830 -1626 1484 -1181 287 -319 -3771 -7339 -6795 -4437 -1291 -2191 -5663 -8353
4277 -8353 -4000 -2567 -3058 -5793 -5272 1642 4028 -941 -1338 -1314 869 3700 4409 1786 -125 -3009
4261 -3009 -1295 -820 -2400 -3140 -1121 -1722 2399 3918 368 -2169 -2859 848 123 -2907 -4883 -6279
$$ packed form
4374e409K354J590N008K895M072N8k765k930Q14l661q09K661j275m504K439J238
4358A776K456l48k418m66K650k258k773K923P7l200l55J477l246J281K354l264
4342c334J779M852k843k238q27Q25M903L341j795j768k77k496j763m374Q41r20
4326f094m033M146r72J776o85K140K745m00M80K049j19J80M08k090N87J767m09
4309A476j820m044m038L868N594K758q68j739O59L540j971l926l125o95K669J071
4293e91q77n47j815K204L110k665J468o06l452l568N44K358L146r00l472k690
4277h353M353J433m91k735N21O914K386m969l97K4K183K831P09k623j911k884
4261c009J714M75j580p40K019o01M121J519l550k537o90L707p25l030j976j396
$$ plain form
4245 -6279 -3030 -1027 -971 -1445 -2869 -3549 -4041 -7809 -7703 -5411 -6283 -2588 -2435 -1519 -1226 -2984 -2466 -1456
4227 -1456 -844 204 574 2894 -1537 -6893 -5276 -6387 -5139 -4124 2570 991 353 2433 -600 -4367
4211 -4367 -6217 -5864 -3047 2556 4309 -358 793 2651 285 -1596 -3147 -4093 -4830 -6058 -5633 -2412
4195 -2412 2873 1254 -1069 1453 4248 2758 2933 256 -1724 -411 -181 548 2119 4240 -119 -5424
4179 -5424 -7069 -2690 2228 2408 2593 856 -1520 2633 4217 5024 4460 5455 6408 1824 1074 1720 -1111
4162 -1111 600 -896 -821 -1974 -3955 -3835 -3223 -4040 -5290 -2072 -1626 -928 -182 1091 340 795 1841
4145 1841 -1542 -2327 -2611 -2473 -2696 -3803 -4583 -3715 -2699 1658 1143 531 785 494 -1367 -2285 -2069 -1331
4127 -1331 -273 50 2 -3781 -10170 -8591 -5228 -2256 133 560 -746 1719 2584 2792 1859 -392 -1682
$$ packed form
4245f279L249K003N6m74j424o80m92l768J06K292q72L695J53R16K93j758N18J010
4227a456O12J048L70K320m431n356J617j111J248J015O694j579o38K080l033l767
4211d367j850L53K817N603J753m667J151J858k366j881j551r46p37j228M25L221
4195b412N285j619k323K522K795j490J75k677j980J313K30P29J571K121m359n305
4179e424j645M379M918J80J85j737k376M153J584Q07n64R95R53m584p50O46k831
4162a111J711j496P5j153j981J20O12q17j250L218M46O98P46J273p51M55J046
4145A841l383p85k84J38k23j107p80Q68J016M357n15o12K54k91j861r18K16P38
4127a331J058L23m8l783o389J579L363K972K389M27j306K465Q65K08r33k251j290
$$ plain form
4110 -1682 -3501 591 2901 5934 5179 -1284 -1462 -2668 1523 2813 -271 622 1618 -2574 -2670 -488
4094 -488 -2716 -4733 -2530 -1889 -4958 -10582 -10088 -7887 -6138 -5909 -6593 -8389 -4681 -420 437 2632
4078 2632 2231 4736 5939 1916 -2643 -2669 1584 3794 -1767 -4779 -7789 -7187 -3492 -2143 -938 2217
4062 2217 237 -2464 -3177 109 830 -724 1437 2609 2276 3791 2432 2010 6196 9161 9629 6945
4046 6945 5039 962 1893 -179 -4278 -5041 -5880 -2624 1297 828 -324 -2242 -954 1094 1717 2165
4030 2165 4908 2652 8455 10980 8991 5321 6360 3298 517 637 550 -1985 -1564 -7607 -12094 -7725
4014 -7725 -2257 951 1699 -3990 -5185 -2987 858 2860 2460 -201 -6525 -2747 -2718 -706 -465 1188
3998 1188 -3760 -6765 -4762 -3238 -6650 -7725 -3815 -3223 -2700 -1529 -3775 -5262 -3354 -558 -1582
$$ packed form
4110a682j819M092K310L033p55o463j78j206M191J290l084Q93R96m192r6K182
4094d88k228k017K203O41l069n624M94K201J749K29o84j796L708M261Q57K195
4078B632m01K505J203m023m559k6M253K210n561l012l010O02L695J349J205L155
4062B217j980k701p13L286P21j554K161J172l33J515j359m22M186K965M68k684
4046F945j906m077R31k072m099p63q39L256L921m69j152j918J288K048O23M48
4030B165K743k256N803K525j989l670J039l062k781J20q7k535M21o043m487M369
4014g725N468L208P48n689j195K198L845K002m00k661o324L778K9K012K41J653
3998A188m948l005K003J524l412j075L910N92N23J171k246j487J908K796j024
$$ plain form
3983 -1582 -201 2262 1771 1174 -1674 -4197 -2127 -1220 -836 4210 2956 -1944 -2763 -954 -2738 -3555
3967 -3555 -2241 2782 -344 1962 1223 1401 -409 -1889 -587 2020 157 461 -1370 854 -900 -1504
3951 -1504 -1750 -958 468 1464 403 -428 -4194 -3192 322 6732 3512 816 1872 425 -690 2040
3935 2040 170 962 219 -2180 -3520 -2086 -2641 -3686 -3329 2277 9492 14052 14911 8374 4140 4450
3919 4450 4957 3449 9250 10609 6073 4213 6651 6505 6028 10140 9567 5962 4379 4563 3102 2782
3903 2782 -1040 -6997 -6624 -5417 -4202 -9076 -11185 -5774 -1663 2562 1353 -379 -828 781 276 810
3887 810 1155 825 -2233 693 3158 4893 6085 2369 -4436 -2037 1651 2921 473 4294 10523 12389
3871 12389 7651 5146 6003 4056 -887 -2875 -1783 691 -1695 531 -1029 -5494 -5752 -4646 -7090
$$ packed form
3983a582J381K463m91n97k848k523K070R07L84N046j254m900q19J809j784q17
3967c555J314N023l126K306p39J78j810j480J302K607j863L04j831K224j754o04
3951a504k46P92J426R96j061q31l766J002L514O410l220k696J056j447j115K730
3935B040j870P92p43k399j340J434n55j045L57N606P215M560Q59o537m234L10
3919D450N07j508N801J359m536j860K438j46m77M112n73l605j583J84j461l20
3903B782l822n957L73J207J215m874k109N411M111M225j209j732m49J609n05N34
3887H10L45l30l058K926K465J735J192l716o805K399L688J270k448L821O229J866
3871A2389m738k505Q57j947m943j988J092K474k386K226j560m465k58J106k444
$$ plain form
3856 -7090 -5053 -3231 -7389 -6628 -5293 -4182 471 -5 -2881 -5234 -1543 1115 3586 3325 2776 4243
3840 4243 3662 -2005 -2931 -2678 -3664 -512 2590 4824 2637 2596 4252 7320 7324 3261 -3664 -5195 -4381
3823 -4381 -1760 1047 -131 -651 3752 5533 5821 3642 1425 2928 3664 7386 9439 5117 1493 65
3807 65 3532 1871 120 3899 5830 3863 1474 -3279 -4208 5288 7282 4280 376 307 -966 1271
3791 1271 -470 -5413 -1383 1947 1090 27 -118 182 -2450 -7387 -7249 -3066 -937 427 1794 2494
3775 2494 -812 -2386 -5220 -5077 -4681 -6505 -6886 -7139 -6315 -7384 -5349 -1493 -636 -2245 -1867 877 -217
3758 -217 -1338 -3447 -3936 -7485 -10503 -10847 -9421 -8226 -7324 -3756 -659 1823 218 -27 -3112 -2594
3742 -2594 -1045 1417 5007 1414 -22 -1219 -1797 -2783 -7260 -2823 1475 -734 -369 1787 1350 4419
$$ packed form
3856g090K037J822m158P61J335J111M653m76k876k353L691K658K471k61n49J467
3840D243n81n667r26K53r86L152L102K234k187m1J656L068Mm063o925j531Q14
3823d381K621K807j178n20M403J781K88k179k217J503P36L722K053m322l624j428
3807F5L467j661j751L779J931j967k389m753r29R496J994l002l904o9j273K237
3791A271j741m943M030L330q57j063j45L00k632m937J38M183K129J364J367P00
3775B494l306j574k834J43L96j824l81k53Q24j069K035L856Q57j609L78K744j094
3758b17j121k109m89l549l018l44J426J195R02L568L097K482j605k45l085N18
3742b594J549K462L590l593j436j197n78r86m477M437M298k209L65K156m37L069
$$ plain form
3726 4419 9235 7670 3529 2881 6170 4197 4453 1844 1890 2223 55 -683 479 2447 3106 1211 -1931
3709 -1931 1938 4287 2062 3215 1109 2076 98 2275 1762 1007 -2343 -3635 50 969 -125 -3311
3693 -3311 -5255 -2989 -3217 -1820 -1183 -6697 -9593 -9374 -7830 -4039 -3268 -5764 -7273 -5851 -2168 -3994
3677 -3994 -7700 -8258 -4595 -6219 -1258 2659 4261 5528 3116 678 1994 3294 5535 1744 1484
3662 1484 1251 5008 5359 7439 4607 -1306 -1238 936 -829 -1276 -3597 1103 -2712 -6715 -5218 -1433
3646 -1433 2301 433 -286 -1983 -1455 756 -2289 -4880 -6236 -2084 2648 5381 3927 -3550 -6883
3631 -6883 -1701 -3368 -4458 -5303 -3252 -1910 1035 2232 1978 2991 1670 2627 4372 2271 -93 -782
3615 -782 4178 5560 5056 5454 4843 3877 1302 -1774 -1418 -3122 -5829 -1116 360 -808 -1871 -3359
$$ packed form
3726D419M816j565m141o48L289j973K56k609M6L33k168p38J162J968O59j895l142
3709a931L869K349k225J153k106R67j978K177n13p55l350j292L685R19j094l186
3693c311j944K266k28J397O37n514k896K19J544L791P71k496j509J422L683j826
3677c994l706n58L663j624M961L917J602J267k412k438J316J300K241l791k60
3662A484k33L757L51K080k832n913O8K174j765m47k321M700l815m003J497L785
3646a433L734j868p19j697N28K211l045k591j356M152M732K733j454p477l333
3631f883N182j667j090q45K051J342K945J197k54J013j321R57J745k101k364o89
3615g82M960J382n04L98o11r66k575l076L56j704k707M713J476j168j063j488
$$ plain form
3599 -3359 -2889 2343 2857 2123 3773 4052 1926 3286 1990 -1575 -3410 -2575 -59 4499 3555 -1917
3583 -1917 -6117 -4968 -8297 -6602 -1530 -2078 -2224 849 958 -1067 -3694 -3809 -2185 -215 -180 -2981
3567 -2981 -3079 -4091 -4771 -7668 -8519 -3055 1015 1490 5623 3531 1778 -2060 -6034 -5171 -1003 -388 -482
3550 -482 2051 -1929 -4489 -5617 -3813 -2958 -2379 -3624 -1735 -1976 -2794 -3131 -1172 -539 -3419 -5304 -4060
3533 -4060 -2715 -1001 -1138 -361 218 2304 244 -472 7223 8209 4889 1624 -30 -1371 -754 -679 -3405
3516 -3405 -6759 -7038 -3291 -610 4613 6241 6007 5290 1665 1520 4410 5020 -288 -1622 1352 4237
3500 4237 5306 5896 5662 4722 -738 -2678 -6731 -7471 -6686 -5338 -1782 -705 -2191 -5987 -5217 -2709
3484 -2709 -3294 1048 2538 -1222 602 3704 3160 3629 2699 1248 -1867 645 617 -1885 -2069 -438 -1405
$$ packed form
3599c359M70N232N14p34J650K79k126J360j296l565j835Q35K516M558r44n472
3583a917m200J149l329J695N072n48j46L073J09k025k627j15J624J970L5k801
3567b981r8j012o80k897q51N464M070M75M133k092j753l838l974Q63M168O15r4
3550d82K533l980k560j128J804Q55N79j245J889k41q18l37J959O33k880j885J244
3533d060J345J714j37P77N79K086k060p16P695R86l320l265j654j341O17P5k726
3516c405l354k79L747K681N223J628k34p17l625j45K890O10n308j334K974K885
3500D237J069N90k34r40n460j940m053p40P85J348L556J077j486l796P70K508
3484b709n85M342J490l760J824L102n44M69r30j451l115K512k8k502j84J631r67
$$ plain form
3467 -1405 -2619 -4977 -2626 -3925 -7202 -8195 -11319 -6541 1545 3169 4362 7985 9047 6835 445
3452 445 -1449 -1020 -1307 -2880 -5405 -7804 -4518 1564 2030 3458 132 1177 1244 -1326 -3575 -1674
3436 -1674 -899 943 1001 -1752 -680 2429 3143 -682 -2063 -455 -2776 -5233 -3098 -3038 -6600 -5262
3420 -5262 -7060 -4685 -1257 -865 1844 1450 -196 -3032 -1593 -2505 -1610 4019 5835 5953 730 3
$$ packed form
3467a405j214k358K351j299l277r93l124M778Q086J624J193L623J062k212o390
3452D45j894M29k87j573k525k399L286O082M66J428l326J045O7k570k249J901
3436a674P75J842N8k753J072L109P14l825j381J608k321k457K135O0l562J338
3420e262j798K375L428L92K709l94j646k836J439r12Q95N629J816J18n223p27
$$ [...]
##END NTUPLES=NMR SPECTRUM
##END=
