##TITLE=Analysis number 313779
Compound Code cc 27204
Project Code adrs
Chemist Name ugmt
##JCAMPDX= 6.0         $$ Bruker NMR JCAMP-DX V2.0
##DATA TYPE= NMR SPECTRUM
##DATA CLASS= NTUPLES
##ORIGIN= Bruker BioSpin GmbH
##OWNER= NMR
$$ XWIN-NMR		Version 3.5
$$ Wed Sep 21 09:22:37 2005 GMT Daylight Time (UT+1h)  MAYBRIDGE\NMR@NMR_250MHZ
##.OBSERVE FREQUENCY= 250.131544655141
##.OBSERVE NUCLEUS= ^1H
##.ACQUISITION MODE= SIMULTANEOUS (DQD)
##.ACQUISITION SCHEME= undefined
##.AVERAGES= 16
##.DIGITISER RES= 18
##SPECTROMETER/DATA SYSTEM= dpx250
##.PULSE SEQUENCE= zg30
##.SOLVENT NAME= CDCl3
##.SHIFT REFERENCE= (INTERNAL, CDCl3, 0, 16.522)
##AUDIT TRAIL= $$ (NUMBER, WHEN, WHO, WHERE, WHAT)
$$ ##TITLE= Audit trail, XWIN-NMR		Version 3.5
$$ ##JCAMPDX= 5.01
$$ ##ORIGIN= Bruker BioSpin GmbH
$$ ##OWNER= NMR
$$ C:\u/data/dgb/nmr/ADRS/9740/pdata/1/auditp.txt
$$ ##AUDIT TRAIL=  $$ (NUMBER, WHEN, WHO, WHERE, WHAT)
(   1,<2005-09-21 09:22:16.49 +100>,<MAYBRIDGE\NMR>,<NMR_250MHZ>,
      <created by zg, POWCHK disabled, PULCHK disabled
       configuration hash MD5:
       62 19 C7 07 E1 42 D1 B7 37 6C 3D D0 77 39 F9 E6
       data hash MD5: 64K
       F6 11 EE E0 2C B4 60 AB 13 EC 88 4B 6E 2B AD 49>)
(   2,<2005-09-21 09:22:29.10 +100>,<MAYBRIDGE\NMR>,<NMR_250MHZ>,
      <Start of raw data processing
       ef LB = 0.3 FT_mod = 6 PKNL = 1 SI = 32K 
       data hash MD5: 32K
       5F F6 9D 52 77 66 48 65 A0 64 CD 2F A0 D5 07 14>)
(   3,<2005-09-21 09:22:30.69 +100>,<MAYBRIDGE\NMR>,<NMR_250MHZ>,
      <apk 
       data hash MD5: 32K
       C0 A4 89 8F E6 6A DE 02 2E 83 14 37 0F 87 F5 37>)
(   4,<2005-09-21 09:22:31.36 +100>,<MAYBRIDGE\NMR>,<NMR_250MHZ>,
      <abs ABSG = 5 
       data hash MD5: 32K
       F4 AE 1B B0 5B 70 44 99 8E 83 1B D8 D7 27 2E 09>)
$$ ##END=
$$ 
$$ hash MD5
$$ 06 88 F3 F1 87 3B 2E 11 75 3E 93 F3 92 DE D1 CC
##$RELAX= 
##$RELAX= 
##$RELAX= 
##$RELAX= 
##$RELAX= 
##$RELAX= 
##$RELAX= 
$$ Bruker specific parameters
$$ --------------------------
##$DU= <C:\u>
##$EXPNO= 9740
##$NAME= <ADRS>
##$PROCNO= 1
##$TYPE= <nmr>
##$USER= <dgb>
##$AMP= (0..31)
100 100 100 100 100 100 100 100 100 100 100 100 100 100 100 100 100 100 
100 100 100 100 100 100 100 100 100 100 100 100 100 100 
##$AQSEQ= 0
##$AQ_mod= 3
##$AUNM= <au_zg>
##$AUTOPOS= <5 >
##$BF1= 250.13
##$BF2= 250.13
##$BF3= 250.13
##$BF4= 250.13
##$BF5= 500.13
##$BF6= 500.13
##$BF7= 500.13
##$BF8= 500.13
##$BYTORDA= 1
##$CFDGTYP= 0
##$CFRGTYP= 5
##$CHEMSTR= <none>
##$CNST= (0..31)
1 1 145 1 1 1 1 1 1 1 1 1 1 1 1 1 1 1 1 1 1 1 1 1 1 1 1 1 1 1 1 1 
##$CPDPRG= <>
##$CPDPRG1= <>
##$CPDPRG2= <>
##$CPDPRG3= <>
##$CPDPRG4= <mlev>
##$CPDPRG5= <mlev>
##$CPDPRG6= <mlev>
##$CPDPRG7= <mlev>
##$CPDPRG8= <mlev>
##$CPDPRGB= <>
##$CPDPRGT= <>
##$D= (0..31)
0 1 0 0 0 0 0 0 0 0.06 0 0 0 0 0 0 0.0002 0 0 0 0 0 0 0 0 0 0 0 0 0 0 
0 
##$DATE= 1127290935
##$DBL= (0..7)
120 120 120 120 120 120 120 120 
##$DBP= (0..7)
150 150 150 150 150 150 150 150 
##$DBP07= 0
##$DBPNAM0= <>
##$DBPNAM1= <>
##$DBPNAM2= <>
##$DBPNAM3= <>
$$ [...]
##$SUBNAM7= <"">
##$SUBNAM8= <"">
##$SUBNAM9= <"">
##$SW= 20.6930455092707
##$SWIBOX= (0..15)
0 0 3 0 0 0 0 0 0 0 0 0 0 0 0 0 
##$SW_h= 5175.983436853
##$TD= 65536
##$TD0= 1
##$TE= 294.16
##$TE2= 300
##$TE3= 300
##$TEG= 300
##$TL= (0..7)
0 120 120 120 120 120 120 120 
##$TP= (0..7)
150 150 150 150 150 150 150 150 
##$TP07= 0
##$TPNAME0= <>
##$TPNAME1= <>
##$TPNAME2= <>
##$TPNAME3= <>
##$TPNAME4= <>
##$TPNAME5= <>
##$TPNAME6= <>
##$TPNAME7= <>
##$TPOAL= (0..7)
0.5 0.5 0.5 0.5 0.5 0.5 0.5 0.5 
##$TPOFFS= (0..7)
0 0 0 0 0 0 0 0 
##$TUNHIN= 0
##$TUNHOUT= 0
##$TUNXOUT= 0
##$USERA1= <user>
##$USERA2= <user>
##$USERA3= <user>
##$USERA4= <user>
##$USERA5= <user>
##$V9= 5
##$VALIST= <valist>
##$VCLIST= <CCCCCCCCCCCCCCC>
##$VD= 0
##$VDLIST= <DDDDDDDDDDDDDDD>
##$VPLIST= <PPPPPPPPPPPPPPP>
##$VTLIST= <TTTTTTTTTTTTTTT>
##$WBST= 1024
##$WBSW= 4
##$XGAIN= (0..3)
0 0 0 0 
##$XL= 0
##$YL= 0
##$YMAX_a= 376662
##$YMIN_a= -409545
##$ZGOPTNS= <>
##$ZL1= 120
##$ZL2= 120
##$ZL3= 120
##$ZL4= 120
##$ABSF1= 16.522
##$ABSF2= -4.171173
##$ABSG= 5
##$ABSL= 3
##$ALPHA= 0
##$AQORDER= 0
##$ASSFAC= 0
##$ASSFACI= 0
##$ASSFACX= 0
##$ASSWID= 0
##$AUNMP= <proc_1d>
##$AZFE= 0.1
##$AZFW= 0.1
##$BCFW= 0
##$BC_mod= 0
##$BYTORDP= 0
##$COROFFS= 0
##$CY= 12.5
##$DATMOD= 1
##$DC= 0
##$DFILT= <>
##$DTYPP= 0
##$F1P= 14.0000005364418
##$F2P= -0.99999901652339
##$FCOR= 0.5
##$FTSIZE= 32768
##$FT_mod= 6
##$GAMMA= 0
##$GB= 0
##$INTBC= 1
##$INTSCL= 1
##$ISEN= 128
##$LB= 0.3
##$LEV0= 0
##$LPBIN= 0
##$MAXI= 10000
##$MC2= 0
##$MEAN= 0
##$ME_mod= 0
##$MI= 0
##$NCOEF= 0
##$NC_proc= -2
##$NLEV= 6
##$NOISF1= 0
##$NOISF2= 0
##$NSP= 0
##$NTH_PI= 0
##$NZP= 0
##$OFFSET= 16.522
##$PC= 1
##$PHC0= -75.06416
##$PHC1= 4.488323
##$PH_mod= 1
##$PKNL= yes
##$PPARMOD= 0
##$PSCAL= 4
##$PSIGN= 0
##$REVERSE= no
##$SF= 250.13
##$SI= 32768
##$SIGF1= 0
##$SIGF2= 0
##$SINO= 400
##$SIOLD= 32768
##$SREGLST= <1H.CDCl3>
##$SSB= 0
##$STSI= 32768
##$STSR= 0
##$SW_p= 5175.98343685301
##$SYMM= 0
##$S_DEV= 0
##$TDeff= 65536
##$TDoff= 0
##$TI= <Analysis number 999999
Compound Code 99
Book Reference 9
Project Code 9>
##$TILT= no
##$TM1= 0
##$TM2= 0
##$TOPLEV= 0
##$USERP1= <user>
##$USERP2= <user>
##$USERP3= <user>
##$USERP4= <user>
##$USERP5= <user>
##$WDW= 1
##$XDIM= 32768
##$YMAX_p= 401312910
##$YMIN_p= -34506
$$ End of Bruker specific parameters
$$ ---------------------------------
##NTUPLES= NMR SPECTRUM
##VAR_NAME=  FREQUENCY,     SPECTRUM/REAL,   SPECTRUM/IMAG
##SYMBOL=    X,             R,               I
##VAR_TYPE=  INDEPENDENT,   DEPENDENT,       DEPENDENT
##VAR_FORM=  AFFN,          ASDF,            ASDF
##VAR_DIM=   32768,         32768,           32768
##UNITS=     HZ,            ARBITRARY UNITS, ARBITRARY UNITS
##FACTOR=    0.157963299565203, 1,           1
##FIRST=     4132.6476996994, 0,             0
##LAST=      -1043.33573715361, 0,           0
##MIN=       -1043.33573715361, -34506,      0
##MAX=       4132.6476996994, 401312910,     0
$$ Real data points
##PAGE= N=1
##DATA TABLE= (X++(R..R)), XYDATA
$$ [...]
$$ plain form
15856 3185 -2781 -8607 -5665 -1822 -2084 -6479 -4877 -4095 -8923 -7841 -6882 -1413 3167 -911 -6460
15841 -6460 -8159 -10358 -11800 -4018 -6795 -9681 -12993 -13186 -10351 -6606 -9028 -12675 -11433 -5941 -2368
15826 -2368 -1309 1315 1746 -4426 -534 3080 2088 4846 6151 4762 -236 1719 6191 5742 3678
15811 3678 -175 -1087 -1813 -7983 -8855 -11987 -10827 -6841 -3763 -8664 -13287 -19674 -20858 -13821 -19996
15796 -19996 -22896 -11880 -852 3281 -675 -4754 -5993 -2337 -4503 -4898 -2712 -3426 -2382 -929
15782 -929 -5863 -3061 4491 3196 -9050 -19313 -18792 -14788 -19385 -20319 -18635 -15134 -15113 -18558 -10802
15767 -10802 -7365 -5252 -2021 -5834 -9184 -7635 -9707 -7608 -713 846 -1431 -5094 -6530 -6057 -6493
15752 -6493 -8391 -15745 -17083 -11165 -6339 -1266 3813 2231 -5145 -4511 1661 8866 3335 -3617 -6101
$$ packed form
15856C185n966n826K942L843k62m395J602P82m828J082R59N469M580m078n549
15841f460j699k199j442P782k777k886l312j93K835L745k422l647J242N492L573
15826b368J059K624M31o172L892L614r92K758J305j389m998J955M472m49k064
15811C678l853r12p26o170q72l132J160L986L078m901m623o387j184P037o175
15796a9996k900J1016J1028M133l956m079j239L656k166l95K186p14J044J453
15782i29m934K802P552j295j2246j0263N21M004m597r34J684L501K1l445P756
15767a0802L437K113L231l813l350J549k072K099O895J559k277l663j436M73m36
15752f493j898p354j338N918M826N073N079j582p376O34O172P205n531o952k484
$$ plain form
15737 -6101 -9855 -8023 -218 4030 6990 10684 9966 7514 11026 9514 -1699 -7326 -2375 -993 -2930
15722 -2930 -1271 -3422 -8732 524 -1638 -11088 -8629 -5308 -5729 -468 -3335 -915 4308 862 -5477
15707 -5477 -4158 -8979 -14694 -14933 -15401 -13827 -12074 -8728 -2775 -7390 -16178 -19884 -17411 -14638 -8685
15692 -8685 -5624 -3353 -9098 -13688 -10899 -1678 -1114 -4265 -9957 -5096 -2585 -6364 -9584 -9326 -5948
15677 -5948 -8734 -5953 1184 7682 1591 -4620 -8516 -9652 -12290 -9954 -9463 -10121 -10402 -3986 576
15662 576 8215 8400 2811 7860 10069 7320 2952 9420 6505 4299 -801 -4071 374 5972 6340
15647 6340 4359 1998 4002 1672 4097 1904 2882 8494 8149 12705 6864 3113 152 -3329 1154
15632 1154 1991 -3984 118 4481 3479 1395 -1956 -11808 -11542 -9981 -9406 -8210 -11118 -14734 -14744 -15992
$$ packed form
15737f101l754J832P805M248K960L694p18k452L512j512j1213n627M951J382j937
15722b930J659k151n310R256k162r450K459L321m21N261k867K420N223l446o339
15707e477J319m821n715k39m68J574J753L346N953m615q788l706K473K773N953
15692h685L061K271n745m590K789R221N64l151n692M861K511l779l220K58L378
15677e948k786K781P137O498o091o211l896j136k638K336M91o58k81O416M562
15662E76P639J85n589N049K209k749m368O468k915k206n100l270M445N598L68
15647F340j981k361K004k330K425k193R78N612l45M556n841l751k961l481M483
15632A154Q37n975M102M363j002k084l351r852K66J561N75J196k908l616j0j248
$$ plain form
15616 -15992 -10633 -8686 -907 -1669 -7511 -10103 -13332 -15139 -16197 -8891 -2072 -2015 3016 2254 -211
15601 -211 2331 3804 6682 9049 3250 1487 -859 -2063 2884 -968 -6846 -4518 -4265 -3263 -7943
15586 -7943 -5574 -2475 -4823 -1367 4548 4422 -3322 466 2352 -982 -4297 -6848 -3697 245 3966
15571 3966 4304 2055 1894 -4648 -7765 -10222 -6040 1790 3848 -4515 -6397 -10469 -16563 -11993 -5569
15556 -5569 -1947 1551 -5042 -8567 -8909 -8691 -8606 -9664 -8298 -3815 492 1808 -4 -4335 -6879 -9624
15540 -9624 -6217 -10608 -13066 -6241 -486 -2012 -5913 -9305 -11093 -7474 -645 1186 -500 -5899 -8403
15525 -8403 -11002 -8399 -3775 -8441 -14901 -10499 -8514 -11098 -8883 -10913 -9413 -9185 -10218 -9801 -5069
15510 -5069 -397 8848 11198 3791 394 -6156 -11765 -10404 -9150 -12468 -13890 -6298 1389 9791 9325
$$ packed form
15616a5992N359J947P779p62n842k592l229j807j058P306O819N7N031p62k465
15601b11K542J473K878K367n799j763k346j204M947l852n878K328K53J002m680
15586g943K369L099k348L456N915j26p744L788J886l334l315k551L151L942L721
15571C966L38k249j61o542l117k457M182P830K058q363j882m072o094M570O424
15556e569L622L498o593l525l42K18Q5j058J366M483M307J316j812m331k544k745
15540i624L407m391k458O825N755j526l901l392j788L619O829J831j686n399k504
15525h403k599K603M624m666o460M402J985k584K215k030J500K28j033M17M732
15510e069M672R245K350p407l397o550n609J361J254l318j422P592P687Q402m66
$$ plain form
15495 9325 1429 1192 5739 2821 2064 -5205 -5620 -8582 -11391 -11676 -6446 -4267 -2486 871 -3170 -5377
15479 -5377 -2279 -1492 -1461 513 2852 -817 -514 -6365 -9874 -10627 -6625 -6966 -8153 447 4258 -2297
15463 -2297 -2169 -4230 -3373 -4975 -563 4303 -413 -1910 -2661 -2974 -1296 -5099 -8396 -8805 1944 -571
15447 -571 -9588 -7366 -3358 -4029 -4123 3279 3660 425 3713 4905 3970 1802 1370 1283 2485 1034 -563
15430 -563 -5647 -8441 -3440 -916 1110 -848 4184 4593 -1432 851 1401 -1116 2593 5000 -2150
15415 -2150 -4422 -4571 -4541 -2108 -1174 -1962 145 6221 4610 11007 12644 11330 7808 8746 2541 -22
15399 -22 -5002 -10816 -6251 -5978 -3332 -8704 -10054 -2731 -1054 -3938 -8831 -12333 -17594 -22743 -17102
15384 -17102 -9534 -448 -994 -1380 -1658 -6192 -5231 -6297 -4818 -3393 -5906 -1329 -3240 -3978 -1959 -2584
$$ packed form
15495I325p896k37M547k918p57p269m15k962k809k85N230K179J781L357m041k207
15479e377L098P87L1J974K339l669L03n851l509p53M002l41j187Q600L811o555
15463b297J28k061Q57j602M412M866m716j497p51l13J678l803l297m09J0749k515
15447e71r017K222M008o71r4P402L81l235L288J192r35k168m32q7J202j451j597
15430e63n084k794N001K524K026j958N032M09o025K283N50k517L709K407p150
15415b150k272j49L0K433R34p88K107O076j611O397J637j314l522R38o205k563
15399b2m980n814M565K73K646n372j350P323J677k884m893l502n261n149N641
15384a7102P568R086n46l86k78m534R61j066J479J425k513M577j911p38K019o25
$$ plain form
15368 -2584 -7378 -3025 3976 7176 7734 1506 -3218 -7119 -8813 -10659 -7100 -8341 -10418 -9651 -10612
15353 -10612 -10198 -19306 -18931 -15547 -4007 3863 8064 8160 5517 6357 10539 9462 3484 289 2398
15338 2398 -1646 -823 -4314 -1385 3128 4535 1356 5168 6802 265 -4890 -5018 -5785 -4466 -4999 -1202
15322 -1202 -471 3786 4433 3672 851 4613 3385 -1096 3110 -2144 -5311 -3674 -79 1740 -4491
15307 -4491 -1197 -5595 -11084 -5780 -2946 -6169 -14204 -11414 -7421 -6576 -277 -1335 -5859 -6033 1510
15292 1510 9973 11191 7874 -2235 -4367 -3216 686 -263 -3081 -315 141 614 -1373 -2095 -410
15277 -410 -3706 -1770 2269 -3779 1950 2210 -1817 -4825 -7584 -6834 -2098 4115 -2518 -6033 -3200
15262 -3200 3983 2234 -2451 -1966 -4770 -5214 -12748 -7841 -6776 -5728 -4374 -7367 -10088 -5487 -3465
$$ packed form
15368b584m794M353P001L200N58o228m724l901j694j846L559j241k077P67r61
15353a0612M14r108L75L384J1540P870M201R6k643Q40M182j077n978l195K109
15338B398m044Q23l491K929M513J407l179L812J634o537n155j28p67J319n33L797
15322a202P31M257O47p61k821L762j228m481M206n254l167J637L595J819o231
15307d491L294m398n489N304K834l223q035K790L993Q45O299j058m524j74P543
15292A510Q463J218l317j0109k132J151L902r49k818K766M56M73j987p22J685
15277d10l296J936M039o048N729K60m027l008k759P50M736O213o633l515K833
15262c200P183j749m685M85k804m44p534M907J065J048J354k993k721M601K022
$$ plain form
15247 -3465 -2181 -3873 -1580 2915 1039 912 2324 -4103 -4195 -5407 -4430 -3305 -8325 -11434 -6774 -520
15231 -520 -1805 -11879 -10570 -4071 -296 1808 3424 -1561 -4559 2067 -1556 2120 -722 -1169 2810
15216 2810 4021 1020 -2612 -6820 -3716 716 4730 151 -2690 -1500 -3513 -6616 -5137 -4777 2771
15201 2771 2458 2918 4284 2280 3315 2138 4618 643 -3768 -4874 -2444 -3720 -7906 617 4946
15186 4946 5243 -367 -11372 -15873 -11235 -9692 -7515 -6950 -9027 -12065 -8148 -3203 2595 -990 -8408
15171 -8408 -5455 -6536 -12314 -10008 -3686 -3248 -1776 -1857 -1171 -5485 -9856 -10485 -12986 -11061 -7345 -3658
15155 -3658 -5409 -7179 213 1351 1275 -3777 -7021 -5621 1390 -99 -5660 -4978 -4 -6795 -3147
15140 -3147 2161 2837 2482 3472 1466 1805 -339 -4606 -1620 327 -10218 -10844 -2502 -3939 -4041 -7449
$$ packed form
15247c465J284j692K293M495j876j27J412o427r2j212R77J125n020l109M660O254
15231e20j285j0074J309O499L775K104J616m985k998O626l623L676k842m47L979
15216B810J211l001l632m208L104M432M014m579k841J190k013l103J479L60P548
15201B771l13M60J366k004J035j177K480l975m411j106K430j276m186Q523M329
15186D946K97n610j1005m501M638J543K177N65k077l038L917M945N798l585p418
15171h408K953j081n778K306O322M38J472q1O86m314m371o29k501J925L716L687
15155c658j751j770P392J138p6n052l244J400P011j489n561O82M974o791L648
15140c147N308O76l55R90k006L39k144m267K986J947j0545o26Q342j437j02l408
$$ plain form
15124 -7449 -9003 -6999 -3096 -7276 -7755 -8510 -6311 -2692 -4472 -2688 1746 1391 -2173 2033 5417
15109 5417 8312 201 -2218 1827 -57 -3466 -3594 1979 6845 1927 -255 5136 1397 1001 -321
15094 -321 -939 -843 -12706 -17456 -19665 -10423 -1084 -2282 -4268 -3390 -3671 -8546 -12859 -12205 -12974 -7914
15078 -7914 -3185 42 -5704 -5700 -10004 -8477 -5264 -2339 -3898 -8068 -6987 -4564 -5026 -7481 -10350 -9918
15062 -9918 -5897 -1620 -9797 -9160 -1850 2990 1465 -5646 -14911 -12212 -4182 -1660 -3913 -3491 -887
15047 -887 1674 999 -3282 -2211 3046 -2715 -7535 -11383 -9195 -3995 -6333 -4119 -5060 -1083 1956
15032 1956 1919 1673 -6017 -13736 -12891 -10965 -9412 -7781 -8065 -7195 -11907 -16188 -13629 -12615 -510 499
15016 499 197 -1035 -717 3895 -614 -1659 324 4404 3799 6673 -273 -3790 -4175 -4416 -8123 -9767
$$ packed form
15124g449j554K004L903m180m79p55K199L619j780J784M434l55l564M206L384
15109E417K895q111k419M045j884l409j28N573M866m918k182N391l739l96j322
15094c21o18R6j1863m750k209R242R339j198j986Q78k81m875m313O54p69N060
15078g914M729L227n746Mm304J527L213K925j559m170J081K423m62k455k869M32
15062i918M021M277q177O37P310M840j525p111r265K699Q030K522k253M22K604
15047h87K561o75m281J071N257n761m820l848K188N200k338K214r41L977L039
15032A956l7k46p690p719Q45J926J553J631k84Q70m712m281K559J014J2105J009
15016D99l02j232L18M612m509j045J983M080o05K874o946l517l85k41l707j644
$$ plain form
15000 -9767 -8597 -7343 -2404 1032 1217 986 2424 2216 4761 7184 6588 -2135 -9749 -8837 -6630 1815
14984 1815 4849 1549 3179 4249 3558 2188 -5988 -1838 -3500 -4500 778 3099 224 -638 -4441
14969 -4441 -6119 -4877 -6700 -2243 -1846 506 7519 9096 3108 3430 975 -9127 -11371 -3444 -299
14954 -299 745 -4492 -6265 -5260 -7884 -13130 -13722 -10321 -6097 -4188 -4651 -5535 -7703 -1205 -3372 -10564
14938 -10564 -12870 -6133 -3217 -5872 -961 -3009 -9956 -8841 -5335 -4175 -691 -2933 3599 6993
14924 6993 8146 3200 -2359 -7159 -9559 -10938 -15466 -19728 -9253 -8392 -5989 -1401 -4663 -10879 -12919
14909 -12919 -13590 -15974 -12820 -3509 -2264 -1821 2815 4703 2328 5067 6271 1878 3251 4241 -3907
14894 -3907 -7953 -5400 -451 -2441 -5009 -8496 -6612 -434 3524 301 -3620 -9174 -8067 -13618 -9872
$$ packed form
15000i767J170J254M939L436J85k31J438k08K545K423n96q723p614R12K207Q445
14984A815L034l300J630J070o91j370q176M150j662j000N278K321k875q62l803
14969d441j678J242j823M457L97K352P013J577n988L22k455j0102k244P927L145
14954b99J044n237j773J005k624n246n92L401M224J909m63q84k168O498k167p192
14938a0564k306O737K916k655M911k048o947J115L506J160L484k242O532L394
14924F993J153m946n559m800k400j379m528m262J0475Q61K403M588l262o216k040
14909a2919o71k384L154R311J245M43M636J888k375K739J204m393J373R90q148
14894c907m046K553M949j990k568l487J884O178L958l223l921n554J107n551L746
$$ plain form
14879 -9872 -9021 -6179 -2424 2858 7201 4269 11265 8542 4851 -2961 -4166 -335 -1563 -7248 -6339
14864 -6339 -5871 -397 369 -5981 -10851 -10226 -13210 -11643 -7641 -9676 -13700 -15073 -9560 -4420 -10744
14849 -10744 -15942 -17140 -18181 -14644 -8212 -9658 -18105 -16702 -12483 -15274 -17557 -17439 -13944 -8069 -4418
14834 -4418 -6816 -12068 -5354 1920 2261 -1136 -2121 -8565 -15332 -14482 -10357 -1696 -2367 -3639 -929 -926
14818 -926 -9675 -12795 -9384 -3517 -419 3072 2819 4034 3546 6353 9285 5858 1837 630 1369 1498
14802 1498 1231 514 -2523 -3564 -6426 -4597 -6339 -10524 -10751 -8600 884 1692 -3338 -8983 -13071 -8191
14786 -8191 -2366 7106 6169 2882 4272 6247 1292 -2395 -6260 -6866 3569 4359 -236 -3799 -873
14771 -873 2874 2765 -4999 -15583 -16401 -11712 -8218 -2074 -142 -374 -3971 -1299 -3093 -7147 -10570
$$ packed form
14879i872Q51K842L755N282M343k932O996k723l691p812j205L831j228n685R09
14864f339M68N474P66o350m870O25k984J567M002k035m024j373N513N140o324
14849a0744n198j198j041L537O432j446q447J403M219k791k283J18L495N875L651
14834d418k398n252O714P274L41l397r85o444o767Q50M125Q661o71j272K710L
14818i26q749l120L411N867L098L491k53J215m88K807K932l427m021j207P39J29
14802A498k67p17l037j041k862J829j742m185k27K151R484Q08n030n645m088M880
14786h191N825R472r37l287J390J975m955l687l865o06J0435P90m595l563K926
14771h73L747j09p764j0584q18M689L494O144J932k32l597K672j794m054l423
$$ plain form
14756 -10570 -9056 -7220 -2381 -1770 926 -1544 4228 -159 94 4073 11255 9588 5800 4139 6346
14741 6346 7078 3913 3438 6296 7326 1825 -2864 -4796 -11714 -15418 -12816 -11026 -5899 -3702 -2556
14726 -2556 -1257 -3209 -3129 -2597 -6104 -9002 -4296 8225 -210 -8145 -1125 7592 2183 -3597 -5121
14711 -5121 -323 4999 11848 10205 1951 -1807 -4156 3424 8977 8655 1886 423 6567 9601 5572
14696 5572 1639 6587 8681 4169 430 1779 -959 -10572 -20843 -20880 -15320 -5685 -7617 -10031 -15855
14681 -15855 -15733 -9659 -5439 -1714 1318 -1969 -1435 -2153 -2082 -3256 2553 1453 -3990 -2546 -597 970
14665 970 511 -2734 -9016 -6014 -9873 -15606 -9968 -16331 -14739 -10688 -7270 -6755 -745 5505 8061
14650 8061 5931 -656 -2726 -1128 4342 5178 7736 2898 -2567 526 -2528 -2394 -4938 -4490 -1329
$$ packed form
14756a0570J514J836M839O11K696k470N772m387K53L979P182j667l788j661K207
14741F346P32l165m75K858J030n501m689j932o918l704K602J790N127K197J146
14726b556J299j952Q0N32l507k898M706J2521q435p935P020Q717n409n780j524
14711e121M798N322O849j643q254l758k349P580N553l22o769j463O144L034m029
14696E572l933M948K094m512l739J349k738r613j0271l7N560R635j932k414n824
14681a5855J22O074M220L725L032l287N34p18P1j174N809j100n443J444J949J567
14665I70m59l245o282L002l859n733N638o363J592M051L418N15O010O250K556
14650H061k130o587k070J598N470Q36K558m838n465L093l054J34k544M48L161
$$ plain form
14635 -1329 4659 3355 -4702 -4989 -12131 -11706 -8325 -1592 -956 -6019 -14127 -14246 -6763 -3041 -9687 -15175
14619 -15175 -10432 -2225 1920 -688 -4272 -4941 -7451 -7734 -10510 -9108 -5741 -8818 -9097 -5809 -927
14604 -927 -1388 -721 -1855 -2924 -5616 -6407 -5091 -5246 -10789 -17546 -15891 -13746 -14531 -9932 -6544 -5193
14588 -5193 -6520 -5633 -2610 -4469 -5204 -7107 -7702 -10087 -6683 -3802 -4568 -1299 3878 2873 3527 5695
14572 5695 2226 -262 -2792 -4258 -1310 -2589 -1055 -2692 -7145 -9104 -8374 -2649 476 1070 -444
14557 -444 -5038 -6966 -4495 -5277 -10052 -3129 4098 3442 -244 -5287 -5711 -9263 -13771 -4615 -1838 -13728
14541 -13728 -5974 -1288 -225 -837 4961 4549 -1946 -8140 -9460 -9442 -7762 -7854 -6123 -6487 -6755 -5400
14525 -5400 -3222 -9168 -6842 -9365 -11192 -8030 -675 3555 1462 868 2382 -5392 -9489 -6908 -9197
$$ packed form
14635a329N988j304q057k87p142M25L381O733O36n063q108j19P483L722o646n488
14619a5175M743Q207M145k608l584o69k510k83k776J402L367l077k79L288M882
14604i27m61O67j134j069k692p91J316j55n543o757J655K145p85M599L388J351
14588e193j327Q87L023j859p35j903n95k385L404K881p66L269N177j005O54K168
14572E695l469k488k530j466K948j279J534j637m453j959P30N725L125N94j514
14557d44m594j928K471p82m775O923P227o56l686n043m24l552m508R156K777j1890
14541a3728P754M686J063o12N798m12o495o194j320J8J680r2J731l64k68J355
14525e400K178n946K326k523j827L162P355M230k093n94J514p774m097K581k289
$$ plain form
14510 -9197 -2262 -3866 -14954 -13018 -17164 -19123 -16616 -16176 -21251 -20248 -16738 -12012 -4992 -1457 -3335
14495 -3335 -3986 -2253 -675 5641 6199 5191 8621 6408 4341 7526 4403 -6200 -7171 -4757 -3427
14480 -3427 -2268 -127 2811 2339 -918 -8495 -11562 -12251 -12246 -6702 -7691 -6772 -8285 -2166 7003 8809
14464 8809 -4724 -12465 -16514 -15066 -15027 -15252 -10550 -8550 -2254 7144 7357 3825 -3004 -4451 -3782 -4264
14448 -4264 3493 7873 3901 4959 8397 2960 1572 5744 5507 1177 -2484 -3564 -231 -19 234
14433 234 -344 -3257 -6172 -9483 -6096 -120 3059 6456 9498 5255 5766 5249 2364 -418 2396 292
14417 292 1231 -2645 -4731 -6073 -5844 -9043 -7766 1857 6825 -2064 -3959 -4702 -2968 -1326 -593 -6842
14401 -6842 -19858 -19700 -8783 -8506 -7842 -7786 -9071 -9309 -11647 -5609 -338 2339 3938 1946 -892 -6246
$$ packed form
14510i197O935j604j1088J936m146j959K507M40n075J003L510M726P020L535j878
14495c335o51J733J578O316N58j008L430k213k067L185l123j0603r71K414J330
14480c427J159K141K938m72l257p577l067o89NN544r89R19j513O119R169J806
14464H809j3533p741m049J448L9k25M702K000O296R398K13l532o829j447O69m82
14448d264P757M380l972J058L438n437j388M172k37m330l661j080L333K12K53
14433B34n78k913k915l311L387N976L179L397L042m243N11n17k885k782K814k104
14417B92R39l876k086j342K29l199J277R623M968q889j895p43J734J642P33o249
14401f842j3016J58J0917K77O64N6j285k38k338O038N271K677J599j992k838n354
$$ plain form
14385 -6246 -11282 -14008 -11348 -5284 -2524 -3439 -632 6479 8058 2117 -4933 -5307 -156 4883 3650
14370 3650 11304 11891 7402 2825 -4279 -9444 -8945 -7132 -6291 -2282 988 -2536 -6706 -6758 -10918 -9697
14354 -9697 -11478 -16754 -11638 -10848 -13224 -10321 -877 -3624 -6412 -5692 -10656 -11159 -9785 -4612 -1244
14339 -1244 -7254 -10162 -5516 -6073 -2408 -2281 -7718 -13576 -11967 -9601 -7657 -3132 -665 -232 1961
14324 1961 -296 -8241 -15897 -16708 -15881 -12567 -8890 -3051 4408 -2484 -13526 -16079 -16334 -17037 -12045
14309 -12045 -7025 -1948 -3496 -7411 -5075 1042 -322 -3848 -6616 -6868 -5854 -8261 -6835 -2946 -1890
14294 -1890 5343 2084 2329 -2983 -3304 -4716 -4059 -1602 -6156 -11147 -14433 -11919 -14811 -20924 -15789
14279 -15789 -9774 -3812 -7393 -11815 -3966 2162 4527 6126 9548 3505 -5174 -116 473 -3661 -2018
$$ packed form
14385f246n036k726K660O064K760r15K807P111J579n941p050l74N151N039j233
14370C650P654N87m489m577p104n165M99J813Q41M009L270l524m170n2m160J221
14354i697j781n276N116P90k376K903R444k747k788P20m964n03J374N173L368
14339a244o010k908M646n57L665J27n437n858J609K366J944M525K467M33K193
14324A961k257p945p656q11Q27L314L677N839P459o892j1042k553k55p03M992
14309a2045N020N077j548l915K336O117j364l526k768k52J014k407J426L889J056
14294a890P233l259K45n312l21j412O57K457m554m991l286K514k892o113N135
14279a5789O015N962l581m422P849O128K365J599L422o043q679N058N89m134J643
$$ plain form
14264 -2018 -1903 1125 7391 9411 3395 -257 5813 12441 9968 2877 1473 8716 5538 -5018 -8162
14249 -8162 -5612 -251 -245 1657 -1127 -6315 -7578 2276 2531 -4244 -2881 4484 2573 5214 6911 3635
14233 3635 -1369 -1633 -3560 -4965 -438 140 -4260 -3495 -7810 -8349 -5169 2713 5269 4845 -66 -271
14217 -271 4784 8105 11418 8129 2467 -3972 -6588 -5861 -11678 -11360 -6698 -987 -2394 -650 2392
14202 2392 2368 -3322 -3993 -5238 -2325 -1455 -6386 -9749 -16873 -17819 -11183 -9039 -12674 -12342 -13226 -15995
14186 -15995 -17514 -15928 -10800 -670 3859 3187 -741 2032 3603 -1211 -3553 -7847 -7352 -9438 -6186
14171 -6186 -5966 -5134 351 2536 6444 6780 1220 292 722 -1933 -2508 -324 -1134 -1134 -4630 -8156 -6637
14154 -6637 449 2575 -911 -493 8076 10752 7920 7123 6144 4293 4142 6727 5194 4627 2963 -1157
$$ packed form
14264b018J15L028O266K020o016l652O070O628k473p091j404P243l178j0556l144
14249h162K550N361OJ902k784n188j263R854K55o775J363P365j911K641J697l276
14233C635n004k64j927j405M527N78m400P65m315n39L180P882K556m24m911k05
14217b71N055L321L313l289n662o439k616P27n817L18M662N711j407J744L042
14202B392k4n690o71j245K913Q70m931l363p124r46O636K144l635L32q84k769
14186a5995j519J586N128J0130M529o72l928K773J571m814k342m294M95k086L252
14171f186K20Q32N485K185L908L36n560r28M30k655n75K184q10%l496l526J519
14154f637P086K126l486M18Q569K676k832p97r79j851j51K585j533n67j664m120
$$ plain form
14138 -1157 -3258 -2185 -7616 -6095 -6400 -3775 2175 3155 4078 3161 2365 -3143 -10162 -10496 -8997 -15387
14122 -15387 -12522 -17852 -16972 -10943 -2190 -1720 -1534 -932 2387 2526 -1129 3425 5598 1298 -5606 -3833
14106 -3833 -2871 -4546 -11305 -11248 -7253 -1557 612 1368 -4275 -12056 -10283 -8148 -4308 -3788 -6659 -8063
14090 -8063 -7532 -4617 4266 7194 7144 13253 9313 2059 3338 -1534 -2289 -3220 -3991 -1663 -1987 88
14074 88 2155 -4707 -10073 -2997 2788 10641 7093 -1065 -1048 3740 3556 1181 1310 1232 385 -554 -3593
14057 -3593 -6617 -5685 -2230 -7076 -7080 -4120 -3216 4205 3737 3951 1816 3390 11385 9158 7116 7112 1610
14040 1610 -1928 -1444 -4118 -2971 -5761 -5266 -424 6027 3706 -2179 -11351 -8431 -4301 -6585 -7400
14025 -7400 -6873 -10187 -10834 -8705 -72 2856 4540 2949 2143 -1217 -6908 -7766 -7140 -15887 -15891 -15831 -18528
$$ packed form
14138a157k101J073n431J521l05K625N950R80R23r17p96n508p019l34J499o390
14122a5387K865n330Q80O029Q753M70J86O02L319J39l655M554K173m300o904J773
14106c833R62j675o759N7L995N696K169P56n643p781J773K135L840N20k871j404
14090h063N31K915Q883K928n0O109l940p254J279m872p55r31p71K328l24K075
14074H8K067o862n366P076N785P853l548q158J7M788j84k375J29p8q47r39l039
14057c593l024R32L455m846mK960R04P421m68K14k135J574P995k227k042mn502
14040A610l538M84k674J147k790M95M842O451k321n885r172K920M130k284q15
14025g400N27l314o47K129Q633K928J684j591q06l360n691q58O26q747mO0k697
$$ plain form
14008 -18528 -20013 -18254 -10745 -4120 -3969 -4630 -1611 -2161 -1722 1866 2830 -2057 -1277 827 3777 -174
13992 -174 -3389 -2692 -3639 -424 804 -273 1050 3690 4225 2321 -240 -1182 -5554 -10099 -12748 -12265
13976 -12265 -15700 -10062 -9431 -9755 -12787 -12964 -8345 -11462 -11275 -11375 -5034 -361 -2723 -11508 -13461 -11956
13960 -11956 -3422 3928 4100 -1596 -5553 -10758 -16305 -9402 -5770 738 218 2621 6278 2903 -5858
13945 -5858 -2048 -5645 -8024 -7720 -1571 1153 3246 -188 -8418 -9615 -7141 -9416 -7971 194 6492
13930 6492 4658 6717 8249 -1106 -1123 -4108 -2902 -4139 -5789 -4904 -3491 -3187 -3297 -2724 -1661 2717
13914 2717 -4265 -6382 -3278 1593 4136 -1339 -4229 -5134 -4455 -1549 6471 3708 2325 -2473 -3426
13899 -3426 6328 6635 -2974 -12000 -8683 -8365 -3461 -7170 -7147 -8651 -8232 -5085 -6454 -11152 -11201 -11793 -10109
$$ packed form
14008a8528j485J759P509O625J51o61L019n50M39L588R64m887P80K104K950l951
13992a74l215O97r47L215J228j077J323K640N35j904k561r42m372m545k649M83
13976a2265l435N638O31l24l032j77M619l117J87j00O341M673k362q785j953J505
13960a1956Q534P350J72n696l957n205n547O903L632O508n20K403L657l375q761
13945e858L810l597k379L04O149K724K093l434q230j197K474k275J445Q165O298
13930F492j834K059J532r355j7k985J206j237j650Q85J413L04j10N73J063M378
13914B717o982k117L104M871K543n475k890r05O79K906Q020k763j383m798r53
13899c426R754L07r609r026L317L18M904l709K3j504M19L147j369m698m9n92J684
$$ plain form
13882 -10109 -7985 453 7964 2795 -4400 -4960 1540 4122 277 2917 -1953 -5608 -9112 -10332 -10467
13867 -10467 -8612 -1712 -604 -5928 -4504 -152 -5802 -4510 -4603 -5121 -1467 2788 5150 74 -814
13852 -814 -1131 515 5353 5645 719 -2902 -4656 -2462 -418 1821 1532 1689 3856 4656 -4182 -11327
13836 -11327 -11311 -14346 -12874 -17686 -12882 -9323 -7875 -6986 -6894 -9267 -10405 -13618 -13120 -4086 -436 502
13820 502 -207 -4487 -3104 -2948 119 -172 -363 -67 4532 3112 -2885 1175 4230 1444 3593 5417
13804 5417 6281 7919 4431 806 1735 -4055 -10925 -10927 -11834 -7171 439 4134 6822 6906 1300 -9159
13788 -9159 -10707 -4510 -4284 -3495 -7514 -10806 -16066 -13917 -7581 -8286 -9909 -2820 5364 6416 8783
13773 8783 10160 6060 4170 -862 -5216 -8376 -14903 -10608 -8869 -4293 -8089 -6647 -2635 -3822 -134
$$ packed form
13882a0109K124Q438P511n169p195n60O500K582l845K640m870l655l504j220j35
13867a0467J855O900J108n324J424M352n650J292r3n18L654M255K362n076q88
13852h14l17J646M838K92m926l621j754K194K044K239k89J57K167Q00q838p145
13836a1327J6l035J472m812M804L559J448Q89R2k373j138l213M98R034L650R38
13820E02p09m280J383J56L067k91j91K96M599j420n997M060L055k786K149J824
13804E417Q64J638l488l625R29n790o870kr07M663P610L695K688Q4n606j0459
13788i159j548O197K26P89m019l292n260K149O336p05j623P089Q184J052K367
13773H783J377m100j890n032m354l160o527M295J739M576l796J442M012j187L688
$$ plain form
13758 -134 -12596 -19505 -14938 -10940 -10135 -5296 -9826 -17196 -17232 -11314 -3836 -608 -587 2930 3403 525
13742 525 2238 2845 3519 -2808 -2763 -5251 -3708 -297 102 -981 2728 3957 -2567 -3111 -5099 1349
13726 1349 2348 -5227 -8203 -4525 -2451 -3556 -1037 1862 5047 4875 -888 -3925 -6637 -5801 -5516 1877
13710 1877 5701 -1112 99 -4095 -3822 -4291 -5582 -6368 -15690 -15043 -13750 -13159 -14961 -15838 -13524 -13187
13694 -13187 -11868 -8481 -1102 -3449 -5679 -4883 -3510 -2184 -3566 -5103 -5207 1650 -1398 -529 -266
13679 -266 -5403 -10182 -7872 -648 -58 -4253 -11861 -10356 -6967 -2510 2 334 4323 5839 4054
13664 4054 443 2297 -1389 2644 2024 -7095 -5582 -4307 -6563 -4360 -2263 1772 -1430 1848 759
13649 759 -9193 -8610 -10292 -12021 -11279 -4809 10520 12195 1912 -5074 1071 2512 7671 8733 10358
$$ packed form
13758a34j2462o909M567L998Q05M839m530p370l6N918P478L228K1L517M73k878
13742E25J713O07O74o327M5k488J543L411L99j083L709J229o524n44j988O448
13726A349R99p575k976L678K074j105K519K899L185j72n763l037k712Q36K85P393
13710A877L824o813J211m194K73m69j291p86r322O47J293N91j802q77K314L37
13694a3187J319L387P379k347k230P96J373J326j382j537j04O857l048Q69K63
13679b66n137m779K310P224N90m195p608J505L389M457K512L32L989J516j785
13664D054l611J854l686M033o20r119J513J275k256K203K097M035l202L278j089
13649G59r952N83j682j729P42O470J5329J675j0283o986O145J441N159J062J625
$$ plain form
13634 10358 10470 10295 8429 6172 3806 1879 1105 4253 6068 8890 636 -4275 -2921 -5642 -10962
13619 -10962 -7440 -447 2492 3883 1864 -166 3700 4525 -556 -1476 6016 9301 7898 1485 1853
13604 1853 2442 1736 427 -6321 -2033 -3751 520 6382 2385 527 1723 832 422 -5257 -2539 -957
13588 -957 -3696 -2559 4864 5355 1442 -1107 -6948 -4343 382 6692 8055 3262 2131 5640 6264
13573 6264 394 625 -8657 -12831 -8657 -2703 -4024 1109 -1702 -2110 -5771 -6957 -6934 -10347 -9403 -15239
13557 -15239 -12004 -7858 -5594 -5653 -10751 -14788 -8460 -6488 -6553 1453 3505 -1707 -1240 -1933 -2083 1310
13541 1310 1844 -85 495 -1187 5023 3106 284 4817 8349 8071 -2501 -3259 -2864 -1414 -4498 -3374
13525 -3374 -6759 -5955 -3650 -5137 -3080 -8675 -17119 -20821 -15653 -7606 -5953 -5590 -9364 -12547 -13933
$$ packed form
13634A0358J12j75j866k257k366j927p74L148J815K822q254m911J354k721n320
13619a0962L522O993K939J391k019k030L866Q25n081r20P492L285j403o413L68
13604A853N89p06j309o748M288j718M271N862l997j858J196q91m10n679K718J582
13588i57k739J137P423M91l913k549n841K605M725O310J363m793j131L509O24
13573F264n870K31r282m174M174N954j321N133k811m08l661j186K3l413R44n836
13557a5239L235M146K264n9n098m037O328J972o5Q006K052n212M67o93j50L393
13541A310N34j929N80j682O210j917k822M533L532k78j0572p58L95J450l084J124
13525c374l385Q04K305j487K057n595q444l702N168Q047J653L63l774l183j386
$$ plain form
13510 -13933 -5940 -7361 -8194 -7646 -4570 3879 2371 -3927 -736 -7587 -11152 -12482 -14560 -12499 -1963
13495 -1963 4440 3728 163 -8521 -13756 -15668 -11301 -9279 -8548 -2288 6640 6853 3749 -3458 -7574
13480 -7574 -2330 407 -2207 -5019 -8294 -10355 -8088 1443 12045 7211 -606 -11070 -11032 -9445 -7355
13465 -7355 -1141 477 6699 7502 4472 3422 -3380 -13705 -15005 -11989 -8576 -5790 634 1833 -774
13450 -774 3022 10486 11733 3634 3360 6977 6294 1512 -6106 -10801 -11266 -9113 -4220 -7836 1422 9352
13434 9352 8697 2687 -9964 -4420 5798 3920 -2215 1162 -3518 -1466 2229 2328 3090 56 -1531
13419 -1531 -410 -2511 -1900 1055 3402 -1278 339 4844 457 -5005 -8184 -2589 2722 -820 -6755
13404 -6755 -7326 -7706 -9863 -7265 -5333 -4691 2768 6651 1851 -7872 -10252 -9801 -3332 -5203 -5332 -7779
$$ packed form
13510a3933P993j421q33N48L076Q449j508o298L191o851l565j330k078K061J0536
13495a963O403p12l565q684n235j912M367K022P31O260Q928K13l104p207m116
13480g574N244K737k614k812l275k061K267R531J0602m834p817j0464L8J587K090
13465g355O214J618O222Q03l030j050o802j0325j300L016L413K786O424J199k607
13450g74L796P464J247q099k74L617o83m782p618m695m65K153M893l616R258P930
13434I352o55o010j2651N544J0218j878o135L377m680K052L695R9P62l034j587
13419a531J121k101O11K955K347m680J617M505m387n462l179N595N311l542n935
13404f755n71l80k157K598J932O42P459L883m800r723k380M51O469j871j29k447
$$ plain form
13388 -7779 -8059 -5648 -5323 -5504 -1497 3731 -5382 -11456 -8059 -9955 -5171 1659 5192 7441 6130
13373 6130 7133 2886 4155 2289 -2977 -5108 -4181 -3450 1860 4021 2172 -3 521 3348 -2030
13358 -2030 -6757 -7483 -4697 -1993 3515 597 -7111 -8022 -5268 -4453 -7744 -7856 -9573 -7887 -11411 -15572
13342 -15572 -7915 -7313 -8646 -8245 -5168 506 1046 -909 -3441 2360 3894 15722 14951 6780 -1671
13327 -1671 1116 4390 -795 -1573 1091 8277 7035 2068 -215 -4631 -8648 -3630 -3019 -4970 -3421
13312 -3421 -4769 -2591 303 3251 382 -1950 2601 5710 6397 6360 8938 10972 4712 3404 640
13297 640 -7478 -10846 -6141 -5951 -9622 -4562 1960 4701 -970 2577 6097 6250 22 -2349 -2772 890
13281 890 -1631 -967 -3009 -2034 3066 7506 8511 5062 -497 -651 -2236 2154 8176 3780 -1669 -8635
$$ packed form
13388g779k80K411L25j81M007N228r113o074L397j896M784O830L533K249j311
13373F130J003m247J269j866n266k131R27P31N310K161j849k175N24K827n378
13358b030m727p26K786K704N508k918p708r11K754Q15l291j12j717J686l524m161
13342a5572P657O02j333M01L077N674N40j955k532N801J534J1828p71q171q451
13327a671K787L274n185p78K664P186j242m967k283m416m017N018O11j951J549
13312c421j348K178K894K948k869k332M551L109O87l7K578K034o260j308k764
13297F40q118l368M705J90l671N060O522K741n671L547L520J53o228k371m23L662
13281H90k521O64k042R75N100M440J005l449n559j54j585M390O022m396n449o966
$$ plain form
13265 -8635 -17953 -17298 -5409 -4045 -7455 -3816 -2359 -159 -5929 -7091 -8808 -9059 -9518 -6487 -1505
13250 -1505 1641 -4226 -11627 -12243 -12808 -13471 -9694 -7593 -4246 -3703 1912 4545 -2485 -6589 -3584 -8606
13234 -8606 -7126 -7774 -10103 -4145 -2787 -6673 -6083 -2340 1469 -4873 -7092 1042 7758 5992 3521
13219 3521 2963 1808 3047 3941 -1549 -5741 -4349 -3037 -1191 -2345 -1716 -5040 -11323 -11433 -8081 1016
13203 1016 996 -2779 -4968 -6543 -1757 -3018 -5718 -14431 -18324 -17106 -14514 -11255 -2096 -320 7956
13188 7956 8006 6936 5564 443 2891 1320 6455 10012 11486 6448 2797 369 2325 3775 -8188
13173 -8188 -5954 -1273 10602 13942 2991 -3322 -4678 -5083 -1126 6385 7856 5156 1799 -2056
13159 -2056 -6909 -7985 -7546 -11538 -13508 -7520 -205 1714 -2482 -3410 628 5837 7875 2660 -1058
$$ packed form
13265h635r318O55J1889J364l410L639J457K200n770j162j717k51m59L031M982
13250a505L146n867p401o16n65o63L777K101L347N43N615K633p030m104L005n022
13234h606J480o48k329N958J358l886N90L743L809o342k219Q134O716j766k471
13219C521n58j155J239Q94n490m192J392J312J846j154O29l324o283j10L352R097
13203A016k0l775k189j575M786j261k700q713l893J218K592L259R159J776Q276
13188G956N0j070j372n121K448j571N135L557J474n038l651k428J956J450j1963
13173h188K234M681J1875L340j0951o313j356m05L957P511J471k700l357l855
13159b056m853j076M39l992j970N988P315J919m196r28M038N209K038n215l718
$$ plain form
13144 -1058 -5106 -7187 -2757 -506 142 -2305 -1362 -5927 -12236 -13393 -12720 -8960 -4018 8016 6977
13129 6977 7293 5004 -1799 -5072 -5279 -6694 -8432 -12385 -6755 -2292 -1296 -264 -2111 -275 2953
13114 2953 5813 5932 4172 -485 -5927 -10029 -8567 -4613 -6245 -3333 -1845 -5763 -3422 -2269 4028
13099 4028 5768 -1472 -2499 -6326 -7388 -4814 91 -2891 -10638 -11948 -14066 -14032 -14401 -10707 -9762 -6638
13083 -6638 -313 205 -11808 -9750 -1514 -974 -3090 -4061 -6665 -7016 -7223 -11216 -7860 -8114 -6126 -1648
13067 -1648 -138 -514 -7898 -3842 -2698 1224 -4304 -15371 -23711 -18545 -14376 -9720 -6018 -2382 -1093
13052 -1093 -888 -7602 -4112 -715 -69 -536 -2274 -10715 -11114 -10136 -12141 -12291 -11449 -8616 -9347 -4292 -1427
13035 -1427 -3069 -6987 -48 2105 2410 9880 11240 9442 447 -1416 -2971 -1775 -678 -2470 2436
$$ packed form
13144a058m048k081M430K251O48k447R43m565o309j157O73L760M942J2034j039
13129F977L16k289o803l273k07j415j738l953N630M463R96J032j847J836L228
13114B953K860J19j760m657n442m102J462L954j632K912J488l918K341J153O297
13099D028J740p240j027l827j062K574M905k982p747j310k118L4l69L694R45L124
13083f638O325N18j2013K058Q236N40k116r71k604l51k07l993L356k54J988M478
13067a648J510l76p384M056J144L922n528j1067q340N166M169M656L702L636J289
13052a093K05o714L490L397O46m67j738q441l99R78k005j50Q42K833p31N055K865
13035a427j642l918O939K153L05P470J360j798q995j863j555J196J097j792M906
$$ plain form
13020 2436 -1574 -1644 6288 9816 3045 -346 1845 4964 3589 4035 4156 -7440 -9281 -7888 -2594
13005 -2594 -910 2054 1476 -4260 -6268 -5740 -3854 -1890 -3200 -2255 -1928 -7181 -7495 -2454 4947 7350
12989 7350 11224 4947 -2916 -5630 -4110 1633 2726 -208 -5014 -1922 3248 -2604 -5276 -1356 -1470
12974 -1470 -555 2832 1788 426 720 -7819 -12999 -12698 -12092 -6236 -8459 -2364 -855 -8897 -12805 -13568
12958 -13568 -2225 181 -8296 -12480 -10499 -1494 225 -1091 2976 2466 -7320 -12575 -12399 -10051 -4540
12943 -4540 -9315 -17119 -13065 -6478 -5388 -8080 -6290 -5423 -8120 -1874 5559 3987 2001 7049 6951
12928 6951 750 -1582 -9242 -9324 -5652 -422 -4120 -6852 -6597 -2584 -3272 -5661 -9567 -9020 -4280 -127
12912 -127 -3129 -6698 -2871 -4175 -2890 -4752 -10126 -5281 -8338 -7783 -3748 668 11027 14267 8885
$$ packed form
13020B436m010p0P932L528o771l391K191L119j375M46J21j1596j841J393N294
13005b594J684K964n78n736k008N28J886J964j310R45L27n253l14N041P401K403
12989G350L874o277p863k714J520N743J093k934m806L092N170n852k672L920j14
12974a470R15L387j044j362K94q539n180L01O06N856k223O095J509q042l908p63
12958a3568J1343K406q477m184J981R005J719j316M067n10r786n255J76K348N511
12943d540m775p804M054O587J090k692J790Q67k697O246P433j572j986N048r8
12928F951o201k332p660q2L672N230l698k732K55M013o88k389l906N47M740M153
12912a27l002l569L827j304J285j862n374M845l057N55M035M416J0359L240n382
$$ plain form
12897 8885 -1405 -4452 -4572 487 -1114 -366 588 2223 6865 5977 -713 -2158 -959 2284 1992 3742
12881 3742 4621 2971 -3487 -9560 -6618 -5761 1983 7651 8073 5451 4472 7859 2411 2696 7454 7993
12865 7993 3141 2283 1518 -1539 -4967 122 4189 5819 1274 -148 -1750 4564 6155 3463 -1664
12850 -1664 -7570 -8198 -6661 -10914 -8457 -3979 -3034 -3581 -5142 -1797 -2296 -5678 -3821 -4853 1398 8671
12834 8671 13604 12443 8882 10887 7627 6851 6527 1166 -206 1194 3291 3496 11574 15141 13780
12819 13780 10274 7609 8600 7497 10480 10229 9189 4021 3732 1689 -5058 -3941 -1762 7050 8339
12804 8339 11711 21160 32693 43752 56759 52125 38720 26135 21325 10853 3833 2386 6808
12791 6808 10328 8569 7769 6660 6527 3111 3636 5015 2834 593 -1797 -2751 -6499 -7701 -11770 -4583
$$ packed form
12897H885j0290l047j20N059j601P48R54J635M642q88o690j445J199L243k92J750
12881C742Q79j650o458o073K942Q57P744N668M22k622r79L387n448K85M758N39
12865G993m852q58p65l057l428N089M067J630m545j422j602O314J591k692n127
12850a664n906o28J537m253K457M478R45n47j561L345m99l382J857j032O251P273
12834H671M933j161l561K005l260p76l24n361j372J400K097K05Q078L567j361
12819A3780l506k665R91j103K983k51j040n168k89k043o747J117K179Q812J289
12804H339L372R449J1533J1059J3007m634j3405j2585m810j0472p020j447M422
12791F808L520j759q00j109j33l416N25J379k181k241k390r54l748j202m069P187
$$ plain form
12775 -4583 8934 7514 2775 740 2390 12225 12572 10125 3683 4260 290 7382 7166 3215 2179
12760 2179 5289 3285 1698 1788 -5731 -8894 -7495 -2534 1674 3149 7176 13304 11025 7210 12569
12745 12569 7782 -5906 -5159 -1542 1350 -2067 -12377 -11876 -2097 1056 -2935 -5622 -4891 -4980 -2627
12730 -2627 -4317 -4936 -5642 -3963 -2004 -4076 -1540 528 2218 6043 6850 5086 6725 7004 4942 8360
12714 8360 7420 3184 -2807 -6929 -4653 5730 4192 1612 -2906 -6176 -9718 -5527 1691 3531 4810
12699 4810 8587 11915 10656 6998 5364 11893 10767 12442 7582 1842 3244 5603 781 -2422 5871
12684 5871 9375 8110 9302 11985 11442 15797 25118 33040 37142 34424 22651 14979 8074 5062 8477
12669 8477 11350 17551 12379 8022 2120 1697 4284 4074 6770 6938 2682 4238 -2285 -9405 -11708
$$ packed form
12775d583J3517j420m739k035J650R835L47k447o442N77l970P092k16l951j036
12760B179L110k004j587R0p519l163J399M961M208J475M027O128k279l815N359
12745A2569m787j3688P47L617K892l417j0310N01R779L153l991k687P31q9K353
12730b627j690o19p06J679J959k072K536K068J690L825Q07j764J639K79k062L418
12714H360r40m236n991m122K276J0383j538k580m518l270l542M191P218J840J279
12699D810L777L328j259l658j634O529j126J675m860n740J402K359m822l203Q293
12684E871L504j265J192K683n43M355R321P922M102k718j1773p672o905l012L415
12669H477K873O201n172m357n902m23K587k10K696J68m256J556o523p120k303
$$ plain form
12654 -11708 -7009 131 1310 1392 4704 5571 -6561 -14804 -10163 -4258 -6859 -4872 -3941 -1685 7128
12639 7128 10914 5180 -6149 -8373 -12018 -7798 -392 1829 -3361 -4597 -8275 -15494 -12062 -8836
12625 -8836 -6722 239 -155 -4720 -10893 -6253 -1797 2377 9114 10888 4204 5144 7185 7469 1879
12610 1879 -1970 2501 -1564 -1798 -802 -5478 -3423 1923 2962 4217 537 -4792 -2342 -5220 -4674
12595 -4674 464 -1277 -2124 4676 5318 3511 -1860 803 3019 847 1700 7611 10479 8836 11796
12580 11796 7863 2584 13430 16064 9617 2788 -838 2210 3864 3975 4435 6584 5645 2988 3954
12565 3954 4888 8600 12222 10098 2188 973 -232 -555 -11873 -16366 -11184 -8676 -7281 -6630 -10800
12550 -10800 -14025 -11726 -10146 -8115 -2980 524 1431 -1153 -5074 -1937 9503 8023 6008 2269
$$ packed form
12654a1708M699P140J179Q2L312Q67j2132q243M641N905k601J987R31K256Q813
12639G128L786n734j1329k224l645M220P406K221n190j236l678p219L432L226
12625h836K114O961l94m565o173M640M456M174O737J774o684R40K041K84n590
12610A879l849M471m065k34R96m676K055N346J039J255l680n329K450k878N46
12595d674N138j741q47O800O42j807n371K663K216k172Q53N911K868j643K960
12580A1796l933n279J0846K634o447o829l626L048J654J11M60K149r39k657R66
12565C954R34L712L622k124p910j215j205l23j1318m493N182K508J395O51m170
12550a0800l225K299J580K031N135L504R07k584l921L137J1440j480k015l739
$$ plain form
12536 2269 -2499 1489 5568 4972 3162 11419 16454 16892 10192 7565 4879 6821 6709 6864 6138 4661
12520 4661 -1903 -7837 -5025 -2517 481 -3066 2142 7492 8611 11812 -54 -10029 -11025 -3508 4289
12505 4289 6226 3281 6403 -43 3291 4153 915 -1999 -2402 1493 104 -7132 -7572 -5277 451
12490 451 4910 10712 17141 20079 15770 2868 113 -6152 -9495 -3196 -2034 -2651 -1359 -5538 -8335
12475 -8335 -11273 -10968 -3044 -251 -4636 1590 6400 3256 -1286 -3600 -3178 -1735 -5885 -5305 2018
12460 2018 5786 10923 8762 2779 -4127 -5519 -3973 -5920 -927 5504 6825 4340 -3053 -6395 -2519
12445 -2519 -3870 2131 7299 5676 -1905 -3829 3034 4350 -125 174 -1028 4411 3455 566 -2851
12430 -2851 -6340 -5003 2741 9132 8728 6668 6419 9969 6959 -3733 -4476 -9065 -10185 -98 1976
$$ packed form
12536B269m768L988M079n96j810Q257N035M38o700k627k686J942j12J55p26j477
12520D661o564n934K812K508K998l547N208N350J119L201j1866r975r96P517P797
12505D289J937k945L122o446L334Q62l238k914m03L895j389p236m40K295N728
12490D51M459N802O429K938m309j2902k755o265l343O299J162o17J292m179k797
12475h335k938L05P924K793m385O226M810l144m542k314M22J443m150N80P323
12460B018L768N137k161n983o906j392J546j947M993O431J321k485p393l342L876
12445b519j351O001N168j623p581j924O863J316m475K99j202N439r56k889l417
12430b851l489J337P744O391m04k060k49L550l010j0692p43m589j120J0087K074
$$ plain form
12415 1976 -1663 -1742 2626 5327 3633 1131 -1641 -3082 -239 3258 3378 818 -3798 -357 -2978
12400 -2978 -5244 -3576 -591 2071 -3358 4723 12972 4236 267 9704 5665 403 -1759 1675 1007
12385 1007 -5888 -7108 -5380 -2535 3712 2081 4604 8948 7791 8716 7094 4716 8993 8734 8362
12370 8362 11474 15946 10695 4094 -4636 -6443 -2848 2123 9317 1071 -6345 -7947 -3949 -577 2252
12355 2252 -188 -6910 -8874 -9204 -7032 -4080 -3834 -1226 3988 5512 1528 -1830 -3406 2242 8662
12340 8662 5311 -1063 1378 9908 12594 10441 6002 1748 506 -4612 -8352 -3889 -3069 -2808 -3566
12325 -3566 -2505 -244 4234 10537 5174 2872 435 -4511 373 1950 -4583 -5228 -4487 1687 -234
12310 -234 -3754 -2002 -1000 177 -797 1815 2931 1702 -1523 -685 -4386 -3105 4431 5450 4841 4806
$$ packed form
12415A976l639p9M368K701j694k502k772j441K843L497J20k560m616L441k621
12400b978k266J668K985K662n429Q081Q249q736l969R437m039n262k162L434o68
12385A007o895j220J728K845O247j631K523M344j157R25j622k378M277k59l72
12370H362L112M472n251o601q730j807L595M971P194q246p416j602L998L372K829
12355B252k440o722j964l30K172K952K46K608N214J524l984l358j576N648O420
12340H662l351o374K441Q530K686k153m439m254j242n118l740M463Q20K61p58
12325c566J061K261M478O303n363k302k437m946M884J577o533o45P41O174j921
12310b34l520J752J002J177r74K612J116j229l225Q38l701J281P536J019o09l5
$$ plain form
12294 4806 10486 14435 11483 6492 5491 2940 2144 3287 4152 -2202 -8752 -7237 -5836 -2918 -5501
12279 -5501 -3969 2321 3663 5705 -73 -5164 -1458 1171 -337 5744 7826 4752 2370 -526 1161
12264 1161 7040 13196 10526 4567 1713 2300 -3469 1493 3690 -1241 1116 3663 -1071 -867 2845
12249 2845 -483 -7405 -4072 3958 3874 -3994 -3069 92 -1385 4632 4337 3037 3010 1857 2650 10653
12233 10653 10319 10665 11258 10064 15162 12235 8683 7070 3516 2440 -905 -1060 494 -4636 23
12218 23 1574 3861 10747 12733 8558 3503 6580 2454 -6798 -6811 -1787 1121 -2899 -6178 -2169 361
12202 361 4074 11420 25887 28058 27288 27539 23866 15582 14316 12124 16161 15202 18350 16499 12946
12187 12946 16679 20041 18903 17929 27098 40097 61332 76593 107079 140736 204024 297326 379055
$$ packed form
12294D806N680L949k952m991j001k551p96J143Q65o354o550J515J401K918k583
12279e501J532O290J342K042n778n091L706K629j508O081K082l074k382k896J687
12264A161N879O156k670n959k854N87n769M962K197m931K357K547m734K04L712
12249B845l328o922L333Q030q4p868R25L161j477O017k95j300k7j153P93Q003
12233A0653l34L46N93j194N098k927l552j613l554j076l345j55J554n130M659
12218B3J551K287O886J986m175n055L077m126r252j3N024K908m020l279M009K530
12202C61L713P346J4467K171p70K51l673q284j266k192M037r59L148j851l553
12187A2946L733L362j138r74R169J2999K1235J5261L0486L3657O3288R3302Q1729
$$ plain form
12174 379055 408756 382786 318282 235371 166616 118602 81083 60798 45036 39919 32919 21876
12162 21876 21849 23830 19646 16130 16665 15875 18048 17197 16429 21978 29291 28134 26737 25546 27893 37640
12146 37640 46567 49430 60126 66353 72355 78392 89425 104883 127741 153330 184472 236976 330346
12133 330346 490673 732448 1021108 1217295 1239539 1102993 844323 581163 392988 274016
12123 274016 200819 152977 119462 95568 81369 69085 58782 49838 37962 32116 28348 24396
12111 24396 32327 30889 31438 34664 32894 33472 32001 34266 39092 51743 54462 60746 69997 73060 80574
12096 80574 96156 115158 133716 151470 183326 236415 310700 434757 641639 917844 1173855
12085 1173855 1274595 1194893 983232 701307 468768 320162 226380 165603 129859 106436
$$ packed form
12174C79055K9701k5970o4504q2911o8755m8014l7519k0285j5762n117p000j1043
12162B1876k7J981m184l516N35p90K173q51p68N549P313j157j397j191K347R747
12146C7640Q927K863J0696O227O002O037J1033J5458K2858K5589L1142N2504R3370
12133C30346J60327K41775K88660J96187K2244j36546k58670k63160j88175j18972
12123B74016p3197m7842l3515k3894j4199j2284j0303q944j1876n846l768l952
12111B4396P931j438N49L226j770N78j471K265M826J2651K719O284R251L063P514
12096H0574J5582J9002J8558J7754L1856N3089P4285J24057K06882K76205K56011
12085A173855J00740p9702k11661k81925k32539j48606r3782o0777l5744k3423
$$ plain form
12075 106436 95367 78485 55611 50016 47282 38579 36785 37670 34208 30672 22927 22263 22809 25569
12061 25569 29099 31084 30557 24226 27365 35583 40446 33675 34457 35931 39714 44363 48109 57427 75705
12046 75705 105140 136545 198612 283862 370423 427596 422615 369144 273787 189687 133155 98687
12034 98687 76602 66749 53529 37727 30173 24594 23949 22213 18965 13772 10324 14307 16185 14252
12020 14252 11243 11728 10248 4352 5569 6439 7868 11473 11167 5264 4725 2760 4963 6326 10191
12005 10191 12313 10486 11365 8471 -1480 4004 16206 16811 11373 11303 7961 2833 4533 4381 2681
11990 2681 4623 815 4840 7501 3975 4874 10223 10825 11695 8059 9353 5339 1507 7400 15193
11975 15193 18062 17637 21569 15972 14395 13825 10595 7353 1521 1634 1023 41 10880 13057 6311
$$ packed form
12075A06436j1069j6882k2874n595k734q703j794Q85l462l536p745o64N46K760
12061B5569L530J985n27o331L139Q218M863o771P82J474L783M649L746R318J8278
12046G5705K9435L1405O2067Q5250Q6561N7173m981n3471r5357q4100n6532l4468
12034I8687k2085r853j3220j5802p554n579o45j736l248n193l448L983J878j933
12020A4252l009M85j480n896J217Q70J429L605l06n903n39j965K203J363L865
12005A0191K122j827Q79k894r951N484J2202O05n438p0l342n128J700j52j700
11990B681J942l808M025K661l526Q99N349O02Q70l636J294m014l832N893P793
11975A5193K869m25L932n597j577n70l230l242n832J13o11r82J0839K177o746
$$ plain form
11960 6311 3794 -3502 -1821 4504 9291 4617 3378 4951 8090 5542 7853 13408 15357 18146 19469
11945 19469 8384 1444 5724 7777 7064 4156 125 5727 4955 9683 6667 -420 -21 5926 12198
11930 12198 16400 18854 9649 2750 10663 10280 8677 6774 3814 8296 17517 20348 15806 12621 7267
11915 7267 995 8573 8542 7005 11324 13638 11974 7110 3485 6412 10011 11290 4719 10611 18306
11900 18306 24325 24906 17074 10676 8635 9370 14001 19599 13109 9688 11732 14368 11227 9313 8358
11885 8358 9648 14755 15457 12253 10426 12960 13251 10852 11113 11643 8930 16993 21031 19058 19066 18610 14091
11868 14091 9308 13814 13216 13107 15727 16243 17900 15776 9477 14068 16562 23746 26492 27968 29029
11853 29029 35507 32328 22979 24479 23918 16763 8213 13759 22998 24766 29604 30066 27061 28134 32201
$$ packed form
11960F311k517p296J681O325M787m674j239J573L139k548K311N555J949K789J323
11945A9469j1085o940M280K053p13k908m031N602p72M728l016p087L99N947O272
11930A2198M202K454r205o899P913l83j603j903k960M482R221K831m542l185n354
11915G267o272P578l1j537M319K314j664m864l625K927L599J279o571N892P695
11900A8306O019N81p832o398k041P35M631N598o490l421K044K636l141j914r55
11885H358J290N107P02l204j827K534K91k399K61N30k713Q063M038j973Qm56m519
11868A4091m783M506n98j09K620N16J657k124o299M591K494P184K746J476J061
11853B9029O478l179r349J500n61p155q550N546R239J768M838M62l005J073M067
$$ plain form
11838 32201 29873 28127 26658 31435 37808 41282 49021 54703 56830 62573 76912 95019 120536 160044
11824 160044 196435 228389 256449 276682 290865 301762 323572 349132 370602 383002 384669 366942
11812 366942 343606 322251 301153 285010 256121 221810 191144 161075 130141 107783 89234
11801 89234 78108 74006 63523 54422 46767 44133 37341 29446 24459 16921 17426 16370 22441 26561
11787 26561 23025 19818 15277 10602 8906 14223 17349 20963 19089 13974 8610 8487 12407 13603 7585
11772 7585 3389 6730 9538 14889 19192 21620 19017 22491 33349 31274 23048 21554 24364 18517
11758 18517 13557 14684 12431 16920 21491 15279 9156 3859 6880 9434 14290 15755 12114 10812
11744 10812 18785 20806 16080 15452 15678 15885 19406 14385 8945 12148 21635 30659 32800 32000 20931
$$ packed form
11838C2201k328j746j469M777O373L474P739N682K127N743J4339J8107K5517L9508
11824A60044L6391L1954K8060K0233J4183J0897K1810K5560K1470J2400J667j7727
11812C66942k3336k1355k1098j6143k8889l4311l0666l0069l0934k2358j8549
11801H9234j1126m102j0483r101p655k634o792p895m987p538N05j056O071M120
11787B6561l536l207m541m675j696N317L126L614j874n115n364j23L920J196o018
11772G585m196L341K808N351M303K428k603L474J0858k075q226j494K810n847
11758A8517m960J127k253M489M571o212o123n297L021K554M856J465l641j302
11744A0812P973K021m726o28K26K07L521n021n440L203R487R024K141q00j1069
$$ plain form
11729 20931 22465 26807 25960 16678 9126 7056 11187 14833 14055 14270 17146 10284 7472 4114 7085
11714 7085 9680 12198 13977 10934 9368 11126 13578 14950 15783 9825 7554 12290 16004 8601 8106
11699 8106 9789 8644 12520 16241 18380 13395 10509 13857 22323 25028 22927 22995 17420 16211 14303
11684 14303 14898 17790 19660 19860 18737 14567 14201 19061 18065 14480 9362 10608 14097 11009 15324
11669 15324 24846 25574 24439 30762 34731 29605 26142 26894 20369 26019 34557 35251 42319 56116 63046
11654 63046 65123 62727 61893 61819 60419 64023 70348 67368 57518 51349 53219 52846 46117 44213 43141
11639 43141 43880 36638 31512 31080 31658 26487 20978 19256 22905 26390 23187 21766 22646 20220 21618
11624 21618 26091 23201 22019 28190 25813 22866 22124 24015 25862 24328 25248 28100 34934 33405 33565
$$ packed form
11729B0931J534M342q47r282p552k070M131L646p78K15K876o862k812l358K971
11714G085K595K518J779l043j566J758K452J372Q33n958k271M736L714p403m95
11699H106J683j145L876L721K139m985k886L348Q466K705k101O8n575j209j908
11684A4303N95K892J870K00j123m170l66M860r96l585n118J246L489l088M315
11669A5324R522P28j135O323L969n126l463P52o525N650Q538O94P068J3797O930
11654F3046K077k396q34p4j400L604O325k980r850o169J870l73o729j904j072
11639D3141P39p242n126m32N78n171n509j722L649L485l203j421Q80k426J398
11624B1618M473k890j182O171k377k947p42J891J847j534R20K852O834j529J60
$$ plain form
11609 33565 33761 35311 42786 47414 47122 49619 38489 29861 26254 35551 34161 26091 25106 24137 20995
11594 20995 23038 24611 20306 13384 12537 8622 5356 6338 5411 -916 -652 -4010 -11091 -7141 737
11579 737 5859 13117 16463 17503 22308 31304 33838 36318 32519 21171 23106 25775 19580 15326 20895
11564 20895 27543 28543 32142 35941 35652 31863 33438 38633 33982 31277 25610 30103 36238 32493 33646
11549 33646 33204 34589 40883 36754 37533 44469 49615 53572 64873 75843 85234 101467 112480 122001
11535 122001 135420 150302 165854 175994 180850 184230 180927 176071 167349 155603 149771 138579 127259
11522 127259 121949 115980 106526 93157 89057 92787 94190 86379 86088 85706 86265 81530 79581 80823 80322
11507 80322 83967 85238 84364 81071 88473 92177 85377 78959 84198 93478 88775 88768 93161 93911 98174 99217
$$ packed form
11609C3565J96J550P475M628k92K497j1130q628l607R297j390q070r85r69l142
11594B0995K043J573m305o922q47l915l266R82r27o327K64l358p081L950P878
11579G37N122P258L346J040M805Q996K534K480l799j1348J935K669o195m254N569
11564B0895O648J000L599L799k89l789J575N195m651k705n667M493O135l745J153
11549C3646m42J385O294m129P79O936N146L957J1301J0970R391J6233J1013R521
11535A22001J3419J4882J5552J0140M856L380l303m856q722j1746n832j1192j1320
11522A27259n310n969r454j3369m100L730J403p811k91l82N59m735j949J242n01
11507H0322L645J271q74l293P402L704o800o418N239R280m703pM393P50M263J043
$$ plain form
11491 99217 96320 109401 113568 118156 123712 125053 128132 130652 132816 146015 150327 149501 154532 161925
11477 161925 168354 172123 167780 162624 170535 177876 183579 184323 183086 179495 178534 178636 180391 184365 189134
11462 189134 200167 207819 209942 215982 229452 234974 246296 251628 257704 265579 272163 282488 293874
11449 293874 298093 310123 321823 333557 348923 376378 400936 422087 443442 473241 502117 531304
11437 531304 564233 596760 627735 666010 713821 770974 829876 893072 965083 1054613 1163022
11426 1163022 1287579 1440964 1618567 1816361 2044848 2303586 2607055 2947122 3338884
11417 3338884 3799079 4314237 4898209 5589975 6412231 7430839 8726073 10440771 12824415
11408 12824415 16251201 21097964 27396815 34495968 41190769 46446011 50077636 52982363
$$ packed form
11491I9217k897J3081M167M588N556J341L079K520K164J3199M312q26N031P393
11477A61925O429L769m343n156P911P341N703P44j237l591r61J02J755L974M769
11462A89134J1033P652K123O040J3470N522J1322N332O076P875O584J0325J1386
11449B93874M219J2030J1700J1734J5366K7455K4558K1151K1355K9799K8876K9187
11437E31304L2929L2527L0975L8275M7811N7153N8902O3196P2011Q9530J08409
11426A163022J24557J53385J77603J97794K28487K58738L03469L40067L91762
11417C338884M60195N15158N83972O91766Q22256J018608J295234J714698K383644
11408A2824415L426786M846763O298851P099153O694801N255242L631625K904727
$$ plain form
11400 52982363 56426081 60997908 66053621 69934964 71049170 68931132 64480324 59426652
11392 59426652 55194248 51981780 48884780 44707205 38897396 31980076 25056400 19096760
11384 19096760 14555118 11327103 9068789 7458885 6264748 5341183 4604890 4016553
11376 4016553 3527743 3119735 2764403 2458583 2186386 1950576 1757461 1587825 1434064
11367 1434064 1298871 1181318 1077964 987766 915136 852223 804504 768124 745117 731573 712040
11356 712040 680176 643100 593834 549284 512562 486538 464907 437635 421476 401749 381178
11345 381178 367652 352763 341306 328413 315313 307240 299512 293428 286559 274825 270876 263251 249787
11332 249787 233369 223569 227679 235413 223604 220053 224421 224673 225131 230224 233608 232420 229297 227980
$$ packed form
11400E2982363L443718M571827N055713L881343J114206k118038m450808n053672
11392E9426652m232404l212468l097000m177575n809809o917320o923676n959640
11384A9096760m541642l228015k258314j609904j194137r23565p36293n88337
11376D016553m88810m08008l55332l05820k72197k35810j93115j69636j53761
11367A434064j35193j17553j03354r0198p2630o2913m7719l6380k3007j3544j9533
11356G12040l1864l7076m9266m4550l6722k6024k1631k7272j6159j9727k0571
11345C81178j3526j4889j1457j2893j3100q073p728o084o869j1734l949p625j3464
11332B49787j6418r800M110P734j1809l551M368K52M58N093L384j188l123j317
$$ plain form
11318 227980 234434 235451 227120 221043 215130 210825 200052 196236 198558 198155 193107 189608 183611 188593
11304 188593 189124 181832 174559 164851 160641 157933 161493 152460 137883 136461 135000 130971 130267 131395
11290 131395 133193 127176 122095 132652 136918 133667 131639 124505 119528 121139 124165 130606 134895 144057
11276 144057 135158 136269 141615 138641 132162 131805 132238 133697 130674 120167 102975 95499 97673 98772
11262 98772 98588 100086 97826 90498 81199 73970 72863 70728 67158 64482 62201 65748 61896 65934 65431
11247 65431 66839 65725 60862 56565 59422 58811 60216 55567 51760 52529 54284 50454 42060 46056 49704
11232 49704 46284 43180 42372 44728 45532 50587 49859 44838 35313 36389 40727 41670 42593 42917 53270 67424
11216 67424 73698 70869 70121 63917 63977 61560 59495 64170 68442 72666 72937 65216 64626 65877 66961 57788
$$ packed form
11318B27980O454J017q331o077n913m305j0773l816K322m03n048l499n997M982
11304A88593N31p292p273r708m210k708L560r033j4577j422j461m029p04J128
11290A31395J798o017n081J0557M266l251k028p134m977J611L026O441M289R162
11276A44057q899J111N346k974o479l57M33J459l023j0507j7192p476K174J099
11262I8772j84J498k260p328r299p229j107k135l570k676k281L547l852M038n03
11247F5431J408j114m863m297K857o11J405m649l807P69J755l830q394L996L648
11232D9704l420l104q08K356Q04N055p28n021r525J076M338R43R23L24J0353J4154
11216F7424O274k829p48o204O0k417k065M675M272M224K71p721n90J251J084r173
$$ plain form
11200 57788 54627 57053 46312 32040 23667 32609 37676 31715 22671 19840 18464 10411 8014 10763
11186 10763 11973 9385 4920 6079 12272 24954 29240 29228 24492 26508 32205 35824 31174 34108 33359
11171 33359 31606 39661 42519 44530 41662 40674 35234 29200 20001 18673 16914 18528 18486 22104 25824
11156 25824 22605 22772 17432 22194 21519 13899 13239 16031 9683 5949 9906 16985 12724 14033 17587
11141 17587 22017 24170 16911 9829 12211 7831 3829 12396 16824 16348 17063 10155 4041 1717 4947
11126 4947 8038 12371 11601 18468 18855 18718 15044 17095 13817 16917 22906 23196 20140 20348 21537 20259
11110 20259 27546 29238 21637 12075 8011 17768 26606 30768 34787 30635 19532 14234 16073 15991 15195
11095 15195 17422 17541 17608 19747 18422 21279 15412 8738 8269 5472 3115 5980 14379 13325 7212
$$ packed form
11200E7788l161K426j0741j4272q373Q942N067n961r044k831j376q053k397K749
11186A0763J210k588m465J159O193J2682M286j2m736K016N697L619m650K934p49
11171C3359j753Q055K858K011k868r88n440o034r199j328j759J614m2L618L720
11156B5824l219J67n340M762o75p620o60K792o348l734L957P079m261J309L554
11141A7587M430K153p259p082K382m380m002Q567M428m76P15o908o114k324L230
11126D947L091M333p70O867L87j37l674K051l278L100N989K90l056K08J189j278
11110B0259P287J692p601r562m064R757Q838M162M019m152j1103n298J839q2p96
11095A5195K227J19O7K139j325K857n867o674m69k797k357K865Q399j054o113
$$ plain form
11080 7212 5113 10101 22079 16784 15427 20392 21567 12249 6074 10461 11536 7559 4362 6191
11066 6191 13598 12719 11648 9505 9470 10705 9218 10230 12980 13600 14794 15546 11728 12863 13657 11831
11050 11831 9668 7100 5973 -1129 -3443 2650 7902 12979 16561 11910 8156 5154 7876 10794
11036 10794 7379 4307 6587 9469 14051 8761 9292 7457 8313 13344 12528 8547 8832 6804 3850
11021 3850 -6956 -7110 3082 8254 7782 7486 4501 669 -3769 -5665 -3836 -2984 744 -603 3083
11006 3083 9889 12698 9545 7542 9544 8165 7136 4700 4979 8869 6995 8001 16037 16566 21779
10991 21779 29454 35686 33988 34707 42938 52245 64288 76690 93926 123143 158687 196765 226928
10978 226928 251235 270211 287994 305026 329272 357508 380833 383372 370705 352481 327251 305888
$$ packed form
11080G212k099M988J1978n295j357M965J175r318o175M387J075l977l197J829
11066F191P407q79j071k143l5J235j487J012K750O20J194P52l818J135P94j826
11050A1831k163k568j127p102k314O093N252N077L582m651l754l002K722K918
11036A0794l415l072K280K882M582n290N31j835Q56N031q16l981K85k028k954
11021C850j0806j54J0192N172m72k96k985l832m438j896J829Q52L728j347L686
11006C083O806K809l153k003K002j379j029k436K79L890j874J006Q036N29N213
10991B1779P675O232j698P19Q231R307J2043J2402J7236K9217L5544L8078L0163
10978B26928K4307J8976J7783J7032K4246K8236K3325K539j2667j8224k5230k1363
$$ plain form
10966 305888 292495 274457 245072 215200 186224 147940 113775 88307 71365 65416 53971 41756
10954 41756 31843 25763 16706 10714 7843 9853 11187 14254 16915 22068 24880 19941 16872 9347
10940 9347 5988 2544 -3175 -3578 1002 2448 -2765 -1355 746 3232 -2365 -4735 -7204 1237 5365
10925 5365 7447 8845 7126 11265 4765 1945 10240 11354 8609 8941 8819 6486 10721 8050 5392
10910 5392 2460 -1141 2871 3875 5719 12628 14449 13072 19365 14413 2740 -3422 4157 7456
10896 7456 4089 2300 7549 7683 4121 9832 13616 8877 10171 13192 11089 18175 18653 10887 8294
10881 8294 8627 12316 12153 8409 3842 4468 2867 1418 4367 5244 4595 3752 5104 7669 11850 13101
10865 13101 12463 9059 6918 2945 4302 8649 13762 10615 8520 9196 6002 2987 4844 5267 5229 2403
$$ packed form
10966C05888j3393j8038k9385k9872k8976l8284l4165k5468j6942n949j1445j2215
10954D1756r913o080r057n992k871K010J334L067K661N153K812m939l069p525
10940I347l359l444n719m03M580J446n213J410K101K486n597k370k469Q441M128
10925E365K082J398j719M139o500k820Q295J114k745L32j22k333M235k671k658
10910E392k932l601M012J004J844O909J821j377O293m952j1673o162P579L299
10896G456l367j789N249J34l562N711L784m739J294L021k103P086M78p766k593
10881H294L33L689j63l744m567O26j601j449K949Q77o49q43J352K565M181J251
10865A3101o38l404k141l973J357M347N113l147k095O76l194l015J857M23l8k826
$$ plain form
10849 2403 1384 5273 508 2083 5710 11668 12237 9819 11143 11346 12181 13473 18238 18883 15109 11532
10833 11532 13701 14684 15535 13112 727 -341 -5296 -10194 -3280 -249 -1907 -1567 -1051 902 4051
10818 4051 8680 4165 4424 624 -2069 -3844 -8707 -7611 -1804 5615 3426 2810 5464 3603 7186
10803 7186 2811 -2009 -1963 -3652 -2210 2849 737 -1412 7167 16862 19579 16939 17962 14077 10624
10788 10624 8958 8971 3413 -3997 3085 -946 -841 1238 4164 5668 934 4631 -1211 -5564 -6946
10773 -6946 -8099 -7822 -2677 6855 8915 7024 -1505 -10795 -6012 -5827 -4020 5725 6507 6957 9427 3924
10757 3924 65 -1472 3317 3673 4469 3929 4314 5794 2073 4766 3774 5124 14727 14807 14194 10787 3462
10740 3462 6111 10730 10105 7249 7146 8047 5580 6832 3491 1524 6123 13001 12583 8276 5712 4008
$$ packed form
10849B403j019L889m765J575L627N958N69k418J324K03Q35J292M765O45l774l577
10833A1532K169R83Q51k423j2385j068m955m898O914L031j658L40N16J953L149
10818D051M629m515K59l800k693j775m863J096N807P419k189o16K654j861L583
10803G186m375m820M6j689J442N059k112k149Q579R695K717k640J023l885l453
10788A0624j666J3n558p410P082m031J05K079K926J504m734L697n842m353j382
10773f946j153K77N145R532K060j891q529r290M783J85J807R745P82M50K470n503
10757C924l859j537M789L56P96n40L85J480l721K693r92J350R603Q0o13l407p325
10740C462K649M619o25k856j03R01k467J252l341j967M599O878m18m307k564j704
$$ plain form
10724 4008 6343 6025 7014 8369 12592 6833 2105 2634 -4851 -4522 4553 7007 1373 -2696 -1365 -1285
10708 -1285 3892 4848 105 4737 3998 241 2419 -2202 2319 8422 10376 6019 4164 6678 5288
10693 5288 -1645 2133 11468 10567 -909 -1354 6524 11220 12360 10961 9126 4082 8164 7374 10641
10678 10641 10385 2589 2065 667 1950 8860 10080 7152 7997 8187 3611 3661 1501 -838 -3261 -4919
10662 -4919 -1237 4722 5307 3005 543 633 4030 4946 -1005 -6155 -1737 -2746 -2083 -4236 -2281 3713
10646 3713 6164 2960 5866 10284 4248 5769 10497 12807 13651 15702 11375 9194 1472 -5437 -77
10631 -77 7864 17615 20024 13890 6853 -3530 -8682 -7303 -7305 -2445 244 2300 -465 4580 8059 11640
10615 11640 10506 8829 5900 716 5722 6373 2704 4096 5223 7447 1473 -5303 3587 3936 368
$$ packed form
10724D008K335l18R89J355M223n759m728N29p485L29R075K454n634m069J331Q0
10708a285N177R56m743M632p39l757K178m621M521O103J954m357j855K514j390
10693E288o933L778R335r01j1476m45P878M696J140j399j835n044M082p90L267
10678A0641k56p796n24j398J283O910J220k928Q45J90m576N0k160k339k423j658
10662d919L682N959N85k302k462R0L397R16n951n150M418j009O63k153J955N994
10646C713K451l204K906M418o036J521M728K310Q44K051m327k181p722o909N360
10631g7P941R751K409o134p037j0383n152J379kM860K689K056k765N045L479L581
10615A1640j134j677k929n184N006O51l669J392J127K224n974o776Q890L49l568
$$ plain form
10600 368 4223 -777 -5396 1809 7631 4982 626 -1286 -5724 -10274 -15309 -5033 3529 135 -1349
10585 -1349 421 3811 -149 4776 6809 3896 9197 3808 281 3094 3874 244 -1216 -1859 -563
10570 -563 -2042 4774 7492 5141 7646 8201 5776 3908 283 -4106 -3981 -1167 3337 3026 6184 13988
10554 13988 13606 10453 3596 4518 6349 10287 14240 11180 9502 4989 2019 5935 7640 8767 13029
10539 13029 12858 16535 20792 14090 9166 11317 12305 4440 906 -247 -7852 -9038 -7724 1047 7409
10524 7409 3910 2861 6445 9681 4178 550 5371 7370 -197 -490 3934 694 -4541 -14002 -9363
10509 -9363 -2631 6349 6706 10560 8738 7474 3127 -2055 -1364 -5072 -1602 4168 8366 14210 13098
10494 13098 11832 7051 4774 -347 -2537 1602 10607 16488 15667 13572 13226 11581 3953 5403 12922
$$ packed form
10600C68L855n000m619P205N822k649m356j912m438m550n035J0276Q562l394j484
10585a349J770L390l960M925K033k913N301n389l527K813P80l630j460o43J296
10570e63j479O816K718k351K505N55k425j868l625m389J25K814M504l11L158P804
10554A3988l82l153o857R22J831L938L953l060j678m513k970L916J705J127M262
10539A3029j71L677M257o702m924K151R88p865l534j153p605j186J314Q771O362
10524G409l499j049L584L236n503l628M821J999p567k93M424l240n235r461M639
10509i363O732Q980L57L854j822j264m347n182O91l708L470N770M198N844j112
10494A3098j266m781k277n121k190M139R005N881q21k095l46j645p628J450P519
$$ plain form
10479 12922 16093 13107 7708 6875 4711 9944 16703 16144 14935 16073 13872 21145 17855 7651 6573
10464 6573 -688 -1250 154 3961 9957 10057 16629 16677 9584 6119 5948 6102 7864 3917 2550 14911
10448 14911 19690 24558 23590 21499 18457 14938 15868 17759 24302 25392 21640 23312 23935 12454 13300
10433 13300 13110 10258 13665 17077 14644 8023 7997 9454 15552 15708 15388 11533 16302 14990 16196 15520
10417 15520 13429 14573 16629 11828 4792 8309 16270 16126 9889 12646 15339 9923 7086 9942 12398
10402 12398 10510 9095 9588 11854 3475 1585 133 3239 8853 14218 11063 10642 14865 16659 7521
10387 7521 4210 6227 11687 9145 11285 18583 21229 13820 14258 14542 16611 14558 10766 10766 17934 19003
10371 19003 17741 18586 18068 18704 15847 14247 13554 15045 16177 16041 12452 9513 12503 13885 9446 9274
$$ packed form
10479A2922L171k986n399q33k164N233O759n59j209J138k201P273l290j0204j078
10464F573p261n62J404L807N996J00O572M8p093l465j71J54J762l947j367J2361
10448A4911M779M868r68k091l042l519R30J891O543J090l752J672O23j1481Q46
10433A3300j90k852L407L412k433o621k6J457O098J56l20l855M769j312J206o76
10417A5520k091J144K056m801p036L517P961j44o237K757K693n416k837K856K456
10402A2398j888j415M93K266q379j890j452L106N614N365l155m21M223J794r138
10387G521l311K017N460k542K140P298K646p409M38K84K069k053l792%P168J069
10371A9003j262Q45n18O36k857j600o93J491J132j36l589k939K990J382m439j72
$$ plain form
10355 9274 8354 10576 13125 12643 8129 6035 8257 12439 10733 10155 2140 -641 9213 13074 8746
10340 8746 -165 -5601 -1432 8370 14715 14553 17018 18643 17910 15529 16580 17515 15630 17215 19510
10325 19510 23785 25017 25214 28317 25033 31160 31565 27658 28705 24008 23511 21479 20190 17026 19901
10310 19901 20778 18456 16967 18585 23928 24588 18852 16036 15679 19281 21797 21326 19081 20967 20480 14971
10294 14971 14553 12341 13023 12924 9664 11603 13115 14878 12122 22575 24163 27448 24559 11501 8782
10279 8782 7028 8620 10509 9993 9004 7946 11296 103 -3138 -2657 -5184 3525 8614 6270 12136
10264 12136 12218 7550 3280 10526 13443 5982 8983 7651 9372 16596 20222 20411 21964 18504 20908
10249 20908 23037 19491 18161 18434 13451 12679 20434 19586 11803 4857 -346 199 6189 7075 13970 7603
$$ packed form
10355I274r20K222K549m82m514k094K222M182j706n78q015k781R854L861m328
10340H746q911n436M169R802O345j62K465J625p33k381J051R35j885J585K295
10325A9510M275J232J97L103l284O127M05l907J047m697m97k032j289l164K875
10310A9901Q77k322j489J618N343O60n736k816l57L602K516m71k245J886m87n509
10294A4971m18k212O82r9l260J939J512J763k756J0453J588L285k889j3058k719
10279H782j754J592J889n16r89j058L350j1193l241M81k527Q709N089k344N866
10264A2136Q2m668m270P246K917p461L001j332J721P224L626J89J553l460K404
10249B0908K129l546j330K73m983p72P755q48p783o946n203N45N990Q86O895o367
$$ plain form
10233 7603 5104 173 -4079 6448 9631 7409 8713 9056 9308 15634 12057 9175 13572 19108 16114
10218 16114 10021 5377 11462 14337 15805 13442 8862 12435 13592 11710 12186 13882 11866 14041 14983
10203 14983 13663 10291 7792 3652 4026 13964 21169 23196 16720 13760 13164 8465 9329 13801 12801
10188 12801 12184 5554 9023 14310 19182 18213 16350 15880 17064 14743 12019 9241 9384 9952 6620 8521
10172 8521 13387 12815 15806 7254 -1177 -1413 3031 6931 8298 13248 16127 17132 19392 14845 10621
10157 10621 18554 17010 12984 3420 6166 11480 17762 14919 9839 6926 7052 8093 10838 4111 4729
10142 4729 10196 13006 9921 4798 3773 5117 3183 5141 12753 9806 11334 15742 6842 1512 8741
10127 8741 14521 5999 -2173 -516 4947 3928 1609 4063 8928 4796 -2815 -5588 2335 4945 1815
$$ packed form
10233G603k499m931m252J0527L183k222J304L43K52O326l577k882M397N536k994
10218A6114o093m644O085K875J468k363m580L573J157j882M76J696k016K175R42
10203A4983j320l372k499m140L74R938P205K027o476k960n96m699Q64M472j000
10188A2801o17o630L469N287M872r69j863m70J184k321k724k778J43N68l332J901
10172H521M866n72K991q552q431k36M444L900J367M950K879J005K260m547m224
10157A0621P933j544m026r564K746N314O282k843n080k913J26J041K745o727O18
10142D729N467K810l085n123j025J344j934J958P612k947J528M408q900n330P229
10127H741N780q522q172J657N463j019k319K454M865m132p611k773P923K610l130
$$ plain form
10112 1815 -4615 -1456 -234 1808 2422 6629 9982 7456 12967 13254 13745 13102 12582 12520 11154 11586 11998
10095 11998 10286 3362 723 6365 6697 9816 15218 17697 19164 18493 16760 15391 13758 11136 13737
10080 13737 14450 8275 6034 4834 10038 9628 6987 8822 10660 19231 18448 16755 15665 17573 17757
10065 17757 13621 14648 19177 12745 14409 13884 13683 17241 25968 27482 21927 13502 11901 7912 10924
10050 10924 16269 23095 28572 37495 46070 55977 73401 109319 180436 274662 331208 332733 290519
10037 290519 201156 126451 87581 69283 57952 43397 33100 33399 25954 14333 13171 12869 14446
10024 14446 12354 4082 3707 11005 9152 12750 12955 11149 10210 9625 14170 12478 12472 14878 17108 17547
10008 17547 20743 19874 22473 19867 16264 8145 9918 12709 16827 16299 10444 11308 12202 10009 10665 16639
$$ packed form
10112A815o430L159J222K042O14M207L353k526N511K87M91o43n20o2j366M32M12
10095A1998j712o924k639N642L32L119N402K479J467o71j733j369j633k622K601
10080A3737P13o175k241j200N204m10k641J835J838Q571p83j693j090J908J84
10065A7757m136J027M529o432J664n25k01L558Q727J514n555q425j601l989L012
10050A0924N345O826N477Q923Q575R907J7424L5918P1117R4226N6546J525m2214
10037B90519q9363p4705l8870j8298j1331j4555j0297K99p445j1621j162l02J577
10024A4446k092q272l75P298j853L598K05j806r39n85M545j692oK406K230M39
10008A7547L196q69K599k606l603q119J773K791M118n28n855Q64Q94k193O56N974
$$ plain form
9992 16639 17440 5590 5068 7517 4582 8997 7316 10034 13726 9410 9745 9406 6113 6512 1848 1020
9976 1020 13128 18395 15173 11347 13313 19995 26112 22551 18467 11894 14594 18233 16808 15439 17503
9961 17503 15837 16993 19934 20622 17438 15714 15462 15633 17430 13106 4208 -1096 876 3932 5051
9946 5051 8001 13734 14299 11510 13852 13893 10856 11729 16870 15727 15146 13046 17549 22285 23785 25514
9930 25514 21416 24608 22308 19382 21080 24014 26417 26231 22156 19931 19389 15889 16102 17440 20813
9915 20813 25187 26213 18478 9208 10255 13398 11671 11502 24591 24096 22461 17535 9177 10864 15489
9900 15489 12519 16580 18641 21393 17727 20984 21868 23123 19502 25236 24132 18776 16649 13475 8333
9885 8333 10158 18932 24575 32550 32008 27191 20798 20312 22230 24587 20548 22849 15857 12105 12873 15185
$$ packed form
9992A6639Q01j1850n22K449k935M415j681K718L692m316L35l39l293L99m664q28
9976A020J2108N267l222l826J966O682O117l561m084o573K700L639j425j369K064
9961A7503j666J156K941O88l184j724k52J71J797m324q898n304J972L056J119
9946E051K950N733N65k789K342M1l037Q73N141j143n81k100M503M736J500J729
9930B5514m098L192k300k926J698K934K403j86m075k225n42l500K13J338L373
9915B0813M374J026p735r270J047L143j727j69J3089m95j635m926q358J687M625
9900A5489k970M061K061K752l666L257Q84J255l621N734j104n356k127l174n142
9885H333J825Q774N643P975n42m817o393m86J918K357m039K301o992l752P68K312
$$ plain form
9869 15185 17108 23780 23382 18712 21686 17802 8801 9848 13409 13509 15684 18348 17342 23836 20933
9854 20933 19043 20832 14688 7522 9331 17043 21077 23996 24410 23122 27791 24237 19532 20405 21053
9839 21053 20674 15445 14297 17428 14832 10063 14753 14952 17776 14777 12881 13804 20387 19228 25528
9824 25528 29462 30093 28934 24986 15755 18038 25022 17828 12788 11595 14958 17448 18842 21047 16258
9809 16258 15476 10967 13225 16046 20071 19592 22194 21757 18751 21979 17672 14721 16842 15050 12443
9794 12443 8468 8169 10019 8713 12998 12944 10733 17778 23613 26065 28543 27054 23294 12071 4261
9779 4261 9770 17669 13174 9033 5274 8346 17524 17991 18867 22773 19694 20206 14396 8891 8318 6381
9763 6381 8201 8345 5162 13540 18606 17549 16008 14393 8765 3877 10280 11112 13201 15338 16440
$$ packed form
9869A5185J923O672l98m670K974l884r001J047L561J00K175K664j006O494k903
9854B0933j890J789o144p166J809P712M034K919M14j288M669l554m705Q73O48
9839B1053l79n229j148L131k596m769M690J99K824k999j896R23O583j159O300
9824B5528L934O31j159l948r231K283O984p194n040j193L363K490J394K205m789
9809A6258p82m509K258K821M025m79K602m37l006L228m307k951K121j792k607
9794A2443l975k99J850j306M285n4k211P045N835K452K478j489l760j1223p810
9779D261N509P899m495m141l759L072R178M67Q76L906l079N12n810n505n73j937
9763F381J820J44l183Q378N066j057j541j615n628m888O403Q32K089K137J102
$$ plain form
9748 16440 16011 19587 24079 13249 12431 17283 21636 21076 21393 28982 30696 28946 30424 29844 34021 29204
9732 29204 25040 25740 26392 26933 21672 10347 13770 19782 16323 11686 15795 17985 21534 25942 22557
9717 22557 19656 12137 16990 26399 32954 36103 44749 46601 46837 46474 45164 42556 34279 34188 32411 32297
9701 32297 27484 23800 26239 24272 24063 24147 22568 24259 33069 36063 31625 33050 23604 11145 8392
9686 8392 17075 19833 14240 11066 13760 11973 23167 26478 22275 16005 14227 16095 13225 12128 17954
9671 17954 22022 20568 19156 16066 10055 9914 15564 22638 27998 31695 36792 34490 27383 27955 23971
9656 23971 18687 23316 25285 24929 23322 15233 9983 13369 17467 14639 15143 18832 21723 24830 17852
9641 17852 20454 21064 20308 18670 20449 21578 21547 27814 37585 33759 29868 27548 28265 32461 38308 33644
$$ packed form
9748A6440m29L576M492j0830q18M852M353n60L17P589J714j750J478n80M177m817
9732B9204m164P00O52N41n261j1325L423O012l459m637M109K190L549M408l385
9717B2557k901p519M853R409O555L149Q646J852K36l63j310k608q277r1j777j14
9701C2297m813l684K439j967k09Q4j579J691Q810K994m438J425r446j2459k753
9686H392Q683K758n593l174K694j787J1194L311m203o270j778J868k870j097N826
9671A7954M068j454j412l090o011j41N650P074N360L697N097k302p107N72l984
9656B3971n284M629J969l56j607q089n250L386M098k828N04L689K891L107o978
9641A7852K602O10p56j638J779J129l1O267R771l826l891k320P17M196N847m664
$$ plain form
9625 33644 26487 24120 25826 25152 23976 29857 37905 34134 29748 32327 36507 36065 34126 31610 26649
9610 26649 28394 31762 24509 13552 10389 14671 17617 24235 25823 24105 21064 18048 20821 19708
9596 19708 20032 19414 23034 25681 25297 24322 24667 27113 25213 24995 20815 21211 26471 31650 27218 25799
9580 25799 27164 26737 25542 22472 25346 34043 35027 36601 37576 37699 33988 33449 35693 33669 34865 36564
9564 36564 36099 42000 42779 36286 37282 38291 37043 40310 41644 39123 40228 40371 43503 45540 47771 48463
9548 48463 48041 53495 55735 52577 52417 39778 35968 42629 36012 29293 33762 33725 30400 24759 27677
9533 27677 39489 39607 37776 42943 45474 48810 47428 45955 43732 37971 32802 34007 36664 37296 33987
9518 33987 33002 30515 24192 22560 29920 34540 38581 42779 51210 54898 59049 60173 58466 64976 74475
$$ packed form
9625C3644p157k367J706o74j176N881Q048l771m386K579M180m42j939k516m961
9610B6649J745L368p253j0957l163M282K946O618J588j718l041l016K773j113
9596A9708L24o18L620K647l84r75L45K446j900k18m180L96N260N179m432j419
9580B5799J365m27j195l070K874Q697R84J574R75J23l711n39K244k024J196J699
9564C6564m65N901P79o493R96J009j248L267J334k521J105J43L132K037K231O92
9548D8463m22N454K240l158j60j2639l810O661o617o719M469l7l325n641K918
9533B7677J1812J18j831N167K531L336j382j473k223n761n169J205K657O32l309
9518C3987r85k487o323j632P360M620M041M198Q431L688M151J124j707O510R499
$$ plain form
9503 74475 76026 74446 81800 85727 89462 90688 87669 72853 64643 62037 55521 50443 47140 42269
9489 42269 46322 53021 54847 56795 57935 58180 59418 64003 69444 68533 66077 58895 55528 56026 55441 52752
9473 52752 55806 61827 68790 72926 74989 78838 83430 88260 84739 86357 95948 107062 116785 126570
9459 126570 131449 138231 151187 172216 185554 195251 213441 231664 257983 289118 341265 409597
9447 409597 502361 627689 793996 989110 1195277 1386605 1538569 1621919 1622513 1526829 1374818
9436 1374818 1182436 968296 773163 612902 477134 372135 294829 240085 198294 178000
9426 178000 165464 162990 152868 135966 126161 118133 104600 99314 95217 91482 93273 96555 94846
9413 94846 87644 79228 80983 76022 72866 72508 76364 76521 76552 75827 75340 76801 71042 58659 49770 52659
$$ packed form
9503G4475J551j580P354L927L735J226l019j4816q210k606o516n078l303m871
9489D2269M053O699J826J948J140K45J238M585N441r11k456p182l367M98n85k689
9473E2752L054O021O963M136K063L849M592M830l521J618R591J1114R723R785
9459A26570M879O782J2956K1029J3338R697J8190J8223K6319L1135N2147O8332
9447D09597R2764J25328J66307J95114K06167J91328J51964Q3350N94r5684j52011
9436A374818j92382k14140j95133j60261j35768j04999p7306n4744m1791k0294
9426A78000j2536k474j0122j6902r805q028j3533n286m097l735J791L282j709
9413I4846p202q416J755m961l156l58L856J57L1p25m87J461n759j2383q889K889
$$ plain form
9397 52659 60450 64555 66196 65656 70725 75940 76744 78086 80099 82466 81668 81015 81375 80070 78355 77645
9381 77645 71134 64527 68207 69385 62951 62374 64495 65271 68816 72611 74063 77248 76523 68620 70012
9366 70012 71313 74315 74819 68739 70311 76390 80109 83026 78026 73169 81518 76390 64139 63121 62808
9351 62808 61564 60570 56303 65124 77811 81487 79323 84711 79649 72024 71681 81678 85535 87831 83146
9336 83146 86803 95924 102542 102623 101224 96354 94833 98795 103419 108808 109549 104313 108143 117656 117553 119401
9320 119401 114283 112890 109560 116716 133793 138574 135252 134276 140949 146371 150800 160548 173825 183088
9306 183088 187431 191920 201318 207791 213656 230690 254452 292351 328140 331660 334724 397487 496730
9293 496730 553906 542849 464817 378812 327000 297587 291537 300569 314846 328029 340391 349625
$$ packed form
9397E2659P791M105J641n40N069N215Q04J342K013K367p98o53L60j305j715p10
9381G7645o511o607L680J178o434n77K121P76L545L795J452L185p25p903J392
9366G0012J301L002N04o080J572O079L719K917n000m857Q349n128j2251j018l13
9351F2808j244r94m267Q821J2687L676k164N388n062p625l43R997L857K296m685
9336H3146L657R121O618Q1j399m870j521L962M624N389P41n236L830R513j03J848
9320A19401n118j393l330P156J7077M781l322r76O673N422M429R748J3277R263
9306A83088M343M489R398O473N865J7034K3762L7899L5789L520L064O2763R9243
9293D96730N7176j1057p8032q6005n1812k9413o050R032J4277J3183J2362R234
$$ plain form
9281 349625 366835 383672 397933 414904 438916 465626 497050 524338 553279 581249 602531 628197
9269 628197 659396 685480 720071 757812 798241 840620 884064 916350 936606 949294 958326 961421
9257 961421 956690 934436 898580 865521 835269 804416 774620 746512 714775 681244 644367 608658
9245 608658 571149 541117 527595 513134 493966 464190 424511 377554 336801 297629 256586 210318
9233 210318 162879 107894 69111 57771 73491 102515 134896 161550 180727 198787 215357 226081
9221 226081 227424 231846 236058 234218 224529 209425 193790 182420 175055 173509 178727 183102 194555
9208 194555 199372 203553 197225 197298 202408 205866 205512 198803 173590 152432 131480 126010 122230 117510
9194 117510 123653 130747 138289 146608 154288 168603 187216 199177 206326 214891 222663 226205 227457 231980
$$ packed form
9281C49625J7210J6837J4261J6971K4012K6710L1424K7288K8941K7970K1282K5666
9269F28197L1199K6084L4591L7741M0429M2379M3444L2286K0256J2688R032L095
9257I61421m731k2254l5856l3059l0252l0853k9796k8108l1737l3531l6877l5709
9245F08658l7509l0032j3522j4461j9168k9776l9679m6957m0753l9172m1043m6268
9233B10318m7439n4985l8783j1340J5720K9024L2381K6654J9177J8060J6570J0724
9221B26081J343M422M212j840r689j5104j5635j1370p365j546N218M375J1453
9208A94555M817M181o328P3N110L458l54o709k5213k1158k0952n470l780m720
9194A17510O143P094P542Q319P680J4315J8613J1961P149Q565P772L542J252M523
$$ plain form
9180 231980 231438 228127 234396 247807 258190 268156 280731 299080 314564 320656 301984 258748 233332
9167 233332 220303 216084 240155 282863 304219 302629 301155 309412 306637 302458 302218 305307 312429 317427
9153 317427 315789 311811 306423 309014 316154 321002 331365 333839 334661 347130 350431 352739 361734 377120
9139 377120 394205 415413 440609 466384 490898 525828 575302 636814 722367 834521 984411
9128 984411 1139062 1232182 1227497 1137509 995514 855774 756766 696170 658594 638260 628784
9117 628784 619331 622878 631837 656031 685599 709205 729943 745876 745151 746447 754974 764139 783101
9104 783101 808529 831813 880164 936858 988080 1033635 1073523 1106635 1129791 1149783 1166016 1193106
9092 1193106 1226750 1262037 1300208 1352238 1417737 1488870 1562830 1638088 1713694 1776299 1838114
$$ packed form
9180B31980n42l311O269J3411J0383R966J2575J8349J5484O092j8672m3236k5416
9167B33332j3029m219K4071M2708K1356j590j474Q257k775m179k40L089P122M998
9153C17427j638l978n388K591P140M848J0363K474Q22J2469L301K308Q995J5386
9139C77120J7085K1208K5196K5775K4514L4930M9474O1512Q5553J12154J49890
9128I84411J54651R3120m685q9988j41995j39740r9008o0596l7576k0334r476
9117F28784r453L547Q959K4194K9568K3606K0738J5933p25J296Q527R165J8962
9104G83101K5428K3284M8351N6694N1222M5555L9888L3112K3156J9992J6233K7090
9092A193106L3644L5287L8171N2030O5499P1133P3960P5258P5606O2605O1815
$$ plain form
9081 1838114 1909482 1991490 2094714 2208638 2331212 2492542 2686357 2904262 3140441 3398179
9071 3398179 3674741 3979043 4314160 4697681 5145279 5679055 6298710 7021047 7873519 8867188
9061 8867188 10016942 11369094 13019048 15097827 17765482 21081996 24905882 28978353
9053 28978353 33145662 37433966 42185879 48257006 56808006 69545123 89409662 121388671
9045 121388671 172540984 245969149 327781212 387143536 401312910 370187180 304875309
9038 304875309 227121605 161034697 114352250 83136824 62263814 48162677 38544522
9031 38544522 31946056 27423721 24270101 21851961 19619969 17284148 14857495 12524568
9023 12524568 10501167 8892179 7672777 6758797 6071764 5522065 5061750 4658378 4306868
$$ packed form
9081A838114P1368Q2008J03224J13924J22574J61330J93815K17905K36179K57738
9071C398179K76562L04302L35117L83521M47598N33776O19655P22337Q52472R93669
9061H867188J149754J352152J649954K078779K667655L316514L823886M072471
9053B8978353M167309M288304M751913O071127Q551000J2737117J9864539L1979009
9045A21388671N1152313P3428165Q1812063N9362324J4169374l1125730o5311871
9038C04875309p7753704o6086908m6682447l1215426k0873010j4101137r618155
9031C8544522o598466m522335l153620k418140k231992k335821k426653k332927
9023A2524568k023401j608988j219402r13980o87033n49699m60315m03372l51510
$$ plain form
9014 4306868 4000516 3718436 3477544 3256253 3062846 2897460 2757672 2631561 2511773 2396711
9004 2396711 2282922 2167353 2048715 1936190 1829027 1724044 1642734 1583881 1535336 1488778
8994 1488778 1447948 1415459 1381784 1350101 1312980 1278422 1243174 1221402 1204009 1190539 1176708
8983 1176708 1154155 1124684 1103420 1101620 1106204 1111145 1121116 1130609 1125114 1105747 1072814 1032569 977697
8970 977697 919334 866038 817640 771682 724842 683264 651783 616960 599219 584881 562323 544047
8958 544047 526279 508718 485358 458321 431427 407677 394912 388247 392895 399481 391132 383436 381074
8945 381074 389534 401223 402823 396937 393922 388783 379165 369974 373004 371864 366831 362432 353939 350254
8931 350254 336222 325391 322032 315893 302806 305766 313793 321552 322735 319818 322402 324331 324183 352881
$$ packed form
9014D306868l06352k82080k40892k21291j93407j65386j39788j26111j19788j15062
9004B396711j13789j15569j18638j12525j07163j04983q1310n8853m8545m6558
8994A488778m0830l2489l3675l1683l7121l4558l5248k1772j7393j3470j3831
8983A176708k2553k9471k1264j800M584M941R971R493n495j9367l2933m0245n4872
8970I77697n8363n3296m8398m5958m6840m1578l1481l4823j7741j4338k2558j8276
8958E44047j7768j7561k3360k7037k6894k3750j2765o665M648O586q349p696k362
8945C81074Q460J1689J600n886l015n139r618r191L030j140n033m399q493l685
8931C50254j4032j0831l359o139j3087K960Q027P759J183k917K584J929j48K8698
$$ plain form
8917 352881 422301 478461 481292 460450 437632 414307 381215 349316 322267 305272 288252 275883
8905 275883 263990 256320 249419 236897 223097 219039 213830 206222 210930 214146 215669 226942 240044
8892 240044 246108 244123 239035 246257 252340 249763 249849 252471 253882 247474 228415 206245 195003 196494
8878 196494 193018 194703 204537 214691 232728 254495 275114 304798 333096 354043 356202 340772
8866 340772 316656 286166 261293 236857 217445 206659 201530 209723 224577 242997 266840 292921
8854 292921 331134 367578 380396 364222 322048 276014 236442 202859 167670 127895 91443 58066
8842 58066 42461 36443 39985 41581 45559 46234 44771 38969 34337 38645 47162 52415 61612 61650 52944
8827 52944 46713 46396 40786 40698 43481 45459 48781 61164 72873 82365 93720 103354 105992 99747 96366
$$ packed form
8917C52881O9420N6160K831k0842k2818k3325l3092l1899k7049j6995j7020j2369
8905B75883j1893p670o901j2522j3800m058n209p608M708L216J523J1273J3102
8892B40044O064j985n088P222O083k577Q6K622J411o408j9059k2170j1242J491
8878A96494l476J685R834J0154J8037K1767K0619K9684K8298K0947K159j5430
8866C40772k4116l0490k4873k4436j9412j0786n129Q193J4854J8420K3843K6081
8854B92921L8213L6444J2818j6174m2174m6034l9572l3583l5189l9775l6452l3377
8842E8066j5605o018L542J596L978O75j463n802m632M308Q517N253R197L8q706
8827E2944o231l17n610q8K783J978L322J2383J1709R492J1355R634K638o245l381
$$ plain form
8812 96366 90917 91440 87443 79330 75760 81468 78348 67771 58933 61400 62382 62731 63051 61830 63467
8797 63467 76833 89751 93729 91713 91158 84920 71018 59907 56277 60191 66636 65823 59366 55573
8783 55573 59671 56331 55637 51736 51534 52515 47358 43358 44951 47366 49474 54610 56957 59294 61727
8768 61727 63234 63641 57572 57245 62884 62255 64524 61195 47574 46892 46854 45936 48711 52010 47583 45854
8752 45854 41639 45366 43339 39021 39285 42965 52353 60474 66106 66369 68005 59405 48336 40606 40719
8737 40719 42500 50407 52247 45629 51195 60407 59354 53181 44416 39774 40356 48594 55648 52117 45853
8722 45853 42065 49108 59815 59693 57090 50980 42467 37011 40471 41216 43165 50361 52421 49690 51457
8707 51457 53926 52603 49688 49406 51578 47875 49033 48435 54204 53179 47190 43556 41455 40674 35126
$$ packed form
8812I6366n449N23l997q113l570N708l120j0577q838K467R82L49L20j221J637
8797F3467J3366J2918L978k016n55o238j3902j1111l630L914O445q13o457l793
8783E5573M098l340o94l901k02R81n157m000J593K415K108N136K347K337K433
8768F1727J507M07o069l27N639o29K269l329j3621o82l8r18K775L299m427j729
8752D5854m215L727k027m318K64L680R388Q121N632K63J636q600j1069p730J13
8737D0719J781P907J840o618N566R212j053o173q765m642N82Q238P054l531o264
8722D5853l788P043J0707j22k603o110q513n456L460P45J949P196K060k731J767
8707E1457K469j323k915k82K172l703J158n98N769j025n989l634k101p81n548
$$ plain form
8692 35126 31125 42547 45304 40483 49712 59326 62225 64673 66049 64516 65303 69051 66133 58192 49976
8677 49976 44368 44855 39169 33968 29678 31974 36899 41430 44130 42095 50104 58844 60470 62080 71829
8662 71829 81535 86169 90363 94038 105708 123336 135389 148699 151956 157818 161576 178294 201143
8649 201143 222126 256168 304218 363503 437772 546900 697007 879359 1080546 1283997 1468856
8638 1468856 1591722 1639163 1588511 1454410 1280518 1075193 870818 684730 529229 414845
8628 414845 330178 273395 230451 197262 173283 150597 133112 120951 106317 98039 88166 76308
8616 76308 76313 75630 75285 74040 77547 78180 76310 75778 75172 74587 62977 66079 75483 79548 85268 94683 98259
8599 98259 96614 95913 99796 95774 96717 95589 99567 101836 101493 105237 113435 118423 117559 121540 123238 127175
$$ packed form
8692C5126m001J1422K757m821R229R614K899K448J376j533P87L748k918p941q216
8677D9976n608M87n686n201m290K296M925M531K700k035Q009Q740J626J610R749
8662G1829R706M634M194L675J1670J7628J2053J3310L257N862L758J6718K2849
8649B01143K0983L4042M8050N9285P4269J09128J50107J82352K01187K03451J84859
8638A468856J22866M7441n0652j34101j73892k05325k04375j86088j55501j14384
8628D14845q4667n6783m2944l3189k3979k2686j7485j2161j4634q278r873j1858
8616G6308No83l45j245L507O33j870n32o06n85j1610L102R404M065N720R415L576
8599I8259j645p01L883m022R43j128L978K269l43L744Q198M988q64L981J698L937
$$ plain form
8583 127175 122086 117995 118230 109832 99767 93053 94697 107559 127565 156614 184493 219113 251882
8570 251882 272099 280138 285114 284806 290896 306020 328917 370041 457006 634896 898785 1188223
8558 1188223 1379381 1380173 1207843 931076 654279 463254 345428 265568 215356 192491 166412
8547 166412 148346 139734 142425 150269 155502 154560 154943 149340 137103 127119 114995 108723 118390 131734
8533 131734 149806 166689 177983 194792 208749 211037 209155 203173 208328 221347 235594 257465
8521 257465 295027 356230 450674 605710 885171 1360260 1993239 2522756 2677904 2460451
8511 2460451 1951250 1360698 917739 642872 464879 352649 273388 216800 177570 148733
8501 148733 127896 115220 114086 112925 108177 95690 90639 86701 81567 75989 79663 84316 88755 100437
$$ packed form
8583A27175n089m091K35q398j0065o714J644J2862K0006K9049K7879L4620L2769
8570B51882K0217Q039M976l08O090J5124K2897M1124Q6965J77890K63889K89438
8558A188223J91158P92j72330k76767k76797j91025j17826p9860n0212k2865k6079
8547A66412j8066q612K691P844N233r42L83n603j2237r984j2124o272R667J3344
8533A31734J8072J6883J1294J6809J3957K288j882n982N155J3019J4247K1871
8521B57465L7562O1203R4444J55036K79461M75089O32979N29517J55148k17453
8511B460451n09201n90552m42959k74867j77993j12230p9261n6588l9230k8837
8501A48733k0837j2676j134j161m748j2487n051l938n134n578L674M653M439J1682
$$ plain form
8487 100437 116031 126236 131197 130464 123577 115819 122541 125258 129511 143730 166126 189835 223243
8474 223243 284714 390201 574271 837169 1117800 1286299 1258831 1074864 793992 539603
8464 539603 366343 254325 178711 133601 101560 82040 69185 62250 55293 47876 43417 39012
8452 39012 37483 37958 36662 28745 31105 32740 32503 29214 27636 25437 26814 31032 26575 27948 28817
8437 28817 22864 16684 13518 13208 14339 17340 13818 11555 11225 13523 18359 20500 18875 8667 3115
8422 3115 10517 20609 23607 20575 21574 17794 14829 18743 19577 20191 19859 21302 21710 24635 29704 24437
8406 24437 20637 21465 23582 27019 32637 30241 28949 29594 28517 22291 26650 22790 21323 23761 28896
8391 28896 34847 39829 48114 57124 66495 62080 53035 47900 41226 32567 27681 24688 25779 22263 25783
$$ packed form
8487A00437J5594J0205M961p33o887p758O722K717M253J4219K2396K3709L3408
8474B23243O1471J05487J84070K62898K80631J68499k7468j83967k80872k54389
8464E39603j73260j12018p5614m5110l2041j9520j2855o935o957p417m459m405
8452C9012j529M75j296p917K360J635k37l289j578k199J377M218m457J373Q69
8437B8817n953o180l166l10J131L001l522k263l30K298M836K141j625j0208n552
8422C115P402J0092K998l032R99l780k965L914Q34O14l32J443M08K925N069n267
8406B4437l800Q28K117L437N618k396j292O45j077o226M359l860j467K438N135
8391B8896N951M982Q285R010R371m415r045n135o674q659m886k993J091l516L520
$$ plain form
8376 25783 31342 31735 28853 27737 22818 22772 18837 10958 18587 26755 23204 19063 15460 19402 20870
8361 20870 26901 31359 25536 18185 18226 22823 22662 19385 15873 8814 10376 8363 19800 27174 31264
8346 31264 43116 49047 50887 54251 60571 59213 53355 51270 40693 29622 25785 23947 25018 28303
8332 28303 22290 22601 21400 15608 15672 11521 13109 20252 17170 11228 13027 10361 7396 11508 14370
8317 14370 12640 9938 8899 16624 23400 14687 15121 24046 28392 29218 26625 23187 22078 19668 22910
8302 22910 25217 25691 31818 41762 48868 55049 59658 63044 60023 55543 51050 41112 35731 33383 25625
8287 25625 15772 18867 19020 22115 26483 23197 13227 18337 17877 21924 25701 18918 20336 17158 16894
8272 16894 20376 20493 11021 12150 12798 11869 20845 19162 6633 4631 8662 15785 17118 14420 22066
$$ packed form
8376B5783N559L93k882j116m919m6l935p879P629Q168l551m141l603L942J468
8361B0870O031M458n823p351M1M597j61l277l512p059J562k013J1437P374M090
8346C1264J1852N931J840L364O320j358n858k085j0577j1071l837j838J071L285
8332B8303o013L11j201n792O4m151J588P143l082n942J799k666k965M112K862
8317A4370j730k702j039P725O776q713M34Q925M346Q26k593l438j109k410L242
8302B2910K307M74O127R944P106O181M609L386l021m480m493r938n381k348p758
8287B5625r853L095J53L095M368l286r970N110m60M047L777o783J418l178k64
8272A6894L482J17r472J129O48r29Q976j683j2529k002M031P123J333k698P646
$$ plain form
8257 22066 28521 38278 43559 53080 52093 58796 70409 68185 49949 35850 28182 23550 20763 16615
8243 16615 19478 17519 17986 19052 17167 16133 19446 24477 28431 32065 33211 27812 29680 23273 16004
8228 16004 11824 15343 16578 16705 16133 15516 12999 12903 15433 15627 16878 16888 16129 22165 22402 21265 27349
8211 27349 28261 20858 17488 15297 15507 16023 15399 16984 19973 17248 12020 10884 12665 20492 30860
8196 30860 32268 25218 22384 21838 26073 28071 31612 30393 32851 29578 29388 31573 28238 14633 11256
8181 11256 15537 19351 22448 23892 19511 20437 22033 16032 20197 22664 22318 26641 26646 27225 32210 37644
8165 37644 35290 37013 41960 42266 40007 35379 32230 31024 33443 33299 24573 18550 19141 18615 26287 32719
8149 32719 35008 31927 30648 33564 30522 26489 22030 24045 26373 22478 19801 21716 25917 26812 23334
$$ packed form
8257B2066O455R757N281R521r87O703J1613k224j8236j4099p668m632k787m148
8243A6615K863j959M67J066j885j034L313N031L954L634J146n399J868o407p269
8228A6004m180L519J235J27n72o17k517r6K530J94J251J0p59O036K37j137O084
8211B7349R12p403l370k191K10N16o24J585K989k725n228j136J781P827J0368
8196C0860J408p050k834n46M235J998L541j219K458l273j90K185l335j3605l377
8181A1256M281L814L097J444m381R26J596o001M165K467l46M323NN79M985N434
8165C7644k354J723M947L06k259m628l149j206K419j44q726o023N91n26P672O432
8149C2719K289l081j279K916l042m033m459K015K328l895k677J915M201Q95l478
$$ plain form
8134 23334 27657 31686 30894 32511 30631 27899 26481 29671 25131 20873 29739 30105 31295 33366 46798
8119 46798 55360 57804 52078 46504 41454 38838 40484 43813 44082 39542 32693 30428 29984 28745 24704
8104 24704 23832 27609 36029 42943 38943 40871 33782 30567 29781 25388 29448 30177 40440 41882 35536
8089 35536 31666 22700 18988 18923 19469 18337 20595 22348 23010 29276 29529 28226 33145 38321 40029 34408
8073 34408 33857 30404 26559 26788 33554 36325 33163 34580 33998 34170 36597 39893 42797 46947 43253 43525
8057 43525 44285 35903 35291 39362 38129 40736 45812 46105 44543 38001 35816 34031 36525 41051 41543 40809
8041 40809 38600 36974 36132 39461 46667 50641 54352 50252 47742 47644 48578 51407 52454 53089 56438 55441
8025 55441 52193 52887 55669 51404 38270 37923 36229 31033 31385 35472 43240 45836 44132 39834 41226
$$ packed form
8134B3334M323M029p92J617j880k732j418L190m540m258Q866L66J190K071J3432
8119D6798Q562K444n726n574n050k616J646L329K69m540o849k265m44j239m041
8104B4704q72L777Q420O914m000J928p089l215p86m393M060P29J0263J442o346
8089C5536l870q966l712o5N46j132K258J753O62O266K53j303M919N176J708n621
8073C4408n51l453l845K29O766K771l162J417n82J72K427L296K904M150l694K72
8057D3525P60q382o12M071j233K607N076K93j562o542k185j785K494M526M92p34
8041D0809k209j626q42L329P206L974L711m100k510r8R34K829J047O35L349r97
8025E5441l248O94K782m265j3134l47j694n196L52M087P768K596j704m298J392
$$ plain form
8010 41226 41555 43225 45423 53353 55154 50021 48222 52020 59400 65355 68521 69239 70848 62697 66252
7995 66252 68341 66581 68251 75103 77471 74285 72188 62564 66540 79098 78409 71546 71857 78714 84116
7980 84116 83885 80730 78772 88769 101363 111831 117301 126709 132645 134459 133985 132496 126016 124146 111285
7965 111285 103367 101147 101859 100938 104273 110290 106721 103785 105603 100878 99873 100845 94294 89939 91334
7950 91334 83221 70673 63556 63924 72382 70030 64251 61443 62461 70684 73307 81305 88818 87064 83454
7935 83454 89068 97167 105538 114093 120048 126763 127821 123028 115794 100704 91109 82422 76970 77014 64579
7920 64579 57052 60821 61922 64351 68061 67219 67223 70075 71951 67137 66438 62149 55013 51118 49188 45567
7904 45567 45493 48947 46702 43301 37636 37070 34208 35728 28214 16866 15873 17981 19506 18574 21128 23525
$$ packed form
8010D1226L29J670K198P930J801n133j799L798P380N955L166P18J609q151L555
7995F6252K089j760J670O852K368l186k097r624L976J2558o89o863L11O857N402
7980H4116k31l155j958R997J2594J0468N470R408N936J814m74j489o480j870j2861
7965A11285p918k220P12r21L335O017l569k936J818m725j005R72o551m355J395
7950I1334q113j2548p117L68Q458k352n779k808J018Q223K623P998P513j754l610
7935H3454N614Q099Q371Q555N955O715J058m793p234j5090r595q687n452M4j2435
7920F4579p527L769J101K429L710q42MK852J876m814o99m289p136l895j930l621
7904D5567p4L454k245l401n665n66k862J520p514j1348r93K108J525r32K554K397
$$ plain form
7888 23525 28097 27104 20044 14222 12932 17141 17051 18648 12064 16857 20985 16804 10121 14895 16322
7873 16322 22719 16021 8240 12713 20437 14624 17140 20726 23189 26873 25759 30776 31134 22727 13834
7858 13834 11716 14784 21124 22338 20633 17895 16099 14869 14931 14266 13346 12555 16411 22637 15311 11171
7842 11171 8524 6519 9530 12436 12030 6648 8920 11164 8130 4659 3924 4829 1609 1547 3841 2993
7826 2993 2862 3116 -13 -345 -964 360 -681 -909 3813 7945 5328 8456 8071 4441 5589 7417
7810 7417 5072 6498 7025 5582 -2624 4780 -592 -4541 -3115 2038 5339 3147 -46 -3749 -1552
7795 -1552 -2619 -1253 4332 8668 11628 10288 6848 11006 9357 10837 9065 7355 4616 6042 12242
7780 12242 13228 14637 12555 10604 6794 5866 1903 558 6414 5049 8190 11372 21126 17056 15849
$$ packed form
7888B3525M572r93p060n822j290M209r0J597o584M793M128m181o683M774J427
7873A6322O397o698p781M473P724n813K516L586K463L684j114N017L58q407q893
7858A3834k118L068O340J214j705k738j796j230O2o65r20p91L856O226p326m140
7842A1171k647k005L011K906m06n382K272K244l034l471p35R05l220o2K294q48
7826B993j31K54l129l32o19J324j041k28M722M132k617L128l85l630J148J828
7810G417k345J426N27j443q206P404n372l949J426N153L301k192l193l703K197
7795a552j067J366N585M336K960j340l440M158j649J480j772j710k739J426O200
7780A2242R86J409k082j951l810r28l963j345N856j365L141L182R754m070j207
$$ plain form
7765 15849 11026 2937 -770 3530 6552 9341 14816 18282 16802 19370 20890 19458 9633 6691 4917
7750 4917 3219 -635 -539 3693 7096 5866 4682 10794 15419 16080 13804 10214 11351 13129 10107 9246
7734 9246 7655 8561 10692 8432 10179 16203 16380 10808 3296 7109 14476 16312 12280 6429 3648
7719 3648 10837 18620 22933 19705 12622 10659 15724 18606 13400 13290 12970 12995 11266 7880 4374 2455
7703 2455 3043 -715 -330 2737 7313 9818 10143 14022 16948 12220 10224 6128 8970 13091 14514 13336
7687 13336 5721 -1583 -3362 -605 8204 5470 3299 9007 5580 5189 8992 6857 5861 7390 4870
7672 4870 2164 5239 2472 143 -122 -489 2042 7036 9262 11021 8215 9026 3119 581 4599 1527
7656 1527 2278 169 -5254 -1281 -656 -4548 -5588 -3245 -4824 -8260 -9523 -4471 8184 7931 5451
$$ packed form
7765A5849m823q089l707M300L022K789N475L466j480K568J520j432r825k942j774
7750D917j698l854R6M232L403j230j184O112M625O61k276l590J137J778l022q61
7734I246j591R06K131k260J747O024J77n572p512L813P367J836m032n851k781
7719C648P189P783M313l228p083j963N065K882n206j10l20K5j729l386l506j919
7703B455N88l758L85L067M576K505L25L879K926m728j996m096K842M121J423j178
7687A3336p615p304j779K757Q809k734k171N708l427l91L803k135r96J529k520
7672D870k706L075k767k329k65l67K531M994K226J759k806Q11n907k538M018l072
7656A527P51k109n423L973O25l892j040K343j579l436j263N052J2655k53k480
$$ plain form
7641 5451 5569 1712 7537 3457 -2389 -953 -76 -2314 -2572 -7156 -9428 -14863 -15675 -13734 -5928 -443
7625 -443 -1933 -7873 -6910 -5185 -2717 2691 -2378 -3937 -3035 -3660 -5262 -6485 -10063 -11451 -4000 -2744
7609 -2744 -9670 -7225 -4856 -5130 351 7398 8375 1427 4142 9728 -1264 -2901 -291 542 -358 -3496
7593 -3496 -3820 -3217 -7054 -8789 -5703 -1132 2234 5155 2991 375 -6228 528 3325 3379 4950 2700
7577 2700 -3798 -3897 933 1962 -1288 2080 4829 7680 5548 3475 -3575 -3022 2703 3567 479 -7167
7561 -7167 -9358 -6341 -8759 -9393 -7071 -6433 -5485 -3795 -747 -3550 -4580 -2415 -3390 -4691 -7811 -9133
7545 -9133 -7606 -8272 -5811 -2050 5744 4923 -1811 -4642 -4578 -7545 -5652 923 3514 5404 4665 -2869
7529 -2869 -6661 -9216 -10626 -5901 -4971 -10830 -10720 -9497 -6087 -9891 -17910 -16836 -17795 -12200 -9903 -11377
$$ packed form
7641E451J18l857N825m080n846J436Q77k238k58m584k272n435q12J941P806N485
7625d43j490n940R63J725K468N408n069j559R02o25j602j223l578j388P451J256
7609b744o926K445K369k74N481P047R77o948K715N586j0992j637K610Q33r00l138
7593c496l24O03l837j735L086M571L366K921k164k616o603O756K797N4J571k250
7577B700o498r9M830J029l250L368K749K851k132k073p050N53N725Q64l088p646
7561g167k191L017k418o34K322O38R48J690L048k803j030K165r75j301l120j322
7545i133J527o66K461L761P794q21o734k831O4k967J893O575K591J890p39p534
7529b869l792k555j410M725R30n859J10J223L410l804q019J074r59N595K297j474
$$ plain form
7513 -11377 -8545 -1571 -2470 -2099 -28 -760 -6948 -12098 -9158 -8349 -6669 -5460 3166 5734 9028 5799
7497 5799 -1882 6227 11458 6974 -2765 -5567 -2463 2488 -1573 -7490 -5276 -3351 -1244 -4979 -9558
7482 -9558 -7698 -5623 -7411 -7285 -3172 -4599 -2201 -4206 141 3894 1794 -6497 -11109 -13058 -15540
7467 -15540 -13419 -7906 -4613 -6885 -5265 -4510 -4372 -2066 -3826 -5975 -9575 -13643 -11924 -6554 -9041
7452 -9041 -7833 -4021 5316 3936 -1758 -3585 -7874 -12574 -10245 -3995 231 3708 3631 1588 1163 -611
7436 -611 1592 -684 -2696 -4898 -7382 -9560 -10475 -8376 -7008 -5998 -9396 -3300 46 -2343 1493
7421 1493 2262 6270 4857 -4438 -6770 -3217 -1372 -216 5681 5646 6312 6689 4899 -1982 -9863 -14193
7405 -14193 -17558 -17823 -9762 -589 -4228 -4723 1943 2871 -5389 -3210 -6895 -6665 -5144 -1587 6743 5346
$$ packed form
7513a1377K832O974q99L71K071p32o188n150K940Q09J680J209Q626K568L294l229
7497E799p681Q109N231m484r739k802L104M951m061n917K214J925K107l735m579
7482i558J860K075j788J26M113j427K398k005M347L753k100q291m612j949k482
7467a5540K121N513L293k272J620P55J38K306j760k149l600m068J719N370k487
7452i041J208L812R337j380n694j827m289m700K329O250M226L477p7k043m25j774
7436f11K203k276k012k202k484k178r15K099J368J010l398O096L346k389L836
7421A493P69M008j413r295k332L553J845J156N897l5O66L77j790o881p881m330
7405a4193l365k65Q061R173l639m95O666R28q260K179l685K30J521L557Q330j397
$$ plain form
7389 5346 5973 2624 -1401 1232 -758 -7659 -15076 -14590 -17178 -18042 -22152 -14662 -8353 -6844 -8333 1077
7373 1077 7496 5553 6759 9375 10315 13149 9106 -2723 -8473 -7372 -4501 974 6532 8241 2859
7358 2859 -3088 -2405 -1354 -7210 -11152 -9318 -8021 -10635 -5138 -3988 -3115 -2554 -7889 -14721 -18492 -13670
7342 -13670 -13697 -6633 -3026 -880 -6331 -6271 -1190 2274 4804 3575 3166 -582 -3048 -2114 -3323 -10512
7326 -10512 -11516 -13936 -4149 -5133 -2443 4550 4198 -4126 -5428 -5568 -10572 -1853 2515 91 677 -3629
7310 -3629 -10512 -11318 -3481 3599 6402 10843 7357 4522 -499 -7174 -14378 -12959 -6034 -2694 -5021
7295 -5021 -3963 3238 2363 1388 -1574 -2900 2712 7434 2976 -814 -6503 -7062 -2758 857 3119 -5509
7279 -5509 -6630 -9289 -11601 -10853 -7755 -2009 2994 -4349 -9362 -12607 -16470 -11661 -5869 -5311 -7325
$$ packed form
7389E346O27l349m025K633j990o901p417M86k588q64m110P490O309J509j489R410
7373A077O419j943J206K616R40K834m043j1829n750J101K871N475N558J709n382
7358B859n947O83J051n856l942J834J297k614N497J150Q73N61n335o832l771M822
7342a3670k7P064L607K146n451O0N081L464K530j229m09l748k466R34j209p189
7326a0512j004k420R787r84K690O993l52q324j302j40n004Q719M368k424N86m306
7310c629o883q06P837P080K803M441l486k835n021o675p204J419O925L340k327
7295e021J058P201q75r75k962j326N612M722m458l790n689n59M304L615K262q628
7279e509j121k659k312P48L098N746N003p343n013l245l863M809N792N58k014
$$ plain form
7264 -7325 -11137 -9445 -11895 -8639 -2883 37 2762 3301 5834 6818 4511 -2793 -9363 -12811 -8178
7249 -8178 -6672 -753 -5158 -12637 -13809 -10442 -1858 775 -10690 -12084 -5260 -1224 1657 -1045 -1897
7234 -1897 -1403 -7417 -9697 -2775 1525 -3394 -7385 3208 5655 -1151 -517 -1675 -2632 -7659 -7391 -4576
7218 -4576 -1002 -2427 -3445 -2579 -3982 -2538 328 1439 -1542 436 667 -1887 -3656 -905 -1455 -3746
7202 -3746 -9285 -7262 -6853 -10969 -8897 -6441 -10637 -8897 -4714 -6393 -3982 -3208 -1685 1073 3548
7187 3548 9547 12441 10848 2323 2487 3928 1588 4916 5055 7826 300 2985 4095 7782 7039 1604
7171 1604 -2779 3603 5760 5232 8124 7999 1973 -5558 -5510 -5152 -7001 -7198 -4036 -2403 -4591 -4766 -2070
7154 -2070 -3023 5784 5423 -1147 -6452 -11763 -13342 -8918 997 6171 4520 -921 -6287 -4639 -4194 -1773
$$ packed form
7264g325l812J692k450L256N756K920K725N39K533R84k307p304o570l448M633
7249h178J506N919m405p479j172L367Q584K633j1465j394O824M036K881k702q52
7234a897M94o014k280O922M300m919l991J0593K447o806O34j158r57n027K68K815
7218d576L574j425j018Q66j403J444K866J111k981J978K31k554j769K751n50k291
7202c746n539K023M09m116K072K456m196J740M183j679K411P74J523K758K475
7187C548N999K894j593q525J64J441k340L328J39K771p526K685J110L687p43n435
7171A604m383O382K157n28K892j25o026p531M8L58j849j97L162J633k188j75K696
7154b070r53Q807l61o570n305n311j579M424R915N174j651n441n366J648M45K421
$$ plain form
7138 -1773 -6848 -7518 -9289 -11501 -5178 -4460 -3901 -357 3670 6799 2102 -1291 365 6109 6172 431
7122 431 -3246 2915 7331 6953 941 -2216 -5220 -4520 -5498 -2913 -2825 -12042 -13713 -14222 -10489 -9410 -13790
7105 -13790 -9647 -4104 3048 5377 6762 9900 7125 3399 3132 4853 9249 5736 3337 9764 11711
7090 11711 6880 4328 -1888 -812 2746 3195 557 -1426 -1115 2522 3984 1930 -1989 -5394 -4866
7075 -4866 -8923 -5464 -1932 -1759 -1251 -3176 2261 6106 4641 -3730 -4208 1 980 -363 554 -3028
7059 -3028 -5577 -8026 -4364 4060 4555 5197 4666 4719 -1144 -12913 -11597 -5885 -8636 -15368 -18299 -14579
7043 -14579 -14740 -12734 -9302 -1948 1027 -317 1850 4238 -8181 -12358 -15297 -9235 -1799 -2080 -6576
7028 -6576 -1280 5416 7714 -4476 -15201 -11567 -10676 -6390 -5649 -5071 -1620 -1053 -1268 -1799 173 -820
$$ packed form
7138a773n075o70j771k212O323P18N59L544M027L129m697l393J656N744O3n741
7122D31l677O161M416l78o012l157l004P00r78K585Q8r217j671n09L733J079m380
7105a3790M143N543P152K329J385L138k775l726k67J721M396l513k399O427J947
7090A1711m831k552o216J076L558M49k638j983L11L637J462k054l919l405N28
7075d866m057L459L532J73N08j925N437L845j465q371m78M209R79j343R17l582
7059c028k549k449L662Q424M95O42n31N3n863j1769J316N712k751o732k931L720
7043a4579j61K006L432P354K975j344K167K388j2419m177k939O062P436k81m496
7028f576N296O696K298j2190j0725L634Q91M286P41N78L451N67k15n31J972r93
$$ plain form
7012 -820 -5598 -4046 -3906 -5022 -5061 -8388 -8313 -13090 -7540 3429 -728 2419 -1317 -7660 -7231 -6249 -7088
6995 -7088 -4167 -6202 -12977 -13387 -6565 -7567 -4649 -1987 -668 -3549 -2993 4199 3871 1456 -1114 -1388
6979 -1388 1972 6022 6411 -644 -3214 -1661 -5448 -7034 -7877 -4515 840 1296 -8498 -14715 -10236 -8574
6963 -8574 -12402 -13145 -16874 -15716 -12857 -8187 -3366 -3666 -4172 -3665 -5802 -7605 -5286 -6806 -8042 -2031
6947 -2031 2049 5066 1343 1754 -769 -1116 -2836 -3788 -3413 -10220 -11222 -9128 -6008 -6076 -6221 2105 1727
6930 1727 4455 12753 6688 -7128 -10378 -7096 -3595 -3321 -7579 -9004 -9670 -6178 -6738 -3728 -2570
6915 -2570 -784 -305 -472 -5868 -6847 -6029 -2070 -3345 -2577 -17 1965 1680 5685 6989 7370 6624 -1677
6898 -1677 -1393 -1391 -1095 54 -2724 -7330 -5945 -8380 -7666 -11815 -9204 -8232 -7302 3831 3286 -2785 -5623
$$ packed form
7012h20m778J552J40j116l9l327P5m777N550J0969m157L147l736o343M29R82q39
6995g088K921k035o775m10O822j002K918K662J319k881N56P192l28k415k570k74
6979a388L360M050L89p055k570J553l787j586q43L362N355M56r794o217M479J662
6963h574l828p43l729J158K859M670M821l00n06N07k137j803K319j520j236O011
6947b031M080L017l723M11k523l47j720r52L75o807j002K094L120o8j45Q326l78
6930A727K728Q298o065j3816l250L282L501K74m258j425o66L492n60L010J158
6915b570J786M79j67n396r79Q18L959j275P68K560J982k85M005J304L81p46q301
6898a677K84KK96J149k778m606J385k435P14m149K611R72R30J1133n45o071k838
$$ plain form
6881 -5623 -3079 -5113 -12199 -10810 -4074 -3272 -4279 -750 980 -8377 -10495 -10555 -9659 -235 4507 4848
6865 4848 4000 -3062 -12037 -6825 -1697 -562 3942 -2675 -5527 -2348 1186 -4115 -5995 -2111 3329
6850 3329 10235 11710 5019 290 -633 242 -1186 1523 1534 2773 6514 5601 7606 2441 745 -547
6834 -547 -3657 -10184 -3695 -4378 -2978 -1748 100 809 2872 1078 -2288 -3592 -5939 799 -3537 -6441
6818 -6441 -3294 -6085 -4598 5166 8982 5056 4311 6892 3799 -1183 -3767 -1243 -3622 -3181 -698
6803 -698 533 9475 10798 11281 10253 4988 -969 -3918 -104 5840 6562 -173 -3221 -3677 -5168 -5769
6787 -5769 -1055 1706 6033 2561 3433 1949 3747 5881 2316 3498 -1738 -6709 -2773 2371 1256
6772 1256 -1757 -2513 2057 267 -1029 -1129 -3919 -3812 -7716 -11322 -6138 -5325 -4568 -13436 -16557 -6788
$$ packed form
6881e623K544k034p086J389O736Q02j007L529J730r357k118o0Q96R424M742L41
6865D848q48p062q975N212N128J135M504o617k852L179L534n301j880L884N440
6850C329O906J475o691m729r23Q75j428K709J1J239L741r13K005n165j696j292
6834e47l110o527O489o83J400J230J848P09K063j794l366j304k347O738m336k904
6818f441L147k791J487R764L816l926p45K581l093m982k584K524k379M41K483
6803f98J231Q942J323M83j028n265n957k949L814N944P22o735l048m56j491o01
6787e769M714K761M327l472Q72j484J798K134l565J182n236m971L936N144j115
6772A256l013p56M570j790j296j00k790J07l904l606N184Q13P57q868l121R769
$$ plain form
6756 -6788 5339 4362 1114 3160 3734 86 -3096 210 7133 11575 11934 11147 4147 3891 6950 9433
6740 9433 7339 7280 5985 2811 -1394 -2356 -2587 -3633 1310 2372 2096 6738 6028 773 1322 2556 3502
6723 3502 12331 19408 32840 45269 62760 75060 76386 79049 75764 63359 43918 33158 26763
6710 26763 20094 7619 -700 -4902 -5983 -3292 -1657 -1233 3914 4162 -83 -1274 -2179 -303 11474
6695 11474 11833 4767 5910 4061 10408 12712 9580 12953 19848 17048 11382 7831 727 -448 -807
6680 -807 5972 9818 6127 3852 -723 589 -714 -3637 -9363 -18313 -12671 -6955 -3592 -237 -3046
6665 -3046 -10593 -16921 -14975 -13171 -11324 -9927 -8602 -12481 -9314 -9877 -6315 -2503 -4842 -5636 -2770
6650 -2770 -351 845 -2569 -5401 -3228 -6545 -6019 -8986 -13143 -11887 -5388 -1820 2577 -131 -538
$$ packed form
6756f788J2127r77l248K046N74l648l182L306O923M442L59p87p000k56L059K483
6740I433k094n9j295l174m205r62k31j046M943J062k76M642p10n255N49J234R46
6723C502Q829P077J3432J2429J7491J2300J326K663l285j2405j9441j0760o395
6710B6763o669j2475q319m202j081K691J635M24N147K48m245j191r05J876J1777
6695A1474L59p066J143j849O347K304l132L373O895k800n666l551p104j175l59
6680h07O779L846l691k275m575J312j303k923n726q950N642N716L363L355k809
6665c046p547o328J946J804J847J397J325l879L167n63L562L812k339p94K866
6650b770K419J196l414k832K173l317N26k967m157J256O499L568M397k708m07
$$ plain form
6635 -538 -1434 -4048 -7138 -9373 -4554 -1660 -6180 -6926 -8160 -12996 -14805 -9289 -10600 -8185 -6943 -5095
6619 -5095 -3167 2521 6150 2275 -388 -7187 -5973 -5922 -1369 -1998 4721 9165 -1473 -5690 -2003
6604 -2003 696 1456 4043 2755 -374 3674 1193 2247 67 65 966 -1938 -5574 -7324 -6845 -8300
6588 -8300 -9894 -12706 -7920 -6356 -8580 -7475 -8396 -11522 -7950 -8104 -5198 -6716 -7547 -840 -1834 3354
6572 3354 1536 2492 2897 697 -661 -7384 -10193 -11536 -6101 -3093 -4649 -7047 -7698 -6739 -7258 -14327
6556 -14327 -13887 -7668 -8389 -9641 -9560 -2115 1947 -1467 -4870 6056 7481 3126 -1570 -712 -2113 -748
6540 -748 395 3820 5422 7716 5365 -635 -3727 -1109 -5213 -6599 -3383 -364 -4755 -8084 -11882
6525 -11882 -7051 1179 2138 163 -9004 -9651 -9494 -5240 7844 7386 2850 457 -3471 -2921 1590 587
$$ packed form
6635e38q96k614l090k235M819K894m520p46j234m836j809N516j311K415J242J848
6619e095J928N688L629l875k663o799J214N1M553o29O719M444j0638m217L687
6604b003K699P60K587j288l129M048k481J054k180kR01k904l636j750M79j455
6588h300j594k812M786J564k224J105r21l126L572j54K906j518q31O707r94N188
6572C354j818R56M05k200j358o723k809j343N435L008j556k398o51R59n19p069
6556a4327M40O219p21j252Q1P445M062l414l403J0926J425m355m696Q58j401J365
6540g48J143L425J602K294k351o000l092K618m104j386L216L019m391l329l798
6525a1882M831Q230R59j975r167o47J57M254J3084m58m536k393l928N50M511j003
$$ plain form
6509 587 -5542 -11440 -7487 -4468 -2822 -5641 -6364 -4904 -6256 -4456 -2908 -1863 -4372 -4881 -5616 -8869
6493 -8869 -8723 -3417 -7745 -9149 -13258 -14772 -8884 -7854 269 5340 -4638 -12229 -14929 -9846 -10402
6478 -10402 -8495 -1666 2579 425 -5683 -11617 -10182 -4781 -3713 233 -6287 -4899 1721 5318 -4427
6463 -4427 -1852 6884 6147 29 -4876 -7176 -4135 -5934 -1132 4115 6524 2864 252 3118 4977
6448 4977 4382 -3006 -8245 -8160 -6539 -8754 -9045 -10810 -9498 -5194 1158 5918 1234 -217 -2531 -3716
6432 -3716 849 5251 7227 2561 -6251 -6642 -3910 1284 193 -8345 -6498 527 1222 -5064 -6189
6417 -6189 -760 -3692 -7035 -9767 -11520 -5556 -3007 1051 2701 -692 266 1492 581 -3239 -5596
6402 -5596 -3853 -582 -573 -2469 -1339 -3665 -2694 -11807 -12525 -9738 -10245 -14999 -15886 -11416 -12582 -13206 -8246
$$ packed form
6509E87o129n898L953L019J646k819p23J460j352J800J548J045k509n09p35l253
6493h869J46N306m328j404m109j514N888J030Q123N071r978p591k700N083n56
6478a0402J907O829M245k154o108n934J435N401J068L946o520J388O620L597r745
6463d427K575Q736p37o118m905k300L041j799M802N247K409l660k612K866J859
6448D977n95p388n239Q5J621k215k91j765J312M304O352M760m684j451k314j185
6432c716M565M402J976m666q812l91K732N194j091q538J847P025O95o286j125
6417f189N429k932l343k732j753N964K549M058J650l393R58J226r11l820k357
6402e596J743L271Rj896J130k326R71r113p18K787n07m754q87M470j166o24M960
$$ plain form
6385 -8246 -5867 -3991 -5599 -2530 -4904 -11124 -12347 -9513 -6729 -1973 7443 13124 10982 -4245 -9605
6370 -9605 -5791 -8086 -4880 -972 -5856 -2812 281 2144 3045 6422 2659 3457 2893 1296 -3580 -2689
6354 -2689 -11372 -10010 -9825 -12825 -15431 -10804 -16106 -19656 -17901 -17931 -15793 -13181 -8706 -9417 -11004 -6324
6338 -6324 -9113 -7301 -4801 -5866 -1485 973 -7166 -15080 -22201 -17168 -12112 -4733 -4847 242 4576
6323 4576 3311 1724 -3122 -11218 -10170 -2748 1249 5683 -2063 -669 -4976 -7389 -7691 -1539 7728
6308 7728 9700 9695 3408 -1351 -6747 -4708 629 -1087 1818 2965 2953 823 -1244 -7112 -8771 -7003
6292 -7003 -6869 -6248 -8701 -7795 -6011 -5836 -3040 -3595 2112 7321 6905 10820 14435 7422 3999 522
6276 522 -5178 -2226 -100 -3654 -963 1903 1262 -243 1041 3189 2458 -1228 -7857 -6923 2280 -923
$$ packed form
6385h246K379J876j608L069k374o220j223K834K784M756R416N681k142j5227n360
6370i605L814k295L206L908m884L044L093J863R01L377l763P98n64j597m876Q91
6354b689q683J362J85l000k606M627n302l550J755l0K138K612M475p11j587M680
6338f324k789J812K500j065M381K458q139p914p121N033N056P379j14N089M334
6323D576j265j587m846q096J048P422L997M434p746J394m307k413l02O152R267
6308G728J972no287m759n396K039N337j716K905J147j2k130k067n868j659J768
6292g003J34O21k453R06J784J75K796n55N707N209m16L915L615p013l423l477
6276E22n700K952K126l554K691K866o41j505J284K148p31l686o629R34R203l203
$$ plain form
6260 -923 -3128 -3613 -6152 -656 1957 651 -8633 -9189 -6244 -2838 -6691 -10233 -3076 2362 7283 7601
6244 7601 2166 1617 2814 4634 -3263 -10296 -7529 -5036 -5183 -5517 -2452 1454 953 -3655 -167 743
6228 743 254 -295 2803 3096 3216 2691 5870 4838 -348 -3807 5606 8801 2896 223 3589 2631 -343
6211 -343 2571 4520 679 -3315 -11047 -11095 -10169 -12940 -12632 -7708 -5087 -2508 -6179 -5814 -2042 822
6195 822 -1777 -8878 -11887 -8093 -4138 697 1933 4078 -571 -3862 -3537 -3193 4949 8052 4384 4810
6179 4810 -1842 -8588 -6960 -9342 -7244 -6227 -3400 -2344 -7977 -10430 -8335 -6165 -8767 -2734 391
6164 391 -7387 -2625 155 -1466 -1060 3513 2182 -327 -7632 -4357 -4960 -9606 -15554 -13813 -11119 -9842
6148 -9842 -7091 -7369 -4666 -5020 -3682 -2557 -7561 -9153 -12196 -12587 -8128 -8320 -3197 -5723 -5358 -2068
$$ packed form
6260i23k205m85k539N496K613j306r284n56K945L406l853l542P157N438M921L18
6244G601n435n49J197J820p897p033K767K493j47l34L065L906n01m608L488R10
6228G43m89n49L098K93J20n25L179j032n186l459R413L195n905k673L366r58k974
6211c43K914J949l841l994p732m8R26k771L08M924K621K579l671L65L772K864
6195H22k599p101l009L794L955M835J236K145m649l291L25L44Q142L103l668M26
6179D810o652o746J628k382K098J017K827J056n633k453K095K170k602O033L125
6164C91p778M762K780j621M06M573j331k509p305L275o03m646n948J741K694J277
6148i842K751k78K703l54J338J125n004j592l043l91M459j92N123k526L65L290
$$ plain form
6132 -2068 -3396 -4630 -3094 -6566 -7682 -7479 -7008 -5835 -4844 -4546 -4106 295 1790 -2101 -3310 -6121
6116 -6121 -2343 932 4456 6149 608 -5432 1361 7504 7973 10021 11386 11336 11077 1759 -517 4968
6100 4968 10488 5203 -1402 -2437 -10877 -13607 -9552 -391 510 -7541 -13261 -11927 -6387 -6004 -2321
6085 -2321 3029 8153 8008 3459 1905 1455 -2308 -5781 -10422 -6919 661 6170 6250 -3373 -7998 -3439
6069 -3439 -967 2412 -1838 -6490 -15057 -17007 -2446 -169 -5533 -5877 -2463 -2437 1459 2702 587
6054 587 -879 -4540 -6054 -541 2827 3488 -663 -7196 -5582 -2512 2797 9610 9705 281 -4127 -1907
6038 -1907 5629 8064 1806 5095 2579 1472 4270 2258 -744 -2377 4608 3391 -4049 -713 4470
6023 4470 4336 -599 776 -7456 -6838 -4831 -3050 -2281 676 -4783 -7416 -6227 -5092 -180 2847 5656
$$ packed form
6132b068j328j234J536l472j116K03M71J173R91K98M40M401J495l891j209k811
6116f121L778L275L524J693n541o040O793O143M69K048J365n0k59r318k276N485
6100D968N520n285o605j035q440k730M055R161R01q051n720J334N540L83L683
6085b321N350N124j45m549j554m50l763l473m641L503P580N509Q0r623m625M559
6069c439K472L379m250m652q567j950J4561K277n364l44L414K6L896J243k115
6054E87j466l661j514N513L368O61m151o533J614L070N309O813R5r424m408K220
6038a907P536K435o258L289k516j107K798k012l002j633O985j217p440L336N183
6023D470j34m935J375q232O18K007J781P69K957n459k633J189J135M912L027K809
$$ plain form
6007 5656 4524 -1349 -5385 -5369 -4770 -2653 -6803 -11246 -11400 -8658 -11386 -9432 -5587 -4558 -6270 -6808
5991 -6808 -3788 4154 5135 2479 -7688 -9250 -2703 -4052 -9588 -8159 321 7451 11507 4786 6190
5976 6190 4101 895 -6420 -7301 -3580 -1337 -3988 -6336 -5558 3323 5891 3438 -3023 -8106 -6401
5961 -6401 -7104 -10588 -15680 -17277 -11411 -10571 -11793 -17200 -20397 -9500 -6913 -10890 -10952 -7836 -1471 -519
5945 -519 -177 3941 -2416 -4002 5138 6624 3793 20 -9342 -12375 -2351 5806 9042 3530 -2385
5930 -2385 -2907 -6736 -6899 -4600 -4608 -2753 3900 8514 9493 6581 2513 1227 -3652 -11353 -3199 9201
5914 9201 9695 -892 5397 10103 3530 -2081 -4708 -7368 -8506 -7469 -9204 -7916 -3121 117 981
5899 981 -1692 -7382 -4011 -3684 -9558 -9064 -4213 -99 7563 8577 6636 1641 -3416 -3259 -310 8185
$$ packed form
6007E656j132n873m036J6N99K117m150m443j54K742k728J954L845J029j712n38
5991f808L020P942R81k656j0167j562O547j349n536J429Q480P130M056o721J404
5976F190k089l206p315q81L721K243k651k348P78Q881K568k453o461n083J705
5961f401p03l484n092j597N866Q40j222n407l197J0897K587l977o2L116O365R52
5945e19L42M118o357j586R140J486k831l773r362l033J0024Q157L236n512n915
5930b385n22l829j63K299qJ855O653M614R79k912m068j286m879p701Q154J2400
5914I201M94j0587O289M706o573n611k627k660j138J037j735J288M795L238Q64
5899I81k673n690L371L27n874M94M851M114P662J014j941m995n057J57K949Q495
$$ plain form
5883 8185 7745 -1220 -8735 -5250 -2969 -3895 -4855 3718 3913 7370 4840 437 -4269 -674 6159 7272
5867 7272 7425 2011 -5231 -9672 -8068 -5538 -5178 1787 7250 12092 10121 -53 -6848 -3607 -1123
5852 -1123 3541 7177 9642 -1338 -3316 -4773 -127 1708 -3294 -7337 -7515 -7691 -9534 -14307 -14408
5837 -14408 -10110 1404 3229 -802 172 6661 6929 -664 3451 777 -475 -6974 -9257 -1152 -697
5822 -697 -3206 -6319 -4602 471 3938 6443 3935 -3212 -8465 -7472 -7020 -2301 1933 1179 -1083 -1311
5806 -1311 -3628 -739 4271 -1753 -2762 1570 -1745 -2269 -4359 210 2506 200 1305 7073 1719
5791 1719 -2634 -737 -2964 -2817 -1419 519 3889 -2683 -7779 -3042 -4311 -5676 -2905 -129 -6687
5776 -6687 -10952 -16695 -15847 -9579 -679 3918 1277 3854 4637 2585 1200 1538 -2425 -10760 -8557 -9165
$$ packed form
5883H185m40q965p515L485K281r26r60Q573J95L457k530m403m706L595O833J113
5867G272J53n414p242m441J604K530L60O965N463M842j971j0174o795L241K484
5852a123M664L636K465j0980j978j457M646J835n002m043j78j76j843m773j01
5837a4408M298J1514J825m031R74O489K68p593M115k674j252o499k283Q105M55
5822f97k509l113J717N073L467K505k508p147n253R93M52M719M234p54k262k28
5806a311k317K889N010o024j009M332l315n24k090M569K296k306J105N768n354
5791A719m353J897k227J47J398J938L370o572n096M737j269j365K771K776o558
5776f687m265n743Q48O268Q900M597k641K577P83k052j385L38l963q335K203o08
$$ plain form
5760 -9165 -11214 -7754 -3123 -3174 289 57 1625 3601 2672 116 941 1891 64 819 -2983 -2646 -1367
5743 -1367 -1537 -7203 -15091 -15792 -3875 5532 11148 4810 -3338 1689 -345 -3825 -3639 -1968 68
5728 68 -6665 -5896 1226 -3738 -10792 -7223 191 8070 12952 5062 -2510 -2407 754 5738 2440 -5716
5712 -5716 854 -2545 -11480 -14454 -14555 -11435 -6331 154 1827 4423 6984 4986 4085 3081 -1503
5697 -1503 -5875 -12859 -16629 -11824 -6640 -9335 -4589 -5481 -3734 -2326 -3601 245 948 -4083 -9953
5682 -9953 -8933 -8691 -9226 -2316 -3847 -14335 -12235 -5216 4973 6833 1927 -1728 -883 597 1332
5667 1332 -1570 308 -1180 -3698 -6964 -7081 -4198 -766 -2156 -2586 -5012 -5111 -1892 -8861 -18571 -13988
5651 -13988 -6336 -687 5736 4032 -47 -6900 -11467 -6615 -4784 -4785 -3463 -2103 -7212 -10256 -9472 -3682
$$ packed form
5760i165k049L460M631n1L463k32J568J976r29k556Q25R50j827P55l802L37J279
5743a367j70n666p888p01J1917R407N616o338q148N027k034l480J86J671K036
5728F8o733P69P122m964p054L569P414P879M882p890p572J03L161M984l298q156
5712e716O570l399q935k974j01L120N104O485J673K596K561j998r01j004m584
5697a503m372o984l770M805N184k695M746q92J747J408j275L846P03n031n870
5682i953J020K42n35O910j531j0488K100P019J0189J860m906l655Q45J480P35
5667A332k902J878j488k518l266j17K883L432j390m30k426r9L219o969r710M583
5651a3988P652N649O423j704m079o853m567M852J831jJ322J360n109l044P84N790
$$ plain form
5635 -3682 4527 5533 644 2206 -375 -8635 -14068 -15718 -11578 -5450 -2746 -5734 -9158 -3190 -3319
5620 -3319 -3692 1876 5630 3711 -4629 -6675 -1464 3607 -530 -2447 -5921 -2749 1769 3373 2433
5605 2433 -2440 -3368 3716 3879 -8332 -10885 -631 4175 5934 9431 3636 -583 2000 6311 -1178
5590 -1178 -5992 -986 1327 -410 -7583 -9562 -10475 -10841 -7701 -6495 -11484 -9466 -611 1031 -3404
5575 -3404 -3769 -3123 -6875 -10907 -10821 -3973 -4082 -796 1357 642 443 -2514 -4430 -7934 -7628 -543 -525
5558 -525 -2756 -3312 5033 11649 16336 13295 10712 3617 -1257 -1512 3735 -39 -5162 -617 -1124 -2481
5542 -2481 -1257 -6119 -10163 -8263 -6401 -3948 -5768 -32 5474 5460 10411 7890 1799 1210 -1855 -6204
5526 -6204 -13460 -11671 -5743 -280 3149 9266 15292 13712 13357 11875 10608 3571 3009 -2289 -3659
$$ packed form
5635c682Q209J006m889J562k581q260n433j650M140O128K704k988l424N968j29
5620c319l73N568L754j919q340k046N211N071m137j917l474L172M518J604r40
5605B433m873r28P084J63j2211k553J0254M806J759L497n795m219K583M311p489
5590a178m814N006K313j737p173j979r13l66L140J206m989K018Q855J642m435
5575c404l65O46l752m032Q6O848j09L286K153p15j99k957j916l504L06P085J8
5558e25k231n56Q345O616M687l041k583p095m874k55N247l774n123M545n07j357
5542b481J224m862m044J900J862K453j820N736N506j4M951k521o091n89l065m349
5526f204p256J789N928N463L429O117O026j580l55j482j267p037n62n298j370
$$ plain form
5511 -3659 -2343 -3728 -983 5168 13248 7990 3629 2029 3044 8751 6745 4084 4635 4673 7154 9547
5495 9547 4527 -9944 -18769 -7900 747 769 -4795 -7611 -10159 -9849 -8901 -2741 -1385 -5305 -353
5480 -353 2426 -808 -3322 -2989 -161 653 -1596 -5400 -3841 -5647 -8360 -7018 -6124 -6586 -5026 -7242
5464 -7242 -7142 -11512 -17761 -13746 -15811 -12734 -6687 -9223 -6099 -9638 -17318 -21203 -21575 -20369 -13589
5449 -13589 -14780 -11442 -7687 -5307 -4938 -335 2342 -1142 -4699 -5137 -6906 281 1679 -4545 -4657
5434 -4657 -186 -5460 -6806 -5052 -506 4131 5773 5301 2277 -4151 -7666 -4716 -524 1342 6957
5419 6957 7637 2982 -5165 -5679 1125 -5481 -8579 -4453 222 4883 6910 8272 673 -5251 -8584
5404 -8584 -7859 -10401 -12023 -837 -1040 -6722 -6277 -11080 -4782 -1215 -253 -4199 -7388 -12055 -10922 -7942
$$ packed form
5511c659J316j385K745O151Q080n258m361j600J015N707k006k661N51L8K481K393
5495I547n020j4471q825J0869Q647K2n564k816k548L10R48O160J356l920M952
5480c53K779l234k514L33K828Q14k249l804J559j806k713J342Q94m62J560k216
5464g242J00m370o249M015k065L077O047k536L124l539p680l885l72J206O780
5449a3589j191L338L755K380L69M603K677l484l557m38j769P187J398o224j12
5434d657M471n274j346J754M546M637J642m72l024o428l515K950M192J866N615
5419F957O80m655q147n14O804o606l098M126M675M661K027J362p599n924l333
5404h584P25k542j622J1186k03n682M45m803O298L567R62l946l189m667J133K980
$$ plain form
5388 -7942 -6876 -4106 351 -3229 -1952 1015 -4935 -1903 -2523 -6137 3088 8211 10402 10209 9980 3247
5372 3247 -213 6789 5718 6165 3625 1453 4787 9186 4700 -4010 -5334 -2270 1331 1253 -2941 -9715
5356 -9715 -11601 -8666 -11174 -9702 -8788 -9428 -6246 -5478 -6267 2203 -2065 -5067 -8775 -7786 -3610 1683
5340 1683 164 -3099 3581 -917 -539 3750 4446 -4871 -3305 -1516 -2606 -6151 -8149 -3839 2760
5325 2760 -2994 -10961 -17497 -10022 1379 1382 -134 -948 1465 792 3168 8097 3358 -503 -3896 -2579
5309 -2579 3422 3334 1453 -1832 -4460 -2479 2072 6992 6147 6894 6897 8098 10375 10284 14416 12633 2270
5292 2270 -5556 -4209 -91 1174 1830 2330 8122 -1601 -6776 -10885 -14066 -14021 -11168 -6538 -2593 -2490
5276 -2490 -5159 -1742 4070 1582 -3350 314 8227 3786 -7077 -13053 -6351 -6289 -5356 1600 -2589
$$ packed form
5388g942J066K770M457l580J277K967n950L032o20l614R225N123K191j93k29o733
5372C247l460P002j071M47k540k172L334M399m486q710j324L064L601p8m194o774
5356i715j886K935k508J472R14o40L182P68p89Q470m268l002l708R89M176N293
5340A683j519l263O680m498L78M289O96r317J566J789j090l545j998M310O599
5325B760n754p967o536P475J1401Lj516q14K413o73K376M929m739l861l393J317
5309b579O001q8j881l285k628J981M551M920q45P47LJ201K277r1M132j783j0363
5292B270p826J347M118J265O56N00N792r723n175m109l181M5K853M630L945J03
5276b490k669L417N812k488m932L664P913m441j0863n976O702O2R33O956m189
$$ plain form
5261 -2589 -11142 -4376 2428 4629 4977 3145 4372 3462 1130 -1652 -5166 -1364 -597 -84 -787 196
5245 196 1019 829 421 -4113 -418 7157 1660 -2958 -7864 -14257 -9977 -7536 -9974 -12202 -10413 -5133
5229 -5133 -4324 -4172 -1450 928 288 2367 2512 -3675 -2247 -940 -4552 -1738 -1485 -4922 -5736 -7727
5213 -7727 -8525 -11475 -7138 348 3487 3783 -270 4684 6333 1009 1751 7669 7363 2633 -599 -3662
5197 -3662 -5719 -3294 -4292 -6941 -6914 -8990 -11584 -12319 -12636 -9936 -6317 -10932 -11302 -900 4758 4607
5181 4607 1692 -1593 -6098 -3095 -3746 -2256 -347 -9353 -8200 -9950 -8938 -4526 -1443 5348 7435
5166 7435 3395 2118 4270 -1284 -5213 -9057 -6972 -3328 -3959 32 2008 3085 5631 9398 2709
5151 2709 -4698 -8174 -5369 -1371 -3082 -11099 -15074 -10633 -4489 -614 134 -5713 -3196 2536 1910
$$ packed form
5261b589q553O766O804K201L48j832J227r10k332k782l514L802P67N13p03R83
5245A96Q23j90m08m534L695P575n497m618m906o393M280K441k438k228J789N280
5229e133Q09J52K722K378o40K079J45o187J428J307l612K814K53l437q14j991
5213g727p98k950M337P486L139K96m053M954J649n324P42N918l06m730l232l063
5197c662k057K425r98k649K7k076k594p35l17K700L619m615l70J0402N658j51
5181D607k915l285m505L003o51J490J909r006J153j750J012M412L083O791K087
5166G435m040j277K152n554l929l844K085L644o31L991J976J077K546L767o689
5151B709p407l476K805L998j711q017l975M441O144L875P48n847K517N732o26
$$ plain form
5136 1910 2230 7497 10837 5019 -182 7076 9419 9437 5713 9730 8936 9452 11769 2286 4943 3726
5120 3726 3860 2234 -2773 1966 5075 6259 4776 1448 7012 -1119 -2110 4966 6267 8503 7164
5105 7164 9693 12435 3568 -3057 -4490 -4007 -9188 -6409 -8223 -4583 -662 -286 1078 4756 2821
5090 2821 -1293 -7942 -5863 -2127 6 3683 3009 -264 779 1263 1525 3776 8315 8489 6505 -2302
5074 -2302 -1860 514 2792 2328 633 4327 -1358 -4562 -4517 -2130 6995 3915 1094 2477 5099 5985
5058 5985 6770 4028 3661 5377 5521 6333 5358 9939 5754 4954 2903 -5187 -93 4299 7587 3293
5042 3293 2318 2995 6797 4336 -2310 -8946 -14209 -10215 -5476 2359 -3465 -6970 -10888 -7317 -1218
5027 -1218 5222 6407 -1251 -5823 -8720 -4872 -2267 -4210 -4498 1092 2903 2566 2196 1193 -4212 -5909
$$ packed form
5136A910L20N267L340n818n201P258K343J8l724M017p94N16K317r483K657j217
5120C726J34j626n007M739L109J184j483l328N564q131r91P076J301K236j339
5105G164K529K742q867o625j433M83n181K779j814L640L921L76J364L678j935
5090B821m114o649K079L736K133L677o74l273J043M84K62K251M539J74j984q807
5074b302M42K374K278m64j695L694n685l204M5K387R125l080k821J383K622Q86
5058E985P85k742l67J716J44Q12r75M581m185q00k051q090N094M392L288m294
5042C293r75O77L802k461o646o636n263L994M739P835n824l505l918L571O099
5027a218O440J185p658m572k897L848K605j943k88N590J811l37l70j003n405j697
$$ plain form
5011 -5909 1200 129 2926 12497 11408 1400 -4928 -6392 -2268 -1548 3874 3474 4719 4000 1129
4996 1129 -3906 -1082 2613 -2851 -1621 -1985 1933 2453 3478 1680 -1410 -6833 -10041 -12503 -10143
4981 -10143 -11744 -7991 -12861 -18691 -21874 -14278 -7732 -7246 -4924 -4674 -5158 -12393 -14581 -9070 -4807
4966 -4807 -7736 -6576 150 1993 -2765 -6653 -5244 -1837 3637 3918 884 -2515 -5525 -8542 -5038
4951 -5038 -6419 -5466 -4802 162 891 -4413 -10498 -9618 -4480 -609 4124 2695 -2450 -3639 -5056 -12288
4935 -12288 -11520 -9557 -10483 -6639 -5416 -757 -2622 -6831 -7999 -1400 5237 8650 9935 5347 4289
4920 4289 4389 -416 -7789 -6761 -5079 -7552 -6104 -2577 -1058 -3987 -2091 4969 3780 2617 1229
4905 1229 1716 10 -1732 -3298 -5718 -3030 -1227 2786 2085 2 -1660 -5302 -5039 1339 2891 3621
$$ packed form
5011e909P109j071K797R571j089j0008o328j464M124P20N422m00J245p19k871
4996A129n035K824L695n464J230l64L918N20J025j798l090n423l208k462K360
4981a0143j601L753m870n830l183P596O546M86K322K50m84p235k188N511M263
4966d807k929J160O726J843m758l888J409L407N474K81l034l399l010l017L504
4951e038j381R53O64M964P29n304o085Q80N138L871M733j429n145j189j417p232
4935a2288P68J963r26L844J223M659j865m209j168O599O637L413J285m588j058
4920D289J00m805p373J028J682k473J448L527J519k929J896P060j189j163j388
4905A229M87j706j742j566k420K688J803M013p01k083j662l642K63O378J552P30
$$ plain form
4889 3621 3447 -1397 -1893 -1399 -5715 -10131 -8217 -10097 -5353 -3585 6669 13055 8708 424 -2205
4874 -2205 -3313 -6821 1034 5955 5412 -1192 -4055 -7006 -6869 3034 2040 1630 -2002 -2803 -1199 -1983
4858 -1983 -5380 -3698 -8150 -1895 3803 -3912 -8626 -2810 -28 -4985 -8535 -6346 -8091 -10737 -9742
4843 -9742 -1703 3267 -779 -1628 -5315 -2669 -3042 -3900 -2916 -3439 -1715 -890 -2800 -4703 -3786 -8760 -16197
4826 -16197 -16209 -1797 1938 -1787 -1691 40 5045 2095 461 -1418 -2279 -1460 235 -2634 -8812 -12843
4810 -12843 -6938 -6384 -11262 -11265 -11441 -2778 -2334 -7925 -5656 -349 -3472 -5079 -2955 3138 6319 6307 6797
4793 6797 2351 1306 3336 821 -1497 -2185 -4640 -7054 -7160 -9223 -7712 -4262 -7663 -10035 -9422 -5262
4777 -5262 -4906 308 9516 13033 2983 2227 1896 -1635 -1107 1095 385 -3049 282 4407 1957 -2559
$$ packed form
4889C621j74m844m96M94m316m416J914j880M744J768J0254O386m347q284k629
4874b205j108l508P855M921n43o604k863k951J37R903r94m10l632q01J604p84
4858a983l397J682m452O255N698p715m714N816K782m957l550K189j745k646R95
4843i742Q039M970m046q49l687K646l73q58R84n23J724Q25j910j903R17m974p437
4826a6197j2J4412L735l725R6J731N005k950j634j879q61Q19J695k869o178m031
4810a2843N905N54m878lj76Q663M44n591K269N307l123j607K124O093L181j2M90
4793F797m446j045K030k515k318o88k455k414j06k063J511L450l401k372O13M160
4777e262L56N214R208L517j0050p56l31l531N28K202p10l434L331M125k450m516
$$ plain form
4761 -2559 -3682 -1149 -2191 420 4666 -1838 -1724 6005 9650 12329 5640 4060 6806 8689 3837
4746 3837 2814 4406 2127 -2587 -1713 4970 12171 11057 3691 -5659 -5984 -3303 1869 2845 -2962 -10708
4730 -10708 -8458 -3567 -340 -92 -3171 -8222 -5158 -946 2537 2529 1763 3238 3574 4570 6020 -1717
4714 -1717 -6026 -6131 5911 8523 755 -2008 -192 1540 -1310 906 2955 7174 8440 1521 -7442
4699 -7442 -7062 -4815 -1878 2733 -409 822 4465 5356 3894 5545 6292 5384 -852 -5925 -7393 -5904
4683 -5904 5330 5126 8463 10760 4517 -2044 -7717 -2453 -4879 -4901 2810 1996 -3588 -225 5636 2261
4667 2261 -1460 -6068 -7293 -3833 4774 513 -1878 52 3059 -3635 -10313 -1569 -2254 -8211 -8584
4652 -8584 -7404 -2473 -3304 -2386 -3930 -10647 -9858 -979 6111 9606 5506 3106 4542 3373 -2364 -20
$$ packed form
4761b559j123K533j042K611M246o504J14P729L645K679o689j580K746J883m852
4746C837j023J592k279m714Q74O683P201j114p366r350l25K681N172R76n807p746
4730a0708K250M891L227K48l079n051L064M212L483qp66J475L36R96J450p737
4714a717m309j05J2042K612p768k763J816J732k850K216K049M219J266o919q963
4699g442L80K247K937M611l142J231L643Q91j462J651P47r08o236n073j468J489
4683e904J1234k04L337K297o243o561n673N264k426k2P711q14n584L363N861l375
4667B261l721m608j225L460Q607m261k391J930L007o694o678Q744o85n957l73
4652h584J180M931q31R18j544o717P89Q879P090L495m100k400J436j169n737K344
$$ plain form
4636 -20 6732 11959 9181 3196 7288 816 -6028 -5477 -1584 4862 7302 7243 3203 -4068 -9040 -14333
4620 -14333 -9461 -12300 -7320 -9157 -4579 -1799 2502 6964 8359 1182 -4934 -6264 -9918 -10548 -7706
4605 -7706 -6439 -5690 -12465 -14828 -13975 -8168 -8525 -8700 -2109 5663 5296 3258 -3842 -5849 -5475 -5589 -4692
4588 -4692 -570 -4811 -13417 -11669 -7388 -4849 116 -2066 -4143 -5625 -9745 -10145 -5800 -4128 -8140
4573 -8140 -7066 -8918 -11708 -3068 3578 3163 1643 2387 4725 4774 1107 -4532 -5394 -982 572 -3257
4557 -3257 -3572 1362 -1100 -772 3311 929 -1007 -1693 -3635 -4278 -1692 1633 4482 2522 1104 -6883
4541 -6883 -12925 -3434 -2898 2561 2808 -4087 -8001 -9636 -5660 -5833 -5830 -3811 -2114 -4881 -7349 -5913
4525 -5913 -14030 -12724 -3603 -1995 -6381 -7514 -6937 -7655 -3575 -7755 -14243 -13018 -8129 -130 -270 -4179
$$ packed form
4636b0O752N227k778n985M092o472o844N51L893O446K440n9m040p271m972n293
4620a4333M872k839M980j837M578K780M301M462J395p177o116j330l654o30K842
4605g706J267P49o775k363Q53N807l57j75O591P772l67k038p100k007L74j14Q97
4588d692M122m241q606J748M281K539M965k182k077j482m120m00M345J672m012
4573h140J074j852k790Q640O646m15j520P44K338M9l667n639q62M412J554l829
4557c257l15M934k462L28M083k382j936o86j942o43K586L325K849j960j418p987
4541f883o042R491N36N459K47o895l914j635L976j73LK019J697k767k468J436
4525e913q117J306R121J608m386j133N77p18M080m180o488J225M889P999j40l909
$$ plain form
4509 -4179 -6813 -5779 1478 962 -2453 3771 5948 3828 531 5185 3530 4096 4878 7234 3451 1285
4493 1285 344 4350 4621 -768 -3716 -4178 506 245 -2319 1044 359 1201 1229 406 6734 7330 5500
4476 5500 4524 2055 -3376 -6243 -4343 -3594 -6620 -3636 257 -146 -5080 -8733 -5057 -5105 -5109 -8633 -11782
4459 -11782 -2765 -128 3045 3210 2937 2137 4736 339 -2783 -3286 10 -2962 -8241 -5505 -2064 2070
4443 2070 6500 8712 8213 1147 -2487 1404 2534 4752 7844 12376 10014 2906 -2312 -354 813
4428 813 -1485 -2742 1453 6096 4943 -3909 -4967 -4268 -6795 -12455 -14737 -12213 -7629 -7525 -11632 -13865
4412 -13865 -5677 1483 6096 3687 2270 -411 -1404 -1832 -1373 -4967 -2160 3756 2251 7147 8770
4397 8770 11616 9598 3327 5276 7652 -3627 -8456 -9108 -15671 -12606 -2734 289 -4507 -5603 -7276
$$ packed form
4509d179k634J034P257n16l415O224K177k120l297M654j655N66P82K356l783k166
4493A285r41M006K71n389k948m62M684k61k564L363o85Q42K8q23O328N96j830
4476E500r76k469n431k867J900P49l026K984L893m03m934l653L676m8ml524l149
4459a1782R017K637L173J65k73q00K599m397l122n03L296k972n279K736L441M134
4443B070M430K212m99p066l634L891J130K218L092M532k362p108n218J958J167
4428H13k298j257M195M643j153q852j058O99k527n660k282K524M584J04m107k233
4412a3865Q188P160M613k409j417k681r93m28M59l594K807N916j505M896J623
4397H770K846k018o271J949K376j1279m829o52o563L065R872L023m796j096j673
$$ plain form
4382 -7276 -6539 -10457 -13123 -13313 -9465 -7255 -8174 -2060 -409 131 -1912 -1055 1125 2589 -5272 2262
4366 2262 1160 -148 336 1345 -1853 -7293 -3420 2217 9737 18286 16796 4388 3322 756 -3777
4351 -3777 -4539 3221 6647 11052 7164 1736 -3121 -2228 -1176 -523 -1464 462 -2565 -5671 -8953 -1993
4335 -1993 559 -3815 -4949 -11561 -14672 -4936 -641 -4030 -6771 -9706 -11682 -17706 -19722 -14804 -9460
4320 -9460 -9457 -7357 -3252 1061 6702 8602 8532 7918 2142 7117 8779 2656 598 3119 6313 9043
4304 9043 6347 13657 20232 19342 14038 7484 114 -1376 4586 -2816 -3825 201 -325 -5691 -9743
4289 -9743 -7728 -3622 -2436 -4333 -2068 -2284 -5092 1010 1254 -53 -2038 1470 -4621 -3086 -4379
4274 -4379 -6567 -5207 -7026 -8930 -6044 2147 7941 10491 4509 -1311 2592 5712 4128 4867 1481
$$ packed form
4382g276P37l918k666j90L848K210r19O114J651N40k043Q57K180J464p861P534
4366B262j102j308M84J009l198n440L873N637P520Q549j490j2408j066k566m533
4351c777p62P760L426M405l888n428m857Q93J052O53r41J926l027l106l282O960
4335a993K552m374j134o612l111R736M295l389k741k935j976o024k016M918N344
4320i460LK100M105M313N641J900p0o14n776M975J662o123k058K521L194K730
4304I043k696P310O575q90n304o554p370j490N962p402j009M026n26n366m052
4289i743K015M106J186j897K265k16k808O102K44j307j985L508o091J535j293
4274d379k188J360j819j904K886Q191N794K550n982n820L903L120j584P39l386
$$ plain form
4259 1481 -1559 -8051 -10786 -12501 -15455 -11483 -1077 896 560 2109 -2615 -4225 -3987 -2267 -1824
4244 -1824 1088 2568 -1318 -3258 -8537 -6964 -2253 -2324 1071 8398 14384 11474 5682 6518 4557 -2796
4228 -2796 -6314 -6122 -6936 -10696 -11843 -3081 10981 15300 17758 13930 2850 -4098 -3325 -1066 -4735
4213 -4735 -522 773 -1647 -4521 -859 848 5396 8562 7050 6258 -2080 -6747 -7600 -7499 -8036 -7232
4197 -7232 -8228 -7450 -10900 -18886 -15426 -13388 -9883 -2022 -984 -5338 -7744 -8966 -5572 -8310 -7522 -3291
4181 -3291 -5609 1739 4216 9098 9073 2842 -2139 -4737 -13471 -16768 -7527 -4179 -6910 -10086 -8015
4166 -8015 -9802 -7733 -16 8304 9564 6598 5956 10569 14625 9651 -3979 -9235 -12536 -9733 -5391
4151 -5391 -2623 2797 1499 -989 -1970 -2310 -394 -606 -6317 -10651 -11022 -6351 -397 -5171 -4004 2727
$$ packed form
4259A481l040o492k735j715k954L972J0406J973l36J549m724j610K38J720M43
4244a824K912J480l886j940n279J573M711p1L395P327N986k910n792Q36j961p353
4228b796l518J92q14l760j147Q762J4062M319K458l828j1080o948P73K259l669
4213d735M213J295k420k874L662J707M548L166j512p92q338m667q53J01n37Q04
4197g232r96P78l450p986L460K038L505P861J038m354k406j222L394k738P88M231
4181c291k318P348K477M882k5o231m981k598q734l297R241L348k731l176K071
4166h015j787K069P717Q320J260k966o42M613M056m974j3630n256l301K803M342
4151e391K768N420j298k488r81l40J916k12n711m334l71M671N954m774J167O731
$$ plain form
4135 2727 6881 8021 9566 13066 4458 -239 2405 6649 10583 8706 10784 9068 7260 9599 11237
4120 11237 6289 3712 6103 7318 945 2171 3634 14 2001 6627 2567 8484 12061 11613 17190
4105 17190 18619 12899 6994 5240 3618 -1252 -1887 3323 -2742 -9324 -4814 1509 -40 -734 7256
4090 7256 6354 -42 -284 4922 5895 5142 4529 8910 4938 -170 2070 1053 1848 2489 -2286 1822 3358
4073 3358 1657 -2662 -4378 -7286 -4046 3714 3325 1859 185 -1246 2159 6427 5129 1789 3304
4058 3304 4116 5532 8869 -800 -136 -10795 -10064 -9137 -9695 -8654 -1224 8883 11467 1694 -3286 -4943
4042 -4943 -6741 1479 1955 5593 6459 4221 7808 7404 4836 -1082 -5022 -6381 -1844 2020 5451 -728
4026 -728 -11804 -7387 -1456 -2256 -5853 -8985 -19067 -21483 -17786 -14263 -8494 -32 -4403 -3176 -2333
$$ packed form
4135B727M154J140J545L500q608m697K644M244L934j877K078j716j808K339J638
4120A1237m948k577K391J215o373J226J463l620J987M626m060N917L577m48N577
4105A7190J429n720n905j754j622m870o35N210o065o582M510O323j549o94P990
4090G256r02o396k42N206R73p53o13M381l972n108K240j017P95O41m775M108J536
4073C358j701m319j716k908L240P760l89j466j674j431L405M268j298l340J515
4058C304Q12J416L337r669O64j0659P31R27n58J041P430J0107K584r773m980j657
4042d943j798Q220M76L638Q66k238L587m04k568n918l940j359M537L864L431o179
4026g28j1076M417N931q00l597l132j0082k416L697L523N769Q462m371J227Q43
$$ plain form
4011 -2333 1202 4958 4239 736 -4054 -2322 49 4362 3941 794 -4350 -9616 -10829 -14945 -14479 -5322
3995 -5322 1698 5744 4728 -29 1017 6380 9846 2091 1456 5387 5293 7251 6068 2386 753 3219
3979 3219 691 -695 -1308 -2620 -577 -2606 -5384 -10370 -3924 -2766 -8515 -5355 2479 4466 -3973
3964 -3973 -3474 -1481 -3045 -4624 -4492 -6747 -4919 -5206 -13198 -12917 -10408 -7787 -10647 -13416 -7296 -9317
3948 -9317 -6747 -7790 -7407 -3053 -4817 -3110 -10033 -11587 -8626 -7037 -4709 1004 2017 896 1091
3933 1091 -1449 -1604 917 -550 -892 2149 746 -4063 -3230 -2279 2899 10654 13044 9127 7155 9294
3917 9294 4633 4134 -5063 -6745 -6325 -2250 4375 1833 -4731 -4184 -1338 3393 9679 9343 7791 -5410
3901 -5410 -11052 -8635 -3423 -3821 -2593 -2648 -6627 -6083 -6359 -3914 -6918 -8140 -4654 -2775 -404 5023
$$ packed form
4011b333L535L756p19l503m790J732K371M313m21l147n144n266j213m116M66R157
3995e322P020M046j016m757J046N363L466p755o35L931r4J958j183l682j633K466
3979C219k528j386o13j312K043k029k778m986O446J158n749L160P834J987q439
3964c973M99J993j564j579J32k255J828k87p992K81K509K621k860k769O120k021
3948i317K570j043L83M354j764J707o923j554K961J589K328N713J013j121J95
3933A091k540j55K521j467l42L041j403m809Q33R51N178P755K390l917j972K139
3917I294m661m99r197j682M20M075O625k542o564N47K846M731O286l36j552j3201
3901e410n642K417N212l98J228n5l979N44k76K445l004j222L486J879K371N427
$$ plain form
3885 5023 6424 5910 2514 367 5915 1004 1783 4586 4834 5605 6141 6451 4802 6503 12206 10284
3869 10284 6455 -504 -10108 -12725 -7098 -8189 -6808 -5081 -4287 -7663 -5653 -3494 -5590 -7072 -6453
3854 -6453 -5319 -3708 4875 3049 -4383 -10751 -12600 -11014 -3864 -2634 -3098 -9035 -15286 -14261 -11745
3839 -11745 -6252 10019 14207 9317 7903 1121 -6052 -8488 -6487 -763 546 -5650 -6984 -12682
3825 -12682 -11661 -7824 -3903 -1986 2227 -1019 -654 3587 5501 4340 -4034 -2422 -472 -4461 -4307
3810 -4307 -576 1733 -2075 -5625 -7598 863 4959 5509 688 1311 -252 -4812 -2177 -1074 -5266
3795 -5266 -8220 -12313 -13719 -7702 -2369 -4573 -10328 -8513 749 1057 -1944 -8604 -14301 -14659 -11680
3780 -11680 -12578 -11386 -7504 -11105 -13936 -9982 -6931 -8170 -10357 -7063 -6762 -12891 -11049 -1195 2484
$$ packed form
3885E023J401n14l396k147N548m911P79K803K48P71N36L10j649J701N703j922
3869A0284l829o959r604k617N627j091J381J727P94l376K010K159k096j482O19
3854f453J134J611Q583j826p432o368j849J586P150J230m64n937o251J025K516
3839a1745N493J6271M188m890j414o782p173k436K001N724J309o196j334n698
3825a2682J021L837L921J917M213l246L65M241J914j161q374J612J950l989J54
3810d307L731K309l808l550j973Q461M096N50m821O23j563m560K635J103m192
3795e266k954m093j406O017N333k204n755J815R262L08l001o660n697l58K979
3780a1680q98J192L882l601k831L954L051j239k187L294L01o129J842R854L679
$$ plain form
3765 2484 1564 2452 5714 8123 9297 5834 2084 -138 2912 -964 -7036 -2797 3596 9592 7936
3750 7936 5931 2465 846 2139 5777 2982 -2013 -3416 -8625 -7783 -6345 -6580 -3068 2210 -938
3735 -938 -3863 -1774 -3900 2249 5554 1939 3199 3437 -2879 -378 1095 4073 6426 653 -5946
3720 -5946 -2358 1170 -6606 -8130 -5465 -7108 -775 4549 7895 11969 9823 10296 6621 664 -8338
3705 -8338 -4950 -2762 -1828 -1234 -1619 -720 -2521 -4089 -8680 -6717 -2794 2737 -119 -1938 -383 1898
3689 1898 7454 5261 -1091 364 1516 695 -1500 -7679 -5871 2059 430 -6412 -3349 1297 1924
3674 1924 -1758 -2458 -8249 -12035 -8683 -7900 -5678 4014 701 229 4903 4518 1617 -693 2143 -649
3658 -649 361 12941 11481 857 -3294 -83 6901 11937 10834 2049 240 -2135 -5429 -4778 4351
$$ packed form
3765B484r20Q88L262K409J174l463l750k222L050l876o072M239O393N996j656
3750G936k005l466j619J293L638k795m995j403n209Q42J438k35L512N278l148
3735i38k925K089k126O149L305l615J260K38o316K501J473K978K353n773o599
3720e946L588L528p776j524K665j643O333N324L346M074k146M73l675n957r002
3705h338L388K188R34N94l85Q99j801j568m591J963L923N531k856j819J555K281
3689A898N556k193o352J455J152q21k195o179J808P930j629o842L063M646O27
3674A924l682p00n791l786L352P83K222R692l313m72M674l85k901k310K836k792
3658f49J010J2580j460j0624m151L211O984N036j103q785j809k375l294O51R129
$$ plain form
3643 4351 7338 7738 6300 2279 -1091 3666 -3310 -6552 3169 7353 4433 399 727 2309 4423
3628 4423 2999 4820 4460 -5073 -7252 -9115 587 3087 4442 8123 11487 9540 7430 12588 10620
3613 10620 3695 -431 -8248 -14390 -11954 -16260 -13355 -2239 1250 2502 5012 4304 4891 2200 2780
3598 2780 -2533 -9186 -10048 -9375 -9449 -3335 -969 3651 4301 -440 -2878 -3626 -1564 -3081 -3816 -3126 -5631
3581 -5631 -15236 -12341 -10083 -11746 -8398 -5524 894 6705 11256 8993 1860 1506 1897 2546 5055 1684
3565 1684 697 -4138 -10141 -7115 -7343 -5819 -2818 -2598 -3378 -1746 -2555 -3092 -6364 -8390 -11059 -11545 -8699
3548 -8699 999 8038 8157 9281 6284 4380 8817 10164 8943 5409 5812 3409 -951 -41 1832 908
3532 908 530 -5286 -15465 -9392 -10609 -14630 -14297 -8658 -609 -10864 -13791 -8397 -3187 -2717 -502
$$ packed form
3643D351K987M00j438m021l370M757o976l242R721M184k920m034L28J582K114
3628D423j424J821l60r533k179j863R702K500J355L681L364j947k110N158j968
3613A0620o925m126p817o142K436m306K905J1116L489J252K510p08N87k691N80
3598B780n313o653q62O73p4O114K366M620O50m741k438p48K062j517p35O90k505
3581e631r605K895K258j663L348K874O418N811M551k263p133l54L91O49K509l371
3565A684r87m835o003L026k28J524L001K20p80J632q09n37l272k026k669m86K846
3548h699R698P039J19J124k997j904M437J347j221l534M03k403m360R10J873r24
3532I08l78n816j0179O073j217m021L33N639Q049j0255k927N394N210M70K215
$$ plain form
3517 -502 -1223 -4328 -6963 573 4613 5548 3316 4002 -1966 -7205 -8909 -9859 -8378 -4952 -7948 -7761
3501 -7761 2317 6289 8503 1027 -1068 4654 1900 -279 -815 -3331 -4534 411 2979 3876 9327
3486 9327 4993 1682 -1359 -3322 3192 5379 3142 1405 -1003 -833 1882 4654 6685 1173 689
3471 689 -252 -4578 -4591 -4671 -7598 -2342 517 3052 4239 -1507 2304 5520 5161 -2861 -3269 -3275 1141 7545
3453 7545 8482 -827 -3288 -47 1827 1481 -426 -407 856 -871 -1167 6348 3935 -307 1602 1962
3437 1962 -1150 -8079 -3892 -185 -3522 -7568 -15886 -9502 -8503 -2480 68 4284 11413 6854 5353
3422 5353 4763 9392 9467 10793 4744 -7870 -11787 -11604 -6242 789 5392 5384 1249 -2136 -4684 2280
3406 2280 1794 4599 2920 2861 3310 -83 -1028 147 -2137 457 4091 3647 -1922 -12420 -11543 -5754
$$ packed form
3517e02p21l105k635P536M040R35k232O86n968n239j704r50J481L426k996J87
3501g761J0078L972K214p476k095N722k754k179n36k516j203M945K568Q97N451
3486I327m334l311l041j963O514K187k237j737k408J70K715K772K031n512m84
3471F89r41m326j3q0k927N256K859K535J187n746L811L216l59q022m08oM416O404
3453G545R37r309k461L241J874l46j907J9J263j727k96P515k413m242J909L60
3437A962l112o929M187L707l337m046q318O384R99O023K548M216P129m559j501
3422E353n90M629P5J326o049j2614l917J83N362P031M603qm135l385k548O964
3406B280m86K805j679n9M49l393r45J175k284K594L634m44n569j0498Q77N789
$$ plain form
3390 -5754 -10470 -8072 -4038 3650 2137 7801 12704 13554 7953 -2451 -1558 1528 -3877 -13247 -14489
3375 -14489 -5462 -2878 3015 -1926 -8049 1407 6306 8110 8466 10825 11136 7909 1763 -6526 -1768
3360 -1768 -1544 -1647 -2045 -8428 -4729 -770 2794 3085 259 188 3725 -1800 -5380 770 8024 4343
3344 4343 211 -5729 -6079 -444 1527 4635 2640 2951 -2838 -4110 668 2005 4428 12206 15099
3329 15099 14463 7719 348 -2757 3066 7249 8194 1551 -4088 -1811 -614 -2500 -4817 459 8444
3314 8444 2222 -1866 -7070 -9717 -4822 -829 -1258 -1790 1474 -5759 -7101 1519 5477 8044 5505
3299 5505 -1358 -1853 -4760 -12877 -10915 -9337 -14291 -12126 -10257 -3369 -4156 -6492 -5872 -571 -1004 1413
3283 1413 649 155 4364 -1070 -1765 -853 1566 3554 6131 11076 5977 7667 3500 -3165 -1754 -931
$$ packed form
3390e754m716K398M034P688j513N664M903Q50n601j0404Q93L086n405r370j242
3375a4489R027K584N893m941o123R456M899J804L56K359L11l227o146q289M758
3360a768K24j03l98o383L699L959L564K91k826p1L537n525l580O150P254l681
3344D343m132n940l50N635J971L108j995L11n789j272M778J337K423P778K893
3329A5099o36o744p371l105N823M183R45o643n639K277J197j886k317N276P985
3314H444o222m088n204k647M895L993m29n32L264p233j342Q620L958K567k539
3299E505o863m95k907q117J962J578m954K165J869O888p87k336O20N301m33K417
3283A413p64m94M209n434o95R12K419J988K577M945n099J690m167o665J411Q23
$$ plain form
3267 -931 1706 -946 -3698 132 3015 6011 3939 -4128 -3408 4379 8695 9070 10760 2843 -680 -2896
3251 -2896 -4788 -699 4556 8374 14885 9125 7320 23 -3662 -8756 -4251 -2605 -7084 -7789 -6657
3236 -6657 2798 5072 4969 6581 13194 13623 6271 1787 3213 9069 14096 14035 7327 1416 -6614 -5255
3220 -5255 -3711 -8813 -9633 -1863 -940 -3032 -3710 -8174 -5826 416 3119 1183 1853 3384 -838 -3360
3204 -3360 -7273 -10111 -10468 -9004 -14256 -14441 -12690 -9940 -12311 -17303 -9722 -3237 -492 -3905 -7007
3189 -7007 -10891 -5181 -436 3203 2651 -2837 -3591 -155 -44 1888 -1083 -2302 417 -4851 -8321 -7490
3173 -7490 -5318 -4643 -4848 -9915 -10422 -8418 -4766 -8748 -11581 -12527 -18368 -12883 -577 499 -2547 -5952
3157 -5952 -1587 -63 1068 -6029 -9189 -10594 -11012 -7104 -7521 -11942 -5645 -2986 -3472 -11144 -12931 -11565
$$ packed form
3267i31K637k652k752L830K883K996k072q067P20P787M316L75J690p917l523k216
3251b896j892M089N255L818O511n760j805p297l685n094M505J646m479p05J132
3236f657R455K274j03J612O613M29p352m484J426N856N027o1o708n911q030J359
3220e255J544n102q20P770R23k092o78m464K348O242K703j936O70J531m222k522
3204c360l913k838l57J464n252j85J751K750k371m992P581O485K745l413l102
3189g007l884N710M745L639n52n488p54L436J11J932k971j219K719n268l470Q31
3173g490K172O75k05n067n07K004L652l982k833r46n841N485J2306J076l046l405
3157e952M365J524J131p097l160j405m18L908m17m421O297K659m86p672j787J366
$$ plain form
3141 -11565 -7381 -3198 -9626 -9870 -6634 -10186 -6945 -4812 -5807 -7191 -11583 -11849 -13465 -14013 -7866 562
3125 562 2808 782 645 673 7589 8595 -3594 -7055 1080 5370 2367 -1152 6396 6392 8275 3345
3109 3345 1073 2146 1720 -1407 -2917 -6010 -7619 -5017 -4679 -146 -248 2238 5721 3953 394 -5544
3093 -5544 -5283 -6640 -6458 -3028 1544 4129 7364 7379 6270 1699 -1479 -4201 -2696 4541 8956 8665
3077 8665 8304 6573 13760 10550 5132 2904 2252 5530 9186 4572 3384 785 -3853 -4784 -105 4861
3061 4861 1039 -4426 -3869 -4018 -5792 -3335 -1559 1960 2068 -783 -5436 -4867 2689 7460 9669 3748
3045 3748 1888 2305 6065 -868 -483 -1117 1317 5773 5783 7861 8000 8767 11245 1240 -3970 -5157
3029 -5157 -10303 -6887 437 930 6004 5096 -465 -2244 -6116 -8591 -12459 -6546 -5345 -1728 6909
$$ packed form
3141a1565M184M183o428k44L236l552L241K133r95j384m392k66j616n48O147Q428
3125E62K246k026j37K8O916J006j2189l461Q135M290l003l519P548mJ883m930
3109C345k272J073m26l127j510l093j609K602L38M533j02K486L483j768l559n938
3093e544K61j357J82L430M572K585L235J5j109m571l178k722J505P237M415k91
3077H665l61j731P187l210n418k228o52L278L656m614j188k599m638r31M679M966
3061D861l822n465N57j49j774K457J776L519J08k851m653N69P556M771K209n921
3045C748j860M17L760o933L85o34K434M456J0K078J39P67K478j0005n210j187
3029e157n146L416P324M93N074r08n561j779l872k475l868N913J201L617Q637
$$ plain form
3014 6909 7273 3268 1841 -1578 -6909 -3120 -1733 -8659 -11886 -8636 -4963 -672 -5732 -9492 -9669
2999 -9669 -7950 -8539 -7994 -6559 -2422 426 3722 3291 -5283 -733 -4446 -8530 -6548 -7866 -7258 4029
2983 4029 734 -2130 -5412 -7621 -14059 -15147 -12666 -4063 3947 3280 6426 4088 -162 3728 9553
2968 9553 10104 2237 3581 6718 3936 102 -8127 -7066 -7881 -12155 -6943 -7937 -16444 -19761 -7720
2953 -7720 796 2710 -718 -904 -4880 -6447 -7478 -1252 3502 1900 -692 -4471 180 2535 -551
2938 -551 -62 -8505 -10383 -9159 -2534 -651 1426 667 1160 6732 3373 2463 5635 10525 9914 10577 5395
2921 5395 948 -1552 -4039 -978 1348 -2839 -3616 -714 -8809 -14946 -12422 -13894 -15877 -14370 -12222
2906 -12222 -7235 -142 4355 10925 9453 -2099 -8890 -1511 1311 1298 4870 5541 3143 -2257 -3573
$$ packed form
3014F909L64m005j427l419n331L789J387o926l227L250L673M291n060l760j77
2999i669J719n89N45J435M137K848L296m31q574M550l713m084J982j318O08J1287
2983D029l295k864l282k209o438j088K481Q603Q010o67L146k338m250L890N825
2968I553N51p867J344L137k782l834q229J061q15m274N212r94q507l317J2041
2953g720Q516J914l428j86l976j567j031O226M754j602k592l779M651K355l086
2938e51M89q443j878J224O625J883K077p59M93N572l359r10L172M890o11O63n182
2921E395m447k500k487L061K326m187p77K902q095o137K524j472j983J507K148
2906a2222M987P093M497O570j472j1552o791P379K822j3L572O71k398n400j316
$$ plain form
2891 -3573 1933 -2227 -8033 -6964 -7610 -4376 -1728 3505 2830 2878 5527 2470 -2508 2658 9923 7647
2875 7647 5396 -1077 -8705 -7780 -6756 -1033 2856 232 -1466 -882 -249 8394 15588 14339 9910 11894
2859 11894 12364 12671 12358 12018 5088 -965 -6614 743 7804 7120 932 157 -3800 -8971 -6419 -8529
2843 -8529 -1726 4696 13550 11234 -5480 -9849 -9297 -7630 -5247 -6846 -4181 2291 6126 1464 -1012
2828 -1012 3300 9187 5169 2570 -2790 -2248 -5161 -9795 -9742 -2946 4079 5827 5899 4443 2339 4258
2812 4258 3081 2764 1315 2059 1869 4317 2809 -163 -1947 -526 1201 -4567 -3285 4178 3173 -3884
2796 -3884 -9677 -2517 -2846 -7118 -1383 1523 536 486 2723 3020 -1927 -6638 -8148 -10663 -4908 -5293
2780 -5293 -2188 -5119 -3483 -6311 -9235 -3674 -334 3326 2925 2753 3506 7281 4141 -3485 -8466 -6411
$$ packed form
2891c573N506m160n806J069o46L234K648N233o75M8K649l057m978N166P265k276
2875G647k251o473p628R25J024N723L889k624j698N84O33Q643P194j249m429J984
2859A1894M70L07l13l40o930o053n649P357P061o84o188p75l957n171K552k110
2843h529O803O422Q854k316j6714m369N52J667K383j599K665O472L835m662k476
2828a012M312N887m018k599n360N42k913m634N3O796P025J748P2j456k104J919
2812D258j177l17j449P44j90K448j508k972j784J421J727n768J282P463j005p057
2796c884n793P160l29m272N735K906r87n0K237K97m947m711j510k515N755l85
2780e293L105k931J636k828k924N561L340L660m01j72P53L775l140p626m981K055
$$ plain form
2764 -6411 -7379 -7623 -2597 -6426 -10542 -13570 -7722 -708 8 465 3233 722 -2367 2478 9328 8227
2748 8227 8677 4416 6244 2760 367 -4314 -5853 5990 16771 13062 10781 10853 11424 11426 15269 5332
2732 5332 1979 8427 8426 -1336 -2387 -936 4978 4015 5297 169 -1372 -6176 -11175 -6475 -3091 -522
2716 -522 6651 7851 4095 5808 -429 -3595 2004 6883 4832 1105 -1289 -4773 -7605 -5624 -2864
2701 -2864 3907 4844 5101 4625 3762 6712 5169 4320 2495 1475 2343 1308 -7320 -10718 -1571 -3592
2685 -3592 -9754 -9397 -5793 -3593 -3362 -7249 -5286 -4644 -2523 6837 7028 4083 -2568 -4941 -1405 6366
2669 6366 5501 2168 1428 3489 -7677 -3788 786 1497 3631 8433 10294 5284 3977 7912 13144
2654 13144 11329 9279 8239 11661 7571 4441 2468 3278 4848 -264 -3152 -2912 -730 -16 1852
$$ packed form
2764f411r68k44N026l829m116l028N848P014P16M57K768k511l089M845O850j101
2748H227M50m261J828l484k393m681j539J1843J0781l709k281P2N71KL843r937
2732E332l353O448jr762j051J451N914r63J282n128j541m804m999M700L384K569
2716e22P173J200l756J713o237l166N599M879k051l727k394l484k832J981K760
2701b864O771R37K57m76q63K950j543q49j825j020Q68j035q628l398R147k021
2685c592o162L57L604K200K31l887J963O42K121R360J91k945o651k373L536P771
2669F366q65l333p40K061j1166L889M574P11K134M802J861n010j307L935N232
2654A3144j815k050j040L422m090l130j973Q10J570n112k888K40K182P14J868
$$ plain form
2639 1852 3649 3951 7088 3727 847 -2075 -3756 -6062 -7546 -6523 2821 10307 7248 1888 4496
2624 4496 4008 -2853 -1848 4307 9372 6259 2037 5726 -111 -8343 -5998 -5693 -9390 -8039 -5210
2609 -5210 -3364 -76 -3034 -2267 2901 4810 3750 707 -3881 -8861 -2686 -8600 -9067 -4108 -1264
2594 -1264 2107 3212 -1384 -3696 -847 714 -2720 -254 -2141 -11334 -6337 5523 13279 12421 7827
2579 7827 5791 3827 -1550 -10968 -6754 -5284 -7111 -7572 -9649 -7611 1197 3061 603 1512 9002
2564 9002 16732 16312 11238 20891 12699 -2736 -5595 -6274 792 10249 12499 11290 10316 10193 7077 3489
2548 3489 7550 9679 11284 7304 5480 6898 10045 2913 -5884 -6794 -5500 -3249 -3600 -6286 -6340 -4738
2532 -4738 -912 -413 -3164 322 2319 -1766 -916 7577 12054 12192 5533 -4411 -10243 -8091 -3931 -1034
$$ packed form
2639A852J797L02L137l361k880k922j681k306j484J023R344P486l059n360K608
2624D496m88o861J005O155N065l113m222L689n837q232K345L05l697J351K829
2609e210J846L288k958P67N168J909j060l043m588m980O175n914m67M959K844
2594a264L371J105m596k312K849J561l434K466j887r193M997J1860P756q58m594
2579G827k036j964n377r418M214J470j827m61k077K038Q808J864k458R09P490
2564I002P730m20n074R653q192j5435k859o79P066R457K250j209r74j23l116l588
2548C489M061K129J605l980j824J418L147p132q797r10J294K251l51k686n4J602
2532d738L826M99k751L486J997m085Q50Q493M477J38o659r944n832K152M160K897
$$ plain form
2516 -1034 -2229 -5373 -7737 -11571 -8179 -4258 -10669 -10031 -3112 13 1837 -1616 -8091 -1263 -9586
2501 -9586 -9560 -8808 -6876 -3112 -1826 -4291 -10421 -10518 -9397 -65 5563 11329 11652 5859 7856 14891
2485 14891 11751 9783 2265 -1952 -2235 -5200 -16619 -15482 -12528 -8228 -5786 -2439 115 -216 4840
2470 4840 3648 79 -4152 -5746 -5786 -2436 -1712 -1497 -2508 -4022 -5445 438 9023 9404 8708 2534
2454 2534 -38 3811 492 -2628 -671 1895 5194 7258 1886 -1270 -1473 5710 7222 498 -5836
2439 -5836 -3230 -3142 -1359 204 180 -935 -797 4189 7503 2167 -1473 326 -6445 -9577 -9187 -10981
2423 -10981 -3046 6209 7251 5719 1407 1473 -2438 -9070 -8437 -4187 1549 938 1242 -3185 -10190 -6639
2407 -6639 700 332 1136 5113 4309 4217 9218 10242 1996 -5193 -1468 143 -4419 -4053 -341 -3338
$$ packed form
2516a034j195l144k364l834L392L921o411O38O919L125J824l453o475O828q323
2501i586K6P52J932L764J286k465o130r7J121R332N628N766L23n793J997P035
2485A4891l140j968p518m217k83k965j1419J137K954M300K442L347K554l31N056
2470D840j192l569m231j594m0L350P24K15j011j514j423N883Q585L81o96o174
2454B534k572L849l319l120J957K566L299K064n372l156k03P183J512o724o334
2439e836K606Q8J783J563k4j115J38M986L314n336l640J799o771l132L90j794
2423a0981P935R255J042j532m312O6l911o632O33M250N736o11L04m427p005L551
2407f639P339l68Q04L977q04r2N001J024q246p189L725J611m562L66L712k997
$$ plain form
2391 -3338 -6171 -5327 -3948 -5070 -568 3702 -3565 -8365 -11095 -13201 -8873 -5027 -3946 -7864 -3623
2376 -3623 -1295 -834 2492 3555 3593 8275 4721 -2523 -2667 -3613 -11296 -9885 -6663 -4479 -2168 2081
2360 2081 4690 4590 7355 9879 9593 5878 10543 8630 1755 8151 13077 14003 7835 4149 2694 -820
2344 -820 -4017 4980 8706 3662 -3523 -5385 -5016 1216 6215 3025 889 5025 5344 2002 1264 -170
2328 -170 -6289 -2006 -2190 3325 3691 -805 -78 239 4299 9183 5872 2979 2130 2506 -836 3576 3578
2311 3578 -1407 -4993 1136 5364 -1922 -1146 -4079 -2649 -2149 1395 -1128 -6934 -4261 -6701 -11730
2296 -11730 -9945 -7186 -733 787 -4289 -6901 -8144 -5230 -5877 -6976 -4401 3363 -2626 -1109 -2523
2281 -2523 -5727 -4511 207 4090 4378 8351 13436 11082 4655 2733 -30 1901 -208 -1352 726
$$ packed form
2391c338k833Q44J379j122M502M270p267m800k730k106M328L846J081l918M241
2376c623K328M61L326J063L8M682l554p244j44r46p683J411L222K184K311M249
2360B081K609j00K765K524k86l715M665j913o875O396M926R26o168l686j455l514
2344h20l197Q997L726n044p185j862L69O232M999l190k136M136L19l342p38j434
2328a70o119M283j84N515L66m496P27L17M060M884l311k893q49L76l342M412K
2311C578m985l586O129M228p286P76k933J430N00L544k523n806K673k440n029
2296a1730J785K759O453J520n076k612j243K914o47j099K575P764n989J517j414
2281b523l204J216M718L883K88L973N085k354o427j922k763J931k109j144K078
$$ plain form
2266 726 9119 3953 -3809 -5367 -3689 378 1841 5137 3408 -5834 -12986 -19788 -10567 -9249 -5747
2251 -5747 2716 -6667 -16263 -16499 -12645 -5901 -7393 -8285 -3724 -802 1612 2057 7866 9241 1631 -6511
2235 -6511 -3418 2296 1211 -725 3419 5875 12687 13511 9530 2981 3898 2166 -459 3334 3973 2935
2219 2935 2043 1288 -4947 -11335 -6612 -90 5808 10112 9441 6291 5866 4043 3117 9224 8320 7058
2203 7058 4728 4940 -346 4049 11767 5637 3467 2313 -1069 5184 13328 14034 2053 -4504 -4945
2188 -4945 4085 8322 6059 2987 8796 11517 4811 4992 8930 7695 5916 1209 -866 -4530 2454
2173 2454 6861 7848 2483 -1668 5756 11801 12495 12725 6587 -3090 -2149 -1513 -2868 1596 4623 6979
2157 6979 10028 7158 6518 3884 3322 4892 14019 11727 9294 8141 4088 5545 -1026 1912 1460 -4979
$$ packed form
2266G26Q393n166p762j558J678M067J463L296j729r242p152o802R221J318L502
2251e747Q463r383r596k36L854O744j492q92M561K922K414M45N809J375p610q142
2235f511L093N714j085j936M144K456O812Q24l981o549R17j732k625L793O39j038
2219B935q92p55o235o388M723O522N898M304o71l150m25j823r26O107r04j262
2203G058k330K12n286M395P718o130k170j154l382O253Q144P06j1981o557m41
2188d945R030M237k263l072N809K721o706J81L938j235j779m707k075l664O984
2173B454M407R87n365m151P424O045O94K30o138r677R41O36j355M464L027K356
2157F979L049k870o40k634n62J570R127k292k433j153m053J457o571K938m52o439
$$ plain form
2141 -4979 -5225 1575 8145 9917 8632 3846 3983 9090 10174 10331 11780 10105 4610 1505 1217 3949
2125 3949 8311 7500 -1980 -356 4076 -667 -48 6888 8827 6480 -1071 -2836 1240 9570 10982
2110 10982 8489 6055 2020 -1471 -1494 1815 9241 3722 -1562 4130 3122 4844 -1493 1854 5118
2095 5118 8679 10495 11029 9885 8290 5655 1474 5414 3810 718 458 -3721 1570 5763 2829
2080 2829 604 3733 7472 12522 15297 9191 5684 -143 -1780 -3224 -3848 787 3568 3427 6187
2065 6187 7759 16418 14803 12566 7159 -1092 603 2081 7111 15071 13039 5361 3825 7433 8008
2050 8008 5801 7272 -1593 -5367 -209 4440 6771 9335 4365 3241 6495 5952 7212 11624 12631
2035 12631 11920 8339 4160 -1109 1737 3738 7398 4592 -976 -1751 9860 16376 4866 3396 -384
$$ packed form
2141d979k46O800O570J772j285m786J37N107J084J57J449j675n495l105k88K732
2125C949M362q11r480J624M432m743O19O936J939k347p551j765M076Q330J412
2110A0982k493k434m035l491k3L309P426n519n284N692j008J722o337L347L264
2095E118L561J816N34j144j595k635m181L940j604l092k60m179N291M193k934
2080B829k225L129L739N050K775o106l507n827j637j444o24M635K781j41K760
2065F187J572Q659j615k237n407q251J695J478N030P960k032p678j536L608N75
2050H008k207J471q865l774N158M649K331K564m970j124L254n43J260M412J007
2035A2631p11l581m179n269K846K001L660k806n568p75J1611O516j1510j470l780
$$ plain form
2020 -384 -2318 -675 843 5572 8614 8916 7127 707 -2008 5215 8649 9301 8091 8397 5866 4860
2004 4860 2434 1270 1824 826 6958 6987 1469 1581 3534 6816 13696 6195 379 2572 5098 3316
1988 3316 103 -3648 -5191 -712 8629 18517 19655 13470 2255 -5594 -1747 5328 1722 -404 525
1973 525 -1887 -3378 2029 3040 9028 15478 13576 8172 3349 375 4897 3868 9641 7542 6415
$$ packed form
2020c84j934J643J518M729L042L02j789o420k715P223L434O52j210L06k531j006
2004D860k426j164N54r98O132K9n518J12J953L282O880p501n816K193K526j782
1988C316l213l751j543M479R341R888J138o185j1215p849L847P075l606k126R29
1973E25k412j491N407J011N988O450j902n404m823k974M522j029N773k099j127
$$ [...]
##END NTUPLES=NMR SPECTRUM
##END=
