##TITLE=Analysis number 316535
Compound Code cc 27213
Book Reference 422/143
Project Code adrs
Chemist Name robb
##JCAMPDX= 6.0         $$ Bruker NMR JCAMP-DX V2.0
##DATA TYPE= NMR SPECTRUM
##DATA CLASS= NTUPLES
##ORIGIN= Bruker BioSpin GmbH
##OWNER= nmr
$$ XWIN-NMR		Version 3.5
$$ Thu Jan 19 11:43:00 2006 GMT Standard Time (UT+0h)  MAYBRIDGE\nmr@NMR_250MHZ
##.OBSERVE FREQUENCY= 250.131544655141
##.OBSERVE NUCLEUS= ^1H
##.ACQUISITION MODE= SIMULTANEOUS (DQD)
##.ACQUISITION SCHEME= undefined
##.AVERAGES= 16
##.DIGITISER RES= 18
##SPECTROMETER/DATA SYSTEM= dpx250
##.PULSE SEQUENCE= zg30
##.SOLVENT NAME= CDCl3
##.SHIFT REFERENCE= (INTERNAL, CDCl3, 0, 16.447)
##AUDIT TRAIL= $$ (NUMBER, WHEN, WHO, WHERE, WHAT)
$$ ##TITLE= Audit trail, XWIN-NMR		Version 3.5
$$ ##JCAMPDX= 5.01
$$ ##ORIGIN= Bruker BioSpin GmbH
$$ ##OWNER= nmr
$$ C:\u/data/dgb/nmr/ADRS/14920/pdata/1/auditp.txt
$$ ##AUDIT TRAIL=  $$ (NUMBER, WHEN, WHO, WHERE, WHAT)
(   1,<2006-01-19 11:41:59.30 +000>,<MAYBRIDGE\nmr>,<NMR_250MHZ>,
      <created by zg, POWCHK disabled, PULCHK disabled
       configuration hash MD5:
       62 19 C7 07 E1 42 D1 B7 37 6C 3D D0 77 39 F9 E6
       data hash MD5: 64K
       4D C6 69 21 65 B0 83 08 36 A3 48 3E E2 CF 62 0D>)
(   2,<2006-01-19 11:42:29.03 +000>,<MAYBRIDGE\nmr>,<NMR_250MHZ>,
      <Start of raw data processing
       ef LB = 0.3 FT_mod = 6 PKNL = 1 SI = 32K 
       data hash MD5: 32K
       FF EE 67 2B DC F7 BA 7C 1A 27 34 C4 0D 44 E1 34>)
(   3,<2006-01-19 11:42:32.98 +000>,<MAYBRIDGE\nmr>,<NMR_250MHZ>,
      <apk 
       data hash MD5: 32K
       D9 81 80 76 4E 61 0E 9F 19 18 48 06 7D 0D 0F 24>)
(   4,<2006-01-19 11:42:34.89 +000>,<MAYBRIDGE\nmr>,<NMR_250MHZ>,
      <abs ABSG = 5 
       data hash MD5: 32K
       F5 54 0A 28 0C 6D 02 E2 74 EE FA 37 91 E8 57 78>)
$$ ##END=
$$ 
$$ hash MD5
$$ 2F E1 0E 87 1C E9 EA EE DD 07 13 6C F9 D0 09 16
##$RELAX= 
##$RELAX= 
##$RELAX= 
##$RELAX= 
##$RELAX= 
##$RELAX= 
##$RELAX= 
$$ Bruker specific parameters
$$ --------------------------
##$DU= <C:\u>
##$EXPNO= 14920
##$NAME= <ADRS>
##$PROCNO= 1
##$TYPE= <nmr>
##$USER= <dgb>
##$AMP= (0..31)
100 100 100 100 100 100 100 100 100 100 100 100 100 100 100 100 100 100 
100 100 100 100 100 100 100 100 100 100 100 100 100 100 
##$AQSEQ= 0
##$AQ_mod= 3
##$AUNM= <au_zg>
##$AUTOPOS= <35 >
##$BF1= 250.13
##$BF2= 250.13
##$BF3= 250.13
##$BF4= 250.13
##$BF5= 500.13
##$BF6= 500.13
##$BF7= 500.13
##$BF8= 500.13
##$BYTORDA= 1
##$CFDGTYP= 0
##$CFRGTYP= 5
##$CHEMSTR= <none>
##$CNST= (0..31)
1 1 145 1 1 1 1 1 1 1 1 1 1 1 1 1 1 1 1 1 1 1 1 1 1 1 1 1 1 1 1 1 
##$CPDPRG= <>
##$CPDPRG1= <>
##$CPDPRG2= <>
##$CPDPRG3= <>
##$CPDPRG4= <mlev>
##$CPDPRG5= <mlev>
##$CPDPRG6= <mlev>
##$CPDPRG7= <mlev>
##$CPDPRG8= <mlev>
##$CPDPRGB= <>
##$CPDPRGT= <>
##$D= (0..31)
0 1 0 0 0 0 0 0 0 0.06 0 0 0 0 0 0 0.0002 0 0 0 0 0 0 0 0 0 0 0 0 0 0 
0 
##$DATE= 1137670913
##$DBL= (0..7)
120 120 120 120 120 120 120 120 
##$DBP= (0..7)
150 150 150 150 150 150 150 150 
##$DBP07= 0
##$DBPNAM0= <>
##$DBPNAM1= <>
$$ [...]
##$SUBNAM7= <"">
##$SUBNAM8= <"">
##$SUBNAM9= <"">
##$SW= 20.6930455092707
##$SWIBOX= (0..15)
0 0 3 0 0 0 0 0 0 0 0 0 0 0 0 0 
##$SW_h= 5175.983436853
##$TD= 65536
##$TD0= 1
##$TE= 294.16
##$TE2= 300
##$TE3= 300
##$TEG= 300
##$TL= (0..7)
0 120 120 120 120 120 120 120 
##$TP= (0..7)
150 150 150 150 150 150 150 150 
##$TP07= 0
##$TPNAME0= <>
##$TPNAME1= <>
##$TPNAME2= <>
##$TPNAME3= <>
##$TPNAME4= <>
##$TPNAME5= <>
##$TPNAME6= <>
##$TPNAME7= <>
##$TPOAL= (0..7)
0.5 0.5 0.5 0.5 0.5 0.5 0.5 0.5 
##$TPOFFS= (0..7)
0 0 0 0 0 0 0 0 
##$TUNHIN= 0
##$TUNHOUT= 0
##$TUNXOUT= 0
##$USERA1= <user>
##$USERA2= <user>
##$USERA3= <user>
##$USERA4= <user>
##$USERA5= <user>
##$V9= 5
##$VALIST= <valist>
##$VCLIST= <CCCCCCCCCCCCCCC>
##$VD= 0
##$VDLIST= <DDDDDDDDDDDDDDD>
##$VPLIST= <PPPPPPPPPPPPPPP>
##$VTLIST= <TTTTTTTTTTTTTTT>
##$WBST= 1024
##$WBSW= 4
##$XGAIN= (0..3)
0 0 0 0 
##$XL= 0
##$YL= 0
##$YMAX_a= 540155
##$YMIN_a= -466419
##$ZGOPTNS= <>
##$ZL1= 120
##$ZL2= 120
##$ZL3= 120
##$ZL4= 120
##$ABSF1= 16.44703
##$ABSF2= -4.246143
##$ABSG= 5
##$ABSL= 3
##$ALPHA= 0
##$AQORDER= 0
##$ASSFAC= 0
##$ASSFACI= 0
##$ASSFACX= 0
##$ASSWID= 0
##$AUNMP= <proc_1d>
##$AZFE= 0.1
##$AZFW= 0.1
##$BCFW= 0
##$BC_mod= 0
##$BYTORDP= 0
##$COROFFS= 0
##$CY= 12.5
##$DATMOD= 1
##$DC= 0
##$DFILT= <>
##$DTYPP= 0
##$F1P= 14.0000005364418
##$F2P= -0.99999901652339
##$FCOR= 0.5
##$FTSIZE= 32768
##$FT_mod= 6
##$GAMMA= 0
##$GB= 0
##$INTBC= 1
##$INTSCL= 1
##$ISEN= 128
##$LB= 0.3
##$LEV0= 0
##$LPBIN= 0
##$MAXI= 10000
##$MC2= 0
##$MEAN= 0
##$ME_mod= 0
##$MI= 0
##$NCOEF= 0
##$NC_proc= -2
##$NLEV= 6
##$NOISF1= 0
##$NOISF2= 0
##$NSP= 0
##$NTH_PI= 0
##$NZP= 0
##$OFFSET= 16.44703
##$PC= 1
##$PHC0= 84.9031
##$PHC1= 4.395576
##$PH_mod= 1
##$PKNL= yes
##$PPARMOD= 0
##$PSCAL= 4
##$PSIGN= 0
##$REVERSE= no
##$SF= 250.130018749589
##$SI= 32768
##$SIGF1= 0
##$SIGF2= 0
##$SINO= 400
##$SIOLD= 32768
##$SREGLST= <1H.CDCl3>
##$SSB= 0
##$STSI= 32768
##$STSR= 0
##$SW_p= 5175.98343685301
##$SYMM= 0
##$S_DEV= 0
##$TDeff= 65536
##$TDoff= 0
##$TI= <Analysis number 999999
Compound Code 99
Book Reference 9
Project Code 9>
##$TILT= no
##$TM1= 0
##$TM2= 0
##$TOPLEV= 0
##$USERP1= <user>
##$USERP2= <user>
##$USERP3= <user>
##$USERP4= <user>
##$USERP5= <user>
##$WDW= 1
##$XDIM= 32768
##$YMAX_p= 326291820
##$YMIN_p= -72183
$$ End of Bruker specific parameters
$$ ---------------------------------
##NTUPLES= NMR SPECTRUM
##VAR_NAME=  FREQUENCY,     SPECTRUM/REAL,   SPECTRUM/IMAG
##SYMBOL=    X,             R,               I
##VAR_TYPE=  INDEPENDENT,   DEPENDENT,       DEPENDENT
##VAR_FORM=  AFFN,          ASDF,            ASDF
##VAR_DIM=   32768,         32768,           32768
##UNITS=     HZ,            ARBITRARY UNITS, ARBITRARY UNITS
##FACTOR=    0.157963299565203, 1,           1
##FIRST=     4113.89570060221, 0,            0
##LAST=      -1062.0877362508, 0,            0
##MIN=       -1062.0877362508, -72183,       0
##MAX=       4113.89570060221, 326291820,    0
$$ Real data points
##PAGE= N=1
##DATA TABLE= (X++(R..R)), XYDATA
$$ [...]
15636b745j886j235J5J219j023q6L530R58J478j150k242m63l110j846M25m19m001
15619a2581j525K51J928M792J754J504J379j401l532j390p57K96J805j83O4P71
15603f825J035J591m41J698j623j295J754N63l119R14L54k179j198K624J375O06
15587d166q4J704R37o14N25r69l465L18j620j822j161J953L123L52k526l50J631
15570f234J275j136J365K291l0J104J725k978l423j488L319j052L72L81n4J055
15554c508m71N98m8k316k187p4j25J143L303L533j828l01M12j416j497m308M227
15537d863L934L564j332j493r66j314p45M378K829J916l599n947q07j068j225
15522f738r04L32k097m19j395k243O25L530M134J628m428k089K875J240P89R75
$$ plain form
15636 -2745 -4631 -5866 -5851 -4632 -5655 -5741 -2211 -1253 225 -925 -3167 -3630 -6740 -8586 -8161 -8580 -12581
15619 -12581 -14106 -13855 -11927 -7135 -5381 -3877 -2498 -3899 -7431 -8821 -9578 -9282 -7477 -7660 -7596 -6825
15603 -6825 -5790 -4199 -4640 -2942 -4565 -5860 -4106 -3543 -6662 -5748 -5394 -7573 -8771 -6147 -4772 -4166
15587 -4166 -4250 -2546 -1609 -2223 -1698 -2667 -6132 -5814 -7434 -9256 -10417 -8464 -5341 -4989 -7515 -7865 -6234
15570 -6234 -4959 -6095 -4730 -2439 -2469 -1365 360 -2618 -6041 -7529 -4210 -5262 -4890 -4509 -4563 -3508
15554 -3508 -3979 -3381 -3429 -5745 -7932 -8006 -8131 -6988 -3685 -152 -1980 -2281 -1869 -3285 -4782 -9090 -4863
15537 -4863 -929 2635 1303 -190 -1156 -2470 -3215 1163 3992 5908 2309 -3638 -4445 -5513 -6738
15522 -6738 -7642 -7310 -9407 -9826 -11221 -13464 -12839 -9309 -5175 -3547 -7975 -10064 -7189 -5949 -5160 -4185
15506d185N84r90l489l525K649L987J658K172j509R91M97q25j79J548j854j662
15490d132J606n68n812j89L285J678p85r65N61j635m06M071O10n3J463p98m494
15473f563n59L086j439J1J455J138r44J79R99R22l177n80k090J339j965L458N749
15456A019l354m075j353k605j251J099M128N358r29k223J417J104K024M71J08
15441I38o96P98j682K70j61j123l40p00k515M75k96j659k22J587L39k582k95K463
15423e401J264j985o27J558j452L24l821j89p2j837L232L225k148J31Q80M11P6
15406f431j006L62J662Q61k850r53J90J821P54J849J476k17k103k470J609R0K87
15389e069k86k189J314J46j608K459j004j828m05J958p84j078N09J517M93M529
$$ plain form
15506 -4185 -3601 -4591 -8080 -11605 -8956 -4969 -3311 -1139 -2648 -1657 -1160 -1985 -2164 -616 -2470 -4132
15490 -4132 -2526 -3094 -8906 -9095 -5810 -4132 -4917 -5882 -5321 -6956 -7362 -3291 -2681 -2734 -1271 -2069 -6563
15473 -6563 -7122 -4036 -5475 -5464 -4009 -2871 -3815 -3636 -2637 -1715 -4892 -5472 -7562 -6223 -8188 -4730 1019
15456 1019 -2335 -6410 -7763 -10368 -11619 -10520 -6392 -1034 -1963 -4186 -2769 -1665 359 830 938
15441 938 242 1040 -642 -372 -533 -1656 -1996 -2696 -5211 -4736 -5032 -6691 -6913 -5326 -4987 -7569 -7864 -5401
15423 -5401 -4137 -6122 -6749 -5191 -6643 -6319 -10140 -10329 -10401 -12238 -9006 -5781 -7929 -7798 -6918 -6507 -6431
15406 -6431 -7437 -7075 -5413 -4552 -7402 -8355 -8165 -6344 -5590 -3741 -2265 -2482 -4585 -7055 -5446 -5356 -5069
15389 -5069 -5355 -7544 -6230 -6084 -7692 -5233 -6237 -8065 -8470 -6512 -7296 -8374 -7865 -6348 -5855 -1326
15373a326K211l481N35J270r70l51K149k841k273%K192R40j007k049q84K905J388
15356a592M90L095l131L31j068L30O56k61o34l747m676j53M043N36k694O57N80
15339g238r74j178j73K047K638J08K27k003M114J261R44Q35j491m410k863r45
15323i101J658J481j151l631J553j803K291N241R22n659j299J858J898J01L00
15308e341n46k98m28O20l43O43K000j484O44m578K400M724J052j949q69K459L60
15291i34k797M35O43k099J493M30K134j083j773j294J93J798J249l258n209l100
15275a3172j121P124J028l805%r80R26K49K430P01k997j01L184N69L463m45o19
15258c566O23j279j922K38O03K496L109k348p19n331n544J018J194K62o37p43
$$ plain form
15373 -1326 885 -2596 -2061 -791 -1761 -2112 37 -2804 -5077 -5077 -2885 -1945 -2952 -5001 -5885 -2980 -1592
15356 -1592 -1102 1993 -1138 -807 -1875 -1545 -889 -1150 -1784 -5531 -10207 -10360 -6317 -5781 -8475 -7818 -7238
15339 -7238 -8212 -9390 -9563 -7516 -4878 -4770 -4543 -6546 -2432 -1171 -227 608 -883 -5293 -8156 -9101
15323 -9101 -7443 -5962 -7113 -10744 -9191 -10994 -8703 -3462 -2540 -8199 -9498 -7640 -5742 -5641 -5341
15308 -5341 -5887 -6185 -6613 -5993 -6336 -5693 -3693 -5177 -4533 -9111 -6711 -1987 -935 -2884 -3753 -1294 -934
15291 -934 -3731 -3296 -2653 -4752 -3259 -2829 -695 -1778 -3551 -4845 -4652 -2854 -1605 -4863 -10072 -13172
15275 -13172 -14293 -7169 -6141 -9946 -9946 -10926 -10000 -9751 -7321 -6620 -9617 -9718 -6534 -5965 -2502 -2947 -3566
15258 -3566 -2943 -4222 -6144 -5906 -5303 -2807 302 -2046 -2765 -8096 -13640 -12622 -11428 -11166 -11803 -12546
15242a2546J50L732K197j136j141K804K092L461l590l970J336m174L716k13l32
15227g614Q02j911M614M763k472k695J419R06J834N82q94k307j677K805L643o22
15211A176j412k818j797J95K022j076j621m64k707k63K060J604N83R09J59N06
15195b944O5q86K69j146K521M371o33j766j111j115Lj026J597J56J003o05j673
15178b920j15k230O28P55K196L417J902q94m5k285m220L02M776P86m8m622k372
15161d989K523M810J432l733k094L7O01q72m832J43K588q93O67N01k5j281K473
15144b944M65K182j43K3K20J382l574l464K176n09Q40l63l637j618n57J453J468
15127f600j43O40j620N14k122j68K850J289M97j710p54N626K850j036p73l047
$$ plain form
15242 -12546 -12396 -8664 -6467 -7603 -8744 -5940 -3848 -387 -3977 -7947 -6611 -10785 -7069 -7282 -7614
15227 -7614 -6812 -8723 -4109 654 -1818 -4513 -3094 -2188 -354 228 -666 -2973 -4650 -1845 1798 1176
15211 1176 -236 -3054 -4851 -4656 -2634 -3710 -5331 -5795 -8502 -8765 -6705 -5101 -4518 -3609 -3450 -2944
15195 -2944 -2879 -3765 -3496 -4642 -2121 2250 1617 -149 -1260 -2375 -2372 -3398 -1801 -1645 -642 -1247 -2920
15178 -2920 -3035 -5265 -4637 -3882 -1686 1731 3633 2739 2694 409 -3811 -3509 1267 2053 2005 -2617 -4989
15161 -4989 -2466 2344 3776 43 -2051 -2014 -1413 -2285 -7117 -6974 -4386 -5279 -4612 -4111 -4136 -5417 -2944
15144 -2944 -2479 -297 -440 -417 -197 1185 -2389 -5853 -3677 -4186 -3346 -3709 -7346 -8964 -9521 -8068 -6600
15127 -6600 -6743 -6103 -7723 -7209 -9331 -9499 -6649 -5360 -4863 -6573 -7327 -1701 1149 113 -660 -3707
15111c707j309k117j448q80J971M030L159L287J783n849n293L95q75J607L389
15096a857j784L282L23Q53n26m94o16j324k952j042K546J660k116k162q97J935
15080e171J32J799J655J575j830m452j995j569J204j496L228N067Q71O77L342
15065C037k625n62l32n21k340k411Q15L14l8j989K7L915P45J779q18k38l80O75
15047i47L166K108J787l953K28L91r31J090L184J436K740R9l560%K443K328n47
15030A1062k300k481k25R68k044m776k354L238J280j434n84J433R66O50m60Q44
15014C783K268j637k954K437l632L85K744j161K295R0p13J136R89j252M756p06
14998H828m60j063L046K987K334J595P120M771K863K122L615M556L215N292P348
$$ plain form
15111 -3707 -5016 -7133 -8581 -9461 -7490 -3460 -301 2986 4769 -1080 -6373 -5978 -6853 -5246 -1857
15096 -1857 -3641 -359 -36 817 291 -203 -819 -2143 -5095 -6137 -3591 -1931 -4047 -6209 -7106 -5171
15080 -5171 -5039 -3240 -1585 -10 -1840 -6292 -8287 -9856 -8652 -10148 -6920 -1853 -982 -305 3037
15065 3037 412 -150 -482 -1003 -3343 -5754 -4939 -4625 -4663 -6652 -6625 -2710 -1965 -186 -1004 -1242 -1622 -947
15047 -947 2219 4327 6114 2161 2389 2780 1849 2939 6123 7559 10299 10398 6838 6838 9281 11609 11062
15030 11062 8762 6281 6056 7024 4980 204 -2150 1088 2368 934 350 1783 2749 3399 2939 3783
15014 3783 6051 4414 1460 3897 265 650 3394 2233 4528 4618 3905 5041 6030 4778 9534 8828
14998 8828 8368 7305 10351 13338 15672 17267 24387 29158 32021 34143 37758 42314 45529 50821 58169
14983E8169J2107J1202J5676J9192K9547M2019O2987R2008J56594K94488N89981
14972A383970Q14513J00437l49599l13986m19951m15989k76111j71462j09400
14963B42422o6428m4258k8303j9123j2947r614j0430o852n624o265n217l429J381
14950B5313N31k527j299l077j823K16q42J63Q02K860L564J582m816l287Q80J070
14934A9310k810m227p95j698j578l407j516L75j882j833k009L227K035k983k6
14919A83J320l001p01L394J237j501J021k156O14l57r31o11J195j743J560O04
14903A27n99O22N78j505p02j775J10K168k851j507M35K513K722J775J48k238k042
14886b021j632j740L11K727K541J034M14N50l638k788K508j146k291P57M024m05
$$ plain form
14983 58169 70276 81478 97154 116346 145893 187912 250899 342907 499501 793989 1383970
14972 1383970 2198483 2298920 1949321 1635335 1215384 799395 523284 351822 242422
14963 242422 175994 131736 103433 84310 71363 61749 51319 44467 38843 32578 27361 23932 25313
14950 25313 25844 23317 22018 18941 17118 17334 16492 16655 17457 20317 23881 25463 20647 17360 18240 19310
14934 19310 16500 12273 11478 9780 8202 4795 3279 3654 1772 -61 -2070 1157 3192 209 183
14919 183 1503 -1498 -2199 1195 2432 931 1952 -204 410 53 -878 -1489 -294 -2037 -477 127
14903 127 -472 150 728 -777 -1479 -3254 -3144 -976 -3827 -5334 -4899 -2386 336 2111 2259 21 -2021
14886 -2021 -3653 -5393 -5082 -2355 186 1220 1634 2184 -1454 -4242 -1734 -2880 -5171 -4414 -390 -795
14870g95K93M980O28j050n27j77J22L31j41K300p94m170r71l129l708M85L480
14853b843K036k2p67K573j97j445P32J471J690k285m821n70J737j25J484o37K080
14836I1k961j520J371j902K119p42K249j801j700P32L878L571j168l646J49M12
14820h68L30J341j940l679L34k00K349M771L236P46m99k208L608K932m833l123
14804B297N12k759l033j661K412L756L823o3l575q06J837J069J202l735k019O28
14788a15n70k76J024J016j87j271j90K186J278K017L42l356m769o76Q77j578k931
14771g179l90L048j088L32l165n97K578O115J402r82l323p86J342K106n45j400
14755b532l10n8J447K13n241Q36k526J22l62R23J327K184Q49l85n79K281j595
$$ plain form
14870 -795 -502 4478 5106 4056 3529 3352 3474 3805 3664 5964 5170 1000 29 -3100 -6808 -6323 -2843
14853 -2843 -807 -829 -1596 977 780 -665 67 1538 3228 943 -3878 -4448 -2711 -2836 -1352 -1989 91
14836 91 -2870 -4390 -3019 -4921 -2802 -3544 -1295 -3096 -4796 -4064 -186 3385 2217 -1429 -1280 -868
14820 -868 -538 803 -1137 -4816 -4482 -4682 -2333 2438 5674 6420 5921 3713 7321 10253 5420 2297
14804 2297 2809 50 -2983 -4644 -2232 1524 5347 5284 1709 903 2740 3809 5011 1276 -743 -115
14788 -115 -685 -961 63 1079 892 -379 -569 1617 2895 4912 5254 1898 -2871 -3547 -2670 -4248 -7179
14771 -7179 -7569 -4521 -5609 -5277 -8442 -9039 -6461 -346 1056 74 -3249 -4035 -2693 -587 -1132 -2532
14755 -2532 -2842 -2900 -1453 -1240 -6481 -5645 -8171 -8049 -8411 -7488 -6161 -3977 -3128 -3513 -4092 -1811 -3406
14738c406l189l93j452j189K094K677K749k334k844J705j605j404R37K844Q65
14723c945m94N57J109J783l080p31J682J490K473R27ql91J39J260M84K103m527
14706H31l367L197K532k421j429M05K718m58m146j141L070M458j33k162n456J799
14690a703P38M549K40j235L068N54q64p71M84q15j755J055P287M864K667K047
14674B0410m99Q94k13k325k833r02l770K48L5j628R9j402l392k016q84l08o77
14657H37K332L177J384l91j360M093n09r46K310J533K834j49q01K559k319l608
14641A0976m103k349j836j453J888J381J77j622K03J261L23J253K554k555j125
14626D973J276M18j391J854L121L591k394j371j764o06q84L168M62K786J052J456
$$ plain form
14738 -3406 -6595 -6988 -8440 -9629 -7535 -4858 -2109 -4443 -7287 -5582 -7187 -8591 -7654 -4810 -3945
14723 -3945 -4439 -3882 -2773 -990 -4070 -4801 -3119 -1629 844 1771 1763 1372 1511 2771 3255 5358 831
14706 831 -2536 661 3193 772 -657 -252 2466 2008 -2138 -3279 -209 4249 4116 1954 -3502 -1703
14690 -1703 -965 3584 3824 2589 5657 6211 5347 4576 5060 4245 2490 3545 10832 15696 18363 20410
14674 20410 19911 20805 20592 18267 15434 14532 10762 11010 11045 9417 9516 8114 4722 2706 1822 1514 837
14657 837 3169 6346 7730 7339 5979 10072 9563 8617 10927 12460 15294 15145 14344 16903 14584 10976
14641 10976 6873 4524 2688 1235 3123 4504 4681 3059 3262 4523 4846 6099 8653 6098 4973
14626 4973 6249 6667 5276 7130 10251 13842 11448 10077 8313 7707 6823 9991 10453 13239 14291 15747
14610A5747j180o9k404j111R4O79n933o97M41l449q11l25Q83k866l839R86J343
14593b511J235p24K870M582j376j285k410l547r24K980p83l673Q73m46J495K401
14577a243K873j73m02K63l460J420J526l325m31R45k750r32J228O383L736o31
14561E027J67M692M208K914N013O613O101O270J832O40o833r250o588n194k058
14546A3554k710l146n687l568K545j467m75j625J539J136J30q30j410k727k07
14531d948k562j909m99k074P08N386K179o20j331j390k587J961K65J355j326j54
14515g546K916O02k039k463P54j402K903K743O42q75k027n6q04K918j024P71K499
14498a488J129K37k834m169L140L161L22j855K784k473k710o87M79L987j334n84
$$ plain form
14610 15747 14567 14498 12094 10983 11077 11756 5823 5126 5567 2118 1307 982 1865 -1001 -4840 -3854 -2511
14593 -2511 -1276 -2000 870 5452 4076 2791 381 -3166 -4090 -1110 -1893 -5566 -4693 -5139 -3644 -1243
14577 -1243 1630 1457 1055 1318 -2142 -722 804 -2521 -2952 -2007 -4757 -5689 -4461 1922 5658 5027
14561 5027 5194 9886 14094 17008 22021 28634 34735 41005 42837 43477 36644 27394 20806 15612 13554
14546 13554 10844 7698 2011 -1557 988 -479 -954 -2579 -1040 96 226 -604 -2014 -4741 -4948
14531 -4948 -7510 -9419 -9918 -11992 -11284 -5898 -3719 -4339 -5670 -7060 -9647 -7686 -7421 -6066 -7392 -7546
14515 -7546 -4630 -4028 -6067 -8530 -7776 -9178 -6275 -3532 -2890 -3765 -5792 -5848 -6652 -3734 -4758 -3987 -1488
14498 -1488 -359 -122 -2956 -7125 -3985 -824 -502 -2357 427 -2046 -4756 -5443 -4964 -977 -2311 -2895
14482b895j232k004l19J169j765o58l92L87j116j619N28K981L574O36j985m625
14466i335n64K807L487K358K043K650j376m175r55j78p33r91q50k18J635m94N31
14449d358J218J337J985m600k498k339k464O44L526j439n89k292K909L974J262
14434c724p45J111k067k559K718J233L282l7j494k382M12j336k522j082O45J942
14418f605K662J425j480l252j667J970Q62N59k593Q84K241K671L489k719J9J843
14402C09j084m318l852L935K739J237K284J973l559l107p13j489m42K550L277
14387b60r30m472k525K493K702n00O9j517J096m39k312k232J351R72M95j375k478
14370i862J510K167n46q92J244j472p98j74K681j266M661N172l16j357j651k007
$$ plain form
14482 -2895 -4127 -6131 -6450 -5281 -7046 -7704 -8096 -7709 -8825 -10444 -9916 -6935 -3361 -2725 -4710 -9335
14466 -9335 -9899 -7092 -3605 -1247 796 3446 2070 -2105 -3060 -3238 -3971 -4962 -5812 -6030 -4395 -4889 -4358
14449 -4358 -3140 -1803 182 -4418 -6916 -9255 -11719 -11075 -7549 -8988 -9577 -11869 -8960 -4986 -3724
14434 -3724 -4469 -3358 -5425 -7984 -5266 -4033 -751 -788 -2282 -4664 -4252 -5588 -8110 -9192 -8547 -6605
14418 -6605 -3943 -2518 -3998 -7250 -8917 -6947 -6085 -5526 -8119 -7235 -4994 -2323 1166 -1553 -1534 309
14402 309 -775 -5093 -8945 -5010 -2271 -1034 1250 3223 -336 -3443 -4156 -5645 -6087 -3537 -260
14387 -260 -1190 -5662 -8187 -5694 -2992 -3492 -3423 -4940 -3844 -4283 -6595 -8827 -7476 -6504 -6009 -7384 -9862
14370 -9862 -8352 -6185 -6731 -7623 -6379 -7851 -8649 -8823 -6142 -7408 -2747 2425 2109 752 -899 -2906
14354b906r92K672k94N46J223l170L89P64l153K82K703L53m16j870O43J085J091
14337a050L08n05J121k16J646j503m691K060J095K89j962J593p20j734L272n057
14321f054j438J367k239k108L204J61J087J901J442o33k189k05k102j249l58K158
14305g255j071J699P39j134J874r34q11o68p99L838K645k101K279J208K74l928
14289d145R57k168n25M28R16N37p12P60J755J04k373m15K084K799J909K89r48
14272A252L87j653L481K162j07K138m520p232J651M380J314J272r3k465L838j776
14256D029m087k481j443K779R2k223K504j430l542j107m35K51J978K833m68o81
14240c431m00j420p95J002K701j965k305k242j768O89L168K87l933L13J883K851
$$ plain form
14354 -2906 -3898 -1226 -1520 -974 249 -2921 -2532 -1768 -4921 -4639 -1936 -1583 -1999 -3869 -3226 -2141 -1050
14337 -1050 -742 -1247 -126 -342 1304 -199 -4890 -2830 -1735 -1446 -3408 -1815 -2535 -4269 -997 -6054
14321 -6054 -7492 -6125 -8364 -10472 -7268 -7107 -6020 -4119 -2677 -3310 -5499 -5704 -7806 -9055 -9413 -7255
14305 -7255 -8326 -6627 -5888 -7022 -5148 -6082 -6893 -7561 -8360 -4522 -1877 -3978 -1699 -491 -217 -4145
14289 -4145 -3188 -5356 -5881 -5453 -4537 -4000 -4712 -3952 -2197 -2093 -4466 -4881 -2797 2 1911 2200 1252
14272 1252 1639 -14 3467 5629 5522 7660 3140 -4092 -2441 1939 3253 4525 4432 1967 5805 4029
14256 4029 -58 -2539 -3982 -1203 -1111 -3334 -830 -2260 -5802 -6909 -7344 -7093 -5115 -2282 -2750 -3431
14240 -3431 -3831 -5251 -6046 -5044 -2343 -4308 -6613 -8855 -10623 -9934 -6766 -6479 -10412 -10099 -8216 -5365
14224e365O14M267Q34l24K35k355n43R07M62L148Q30j998k799j2K796l813k042
14207e158o26M066K42l478R48K658K010K621j092j944l038j052l74K758j188j710
14191d357J435M254L355k065n460q73P33q38l12j487j73q81J036L430L540j713
14175c76n41K646j188O0k40K340k450J946L862l161j824K908r47j468K718L39
14159D624O93m23J425O283K201q71p51L64N36J457J335J075L253l054J89k43J201
14142A9294k107n32j938l515K53J382r33Q7J775Q80K732J20J522M008L950M025
14126C1003M307k492N19J105K155M36j779n21j84l559m825j301O38m872m656p352
14110H622p411J732K460J85j067K03Q36K3k691l032k33j133j53N036K726M870
$$ plain form
14224 -5365 -4751 -484 350 26 261 -2094 -2637 -1730 -1268 1880 2710 712 -2087 -2099 697 -3116 -5158
14207 -5158 -5784 -1718 -1476 -4954 -4006 -1348 662 3283 2191 247 -2791 -3843 -4217 -1459 -2647 -4357
14191 -4357 -2922 1332 4687 2622 -2838 -3711 -2978 -3816 -4128 -5615 -5788 -6669 -5633 -2203 1337 -376
14175 -376 -917 1729 541 601 361 2701 251 2197 6059 2898 1074 3982 3035 1567 4285 4624
14159 4624 5317 4894 6319 12602 14803 13932 13181 13545 14081 15538 16873 17948 21201 18147 18336 18093 19294
14142 19294 17187 16655 14717 11202 11455 12837 11904 11991 13766 14646 17378 17498 19020 23028 26978 31003
14126 31003 35310 32818 33337 34442 36597 37033 35254 34733 34549 30990 26165 24864 25502 20630 15974 8622
14110 8622 1211 2943 5403 5588 4521 4724 5560 5583 2892 -140 -373 -1506 -1659 3377 6103 10973
14094A0973L659K279J918K078K4J9k347m364l949j554k138o233J479M41pj552
14078G26m292l382J345R7k084k133r55N84L955K835K616M7j540k002l060l82J008
14061f617j983K481M452n10l33L60O5j15N36L064J052K284k99K38O78k785m37
14044B131N62R8J708k479J095n36m381o86Q99J827k12p33j50R6K79L486J066m991
14026i21k97Q3o36l1r69M1K784L086k928j047N06r23l90J540K016n16m483o09
14008c694P32K90L725k450J297K439p60j796m59J402k078k344L7M606j74k763
13992a990K96K649j087k126K218o47J405P12L4k96j170N45J565j524J023J068
13976B675r51J176K530O24j531j584J209K168R3J404M279M191J451P22M160L462
$$ plain form
14094 10973 14632 16911 18829 20907 20931 20950 18603 14239 10290 8736 6598 365 1844 2285 2278 726
14078 726 -3566 -6948 -5603 -5506 -7590 -9723 -10678 -10094 -6139 -3304 -688 -641 -2181 -4183 -7243 -7625 -6617
14061 -6617 -8600 -6119 -1667 -2177 -2510 -2150 -2085 -2200 -1664 1400 2452 4736 4437 4675 5353 2568 2131
14044 2131 2693 2791 4499 2020 3115 2579 -1802 -2488 -1589 238 26 -707 -857 -761 -482 3004 4070 -921
14026 -921 -1218 -1135 -1771 -1802 -2771 -2730 54 3140 212 -835 -329 -1252 -1642 -102 1914 1398 -3085 -3694
14008 -3694 -2962 -2672 1053 -1397 -100 2339 1579 -217 -676 726 -1352 -3696 -3659 947 773 -1990
13992 -1990 -1694 955 -132 -2258 -40 -687 718 1430 1464 1168 -2 543 2108 584 1607 2675
13976 2675 1724 2900 5430 6054 4523 2939 4148 6316 6409 7813 12092 16283 17734 18456 22616 26078
13960B6078N215J468L866N425M267N289R564J2871J1462J6559K1854L2899N3189
13947B10006P8884J06134J22264J23263J10774P9654L8444j317m3802q5258j14623
13936F24423j28517j15696r7734p6362n6364m0017k1752j3836r240o321p857j0861
13924C9866q008m591o076m339j213k927N12p08j063k676n989m039L41J557P13
13909A360N09J459J916N6Qj054k342k396j619K613L24j636n00Q98Q37j286J577
13892G24P11j805J454R9r26P97j284M55K858J52l065p19l271k523j761j696L943
13875e857J271K750K407m04N45l86J444o13K113o84l714n90m837j674J859L199
13859c171m7j490L424j662J778n5R51M154J9k98k284j412j492k07M55j192K304
$$ plain form
13960 26078 31293 32761 36627 42052 46319 51608 61172 74043 85505 102064 123918 156817 210006
13947 210006 288890 395024 517288 640551 751325 830979 869423 868106 824304 739046 624423
13936 624423 495906 380210 282476 206114 149750 109733 87981 74145 64905 58584 50727 39866
13924 39866 31858 27267 21191 16852 15639 12712 13224 12516 11453 8777 2788 -1251 -910 647 1360
13909 1360 1869 3328 5244 5300 5308 4254 1912 -484 -2103 510 834 -802 -1302 -404 433 -853 724
13892 724 1435 -370 1084 1183 257 1054 -230 225 3083 3235 170 -549 -3820 -6343 -8104 -9800 -5857
13875 -5857 -4586 -1836 571 167 712 326 1770 1157 3270 2586 -1128 -1718 -6555 -8229 -6370 -3171
13859 -3171 -3218 -4708 -1284 -2946 -1168 -1223 -272 3882 3901 3603 1319 -93 -1585 -1792 -1337 -2529 -225
13842b25J006j882J257j744l139o3K814L816r88m979l506L860L815j748K868K26
13826A388k556J023l71J11K0j75k214j692l125J487L613N347M684o20k790l234
13810H96J353r13j531l048J257l728m534N87J700o08j201K108K050R87P99l82
13794d208k576J702L878J989m97k120o23L46K121K848K854J710o84J362j693o09
13778E800J74M09j01K949K914K012k270K2j609m37k088l355J788K212J942k756
13762G606K027O94o797l25K928J966j665L10K057J039k137m836N98K866M099J422
13746A1852k639m53K070P38m76l71m52j499M17O08q60Q04j02N00N93j414j480
13729G836l052O71j47j274R45n34k594M156J498m73R21l35L586L78P03N90J084
$$ plain form
13842 -225 781 -1101 156 -1588 -4727 -4790 -1976 1840 852 -4127 -7633 -3773 42 -1706 1162 1388
13826 1388 -1168 -145 -516 -405 -385 -560 -2774 -4466 -7591 -6104 -2491 2856 7540 6920 4130 896
13810 896 2249 1336 -195 -3243 -1986 -5714 -10248 -9661 -7961 -8569 -9770 -7662 -5612 -4625 -3826 -4208
13794 -4208 -6784 -5082 -1204 785 288 -1832 -2455 -2109 12 2860 5714 7424 6740 8102 6409 5800
13778 5800 5974 6383 6282 9231 12145 14157 11887 11909 10300 9863 7775 4420 6208 8420 10362 7606
13762 7606 9633 10327 3530 3205 6133 8099 6434 6744 8801 9840 7703 2867 3465 6331 10430 11852
13746 11852 9213 8760 10830 11568 11092 10721 10269 8770 9187 9795 8935 9739 9637 10137 10730 9316 7836
13729 7836 4784 5455 5308 4034 4979 4445 1851 6007 7505 7032 7953 7618 11204 11582 12285 12875 13959
13712A3959K683L950K020J342K053N156N877P23p37l943m699l43n762m540j025
13697A6714R74j721j59j812o72j37j778j393j078q94j310k560R94J630q47j267
13681D684n3m427K796M800K600K237O642O223L270M083J374K745j141j075K120
13666C6878j623n277n971m229m263j90j477j986k152J251l408J157j773rJ968
13651H896N972M307K85l432O131O547M466Q027N989J0176R362L165N398J247k129
13636G4407l078l970p975o069l674l208p180l726J38l332k682j94q35m873r21
13621B2828r97L105J343J418N38j4L005K070P120M732M265O623O122N275Q360
13606G5793J1102J1141J0307P936N431Q535M990J807k472k677m915m335o019p614
$$ plain form
13712 13959 16642 20592 22612 23954 26007 31163 37040 37763 37026 33083 28384 28041 22279 17739 16714
13697 16714 17688 15967 15808 13996 13324 13187 11409 10016 8938 8044 6734 4174 5168 6798 5951 4684
13681 4684 4631 204 3000 7800 10400 12637 19279 25502 28772 32855 34229 36974 35833 34758 36878
13666 36878 35255 29978 24007 19778 15515 15325 13848 11862 9710 10961 7553 8710 6937 6928 8896
13651 8896 14868 19175 19460 16028 22159 28706 33172 41199 47188 57364 66726 69891 75289 76536 74407
13636 74407 71329 67359 59384 53315 49641 46433 39253 35527 35665 32333 29651 29457 28622 23749 22828
13621 22828 21831 24936 26279 27697 28235 28221 31226 33296 40416 45148 49413 56036 62158 67433 75793
13606 75793 86895 98036 108343 116279 121710 130245 135235 137042 134570 131893 126978 122643 116624 109010
13592A09010k905J145K874O81N52L47K460L702R43J094M432K674k24k218j359
13577A23208J548M861j700o310n001l306k380l644j567l778j686n861j524k333
13563I0527m402o464m293j74l266k610j034m947m152r07k446n878l152k686k568
13548D1548L35K5j710k953m873j330J723M19m918m176N54N65J10j816j575J010
13532B2938o167j229K29m150M896K871k703P30O83l618m388j513K926N366j536
13517A5335k867n252l201j234P37J63q72L09J496J413R86J147j412n48j304k200
13501B696L257K870j66k326p73P97J121J397j788l350K495K995Q85j453j141p27
13485F789o83q46J50k155q35L68j912k258j703j021K351J330k012P98K88K78r67
$$ plain form
13592 109010 106105 107250 110124 110805 111357 111704 114164 117866 118809 119903 124335 127009 126785 124567 123208
13577 123208 124756 129617 127917 121607 116606 113300 110920 107276 105709 101931 100245 94384 92860 90527
13563 90527 86125 79661 75368 75194 71928 69318 68284 63337 59185 58278 55832 49954 46802 44116 41548
13548 41548 41883 41908 40198 37245 32372 31042 32765 33184 28266 24090 24644 25209 25319 23503 21928 22938
13532 22938 16771 15542 15771 11621 16517 19388 16685 17415 18098 14480 10092 8579 11505 16871 15335
13517 15335 12468 7216 4015 2781 3518 3681 2809 3118 4614 6027 7013 8160 6748 6200 4896 2696
13501 2696 5953 8823 8657 6331 5558 6355 7476 8873 7085 3735 6230 9225 10110 8657 7516 6789
13485 6789 6106 5260 5410 3255 2420 2788 876 -1382 -3085 -4106 -1755 -425 -2437 -1639 -1351 -1073 -2040
13468b040k039l723J775L310j145j930K167J536M502J6l844j567K810M229k9r15
13452C113j816l000J838k353l769r17M714K681J316r0p65k364K133K196O10P67
13436D294j722K003K564J585L300O05j945K072J898k109j319k566K391l006l153
13421D892l925l299K206K930j169j751jm00j419J553J379j466L67M04m734O0R28
13404c445p06J673M148L397N41j42r10N73J765J353M145o26R00J230K580K77M01
13387A7154K79j510j097k336n172k059Q07l299k69P89k630p49L450j104J233l950
13371d63N14J175r77q12j542l67K577J284J149k637j30O21j596n92n93J960j57
13354e86J962L147l265j010K12J319Rj638j261j07j225Q68R47J632k859m328K326
$$ plain form
13468 -2040 -4079 -7802 -6027 -2717 -3862 -5792 -3625 -2089 2413 2429 -1415 -2982 -172 4057 4028 3113
13452 3113 1297 -1703 135 -2218 -5987 -6904 -2190 491 1807 1717 952 -1412 721 2917 3527 4294
13436 4294 2572 4575 7139 8724 12024 12629 10684 12756 14654 12545 11226 8660 11051 8045 4892
13421 4892 967 -2332 -126 2804 1635 -116 -117 -517 -1936 -383 996 -470 -103 301 -4433 -4373 -3445
13404 -3445 -4151 -2478 1670 5067 5608 5466 4556 5129 6894 8247 12392 11766 12666 13896 16476 16753 17154
13387 17154 17433 15923 14826 12490 7318 5259 6066 2767 2498 3287 657 -92 3358 2254 3487 -463
13371 -463 51 1226 249 -563 -2105 -2472 105 1389 2538 -99 -229 392 -1204 -1796 -2389 -429 -586
13354 -586 1376 4523 1258 248 460 1779 1788 150 -1111 -1218 -2443 -1575 -628 1004 -1855 -6183 -3857
13337c857j30J054J729J65k881j872k36k91M47m06J129o67l91k867j789J461L179
13320f223L157M28j801J704N88m20R86k064J204m82l319m10M474o72j214K6L286
13303g52O79l642j081L72M53o31J065K33K70k033p49k006o2J091J277J407j34
13286d243k27R14q48L69k085J834L066l027L52k304K20K118J234r17j235k892
13270g671k219J570L71k242m34K066K136L290J606P97k802k596k972N52L358J600
13254c590L399L232k98n2k631m442L929K351L532J128N543L130j331k644l268
13239G988l332k015l850k046l79k294M66K673M48j912j215p04j268R1J756P18
13223d875M14J689J35l453J598L059l866k149J217n71M316L432j981l273P82p54
$$ plain form
13337 -3857 -3987 -2933 -1204 -1039 -3920 -5792 -6028 -6319 -5872 -6278 -5149 -5816 -6207 -9074 -10863 -9402 -6223
13320 -6223 -3066 -2638 -4439 -2735 -2147 -2567 -1581 -3645 -2441 -2923 -6242 -6652 -2178 -2850 -4064 -4038 -752
13303 -752 -73 -3715 -4796 -4424 -3971 -4602 -3537 -3304 -3034 -5067 -5816 -7822 -7884 -6793 -5516 -4109 -4243
13286 -4243 -4470 -3556 -4404 -4035 -6120 -4286 -1220 -4247 -3895 -6199 -5979 -3861 -2627 -3544 -4779 -7671
13270 -7671 -9890 -8320 -7949 -10191 -10625 -8559 -6423 -3133 -1527 -730 -3532 -6128 -9100 -8548 -5190 -3590
13254 -3590 -191 3041 2743 2691 60 -4382 -453 1898 5430 6558 12101 15231 13900 11256 7988
13239 7988 4656 2641 -1209 -3255 -3634 -5928 -5462 -2789 -2341 -4253 -5468 -6172 -7440 -7349 -5593 -4875
13223 -4875 -4461 -2772 -2637 -6090 -4492 -1433 -5299 -7448 -6231 -6802 -2486 946 -1035 -4308 -3526 -4280
13207d280p77R66k703L63L229J778m251j328L241J845P2j233p17L39l681k226
13191i363K442L776P26l248k44q94P82O40K08K065J008j445M14J859K529n65j529
13174h39k135r65k772k20J007K236M71k633J343L50p26k667J495K064k833l983
13158a0807L542M246J473j717R83N32l663j254L954j985J254q19l14K296k494
13143d773K461k115k747m027J209K552K183J265j777K907J157J118j564j436l449
13128g036l47J224K117J009J950L17J271P78j003M078l79K00M274J4k233Q5k827
13111C492j328K154k45k359j187j382L389P0m210j306K260L040j7J714J244k482
13095B847k098q98J758K548j754k283J878O12P96p16l400l81j237k288J497l82
$$ plain form
13207 -4280 -5057 -4091 -6794 -6431 -3202 -1424 -5675 -7003 -3762 -1917 -1845 -3078 -3795 -3456 -7137 -9363
13191 -9363 -6921 -3145 -2419 -5667 -5911 -6805 -6023 -5383 -5175 -3110 -2102 -3547 -3133 -1274 1255 690 -839
13174 -839 -2974 -3939 -6711 -6931 -5924 -3688 -3217 -5850 -4507 -4157 -4883 -7550 -6055 -3991 -6824 -10807
13158 -10807 -7265 -3019 -1546 -3263 -2280 -1748 -5411 -6665 -2711 -4696 -3442 -4261 -4575 -2279 -4773
13143 -4773 -2312 -4427 -7174 -11201 -9992 -7440 -5257 -3992 -5769 -2862 -1705 -587 -2151 -3587 -7036
13128 -7036 -7383 -6159 -4042 -3033 -1083 -766 505 1283 280 4358 3979 4179 8453 8467 6234 6319 3492
13111 3492 2164 4318 4073 1714 527 -855 2534 2604 -1606 -2912 -652 2388 2371 4085 5329 2847
13095 2847 749 -149 1609 4157 2403 120 1998 2610 3406 2690 -710 -1091 -2328 -4616 -3119 -3501
13079c501M320m3k21k719q29m82k344J739M412L164K776j163n04j23m887l155
13063c560K926P57P36n87j120k670k729J928O422M319J98l013l043L088m35k36
13047B981l35k426m710m36L89L090p98j282j631J221K712K683Q76L220n57p64
13031D233j096K293P78L955N344L318M75M942P294K084L599M143N687O193J2759
13016F6001J4562J8376K4635L4556M8073N6407O1558N9965N0577L4564J7483r880
13004D76877l6332n0792o0065o2353o0195n2813l7553k5936j7309j2273p175n876
12992D8205o633o046l672o805k696J345j674j306k381n395l405JP32P43J949j369
12976A1593k58j500j02q28k680k824K85j129K018k87N10P04Q81q76j688J469m02
$$ plain form
13079 -3501 819 776 555 -2164 -2993 -3475 -5819 -4080 332 3496 6272 5109 4605 4482 -405 -3560
13063 -3560 -634 123 859 272 -848 -3518 -6247 -4319 2103 6422 6620 3607 564 3652 3217 2981
13047 2981 2646 220 -4490 -4926 -4537 -1447 -2245 -3527 -5158 -3937 -1225 1458 2334 5554 4997 4233
13031 4233 3137 5430 6208 10163 15507 18825 19300 24242 31536 33620 37219 41362 47049 53242 66001
13016 66001 80563 98939 123574 158130 206203 262610 324168 384133 434710 469274 486757 476877
13004 476877 440545 389753 329688 267335 207140 154327 116774 90838 73529 61256 54081 48205
12992 48205 41572 35526 31854 25049 22353 23698 22024 20718 18337 12942 9537 9538 10270 11013 12962 11593
12976 11593 11335 9835 9733 8905 6225 3401 3686 2557 4575 4288 4798 5502 6383 5507 3819 5288 4886
12959D886L26K915K110pm582l672P17K459r62L986J221l805k525j165J932J476
12943E310L28q1j055L375K671m752j995J368K193K008K527J654J558O47j970k75
12927A3511K108L215K238j071J127j035l145j383J110K091K399K37L198o4l663
12912B0873j652M98r47J533J282L902l2N4j108J305M078J580L352P8O447M856
12896D6099J722k79K819N690L709k040L39l284j1316j5553j2087j1704j2539j0892
12882a9316p749p471o902l97N442O035M343K759O112M990J73m62O374L481L01
12867b287j744n33j569L103j155J094L066j824k841K436K487j686k491J645J954
12852c45L892L772K442O469Q339M813J763P724J34q69Q06j217l49m25l763j293
$$ plain form
12959 4886 5212 8127 10237 10230 5648 1976 2693 5152 4190 8176 9397 5592 3067 1902 3834 5310
12943 5310 5638 5557 4502 7877 10548 5796 3801 5169 7362 9370 11897 13551 15109 15756 13786 13511
12927 13511 15619 18834 21072 20001 21128 20093 16948 15565 16675 18766 21165 21402 24600 24536 20873
12912 20873 19221 19719 18772 20305 21587 25489 25457 25511 24403 25708 29786 31366 34718 34796 41243 46099
12896 46099 47821 47542 50361 56051 59760 57720 58059 54775 43459 27906 15819 4115 -8424 -19316
12882 -19316 -27065 -34536 -41438 -41835 -36393 -30358 -26015 -23256 -17144 -12154 -11981 -12443 -6069 -2588 -2287
12867 -2287 -4031 -4564 -6133 -3030 -4185 -3091 -25 -1849 -4690 -2254 233 -1453 -3944 -2299 -345
12852 -345 3547 7319 9761 16230 24569 29382 31145 38869 39003 38134 38940 37723 37374 36949 33186 31893
12836C1893q84j771j997k712M77K399N31k011q63J410k151o84L758J862j271J734
12820B9720k587l256j801r87J128l104n672j323N32J201K028L488K75k939k176
12805A4527m28k762k44m843m410M281R095K559o11k837J060j816P85K714j164
12790A5906j175k852K131j166j704K141J761M838M893M181L195K091J959k710
12776C3489j830m28j989k868m362p700p196m481l343n914k012k44j00N399P921
12761D342N342N004M599O626L609k254l852J37O93J854L702O568O636K008N198
12746E0212K906J547j550n972m313m348o250m640l813l616r35j560j569l142m21
12731A2536l61k579K192L302k717n71M474Q747K638K75J106L220N172Q97j137
$$ plain form
12836 31893 31009 29238 27241 24529 25006 27405 27936 25925 25062 26472 24321 23637 27395 29257 27986 29720
12820 29720 27133 23877 22076 21089 22217 19113 13441 12118 12650 13851 15879 19367 19642 16703 14527
12805 14527 14099 11337 11093 6250 1840 6121 15216 17775 17164 14327 15387 13571 14356 17070 15906
12790 15906 14731 11879 14010 12844 11140 13281 15042 19880 24773 28954 32149 34240 36199 33489
12776 33489 31659 31231 29242 26374 22012 14312 7116 2635 -708 -6622 -8634 -8878 -8978 -3579 4342
12761 4342 9684 14688 19287 25913 29522 27268 23416 23553 24246 26100 29802 36370 43006 45014 50212
12746 50212 53118 54665 53115 47143 42830 38482 32232 27592 23779 20163 19228 17668 16099 12957 12536
12731 12536 12175 9596 11788 15090 12373 11802 16276 25023 27661 27936 29042 32262 37434 38331 37194
12716C7194k907l015l539K585O551Q735J1345J1578J8463J9463J7254J5619J2085
12703A51411Q564K318L343M854M438N050L796P133N15K792L689k752r921j5235
12689A69995j9691k1793j5078j3217p773j365L33m037j553p86M201J290L060L61
12675I3947J904j548m845k903k429J449J224N703M781P682Q348P720J1764J0395
12661A43192J0314Q104N918M987K499L078P86k065j503L890K420K532K366J796
12647A88314M816J0348M912P921O078Q815M054N063M779P731P380J3049J5334
12634B88594J5450J8136J5188J5668K1194J7266J9162K6006K5420K1718K6109
12623E09911L8513L6830L8038M3203M4018M4906M8248M9099N1233O0514O7696
$$ plain form
12716 37194 34287 31272 27733 30318 36869 45604 56949 68527 86990 106453 123707 139326 151411
12703 151411 159975 162293 165636 170490 174928 179978 183774 190907 191422 194214 197903 195151 185230 169995
12689 169995 150304 128511 113433 100216 92443 91078 91411 87374 85821 85035 89236 90526 93586 93947
12675 93947 95851 94303 89458 86555 84126 85575 86799 92502 97283 104965 113313 121033 132797 143192
12661 143192 153506 161610 167528 172515 175014 178092 178878 176813 175310 179200 181620 184152 186518 188314
12647 188314 193130 203478 208390 216311 222389 231204 235258 240321 245100 252831 260211 273260 288594
12634 288594 304044 322180 337368 353036 374230 391496 410658 436664 462084 483802 509911
12623 509911 548424 585254 623292 666495 710513 755419 803667 852766 903999 964513 1032209
12612A032209P1706P7741Q0497Q6471R5258J01788J10688J24643J37071J54903
12602B072975J84832K23999K72316L31544M07640M88324N66594O29936O97755
12593E875915P78029Q81716J036628J293555J720523K416757L557261N345055
12585B2905439P786491J0183011J1617715J1889667J0633227P949872M331273
12578H7296695J67117m164837q005139j0720948j1971572j1472436r812121p752357
12570B3564402n696918l962804k701055j857231j322251r90067q03786o98251
12562E532039o33176n81499n30746m72663m12035l47631k85147k29685j81436
12553A858021j49695j25446j05153r2140p8367o6838o2638n4386n1757m8499m2233
$$ plain form
12612 1032209 1103915 1181656 1262153 1348624 1443882 1545670 1656358 1781001 1918072 2072975
12602 2072975 2257807 2481806 2754122 3085666 3493306 3981630 4548224 5178160 5875915
12593 5875915 6653944 7535660 8572288 9865843 11586366 14003123 17560384 22905439
12585 22905439 30691930 40874941 52492656 64382323 75015550 82965422 87296695
12578 87296695 87463812 83298975 75293836 64572888 52601316 41128880 31316759 23564402
12570 23564402 17867484 13904680 11203625 9346394 8024143 7034076 6230290 5532039
12562 5532039 4898863 4317364 3786618 3313955 2901920 2554289 2269142 2039457 1858021
12553 1858021 1708326 1582880 1477727 1385587 1307220 1240382 1177744 1123358 1071601 1023102 980869
12542I80869l2525k6863l7117n2108m9733m5040m3800m0353l4590k7763k4120
12531E66857k1808j6280j5972j5309j6028j4469j4296r935j3751j5245j2446j2357
12519C88961j2816r809q522j1326j0594j0400o972j0261q924n551o284o787o107
12506B74608n587o368o700p591k969o528p017m988K252R641J3908K7388M0336
12493C20385K9404N847J179m554j327R154L6096Q3184J22579N8221m7837p0799
12481E41532q5584r0064p1100m9136l1537j6220j2098j0515o849j1973j0532m878
12469A41046l760q367j1216q220o879r258p058m588J53m25k304N42J059J867L068
12454H5660O830J0625J3421J8580K2266K3506K9032L9044M7358N8173P8919J27791
$$ plain form
12542 980869 948344 921481 884364 832256 782523 737483 693683 653330 618740 590977 566857
12531 566857 545049 528769 512797 497488 481460 466991 452695 442760 429009 413764 401318 388961
12519 388961 376145 366336 357814 346488 335894 325494 318522 308261 299337 293786 287502 280715 274608
12506 274608 269021 262653 255953 248362 245393 238865 231848 226860 229112 238753 252661 280049 320385
12493 320385 349789 355636 356815 352261 350934 360088 396184 479368 601947 660168 612331 541532
12481 541532 455948 365884 294784 245648 214111 197891 185793 175278 168429 156456 145924 141046
12469 141046 137286 128919 117703 109483 102604 93346 86288 81700 81853 81428 79124 79666 80725 82592 85660
12454 85660 92490 103115 116536 135116 157382 180888 209920 248964 296322 354495 433414 561205
12442E61205K33484L79340M01159L8446j89932j99835k51745k43445j63034j10194
12432D55449p4658n1529m0161l7805k6048k0736j4922j1481j3152j0289o513q775
12420A39380o114o957o393p23J218l971j672K133J811J775J519L020N553M118
12406A34697N485R963J4362K3120L3173M0984O0455J00216J77261L08329M33223
12395A341268K28010j42239k07604k42251k65089k04164j32049q3169n2735m0397
12385A99581k3955j8827j6071q351r643j1344l993q013q293m944j679L007q97
12372H6578n431n02J905l752o814O96J104l249l903L361L758L045N192R202J2864
12357A04054J4537J6944K5216M7292Q4182J33958J12382q342o5173p4243q8966
$$ plain form
12442 561205 794689 1174029 1575188 1613634 1423702 1223867 972122 728677 565643 455449
12432 455449 380791 329262 289101 251296 225248 204512 189590 178109 164957 154668 148155 139380
12420 139380 133266 126309 119916 119193 120411 116440 114768 116901 118712 120487 122006 125026 130579 134697
12406 134697 140182 150145 164507 187627 220800 261784 322239 422455 599716 908045 1341268
12395 1341268 1569278 1427039 1219435 977184 712095 507931 375882 292713 239978 199581
12385 199581 175626 156799 140728 132377 122734 111390 107397 99384 91091 86147 84468 87475 86578
12372 86578 81147 80645 82550 78798 71984 72680 73784 70535 66632 69993 73751 76796 81988 91190 104054
12357 104054 118591 135535 160751 208043 292225 426183 538565 530223 465050 390807 301841
12346C01841q0470n4464l2182k3990j6271q639n047q797o196o667l738P37m047
12333E2070m157k68p49l177l014l7j32n382J137M224k24k295J485j763j478O27
12317C6867L600J992j686R00O8k180m66N450K431q87l732j139o99j339k812k85
12301C6083o98K762k838R13J862J069l236P13L3j377J426k285j162L675p3M23
12285C7290K681O84L879K105L605K543N208O376K819o347p741r171j2047j2223
12271A9661j7600j2458j3485j1890l146P50L76J660K638O774O212J488J423k408
12257b0005J287M717K809K148O63K839J532K460K179J249L268K82L96j452j484
12242B888k07K004l68P19N8K99k467k837J516K266q82j592l228J058N986J125
$$ plain form
12346 301841 221371 166907 134725 110735 94464 85825 80778 71981 65785 59118 55380 56117 52070
12333 52070 47913 47645 46896 43719 40705 40668 40536 35154 36291 40515 40291 37996 39481 37718 36240 36867
12317 36867 40467 42459 40773 41673 41741 39561 39095 44545 46976 46089 42357 41218 40519 39180 36368 36083
12301 36083 35385 38147 35309 36222 38084 39153 35917 36630 36663 35286 36712 34427 33265 36940 36867 37290
12285 37290 39971 40655 44534 46639 50244 52787 57995 64371 67190 60843 53102 43931 31884 19661
12271 19661 2061 -10397 -23882 -35772 -38918 -38168 -37792 -36132 -33494 -26720 -20508 -19020 -17597 -20005
12257 -20005 -18718 -14001 -11192 -9044 -8381 -5542 -4010 -1550 629 1878 5146 5428 5824 4372 2888
12242 2888 2681 4685 4317 5036 5094 5393 2926 89 1605 3871 2989 1397 -1831 -773 5213 6338
12226F338K015O3P97J470m878k676p58L256K114K214L861j392m393J339N6K064
12210A1490j679M05L332K072j790j720M55R80J41K549N03k109l50k145n05k340
12194I289J783Q23k71o79J50J65j678j100J180K573r80N52O58J272L707o14k215
12177A4615l66l332o41L833J886J352K123n12K029K241j768N7M386L149K149N671
12161C6872O758j244J058L019Q973P605O223J8075K0422K6869M1542N4960O1299
12148B92431O1555N5977M0161K1095j338k2177m5327n8663o1488o0026n1194l9047
12136A31959k3985k1856j6425q519n736o408m395k658l925l890l3k145l499r80
12122B7505m535r05k40r80N964L669j073k230l529j640j86j001n87p79l900m280
$$ plain form
12226 6338 8353 8416 9213 10683 5805 3129 2371 5627 7741 9955 13816 12424 8031 9370 9426 11490
12210 11490 9811 10216 13548 15620 13830 12110 12565 13545 13686 16235 16738 14629 14279 12134 11629 9289
12194 9289 11072 11895 11624 10945 11095 11260 9582 8482 9662 12235 11255 11807 12465 13737 17444 16830 14615
12177 14615 14249 10917 10276 14109 15995 17347 19470 18958 20987 23228 21460 21517 25903 29052 31201 36872
12161 36872 43630 42386 43444 46463 55436 63041 69264 87339 107761 134630 176172 231132 292431
12148 292431 353986 409963 450124 471219 469881 447704 402377 343714 282226 222200 171006 131959
12136 131959 107974 86118 69693 61174 55438 49030 44635 41977 38052 34162 34129 31984 28485 27505
12122 27505 22970 22065 21825 20845 26809 30478 29405 27175 23646 22006 21820 20819 20232 19453 15553 11273
12106A1273j030K203j595R16J634N46j849j531J438k366l096l116j892M671o46
12091E560R17K713M31l02J368J030j283m42k393m070R76L896L76m211J320J030
12075F916J268J95J7k369k693q83o8J699K161j071k642j085n78l316J638K709
12059A898L856p66l589N46J739m70M063K278n59j538K040L267K495J016m040k950
12043I286L023J718m508l802j494O35J969N6K045L905r51k195m213n71Q33L414
12027I150J472k358k037r1n13p6M406L669j198k741L96j099l115L60L713L799
12011A3737K075O80L108N969J586k017j402l562m199j844l649p78n98l525L49
11996E930K767R42O6jJ676J395k308K99q7K931l53l252m927l571K69l150M40K970
$$ plain form
12106 11273 10243 12446 10851 11767 13401 13947 12098 10567 12005 9639 6543 3427 1535 6206 5560
12091 5560 6477 9190 9621 9319 10687 11717 10434 9992 7599 3529 4505 8401 8777 4566 5886 6916
12075 6916 8184 8379 8396 6027 3334 2451 2383 4082 6243 5172 2530 1445 867 -2449 -811 1898
12059 1898 5754 4988 1399 1945 3684 3214 7277 9555 8996 7458 9498 12765 15260 16276 12236 9286
12043 9286 12309 14027 9519 5717 4223 4858 6827 6883 8928 12833 11882 9687 5474 4903 5736 9150
12027 9150 10622 8264 6227 6136 5623 5547 9953 13622 12424 9683 10079 8980 5865 6225 9938 13737
12011 13737 15812 16492 19600 25569 27155 25138 23736 20174 15975 14131 10482 9704 9106 5581 5930
11996 5930 8697 9639 9705 9704 11380 12775 10467 10766 10679 13610 13257 10005 5078 1507 1776 -1374 -934 2036
11978B036P98j741o17L680M84J359J081M82j782k862m84J064l255j882J491N665
11962E517J706j678k973k12J744J988N070K587k094L95K010j342j976P56L340
11947A4838M941K863M248P68j646Q6K75k07J485J109J283r69j319J004J888k246
11931B8401o845l509j830l027Q49l201m318k587n06L375J373n369m309J021k22
11916g04J18J06j59Q45K074k090M3M58J39k318J197L650J18p97L781K79p68M173
11898A0145L349l154l520l59R4L396M838M097O336R445J223j862o958q988o683
11883A1399l168J909N59j456l884k271J892J76j347l214o41J697L283N44M80k277
11867C681M65m48j756J550j333k448J851j66R65N75J73j01K21O29j328k174j176
$$ plain form
11978 2036 2834 1093 476 4156 4640 5999 7080 7562 5780 2918 2434 3498 243 -1639 -148 5517
11962 5517 7223 5545 2572 2360 4104 6092 11162 13749 11655 12050 14060 12718 10742 11498 14838
11947 14838 19779 22642 26890 27658 26012 26098 26373 26166 27651 28760 30043 29074 27755 28759 30647 28401
11931 28401 21556 18047 16217 13190 14039 10838 6520 3933 3427 6802 8175 2806 -1503 -482 -704
11916 -704 -586 -480 -639 206 2280 190 233 691 830 -1488 -291 3359 3477 2680 6461 6740 5972 10145
11898 10145 13494 10340 6820 6461 6555 9951 14789 18886 25222 34667 35890 34028 27070 18082 11399
11883 11399 8231 10140 10699 9243 5359 3088 4980 5156 3809 595 -46 1651 4934 5478 5958 3681
11867 3681 4146 3698 1942 3492 2159 -289 1562 1396 2361 2936 3109 3008 3229 3858 2530 356 -820
11850h20L009K95M90k869o33J225R79K145L77J470j874j152j306m87k23k25k945
11833b544J548K387N43L36J816j306k679k165o22K251P31J019L93J93J80j325
11817G56l361k080NM269J668k664p01M21J624J299J103j416J647P30K598K882
11801H780j696K76K011M74j020j531K524J617j758J637N953M970J668j74K045
11786B5776K081M217q15M808Q613K150M471M619R307J1736J6287K0529K6093L2259
11772A72131L4750K7457K5608K4703K4776K2707J6717J0558o519j4006j7749j8773
11760C02360k2015k3690l1000l7670k9974k9657k7666j9203j5436j2034n786o424
11748D1805o911n619o030j431K950r36j581l841k169m780j02k388k140M592J443
$$ plain form
11850 -820 2189 2484 2974 105 -528 697 1676 3821 4198 5668 3794 2642 1336 849 626 401 -2544
11833 -2544 -996 1391 1934 2270 4086 2780 101 -2064 -2686 -435 296 1315 1708 1901 2081 756
11817 756 -2605 -4685 -4680 -411 1257 -1407 -2108 -1687 -63 1236 2339 923 2570 3300 5898 8780
11801 8780 7084 7360 9371 9845 8825 7294 9818 11435 9677 11314 17267 22237 23905 23731 25776
11786 25776 27857 32074 31259 36067 44680 46830 51301 55920 65227 76963 93250 113779 139872 172131
11772 172131 206881 234338 259946 284649 309425 332132 348849 359407 352888 338882 321133 302360
11760 302360 280345 256655 225655 187985 158011 128354 100688 81485 66049 54015 48229 41805
11748 41805 34894 29275 23245 21814 24764 23828 22247 18406 16237 11457 11355 8967 6827 11419 12862
11733A2862L161l49j735M26j92L73J801k586j178M66J78l953J330K051K68L54
11717A3277K57m68L608j091P38n00l90P46o41L73k514L41K126J931J226Qj498
11700A7529Q6L470K3j897m53J429J710o92M38Q83N79j134j364j918O00K859L379
11683B5527J262j882M97m19m54r96J482J205L013O029j599j297J599P807L756
11668D5530n88K669l47J79K144j652P49m572l423l683n879q194r362j1617j1745
11653i791n614o31p942n121k581j451K095L813J304M813N663j16j165K336K93
11638a4095L422K613L76J217k495P44L15j379l014j480J153J803L240L705O18
11623c257l971K0R91M262J823K154L027L937M438L345J088L811j77k147L322L955
$$ plain form
11733 12862 16023 15674 13939 14365 14173 14546 16347 13761 12583 13049 13227 9274 10604 12655 12923 13277
11717 13277 13534 13066 16674 15583 16321 15821 15431 16177 15536 15909 13395 13736 15862 17793 19019 19027 17529
11700 17529 17615 21085 21108 19211 18758 20187 21897 21205 21643 22526 23105 21971 20607 18689 19289 22148 25527
11683 25527 26789 24907 25404 24985 24531 23535 25017 26222 29235 35264 33665 32368 33967 41774 45530
11668 45530 44942 47611 47264 47443 49587 47935 48684 44112 40689 37006 31127 22933 13571 1954 -9791
11653 -9791 -15405 -16036 -23978 -29099 -31680 -33131 -31036 -27223 -25919 -21106 -15443 -15559 -16724 -14388 -14095
11638 -14095 -10673 -8060 -7684 -6467 -8962 -8218 -7903 -9282 -12296 -13776 -12623 -10820 -7580 -3875 -3257
11623 -3257 -7228 -7208 -6217 -1955 -132 2022 5049 8986 13424 16769 17857 21668 21491 19344 22666 26621
11607B6621K911L012j397l096k446L6J45k252q24J262M777O386l196n793m483
11592B1663j721J879K187k413J235L15m658j231K790k137k469M8k384M35M526
11577A8065N916k12k023J046j705m324k751K255Q39k09Q68j344J360K094J411
11562B1286n828j400P95P71j418k469j513N49L263N551J096J212J917J692n2l084
11546B2368l688J041o79j736l405l150j992k127m207K453K273N68k73l45m90J003
11530G614O08J145J191J918K673j7J773L297M83n047l667J241K247o12j503j43
11514A3201j801j653P24L483q66k489k351j182j763j262K147K129j087R01J812
11499I943j761J967J489M243j50k001k076J790M458J363k145n10m22L363M024
$$ plain form
11607 26621 29532 32544 31147 28051 25605 25641 25786 23534 22710 23972 28749 35135 31939 26146 21663
11592 21663 19942 21821 24008 21595 22830 23145 18487 17256 20046 17909 15440 15488 13104 13539 18065
11577 18065 23981 23769 21746 22792 21087 16763 14012 16267 17106 16897 17765 16421 17781 19875 21286
11562 21286 15458 14058 14853 15624 14206 11737 10224 10773 14036 19587 20683 21895 23812 25504 25452 22368
11546 22368 18680 19721 19042 17306 13901 10751 8759 6632 2425 4878 7151 7719 7446 7101 6611 7614
11530 7614 8222 9367 10558 12476 15149 15132 16905 20202 20685 15638 11971 13212 15459 14847 13344 13201
11514 13201 11400 9747 10471 13954 13088 10599 8248 7066 5303 4041 6188 8317 7230 8131 9943
11499 9943 8182 10149 11638 15881 15731 13730 11654 13444 17902 19265 17120 16610 16188 19551 23575
11484B3575M208P726J1821R947O607M734O282R765J0242J5537J2848Q474N602
11471A37368M296J92j641j124L43k319o359j908p425q327m424l505n212m201J911
11456I7665l018n864n269j119r78m32l44K155M12J254j088j424l23K41J45L267
11440H5280N065M139L972N456O254N974L928O515P310K312M372O053L025M617
11426A54272L501K829J474R29J370K080P636P382N867J455L724L347M848P602
11412B08316J1196P130J1963J0978J2793J2762J0275O888J1470J6612J7389J7215
11400C54987K0326K3359K5040K7608L1595K7088L0074L1449L1550L3683L6093
11389F72852L9385L9607M0321M3952M7107N1257N9329O9506P3829Q9028J06909
$$ plain form
11484 23575 27783 35509 47330 57277 63884 68618 74900 84665 94907 110444 123292 131766 137368
11471 137368 141664 141856 140215 139091 139434 137115 130756 128848 121423 113096 108672 105167 99955 95754 97665
11456 97665 94647 88783 83514 82395 81417 80985 80641 82796 83208 84462 83374 81950 81627 81868 82013 85280
11440 85280 90345 94484 98456 103912 110166 116140 120068 126583 133893 136205 140577 146630 149655 154272
11426 154272 157773 160602 162076 163005 164375 166455 174091 181473 187340 188795 192519 195866 200714 208316
11412 208316 219512 226642 238605 249583 262376 275138 285413 292301 303771 320383 337772 354987
11400 354987 375313 398672 423712 451320 482915 510003 540077 571526 603076 636759 672852
11389 672852 712237 751844 792165 836117 883224 934481 993810 1063316 1137145 1226173 1333082
11378A333082J23689J49066J74082K03627K34745K69315L07937L49214L88042
11369C532799M34295M89644N55686O48311P78166R49007J196809J563561K127959
11360A2276237K993899M204234N549031O448762O352250N416326M458543M219580
11352E1918862M609108M746022L794299J620003r92794k962695l744136l751523
11344E5237146l898868m647936n662162o332048o356415n795068m840448l744278
11336A3959923k751163j981819j440272j081989q42256o82844n68280m82124m25793
11327C703383l81760l44213l05292k72076k41047k10780j85714j60713j34122
11318A467666j11559r8385q3468o9370o2436n9740n2084m9957m1454l9237l8837
$$ plain form
11378 1333082 1456771 1605837 1779919 1983546 2218291 2487606 2795543 3144757 3532799
11369 3532799 3967094 4456738 5012424 5660735 6438901 7387908 8584717 10148278 12276237
11360 12276237 15270136 19474370 25023401 31472163 37824413 43240739 47699282 51918862
11352 51918862 56527970 61273992 65068291 66688294 65695500 62732805 58988669 55237146
11344 55237146 51338278 46690342 41028180 34696132 28339717 22544649 17704201 13959923
11336 13959923 11208760 9226941 7786669 6704680 5862424 5179580 4611300 4129176 3703383
11327 3703383 3321623 2977410 2672118 2400042 2158995 1948215 1762501 1601788 1467666
11318 1467666 1356107 1257722 1174254 1104884 1042448 982708 930624 880667 839213 799976 761139
11307G61139l0270l0280k8453k0914j8470j7669j5725j3109j1555j5383j1568
11296E47743j2619j2733p068j1824j7369j4834j4464j6079j7004j8040j4660j4048
11284C77001j3989j3898j5020j0398j0783q648o770l051J091L258J5455L8792
11272C53040N0877M4025L1834K8531K257l9830n7807n4008m0091l3818k0024o095
11260B58891J175J4890K6381L5080K5920k729k4189k5998l1886k9147k2925j9548
11248B05915j1784p480m282o228j2034r133q361j0380r841m181o974q542r979
11235I6716j3266p296m236l357p915p241o022l700l742J370M782J087L578P212
11221E7970N752M680P993O568Q452Q698N487O802N451j926j150J238q10o62J30
$$ plain form
11307 761139 730869 700589 672136 651222 632752 615083 599358 586249 574694 559311 547743
11296 547743 535124 522391 515323 503499 486130 471296 456832 440753 423749 405709 391049 377001
11284 377001 363012 349114 334094 323696 312913 304265 297495 294444 295535 298793 314248 353040
11272 353040 403917 447942 479776 508307 510564 470734 412927 358919 318828 285010 264986 258891
11260 258891 260066 274956 301337 336417 362337 359608 335419 309421 277535 248388 225463 205915
11248 205915 194131 186651 182369 176141 164107 154974 146613 136233 126392 122211 115237 106695 96716
11235 96716 83450 76154 71918 68561 60646 53405 47383 43683 39941 41311 46093 47180 50758 57970
11221 57970 63722 68402 76395 82963 91415 100113 105600 112402 117853 115927 114777 116015 115205 114543 114673
11206A14673k019m769l400l074J9j161o71j549K550K41l371j486J159j547m258
11191I1337l500j912k643l972k499j67K136m90l745l492l69j40J196J320j60p18
11175G2182L951J009N827J0752P937M636K780P181J2252J8180K8884N1230N1065
11162B77866K1468N503J0898M242k7660m7764m3575m2655l9698k5511j9169j3353
11150F0592r338k406l803l786n699M98K029L29J031Q78Q74k6q59l997K005M864
11134D3186j555j610M00p06l370j324O83J406j27L152J384J272J899K102J787
11119D8579P61P74k734J449P23K099L833R82j954k159o63k731k170Q31n33j643
11103D5444l803j676K611J79m575l364P15Q89j571L57N984K00j421L1j183n0K905
$$ plain form
11206 114673 112654 107885 104485 101411 101430 100269 99598 98049 100599 100840 97469 95983 97142 95595 91337
11191 91337 87837 85925 83282 79310 76811 76644 78780 78290 74545 71053 70684 70544 71740 73060 72900 72182
11175 72182 76133 77142 82969 93721 101658 106294 109074 116255 128507 146687 175571 226801 277866
11162 277866 299334 304837 315735 319977 292317 244553 200978 158323 118625 93114 73945 60592
11150 60592 51254 48848 45045 41259 35560 36058 38087 38416 39447 40325 41199 41173 40314 36317 38322 43186
11134 43186 41631 40021 40421 39715 36345 35021 35704 37110 36983 40135 41519 42791 44690 46792 48579
11119 48579 49340 50114 47380 48829 49552 51651 55484 56466 54512 52353 51690 48959 46789 47620 47087 45444
11103 45444 41641 39965 42576 42755 38180 34816 35531 36420 34849 35206 41190 41390 39969 40000 38817 38767 41672
11086D1672K20r60n80K284J355k529m102K095R93l009M68j057l28J063r67J377
11070C7995J656K44M69j533l971j676K716L439J339N92K378P01j414Q28n48J965
11054D5180L384K632L037K26j68o43k738k240l586o196p525n631o298j0216p417
11039A801n986o272n923p021p82K100P78J669j900k302j14M713M247M140J029
11024i823P43P23K148J07J441K219p35P03o09j616J766J601M82K064m6k830m132
11007e794j936Lo29K157K654k76J777J76l698J128L602q1k294n63K045M184mp22
10989A729P75J66k50j308J749j860l03J495k72k932J401M360r59l567k170J681
10973b65K648L058n3o37K053n521j396K266M332K250K329L648K74O88j921R45
$$ plain form
11086 41672 41892 40932 40352 42636 43991 41462 37360 39455 40448 37439 37907 36850 36522 37585 36618 37995
11070 37995 39651 39895 40364 38831 34860 33184 35900 39339 40678 41270 43648 44349 42935 43763 43215 45180
11054 45180 48564 51196 54233 54459 54291 53648 50910 48670 45084 38888 31363 25732 19434 9218 1801
11039 1801 -4185 -10457 -16380 -23401 -24183 -22083 -21305 -19636 -21536 -23838 -23952 -19239 -14992 -10852 -9823
11024 -9823 -9080 -8357 -6209 -6102 -4661 -2442 -3177 -2474 -3083 -4699 -2933 -1332 -850 1214 1168 -1662 -5794
11007 -5794 -7730 -7727 -8356 -6199 -3545 -3821 -2044 -1868 -5566 -4438 -836 -917 -3211 -3774 -1729 2455 2451 1729
10989 1729 2504 2670 2420 1112 2861 1001 698 2193 1921 -1011 390 4750 3791 224 -1946 -265
10973 -265 2383 5441 5388 4751 6804 1283 -113 2153 6485 8735 11064 14712 14986 15674 13753 14698
10957A4698N775o51m056m05K013J514K407J663L605Q97p91j084J606N779N873
10942C8843M979M934P119J0851J7355K3198K8287L2067L2278K8593K5969K3542
10930B78015K2262K3232K0605J0422m164j3023j7843j9433k3653k5239k5072l0916
10918A95193l3624k9123k3947j7940j6800j6477j2985l566k592n412k038j490
10906B9199k434Q86N37J967l5p35m59M015L738M304P124R428J9009K6229L5893
10891A38666K7761K777j8980k3807k7311k5381j9162j2364q753o318k863N46n128
10878A9683k137O66k51L21l230n246k560r84j96K326J443L102K379k532k983L67
10862A0168p52k25J833J80j938L06J966q64j601n13N27J80k678l165j392K769
$$ plain form
10957 14698 20473 19822 15766 15361 17374 18888 21295 22958 26563 27460 26669 25585 27191 32970 38843
10942 38843 43822 48756 55875 66726 84081 107279 135566 167633 199911 228504 254473 278015
10930 278015 300277 323509 344114 354536 350372 337349 319506 300073 276420 251181 226109 195193
10918 195193 161569 132446 108499 90559 73759 57282 44297 40731 38139 32727 30689 29199
10906 29199 26765 27651 28188 30155 30120 29385 28926 32941 36679 40983 48107 57535 76544 102773 138666
10891 138666 166427 169204 150224 126417 99106 73725 54563 42199 33446 27128 24265 24811 19683
10878 19683 17546 18212 17961 18282 15052 9806 7246 6262 6066 8392 9835 12937 15316 12784 9801 10168
10862 10168 9416 9191 11024 11204 9266 9572 11538 10674 9073 8560 9087 9267 6589 3424 2032 4801
10846D801O30J96K9K340K328j352N97J600P97l041K442k063k860j861l65P94J377
10829F389K40K281r78m75j389o33L253L859P47J49K120Q81k221m556J381J734
10813A2782l467k995j661k54l86J023L29k08q57o3J824p33k711q24O82J096M487
10796H064q72k596l35r0J59J771j015q16J325P14k781k127J198L976J496m057
10780D014m086J04p57J369K449J385j19J258Q80N53l014j417p29j795k61R69J251
10763B054K721M79k022N21m77N69K574J832K655o16l653j833R37l141l554L52
10747f02N19m3K255k011K567J720n842p876J295L638L008o13J647Q58K244j92
10731B572k981M723M416K76j758k379k708J292K731R51k472k075O98J409j708
$$ plain form
10846 4801 5431 5627 5656 7996 10324 8972 9569 11169 11966 8925 11367 9304 6444 4583 4218 5012 6389
10829 6389 6629 8910 7932 7457 6068 5435 8688 12547 13294 13443 15563 16444 14223 9667 11048 12782
10813 12782 9315 6320 4659 4405 4019 5042 5371 5163 4306 4243 6067 5334 2623 1799 2481 3577 8064
10796 8064 7192 4596 4261 4171 4330 6101 5086 4270 5595 6309 3528 1401 2599 6575 8071 4014
10780 4014 -72 32 -725 644 3093 4478 4359 5617 6497 7050 4036 2619 1890 95 -166 803 2054
10763 2054 4775 5254 3232 3753 3276 3845 6419 8251 10906 10290 6637 4804 5741 2600 -954 -602
10747 -602 -83 -126 2129 118 2685 4405 -1437 -9313 -8018 -4380 -1372 -1985 -338 520 2764 2572
10731 2572 -409 4314 8730 9006 7248 4869 2161 3453 6184 7135 4663 2588 3286 4695 2987
10716B987n707K418Q330J499m841l70j121j425O6q76j713m48K123K676R07j824
10700B681q22k390k147j37J28M109r94m923k121J586J310K4O66K262o18k315p37
10683d438L786j160k092J076M494p32j138l48k19K159Q52p43j270j05j854l010
10667d742N020J330K157k739k143m24o87j762m58j274M434K854k891k755j327
10652e407m667J163N797m06n400k850O59K852N12J619P680J898J385o39l08j64
10636C724m62m37r87L77J83j153j523L421J608j319j056J985k415j647J102N631
10620G032J661m15o01j124j201o25k288K524J458K686n42j685j553l446K197k362
10604A716m659o32R38n12L107K828j381K56J430M831J866m777l79l158J853J720
$$ plain form
10716 2987 -2720 -302 8028 9527 4686 4316 3195 1770 1836 960 -753 -1201 922 3598 4505 2681
10700 2681 1859 -531 -2678 -2815 -2687 1422 428 -4495 -6616 -5030 -3720 -3696 -3030 -768 -1386 -3701 -4438
10683 -4438 -652 -1812 -3904 -2828 1666 934 -204 -552 -771 1388 2240 1497 227 122 -1732 -4742
10667 -4742 278 1608 3765 1026 -1117 -1541 -2228 -3990 -4448 -5722 -1288 1566 -1325 -4080 -5407
10652 -5407 -10074 -8911 -3114 -3520 -8920 -11770 -11111 -8259 -7747 -6128 1552 3450 4835 4196 3888 3724
10636 3724 3262 2825 1838 2215 2398 1245 -278 3143 4751 3432 2376 4361 1946 299 1401 7032
10620 7032 8693 8278 7677 6553 5352 4727 2439 4963 6421 9107 8565 6880 5327 1881 4078 1716
10604 1716 -2943 -3575 -2637 -3149 -42 2786 1405 1661 3091 7922 9788 5011 4632 1474 3327 5047
10588E047J347m156n222J98k620R62P39N190M84l88J763K714j117m893p82K238
10572A504J124k383qJ348K660j472J60J023J00J877m10L84j302K594K153l489
10556E863k039k040K158Q55j233j431K298L691O86k345k133L06K477k641P94j34
10540E132K12j779k987j766J820P83l034J010O25m667l043P16M403K737p98j33
10524g69L954K56J062L311N43j855J798o03P18M066J468N52J208n3r18l47M424
10507A8815J717q31j611l486k742n055k380k615m81L792K084p48L472j436J784
10492A0279j244n068j466r96Q10L332L648k032j165m99l14l540j292L017J800
10477E270K562L345R9q11k556m445q14M823j091q07K92L191J063l639M21R3K580
$$ plain form
10588 5047 6394 2238 -2984 -2786 -5406 -4444 -3705 1485 1969 1581 3344 6058 4941 48 -734 1504
10572 1504 2628 245 237 1585 4245 2773 2933 3956 4056 5933 5523 5907 4605 7199 9352 5863
10556 5863 3824 1784 3942 4797 3564 2133 4431 8122 8808 6463 4330 4636 7113 4472 5266 5132
10540 5132 5344 3565 578 -1188 632 1415 -1619 -609 16 -4651 -7694 -6978 -2575 162 -636 -769
10524 -769 3185 3441 4503 7814 8357 6502 8300 7697 8415 12481 13949 14501 15709 15656 14738 14391 18815
10507 18815 20532 19701 18090 14604 11862 6807 4427 1812 1331 5123 7207 6459 9931 8495 10279
10492 10279 9035 3967 2501 1505 2315 5647 9295 7263 6098 5599 5285 1745 453 3470 5270
10477 5270 7832 11177 11276 10465 7909 3464 2650 7473 6382 5575 5867 9058 10121 6482 6903 6996 9576
10460I576M73L463M347o11K5j356k622j27J428q06k522O10J41l35o20q82K462
10443A2644j140M24j26J853J462J780k77K424K035l371r58q90j189j592j983j486
10427I610P90O28k866J792K492p6r60k922K79J913J296K611K66q6O90J657j630
10410A5484L02J120N362n81k276l533m142j836r23j212j423L699N37j321k026
10395G231j24j310M13N62K008j230l325j34j305l407j392K765J951L807J346J276
10379I132j350J167o48k173J230k627r51j477m08j545L80N455L272K96O06J610
10363A1969K50j089j770k240j213j900k465j00J942k113n84K359m22K40K837n40
10347E161k828j635o93K651L105p69k173K247k93l192O61M057L12j853o36P33
$$ plain form
10460 9576 10049 13512 17859 17248 17273 15917 13295 13168 14596 13790 11268 11878 12019 11684 11064 10182 12644
10443 12644 11504 11928 11802 13655 15117 16897 16620 19044 21079 17708 16750 15860 14671 13079 11096 9610
10427 9610 10400 11028 8162 9954 12446 12370 11410 8488 8767 10680 11976 14587 14853 14767 15457 17114 15484
10410 15484 15786 16906 22268 21687 19411 15878 11736 9900 8977 7765 6342 10041 10578 9257 7231
10395 7231 7107 5797 6210 6772 8780 7550 4225 4091 2786 -621 -2013 752 2703 6510 7856 9132
10379 9132 7782 8949 8301 6128 7358 4731 3780 2303 1895 350 730 6185 9457 9753 10359 11969
10363 11969 12219 11130 9360 7120 5907 4007 1542 1442 3384 1271 687 3046 2624 2864 5701 5161
10347 5161 2333 698 5 2656 5761 4992 2819 5066 4773 1581 2242 6299 6611 4758 4122 4855
10331D855J863n02J238R28l191j352K382j694o01J542k94J367j379K634k51j663
10315E882l33k88J540O44m194p96J159N67R66L77K566j430J511L180l018J982
10299A0315l86M416L240L190K247J770J463M31L65J12m557m272o3J319j74k483
10283A6933n021o728j335O58K60M379K174l426J931R23J939J381R96K7o23k074
10267A2394k516m488q97l44J434K225L002j697K450L89j65l520j033k0m03P84
10251G595M335J056K79n7n29M267K067K232L326K3k257j607L096L723K53j684
10235B6118m593j935K50l135j484K601k72j972K36l629j209q99J21L724L200J291
10219A8413O54P52K108L850K958l360j046L360J670j275k868l996L182N615M77
$$ plain form
10331 4855 6718 6216 7454 8382 5191 3839 6221 4527 3926 5468 5174 6541 5162 7796 7545 5882
10315 5882 5549 5261 6801 7445 3251 2455 3614 4181 5147 5524 8090 6660 8171 11351 8333 10315
10299 10315 9929 14345 17585 20775 23022 24792 26255 26686 27051 27163 22606 18334 18271 19590 19416 16933
10283 16933 11912 5184 3849 4507 4767 9146 11320 7894 9825 10748 12687 14068 15064 15091 14468 12394
10267 12394 9878 5390 4493 4149 5583 7808 10810 9113 11563 11952 11787 8267 7234 7214 6811 7595
10251 7595 11930 12986 13265 13208 12679 16946 19013 21245 24571 24594 22337 20730 23826 27549 27802 26118
10235 26118 21525 19590 19840 16705 15221 17822 17550 15578 15814 12185 10976 10077 10198 13922 17122 18413
10219 18413 19067 19819 21927 25777 28735 25375 24329 27689 29359 28084 25216 21220 24402 30017 30494
10204C0494n38j138K880K131k597L55q76n372j232j993k318J203J412k416j079
10189A8916J554P05k465m211m646j595J193L10p6L260J971j93J358q55L113j043
10173A7296k492q44K93K43j797o22K862O49J588J472j51n6L138n70l43Q10k386
10156A9090J963m44j313J883j291K871j515l154l404l637o06j010L61M10L266
10141A3470K806l767Q80K833M97k437K213L252O32J484k092l467n88Q54L177N14
10125B0261p09Q72K674P41k042J005l883j49n19p33l258j495J768m32p6J45L248
10108A7418K046O77l13l02j260k464R59K701K47j697l156J125K420m18J838l026
10092A6795j065J945n86j97k00k083k711K759J948l146N98K654K406k324m825
$$ plain form
10204 30494 29956 28818 31698 33829 31232 31587 30711 25339 24107 22114 19796 20999 22411 19995 18916
10189 18916 20470 21175 18710 14499 9853 8258 9451 9761 9685 12945 14916 14723 16081 15226 18339 17296
10173 17296 14804 13960 14253 14496 12699 12077 14939 15588 17176 18648 18497 18441 21579 21009 20666 21476 19090
10156 19090 21053 20609 19296 21179 19888 22759 21244 18090 14686 11049 10443 9433 9794 10204 13470
10141 13470 16276 12509 13389 16222 16719 14282 16495 19747 20379 21863 19771 16304 15716 16570 19747 20261
10125 20261 19552 20424 23098 23839 21797 22802 18919 18770 18251 17518 14260 12765 14533 14101 14025 14170 17418
10108 17418 19464 20141 19828 19526 18266 15802 16761 19462 19709 18012 14856 15981 18401 17983 19821 16795
10092 16795 15730 17675 17089 16892 16692 14609 11898 14657 16605 13459 14057 16711 19117 16793 11968
10077A1968l02J312J068K686J92N81M51J424J997n70q79K57K806L789L692K228
10061C2700L442K350j294m49J237J490K309P255P151J2538R251k95O574Q451P755
10046A00465J1408J3950J1954J6118K4045L6973N1302O8500J11289J84841L48981
10035I79826P15148J100770J93662m74453l99708n38327n46406l63618k12550
10026D54344j32089p9127n0805l4970k3160j7888j2155j1414j0453p517j056K739
10014G6449j291l693j16o517j1829n812l633R54L348j871K402Q337J2832J1169
10000H0729L777l260m579o561r908l035k747p4j341k336r5j509j56r37j61J460
9984D9267m162l887k670k866l118J9l920k694J744L489j187K90j282j044P34J754
$$ plain form
10077 11968 11666 12978 14046 16732 16924 17505 17956 19380 21377 20807 19928 20185 22991 26780 30472 32700
10061 32700 36142 38492 37198 36749 37986 39476 41785 49040 56191 68729 77980 77685 84259 92710 100465
10046 100465 111873 125823 137777 153895 177940 214913 266215 334715 446004 630845 979826
10035 979826 1694974 2795744 2989406 2514953 2115245 1576918 1030512 666894 454344
10026 454344 322255 243128 192323 157353 134193 116305 104150 92736 82283 74766 73710 76449
10014 76449 75158 71465 71349 64832 53003 47191 43558 44512 47860 45989 48391 56728 69560 80729
10000 80729 84506 81246 76667 70106 60198 57163 54416 54342 53001 50665 50570 49061 48905 47968 47807 49267
9984 49267 45105 41218 38548 35682 32564 32583 28663 25969 27713 31202 30015 30305 29023 27979 28713 30467
9968C0467O919K936l019K232K397J368L216K079m292j924L989P66Q24K549M182
9953E4689J655J347n31j97k797K853N993L599L526J0638J2484N169K798R056Q470
9938A18752L541p920j1086j2021q806l602k850m054r88K78K681J427J807J202
9924G8361L687J743M003P545J1286P769Q487O297P658N472j200Q75J338M837Q480
9909A56638Q617Q892Q171K390J872O19j052n339k192J836K192j651k129O126J275
9894A86265N215L616P58L484O637Q161M917k82J797M045K662M582J873m057j403
9879B28270N917M329J393R580Q562l023q835q024j2808j2875q548j0355n819l364
9865A84400k449k968n671j883j546k363j764n249l536j84o785p985j542M243N96
$$ plain form
9968 30467 37386 40322 37303 39535 41932 43300 46516 48595 44303 42379 46368 47134 47958 50507 54689
9953 54689 56344 57691 57160 56963 54166 57019 63012 66611 70137 80775 93259 98428 101226 110282 118752
9938 118752 122293 114373 103287 91266 82460 78858 76008 71954 70966 71244 73925 75352 77159 78361
9924 78361 82048 83791 87794 95339 106625 114394 122881 129178 136836 142308 141108 141983 143321 148158 156638
9909 156638 165255 174147 182318 184708 186580 187199 186147 180808 178616 180452 182644 180993 178864 184990 186265
9894 186265 191480 195096 195854 199338 205975 214136 219053 218771 220568 224613 227275 231857 233730 229673 228270
9879 228270 234187 238516 239909 249489 258051 255028 246193 238169 225361 212486 203938 193583 187764 184400
9865 184400 181951 178983 173312 171429 169883 167520 165756 160507 156971 156787 150002 142017 140475 144718 145314
9850A45314k35K457j569m816q19k80j131l574J358L537JJ316L416K366R33n211
9834A43063k893k964l393p91l481R49j602k216m605n592p725n914m755l617j243
9819I3221J453m78j676K137N724N190O658N659k412J754N286M171K791O530J2130
9804A48138J4870J3480J8337K3146K9056L9558N9931R6392J55348K58799M15443
9793A272498M80579J60287j68171k53047l13415l17390k43222j60032j06351o6865
9783B84871m2153k8782j7625j0206j0268r869m775l942o228k598L15j753m152
9770A42835n992j108J148j99J459M484J728k153j671j645j576l168j388l57j303
9755A31094l718p44l266j359J694M122m624l267k920P2L497L590L210L02k908
$$ plain form
9850 145314 145079 147536 145967 141151 140332 140052 138921 135347 136705 140242 140243 141559 144975 147341 148274 143063
9834 143063 140170 137206 133813 133022 129541 130490 128888 126672 122067 116475 108750 102836 98081 94464 93221
9819 93221 94674 94196 92520 94657 100381 105571 112229 117888 115476 117230 122516 126687 129478 136008 148138
9804 148138 163008 176488 194825 217971 247027 286585 346516 442908 598256 857055 1272498
9793 1272498 1753077 1913364 1745193 1492146 1178731 861341 618119 458087 351736 284871
9783 284871 242718 213936 196311 186105 175837 165968 161193 157251 151023 148425 148740 146987 142835
9770 142835 136843 135735 136883 136684 138143 142627 144355 142202 140531 138886 137310 134142 132754 132397 131094
9755 131094 127376 126632 123366 122007 123701 127823 123199 119932 117012 117084 120581 124171 127381 127683 124775
9740A24775j955J150K466K201L945L618J417Q980N286R84N448J859j829k15k341
9725A55789j517j614k913Q85P589K127J470M101K466p10l90Q57K154r7O81j290
9709A69588k033l55M430O187l84L019O162J468J202O715J1650R020O127Q248R655
9694B40699J1557J2662J3573J3223R856J0201J0873J1242l13m680n867q561l926
9681C10539J289J863J272M209M018O479N583N079M994N289K345N094R442L580
9667C71075k533n54j384k759l331k89k743o273n41k706P51p11k140o71o575n177
9651C33439l059K218J98m33N006O956Q214J2570J4249J3375J2990J0341L227n092
9637D14199p075p724l000j843m048r864n104K7j886m300j069j058J019L24k485
$$ plain form
9740 124775 122820 123970 126436 128637 132582 136200 137617 146597 151883 152867 158315 160174 158345 158130 155789
9725 155789 154272 152658 149745 150630 158219 160346 161816 165917 168383 167673 167283 168140 170294 170197 170878 169588
9709 169588 167555 167200 171630 177817 177433 180452 186614 188082 189284 195999 207649 216669 222796 231044 240699
9694 240699 252256 264918 278491 291714 301570 311771 322644 333886 333573 328893 323026 314465 310539
9681 310539 311828 313691 314963 319172 323190 329669 335252 340331 345325 350614 352959 358053 367495 371075
9667 371075 368542 367988 366604 363845 360514 360225 357482 351209 350668 347962 348713 348002 345862 345191 338616 333439
9651 333439 330380 332598 332796 332363 337369 344325 352539 365109 379358 392733 405723 416064 419291 414199
9637 414199 407124 399400 396400 394557 390509 380645 375541 375568 373682 369382 368313 367255 368274 368598 366113
9622C66113P64K524L455O206O496M447O964M762L781J794N555N191Q635P262O860
9607D40809J1655J1767J2123P402R884R867J1477J4379J3359J5707J3879J4270
9595E86578J5047J6915J5293J8452J4958Q433J2965K2089K2900K3094K3188K1907
9583H01819K1111K1413K5484K3852K7438K7827K9875K9566K9328L5324L5462L9421
9571A147920M3545N1337N2404N4421N5384N9686O3551O6800P1023P5069P7319
9560A818459Q3451R1875R6800J03049J09616J17848J26052J35698J51274J65598
9550B999720J76813J92723K10467K29856K54342K76504L01843L37855L73611M11067
9540E764801M60628N18585N85269O54329P34317Q32380R40838J071052J221852
$$ plain form
9622 366113 366877 369401 372856 379062 385558 390005 396969 401731 405512 407306 412861 418052 426687 433949 440809
9607 440809 452464 464231 476354 483756 493640 503507 514984 529363 542722 558429 572308 586578
9595 586578 601625 618540 633833 652285 667243 675676 688641 710730 733630 756724 779912 801819
9583 801819 822930 844343 869827 893679 921117 948944 978819 1008385 1037713 1073037 1108499 1147920
9571 1147920 1191465 1242802 1295206 1349627 1405011 1464697 1528248 1595048 1666071 1741140 1818459
9560 1818459 1901910 1993785 2090585 2193634 2303250 2421098 2547150 2682848 2834122 2999720
9550 2999720 3176533 3369256 3579723 3809579 4063921 4340425 4642268 4980123 5353734 5764801
9540 5764801 6225429 6744014 7329283 7983612 8717929 9550309 10491147 11562199 12784051
9531A2784051J410213J622690J861795K148857K474336K828823L203749L575377
9523C1909891L896929M092545M090519L805991L197423K048130K81646j324023
9515E1999051k570740l525534m056779m189051m071730l793149l429967l046366
9507B3315735k670221k324613k014052j740994j502569j300410j127633r78035
9499I657208q57585p58027o66831n84613n19114m64891m13079l74524l34918l01782
9489D381844k76826k44320k22356k05934j86497j74624j60777j48538j38742j28778
9479B494452j14192j08065j03284r7434q6532q3902p8539p1435o7000o3019n5978
9468A565072n4285n1794m9325m9388m6029m0582m0349l9200l5771l7996l6792
$$ plain form
9531 12784051 14194264 15816954 17678749 19827606 22301942 25130765 28334514 31909891
9523 31909891 35806820 39899365 43989884 47795875 50993298 53041428 53323074 51999051
9515 51999051 49428311 45902777 41845998 37656947 33585217 29792068 26362101 23315735
9507 23315735 20645514 18320901 16306849 14565855 13063286 11762876 10635243 9657208
9499 9657208 8799623 8041596 7374765 6790152 6271038 5806147 5393068 5018544 4683626 4381844
9489 4381844 4105018 3860698 3638342 3432408 3245911 3071287 2910510 2761972 2623230 2494452
9479 2494452 2380260 2272195 2168911 2071477 1984945 1901043 1822504 1751069 1684069 1621050 1565072
9468 1565072 1510787 1458993 1409668 1360280 1314251 1273669 1233320 1194120 1158349 1120353 1083561
9457A083561k9398k5145k3848j9083j9120k3691k4532k8039k2866j9114k0625
9446H28100j5442k1069k2231k2676k0863j8378j9528k5109k3872k1274k1646j6454
9434E79558j7442j1869j1629j3817j2366q606j0165p407p800p486j1109p447r363
9421D43052j0773q866p613q768j0247j1357o870o436p589p505o418n391p135p732
9407C30352r087r523o450r316j1619j0994r950j0775m848p47J454j722j04N243
9393B51914R091L265M154M120N002o06q761p573k915j078J920J538K036K04J996
9378B64307n08l909Q7N160K544N497N467J403l8j224j019m300n231k234j343o776
9362B57883n018l48J033K388R17m87K39J114J033J652J1313J0852O205L278Q786
$$ plain form
9457 1083561 1054163 1029018 1005170 986087 966967 943276 918744 890705 867839 848725 828100
9446 828100 812658 791589 769358 746682 725819 707441 687913 662804 638932 617658 596012 579558
9434 579558 562116 550247 538618 524801 512435 503829 493664 486257 478457 470971 459862 452415 443052
9421 443052 432279 423413 415800 407032 396785 385428 378558 372122 364533 357028 350610 345219 338084 330352
9407 330352 321265 311742 305292 295976 284357 273363 263413 252638 247790 247043 248497 246775 246671 251914
9393 251914 261005 264270 268424 272544 277546 276940 268179 260606 257691 256613 258533 260071 262107 262311 264307
9378 264307 263799 259890 259977 265137 267681 273178 278645 280048 280010 278786 277767 273467 268236 266002 264659 257883
9362 257883 252865 252517 253550 255938 256855 256368 256607 257721 258754 260406 271719 282571 288776 292054 300840
9347C00840R217J0877J3490J7615J4235J9240K8173M0330N4812Q1522J09046J37456
9335H36853J60236J78546J68403J26448P1493L625p3955j33833j61739j68351
9325A007726j58573j41302j16723r4004o5343m6642l4399k2257j7504j3875j4253
9314B82851j3819j4831j1943o219q465r086k765O79k371q051j3572o947l835l371
9300A78255m612j606J384O92K606L011K545j574j972j641l814K07r97l694p97
9285A67993M398L887j480Q59K102p40J254M257l143k362p29K291L81l666n337
9270A69965J632L852N271K422L717M458L635J444K99q83j82J134L337K152N838
9255B08091L596M723P288N227L602M615Q568J7190K0200J9033R160k147j5629
$$ plain form
9347 300840 310057 320934 334424 352039 366274 385514 413687 454017 508829 590351 699397 836853
9335 836853 997089 1175635 1344038 1470486 1541979 1545604 1471649 1337816 1176077 1007726
9325 1007726 849153 707851 591128 497124 431781 385139 350740 328483 310979 297104 282851
9314 282851 269032 254201 242258 236039 227574 218488 215723 216402 214031 205980 192408 185461 181626 178255
9300 178255 173643 172037 173421 174113 176719 179730 182275 180701 178729 177088 173274 173481 172484 168790 167993
9285 167993 172391 176278 174798 175657 177759 177019 178273 182530 179387 177025 176296 178587 178968 175302 169965
9270 169965 171597 175449 180720 183142 186859 191317 194952 196396 196695 195812 195630 196764 200101 202253 208091
9255 208091 211687 216410 223698 228925 232527 237142 245710 262900 283100 302133 311293 309146 293517
9242B93517l3479o1488p4234o1190m9039l8402j7117J258O960J4101J6159J6720
9230A3766J8305J8821J7302J1445O814m9k595N38o76r59l355p38J726J580k412
9215G9513r38k666l700o699n524n288l534o049m407m139O91L558Q51M653R578
9200E5900J2633J3835J1842O422M224K138J702j187O77Q465P654J1332R007N514
9186A50158L184l161k104J301q39K918R931L844J050J290J158M260m58l967p039
9171A61526j1686r037k899n068m616q49p23j080p638m004m226o928q112o097k848
9156H5715Q12L085O081Q297P668N718P121L395p013n946N2n236q491m369j159
9141I5730l4J539N468P775J1450J0107Q243J2005R605N136O412k94r433j5453
$$ plain form
9242 293517 260038 198550 124316 63126 14087 -24315 -41432 -40174 -33214 -19113 -2954 13766
9230 13766 32071 50892 68194 79639 86453 86404 83809 84347 83671 82712 79357 78619 80345 81925 79513
9215 79513 78575 75909 72209 65510 59986 54698 51164 45115 40708 36569 37260 40818 41669 46322 55900
9200 55900 68533 82368 94210 100632 104856 106994 108696 107509 108186 116651 124305 135637 144644 150158
9186 150158 153342 150181 148077 149378 148539 151457 161388 165232 166282 167572 168730 172990 172532 168565 161526
9171 161526 149840 140803 137904 132836 128220 127371 126648 125568 117930 113926 109700 102772 94660 88563 85715
9156 85715 86527 89612 95693 103990 111658 117376 124497 127892 120879 114933 114985 109749 101258 96889 95730
9141 95730 95696 97235 102703 110478 121928 132035 140278 152283 161888 167024 173436 173142 163709 148256
9127A48256j6879j2884j7230k3282k9329k5335q660Q673J7719K2095K4244K4300
9115A11688L0034L4458K8554J9549P337p189j5579j7367k4430j8311j2793p475
9103A28476n621j344k219Q30J663J680K958L36k696n632p283r513j2810p745j502
9088G9578Q82M433M005N410M933P01l599n488l711P36m0M390N464P579M224j313
9072A08184j284k342k342n42M305J4709L1500L4209L7738M3907N8007O8522O9415
9059D63986N1353K9557J5277J905r419j1457j222J4215R224j4544k5751k4032
9047D99092k6544l4569l6220k7526j8933j5890j4144r518o522J63J822N477Q818
9034C25506R083Q144P276J0937L721Q50j219q845p917m366J387L858J4394K4599
$$ plain form
9127 148256 131377 118493 101263 77981 48652 23317 14657 23330 41049 63144 87388 111688
9115 111688 141722 176180 204734 224283 231620 224431 208852 191485 167055 148744 135951 128476
9103 128476 122855 121511 119292 120122 121785 123465 126423 126759 124063 118431 111148 101635 88825 81080 79578
9088 79578 80460 84893 88898 94308 99241 99942 96343 90855 87144 87880 87840 92230 97694 105273 109497 108184
9072 108184 106900 104558 102216 101674 105979 120688 152188 186397 224135 268042 326049 394571 463986
9059 463986 515339 544896 560173 562078 552659 541202 539980 554195 563419 548875 523124 499092
9047 499092 472548 437979 401759 374233 355300 339410 325266 315748 309226 309389 311211 316688 325506
9034 325506 334589 342733 350009 360946 364667 365517 364298 355453 347536 343170 344557 348415 362809 387408
9020C87408L5407L8985L3338K7837K4926K5058K1256J3574N250K529K288R24J691
9007F20471N638J0839J4506J3929J3565J0837J3371K5543K9751K7894L1753K6394
8995H44491K2049K2790K6658K2462K1835K5795L2707L7870M4490O0746P4194O6586
8983A302673O8999P6852P7663Q3854R0775Q7903Q7021Q7774J00930J15047J21158
8972B300649J18036J26609J46376J75447K07333K36084K55191K61058K61571K72490
8962D360844L04151L46634M01683M55339N07726N71244O66050P89828R26294J081416
8952A0411209J287647J571719J950549K419903K883504L109612L064721L202428
8944B9901292L825459M963034O806854R645023J3953123K0538590L0770900M5880625
$$ plain form
9020 387408 422815 461800 495138 522975 547901 572959 594215 607789 613039 615568 617856 618780 620471
9007 620471 626109 636948 651454 665383 678948 689785 703156 728699 758450 786344 818097 844491
8995 844491 866540 889330 915988 938450 960285 986080 1018787 1056657 1101147 1161893 1236087 1302673
8983 1302673 1371672 1448524 1526187 1610041 1700816 1788719 1875740 1963514 2064444 2179491 2300649
8972 2300649 2418685 2545294 2691670 2867117 3074450 3310534 3565725 3826783 4088354 4360844
8962 4360844 4664995 5011629 5413312 5868651 6376377 6947621 7613671 8403499 9329793 10411209
8952 10411209 11698856 13270575 15221124 17641027 20524531 23634143 26698864 29901292
8944 29901292 33726751 38689785 45496639 55141662 69094785 89633375 120404275 166284900
8936A66284900O2372321O3834908L3799691p079700l1098261m3871281n0845976
8929A93396602m7845394l7764325k7175167j8806054j2815221q736009o009344
8922C4245088m206596l089347k544589k439568k435425k314618k108619j837261
8914A3269065j516056j222747r94298q16404o62009n36397m42271l84261l55638
8905F338984l59297l60203l52731l38296l19194k99436k71521k52153k37052k16440
8895C332661j84382j58328j44419j32681j21010j08562r6286q0877o0595n8869
8885B186652o4442p0073p2705p2279o3865n7182n0227m9378m7199m2600l0447
8874A566255k6586j9035k094O465j4228l7868m4277n0682n9113o0966n9807n0493
$$ plain form
8936 166284900 228657221 292492129 326291820 319212120 288113859 244242578 193396602
8929 193396602 145551208 107786883 80611716 61805662 48990441 40254432 34245088
8922 34245088 30038492 26949145 24404556 21964988 19529563 17214945 15106326 13269065
8914 13269065 11753009 10530262 9535964 8719560 8057551 7521154 7078883 6694622 6338984
8905 6338984 5979687 5619484 5266753 4928457 4609263 4309827 4038306 3786153 3549101 3332661
8895 3332661 3148279 2989951 2845532 2712851 2591841 2483279 2386993 2306116 2245521 2186652
8885 2186652 2122210 2052137 1979432 1907153 1843288 1786106 1735879 1686501 1639302 1596702 1566255
8874 1566255 1539669 1520634 1518540 1525005 1510777 1472909 1428632 1377950 1318837 1257871 1198064 1147571
8862A147571m7189m5096l9999l7180k9178k9165k8714k5595k4759k3244j5107
8851H02345o197N674K2788L3149K8051J7310N468k1626m0017m6809m9263m5998
8839G04875l9051l3644k9785k0504k0612k1127j9374n666l051m289o362j0097
8827D91313j1879o964o696j2658j7786k4730l3170m4602m6194l0748q385m643
8815B42858j6007j9014m696j029j0299k1471j6564K154K5510L4753L7906L5168
8803B89269L8549L8711L0637J4839P111J15m958j0910j4564j3368q870n222l243
8790C58096q75j685o787j1206j2558q243p312p981l467m750J027L970L955l620
8776B98564n526p706j0202j2182j2003n185J591O385J404l14M064K377O381R789
$$ plain form
8862 1147571 1100382 1055286 1015287 978107 948929 919764 891050 865455 840696 817452 802345
8851 802345 796148 801822 824610 857759 885810 903120 908588 886962 846945 800136 750873 704875
8839 704875 665824 632180 602395 581891 561279 540152 520778 515112 512061 507772 501410 491313
8827 491313 479434 472470 465774 453116 435330 410600 377430 332828 286634 255886 247501 242858
8815 242858 226851 207837 203141 202112 191813 170342 153778 155932 181442 216195 254101 289269
8803 289269 327818 366529 397166 412005 419116 419231 414273 403363 388799 375431 366561 361339 358096
8790 358096 357221 355536 348749 337543 324985 316742 309430 301449 297982 293232 294259 298229 302184 298564
8776 298564 293038 285332 275130 262948 250945 245760 247351 253736 255140 254826 258890 261267 267648 277437
8762B77437R516J6298J7600J4961J956j1496k4039k7279k4837j3683l557J991
8750B34868J1097J2466P571J3097J3319K084j9167l2750l4161k2315j7379k0593
8738A48137j9656j6361o647N70N267O822P826P746N450P181P294J0590N332Q18
8724A70369P03m214o313k330j879L962R263O552J996M807N627J0425M796l987
8710A99777l704l421r645q504j572k961M5Q413M945N20N801K971j523o94j239
8695A89209p030l758N076J299l646m400n638r024p638j1162j2925o973O71K710
8681A26771l54J168N30P81M442N011P85L12m282j483L87J112J675N466Q799N220
8665A56340P21l436j487l41m7K338Q38j065L554O229J241J869K865n63j720j881
$$ plain form
8762 277437 286953 303251 320851 335812 337768 326272 302233 274954 250117 236434 232877 234868
8750 234868 245965 258431 266002 279099 292418 294502 275335 242585 208424 186109 168730 148137
8738 148137 128481 112120 105473 106043 111310 118132 125958 133704 139154 146335 153629 164219 169551 170369
8724 170369 171072 166858 160545 158215 156336 160298 169561 176113 178109 182916 188543 198968 203764 199777
8710 199777 196073 192652 183007 174503 172931 169970 170015 178428 183373 183893 189694 192665 191142 190448 189209
8695 189209 182179 178421 183497 184796 181150 176750 171112 162088 154450 143288 130363 123390 124061 126771
8681 126771 126417 127585 128115 128896 133338 138349 139134 139446 135164 133681 134068 135180 136855 142321 151120 156340
8665 156340 157061 153625 152138 151797 151750 154088 154926 153861 157415 163644 164885 166754 169619 169056 167336 165455
8649A65455L275m92k153j266k960m290p682l285L597N160Q813J2545J1581J7042
8635B05340J8188J6306Q780Q864J0577L39k7922o0381o6226n7462n3163m0812
8623c7572k4655r956N257J1720J5569J6728R454O485M670O838J1616R576L218
8610B8948L746P370M714M192L914J921M892O845P888N754N005P065Q698P238N023
8595A13213N400L956N514K950M858N345J774J663N035N601M209N207L081Q368
8581A76174J2779K1552L5067N5261Q7391J48296K80471M60459L29355q6232k07718
8570A312855k34442k73922k32365j54300r7317o0857l7479k6106k0022n897l830
8559A66318k54K156M920P417R011O574M052K664K300L352O569N409J2155J7558
$$ plain form
8649 165455 168730 168238 166085 164819 161859 157569 149887 146602 150199 155359 164172 176717 188298 205340
8635 205340 223528 239834 248614 257478 268055 268394 240472 180091 113865 56403 3240 -37572
8623 -37572 -62227 -72183 -66926 -55206 -39637 -22909 -13455 -6970 -2300 4538 16154 25730 28948
8610 28948 32694 40064 44778 48970 52884 54805 59697 66542 74430 80184 85189 92254 100952 108190 113213
8595 113213 118613 122569 128083 131033 135891 141236 143010 144673 149708 155309 159518 164725 167806 176174
8581 176174 188953 210505 245572 300833 388224 536520 816991 1277450 1606805 1520573 1312855
8570 1312855 1078413 804491 572126 417826 320509 259652 222173 196067 176045 170148 166318
8559 166318 166064 168220 173140 180557 189568 196142 200194 202858 205158 208510 215079 220488 232643 250201
8545B50201K1285K2130L0649L6230M0249N6556P6054J04545J36955J76800K24879
8534A176533K65083L01318L51675M91973Q00241Q51910m5765n48067n98264p06162
8524B340475o61252m72457l17277k06855j38072r4162o6370m9060l6782l1236
8514B66952k2874j4474j0386j4019j4379j4191j0646r289p544r376o429l815o839
8501A22691m225l384m100j431K913J1999J1549R094J4949J9939K8173M2704N5315
8488C06186Q4955J55165K92469M47956K64146j15405k05374k43520k69931k12921
8478E03726j34790q6211n2109l1671k1558j8843j7255j0541o759q227o394m537
8466A04831o196p974n941m568o379o099k838n095j394K420r10M39Q71K68n98k396
$$ plain form
8545 250201 271486 293616 324265 360495 400744 457300 533354 637899 774854 951654 1176533
8534 1176533 1441616 1742934 2094609 2586582 3386823 4238733 4192968 3644901 3046637 2340475
8524 2340475 1679223 1206766 889489 682634 544562 450400 384030 334970 298188 266952
8514 266952 244078 229604 219218 205199 190820 176629 165983 156694 149150 139774 133345 129530 122691
8501 122691 118466 115082 110982 109551 112464 124463 136012 145106 160055 179994 208167 250871 306186
8488 306186 391141 546306 838775 1286731 1550877 1435472 1230098 986578 716647 503726
8478 503726 368936 282725 230616 198945 177387 158544 141289 130748 123989 115762 109368 104831
8466 104831 98635 90661 84720 80152 73773 67674 64836 59741 58347 60767 59857 60296 61167 61435 60837 58441
8450E8441l347l787j027Q1n19L31m35L174M961O87j539M276M472K028q82L418
8434G0333Q61P81j247n694l302l31j247j301k424n322k593k307J162L114O1j398
8418D9146l73j359n68k601m728k33j488K90J153q19k859K353N237J51J170J091
8402D5563N7Q56K643P17L418K663R16L672K769q00J33l794p734n005j870k101
8386D2103j285K949J346j033m653P4L158l416j492J521m16l929l207J975L977
8371C7672P12k113r05k458q94j594j593K930K158O78k424l354k224K236K170M32
8355C1429M20P572K821j95J131J321N70l300l856j502Q57J045p55l679m75j367
8339C2037j630l52K762L774l608p981m371l117K506K601O63j225J188K425J522
$$ plain form
8450 58441 55094 51307 50280 50361 49842 50173 49738 52912 57873 58560 57021 61297 65769 67797 66915 70333
8434 70333 71194 71975 70728 65034 61732 61401 60154 58853 56429 51107 48514 46207 47369 50483 50544 49146
8418 49146 48773 47414 46846 44245 39517 39284 37796 38086 39239 38420 35561 37914 43151 43302 44472 45563
8402 45563 45620 46476 49119 49836 53254 55917 56833 60505 63274 62474 62607 58813 51079 46074 44204 42103
8386 42103 40818 43767 45113 44080 39427 39501 42659 39243 37751 39272 38856 34927 31720 33695 37672
8371 37672 38384 36271 35366 32908 32014 30420 28827 31757 33915 34593 32169 28815 26591 28827 30997 31429
8355 31429 31849 39421 42242 42047 43178 44499 45069 41769 37913 36411 37268 38313 37558 33879 33404 32037
8339 32037 30407 30055 32817 36591 32983 25002 20631 17514 20020 22621 23284 22059 23247 25672 27194
8324B7194j001J80p4j73J055L48K946J312K66l310k135l6j00J017q08m77J276
8307B7480j438l35o56j154J10J508J146K005o7j413QJ356o97k634r5L289J118
8290B9531R93k481r42m18j210Q27J459N38m093k921j506j364K027J782j994j593
8274A8635L926O6k93K319l81j666K007J566p51l065J7J874k948l550p30R57r31
8257A7052M08k42j49N401K121p78M779j6j767J537j135P04R81j416J373j622k131
8240B5100J2l325k019J191M282M4q95m278l251n89J20j262J474N88K794Q73K130
8223B2989R677L341j71j497J30N786N393M018R8j488j891m10l928j908k343l675
8207C4121j485j841l982k73K288j730j333q58k417l096P31K356L041M053L240
$$ plain form
8324 27194 26193 26373 26299 26126 27181 27529 30475 31787 32053 28743 26608 26572 26472 27489 26681 26204 27480
8307 27480 26042 25707 25051 23897 24007 25515 26661 28666 28599 27186 27194 28550 27853 25219 25124 28413 29531
8290 29531 30524 28043 27101 26683 25473 26300 27759 28297 24204 21283 19777 18413 20440 22222 20228 18635
8274 18635 22561 22627 22334 24653 24272 22606 24613 26179 25428 22363 22380 24254 21306 17756 17026 17983 17052
8257 17052 17460 17218 17069 22470 24591 23813 28592 28576 26809 28346 27211 27915 28896 27480 28853 27231 25100
8240 25100 25112 21787 19768 20959 25241 25285 24390 20112 16861 16272 16392 15130 16604 17192 19986 20859 22989
8223 22989 32666 36007 35836 34339 34469 40255 45648 49666 49764 48276 46385 45975 42047 40139 37796 34121
8207 34121 32636 30795 26813 26540 28828 27098 25765 24907 22490 19394 20125 22481 25522 29575 32815
8192C2815j342j546N94Q10l069o65L106l941M30L583K205N278K768M511K937j292
8176D7182K528O069R331P776N653L187p44j561m673l985o340n739n529l686j702
8161D7767m825j921J36k620l535k638k99J463m035k106j99K033r12J147J731M177
8145C5364M464J060j058L256Q699Q878J747J020j458m593l147k698p57j049N699
8130E5427Q337Q013M134O0L5l091n322m460l840o532p560j937J162L05n199j402
8114C8130J104O88J850J498k93J292L451K734N408K664m095m562m768Q75p14o30
8098D4632M062M041K033Q86R4p694r758J403N148K763m180k356J118M706k161
8083D4737l527n6j937k21j074j167J394R26q91j032J7j033n68r99l03M954K172
$$ plain form
8192 32815 31473 29927 30521 31331 28262 27597 30703 26762 27192 30775 32980 38258 41026 45537 48474 47182
8176 47182 49710 55779 65110 72886 78539 81726 80982 79421 74748 70763 64423 58684 53155 49469 47767
8161 47767 42942 41021 41157 38537 35002 32364 32065 33528 29493 27387 27188 29221 28309 29456 31187 35364
8145 35364 39828 40888 39830 43086 51785 60663 62410 63430 61972 57379 54232 51534 50777 49728 55427
8130 55427 63764 71777 75911 75971 76006 72915 67593 63133 59293 52761 45201 43264 44426 44731 39532 38130
8114 38130 39234 39922 41772 43270 42977 44269 47720 50454 55862 58526 54431 49869 45101 45976 45262 44632
8098 44632 48694 52735 54768 55654 55748 48054 38296 39699 44847 47610 43430 41074 42192 46898 44737
8083 44737 41210 41154 39217 38996 37922 36755 38149 39075 38184 37152 37169 36136 35568 34569 34266 39220 41392
8066D1392J46L093L403P744N605o37l070m162o887l666k285k289k789j264j761
8051C2573l390j474q64K996q55K60K022J441L159K08n8M97J390J361K109J365
8035D2740M653P215K14l664o18j845j158l948j763k718O04k627R16k55j106j779
8019C4861j22k851j700R49J479ok983L307O379P741K480m238K441J528j313k514
8003D5438j259l809K848L877n45K225J240j013j83J869M4j587p35p11k005l19
7987D5375K19k838j983p12l014m201k723j064K594R58J35j111r69P22q98M57j78
7970C0769L979L487J777K564J409L01p58K2k564o56k692K416k307k003K333L45
7954C8422l179M67%k40J313m2j433l143j867k20J419k957k212J115j589j525L167
$$ plain form
8066 41392 41538 44631 48034 55778 61383 60746 57676 53514 46627 42961 40676 38387 35598 34334 32573
8051 32573 29183 27709 26845 29841 28986 29246 31268 32709 35868 36076 36018 36515 37905 39266 41375 42740
8035 42740 47393 54608 54822 51158 50540 48695 47537 43589 41826 39108 39712 37085 38001 37746 36640 34861
8019 34861 34739 31888 30188 31137 32616 32610 29627 32934 39313 47054 49534 45296 47737 49265 47952 45438
8003 45438 44179 40370 43218 47095 46550 48775 50015 49002 48819 50688 50732 49145 48410 47699 45694 45375
7987 45375 45594 42756 40773 40061 37047 32846 30123 29059 31653 32611 32746 31635 30666 31388 30490 30947 30769
7970 30769 34748 38235 40012 42576 43985 44286 43528 43550 40986 40330 37638 40054 37747 35744 38077 38422
7954 38422 35243 35710 35710 35470 36783 36741 35308 32165 30298 30078 31497 28540 26328 27443 25854 24329 27496
7937B7496L56R22j391j079O1J029q54J802O610J005J306J058m593j638l83l555
7921B8152k299k123L40k229k690M77L800J290n68m341j569j64M71m47J764j928
7905A7936j917J429M404Q81k254o2k80j53P3J353Q06J988J487K366k833l550q43
7888B0831j700K7K254M73m448l286m01j462k065K732m19j130K872L454O96p53
7872A7675j444k013n97j169J219K085L58j135J65l73J043j695l851P14K718l377
7856A0323j99M794Q03j929l975P59Q63j640j958k166j681M429M175J701j350J996
7840A4945L56L41m50k437n214o21L065k098k455O52L263R45m241l756M11L871
7824F577K308P47k084R79j035k798j682J180J197J551J424K698m21m274L76L632
$$ plain form
7937 27496 27852 28774 27383 26304 26365 27394 26540 28342 34952 35957 37263 38321 33728 32090 31707 28152
7921 28152 25853 23730 24070 21841 19151 19628 23428 24718 24150 19809 18240 18076 18547 18100 19864 17936
7905 17936 16019 17448 21852 22733 20479 20417 20137 19984 20057 21410 22216 24204 25691 28057 25224 21674 20831
7888 20831 19131 19158 21412 21885 17437 14151 13750 12288 10223 12955 12536 11406 14278 17732 18428 17675
7872 17675 16231 14218 13621 12452 13671 15756 16114 14979 15144 14771 15814 14119 10268 10982 13700 10323
7856 10323 10124 14918 15721 13792 9817 10576 11439 9799 7841 5675 3994 8423 12598 14299 12949 14945
7840 14945 15301 15642 15192 12755 7541 6920 9985 7887 5432 6084 9347 10292 6051 2295 2706 6577
7824 6577 8885 9632 7548 8527 7492 4694 3012 4192 5389 6940 8364 11062 10641 6367 6743 10375
7808A0375k315k857k237l32L534L301J342Q38m19N19k656j540l254j476j268k381
7792h26M719R35k69K715k238j374J778K637L070k174q3J060k817k915Q01o13j761
7775B645l206J995J958j822J8J225J067N72j216K337Q41l01j468J389j149k997
7759A888j116L530K726J201P30k894p84q68J927J289J80j000j414k834L512J697
7743G770r03q15j049j989L462P37o51l856P04K806J549p02n8j125K272K847K629
7726A3628l77n570j468r11M797J776j989q37j939j834K088R51K499L201k448r52
7710A0615k95k938k132K236L568M494K102l365n869k659m300k556J012M22o60
7695c25J45K394j183k98Q69j608j739j000J031r43j239K910K963j597K204M592
$$ plain form
7808 10375 8060 5203 2966 2634 6168 9469 10811 11649 11230 11749 9093 7553 4299 2823 1555 -826
7792 -826 3893 4828 4559 7274 5036 3662 5440 8077 11147 8973 8890 9950 7133 4218 5019 4406 2645
7775 2645 -561 1434 3392 1570 1588 2813 3880 4452 3236 5573 6414 6113 4645 6034 4885 1888
7759 1888 772 4302 7028 8229 8959 6065 5281 4413 6340 7629 7809 6809 5395 2561 6073 7770
7743 7770 6867 6052 5003 3014 6476 7213 6562 2706 3410 6216 7765 7063 7005 5880 8152 10999 13628
7726 13628 13251 7681 6213 5302 10099 11875 9886 9049 7110 5276 7364 8315 10814 14015 11567 10615
7710 10615 10320 7382 5250 7486 11054 15548 17650 14285 8416 5757 1457 -1099 -87 335 -325
7695 -325 -180 2214 1031 733 1602 -6 -1745 -2745 -1714 -2657 -3896 -986 1977 380 2584 7176
7679G176q58L86J329j953k018l214j769L783N43J031N715Q15j330m180m140l209
7663a893j191L041J218K558j088k221K644Q394R81l858k551k162k08J657L539
7648H860Q00j751k54K448k479J010o78k100j301K891j15k164l011J259N54n09
7632C460j153N63l129l247q96k42L495J058M514P32k05l374k665p50j540R28J205
7615a246N1q02j639K195J891l28K824K75l286J852J350j847J523R02l05J703L847
7598H960k632k571n561k980J291J235k07l799q65K834J167K247J08Q3K815J157
7582C282J887j414j819k833K025R74J66N130M061j849l454q731l251L259L501
7567I34k039K396K560j442j339K502K295J484k770M5k66j411m072o10j252K680
$$ plain form
7679 7176 6318 6704 8033 6080 4062 848 -921 2862 3405 4436 10151 10966 9636 5456 1316 -1893
7663 -1893 -3084 -43 1175 3733 2645 424 3068 11462 12443 8585 6034 3872 3664 5321 8860
7648 8860 9660 7909 7655 10103 7624 8634 7956 5856 4555 7446 7331 5167 2156 3415 3969 3460
7632 3460 2307 2870 -259 -3506 -4402 -4644 -1149 -91 4423 5155 4950 1576 -1089 -1839 -3379 -2451 -1246
7615 -1246 -1195 -1997 -3636 -1441 450 122 2946 3221 -65 1787 3137 1290 2813 3715 3410 5113 8960
7598 8960 6328 3757 -1804 -4784 -3493 -2258 -2465 -6264 -7129 -4295 -3128 -881 -773 -690 2125 3282
7582 3282 5169 3755 1936 -897 1128 2102 2268 7398 11459 9610 6156 -2575 -5826 -2567 934
7567 934 -1105 1291 3851 2409 1070 3572 5867 7351 4581 4626 4360 2949 -1123 -1733 -2985 -305
7551c05N135k961l371p36K870q08n8j571k987n54k0L317N156J598L80j578j647
7534A860k455K020J627q92K54L35J153K245n56k702k455j711M121K883k893l651
7518h17k629J873M185q64J584M643j157r05n713k984j554l01K123O61j769K426
7502a198K730j817L043L001k206j657p31j561l060l471K62oL268M068J580l220
7486i75j308J847K211k000K771m79j582P41j060k764l60L134K396M96j63j570
7470A335o59p87j244k987J16P76J869J672k16O33L462J074m312o57J569N59P62
7453B965m644k034J803j152j46O58K12L273M643j037m402J266J851j700j606q50
7437i00K70j498K308j419k257Q27J040J949j034k725P82J336j917m55J290L872
$$ plain form
7551 -305 4830 1869 -1502 -2238 632 -176 -234 -1805 -4792 -5346 -5366 -2049 3107 4705 5085 3507 1860
7534 1860 -595 1425 3052 2160 2414 2749 3902 6147 5591 2889 434 -1277 2844 5727 2834 -817
7518 -817 -3446 -1573 2612 1748 3332 7975 6818 5913 200 -2784 -4338 -4639 -2516 -1855 -3624 -1198
7502 -1198 1532 -285 2758 5759 3553 1896 1165 -396 -3456 -6927 -6665 -6671 -3403 665 2245 -975
7486 -975 -2283 -436 1775 -225 2546 2067 485 1226 166 -2598 -2958 176 2572 3068 2905 1335
7470 1335 676 -111 -1355 -4342 -4226 -3450 -1581 91 -125 508 3970 5044 732 75 1644 2203 2965
7453 2965 -1679 -3713 -1910 -3062 -3208 -2550 -2338 935 5578 4541 139 1405 3256 1556 -50 -900
7437 -900 -630 -2128 180 -1239 -3496 -2669 -1629 320 -714 -3439 -2657 -1321 -3238 -3693 -2403 1469
7421A469j087j021L679L686k863k659r70r02j512K049L670q41M66P79N04K234
7405F681j366j840l031l299K711J603m384j788L287J278k468J104R37M608K39
7390D272j780k871L39J109j99k302j21K509k479J023k52j431J802K294j8k295
7374d00n11j288k476j290J490K193K352J05j287j255n28J005M676L70J228N528
7358I912l193n851q99o73J893n47K332O68O43P90k633k264M17J759j104k446j088
7341b284P05J825Q34J422l92k647J048n98k014Q28o29j168j25J196N17q66R8k380
7323d630K465j897N03N74J98L39J484j74N0j236J565K801l173r14N24J560Q78
7306I17N79J543J511l388j811J244K35M84K388j576j016k207J202K037J538j502
$$ plain form
7421 1469 382 -639 3040 6726 3863 1204 234 -668 -2180 -131 3539 2698 3164 3943 4447 6681
7405 6681 5315 3475 444 -2855 -144 1459 -2925 -4713 -1426 -148 -2616 -1512 -575 4033 4272
7390 4272 2492 -379 -40 1069 870 -1432 -1553 956 -1523 -500 -752 -2183 -381 1913 1895 -400
7374 -400 -911 -2199 -4675 -5965 -4475 -2282 70 175 -1112 -2367 -2895 -1890 2786 3156 4384 9912
7358 9912 6719 868 -31 -704 1189 642 2974 3642 4285 5075 2442 178 595 2354 1250 -1196 -2284
7341 -2284 -1579 246 1080 2502 2110 -537 511 -87 -2101 -1273 -1902 -3070 -3195 -1999 -1482 -2348 -2250 -4630
7323 -4630 -2165 -4062 -3559 -2985 -2787 -2448 -964 -1138 -1088 -2324 -759 2042 -1131 -2045 -1521 39 917
7306 917 1496 3039 4550 1162 -649 595 830 1314 3702 2126 1110 -1097 105 2142 3680 2178
7290B178j000K071m53K014m60l187J793K276l587m614j500J339L099P57L53r9
7274I80n11L176L85n81n604n86K012j024J175n50K187j3J765J760k48j824k191
7257C08j797J36p49n174M68K489L043L558m37J571j402p08j974K143K227J859
7241E561Q0k128r62j861m81j167J237l20l095m634j22K269L758L026k73J612J569
7224D069k902m091J344L273R7L73J685l290l496J538P24k277m295Q04L719J883
7208h42j347j476K793K883J690j986k910k544M267K555Q97K4j816k444J076j605
7192g85J060K736L78o89l816O72J569Lj502k320L32L127L439m01j194p37K98O11
7174B781l387K83M32K448r24k543R87L495K769q21q43j4l74j378j742k356J895
$$ plain form
7290 2178 1178 3249 2796 4810 4350 1163 2956 5232 1645 -2969 -4469 -3130 -31 726 1079 980
7274 980 469 3645 4030 3449 -2155 -2741 -729 -1753 -578 -1128 1059 1046 2811 4571 4323 2499 308
7257 308 -1489 -1353 -2102 -7276 -6808 -4319 -1276 2282 1845 3416 2014 1306 -668 1475 3702 5561
7241 5561 5641 3513 2551 690 209 -958 279 -41 -3136 -7770 -7892 -5623 -1865 1161 888 2500 4069
7224 4069 1167 -2924 -1580 1693 1790 2163 3848 558 -2938 -1400 -676 -2953 -7248 -6444 -2725 -842
7208 -842 -2189 -3665 -872 2011 3701 1715 -1195 -3739 528 3083 3980 4004 2188 -256 820 -785
7192 -785 275 3011 3389 2700 -1116 -444 1125 1128 -374 -2694 -2362 765 4204 3803 2609 1872 2170 2781
7174 2781 -606 -323 109 2557 1633 -910 77 3572 6341 5520 4677 4663 4289 2911 1169 -1187 708
7157G08R91l124j9k283L59N14q40J518K182k631O31K993J300J610k405k945l264
7140d705K588L71L297j417j907O44K258m72J513j115p17K308j366l904p92J562
7124a854K652l62j37J340k33j801L71J598j854m902j045K324K143K237l02j280
7108a105l164M16K65M565K117l35J13l751k573r1L342J720q48J904K453l99k208
7091B421l792J645Q71l210j646N84J913k754n75K207L42l729P76M347j582J386
7075g96K826j16j739j694j6J958o94j557j971J957K085J209k13j212p20K209K536
7058D052k65n50k55P67j659j005o17j104k439k35M54K96j061L158L434k125j741
7041h95J604r14J606k013J715J503n64l023O69K625q00K465J988j641k384q73
$$ plain form
7157 708 1699 -1425 -1444 -3727 -3368 -2854 -3694 -2176 6 -2625 -1994 999 2299 3909 1504 -1441 -4705
7140 -4705 -2117 -1746 1551 134 -1773 -1129 1129 657 2170 1055 338 2646 1280 -2624 -3416 -1854
7124 -1854 798 436 299 1639 1406 -395 -24 1574 -280 -5182 -6227 -3903 -1760 477 175 -1105
7108 -1105 -4269 -3853 -3588 977 3094 2759 2872 -879 -3452 -3543 -201 1519 671 2575 5028 4629 2421
7091 2421 -1371 274 1145 -2065 -3711 -3127 -1214 -3968 -4543 -2336 -1994 -5723 -4947 -600 -2182 -796
7075 -796 2030 1914 175 -1519 -1535 423 -271 -1828 -3799 -1842 243 1452 1239 27 -693 1516 4052
7058 4052 3787 3237 2982 3749 2090 1085 468 -636 -3075 -3310 -2856 -2560 -3621 -463 2971 846 -895
7041 -895 709 -205 1401 -612 1103 2606 2042 -981 -312 2313 1513 3978 5966 4325 1941 1068
7025A068m03L65p69L061m15l512k911k974l417K289O33M90J757N61J253j106j535
7008e565Q64M061R7k99k352J248J508j673j301j332j834j343P484L325m389j745
6992c246K231L57L8j494N65n90j445J962r94k196j671j13K16n77o52O71J93j208
6974g953N469J864P19J521k301m59J819j850j187L461K352J750J260j599o142
6959a276m865k703j234R69O453K556L153O16K58j411k438J286k020K753J034l764
6943f33k516J037M532K156j914L46L86k163r9K85j97j525m257J35O63m82l296
6926g542k68R62K401L297J009K383k74r75j520j744J650K293P35R50k070J636
6910B923K608j738m691j915L289M393M13l396K95k606n042m7J211k855K477M028
$$ plain form
7025 1068 665 1030 261 3322 2907 -605 -3516 -6490 -9907 -7618 -6985 -6495 -4738 -4177 -2924 -4030 -5565
7008 -5565 -4701 -640 -543 -842 -3194 -1946 -438 -2111 -3412 -4744 -6578 -7921 -437 2888 -1501 -3246
6992 -3246 -1015 -658 -620 -2114 -1549 -2139 -3584 -1622 -2616 -4812 -6483 -6596 -6380 -6957 -7609 -6938 -6745 -7953
6974 -7953 -2484 -620 99 1620 -681 -1140 679 -1171 -2358 1103 3455 5205 6465 4866 -1276
6959 -1276 -6141 -8844 -10078 -9109 -2656 -100 3053 3669 3927 2516 78 1364 -656 2097 3131 -633
6943 -633 -3149 -2112 2420 4576 2662 3008 3394 1231 1132 1417 1220 -305 -4562 -4427 -3764 -4246 -7542
6926 -7542 -7810 -6848 -4447 -1150 -141 2242 1968 993 -527 -2271 -621 1672 2407 3357 1287 2923
6910 2923 5531 3793 -898 -2813 476 4869 5282 1886 2181 -425 -5467 -5514 -4303 -7158 -4681 -653
6894f53l52o27L421l395j111p22K110k092k562k862J410J913o91L40L142j22Q33
6877b020J442k833j413L261K407K586j341k415l117J77Q15J436J162J186K219
6862C552j137m069k205J872P89L441J111n75R96J360K73k708m074j149J286K40
6846i97k68m425J008L517K478p11j472p66k356M02L001J0J436l21Q65M082k907
6829B576o11J331j281K085M586j441o561j744L249j147L124R47J62N90l013m75
6813B377O90M954N221O084L148n638k685p79N31k555k287l223j231M964j51l054
6797F366k96J548k206j973k503j075K462J341n88k620J407J424J022j293l90j288
6781A338K5l49J519o86r35K542L330n26j869N28j012L949j79q92K487J362O67
$$ plain form
6894 -653 -1005 -1632 1789 -1606 -2717 -3439 -1329 -3421 -5983 -8845 -7435 -5522 -6213 -5873 -2731 -2853 -2020
6877 -2020 -578 -3411 -4824 -1563 844 3430 2089 -326 -3443 -3266 -2451 -1015 147 1333 3552
6862 3552 2415 -1654 -3859 -1987 -1198 2243 3354 2779 3775 5135 5408 2700 -1374 -2523 -1237 -997
6846 -997 -1265 -5690 -4682 -1165 1313 602 -870 -1636 -3992 -3590 -589 -579 857 536 1401 5483 2576
6829 2576 1965 3296 2015 4100 8686 7245 684 -1060 2189 1042 4166 5113 5275 5865 2852 2377
6813 2377 3067 8021 13242 19326 22474 16836 14151 13372 13903 11348 9061 5838 4607 9571 9420 6366
6797 6366 6070 7618 5412 3439 936 -139 2323 3664 3076 456 1863 3287 4309 3016 2626 1338
6781 1338 1363 1014 2533 1847 912 3454 6784 6258 4389 4917 3905 7854 7675 6783 9270 10632 11299
6764A1299j763L515L750l96J878K150K74m490j401j361j01K155K182L945K154
6749B3790M414N006M109J019j296L765R799J1308P970P977O326R083J4853M845
6735A12968m053k501K030J0998Q536J192M640J0885K0176K7870L0249J5733p795
6722B30928k9671l5975l5932l6974k9161j8820j0945q221m210p07m664m001K265
6709A3912J76j394j721l889l50n50L36N042J675j185m092m305J56L910J077o8
6693H730N88k370l677j793k784o68O13r2J934K941J398j179k360J241k41j667
6677F14k562L277L017j151p05j453j894K36k433o03k50l206L471L624J034R32
6661A948O72J461j165o01k833j267j166L81L54J555P35K388j668l526J201J441
$$ plain form
6764 11299 9536 13051 16801 16405 18283 20433 20707 16217 14816 13455 13354 15509 17691 21636 23790
6749 23790 28204 33210 37319 38338 37042 40807 50606 61914 69884 77861 84187 93270 108123 112968
6735 112968 108915 106414 108444 119442 127978 129170 133810 144695 164871 192741 222990 238723 230928
6722 230928 201257 165282 129350 92376 63215 44395 33450 25229 21019 20312 15648 11647 13912
6709 13912 14088 12694 10973 7084 6734 6184 6520 11562 13237 12052 7960 3655 3811 7721 8798 8730
6693 8730 9318 6948 3271 1478 -1306 -1974 -1361 -1453 481 3422 4820 3641 1281 2522 2281 614
6677 614 -1948 1329 4346 3195 2490 1037 -857 -621 -3054 -3657 -3907 -7113 -3642 -18 1016 1948
6661 1948 2620 4081 2916 2315 -518 -1785 -2951 -2570 -2216 -661 74 2462 794 -2732 -1531 -90
6645i0J745k691k167r64N34R58J932j723j089J895J03j447J993J377N6l160M5
6628b693j220j007J320k794R58K846K471O85j28k218k308J3j313J395K714J692
6612D13J261j697j793M034j657j99Q27j700j152q21K162J047L05j708r02L979
6596B399l499k768r66m33L276M948P02j886J537N25k963m12R45l2n161k5Q55j808
6578d766J296O92J225O06M188N85n65J534J728m027j980n71p13J598R88q75R93
6561A936l229j270m377j890Q19L598M582N63j565K29P90j224J137J533k744l208
6545d320j157J676N006Q83k256l272m046k85M032J691L44q68j496j126m659l861
6529a3714M109N862L554Q23L453k7l770O05L662N397K766L03m846l839l99K487
$$ plain form
6645 -90 1655 -1036 -3203 -4167 -3633 -2675 -743 -2466 -3555 -1660 -1557 -3004 -1011 366 422 -2738 -2693
6628 -2693 -3913 -4920 -3600 -6394 -5436 -2590 -119 566 438 -1780 -4088 -4075 -5388 -3993 -1279 413
6612 413 1674 -23 -1816 2218 561 362 1189 -511 -1663 -2484 -322 725 1030 -678 -1580 2399
6596 2399 -1100 -3868 -4834 -5267 -1991 2957 3659 1773 3310 3835 872 460 1405 1373 -3788 -3813 -2958 -4766
6578 -4766 -3470 -2778 -1553 -947 3241 3826 3261 4795 6523 2496 516 -55 -768 830 1818 943 1936
6561 1936 -1293 -2563 -6940 -8830 -8011 -4413 169 732 -833 -604 186 -1038 99 1632 -1112 -4320
6545 -4320 -5477 -3801 1205 2088 -168 -3440 -7486 -7771 -3739 -2048 -1704 -2572 -4068 -5194 -9853 -13714
6529 -13714 -9605 -3743 -189 634 4087 4060 290 895 4557 9954 12720 13023 8177 4338 3939 6426
6513F426J381j426m221k448n31j090M51M106m38p31q34P8l595m620m78K513R53
6496d504j51q54J551M522K072j690j882m5M51K524J835l450l569Q83O34r5j647
6479c415K200L493L70N81j647l923k882J327J236k725n65N14M493J272M83k689
6463a877j526N833o94j077J05j496J218k007l907M96k259L129J551m335n145K512
6447i479M197L253m068j895J481p34K41M89J504J229M61j766P79K120j571k496
6431f255R96L853J888k11j662r16o75q40o93O33L243K735q72k636k563N14K503
6414i58k491j965l322K091N39l4k437j153J749L511M144K876p13n99j759l941
6398d462P60K454P37j661J749j410k686j344j660L01L406L104o18K12J074J715
$$ plain form
6513 6426 7807 6381 2160 -288 -819 -1909 -1458 2648 2210 1479 645 723 -2872 -7492 -7970 -5457 -4504
6496 -4504 -4655 -5509 -3958 564 2636 946 -936 -981 -530 1994 3829 379 -3190 -2307 -1673 -1768 -3415
6479 -3415 -1215 2278 2648 3229 1582 -2341 -5223 -3896 -2660 -5385 -5950 -5436 -943 329 812 -1877
6463 -1877 -3403 2430 1736 659 764 -732 486 -1521 -5428 -4932 -7191 -4062 -2511 -6846 -11991 -9479
6447 -9479 -5282 -2029 -6097 -7992 -6511 -7245 -7004 -6515 -5011 -3782 -3321 -5087 -4308 -2188 -3759 -6255
6431 -6255 -5259 -1406 482 271 -1391 -2307 -2982 -3822 -4515 -3882 -639 2096 1224 -1412 -3975 -3461 -958
6414 -958 -3449 -5414 -8736 -6645 -6106 -6140 -8577 -9730 -7981 -4470 -326 2550 1837 1238 -521 -4462
6398 -4462 -3702 -1248 -511 -2172 -423 -1833 -4519 -5863 -7523 -7222 -3816 -712 -1330 -1118 -44 1671
6382A671o79k347o27J9j729k174j326J216K620M746K065l526Q61M24K097K025
6366E336k660L49J16l576l377k28k25J446M404J347k133m931J552K447K013j009
6350H71m126l40p01m2K332K462p78j821N119M46J41N22p23R67l883k943J508j298
6332b287p16N05J296K84K903J426m33l498j954J140K863J860j734J908N21q20
6316C264j894l654k887M16K770p47r80K996j086l083J382M325j892k47K230j006
6300i3j891m527j908J504M093M36J433M261j160j768k977j903Q34J589M67N90
6284a020pp47R64k729r78J827J096j545j462J600p95j46p88L621L576k453k191
6267b177J089J28N02O03j838k602j122K561K887N61l031j413J55o9J727K486K639
$$ plain form
6382 1671 992 -1355 -1982 -1963 -3692 -5866 -7192 -5976 -3356 1390 3455 -71 790 1214 3311 5336
6366 5336 2676 3025 3141 -435 -3812 -4040 -4265 -2819 1585 2932 799 -4132 -2580 -133 1880 871
6350 871 -3255 -3595 -4296 -4338 -2006 456 -322 -2143 2976 3422 3563 4085 3362 4329 446 -2497 -989 -2287
6332 -2287 -3003 -2498 -1202 -918 1985 3411 2978 -520 -2474 -1334 1529 3389 1655 3563 4084 3264
6316 3264 1370 -2284 -5171 -4755 -1985 -2732 -3712 -716 -1802 -4885 -3503 822 -1070 -1317 913 -93
6300 -93 -1984 -6511 -8419 -6915 -2822 -2386 -953 3308 2148 380 -2597 -4500 -3666 -2077 -1610 -1020
6284 -1020 -1027 -1774 -810 -3539 -4517 -2690 -1594 -3139 -4601 -3001 -3796 -3942 -4730 -1109 2467 14 -2177
6267 -2177 -1088 -960 -458 145 -1693 -4295 -5417 -2856 31 592 -2439 -3852 -3697 -3766 -2039 447 3086
6250C086J421m496l32N005k261m993j661M99J774L072K332n80m929k836K15J183
6234c501j910O74J294O23M537k145l534M24j239p18j508N031O9q33J079k3j266
6217b946J682k047j523K05N36K70M453R16k416j680j3L43L58p35j33P70J324R59
6199C23J458L90l046k20j590O02j019k561O21J112K004l82K024r53K201p05K399
6182B658J58l318j021Q80k813N99K79K286K144J2j197j743J672J542k318k095
6166b275K177j170n33Q02K298k337j364L017k804m46k807J897k15j803K101J540
6150a922J068j545l90q47K472L090L451K395n547l348J972k240k626J625n18l085
6134e995N5o39R60N243K206k334j761l037J101N86L52k6J60K894k603k427J861
$$ plain form
6250 3086 4507 11 -321 4684 2423 -2570 -4231 -3732 -1958 1114 3446 2866 -2063 -4899 -4684 -3501
6234 -3501 -5411 -4737 -3443 -2820 1717 -428 -3962 -3538 -4777 -5495 -7003 -1972 -1903 -2736 -1657 -1680 -2946
6217 -2946 -1264 -3311 -4834 -4629 -4093 -3823 630 1546 -870 -2550 -2563 -2220 -1862 -2597 -2730 -1960 -636 323
6199 323 1781 2171 -875 -1095 -2685 -2083 -3102 -5663 -5042 -3930 -1926 -2308 -284 -1237 964 259 2658
6182 2658 2816 -502 -1523 -643 -3456 -2857 -2578 -292 1852 1864 667 -1076 596 2138 -180 -2275
6166 -2275 -98 -1268 -1801 -999 1299 -1038 -2402 615 -2189 -2635 -5442 -3545 -3760 -5563 -3462 -1922
6150 -1922 -854 -2399 -2789 -3636 -1164 1926 5377 7772 2225 -1123 849 -1391 -4017 -2392 -2910 -5995
6134 -5995 -5940 -6579 -5619 -376 1830 -504 -2265 -5302 -4201 -3615 -3263 -3289 -3129 -235 -2838 -5265 -3404
6117c404M065J661N75k414k851q11k426J75L095K838j459m076K041K995J455J815
6101C274j874l568k494j4R08j37M710j04j847K45J225k82k695l228n17k66n31
6084g195L492O17j859l021j890J699L06K568L259k38j115o08o10N67K321R08J816
6067A017l87NK321j353l724j377k315M04K313K548q88L479k72r90j298k667J997
6050a187J261N233L97j744M34k429j410j230m03m05m298l53K285J249J334J005
6034b61m486n134j146L472K515QM368K171o72m68k799r48r65M01M700R38j061
6017F33k865m65M75P55O45P41O55j304n60L7M33k605K190M96P5o54k152r04k545
5998f919r99K16K679Q15N632J440k392k067K080R08l696j148l387M97j013r96
$$ plain form
6117 -3404 661 2322 2897 483 -2368 -3179 -5605 -5430 -2335 503 -956 -5032 -2991 4 1459 3274
6101 3274 1400 -2168 -4662 -4676 -3768 -3905 805 701 -1146 -901 324 42 -2653 -5881 -6398 -6664 -7195
6084 -7195 -3703 -3086 -4945 -7966 -9856 -8157 -7851 -5283 -2024 -2262 -3377 -3985 -4595 -4028 -1707 -799 1017
6067 1017 630 635 2956 1603 -2121 -3498 -5813 -5409 -3096 -548 -1436 2043 1771 781 -517 -3184 -1187
6050 -1187 74 5307 5704 3960 4394 1965 555 -675 -1078 -1483 -5781 -6134 -3849 -2600 -1266 -261
6034 -261 -4747 -9881 -11027 -7555 -5040 -5032 -664 1507 835 367 -2432 -3380 -4345 -3944 756 1694 633
6017 633 -2232 -2697 -2222 -1467 -822 -81 574 -730 -1290 -1253 -820 -3425 -1235 -739 -664 -1318 -3470 -4374 -6919
5998 -6919 -7918 -7702 -5023 -4208 1424 2864 472 -1595 485 1393 -2303 -3451 -6838 -6341 -7354 -8350
5982h350J384J938J122K31j298M755L558M38n12j064j811L1l72l016O77J284j712
5965b717R09J120L547J944j244k271L68J642o94m978q37J289P64q08m821r41L21
5948g407k113j243J813L098J142o09j255j680j07K277J104j826l429j823R95L08
5932a0755R78J85K724K614J158o85J11M735k349n917K178Q00j468K698K954k089
5916b128j465m16k99M85J459K483j293k997K62n79J46L550K859M41l239j712J593
5899h50j027j070k80J157K539J036o20J457K32m82r82k05l14q16j066R1K381L335
5881D516J18J143k302k796n39K44J226O95j764k038L58n26l869P07K532K305m82
5864d72o60k514j683K993M177L414j359r63j709Q7j799k048r82j125j061J763
$$ plain form
5982 -8350 -6966 -5028 -3906 -3675 -4973 -218 3340 3778 3266 2202 391 422 50 -2966 -2289 -1005 -2717
5965 -2717 -1808 -688 2859 4803 3559 1288 1656 3298 2604 -2374 -3211 -1922 -1158 -1966 -6787 -7728 -7407
5948 -7407 -9520 -10763 -8950 -5852 -4710 -5319 -6574 -8254 -8361 -6084 -4980 -6806 -10235 -12058 -11063 -10755
5932 -10755 -9777 -9592 -6868 -4254 -3096 -3781 -3670 1065 -1284 -7201 -5023 -4223 -5691 -2993 -39 -2128
5916 -2128 -3593 -4009 -4308 -3823 -2364 119 -1174 -4171 -3909 -4488 -4342 -792 2067 2508 -731 -2443 -850
5899 -850 -1877 -2947 -3227 -2070 469 1505 885 2342 2574 2092 1110 905 591 -225 -1291 -1200 1181 4516
5881 4516 4634 5777 3475 679 140 384 1610 2305 541 -1497 -1139 -1665 -5534 -4827 -2295 10 -472
5864 -472 -1132 -3646 -5329 -2336 1841 5255 3896 2933 1224 1311 -488 -2536 -3518 -4643 -5704 -3941
5848c941K725J376j166k568j862M306J558m89K150R17k555m481q87J608k555J134
5832d730N057L345J800l566k824l09N07k265k30k095K734N32J67J986J376L24
5816A809l195Q42L46j601k316k418M33K531j615J247j202k747L110M72J126K526
5800f52J066m95k606J381J039K811j900J37P97K677j403j074j824l14l88l923
5784d671j043J124Q11m58L665J090j773J772R63j741l706R58R73m38M593K043
5768D162J53k320k206m155j627j304J781L091q91j969J050j015l80L806q1q65
5752b770j996K066q71j057k85o62j88L053j157k796N170M341L382K639j096o548
5736A225l575j183K908j542l883P9J257P94k674j364K506L93P05P52r98M53k587
$$ plain form
5848 -3941 -1216 160 -1006 -3574 -5436 -1130 428 -61 2089 3006 451 -4030 -4917 -3309 -5864 -4730
5832 -4730 327 3672 5472 1906 -918 -1227 -720 -2985 -3215 -5310 -2576 -2044 -1877 109 1485 1809
5816 1809 -1386 -544 -198 -1799 -4115 -6533 -6100 -3569 -5184 -3937 -5139 -7886 -4776 -4304 -3178 -652
5800 -652 414 -81 -2687 -1306 -267 2544 644 781 1578 4255 2852 1778 -46 -360 -748 -4671
5784 -4671 -5714 -4590 -3779 -4237 -572 518 -1255 517 1480 -261 -3967 -3009 -2036 -2474 2119 4162
5768 4162 4315 1995 -211 -4366 -5993 -7297 -5516 -2425 -3316 -5285 -4235 -5250 -5630 -1824 -1905 -2770
5752 -2770 -4766 -2700 -3571 -4628 -4913 -5575 -5763 -2710 -3867 -6663 -1493 2848 6230 8869 7773 1225
5736 1225 -2350 -3533 -625 -2167 -6050 -5971 -4714 -3920 -6594 -7958 -5452 -5059 -4354 -3602 -4600 -4147 -6734
5719f734L359J715J94P09L11k092o748k146K869K192J254r91r49K821N03J571
5703b162J258j903l150l032M707K665J003k784J63q03n52J526Q02j128j146j40
5687d676j986P9K684J667j323j711K521J984J171K882j399qk25m68L775M39l931
5670A475J428J767k180l294j975J724k741k660J721M484J617k21k735l250k537
5655g377m580r10L797N666L506n79j031j714J738J319J044J595R46j688j475k546
5639b289N34J664j071l754K776M770K094K80m78j235j350j680L320R00k390k369
5623b78l057l637J648K198l883k66K523j772J939p56L62K161K136j572k037m93
5607d784K189n37q70Q61L285K450l142m542j632j81K489m96N054K465q79Q63J7
$$ plain form
5719 -6734 -3375 -1660 -1466 -757 -446 -2538 -9286 -11432 -8563 -6371 -5117 -6108 -7057 -4236 -3733 -2162
5703 -2162 -904 -2807 -5957 -8989 -4282 -1617 -614 -3398 -3235 -4038 -4590 -3064 -2262 -3390 -4536 -4676
5687 -4676 -6662 -6583 -3899 -2232 -3555 -5266 -2745 -761 410 3292 1893 1885 1660 1192 4967 5406 1475
5670 1475 2903 4670 2490 -804 -2779 -1055 -3796 -6456 -4735 -251 1366 1145 -1590 -4840 -7377
5655 -7377 -11957 -12867 -9070 -3404 102 -477 -1508 -3222 -1484 -165 879 2474 3420 1732 257 -2289
5639 -2289 -1755 -91 -1162 -4916 -2140 2630 4724 5004 4526 3291 1941 261 3581 4481 2091 -278
5623 -278 -3335 -6972 -5324 -3126 -7009 -7275 -4752 -6524 -4585 -5341 -4979 -2818 -682 -2254 -4291 -4784
5607 -4784 -2595 -3132 -4002 -3141 144 2594 -548 -5090 -6722 -6903 -4414 -4910 144 2609 1730 2593 2610
5590B610O19J527l813j780q87J618n18l142m8p69j137J511J559j622j470q2q05
5573f629j67j018R4K945M868K769N17L031R91j711J268M31K26l959m450m056j24
5556d974n83P77M44J474P21J597O16m82r51j440M892M210r44l346K930J75j984
5539C132j796j249k933J899K103K311O96R47k623o900k981L134K724J213J51M48
5523B76J059J351K149J30k234p39m83q33l50j537j246J360J123J319k415q75J107
5506h38J181j677k049l128k05L646M611M52k803J693r93k406l029q0M226Q44M7
5489e08L73J990l072M1l0M88n80j104j762l158j848K380M930o23n006R24K550
5472d015k523K54k3K514M076J612l578l881k34k04j883J763O69N273M127L97j367
$$ plain form
5590 2610 3229 4756 943 -837 -1724 -106 -624 -3766 -3814 -4583 -5720 -4209 -2650 -4272 -5742 -5824 -6629
5573 -6629 -6796 -7814 -7720 -4775 93 2862 3379 6410 7401 5690 6958 7389 7615 3656 -794 -4850 -4974
5556 -4974 -5557 -4780 -4336 -2862 -2141 -544 72 -410 -1361 -2801 2091 6301 5357 2011 4941 5116 3132
5539 3132 1336 87 -2846 -947 1156 3467 4163 5110 2487 -4413 -7394 -4260 -1536 -323 -172 276
5523 276 1335 2686 4835 4965 2731 1992 1509 676 326 -1211 -2457 -1097 26 1345 -1070 -1945 -838
5506 -838 343 -1334 -3383 -6511 -6716 -3070 1541 1993 -810 883 -110 -2516 -5545 -5625 -1399 -555 -508
5489 -508 -135 1855 -1217 -1176 -1206 -718 -1298 -2402 -4164 -7322 -9170 -6790 -1860 -2483 -7489 -6565 -4015
5472 -4015 -6538 -6284 -6307 -3793 283 1895 -1683 -5564 -5798 -6002 -7885 -6122 -5453 -180 3947 4344 2977
5455B977l919j746J931K179r15j114J618K819n19k506K00J625n54j57j778k912
5439b771J312k155j366M713k65j081j982k568j907J020L820o17l642L441P53j644
5423d939K45J697J943K43j285o17J625J476N24j594k486j781r98K597j40M81R2
5406b917j744j681K465N381L28l499j343Q53l290L950M274k491q74o94k167P17
5390b732J335J658P93k829k028j025K074R79k215j895m12J039J226r7J306m51
5374c274K170J697k463n182O25J493j953j825p31O75K596K51j221M360J768J712
5358F98K900j681J085R74n027k106K884K532k550j115n71M362J732j928j286j64
5342G39K70n43n32o75M041N77j181j417J831j28J048J572k87k40p03K156j905
$$ plain form
5455 2977 -942 -2688 -757 1422 507 -607 1011 3830 3311 805 1005 2630 2076 1919 141 -2771
5439 -2771 -1459 -3614 -4980 -267 -532 -1613 -3595 -6163 -8070 -7050 -3230 -3847 -7489 -4048 -3295 -4939
5423 -4939 -4694 -2997 -1054 -811 -2096 -2713 -1088 388 912 -682 -3168 -4949 -5947 -3350 -3490 -3009 -2917
5406 -2917 -4661 -6342 -3877 1504 1832 -1667 -3010 -2157 -5447 -1497 2777 286 -588 -1282 -3449 -2732
5390 -2732 -1397 261 1054 -1775 -3803 -4828 -2754 -1775 -3990 -5885 -6297 -5258 -4032 -4129 -2823 -3274
5374 -3274 -1104 593 -1870 -7052 -6427 -4934 -6887 -8712 -9443 -8768 -6172 -5921 -7142 -2782 -1014 698
5358 698 3598 1917 3002 3976 -1051 -3157 -273 2259 -291 -1406 -1977 2385 4117 2189 903 739
5342 739 1009 466 -66 -741 3300 3877 2696 1279 3110 2982 4030 5602 5315 5075 4372 6528 4623
5325D623j269J35J163m142J681l55J220O75j957R87j301j820l173J100J755j02
5309g80J036j564j551L83M73kj278K605K665p65k425l976k172J879O262J418L436
5292E644Q591M508J814O38l318J495m833o875o581n284j348K408j049o841l818
5277a4849R40J040K784K895N10L700J146p77K557L97j948n23j269m075J659M935
5261h78J453l85J947M292l750j523R18j262J15j581l308j726k677J130l83N530
5245b088K858J850l059l86m859m046p65O670K457j254J209m91K675p11J701l533
5229a772k899m22J22O00K982J0l017J936j75J12j106l793m93L755J672O15J431
5212d42k312k727L97J051K719J130j315Q24J268k340j354K717P89l381K311k264
$$ plain form
5325 4623 3354 3489 4652 510 2191 1836 3056 3731 1774 2761 1460 -360 -3533 -2433 -678 -780
5309 -780 256 -1308 -2859 -2476 -2003 -2005 -3283 -678 1987 1222 -1203 -5179 -7351 -5472 790 2208 5644
5292 5644 14235 18743 20557 21195 17877 19372 14539 7664 1083 -4201 -5549 -3141 -4190 -11031 -14849
5277 -14849 -13909 -12869 -10085 -7190 -6680 -2980 -1834 -2611 -54 343 -1605 -2128 -3397 -7472 -5813 -878
5261 -878 575 190 2137 6429 2679 1156 2074 812 927 -654 -3962 -5688 -8365 -7235 -7618 -2088
5245 -2088 770 2620 -439 -825 -5684 -9730 -10495 -3825 -1368 -2622 -1413 -1904 771 60 1761 -1772
5229 -1772 -4671 -5093 -4971 -4371 -1389 -1379 -4396 -2460 -2635 -2523 -3629 -7422 -7915 -4160 -2488 -1873 -442
5212 -442 -2754 -5481 -5084 -4033 -1314 -184 -1499 -675 593 -1747 -3101 -384 405 -2976 -665 -2929
5196b929q94J162N53J993K063k365j471L387k291k256N56M386L374k56n68J315
5180E759l679K42p58l628M09O17k283k272P53K229J570R61l058K807K254k903
5164i80m558j481K181R94m5P42q89k433j19R18R92L691L820j719J724k781l798
5147c741N82k30K253M719k383l356J673q95L68k979o54J052J774J868j28k031
5131b108k0L920K740k086r12J614k309k765N67J746l18j309j193J806j590n09
5115b726K043N45k120k089K184J977m408k646N36K405L824n19o70j93m856j039
5099g752Q04J587j22m54K679L05L246J69m539l395J29K028k461O49j17J670M112
5082a462J745O53j033k434j355L069K130p61q20J848N764J121j496l125n60k548
$$ plain form
5196 -2929 -3823 -2661 -2108 -115 1948 -417 -1888 1499 -792 -3048 -2492 1894 5268 5012 4444 5759
5180 5759 2080 2322 1564 -2064 -1655 -1038 -3321 -5593 -4840 -2611 -1041 -80 -3138 -331 1923 -980
5164 -980 -5538 -7019 -4838 -3844 -3889 -3147 -4036 -6469 -6588 -5670 -4678 -987 2833 1114 2838 57 -3741
5147 -3741 -3159 -3389 -1136 3583 1200 -2156 -483 -1378 -1010 -3989 -4643 -3591 -1817 51 -77 -2108
5131 -2108 -2128 1792 4532 2446 1534 3148 839 -1926 -1359 387 69 -1240 -2433 -627 -2217 -2726
5115 -2726 -683 -138 -2258 -4347 -2163 -186 -4594 -7240 -6704 -4299 -475 -994 -1664 -1857 -6713 -7752
5099 -7752 -6948 -5361 -5483 -5937 -3258 -2953 293 462 -4077 -7472 -7343 -5315 -7776 -7127 -7244 -5574 -1462
5082 -1462 283 936 -97 -2531 -3886 -817 1313 552 -268 1580 7344 8465 6969 3844 3284 736
5066G36J91l335r24j592j5L126J027K140m15j107K353m15J589N051K744j926k344
5049F884l486r80M70J91j278r83k149l303j460M15K021j636K404L714l268k858
5033e302j330K446Q44m971J773L031j275K175j912l157j203K901n80j816j085
5018i461R15R41K534K814K911J61m41N05j831j564n35l461J251P8k883L120L430
5001a516M1o88l01K509k41k20L503j722q093O62L144j903K142N74J053k694K454
4984a296J785J204p69q79Q22L489k063j387m38M35r10L27m1J682q62Q01J091J78
4966C169J5k856l439j41j985J233K627K888Q67j282k81J840l827o19K921Q94J821
4949C845k634o519J904N127K378J76j314j503M71P95J19k582l494j517K19J536
$$ plain form
5066 736 927 -2408 -3332 -4924 -4939 -1813 -786 1354 939 -168 2185 1770 3359 8410 11154 9228 6884
5049 6884 3398 2418 2888 3079 1801 818 -1331 -4634 -6094 -5679 -3658 -5294 -2890 824 -2444 -5302
5033 -5302 -6632 -4186 -3342 -8313 -6540 -3509 -4784 -2609 -4521 -7678 -8881 -5980 -6560 -8376 -9461
5018 -9461 -8546 -7605 -5071 -2257 654 815 374 879 -952 -2516 -3051 -6512 -5261 -5183 -8066 -4946 -1516
5001 -1516 -1475 -2163 -2464 45 -196 -416 3087 1365 -6728 -6066 -2922 -4825 -2683 -2109 -1056 -3750 -1296
4984 -1296 489 1693 924 45 867 4356 2293 906 468 903 -7 320 279 1961 1099 1900 2991 3169
4966 3169 3184 328 -3111 -3252 -5237 -4004 -1377 1511 2378 1096 815 2655 -1172 -1791 1130 2024 3845
4949 3845 1211 -5308 -3404 1723 4101 4277 2963 1460 1931 2726 2845 263 -3231 -4748 -4529 -2993
4933b993L207k080J88j558K891J602j799k58m33k356j19q69L64j169Q60j764K55
4916f031J903k839j255O58L424l89J544L84q55O64N00k1J381Q20J726q51j151
4899c88m78R56l64P2j677j888J124o80N06Q48J535J164J420p32k701J607L173
4882C497P01j979J582K358k151k009m559p07L529J873j219O9j806j923J611K943
4866A810k965j005m08n5J239K346k1o61k817n27N88J573R93k766k41r69L477J654
4848A245K467k597k49l305j297j091l79J703P94R0%j30J466J322j689k710m74
4831d834j526J062M163K306k239l385l534j613N55L832Q34n07L65j543j473J688
4815e849l788N85J382N02K215K002P53O75P00M28l79p85J078N09l85J479j071
$$ plain form
4933 -2993 214 -1866 -1678 -3236 -345 1257 -542 -800 -1233 -3589 -3708 -4577 -4213 -5382 -4522 -6286 -6031
4916 -6031 -4128 -6967 -8222 -7564 -4140 -4529 -2985 -2601 -3456 -2792 -2292 -2313 -932 -112 1614 763 -388
4899 -388 -866 90 -274 -202 -1879 -3767 -2643 -3323 -2817 -1969 -434 730 2150 1418 -1283 324 3497
4882 3497 4198 2219 3801 6159 4008 1999 -2560 -3267 262 2135 916 985 -821 -2744 -1133 1810
4866 1810 -1155 -2160 -2568 -2623 -1384 962 941 280 -2537 -3064 -2476 -903 90 -2676 -2917 -3886 -409 1245
4848 1245 3712 1115 866 -2439 -3736 -4827 -5206 -3503 -2709 -2619 -2619 -2749 -1283 39 -1650 -4360 -4834
4831 -4834 -6360 -5298 -1135 1171 -1068 -4453 -7987 -9600 -9045 -5213 -4379 -4886 -4521 -6064 -7537 -5849
4815 -5849 -9637 -9052 -7670 -7168 -4953 -2951 -2198 -1523 -823 -395 -774 -1559 -481 28 -357 1122 51
4798E1n45R88r08k132K038K880J184J86J47j180j448j44L97j71n34J661j60q26
4780A484m22k585J098j2m299j354n0k28J49J197J179j1o18k35j651O57K092P41
4762b868N32K72r73J463j006l004j717M39N083M093p78j528J849j806K580j008
4746A623m233k568J014N82J587K264k71j139l87l24J232L271k554j410J412r88
4730h89j969n71j833K43N53L820L436J712j162q8j54l790J160k368k626J096J320
4713b110m96k884K48P63N21N23k229Q66j00k396q14J90N73J633J156J394l56j25
4695c643L208J661J343l874k918J7j902j949J453J758K320K462o18k01K177o57
4679F37q88j262n94Q11J091k38J067J990j262n213L43J850K736K745Q01j425k702
$$ plain form
4798 51 -494 494 -414 -2546 -508 2372 3556 3742 3889 2709 1261 1117 1514 1343 809 2470 2310 1484
4780 1484 1062 -1523 -425 -437 -4736 -6090 -6140 -6368 -6219 -5022 -3843 -3854 -4472 -4707 -6358 -5701 -3609 -2868
4762 -2868 -2336 -2064 -3037 -1574 -2580 -5584 -7301 -6862 -1779 2314 1536 8 1857 51 2631 1623
4746 1623 -2610 -5178 -4164 -3582 -1995 269 -2 -1141 -1528 -1852 -620 2651 97 -1313 99 -889
4730 -889 -2858 -3429 -5262 -5019 -4466 -646 2790 4502 3340 3252 3098 -692 468 -1900 -4526 -3430 -2110
4713 -2110 -2606 -5490 -5242 -4479 -3958 -3435 -5664 -4798 -4898 -7294 -8108 -7918 -7345 -5712 -4556 -3162 -3518 -3643
4695 -3643 -435 1226 2569 -1305 -4223 -4206 -6108 -8057 -6604 -4846 -2526 -64 -682 -883 1294 637
4679 637 -251 -1513 -2107 -1296 -205 -443 624 2614 1352 -3861 -3518 -1668 1068 3813 4614 3189 487
4662D87L15J205l249j340l028j506L954J400J108m783k476j467J406J483J374
4647e117j011k583n34K927N155O35l461j209K438R15m837L39M515M356k908k481
4631b861L285K409P07k672j596j147j388K388J942l436j096L166K917M73q78j262
4615I51q57J084J64l903j746K65K341J411J635p38r32l078l890q15K384J119l2
4598d637L4K547q17p44Q96q51M07k389j419J507M8m92j318J087J235K859L109
4581A062N907L54l467n282k98k374K069k87O94J396J931m25m22k977l652K708
4565c063K932k384J226J231J403J53J375j098K332J672k222j181N03P35k921j795
4549a102j007L949j839j15L494k56j482o289j793K739k00K155J787K80l826k255
$$ plain form
4662 487 802 2007 -1242 -2582 -5610 -7116 -3162 -1762 -654 -5437 -7913 -9380 -7974 -6491 -5117
4647 -5117 -6128 -8711 -9245 -6318 -1163 -528 -3989 -5198 -2760 -1845 -6682 -6343 -1828 2528 -380 -2861
4631 -2861 424 2833 3540 868 -728 -1875 -3263 -875 1067 -2369 -3465 -299 2618 3091 2213 951
4615 951 94 1178 1342 -2561 -4307 -4042 -1701 -290 1345 607 -325 -3403 -7293 -8108 -5724 -4605 -4637
4598 -4637 -4603 -2056 -2873 -3617 -2721 -3572 -3165 -5554 -6973 -5466 -5418 -5910 -7228 -6141 -4906 -2047 1062
4581 1062 6969 7323 3856 -1426 -1724 -4098 -2029 -2316 -1622 -226 1705 1280 858 -2119 -5771 -3063
4565 -3063 -131 -2515 -1289 -58 1345 1498 2873 1775 4107 5779 3557 2376 2879 3614 693 -1102
4549 -1102 -2109 1840 1 -114 3380 3124 1642 -4647 -6440 -3701 -3901 -1746 41 321 -3505 -5760
4533e760p35j200j171j092L490J104n54R01L516J764r66j698j530R04L110j87
4517a04l004L223K808l80l599m018O23J632N73J312m54J747P18O04k181l280j549
4500e329m01q24J449M99J046K95j636Q57K80J956j867l232J359J727m33J709j839
4483d384K27J344P02J93l289r64J711L283K936l121k207J487p04P63J876j202
4467a349o81m68q67O96J887J815j998l089J127J589R03J239L076J401K188l207
4451D262n708l52j19o95R93r56l698m3K333K007P1K06l354k779R38J626K681K532
4433e5l98K807j426l105P22l333Q33K453q06N20M347j302r59m654J255J483K35
4416a383k829k877L0M621J822k115k697j79Q50J663J12J918rk883L20N389p71
$$ plain form
4533 -5760 -6495 -7695 -8866 -9958 -6468 -5364 -5918 -5017 -1501 263 -703 -2401 -3931 -3027 83 -104
4517 -104 -3108 115 2923 2543 -1056 -5074 -4451 -2819 -2246 -934 -1388 359 1077 1681 -500 -3780 -5329
4500 -5329 -5730 -6554 -5105 -4606 -3560 -3265 -4901 -4044 -3764 -1808 -3675 -6907 -5548 -3821 -4254 -2545 -4384
4483 -4384 -4157 -2813 -2111 -1918 -5207 -6171 -4460 -1177 1759 -1362 -3569 -2082 -2786 -2023 -147 -1349
4467 -1349 -2030 -2498 -3365 -2669 -782 1033 -965 -4054 -2927 -1338 -435 804 3880 5281 7469 4262
4451 4262 -1446 -1798 -1917 -2612 -1619 -2575 -6273 -6316 -3983 -1976 -1905 -1699 -5053 -7832 -6894 -5268 -2587 -55
4433 -55 -453 2354 928 -2177 -1455 -4788 -3955 -1502 -2308 -1788 2559 1257 298 -4356 -3101 -1618 -1383
4416 -1383 -4212 -7089 -7059 -2438 -616 -2731 -5428 -5607 -4757 -3094 -2982 -1064 -1073 -3956 -3636 1753 982
4399I82l286p01J368L173l540n349l93J851J724j385K05J958j606k289J540M253
4383a495r22l480j371L887L53k80J242K173j118o79K4L422k218K163j92k488j503
4366b482l102j581L106M759J940J10j92m224J61M141O6l631j768K69M60m49n08
4349b925j070j447J941P06k91k852j111j157L031K569l098r38K830L169J693l38
4333G12O02j360l805K498L401J020j207l386p18J018k144l166p57j011K695m657
4317a0265J379K257M133K584m6j019L277K331o6l181k118N03J000k051M013N88
4301C319l78k734l255N71L238L86p85J207J578j555j583k29J066j472J43Q56p71
4284c98J314L279J673j133p99l074m238J461R61k984r00L545J552j431K96j224
$$ plain form
4399 982 -2304 -3005 -1637 1536 -2004 -7353 -7746 -5895 -4171 -5556 -5351 -3393 -4999 -7288 -5748 -1495
4383 -1495 -2417 -5897 -7268 -3381 -3028 -3308 -2066 107 -1011 -1690 -1666 1756 -462 1701 1509 -979 -2482
4366 -2482 -5584 -7165 -4059 700 2640 2750 2558 -1666 -1505 2636 2702 -929 -2697 -2428 -1968 -2417 -2925
4349 -2925 -3995 -5442 -3501 -2795 -3086 -5938 -7049 -8206 -5175 -2606 -5704 -6642 -3812 -643 1050 712
4333 712 1314 -46 -3851 -1353 2048 3068 1861 -1525 -2243 -1225 -3369 -6535 -7292 -8303 -5608 -10265
4317 -10265 -8886 -6629 -2496 88 42 -977 2300 4631 4565 1384 -734 -231 769 -1282 2731 3319
4301 3319 2941 207 -3048 -2477 761 1147 362 1569 3147 1592 9 -220 846 -626 -483 373 -398
4284 -398 916 4195 5868 4735 3936 862 -3376 -1915 -954 -3938 -4838 -1293 259 -1172 -876 -2100
4268b100q67Q84k620P87J794K38l90J558M2O1P28L631k442j660j339l090J899
4251b886K52m939K048J098N136J772k612l995L04K6J048O38o31J6J967Q66M140
4234D248N3j847p84l752o80p85J934K874J80r9K102J524j003m267P4k355N81N71
4216a431J458j495l63q31R04L088K828P3j025J22J93J22O51k261k647j544r79
4199c137J228k697J3L447K98KL40j133J334J177l26rl690k946j698L38K527N064
4181A32K879K443p23n63J928K99l328K903j580k451K18M95j620m20J275J928o73
4164C142j995k674n261k61M430J626j315K685J454p26l683j573M93J641K936L010
4148C929n119m616m436K675J086N70j251k814K637M126M47K009O587M251m800
$$ plain form
4268 -2100 -2967 -2083 -4703 -3916 -2122 -1884 -2274 -716 -674 -613 115 3746 1304 -356 -1695 -4785 -2886
4251 -2886 -2634 -7573 -5525 -4427 709 2481 -131 -4126 -3822 -3796 -2748 -2110 -2741 -2725 -758 108 4248
4234 4248 4301 2454 1670 -2082 -2762 -3547 -1613 1261 1441 1342 3444 4968 3965 -302 -228 -2583 -2002 -1431
4216 -1431 27 -1468 -1831 -2662 -1758 1330 4158 4231 3206 3328 3521 3643 4294 2033 -614 -2158 -3137
4199 -3137 -1909 -4606 -4593 -1146 -848 -846 -506 -1639 -305 872 546 537 -3153 -6099 -7797 -7459 -4932 132
4181 132 3011 5454 4731 4168 6096 6395 3067 5970 4390 1939 2157 2652 1032 612 1887 3815 3142
4164 3142 1147 -1527 -6788 -7049 -2619 -993 -2308 377 1831 1105 -2578 -4151 -3658 -2017 919 3929
4148 3929 -1190 -5806 -10242 -7567 -6481 -5911 -7162 -9976 -7339 -3213 -2766 -757 5830 10081 5281
4133E281n552k011j296K55p00J982M440k481k557p61J787J498L56n76P77L478
4117C920O86o153m426J654J244J39j212L68R10j378k261K993L042m041j370L193
4101b692R50J409j68K44P9Q23m418N66N855J311k265J39K50k437j767l45k91J517
4083a240K814L89l207l177k710j77K907k35N50K045o19q99K753J172O48j962k787
4066c735R60K924L246m06j138L01j769p57k459Q81N882J271l536j518j40j151
4050a144l98K014L19j905P94j342o228N36L084K381J474K691k94k454l250l15
4034d037J207R46L42n85O43K783J659m640k473L995K82K07J73l769l41L556M262
4017D210J220k796k784J331L51J426l28m089k190L135O11j132K783m15o6k063
$$ plain form
4133 5281 -271 -2282 -3578 -3323 -4023 -2041 2399 -82 -2639 -3400 -1613 -115 241 -335 442 3920
4117 3920 4606 -1547 -5973 -4319 -3075 -2936 -4148 -3780 -2870 -4248 -6509 -3516 -474 -4515 -5885 -2692
4101 -2692 -1742 -333 -501 -257 -178 645 -3773 -3207 2648 3959 1694 1833 2083 -354 -2121 -2466 -2757 -1240
4083 -1240 1574 1963 -1244 -4421 -7131 -7308 -4401 -4636 -4086 -2041 -2660 -3559 -806 366 1014 -948 -3735
4066 -3735 -2775 149 3395 2989 1851 2152 383 -374 -2833 -1952 3930 5201 1665 147 7 -1144
4050 -1144 -1542 472 791 -1114 -320 -1662 -7890 -7354 -4270 -1889 -415 2276 1982 -472 -3722 -4037
4034 -4037 -2830 -1884 -1542 -2127 -1484 1299 2958 -1682 -4155 -160 122 329 502 -3267 -3608 -52 4210
4017 4210 5430 2634 -150 1181 1532 2958 2630 -1459 -3649 -514 97 -1035 1748 1333 1267 -796
4001g96j342k18P5r38K102K093L705k666l978J435L767K706k077j077l840M55
3985e94L0L36L522J951k876m04k491L023R69M59R18Q32r5l583k792L127J039l017
3967C54J533L09J395k483j540J103l769l859J206M274Q66j90J65o64m677p93N17
3950f253J571L511q5j390o48q16M3n39M52j33J368J451K802J803k791M05J712
3933B463M66J386k606j23R69j259j184M42Q18j585j622j031q38J822R72r56j643
3916c509j723P96L183J9M80J132n04J864M164l581k861m531j08J457J801j565
3900c486J284M090K313l099j426K126j876p01j562k403N717L709k078k498N76
3885F86l744m574J886L918K275l86k073j29L560Q28k327k690N34j000j418l256
$$ plain form
4001 -796 -2138 -2356 -2281 -3219 -1117 976 4681 2015 -1963 -528 3239 5945 3868 2791 -1049 -594
3985 -594 -564 -228 3294 5245 2369 1965 -526 2497 3466 3925 4843 5675 5580 1997 -795 2332 3371 354
3967 354 1887 2196 3591 1108 -432 671 -3098 -6957 -5751 -1477 -611 -801 -636 -1300 -5977 -6770 -6253
3950 -6253 -4682 -1171 -1256 -2646 -3294 -4110 -4067 -4606 -4154 -4287 -2919 -1468 1334 3137 346 751 2463
3933 2463 2929 4315 1709 1586 2555 1296 112 554 1372 -213 -1835 -2866 -3704 -1882 -910 -1866 -3509
3916 -3509 -5232 -4436 -1253 -1234 -754 378 -126 1738 5902 2321 -540 -5071 -5179 -3722 -1921 -3486
3900 -3486 -2202 1888 4201 1102 -324 1802 -74 -775 -2337 -4740 977 4686 2608 110 686
3885 686 -3058 -7632 -5746 -1828 447 61 -2012 -2141 1419 2247 -80 -2770 -2236 -3236 -4654 -7910
3869g910r97k1J794J372k805k31J310L535L846R72l577r34M864J130j942J537
3853A943j7j768k155K99q43j442Q09j523K890M983K819l72j820o8R38n69m344
3836b40j827N90K314M576M617r28k405j530j861k11j430k29O70J241j629q82Q33
3819A669n220J100J01L617L796o688j651J442M116Q04r43m595m1K08L14k05L247
3802A071P22l012o15k23j396J095J841K621P25l84k278k17r31J533Q63r76k20
3785B19o33k699K403j124p98N37l992r98L290J302K14n14R0K974K102k474L182
3768C081L869l235p33n32K25L110K02j430L41J052K81l321o477P30M320j341m480
3751d338j0L086m026K18K197L054N0l86m958k688L559L083l91k328j398R27L233
$$ plain form
3869 -7910 -8907 -8928 -7134 -5762 -8567 -8798 -7488 -3953 -107 865 -2712 -3646 1218 2348 406 1943
3853 1943 1926 158 -1997 -1698 -2541 -3983 -3174 -4697 -1807 3176 5995 5623 3803 3735 4673 4104 -240
3836 -240 -2067 -1477 837 5413 10030 9102 6697 5167 3306 3095 1665 1436 2106 3347 1718 836 1669
3819 1669 -3551 -2451 -2350 1267 5063 -1625 -3276 -1834 2282 3086 2143 -2452 -2493 -2285 -1971 -2176 1071
3802 1071 1793 -1219 -1834 -2057 -3453 -2358 -517 2104 2829 2445 167 -50 -981 552 1415 439 219
3785 219 -414 -3113 -710 -1834 -2632 -2095 -6087 -7085 -3795 -2493 -2279 -2793 -2703 271 2373 -101 3081
3768 3081 6950 3715 2982 2450 2675 5785 5987 4557 4898 5950 6231 2910 -3567 -2837 1483 142 -4338
3751 -4338 -4348 -1262 -5288 -5070 -2873 181 231 -155 -5113 -7801 -4242 -1159 -1550 -3878 -5276 -4349 -1116
3734a116L034M04j417m659R63J847J833Q0j120k035j875k98L263j916L97j276
3718c891J941K325L144j359M43J34P26MJ362k742j309j476k204q01O4K161J327
3701a51p27M11r66J439K531k495j603m527R97j953j86Q49P50N13L099p12K527
3684b04J690j056k1j074k029r69R67O56m296j055J016L536M373J970O1n1m115
3667f01j895k379O8K63N16j670J476K516P87K576P81l86j461J163m87O84r99M72
3649A424J91n87J451K60N31k470j767K470K89j325j564l35N4k460r28K721M984
3632B939K939P97l651m262j285n87J831k63J448j369k464j470J416j055K86L156
3616a594L18k408R56j935J410K019L31J106N91J368J119k307j968R34r41O10J502
$$ plain form
3734 -1116 1918 2322 905 -3754 -2791 -944 889 969 -151 -2186 -4061 -4359 -1096 -3012 -2615 -3891
3718 -3891 -1950 375 3519 2160 2603 2737 3463 3467 4829 2087 778 -698 -2902 -3703 -3639 -1478 -151
3701 -151 -878 -467 -1433 6 2537 42 -1561 -6088 -5091 -7044 -7230 -6381 -5631 -5118 -2019 -2731 -204
3684 -204 1486 430 409 -665 -2694 -3663 -2696 -2040 -6336 -7391 -6375 -2839 1534 3504 3565 3514 -601
3667 -601 -2496 -4875 -4807 -4544 -4028 -5698 -4222 -1706 -919 1657 2438 2052 591 1754 1267 1951 952 1424
3649 1424 1615 1028 2479 2739 3270 800 -967 1503 1792 467 -1097 -1432 -1378 -3838 -4766 -2045 2939
3632 2939 5878 6675 3024 -1238 -2523 -3110 -1279 -1542 -94 -1463 -3927 -5397 -3981 -5036 -4750 -1594
3616 -1594 -1276 -3684 -2728 -4663 -3253 -1234 -903 203 794 2162 3281 974 -994 -60 -1001 -391 1111
3599A111Q12j600n21l544j31j208k61j025J585J002P0J631l43M85J360K338J819
3582C580j012n030j099L020Q08M422n12m189j179L6l99k37k640j058O44O003J36
3565A294m111L70j711Q04j434J186o47l96L21l582K238J333l54r50K808J591j058
3548b298J32k694j274o13L259N744J589k468j920J862j534J06J478J886j334m326
3532b405p62K83j169J20l245M113M415J114k407j25o80J25Q92K719J529k609m922
3515c014j762J689M609j518M15j124l93j570j862K598K129O28O72j809o16r38
3499a866j090k019J076j51K969k106l92L504r59l578p75o25K02K724M039l44n48
3482F1J103P01J684J094k26j396r65l136k314k622L052j613j123J434K882J343
$$ plain form
3599 1111 1923 323 -198 -3742 -3873 -5081 -5342 -6367 -4782 -3780 -3710 -2079 -2422 -1937 -577 1761 3580
3582 3580 2568 -2462 -3561 -541 267 4689 4177 -12 -1191 -1155 -1554 -1791 -4431 -5489 -4845 1158 1294
3565 1294 -2817 -2447 -4158 -3354 -4788 -3602 -4249 -4645 -4324 -7906 -5668 -4335 -4689 -5639 -2831 -1240 -2298
3548 -2298 -2166 -4860 -6134 -6747 -3488 2256 3845 1377 -543 1319 -215 -109 1369 3255 1921 -2405
3532 -2405 -3167 -2884 -4053 -3933 -7178 -3065 1350 2464 57 -68 -748 -623 269 2988 4517 1908 -3014
3515 -3014 -4776 -3087 1522 4 419 -705 -1098 -2668 -4530 -1932 197 825 1497 -312 -928 -1866
3499 -1866 -2956 -4975 -3899 -4050 -1081 -3187 -3579 -75 -1034 -4612 -5387 -6012 -5810 -3086 953 609 61
3482 61 1164 1865 3549 4643 4417 3021 2056 -1080 -3394 -6016 -2964 -4577 -5700 -4266 -1384 -41
3466d1N49j731K53m21l89P11q8n75L72P33J312L84J003j063m64j480n46K217J597
3447B333j590k499l665J353J631J642k056J426K12J68k182L212K265p46o01j877
3431i74j977J91l87J236J757J882p14m113k654K6L756N073k937j550r40L59k329
3414d295j035M580L521j309R04J748m162k39J067p83j125R11m29O08M367N69j736
3397C162M189L367k557l430J46j586l385J153J099L003p64l318o361K234L339
3382B91k9j302L017q37j184O95J065j733l22N00K49J776K411j624k743J800J025
3365C055K203r53n107o30M82J765L777J105q64l496r96P0l328K87K444N09m154
3348c831j231P027K831L26j975J46J407j464l362j174L098PK86J12K336P54k473
$$ plain form
3466 -41 508 -1223 -970 -1391 -1780 -1069 -1157 -1732 -1360 -627 685 1069 2072 1009 545 -935 -1481 736 2333
3447 2333 743 -1756 -5421 -4068 -2437 -795 -2851 -1425 -1213 -1045 -3227 -15 2250 1504 903 -974
3431 -974 -2951 -2760 -3147 -1911 -154 1728 1014 -3099 -5753 -5727 -1971 3102 165 -1385 -2325 -1966 -4295
3414 -4295 -5330 -750 2771 1462 2366 4114 -48 -287 780 -3 -1128 -217 -646 -38 4329 4898 3162
3397 3162 7351 10718 8161 4731 4877 3291 -94 1059 2158 5161 4397 1079 -5282 -3048 291
3382 291 262 -1040 1977 1140 -44 651 1716 -17 -339 161 410 2186 4597 2973 230 2030 3055
3365 3055 5258 4305 -802 -1432 -950 815 4592 5697 4833 1337 341 411 -2917 -2630 -186 323 -3831
3348 -3831 -5062 1965 4796 5122 3147 3293 4700 3236 -126 -1300 1798 1805 2091 2203 4539 5293 2820
3331B820j974N26m146j613K693j069J546L242K436l72q27k298l457j044J717L985
3315B165J389j170q02J008K071L33j475m392o244M411P246l50k309l127j127q20
3299c193j265R11K030J301k337j338k48K055K012p97K642K01J314J151j213j727
3283A499p19j905K7j501K049p95j277p29J173N60K379J324k198l391k457L175
3267b786J240n90J258L573q4J006k737l44q43J29J291l102k72L804p02j321J127
3250F47L017p00l285k158n166n38P69O5K730Q60M584m60m206j508M86k646Q44
3233f665K519j951K096P82N84j254l499k715K964K523O239P25k131j340k464J714
3217a873M252J627k982K88q77J99K196M89k782O98k415k188lM041J171j03K99
$$ plain form
3331 2820 846 1372 -2774 -4387 -1694 -2763 -1217 2025 4461 4089 3262 964 -2493 -3537 -1820 2165
3315 2165 3554 2384 1582 2590 4661 4994 3519 -873 -7117 -2706 4540 4190 1881 -1246 -2373 -3193
3299 -3193 -4458 -3547 -1517 -216 -2553 -3891 -4139 -2084 -72 -869 1773 1974 3288 4439 3226 1499
3283 1499 780 -1125 -1098 -2599 -550 -1345 -2622 -3351 -2178 -1618 761 2085 -113 -3504 -5961 -2786
3267 -2786 -1546 -2136 -878 2695 2611 3617 880 536 -307 -178 1113 -1989 -2261 1543 841 -480 647
3250 647 3664 2964 -321 -2479 -7645 -8183 -7414 -7349 -4619 -3759 825 365 -3841 -5349 -4863 -7509 -6665
3233 -6665 -4146 -6097 -4001 -3219 -2635 -3889 -7388 -10103 -7139 -4616 1623 2348 217 -1123 -3587 -1873
3217 -1873 2379 4006 1024 1312 435 634 2830 3319 537 1235 -1180 -3368 -3371 670 1841 1738 2037
3200B037n193j045j404L861K558M04j369J564J574j51l002j683K312k98j909N68
3184a176K653J39R6n74j433j980K888J434O85J654J300j74m958j250j820J654
3168h62Q72o41j316j230N12M871j252l164n53L722K370M41j324R67q32r72L88
3151A997j442j189j25Q57l671R37M658K966K906j249k8l487l826k13K72j480p16
3134b833N581J664k364n370j489J777L876q83j097K060n51j436m93k24L043K570
3118C831K832m10q03k209m523O00J237O40j299l754m51J905j038k179l145J219
3102g547j96J139O40N373Q67p216l80L293K894q09J460J746K20Q69P18K636k179
3085C528j046l240k049q80j07J791q95l489j178J465L208m34K970M611j650p76
$$ plain form
3200 2037 -3156 -4201 -5605 -1744 814 1218 -151 1413 2987 2836 -166 -1849 463 165 -1744 -1176
3184 -1176 1477 1616 1712 1138 -295 -2275 613 2047 2732 4386 5686 5512 554 -696 -2516 -862
3168 -862 10 -631 -1947 -3177 -2665 2206 954 -2210 -2763 959 3329 3770 2446 3413 2581 1609 1997
3151 1997 555 -634 -759 98 -3573 -2636 2022 4988 7894 6645 6617 3130 -696 -909 -637 -2117 -2833
3134 -2833 2748 4412 2048 -3322 -4811 -3034 842 -41 -1138 922 371 -1065 -1558 -1782 1261 3831
3118 3831 6663 6253 5450 3241 -1282 -682 555 1195 -104 -3858 -4309 -2404 -3442 -5621 -8766 -7547
3102 -7547 -7743 -6604 -5964 -591 276 -6940 -7320 -4027 -1133 -1942 -482 1264 1484 2353 3071 5707 3528
3085 3528 2482 -758 -2807 -3687 -3794 -2003 -2898 -6387 -7565 -6100 -2892 -3326 -356 4255 2605 1829
3069A829K341M47m34l753j555Q84K838J124J023l607P9l30k419P03K449o03j037
3052b1j131J806k240J586N13L844k602q94J072M35P9j723p20r18M96O83r57P26
3034C4j963N58K794K456j502j444m76J369j969q57J349o08k49k65%J335J720n58
3016A724j295L73K440j647k281j007k73N01K64K637Q21q11O76m38R95l569m1q79
2998a810j985j053l362M03J358K324K22R32L208K63J099q56M78q24m019j323j56
2981e101N194J417k369k178J379L61j448j630J991J204J573j271k006rK70J065
2965a558q77k334j974Q77j617L7R00J861J429k10j750K00j048J814J781J649J199
2948C79L105p69k617M70K134J529l593L61r56J668p32k845k261j101j072J967
$$ plain form
3069 1829 4170 4617 4183 430 -1125 -241 2597 3721 4744 1137 1216 886 -1533 -830 1619 1016 -21
3052 -21 -1152 654 -1586 0 513 4357 1755 861 1933 2368 2447 724 4 -914 -418 265 -692 34
3034 34 -1929 -1371 1423 3879 2377 933 457 1826 -143 -1000 349 -259 -508 -773 -773 562 2282 1724
3016 1724 429 802 3242 1595 -686 -1693 -1966 -1465 -1201 1436 2257 1446 2122 1684 2679 -890 -931 -1810
2998 -1810 -3795 -4848 -8210 -7807 -6449 -4125 -3903 -2971 237 500 1599 743 1221 397 -3622 -4945 -5101
2981 -5101 93 1510 -859 -3037 -1658 -1297 -2745 -4375 -2384 -1180 393 -878 -2884 -2893 -2623 -1558
2965 -1558 -2435 -4769 -6743 -5866 -7483 -7446 -6546 -4685 -3256 -3466 -5216 -5016 -6064 -4250 -2469 -820 379
2948 379 3484 2715 98 568 2702 4231 638 999 43 1711 979 -1866 -4127 -5228 -6300 -4333
2932d333P13O80K479j354l130m04K024j194j032M65j164L388K183k716j34K670
2916h59p28J45J112K447k625k264K03j168k19M293J900m86J499j912k535j34K225
2899H94j29K012L560J934j234l094l352o61J168j87k690k905m072L119N429J7
2883a91j757j074k662j244K389n38j224j71m168n47K062L937J495j329M150k96
2867a168L92L488j197k277J797J611J05j617k045k824j439J240K113L183j336
2852B6j101J443K45j784j044K430J806j771j872j46K330l50l36N28J543J102m35
2835B614M64J109m73Q78k83n39k620j998K92Q45J728r58K655l71j159l13m826
2818b955p58k546L73L559K338M76m26Q63j060M36k768J167j130K635J107l173
$$ plain form
2932 -4333 -3620 -2940 -461 -1815 -4945 -5349 -3325 -4519 -5551 -5086 -6250 -2862 -679 -3395 -3529 -859
2916 -859 -1587 -1442 -330 2117 -508 -2772 -2569 -3737 -3956 337 2237 1751 3250 1338 -1197 -1331 894
2899 894 765 2777 6337 8271 7037 3943 591 -70 1098 911 -1779 -4684 -8756 -5637 -208 -191
2883 -191 -1948 -3022 -5684 -6928 -4539 -5077 -6301 -6472 -10640 -11187 -9125 -5188 -3693 -5022 -872 -1168
2867 -1168 -776 2712 1515 -762 1035 2646 2751 1134 -911 -3735 -5174 -3934 -1821 1362 26
2852 26 -1075 368 613 -1171 -2215 215 2021 250 -1622 -1768 562 212 -124 404 1947 3049 2614
2835 2614 3078 4187 3714 4592 4309 3770 1150 -848 -556 289 2017 1059 3714 3343 2184 1871 -2955
2818 -2955 -3713 -6259 -5886 -2327 11 487 61 924 -136 300 -2468 -1301 -2431 204 1311 -1862
2802a862k01m159m76l4L112m63l07N589J134l230Q0L740J292m148k155p41k603
2785e432L54K109K045M753R11l002l357P20L292k550l99K469J516R83l699k95
2769D18N89j850J022J105j953N83p07M16j741K721R16k762l261M261L018k200
2753E75j753k914K856L57K41K487j895m269K695R55Q26L063L049Q78k385n064
2737b98q21J938K411Q21k699j568J428j832Q20j836k354J329K214K312N02j381
2721I86l474J541K505K577R2M09n34J79j041k033k573p6K957l03o13l386J399
2704a388J154j844L9K955K168p2j391L86r57n14R53K140q04n177J208J181J156
2687A193o09j069k14J552o13r39p62j838J03J122K735L42N08L555J227p83k980
$$ plain form
2802 -1862 -2063 -6222 -6698 -6732 -3620 -4083 -4390 1199 2333 -897 -817 2923 4215 67 -2088 -2829 -5432
2785 -5432 -5078 -2969 -924 3829 4740 1738 -1619 -899 2393 -157 -556 1913 3429 4412 713 418
2769 418 1007 -843 179 1284 -669 -86 -793 -377 -2118 603 1519 -1243 -4504 -243 2775 575
2753 575 -1178 -4092 -1236 -879 -638 1849 -46 -4315 -1620 -665 161 3224 6273 7151 4766 -298
2737 -298 -1119 819 3230 4051 1352 -216 1212 -620 200 -1636 -3990 -2661 -447 1865 2367 986
2721 986 -2488 -947 1558 4135 4227 4636 4102 4281 3240 1207 -1366 -1442 1515 1212 599 -2787 -1388
2704 -1388 -234 -2078 -2039 916 3084 3012 1621 2007 1050 536 1489 3629 2825 -2352 -1144 37 1193
2687 1193 584 -485 -699 853 240 -699 -1461 -3299 -3196 -2074 661 1003 1511 5066 6293 5510 2530
2670B530l517M88q85J908O0j192P70J737J888q92k078k925j389K526L628J084
2654C741n51n293l04M58J743r68k644K037P54j396o17j273N10K081M581K231J233
2637F323k759j517P71R7J969O62J967k184k328l097R17J026l11k337l149M230
2621B80J528l797N700J95l827k421L24J9j59o95l27K600Q0n0o86K96K258Q84l89
2602A813o36l207J884K514j834k265L389J737l899K467K553j730j564k263k76
2587a317l397K381M798J789l030l286J903L871L267J82k421m781J375K811j351
2572B794j676o02r1K097j651k619k09K199L137Kj407k365K681L735q07k264J347
2555D301O19N57O00K44l417k348j924J946Q93P0K677R83r53n000q71K72M150K31
$$ plain form
2670 2530 -987 -499 -1384 524 584 -608 162 1899 3787 2895 817 -2108 -3497 -971 2657 3741
2654 3741 3190 -2103 -2407 -1949 -206 -1174 -3818 -1781 -1027 -2423 -3040 -4313 -3803 -1722 2859 5090 6323
2637 6323 3564 2047 2818 2915 4884 5546 7513 5329 3001 -96 821 1847 1536 -801 -3950 280
2621 280 1808 -1989 3711 3906 79 -2342 -2018 -1999 -2158 -2853 -3180 -580 -500 -550 -1236 -940 1318 2202 1813
2602 1813 1177 -2030 -146 2368 534 -1731 1658 3395 -504 1963 4516 2786 1222 -1041 -1317
2587 -1317 -4714 -2333 2465 4254 1224 -2062 -159 3712 6979 7161 4740 -41 1334 4145 2794
2572 2794 1118 516 425 2522 871 -1748 -1957 242 3379 3381 1974 -391 2290 6025 5218 2954 4301
2555 4301 4920 5477 6077 6321 2904 556 -1368 578 1471 1541 4218 5201 4248 -752 -1623 -1351 2799 3030
2537C030p82K82l426k279l3k828N05m69J520p2L284K129m88k49K670L13l235K50
2519A22j341j964N412K626l62j191n15k316k471l78L454K707L125k049k28l638
2503I93o07K4k496k824K894K005l74P46J101q61R67K778P37j154k336o98j07L93
2485A181L282j889m724J425R66k101j327J1J097O76J067M921K126j150k417k926
2469B18r26K308N997j960l146j534j185O12p75k248J461O200J365o27j419j086
2453C255k21j718J939J424j160k363j446k438J936J977L047r64J400j330k065
2438A273j944j065k722N49J364j009K376Q06K594r93J992l777m174J491K034M31
2422g74k05r81k91P07j146N50L470k474J226n56m62K048l28m27r02K025m230r37
$$ plain form
2537 3030 2248 2530 -896 -3175 -3208 -6036 -5531 -6000 -4480 -4552 -1268 861 373 124 2794 3107 -128 122
2519 122 -1219 -3183 2229 4855 4493 3302 2787 471 -2000 -2378 1076 3783 6908 4859 4631 993
2503 993 386 410 -2086 -4910 -2016 -11 -385 361 1462 601 1568 4346 5083 3929 1593 895 788 1181
2485 1181 4463 2574 -2150 -725 241 -1860 -3187 -3176 -2079 -1403 -336 4585 6711 5561 3144 218
2469 218 -708 1600 7597 5637 2491 957 -228 384 -391 -2639 -1178 5022 6387 5760 4341 3255
2453 3255 3034 1316 3255 4679 3519 1156 -290 -2728 -792 1185 4232 3268 4668 3338 1273
2438 1273 -671 -1736 -4458 -3909 -2545 -3554 -1178 -372 2222 1229 3221 -556 -4730 -3239 -1205 -774
2422 -774 -979 -1960 -2251 -1544 -2690 -2140 1330 -1144 82 -474 -936 1112 784 357 -545 1480 -2750 -3687
2404c687R30J316N21O51J021K574K552j372m442q18O00j59J881m47m757J880K400
2387F44o76l237p15K964K543Ro49j166J290l8K297J973j101k86P87k375J907N49
2369D720K042k087J106R0k715o06l709o056j7K172P99J910K797R95j56J78j069
2352C94k064N22J592n18L047k1k987o69o9J692l77K175L295k810l951L633J376
2335D260l986O26l547J823J494J502j87q45k175J982J476J477K46k088j178j380
2319e00j822M026r62O74L341L062o208j203L956J526l03j788k209l949k95p9q50
2302c583M151K382k562m796J759N335P67j314N35K489J392j667l250k897K638
2287A379q84L05p22R49n86p83j077Q75Q75Q07j084J142L140j007j582j233K152
$$ plain form
2404 -3687 -2757 -1441 -920 -269 752 3326 5878 4506 64 -754 -154 -313 1568 1121 -3636 -1756 644
2387 644 -32 -3269 -3984 -1020 1523 1532 883 -283 1007 969 3266 5239 4138 3852 4639 2264 4171 4720
2369 4720 6762 4675 5781 5871 3156 2550 -1159 -7215 -7232 -5060 -4261 -2351 446 1441 1285 1463 394
2352 394 -1670 -1148 444 -74 2973 2952 -35 -704 -773 919 542 2717 6012 3202 -749 2884 4260
2335 4260 274 900 -2647 -824 670 2172 1985 1140 -1035 947 2423 3900 4146 2058 880 -500
2319 -500 -2322 1704 742 1416 4757 7819 1611 408 4364 5890 5587 3799 1590 -2359 -2654 -2733 -3583
2302 -3583 568 2950 388 -4408 -2649 2686 3453 2139 2674 5163 6555 4888 1638 -1259 1379
2287 1379 495 800 78 1027 441 -342 -1419 -544 331 1138 54 1196 4336 3329 1747 514 2666
2270B666j767J809J934j02j686l673J386J166L024L407j468KL66j500K794M25
2254H783m469j805m861k01K27J469j321k563k527J995L526j598l162j087J975
2239e619N711O7p96J795j04k897J718K598J159K603l545Q65K368q85l941l442
2223b345p31P3K338J588K296J695l833l235R9K270J75J003j008k661J071J614
2207D09M62j408J85K043j511l815J270m462j834K926P82K476K670M19p55j607
2191a750q28J120K033o35J215L8P25P82p31J073K08j2o34m225QJ457j154J68n9
2172a201j421J783P71q37j64m82j66M92j926l009K343K608l083R43N076J230j776
2155A181n0l65l911J88J459j946k798M268o31m383j255L057N05k690L062k68m70
$$ plain form
2270 2666 899 2708 4642 4540 2854 -819 567 1733 4757 8164 6696 6698 7064 5564 8358 8783
2254 8783 4314 2509 -2352 -2553 -2326 -857 -2178 -4741 -7268 -5273 -1747 -3345 -6507 -7594 -5619
2239 -5619 92 159 -637 1158 1054 -1843 -125 2473 3632 6235 2690 3555 5923 5038 1097 -2345
2223 -2345 -3076 -3003 -665 923 3219 4914 1081 -2154 -2055 215 390 1393 385 -2276 -1205 409
2207 409 871 -537 -352 1691 180 -3635 -2365 -6827 -8661 -5735 -4953 -2477 193 612 -143 -1750
2191 -1750 -2578 -1458 575 -60 1155 1193 1918 2700 1969 3042 3250 3238 2604 -1621 -1613 -156 -1310 -1142 -1201
2172 -1201 -2622 -839 -68 -905 -1069 -1551 -1717 -1225 -3151 -6160 -3817 -1209 -4292 -3349 1727 2957 1181
2155 1181 1131 766 -3145 -2957 -1498 -3444 -6242 -1974 -2605 -6988 -8243 -5186 -4681 -7371 -4309 -4577 -5047
2138e047k186M61M067j285p92q75J24J894M303K104j761J118L871q47m416K780
2122C513o6j265N08K697L791l121R02l327m514j944J845J971J046j009m157J375
2106a755K247o92j441J040J949j384k646K038K534J207J281J437L23k004r67P58
2090C925k378l491j527K292R56L10L133j272l987k327p44q31N29J788J83J166
2074b275K553N33j383q17j766j198K16l79J223J274J679l069j217K915R80NJ873
2057A147j454o393K33K858L258O17l112j093p07M56J413O09l458M979J554j267
2041c60J46O9j23N12j131J681R04j673k174j059R95J570M0M48l07j618J313M378
2023C611M700l75k343k704j65J46P23K543k684m04J761k221q87J422l7K267K406
$$ plain form
2138 -5047 -7233 -6772 -2705 -3990 -4782 -5657 -5533 -3639 664 2768 1007 2125 5996 5149 733 3513
2122 3513 3447 2182 2690 5387 9178 6057 6959 3632 -882 -2826 -981 990 2036 1027 -3130 -1755
2106 -1755 492 -200 -1641 -601 1348 -36 -2682 -644 1890 3097 4378 5815 6138 4134 3167 3925
2090 3925 1547 -1944 -3471 -1179 -223 87 3220 1948 -2039 -4366 -5110 -5941 -5412 -3624 -3441 -2275
2074 -2275 278 811 -572 -1389 -3155 -4353 -4137 -4516 -3293 -2019 -340 -3409 -4626 -1711 -731 -726 1147
2057 1147 -307 -6700 -6467 -3609 -351 266 -2846 -3939 -4646 -4190 -2777 -2168 -5626 -647 907 -360
2041 -360 -214 -145 -268 244 -887 794 1698 25 -2149 -3208 -2213 -643 -603 -155 -462 -2080 -767 3611
2023 3611 8311 7936 5593 2889 2724 2870 3593 6136 3452 3048 4809 2588 1701 3123 3086 5353 7759
2006G759o82j239j690j246j373l56qJ309n8k492k563J615L648J813j579K113O10
1989E581Q84j449J49k266r61K573k895m049J228M566O3l869J303L907k150q1J328
1972C862J002k321k792K41k477o99K534P41K780M483O1j138m344P45R66m404k00
1955i60L784K219r94k023l142J23l49k665P55K067n17K114L905J195j212j161
1939C139l730O8j66K173K733J373m892l050j35j115N56L509K236q45n03l135L34
1922a450j007k58L328K627k405l775J7L790M420J267n91k91N55K748r27n322n216
1905b490j291J982k063J432L910M59P52j997M1l45R21L383n72k091l299j246j237
1888c751j090J298K247J590K389o4j148J509L037J924j984r59n27n32J435p77
$$ plain form
2006 7759 7077 5838 4148 2902 1529 1173 1165 2474 2416 -76 -2639 -1024 2624 4437 2858 4971 5581
1989 5581 6465 5016 5165 2899 1938 4511 1616 -2433 -1205 3361 3424 -445 858 4765 2615 2534 3862
1972 3862 4864 2543 -249 -8 -2485 -3184 -650 91 2871 7354 7415 6277 1933 2678 3644 -760 -960
1955 -960 2824 5043 4049 2026 -1116 -993 -1342 -4007 -3252 -1185 -1702 412 4317 5512 4300 3139
1939 3139 -591 -523 -689 1484 4217 5590 698 -2352 -2487 -3602 -3046 463 2699 1854 1351 -1784 -1450
1922 -1450 -2457 -2715 613 3240 835 -2940 -2923 867 5287 6554 5963 5672 6227 8975 8048 2726 -2490
1905 -2490 -3781 -1799 -3862 -2430 1480 1939 2691 694 735 390 1311 4694 4122 2031 -1268 -2514 -3751
1888 -3751 -4841 -3543 -1296 294 2683 2619 1471 2980 6017 7941 5957 4998 4471 3939 5374 4597
1872D597l379m717o74J797j793L264K452j120K90Q0j986m79K313L671p47k191
1856A378k312J388m5j628j907L11J161r9M829K782j418J72k041J452p45k134J394
1839B538K51l741j142M959j595k939J013J861K979Q13j912j606j538k680n71n09
1823c819K52N171K276Q08K076k206j185k636l42J250J397R29j494j60j407l6Q88
1806A762j312J050J620J072J626l474K148J437k735O74J244J219J626j053k510
1791D394j808j081k297q64L601J315r23Q2K462j604o590j159l63q87J272J705
1775b745N39K644K248o05J291j012M1l336k28K903J05k359n44j93J827J116j111
1758E81l008j172P77K015K972L77k213L07J560p82q20L88J170j551j203K03n66
$$ plain form
1872 4597 1218 -3499 -4173 -2376 -4169 -905 1547 427 717 797 -1189 -1668 645 4316 3569 1378
1856 1378 -934 454 409 -1219 -3126 -2815 -1654 -1753 3076 5858 4440 4612 2571 4023 3278 1144 2538
1839 2538 2789 -952 -2094 2865 1270 -1669 -656 1205 4184 4997 3085 1479 -59 -2739 -3310 -3819
1823 -3819 -3567 1604 3880 4688 6764 4558 3373 737 395 1645 3042 3971 2477 2317 910 874 1762
1806 1762 450 1500 3120 4192 5818 2344 4492 5929 3194 3868 5112 6331 7957 6904 4394
1791 4394 2586 1505 -792 -1656 1945 3260 2337 2419 4881 3277 -3313 -4472 -4835 -5722 -4450 -2745
1775 -2745 -2206 438 2686 2081 3372 2360 2401 -935 -1163 1740 1845 -514 -1058 -1251 576 1692 581
1758 581 -2427 -3599 -2822 -807 2165 2542 329 636 2196 1414 594 982 2152 601 -602 -399 -965
1741i65k554j308L083J094J779M05j804K011Q13K52j33J408J076k358k79K55Q67
1724C642Q57l841n488o69L638K714p49J760R61L138O46k818l377o67J647P09L012
1707E115j239L28J150k276j673o22j17K932M25M759L42l444k683J792J57m394
1691E52R89J345J016O55k362k891l240j49Q17M008M244o70j121j849q70K504j719
1674A259k885J723K388k588k820K536N82p39L79j444R12L09l42q52J768K171n83
1657A774j856l342J949K505J274M592K277n461r42K633q55l599J422J44j205o99
1641F11K762K033K120q8l128m718j716j0J418K143j081J048J56R38Q66K683O3
1624F100J560J012l118J619N49j642j094L10j507k137j722o858N78J152J402K983
$$ plain form
1741 -965 -3519 -4827 -1744 -650 1129 1534 -270 1741 2554 2806 2673 4081 5157 2799 2520 2775 3642
1724 3642 4499 658 -4830 -5499 -1861 853 104 1864 2825 5963 6609 3791 414 -253 1394 2103 5115
1707 5115 3876 4204 5354 3078 1405 783 666 3598 4023 8782 9124 5680 2997 4789 4946 552
1691 552 1541 2886 3902 4557 2195 -696 -3936 -4085 -3268 740 4984 4314 3193 1344 474 2978 1259
1674 1259 -1626 97 2485 -103 -2923 -387 195 -544 -165 -1609 -697 -388 -730 -1582 186 2357 1774
1657 1774 -82 -3424 -1475 1030 2304 6896 9173 3712 2770 5403 4548 949 2371 2515 1310 611
1641 611 3373 5406 7526 7438 4310 -408 -2124 -2134 -716 1427 346 1394 1550 2488 3354 6037 6100
1624 6100 7660 8672 5554 7173 7722 6080 4986 5296 3789 1652 -70 -6928 -6350 -5198 -3796 -813
1608h13J109k55O28j671j175L2J018n33l93J777L53j801J182M863k202m53k64
1591A402J244N04o14j095L0J131j391J74J975L14k246K31K430J683L687m936n521
1574i98j142L283L747k215L94L370K90m376m672j87K982J756r78j040O07j661
$$ plain form
1608 -813 296 41 669 -1002 -2177 -2145 -1127 -1660 -2053 -276 77 -1724 -542 4321 2119 1666 1402
1591 1402 2646 3150 2536 1441 1471 2602 1211 1385 3360 3674 1428 1659 4089 5772 9459 4523 -998
1574 -998 -2140 1143 4890 2675 3069 6439 6729 2353 -2319 -2506 476 2232 1254 214 821 -840
$$ [...]
##END NTUPLES=NMR SPECTRUM
##END=
