##TITLE=Analysis number 317467
Compound Code cc 27246
Book Reference 422/151
Project Code qc-cat
Chemist Name robb
##JCAMPDX= 6.0         $$ Bruker NMR JCAMP-DX V2.0
##DATA TYPE= NMR SPECTRUM
##DATA CLASS= NTUPLES
##ORIGIN= Bruker BioSpin GmbH
##OWNER= nmr
$$ XWIN-NMR		Version 3.5
$$ Tue Feb 21 11:34:03 2006 GMT Standard Time (UT+0h)  MAYBRIDGE\nmr@NMR_250MHZ
##.OBSERVE FREQUENCY= 250.131544655141
##.OBSERVE NUCLEUS= ^1H
##.ACQUISITION MODE= SIMULTANEOUS (DQD)
##.ACQUISITION SCHEME= undefined
##.AVERAGES= 16
##.DIGITISER RES= 18
##SPECTROMETER/DATA SYSTEM= dpx250
##.PULSE SEQUENCE= zg30
##.SOLVENT NAME= CDCl3
##.SHIFT REFERENCE= (INTERNAL, CDCl3, 0, 16.522)
##AUDIT TRAIL= $$ (NUMBER, WHEN, WHO, WHERE, WHAT)
$$ ##TITLE= Audit trail, XWIN-NMR		Version 3.5
$$ ##JCAMPDX= 5.01
$$ ##ORIGIN= Bruker BioSpin GmbH
$$ ##OWNER= nmr
$$ C:\u/data/dgb/nmr/ADRS/16520/pdata/1/auditp.txt
$$ ##AUDIT TRAIL=  $$ (NUMBER, WHEN, WHO, WHERE, WHAT)
(   1,<2006-02-21 11:33:42.25 +000>,<MAYBRIDGE\nmr>,<NMR_250MHZ>,
      <created by zg, POWCHK disabled, PULCHK disabled
       configuration hash MD5:
       84 BC 41 DB A1 6E 1D 46 DA 25 12 A5 C1 ED C5 3A
       data hash MD5: 64K
       F3 06 F7 9F 39 68 60 52 CE 0A E5 EE 86 3B 93 DE>)
(   2,<2006-02-21 11:33:54.80 +000>,<MAYBRIDGE\nmr>,<NMR_250MHZ>,
      <Start of raw data processing
       ef LB = 0.3 FT_mod = 6 PKNL = 1 SI = 32K 
       data hash MD5: 32K
       C6 56 CC 07 62 45 1D E7 11 B8 6C 15 D0 D8 B9 4B>)
(   3,<2006-02-21 11:33:56.86 +000>,<MAYBRIDGE\nmr>,<NMR_250MHZ>,
      <apk 
       data hash MD5: 32K
       A3 03 AB 22 0B 56 58 A3 F6 58 B6 26 B0 93 40 BA>)
(   4,<2006-02-21 11:33:57.64 +000>,<MAYBRIDGE\nmr>,<NMR_250MHZ>,
      <abs ABSG = 5 
       data hash MD5: 32K
       B5 D7 EA F7 7C 26 82 AF 8C 41 26 1E 8A 9C 87 5F>)
$$ ##END=
$$ 
$$ hash MD5
$$ 37 45 3B 49 4F F7 F7 10 13 36 17 E4 D5 8C 4B 59
##$RELAX= 
##$RELAX= 
##$RELAX= 
##$RELAX= 
##$RELAX= 
##$RELAX= 
##$RELAX= 
$$ Bruker specific parameters
$$ --------------------------
##$DU= <C:\u>
##$EXPNO= 16520
##$NAME= <ADRS>
##$PROCNO= 1
##$TYPE= <nmr>
##$USER= <dgb>
##$AMP= (0..31)
100 100 100 100 100 100 100 100 100 100 100 100 100 100 100 100 100 100 
100 100 100 100 100 100 100 100 100 100 100 100 100 100 
##$AQSEQ= 0
##$AQ_mod= 3
##$AUNM= <au_zg>
##$AUTOPOS= <22 >
##$BF1= 250.13
##$BF2= 250.13
##$BF3= 250.13
##$BF4= 250.13
##$BF5= 500.13
##$BF6= 500.13
##$BF7= 500.13
##$BF8= 500.13
##$BYTORDA= 1
##$CFDGTYP= 0
##$CFRGTYP= 5
##$CHEMSTR= <none>
##$CNST= (0..31)
1 1 145 1 1 1 1 1 1 1 1 1 1 1 1 1 1 1 1 1 1 1 1 1 1 1 1 1 1 1 1 1 
##$CPDPRG= <>
##$CPDPRG1= <>
##$CPDPRG2= <>
##$CPDPRG3= <>
##$CPDPRG4= <mlev>
##$CPDPRG5= <mlev>
##$CPDPRG6= <mlev>
##$CPDPRG7= <mlev>
##$CPDPRG8= <mlev>
##$CPDPRGB= <>
##$CPDPRGT= <>
##$D= (0..31)
0 1 0 0 0 0 0 0 0 0.06 0 0 0 0 0 0 0.0002 0 0 0 0 0 0 0 0 0 0 0 0 0 0 
0 
##$DATE= 1140521621
##$DBL= (0..7)
120 120 120 120 120 120 120 120 
##$DBP= (0..7)
150 150 150 150 150 150 150 150 
##$DBP07= 0
##$DBPNAM0= <>
##$DBPNAM1= <>
$$ [...]
##$SUBNAM7= <"">
##$SUBNAM8= <"">
##$SUBNAM9= <"">
##$SW= 20.6930455092707
##$SWIBOX= (0..15)
0 0 3 0 0 0 0 0 0 0 0 0 0 0 0 0 
##$SW_h= 5175.983436853
##$TD= 65536
##$TD0= 1
##$TE= 294.16
##$TE2= 300
##$TE3= 300
##$TEG= 300
##$TL= (0..7)
0 120 120 120 120 120 120 120 
##$TP= (0..7)
150 150 150 150 150 150 150 150 
##$TP07= 0
##$TPNAME0= <>
##$TPNAME1= <>
##$TPNAME2= <>
##$TPNAME3= <>
##$TPNAME4= <>
##$TPNAME5= <>
##$TPNAME6= <>
##$TPNAME7= <>
##$TPOAL= (0..7)
0.5 0.5 0.5 0.5 0.5 0.5 0.5 0.5 
##$TPOFFS= (0..7)
0 0 0 0 0 0 0 0 
##$TUNHIN= 0
##$TUNHOUT= 0
##$TUNXOUT= 0
##$USERA1= <user>
##$USERA2= <user>
##$USERA3= <user>
##$USERA4= <user>
##$USERA5= <user>
##$V9= 5
##$VALIST= <valist>
##$VCLIST= <CCCCCCCCCCCCCCC>
##$VD= 0
##$VDLIST= <DDDDDDDDDDDDDDD>
##$VPLIST= <PPPPPPPPPPPPPPP>
##$VTLIST= <TTTTTTTTTTTTTTT>
##$WBST= 1024
##$WBSW= 4
##$XGAIN= (0..3)
0 0 0 0 
##$XL= 0
##$YL= 0
##$YMAX_a= 681627
##$YMIN_a= -503997
##$ZGOPTNS= <>
##$ZL1= 120
##$ZL2= 120
##$ZL3= 120
##$ZL4= 120
##$ABSF1= 16.522
##$ABSF2= -4.171173
##$ABSG= 5
##$ABSL= 3
##$ALPHA= 0
##$AQORDER= 0
##$ASSFAC= 0
##$ASSFACI= 0
##$ASSFACX= 0
##$ASSWID= 0
##$AUNMP= <proc_1d>
##$AZFE= 0.1
##$AZFW= 0.1
##$BCFW= 0
##$BC_mod= 0
##$BYTORDP= 0
##$COROFFS= 0
##$CY= 12.5
##$DATMOD= 1
##$DC= 0
##$DFILT= <>
##$DTYPP= 0
##$F1P= 14.0000005364418
##$F2P= -0.99999901652339
##$FCOR= 0.5
##$FTSIZE= 32768
##$FT_mod= 6
##$GAMMA= 0
##$GB= 0
##$INTBC= 1
##$INTSCL= 1
##$ISEN= 128
##$LB= 0.3
##$LEV0= 0
##$LPBIN= 0
##$MAXI= 10000
##$MC2= 0
##$MEAN= 0
##$ME_mod= 0
##$MI= 0
##$NCOEF= 0
##$NC_proc= -2
##$NLEV= 6
##$NOISF1= 0
##$NOISF2= 0
##$NSP= 0
##$NTH_PI= 0
##$NZP= 0
##$OFFSET= 16.522
##$PC= 1
##$PHC0= 92.27925
##$PHC1= 4.459929
##$PH_mod= 1
##$PKNL= yes
##$PPARMOD= 0
##$PSCAL= 4
##$PSIGN= 0
##$REVERSE= no
##$SF= 250.13
##$SI= 32768
##$SIGF1= 0
##$SIGF2= 0
##$SINO= 400
##$SIOLD= 32768
##$SREGLST= <1H.CDCl3>
##$SSB= 0
##$STSI= 32768
##$STSR= 0
##$SW_p= 5175.98343685301
##$SYMM= 0
##$S_DEV= 0
##$TDeff= 65536
##$TDoff= 0
##$TI= <Analysis number 999999
Compound Code 99
Book Reference 9
Project Code 9>
##$TILT= no
##$TM1= 0
##$TM2= 0
##$TOPLEV= 0
##$USERP1= <user>
##$USERP2= <user>
##$USERP3= <user>
##$USERP4= <user>
##$USERP5= <user>
##$WDW= 1
##$XDIM= 32768
##$YMAX_p= 306533017
##$YMIN_p= -17617
$$ End of Bruker specific parameters
$$ ---------------------------------
##NTUPLES= NMR SPECTRUM
##VAR_NAME=  FREQUENCY,     SPECTRUM/REAL,   SPECTRUM/IMAG
##SYMBOL=    X,             R,               I
##VAR_TYPE=  INDEPENDENT,   DEPENDENT,       DEPENDENT
##VAR_FORM=  AFFN,          ASDF,            ASDF
##VAR_DIM=   32768,         32768,           32768
##UNITS=     HZ,            ARBITRARY UNITS, ARBITRARY UNITS
##FACTOR=    0.157963299565203, 1,           1
##FIRST=     4132.6476996994, 0,             0
##LAST=      -1043.33573715361, 0,           0
##MIN=       -1043.33573715361, -17617,      0
##MAX=       4132.6476996994, 306533017,     0
$$ Real data points
##PAGE= N=1
##DATA TABLE= (X++(R..R)), XYDATA
$$ [...]
19778 -7680 -3119 -2486 -5997 -6286 -2476 -6911 -7320 -4826 2237 6501 1195 -3566 -294 464 386 -2435
19762 -2435 -5090 -4679 -6020 -3929 -3212 -867 -1254 -492 -1106 -4503 -5789 -7151 -10769 -11684 -11351 -12074 -6031
19745 -6031 -1189 2226 -155 -4470 -2327 -1026 -2999 -459 2547 3970 4765 1905 2108 4749 6341
19730 6341 12257 16434 17240 16583 15413 14549 12179 10360 6867 6052 8226 6740 5264 2375 -1059 1779
19714 1779 3068 3512 5737 5543 3476 264 -2754 -467 -2221 -2504 -1913 -670 2733 671 -4316 -5492
19698 -5492 -8838 -8367 -4135 -3753 -6947 -7235 -3517 -5879 -3990 199 -2974 -444 -4403 -5048 -2499 -4292
19682 -4292 -2267 807 377 -2936 -8979 -7884 -8570 -7927 -6186 -6825 -5163 -1296 -557 -967 -2685 -6216
19666 -6216 -8300 -10185 -12857 -7337 -2536 -252 -1604 -4508 -6304 -5172 -2543 108 -1155 -2810 -1768
19651 -1768 -1745 -3376 -7041 -6125 -2248 -1604 -4018 -4460 -7583 -6944 -1705 1551 2049 2379 3590 5224 -480
19634 -480 -3659 -1204 -79 580 -441 2206 1952 38 -3472 -8474 -8383 -8045 -14084 -13563 -11591 -8181
19618 -8181 -4908 -1544 4297 4372 2133 -3498 -8017 -6883 -3237 416 -1607 -5289 -5565 -5094 -6320 -5857
19602 -5857 -3705 1072 1796 -260 -1889 587 1915 513 -3928 -3902 130 -627 -4134 -3841 -6171 -5837
19586 -5837 -2894 -5327 -5025 696 2316 -2681 -6816 -8643 -4941 -2152 -2105 -6171 -6718 -3693 511 3608
19570 3608 -303 -1967 -2301 -805 538 -3303 -4013 -3829 -4593 -7119 -4167 -1688 -280 116 -2495 -4998
19554 -4998 -6269 -5355 -3886 -3440 -5040 -8001 -5709 1773 1138 1464 5343 10488 11003 6764 -174 -1195
19538 -1195 1404 -1332 -4914 -5548 -1198 -1209 -2090 -5211 -6156 -1143 -1038 384 -2966 -5246 -1624 -4227
19522 -4227 -7290 -9344 -11492 -8466 -2602 -1677 -1240 -5248 -6423 -4675 -7701 -8205 -1296 7011 4949
19507 4949 -636 267 2229 -2529 -8225 -9720 -8187 -3301 -747 -76 -322 2520 1697 -2059 -4868 -5182
19491 -5182 -4757 -2202 -537 -1012 -3745 -2639 -822 32 -3834 -6942 -3817 -1859 -1925 -2115 -110 5
19475 5 -1528 -3317 -2242 219 -5645 -7585 -12137 -9121 -8305 -2243 1362 -5903 -8531 -8924 -7161 -5882
19459 -5882 -3976 -4601 -5427 -6611 -6089 -6300 -5111 -7705 -7508 -7736 -7994 -4950 -6502 -4805 -5248 -4131 -4167
19442 -4167 -1241 35 -1963 -935 -4611 -6546 -3276 -1820 -4170 -4144 -766 -1659 -3946 957 3725
19427 3725 2060 -2915 -9677 -13281 -13617 -11326 -11564 -9735 -8375 -4902 -2793 -570 -1205 -5862 -3679
19412 -3679 1286 2572 6053 1129 -3690 -7030 -5633 -3159 -1976 -4967 -7034 -1820 703 334 -4196
19397 -4196 -6864 -7080 -5963 -459 3468 2314 -1718 -512 -4497 -6753 -5564 -2576 -1347 979 -3753
19382 -3753 -3429 1234 764 -481 4886 4172 2239 5229 5175 2181 1579 -1416 244 449 -4924 -7319
19366 -7319 -9076 -9242 -8337 -8665 -4775 -569 -65 -130 1986 772 -1015 -1515 348 686 1587 -2152 -4404
19349 -4404 -5131 -8244 -8072 -5772 -3294 -3355 1631 3789 -211 -6482 -9989 -7724 -8143 -9629 -6324 -5792
19333 -5792 -2339 -1266 -4233 -1092 3066 1874 -2325 -805 -1836 -454 9 109 -1694 -2375 -1330
19318 -1330 1394 215 -4508 -5008 -3954 -1273 -1205 -1640 -2035 -4361 -4278 -1914 -2139 -2916 -567 -3598 -3600 -1119
19300 -1119 -3215 -3738 -1986 -2153 -2220 -1913 -5201 -1837 -676 443 -810 1669 3301 2859 2278 1587 -2302
19283 -2302 -6119 -4185 -4076 -6252 -4007 -6662 -6341 -6361 -3285 453 2616 -3211 -8259 -7981 -5268 -4523
19267 -4523 -5892 -6527 -7510 -4820 -732 -2483 -1237 1993 -467 554 2905 1745 850 1095 357 -4962
19251 -4962 -10494 -7774 -5723 -5635 -5650 -1596 1268 -935 -3742 -5327 -8815 -9211 -5402 -1455 -2798 -3494
19235 -3494 -4446 -5325 -2294 -950 -55 -4379 -4257 -4845 -5527 -5229 -4468 -2612 1356 2038 6607 5490 717
19218 717 -1983 -900 2186 2430 3578 4819 3960 6763 9566 13793 19610 19318 20579 23947 24670 19652
19202 19652 21242 20916 17875 19483 23269 23900 21182 18451 17797 18295 18816 17384 13951 10072 10599 10428
19186 10428 6261 6669 8515 4676 -1602 -2648 1494 3005 3244 -2505 -5145 -2143 -7034 -5932 -4506
19171 -4506 -5612 -5893 -6429 -7956 -10367 -7356 64 2734 530 1528 814 2705 3600 7588 11223 14883
19155 14883 19951 16353 13121 14142 15605 20963 23692 23542 25664 27493 28040 25458 22440 21196 22193
19140 22193 18472 15823 9337 4354 -293 -1466 1855 3840 5475 3379 -44 -2341 -3500 839
19126 839 5026 3798 4245 7931 3746 700 -1068 -2263 887 -2894 -3403 -1827 2197 696 -2275
19111 -2275 -2651 782 3328 5381 3269 -511 -535 -585 -2762 -311 -2990 -4118 -3129 -5212 -4076 -3140
19095 -3140 -1120 -1794 -4420 -4731 -3837 -95 1070 1286 3707 4233 1055 -317 -5137 -7232 -2574 749
19079 749 5107 3060 1340 -2551 -4571 -4266 -1042 473 -4684 -2240 933 -1284 -1512 636 575 3407
19063 3407 3179 888 -51 2819 71 -2029 -3561 -2181 4019 2740 -1018 -1061 -594 -2767 -538 -2778
19047 -2778 -5940 -5975 -7478 -9657 -10136 -1833 1180 990 -800 -895 -427 -1467 -282 -2830 -4560 -4057 -6017
19030 -6017 -3659 -1451 272 -440 -4045 -1692 791 476 246 585 -860 491 129 292 1585 1169
19014 1169 1017 -2256 422 5264 6442 5817 3899 2236 2895 1309 -2752 115 -2609 -3526 -6029 -7315
18998 -7315 -1068 151 -1233 -2635 -3506 -4173 -4408 -5656 -2231 1204 1916 2310 4516 7631 7788 8396
18982 8396 9764 7942 5945 6470 9428 7229 2231 -2711 -3922 -3381 -2229 -1579 2353 2255 -3582 -5680
18966 -5680 -6018 -4335 -4861 -7376 -4692 -7316 -4414 -3349 -3196 -539 5619 7422 4870 697 3084
18951 3084 1114 2566 3001 2011 1373 4489 4179 459 2469 3663 93 419 3094 261 922 1711
18935 1711 796 623 -890 239 128 -763 -1933 -6294 -7128 -5433 -328 102 2502 3192 1596 -2655
18919 -2655 -6285 -7951 -8222 -7766 -4727 -1653 -4888 -11366 -10585 -4960 1785 -1609 -3831 -746 656
18904 656 38 3721 3198 653 250 -992 -1820 -349 -3253 -3488 -2619 -2588 -309 -11 -1880 -3974 -214
18887 -214 -120 -5915 -6362 -2085 -1595 635 6455 4112 33 -1192 -3150 -4206 -6169 -5865 -6277 -7979
18871 -7979 -7378 -5120 -6500 -3533 -2502 -2486 -5192 -3961 -232 1681 1025 -1919 -4412 -7411 -4707 -1655
18855 -1655 -2416 -2771 -3168 65 1265 597 -3077 -3828 -1043 3245 7702 10870 9137 1499 -4094 -5946
18839 -5946 -2736 1311 4009 2105 -1443 425 1011 1958 -1464 -5756 -3081 -1751 1512 2468 -1510
18824 -1510 -4540 -5726 -444 1451 67 17 -2591 -1667 2250 -922 -472 -1774 -1909 -3156 1473 1404
18808 1404 130 -1631 -351 -885 -229 1843 -1215 -3423 -3173 -5858 -6772 -7637 -10600 -12426 -9833 -4897
18792 -4897 -3417 -2798 -456 -465 25 -799 -6545 -2099 505 1907 -1384 -6326 -6805 -5128 726 5078
18776 5078 2368 4037 3684 4242 5419 5314 5836 4390 5128 9524 15038 26294 38273 40003 34587
18761 34587 27185 22876 15759 10051 7987 7707 11664 11400 9531 11708 12605 11077 10918 9468 6015
18746 6015 2412 3424 7319 11963 11626 4135 965 -1961 -2818 -6154 -7017 -7898 -11018 -8707 -5743 -230
18730 -230 -261 -3693 -9912 -6048 331 1901 -1089 -3396 -1322 3286 2732 2753 2424 2588 1409 -710 -7126
18713 -7126 -4060 2296 3842 6131 8530 12745 12333 11816 12795 9611 3185 -264 939 3486 5614
18698 5614 6301 2225 2183 3970 2770 4139 5262 6240 7495 5648 2514 -2712 -5215 -4915 -3139 639
18682 639 3557 3103 2367 1626 1406 -1745 -1074 -472 1123 3228 5420 2407 -1429 -3795 -1271 1982
18666 1982 5273 8863 7774 3484 1505 3320 2912 1798 3146 1520 1251 6959 10525 12765 11773
18651 11773 14421 12533 9484 7874 9848 11709 9451 9161 13730 11918 9883 6301 3581 3933 8175
18636 8175 6050 5220 3417 1855 2479 2391 4569 12014 13163 7205 4038 5101 6370 5861 4090 860
18620 860 -827 2275 8011 6752 6219 10221 15933 14190 13838 8388 5282 12406 15492 14551 16684 18359
18604 18359 20977 29126 29829 29610 27167 25028 18857 16965 19534 19179 19660 17507 13842 13549 10093 6422
18588 6422 7767 8764 11095 7509 9992 14768 13446 9125 9643 7137 6283 10444 14995 13138 11262
18573 11262 9915 7542 7108 5862 3556 8336 8058 5477 4138 2852 4129 6890 9748 14792 14844
18558 14844 11417 13460 11665 10221 13396 11124 8763 7497 7385 6070 8156 10610 7624 6646 7703
18543 7703 9653 13117 15498 14894 12797 11006 8709 4070 1765 3902 7481 6760 5598 7257 6270
18528 6270 2606 4046 5606 4750 1924 2637 3531 2599 3119 4914 5315 4321 2911 6535 4017 545
18512 545 1933 2900 2724 1049 4511 5845 212 -75 3254 7910 10612 11609 8243 3743 2534 3654
18496 3654 1850 -973 4665 8736 9703 8708 10149 9757 3649 420 4182 4632 2973 1809 1058 3908
18480 3908 6299 6665 8368 5011 5675 4924 2740 2974 1238 -2557 -1607 499 3895 8128 11235 8872
18464 8872 5296 4380 3072 3566 3390 3469 4820 5166 2089 -347 -883 -2284 -1963 -246 -283 2768 185
18447 185 -2250 76 888 -174 -2687 -3130 944 5018 6100 7042 5638 4208 2679 4988 4547 2269
18431 2269 2210 4333 7957 8109 4962 4873 885 -881 -1616 -4170 -3165 -2731 -551 5398 8827 8088 9929
18414 9929 11888 8437 5532 8442 7007 5531 9405 9414 9924 12566 14302 11352 11022 9004 7343 4609
18398 4609 3866 11156 13667 9442 7738 9357 5819 4757 8048 6482 4597 6376 7205 8384 10334
18383 10334 11038 8953 9414 10421 11010 10849 6358 5562 7605 6376 4253 3400 4743 5349 8340 9011
18367 9011 6025 7951 11136 7505 4634 3122 5552 8796 8104 4346 1699 417 970 5610 4560
18352 4560 1589 1273 213 -2560 -1927 3299 4953 5100 3365 880 3187 1226 2615 3639 3500 5163
18336 5163 4163 6762 9496 10656 9618 7588 9807 13854 11679 10958 12792 12476 13932 9753 4216
18321 4216 3805 11433 10911 12389 12367 12924 9529 9845 9121 10562 12054 8643 4469 5167 5575 6678 8544
18304 8544 9260 8728 11334 12627 17492 24440 22558 22115 25093 30586 35558 42559 43808 49907 57210
18289 57210 65825 75041 82820 90420 96863 103407 110425 112805 118151 119421 120580 122808 123956 123523 118424
18274 118424 109903 105819 107366 111843 107583 100650 95482 86342 76627 68031 60313 54585 52008 48765
18260 48765 44648 43651 39121 40493 39069 33809 29239 28126 36386 38609 38014 38326 40207 42069 48474
18245 48474 60485 72491 75410 78134 83270 91151 103224 112443 122368 128069 129649 128327 129625 135110
18231 135110 135493 134101 132426 124882 117301 112436 109842 108706 106506 102416 90288 82133 75668 69719
18217 69719 65574 61782 55286 49889 47460 45551 44494 42797 43554 42383 39993 33966 28478 29888 34428
18202 34428 34756 30342 29739 32936 29390 26054 26561 28320 33215 32086 33083 27370 26265 28872 30627
18187 30627 33622 32148 33904 32813 26811 26331 30838 33164 37069 37139 43293 49248 50242 49851 50128 49799
18171 49799 50607 54655 54868 55012 58814 61570 59595 54433 50145 49616 46736 43154 44370 47333 47399 47773
18155 47773 49422 46501 45829 45705 46041 43752 43680 45827 44805 46130 46475 52771 56407 57033 53829 56407
18139 56407 57169 59988 62273 60850 61820 64979 72791 80581 86584 94792 100957 107070 113396 121570 127558
18124 127558 138136 150798 162213 170495 185100 206699 227758 248607 273332 315218 367020 439560
18112 439560 539725 688293 926712 1334387 2104405 3583713 5564491 6445414 6124468
18103 6124468 5235988 3862637 2643682 1820464 1311316 997249 793892 656083 555485
18094 555485 485259 430636 381223 343571 316191 291800 270752 255835 230964 209425 197126
18083 197126 191301 183793 174452 173176 171810 164610 152833 146966 144593 134781 132154 128495 124482 118723
18069 118723 112531 109125 106711 107594 103375 105950 110362 113614 113354 111388 111081 112339 112702 111201 110951
18054 110951 107671 103895 100579 93662 91478 94210 93053 88191 88700 92126 93081 95110 99124 99374 95770
18039 95770 91448 91693 95093 100788 103289 101674 94396 88248 82953 78313 78574 79717 77304 75146 70042
18024 70042 71012 69984 65993 61667 65630 70429 71385 68102 66843 65719 62508 64490 66586 65612 70373
18009 70373 74859 80370 83378 87851 97234 104437 110398 126148 144906 167022 190816 221878 259988
17996 259988 304283 348519 396145 439181 482397 532084 572675 602211 623213 643836 660317
17985 660317 669350 679218 675424 670839 662573 636450 606830 575303 538178 493479 446222 400403
17973 400403 354790 317048 281528 253275 235265 216334 202218 199641 194555 187771 178088 174333
17961 174333 172390 170760 171732 177846 177251 179111 190762 200839 215609 239837 269253 297286 332786
17948 332786 375985 422949 479791 536929 594582 649837 696149 732043 761405 788214 808056
17937 808056 822952 829619 828270 827515 820503 797541 766302 726783 681208 634840 579801 523860
17925 523860 477598 433203 393865 363402 337883 315127 296318 276471 255206 240078 225312
17914 225312 217564 211266 205203 197555 188113 178761 172540 167240 164938 164531 167978 176862 188744 194790
17900 194790 193970 194388 200895 207285 213754 223899 232615 241157 251391 260436 267095 274104 278173 282079
17886 282079 283043 281927 286209 288952 281669 277911 273743 266912 261018 261254 258177 252874 247304 235465
17872 235465 225195 211897 202664 195515 190078 179819 180000 181952 186106 191343 196017 195762 191911 190169
17858 190169 189891 197094 200424 206921 219644 233957 249364 262959 279674 288989 294855 304229 318947
17845 318947 334755 348530 360897 379458 398824 414887 427493 435524 444319 447834 452085 454433
17833 454433 456353 459054 461170 458689 461758 472027 484911 504116 519857 537736 555289 569831
17821 569831 593228 627384 665746 707147 748724 802988 874918 953775 1031077 1096458 1156803
17810 1156803 1214523 1284273 1391214 1556267 1782109 2068951 2407087 2818459 3336895 3945298
17800 3945298 4591721 5254460 5999801 6886779 7827149 8685343 9549071 10554496 11692669
17791 11692669 12847054 13942192 15069112 16324856 17454093 18057820 18216717 18202259 18180524
17782 18180524 18251381 18398783 18447825 18101556 17362711 16283180 15058362 14004345 13260675
17773 13260675 12791129 12434800 12014961 11318391 10384390 9353848 8360179 7545320 6939805
17764 6939805 6488069 6090759 5710326 5342811 5025831 4802867 4690645 4708321 4868636 5176109
17754 5176109 5598965 6113444 6750448 7585687 8592330 9636492 10749833 12069735 13568246
17745 13568246 15112813 16611097 18112693 19816722 21620332 23076501 24011346 24448070
17737 24448070 24474597 24308789 24092573 23924010 23927520 23806952 23106367 21943414 20409201
17728 20409201 18726262 17300802 16245662 15396029 14557914 13592766 12356403 10972778
17720 10972778 9621513 8416452 7448487 6713342 6119667 5577740 5051012 4519093 4011888
17711 4011888 3562309 3177866 2866326 2613629 2406990 2230190 2075148 1938884 1814020
17702 1814020 1703326 1606642 1520159 1446498 1380943 1319573 1261767 1203484 1151828 1106774 1065370
17691 1065370 1038761 1021345 1010291 1005332 1007520 1013101 1014931 1020783 1028944 1045326 1076725 1130749
17679 1130749 1182255 1217463 1226952 1217258 1194327 1167834 1150298 1141896 1135230 1124972 1093377 1042415
17667 1042415 976293 902633 835040 777209 727913 686111 640978 596750 549968 504675 464332
17656 464332 432939 406180 386466 374391 363181 352728 344249 329228 317736 303743 291819 283453
17644 283453 276581 272314 270978 262690 250430 237027 229410 223970 218144 211893 206622 199348 188139
17631 188139 182283 179238 173779 173270 171394 169393 169027 171970 178408 182031 182817 185386 183940 182331 185028
17616 185028 181511 177209 176798 177933 175979 175300 176237 177584 183728 185714 186907 192482 197117 201584 203328
17601 203328 204207 204315 203822 204292 210771 214065 215028 213073 206516 199577 193495 191518 191846 192274 194295 192990
17585 192990 191676 196040 189692 179391 173264 172692 179249 189663 197300 201643 209199 221865 232123
17572 232123 238875 248869 254799 257190 252196 248268 247162 246957 245223 249884 256766 261987 267584 270080
17558 270080 267970 272002 274035 275498 278622 279877 277808 273513 272802 266115 259214 249244 242205 234845
17544 234845 224141 212681 201783 191947 179812 169389 161103 153473 147556 148724 147246 143014 141073
17531 141073 143164 146504 148327 151472 165253 177458 179149 179462 174108 166224 159244 156850 153201 146383
17517 146383 143178 139116 132458 129501 126336 118593 113516 116031 116245 119446 122411 124077 124998 129495 131827
17502 131827 126018 119455 115676 113450 112821 112813 114520 115221 111504 110706 109653 108921 107768 104274 101183 99958
17486 99958 104881 104961 104230 101502 107594 116525 118630 117223 119951 119652 121707 120647 119571 120971 122750
17471 122750 122957 123552 122864 120836 118122 118526 122601 121964 120693 124402 127226 133690 147183 156981 159265
17456 159265 160550 158174 150019 144123 138813 139156 139846 140212 143616 145279 147581 152384 159206 174211 190356
17441 190356 209752 243766 282249 300795 305782 297562 275433 249143 229960 217679 211561 211422
17429 211422 212362 217293 227579 243934 268225 289087 301761 313617 322466 326226 325514 330357 345824
17416 345824 373528 412625 466968 530303 588655 631437 652740 651937 631551 605994 588006 579415
17404 579415 584489 600148 632471 675683 729545 800968 894197 1027670 1213675 1472251 1835170
17393 1835170 2347491 3097570 4220864 5892882 8245280 11142706 14067976 16216064
17385 16216064 16908416 16024190 13937057 11308958 8750428 6635821 5068071 3978495
17377 3978495 3246374 2752029 2418227 2193368 2049539 1982191 1978388 2027384 2096830 2141462
17367 2141462 2137166 2093469 2027849 1946265 1865921 1791736 1732983 1685469 1652413 1634262 1633547 1640607
17355 1640607 1645076 1655032 1680735 1729841 1814636 1954882 2176879 2524271 3045077 3820657 4991390
17344 4991390 6763581 9365794 12888802 17077128 21191490 24189617 25259821 24161440
17336 24161440 21334447 17609209 13840720 10584415 8068483 6262771 5009044 4156159
17328 4156159 3586131 3214109 2992907 2895403 2900114 2964959 3031003 3038941 2964156 2802670 2582167
17317 2582167 2343935 2116726 1920927 1765231 1641503 1538918 1446997 1358546 1274298 1199222
17307 1199222 1137505 1096597 1082576 1094541 1139369 1224926 1359218 1559358 1856206 2299807
17297 2299807 2981095 4027587 5511914 7364488 9271730 10718607 11235309 10724217 9400399
17288 9400399 7692177 5997967 4575469 3503058 2746787 2227929 1871274 1626194 1459848
17279 1459848 1356493 1308981 1298935 1311912 1335989 1336095 1294236 1210949 1105506 998087 902996
17268 902996 823991 763846 722043 687058 651352 612142 570319 533650 498597 469199 451907
17257 451907 433196 410462 389054 362801 337422 316162 297276 283156 272466 260870 247415
17246 247415 235373 228139 228024 221469 213157 208180 207597 209183 202520 193168 183250 175624 168339 160532
17232 160532 162511 162441 158424 154981 154065 151858 150689 149050 147440 148441 145254 147360 150325 149065 144565
17217 144565 145283 149270 150971 149698 152507 153498 150376 143525 135014 128164 123592 119855 115878 110904 103148
17202 103148 98306 93100 83581 75735 71491 72291 70133 69240 71594 70349 69097 71127 69572 68778 69580
17187 69580 68781 65388 64180 61408 60773 63211 64902 65164 63026 56907 57514 58877 57574 59574 58253
17172 58253 55433 58722 61728 62798 60617 60668 62813 64456 61083 59255 55353 48820 45852 41036 40126
17157 40126 40416 34315 31900 32876 35232 36430 36950 36786 37868 44533 42792 40053 45348 51441 52287 54184
17141 54184 53553 49333 50555 46963 43440 44952 44683 44379 48643 47319 45917 47237 46043 47367 49995
17126 49995 52136 51685 51780 52358 53518 52376 51326 52747 49930 45191 42308 40133 38099 35851 36237 30897
17110 30897 27817 30410 29908 35273 37041 35024 31718 32350 32497 28603 29425 36515 38687 40994 43694
17095 43694 47185 46912 48617 47567 46805 50484 55079 57615 59094 59910 62196 67244 73839 76038 75353
17080 75353 76365 80060 84115 90939 92734 88268 82367 79790 79376 78973 74657 74235 72973 73514 69453
17065 69453 65053 60457 57638 62480 57766 48232 43821 42485 38600 33553 34562 34481 33449 33955 38962
17050 38962 42880 45492 46755 44329 38972 36942 37579 37561 38652 35159 37703 38111 39157 40082 41550 45972
17034 45972 49248 52405 53935 55119 54852 53918 56226 61100 64506 65495 68796 67895 65708 65923 59586 56618
17018 56618 56257 50489 43863 40679 35534 31636 32194 33046 32552 29257 25652 27264 25572 23241 21647
17003 21647 24325 27184 24970 22058 22165 22655 20882 22830 27728 31000 29352 27762 24356 21979 19587
16988 19587 24036 28700 23464 18936 17247 21538 27136 25050 23402 18293 15342 21280 23256 22315 20255
16973 20255 16591 15259 19453 21665 18870 15123 16710 20809 20840 22032 25703 25691 21694 17690 13144
16958 13144 12195 15609 15866 18570 20050 19663 20938 21173 18822 18187 15133 8796 8988 10365 11018 12681
16942 12681 14576 12646 14204 14005 8919 4808 3967 4959 9362 9521 13542 18310 18556 16431 11891 8587
16926 8587 10376 11881 15263 13731 13767 14693 15439 15062 14385 10655 9802 9000 11792 18270 18353 20335 19892
16909 19892 16748 12927 12235 11983 16748 21362 16667 17132 16529 12277 12130 19258 20520 16997 16366 18639
16893 18639 17435 12883 12256 15984 18868 23207 26392 22075 19296 24698 31611 39546 48968 64191
16879 64191 77210 80705 83893 83556 72199 60804 50234 42210 40859 32626 29557 26970 23304 19798
16865 19798 18448 17000 14112 15045 17904 21346 20191 22259 18967 14746 13347 13557 18384 20690 19530
16850 19530 14274 7257 7141 12842 15504 19633 20637 17374 13741 14048 21553 27137 31315 39092 41492
16835 41492 47877 70422 95288 117642 132026 140372 137242 125207 106303 84604 68056 57659
16823 57659 46240 39343 35225 31668 28710 25450 23752 20396 18787 19961 19086 20982 20778 19979 17766
16808 17766 17037 15707 14168 15290 12191 14652 15069 10647 12222 17180 21604 25978 18414 13256 13860
16793 13860 10371 11711 18634 23750 24475 28505 33447 40303 51977 60418 61294 58088 56220 49236 41444
16778 41444 32511 28699 25331 22355 17702 15314 12674 13718 14597 12800 12624 13095 15263 11782 8221
16763 8221 8490 6776 9088 12668 12566 13454 12957 9677 4341 2066 -1046 596 1347 3623 3871 5450
16747 5450 8132 9482 9884 9130 10103 11362 10845 10116 9926 5414 4102 1608 522 -2215 -32 858
16731 858 -480 -337 -2711 -3600 -2055 -2183 -3048 495 2847 2194 4695 7130 7523 4173 4167 8092 7332
16714 7332 3673 4878 6456 3582 4041 6767 8666 9261 6988 5515 1347 -4142 -779 4283 6315
16699 6315 3798 1531 -809 1819 7784 12300 10234 6893 2682 38 2482 7116 8930 9604 6826
16684 6826 1000 2412 8587 11168 7160 3911 5273 2713 3828 5124 4246 3785 3221 3464 -1585 -1947
16668 -1947 1962 4492 2835 2999 4897 2417 858 5089 10653 11737 6067 4247 2971 4596 3631
16653 3631 994 -3421 -2821 -2467 -1163 1386 6485 7937 10761 7732 6033 12 -497 -1800 222
16638 222 4396 6712 6467 7364 7961 930 -2017 774 230 -1288 977 333 -64 -1590 -1812 2032 2888
16621 2888 3126 2116 1274 3432 2266 1124 -780 -2248 -3240 -9 3036 3943 1389 482 236 3362
16605 3362 3394 3343 5941 8582 6783 5012 8406 10042 8184 8042 11071 16542 13621 12127 14519 11425
16589 11425 10579 14027 14918 15869 15840 13340 14911 13888 13544 12005 9185 12783 9307 4073 1534 2075
16573 2075 3274 3311 3905 237 1354 4489 2087 -1305 -5441 -9878 -11555 -7283 -3143 874 4177
16558 4177 6378 9580 7690 3334 -554 -1276 1524 541 -691 -4096 -4086 2342 1220 4025 4654 189
16542 189 1024 483 3369 2623 -318 2819 2658 -1788 -4594 -2629 -162 1960 2808 2303 5327 5458 4407
16525 4407 1654 -2394 -4482 -5227 -3059 -1867 -4067 486 3647 1378 -314 201 -183 1661 -746
16510 -746 -1789 -1029 -1942 -697 3981 4941 4525 3294 3430 -717 -5766 -4279 -1787 742 -1587 -448
16494 -448 2001 2576 -2745 -4456 348 489 4508 5633 4295 2527 5067 9238 6198 3844 2444
16479 2444 668 -2012 -5227 -6437 -8728 -9675 -10513 -7834 -4877 -2723 -828 1215 678 2667 3516 5686
16463 5686 4414 3068 -84 -1596 -140 562 -194 1488 2086 2112 4408 8534 7912 -630 -3486 -839
16447 -839 216 -1810 -5324 -3104 -3095 -205 -3699 -5404 -2913 -313 -6555 -9170 -5386 -5793 -2420 -3601
16431 -3601 47 2157 1956 3864 3223 3088 5976 5887 2170 780 4645 3474 4481 4618 1807 230
16415 230 -863 -2394 19 -1668 -8905 -12619 -10567 -6408 -4871 -4321 -5670 -5236 -4558 -2664 3045 3241
16399 3241 972 -35 3604 6200 7968 7515 7393 1114 -444 4583 4682 1660 4727 2674 3980 2545
16383 2545 -838 2236 8025 10999 8700 5408 3598 9171 13143 10016 7147 4343 2091 1508 1150
16368 1150 1236 1826 584 3792 2956 648 466 -586 872 2761 1148 -1455 -202 920 1098 -334
16352 -334 249 2369 1460 1374 2223 4088 -432 -4760 935 1207 1074 -3100 -2067 -3188 -3203 -5104 -6086
16335 -6086 -4662 -2738 -919 613 3203 4631 8758 9976 10518 10181 7358 -609 -1464 -723 -1582 -2025
16319 -2025 -2295 1534 5099 4187 -1153 -550 924 3896 2036 4062 2450 -767 -165 196 2215 1571
16303 1571 -576 -2059 959 1545 -345 -2097 -1754 -4860 -4184 -4776 -1135 -1516 -5007 -5734 -3921 -2667
16287 -2667 -4248 -6344 -9996 -5777 -3529 -4909 -6474 -3431 1199 -722 -1226 -4086 -2776 -664 -1614
16272 -1614 -2297 -495 -2482 -2170 -1774 -4721 -10530 -9825 -2979 -3754 -3877 -6944 -8029 -3382 186 2532
16256 2532 3610 6879 8655 4613 1079 -460 -5408 -3809 -3221 -4739 -2700 1975 6433 5144 5122
16241 5122 4867 264 -3988 -198 4583 6143 609 -6345 -7737 -5739 -749 -5203 -8568 -5726 -4823
16226 -4823 -6068 -6363 -7642 -7053 -5319 -2470 1505 4041 2720 -1488 -1798 2551 1154 -2173 -3677
16211 -3677 -6086 -5688 -3541 -4305 -4102 -2239 -1703 -1215 2456 1020 1197 2579 1624 1640 1984 2967 629
16194 629 -4117 -4904 -3885 -7738 -10751 -10347 -8730 -4403 -1611 -4235 -4588 780 3670 4906 2372 -1903
16178 -1903 -2665 -1348 3418 4214 4614 4124 4134 324 -2502 -4011 -3014 346 1464 214 2513 2960 -1378
16161 -1378 -993 -1804 -2607 -957 4561 3681 1185 -2110 600 1636 -3692 -5401 -9504 -7816 -36 -2619
16145 -2619 -3419 -7795 -11365 -9017 -5994 -1566 -4986 -7391 -5369 -3723 -2455 734 4093 5357 3751
16130 3751 -256 -3350 -5388 -5632 -1753 -485 598 -5814 -6919 -4561 -3535 -2806 172 4565 2652
16115 2652 2457 2339 -958 -849 -141 -2372 -264 648 -576 6663 4524 -1019 -3325 -2090 1870 2655
16099 2655 413 -3650 -1004 -6357 -6108 -6119 -3089 -1530 -1591 413 -23 -806 1381 1496 5591 -347 -739
16082 -739 1773 1088 -2985 -4646 -1679 -2418 42 4465 7008 3179 -2275 -5423 -6460 -5680 -1264 -1966
16066 -1966 803 4727 4042 955 761 -1258 -3924 -5852 -10820 -10975 -3891 2469 2989 -1204 -7063 -7736
16050 -7736 -8256 -7685 -2331 -972 -6605 -9834 -8541 -8168 -3004 -1659 -7723 -9416 -9733 -8413 -6279 -3389
16034 -3389 -3917 -5404 -3081 -761 -467 -2557 -1579 3495 3416 1940 -1919 -2628 -2879 -3035 -3003 39 -1770
16017 -1770 -5819 -3032 -1240 -5019 1501 4547 2255 1958 -3057 -6683 -6515 -4620 -2721 -4347 -3857
16002 -3857 -2098 -3173 -5742 -5415 -4018 -3578 -2027 -3265 -1900 -1927 572 1399 374 -766 -4571 -4044
15986 -4044 -2059 1045 4466 5184 -1891 -4878 -8258 -6369 -23 2151 2701 427 -3271 -3203 -5103 -8156
15970 -8156 -3926 2049 3712 275 -5379 -8882 -12248 -9698 -6122 -3990 -137 -2704 -3225 -2914 -1478
15955 -1478 -723 -742 741 4313 4406 -949 -4040 -4532 -4526 -5139 -8965 -7439 -7244 -7202 -9747 -8115 -5559 -2814
15937 -2814 209 71 -3584 -7518 -9404 -6280 -2652 -2613 -4542 -4101 -3653 -5377 -6291 -8523 -9626 -4127
15921 -4127 -368 591 4141 5992 4692 41 -4132 -4805 347 410 -11 -1979 -4306 -5879 -7888 -2489
15905 -2489 -307 -2114 -4093 -6503 -5565 -4336 1552 2745 74 -2129 -372 -4675 -12318 -12677 -11748
15890 -11748 -10884 -5160 -1881 -3012 -4379 -4260 -3079 -1168 -1175 -1548 -3474 -7383 -5134 -1866 652 4683
15874 4683 291 -3023 -2920 1642 3577 2742 1279 3566 3099 -563 263 -348 -157 -1525 -364 -1076
15858 -1076 -2677 -1215 -5574 -9355 -8714 -7250 -5871 -4790 -3082 -3936 -5408 -11944 -9860 -8939 -8430 -1082
15842 -1082 1041 -1029 -1417 -5098 -4235 -3782 -4230 -2635 -1862 -122 -5 1812 -6099 -9193 -9205 -10807 -13198
15825 -13198 -10941 -6785 -7136 -5637 -6242 -5246 -4218 -3510 -1501 -3825 -4527 -6402 -6375 -6042 -5560 -7976 -7508
15808 -7508 -3814 -1531 954 2050 2437 3611 -4152 -5724 -4207 -5701 -7410 -6990 -9508 -4976 -5484
15793 -5484 -5315 -1354 4089 2303 2031 2905 -2956 -6303 -6708 -6938 -10131 -9764 -6266 -8776 -10750 -9199
15777 -9199 -6757 -4457 -3596 -7699 -11628 -11898 -10229 -11015 -9841 -7581 -6493 -6642 -2118 -227 -2676 -4568
15761 -4568 -4303 -2164 -6990 -8094 -9445 -11201 -7083 -7964 -7238 -6317 -4994 -4001 -2864 -7361 -7424 -3880
15745 -3880 -1920 -997 1117 -1331 -4513 -815 265 -2213 649 360 -326 -4083 -6539 -3799 -3971 -6442
15729 -6442 -8238 -6876 -6900 -5684 -5994 -7078 -7936 -7227 -3037 357 86 407 -3342 -7646 -7550 -6881 -5920
15712 -5920 -7510 -3410 286 179 -2964 -3307 -1463 -2564 -3133 -3575 -110 -1286 -1251 142 808 -46 -1790
15695 -1790 1757 2928 1128 -2690 -3706 -4889 -5169 -3464 -3094 -5390 -7835 -2202 -910 -5127 -6609
15680 -6609 -7342 -8311 -6657 -3988 -1976 364 -1844 -3045 -4386 -2056 1193 3586 -340 -281 -220 -1079
15664 -1079 -482 788 386 924 420 -1827 -5597 -6404 -2017 -1578 -4872 -4694 -6420 -9270 -10730 -12583
15648 -12583 -10236 -5722 -4762 -7170 -4348 1563 60 -1965 -4476 -9491 -10022 -8446 -8184 -7265 -7917 -8659
15632 -8659 -10326 -8029 -4219 -4255 -5527 -2175 152 969 952 4664 -655 -4128 -8401 -5379 -6351 -6406 -5787
15615 -5787 -7541 -9989 -4813 -2896 -5104 -8269 -7566 -3957 -1500 30 -3567 -2842 -1404 212 -224
15600 -224 -2217 -338 -2422 -6070 -6853 -4848 -5357 -2532 -5661 -8135 -6477 -4415 -3454 -10318 -11317 -8866
15584 -8866 -10280 -11969 -12630 -10206 -6671 -5110 -5976 -6173 -4564 -3451 -4738 -6134 -2557 -1999 -2526 -1883
15568 -1883 -2608 -3799 -1774 -2038 -3064 -4985 -6742 -6638 -2869 -5039 -5942 -7215 -8082 -7624 -7591 -7605 -6273
15551 -6273 -6923 -3664 1533 5103 891 -3852 -2910 -4543 -3763 5766 3771 -409 -2687 -3154 -1593 -915
15535 -915 3275 3852 472 -1674 -3493 -4937 -2525 -2100 -5937 -8175 -8594 -5574 -8005 -8337 -2840 -72
15519 -72 -4703 -7162 -6771 -8144 -5218 -2934 -2240 -3021 -3797 -3480 -2033 -6907 -11772 -7886 -4951 -3441
15503 -3441 -2906 -988 -835 -371 646 -1173 -3628 -7694 -11625 -11321 -10437 -13152 -14994 -11681 -7098 -7706
15487 -7706 -10446 -10695 -8105 -8147 -4809 -4774 -426 3350 1134 -1015 -2826 -1738 -2588 -4413 -5052 -3113
15471 -3113 -789 1347 2345 70 -3629 -4943 -983 2989 3946 543 -3714 -3677 -4216 -4572 -4993 -5716 -5559
15454 -5559 -4195 -2282 1573 -509 541 -2123 -6036 -7604 -4734 -188 374 -1687 1038 -1708 -2962
15439 -2962 -5357 -4087 -1720 401 89 -1132 -3218 -2908 -3235 -3120 -1228 -3302 -5053 -5128 -6186 -2440
15423 -2440 1636 -476 -4389 -7482 -8091 -7163 -7543 -7147 -9653 -6542 -2019 953 -2897 -3530 -3133 984
15407 984 4137 5653 3503 1151 -3517 -4619 -4728 -4956 -7162 -5291 -1189 3200 683 87 1889 -1744
15391 -1744 -2112 -2240 -4099 -4237 -5025 -5458 -7093 -6628 -6282 -6054 -7802 -4538 -6150 -2623 -556 -2906 -1682
15374 -1682 -842 -1093 -2508 -1666 129 -347 -74 -6292 -9840 -13642 -12335 -10369 -7976 -9543 -12117 -4872
15358 -4872 -645 -1424 -3485 -2719 -2741 -2592 -5493 -3047 -331 -4134 1202 6950 10886 12534 13789 17171
15342 17171 16608 13388 8233 2437 -3062 -7863 -6732 -3732 -3914 -2709 -3648 -5566 -5892 -6922 -6196 -5805
15326 -5805 -5434 -3541 -2609 -4219 -6473 -6779 -11434 -8237 -3702 -8794 -11950 -5146 -4808 -4897 -5083 -7798
15310 -7798 -4973 -2907 -2896 -4293 -9009 -10594 -8449 -5808 -5698 -6973 -5217 -6492 -2800 -364 -699 -8616
15294 -8616 -10796 -6511 -6042 -8248 -6084 -993 -2481 -3252 -5541 -4187 -3845 -7088 -9715 -9534 -8326 -11454
15278 -11454 -9739 -5440 2734 3670 -1920 -4087 -1094 4122 -532 -3463 -4085 -6517 -6277 -5571 -3018
15263 -3018 -3351 -1875 -4485 -1710 -3846 -4205 -2878 -4426 -5891 -5795 -2538 433 3504 2211 469 -6071
15247 -6071 -5789 -5632 -4720 -5790 -9398 -5879 1654 5096 2185 2588 296 -1046 -4558 -6478 -6332 -7014
15231 -7014 -4876 -1838 1610 4810 7376 7063 3577 -832 -60 86 3551 4097 1768 -688 -2280 -3031
15215 -3031 -7251 -10741 -10065 -1985 563 889 2746 1961 -1619 -1474 -1656 -6116 -7702 -9080 -5148 -6209
15199 -6209 -8973 -7885 -3154 -3859 -2724 242 -356 -2765 -1918 2166 2344 -3171 -4705 -3590 -2454 63
15183 63 -1794 -1329 3850 7664 5588 3700 2454 2338 1940 634 762 387 -582 1844 315 180 1918
15166 1918 1370 -27 -1925 320 672 1405 1020 2617 5505 9341 6909 5417 2693 1932 -1593 -5068
15150 -5068 -5387 -7937 -8059 -4445 -1633 -6574 -4130 -1535 2835 1006 -3278 -5463 -4227 307 2065
15135 2065 6714 5721 2146 1343 -1130 -3561 -2086 -406 -1352 -1247 -2566 -5313 -1323 4474 5525 -3983
15119 -3983 -6841 -7553 -8590 -7728 -6250 -6620 -4972 -3057 -5316 -2087 -546 -4163 -5668 -5184 -2457 -4290
15103 -4290 -6325 -6168 -8042 -5152 -3502 -1738 -1920 -2768 -4542 -6538 -8294 -8501 -6561 -6169 -7108 -9131
15087 -9131 -9543 -8711 -10076 -9358 -6137 -2320 -208 -1346 805 -1815 -3725 -1974 -399 -1359 2391 -2403
15071 -2403 -5133 -6222 -8476 -6786 -5881 -3421 -1394 -4297 -2594 -6295 -2831 1574 2027 2548 367
15056 367 -1092 1057 1543 945 -246 -2995 -3018 -2832 -4297 -6289 -3281 -6578 -1675 2448 -950 -2825
15040 -2825 -5679 -5210 -3295 1455 13 -24 -2101 -1531 -8045 -7856 -5214 -3753 -2576 -714 -115 -3312
15024 -3312 -1504 921 -1548 -4185 -2477 1483 4123 4954 1752 -1519 -3283 -4544 -3643 -4273 -7370
15009 -7370 -9326 -9220 -7541 -7028 -3171 -269 3475 3397 578 -1643 -1519 264 2508 -37 3765 7022
14993 7022 4670 3534 464 -1015 292 103 -3187 -2771 -3385 -4796 -7988 -5256 -976 486 -1090
14978 -1090 -88 8299 18846 22737 23958 21798 17346 11974 4512 -867 -392 -426 -6700 -8493 -8632
14963 -8632 -8241 -7068 -3140 -1601 -442 2450 5714 6625 1314 76 3177 1972 1661 -694 161 -1259
14947 -1259 -2799 -3673 -1355 -4398 -7449 -6504 -5075 -3084 -3309 -1320 2050 3126 1570 -1340 -1625 -548
14931 -548 -1579 -2878 -3538 -3240 -7711 -7906 -2063 1432 743 -1136 -1149 -4153 -2552 -3296 -1235 -3425 -1974
14914 -1974 525 -896 507 1810 3399 -2297 -1883 -3436 -3485 -4016 -2380 -3688 -7216 -7246 -8372 -7867
14898 -7867 -8213 -4702 -7068 -12193 -9976 -4069 -2794 -6332 -4493 -694 1293 -2897 -3491 -3630 -5780
14883 -5780 -6798 -3611 -6253 -8523 -8040 -10247 -9430 -3774 -1914 -3059 -5533 -6252 -6037 -7324 -8327 -6043
14867 -6043 -3363 -4941 -3903 -3098 -2669 -3925 -6138 -6756 -12594 -9364 -8455 -6395 -3889 -3003 -4339 -5045
14851 -5045 -2922 1584 -522 164 -1375 -3952 -2788 -3240 -1802 461 -1675 -1566 23 1017 -3140 -6009
14835 -6009 1644 374 -1927 -3588 -8713 -4664 -2900 -1746 618 -1819 -1596 571 -2343 -6073 -9017
14820 -9017 -5766 -6041 -7819 -8615 -6223 -2981 -3431 -4997 -5461 -9311 -10732 -4776 525 2588 111 -1012
14804 -1012 1374 2894 -1043 -842 1609 1180 88 2276 2726 -784 -4150 -7027 -10565 -14450 -11478
14789 -11478 -10232 -12879 -14637 -8443 -5329 -5622 -3238 -2348 1201 -274 -2382 -4468 171 2551 -2862
14774 -2862 -3259 92 -2043 -5201 -5564 -8633 -10006 -6972 -8317 -7616 -6049 -6236 -7328 -5274 -7198 -7318
14758 -7318 -1352 -2210 -1721 -3015 -8917 -8603 -3368 -2642 -6429 -6442 -2545 -1313 -7436 -7255 -3844 -3143 -8139
14741 -8139 -7835 -3817 -5457 -1819 -244 -1759 -5311 -7007 -3935 -6629 -10696 -9115 -6313 -5613 -6392
14726 -6392 -6457 -2586 -620 -2035 -4712 -4681 -8775 -7899 -5032 -9312 -9141 -8197 -7363 -6314 -8828 -6592 -4928
14709 -4928 -3198 -1885 -2560 -2863 -3235 -2718 -2208 -1048 -5563 -6479 -8427 -10571 -6126 700 -1149 -5331
14693 -5331 -5377 -4654 -1336 1207 -85 -3347 -4460 -8809 -12627 -12406 -11966 -12113 -7990 -4639 4026 5884
14677 5884 4771 6227 1149 -3073 -1181 -954 -2867 -5317 -8902 -6967 -3554 -1793 -1551 -4597 -6319
14662 -6319 -5562 -4641 -4505 -5414 -10146 -10603 -9760 -5536 -2339 -5592 -7711 -6912 -5448 -5973 -3634 825 1871
14645 1871 -2277 -6296 -6255 -9720 -6686 -3561 -3321 -2246 -1621 -6306 -9321 -9297 -5415 -2197 -2796 -3712 -1762
14628 -1762 1464 2621 1536 -1082 -1741 -2993 -2098 -4139 -7877 -11186 -10125 -5034 -2625 -2809 -3584 -1671
14612 -1671 -3837 -8581 -7065 -6156 -3772 -7223 -10604 -10905 -5711 -5108 -4173 -7753 -11671 -5624 -5852 -4796
14596 -4796 -5621 -2229 -1075 -6363 -10387 -8641 -6903 -7026 -5303 -6698 -7424 -8743 -12621 -14175 -10830
14581 -10830 -7400 -6927 -5701 -5874 -6786 -5741 -8194 -5986 -6164 -8181 -11672 -7361 -5774 -5391 -8030 -11305
14565 -11305 -10206 -11720 -10158 -7923 -8280 -7074 -6425 -8582 -10459 -10652 -9631 -9483 -9712 -8922 -9501 -6579
14549 -6579 -3571 -2749 -1098 -4551 -5560 -4769 -4741 -3782 -2686 -73 -4746 -2692 -1226 -1950 -3904 -6737
14533 -6737 -11074 -8874 -2466 4792 4412 -4441 -7243 -6458 -3654 -1874 275 2110 105 -3249 -3936
14518 -3936 -1109 2129 1317 2295 1162 -855 -1157 2613 806 -7593 -11502 -6834 -1740 -494 -5220
14503 -5220 -9869 -9323 -4274 -2335 -4727 -7651 -7132 -6228 -4151 -1924 -2535 1554 5615 3388 -449 -1736
14487 -1736 -1621 -1686 -5970 -8223 -9292 -8294 -7453 -7141 -7496 -5595 -2485 1086 -878 -36 -1084 -1373 -5930
14470 -5930 -7975 -6559 -3380 -5279 -3622 -3752 -1559 -1738 -1593 2073 3978 -68 475 -3203 -6280 -3885
14454 -3885 192 -2003 127 1588 -1384 -6659 -8300 -5502 -6994 -7850 -7649 -6652 -7862 -8714 -8697 -731
14438 -731 -690 -1189 -6003 -7369 -11720 -8353 -7393 -6539 -6450 -6147 -5352 -5282 -3684 -6698 -2324 1949 5261 3192
14420 3192 3073 -4457 -4744 -1764 -4036 -7011 -5208 -6024 -6294 -3556 3059 7726 4179 -2733 -2227 5043
14404 5043 5067 4253 4340 4211 841 -382 834 729 -1847 -365 -843 -355 -48 2398 1874 -712 67 -2366
14386 -2366 -4018 -6891 -5302 -2598 -1336 -1707 434 301 -38 -4268 73 367 -1589 -3057 -554 417
14370 417 -1993 -447 -2333 -7916 -5903 1470 -370 -4875 -6488 -3992 -3069 -5424 -9001 -10488 -15416
14355 -15416 -17617 -16899 -15319 -10092 -7458 -854 1739 -2046 -580 -2063 -6414 -2465 3205 3896 6887
14340 6887 5234 2431 -5846 -7681 -4250 -6329 -7853 -8252 -8748 -9442 -6789 -2978 -1140 -3083 -1606
14325 -1606 -6226 -9699 -7926 -9706 -9999 -6664 -7451 -6630 -7680 -12046 -9141 -9394 -9584 -9478 -8996 -6626
14309 -6626 419 3533 3947 -989 -2543 -892 -1122 -6361 -5413 -3516 700 3251 -220 -6725 -5111
14294 -5111 -2055 -566 -1238 87 251 -2547 -2733 -1298 -1792 -6691 -5374 -2785 -609 -4622 -6468 -1918
14278 -1918 -3303 -2896 -2556 -1385 -2881 -1592 -5092 -8631 -4634 -1548 545 429 619 374 -1667 -4211
14262 -4211 -4378 -3950 -6648 -8543 -9102 -5925 -3465 -4909 -4349 -4415 -1080 -3231 -5667 -9035 -5157 580
14246 580 699 330 -3038 -86 2034 2435 2659 4992 2922 1766 3463 6026 3880 318 -296 681
14230 681 -59 -2575 196 2372 1936 2156 3481 1905 2577 3605 935 -2347 -3538 -2902 -499 -297
14214 -297 1513 736 -3437 -3634 -1724 1382 3527 3375 1552 952 2128 3610 3487 4398 1058 3085
14198 3085 3781 -1049 -3175 -6946 -5112 -2405 2384 1794 1733 4332 3417 4034 1491 -2772 -1462 -1311
14182 -1311 1374 4999 5842 3036 8258 8363 5999 6600 4441 -341 -1783 -1043 -2260 -5472 -3210 -1962
14166 -1962 -2452 -1219 428 2205 3481 3850 4246 883 374 -4018 -4757 -3755 -1096 1189 1842 2945
14150 2945 1406 -4156 -6810 -4685 -2504 -2149 -1244 -2058 -1986 -88 718 543 779 2398 2475 3893 6361
14133 6361 6806 4477 7055 6805 5673 1286 -298 -577 1834 2622 6340 7800 5535 4731 896 -816
14117 -816 2337 7425 534 -1193 2414 3068 3521 6123 8496 10440 7809 2732 1788 -976 -3325 -5237
14101 -5237 -2139 -8 1339 3624 4480 3694 2968 2447 1588 1276 -714 3093 6130 4572 3686 5176
14085 5176 10923 11895 10069 8538 4025 4725 8772 12245 14922 14080 14993 13269 11183 11653 9268 6420
14069 6420 4727 2189 3394 6150 4972 7128 10532 10932 4487 5671 10415 13718 11233 11220 10392 16047
14053 16047 20510 21002 24621 28292 33220 46536 52892 58079 63787 68405 66624 66767 61388 54503 50553
14038 50553 45038 37395 26671 18949 16320 14942 13811 17085 18055 19733 16307 12122 8558 7152
14024 7152 4231 2352 4602 7027 9006 10103 6131 5288 7298 7604 9095 4588 3604 3279 6958 11293
14008 11293 13874 9525 8934 6916 3874 6134 7040 7479 9323 2849 -2454 -1566 1915 2220 3277 4850
13992 4850 6611 3045 2744 2085 1707 1979 -2785 -2005 -3312 -6746 -7075 -7579 -5703 -2571 -985 -545 341
13975 341 2912 5204 7403 8499 7468 3080 3360 3906 6769 11805 12172 12736 12392 10891 8905 10430
13959 10430 10461 11491 16684 18078 13187 6783 10500 14370 15718 15999 22010 27766 32237 37946 45831
13944 45831 58915 76563 95689 131096 175359 226361 277472 323880 357973 379155 383860 371397
13932 371397 343039 304014 255505 207392 171434 146154 119279 100906 87339 74333 67289 60228
13920 60228 50860 42245 36644 35074 31369 31889 29048 25547 26242 30488 32278 33380 32552 28768 26136
13905 26136 21705 17444 16062 20145 16580 14486 16175 16834 17462 12543 11926 14613 15022 20225 21418
13890 21418 19668 16659 19783 20371 15947 14991 14448 15669 13349 11581 12253 10244 10100 14442 14815 14717
13874 14717 12277 11982 11757 12276 16895 20151 22412 25424 23643 24891 25359 23246 21274 19140 20121 21844
13858 21844 17571 17547 23095 20704 20430 19606 18911 19293 21236 21699 16843 19348 17363 14142 11091 9057
13842 9057 10792 16382 18989 16508 18433 18109 13449 16718 21014 20026 19299 17814 13719 17864 22051
13827 22051 25248 27887 24386 26242 27915 24703 21333 23222 21714 19756 19866 20389 19624 18115 19344
13812 19344 19506 21908 18684 18078 20056 21389 24338 23465 23725 23327 20312 18590 21664 21182 15154 12115
13796 12115 14532 16610 20090 21268 22696 25422 23743 21219 18540 13422 14030 18453 17613 15133 13285
13781 13285 15939 17761 15729 16361 18312 15361 18074 20412 21070 19358 16149 17790 16217 14432 16102
13766 16102 16971 15392 12985 13488 11525 8466 8004 9647 9446 10528 11182 9899 12589 15887 17331 17857
13750 17857 13958 8430 7760 8315 10221 11401 11270 13005 10951 10410 15566 17589 14572 11663 11430 9111
13734 9111 4701 6293 10430 10388 4955 243 2245 3151 1905 -2079 395 4860 6540 9003 11656
13719 11656 10609 6242 5278 9011 6701 8514 7616 6535 11571 14244 15532 12793 13848 17524 20290
13704 20290 19343 15236 11677 11151 12481 9672 9779 13848 19821 20181 20696 17713 15876 13616 15869 11098
13688 11098 4296 3638 9221 13662 12793 10074 5047 6786 3548 779 2902 4063 4557 3006 2249
13673 2249 914 2924 7754 10358 11853 9264 8115 6071 7005 5173 4210 3092 5383 8046 6978
13658 6978 9235 8862 10052 9145 10444 10932 8490 7648 5487 5343 5240 4734 5128 4817 7223 9552 8590
13641 8590 7177 8346 4528 5048 4401 3480 9161 9898 11389 9825 9356 2821 -802 9 2100 5036
13625 5036 6606 5340 6202 10701 17212 15985 11557 9983 9381 6512 5659 4985 3824 3960 6331 6355
13609 6355 3495 -57 -757 -121 3302 7434 5216 7201 7148 10083 9839 3737 3367 3848 4283 2240 3331
13592 3331 2707 2944 7885 8164 9200 9038 5695 1822 1841 1443 3950 4952 7642 11198 3125 -269
13576 -269 1792 4908 9567 5189 5088 -1604 -4187 -2110 -3352 -2178 -2098 -2826 575 1425 5089 7196
13560 7196 5939 6918 8447 8711 4076 4665 8404 9381 3288 1608 4738 7863 6279 1318 -2857 -1150
13544 -1150 2652 3769 194 -396 -1057 -4388 -3945 -716 1806 3507 6758 8820 5918 4155 5408
13529 5408 2170 2021 2632 1116 3181 2293 1727 198 -374 -1338 1949 7778 10429 12725 10780 7209
13513 7209 6071 5126 6177 10997 8202 6064 6494 8461 9560 10896 7686 6519 6651 6191 9300 11668
13497 11668 13575 15070 18372 23493 23897 27186 32732 38959 45334 56412 69799 86052 102717 115021
13483 115021 129615 149433 172671 191843 198927 199893 199000 191524 179014 160861 143451 129680 115173
13470 115173 97175 84491 76084 64591 50943 46777 47719 41138 35109 32043 27454 25726 25593 23962
13456 23962 20840 20650 20062 17969 16205 17162 14229 15744 17508 16619 16210 22063 24366 27359 25324 28402
13440 28402 34408 43750 47090 47513 53250 58227 52834 50710 51168 50595 46137 43712 42959 35963 32550
13425 32550 31421 36687 39580 42063 42133 43118 42350 42315 44147 51647 51024 49071 45389 40229 32881 29575
13409 29575 30445 24077 15936 19273 20932 18663 16261 13461 11491 8872 7156 7248 7543 10067 11553
13394 11553 11462 9370 13428 13197 13159 13700 14956 14119 11960 8758 11460 8538 4221 3392 4756 6305
13378 6305 9169 10337 11111 11625 9312 9978 12199 8098 8647 7678 5939 6122 4908 4298 3154 1571
13362 1571 1626 2519 4999 11452 13298 12870 12922 20221 24257 27108 29679 32866 34890 38995 46020 57016
13346 57016 58483 54611 54140 60387 61102 57547 53604 44581 35446 31717 27463 29690 34988 35351 32600
13331 32600 33883 35178 38351 42331 46666 52915 53901 48191 46581 47280 46164 41543 37794 35174 32859
13316 32859 26119 22729 20258 15439 13707 8639 9137 13559 12952 16467 13498 9012 8582 5315 3299
13301 3299 4627 7123 4515 2559 2249 376 3752 7534 5676 3494 4853 8293 6810 1648 -411
13286 -411 4 2904 7997 9878 11780 12184 8727 9528 9464 10106 10787 10571 8483 12031 9547 4829 4939
13269 4939 8231 9650 7343 3175 2032 -633 -3749 -460 25 715 1476 2251 2277 -926 607 -1846
13253 -1846 -287 3534 2337 -756 3262 4442 1032 -732 7038 11730 11527 8838 8966 7946 6824
13238 6824 7758 5508 3355 2256 5833 9268 11878 12067 12899 12248 10211 5707 4041 6903 8022 4268
13222 4268 3595 5803 5359 -1401 -6325 -1551 2244 5025 6441 6875 8755 13141 10787 9406 5047
13207 5047 2792 1884 666 -470 864 -124 1958 1101 -1066 -4014 -834 -1842 -3218 1278 2225 3452
13191 3452 2931 2624 267 -1522 1564 3543 5719 7348 4541 2517 -706 -1722 -2479 -1339 -11
13176 -11 369 586 2181 1396 -1149 662 -1198 -12 1138 -825 -3289 742 7046 5008 4478 4855
13160 4855 4398 10930 9348 6296 4573 1171 2751 969 1812 3840 6903 6720 4256 2485 5484
13145 5484 8383 7573 3169 2254 3864 5166 3609 2826 4351 6329 6674 4548 2011 -1442 -44 2678
13129 2678 2103 1196 1528 1597 -341 -804 -1528 819 3559 7832 9185 8027 2206 33 -3524 -419
13113 -419 2862 3215 4739 6812 4003 1265 -5460 -6581 -5913 -2635 578 67 2600 4835 2847 1434
13097 1434 -449 -4151 -1110 1106 3634 232 -3206 -1307 -1701 2985 8287 9160 5001 5295 9405
13082 9405 10434 6460 5607 4088 3586 862 1852 3092 4414 2979 7637 13119 14328 9701 3650
13067 3650 1324 7598 8554 9202 9609 10223 9952 6903 6331 4717 4162 3051 1215 1046 7278 8295 8762
13050 8762 5999 7484 2994 4552 5214 5121 9023 9597 8482 10856 12612 14583 14162 8864 7570 9131
13034 9131 7557 1516 3644 7777 5451 4858 9323 8046 11763 10020 6029 4390 4260 8345 10788
13019 10788 9173 4982 10706 14107 15306 15931 15620 15894 17453 11687 8238 13047 12433 12214 10866 10426
13003 10426 10923 9018 11061 14267 14545 13267 10488 8505 9527 14060 14487 16147 19107 20547 24866
12988 24866 24758 25107 28680 26581 24034 21252 15963 16299 12405 8624 9675 10838 9673 8612 8369
12973 8369 7932 13599 14126 13257 16599 19124 15076 10664 10879 11630 11586 10661 14729 18734 19270 15563 22173
12956 22173 20259 16801 19626 23923 22500 19156 17755 18096 20079 27376 29154 34368 39533 41960 45385
12941 45385 47824 49140 55042 59768 64110 66634 74978 85589 100458 115942 136038 164669 196759
12928 196759 231133 267761 303429 330844 346365 355241 351487 335373 310994 284068 253273 223584
12916 223584 195184 167640 144585 127855 112339 104378 96982 88298 80927 72885 69426 67288 63739
12903 63739 56966 52236 52015 48292 47474 45309 44870 47708 45051 39778 36214 32731 32887 33017 34836 34547
12887 34547 32988 29106 30042 27163 27007 29875 28353 24410 26937 30821 31096 31080 31261 32414 33998 34389
12871 34389 36103 36821 35319 38012 41881 43747 46639 45844 44330 43823 45924 46612 46242 45086 39502 35675
12855 35675 32504 34049 42014 45913 40369 40635 46896 50307 48722 46358 46289 45120 46413 48665 44394
12840 44394 41350 38672 40804 38540 31550 27849 29544 33325 35630 33623 34936 36410 38727 35443
12826 35443 35533 35446 35164 37661 38033 36741 33997 30926 26937 28515 31335 32486 26478 29698 36139 40981
12810 40981 43703 45029 43541 43972 48183 48379 48149 45318 40551 41877 45260 47089 46250 45092 50003
12795 50003 51859 46235 44575 42441 45044 47270 50574 45592 37111 40671 43550 50363 52665 56401
12781 56401 55325 54192 57749 58848 60362 63569 64888 66851 70566 78149 78713 76614 78298 80063 87120
12766 87120 93917 97683 100516 98044 97446 100594 104840 105582 105853 108711 115434 119059 123556 125481 126114
12751 126114 128582 127766 126221 117925 110124 107483 94692 86199 81554 74060 70816 68399 66607 65436
12737 65436 62882 63064 63462 64356 59601 53274 56263 55015 54499 55696 58889 59119 64540 68629 72285 72546
12721 72546 72809 73818 75518 80778 93316 101795 100826 99450 103005 106776 105864 101872 91418 82920 79223
12706 79223 70573 59944 54833 52119 54844 59014 58111 60246 59927 60155 61409 64471 69245 77592 83303
12691 83303 91535 100879 110267 119165 131413 144293 158031 165902 163996 158833 149929 141591 138707 134024
12677 134024 130437 129693 129146 124842 126405 129899 127630 127086 127835 131998 131164 125753 121814 125045 128506
12662 128506 133667 141320 143222 147642 150788 148954 146389 141284 138146 134872 129604 125602 128078 131831
12648 131831 132180 132377 135328 135650 132319 130796 127012 130251 133144 134027 137301 139690 138995 144193 147832
12633 147832 145883 144333 147320 147409 149846 155461 149198 145550 144808 146339 147123 151444 160957 163726 166727
12618 166727 171776 175180 173745 172827 177506 179413 184920 192652 207999 234758 268157 288497 286681
12605 286681 270557 253990 241777 235919 235513 236500 237540 237003 238456 239168 243562 244538 243470 247262 256510
12590 256510 266236 269910 274539 287342 301048 312449 323416 334492 345340 352043 357759 360098 364217
12577 364217 368021 371859 376069 377369 382213 387847 392757 394218 404529 416125 418836 423088 430130 431966
12563 431966 434059 440295 445886 452398 459981 466807 475472 487310 502684 518273 533306 549080 571583
12550 571583 600138 630879 660818 685313 709132 737981 769422 799854 833530 873003 915196
12539 915196 962848 1014762 1071654 1135468 1202265 1275465 1356506 1438902 1525789 1622331 1731129
12528 1731129 1850899 1986441 2142081 2312883 2511051 2737297 2996870 3293021 3635993
12519 3635993 4037763 4500756 5028493 5628557 6309461 7071698 7933173 8923151 10091446
12510 10091446 11501168 13260782 15502456 18392343 22116201 26813295 32485456 38932581
12502 38932581 45731897 52279935 57882605 61896447 63842408 63482776 60885425 56418733
12494 56418733 50664948 44296043 37957824 32138877 27116337 22974613 19649004 17011276
12486 17011276 14913535 13223505 11828730 10659219 9651453 8767189 7966667 7224578
12478 7224578 6544648 5931312 5392997 4929887 4527441 4180219 3879615 3616182 3381992
12469 3381992 3172535 2979742 2803411 2641934 2492325 2358200 2233840 2118176 2010051
12460 2010051 1907617 1820197 1742635 1667260 1597933 1531835 1472492 1419350 1365606 1313810 1267230
12449 1267230 1222397 1183863 1145464 1109094 1070876 1030441 993587 959684 922481 888852 854770
12438 854770 823675 795596 767377 743491 718498 689501 666750 653274 647311 641253 633990 633157
12426 633157 638780 643252 647676 652065 652502 646927 633170 614894 591790 567246 544618 523296 504548
12413 504548 485502 465243 446815 434331 418783 395956 376990 363482 357145 350093 336531 323656
12401 323656 315192 305721 294120 288894 278375 277577 274083 266513 260802 260341 260514 259911 259336 255588 256186
12386 256186 264429 268295 265758 263865 263657 261601 264712 274366 283058 294233 300201 302862 309879 321469
12372 321469 330287 329825 332387 340791 338840 339190 346641 363876 380831 397036 422289 454493 490824
12359 490824 535469 583484 638363 710772 806899 932273 1102185 1318041 1589015 1907888
12349 1907888 2273766 2654705 3022256 3340109 3573697 3690634 3675872 3541387 3300076 2983168
12339 2983168 2625744 2262249 1921199 1621944 1370966 1166630 1003921 880290 778923
12330 778923 694803 632850 577150 529919 485874 445315 405217 376758 349977 323682 298995
12319 298995 277026 258619 239823 222783 208017 192389 175785 164293 155442 152849 147609 143696
12307 143696 146777 148673 149204 150893 154205 157778 154913 153050 157177 162452 159351 158158 157927 153255 149390
12292 149390 149679 153289 155954 155887 152190 150216 145729 142792 139888 138252 131550 128275 128010 127833 126341
12277 126341 120354 117382 116388 110210 108049 108466 109417 105966 102604 104385 112234 110252 105471 100610 100418
12262 100418 98999 95581 95357 91582 87860 89931 84922 78895 75555 75715 75159 76323 77937 76557 75106
12247 75106 82615 83752 84204 90542 89798 87737 90491 93700 92578 94045 94804 96482 106763 115178 124116
12232 124116 135137 153396 173838 189306 206845 221227 226760 230685 228480 215595 196294 182950
12220 182950 162408 146257 131364 121170 113782 107835 99718 93830 92050 91780 93125 91873 86913
12207 86913 82768 81602 74285 72185 65616 64295 62128 57334 60081 65410 62537 56261 49995 44067
12193 44067 41120 41273 40702 38209 37030 39111 40203 44707 48066 46677 45449 45317 48567 51455 52238
12178 52238 51916 52898 55971 54133 54410 60791 64832 69973 72818 73163 70525 68459 64194 62339 66626
12163 66626 70877 79783 88658 97195 108226 115822 117977 118365 116722 115418 115711 121194 125499 120441 108849
12148 108849 98649 91067 85861 84714 89076 95394 102997 108946 109352 98518 91316 86813 78240 72104
12134 72104 66360 59578 56235 56505 58670 57323 53251 49301 44058 46863 48261 45266 41489 36927 39102
12119 39102 43925 43631 45171 46717 48288 51276 46736 47611 48446 47123 45541 44440 41658 40904 42401
12104 42401 43584 47803 48998 50508 51128 58380 65877 77571 83713 95899 103472 108298 110947 112585
12090 112585 111659 102661 95180 91403 93010 93365 94435 93483 92025 93478 99846 110919 122373 133356
12076 133356 151060 170026 194346 226098 266199 311526 357560 406052 441780 459112 471051
12065 471051 470144 455684 436646 423011 417581 426748 448897 479247 517614 557022 581395 595270
12053 595270 590815 561151 510651 447190 385966 328515 272562 227046 191893 161206 143280 130582
12041 130582 124516 119194 111763 102228 90258 79407 74899 71208 61959 54795 51054 48618 46229 45566
12027 45566 40012 38633 44713 54351 60940 59032 50748 44369 44714 43232 42441 43115 47259 52657 50723
12012 50723 53279 55718 53087 53275 57316 64643 73430 77421 83189 86997 89282 89818 87268 77889 64525
11997 64525 57565 51706 41304 34081 35336 31832 31568 31960 33357 33438 36853 37544 35486 33439 29849
11982 29849 27076 28620 30975 32289 35059 37073 34640 34614 37305 31975 27001 30704 37958 37769 37012
11967 37012 34937 33066 31000 31023 30979 32634 31259 28941 30394 29818 27682 26558 30766 21900 19555 28985
11951 28985 32095 29621 26825 27678 32704 34385 29442 28911 31987 29037 28271 32852 35821 38481 36990
11936 36990 34182 30953 33072 36982 38568 37768 36005 36780 32046 29680 34831 38141 39372 36157 33016
11921 33016 31006 33648 41099 43158 41944 39102 35364 34523 38433 41066 44606 44146 50492 64157 82491
11906 82491 119030 161316 174521 170368 148272 115899 91102 74228 61213 53620 47703 44486
11894 44486 40886 37724 34679 31181 28759 25076 24583 25041 23702 25447 27041 26760 22256 21372 23878
11879 23878 29333 29071 26648 25670 23509 20764 25012 27404 27673 26946 26823 24360 21837 17406 18193 18769
11863 18769 20352 19996 16850 16551 19333 21921 22183 21004 19253 18157 14938 16978 17261 17047 14495 15364
11847 15364 15815 17226 22196 21941 18458 15885 17012 19839 22171 26800 27500 23660 24617 19887 20187 19702
11831 19702 18810 15583 13835 13780 18511 21283 25074 23999 21736 17483 17341 18854 19579 22542 30925 31514
11815 31514 26034 20552 21758 20646 23048 28631 28413 25698 27211 24839 21581 20880 21723 22290 25738
11800 25738 28289 31036 31215 31785 33391 30384 26510 25553 27459 32005 35496 33187 32762 33357 34710 32608
11784 32608 34741 36616 40323 44171 47005 44978 48832 54561 59562 70612 77578 85304 99108 115598
11770 115598 140409 168189 194684 218212 245362 269738 293788 318783 340775 359249 365021 356574
11758 356574 343203 323652 306484 295013 275558 253013 227842 201075 175789 158014 137413
11747 137413 121799 111929 101493 92342 87358 83379 82478 83378 81924 77816 72418 66939 70571 69797
11733 69797 70364 69845 67449 59820 54152 55771 61963 62319 65585 68792 73874 73242 72733 74947 74214 74895
11717 74895 77025 75763 76418 76769 74009 71454 68569 65074 63984 62429 60518 59802 58982 58534 64128 63168
11701 63168 57926 57772 59911 63434 63970 60568 58447 61107 65120 65961 65150 66086 65657 68572 73058 75552
11685 75552 73937 68015 64822 65226 61788 59300 57897 56195 54385 55595 59565 58229 60567 62639 65367
11670 65367 63802 60337 58001 57542 61807 64834 65510 63226 64196 69194 71447 70672 69992 70963 75903 78060
11654 78060 79951 85005 93254 97894 97292 96346 91510 91653 89775 85763 84591 82177 77950 74108 72991
11639 72991 70343 70372 72149 72647 72297 76625 84047 86605 84712 84500 84114 81645 85664 81891 77727 84727
11623 84727 90335 94696 95108 94641 92552 92581 91181 88574 86800 89410 91231 94903 97645 104380 106982
11608 106982 108022 104563 104262 104428 105740 107114 105588 104217 97892 92402 88568 87134 90611 91251 84333
11593 84333 81321 75568 67390 62093 59389 59293 57452 53261 54173 54103 55835 56390 57620 56282 57232 56845
11577 56845 56119 59344 57326 59762 61821 56763 53609 54607 57358 54479 49765 45518 47486 50857 51266
11562 51266 47379 46093 41761 40977 42828 41866 42116 45048 43055 40779 37223 36483 34932 39831 45555
11547 45555 46593 48743 52489 53523 57372 59498 60044 60675 69221 74965 79474 85189 94696 101407 108202
11532 108202 115375 116454 118377 121851 122720 119941 121929 120737 119638 118702 117299 113694 106307 103917 107668
11517 107668 106119 102043 98561 98957 100238 97787 95063 96765 102017 106954 109427 111273 111957 112433 112102
11502 112102 110352 114474 118744 116663 115552 115473 118253 119367 117457 120113 118106 116304 117235 118496 115488
11487 115488 114401 116687 120020 117046 115946 112681 116900 117255 114734 110378 109120 110835 108595 104274
11473 104274 99050 95882 91952 93565 94160 96468 99294 108838 119543 133304 142961 158261 173515
11460 173515 188677 206645 223147 245276 266900 293752 327421 367052 400110 435063 477188
11449 477188 535743 612627 716723 860568 1054668 1317257 1646892 2006927 2309401 2474165
11439 2474165 2458437 2285350 2015470 1719347 1454507 1241811 1078669 951174 861824 802792
11429 802792 759238 722116 684437 648130 613404 580733 550891 523159 499194 478108 457442
11418 457442 443213 433569 420365 407321 398914 397062 386920 380788 378031 374732 373041 374321 377889
11405 377889 378746 379047 382996 389341 396942 406559 418347 436285 458554 479396 497428 519846 547038
11392 547038 579929 619946 675944 754617 847131 934677 1001500 1044824 1076209 1102387 1137010
11381 1137010 1185714 1241470 1302706 1366649 1427817 1484631 1547547 1623680 1719262 1838182 1977082
11370 1977082 2135125 2319986 2536544 2788779 3077135 3416299 3810784 4270776 4806098
11361 4806098 5440932 6205694 7151126 8363356 9968428 12149648 15198491 19378910 24672662
11352 24672662 30575717 36269193 41169415 45358520 49446471 53892997 58448794 62128492
11344 62128492 63801567 63043263 60452288 57121977 53792624 50442164 46581838 41875706
11336 41875706 36486552 30976509 25956857 21822287 18645399 16270132 14455941 13001454
11328 13001454 11778744 10716802 9777770 8935282 8151186 7402359 6689484 6018587 5409103
11319 5409103 4874281 4419370 4024638 3688792 3396807 3140576 2919242 2722871 2548509
11310 2548509 2385882 2235225 2098178 1967638 1849162 1746481 1652913 1568091 1489215 1418611
11300 1418611 1354364 1296880 1248969 1202505 1158630 1115637 1077890 1041903 1007354 972900 936176
11289 936176 904260 875751 844773 815145 792167 771080 752569 735398 723013 709730 694012
11278 694012 684896 677529 671008 660101 653961 651254 651673 644168 636189 625256 610461 594718 576427
11265 576427 567234 566876 564657 564861 561963 553465 552314 556157 561880 561057 559108 557987 553667 552058 551315
11250 551315 549870 544098 535767 524818 514493 505475 494966 474402 450592 431522 413850 395862
11238 395862 378026 365999 353336 335743 319059 310058 304246 301459 293544 288180 287832 285120 281224
11225 281224 277508 279384 277819 276626 274997 274773 270288 265890 264676 260948 254080 240636 233610 226189
11211 226189 219446 213668 210195 199354 185136 172540 162288 159740 160572 159633 158883 157251 153125 148155
11197 148155 146031 138995 133243 129078 122658 116602 112322 103666 95496 91121 90256 92816 91510 89697
11183 89697 89766 91880 92510 93861 88656 80428 80064 87312 91548 90815 85448 83863 86738 83551 78985 76292
11167 76292 71284 65410 60999 53591 53396 52393 46587 48084 50187 50463 45902 46967 50156 57085 60197
11152 60197 63137 67384 74327 80240 84805 89761 92176 96988 98451 101568 101338 98028 98520 99595 101898
11137 101898 105929 105217 105837 103212 102609 102302 97693 94184 96694 97087 100470 98684 94401 93928 93955 90727
11121 90727 83361 81005 85063 85351 88547 88449 85816 90689 90521 87802 83481 84431 85857 84707 86481 90014
11105 90014 93068 95584 96651 99323 101561 109167 117108 123504 131175 135506 131205 124595 118665 110179
11091 110179 103363 97108 96690 97698 93424 87570 84848 87580 85247 83125 81411 76067 71975 72280 72425
11076 72425 74589 73707 69936 69126 66852 62729 60980 59643 60102 58883 59451 55668 56963 61403 60866 60774
11060 60774 64436 63931 65568 68443 64578 59292 55136 54809 53811 56421 61598 64755 63765 59960 53757
11045 53757 48466 51639 57246 54850 54948 54116 51207 48576 48045 53106 55833 54110 53552 56110 59191 60916
11029 60916 62356 66647 68292 67779 70461 66567 63466 66004 69387 66440 65908 66038 62904 59808 56889
11014 56889 58362 58772 57803 60204 58867 59531 57116 62278 65357 63485 62904 63163 62125 61025 60431 66609
10998 66609 72688 77487 74373 75315 78226 81847 81113 79711 80392 79107 76783 69895 66400 65705 63760
10983 63760 64404 61836 59325 60164 60010 58446 55825 55205 60306 60721 59836 62298 60884 61928 61180 65320
10967 65320 72512 76699 76455 79233 87300 90082 98608 115795 134440 155758 180417 220702 283008
10954 283008 356880 435035 498657 523355 509872 459388 393327 328719 270715 224476 193581
10943 193581 173590 158504 148853 143396 137901 137688 136435 142397 148128 152322 163939 182718 205325
10930 205325 231129 257491 285690 308475 329897 349724 369545 387562 396701 394660 385010 370046
10918 370046 354515 333811 310914 283701 254124 226366 200842 178039 163338 150047 137973
10907 137973 135090 129143 121773 118234 111117 105624 104682 102466 97583 97040 95772 95219 92280 86608 83270
10892 83270 79949 80820 78877 76792 78264 76849 74007 75370 77457 72624 68633 71539 73111 78226 80775
10877 80775 80440 81051 88054 88978 84992 83102 84487 88809 88576 90021 98010 107775 116901 117822 119658 131818
10861 131818 141554 147640 154349 167267 185167 209127 237212 270991 317547 380361 457081 541967
10849 541967 631404 702598 726079 700263 639663 566663 485987 418879 359929 320775 287907
10838 287907 267281 251686 240976 239566 228943 215524 202566 186241 173610 162135 153968 152716
10826 152716 150905 149274 150987 152928 150472 144035 141024 140259 137943 136975 133649 131434 130896 132770 136428
10811 136428 137781 131523 127927 128344 125776 121450 117597 113312 111815 111081 110645 107006 105663 108745 108131
10796 108131 108547 105150 102307 104281 104453 100105 99722 100499 100161 94480 94967 97585 94679 95579 97441 99818
10780 99818 101137 101582 104610 108845 110908 110383 109175 109271 105739 103615 101398 101665 107250 107875 105481 105165
10764 105165 105453 105530 107623 107482 105768 108585 109797 105133 109931 111810 111711 117681 120509 117801 118542 124299
10748 124299 123256 120644 116231 116617 124448 130718 133666 136375 135736 138991 142335 143639 145631 143401 148127
10733 148127 149651 151377 154354 154939 146965 139297 142245 146095 145727 147248 146324 143262 139729 136428 133324
10718 133324 134904 134183 132161 133544 135698 140661 141330 140535 144135 148685 148855 152000 155134 156899 160833
10703 160833 157589 153612 157917 161998 161965 160550 166103 167908 164647 164313 165762 168135 173488 180110 183017
10688 183017 184170 184816 188969 192422 192425 192410 190953 186018 185412 178460 173175 171357 172925 173235 175399 180265
10672 180265 186431 186723 188314 193165 191837 193775 193552 192937 191925 189741 192262 198956 200999 200233 194972
10657 194972 189073 190991 196000 200159 198499 199236 199851 199744 199537 199389 204579 208257 211804 211354 213346 214766
10641 214766 217436 222231 224141 222259 221305 217341 216267 217404 220675 220789 222281 222592 225441 231020 237785
10626 237785 242413 249582 256286 267799 278293 288431 298378 318816 341692 358863 375671 383829
10614 383829 385941 385088 386017 384089 383393 383616 384206 381865 382849 387204 390835 390021 384698 380336 381848 384361
10598 384361 382067 383431 388763 391175 394688 402969 413309 422382 423060 428712 439918 448914 454384 456855
10584 456855 461043 460931 465482 472644 472808 468943 470114 468067 471533 478564 484128 485635 493213 502976 507093
10569 507093 514184 523361 530964 540234 551955 560495 570655 587126 603130 612148 610485 607140 599266
10556 599266 588768 579034 568087 567398 571853 584515 602891 628429 649618 667304 688562 707039
10544 707039 720589 732233 748969 769752 789587 811063 836290 857539 876912 901772 930916
10533 930916 957760 988827 1013821 1036631 1058775 1080962 1101587 1128818 1152722 1173716 1193133
10522 1193133 1215589 1247029 1282624 1320914 1353391 1385849 1426386 1470713 1514485 1558867 1606543
10511 1606543 1655266 1703179 1749134 1795419 1842379 1896407 1950966 2010578 2078312 2146749 2212600
10500 2212600 2283339 2360440 2446918 2539000 2637948 2736285 2846362 2968345 3095486 3228267
10490 3228267 3367634 3503941 3637198 3768471 3893255 4020640 4164497 4323974 4494968
10481 4494968 4691482 4910790 5148288 5401204 5676959 5976917 6297910 6632833 6981731
10472 6981731 7329952 7676473 8025219 8381666 8747920 9128679 9524422 9925228 10330441
10463 10330441 10744121 11159971 11566483 11967059 12357433 12732153 13087192 13428134 13761642
10454 13761642 14084894 14393727 14690722 14984975 15277654 15584425 15918132 16283383 16674272
10445 16674272 17098195 17573729 18139476 18859386 19791395 21020665 22648174 24803233 27663802
10436 27663802 31468399 36552520 43398415 52626116 64864903 80285977 97648563 113487690
10428 113487690 123310849 124496123 117438880 104562882 89150185 74100198 61070999
10421 61070999 50527945 42258890 35834427 30834119 26901764 23772914 21235747 19142888
10413 19142888 17392907 15903333 14613796 13472252 12436298 11482708 10605674 9807356
10405 9807356 9086634 8449672 7893508 7407587 6977861 6586859 6228611 5896834 5592597
10396 5592597 5309998 5052937 4815097 4593452 4393513 4211007 4044779 3889538 3740645
10387 3740645 3599512 3462606 3331405 3207771 3092721 2993795 2904070 2822215 2755167 2698600
10377 2698600 2652178 2615161 2580895 2546079 2501382 2440069 2358294 2272820 2180111 2085301 1987894
10366 1987894 1891556 1798594 1712981 1643864 1576919 1519981 1471948 1427252 1388117 1347247 1309550
10355 1309550 1276624 1246396 1220801 1193681 1167116 1145404 1119192 1093633 1079177 1067795 1059435
10344 1059435 1053896 1055019 1059116 1069527 1088531 1102577 1113179 1113832 1104462 1086226 1059385 1021488
10332 1021488 971481 919354 867120 823198 786519 757255 733989 717662 700257 682230 665159
10321 665159 648980 636940 626355 614141 600102 592381 588718 581225 576976 571031 561615 549825 544535
10308 544535 544082 544230 543686 545851 559547 574391 585123 590590 582997 562355 525738 485538 450552
10295 450552 427531 418916 415892 413344 408385 401429 397692 392676 383812 376650 370159 365822 357796 354623
10281 354623 352244 344509 339766 339520 333510 324130 314840 305028 299198 288999 276809 271435 269654 267019
10267 267019 264022 261166 261770 263632 263815 261148 256992 259732 260861 259428 262334 266568 264593 262563 262869
10252 262869 258921 252837 244161 238415 231706 226788 221721 212614 203591 198377 192519 186621 181935 189220
10238 189220 201463 210406 226946 240863 246617 250492 254210 261969 271188 281013 283582 286205 292192
10225 292192 293421 292323 292973 294468 297836 295986 294521 291385 290111 289833 290222 291960 294564 299107 305841
10210 305841 314555 321959 328452 330291 330270 329778 326938 323733 328137 339875 354869 374556 405628 449292
10196 449292 511373 602144 747238 957678 1263640 1645201 1993796 2175429 2137254 1920341
10186 1920341 1614415 1301558 1042959 854805 724723 637486 581235 542731 516451 495692
10176 495692 485623 481913 481657 487977 489806 497619 504062 506425 513072 523641 537286 552939 574338
10163 574338 605395 647443 694375 747385 809686 881042 975410 1093159 1234538 1411216 1635475
10152 1635475 1929358 2332940 2892932 3635191 4547160 5541459 6424009 6954117 6996997 6575348
10142 6575348 5821322 4928965 4055673 3298014 2687914 2218359 1858153 1580472 1371780
10133 1371780 1210012 1085327 982211 900969 835704 770522 713729 656096 606135 564669 528180
10122 528180 499092 472600 450228 431937 408227 390933 371047 353242 337103 322517 308850
10111 308850 296499 291304 290377 287601 281802 273472 264415 254084 242854 234826 226165 219813 210777 202905
10097 202905 199697 197313 191931 184746 179596 171434 168512 168102 165595 162583 155891 152383 148308 140998
10083 140998 141271 139547 135317 131496 133070 135662 135689 131095 128585 130328 128942 129630 133462 135098 132029
10068 132029 127811 130723 127088 120720 121597 123049 118039 118879 118305 113279 109013 109348 107255 109681 107536
10053 107536 105100 98891 96529 96236 96709 95549 95635 93008 90346 91985 93478 94039 103046 107619 105664
10038 105664 107801 106819 110730 117570 119919 120532 120774 120404 121157 123209 120691 118408 117733 117578 120076 119990
10022 119990 121200 122285 125089 130703 133599 137249 143149 146962 157487 163950 175899 192296 215422
10009 215422 242608 279926 329084 390191 472078 565745 649231 700723 707790 673046 605260 522300
9997 522300 445427 378050 325280 284535 249229 226339 208741 190548 177882 165196 154337 145810
9985 145810 136879 133708 133027 125716 119379 114328 110325 106304 102534 100833 97758 91669 89500 89799 93872
9970 93872 98778 96595 94334 91645 86468 82851 83451 85249 84492 86264 86573 81783 75923 78066 78367 79462
9954 79462 81231 81338 80424 82690 85588 86075 83623 80276 79635 79297 73554 70628 71285 68659 70777 75436
9938 75436 73077 71020 70725 73120 74193 70927 70048 70767 71864 71617 73177 72206 70205 67221 67336 67404 66706
9921 66706 65065 62327 66244 65631 59806 58970 60848 59988 60526 57708 57007 58861 61882 66510 69220 66394
9905 66394 62070 60897 61488 59947 60392 60739 56848 53209 56058 58501 59364 61965 62376 59046 60312 61530
9889 61530 61740 62793 57060 54508 55237 55915 55723 55710 54593 54177 55225 58008 59467 60267 59647 59586 59022 57087
9871 57087 54525 53933 53625 53757 52057 51476 49716 49962 50340 47205 45526 46844 48485 49020 49007 49761 50756
9854 50756 48907 46592 47957 49590 52340 49887 46154 42883 50086 50195 49490 46987 46422 48776 51902
9839 51902 51951 55489 57268 58654 55204 56461 54481 52901 52565 47693 45586 50615 49409 43787 42108
9824 42108 39383 39842 41335 43742 43594 44707 44697 44584 44448 41383 40007 42733 43621 43430 46337 49587 51555
9807 51555 49239 45737 48480 49773 49952 49890 51313 49993 50930 57135 58387 55569 50886 42942 45088 57290
9791 57290 63069 60265 63223 63476 64712 69507 68116 62787 58870 55556 52391 49662 50447 46190 46546
9776 46546 47256 47121 47899 50360 53817 57251 57803 56294 53777 56575 56271 55834 53878 52139 54832 56447
9760 56447 53825 51733 51713 47817 43029 48322 51894 50698 44912 43564 45960 45122 47346 48977 49560 51005
9744 51005 49502 50479 50675 51006 54553 56962 57597 57451 55040 54593 54233 54410 57501 63020 64192 58647 61150
9727 61150 65115 64739 63850 70285 75150 77367 84638 88086 86363 89238 89008 84260 80897 80675 77599 71083
9711 71083 68011 63825 58438 59091 56575 52961 54576 53265 52363 51511 49904 52175 55684 53510 53239 57504
9695 57504 55706 50899 47805 50209 47756 54007 56387 54671 56047 51607 54373 53289 51401 54042 57759
9680 57759 60568 62988 64904 65962 68311 64864 62611 66706 68559 69873 71044 73096 75306 77103 80902
9665 80902 85990 93764 100588 102168 108692 116301 120172 117309 112586 113191 110914 111841 113233 115837 115099
9650 115099 111556 105043 96705 94996 96056 94738 85223 80825 75387 72468 72800 74186 71159 68319 65331
9635 65331 62666 62920 65232 68338 69970 71993 72758 70461 70281 72381 70801 72492 73830 73473 74312 77687
9619 77687 79472 79311 74820 72175 70300 67823 67481 64727 62344 62336 58691 60092 62099 61662 62271 62455 63210
9602 63210 64864 63913 70111 72519 68339 66785 66586 68431 70120 71670 71748 66686 63519 67174 69957 69555
9586 69555 76502 79987 77056 76047 76580 78355 80400 79033 75897 75411 78585 81958 78113 75348 77318
9571 77318 77987 71825 71510 76134 78285 77837 80988 79201 76174 77053 76750 77482 80303 82300 84162 84887
9555 84887 87163 94165 94823 89125 84392 82556 79652 81056 83653 81447 77590 76812 76555 72902 72108 77148
9539 77148 78740 75252 73758 76319 72679 74972 76940 84426 87377 88896 91410 93631 91108 88880 87531
9524 87531 92673 93822 95169 96168 94918 88266 87220 86630 86816 87477 88309 93032 91710 88021 83622 87512
9508 87512 93680 93406 91698 92051 93780 89526 84195 85623 83702 81284 80098 81619 81362 78829 76027
9493 76027 73374 76364 80820 78727 78440 76524 78364 74647 69140 72207 74937 73073 68861 70388 73969
9478 73969 75904 75005 77243 77643 75863 75959 76966 80985 80402 81605 83535 86104 87000 82443 80908 79487
9462 79487 74745 75321 78953 81475 80749 80104 87722 94985 96334 95115 96164 103432 114322 122310 127017
9447 127017 130552 128970 129705 125529 123033 126242 125513 126830 126673 123222 123180 124248 121687 118116 120400 115761
9431 115761 108599 102302 96905 89631 84767 83512 81986 83056 90240 88753 81966 77116 75154 77256
9417 77256 76863 78051 79770 80505 77765 75202 76206 80138 82836 78980 69244 64227 65597 65491 63206
9402 63206 63246 62479 64441 69049 74330 77427 81081 82447 80718 81267 82972 84768 83770 86147 90294 91176
9386 91176 90901 97733 98161 94199 91967 89650 91316 87392 86615 92194 95671 94818 96220 98557 101446 99530
9370 99530 94014 89986 92209 93203 86007 80879 79195 81072 80386 83640 88537 99570 112404 120954 123661
9355 123661 125837 127941 126617 128874 133780 135532 132820 131585 132196 134654 136136 140281 148621 155981 160644
9340 160644 156194 160903 168961 180574 189550 204217 218551 231830 245655 266965 290408 320296
9328 320296 362979 424021 504113 607333 735853 884865 1045214 1194197 1307180 1368219
9318 1368219 1361611 1290319 1178055 1040354 895056 761243 647124 555291 484531 425844 374179
9307 374179 337551 314978 298122 286931 278271 272368 257639 243676 233641 223742 216504 209825 203613
9294 203613 195196 189486 186189 183117 179344 180783 183066 186863 183254 177101 173482 173210 174011 174730 171836
9279 171836 167689 169605 174804 177687 190185 197857 204324 215671 223073 226510 229496 226677 216779 208465
9265 208465 199478 190002 185949 182150 179241 179481 178765 173861 171539 171249 166892 161130 157213 153407 152180
9250 152180 153223 153120 155403 156010 155818 155758 153175 151501 153383 152131 147609 146836 148161 151381 156157 165678
9234 165678 176742 186383 198274 202646 211009 211430 205683 196751 191870 185459 180679 177505 177301 174190
9220 174190 169846 169344 167689 167317 168300 168638 169516 165675 162225 156923 152756 154035 156980 158086 156682 157062
9204 157062 159636 166670 177467 183050 186422 193436 202210 205324 200881 198548 193373 191064 190368 199696
9190 199696 215238 226696 230103 226996 218746 214000 210404 210430 217340 230632 245921 261670 265461 252940
9176 252940 234943 218732 203006 188833 183853 179746 174161 166286 157930 151783 151593 154471 155611 152885
9162 152885 149083 142401 142792 142445 141113 142989 141049 144515 148379 152471 158861 156217 156081 151045 149561
9147 149561 152503 155881 147702 134871 124508 122368 122964 124600 124212 121819 124952 131164 133532 133360 138847
9132 138847 135181 123128 109540 102141 100382 94558 90012 93344 97197 98464 101220 113731 130616
9119 130616 140217 147018 164489 178559 198164 225374 269336 325353 371299 396440 402087 400117
9107 400117 389267 373981 359426 347295 336598 327826 320530 314215 311148 306469 305367 307095 306936
9094 306936 301863 300233 301056 303458 302622 301997 301731 307010 316344 328268 340610 350011 361929 374335
9080 374335 384346 388296 381893 365698 354588 351024 344042 332951 326144 320367 313321 317795 327767
9067 327767 327766 334668 338310 340890 340131 341808 345724 346397 348316 351368 363707 393106 430271 457420 468205
9052 468205 459015 445598 447286 476983 544938 668098 813045 915443 947759 914414 837402
9041 837402 746290 660538 591489 538769 496431 465185 451117 451272 456968 459197 464943 474322 482837
9028 482837 488626 493745 501977 518355 538628 555839 580199 606261 641218 673927 686399 678780
9016 678780 662043 649730 632417 613657 594622 582539 584389 589760 599551 615112 632023 650480
9004 650480 665668 678573 693091 705376 713925 723449 735051 751384 774565 798042 831806 874159
8992 874159 909202 937789 959217 977595 1004865 1031116 1052364 1068499 1074978 1072860 1074566 1083550
8980 1083550 1097917 1131709 1186606 1264871 1358753 1447040 1512819 1554801 1578845 1596401 1623415
8969 1623415 1665709 1730509 1808217 1890041 1976343 2064695 2163290 2280787 2426546 2605495 2816728
8958 2816728 3055952 3324142 3619630 3921365 4222478 4506415 4774991 5046504 5338854 5664605
8948 5664605 6032476 6438183 6905033 7455229 8112014 8916936 9924034 11165753 12593978
8939 12593978 14134908 15840558 17828040 20116729 22591383 25191215 28092908 31655998
8931 31655998 36421513 43106214 52680139 66665632 87566297 119194845 165557017 224578126
8923 224578126 279099459 306533017 301595714 271518225 225668623 176814992 135127353
8916 135127353 103788900 81502209 65817389 54682137 46692765 40916920 36679153
8909 36679153 33450570 30801220 28431923 26137887 23796606 21448219 19224739 17248915
8901 17248915 15590244 14218203 13051341 12039717 11157743 10406962 9769159 9211400 8710188
8892 8710188 8259181 7859719 7511267 7224489 6998905 6832154 6718099 6656876 6641661 6691647
8882 6691647 6838130 7108520 7560819 8266308 9333590 10895667 12999395 15393395 17398240
8873 17398240 18278490 17827605 16330412 14289456 12217701 10449986 9073407 8048264
8865 8048264 7294392 6755444 6375822 6101079 5865335 5615694 5349885 5086030 4843428 4631965
8855 4631965 4427391 4216575 3992175 3757231 3520453 3291945 3079506 2881454 2697499 2535166
8845 2535166 2387606 2259695 2148245 2050302 1966974 1896239 1840346 1789214 1736765 1677027 1608772
8834 1608772 1530623 1439451 1349853 1270980 1213946 1171245 1131737 1094692 1050348 1007298 963075
8823 963075 927682 897481 873055 853269 831713 815867 800115 783753 764358 744772 728535 714951
8811 714951 707949 703566 696651 693318 688807 672326 653449 638263 628811 625423 625866 635831 659915 708079
8797 708079 766884 827797 877141 875139 798988 681536 548639 438982 387560 391028 422090
8786 422090 450436 456274 442148 417399 392976 376045 360353 346769 333780 322278 314460 311136
8774 311136 304371 299212 294173 280012 265831 252772 241381 224890 202114 177416 165032 161320
8762 161320 157608 163236 174588 187359 194802 200276 205932 203391 196371 191670 190786 191443 188438 188976 194496
8747 194496 199577 197902 186058 171347 155469 139884 120204 99359 84458 68655 46409 22009
8735 22009 1797 -10159 -4915 26447 67423 111968 151677 177041 187897 196406 215786 233412
8723 233412 242366 249823 260329 269828 271367 267978 269427 270057 264148 259304 249767 239489 227909 218144
8709 218144 213589 211039 209055 211234 215085 218890 218797 219257 218557 217065 209243 201914 195326 199326 204614
8694 204614 203577 208588 211367 217746 223919 237407 257825 283148 311217 342141 360345 368333 369762
8681 369762 353688 335428 321669 300761 283017 267941 253023 238325 229229 225455 224329 229533
8669 229533 239339 248072 252641 255830 255467 250138 245453 240263 231955 225724 221211 224003 226067 228162 228667
8654 228667 228812 231526 227791 224324 220114 206855 198101 186745 177443 176986 179354 181357 184510 185522
8640 185522 185664 187310 185482 184950 181332 172660 170320 172385 169769 171170 170565 165306 158620 152619 148523
8625 148523 147789 144081 136535 133326 136904 138175 134897 128341 126785 124161 125965 126958 123459 124365 130533
8610 130533 136289 147348 161941 171377 176569 176857 181334 188360 199195 210269 213324 213052 214924 219596
8596 219596 222590 225310 223280 227203 231458 234013 230202 230481 228318 227497 225951 219696 214209 210851 204295
8581 204295 193707 184930 174130 167158 162028 156577 153754 148523 149001 149716 152377 154446 160790 163229
8567 163229 163748 167092 167599 163731 161323 160763 161140 162412 155036 149021 149994 149688 147206 145376 147116 153153
8551 153153 160108 165700 166830 173560 184471 195561 207919 221533 237875 255540 275585 300323
8539 300323 322979 340895 356390 370327 375608 380194 383157 389366 403392 422065 448335 484112
8527 484112 534656 610121 713955 847404 1009062 1185658 1346339 1467177 1535191 1532143 1457769
8516 1457769 1331800 1176644 1008565 854876 724098 616208 534427 464579 413175 374094
8506 374094 340574 316576 293433 275315 266725 258554 256363 260000 269430 284947 308417 328629 327673
8493 327673 312901 288996 258047 231346 207985 189372 175808 172148 168441 168025 167397 168231 167518 162095
8479 162095 159058 161302 162748 164478 164489 163042 163645 165336 164874 163533 159044 154305 145577 135944 131464
8464 131464 128683 126321 123460 120578 115366 111680 107476 104733 99414 96875 97858 97759 97742 95763 97828 95994
8448 95994 93192 94385 96333 99995 103677 106801 102501 95009 93515 94540 97467 96964 91442 86375 82208
8433 82208 82205 81477 81695 81587 76011 76247 86390 90970 89517 91401 90124 89936 90536 90981 90013 86633 83514
8416 83514 78662 75599 76137 74750 73922 76429 76272 74588 77459 81025 78332 74116 75421 77306 77894 77630
8400 77630 78164 77568 75179 71884 70013 67968 63081 64922 65336 65232 66963 70255 69370 68960 69352 72899
8384 72899 75488 75084 77888 78049 79234 79964 77470 69554 65717 65363 63272 65066 69982 69921 73454 69891
8368 69891 68902 69947 71669 70812 66082 67301 66996 66148 66128 68228 67324 68216 71159 70581 68928 69593 70809
8351 70809 69315 67205 68783 73427 71425 70745 68718 67149 62668 62567 67306 71964 71984 72266 79403 84806
8335 84806 91016 95639 97332 93818 88848 76013 68478 67315 66881 64768 64528 64794 68468 69274 64352
8320 64352 61462 61592 62668 59884 58420 59762 62483 67571 68567 65385 65343 70165 70766 69217 66974 66581
8304 66581 68245 70761 68616 69659 70549 71409 71271 70677 71966 77646 86490 95905 98269 101142 100159 93396
8288 93396 83922 78703 79824 74300 70857 66005 60422 62543 65559 72304 76872 73793 74670 70766 67883
8273 67883 64963 64142 69829 70721 69183 65189 63930 62821 61519 61336 63508 64753 69310 72087 72600 70103
8257 70103 68245 67308 67886 66303 67606 69207 75192 74849 77049 79787 79827 77667 79161 78088 73777 73119
8241 73119 72882 73919 76063 75143 77172 80527 85825 88830 93165 95040 95099 95976 99269 99381 99538 92042
8225 92042 90518 90752 93493 91999 86604 85601 85105 85187 88605 93950 94433 93302 99942 112123 123524
8210 123524 133746 134842 130409 128392 122938 114216 102789 95555 93214 90682 91912 97551 100494 100344
8196 100344 102537 103381 97857 95976 99164 103693 107705 104118 104729 110161 114441 117232 120579 124313 130376
8181 130376 135137 137382 136030 134949 134732 131671 128263 129249 129090 139647 156087 171574 191854 210275
8167 210275 224752 227665 217937 204628 194783 180060 168339 151957 140700 140553 139557 138119 133742
8154 133742 129412 127759 123239 121693 122956 125189 126324 125284 124313 127493 125568 123328 125933 133286 141797
8139 141797 151029 160463 169290 176702 182662 188748 195730 194985 192827 194785 200189 203928 208278 206737 200628
8124 200628 195137 191733 181216 166960 155108 145456 139069 135542 136002 136614 137802 143548 149142 154632
8110 154632 156892 156857 165486 173708 178111 178017 175744 171890 163463 156519 151606 146910 140931 135470 134594 136219
8094 136219 138204 145398 150775 155708 163938 171670 178796 178042 172112 160559 152186 148844 146901 141657
8080 141657 141326 139982 142896 149999 157837 169195 177349 180571 180405 175723 167683 160173 159437 157981 156191
8065 156191 158821 160811 161089 167682 176667 177719 180588 186646 193989 204672 217559 229432 237768 238123
8051 238123 232233 223178 216713 203834 188337 178518 176569 174158 174175 179888 185931 188899 198867 212676
8037 212676 221243 227886 232738 238560 242067 240822 238227 234949 226941 213846 202327 186355 177858 174039
8023 174039 175666 172178 170341 172252 171461 171145 169861 175831 183452 193268 206152 227061 250585 265514
8009 265514 273601 271519 268068 262368 252503 243551 235645 229819 227823 224875 227838 235532 239882 248864
7995 248864 257655 261136 264052 262962 254343 251013 243943 231000 218369 204909 197427 190533 186698 182058
7981 182058 183508 186343 189523 198790 203016 206522 209628 215710 221603 224023 223293 230402 238861 249489
7967 249489 267393 277078 290119 301569 313276 319065 319938 321823 328858 339622 355053 373607 401694
7954 401694 428061 454843 481842 500445 515464 521997 519437 511998 500459 489150 487236 483626 481471
7941 481471 480546 478156 469415 454216 437326 419230 396654 379334 362259 352553 345953 341471 336981
7928 336981 336383 341814 342403 348272 355263 359215 358598 355364 351967 347522 349960 355113 360069 376961 400299
7913 400299 424730 449907 472184 492097 504515 509306 506060 494106 478356 465636 454236 450341
7901 450341 448182 441388 423226 405928 389798 369299 349340 330557 311527 293833 277917 263520
7889 263520 247268 235538 230125 228070 223856 218026 214965 206033 199159 197446 196648 188092 180064 170099
7875 170099 161152 154192 148517 145160 144774 140243 136389 133027 131216 128186 121961 117127 114591 112031 108239
7860 108239 105560 104300 99548 99659 101237 96090 92322 92925 89782 84128 79071 80160 85526 83578 84984
7845 84984 86404 83678 80453 79009 80487 80892 77624 76011 78120 71623 69966 70349 69422 70656 73132
7830 73132 74275 75155 78719 83764 89893 89058 93471 89926 85448 83514 79733 76562 71100 64235 60120
7815 60120 58203 61154 61021 59164 56240 57201 55278 53097 53949 51844 45736 46026 46683 50628 52672 51965
7799 51965 54290 51484 49904 48970 50517 50890 50024 48434 43139 44304 44934 46501 50271 52818 55079 58356
7783 58356 63966 67087 64589 61831 64274 66753 63429 56991 51284 48992 51977 51808 51157 52890 54148
7768 54148 57246 57789 58496 55872 52176 48330 43084 41548 47478 51741 48855 44768 51910 57839 61178
7753 61178 59422 59950 57266 53917 54426 55988 56567 62469 67705 66938 65194 62798 58686 58661 64463 69371
7737 69371 71634 68851 66206 64682 63516 67445 69770 74835 70811 62722 56264 55621 57971 60364 58085
7722 58085 62917 72585 68614 67409 70464 72452 72916 72258 72083 76520 80677 82741 83531 83480 77925 74386
7706 74386 73344 68512 64034 61680 60037 55989 49500 50067 48718 51949 58220 57218 51118 48338 49215
7691 49215 49714 47657 43229 39289 37083 42277 40809 39067 35089 30450 31715 30556 32956 33662 35903
7676 35903 39769 43491 44358 41529 40220 43615 42953 39294 35391 33097 37178 39152 32548 28852 28082
7661 28082 30442 26823 17623 17798 21202 22487 22607 20196 21776 26213 29219 26306 24526 24160 22148
7646 22148 23901 25585 24609 26777 26473 26785 25595 26389 23476 21072 19494 16615 15918 20093 22387 19657
7630 19657 20645 20762 23091 25645 28048 29758 27130 23093 19225 19909 21508 23900 24018 21526 13370 5618
7614 5618 7589 11332 8938 8434 10954 14806 13017 10396 9631 9774 12445 15232 15993 15022 11902 9413
7598 9413 8117 9962 13858 15901 14068 12080 13052 13102 9993 7338 8541 4717 4756 8843 11026 11955
7582 11955 10033 9654 5431 9127 12677 11365 10427 9382 8741 11153 10619 12471 9878 9148 9306 8729
7566 8729 7531 6010 1616 3585 11906 16112 15377 13741 12651 9671 12906 14171 14554 12566 9093
7551 9093 5606 6312 9002 8770 2428 4832 7650 11914 12178 11498 11026 10071 9099 9407 7399 7161 13008
7534 13008 16651 15211 10161 4678 4693 4687 1792 3870 4083 6279 8298 7164 3284 5865 9706 10142
7518 10142 7649 6782 6520 6378 10562 8738 4990 7747 8965 7602 7317 2540 1904 7315 6098 2652
7502 2652 1232 -697 -1549 1940 2291 -366 2447 7061 8621 7968 8230 6479 3106 5202 9830 7411
7486 7411 6513 7375 6949 5651 7348 7835 7959 12296 13084 12045 10927 11407 7513 -147 1312 2717 6857
7469 6857 8245 2581 825 213 119 317 -3468 -3915 -545 2563 2023 5080 3813 3897 4145 5740 4125
7452 4125 1878 5015 8238 8008 10725 9647 5783 3449 3878 4430 1432 489 -2991 -4016 -1695 3289
7436 3289 6900 9338 7708 5857 1660 1858 323 -848 915 4395 5226 2674 -3142 -4968 -4542 -3219
7420 -3219 455 9277 19431 29632 35325 30346 15671 4255 -2488 -2896 -3927 -1816 -3184 -4716
7406 -4716 -4439 -4026 -4090 -4177 -5943 -2542 -3512 -4666 -5626 -5973 -4667 -3526 -4507 -4444 -5870 -7265 -4247 -593
7388 -593 585 -682 1252 5019 6061 7537 13096 12664 4608 1150 3633 4961 5348 7756 4884 1921
7372 1921 -19 -4059 -800 1314 1705 2314 2254 -3306 -9420 -10094 -4843 152 3161 4496 7347 8138
7356 8138 9124 9868 8539 5375 1887 1266 2640 4226 5660 2457 1060 650 -2149 -464 -1987 -5746
7340 -5746 -7518 -6083 -1703 710 -959 -2591 -5757 -1078 4881 5954 344 -2554 -2358 -965 1007
7325 1007 4907 4880 -512 -1534 4 2062 2932 -3857 -4192 -2899 965 -1093 -2027 -4048 -3925 611
7309 611 735 -2736 -6547 -7714 -5138 -8654 -10737 -9661 -8655 -6090 -3366 -773 1603 -1889 -3799
7294 -3799 -413 1226 3908 1311 161 1358 267 2242 1435 -2141 -7022 -8554 -4976 -1513 -4779
7279 -4779 -1209 3721 1274 -2615 -1422 -398 -3775 -7382 -12841 -10111 -4500 -5635 -9902 -10884 -8847
7264 -8847 -1370 -793 -2166 -3112 -6568 -5826 -4318 -2864 -512 2205 3067 828 3353 4401 6015 890
7248 890 -1710 -5451 -3420 1146 546 386 -2396 -3419 -2499 -2637 -6140 -5443 -333 286 -1405 -2553 -240
7231 -240 4811 7494 8755 8626 5534 3361 2137 -1094 -3180 -7996 -4307 331 -1275 0 2712
7216 2712 1712 -1941 443 584 -3612 -3717 -877 -1774 -1813 -5999 -6583 -8944 -10480 -8409 -8295 -9168 -2077
7199 -2077 4698 8452 7333 3446 369 469 6166 5941 -3516 -6249 -7244 -8128 -4620 -5020 -1737 -147
7183 -147 -943 3015 6008 4827 1986 883 1770 4868 4608 4433 1304 4858 8165 9496 4323 2187
7167 2187 1218 -1399 -375 -1542 -4976 -6711 -6292 -5279 -6905 -4715 -947 2011 7181 5795 -1835
7152 -1835 -4602 -2717 785 -94 -2721 -893 200 199 1544 5556 4259 52 1686 1394 -731 343
7136 343 -21 -2220 -964 -4058 -3968 -7049 -6379 -4486 -2844 -2302 -4565 -5439 -3107 -249 1043 -2433 -5203
7119 -5203 -5774 -4472 -5477 -1828 -368 -968 -190 506 -2517 -5943 -3347 -166 -1267 -4312 -3158 225
7103 225 969 1297 3900 2058 908 1320 4574 5144 -450 -5520 -2309 -1812 -2973 -7873 -8696 -9768 -9204
7086 -9204 -7527 -5370 -2511 1889 623 -1011 -6071 -1639 3872 5480 5834 5422 2340 881 -2663
7071 -2663 -2597 -1947 -4353 -1282 -148 -2358 1353 4103 2941 2947 591 -1340 -3866 -1726 -333 126 -2697
7054 -2697 -3116 -3501 3220 6733 -580 -5343 -3018 1503 7800 2432 -3746 -4602 -3540 2231 539 -3025
7038 -3025 1089 5836 7071 365 -5781 -1726 1803 4978 1142 904 3599 1590 399 1795 709
7023 709 562 -2509 -2855 -3147 -5153 -4435 -5066 -3368 2007 1840 3590 1060 -551 -1485 -3960 -7764 -5416
7006 -5416 -779 1503 1300 3778 5343 2581 891 -1317 -2472 -2089 -1840 -2238 -5041 -5547 -3387 -1033
6990 -1033 -1454 -1743 -2857 -4495 -2949 -2881 1656 2096 536 -2289 -4839 -3113 -3307 -3157 -2936 -5241 -6017
6973 -6017 -3199 -2549 -2120 -140 1036 -1200 -4473 -5245 -6439 -8048 -4790 -4977 -9711 -8262 -7160 -12583
6957 -12583 -14252 -10143 -4694 216 -326 711 -66 11 -2185 -5195 -1094 153 -3147 -7570 -7654 -4085
6941 -4085 -3628 774 3204 3847 2871 -2008 1870 3398 295 1199 -883 -1333 -2276 -1956 1542 2402 2045
6924 2045 2682 4460 5725 4587 -2040 -8267 -8334 -6521 -5961 -4648 57 4770 4088 2420 -791 -2084
6908 -2084 673 3289 7174 5013 474 142 4567 5320 4569 5033 2683 -3283 -7494 -4196 -1103 -415
6892 -415 -1400 -3365 -2481 -294 1366 1541 -637 -447 -3937 -3360 -2979 -4398 -7495 -2688 -2159 -2850 -2859 197
6874 197 1623 5308 3209 2964 3777 197 -1149 -4360 -4611 -7615 -8432 -7572 -8164 -3730 3419 4871 5955
6857 5955 9000 11905 9926 7029 2152 405 527 272 3325 2679 1587 3953 -29 -3979 -8399 -8962
6841 -8962 -5469 -4263 708 -449 -2582 -497 271 1364 1961 822 424 1417 926 176 -2452 -8216
6825 -8216 -5533 -5977 -3181 1935 3076 1818 2344 90 -5496 -7694 -2664 1599 7692 5960 1539
6810 1539 -1431 -3707 -2541 2305 1381 -384 3237 6077 6387 3646 592 3344 3659 -1445 -1944 72
6794 72 500 -1889 -1387 505 -72 -1516 -5387 -1431 659 -2873 -2570 -92 2008 1511 1972 1083 4365
6777 4365 3635 782 -2856 -2399 -1788 -1122 -1908 648 1056 1132 2079 2629 3567 5574 8984 5326 3153 1342
6759 1342 1485 -2949 -2855 -317 3337 5106 2355 1478 737 -5398 -6115 -5470 -1529 -183 596 2618 4158
6742 4158 3759 757 3943 3155 2173 -3172 -489 8851 8079 6832 4943 3230 5804 5973 10578 10787
6726 10787 12566 19186 22871 24487 29781 33856 34957 28404 19402 17774 14618 10738 5043 -1615 -101
6711 -101 3169 4082 2184 -4404 -8298 -7470 -3845 -475 2666 4727 5006 3080 670 798 1441 -124
6695 -124 879 1033 -96 -609 1153 3986 2079 -562 -2698 -6333 -3180 -888 -2121 -2722 -6122 -8232
6679 -8232 -3197 -3423 -6430 -7980 -8384 -11500 -7703 -10682 -9417 -6726 -10539 -6497 -878 -3718 -6555
6664 -6555 -5537 -1925 -222 -196 2472 3355 -1557 -4322 -7464 -9725 -5635 -5347 -1345 -1911 -3651 1126
6648 1126 3427 -28 -3865 -6497 -6717 -3730 -5614 -5930 -4687 -5733 -7549 -5407 -2328 -4893 -7800
6633 -7800 -1661 2193 3504 6176 3839 2573 3023 3275 1624 -780 -316 1384 -315 -2096 -3546 -4149
6617 -4149 -1304 442 -503 -506 3214 5246 3424 3401 1672 -660 -2658 1821 4014 5293 4608 2843 -526
6600 -526 -1010 67 -5691 -2624 3576 4864 2583 3152 -468 -2220 103 -121 -4467 -3969 -3509 -4950
6584 -4950 -5947 -2179 847 -132 -2012 -3702 -2593 -2760 -955 3625 3518 864 -3359 -8894 -11336 -11936
6568 -11936 -5518 -1949 -198 -3073 -5985 -8643 -5752 -4017 -1341 700 -1921 716 704 -1303 -4777
6553 -4777 -2492 -2638 -7433 -11621 -8229 -2554 -5681 -8622 -7779 -5401 -3371 -2778 -3776 -4467 -4637 -3729 -5442
6536 -5442 -4102 -961 -1924 232 -1818 -4632 -1465 -273 -948 -758 -2522 -4027 -5049 430 680 -809
6520 -809 -4694 -4754 -2243 -242 2700 1310 1712 -327 -2993 -7873 -10802 -10553 -7074 -5926 -6890 -4827
6504 -4827 -6265 -8182 -1366 4882 2867 3590 2256 -1700 -3884 -1217 6467 8824 3772 -586 -1399
6489 -1399 -5219 -7465 -4876 -6644 -6364 -7857 -11567 -11526 -11393 -10358 -8344 -5888 -767 -2733 -3401 -6352
6473 -6352 -6902 -3511 -1724 -78 -1635 -4583 -5267 -6872 -7634 -9802 -9850 -4950 -306 -1065 -2595 -1905 -385
6456 -385 -222 3065 6119 5551 2322 1018 -4273 -6292 -5186 -1687 3873 2910 -3232 -3370 -2929 -2818 -4734
6439 -4734 -4581 -4295 -5155 -3411 -4134 -1012 -819 -2088 -4329 -6110 -3919 -5515 -6194 -5178 -6677 -3205
6423 -3205 2472 3806 16 -4556 -7396 -7752 -11511 -11864 -10777 -6481 531 1044 -2300 -7015 -10333 -9465
6407 -9465 -9120 -8601 -11615 -6963 -8093 -2111 2254 3097 5057 3903 1736 3149 -2867 -10019 -3610 196
6391 196 972 -2845 -4671 -6438 -9404 -9935 -9190 -6951 -3535 -1975 -1382 -2452 -2025 501 -350 885 37
6374 37 -1479 -2037 670 -535 -1328 -3486 -3054 -2035 -2457 -5346 -4777 -4894 -3752 -2372 -4699 -3263 367
6357 367 1669 -2480 -7978 -8750 -7667 -5421 -1014 1986 -1461 -3281 -4291 -2434 -2687 -2710 -5337 -3000
6341 -3000 -5190 -8376 -7587 -8235 -5228 -3093 -3437 -5490 -5302 -4494 582 -1094 -3920 -6555 -8426 -7630
6325 -7630 -7185 -9924 -4811 230 -3616 -2623 -1557 -5219 -6499 -5851 -2442 -4029 -7492 -2503 1364 2764
6309 2764 -301 -3688 -978 -280 -1634 -6704 -8469 -5785 -1315 3352 8030 172 -1400 -245 -1387
6294 -1387 -1050 -6342 -14449 -14277 -9336 -10078 -6434 -4038 -3431 -3073 -2645 1618 2594 2509 874 257 -1947
6277 -1947 -1351 1932 1669 -2530 -3771 -750 2791 3388 -1063 -6230 -2843 3660 -3905 -7442 -3068 -2929
6261 -2929 -2577 754 -4664 -5808 -6410 -10329 -9757 -4353 -818 -543 -3690 -2873 -3677 -5326 -3942 2539
6245 2539 4333 -440 -6158 -9048 -9983 -4997 -1837 293 2611 2175 3061 3219 -560 -702 1906 -2755
6229 -2755 1381 4944 5769 1517 -4602 -5663 -3623 -6864 -5669 -7201 -8851 -5619 -7333 -8638 -7235
6214 -7235 -5948 -5373 -4103 -4265 -4800 -3968 -4466 -1541 1211 1853 3373 4226 4759 4211 -3090 -6798 -8328
6197 -8328 -2953 2248 -509 2392 3704 3439 3155 4022 7918 3598 -286 -4157 -1949 1549 2382 868
6181 868 3238 1687 -2220 -4030 592 834 -1040 -4787 -9932 -10125 -10463 -8659 -7337 -3845 -696 -746
6165 -746 3858 2960 1816 760 -3437 -3521 -1681 248 1359 5671 8287 1303 -6391 -7592 -7317 -2564
6149 -2564 349 -2725 -2325 -17 1159 1095 3475 3099 -2503 -2511 3411 4121 2 -7345 -8635 -8617 -5106
6132 -5106 -2474 -454 -1080 -2326 -2188 -1926 570 1697 -2420 -3299 700 -3151 -7424 -2734 2667 3601
6116 3601 732 1579 3472 4428 976 -587 -972 839 2857 544 -759 -1057 -6740 -5180 -2130 -2652
6100 -2652 -1630 1358 -1241 -4302 -11049 -12417 -9143 -6003 -2241 239 4888 7942 11152 7452 4579
6085 4579 4593 2260 -3602 -4236 -628 -1646 -1571 -1285 -2594 -2938 -3435 -2550 -4196 -8072 -7893 -972 4676
6068 4676 2783 -5964 -9047 -2454 -3513 -5017 -3272 -1971 -3280 -4773 -5341 -1988 1646 -384 -514
6053 -514 2243 4549 2145 -415 -2578 -1788 2587 -699 -2329 -210 -761 1282 2702 1303 469 362
6037 362 3018 4082 -576 2171 4213 4610 -2959 -3466 706 -953 -3074 -1693 -2478 -7540 -8073 -6606
6021 -6606 -6889 -7986 -5973 1249 3931 1654 696 -2042 -10505 -10844 -6418 -2820 -3853 -7356 -5230 -827
6005 -827 -2726 -2634 -2570 -1236 -6459 -8241 -6879 -3658 -2135 -2529 -7029 -4369 -3827 -1938 347 746 -100
5988 -100 -2112 -2988 -3977 -1584 2268 6434 9461 9407 9068 6882 1557 -2016 -3190 3807 2406 654
5972 654 -1713 -3372 -4216 -3603 -2840 -6012 -7612 -7995 -6209 -4816 -5581 -5549 -8100 -6542 -1635 2727 945
5955 945 -2273 -5809 -4769 -2518 -67 -1106 -2197 -2361 -2568 -4149 -3530 401 2993 2412 1675 -279
5939 -279 -3092 -5272 -4296 -4729 -8406 -6824 -5062 -3861 -4701 -3629 -1824 -671 -5600 -7121 -5906 -6302
5923 -6302 -10767 -8649 -7765 -7889 -5816 -3113 1440 4373 1220 789 3559 -2900 -11469 -11886 -10194 -10037
5907 -10037 -8133 -8788 -5125 -1631 763 -847 -4566 -7122 -4255 -4566 -6491 -1588 937 3980 7492
5892 7492 4870 1862 882 -1028 -4742 -3608 -5454 -5289 -3948 -4649 -2431 -3699 -6121 -3436 -148 692
5876 692 1428 3326 1977 -2995 -1757 -733 1075 3687 4221 3906 2608 3144 -1679 -1260 35 -22 -1419
5859 -1419 2318 4480 2912 4033 373 -625 346 542 1224 192 -218 3052 1299 -564 240 2150
5843 2150 3768 132 -24 -1234 -359 875 2113 3812 604 -2354 -3427 -2472 -3007 -4176 -3135 -1416
5827 -1416 1892 2686 -168 -5584 -8781 -5605 -2954 -1347 -2835 -4677 -3503 -2526 -6527 -6875 -4828 -1897
5811 -1897 1580 5140 4581 3910 1286 -3176 -2071 1857 461 -324 232 -1143 -3723 866 3331 3822
5795 3822 -2625 -5520 -2660 -4607 -5857 -3157 -1807 -5241 -5770 191 2752 2374 4773 6911 7937
5780 7937 7750 7076 6062 6709 8405 5904 2023 24 1966 4456 -1580 -1592 1503 911 1531 3314 3020
5763 3020 5861 4074 606 -4643 -7083 -6161 823 5163 5912 5439 2916 718 -138 849 5800 5840 7061
5746 7061 4377 -493 -1948 -811 -3999 -3996 -1536 -981 -3902 1358 4592 6443 2072 -2993 -4656 -3192
5730 -3192 -5064 -5418 -8027 -9142 -4566 -4332 -3375 -2534 1930 3483 3259 4204 2604 2804 -1044 -4335 -5949
5713 -5949 -2610 -3245 -3359 -7945 -6100 -2082 -63 -330 2425 6446 4464 865 771 -351 1632 2734
5697 2734 2244 192 -181 -1065 1534 407 -2910 -1720 1356 2759 2157 609 -2750 -6304 -7748 -6399
5681 -6399 -4266 147 2233 -742 -1561 -2908 -4951 -1711 -5412 -6400 -6969 -9957 -10562 -12890 -7243 -5693
5665 -5693 -3957 -5931 -10554 -11396 -10125 -7349 -4766 -1195 1418 2289 -1809 -6015 -4057 -2649 1092
5650 1092 3858 7447 4032 -2598 -4988 -2571 -4413 -6094 -6745 -415 589 3418 7584 3644 2943
5635 2943 5835 5334 4527 2153 -4315 -3736 -193 -385 -1932 -4529 -5671 -5145 -6240 -8924 -4058 -38
5619 -38 124 479 4410 1959 -1090 -1322 55 -3632 -4828 -3953 -1076 3250 3074 2027 6749 5237 4997
5602 4997 8355 7005 6279 4522 3396 1849 798 661 -1418 -1069 -2767 -2084 -2443 -4364 -5255 -4940 -4193
5585 -4193 -4137 -8410 -6579 -514 -779 -2607 -2766 -944 -3626 -5125 -3433 -1983 -2054 -837 1546 4894
5569 4894 5227 4062 3813 417 -5262 -7217 -3619 -1550 -3155 -2665 1138 -1940 -1316 290 -1073 -5022
5553 -5022 -1966 -893 412 725 -496 -3046 -6287 -1278 -3361 -4752 -6528 -7654 -5967 -1635 1338
5538 1338 113 -2498 -4659 -4185 -3723 -2029 -7825 -7516 -1268 -467 -3236 -4048 -3952 -5716 -6603 -1396 4770
5521 4770 3311 1388 -1005 -6331 -8999 -6393 -5852 -7483 -5464 -5394 -984 127 451 -2876 -4593 -588
5505 -588 -581 -539 990 5170 8014 4375 2627 -368 -1871 1449 1347 241 -4230 -10607 -10918 -5242 -1803
5488 -1803 -2046 1582 3583 4270 306 -2779 576 3840 404 1810 6099 8094 2201 -1006 -3828
5473 -3828 -3419 -820 -2104 -1511 4292 6336 1775 1101 2321 4173 7948 8220 6618 1889 -2287 -3069
5457 -3069 -7238 -9042 -11074 -7325 -6858 -6120 -5999 -5022 -4124 -3026 -3229 1868 2041 -948 2069 3030 2769
5440 2769 2729 -497 3808 5380 121 2251 6462 8591 6117 2472 1936 2712 3106 344 -3001 -804
5424 -804 1694 2991 -2099 -1843 1263 802 -1030 619 2965 503 -295 -567 -2307 -713 -2108 1289
5408 1289 3943 1811 1612 1425 -2712 -4254 -2205 -932 39 -4268 -4615 -3359 -10237 -8368 -7538 -4205
5392 -4205 -1234 1094 -1652 -1738 1517 -159 -941 -1304 -614 -1227 -1848 -4403 -4026 -409 -1137 -480 -1695
5375 -1695 -2766 -3390 -4426 -794 -1047 -3587 -3310 -975 -3 -4035 -6833 -7605 -372 2266 -2776 -6820
5359 -6820 -4064 3314 529 -4969 -1601 -2071 1664 4279 4070 1664 4744 11379 11859 8853 7492 4843
5343 4843 507 -3512 -5686 -3615 -1815 -2047 -3206 -5131 -6539 -6065 -5109 -6660 -6351 -6122 -7114 -5112
5327 -5112 -1073 96 -335 173 -731 1917 1061 -672 -1923 -254 -3656 -7227 -10577 -8286 -7220 -4126
5311 -4126 -1104 -1522 -3781 -4137 -5211 -3567 -2755 -5609 -6048 -9082 -9906 -4301 -3906 -3794 -6115 -3916 -2493
5294 -2493 -944 -2898 -3046 -2174 -2640 -6516 -8413 -5315 -6179 -6789 -8540 -9619 -6185 -5912 -7956 -6351
5278 -6351 -2753 2759 6764 5483 3184 533 -4909 -5381 -2829 -3617 -7977 -6813 -6751 -8098 -6985 -6938
5262 -6938 -5528 -2456 -969 -9 -1196 -37 -824 -3755 -4727 -3131 -371 -1221 -1664 -7361 -6752 -1146
5246 -1146 5922 5819 6497 3118 540 -1894 -2461 156 4700 177 -528 5013 2553 1590 375 724
5230 724 3118 4489 554 -3754 -4089 -1759 492 35 137 2169 1820 811 -451 -4330 -2679 -3295
5214 -3295 -3244 278 2981 4563 1509 -1784 -4227 -7272 -5272 -2655 -3767 325 1680 -4002 -5827
5199 -5827 -2655 922 969 1793 -893 -3919 -7292 -2949 1900 -1525 -1365 -1566 -2562 -2487 -1495 -445 1168
5182 1168 -428 -5831 -10836 -10251 -10254 -7752 -3565 -4483 -4838 -5230 -5204 -5638 -2552 -5212 -5709 -7439 -6018 -1934
5164 -1934 3634 2058 568 1137 3105 5110 3233 5502 7953 6900 4764 2624 -327 -238 3053 5265
5148 5265 4004 2768 5014 6916 8365 5614 4813 -866 -5975 -5718 -1199 3486 530 -2362 -2642 -4416
5132 -4416 -6592 -6264 -5837 -4262 -6763 -9059 -7130 -7124 -6433 942 2888 1663 -1768 328 -2332 -6019
5116 -6019 -4711 -732 2040 1875 -566 -1541 -2961 -3279 -509 -4028 -9353 -8296 -3078 1150 752 -30
5100 -30 442 -865 -1764 -2251 -3342 -4463 -2602 -4351 -3043 2094 4240 3269 196 -4704 -7833 -2288
5084 -2288 -593 -3294 1837 -137 -4011 -2977 -1674 2872 6443 3011 3715 4145 2318 -1865 -3518
5069 -3518 -2718 -2195 432 3703 4416 -613 -2824 -1735 -2919 -5682 -3439 -2172 -812 1786 -596 -2619
5053 -2619 -1291 -2466 -5195 -2542 -4596 -7086 -7506 -6943 -7920 -10281 -10595 -10444 -10033 -9609 -9245 -7324 -7303
5036 -7303 -2828 1436 -2678 -6165 -3433 2455 2995 3101 6099 3921 1090 196 2924 6496 5844 5115
5020 5115 3042 -995 -6175 -2225 -682 -4161 -4444 -1259 -2303 -2568 -1407 -3416 -4245 -2281 485 -2979
5004 -2979 -3666 -3104 -1696 -5258 -11190 -10714 -3984 -3595 -7149 -8482 -7628 -7635 -6209 -5275 -7359 -6569 -7506 -11014
4986 -11014 -11139 -8692 -9345 -8072 -7620 -6152 -6097 -3117 30 -1607 -2659 -2496 -4016 -6456 -8170 -2015
4970 -2015 -2226 -2568 -1610 1005 2431 4089 5885 3741 3755 2934 1863 -725 -842 161 -401 -3432 -3692
4953 -3692 -2703 -444 1150 -1511 -6249 -6366 -8441 -5227 -1504 1041 -909 230 2050 2946 4289 3773
4937 3773 1928 2318 4656 6708 4369 21 2449 3505 1962 -174 -331 -2095 276 1822 441
4922 441 -3548 -8815 -9253 -9264 -8726 -1812 -976 -3857 -3025 176 1500 3013 4976 7119 6427 4168 1817
4905 1817 -2104 -3789 -1244 -850 -2763 -2320 1625 3251 1463 683 1016 7280 5768 4498 4891 2505
4889 2505 -2238 -4410 -1842 3976 3791 -861 -2117 -3896 1031 3123 2949 9236 9019 4408 855 -1216
4873 -1216 -1750 7 42 -1584 -1331 -5262 -3142 -3202 -3156 -4402 -1030 2706 5052 4249 3867 5738 3456
4856 3456 -2083 -214 3591 2149 -3311 -3230 -1807 -1220 68 2487 -4113 -3687 3681 5764 5811 3066
4840 3066 -275 563 -2865 -3659 -1766 -4659 -6602 -1656 -2445 -8273 -5895 -2990 -4994 -5743 -7931 -3620
4824 -3620 349 320 -3599 -5604 -4003 -2171 -838 238 -3077 -5338 -4855 -5015 -2609 139 931 2167
4808 2167 3552 3507 627 -105 684 -1466 1724 3773 -137 -2496 -1420 -1247 -741 -4594 -2705 995
4792 995 5960 5430 3768 3372 -3025 -6299 -3483 -4468 -3949 -1607 195 -4782 -6175 2097 4266 1479
4776 1479 -2743 -3158 -3380 -1687 694 4776 2273 848 -4459 -875 6795 9856 7753 1134 -1222
4761 -1222 -3328 -2086 1263 2180 1919 1688 2464 936 -2120 -980 2486 2608 1670 1569 1322 -892 361
4744 361 4799 6393 5851 5533 2742 -1068 -3381 -7015 -4172 -2685 1047 1514 1166 -3117 1093 2474
4728 2474 2801 3315 7064 2596 -1612 -4551 -1050 -1474 -3942 -3052 -1867 -533 1424 5051 4015 1358
4712 1358 94 -2263 -957 -3325 -6454 -3384 -2037 -5538 -6036 -3622 1093 -1038 -2426 1419 1279
4697 1279 2162 1571 1787 517 3042 2303 1376 -1759 -4553 -6619 -5815 -2414 -1503 -1654 152 2375 4990
4680 4990 4455 4799 1869 -560 -877 -1486 1552 -1504 -635 2998 -3160 -8086 -7027 -6318 -3290 -4761
4664 -4761 160 563 -3532 -1939 1647 1820 28 -131 -727 -931 -737 -3177 -4162 -4287 -5920 -313 630
4647 630 -543 2529 5791 3604 634 3285 400 -1272 -2906 -8187 -9057 -5081 -4289 -735 1795 2348
4631 2348 2786 1579 1719 -978 -2114 -450 -2601 -7592 -5177 -4378 -2129 -1310 503 4208 3906 2724
4615 2724 382 2512 6060 4978 4263 4201 3064 3897 1446 5245 7308 5971 2965 -1509 -4746 -5427
4599 -5427 -4401 -3692 -3666 -2008 2663 5591 4876 807 -4630 -3554 -3414 -6963 -7053 -5081 -3350 -3491 -653
4582 -653 1585 -2045 -1308 -168 1798 486 -3717 -3850 -5547 -4153 -1079 696 350 -322 2048 3664
4566 3664 2593 3724 5346 898 -942 -2830 -3211 -1638 -73 2771 -1674 -2413 4704 2662 2638 2608
4550 2608 -158 -3696 -6273 -5309 -3616 -3576 -1465 -1769 -4119 -2675 4043 8357 9050 6485 3586 633
4534 633 -5893 -8051 -3248 -1376 -2889 -5268 -2782 -1344 -866 -557 2025 1144 -1884 -418 1161 3248
4518 3248 -997 -5764 -8433 -6008 -2641 -5502 -6618 -9148 -10081 -9488 -6584 -4058 -3604 -172 -1975 -31
4502 -31 -2452 -2581 -1001 -2238 -8311 -5351 -1645 -4346 -4359 -3061 -987 -309 5598 7084 8135 8708 6776
4485 6776 2746 -5542 -8914 -8498 -7337 -5661 -6251 -582 8121 4272 -992 -4562 -1424 -67 -4018
4470 -4018 -1983 836 2362 2308 1903 -3032 668 6844 6797 6547 6140 3272 -2083 -5343 -4459 -3381 -3874
4453 -3874 667 1035 79 -1150 -5792 -9313 -11254 -9997 -4089 -1833 -1396 3186 1651 -400 -1806 -158
4437 -158 3419 -128 -3129 -5040 -57 4947 5156 2886 -2620 -4182 -5023 -2246 -4985 -8372 -3309 -2053
4421 -2053 159 -2241 -2032 -1621 -2087 389 -1009 768 3509 6957 5495 2123 -664 -4830 -6053 -5277
4405 -5277 -4362 -4597 -1489 -1029 997 -737 2819 2559 211 -2408 -1124 -849 -2749 -8940 -7185 -8084
4389 -8084 -7865 -3369 -3854 -7248 -7068 -12618 -8950 -1741 -1129 4 1341 2768 -879 -503 -338 2734
4373 2734 2779 3762 4716 4686 2045 1514 226 -1020 -2922 -4745 -4862 -8865 -10005 -6309 -3846 -2711 -1975
4356 -1975 -5120 812 1090 -885 -663 -1479 1634 -1343 -6246 -4033 -2586 -1922 -5970 -6658 -4363 -1972
4340 -1972 405 -3353 -3959 -1796 361 -911 -3993 -5096 -378 -110 -372 -1755 -1801 -4207 -3210 1887
4324 1887 5203 5735 4542 757 -1376 -324 -425 4779 8001 1555 -1822 -1886 537 431 -1126 -715
4308 -715 -1078 954 1725 -4894 -6004 -3719 373 3697 5894 6064 5015 -1626 356 6808 7104 6087
4292 6087 4324 2995 -312 -2909 -7511 -7196 -3112 -1765 -4582 -2259 407 3213 1488 -1729 -2471
4277 -2471 -2104 -1728 -1376 -1837 -2340 811 181 385 1310 -3006 -3112 -5948 -5759 1360 7330 2284 814
4260 814 3535 2593 2921 3725 3487 2336 -1555 -3636 1733 4291 1157 620 1348 2285 231 107 -2195
4243 -2195 -1628 904 -1186 -5450 -5245 -5036 -2726 -2217 1820 84 -3227 -7247 -6645 -3007 -1205 -760
4227 -760 -1470 -3177 -3459 -1476 -2846 -3799 -5386 -4828 -2425 -3220 -1933 254 3959 1556 -3308 -3559 927
4210 927 3712 -818 1627 4428 2806 -1371 -5345 -3918 -1376 -605 -3296 -2863 -1275 3431 176 2085
4194 2085 3329 1451 2686 5753 5050 8363 4077 -907 257 -1937 -4660 -5453 -4953 -5620 -3203 2908
4178 2908 2027 -847 72 -570 -5526 -3139 562 2915 3684 6227 3990 2453 1318 302 3955 7021
4162 7021 8830 7136 -354 -1278 1680 793 5125 5377 1033 -690 175 -3816 -7953 -6252 -7853 -8877
4146 -8877 -4836 -447 1873 -2381 -1075 1270 1533 215 -856 1478 -1636 -4842 -4472 -5249 -2369 2185
4130 2185 3550 3132 1777 -3402 -2558 -669 1955 6249 6343 7640 2910 3918 7368 7378 2960 -2956
4114 -2956 -1820 2705 1438 173 3348 4230 -3227 -8407 -3787 -4280 -1461 4671 4131 2110 2020 4685
4098 4685 6687 4228 293 -301 524 4788 5253 1531 -1468 -4751 -6762 -6073 -116 2896 730 -332
4082 -332 312 -353 -792 481 -831 3256 4819 -2890 -6219 -6234 -9226 -9146 -4190 1774 5150 9789 12619
4065 12619 9062 3985 88 1518 193 -4030 -4607 -3779 -1919 -132 -409 1440 -2318 -2960 905 1014
4049 1014 -3210 -1994 2380 6636 6030 5795 7473 4609 3820 1073 4549 6756 7249 8886 6515 6867
4033 6867 6971 5021 8416 4422 -392 -1440 1078 614 -3248 -3266 -2885 1522 -317 -1194 386 349 1521
4016 1521 3707 4390 3043 467 -4546 -4067 -36 -2062 -1134 1238 2307 -2713 -1474 2870 785 -5126
4000 -5126 -4060 -181 -672 -3777 -7933 -7297 -4316 -4013 -2963 -3028 -5116 -4920 -5260 -4197 -1047 4359 3906
3983 3906 -626 -1534 -581 -2688 -2670 1160 4544 1664 -1379 1119 1664 4823 3799 2789 1506 2572
3967 2572 -1111 -629 2174 4092 5107 4047 1792 163 416 1870 -1158 -3930 -7015 -9037 -7622
3952 -7622 -4459 -6008 -5659 -5246 -5791 -9151 -8553 -5289 -1961 -2041 -8761 -8186 -2771 -1045 5643 6682 10843
3935 10843 10251 7160 2467 -208 -2314 -3909 -7440 -5207 -921 3662 4914 4219 1816 2668 233
3920 233 -90 1141 -1045 -4041 -2709 -803 -998 525 36 -3215 -4204 -5624 -4821 -4730 -4788 -6079 -7605
3903 -7605 -6409 -1514 -1606 3797 7392 2897 -3563 -3351 -6415 -6915 -2562 -1872 2203 517 -4272 -4292 1641
3886 1641 4106 5768 4755 1270 -1630 -1840 -2345 -2387 -3223 -3221 -2247 -1697 -2163 -2010 -3441 -4508 -5768 -3590
3868 -3590 533 1814 1708 797 3328 -3682 -6000 -1686 2475 187 264 594 1995 2372 1890 319 309
3851 309 -1648 1943 -671 -4276 -5195 -6104 -6821 -5254 -6118 -1886 181 -4266 -8967 -6552 -1164 -2620
3835 -2620 -5419 -4312 437 1822 -246 -451 -3476 -4291 -7495 -4793 -975 3122 1636 2960 5588
3820 5588 2976 -67 -3981 -7468 -10961 -9011 -1914 -292 -3825 -3415 -988 -912 -916 4402 3597 1059 -685
3803 -685 -1853 -2807 -4573 1677 5624 4632 3515 5640 6609 3795 2173 3846 2635 727 4255 7607
3787 7607 4720 1245 -2119 64 1121 1847 2727 3537 1496 -501 -1603 -6034 -6125 -3827 -2344 -4038
3771 -4038 -6115 -2801 810 3923 1104 -5824 -8272 -6771 -5379 -899 376 -2204 -5219 2175 4687
3756 4687 6198 3081 -1407 312 3635 7304 8074 5028 3683 2050 2634 3148 3684 3798 2024 2562
3740 2562 5365 4416 3426 6023 3940 3957 3528 2999 3778 6185 2037 -508 -5218 -6914 -544 245 -2051
3723 -2051 -547 2091 2944 -876 1442 2348 4029 5813 5358 2356 2288 845 1041 5774 6680 5550 904
3706 904 -6948 -7261 -4765 -5297 -129 4421 6356 6195 3269 828 -942 2505 6656 11638 10031 7107
3690 7107 4240 1488 6810 9168 5123 4112 4257 2894 5229 8254 11548 9848 8963 6445 2823
3675 2823 1781 3600 1481 1870 2593 -492 -241 -580 -1838 -2265 1362 1532 541 -3767 -3429 -1911 -4831
3658 -4831 -4061 -149 -1403 -6137 -4885 -2153 -2004 -4958 -5594 -5615 -7900 -7563 -2378 1449 -1753 -4463
3642 -4463 -5189 -2971 -3811 -7655 -10053 -9686 -10504 -6758 -6938 -3818 2545 4230 3661 2391 3234 1849 165
3625 165 -3363 -4991 -1460 2055 2112 15 -2312 -2084 -1402 -2993 -770 -87 -6895 -9566 -6980 1208
3609 1208 3189 2905 -1506 1336 5805 6481 4616 1791 58 -1409 -1154 806 -778 -4162 -8378 -2763
3593 -2763 -255 -717 -2395 -1491 1919 4527 6724 6860 1491 -917 -423 124 -1818 -3323 -300 227
3577 227 2230 2133 1468 402 -360 412 -445 -735 -1200 -1466 -463 -2386 -6535 -7224 -5050 -4107 3374 5526
3559 5526 2680 423 -1605 -3879 -2024 3353 2720 -363 -148 3824 4243 6787 5009 726 550 -2401
3543 -2401 -6290 -4750 -186 302 1486 2236 5010 1853 3507 4334 5244 9367 8650 8162 8185 1992 -875
3526 -875 -5231 -3672 -2091 -1572 1920 3092 457 -839 232 1260 1592 2641 1732 -46 -415 1563
3510 1563 -879 -6719 -4899 -1232 2900 2044 -884 -4403 -5331 -7177 -5423 -2951 -457 511 1851 846
3494 846 4016 4700 4822 5188 6548 5578 3852 1071 1993 2370 168 -1174 46 3238 4418 2831 1136
3477 1136 -1976 -1016 -262 1356 1100 592 1153 -585 -1270 818 1610 2365 -2376 -2107 2005 8990 5775
3460 5775 2980 3641 4458 832 2592 5279 5856 10640 9709 4526 3374 5301 7245 8639 8421 3169
3444 3169 539 2693 1036 1807 -536 -782 81 -457 -4319 -6397 -3695 -734 -1072 -1475 -4867 -455
3428 -455 1195 1429 2679 5816 8646 12716 8931 5365 6627 2816 2159 4578 6356 3358 5045 9563
3412 9563 7447 4287 4551 2617 288 -1796 -1575 490 -1340 2651 4180 1509 -1717 -5010 -5598 -1232
3396 -1232 1394 -1556 -3255 2079 6912 9310 4615 -1278 488 -1687 -2721 -3372 2226 5241 6788
3381 6788 1584 -2558 -2961 -1497 1793 4148 1032 3577 5709 4332 -1484 3073 5902 2321 -635
3366 -635 981 4836 4178 3010 1642 3242 5094 3221 1295 -1096 -2561 1674 -992 -1482 774 1194
3350 1194 761 1691 630 -1588 548 -423 -2586 -360 -1635 -2338 -3502 -5127 306 3716 5034 8136
3334 8136 3635 839 658 3023 6154 8014 7551 4307 5867 2593 1655 1583 2709 1085 -3279 -2916
3318 -2916 2770 5836 5319 3150 1152 -2833 -2599 -130 5755 5689 3186 3442 2098 1459 3639 3322 3839
3301 3839 1799 -1891 1536 4324 2871 5299 4773 3888 4616 8841 6772 2572 -2960 -6329 -6475 -5261
3285 -5261 -2483 -1044 -3302 -1773 222 2119 -2575 -4108 -3447 -6576 -4465 -857 -1326 -1994 1372 944
3269 944 -1911 -2273 -5879 -2927 -3482 -3410 -4076 -1714 -1445 -1037 2447 2252 766 1442 6268 7232 6188 5167
3251 5167 3968 4995 6215 -1821 -6968 -6392 -2459 -559 -1045 716 2731 231 -1426 -1461 -3725 323
3235 323 1729 1872 1977 4974 -429 -505 2857 60 -6165 -7355 -8073 -4530 -1608 -1663 1954 6912 6916 2058
3217 2058 -4950 -4141 -454 3323 3897 2284 5022 4842 6420 7952 4711 1770 4051 3044 4685 4109
3201 4109 94 -1703 -2980 -117 -1276 -2718 -445 -2461 -1367 1046 906 -268 -361 670 -431 5118
3185 5118 7062 2918 -1550 -4647 -5367 -2186 -938 -2945 -2827 -2459 -2421 -2386 -1373 2282 8627 5136 757
3168 757 3697 2829 3173 3120 451 1946 348 -3678 -2072 4288 4928 4879 3820 -1624 -1548 1448 135
3151 135 -4382 -2197 7031 7336 2562 -681 -5243 -6909 -3671 -2756 -8339 -7284 -1862 5421 10167 9402
3135 9402 9722 10126 8200 6429 941 -1939 1524 2538 180 -2646 749 -1706 -5687 -1811 3514
3120 3514 3605 4014 70 325 240 -3509 -1216 -2704 -3658 -1227 169 1362 484 2578 6325 4576 5647
3103 5647 1423 -1543 -1087 1729 3689 5781 4396 3101 672 -1147 -2344 1714 2740 943 -12
3088 -12 47 -3169 148 5797 3981 -500 2343 5860 963 821 3696 2157 0 -247 4346 6189
3072 6189 3231 1180 45 -727 -2015 1156 -232 -3052 -7764 -7718 -6162 -3391 -4661 -6838 -6646 -8112
3056 -8112 -8326 -5888 -5723 -895 1093 -1881 -5873 -1784 3506 1343 -929 1582 2363 2825 4872 4269
3040 4269 3169 2871 2157 1567 232 537 -1784 -2495 -1946 -274 -53 722 -5163 -8765 -6367 -3056 -3314
3023 -3314 -3507 -669 -609 1338 -349 -199 -477 -505 2241 1631 -538 -5454 -5795 -6708 -7150 -4429 -4557 -3701
3005 -3701 -439 4581 4359 6262 7725 5402 1667 3598 1979 -2003 772 1605 -779 -3849 -6820
2990 -6820 -5481 -439 1239 1299 231 -1936 1473 -852 -5167 -2779 -4723 -7640 -6745 -2557 -1838 -6816
2974 -6816 -5746 -1162 5956 11340 8015 6247 2115 -269 393 -3185 -2907 -2897 -755 86 -3602 -7825
2958 -7825 -6379 -3718 -1852 -5976 -7367 -1590 2560 858 2520 493 -3834 -3855 -1092 -4717 -3485
2943 -3485 -152 -205 -1290 2806 4368 2901 -1663 4903 5468 9459 5883 4293 3922 4872 4087 3610 1849
2926 1849 167 -5443 -4919 -548 877 1924 -3825 -8266 -5874 -5433 -5853 -5251 -1498 451 -950 381
2910 381 2146 630 2027 483 218 287 2195 -1898 -4743 -5696 -5495 -1799 -1933 -5970 -3115 -2923 -2786
2893 -2786 -416 -362 915 4771 2518 2823 5004 11288 12877 10776 11745 6929 5805 3720 1538 -430
2877 -430 -3511 -3025 -5255 466 4033 8073 5087 2448 -5706 -7048 -3468 -2707 -2517 -509 579 -1650
2861 -1650 -1532 -6127 -8036 -6022 -3080 -902 -2505 -7390 -6941 -3618 -1167 1204 1084 4654 6716 6140
2845 6140 90 2629 384 -3365 -2397 869 1869 -2380 -1771 1261 3216 5717 3569 1833 -1266
2830 -1266 -2603 -1249 -952 -68 -1914 -1344 180 -4711 -5951 -2916 -5521 -6379 -532 401 1056 3436
2814 3436 7652 4368 6243 6149 1496 196 -77 4664 6624 7020 517 -3336 -3305 -2997 2359 5849 5253
2797 5253 -316 -1548 872 -1813 -2087 -4323 -5713 -4662 -806 2367 7010 7944 3291 -1041 -795 -557
2781 -557 -236 3173 5428 5866 4844 989 -2499 -5384 -5755 -332 4293 5783 4395 -2482 -4175 2214
2765 2214 9172 6818 3510 4187 5154 3076 3496 6408 8190 7270 3490 3890 6364 5576 -1836 782
2749 782 1647 -356 2031 2342 5 1861 1183 3058 4706 2467 1813 1826 554 2389 1492 1088 -79
2732 -79 1226 1718 -971 1578 3065 5 -3273 699 -188 2935 3079 918 1912 5967 6246 2710 -2587
2715 -2587 -3390 -3546 -3715 -3222 -1084 -553 -2031 -2055 -3740 -6625 -8327 -8907 -2925 279 5313 4659 5044
2698 5044 6175 2601 -2218 -1302 4063 852 -442 -206 2237 387 2 1030 1646 -458 -2661 -469
2682 -469 1415 980 -781 -1774 -3738 -928 2977 3775 6418 5976 2342 826 4854 3995 325 3328
2666 3328 4057 4658 3371 1705 6928 6842 -828 -2802 -2213 -4022 -3728 -1840 -140 -15 -2270 1262 6697
2649 6697 10313 13859 10788 8770 7300 9111 5194 2311 1407 -1424 -4835 -5042 -4416 -4926 -390 111
2633 111 1761 -288 -3934 -2853 -2145 -1001 -2032 -1329 -7368 -11952 -11133 -10706 -7918 -1724 4548 7340
2617 7340 1458 648 820 1511 -3203 -1272 1718 2026 -630 -3901 -1464 2223 -39 -3512 -3714 1509
2601 1509 3482 3630 5272 2565 2274 3017 2025 1896 -731 -1318 -1211 -3235 -3774 435 564 -1532 -3458
2584 -3458 -3105 -2716 -1871 1231 1028 1648 1699 2225 -2716 -4295 -4195 -2329 -3120 -269 3666 5201 7589
2567 7589 8712 10077 13648 15440 14447 10329 4577 1382 2213 133 -52 -4152 -4057 -2728 -3234 2476
2551 2476 5965 6721 7552 11048 9784 6155 -1791 -6158 -4020 -3961 -1791 -2325 -2256 -1561 -986 2901 4075
2534 4075 3483 3823 5886 3810 4099 2928 -1489 -3766 -5285 -4998 -1993 -1354 -2157 -2320 -6579 -3275 -739
2517 -739 -2769 836 2959 -95 1349 2423 -1314 -4261 220 2883 -2254 -2394 -3807 -3344 -3628 -3402
2501 -3402 -6835 -6538 623 98 -2451 -1069 -973 -3635 -4865 -5611 -8063 -4241 -3627 -990 3165 1688
2485 1688 -2930 -5392 -3687 -734 2866 6543 -560 2283 7061 6526 5331 3341 2706 1881 1025 -925
2469 -925 -1861 -2579 3157 3908 926 -1579 3780 8492 6963 -918 -6231 -7658 -3749 1776 7084 8584
2453 8584 4588 2910 4441 4652 3845 -138 -761 1082 4461 2990 4222 6562 8404 1236 -3515 -2423
2437 -2423 -709 44 3159 5997 4115 4381 5327 7426 4076 1565 3194 5766 6563 7117 4983 1040
2421 1040 -816 2082 -28 -4481 -4847 -3347 -541 2734 3517 3834 797 -6819 -6008 -5534 -4537 -5873
2405 -5873 -9924 -7304 -3965 -1355 -520 1329 2132 -4485 -6668 -5968 -5848 -4626 -2200 -1508 -5433 -4953
2389 -4953 -2100 -3503 -3551 506 837 -2219 3053 4653 2550 1425 2436 3315 5795 8958 9506 10889
2373 10889 12029 9416 6693 4237 1448 1770 3943 5010 2792 425 -2577 -5342 -7459 -1795 1203
2358 1203 2435 -8 -1306 1050 -895 474 3388 -1067 -1089 -1024 -2468 -1656 -1161 -1018 -183 -2625 -3202
2341 -3202 -3625 -1876 276 1750 232 1125 7163 4987 3458 9218 10087 6201 7606 4955 2391 -3647
2325 -3647 -6444 -6304 -1728 -3806 -530 -1654 -4994 -2808 1808 -2021 -1870 1950 4073 5157 4549 -72
2309 -72 -418 8018 5394 -577 -5738 -1908 444 220 442 -947 -1729 -1218 -4007 -3602 -382 1824 3998
2292 3998 879 348 5070 10695 6668 4684 6733 7089 8944 10205 8538 7513 11087 10674 6968 7418
2276 7418 2903 814 2348 5181 5249 3371 3232 1198 1673 2771 6419 5781 284 -2288 1481 5620
2260 5620 10075 5608 1853 -424 -903 -1205 50 -1045 -1082 3021 4367 3087 3522 668 2697 4080
2244 4080 5386 3071 -141 2474 1005 1738 3179 157 -3831 -4398 -1886 500 4423 2615 5461
2229 5461 9034 5811 2184 3907 4740 3770 1351 -754 477 1917 -489 -1650 1298 138 -6110
2214 -6110 -9808 -8383 -2260 844 1473 3887 -193 -1498 -729 -5901 -7491 -6849 -6463 -7344 -7171 -6289 -4011
2197 -4011 -3216 -1360 4367 8556 8958 2726 -1927 -7995 -8023 -6269 -3954 -2352 -2627 -2760 -6709 -7413 -8900
2180 -8900 -10736 -7079 -5351 -2665 -4024 -4281 -3572 -161 2797 3063 1219 -2195 -404 -1455 -6084 -6858
2164 -6858 -3123 -3047 321 2234 3784 -765 -5391 -2194 3542 4138 933 -361 -717 2528 948 78
2148 78 -2515 -5341 -8648 -7588 -5508 -1386 739 3216 7690 4885 1089 -3440 -4055 -4862 -6391 -7319
2132 -7319 -2768 -1468 -5451 -14537 -14867 -11119 -5103 -1758 -2109 -3085 -4227 -2122 2449 1332 1210 6599
2116 6599 7083 6405 5939 2971 -789 1836 5991 6340 1136 -1268 951 302 2489 4376 1447 -766
2100 -766 -681 -497 690 5290 3382 5608 9914 5691 4654 3745 3286 1002 -614 -2871 4155 8652
2084 8652 4738 -1765 -2553 -1588 -3508 -4321 -4446 -851 -1994 -1004 -1052 -1958 -152 1250 3928 4008 4438 2593
2066 2593 2463 4016 4794 7692 5437 -174 1053 4821 3672 882 -2672 -1433 4740 5598 3345 3109
2050 3109 3551 5378 2855 2334 -2904 -3487 -2661 -517 -2556 -3723 -5700 -5967 -4457 -1997 -1792 -266
2034 -266 1077 6615 6701 2437 653 3450 6472 3716 3215 5944 3339 1422 2851 6034 4947 3841
2018 3841 1718 364 -996 -4488 -2952 103 3453 3571 6990 6956 6641 4618 2455 1018 2317 3602
2002 3602 5016 -960 -2598 -2925 144 2570 2532 4818 5380 4482 6097 4442 1801 -3189 -4362 2055
1986 2055 1500 4539 5701 6249 4758 3588 3756 -1481 -3941 -4282 -4805 -4716 -5380 -5740 -7002 -3353 923
1969 923 -159 -2423 1785 6481 8381 6639 4931 5401 4519 1419 -1053 -4896 -2367 4857 4224 1669
1953 1669 -2353 -6444 -8036 -4518 -2797 -2598 -2997 -1705 -1685 -1332 -783 -276 -1557 -1088 -534 -872 234
1936 234 -469 -5432 -7150 -3666 372 130 -2311 -1882 2958 3266 102 3228 4356 2060 559 2746
1920 2746 3124 1019 -1841 -3364 -1819 -1547 -1283 2838 2638 1132 1750 3396 3338 4766 3645 899 -5610
1903 -5610 -6904 -8044 -7941 -9136 -5762 -4360 -1871 -37 1823 1081 2108 2575 3569 3888 7412 9136
1887 9136 6527 1340 -2001 -858 -1170 -2206 -571 3100 1600 367 1511 1543 -1057 5068 9220 8916
1871 8916 6953 5557 8289 5193 1136 459 -2683 -2043 -2797 395 -2348 -3018 -4408 -1088 -1207 -6237
1855 -6237 -7658 -3602 -2172 -1203 -4180 -7305 -8309 -4756 -1915 -2000 -2626 2391 4925 -53 -3154 -3489
1839 -3489 -3113 -4018 -1724 768 2134 1754 551 4991 3026 2340 2587 1981 2657 3180 -52 -289 189
1822 189 -344 839 3785 5635 3559 -397 69 -857 -3049 -3249 -8892 -7770 -4666 941 1109 1503 5066
1805 5066 7828 6019 3996 2311 -813 2117 194 -25 2651 2898 4247 4617 -1358 -173 951 2191
1789 2191 2593 3651 6764 5669 4443 1548 1406 856 -3439 -5107 -2472 -1028 -816 -2603 -5883 -6414
1773 -6414 -3274 321 108 1988 3056 3677 3649 1413 -1825 -2407 -4128 -1544 -3595 -8830 -7957 -2770
1757 -2770 905 528 -4397 -7977 -6633 -2759 -4800 -4936 -6162 -3346 -2603 -6236 -2554 -3018 -2167 -1038
1741 -1038 -1270 -1969 -3390 -3915 -1690 2342 1526 827 -2326 -2684 -2271 -2033 -5099 -6982 -2147 2218 5234
1724 5234 5592 -929 -5404 -4468 345 -3828 -5064 -7622 -5797 1526 5272 1750 -1705 2137 -729
1709 -729 1697 6989 4847 -1066 -8268 -7890 -1436 2989 -21 -1187 -1803 -1131 173 625 -313 1696
1693 1696 3351 5639 6498 2794 -3802 -4972 -3083 -2266 -2165 -4599 -5082 -2038 1456 3583 3121 2278
1677 2278 -332 -3265 -4353 -696 -3911 -2280 -597 -2282 -1322 1579 2373 2011 2243 -518 -2667 -4514
1661 -4514 -3997 -2665 -23 -3330 -7061 -5099 1032 5092 6861 8748 3435 -1698 -3308 -674 4868
1646 4868 8225 5098 634 5834 6657 6926 754 -2259 -4220 37 2157 8218 9012 6223 3689 3825
1630 3825 3492 2959 5070 4712 5057 894 817 2928 4719 8124 6956 2536 3545 3994 561 -1758 -3324
1613 -3324 -1788 -41 3070 9034 6961 3780 5474 -433 -2235 -58 1772 3799 4022 1012 -2174
1598 -2174 -3491 -3816 -1900 419 -822 -3045 -3052 1002 4023 696 -4594 -5121 -2306 1159 1425 1460 4809
1581 4809 2922 -2812 -3844 -2976 -1250 1166 2256 -150 -5933 -8205 -8718 -4924 -2530 3424 4397 -42
1565 -42 539 5113 9089 4601 544 -811 -1955 -3511 -5821 -9791 -11647 -9727 -5905 39 -887 -2387
1549 -2387 845 5323 4953 1349 -2736 -2527 297 2527 637 -5019 -1365 -675 420 3458 2975 400
1533 400 -829 -1556 -1247 503 3217 7448 8910 10098 8503 4384 -370 -4153 -6055 -851 4231 674
1517 674 -1048 -3482 -2655 -2023 -2520 -3029 -6172 -4817 -1087 2745 3734 4753 2402 -1427 107 4139
1501 4139 5353 4325 2107 3357 5067 6572 6962 3407 -594 -4413 1308 6926 8057 6461 5924
1486 5924 6275 4336 428 -626 363 -492 -1838 1266 3203 2894 -3551 -2276 979 716 1164 4481
1470 4481 6395 3316 -2466 -3622 -853 2246 3045 2055 1903 2721 -38 5305 8675 4816 5097 4437
1454 4437 4876 5843 7354 2060 1301 1410 241 -1541 -3958 -1311 235 -853 -167 894 -2052 -2696
1438 -2696 1547 450 770 389 -484 -1989 -2773 -6984 -5065 3196 2584 -1364 2675 4355 4724 4334 6162
1421 6162 6655 3191 3046 2868 -969 -2644 -516 3731 -333 -3005 -9011 -4032 -1447 624 2598 974
1405 974 -3031 -2958 -5033 -6084 -780 834 2660 2206 -2675 -7035 -7110 -1573 1408 2212 6090 9723 8914
1388 8914 3691 2329 4957 1199 -3003 -2664 -3097 -302 -6196 -2258 1993 3200 5054 8067 9043 8676
1372 8676 6308 6643 6096 2124 -893 261 -2756 -6911 -8632 -3598 3048 6415 8668 6583 6123 4416
1356 4416 2818 4518 4556 5370 10262 6738 2524 1766 4091 3244 192 -464 -1933 -2115 -5589 -5997 -2003
1339 -2003 -2636 1002 3965 4226 3667 7201 8676 7612 4617 8749 10302 7198 2592 1612 -1016 -2517
1323 -2517 -5338 -2943 -1923 -139 -3068 -2405 1098 6658 2392 -4836 -3376 20 147 177 -1256 2184
1307 2184 3542 939 2042 -340 1883 4472 5987 5153 2286 -520 -246 2546 2421 1439 1263 753
1291 753 5168 5909 4853 4735 1878 -1234 -4323 1549 6794 7248 3205 -961 -1799 -1072 3745 6964
1275 6964 5069 1463 5029 8255 5623 4724 6367 5277 4372 1960 2491 2217 2561 2670 5309 814
1259 814 -2040 -4372 -2537 3990 3767 515 2335 1816 2159 -950 -3169 -2065 -1953 412 505 6933 8756
1242 8756 2554 350 -1205 -5636 -6273 -868 -968 -4613 -9013 -11996 -11591 -10251 -6916 -6733 -6905 -3214
1226 -3214 -194 -3525 -4781 -4284 -3117 530 2034 853 -324 -1182 -1191 -2455 -2690 -6582 -4108 -5910
1210 -5910 -6325 -5859 -3404 -9305 -6656 -3761 -1358 -3623 -7244 -8473 -5447 -1072 812 1869 -525
1195 -525 16 -2569 -5195 -4032 -5214 -5096 -6069 -6232 -6249 -6837 -3041 -542 -721 285 2443 2878 2079 817
1177 817 -2373 -6993 -7608 -6828 -3598 -42 3804 5440 4976 3188 984 2360 1185 -582 -970 -5532
1161 -5532 -12053 -12518 -9295 -4926 -3941 -254 8267 10071 3840 3748 1735 -1275 -4585 -5218 -3946 -1269
1145 -1269 -249 4452 6491 2427 -1355 -390 228 2286 3658 -1828 -3735 -2004 -1440 810 -187 -2682
1129 -2682 -1193 -264 -3462 -2857 -1105 617 3987 7660 6607 4708 2464 2791 1711 2397 2611 2184
1113 2184 2561 -1896 -2439 -3625 -7500 -6543 -1367 905 678 -2435 -7031 -6835 -2048 305 -172 2003
1097 2003 1128 -1978 736 2337 5302 2407 1055 -1974 -6931 -4082 -1114 -1008 708 -3662 -12604
1082 -12604 -10130 -5580 -682 -2061 -3558 -2467 -572 -128 -1391 326 732 -2995 -5557 -7708 -7876
1067 -7876 -9155 -11937 -11477 -4768 4017 2726 2289 740 3112 2568 -2205 -2532 -1591 2692 7538 2455
1051 2455 1063 279 -2695 -2200 464 2582 961 -2970 -5573 -5654 -7109 245 4591 -561 -5765 -5116
1035 -5116 -458 3821 3859 3154 939 269 3430 4130 2232 -319 1380 2045 1087 -154 -244 1261 3037
1018 3037 -464 -2708 -6009 -5809 -1761 1407 396 3082 1455 2029 996 2481 -2553 -3425 -2763 -2546
1002 -2546 3285 3731 8010 11186 6288 2168 1233 -4137 -4725 -1319 -5777 -7004 -5383 1044 3081 4597
986 4597 4649 4988 6766 5413 1372 -1439 -335 3262 4297 2238 3928 2902 3363 2851 947 996 5135
969 5135 5963 5454 1037 -261 1692 1832 -68 1044 4757 1629 2029 2827 1854 1575 -1100 -363 1085
952 1085 525 -2424 -1364 963 -4715 -10480 -10721 -6778 -5815 -5210 -1030 -3558 -2311 -2490 2213 2303 -681
935 -681 -1466 -1968 2996 4946 3616 842 1284 -890 -5067 -3442 -6189 -8489 -5718 -3871 -1465 347
919 347 -1907 -3459 -3376 4037 3118 2170 2775 -44 -3335 -2296 -4985 -5855 -4736 -3706 -2344 -2748 -1196
902 -1196 3123 1360 -456 649 -163 1214 409 766 -2728 -4233 -6411 -6228 -1738 -3443 -6623 1169
886 1169 5319 3947 5271 6814 9383 5112 2485 1336 -3317 844 923 1567 4395 5762 7150 4655
870 4655 876 2235 -738 1333 4634 3482 4046 4667 6466 7458 8780 10196 7436 3819 2433 359
854 359 2225 1918 -867 -5196 -7550 -4930 -5704 -6672 -5827 -3879 1519 1629 -1117 1136 632 -3314 -5317
837 -5317 -4043 675 1376 422 -1398 -758 2034 3574 2025 -986 2157 2209 3592 4987 2240 562
821 562 779 -1192 -2267 1258 3730 4942 4319 -2888 -5694 -4267 -4131 -4670 -4790 1089 -444 1779 3869
804 3869 2819 -266 -4249 1359 3405 5476 4538 5239 6275 6658 4573 5971 9129 5264 2436 -1487
788 -1487 -4134 -313 4544 7837 4042 3001 4006 1247 -4579 -3098 -953 871 -3238 -2313 -6590
773 -6590 -3764 -1663 -4273 -6106 -6994 -5817 -556 1873 1365 3796 5199 7423 7958 3810 1377 -2713
757 -2713 1491 2357 4077 5620 10397 12685 12923 9474 5814 6749 3571 248 396 1667 6997 9382
741 9382 7374 4012 1776 1247 2493 -933 1033 5677 5609 1698 -772 2484 2281 -2885 -5077 -4963
725 -4963 -838 2417 5452 7222 10981 6730 3165 155 -5442 -4678 -2329 260 2038 2132 2059 1375 3484
708 3484 2190 2741 3732 5537 8470 8155 7761 8538 869 -2978 -5643 -5069 -65 -398 -6290 -6886 -1520
691 -1520 3228 5388 2405 6489 11174 8457 2379 -4087 -4087 3062 899 -1253 -795 117 2220 2349 2201
674 2201 5234 5147 5188 2647 151 -34 378 -1321 -1872 5589 5951 2808 1902 1018 -1411 -1071 -5159 -5272
656 -5272 863 -246 -185 3242 6215 7181 722 604 1849 2287 994 -150 1267 2819 -694 -716 -1950
639 -1950 -2849 -2339 -4300 248 858 -468 547 -684 -4044 -5499 -5611 -3692 1291 3674 2864 5708
623 5708 4887 2273 5193 3975 2954 5461 7194 3702 4145 342 983 318 926 1006 -1190 -2946 480
606 480 2520 3601 -1308 -3032 -333 -107 1873 1318 2005 130 1598 4218 10335 13549 10091 4531
590 4531 5935 5745 6822 5543 1173 -2501 305 703 -1310 -2571 2566 2272 -2435 -577 6311 4991
574 4991 1215 990 1048 -611 2324 1468 923 1095 3188 4110 -4315 -10167 -9424 -6744 -5925 -6808 -5089 -1829
556 -1829 -59 3615 8434 8887 4932 2415 782 -2596 -4638 -4996 1759 2135 2757 152 319 1303 330
539 330 642 -2945 -2431 311 336 3612 5786 6014 7408 6709 5073 1943 -3442 -5125 -3557 -1639 2969
522 2969 711 -3603 -12148 -12218 -7820 -6027 -4852 -2737 -3357 -8726 -3508 2822 1604 -607 3018 3567
506 3567 33 5704 6346 3125 -1158 -2322 -1324 -2147 -2258 -2692 50 1886 -1647 -2587 2412 4955 9097
489 9097 5490 -3831 -4482 -1681 281 2435 4297 2188 509 -1899 -819 2351 4228 5042 1846 -1378
473 -1378 -168 271 -498 276 1984 2666 2792 2427 -256 991 3565 6262 3035 4211 8341 6606 10377
456 10377 11599 5777 3196 1715 -1137 -967 -1263 -4283 -3511 -1491 -143 -1709 -16 -3684 -3877 -1685
440 -1685 1010 -149 -2423 855 4154 3776 7081 5162 -1758 -4179 4219 9051 6765 4090 -3763
425 -3763 -5791 -4025 -3719 -6594 -7360 -4294 -882 1378 -881 -2639 -2344 -1267 19 1460 3735 2675
409 2675 523 1907 1751 2648 8314 8147 6001 4647 351 -37 1207 3414 6341 8327 4801 2374
393 2374 6192 8359 10719 7215 5644 4199 6854 5150 4204 5204 5034 6390 6426 2993 1356 2843
377 2843 8344 6433 4893 4157 4185 792 -1132 -2650 -3681 -1482 -244 -2569 -4303 -1122 5655 8018
361 8018 5581 6109 3885 727 2796 390 1603 4073 3845 1831 -1710 -3729 -2514 -1665 -2098 -1760
345 -1760 -2396 -1526 -1835 -647 1588 2450 -199 -904 710 -1609 -3712 -3477 -1431 -1240 686 1500 1156
328 1156 -3805 -5612 -3990 -3002 -2040 -1924 -230 -1228 1035 2939 7271 4845 -999 1970 3479 4839
312 4839 4693 4219 6229 6125 5229 4044 4218 3032 1294 454 62 494 3317 5228 5330 2845 3223 3680
294 3680 3323 1023 1813 -845 -2665 -1205 1349 -461 -847 1790 525 70 -1353 -1044 -1643 -415 408
277 408 -1023 -962 -301 1097 421 -1216 1477 1589 -670 -13 -3799 -3013 1789 1475 -1676 157 -1977
260 -1977 -4444 -782 1785 1294 279 1691 -14 -806 443 1251 308 3029 -187 -2347 -3687 -1461
244 -1461 -1189 -1795 1813 -890 -775 3168 2213 1169 1989 4087 2757 3953 4706 4245 5341 2645 -2306
227 -2306 -4537 -4669 -5074 -4477 -1138 1682 2202 -985 -2439 -3505 -5485 -5396 306 2353 1239 -872 3175
210 3175 5104 2038 -1133 -5247 -2974 -278 -2132 745 3633 -569 -3920 -3288 119 2436 1904 1947
194 1947 485 -393 444 1405 1720 -1255 1423 2758 3171 4598 4360 954 -926 1824 -1844 -2257 -2332
177 -2332 -2969 -2311 -317 2801 135 1026 846 2805 2478 2335 447 438 1492 -1702 -2631 -2968 -2813 529
159 529 4572 5340 4405 4050 3620 5950 2781 -306 206 -3624 -2462 -3277 594 4400 2350 451 729
142 729 1249 1576 50 897 2055 -2914 -3639 -1829 -2572 -3001 25 514 731 466 -997 -731 86 2736
124 2736 1158 2801 3475 4329 8044 7027 5480 3392 3372 392 549 1357 2270 930 -144 -438 -394 -2673
106 -2673 758 1882 -195 -1514 2698 3548 3292 844 -739 -4742 -3635 687 2764 1129 1316 3491
90 3491 1214 -2735 -4975 -2835 2145 3242 1638 -559 1382 1872 -1542 -3010 -3353 -1747 852 -580
74 -580 -2381 -3244 -3338 -3245 -3995 -4945 -1993 1266 2611 4788 4970 2049 -975 1800 5807 7814 4815 4818
56 4818 5332 3355 1358 632 395 2011 3943 3479 1185 2766 2410 2207 2659 -98 378 1153 568 -1072
38 -1072 -2914 -1973 -756 -1256 -756 -530 656 1154 -1833 -1481 132 2488 2074 590 789 787 623 -1349
20 -1349 -3152 -1772 -230 283 597 2253 112 -1777 -1204 1963 355 -1247 -1358 360 2611 2190 2519
3 2519 1736 -767 -4015
0 -4015
$$ Imaginary data points
##PAGE= N=2
##DATA TABLE= (X++(I..I)), XYDATA
32767 29493 31661 30311 29023 28857 29072 31503 30617 32305 31802 30696 31714 36523 37971 37525 35279 34293
32751 34293 36216 37778 36666 36170 39421 42064 41526 40356 43123 44538 44488 45690 47245 47476 45587 44923
32735 44923 44306 45996 49291 53369 52897 51660 49782 49718 49288 49935 48970 48013 49662 50567 51734 53669 55522
32718 55522 56339 55969 58787 58165 57711 57922 56492 58666 59891 57585 58063 60559 63316 65095 65818 64941
32702 64941 66114 66401 66253 64755 67614 66033 65456 65399 67197 67454 65112 67172 70126 70840 68656 69051
32686 69051 68343 67386 69320 70977 73921 73727 72651 71611 71646 72587 70891 70336 69350 71458 71890 73562 76333
32669 76333 80425 84040 81200 81697 84129 84663 83415 80229 78976 79288 79669 82391 85398 84208 83182
32654 83182 85345 85680 86495 87656 87009 88955 91782 93633 90638 89441 94466 96554 94173 91264 90061
32639 90061 90099 90527 93142 95927 97970 99017 101389 103257 99132 98306 97302 99410 98486 95837 96153 97232
32623 97232 100307 104234 105570 101383 99515 101732 102013 101148 102029 104341 104246 105009 106395 109044 112518 111002
32607 111002 109979 110287 108443 105758 105223 104555 106128 105024 103843 106468 111596 113822 112895 112883 113635 112177
32591 112177 112054 112156 112884 114750 115251 114535 116185 117588 118598 117609 118793 118298 118805 119524 122632 121884 120887
32574 120887 123831 125851 126627 130355 129910 128696 129356 128569 128205 131384 128929 123805 123071 122409 122736 123992
32558 123992 127427 127567 124430 123477 123235 126294 127332 130832 133230 134514 134673 136574 136166 137971 138628 138896
32542 138896 137352 138435 137751 135630 136106 138370 138654 137556 136968 139813 141675 139241 137624 137494 137901 134437
32526 134437 136521 136996 136296 138802 140428 140044 142067 143162 143647 144085 143769 142455 140778 143322 146345 147853
32510 147853 148766 148907 149707 149751 148852 148555 148240 146293 146374 146350 145627 148210 148616 145391 150339 153902 156917 156337
32492 156337 156099 158366 159814 156105 155213 152511 151894 152707 154987 156840 156479 155384 156229 153609 152006 154443
32476 154443 160390 160693 155023 153592 153703 156122 156201 157669 157492 155449 152590 156335 159575 159344 160327 163901
32460 163901 163434 159188 156929 156565 160512 164485 163917 164830 163802 160503 162915 163943 163546 167126 168091 165443
32444 165443 163662 161914 160800 158617 156214 159264 161532 160934 160202 154694 153667 158503 159948 162188 165413
32429 165413 168665 169529 174159 175381 170361 167807 170583 169056 167445 166278 162486 162100 166466 166954 167774
32414 167774 165619 162318 166900 174275 177914 172066 170754 172316 171748 170526 170637 169358 173645 176136 176347
32399 176347 174340 174307 175607 175186 172810 173356 174587 175536 177555 176956 174635 170287 170325 171377 176357 180578
32383 180578 177802 177345 179435 181853 183749 181622 181271 183390 180406 180318 179048 179940 174427 168635 171426
32368 171426 177134 180612 177747 173277 176724 178076 179879 179856 175989 177392 181063 180133 179623 180116 179398 182509
32352 182509 181115 182614 181192 183503 184163 181414 182676 180612 179162 180717 179874 184080 187865 190394 190479
32337 190479 186902 183286 184892 189719 191680 188241 189514 186947 183304 182986 185493 185399 184026 182744 186201
32322 186201 187459 188388 189105 186065 184584 188103 191817 192995 190694 188388 187789 188532 188089 187924 189370 189762
32306 189762 185566 184194 181672 185505 187040 191684 193297 193433 191934 189252 187975 186228 187149 186891 192487
32291 192487 194238 196625 199765 200011 201183 200834 198579 198767 198424 198304 198488 195037 195866 192532 192089 192497
32275 192497 190419 192977 194717 192110 190946 186578 187921 189373 187732 184048 187415 191836 197257 198086
32261 198086 198077 199924 198099 193023 188578 189561 189278 186643 192071 195989 195140 196970 194075 194136 193389 190612
32245 190612 188952 189319 193048 196427 196479 193366 189464 187170 189182 194896 196259 194426 188879 192039 194990
32230 194990 199337 199648 196095 192813 191141 190121 191148 193714 195097 194465 195395 193972 196077 198085 195989
32215 195989 195821 194658 192418 194335 196265 195640 191932 187501 186783 190237 190632 189003 190989 196394 199246
32200 199246 199876 198804 199054 197908 196995 194040 192189 186629 184430 182592 184348 191690 197093 197389 196405
32185 196405 198255 199051 196502 194287 192250 193720 195942 198072 198603 200406 202651 204258 202229 193361 196056
32170 196056 199191 199814 198164 198175 199193 199028 201222 201610 201330 203761 202781 203261 201276 200258 203135 201750
32154 201750 200500 198302 201103 197821 194333 196540 195548 196016 193678 196580 200339 204433 208612 204447 206606
32139 206606 206985 206627 201208 203043 204346 200693 197468 200419 200739 198015 200164 204235 207065 206430 200164
32124 200164 197946 201044 204899 204489 200993 201526 203649 200391 198011 200962 202891 204777 201866 201168 199625
32109 199625 198815 196131 198805 197054 195296 196666 197258 199719 200320 200385 197547 193253 189580 188056 185472
32094 185472 187939 193287 203026 203892 201231 197634 201300 201461 202098 201380 199027 204819 204303 203163 205508
32079 205508 202748 203850 208390 206469 199723 196500 197731 198586 205258 208227 209211 207167 204551 203771 202591
32064 202591 200125 204630 205862 201245 199048 197579 199976 202669 201069 196391 196324 199997 202379 200086 195749
32049 195749 197991 200989 201334 205437 208709 207682 206701 204944 205145 207948 206066 204833 206867 205948 208204
32034 208204 211401 211858 211281 207433 208204 209197 209673 207754 206278 206096 206907 204077 202921 203885 205897 208881
32018 208881 207342 206633 210188 211868 203661 198683 198506 199041 199182 198089 196880 200860 205170 209427 207524
32003 207524 207656 209154 209070 208888 210940 206047 204099 203107 202884 203366 206421 208965 208872 208563 206675 209279 209153
31986 209153 209738 210553 206423 203332 206322 208817 210352 210453 207677 203335 199781 194051 195260 196034 198575
31971 198575 203695 205480 204025 202123 199429 196623 195009 196260 202544 205850 205543 203659 199474 200812
31957 200812 200531 199417 199252 201616 202055 204438 203720 202123 200576 200014 200558 195751 194773 200835 203023 203120
31941 203120 198742 196456 198904 201070 204959 207145 201352 199617 203173 202903 198832 199456 203811 208019 205814
31926 205814 203697 204156 203174 203615 204367 205756 206039 201212 197784 195859 198151 198168 197791 200587 201018 202708
31910 202708 204222 205245 202916 198755 199144 204138 202573 199107 198713 200576 202431 202018 202962 199711 194979
31895 194979 195713 193677 193444 193519 193863 195003 196402 200509 203142 203481 202439 201696 203613 201921 196306 193735
31879 193735 197563 202022 204614 208265 209926 207475 206483 208269 208539 204700 202905 204525 207439 205517 203642
31864 203642 202894 208032 210223 206604 203743 202577 203501 204972 203443 203334 204386 199472 201402 204611 206735
31849 206735 205730 201394 200203 199508 199979 200274 200955 203549 204687 201537 201230 202038 204388 204012 205846 207150
31833 207150 201715 203981 202623 200965 206175 206706 204065 200044 196733 197296 199679 202780 205516 205118 201471
31818 201471 198945 198716 197883 197914 194860 191876 195300 198634 202550 207327 204611 201603 200801 201640 202086 204191
31802 204191 210574 206782 203063 199813 202161 207321 208655 206545 204056 203977 205872 206426 207970 206829 205829
31787 205829 207143 210857 209642 206700 207673 203915 199825 199298 200458 201470 204737 209224 212392 213254 211050
31772 211050 204335 199950 195716 195628 196291 204370 207274 208415 203268 200822 201885 199974 201028 201376 207203
31757 207203 207561 201615 199120 200950 202826 199429 199934 198448 197929 199569 204723 206303 204897 200376 199961
31742 199961 202726 203859 200682 200515 202714 201849 199656 200271 200804 203386 209025 210593 208140 210247 207409
31727 207409 206777 210729 208701 206025 206913 207387 207906 206612 204812 205537 205412 206233 206979 205716 203304 203960
31711 203960 207212 208757 205083 198894 199037 203581 207976 214615 216109 213564 209762 206267 204244 203211
31697 203211 197810 199206 203863 206123 205165 202852 203074 202514 205269 207135 204619 201557 202217 203053 203262 205161
31681 205161 207831 208367 207502 202047 202281 205178 205599 202853 200171 199314 195019 193875 201154 202923 204358
31666 204358 205158 207077 207727 208550 207153 206445 207732 206917 202716 200253 200581 202623 203459 203972 203419 197559
31650 197559 202289 205941 207918 205639 200864 199187 202780 204907 205249 205244 200967 203199 200794 201932 205650
31635 205650 206861 206602 206458 203881 204182 206462 208282 211109 210155 207138 203515 202356 198891 196985 202100
31620 202100 207254 208545 203942 203446 204548 204005 203173 207456 210119 208103 208210 208364 203154 199795 199231 199542
31604 199542 202708 205146 206297 201229 200346 203038 206881 204937 204035 205350 206235 203977 202714 203440 202925
31589 202925 206428 206493 206943 204296 205167 205155 207920 210533 208423 208779 206373 203367 207546 209920 211968 209331
31573 209331 205841 205794 206081 204966 204127 202445 201360 200857 202254 208203 211052 209834 204573 205469 211281 214723
31557 214723 216618 210876 207330 205360 204881 208147 208211 208602 211096 207151 204417 203134 200856 199432 200116
31542 200116 205111 206011 204270 204354 206245 208471 210254 209969 205907 204501 203001 200895 201896 204755 205705
31527 205705 206099 202952 203552 209235 210374 210209 208605 205068 204394 206734 206280 207108 210193 214850 215170 211259
31511 211259 208184 210186 208891 206488 201487 199162 200927 204546 205388 201668 197795 198610 201970 203843 206663
31496 206663 209477 211172 215693 215111 213956 209725 207903 204237 200532 201113 203303 204605 205218 207194 206242
31481 206242 206402 208009 210138 211471 209938 207654 207892 208807 208534 208198 208457 207119 205355 204504 201240 198011
31465 198011 197891 197955 201487 203726 202389 201641 202337 204634 208128 206859 205637 207710 210324 210932 213998 210206
31449 210206 206402 200831 202469 206052 205700 202322 202114 202167 205015 204691 205990 205424 203418 202825 202057 207952
31433 207952 211681 213157 211145 209180 205784 205624 205928 199940 199694 202346 204838 203225 201925 205698 210182
31418 210182 211413 208059 202504 204135 210902 210178 206519 206095 205831 206803 207119 209821 206198 200322 203005
31403 203005 208262 205329 203312 204647 205791 208725 208927 208687 208042 208755 209176 209955 206191 205862 205883 203076
31387 203076 206803 207007 206930 204558 200971 200645 200717 203401 201372 197195 199490 200837 206100 210662 214223 216387
31371 216387 216192 210409 209281 211428 208474 204736 202232 199274 200086 204025 207456 205692 204325 201956 205796
31356 205796 210887 207505 206012 210287 210045 205837 208013 211991 211853 209657 204997 204738 210030 214220 213838
31341 213838 213963 213874 215010 214070 213194 214706 215753 214431 215385 214493 210281 209557 208370 211845 212744 211337
31325 211337 209963 210426 212300 211501 207809 205262 204513 204511 206297 208190 207589 206542 203796 200978 200613 202036
31309 202036 206496 207042 204539 204245 204226 203980 204475 206278 208551 210874 213280 214098 213219 207483 205026 207251
31293 207251 210667 208142 204489 205832 204513 200700 204543 202471 201788 206637 210375 214095 212059 212668 214264
31278 214264 212485 207438 207005 206301 207305 208547 209183 211435 208334 208670 208497 208931 209659 210813 209418 205674
31262 205674 204476 209386 209542 205622 207205 210308 213391 211711 208694 209220 206889 207280 209680 214895 214930
31247 214930 212201 210182 211205 211164 211534 213644 214110 211952 213584 215582 216991 214409 214710 216455 216383 217363
31231 217363 213063 208811 203956 202196 203584 205725 206005 207872 211073 213147 213535 214249 216011 213384 212541
31216 212541 213048 216844 218906 215152 213362 208186 206977 210822 216154 216548 214212 214167 215009 215358 215844 213383
31200 213383 212164 213385 210761 209107 210765 211723 208978 206452 208746 202612 203270 203973 203179 202603 205329
31185 205329 209433 213119 217272 215371 208644 203856 204537 208195 214383 218967 217010 213716 213567 214800 213272
31170 213272 212795 209680 209321 212448 214651 212357 212419 213103 213225 215547 214321 214861 210757 207276 204608 204769
31154 204769 212596 214254 212508 211159 210776 210210 210919 212018 211697 211993 211824 211370 211942 214061 213675 215240
31138 215240 212956 211302 212009 212868 211006 208972 211577 211449 210851 211805 208621 206711 209861 210611 211798 210102
31122 210102 209044 210197 212586 214531 214077 212539 212857 207888 212939 218119 219221 220855 219335 219152 211824
31107 211824 207462 208759 209448 206076 209273 210813 209362 212434 218800 220488 213322 208067 207004 213237
31093 213237 214182 211561 211634 212043 213637 211444 206804 207360 209754 211896 215052 214480 212912 212390 211141 211420
31077 211420 210177 213237 212048 210636 213886 212246 210371 206571 207600 209828 212058 209816 204806 200150
31063 200150 203159 204678 206876 210791 207759 209800 214291 214785 209846 205472 207089 210835 215481 214898 216301
31048 216301 216609 211067 213734 214816 213278 215204 218640 215587 215666 217148 217831 219033 220950 217693 215321
31033 215321 213137 212401 214885 218009 216316 216506 214172 211281 210605 209430 211215 210643 211376 212905 213584 211987
31017 211987 211863 216074 214268 214376 212616 210513 213253 210817 207545 208812 207034 209114 211934 211262 211206
31002 211206 216345 218379 214815 210373 209403 210629 216004 211716 206623 211991 215525 214810 212895 211587 215746
30987 215746 216380 212813 212671 213966 212098 212059 216936 214324 215807 217042 214451 213987 216507 216896 214823 216198
30971 216198 213644 210674 210123 208752 210678 212449 212040 210492 208161 207141 209273 211639 212702 209796 207738
30956 207738 209517 209091 213919 213828 211306 209065 211299 211186 212526 213398 211069 208513 209224 211880 211012 210069
30940 210069 212554 212583 213999 214943 213027 213076 217388 218771 214134 211284 215891 217061 215590 213119 212199 211836
30924 211836 210181 210122 211176 214014 214609 212407 213674 213774 215553 214851 215644 212241 206799 204203 207837 211908
30908 211908 210632 211433 211796 214811 215444 214433 216067 217637 215162 214250 211451 206238 206205 207942 211768 213544
30892 213544 214143 212035 213709 213368 213229 211098 212978 211922 211467 212362 213373 213073 215769 216764 212194 210534
30876 210534 212119 215779 218463 218818 215368 214824 216454 215916 208681 207459 211821 214795 210484 206480 205894
30861 205894 209876 219524 221042 217748 216817 213132 211754 215861 216988 217604 216740 211797 211462 213357 217565
30846 217565 215080 210241 208770 209014 208247 214865 219684 222694 223888 225590 227787 225673 225522 220843 215526
30831 215526 215051 211093 211775 208474 210660 212476 212062 213235 211885 209191 203480 201428 204201 208468 206608
30816 206608 203430 202816 203027 200567 202045 201928 206685 210113 212412 213979 209102 209044 213205 213933 210905 205559
30800 205559 203259 205425 208362 211367 211214 211648 213300 209782 209950 208318 206071 204892 206003 206187 209232
30785 209232 213119 213064 212424 209631 209183 208349 208524 211389 209531 209575 209779 214271 217225 212710 209294 205757
30769 205757 206613 210911 217671 220039 217979 218555 216152 212161 212076 209024 208854 212090 211380 209469 214966 216923
30753 216923 215292 217796 219273 217748 212936 214433 221706 222221 216481 220394 220618 215909 212931 212971 215053
30738 215053 216284 214699 215434 217852 218565 215097 210454 211235 211849 212476 213638 214826 213162 213603 213079 212994
30722 212994 211925 210367 212432 209969 208372 211941 212620 211174 214721 212537 210652 212273 213391 214213 218765
30707 218765 221313 222022 221183 217952 214789 216633 221318 217951 215769 217304 217847 219143 217937 220161 219354
30692 219354 217999 219190 219123 212799 211158 216039 218641 219804 218495 217865 221388 220992 217326 212418 209178
30677 209178 209853 210925 214206 214321 215636 218421 215627 218480 223427 222697 220642 218027 217325 218382 221889
30662 221889 222830 219758 219870 217548 216512 213931 215623 219553 221728 222043 224525 222347 221875 224206 220978
30647 220978 218501 222676 226160 224067 221011 219010 218430 219034 218325 218020 221106 221579 217870 221703 219448
30632 219448 214292 213307 216395 218473 216931 214722 215773 215959 214579 218358 218531 216528 213598 212593 218079
30617 218079 222672 220485 221633 218869 215837 215803 215905 215970 214472 216097 219959 219078 216627 216341 215107 214320
30601 214320 214655 217441 218562 219549 221230 218406 214462 216568 221174 221671 221454 218556 219095 222347 223342 221272
30585 221272 220746 217896 215898 213090 212447 211419 211847 213033 215375 212730 216328 221134 224664 221704 221516
30570 221516 221581 220547 216211 213516 214448 216911 219273 214627 214493 214993 219167 221325 215004 211257 209314
30555 209314 207777 210700 216365 216208 213519 213680 212581 218162 217883 216057 220054 220473 222221 222665 223070 222783
30539 222783 223207 220410 220065 218241 218909 224538 224601 222575 221874 217384 215216 215551 213463 211349 209847 212699
30523 212699 216784 217598 217625 219753 214592 212502 212031 216462 222897 215654 212222 211031 215117 217332 213692
30508 213692 209711 206615 210891 212566 214377 218291 217483 216708 214197 212237 212425 215804 214495 216118 214708
30493 214708 215846 215762 214578 217646 220048 219757 220190 217033 214568 213261 213941 217635 218036 218224 221704 222052
30477 222052 215821 217847 218661 216817 215992 216821 218694 218290 216869 218013 217983 216461 217158 220958 221113 223605
30461 223605 219485 216809 222903 224484 222723 225091 226843 226490 228888 230794 230179 226639 223963 224186 226527
30446 226527 227120 225591 222558 221290 223181 224094 222184 218643 216998 219408 218681 218257 216524 216253 216069 216223
30430 216223 216986 219853 221970 224138 221282 216211 217198 220589 222697 220804 218491 218561 217155 217285 217394 219840
30414 219840 217506 218644 221585 222825 225232 224794 224440 222826 219162 215918 215193 218094 218796 217618 217699 219126
30398 219126 213901 214263 221685 225796 224865 225568 222379 221226 224863 224827 223315 222018 217464 218400 220996 216999
30382 216999 218301 218918 221552 220767 220044 220811 223168 221049 218827 217574 217749 214302 214353 213497 213306 213184 214757
30365 214757 218805 221186 222237 225271 223380 221779 224451 226137 223598 224524 219191 217760 220221 222456
30351 222456 224107 222788 220110 217352 218532 219447 224852 227324 223220 216469 218462 217871 220592 222209 220082
30336 220082 222232 221046 219166 218112 221115 221669 219294 218449 221325 221887 220330 221140 222815 221295 219269
30321 219269 221936 223787 225398 223440 219382 217183 215170 210821 212375 214481 214344 222288 227787 228048 224210
30306 224210 224232 223072 220634 219947 220492 223475 222488 221074 219310 217845 218695 218085 216158 218869 218023 217622
30290 217622 214891 213461 214012 211430 211070 212352 213073 214595 219957 225561 226583 225035 220821 215832 217458
30275 217458 221224 221854 222962 225870 220587 218951 219852 217559 214784 215763 221115 221786 222589 223177 227880 230934
30259 230934 228399 222733 220306 219462 221922 219937 217890 220042 226199 227094 226360 222612 220261 216144 217893
30244 217893 222481 219711 219590 219093 222615 223577 221836 223538 223673 222355 224093 226331 220765 215333 215123
30229 215123 216796 217567 215151 216133 220802 219610 214261 214621 219513 217645 218819 222257 219478 219423 216827
30214 216827 215070 213720 215491 217865 222757 223446 222543 219892 218117 217833 217996 224529 227583 222838 218653
30199 218653 221426 224285 221160 219579 223582 228384 226298 222633 225607 225553 224767 225822 225418 224788 229025
30184 229025 233076 229781 228994 228366 231852 232401 223410 217474 215139 216382 217422 214779 212619 214656 217128
30169 217128 222044 223174 220076 221164 220424 221340 226657 227590 221596 220340 221512 218994 217580 219165 220291
30154 220291 219287 218919 223415 221298 222884 226645 226348 225852 224112 220705 218095 221974 226088 221807 216008
30139 216008 216605 217050 217436 218402 226145 226719 223633 224400 224469 221876 217735 217363 220882 223755 223185 223639 224557
30122 224557 225237 222112 223830 224910 224371 223688 224982 221969 217015 217218 216111 218333 218551 223729 224725 222517
30106 222517 222094 219928 223130 223101 224298 228820 230910 233809 232359 231041 231868 233240 233519 230407 228993
30091 228993 229030 228133 226366 223252 223450 223636 223547 225335 220336 218460 224031 224083 221095 222796 226283 229562
30075 229562 226492 231096 224197 218043 220691 218374 214884 213981 217262 219356 224261 224409 220769 219275 217364
30060 217364 221526 222332 220854 220579 221199 223373 218775 215227 215198 220801 220397 222741 227798 227226 227856 225488
30044 225488 226071 225971 220898 219813 215920 215551 219501 222889 225579 225275 226039 226329 225516 225931 222732 218923
30028 218923 215438 216251 218302 222666 225004 228525 228855 223871 218382 217689 223268 222743 220237 221694 227615
30013 227615 229437 225484 222410 220490 220723 222513 225017 225226 225866 224925 225492 227310 224028 223450 224729 227208
29997 227208 227955 227465 227209 226097 229717 231701 232535 233941 230693 227981 224052 219329 217962 219922 223331
29982 223331 223534 222474 224167 224987 218807 216662 219160 218087 214062 209650 208495 212935 217242 224208 227819
29967 227819 222970 220676 221070 222804 225469 225353 225368 226820 228477 228547 226939 225080 226555 225031 221963 226767
29951 226767 229761 228475 227134 224135 217811 220839 222120 218655 223365 226327 229536 232979 230998 229446
29937 229446 226728 224081 226321 227285 224853 225070 226643 229346 232477 234173 232130 225779 224285 227558 229560
29922 229560 229763 231492 232433 233610 233317 230646 231176 228532 227403 225237 225734 224342 219566 218890 219820 221060
29906 221060 224585 225311 225941 228951 232805 233150 229435 226887 222351 223186 229121 233002 231170 230237 229278 229584
29890 229584 226809 226519 221216 219962 225659 225708 226693 221586 218056 218991 222246 224243 226514 223165 218174
$$ [...]
##END NTUPLES=NMR SPECTRUM
##END=
