##TITLE=Analysis number 314577
Compound Code cc 28510
Project Code adrs
Chemist Name stores
##JCAMPDX= 6.0         $$ Bruker NMR JCAMP-DX V2.0
##DATA TYPE= NMR SPECTRUM
##DATA CLASS= NTUPLES
##ORIGIN= Bruker BioSpin GmbH
##OWNER= NMR
$$ XWIN-NMR		Version 3.5
$$ Thu Oct 20 12:32:45 2005 GMT Daylight Time (UT+1h)  MAYBRIDGE\NMR@NMR_250MHZ
##.OBSERVE FREQUENCY= 250.131544655141
##.OBSERVE NUCLEUS= ^1H
##.ACQUISITION MODE= SIMULTANEOUS (DQD)
##.ACQUISITION SCHEME= undefined
##.AVERAGES= 16
##.DIGITISER RES= 18
##SPECTROMETER/DATA SYSTEM= dpx250
##.PULSE SEQUENCE= zg30
##.SOLVENT NAME= CDCl3
##.SHIFT REFERENCE= (INTERNAL, CDCl3, 0, 16.522)
##AUDIT TRAIL= $$ (NUMBER, WHEN, WHO, WHERE, WHAT)
$$ ##TITLE= Audit trail, XWIN-NMR		Version 3.5
$$ ##JCAMPDX= 5.01
$$ ##ORIGIN= Bruker BioSpin GmbH
$$ ##OWNER= NMR
$$ C:\u/data/dgb/nmr/ADRS/11070/pdata/1/auditp.txt
$$ ##AUDIT TRAIL=  $$ (NUMBER, WHEN, WHO, WHERE, WHAT)
(   1,<2005-10-20 12:32:26.67 +100>,<MAYBRIDGE\NMR>,<NMR_250MHZ>,
      <created by zg, POWCHK disabled, PULCHK disabled
       configuration hash MD5:
       62 19 C7 07 E1 42 D1 B7 37 6C 3D D0 77 39 F9 E6
       data hash MD5: 64K
       1E D4 47 E2 B2 48 D2 F7 89 81 62 A2 84 29 BB 98>)
(   2,<2005-10-20 12:32:37.69 +100>,<MAYBRIDGE\NMR>,<NMR_250MHZ>,
      <Start of raw data processing
       ef LB = 0.3 FT_mod = 6 PKNL = 1 SI = 32K 
       data hash MD5: 32K
       C8 3B 7B 0B 00 80 D3 B7 F0 08 CC D6 3C 59 DC 39>)
(   3,<2005-10-20 12:32:39.32 +100>,<MAYBRIDGE\NMR>,<NMR_250MHZ>,
      <apk 
       data hash MD5: 32K
       2C 6F 11 DC 30 E1 4D 48 2C 77 9A 51 1F 4F 88 BB>)
(   4,<2005-10-20 12:32:40.13 +100>,<MAYBRIDGE\NMR>,<NMR_250MHZ>,
      <abs ABSG = 5 
       data hash MD5: 32K
       FC BB F6 B2 0E C6 86 C5 0D 46 8B 3F 5E 32 42 90>)
$$ ##END=
$$ 
$$ hash MD5
$$ 93 A3 D5 BA 74 98 8D E9 AD 5A 07 73 EA 44 DA EE
##$RELAX= 
##$RELAX= 
##$RELAX= 
##$RELAX= 
##$RELAX= 
##$RELAX= 
##$RELAX= 
$$ Bruker specific parameters
$$ --------------------------
##$DU= <C:\u>
##$EXPNO= 11070
##$NAME= <ADRS>
##$PROCNO= 1
##$TYPE= <nmr>
##$USER= <dgb>
##$AMP= (0..31)
100 100 100 100 100 100 100 100 100 100 100 100 100 100 100 100 100 100 
100 100 100 100 100 100 100 100 100 100 100 100 100 100 
##$AQSEQ= 0
##$AQ_mod= 3
##$AUNM= <au_zg>
##$AUTOPOS= <28 >
##$BF1= 250.13
##$BF2= 250.13
##$BF3= 250.13
##$BF4= 250.13
##$BF5= 500.13
##$BF6= 500.13
##$BF7= 500.13
##$BF8= 500.13
##$BYTORDA= 1
##$CFDGTYP= 0
##$CFRGTYP= 5
##$CHEMSTR= <none>
##$CNST= (0..31)
1 1 145 1 1 1 1 1 1 1 1 1 1 1 1 1 1 1 1 1 1 1 1 1 1 1 1 1 1 1 1 1 
##$CPDPRG= <>
##$CPDPRG1= <>
##$CPDPRG2= <>
##$CPDPRG3= <>
##$CPDPRG4= <mlev>
##$CPDPRG5= <mlev>
##$CPDPRG6= <mlev>
##$CPDPRG7= <mlev>
##$CPDPRG8= <mlev>
##$CPDPRGB= <>
##$CPDPRGT= <>
##$D= (0..31)
0 1 0 0 0 0 0 0 0 0.06 0 0 0 0 0 0 0.0002 0 0 0 0 0 0 0 0 0 0 0 0 0 0 
0 
##$DATE= 1129807945
##$DBL= (0..7)
120 120 120 120 120 120 120 120 
##$DBP= (0..7)
150 150 150 150 150 150 150 150 
##$DBP07= 0
##$DBPNAM0= <>
##$DBPNAM1= <>
##$DBPNAM2= <>
$$ [...]
##$SUBNAM7= <"">
##$SUBNAM8= <"">
##$SUBNAM9= <"">
##$SW= 20.6930455092707
##$SWIBOX= (0..15)
0 0 3 0 0 0 0 0 0 0 0 0 0 0 0 0 
##$SW_h= 5175.983436853
##$TD= 65536
##$TD0= 1
##$TE= 295.16
##$TE2= 300
##$TE3= 300
##$TEG= 300
##$TL= (0..7)
0 120 120 120 120 120 120 120 
##$TP= (0..7)
150 150 150 150 150 150 150 150 
##$TP07= 0
##$TPNAME0= <>
##$TPNAME1= <>
##$TPNAME2= <>
##$TPNAME3= <>
##$TPNAME4= <>
##$TPNAME5= <>
##$TPNAME6= <>
##$TPNAME7= <>
##$TPOAL= (0..7)
0.5 0.5 0.5 0.5 0.5 0.5 0.5 0.5 
##$TPOFFS= (0..7)
0 0 0 0 0 0 0 0 
##$TUNHIN= 0
##$TUNHOUT= 0
##$TUNXOUT= 0
##$USERA1= <user>
##$USERA2= <user>
##$USERA3= <user>
##$USERA4= <user>
##$USERA5= <user>
##$V9= 5
##$VALIST= <valist>
##$VCLIST= <CCCCCCCCCCCCCCC>
##$VD= 0
##$VDLIST= <DDDDDDDDDDDDDDD>
##$VPLIST= <PPPPPPPPPPPPPPP>
##$VTLIST= <TTTTTTTTTTTTTTT>
##$WBST= 1024
##$WBSW= 4
##$XGAIN= (0..3)
0 0 0 0 
##$XL= 0
##$YL= 0
##$YMAX_a= 538158
##$YMIN_a= -486011
##$ZGOPTNS= <>
##$ZL1= 120
##$ZL2= 120
##$ZL3= 120
##$ZL4= 120
##$ABSF1= 16.522
##$ABSF2= -4.171173
##$ABSG= 5
##$ABSL= 3
##$ALPHA= 0
##$AQORDER= 0
##$ASSFAC= 0
##$ASSFACI= 0
##$ASSFACX= 0
##$ASSWID= 0
##$AUNMP= <proc_1d>
##$AZFE= 0.1
##$AZFW= 0.1
##$BCFW= 0
##$BC_mod= 0
##$BYTORDP= 0
##$COROFFS= 0
##$CY= 12.5
##$DATMOD= 1
##$DC= 0
##$DFILT= <>
##$DTYPP= 0
##$F1P= 14.0000005364418
##$F2P= -0.99999901652339
##$FCOR= 0.5
##$FTSIZE= 32768
##$FT_mod= 6
##$GAMMA= 0
##$GB= 0
##$INTBC= 1
##$INTSCL= 1
##$ISEN= 128
##$LB= 0.3
##$LEV0= 0
##$LPBIN= 0
##$MAXI= 10000
##$MC2= 0
##$MEAN= 0
##$ME_mod= 0
##$MI= 0
##$NCOEF= 0
##$NC_proc= -3
##$NLEV= 6
##$NOISF1= 0
##$NOISF2= 0
##$NSP= 0
##$NTH_PI= 0
##$NZP= 0
##$OFFSET= 16.522
##$PC= 1
##$PHC0= -66.63101
##$PHC1= 2.866036
##$PH_mod= 1
##$PKNL= yes
##$PPARMOD= 0
##$PSCAL= 4
##$PSIGN= 0
##$REVERSE= no
##$SF= 250.13
##$SI= 32768
##$SIGF1= 0
##$SIGF2= 0
##$SINO= 400
##$SIOLD= 32768
##$SREGLST= <1H.CDCl3>
##$SSB= 0
##$STSI= 32768
##$STSR= 0
##$SW_p= 5175.98343685301
##$SYMM= 0
##$S_DEV= 0
##$TDeff= 65536
##$TDoff= 0
##$TI= <Analysis number 999999
Compound Code 99
Book Reference 9
Project Code 9>
##$TILT= no
##$TM1= 0
##$TM2= 0
##$TOPLEV= 0
##$USERP1= <user>
##$USERP2= <user>
##$USERP3= <user>
##$USERP4= <user>
##$USERP5= <user>
##$WDW= 1
##$XDIM= 32768
##$YMAX_p= 497741650
##$YMIN_p= -209486
$$ End of Bruker specific parameters
$$ ---------------------------------
##NTUPLES= NMR SPECTRUM
##VAR_NAME=  FREQUENCY,     SPECTRUM/REAL,   SPECTRUM/IMAG
##SYMBOL=    X,             R,               I
##VAR_TYPE=  INDEPENDENT,   DEPENDENT,       DEPENDENT
##VAR_FORM=  AFFN,          ASDF,            ASDF
##VAR_DIM=   32768,         32768,           32768
##UNITS=     HZ,            ARBITRARY UNITS, ARBITRARY UNITS
##FACTOR=    0.157963299565203, 1,           1
##FIRST=     4132.6476996994, 0,             0
##LAST=      -1043.33573715361, 0,           0
##MIN=       -1043.33573715361, -209486,     0
##MAX=       4132.6476996994, 497741650,     0
$$ Real data points
##PAGE= N=1
##DATA TABLE= (X++(R..R)), XYDATA
$$ [...]
24039c8573r074J5235K8966J1526Q343Q300q526j5957k5663J1105Q640j1235L686
$$ -38573 -47647 -32412 -3446 8080 16423 24723 16197 240 -25423 -14318 -5678 -16913 -13227
24026a3227j2884K698J4505K3017J7441k9059j6258J3671j538q851r62J1718k006
$$ -13227 -26111 -23413 -8908 14109 31550 2491 -13767 -96 -1634 -10485 -11447 271 -1735
24013a735N673J789M78j50j1115N843k562k7805k8872K4965L2342J2499K142P99
$$ -1735 3938 5727 6205 6055 -5060 783 -1779 -29584 -58456 -33491 -1149 11350 13492 14291
23999A4291J0065q574J8258j7859j430J8633O899j9688k6134O068J7749K0997
$$ 14291 24356 15782 34040 16181 14751 33384 40283 20595 -5539 529 18278 39275
23987C9275j781L616k2451j6205o378N944j656L352j668O801j0883k3252M790
$$ 39275 37494 41110 18659 2454 -3924 2020 364 3716 2048 8849 -2034 -25286 -20496
23974b0496k420q294J2935o480J5239K380j4410j3981o985L3414L751k2978P214
$$ -20496 -22916 -31210 -18275 -24755 -9516 -7136 -21546 -35527 -42512 -9098 -5347 -28325 -21111
23961b1111J2976J4476L051M513m304j4095q543J2781j6434J553O71K10L497m785
$$ -21111 -8135 6341 9392 13905 9601 -4494 -13037 -256 -16690 -15137 -14466 -14256 -10759 -15544
23947a5544N790N487p402Q022j191r196j3616J2167K1713M94j4653K93J0745J3808
$$ -15544 -9754 -4267 -11669 -3647 -4838 -14034 -27650 -15483 6230 6724 -7929 -7636 3109 16917
23933A6917j0719K614J0558n483j0834J198o698j4833j5312Q848L7306J7487P997
$$ 16917 6198 8812 19370 13887 3053 4251 -2447 -17280 -32592 -23744 13562 31049 39046
23920C9046n980J561J7335l7324j7212N392Q444q17l145L862r327q685j6038m419
$$ 39046 33066 34627 51962 14638 -2574 2818 11262 10445 7300 11162 1835 -6850 -22888 -27307
23906b7307q484K9610J1763k504L913k870m953j5731M948K1173J1432P82J9419
$$ -27307 -35791 -6181 5582 3078 6991 4121 -832 -16563 -11615 9558 20990 21772 41191
23893D1191P055j2942r885o327j6850j7201L214M071q243j3185R279K8987K4906
$$ 41191 48246 35304 25419 19092 2242 -14959 -11745 -7674 -15917 -29102 -19823 9164 34070
23880C4070J5538L589j5933j1598r406k0155J407K5904J1179o999j082j9961j2647
$$ 34070 49608 53197 37264 25666 16260 -3895 -2488 23416 34595 27596 26514 6553 -6094
23867f094L216P150j4815m1248K743M0173J2013j8934J092j1624M052m964j1154
$$ -6094 -2878 4272 -10543 -51791 -49048 -8875 3138 -15796 -14704 -26328 -22276 -27240 -38394
23854c8394J7142K2462M914K3458m12j4815k0763n582J0069q86o080m304Q105
$$ -38394 -21252 1210 6124 29582 29170 14355 -6408 -11990 -1921 -2807 -8887 -13191 -5086
23841e086j889r711M928J5445K838q232q294j5364Q540K0248J0484l733m221j0565
$$ -5086 -6975 -16686 -11758 3687 6525 -1707 -10001 -25365 -16825 3423 13907 10174 5953 -4612
23827d612j3367M657K4094J353J708q060p41N88k4035l7811o789L4874O019J994
$$ -4612 -17979 -13322 10772 12125 13833 5773 5032 5620 -18415 -56226 -63015 -28141 -22122 -20128
23813b0128K5566m996m070M091j3727J923l42r577M534P222L158J9982P380l991
$$ -20128 5438 442 -3628 463 -13264 -11341 -11683 -21260 -16726 -9504 -6346 13636 21016 17025
23799A7025q777o688N203m978m285M308K026K4625J4858k0361k3649j89O723k2100
$$ 17025 8248 1560 6763 1785 -2500 1808 3834 28459 43317 22956 -693 -882 5841 -16259
23785a6259j7061J4715J1070k7824J3401K3542J040J4558J6969j0932r858r143
$$ -16259 -33320 -18605 -7535 -35359 -21958 1584 2624 17182 34151 23219 13361 4218
23773D218j5904q275j726N908M453J437K3839J638k8352j158N874j8801J7030
$$ 4218 -11686 -19961 -21687 -15779 -11326 -9889 13950 15588 -12764 -13922 -8048 -26849 -9819
23760i819J5961l862K0829r103k3155J6434M657K145r472p296J9365J8050J1153
$$ -9819 6142 2280 23109 14006 -9149 7285 11942 14087 4615 -2681 16684 34734 45887
23747D5887j1254O990K290N696m445M854j8654l0437j3003R189N284m365J8415
$$ 45887 34633 41623 43913 49609 45164 50018 31364 927 -12076 -2887 2397 -1968 16447
23734A6447J3811l571j9108k363K0986Q533k0446J4263M318L110j6394m043M72
$$ 16447 30258 26687 7579 5216 26202 34735 14289 28552 32870 35980 19586 15543 16015
23721A6015R659J7556p560o325p758j5405N007q551r578O718J0192O983K965k0287
$$ 16015 25674 43230 35670 29345 21587 6182 11189 2638 -6940 -222 9970 16953 19918 -369
23707c69l5330j2983K474Q835P765Q284O666J3401k624k5069M274L3053J2282
$$ -369 -35699 -48682 -46208 -37373 -29608 -21324 -14658 -1257 -3881 -28950 -24676 8377 20659
23694B0659k4295m747K0714j8013J3828N315j5646M177K4907n763m584k7501J5005
$$ 20659 -3636 -8383 12331 -5682 8146 13461 -2185 1992 26899 21136 16552 -10949 4056
23681D056j0158j2124k0543L2006K3136K050q128l01J7416Q619j0814n271o19
$$ 4056 -6102 -18226 -38769 -6763 16373 18423 10295 9994 27410 36029 25215 19944 19325
23668A9325k477j3928J124q246j5007j5997J7994J0563K283j3446j0980J7242
$$ 19325 16848 2920 4044 -4202 -19209 -35206 -17212 -6649 -4366 -17812 -28792 -11550
23656a1550M2217O411j0281J8900r69n869p312j5753k0106o918M033j0743M925
$$ -11550 30667 37078 26797 45697 44728 38859 31547 15794 -4312 -11230 -7197 -17940 -13015
23643a3015k316j0172J5856K5090n466J46J0712q312k4516j314O425j6402j8317
$$ -13015 -15331 -25503 -9647 15443 9977 10123 20835 12523 -11993 -13307 -6882 -23284 -41601
23630d1601q274r371P718J6257J8614J713k074N556P456k3360l91k978j1591P304
$$ -41601 -49875 -59246 -51528 -35271 -16657 -14944 -17018 -11462 -4006 -27366 -27757 -30735 -42326 -35022
23616c5022K7097J5108Q212K2415k5717j6843P269k5515j5125L800j2439O997
$$ -35022 -7925 7183 15395 37810 12093 -4750 2519 -22996 -38121 -34321 -46760 -39763
23604c9763O687l892p914J2533o169J4729J0572l859k809J4333K5713L615j8519
$$ -39763 -33076 -36968 -44882 -32349 -38518 -23789 -13217 -17076 -19885 -5552 20161 23776 5257
23591E257n335k8472q461J9537P678j1484N740J3188K7217K7225P738m3l1257
$$ 5257 -78 -28550 -37011 -17474 -9796 -21280 -15540 -2352 24865 52090 59828 59785 28528
23578B8528m8487k629K1783l236P095o199k2533j253j2069k504N170J4371j0646
$$ 28528 -19959 -22588 -805 -4041 3054 -3145 -25678 -26931 -39000 -41504 -36334 -21963 -32609
23565c2609K347J2970J264J4274J2272j4302j1758p820k7997J9113J6716N860
$$ -32609 -30262 -17292 -16028 -1754 10518 -3784 -15542 -23362 -51359 -32246 -15530 -9670
23553i670K8796J9126k2193k4801j3513J158r914K2619L588j3711n643K6457J5449
$$ -9670 19126 38252 16059 -8742 -22255 -21097 -31011 -8392 -4804 -18515 -24158 2299 17748
23540A7748j2193l635J0903J0971l699j4241j7251r599k4791k1136J7545M860
$$ 17748 5555 1920 12823 23794 20095 5854 -11397 -20996 -45787 -66923 -49378 -44518
23528d4518n746K3982J5983k600J2987L7018k4585K172q468j1361r282R828J424
$$ -44518 -50264 -26282 -10299 -12899 88 37106 12521 14693 6225 -5136 -14418 -4590 -3166
23515c166j1682k2947K007K7241K0651l759J522J374J5179k8252N384K4282j1296
$$ -3166 -14848 -37795 -35788 -8547 12104 8345 9867 11241 26420 -1832 3552 27834 16538
23502A6538j0138r404L098K415M557q689P505l578k4880m235p565K6199K0670
$$ 16538 6400 -3004 94 2509 7066 -1623 5882 2304 -22576 -26811 -34376 -8177 12493
23489A2493L682J364j338j3299j5538Q994p677K936K8725J0383j6194k7983j5964
$$ 12493 16175 17539 16201 2902 -12636 -3642 -11319 -8383 20342 30725 14531 -13452 -29416
23476b9416m969M694N946Q044l789L561J359M654j5530L036Q511R41j4069j475
$$ -29416 -34385 -29691 -23745 -15701 -19490 -15929 -14570 -9916 -25446 -22410 -13899 -12958 -27027 -28502
23462b8502K3408L9695M602j7566k5146j0319q718J5509J6699R015k264J2575
$$ -28502 -5094 34601 39203 21637 -3509 -13828 -22546 -7037 9662 18677 16413 28988
23450B8988m952l466j4392r969r315P397nj0694j3727p572J556K2593J2820j1373
$$ 28988 24036 20570 6178 -3791 -13106 -5709 -5714 -16408 -30135 -37707 -36151 -13558 -738 -12111
23436a2111l3711O055R204K264j028J2605K7375K1435j8019j7048R054N552N209
$$ -12111 -45822 -39767 -30563 -28299 -29327 -16722 10653 32088 14069 -2979 6075 11627 16836
23423A6836k6035r334j88K5005j1316r404J8797m018j3377J1215J5436J0884j2826
$$ 16836 -9199 -18533 -18721 6284 -5032 -14436 4361 343 -13034 -1819 13617 24501 11675
23410A1675Q880n475j1939o805j0349O150K0171r985l377j230J835j142Q151j3181
$$ 11675 20555 15080 3141 -3664 -14013 -7863 12308 2323 -1054 -2284 -449 -1591 6560 -6621
23396f621l3838J1052L1529M358N745J4060k719P28J8860l2530k8012j069K8368
$$ -6621 -40459 -29407 2122 6480 12225 26285 23566 24294 43154 10624 -17388 -18457 9911
23383I911n164k4003j8770k3186J8586K1260J0898k994j3236L4111J7539k0674
$$ 9911 4747 -19256 -38026 -61212 -42626 -21366 -10468 -13462 -26698 7413 24952 4278
23371D278N744k74j383k2832J2664J5936k9594j0N706j4847j3306J5246k0872
$$ 4278 10022 9748 8365 -14467 -1803 14133 -15461 -15471 -9765 -24612 -37918 -22672 -43544
23358d3544K0271K3077j0084J4265K211p812L227j983Q463J3339l96q188j7937
$$ -43544 -23273 -196 -10280 3985 6196 -1616 1611 -372 8091 21430 21034 12846 -5091
23345e091j5912l586J906J3204q795q3R384O933p280j1747j2328K1015J4498P669
$$ -5091 -21003 -24589 -22683 -9479 -18274 -18357 -8973 -2040 -9320 -21067 -33395 -12380 2118 9787
23331I787Q656J7097K0918j3973j9546m1085L855J3710M934k0405O603o129n101
$$ 9787 18443 35540 56458 42485 22939 -18146 -14291 -581 4353 -16052 -9449 -15578 -20679
23318b0679J1816Q588p709J4148J9134q43j0037M060Q346K701p053K216j6733
$$ -20679 -8863 -275 -7984 6164 25298 24455 14418 18478 26824 29525 22472 24688 7955
23305G955m901o497K4062K1692L964j0240j5452k0863l1024l931J2372P253J705
$$ 7955 3054 -3443 20619 42311 46275 36035 20583 -280 -31304 -35235 -22863 -15610 -13905
23292a3905K2604L0191p024P581L64j8259l978J6679J1959N88j4439K172j3056
$$ -13905 8699 38890 31866 39447 39811 21552 17574 34253 46212 46800 32361 34533 21477
23279B1477l0315j2874J959k348j3305Q425J1982n499j1378N782R765J2533k303
$$ 21477 -8838 -21712 -19753 -22101 -35406 -26981 -14999 -20498 -31876 -26094 -16329 -3796 -6099
23266f099r61O676K2672j1603k3789J887K2024L800J527j3556k598K2441M188
$$ -6099 -7060 -384 22288 10685 -13104 -11217 10807 14607 16134 2578 -20 22421 26609
23253B6609j7722L402j979J2953L945J0156k9975l0823K4370K8192j043N707j8288
$$ 26609 8887 12289 10310 23263 27208 37364 7389 -23434 936 29128 28085 33792 15504
23240A5504j1557n982j0701N088M385J178R61J2183p013J5348J7664r450j5306
$$ 15504 3947 -2035 -12736 -7648 -3263 -2085 -1124 11059 4046 19394 37058 27608 12302
23227A2302P760j3410j7608k4359j467o079o176O305J1589J3381k099R334J0648
$$ 12302 20062 6652 -10956 -35315 -36782 -42861 -49037 -42732 -31143 -17762 -19861 -10527 121
23214A21j5424q721J4276J4696l987k7228q835K1087P224j5010R244J7080J9213
$$ 121 -15303 -24024 -9748 4948 961 -26267 -35102 -14015 -6791 -21801 -12557 4523 23736
23201B3736j9611k1886j1876r016j0249K2131J8463k945K5M665n975J7379j5327
$$ 23736 4125 -17761 -29637 -38653 -48902 -26771 -8308 -11253 -11228 -6563 -12538 4841 -10486
23188a0486q956m170J3986J5501J3046j0431l1383m369J1998P678j8665m607J076
$$ -10486 -19442 -23612 -9626 5875 18921 8490 -22893 -27262 -15264 -7586 -26251 -30858 -29782
23175b9782L1254J1612j6861j8631l33J0889R190J2329J3541r325k1435N765L5322
$$ -29782 1472 13084 -3777 -22408 -22741 -11852 -2662 9667 23208 13883 -7552 -1787 33535
23162C3535J2034o876j7420k0201n110l732J113l517q322J4947r815J3410P155
$$ 33535 45569 38693 21273 1072 -4038 -7770 -6657 -10174 -18496 -3549 -13364 46 7201
23149G201J464o88p010p013n864q682p272j5782M761O916J9484q627N921J4176
$$ 7201 8665 7977 967 -6046 -11910 -20592 -27864 -43646 -38885 -31969 -12485 -21112 -15191 -1015
23135a015o941j2498j977j233k800p583L068k096p437K4141R218q193k4552J08
$$ -1015 -7956 -20454 -22431 -23664 -26464 -34047 -30979 -33075 -40512 -16371 -7153 -15346 -39898 -39790
23121c9790K6775J062J4112J5736o524k1716k308o761J9110n697l2693j8424J2518
$$ -39790 -13015 -11953 2159 17895 11371 -10345 -12653 -19414 -304 -6001 -38694 -57118 -44600
23108d4600L2941Q838l0119j3859P810M173l116j7572o987J1228J1629O834L0286
$$ -44600 -11659 -2821 -32940 -46799 -38989 -34816 -37932 -55504 -62491 -51263 -39634 -32800 -2514
23095b514P031P490k1848j8928J6730j1128K32P153j7972j3478O857J538J624
$$ -2514 4517 12007 -9841 -28769 -12039 -23167 -22935 -15782 -33754 -47232 -40375 -38837 -37213
23082c7213L0335K4235L905R63m836O58l111p018J0825j5289j179K0217N770P528
$$ -37213 -6878 17357 21262 22225 17389 18047 14936 7918 18743 3454 2275 22492 28262 35790
23068C5790J2611j1422l584k0459P663o066j3141r287r420J0855o217n575J956
$$ 35790 48401 36979 33395 12936 20599 14533 1392 -7895 -17315 -6460 -12677 -18252 -16296
23055a6296o492J6627J1551l0053r703K460J164K7898J4299m450J2378J7699K5120
$$ -16296 -22788 -6161 5390 -24663 -34366 -31906 -30742 -2844 11455 7005 19383 37082 62202
23042F2202M76k6455k4585N354O952l432L21j0289k1791r166m66R927J1520k497
$$ 62202 62678 36223 11638 16992 23944 20512 20833 10544 -11247 -20413 -20879 -10952 568 -1929
23028a929K636k3917j4650P876J6273K7037Q122m801N705j6511p328M377P720
$$ -1929 707 -23210 -37860 -29984 -13711 13326 21448 16647 22352 5841 -1487 2890 10610
23015A0610K739k4016J963K2462N444k322J3614j2002r670m034N221l719m724
$$ 10610 13349 -10667 -8704 13758 19202 16880 30494 18492 8822 4788 10009 6290 1566
23002A566o246K2277J8465l511P879m286k2458l1525K336j8422j4790K754J9175
$$ 1566 -4680 17597 36062 32551 40430 36144 13686 -17839 -15503 -33925 -48715 -45961 -26786
22989b6786M982j4054J5886N384n061l446M448J300J0894j4443j4600J2177O974
$$ -26786 -21804 -35858 -19972 -14588 -19649 -23095 -18647 -17347 -6453 -20896 -35496 -23319 -16345
22976a6345M867J4034J3036M022q27n981K733j4653j9844J1617j1581M99l879
$$ -16345 -11478 2556 15592 19614 18787 12806 15539 886 -18958 -7341 -18922 -18423 -22302
22963b2302Q692K5105R723n641k0270m845j9285m717O921J289J2115J8917L4947
$$ -22302 -13610 11495 21218 15577 -4693 -9538 -28823 -33540 -26619 -25330 -13215 5702 40649
22950D0649j922l8125l862O412Q213q283r958m033J1102L589m903J893o697k7133
$$ 40649 38727 602 -3260 3152 11365 3082 -6876 -10909 193 3782 -1121 772 -5925 -33058
22936c3058o833Q595M2342J2902k2577k271J3853r466N407j975r32P714O488m740
$$ -33058 -39891 -31296 11046 23948 1371 -900 12953 3487 8894 6919 5987 13701 20189 15449
22922A5449n519O319k459O799j2681p332J0297Q556j6268N46R83r052k9220N864
$$ 15449 9930 16249 13790 20589 7908 576 10873 19429 3161 3707 4690 -4362 -33582 -27718
22908b7718K5331N822j0443k255N641P649j2262k3428r270R803K9369L7428J86
$$ -27718 -2387 3435 -7008 -9263 -3622 4027 -8235 -31663 -40933 -31130 -1761 35667 35853
22895C5853k2010j9413k3133J5545L144J2588J0058l086J0570K364q08N098l888
$$ 35853 13843 -5570 -28703 -13158 -10014 2574 12632 9546 20116 22480 21672 26770 22882
22882B2882k2055k6740J245J2655J0206Q108R693O017j3771M358n039k2564J0691
$$ 22882 827 -25913 -24668 -12013 -1807 6301 15994 22011 8240 12598 7559 -15005 -4314
22869d314J4975l283J2138N002K033m1374m5171J948K7104K8372q64J308J6767
$$ -4314 10661 7378 19516 24518 26551 -14823 -59994 -58046 -30942 -2570 -3434 -2126 14641
22856A4641p787m287R185j3204k8408J4256K4226k118O262j2674k2986j2834k1075
$$ 14641 6854 2567 11752 -1452 -29860 -15604 8622 6504 12766 92 -22894 -35728 -56803
22843e6803J7894l3n671L30q327r871K9358R075j1613J349k3188K746O012j76
$$ -56803 -38909 -38942 -44613 -44283 -52610 -62481 -33123 -24048 -35661 -34312 -57500 -54754 -48742 -48918
22829d8918Q779J1815J3901M543Q913L283m96j0736L680q755l161m674L230m492
$$ -48918 -40139 -28324 -14423 -9880 -967 2316 1820 -8916 -5236 -13991 -17152 -21826 -18596 -23088
22815b3088k9188N421R154J886K3933K0430o619j0114R423k4656K1577R373M799
$$ -23088 -52276 -46855 -37701 -35815 -11882 8548 1929 -8185 1238 -23418 -1841 7532 12331
22802A2331O516n376M451j5292k333J6636j4790R794O260j1090J2741k479j952
$$ 12331 18847 13471 17922 2630 297 16933 2143 11937 18197 7107 19848 17369 15417
22789A5417j6460k9954k773P221J4558N401R298J1697Q231k8932r058n301m152
$$ 15417 -1043 -30997 -33770 -26549 -11991 -6590 2708 14405 22636 -6296 -15354 -20655 -24807
22776b4807K2650J5880p721j0665Q394m156Q401l297J5619k8613j7460M743k432
$$ -24807 -2157 13723 6002 -4663 3731 -425 7976 4679 20298 -8315 -25775 -21032 -23464
22763b3464K491k3673o943J6420J9484J5202k514j3356r996R654J3875Q07J6403
$$ -23464 -20973 -44646 -51589 -35169 -15685 -483 -2997 -16353 -26349 -16695 -2820 -2013 14390
22750A4390J1137j490n933j1847K714k9904J0114J6193k2611j2918J3744L4674
$$ 14390 25527 24037 18104 6257 8971 -20933 -10819 5374 -17237 -30155 -16411 18263
22738A8263J4507q779J860L62l361L724p872j0394j5991k845l123j2109M546r077
$$ 18263 32770 23991 25851 26213 22852 26576 18704 8310 -7681 -10526 -13649 -25758 -21212 -30289
22724c0289N507l910J7849J7990J5232N031j5586k2967j0013k529J461k991J9282
$$ -30289 -24782 -28692 -10843 7147 22379 27410 11824 -11143 -21156 -23685 -22224 -25215 -5933
22711e933K4148j045j9045o959J3596P415J753K8630J7343k2937k2513l2320j6655
$$ -5933 18215 17170 -1875 -8834 4762 12177 13930 42560 59903 36966 14453 -17867 -34522
22698c4522J8131L1191J5604K601m194J816o951j746L733j759R395k4882O524
$$ -34522 -16391 14800 30404 33005 28811 30627 23676 21930 25663 23904 33299 8417 14941
22685A4941Q923k023k4588j2079J5886J6290j1289J0186Q238j942k1702k0635
$$ 14941 23864 21841 -2747 -14826 1060 17350 6061 16247 24485 22543 841 -19794
22673a9794M299P307J4247m0401k8041Q501k583P189J2287P379K590P505J6376
$$ -19794 -15495 -8188 6059 -34342 -62383 -53882 -56465 -49276 -36989 -29610 -27020 -19515 -3139
22660c139q714r61J1761j0831j3432K0453J4976k65k5812j6565K645J8656J6394
$$ -3139 -11853 -12814 -1053 -11884 -25316 -4863 10113 9848 -15964 -32529 -29884 -11228 5166
22647E166M976j1166J5836O646j8566j9057j7068k937j934J1521R185J023k061
$$ 5166 10142 -1024 14812 21458 2892 -16165 -33233 -36170 -38104 -26583 -17398 -16375 -18436
22634a8436j5337J1941K1201n029k0639L0829M1724r004j6996k9456J0369k545
$$ -18436 -33773 -21832 -631 -5660 -26299 4530 46254 37250 20254 -9202 1167 -1378
22622a378j9170j2277N289j3655k680R961k19K0159J0435J1104L4R11J396M175
$$ -1378 -20548 -32825 -27536 -41191 -43871 -33910 -34129 -13970 -3535 7569 7603 8514 9910 14085
22608A4085l1171j1991Q072K1975P192q444k4783K6097J3806l227k159j7795k7435
$$ 14085 -17086 -29077 -21005 970 8162 -282 -25065 1032 14838 11611 9452 -8343 -35778
22595c5778l4844j3435J1559J7393J1274O34j4192J0977J5310l5090k10J5443
$$ -35778 -70622 -84057 -72498 -55105 -43831 -43197 -57389 -46412 -31102 -66192 -66402 -50959
22583e0959M386k1833P010K3948J7272J2021j0973N399j382O988k591j6895q45
$$ -50959 -46573 -68406 -61396 -37448 -20176 -8155 -19128 -13729 -15111 -8123 -10714 -27609 -28454
22570b8454N491J4277R396j4074J424j1593m641K8226J0633N112j112P351P246
$$ -28454 -22963 -8686 710 -13364 -11940 -23533 -28174 52 10685 15797 14685 22036 29282
22557B9282j9828j2750j1115o774K2116n791j7165j6556r333K595K8933J8734
$$ 29282 9454 -3296 -14411 -21185 931 -4860 -22025 -38581 -47914 -45319 -16386 2348
22545B348j1692J8554O715o804r101j0461J0339J5709K0645O519r821m53n432
$$ 2348 -9344 9210 15925 9121 20 -10441 -102 15607 36252 42771 32950 32497 27065
22532B7065j2101j6873j4175L986L497n580L2721J6792j2922m343j1951k3899
$$ 27065 14964 -1909 -16084 -12098 -8601 -14181 18540 35332 22410 18067 6116 -17783
22520a7783J66J4757n69j4807j6174O67Q224M769K4194J714J1482J5424j5282
$$ -17783 -17617 -2860 -3429 -18236 -34410 -33743 -25519 -20750 3444 5158 16640 32064 16782
22507A6782r330o808j5277L1927j118j4629L055j0111r992k842M878O929j5128
$$ 16782 7452 644 -14633 17294 16176 1547 4602 -5509 -15501 -18343 -13465 -6536 -21664
22494b1664j997J5506R824j3302j5189P086R353j0051K303J9305J1603j2220Q009
$$ -21664 -23661 -8155 1669 -11633 -26822 -19736 -10383 -20434 -18131 1174 12777 557 8566
22481H566n223P55r415k3271k6343J3766J7506k007l113j2181j1985J0654Q263
$$ 8566 3343 4098 -5317 -28588 -54931 -41165 -23659 -25666 -28779 -40960 -52945 -42291 -34028
22468c4028J9636P84L527Q925j498K771N6J6572k239o41R02M458j6318Q932L3235
$$ -34028 -14392 -13608 -10081 -1156 -2654 117 173 16745 14506 13865 14767 19225 2907 11839 45074
22453D5074J0928j5156k7870J5570o020k8067j5418R719J3854N30L641j5879O030
$$ 45074 56002 40846 12976 28546 22526 -5541 -20959 -11240 2614 3144 6785 -9094 -3064
22440c064K3654m520q244j2766j5826k5123k388J1729O46K397N127m129J653O298
$$ -3064 20590 16070 7826 -4940 -20766 -45889 -48277 -36548 -35902 -33505 -28378 -32507 -30854 -24556
22426b4556K6208L22j1747p648J2623n938k0904J3429L98l873O444L1966q858
$$ -24556 1652 1974 -9773 -17421 -4798 -10736 -31640 -18211 -17813 -21686 -15242 16724 7866
22413G866q918m417k0284q856K2137L5187M631k5053j6884K891K4380K657l24
$$ 7866 -1052 -5469 -25753 -34609 -12472 22715 27346 2293 -14591 -11700 12680 15337 15013
22400A5013k979n011N57J9865J1339l0586k9167j5720q228p491K1322J2851p382
$$ 15013 12034 7023 7580 27445 38784 8198 -20969 -36689 -44917 -52408 -31086 -18235 -25617
22387b5617j0696j5958J1188K6048K5287m023m246J2062j8635n061j4285j305
$$ -25617 -36313 -52271 -41083 -15035 10252 6229 1983 14045 -4590 -9651 -23936 -25241
22375b5241Q703P740K207q893o401j6373p084J3089q796j571P332L6311K9523
$$ -25241 -16538 -8798 -6591 -15484 -21885 -38258 -45342 -32253 -41049 -42620 -35288 1023 30546
22362C0546j2023q275n098P78j0462l254o740q762m472J2758o522n28k9007n118
$$ 30546 18523 10248 5150 5928 -4534 -7788 -14528 -23290 -27762 -15004 -21526 -22054 -51061 -56179
22348e6179L3642L4023j2573j0918p394J8150P94j61o665k2873J2163K6970j2960
$$ -56179 -22537 11486 -1087 -12005 -19399 -1249 -455 -616 -7281 -30154 -17991 8979 -3981
22335c981q200k9347k4081K6238K6196r645k2016O453L3004o679l675J7216M569
$$ -3981 -12181 -41528 -65609 -39371 -13175 -22820 -44836 -38383 -5379 -12058 -15733 1483 6052
22322F052j9401K089K6296R951j3766l066j1979m823m303j4315o0M536k0761k5946
$$ 6052 -13349 -11260 15036 24987 11221 8155 -3824 -8647 -12950 -27265 -27325 -22789 -43550 -69496
22308f9496R527j5125L2567J9941K2235k3328l280J2575J2486J0181M126n629
$$ -69496 -59969 -75094 -42527 -22586 -351 -23679 -26959 -14384 -1898 8283 12409 6780
22296F780n935j4386j5017j643K4637J7586N440q3O332k0451l1613M664K5534
$$ 6780 845 -13541 -28558 -30201 -5564 12022 17462 17379 23711 3260 -28353 -23689 1845
22283A845M719j5449k1565m905l428Q217K6813Q413k00l824k457J0128K666p013
$$ 1845 6564 -8885 -30450 -35355 -38783 -30566 -3753 4660 4460 636 -1821 8307 10973 3960
22269C960J5316r802k3846k1868k3190J2856J2461J1274r436k4249J2006n64J5581
$$ 3960 19276 9474 -14372 -36240 -59430 -46574 -34113 -22839 -32275 -56524 -44518 -45082 -29501
22256b9501J7299j3191j3822J8433l879R255J6838j3494Q283n67J365j6618j1068
$$ -29501 -12202 -25393 -39215 -20782 -24661 -15406 1432 -12062 -3779 -4346 -2981 -19599 -30667
22243c0667J9568J3094N371J144j0624j2175J2020k387k0851m502k3396l440K2503
$$ -30667 -11099 1995 7366 8510 -2114 -14289 -2269 -4656 -25507 -30009 -53405 -56845 -34342
22230c4342N242J2055M993j0538o726J2429K0307r683q072J2544K0107p288l2343
$$ -34342 -29100 -17045 -12052 -22590 -29316 -16887 3420 -6263 -14335 -1791 18316 11028 -21315
22217b1315k0258J4816N42K2934o156m0106J6148J9451j381j956p545J1560R834
$$ -21315 -41573 -26757 -26215 -3281 -9437 -49543 -33395 -13944 -15325 -17281 -24826 -13266 -3432
22204c432M064l958K9922p104k8410p278J0030M506N38j8073Q546l977O061p498
$$ -3432 632 -3326 26596 19492 -8918 -16196 -6166 -1660 -1122 -19195 -10649 -14626 -8565 -16063
22190a6063m28K1151O622j8469j1923kJ2894J006Q72J469K831j0561m353l410
$$ -16063 -16491 4660 11282 -7187 -19110 -19112 -6218 -5212 -4340 -2871 -40 -10601 -14954 -18364
22176a8364J0878J5244K976k350j1250N575j7017r02j0499j9181K8074J459J623
$$ -18364 -7486 7758 10734 8384 -2866 2709 -14308 -15210 -25709 -44890 -16816 -15357 -13734
22163a3734J4220o455r078K533J5405L520l3612j145L944q63l082J7500K1321
$$ -13734 486 -5969 -15047 -12514 2891 6411 -27201 -28346 -24402 -25265 -28347 -10847 10474
22150A0474k2906J7773K4307q260j3233J0392N134n44k559r920p040k0064k013
$$ 10474 -12432 5341 29648 21388 8155 18547 23681 23137 20578 10658 3618 -16446 -18459
22137a8459J8784K730j4053J6132k0754R765K4458L988k8346j2467J6779J3519
$$ -18459 325 3055 -10998 5134 -15620 -5855 18603 22591 -5755 -18222 -1443 12076
22125A2076q737O732j9621J1308J9619p150l35o53j9520j6562j4242O676K519
$$ 12076 3339 10071 -9550 1758 21377 14227 13892 13239 -6281 -22843 -37085 -30409 -27890
22112b7890l308J1204N776k6872O110J5061K7829N327J8472K254j0390k4844j5512
$$ -27890 -31198 -19994 -14218 -41090 -34980 -19919 7910 13237 31709 33963 23573 -1271 -16783
22099a6783J86j5668q352j2324J5460L2591J7184J9063O260m7441j7665J9854
$$ -16783 -16597 -32265 -40617 -52941 -37481 -4890 12294 31357 37617 -9824 -27489 -7635
22087g635L705J1862k7485j3137J4629J2600m494j0012k3115j0333M783L4162
$$ -7635 -3930 7932 -19553 -32690 -18061 -5461 -9955 -19967 -43082 -53415 -48632 -14470
22075a4470J2464N689P418N1j5495k150N124J352P166L535J2950j7462l925j4522
$$ -14470 -2006 3683 11101 11152 -4343 -6493 -1369 -17 7149 10684 23634 6172 2247 -12275
22061a2275r295J5817M514Q677K0376l994l7366q557J6579K4296m44k7733L521
$$ -12275 -21570 -5753 -1239 7438 27814 23820 -13546 -22103 -5524 18772 18328 -9405 -5884
22048e884O572j371r720P979J0113n193J7550j1474J8023m683k3705J74j4327
$$ -5884 688 -683 -10403 -2424 7689 2496 20046 8572 26595 21912 -1793 -1619 -15946
22035a5946m248r366N980K3389n348k749j1486K1277R267p026j7463N829l965
$$ -15946 -20194 -29560 -23580 -191 -5539 -8288 -19774 1503 10770 3744 -13719 -7890 -11855
22022a1855L253K7279n240M739P72k1526j88L592j214k53k195r95m373p349j4879
$$ -11855 -8602 18677 13437 18176 18948 -2578 -2766 826 -388 -641 -2836 -3831 -8204 -15553 -30432
22007c0432j0711J1843j208j272r698q289K9760P396j0679J1892P852o388K255
$$ -30432 -41143 -29300 -30508 -31780 -41478 -49767 -20007 -12611 -23290 -11398 -3546 -9934 -7679
21994g679J1094l875j8264k4604j8258R866M5772L0987J1868m251P441j6900k7013
$$ -7679 3415 -460 -18724 -43328 -61586 -51720 -5948 25039 36907 32656 40097 23197 -3816
21981c816p823K7650o903l892J4470K8219o354j1024j8298n861K1722j9967k0306
$$ -3816 -11639 16011 9108 5216 19686 47905 41551 30527 12229 6368 28090 8123 -12183
21968a2183j1169P812o797k4026m396J4563J1839j571q726Q603N271J5794J6122
$$ -12183 -23352 -15540 -22337 -46363 -50759 -36196 -24357 -25928 -34654 -26051 -20780 -4986 11136
21955A1136K0570p78j7646j1481k156M144jj9480J2992r017p955j9332K970J1216
$$ 11136 31706 30928 13282 1801 -355 3789 3788 -15692 -2700 -11717 -19672 -39004 -36034 -24818
21941b4818M61J2824l479N888j9362j6067p550L0304J0297j4152J2882J9087Q721
$$ -24818 -24357 -11533 -15012 -9124 -28486 -44553 -52103 -21799 -11502 -25654 -12772 6315 15036
21928A5036o927j7095M513q41J5114J2688J0512J9398k2069l1440j7453q513J1599
$$ 15036 8109 -8986 -4473 -5314 9800 22488 33000 52398 30329 -1111 -18564 -27077 -15478
21915a5478Q986O477M337j730k0678P859L235j5893Q982J4731J9778l979J139
$$ -15478 -6492 -15 4322 2592 -18086 -10227 -6992 -22885 -13903 828 20606 16627 17766
21902A7766o174J282M627j1882p93R637k4342j9524R013J4761K4693k917j5078
$$ 17766 11592 12874 17501 5619 4826 14463 -9879 -29403 -20390 -5629 19064 16147 1069
21889A069j4479k20K0047K2910M244j5840k8588r015K0533Q532J05K3509J1222
$$ 1069 -13410 -13630 6417 29327 33571 17731 -10857 -19872 661 9193 9298 32807 44029
21876D4029k5554k0455P124K7062m744j0962J0545N441j5223j3016k744o49O129
$$ 44029 18475 -1980 5144 32206 27462 16500 27045 32486 17263 4247 1503 854 6983
21863F983j0225j3841J2843J1017J488R177o131k6584n383n187J8345J3968L345
$$ 6983 -3242 -17083 -4240 6777 8265 17442 11311 -15273 -20656 -25843 -7498 6470 9815
21850I815R657q455k109l518n14Q020j1585j1062k7825N942P955M018j367P947
$$ 9815 19472 11017 8908 5390 4876 12896 1311 -9751 -37576 -31634 -23679 -19661 -21028 -13081
21836a3081J2747n237n558K89J798j6429j6114o715o08K952q065K9380L5164p659
$$ -13081 -334 -5571 -11129 -10840 -9042 -25471 -41585 -48300 -48908 -45956 -54021 -24641 10523 2864
21822B864o310j4945n243L3536J9703j4599j1632m317J0274j5561j663P28K771
$$ 2864 -3446 -18391 -23634 9902 29605 15006 3374 -943 9331 -6230 -7893 -7165 -4394
21809d394J9794J999j2770K1439K427n886q179j3461n633j6834P475J5728J4764
$$ -4394 15400 17399 4629 26068 28495 22609 14430 969 -4664 -21498 -14023 1705 16469
21796A6469P351p438k0323j8455o306N301j5605O991J0295K706k6528O341J2406
$$ 16469 23820 16382 -3941 -22396 -28702 -23401 -39006 -32015 -21720 -19014 -45542 -39201 -26795
21783b6795K5085K5679m888k9231j0961m982J0047R82NJ2484K4560J9394m58k3777
$$ -26795 -1710 23969 19081 -10150 -21111 -26093 -16046 -15064 -15059 -2575 21985 41379 40921 17144
21769A7144j6090l425r342k7961R442J6453K5323M861l915J1344l978LK2773j3301
$$ 17144 1054 -2371 -11713 -39674 -30232 -13779 11544 16405 12490 23834 19856 19859 42632 29331
21755B9331q176r976j3570j0558J2111J9029m345J4749K009j7812K2977n600k7424
$$ 29331 21155 11179 -2391 -12949 -838 18191 13846 28595 30604 12792 35769 30169 2745
21742B745j38J0502J6740l319j4577K791N179j8408k8652j7718J3615q865J235
$$ 2745 2607 13109 29849 26530 11953 14744 19923 1515 -27137 -44855 -31240 -40105 -38870
21729c8870N416j4546o818o961Q332L2940P269O515n052n890J6307P928R883q84
$$ -38870 -33454 -48000 -54818 -61779 -53447 -20507 -13238 -6723 -11775 -17665 -1358 6570 16453 15569
21715A5569j7549j4774r07j265l435J6833J1623k040K891j8194j9019L0527k588
$$ 15569 -1980 -16754 -17661 -18926 -22361 -5528 6095 4055 6946 -11248 -30267 260 -2328
21702b328j3950J6886o570l342K742J2449N301J158N524o72J5971j9694k8234
$$ -2328 -16278 608 -5962 -9304 -6562 5887 11188 12346 17870 17198 33169 13475 -14759
21689a4759K147J8493N978J1635q538j4025j4254J941J7333K991j2528j2132L75
$$ -14759 -12612 5881 11859 23494 14956 931 -13323 -11382 5951 8942 -3586 -15718 -15343
21676a5343J5514j9099k1492J2788J779K315L1598K2599R877n370k2456O893j2479
$$ -15343 171 -18928 -40420 -27632 -25853 -23538 8060 30659 40536 35166 12710 19603 7124
21663G124j3540l109J6723J2344l814k2124q896J8898M899m994K1640k0094l3292
$$ 7124 -6416 -9525 7198 19542 15728 -6396 -15292 3606 8505 3511 25151 5057 -28235
21650b8235k0909l881n294Q81N4483K7423j4987N132n757j3204j1006P296n75
$$ -28235 -49144 -53025 -58319 -57438 -2955 24468 9481 14613 8856 -4348 -15354 -8058 -8633
21637h633l424J699K5952J4011j8315J810J8480j0236j7724n930j594j0111q181
$$ -8633 -12057 -10358 15594 29605 11290 13100 31580 21344 3620 -2310 -3904 -14015 -22196
21624b2196J3393O610J3726N511j1251J1372J6947N778k9869k4992q583J3327
$$ -22196 -8803 -2193 11533 17044 5793 17165 34112 39890 10021 -14971 -23554 -10227
21612a0227l709J4507J464j2637j5006o530m609J4648j3637J5899K0525J6581
$$ -10227 -13936 571 2035 -10602 -25608 -32138 -36747 -22099 -35736 -19837 688 17269
21600A7269O611m426j0836Q652J2539Q339N30K917k3501j7476q670m006q897P172
$$ 17269 23880 19454 8618 17270 29809 38148 38678 41595 18094 618 -8052 -12058 -20955 -13783
21586a3783p013J7010J0122j1979l2678O03J6235L0696K6994j9648M523J4426
$$ -13783 -20796 -3786 6336 -5643 -38321 -37718 -21483 9213 36207 16559 21082 35508
21574C5508q646k5526j2673J9426j2033j0168J4598J417L194q480j5183J311J7404
$$ 35508 26862 1336 -11337 8089 -3944 -14112 486 1903 5097 -3383 -18566 -17255 149
21561A49j77J0824l2442k7575J261J9403J9399N524P734O88J972k6793j3474K4734
$$ 149 -28 10796 -21646 -49221 -47960 -28557 -9158 -3634 4100 4788 6760 -20033 -33507 -8773
21547h773r690q000J3901j2218J6722j5002N168M137k6796R94N957P373K9935
$$ -8773 -18463 -26463 -12562 -24780 -8058 -23060 -17892 -13755 -40551 -39557 -33600 -26227 3708
21534C708J4139k6155k5023J9056R894J202K897j1623k5160J6291K4059m194k4610
$$ 3708 17847 -8308 -33331 -14275 -4381 -3179 -282 -11905 -37065 -20774 3285 -909 -25519
21521b5519O472R777j4660J4040l404K152j113j6079m994P710J1702K0409l998
$$ -25519 -19047 -9270 -23930 -9890 -13294 -11142 -12255 -28334 -33328 -25618 -13916 6493 2495
21508B495k9823o012K740J7767M707k0645J4587J2112m017J5785O07j977j0750
$$ 2495 -27328 -33340 -30600 -12833 -8126 -28771 -14184 -2072 -6089 9696 10303 8326 -2424
21495b424k075j3583q358J0782K9190J747l640l103L944J3518j1537r414j9613
$$ -2424 -4499 -18082 -26440 -15658 13532 15279 11639 8536 12480 25998 14461 5047 -14566
21482a4566J4584K5402j7426j4014J1068J1418j1273l744j786J460j2461P30J9018
$$ -14566 18 25420 7994 -6020 5048 16466 5193 1449 -337 1123 -11338 -10608 8410
21469H410J5448j4906l531m331j7450m487J5480j5520J2151k82k3484k9192k779
$$ 8410 23858 8952 5421 1090 -16360 -20847 -5367 -20887 -8736 -9018 -32502 -61694 -64473
21456f4473J1490L1834j282J244k6992j805L2351j3668l3805M96J4417J2141P708
$$ -64473 -52983 -21149 -22431 -21187 -48179 -49984 -17633 -31301 -65106 -64610 -50193 -38052 -30344
21443c0344l155j3586K481K0078p584M805K4768J9166j6814n261q071M29J0189
$$ -30344 -33499 -47085 -44604 -24526 -32110 -27305 -2537 16629 -185 -5446 -13517 -13088 -2899
21430b899K3296l3463k6403R750K2097J8771M965q575q204P727Q700q024r615
$$ -2899 20397 -13066 -39469 -29719 -7622 11149 16114 7539 -665 7062 15762 7738 -1877
21417a877R396J467p737j2645K507O163j5472K029J6370J0823o673j4236Q257
$$ -1877 7519 8986 1249 -11396 -8889 -2726 -18198 -16169 201 11024 4351 -9885 -1628
21404a628k1304k0123L0672k196j7360l561J1462J4186J5432K4602M593l3664
$$ -1628 -22932 -43055 -12383 -14579 -31939 -35500 -24038 -9852 5580 30182 34775 1111
21392A111l8130L512r8k720O62l437o791J0112L8680K9642j1147m264Q479n653
$$ 1111 -37019 -33507 -33605 -36325 -35663 -39100 -45891 -35779 2901 32543 21396 17132 25611 19958
21378A9958R659j7286r601O365J7315J320j1047n677n395J0636p328o725o739
$$ 19958 29617 12331 2730 9095 26410 27730 16683 11006 5611 16247 8919 2194 -4545
21365d545k9763k4421J5399L1106K391J7632J4388M540N29j58q141q174k8811
$$ -4545 -34308 -58729 -43330 -12224 -9833 7799 22187 26727 27256 27098 18957 10783 -18028
21352a8028l297J29J816K5379P54n271k3703k1002N990m350j7601N959K4705P644
$$ -18028 -21325 -21196 -19380 5999 6753 1482 -22221 -43223 -37233 -41583 -59184 -53225 -28520 -20876
21338b0876K8755L178j0199J1369j0828j3276Q568j5326n109J6168j9927l788
$$ -20876 7879 11057 858 12227 1399 -11877 -3309 -18635 -23744 -7576 -27503 -31291
21326c1291K1161K9335M751o302J4805r996j621j3052l6707j1577L4394J6038
$$ -31291 -10130 19205 23956 17654 32459 22463 20842 7790 -28917 -40494 -6100 9938
21314I938r612k1619q715j4727J0541K0000j2257N042J1425o986j0942k644k597
$$ 9938 326 -21293 -30008 -44735 -34194 -14194 -26451 -21409 -9984 -16970 -27912 -30556 -33153
21301c3153J9282n85J1568J1626j0314M446o467O504p448P576M597M919m923j4463
$$ -33153 -13871 -14456 -2888 8738 -1576 2870 -3597 2907 -4541 3035 7632 12551 7628 -6835
21287f835j5012K3381K3256q630k588k179j0059q914r715M365J0990j1092K8651
$$ -6835 -21847 1534 24790 16160 13572 11393 1334 -7580 -17295 -12930 -1940 -13032 15619
21274A5619N710r622J3205J4747j4965q366k725J5169R922L67j3627j557j5246
$$ 15619 21329 11707 24912 39659 24694 16328 13603 28772 38694 39061 25434 23877 8631
21261H631j945J856J1792J0287J3535L576j7523k2115l754j3668M654r646O246
$$ 8631 6686 8542 20334 30621 44156 47732 30209 8094 4340 -9328 -4674 -14320 -8074
21248h074j7946O607J7228J4796J6876o570j4835Q816l128k4976j1422r552K8846
$$ -8074 -26020 -19413 -2185 12611 29487 22917 8082 16898 13770 -11206 -22628 -32180 -3334
21235c334k96k7527m243k77J1632Q362J0321j1422q856K9690n489M329J0313j0084
$$ -3334 -3630 -31157 -35400 -35677 -24045 -15683 -5362 -16784 -25640 4050 -1439 2890 13203 3119
21221C119l1952k0502q377J3607R870r079O19L0065K1900j6334j6235l1680l2201
$$ 3119 -28833 -49335 -57712 -44105 -34235 -43314 -42695 -12630 9270 -7064 -23299 -54979 -87180
21208h7180J0971K1818K1716K0626K4734J5612j5906j7804O737p649j1820j8195
$$ -87180 -76209 -54391 -32675 -12049 12685 28297 12391 -5413 1324 -6325 -18145 -36340
21196c6340J089L4400K6650n511l970r574M60J0806O596J3609l037l0972o089
$$ -36340 -35251 -851 25799 20288 16318 6744 7204 18010 24606 38215 35178 4206 -1883
21183a883j854J5643P151N525L615J2391j9533j412l713j4081j5248k435j2580
$$ -1883 -3737 11906 19057 24582 28197 40588 21055 19643 15930 1849 -13399 -15834 -28414
21170b8414j0872j4643J0556K7623P352j4319l971M793j3844R733j483K7583J1865
$$ -28414 -39286 -53929 -43373 -15750 -8398 -22717 -26688 -21895 -35739 -26006 -27489 94 11959
21157A1959L403J1958J2036j7383J1307k1695L3Q125j8579k3910K293K3767K3153
$$ 11959 15362 27320 39356 21973 33280 11585 11618 19743 1164 -22746 -20453 3314 26467
21144B6467j4192M698J0895P956j865Q037p579q942j1935l1171k2073k2479J7233
$$ 26467 12275 16973 27868 35824 33959 41996 34417 25475 13540 -17631 -39704 -62183 -44950
21131d4950M883j1507J8349J8797K1007J830r355o586j1215K5210J2033j3665
$$ -44950 -40067 -51574 -33225 -14428 6579 8409 -946 -7532 -18747 6463 18496 4831
21119D831j535J1370N326k1818r858J3555O842R934k3437k917R366j2205L366
$$ 4831 3296 14666 19992 -1826 -11684 1871 8713 18647 -4790 -7707 1659 -10546 -7180
21106g180J2477J7080j4817p649J2783n938J2556l702j9850Q131M619o424P43
$$ -7180 5297 22377 7560 -89 12694 6756 19312 15610 -4240 3891 8510 2086 2829
21093B829N288N20J1157j3703j4644J399p256J5108K872J4534l566k0192M31J0708
$$ 2829 8117 8637 19794 6091 -8553 -7154 -14410 698 3570 18104 14538 -5654 -5223 5485
21079E485L175J117O576q523M065J6212j560j1223j6039j3521Q119K863j2223
$$ 5485 8660 9777 16353 7830 11895 28107 26547 15324 -715 -14236 -6117 -3254 -15477
21066a5477J305J236O082j7989j0199K0124K5197o896j851o251m027J5605k372
$$ -15477 -14172 -12936 -6854 -24843 -35042 -14918 10279 3383 1532 -4719 -8746 6859 4487
21053D487j8176m129J4203J517k50J4275J4810l065j4274n633o470k0843j3798
$$ 4487 -13689 -17818 -3615 -2098 -2348 11927 26737 23672 9398 3765 -2705 -23548 -37346
21040c7346j3132K368K0423L042j1555K603R998p026L1314Q393j4979J439j3489
$$ -37346 -50478 -48110 -27687 -24645 -36200 -33597 -23599 -30625 689 9082 -5897 -4458 -17947
21027a7947j1283r024J4881J9529j1880p290K0897j5513k1478Q245K2533K3463
$$ -17947 -29230 -38254 -23373 -3844 -15724 -23014 -2117 -17630 -39108 -30863 -8330 15133
21015A5133J4737j6065o842j551Q089N636j3181O464L198k3192j4774j4030K8612
$$ 15133 29870 13805 6963 5412 13501 19137 5956 12420 15618 -7574 -22348 -36378 -7766
21002g766J1884k8642j6781L0693L2204K4831j733m8369k0121J598k4993R251
$$ -7766 4118 -24524 -41305 -10612 21592 46423 44690 -3679 -23800 -22202 -47195 -37944
20990c7944M498K1247J7749j4162M806j3472M802j3907K047J4255J6192j179j2766
$$ -37944 -33446 -12199 5550 -8612 -3806 -17278 -12476 -26383 -24336 -10081 6111 4932 -7834
20977g834j0850J3107R646k251R828o77j7158l2007J0198O552j8857l5455j9298
$$ -7834 -18684 -5577 4069 1818 11646 10969 -6189 -38196 -27998 -21446 -40303 -75758 -95056
20964i5056j3816M1299O3699L273K203J3382p483j4219p127M956j474j4412N710
$$ -95056 -108872 -67573 -3874 -601 1602 14984 7501 -6718 -13845 -8889 -10363 -24775 -19065
20951a9065j8480J0152K1542j9294p7J4627o116K165j0064P201k869j7209j5574
$$ -19065 -37545 -27393 -5851 -25145 -25222 -10595 -16711 -14546 -24610 -17409 -20278 -37487 -53061
20938e3061J3180j3390j0379Q980K9594K0619J4171K054r185R595l47K770J2591
$$ -53061 -39881 -53271 -63650 -54670 -25076 -4457 9714 11768 2583 12178 11831 14601 27192
20925B7192n380j7705j4684j4267l261r783k399J1228j5319n788L967J4865J9539
$$ 27192 21812 4107 -10577 -24844 -28105 -37888 -40287 -29059 -44378 -50166 -46199 -31334 -11795
20912a1795l123J3620J3155q446j1186j9229j0833L4988L098K5353K0088j8829
$$ -11795 -14918 -1298 11857 3411 -7775 -27004 -37837 -2849 249 25602 45690 26861
20900B6861k8284l4870Q938J5103N641P734J3556j5717j2072O228q105p531K0514
$$ 26861 -1423 -36293 -27355 -12252 -6611 1123 14679 -1038 -13110 -6882 -14987 -22518 -2004
20887b004J7792j0155j1512k6538J1223J1567L529K8666k1335j2015J6838K049
$$ -2004 15788 5633 -5879 -32417 -21194 -9627 -6098 22568 1233 -10782 6056 8105
20875H105m262J1811L87J2939k5228l6O233J3870k87J3959m940j1593k4710j4534
$$ 8105 3843 15654 16041 28980 3752 3716 9949 23819 23532 37491 32551 20958 -3752 -18286
20861a8286N56N685R137K2171k3467k4812o391J2101L6429J7182n87j1330k4548
$$ -18286 -17730 -12045 -2908 19263 -4204 -29016 -35407 -23306 13123 30305 29718 18388 -6160
20848f160L54o631R764J5197J3461J541k634J0712j3224P030j8083k5722j9340
$$ -6160 -5806 -12437 -2673 12524 25985 27526 24892 35604 22380 29410 11327 -14395 -33735
20835c3735N456nn983O315r969m756Q158K9523L764J6054J0957j66j9402j009
$$ -33735 -28279 -28284 -34267 -27952 -37921 -42677 -34519 -4996 -1232 14822 25779 25613 6211 5202
20821E202J8518R150j3069j2484p525j3015O456R422j7879Q246K4892J0878j2528
$$ 5202 23720 32870 19801 7317 -208 -13223 -6767 2655 -15224 -6978 17914 28792 16264
20808A6264o083R917J5134K0348j4426j7044n462J647M373j2536L805j1698J5449
$$ 16264 10181 20098 35232 55580 41154 24110 18648 20295 24668 12132 15937 4239 19688
20795A9688L879j1801r509N660K2190l476j9059J2617J3401M429l5054n986J4532
$$ 19688 23567 11766 2257 7917 30107 26631 7572 20189 33590 38019 2965 -3021 11511
20782A1511j613j6066m284J2596l946q7J2454J2108o762K8922R42k3321k2398
$$ 11511 9898 -6168 -10452 2144 -1802 -1889 10565 22673 15911 44833 45775 22454 56
20769E6j3239J1974R368j0819j3775J8540J2251j3706j3844r999N581J9051K0605
$$ 56 -13183 -1209 8159 -2660 -16435 2105 14356 650 -13194 -23193 -17612 1439 22044
20756B2044O824P635o550k4744J573N906Q326j6676q950j9424j471K626J3481
$$ 22044 28868 36503 29953 5209 6782 12688 21014 4338 -4612 -24036 -25507 -22881 -9400
20743i400K6448K0970k584o729p417M439j9212j0784r35N537p481j9883k8841
$$ -9400 17048 38018 35434 28705 21288 25727 6515 -4269 -5204 333 -7148 -27031 -55872
20730e5872j2653K7074P063L1626J6445K947j0763k1194l677P051L052J4239j20
$$ -55872 -68525 -41451 -34388 -2762 13683 16630 5867 -15327 -19004 -11953 -8901 5338 5218
20717E218k2031j3193M889N623N966K0371M545m518K947R28J6095N615l4056j9418
$$ 5218 -16813 -30006 -25117 -19494 -13528 6843 11388 6870 9817 10745 26840 32455 -1601 -21019
20703b1019j6229J0831Q577j2315q025J5029k035j337K9352P013P234l154M530
$$ -21019 -37248 -26417 -17840 -30155 -38180 -23151 -25186 -26523 2829 9842 17076 13922 18452
20690A8452K6499j0840j0682k0242o347J1374K2466J2689Q602l4560n5419J393
$$ 18452 44951 34111 23429 3187 -3160 8214 30680 43369 51971 17411 -38008 -36615
20678c6615J8594J3481L973J0015P021J3716O141j3480l6526j1484j3344J7907
$$ -36615 -18021 -4540 -567 9448 16469 30185 36326 22846 -13680 -25164 -38508 -20601
20666b0601J0257K977J588j2255J0051j8627J0967p815j5716J0753J0792P737
$$ -20601 -10344 -7367 -5779 -18034 -7983 -26610 -15643 -23458 -39174 -28421 -17629 -9892
20654i892m400k620p30k424n450O180L999K074o592K4474K3798j0379j6117o392
$$ -9892 -14292 -16912 -17642 -20066 -25516 -19336 -15337 -13263 -19855 4619 28417 18038 1921 -4471
20640d471J3315J2911l0108k9184R743J0946k582O570J8164j0872j36j384J1404
$$ -4471 8844 21755 -8353 -37537 -27794 -16848 -19430 -12860 5304 -5568 -5704 -7088 4316
20627D316J5294O201O317q991j1606K626O839K6298R666j1682k056j0434j3081
$$ 4316 19610 25811 32128 23137 11531 14157 20996 47294 56960 45278 43222 32788 19707
20614A9707k6803r849j018K6640j683R609q028p570J6465k595k7424k339M701
$$ 19707 -7096 -16945 -17963 8677 6994 16603 8575 1005 17470 14875 -12549 -14888 -10187
20601a0187Q405j3927k6260k1897K5876P158J0338K5390J4502L097j0368m675
$$ -10187 -1782 -15709 -41969 -63866 -37990 -30832 -20494 4896 19398 22495 12127 7452
20589G452r823j6009L1230K7050k5542k6750j2419J3297J5617l879j230k0609
$$ 7452 -2371 -18380 12850 39900 14358 -12392 -24811 -11514 4103 224 -1006 -21615
20577b1615J602J9559O537m070j3146j66J0176K2195L204l0303j7369o547P372
$$ -21615 -20013 -454 6083 2013 -11133 -11299 -1123 21072 24276 -6027 -23396 -29943 -22571
20564b2571j020J046j495J2114J1962L464q597N491o972j0472J5773L403o848
$$ -22571 -23591 -22545 -24040 -11926 36 3500 -5097 394 -6578 -17050 -1277 2126 -4722
20551d722j545J6043N702J0359K01R406k1594j7692j8317p559q991J3441K0665
$$ -4722 -6267 9776 15478 25837 26038 35444 13850 -3842 -22159 -29718 -38709 -25268 -4603
20538d603K4342J0221j1080j3230k7567J8982K7310m949n754Q552O372l2447j3147
$$ -4603 19739 29960 18880 5650 -21917 -2935 24375 19426 13672 22224 28596 -3851 -16998
20525a6998j4583L027O005J5814J2553Q852J263j9918J6697K2354j1816Q285j4341
$$ -16998 -31581 -28554 -22549 -6735 5818 14670 15933 -3985 12712 35066 23250 31535 17194
20512A7194m530k4503q213K7370J3703j0718k867P668r846k1664n398K8424P057
$$ 17194 12664 -11839 -20052 7318 21021 10303 7436 15104 5258 -16406 -21804 6620 13677
20499A3677N244j7458p638j1746O018M346K4246j4967j1916P931r7q762L866O061
$$ 13677 18921 1463 -6175 -17921 -11903 -7557 16689 1722 -10194 -2263 -2360 -11122 -7256 -1195
20485a195n373N751k2556j700N715j5147j4204J7968K383P949K4513m296p213
$$ -1195 -6568 -817 -23373 -25073 -19358 -34505 -48709 -30741 -28358 -20409 4104 -192 -7405
20472g405k5148N261J9917K7987J1571l0935o419O201K3073J1704k6650k9338
$$ -7405 -32553 -27292 -7375 20612 32183 1248 -5171 1030 24103 35807 9157 -20181
20460b0181m4720j0076K6417K2662K0102J57k2236m696Q619L430M408K1698k5854
$$ -20181 -64901 -74977 -48560 -25898 -5796 -5639 -27875 -32571 -23952 -20522 -16114 5584 -20270
20447b0270j2743k171J2985L6891p725o515j4842k1216j7831R601R348J2357j5944
$$ -20270 -33013 -35184 -22199 14692 6967 452 -14390 -35606 -53437 -43836 -34488 -22131 -38075
20434c8075J6315K4577o088j4811P222J0043r590O94L172j7343k613k340R127
$$ -38075 -21760 2817 -3271 -18082 -10860 -817 -10407 -9713 -6541 -23884 -26497 -28837 -19710
20421a9710j3735j6189J1051O427P235M0142J4080k152o556J1299R693p228j2341
$$ -19710 -33445 -49634 -38583 -32156 -24921 15221 29301 27149 20593 31892 41585 34357 22016
20408B2016k7499l2315Q300j0044o50J6689J4123K0818r710k7236j6685Q748L7154
$$ 22016 -5483 -37798 -29498 -39542 -40192 -23503 -9380 11438 1728 -25508 -42193 -33445 3709
20395C709j1446j3262O025P05P669J7857O052O020P37j1776j6222j0947k0728
$$ 3709 -7737 -20999 -14974 -14269 -6600 11257 17309 23329 24066 12290 -3932 -14879 -35607
20382c5607J3113J021j0047J1277P924L47K4720J1927R4j0754M822k3497l078
$$ -35607 -22494 -21473 -31520 -20243 -12319 -11972 12748 24675 24769 14015 18837 -4660 -7738
20369g738L6763L940j3874p080j8104k1624J4576J7014m547n130R511K3023j157
$$ -7738 29025 32965 19091 12011 -6093 -27717 -13141 3873 -674 -5804 3707 26730 25573
20356B5573j799q710j1136O5k37q139k3722P389L4774J1273J5021o813j9192N545
$$ 25573 23774 15064 3928 3993 3756 -4383 -28105 -20716 14058 25331 40352 33539 14347 19892
20342A9892j324m947k8928J689J4601J8669j4697J1662j947l0063O158K1690L723
$$ 19892 18568 13621 -15307 -13618 983 19652 4955 16617 14670 -15393 -9235 12455 16178
20329A6178J5901o430N845j2109k1046q002J6650J4819k3026L881j3547J7983
$$ 16178 32079 25649 31494 19385 -1661 -9663 6987 21806 -1220 2661 -10886 7097
20317G097J3426M018n798l1437p026N834J4151K827j0064J672J0732J2803K798
$$ 7097 20523 24541 18743 -12694 -19720 -13886 265 3092 -6972 -5300 5432 18235 21033
20304B1033L020l2432k6241j6528N19J9122J5527Q901M939j5341J0455J7610q020
$$ 21033 24053 -8379 -34620 -51148 -50629 -31507 -15980 -7079 -2140 -17481 -7026 10584 2564
20291B564j4583K0304J3512j4880j5953M770J2217m418r169J2285P873J1839m4675
$$ 2564 -12019 8285 21797 6917 -9036 -4266 7951 3533 -5636 6649 14522 26361 -18314
20278a8314r746K8350J0627n700O679k0386N294J071P85l366j9037j9361R118
$$ -18314 -28060 290 10917 5217 11896 -8490 -3196 -2125 -1340 -4706 -23743 -43104 -33986
20265c3986O150J7982K301j2380o029j952k008J6058J9348p253J434J3703l826
$$ -33986 -27836 -9854 -7553 -19933 -25962 -27914 -29922 -13864 5484 -1769 -335 13368 9542
20252I542m117L628J48p682l777j0636O800K8647P295P195j7171l5104J317J1925
$$ 9542 5425 9053 9201 1519 -2258 -12894 -6094 22553 29848 37043 19872 -15232 -13915 -1990
20238a990j410p755N277n814N516j2055k1776J2469J535J1632j680k504L793k3567
$$ -1990 -3400 -11155 -5878 -11692 -6176 -18231 -40007 -27538 -26003 -14371 -16051 -18555 -14762 -38329
20224c8329N930J2884n89R053L475J7868j2981j339N437j4697j6431K83R738K3958
$$ -38329 -32399 -19515 -20104 -11051 -7576 10292 -2689 -4028 1409 -13288 -29719 -29436 -19698 4260
20210D260L233L348J3599n619n386l1512o555L694l406K427J0964K9442j7922
$$ 4260 7493 10841 24440 18821 13435 -18077 -24632 -20938 -24344 -21917 -10953 18489 567
20197E67P70k3589j8888K6310J7362K2k2157l173J7316R358n072k2808j0807K9528
$$ 567 1337 -22252 -41140 -14830 2532 2554 -19603 -22776 -5460 3898 -1174 -23982 -34789 -5261
20183e261o213r745L44M40q386K938J9881J4039l5050M600J9938o287q148L864
$$ -5261 -11474 -21219 -20875 -20435 -28821 -25883 -6002 8037 -27013 -22413 -2475 -8762 -16910 -13046
20169a3046M148K705L049r74L231J1540j985R5j4195j7774j1389j2947K0738J8106
$$ -13046 -8898 -6193 -3144 -4118 -887 10653 8668 8763 -5432 -23206 -34595 -47542 -26804 -8698
20155h698J1941J5358j4155q796q361O363q486n719J833o905o38M574M377Q062
$$ -8698 3243 18601 4446 -4350 -12711 -6348 -14834 -20553 -18720 -25625 -26263 -21689 -17312 -9250
20141i250j1258m129M874J2217N663j074j6980p509n362M420J1708J4117Q75P141
$$ -9250 -20508 -24637 -19763 -7546 -1883 -2957 -19937 -27446 -32808 -28388 -16680 -2563 -1688 5453
20127E453j1403r206J0157q526j9852j1690K6693R650K4206j3633m0245J8788
$$ 5453 -5950 -15156 -4999 -13525 -33377 -45067 -18374 -8724 15482 1849 -38396 -19608
20115a9608J4961k271J5121n613j3865k2948P819r656L015M7774J2560N02J0860
$$ -19608 -4647 -6918 8203 2590 -11275 -34223 -26404 -36060 -33045 14729 27289 27791 38651
20102C8651M220j9729k5914j1824p850J6569J0512k1423r916J2467K8611M075
$$ 38651 42871 23142 -2772 -14596 -22446 -5877 4635 -16788 -26704 -14237 14374 18449
20090A8449J0R86j2598j324J112K240k7062j1750J9885J7567K0434j5698r514
$$ 18449 18459 19445 6847 5523 6635 8875 -18187 -29937 -10052 7515 27949 12251 2737
20077B737O781p259m882n852r8p404L564J3608J9486j1304j8979j623j69n780
$$ 2737 9518 2259 -2623 -8475 -8573 -15977 -12413 1195 20681 9377 -9602 -11225 -11394 -17174
20063a7174n757J4052j3644k3325j797K7949P619k0299N632J7352K1287R670J1301
$$ -17174 -22931 -8879 -22523 -45848 -47645 -19696 -12077 -32376 -26744 -9392 11895 21565 32866
20050C2866j9265n186n033k0139J080J3577J3209N284P644L461j817q984o23J1042
$$ 32866 13601 8415 3382 -16757 -15677 -2100 11109 16393 24037 27498 25681 16697 16074 27116
20036B7116Q185K1731j2277l4536j5753J471Q519R606Q960l936k6251l028J3247
$$ 27116 35301 57032 44755 10219 -5534 -4063 4456 14062 23022 19086 -7165 -10193 3054
20023C054m659K467J4839j5690k0885L5322J3562l3424P603J9122j1682N191K5428
$$ 3054 -1605 862 15701 11 -20874 14448 28010 -5414 2189 21311 9629 14820 40248
20010D0248J1178l8934j8710J3582N585J3835j3136r636k0448l2975K1684L7680
$$ 40248 51426 12492 -6218 7364 12949 26784 13648 4012 -16436 -49411 -27727 9953
19998I953j145k2924L413j7589k2308K1958K6873J2958L236j902l009K285j9479
$$ 9953 8808 -14116 -10703 -28292 -50600 -28642 -1769 11189 14425 12523 9514 11799 -7680
19985g680k0665J2623L5608o57m0097M775J0171j4288m951k540J913K8812M797
$$ -7680 -28345 -15722 19886 19229 -20868 -16093 -5922 -20210 -25161 -27701 -25788 3024 7821
19972G821L01p089K1686K480j0331j3123J3367j2129R390K234m060r152j858o344
$$ 7821 8122 1033 22719 25199 14868 1745 15112 2983 12373 14607 10547 1395 -463 -6807
19958f807K98J3641p989R125J0515q170M19M959L214j3818O151j9174j5198R72
$$ -6807 -6509 7132 -857 8268 18783 10613 11032 15991 19205 5387 11538 -7636 -22834 -21862
19944b1862k035O975n820J9224K3889k8373j0988m715K6621K0512J3673j275q185
$$ -21862 -23897 -16922 -22742 -3518 20371 -8002 -18990 -23705 2916 23428 37101 35826 27641
19931B7641j2104J672n657l055k442K2070J5849j4571O662o523j0860R530J5446
$$ 27641 15537 17209 11552 8497 6055 28125 43974 29403 36065 29542 18682 28212 43658
19918D3658n829j2999j713k5190J87K8324J3162k2237l0769l3365j2648N30N267
$$ 43658 37829 24830 23117 -2073 -1886 26438 39600 17363 -13406 -46771 -59419 -58889 -53622
19905e3622K9257n747j6233K0907Q584J1433r779J5028J2784K4225m044l2244
$$ -53622 -24365 -30112 -46345 -25438 -16854 -5421 -15200 -172 12612 36837 32793 549
19893E49j0969k4028j7347P645M91P351J3582K5860K3467n47k0861j4690n522
$$ 549 -10420 -34448 -51795 -44150 -43659 -36308 -22726 3134 26601 26054 5193 -9497 -15019
19880a5019J7506J2233k5283j9174l215J8656l844J108O899K262K941r53j100
$$ -15019 2487 14720 -10563 -29737 -32952 -14296 -18140 -17032 -10133 -7871 -4930 -5883 -6983
19867f983J3052R546j0629P498o73j7231n7j2038J8686K6009J9439k4401r197
$$ -6983 6069 15615 4986 12484 11811 -5420 -5477 -17515 1171 27180 46619 22218 13021
19854A3021k8494Q637J1216J4051J3924j4604q866J0174K261j4406k7227m534
$$ 13021 -15473 -6836 4380 18431 32355 17751 8885 19059 21320 6914 -20313 -24847
19842b4847M9661J2981j7857m533J2588J243j4204m090Q101j7322l2527l756J1982
$$ -24847 24814 37795 19938 15405 27993 29236 15032 10942 19043 1721 -30806 -34562 -22580
19829b2580K8201r4m250j2289N938J5708n872j3704k0204M372P8l81j5305k066
$$ -22580 5621 5527 1277 -11012 -5074 10634 4762 -8942 -29146 -24774 -24696 -25077 -40382 -42448
19815d2448K4972J6662O668l32J5824k5081j2605R505k9123O145J4090r032k852
$$ -42448 -17476 -814 5854 5522 21346 -3735 -16340 -6835 -35958 -29813 -15723 -24755 -27607
19802b7607M120J2916P442p630J5194R394m616k782l3616k7318J4205K7515K4025
$$ -27607 -23487 -10571 -3129 -10759 4435 13829 9213 6431 -27185 -54503 -40298 -12783 11242
19789A1242O361l590j8759J9437o22k6569K7P995J0090J0090j9532J7006j7652
$$ 11242 17603 14013 -4746 14691 14069 -12500 -12473 -4478 5612 15702 -3830 13176 -4476
19776d476k2292n32O222J7453J6911p621q434J2905L807J2326q976k822j2263
$$ -4476 -26768 -27300 -21078 -3625 13286 5665 -2769 10136 13943 26269 17293 14471 2208
19763B208m345q399n451j8993m727K4646J0795j845P04J3332j8323j3909R465
$$ 2208 -2137 -10536 -15987 -34980 -39707 -15061 -4266 -6111 -5407 7925 -10398 -24307 -14842
19750a4842Q268R937l665j3790N155k2876j1708L4558K9998L58J0997n51o767
$$ -14842 -6574 3363 -302 -14092 -8937 -31813 -43521 -8963 21035 21393 32390 31839 25072
19737B5072l0073R631R778N221k135M870k389l673k2133p944J920n808J9898Q700
$$ 25072 -5001 4630 14408 19629 17494 22364 19975 16302 -5831 -13775 -11855 -17663 2235 10935
19723A0935j2105K136j3825M098K726R937n619r882N193K2301J5502j2901j2921
$$ 10935 -1170 966 -12859 -8761 -6035 3902 -1717 -11599 -6406 15895 31397 18496 5575
19710E575L860R290j1480J511j9359m719K755J5681K3509j504m209k2743k2664
$$ 5575 9435 18725 7245 8756 -10603 -15322 -12567 3114 26623 25119 20910 -1833 -24497
19697b4497m727Q473r000J8109K084j1180m223L3566J9927o636j6196p501K5232
$$ -24497 -29224 -20751 -29751 -11642 -9558 -20738 -24961 8605 28532 21896 5700 -1801 23431
19684B3431J4207L909m066p474n403j7493q072q994R915K0986J0638J6556j31
$$ 23431 37638 41547 37481 30007 24604 7111 -961 -9955 -40 20946 31584 48140 48009
19671D8009q410j2202j9163j552j6195N470n965L84K5431n369k1200J6122K559
$$ 48009 39599 27397 8234 6682 -9513 -4043 -10008 -9624 15807 10438 -10762 5360 7919
19658G919k521o107k7327j4214L706L1681L6987q41l449Q634N833p43j4190p388
$$ 7919 5398 -709 -28036 -42250 -38544 -6863 30124 29283 25834 34468 40301 39558 25368 17980
19644A7980n808n803M021Q777L368p984n769J2904K0478o985o515K89j1707j2261
$$ 17980 12172 6369 10390 19167 22535 14551 8782 21686 42164 35179 28664 28953 17246 4985
19630D985K6128m406k1326r663p140J9308J1100L781j7786j6797K2854J033m528
$$ 4985 31113 26707 5381 -4282 -11422 7886 18986 22767 4981 -11816 11038 12071 7543
19617G543J2936N292n452N060j2356J649j5240R339L042K257J8281o635k7992
$$ 7543 20479 25771 20319 25379 13023 14672 -568 8771 11813 14070 32351 25716 -2276
19604b276l5698l097K3161r535R62K5464K6485j684j1485k001K4608J2552j6744
$$ -2276 -37974 -41071 -17910 -27445 -26483 -1019 25466 23782 12297 10296 34904 47456 30712
19591C0712n063L733J0536P8j0997r494o039J1093j0066j26K0259r652M307n302
$$ 30712 25649 29382 39918 39996 28999 19505 13466 24559 14493 14367 34626 24974 29281 23979
19577B3979k818M787K437j7424O47q503q068j3707l603K0299p677N146J0105K235
$$ 23979 21161 25948 28385 10961 11608 3105 -4963 -18670 -22273 -1974 -9651 -4505 5600 7835
19563G835M318l327j9912m176J685M387q522l865N417m504J0095L914q008q79
$$ 7835 12153 8826 -11086 -15262 -13577 -9190 -17712 -21577 -16160 -20664 -10569 -6655 -14663 -15542
19549a5542J1919M018n711p651P197j1489k0092P707J8921M501k1050p221K1490
$$ -15542 -3623 395 -5316 -12967 -5770 -17259 -37351 -29644 -10723 -6222 -27272 -34493 -13003
19536a3003K2321J9021j1754J603q411J5324k0440k4356J5058K6827M0300o722
$$ -13003 9318 28339 16585 18188 9777 25101 4661 -19695 -4637 22190 62490 55768
19524E5768m7393K3539J5805r044p163k5809p849j6704k293R680J1357k273K6707
$$ 55768 8375 31914 47719 38675 31512 5703 -2146 -18850 -21143 -11463 -106 -2379 24328
19511B4328J1393j9439j3270J891J8589L234k091o936k4637M535Q439o851J7377
$$ 24328 35721 16282 3012 4903 23492 26726 24635 17699 -6938 -2403 6036 -815 16562
19498A6562j6212k1341R85K4763o361N630K5704J5475M086j9029l5338M702J1729
$$ 16562 350 -20991 -20006 4757 -1604 4026 29730 45205 49291 30262 -5076 -374 11355
19485A1355r779Q577P614L471m021l109J0312p344j9183J5166J2967j1283P881
$$ 11355 1576 10153 17767 21238 17217 14108 24420 17076 -2107 13059 26026 14743 22624
19472B2624n760Q771O497o385L0971K6820l325l2564r796n828j8913N212J7669
$$ 22624 16864 25635 32132 25747 56718 83538 80213 47649 37853 32025 13112 18324 35993
19459C5993j3145j1010l326r841J3994J0517K903k1119r508J3130O593j0978l0139
$$ 35993 22848 11838 8512 -1329 12665 23182 26085 4966 -4542 8588 15181 4203 -25936
19446b5936P607P989L648L1552J28l315M533j8936l702J7979L315P346J1431j6362
$$ -25936 -18329 -10340 -6692 24860 24988 21673 26206 7270 3568 21547 24862 32208 43639 27277
19432B7277k3865M213o019j9885R460r018o752O661J3355J3162K0678M633j5120
$$ 27277 3412 7625 1606 -18279 -8819 -17837 -24589 -17928 -4573 8589 29267 33900 18780
19419A8780j0850J0170l0420K024L5794J7308n812q151k79o654J9356q714j3733
$$ 18780 7930 18100 -12320 -10296 25498 42806 36994 28843 28564 21910 41266 32552 18819
19406A8819k7195j2891J8890J2468j595Q112j4691k2081q113J8371K7084J9534
$$ 18819 -8376 -21267 -2377 10091 8496 16608 1917 -20164 -28277 -9906 17178 36712
19394C6712J5357o783j4212j0585k347J491J1886o551m222k819R103q479P532
$$ 36712 52069 45286 31074 20489 18142 19633 31519 24968 20746 17927 27030 18551 26083
19381B6083K5180k3707j3971k3984m745K2345K4239J9759J5889j5463m069Q482
$$ 26083 51263 27556 13585 -10399 -15144 7201 31440 51199 67088 51625 47556 56038
19369E6038j0202j2457n520n72j9051K272Q198J4440Q543J08q42m404j4562m592
$$ 56038 45836 33379 27859 27287 8236 10508 18706 33146 41689 41797 40955 36551 21989 17397
19355A7397j6085j2408K058Q758J1512N809L587J5693L443m932N274K1938k422
$$ 17397 1312 -11096 -9038 -280 11232 17041 20628 36321 39764 34832 40106 62044 59622
19342E9622n803j5599k5602l93N706j714l2085M157l108K5477K1958j2916k3469
$$ 59622 53819 38220 12618 12225 17931 16217 -15868 -11711 -14819 10658 32616 19700 -3769
19329c769o462J3001J4184r06j4556l175o82j5753o264J1827K3234J8634J4179
$$ -3769 -10231 2770 16954 16048 1492 -1683 -2365 -18118 -24382 -12555 10679 29313 43492
19316D3492q827L827m233j8667M735Q980J0155j7610j0k397j8184q2J9911o32
$$ 43492 34665 38492 34259 15592 20327 29307 39462 21852 21842 19445 1261 1179 21090 20458
19302B0458p752n413j5617j0539k9729o90L3031L3569R916q633j5782n683o989
$$ 20458 12706 7293 -8324 -18863 -48592 -49282 -16251 17318 27234 18601 2819 -2864 -9853
19289i853N674l947K174J5687n171J594J2570K6039j257j0243k4023m904o294
$$ -9853 -4179 -8126 -5952 9735 4564 6158 18728 44767 43510 33267 9244 4340 -1954
19276a954K2325k40k1093j5113J6519K3328J8899k260k6363j6617N391j5755R215
$$ -1954 20371 20131 -962 -16075 444 23772 42671 40411 14048 -2569 2822 -12933 -3718
19263c718J3039J0984k458L853O764K729j8308K903L51p609p341j0050j5422q147
$$ -3718 9321 20305 17847 21700 28464 31193 12885 15788 16139 8530 1189 -8861 -24283 -32430
19249c2430l827L2825o135J7045K462n099l919k573m020p026K0180J3773N926
$$ -32430 -36257 -3432 -9567 7478 9940 4841 922 -1651 -5671 -12697 7483 21256 27182
19236B7182L019J1139o81k1086m425J3691j6525l219n467R681P090k42K580N87
$$ 27182 30201 41340 40659 19573 15148 28839 12314 9095 3628 13309 20399 20157 22737 23324
19222B3324K981m289l687l217N733K9166j5109l692j346K3033j4823k6871r560
$$ 23324 26305 22016 18329 15112 20845 50011 34902 31210 29864 52897 38074 11203 1643
19209A643J329J1126j2717j94P386R889J5720r258J2159K890l1338o497P350n901
$$ 1643 2972 14098 1381 1187 8573 18462 34182 24924 37083 39973 8635 2138 9488 3587
19195C587Q587j7740o797o2j0397j7642m52J346J9513J3698q644K5030L2426o049
$$ 3587 12174 -5566 -12363 -12425 -22822 -40464 -40916 -39570 -20057 -6359 -15003 10027 42453 36404
19181C6404k0931K310p887j9381k37N136p155k700m672O293J6687j493R111J0050
$$ 36404 15473 17783 9896 -9485 -9722 -4586 -11741 -14441 -19113 -12820 3867 2374 11485 21535
19167B1535j87J4217J0897l912o962k698J4649J5212j0118k6718k6432N899M221
$$ 21535 21348 35565 46462 42550 35588 32890 47539 62751 52633 25915 -517 5382 9603
19154I603n957O482k1345q314M6748J1551l033M417k1026k3240n618J1892J6268
$$ 9603 3646 10128 -11217 -19531 27217 38768 35735 40152 19126 -4114 -9732 2160 18428
19141A8428P531J9114J739J1337M189o045j5284j7823j3023O093R005j3950k2627
$$ 18428 25959 45073 46812 58149 62338 56293 41009 23186 10163 16256 25261 11311 -11316
19128a1316N215j1000r263J0149J797K6080J2009M091M855n522N48j7501k8680
$$ -11316 -6101 -17101 -26364 -16215 -14418 11662 23671 27762 32617 27095 27643 10142 -18538
19115a8538o791J8394L2076N1293j8340l0861j4573m650p76o818L958K7955R444
$$ -18538 -25329 -6935 25141 76434 58094 27233 12660 8010 7234 416 4374 32329 41773
19102D1773j2516j0116P393Q446k4586j6340J4428N564L413J0042Q410k959l0919
$$ 41773 29257 19141 26534 34980 10394 -5946 8482 14046 17459 27501 35911 32952 2033
19089B033j2607K1727N283K04j4397L307J2102Q051p685j1889r811l907p198o810
$$ 2033 -10574 11153 16436 16640 2243 5550 17652 25703 18018 6129 -3682 -7589 -14787 -21597
19075b1597L751J3143Q608n15R230r772M051k1423j1353Q27o565J7681K7633L638
$$ -21597 -17846 -4703 3905 3390 12620 2848 6899 -14524 -25877 -25050 -31615 -13934 13699 17337
19061A7337j1227L864K69j4746L290j5847j7101j0265J6267Q689J0912J2356q539
$$ 17337 6110 9974 10243 -4503 -1213 -17060 -34161 -44426 -28159 -19470 -8558 3798 -4741
19048d741j3797P135J7062L494n02M498r456k362Q581k4973K479j5752R914J4003
$$ -4741 -18538 -11403 5659 9153 8651 13149 3693 1331 9912 -15061 -12582 -28334 -18420 -4417
19034d417J7597j2025j2950l239J0991j2020j0846L015p01J2999J5448J5796q824
$$ -4417 13180 1155 -11795 -15034 -4043 -16063 -26909 -23894 -24595 -11596 3852 19648 10824
19021A0824j9779J6863P331R641k488m728o778k76M756L238k0361j3741J0391
$$ 10824 -8955 7908 15239 24880 22392 17664 10886 10610 15366 18604 -1757 -15498 -5107
19008e107K6606J8559J887k1502J704J739K0059M617k6399n113O880p71R670K055
$$ -5107 21499 40058 41945 20443 22147 23886 43945 48562 22163 17050 23930 23159 32829 34884
18994C4884J1499J002R465j345k7612L303P052k4667k0414O956K0668M457q526
$$ 34884 46383 47385 56850 55505 27893 31196 38248 13581 -6833 123 20791 25248 16722
18981A6722P70M189k4170j2682L245l945r788R198L5175P210j4271J0640o147
$$ 16722 17492 21681 -2489 -15171 -11926 -15871 -25659 -16461 18714 25924 11653 22293 16146
18968A6146j5530J5644M4659j4165k9172j5842J3046M332j5519K224L801J4246
$$ 16146 616 16260 60919 46754 17582 1740 14786 19118 3599 5823 9624 23870
18956B3870K4226K176k0629l0995J571J6017P501J3957j3051K80k776j7328j6488
$$ 23870 48096 50272 29643 -1352 219 16236 23737 37694 24643 24923 22147 4819 -11669
18943a1669J1360K4852j0868j4889K557j3503R038M3049J7081j0355j2763J4384
$$ -11669 -309 24543 13675 -1214 1343 -12160 -3122 39927 57008 46653 33890 48274
18931D8274j3098r600J4845J7771J8417n650o124M897n548k5233j5217j0714r63
$$ 48274 35176 25576 40421 58192 76609 70959 64835 69732 64184 38951 23734 13020 12057
18918A2057L686o407J0004L400k9985j3218L1424n696n745J0124J0410L019j4743
$$ 12057 15743 9336 19340 22740 -7245 -20463 10961 5265 -480 9644 20054 23073 8330
18905H330n173k1763j6026K1289J3796M797j865j6316K2591J2261J2666J3613
$$ 8330 3157 -18606 -34632 -13343 453 5250 3385 -12931 9660 21921 34587 48200
18893D8200j3145j7554j3592j2410L4297R910J1269k4630k6086Q076K497K5433
$$ 48200 35055 17501 3909 -8501 25796 35706 46975 22345 -3741 4335 6832 32265
18881C2265M110K0096j4424k3539Q31j4167L828J8275k6219k6221K8528J1806
$$ 32265 36375 56471 42047 18508 19339 5172 9000 27275 1056 -25165 3363 15169
18869A5169j353j1846n012L2283N033j8424m567P415K565O950p973j2422r132
$$ 15169 13816 1970 -3042 29241 34274 15850 11283 18698 21263 28213 20240 7818 -1314
18856a314P555J6492Q699k903J3540J4009j8175j3292K663k471j5867K1882J0237
$$ -1314 6241 22733 31432 28529 42069 56078 37903 24611 27274 24803 8936 30818 41055
18843D1055N288r624k4921j6866K9789J1779n329n074M459j876k1103O029M591
$$ 41055 46343 36719 11798 -5068 24721 36500 31171 26097 30556 28680 7577 13606 18197
18830A8197j4637j0975L112J4895j808n834K831Q458J9413J7905J1588j1900l1920
$$ 18197 3560 -7415 -4303 10592 8784 2950 5781 14239 33652 51557 63145 51245 19325
18817A9325k774j1942J0622J0021J6666J7394Q286k6139k3596L214Q663l621j3741
$$ 19325 16551 4609 15231 25252 41918 59312 67598 41459 17863 21077 29740 26119 12378
18804A2378N467L8029K053k431J9727K8540k6297k8802l1819Q622O96j2873q756
$$ 12378 17845 55874 57927 55496 75223 103763 77466 48664 16845 25467 26163 13290 4534
18791D534J5944q88Q896J6110O051j0271j4524J5398K3711o70l422J4841K2647
$$ 4534 20478 19590 28486 44596 50647 40376 25852 41250 64961 64291 60869 75710 98357
18778I8357M0692J7534k6399j4618n417k7486J985K7153R390K4459L0324M5940
$$ 98357 139049 156583 130184 115566 110149 82663 84648 111801 121191 145650 175974 221914
18766B21914J8700l2582l4718k4878l2710k7163j8275N285Q973j4175k3431J8693
$$ 221914 240614 208032 173314 148436 115726 88563 70288 75573 84546 70371 46940 65633
18754F5633M2700M883k1159j8734l6963j3043j1994o250K475L328n880J8999M787
$$ 65633 108333 113216 92057 73323 36360 23317 11323 5073 7548 10876 4996 23995 28782
18741B8782k2096j3851K3853K3982O350m38j4444j6584m03L2656P391l060j6776
$$ 28782 6686 -7165 16688 40670 47020 46582 32138 15554 15151 47807 55198 52138 35362
18728C5362j4015q389p307K6971L7600J8547K9016n854m5956l775J1938k0558
$$ 35362 21347 12958 5651 32622 70222 88769 117785 111931 65975 62200 74138 53580
18716E3580k1031J3697n649N699m265p227Q276j4403n07j6346o306J3484j5673
$$ 53580 32549 46246 40597 46296 42031 34804 43080 28677 28170 11824 5518 19002 3329
18703C329j0545J2146P318J961j406o649K1315Q706j2074j1463N500J8543N741
$$ 3329 -7216 4930 12248 14209 12803 6154 27469 36175 24101 12638 18138 36681 42422
18690D2422j0698l79K4060M6135K2514J1292j5825k6868l8173k0261j4203r837
$$ 42422 31724 31345 55405 101540 124054 135346 119521 92653 54480 34219 20016 10179
18678A0179m803J5656K1017j2881j3691J2304J1638p855m871j2191J2531L4230
$$ 10179 5376 21032 42049 29168 15477 27781 39419 31564 26693 14502 27033 61263
18666F1263K934J1358j255j8181k7479k1952Q547K0810m474r64K260o200r441
$$ 61263 64197 75555 74300 56119 28640 6688 15235 36045 31571 30607 32867 26667 17226
18653A7226J6255J2961j2667O958J9573o256k4203k4469j0910M1545K9398l388
$$ 17226 33481 46442 33775 40733 60306 54050 29847 5378 -5532 36013 65411 62023
18641F2023O244J1118j8825l7647j2202J3772J5897O905j4819j627J618j0032
$$ 62023 68267 79385 60560 22913 10711 24483 40380 47285 32466 30839 32457 22425
18629B2425n394J5275O433J7693p600j0302j6917j288J5838L1405n107N744K4064
$$ 22425 17031 32306 38739 56432 48832 38530 21613 20325 36163 67568 62461 68205 92269
18616I2269j9106j5734O6J4398N737N485j5791j0293j443J227J5427j1164l0792
$$ 92269 73163 57429 57495 71893 77630 83115 67324 57031 55588 56815 72242 61078 30286
18603C0286j3104l025K3597M882K375J732j2200M909J1315o306j9156k0384k323
$$ 30286 17182 14157 37754 42636 45011 46743 34543 39452 50767 44461 25305 4921 2598
18590B598O586j732k172J4893R735R266k050j9046J8905J8412L5888L169k0145
$$ 2598 9184 7452 5280 20173 29908 39174 37124 18078 36983 55395 91283 94452 74307
18577G4307k17J8214M908n489J9823m242J1599Q112O051K6689K3790N204m52J9963
$$ 74307 74090 92304 97212 91723 111546 107304 118903 127015 133066 159755 183545 188749 188297 208260
18563B08260L1863L1616K6428J7099L9600N7312R9717J06429J67192K84536L92175
$$ 208260 240123 271739 298167 315266 354866 412178 511895 618324 785516 1070052 1462227
18552A462227M91149N16114K40841m22855o50997l73779j41772J9261J14596K67431
$$ 1462227 1953376 2469490 2710331 2287476 1636479 1262700 1120928 1140189 1254785 1522216
18542A522216M05462N01949L48535k72796p40845n62671l03124j68129j06730
$$ 1522216 1927678 2429627 2778162 2505366 1764521 1201850 898726 730597 623867
18533F23867p7480m6242k1404l3178l0065j2729m3843l6036k8482j5227j6509
$$ 623867 546387 500145 478741 445563 415498 402769 358926 322890 294408 279181 262672
18522B62672l6601r696j7730m695Q002j6012j4127q475j7727j0096q003p639k1429
$$ 262672 226071 216375 198645 193950 201952 185940 171813 163338 145611 135515 127512 119873 98444
18509I8444j6901O023L2153J7951k1854j4720l451K9289J0650O074J5644K582
$$ 98444 81543 87566 119719 137670 115816 101096 97645 126934 137584 143658 159302 161884
18497A61884k1812l896m359K240l4421k0363j5559R514J7178J7590j519m528k0208
$$ 161884 140072 136176 131817 134057 99636 79273 63714 73228 90406 107996 106477 101949 81741
18484H1741n135K7032n516m1439m6143J76J1418L3314K8315k0907j7142Q423P220
$$ 81741 76606 103638 98122 56683 10540 10716 22134 55448 83763 62856 45714 54137 61357
18471F1357k627J348L240Q695j7763j1391K6791K0126K321j5659j166J8953J635
$$ 61357 58730 60078 63318 72013 54250 42859 69650 89776 92097 76438 75272 94225 95860
18458I5860j5349n254J5120R399J7012K976k2239j6668J0651M354k2071J0580
$$ 95860 80511 75257 90377 99776 116788 119764 97525 80857 91508 95862 73791 84371
18446H4371K3000l223j4499l378j364K4417J2530L878o330l2207j0157n077J3162
$$ 84371 107371 104148 89649 86271 84907 109324 121854 125732 119402 87195 77038 71961 85123
18433H5123K1461R538j5467J3529K252l0125j4659K350J249L512P637k3095o657
$$ 85123 106584 116122 100655 114184 116436 86311 71652 74002 75251 78763 86400 63305 56648
18420E6648O295m615n572J3363L834j0182M339j4360k0548J3125K9840M545J1423
$$ 56648 62943 58328 52756 66119 69953 59771 64110 49750 29202 42327 72167 76712 88135
18407H8135J174j1022k851P61q028j1891J623L20K1713L6817J5017k4459l6453
$$ 88135 89309 78287 75436 76197 68169 56278 57901 58221 79934 116751 131768 107309 70856
18394G0856J5694K8072p287K035Q051J2118j0752n023k4456j7205l236K9801J7946
$$ 70856 86550 114622 107335 109370 117421 129539 118787 113764 89308 72103 68867 98668 116614
18381A16614K6384q607p554K924m169L090J13k3362j4381J89j6776k5588K4077
$$ 116614 142998 134391 126837 129761 125592 128682 128795 105433 91052 91241 74465 48877 72954
18368G2954K1356K0119J9989J8926k472k9974m837R301k226j2290r678K882k212
$$ 72954 94310 114429 134418 153344 150872 120898 116061 125362 123136 110846 101168 104050 101838
18355A01838M308j4172J3607J1155R892Q72q151L329J593o471J1095k826k6992
$$ 101838 106146 91974 105581 116736 126628 127500 119349 122678 124271 117800 128895 126069 99077
18342I9077k8348j5479J6578J9879L5033K2190k6173l6594m3852k3012J3277K271
$$ 99077 70729 55250 71828 91707 126740 148930 122757 86163 42311 19299 32576 34847
18330C4847J7500O211R91O012L3429Q882L339J2516p508n383K1590o929l494q959
$$ 34847 52347 58558 59549 65561 98990 107872 111211 123727 116219 110836 132426 125497 122003 113044
18316A13044K0079K6854q154O006j9572M339J703J9844K747p065j231m426j0498
$$ 113044 133123 159977 151823 157829 138257 142596 144299 164143 166890 159825 158594 154168 143670
18303A43670L308L20j488P90k414j1572k7028J0636K593J8936J5592k0452p186
$$ 143670 146978 147298 145810 146600 144186 132614 105586 116222 118815 137751 153343 132891 125705
18290A25705P632J5158O208R915O570L698l5360k0125L5355L5478K916m1435k6087
$$ 125705 133337 148495 154703 164618 171188 174886 139526 119401 154756 190234 193150 151715 125628
18277A25628j0424O024K0281j0690m881J4501J3185L883j5237j1513J4019L6511
$$ 125628 115204 121228 141509 130819 125938 140439 153624 157507 142270 130757 144776 181287
18265A81287K0395l674r290o502r369j2009Q187j2962k1872k814K8514J5971J6117
$$ 181287 201682 198008 188718 182216 172847 160838 169025 156063 134191 131377 159891 175862 191979
18252A91979L5262j773j7030J5475P061k475l361M4722O1306O0122Q9241Q1010
$$ 191979 227241 225468 208438 223913 230974 228499 225138 269860 331166 391288 480529 561539
18240E61539O6073O8658R5723J60276K92672M72028N12196M31099l8846n63080
$$ 561539 627612 696270 791993 952269 1244941 1716969 2229165 2660264 2621418 2058338
18230B058338m81010k21303n5808L8044J92782L76579M87646M68219J02382n71363
$$ 2058338 1577328 1356025 1300217 1338261 1531043 1907622 2395268 2863487 2965869 2394506
18220B394506p01417l89405k00049j24948o3262o2200q1227l7445o475J6323M599
$$ 2394506 1693089 1303684 1103635 978687 915425 853225 771998 734553 728078 744401 749000
18209G49000L0523M5947Q5994O8335J0277n0868k9688Q56K9550P4543J08291J07182
$$ 749000 779523 825470 911464 979799 990076 939208 909520 910376 939926 1014469 1122760 1229942
18197A229942J17300J22594J52775J49442J86586K08133K45240K88495L75074
$$ 1229942 1347242 1469836 1622611 1772053 1958639 2166772 2412012 2700507 3075581
18188C075581M16200N38847P58280J025116J575951K807861M692406O079990O313064
$$ 3075581 3491781 4030628 4788908 5814024 7389975 10197836 14890242 20970232 27283296
18179B7283296K421471o894488q878558m837029k398410j345430q03358n14002
$$ 27283296 29704767 22810279 13931721 9094692 6696282 5350852 4547494 4033492
18171D033492l18878j96510j33177j01842j75357k38950k75531k60026j96663
$$ 4033492 3714614 3518104 3384927 3283085 3107728 2868778 2593247 2333221 2136558
18162B136558j61762j37023j50571j59232r9504m4101m9873o3438k8486m6018
$$ 2136558 1974796 1837773 1687202 1527970 1428466 1384365 1334492 1271054 1242568 1196550
18152A196550m5228n2695n5477k3896k9028n644M5087J3218O192R353J0364N8278
$$ 1196550 1151322 1098627 1043150 1019254 990226 984582 1029669 1042887 1049079 1058432 1068796 1127074
18140A127074P0046P2077Q0465N4573Q3613J37980J73737J78907K43407L90591
$$ 1127074 1197120 1269197 1349662 1404235 1487848 1625828 1799565 1978472 2221879 2612470
18130B612470N17236P24062J110576J743335K311913K442471J351355j858021
$$ 2612470 3129706 3853768 4964344 6707679 9019592 11462063 12813418 10955397
18122A0955397l113624j718057o18478j00928J46587K65198M19212O84054J023084
$$ 10955397 7841773 6123716 5505238 5404310 5550897 5816095 6235307 6919361 7942445
18113G942445J562050K593749M526916O723106P708056O346755k360759j0815884
$$ 7942445 9504495 12098244 16625160 23348266 31056322 37403077 35042318 24226434
18105B4226434q548651m378510k266952j287360p56651m56093l36758l49303m02303
$$ 24226434 15677783 11299273 9032321 7744961 6988310 6532217 6195459 5846156 5443853
18096E443853k13338Q8014J87362K71301N97390J299136K074946K426700J948186
$$ 5443853 5230515 5318529 5505891 5777192 6374582 7673718 9748664 12175364 14123550
18087A4123550r90526m088061l228380j623726q31871n21597l79795k32050j31439
$$ 14123550 13133024 9044963 5816583 4192857 3360986 2839389 2459594 2227544 2096105
18078B096105j09992r5989n5807o8736r1587j21390j55501j13131j00158j41082
$$ 2096105 1986113 1890124 1834317 1765581 1673994 1552604 1397103 1283972 1183814 1042732
18068A042732j26036k6134k3240j6731l0314l0563n5526o1130m2771p1434o9125
$$ 1042732 916696 890562 867322 850591 820277 789714 734188 673058 630287 558853 489728
18057D89728J4052M9304K1948J8211p185L514M913J6812J6795k4211J4157M6022
$$ 489728 503780 553084 575032 593243 586058 589572 594485 611297 628092 603881 618038 664060
18045F64060L970j8021j648J1570P024K527j788j8512j0488K2190k6167l4179
$$ 664060 668030 650009 648361 659931 666955 669482 667694 649182 638694 660884 634717 600538
18033F00538j1453M927K5763K7430P004j7864j5299K6785R341j4607p966k6353
$$ 600538 589085 594012 619775 647205 654209 636345 621046 647831 657172 642565 634599 608246
18021F08246l036L1933K3962J8232O957M6255M8018K8636L0032Q184J3274k9485
$$ 608246 605210 637143 661105 679337 686294 732549 780567 809203 839235 847419 860693 831208
18009H31208j776J1215m4467m0894J9493N8471R7590Q3250O2893N0497J5985n980
$$ 831208 829432 840647 796180 755286 774779 833250 930840 1014090 1076983 1127480 1143465 1137485
17997A137485k9948l1324K3088N2180M1433P1669J10342Q6105N1858M8557N0457
$$ 1137485 1107537 1076213 1099301 1151481 1192914 1264583 1374925 1461030 1512888 1561445 1611902
17986A611902Q8894L0327M6262O9943J14410K01228K09915K16723K26115J74481
$$ 1611902 1700796 1731123 1777385 1847328 1961738 2162966 2372881 2589604 2815719 2990200
17976B990200K26765L52757M01457M68121N84472Q49802J169991J294019J239014
$$ 2990200 3216965 3569722 3971179 4439300 5023772 5873574 7043565 8337584 9576598
17967I576598Q28590M48683R48913J572229J780320J442996J306327J932965K588423
$$ 9576598 10405188 10853871 11802784 13375013 15155333 16598329 17904656 19837621 22426044
17958B2426044K958287L012511K862795L417500M531372N572330O212055O902253
$$ 22426044 25384331 28396842 31259637 34677137 39208509 44780839 50992894 57895147
17950E7895147R041445J2274830J6291686K3206840L7919543O3571146Q7237919
$$ 57895147 66936592 79211422 95503108 118709948 156629491 220200637 307438556
17943C07438556R4696087O5632651m8849449j20985926p7124692l1139720n426218
$$ 307438556 402134643 467767294 418917845 297931919 220807227 189667507 184241289
17936A84241289J6494787M5257318P6600460R1545143Q0179933j5330646j31332096
$$ 184241289 200736076 245993394 322593854 414138997 494318930 478988284 347656188
17929C47656188j17083254o3937609l6324382k2480064j4921006j0186754o977904
$$ 347656188 230572934 166635325 130310943 107830879 92909873 82723119 75745215
17922G5745215n115045m059206l852683m375135m946659n239689m825353m359296
$$ 75745215 70630170 66570964 62718281 58343146 53396487 48156798 43331445 38972149
17914C8972149m152200l439546k664286k180210k160943k332102k023416j620909
$$ 38972149 34819949 31380403 28716117 26535907 24374964 22042862 20019446 18398537
17906A8398537j318741j283291j606156j580530j207544j020475r09695p28755
$$ 18398537 17079796 15796505 14190349 12609819 11402275 10381800 9472105 8743350
17898H743350o37087o44342o35636n58958m51485l70743l13827l32941l95386
$$ 8743350 8106263 7461921 6826285 6267327 5815842 5445099 5131272 4798331 4402945
17889D402945l56048k57201k32537k25286k39072j82889j19465r9763j27566j32174
$$ 4402945 4046897 3789696 3557159 3331873 3092801 2909912 2790447 2690684 2563118 2430944
17879B430944j40177j51166j81422j72697j34018q2901m7715j3032K9040L0265
$$ 2430944 2290767 2139601 1958179 1785482 1651464 1568563 1520848 1507816 1536856 1567121
17869A567121R815l4338m4259m0792o9077n6729m9570m3746l7043o303J3528l37
$$ 1567121 1576936 1542598 1498339 1457547 1388470 1331741 1282171 1238425 1201382 1195079 1208607 1208270
17857A208270N6437Q1804P4708J5345p0533n7676p4289l9436j0552k5483j9865
$$ 1208270 1264707 1346511 1421219 1436564 1366031 1308355 1234066 1194630 1184078 1158595 1138730
17846A138730L4839M7611L6245l041O11j0617p950j6466o1569n2141M370J8325
$$ 1138730 1173569 1221180 1257425 1254384 1254995 1244378 1236428 1219962 1158393 1106252 1110622 1128947
17834A128947K8648N9990N6289O838o180J4767J2036L2689M9476k7858j78916
$$ 1128947 1157595 1217585 1273874 1280712 1274532 1289299 1301335 1334024 1383500 1355642 1176726
17823A176726l53545k15356N0933J21719J52553J49335J43392P4546L3631j99003
$$ 1176726 823181 607825 658758 780477 933030 1082365 1225757 1300303 1333934 1134931
17813A134931m01824l67850o2967N5773Q1775R9348J22566L8907M6355O319m1754
$$ 1134931 733107 365257 302290 358063 439838 539186 661752 700659 747014 753333 711579
17802G11579k3532K512L4924L8073L2019M3989L5270l7629k6910N3850L1679O6678
$$ 711579 688047 690559 725483 763556 795575 839564 874834 837205 810295 864145 895824 962502
17790I62502O8519M8237l2648j60054k75329k15809m7529R9131J14720O7811O3156
$$ 962502 1031021 1079258 1046610 886556 611227 395418 347889 447020 561740 629551 692707
17779F92707M2904k2461j34783k62178k65982q6167O4486P9188N5738L701K2166
$$ 692707 735611 713150 578367 316189 50207 -35960 28526 107714 163452 167153 189319
17768A89319K4392L7730N6192M9149K3129o779p139m0217m3275k3928k4690Q930
$$ 189319 213711 251441 307633 356782 379911 373132 365993 325776 282501 258573 233883 242813
17756B42813O4911L3837L6925P2892P2599j9433j05891m8740m3150m9605J9750
$$ 242813 307724 341561 378486 451378 523977 504544 398653 349913 306763 257158 276908
17745B76908J01835R2330Q7420R1722K9953k65j6364j6066l7631k5706J084J6297
$$ 276908 378743 471073 558493 650215 680168 679903 663539 647473 609842 584136 585220 601517
17733F01517k5733k2052M2659Q2746Q8545R1068N7979J5879k1931k8079j6193
$$ 601517 575784 553732 596391 679137 767682 858750 916729 932608 910677 882598 866405
17722H66405J3030L3320L9798K8249P4433Q1635O7689O2172N1983N7675J09410
$$ 866405 879435 912755 952553 980802 1055235 1136870 1204559 1266731 1318714 1376389 1485799
17711A485799R7368R6815Q0975R9649J78218K04391K18088K00359J82619K60999
$$ 1485799 1583167 1679982 1760957 1860606 2038824 2243215 2461303 2661662 2844281 3105280
17701C105280M15949N47625N36108O69632R69601J164852J155666O75673O7792
$$ 3105280 3521229 4068854 4604962 5274594 6244195 7409047 8564713 9240386 9308178
17692I308178K38547Q49199J362042J600739J843087K239509K643051K926611
$$ 9308178 9546725 10395924 11757966 13358705 15201792 17441301 20084352 23010963
17684B3010963K841181K499617K807485L661608M654210N761440O916969Q425569
$$ 23010963 25852144 28351761 31159246 34820854 39475064 45236504 52153473 60579042
17676F0579042J1009710J4509586J8971889K6858162M2974144O9854839R3175144
$$ 60579042 71588752 86098338 105070227 131928389 174902533 244757372 337932516
17669C37932516R9375838O0433296o6826903j29687325p7121115l0157036m023750
$$ 337932516 437308354 497741650 430914747 301227422 224106307 193949271 189925521
17662A89925521J7149081M2992745O9694030Q2443851O8482685k8407297j27183568
$$ 189925521 207074602 250067347 319761377 402205228 470687913 442280616 315097048
17655C15097048j03434966n5425318l1125110j9166257j3406972j0652348q303623
$$ 315097048 211662082 156236764 125111654 105945397 92538425 81886077 73582454
17648G3582454o217120m723475l826610l864821m508626m899543m572659m298132
$$ 73582454 67365334 62641859 58815249 54950428 50441802 45542259 40969600 36671468
17640C6671468m223112l610308k953141k461748k021552j612801j421952j252881
$$ 36671468 32448356 28838048 25884907 23423159 21401607 19788806 18366854 17113973
17632A7113973j105454j191924j498983j393704j081834r63100q56812p12096
$$ 17113973 16008519 14816595 13317612 11923908 10842074 9878974 9022162 8310066
17624H310066o11052n93936n80089n02924l99816l24789k94252l35297m08833
$$ 8310066 7699014 7105078 6524989 6022065 5622249 5297460 5003208 4667911 4259078
17615D259078m00108k76234k22647k21295k08668j79218j15662p6023p0350p4646
$$ 4259078 3858970 3582736 3360089 3138794 2930126 2750908 2635246 2559223 2488873 2414227
17605B414227j02605j01591j38987j11795n1972j7605P411K4370Q0364J41594
$$ 2414227 2311622 2210031 2071044 1959249 1907277 1889672 1897083 1921453 2001817 2143411
17595B143411J39557J11267J06961J23483J78221L02781M31786O88758J265390
$$ 2143411 2282968 2394235 2501196 2624679 2802900 3105681 3537467 4226225 5491615
17586E491615K120920K623062K579705N47600l098927l464288j900027r71352
$$ 5491615 7612535 10235597 12815302 13362902 10263975 6799687 4899660 3928308
17578C928308n61458l87088k15954q7421q5220j05299r2846r6533j15182r9097
$$ 3928308 3366850 2979762 2763808 2676387 2591167 2485868 2393022 2296489 2181307 2082210
17568B082210p3095o3488n6053o4717m1167j3270k4223k3990J0936L0990Q2493
$$ 2082210 2009115 1945627 1889574 1824857 1783690 1770420 1746197 1722207 1733143 1764133 1846626
17557A846626J17716J26453J76242K59826L55550N51475R02367J535023K126166
$$ 1846626 1964342 2090795 2267037 2526863 2882413 3433888 4336255 5871278 7997444
17548G997444K337108J643084j334996l238867k155862j184787p29883l74858
$$ 7997444 10334552 11977636 10642640 7403773 5247911 4063124 3333241 2958383
17540B958383k77001k41530j73458j12676p6746k3968j2016p3655j47663p6561
$$ 2958383 2681382 2439852 2266394 2153718 2076972 2053004 2040988 1967333 1819670 1743109
17530A743109j20540j55504r9793q7973o3142o3761n9876j6781N014K9616K0279
$$ 1743109 1622569 1467065 1367272 1279299 1216157 1152396 1092520 1075739 1080753 1110369 1130648
17519A130648j2341J5315J3803L9696k772n7212j59501k93024k18227k4876K2486
$$ 1130648 1118307 1133622 1147425 1187121 1184349 1127137 967636 674612 456385 431509 453995
17508D53995K5651P1571N7718l5186n4621j01796k66036k67354r3428K6565L5549
$$ 453995 479646 551217 608935 573749 519128 417332 151296 -116058 -209486 -182921 -147372
17497a47372J4871J3623N0718M9309J3218L886m23L649l644k5008n5590j7467
$$ -147372 -132501 -118878 -68160 -18851 -5633 -1747 -2170 1479 -2165 -27173 -82763 -100230
17485a00230o909m0650k3185L0432P5103P6728P7645J2403k8513m2272l7779l0599
$$ -100230 -107139 -147789 -170974 -140542 -65439 11289 88934 101337 72824 30552 -7227 -37826
17473c7826j5725J8124J4840M7766O3039P0052P622n2351p0939j0532o473K017
$$ -37826 -53551 -35427 -20587 27179 90218 160270 167892 115541 44602 34070 27597 29614
17461B9614K2091K8282M0876K9026L1485P120r115J5642N2393O0870M6172J12771
$$ 29614 51705 79987 120863 149889 181374 188494 179379 195021 247414 308284 354456 467227
17449D67227J96985K86208K95888J89907k28895l71141j99304p8149o4641p5860
$$ 467227 664212 950420 1246308 1436215 1207320 836179 636875 558726 494085 418225
17439D18225p6012o4898l6844k096J1205r501k3356j8931K1096J13j1099p972
$$ 418225 342213 277315 240471 238375 249580 240079 216723 197792 218888 219001 207902 199930
17427A99930k0936j3775p584k0016k9449N402K7887N563K1312p180o434P587k49
$$ 199930 178994 165219 157635 137619 108170 113572 141459 147022 168334 161154 154720 162307 162058
17414A62058J1640K486j2834q654j5086l5056j6628j6000J3637K0125P820j015
$$ 162058 173698 176184 163350 154696 139610 104554 87926 71926 85563 105688 113508 112493
17402A12493j0638J3479K3031n142k5880q013K9334K9605j0623l5058n2408O755
$$ 112493 101855 115334 138365 133223 107343 99330 128664 158269 147646 112588 60180 66935
17390F6935K157l5349o898J1541J9740J4346L5154j0588l0431l433K407M827j5776
$$ 66935 69092 33743 26845 38386 58126 72472 107626 97038 66607 63174 65581 70408 54632
17377E4632k1106l0943m5475o182L0287L9720J3509K73K5802J7485n477J2387
$$ 54632 33526 2583 -42892 -49074 -18787 20933 34442 34715 60517 78002 72525 84912
17365H4912J2355L883j4684q365n758p354J755J3030J5797K8541J1380M320J392
$$ 84912 97267 101150 86466 78101 72343 64989 66744 79774 95571 124112 135492 139812 141204
17352A41204j1095l0032J565K2134p596P614J9043J85k2613J3347J6256J3189
$$ 141204 130109 100077 101642 123776 116180 123794 142837 143022 120409 133756 150012 163201
17340A63201K2103K3827K6128L3816M2239J6766L2315Q2008R2618J43366K20895
$$ 163201 185304 209131 235259 269075 311314 328080 360395 442403 535021 678387 899282
17329H99282L43300N09351N75548M48191j13211o92040n50222k46667q2638K9939
$$ 899282 1242582 1751933 2327481 2775672 2662461 1970421 1420199 1173532 1090894 1120833
17319A120833J76367L42767M72310M14659O4863n65687o67429m03417k13109j16492
$$ 1120833 1297200 1639967 2112277 2526936 2591799 2026112 1358683 955266 742157 625665
17309F25665r7960n2812l9851j6789l3658n0467k0532j4336k8990l0503j5743
$$ 625665 527705 474893 435042 418253 384595 334128 313596 299260 270270 239767 224024
17298B24024p377k2028k2371k9613m364p006k040P077P53l4632l5320k3731j3343
$$ 224024 216647 194619 172248 142635 138271 131265 129225 136302 137055 102423 67103 43372 30029
17285C0029p294J4503J9408l097k1985J0617M277J9895k730k2885j6342N153J3038
$$ 30029 22735 37238 56646 53549 31564 42181 46458 66353 63623 40738 24396 29549 42587
17272D2587m959K1277K1724M444k2846j2539N067k612j8127k0743Q217o184J5605
$$ 42587 37628 58905 80629 85073 62227 49688 54755 52143 34016 13273 21490 15306 30911
17259C0911N132K1023J902J753j3420k1450J712P567K6861k1593k4337j42M433
$$ 30911 36043 57066 58968 60721 47301 25851 27563 35130 61991 40398 16061 15919 20352
17246B0352o858j1326J8339J1095L892j4477l3429j9084j6735J6382O548R94K4794
$$ 20352 13494 2168 20507 31602 35494 21017 -12412 -31496 -48231 -31849 -25301 -24307 487
17233D87K093k835J5761r537j7695K1049j4424k933k4663M731K1509J4860M518
$$ 487 2580 -255 15506 5969 -11726 9323 -5101 -8034 -32697 -27966 -6457 8403 12921
17220A2921R152n331j2896J5150j6858k3075k3573K001K65J3308N0163J0252Q288
$$ 12921 22073 16742 3846 18996 2138 -20937 -44510 -42509 -42244 -28936 21227 31479 39767
17207C9767r443l0715K036Q276N82M718k177M374K1592N312q790k1028k2122k708
$$ 39767 30324 -391 1645 9921 10503 15221 13044 17418 39010 44322 35532 14504 -7618 -10326
17193a0326q636J6156K667K7968J2769l135Q198L419P603r474k2391p843P192
$$ -10326 -18962 -2806 -139 27829 40598 37463 45661 49080 56683 47209 24818 16975 24167
17180B4167r012P17k701j3335r716L2878L2970j9824l8207N512J4291O844k1947
$$ 24167 15155 15872 13171 -164 -9880 22998 55968 36144 -2063 3449 17740 24584 2637
17167B637r882L4174J9283J0271j6495j3087j1972j3000J755Q157K6007R010j2273
$$ 2637 -7245 26929 46212 56483 39988 26901 14929 1929 3684 11841 37848 46858 34585
17154C4585k7819J4377o455J2281q087j0509M08J6248J4304K1805J0742j0575
$$ 34585 6766 21143 14688 26969 18882 8373 8781 25029 39333 61138 71880 61305
17142F1305k3808j1766K769j9539N616K9157K4911M832Q754O490j5926o814j0993
$$ 61305 37497 25731 28500 8961 14577 43734 68645 73477 82231 88721 72795 65981 54988
17129E4988p395J5565r586l6427L8673N7142j5706n2187l8076j7345K8320L9712
$$ 54988 47593 63158 53572 17145 55818 112960 97254 45067 6991 -10354 17966 57678
17117E7678J3944N615K5464K0433J1079J4169O831j6305P053K8023L8843M6999
$$ 57678 71622 77237 102701 123134 134213 148382 155213 138908 145961 173984 212827 259826
17105B59826O4611J02665J16715J55928K32930L55715N07343N49911K87934l69385
$$ 259826 324437 427102 543817 699745 932675 1288390 1795733 2345644 2633578 2264193
17095B264193o63710l88542j50711m0J15648K25239L69366M44016L87819j38673
$$ 2264193 1600483 1211941 1061230 1061190 1176838 1402077 1771443 2215459 2603278 2464605
17085B464605o97083n72157l25059j82649j03058q4486m9940m7807j9231m4372
$$ 2464605 1767522 1195365 870306 687657 584599 500113 450173 402366 383135 338763
17075C38763j2870K93k5737k3501k3053j5622J175k5452k3089k0878j7562l5884
$$ 338763 325893 326186 300449 276948 253895 238273 239448 213996 190907 170029 152467 116583
17063A16583p72k400J682l3054j3918R650J8636m035J8859j0538j6890k999Q094
$$ 116583 115811 113411 115093 82039 68121 77771 96407 92372 111231 100693 83803 80804 88898
17050H8898k2259k3416j7425K886k831n844L371M02J0110r115j0648m458j0749
$$ 88898 66639 43223 25798 28684 25853 20009 23380 23782 33892 24777 14129 9671 -1078
17037a078Q933k764O88J7496m276j759j2710k675K0651O625r384j322N072m6P394
$$ -1078 7855 5091 5779 23275 18999 17240 4530 1855 22506 29131 19747 18425 23497 23451 30845
17022C0845L0385J7137K816j4603k641j7491q767o755k3585k3925o233K4068K1364
$$ 30845 61230 78367 81183 66580 63939 46448 37681 30926 7341 -16584 -22817 1251 22615
17009B2615j115n374r113N326r664r277j1758Q110K8421J0937r632J392Q445j7599
$$ 22615 21500 16126 7013 12339 2675 -6602 -18360 -10250 18171 29108 19476 20868 29313 11714
16995A1714q708j4767j6733K4089J8748J7891Q585m125M584J4837M4396k6136
$$ 11714 3006 -11761 -28494 -4405 14343 32234 40819 36694 41278 56115 100511 74375
16983G4375k5430P055j1148n362q60q046k703m17r929N25p415Q8Q863o228o593
$$ 74375 48945 56000 44852 39490 38630 30584 27881 27464 17535 18060 10645 10733 19596 13368 6775
16968F775J0250P358r707K6719J1861j7686p293j2439j4003L784j6280j4634j0514
$$ 6775 17025 24383 14676 41395 53256 35570 28277 15838 1835 5619 -10661 -25295 -35809
16955c5809K3403M0884J6505p305K578k033j6368k4399K960J2082k0553O146j3137
$$ -35809 -12406 28478 44983 37678 40256 38223 21855 -2544 416 12498 -8055 -1909 -15046
16942a5046j0837L1362Q493K1372J2711R703j3821N871K403j2351K2609k0199
$$ -15046 -25883 5479 13972 35344 48055 57758 43937 49808 52211 39860 62469 42270
16930D2270k2450r549j5611k5090N828J0077O066J2322J7221l512k3915J4369
$$ 42270 19820 10271 -5340 -30430 -24602 -14525 -8459 3863 21084 17572 -6343 8026
16918H026j266k0917L780o051L146O259P015J2193P130l985K010J3983O53j2893
$$ 8026 6760 -14157 -10377 -16428 -13282 -7023 -8 12185 19315 15330 17340 31323 31976 19083
16904A9083l0221m670P913j670o265n59J5318K7134j4204J0404k1545j6209J3946
$$ 19083 -11138 -15808 -7895 -9565 -15830 -16389 -1071 26063 11859 22263 718 -15491 -1545
16891a545m722R1J3345Q222m804N412P96l1687k4740n560J4337p002o831m55Q165
$$ -1545 -6267 -6176 7169 15391 10587 15999 16795 -14892 -39632 -45192 -30855 -37857 -44688 -45143 -36978
16876c6978J3427n973K423M608J2852Q368M909O593q235k174M78o769q189J8866
$$ -36978 -23551 -29524 -27101 -22493 -9641 -1273 3636 10229 1994 -180 298 -6471 -14660 4206
16862D206r403k1627N253J6352L65J4330R093l9094J0043Q506j2952p807L0669
$$ 4206 -5197 -26824 -21571 -5219 -4854 9476 18569 -20525 -10482 -1976 -14928 -22735 7934
16849G934J4093K1193K0509k1968k1296o066p323j6540M995p670P272K9328Q906
$$ 7934 22027 43220 63729 41761 20465 14399 7076 -9464 -4469 -12139 -4867 24461 33367
16836C3367P131k246k4231j9463K822j3780j9064O896q751q848K8373K3018J1978
$$ 33367 40498 38252 14021 -5442 -2620 -16400 -35464 -28568 -37319 -46167 -17794 5224 17202
16823A7202l636R013j6448r573j5992J0785k131j938K1563J8089o268j3466j3826
$$ 17202 13566 22579 6131 -3442 -19434 -8649 -10780 -12718 8845 26934 20666 7200 -6626
16810f626j388L228L744K7441L9R054r067l4309Q720m150J3409L760j0339k444
$$ -6626 -8014 -4786 -1042 26399 26438 35492 26425 -7884 836 -3314 10095 13855 3516 1072
16796A072J5867l622k3553j5193o164K3815O315K2035K4206j1682j7955k0341
$$ 1072 16939 13317 -10236 -25429 -31593 -7778 -1463 20572 44778 33096 15141 -5200
16784e200M751n148p69K6143k5676j8786O73J6042m103q001O868l464k8439j9004
$$ -5200 -449 -5597 -6366 19777 -5899 -24685 -24012 -7970 -12073 -20074 -13206 -16670 -45109 -64113
16770f4113n797K5123K2148M533P283R886M329m284K1439j7642q447Q392M866
$$ -64113 -69910 -44787 -22639 -18106 -10823 -937 3392 -892 20547 2905 -5542 2850 7716
16757G716l4974j5498J9141L9478L270R110k077k533j9621N131m309j2301R028
$$ 7716 -27258 -42756 -23615 15863 19133 28243 26166 23633 4012 9143 4834 -7467 1561
16744A561L1448L5897k1623j7547k444L429j9529o271k4293q632Q429j0735j4473
$$ 1561 33009 68906 47283 29736 27292 30721 11192 4921 -19372 -28004 -19575 -30310 -44783
16731d4783p96K2106L2127J2634k853M800n287q158j3086J9856q45k1659K542
$$ -44783 -45579 -23473 8654 21288 18435 23235 17948 9790 -3296 16560 15715 -5944 -3402
16718c402J8556l682J355j4176o799k9315J9540J7891o765j4424J6572N316Q692
$$ -3402 15154 11472 12827 -1349 -8148 -37463 -17923 -32 -6797 -21221 -4649 667 9359
16705I359n910M478j081j4457j8667J284L072j0412k376N137O69O124O086o640
$$ 9359 3449 7927 6846 -7611 -26278 -24994 -21922 -32334 -34710 -29573 -28904 -22780 -16694 -23334
16691b3334K352J060j0252L633j5257n342J4173J1498M779J6529N239P836J1376
$$ -23334 -20982 -19922 -30174 -26541 -41798 -47140 -32967 -21469 -16690 -161 5078 12914 24290
16678B4290Q137l986j2490L022J2651N673o118j1582j0146j2392L371j6876k4726
$$ 24290 32427 28441 15951 18973 31624 37297 31179 19597 9451 -2941 430 -16446 -41172
16665d1172q74J3946J6672J2890Q03q97j7880O578N648J0973J2859J651o205j631
$$ -41172 -42046 -28100 -11428 1462 2265 1368 -16512 -9934 -4286 6687 19546 21197 14992 13361
16651A3361j2750k523P74k7530j0707M421J7556j0653k0657J3485K9796M63j0535
$$ 13361 611 -1912 -1138 -28668 -39375 -34954 -17398 -28051 -48708 -35223 -5427 -4964 -15499
16638a5499L0919P195m631j7443j7512r671J7992j3027o339L260J9635J1289m142
$$ -15499 15420 22615 17984 541 -16971 -26642 -8650 -21677 -28016 -24756 -5121 6168 2026
16625B026l674p967J4327R537p442M887l1077j6352K3283K6938p047k8485L0420
$$ 2026 -1648 -9615 4712 14249 6807 11694 -19383 -35735 -12452 14486 7439 -21046 9374
16612I374K5294Q125l883o480k2669j6522J4632J5015j8693J2491k2605k1969
$$ 9374 34668 42793 38910 32430 9761 -6761 7871 22886 4193 16684 -5921 -27890
16600b7890R326N17m186K7138j4530j4189J0954K9847j5013M816k695K839o59
$$ -27890 -18564 -18047 -22233 4905 -9625 -23814 -12860 16987 1974 6790 4095 6934 6275
16587F275J5186J5723k3661j5134K9047Q083r92j0199l0081r700p2n575l441k470
$$ 6275 21461 37184 13523 -1611 27436 35519 34527 24328 -5753 -15453 -15525 -21100 -24541 -27011
16573b7011p746L183L426J5936J5126M11j1926O759k473J0145K3305K233K853
$$ -27011 -34757 -31574 -28148 -12212 2914 3325 -8601 -1842 -4315 5830 29135 31368 34221
16560C4221r259o237j0431K335j5712k2379j6552j5377N385J4485J515P522J9619
$$ 34221 24962 18725 8294 10629 -5083 -27462 -44014 -59391 -54006 -39521 -38006 -30484 -10865
16547a0865R296N730q058k0439J4006L1508j338k2898j8226J2290o031O158J2384
$$ -10865 -1569 4161 -3897 -24336 -10330 21178 19840 -3058 -21284 -8994 -15025 -8867 3517
16534C517Q270q453k0225K2958J4282j917j0185j014m851j584o137j0330j885
$$ 3517 11787 3334 -16891 6067 20349 18432 8247 7233 2382 798 -5339 -15669 -17554
16521a7554q644K9157K3330q210k3146K362k4896j5639M536P75K311J9154j6376
$$ -17554 -26198 2959 26289 18079 -5067 -2705 -27601 -43240 -38704 -37929 -35618 -16464 -32840
16508c2840J2523M1671j0337j0496M633j7849P617Q014R451N286o485j0222k7893
$$ -32840 -20317 21354 11017 521 5154 -12695 -5078 2936 12387 17673 11188 966 -26927
16495b6927j0180J1103J3878Q035P298J9967l32j2916j710J7535j0034j6224L705
$$ -26927 -37107 -26004 -12126 -4091 3207 23174 22842 9926 8216 25751 15717 -507 3198
16482C198j1152j0819k347N005K9605J6183K899l699k3412K640N940n330k575
$$ 3198 -7954 -18773 -21120 -16115 13490 29673 32572 28873 5461 8101 14041 8711 6136
16469F136R88j0600o913p237K1680L3409Q806l4517k5861J7055J6487J2982j9618
$$ 6136 7124 -3476 -10389 -17626 4054 37463 46269 11752 -14109 2946 19433 32415 12797
16456A2797j0580P719p839j4361j0752K0592J5733j6669j4031q051j1004j4066
$$ 12797 2217 9936 2097 -12264 -23016 -2424 13309 -3360 -17391 -25442 -36446 -50512
16444e0512j6766K2352K7080j1688k4441M201K7642J2412j1496j9386K7135J0485
$$ -50512 -67278 -44926 -17846 -29534 -53975 -49774 -22132 -9720 -21216 -40602 -13467 -2982
16432b982J1738n518k2664j5039J5206M657j0109N213j4509o107K167J1414N241
$$ -2982 8756 3238 -19426 -34465 -19259 -14602 -24711 -19498 -34007 -40114 -37947 -26533 -21292
16419b1292j2976o505K4578R067k4184l5214l381k8486L91K7450K2477L0699K5151
$$ -21292 -34268 -40773 -16195 -7128 -31312 -66526 -69907 -98393 -98002 -70552 -48075 -17376 7775
16406G775j2752j3630O494J4551n659r361J3329O771q975q95m632k4814j2658
$$ 7775 -4977 -18607 -12113 2438 -3221 -12582 747 7518 -1457 -2352 -6984 -31798 -44456
16393d4456K2428J2862k9395j15J0118o302j5506J7105J1785j9808J1437J8816
$$ -44456 -22028 -9166 -38561 -38676 -28558 -34860 -50366 -33261 -21476 -41284 -29847 -11031
16381a1031O890K5183J8595l8923l5621K6277J9742j4032j5588J6001n337K685
$$ -11031 -4141 21042 39637 714 -34907 -8630 11112 -2920 -18508 -2507 -7844 -5159
16369e159J7656J0532j3160P44n854k3671l5902J0563K2082J1572J1436J1095
$$ -5159 12497 23029 9869 10613 4759 -18912 -54814 -44251 -22169 -10597 839 11934
16357A1934n867r183r468j4067m69M807J371J7708K5382O222m692n144m141j7835
$$ 11934 6067 -3116 -12584 -26651 -27120 -22313 -20942 -3234 22148 28370 23678 18534 14393 -3442
16343c442O973J7821M898J5714J7855j3565l989q729l2240r799n860K2036o242
$$ -3442 3531 21352 26250 41964 59819 46254 42265 33536 1296 -8503 -14363 7673 1431
16330A431j5083j2015k1180Q853K2975P149K1578q916L523L009k6919J8242K0797
$$ 1431 -13652 -25667 -46847 -37994 -15019 -7870 13708 4792 8315 11324 -15595 2647 23444
16317B3444q718j447J0236K822o27q194j4234L219M360J7822J8327K1860k7390
$$ 23444 14726 13279 23515 26337 25710 17516 3282 6501 10861 28683 47010 68870 41480
16304D1480l1405k6244J4981L2722o960n0080J1356M3430P412p744l074N148m418
$$ 41480 10075 -16169 -1188 31534 24574 -25506 -14150 29280 36692 28948 25874 31022 26604
16291B6604K2174K341k2613j0722k250k6413l607m450K520M925j7245J597q65
$$ 26604 48778 51119 28506 17784 15534 -10879 -14486 -18936 -16416 -11491 -28736 -27139 -28004
16278b8004J1629p100j4764J4886J7344j383o543n335j3359n193j0014Q109L2500
$$ -28004 -16375 -23475 -38239 -23353 -6009 -7392 -13935 -19270 -32629 -37822 -47836 -39727 -7227
16265g227o51n018J5763L1925m98k801l9502k6879J060J4998j042J8909k929J7221
$$ -7227 -7878 -12896 2867 34792 34294 31493 -8009 -34888 -33828 -18830 -19872 -963 -3892 13329
16251A3329j3682J3134l840j5236q416pK624K4738o620n061Q308J1885l923Q931
$$ 13329 -353 12781 8941 -6295 -14711 -14718 -12094 12644 6024 963 9271 21156 17233 26164
16237B6164j3421k842j1295P01n509Q465M671q23J3000l04j6372q17M382k180
$$ 26164 12743 9901 -1394 -693 -6202 2263 6934 6111 19111 18807 2435 1618 6000 3820
16223C820L397L429R438j3015o80m486O738J1230K3625q160M724l800k5849o733
$$ 3820 7217 10646 20084 7069 6389 1903 8641 19871 43496 35336 40060 36260 10411 3678
16209C678J1390R298l3125K169K5435N663J902o738P376p62k0092j9063p822m546
$$ 3678 15068 24366 -8759 -6590 18845 24508 26410 19672 27048 26286 6194 -12869 -20691 -25237
16195b5237k041L006l742j3441k6048N441K2151K4025K5296J5903J281o320j0673
$$ -25237 -27278 -24272 -28014 -41455 -67503 -62062 -39911 -15886 9410 25313 26594 20274 9601
16182I601j5385P520K7595j3482j7804j6070J3721j8923j3291M510K4845L7934
$$ 9601 -5784 1736 29331 15849 -1955 -18025 -4304 -23227 -36518 -32008 -7163 30771
16170C0771o073j5201L210N535J2087j2394j4725P82J342K087L374m784P278R354
$$ 30771 24698 9497 12707 18242 30329 17935 3210 3992 5334 7421 10795 6011 13289 22643
16156B2643n922m787m340k822j404R108j3711q458K199r144o586K3207J2948p280
$$ 22643 16721 11934 7594 4772 3368 12476 -1235 -9693 -7494 -16638 -23224 -17 12931 5651
16142E651j060K4072J2541J018k397j0252j2283k7955Q36K5947J9320l763r506
$$ 5651 4591 28663 41204 42222 39825 29573 17290 -10665 -9829 16118 35438 31675 22169
16129B2169R73k5195R476j5636j3588R881J7093J52j2179o467N506o515j2851
$$ 22169 23142 -2053 7423 -8213 -21801 -11920 5173 5325 -6854 -13321 -7815 -14330 -27181
16116b7181J2236J5153j21l3q022L394Q43o395j7062J1590J229k7318j6421Q373
$$ -27181 -14945 208 87 54 -7968 -4574 -3731 -10126 -27188 -15598 -14369 -41687 -58108 -49735
16102d9735L017n58K489k346j9790R539L0274K3282J8349j0075N835p787j2697
$$ -49735 -46718 -47276 -44787 -47133 -66923 -57384 -27110 -3828 14521 4446 10281 2494 -10203
16089a0203J3546r636k6788j6733N310K0078r962k4232M33L4873R236K3225P539
$$ -10203 3343 -6293 -33081 -49814 -44504 -24426 -34388 -58620 -58187 -23314 -14078 9147 16686
16076A6686P934O821j9720O90J3767j6069J6579j487j5863q106k4322o172m282
$$ 16686 24620 31441 11721 12411 26178 10109 26688 25201 9338 1232 -23090 -29262 -33544
16063c3544J9654K544o603P822j097j1488j685J1728J4062J6800L902l437o502
$$ -33544 -13890 -11346 -17949 -10127 -11224 -22712 -24397 -12669 1393 18193 22095 18658 12156
16050A2156o731P634j4033q551k551o526n88J2920J4902o999r836L22J0378n49
$$ 12156 5425 13059 -974 -9525 -12076 -18602 -19190 -6270 8632 1633 -8203 -7881 2497 1948
16036A948m414j2011J6135J0240k5633k0263K0961J1673P384k3550k937M1208
$$ 1948 -2466 -14477 1658 11898 -13735 -33998 -13037 -1364 6020 -17530 -20467 20741
16024B0741o201j4956K307j6114j954J19K1771k598k4022o993r835n587M3434
$$ 20741 14540 -416 1891 -14223 -16177 -16058 5713 3115 -20907 -27900 -37735 -43322 112
16011A12K6787Q13m99q183k5705j0375o455J3551L150l177k469K146m1977j2840
$$ 112 26899 27712 27213 19030 -6675 -17050 -23505 -9954 -6804 -9981 -12450 -10304 -52281 -65121
15997f5121J821K4553L4100K9095J2311j5659n909r300K263N097q550m032R466
$$ -65121 -63300 -38747 -4647 24448 36759 21100 15191 5891 8154 13251 4701 669 10135
15984A0135N831k937m071R973k200n508m449k121j0962N630q685r268k5667j6368
$$ 10135 15966 13029 8958 18931 16731 11223 6774 4653 -6309 -679 -9364 -18632 -44299 -60667
15970f0667l703K2560K4764n460M229k0j7103O77L653J8952J0389J9803j4324
$$ -60667 -64370 -41810 -17046 -22506 -18277 -18297 -35400 -34723 -31070 -12118 -1729 18074 3750
15957C750k7722l639R091O684Q369J1295L535j6281J9413J6298K5684q356j8896
$$ 3750 -23972 -27611 -18520 -11836 -3467 7828 11363 -4918 14495 30793 56477 48121 29225
15944B9225J149l700j8506k361Q901k333j4305J783K2301N654j7169j5788Q505
$$ 29225 30374 26674 8168 5807 14708 12375 -1930 -147 22154 27808 10639 -5149 3356
15931C356N172l576K917K600j2081M431q637l622J869j036K8554j7853k7713k0710
$$ 3356 8528 4952 7869 10469 -1612 2819 -5818 -9440 -7571 -8607 19947 2094 -25619 -46329
15917d6329J5341M1783m369l4520J116K4418J4928J4768M979o810k1172r551J5303
$$ -46329 -30988 10795 6426 -28094 -26978 -2560 12368 27136 32115 25305 4133 -5418 9885
15904I885J851k1841j6278N671J1098j9192k4959N247J855j175J1751J7259J6851
$$ 9885 11736 -10105 -26383 -20712 -9614 -28806 -53765 -48518 -46663 -47838 -36087 -18828 -1977
15891a977K296j3700P753j65j2364p885l3760J0826K0034j5826J6176k036j843
$$ -1977 319 -13381 -5628 -5793 -18157 -26042 -59802 -48976 -28942 -44768 -28592 -30628 -32471
15878c2471K3818J5520J9720j7204j5178o502K598J2061J617j3885j7624P072
$$ -32471 -8653 6867 26587 9383 -5795 -12297 -9699 2362 3979 -9906 -27530 -20458
15866b0458O317n996j5228j3359M625J5345k0658o590K0239Q786k797m218O935
$$ -20458 -14141 -20137 -35365 -48724 -44099 -28754 -49412 -56002 -35763 -26977 -29774 -33992 -27057
15853b7057K2621l93N3P658N867J2103j9579N79J8189j1943Q068N23k953n737
$$ -27057 -4436 -4829 -4776 2882 8749 20852 1273 1852 20041 8098 16166 16689 13736 7999
15839G999J7794J765k716k5385l3543k471K5844J9782J1240k5669l4461q633J5826
$$ 7999 25793 27558 24842 -543 -34086 -36557 -10713 9069 20309 -5360 -39821 -48454 -32628
15826c2628J2813J5922J7735K2796R637j1884j2672k0157m504l952J1646K4390
$$ -32628 -19815 -3893 13842 36638 46275 34391 21719 1562 -2942 -6894 4752 29142
15814B9142j426N43K267j9686j7244p188k4414p371O951K459k531J2322J0212
$$ 29142 27716 28259 30526 10840 -6404 -13592 -38006 -45377 -38426 -35967 -38498 -26176 -15964
15801a5964N458J9544O189K4491p227j4105L409q29j307P118k221q660m068M08
$$ -15964 -10506 9038 15227 39718 32491 18386 21795 20966 19659 26777 24556 15896 11828 12236
15787A2236j7263M462L649k516k2255j6705p93J1776M3243L53j4487n762p881
$$ 12236 -5027 -565 3084 568 -21687 -38392 -39185 -27409 15834 16187 1700 -4062 -11943
15774a1943l1079j1343K3165L7607J9803n193J4184J5873j375n345k3624j1786
$$ -11943 -43022 -54365 -31200 6407 26210 21017 35201 51074 49699 44354 20730 8944
15762H944K1003j357Q115j6152j1250k2059K997J2792Q60k299K043j6140j0959
$$ 8944 29947 28590 36705 20553 9303 -12756 -9759 3033 3893 1594 3637 -12503 -23462
15749b3462j2504J3884K4083j250m944J242K3465K0819M038j2818k4549l3322
$$ -23462 -35966 -22082 2001 751 -4193 -2951 20514 41333 45371 32553 8004 -25318
15737b5318o261K1194P72L321R000Q83j3645k416N80K4343k5185k1924K1197L0074
$$ -25318 -31579 -10385 -9613 -6292 2708 3591 -10054 -12470 -11890 12453 -12732 -34656 -13459 16615
15723A6615K769k1827l019J2947P717R552J1912p159m220l001j8542l140j8017
$$ 16615 19384 -2443 -5462 7485 15202 24754 36666 29507 25287 22286 3744 604 -17413
15710a7413k1561j0565L0863K1862o45r611K270j4278J3400J618r663n497J6805
$$ -17413 -38974 -49539 -18676 3186 2541 -7070 -4800 -19078 -5678 -4060 -13723 -19220 -2415
15697b415R984j3789L0221R266Q364j0882j7158p580O151J3269l6491j1625J464
$$ -2415 7569 -6220 24001 33267 41631 30749 13591 6011 12162 25431 -11060 -22685 -21221
15684b1221K052J3196N586P626j4675j1800p299r437k119J3525K3743K0058m275
$$ -21221 -19169 -5973 -387 7239 -7436 -19236 -26535 -35972 -38091 -24566 -823 19235 14960
15671A4960q589K026R179k0784j5286Q887K2526K169n754k2989k22j0549J1195
$$ 14960 6371 8397 17576 -3208 -18494 -9607 12919 15088 9334 -13655 -13877 -24426 -13231
15658a3231P554J3141p739l690O918j1357l9135O347K885j1367J8298K0885L0549
$$ -13231 -5677 7464 -275 -3965 2953 -8404 -47539 -41192 -38307 -49674 -31376 -10491 20058
15645B0058l944j1256j6348o631J5387j3982n370J429j6268J1598J6042K2924
$$ 20058 16114 4858 -11490 -18121 -2734 -16716 -22086 -20657 -36925 -25327 -9285 13639
15633A3639l688j7777K1463J0343k6507k8296j186o096k459j207l398K708J3980
$$ 13639 9951 -7826 13637 23980 -2527 -30823 -32009 -38105 -40564 -41771 -45169 -42461 -28481
15620b8481J2143J9072N398j187o795L1503J3927k5978l751j3680n685j8788j2807
$$ -28481 -16338 2734 8132 6945 150 31653 45580 19602 15851 2171 -3514 -22302 -35109
15607c5109J8649J7470J5022k800k7198j575k4977N026l79l085k505J3773J8057
$$ -35109 -16460 1010 16032 13232 -13966 -15541 -40518 -35492 -35871 -38956 -41461 -27688 -9631
15594i631L974m860l823M192R940L130j5255r480J0252J3909j571j0755R45K193
$$ -9631 -5657 -10517 -14340 -10148 -208 2922 -12333 -21813 -11561 2348 777 -9978 -9033 -6840
15580f840K271l26N280J0823J811l8037k2786R236o45J8761K2385j6264r302M984
$$ -6840 -4569 -4895 385 11208 13019 -25018 -47804 -38568 -39213 -20452 1933 -14331 -23633 -18649
15566a8649L718L161J0573j2367j6803m454k889J1536q642O643M2955j31r490
$$ -18649 -14931 -11770 -1197 -13564 -30367 -34821 -37710 -26174 -34816 -28173 14782 14651 5161
15553E161o514k8514o01K3762R063o584r651o760M471j6764M352J7495j297M620
$$ 5161 -1353 -29867 -30468 -6706 2357 -4227 -13878 -20638 -16167 -32931 -28579 -11084 -12381 -7761
15539g761n609j261J5106j0424k924N98J4263J1413q523r035J2407K9064m261
$$ -7761 -13370 -14631 475 -9949 -12873 -12275 1988 13401 4878 -4157 8250 37314 33053
15526C3053j2425o35q357k7310j6652J6201N144J3245j0832q089K614m565J6340
$$ 33053 20628 19993 11636 -15674 -32326 -16125 -10981 2264 -8568 -16657 -14043 -18608 -2268
15513b268j274j1626k5588Q361J723J9110L5902j7806k9002k1648J4480K4426
$$ -2268 -3542 -15168 -40756 -32395 -30672 -11562 24340 6534 -22468 -44116 -29636 -5210
15501e210K708J598J970k1101O479l893j5954K385r186o766o071K394K5499J7359
$$ -5210 -2502 -904 1066 -20035 -13556 -17449 -33403 -31018 -40204 -46970 -53041 -50647 -25148 -7789
15487g789k268J3053L1114P571j7491j3257l1082l650J8434n671j5326M531O583
$$ -7789 -10057 2996 34110 41681 24190 10933 -20149 -23799 -5365 -11036 -26362 -21831 -15248
15474a5248J8287K4638J6530R340j0637k8754k4068j4916q730J169J3795J4112
$$ -15248 3039 27677 44207 53547 42910 14156 -9912 -24828 -33558 -32389 -18594 -4482
15462d482l701q85o589J2396J0629N786K2816j8698j8998K2303J1717M210M413
$$ -4482 -8183 -9068 -15657 -3261 7368 13154 35970 17272 -1726 20577 32294 36504 40917
15449D0917j9023j9332Q601m146j2211j8067K2230K4912l413j6988n022J8321
$$ 40917 21894 2562 11163 7017 -5194 -23261 -1031 23881 20468 3480 -1542 16779
15437A6779Q00j965R63J7984J7274r570k4292o27N195P653J0387Q178J091j4561
$$ 16779 17579 15614 16577 34561 51835 42265 17973 17346 22541 30194 40581 48759 49850 35289
15423C5289k1263K849K4149j3209N543j1754n661j121R565p583j2608k441o164
$$ 35289 14026 16875 41024 27815 33358 21604 15943 14822 24387 16804 4196 1755 -4409
15410d409p247m332j788P294N665j3311M323k676J7933J0038J5852R072q736P419
$$ -4409 -11656 -15988 -17776 -10482 -4817 -18128 -13805 -16481 1452 11490 27342 36414 27678 35097
15396C5097r095r482m028K0518j8395k8938K212k114n303K4933J7117P958N278
$$ 35097 26002 16520 12492 33010 14615 -14323 -12111 -14225 -19528 5405 22522 30480 35758
15383C5758r578k4490j4786N257P463L5k2532J2109m835J2105j789m347K703J179
$$ 35758 26180 1690 -13096 -7839 -376 -341 -22873 -10764 -15599 -3494 -5283 -9630 -6927 -5748
15369e748J655K0730J9727L806k3201k0774j2899o706q102k50j4555P589J1513
$$ -5748 -4093 16637 36364 40170 16969 -3805 -16704 -23410 -31512 -31762 -46317 -38728 -27215
15356b7215J6216k654K0064O374l166Q203K1183p963k3366l140j573p013N845
$$ -27215 -10999 -13653 6411 12785 9619 17822 39005 31042 7676 4536 2963 -4050 1795
15343A795N24j1683J421R570K365N032N640j6113j5916q432J4447K7410l707J1320
$$ 1795 2319 -9364 -7943 1627 3992 9024 14664 -1449 -17365 -25797 -11350 16060 12353 23673
15329B3673r276L393J1320K1802Q30r845k1818M780N594j6415J9530J6205j6386
$$ 23673 14397 17790 29110 50912 51742 41897 20079 24859 30453 14038 33568 49773 33387
15316C3387j8428j5773m33m396O492P931N728M402j1104p830O74j580o233M487
$$ 33387 14959 -814 -1247 -5643 849 8780 14508 18910 7806 -24 650 -930 -7163 -2676
15302b676K470k167K929K4437q553k756J2942J3089p318k2514j6463j5437R893
$$ -2676 -206 -2373 556 24993 16440 13684 26626 39715 32397 9883 -6580 -22017 -12124
15289a2124O299p159k971o911q0r718Q474K1153K494j6039l46J6563J0636K087
$$ -12124 -5825 -12984 -15955 -22866 -22946 -32664 -24190 -3037 -543 -16582 -16928 -365 10271 12358
15275A2358j3177L534J1196L0l294j4809L951q969j572P673J6257k681j7649L400
$$ 12358 -819 2715 13911 13941 10647 -4162 -211 -9180 -10752 -3079 13178 10497 -7152 -3752
15261c752P268J0952j2230O376m107j0945l765j3874j5471j9853K4090J0425P879
$$ -3752 3516 14468 2238 8614 4507 -6438 -10203 -24077 -39548 -59401 -35311 -24886 -17007
15248a7007p47J1358k4041l307L2885R383N836o140O786K1431J2828R875k7554
$$ -17007 -17754 -6396 -30437 -33744 -859 8524 14360 8220 15006 36437 49265 59140 31586
15235C1586j2003j3665l5599n155J5840l139P675P712l439J3908j6458J48K0695
$$ 31586 19583 5918 -29681 -34836 -18996 -22135 -14460 -6748 -10187 3721 -12737 -12589 8106
15222H106M58j7926j8627N627K7654P100O616j059Q552o085p717J699k1239M45
$$ 8106 8564 -9362 -27989 -22362 5292 12392 19008 17949 26501 20416 12699 14398 -6841 -6396
15208f396K0502J5282j1220k3996k4818p147J4742P712l3133K530L0142J0999
$$ -6396 14106 29388 18168 -5828 -30646 -37793 -23051 -15339 -48472 -45942 -15800 -4801
15196d801P137J4785K0659J9550j0103M596J3628o839k3359j8598p452q609M517
$$ -4801 2336 17121 37780 57330 47227 51823 65451 58612 35253 16655 9203 594 5111
15183E111m273j93K042O176J3952k5255k841M222k832Q357J5265j5340L828n233
$$ 5111 838 645 2687 8863 22815 -2440 -5281 -1059 -3891 4466 19731 4391 8219 2986
15169B986j4771j4954r810J4324K3678J8184j073j3511k0279j010K8159J4272
$$ 2986 -11785 -26739 -36549 -22225 1453 19637 18564 5053 -15226 -16236 11923 26195
15157B6195K789p738m513k324m919p87j2752j2219q00k0993K3669K3104N351K5070
$$ 26195 28984 21246 16733 14409 9490 8703 -4049 -16268 -17068 -38061 -14392 8712 14063 39133
15143C9133P08j8239k1513j1920K3887q800M979l299P946J2792J2103L0776n425
$$ 39133 39841 21602 89 -11831 12056 3256 8235 4936 12882 25674 37777 68553 63128
15130F3128j4947l01J0856M976q704o688k4992j466K9189l387l5211j4392k4395
$$ 63128 48181 47880 58736 63712 55008 48320 23328 21862 51051 47664 12453 -1939 -26334
15117b6334q10p312K6180K3209m453j2275N472N457Q353j4072J6092K005j1419
$$ -26334 -27144 -34456 -8276 14933 10480 -1795 3677 9134 17487 3415 19507 21512 10093
15104A0093J6587j1667k633Q196J6844k3698l5257R022J5653J867K6727Q269j4024
$$ 10093 26680 15013 12380 20576 37420 13722 -21535 -12513 3140 5007 31734 40003 25979
15091B5979j1407P579j079j6527j8025j3999n065J1212J3933m198M968l886q00
$$ 25979 14572 22151 21072 4545 -13480 -27479 -32544 -21332 -7399 -11597 -6629 -10515 -11315
15078a1315J706J5891J0991j2532M170J2199L244J0059R073l0570j8668J4904
$$ -11315 -9609 6282 17273 4741 8911 21110 24354 34413 43486 12916 -5752 9152
15066I152K3106m982N687j4716k3907l668n153n98Q202o059O577J5551J8571q757
$$ 9152 32258 27276 32963 18247 -5660 -9328 -14481 -15079 -6877 -12936 -6359 9192 27763 19006
15052A9006j3395j9143Q459K0696m49m782l748p864r806R4P706k6775J960P639
$$ 19006 5611 -13532 -5073 15623 15174 10392 6644 -1220 -11026 -10932 -3226 -30001 -28041 -20402
15038b0402l977j161q735M368L389K1885J7776l578k2041j0024O628R655K446
$$ -20402 -24379 -25540 -34275 -29907 -26518 -4633 13143 9565 -12476 -22500 -15872 -6217 -3771
15025c771r342J196j2593P828j2314J0046J070k218K31j0431K714j2898j0266
$$ -3771 -13113 -11917 -24510 -16682 -28996 -18950 -17880 -20098 -19867 -30298 -27584 -40482 -50748
15012e0748J1305K7704K147M371j1320J0082K7509K4263j2945o0481j8592R144
$$ -50748 -39443 -11739 -9592 -5221 -16541 -6459 21050 45313 32368 -28113 -46705 -37561
15000c7561K721R263K9872J4198j1496Q786K3688j2434j9052j1108J7115O738
$$ -37561 -34840 -25577 4295 18493 6997 15783 39471 27037 7985 -3123 13992 20730
14988B0730j4726K935r471k2568k516J8733K9745k6831j4217m372N145L445J858
$$ 20730 6004 8939 -532 -23100 -25616 -6883 22862 -3969 -18186 -22558 -17413 -13968 -12110
14975a2110L0674j0262k438j223k1972J0546R56P646K1791R701Q826r634k5962
$$ -12110 18564 8302 5864 4641 -17331 -6785 -5829 1817 23608 33309 42135 32501 6539
14962F539q128p430M88M532N129P540q608j8581n139J2284O467Q806k652k147
$$ 6539 -1589 -9019 -8531 -3999 1130 8670 62 -18519 -23658 -11374 -4907 3899 1247 -900
14948i00q689o508J6749O447K416j1593l7703M90Q102q44j2802O126J2118J7438
$$ -900 -9589 -16097 652 7099 9515 -2078 -39781 -39291 -31189 -32033 -44835 -38709 -26591 -9153
14934i153P170J4126J5006k3780k9943Q913m973n133o189N334M3632J9348j688
$$ -9153 -1983 12143 27149 3369 -26574 -17661 -22634 -27767 -33956 -28622 15010 34358 32670
14921C2670J162j043l086n07P98K515r27m184n288l7369l1722q610j054K3748
$$ 32670 33832 32789 29703 29196 29994 32509 31582 27398 22110 -15259 -46981 -55591 -56645 -32897
14907c2897J3941M986n763L926q736j0155M535n538O037J8694J6077L696K1936
$$ -32897 -18956 -13970 -19733 -15807 -24543 -34698 -30163 -35701 -29664 -10970 5107 8803 30739
14894C0739j295j7470k1935j0609o508r905J4814J7528r422j307J5293M934p259
$$ 30739 29444 11974 -9961 -20570 -27078 -36983 -22169 -4641 -14063 -15370 -77 4857 -2402
14881b402J7738J2868J1048P273j0370l6210k4972m243M620J888K784J1250K4542
$$ -2402 15336 28204 39252 46525 36155 -55 -25027 -29270 -24650 -22762 -19978 -8728 15814
14868A5814j728j5273j1891j4702P780K1670R848j8440Q182J2172O284m491K2816
$$ 15814 14086 -1187 -13078 -27780 -20000 1670 11518 -6922 1260 13432 19716 15225 38041
14855C8041J2530r026k542j6603J637L517j4086k9559M811J8550q099J8021P113
$$ 38041 50571 41545 39003 22400 24037 27554 13468 -16091 -11280 7270 -829 17192 24305
14842B4305l2496j558L2629q882K408l466p22m147P53k538O45J4991N061P5J974
$$ 24305 -8191 -9749 22880 13998 16406 12940 12218 8071 8824 6286 6931 21922 26983 27058 29032
14827B9032n430l2662m343j5155P388N616J2951R82j006L403J0369m732o373K425
$$ 29032 23602 -9060 -13403 -28558 -21170 -15554 -2603 -1621 -2627 776 11145 6413 40 2465
14813B465L695N933n745j998n236N384J8189o427j1124j0974k123P026k0395J8242
$$ 2465 6160 12093 6348 4350 -886 4498 22687 16260 5136 -5838 -7961 -935 -21330 -3088
14799c088J1946j5532j7633n53j0172j4658P318J6824j8397K155J9788K8398J3301
$$ -3088 8858 -6674 -24307 -24860 -35032 -49690 -42372 -25548 -43945 -41790 -22002 6396 19697
14786A9697j2640k9507J1342J160n849K095J2767R572N999j2436l4019J322N443
$$ 19697 7057 -22450 -11108 -9948 -15797 -13702 -935 8637 14636 2200 -31819 -30497 -25054
14773b5054o759K610L6311j0335k6745n978R003Q962P432R746j291j274o750j0471
$$ -25054 -31813 -29203 7108 -3227 -29972 -35950 -26947 -17985 -10553 -807 -2098 -3372 -10122 -20593
14759b0593j0240J3340M81K5411P972k7380k315J6175J9011q021k1853K1091L5009
$$ -20593 -30833 -17493 -17012 8399 16371 -11009 -13324 2851 21862 13841 -8012 13079 48088
14746D8088k6362j8644j1490m767L196j4417R278J2837J8214P389J1469j1133
$$ 48088 21726 3082 -8408 -13175 -9979 -24396 -15118 -2281 15933 23322 34791 23658
14734B3658j2914M538j5658l489M446j0544M48j3374R151L149Q577O225J9009
$$ 23658 10744 15282 -376 -3865 581 -9963 -9515 -22889 -13738 -10589 -2012 4213 23222
14721B3222J583j2194J4784J1022r367o216l2587N227J7194P587M996O482j146
$$ 23222 24805 12611 27395 38417 29050 22834 -9753 -4526 12668 20255 25251 31733 30587
14708C0587j0836r654j88k8983j4549O902M532J2895J8426R479J0413j4365j9933
$$ 30587 19751 10097 9909 -19074 -33623 -26721 -22189 -9294 9132 18611 29024 14659 -5274
14695e274Q884K41L391J2560k0818k6046p550M625N564m374p39j551Q950L258
$$ -5274 3610 3851 7242 19802 -1016 -27062 -34612 -29987 -24423 -28797 -29536 -31087 -22137 -18879
14681a8879M35l966o674L123J4984J7559j8208k3445J384J0169M568J4325l9632
$$ -18879 -18444 -22410 -29084 -25961 -10977 6582 -11626 -35071 -33687 -23518 -18950 -4625 -44257
14668d4257o878K1056J4297j3585m749j4856J520J4334m837k7946J968L7014J3301
$$ -44257 -51135 -30079 -15782 -29367 -34116 -48972 -47452 -33118 -37955 -65901 -63933 -26919 -13618
14655a3618k4130J4179L2685P572M01J293R461j0348K2603P06j9855k5620p7L2813
$$ -13618 -37748 -23569 9116 16688 17089 18382 27843 17495 40098 40804 20949 -4671 -4748 28065
14641B8065k769j9871j6347j6183j8597J9528K9419Q66m92n305j763j274n038
$$ 28065 25296 5425 -10922 -27105 -45702 -26174 3245 4111 3619 -1686 -3449 -4723 -9761
14628i761K1799j4602J1568j4905N472R602J4506R90k5793J482o183j7387j3534
$$ -9761 12038 -2564 9004 -5901 -429 9173 23679 24669 -1124 358 -5825 -23212 -36746
14615c6746k774K2088j0764j5596L869R090J3235J2412M611N305j8276K7883J9838
$$ -36746 -39520 -17432 -28196 -43792 -39923 -30833 -17598 -5186 -575 4730 -13546 14337 34175
14602C4175l732N805j7080j1726j9157l1712J1560J9915R737N137j5449K292J0815
$$ 34175 30443 36248 19168 7442 -11715 -43427 -31867 -11952 -2215 2922 -12527 -10235 580
14589E80p337r748l82r654K0761J4142k8028j8778K6862L560O466m727R800N507
$$ 580 -6757 -16505 -16887 -26541 -5780 8362 -19666 -38444 -11582 -8022 -1556 -6283 3517 9024
14575I024j0935p842O812K8519O108N733l0126l415K3602K5639j5784l0163j7071
$$ 9024 -1911 -9753 -2941 25578 31686 37419 7293 3878 27480 53119 37335 7172 -9899
14562i899O948j4867j860K716J8354O59J55j4595j163Q522Q403P171o465j0007
$$ -9899 -2951 -17818 -19678 -16962 1392 2051 2206 -12389 -13552 -5030 3373 10544 4079 -5928
14548e928r941j1594Q247J5391k929L974R029j2094j0643o905L233K1854O003
$$ -5928 -15869 -27463 -19216 -3825 -6754 -2780 6249 -5845 -16488 -23393 -20160 1694 7697
14535G697N073Q837k7470n03J3637j6050j4948j1163K2Q051L174q1K2616J1915
$$ 7697 12770 21607 -5863 -6366 7271 -8779 -23727 -34890 -34868 -26817 -23643 -23724 -1108 10807
14521A0807j3099K924o722k0472j41j1357j3647J0129Q076K2833R228o049j7324
$$ 10807 -2292 632 -6090 -26562 -26703 -38060 -51707 -41578 -33502 -10669 -1441 -7490 -24814
14508b4814p902L13L1133N129o799J5582J9694J7820n9j9949l9705j9646J2246
$$ -24814 -32716 -32403 -1270 3859 -2940 12642 32336 50156 50097 30148 -9557 -29203 -16957
14495a6957K898j0402J0708Q425J210J1821K0495N222J2582j9764m0328J0150
$$ -16957 -14059 -24461 -13753 -5328 -4118 7703 28198 33420 46002 26238 -14090 -3940
14483c940K3000J9275m191r800k2000O663P876p671o903l4332m546J4020K0307
$$ -3940 19060 38335 34144 24344 2344 9007 16883 9212 2309 -32023 -36569 -22549 -2242
14470b242n704n68N364m327o88j9832L511N172M823k434o246R119K3671J2200
$$ -2242 -7946 -8514 -3150 -7477 -8165 -27997 -24486 -19314 -14491 -16925 -23171 -14052 9619 21819
14456B1819J9702M447m8250K50L5702j3732J5095N864j8472j0043K4078O147j0698
$$ 21819 41521 45968 -2282 -2032 33670 19938 35033 40897 22425 12382 36460 42607 31909
14443C1909j2450K938K0167o744p166k7878l0460l799L1326M440O760N051j3477
$$ 31909 19459 22397 42564 35820 28654 776 -29684 -33483 -2157 2283 9043 14094 617
14430F17j3971q829j7058o97M908J2992J5937o201N941Q141K753Q213N28j2493
$$ 617 -13354 -22183 -39241 -39938 -35030 -22038 -6101 -12302 -6361 1780 4533 12746 13274 781
14416G81j1789m196J0184j8874P746P135j7549l549R01J218J0146k414O437K2511
$$ 781 -11008 -15204 -5020 -23894 -16148 -9013 -26562 -30111 -29210 -27992 -17846 -20260 -13823 8688
14402H688K8360M399j0040k7987M211m238r250n523p224J0495J4184j5971K821
$$ 8688 37048 41447 31407 3420 7631 3393 -5857 -11380 -18604 -8109 6075 -9896 -7075
14389g075p864o163M111J8184N188M32p58j7464N371r211m738m370Q307j781q300
$$ -7075 -14939 -21102 -16991 1193 6381 6813 6055 -11409 -6038 -15249 -19987 -24357 -16050 -17831 -26131
14374b6131K965K9667K8597K1142l387m5477o824p031O556j3427J0609J6917k0149
$$ -26131 -23166 6501 35098 56240 52853 7376 552 -6479 77 -13350 -2741 14176 -5973
14361e973k5997J3494O069N145r787J0823j1963L202J3423J7117M463j3001o900
$$ -5973 -31970 -18476 -12407 -7262 -17049 -6226 -18189 -14987 -1564 15553 20016 7015 115
14348A15J7016J1947r155l8495j4825K7031R660m581m449J498J6632r706J7849
$$ 115 17131 29078 19923 -18572 -33397 -6366 3294 -1287 -5736 -4238 12394 2688 20537
14335B0537Q127p431J0539k4081k1882P391R150m328R467j1365j0475J3348j2971
$$ 20537 28664 21233 31772 7691 -14191 -6800 2350 -1978 7489 -3876 -14351 -1003 -13974
14322a3974q603k194J8932J554J25r226K1946N119J1354j232k6245k277J8961
$$ -13974 -22577 -24771 -5839 -4285 -4160 -13386 8560 13679 25033 23801 -2444 -4721 14240
14309A4240R031M978q109j4087n158J6567j2917k6774j105l751J3741M2455O451
$$ 14240 23271 28249 20140 6053 895 17462 4545 -22229 -23334 -27085 -13344 29111 35562
14296C5562j0514r988k4512p671p789J7986J7205J1143j9469k0692J3687o303
$$ 35562 25048 15060 -9452 -17123 -24912 -6926 10279 21422 1953 -18739 -5052 -11355
14284a1355L467L2199J4793l2555N94J2708j1986j2165K0891p728L92N509k6782
$$ -11355 -7888 24311 39104 6549 7143 19851 7865 -4300 16591 8863 9255 14764 -12018
14271a2018j7929J8596l896N076K147K9819j3011j5297L122j1647l223n439J4943
$$ -12018 -29947 -11351 -15247 -10171 -8024 21795 8784 -6513 -3391 -15038 -18261 -23700 -8757
14258h757k7670j768J594j0622K0159L216J0232L3785R565R360J6203J8713k8436
$$ -8757 -36427 -38195 -36601 -47223 -27064 -23848 -13616 20169 29734 39094 55297 74010 45574
14245D5574k9504k3413o162O08k329J6847q713P094p366j0567O281k333m080K365
$$ 45574 16070 -7343 -13505 -12897 -15226 1621 -7092 2 -7364 -17931 -11650 -13983 -18063 -15698
14231a5698J7310r281j4682r076n170M950m213j4540l218Q15K3343J1847Q363
$$ -15698 1612 -7669 -22351 -31427 -36597 -31647 -35860 -50400 -53618 -52803 -29460 -17613 -9250
14218i250J4870J263K208K1199J7836k5803j8737n363J3631P54O834p901m753
$$ -9250 5620 6883 9091 30290 48126 22323 3586 -1777 11854 12608 19442 11541 6788
14205F788K4020n932j58J396j3123n573k239J4788m696r958L666J3384j8700j5092
$$ 6788 30808 24876 24718 26114 12991 7418 5179 19967 15271 5313 8979 22363 3663 -11429
14191a1429N515K67O821o358m942j6043m181J011J0955J6232N482M665J0578j9724
$$ -11429 -5914 -5647 1174 -5184 -10126 -26169 -30350 -29339 -18384 -2152 3330 7995 18573 -1151
14177a151l055q393r001R027J2974j886Q107J8684R102k3347P031P249J6163q50
$$ -1151 -4206 -12599 -21600 -12573 401 -1485 6622 25306 34408 11061 18092 25341 41504 40654
14163D0654j8530j4297O535J1668r571j8938n821L61K90R505n12N174n743j1736
$$ 40654 22124 7827 14362 26030 16459 -2479 -8300 -7939 -7649 1856 1344 6518 775 -10961
14149a0961N170p094Q411M005n939j9220J093J4275j1429l411K2208O849J7607
$$ -10961 -5791 -12885 -4474 -469 -6408 -25628 -24535 -10260 -21689 -25100 -2892 3957 21564
14136B1564l329p266q925j0536n80J7168q098j1054j6867q624K302L558M000P831
$$ 21564 18235 10969 2044 -8492 -9072 8096 -2 -11056 -27923 -36547 -34245 -30687 -26687 -18856
14122a8856K3952N350J2670j6412l3235J5309L7608R470O921J292k1960j5525
$$ -18856 5096 10446 23116 6704 -26531 -11222 26386 35856 42777 44069 22109 6584
14110F584m377j1242m7073O065L3084N7882J9934j4991k2675k3069j3206J6407
$$ 6584 2207 -9035 -56108 -50043 -16959 40923 60857 45866 23191 122 -13084 3323
14098C323o436j2417J6232J5263l280k7592j98K9469K043P677k7886m232K464
$$ 3323 -3113 -15530 702 15965 12685 -14907 -15105 14364 16407 24084 -3802 -8034 -5570
14085e570L883j5359r70J413R635r411n732J5161N3800J0205j7638j2181p522
$$ -5570 -1687 -17046 -18016 -16603 -6968 -16379 -22111 -6950 46850 57055 39417 27236 19714
14072A9714k0225q116l993K0161M041r61l638p322L872L093J8097J2304k740k5706
$$ 19714 -511 -8627 -12620 7541 11582 10621 6983 -339 3533 6626 24723 37027 34287 8581
14058H581k1530j762Q556k238J2464J169j5403L435K1971j1437q226M731R005
$$ 8581 -12949 -14711 -6155 -8393 4071 5240 -10163 -6728 15243 3806 -4420 311 9316
14045I316N802l963L78j4150j7195J2289J7396j9903p424n974m787J1357L3464
$$ 9316 15118 11155 11533 -2617 -19812 -7523 9873 -10030 -17454 -23428 -28215 -16858 16606
14032A6606j1860K2095J6036p983j356N432j815r362r078L87j4277j1105J7707
$$ 16606 4746 26841 42877 34894 33538 38970 37155 27793 18715 19102 4825 -6280 11427
14019A1427o699K950J3080j1225P908k35j4473j4934J6631j0556j6919L2750K6259
$$ 11427 4728 7678 20758 9533 17441 17206 2733 -12201 4430 -6126 -23045 9705 35964
14006C5964j1467j8060K0717J5969J3319j0350K043N753j7607j1089J1903J4072
$$ 35964 24497 6437 27154 43123 56442 46092 48135 53888 36281 25192 37095 51167
13994E1167l9867k9872J2996J8902k8856j155J5962j3999m668p375Q654k979j2345
$$ 51167 11300 -18572 -5576 13326 -15530 -16685 -723 -14722 -19390 -26765 -18111 -21090 -33435
13981c3435R848J2540j050K8467j9939j5753J2073m551O685j612J1968k3896k2576
$$ -33435 -23587 -11047 -12097 16370 -3569 -19322 -7249 -11800 -5115 -6727 5241 -18655 -41231
13968d1231n477J5493Q619L041K1398j889J5558o528j4015j0091O449P073l131
$$ -41231 -46708 -31215 -22596 -19555 1843 -46 15512 8984 -5031 -15122 -8673 -1600 -4731
13955d731q52J5948M763O342k98j3954N118K1046J0431l893k5443R338J8714N324
$$ -4731 -5583 10365 15128 21470 21172 7218 12336 33382 43813 39920 14477 23815 42529 47853
13941D7853j8247l1046Q898q290r352j5698r364l354O309L756K872O669j32P869
$$ 47853 29606 -1440 7458 -832 -10184 -25882 -35246 -38600 -32291 -28535 -25663 -18994 -19126 -11257
13927a1257J2234J7851k367N951j8282J5033J4308k0626j394p433j7340j4217
$$ -11257 977 18828 16461 22412 4130 19163 33471 12845 11451 4018 -13322 -27539
13915b7539J9943O704K428J1469k0498K223j1809K068L2592j2721j2287o387P803
$$ -27539 -7596 -892 1536 13005 -7493 -5270 -17079 -15011 17581 4860 -7427 -13814 -6011
13902f011P282J5987o744l073k736q856M773j060K2234N584K783N77l5368k9057
$$ -6011 1271 17258 10514 7441 4705 -4151 622 -438 21796 27380 30163 30740 -4628 -33685
13888c3685K9K2341L215j0713r952J3383K3808L846j8173M893O225J4843J2534
$$ -33685 -33656 -11315 -8100 -18813 -28765 -15382 8426 12272 -5901 -1008 5217 20060 32594
13875C2594j3740k5210k1910n599K2814J128j1723p09l446K2718o899K1929J2380
$$ 32594 18854 -6356 -28266 -33865 -11051 -9923 -21646 -22355 -25801 -3083 -9982 11947 24327
13862B4327j0041j8116j834k0177j3596L658K9853j472J779j6067j740K2103L020
$$ 24327 14286 -3830 -5664 -25841 -39437 -35779 -5926 -7398 -5619 -21686 -23426 -1323 1697
13849A697N305L116r338j8032j4897J9795K0640K976Q393L47Q543q168j8469j284
$$ 1697 7002 10118 780 -17252 -32149 -12354 8286 11262 19655 20002 28545 20377 1908 624
13835F24Q26k549K7050j2339j1507J4244r274Q44r974R11j0716p577j2031L968
$$ 624 1450 -1099 25951 13612 2105 16349 7075 7919 -2055 -1144 -11860 -19437 -31468 -27500
13821b7500J9696j5048o685J7964R011K0323J3355j707j4166j8071j1284P85p639
$$ -27500 -7804 -22852 -29537 -11573 -2562 17761 31116 29409 15243 -2828 -14112 -13327 -20966
13808b0966j9399j4804J9015L1015J265Q856k0851k5954J4787J6980K4838k682
$$ -20966 -40365 -55169 -36154 -5139 -3874 4982 -15869 -41823 -27036 -10056 14782 12100
13796A2100l305k7210j5939m151J0636K3200M1613j1324l5687j1832R507J6936
$$ 12100 8795 -18415 -34354 -38505 -27869 -4669 36944 25620 -10067 -21899 -12392 4544
13784D544K7564J0523o251r252j0990P609o110j1830j293Q136j9279j4749m104
$$ 4544 32108 42631 36380 27128 16138 23747 17637 5807 4514 12650 -6629 -21378 -25482
13771b5482J0305P846K3703J1985j3606j8913K600o879j0132J4459K8995k84j7738
$$ -25482 -15177 -7331 16372 28357 14751 -4162 -1562 -8441 -18573 -4114 24881 24597 6859
13758F859k2232j850K0620O013r948p674k9498J0181R181J2819N255M044k2979
$$ 6859 -15373 -17223 3397 9410 -538 -8212 -37710 -27529 -18348 -5529 -274 3770 -19209
13745a9209p138L7618J0211j6933j0582j3429j4949j1975m580Q282J7010J1679
$$ -19209 -26347 11271 21482 4549 -6033 -19462 -34411 -46386 -50966 -42684 -25674 -13995
13733a3995q743J1635J5627J5393K4310j7982j5865j9135r718Q821J6572j8121
$$ -13995 -22738 -11103 4524 19917 44227 26245 10380 -8755 -18473 -9652 6920 -11201
13721a1201j1823L0197K4360j3985m496J4563l043j3191L871J621n391j5938k4229
$$ -11201 -23024 7173 31533 17548 13052 27615 24572 11381 15252 16873 11482 -4456 -28685
13708b8685l3770N020M5160J2406o643J110K1064O557j3213j9792J447L9842K0543
$$ -28685 -62455 -57435 -12275 131 -6512 -5402 15662 22219 9006 -10786 -9339 30503 51046
13695E1046j8448n254P292k102m1124k0743J4267p124j311J080K0693m845J789
$$ 51046 32598 27344 34636 32534 -8590 -29333 -15066 -22190 -23501 -22421 -1728 -6573 -4784
13682d784l5230M505L9658N923M940Q377j930o353O583k1413q510N705j2794k2520
$$ -4784 -40014 -35509 4149 10072 15012 23389 21459 15106 21689 276 -8234 -2529 -15323 -37843
13668c7843R025K7521p900j4070J7888l264m252l480k006m117J6111K1050K524
$$ -37843 -28818 -1297 -9197 -23267 -5379 -8643 -12895 -16375 -18381 -22498 -6387 14663 17187
13655A7187o643J2939r750l0771L336O865n400n688l837j9140J9078J7800p885
$$ 17187 10544 23483 13733 -17038 -13702 -6837 -12237 -17925 -21762 -40902 -21824 -4024 -11909
13642a1909J214M403K4294L939l2001j6521p866K6346K4143j1397k5246J0064
$$ -11909 -10695 -6292 18002 21941 -10060 -26581 -34447 -8101 16042 4645 -20601 -10537
13630a0537K8415K1934J5432k4766m1401m998J7017Q865m796J618l648O972O871
$$ -10537 17878 39812 55244 30478 -10923 -15921 1096 9961 5165 6783 3135 10107 16978
13617A6978p872p321K2994j5811J249k3060l4398J3670J5882p744r104K7065Q277
$$ 16978 9106 1785 24779 8968 10217 -12843 -47241 -33571 -17689 -25433 -34537 -7472 805
13604H05J5485K007j7867k0922J3965L4660o379K0172j5167o711j3396p834J0058
$$ 805 16290 18297 430 -20492 -6527 28133 21754 41926 26759 20048 6652 -1182 8876
13591H876N998r421o628j0894J5158J3706N960j5199n411r13j5000k5368k2124
$$ 8876 14874 5453 -1175 -12069 3089 16795 22755 7556 2145 1232 -13768 -39136 -61260
13578f1260K3524K2982k8514l701Q952J4347m781j8801k2142K4641l374N757M0591
$$ -61260 -37736 -14754 -43268 -46969 -38017 -23670 -28451 -47252 -69394 -44753 -48127 -42370 -1779
13565a779K5756k4129k6679l3477N467R281J8089P450Q966j0194O718R437J0627
$$ -1779 23977 -152 -26831 -60308 -54841 -45560 -27471 -20021 -11055 -21249 -14531 -5094 5533
13552E533j6665K91R610K9838m751j5694J350o847k7144k9559P247K8934K3641
$$ 5533 -11132 -10841 -1231 28607 23856 8162 9512 2665 -24479 -54038 -46791 -17857 5784
13539E784o81p808J3881r059J0101o019p03j259j2548m431M69K7285K945o033
$$ 5784 5103 -2705 11176 2117 12218 6199 5496 4237 -8311 -12742 -12273 15012 17957 11924
13525A1924o399r536j1459O069m857k2694l003J3405M893q486l548k435K2922
$$ 11924 5525 -4011 -15470 -9401 -14258 -36952 -39955 -26550 -21657 -30143 -33691 -36126 -13204
13512a3204N286j1030j1332L127N3J2996J8874m026q487L042p655N321Q995o433
$$ -13204 -7918 -18948 -30280 -27153 -27100 -14104 4770 744 -7743 -4701 -12356 -7035 1960 -4473
13498d473k901O791L246J9711J1760j0043k546O25j73J2521J1316k257o76j2771
$$ -4473 -7374 -583 2663 22374 34134 24091 21545 22170 21997 34518 45834 43577 42901 30130
13484C0130j1486K2288j2088p344j6037k4017J3005P525k6934m096J4829L757
$$ 30130 18644 40932 28844 21500 5463 -18554 -5549 1976 -24958 -29054 -14225 -10468
13472a0468J6041J0361k5316l896l012P079r60J7931J1379j3877r386J1751J6917
$$ -10468 5573 15934 -9382 -13278 -16290 -9211 -10171 7760 19139 5262 -4124 7627 24544
13459B4544P925m26l6192k1603L0499J2786Q507r302p477j2525J1203R99j7178
$$ 24544 32469 32043 -4149 -25752 4747 17533 26040 16738 9261 -3264 7939 8938 -8240
13446h240k434K5577j8703k0007R404K8360p00j5526Q655o938K024J5608j6892
$$ -8240 -10674 14903 -3800 -23807 -14403 13957 13257 -2269 6386 -552 1472 17080 188
13433A88q040j231P725J5225J3556O612o624p89P660Q646j0114j741k2468k2368
$$ 188 -7852 -9083 -1358 13867 27423 34035 27411 26622 34282 42928 32814 31073 8605 -13763
13419a3763k0594j647K8385M614j3135j0926K0384K4768M240k0600r801j4536
$$ -13763 -34357 -36004 -7619 -3005 -16140 -27066 -6682 18086 22326 1726 -8075 -22611
13407b2611K328K9641K3908j863k2221q816L540J63j1580J153J5192r982Q193
$$ -22611 -20283 9358 33266 31403 9182 366 3906 4069 -7511 -6358 8834 -1148 7045
13394G045j0435j3842L8799K6551k4815j1151k269k3563j0293J6503J5796P284
$$ 7045 -3390 -17232 21567 48118 23303 12152 9883 -13680 -23973 -7470 8326 15610
13382A5610j8004k1162K8829K5412O621K197j6677O60P845Q673r436j3056K8777
$$ 15610 -2394 -23556 5273 30685 37306 39503 22826 23486 31331 40004 30568 17512 46289
13369D6289q967k5052K8209J2515k9073m3994l8859M410K2883J9396J1010J4595
$$ 46289 37322 12270 40479 52994 23921 -20073 -58932 -54522 -31639 -12243 -1233 13362
13357A3362k243q304l925j4705k4418J2653R801J2871M003j8995k8497K3154J7537
$$ 13362 11119 2815 -1110 -15815 -40233 -27580 -17779 -4908 -905 -19900 -48397 -25243 -7706
13344g706k1654k8347L470J334L4328j6844q957J1265j1141k306J2185J8354J2856
$$ -7706 -29360 -57707 -54237 -52903 -18575 -35419 -44376 -33111 -44252 -46558 -34373 -16019 -3163
13331c163O476J5105j2648J1336P091N856k300L762J1307N584l09k8291n992j453
$$ -3163 3313 18418 5770 17106 24197 30053 27753 31515 42822 48406 48097 19806 13814 12361
13317A2361j4224j5142j615M948O071M0874N506l0255j792n31J8353M739r011
$$ 12361 -1863 -17005 -18620 -13672 -7601 33273 38779 8524 6732 6201 24554 29293 20282
13304B0282j3378j658P980r871j5016M231K1772k2658l3202o21J1481K3554J6221
$$ 20282 6904 5246 13226 3355 -11661 -7430 14342 -8316 -41518 -42139 -30658 -7104 9117
13291I117j7206o790J4970L108o952n17l4261k992L2191J5566j8404q994J9160
$$ 9117 -8089 -14879 91 3199 -3753 -4270 -38531 -41523 -9332 6234 -12170 -21164 -2004
13278b004N348R600k631j2050l2036j0161J5999J3977R443l771J105L0644L073
$$ -2004 3344 12944 10313 -1737 -33773 -43934 -27935 -13958 -4515 -8286 -7181 23463 26536
13265B6536M596p240j3024M359J5711p799j7963j4423k0154N17K0395J4787k1485
$$ 26536 31132 23892 10868 15227 30938 23139 5176 -9247 -29401 -28884 -8489 6298 -15187
13252a5187K927J3704K5255J2722j5513o477Q863j9791L053k2521l806M834K2307
$$ -15187 -12260 1444 26699 39421 23908 17431 26294 6503 9556 -12965 -16771 -11937 10370
13239A0370k6335o470j3037k5089O809R397j354K4241J204n30M406K808J6260
$$ 10370 -15965 -22435 -35472 -60561 -53752 -44355 -45709 -21468 -20264 -20794 -16388 -13580 2680
13226B680q392J0441m144l704J7771j3500k9904j4437j37j4252K247J9254o433
$$ 2680 -5712 4729 585 -3119 14652 1152 -28752 -43189 -43326 -57578 -55331 -36077 -42510
13213d2510K6908j5872j9302R355o560N996n542j3469K4310K9130r471j2383j1346
$$ -42510 -15602 -31474 -50776 -41421 -47981 -41985 -47527 -60996 -36686 -7556 -17027 -29410 -40756
13200d0756N570M172j5110j5653K0288l427O8k821J0540K2903o728J5765J2763
$$ -40756 -35186 -31014 -46124 -61777 -41489 -44916 -44848 -47669 -37129 -14226 -20954 -5189 7574
13187G574k1784O192N426j0098n481L2006k234l359q350K6847j056k0821J3454
$$ 7574 -14210 -8018 -2592 -12690 -18171 13835 11601 8242 -108 26739 25683 4862 18316
13174A8316K4491l140j8409p88J2770r622j7347k1784q074K143j0269J2798K638
$$ 18316 42807 39667 21258 20470 33240 23618 6271 -15513 -23587 -21444 -31713 -18915 -16277
13161a6277J4450q515K0026N465n785P639J9370Q095j8634o023k6076l497n16
$$ -16277 -1827 -10342 9684 15149 9364 17003 36373 44468 25834 19811 -6265 -9762 -10278
13148a0278n79J5208J4035o816m776L996j9221j3213j6059J8563J8585J373m258
$$ -10278 -10857 4351 18386 11570 6794 10790 -8431 -21644 -37703 -19140 -555 818 -3440
13135c440j6114k0555L660Q781K7113K2733K0793N379o000r219n836l349k6060
$$ -3440 -19554 -40109 -36449 -27668 -555 22178 42971 48350 42350 33131 27295 23946 -2114
13122b114j5512J2200J9976J2024j6762j606Q621o946J0569K7630r701k3557j1530
$$ -2114 -17626 -5426 14550 26574 9812 8206 16827 9881 20450 48080 38379 14822 3292
13109C292J4267k9196q960O62K798p178J1326R141P75l200N342P039k1337j8175
$$ 3292 17559 -11637 -20597 -19935 -17137 -24315 -12989 -3848 -3073 -6273 -931 6108 -15229 -33404
13095c3404n686R86n170J056L8443J2044k0488j861o14q150o74o458K1274P81
$$ -33404 -39090 -38104 -43274 -42218 -3775 8269 -12219 -14080 -14694 -22844 -23518 -29976 -8702 -7921
13081g921r558P758M658j7014P824J082j0188o064J6424N639K2813J9115Q439
$$ -7921 -17479 -9721 -5063 -22077 -14253 -13171 -23359 -29423 -12999 -7360 15453 34568 43007
13068D3007j0408r171m264O590j0303k3710k0309J4750J5675j8223j19L759j1581
$$ 43007 32599 23428 19164 25754 15451 -8259 -28568 -13818 1857 -16366 -16485 -12726 -24307
13055b4307j5398k515J4656P452L6049j0576J2471J2115j4766m227J361Q759j0320
$$ -24307 -39705 -42220 -27564 -20112 15937 5361 17832 29947 15181 10954 12315 21074 10754
13042A0754r72j3510j9764J3741J7947n63j8285k354R079n262j1723N761K2406
$$ 10754 9782 -3728 -23492 -9751 8196 7633 -10652 -13006 -3927 -9189 -20912 -15151 7255
13029G255l410k5620r13p73l03P440j5022k263L041r53o254Q219Q506l849J8223
$$ 7255 3845 -21775 -22688 -23461 -23764 -16324 -31346 -33609 -30568 -31521 -37775 -29556 -21050 -24899 -6676
13014f676J7084j6720j0924n663m367J3403J4764k719n604j523L264J8242K3039
$$ -6676 10408 -6312 -17236 -22899 -27266 -13863 901 -1818 -7422 -8945 -5681 12561 35600
13001C5600k26k4829m535L000K3460J1169o168m5101j3118J0201O717L934n997
$$ 35600 35374 10545 6010 9010 32470 43639 37471 -7630 -20748 -10547 -3830 104 -5893
12988e893l1l903J5435R853j3790Q39J5302j0275k5789J769k014L964P202J3732
$$ -5893 -5924 -9827 5608 15461 1671 2510 17812 7537 -18252 -16483 -18497 -14533 -7331 6401
12974F401m259P867J4739j6948j5849k422M270k517j4924k4140M948K3987K5345
$$ 6401 2142 10009 24748 7800 -8049 -10471 -6201 -8718 -23642 -47782 -42834 -18847 6498
12961F498N453j3939q813j2029K0788J0800Q332j5701j2611j0277k4283q513L2140
$$ 6498 11951 -1988 -10801 -22830 -2042 8758 17090 1389 -11222 -21499 -45782 -54295 -22155
12948b2155J7509j2404j721J536k46j0859j8006K2430J0108o856J0289R031K319
$$ -22155 -4646 -17050 -18771 -17235 -17481 -28340 -46346 -23916 -13808 -20664 -10375 -1344 975
12935I75L832Q038N682K3283l482N252K0175k8077k7317j2001K2401L003k147
$$ 975 4807 12845 18527 41810 38328 43580 63755 35678 8361 -3640 18761 21764 19617
12922A9617J6687l660o830K4034P627k3114k7495O008l296j4307j6383p874O605
$$ 19617 36304 32644 25814 49848 57475 34361 6866 12874 9578 -4729 -21112 -28986 -22381
12909b2381K444j1227J8936R127k7467k6149k2817K0520L9554P982r383n810r489
$$ -22381 -19937 -31164 -12228 -3101 -30568 -56717 -79534 -59014 -19460 -11478 -20861 -26671 -36160
12896c6160O443K162O533j0057J944q563j0695o554J652J8812l8J719J2304K1953
$$ -36160 -29717 -27555 -21022 -31079 -29135 -37698 -48393 -54947 -53295 -34483 -34521 -32802 -20498 1455
12882A455J462k8000j7566O062K0942J5089m247J836O058l060l4040J6479M2167
$$ 1455 2917 -25083 -42649 -36587 -15645 -556 -4803 -2967 3091 31 -34009 -17530 24637
12869B4637R332q599j7718l536K1722J1166j907j4454r820R23R988N20o806J0412
$$ 24637 33969 25370 7652 4116 25838 37004 35097 20643 10823 11746 21734 22254 15448 25860
12855B5860k2485l3979r269K3355K6268j0662k102L5319P851l3141m0090k73J6965
$$ 25860 3375 -30604 -39873 -16518 9750 -912 -3014 32305 40156 7015 -33075 -33348 -16383
12842a6383K3771j3033P66J8222n658j5735L360j1571j2392R533J8650j0143J0896
$$ -16383 7388 -5645 -4879 13343 7685 -8050 -4690 -16261 -28653 -19120 -470 -10613 283
12829B83J4592k087n378k700J37j1978k2335J6127M730j3709O354r995J9679m719
$$ 283 14875 12788 7410 4710 4847 -7131 -29466 -13339 -8609 -22318 -15964 -25959 -6280 -10999
12815a0999k4422k4994M818K7515J9999Q927J0789J7167k6153M457k0868J066
$$ -10999 -35421 -60415 -55597 -28082 -8083 844 11633 28800 2647 7104 -13764 -12698
12803a2698L932Q262p692k4867P556J0867K4490R156j5616q721m219P443Q612
$$ -12698 -8766 -504 -8196 -33063 -25507 -14640 9850 19006 3390 -5331 -9550 -2107 6505
12790F505q973j7773l967R555R372P641L517j6047J3770L5252j1517j0954l104
$$ 6505 -2468 -20241 -24208 -14653 -5281 2360 5877 -10170 3600 38852 27335 16381 13277
12777A3277k069J0410o822j5796j4703K1898J9878o416m0923J7054J7800r859
$$ 13277 11208 21618 14796 -1000 -15703 6195 26073 19657 -21266 -4212 13588 3729
12765C729j3176m064q226O024p240j2441J9875J3742Q703J8735j424j0183L792
$$ 3729 -9447 -13511 -21737 -15713 -22953 -35394 -15519 -1777 6926 25661 24237 14054 17846
12752A7846J5660j8355p6N385j7364l7794K6102J0594J416j4795J9709o170J222
$$ 17846 33506 15151 15075 20460 3096 -34698 -8596 1998 3414 -11381 8328 2158 3380
12739C380L3726Q876p914q353o957n294J0145n303k1455M228j7023K3m360j4215
$$ 3380 37106 45982 38068 29715 22758 17464 27609 22306 851 5079 -11944 -11921 -16281 -30496
12725c0496J5592J1713Q116J952j9694J5751j5232j8543j835J2270R123N797q459
$$ -30496 -14904 -3191 4925 6877 -12817 2934 -12298 -30841 -32676 -20406 -11283 -5486 -13945
12712a3945N780O916N481j5626r214K874j4907J799K2741Q930k1438O081L650
$$ -13945 -8165 -1249 4232 -11394 -20608 -17734 -32641 -30842 -8101 829 -20609 -14528 -10878
12699a0878O482J0261o058k3819P101j1176j6699J2875L8547K3015K114k3664
$$ -10878 -4396 5865 -193 -24012 -16911 -28087 -44786 -31911 6636 29651 31765 8101
12687H101R281o874j4053J0860j5359j0232K5087K542n027J549n985j4266r908
$$ 8101 17382 10508 -3545 7315 -8044 -18276 6811 9353 4326 5875 -110 -14376 -24284
12674b4284J5624J9380j2905j049l213R006O461k099j275N654l613p881m114N085
$$ -24284 -8660 10720 -2185 -3234 -6447 2559 9020 6921 5646 11300 7687 -194 -4308 777
12660G77L607p902J2396R055J5392q720l532k6008Q239M620J1194K166q115j9093
$$ 777 4384 -3518 8878 17933 33325 24605 21073 -4935 3304 7924 19118 21284 13169 -5924
12646e924J202M304j2363K1733j8002m7395l254J6453K4373j721j2623J1255K4106
$$ -5924 -4722 -418 -12781 8952 -9050 -56445 -59699 -43246 -18873 -20594 -33217 -21962 2144
12633B144L4942K009j7610j0255j0045o637j4311K0844K1259r059M150j9955j5172
$$ 2144 37086 39095 21485 11230 1185 -5452 -19763 1081 22340 13281 17431 -2524 -17696
12620a7696p100o148J1386k777j6524j923K4746K5476q87j9116J6940p143j410
$$ -17696 -24796 -30944 -19558 -22335 -38859 -40782 -16036 9440 8553 -10563 6377 -766 -2176
12607b176J8873l361j4025J7115Q239p143j9549o600k7932j487q145p603M15K4976
$$ -2176 16697 13336 -689 16426 24665 17522 -2027 -8627 -36559 -38046 -46191 -53794 -53379 -28403
12593b8403K2041r546k4177o568Q776L0599K5306J3072o275k4276N944K2104J2139
$$ -28403 -6362 -15908 -40085 -46653 -37877 -7278 18028 31100 24825 549 6493 28597 40736
12580D0736Q449P133J8559o767l2296j4173l622n824n464k629j0996K403J5125
$$ 40736 49185 56318 74877 68110 35814 21641 18019 12195 6731 4102 -6894 -4491 10634
12567A0634Q639N383j6381j3576m597J442n515K0784J5519j2620n324m828K343
$$ 10634 19273 24656 8275 -5301 -9898 -8456 -13971 6813 22332 9712 4388 -440 1903
12554A903J7565l284k8990j7010J0670K4903L32N524j443k773O182K237m850k5381
$$ 1903 19468 16184 -12806 -29816 -19146 5757 6089 11613 10170 7397 13579 15816 10966 -14415
12540a4415j1054J1783K550l2772K505K425K5584L0689N712k7285j4024J5458
$$ -14415 -25469 -13686 -11136 -43908 -41403 -38978 -13394 17295 23007 -4278 -18302 -2844
12528b844K062q787J5736J875J0652n124j5485Q303J4605J33j124j1353j6528
$$ -2844 -782 -9569 6167 8042 18694 13570 -1915 6388 20993 21126 20002 8649 -7879
12515g879K2743n264l786N502J6386k673o751N735O654R501k1330K7J1181k0700
$$ -7879 14864 9600 5814 11316 27702 25029 18278 24013 30667 40168 18838 18865 30046 9346
12501I346N75L906l300j4212K600O611j6279J0635J9400O902k588j7768P493J7472
$$ 9346 9921 13827 10527 -3685 -1085 5526 -10753 -118 19282 26184 23596 5828 13321 30793
12487C0793k5120k7790l445j0504K8773m739n006J127j6106r86J6365M009K1952
$$ 30793 5673 -22117 -25562 -36066 -7293 -12032 -17038 -15911 -32017 -33003 -16638 -12629 9323
12474I323J7571K0152R18k8236k3048k5450n180J5232J6052n686o433j147J2171
$$ 9323 26894 47046 47964 19728 -3320 -28770 -33950 -18718 -2666 -8352 -14785 -15932 -3761
12461c761j4131j6332P108j576Q728J7107J1707K8580J1053j8072q134j9269j3980
$$ -3761 -17892 -34224 -27116 -28692 -19964 -2857 8850 37430 48483 30411 22277 3008 -10972
12448a0972m923K534l241l257J0118J9503q920k9554j7859J2544J3190J9405M8388
$$ -10972 -15895 -13361 -16602 -19859 -9741 9762 842 -28712 -46571 -34027 -20837 -1432 46956
12435D6956J0488j3403N103p009l0885k3681k4071N811J2095K6317K3898O44p568
$$ 46956 57444 44041 49144 42135 11250 -12431 -36502 -30691 -18596 7721 31619 32263 24695
12422B4695n884l1927M142n438r076K6708J3334j2974j5913j5289J8378j629k383
$$ 24695 18811 -13116 -8974 -14412 -23488 3220 16554 3580 -12333 -27622 -9244 -10873 -13256
12409a3256r69k594j2907O233K3528K6112J5577l844P100q298o783n284r842j7938
$$ -13256 -14225 -16819 -29726 -23493 35 26147 41724 37880 44980 36682 29899 24615 14773 -3165
12395c165J3062K0942k109N39K4075J1524j4110j3784R982j4709r918r968n223
$$ -3165 9897 30839 28730 29269 53344 64868 50758 36974 46956 32247 22329 12361 7138
12382G138j2194J319J6136J4543j3272j9946j6969J1298K355J7609K3925k8287
$$ 7138 -5056 -3737 12399 26942 13670 -6276 -23245 -11947 -9592 8017 31942 3655
12370C655r499J1456L538o886l1773K699m825q654k907k302M554o163K0809J8352
$$ 3655 -5844 5612 9150 2264 -29509 -26810 -31635 -40289 -43196 -45498 -40944 -47107 -26298 -7946
12356g946k989j899j1120L862M539M485L6101J1967l2131j4318K5427O413j1289
$$ -7946 -10935 -12834 -23954 -20092 -15553 -11068 25033 37000 4869 -9449 15978 22391 11102
12343A1102r226P892k240l136J0063l06p286M068k2967j1918l278J6904J3813
$$ 11102 1876 9768 7528 4392 14455 14149 6863 10931 -12036 -23954 -27232 -10328 3485
12330C485P22O340o360o776K1845N392j4063l1437k7883j1299J2569K5602J5058
$$ 3485 4207 10547 4187 -2589 19256 24648 10585 -20852 -48735 -60034 -47465 -21863 -6805
12317f805Q355N824o239O86j1336q369j0672j4982P480J2885P295K0315P620j9173
$$ -6805 1550 7374 1135 1821 -9515 -17884 -28556 -43538 -36058 -23173 -15878 4437 12057 -7116
12303g116J879J4183j0940K931J0611N965K2196Q22j9182j6290J850q30j2226
$$ -7116 -5237 8946 -1994 937 11548 17513 39709 40531 21349 5059 6909 6079 -6147
12290f147J0882L004l414n37j9841q845J9098L4994j3653J0116n634l363j9359
$$ -6147 4735 7739 4325 3788 -16053 -24898 -5800 29194 15541 25657 20023 16660 -2699
12277b699o078j1411P367R283l311p857r600L747l993j497O572J1456j0207M334
$$ -2699 -8777 -20188 -12821 -3538 -6849 -14706 -24306 -20559 -24552 -26049 -19477 -8021 -18228 -13894
12263a3894J6554L84r31P474j3486j3919J0617L7468j1085l041k2814j4932J7504
$$ -13894 2660 3044 2113 9587 -3899 -17818 -7201 30267 19182 16141 -6673 -21605 -4101
12250d101J3788O855q245k1679M829M032J1145O506K794j6842j2221j9444L441
$$ -4101 9687 16542 8297 -13382 -8553 -4521 6624 13130 15924 -918 -13139 -32583 -29142
12237b9142j1489K0430K7772L590k6439j7262K2453R296j1316Q999J2582N510
$$ -29142 -40631 -20201 7571 11161 -15278 -32540 -10087 -791 -12107 -3108 9474 14984
12225A4984J0934J8612n067j7877k7903l623J2995J3770j1919o552J0632j3179
$$ 14984 25918 44530 39463 21586 -6317 -9940 3055 16825 4906 -1646 8986 -4193
12213d193L712K4615P655j6230j8491K988J8449K2094L550j8241n144n838j1302
$$ -4193 -481 24134 31789 15559 -2932 56 18505 40599 44149 25908 20764 14926 3624
12200C624j5473j2209J0141K927K5726j3563K168Q210m244p858J3920l98L7346
$$ 3624 -11849 -24058 -13917 -10990 14736 1173 3341 11551 7307 -551 13369 12971 50317
12187E0317J7916j5767j0982j8071k2507K1198p398j1421K6353M093j6838J87
$$ 50317 68233 52466 41484 23413 906 22104 14706 3285 29638 33731 16893 17080
12175A7080m619k9715k4872m210K0922j17p217n362K9836L0575Q711j6664j8095
$$ 17080 12461 -17254 -42126 -46336 -25414 -25531 -32748 -38110 -8274 22301 31012 14348 -3747
12162c747J475o34Q752k185j1165O202N723j72j227j1360L989J5117P333j5185
$$ -3747 -2272 -2906 5846 3661 -7504 -1302 4421 4249 3022 -8338 -4349 10768 18101 2916
12148B916j3481j616j0501j2801J2465k3476N379K1152K7309O652P368k0441J1161
$$ 2916 -10565 -12181 -22682 -35483 -23018 -46494 -41115 -19963 7346 13998 21366 925 12086
12135A2086J7133J4361j5403l4055j4498J416L855o131M288R04R362j994O88K0849
$$ 12086 29219 43580 28177 -5878 -20376 -18960 -15105 -21236 -16948 -16044 -6682 -8676 -7988 12861
12121A2861J3979m890L685k830K287P076j8533l0919j0618l319k847n791K1776
$$ 12861 26840 21950 25635 22805 25092 32168 13635 -17284 -27902 -31221 -34068 -39859 -18083
12108a8083J4727L356J3946m217k862J2024l424k3376p797K2860j2500j9406m710
$$ -18083 -3356 0 13946 9729 6867 18891 15467 -7909 -15706 7154 -5346 -24752 -29462
12095b9462K4549J9920j7760j6374Q971Q050j1808M538L764J0548J4486R47j4836
$$ -29462 -4913 15007 -2753 -19127 -10156 -2106 -13914 -9376 -5612 4936 19422 20369 5533
12082E533k0422K8417K4887L809q662l3152l9595m887R042J2642P78M24J6260
$$ 5533 -14889 13528 38415 42224 33562 410 -39185 -44072 -35030 -22388 -21610 -21186 -4926
12069d926J4096j3683P316n95J888k4971j3492J6568M2127K6503k1078m5803j855
$$ -4926 9170 -4513 2803 2208 4096 -20875 -34367 -17799 24328 50831 29753 -16050 -17905
12056a7905J4053L913J8816P619J6885L58k5911L592J0532J141j4965j3143P773
$$ -17905 -3852 61 18877 26496 43381 43739 17828 21420 31952 33093 18128 4985 12758
12043A2758J54n419J1811L433J0701n579m554n897J5808J2278L698l4912k0030
$$ 12758 12912 7493 19304 22737 33438 27859 23305 17408 33216 45494 49192 14280 -5750
12030e750O282j2172N145J3549o885j4773r620r114k877o965J3719J6541R998
$$ -5750 532 -11640 -6495 7054 169 -14604 -24224 -33338 -36215 -43180 -29461 -12920 -2922
12017b922K1041k582R316k0267k1152M394j5678j1590m095j0613P833p25J3121
$$ -2922 18119 15537 24853 4586 -16566 -12172 -27850 -39440 -43535 -54148 -46315 -47040 -33919
12004c3919J9063K0721P257j5636K1519p62q319k1078J1714Q358j5923k7143J3513
$$ -33919 -14856 5865 13122 -2514 19005 18243 9924 -11154 560 8918 -7005 -34148 -20635
11991b0635N3164K6490j3020k7466k0841K461K8463J4295l169j8055j9253q334
$$ -20635 32529 59019 45999 18533 -2308 153 28616 42911 39742 21687 2434 -5900
11979e900k607J8379K1432r722j3196o328k2224j3209N087R910K3486l521k2115
$$ -5900 -8507 9872 31304 21582 8386 2058 -20166 -33375 -28288 -18378 5108 1587 -20528
11966b0528k986M970j2731K3308n933J1542J1828M958p392j6198L214J2573J641
$$ -20528 -23514 -18544 -31275 -7967 -13900 -2358 9470 14428 7036 -9162 -5948 6625 8266
11953H266k9453k4611L2495K3582j0824J0888n825j9136J0482J4868K090R01q973
$$ 8266 -21187 -45798 -13303 10279 -545 10343 4518 -14618 -4136 10732 12822 13723 4750
11940D750k669J5304k0834k940R154L898N577N016p972Oj5804p490k27M997R222
$$ 4750 2081 17385 -3449 -6389 2765 6663 12240 17256 9284 9290 -6514 -14004 -14231 -9234 -12
11925a2r122j1527j994j7221J0643J5680O917R149n191m46m100l6469j2099K5036
$$ -12 -9134 -20661 -22655 -39876 -29233 -13553 -6636 2513 -2678 -3124 -7224 -43693 -55792 -30756
11911c0756K3623O456J419J2586j3471R537j715j2161o23k4917P513L9364N842
$$ -30756 -7133 -677 742 13328 -143 9394 7679 -4482 -5105 -30022 -22509 16855 22697
11898B2697k0002r573L5422p815j4999j4545j2665J5424j7006q920K1667L6781
$$ 22697 2695 -6878 28544 20729 5730 -8815 -21480 -6056 -23062 -31982 -10315 26466
11886B6466r274p213P207j6924j093J9672J099j5775j6753k0340L951n665K3949
$$ 26466 17192 9979 17186 262 -831 18841 19940 4165 -12588 -32928 -28977 -34642 -10693
11873a0693J6990k8654J6993K9755m599P630l672k4992k2432Q122n330n607R326
$$ -10693 6297 -22357 -5364 24391 19792 27422 23750 -1242 -23674 -15552 -20882 -26489 -17163
11860a7163J264J7164Q067l96k6289J5526J3135K549j3422q687r6r827j6220l563
$$ -17163 -15899 1265 9332 8936 -17353 -1827 11308 13857 435 -8252 -8348 -18175 -34395 -37958
$$ [...]
##END NTUPLES=NMR SPECTRUM
##END=
