##TITLE=Analysis number 316558
Compound Code cc 28701
Book Reference 407/107
Project Code adrs
Chemist Name andyw
##JCAMPDX= 6.0         $$ Bruker NMR JCAMP-DX V2.0
##DATA TYPE= NMR SPECTRUM
##DATA CLASS= NTUPLES
##ORIGIN= Bruker BioSpin GmbH
##OWNER= nmr
$$ XWIN-NMR		Version 3.5
$$ Thu Jan 19 14:36:05 2006 GMT Standard Time (UT+0h)  MAYBRIDGE\nmr@NMR_250MHZ
##.OBSERVE FREQUENCY= 250.131544655141
##.OBSERVE NUCLEUS= ^1H
##.ACQUISITION MODE= SIMULTANEOUS (DQD)
##.ACQUISITION SCHEME= undefined
##.AVERAGES= 16
##.DIGITISER RES= 18
##SPECTROMETER/DATA SYSTEM= dpx250
##.PULSE SEQUENCE= zg30
##.SOLVENT NAME= DMSO
##.SHIFT REFERENCE= (INTERNAL, DMSO, 0, 16.5157)
##AUDIT TRAIL= $$ (NUMBER, WHEN, WHO, WHERE, WHAT)
$$ ##TITLE= Audit trail, XWIN-NMR		Version 3.5
$$ ##JCAMPDX= 5.01
$$ ##ORIGIN= Bruker BioSpin GmbH
$$ ##OWNER= nmr
$$ C:\u/data/dgb/nmr/ADRS/14950/pdata/1/auditp.txt
$$ ##AUDIT TRAIL=  $$ (NUMBER, WHEN, WHO, WHERE, WHAT)
(   1,<2006-01-19 14:35:32.87 +000>,<MAYBRIDGE\nmr>,<NMR_250MHZ>,
      <created by zg, POWCHK disabled, PULCHK disabled
       configuration hash MD5:
       62 19 C7 07 E1 42 D1 B7 37 6C 3D D0 77 39 F9 E6
       data hash MD5: 64K
       5E 45 21 1F 6C 38 89 90 22 02 B0 B6 8E 4C 07 7E>)
(   2,<2006-01-19 14:35:52.61 +000>,<MAYBRIDGE\nmr>,<NMR_250MHZ>,
      <Start of raw data processing
       ef LB = 0.3 FT_mod = 6 PKNL = 1 SI = 32K 
       data hash MD5: 32K
       DA D2 BB 83 65 98 E7 B6 1D 4E 73 3D 18 04 B4 3E>)
(   3,<2006-01-19 14:35:54.95 +000>,<MAYBRIDGE\nmr>,<NMR_250MHZ>,
      <apk 
       data hash MD5: 32K
       0F 94 64 A6 69 F1 B4 F1 76 54 39 A8 D4 C1 24 F7>)
(   4,<2006-01-19 14:35:55.81 +000>,<MAYBRIDGE\nmr>,<NMR_250MHZ>,
      <abs ABSG = 5 
       data hash MD5: 32K
       34 69 1E DF AD CA 65 81 39 00 B5 CC 9A DE 87 56>)
$$ ##END=
$$ 
$$ hash MD5
$$ 71 2E 8F 08 7E 98 12 77 D4 E2 FD FB 6A 20 10 58
##$RELAX= 
##$RELAX= 
##$RELAX= 
##$RELAX= 
##$RELAX= 
##$RELAX= 
##$RELAX= 
$$ Bruker specific parameters
$$ --------------------------
##$DU= <C:\u>
##$EXPNO= 14950
##$NAME= <ADRS>
##$PROCNO= 1
##$TYPE= <nmr>
##$USER= <dgb>
##$AMP= (0..31)
100 100 100 100 100 100 100 100 100 100 100 100 100 100 100 100 100 100 
100 100 100 100 100 100 100 100 100 100 100 100 100 100 
##$AQSEQ= 0
##$AQ_mod= 3
##$AUNM= <au_zg>
##$AUTOPOS= <54 >
##$BF1= 250.13
##$BF2= 250.13
##$BF3= 250.13
##$BF4= 250.13
##$BF5= 500.13
##$BF6= 500.13
##$BF7= 500.13
##$BF8= 500.13
##$BYTORDA= 1
##$CFDGTYP= 0
##$CFRGTYP= 5
##$CHEMSTR= <none>
##$CNST= (0..31)
1 1 145 1 1 1 1 1 1 1 1 1 1 1 1 1 1 1 1 1 1 1 1 1 1 1 1 1 1 1 1 1 
##$CPDPRG= <>
##$CPDPRG1= <>
##$CPDPRG2= <>
##$CPDPRG3= <>
##$CPDPRG4= <mlev>
##$CPDPRG5= <mlev>
##$CPDPRG6= <mlev>
##$CPDPRG7= <mlev>
##$CPDPRG8= <mlev>
##$CPDPRGB= <>
##$CPDPRGT= <>
##$D= (0..31)
0 1 0 0 0 0 0 0 0 0.06 0 0 0 0 0 0 0.0002 0 0 0 0 0 0 0 0 0 0 0 0 0 0 
0 
##$DATE= 1137681330
##$DBL= (0..7)
120 120 120 120 120 120 120 120 
##$DBP= (0..7)
150 150 150 150 150 150 150 150 
##$DBP07= 0
##$DBPNAM0= <>
##$DBPNAM1= <>
$$ [...]
##$SUBNAM7= <"">
##$SUBNAM8= <"">
##$SUBNAM9= <"">
##$SW= 20.6930455092707
##$SWIBOX= (0..15)
0 0 3 0 0 0 0 0 0 0 0 0 0 0 0 0 
##$SW_h= 5175.983436853
##$TD= 65536
##$TD0= 1
##$TE= 294.16
##$TE2= 300
##$TE3= 300
##$TEG= 300
##$TL= (0..7)
0 120 120 120 120 120 120 120 
##$TP= (0..7)
150 150 150 150 150 150 150 150 
##$TP07= 0
##$TPNAME0= <>
##$TPNAME1= <>
##$TPNAME2= <>
##$TPNAME3= <>
##$TPNAME4= <>
##$TPNAME5= <>
##$TPNAME6= <>
##$TPNAME7= <>
##$TPOAL= (0..7)
0.5 0.5 0.5 0.5 0.5 0.5 0.5 0.5 
##$TPOFFS= (0..7)
0 0 0 0 0 0 0 0 
##$TUNHIN= 0
##$TUNHOUT= 0
##$TUNXOUT= 0
##$USERA1= <user>
##$USERA2= <user>
##$USERA3= <user>
##$USERA4= <user>
##$USERA5= <user>
##$V9= 5
##$VALIST= <valist>
##$VCLIST= <CCCCCCCCCCCCCCC>
##$VD= 0
##$VDLIST= <DDDDDDDDDDDDDDD>
##$VPLIST= <PPPPPPPPPPPPPPP>
##$VTLIST= <TTTTTTTTTTTTTTT>
##$WBST= 1024
##$WBSW= 4
##$XGAIN= (0..3)
0 0 0 0 
##$XL= 0
##$YL= 0
##$YMAX_a= 324949
##$YMIN_a= -369328
##$ZGOPTNS= <>
##$ZL1= 120
##$ZL2= 120
##$ZL3= 120
##$ZL4= 120
##$ABSF1= 16.51573
##$ABSF2= -4.177443
##$ABSG= 5
##$ABSL= 3
##$ALPHA= 0
##$AQORDER= 0
##$ASSFAC= 0
##$ASSFACI= 0
##$ASSFACX= 0
##$ASSWID= 0
##$AUNMP= <proc_1d>
##$AZFE= 0.1
##$AZFW= 0.1
##$BCFW= 0
##$BC_mod= 0
##$BYTORDP= 0
##$COROFFS= 0
##$CY= 12.5
##$DATMOD= 1
##$DC= 0
##$DFILT= <>
##$DTYPP= 0
##$F1P= 14.0000005364418
##$F2P= -0.99999901652339
##$FCOR= 0.5
##$FTSIZE= 32768
##$FT_mod= 6
##$GAMMA= 0
##$GB= 0
##$INTBC= 1
##$INTSCL= 1
##$ISEN= 128
##$LB= 0.3
##$LEV0= 0
##$LPBIN= 0
##$MAXI= 10000
##$MC2= 0
##$MEAN= 0
##$ME_mod= 0
##$MI= 0
##$NCOEF= 0
##$NC_proc= -5
##$NLEV= 6
##$NOISF1= 0
##$NOISF2= 0
##$NSP= 0
##$NTH_PI= 0
##$NZP= 0
##$OFFSET= 16.51573
##$PC= 1
##$PHC0= 233.8204
##$PHC1= 4.866735
##$PH_mod= 1
##$PKNL= yes
##$PPARMOD= 0
##$PSCAL= 4
##$PSIGN= 0
##$REVERSE= no
##$SF= 250.130001566051
##$SI= 32768
##$SIGF1= 0
##$SIGF2= 0
##$SINO= 400
##$SIOLD= 32768
##$SREGLST= <1H.DMSO>
##$SSB= 0
##$STSI= 32768
##$STSR= 0
##$SW_p= 5175.98343685301
##$SYMM= 0
##$S_DEV= 0
##$TDeff= 65536
##$TDoff= 0
##$TI= <Analysis number 999999
Compound Code 99
Book Reference 9
Project Code 9>
##$TILT= no
##$TM1= 0
##$TM2= 0
##$TOPLEV= 0
##$USERP1= <user>
##$USERP2= <user>
##$USERP3= <user>
##$USERP4= <user>
##$USERP5= <user>
##$WDW= 1
##$XDIM= 32768
##$YMAX_p= 310209064
##$YMIN_p= -691500
$$ End of Bruker specific parameters
$$ ---------------------------------
##NTUPLES= NMR SPECTRUM
##VAR_NAME=  FREQUENCY,     SPECTRUM/REAL,   SPECTRUM/IMAG
##SYMBOL=    X,             R,               I
##VAR_TYPE=  INDEPENDENT,   DEPENDENT,       DEPENDENT
##VAR_FORM=  AFFN,          ASDF,            ASDF
##VAR_DIM=   32768,         32768,           32768
##UNITS=     HZ,            ARBITRARY UNITS, ARBITRARY UNITS
##FACTOR=    0.157963299565203, 1,           1
##FIRST=     4131.07954679572, 0,            0
##LAST=      -1044.90389005729, 0,           0
##MIN=       -1044.90389005729, -691500,     0
##MAX=       4131.07954679572, 310209064,    0
$$ Real data points
##PAGE= N=1
##DATA TABLE= (X++(R..R)), XYDATA
$$ [...]
15788a30306J56687r379p1576p8727J08658O9849l076o9388j28079J93765J26856
15777A65284r8039l9787k3799j95108N0032J13062J18768m3374p7855n4719j03942
15766a89477N7512N5889l0874L5132Q6244N9476J5236j1354J45607L9893l9918
15755B23366o1278j16798N0397L4843m7399q5063k944j40762N2616K15118n549
15744A16547n9407j1810r6541J24533J32625L6065p3398L6472J9645k39727k2587
15733c7583J4192P8095R9589l4759q7110R1396j89030L2522J43146J46666k78101
15722b0977k74844Q4811J22146J85322J45661j14405j92188M979K35005j34835
15712D0675J6077N2301N2344l2779O7851n6143M9770J52537J5611l31j22215p2147
$$ plain form
15788 -130306 26381 17002 -54574 -133301 -24643 45206 42130 -27258 -155337 38428 165284
15777 165284 67245 27458 3659 -191449 -141417 -28355 90413 47039 -30816 -85535 -189477
15766 -189477 -131965 -76076 -106950 -71818 14426 73902 89138 77784 223391 263284 223366
15755 223366 162088 45290 95687 130530 83131 -1932 -4876 -145638 -93022 122096 116547
15744 116547 57140 45330 -51211 73322 205947 242012 168614 205086 224731 -14996 -37583
15733 -37583 -23391 54704 154293 119534 32424 123820 -65210 -32688 110458 257124 -20977
15722 -20977 -295821 -211010 -88864 96458 242119 127714 -64474 -59495 175510 40675
15712 40675 56752 109053 161397 128618 196469 140326 190096 342633 358244 357913 235698 163551
15700A63551N6419k9962p1793J09442r3924l95868M4659K05052l9337N5160l9344
15689c5945p6574J11546R3906K28299j736n1513k3459j09077k61422O7618K03577
15678A45220K4610P7812j75834j48882r1124m4460L2653Q8890K2347o4096N6345
15667g6519O8160p0121J55162Q3439k8483N3870j26745j26256r9441L6542j21326
15656b51718P0743J52164J02384o0736K0204O4398O0598O5774j79375k3362M7463
15645F8537J74621P98j80219k08614l6935k3699J6949K8779J7J48895J10672n3607
15633D6194k1053P4995n1672j04840J45082j3582R353j03527K2823r7059r1530
15622a84816m7932R2341l3152q2592k106K65223R7281J3912J33112O1046j59162
$$ plain form
15700 163551 219970 190008 118215 227657 133733 -262135 -217476 -12424 -51761 3399 -35945
15689 -35945 -112519 -973 92933 321232 319496 267983 244524 135447 -125975 -58357 145220
15678 145220 169830 247642 71808 -77074 -168198 -212658 -180005 -91115 -68768 -132864 -76519
15667 -76519 -8359 -78480 76682 160121 131638 185508 58763 -67493 -166934 -130392 -251718
15656 -251718 -180975 -28811 73573 12837 33041 97439 158037 223811 44436 21074 68537
15645 68537 243158 243956 63737 -144877 -181812 -205511 -188562 -159783 -159766 -10871 99801 46194
15633 46194 25141 100136 48464 -56376 88706 75124 84477 -19050 3773 -93286 -184816
15622 -184816 -232748 -140407 -173559 -256151 -258257 6966 104247 118159 251271 312317 153155
15611A53155m6841j18752j34094K177J8753N2860j1398J32738J05887r4231L8484
15600I8738o4695k8396J2821L424P689N8001K8953j84927j45118R661P8602M5843
15588g9404J1983O9439K4029J8415o1957J78836R0664o0536j94610j30283m6267
15577a79691Q0392N4143J35902J13376j15184m2470j8142R8173R7934o5983j05452
15566E2998K66830Q8622j98153l4153m3796j39544l3858N440j04280l8306J31849
15555d6351n3058J02433p9325j45227J02665K13641j7934n1467j10968j42245
15545b27836m7301J13820O3310J52391K01439p5697j06896k1666J6693p9708k1779
15534c3230L9348l1089M6324J7676o8335p3246l5736r3765j79130J20224J69632
$$ plain form
15611 153155 106314 -12438 -146532 -144355 -125602 -72742 -84140 48598 154485 60254 98738
15600 98738 34043 5647 18468 21892 29581 87582 116535 -68392 -213510 -203849 -125247 -79404
15588 -79404 -67421 2018 26047 44462 -17495 161341 252005 191469 -3141 -133424 -179691
15577 -179691 -99299 -45156 90746 204122 88938 46468 28326 126499 224433 158450 52998
15566 52998 319828 408450 210297 176144 132348 -7196 -41054 -35614 -139894 -178200 -46351
15555 -46351 -99409 3024 -76301 -221528 -118863 94778 76844 25377 -85591 -227836
15545 -227836 -275137 -161317 -98007 54384 255823 180126 73230 51564 68257 -11451 -33230
15534 -33230 6118 -24971 21353 39029 -29306 -102552 -138288 -232053 -411183 -290959 -121327
15523a21327j31552P9219J63273j8677o2642K05597J43722j0292o7946M1456J1835
15512B32666j2255j79911q0520O5524J47746o7288o2960J50584M0810P449j167
15501B40678j20634M6174k9766k01090P86J06308q5832j4461L7729p2806L485
15490h9429J65710j9492j07710J17360O7057M9831J22249q1151m6847j45959p4921
15479d3302P0834j83183L84l7697R973l9949j40254j544K6301K03226J08914m3445
15467f9742j8491k6688n0669J93595M4963K9327j03403q3225l3242P4305K16312
15456A73042l4393n692m4355K9668J55226L0482q6913q9777q9593J08788J40979
15445B87462N8847K2281k06905J1909n1119k2737j32373J3572R2888N6224o6557
$$ plain form
15523 -121327 -252879 -173660 -10387 -29064 -91706 113891 257613 247321 179375 220831 232666
15512 232666 220411 40500 -40020 25504 173250 105962 43002 193586 234396 241845 240678
15501 240678 120044 166218 136452 -64638 -63852 42456 -43376 -57837 -20108 -92914 -89429
15490 -89429 76281 56789 -50921 66439 133496 183327 305576 224425 177578 31619 -43302
15479 -43302 27532 -155651 -155267 -192964 -182991 -222940 -363194 -364738 -338437 -135211 -26297 -69742
15467 -69742 -88233 -114921 -165590 28005 72968 102295 -1108 -84333 -117575 -43270 173042
15456 173042 138649 132957 88602 118270 273496 303978 217065 127288 37695 146483 287462
15445 287462 346309 368590 161685 173594 122475 99738 -32635 -19063 73825 130049 63492
15434F3492M0666O4700r5428n7332j12516Q2851M4013o3667l8746k4806j17904
15423b14677o5579l1244J30364O2326j01225p8585J07659J00331O841J08595K01391
15412B26197L4268k53583j16586M1617K997K0319l5670l7071L0826N1373K2994
15401a2319J3067k0697q0535q2443j34733J20019K44445J47516L30j57053j813
15390C5784j1865m0452k8640l3781M4772j13572r1166J4371J10461J39555O5193
15379I0660m9555j1397q472j00727j05472p9535J13363m7612K33371J19201j05349
15368D8476k24827j65513K140R1020K7646j04764J11726K47755J37764o0733J22977
15357B33667k6575K9565k10941j39232q9881L5054J95482M724K185O1333j24683
$$ plain form
15434 63492 104158 168858 73430 16098 -96418 -13567 30446 -33221 -71967 -96773 -214677
15423 -214677 -280256 -311500 -181136 -118810 -220035 -298620 -190961 -90630 -83789 24806 226197
15412 226197 260465 6882 -109704 -68087 -65090 -44771 -80441 -117512 -86686 -35313 -12319
15401 -12319 748 -19949 -100484 -182927 -317660 -197641 46804 194320 194650 37597 35784
15390 35784 23919 -16533 -45173 -78954 -34182 -147754 -238920 -224549 -114088 25467 90660
15379 90660 41105 29708 21236 -79491 -184963 -264498 -151135 -198747 34624 153825 48476
15368 48476 -176351 -341864 -339724 -248704 -221058 -325822 -214096 33659 171423 110690 233667
15357 233667 207092 236657 25716 -113516 -203397 -168343 27139 31863 34048 95381 -29302
15346b9302p2097n989J8361J12612j7290n706l6552L4135p0376K2613n9305J57435
15334D8539J30319K18985p1424r9072j43838n3195L0902l0815j35298M032m0747
15323a41612j35641L9761l8045N6130Q475q9553J4352M9665K4463J06427L6764
15312f8814j14959k01199Q3195n1668J808J8492K8117J32831K5984O3365J63306
15301H0458J64721j9687j83762J0568K4141j5051j34595j1772l3311O1086O1582
15290D378j03628L1069J72209P3092q0027j04717l0334j45435N9622K99127K1832
15279A97188j02045j36385l2526O6283j173J1168O3338O0261P5462J8581K0382
15268B40534m6739n5195n1931r3699L8515j136O9530j44274j43436J22411P823
$$ plain form
15346 -29302 -101399 -107388 -89027 23585 6295 589 -35963 -1828 -72204 -49591 -108896 48539
15334 48539 178858 397843 326419 227347 83509 30314 61216 30401 -104897 -100865 -141612
15323 -141612 -277253 -237492 -275537 -219407 -210932 -300485 -286133 -236468 -212005 -105578 -68814
15312 -68814 -183773 -384972 -301777 -353445 -351637 -333145 -305028 -172197 -146213 -82848 80458
15301 80458 245179 225492 41730 52298 76439 61388 -73207 -84979 -118290 -57204 4378
15290 4378 -99250 -68181 104028 177120 97093 -7624 -37958 -183393 -123771 175356 197188
15279 197188 95143 -41242 -73768 -7485 -8658 2510 65848 126109 201571 220152 240534
15268 240534 193795 138600 86669 -7030 31485 30349 99879 -44395 -187831 -65420 -57597
15257e7597m7600O6653J19876j84683R1136l122O2749J06442O036Q3583j48342
15246I5131j70890O8073L08048M8766j21571k25726j67477P1706L3219J27040
15236F6319M9922j0578K9092N7485j06972j13502p241n0056j06736j37017n0320
15225c79604J35765J29921M0505N5650L6639l5221N9482J34115p6694j0183J73731
15214B64106n0338j57120l5362J20037R906k55311j34716N9288J58426Q0662k1633
15203C7945k410J852O985K8445J06489O025j44258p1171Q275k1109j50705j75672
15191c69309L3465J07368L8259m650m3566J9624J06171J77634j1350j66351K0834
15180i1871q4892J25860O709p1021J70902J15520r8532o6626p7244O7597O7407
$$ plain form
15257 -57597 -105197 -38544 81332 -103351 -12215 -15337 47412 153854 159890 243473 95131
15246 95131 -75759 -7686 300362 349128 227557 1831 -165646 -93940 -60721 66319
15236 66319 116241 105663 134755 192240 85268 -28234 -35475 -85531 -192267 -329284 -379604
15225 -379604 -243839 -113918 -73413 -17763 18876 -16345 43137 177252 100558 90375 264106
15214 264106 213768 56648 21286 141323 151229 -104082 -238798 -179510 -21084 59578 37945
15203 37945 35535 37387 44372 72817 179306 185331 41073 -30098 -21823 -42932 -193637 -369309
15191 -369309 -335844 -228476 -190217 -194867 -238433 -218809 -112638 64996 53646 -112705 -91871
15180 -91871 -176763 -50903 -44194 -115215 55687 171207 72675 6049 -71195 -3598 63809
15169F3809m3054q9525q0744L9812J1582M4374J76945L0259L7474l0725k00775
15158d0568N9924K5547J1573J89732P3063m7302k690p7373R0574j86682n2903
15147D2895J8972l1595l7348p4644J21706J63044r6387k63085j4241N5622Q503
15136a06558k2986L1439N6236J06188Q1207j84727m2901O5090Q6836L935M250
15125G8009k3906j46327j15772J5703Q8094Q0638J51993J61954o0294j97077j42620
15114a09605k7030J20031Q7848j41120O2716P3072k9182j52257n3648j4700n0118
15103b33993J02458J30868n1445o0808j23119J06684J14364J00674J97510r5424
15093A87769j83598l4487j7025K3604J82113L96k3012j56003j01169J06199J7010
$$ plain form
15169 63809 20755 -68770 -149514 -109702 -98120 -53746 123199 153458 190932 160207 -40568
15158 -40568 19356 44903 56476 246208 319271 271969 269279 191906 282480 95798 42895
15147 42895 61867 30272 -7076 -81720 39986 203030 106643 -156442 -170683 -115061 -106558
15136 -106558 -129544 -98105 -41869 64319 145526 -39201 -82102 -17012 69824 73759 78009
15125 78009 54103 -92224 -207996 -192293 -104199 -23561 128432 290386 230092 33015 -109605
15114 -109605 -136635 -16604 71244 -69876 -7160 65912 36730 -115527 -169175 -183875 -233993
15103 -233993 -131535 -667 -52112 -112920 -236039 -129355 -14991 85683 283193 187769
15093 187769 4171 -30316 -47341 -23737 158376 158772 135760 -20243 -121412 -15213 1797
15082A797R6943j3424N148m3797j93556L6491J58800J69053j3852k07392j83968
15071a87757j24046J23670J38359J54236k0623n7589n1282j44002O8806M3616
15061e6612J19131K8750L8451R5415J0306j18496q2538P28J24495m4715r7445
15050A7470L0611n0886M9543r2652k3520n2717j31231o816O8682m1703K5317J08001
15038i9901q2785j23972J42231j3434o767j59995R0016P0813J21213M1091k35980
15027b57470M6615J75239N2347j60361j80523j3480J41062J22130p1806j14928
15017b61175P6088R3499N2452j22844N8059N9845K5204r810N1649n9332j45323
15006a81688k8686J08197J07647K57008j41093j77103m0659j52597l7972o1223
$$ plain form
15082 1797 98740 85316 90464 46667 -146889 -110398 48402 217455 203603 -3789 -187757
15071 -187757 -311803 -188133 -49774 104462 83839 26250 -25032 -169034 -100228 -56612
15061 -56612 62519 91269 129720 225135 235441 116945 34407 35135 159630 114915 17470
15050 17470 48081 -2805 46738 -45914 -69434 -122151 -253382 -260198 -191516 -233219 -207902 -99901
15038 -99901 -182686 -306658 -164427 -177861 -184628 -344623 -254607 -183794 -62581 -21490 -257470
15027 -257470 -210855 -35616 16731 -143630 -324153 -337633 -196571 -74441 -146247 -261175
15017 -261175 -185087 -91588 -39136 -161980 -103921 -44076 -18872 -28682 22967 -36365 -181688
15006 -181688 -210374 -102177 5470 262478 121385 -55718 -96377 -248974 -286946 -348169
14996c48169J38195M0144R0518K00875J86402o30j73846o9895n7856q0812k38816
14985c13890P4652J88321R8791J847j07016O9467j52545p9651q538J8360R1033
14974a19169J70408n6454j14517n6905O9701M8876R5560j10711j35895J10158
14964i8948N1794o434j64565M0291L9807L081K18730k6681j30391P6032R193J35273
14952A47182J63645o5883r6909j75827k32695J19542k695l2784K2620j6527l5560
14941b05891k4330J28663J72634O1571j24020p0352l6112M2716K8323o3299K1750
14930f8347J05512p6032j26328M3890Q4790J07879M1481q8719j17036j0247o1927
14919a65084K17624J10573k2202q2394j36952J26233o5652q687q8552l2463O3307
$$ plain form
14996 -348169 -209974 -169830 -79312 121563 307965 307335 133489 63594 5738 -75074 -313890
14985 -313890 -239238 -50917 47874 49721 -57295 12172 -140373 -220024 -228562 -210202 -119169
14974 -119169 51239 -5215 -119732 -176637 -106936 -58060 37500 -73211 -209106 -98948
14964 -98948 -47154 -53588 -218153 -177862 -138055 -134974 83756 57075 -73316 2716 11909 147182
14952 147182 310827 244944 148035 -27792 -260487 -140945 -143640 -176424 -153804 -170331 -205891
14941 -205891 -230221 -101558 71076 132647 8627 -61725 -97837 -55121 -26798 -90097 -68347
14930 -68347 37165 -38867 -165195 -121305 -36515 71364 112845 24126 -92910 -103157 -165084
14919 -165084 52540 163113 140911 58517 -78435 47798 -17854 -26541 -115093 -147556 -84249
14908h4249J64138j7441p9341J6430k4724j03682k7634m2291Q9945r1057j43976
14897c43882n1807J66549J17048k5478n0482J17892M5573R442n7808L3322p6376
14886a16007J34071K08163k20252n0961j3853k8226N2013k6211j1984k3665K7045
14875f9867M6688k43400n3188J90445J52921O205p3464L6540j4712j70025j6226
14864b08083K5614J6992p1030o739J61030J33465L5474j28138n4254o6990K4809
14853a37850O7341q3326j12591j73097k17731l4246J91655J99080K07559L25390
14843B32184J37289O4605k25584k6029o3219k27562M5240q7041j21441J29420
14833a42138R4633o8992n9590J14369J15086r8713J52755J31165j62614q9995
$$ plain form
14908 -84249 79889 62448 -16893 -463 -25187 -128869 -156503 -198794 -108849 -199906 -343882
14897 -343882 -395689 -229140 -112092 -137570 -188052 -70160 -24587 -15145 -72953 -39631 -116007
14886 -116007 18064 226227 5975 -44986 -58839 -87065 -35052 -61263 -73247 -96912 -69867
14875 -69867 -23179 -266579 -319767 -129322 23599 29804 -43660 -7120 -21832 -191857 -208083
14864 -208083 -182469 -165477 -236507 -243246 -82216 51249 86723 -41415 -95669 -162659 -137850
14853 -137850 -70509 -153835 -266426 -439523 -657254 -691500 -499845 -300765 -93206 232184
14843 232184 369473 434078 208494 182465 119246 -108316 -63076 -150117 -271558 -142138
14833 -142138 -47505 -116497 -176087 -61718 53368 -45345 107410 238575 75961 -14034
14823a4034j40450j77472R6245J80304L3962p9712j02271j3879J02193K60361
14813A45247j1385k38023O121L0060M0185K4900j54893j8297J44267j43851O4288
14802a11381L09897N962Q160m1276q3185K0445J5813M8020n8420J12124K9482
14791B55641r8327j20742n7324P03K844j8066J05435J4462j28753M6645K2646
14780B5164j65795O9991L8633j63552j00526J00884Q8882j55090l535J60181K2139
14769h2624q8975J40951J31595K440o2967k2840k4745J3552j9368J02400O0759
14758A50178N8254Q2944J06633j29681k50320m4170L3173K9345j07579j20171
14748a91394J15947L4208j52935L1253K63616P9364j72418j72886k41899O4780
$$ plain form
14823 -14034 -154484 -331956 -235711 -55407 -21445 -101157 -203428 -217307 -115114 145247
14813 145247 133862 -104161 -98040 -67980 -27795 -2895 -157788 -176085 -31818 -175669 -111381
14802 -111381 198516 204478 212638 171362 88177 108622 124435 172455 114035 226159 255641
14791 255641 157314 36572 -20752 -20049 -17205 -35271 70164 84626 -44127 2518 25164
14780 25164 -140631 -70640 -32007 -195559 -296085 -195201 -106319 -261409 -264944 -104763 -82624
14769 -82624 -171599 -30648 100947 103387 40420 17580 -7165 6387 -12981 89419 150178
14758 150178 208432 291376 398009 268328 18008 -26162 7011 36356 -71223 -191394
14748 -191394 -75447 -41239 -194174 -162921 100695 180059 7641 -165245 -407144 -342364
14738c42364J39010Q7750K45817O9061j42593k15197o815K1723J09294Q5339p6706
14727b5681l7235M2233R0941r2854j26427M778P4158m43j13787j8970J87818q3016
14715i8485l0956o5403J10520J14250J6759k0432j72762M1990K07691o2724K2941
14704F3389M2135p2533k2197j8908l0259M1498O8928m3616n1082m8407l6445R2613
14692a4884J18560j54422o845J44270R6314p088j28011p4689O59J53400O4767
14681A92031j35867n3347p8541j08371j04561M6827O9122O6726p922j38275q954
14670b61132K33809R1063j57391m4682q4255Q541J25237J67572M6428j52808k07690
14659b35308k5908K14308K06823L3571o9145J18297J18485j91671l46707k19600
$$ plain form
14738 -342364 -203354 -115604 130213 199274 56681 -158516 -165331 -143608 -34314 51025 -25681
14727 -25681 -62916 -20683 70258 -22596 -149023 -144245 -70087 -70530 -184317 -203287 -15469 -98485
14715 -98485 -129441 -194844 -84324 29926 46685 26253 -146509 -104519 103172 40448 63389
14704 63389 105524 32991 10794 -8114 -38373 3125 72053 28437 -22645 -71052 -107497 -14884
14692 -14884 103676 -50746 -57591 86679 182993 175905 47894 -26795 -26136 127264 192031
14681 192031 56164 2817 -75724 -184095 -288656 -241829 -172707 -105981 -113903 -252178 -261132
14670 -261132 -27323 63740 -93651 -138333 -222588 -214047 -88810 78762 125190 -27618 -235308
14659 -235308 -261216 -46908 159915 193486 124341 242638 361123 169452 -177255 -396855
14649c96855K09754J98667k72175j41012K64337J81847K81990J18042j52836k28053
14639F3706k04986J32848q7770K8897n8068m9299p3052K4288R9697r5832m1720
14628b61291l8121k9005J90051J00352l5181Q853m9696j76551M6156O2630l6526
14617b18329L0077j0039Q8980J41043r7832n9923P0078k7516J77137k27494j43905
14606b77723J47106J03082O48O2755R0516J1723j25417j32730j6297N3181J05623
14595B2467n1879p6732j08973R4527J62640J10041j62106O3715K9587r7463q2048
14584i6224l3330K3356J08293J07433l1645j59859L1164j48545j43900j12488
14574d55745j663P4775J05486L3302Q8178R1120J1485p668k3635p2q1610n155
$$ plain form
14649 -396855 -187101 11566 -260609 -401621 -137284 44563 326553 444595 291759 63706
14639 63706 -141280 -8432 -96202 -67305 -125373 -174672 -247724 -223436 -123739 -219571 -261291
14628 -261291 -299412 -328417 -138366 -38014 -73195 -64342 -114038 -290589 -244433 -181803 -218329
14617 -218329 -188252 -198291 -109311 31732 -66100 -126023 -55945 -83461 93676 -133818 -277723
14606 -277723 -130617 -27535 -26887 35868 126384 138107 12690 -120040 -136337 -83156 22467
14595 22467 -29412 -106144 -215117 -120590 42050 152091 -10015 53700 83287 -14176 -96224
14584 -96224 -129554 -106198 2095 109528 77883 -81976 -50812 -199357 -343257 -455745
14574 -455745 -457408 -382633 -277147 -243845 -155667 -64547 -53062 -60730 -84365 -84437 -166047 -171202
14562a71202j19649p6794N4614J4414K9776K29341J36284J36767j13498j20719
14552f66p2938N9402K13400j35347k41808k7596P7357R745m1079m4582P3915N8131
14540g2066M8437r9082j68602o7948k6751P2580J55287j08183n5296J04580j13212
14529c30256N1640L272J25475n2494K04813l2659j9587J54231J97850l2025o2413
14518B07847n7416J7279K729r4729j15661j5835M4993p7650l4914K4118J04374
14507E135j13359L5806j4952M4808J11700M073j19861r5439J81460Q6626p568
14496A18429l8893R0006M8055k19518j14533J45654r7151m9576L1539l8436J77116
14485E2692J02613m2677k0020k7275o1861j16223j07929R0427K47746l3694m7527
$$ plain form
14562 -171202 -290851 -367645 -313031 -298617 -268841 -39500 96784 233551 120053 -666
14552 -666 -73604 -14202 199198 63851 -177957 -205553 -128196 -118451 -159530 -204112 -130197 -72066
14540 -72066 -23629 -122711 -291313 -359261 -386012 -313432 -158145 -266328 -321624 -217044 -330256
14529 -330256 -278616 -275344 -149869 -202363 2450 -30209 -49796 104435 302285 270260 207847
14518 207847 150431 167710 170439 75710 -39951 -55786 -10793 -88443 -123357 -99239 5135
14507 5135 -108224 -72418 -87370 -42562 69138 73211 -46650 -142089 39371 125997 118429
14496 118429 79536 169542 217597 -1921 -116454 29200 -67951 -117527 -85988 -124424 52692
14485 52692 155305 112628 92608 65333 3472 -112751 -220680 -130253 117493 83799 36272
14474C6272j3841l357K03786l4159j6251p1938j54372p2119j17904L0150J24649
14463h9084R0325L2126P0689k144j34514l0363R3327P3873L7582j33996m5840
14452c8019n2188J14626r75j20331j14607Q8514J60154J26392q8618l1613n4610
14441a1275J7010q3663O2069K8018m2335N8770j83021n4876J02687J26566M0838
14430F0788P58q5123Q3311J20011k7022r6935o3356n8301p5598Q1254K34826L3160
14418B07773j32138J7853j3129j28011j74106k7999L4673r6549J0824q184K13828
14407i5165J50324N9662q5731p3566j13912N9954Q0791J26764l9788k61843j06357
14396b98867P1932R7765n93n3132n1810J14280J80075N4553j44413j54555m6027
$$ plain form
14474 36272 22431 19074 222860 188701 172450 100512 -53860 -125979 -243883 -213733 -89084
14463 -89084 1241 33367 104056 101912 -32602 -62965 30362 104235 141817 7821 -38019
14452 -38019 -90207 24419 23444 -96887 -211494 -122980 37174 163566 74948 43335 -11275
14441 -11275 5735 -77928 -15859 12159 -30176 28594 -154427 -209303 -106616 19950 60788
14430 60788 61546 -23577 59734 179745 152723 55788 -7568 -65869 -141467 -60213 174613 207773
14418 207773 75635 93488 80359 -47652 -221758 -249757 -215084 -311633 -300809 -308993 -95165
14407 -95165 55159 114821 29090 -44476 -158388 -98434 -17643 109121 69333 -192510 -298867
14396 -298867 -226935 -129170 -129763 -182895 -234705 -120425 59650 114203 -30210 -184765 -230792
14385b30792J16253J43383N9599q281J32640o4473k6724P2767k4563q571Q3191
14374B44429r6945k14439o0325o3126K65429K50038k3975k56738j49557k1261
14364a26470j5683j19p1808J85660J75443j3067j78070j42289j2144j3461p202
14353b19210K5160P4918J15524N8883N5711j2503j7821n6317J61897L5451j65063
14342E6630m4374R0790j5169L4238p3700o09l1330j28747j689j3620Q9457j6756
14330e4879R141N242P8533p6790m8987J46825j10315J7329O5967J06946j99151
14319f0139j72708M5229j0159L1739L8873J45622L47028K9770J04886j22337p8243
14308B99561J2969k78153o2434J20249R033j09542o1114P4227j60535K5110J6540
$$ plain form
14385 -230792 -114539 28844 88443 80162 212802 148329 121605 194372 169809 161238 244429
14374 244429 147484 -66955 -127280 -190406 75023 325061 301086 44348 -105209 -126470
14364 -126470 -142153 -142272 -214080 -28420 147023 133956 -44114 -186403 -198547 -212008 -219210
14353 -219210 -194050 -119132 -3608 55275 110986 98483 80662 24345 186242 221693 56630
14342 56630 12256 103046 87877 122115 48415 47806 16476 -112271 -113960 -127580 -38123 -54879
14330 -54879 -45738 -40496 38037 -38753 -87740 59085 -51230 -33901 32066 139012 -60139
14319 -60139 -232847 -187618 -197777 -166038 -127165 18457 365485 395255 500141 377804 299561
14308 299561 312530 34377 -28057 92192 101225 -8317 -69431 4796 -155739 -130629 -114089
14297a14089J8229J81054K16878n6072j36943l5734m2193J64409m5359r5709r0295
14286c5824j42558J3732J18738O3282P3536j34752p3528R6833k0777O583j2497
14275d7232N7587j10201j1926K8272m2678N63M4744q2142L6967J38266L9480O9205
14263A20905K6806K2302j87794j97846r7027J33060R1840J25571k9536p9623r3244
14252a64586p9013J64976Q114M5630l2873p7081l770O8375j19406o1050R0972
14241a59712M3721K3752O6647k41621k29884l6935J87562Q5634p3713j90496k7723
14230e52768J08495K05468Q314j48777j6042P9541J24265m6321n1989Q9534N8953
14219a41327K6755K0699J9599k1439j9006m8020M1013r014j01751N2334P1956
$$ plain form
14297 -114089 -95860 85194 302072 246000 109057 73323 31130 195539 150180 54471 -35824
14286 -35824 -178382 -164650 -45912 17370 90906 -43846 -117374 -20541 -41318 -34735 -47232
14275 -47232 10355 -99846 -111772 -83500 -126178 -125615 -80871 -163013 -126046 12220 51700 120905
14263 120905 147711 170013 -17781 -215627 -312654 -179594 -87754 37817 8281 -71342 -164586
14252 -164586 -243599 -78623 -70509 -24879 -57752 -134833 -138603 -70228 -189634 -250684 -159712
14241 -159712 -115991 -92239 -25592 -267213 -497097 -534032 -346470 -260836 -334549 -525045 -552768
14230 -552768 -444273 -238805 -230491 -379268 -395310 -315769 -191504 -237825 -289814 -200280 -141327
14219 -141327 -114572 -93873 -74274 -95713 -114719 -162739 -121726 -130740 -232491 -180157 -108201
14208a08201J48203P1868j67374L3398L5885N1438n3055n2278q4520L9043P858
14197g7735P9826R4956j47546r4146J02342J41155J14456r8781j12702k3907O2158
14186D0076N1187k8158J2143Q9530n7431j21184L8021j3718n0878L6090M4113
14175C9791P9966J02442j93648k24773j8284m9892j10009K0623Q6820J21939L923
14164a41102L6P7922j11415O0942N9586M0209p7693k8808l0252J15479J15676
14153H0580K799p7005o0325j9107R550J45915j15q7931o636r6936o2703m4114
14141b16028J01778J3818Q2673J48952K26952n0608l14773p9932J06095j628k12726
14130a95427P1414K16164J66278K1985o3427j69781k4765k50851q2105P9235K7985
$$ plain form
14208 -108201 40002 111870 -55504 -22106 13779 65217 12162 -40116 -124636 -85593 -77735
14197 -77735 2091 97047 -50499 -144645 -42303 98852 213308 114527 1825 -22082 40076
14186 40076 91263 63105 75248 164778 107347 -13837 24184 10466 -40412 -4322 39791
14175 39791 119757 222199 28551 -196222 -214506 -264398 -374407 -353784 -266964 -145025 -141102
14164 -141102 -141066 -63144 -174559 -113617 -54031 -13822 -91515 -120323 -150575 -35096 80580
14153 80580 83379 6374 -53951 -73058 -63508 82407 82292 -5639 -12275 -109211 -171914 -216028
14141 -216028 -114250 -100432 -17759 131193 358145 307537 -7236 -87168 18927 17299 -195427
14130 -195427 -124013 92151 258429 280414 216987 47206 22441 -228410 -310515 -231280 -203295
14119b03295j45218O4030J04836J39675J21051k5683J54067n2001l44302k7856
14109b14696J2969k8420j28587r7974J52017L41491M2727j17711m4050j3591L0335
14098f5490j16550j29834n615J1391J4954J60392N1936K1296K8319k4520j4942
14087f8663K1688J02133q4934j94864J57184o6445M8l4154j4616j8399M0305K57317
14075I6600k6404j02373m0070N519M6560K3055L0005n9937m5488q2446Q0671M6139
14063b8169M2560j25716m8609K3470n9687L6452l1048n9109J41906J41472l3850
14052c28J01744r8853r7292o46J22651k036q8201J40989Q4075J15253j13265j75477
14040a1386m7191m7799N6406K09673J4892k56915j19743J49813O5843l9092J2144
$$ plain form
14119 -203295 -348513 -284483 -179647 -39972 81079 55396 209463 157462 -186840 -214696
14109 -214696 -201727 -230147 -358734 -456708 -304691 36800 79527 -38184 -82234 -95825 -65490
14098 -65490 -182040 -311874 -317489 -306098 -291144 -130752 -78816 -57520 -29201 -53721 -68663
14087 -68663 -46975 55158 -29776 -224640 -67456 -133901 -133853 -168007 -182623 -201022 -160717 96600
14075 96600 70196 -32177 -72247 -66728 -20168 2887 32892 -27045 -72533 -154979 -74308 -28169
14063 -28169 14391 -111325 -159934 -136464 -196151 -159699 -190747 -249856 -107950 33522 -328
14052 -328 101416 2563 -94729 -95375 27276 25240 -62961 78028 162103 277356 164091 -11386
14040 -11386 -58577 -106376 -49970 159703 174595 -82320 -202063 -52250 13593 -25499 -13355
14029a3355M509j1012k8902q2881q4139M374J32517K4448n8806j5020o3516K0152
14017a71631Q7131J16131o425K5691n2202k71935o8356l259J6748J25664J07608
14006i4835R2959m0199J6563N3478j33212j43736P3962K9561p9865p4422O4987
13995b34759m0591j09660J00615P2151L7726K0857r6188j73023L8282J97032R9844
13984h7714J6596q23k2201P6680o4960j5159j1510J14036o6400q2544n1065j38785
13972c33849m3151J57575J24792J56684Q9341j28232o8324q4144j07330J65423
13962g1215J78473j63317j10702J46616J90993j14058r0279m190N527l7978J3777
13951e6353N0343j40294j32174k5225M5181P0083P7350Q675q8857P1248J00425
$$ plain form
14029 -13355 -8846 -19858 -48760 -131641 -215780 -211406 -78889 -54441 -113247 -128267 -191783 -171631
14017 -171631 -84500 31631 25206 50897 -1305 -273240 -341596 -344855 -328107 -202443 -94835
14006 -94835 -1876 -42075 -25512 27966 -105246 -248982 -175020 -145459 -225324 -299746 -234759
13995 -234759 -275350 -385010 -284395 -212244 -174518 -153661 -249849 -422872 -384590 -187558 -87714
13984 -87714 -71118 -71941 -94142 -17462 -82422 -97581 -109091 4945 -61455 -143999 -195064 -333849
13972 -333849 -377000 -219425 -94633 62051 151392 23160 -45164 -129308 -236638 -71215
13962 -71215 107258 -56059 -166761 -20145 170848 56790 -33489 -37679 -32152 -70130 -56353
13951 -56353 -6010 -146304 -278478 -303703 -258522 -188439 -111089 -102414 -191271 -120023 -19598
13940a9598m77r6189n4954Q471Q140J52021o0113j70153O5230J25421J31017r7226
13928h410n4042K8154n8248J1038j01219j01033M0007J01198j8031R4228j3010
13917g9368R4412M235m4278O358K8246J14115k4607J4321q4630k81639o5735M6376
13905b72194l8099J02933J53241O9484l2941j40161o5212p6144P8176n4523j6228
13894b91668O2849Q6800m6755p4507N4974J39906J42590L2291j13403j78639n0052
13883b35614p1498L7777O2144P1813L3700J01946j69401J54864K51791j1780Q7425
13872C13167j88555j26944p1530j19349l0081R2619J06819o7252N6215J37028
13862A02137Q5387M6582j7547N8836j59566j1109p3704l29916L6455N5527R8835
$$ plain form
13940 -19598 -20075 -116264 -171218 -162747 -154607 -2586 -62699 -232852 -167622 -42201 88816 -8410
13928 -8410 -62452 -34298 -92546 -81508 -182727 -283760 -243753 -142555 -160586 -66358 -79368
13917 -79368 15044 19279 -24999 -18641 9605 123720 99113 113434 28804 -252835 -318570 -272194
13905 -272194 -310293 -207360 -54119 15365 -17576 -157737 -222949 -299093 -220917 -275440 -291668
13894 -291668 -228819 -142019 -188774 -263281 -208307 -68401 74189 106480 -6923 -185562 -235614
13883 -235614 -307112 -269335 -207191 -135378 -101678 268 -169133 -14269 237522 225742 313167
13872 313167 124612 -2332 -73862 -193211 -223292 -130673 -23854 -91106 -34891 102137
13862 102137 187524 234106 216559 275395 115829 104720 31016 -298900 -262445 -206918 -108083
13851a08083K50854J79045j43115o5795n363r1047j72167o4958p6004j43262J75769
13840b64126Q9475j21742k0771j0524J44256J54054K34236L1058k06027l9069
13830i180l8368j36529k52604N2480L5168o8755l0784P5806P2631j02897o5734
13819d68766J05188J99932K76968M6517n1848P35q428J3974l1072R4735n9783
13808A18152j61129j89874P0779J74461k9843L7058m3362r6983k1975j13346J78853
13797g7209j30220r5792J50870j5171p7052R3855k9522n4820P1708Q2692l251
13786h3912J40661j7183O7295J1399j57956R708k9870j34752K4573j5471J13871
13775g1637Q8713m2227j5010q7626J05777P5672J8966N7519J17770o3733j0039
$$ plain form
13851 -108083 142771 321816 178701 112906 107543 16496 -155671 -220629 -296633 -439895 -264126
13840 -264126 -174651 -296393 -317164 -327688 -183432 -29378 204858 235916 29889 -9180
13830 -9180 -47548 -184077 -436681 -384201 -349033 -417788 -448572 -372766 -300135 -403032 -468766
13819 -468766 -363578 -163646 113322 159839 107991 108726 100298 114272 83200 177935 118152
13808 118152 -42977 -232851 -162072 12389 -17454 19604 -23758 -120741 -142716 -256062 -77209
13797 -77209 -207429 -303221 -152351 -167522 -244574 -150719 -180241 -235061 -163353 -80661 -83912
13786 -83912 56749 39566 106861 118260 -39696 -29988 -59858 -194610 -170037 -185508 -71637
13775 -71637 17076 -25151 -40161 -127787 -22010 53662 72628 130147 247917 184184 174145
13764A74145O3509k14959j53573J01038K13563N2828l1865j8620k07083j75864
13754a96881m1032P7488J11898m4197J4709o5975K9700p2613O2643J81983Q9430
13743A47153R6028j52560l5663J39571l9279K2363j08418j16366L6429J20196
13733A09454J9855o2443j37373j9463J04836q3981l8143L0999J66655K5973j18045
13722a676o6732j28932n1390R3307K0353J55420J59273n3309q0338Q4757N6730
13711A87463m143j17161j45084k3746j00686m3967j29684O4698K37904R2906l5679
13700a7179K5195O400l3708o9569P9055n2490r2617J76104J57180o2643j20722
13689d994N4319k17q9997j23171N3957J60658r769J19549Q4549J2282j03403L7616
$$ plain form
13764 174145 237654 22695 -130878 -29840 183723 236551 204686 186066 -21017 -196881
13754 -196881 -237913 -160425 -48527 -92724 -78015 -143990 -114290 -186903 -124260 57723 147153
13743 147153 243181 90621 54958 194529 155250 177613 69195 -47171 -10742 109454
13733 109454 129309 66866 -70507 -89970 14866 -69115 -107258 -76259 90396 116369 -1676
13722 -1676 -68408 -197340 -248730 -155423 -135070 20350 179623 126314 45976 130733 187463
13711 187463 183320 66159 -78925 -102671 -203357 -247324 -377008 -312310 -74406 18500 -17179
13700 -17179 8016 14416 -19292 -88861 -9806 -62296 -154913 21191 178371 115728 -4994
13689 -4994 49325 49108 -40889 -164060 -110103 50555 40786 160335 244884 257166 153763 191379
13677A91379l563N6654P6905R1079l05665j13926L9061q5755o603J49739P099
13666I6404J85574j45854P612J35395M0888k19657l8851K15150K4935q1853p2164
13655A47579k03018m1126L8364N6151J91833K22854N1820j4396Q7934J13288o371
13644F44912J38211j0548O6014J45998o3320J08363K16407J13358K4249m2287
13634A341357q9649P8812K27731J06549j12034j12544J35850j7240j7556K4896
13624A566172j31221o1137j73747k43479k30455j37553q2888j71902k20586J24683
13614B37887K14882M6454k24928j14588L5955O586J28850L042r0201l3967j12002
13603I7970Q5547J16153k221o352P9297J38244j6552q6767q7065j23422m8334
$$ plain form
13677 191379 187816 244470 321375 412454 106789 -7137 31924 -53831 -60434 89305 96404
13666 96404 281978 136124 143736 279131 320019 100362 61511 276661 301596 219743 147579
13655 147579 -55439 -96565 -58201 -2050 189783 412637 464457 450061 537995 651283 644912
13644 644912 783123 772575 838589 984587 921267 1029630 1246037 1359395 1383644 1341357
13634 1341357 1251708 1330520 1558251 1664800 1552766 1440222 1576072 1558832 1541276 1566172
13624 1566172 1434951 1373814 1200067 956588 726133 588580 505692 333790 113204 237887
13614 237887 452769 499223 274295 159707 195662 202248 331098 334140 243939 209972 97970
13603 97970 183517 299670 297449 291097 370394 508638 492086 405319 318254 194832 146498
13592A46498M9976n8317l4790n4853p7428Q5895J49196m0333j04386j05645j46186
13581a90373O6084J31147K39518J51882j72926j10668j37543L5229O9030L8225
13571A19605j73370j29025l8282j55083P0355J75381K9818L2823n7179q2980K19778
13560A1841L1664N652q2183p6144L116j02228j08264j00917J22725K13952K7894
13549e2892j30261o8327j894k8619j68330J29140K60951K7763p6503J4343P8400
13538a6229j46953n5113O1022N8960J62422M5951l6290Q3576O9566O1651j58595
13527A29968j71312N2720O7447j26j8341l8783Q4953k1096j00712O1254R047N3087
13515A08106J8291j79884q6348l9108J06162J1320j13319N4242K131R524J2783
$$ plain form
13592 146498 196474 138157 103367 48514 -28914 56981 206177 165844 61458 -44187 -190373
13581 -190373 -124289 6858 246376 398258 225332 114664 -22879 12350 81380 119605
13571 119605 -53765 -182790 -221072 -376155 -305800 -130419 -100601 -67778 -124957 -207937 11841
13560 11841 43505 49157 -33026 -109170 -106054 -208282 -316546 -417463 -294738 -80786 -52892
13549 -52892 -183153 -251480 -253374 -281993 -450323 -321183 -60232 -32469 -108972 -94629 -16229
13538 -16229 -163182 -218295 -157273 -98313 64109 110060 73770 157346 226912 288563 129968
13527 129968 -41344 11376 78823 78697 60356 21573 106526 85430 -15282 45972 55019 108106
13515 108106 126397 -53487 -139835 -178943 -72781 -61461 -174780 -120538 -118407 -108883 -96100
13504i6100O0547j02537q962J61438Q6693n9286r2288J15545J85387p5738p4546
13493A00153o614K5098j8628l3539j42340j14988J64815L5657Q5495J9362J6004
13482A30475j35349j63248m9102K84890J57401k59431l5097M3814K8186j12331
13472a09792L335J14124j8027q6067k4867J90320J97150l8637r2908j59866q3830
13461a09065J09198n4581J0577J13352J06420j51474L6660J90999j63753p7793
13451A0540N4973j52306P0886j76R7948j66169k33383M3988J80022J26132J8281
13440E0736L6149P0627m5564k6022Q2068o0595k2275j63300J51900L5907j52082
13429d2451j0620k9506o6597P2229L2789j21087K4848m6460k7854K0790O7546
$$ plain form
13504 -96100 -35553 -138090 -147052 14386 101079 41793 -50495 65050 250437 174699 100153
13493 100153 93539 118637 100009 66470 -75870 -190858 -26043 9614 95109 114471 130475
13482 130475 -4874 -168122 -217224 67666 225067 -34364 -69461 -25647 2539 -109792
13472 -109792 -106457 7667 -10360 -96427 -121294 69026 266176 227539 134631 -25235 -109065
13461 -109065 133 -54448 -43871 69481 175901 24427 61087 252086 88333 10540
13451 10540 65513 -86793 -15907 -16083 81865 -84304 -317687 -273699 -93677 32455 50736
13440 50736 86885 157512 111948 85926 167994 107399 85124 -78176 73724 109631 -42451
13429 -42451 -53071 -82577 -149174 -76945 -44156 -165243 -140395 -186855 -214709 -193919 -126373
13418a26373J05630l9205r5478K4109J46001j08324q650J24973Q2846j01051M112
13407H590j18348J4120N8731j4383r2907R1488K543o6072n7235j09810k1248L0472
13395b74059K5842m1650o4861P8256J61586M2636L9831P579J4914o222K6086o4551
13383e4613k6483q904j70488l1016K424P1533N7325j1261J02071J37653q2792
13372a4551m3182L0037m7651R4166j9208m2824L2298K885R0000R9507p8603m0428
13360F2446p6655j06560j2548o4716L6825J8955N2922n2420J09330J15530L1043
13349A14152j05033j51018L9727L0648J581j7717m1869k7070M6549p7236m1521
13338b28807n5958r1905O2983J96874j03598n6656O1063O8788m4838J39314J59785
$$ plain form
13418 -126373 -20743 -59948 -155426 -131317 14684 -93640 -102290 22683 105529 4478 8590
13407 8590 -109758 -95638 -36907 -51290 -144197 -52709 -50166 -116238 -173473 -283283 -304531 -274059
13395 -274059 -248217 -289867 -354728 -276472 -114886 -72250 -32419 -24840 -9926 -16148 9938 -54613
13383 -54613 -81096 -90000 -260488 -291504 -289080 -217547 -160222 -171483 -69412 68241 -14551
13372 -14551 -57733 -27696 -75347 18819 -389 -43213 -10915 -8030 81970 181477 102874 62446
13360 62446 -14209 -120769 -133317 -198033 -161208 -142253 -89331 -141751 -32421 83109 114152
13349 114152 9119 -141899 -102172 -71524 -69943 -87660 -129529 -156599 -110050 -187286 -228807
13338 -228807 -284765 -376670 -313687 -116813 -220411 -277067 -216004 -147216 -192054 -52740 107045
13327A07045M5491Q807p9897q3769k00358p3160j22223Q655K21383r5002p2928
13316c35956J49059J97143m3946j50867j04222L3367J08743M3975j0367J89180
13306G6109j7566n3736P4474J66414K8979k27601q1333J07264Q7653p2771r8781
13295a0895r2513j91915J175M3572R4166K1133r167j22956k2273J19439k25573
13284c95807j32221K64595K24905J17963o6504j51610k4338R3487L9570L2047
13274B087n9802n7206j29317L2915l724J5352J05545n9690N5976L8717j51407
13263b10554J74022N4027K4207R8969q5443P0357k5331j38410o0966J3448R2063
13252F389K7120j40012j1791J60440j3847j9184r5551K788j78750j24205J22177
$$ plain form
13327 107045 152536 161343 81446 -2323 -202681 -275841 -398064 -389409 -168026 -263028 -335956
13316 -335956 -186897 10246 -33700 -184567 -288789 -255422 -146679 -102704 -113071 76109
13306 76109 58543 4807 79281 245695 274674 47073 -34260 73004 160657 87886 -10895
13295 -10895 -103408 -295323 -294148 -250576 -156410 -135277 -144444 -267400 -289673 -170234 -395807
13284 -395807 -528028 -263433 -38528 79435 12931 -138679 -163017 -69530 -29960 2087
13274 2087 -57715 -114921 -244238 -211323 -215047 -199695 -94150 -153840 -97864 -59147 -210554
13263 -210554 -36532 17495 41702 140671 55228 125585 100254 -38156 -99122 -85674 6389
13252 6389 33509 -106503 -118294 42146 28299 9115 -86436 -83648 -262398 -386603 -264426
13241b64426L03963q884j2915Q2322J08922k2814j71982j36842Q8359o6983J00947
13230c33j9117o828L484L7253l418n7544o2731J9874l7319n0520k16706M2404
13218c51501J36970k3361L2733j8291j03090l4755J11254r121R4857J84946K0902
13207D1543j48659Q4822J04611n5231N7804L6096P6336k46951j93408L4797N9153
13196a49087n563M8342K016J41735m5705k5533j97268j00318R9707J25955l7482
13185a43201J57837O198o1916j26799j5877J60029J30183O2792j37395q9494j5036
13174g2679j4467L0863q7434M593P5269J07778m5817n1975j9475J43835j8947
13163E1544k19182k270p9241J55800K03952r171j15376n4394J6M4160L9004J22219
$$ plain form
13241 -264426 39537 30653 17738 100060 208982 186168 14186 -122656 -34297 -101280 -333
13230 -333 -19450 -26278 -22794 14459 11041 -46503 -109234 -89360 -126679 -177199 -393905 -351501
13218 -351501 -214531 -237892 -205159 -223450 -326540 -361295 -250041 -259162 -164305 20641 41543
13207 41543 -107116 -22294 82317 27086 84890 120986 197322 -49629 -243037 -208240 -149087
13196 -149087 -154650 -106308 -104292 37443 -8262 -33795 -231063 -331381 -231674 -105719 -143201
13185 -143201 14636 20834 -41082 -167881 -183758 -23729 106454 169246 31851 -57643 -72679
13174 -72679 -87146 -56283 -143717 -139124 -63855 43923 -1894 -53869 -73344 70491 51544
13163 51544 -167638 -169908 -249149 -93349 110603 101432 -13944 -68338 -68322 -24162 14842 137061
13151A37061j42m806Q5582r5548p1K2055p3344M6644L0097o1439j12739j96859
13139b23509J04194j00509N2299Q9495M717J87785N275j29479j70119L3940o6482
13128b12393J1708n4764l437K7788J93467K23173m9172k7518J22199j27835Q739
13117A11955P3441k07411J15159J0264j90264J4469K66968K06902m7617j92307
13107A61559o8188J57721O8382J22473L88013K77406M83949P66031J065803J835478
13097E258627K091415M82064j191280j614716j567610j173096p68941l60690k37537
13088I18236q7423k13908p3730j83601j57848Q7005n166j59139L5718L3762K8955
13077B22861j87945j2522J83018J21164K20530K50784J48985J02173J17521K58483
$$ plain form
13151 137061 136919 132113 217695 122147 122076 144131 70787 117431 147528 86089 -26650 -223509
13139 -223509 -119315 -219824 -167525 -78030 -73313 114472 119747 -9732 -179851 -145911 -212393
13128 -212393 -200685 -255449 -258886 -231098 -37631 185542 136370 108852 231051 103216 111955
13117 111955 185396 -22015 93144 103408 -86856 -72387 194581 401483 353866 161559
13107 161559 93371 251092 319474 441947 829960 1107366 1591315 2357346 3423149 5258627
13097 5258627 7350042 7832106 6640826 5026110 3458500 2285404 1516463 1155773 918236
13088 918236 830813 616905 543175 359574 201726 288731 283565 124426 160144 193906 222861
13077 222861 34916 22394 205412 326576 547106 797890 946875 1049048 1166569 1425052
13067A425052N38151J266602J963526K149484J562890J59904j329827k066328
13059E669454j928279j306727p95915m31726l01320n9512m5338j17157n3439j82106
13049D47935j8594J19331J8146j10104r6931K2396m0345p5340o9769J9744J65457
13038C81926n5524K2164N1707k5300m81L116k2555J03370J93051M02944K84472
13027A338890J15971K35580L60421P24039J240280J887891L280023N612797P109796
13018B1905688N523985P32727m335417o218615n538318l854235k372758j500135
13010D342922j187172o16974l26729l37312l61571k26146j26775p6283N3896j59474
13000I78382k67819k67718k36982R646k3174P1073J14072R9769R2330j50731m8177
$$ plain form
13067 1425052 1963203 3229805 5193331 7342815 8905705 9065609 7735782 5669454
13059 5669454 3741175 2434448 1638533 1206807 905487 845975 800637 683480 630041 447935
13049 447935 429341 548672 566818 456714 359783 382179 341834 266494 196725 216469 381926
13038 381926 326402 348566 400273 374973 374492 377608 355053 458423 651474 1054418 1338890
13027 1338890 1454861 1690441 2050862 2774901 4015181 5903072 9183095 14795892 21905688
13018 21905688 27429673 28162400 23826983 17608368 12070050 8215815 5843057 4342922
13010 4342922 3155750 2538776 2212047 1874735 1513164 1287018 1160243 1083960 1137856 978382
13000 978382 710563 442845 205863 215509 192335 263408 377480 477249 569579 418848 370671
12989C70671O6598J30933R1701J38201M5295m8569P4764J21338L26204P68564
12979B085700P98094Q29361J891442L462067N542156P103415N641593R58211l995413
12970B4316626o260711n552840l989017k598862j548639r96108p27232n12416
12962B130801j98178j82614l69362k67603j41394o7769r5134k44757k67356q1709
12952B14925M3916N2907n1878N2937R7681Q8866r9463p9307M3268K96593n9195
12941F01250j18353n5281q6817k5687J35210P1311J52291K10665L47305M48074
12931A679968J177364J938393K405160J936198L53440j144370j975672k040096
12923D330385j453011q95782m88153m05544k43953q9287N6849k28015k27037r6019
$$ plain form
12989 370671 437269 568202 659903 798104 843399 794830 869594 990932 1317136 2085700
12979 2085700 2883794 3713155 5604597 9066664 14608820 21712235 27353828 28312039 24316626
12970 24316626 18055915 12503075 8514058 5915196 4366557 3370449 2643217 2130801
12962 2130801 1932623 1750009 1380647 1113044 971650 903881 808747 563990 296634 214925
12952 214925 258841 311748 259870 312807 410488 499354 399891 320584 363852 660445 601250
12941 601250 482897 427616 340799 315112 450322 521633 673924 884589 1231894 1679968
12931 1679968 2857332 4795725 7200885 9137083 9490523 8346153 6370481 4330385
12923 4330385 2877374 1981592 1493439 1087895 843942 754655 811504 583489 356452 260433
12913B60433J73630o1629o0028o7871L1159N3748p0392j79969K6668K1077j10018
12902A6808k2371J98797J21353j9159Q0411M745O9103p977j51754j53783o9482
12891F6691L3305q3278p0928p6036J3285M9205J7965l5272n3523n4029j82465
12880c75080J54832J77963P7349j01663j35477m617K01593J50077m9727j35800
12870d0550q6102n7807K223J46207P1847L5410J93176k6496q8516j4432L096N6380
12858A94436m2225q0834K9314j29524M9483K50254K317r1801K9812N382j00103
12847A16511O1403j8655N1435J43810P3054q4488j27058n3921q2196j3463k0102
12836D6330M4222P9615J40699M2084k37114K9215J1071J43978M9098j86198j35954
$$ plain form
12913 260433 434063 372434 312406 244535 275694 329442 259050 79081 105749 126826 16808
12902 16808 -5563 193234 314587 295428 375839 380584 449687 441710 289956 136173 66691
12891 66691 99996 16718 -54210 -130246 -116961 -67756 -49791 -85063 -138586 -192615 -375080
12880 -375080 -220248 -42285 35064 -66599 -202076 -206693 -5100 144977 95250 -40550
12870 -40550 -126652 -184459 -182236 -36029 35818 71228 264404 237908 149392 134960 138056 194436
12858 194436 152211 71377 100691 -28833 20650 270904 273221 181420 211232 216614 116511
12847 116511 177914 159259 210694 354504 427558 343070 216012 162091 79895 66432 46330
12836 46330 90552 170167 310866 352950 115836 145051 156122 300100 349198 163000 27046
12825B7046o4198J42688K1938j10076p4371l4369K7530M4417O9666n4657n3840
12814e8226J8311K60852Q3422j24959l9267O8496R1523J4932j91535m2732j1486
12803F9331J49672J27672r3343q5941N7150j95178k04677j05778R0463L4685J5695
12792a40249m3577R9960j8266n9779j01233j41727J7185K07866J79432J07471
12782A07083J02432M8283p5715m3478k2294k0197N0956J91850l1251k4588L9380
12771C22461M8718j50435k75925o3409J60179N2483k1538o8358J1709n9257k34596
12760b77968l8336J90417J54899P2814l1123J41194O066j03908m0825j09083p9293
12749a15146M8631k4843N8285N9292j01333m7897R5747K7230K05354J04215p424
$$ plain form
12825 27046 -37152 105536 127474 17398 -56973 -91342 -63812 -19395 50271 -4386 -58226
12814 -58226 -39915 220937 304359 179400 140133 208629 300152 315084 123549 80817 69331
12803 69331 219003 346675 253332 167391 224541 29363 -175314 -281092 -190629 -155944 -140249
12792 -140249 -183826 -83866 -102132 -161911 -263144 -404871 -387686 -179820 -388 107083
12782 107083 209515 257798 182083 138605 116311 96114 147070 338920 307669 283081 322461
12771 322461 371179 220744 -55181 -118590 41589 94072 72534 4176 15885 -43372 -277968
12760 -277968 -316304 -125887 29012 101826 70703 211897 217963 114055 73230 -35853 -115146
12749 -115146 -66515 -91358 -33073 26219 -75114 -123011 -27264 -34 205320 309535 302111
12738C02111j40625k23942N5348J54343r504j84375j84849J4281K04787R5542
12728H3117n432m9095m3545j7530l4987J10762K12963R4398J6224j55559k46557
12717c5241Q122J25636l9013M8752o5352j02273l170j08047J02699J25589j94329
12706a36627j11554J87563J78887j13212Q079J06143J79735j34522j68686o0126
12696f4320k5896L8480L9040R07m3132p76P1987j2250k7572N3941O1861j81335
12684h9065o8800p9343m5769K21179K6809o5816k6551k4111K74868L8386j88225
12673b6438m998o49J17323K17367L6846O0510j83615j12378M8309P2489Q9340
12662C14106p7577J4863j27565Q7p1178J07681J35343j30259q5538j4587K7921
$$ plain form
12738 302111 161486 -62456 -7108 147235 137731 -46644 -231493 -217212 -12425 83117
12728 83117 77685 28590 -14955 -32485 -67472 43290 256253 350651 366875 211316 -35241
12717 -35241 -27119 98517 59504 108256 42904 -59369 -62539 -170586 -67887 57702 -136627
12706 -136627 -248181 -60618 118269 5057 13136 119279 299014 164492 -4194 -64320
12696 -64320 -90216 -51736 -12696 -11789 -54921 -55697 16290 4040 -23532 30409 92270 -89065
12684 -89065 -157865 -237208 -282977 -61798 -34989 -100805 -127356 -151467 123401 161787 -26438
12673 -26438 -31436 -32085 85238 302605 339451 399961 216346 103968 152277 224766 314106
12662 314106 236529 251392 123827 123914 52736 160417 295760 165501 79963 65376 93297
12651I3297J51546j14156j08473j06284j0072J07814k6798L5105L2031j27080
12641g3070L0945Q2551Q0911O5547J19350j00815j35774M8226M4013J5795L100
12630A80779J13389j4569J47747K01800Q0242m1542K1520j08716k53976k5419
12620C01255j09163r2012l5902L325K0487N028R44M2610k1610p7214J66052J4413
12608B18213j33963m7339o9856k7707q2645p3884O4260J64959J98312J49199Q4169
12597D43718J89532P8389j3308K19542R927j45604m1220l0728k8497R4904j36974
12586F39681r5945k80710o4721l0131n8783J78754p195r9426l3658P6537J82032
12575D06435n8652p0831k7047k7057M0298J5952l6771n4849p0329p454R4909J43878
$$ plain form
12651 93297 244843 130687 22214 -84070 -94142 13672 -13126 21979 54010 -73070
12641 -73070 -42125 40426 121337 186884 306234 205419 69645 117871 161884 177679 180779
12630 180779 294168 279599 427346 629146 709388 667846 689366 580650 326674 301255
12620 301255 192092 100080 64178 67503 87990 93018 93962 136572 114962 37748 203800 218213
12608 218213 84250 36911 -32945 -60652 -143297 -217181 -152921 12038 210350 359549 443718
12597 443718 633250 711639 698331 917873 927800 782196 740976 710248 681751 776655 639681
12586 639681 543736 263026 198305 168174 109391 288145 280950 181524 147866 224403 406435
12575 406435 347783 276952 249905 222848 263146 279098 242327 187478 117149 109695 204604 348482
12563C48482l8244q6715r2859L6867K6834J92156o3797m6051j67432r2982M9397
12552F5656J20558M2197o9752l5657q4805J20138K9543M9614o4037j18985j86197
12541a31727K7681q3135J07389P0025l5667k3444r3952J9972J53050Q5560j16838
12530b1086L1024j9183k4201m3891j39077Q8512R7342k4829L5536R8640L4168
12519A12955N540j53862j23988J21053m9031o1189O0642K5837R293J61687J62318
12508B71255j08638o8364N1513K7385M5278L1585k7020m4925k5930j40502r5861
12497h4224Q7105P4484o373j73480q8927J40679m5845j8266K32371K31597Q8768
12486D37889j04684r7210j89601j27395m3659K0193J57645K1642j36311q3001
$$ plain form
12563 348482 310238 223523 130664 167531 194365 386521 322724 276673 109241 16259 65656
12552 65656 186214 228411 158659 123002 38197 158335 187878 237492 173455 54470 -131727
12541 -131727 -104046 -187181 -79792 -9767 -45434 -68878 -162830 -142858 10192 95752 -21086
12530 -21086 9938 -9245 -33446 -77337 -216414 -127902 -30560 -55389 -19853 78787 112955
12519 112955 118495 -35367 -159355 -38302 -87333 -148522 -87880 -62043 -52750 108937 271255
12508 271255 162617 94253 145766 173151 218429 250014 222994 178069 152139 11637 -84224
12497 -84224 2881 77365 70992 -102488 -191415 -50736 -96581 -114847 117524 349121 437889
12486 437889 333205 235995 46394 -81001 -124660 -104467 53178 74820 -61491 -144492
12476a44492J5041M8668r4440j13967K49722N2207o1935N7640Q766M8304J17446
12465A82960J63456n1427j37587L2015M0657J42526J8550n6968J09673o724M1432
12454D78563K5841K78144K4965J52511R9368K095m5174r180Q6085L0841k14489
12443I09570k07126k61295M920L6241l8253L099j58948j68004k43795L9760P2754
12432a1077J47173J29217n0762j09730k04918N8156J37278l1471J12599j7587
12422A58878q3256J6546P5376J0415k7102k5079j75852j11417R5609l7653j81101
12411b84636j08561R8783k4407q4628O5402Q8282J12091K3690J57643k932j7248
12400B3479j77664J10951J30318K9648j65005q4658O8795R5107j9851k12445j97825
$$ plain form
12476 -144492 -129451 -80783 -175223 -289190 -39468 12739 -49196 8444 17210 65514 182960
12465 182960 346416 294989 157402 189417 230074 372600 391150 334182 443855 437131 478563
12454 478563 504404 782548 807513 960024 1059392 1061487 1016313 1007133 1093218 1124059 909570
12443 909570 702444 441149 446069 482310 444057 447156 288208 120204 -123591 -83831 -11077
12432 -11077 136096 265313 214551 104821 -100097 -41941 95337 63866 176465 158878
12422 158878 75622 92168 167544 177959 150857 125778 -50074 -161491 -65882 -103535 -284636
12411 -284636 -393197 -294414 -318821 -403449 -338047 -249765 -137674 -113984 43659 40727 23479
12400 23479 -154185 -43234 87084 116732 -48273 -132931 -64136 30971 11120 -201325 -399150
12389c99150K48553O2138J30620m2326r951R6351J05704M9978k02753o4343j1296
12378c6475k0116N9575N9735P957q9480q6652l907N3546J6157l753L0685Q3974
12366G1246J07977j11595l9758J30678R5488N865j10114k23000m1724O772l5301
12355a43466J04112K32301K06101l9144J3468J45381O439k98497k51421R1178
12345F6452R7699J21296Q0944q1202o0115l0536P4907p1353j98540r4713K3607
12334g1554J28802j25570p353Q8191k03836j23553J70325P4279j80774j14901
12324c65944L9787J22965O996j07577M5600J21499J76147N8972r9480J58k5871
12313b6748M8433k2530q1640K2130M9219J48902j4155k1106Q4625N1507J2648
$$ plain form
12389 -399150 -150597 -88459 42161 -165 -10116 86235 191939 241917 39164 -25179 -36475
12378 -36475 -56591 2984 62719 70676 -18804 -105456 -109363 -55817 -39660 -43413 -12728 71246
12366 71246 179223 67628 27870 158548 254036 259901 149787 -73213 -114937 -108165 -143466
12355 -143466 -39354 192947 399048 359904 373372 518753 525192 226695 -24726 66452
12345 66452 164151 285447 366391 285189 225074 194538 269445 198092 -448 -95161 -71554
12334 -71554 57248 -68322 -75675 12516 -191320 -314873 -144548 -70269 -251043 -365944
12324 -365944 -326157 -203192 -196196 -303773 -258173 -136674 39473 98445 -1035 -877 -26748
12313 -26748 21685 -845 -82485 -60355 -11136 137766 123611 102505 187130 238637 251285
12302B51285k59333k15775M1203J37799J4351k0536M4394P4217J68770j9968p5253
12291A41154l6666Q0402J36329n0748j59200r7776q6428j8717j85815P6531J15789
12280h5145P9731L9920Q6113P2571j8598r5350j1303j719N5074P1052K179j0186
12268A84339P4308k8257J0746j31334n1870m1856P9084Q2916M921K4200K8865
12257B36062o2963p9255j99431k825J38836P9594L3055J5670p2627j9278J01224
12246A68062J8079j10179j3746O6949N3957M0805J47577k20521O9135L9226p8180
12235A81164k0403j53664K4354p3496r9237J50045J03407j01748n3932Q4237n533
12224C5194o2552J9591R7207K5156N780J92394J65257k0835j70224k60315M5774
$$ plain form
12302 251285 -8048 -223823 -182620 -44821 -30470 -51006 -6612 67605 236375 216407 141154
12291 141154 104488 184890 321219 270471 111271 13495 -72933 -91650 -277465 -200934 -85145
12280 -85145 -5414 34506 120619 193190 174592 79242 67939 66220 121294 192346 194525 184339
12268 184339 258647 230390 241136 109802 57932 16076 95160 178076 182997 207197 236062
12257 236062 173099 93844 -105587 -108412 30424 110018 143073 158743 86116 66838 168062
12246 168062 186141 75962 62216 129165 183122 223927 371504 150983 220118 259344 181164
12235 181164 160761 7097 31451 -42045 -141282 8763 112170 10422 -43510 40727 35194
12224 35194 -27358 -7767 89440 114596 120376 312770 478027 457192 286968 26653 72427
12213G2427J8444j15255j19817N9086P7384K23669K834l5755j8631L2662R237
12202B06285N9381p1156k6745J71922R4387k2741j11759l0706p8666j2040M7998
12191B26160J62640K24503n4732j14918R4887K08321Q2627j50231k0373m5774
12181F13110j57660p9592j10985o1571J89443J46859l7385j05760n4933j21412
12171B20114J884k0529N1342q7631Q6304l070o1069J42415R7239N8280O8469O7116
12159F20864o3916k93021M6123m058J38204O3731L9167j61400j02970J35700K42306
12148F60730o634p8570R1633M2263l0495j75352k51689j5180n6313O5126L5734
12137B81253l9598m5704Q1863J38104J06726Q4253J89800o6720j77847l1029K4051
$$ plain form
12213 72427 90871 -24384 -144201 -85115 -7731 215938 218772 183017 164386 197048 206285
12202 206285 265666 194510 167765 339687 434074 411333 299574 268868 190202 178162 226160
12191 226160 388800 613303 558571 443653 538540 746861 829488 679257 658884 613110
12181 613110 455450 375858 264873 203302 392745 539604 502219 396459 341526 220114
12171 220114 221998 201469 252811 165180 251484 248414 187345 329760 426999 485279 553748 620864
12159 620864 556948 263927 310050 305992 444196 507927 547094 385694 282724 418424 660730
12148 660730 654096 575526 667159 709422 678927 503575 251886 236706 180393 245519 281253
12137 281253 241655 195951 277814 415918 522644 606897 796697 729977 552130 521101 545152
12126E45152J21386P312k21999J81686J30787m6635j31762n1710K8966J25136
12116F88319o8097j1676p5299n6819K59317K28167J4036J01547q1848m7941J0673
12105I60379j0905n7358J84642J25591j40056l45625n482J7722L1559O5523O1371
12094H87361J4920j52841J16983N1969N7807q1531K3677j6594r3599N4461Q4524
12083I47137J67629j21791J38384R6787j35410o7931p7846k4687J23306J1580
12073A057158N1884m4771P3392J94956K31348m0248j21961N5032O927o4946K27371
12062A626142O9220o5929K62005R1313k22946j12933Q649p7493L8705R3989N0893
12051A761615n5301J44067o4214j85024l6731j00144N2151J83144J55348l5507
$$ plain form
12126 545152 666538 673850 451851 633537 764324 717689 585927 534217 563183 688319
12116 688319 620222 608546 533247 476428 735745 963912 977948 1079495 997647 949706 960379
12105 960379 949474 892116 1076758 1202349 1062293 716668 711186 728908 760467 825990 887361
12094 887361 902281 749440 866423 918392 976199 894668 918345 901751 808152 862613 947137
12083 947137 1114766 992975 1131359 1228146 1092736 1024805 946959 922272 1045578 1057158
12073 1057158 1109042 1064271 1137663 1332619 1563967 1523719 1401758 1456790 1463717 1398771 1626142
12062 1626142 1695362 1629433 1891438 1982751 1759805 1646872 1655521 1578028 1616733 1710722 1761615
12051 1761615 1706314 1850381 1786167 1601143 1564412 1464268 1516419 1699563 1854911 1819404
12041A819404o1919m8948J39549P9387n2642J21987K477q615J9467J82117q6228
12030B106036Q051Q6780J54986J23132N4312J01657J87538R9616K4398M094m4626
12019B905974m8141J75m2180J95908J79824K14148J97558J75986J72512K58993
12009D210757J4272j1878P8417R1901Q8602N7591K4369J25939P1423j8816L2426
11998D765003K70360K65938L34297K59303R1393K06848J32166K28073L35323M52722
11988G341426K93190L76385J83174J79794L77454M20748L65287L38863M94177
11979A0370498L26158M24379M67895N36733P86518P66076N68444O18383P24466
11970A5589550P88029Q27543Q62850R96323Q48952J000242J110626J365869J495283
$$ plain form
12041 1819404 1757485 1708537 1848086 1927473 1874831 1996818 1999295 1990680 2010147 2192264 2106036
12030 2106036 2114087 2200867 2355853 2478985 2533297 2634954 2822492 2922108 2946506 2950600 2905974
12019 2905974 2857833 2858008 2815828 3011736 3191560 3405708 3603266 3779252 3951764 4210757
12009 4210757 4225029 4213151 4291568 4383469 4472071 4529662 4554031 4679970 4751393 4732577 4765003
11998 4765003 5035363 5301301 5635598 5894901 5986294 6193142 6325308 6553381 6888704 7341426
11988 7341426 7634616 8011001 8194175 8373969 8751423 9172171 9537458 9876321 10370498
11979 10370498 10696656 11121035 11588930 12125663 12912181 13678257 14246701 14865084 15589550
11970 15589550 16377579 17205122 18067972 19064295 19913247 20913489 22024115 23389984 24885267
11961B4885267J623712J708857J860550K073277K426631K850649K945947L014585
11953D3389475L157571L677081M118643M455804N099084N541197N968457P047211
11945H2454523P568572P921031Q657058R344391R890975J0539466J0667768J0438411
11937A57482195R919394Q901350P322295N238682K763643L56514k409096m858622
11929A84716355o556618q258192r333332r872032j0002394j0174535r895592r308276
11921A11315384q670213p999666p447337p011638o298092n617410n296258m674058
11913E8300712m084221l873412l488375l027036k864841k483239k437741k212072
11905C3829775k089555j754763j579588j487255j436490j313347j241627j008537
$$ plain form
11961 24885267 26508979 28217836 30078386 32151663 34578294 37428943 40374890 43389475
11953 43389475 46547046 50224127 54342770 58798574 63897658 69438855 75407312 82454523
11945 82454523 90023095 97944126 106601184 115945575 125836550 136376016 147043784 157482195
11937 157482195 167401589 176302939 183625234 188863916 191627559 191984073 189574977 184716355
11929 184716355 178159737 169901545 160568213 150696181 140693787 130519252 120623660 111315384
11921 111315384 102645171 94645505 87198168 80186530 73888438 68271028 62974770 58300712
11913 58300712 54216491 50343079 46854704 43827668 40962827 38479588 36041847 33829775
11905 33829775 31740220 29985457 28405869 26918614 25482124 24168777 22927150 21918613
11897B1918613j097060r96113q74767q89250q72783r03731q44507n80718n10204
11888A4349480n20239n08021m76655m77360m27744l25312m08108m96661m38259
11879A0271121k63374k74029k57790m04925m58577m09902j60858k40405k13901
11870G587360j73211m25979k26411j82560j8066K212k58744l42812k28696k68241
11860E464852j83515p2921J38331j95666k83529j64078k19363q3743J54698J24116
11850D679182j01217j29775q9229K0983j0669j32591j98882r8885j39907j84637
11840C614373n0306j20102K5800K0719K7800p9174j20188q8621j91894j51850
11830B886557n8043n5912K8802q4628M3555j22236J2953k693j18745m7518J5488
$$ plain form
11897 21918613 20821553 19825440 18950673 18061423 17188640 16284909 15440402 14859684 14349480
11888 14349480 13829241 13321220 12844565 12367205 11939461 11614149 11206041 10709380 10271121
11879 10271121 10007747 9733718 9475928 9071003 8612426 8202524 8041666 7801261 7587360
11870 7587360 7414149 6988170 6761759 6579199 6561133 6563345 6304601 5961789 5733093 5464852
11860 5464852 5281337 5208416 5346747 5151081 4867552 4703474 4484111 4400368 4555066 4679182
11850 4679182 4577965 4448190 4358961 4379944 4369275 4236684 4037802 3938917 3799010 3614373
11840 3614373 3564067 3443965 3469765 3490484 3518284 3439110 3318922 3230301 3038407 2886557
11830 2886557 2828514 2772602 2801404 2716776 2760331 2638095 2651048 2648355 2529610 2482092 2497580
11819B497580j82730M1014J5807o5154L7972O3620m6768k31907j27324n5927j06852
11808A839331J59327j37772l976M537K2930P1161l6866j18193p378m4799j61161
11797A587141j21053k8038J8864K6887m4394r389R1609M7688O6889j3889l1406
11786A590909k3040P8365m5501l634k33787l32823j32642m8188J66526K3266J07060
11775A146511O2283J4307j6477J52574J76399O0945j67166k45261j09392J34158
11765A208881P4573n3389P4776J63158N23P992j19737j95090M4102j63254N338
11754A047873J4986k9791j00146L1329j8118k7980J76768R0781j45282J1387j47612
11743I04195n8953j3407P359O019J13756K2440j1568N8263q3496O1505J52280
$$ plain form
11819 2497580 2314850 2355864 2371671 2306517 2344489 2408109 2361341 2129434 2002110 1946183 1839331
11808 1839331 1998658 1860886 1856910 1861447 1884377 1955538 1918672 1800479 1793101 1748302 1587141
11797 1587141 1466088 1438050 1456914 1483801 1439407 1430018 1521627 1569315 1636204 1622315 1590909
11786 1590909 1567869 1646234 1600733 1597099 1363312 1030489 897847 849659 1016185 1039451 1146511
11775 1146511 1208794 1223101 1206624 1359198 1535597 1596542 1429376 1184115 1074723 1208881
11765 1208881 1283454 1230065 1304841 1467999 1468522 1476514 1356777 1161687 1205789 1042535 1047873
11754 1047873 1062859 1033068 932922 964251 946133 918153 1094921 1185702 1040420 1051807 904195
11743 904195 845242 831835 839194 845213 958969 981409 969841 1028104 944608 1006113 1158393
11732A158393k4852k26543j35926R5314M1370n8898o4608P2841J60230K9675o2054
11721I84942n9118l1681M441L5752M0158j0338k2912m0185O8427q4951j65567
11710G18968P6545j03201j65120p7212L9290J35880J14477q1372m8770M4859P3122
11699G27466J55921J09356r3778k21540j65255P1241K2380k21975o7392K10085
11689E26509k5585j05383k19955j2074K70837J07176k48048j35985N9276J5668
11679B32436N1736J42786Q5185j0479K8127O635j05991j23244J65789M184l3370
11668D43794q6895j13937K5921k0253K37330O9067j5234k9973k11216o2008K5160
11657B61756R3730J10473L9079P4865j0722M6648j37740k09186r8061M7052j49272
$$ plain form
11732 1158393 1133541 906998 771072 866386 907756 848858 784250 857091 1017321 1046996 984942
11721 984942 925824 894143 898584 934336 974494 964156 941244 901059 969486 884535 718968
11710 718968 795513 692312 527192 449980 489270 625150 739627 658255 609485 654344 727466
11699 727466 883387 992743 898965 677425 512170 583411 605791 383816 316424 526509
11689 526509 500924 395541 175586 163512 434349 541525 293477 157492 216768 232436
11679 232436 284172 426958 512143 501664 529791 536426 430435 307191 472980 477164 443794
11668 443794 356899 242962 268883 248630 485960 555027 539793 509820 298604 236596 261756
11657 261756 355486 465959 505038 579903 569181 615829 478089 268903 170842 217894 68622
11646F8622J36564P994M4251J00341J03515P6719l1559l7874j22634m0977J7613
11635C22575J01768K7453L2366q2703m3363N6131m4060j40975N5060N5706n4517
11624B85441L3250j22808o899L9016q9231Q5945L1817J5224r7781j41852l6642
11613d520Q9086o3156L6658L4917L7871K41723R4594m5508n680o4107M8618O0769
11601D61265M2821q819j78526j03655n4413n2877J12415J94010J38520j90060
11591C60681Q4737R6513k6888j54162j17199K4217m0884O3847K1057o7573r321
11580B35025j2539J29627K14418j9890j04527k4766l357K4859P7772j9347j80047
11569C17228j60664k7025j9001Q5356J82491M722k42114m8344J23669j06466p7336
$$ plain form
11646 68622 205186 213180 257431 357772 461287 538006 506447 468573 345939 304962 322575
11635 322575 424343 451796 484162 401459 358096 414227 370167 229192 284252 339958 285441
11624 285441 318691 195883 188984 228000 138769 224714 256531 271755 173974 32122 -4520
11613 -4520 84566 21410 58068 92985 130856 372579 467173 421665 415985 351878 400496 461265
11601 461265 504086 495267 316741 213086 158673 105796 218211 412221 550741 360681
11591 360681 445418 541931 515043 360881 243682 267899 227015 290862 311919 244346 235025
11580 235025 222486 352113 566531 546641 442114 417348 413991 438850 516622 497275 317228
11569 317228 156564 129539 110538 195894 378385 383107 140993 92649 216318 109852 32516
11558C2516n2067R4174J23340j4571L1896J49642J94200n2109j8728J31929p5280
11547E44942j62666k4442j3295n3975j12075J17024L6029r0399L4190K8484n4178
11536B49639k16830j1141J46410J89866K6170j19267L712p1329r2366m6171J7742
11525G6435p225R450L2316J42642j25708j36031o7109Q3880O0264k2037L369k6536
11513B3710N3070P9432J30966K0458j61248O1379m9855n8325K1917O1959j24120
11502E9343J4203O771n1595K99192P7648m4333j26982j81459m6314J89890N122
11491B01486j04172N4067j53131m0441R9281j02358J61730k1352j46043L7018
11481a3915m2233J06712J92593L0016J8105j61601r6667j12652J46162J29696
$$ plain form
11558 32516 -19551 74623 197963 183392 215288 364930 559130 507021 488293 620222 544942
11547 544942 382276 357834 344539 290564 178489 295513 331542 241143 275333 303817 249639
11536 249639 32809 21668 168078 357944 384114 264847 268559 197230 104864 58693 76435
11525 76435 69210 78660 110976 253618 127910 -8121 -75230 8650 68914 46877 50246 23710
11513 23710 76780 156212 287178 307636 146388 207767 157912 99587 121504 183463 59343
11502 59343 73546 80317 28722 327914 405562 361229 234247 52788 6474 196364 201486
11491 201486 97314 151381 -1750 -42191 57090 -45268 116462 95110 -50933 -13915
11481 -13915 -56148 50564 243157 273173 291278 129677 33010 -79642 66520 196216
11471A96216m2289J7860j1573k938J08450k7009m0115J09466l8182j34768j07949
11460B7169r6146j00477K651J23682P9460K7911J3026l0399J49969R763J07110
11449C13719j6552p0867j9921O519M404P9702m0390K4764J36840j03308k60104
11438E4806k12687P7929J19496J04689j0808n1820Q9714m5304p0085O5876P621
11427A29427k01208J16157J92239Q0689j61427r4162j51103P1985Q8156j08139
11417c7386J75358N675j46360M7813k3780N3822J9476r3378R2396J74928j5422
11406B53142j50720k8704o31ML7673m1377L6472N9879j08234J323J39115l4243
11394A63699M0149j252j115k14420N4599R6789J42543o5575n1484j94726m5107
$$ plain form
11471 196216 153927 171787 160214 157276 265726 238717 198602 308068 269886 135118 27169
11460 27169 -68977 -169454 -166803 -43121 36339 64250 77276 46877 196846 206609 313719
11449 313719 297167 226300 206379 212898 217302 297004 256614 281378 418218 314910 54806
11438 54806 -157881 -79952 39544 144233 133425 81605 171319 126015 55930 121806 129427
11427 129427 -71781 44376 236615 317304 155877 61715 -89388 -17403 70753 -37386
11417 -37386 137972 143647 -2713 45100 21320 75142 94618 1240 93636 268564 253142
11406 253142 102422 73718 73087 73091 110764 69387 105859 165738 57504 58827 197942 163699
11394 163699 203848 202596 201481 -12939 41660 138449 280992 215417 163933 -30793 -75900
11383g5900J88467J84752p9095j47029j87563O1168r5654P2422p656n5326p0613
11372b12027Q7854K17333K13479r689p1687j48544m8178P3044J02775k066j07801
11361I4493R7105P0932M3283l6946M0671o5914j5456q63j43889j4831N1290M9114
11349A68989o1383k4642P3756J59909L6690j57178p5273j13402r2676K05462Q6047
11338B06299j22799j54027J02214R3018J21137j5605k21663N1838J22902n2515
11328A30799j59383J97421K8731p1594j2967k2541p3105O974l0421o9511k2669
11317i8266J44774j30192k09809M9186J16168N0914p7180k0105K36123n0413J0627
11306B1827J61010J3234J11266R8069j40874k23109j45656j38279J41201k3016
$$ plain form
11383 -75900 112567 297319 218224 71195 -116368 -55200 -150854 -78432 -86088 -141414 -212027
11372 -212027 -124173 93160 306639 296950 225263 76719 28541 101585 204360 202294 94493
11361 94493 191598 262530 305813 268867 309538 243624 228168 227305 83416 68585 119875 168989
11349 168989 107606 82964 156720 316629 353319 196141 120868 7466 -85210 120252 206299
11338 206299 83500 -70527 31687 124705 245842 230237 8574 60412 183314 130799
11328 130799 -28584 168837 197568 125974 113007 90466 17361 24335 -6086 -75597 -98266
11317 -98266 46508 -83684 -293493 -244307 -128139 -77225 -154405 -174510 61613 11200 21827
11306 21827 182837 196071 307337 405406 264532 41423 -104233 -242512 -101311 -124327
11296a24327o9590J47279j71711m0675P3479J43138O8123R647M1268O049K8650
11285A11330N8101j77164j13576O8781J38392N0203P9083j26404K9504j4234k6028
11274G7988N4551o4187L3715j846L3206l0869p5553k8240N8664p205J9174j4919
11262E4479j7660J94838l764O477J18427O0450k1160L913j67792l8230L4371K6231
11250B50580n0772k4944J42334J867R970q9014r3907n1325n3059j69118m5547
11239a72935M1064M9907L6175K63759J39288K8090j69505l2611K4755q7249m4102
11228G6636K0586o2493K374P440j41927r4916J34688j9091r0376J28575P9487
11217D0983l2640m890L5712M086J05484o8567n0179p8453J32641k3115q5768M9818
$$ plain form
11296 -124327 -193917 -46638 -218349 -259024 -185545 -42407 25716 35363 76631 82680 111330
11285 111330 169431 -7733 -121309 -52528 85864 136067 215150 88746 118250 104016 77988
11274 77988 132539 68352 102067 100221 133427 102558 27005 -1235 57429 50224 69398 54479
11262 54479 36819 231657 227893 234370 352797 413247 392087 396000 228208 189978 224349 250580
11250 250580 199808 174864 317198 319065 329035 240021 146114 94789 41730 -127388 -172935
11239 -172935 -131871 -81964 -45789 217970 357258 385348 215843 183232 207987 120738 76636
11228 76636 97222 34729 37103 44543 -97384 -192300 -57612 -76703 -167079 -38504 40983
11217 40983 8343 3453 39165 43251 148735 80168 29989 -48464 84177 61062 -24706 25112
11205B5112J28739Q8497L5505J7417L7089p3327j40506n2604J05363R6331o7400
11194B00216r0902K0123O4781q7655l5355L58744K4750j93707L5298j9763P184
11183B83714j92755j66277R9369K9061J9986n1949j5399m0368Q4414q4429r4745
11172a29378K9772O1655J07904l384r9926m0966K9606q5702j62066J76977J76873
11161F1365l5402N7352J14544l6832k1527M7328L8590j3266K0096J21301p8807
11150B74742M3692k6202j94185k9584K10735Q5629K3983r0930l8091j51358Q42
11139A09273j3871k2749j11018Q4589j7938l581l7921Q4928J67386j30321k65892
11128a57115p8654J29565J58659O874Q5476O8758k187n3932j40256J4050L0212
$$ plain form
11205 25112 153851 242348 277853 295270 332359 259032 118526 65922 171285 267616 200216
11194 200216 109314 129437 194218 106563 71208 429952 454702 260995 296293 276530 283714
11183 283714 90959 -75318 24051 53112 73098 21149 5750 -34618 49796 -34633 -129378
11172 -129378 -99606 -37951 69953 66569 -33357 -74323 -44717 -130419 -292485 -115508 61365
11161 61365 25963 83315 197859 161027 139500 186828 225418 212152 232248 353549 274742
11150 274742 318434 292232 98047 68463 279198 364827 388810 297880 259789 108431 109273
11139 109273 95402 72653 -38365 46224 28286 24705 -13216 71712 239098 108777 -157115
11128 -157115 -235769 -106204 52455 59329 144805 213563 211376 157444 17188 31238 61450
11117F1450j6508j4442J0439L3276O9657N0346L0478p691r0486K7872m6025m9337
11105E9029Q416j91787m2941O1157K2338m8148K0589M8238q3878j2416j17612
11094b77015n8714K03218K69500Q6427p5097j23745j33014j6242J63294J09429
11084A48041K2155J5739M4586p4242r8304j1253J6528O3096M0100m3254o3155
11073F0037M0495K22922P393r8037Q4096j48669j40551M9808J02408m3529j31642
11062D731n3087N9863J03838o4018m1888L4178J717N1962M8821R2452r2892n5745
11050H9932R5240j0249J7986o777j58834J69595J05049M3726j9799k79206J08837
11039A55500J34242R4987J34324L5960P0664j08978Q8409j58112K672n9059O5594
$$ plain form
11117 61450 44942 30500 40939 74215 143872 194218 224696 217005 126519 154391 108366 59029
11105 59029 67445 -124342 -167283 -106126 -83788 -131936 -111347 -63109 -146987 -159403 -277015
11094 -277015 -335729 -132511 136989 223416 148319 24574 -108440 -124682 38612 148041
11084 148041 170196 185935 230521 156279 57975 46722 63250 126346 166446 123192 60037
11073 60037 100532 323454 330847 232810 316906 168237 27686 77494 179902 136373 4731
11062 4731 -48356 11507 115345 51327 9439 43617 45334 97296 146117 238569 145677 89932
11050 89932 185172 174923 192909 186132 27298 196893 301942 345668 325869 46663 155500
11039 155500 289742 384729 519053 555013 625677 516699 605108 446996 449668 390609 456203
11028D56203J56282J36355K93582P8108P2989M5043P6969l25801p3383O6458J43164
11017A125969J46406J63519P4105K10670K55289Q4120j58521l13637j16290N0748
11007A522378q7732j55064j82128J53376O5960J24504L2634J3870j71595j84928
10997A131275k57297j49050j06819n9678J9615m2777l5351J7401J8129J56335
10987F91783j57059j04269j56687K7941M3707r6445j8041N403N7279r0896j61333
10976D1383m0712K174J26434Q3846L5628N3332K1838p784j2112o2696N0048O7603
10964C58982K2756J13466j71773l2348j35919j57135O4899N3607k5088M1469j34122
10953a206j70167Q5189K1864m6093n9877q471O1409J23776K08190L0684j17883
$$ plain form
11028 456203 612485 748840 1042422 1120530 1193519 1238562 1315531 989730 916347 982805 1125969
11017 1125969 1272375 1435894 1509999 1720669 1975958 2060078 1901557 1587920 1471630 1522378
11007 1522378 1434646 1279582 1097454 1250830 1316790 1441294 1473928 1487798 1316203 1131275
10997 1131275 873978 724928 618109 558431 578046 535269 499918 517319 535448 691783
10987 691783 534724 430455 273768 301709 345416 248971 230930 236333 293612 202716 41383
10976 41383 671 2845 129279 213125 248753 302085 323923 316139 304027 241331 291379 358982
10964 358982 381738 495204 323431 291083 155164 -1971 62928 116535 91447 132916 -1206
10953 -1206 -171373 -86184 -64320 -110413 -170290 -178761 -117352 6424 214614 245298 127415
10942A27415l91J2516L5824j4605K2334L5413l4640P8165O7962j2128J6135k22252
10930A11748j59948M6463L3212L4522P6247l2340o2022j61738J14898J44723j05338
10919D0427j65095k2975m8519J8982J99835K38149J09024J4274j5424j50653j19455
10908I8570j25289L3607Q7428N2935P1448m7965k987j23252M2351M1519j09922
10897A8443k21226K8028M1742J18280o6216P6761J91847O6307M3872q3460m9984
10886A64394J03406j8319j49195r2588J1614L6217L0699p6568j23350l4690P8693
10875f9687Q9908R7546M1296o6580L2130J62322j6357q4558J14999k15196L4361
10864A20184J83695j45625r2530R3009J52997Q0261K5764M8212l2834k76067j51741
$$ plain form
10942 127415 127024 139540 175364 160759 183093 218506 183866 262031 329993 317865 334000 111748
10930 111748 -48200 -1737 31475 65997 142244 109904 47882 -113856 1042 145765 40427
10919 40427 -124668 -147643 -196162 -177180 22655 260804 369828 384102 368678 218025 98570
10908 98570 -26719 6888 94316 147251 218699 170734 167747 44495 86846 128365 18443
10897 18443 -202783 -174755 -133013 -14733 -80949 -4188 187659 253966 297838 214378 164394
10886 164394 267800 249481 100286 7698 19312 55529 86228 9660 -113690 -148380 -69687
10875 -69687 20221 117767 159063 92483 124613 286935 270578 186020 301019 85823 120184
10864 120184 303879 158254 65724 158733 311730 391991 417755 465967 433133 157066 5325
10853E325q3320m7940M5744Q9896m2165k1769J13449J2031m4596M4135o4130Q9947
10841I6607J18001N852R5603r1418k38831k01960R7590J98112L623R5410m6418
10830A32171m3188q8961l6887M9121J76666j3195L2842j14340J7242K5329j26266
10819A0534m4683J89861J04052j0728k31304n7680J25939K24485J1162j29009
10809A92629M4111j7016R4032j25075k18277J06139j44431k0453p2118j06594
10799b67053j35652J46896K96230J50074r7519o8277n877j9054N706N7082N4028
10788A16584l1953j60817Q6433k5079M8912P6788j57384k0383R9261n4812k03683
10777b26133k1886J28861J21081k2347j85852p223r3800J45187J80687N4258L378
$$ plain form
10853 5325 -77995 -125935 -80191 9705 -32460 -54229 59220 71251 26655 70790 6660 96607
10841 96607 214608 220460 316063 224645 -14186 -216146 -118556 79556 83179 178589 132171
10830 132171 88983 22 -36865 12256 188922 175727 208569 94229 111471 136800 10534
10819 10534 -34149 155712 259764 249036 17732 -39948 85991 310476 321638 192629
10809 192629 236740 219724 313756 188681 -29596 76543 -67888 -88341 -160459 -267053
10799 -267053 -402705 -255809 40421 190495 92976 24699 18822 -232 5474 62556 116584
10788 116584 84631 -76186 10247 -14832 34080 110868 -46516 -66899 32362 -22450 -226133
10777 -226133 -248019 -119158 1923 -20424 -206276 -213499 -307299 -162112 18575 72833 76211
10766G6211j3582m4955q7780p5671K6579P7929J1484J42287R5383j57698j41129
10755i0942k23564p9669p70P9685K9569p9388n372K06315J33317n643O100K8652
10743a710j14222j89409J27126J80372Q2967O0128Q4319j09617M5479K29451j00243
10732B94641l09668O3966J48440K7783n2835l1814P8359J41168k574k00664J28974
10721B85776O2462J28689m854j9931j02557M7530J47420o3629k75079j01367m3808
10710F0652O4065j08075j5112Q2356q6125m6467P0548N5993n9091o4722j19413
10699a65391M9977j4113n1779k7336o5010m1819J54186J28880R2186j50565k8777
10688a19561n9091J2238J42789l8K0897Q7228n6479o6804n851j9904k0878k7313
$$ plain form
10766 76211 62629 17674 -70106 -145777 -119198 -41269 -29785 112502 207885 50187 -90942
10755 -90942 -314506 -394175 -394945 -315260 -285691 -365079 -370451 -164136 -30819 -36462 -30362 -1710
10743 -1710 -115932 -305341 -178215 2157 85124 145252 229571 119954 165433 394884 294641
10732 294641 -15027 48939 197379 225162 172327 140513 218872 360040 357466 156802 285776
10721 285776 348238 476927 472073 452142 349585 397115 544535 480906 205827 104460 60652
10710 60652 124717 16642 1530 83886 -2239 -48706 21842 77835 18744 -45978 -165391
10699 -165391 -115414 -129527 -181306 -208642 -273652 -315471 -161285 -32405 59781 -90784 -119561
10688 -119561 -178652 -166414 -23625 -23663 -2766 84462 27983 -38821 -44672 -64576 -85454 -112767
10676a12767l3403j21923J43439k9691l9431J00401O9418N0689j4272o285k9407
10665b3232J58743J07740k2368O1777j55261M9654j4602n8603N2678m0577j6914
10654I9035l5850M5646L9616o2318J07883M18314K71219J05930N69424Q35791
10644B394690K95734k71065m80313l67323j21085j71894p8143j35226j18294J11980
10634A059061L3972R589l2984R4579K55119L06227J47512J00482L47621P18094
10624C039272O64599O39133M18647M38465M34351M79935P16035Q42536J362443
10615I035416J792773K359048L480016M813626O579645Q829801J1624085J4760169
10607F3274579J5760916J2488747N502779j519269n022019m757780k342658J861637
$$ plain form
10676 -112767 -146170 -268093 -124654 -154345 -193776 -93375 -23957 26732 12460 6175 -23232
10665 -23232 135511 243251 220883 282660 127399 177053 162451 103848 156526 115949 99035
10654 99035 63185 108831 148447 86129 194012 612326 883545 989475 1558899 2394690
10644 2394690 2690424 2419359 1939046 1571723 1450638 1278744 1200601 1065375 947081 1059061
10634 1059061 1093033 1102622 1069638 1164217 1419336 1725563 1873075 1973557 2321178 3039272
10624 3039272 3703871 4343004 4761651 5200116 5634467 6114402 6830437 7672973 9035416
10615 9035416 10828189 13187237 16667253 21480879 28060524 36890325 48514410 63274579
10607 63274579 79035495 91524242 97027021 95507752 90485733 85727953 83385295 85246932
10599H5246932P404096J4398278K2765254L0789314L2603103K2344503L345913
10592B18897393j3356544k0447206j8235332j1511197k956731P111921J8526542
10585A78028846L0716460M0190910L9669211K1603637p309062l0129071l7757555
10578B35013376l4005802k4887584j4558217m160730N913858J5431340K1871300
10571B00617541J9781161N725525j3543002k7298886l0381605k6184306j9250056
10564A09466372j2288647n872605o22095L583477N700201L949909j902053r071671
10556I2942888j3996775j5039776j3507258j0898786q167224n957212m490648
10549B0885209l502203k676062k077374j442899j069922j013424r36460p21187
$$ plain form
10599 85246932 92651028 107049306 129814560 160603874 193206977 215551480 218897393
10592 218897393 205540849 185093643 166858311 155347114 152390383 159502304 178028846
10585 178028846 208745306 248936216 288605427 310209064 302900002 272770931 235013376
10578 235013376 201007574 176119990 161561773 157401043 163314901 178746241 200617541
10571 200617541 220398702 226124227 212581225 185282339 154900734 128716428 109466372
10564 109466372 97177725 91305120 90683025 94266502 99966703 103916612 102014559 92942888
10556 92942888 78946113 63906337 50399079 39500293 31333069 25375857 20885209
10549 20885209 17383006 14706944 12629570 11186671 10116749 9103325 8166865 7445678
10541G445678o62332n83869o11222m08236l20796r5752k9356m10502l27590k55964
10531C740059k42672k16369j92852n9487q7249k70938j13148j19463N8241L1172
10521B527294L0199j77121m0752j30887j10747k31807j11179j0908J40360j22650
10511A761802j20631l1343j01943R8208J20548j42493m1936j14800l7531L9296
10501A429177J83026J28178j11641j61246M0539r2257j78525j57681M5704J16993
10491A242267o47J0926m7000l3177j5821n9561j61780J55295K03973M0299l5937
10480A298837k29461n9359J42531J69864j85695k48875j3325J67435l4498k57006
10470G50448j63296n7389M7600J22352J32034p7294k02193j11538j20602l399
$$ plain form
10541 7445678 6783346 6199477 5588255 5180019 4859223 4763471 4734115 4323613 3996023 3740059
10531 3740059 3497387 3281018 3088166 3028679 2941430 2670492 2557344 2437881 2496122 2527294
10521 2527294 2557493 2380372 2339620 2208733 2097986 1866179 1755000 1744092 1884452 1761802
10511 1761802 1641171 1609828 1507885 1606093 1726641 1584148 1542212 1427412 1389881 1429177
10501 1429177 1612203 1740381 1628740 1467494 1508033 1415776 1237251 1079570 1125274 1242267
10491 1242267 1241620 1252546 1205546 1172369 1156548 1096987 935207 1090502 1294475 1334774 1298837
10480 1298837 1069376 1010017 1152548 1322412 1136717 887842 874517 1041952 1007454 750448
10470 750448 587152 529763 577363 699715 831749 754455 552262 440724 320122 316723
10460C16723P5414K52108J72420q7505K9983r3933j69702q6071K0556O7189N7404
10449E54586J08724R1148K17966n1361j31676L6518j54823j49309J31338P347
10439F60458j00699Q7515J83023j97381k3337j60325J613P0807J7089q6320O2244
10428E14687J25002K48112K832k18886o232n1055Q179n7902j79404j86893J80004
10417C78444L34828r7244j07189o7389l8959k07467J4109J28613P1097M3239o2036
10406C90046m2621q2918l2834j55151k3873R5747J66933p4482N8015K28631n4344
10395D73149j36582o8195K39592M0698p2034O6516j42706o6536q6180n2339M0680
10384B36063L23136J70747j88437j11725j23598P8035L1636K5927P4465j23324
$$ plain form
10460 316723 392137 644245 816665 729160 759143 665210 495508 409437 429993 497182 554586
10449 554586 663310 754458 972424 921063 789387 825905 671082 521773 653111 660458
10439 660458 559759 647274 830297 632916 609579 449254 450867 521674 538763 452443 514687
10428 514687 639689 887801 890633 671747 665515 614460 622639 564737 385333 198440 378444
10417 378444 713272 616028 508839 441450 402491 195024 209133 337746 408843 452082 390046
10406 390046 347425 264507 231673 76522 52649 148396 315329 240847 298862 527493 473149
10395 473149 336567 268372 507964 548662 476628 543144 400438 333902 247722 195383 236063
10384 236063 559199 729946 541509 429784 306186 384221 415857 441784 516249 392925
10374C92925o667M0460j34671r0123p0247J22046l4816m5872O0482j8312o7563
10363A47642p647L2929j2558J07575K07940j5710j05306J14924Q1376N7031O333
10352F14529k11283M7170L5858R1315J18616j4122k6751j27610j50613N8983J65886
10341F01978k3627Q7142l5498j61040M8115J75097m7155l13329j63166K27989
10331C96506J00728j85220Q4477r9511n031M4494Q0654K01179Q7876j74604j63650
10320C67898m8992k5499Q7729p0633O7510O3921J9596m5780q074j19952j26366
10309A61358k02838o5884J97750K9408K6473O5030O2987O5648O7993l217o5712
10298C38996J37611P3729N0024q9374N0997R9003Q4608J701j88447k06195m0222
$$ plain form
10374 392925 386258 426718 292047 201924 131677 253723 218907 173035 233517 215205 147642
10363 147642 139995 172924 160366 267941 475881 460171 354865 469789 551165 608196 614529
10352 614529 403246 450416 486274 577589 696205 682083 655332 527722 377109 436092 601978
10341 601978 578351 665493 629995 468955 517070 692167 645012 331683 168517 396506
10331 396506 497234 312014 396491 296980 291949 336443 417097 618276 706152 531548 367898
10320 367898 318906 293407 381136 310503 378013 441934 461530 415750 407676 287724 161358
10309 161358 -41480 -107364 90386 119794 146267 211297 274284 339932 407925 404708 338996
10298 338996 476607 550336 600360 510986 561983 660986 745594 747295 558848 352653 312431
10287C12431Q0393n6252j2911K13568o6848j00951o4095K329q4382r3146N163
10276A35299J50939L0243q0882j01404l320j1508L0878m6708k63558p6677Q4901
10265a51797L9279k9503M3133J40926K7052Q9426j68477j78600o7621J48052J94765
10254H6635J64260l4056j88365r8000J14654J70194j1651L736r8348o3140n1548
10243e629K3510q6803q2727K1694J87952O7403N8826j7596M4255k7649k00070
10232a6834r9603j21212q0348R9687J02574R5369P6174P7675m2947j25829j37510
10221a72804m8447L4778J26452M5358N8491J6751N1920j10475n1636J7649O5646
10210C3683n6119r4866n707k3111O2450J87496Q9949J17697r1289M3205O9416
$$ plain form
10287 312431 392824 336572 323661 537229 470381 369430 305335 307664 223282 130136 135299
10276 135299 286238 316481 235599 134195 130875 119367 150245 103537 -160021 -236698 -151797
10265 -151797 -112518 -142021 -98888 42038 69090 158516 -9961 -188561 -256182 -108130 86635
10254 86635 250895 216839 28474 -69526 45128 215322 203671 207407 109059 45919 -5629
10243 -5629 17881 -68922 -151649 -129955 57997 125400 184226 166630 210885 183236 -16834
10232 -16834 -116437 -237649 -317997 -218310 -115736 -20367 55807 133482 90535 -35294 -172804
10221 -172804 -221251 -186473 -60021 -14663 43828 60579 112499 2024 -49612 -31963 33683
10210 33683 -22436 -117302 -123009 -146120 -83670 103826 193775 311472 220183 263388 332804
10199C32804J6413j33006k8821K642l730P6213N8690M5365o7176M1450M0563q7333
10187B94074j23805j54362j82785l0465K40626J63410J58793N1663m7903N0338
10177D19584K41606J86390k4652L5682q9856l0374k9704k1979P346q8410K6348
10166F31981J76544k7858l8450P678O8083O6453Q1659J09658J2863J96311Q0370
10155A365292J08482J38513j46006k82457j96177J21632K00169k6713J25370L82736
10145A790841Q6175p1060j42222j4714j65756l34634j47633K9720L738P9420R9484
10134A213359M2650J88853j50123k21634o2247j63921p1760j8103J50611Q803
10124I16488m7383N3336k22015p6197n4173N8154K00718j02038r4483j07574q7735
$$ plain form
10199 332804 349217 216211 187390 190032 186302 262515 321205 366570 299394 340844 381407 294074
10187 294074 170269 15907 -166878 -197343 43283 206693 365486 417149 369246 419584
10177 419584 661190 847580 822928 858610 768754 738380 708676 686697 694043 605633 631981
10166 631981 808525 780667 742217 749895 817978 884431 966090 1075748 1088611 1284922 1365292
10155 1365292 1473774 1612287 1466281 1183824 987647 1109279 1309448 1282735 1408105 1790841
10145 1790841 1877016 1805956 1663734 1649020 1483264 1148630 1000997 1030717 1034455 1113875 1213359
10134 1213359 1256009 1444862 1294739 1073105 1010858 846937 775177 757074 907685 916488
10124 916488 869105 922441 700426 624229 570056 628210 828928 726890 632407 524833 437098
10113D37098r3740o9616o4122j44752N9396J25321j2972K5918p9604J5737j179
10102A97485l5254K4243j15292j68538l6011J9798Q9994O4564P5026L8200k76823
10091a22608r1087K34815K12389J728j24714j9972J70422K86334N0907j01423
10081D96791O7355J17476p5460R5543N2765k45406k69859q6404n6508j02637m2496
10070d8840P1192M0295n9434J25336N5758N1856m6096J6461j58687j77606l3003
10059a62768K5071o276L2242M5889k481N9790n807m7780K58918J79032j94537
10048A81293L5807m7905q7507l0068N7170J5970Q4962j44276j79967J26887L6453
10037D8819k0031O2275m9409q9130Q9056J30114j0337j12054k64319o4671J37650
$$ plain form
10113 437098 343358 273742 209620 64868 124264 249585 236613 262531 182927 198664 197485
10102 197485 162231 186474 71182 -97356 -133367 -113569 -23575 40989 116015 154215 -122608
10091 -122608 -213695 21120 233509 235237 110523 90551 260973 547307 598214 496791
10081 496791 564146 681622 606162 701705 754470 509064 239205 152801 96293 -6344 -48840
10070 -48840 22352 62647 3213 128549 184307 236163 190067 206528 47841 -129765 -162768
10059 -162768 -137697 -143973 -111731 -65842 -68323 -8533 -14340 -62120 196798 375830 181293
10048 181293 217100 169195 81688 51620 108790 124760 209722 65446 -114521 12366 48819
10037 48819 28788 91063 41654 -47476 41580 171694 161357 49303 -215016 -279687 -142037
10026a42037J75835J26820j06342Q155N5595K1867j46057p9819M7655n3713L5299
10015e6742L2649m4170j00449p8894J19432J43336L9967o8475l1719j41404J68363
10004a8106J53365o9812l020o7222l5432M6387K4298J19359O5791M3102j11870
9993A46840M1937O3702k9808N1795N7249o1805p084j68970M7512N019q8217O1653
9981A19823m6983p6806j0036J46196M8759j84539q7703N4139N0144J35108m5674
9970A02428k13883J4819K3672p8878J12053J07306l5209J5118R9458K08956r9154
9959B56686k03311J6896R4016r2208M8037J32181m5966j51126n5428k299p036
9948i558m5208N0611m4254L1721m416m6218J16744n593r986Q6949N346j44039
$$ plain form
10026 -142037 33798 160618 54276 62431 118026 139893 -6164 -85983 -38328 -92041 -56742
10015 -56742 -24093 -68263 -168712 -247606 -128174 15162 55129 -13346 -45065 -186469 -18106
10004 -18106 135259 65447 62427 -4795 -40227 6160 30458 149817 215608 258710 146840
9993 146840 188777 252479 222671 274466 331715 269910 262826 93856 141368 146387 58170 119823
9981 119823 72840 -3966 -14002 132194 180953 -3586 -91289 -37150 12994 148102 102428
9970 102428 -111455 -96636 -72964 -151842 -39789 67517 32308 47426 146884 355840 256686
9959 256686 53375 70271 164287 72079 120116 252297 206331 55205 -223 -2522 -9558
9948 -9558 -54766 -4155 -48409 -16688 -21104 -67322 49422 43829 33843 120792 126138 -17901
9936a7901M8943O3209J38775O83j45991k2394r0945K7673K11934J39915q8568
9925B65333j08786K42282L91918M72970R81496J473523N52606r40884j169759
9916B160699r41703m26802k90085j50830j30881J2701o0925m3341k2246k24052
9906a17465k8816K46565J57369j14870l7085j357m6861M9396M818j72126L799
9895e6633N1531J26263m5366n5577j44630N3294l1759J39915J24396j7912p156
9884A36366k04745j2277J21905J06170J07476L9472o8745j57766p8610o3107m5239
9873a19100O1934J2724N2530J60347J19983j1514L6302j71379j42201O0035J72
9862E9833p2643O8871K4975k5619P1683N0308J34934N9997m7392o9235l2745K8410
$$ plain form
9936 -17901 31042 94251 233026 233709 87718 65324 -25621 2052 213986 353901 265333
9925 265333 156547 398829 790747 1263717 2245213 3718736 4271342 3330458 2160699
9916 2160699 1218996 792194 502109 351279 220398 233099 172174 128833 106587 -117465
9906 -117465 -146281 100284 257653 142783 105698 104341 57480 106876 111694 -60432 -56633
9895 -56633 -5102 121161 75795 20218 -124412 -71118 -102877 37038 161434 143522 136366
9884 136366 -68379 -80656 41249 147419 254895 294367 225622 67856 -10754 -73861 -119100
9873 -119100 -57166 -44442 8088 168435 288418 276904 313206 141827 -374 59661 59833
9862 59833 -12810 56061 81036 55417 127100 177408 312342 372339 324947 255712 222967 251377
9850B51377q6660j65286j02858M1766J21605j1361m9508j22354O2374J32087M0731
9839A11913J04407j94790k41903P7974K12962Q4193l7039m5230n1347O692N9621
9828H7453j2028k822m0528J6176O768J14423K27656O1513p9818q5526j55946j61278
9816b3957j23190r8679J24957J19818j09442J08102J29267K5306L9659J77231
9806C69072n4188L2665l1595N6243K877p4796m7973o5143N6004P6945m8043O6692
9794C38760J6897K03128J94232K02280L08555J73093q2256j5729j0037J31558
9784A460481K3889j5819K15173J71155K06830M84276Q51797R81662J513363K399033
9774H291840L950370O741435J3207626K4916667L5768395L0320944L848217k3070026
$$ plain form
9850 251377 164717 -569 -103427 -61661 59944 48583 -925 -123279 -60905 71182 111913
9839 111913 216320 21530 -220373 -142399 70563 154756 117717 72487 21140 27832 87453
9828 87453 75425 72603 32075 48251 55019 169442 397098 458611 378793 293267 137321 -23957
9816 -23957 -147147 -245826 -120869 -1051 -110493 -2391 126876 152182 191841 369072
9806 369072 314884 347549 315954 372197 375074 300278 252305 187162 243166 320111 272068 338760
9794 338760 355657 558785 753017 955297 1263852 1436945 1354689 1338960 1328923 1460481
9784 1460481 1484370 1468551 1683724 1854879 2061709 2545985 3397782 4379444 5892807 8291840
9774 8291840 12242210 18983645 32191271 57107938 92876333 123197277 127045494 103975468
9766A03975468l1399641k5398376j6721170j0103291o000589l717631k604825
9759H029945j707715j316684q59098p27917o15448k68677k02083r8472k27667
9750B006184r0185k098J26613k3659n5402o8849j81351m38364k33136j00759r5300
9739H43694j45929p4390j47552o8157Q5780j05761l8282M8154p6253o5019N6999
9728C13284P3090J71721K53575p9566j4520k01605j23827O2507J51022p24j64969
9717D39988j08241q5506O9454l5810Q0838K1385j6045l3776m8055L5296l2354
9706B87174n7451K02160N7540j97376k15776K4443K64576m4271N8171q085R95
9695C72100J29867j20340k35867J59059q5654j79714o6783K25249J50299j06084
$$ plain form
9766 103975468 72575827 47177451 30456281 20352990 14352401 10634770 8029945
9759 8029945 6322230 5005546 4146448 3418531 2803083 2534406 2332323 2233851 2006184
9750 2006184 1915999 1913901 2040514 2016855 1961453 1892604 1711253 1272889 1039753 938994 843694
9739 843694 697765 623375 475823 407666 493446 387685 349403 397557 321304 256285 313284
9728 313284 386374 558095 811670 732104 717584 515979 392152 454659 605681 604957 439988
9717 439988 331747 246241 315695 279885 360723 382108 366063 332287 284232 319528 287174
9706 287174 229723 431883 489423 292047 76271 100714 365290 321019 379190 371105 372100
9695 372100 501967 381627 145760 304819 219165 39451 -27332 197917 348216 242132
9685B42132m2793j02608M1361J27639m7430j62338L2667o3096J8952J26794j33356
9674C7924K1518M3697j41089Q2J84360j84227k0866J16350R774j17841K07914
9663A57596J91534L9252J13831N4913o7574j33124p2176n7145K2989J72295r3649
9652C28742Q8873n0903l5221K82693M49814O88257O92638J53864n29147p32814
9642A336796n45548k26363j25966j69428k45363j51500J03569K24870J80093j14979
9632B66181j09512K9797J42824j87587l76437l0635J35424j22455j68634K809
9622d18225K5265J61855J96208P5959l0891l4772M6247K01854J82460j25061J1904
9611B92803M8604P7016m4319j74714q3872L9599n5209j8088Q9594q9805l5238
$$ plain form
9685 242132 199339 96731 138092 265731 218301 55963 88630 25534 44486 171280 37924
9674 37924 59442 103139 -37950 -37868 146492 -37735 -58601 57749 67523 -50318 157596
9663 157596 349130 388382 502213 557126 489552 356428 284252 227107 250096 422391 328742
9652 328742 417615 366712 331491 614184 1063998 1752255 2444893 2598757 2069610 1336796
9642 1336796 791248 564885 438919 269491 24128 -127372 -23803 201067 381160 266181
9632 266181 156669 186466 329290 141703 -234734 -265369 -129945 -252400 -421034 -418225
9622 -418225 -392960 -231105 -34897 41062 10171 -24601 21646 223500 405960 280899 292803
9611 292803 341407 418423 374104 199390 115518 155117 99908 81820 171414 81609 46371
9600D6371p3288j18777l5324j00428J17476J08393J15715O8247K7171o5886k6522
9589F3148K8312m798j41258L394m6315o8581J3162J65798J88103O7666k3235j564
9577B43832K1274p2173M8060j11718j43793m5118N1830j3460L8449P1909j1394
9566G7698p4953m4496n2710j23539J92687J83185J10974j90279o9312K5341J65430
9555B00026O2858M5365L1710r1344k57654k26373P84K8200J5435O4886J30524
9544D417j23855j92168M706J15253J35252J34179J46781J0357j2412q4479m3414
9533I4617j1481J25126K5074O7508k4521k33284q3689L0433l5994j62579n7067
9522b65857M0738o7828J5398Q4253K7585L5363M5768j9495N2613K9586p8017j24746
$$ plain form
9600 46371 -26917 -145694 -181018 -281446 -163970 -55577 60138 128385 155556 89670 63148
9589 63148 91460 86662 -54596 -51202 -97517 -166098 -152936 12862 200965 268631 245396 243832
9577 243832 265106 192933 240993 129275 -14518 -59636 -7806 -21266 17183 89092 77698
9566 77698 2745 -41751 -94461 -218000 -25313 157872 268846 78567 9255 34596 200026
9555 200026 262884 308249 339959 248615 -9039 -235412 -234628 -206428 -190993 -126107 4417
9544 4417 -119438 -311606 -306900 -191647 -56395 77784 224565 234922 222510 138031 94617
9533 94617 83136 208262 233336 300844 276323 43039 -40650 -10217 -46211 -208790 -265857
9522 -265857 -225119 -292947 -277549 -193296 -165711 -130348 -84580 -104075 -51462 -21876 -99893 -224639
9510b24639Q4766J36242R6743k6370n2582j06477n5751j0526N5445J52163P5772
9499A24786J06168p257p0537j24910Q0305Q3305l2403j43447j09091J00912J76254
9488A84085M1213j60016j19266k8027n8199J31602J17158K4170p3655o8237j69548
9477a78720O7769Q1367P7534K1808q797j48578R0649k0953j6770l0922j50786
9466b16399J6071K19534m9850k09642M5866J68697M7779m7532N7981N3125P8633
9455A64263l3411k34115K2480L1369J36385P2039m4088j72530N284j08136j25684
9444b86144J41267J40386P350Q3735r5803k37491j81478P3457J04297J26825L0188
9433i3411p7613J37700Q0550O1205p2553j82165j27425Q4146J28409J11931l7376
$$ plain form
9510 -224639 -139873 -3631 93112 66742 14160 -92317 -148068 -158594 -103149 49014 124786
9499 124786 230954 223697 153160 28250 108555 191860 159457 16010 -93081 7831 184085
9488 184085 225298 65282 -53984 -82011 -140210 -8608 108550 132720 59065 -9172 -178720
9477 -178720 -110951 -29584 47950 69758 60961 -87617 3032 -17921 -34691 -65613 -216399
9466 -216399 -200328 19206 -30644 -240286 -194420 -25723 22056 -25476 32505 85630 164263
9455 164263 130852 -103263 -80783 -49414 86971 159010 114922 -57608 -52324 -160460 -286144
9444 -286144 -144877 -4491 2859 86594 -9209 -246700 -428178 -354721 -250424 -123599 -93411
9433 -93411 -171024 -33324 47226 108431 35878 -146287 -273712 -189566 -61157 50774 13398
9422A3398k4386K5293J01934K45974J7263j72806j28034r7045k849j12504N3885
9411g9877N3095J02322m7657k05295k9947L26843J17521P6753j7761l9850j19392
9400A36755k01009j31567j58458J0257p5741J73215R3763P2195j57124N8377P1891
9389a07446j9541R6826N4068J55589j08158j93373J18568J04238k0975p8302J4790
9378A6284l9756L0638J5500K6753P0428n1252j5614m8814l6987j67449J60J48594
9366e1515J32083j635l538m3016J79426J16795q5571K71305K27374J3060m6324
9355G08444j30037j61823j14649o971O0513j76916j07907k8789O0256M0742N2982
9344A95845j25561l04174N6571P4443K08200O5617j07412q275m4146o2966j9260
$$ plain form
9422 13398 -10988 14305 116239 362213 379476 206670 78636 -18409 -21258 -133762 -79877
9411 -79877 -26782 75540 27883 -177412 -207359 119484 237005 313758 295997 256147 136755
9400 136755 -64254 -195821 -354279 -344022 -419763 -246548 -152785 -80590 -237714 -179337 -107446
9389 -107446 -126987 -30161 23907 179496 71338 -122035 -3467 100771 79796 1494 16284
9378 16284 -23472 7166 22666 49419 119847 68595 52981 4167 -32820 -200269 -200109 -51515
9366 -51515 80568 78933 75395 32379 211805 328600 243029 514334 741708 754768 708444
9355 708444 578407 416584 301935 294964 355477 178561 70654 41865 102121 142863 195845
9344 195845 70284 -233890 -177319 -102876 105324 170941 63529 55254 11108 -51858 -71118
9333g1118p4712J7442j107j57990j48726J46953K36525R0553j01473j60297K42493
9322A8543L29064m9377j68319j38215l3485J5307J1947J15945r462j13800Q2386
9311F0534l3270l2753r6028q4993m5515J06228K18572j11639k35981j38915J75765
9300b17995J20270P0787L4416j4314J14845k1365j90337l1235J56337J8067k6623
9289A2853L3506j02067n1781P2032J98969O5623j72267r7773J2979n7722J06524
9278B0876O4410J88091p5212j58179j71194m8346J14508K17549J07361R2029o9302
9267B82591n4519J62484J57489l29492j58349L933q5118j38224j70J02063q2132
9256a39444l1569Q5800Q547J1046L2023j36402o0512J02118J25129J68767P9692
$$ plain form
9333 -71118 -145830 -128388 -129495 -287485 -436211 -289258 -52733 37820 -63653 -223950 18543
9322 18543 347607 298230 129911 -8304 -41789 -26482 -14535 101410 91948 -21852 60534
9311 60534 27264 -5489 -101517 -186510 -232025 -125797 92775 -18864 -254845 -393760 -217995
9300 -217995 -97725 -26938 7478 -6836 108009 86644 -103693 -134928 21409 39476 12853
9289 12853 46359 -55708 -107489 -35457 163512 229135 56868 -40905 -27926 -85648 20876
9278 20876 85286 273377 198165 39986 -131208 -179554 -65046 152503 259864 351893 282591
9267 282591 228072 390556 548045 218553 60204 64137 -20981 -159205 -159375 -57312 -139444
9256 -139444 -171013 -85213 -76666 -65620 -33597 -169999 -230511 -128393 -3264 165503 245195
9245B45195O4380M7536q9544k68995k2581R7637P4038j07544p0009P998K7330
9234E441J83850o043j34748m1522R1894Q9979j43098j04310O6102o1192M762J00600
9222E1715J03673R081q6696O0502J01342K4965j443j7980l8722p8316J9494L147
9210A50762J58004K5622k08573M9332p9514n1686L9551n073L1717p7844k21120
9199a88822J96897j5748j82081N1935K38315j9631j91712J8970J36766O7685O8219
9188A80793r7470l12376j05700J55556J39480K7464J1445j2844M8835q2944j31746
9177a79507J13801J88683P451j38034j0403M5323P1359n1861L0093r567j08912
9166d1574j145r9465Q6883R3180m2053N0967J15414Q307j79415j51500J4494J75172
$$ plain form
9245 245195 309575 357111 267567 -1428 -24009 73628 147666 40122 -29887 -21889 5441
9234 5441 189291 183248 48500 6978 98872 188851 45753 -58557 7545 -53647 -48885 51715
9222 51715 155388 164469 77773 138275 239617 264582 263139 245159 206437 128121 147615 150762
9210 150762 308766 334388 125815 175147 95633 43947 83498 78425 110142 32298 -188822
9199 -188822 8075 -7673 -189754 -137819 100496 80865 -110847 -91877 44889 112574 180793
9188 180793 83323 -229053 -334753 -179197 -39717 -12253 -808 -13652 35183 -47761 -179507
9177 -179507 -65706 122977 130428 -7606 -18009 27314 98673 46812 76905 67338 -41574
9166 -41574 -42719 -142184 -55301 37879 -4174 46793 162207 170514 -8901 -160401 -145907 29265
9154B9265L9597q502M4617n9635j75036m6050l6400R5558n1443j43697N0151J67766
9142i3809R1669O1528n4366k2118j01992K4144L1386j02429O7958K06308j81744
9131g3465o9965j36628J99884N6331j39534J40125L0157q3382k0658N8549M7037
9120H451l2892r3201o3212j39322J2582J33706J20387o6227N6137Q1138K0767
9109C8314r5943J2305l5032n7584n2615K7589K8637m0113n6194o501p5956k9657
9097c42750O3987P6411Q0676J12082J34505P3092J0489j9462p4700J17289j04284
9086A27335n3133L5904l6677N5108p3371j07505P1609J78093J65167p1077n5475
9075B35978l4530j73743K30076J46026p4084N4259j05856q7205L353J58323r756
$$ plain form
9154 29265 68862 60360 104977 45342 -129694 -175744 -212144 -116586 -168029 -311726 -261575 -93809
9142 -93809 -2140 59388 5022 -17096 -119088 -94944 -63558 -165987 -98029 108279 -73465
9131 -73465 -143430 -280058 -80174 -23843 -163377 -23252 6905 -76477 -97135 -38586 8451
9120 8451 -24441 -117642 -180854 -320176 -307594 -173888 -53501 -119728 -63591 17547 38314
9109 38314 -57629 -45324 -80356 -137940 -190555 -162966 -134329 -174442 -230636 -237137 -313093 -342750
9097 -342750 -278763 -202352 -121676 -9594 124911 198003 208492 189030 114330 231619 127335
9086 127335 74202 110106 73429 128537 55166 -52339 19270 197363 362530 291453 235978
9075 235978 201448 27705 257781 403807 329723 383982 278126 190921 194274 352597 342841
9064C42841P5640J6320j55520q748j021n6572j71174q855O1261k3050k46587Q0389
9052i5076K59394J18219j52031k05208k07170O8467N5597J35660J87339J77571
9042C42762j2442K8201j78330j96020J8066K5519N6942k6999k4871K7352J24327
9031A84507J6347k2000M4483J11520m986q3741j2698L1850J01094J10804M3484
9020E20664j13189k09546K5896j38805l9110K4887l0091L8128K929J70298O8236
9009C20297R3045j29439j82810m4072J02439L1418Q353J8621j2246j67794j34692
8998i6880o3391J87401J53858m9809J8549K7974r3039m4302J43806M627M1061
8987B29855N9535L1296K9330j6179P1835J5192j49202m2942J27397J22552n004
$$ plain form
9064 342841 418481 434801 279281 270533 269512 212940 41766 32911 94172 71122 -175465 -95076
9052 -95076 164318 282537 130506 -74702 -281872 -213405 -157808 -22148 165191 342762
9042 342762 330320 358521 180191 -15829 2237 27756 84698 57699 32828 60180 184507
9031 184507 200854 178854 223337 334857 329871 246130 233432 265282 366376 477180 520664
9020 520664 407475 197929 223825 85020 45910 70797 40706 78834 81763 252061 320297
9009 320297 413342 283903 101093 57021 159460 190878 199231 217852 205606 37812 -96880
8998 -96880 -160271 27130 180988 131179 149728 177702 84663 40361 184167 188794 229855
8987 229855 289390 320686 350016 333837 405672 420864 271662 228720 356117 478669 473665
8976D73665P4661N1954q7368j63514j35090n1826K8889j21737n5075q9278j0403
8965h5122L2587L704K37747L7943q1262m4532R303M1604j01960o6213j5710P3735
8953D1824N263l1429O5598K0943n4100n3369j25444p6345Q2897L5571J07522J63738
8941A82669n1492m3833j55573K3091o432m265Q988L1488M4296J84876K01091k4311
8929C90593j98495L8862O2065J48858n7621j30249j64081k9842L8293n1458n9547
8918a2622R8140j18674q7269L0576Q812N6527R1984L1286P2841n9003j32365P0200
8906E0433J79673K7575j56027l4539m0641J086M9491K1183J06751M0621k5844
8895B19762k0055N011j27356j41464j00251K015K30219K3377q6221k00648q9652
$$ plain form
8976 473665 548326 600280 512912 349398 214308 162482 191371 69634 14559 -74719 -85122
8965 -85122 -52535 -48831 188916 226859 145597 101065 110368 151972 50012 -16201 -31911 41824
8953 41824 47087 15658 81256 102199 48099 -5270 -130714 -207059 -124162 -88591 18931 182669
8941 182669 131177 87344 -68229 -45138 -51570 -55835 -46847 -15359 28937 213813 414904 390593
8929 390593 192098 230960 293025 441883 384262 254013 89932 60090 98383 46925 -12622
8918 -12622 85518 -33156 -120425 -89849 -81037 -24510 67474 98760 171601 112598 -19767 50433
8906 50433 230106 257681 101654 67115 26474 27560 77051 98234 204985 245606 219762
8895 219762 199707 204718 77362 -64102 -164353 -162338 67881 91258 5037 -195611 -285263
8884b85263Q5132M4573J5443p7245N4532J02718R6963j52757j67952K18968K84974
8873B20086Q9380O897j09340N2311O453j2135j5238j31478p2007M3536r71O7204
8861A44698l6371J58821J28486k17879j19589n5312J43029N4514K3409j89658
8851C4148r1044J3918J52903j19216R6186m5049J07335O030K6944o6074l6565
8840G9516J23281L465O6845J00988o1002m5100J5233J08473r437K0177J38947
8829E41386L45487N05328N12258L44407j89656k42509m47900m55053m99800l03782
8819A10166l4042L5763q9841l1296k9818m36q0077l932n4155R4125J19612J29133
8807A65202L9182n7169q6596n9943J38662O8188l1388N540l3578O6841p1426j69281
$$ plain form
8884 -285263 -200131 -155558 -140115 -217360 -162828 -60110 36853 -115904 -283856 -64888 220086
8873 220086 309466 316363 207023 259334 265787 253652 238414 106936 34929 78465 77494 144698
8861 144698 108327 267148 395634 177755 58166 2854 145883 200397 223806 34148
8851 34148 -56896 -42978 109925 -9291 86895 41846 149181 155211 182155 116081 79516
8840 79516 202797 206262 273107 374095 313093 267993 283226 391699 382262 402439 541386
8829 541386 886873 1392201 1904459 2248866 2059210 1816701 1368801 913748 413948 110166
8819 110166 76124 111887 22046 -9250 -39068 -39504 -119581 -123513 -177668 -83543 36069 165202
8807 165202 204384 147215 60619 676 139338 207526 176138 181678 148100 214941 143515 -25766
8795b5766j30603j3366J03748P0103j77182R3036J30078m4531M9454j71727q6089
8784b02845N4819K0870J50412P3198m1086j10107J65881J07693k06448j37270
8774a24883Q6655J47148J4998q4261j83753p7734J05381J82055n2645l6111o9684
8763i2834j6922J62124M6478j23704J14487L095j11870r3612m6387p387l833r679
8751a80044R3716p5541k9446p6789R8522J17895K27679q4802L5099J3893m7697
8740I2485r9705j77502M7655J5233p0529j2616j3224j07142J17950J49651J30207
8729G2463J56105O1628J3442j53733R790Q6194q5070p8949j28442M7083J10446
8718A10957J36026l5807p6813J8539N5227N4072j87637j73079J33536J30599J23126
$$ plain form
8795 -25766 -156369 -169735 -65987 4116 -173066 -80030 50048 5517 54971 -116756 -202845
8784 -202845 -148026 -127156 23256 96454 55368 -54739 111142 218835 12387 -124883
8774 -124883 -38228 108920 123918 39657 -144096 -221830 -116449 65606 12961 -23150 -92834
8763 -92834 -109756 52368 98846 -24858 89629 92724 -19146 -112758 -159145 -166532 -170365 -180044
8751 -180044 -86328 -161869 -191315 -268104 -169582 -51687 175992 91190 126289 140182 92485
8740 92485 -7220 -184722 -137067 -121834 -192363 -204979 -218203 -325345 -207395 -57744 72463
8729 72463 228568 290196 303638 149905 159695 245889 160819 81870 -46572 511 110957
8718 110957 246983 211176 134363 152902 208129 262201 74564 -98515 35021 165620 288746
8707B88746L3111n304K6921P5098R5868o1574j19822j14308n3990O0126k5716
8696A99156j14767m1936Q1782J73777J32846m3275j18505M0688r5380q3241J6298
8685A47443j01295K2618j7734J5302J74599o1K471O3750J000m3369j43190J65502
8673B87036l4236k88756o9501K5558J10192J68492K03340M0873o5816j21061m140
8662B51981J00724J11561j20389n9604J33835m4757n9311P6251L1168J58647K0441
8651F00547J07950p7866Q0194o1760j9730j14199J5059k1707j40542O7584Q3959
8640E19489O4058Q3399M9601r5629j3368J08866J01050j45043j44961O3779j74569
8629D16672K1731J30223L6103K6636K1003l3058k4578J48308K56739J58872m524
$$ plain form
8707 288746 321857 316553 343474 418572 514440 452866 333044 218736 164746 224872 199156
8696 199156 84389 42453 124235 298012 430858 387583 269078 309766 214386 131145 147443
8685 147443 46148 68766 51032 66334 240933 240872 243343 307093 308093 264724 121534 287036
8673 287036 252800 -35956 -105457 -79899 30293 198785 402125 442998 377182 256121 251981
8662 251981 352705 464266 343877 284273 418108 373351 314040 390291 421459 580106 600547
8651 600547 708497 630631 710825 649065 629335 515136 530195 508488 367946 435530 519489
8640 519489 583547 666946 716547 620918 607550 716416 817466 672423 527462 591241 416672
8629 416672 438403 568626 604729 631365 652368 619310 594732 743040 999779 1158651 1154127
8618A154127p4838M6381J55562j29801Q1761J25914N9984L8260K2969M1580J39662
8607A661561j377m4825p8387j01559p147J60445P3327J13426J18329J45294K60968
8596B300055J97688J78003J23564J8793K53111L12944J72554K1684J12322J75687
8586C866405J09210K14501J6974j40715k21795j62000l25572l16130J5399k07721
8576B848556j76183m5618J75997n4044j49605P5629j10660j14406r5141j36741
8566B217784k37385j07098j09998q8646K9954k9637j1585j81657j94719r245M3015
8555A320783q2189L2970J39399r2589k19980K6893j45625k98027k49434O8424
8545E00625P6244r8741J62538M0938j5818P1141Q0590M6346L1691j1107p3956
$$ plain form
8618 1154127 1079289 1125670 1281232 1151431 1233192 1359106 1419090 1457350 1480319 1521899 1661561
8607 1661561 1660184 1615359 1536972 1435413 1428266 1588711 1662038 1775464 1893793 2039087 2300055
8596 2300055 2497743 2675746 2799310 2818103 3071214 3384158 3556712 3578396 3690718 3866405
8586 3866405 3975615 4190116 4207090 4066375 3844580 3682580 3357008 3040878 3056277 2848556
8576 2848556 2672373 2626755 2802752 2748708 2599103 2674732 2564072 2449666 2354525 2217784
8566 2217784 1980399 1873301 1763303 1674657 1704611 1674974 1663389 1481732 1287013 1277768 1320783
8555 1320783 1238594 1271564 1410963 1318374 1098394 1125287 979662 681635 432201 500625
8545 500625 576869 478128 640666 681604 665786 736927 817517 863863 895554 884447 810491
8534H10491O7263N3479J19905J46009R3282J93421L02319M32194P15681J212977
8524D147021K183174M098839P720997J0415959O057869l633919q567645p463743
8516A4958552n098066l100175j910402j215990r60605o13066k80724N953k03810
8507A581667m10555j72430p4392m1445j59308j89447j04057K2887m5256Q2957
8497D90621l4007J63322P2336L8226O0357Q6299P8375J56374K07372K40917J30085
8486A690277Q9809K27381L24635O40730P95158J328458K229819M098711P606568
8477A9031546J4785233K1950358J3463010p158929j7686444j5185272j0197039
8470A9002463o126550l900923k379526j452550r90180q29059p17743l79759j44968
$$ plain form
8534 810491 877754 931233 1051138 1197147 1290429 1483850 1786169 2218363 2934044 4147021
8524 4147021 6330195 10429034 18150031 28565990 34623859 30989940 22422295 14958552
8516 14958552 9860486 6760311 4849909 3633919 2673314 2060248 1779524 1785477 1581667
8507 1581667 1171112 998682 924290 882845 723537 534090 430033 452920 407664 490621
8497 490621 456614 619936 692272 730498 790855 877154 955529 1111903 1319275 1560192 1690277
8486 1690277 1780086 2007467 2332102 2972832 3767990 5096448 7326267 11424978 19031546
8477 19031546 33816779 55767137 69230147 62071218 44384774 29199502 19002463
8470 19002463 12875913 8974990 6595464 5142914 4152734 3323675 2605932 2226173 2081205
8461B081205r6031j66257j84755k77338j75265l38052J3424K00617j18082p5922
8451H63544m6888P9144n2365L7374J18319j20912K8085J69308J43335Q7095O5065
8440A371104J04587K63932L50043L88029Q11493J258284J941863L438225O596735
8431A6524295J0021964O934866k278957q209698p534664n156263l298159j905593
8423E097791j278088q58339o31226l77253j88952j95379j35045j77220j00686
8414A155603k68349j11401j8J0248k2124k5988o7560O291J1664r058o0105n7941
8402E61262J6917k468K0079n3578j54998j20771n7527n3908k7556P1917J08623
8391C07992R2441O2743l3641n5880j53062m9004K41011J691j47935j8795r4891
$$ plain form
8461 2081205 1985174 1818917 1634162 1356824 1181559 843507 856931 1057548 939466 863544
8451 863544 816656 895800 843435 880809 999128 878216 906301 1075609 1218944 1306039 1371104
8440 1371104 1475691 1739623 2089666 2477695 3289188 4547472 6489335 9927560 16524295
8431 16524295 26546259 33481125 31202168 22992470 15457806 10301543 7003384 5097791
8423 5097791 3819703 2961364 2330138 1952885 1763933 1568554 1433509 1256289 1155603
8414 1155603 887254 775853 775835 786083 763959 737971 670411 676702 688366 679308 619203 561262
8402 561262 578179 575711 595790 542212 387214 266443 208916 155008 127452 199369 307992
8391 307992 400433 463176 429535 373655 220593 171589 412600 414291 266356 247561 152670
8380A52670j9622J83907J58593q4252j18149N1035p132k08777j26124J46542J06
8369A28797j2617L0782J1401j3332J5925Q9039M0986q4054O8110R6852r5014K4173
8357C01048j2715Q0476p157j86076j89512J68922K1192j40773j42374j355J0214
8346i8110m2195r6917J19426J91218J281o7011l8023K0357N5627K1929J04003
8335A71585P5980l0333p6986j55353J34496l4990L5635j26686j3829J26152Q2474
8324A88145k7627j03850j64326M0575J809k5465j14339J02225O4338o5772o2225
8313a66512J13641J37804J30650o8341p0330k5450o0385J36961Q9444m0776p1677
8302A05029P5899N1728q150J6400J67911r942Q7108j10079j65147k31486j6903
$$ plain form
8380 152670 133048 316955 475548 391296 273147 324182 317050 108273 -17851 128691 128797
8369 128797 116180 146962 158363 145031 160956 249995 290981 206927 275037 371889 276875 301048
8357 301048 288333 368809 361652 175576 -13936 154986 176178 35405 -106969 -108324 -98110
8346 -98110 -140305 -237222 -117796 73422 74703 7692 -30331 -9974 45653 67582 171585
8335 171585 247565 217232 140246 -15107 119389 84399 120034 -6652 -20481 105671 188145
8324 188145 160518 56668 -107658 -67083 -65274 -90739 -205078 -102853 -38515 -104287 -166512
8313 -166512 -52871 84933 215583 147242 76912 51462 -8923 128038 217482 176706 105029
8302 105029 180928 232656 224506 240906 408817 398875 485983 375904 210757 -20729 -37632
8291c7632K43517M2992O1681p7952N3763j09432j6124L4151l6937O0811j61746
8280E7092r6856L8661M181k1844J31510k3650q9864m5369J8034q1817J2386J41172
8268D3636m9076k9944O4034J28250L8043j12179k5783O4970j8971R7931O4250
8257B65161k52861j1991J44703J94929r8069j48456j85109j0282r8662K15020
8247A4383J62142O4778j06378k1848P8642j72647m6797R5578J2339p5390q8167
8236h3365M3182L96q4451L5923J90952k3336M3060l8507Q5606j05027O107J55583
8224B26123p9857N5635J79071j77651J2468L6331K44676Q5163k02629k28399l49
8213A50582J40454M1905q8464j38678m4701r303n9215o6126O8169J02616L6580
$$ plain form
8291 -37632 205885 248877 310558 232606 286369 176937 160813 194964 158027 218838 57092
8280 57092 -39764 -1103 3078 -18766 112744 89094 -770 -46139 -28105 -109922 -97536 43636
8268 43636 -5440 -35384 28650 156900 194943 82764 56981 121951 102980 200911 265161
8257 265161 12300 309 145012 339941 241872 93416 -91693 -101975 -200637 14383
8247 14383 176525 241303 134925 113077 191719 19072 -27725 67853 80192 4802 -83365
8236 -83365 -40183 -39787 -124238 -88315 102637 79301 122361 83854 169460 64433 70540 226123
8224 226123 146266 201901 380972 203321 215789 252120 496796 581959 379330 150931 150582
8213 150582 291036 332941 244477 105799 61098 51795 -7420 -73546 -5377 97239 133819
8202A33819p5717j14155J2946L0147j76570j9115m1275J52612J07033K16307M7254
8191B73286j14963L3487k5206q0730j76794m6428P0088R1329N2704L6738L4999
8180A48510O0438m1467J33600k4478m3637q2302m1409o9867j11669J999J10798
8169D0516M0001p3411j24531j3959J5962m9927Q4344N2698k6545p7081m8608Q964
8157a71577j26151M1210R6604k5241k2229J52247O3722L5228m712M2612K8297
8146A10010m6365j14375j896j31090o8283N411o4692L5450J48464K44081K38935
8135C55650L48355K00205O1792k3754j63507k61354n2141J13779j2822j24579
8125D41624j19419m2888M9645J48191m5249k31052m2943L3402k10255o2780k6811
$$ plain form
8202 133819 58102 -56053 -43107 -12960 -189530 -208645 -249920 -97308 9725 226032 273286
8191 273286 158323 191810 166604 85874 -90920 -137348 -67260 24069 76773 113511 148510
8180 148510 208948 167481 301081 276603 232966 150664 109255 39388 -72281 -70282 40516
8169 40516 80517 7106 -117425 -131384 -115422 -165349 -81005 -28307 -54852 -131933 -180541 -171577
8157 -171577 -297728 -256518 -159914 -185155 -207384 -55137 8585 43813 39101 81713 110010
8146 110010 63645 -50730 -52626 -183716 -251999 -246588 -311280 -275830 -127366 116715 355650
8135 355650 704005 904210 966002 942248 778741 517387 465246 579025 566203 441624
8125 441624 322205 279317 328962 477153 431904 200852 157909 191311 -18944 -81724 -108535
8114a08535j1202Q8067j3459j28501J03806K978R9049L7103j48769j51514m8242
8103b79219J58228K61635K3612R4696n7605k43972o5954J28950P0409J80852K42212
8092E13844K63626P9357j46043k50108k20526k51867j37694p720J37624L6724
8082A7217r6691J14280q4484l5435K12020J34788p87j30038m1860k907J15275
8071B01378J12341r0785k55589k51027O1155j2648K25195N4563N887r828K5635
8060F6277o3306o2968J9536Q9702J35248K7647j28404O1436r2218j36102K10012
8049A26860o8921j02913j408J43480n7392R6504q2869m4841j43879J30962K6780
8038B2363m1674l3646m2692J30870K72201N7416r1719n0248K19894N6446o5264
$$ plain form
8114 -108535 -119737 -31670 -45129 -173630 -69824 -66846 32203 69306 -79463 -230977 -279219
8103 -279219 -120991 140644 164256 258952 201347 -42625 -108579 20371 90780 271632 513844
8092 513844 777470 856827 710784 460676 240150 -11717 -149411 -157131 -19507 17217
8082 17217 -79474 34806 -49678 -85113 126907 261695 260908 130870 89010 86103 201378
8071 201378 313719 222934 -32655 -283682 -222527 -235175 -9980 44583 50470 40642 66277
8060 66277 2971 -59997 -40461 49241 184489 212136 83732 145168 52950 -83152 126860
8049 126860 57939 -44974 -46382 97098 39706 136210 53341 8500 -135379 -4417 22363
8038 22363 -19311 -52957 -95649 35221 307422 364838 273119 222871 442765 499211 433947
8027D33947P3772L75500J98030N7936L1210k2498o4519R9116J65294L7073J25520
8016A510381Q241j70619j10739l6694J37002J23079J1940j74449Q8772J02788
8006A489702j45903j68313K3273r0373o6614O9087l6709m5922Q4307P5832j5274
7995A173093n8833J14524j18795j04208J37200J02429j66124j16540L5242K26070
7985A224058K11340K14071K70718K84057L13379N56849P10755J081460J402982
7976F269669J310823M01424n80843j269962j356328j168783p76352m45424k75217
7967B109007q1020l7658r5294j84527j94601p3416p6140n3398j12674k0933l9069
7956A140277j52598j57629J8494J43764J9420j55440K920L3568K3347K2818K28416
$$ plain form
8027 433947 507719 883219 1081249 1139185 1170395 1147897 1083378 1182494 1347788 1384861 1510381
8016 1510381 1518622 1348003 1237264 1200570 1337572 1460651 1472591 1298142 1386914 1489702
8006 1489702 1343799 1175486 1198759 1108386 1041772 1110859 1074150 1028228 1112535 1188367 1173093
7995 1173093 1114260 1228784 1109989 1005781 1142981 1245410 1079286 962746 997988 1224058
7985 1224058 1435398 1649469 1920187 2204244 2517623 3074472 3785227 4866687 6269669
7976 6269669 7580492 7981916 7401073 6131111 4774783 3606000 2829648 2384224 2109007
7967 2109007 2027987 1990329 1895035 1710508 1515907 1442491 1366351 1312953 1200279 1179346 1140277
7956 1140277 987679 830050 848544 992308 1011728 856288 859208 892776 916123 938941 1167357
7945A167357j05979p5996M8668J70128K50572R6263J95050L91770N88354O48945
7935C375132Q48805P74010L35740j13098n75204o18912o76608r28436l98804k22923
7925A799702k03128j71189p9881o4344k28542j79089n5395N1558P007l6569M6477
7914H86607j93044j37994J0626p2555J04824P1407j26932O2582J2789l29014l4251
7903B55045J21657K1406Q2110K35414P4415J84769j27333r0018l1268j84349j56763
7892C85085J47334P5159J17413J43267q3604r3870K1471Q0539r8720j33706J04100
7881F64468R4618j54238k29716L6330r9218k66686p946l6802l6320j06276J12506
7870b9280J55188J51862N654j15274R5906J30768o0210k0488m4045j54811j52068
$$ plain form
7945 1167357 1061378 985382 1034050 1204178 1454750 1551013 1746063 2137833 2726187 3375132
7935 3375132 4223937 4997947 5333687 5220589 4645385 4026473 3349865 2421429 2022625 1799702
7925 1799702 1596574 1425385 1345504 1281160 1052618 873529 818134 869692 876699 840130 886607
7914 886607 693563 555569 566195 493640 598464 669871 542939 605521 618310 289296 255045
7903 255045 376702 398108 480218 715632 790047 974816 847483 757465 726197 541848 385085
7892 385085 532419 607578 724991 868258 784654 690784 712255 792794 694074 560368 664468
7881 664468 759086 604848 375132 411462 312244 45558 37612 810 -35510 -141786 -29280
7870 -29280 125908 277770 283424 168150 264056 394824 334614 314126 270081 115270 -36798
7859c6798k13578l3215K70431M0798o2455q5298K1565R4235j11965j39568M755
7848b51093Q7140M886o2405q434J45682R0352r4216J27181R6521N5854k51508
7837f0040n4581J439j14033J0934K25551J00828j71787j11444j18856K10298J46898
7826F5207l4327p0260k5426j131J50841J219j57963j29902m0372P6201J46202
7815a9711j03610P1800P3832j1497K2671r2474r457j64858m1977J23996O9030
7804h2255j44708J5144J21349K7528J35524L493O1910m4522k52071o5702J90955
7793c3355j7128k11704n6315K01531P5725J14383o5658j59817P1696J94510l3510
7782H0358p8240m6666O4844j39937J92265J2685k42814j88205J6147J15347J25998
$$ plain form
7859 -36798 -250376 -283591 -13160 27638 -34817 -120115 -98550 -4315 -116280 -255848 -251093
7848 -251093 -163953 -159067 -221472 -229906 -84224 6128 -88088 39093 135614 191468 -60040
7837 -60040 -114621 -113182 -227215 -216281 9270 110098 -61689 -173133 -291989 -81691 65207
7826 65207 30880 -39380 -64806 -65937 84904 86123 -71840 -201742 -242114 -165913 -19711
7815 -19711 -123321 -51521 22311 10814 33485 -58989 -68446 -233304 -275281 -151285 -82255
7804 -82255 -226963 -211819 -90470 -62942 72582 76075 137985 93463 -158608 -224310 -33355
7793 -33355 -50483 -262187 -318502 -116971 -41246 73137 7479 -152338 -80642 113868 80358
7782 80358 2118 -44548 20296 -119641 72624 85309 -157505 -345710 -329563 -214216 -88218
7771h8218L8390j05222p3352J3591J15498O3912R351p4393j01826k584j71411
7760c76264o7498N4620M6364J22322J78455M2283J37028L2285k690m8775k6175
7749I1955j78129M0818M5566M8034q6113O1120o9375K0650J38248L563j73472
7738e7135J16004Q8660l1413l221j82193l25973n6735K78664J52872O8201m5442
7727B289J0573J2332J6513M0317j52956Q2967M7861r8052q9713q8349J82989J97619
7715A64390j51165k01903k4837J55225p8499R221K21567m4150j88711K9894J66673
7704E7705j62279P8042R4218J51886J50590m5010k98603l10123n2948R0860J60988
7693h4674L8320L000Q4852N468j48451j9504O333P7026O0881j68476j74177R668
$$ plain form
7771 -88218 -49828 -155050 -228402 -214811 -99313 -35401 -26050 -100443 -202269 -204853 -376264
7760 -376264 -443762 -389142 -342778 -220456 -42001 282 137310 169595 166905 118130 91955
7749 91955 -86174 -45356 210 48244 -37869 23251 -46124 -25474 112774 116337 -57135
7738 -57135 58869 147529 116116 112895 -69298 -395271 -452006 -173342 -20470 47731 2289
7727 2289 12862 25194 41707 82024 -70932 12035 59896 -38156 -127869 -216218 -33229 164390
7715 164390 13225 -188678 -213515 -58290 -136789 -127568 93999 49849 -138862 -108968 57705
7704 57705 -104574 -26532 67686 219572 370162 325152 26549 -283574 -336522 -245662 -84674
7693 -84674 -46354 -43354 41498 46966 -101485 -120989 -114656 -37630 23251 -145225 -319402 -309734
7681c09734k5699K88270J78430n0669k31308L381J88444n0553N252J00668j32237
7670c5755k26934j53098J2086K38322k7868k856O7182L0017J61661O9544j6383
7659A15918o9953k3533n4320P1597O6222o5697j58686N4142J63684K3866p0805
7648E2435j48150J46196P5871j7469q737r3128k15360l54J41572O2369j04398
7637a09153K5385j26525P2901J11235j32082N9854J19977N4277J9512j71243q5412
7626a61274j00272P1236M6921M5981m4900J29598j3530j38130j2281k0720K05376
7615H005L6775j12890r1728L7945J73378M266j03029k1969M4536J00436o3317
7604A2408l3363m2250L1368j83888j16900M8189r9043J84788M15552J38108j95935
$$ plain form
7681 -309734 -335433 -47163 131267 80598 -150710 -147329 41115 -9438 -4186 96482 -35755
7670 -35755 -262689 -415787 -403701 -165379 -193247 -196103 -128921 -98904 62757 132301 115918
7659 115918 45965 22432 -31888 39709 105931 40234 -118452 -64310 99374 123240 52435
7648 52435 -95715 50481 126352 108883 100146 7018 -208342 -208696 -67124 -4755 -109153
7637 -109153 -83768 -210293 -137392 -26157 -158239 -98385 21592 75869 95381 -75862 -161274
7626 -161274 -261546 -190310 -143389 -97408 -142308 -12710 -26240 -164370 -176651 -197371 8005
7615 8005 44780 -68110 -159838 -121893 51485 55751 -47278 -69247 -24711 75725 12408
7604 12408 -20955 -63205 -31837 -215725 -332625 -284436 -383479 -198691 216861 354969 159034
7593A59034j32574K1555j36017l0611l8450J31825J0860P946o7900J2841m525
7582f6016k625J4044P6533O7601J72190J1589j61346j35860n2377o8261o1278
7571b05806o2131M0900p698J43385J40937j7379O0772r723k10876j24064r2260
7560c43943J60149J65795K7583k3133j8447r0368N364J24342m1218n0169J3186
7549g0859o0796j7535j39942j91933k9417M7456J35333J49965j5735O942Q7811
7538i8710R6737O1631o3450r7610P494R4866J12757r8168j49629N0212m8855Q378
7526a24347P7290M0670n975J5133o1473j70370l3255N1437j9480k9264K2486q0045
7514c17193Q6423l6828K0276M1632o0383o4375J22261N7349R5247J13823q1240
$$ plain form
7593 159034 26460 48015 -88002 -118613 -157063 -25238 -14378 -6432 -74332 -61491 -66016
7582 -66016 -68641 -54597 21936 89537 261727 273316 111970 -23890 -76267 -144528 -205806
7571 -205806 -267937 -227037 -234735 -91350 49587 32208 92980 83257 -127619 -251683 -343943
7560 -343943 -183794 -17999 9584 -13549 -31996 -122364 -117000 7342 -33876 -84045 -70859
7549 -70859 -131655 -149190 -289132 -481065 -510482 -463026 -327693 -177728 -193463 -186521 -98710
7538 -98710 -1973 59658 -3792 -101402 -93908 958 113715 15547 -134082 -83870 -132725 -124347
7526 -124347 -47057 -6387 -12362 2771 -58702 -229072 -262327 -210890 -230370 -259634 -237148 -317193
7514 -317193 -230770 -267598 -247322 -205690 -266073 -330448 -208187 -150838 -55591 58232 -23008
7503b3008J3898j11535j62042K0642J54718M5945r983J34737K9319p2334j70333
7492a49976r5964j1680J47121K12660r4140j807j6866J8570M9538j1568K8588
7481G4476J04954o0711q1895N3280J1143j49539J5334k3214j3587k4485J8391
7470g5853k1546j5707R5520J05945K2926j17723k26888o9178l7327k5089J4978
7459c49942O304P0498J50537L8368l9691J07085j08938j37349j0923R8813R7477
7448g7761J32070O1732p671J08213m6209K0716l0967j12391l2415K6733N137j99513
7436a52326o0458O4903K0600k9041Q6380n7628q000P433k9619N6472K21069J26721
7424B46506p2206j84241o9594O4884j57523j14600N4246J31145o9902j45704J43908
$$ plain form
7503 -23008 -9110 -120645 -282687 -262045 -107327 -61382 -71365 63372 92691 20357 -149976
7492 -149976 -245940 -257620 -110499 102161 8021 6214 -10652 7918 57456 45888 74476
7481 74476 179430 118719 36824 90104 101247 -48292 -32958 -56172 -69759 -94244 -75853
7470 -75853 -97399 -113106 -17586 88359 111285 -6438 -233326 -302504 -339831 -364920 -349942
7459 -349942 -343638 -273140 -122603 -84235 -123926 -16841 -125779 -263128 -274051 -175238 -77761
7448 -77761 54309 116041 108370 216583 170374 191090 160123 47732 15317 42050 47187 -152326
7436 -152326 -212784 -147881 -127281 -156322 -69942 -127570 -135570 -128137 -157756 -101284 119785 246506
7424 246506 174300 -9941 -79535 -14651 -172174 -286774 -232528 -101383 -171285 -316989 -173081
7413a73081J39720l3016j84316N2189O0458Q306O6333j0154k4695j14174O7638
7402a44792Q9194k8147K7693K4206M2271O8912L6948p6470j12523M0293m9077
7391h1492l783p1339j65788j54208M7933K40984L52227J08210j74510q9756j5706
7380g228Q1953J96058l9789n2518l9745k45254n0006O1000k2581N0296j9617p6336
7368a63767L1353l0846M9198O0655j66143P1621J27776m2592J3578Q3857M8218
7357H2908j22285j79722N2531K5655j01477j31188J91698o4945j16689L5708J05066
7346b22740j2099j6418P5408L0926J68876l1163j41846P2453r9535J24317N5969
7335D148l8522J02952P6019j20234j0381j43688j70227J9964J22810P6880m4301
$$ plain form
7413 -173081 -33361 -66377 -250693 -198504 -138046 -129740 -63407 -73561 -98256 -212430 -144792
7402 -144792 -55598 -83745 -56052 -31846 10425 79337 116285 39815 -72708 -32415 -81492
7391 -81492 -85275 -156614 -322402 -476610 -428677 -187693 164534 272744 98234 8478 -7228
7380 -7228 74725 270783 230994 178476 138731 -106523 -156529 -95529 -118110 -67814 -87431 -163767
7368 -163767 -132414 -163260 -114062 -53407 -219550 -147929 -20153 -62745 -49167 34690 82908
7357 82908 -39377 -219099 -166568 -140913 -242390 -373578 -181880 -246825 -363514 -327806 -222740
7346 -222740 -234839 -251257 -175849 -144923 23953 -7210 -149056 -76603 -176138 -51821 4148
7335 4148 -34374 68578 144597 24363 13982 -129706 -299933 -279969 -157159 -80279 -124580
7324a24580L8857J17376P1085r8041j81497o1087J38514J28510m4762j61043j67321
7313c43989O4574o9867p9765J10154M0864P6027K7063q5473L3450N9925j4572
7302a81609M1575N3363J07726J00459m4105n5141j89775M0628j9901Q5978n5286
7291a16088r8774q220n6277J2995O8539J27757j03714o4914J92616J20868n899
7280F8889r1099p5323l736l7072P0032N6397m1854j89050j06297J26093J92069
7269c0951o3310M014K4697p6158J2648L7233l2698K9085j61687J44666J68921
7258E6460j6769q0775j42296n8457n6214J31386R5279j75906n3233J9765j473
7247b82233L8598J71319O2113J4081p6129P0936j43413j17905R7392K7636J4842
$$ plain form
7324 -124580 -85723 31653 102738 4697 -176800 -237887 -99373 29137 -15625 -176668 -343989
7313 -343989 -279415 -349282 -429047 -318893 -278029 -202002 -174939 -260412 -226962 -167037 -181609
7302 -181609 -140034 -86671 21055 121514 77409 22268 -167507 -126879 -146780 -60802 -116088
7291 -116088 -214862 -223082 -279359 -266364 -197825 -70068 -173782 -238696 -46080 74788 68889
7280 68889 -22210 -97533 -101269 -138341 -68309 -11912 -53766 -242816 -349113 -223020 -30951
7269 -30951 -94261 -90247 -65550 -141708 -129060 -91827 -124525 -95440 -257127 -112461 56460
7258 56460 39691 -41084 -183380 -241837 -298051 -166665 -71386 -247292 -300525 -280760 -282233
7247 -282233 -243635 -72316 -10203 3878 -72251 -1315 -144728 -262633 -165241 -137605 -122763
7236a22763l8532J4411L9393q0612J38921R9503L9776q4208j78187L8632O3672
7225f9994r4345N512J48295J61959j56564j20391J10731M1215N2611J0307j126
7214H8210o2510n003P2757m3641l3236m2125L7202j19722j17731N294P9979R3113
7202d7413J26026j16031j07908p8468J08133l6626P066N8986P9939p6239k1006
7191a03541J8141p5613o6780K8105n3378Q3471R0371O8792O2192K8357m2628L6278
7179G3767K150o7220j33115j43580L2779J54970j03068J08023M6970K02486J8258
7168A92420j2558l3335j24230o9748L5151j05629P5361L595L9343P1040p1562
7157a52j02862J39731L3211k9473M8044j8380l0656J5175o0183j21887j79009
$$ plain form
7236 -122763 -161295 -146884 -107491 -188103 -49182 50321 90097 5889 -172298 -133666 -69994
7225 -69994 -164339 -158827 -10532 151427 -5137 -125528 -14797 26418 79029 89336 88210
7214 88210 25700 20697 93454 49813 16577 -25548 11654 -108068 -225799 -220505 -140526 -47413
7202 -47413 78613 -37418 -145326 -223794 -115661 -152287 -145221 -86235 -6296 -82535 -103541
7191 -103541 -85400 -161013 -227793 -199688 -253066 -169595 -79224 -10432 51760 80117 37489 73767
7179 73767 75917 8697 -124418 -267998 -235219 -80249 -183317 -75294 -28324 174162 192420
7168 192420 179862 146527 22297 -47451 -12300 -117929 -42568 -38973 370 71410 -152
7157 -152 -103014 36717 69928 40455 88499 70119 39463 54638 -5545 -127432 -306441
7146c06441j6086j6755Q663m555l2549R3539l4107k396q2421J01911K69467n9336
7134h1066l3866k6890P7801P1615R5842N0072j25805j68041J54898K16082L1264
7123B61906k64635j99579J69155K9616r4328m5210J43802K43663R0756k2428k94810
7112A7908j83381M3618J78411P3641J12990j49355j09455J90042Q0592k19654
7102C5357j37258M2436j24956n0721M6524j01063R3779R1970J05364J89335R7735
7091B88502j99007p6453k0022P0285j45255j93584j2741O3796P7436J6883K7684
7080a02476j73216o3140j22534n9049K531J36386J36476J77246m3850r3184J00723
7069a04087M7236j40261q7055L6706p8288L1437J52928J00282O6957j02106J20993
$$ plain form
7146 -306441 -322527 -339282 -330619 -335174 -367723 -274184 -308291 -310687 -393108 -291197 -21730 -81066
7134 -81066 -114932 -141822 -64021 7594 103436 153508 27703 -140338 14560 230642 261906
7123 261906 -2729 -202308 -33153 -3537 -97865 -143075 727 244390 335146 312718 17908
7112 17908 -165473 -121855 56556 130197 243187 93832 -15623 174419 255011 35357
7102 35357 -101901 -59465 -184421 -235142 -188618 -289681 -195902 -103932 1432 190767 288502
7091 288502 89495 13042 -6980 63305 -81950 -275534 -288275 -224479 -147043 -130160 -102476
7080 -102476 -275692 -338832 -461366 -520415 -517884 -381498 -245022 -67776 -111626 -204810 -104087
7069 -104087 -56851 -197112 -284167 -247461 -325749 -294312 -141384 -41102 25855 -76251 44742
7058D4742M3156P635j03647p9274J41956J709K935j05254O6815J20716n6888l1235
7046E3366R7679j81045k41961q5238J26273M4665J32655j2533j41370j9526R7715
7035a29320K2451Q3120J08676j53940Q3279J16397r8171j3786K2920o1694r3903
7024a13971J28340K1969O0513J38278k08858l50003p7055j6952J69241J81973
7014f6525J41604O773K4762j05760O5710L9535q5518j64638P4794j00608K4137
7003a45734L2465P5556n4039n4677J42950J05575j48723j17533k8380j00639j6107
6992c09286J48512J42449J92784J58031J64079J19612K2686k4076j98054k24391
6982A92346j00304O700j30229j26927J0980m7602j45835M734M5577j01940K1023
$$ plain form
7058 44742 87898 95533 -8114 -87388 54568 56277 59212 -46042 20773 141489 84601 53366
7046 53366 151045 -30000 -271961 -357199 -230926 -186261 -53606 -66139 -207509 -227035 -129320
7035 -129320 -106869 -23749 84927 -69013 14266 130663 32492 18706 41626 -20068 -113971
7024 -113971 14369 36338 96851 235129 26271 -323732 -400787 -417739 -248498 -66525
7014 -66525 75079 81852 106614 854 66564 106099 20581 -144057 -69263 -169871 -145734
7003 -145734 -113269 -37713 -91752 -146429 -3479 102096 -46627 -164160 -192540 -293179 -309286
6992 -309286 -160774 -18325 174459 332490 496569 616181 638867 614791 416737 192346
6982 192346 92042 98742 -31487 -158414 -147434 -195036 -340871 -336137 -290560 -392500 -371477
6971c71477N0913q1386J06683j6036J79579J04675l7024Q9732L4792L498p6782
6960a2833q8557O6961m7040M9274L4864J0483J3566N6595q6987R5732Q0183j86630
6948a4389j29311J02325o3527r6187M7657N2844n8441P4971n9473N7149n2873
6937a39255j58440j3113R4666J97875J54410O3266J16873j00708k54616n7802
6927i6844l878l1312N9771J0816J626j53750n9940J80746M8522n597Q6481j90671
6915a54030k57886J7227L50974Q0761j46570m9239J90823N1781L9419K6124M1185
6904A90569K611j6188j128o204j04521k86410K0982J51166q2465k5759J88252
6893C0905j39058j52438J2138m5909Q6170o3071J6411Q2287J30545n6241K6417
$$ plain form
6971 -371477 -320564 -401950 -295267 -311303 -131724 -27049 -64073 25659 60451 63949 -12833
6960 -12833 -101390 -34429 -81469 -32195 2669 13152 26718 83313 -3674 92058 172241 -14389
6948 -14389 -143700 -41375 -104902 -201089 -153432 -100588 -159029 -84058 -143531 -86382 -139255
6937 -139255 -297695 -310808 -216142 -18267 136143 199409 316282 215574 -39042 -96844
6927 -96844 -100722 -132034 -72263 -61447 -59821 -213571 -273511 -92765 -44243 -49840 36641 -154030
6915 -154030 -411916 -394689 -43715 37046 -109524 -158763 32060 83841 123260 149384 190569
6904 190569 193180 176992 175864 169660 65139 -221271 -200289 -49123 -131588 -157347 30905
6893 30905 -108153 -260591 -248453 -294362 -208192 -271263 -254852 -172565 -42020 -98261 -71844
6882g1844J37860J3353k6522p9191m0314j17188M3815j05911Q0905K12379j7982
6871B9360m0598o5028L0710L9561p4859p3863J38069j5498M836Q4214n676j96308
6859a45080l1875r3351n4814Q4173J50116J49216m2925l3557r8357K3277J64907
6848G1730Q8120J8884j69863k10754j13828q5368J9045R7005K54048k8285k28241
6837b87507K3483q607J11358K19229M2318k35282m7258N0869J6655m0787P4379
6826h1150m784Q4049p3067j57675K5889J65309J0136J7533J41540J84863L2751
6815C45394J21141j34506k51648j00556P4637P2507j5169Q1351j803l3493j32209
6804B5646o7743J96917P520j40279p0030j45819p7594p7955O3959O2394K7551
$$ plain form
6882 -71844 66016 79369 52847 -26344 -66658 -183846 -140031 -245942 -165037 47342 29360
6871 29360 -11238 -76266 -45556 -5995 -80854 -154717 -16648 -32146 -27310 56904 51228 -145080
6859 -145080 -176955 -270306 -325120 -240947 -90831 58385 15460 -18097 -116454 -93177 71730
6848 71730 159850 178734 8871 -201883 -315711 -401079 -382034 -285029 -30981 -59266 -287507
6837 -287507 -264024 -272631 -161273 57956 100274 -135008 -182266 -131397 -114742 -155529 -81150
6826 -81150 -85934 -1885 -74952 -232627 -206738 -41429 -31293 -13760 127780 312643 345394
6815 345394 466535 332029 80381 -20175 54462 126969 111800 193151 191348 157855 25646
6804 25646 -42097 154820 162340 22061 -47969 -193788 -271382 -349337 -285378 -222984 -195433
6793a95433o6252j9760K6091K28995J61867N1534N7719J02007o1686k14301m1838
6782B8943p5840p8653n7790k1254r0460L3014J97113J05114p0164m6352j20164
6771a96493J1971j8389j9537J31232Q2030p39p9005l2118j56413j465K99334N8753
6759G9161l3186j27240o8802K0916q1974k754Q6539J3013N3047k9501l6373R9733
6747b7421J23205J12173L31310k40223k17328J5743o9702j990j03019L1210J47286
6736A01244K2801n6309p1668M321p0670J0642r283J14341q3741q4891J08753J0313
6724d147j21419J66312j9014J68583P9734l16304l2197j60770l0647l9172J28674
6713a80367o6135l7809J92808k5955l9289j0381n9226K47935j13109q4295J69068
$$ plain form
6793 -195433 -261685 -281445 -255354 -26359 135508 187042 244761 346768 285082 70781 28943
6782 28943 -46897 -125550 -183340 -204594 -295054 -262040 -64927 40187 -29977 -76329 -196493
6771 -196493 -184522 -202911 -222448 -91216 -9186 -9925 -88930 -121048 -277461 -278926 20408 79161
6759 79161 45975 -81265 -150067 -129151 -211125 -213879 -127340 -114327 -61280 -90781 -127154 -27421
6747 -27421 95784 207957 539267 299044 81716 97459 27757 25767 -77252 -46042 101244
6736 101244 124045 67736 -3932 389 -70281 -59639 -68922 45419 -38322 -123213 -14460 -4147
6724 -4147 -125566 40746 21732 190315 270049 -46255 -78452 -239222 -269869 -309041 -180367
6713 -180367 -246502 -284311 -91503 -117458 -156747 -167128 -226354 21581 -91528 -175823 -6755
6702f755J51087o7635o8334r4490P2854p398L4557K7182j46937j44793j2290N7711
6690b05241L8277Q0807J02294m3724P723K95420k4882k11882o6325o4984j25807
6679b18324N2707M5621k7309m9870J01216J46790j12056q5012J60705n9802J11452
6668F6118J24621o7402k8119r4043j43730K891M2937K07104q5092k5008K1379
6657B1656Q972O7163R3737P7840j27469M1578Q4973k3492p2231N8630J4675p9231
6645A66801J13648J92552N5165Q3468L02241L41544N63374J152606J518600R56186
6635E446185m01278j147132p89755n32374j41205K65021J16210K38877M33413
6626C487962N68104J000000J637441K287210K938038L820620N740682J0837332
$$ plain form
6702 -6755 144332 76697 8363 -86127 -13273 -20671 13886 41068 -105869 -250662 -262952 -205241
6690 -205241 -166964 -86157 16137 -27587 -19864 275556 250674 38792 -27533 -92517 -218324
6679 -218324 -165617 -119996 -147305 -197175 -95959 50831 -61225 -146237 14468 -45334 66118
6668 66118 190739 123337 95218 1175 -142555 -139664 -96727 110377 25285 277 21656
6657 21656 30628 97791 191528 269368 141899 183477 268450 244958 172727 231357 246032 166801
6645 166801 280449 473001 528166 611634 913875 1255419 1818793 2971399 4489999 5446185
6635 5446185 5044907 3897775 3108020 2575646 2434441 2699462 2815672 3054549 3487962
6626 3487962 4056066 5056066 6693507 8980717 11918755 15739375 21480057 32317389
6618C2317389K2567253M7561695O8611386L0089076l6267569n4594777m0122279
6611G0162174k4821625j4015091q047904n184113l957963l132229k320252j743644
6603F939353j294240r07286o84408o05157l25756l1165M62932R86957J558604
6594F099834P93462r69897j551319j374479r11944l67291m14390k01062L3174
6585A136088k7908l2985j02923k45281l4377N1121Q9211j12183k12341j0843n8301
6574D39278j82742o5504J4230J20008Q9273p3413o1033m5064N4572M0958J06115
6563D36678p7987m3566L2633l3023j65758j66810l9135Q8577K25245o9914j41012
6552D5928J49289Q5048j6747O6310j78106j5000l0541M1797j46062O8009J87383
$$ plain form
6618 32317389 54884642 102446337 171057723 201146799 164879230 110284453 70162174
6611 70162174 45340549 31325458 23277554 18093441 14135478 11003249 8682997 6939353
6603 6939353 5645113 4737827 4053419 3448262 3122506 3091341 3554273 4541230 6099834
6594 6099834 6893296 5923399 4372080 2997601 2085657 1718366 1303976 1102914 1136088
6585 1136088 1108180 1075195 972272 726991 692614 743735 832946 720763 508422 497579 439278
6574 439278 256536 191032 205262 325270 414543 341130 280097 235033 289605 330563 436678
6563 436678 358691 315125 347758 314735 148977 -17833 -56968 31609 256854 186940 45928
6552 45928 195217 280265 263518 329828 151722 136722 106181 147978 1916 69925 257308
6541B57308K3890O9524Q1174k27731n9085M9783Q6876L1137J32207m4702j60189
6530B40192j91108J14912J90374Q1955j09429j92253M6245j25237n0762r613N3926
6519D9202j3853k24759P195Q8827J76442J39906r541j33199n97j37477j80251
6508b38105J06299K08593q8199l1019J10447l0234q7555k41467N8837J67024n647
6497g1026k01494L5200J28479n1860J37273Q3000r2446N1213K9269J6039P296
6486G0943l7523R4965p6823j44427J18631L7836O442j63422k6375K67858J08122
6475B56227j14336k09020k44981j03422L35935K71845m7397j40701K87Q0356J14160
6464A98953j29534j31400P3996m0564k4262L11k308N1818J7667J76235j61703
$$ plain form
6541 257308 281198 350722 431896 204165 145080 194863 281739 312876 445083 400381 240192
6530 240192 49084 163996 354370 436325 326896 134643 180888 55651 4889 -4724 49202
6519 49202 35349 -189410 -182215 -93388 83054 222960 213419 80220 79623 -57854 -238105
6508 -238105 -131806 76787 -11412 -42431 68016 37782 -49773 -291240 -232403 -65379 -71026
6497 -71026 -272520 -237320 -108841 -160701 -23428 59572 -32874 18339 47608 63647 70943
6486 70943 33420 128385 51562 -92865 25766 63602 70044 -93378 -119753 148105 256227
6475 256227 141891 -67129 -312110 -415532 -79597 192248 144851 4150 4437 84793 198953
6464 198953 69419 -61981 12015 -28549 -52811 -52500 -54808 -2990 14677 190912 29209
6453B9209j18651J59171K2451j06178P652J58207n1451j2949J05613k4927M308
6442A72455j13842R8932N5071n0641J38603P3898j42353j95247o646J0952q0763
6431c9581l5201M361N4547J265k5137R4061k26809p7462K75596P2485p0978L8236
6419F5383j18506j83685L2008O8331K3885K2493N9527J08605j06331q9338q6313
6408b03941Q7507M544M4778K5303J10434q3696R6682R9033L4577J70R2379j96004
6396A11766j55388M1190N6188p1598m5619K07625N8299k01326j20093O3118K18436
6385A62598N4592j6575k41559q2945J7187J54114M0579l9235q5842J90814J04052
6374B57780O9969l9568N2902j07851k59497k0803J11836K07817j02884r4063k4275
$$ plain form
6453 29209 -89442 69729 92180 -13998 -6346 151861 100410 87461 193074 168147 172455
6442 172455 58613 157545 212616 161975 300578 374476 232123 36876 30230 41182 -39581
6431 -39581 -74782 -70421 -15874 -14609 -39746 54315 -172494 -249956 25640 98125 27147 65383
6419 65383 -53123 -236808 -204800 -136469 -112584 -90091 -30564 78041 -28290 -117628 -203941
6408 -203941 -116434 -111890 -67112 -41809 68625 -15071 81611 180644 215221 215391 307770 111766
6396 111766 -43622 -2432 53756 -17842 -63461 144164 202463 1137 -118956 -55838 162598
6385 162598 217190 200615 -40944 -123889 -106702 47412 87991 48756 -37086 153728 257780
6374 257780 327749 288181 341083 233232 -26265 -47068 64768 272585 169701 75638 51363
6363E1363M1356k39371j93244O8297K4756R1013O9444J59484o1858R9067J20337
6352B30644M4916k33797j69556J7326n5372Q7371K12275j01247o9619n5320K3645
6341f8734R1110P6796J45329m8237j84387m6374J218m0126q6228q9642r6060j4974
6329c60309P1756J91546M7276j54555J9821l8940j39251N2611J28358J35490n0124
6318i6321j1811J96550R1551j55775m7562J53590P926r1676j86684j00080K07203
6307c3089J17144J19091m3373k21490j42470n6456J14161k0278M5817k5965Q7403
6296e9505P4179M4125n8339j3377O3035j3620p3611k84446l0881Q9380O2953J13012
6284h7095K57856J13433L2629j09078o0417j88593l23631M2303K75285J62756
$$ plain form
6363 51363 92719 -146652 -339896 -271599 -246843 -155830 -86386 73098 11240 110307 230644
6352 230644 275560 41763 -127793 -110467 -165839 -78468 133807 32560 -37059 -92379 -68734
6341 -68734 22376 99172 244501 196264 11877 -34497 -33279 -73405 -159633 -249275 -345335 -360309
6329 -360309 -288553 -97007 -49731 -204286 -184465 -223405 -362656 -310045 -181687 -46197 -96321
6318 -96321 -108132 88418 179969 24194 -23368 130222 138148 46472 -140212 -240292 -33089
6307 -33089 84055 203146 159773 -61717 -204187 -260643 -146482 -166760 -120943 -146908 -59505
6296 -59505 14674 58799 460 -12917 50118 36498 -37113 -321559 -352440 -263060 -200107 -87095
6284 -87095 170761 284194 316823 207745 147328 -41265 -364896 -322593 -47308 115448
6274A15448p039k14646j20884j92783K16639J06011JL8428P1346l847K8750P0921
6262A08345k4664j9670N496N773j53707j66121J9889N3211J19212J57404o1998
6251D3170K1763J19874j37660r7263J52268O1396J74645J9763M4922k14322J48248
6240C36804J98324K75254P2761m4105j22934k25046j08969k23047j89562l0414
6230f0934j10555R430J07398m1292K6659J29456J04380P1610P0643m5601j58136
6219A03058k7462K20382l0122n418j47474k62964j39557p7450J68440J1435j13290
6208c00422j05015p1726J28408K17184P8433K20041J02986J3283j57962j87705
6198f2495j40482O0009o4274N0222K21204O9432n2534N3835K8051L4169m5339
$$ plain form
6274 115448 108409 -106237 -227121 -419904 -203265 -97254 -97253 -58825 12521 8674 37424 108345
6262 108345 83681 64011 69507 75280 -78427 -244548 -224659 -171448 -52236 105168 43170
6251 43170 64933 184807 47147 -50116 102152 163548 338193 357956 402878 188556 336804
6240 336804 535128 810382 883143 839038 716104 491058 382089 159042 -30520 -60934
6230 -60934 -171489 -162059 -54661 -95953 -69294 60162 164542 236152 306795 261194 103058
6219 103058 75596 295978 265856 260438 112964 -150000 -289557 -367007 -198567 -187132 -300422
6208 -300422 -405437 -477163 -348755 -131571 -53138 166903 269889 283172 125210 -62495
6198 -62495 -202977 -142968 -207242 -157020 64184 133616 81082 134917 162968 197137 151798
6187A51798r6473p1784j6997n0164m258j34897o4939Q4135j5049M9728K43981
6176G5081j49253j72167J54510R5447k00240j59462R1444k6518P0726O0868L4372
6165a25192k7776j2697j43464R657J54519j2623n590Q0308J13127q3651L6349
6154a7033J00693J17354l2715j04421K2307j44020j35329j05752r4603p8277Q3030
6143c88766K27265j8944q7078k2908R6741L1466P6466J21881L7113n665Q2481
6132A50052k01326j46675m0961l9778J19864M1546L5493J13600p283q8000J45235
6121H1767j46431j29039J1293L1772N3047k5948m0985j05536j09641J40679P9102
6110a59920k2684j0822r3532R415J33384j6092l0716J63331n2021j99424J21983
$$ plain form
6187 151798 55325 -16459 -33456 -83620 -87878 -222775 -287714 -203579 -218628 -168900 75081
6176 75081 -74172 -246339 -91829 3618 -196622 -356084 -264640 -291158 -220432 -159564 -125192
6165 -125192 -152968 -165665 -309129 -299472 -144953 -157576 -163166 -82858 30269 -53382 -17033
6154 -17033 83660 201014 168299 63878 86185 -57835 -193164 -298916 -393519 -471796 -388766
6143 -388766 -161501 -180445 -267523 -290431 -193690 -162224 -85758 36123 73236 67571 150052
6132 150052 -51274 -197949 -238910 -278688 -158824 -117278 -81785 31815 24532 -63468 81767
6121 81767 -64664 -193703 -182410 -150638 -97591 -123539 -164524 -270060 -379701 -239022 -159920
6110 -159920 -182604 -193426 -286958 -277543 -144159 -160251 -190967 -27636 -79657 -279081 -157098
6099a57098J01548N0102j05610L7640M0597J05348R6699M6224j83147k68423n9320
6088b95440J24655K88038j03084m2485M7100j06177N3178Q0111J23612j19575
6078D9933m6256j87753O748K8280R6248J88520l1611j64646p6774J3458K92629
6067A68776m31k89493k19947L0710J33859K2365Q7021M9575R0600J0890k13248
6056a29323l4585K0109o0540P3690m4026n0408L9349j29686r7302J96510K6010
6045a90202J44604J48121j21j45068j64820j32224J8337J46767P2629K7182j7375
6034i2170j1928K3701q7003m1185p680q5363P968L892O8884J61107P5896n2562
6022c6443K7716J70100j5402L8762m6670L9062J01719r4402r1404r3165K1751
$$ plain form
6099 -157098 -55550 -5448 -111058 -73418 -32821 72527 169226 215450 32303 -236120 -295440
6088 -295440 -170785 117253 14169 -28316 18784 -87393 -34215 45896 169508 49933
6078 49933 3677 -184076 -177328 -149048 -52800 135720 104109 -60537 -137311 -123853 168776
6067 168776 168345 -121148 -341095 -310385 -176526 -154161 -67140 -17565 73035 83925 -129323
6056 -129323 -163908 -143799 -204339 -130649 -174675 -225083 -185734 -315420 -412722 -216212 -190202
6045 -190202 -45598 102523 102402 -42666 -207486 -339710 -321373 -174606 -101977 -74795 -92170
6034 -92170 -104098 -80397 -167400 -208585 -216265 -301628 -293660 -289768 -220884 -59777 16119 -36443
6022 -36443 -8727 161373 145971 184733 138063 177125 278844 184442 93038 -127 21624
6011B1624Q4116l9586O3305L6032k08799k51891m6827J45113K44140K67209N9134
6000C73570k63648j24874K45315Q3972j77538r3950o0886o053j21636j50212p7994
5989c73934j5681J47190K14317O8984m2057j78283j21625P9933J62229m3942k9832
5978a32701J5529q4766J33158m1317J3399K0511J04925J6501n2637P8511J0270
5967H1383N2290J6323j26338j48973j07195N1003P1629J61536R1859p398k06246
5956g0127p3478j01311k3124M6878J32639J56112J27370j9370j093k67142j68198
5945b60844P7739J00927N558L2633j7797j03142K1974j4081L3641R5084o1615
5934h9923J6141J37980q105Q7268J83122M7330k25539m2104l2720j48904L9968
$$ plain form
6011 21624 105740 66154 129459 165491 -43308 -295199 -342026 -196913 47227 314436 373570
6000 373570 109922 -14952 230363 314335 136797 42847 -18039 -24092 -145728 -295940 -373934
5989 -373934 -389615 -242425 -28108 40876 -1181 -179464 -301089 -221156 -58927 -102869 -132701
5978 -132701 -117172 -201938 -68780 -110097 -96698 -76187 28738 45239 -7398 71113 81383
5967 81383 133673 149996 23658 -125315 -232510 -181507 -109878 51658 143517 136119 -70127
5956 -70127 -143605 -244916 -268040 -221162 -88523 67589 194959 175589 174496 -92646 -260844
5945 -260844 -183105 -82178 -76620 -43987 -61784 -164926 -142952 -157033 -123392 -28308 -89923
5934 -89923 -73782 64198 56093 143361 326483 373813 148274 106170 73450 -75454 -35486
5923c5486j0477M3914o3042j9542j56683J74849R7866P6320J7380j01960n5944
5912c2805J0023j0216j27267k0637L6348o8409n2198J9598O8403K58809J38913
5901B20562k31573j36825n0054P6975J04519k4462k6756p7923J3549l6041J242
5890a66787p425m7252Q0691J39964L7142l6310N6376J67484J28521P6313K4713
5879D53430j66672k00466k25020K5198L486j70222l8408O2129J05737N3095j8298
5868a16011l6506J08045J4451r5582K5571J04637M6835l6649j9345o1187p8834
5857a44575n7183M4225l4532j71609J92683J61465R5869r1794q8684R2343Q2746
5846H0954J18085j05652j11704N8567p715j21362j17117K4683l9849J28652Q6680
$$ plain form
5923 -35486 -45963 -2049 -65091 -84633 -241316 -66467 31399 107719 125099 23139 -32805
5912 -32805 -22782 -32998 -160265 -180902 -144554 -212963 -265161 -245563 -177160 81649 220562
5901 220562 -11011 -147836 -197890 -120915 -16396 -40858 -67614 -145537 -131988 -168029 -166787
5890 -166787 -174212 -221464 -140773 -809 36333 23 56399 223883 352404 428717 453430
5879 453430 286758 86292 -138728 -113530 -110044 -280266 -318674 -256545 -150808 -97713 -116011
5868 -116011 -152517 -44472 -30021 -125603 -100032 4605 51440 14791 -4554 -65741 -144575
5857 -144575 -201758 -157533 -192065 -363674 -170991 -9526 86343 -5451 -94135 -1792 80954
5846 80954 199039 93387 -18317 40250 32535 -88827 -205944 -181261 -221110 -92458 -5778
5835e778m2081m23J38629K32269J24647j71256m3163N1630q6846q6176j28040
5824a6588Q2702l1948N4894P524N3573J7613j43441j0345P3566r494J11557p5229
5812A14384q3224P1341n346O9029N3918K0503j23437r8830k0456j70N8435M0957
5800I7104k48732J07192Q5817K05011k81p3458j88547o5380l6144K8147O4035
5789b5236M8681q6025l6724M486J0180P6298r951j9635J0523j7651J77144j57243
5777b5153q331P2205O4975J61297m671j0043j16583k5484L9889j21441j23261
5766i6601j5013J53634J31312k21290k35958n9056J58336J14946j197j7994n7782
5755a46663l6915J57859K078j41812Q1318J38149o0232p7252p3530K5387J77779
$$ plain form
5835 -5778 -47859 -48282 90347 322616 447263 276007 232844 284474 197628 111452 -16588
5824 -16588 66114 34166 89060 96584 150157 167770 24329 13984 87550 78056 189613 114384
5812 114384 31160 102501 97155 166184 220102 240605 117168 18338 -2118 -2288 56147 97104
5800 97104 -151628 -44436 41381 246392 246111 172653 -15894 -81274 -117418 -89271 -25236
5789 -25236 23445 -62580 -99304 -94818 -84638 -8340 -18291 -37926 -27403 -45054 132090 -25153
5777 -25153 -33484 38721 103696 264993 260322 250279 133696 108212 148101 26660 -96601
5766 -96601 -111614 42020 173332 -47958 -283916 -342972 -184636 -69690 -70887 -88881 -146663
5755 -146663 -183578 -25719 -23641 -165453 -84135 54014 -6218 -83470 -157000 -131613 46166
5744D6166n2357J9185J7941p5912R3683n5685j37399n1681J07102J2635L2007
5733d4315J01070q3868j2027p5037n2221k96969j099L29185R441j07552J55175
5722g8217R4597k18440q5772J33805p4262l2988J66507J20619j8581l8235L0662
5711c05L9346R937o8100J13778Q8756N748l8063q0347j84225n7521n0945R0361
5699a31580J70387n6454j24462k4846n1907o2560J62253j47746j17289q2941K8648
5688d38497J45642R8088L8854O2179J1316P7771J21861K30724M5328p3184j40318
5677A79764o4385j32994l05052P0909J42403J5566n582j7430R4138o7140R4602
5666D799N2753j73243j7991q8157j15791l1583J85333J48213J26543n6195N897
$$ plain form
5744 46166 -6191 12994 30935 -44977 48706 -6979 -144378 -196059 -88957 -76322 -44315
5733 -44315 56755 -27113 -39140 -114177 -166398 -463367 -464466 -135281 -125840 -233392 -78217
5722 -78217 16380 -202060 -287832 -154027 -228289 -261277 -94770 25849 7268 -30967 -305
5711 -305 39041 48978 -19122 94656 183412 189160 151097 70750 -113475 -170996 -221941 -131580
5699 -131580 38807 -17647 -142109 -166955 -218862 -281422 -119169 -266915 -384204 -467145 -438497
5688 -438497 -292855 -194767 -155913 -93734 -82418 -4647 117214 347938 393266 320082 179764
5677 179764 115379 -17615 -322667 -251758 -109355 -93789 -99371 -116801 -22663 -89803 4799
5666 4799 57552 -115691 -133682 -221839 -337630 -369213 -183880 -35667 90876 34681 40578
5655D0578J06542q5061j87339M6283O9315J2308o5852o0075j5362o0516P2206
5644a26973J91712J96605k34245j99238Q2299J70750q4618k01069R2407K9863
5634h2507j6034j38221o7693K45396J33696Q9081N4802P983K5397N8496J1839
5623C22235k26554m9454J41209J3263n4570R2725J0698L9011r365j06647j58131
5612A4420R4304M2846j19240p3112J58460Q7739j46394n224k2636o3649O9948
5601C7462J03073o2459j81082O2525J22861n3939k5308j70010p7367J48947P9904
5590a5393m3249J27265J6506k17214j4973K13215J42898l8424j54993J3642o5204
5579c5924k90363O0199J24145M1507q2851r9955q6435J52494O2177J10791L7679
$$ plain form
5655 40578 147120 62059 -125280 -78997 -9682 2626 -63226 -123301 -138663 -199179 -126973
5644 -126973 64739 261344 27099 -172139 -89840 80910 -3708 -204777 -112370 -82507
5634 -82507 -98541 -236762 -304455 -59059 74637 163718 218520 226503 251900 310396 322235
5623 322235 95681 46227 187436 200699 146129 238854 249552 288563 279198 172551 14420
5612 14420 108724 151570 32330 -40782 117678 205417 59023 53799 31163 -32486 37462
5601 37462 140535 78076 -103006 -40481 82380 28441 3133 -166877 -244244 -95297 -15393
5590 -15393 -58642 68623 85129 -132085 -147058 66157 209055 170631 15638 29280 -35924
5579 -35924 -326287 -266088 -141943 -100436 -183287 -283242 -369677 -217183 -155006 -44215 -6536
5568f536k03284j87167J07987K7222O9128j23971r8700K3643J06474J40161r5866
5557b40909l1641j3243L8224R9893Q1609R2178k4057p3689j40252q8639M4758
5546b55768r610J29852J97487m6523p1825R1311K54366J72211j34193q7702k6861
5535B12745r8050k7928K903m4802o1801j67075J13149J86493L7745j09346j50746
5524a06713q5004J19098q119p2262m8778R4P799J66630J92729j01202j73657M9782
5512e9603P5239J663o3219K4992J33888p0009r238J09146L8473k9954l6245r1910
5500B3223K4078n772O3569K7775P27K3915Q9020j01583j5976l1362k41262l2948
5488a76596q4582M9878K8332n7178M4651J22511p803m7909o7353J34223Q5786
$$ plain form
5568 -6536 -209820 -396987 -289000 -261778 -192650 -316621 -415321 -391678 -285204 -145043 -240909
5557 -240909 -272550 -285793 -247569 -147676 -66067 26111 2054 -71635 -211887 -300526 -255768
5546 -255768 -265378 -135526 61961 15438 -56387 34924 289290 461501 327308 239606 212745
5535 212745 114695 86767 89670 44868 -16933 -184008 -70859 115634 153379 44033 -106713
5524 -106713 -191717 -72619 -80738 -153000 -201778 -201684 -193885 -27255 165474 64272 -109385 -59603
5512 -59603 15636 17299 -45920 -20928 112960 42951 33713 142859 181332 151378 115133 23223
5500 23223 47301 41529 105098 132873 133600 157515 246535 144952 128976 97614 -143648 -176596
5488 -176596 -261178 -211300 -182968 -240146 -195495 -72984 -80787 -128696 -196049 -61826 23960
5477B3960j60418K5102Q0834r1200p6088j04605K7796O6584J42818O594Q385j37711
5465a87949k8349J4505K69700r6289j95302m468J20167o9811o625J32551Q3899
5454C2029k89M0369M5408m5172j75792k01087J09126R548j30686J00576J39890
5443g6080o9538J65322J0954j94782q8310R2146J68118J16235q8647J6156J0045
5432F1619M1658p165n1272j64836L8023l1081J11077O0996J10471O2451k01556
5421C0385j6823M1722j29991j16283M0311m1245j9120J58604R939Q1209J65531
5410B04239j16632j02963O5856p2077j99793l106N3575p844M6927Q7447m9775
5399i4146o9327l5468j17222j16731J40852J00570J30300m9875j18943o9586Q7649
$$ plain form
5477 23960 -136458 -111356 -30522 -121722 -197810 -302415 -274619 -208035 -65217 -58623 -50238 -187949
5465 -187949 -216298 -201793 67907 -28382 -223684 -228152 -107985 -177796 -184421 -51870 32029
5454 32029 31740 72109 117517 72345 -103447 -304534 -195408 -185860 -316546 -215970 -76080
5443 -76080 -145618 19704 30658 -164124 -252434 -160288 7830 124065 35418 51574 61619
5432 61619 103277 96112 44840 -119996 -81973 -113054 -1977 59019 169490 231941 30385
5421 30385 13562 55284 -74707 -190990 -150679 -191924 -211044 -52440 -42501 38708 204239
5410 204239 87607 -15356 50500 -21577 -221370 -224476 -170901 -178745 -131818 -44371 -94146
5399 -94146 -163473 -198941 -316163 -432894 -292042 -191472 -61172 -111047 -229990 -299576 -211927
5388b11927L4572m7740J5678p2805k9484p49m7527O4552L8352k1960J44987K29332
5376I5281N9743l4647j81534p0324R026N5093j19087r6393K01604k1714r2709
5365a95661J22364J79783k80853j82998J85738J65776J31816J2630n8083q5802
5355e290Q0023P5726q2035J35195k098q5425N355K0285j00824q7738k6310r8137
5343a71273l5054J31249K38741j8671k0530L7094L3048m4130M7513j05486j07197
5332a4696j26542q4622K2484Q8093k2570J378O3710P7061J76806J2344j20478
5321G2968n714R2903j7424o6676L3491k77399k19926K4532k1677O0106J94592
$$ plain form
5388 -211927 -177355 -225095 -209417 -282222 -311706 -312455 -359982 -295430 -257078 -279038 -134051 95281
5376 95281 155024 120377 -61157 -131481 -122455 -67362 -186449 -282842 -81238 -102952 -195661
5365 -195661 -73297 106486 -174367 -357365 -171627 -5851 125965 138595 80512 -5290
5355 -5290 74733 150459 68424 203619 201521 116096 121451 141736 40912 -46826 -73136 -171273
5343 -171273 -206327 -75078 163663 144992 124462 161556 194604 150474 197987 92501 -14696
5332 -14696 -141238 -225860 -203376 -115283 -137853 -136475 -72765 4296 181102 193446 72968
5321 72968 67254 160157 142733 76057 109548 -167851 -387777 -363245 -384922 -324816 -130224
$$ [...]
##END NTUPLES=NMR SPECTRUM
##END=
