##TITLE=Analysis number 317419
Compound Code cc 29010
Project Code qc-cat
Chemist Name ugmt ltd
##JCAMPDX= 6.0         $$ Bruker NMR JCAMP-DX V2.0
##DATA TYPE= NMR SPECTRUM
##DATA CLASS= NTUPLES
##ORIGIN= Bruker BioSpin GmbH
##OWNER= nmr
$$ XWIN-NMR		Version 3.5
$$ Mon Feb 20 12:23:01 2006 GMT Standard Time (UT+0h)  MAYBRIDGE\nmr@NMR_250MHZ
##.OBSERVE FREQUENCY= 250.131544655141
##.OBSERVE NUCLEUS= ^1H
##.ACQUISITION MODE= SIMULTANEOUS (DQD)
##.ACQUISITION SCHEME= undefined
##.AVERAGES= 16
##.DIGITISER RES= 18
##SPECTROMETER/DATA SYSTEM= dpx250
##.PULSE SEQUENCE= zg30
##.SOLVENT NAME= CDCl3
##.SHIFT REFERENCE= (INTERNAL, CDCl3, 0, 16.522)
##AUDIT TRAIL= $$ (NUMBER, WHEN, WHO, WHERE, WHAT)
$$ ##TITLE= Audit trail, XWIN-NMR		Version 3.5
$$ ##JCAMPDX= 5.01
$$ ##ORIGIN= Bruker BioSpin GmbH
$$ ##OWNER= nmr
$$ C:\u/data/dgb/nmr/ADRS/16290/pdata/1/auditp.txt
$$ ##AUDIT TRAIL=  $$ (NUMBER, WHEN, WHO, WHERE, WHAT)
(   1,<2006-02-20 12:22:39.70 +000>,<MAYBRIDGE\nmr>,<NMR_250MHZ>,
      <created by zg, POWCHK disabled, PULCHK disabled
       configuration hash MD5:
       84 BC 41 DB A1 6E 1D 46 DA 25 12 A5 C1 ED C5 3A
       data hash MD5: 64K
       60 AE 29 70 8F 11 6A 08 E7 D0 A6 78 40 01 0B 4D>)
(   2,<2006-02-20 12:22:52.92 +000>,<MAYBRIDGE\nmr>,<NMR_250MHZ>,
      <Start of raw data processing
       ef LB = 0.3 FT_mod = 6 PKNL = 1 SI = 32K 
       data hash MD5: 32K
       B2 F5 D7 A9 99 03 EE 5B A0 40 3E 2F D6 65 6E 80>)
(   3,<2006-02-20 12:22:54.70 +000>,<MAYBRIDGE\nmr>,<NMR_250MHZ>,
      <apk 
       data hash MD5: 32K
       81 7B EF FC 1D 0A 59 56 6C 90 E6 B9 52 43 3B 7D>)
(   4,<2006-02-20 12:22:55.43 +000>,<MAYBRIDGE\nmr>,<NMR_250MHZ>,
      <abs ABSG = 5 
       data hash MD5: 32K
       E5 0E 82 35 B7 CD 1B 02 35 4A C9 3A 82 F1 40 2B>)
$$ ##END=
$$ 
$$ hash MD5
$$ FD 19 26 21 8B CC FA D9 27 55 08 AC 94 AA 7D 78
##$RELAX= 
##$RELAX= 
##$RELAX= 
##$RELAX= 
##$RELAX= 
##$RELAX= 
##$RELAX= 
$$ Bruker specific parameters
$$ --------------------------
##$DU= <C:\u>
##$EXPNO= 16290
##$NAME= <ADRS>
##$PROCNO= 1
##$TYPE= <nmr>
##$USER= <dgb>
##$AMP= (0..31)
100 100 100 100 100 100 100 100 100 100 100 100 100 100 100 100 100 100 
100 100 100 100 100 100 100 100 100 100 100 100 100 100 
##$AQSEQ= 0
##$AQ_mod= 3
##$AUNM= <au_zg>
##$AUTOPOS= <20 >
##$BF1= 250.13
##$BF2= 250.13
##$BF3= 250.13
##$BF4= 250.13
##$BF5= 500.13
##$BF6= 500.13
##$BF7= 500.13
##$BF8= 500.13
##$BYTORDA= 1
##$CFDGTYP= 0
##$CFRGTYP= 5
##$CHEMSTR= <none>
##$CNST= (0..31)
1 1 145 1 1 1 1 1 1 1 1 1 1 1 1 1 1 1 1 1 1 1 1 1 1 1 1 1 1 1 1 1 
##$CPDPRG= <>
##$CPDPRG1= <>
##$CPDPRG2= <>
##$CPDPRG3= <>
##$CPDPRG4= <mlev>
##$CPDPRG5= <mlev>
##$CPDPRG6= <mlev>
##$CPDPRG7= <mlev>
##$CPDPRG8= <mlev>
##$CPDPRGB= <>
##$CPDPRGT= <>
##$D= (0..31)
0 1 0 0 0 0 0 0 0 0.06 0 0 0 0 0 0 0.0002 0 0 0 0 0 0 0 0 0 0 0 0 0 0 
0 
##$DATE= 1140438158
##$DBL= (0..7)
120 120 120 120 120 120 120 120 
##$DBP= (0..7)
150 150 150 150 150 150 150 150 
##$DBP07= 0
##$DBPNAM0= <>
##$DBPNAM1= <>
##$DBPNAM2= <>
$$ [...]
##$SUBNAM7= <"">
##$SUBNAM8= <"">
##$SUBNAM9= <"">
##$SW= 20.6930455092707
##$SWIBOX= (0..15)
0 0 3 0 0 0 0 0 0 0 0 0 0 0 0 0 
##$SW_h= 5175.983436853
##$TD= 65536
##$TD0= 1
##$TE= 294.16
##$TE2= 300
##$TE3= 300
##$TEG= 300
##$TL= (0..7)
0 120 120 120 120 120 120 120 
##$TP= (0..7)
150 150 150 150 150 150 150 150 
##$TP07= 0
##$TPNAME0= <>
##$TPNAME1= <>
##$TPNAME2= <>
##$TPNAME3= <>
##$TPNAME4= <>
##$TPNAME5= <>
##$TPNAME6= <>
##$TPNAME7= <>
##$TPOAL= (0..7)
0.5 0.5 0.5 0.5 0.5 0.5 0.5 0.5 
##$TPOFFS= (0..7)
0 0 0 0 0 0 0 0 
##$TUNHIN= 0
##$TUNHOUT= 0
##$TUNXOUT= 0
##$USERA1= <user>
##$USERA2= <user>
##$USERA3= <user>
##$USERA4= <user>
##$USERA5= <user>
##$V9= 5
##$VALIST= <valist>
##$VCLIST= <CCCCCCCCCCCCCCC>
##$VD= 0
##$VDLIST= <DDDDDDDDDDDDDDD>
##$VPLIST= <PPPPPPPPPPPPPPP>
##$VTLIST= <TTTTTTTTTTTTTTT>
##$WBST= 1024
##$WBSW= 4
##$XGAIN= (0..3)
0 0 0 0 
##$XL= 0
##$YL= 0
##$YMAX_a= 438211
##$YMIN_a= -486867
##$ZGOPTNS= <>
##$ZL1= 120
##$ZL2= 120
##$ZL3= 120
##$ZL4= 120
##$ABSF1= 16.522
##$ABSF2= -4.171173
##$ABSG= 5
##$ABSL= 3
##$ALPHA= 0
##$AQORDER= 0
##$ASSFAC= 0
##$ASSFACI= 0
##$ASSFACX= 0
##$ASSWID= 0
##$AUNMP= <proc_1d>
##$AZFE= 0.1
##$AZFW= 0.1
##$BCFW= 0
##$BC_mod= 0
##$BYTORDP= 0
##$COROFFS= 0
##$CY= 12.5
##$DATMOD= 1
##$DC= 0
##$DFILT= <>
##$DTYPP= 0
##$F1P= 14.0000005364418
##$F2P= -0.99999901652339
##$FCOR= 0.5
##$FTSIZE= 32768
##$FT_mod= 6
##$GAMMA= 0
##$GB= 0
##$INTBC= 1
##$INTSCL= 1
##$ISEN= 128
##$LB= 0.3
##$LEV0= 0
##$LPBIN= 0
##$MAXI= 10000
##$MC2= 0
##$MEAN= 0
##$ME_mod= 0
##$MI= 0
##$NCOEF= 0
##$NC_proc= -2
##$NLEV= 6
##$NOISF1= 0
##$NOISF2= 0
##$NSP= 0
##$NTH_PI= 0
##$NZP= 0
##$OFFSET= 16.522
##$PC= 1
##$PHC0= -113.7588
##$PHC1= 9.082386
##$PH_mod= 1
##$PKNL= yes
##$PPARMOD= 0
##$PSCAL= 4
##$PSIGN= 0
##$REVERSE= no
##$SF= 250.13
##$SI= 32768
##$SIGF1= 0
##$SIGF2= 0
##$SINO= 400
##$SIOLD= 32768
##$SREGLST= <1H.CDCl3>
##$SSB= 0
##$STSI= 32768
##$STSR= 0
##$SW_p= 5175.98343685301
##$SYMM= 0
##$S_DEV= 0
##$TDeff= 65536
##$TDoff= 0
##$TI= <Analysis number 999999
Compound Code 99
Book Reference 9
Project Code 9>
##$TILT= no
##$TM1= 0
##$TM2= 0
##$TOPLEV= 0
##$USERP1= <user>
##$USERP2= <user>
##$USERP3= <user>
##$USERP4= <user>
##$USERP5= <user>
##$WDW= 1
##$XDIM= 32768
##$YMAX_p= 345035283
##$YMIN_p= -119878
$$ End of Bruker specific parameters
$$ ---------------------------------
##NTUPLES= NMR SPECTRUM
##VAR_NAME=  FREQUENCY,     SPECTRUM/REAL,   SPECTRUM/IMAG
##SYMBOL=    X,             R,               I
##VAR_TYPE=  INDEPENDENT,   DEPENDENT,       DEPENDENT
##VAR_FORM=  AFFN,          ASDF,            ASDF
##VAR_DIM=   32768,         32768,           32768
##UNITS=     HZ,            ARBITRARY UNITS, ARBITRARY UNITS
##FACTOR=    0.157963299565203, 1,           1
##FIRST=     4132.6476996994, 0,             0
##LAST=      -1043.33573715361, 0,           0
##MIN=       -1043.33573715361, -119878,     0
##MAX=       4132.6476996994, 345035283,     0
$$ Real data points
##PAGE= N=1
##DATA TABLE= (X++(R..R)), XYDATA
$$ [...]
18731B6863O21j849j9531j1504K5011K3565p909j7301O32Q554q870k3901k3850
18718b9469L3554K7016l335M772J771l502J3443r517n2686k3088L3854M0900J8028
18705E1741P101k2222J1026N090K3947m58J0214r543O405P971R219k4384j0818
18692F5289K1537K8536J335l5352j4372k7737m1741j376L225L461J8411j1716
18680I500J950K0838l612m7694O416L4058N0723n272k5360j2594j0647L341m859
18667A6788L054k3492K6760J6251m365j2046l369j831l763K6791J4771L237K4724
18654H3510J8638k3645K6264L7359r253k8200j4297K0006J9129j8714j3514K8103
18642A25386k482J2950J613k0574l0130J3348j0132j0567J2140K7316O16l6902
$$ plain form
18731 26863 27484 25635 6104 -5400 19611 43176 35267 17966 18598 27152 18282 -5619 -29469
18718 -29469 4085 31101 27766 32538 34309 30807 44250 34733 -17953 -41041 -7187 33713 51741
18705 51741 58842 36620 47646 52736 76683 76225 86439 76896 83301 91272 100491 76107 65289
18692 65289 86826 115362 116697 81345 66973 39236 -2505 -3881 -656 2805 21216 9500
18680 9500 11450 32288 28676 -19018 -12602 21456 72179 66907 41547 28953 18306 21647 16788
18667 16788 19842 -3650 23110 39361 34996 22950 19581 17750 13987 40778 55549 58786 83510
18654 83510 102148 78503 104767 142126 132873 104673 90376 110382 129511 110797 97283 125386
18642 125386 122904 135854 137467 116893 86763 100111 89979 79412 91552 118868 119484 82582
18630H2582k8045m073j2151p762j5265k3482L000K7N565q990J7891K798R985L7330
18616E9410K955l3408M22K738K871k0495j0311n219O112N627K2509J2252O091
18603E1554l217j6467O385J4201k619N214j3236R400J8954R188R875j0914o59
18590G7659P157R270l646j0287O279j0418m3877J93L6764K0106Q831L1891M856
18577A34778o350K0945k638R738j1992j6656N324k9246q128j2736q517M016K6987
18564A05525l6846J3693m40j7992p105J5622J2470J792J0213J3656N309K949J9392
18551A38238J1165k5270M259j3818L482P701J6661o51m349O78k0307J3428L4297
18538A65514m572j7965m867k399K729k3705k3880j71O909Q014j147J3101n436
$$ plain form
18630 82582 54537 50464 38313 30551 15286 -8196 -5196 -5169 396 -8594 9297 12095 22080 59410
18616 59410 62365 28957 29379 32117 34988 14493 4182 -1037 5075 10702 33211 45463 51554
18603 51554 48337 31870 38255 52456 49837 55051 41815 51215 70169 79357 89232 78318 77659
18590 77659 84816 94086 90440 80153 86432 76014 32137 32330 69094 89200 98031 129922 134778
18577 134778 128428 149373 146735 156473 144481 127825 133149 103903 95775 83039 74522 78538 105525
18564 105525 68679 82372 81932 63940 56835 72457 84927 86719 96932 110588 115897 118846 138238
18551 138238 149403 124133 128392 114574 118056 125757 142418 141767 137418 138096 117789 131217 165514
18538 165514 160942 142977 138110 135711 138440 114735 90855 90684 97593 105607 104460 117561 112125
18525A12125J1005l128n314L0990l930j3470j6742k5992J247L0742J6288J6198
18513A50019j2630k3609k9384n457J3011J0185J5510L2408j0219j7343M0514L9376
18501B02381K9831K6963L4529J3229M3021M8296N7493O9233R7502P3157M4913
18490G40548j656l5852o5353l3539j4496m8567k9724r812j0555n446J6354Q845
18478E10747P303J9143r164J7975N3615M7274M5323L0895M9954Q9809Q8562J16679
18466A068115J39462J65573K37869K65310K74381L69034M87057N51286N90747
18457D148834O94804Q98652J303133J907160K900026M426830O505812Q893091
18449C1678342J1148758J2466300J1653341R256886M781288j751492n134411q640694
$$ plain form
18525 112125 123130 120002 114688 145678 141748 128278 111536 85544 86791 117533 133821 150019
18513 150019 137389 113780 84396 78939 91950 102135 117645 150053 139834 122491 163005 202381
18501 202381 232212 259175 293704 306933 349954 398250 455743 524976 622478 695635 740548
18490 740548 738892 703040 637687 604148 589652 541085 511361 501549 490994 485548 501902 510747
18478 510747 518050 537193 528029 546004 599619 646893 692216 723111 773065 862874 951436 1068115
18466 1068115 1207577 1373150 1611019 1876329 2150710 2519744 3006801 3558087 4148834
18457 4148834 4843638 5742290 7045423 8952583 11852609 16279439 22785251 31678342
18449 31678342 42827100 55293400 66946741 76203627 80984915 79233423 74099012 65458318
18441F5458318j2190415j0801446q632331o839077m696561l162101k280869j801841
18433A5053677j616560j494743j348306j197454j089924r69195q44151p67927
18425E725417o95210n88736m92213l98565l42242l24702k64056k15142j91294
18416B213257j77334j54679j33861j47480j29831j07981j10864j17271p3167j7343
18406A043446j7804j8965l3205q914j6455k4212o079k9806n5958q0875q0399q7096
18394E83678p5196l8773n8123l2787l0352m1897m6449j7054K579k5883j1437p803
18382B00503m7966p2554j7201K3835K2456o875k0690k108M387q569p187q618J0550
18369F9963P180P044k7821m026j7022P416K9479L0781J446o017j1617L109J2055
$$ plain form
18441 65458318 53267903 42466457 33834126 26995049 22298488 19136387 16855518 15053677
18433 15053677 13437117 11942374 10594068 9396614 8306690 7337495 6493344 5725417
18425 5725417 5030207 4441471 3949258 3550693 3208451 2883749 2619693 2404551 2213257
18416 2213257 2035923 1881244 1747383 1599903 1470072 1362091 1251227 1133956 1060789 1043446
18406 1043446 1025642 1006677 973472 964558 948103 923891 917812 888006 832048 751173 670774 583678
18394 583678 508482 469709 411586 378799 348447 306550 260101 243047 245626 219743 208306 200503
18382 200503 152537 79983 62782 86617 109073 102198 81508 79400 83787 75218 68031 59413 69963
18369 69963 77143 84187 56366 52340 35318 42734 72213 102994 104440 98423 86806 89915 101970
18356A01970q716k8096K4340L2147j0626k5201J2117O337m6259P257r254P925
18344F3941K5634L988l8426l2860J987J9956m999O00j3383J3327K7390M08k3766
18331D3797m045K5442K6303J2826o640j1221k964j3010N148L5683k1981l9890
18319D9448J142J4535o642m2920p056j5176j421k0938K3944O53o190Q724K4545
18306B2648J3312k657n915j8481q904J5406r740m418j2409K707J1900M540J3919
18293B1908J7357n531j3061R636J9284r089p529j1379J6739j3884j0497k561J7609
18280B9002n845j1312L092K6434j1469j4054q891l1961J2352k442J5880L993L961
18267H740k318j4419J8581J4953p372j2848K4775J6048L1718J0382l5920k1522
$$ plain form
18356 101970 93254 65158 89498 121645 111019 85818 97935 104272 58013 65270 56016 63941
18344 63941 89575 93563 55137 22277 24264 44220 39221 39821 26438 39765 67155 67563 43797
18331 43797 39752 65194 91497 104323 97683 86462 83498 70488 75636 111319 89338 49448
18319 49448 50590 65125 58483 15563 8507 -6669 -8090 -29028 -5084 -4431 -10621 -1897 22648
18306 22648 35960 33303 27388 8907 3 15409 5669 1251 -11158 -8451 3449 7989 21908
18293 21908 39265 33734 20673 30309 49593 40504 32975 21596 38335 24451 13954 11393 29002
18280 29002 23157 11845 14937 41371 29902 15848 6957 -25004 -12652 -15094 786 4779 8740
18267 8740 6422 -7997 10584 25537 18165 5317 30092 46140 77858 88240 52320 30798
18255C0798k4159r018J5823j0590O323j400q865r345K5719K5383J2986j4390j3597
18242B5668J703J2185R494k186O718j3320k027N281Q241J8798K8067K8564k2755
18229A04431k9629k2950n796j0658M862J8691k3928q949P224J1551J9997j117
18217F3729p152P959l1711m618J9107M732K5824j5773l342P429R950j0978M255
18204F9411m551k0099j2821Q898j5458l1124Q353L8081O958M1476q996k4546Q65
18191E6447J7767j4519m378l4287q797l361l015Q504q486N223N0724K1505R197
18178I2524k3881l5311O759j2746K4545j5664j5386M932K5538J992l162R886M935
18165F4961J2010J9701R502l2401l2379R437K0240J0840L7052K2205j4559j060
$$ plain form
18255 30798 6639 -2379 13444 2854 9177 7777 -1088 -10433 15286 40669 53655 39265 25668
18242 25668 27371 39556 49050 46864 53582 40262 38235 43516 51757 70555 98622 127186 104431
18229 104431 74802 51852 46056 35398 40260 58951 35023 26074 33298 44849 64846 63729
18217 63729 56577 64536 32825 28207 47314 52046 77870 62097 58755 66184 76134 65156 69411
18204 69411 64860 44761 31940 40838 25380 -5744 2609 40690 47648 89124 80128 55582 56447
18191 56447 74214 59695 55317 21030 12233 8872 5857 14361 5875 11098 61822 83327 92524
18178 92524 68643 33332 40091 27345 51890 36226 20840 25772 51310 53302 50140 60026 64961
18165 64961 76971 96672 106174 73773 41394 50831 71071 81911 118963 141168 126609 125549
18153A25549j4290n6416J7755L6426J2619j2810K2882O160N777j2669j93K1101
18141A51891j1883k4090J4687K7371J2135K8986l248O211J7618k5074J3594L1545
18129B39743o378J6974L0684M2886O7606N1281O0115L5971P0517P2755R4365J25338
18117I01857J75973K49704K97754L92786O06114Q85246J415940K276110L686681
18108A0888165N826648Q345411R607530P346774J257079p769132j1862121p848787
18100A5791567m063570k265909j394094q99360n91834n65973p35263p64380o32390
18091C878794n14536m62323l76053k88700k18192j89282j53463j49955j53112
18082A373178j32804j34912j04152j03817r3610q2400l6851p4576l8316j1544
$$ plain form
18153 125549 111259 54843 72598 109024 121643 108833 131715 137875 143652 130983 130790 151891
18141 151891 140008 115918 130605 157976 170111 199097 195849 202060 219678 194604 208198 239743
18129 239743 233365 250339 281023 323909 391515 442796 502911 538882 609399 682154 776519 901857
18117 901857 1077830 1327534 1625288 2018074 2624188 3509434 4925374 7201484 10888165
18108 10888165 16714813 25060224 34667754 42014528 43271607 35502475 23640354 15791567
18100 15791567 11727997 9462088 8067994 7168634 6576800 6010827 5275564 4511184 3878794
18091 3878794 3364258 2901935 2525882 2237182 2018990 1829708 1676245 1526290 1373178
18082 1373178 1240374 1105462 1001310 897493 803883 721483 684632 610056 571740 560196
18072E60196o7608n9818j8749m1450k7413k0186l6827j9040m6066l7859l3332
18061A51848j9100K3952O172R309l2784j8493j4615l6266J5285J9627J4339J034
18049A20308j9938j0292p396k3326k8241O439n22j3884k6081M897J8866L6382
18037E7212o199k1495j1050J229k013J433j0167k0381m252M9893R111k1340k1389
18024E92j690J0794k2509J294K4494M2036J3424Q901j00k418R470r905j6578R556
18010F7361N352k0760r708N003M1640M3319L7201K3272K777l599l200K2246M9621
17997B60525J4417P704k7567m0192K4917J4362L107K6091l9376o5522k6302Q303
17985A60467K8298K922j3130k0902m0188l2239j591K580j3965k3069k1856p490
$$ plain form
18072 560196 492588 432770 414021 372571 345158 324972 288145 269105 223039 185180 151848
18061 151848 132748 156700 162872 172181 139397 120904 106289 70023 85308 104935 119274 120308
18049 120308 100370 90078 82682 59356 31115 37554 37032 23148 -2933 1964 20830 57212
18037 57212 51013 29518 18468 19697 17684 19117 8950 -11431 -15683 34210 43321 21981 592
18024 592 -1098 9696 -12813 -11519 12975 55011 68435 77336 77236 74818 84288 74383 57805 67361
18010 67361 72713 51953 42245 47248 88888 132207 169408 192680 195457 191858 188658 210904 260525
17997 260525 274942 282646 255079 214887 239804 254166 257273 283364 243988 178466 152164 160467
17985 160467 188765 191687 178557 157655 117467 85228 83637 86217 72252 49183 27327 19837
17973A9837k6137m882K7097n11k2913l0131J368J8630J8203Q522M32p400k3344
17960b1229k6976L825K9178R671q32J7233K830J7834J6124j4384r84J4745J567
17947D8602k401L411j86p199N21k2313k2835n510K412J5674P210M099O463j6895
17933A1053l2600O562j3224M923N140j6681j502M2677n77j7155J0420K752K3610
17920B5398j602j2242Q774K1554P066p059j3104K1122J1585R44K8311K4208L5367
17907A50322K8317O8129Q4872O3778J6872r06M2331L664m277k7829n8490p9696
17895B87087q7054m2558r342O318m1403k5299j8019J1368j055j4259j5546j2186
17883C8052K514J10r315j7377j2048M975J381J8215o031k8951j2634K5369J570
$$ plain form
17973 19837 -6300 -11182 15915 15404 -7509 -37640 -36272 -17642 561 9083 9515 2115 -21229
17960 -21229 -48205 -44380 -15202 -5531 -6363 10870 13700 31534 47658 33274 32290 47035 48602
17947 48602 46201 49612 49426 42227 42748 20435 -2400 -7910 -5498 10176 17386 21485 27948 11053
17933 11053 -21547 -14985 -28209 -23286 -18146 -34827 -36329 6348 5771 -11384 -964 1788 25398
17920 25398 23796 11554 20328 41882 48948 41889 28785 49907 61492 62436 90747 114955 150322
17907 150322 178639 246768 331640 395418 412290 411384 453715 457379 453102 425273 366783 287087
17895 287087 200033 157475 148133 154451 113048 87749 69730 81098 80043 65784 50238 38052
17883 38052 40566 40676 31361 13984 1936 6911 8292 26507 20476 -8475 -21109 4260 5830
17870E830J6981J4097O578j9470l0461j987K5872O904j5003l5955k2577K1016
17858b8175P011n03R446J0851q242J2802n666j8248j844k253O468J212L214j7956
17844c1883m675K3485K2460k649j3390M682K945o174k3224K3329L2049J1555j1218
17831B7292L456O648O165p345m3141k8444L796K7159K7971K2743j4832n4566l63
17818b3461J4426J2370N40K605M607j1185k3299Q474K1220n368l27J7622J1792
17805C0016P723l9855m2166O240K6128K0052J581j7588J8470J2978l961K5611
17793D5229K3598l6369l4524p206l9248n54L6705K8043L5539l826j0114k1643
17781A5630k223L8085N747J2306M834J46j1064l0790k0544q070l2563K099K2660
$$ plain form
17870 5830 22811 36908 43486 24016 -6445 -8432 17440 24344 9341 -26614 -49191 -28175
17858 -28175 -21164 -21667 -12221 -1370 -9612 3190 -2476 -20724 -22568 -24821 -18353 -17141 -13927 -31883
17844 -31883 -36558 -13073 9387 6738 -6652 -1970 975 -5199 -28423 -5094 26955 38510 27292
17831 27292 30748 37396 43561 36216 -6925 -35369 -31573 -4414 23557 46300 31468 -23098 -23461
17818 -23461 -9035 3335 3875 6480 11087 -98 -23397 -14923 6297 929 602 18224 30016
17805 30016 37739 -2116 -44282 -38042 -11914 8138 9719 -7869 10601 23579 19618 45229
17793 45229 68827 32458 -2066 -9272 -48520 -49074 -12369 15674 51213 47387 37273 15630
17781 15630 13407 51492 57239 69545 74379 74525 63461 32671 12127 4057 -28506 -26407 -3747
17768c747M754K0167J010k1774m0898l787N984l5014J3398K2011Q886K9157J5022
17755A5169P701P243j2834k8313o195J3430R806j3640j038K939o456n37O671J514
17741d540J9776j7019R759l21O999j3928J4277J3521k579L268J733n513n305o364
17727A3764P563o440P791k717k3638K2163K136J0007j114j8199K0077L166j8851
17714A5708j6784n094O633J2863J5385n6103j4012K2303K5912L327l2698m7452
17702g0012l306M1743M7625J9357l7405p011L0613j869k8215l0049j9673n903
17690f4105Q187K2440J1763J4796K662N998r302p947K3470K2214r617k5583M830
17677a94O336j1719j2277Q796O345j747M201J5521R652j1680l0333j5495Q807
$$ plain form
17768 -3747 1007 21174 22184 410 -40488 -44275 -38291 -73305 -59907 -37896 -29010 147 15169
17755 15169 22870 30113 17279 -11034 -17229 -3799 6007 -7633 -8671 -5732 -12188 -12725 -6054 -4540
17741 -4540 15236 -1783 7976 7655 14654 726 15003 28524 25945 29213 30946 25433 20128 13764
17727 13764 21327 14887 22678 19961 -3677 18486 20622 30629 29515 11316 31393 34559 15708
17714 15708 -1076 -6170 463 13326 28711 -27392 -41404 -19101 6811 10138 -22560 -70012
17702 -70012 -73318 -31575 16050 35407 -1998 -9009 21604 19735 -8480 -38529 -58202 -64105
17690 -64105 -55918 -33478 -21715 -6919 -4257 1741 -7561 -15508 7962 30176 20559 -5024 -194
17677 -194 6142 -5577 -17854 -9058 -2713 -4460 -259 15262 24914 13234 -17099 -32594 -23787
17664b3787K092J3524m186Q013j3245j7905Q613K0884K9954J1943J1481l0340
17652A7041j8358m757q591j6312J5578L4451n044p753j4419J3792J4858k5227
17640d741k4651J0682J7742K1696K9247N739l3086l7911l105J5547j9732j453
17628b4026j254M010M783N927j5473k2925k2213L799J1559q057P230J6019J2583
17615b8038k9848K97J7139j1148k061J6950L3443J2365j8630l0194q463K432J2299
17602c3457j0158j2545M1983N8154K9384l0479l2268r470O902P723l3719j9240
17590c7190J8625M1126j669r200K3579j0005j5013J949j2626k5218q001l2977
17578f6620J5453K1506k638k182M347J8512P39J3217q304J1701J7388K674m1291
$$ plain form
17664 -23787 -21695 -8171 -12357 -4344 -17589 -35494 -26881 -5997 23957 35900 47381 17041
17652 17041 -1317 -6074 -14665 -30977 -15399 19052 14008 6255 -8164 5628 20486 -4741
17640 -4741 -29392 -18710 -968 20728 49975 55714 22628 -15283 -18388 -2841 -22573 -24026
17628 -24026 -25280 -21270 -16487 -10560 -26033 -48958 -71171 -67372 -55813 -63870 -56640 -40621 -28038
17615 -28038 -57886 -57589 -40450 -51598 -53659 -36709 -3266 9099 -9531 -39725 -48188 -45756 -33457
17602 -33457 -43615 -56160 -14177 43977 73361 42882 10614 1144 8046 15769 -17950 -37190
17590 -37190 -18565 22561 20892 11692 35271 25266 10253 12202 -424 -25642 -33643 -66620
17578 -66620 -51167 -29661 -32299 -34481 -30134 -11622 -10883 2334 -5970 5731 23119 25793 -15498
17565a5498n998J8720K9301k2049l7490m129P514l719Q111M7346J5504o325k6041
17552E247j8545j2171J1425m246j2908K6193O059J9402K0182j1003L3618k4533
17540C8720k5392n098k737J5091k1260k0715L51k2592j4486K5419K6038m919p850
17527a9430j8973J3909l261j6215j1576J5474L4390l471k7771k1070P736J3297
17515c6961p430K860n959K6858J9388k9740j3693L1916L2276q386j114K9958M996
17502D4969k2995j3933K4644k5459j6336k0940K692P497j1038K5265M226R643
17490H235k1314j9639k6705o346O79L0349K974R361J0214j5572O042R39K174j9797
17476c8406j8261j4139Q404L2173J5975j7863J1016j8063J6068J327J170O132
$$ plain form
17565 -15498 -21496 -2776 26525 4476 -33014 -37143 -29629 -33348 -25237 22109 37613 31288 5247
17552 5247 -13298 -25469 -14044 -18290 -31198 -5005 1054 20456 40638 29635 63253 38720
17540 38720 13328 8230 5493 20584 -676 -21391 -21040 -43632 -58118 -32699 -6661 -11580 -19430
17527 -19430 -38403 -24494 -27755 -43970 -55546 -40072 -5682 -9153 -36924 -57994 -50258 -36961
17515 -36961 -44391 -41531 -47490 -20632 -1244 -30984 -44677 -12761 19515 11129 10015 39973 44969
17502 44969 21974 8041 32685 7226 -9110 -30050 -27358 -19861 -30899 -5634 -1408 8235
17490 8235 -13079 -32718 -59423 -65769 -65090 -34741 -31767 -22406 -12192 -27764 -21722 -20783 -18609 -38406
17476 -38406 -56667 -70806 -62402 -30229 -14254 -32117 -21101 -39164 -23096 -21769 -20599 -14467
17464a4467J3851j4525N712O302O904j7786j022j7832K6078J0729L2645J5336
17452E1925j0541K191K0069k5104m0325J992L8495M729q938K7262L9432M8118
17440A49305L6555Q4241J5161l9288p4145o2359l4445j9829m4747O311j5103j6915
17428a5258J6195l8745j3180J3813J9275K9278K6567K6845j3805j5921k4721O527
17416A6870O6114K1715l4413p7759j6190N0807J2883j1221K008K832p519k2042
17404D085r987Q311M748o318l9771J092K7794l2518o89J9214L7232K5383j9175
17391A9401k3869k9752k5905K5493K5431K3829L0779q148J398q48j4752q05L9014
17378F1266j3537m8053m132p223Q480O573J3583j57O234J6753L918q641L708j8041
$$ plain form
17464 -14467 -616 -15141 -9429 -3127 3777 -14009 -15031 -32863 -6785 3944 36589 51925
17452 51925 41384 43575 63644 38540 -1785 207 38702 43431 34493 61755 101187 149305
17440 149305 185860 270101 285262 245974 171829 109470 75025 55196 10449 16760 1657 -15258
17428 -15258 937 -37808 -50988 -37175 -17900 11378 37945 64790 50985 35064 10343 16870
17416 16870 82984 104699 70286 -7473 -23663 27144 40027 28806 30814 33646 26127 4085
17404 4085 -5902 2409 7157 839 -38932 -37840 -10046 -42564 -43253 -24039 13193 38576 19401
17391 19401 -4468 -34220 -60125 -34632 -9201 14628 45407 37259 38657 37809 23057 22252 61266
17378 61266 47729 -324 -4456 -11679 -3199 3374 16957 16800 23034 39787 43705 35064 38772 20731
17364B0731m257r321J066n986j9934L3627K4044k2828j6527j1884K5636L2097
17352D6464L3074J3999k8252o3232k3870J287J8240K9118K3820l7276j6667K6018
17340B2723j81m1664M787n3j0843K4733J9090P765j0825k832J8756n003k9173
17327b720j5517l3264j3445J2594K0941j060k6879P904L325N395L6374K7738J2688
17314C4074j2906O490K1926n047m6464K231J530K040J4436j6402j0077K6425J5293
17301C3549J2556J2850j4366m6019l4043R664K2897m027J8819k8258j2660R043
17289a9995J6848p738K8155J5394L539k9872k6326n41j2089l288j0248l949j604
17276e1714L507l538J096j1366K4585J7037j4656n135R259J1816R835Q135M424
$$ plain form
17364 20731 16474 7153 8219 2233 -17701 15926 39970 17142 615 -11269 14367 46464
17352 46464 79538 93537 65285 2053 -21817 -20530 -2290 26828 50648 13372 -3295 22723
17340 22723 22542 -19122 -14335 -14388 -25231 -498 18592 26357 15532 12700 31456 26453 -2720
17327 -2720 -18237 -51501 -64946 -52352 -31411 -32471 -59350 -51446 -48121 -42726 -6352 21386 34074
17314 34074 21168 27658 49584 44537 -1927 304 1834 3874 18310 1908 -8169 18256 33549
17301 33549 46105 58955 44589 -1430 -35473 -25809 -2912 -6939 11880 -16378 -29038 -19995
17289 -19995 -3147 -10885 17270 32664 36203 6331 -19995 -20536 -32625 -35913 -46161 -50110 -51714
17276 -51714 -48207 -51745 -50649 -62015 -37430 -20393 -35049 -40184 -30925 -19109 -9274 -1139 3285
17263C285j7057J0035K3573J1865o287m59j9012k0950l72k0639j8000j2516L8547
17250b7987L1639j7300k072K4277L249J0552l9461J6229K901Q646L835m392M426
17237A4542L250j1690l5956m6741m73J8969M868P600J1385o180J4979J5884J4391
17224D828l865O082K4305k0628j5298M897n55j3453j1813k1508j8265K7404J5162
17211b2707k33J8809q312k9654j3867M833L3316J4552Q379m17n97K993q576m703
17197f184l0323K1610k9581q096K5394Q68r486R209r457j78J1740M4272J4180
17184C3968k8938l913m7333k6310R606R170J5643k91J7355N366L4088K1216j671
17171C7956k1179k0591p226N169K3586L2120P181m8746j3209r847J302j3361J3327
$$ plain form
17263 3285 -13772 -3737 19836 31701 25414 24955 5943 -15007 -15379 -36018 -54018 -66534 -27987
17250 -27987 3652 -13648 -15720 8557 11806 22358 -17103 -874 2027 10673 14508 10116 14542
17237 14542 17792 6102 -29854 -76595 -77068 -58099 -53231 -45631 -34246 -40426 -25447 -9563 4828
17224 4828 963 7045 31350 10722 -4576 321 -234 -13687 -25500 -47008 -65273 -37869 -22707
17211 -22707 -22940 -4131 -12443 -42097 -55964 -51131 -17815 -3263 5116 4699 4102 7095 -1481 -6184
17197 -6184 -36507 -14897 -44478 -52574 -27180 -26312 -35798 -26589 -36046 -36224 -24484 19788 33968
17184 33968 5030 1117 -46216 -72526 -62920 -53750 -38107 -38398 -21043 -15677 18411 39627 37956
17171 37956 16777 -3814 -11040 -5871 17715 49835 57016 8270 -4939 -14786 -13484 -26845 -13518
17158a3518j3256K783Q678l9661j0383m473n580o866K1917K1607m726j3542K5388
17145c1632J3560L715j6742Q427K8993O484j7402K304J7806K2523j6554k3676
17133b194J3336R34k4949j5359l412J8030J8474K332j6064J7195K8576J5108J1260
17120F3267k6025m0813m323L2666j7176q909j2774j4660J8419K7631r013j1582
17108c292p762k813o062k6345J5301K0384K7396k958n1734j0472L35l4627M3551
17095c9098R092N170J5359n384J6376L0942l7912m580K1894m030n81K392k0479
17082a0839o877p808J0677r561j2076M4944J3543l1667J99O154O322j621k4142
17069b2752l7432k0325K988J6588J4875K4440J8303K5436J4963q022n0583r007
$$ plain form
17158 -13518 -26774 -23991 -15313 -54974 -65357 -69830 -75410 -82276 -60359 -38752 -43478 -57020 -31632
17145 -31632 -18072 -14357 -31099 -22672 6321 12805 -4597 -2293 15513 38036 21482 -2194
17133 -2194 11142 12076 -12873 -28232 -31644 -13614 4860 7192 -8872 8323 36899 52007 63267
17120 63267 37242 -3571 -7894 24772 7596 -1313 -14087 -28747 -10328 17303 8290 -3292
17108 -3292 -11054 -13867 -19929 -46274 -30973 -10589 16807 13849 -37885 -48357 -48022 -82649 -39098
17095 -39098 -30006 -24836 -9477 -14861 1515 32457 -5455 -10035 11859 7829 7248 9640 -10839
17082 -10839 -17716 -25524 -14847 -24408 -36484 8460 22003 -9664 -9465 -3311 3011 1390 -22752
17069 -22752 -60184 -80509 -77521 -60933 -46058 -21618 -3315 22121 37084 29062 -21521 -30528
17057c0528o127k111J184j8751J4367K5405L1822K5044J001j9231p882j1834k0674
17044a8315J1739N435p314j321Q730l2947j8140O869J8803K1331j4478j5648O56
17031c4600K9113L7376K8163k7245k9619M830M184j6214k0190J7063J8647J9000
17019C0508j278j7785l523K1594K5334k0056j8200m950q770m443j0904N40L5215
17006B3282j338k0671k2459K9436M3380j1213j5158M906J3322k0269q297j4751
16994A70j228j3120j6076j3215r712n371K3319K8207K2178n07j67k6362K5675
16981A3791K043j6897o953k2184j6376J8589Q180m513j1918J5064K1480J7742
16969A8048K4578j3944k5507l1605J6803M320j6856J2415K3667J0550r129K6863
$$ plain form
17057 -30528 -36655 -38766 -37582 -56333 -41966 -16561 15261 40305 41306 22075 14193 2359 -18315
17044 -18315 -6576 -1141 -8455 -9776 -1046 -33993 -52133 -45264 -26461 -5130 -19608 -35256 -34600
17031 -34600 -5487 31889 60052 32807 3188 8018 12202 -4012 -24202 -7139 11508 30508
17019 30508 29230 11445 7922 29516 54850 34794 16594 11644 2874 -1569 -12473 -11933 23282
17006 23282 21944 1273 -21186 8250 51630 40417 25259 30165 43487 23218 14921 170
16994 170 -1058 -14178 -30254 -43469 -53181 -58552 -35233 -7026 15152 14645 14478 -11884 13791
16981 13791 15834 -1063 -8016 -30200 -46576 -27987 -19807 -24320 -36238 -21174 306 18048
16969 18048 42626 28682 3175 -28430 -11627 -7307 -24163 -11748 11919 22469 13340 40203
16957D0203P547o496N56j7590l5040k2503J3202K1622K517q411j2981K88j1523
16944b8609M6590M8586L326L170l893j8259j5780q793j1544J1284Q530Q964O817
16931E0389m4931l5202J1092m176P697J0072P753j1523l5104M820L0732n366N184
16918h563K901l182M214j5293j2153J2905L6640N250p075r529k6460k0607J2956
16905b7996R280J4535j0383k2551j4838o088J808K4607L5541J5812j0284m5029
16893c5586j9335K3110k1364l9518N635L3498J8286L5150K0424j666k1907l9454
16881d2727j0827j7868L0406K7858J0716M501k4180k734R583k4953l3204j1506
16869h4935J5565n891K163K0363o643L75J9357J1542N449j763K9664K4621j547
$$ plain form
16957 40203 47750 41254 41810 24220 -10820 -33323 -20121 1501 4018 -4393 -17374 -17086 -28609
16944 -28609 17981 66567 69893 73063 69170 50911 35131 26338 14794 26078 34608 43572 50389
16931 50389 5458 -29744 -18652 -22828 -15131 -5059 2694 -8829 -43933 -39113 -8381 -13747 -8563
16918 -8563 -5662 -8844 -4630 -19923 -32076 -19171 17469 22719 15644 6115 -20345 -40952 -27996
16905 -27996 -18716 -4181 -14564 -37115 -51953 -58041 -56233 -31626 3915 19727 9443 -35586
16893 -35586 -54921 -31811 -53175 -92693 -87058 -53560 -35274 -124 20300 18634 -3273 -42727
16881 -42727 -53554 -71422 -41016 -13158 -2442 2059 -22121 -24855 -15272 -40225 -73429 -84935
16869 -84935 -69370 -75261 -73098 -52735 -59378 -59003 -39646 -28104 -22655 -24418 5246 29867 28320
16856B8320k5994j5567J2305L1994P389l543l7608O28n429Q728M442n049J5887
16843A6503J3753J617m0212j6871n054J655J2267K4644L3924P375j8345k3832
16831G424m9377J5417M4589J7300P745j5040l5088O339q455l676m535p611N79
16818b4389j8146K7948M200J1457l688j3765K6709J7308j6985n17L902l967M329
16805A4396R642n743K359k1602j7884r640J7272J7738K84j1021J0935j951n294
16792e09l3478K3190j0028r43J2627k2955J0164J1298J7378J3065l4693k1346
16780c6230q830q029L11L7392o27J8871L5098k0280n4654j0637R008K0551O504
16767a1552J0705q854j6722J5955K6836j4309k5301k2939j4608L551p425O271
$$ plain form
16856 28320 2326 -13241 -936 31058 38447 34904 -2704 -2076 -7505 1223 5665 616 16503
16843 16503 30256 31873 -8339 -25210 -30264 -28609 -16342 8302 42226 49601 31256 7424
16831 7424 -41953 -26536 18053 35353 43098 28058 -7030 -691 -9146 -12822 -17357 -24968 -24389
16818 -24389 -42535 -14587 -10387 1070 -2618 -16383 10326 27634 10649 10132 14034 10067 14396
16805 14396 24038 18295 20654 -948 -18832 -28472 -11200 6538 6822 -4199 6736 4785 -509
16792 -509 -33987 -10797 -20825 -21768 -9141 -32096 -21932 -10634 6744 19809 -14884 -36230
16780 -36230 -45060 -53089 -52778 -15386 -16013 2858 37956 17676 -36978 -47615 -38607 -18056 -11552
16767 -11552 -847 -9701 -26423 -10468 16368 2059 -23242 -46181 -60789 -57238 -64663 -58392
16755e8392j359K0482M5083P653j2314k464P565J001j9905k1191j5116K1917J8589
16742h451k3425o54J1905J8434J815J0805q220m0898J2761K5803M936l433j4840
16729a3462J2064K3857K2802p611l3106j420K9320K9319j9154Q472M07l0427l8757
16716a7696n65L6976M509r835k150N529K1890J5995p508l7558l8983J47K6025
16703c224K3253j8043k4198j879K1098P479n0788m1357K233M5523J7995L6094
16691A4186J0719m92j5221k1219q023K3027K4286l0515l6804J1150J9796L767
16679e343r514K3272p972j6071k0893M059N2395N436j7601k3439j984k5326l1389
16666g4370j6188K4566K8202r466j0229L3706J5498j4738J1918J5621j4458N853
$$ plain form
16755 -58392 -59751 -39269 5814 13467 1153 -1311 6254 7255 -12650 -33841 -48957 -27040 -8451
16742 -8451 -31876 -32530 -20625 -2191 -376 10429 2209 -38689 -25928 -125 4811 1378 -13462
16729 -13462 -1398 22459 45261 37650 4544 3124 32444 61763 42609 51081 51488 21061 -17696
16716 -17696 -18261 18715 23224 13389 11239 16768 38658 54653 47145 9587 -29396 -29249 -3224
16703 -3224 20029 1986 -22212 -24091 -2993 4486 -46302 -87659 -85426 -39903 -21908 14186
16691 14186 24905 24413 9192 -12027 -20050 2977 27263 -3252 -40056 -28906 -9110 -5343
16679 -5343 -14857 8415 443 -15628 -36521 -32462 19933 25369 7768 -15671 -17655 -42981 -74370
16666 -74370 -90558 -65992 -37790 -47256 -57485 -23779 -8281 -23019 -11101 4520 -9938 -4085
16654d085J2827k0440j3324K6256J5597j3444k0636k952P468K3953J1818l9800
16642a6762m270Q782J0703J6173J7083L5372R017j2447j4347j8248J1331k1031
16630B1356K3568K6142n5852k9471K2717O759k8062N049K1464O109j1492k4835
16618a6548j4450J2756o52O004R314r257q062J2904L0358L6545j9227j7123o482
16605A6080M78j4042K933K1119J457j3274r711j3648o219P090l444J4806P855
16592A1480j4703M243k3233J2205K5496j0875L848Q950j8571j0779j6902o215
16580c5056p353J3758J5996q524k0862M860O6696K7731j5151m1718j5124O569
16568h178N417j810J3202j3599P186N206m877J1640j5394K248L3627j4988k7554
$$ plain form
16654 -4085 8742 -11698 -25022 1234 16831 3387 -17249 -20201 -12733 11220 23038 -16762
16642 -16762 -21032 -12250 -1547 14626 31709 67081 76098 63651 49304 31056 42387 21356
16630 21356 44924 71066 15214 -14257 8460 15219 -12843 -7794 13670 19779 8287 -16548
16618 -16548 -30998 -18242 -18894 -12890 -3576 -12833 -20895 -7991 22367 58912 39685 22562 16080
16605 16080 16558 2516 5449 26568 28025 14751 5040 -8608 -14827 -7737 -11181 3625 11480
16592 11480 -3223 1020 -22213 -10008 15488 4613 8461 17411 -1160 -11939 -28841 -35056
16580 -35056 -42409 -28651 -12655 -21179 -42041 -37181 29515 57246 42095 377 -14747 -8178
16568 -8178 -2761 -4571 8631 -4968 2218 7424 2547 14187 -1207 1041 34668 19680 -7874
16555g874L002J2881O032K6963J3973j0074p369m380J0527j8963j7364j4811J2578
16542E121r137K480m6100k2714L1490K8456j588k4853k0702n668N22M3336L7087
16529A7730K3706N848l6507m9975q537L3676J9473j5716J6776K971j5912j5957
16517b2424Q860K6625M6665j1383k7401k7112p241l2749J1638J9433J769n947
16505a9267m120j8224L4296L8199J370k2994r366K865j4374j034J4239J9358O361
16492B7309j6485j1464q634K242K752J4694K673L982O714L1996k3812l5025j4926
16479a7984Q495j9140k975l326J7878o20j421N465K1866M583q709l7377P611L5945
16465A0291J2325k7057j2240L4353J0761J931r109K2374J8574k3576o3678l3005
$$ plain form
16555 -7874 -4872 8009 14041 41004 54977 44903 37534 33154 43681 24718 7354 -7457 5121
16542 5121 -4016 -1536 -47636 -70350 -38860 -10404 -11992 -36845 -57547 -63215 -62693 -19357 17730
16529 17730 41436 47284 10777 -39198 -47735 -14059 5414 -10302 6474 9445 -6467 -22424
16517 -22424 -13564 13061 59726 48343 20942 -6170 -13411 -46160 -34522 -15089 -13320 -19267
16505 -19267 -23387 -41611 -7315 30884 32254 9260 -106 2759 -11615 -12649 1590 20948 27309
16492 27309 10824 -640 -9274 -7032 -4280 10414 13087 17069 23783 55779 31967 -3058 -17984
16479 -17984 -9489 -28629 -31604 -34930 -17052 -17672 -19093 -13628 8238 12821 4112 -33265 -25654 10291
16465 10291 22616 -4441 -16681 17672 28433 30364 21255 43629 62203 38627 -25051 -58056
16453e8056K5158O47O894K8218k639j8549J9909k2276k5772K2345J4648l090j4418
16440b6981j1548Q208N2985J639l483L847o969j8556k799R648k7084j9826j9361
16427f0280k413J2189L0544O818k368k0537k8008n137N7241Q843m4140k1605J2838
16414e6015L4360M834j8661o525j221K8361L6818J9181j6668L561m0560J8301
16402E766P394k622J280Q699j8035k1889J3944J2246K8008K3269m6853k2734j5835
16389b7362J0399L8493O487n0682K0398M1328Q87R4J182l0267o439m974L250k914
16375a20j5515M993J260J530K0139L1656J2204k4533j3251R500k6747j8755J27
16362a7512J3805l228o078p854m870K0497j136J3250N449p203q649k495K689o162
$$ plain form
16453 -58056 -32898 -32251 -25357 2861 222 -18327 1582 -20694 -46466 -24121 -9473 -12563 -26981
16440 -26981 -38529 -30321 22664 24303 20820 24667 17698 -858 -3657 5991 -21093 -40919 -60280
16427 -60280 -62693 -50504 -19960 -13142 -15510 -36047 -64055 -69192 -11951 -3108 -47248 -68853 -56015
16414 -56015 -21655 -16821 -35482 -42007 -43228 -14867 21951 41132 24464 28025 -12535 5766
16402 5766 13160 10538 11818 20517 2482 -19407 -5463 6783 34791 58060 11207 -11527 -27362
16389 -27362 -16963 21530 28017 -22665 -2267 39061 39948 40042 41224 10957 4518 -456 2794 -120
16375 -120 -15635 -10642 -9382 -7852 12287 43943 56147 31614 18363 27863 1116 -17639 -17512
16362 -17512 -3707 -6935 -13013 -20867 -25737 -5240 -6376 6874 12323 5120 -3529 -6024 -3335 -9497
16348i497k9839k0227K6295M310p332K5033J5947q953J411K0786j4838j8758R397
16335f265L0411q375l754o287K5220O330j7895n349P044k0435P648j0586r949
16322a2242J8812K7132l82k3578P79J8442M872q771k4809k0473j0620Q398K1379
16309a061K9041j861k2320J067J943J0324O463l235m133k813n3858k2044J1592
16296e0895j3333o055J9904M3844J0472j3509q811r640k3819K9321L764r93m587
16283b4337o028p217J6426L9761M6374k9856l8323k6223L4871m064n571Q538K470
16270F821P199K7534n251k0027p250o604j6834j5724j4249K041k467k4090J0225
16257e8676k7233O90N2299K8308M328m471J4587N404j9489l1811L240q624J8293
$$ plain form
16348 -9497 -39336 -59563 -33268 -28958 -36290 -11257 4690 -4263 -2852 17934 3096 -15662 -6265
16335 -6265 24146 15771 12017 5730 30950 37280 19385 14036 21080 645 8293 -2293 -12242
16322 -12242 6570 33702 33320 9742 10521 28963 33835 25064 255 -20218 -30838 -22440 -1061
16309 -1061 27980 26119 3799 4866 6809 17133 23596 20361 16228 13415 -40443 -62487 -50895
16296 -50895 -64228 -70283 -50379 -6535 3937 -9572 -18383 -28023 -51842 -22521 -18757 -19750 -24337
16283 -24337 -30365 -37582 -21156 18605 64979 35123 -3200 -29423 5448 1384 -4187 4351 6821
16270 6821 14020 41554 36303 16276 9026 2422 -14412 -30136 -44385 -42344 -44811 -68901 -58676
16257 -58676 -85909 -85219 -32920 -4612 -284 -4755 9832 15236 -4253 -36064 -32824 -41448 -23155
16244b3155M7438j2567j7404Q210j5816l4992J8954K4540J4196K265J1836Q358
16232C1863o724j4894Q530o407J8756n693k913L345l6243n0608j7754M2199L4747
16219a796O682j7826P077j6274l0146L915J5747Q890K896K0497j5896m794K4614
16206C586K9197R857o570k3015j0792k6000l3186j5688K711L0479K2329J9975
16194B883J9595N580m104j5151m343j5258j8048J2940J7854K2351l4608m821M0633
16181B5503K6421M740n729o689k5831j1289o150k6190K2747J1396k7603k2745
16169d1419J795K863J5269l648J3855K518j8245Q946J2790O491R901K0897J93
16156C2206l1251j3518j1058J3323K0408M3563J7285l2969r449J6601m1061m5525
$$ plain form
16244 -23155 24283 11716 -5688 2522 -13294 -48286 -29332 -4792 9404 11669 23505 31863
16232 31863 25139 10245 18775 12368 31124 25431 22518 25863 -10380 -60988 -78742 -36543 -1796
16219 -1796 4886 -12940 -5863 -22137 -52283 -48368 -32621 -23731 -20835 -338 -16234 -21028 3586
16206 3586 32783 42640 36070 13055 2263 -23737 -56923 -72611 -69900 -39421 -17092 2883
16194 2883 22478 28058 23954 8803 4460 -10798 -28846 -15906 1948 24299 -10309 -15130 25503
16181 25503 51924 56664 50935 44246 18415 7126 976 -25214 -2467 8929 -18674 -41419
16169 -41419 -39624 -36761 -21492 -25140 -11285 -8767 -27012 -18066 -5276 1215 11116 32013 32206
16156 32206 955 -12563 -23621 -10298 10110 53673 70958 37989 28540 45141 4080 -41445
16144d1445j4482J4384K1904L3347m779J3165m1301k9871J1325j895K1103q172
16132b6717l499L0154J9116j9564Q84k671K932m269p68J5462J0320j7002k8276
16119b3898j165m632j6992K8435K3980L155l357j1809J0899j410q915K01K7916
16106B2408R109l063J601J7655k6712j9149j9331M9o852J5205K420m775l4964
16093d6399J5190J6293K6923j4803o559K922k1981m0406K7743K7256P289N053
16081a479J5868J0955l6568q878M9804K5021L800j6925k8736k1649M269O266J1952
16068A3700j8612N187K9305l904o0790l919K5127K7820J9422l508j1796l963l8331
16055b4262l1391J7123L6048j2055q26K2839j6594J9K174j4248l355k7238Q241
$$ plain form
16144 -41445 -55927 -41543 -19639 13708 8929 22094 -19207 -49078 -37753 -39648 -18545 -26717
16132 -26717 -30216 -62 19054 -510 374 -2297 635 -3634 -4402 11060 21380 4378 -23898
16119 -23898 -25063 -29695 -46687 -18252 5728 8883 5526 -6283 4616 3206 -5709 -5508 22408
16106 22408 31517 28454 30055 47710 20998 1849 -17482 -17433 -24285 -9080 -6660 -11435 -46399
16093 -46399 -31209 -14916 12007 -2796 -9355 -6433 -28414 -68820 -41077 -13821 -6532 -1479
16081 -1479 14389 25344 -11224 -20102 29702 54723 58523 41598 12862 -8787 -4518 1748 13700
16068 13700 -4912 275 29580 25676 -35114 -39033 -13906 13914 33336 29828 18032 14069 -24262
16055 -24262 -55653 -38530 -2482 -14537 -15363 7476 -9118 -9099 -6925 -21173 -24528 -51766 -43525
16042d3525N521N9579J6046j8880O082l557J6121N236k9301j1762o722Q631m102
16029f33j3291j8822r706j4146K8290K1424k0703k301K4562j4011j6201R017J8837
16016g684K5445R33j344l1194k0232K3646q254m620K0080n453j8787m964N910
16003b6518J0049O252qo040j7656L8976K9338N967k4532j7381o82q420k921j702
15989a5278J245J7348J5140j2461j2987J3605Q939l480J4733K5246L1609j099
15977H2560j0652k4571m0146k1919J4182K967k324j7405m7069k2913P557M5515
15965c4218L2215j5617k0725J1765L1259q910r005K6087l0146l3997k459L9918
15953a3833J7721j0792L019L3414J2164J4869j6679l244k2609m7106j2634L8555
$$ plain form
16042 -43525 -38004 21575 37621 18741 24823 21266 37387 42623 13322 1560 -5162 3469 -633
16029 -633 -13924 -32746 -42452 -56598 -28308 -6884 -27587 -29888 -5326 -19337 -35538 -26521 -7684
16016 -7684 17761 18694 17350 -13844 -34076 -10430 -18684 -23304 -3224 -8677 -27464 -32428 -26518
16003 -26518 -16469 -10217 -10225 -16265 -33921 5055 34393 40360 15828 -1553 -2235 -10655 -13576 -15278
15989 -15278 -14033 3315 18455 5994 -6993 6612 15551 12071 26804 52050 83659 82560
15977 82560 71908 47337 7191 -14728 -546 2421 97 -17308 -64377 -87290 -79733 -34218
15965 -34218 -2003 -17620 -38345 -26580 4679 -4231 -13236 12851 -17295 -51292 -53751 -13833
15953 -13833 3888 -6904 -3885 29529 41693 56562 39883 36639 14030 -33076 -45710 -7155
15941g155K3180L539j6895n191r612M748q788k746R543L459K0438L140J4312m1348
15927i376j1692J0716K0868j3327k0814J8845n792n464j0033q189J0077n113j8217
15914d7511Q001K0183L123j2531L663L9923L8793j8277k9748l0820K4924k2782
15902b3059o016o859K7316L4294J3442j1975k2645j889j4099J0462j189j9265
15890b1482j4624J2583J2817J3496J7685L658j9415j1141P47J9131K9779q729
15878C4505j890k6080m8865O10P343R838O044J4381K5535k2496j6515j0830K8020
15865d00R915L684n248J5982m530k411J005k6259R770O350N733O503j7121l842
15851h69R460L6454J3373n0633j6469K2426j7522j2363J4819J4717k9010j2195
$$ plain form
15941 -7155 16025 19564 2669 -2522 -12134 -7386 -16174 -18920 -9377 -5918 14520 17660 31972 -9376
15927 -9376 -21068 -10352 10516 -2811 -23625 -4780 -10572 -16036 -26069 -34258 -24181 -29294 -47511
15914 -47511 -39510 -19327 -16204 -28735 -25072 14851 53644 35367 5619 -25201 -277 -23059
15902 -23059 -29075 -35934 -8618 25676 39118 27143 4498 2609 -11490 -1028 -2217 -21482
15890 -21482 -36106 -23523 -10706 2790 20475 24133 4718 -6423 -5676 13455 43234 34505
15878 34505 32615 6535 -42330 -41720 -34377 -24539 -18495 -4114 21421 -1075 -17590 -28420 -400
15865 -400 9515 13199 7951 23933 19403 16992 17997 -8262 1508 7858 13591 20094 2973 -869
15851 -869 8591 45045 58418 7785 -8684 13742 -3780 -16143 -1324 13393 -15617 -27812
15839b7812M833Q424K1171m755l0967j7965K3036L1546P090M02q400K6767K7155
15826F0525M4091l9872l7223m1700m4361N0822K1339k787N478j0541j3962J8517
15814A0326k1729r785j354M38r456n81r849p315r319J0465K7865L4056J5777j2087
15800A7452j3347K3759j0359r88L308n057L4017M845k3943k7187l0343q635R364
15787b7114k2219J2348l726P351k4665K9010L2784k4982o026J4262L4686L2860
15775E4569R237k4723o62l4510J7770j6794j9332J5551k355l5134N993K0967O723
15762b700J8270K0651K2084r298j9231l6120j0501K5291L6036K1307k7465L616
15750D1940M143J2221k7738q48L8310m1136m4466K0790R67N536O576K1707k7462
$$ plain form
15839 -27812 -22979 -14555 6616 1861 -29106 -47071 -24035 7511 14601 15003 6603 33370 60525
15826 60525 104616 64744 27521 -14179 -58540 -7718 13621 10834 16312 5771 -8191 10326
15814 10326 -11403 -21188 -22542 -22104 -31560 -32141 -41990 -49305 -58624 -48159 -20294 13762 29539 17452
15800 17452 4105 27864 17505 16517 19825 14768 48785 53630 29687 2500 -27843 -36478 -27114
15787 -27114 -49333 -36985 -40711 -33360 -58025 -29015 3769 -21213 -27239 -12977 21709 54569
15775 54569 63806 39083 38421 3911 21681 4887 -14445 1106 -1249 -36383 -30390 -9423 -2700
15762 -2700 15570 36221 58305 49007 29776 -6344 -16845 8446 44482 65789 38324 41940
15750 41940 46083 58304 30566 29718 68028 26892 -17574 3216 4183 9719 16295 38002 10540
15737A0540j0087J1471J5649k1787l750L747N110J203l974j6832J2456J5059j8787
15724A8l1414j8018J2536J8375J3862K262j3217J5777r985N640L079q543M4949
15711C5321J2079J135l8473J19J5860k9392k7498K2143J5904j2278M37M921O548
15698F826L2497j2044n5980j9836n237j949K4109J8471K0431K8154q556R344q639
15685B7591k0705q214k0937o277J8254n687j0849l510J3893J2448r839J2381J365
15672h6N677K5970k4631l4376o798L1659K4969m4755k146n6j0261k8671k7528
15659i1033L500K7848L2055K2876O898K730r46m1312k4853Q659J5391J1182j4868
15646d1873L513K6829k488J0799J6250K5283j7864k5178M0078J5167j6394J2830
$$ plain form
15737 10540 453 11924 27573 5786 2036 5783 10893 12096 8122 -8710 3746 18805 18
15724 18 -31396 -49414 -36878 -18503 -4641 -2379 -15596 181 -9804 -4164 -1085 -9628 35321
15711 35321 47400 48535 10062 10181 26041 -3351 -30849 -8706 7198 -5080 -4643 278 6826
15698 6826 39323 27279 -28701 -48537 -53774 -55723 -31614 -13143 7288 35442 26886 36230 27591
15685 27591 6886 -1328 -22265 -28542 -10288 -15975 -26824 -30334 -16441 -3993 -13832 -1451 -86
15672 -86 5591 31561 6930 -27446 -34244 -2585 22384 -22371 -24517 -24573 -34834 -63505 -91033
15659 -91033 -87533 -59685 -27630 -4754 2144 4874 3928 -37384 -62237 -53578 -38187 -27005 -41873
15646 -41873 -38360 -11531 -14019 -3220 13030 38313 20449 -4729 35349 50516 34122 46952
15634D6952k275R931k1669l484j3181j9420K8181J0838l44j7494K834K0493J6573
15621E7935P555l3228k3414L0681J266j3466j3179j573q801J5232J5312k6611
15609G709k5196K0603P036l4181j9955o70p080o077J5927P445K673l61P975P446
15595a6706j0694J8053J7101k2134j6906J7169K1614J803j8372m736o694l5310
15583e5812j6337J6089J9127J8363K1345L245k1202m2667L2499J3033k795N917
15571i195L6615J1749k3590l453J3142p770J2907J6669r381l2663r190K7798J9466
15558D3104l167l3268J4050q462j8093J2393j7638k8858n498N992q125K4279l9229
15545f2520k1582J6787K4695K0697J3840P949J603k0522L984J1032N0645J7462
$$ plain form
15634 46952 44677 54608 32939 29455 16274 -3146 25035 35873 35529 18035 20869 41362 57935
15621 57935 65490 32262 8848 39529 40795 27329 14150 12577 3776 19008 34320 7709
15609 7709 -17487 3116 10152 -24029 -43984 -44654 -51734 -57811 -41884 -34439 -31766 -32127 -24152 -16706
15595 -16706 -27400 -9347 7754 -14380 -31286 -14117 7497 9300 -9072 -13808 -20502 -55812
15583 -55812 -72149 -56060 -36933 -18570 2775 6020 -15182 -57849 -25350 -12317 -15112 -9195
15571 -9195 27420 39169 15579 12126 25268 17498 30405 47074 37693 5030 -4160 23638 43104
15558 43104 39937 6669 20719 12257 -5836 6557 -11081 -39939 -45437 -39445 -47570 -23291 -62520
15545 -62520 -84102 -67315 -42620 -21923 -8083 -134 1469 -19053 -15069 -4037 46608 64070
15533F4070J1109k0459Q56l9232k3596J5538M0273j1224l0547j4876l7266j2773
15521e8127J2827O379J5104L2696K5982K1022p10k5334j6896L119o147J8015j577
15508B6353j4l17J8820K6634o147j8816k3613n4244m0286K2026R330J6339R799
15495a4136K2793K8435q934l1635j9321M013l650k2945J6272k4457O043K4485
15483b3037J8780P241J0696O058p145K2663R834p403j7680l5786O417J590k68
15470h040K0744j7100n379Q717k5541j0695K7480O1815k5763j2924j3441j3419
15458a3546M5775K6322k1797K496j3441J857j4641k0992O65R882J7457l0k2218
15445b211q685n916K7797J2033J6800K2905J9056k8575O272R791l6156j559k097
$$ plain form
15533 64070 75179 54720 55576 16344 -7252 8286 48559 37335 6788 -8088 -45354 -58127
15521 -58127 -45300 -38921 -23817 8879 34861 55883 55173 29839 12943 16062 9915 27930 26353
15508 26353 26339 26022 44842 71476 65329 46513 22900 -31344 -71630 -49604 -40274 -23935 -14136
15495 -14136 8657 37092 28158 -3477 -22798 -18785 -22435 -45380 -29108 -53565 -47522 -23037
15483 -23037 -4257 2984 13680 19738 12593 35256 45090 37687 20007 -15779 -9362 -7772 -8040
15470 -8040 12704 -4396 -9775 -1058 -26599 -37294 -9814 52001 26238 13314 -127 -13546
15458 -13546 32229 58551 36754 39250 25809 27666 13025 -7967 -7302 2580 20037 20007 -2211
15445 -2211 -10896 -16812 10985 23018 39818 62723 81779 53204 59476 69267 33111 31552 29455
15432B9455L924q360j1323o676M915K501j4459M007j5887j0750M225J7356J5266
15419A4194n217m80m2359R382K4243J0981m25k5978k6346J0939J6508R582K4034
15406A9058R677j3942j4459J195m450K43m609J2156j1309k1727K2255J8108M50
15393A2646l045j3243r964j6010j2111J41k678L5494k415m7797O811l889J6750
15380c9310J5643J7593k829j2627m292J5233J4799J1536k6565k8570p411N2266
15368E466L7880Q998k6697l3306R61J8700K0108J1820m854p14k2366j5463k6240
15355b5707P987K317O133K416n517j2296k053r185j3225l347L4111J4656J2073
15342H363J3072q156m593P210L7555j8152o336k5110n2878P539q643q092J0625
$$ plain form
15432 29455 33379 25019 13696 7020 11935 14436 -23 3984 -11903 -22653 -18428 -1072 14194
15419 14194 8977 8497 -33862 -24480 -237 10744 10319 -15659 -42005 -31066 -14558 -4976 19058
15406 19058 28735 14793 334 1529 -2921 -2678 -7287 4869 -6440 -28167 -5912 12196 12646
15393 12646 9601 -3642 -13606 -29616 -41727 -41586 -44264 -8770 -11185 -58982 -52171 -56060 -39310
15380 -39310 -23667 -6074 -8903 -21530 -25822 -10589 4210 15746 -10819 -39389 -46800 5466
15368 5466 43346 52344 25647 -7659 -6698 12002 32110 43930 39076 38362 15996 533 -25707
15355 -25707 -17720 -15403 -9270 -6854 -12371 -24667 -26720 -35905 -49130 -52477 -18366 -3710 8363
15342 8363 21435 13279 8686 15896 53451 35299 28963 3853 -49025 -41486 -50129 -58221 -47596
15329d7596L966K4627Q613N18o737j1490L1000L541l4954l6014J5478N0122O855
15316G929l2743J4315L1271o703j4924o38M983K4152j5541j4589p27K1n870k1531
15302c0595k4909r506l789J7298K971K9483K4461q872q406k382K2876j734j7744
15289a0848K4620o348r30P477o250o938K0679j5307o982o037m626j0592p875l9849
15275f9806k1372J7860J9292L875k322K0102J9605M395K0366j4259l6204r80R451
15262b9997R916L2837k51j557j1406o792j0990j2760J2911L7489Q958k0889o67
15249F802k2785j816K3984Q408j5894k7392m993L6952J9704n22K455q052J8490
15236C5341M1178M0285j5458l5108l6883j1167o890K4465O935l2943p701N488
$$ plain form
15329 -47596 -43630 -19003 -10390 -9872 -16609 -28099 2901 6442 -28512 -64526 -49048 1074 7929
15316 7929 -24814 -10499 20772 14069 -855 -1493 3490 27642 12101 -2488 -3215 -3194 -9064 -30595
15302 -30595 -55504 -65010 -68799 -51501 -48530 -19047 5414 -3458 -11864 -14246 8630 6896 -10848
15289 -10848 13772 7424 6494 13971 7721 783 21462 6155 -827 -6864 -11490 -22082 -29957 -69806
15275 -69806 -91178 -73318 -54026 -50151 -52473 -32371 -12766 -8371 11995 -2264 -38468 -39448 -29997
15262 -29997 -20081 12756 12505 10948 -458 -7250 -18240 -31000 -18089 19400 28358 7469 6802
15249 6802 -15983 -17799 6185 14593 -1301 -28693 -33686 3266 22970 22448 24903 16851 35341
15236 35341 76519 116804 101346 66238 29355 18188 11298 35763 42698 9755 2054 7542
15224G542J2409o675k0531j4833O001j9686k5832j4642N3334J5171k959M675J6450
15211A0424R872J251L1768k6207n1737j0603K5255R271j8947Q180P438J2494k1620
15198a3161l883L1559J4501k1299j0917M354j1275m947q801L7554J9025m293k1781
15185F636K3812R593j1134j4937j1569J5380j0122l919l09K2490j4008j5010j2263
15172a5360k4097j0744J1043J3801j8859J2004m316N0720M0256l7982j1393K9475
15160C4548J4931k2580j235n333k7774p106J3586P190J3556R821k3170o695J7847
15147A7586r078m8541k2660K4247J9319j253k1014M5389J7706J6253j5575n2165
15135b9786j8224P194M0993n671o925j5691J8L6196P899k0164j2507l8680K1646
$$ plain form
15224 7542 19951 13276 -7255 -22088 -16087 -35773 -61605 -76247 -22913 -7742 -10701 -6026 10424
15211 10424 20296 21547 53315 27108 -24629 -35232 -9977 -706 -19653 -11473 -4035 8459 -13161
15198 -13161 -17044 14515 29016 7717 -3200 1154 -10121 -15068 -23869 13685 32710 28417 6636
15185 6636 30448 40041 28907 13970 2401 17781 7659 3740 3431 25921 11913 -3097 -15360
15172 -15360 -39457 -50201 -39158 -25357 -44216 -32212 -36528 14192 54448 16466 5073 34548
15160 34548 49479 26899 25664 20331 -7443 -14549 -963 6227 19783 29604 6434 -261 17586
15147 17586 8508 -40033 -62693 -38446 -19127 -20380 -41394 3995 21701 37954 22379 -29786
15135 -29786 -48010 -40816 177 -5494 -12419 -28110 -28092 8104 16003 -4161 -16668 -55348 -33702
15122c3702J8113J8211k9971j0670N0894J8858k0760m29J3318j0152l6782J3248
15110i824L74k2962R754O242J0193n221O17K870q459k8462Q965M871j7699k8577
15096g7318l8067K1929N0653M6585k61j2525J933j4600Q317J6315J7007l6717
15084a6749k9114k0267K4621L3190j8035J5523J7077J1405O074J3824l4339j9714
15072a6504J7250j0458l3002r972k2108p955K8466L6552j2879L340K9853j577
15060A006l0631n127J854L6529L0350P352k91l2606J2927Q939K1382J4303N029
15047G1016K856k838j4930k5314N04j276l3601l335K4910K7283j4879n2046N155
15034a6495K137j4476j2701J56L9038K7013K1026K417l633j7018J5425o460j8357
$$ plain form
15122 -33702 -15589 2622 -27349 -38019 12875 31733 10973 10544 23862 13710 -23072 -9824
15110 -9824 -9450 -32412 -22658 -16416 -6223 -11444 -10827 -7957 -16416 -44878 -35913 -31042 -48741 -77318
15096 -77318 -115385 -93456 -42803 3782 3521 -9004 -7071 -21671 -13354 2961 19968 -16749
15084 -16749 -45863 -66130 -41509 -8319 -26354 -10831 6246 17651 23725 37549 3210 -16504
15072 -16504 746 -9712 -42714 -52686 -74794 -82749 -54283 -17731 -30610 -27270 2583 1006
15060 1006 -29625 -34752 -32898 3631 33981 41333 41042 8436 21363 30302 51684 65987 71016
15047 71016 73872 71034 56104 30790 31294 30018 -3583 -6918 17992 45275 30396 -21650 -16495
15034 -16495 -14358 -28834 -41535 -41379 -2341 24672 45698 48115 44482 27464 42889 36429 18072
15021A8072k5365N49J4446j6832K075J6270N2l2910j5880K6032M5272J1721m509
15008C8993q785k4526j574l723J6948N216PJ4911K3965p846j2631J6263j5939
14995D1279L723j1461k7803j5441K5725j8460j5556M997J0250L1734L0042l9520
14983A9509J117R191j9173k1112L8625K4516M194R51o453l2068k3200k0967J3251
14970a1619R603j8628j0485J9908j9611J0922J4318k1753M381J5911R326P020
14958I293k0718p292L5054J3572M669k1900J414J3861J2137k3840M613k9130p969
14945a6236L5283J5367m539k4502j5982J0602o6l1118k8041O744K0378M274K6666
14932a170k0020j8697N17Q124K1244k0119j8373J45Q756J7436K7347L0959k0281
$$ plain form
15021 18072 -7293 -6744 7702 -9130 -7055 9215 9267 -23643 -39523 -13491 31781 43502 38993
15008 38993 30208 5682 4108 385 17333 22549 22556 37467 61432 53586 40955 57218 41279
14995 41279 45002 33541 5738 -9703 16022 -2438 -17994 -12997 -2747 28987 59029 19509
14983 19509 20626 29817 10644 -10468 28157 52673 56867 57818 51365 19297 -3903 -24870 -11619
14970 -11619 -2016 -20644 -31129 -11221 -30832 -19910 -5592 -27345 -22964 -7053 2273 9293
14958 9293 -11425 -18717 16337 29909 34578 12678 14092 27953 40090 16250 20863 -8267 -16236
14945 -16236 19047 34414 29875 5373 -10609 -7 -73 -31191 -59232 -52488 -32110 -27836 -1170
14932 -1170 -21190 -39887 -39370 -31246 -10002 -30121 -48494 -48349 -39593 -22157 5190 36149 15868
14919A5868l516M1847K34l1475l0397O840K7626K8445r145p912L7025k3127k1708
14906C0605O245N554K832k3996p720J8204l2129j5870L0714J4613k7191J1060
14894A2921K862k5409K3421P464P4j5847j5213N089K1245j4800l2232J1105m440
14881b3760n489K9590J2907M246j0012j894r512k87L4815L4906n126k8678r44
14868C0762j8638k1681K1009K5268q379j4115m372k00j3777M9602L6239j3984
14856F7734m0359k7941k6008M8029n013J0627j7358l9172J7376o44J5425J4863
14844A7559p329j5528j3204k498J5961J2254n421L478K5502K4275J4808l196k4291
14831D2370j2015J6230L1694k0272l8262k3201K795p174M570n14K5210r389k2673
$$ plain form
14919 15868 12352 54199 54433 22958 -7439 -599 27027 55472 46327 38415 75440 52313 30605
14906 30605 36850 42404 45236 21240 13520 31724 -405 -16275 14439 29052 1861 12921
14894 12921 15783 -9626 13795 21259 21333 5486 -9727 -4638 16607 1807 -30425 -19320 -23760
14881 -23760 -29249 341 13248 17494 7482 5588 -3924 -4211 30604 65510 60384 31706 30762
14868 30762 12124 -9557 11452 36720 28341 14226 9854 9654 -4123 45479 81718 67734
14856 67734 27375 -566 -26574 21455 16442 27069 9711 -29461 -12085 -12729 2696 17559
14844 17559 10230 -5298 -18502 -21000 -5039 7215 1794 5272 30774 55049 69857 66661 42370
14831 42370 30355 46585 78279 58007 19745 -3456 -661 -7835 -3265 -3779 21431 12042 -10631
14818a0631K32K898m330J4509L9483k77q037j4144j9987L348J8460q3l1531k8735
14804c8825J6672K5288K6785O967j7014q000j2131J3343m4213j1270m388l130
14792d9916P517K4372K0441j4906k6754M331J378J2258L4255K2537j2581K573
14780B5505J5845k1773O683K0211l3207j8313k073N181J4513J877k2321k7059
14768c4931j9888K5520K847j2899J9986K0518K0594q665k6874j8036K8830K3829
14756B0831J4452j4727j2018m2683o242K176M6300L5036O923m4419l7091M361
14744b7101K1174K8346K405J8058N756j3700J3744l03n1670k6425J3781O847q208
14731a7296O056p899K0144R641r467k583k0850k6495n371J7373K1431J5379O689
$$ plain form
14818 -10631 -10399 -7501 -11831 2678 42161 41884 33847 19703 -284 3064 21524 21441 -10090 -38825
14804 -38825 -22153 3135 29920 36887 19873 11873 -258 13085 -31128 -42398 -46786 -49916
14792 -49916 -42399 -18027 2414 -12492 -39246 -34915 -33537 -21279 12976 35513 22932 25505
14780 25505 41350 19577 26260 46471 13264 -5049 -7122 -1941 12572 14449 -7872 -34931
14768 -34931 -54819 -29299 -26452 -39351 -19365 1153 21747 13082 -13792 -31828 -2998 20831
14756 20831 35283 20556 8538 -34145 -40387 -38211 8089 43125 50048 5629 -31462 -27101
14744 -27101 -5927 22419 24824 42882 48638 34938 48682 48379 -3291 -29716 -15935 -9088 -17296
14731 -17296 -11240 -19139 1005 10646 1179 -1404 -22254 -48749 -54120 -36747 -15316 63 6752
14718F752j8104M557L4721k5651k8049K5757L439P209j261j9597m33J2846p729
14705e543j526R673R38R824P457l367k6552k678J0431l016J6330J7234J2512J2698
14691E4415l600j0769j0351l5022k4994n514R649J0188j7224J2469J1440N717
14679c596j8419q050j5669J3566K281J3657J0306J5889Q666p328j5067j3765K882
14666a4647J2071K2958J0912r572k019n664l5376k7254J6608K3491K0144j2297
14654f45k4749K7425K000p827P334l620M960J5719j2449k2336j4985q585l964
14641d1722J9242J2838K4090m28l7738o531j4107L4508K5469m66j1478R036P102
14628A9815k8533M899n799P011O863O833J7430J3012K238j7789k1531k5620N806
$$ plain form
14718 6752 -11352 -6795 27926 2275 -25774 -17 3422 10631 9370 -10227 -10660 2186 -5543
14705 -5543 -7069 2604 3542 13366 20823 17456 -9096 -11774 -1343 -4359 11971 29205 41717 54415
14691 54415 50815 40046 29695 -5327 -30321 -35835 -26186 -15998 -33222 -20753 -9313 -3596
14679 -3596 -22015 -30065 -45734 -32168 -29887 -16230 -5924 9965 18631 11303 -3764 -17529 -14647
14666 -14647 -2576 20382 31294 21722 19703 14039 -21337 -48591 -31983 -8492 11652 -645
14654 -645 -25394 2031 4031 -3796 3538 -82 4878 20597 8148 -14188 -29173 -37758 -41722
14641 -41722 -22480 -9642 14448 14020 -23718 -30249 -44356 -9848 15621 15155 3677 12713 19815
14628 19815 -8718 -3819 -9618 -2607 4256 11089 28519 41531 43769 25980 4449 -21171 -15365
14615a5365J8763j2154l4794j5697j9785J7760J6991M0002j3511m2748j424K4715
14603c7247J7644j2691q092r570q775K2501J8466j5334m441K3850M268K2563P920
14590B1062N670l368m1278q387k0279q043K2916K2393L7518L0398n221l5972J0559
14577B7968q561j2175N679q789k4J5302N98l979k890r503n857J6077J5065j3277
14563A5634R114m118k8370k7054m263r703J8890P533k2391q648J7040r713j3427
14550e9476K9514M7273J6998k988j8677l8167j1260k323K1411q984j1623K6037
14538a2265K0664M386J4739k347j9010K4368J8852k2471j4461J6156k162l6671
14526a0222k4314o062K3017N763k5948k9144k5656J2361J7158K4645j4808j4039
$$ plain form
14615 -15365 3398 -8756 -43550 -59247 -79032 -61272 -44281 -4279 -17790 -60538 -61962 -37247
14603 -37247 -19603 -32294 -40386 -49956 -58731 -36230 -17764 -33098 -37539 -13689 -9421 13142 21062
14590 21062 26732 23364 -17914 -26301 -46580 -54623 -31707 -9314 28204 58602 53381 17409 27968
14577 27968 19407 7232 12911 4122 4098 19400 19998 16019 13129 3626 -2231 13846 28911 15634
14563 15634 24748 20630 -7740 -34794 -39057 -48760 -29870 -22337 -44728 -53376 -36336 -46049 -59476
14550 -59476 -29962 17311 34309 31321 12644 -25523 -36783 -39106 -17695 -26679 -38302 -12265
14538 -12265 8399 12785 27524 25177 6167 30535 49387 26916 12455 28611 26449 -10222
14526 -10222 -34536 -40598 -17581 -11818 -37766 -66910 -92566 -80205 -63047 -38402 -53210 -67249
14514f7249O775Q698N866J4012K6193K2171j3711k1343J0239N202O353p804J9088
14501A4490M0292J243j386n2397l2159J2781K7548R427k9810l0943P253M9974
14489A6313K135J005K9375M082k3393J740q759L513l4057l5371n571J5688L7797
14476D497r819P904R345j8957J2173K2839P558j3462K7355k0072p422j5019J7201
14463B4121r136K81Q249k4784l537K0150R596k0947l7278o926k2076j2936K8021
14450d7202M7528J9289r847N07J899l318R012J4531j5269j9230j1412J7032j265
14437B255k5036M609k6587K8004j2232J9512J1730k6454j2437J8583k2213R503
14425c0763j6776R287j7805Q458L6215J5749J9588K7195n296l2955j7340o050
$$ plain form
14514 -67249 -60474 -51776 -45910 -31898 -5705 16466 2755 -18588 -8349 -3147 3206 -4598 14490
14501 14490 54782 56025 54639 2242 -29917 -17136 10412 19839 -9971 -40914 -33661 16313
14489 16313 18448 19453 48828 52910 29517 31257 22498 26011 -8046 -43417 -48988 -33300 4497
14476 4497 -5322 2582 11927 -7030 5143 27982 35540 22078 49433 29361 21939 6920 24121
14463 24121 14985 15266 23515 -1269 -4806 15344 24940 3993 -33285 -40211 -62287 -75223 -47202
14450 -47202 326 19615 9768 10275 12174 8856 17868 32399 17130 -2100 -13512 3520 2255
14437 2255 -22781 -18172 -44759 -16755 -28987 -9475 2255 -24199 -36636 -18053 -40266 -30763
14425 -30763 -47539 -38252 -56057 -47599 -11384 4365 23953 51148 45852 12897 -4443 -10493
14413a0493O334J0073n490j8013r682L2670K2648J9751M542m916j1597k7083l3016
14400b4272j6257N5202Q807k9163L385K035R915m696L691L1309k374j7961j2080
14387G541k6886j242Q042r531k7809j3943M0365J3897M350J0507J8832K2525J3899
14374F0547l2311j5411k263J9371M6734L6921k9429m0207k7308n61J2067j3995
14362A4155k8466p38R018K7004K5187N663J329j0939k8838P810P411k0241J5709
14349B4064J2077o006p702J4161J1641j0599k0020l9283Q14K7732l1981j1302
14337c6404R361n799J0454K0677j8699j8454q035P559K2654J3827Q884J536j5928
14324h367r791o325M538J76Q419j4607k4219J6609J1994J7590K9340k1068r847
$$ plain form
14413 -10493 -4159 5914 424 -17589 -27271 5399 28047 47798 52340 47424 35827 8744 -24272
14400 -24272 -40529 14673 23480 -5683 -2298 -263 9652 4956 8647 39956 37582 19621 7541
14387 7541 -19345 -20587 -12545 -22076 -49885 -63828 -23463 -9566 -5216 5291 24123 46648 60547
14374 60547 28236 12825 10562 29933 76667 113588 84159 43952 16644 16083 28150 14155
14362 14155 -14311 -15049 -6031 20973 46160 51823 53152 42213 13375 21185 28596 8355 24064
14349 24064 36141 30135 22433 36594 48235 37636 17616 -21667 -20853 6879 -25102 -36404
14337 -36404 -27043 -32842 -22388 -1711 -20410 -38864 -46899 -39340 -16686 -2859 6025 7561 -8367
14324 -8367 -18158 -24483 -19945 -19769 -11350 -25957 -50176 -33567 -21573 -3983 25357 4289 -5558
14311e558K2299J1478J3534P827K832j8503j9787J3166K062j7009L665r05L1089
14298D6190O420k7174Q96o390r957k2131J4830J4115K132k0977j3008K1129j9823
14285a3748j8025J8712J3250J8937Q058O868k0692j6445j9310j3156J9082K9327
14273A2858K690q274k6673k8757N905K9407k553j2851M1713L3193l1447m5705
14261c0494Q73J784o382L0023L1937K2237l2530l4518M427L1887q926J0025j6248
14248D095j5929o631j0811L953J3409j5302M7328J0576l349j9639L781J8058n951
14235B3588j8982k559K68l756j6495n334j1231J4177K3973J0371K9734p289k6023
14222A0442j962L750O751K0164j2740k4067k0632P64j1082k3366K0926K2889J7324
$$ plain form
14311 -5558 16741 28219 41753 49580 52412 33909 14122 27288 29350 12341 16006 15101 46190
14298 46190 52610 25436 26332 19942 9985 -12146 2684 16799 18931 -2046 -15054 6075 -13748
14285 -13748 -31773 -13061 189 19126 27184 34052 13360 -3085 -22395 -35551 -16469 12858
14273 12858 15548 7274 -19399 -48156 -42251 -12844 -15397 -28248 13465 46658 15211 -30494
14261 -30494 -29621 -27837 -34219 -4196 27741 49978 17448 -17070 -12643 19244 10318 20343 4095
14248 4095 -11834 -18465 -29276 -25323 -11914 -27216 20112 30688 27339 7700 11481 29539 23588
14235 23588 4606 2047 2315 -1441 -17936 -23270 -34501 -20324 3649 14020 43754 36465 10442
14222 10442 8480 12230 18981 39145 26405 2338 -18294 -17530 -28612 -51978 -31052 -8163 9161
14209I161J3954o386k6432j8686Q67p429K7907K0195j382j3012j9402Q283m13
14196a2775r414K8324K4176k5514J159Q283j1569k5422r19o7J0395J6216K1765
14183B4638OJ4031k8597k2802j2416K534R064O041Q410n144K939K7781k9501j7617
14169b0633n915K65j9174p079L705n62N637K6407p44j8428K2745l564M508j5599
14155b8431j692M1365K1447j17j8846q658O598M470o354p062j697J5734k2203
14142e446l4743K9738Q560k2345N813M306J9104J0266J2366N104j928n087K1836
14129D7544L1919R266n4400k8962J9081J2119R517j1138r943J7084n411k8512
14117H164O575K5550O464l607j7775j9334j1422K8139K4976m143l7040k5982R970
$$ plain form
14209 9161 23115 16729 -9703 -28389 -27522 -34951 -7044 13151 11769 -1243 -20645 -12362 -12775
14196 -12775 -22189 6135 30311 4797 5956 14239 2670 -22752 -23671 -23738 -13343 2873 24638
14183 24638 24644 38675 10078 -12724 -25140 -22606 -13542 -7501 909 -4235 -1296 26485 -3016 -20633
14169 -20633 -26548 -26283 -45457 -52536 -48831 -49393 -43756 -17349 -18093 -36521 -13776 -17340 -12832 -28431
14155 -28431 -30123 11242 32689 32572 13726 5068 11666 16136 9782 2720 1023 16757 -5446
14142 -5446 -40189 -10451 -1891 -24236 -18423 -14117 4987 15253 27619 32723 30795 25708 47544
14129 47544 79463 88729 34329 5367 24448 36567 46084 34946 25003 42087 36676 8164
14117 8164 14739 40289 46753 43146 25371 6037 -5385 22754 47730 43587 6547 -19435 -9465
14104i465R522l5220k0138K363J3378J4513K5449l261K0225j6845J137O401k5217
14091a7158j7383N165J1300L6240K9262k572l0542j8784j849l91m339L5170K6729
14078E0848l0015k5151j8720K3486J470N6M530j4615K2452L6813j0251k6321m322
14065A0260j2309r830M271q362j5075K3406J2918k4320l8356J867j2046j0639
14053g8215K3779J8111J8363J5019j1302J0321j1253r772j3109j484J1678J4741
14041a3123J3602n421l654J7676k6166P557K6583k6687j1642J2730j2310k6502
14029d7357j1715M0882K7079m06j2594L356P099n430l0258L796J6706K5944k0796
14016c694j8725K5782J1976q564L1138K798Q19j0711j4288j231j8788m8907j1999
$$ plain form
14104 -9465 57 -35163 -55301 -52938 -39560 -25047 402 -2859 17366 521 1658 8059 -17158
14091 -17158 -34541 -29376 -18076 18164 47426 44854 14312 -4472 -6321 -6712 -11051 24119 50848
14078 50848 20833 -4318 -23038 448 1918 1974 6504 -8111 14341 51154 40903 14582 10260
14065 10260 -2049 -11879 -7608 -15970 -31045 -7639 5279 -19041 -57397 -55530 -67576 -78215
14053 -78215 -54436 -36325 -17962 -2943 -14245 -3924 -15177 -24949 -38058 -39542 -27864 -13123
14041 -13123 479 -4942 -8596 9080 -17086 -9529 17054 -9633 -21275 -8545 -20855 -47357
14029 -47357 -59072 -18190 8889 8483 -4111 -755 6344 914 -29344 -25548 -8842 17102 -3694
14016 -3694 -22419 3363 15339 6775 37913 40711 41530 30819 16531 15300 -3488 -52395 -64394
14003f4394L7967K2808j2078R392k418j1753m205j6785n588J1277J4172J7912
13991c693J751l7422L149J3104j6751O578K1604n069j4237P716O401L3004O632
13978B2767k1976m5135k5476K7848L5398k653l5667l6416M618K9751J4672O556
13966b5713K0660J3390j247k150J0323q222m3265j4295Q929m631N140L2984L5567
13953B7470j120J1459J8034l831N306j0644l5365k5670j3450Q383q780J3304K5430
13940A0526J5621k0321l1999J0706J6731j4670j3462k1631J4078n359J2523j8164
13928d5421j9659L124p272m452N421n771J0509J5458K7398k937l844J3900L298
13915a0248j5150l5400k0567J7258K6090J9079J8218J3935J69K6316L579j9668
$$ plain form
14003 -64394 -26427 -3619 -15697 -6305 -8723 -20476 -24681 -41466 -47054 -35777 -21605 -3693
13991 -3693 -1942 -39364 -36215 -23111 -39862 -33284 -11680 -16749 -30986 -23270 -16869 16135 22767
13978 22767 791 -44344 -69820 -41972 -6574 -9227 -44894 -81310 -76692 -46941 -32269 -25713
13966 -25713 -5053 8337 7090 4940 15263 7041 -36224 -50519 -41590 -46221 -41081 -8097 27470
13953 27470 26350 37809 55843 52012 57318 46674 11309 -14361 -27811 -19428 -28208 -14904 10526
13940 10526 26147 5826 -26173 -15467 1264 -13406 -26868 -48499 -34421 -39780 -27257 -45421
13928 -45421 -65080 -61956 -69228 -73680 -68259 -74030 -63521 -48063 -20665 -23602 -27446 -13546 -10248
13915 -10248 -25398 -60798 -81365 -64107 -38017 -18938 -720 13215 13384 39700 43279 23611
13903B3611j2420j4052K269J600p237m925m553k5866L2057K4673k1055J9598K9096
13890D2796r94p265o796j8840o071K030j3184J3516r151j3516l6704Q244k2258
13877f8193P47K5712J1579j9603j3064K7660J4461j9442j9429L720M1008J8492
13865C648r975m860k601j9106K7636k1587R750J5544L023J6355k1946j7634J9728
13852b025J7980j8226n850K3262j2004o08j5555J074M0717j6984j8673r745J196
13839a5441P537l989k447p941j0390J0653J6298O783K187j1803l2742k1552k31
13826f3078J9226K6798K0529J1422M149m352j3427l7413K6991j9506k8108n977
13814f2746l302L1165N395J3194K4302J7108q924J1901j331l1678k4690M547j1483
$$ plain form
13903 23611 11191 -2861 -592 1008 -6229 -11154 -15707 -41573 -9516 15157 -5898 13700 42796
13890 42796 41802 34537 27741 8901 2830 4860 -8324 5192 -3959 -17475 -54179 -45935 -68193
13877 -68193 -67446 -41734 -30155 -49758 -62822 -35162 -20701 -40143 -59572 -55852 -14844 3648
13865 3648 -6327 -11187 -13788 -32894 -5258 -26845 -17095 -1551 1472 17827 -4119 -21753 -2025
13852 -2025 15955 -2271 -8121 15141 3137 2529 -13026 -11952 28765 11781 -6892 -16637 -15441
13839 -15441 -7904 -11893 -14340 -22281 -32671 -22018 -5720 1063 3250 -8553 -41295 -62847 -63078
13826 -63078 -43852 -17054 3475 14897 19046 14694 1267 -36146 -9155 -28661 -56769 -62746
13814 -62746 -66048 -34883 -29488 -16294 8008 25116 16192 28093 26762 -4916 -29606 -25059 -36542
13801c6542K0199L1815r498o533l5318j3031J8O627Q337K5064J0864o899p966
13788a2863j5889k3863k170M130J6217j8679j1998J0191K1211m936J3392L5129
13776I872K6709M4161j5324j2162j7193n2027k9202r015k6111J4139L7917M549
13764b3687J7081q948j8295K281j3715K0836O0051K6670j4582n075j2416r917
13752B0284L837k0831o780k200m43P293j0714J2640M1607J1386j9037p765P758
13739C7035k7962N598J6551j5142k4385l6307J5325p639O16J8371j2935J1167
13727a9707K1689J41o013r112O676Q412J7391M876j8919k3426r169k2476J6158
13714c3479L8570L7622N834j1371o958J0700r142k2573m0835j2032M2546K3084
$$ plain form
13801 -36542 -16343 15472 5974 -559 -35877 -48908 -48890 -42263 -33926 -8862 2002 -4897 -12863
13788 -12863 -28752 -52615 -54785 -50655 -34438 -53117 -65115 -54924 -33713 -38649 -25257 9872
13776 9872 36581 80742 65418 53256 36063 -15964 -45166 -54181 -80292 -66153 -28236 -23687
13764 -23687 -6606 -15554 -33849 -31568 -45283 -24447 35604 62274 47692 42617 30201 20284
13752 20284 24121 3290 -3490 -5690 -6133 1160 -9554 3086 44693 56079 37042 29277 37035
13739 37035 9073 14671 31222 16080 -8305 -44612 -29287 -36926 -36310 -17939 -30874 -19707
13727 -19707 1982 2123 -3890 -13002 -6326 2086 19477 24353 5434 -17992 -27161 -49637 -33479
13714 -33479 5091 42713 48547 37176 30218 40918 31776 9203 -31632 -43664 -1118 21966
13702B1966j3318k5828n831p427j062K2486J1677R906P009M784m1995J4804J2514
13689I685K9792Q124l5842j3139j5052j934K2846N018J267L5887q171k3452K7632
13676D2661K8477l8090l8606O029K740J2043J679Q41O338k6434j8304J7008O777
13663C159j3223K4779K7828k089k673J4285j3700k3629q795j1566k775J7831M284
13650A3716j8443K1695r292K0582k929j3315j8358K5758k460J335K4743P55k1076
13637B2711r037j6223n245j2547k2899l5936p346J5939J4933L5471M647l558K061
13624a7029J6288q288L5520M0224j5380q806l2661J9230K5003k316L297J8750
13612G3832l0517K318L086P858j5723q513P530N63k0594L061j4253J6099m523
$$ plain form
13702 21966 8648 -17180 -23011 -30438 -31500 -9014 2663 12569 19578 24362 -17633 -2829 9685
13689 9685 39477 47601 11759 -1380 -16432 -18366 4480 9498 10765 46652 38481 15029 42661
13676 42661 71138 33048 -5558 471 3211 15254 16933 17774 24112 -2322 -20626 -3618 3159
13663 3159 -10064 14715 42543 40454 37781 52066 38366 14737 5942 -5624 -8399 9432 13716
13650 13716 -4727 16968 7676 28258 25329 12014 -6344 19414 16954 18289 43032 43787 22711
13637 22711 13674 -2549 -7794 -20341 -43240 -79176 -86522 -70583 -55650 -20179 -15532 -19090 -17029
13624 -17029 -741 -9029 26491 66715 51335 42529 9868 29098 54101 51785 55082 73832
13612 73832 43315 45633 48719 56577 40854 32341 39871 40434 19840 22901 8648 24747 20224
13599B0224j3854j7061j8741o352N514N6127N5843l078o66K3106J376p976j62
13586I4300P432J6548k3558k6008q701r191l0157q142K9831J6071k4310r078j5674
13573I363J1255K5106q277k5921J1393l6621j3358K5318j1061q772r28J011P675
13560a3817K7340M656K0148M7238J675k0670m1289r453p746r192o128M1488M423
13547C8673M632P962o939o676l92k4963o210L0075K7798k6361j7568J9215P419
13534D6665p914j1094M523J171m4528j6550K4879N359q228l2373o750M9449L1867
13521C6476m102k3088n6093j4961J0783m275J3242J5099j3131P870K3949K4930
13509A6699m254q100j5125k8362j5679N519L5204j2832j0535L7088K6859o348
$$ plain form
13599 20224 6370 -10691 -29432 -35784 -30270 25857 81700 78622 77956 101062 102438 94462 94300
13586 94300 101732 118280 94722 68714 60013 50822 20665 12523 42354 58425 34115 25037 9363
13573 9363 20618 45724 37447 11526 22919 -13702 -27060 -1742 -12803 -21575 -22503 -21492 -13817
13560 -13817 13523 18179 38327 85565 87240 66570 25281 15828 8082 -1110 -7238 34250 38673
13547 38673 43305 51267 44328 37652 37260 12297 6087 36162 63960 37599 20031 39246 46665
13534 46665 38751 27657 32180 33351 -11177 -27727 -2848 2511 -5717 -38090 -44840 4609 36476
13521 36476 32374 9286 -46807 -61768 -50985 -55260 -42018 -26919 -40050 -32180 -8231 16699
13509 16699 12445 4345 -10780 -39142 -54821 -49302 -14098 -26930 -37465 -377 26482 20134
13497B0134m003n1050j2637k7214J3280L1962M8510J7261J7997l9812l4341K035
13485a7878k443Q900n641j8896J5732J133l1018k2693J8084J8376j6645J3028
13473c9961l6431J0273l048n455J1384Q400K5344L200N629J6325K4137p460M8
13460A2385N990P252N094k486k0982j6731J4232j2384j4053K2328n242R788K0546
13447B5737J7290J953k3258l3602j8224J3554K5019N83j7521J5635M8970J09l9959
13434A6286l3844j5222Q60Q612o790J490J1355L4960J9681k0427K960j0018J0192
13421B0095k1005j7102J7511Q019l922k465k7645k5885K0758M7687L4479k4322
13409B6203n4914j9480J9324K036j464Q587k824r792N32j5209J9321J3121k4080
$$ plain form
13497 20134 16131 -34919 -47556 -74770 -61490 -29528 18982 36243 54240 14428 -19913 -17878
13485 -17878 -20321 -11421 -17062 -35958 -20226 -19093 -50111 -72804 -54720 -36344 -52989 -39961
13473 -39961 -76392 -66119 -69167 -74622 -63238 -54838 -29494 -26294 -20665 -4340 19797 12337 12385
13460 12385 18375 25627 30721 28235 7253 -9478 4754 -7630 -21683 645 -4597 5191 25737
13447 25737 43027 44980 21722 -11880 -30104 -16550 8469 9052 -8469 7166 56136 56245 16286
13434 16286 -17558 -32780 -31920 -23308 -30098 -28608 -17253 17707 37388 16961 19921 9903 20095
13421 20095 -910 -18012 -501 7518 3596 1131 -26514 -52399 -31641 16046 50525 26203
13409 26203 -28711 -48191 -28867 -26831 -28295 -19708 -22532 -32324 -31792 -47001 -27680 -14559 -38639
13396c8639m317j8811K5592L2971L740L3198J5662k4662l0520n036J4332N176
13384H686q263n073K952K3750K2215p489l7555j7142o163K5213m216M280o429
13371e234p019J8921J1441P640l759k6812k9992n677L0182K8340J4080r878K8115
13358E0348J3811n40m1289k6179j8114k0329j4874L385K4248K573J3396N596P861
13345a07L1245r980p48j9637J1204J9351j1126j7333j4911l1500r689K1210J6198
13332a5823L0913J0159r668Q099j3456j4302k3703j7619n032J9961Q362K7553
13320E444K2306j934m1032l4182R00L5953J0760l547j8310J4699O277N675J268
13307D277j675l4946j7107N200J9290J4300r097K068K707l354K1313P546j600
$$ plain form
13396 -38639 -42956 -61767 -36175 -3204 536 33734 49396 24734 -5786 -10822 3510 8686
13384 8686 423 -4650 -1698 22052 44267 36778 -777 -17919 -24082 1131 -3085 1195 -5234
13371 -5234 -12253 6668 18109 25749 21990 -4822 -34814 -40491 -10309 18031 32111 22233 50348
13358 50348 64159 63619 22330 -3849 -21963 -42292 -57166 -53781 -29533 -26960 -13564 -7968 -107
13345 -107 31138 21158 20410 773 11977 31328 20202 2869 -12042 -43542 -53231 -32021 -15823
13332 -15823 15090 25249 15581 23680 10224 -4078 -27781 -45400 -50432 -30471 -22109 5444
13320 5444 27750 25816 -15216 -49398 -48498 -12545 -1785 -5332 -23642 -8943 -2666 3009 4277
13307 4277 2602 -32344 -49451 -44251 -24961 -10661 -19758 -17690 -14983 -18337 2976 10522 8922
13294H922J2175m709K112l401k6007m4777j2900L6617J7561l922J9283P406L9722
13281D8082Q242m361m0514J2383N72j7723k843N170J7810n212l3185k0132k0290
13268e2001m2383Q698M1107J0310l65K9018K1783j4794J8487J1743K244P613J6541
13255E8001k7341l1012K8370Q578k6514m485l6510j5106J0678J0746J8408j9671
13243b5858j5546K1043N475J3400j5969k2354j1407K8898J7674J5570j1837M7325
13231D6414p450k3678r369R346M7092q540l4473k1097J6107j057k615N127j1938
13218C869R074J9800k2746J0057J6467j578j7116p776j1417K1675R301l0606L9201
13205C8205J8772k7427O490p253o360n1155j0409K6717K2759l9477k69K7287L5228
$$ plain form
13294 8922 21097 16388 18500 15099 -10908 -55685 -68585 -31968 -14407 -18329 954 8360 48082
13281 48082 56324 51963 11449 23832 24404 6681 3838 9008 26818 21606 -11579 -31711 -52001
13268 -52001 -94384 -85686 -44579 -34269 -34634 -5616 16167 1373 19860 31603 33847 41460 58001
13255 58001 30660 -352 28018 36596 10082 5597 -30913 -46019 -35341 -24595 -6187 -25858
13243 -25858 -41404 -20361 -14886 -1486 -17455 -39809 -51216 -22318 -4644 10926 -911 46414
13231 46414 38964 15286 5917 15263 62355 53815 19342 -1755 14352 13295 10680 15807 3869
13218 3869 12943 32743 9997 20054 36521 34943 17827 10051 -1366 20309 29610 -996 38205
13205 38205 56977 29550 36040 28787 22427 -28728 -39137 -12420 10339 -29138 -29407 -2120 33108
13192C3108p420l199Q119L6537K0961M8628Q2324N3460Q3067J54710K08714L07855
13180A026864L68468L02377R5472j64465l95217l71364k46158j33478q8150l6881
13170C57468j9065l8067l8695l2376l527l3431k9505j1818j0505m811k1048Pk190
13157A12437l7590q141N487R099j5931l0054k9669J4083l392J4823p557J541k1093
13144D043J2082J6008m048P508K3308o63Q140k5551k6624l1812k715K2353L9437
13131D1466J5382j2224r343p293k6333K3329L9287l6691j1390J785k5413O10M1298
13118C4470J3087o254K384k6862j6437j9128j4155J401M7558K2555o685K5290
13106E7224O204j0838k2609R355n523j7609r003m460J6719K7494j1903m493K2490
$$ plain form
13192 33108 25688 22489 30608 67145 88106 136734 219058 272518 355585 510295 719009 1026864
13180 1026864 1395332 1697709 1793181 1628716 1233499 862135 615977 482499 394349 357468
13170 357468 338403 300336 261641 229265 225738 192307 162802 150984 140479 135668 114620 114627 112437
13157 112437 74847 66706 72193 81292 65361 35307 5638 19721 16329 31152 23595 25136 4043
13144 4043 16125 32133 28085 35593 58901 58238 66378 40827 14203 -17609 -20324 2029 41466
13131 41466 56848 44624 35281 27988 1655 24984 64271 27580 16190 17975 -7438 -6828 34470
13118 34470 47557 41303 43687 16825 388 -18740 -32895 -31494 16064 38619 31934 57224
13106 57224 63428 52590 29981 39336 33813 16204 7201 2741 19460 46954 35051 30558 53048
13093E3048P306J6583L945l1367l2754L283j7078l1333L886J6681J7965o28k6804
13080a7267k2077P455J7106K2141M629k2372k1415J1145K7741l68n104J1333K9708
13067D2655j1859N132j9095j0009j0066J0146J8688r181p493p159L5720K216j7496
13054B2199r551N973L219J914k7070J0434j860j4854L0653n947N152N87j6299
13041D550j3796K7391j5243J3639j8486M563L7360j5231j6632N87J9509j2167
13029A6044k1199k1651l711M666n131J9435L2717L3850J805L605m8120q063Q229
13016A2476m4087k7291K4J5184K6170J1467K0708m459k3388j9281n695J8429L4634
13003A4891Q622j3517q477J0894J2183j0829l076l1017n47J0496P1j647n149p459
$$ plain form
13093 53048 60354 76937 80882 49515 16761 20044 2966 -28367 -24481 -7800 10165 9537 -17267
13080 -17267 -39344 -31889 -14783 7358 11987 -10385 -31800 -20655 7086 6718 1614 12947 42655
13067 42655 30796 35928 16833 6824 -3242 6904 25592 16411 8918 1759 37479 39695 22199
13054 22199 12648 18621 21840 23754 -3316 7118 5258 -9596 21057 15110 20262 20849 4550
13041 4550 -9246 18145 2902 16541 -1945 2618 39978 24747 8115 8702 28211 16044
13029 16044 -5155 -26806 -30517 -25851 -30982 -11547 21170 55020 56825 60430 12310 4247 12476
13016 12476 -31611 -58902 -58878 -43694 -17524 -6057 14651 10192 -13196 -32477 -38172 -19743 14891
13003 14891 23513 9996 1519 12413 24596 13767 10691 -20326 -20873 -10377 -10306 -11953 -17102 -24561
12989b4561K4766K9717j1835l3700M979L1283Q692l0034R376L7114p294k942L8717
12976G4278K4314j4795l7761L6355P4544K8985K9537k5652k3319m9575l9249k6503
12964E1159J6544L9180j129k5515k1485j1297k1128p457j7383L5544n856J6200
12952D7377K6211J2294N980j9285J2064j6019j7181l8014l0409M573K036K0319
12940I946J0848m8896L03L5149Q683J7070l36J762N839L955K8003j0387j4146
12927D7793J3544j0545Q309O044M556n7320k4567J8002J8665j4605l6933k8096
12915e5153L5196M2258J09K0573l0323J921K3401L3572N066J3354p27j8712k7985
12902D2550k4627O648L871R37l2371j5832K2931k5000j2866K3852J4381p238p813
$$ plain form
12989 -24561 205 29922 18087 -15613 -10634 20649 29341 -693 8683 45797 38503 35561 74278
12976 74278 98592 83797 46036 82391 156935 185920 215457 189805 166486 116911 77662 51159
12964 51159 67703 106883 105754 80239 58754 47457 26329 18872 1489 37033 31177 47377
12952 47377 73588 85882 91862 72577 84641 68622 51441 13427 -16982 -12409 -10373 9946
12940 9946 20794 -28102 -27799 7350 16033 33103 32767 34529 40368 44323 72326 61939 47793
12927 47793 61337 50792 59101 65145 69701 12381 -12186 5816 24481 9876 -27057 -55153
12915 -55153 -19957 22301 22410 42983 12660 14581 37982 71554 76620 89974 89247 70535 42550
12902 42550 17923 24571 28442 29379 -2992 -18824 4107 -20893 -33759 -9907 4474 -2764 -10577
12889a0577m20L757K1830p383J4877P496l0691l0465j786p76O1113K3902l0563
12876B0314j6353J5252R592k0160l2275K0958M1027M8380K6438l75J1383K4484
12864A48665P062k5612j1369l9566j997J5633O696n255l132K1191M3324k6108
12852A29532l845J676j5109J6666N1754M3379K511p753R336J0285O8804N0736
12840C57972l6623o8738n0107J6335j6423l5184n3370k0219O025R578K7462K1667
12828A58375N939K2002Q825L6062J8270P645j1166J1709Q722j6526j2955l2248
12816B04654m2313O376K0407L619J9884J018J1499R829j5271j4583j4685K615
12804A93049j0247r546K0843K9536n532p672J7299K3419J6890l532j8530k7870
$$ plain form
12889 -10577 -10997 -7240 14590 7207 22084 29580 -1111 -31576 -33362 -34138 26975 50877 20314
12876 20314 3961 19213 28805 8645 -23630 -2672 38355 86735 113173 112798 124181 148665
12864 148665 155727 130115 118746 79180 77183 92816 99512 94257 91125 112316 155640 129532
12852 129532 125687 127363 112254 128920 180674 224053 226564 218811 228147 238432 307236 357972
12840 357972 321349 252611 202504 218839 202416 167232 113862 93643 99668 109246 136708 158375
12828 158375 164314 186316 195141 231203 249473 257118 245952 257661 266383 249857 236902 204654
12816 204654 162341 168717 189124 192743 212627 213645 225144 234973 219702 205119 190434 193049
12804 193049 182802 173256 194099 223635 218103 210431 227730 251149 268039 264507 245977 218107
12792B18107m574P732J9400J0747k229o682L0672L6876J0805O392L1009L0302
12780C88557K3719N0131O0463L2297R5669R4206J44536K44669L39719M22884M54972
12769B351822L10807J5963l57337m89093l14951j49298n2290m0216o182k3859
12759A245366m1153n0425l3753L9043O1177O2130L9362J2034Q6143J17704R2056
12748A629684K6953p282j8872O9155J10248J01535J34745J70245K02418K93632
12738B712461L47265M04600M03639N05054O20171P07691P59277R00630J184596
12729H545384J428954J631751J839203K201492K985478M505627O966951J0822173
12721D0927013J7160671K7347327M2190150N9948697P1882772O1622478K3956175
$$ plain form
12792 218107 213533 221265 240665 251412 249183 242501 273173 310049 320854 327246 358255 388557
12780 388557 412276 462407 522870 555167 650836 745042 889578 1134247 1473966 1896850 2351822
12769 2351822 2662629 2678592 2321255 1832162 1517211 1367913 1315623 1275407 1269225 1245366
12759 1245366 1204213 1153788 1120035 1159078 1220255 1282385 1321747 1333781 1419924 1537628 1629684
12748 1629684 1656637 1649355 1630483 1699638 1809886 1911421 2046166 2216411 2418829 2712461
12738 2712461 3059726 3464326 3867965 4373019 4993190 5700881 6460158 7360788 8545384
12729 8545384 9974338 11606089 13445292 15646784 18632262 23137889 30104840 40927013
12721 40927013 58087684 85435011 127625161 187573858 259456630 321079108 345035283
12714C45035283l6413893q3127804p0797697m1353967k3589248j4438039r273787
12707F6040848o080626n069548n586167n673190n193878m679301m219970l842569
12699B5695599l238045k622663k123480j815961j589602j385339j194433j033344
12691A0692732q89135q12291p64630o91980o12460n41790m73246m27657m07222
12682E072321l90279l75018l23153l18263l05949k45475k10676k27728k07155
12673B468625j82926j81510j82582j74452j30942j62284j17911r1837n2660n6506
12663A135015p3509n9330l2954n8491o8985q8805l4571j8661o8558p2866l9207
12652E19078J8503K1162j3364l4164j4827L113r033k2716n759m741J3218L7793
$$ plain form
12714 345035283 308621390 225493586 154695889 113341922 89752674 75314635 66040848
12707 66040848 59960222 54890674 49304507 43631317 38437439 33758138 29538168 25695599
12699 25695599 22457554 19834891 17711411 15895450 14305848 12920509 11726076 10692732
12691 10692732 9803597 8991306 8226676 7534696 6922236 6380446 5907200 5479543 5072321
12682 5072321 4682042 4307024 3983871 3665608 3359659 3114184 2903508 2675780 2468625
12673 2468625 2285699 2104189 1921607 1747155 1616213 1453929 1336018 1244181 1191521 1135015
12663 1135015 1061506 1002176 969222 910731 841746 752941 718370 699709 631151 558285 519078
12652 519078 537581 558743 545379 511215 496388 499501 490468 467752 461993 457252 470470 508263
12640E08263l6397o2152k9360l810o044P893r293Q184J8672J6881k8069n044p950
12627C71774j4964J5706Q633j8590k7549k7299J0681R795J0493J633m705j0820
12615C24788j199J4057J2589m5076n7957k0355o47J7726K4726L1948m682L175
12603B99093k53r165M883p240l1026k646k1617p42L9543K3496K6267K0045j6431
12590C24207l7686j0967j1007m4309n0116k7171j8636m2797J4443K7901K3108
12579A46970J683M5523J4932l5610k6948o240L307J503j2067j6689k1349J3181
12567A08196M5885J7417r24k7053p474L918j4418M3205L1318j2507o096k7157
12555A54310k1261J7875P543j4372J556J3441m9989l188K0145Q194j1641r480
$$ plain form
12640 508263 471866 409714 380354 376544 370500 378393 369100 377284 395956 412837 384768 379724 371774
12627 371774 356810 372516 381149 362559 335010 307711 318392 328187 338680 340313 335608 324788
12615 324788 323589 337646 350235 305159 247202 226847 226200 243926 268652 300600 295918 299093
12603 299093 298840 289675 294558 287318 256292 253646 232029 231287 270830 294326 320593 340638 324207
12590 324207 286521 275554 264547 220238 170122 142951 124315 81518 95961 123862 146970
12579 146970 148653 194176 209108 173498 146550 140310 143617 145120 133053 116364 95015 108196
12567 108196 154081 171498 170574 143521 136047 139965 125547 168752 200070 187563 181467 154310
12555 154310 133049 150924 158467 144095 145651 159092 109103 105915 126060 134254 122613 113133
12543A13133j1767J8315L2337m6k8621n035J2581K6092Q465p413l9940j373j138
12530A15590l5665j3045j8164k1473m2493r233K6431L9693J3347J6374K4765j1850
12518H4277O023L0299R332m761J6859m101k4590j5506L5831K0767K265n5157m3714
12505E7824k2598j1339J5526K153r487L141K2192K1584K6113m0779l6253J6214
12493D4291J7363L485j2078J927l616Q459K1549Q213l0093k7988o040N3514J2510
12480I1496j1703k0766m497J0015j716o399J5654J9654r054M139K650n187K388
12467H6674L231q083j2152P999L144j127J3817J1626J3408m1351p950j786o94
12454F6756k4148q206K7407P452k4064q403Q743K2049J9362j5889j0763J6978
$$ plain form
12543 113133 101366 119681 152018 151972 123351 118316 130897 156989 165454 158041 118101 116728 115590
12530 115590 79925 66880 48716 27243 -15250 -24483 1948 41641 54988 71362 96127 84277
12518 84277 90300 120599 129931 125170 142029 137928 113338 97832 133663 154430 156695 101538 57824
12505 57824 35226 23887 39413 41566 32079 35220 57412 78996 105109 64330 28077 44291
12493 44291 61654 65139 53061 54988 51372 59831 81380 89593 59500 31512 25472 78986 91496
12480 91496 79793 59027 54530 64545 62829 56430 72084 91738 82684 86823 89473 84286 86674
12467 86674 89905 81822 69670 77669 80813 79686 93503 105129 118537 77186 69236 67450 66756
12454 66756 42608 34402 61809 69261 45197 36794 45537 67586 86948 71059 60296 77274
12442G7274r258J8749L0127n065k4494r99n703J31l260j9707k7353k8527J347
12429C262L0165K7251l5181l3540j1743O508J4968Q383K9803J9785k426j0611
12417D6624j0596K1637j2350l5206q20J232J7612L993j0729j8128j6784R621J1390
12404G496L3731K6301J6876P525N696m050k4455j8621n931P644J5681j325o483
12391F0085l330q289o572k6189q77L2903K7042p341j4900j4633j5431j5811J6030
12378B2687P607n670p090Q482m4120J3739p34J4064L6758J286k664j0015m2490
12365h160j6459r88L3692K7360j9095j0104L963j916j2243L759n557P8l444O187
12351b927O851Q140K5625J8855j9952o72l3868m766K4897m510J4400j108p252
$$ plain form
12442 77274 68016 86765 116892 111827 87333 86334 80631 80762 77502 57795 30442 1915 3262
12429 3262 33427 60678 25497 -8043 -19786 -13278 1690 10073 39876 59661 57235 46624
12417 46624 36028 57665 45315 10109 9289 10521 28133 32126 21397 3269 -13515 -3894 7496
12404 7496 41227 67528 84404 91929 97625 93575 69120 50499 44568 52212 67893 66568 60085
12391 60085 56755 48466 41894 15705 14828 47731 74773 67432 52532 37899 22468 6657 22687
12378 22687 30294 24624 17534 26016 -18104 -4365 -5099 8965 45723 47009 44345 34330 -8160
12365 -8160 -24619 -25607 8085 35445 16350 6246 10209 8293 -3950 -191 -5748 -5670 -9114 -2927
12351 -2927 3924 12064 37689 56544 36592 35920 2052 -2714 22183 17673 32073 30965 23713
12338B3713j628J6971J3584K4823k652k8858k2287j0813J0041J3088j5082m3130
12326b2230j137N4843N0636n873r237j0894r081k0075K206k1454l2K8878L0694
12313F7244J761k237j725j1548k4035l076o699M502k0700R09N637J0714J080K6906
12299D8733R816J511j8257k246J6197M2688L7486k1760k9915j2389M370q223m4041
12286B3970l7530l467J0343O030J0212J0785j6451Q454J4329K2351m835J3632
12274E7823m732P911Q208j3303k832Q112q718l205J626J3961O720l5442J344j367
12260C6106k7444n348L7355N1736L8134j1270k7803M5141M0649O4111R9918J60783
12248E02068K35528L24927L74653K98736P2771k02597m35485l50153k28758j12213
$$ plain form
12338 23713 22085 39056 52640 77463 74811 45953 23666 12853 22894 35982 20900 -22230
12326 -22230 -23367 31476 82112 76239 67002 56108 47027 26952 29158 7704 7672 36550 67244
12313 67244 69005 66768 65043 53495 29460 26384 19685 24187 3487 4396 10033 20747 21827 48733
12299 48733 58549 60060 41803 39557 55754 98442 135928 114168 84253 71864 76234 68011 23970
12286 23970 -13560 -17027 -6684 -654 9558 20343 3892 12346 26675 49026 44191 57823
12274 57823 53091 61002 69210 55907 53075 61187 52469 49264 50890 64851 71571 36129 37473 36106
12260 36106 8662 3314 40669 92405 130539 119269 91466 136607 177256 241367 341285 502068
12248 502068 737596 1062523 1437176 1735912 1808683 1606086 1170601 820448 591690 479477
12238D79477p0034m4143k4544q436j0624k0132n8581k9002m5976m2291L847k8834
12226A00727k0723k8631k0181j1972L858j2859p495L5357P229k9559l86l099J1589
12213B3855k6197j1790K9104j8161K6344K5267k2947J5152M325P800l885j6931
12201C1936k1918j4940J3680j766j2104j4812J9555J0904l392M090R730J8075
12189C9038n284K3909J3748k3880l3744m48j4684k2950k0456j7041K9413K0179
12177a2200Q449J8203l0754l0843m169Q15j0926j7547j39K0250J2267L4747L0961
12164A9114j8673j7016j7705J1373L7695J9861j9983J4730r822O42J4005l4386
12152a65J603Q450J363j7411j2232Q510j1109l0686J1872J6873L818K3606J177
$$ plain form
12238 479477 409443 365300 340756 332320 321696 301564 242983 213981 168005 125714 129561 100727
12226 100727 80004 51373 31192 19220 23078 10219 2724 38081 45310 15751 15365 12266 23855
12213 23855 -2342 -14132 14972 -3189 23155 48422 25475 40627 44952 52752 48867 31936
12201 31936 10018 -4922 8758 6992 -5112 -19924 -369 10535 7143 11233 20963 39038
12189 39038 33754 57663 71411 47531 13787 13339 -1345 -24295 -44751 -61792 -32379 -12200
12177 -12200 -3751 14452 -16302 -47145 -51314 -50499 -61425 -78972 -79111 -58861 -46594 -11847 19114
12164 19114 441 -16575 -34280 -22907 14788 34649 14666 29396 19574 20216 34221 -165
12152 -165 1438 9888 11251 -6160 -18392 -9882 -20991 -51677 -39805 -22932 -19114 4492 5669
12139E669R679K9133J1217k6178k3025j8784L016J5228m094K6542q520m0031j7803
12126c7951K9676L0922J8287K180k3377Q093p027N596O525K5536K776j6770j6421
12113B8045O332r835q661k712j9330k5813L4279k33q834J7122J366K2905m697
12100B9934j1493J6560q719l0691j0959J2753J9958Q44j9634k7766J1840r286
12088b6659j9238q880j4692J0615J5939K9808K0526J2688m365O602m789K811k3728
12075c362P187j347n207j2864O136j7810m603L2767Q61M983Q932N269j1592J835
12061A1185P065q213k2394l3342m3379L3513J5583j3322K5686M129J8155m225
12049i559J5342j8784o63N333k864M2094L2320l3721l8098K375R503j6895R256
$$ plain form
12139 5669 15348 44481 55698 29520 6495 -12289 -9273 5955 1861 28403 19883 -20148 -37951
12126 -37951 -8275 22647 40934 43114 19737 27830 20803 26399 32924 58460 61236 44466 28045
12113 28045 34377 24542 15881 13169 -6161 -31974 2305 2072 -6762 10360 11726 34631 29934
12100 29934 18441 35001 26282 -4409 -15368 -2615 17343 18187 -1447 -29213 -17373 -26659
12088 -26659 -45897 -54777 -69469 -58854 -42915 -13107 7419 20107 15742 22344 17555 20366 -3362
12075 -3362 3825 2478 -2729 -15593 -9457 -27267 -31870 897 1758 6741 15673 20942 9350 11185
12061 11185 18250 10037 -12357 -45699 -89078 -55565 -39982 -53304 -27618 -23489 -5334 -9559
12049 -9559 5783 -13001 -13664 -8331 -11195 30899 63219 29498 -8600 -6225 3278 -13617 -4361
12036d361K155m084L4896j4992Q658N213k4789o7774j4384L0329K3385L089j1673
12023c4332J3339L7841p909r482L673J7601O325K5039j1943k7466k1610o649J7257
12010A684l823J9946L8011j8788j1867j503Q46O992j8538j8126O841J445l05M207
11996G022Q0j2550n117J104j5972R890r328j8053J7495J2017J4258j3798O847
11983f105J9528J2467J4509j5170j3261k637N820j8429m3360l969J6132K5543
11971h932j3092k9813K1796K0851J507p746l0478k0196L8905M8914J4906K859
11959C9481l5584k9983K0273j9350k534K6101M6502J1189n042j9098p524K542
11947B6973R245L654j6471l9731l1359J0106R921k4732m021P047L4231J1806j2148
$$ plain form
12036 -4361 -2206 -6290 28606 13614 22272 27485 2696 -65078 -79462 -49133 -25748 -22659 -34332
12023 -34332 -20993 16848 8939 -543 3130 20731 27056 52095 40152 12686 -8924 -15573 1684
12010 1684 -2139 17807 55818 37030 25163 23660 24506 31498 12960 -5166 1675 3120 2815 7022
11996 7022 7102 -5448 -10565 -9461 -25433 -15543 -24871 -42924 -25429 -13412 846 -12952 -6105
11983 -6105 13423 25890 40399 25229 11968 9331 15151 -3278 -46638 -50607 -34475 -8932
11971 -8932 -22024 -51837 -30041 -9190 -7683 -15429 -45907 -66103 -27198 21716 36622 39481
11959 39481 3897 -26086 -5813 -25163 -27697 -1596 44906 56095 51053 31955 24431 26973
11947 26973 36218 39872 23401 -16330 -47689 -37583 -27662 -52394 -56415 -49368 -15137 -3331 -15479
11934a5479Q975J4801M943j317P307Q39m3726q56J8904p669j0741j1167K9498
11921e688K0353K3086L8036l2555k4762j5004k2631m969J8598q312O255m428p558
11908a9579j5202l499K8814j4587j3479K3989K6342O822k944k3346j9075k059
11896b7803k2108J0568R489K892K7325L3936K3903j1815k8963j8474k804M304
11884D50K2035n672l4203K583L6084R567k1775k4351J0539L5667k654j8445L212
11871A3037q003J5224Q897j8562J5026j9131j0649O159l016k858J1259J7240q097
11858A6526j4313n267n117L2865M2064K0432q424m9133k4758N932N118j068k4395
11845i538P936Q356J7290J5219j3388j1093j132M081q255K477K7072O747m680
$$ plain form
11934 -15479 -6504 8297 13240 11923 19230 20069 -23657 -24513 -5609 -13278 -24019 -35186 -5688
11921 -5688 14665 37751 75787 43232 18470 3466 -19165 -24134 -5536 -13848 -7593 -12021 -19579
11908 -19579 -34781 -38280 -9466 -24053 -37532 -13543 12799 19621 16677 -6669 -25744 -27803
11896 -27803 -49911 -39343 -29854 -26962 363 34299 58202 46387 17424 -1050 -3854 450
11884 450 22485 16813 -17390 -14807 21277 30844 9069 -15282 -4743 30924 28270 9825 13037
11871 13037 5034 20258 29155 10593 25619 6488 -4161 1998 -1018 -3876 7383 24623 16526
11858 16526 2213 -3054 -8171 24694 66758 87190 78766 29633 4875 10807 15925 14857 -9538
11845 -9538 -1602 6754 24044 39263 25875 14782 13650 17731 9476 11953 39025 45772 41092
11832D1092n0533k3010J942j2211k773n872J822J3326K9572L1491m3158m8928
11820f7240K3462K102K0541J5488j883k176K0718m19M350j5680J3377J1579q951
11807A5268j6052r069M91L4718K0969j3829k5349l9255L5974K9464k1454k2320
11795a0444L1051O385j1621j7601n991M2730P55J3983j263k0210j5502K1710K2562
11782E6544L5054k1623j5787n638l7673k8216l4357K7887K7422j5104P486K0849
11770A6844K2051j925J0951j4630m0963m461J6490k7315r39J9097K7591q729P530
11757B1592o0985J5009K3543l987m7177j4107J3447P61K2105J779m923J6728J6269
11744E4L64K9214p534k1885m738K103K7747l267j0173j8538k1159Q824R452k047
$$ plain form
11832 41092 -9441 -32451 -30509 -42720 -45493 -51365 -49543 -36217 -6645 24846 -18312 -67240
11820 -67240 -43778 -41676 -21135 -5647 -7530 -9706 11012 10593 14943 -737 12640 24219 15268
11807 15268 -784 -9853 -9362 25356 46325 32496 7147 -32108 3866 33330 11876 -10444
11795 -10444 20607 26992 15371 -2230 -8221 34509 35264 49247 47984 27774 12272 33982 56544
11782 56544 91598 69975 54188 48550 10877 -17339 -51696 -23809 3613 -11491 -4005 16844
11770 16844 38895 36970 47921 33291 -7672 -12133 4357 -22958 -23897 -4800 22791 14062 21592
11757 21592 -39393 -24384 -841 -4828 -52005 -66112 -52665 -51904 -29799 -28020 -32943 -16215 54
11744 54 418 29632 22098 213 -4525 -2422 25325 22058 11885 -6653 -27812 -18988 -9536 -11583
11730a1583N687O58j3953n899N948J3398l312n872R973J5240k4944j7531j864
11717c4054K242m067q425P626J5543M39j4772L200M930m320j810L0099L1252J7199
11703D5082j7178L612j8304j6374J1365r378l406K761j2060n942q882M976K2370
11690a358M017Q372q678K700m088j2712j1408k9551M1107M227j874J4493j0006
11677d759k9554J5143M178k9937K292K0790q478n440l558l278J3253M7186j1405
11664F433k5037J4383J0413n9163K034M4067L4009L320k837j4778k6802K480J7757
11651F279j4813K5493n525l2503K9470R761q830j5751K0562o674l2898k1668o937
11638e4034K0819K1626n164K0787L585Q20l4511j259j1199j4116J3285L0262J980
$$ plain form
11730 -11583 -5896 -5238 -19191 -25090 -19142 -5744 -9056 -14928 -4955 10285 -14659 -32190 -34054
11717 -34054 -31812 -35879 -44304 -36678 -21135 -20696 -35468 -32268 -27338 -31658 -33468 -3369 27883 45082
11703 45082 27904 31516 13212 -3162 8203 -1175 -4581 -1820 -13880 -19822 -28704 -23728 -1358
11690 -1358 2659 11031 2353 5053 965 -11747 -23155 -52706 -11599 -7372 -9246 5247 -4759
11677 -4759 -34313 -19170 -14992 -44929 -42637 -21847 -30325 -35765 -39323 -42601 -29348 17838 6433
11664 6433 -18604 -4221 6192 -52971 -50937 -6870 27139 30459 27622 12844 -13958 -11478 6279
11651 6279 -8534 16959 11434 -21069 8401 18162 9332 -6419 14143 7469 -25429 -47097 -54034
11638 -54034 -33215 -11589 -16753 4034 7619 8439 -26072 -27331 -38530 -52646 -39361 -9099 -7119
11625g119N101J4224J7600J7270j0988l1691J4174L968l9487L6486L904l1165
11613g723r906Q710o059P639K6555J2883n1797k6927K348J7626L3261l7269l5366
11600f6025J2131j471K8534N0621J5274j5718m0632n273q023j0798L3064J3370
11588E054k9086k7552J2261R771L9775J2096P973l132j2107L696k7690j4559j8127
11575d1627J7256K4389Q280k4453J465q66L0582K5423j026k1704n379O103j5554
11562B889n6839K6749J3879m153J902M1751J7004j9742n4836J0258L9466l120
11550A5208K271J0306p211l7983l4594M0451M8668K3730o355J2653J8474J32k8328
11537E7422m5946m907K8662r210k0000k1173o23k980N262J2664k1246j5294j6385
$$ plain form
11625 -7119 -2018 12206 29806 47076 36088 4397 18571 22539 -16948 19538 23442 -7723
11613 -7723 -17629 -8919 -14978 -7339 19216 32099 -19698 -46625 -44277 -26651 6610 -30659 -66025
11600 -66025 -53894 -55365 -26831 23790 39064 23346 -17286 -22559 -30582 -41380 -8316 5054
11588 5054 -24032 -51584 -39323 -29552 10223 22319 30292 27160 15053 18749 -8941 -23500 -41627
11575 -41627 -24371 18 8298 -16155 -14690 -15556 15026 40449 39423 17719 12340 18443 2889
11562 2889 -53950 -27201 -13322 -17475 -15573 26178 43182 23440 -31396 -21138 18328 15208
11550 15208 17479 27785 20574 -17409 -52003 -11552 37116 60846 54491 67144 85618 85750 57422
11537 57422 11476 6569 35231 26021 6021 -15152 -15775 -18755 -13493 -829 -22075 -37369 -53754
11524e3754j894L960o507L8298M3424j9517j7437j2436J7124L2511j5332j9617
11512a1177P22L0307j0737k7758Q495K2449J782O002J0330l621q429R814j423
11499B6756j5366r309o903n19P355Q644J3511J1105m75j8592k0253l1158j6468
11486e1672J7683l76J6660K7558K0823j3664R196M044R94j4098N45k3828k8482
11473c4617o615J516K3679K8701L1685q058n1511j1356K4741L9477j2074l8276
11461a2708l0679J9564P962K4367L9299J4545o363j7437j9043j1623K5532J9867
11449E3283l8021j4924J8535J4646q101m1216j9257K0277q848K1354M4524K4384
11437F6636k1487n7941j24n372l944J4476o190Q332K9254K291o408l428l7730
$$ plain form
11524 -53754 -55648 -51688 -58195 -19897 23527 4010 -13427 -25863 -8739 23772 8440 -11177
11512 -11177 -10455 19852 9115 -18643 -10148 12301 14083 20085 30415 26794 18365 28179 26756
11499 26756 11390 2081 -4822 -5341 2014 10658 24169 35274 34799 16207 -4046 -35204 -51672
11486 -51672 -33989 -34365 -17705 9853 30676 17012 26208 30252 31246 17148 17693 -6135 -34617
11473 -34617 -41232 -39716 -16037 12664 44349 36291 -15220 -26576 -1835 37642 25568 -12708
11461 -12708 -43387 -23823 -15861 8506 47805 62350 55987 38550 19507 7884 33416 53283
11449 53283 15262 338 18873 33519 25418 -15798 -35055 -14778 -23626 -2272 42252 66636
11437 66636 45149 -12792 -12916 -18288 -22232 -7756 -13946 -5614 23640 25931 19523 16095 -21635
11424b1635l1066J5494J4439R946J2735k2601K15r372R820J6504n976l0393K614
11411c9276R892J298K2342J2299j5521k3408m985L7986M3848o720j0375k0740
11399F640j7895J9219L0492j6783k4196l5382K3809J5607K733N142K400q201k2367
11386a8782n268j6908m593O478J3724n412k0096K2219k11j5086r76R267m760L3448
11372f956M600K7080j52o930p827N784j5233P892n403r915P676n984k4895P758
11358b2505Q86j0350J3034j7388k3377j8633J9226M5950J2144j1824K0917J62
11346H242M643L37P744k921j8277J2454j6380k8415p509n509K6341K5892K0236
11333B6878M7j6560J424K7409K2803k3644j749r494m6678k8225l5154R751K7897
$$ plain form
11424 -21635 -52701 -37207 -22768 -12822 -87 -22688 -22473 -31845 -22025 -5521 -11497 -41890 -39276
11411 -39276 -29384 -28086 -5744 6555 -8966 -32374 -37359 627 44475 37755 27380 6640
11399 6640 -11255 7964 38456 21673 -2523 -37905 -14096 1511 4244 9386 11786 3585 -18782
11386 -18782 -24050 -40958 -45551 -39073 -25349 -30761 -50857 -28638 -28849 -43935 -44911 -35644 -40404 -6956
11372 -6956 -2356 24724 24572 17642 9815 15599 366 8258 2855 -7060 616 -5368 -30263 -22505
11358 -22505 -21619 -31969 -18935 -36323 -59700 -78333 -59107 -13157 -1013 -12837 8080 8242
11346 8242 12885 13222 20966 18045 -232 12222 -4158 -32573 -40082 -45591 -19250 6642 26878
11333 26878 26925 10365 11789 39198 62001 38357 36608 27114 -19564 -47789 -82943 -73192 -45295
11320d5295L959J3967J9296J5383j4527k9045L0653J9874j2168k7295j2867J4232
11308b3833j636N050o400k904K0164K8406l3045j0904K6329r697q738k0355k951
11295d0514K5034M5686n643m9240j7010L3112K2770j3479K0292l507j6020K878
11283D359L879K67N1608R492l8556l1672j2698J465J5192k0790m42R700n100q508
11269b1804J1029k1448j4457K6098P188j9508J307K8400K0643M62K106j6387m468
11256h39K2886j8038n865j4031j0430j716N852n339j4183r11N406J0201J0392
11243a6615j8429j0951L0360j222j1867K9604n555n158J9067j4463n275R595J1387
11230A0478J1884J7842O172j5739j5721r839k7400j3483j8324J8809K6286K1236
$$ plain form
11320 -45295 -41336 -27369 -8073 7310 -7217 -36262 -5609 14265 2097 -25198 -38065 -23833
11308 -23833 -25469 -20419 -26819 -29723 -9559 18847 -14198 -25102 1227 -8470 -17208 -37563 -40514
11295 -40514 -15480 30206 24563 -24677 -41687 -8575 14195 716 21008 17501 1481 4359
11283 4359 8238 8505 60113 69605 31049 -623 -13321 -11856 3336 -17454 -17896 -8196 -13296 -21804
11269 -21804 -10775 -32223 -46680 -20582 -13394 -32902 -31595 -3195 17448 17910 20016 3629 -839
11256 -839 22047 4009 -1856 -15887 -26317 -28033 -22181 -27520 -41703 -42614 -37208 -27007 -16615
11243 -16615 -35044 -45995 -15635 -16857 -28724 880 -4675 -9833 9234 -5229 -10504 -909 10478
11230 10478 22362 40204 46376 30637 14916 5077 -22323 -35806 -54130 -35321 -9035 12201
11218A2201K1028j1199n653J1520j7311K1433j3062l8330J4304K7405O472J9559
11206D8367J3785m7409k266j6647k1725q212k3523J735p391K7765K5297O38O22
11193h964r023K1910J6802K5334j4566p101K4047j472R356k0685j7718j1525j3770
11180g375j260n735J982K1913j5112r423Q515j0022J4189j801J1054j9270J7433
11167E088j249n4049l0817K0748M4778j922l449J5363k1533j3514J688N784J0212
11154b2872O868n367M311J8546K5174J7577o957l5974k179l672k2557j5734L3303
11141i533O182j767J5410N882k5438J1202J3328k9762O324M585k0179k5879j0824
11128f0469P178K4736J8833o723m003K1797L7122K6628K427j8034m634n615J4242
$$ plain form
11218 12201 33229 22030 16377 27897 10586 32019 18957 -19373 -5069 22336 28808 48367
11206 48367 62152 14743 12477 -4170 -25895 -34107 -57630 -55895 -63286 -35521 -10224 -9586 -8964
11193 -8964 -17987 3923 20725 46059 31493 24392 48439 46967 56323 35638 17920 6395 -7375
11180 -7375 -8635 -14370 -12388 9525 -5587 -15010 -6495 -16517 -2328 -4129 6925 -12345 5088
11167 5088 3839 -50210 -81027 -60279 -15501 -17423 -20872 -5509 -27042 -40556 -38868 -33084 -22872
11154 -22872 -16004 -21371 -17060 1486 26660 44237 37280 1306 -873 -4545 -27102 -42836 -9533
11141 -9533 -3351 -5118 10292 16174 -9264 1938 15266 -14496 -8172 -3587 -23766 -49645 -60469
11128 -60469 -53291 -28555 -9722 -16445 -20448 1349 38471 65099 67526 49492 44858 39243 53485
11115E3485l230n9034j1423L6590J814N023k5525k4460k9259M091K0235K8219
11103c474N555M47q791k9366J2223M463J0565j0430K3319K0265M0197j3535j5451
11090C5987M103j7339k2833p319O796o131j8870l92j8286J7186O569J8620j2134
11077a4043o493L0575L2128M383k5551k3733R572j107q96J2670L082K0896j91
11064D1292j4362K2697n7159k6805K3660Q072K2131m044L456M3798p277j6823
11052C8636j4808l3954N520K2247j1087k1668M8921K7143l8105n2948L37q747
11040c8513K7542J6714j5907j6635N987L732n750K353m961k503J2682K3863j8395
11027i791l1185J8663R124p926n483L2034j34M773K2438o537m37j7647j2725K5714
$$ plain form
11115 53485 50255 -8779 -20202 16388 18202 23225 -2300 -26760 -56019 -51928 -31693 -3474
11103 -3474 2081 2528 -6263 -35629 -23406 -18943 -8378 -18808 4511 24776 64973 51438 35987
11090 35987 40090 22751 -82 -7401 -605 -6736 -25606 -25998 -44284 -27098 -20529 -1909 -14043
11077 -14043 -20536 10039 42167 46550 20999 -2734 6838 5731 4835 17505 20587 41483 41292
11064 41292 26930 49627 -7532 -34337 -10677 -2605 19526 15482 18938 62736 55459 38636
11052 38636 23828 -10126 -4606 17641 6554 -15114 33807 60950 22845 -30103 -29766 -38513
11040 -38513 -10971 5743 -10164 -26799 -20812 -17080 -22830 -20477 -25438 -27941 -15259 8604 -9791
11027 -9791 -40976 -22313 -13189 -21115 -26598 5436 5302 10075 32513 25976 25539 7892 -4833 20881
11013B0881M3250j155L2646Q5689R2443J33916K09713K02084J16456j9584k01533
11002G14806k36195j48762o5495n3023m4662P664j3139m6778m1997k2996l760
10991D5663m986J8246K1278r276l1414k3187j1347J5540N638m354j6446k341O859
10978I873J6442J7312q075k7210k8003O617J9836j062q711j7609k824K3233K2679
10965B2498l5001J092j6019l8490J1887M0227N9143j3063p141k1735P542l2408
10953b1468j2242M609j7215j3841o252J3424J9952k2505j7299J2633K4017J4624
10941b1563j2793j6321J74O790q296K0336L8804Q806j3042O661K2233j5657l4448
10928a8316j908R345K1228L429J8532K941j5570j6690n632J0807O436l7346j7837
$$ plain form
11013 20881 64131 62976 95622 181311 273754 407670 617383 819467 935923 916339 714806
11002 714806 478611 329849 264354 211331 166669 174333 161194 114416 72419 49423 45663
10991 45663 40677 58923 80201 70925 39511 16324 4977 20517 26155 21801 5355 3014 9873
10978 9873 26315 43627 35552 8342 -19661 -13044 6792 5730 -2981 -20590 -23414 -181 22498
10965 22498 -12503 -11411 -27430 -65920 -54033 -13806 45337 32274 25133 3398 10940 -21468
10953 -21468 -33710 -29101 -46316 -60157 -66409 -52985 -33033 -55538 -72837 -60204 -36187 -21563
10941 -21563 -34356 -50677 -50503 -43713 -52009 -31673 7131 15937 2895 9556 31789 16132 -18316
10928 -18316 -20224 -10879 10349 13778 32310 35251 19681 2991 -2641 8166 14602 -22744 -40581
10915d0581J7404P761K1676j930O764j107j5793j9833l9773q122M1817K4312N705
10902a700j6534J6917R671O422o86q536k9098j7414K937R087L2023J5190M894
10889B3173j0639m303m599k3368j0168J1264J5942K6025q895k4925L1680K500
10877B3687j4633Q042J3385N729k595l6953j9659L2431L1040l4078j8257J4291
10865B430J1792N345O174K0637J5856l0188j0269J1749R635k6036k6755q284K7866
10852I952J078o379k0707j8507j8387N164L0635j9471K3703O872k344j2423j2811
10839c3625Q554J4033j155j4310J3021J8944L7246O537J4845k6476k6914q394
10827B306o77j2849j3566j5830j2567M025J5819J8151K3170J2076j4773j2063
$$ plain form
10915 -40581 -23177 -15416 6260 4330 11094 9987 -5806 -25639 -65412 -73534 -31717 -7405 -1700
10902 -1700 -18234 -1317 8354 14776 14090 5554 -23544 -40958 -38021 -28934 3089 18279 23173
10889 23173 12534 8231 3632 -19736 -29904 -18640 -2698 23327 14432 -10493 21187 23687
10877 23687 9054 17096 30481 36210 33615 -3338 -22997 9434 40474 6396 -11861 2430
10865 2430 14222 19567 25741 46378 62234 32046 21777 33526 43161 17125 -9630 -17914 9952
10852 9952 11030 4651 -16056 -34563 -52950 -47786 -17151 -36622 -12919 -6047 -8391 -20814 -33625
10839 -33625 -25071 -11038 -12193 -26503 -13482 5462 42708 49245 64090 37614 10700 2306
10827 2306 1629 -11220 -24786 -40616 -53183 -49158 -33339 -15188 7982 20058 5285 -6778
10815f778K5042j1845k1767r355o119n860l244O379n465J3951j5722K6292K0786
10802F295p499j8339K1819M3322n373k8725l6137k2580Q803J5537j7118O471M3339
10789I815M307j2113K1467J218j3477n6169m895J1684N4855L4959j2315k9753
10777I583Q525k9537k0324n479Q887J2638J007J5662O495k5146m642K7576O191
10764A1436p255k1250R108k0207l228l402Q031J572J6870K1023r081m409K8243
10751B7451l733L242q806l1859m2280j0103L7322K2147p853J9476j3194J3978
10739E788J6490l6723n500M486J6516K216r143j323k6575r054N6996J8804J4387
10726D7365j3711l3174r318k2740J245J7515K2070l6949q729k640j6554M861R792
$$ plain form
10815 -6778 18264 6419 -15348 -24703 -30822 -36682 -39926 -33547 -39012 -25061 -40783 -14491 6295
10802 6295 -1204 -19543 2276 45598 40225 11500 -24637 -47217 -38414 -22877 -39995 -33524 9815
10789 9815 14122 2009 23476 24694 11217 -44952 -49847 -38163 16692 51651 39336 9583
10777 9583 18108 -11429 -31753 -37232 -28345 -15707 -14700 962 7457 -17689 -22331 5245 11436
10764 11436 4181 -17069 -7961 -28168 -31396 -34798 -26767 -25195 -8325 12698 3617 -792 27451
10751 27451 23718 26960 18154 -13705 -55985 -66088 -28766 -6619 -14472 5004 -8190 5788
10739 5788 22278 -14445 -19945 -15459 1057 3273 -5870 -7193 -33768 -42822 14174 32978 47365
10726 47365 33654 480 -8838 -31578 -30333 -12818 9252 -27697 -36426 -39066 -55620 -50759 -40967
10713d0967J8955r524K1407K1674j4082m547j9463M857J8176J6714p426j7088
10701a1314L0565m320j1707n181r848M290m2729J1311K3403L6151n74M715j3563
10688A1199L241j7866N201p814J2651j1204K859O100j3810K7328J5741l9905j2044
10675a8323M077n693J1707R238P217M29K6372Q581k2985k7210R745p741j4471
10662a9057j2215J2931R627k5656k9716J0725J7315j9379J9472J1207O103P618
10650a1025j1492J9011K6355j6625k8809O170m165L1161l0562l937K558J1276
10638a0084Q234J1084j3043K305n916P152j4377Q065J6071k3892l419J8783K7679
10625B8642K912J653n3082m7006K6381N479r20n462L1674N589N167j620N957j9775
$$ plain form
10713 -40967 -22012 -31536 -10129 11545 -2537 -7084 -26547 -21690 -3514 13200 5774 -11314
10701 -11314 19251 14931 3224 -1957 -11805 -7515 -50244 -38933 -15530 20621 20047 24762 11199
10688 11199 14440 -3426 1775 -6039 6612 -4592 -1733 4367 -9443 17885 33626 -6279 -18323
10675 -18323 -14246 -19939 -8232 1006 8223 8652 35024 43605 20620 -6590 3155 -4586 -19057
10662 -19057 -31272 -18341 -8714 -34370 -64086 -53361 -36046 -55425 -35953 -24746 -18643 -11025
10650 -11025 -22517 -3506 22849 6224 -22585 -16415 -20580 10581 -19981 -23918 -21360 -10084
10638 -10084 -1850 9234 -3809 -1504 -7420 -268 -14645 -6580 9491 -14401 -17820 963 28642
10625 28642 31554 33207 -19875 -66881 -40500 -35021 -35941 -41403 -9729 -4140 1027 -593 5364 -14411
10611a4411j6310N966J2792K1402L778O213p225m4822O10L140r813P413J8854
10598a2413j7923N222L1201J0107k0563l5471J2294N4458K0023m2301k1375l495
10586b0236P93J6877J7432K4122k0733j04j295R23J0643L3956j7660k2664l5059
10573a3005k6761L394L1840K9594R07k8776k7376L120K6630N873k089J0590r761
10560D180k2039K4140j209J930l85q073k0967l1906J7142L7952P896k787O7k0956
10546a5015J7582L9259k0078J7092R418o637m2006k0258m610K5079J2024K7805
10534C9655K2292j4852j8134p952R73J938J683J296l1687q877K3698J3883M22
10521B4338j4695J5155m059l219J0021m419L0358J7119l009J3878j0118K8601
$$ plain form
10611 -14411 -30721 -24755 -11963 9439 13217 19430 12205 -32617 -32007 -28867 -38680 -31267 -12413
10598 -12413 -30336 -25114 6087 16194 -4369 -39840 -27546 26912 46935 4634 -16741 -20236
10586 -20236 -19443 -2566 14866 38988 18255 18151 16856 17779 28422 62378 44718 22054 -13005
10573 -13005 -39766 -36372 -4532 25062 25969 -2807 -30183 -27063 -433 5440 3351 13941 4180
10560 4180 -17859 6281 5072 7002 6617 -1456 -22423 -54329 -37187 765 8661 5874 5941 -15015
10546 -15015 2567 41826 21748 38840 48258 41621 -385 -20643 -25253 -174 11850 39655
10534 39655 61947 47095 28961 21009 21982 23920 25603 26899 -4788 -13665 10033 23916 24338
10521 24338 9643 24798 20739 17520 27541 23122 53480 70599 67590 81468 71350 99951
10509I9951M0998K6899K2661L3261N2830O8173J14367K03443K25480K57759K74186
10498A420008J22775m7162j50110k33819k95497k31827j08060n7136m5721m6415
10488C27036m1605m1273m1225j4579n272m0533K116r368m1295j9213m215k602
10476F7972j4195j8036k182J4033K8615J5405J354j4465l2001j1188j3896K3647
10464D5063O269J0043j7591k1573m582M899j018k0608L119J5362J6494P497j401
10451D1973p20j2617M614m0596j2253K3825L8685P377q360L074J2811l0653J035
10438B8195O830j4512q432J4665j5082k957M417Q963r785J1158j4381m011K8006
10425C3074q415J8197K5450L317j8274J6082J1492o746m3478k1160J0114J3762
$$ plain form
10509 99951 140949 167848 190509 223770 276600 344773 459140 662583 888063 1145822 1420008
10498 1420008 1542783 1495621 1345511 1111692 816195 584368 476308 419172 373451 327036
10488 327036 285431 244158 202933 188354 183082 142549 144665 135297 94002 74789 70574 67972
10476 67972 53777 35741 33559 47592 76207 91612 92966 78501 46500 35312 21416 45063
10464 45063 51332 61375 43784 22211 17629 22528 21510 902 4021 19383 35877 43374 41973
10451 41973 41253 28636 33250 -7346 -19599 4226 42911 50288 41928 45002 57813 27160 28195
10438 28195 35025 20513 12081 26746 11664 8707 13124 22087 12302 23460 9079 5068 33074
10425 33074 24659 42856 68306 71623 53349 69431 80923 74177 30699 9539 19653 33415
10413C3415M513j1990j9288n563j2382n474K5565L2417J6013j2468J1184q829
10401D7113j4220p504P366J2489j0040l0648p94l8793o118P815J1713j2760J0900
10388b3481L262l789M871M1816j719j1077M431J7292j7781j8777M1661M2688j9192
10375F0205k3095k6703k1560j2246K8070O234R443J6628n549k3348l025k521o697
10362d164K9594K4962k5579m1067Q475K2936K0463r296K589K1031q221K9279L4706
10349A05708L9264K422J9437j83o853O867j1247n3209o0493k4368K2450K6793
10337F6588K1688n405r949l00o736k1648J1403k1209J9050R074L679n169l3490
10324B7576K550j640M618k4995O215K2914K6924k1220k6214m1151m00M3815R829
$$ plain form
10413 33415 37928 25938 6650 1087 -11295 -16769 8796 41213 57226 44758 55942 47113
10401 47113 32893 25389 32755 45244 35204 4556 3762 -35031 -41149 -33334 -21621 -34381 -23481
10388 -23481 -20219 -24008 -19137 22679 20960 9883 14314 31606 13825 -4952 36709 79397 60205
10375 60205 37110 10407 -11153 -23399 4671 10905 20348 36976 31427 8079 5054 2533 -4164
10362 -4164 25430 50392 24813 -16254 -7779 15157 35620 26324 28913 49944 41723 71002 105708
10349 105708 144972 147394 166831 166648 159795 166662 155415 102206 41713 17345 39795 66588
10337 66588 88276 82871 72922 72622 65886 44238 55641 34432 53482 62556 66235 61066 27576
10324 27576 30126 28486 33104 8109 14324 37238 64162 42942 16728 -24423 -24823 18992 28821
10311B8821l4413q797Q610N182K4828K4400n71l6188n1267j3994J9444j8460K8446
10298b3959J0098o652j539k8647j9668k965O702J3154N4789L1167k0672N343J6600
10285C3751K1256N802l48P29j3311N483L961R664R273k4282k9016p627k7336j7205
10271b9206R856k1011q475J3307P546M5806L3206l3441K948J0658J1556N789K1265
10258F9804P547M42m4823n134j7712n1725k003J8284j414l79J3211K2156L7923
10245D6177J2727n317j2625K050M76L4430J8076K0006p634l6990j8497Q270R468
10232G0617L418M505j183Q211K7287J9918O5229L3816q039J7672L5511K4042K7522
10219C28526J467O8544N2383k664l4472m9804J3486K7522J5155J330l9280j2769
$$ plain form
10311 28821 -5592 -14389 -5779 -597 24231 48631 48060 11872 -39395 -53389 -33945 -52405 -23959
10298 -23959 -13861 -20513 -22052 -50699 -70367 -73332 -66630 -53476 1313 32480 11808 17151 33751
10285 33751 55007 60809 60461 61190 47879 53362 57323 66987 76260 51978 22962 15335 -12001 -29206
10271 -29206 -19350 -40361 -48836 -35529 -27983 17823 51029 17588 20536 31194 42750 48539 69804
10258 69804 77351 77793 32970 27836 10124 -41601 -43604 -25320 -26734 -27113 -13902 8254 46177
10245 46177 58904 53587 40962 43012 43488 77918 95994 116000 108366 71376 52879 61149 70617
10232 70617 74035 78540 77357 85568 112855 132773 198002 231818 223779 241451 276962 301004 328526
10219 328526 329993 398537 450920 448256 413784 363980 377466 404988 420143 421473 382193 369424
10207C69424o679m4876o9799r796L1603J5958n030J66l4528k3899j5855k8612
10195A78077r582J0682n395j1224J3479K563J2291R093k6664k8696l054j1147
10183A30423J0218R43k8979j6978l037K2815J5091m8755o396L9439L4042J1266
10171A60092k665j6069K2881J3231K0533M0259K3588q136J2901K8725j6581R889
10159B88648K0021K6040K3047M1108N6161M8300L8971Q9184J95339K42957K40908
10148A310684J81786Q5084k8685p8835M0964J53382J47279O7406q7923k32111
10138A559031j94376j32703q8028k2247l3653J2511J2397K6081L2342L7200L9152
10127A247707O5106P8761N8273N0010Q2269J24918K56625K59696L38154N53595
$$ plain form
10207 369424 362745 317869 248070 238274 269877 285835 280805 280971 246443 222544 206689 178077
10195 178077 168495 179177 173782 162558 176037 178600 190891 199984 173320 144624 141570 130423
10183 130423 140641 141584 112605 95627 92590 115405 130496 81741 75345 114784 148826 160092
10171 160092 157427 141358 164239 177470 198003 238262 261850 253714 266615 295340 278759 288648
10159 288648 308669 334709 357756 398864 455025 503325 542296 631480 826819 1069776 1310684
10148 1310684 1492470 1577554 1548869 1470034 1510998 1664380 1811659 1879065 1791142 1559031
10138 1559031 1364655 1231952 1143924 1121677 1088024 1100535 1112932 1139013 1171355 1208555 1247707
10127 1247707 1312813 1391574 1449847 1499857 1582126 1707044 1963669 2223365 2561519 3115114
10117C115114P19267Q23144Q42474P25455N15916L30795K79962L38329N41323
10108H231779P82284J005875J239503J616364K253263L191364M898061P621361
10100C0839854J2032171J9027497K9218926M1959365N2315691N2549658L9085869
10093B77029031J0102931j8099570l3045759m9823368n1313692l4035920j9650523
10086H1163130j1918018q247237o475163n354925n030777m981295m557514l993111
10078C0605090l445411k875700k334097j808986j358326j193234j281427j428754
10070A4879155j418398j461268j355949j103524r08098p54610o66692n39443n13970
10061F157203m82687m24695l76403l61627l35524k95218k92165k44024j52935
$$ plain form
10117 3115114 3834381 4657525 5499999 6225454 6741370 7072165 7352127 7690456 8231779
10108 8231779 9014063 10019938 11259441 12875805 15129068 18320432 23218493 30839854
10100 30839854 42872025 61899522 91118448 133077813 185393504 237943162 277029031
10093 277029031 287131962 269032392 235986633 186163265 134849573 100813653 81163130
10086 81163130 69245112 60997875 54522712 49167787 44137010 39155715 34598201 30605090
10078 30605090 27159679 24283979 21949882 20140896 18782570 17589336 16307909 14879155
10070 14879155 13460757 11999489 10643540 9540016 8631918 7877308 7210616 6671173 6157203
10061 6157203 5674516 5249821 4873418 4511791 4176267 3881049 3588884 3344860 3191925
10052C191925p8748R682P3472J44591O3761j16632m05963n34027l69888k17143
10042A761030j54050j15621p0833o9525r2053r4171r7777r4740o9562o0350o4062
10031G78286k4395n502k6696l5180j9786k4065l4693k7524k3611l9586j6982L293
10019E03559J4467J4021O203R60l9089m3403K5226j7818k4180J7866o480k6962
10007D24370L03L887l691K2435j1092l9307J1701J2627M197j9464m230r828N026
9994C96934K5692L1543k834k9465j2177j5158k5063l3995k8540n567J6804J6643
9982C34817o396J1118L1455k0978l3100J6489K7330K479j6043j677k6803l9366
9970B79325j3917J898j641M976j0123l9207k7322j9458k3280n699l136J1286n411
$$ plain form
10052 3191925 3113177 3122859 3196331 3340922 3404683 3288051 2882088 2348061 1978173 1761030
10042 1761030 1606980 1491359 1420526 1351001 1258948 1164777 1067000 972260 902698 842348 778286
10031 778286 753891 748389 721693 686513 666727 642662 607969 580445 556834 517248 500266 503559
10019 503559 518026 532047 538250 539210 500121 456718 481944 464126 439946 457812 451332 424370
10007 424370 424673 428560 424869 447304 436212 396905 408606 421233 425430 405966 401736 391908 396934
9994 396934 422626 454169 451335 421870 409693 394535 369472 335477 306937 301370 318174 334817
9982 334817 328421 339539 370994 350016 316916 333405 360735 363214 347171 345494 318691 279325
9970 279325 265408 267306 265665 270641 260518 221311 193989 174531 151251 145552 142416 153702 148291
9957A48291j7828L7763J2630o868Q389j2832l0481j1181K0870P048j8412J5781
9945A53170K0899K2628K7603R952L051K0492j9034j5128M5349K6490j6472k8604
9933B50396j8861l0440m093J8613n73j665k1667l8978j6904j6349j2180j4779
9921I2520J8078q845J0508J5001L4466Q574j5832L3866J4332k8596j6286k6495
9909A31291j1017j5724J181R248J805j0754m3369m0669j8398J3787L7224N7010
9897A11615J0898j5165J604J5220J9526o235K3345k54j4812P739J2916j7784j9326
9884A29287K2046j43j4891r009l4036p085P753r09J7305J9961J9368j8907k2568
9871A08172r798p753j3125k8640j4148N85K6946p848l791J4201q370q050J7441
$$ plain form
9957 148291 130463 168226 180856 173988 182377 169545 139064 127883 148753 155801 137389 153170
9945 153170 174069 196697 224300 234252 237303 257795 238761 223633 268982 295472 279000 250396
9933 250396 231535 201095 197002 215615 215042 213377 191710 152732 135828 119479 107299 92520
9921 92520 110598 101753 112261 127262 161728 170302 154470 188336 202668 174072 157786 131291
9909 131291 120274 104550 105731 114979 116784 106030 62661 21992 3594 17381 54605 111615
9897 111615 122513 107348 108952 124172 143698 137463 160808 160554 145742 153481 166397 148613 129287
9884 129287 151333 151190 136299 127290 93254 86169 93922 93013 110318 130279 149647 130740 108172
9871 108172 98374 90621 77496 48856 34708 35293 62239 54391 50600 64801 56431 48381 65822
9858F5822J103L205L0688O787K7823K9991M688J5007J5322J2785M924k1819k3054
9845A73272q163j0870l6669l0224k815J2115J2399j1200k4510k4269p548J5231
9833E6749J0658R606j3790l0579K8261L4188j560j5862K8212J6836l4562j5157
9821G3000J4326J9353j1763P12K0125j0347k4598J3571K1369J5016m0669l2988
9809E7107J7665J2819j2673n804p888q629J6721N310p828j7129o0126j1381L1251
9796I415J0772K3326J1867K037M394K3383J4057r976k0189l385j6179K4795M019
9783G8336J5370r880L620N547j5002q999k749L3971J3089n307l653k8126k5009
9770E1208n0139o796O110J1162j2059K11K2559Q070L1157K2080k9202k237J7934
$$ plain form
9858 65822 66925 70130 100818 107605 135428 165419 170107 185114 200436 213221 218145 196326 173272
9845 173272 165109 154239 117570 87346 84531 96646 109045 97845 73335 49066 41518 56749
9833 56749 67407 77013 63223 32644 60905 95093 93533 77671 105883 122719 88157 73000
9821 73000 87326 106679 94916 95628 115753 105406 80808 94379 115748 130764 90095 57107
9809 57107 74772 87591 74918 69114 61226 52597 69318 74628 66800 49671 -10455 -21836 9415
9796 9415 20187 43513 55380 57417 61811 85194 99251 89275 69086 65701 49522 74317 78336
9783 78336 93706 83826 87446 92993 77991 68992 66243 100214 113303 107996 104343 76217 51208
9770 51208 1069 -5727 383 11545 -514 -303 22256 30326 61483 83563 54361 52124 70058
9757G0058K4196J4093p140Q5L526j0159j9733j8440m577N978j1834m163K6849
9744F8739K1153l521l944l4970j1333l544R459l908K877J3802j3791L952L1918
9731G6889J292k5751k2722M042J4566k0300p830K3094J492l290q744j1774k1075
9718a11P530p211l723k157K3836K7195M10J6282O569n55j6441j6817P828k5886
9704A6749k2545K4010K1361K2051Q727j2681L861L8270J4690J00r679n80L8611
9691A42945N2363M7622P2814J43152K26684K69851K61225K23140J15543k0486
9681A534853j68385k39856k64938k21564j31171q8969k6134l3779m9229m1809
9671B69019m4009j71K099j5000m8002j6854r984k3754l4119m563L3257R527k3497
$$ plain form
9757 70058 94254 108347 101207 101292 104818 94659 74926 56486 51909 57887 46053 41890 68739
9744 68739 89892 86371 82427 47457 36124 32580 42039 38131 41008 54810 41019 44971 76889
9731 76889 78181 52430 29708 33750 48316 28016 20186 43280 44772 41482 32738 20964 -111
9718 -111 7419 208 -3515 -5672 18164 45359 45769 62051 68620 68065 51624 34807 42635 16749
9704 16749 -5796 18214 39575 61626 70353 57672 61533 99803 114493 114593 104914 104334 142945
9691 142945 195308 242930 315744 458896 685580 955431 1216656 1439796 1555339 1534853
9681 1534853 1366468 1126612 861674 640110 508939 419970 393836 360057 310828 269019
9671 269019 225010 224839 226938 211938 163936 147082 137098 113344 79225 74662 107919 117446 93949
9658I3949j8J3041M703k4611j5654J7536j5822r653R801L0310J1937l2498k9507
9645E3514Q992P843k516j4990j7682R483n723q84m523q994m175K7380L8674m785
9631H1614k5349j4337P281n901j1819l4102l7135j2761K6313L5307J0185K4228
9619D3524J987j815j2147P1l4367k5554M71M0560j9745K2878J0722N148j7625
9606A4108k2030J6993K4036P318j7206k4756j1002K0394O785j5025M748K2803
9594B7166j4605j4078K849J9332Q58l4211q45M871J5720J6997J3177N109K2885
9581F5225j1141j3084l2684j4352k1574L0235J8892P104l153K1398R820J9r381
9568D7324j5000k6309j2207K1807K4313k2536n959J8322j1801j2481J8851K7020
$$ plain form
9658 93949 93931 106972 111675 87064 71410 88946 73124 63471 73272 103582 115519 83021 53514
9645 53514 62506 70349 67833 52843 35161 44644 38921 38037 33514 24520 20345 47725 86399 81614
9631 81614 56265 41928 49209 43308 31489 -2613 -39748 -52509 -26196 9111 19296 43524
9619 43524 45511 43696 31549 31620 -2747 -28301 -27830 12730 -7015 15863 26585 31733 14108
9606 14108 -7922 9071 33107 40425 23219 -1537 -12539 7855 14640 -385 4363 27166
9594 27166 12561 -1517 1332 20664 21522 -12689 -13534 -8663 7057 24054 37231 42340 65225
9581 65225 54084 41000 8316 -6036 -27610 2625 21517 28621 25468 46866 56686 56705 47324
9568 47324 32324 6015 -6192 15615 39928 17392 11433 29755 17954 5473 24324 51344
9556E1344J806k6195q957q992j9072J243L1601K5413l32J0649l865p308j1464
9543C5871j7854j7648j8898P758R27K2634O409L391J1096K0202J4105l460L225
9530F7758p963j382j715j467n641j3836l1423m927p182J1234L566k7383j0945
9517c1306N347N396J8085K2016m1J5580J2436k464p396O822J6291l2737l6397
9504h368J4279L1665J6063j8295m813K3804q07k0834j0868m922j0235q009K9446
9491B8106J928o024J2608R253n654j2665N097j577k3986k1940P668K6379K9384
9478D8577N720k6872o017O735J367k7771l0251J0755K7164k6818k004J8027r954
9465a1342j0067j961O395L3596J3602J0025J865J9939r9k3379j3105R515m735
$$ plain form
9556 51344 53150 26955 17998 9006 -10066 -8823 22778 48191 47859 58508 54643 47335 35871
9543 35871 18017 369 -18529 -10771 -9844 12790 19199 22590 33686 53888 67993 64533 67758
9530 67758 59795 58413 56698 55231 49590 35754 4331 -596 -7778 3456 7022 -20361 -31306
9517 -31306 -25959 -20563 -2478 19538 19497 35077 47513 45049 37653 44475 60766 28029 -8368
9504 -8368 5911 37576 53639 35344 30531 54335 53528 32694 21826 16904 6669 -1340 28106
9491 28106 30034 24010 36618 45871 40217 27552 32649 31072 7086 -14854 -7186 19193 48577
9478 48577 54297 27425 21408 28143 29510 1739 -28512 -17757 9407 -17411 -19415 -1388 -11342
9465 -11342 -21409 -23370 -16975 16621 30223 40248 42113 62052 61953 38574 25469 34984 30249
9452C0249o941j1005Q917P236o029N858L858R47j7831P901p706J963l1705r710
9438b3998J6349k804M314L2011J9011j7445J7445R358k1296j7196j0248j4574
9426i073L081J5266P708k478j3518j1757K8965L5139k1472k2309j7437J6440K6334
9413C4889j6945j3248l3446j8130q273o086M591J6892j429k9186R566K0759L993
9400c6053j4489j5490n434L7544L0557m2607P331L6232J9584J5301p176J4331
9388C9631J6951j7239r903j2720l3844P128K679j5659O649K5115k8544J1936K5821
9375A8001O674P627K6285m745j8269J5223O02j0730J029k4163K2544k8256P970
9362A9792L8591k2219Q690M3805l6272l2363J6380K448l1115k9773O752P6K720
$$ plain form
9452 30249 23308 12303 21220 28456 22427 28285 32143 33090 15259 23160 15454 17417 -14288 -23998
9438 -23998 -7649 -10453 -6139 25872 44883 27438 44883 54241 32945 15749 5501 -9073
9426 -9073 -5992 9274 16982 14504 986 -10771 18194 53333 31861 9552 -7885 8555 34889
9413 34889 17944 4696 -28750 -46880 -55153 -61239 -56648 -39756 -41185 -70371 -60805 -40046 -36053
9400 -36053 -50542 -66032 -71466 -33922 -3365 -45972 -38641 -2409 17175 32476 25300 39631
9388 39631 56582 39343 29440 16720 -17124 -9996 -7317 -22976 -16327 8788 -19756 -7820 18001
9375 18001 24675 32302 58587 53842 35573 50796 51398 40668 41697 17534 40078 11822 19792
9362 19792 58383 36164 44854 88659 52387 20024 36404 38852 7737 -22036 -15284 -15208 -12488
9349a2488J3520m964k2327J0237m493K8491J2006o869j1795p897Q676L23R989
9336A2409j3973k3800L822j0982R903L1338j2888k5549k3207M227L7103Q580k0188
9323b3205q552J7208J5725k60K289J8138Q307l0345r953J8532O711j0243k310
9310B042K550K045j4587K0433K5230N640J1448J9189l980k5712k4453j2302n708
9297A835j1406k771Q345P524j4257N51M0025P231L36l187k5219n963M796j2111
9283d271l1016j2311k4434j3957K0828M2002q207j3246M4602M0328p592k3685
9271I041o823J2758P862j998J2825j0212k7835j5426l1458j4149M1342K6734M4592
9258D7253L5739J8014j5309l5453k1610N411k830J2997K7117Q679K088M067m4818
$$ plain form
9349 -12488 1032 -3932 -26259 -16022 -20515 7976 19982 13113 1318 -6579 2097 2420 12409
9336 12409 -1564 -25364 -21542 -32524 -22621 8717 -4171 -29720 -52927 -48700 -11597 -3017 -23205
9323 -23205 -31757 -14549 1176 916 3205 21343 29650 -695 -10648 7884 14595 4352 2042
9310 2042 4592 6637 -7950 12483 37713 43353 54801 73990 70010 44298 19845 7543 1835
9297 1835 -9571 -12342 -3997 3527 -10730 -10179 29846 37077 37413 34226 9007 3044 7840 -4271
9283 -4271 -35287 -47598 -72032 -85989 -65161 -23159 -31366 -44612 -10 40318 32726 9041
9271 9041 2218 14976 22838 20840 33665 23453 -4382 -19808 -51266 -65415 -24073 2661 47253
9258 47253 82992 101006 85697 50244 28634 34045 31215 44212 71329 80008 82096 86163 41345
9245D1345k9286o44n912L8593K4840j5208k3254j2956M3062J1781k4054m5123
9233C184j6879N755j2319J7586J5393Q61o818J5692m423k0291J4145r381O348
9220H853L5843K0441j4915m630O517J5351p391J7990k4261l8680Q949k2390q886
9207g209J0739k5425j8447J6632L0700j2000K3624J0140n209j1842k1863K3679
9195A3519R220l401N558j5509o087J1968n681J300K3470j7736l7575j6380K7325
9182a0009M4535j7734m7405j953L9507l3387k5436J6998K1919K3542L9466j8102
9170C1941l5720o603m061j5689J6821K2374k0904J2154K3702K336M535j3613O97
9157A7970Q303J4767K9743o836j1641l288l631J2585K4479m2494l2799J1511K1740
$$ plain form
9245 41345 12059 11415 5503 44096 68936 53728 30474 17518 60580 72361 48307 3184
9233 3184 -13695 -7940 -20259 -2673 12720 13581 6763 22455 18032 -2259 11886 2505 8853
9220 8853 44696 65137 50222 45592 52109 67460 60069 78059 53798 15118 24067 1677 -7209
9207 -7209 3530 -21895 -40342 -23710 6990 -5010 18614 28754 23545 11703 -10160 13519
9195 13519 22739 19338 24896 9387 3300 15268 9587 10887 34357 16621 -20954 -37334 -10009
9182 -10009 34526 16792 -30613 -32566 6941 -26446 -51882 -34884 -12965 10577 50043 31941
9170 31941 -3779 -10382 -14443 -30132 -13311 9063 -11841 313 24015 26351 30886 17273 17970
9157 17970 26273 41040 70783 63947 52306 49018 45387 57972 82451 39957 7158 18669 40409
9144D0409N110m289L3009J4535j8465l9910k5100k2691K418M2835J2615R7L1208
9131G1781R685j2729n283j8424j0134j1876j1078Q198P551J0221m316k75L8862
9118G2183P833J492k371J974J8545J229k4056Q373J5433M2372K9676O3674O2905
9105B99262P9849J66114K53563L86486N92383R65142J458251J707590J424862
9096G333502N21998r60000k019196j576733q50894m92256l12414k13150j34587
9087A296270o0023j28803j70048j54363j13329r5673q3163p1694l8238l3334j5873
9076C31729l1551n485k4435j5284k5434N333j8510k9487j8873m959j4668m5903
9064A02473j2581j2608J1936j053Q544k581r408J662l34j2042m2170j6604K5065
$$ plain form
9144 40409 45519 41230 74239 88774 70309 30399 5299 -17392 -14974 27861 40476 40573 71781
9131 71781 81466 68737 63454 45030 34896 23020 11942 20140 27691 37912 33596 33321 72183
9118 72183 80016 81508 79137 81111 99656 100885 76829 85202 100635 143007 172683 236357 299262
9105 299262 379111 545225 798788 1185274 1777657 2742799 4201050 5908640 7333502
9096 7333502 7855500 6895500 4876304 3299571 2448677 1956421 1644007 1430857 1296270
9087 1296270 1236247 1107444 937396 783033 669704 574031 490868 419174 380936 347602 331729
9076 331729 300178 294693 270258 254974 229540 234873 216363 186876 168003 163044 148376 102473
9064 102473 89892 77284 89220 88167 96711 94130 84722 86384 86050 74008 31838 15234 40299
9051D0299J2166k4514k8338n077j3415K183J7380M563J8968L6686n41m7354k7769
9038a4763R514p629J5672l629j9664L771J3531O92o460j8047L4991j338J2609
9025A9250j5920j1370l746J9680j2589j3056L4047K8814l5091k3418m619J5431
9013b587J0226k740J0169J2050j4944P176J293j1725m4927l2005K5446K9561L6579
9000B3572K5018l591j7484j3113j0079k5192O028K64L52j8048J5317K8949J9922
8987C1915J7361J0117N944J1241J9207k1531m4533l3963k3714j5089K2080J2918
8975h047L445K3245J4811l437j4912k9384l7764J2943K4708O96K6770r098k0904
8962a6928r879L5440J3511o084J960K3586O578k3041j097L290p996l874N548j1891
$$ plain form
9051 40299 52465 27951 -387 -5464 -18879 -16696 684 5247 24215 60901 60360 13006 -14763
9038 -14763 -5249 -12878 2794 -835 -20499 -16728 -3197 -2505 -8965 -27012 7979 6641 19250
9025 19250 3330 -8040 -11786 7894 -4695 -17751 16296 45110 10019 -13399 -18018 -2587
9013 -2587 7639 4899 15068 27118 12174 19350 20643 8918 -36009 -68014 -42568 -13007 23572
9000 23572 48590 44999 27515 14402 4323 -20869 -14841 -14577 -14225 -32273 -16956 11993 31915
8987 31915 49276 59393 65337 76578 95785 74254 29721 -4242 -27956 -43045 -20965 -8047
8975 -8047 -4602 18643 33454 30017 15105 -14279 -52043 -39100 -14392 -13696 13074 3976 -16928
8962 -16928 -26807 8633 22144 16060 18020 41606 48184 25143 24046 27336 19340 15466 21014 9123
8948I123J3577K5343j6099k544j7457k4866J2365n309j3232J3655O054R332j0958
8935a016k1674J6988K7562q332l946n438J6934J7856J4735J1225J8076k3695l0861
8922B8414K3175l449r276j5532J1509N900q523m2942J9111l189k199O173N574
8909A4746K856j1039N335K8355n249l1437O629K2358j8486l2982j0986O338P6504
8896E2942J0758o418k0197k3479j6607k0494k9169K421R922K5006P7751o305l6307
8883A9824M021p27L4230L8371j0634l0690j2229l9809k2108j3727J1687K8506
8871F715J6560J3753J3935j1339L6032j6156m2149l4383j1378K4936J4944q412
8859C058q997J1643L073j8460K3498J1766J0392M4801k5959j9043r110K537O825
$$ plain form
8948 9123 22700 48043 31944 29400 11943 -12923 -558 -5867 -19099 -5444 610 9942 -1016
8935 -1016 -22690 -5702 21860 13528 9582 4144 21078 38934 53669 64894 82970 59275 28414
8922 28414 51589 48140 38864 23332 34841 40741 32218 -10724 8387 5198 2999 9172 14746
8909 14746 17602 6563 11898 40253 35004 3567 10196 32554 14068 -18914 -29900 -23562 52942
8896 52942 63700 57282 37085 13606 -3001 -23495 -52664 -50243 -40321 -15315 62436 56131 19824
8883 19824 23845 23118 57348 95719 85085 54395 42166 2357 -19751 -33478 -21791 6715
8871 6715 23275 37028 50963 39624 75656 59500 17351 -17032 -28410 -3474 11470 3058
8859 3058 -5939 5704 8777 -9683 13815 25581 35973 80774 54815 35772 26662 29199 36024
8846C6024K563k0301n640J37l498j2044Q0o635K8980M269j9423k7612K3617L2479
8832C2996Q13q227r78J455J3094K0660r014k789m288J9610j4329j3941m606r460
8818B0996P277j8014k7600q903K1113k2080j3405K3103J2030o703r157J5716k0348
8805b5975o274J2202L1590K4166r111K559J5300j2253m265K5139j637k1829k952
8792B6660J1916k0511O196j9744J3903L537l625j5747o010n970j7842K3652j2586
8779a6171l6204P352M0876K6535j2317j0602K3198p044K212M371j5437l1276L098
8766b1409J7021L3529J9968k7927j4326k6287l4326J5278J983K4636l640j7552
8754c3052Q50K3879M03P098R481K2110J3010k9324k1408J7995K719K0440O035
$$ plain form
8846 36024 38587 18286 12646 12783 9285 -2759 -2679 -9314 19666 23935 4512 -23100 517 32996
8832 32996 33809 25582 24604 26059 39153 59813 50799 48010 43722 63332 49003 35062 30456 20996
8818 20996 28273 10259 -17341 -26244 -5131 -27211 -40616 -17513 -5483 -12186 -21343 -5627 -25975
8805 -25975 -32249 -20047 11543 35709 26598 29157 44457 32204 27939 53078 51441 29612 26660
8792 26660 38576 18065 24261 4517 18420 21957 18332 2585 -3425 -9395 -27237 -3585 -16171
8779 -16171 -52375 -45023 -4147 22388 10071 -531 22667 15623 17835 22206 6769 -24507 -21409
8766 -21409 -4388 29141 49109 21182 6856 -19431 -53757 -38479 -36496 -11860 -15500 -33052
8754 -33052 -32202 -8323 -7920 -822 8659 30769 43779 14455 -6953 11042 13761 34201 40236
8741D0236j4156k1624r901J4355J505j95J320q087p57P23R989J151l290r848l1334
8726b9913j1274J3503J1752O264j6766P758J7420M48o721P697j9054j5857J0103
8713b4640K9475J095K234J2412l4346l4324J4893M5740J2541j4615J2647j470
8701B1642L549J8180J5076j169K151k9665L989m371j8760k2561J6387O788p21
8688A0515J6729K4853M017Q160k6188l0981j1484j9059K8525P194k2063l518J0050
8675c250l5659j3781Q593J0983K9092L1287K572M4J0462k5474J1047K6806k0594
8662C2128j4355L180k4297j8743l4204j5663L3150J5609L3982J9408j3688J6124
8650C2631l190j5341J0342j4953J3639J4598p591l148n478j0482K1362k286k4894
$$ plain form
8741 40236 26080 4456 -5445 8910 10415 10220 11540 3453 2696 3419 13408 14559 11269 1421 -29913
8726 -29913 -41187 -27684 -15932 -9668 -26434 -18676 -1256 -808 -7529 168 -18886 -34743 -24640
8713 -24640 4835 5930 8164 20576 -13770 -48094 -33201 12539 25080 10465 23112 21642
8701 21642 25191 43371 58447 57278 59429 29764 33753 29382 10622 -11939 4448 11236 10515
8688 10515 27244 52097 56114 64274 38086 7105 -4379 -23438 5087 12281 -9782 -13300 -3250
8675 -3250 -38909 -52690 -44097 -33114 -4022 27265 29837 29881 40343 14869 25916 52722 32128
8662 32128 17773 20953 -3344 -22087 -56291 -71954 -38804 -23195 10787 30195 16507 32631
8650 32631 29441 14100 24442 9489 23128 37726 30135 26987 21509 11027 32389 30103 5209
8637E209P899m027m4080J0434L7108J2885J5919M7046J8105o5900k3876j1496
8625E226J4521j0327r373J0700K9932J1400j0436j9790k065K640q050J607o677
8612I308j139n795K2194K5892Q308j6947K366L180j4125j1251J5300R615J5764
8599F2670L0216R967j6127k8348n00J1120R339M1k1911k2886k457J2753p034J4595
8585E1438O904k918L362j7585L214N870j7387k8118j864J4950j5671m930K620
8572a15j9823K0373L7868J7955j6446n9218m475J5500N917J3811M50J3179L8779
8559F3755J7714k7642j6802J0688K2867J5609j9691J1728k0030k684j0825o845
8547C7842O549N663R900k6547j0087P817K4643l782n963k581j2416J848j468k0478
$$ plain form
8637 5209 13108 9081 -34999 -24565 12543 25428 41347 88393 106498 40598 16722 5226
8625 5226 19747 9420 47 10747 40679 52079 41643 21853 19788 22428 14378 15985 9308
8612 9308 8169 2374 24568 50460 58768 41821 44187 47367 33242 21991 37291 46906 62670
8599 62670 92886 102853 86726 58378 57878 68998 78337 78378 56467 33581 31124 43877 36843 51438
8585 51438 58342 55424 58786 41201 44415 50285 32898 4780 2916 17866 2195 -2735 -115
8572 -115 -19938 435 38303 56258 39812 -19406 -23881 -8381 -2464 11347 11797 24976 63755
8559 63755 81469 53827 37025 47713 70580 86189 66498 78226 58196 55512 44687 37842
8547 37842 44391 50054 59954 33407 23320 31137 55780 51998 46035 43454 31038 32886 31418 10940
8533A0940J4263j1349k2667q177J5587j4186O178P099q963k1763K0049L4801p693
8520A4119l157j9284l4121k467N658o618j5787J539J4821M0412J4212o34m217
8507D476p104j4982l334J5903K1352l425n376L1863m469n0458j0399L4213J8993
8494B7253N157k202k2750j5039j5347m310K2218q134Q862j677l3273K0136J4096
8481e010J613P012J2638p403P659J874P590R053n18r837Q814j561l6075k8002
8467c2153j4823J7784J5938k1043j1727j0958O415J9294J1857K0701j1843k8498
8455c9056J677L8073M9008L306l1740n0041r751o775Q393K8967J3226j5816j9892
8442c0421J4458J7672p750K2867J7829n348K541p915M101l6912j6785K2864O0586
$$ plain form
8533 10940 25203 13854 -8813 -16990 -1403 -15589 -9411 -2312 -11275 -33038 -12989 21812 14119
8520 14119 10962 -8322 -42443 -44910 -39252 -45870 -61657 -60118 -45297 -4885 9327 8693 4476
8507 4476 -2628 -17610 -20944 -5041 16311 12886 7510 39373 34904 -15554 -25953 8260 27253
8494 27253 32410 30208 7458 -7581 -22928 -27238 -5020 -13154 -4292 -5969 -39242 -19106 -5010
8481 -5010 -3397 3615 16253 8850 16509 18383 25973 35026 34508 24671 33485 31924 -4151 -32153
8467 -32153 -46976 -29192 -13254 -34297 -46024 -56982 -50567 -31273 -19416 1285 -10558 -39056
8455 -39056 -37379 694 49702 53008 21268 -28773 -38524 -45299 -36906 -7939 5287 -10529 -30421
8442 -30421 -15963 1709 -6041 16826 34655 29307 31848 23933 28034 -8878 -25663 -2799 57787
8429E7787K3098q611o69k9383n3857k5461j0677J2133k6464j5474K8262K6711
8417b2605K2363J3870K2019p997n5377l4482j5998L2490K8237K5048n236r36J952
8404C348j2087J2845J3280J7012J3819r209j3982l5361R444L8285K1058m689l8423
8391A5340k6245K6525K856J0947k0103j6231j7387k1615J2578J7857J2388K754
8379c36j3864J1046J0655R25k2228P398K5578l6042N517K6243L3021k70m5946
8366A697n052M385J7556j1528k2878k742r918J8411J9020K287j5026k6490j6200
8353d6478k195J5424J1473r687K2808K4571M838m767p646j9644J7408J6296j7209
8340E192l91q944j3294j1411K4290L3321p373k7944N059J0267J6454J2375l23
$$ plain form
8429 57787 80885 72274 71605 42222 -11635 -37096 -47773 -35640 -62104 -77578 -49316 -22605
8417 -22605 -242 13628 35647 27650 -27727 -62209 -78207 -45717 -17480 7568 2332 1396 3348
8404 3348 -8739 4106 17386 34398 48217 39008 25026 -10335 -891 37394 58452 53763 15340
8391 15340 -10905 15620 18476 29423 9320 -6911 -24298 -45913 -33335 -15478 -3090 -336
8379 -336 -14200 -3154 7501 8426 -13802 -6404 19174 -16868 -11351 14892 47913 47643 1697
8366 1697 -3355 1030 18586 7058 -15820 -18562 -28480 -10069 8951 11238 -3788 -30278 -46478
8353 -46478 -48673 -33249 -21776 -31463 -8655 15916 20754 15987 8341 -11303 6105 22401 5192
8340 5192 4801 -4143 -17437 -28848 -4558 28763 21390 -6554 -1495 8772 25226 37601 37278
8327C7278M423k6847k3682K9011J5476M108q735Q43j6971j9673j0563L942j2399
8314b3789j5818k3218J6204J6976L5781J0044Q09k2074j4708M175J8903K1255
8302B4540j982r927J5934j5113n070L0031O471k1276k7784j3118K813p44J2668
8289b557K1401j1080j7921k0724q869K887M582K4092J8194j5134r443K487l29
8276a2414p114O819J221j4159P447K7376J8910m3298M217m1415K5335K2425l254
8263g904J927k7016p657n984K8771J6049K0283L3790Q435J493p882m4022k9516
8250a9233Q736L775J2915K039K3650l325l1134o268j7162M2762Q558j3124j7851
8237e662J12K2710N526l5388j2305K6290J4145r685q437j8994J0874r83o023Q440
$$ plain form
8327 37278 41701 14854 -8828 20183 35659 39767 31032 31875 14904 -4769 -15332 -11390 -23789
8314 -23789 -39607 -62825 -46621 -29645 6136 16180 16989 -5085 -19793 -15618 3285 24540
8302 24540 22558 12631 28565 13452 8382 38413 44884 23608 -4176 -17294 -14481 -15225 -2557
8289 -2557 18844 7764 -10157 -30881 -39750 -36863 -32281 -8189 10005 -5129 -14572 -12085 -12414
8276 -12414 -19528 -12709 -11488 -25647 -18200 9176 28086 -15212 -10995 -52410 -27075 -4650 -7904
8263 -7904 -5977 -32993 -40650 -46634 -17863 -1814 18469 52259 60694 62187 54305 10283 -19233
8250 -19233 -10497 -6722 6193 8232 31882 28557 -2577 -8845 -26007 16755 25313 12189 -5662
8237 -5662 -5550 17160 22686 -12702 -25007 1283 15428 5743 -2694 -21688 -10814 -11797 -17820 -9380
8223i380o929P362J6705o578J1428o57k391J0451k5600k838K861k8042k8921k4719
8209h7248J4849L3794N37l5326J0902J7174J4265r005J5256K2231r352k6180m0685
8196g8788J372N7800L1452k8971Q246Q832k204o206J6837j6783n588J2022J0630
8183H651M225K6183n109k3938k1129r527N696l036j1459l026J1319J1218M557
8170e375L588J5114m832q055J5355M0508p152R56m728Q86K7068N077m8463k3369
8156F578k5975O606L5796M373j9945l4101J894L0936N409k6557J9769n75j1998
8143g790K2193l242J5935k5783k2847K891L8140K0112j2157k7107j2057M252L823
8130c637K955K8017k5446j7304l359L4726l498m7491k2150j3908R067J9600K778
$$ plain form
8223 -9380 -16309 -8947 7758 1180 12608 11951 9560 20011 -5589 -8427 -5566 -33608 -62529 -87248
8209 -87248 -72399 -38605 -38068 -73394 -62492 -45318 -31053 -40058 -24802 -2571 -11923 -38103 -78788
8196 -78788 -77416 -19616 11836 -17135 -8889 -57 -2261 -8467 8370 -8413 -14001 -1979 8651
8183 8651 12876 39059 33950 10012 -11117 -20644 -14948 -17984 -29443 -32469 -21150 -9932 -5375
8170 -5375 -1787 13327 8495 440 15795 56303 49151 50107 45379 46265 73333 78410 29947 6578
8156 6578 -19397 -12791 23005 27378 7433 -26668 -24774 6162 11571 -14986 4783 4208 -7790
8143 -7790 14403 11161 27096 1313 -21534 -18643 19497 39609 27452 345 -11712 -7460 -3637
8130 -3637 -682 27335 1889 -15415 -18774 15952 12454 -35037 -57187 -71095 -62028 -42428 -39650
8117c9650J8420L4646P240L795J9163l946l2060J6615L134j0320j3741j690l121
8104a515r367l681Q472l422l51k376L4017O356L985j6962k9135R267r456k3039
8090c7207K1311K1182j251P240k1346j7815K115k0292k8595M282K7595J7060J1109
8077a4612J836J6020J8235L3608J9124j5221j352K5256m920m5854k0814p822o741
8064c257J5308K6086l261o089K6744K2507q703j5014m6517J395k958n441J9171
8051A9971k581k446Q497L2178J3539n880k9909j3297q441R198O709j6583n798
8038E157j8582L280j5341M1439o427n524q148J5402J5067J7904j3075l2181K135
8025A106J6033K1381M575L904K6317p279j1555l4625j5859J7026J3647j6287k1526
$$ plain form
8117 -39650 -21230 13416 20656 24451 43614 39668 7608 24223 27357 17037 3296 1606 -1515
8104 -1515 -10882 -14563 -6091 -9513 -9864 -12240 21777 28133 32118 15156 -13979 -4712 -14168 -37207
8090 -37207 -15896 5286 4035 11275 -10071 -27886 -25771 -46063 -74658 -70376 -42781 -25721 -14612
8077 -14612 -12776 3244 21479 55087 74211 58990 57638 82894 77974 32120 11306 3484 -3257
8064 -3257 12051 38137 34876 28787 55531 78038 69335 54321 7804 9199 6241 800 19971
8051 19971 17390 14944 23441 55619 69158 63278 33369 20072 11631 20829 27538 10955 5157
8038 5157 -13425 -10145 -25486 15953 9526 4002 -4146 11256 26323 44227 31152 -1029 1106
8025 1106 17139 38520 43095 46999 73316 66037 54482 19857 3998 21024 34671 18384 -3142
8012c142j5073O157L4732J6496l07k950l8559k2214J253k0999m151O1230K4919
7999C7392j7872k6713o662j8645l6753R03M7282L1082j327j23L4655p574n041
7986C0604p625j2918O951k8910k229R223O050k2388J6170j3230j5944O674K2629
7973d943Q782j479J847j2934M3858L1257l3885l1089r536J0458J9602Q46K4454
7960D7238J4929k9953j1374l0749k209J8064k7433j8778j677N599M7080N5271
7948F6008L5268O192r408j009k1767m6127L864J8263p910L3666J8624o524l3169
7935E5971k2247L169J5979k975k7050j3770j4611n425J5933P699j1422j2041L0601
7922A9811L9764J2177m613j1479k3363r468m999k6556J3442K8784K5074k1318
$$ plain form
8012 -3142 -18215 -12058 22674 39170 38863 35913 -2646 -24860 -23607 -44606 -48757 12473 37392
7999 37392 19520 -7193 -13855 -32500 -69253 -68350 -21068 10014 8687 8564 43219 35645 30604
7986 30604 22979 10061 17012 -11898 -14127 -4904 1146 -21242 -5072 -18302 -34246 -27572 -4943
7973 -4943 3839 2360 4207 -8727 35131 66388 32503 1414 -8122 2336 21938 22784 47238
7960 47238 62167 32214 20840 -9909 -12118 5946 -21487 -40265 -41942 -36343 10737 66008
7948 66008 101276 107468 98060 97051 75284 29157 33021 51284 43374 77040 95664 89140 55971
7935 55971 33724 36893 52872 49897 22847 9077 -5534 -10959 4974 12673 1251 -10790 19811
7922 19811 59575 71752 67139 55660 32297 22829 17830 -8726 4716 33500 58574 37256
7910C7256l3930j3399j7163K760r346j6545J1958O502J1977K5963O605L612K53
7897A6503l9567k0627K6062J5262K3317O856k8778l2762j842K1040K3181p987
7885F58Q4N717q065J147K4771j2265O162J774J8435k0013k2897J6882l734l0218
7871b1562q990K4625k889M2150k2654p451j4494Q661j0878r634j0013l2820j0477
7858g6426K4330L6096J9484J533J4746j3488n081k110K2232j3297j5544L218j8952
7845b3259j0367R364J3440o409R028J7352j739R173l3808O263L8251R396k1843
7832A4842r578l477q370m699r461J2753J5325K4205J8793j5661q749R331m2597
7819g343j2302L336K2727j0696m2622j8338K1761K7844o769J9928K7171m032k6715
$$ plain form
7910 37256 3326 -10073 -27236 -24476 -33822 -50367 -38409 -31907 -19930 6033 12638 16250 16503
7897 16503 -23064 -43691 -17629 -2367 20950 27806 -972 -33734 -35576 -14536 8645 658
7885 658 742 6459 -1606 -459 24312 12047 18209 19983 38418 18405 -4492 12390 8656 -21562
7871 -21562 -30552 -5927 -8816 33334 10680 3229 -11265 -2604 -13482 -23116 -33129 -65949 -76426
7858 -76426 -52096 -16000 3484 5017 19763 6275 1194 -916 21316 8019 -7525 -4307 -23259
7845 -23259 -33626 -24262 -10822 -17231 -8203 9149 7410 16583 -17225 -10962 27289 36685 14842
7832 14842 5264 1787 -6583 -11282 -20743 -7990 7335 31540 50333 34672 25923 35254 -7343
7819 -7343 -19645 -16309 6418 -4278 -46900 -65238 -43477 -15633 -22402 -2474 24697 20665 -6050
7806f050k603j3949J2452j116m111K4415k4111K822O939K2395P052l2923j2664
7793b1452J5512K0303k6694k7042R042K9826j004j8757j1170j3258J5031J7087
7781a2576L416J004M6323P903j5146j5504j1485L4907L59j8958K0731j8294J373
7768B4053k3225k9720p144m272K8241K7521o40l72M391l1946p441J4449j4623
7755b0728j0110L4630K4493K4039j9068k9427r166Q62J440N945L6682J194j4532
7742B6254J1897p273k5032l1458k0954L3472J9921k7284p656J9924J3961m153
7730A619j8455j3209l586J1804l3449J693L793Q491J1989J8021l700J3963l450
7717d476j7706l4926M84l071M103M5850N183j5556J8019n14l427k2863q823J2194
$$ plain form
7806 -6050 -8653 -22602 -10150 -11266 -15377 9038 -15073 -12251 -5312 17083 24135 -8788 -21452
7793 -21452 -5940 14363 -12331 -39373 -30331 -505 -1509 -20266 -31436 -44694 -29663 -12576
7781 -12576 -9160 -8156 38167 46070 30924 15420 3935 38842 39201 20243 40974 22680 24053
7768 24053 828 -28892 -36036 -40308 -12067 15454 14814 14442 18833 -13113 -20554 -6105 -20728
7755 -20728 -30838 3792 28285 52324 33256 3829 -5337 -4475 -3035 2910 39592 40786 26254
7742 26254 38151 30878 5846 -25612 -46566 -13094 6827 -20457 -28113 -8189 5772 1619
7730 1619 -16836 -30045 -33631 -21827 -55276 -53583 -49790 -41299 -29310 -11289 -14989 -1026 -4476
7717 -4476 -22182 -57108 -56624 -59695 -55592 -9742 -4559 -20115 -2096 -2610 -6037 -28900 -37723 -25529
7703b5529J6754N980k523k4726j0710J275j5734N330N7284j4958O792k436K64
7690b937R715k495m169p656L252L233j714L7598J5924k3807n233k3181j1119r714
7676b2303J182O992J4185K444j4576r744L3440K1591J909K798P41M200K032k9218
7662A5673r868j512N642J412l050L7422P838k0103k5489j653M548J2245J0386
7649C3491r061R714k4900n129P407O423J1790l3053l8090J8397M1159o591q617
7636B940j4149K107K0648J3475m0307p964J7813n712R181J2414j0697M140K1970
7623B5859J5028L750k1363j3172O990k2110K1528k925O262p367o71K3745j6116
7610A9438J747R438q484l4972r682K348q804M7356K5414J162j5158m206K2738
$$ plain form
7703 -25529 -8775 -2795 -5318 -30044 -40754 -39479 -55213 -49883 7401 -7557 -765 -3201 -2937
7690 -2937 6778 4283 114 -7542 -4290 -1057 -2771 34827 50751 26944 21711 -1470 -12589 -22303
7676 -22303 -21121 -14129 56 2500 -12076 -21820 11620 33211 35120 37918 38659 42859 44891 15673
7662 15673 5805 4293 9935 11347 8297 45719 53557 33454 7965 6312 10860 23105 33491
7649 33491 24430 34144 9244 4115 11522 17945 29735 -3318 -41408 -23011 18148 11557 2940
7636 2940 -11209 -9102 11546 25021 -15286 -23250 -5437 -11149 -1968 10446 -251 3889 25859
7623 25859 40887 44637 23274 10102 17092 -5018 16510 13585 19847 12480 11809 35554 19438
7610 19438 21185 30623 22139 -12833 -22515 -20167 -28971 18385 43799 44961 29803 25597 48335
7597D8335K898j8975j7030j0575l2987J0285J9359L2382K7274j1589k0027k7981
7585A369j8448j4545N065n215k2490M457J6852J470J8824M328M663K149r001R029
7571a493L1463J4327q808q232O362k2456L478q027p108j2720j6288K057P659r176
7557b8962R569J3851N736J8946o851M267k439M058q735k0448Q867j3849l7776
7544e3766R58K6401p348J5674L4966k0285k0484q370K3920K7303j52n011k1677
7531g871O518l697k266K6670j1931J3115P903l4680k7538R691J0265K718j5208
7518b6311P346n431j3209J5255P777J3469K7247K2423J1009j1845M960N838n065
7505E3463r028o170k8105J6196J5481l785K1721J5051k1748k4070l7636j9811
$$ plain form
7597 48335 51233 32258 15228 4653 -28334 -18049 1310 33692 60966 49377 29350 1369
7585 1369 -17079 -31624 -26559 -31774 -54264 -49807 -32955 -31485 -12661 -8333 -3670 -1521 -10522 -1493
7571 -1493 29970 44297 35489 27257 33619 11163 14641 6614 -494 -13214 -29502 -27445 -19786 -28962
7557 -28962 -19393 -5542 194 19140 12289 16556 14117 18175 9440 -11008 -2141 -15990 -53766
7544 -53766 -52808 -26407 -33755 -18081 16885 -3400 -23884 -32254 -8334 18969 18817 13806 -7871
7531 -7871 -1353 -5050 -7316 19354 7423 20538 28441 -6239 -33777 -24086 -13821 -11103 -26311
7518 -26311 -18965 -24396 -37605 -22350 -14573 -1104 26143 48566 59575 47730 52690 58528 53463
7505 53463 44435 38265 10160 26356 41837 38052 59773 74824 53076 29006 -8630 -28441
7493b8441N601N773j062J0039K8150l0578q786j9157j4416J4374J2066O784j4571
7480c4224O905j8311J272K4229J6979P618k1468o072K0757K5245j3618J905J6998
7467B8215Q712J2758l3850k4727j363j2557L756J4966O2845J1456k2642k551m6433
7454a415j7760J4395R069j741k7443j799K940J3384R666N051m59j1942J4258J1508
7440A7712l7529j2307J7073J9256Q780J6408m232J2916l1900j7813Q658N335J0929
7427A3286j4780k2430k2939J2799P373j0953K8391K1426L702O544J867j9802l5842
7414c1358J6429P483k435K7001L7414L270q735p284j9958j4111J4830j8076K2778
7401B7248K6942J0859l4765k4989k6187J3726L924J5795j3001l2574j0692j3740
$$ plain form
7493 -28441 -22840 -17067 -18129 -8090 20060 -10518 -19304 -38461 -52877 -38503 -26437 -19653 -34224
7480 -34224 -27319 -45630 -44358 -20129 -3150 4468 -17000 -23072 -2315 22930 9312 11217 28215
7467 28215 36927 49685 15835 -8892 -10255 -22812 -19056 -4090 58755 70211 47569 45018 -1415
7454 -1415 -19175 -4780 4289 2548 -24895 -26694 -23754 -10370 -704 4347 3888 -8054 6204 17712
7440 17712 -19817 -32124 -15051 4205 12985 29393 25161 38077 6177 -11636 -2978 2357 13286
7427 13286 -1494 -23924 -46863 -34064 -26691 -37644 -9253 12173 15875 22419 24286 4484 -31358
7414 -31358 -14929 -7446 -9881 17120 54534 57804 49069 41785 21827 7716 22546 4470 27248
7401 27248 54190 65049 30284 5295 -20892 -7166 -3242 12553 -448 -33022 -43714 -57454
7389e7454J1847L5161M742r672Q443o173K123K3845R630O726L699K1900j1262
7376D3555j8098k1857j8792j592j7190L0406K1422j9451J9754m87J4625l627j46
7363B8522K8l5415J641Q065J9153r35k3982m29k1208n173M237L1243M576K310
7349A2633K7609l0892j6799O8422p886k9276K1053K3693k2204k5703n460K5888
7337D1078n225l3702k0345j0067m558J9466j9127q184M5791O173k2152Qn533J7584
7323A207l0484q071M0512K4777j9976l5219k589R764k4717J161J255m470J9229
7310b7621L3559j6648j6436J8879O125j9543N68K6472j4297k662l6377R196K5363
7297a3422q520J5816J1235k5107j289J8286K3857P449J2463j698k5455j9714L286
$$ plain form
7389 -57454 -45607 -10446 -5704 -15376 -6933 -13106 -10983 12862 22492 29218 32917 54817 43555
7376 43555 25457 3600 -15192 -16784 -33974 -3568 17854 -1597 18157 17670 32295 28668 28522
7363 28522 28550 -6865 -5224 2841 21994 21059 -2923 -3352 -24560 -29733 -25496 5747 10323 12633
7349 12633 40242 9350 -7449 60973 53087 23811 44864 68557 46353 20650 15190 41078
7337 41078 35853 2151 -18194 -28261 -32819 -13353 -32480 -40664 5127 11300 -10852 -10844 -16377 1207
7323 1207 -29277 -37348 3164 27941 7965 -27254 -29843 -20079 -44796 -43635 -42380 -46850 -27621
7310 -27621 5938 -10710 -27146 -8267 -2142 -21685 -21117 5355 -8942 -11604 -47981 -38785 -13422
7297 -13422 -21942 -6126 5109 -19998 -21287 -3001 20856 28305 40768 39070 13615 -6099 -2813
7284b813M8941m992l7402K526N417k6510j710K9551R047j5894l3020J6474Q148
7271b237q917J7706k427J37L0158Q178J752j2065l0257M1088l108k8552R411k7404
7257f537r888o351L2158m1912k955K8461J8342l1007R661o864l5038J0405J7133
7244b4392J0830L462J3274o160j8207M136l284n75P888j4066k545r633Q046P986
7230b3240j1692k1392j8232n596K8239L4214K321j4354K3918N431l043o726j2082
7217b2234O658K1974j0755j6866K5134J2248j9772k3130k1732k0452K5051R271
7205c4605J1504K188J6396J3056J3028r909k9104m1086q879K6569K7967p073r60
7192b0908j2254J6508L0804J379P68q978r106M338j8693k3029j148j7544J8308
$$ plain form
7284 -2813 46128 41136 3734 6260 11677 -14833 -16543 13008 22055 6161 -26859 -10385 -2237
7271 -2237 -11154 6552 4125 4262 34420 42598 44350 32285 2028 43116 40008 11456 20867 -6537
7257 -6537 -16425 -22776 9382 -32530 -35485 -7024 11318 -19689 -10028 -16892 -51930 -41525 -24392
7244 -24392 -13562 -10100 3174 -2986 -21193 -17057 -20341 -20916 -13028 -27094 -29639 -39272 -31226 -23240
7230 -23240 -34932 -56324 -74556 -80152 -51913 -17699 -15378 -29732 -5814 -383 -3426 -10152 -22234
7217 -22234 -15576 6398 -4357 -21223 3911 16159 -3613 -26743 -48475 -68927 -43876 -34605
7205 -34605 -23101 -20913 -4517 8539 21567 11658 -17446 -58532 -67411 -40842 -12875 -19948 -20908
7192 -20908 -33162 -16654 14150 15529 16297 7319 -1787 2551 -16142 -39171 -40319 -57863 -39555
7179c9555O710l5570j5802K2862R863J1048J0239K1942m596l7713j2380M174l067
7166f1845p962J4210O92N656K1182K9695J0901r464p489J1647k203K2152j2042
7153A5130q76m413P477l0287m76r254o666O777L2080N748k0816p24J9969k3959
7139a0290k0061o693j3144O8948K0048m3635n7608k0537J4427J7161J6940J4399
7127b0045J1822N45J7991N4057J6242m4845j935J0638k9533j3077r567O351K3896
7114B2540j0332j4314r489j1873m470j8973j292R158L1261J2475l240j8560K0900
7101C791j7925j224J5803j1861j4948p153j609m741J5594J1409k283J5441J1300
7088A1594J2392k2558j0886L0814j8232J699j3638O077J5394L6949K2123J540
$$ plain form
7179 -39555 -32845 -68415 -84217 -61355 -51492 -40444 -30205 -8263 -12859 -50572 -62952 -58778 -61845
7166 -61845 -69807 -55597 -54905 -49249 -28067 1628 12529 3065 -4424 7223 5020 27172 15130
7153 15130 14254 9841 17318 -12969 -13445 -22699 -29365 -22588 9492 15240 -5576 -6300 13669 -10290
7139 -10290 -30351 -37044 -50188 18760 38808 -4827 -62435 -82972 -68545 -51384 -34444 -20045
7127 -20045 -8223 -7678 10313 64370 80612 35767 33832 44470 14937 1860 -7707 -1356 22540
7114 22540 12208 -2106 -11595 -23468 -27938 -46911 -48203 -39045 -7784 4691 1451 -17109 3791
7101 3791 -14134 -15358 445 -11416 -26364 -33517 -35126 -39867 -24273 -12864 -15147 294 11594
7088 11594 23986 1428 -9458 21356 3124 4823 -8815 -2738 12656 49605 71728 73268
7076G3268m3007k6098J6944L192k7142n848j9322m102O915l132M3879K5655j2605
7063B8597l2215k1356j4974P612K705p30P015q331M199j0469k024J8577J079P140
7049a3175m844o893N136K7797K6732m881M584m045k9056k8910R337r879P814j9141
7035c9424p4900n554M6045M7747M3936j036R341K3287j4482k5020P486M6196j035
7022F2587p5805k9749o650M5319L448o797J749j9514k3720K2682K2989J3432l61
7009I610J0336j2691J889K064J6816J2218j4349k1432k6525N390j4851k5080r824
6996f6429K5283M0679J6345k1097n389K764j2611R414l0365O556K5066m123R920
6983c987J5462j6151m1978q946M2816K0704j8376K9055k76K636J1361j5054j9787
$$ plain form
7076 73268 30261 4163 21107 24299 -2843 -8691 -28013 -32115 -25200 -28332 15547 41202 28597
7063 28597 -3618 -24974 -39948 -32336 -29631 -30361 -23346 -31677 -27478 -37947 -39971 -21394 -20315 -13175
7049 -13175 -18019 -24912 -19776 8021 34753 29872 34456 30411 1355 -27555 -18218 -28097 -20283 -39424
7035 -39424 -114324 -119878 -73833 -26086 17850 16814 26155 49442 34960 9940 17426 63622 62587
7022 62587 -13218 -42967 -49617 -4298 -850 -7647 -5898 -25412 -49132 -26450 -3461 9971 9610
7009 9610 19946 7255 9144 11208 28024 40242 25893 4461 -22064 -16674 -31525 -56605 -66429
6996 -66429 -41146 -467 15878 -5219 -10608 -7844 -20455 -11041 -41406 -34850 -9784 -13907 -3987
6983 -3987 11475 -4676 -46654 -55600 -12784 7920 -10456 18599 18323 20959 32320 17266 -2521
6970b521o960j4571j5994l270K6846J3575J5832M295m5341k2881L1294K0776P075
6957H155j4352j9572O042P339K3412J9716m337o825m2914k4275L8186J1880p848
6944e393j0943K9101K6433j6041J7306k5043L4J6125k705L842m281m1317J0438
6931b444J9213j9565J487Q465J4272k0577j1099k3973J9448L4635j3584k6892
6919b0614j1353J1777K0498k022o401K3511k04j3876m807J1179o269j4265q522
6906b1368M4056Q75q503p275l4882o494j1051J5235J9991J0093l618k2629K2744
6893b826L1846m856n153j8505o460j3600k4170M7785J2522j1365K818K0149o439
6880B1746l5762R282L6475j937l4200k6241k0088M0055K590j211m313k0479n412
$$ plain form
6970 -2521 -9481 -24052 -40046 -43316 -16470 -2895 12937 17232 -28109 -50990 -19696 1080 8155
6957 8155 -6197 -25769 -19727 -12388 11024 30740 26403 19578 -23336 -47611 -9425 2455 -5393
6944 -5393 -16336 12765 39198 23157 40463 15420 15454 31579 28874 32716 28435 -12882 -2444
6931 -2444 16769 -2796 -1309 7156 21428 851 -10248 -34221 -14773 19862 6278 -20614
6919 -20614 -31967 -20190 308 -1714 -8115 15396 15192 1316 -3491 7688 1419 -12846 -21368
6906 -21368 22688 23563 15060 7785 -27097 -33591 -44642 -29407 -9416 677 -2941 -25570 -2826
6893 -2826 29020 24164 19011 506 -5954 -19554 -43724 4061 16583 5218 8036 28185 21746
6880 21746 -14016 -4734 31741 29804 -4396 -30637 -50725 -10670 -8080 -9291 -13604 -34083 -39495
6867c9495K0707K5060p370q097J2601o108j0746L008j3583P5166K2032l7246k5497
6854A0432J1645J3833R545j1207j5380k6125p067j5559K6398N1744J398l4261
6842A5396o779R091j7491N8m760j0544K3757J0733J4143K942J2671J6366j8407
6829D7176k6330j5503K2939q495m0998k3824J702R644m874m208J1812J0633q769
6816b9095m557o07K7351j313J6099J386r604m609L814J3405J793K6570J862M069
6802D6564l099k64r429J6305j2529k9993p295n811J2597M35K9416l3953m0963
6789c8019m458J6187P615k6080Q911K8333n651K6752K2359l3356l594N246n733
6776a488p371J0364n541j0240K3735J2629J0618l7621p144j4448M629J0099n581
$$ plain form
6867 -39495 -18788 6272 -1098 -9195 3406 -2702 -13448 -10440 -24023 51143 73175 35929 10432
6854 10432 22077 35910 45455 34248 18868 -7257 -14324 -29883 -3485 48259 49657 15396
6842 15396 8617 17708 217 275 -4485 -15029 8728 19461 33604 36546 49217 65583 47176
6829 47176 20846 5343 28282 19787 -21211 -45035 -43333 -33689 -38563 -42771 -30959 -20326 -29095
6816 -29095 -33652 -34259 -6908 -8221 7878 9264 -340 -4949 -1135 12270 14063 40633 42495 46564
6802 46564 43465 43201 33772 50077 37548 7555 260 -5551 7046 7481 36897 2944 -38019
6789 -38019 -42477 -26290 -18675 -44755 -35844 -7511 -13162 13590 35949 2593 -1001 4245 -1488
6776 -1488 -8859 1505 -4036 -14276 9459 22088 32706 -4915 -12059 -26507 -21878 -11779 -17360
6763a7360j5953K3929K4405L270m034J751l5191k3237N587K2672k6008r794J5608
6750c4355Q719O022P795P113K4091L5214j2554j0821m110k7652l9146l2109n524
6737g7317N4387L5773J4739j2863k654j9134J253n336k7499p470K5478P773J3706
6724H36q042l940L0228M7368J6648j797k51k2816m9033j247o599p45j4821l0294
6710d4505q565J7677J5126R273k8484K616R554K0221j9608Q98L557k3831k1514
6697f7585M3383L9367J7733K53l8207p627l892k9958M02J9553k339P433J4690
6684f794j5258k488J5850K864k6727j993K8320J1191M528L52k2211J23N0688J3636
6670E2081l1478p471o658J6103j3662k2355n353L373p435J7948K227J3112j2897
$$ plain form
6763 -17360 -33313 -9384 15021 18291 14257 16008 -19183 -42420 -36833 -14161 -40169 -49963 -34355
6750 -34355 -25636 -19614 -11819 -4706 19385 54599 42045 31224 27114 -538 -39684 -71793 -77317
6737 -77317 -22930 12843 27582 14719 12065 -7069 -5816 -11152 -38651 -46121 -20643 -12870 836
6724 836 -7206 -11146 19082 66450 83098 81301 81050 58234 9201 7954 1355 610 -14211 -44505
6710 -44505 -53070 -35393 -20267 -10994 -39478 -36862 -27308 -7087 -26695 -25797 -22240 -46071 -67585
6697 -67585 -24202 15165 32898 33151 -5056 -12683 -16575 -46533 -46131 -26578 -28917 -21484 -6794
6684 -6794 -22052 -24540 -8690 -5826 -32553 -34546 -6226 4965 9493 9845 -12366 -12243 38445 52081
6670 52081 20603 13132 6474 22577 8915 -13440 -18793 -15420 -22855 -4907 -2680 10432 -2465
6657b465j5298Q147J295j6114N092K8458k5985Q803L8482j1542K338J2410j3447
$$ plain form
6657 -2465 -17763 -9616 -8321 -24435 -19343 9115 -16870 -8067 30415 18873 21211 33621 20174
$$ [...]
##END NTUPLES=NMR SPECTRUM
##END=
