##TITLE=Analysis number 315137
Compound Code cc 29210
Book Reference 439/77/29
Project Code adrs
Chemist Name ronp
##JCAMPDX= 6.0         $$ Bruker NMR JCAMP-DX V2.0
##DATA TYPE= NMR SPECTRUM
##DATA CLASS= NTUPLES
##ORIGIN= Bruker BioSpin GmbH
##OWNER= NMR
$$ XWIN-NMR		Version 3.5
$$ Wed Nov  9 08:48:44 2005 GMT Standard Time (UT+0h)  MAYBRIDGE\NMR@NMR_250MHZ
##.OBSERVE FREQUENCY= 250.131544655141
##.OBSERVE NUCLEUS= ^1H
##.ACQUISITION MODE= SIMULTANEOUS (DQD)
##.ACQUISITION SCHEME= undefined
##.AVERAGES= 16
##.DIGITISER RES= 18
##SPECTROMETER/DATA SYSTEM= dpx250
##.PULSE SEQUENCE= zg30
##.SOLVENT NAME= CDCl3
##.SHIFT REFERENCE= (INTERNAL, CDCl3, 0, 16.4457)
##AUDIT TRAIL= $$ (NUMBER, WHEN, WHO, WHERE, WHAT)
$$ ##TITLE= Audit trail, XWIN-NMR		Version 3.5
$$ ##JCAMPDX= 5.01
$$ ##ORIGIN= Bruker BioSpin GmbH
$$ ##OWNER= NMR
$$ C:\u/data/dgb/nmr/ADRS/12040/pdata/1/auditp.txt
$$ ##AUDIT TRAIL=  $$ (NUMBER, WHEN, WHO, WHERE, WHAT)
(   1,<2005-11-09 08:47:31.36 +000>,<MAYBRIDGE\NMR>,<NMR_250MHZ>,
      <created by zg, POWCHK disabled, PULCHK disabled
       configuration hash MD5:
       62 19 C7 07 E1 42 D1 B7 37 6C 3D D0 77 39 F9 E6
       data hash MD5: 64K
       CC F2 60 09 30 F5 4F 13 CB 29 EA 89 83 05 3A 22>)
(   2,<2005-11-09 08:47:54.28 +000>,<MAYBRIDGE\NMR>,<NMR_250MHZ>,
      <Start of raw data processing
       ef LB = 0.3 FT_mod = 6 PKNL = 1 SI = 32K 
       data hash MD5: 32K
       20 A1 48 E3 1E B9 67 6D 52 70 E0 E9 CA 49 D3 7D>)
(   3,<2005-11-09 08:47:59.57 +000>,<MAYBRIDGE\NMR>,<NMR_250MHZ>,
      <apk 
       data hash MD5: 32K
       6C D2 12 FB 58 7F 44 18 C6 45 EA EE BF D5 D4 A9>)
(   4,<2005-11-09 08:48:01.83 +000>,<MAYBRIDGE\NMR>,<NMR_250MHZ>,
      <abs ABSG = 5 
       data hash MD5: 32K
       78 1F BA 07 19 D6 F4 74 15 AC 2F 75 C2 06 FE 66>)
$$ ##END=
$$ 
$$ hash MD5
$$ DD D0 57 91 F2 7F 83 E4 BB 31 06 08 DA 28 41 5A
##$RELAX= 
##$RELAX= 
##$RELAX= 
##$RELAX= 
##$RELAX= 
##$RELAX= 
##$RELAX= 
$$ Bruker specific parameters
$$ --------------------------
##$DU= <C:\u>
##$EXPNO= 12040
##$NAME= <ADRS>
##$PROCNO= 1
##$TYPE= <nmr>
##$USER= <dgb>
##$AMP= (0..31)
100 100 100 100 100 100 100 100 100 100 100 100 100 100 100 100 100 100 
100 100 100 100 100 100 100 100 100 100 100 100 100 100 
##$AQSEQ= 0
##$AQ_mod= 3
##$AUNM= <au_zg>
##$AUTOPOS= <3 >
##$BF1= 250.13
##$BF2= 250.13
##$BF3= 250.13
##$BF4= 250.13
##$BF5= 500.13
##$BF6= 500.13
##$BF7= 500.13
##$BF8= 500.13
##$BYTORDA= 1
##$CFDGTYP= 0
##$CFRGTYP= 5
##$CHEMSTR= <none>
##$CNST= (0..31)
1 1 145 1 1 1 1 1 1 1 1 1 1 1 1 1 1 1 1 1 1 1 1 1 1 1 1 1 1 1 1 1 
##$CPDPRG= <>
##$CPDPRG1= <>
##$CPDPRG2= <>
##$CPDPRG3= <>
##$CPDPRG4= <mlev>
##$CPDPRG5= <mlev>
##$CPDPRG6= <mlev>
##$CPDPRG7= <mlev>
##$CPDPRG8= <mlev>
##$CPDPRGB= <>
##$CPDPRGT= <>
##$D= (0..31)
0 1 0 0 0 0 0 0 0 0.06 0 0 0 0 0 0 0.0002 0 0 0 0 0 0 0 0 0 0 0 0 0 0 
0 
##$DATE= 1131526049
##$DBL= (0..7)
120 120 120 120 120 120 120 120 
##$DBP= (0..7)
150 150 150 150 150 150 150 150 
##$DBP07= 0
##$DBPNAM0= <>
##$DBPNAM1= <>
$$ [...]
##$SUBNAM7= <"">
##$SUBNAM8= <"">
##$SUBNAM9= <"">
##$SW= 20.6930455092707
##$SWIBOX= (0..15)
0 0 3 0 0 0 0 0 0 0 0 0 0 0 0 0 
##$SW_h= 5175.983436853
##$TD= 65536
##$TD0= 1
##$TE= 294.16
##$TE2= 300
##$TE3= 300
##$TEG= 300
##$TL= (0..7)
0 120 120 120 120 120 120 120 
##$TP= (0..7)
150 150 150 150 150 150 150 150 
##$TP07= 0
##$TPNAME0= <>
##$TPNAME1= <>
##$TPNAME2= <>
##$TPNAME3= <>
##$TPNAME4= <>
##$TPNAME5= <>
##$TPNAME6= <>
##$TPNAME7= <>
##$TPOAL= (0..7)
0.5 0.5 0.5 0.5 0.5 0.5 0.5 0.5 
##$TPOFFS= (0..7)
0 0 0 0 0 0 0 0 
##$TUNHIN= 0
##$TUNHOUT= 0
##$TUNXOUT= 0
##$USERA1= <user>
##$USERA2= <user>
##$USERA3= <user>
##$USERA4= <user>
##$USERA5= <user>
##$V9= 5
##$VALIST= <valist>
##$VCLIST= <CCCCCCCCCCCCCCC>
##$VD= 0
##$VDLIST= <DDDDDDDDDDDDDDD>
##$VPLIST= <PPPPPPPPPPPPPPP>
##$VTLIST= <TTTTTTTTTTTTTTT>
##$WBST= 1024
##$WBSW= 4
##$XGAIN= (0..3)
0 0 0 0 
##$XL= 0
##$YL= 0
##$YMAX_a= 489332
##$YMIN_a= -449791
##$ZGOPTNS= <>
##$ZL1= 120
##$ZL2= 120
##$ZL3= 120
##$ZL4= 120
##$ABSF1= 16.44575
##$ABSF2= -4.247423
##$ABSG= 5
##$ABSL= 3
##$ALPHA= 0
##$AQORDER= 0
##$ASSFAC= 0
##$ASSFACI= 0
##$ASSFACX= 0
##$ASSWID= 0
##$AUNMP= <proc_1d>
##$AZFE= 0.1
##$AZFW= 0.1
##$BCFW= 0
##$BC_mod= 0
##$BYTORDP= 0
##$COROFFS= 0
##$CY= 12.5
##$DATMOD= 1
##$DC= 0
##$DFILT= <>
##$DTYPP= 0
##$F1P= 14.0000005364418
##$F2P= -0.99999901652339
##$FCOR= 0.5
##$FTSIZE= 32768
##$FT_mod= 6
##$GAMMA= 0
##$GB= 0
##$INTBC= 1
##$INTSCL= 1
##$ISEN= 128
##$LB= 0.3
##$LEV0= 0
##$LPBIN= 0
##$MAXI= 10000
##$MC2= 0
##$MEAN= 0
##$ME_mod= 0
##$MI= 0
##$NCOEF= 0
##$NC_proc= -2
##$NLEV= 6
##$NOISF1= 0
##$NOISF2= 0
##$NSP= 0
##$NTH_PI= 0
##$NZP= 0
##$OFFSET= 16.44575
##$PC= 1
##$PHC0= 84.93957
##$PHC1= 5.022571
##$PH_mod= 1
##$PKNL= yes
##$PPARMOD= 0
##$PSCAL= 4
##$PSIGN= 0
##$REVERSE= no
##$SF= 250.130019071984
##$SI= 32768
##$SIGF1= 0
##$SIGF2= 0
##$SINO= 400
##$SIOLD= 32768
##$SREGLST= <1H.CDCl3>
##$SSB= 0
##$STSI= 32768
##$STSR= 0
##$SW_p= 5175.98343685301
##$SYMM= 0
##$S_DEV= 0
##$TDeff= 65536
##$TDoff= 0
##$TI= <Analysis number 999999
Compound Code 99
Book Reference 9
Project Code 9>
##$TILT= no
##$TM1= 0
##$TM2= 0
##$TOPLEV= 0
##$USERP1= <user>
##$USERP2= <user>
##$USERP3= <user>
##$USERP4= <user>
##$USERP5= <user>
##$WDW= 1
##$XDIM= 32768
##$YMAX_p= 410568184
##$YMIN_p= -74575
$$ End of Bruker specific parameters
$$ ---------------------------------
##NTUPLES= NMR SPECTRUM
##VAR_NAME=  FREQUENCY,     SPECTRUM/REAL,   SPECTRUM/IMAG
##SYMBOL=    X,             R,               I
##VAR_TYPE=  INDEPENDENT,   DEPENDENT,       DEPENDENT
##VAR_FORM=  AFFN,          ASDF,            ASDF
##VAR_DIM=   32768,         32768,           32768
##UNITS=     HZ,            ARBITRARY UNITS, ARBITRARY UNITS
##FACTOR=    0.157963299565203, 1,           1
##FIRST=     4113.57558176906, 0,            0
##LAST=      -1062.40785508395, 0,           0
##MIN=       -1062.40785508395, -74575,      0
##MAX=       4113.57558176906, 410568184,    0
$$ Real data points
##PAGE= N=1
##DATA TABLE= (X++(R..R)), XYDATA
$$ [...]
16775a1882l150l047j1925k804K0438J8880j9960j605p219k315J394R747K780
16762a0668N1M296J5794k199j156M102n897p094O755K6555J0787o529J376j8783
16748A7390j8755q86M167p992n328j9274Q578j2143j01J3758O671q355j4460J001
16734c5729N219j7569L5446J5722L991j749q039K1141r35l2832j3375K314q73
16721b7268R552J4290N213l952Q197J6743K818j1294n728j3668j7296j8632k805
16708d3830Q080L3897K1315J0874j5721p202q399j656J763k079j009q343k9J6331
16694C992k983k200K430L2J840j8658J1989J6170k0939J211J9220R627l9R778
16680C1470p184j3099j1058M702Q325J1779j5097l0779K0268J8146l457k2340
$$ plain form
16775 -11882 -15032 -18079 -30004 -32808 -12370 6510 -13450 -15055 -22274 -24589 -23195 -13448 -10668
16762 -10668 -10617 -6321 9473 7274 6118 10220 4323 -2771 3984 30539 41326 34797 36173 17390
16748 17390 -1365 -2251 1916 -6076 -11404 -30678 -22100 -34243 -34344 -20586 -13915 -22270 -36730 -35729
16734 -35729 -30510 -48079 -12633 3089 7080 5331 -2708 18433 17498 -15334 -28709 -26395 -27268
16721 -27268 -17716 -3426 1787 -2165 6032 22775 25593 14299 8571 -5097 -22393 -41025 -43830
16708 -43830 -35750 -1853 19462 30336 14615 7413 -986 -2642 -879 -2958 -3967 -12310 -12339 3992
16694 3992 1009 -1191 1239 1271 3111 -15547 -3558 12612 -8327 -7116 12104 21731 21692 31470
16680 31470 24286 11187 129 4831 13156 24935 9838 -20941 -673 17473 14016 -8324
16668h324j1963J393N20O211K0920K2284k279k4329j1219j2229K347J3475p662
16655a0855Q064J9572j9978k279J2425q221q604P33J2307J133k110j2414J621
16642h606k817r166K1302J0196L45k268l0350r296J7340n861M664Q490p3O985
16628H85P296J244j3399m0027L844K6473M13P067J3661J4533j3355L963J4658
16615B7256J625j2806K775o326j0618K951J3918k021q328L485J8325j570l59k421
16601B5886j8713N182R943J1936M462j7618J0887J1619M976j6169k094p116P66
16588B3947N351r800k3032q416j5410K0621R202j6810j9133P570j096K9725Q798
16575A1517j050n784k2704p378O087o466L0413m930k306J1740j8395n419O933
$$ plain form
16668 -8324 -20287 -18894 -18374 -12163 8757 31041 28762 4433 -6786 -19015 -16668 -3193 -10855
16655 -10855 -2791 16781 -3197 -5476 6949 -1272 -9876 -9143 3164 4297 2187 -10227 -8606
16642 -8606 -11423 -20589 713 10909 11254 8986 -21364 -30660 -13320 -19181 -14517 -6027 -6100 885
16628 885 8181 9425 -3974 -44001 -40157 -13684 -13271 -6204 7457 21990 8635 12598 27256
16615 27256 28881 16075 18850 12524 1906 4857 18775 16754 8426 11911 30236 28666 28307 25886
16601 25886 7173 12355 22298 34234 38696 21078 31965 43584 48560 32391 30297 23181 23947
16588 23947 29298 19498 -3534 -11950 -27360 -6739 2463 -14347 -33480 -25910 -27006 2719 11517
16575 11517 10467 4683 -18021 -25399 -19312 -25778 4635 -295 -2601 9139 -9256 -14675 -7742
16562g742R974j0965L61k2138R156J5016j979l63j1085l220o48J0233J3970J0556
16548A1126o692j9962K258P362J4903J757m445O519j696j6675j0429k273P580
16535a0667K859J7366N935m772j5316k0096j3937J3768O890K2756J7641j6242
16523F185o251K3713K144j7029j0722J3815j78Q061M789o026j3565o221R170o581
16509A304m38K9550m1881k1049P322J1127J9383K0154m776k3135j0052j4145j118
16496b7754L326N798l560o164j8584m023J7681M944o930J775P295J2146J8527
16483D477J9157m57k84q709L080j812K567j291n09l6197k6627J1440J4551m433
16469b5047p860o260j003l748J7047N611J7923N642M215J4644r994k2568O354
$$ plain form
16562 -7742 2232 -8733 -8372 -30510 -21354 -6338 -8317 -8680 -19765 -22985 -23633 -13400 570 11126
16548 11126 4434 -15528 -13270 -5908 8995 10752 6307 12826 11130 -5545 -15974 -18247 -10667
16535 -10667 -7808 9558 15493 10721 -4595 -24691 -38628 -24860 -17970 4786 22427 6185
16523 6185 -66 23647 25791 8762 -1960 11855 11677 19738 24527 18501 4936 -1285 7885 1304
16509 1304 866 30416 -11465 -32514 -25192 -14065 5318 25472 20696 -2439 -12491 -26636 -27754
16496 -27754 -24428 -18630 -22190 -28354 -46938 -50961 -33280 -28336 -35266 -33491 -26196 -14050 4477
16483 4477 23634 23177 22893 14184 17264 15452 18019 16728 16219 -19978 -46605 -35165 -20614 -25047
16469 -25047 -32907 -39167 -40170 -43918 -26871 -21260 -3337 2305 6520 21164 11170 -11398 -5044
16456e044m629q785R597k182P715K9667j1880k1699l007K311j176r351R370P353
16442a740j7287n149j1153J7986n644O911L017R604J3529l451k279p032J0130
16429G442J2460K084J334l292r307j0265l267j4213o7K4724J4442r909q221J2226
16415A6171k377j1228j7592M874O966m019j002O424J04p827o243j93N816p070
16401a7196N093Q523N245q665j6819l98k4109o047J9501J2601q443O767J8029
16388e918Q705j5394j5608N927J483P762M263K67l467K1825O960L868j3344J5018
16374B2347l088j3539Q659Q089k5256j4466k4452R480K6643j237q517j4573P564
16361b2346K8418L8673L950l1086j3145K242k0624p745p08o851m090L0965J2609
$$ plain form
16456 -5044 -9673 -18458 -8861 -11043 -3328 26339 14459 -7240 -10247 -7936 -9112 -18463 -9093 -1740
16442 -1740 -19027 -24176 -35329 -17343 -22987 -16076 -13059 -3455 10074 6623 4344 -2688 7442
16429 7442 19902 21986 23320 20028 10721 456 -2811 -17024 -17091 7633 22075 12166 3945 16171
16415 16171 13794 2566 -15026 -10152 -3186 -7205 -8207 -1783 -1679 -9506 -15749 -15942 -10126 -17196
16401 -17196 -12103 -3580 1665 -7000 -23819 -24217 -48326 -54373 -34872 -22271 -30714 -23947 -5918
16388 -5918 2787 -12607 -28215 -22288 -20805 -13043 -8780 -8513 -11980 9845 16805 20673 7329 22347
16374 22347 19259 5720 14379 22468 -2788 -17254 -41706 -32226 -5583 -6820 -15337 -29910 -22346
16361 -22346 6072 44745 48695 17609 4464 6706 -13918 -21663 -22371 -29222 -33312 -2347 10262
16348A0262J5526j2064p490K247o388k650j0352o636P607j668j3492j3355J0967
16335b7486k327j3136J0153N707k191J3246J8253J9391j2591r373j1713J5111
16323C044j535o603J1758R212J0398q838j5767J3970M846m658o379M23j1977j9180
16309b1286O846Q312R962l664j531r264m903K1950K0636L602j3247k5802J1321
16296B932J3861p148j9706J3509K695k0111j094N971q84J5120Q951j1510n201
16283b615k311J939n40q109J0463P185o657M476J8428m497K392p32J6743J620
16269C7785k0705k8921j9250M5623R007n566l54m727l745n373K36J6294j3824
16256F480R265J9231q086J7775J784k3199k4700p148r912K386J6357M418J5765
$$ plain form
16348 10262 25788 13724 6234 8481 2093 -557 -10909 -17545 -9938 -11606 -25098 -38453 -27486
16335 -27486 -29813 -42949 -32796 -27089 -29280 -16034 2219 21610 9019 -354 -12067 3044
16323 3044 1509 -5094 6664 15876 26274 17436 1669 15639 20485 15827 9448 9871 -2106 -21286
16309 -21286 -14440 -6128 3834 170 -1361 -10625 -15528 6422 27058 30660 17413 -8389 2932
16296 2932 16793 9645 -10061 3448 6143 -13968 -15062 -9091 -9975 5145 14096 2586 -2615
16283 -2615 -4926 -2987 -3527 -11636 -1173 6012 -645 3831 22259 17762 20154 19422 36165 37785
16269 37785 17080 -11841 -31091 14532 23539 17973 17619 12892 9147 3774 4010 20304 6480
16256 6480 15745 34976 26890 44665 46449 23250 -1450 -8598 -18510 -16124 233 4651 20416
16243B0416j8197j0688n621j9879j6600J2889L8067K2305N792o434j950j537J4741
16230C3304r014p595P20j8658k1163j0067J0230J5803J6548m862P280N854p340
16217A1040k0614p468K0163K235L647J278q985q750L550q029q526j301L655j5663
16203c3768j3178J1940M471l104J5477K5930q102J325J4747J4460j6428j7658
16191c888j741J7831J1290k367j5967j37m541j0361j3795k359K1178J985j1483
16178a4355j0742J2268p576K755p944j7826l470L229J8366K6212k079k987J7104
16165A2955j2338J2825J4530j3653J860N823r718j2700J5218j6505J892l600r676
16152a3087K6438Q013Q56r175P689Q863j137p546k1255j8611P555J0371k632K622
$$ plain form
16243 20416 2219 -8469 -14090 -33969 -50569 -37680 387 22692 28484 22050 20100 18563 33304
16230 33304 24290 16695 17415 -1243 -22406 -32473 -22243 -6440 10108 5246 12526 18380 11040
16217 11040 -9574 -17042 3121 5356 9003 10281 1296 -7454 -3904 -11933 -20459 -21760 -18105 -33768
16203 -33768 -46946 -35006 -30535 -33639 -18162 7768 -334 991 15738 30198 13770 -3888
16191 -3888 -5629 12202 23492 21125 5158 5021 480 -9881 -23676 -26035 -4857 -2872 -14355
16178 -14355 -25097 -12829 -20405 -17650 -25594 -43420 -46890 -43661 -25295 917 -1162 -4149 12955
16165 12955 617 13442 27972 14319 16179 22002 12284 -416 14802 -1703 189 -3411 -13087
16152 -13087 13351 21364 22220 13045 20734 29597 28460 20914 -341 -18952 -11397 -1026 -3658 -1036
16138a036l900m408M814O968k3156k164K0660k757J2343r754j6081j2639j1730
16125d2840N795Q90k044P317J7372M852K2805Q617j8528m201K438j9598j451O319
16111a2257J9598J1941o741j5343j1483O641Q746R570J821j0788j4570O773L0428
16098B4336l236k0809n440L004R73N50o027J4845l421k1669M91R806J5989j1583
16084b191o884j7619Q357m239j059J2787L842j640R578o64L377j563K387j2343
16070g874J2553K857r808K9695K712k3122q162k1357p990O922J2896r56K338J1335
16056B039R656J2142q487k8689j8116K2379L8150J3625k6295q088k4860O331K4068
16043A3855J2222P88j9850k2611j1156J1184R573L318J1127R240n893j5636p885
$$ plain form
16138 -1036 -4936 -9344 -4530 2438 -20718 -22882 -2222 -4979 7364 -2390 -18471 -31110 -42840
16125 -42840 -37045 -36155 -38199 -30882 -13510 -8658 14147 22764 4236 35 2473 -17125 -18576 -12257
16111 -12257 7341 19282 12541 -2802 -14285 -7644 1102 10672 12493 1705 -12865 -6092 24336
16098 24336 21100 291 -5149 -2145 -1172 -622 -6649 8196 4775 -16894 -16403 -6597 9392 -2191
16084 -2191 -9075 -26694 -18337 -22576 -23635 -10848 -7006 -8646 932 268 3645 2082 4469 -7874
16070 -7874 4679 7536 -2272 27423 30135 7013 -1149 -22506 -30496 -23574 -10678 -11634 -9296 2039
16056 2039 11695 23837 15350 -13339 -31455 -9076 29074 42699 16404 8316 -16544 -10213 13855
16043 13855 26077 26865 7015 -15596 -26752 -15568 -5995 -2677 8450 17690 11797 -3839 -11724
16030a1724M334L1258M924j7281p961m409K2313n340j3138J8520r496k9247J4622
16017b625L8485l148l6132k0274J0721N793J7235J7732q88p402r44L942O868j1227
16003A8136k6152k1013m908K5181J0392j1638j1314L121K7643J2028k9352M875
15991c001o821k709J7133l206M994J4253J457J479J1032n702k3450j4202j0643
15978a9386J5663O155j2721N227K4149K2441k540k5650j6455J9653K2503J5055
15966E4094O4L22p333j6131j8012p125q3n454l0013J5563J3454L245Q356J4149
15952B5096r04O122j2568k2148p141J280m039J2488L892J0952q711j9095O353
15939h423N686r128o943N008j9823j3611l84J9769J0683n458M951k272l233l715
$$ plain form
16030 -11724 -7390 23868 28792 11511 3550 -859 21454 16114 2976 21496 12000 -17247 -2625
16017 -2625 35860 32712 -3420 -23694 -12973 -7180 10055 27787 26899 19497 18553 22495 29363 18136
16003 18136 -8016 -29029 -33937 -8756 1636 -10002 -21316 -18195 9448 21476 -7876 -3001
15991 -3001 -9822 -12531 4602 1396 6390 20643 22100 23579 34611 28909 5459 -8743 -19386
15978 -19386 -3723 2432 -10289 -5062 19087 41528 38988 13338 -3117 16536 39039 54094
15966 54094 54158 54480 47147 31016 13004 5879 5796 342 -29671 -14108 -654 2591 10947 25096
15952 25096 24192 30314 17746 -4402 -11543 -10263 -14302 -1814 2078 13030 4319 -14776 -8423
15939 -8423 -2737 -11865 -18808 -13800 -33623 -47234 -47618 -27849 -17166 -22624 -17673 -19945 -23178 -26893
15925b6893Q749P89k4614p698J1669J4193Q300j9302j6400J674J5462J5707J8430
15912F6J3598m455j6978k1735Q539K8616M691n787J3812r242j901p241m3179J2358
15898b8838O437j3599m59K2503k127r357j5200K7571J7680o522Q856R89k1325
15885a3391p908J1319R287O576j3581N962p732o383J6158j6254j0882k788Q136
15872b1481J0540l341n441O956l763p078M59M072J0425K4131m70j3614j4408J1154
15858a859j0314J0767L247Q35j1834o143Q410K4482P648R25Q183N512j5135n895
15844A8829J1460K592j1955k5044J881Q943k5306j8482k813J3381K72J0683Q65
15831a4694P564K1185K2350l50m651k4781k2612J321j1242q289K8871j3859n757
$$ plain form
15925 -26893 -18144 -17355 -41969 -49667 -37998 -23805 -15505 -34807 -51207 -49533 -34071 -18364 66
15912 66 13664 9209 -7769 -29504 -20965 7651 12342 6555 20367 11125 9224 1983 -41196 -28838
15898 -28838 -22401 -36000 -36459 -13956 -16083 -25440 -40640 -13069 4611 -1911 6945 7934 -13391
15885 -13391 -21299 -9980 -693 5883 -7698 -1736 -9468 -15851 307 -15947 -26829 -29617 -21481
15872 -21481 -10941 -14282 -19723 -12767 -16530 -23608 -23149 -19077 -8652 15479 15009 1395 -13013 -1859
15858 -1859 -12173 -1406 1841 2676 -9158 -15301 -6891 17591 25239 26164 34347 39859 24724 18829
15844 18829 30289 32881 20926 -4118 -2237 6706 -18600 -37082 -39895 -26514 -26242 -15559 -14694
15831 -14694 -7130 14055 36405 36055 31404 6623 -15989 -14668 -25910 -34199 -5328 -19187 -24944
15818b4944m174j3873J9124J2009r891n228J8449K438O10J1709p072j420J4245
15805A1982J2781j2705o949q321k922L450O043j4347M003O396l566m365J0024
15792A504J8876j2672j9006q201K0599j5840j0594o828q297J843O968K8736J4955
15779A2043k0617P943Q425n69J4395K8959j3014k8161q196l929k2163q574J0022
15766b3436K0610J9744k578j79j3642k5960j0946Q060k034K0344P915J0882R004
15753A7784n743J1252K009m093k2180j6332J0906J1787J9437r557q23N555j0783
15740I219k7647j156J3120J3506L80m656l802o896j1764R614j0172J1739j4095
15727b2610O868J9924k667j4336j472k503n201j4203n694R949k627j148N099m251
$$ plain form
15818 -24944 -29118 -42991 -23867 -11858 -21749 -26977 -8528 -6090 -5480 6229 -843 -2263 11982
15805 11982 24763 12058 5109 -3212 -6134 -2684 3359 -10988 -6985 -589 -4155 -8520 1504
15792 1504 20380 7708 -11298 -19499 1100 -14740 -25334 -32162 -40459 -38616 -31648 -2912 12043
15779 12043 -8574 -631 7794 7225 21620 50579 37565 9404 1208 -2721 -24884 -33458 -23436
15766 -23436 -2826 16918 14340 14161 519 -25441 -36387 -28327 -30361 -10017 -2102 8780 17784
15753 17784 12041 23293 25302 21209 -971 -17303 -6397 5390 24827 15270 14447 20002 9219
15740 9219 -18428 -19584 -6464 7042 7422 2766 -1036 -7932 -19696 -10082 -20254 -8515 -22610
15727 -22610 -15742 4182 1515 -12821 -14293 -16796 -21997 -36200 -41894 -31945 -34572 -35720 -30621 -34872
15713c4872j2378q442J7576K5019J8681N70m779l686j5589k8P739K1687J5033
15700B6531j2224j1075K137J2619Q444m559J4913j6122O627j3323l3816J311K5018
15687F481j726r714j014J3668j3395l2640J1638L4166J1695j2957j6396L920m393
15674a0667K649J2552o973K669j519J209k4219J9233K2662m703J5547O837k5078
15661A0199o232r181N382j9344j9608J1596L871l833J6904M549l117j214N92q716
15647a8152j479L7261q603o486J9855N017k2610k632J0267j9250N768J1443l225
15634G174l388J6522J0977k2563j5412p692J1863P475l688j7231Q482J3950J0172
15621A6641j453m599n850n218K050m47p947j8343j7956M066K2043N465j5704J6013
$$ plain form
15713 -34872 -47250 -55692 -38116 -13097 5584 6154 1375 -2311 -17900 -17928 -10189 11498 26531
15700 26531 14307 3232 5369 17988 26432 21873 36786 20664 27291 13968 -19848 -18537 6481
15687 6481 4755 -4959 -5973 7695 -5700 -38340 -26702 7464 19159 6202 -10194 -6274 -10667
15674 -10667 -8018 4534 -2439 230 -1289 -80 -24299 -5066 17596 12893 28440 35277 10199
15661 10199 3967 -5214 168 -19176 -38784 -27188 -23317 -27150 -10246 -5697 -8814 -10028 -9436 -18152
15647 -18152 -19631 17630 9027 2541 22396 27413 4803 2171 12438 -6812 -1044 10399 7174
15634 7174 3786 20308 31285 8722 -6690 -14382 -2519 4956 1268 -15963 -7481 6469 16641
15621 16641 15188 10589 4739 -479 1571 1124 -6823 -25166 -43122 -39056 -17013 -11548 -27252 -11239
15607a1239n109M547m338o617L1036J3866j0823m186J7722P071j7267k3950O081
15594c206K1288L207j6411j0749Q370K9230J0956j9586P49k004k3379L308Q337
15581A0110M202l3210j1322L4353K5525j465l2621j3280J1048L91J322Q059J3581
15568A6693Q110n648j4171J0345o205L699K101j654p722j2179R163N92j6142k2993
15554c6011J1334K9212J2843o597j9580j4182J793R181J2195J6451J23M009q28
15541A9943j1821k1268O982k6284j054K706J579N570J2088J3574m700O745K1860
15528B5920J0496r4j113N132j4102k9040j4254Q516J2308R384j1729q341J7800
15515A0883k092J1231K216k0103l1511J5113j4457J0293P523J745j2331k968J2898
$$ plain form
15607 -11239 -16348 -11801 -16139 -22756 8280 22146 11323 7137 24859 31930 14663 -9287 -3206
15594 -3206 18082 21289 4878 -5871 2499 31729 42685 23099 23848 21844 -1535 1773 10110
15581 10110 14312 -18898 -30220 4133 29658 28193 -4428 -17708 -6660 -6269 -4947 3112 16693
15568 16693 24803 19155 4984 15329 9124 12823 14924 13270 5548 -6631 2532 3124 -13018 -36011
15554 -36011 -24677 4535 17378 10781 -8799 -22981 -21188 -12007 188 16639 16762 20771 19943
15541 19943 8122 -13146 -6164 -32448 -33502 -30796 -29217 -23647 -11559 2015 -2685 4060 25920
15528 25920 36416 36322 35209 40341 26239 -2801 -17055 -8539 3769 13153 1424 -6917 10883
15515 10883 8791 20022 22238 2135 -29376 -14263 -28720 -18427 -10904 -9159 -21490 -24458 -11560
15502a1560P379j663l112R108J9926Q838j2568j1215o763m85m729l589K3668N812
15488A9047R95K4732l620K155l079k1813k0527k3360j0289J2475K7277L211j339
15475E865j6367j78R39k311l190Q802N220m331N125k863M974O113J904j550M599
15460A2751j7101N646p533j475J232J220M632R312J8900k2758m0312R479K6194
15447A87j5396L513K5577K786l3882j8999n571k587J5927L3201M63o990J3236
15434A1465m256k3426j9252L556K9150N624j8422J5645J7075J2717M516o590J395
15421B9197J0779Q993r091k546l010k4204j1773k791k432J9477J3581J4382j0410
15408C0152K800n420p719j0426n018n512l810L911j119P153P110K798P107m885
$$ plain form
15502 -11560 -4181 -5844 -8956 152 20078 28916 16348 5133 -1630 -2115 -6844 -10433 13235 19047
15488 19047 20042 44774 41154 43309 40230 18417 -2110 -25470 -35759 -23284 3993 7204 5865
15475 5865 -10502 -10680 -9741 -12052 -15242 -6440 -1220 -5551 -426 -3289 1685 7798 9702 8152 12751
15460 12751 -4350 1296 -6237 -7712 -6480 -5260 -628 8684 27584 4826 -35486 -26007 187
15447 187 -15209 -11696 13881 16667 -17215 -36214 -41785 -44372 -28445 4756 5219 -1771 11465
15434 11465 7209 -16217 -35469 -31913 -2763 2861 -15561 84 17159 29876 34392 27802 29197
15421 29197 39976 48969 39878 37332 34322 10118 -1655 -4446 -6878 12599 26180 40562 30152
15408 30152 32952 27532 19813 9387 4369 -1143 -4953 -1042 -2161 4992 12102 14900 22007 17122
15394A7122k8326k026Q930j3738j4184J3260J2926J442o772J9409J5414J44j0239
15381A3362r666R763j1416k2603J3047j7126j8393K3935Q575k0791j3346L0181
15369a4478O210j40J2249K3363l747k0826j171M765J4427P3P822P121m783Q812
15355C9697o521j1174M587L546k0324k2661J1156N645N245L909j6956r627P078
15342f400K2788P604o478j4982k6578j910J6286L689R387k094j931J5031Q420
15329B2832M356M648k0994o786RO416j9188j36m64K0143O930N571m706k8651j8420
15314b8440K636L0315N2K914R963l446l1288j5863K2893K2753j0018J0652J0181
15301B3304j3097j0071m85J4296k2487j7509J2786Q655J3077K6883j8045j3774
$$ plain form
15394 17122 -11204 -13230 -4300 -18038 -32222 -18962 -6036 -4594 -11366 8043 23457 23601 13362
15381 13362 3696 13459 2043 -20560 -7513 -24639 -43032 -19097 -10522 -31313 -44659 -14478
15369 -14478 -8268 -8408 3841 27204 23457 2631 1460 6225 20652 20725 28547 35668 30885 39697
15355 39697 33176 22002 26589 30135 9811 -12850 -1694 3951 9196 13105 -3851 -13478 -6400
15342 -6400 16388 23992 17514 2532 -24046 -25956 -9670 -5981 3406 1312 -619 14412 22832
15329 22832 27188 31836 10842 4056 4065 10481 -8707 -8843 -9307 10836 17766 23337 18631 -10020 -28440
15314 -28440 -25804 4511 4563 7477 17440 13994 -17294 -33157 -10264 12489 2471 13123 23304
15301 23304 10207 136 -349 13947 -8540 -26049 -13263 -4608 8469 35352 17307 3533
15289C533q322j1482R788j583j157J4700J999n541J313k378j4377j6186K0388
15276i305R513k695K5951R187j5779l757j2391j7543l1821l236K6255J9704n479
15263a1396J128m693K807p194J421N006n368Q63Q202m666O12K2937O347m117j0654
15248A235L051q187r185k900n556J0262N617q212k7516M292k862J909J2009J8855
15234g188p140j1031J2198P534k773q872J8477m538J8467J0277N938p635j8920
15221D794k0551L769J1790k4856j8321Q893J5581R486J055j405J3555l059J995
15208B726k1704K4240L806m8616j7515L1630L7998J334r233N228R53j4086k3902
15195b7141r381K0131K4014K1004o938Q48n910j2391K3411J0564j3530k5361k3074
$$ plain form
15289 3533 -4789 -16271 -6483 -8066 -9223 5477 7476 1935 3248 870 -13507 -29693 -9305
15276 -9305 208 -2487 23464 32651 16872 13115 724 -16819 -48640 -51876 -25621 -5917 -11396
15263 -11396 -10268 -14961 -12154 -19348 -17927 -12921 -18289 -17426 -9224 -13890 -13278 9659 16006 11889 1235
15248 1235 4286 -3901 -13086 -15986 -21542 -11280 -5663 -13875 -41391 -37099 -39961 -38052 -26043 -7188
15234 -7188 -14328 -25359 -13161 -5627 -8400 -17272 1205 -3333 15134 25411 31349 23714 4794
15221 4794 -15757 -11988 -198 -25054 -43375 -34482 -18901 -9415 -8360 -9765 3790 731 2726
15208 2726 -18978 5262 9068 -39548 -57063 -25433 12565 13899 4666 9894 10847 -3239 -27141
15195 -27141 -36522 -16391 7623 28627 21689 22537 16627 4236 27647 38211 24681 -680 -23754
15182b3754K018k799p950R296j0109J7526M078q77P79p181j3132k43J0370J1294
15168a0684O399M662l355j589J2016R824k781l520K893J3731J9608l047k8537
15155A5620J801J7901J4082j6247m136r441M163P775r19k5164j918J3436J3834
15142C0787j6157K992k573q580p431N158P211J8209o614L977j9410n823n403Q555
15128D898p953r455L856n901J7111J0501p034j7750L141k838j3662p463L1146
15115a403j3235j2959L580Q59J8026k226J393n495J4267J1084K0324J136p287
15102B8064R145N35k585N382j3065k9041n721N010j962j976P329J1013j2814j6261
15088a6947j4053j133J0155J0110R021J4226l13o367K8563P087r041Q464J132
$$ plain form
15182 -23754 -21736 -24535 -32485 -23189 -33298 -15772 -11694 -12571 -11792 -18973 -32105 -32348 -21978 -10684
15168 -10684 -4285 377 -2978 -4567 7449 17273 14492 10972 13865 27596 47204 44157 15620
15155 15620 17421 35322 49404 33157 29021 19580 23743 31518 30599 5435 3517 16953 30787
15142 30787 14630 17622 15049 6469 -962 4196 11407 29616 23002 26979 7569 1746 -3657 4898
15128 4898 -3055 -12510 -8654 -14555 2556 13057 6023 -11727 -8586 -11424 -25086 -32549 -1403
15115 -1403 -14638 -27597 -24017 -23158 -5132 -7358 -5965 -11460 2807 13891 34215 35351 28064
15102 28064 37209 37744 35159 40541 27476 -1565 -7286 -2276 -4238 -6214 1115 12128 -686 -16947
15088 -16947 -31000 -32133 -21978 -11868 -2847 11379 11066 4699 33262 40349 31308 39772 40904
15075D0904j4084p132j108k6146j0746M717J4861J3995J6790r7j6766j7138l202
15062e152m391M810K3273n723r018n343J242n107k300r344M094q01j5269p414
15048c6443K3647O815k803J6229J0812J1001J6516k961k0333j3674l648J9521
15036B4679O578r582k1023k880L261l806J3464M219k1807M084J1918K0421j5806
15023A3720j5184M321l436J5803J7533j1809j3123j6918r633K001n837J755J9054
15010a753J7988o187J0535Q653j74j5737J796q660j4784K5088M3787M9559J8200
14997A28311k0179k9137k0445l352m679k8628k752k713L938j4966n857L966m469
14984i62J2239J0244n134j0825M523j2653k8914J9814R496j1567R209O617q087
$$ plain form
15075 40904 26820 19688 18580 -7566 -18312 -13595 1266 15261 32051 31954 15188 -1950 -5152
15062 -5152 -9543 -4733 18540 12817 3799 -1544 -302 -5409 -7709 -17053 -12959 -13760 -29029 -36443
15048 -36443 -12796 -5981 -8784 7445 18257 29258 45774 42813 22480 8806 5158 24679
15036 24679 31257 21675 652 -2228 1033 -2773 10691 14910 -6897 -2813 9105 29526 13720
15023 13720 -1464 2857 -579 15224 32757 20948 7825 -9093 -18726 -16725 -22562 -20807 -1753
15010 -1753 16235 10048 20583 29236 29062 13325 15121 6461 -8323 16765 60552 110111 128311
14997 128311 108132 78995 58550 55198 50519 21891 19139 16426 20364 5398 -459 3507 -962
14984 -962 11277 21521 16387 5562 10085 -2568 -31482 -11668 -2172 -13739 -4530 2087 -6000
14971f000K8794L472l6067k937M330P733N708j0845j4603k5633o269J9189J0537
14958b2591P905J3658R320R21O907M475k2023Q356p551l385q537l99q734L780
14944a7898M51o101j501J0572J5243j5405J272K0858L729Q489J012q715J034j4034
14930i94m706q166K1870K6384J2311K415j0496m249k0249M760L170M010K267J3095
14916D1422m791k3470l4635j2381N402n642J2185K8202R803j2897P65K5461N13
14903B9937M981J349j0976J0353m110l2040l451K5549J0381M636j730l2637o270
14890d028O314M746j4690n816j478J8658J096L793q119q496o354o642J7219L767
14876c0q282l514J86j045o773J6916K2730N218k0694O249P342J910J4835R063
$$ plain form
14971 -6000 22794 26266 -9801 -12738 -8408 -675 5033 -5812 -20415 -46048 -52317 -33128 -22591
14958 -22591 -14686 -1028 8292 9213 16120 20595 -1428 6928 -623 -4008 -12545 -12944 -21678 -17898
14944 -17898 -17447 -23548 -25049 -14477 766 -14639 -13367 7491 11220 19709 20721 12006 13040 -994
14930 -994 -5700 -13866 8004 34388 46699 49114 38618 34369 14120 18880 22050 26060 28327 41422
14916 41422 36631 13161 -21474 -33855 -28453 -34095 -21910 6292 16095 3198 3963 29424 29937
14903 29937 34918 36267 25291 35644 31534 -506 -3957 21592 31973 36609 34879 2242 -4028
14890 -4028 2286 7032 -7658 -13474 -14952 3706 4802 8595 476 -8020 -14374 -21016 -3797 -30
14876 -30 -8312 -11826 -11640 -12685 -19458 -2542 20188 25406 4712 10961 18303 20213 35048 44111
14862D4111O117M588l1084m1866J6575J6354k1149q942m262O080n820j1335p604
14849c8237J5021m475J3622J0029q483R931J1097k3505O594r025K517M865o92
14836a0741j0354o462P175J6040P039R031R818j0130J1997P224n825n954J782
14823B0640l760J965k926j7133j1143J6204K9999J6612k0383k4923k8782k279
14811b5909J5603J8345J2986j5650j0204N134J3172M01k8784p690M124K0613K020
14798D161o376n715Q460p698N367J9L512J4317q424n749R326M510r250k265j1199
14783g004Q49K0599J4735j6136j7305K3019J4685k4676j6446O380J3353J5202
14771B7255o202j1244o031r074j175M531J992j1605K421m503j144j5657r727l151
$$ plain form
14862 44111 50228 54816 23732 -18134 -1559 14795 -6354 -15296 -19558 -13478 -19298 -30633 -38237
14849 -38237 -23216 -27691 -14069 -4040 -12523 -2592 8505 -15000 -8406 -17431 -14914 -10049 -10741
14836 -10741 -21095 -27557 -20382 -4342 2697 11728 21546 11416 23413 30637 24812 18858 20640
14823 20640 16880 18845 15919 -1214 -12357 3847 33846 50458 30075 5152 -23630 -25909
14811 -25909 -10306 8039 21025 5375 -4829 305 13477 13878 -14906 -22596 -18472 2141 4161
14798 4161 -2215 -7930 530 -7168 -1801 -1782 1730 16047 7623 1874 11200 15710 6460 4195 -7004
14783 -7004 -6155 14444 29179 13043 -4262 18757 33442 8766 -7680 -1300 12053 27255
14771 27255 21053 9809 3778 -5296 -6471 -1940 52 -11553 -9132 -13635 -14779 -30436 -40163 -43314
14757d3314J7609J0574Q256K447R792R518o532k1568K373M2810j3059k4273l44
14744e711J7333K6423P387k2859m610N055j0533j6348Q717J7697n640j1796j1655
14731f540O110K6613J0275J5624k1621l0255p212o468j358O088J289p754K2570
14718G361J354l934Q545q024j1923J3845O856M784j1682j716J1330N149O664j1086
14704A7523j1864k2762k1340k160J476J8407m076K1509n975j3276j448R874P044
14691g068j2263j1133l889j7769l313K1036j173m638K734J7549K382R072J7505
14678I032o042j9057k795j407j965R624j1345j3022p231K0903J2668J3184n366
14665b819P898J6471j2198j4244p558M844j0703R438J5006k160k9096L265M526
$$ plain form
14757 -43314 -25705 -15131 -6875 -4428 5364 14882 8350 -13218 -10845 31965 18906 -5367 -5711
14744 -5711 11622 38045 45432 22573 17963 23018 12485 -3863 4854 22551 16911 5115 -6540
14731 -6540 -430 26183 36458 52082 30461 206 -7006 -13474 -14832 -8744 -7455 -15209 7361
14718 7361 8715 4781 13326 5302 -6621 7224 14080 18864 7182 5466 16796 21945 28609 17523
14704 17523 5659 -17103 -38443 -40603 -39127 -20720 -24796 -3287 -9262 -22538 -23986 -14112 -7068
14691 -7068 -19331 -30464 -34353 -52122 -55435 -34399 -35572 -40210 -37476 -19927 -17545 -8473 9032
14678 9032 2990 -16067 -18862 -20269 -22234 -12610 -23955 -36977 -44208 -23305 -10637 2547 -2819
14665 -2819 5079 21550 9352 -4892 -12450 -7606 -18309 -8871 6135 3975 -25121 -21856 -17330
14652a7330L077J2111J5778k7246k0159N631K3349o187k811L282M198r377l43
14639a6027q015n456L948K4927J4295J5095j0136k0249o961j314M808M207J630
14626G52j5656o081J8459J4925o795O51Q232j0073m12J0865j7216m697J992J4739
14612I685r281j0146j8916j253j296L282P979J0758J1264j7681j6628J5995J6544
14599C06o827O994k925N374j3346q98j234j0429J518m638l403o436l857J1629
14585b8172Q922J9470L383L372Q17J074M605J5669j1261K363j3270k4841l016
14572b0885k105k225J2228r540J8480n975K73K0760j4368M002J0165j0655k2085
14559b1930r332K3644j3096J7488J0187j0528j2024j4337K0597N442j2344K0175
$$ plain form
14652 -17330 -14253 -2142 13636 -13610 -33769 -28138 -4789 -10976 -13787 -10505 -6307 -15684 -16027
14639 -16027 -24042 -29498 -25550 -623 13672 28767 18631 -1618 -8579 -9893 -5085 -878 752
14626 752 -14904 -20985 -2526 12399 5604 6255 14487 4414 4002 14867 -2349 -7046 -5054 9685
14612 9685 404 -9742 -28658 -29911 -31207 -27925 -19946 -9188 2076 -15605 -32233 -16238 306
14599 306 -6521 473 -2452 2922 -10424 -11322 -12556 -22985 -21467 -26105 -29508 -35944 -39801 -28172
14585 -28172 -19250 220 3603 6975 7792 8866 13471 29140 17879 20242 6972 -17869 -20885
14572 -20885 -22990 -25215 -12987 -22527 -4047 -10022 -9749 11011 -3357 645 10810 155 -21930
14559 -21930 -31262 -7618 -20714 -3226 6961 -3567 -15591 -29928 -9331 -3889 -16233 3942
14547C942Q882j4582m789L974n18o25o490k251J5333L0763Q145m883N156j1323
14533C0734j9673M430l092L473J3830j3898k0986P831L872o378k406P796P956
14520A3489J158K722p528j5142m199l771q138J8521j460K500l956j8516j096m882
14506c0298P761K2645K0954K57N467J4751j0842k3704j6944J5800J6735n126j6589
14493H67q084J3585K231j788P242M066O670R944O244k9539n852K401J2825J941
14479B2753j089j3289P962o089j5493l058M341l276K0534J3732p018p414J3654
14466B6250l777j1087l269j1771k0251M456j6849P910J2968J0333J3576q384o56
14453e51k710R940J3127j2163j0730m959L66q4n802P198P660J5974m114l2110
$$ plain form
14547 3942 12824 -1758 -6547 -2573 -3091 -3716 -10206 -12457 2876 33639 41784 36901 42057 30734
14533 30734 11061 15491 12399 15872 29702 15804 -5182 2649 6521 143 -2263 5533 13489
14520 13489 14647 17369 9841 -5301 -9500 -13271 -21409 -2888 -4348 -1848 -5804 -24320 -25416 -30298
14506 -30298 -22537 108 21062 21319 26786 41537 30695 6991 -9953 5847 22582 17456 867
14493 867 -7217 6368 8599 6811 14053 18119 24789 34733 40977 11438 5586 7987 20812 22753
14479 22753 21664 8375 16337 10248 -5245 -8303 -3962 -7238 13296 27028 20010 12596 26250
14466 26250 22473 11386 8117 -3654 -23905 -19449 -36298 -28388 -15420 -5087 8489 105 -551
14453 -551 -3261 6679 19806 7643 -3087 -8046 -7680 -7764 -13566 -6368 1292 17266 13152 -18958
14439a8958k0255K4126J582n262L114J5736l264P544p622Q415J2504l273j0062
14426D325J3203P462k7180k2350j953K641j6375R57J23R852K5170l517j1160r89
14412a9791K065J7042k427M261N845N256q116J6166L7613O431j2825j5561j7154
14399A8805m022M483o947j1252j6666J189O935p627k113j1401J993K0269J1129
14386D775J4377J3706j5131k2315K468J2719l415k0482n296J4090K344k2410L058
14373b1512m623N492J8393k008K725L896J5261M155j1342n813j2052j8179J7558
14360h049J3015J2662n78o195K3580J7523N529R071M522l10l8994l0502j168j2362
14346a2256J4575K2737N562j6093Q566P370n460K332j6835j8957j847J0713l11
$$ plain form
14439 -18958 -39213 -15087 -13505 -18767 -15653 83 -3181 4363 -3259 5156 17660 14387 4325
14426 4325 17528 24990 -2190 -24540 -26493 -23852 -40227 -39270 -39147 -29295 -4125 -7642 -18802 -19791
14412 -19791 -17726 -684 -3111 1150 6995 12251 4135 20301 57914 64345 51520 35959 18805
14399 18805 14783 19266 12319 1067 -15599 -14410 -7475 -15102 -17215 -28616 -26623 -6354 4775
14386 4775 19152 32858 17727 -4588 -2120 10599 7184 -13298 -18594 -4504 -2160 -24570 -21512
14373 -21512 -26135 -20643 -2250 -4258 -1533 2363 17624 21779 10437 4624 -7428 -25607 -8049
14360 -8049 4966 17628 17050 10855 34435 51958 57487 66558 71080 70770 31776 1274 106 -12256
14346 -12256 2319 25056 30618 14525 23091 30461 25001 27333 10498 -8459 -10306 407 96
14333I6p439R481j133j3397o803K398J2488j0240J4051J9975l731r631k999K399
14319E515J0309j357j2988q733Q581l636K906l94j0862M381J0222J6814J029o630
14305A5157l0434j2832J0419K8864Q501q492k9889j3662J1193m949K461L847j715
14292b1531L536l444j5863j267M4754J3094k0935k2274k486K043l413J8131k6350
14279c6005J2923J8599j3335o180P402L1328k332k4944J9399L13j2685j0216P044
14266h689K73K896j270K3159Q119j7879j5299K4872J4819l4611m3167P079K7130
14253a2568j1170Q163P391j7960M846M212J2517k470j3204L987J1167m327P225
14240b191J4062J1853j7686j598R076N19j4841n834j5215j274j755j8M96j0922
$$ plain form
14333 96 -7343 2138 1005 -12392 -19195 -16797 -4309 -14549 -498 19477 15746 6115 3116 5515
14319 5515 15824 14467 1479 -7254 1327 -2309 597 203 -10659 -6278 3944 20758 21787 15157
14305 15157 -15277 -28109 -17690 11174 19675 11183 -18706 -32368 -21175 -26124 -23663 -19816 -21531
14292 -21531 -17995 -21439 -37302 -38569 6185 19279 -1656 -23930 -26416 -24373 -27786 -9655 -36005
14279 -36005 -23082 -4483 -17818 -23998 -16596 14732 12400 -12544 6855 7168 -5517 -15733 -8689
14266 -8689 -8416 -5520 -6790 16369 24488 6609 -8690 16182 31001 -3610 -46777 -39698 -12568
14253 -12568 -23738 -15575 -8184 -26144 -21298 -17086 -4569 -7039 -20243 -16256 -5089 -9416 -2191
14240 -2191 11871 23724 6038 4440 13516 14035 -806 -6640 -21855 -23129 -24884 -24902 -24406 -35328
14226c5328r989J4195K6761L4329J1970l3912k5603q774j9874k333K0184K119
14214b6255J3326r22n111M007J5528R371N158J7783k6523j3588O492j998k2491
14201b5223j605M837l507K7536P506j8067m923n453J4612J4849o316q347k3048
14188b7149p819J3589J1545j4078J1574J5810j6615J523J1844N658R117K0721
14176C5720j0112p493Q230k256q929K0010J0533n809l6283l1699r615K3917J5717
14163A931r840m341L437J5259Q08k3908O946k587l434J7369o622p550P738j7370
14149b2164j1240K054N900Q494J2874J3884J1618j0507P164k6346r650M898J0625
14136b396j019J3159P240j9290J6992K3362k7642k3592J2849l65J69k1616k5747
$$ plain form
14226 -35328 -45317 -31122 -4361 29968 41938 8026 -17577 -26351 -46225 -48558 -28374 -26255
14214 -26255 -12929 -13851 -18962 -14955 573 9944 15102 32885 6362 -7226 -734 -2732 -25223
14201 -25223 -26828 -21991 -25498 2038 9544 -8523 -13446 -18899 -4287 10562 4246 -4101 -27149
14188 -27149 -34968 -21379 -9834 -23912 -12338 3472 -13143 -11620 224 5882 14999 35720
14176 35720 25608 18115 26345 24089 15160 35170 45703 39894 3611 -28088 -37703 -13786 1931
14163 1931 -7909 -12250 -8813 6446 7254 -16654 -9708 -12295 -15729 1640 -4982 -12532 -4794 -22164
14149 -22164 -33404 -31350 -25450 -16956 -4082 9802 21420 10913 18077 -8269 -17919 -13021 -2396
14136 -2396 -3415 9744 16984 -2306 14686 38048 10406 -13186 -337 -702 -533 -22149 -47896
14123d7896J3798K4206K3380j6224l939J3689n63j3241K310O545n684J0369J0391
14110A7141Q294K021q861r574j6005k896o570j2533L7281Q043J6292J1945l0627
14097A3951k1289m672J4631l461j1554J1901J1164j115m179J996J6565K1332m768
14084D0502r319J230n179j1366r813o179J8321N807q355j1659j6632L754J6739
14071G851J7877M071m769J4236j5974k0822r948m466P286k043r948L666M111l992
14057a2864R819O419j533k1232p500j409q673L115P521J3785l008j3258J8834
14044i984J773J0232j6809J816N836l420n923j2296K965K1228J2257R718M260
14031B1653K1419M125j4786j6091k2671r660J3963J4398J397j0392Q59K3958L595
$$ plain form
14123 -47896 -34098 -9892 13488 -2736 -6675 7014 6451 -6790 -4480 2065 -3619 6750 17141
14110 17141 25435 27456 18595 9021 -6984 -9880 -16450 -28983 8298 16341 32633 44578 13951
14097 13951 -7338 -12010 2621 -840 -12394 -493 10671 9556 5377 7373 23938 45270 40502
14084 40502 31183 32413 27234 15868 6055 -124 18197 24004 15649 3990 -12642 -8888 7851
14071 7851 25728 29799 25030 39266 23292 2470 -7478 -11944 -4658 -6701 -16649 -12983 -8872 -12864
14057 -12864 -3045 3374 1841 -19391 -26891 -28300 -36973 -33858 -26337 -12552 -15560 -28818 -9984
14044 -9984 -8211 2021 -14788 -12972 -7136 -10556 -16479 -28775 -25810 -4582 7675 17393 21653
14031 21653 43072 47197 32411 16320 -6351 -16011 -2048 12350 13747 3355 4214 28172 31767
14018C1767O406o962j4539L01L871r520n675J1777K2966j0079k0998p895J5219
14005A6639j0244p412K2492N586m838O356p525N277K2K1655j5755k1461k4475
13992a3683o568J5249J1747K2784l05j5062P016J656j8199l396J1637Q553l264
13979A8165k623J8434l392J0232r935k6420N442J3005l475O727l511j5078m908
13966B663j0364j4306J2587k61J4686k5696k8810J4135K0288k323K0892K872j1285
13953d922P149n793r676J3280J1401p334j0850K3941q796j3208N845j534K857
13940B360k037m048M369J0516J8365K6227M227j632j7250l244O200M413k1566
13927B6900J506K1873J5590l716l7970j7263n390K1958o000r705J0912J521q288
$$ plain form
14018 31767 38173 31211 16672 16973 20844 11324 5649 17426 40392 30313 9315 1420 16639
14005 16639 6395 -1017 21475 27061 22223 28579 21054 26331 26353 48008 32253 10792 -13683
13992 -13683 -20251 -5002 6745 29529 29224 14162 21178 22834 4635 1239 12876 21429 18165
13979 18165 15542 33976 30584 40816 30881 4461 9903 22908 19433 26160 22649 7571 2663
13966 2663 -7701 -22007 -9420 -9681 5005 -20691 -49501 -35366 -15078 -17401 3491 6363 -4922
13953 -4922 2227 -3566 -13242 38 11439 4105 -6745 17196 8400 -4808 1037 -497 2360
13940 2360 323 -3725 644 11160 29525 55752 59979 58347 41097 37853 44053 48466 26900
13927 26900 28406 50279 65869 62153 24183 6920 1530 23488 17488 7783 18695 20216 11928
13914A1928R217M58k1651l5266r318P272J2573J9609N527N140j7229n595j0700
13901b8035N359l844m070Q296J6946n034j8935j103J2114J7412Q011Q128j3514
13888A731j7707r493q791k0045l117O006P503n846J3287K0427J0334j1192j4972
13875c1875j1320P988J1840N060L061M687m193M440Q989J291j608j2676N755L597
13861d964k6720J559R376K3507K0283l2777j5513k475n319J1679K2598K727j3288
13848i327k738K613q181N624L736k1405L269K1322J0257j4494k0237J399J5128
13835a3034L783j2394p816m089K208J9716P997q430q524l97J7248J4663J0685
13822B1616k5756j6031o35J1369K8104O372k8581j1885R442J1146j316R101l619
$$ plain form
13914 11928 21145 21603 -48 -35314 -44632 -37360 -24787 -5178 349 5489 -11740 -17335 -28035
13901 -28035 -22676 -26520 -30590 -22294 -5348 -10382 -29317 -30420 -18306 -894 7117 15245 1731
13888 1731 -15976 -25469 -34260 -54305 -57422 -51416 -43913 -49759 -36472 -16045 -5711 -16903 -31875
13875 -31875 -43195 -35207 -23367 -18307 -15246 -10559 -14752 -10312 -1323 -32 -1640 -14316 -8561 -4964
13861 -4964 -31684 -30125 -20749 2758 23041 -9736 -25249 -27724 -33043 -21364 1234 3961 -9327
13848 -9327 -12065 -9452 -17633 -12009 -8273 -29678 -26409 -5087 5170 -9324 -29561 -28162 -13034
13835 -13034 -9251 -21645 -29461 -33550 -31342 -11626 -3629 -12059 -20583 -20980 -3732 10931 21616
13822 21616 -4140 -20171 -20806 -9437 18667 25039 -3542 -15427 -5985 5161 3845 12946 9327
13809I327J304j6693p01j539J3566N194j1840P005L3781J1729k2222M146j5253
13796A7804P430l255m888K6752q737k0429k1682O863j1462k111k503K3788j0072
13783b502M562P053L639j7682Q212J050J2732p569R937K464o790n538n18L913
13769A2963m728o581O25n340j0388j365M466N771J1642k1555N335P126P906N825
13755A1702k7872L595k715J566J0941K1288J3284j7576j9171J0730J2288j0815
13743G245j8644K9868K5294M716M18M34K976k0928q971o643m961q281J1061l678
13729I906q679J75M249M420k8065J3623J6952J4578p258k8792k0029k5230m612
13716e8762j549R029J4477M596j8317J1812J872J131J2279j3656Q105R817J9432
$$ plain form
13809 9327 10631 -6062 -6763 -8302 5264 10458 -1382 5623 39404 51133 28911 33057 17804
13796 17804 25234 21979 17091 43843 35106 14677 -7005 -142 -11604 -13715 -16218 7570 -2502
13783 -2502 2060 9113 12752 -4930 3282 4332 17064 9495 19432 21896 15106 9568 9050 12963
13769 12963 8235 1654 2279 -3061 -13449 -14814 -10348 -4577 7065 -14490 -9155 -2029 5877 11702
13755 11702 -16170 -12575 -15290 -13724 -2783 18505 31789 14213 -4958 5772 18060 7245
13743 7245 -11399 18469 43763 48479 48897 49331 52307 31379 22408 15765 10804 2523 13584 9906
13729 9906 1227 1402 5651 10071 -17994 -4371 12581 27159 19901 -8891 -28920 -54150 -58762
13716 -58762 -60311 -51282 -36805 -32209 -50526 -38714 -36842 -35711 -23432 -37088 -28983 -19166 266
13703B66j197R037k5456j4141K631J6422J2378m552m328j406o906J5444O129j5660
13689a1339N868R575K108P266K868J0156O194n014K62L05l3676k3453J4196K9255
13675A4571j832j1955l124K3004j3351J6702J2923j2672j8564k7465k864M498
13663b0129m753J4921L886j1923p119R764J6331m52P650q568N95m313j696j845
13649g651j035j6508j0870J4534J7905K6499n707l6896p585Q041Q707O04j2348
13636b2310p519l410r453J0522N239P681J001L771K1624J7300J0192j3880j9077
13623A681L3085P607m1326m727N321J2860M631k3675j9487k786K9956K5440M263
13610C2843N686o446l2066j2891L2640K0557L624j7136p988O352J6957j2205l3126
$$ plain form
13703 266 -931 8106 -17350 -31491 -28860 -12438 -60 -4612 -8940 -10346 -17252 -1808 4321 -11339
13689 -11339 -5471 4104 6212 13478 16346 26502 32696 27682 27944 28249 -5427 -28880 -14684 14571
13675 14571 12739 784 -2340 20664 7313 24015 36938 24266 5702 -21763 -24627 -20129
13663 -20129 -24882 -9961 -6075 -17998 -25117 -15353 978 526 8176 -392 203 -4110 -5806 -7651
13649 -7651 -8686 -25194 -36064 -21530 -3625 22874 17167 -19729 -27314 -19273 -10566 -9962 -22310
13636 -22310 -29829 -33239 -42692 -32170 -26931 -19250 -18249 -14478 7146 24446 34638 20758 1681
13623 1681 34766 42373 1047 -3680 1641 14501 19132 -4543 -24030 -26816 3140 28580 32843
13610 32843 38529 32083 17 -12874 19766 40323 43947 26811 18823 25175 42132 29927 -3199
13597c199N014M696j2263k981l910J990n311K0098L2551J3882l0705k6746j0046
13584a6930R656K1430J126l350L355j7744P542K1622J3535j5934N99j1057l4889
13571b1039j0160K0331Q762J5896o834m773J7568l183p867P547J0131j8973j9769
13558a2363O618J7956K1576M123j2898k7717k1025M119J1829K2905j2914k1179
13546a8970j9936j511M729O857p486M774Q287J7438L1472M82j5631m758j4268
13533h521M043J070O757J1317n129j9264p355M613K2403q168k0909J8844J3360
13520A3061K308M239p06r684J517K205M230n652j8072L869k6Q478R568k1739J6098
13505I694q148m382K6107M120l4627P528n0j430M391P355j5611j8730K2774K0827
$$ plain form
13597 -3199 1815 6511 -5752 -8733 -12643 -10653 -15964 4134 36685 50567 19862 -6884 -16930
13584 -16930 -7274 14156 15282 11932 15287 -2457 5085 26707 40242 24308 24907 13850 -21039
13571 -21039 -31199 -10868 -2106 13790 6956 2183 19751 16568 8701 16248 26379 7406 -12363
13558 -12363 -5745 12211 33787 37910 25012 -2705 -23730 -19611 -7782 15123 2209 -18970
13546 -18970 -38906 -40417 -35688 -28831 -36317 -31543 -23256 -5818 25654 26136 10505 5747 -8521
13533 -8521 -4478 -3408 3349 14666 9537 -9727 -17082 -12469 9934 1766 -19143 -299 13061
13520 13061 15369 19608 18902 9218 10735 12940 17170 11518 -6554 -2685 -2711 5767 15335 -6404 9694
13505 9694 1546 -2836 23271 27391 -7236 292 242 -1188 3203 10558 -5053 -23783 -1009 19818
13491A9818j8049k2038k757J6003J1565r213R12j5318r224J7920J706p541m129
13478b0345P109K1079j3903j6093l27R990K7104j3211j3905J1827R494k649p914
13465a744J0862n190p158J2633O917j822j1340m700J8999M864j6951q855l493
13452f978J1204j450J8106q093l458j3055j1837Q309J0104P397j5561j3705j0092
13439b9109k3005K3055J2047M832Q537j1548M387J2547j938q646J4587K9879J4340
13426D9965j8348o887q648K436Q586k5161j3899J7471j8145J218N786J5632j0535
13413e29J285j390J04J2152K6896j4197k527j772q93j2852o369p511n33r447M29
13398a7154q593J7739m210n657R652J7854Q107N196j9521k8202Q633K3326J345
$$ plain form
13491 19818 1769 -20269 -23026 -7023 4542 -4671 -3759 -19077 -28301 -10381 -8675 -16216 -20345
13478 -20345 -13236 7843 -6060 -22153 -22480 -12490 14614 1403 -12502 -675 8819 6170 -1744
13465 -1744 9118 3928 -3230 9403 16320 14498 3158 -1542 17457 22321 5370 -3485 -6978
13452 -6978 4226 2776 20882 12789 9331 -3724 -15561 -7252 2852 10249 -5312 -19017 -29109
13439 -29109 -52114 -29059 -17012 -12180 -3643 -15191 -10804 1743 -195 -8841 5746 35625 49965
13426 49965 31617 24730 16082 18518 27104 1943 -11956 5515 -12630 -11412 -5626 10006 -529
13413 -529 756 -634 -530 11622 38518 24321 21794 20022 19129 6277 -92 -7603 -8136 -17583 -17154
13398 -17154 -25747 -8008 -12218 -17875 -8223 9631 17738 22934 3413 -24789 -16156 7170 8515
13385H515p201J293j3063M261n069j9225j3477J7875K2030k757j584N923j8940
13372b1419q575j011L509K460L041J146J0339k829O202J7722P43m149p57j2826
13358f404j8455J4958J3901Q489P470m915m0565k8681J6038L9500J2193j3850
13346c21o413k8930q197L1987K6337O826p983k0588Q812J1626N369o930l896o454
13332A245r146J6794n344p532J2501M928l16L194J3216O132k5306j2960L168K5074
13318B5648J0461l1968o934j2788J1035o093QK778J5760J8918J835j9479Q001
13305A7182N397k8792m47P467l558J2910J4910J269K503K7068q088k4306j3292
13292A0223m457O289j632k168N274J1220p218J74K568l3251n818P875P278j354
$$ plain form
13385 8515 1314 2607 -10456 -6195 -11264 -30489 -43966 -26091 -4061 -6818 -8402 -2479 -21419
13372 -21419 -29994 -31005 -27496 -25036 -21995 -20849 -10510 -13339 -7137 10585 11328 7179 6422 -6404
13358 -6404 -24859 -9901 4000 12489 19959 15044 -25521 -54202 -38164 1336 13529 -321
13346 -321 -6734 -35664 -43861 -11874 14463 21289 13306 -7282 1530 13156 18525 11595 7699 1245
13332 1245 -7901 8893 3549 -3983 8518 13446 13130 16324 29540 35672 10366 -2594 574 25648
13318 25648 36109 4141 -2793 -15581 -4546 -10639 -10631 -7853 7907 26825 28660 9181 17182
13305 17182 22579 -6213 -6660 807 -2751 10159 25069 26338 28841 55909 47821 23515 10223
13292 10223 5766 12055 10423 8255 13529 24749 17531 17705 20273 -12978 -18796 -10921 -3643 -4997
13278d997O814k7888k531k82K3247J4035k6533m486K0871J4152J4842K5028J578
13265E3850k983j4957J646j3742K061l114r530k9375j0367K4798R608J2552j950
13252A8497k6509K381n663L268J2663K405k185J7845J4358L634j5254k0686M887
13239I641q748l15O313N798J1215K249l0011o469J1824J0068J6966r396q45n321
13225A2969J226P4l736o070j168Q285K4426j3246j1136k29o439o990j231K140
13211a125J5020Q366j6834j0782M839N891o672J4051r788j7355K1620m817k909
13198d95P112J8826K647m741K307o534j5393K139p311j7194O330p22K389j0317
13184b0957J1449J6598q065j7424O530J0062R202J2474J0239j2962l5832P850
$$ plain form
13278 -4997 1817 -26071 -28602 -28884 -5637 8398 -18135 -22621 -1750 12402 27244 52272 53850
13265 53850 50867 35910 37556 23814 25875 22761 13231 -16144 -26511 -1713 7895 20447 18497
13252 18497 -8012 -5631 -11294 -8026 4637 7042 4857 22702 37060 40694 25440 4754 9641
13239 9641 893 578 6891 12689 23904 26153 -3858 -10327 1497 11565 28531 19135 18290 12969
13225 12969 14195 14269 10533 4463 3295 11580 36006 22760 11624 11395 4956 -2034 -3265 -1125
13211 -1125 13895 22261 5427 -5355 -516 5375 -1297 12754 2966 -14389 7231 2414 -495
13198 -495 6617 25443 28090 23349 25656 19122 3729 5868 -1443 -18637 -12307 -13029 -10640 -20957
13184 -20957 -9508 7090 -975 -18399 -11869 -1807 7395 19869 30108 17146 -18686 -10836
13172a0836J2614L995J0359p298l501M964K257R951J0852k152k3332j2193j5746
13159b0066J95J1142n026k53J133j0883j0393J8753J4908J7250j2176k4457k794
13146b2667J2641J6478p476l138j592k205m24j164K2833n780j456K1266n126k0560
13132A630k864J0744K9138l522r949j515j9322J438N276j6622o868J3978J6522
13119A8064J8569q80j5358j0968p062P079j3828L232R514J2065O709j9374r8n363
13105B301J0160k4569j4710l22K8099L4312j6904j4312M560p321m134o945J8880
13092I095J8325L323J252k0142K918J0873m11J2248j0805j2045j4440R515K0829
13079C0535k282j3699K271j8379j3786J5287O592R405j287J1322j2746k6267o719
$$ plain form
13172 -10836 1778 5773 16132 8834 5333 10297 12554 22505 33357 31205 7873 -4320 -20066
13159 -20066 -19871 -8729 -13755 -14008 -12875 -23758 -34151 -15398 -490 16760 4584 -19873 -22667
13146 -22667 -10026 6452 -1024 -4162 -5754 -7959 -8383 -9547 13286 7506 6050 27316 22190 1630
13132 1630 -1234 9510 38648 35126 25177 23662 4340 5778 11054 -5568 -12436 1542 18064
13119 18064 36633 35753 20395 9427 2365 9444 -4384 -1152 8362 20427 27136 7762 7664 2301
13105 2301 12461 -12108 -26818 -27140 959 35271 18367 4055 8615 1294 -2840 -9785 9095
13092 9095 27420 30743 31995 11853 14771 25644 25233 37481 26676 14631 191 9706 30535
13079 30535 28253 14554 16825 -1554 -15340 -53 6539 15944 14657 25979 13233 -13034 -19753
13066a9753p254Q08j0697R857J1266J5740n409j4731j1261k253J2854J7236R927
13053F330J9362L72l5317k1688o277J7714L2724M367r906N978n324K214O442K402
13039A9393L839j0110j4889N448k217j1842L508J7780o312N006K2459j2496j653
13026A7914m833p623n426J784N91k10j2182k209J1498P972q795j4183K1230J9697
13012B5225l300k8717n381M556q419p372r815J4575J7309o53o725r769J2320p076
12998a3242q226o404j8930L990K6799J324L3930L347j9070J5566J7374j191j5894
12985A9373O76J982Q02M29j7947J4418P13J95L748q303j058o763J0237l710j0293
12970D499j2616M569K0163J2693K304n018R010q788k0875p559j8111j2383J4715
$$ plain form
13066 -19753 -27007 -26199 -36896 -27039 -15773 -33 -5442 -20173 -31434 -33687 -20833 -3597 6330
13053 6330 25692 26064 -9253 -30941 -37218 -19504 13220 17587 7681 13659 8335 10549 16991 19393
13039 19393 23232 13122 -1767 3681 1464 -10378 -6870 10910 4598 9604 32063 19567 17914
13026 17914 13081 5458 32 1816 2407 2197 -9985 -12194 -696 7276 -1519 -15702 5528 25225
13012 25225 21925 -6792 -12173 -7617 -16036 -23408 -33223 -18648 -1339 -1992 -8717 -18486 -6166 -13242
12998 -13242 -21468 -27872 -46802 -42812 -16013 -14689 19241 22588 3518 19084 36458 35267 19373
12985 19373 20049 22031 22833 23262 5315 19733 20446 20641 24389 16086 15028 8265 18502 14792 4499
12970 4499 -8117 -3548 16615 29308 31612 26594 35604 26816 5941 -1618 -19729 -32112 -17397
12957a7397M100j5555J8724j6587j7068L860J6147J8676J4863l253l632j0436
12945g558P503O417r661j0242K3503P227q8k303p448j1123J2036O707j8375j0898
12931a4303q936q269O194R722L397p958L671J377j1829o462M304R555j8338M414
12917c3461K8904K2424l149k9077r72P154n317k952j1046p026O775J2101J0809
12904d833J7881R119J663j0911O2l23j9880j4637j0056k9955p967L2384K2244
12891a5209L550n047K59K4690J6288j5836j0080p068P41o720K1416R987o744P913
12877A8140r65J4133j7412n904N128j9086m802K985O092P725K0866Q968j363k3914
12863A0591O464P241j294j4423k6952R367N549J7792L651J6116L4372k357m3216
$$ plain form
12957 -17397 -13297 -28852 -10128 -26715 -43783 -39923 -23776 -5100 9763 6510 2878 -7558
12945 -7558 -55 6362 -3299 -13541 9962 17189 17101 14798 7350 -3773 8263 14970 -3405 -14303
12931 -14303 -23239 -31508 -25314 -15592 -12195 -20153 -16482 -15105 -26934 -33396 -29092 -19537 -37875 -33461
12917 -33461 -4557 17867 14718 -14359 -15331 -8177 -13494 -16446 -27492 -34518 -27743 -15642 -4833
12904 -4833 13048 22167 23830 12919 12981 12658 -7222 -21859 -31915 -61870 -69837 -37453 -15209
12891 -15209 -11659 -16706 -16447 8243 24531 8695 -1385 -8453 -7712 -14432 6984 16971 10227 18140
12877 18140 17175 31308 13896 7992 13120 -5966 -10768 -7783 -1691 6034 26900 35868 34505 10591
12863 10591 17055 24296 23002 8579 -18373 -9006 -3457 14335 17986 34102 68474 66117 22901
12850B2901k8224P997O678j6812r03N511Q196J2659l009j8644j6272M061J5281
12837e80J030o065j6682q096R799O180R544r264J4029K2916R12J392Q81j0983
12823A5013J3887N841l2048k0191m654m130J9396J3611Q673J7989J1839j6054
12811B9172j5141L32P371P308k886L047L196k5010j7851Q297m260Q478p363O045
12797G35L404J3790J905j9021nj783j0250j5699k127J310R392j5244J4633J0297
12783h663j77O668j4126L731Q901J453q014J2084M102j8227K874J4363n376J5150
12769A4743l902m394l1693J580J9206K8412K395r774l6521k356J864O849k440
12756a6031K762J373J2172Q778J5629j4096K9o84j256o504n296j780L791j4156
$$ plain form
12850 22901 -5323 2674 9352 -7460 -8363 -2852 5344 18003 14994 -3650 -19922 -15861 -580
12837 -580 450 -5615 -22297 -30393 -20594 -14414 -4870 -14134 -105 22811 23723 25115 25996 15013
12823 15013 28900 34741 2693 -17498 -22152 -26282 -6886 6725 15398 33387 45226 29172
12811 29172 14031 14363 21734 29042 26156 29203 32399 7389 -10462 -2165 -6425 2053 -5310 735
12797 735 4139 17929 19834 813 808 -975 -11225 -26924 -29051 -27741 -18349 -33593 -18960 -8663
12783 -8663 -8840 -2172 -16298 -12567 -3666 -2213 -10227 1857 5959 -12268 -9394 4969 -407 14743
12769 14743 10841 6447 -25246 -23666 -4460 23952 26347 16573 -19948 -22304 -20440 -13591 -16031
12756 -16031 -13269 -11896 276 9054 24683 10587 10616 9932 8676 2172 -3124 -4904 -1113 -15269
12742a5269k601J7227L696N730r872Q351K0871j4949j362O117r640J5403Q670
12729C2372R292O629q128k6567k7626K870k89p214P668J9493J7198o468k808M05
12715A6827m258l28j099q066j8251j27n390Q863P970m41K821o868L351Q089j5020
12700a1927k956o88j6799K839J4860J4365J9252J7951r660n04k928M386j4235
12687A3956j2718l91p241J666k0419k161j1083O665K1214J0999R011L0529r878
12674C0149k2096q772J2040j7321k4909Q945n600l320N231J4250J6655o878j0784
12661a2410J2848m111k6707L0J0090M876q87R421P234m154O848Q603j4004K749
12647D26q29j2153q860m517R885K1932k4280j8876J4219K094J0077l296j6133
$$ plain form
12742 -15269 -17870 -643 3053 8783 -1089 7262 28133 13184 11822 17939 8299 23702 32372
12729 32372 41664 48293 40165 13598 -14028 -11158 -11447 -18661 -10993 8500 25698 19230 16422 16827
12715 16827 12569 12241 11142 3076 -15175 -15302 -20692 -11829 -3859 -4300 -1479 -8347 -4996 3093 -11927
12700 -11927 -14883 -15571 -32370 -29531 -14671 -306 18946 36897 27237 26733 23805 28191 13956
12687 13956 1238 847 -6394 -4728 -25147 -27308 -38391 -31726 -10512 487 9498 40027 30149
12674 30149 8053 -719 11321 -6000 -30909 -21964 -27564 -30884 -25653 -11403 5252 -1626 -12410
12661 -12410 438 -3673 -30380 -30350 -20260 -15384 -16271 -6850 384 -3770 3078 11681 -2323 426
12647 426 -403 -12556 -21416 -25933 -16048 5884 -18396 -37272 -23053 -20959 -10882 -14178 -30311
12634c0311j378m343Q988J5192k6087N756K487K27P544M163n642n970j791J1437
12620a9728J2607K4384q238J032r522k4756M740R189J4854K154l461m195K58j407
12606b089M739J314J3933J3054j6579k4300P52P483J7115J4851m153j3133k902
12593A0085q778m109L330n081j1585J1448q631k7388J7322L047n057M769J5949
12580d679P326q422j9631J0481J5430m754k6547N532J1313j0845l837J7131O188
12567e314r326p207j2623p236q972k0854l043K0408K7083K1688J260O40n196M489
12553d203J045R62R496J0992n821Q525M030k6925M487m325l932K3934J4402r893
12539B2774k5747r459K237P491J4152J9329K219j116O926k074l4321j4810R681
$$ plain form
12634 -30311 -31689 -36032 -27044 -11852 -37939 -32183 -29696 -29469 -21925 -17762 -23404 -29374 -31165 -19728
12620 -19728 -7121 17263 9025 10057 535 -24221 -19481 -10292 4562 6716 3255 -940 -682 -2089
12606 -2089 2650 3964 17897 30951 14372 -9928 -9176 -1693 15422 30273 26120 12987 10085
12593 10085 1307 -2802 528 -4553 -16138 -4690 -13321 -40709 -23387 -20340 -25397 -20628 -4679
12580 -4679 2647 -5775 -25406 -14925 505 -4249 -30796 -25264 -13951 -24796 -28633 -11502 -5314
12567 -5314 -14640 -21847 -34470 -41706 -50678 -71532 -74575 -54167 -27084 -5396 -4136 -3496 -8692 -4203
12553 -4203 -3158 -2196 7300 18292 12471 20996 25026 -1899 2588 -1737 -5669 18265 32667 22774
12539 22774 -2973 -12432 -10195 -2704 11448 30777 32996 31880 38806 36732 2411 -12399 -2718
12526b718M254n618r952J9799P277j0253k1551J0851L044m980m01p577j7109J260
12512c3674L75n212k183K251j6111P774K0528J4068J346Q15J764M423Q7N782k685
12497f52J3206J6447p984j3280K849j0581L771Q485r687n905O647O307J2139M166
12483B5928k1538j8093O630J0484L363J558n812O409N082p06j1974m817J5890
12470A2404J1539j707q034l816M527j6852p213Q346M488Q520r309L271J2922j2023
12456G063j749J490R271q841l416j688k213o233l014K320j2732k0968K0216J3868
12442f626K85j694Q898K064j4975J337n793j4279l967J3285J7883M360l300J4121
12428A1599K300j0473k592L520l0433r274O117Q672K2773N928L615j5596j3480
$$ plain form
12526 -2718 1536 -4082 -14034 5765 13042 2789 -18762 -7911 -4867 -9847 -10248 -17825 -34934 -33674
12512 -33674 -33299 -38511 -40694 -38443 -54554 -46780 -26252 -12184 -10838 -10023 -8259 -3836 -3749 2033 -652
12497 -652 12554 29001 21017 7737 10586 5 3776 12261 2574 -3331 3316 9623 21762 25928
12483 25928 4390 -13703 -7073 3411 6774 8332 2520 8929 14011 13305 1331 -3486 12404
12470 12404 23943 22236 14202 10386 14913 -1939 -9152 -806 3682 12202 2893 6164 19086 7063
12456 7063 5314 6804 16075 7234 3818 2130 -83 -6316 -9330 -7010 -19742 -40710 -20494 -6626
12442 -6626 -6341 -8035 863 2927 -12048 -10711 -16504 -30783 -34750 -21465 -3582 778 -2522 11599
12428 11599 13899 3426 834 4354 -26079 -35353 -29236 -20564 2209 8137 11752 -3844 -17324
12415a7324j373J119K7123J5386j4187p91k60J270J598K815j2866j0695q697Q785
12401h097O337j9371k872N826M970j6228K4051K6575n67m064k7213J1035J4443
12388A4825k0833m903j3405j1206P241P69n3J6427M647O781J0070J8130R634o565
12374C1559k2060j1664J3645M999j2488j37L148j166N262L237j3988Q015O902
12361A5264N69k1930Q702j9925k7264l116J5082n085Q674J3801Q143J4930K375
12348A0220j212k017j3001j609J5270J9334o965k4702L94L26P353Q786j8870j2508
12334a9201J6622K8549P261m226l559k4251j4944J3044Q914J3431J607J7o349
12321A6915l954J5462q59k0245J0866J5760P149j0342j8050j0043p597N529Q14
$$ plain form
12415 -17324 -18697 -17578 9545 24931 10744 9953 9693 10963 12561 15376 2510 -8185 -16882 -8097
12401 -8097 -1760 -21131 -24003 -18177 -13207 -29435 -5384 21191 20624 16560 -10653 382 14825
12388 14825 -6008 -10911 -24316 -35522 -28281 -27512 -27565 -11138 -6491 290 10360 28490 38124 31559
12374 31559 9499 -2165 11480 16479 3991 3854 7002 5836 11098 14335 347 8362 15264
12361 15264 15833 -6097 2605 -17320 -44584 -47700 -32618 -37703 -29029 -15228 -7085 7845 10220
12348 10220 9008 6991 -6010 -7619 7651 26985 20020 -4682 -4288 -3962 3391 12177 -6693 -19201
12334 -19201 -2579 25970 33231 29005 25446 1195 -13749 -705 8209 21640 23247 23264 16915
12321 16915 12961 28423 27564 7319 18185 33945 41094 30752 12702 2659 -4938 591 1405
12308A405p858l977k7446j7837J1896J1726P969K9905M863K783n260k1122Q473
12295d480J3303j672j8725j2616N730J0611Q053n093R031l590L918K269q630j0571
12281a2462m570N646P697J2392Q699k2115m260m66j789n907j2378O03K1703M280
12267b927O927r281j8734j7381P128J7654P456R485P56j1489K6281J1834L158
12254C0867O880j7834m470R614j3263k3430p819J1106m055L034P254L226L755
12241D865J0384q29k791n147j1510l1880L546R838J2795J5103O280O911l08J47
12227A7404m741r436K6976R010o658l537l662j1504l739R487L632N6j8360k2489
12213a7561P212L258J9876J4167l664J018k972j947p903j6289J7891K066Q48j5244
$$ plain form
12308 1405 -6453 -10430 -37876 -55713 -43817 -32091 -24122 5783 10646 13429 8169 -12953 -4480
12295 -4480 8823 7151 -11574 -24190 -18460 -7849 204 -4889 4142 552 4470 6739 -1891 -12462
12281 -12462 -17032 -11386 -3689 8703 17402 -4713 -8973 -9439 -11228 -17135 -29513 -28910 -7207 -2927
12267 -2927 4000 -5281 -24015 -41396 -34268 -16614 -9158 327 1083 -10406 15875 27709 30867
12254 30867 37747 19913 15443 25057 11794 -11636 -19455 -8349 -12404 -9370 -2116 1110 4865
12241 4865 15249 14420 11629 6482 -5028 -36908 -33362 -23524 -10729 4374 10654 17565 17257 17404
12227 17404 12663 3227 30203 39213 32555 29018 25356 13852 10113 19600 23232 23288 4928 -17561
12213 -17561 -10349 -7091 12785 26952 23288 24306 21334 19387 11484 -4805 13086 15152 16000 756
12199G56j3186M875j6794N163J1085L805q594m636J3858J2832J925Q702p620j4423
12185b252q695p145K342j0906j2506M630J1706M574r256M505J6837P802j0563
12172h927K0987K3815j4714j3933j5640p888J297m841K498K3438J0694K438K0389
12159C9613j8295l102J1055j5341o474j1389l5m81J0215R325K37j2565J6607J4175
12145C3545j6360L841j0960j3857M822j3376r393J5958J5202O995L836R820J2832
12132D2905p462o586p893P309J1636k0567j0316L027n060q131J1423R620Q419
12119B8324L059j5071N651L238J2405K7459k2084k1733K91p376k4051j1930N379
12106a6439j03p127j0557L710J3576K0268P365J467J6279j1303l973k0266j4769
$$ plain form
12199 756 -12430 -7555 -24349 -19186 -8101 -4296 -12890 -17526 -3668 9164 11089 19791 12171 -2252
12185 -2252 -10947 -18092 -15750 -26656 -39162 -34532 -22826 -18252 -27508 -23003 -6166 1636 -8927
12172 -8927 12060 35875 21161 7228 -8412 -16300 -15003 -19844 -17346 6092 16786 19224 39613
12159 39613 21318 18216 29271 13930 7456 -3933 -3968 -4449 5766 15091 15328 2763 19370 33545
12145 33545 17185 21026 10066 -3791 1031 -12345 -21738 -5780 9422 16417 20253 30073 42905
12132 42905 35443 28857 20964 28273 39909 19342 9026 12053 6993 -1138 10285 19905 28324
12119 28324 31383 16312 21963 25201 37606 65065 42981 21248 21539 14163 -9888 -21818 -16439
12106 -16439 -16542 -23669 -34226 -30516 -16940 3328 10693 12160 28439 17136 13163 -7103 -21872
12093b1872k79P076K073m817k032P928n203q469Q762R07j3893J6222K3805k988
12079G220O56K7662j9260j5505j516j4168R314m235j291p484R952O625j0109O954
12065e185J217N998n328j2437j0392n342R587J0309J406n328m935m824J1845N315
12051h094q008J623l007q985N043J0003r148J4735J8467r83J4954K0915J1818
12038E9333j4252j9811p742R390J4761q393o622L862l4979j1537q106j5011J8418
12025b0689j292J7534K6258n893l467m886P177j0623r558P95m550j9262q515O806
12011c0165K2838r833K947L310J795q920Q436R180K098m424k3502M36K567P39
11997b2498p631P957K2663k928k066k295j6858n33M509l982J4420R164J7305j6140
$$ plain form
12093 -21872 -22151 -15075 -13002 -17819 -19851 -11923 -17126 -25595 -16833 -15926 -29819 -13597 10208 7220
12079 7220 7876 35538 16278 773 -743 -14911 -5597 -9832 -11123 -18607 -8655 -2030 -12139 -5185
12065 -5185 -3968 2030 -3298 -15735 -26127 -31469 -21882 -11573 -10167 -15495 -20430 -25254 -13409 -8094
12051 -8094 -16102 -14479 -17486 -26471 -21428 -11425 -20573 -5838 12629 11646 26600 47515 59333
12038 59333 45081 25270 17528 26918 41679 33286 26664 30526 -4453 -15990 -24096 -39107 -20689
12025 -20689 -21981 -4447 21811 15918 12451 7565 14742 4119 -5439 -4644 -9194 -28456 -36971 -30165
12011 -30165 -7327 -17160 -14213 -10903 -9108 -18028 -9592 -412 1686 -2738 -26240 -25804 -23237 -22498
11997 -22498 -30129 -22172 491 -2437 -4503 -6798 -23656 -24189 -19680 -23662 -9242 -78 17227 1087
11983A087l1038K463J4526J0952k692j2982o966k3410J3443N403j2956J6773K9068
11970C671N156N71j123M590O987p432L7N622q244J3181P192R133p80k8825k5717
11955a5981N865q185M290K7532j925M391J4170m5k9349q071o882J2967K2719N436
11941B6932p939o247k1496m967J3085j195n092J0685k8946j0713M16K7455J3201
11928E179j9457j021K2306J9270N130r869j6172r325J760J0965L185n919k2333
11915a6301M015l99j4310J6299J8402l97j7401M222J8947l129p141J1013L448
11902A7268R818m625k0536J3721K9531J731l3070j053n773j677j7916K006l397
11889a3972m504J0965j4138n774L661O098l187J2738K447j7454j7387J2814J7919
$$ plain form
11983 1087 -29951 -27488 -12962 -2010 -4702 -17684 -24650 -48060 -34617 -29214 -42170 -25397 3671
11970 3671 8827 9398 8275 12865 19852 12420 12457 18079 9835 23016 30208 39341 38561 9736 -15981
11955 -15981 -10116 -18301 -14011 13521 11596 15987 30157 30112 763 -7308 -14190 -1223 21496 26932
11941 26932 18993 12746 -8750 -13717 -632 -1827 -6919 3766 -25180 -35893 -35477 -8022 5179
11928 5179 -14278 -15299 7007 26277 31407 21538 5366 -3959 -2199 8766 11951 6032 -16301
11915 -16301 -12286 -12685 -26995 -10696 7706 7309 -10092 -5870 13077 9948 2807 13820 17268
11902 17268 27086 22461 1925 15646 45177 46908 13838 12785 7012 5335 -12581 -10575 -13972
11889 -13972 -18476 -7511 -21649 -27423 -23762 -17664 -20851 -8113 -5666 -23120 -40507 -27693 -9774
11876i774K902Q932N114n234n790J4969J0371j3530o468M390K0810l055o355n156
11862A2126j2498R262J613q808j4850p683J842l245j3012N076R589K3861Q79R574
11848A3726R009m649p211l894J305N918R442K30n855K33N793J9486J5054k7738
11834C0849k0659L970K0963k1177k7744j5504j2260J5483K8449O029m544P772
11822A1627K0502M627k816k3058q831K3587o434j7306j5049p01P279K44K324q44
11808d849j4041m761k085m405J4015J1909P691k935j6613J3665j516m776K098
11795f603K1720M792l5782j3293N58P66K8175k194r461n999M779j0992m446K1690
11781f290R839R963k788m65J045N026j2683n139J679j1151N840O595p418o714
$$ plain form
11876 -9774 -6872 2060 7174 1940 -3850 11119 21490 7960 1492 5882 26692 23637 17282 12126
11862 12126 -372 8890 10503 1695 -13155 -20838 -18996 -22241 -35253 -30177 -20588 3273 4152 13726
11848 13726 22735 18086 10875 6981 8286 14204 23646 23876 18021 18254 24047 43533 58587 30849
11834 30849 10190 14160 35123 13946 -13798 -29302 -41562 -26079 2370 8399 3855 11627
11822 11627 32129 36756 33940 10882 2051 25638 19204 1898 -13151 -13852 -6573 -6329 -4005 -4849
11808 -4849 -18890 -23651 -25736 -30141 -16126 -4217 3474 539 -16074 -2409 -3925 -8701 -6603
11795 -6603 15117 19909 -15873 -29166 -28608 -27842 333 -1861 -11322 -17321 -12542 -23534 -27980 -6290
11781 -6290 3549 13512 10724 10259 11304 16330 3647 -1492 187 -10964 -5124 1471 -5947 -12661
11767a2661n222J0696J8638N018j3774J4283R048j608M248j074k8406p301n206
11754a3321N123K2149N086J862j106J650o233M733j6703k0107O543L2575K454
11741B4705q979L784P838r150p012o751J0447k89j5732J2465J0722J5330r686
11728B7692j1350l082p360p565j3428M614J3302N944m179P206j3596k3454j0732
11715c5988J4621J4304q965j8057N31P586q069O312J3161o238K026q213J6411
11702a0578O701j222O29J0875K8882l018k4002p896l034%r856q662j4272J3360
11688b2093J1847q906L203J8190J0566j16K640J0040J2514r902j1004n607K100
11675A3472o67O004J0909l1732M145K4536K125p083j4931R71J1467q406j1338
$$ plain form
11767 -12661 -17883 -7187 11451 16469 2695 16978 26026 24418 28666 27592 -814 -8115 -13321
11754 -13321 -8198 13951 19037 20899 19793 21443 15210 19943 3240 -16867 -10324 22251 24705
11741 24705 15726 19510 27348 18198 11186 4435 14882 14593 -1139 11326 22048 37378 27692
11728 27692 16342 13260 5900 -1665 -15093 -10479 2823 8767 4588 11794 -1802 -25256 -35988
11715 -35988 -21367 -7063 -16028 -34085 -33554 -25968 -34037 -27725 -14564 -20802 -18776 -26989 -10578
11702 -10578 -3877 -5099 -4470 6405 35287 32269 8267 371 -2663 -2663 -12519 -21181 -35453 -22093
11688 -22093 -10246 -19152 -15949 2241 12807 12691 15331 25371 37885 27983 16979 11372 13472
11675 13472 12805 18809 29718 -2014 2131 26667 28792 21709 6778 7749 19216 10810 -528
11662e28p319l681K7605R298q436j3153j4271j346K1833J1422Q81k501j1294L162
11648A1672J627o868q822j6271m920J1392N442j3925j3689J7622J0381N53J5770
11635I964j0925j5390N060P365M759q417j3538N233R582J8374k012O872J9109
11622C6036o726j3172N678J2354J6986j6338k4785j3701j0676o38J9257K682j1688
11609d731n458j1333j0595O919R82j5008P47J4664J4306O640J0245O851r299q960
11595d030o175j2292j5925N539K1928Q001l540l405J2069j5626k16l317m471J2889
11581h571m272k638o925P585J7795j141j1198k539J4424L141m857O987M756J8192
11567C0739M390j0224J0996j1556k7421J5250J4321q767j7485m673J7866J9348
$$ plain form
11662 -528 -7847 -11528 16077 25375 16939 3786 -10485 -11831 10002 21424 22305 19804 8510 11672
11648 11672 13299 6431 -2391 -18662 -23582 -12190 -6748 -20673 -34362 -16740 -6359 -5806 9964
11635 9964 -961 -16351 -11291 -3926 833 -7584 -21122 -15889 -6307 12067 10055 16927 36036
11622 36036 29310 16138 21816 34170 51156 34818 10033 -3668 -14344 -14982 4275 6957 -4731
11609 -4731 -10189 -21522 -32117 -25198 -24216 -39224 -38477 -23813 -9507 -2867 7378 14229 4930 -4030
11595 -4030 -10205 -22497 -38422 -32883 -10955 -2954 -6494 -9899 2170 -13456 -13672 -16989 -21460 -8571
11581 -8571 -12843 -15481 -22406 -14821 2974 1833 -9365 -11904 2520 5661 804 7791 12547 30739
11567 30739 35129 24905 35901 24345 -3076 12174 26495 17728 243 -4430 13436 32784
11555C2784n802o611Q321J6648K0105j7898l2250j3284P954R277j721J1999j978
11542B7544O759P227j2084j1754j3342k850L123j1878r833J3390R615j7849O693
11529e239N094J2547Q298Q04k4242j9626n189K0250M940J0040L244j5435J1702
11516G188p344n643l76j6440j0557l469R716K0896J0789p526M799J1602j5983
11503b348l298J828J584j066R994j984j5765k9060o813J7102L9032P462o421q251
11489A996P761M251j3234M22J0568k4496j2094J2189Q722J4832R99j1047O320
11476G189J2279j1797k0069j1713L100J5541K0265k150j7100M360J2124R996j8258
11463C767L648K7377L675j3695j3837p478n515M884j453j415k4526j7752J9329
$$ plain form
11555 32784 26982 20371 28692 45340 65445 47547 15297 2013 9967 19244 17523 29522 27544
11542 27544 34303 41530 29446 17692 4350 1500 4623 -7255 -17088 -3698 5917 -11932 -5239
11529 -5239 -145 12402 20700 21504 -2738 -22364 -27553 -7303 -2363 7677 10921 -4514 7188
11516 7188 -156 -5799 -6175 -22615 -33172 -36641 -26925 -6029 4760 -2766 2033 13635 -2348
11503 -2348 -5646 -3818 -2234 -3300 6694 4710 -11055 -40115 -46928 -29826 9206 16668 10247 1996
11489 1996 9757 14008 774 1196 11764 -12732 -24826 -12637 -3915 10917 11916 869 7189
11476 7189 19468 7671 -12398 -24111 -21011 -5470 14795 12645 -4455 -95 12029 22025 3767
11463 3767 7415 34792 38467 24772 10935 3457 -2058 2826 1373 -42 -24568 -42320 -22991
11450b2991M202k949J129j8652J6751J4889L734J3956k344L1750J752k849j2531
11437B5847j7854k4736k46P935L837O126j3110L0550K6272l8214j8436n118J1141
11424f006J2996J0603l95j2589O792j1472j7068N08J2965J3845J0327K714J1436
11411C4656l162l302Q847j0989k794Q174j096J874k3348p559n308J4165M4600
11398E4758Q571q414k7492k9272J074J036j3436R463P107O420Q134P027j9131
11385E845M33J2206k345j1867O207J8232N367k7677k0607J5904K3403l618K743
11372B4226k549r316j1028j1747K1229R862M031J059k3744J177m965j0746K8966
11359A6455J4167j1330q894k4999p714K4443k498Q682o290j2976j0562P435J0336
$$ plain form
11450 -22991 -18789 -21738 -20609 -39261 -22510 -7621 -3887 10069 7725 39475 41227 38378 25847
11437 25847 7993 -16743 -16989 -9054 -5217 909 -12201 18349 44621 6407 -12029 -17147 -6006
11424 -6006 6990 17593 17198 4609 11401 -71 -17139 -16631 -3666 10179 20506 23220 34656
11411 34656 31494 28192 37039 26050 23256 31430 30334 32208 8860 1301 -4007 10158 54758
11398 54758 63329 54915 27423 -1849 -775 261 -13175 -3712 3395 9815 17949 24976 5845
11385 5845 6278 18484 16139 4272 10479 28711 34078 6401 -14206 1698 25101 21483 24226
11372 24226 21677 12361 1333 -10414 10815 20677 24708 25767 2023 3200 -1765 -12511 16455
11359 16455 30622 19292 10398 -14601 -22315 2128 -370 8312 2022 -10954 -21516 -14081 -3745
11346c745J6214J4491o352k472k3036k2897r22K4374J4722j677J0330L457o682
11333A5805j3677J2495J057J877j008j8271q045J2875P101j0849m34J2370m434
11320F862n439J8186M817P819n201r926k3092j1971R019J89q34N455M459L102
11306C445J8312N145p174r790P168J3217o29r429P721n323k563M947m672j1096
11292I279R67j3629o449m759j3786J7209J569O708q25K487K9585P411r838r925
11278A6004q807q192l611K996K6066j0124J4096k1062k9495Q656P141J8661p995
11265D334l502J2802r559R126n660j6802l372K231l262j5565K207P858J8311K3822
11251B2969K99k6966m827P554M746j4555J653j3148m09K4135J8581j3594j5301
$$ plain form
11346 -3745 12469 26960 20608 18136 -4900 -27797 -28719 -4345 10377 8700 19030 22487 15805
11333 15805 2128 14623 15680 17557 16549 -1722 -9767 3108 10209 -640 -1074 11296 6862
11320 6862 1423 19609 24426 32245 27044 17118 -5974 -17945 -8926 -8737 -9571 -4116 343 3445
11306 3445 21757 26902 19728 9938 17106 30323 29694 20265 27986 22663 20100 25047 20375 9279
11292 9279 10246 -3383 -9832 -14591 -28377 -11168 -9599 -2891 -3716 -1229 28356 35767 25929 16004
11278 16004 7197 -995 -4606 -1610 24456 14332 28428 7366 -22129 -13473 -6332 12329 4334
11265 4334 832 13634 4075 13201 7541 -9261 -12633 -10402 -13664 -29229 -27022 -19164 -853 22969
11251 22969 23268 -3698 -8525 -971 3775 -10780 -9127 -22275 -22684 1451 20032 6438 -8863
11238h863j253Q411J784N052N228M068K2143N176j2325q689k9289m440q873L496
11224a8374J8947j4429O71K309K4483R159k8444j1683m98J611L866j2515q814
11211c3711L7810Q111j7284l0526q796K2590J2855Q891N093O172K1467k3247j2270
11198b845M0840K5609j3918j0796j4874j1004n856q896J4086K729o777j3776J090
11185d388M388O875O937j4051j9006l854R722K2237K3031L761J5526m48k5443
11172B5287L883j3308J94r650K961J3430J3892j1221j657k213k513J2552p915
11159B3722j7644J4571K1173l964r067K615P407j0078j1058m60O592J272j8792
11146F289r86K207n603Q45J560J1802n494M538J5790j6479j0387j5759J0826K2341
$$ plain form
11238 -8863 -10116 -1705 79 5131 10359 14427 36570 41746 29421 20732 -8557 -12997 -21870 -18374
11224 -18374 573 -13856 -13185 -10876 13607 22766 -5678 -17361 -17859 -16248 -12382 -24897 -33711
11211 -33711 4099 12210 -5074 -35600 -44396 -21806 -8951 -60 5033 11205 32672 9425 -2845
11198 -2845 37995 63604 49686 38890 24016 13012 7156 -1740 12346 15075 8298 -5478 -4388
11185 -4388 0 6875 13812 -239 -19245 -23099 -13377 8860 31891 35652 51178 50730 25287
11172 25287 29170 15862 16056 6406 9367 22797 36689 25468 23811 21598 19085 31637 23722
11159 23722 6078 20649 41822 37858 28791 31406 38813 28735 17677 17217 23809 25081 6289
11146 6289 5303 7510 1907 2752 4312 16114 10620 15158 30948 14469 4082 -11677 -851 21490
11132B1490j0198J5609O616j3693L731j3739j4764N4M426K108K3997n189r327
11119A1121O016R26l477J310l709l686j200q028q397n575J3427K7763j7146j1657
11105b312P066K1997K602k4814q84o635J0489J3327L667o722j4826j1867O48K9101
11091B0837J3588o504k419j9154r965Q179L128J0091J3469L409j7098j1129M140
11078A0572k2251L283M421J4511O094N458J8049j5335j7990j2230r009J9317J7222
11065B2112l99l234l344K3299J3730n027J2232J2562l255K795K202Q30j6647k9135
11051B8721j471J5219j3794j2625J720j0752L974K7744K2772j2974M663j4099
11039C9098k6241K892M359J8218j1658j7031o911Q538J6173j4912j916J4311Q974
$$ plain form
11132 21490 11292 26901 33517 19824 23555 9816 -4948 -4894 -468 1640 25637 20448 11121
11119 11121 17137 18063 14586 15896 12187 8501 7301 -727 -9124 -14699 -1272 26491 9345 -2312
11105 -2312 4754 26751 29353 4539 3655 -2980 7509 20836 24503 17781 2955 -8912 -8264 20837
11091 20837 34425 27921 25502 6348 -3617 4562 7690 17781 31250 34659 17561 6432 10572
11078 10572 -11679 -8396 -3975 10536 16630 22088 40137 24802 6812 -5418 -14427 4890 22112
11065 22112 21713 18479 15135 38434 52164 47137 59369 71931 68676 71471 73673 74503 57856 28721
11051 28721 27250 42469 28675 16050 17770 7018 10992 38736 61508 48534 53197 39098
11039 39098 12857 15749 20108 38326 26668 9637 2726 11264 27437 12525 10609 24920 33894
11026C3894J2562J2469l1370Q817M015m612N000R272j3272p568l967k0521j258
11013C461K4302O296K0794m763k0367J1126K1558J2921P04K3800K79k765k223
11000I5123l4307n611o738j7286l031J7668J3078k2146q412J7088p34r516k4372
10987A0804j430J3418J1022j2567p060n379N982K826J2512k5611q228J1908p636
10974E61R788J7452O200m73j0564J1831p816l731P840N636K7q171j5409j234J1751
10959B3688l434j2754K3967J8489o946k0953o464M242J686J7542l069j0561K217
10946B7650J3861J6712j4153j8623j8927l962j1673K2669J7773N534j535Q647
10934D3973o339K7801L4848o183k2913P16l536j909P416J2778q10m564Q518Q789
$$ plain form
11026 33894 46456 58925 27555 36372 40387 35775 40775 50047 36775 29207 25240 4719 3461
11013 3461 27763 34059 54853 50090 29723 40849 62407 75328 76032 99832 100111 97346 95123
11000 95123 60816 55205 48467 31181 28150 45818 58896 36750 28338 45426 44692 35176 10804
10987 10804 9374 22792 33814 21247 14187 8808 14790 17616 30128 4517 -3711 8197 561
10974 561 10349 27801 34001 33528 22964 34795 26979 23248 31088 36724 36751 28580 13171 11937 23688
10959 23688 20254 7500 31467 49956 43010 22057 15593 19835 21521 39063 35994 25433 27650
10946 27650 41511 58223 44070 25447 6520 2558 -9115 13554 31327 36861 35326 43973
10934 43973 37634 65435 100283 94100 71187 71903 68367 66458 73874 86652 85842 81278 89796 98585
10920I8585J2685q25P262L976L2678L7817J3423N0816O1897N2578O5340J69363
10908F05595L09118N53784O28871K5700m10746l68107l18991k99179k12553j38350
10898C75142j05401p3666n4978j7669J6774j7216j8291M044p809M481j5014j475
10886H8922K0642o997l2717j9537k3797M184J0930o951N121k141n06P893O028
10873E1074k0911k1539M976m339K048n508J6710K8736J306j8538j0547k5279l917
10860e728J1454J7631J3296J0591J5449J515j6849r444m161r524J0105j2686J7530
10847C9179K4305O494n620j6493j284J0987O949O117m729r485j7936j4447R690
10834C3727M710J0329m989j6091J2092J2684L699j1227k291r43O391J353j2379
$$ plain form
10920 98585 111270 110445 117707 121683 154361 192178 205601 256417 318314 370892 436232 605595
10908 605595 914713 1468497 2097368 2123068 1712322 1344215 1025224 726045 513492 375142
10898 375142 269741 196075 141097 123428 140202 122986 104695 108739 100930 105411 90397 88922
10886 88922 109564 102567 69850 50313 26516 30700 41630 34679 39800 37659 37153 45046 51074
10873 51074 30163 8624 13600 9261 11309 5801 22511 51247 52553 34015 23468 -1811 -5728
10860 -5728 5726 23357 36653 47244 62693 64208 47359 37915 33754 24230 34335 21649 39179
10847 39179 63484 69978 64358 47865 46581 57568 64517 70634 65905 56420 38484 24037 33727
10834 33727 38437 48766 43777 27686 39778 52462 56161 44934 42643 41700 48091 49444 37065
10821C7065K316M840p157K1922K8251l586n182n664k5625k6870j416K539m02K461
10807B3492j0183k51j3490N054K0312N468K2900K7971J0227j336j0757j7089l7737
10794B4581j3575K6884K5504K2802J1416l171k3502j3427o22l772l367J34K7079
10781G6964P403R478K2917J2027j8018o980j5701j7849p324J6R207J1923P19J6728
10767A01510O002q147o187J4718Q737J0645k025N452L2719L5936K2177J9856J8613
10754B60006K3669l327m0460m6192m7310k0555L375r881j9038j9736j2188K643
10742G1006n094l1736J8705J7716R76r029j958o402L7242n618n719q297j1668
10729F0124j5334j1502K4397J5500n812L218q047K351J4937J8908p353m168O707
$$ plain form
10821 37065 39381 44221 37064 58986 87237 83651 78469 72805 47180 20310 18894 21433 21031 23492
10807 23492 13309 13058 -432 4622 24934 30402 53302 81273 91500 90164 79407 62318 24581
10794 24581 11006 37890 63394 86196 97612 94441 70939 57512 56890 53118 49751 49885 76964
10781 76964 84367 93845 116762 128789 110771 103791 88090 70241 62917 62933 72140 84063 84782 101510
10767 101510 107512 99365 93178 107896 116633 127278 125253 130705 163424 199360 221537 241393 260006
10754 260006 283675 280348 239888 193696 146386 125831 129206 119325 100287 80551 68363 71006
10742 71006 65912 34176 52881 70597 71573 62544 60586 54184 91426 85808 80089 71792 60124
10729 60124 44790 33288 57685 73185 67373 70591 62544 64895 79832 98740 91387 87219 93926
10716I3926j703j8507j4753j6864l26J1036R714j127p211J3886K6747K0936j7142
10703I8612j4026k6747j6255R254R444n116r69Q350J3828j9736j3007o322k5880
10690A1430l7120m90L3647L7456P565O076J932j97j1092P680R644L4077L0259
10677A30867OJ2645L875p646M978O141j3165k075J5253p832k0448j9872J0477
10664A13204L4640L5896J142p599J467L97m995l3360N084O00k4632l6693n54J1726
10650I6323n317P132Q987K3681J8388J5362R127N252m056J028J4256K8271K6728
10637B45162N582j9576N834J7424J4222Q893M418M1153k1544m8511l817J2355
10625B61595J0914n0455n4350P82R047R286l794N307n461n103K4262L3919M939
$$ plain form
10716 93926 92223 73716 58963 42099 41773 52809 62523 61396 54185 68071 94818 115754 98612
10703 98612 84586 57839 41584 50838 60282 55166 54197 62547 76375 56639 43632 37310 11430
10690 11430 -25690 -26180 7467 44923 52488 58564 60496 60299 49207 56887 66531 100608 130867
10677 130867 130873 143518 147393 139747 144725 150866 137701 135626 150879 143047 122599 102727 113204
10664 113204 147844 183740 184882 177283 178750 179147 174152 140792 145876 146476 121844 85151 84597 96323
10650 96323 91006 98138 107125 130806 149194 164556 173683 178935 174879 175907 190163 218434 245162
10637 245162 250744 231168 237002 254426 268648 277541 281959 323112 301568 253057 249240 261595
10625 261595 272509 222054 167704 168486 177533 186819 183025 188332 182871 177768 202030 235949 240888
10612B40888Q48j893k700J2754R990Q330K190J0084k3873k6369m0660J906J8406
10599B09901L5984J5966K1161J4129Q466j348j0038K4926J3545j6678j9373k3735
10587B72906P267N349j241L3553M1318L2892k5428n056r773R212L2221N4423M1232
10574D88875K7774K3453M2086J4379P685L5417K6076R062J1658K5654K6093M8913
10562G87125M9030L2567L0938o215J5974Q919J7016K9824m902M4557M0304O746
10550A051883M6283J00360O4479M6729Q4911R3178Q0982J05431J18580J47399
10540A940215J28982J13627J44306J90108K27256K56205K91907L08015K63767
10531C864388K13888K45487K96605L57296M64527O17874Q09604J112440J518989
$$ plain form
10612 240888 241736 239843 237143 249897 259887 268217 270407 280491 256618 230249 189589 191495 209901
10599 209901 245885 261851 283012 297141 305607 304259 294221 319147 332692 316014 296641 272906
10587 272906 280173 285522 284281 317834 359152 392044 366616 361560 351787 360999 393220 447643 488875
10574 488875 516649 540102 582188 596567 604252 639669 665745 674807 686465 712119 738212 787125
10562 787125 836155 868722 899660 893445 909419 918338 935354 965178 960276 1004833 1045137 1051883
10550 1051883 1098166 1198526 1263005 1309734 1394645 1487823 1568805 1674236 1792816 1940215
10540 1940215 2069197 2182824 2327130 2517238 2744494 3000699 3292606 3600621 3864388
10531 3864388 4078276 4323763 4620368 4977664 5442191 6060065 6869669 7982109 9501098
10522I501098J256552O66560Q77002J244269J239263P85887Q51148J147611J513690
10513A9083080J976104K314139K664872L068142M013509N770598Q689454J3263006
10505F0842904K1858734L9076910P2884476J21410481R4494679m5627384p4635655
10498B90305145o3071457o0021570n1142923l6538267k3534345j5146498j0228896
10491C0621189p109948m941563l462955k378825j680056j026167m95052l09852
10483I216771q35997r75064o80041k59344J07265l66709p75297o25724n69768
10474D236092n17062m08312l44131k83169j49976L3169o2560k21889j85566j89247
10464A907349j76914j89002j37711p1863p5666r7619r4191q6906n4243m6178m4032
$$ plain form
10522 9501098 10757650 11424210 12301212 13545481 14784744 15570631 16421779 17569390 19083080
10513 19083080 21059184 23373323 26038195 29106337 33119846 38890444 47579898 60842904
10505 60842904 82701638 121778548 194663024 316073505 410568184 364940800 290305145
10498 290305145 227233688 167212118 116069195 79530928 55996583 40850085 30621189
10491 30621189 23511241 18569678 15106723 12727898 11047842 10021675 9526623 9216771
10483 9216771 8380774 7405710 6725669 6466325 6573590 6206881 5431584 4805860 4236092
10474 4236092 3719030 3310718 2966587 2683418 2533442 2566611 2504051 2282162 2096596 1907349
10464 1907349 1730435 1541433 1403722 1331859 1256193 1158574 1064383 977477 923234 877056 833024
10453H33024j3626J2159l3579o7793k8272l0794o2124m1076j6897j8834m9688
10442D82500n8336n5659k8558j254Q048p383j4766o201j8799j0392l037L0530
10430C16693J7574L266j1015j8048J4977K7212J9723K1660q151k6182q188O068
10418C55589m192p094K0128N16j656k8824l2761o583m113l646j5258l0362j5647
10405B26097r468R148J7179Q262l808n110o991k4256l3190j9876k264P356K971
10392A66050l2160j5862R392K1801J7326M605o235M903M696j776m173j3089n772
10379A49706K433K5989N1255L8199k8666p5851q8642l7838j9178J1634L1127P846
10367F8014J0867j2763m676J079J4288r28l3446J1438R315K3294K962J7802J1334
$$ plain form
10453 833024 819398 831557 797978 730185 701913 671119 608995 567919 551022 532188 482500
10442 482500 424164 368505 339947 338693 346741 339358 324592 318391 299592 289200 286163 316693
10430 316693 334267 337533 326518 308470 323447 350659 370382 392042 383891 357709 349521 355589
10418 355589 351397 344303 364431 364947 363291 334467 301706 295123 291010 287364 272106 241744 226097
10405 226097 216629 225777 242956 251218 247410 242300 235309 211053 177863 157987 155723 163079 166050
10392 166050 133890 118028 127420 149221 166547 171152 164917 169820 174516 172740 168567 155478 149706
10379 149706 152139 178128 229383 267582 238916 163065 74423 36585 17407 29041 60168 68014
10367 68014 78881 66118 61442 62521 76809 75881 42435 53873 63188 86482 89444 107246 118580
10354A18580L818p569k4406j1146K2668L2284j1771j4642m2472o3872j6576Q769
10342f335J3397m443j6952J5820P908K910P251m70N068J4508J6720K566k1509
10329C6439j3285n014K432j890K1184L3572P214k442N616O281J372n329j8127
10316F8023J8928N484J5671K7430M7072K1163m1026m4561j4347N32q407r190j937
10303H4835k8696k2010j4346M920m144l2930O399K2693J0065J0785J2839m03K210
10290E2217J5136j2617r67m867J3442P950j3361k0051j8575J07J6511j1704n838
10277A7383L7477R334l0361j7194N174J0392p225M660O77j0773j192R289K0099
10264D7740k449q946q97L247J635R704N252J0038j591j6825j0933L539P417M999
$$ plain form
10354 118580 122398 114829 90423 79277 101945 134229 122458 107816 65344 1472 -15104 -6335
10342 -6335 7062 2619 -14333 1487 9395 12305 19556 19086 24154 38662 55382 57948 36439
10329 36439 23154 18140 20572 18682 39866 73438 80652 78210 83826 90107 91479 86150 68023
10316 68023 86951 92435 108106 135536 182608 203771 162745 118184 103837 104369 95962 86772 84835
10303 84835 56139 34129 19783 24703 20559 -12371 -5972 16721 26786 37571 50410 50007 52217
10290 52217 67353 54736 53769 48902 62344 70294 56933 36882 18307 18414 34925 23221 17383
10277 17383 54860 64194 33833 16639 21813 32205 24980 29640 30317 19544 18352 27641 47740
10264 47740 45291 36345 35448 38695 40330 50034 55286 65324 63733 46908 35975 39514 46931 51930
10250E1930m912j2652j0489r511k75N299J5677j9235j3608J357J3778j2366j6077
10237a1084Q566o379p917L985J1531J9897L19N410m044p846J9194m007j7150l894
10223F581J2946J3041K102K422l21k035J276j8409R741K7158M24k4940q120J7206
10209C9072R528j6178j9049j2548J477R842K603N952J9822j6653J610J4959J5002
10196E5439r359j0492q087n90Q776k98r64j6100k6807K336r312N073J1466Q560
10182I641J2474K16k205k2949j6376J0690l90k1091J2471K6622r29P756q395j0281
10168b746N833j7409j2884K612j525J3818K1175o963j1185Q62J7833N064J7140
10155C1625J5829m356J245k4158q986j3779J2209K6957N971M31p541R755j1167
$$ plain form
10250 51930 47018 34366 23877 14366 14091 19390 35067 15832 2224 3581 17359 4993 -11084
10237 -11084 -2518 -8897 -16814 -12829 -1298 18599 18918 24328 20284 12438 31632 27625 10475 6581
10223 6581 19527 32568 34670 37092 36771 34736 36012 17603 27344 54502 54926 29986 21866 39072
10209 39072 48600 32422 13373 825 2302 12144 14747 20699 40521 23868 25478 40437 55439
10196 55439 46080 35588 27501 26911 35687 35389 34425 18325 -8482 -6146 -15458 -10385 1081 9641
10182 9641 22115 22331 20126 -2823 -19199 -8509 -8899 -29990 -17519 9103 8174 15930 7535 -2746
10168 -2746 3087 -14322 -27206 -24594 -26119 -12301 8874 1911 -9274 -8412 9421 14485 31625
10155 31625 47454 43098 44343 20185 11199 -2580 9629 36586 42557 42988 35447 45202 34035
10142C4035q136n343j613l737O128P705J2401m478j6494J5686K3162j7798o18
10129D0900L751j0545k0435j2788J9035J9464J2087J9049n231L2j2393L61j1879
10116D1408j4902J9335K5152J7320l3862j5076J9268L155R501J5989m103p037
10104G6148J0513K6034J4181J1763n303J4466L3472M3208O8061R8594J71193L25252
10092H87582N65641O36912k048l90239l56743l43906l05380k22324j39976q6504
10082B43015n2641n8534n3929l9555q331J3058m44j3538J542j0923j2555n886
10070A279m602p591N71O580J6157r215O633J5249K1436m975k925j6437r674m240
10056H246j914q440k4207j0619J5418L3198K1612J1071K8252p142k4577j0830
$$ plain form
10142 34035 25899 20556 18943 15206 21334 29039 41440 36962 20468 36154 59316 41518 40900
10129 40900 44651 34106 13671 883 19918 39382 51469 70518 65287 65319 52926 53287 41408
10116 41408 26506 45841 70993 88313 54451 39375 58643 61798 71299 87288 83185 76148
10104 76148 86661 112695 126876 138639 133336 147802 181274 224482 292543 391137 562330 887582
10092 887582 1453223 2090135 2088087 1697848 1341105 997199 691819 469495 329519 243015
10082 243015 190374 131840 77911 38356 30025 43083 42639 29101 30643 19720 7165 1279
10070 1279 -3323 -10914 -10343 -3763 12394 3179 9812 25061 46497 41522 38597 22160 12486 8246
10056 8246 6332 -2108 -26315 -36934 -21516 11682 33294 44365 72617 65475 40898 30068
10044C0068j047M047p99p205K425o11l240o908Q389N333j4040k9043r62l806q021
10029b5420q38p965o31R177K6910J1909O430j7980l625J273j9883O140j5779l610
10015c3892L6944J4728k529J677M153j2999j2324L550J447M212J393M44p630j65
10001i91K5437L250j0512J0218p06j9149l4387N564J103M014N856l31M061J2189
9987E616J2606p721j6543J3384m906j215n33M312O415N647N048j4148j262J4010
9973B0710o985j6681k6278j2962O306K6311K0975k3287j1805J7242q398j2552
9961b7404n075P132K5345J2004O52m258m212l83j0529j9983j872j829k3185J2037
9947d1560K2448M469J6617N692q465j1997Q746J0894j6970r860N670J8644N358
$$ plain form
10044 30068 29021 33068 32269 25064 27489 26878 23638 16730 25119 30452 16412 -12631 -13593 -17399 -25420
10029 -25420 -26258 -34223 -34854 -25677 1233 13142 19572 1592 -2033 -760 -20643 -14503 -30282 -33892
10015 -33892 3052 17780 15251 16928 21081 8082 -4242 -692 755 4967 6360 6804 -826 -991
10001 -991 24446 27696 17184 27402 26696 7547 -26840 -21276 -20173 -16159 -10303 -10634 -6573 5616
9987 5616 18222 10501 -6042 7342 2436 1221 688 5000 11415 17062 22110 7962 6700 20710
9973 20710 13725 -2956 -29234 -42196 -35890 -9579 11396 -11891 -23696 -6454 -14852 -27404
9961 -27404 -32479 -25347 -2 12002 12654 8396 4184 3801 -6728 -26711 -28583 -30412 -53597 -41560
9947 -41560 -19112 -14643 1974 7666 -799 -12796 -4050 6844 -10126 -19986 -14316 4328 9686
9934I686M765p346q63n80j138n543J0101r699j2473J608Q182r223j0772q810J2741
9919a9364K563n636J0410J560k4688l733K144M101M216K387J6906n153R219j261
9905f329J5964N774J2078j7593l2984J8125J4158j4400j369K7088J5700Q627M20
9892D5259j0004r59Q023p056k0288l8100l1707k730K2173J2396J8155l884k616
9879a1338k527O180o800q221k908L239k735j942K58J036K4574k415l126J8511
9865A1786k168J543k1673p159O368L85K5317n999l0341J0751m684R212R396K2068
9851B4802J0897j7707k3083j9971J0573Q085l561K3893P787Q039k0836K749j63
9838A1504k426m337j458j7204n417R049J8100J2323o006j0166k0392j1938m696
$$ plain form
9934 9686 14451 7105 6242 5662 4524 -1019 9082 -617 -13090 -11482 -3300 -12523 -23295 -32105 -19364
9919 -19364 -16801 -22437 -12027 -10467 -35155 -38888 -36744 -32643 -28427 -26040 -9134 -14287 -5068 -6329
9905 -6329 9635 15409 27487 9894 -23090 -4965 9193 -5207 -6576 20512 36212 44839 45259
9892 45259 35255 34296 42319 35263 14975 -23125 -54832 -57562 -35389 -22993 -4838 -8722 -11338
9879 -11338 -13865 -7685 -14485 -22706 -25614 -22375 -25110 -27052 -26794 -25758 -1184 -3599 -6725 11786
9865 11786 9618 11161 -10512 -17671 -11303 -10918 14399 8400 -21941 -11190 -15874 -6662 2734 24802
9851 24802 35699 17992 -5091 -25062 -14489 -6404 -9965 13928 21715 29754 8918 11667 11504
9838 11504 9078 4741 3283 -13921 -19338 -10289 7811 20134 14128 3962 -16430 -28368 -33064
9825c3064R52O656L2493p74J423J0177q653j6479q677R374J0411l289p411P339
9811D78n377N786J6127j830m910N931k4059k6953R176L1959L1061j1016k3733
9798B640p890P601q958n049j2038r241R267P239Q054J929L054J9790l897j3231
9784g30j7176r483m350L047K1362K0822r670j1113j4681l1820O400K0817l069
9771b9644k3885J9699K9025J0171j2939j4463p664j6060j2877J2350J9808L732
9759b2747J3981J2690n59k056j0944k60P259J108k808j905O726J0780J069j3320
9745i86R257J8461k376k0137j9171J867L031J4267Q581q611k307p764k5071N12
9731c0447J4420K3594J5137j150k262P320N739Q288j3643j1746j7044Q415J1724
$$ plain form
9825 -33064 -32112 -25456 7037 6263 7686 17863 9210 -7269 -15946 -6572 3839 550 -6861 478
9811 478 -4899 887 17014 15184 10274 16205 -7854 -34807 -25631 6328 37389 26373 2640
9798 2640 -5250 2351 -6607 -11656 -23694 -32935 -23668 -16429 -8375 -6446 -3392 16398 12501 -730
9784 -730 -17906 -27389 -31739 -28692 -7330 13492 3822 -7291 -21972 -53792 -47392 -26575 -29644
9771 -29644 -53529 -33830 -4805 5366 -7573 -22036 -29700 -45760 -58637 -46287 -26479 -22747
9759 -22747 -8766 3924 3365 1309 -9635 -9895 -2636 -1528 -4336 -6241 485 11265 12334 -986
9745 -986 8271 26732 24356 4219 -14952 -13085 -10054 4213 12794 4183 1876 -5888 -30959 -30447
9731 -30447 -16027 7567 22704 21554 19292 26612 32351 40639 26996 15250 -1794 6621 18345
9718A8345O714j674r532o786r693K563l41M392k206j0914r90m031j9919J2152
9704b1920J3986O245n620J3173K8948Q203J38l205j8035M519j1621j5673j5722
9691a6584J0272m670o212K315j6380J7732J5177K902l65j563j5975j4697N654
9678b2394J2834K5358J2339j1000n731p202j2147O092K1091o271J6555J4147J172
9665D4843j7534K472J2528J8216J5023k1396k9730j9186N291R946n484j3906j4038
9652a2955K4185J2552k6906K2768J5046r835m16l2065j0064J3634o674j1768J4847
9639g651p128q031J2327j379L123M001p564k7030O519J6449J7051l960J0919Q600
9625A6246M104K933J795n742k0100k4408J693J2109K2529n824j2848J2137P121
$$ plain form
9718 18345 25059 23385 13853 7067 -2626 -63 -404 3988 1782 -9132 -10122 -14153 -34072 -21920
9704 -21920 -7934 -1689 -7309 5864 34812 43015 43153 39948 21913 26432 14811 -862 -16584
9691 -16584 -6312 -10982 -17194 -14879 -31259 -13527 1650 4552 4187 2624 -13351 -28048 -22394
9678 -22394 -9560 15798 28137 17137 11406 4204 -7943 -1851 19240 12969 29524 43671 44843
9665 44843 27309 29781 42309 60525 75548 54152 24422 5236 10527 20473 14989 1083 -12955
9652 -12955 11230 23782 -3124 19644 34690 24855 24439 -7626 -17690 -4056 -10730 -22498 -7651
9639 -7651 -14779 -22810 -10483 -11862 -8739 -4738 -12302 -39332 -32813 -16364 687 -3273 7646 16246
9625 16246 20350 23283 25078 19336 -764 -25172 -23479 -11370 11159 5335 -7513 4624 11745
9612A1745o431P140J9524j0380o058R030M144k7796l191J460J7278O191N109K965
9598C0730p637k5933j7000k1062J6551J6474R121J4868p335j4768p641L201p555
9585a7986j600m326J2619J1359M654l209O145L374j3201J187K239K4879J6117
9572D2251j1080j1293k0989q673J1189J4215n507k1645o347J2502q301J7746J1467
9559A5535J9382k510j4834m703n521m842N390j3963r822j576R771K263L874j2199
9545a3755O410O935J1873k918r695n358L4N720N47j0186J6055K1800j7070k1661
9531a1269J3856J0800n30J650j3897o066j6596J494k016j1558N646J0354J5852
9518b280R89o333J1713m837j986k108Q983N161p481K920J4932J2616K656m700
$$ plain form
9612 11745 5314 12454 31978 21598 15540 24570 28714 918 -2273 -813 16465 22656 27765 30730
9598 30730 23093 -2840 -19840 -40902 -24351 -7877 1244 16112 8777 -5991 -13632 -10431 -17986
9585 -17986 -19586 -23912 -11293 66 4720 1511 7656 11030 -2171 -984 1255 26134 42251
9572 42251 31171 19878 -1111 -9784 1405 15620 10113 -11532 -17879 -5377 -13678 4068 15535
9559 15535 34917 32407 17573 12870 7349 2507 7897 -6066 -15888 -17464 -7693 -5430 -1556 -13755
9545 -13755 -7345 -410 11463 8545 -1150 -6508 -6474 -754 -207 -10393 5662 27462 10392 -11269
9531 -11269 2587 13387 12857 14507 610 -5456 -22052 -20558 -22574 -34132 -28486 -18132 -2280
9518 -2280 -1291 -7624 4089 -748 -2734 -4842 4141 9302 1821 4741 19673 32289 34945 30245
9504C0245j2130L84M057j2315j9105J5580J2528l481j7364N914K2864j1781R451
9491B4847J9666N605q476l453o88N4M517l036j4160p083r370l389o71J237n687
9476h7O135j4725n229P185K532M376P595k160k7951M831O025K1285K331J1234
9462B3377j2198p019j0099K0527M111Q089J1670o955j3289p278j0280j0648M189
9449e803J6015j887n094j6799J2940J609j3802r129P55J1920r206J1809J0876
9436D204p720N023R338J3793R211k829k0786l0093m745q63J3790r461K0583K4131
9422B3576K0508K5602L861j9201l8349j1014J0090l092J3345J5128j001r871m350
9409B5232r152q826J2212k404O39j7128J4701J0683m530k070j9278j5077o935
$$ plain form
9504 30245 18115 18499 22556 10241 -8864 6716 19244 15763 -1601 4313 27177 15396 24847
9491 24847 44513 50118 41642 38189 37501 37555 42072 39036 24876 17793 8423 5034 4363 5600 -87
9476 -87 6048 -8677 -13906 -6721 -4189 187 7782 5622 -22329 -17498 -11473 9812 12143 23377
9462 23377 11179 4160 -5939 14588 18699 26788 38458 31503 18214 10936 656 -9992 -5803
9449 -5803 10212 8325 3231 -13568 -628 981 -12821 -21950 -21195 -9275 -18481 -6672 4204
9436 4204 -3516 1507 10845 24638 33849 31020 10234 -19859 -24604 -25467 -11677 -21138 -555 23576
9422 23576 44084 69686 73547 54346 15997 4983 15073 11981 25326 40454 39453 29582 25232
9409 25232 16080 7254 19466 17062 17701 573 15274 25957 21427 19357 79 -14998 -21933
9396b1933J6081K2123J546O456q022k3916p282O184J4711J7146J3370p085j5970
9383A3409j448j6157L913L274L777O747p890m117j0542J5172K0434M886L162o600
9369B8020N194k659L868n648m08J0837k3617j3113K1895l426j9241k1936J822
9356a8412J0850J2559J287R424R648J647k0261O677J2315n951j3122Q239J9067
9343C3967o635m415q109N580p400p48r583N483Q502p044m042K2186N921J2899
9329D6562j01r469J294k1440k2524n94J2608J3028P744K2233J105q536o744O705
9315D1871J5219J4062l316q719m87M135r305k2344j7395J7324K8010P742P263
9302G4060j2724P635J2764P96k4595j3206K5020R514j1124n296M46O714m711J5146
$$ plain form
9396 -21933 -5852 16271 17817 24273 16251 -7665 -14947 -8763 5948 23094 36464 29379 13409
9383 13409 11961 -4196 -283 2991 6768 13515 5625 1508 -9034 6138 26572 31458 34620 28020
9369 28020 33214 30555 34423 28775 28367 39204 15587 2474 24369 20943 1702 -20234 -18412
9356 -18412 -7562 4997 6284 15708 25356 27003 6742 13419 25734 19783 6661 14900 33967
9343 33967 27332 22917 14808 20388 12988 12240 2657 8140 16642 9598 5556 27742 33663 46562
9329 46562 46461 36992 38286 16846 -5678 -6272 6336 19364 27108 49341 50446 41910 35166 41871
9315 41871 57090 71152 67836 59117 58630 62765 53460 31116 13721 31045 59055 66797 74060
9302 74060 61336 68971 81735 82531 57936 44730 69750 79264 68140 62844 63290 70004 65293 80439
9288H0439m743N390R979j6460n242J3754M541m975L889J053L027j2502o29Q150
9274H5671j1367L8236L0746q572j8428J3915N428k3868J153j0464L227R065K967
9261A17709Q978O784J2605j873J9204J3086L853r313R788K6819J0819j075j6514
9248B00870m923M1791J7455o404k593J6479N874j0871q71K6421M3012L4183M229
9235C64652o687K7974J8109p737J4522L5305K8431J8117P991J1542K5366L0650
9223E68235J5092j1062R674L0021K6254K6622K402K3900L8837M2368K2491K466
9211G97300J5812J8614N149P001O836K0474N659n968J0334L0605p778O109k3594
9198H86553k3458j0847j7052j2583J8134j8370n6099l3330k4570q797j1786j3238
$$ plain form
9288 80439 75696 81086 91065 74605 69363 83117 87658 82683 86572 87625 90652 78150 77521 85671
9274 85671 74304 112540 143286 134714 116286 130201 135629 111761 112914 102450 105677 114742 117709
9261 117709 126687 133471 146076 144203 163407 176493 180346 171033 180821 207640 218459 217384 200870
9248 200870 195947 237738 255193 248789 246196 262675 268549 257678 256807 283228 326240 360423 364652
9235 364652 357965 385939 404048 396311 410833 446138 474569 492686 500677 512219 537585 568235
9223 568235 583327 572265 581939 611960 638214 664836 667238 691138 729975 772343 794834 797300
9211 797300 813112 831726 836875 843876 850712 871186 876845 870877 881211 911816 904038 910147 886553
9198 886553 863095 852248 835196 822613 840747 822377 766278 732948 708378 699581 687795 674557
9186F74557j2434L233q720n4945n4145j9894O764j543m5637m0926k2006k43j6411
9173D07650j7510k790r063m0850n850J315P317J1586j9243j7546k5565J981j6813
9160B74619l1222N500O84j9366o260Q022j903j1970j301o804j3225J2516R42m331
9146B05901m9o169l477k7632j9420j2236J1107M776j2392k0619l268j402m227
9133A10893j0449r209J5735K701n976j115Q153o730J2976j0241j3764N475J2697
9120A11146j5403n821m909J183J099P775j1348Q969R237m612o833J5847J1835
9107A18165O410j4607l282J513J907j2363k4953L843M85j1915m701k0786L55J4674
9093E4745J498j672q411j010k251J2868J497m058n886l602M051n453o918j9468
$$ plain form
9186 674557 662123 665356 656636 601691 547546 527652 534416 532873 487236 446310 424304 424061 407650
9173 407650 390140 387350 378287 337437 331587 332902 340219 351805 332562 315016 289451 291432 274619
9160 274619 243397 248897 249581 230215 223955 231977 230074 218104 216803 209999 196774 209290 210232 205901
9146 205901 205852 199683 196206 168574 149154 136918 148025 152801 140409 119790 116522 115120 110893
9133 110893 100444 91235 106970 109671 103695 102580 110733 104003 116979 106738 92974 98449 111146
9120 111146 95743 89922 85013 86196 87295 95070 83722 92691 101928 97316 90483 106330 118165
9107 118165 124575 109968 106686 108199 110106 97743 72790 76633 77118 65203 60502 39716 40071 54745
9093 54745 56243 54571 46160 45150 42899 55767 57264 53206 47320 43718 47769 42316 35398 15930
9079A5930P381K1474J3753M168j0246j1358P810R749n632J323q656j9420j4086
9066A2190P951K5644o888J0777R94k3024O509Q746J99j0532l006j490r473L212
9052B1809M850J2203n405n370m175J4969k341q039j2689L862R561Q800P136Q8
9038D5259j6519l0984L050O119p47L535J2286K9724J2897J489l508J261P97o672
9024E7987M437O955k0330q275o575q264p018o976O841m561m319p76J7143K4983
9010E1252L139k2201k0678j7357j4286M762J0051n246M427j374M855J2074M334
8997A3752j3348j3446M903R823J0230J227L0079j1294p809J2033J8311J9110j659
8984G1912k2222p518R065j7790m176p389k6711o797P867m142L233J2093J0756
$$ plain form
9079 15930 23311 44785 58538 62706 52460 41102 48912 58661 53029 54352 45696 26276 12190
9066 12190 20141 45785 38897 49674 50668 27644 34153 42899 43098 32566 29560 28070 18597 21809
9052 21809 26659 38862 33457 28087 23912 38881 36540 28501 15812 19674 29235 38035 45171 45259
9038 45259 28740 -2244 806 6925 6178 9713 21999 51723 64620 66109 62601 63862 64659 57987
9024 57987 62424 69379 49049 40774 34199 25935 18917 11941 18782 14221 9902 9126 26269 51252
9010 51252 54391 32190 11512 -5845 -20131 -15369 -5318 -10564 -6137 -7511 -2656 9418 13752
8997 13752 404 -13042 -8139 1684 11914 13141 43220 31926 24117 36150 54461 73571 71912
8984 71912 49690 42172 51237 33447 29271 21882 -4829 -11626 -3759 -7901 -4668 7425 18181
8971A8181k085O639j345m536j9136o211M869p39o267j1786K7484J311l091j1504
8957h216J0630P256o321J2108P191k536L1726J9045K040m786k049k0800l2310
8944A2978J1795Q579J6789J5144J0780j9501n473j4596j1561M097q986k6830j7346
8931b4131k221j0137K2862L0269n273K235o335R932R28l182p184l835L0602L456
8917C7986q797r05n521p574P6q75P157j1056k107K452J4496l620r992P827K0155
8902C9702k0340j5248M914J7574j1650j1309j3054j3700J3876J7168K122p845
8890B210r010Q048P836M206j3023r281R64N986J6687J7351L2491O02p057k2040
8876C5970N932J5907j2988j2590j525J653J1910J4344K822P879P932N810Ml1969
$$ plain form
8971 18181 16096 22735 21390 16854 -2282 -8493 -3624 -4363 -10630 -22416 5068 6379 3288 -8216
8957 -8216 2414 9670 3349 15457 22648 20112 51838 70883 72923 68137 66088 45288 12978
8944 12978 24773 33352 50141 65285 76065 56564 51091 36495 24934 29031 20045 -6785 -24131
8931 -24131 -26352 -36489 -13627 16642 11369 13604 7269 17201 18129 14947 7763 3928 34530 37986
8917 37986 29189 28284 22763 15189 15265 14390 21547 10491 8384 10836 25332 21712 11720 19547 39702
8902 39702 19362 4114 9028 26602 14952 3643 -9411 -23111 -9235 7933 10055 2210
8890 2210 -6800 1248 9084 13290 267 -9014 -8050 -2064 14623 31974 64465 65067 58010 35970
8876 35970 41902 57809 44821 32231 30706 32359 44269 58613 61435 69314 77246 83056 83060 51091
8862E1091k7465R03j9290J571J3621l150J0667q560r024L4387O997p166K85r770
8848C5097n562j0545J0645M374k7816l2538J7430K3470n184n732q249M159K167
8835A716L4384M280L037K249k8328M920j192n860J1363q63K245R946j0411J396
8821B8882m183j3530L841L672j2644J022L665J591J1081q940q143R88k362p518
8807b578j3629r559n831K0156J1556P691p364j364P218Q40k130p477l675j4183
8793b0329j2546J1774J2109q612J0972K4008J4389k851l3205l0808J1816J7392
8781e891N690R505J2675P314M829o986q105j2821n724R070k445j9178k3575K1149
8767a4493J9283p554j6604J6172L3848J9446n777l0554j3323Q092J0600j0571
$$ plain form
8862 51091 23626 24529 5239 6810 20431 17281 27948 19388 10364 44751 51748 44582 44867 35097
8848 35097 29535 18990 29635 34009 6193 -26345 -8915 14555 9371 3639 -4610 -451 1716
8835 1716 36100 40380 43417 45666 17338 22258 21066 15206 26569 25706 27951 37897 27486 28882
8821 28882 24699 11169 15010 18682 6038 7060 10725 12316 23397 14457 6314 7302 4940 -2578
8807 -2578 -16207 -25766 -31597 -11441 115 7806 442 -922 6296 7136 5006 -2471 -6146 -20329
8793 -20329 -32875 -21101 -8992 -17604 -6632 17376 31765 28914 -4291 -35099 -23283 -5891
8781 -5891 -201 9304 21979 29293 34122 27136 19031 6210 486 9556 7111 -12067 -35642 -14493
8767 -14493 4790 -2764 -19368 -3196 30652 50098 44321 13767 444 8536 19136 8565
8755H565l13J4382j6945J1121j0135j6750K1547o451Q372J1130j2738J8637m388
8742B6034j5425J1673J716L470j320j4729K39L0568J214L978k0608j8150K2491
8729C1151J9537M350J3593K827j9543j7491K1560o731n034q767j3385j3921j0022
8716a876J7874n762q148j3717J4878L850k137j6635l982J5871J7495K7140R797
8703E4648Q970J23j7721r183n910j1364j1922N74K763K4106K3816q14k1348k0280
8689A6458L376L2413O071q650M83P796o076j171J0258J5772P494j2506j9413j4288
8675C8017J5958J7621o437J1999N986j9964k1047j9518J3398J2228j6964K4230
8663E5507m953L272O440r264J0883L9537J0312k3709l510j247l7746p757K6778
$$ plain form
8755 8565 8252 22634 5689 16810 6675 -10075 11472 5021 13393 24523 11785 30422 26034
8742 26034 10609 22282 23998 27468 26148 11419 11658 42226 43440 47418 26810 8660 31151
8729 31151 50688 55038 68631 71458 51915 34424 55984 49253 44219 35452 22067 8146 -1876
8716 -1876 15998 10236 2088 -11629 3249 7099 4962 -11673 -15655 216 17711 44851 54648
8703 54648 63618 63741 46020 36837 30927 19563 7641 8215 10978 35084 58900 58086 36738 16458
8689 16458 19834 52247 58318 49668 50151 57947 51871 50700 60958 76730 84224 71718 52305 38017
8675 38017 53975 71596 65159 77158 83144 63180 42133 22615 36013 48241 31277 55507
8663 55507 50554 53826 60266 51002 61885 101422 111734 88025 84515 83268 45522 37765 64543
8650F4543J3433r94J895m383m477j0614O328N668M140J582j384q608L801L245
8636G4175O143K1975j7569j1313K481M053r713n086J0552P630L8286J1249l567
8623A29296j0868o937K565O925p124L615j1458p708M073N290K6253L132p123j1525
8609A18406k110O796J402J5797L1996m659J7476J7187M991j2294J3754K0657J9756
8596B49155J0694J3538j3151k7827j5713k2370l8339l6190k479k3178j1888j0503
8584G1749j4947j4005n776L302N063J3546J8151M59j4250R531k581j404l5375
8571C3463k3568J546k401k0448j6302o427j0403J6159K6040K8230j257p491Q732
8558B5873j7821Q72L0576p753j0139r255o411j8853L168J9595J3713j0801k2729
$$ plain form
8650 64543 77976 76982 78877 74494 70017 59403 65731 71399 75539 77121 75737 67129 70930 74175
8636 74175 80318 102293 84724 73411 75892 79945 70232 65146 75698 83328 121614 132863 129296
8623 129296 118428 111491 114056 120981 113857 117472 106014 98306 102379 107669 133922 137054 129931 118406
8609 118406 116296 123092 124494 140291 172287 167628 185104 202291 207282 194988 208742 229399 249155
8596 249155 259849 273387 260236 232409 216696 194326 155987 119797 117318 94140 82252 71749
8584 71749 56802 42797 37021 40323 45386 58932 77083 77542 63292 72823 70242 68838 33463
8571 33463 9895 11441 9040 -11408 -27710 -34137 -44540 -28381 -2341 25889 24632 17141 25873
8558 25873 8052 8924 39500 31747 21608 12353 5942 -12911 -9743 9852 23565 12764 -9965
8545i965j4309N399K609K029L635j3865N712N009J9756p490q275Q887J428q240
8531g680J4246R492j77p879k3099o418K6354M624P000J750j2767J965j0457Q845
8517E799J7718J9741l03R590p975r838p785j2307p969J5752J2306o944m291j0634
8503A2860J0739P320k1304l621Q186Q776K0680J414j6798K3206K672k5737m344
8490B4049m748r591j0059J1202k898j8132r214J5511J3909l349J212j3844j5184
8477b1136Q617J4669J691P018j0307p23M073j210p447m171L2479J3123j106j4175
8463B1395J134J0851J2896p026l6399k1174n044N67R700N617j1288l25K068K3330
8449F302N457M996p732o887J0230K106p659j3608J2008J0897K177m795k1799k0601
$$ plain form
8545 -9965 -24274 -18875 -16266 -14237 -10602 -24467 -18755 -13746 6010 -1480 -9755 -868 560 -7680
8531 -7680 6566 16058 15881 8002 -15097 -21515 4839 9463 16463 18213 5446 7411 -3046 5799
8517 5799 23517 43258 42955 52545 44570 34732 26947 14640 6671 22423 34729 27785 23494 12860
8503 12860 23599 30919 9615 5994 14180 22956 43636 45050 28252 51458 54130 28393 24049
8490 24049 19301 9710 -349 10853 7955 -10177 -19391 -3880 10029 6680 7892 -5952 -21136
8477 -21136 -12519 2150 3841 10859 552 -171 3902 2692 -4755 -8926 23553 36676 35570 21395
8463 21395 22529 33380 46276 39250 2851 -18323 -23367 -22800 -13100 -7483 -18771 -19096 -17028 6302
8449 6302 11759 16755 9023 2136 12366 14472 6813 -6795 5213 16110 18287 13492 -8307 -28908
8435b8908m085J6252J5325L701j4055K995P446J6045M744j4695j5743q15J7404
8422E611r342j1296J9159O275j0853j3711J6058K2372j7467J03p773j1460R020
8409c304K3186J747K6979r69j6849j4733N18p331q438k382p682j2340n080j622
8395b8300j5658K463L330K4966J4690J5343J1645J0478m459j0065k3803k702p029
8382i101k5903j8527R29J9577J4762m051J4608Q058R514O179j4982j3444j0058
8369b2439n699J0518J4462P518j2P895n147q821O100J7348j9985j7013J5623J7096
8355A7444J5653L902J5704n324j4525j4432k2868K1673J0725j9844r299l036J3473
8342I246J640O594Q957O618k9004J0407M275k2536j7528N039M874o692j8100M010
$$ plain form
8435 -28908 -32993 -16741 -1416 2285 -11770 -8775 -1329 14716 19460 4765 -10978 -11793 5611
8422 5611 -3731 -15027 4132 10407 -446 -14157 1901 24273 6806 6909 -864 -12324 -3304
8409 -3304 19882 21629 48608 47639 30790 16057 16575 9244 806 -1576 -9258 -21598 -26678 -28300
8395 -28300 -43958 -41495 -38165 -13199 1491 16834 28479 38957 34498 24433 630 -2072 -9101
8382 -9101 -35004 -53531 -52602 -33025 -18263 -22314 -7706 352 9866 16045 1063 -12381 -22439
8369 -22439 -28138 -17620 -3158 4360 4348 12243 7096 -1725 4375 21723 1738 -15275 348 17444
8355 17444 33097 36999 52703 47379 32854 18422 -4446 17227 27952 8108 -1191 -4227 9246
8342 9246 10886 17480 26437 33055 4051 14458 18733 -3803 -21331 -16292 -11418 -18110 -36210 -32200
8328c2200j784M926J1441k995J458J9253M233j4691k170J0994P164j837l49k5041
8314b1598n035K2349n462N039O425N402o933N755p801P891j0021j4376J7672Q867
8300H174O50Q004m2177j4027P50O052J6930K7133n914l240k645m40P181K167l603
8285D995K2252q38J554j4574l77K0907J312P459J636O667k1787o609L646j0922
8271A5321j2515m747K1462k8548k614Q13q004N690J911J3203j0768J887J1417
8258D508q522k0427L5555J4474k2343j1451J2581R572j7494m423K1566J2346l1425
8245e483k7179Q606k1423K181K7918J4762o868j1156O184j4941m293N259N409
8232b1024J2194O029N177M700p282q543k994P98J1561M448J1638O312M194k5070
$$ plain form
8328 -32200 -33984 -29058 -17617 -20612 -19154 99 4332 -10359 -12529 -1535 5629 3792 3443 -21598
8314 -21598 -26633 -4284 -9746 -4707 1718 7120 187 5942 -1859 6032 -3989 -18365 -693 8174
8300 8174 8824 16828 -25349 -39376 -38626 -32574 -15644 11489 5575 2335 -310 -750 6431 8598 4995
8285 4995 27247 26409 27963 13389 13012 33919 35231 42690 44326 50993 29206 22597 26243 15321
8271 15321 2806 -1941 19521 -9027 -11641 -10828 -18832 -13142 -11231 1972 -8796 -6909 4508
8258 4508 -4014 -24441 11114 25588 3245 -8206 4375 13947 -3547 -7970 13596 25942 -5483
8245 -5483 -32662 -24056 -45479 -43298 -15380 -618 -7486 -18642 -12458 -27399 -31692 -26433 -21024
8232 -21024 -8830 -2801 2376 7076 -206 -8749 -11743 -10945 616 5064 16702 23014 27208 2138
8218B138K881K0535K250j1694J4619R455j2249N36k5908k1959n995Q847L8239
8205B1695L4148r956m8847k5592J2521O343m205J1800J4882M835j2391L072K582
8192A0887l2424n438K0258L229K660l073m155P020l397j77j2441J3672K5855J0548
8178C3024j0345n190J5449R929J956l7071k5791j527q207K579L2299M308O428
8165A7841J4652j1812n035O565j929l626K045j0425j9048p816j922L245J6387
8152h78J8823K5934j6001k9728j0660j2243n34J1756L573p98J2215Q613j749m783
8138C540L066R562j6160k4633n00J4501k876j9741L119J7424Q631N976k059m890
8124e040J0859m386R025j2133r656j5929m358J6116L3205J8124j1558O276j7736
$$ plain form
8218 2138 5019 25554 27804 16110 30729 40184 27935 28471 2563 -19396 -25391 -16544 21695
8205 21695 55843 45887 -2960 -28552 -16031 -9688 -13893 -2093 12789 17624 5233 8305 10887
8192 10887 -21537 -26975 -6717 -3488 -828 -3901 -8056 -1036 -4433 -4610 -17051 -3379 22476 33024
8178 33024 22679 17489 32938 42867 44823 7752 -18039 -19566 -27773 -25194 7105 11413 17841
8165 17841 32493 20681 15646 22211 20282 16656 18701 8276 -10772 -18588 -20510 -17265 -878
8152 -878 17945 43879 27878 -1850 -12510 -24753 -25287 -13531 -9958 -10756 1459 10072 8323 3540
8138 3540 6606 16168 8 -24625 -25125 -10624 -13500 -33241 -30122 -12698 -4067 1909 -150 -5040
8124 -5040 5819 1433 10458 -1675 -11331 -27260 -31618 -15502 17703 35827 24269 30545 12809
8111A2809m0443K1762J807q509n595N738j5149J0802K6576p172j4227q069o768
8098b6438p863J2435J6159j3941o270k476R417J2201Q443j0022n722R242J4999
8085A0164l718j5035j0320Q530P039l951O666m247j3151k0801R136J2406L0331
8072A3049J8861j8527j500j2172o646k263J5987J556J4280j1359j330N087J1559
8059B6582j1667P185Q799l591m976O748r184j4534j3827J2200J2285Q382n019
8046A9383P895J5626k971N281K6898p486l0737j6151m268M480J9242M61l299j554
8032C2800k5988l808P916J2645r508m72q645J4314Q931J258r995j7409J1427K4751
8018C8217Q587M576m452q44m553J2883K2420L34K6056J0826m188J3017k3593q978
$$ plain form
8111 12809 -27634 -5872 -4065 -12574 -18169 -12431 -27580 -16778 9798 2626 -11601 -19670 -26438
8098 -26438 -34301 -21866 -5707 -19648 -25918 -28394 -18977 -6776 1667 -8355 -14077 -4835 10164
8085 10164 6446 -8589 -18909 -10379 -3340 -7291 -625 -4872 -18023 -38824 -29688 -17282 13049
8072 13049 31910 13383 11883 -289 -6935 -9198 6789 8345 22625 11266 9936 15023 26582
8059 26582 14915 22100 30899 27308 22332 29080 19896 5362 -8465 3735 16020 24402 19383
8046 19383 27278 42904 39933 45214 72112 64626 33889 17738 13470 17950 37192 37653 34354 32800
8032 32800 6812 3004 10920 23565 14057 13585 4940 19254 28185 29443 19448 2039 13466 38217
8018 38217 46804 51380 46928 46084 41531 54414 76834 77168 103224 114050 109862 122879 99286 90308
8004I0308k3308j1420J618p876M074K0047N59N856n933j0583L445l2425J2J855
7990C6229J2599J561j3789r739J516J1967J2614O843J1771k043k9003n632R504
7977D4398k285K192q421J3444J071k038j8181L654J0537p430n657K6984M6918
7964A05186J9943j1921q560j2378k574r539j2414j6867j4944J1324j806j5368
7952C0082p192k0912J097L576Q632L876j783j8402j0637r483j243J3821R122K800
7938C354r092j5706k252J7914N700J4697J2345n799l139o721R744R418J493J1712
7924D3668n776o361j3710J8765L463j2935J709k990J2493j3974j7758j6043K868
7911f581m519K147N957J8456L531m806o197j1636p515J857k503m078O6k1539L838
$$ plain form
8004 90308 67000 55580 57198 49322 53396 73443 74002 79858 73925 63342 66787 34362 34374 36229
7990 36229 48828 50389 36600 26861 28377 40344 52958 59801 71572 69529 40526 34894 44398
7977 44398 42113 44305 35884 49328 50399 48361 30180 33834 44371 36941 31284 58268 105186
7964 105186 125129 113208 104648 92270 89696 80157 67743 50876 35932 47256 45450 30082
7952 30082 22890 1978 3075 6651 15283 19159 17376 -1026 -11663 -21146 -22389 -8568 554 3354
7938 3354 -5738 -21444 -23696 -5782 -82 14615 26960 21161 18022 11301 21045 30463 31956 43668
7924 43668 37892 31531 17821 36586 40049 27114 28823 25833 38326 24352 6594 -9449 -6581
7911 -6581 -11100 -8953 -2996 15460 18991 14185 7988 -3648 -11163 -9306 -11809 -15887 -15821 -37360 -33522
7896c3522m769o787P72J853J2527P558O299J5211j4389j657R501O427P700o749
7882b5j1115J0586J3467q738j2165O143Q674M802j1156L578J73J3997J1625K814
7868C2660j3750m120J2616j38j424j6812m079j1435R73j0210j1967K1029q57j0565
7854a8079j4354j3180J2749N179M448k495L886J0876N441N238K861K867J672K841
7840I950k109j347M930P772j9114j0006j860M986M015P811L725J5166N840l3242
7826c483p820P468r123R880n209M500q452l045K178J2002J13n765J6789O271j1298
7811E006k0307J4005J7136p473j5656O102M725m639R117J5209L479N964O367m318
7797C4717k4143J161l829k4737r138O532O620J5184j8263r616R138j4557k8979
$$ plain form
7896 -33522 -38291 -45078 -44306 -42453 -29926 -22368 -16069 -858 -15247 -16904 -7403 -976 6724 -25
7882 -25 -11140 -554 12913 4175 -7990 -1847 6827 11629 473 4051 4224 18221 29846 32660
7868 32660 18910 14790 27406 27268 25844 9032 4953 -6482 -5509 -15719 -27686 -6657 -7514 -18079
7854 -18079 -32433 -45613 -32864 -27685 -23237 -25732 -21846 -10970 -5529 -291 2570 5437 7109 9950
7840 9950 7841 6494 11424 19196 82 -9924 -11784 -6798 -2783 5028 8753 23919 29759 -3483
7826 -3483 -11303 -3835 -12958 -3078 -8287 -3787 -12239 -15284 -13106 -1104 -991 -6756 10033 16304 5006
7811 5006 -15301 -1296 15840 8367 -7289 -1187 3538 -1101 8016 23225 26704 32668 39035 34717
7797 34717 10574 11735 7906 -16831 -25969 -19437 -12817 2367 -15896 -25512 -16374 -30931 -59910
7784e9910J5898J7708l842L189J5069R075l07j3171q884J9694K6292l366j6664
7771G81j0042j2207q598M110R711K0010k091p812J2842n798k5055m303j3973m045
7757d6470J332J1674m346r822j729J6877o373j5334J6088L3719J3064l786K5016
7744B9910K0363j6097j6398q274r679m557j2451N237J5488R692Q287k952R896
7731B8465K74j2195p912j4074J623M182k3376j727J9526J3199j414J259k0815
7718a2985n545K731O956l791J5802N179k1740Q32L208o855j87n296R05J4879l73
7703f280j7092k265J5140Q028q290q479R448p535P576j3461J1340P116p134K069
7689i819p33P585K6298K4284k6825k5809l591J6255J7597o799j1319k6936j0033
$$ plain form
7784 -59910 -44012 -26304 -30146 -26957 -11888 -2813 -3120 -16291 -25175 -5481 20811 17445 781
7771 781 -9261 -21468 -30066 -25956 -16245 3765 1674 -6138 6704 906 -24149 -28452 -42425 -46470
7757 -46470 -45138 -33464 -37810 -47632 -49361 -32484 -38857 -54191 -38103 -4384 8680 4894 29910
7744 29910 50273 34176 17778 9504 -175 -4732 -17183 -11946 3542 13234 21521 18569 28465
7731 28465 28739 16544 8632 -5442 -3819 363 -23013 -24740 -5214 7985 6571 7830 -12985
7718 -12985 -18530 -15799 -8843 -12634 3168 8347 -13393 -12561 -9353 -16208 -16395 -21691 -20786 -5907 -6280
7703 -6280 -23372 -25637 -10497 -2469 -10759 -19238 -9790 -17325 -9749 -23210 -11870 -4754 -11888 -9819
7689 -9819 -10552 -2967 23331 47615 20790 -5019 -8610 7645 25242 18443 7124 -19812 -29845
7676b9845N509J9674K759m560J3819J329P79L764k7763j2029j141j695m91Q935
7662b0956O618j9159K226K7133J1527J0023k264q7j6527l484K248j2715r133j6468
7648d1018P237P252J9076K025K2282J5367j3386j0997J8654k866j1275l0644P873
7635a0420K3765m0J776O063J4634p936k1344k7281j769J2988K2528K2465l26n135
7621B9968k2124j9494l299L46l195m481J1572M757M005J095l1423J0900J8719
7608b654q523k2722j2338R434M4374j1628k8950j2273J0985k12J0547P667J6911
7595F18n277M982K327k6221r501J2451m318j5785p404J3858L1040k101l304k339
7581a0974J349O728K4101k814l688j3212M957q465M618p237q499j1024n623Q135
$$ plain form
7676 -29845 -24336 -4662 -1903 -6463 7356 8685 9464 13228 -14535 -26564 -27705 -29400 -29891 -20956
7662 -20956 -14338 -33497 -31271 -4138 7389 17412 15148 15061 -1466 -4950 -2702 -15417 -24550 -41018
7648 -41018 -33781 -26529 -7453 -5428 16854 32221 18835 7838 26492 23626 12351 -18293 -10420
7635 -10420 13345 13305 15081 21144 35778 27842 6498 -20783 -22552 -9564 12964 35429 35103 29968
7621 29968 7844 -11650 -14949 -14603 -17798 -22279 -10707 -5950 -1945 -850 -32273 -21373 -2654
7608 -2654 -11177 -33899 -46237 -36803 7571 -4057 -33007 -45280 -34295 -34507 -23960 -16293 618
7595 618 -4659 323 2650 -23571 -33072 -20621 -24939 -40724 -48128 -34270 -3230 -5331 -8635 -10974
7581 -10974 -9625 -2897 21204 18390 14702 1490 6447 -2018 2600 -4637 -13136 -24160 -29783 -21648
7567b1648O524J6508M694L87p724j0717O773J575N568M552k047J830j746j5203
7553a0674m316K2184J0351J946k6419R646o589n144J3718j3213p07L377R830m731
7539g41q126k124j2828m985J5466J377j3606L950m548O986M360R456J395j654
7525e622q249J13q210J5399J4643o801m688N482m519P180Q33J4890l317k457k3983
7510i306k1548R386J2602K058O503O906j5778j901j9372j5663o75L112M313O867
7496c2496L723N854k998P484j1617j7412k361P433j2839l658L00K2456J2221Q818
7482a5092J8398Q450J4301J5519R305l2473j8946j0657O54M841q387m040J5970
7469b157j2001j5979l183J6730Q52J669j4126j3130O694J7429o292j2558K900
$$ plain form
7567 -21648 -15124 1384 6078 6465 -1259 -11976 -5203 -3628 1940 6492 4445 6275 4529 -10674
7553 -10674 -14990 7194 17545 19491 -6928 2718 -3871 -9015 4703 -8510 -9217 -5840 3990 -741
7539 -741 -8867 -10991 -23819 -28804 -13338 -11961 -25567 -21617 -26165 -19179 -14819 -5363 -3968 -5622
7525 -5622 -13871 -13758 -21968 -6569 8074 1273 -3415 2067 -2452 4728 5561 20451 17134 14677 -9306
7510 -9306 -30854 -21468 -8866 -6808 -305 6601 -9177 -11078 -30450 -46113 -46788 -43676 -39363 -32496
7496 -32496 -28773 -22919 -25917 -18433 -30050 -47462 -49823 -42390 -55229 -58887 -58587 -36131 -23910 -15092
7482 -15092 3306 11756 26057 41576 50881 18408 -538 -11195 -10541 -5700 -14087 -18127 -2157
7469 -2157 -14158 -30137 -33320 -16590 -15738 -14069 -28195 -41325 -34631 -17202 -23494 -36052 -33152
7456c3152K5084J7024K50j0670r413q298j1049k4610J1076K3151N45k8k696N590
7442a7196R981L317r200j4908L821J4854N194k015Q239k7447j3233N787J0263
7429b2543J836J0152K0951j8275k0931p966j753q472N53P832M156J4558J3460
7416f442n204O830L189O581J192R148j5570m854R901J3780N49k0534o049J2387
7402D904r636l2679m7N797p71J8690J8233R158j3783j1420j6555K498J3401j4200
7388b6410J6655J2436q118L130m015j0415j2844J8151J8061K925J1448K1518J7982
7375F0504k9727k7775j9597J8526K789M251J5801L110j0509k0377q017R193N125
7362C297J8271J4197R89l4910k8133J2691J231R260J1796N920m050j8036l192
$$ plain form
7456 -33152 -8068 8956 9206 -1464 -10877 -19175 -30224 -54834 -43758 -20607 -20062 -20090 -22786 -17196
7442 -17196 -7215 -3898 -13098 -28006 -24185 -9331 -4137 -6152 2087 -25360 -38593 -32806 -22543
7429 -22543 -20707 -10555 10396 -7879 -28810 -36776 -38529 -47001 -46448 -38616 -34460 -19902 -6442
7416 -6442 -11646 -4816 -1627 4954 6146 15294 -276 -5130 4771 18551 19100 -1434 -7483 4904
7402 4904 -4732 -37411 -37458 -31661 -32432 -13742 4491 13649 -134 -11554 -28109 -25611 -12210 -26410
7388 -26410 -9755 2681 -5437 -2307 -6322 -16737 -29581 -11430 6631 9556 21004 42522 60504
7375 60504 30777 3002 -16595 1931 4720 8971 24772 27882 17373 -3004 -11021 -1828 3297
7362 3297 21568 35765 36754 1844 -26289 -13598 -12367 -3107 8689 14609 10559 -7477 -10669
7349a0669j1105J1714R979m528j3918n600R273R89k495J510P515J4509M958R108
7335B1240j2190P765p679l875p725j7745n772q706M769O068K4156j4850J5133
7322E89J7268O40K180j2216L556J3420K6518j9875k1744N312J1002j7170j0584
7309a104J653K444p708J0189m975p135k500K2137J5730l958j2921j2171m47j5379
7295a6145j9465L38p994R130K8716j252l94l84j4230L07J1243J7005o152j3343
7281a2620p240J6697J3743j0155k4087p753j3296M02k958R453j210N918J6852
7268a6254j8524L652J1359J2818J2339N68Q431p714J4196L450o168k1032j2430
7255a5309J2129k55r243j2161J8375L45p532k4827p205L0289l71J590q121M948
$$ plain form
7349 -10669 -21774 -10060 -81 -4609 -18527 -24127 -14854 -13865 -16360 -14850 -7335 7174 12132 21240
7335 21240 9050 16815 9136 5261 -2464 -20209 -25981 -34687 -29918 -23850 306 -14544 589
7322 589 17857 18497 20677 8461 12017 25437 51955 32080 10336 15648 26650 9480 -1104
7309 -1104 549 2993 -4715 5474 499 -6636 -9136 13001 28731 24773 11852 -319 -766 -16145
7295 -16145 -35610 -35272 -43266 -34136 -5420 -6672 -7066 -7450 -21680 -21373 -10130 6875 723 -12620
7281 -12620 -19860 -3163 10580 425 -23662 -31415 -44711 -44309 -47267 -37814 -39024 -33106 -16254
7268 -16254 -34778 -31126 -19767 -6949 5390 5958 14389 6675 20871 24321 18153 -2879 -15309
7255 -15309 -3180 -3435 -12678 -24839 -6464 -6119 -13651 -38478 -45683 -15394 -15765 -14175 -22296 -17348
7241a7348J1301J1673K1161O241L435J6695j6013j9862L181j7116j1658J9265
7229A0955J4616K1377j3524n179j5759k1532K4524J0497j5354k472j1068m267
7217g186k6509O221J1801p434p379M0131N028k6750N467K3991n002j3614j2216
7204a3451Q343j2796P538K1108L216J558J5003K122r944o227j2070k5823j5039
7191c6462m653J7053j3520J8946J7729j8512M674P693n958j2966L977m103j6383
7178d2485J8088L3284J962K0107p313M157m996j7033j932p405M290P136m931k2237
7164a9308j0090J2682k882J2388L00j3617j303K5301Q56j7562R556J2263j9903
7151a1319j0820K0414k447N044J2526j4750j4614q820K115J0548L5345L735j8800
$$ plain form
7241 -17348 -6047 5626 26787 33028 36463 53158 37145 17283 20464 3348 -8310 10955
7229 10955 25571 46948 33424 28245 12486 -9046 15478 25975 10621 8149 -2919 -7186
7217 -7186 -33695 -27474 -15673 -23107 -30486 9645 14673 -12077 -6610 17381 12379 -1235 -13451
7204 -13451 -5108 -17904 -10366 10742 13958 15516 30519 32641 22697 16470 4400 -21423 -36462
7191 -36462 -41115 -24062 -37582 -18636 -907 -19419 -14745 -7052 -13010 -25976 -21999 -26102 -42485
7178 -42485 -24397 8887 10849 30956 23643 27800 22804 5771 3839 -3566 724 7860 2929 -19308
7164 -19308 -29398 -16716 -19598 -7210 -6910 -20527 -21830 3471 4327 -13235 -3679 8584 -11319
7151 -11319 -22139 -1725 -4172 872 13398 -1352 -15966 -24786 -22671 -12123 23222 26957 8157
7138H157k0349k2711M5776K5943j8947j1595r54K657l199j2063o684j2330J109
7125b5190K6586j1071j0917K1411O451m154L07j3656J0836J861o746R972M539
7112A0229j1065M260m201j5765m264m458j1996Q465L0042N523J9442m721j3484
7099H007Q191j5599n377j3405j472L986K580j4408n250K3840K2261j4680k5048
7086b6374p551k281J8544L0701K1979m337n223R605K508l203R025J2315n294j2423
7072C7991k6968p462n943K140m073l696q089k350J1168N987J0763K249j2637J267
7058C47R524j2577J1015J6553o745j3500k174K0175J6497k1477l4433L866K511
7045a0418P633j812J9584J4620J2877o820j0805j3456O459N847J7012l464o180
$$ plain form
7138 8157 -12192 -34903 10873 36816 17869 6274 5320 7977 4778 -7285 -13969 -26299 -25190
7125 -25190 1396 -9675 -20592 819 7270 3116 3423 -10233 603 2464 -4282 5690 10229
7112 10229 -836 3424 -777 -16542 -20806 -25264 -37260 -28795 1247 6770 26212 21491 8007
7099 8007 16198 599 -4778 -18183 -19655 -15669 -13089 -27497 -32747 -8907 13354 -1326 -26374
7086 -26374 -33925 -36206 -17662 13039 35018 30681 25458 35063 37571 34368 43393 55708 50414 37991
7072 37991 11023 3561 -2382 -242 -4315 -8011 -16100 -18450 -7282 -1295 9468 11717 -920 347
7058 347 9871 -2706 8309 24862 18117 4617 2443 22618 39115 17638 -16795 -12929 -10418
7045 -10418 -2785 -4597 14987 29607 42484 35664 24859 11403 17862 23709 40721 37257 31077
7032C1077q903l012O882J5282J8599m472k8543l3293q162J6041K2637J3364k0780
7019A6717k7593K005M526m294L767J1835r307j9058n760o571O791R689o061m267
7005b7581m71J8441M52j5195J0617Q551l1473l11J0749K0249J1574j1820j0106
6992a6324L3r354k44M129J13J2712M532j7424P711P542k188O333p765R37N579
6977c678o7L964J1705K291j1874K852r63q51m207k4714j1186J0829k240K3085
6963e054j656m852j786N149j2445n22M121L499o687L641J71K1525K5361k8871
6949A594j2625J4977M508q127q906J6759j20j304N72L386j2199N002J3423j8723
6935a783k2618J283Q743N932k919K365k0372k6078L8782J5120N304k4901q334
$$ plain form
7032 31077 22174 19162 26044 41326 59925 55453 26910 -6383 -14545 1496 24133 37497 16717
7019 16717 -10876 -8871 -4345 -8639 -4872 6963 -2344 -21402 -27162 -33733 -26942 -17253 -23314 -27581
7005 -27581 -28052 -9611 -9159 -24354 -13737 -5186 -36659 -36970 -26221 -5972 5602 -6218 -16324
6992 -16324 -16291 -25645 -25889 -21760 -21647 -8935 -4403 -21827 -14116 -6574 -8762 -2429 -10194 -9257 -3678
6977 -3678 -3745 219 11924 14215 2341 5193 4230 3379 -828 -25542 -36728 -25899 -28139 -5054
6963 -5054 -6710 -11562 -13348 -8199 -20644 -21166 -17045 -13546 -20233 -16592 -16421 5104 30465 1594
6949 1594 -11031 3946 8454 327 -8579 8180 8060 6756 7328 10714 -1485 3517 16940 -1783
6935 -1783 -24401 -23118 -14375 -8443 -11362 -8997 -29369 -55447 -16665 -1545 3759 -21142 -29476
6922b9476J0059N728O090J1716j2875L42L103o216q631O892P56J5247L786K491
6908I012j5108k5855K1218J5867r911j5506O878J7615J1281j1503k539j2264j266
6895a2081o24n463o007k627o255K9775K4886r942l1498K720j2771n44N549m892
6881b9774m679N09q346K717q143n11K3314K5139N794j5376j4401N598r084Q680
6867a8563J4371K4970J9462q072l0145j7993Q601j2961O925R443n819N992M610
6854H21j700J1880M354p614O630Q481j0814n89j7471l556J1435M89k8721o221
6840c2596L0832J3457j8639J727O628K414J6032j170P097q015J8561J744l0209
6827G863m1512r96N056L1433j4219k789l975K7J1345j3051p087J0523J9002P610
$$ plain form
6922 -29476 -19417 -13689 -7599 4117 -8758 -8416 -5313 -11529 -20160 -13268 -12512 2735 6521 9012
6908 9012 -6096 -31951 -10733 5134 -4777 -20283 -13405 4210 15491 3988 1449 -10815 -12081
6895 -12081 -12705 -18168 -24175 -26802 -33057 -3282 21604 11662 -19836 -17116 -29887 -30431 -24882 -29774
6881 -29774 -34453 -33944 -42290 -39573 -47716 -48227 -24913 226 6020 -9356 -23757 -18159 -27243 -18563
6867 -18563 -4192 20778 40240 32168 2023 -15970 -7369 -20330 -13405 -3962 -9781 -3789 821
6854 821 -879 11001 15355 7741 14371 22852 12038 11449 -6022 -9578 1857 2346 -26375 -32596
6840 -32596 -1764 11693 -6946 -5219 1409 3823 19855 18685 25782 17767 36328 38072 7863
6827 7863 -33649 -34645 -29589 1844 -12375 -15164 -19139 -19112 -7767 -20818 -27905 -17382 1620 9230
6813I230N175j4839K343m852k0573j7972J6053K2428J1725j8604l2855j0910J8933
6800c4718K2001N628K426k960N349j0576n296K6542J4694r538p790m574k206R084
6786H066O674N607j1256o730k0513k7269M10L8564J8066k37j9480r515L681K0891
6772F959J6469j275l205J387j1313N593k6434j6218Q253J7947J2199N913o080
6759A0195j0208Q08P539j0955m037r754o494K4784Q868o001K9201q444J8575P952
6745E2029P956l182o885k2139L708j0376l094j2483N387L0148J3698J053k002
6732E3818J6741K4275J6127L4621K6488M9647L7872k2507m7535m3217l2216m3419
6720G0695l1787j050J0946j1047j037j0498j6719j0286o980q135m123K0363J4552
$$ plain form
6813 9230 14405 -434 1909 -2943 -23516 -41488 -25435 -3007 8718 -9886 -42741 -53651 -34718
6800 -34718 -12717 -7089 -4663 -7623 -2274 -12850 -18146 8396 23090 13552 5762 1188 -1018 8066
6786 8066 14740 20347 9091 2361 -18152 -45421 -45011 -6447 11619 11382 -8098 -17613 -13932 6959
6772 6959 23428 22153 18948 20335 9022 14615 -11819 -28037 -19784 -1837 10362 16275 10195
6759 10195 -13 795 8334 -2621 -6658 -16412 -22906 1878 10746 4745 33946 25502 44077 52029
6745 52029 59985 56803 49918 27779 31487 21111 18017 5534 10921 41069 54767 55820 53818
6732 53818 70559 94834 110961 145582 172070 221717 259589 237082 189547 146330 114114 70695
6720 70695 38908 37858 48804 37757 36720 26222 9503 -783 -7763 -15898 -20021 342 14894
6707A4894n226o712q945j469l132J312J4625Q349j34r62k1716k8466k7093Q313
6693e6362R685J6398J4545k5447j3035J6537K1331q160M621P795K853N691O565
6680C017j2362k1489O06K1784L423k6010k8581J1592J3420r54k0280K7359L5170
6667F695J52J583N452n909m591j8768q149J1762M812J5308n370m899j3915J833
6653a4004M323m677j1275m697J2520J192J685J4768k1401o710J1074N917K185
6640i100M848J2993q358j7385N963K4977L580M437j5220p443j471L090R944J2344
6626B3199o290l506Q739n886k8215p038K3932K2990k986j7747m746j4743k899
6613a5196J155j4126q171M035R993J626J0945j0055L4640K3609r92p682j633j4642
$$ plain form
6707 14894 9668 2956 -5989 -7458 -10590 -9278 5347 13696 13562 12600 -9116 -37582 -64675 -56362
6693 -56362 -46677 -30279 -15734 -41181 -54216 -37679 -16348 -24508 -19887 -12092 -9239 -3548 3017
6680 3017 -9345 -30834 -30228 -8444 -5021 -31031 -59612 -48020 -34600 -35554 -55834 -28475 6695
6667 6695 6847 8430 13882 7973 3382 -15386 -23535 -11773 -6961 8347 2977 -1922 -15837 -14004
6653 -14004 -9681 -14358 -25633 -30330 -17810 -16618 -14933 -165 -21566 -28276 -17202 -11285 -9100
6640 -9100 -4252 8741 383 -17002 -11039 13938 17518 21955 6735 -708 -2179 911 10855 23199
6626 23199 16909 13403 22142 16256 -11959 -18997 4935 27925 24939 7192 2446 -12297 -15196
6613 -15196 -14041 -28167 -36338 -32303 -22310 -20684 -9739 -19794 14846 38455 37463 29781 28148 13506
6599A3506j9317k078L105J5643L852L227Q57k2897k0123j260j1569l289K1822
6586a8521Q418N14P564m094L202J3456j8701j4601l197J9532J3743J3083Q649
6573B9047j3802n547j7940j675K0399L582k1005k6428K6495j87l638Q877k629
6560d451J7616j7212j0041K9255R652J1465N911r40j3509j9925l670j9828L213
6547a2464j15n752J6575P855l838J1018n554j2482K748M03q269K879O13l538Q274
6532a647o71J0987j3911L224O722m810J535R317r914j5815p704J131j5797N577
6518c1776R383J5312L578K1496J0553p103j4939L190j1460N60o118o140N990j0210
6504a7684K167J2514K0962o997r929J3369k954l288j0938k123j1781J9982J6505
$$ plain form
6599 13506 -5811 -7889 -4784 10859 14711 17938 18795 -4102 -24225 -25485 -37054 -40343 -18521
6586 -18521 -10103 -9589 -2025 -6119 -2917 10539 -8162 -22763 -25960 -6428 7315 20398 29047
6573 29047 15245 9698 -8242 -9917 10482 14064 -6941 -33369 -6874 -7061 -10699 -1822 -4451
6560 -4451 13165 -4047 -14088 15167 24819 36284 42195 41255 27746 7821 4151 -15677 -12464
6547 -12464 -12579 -18331 -1756 6099 2261 13279 7725 -4757 -2009 -1606 -9875 -6996 -6383 -9921 -1647
6532 -1647 -2318 8669 -5242 -2018 4704 -106 1429 10746 832 -14983 -22687 -21556 -37353 -31776
6518 -31776 -22393 -7081 -3503 17993 28546 21443 6504 9694 -1766 -1206 -7324 -13464 -7474 -17684
6504 -17684 -15517 -3003 17959 10962 1033 14402 11448 8160 -2778 -4901 -16682 3300 19805
6491A9805P539q979p670j6842k8355L285j653K0509K7011K167n639j8732o816
6478a4370J1545J8433k270j5715l857J2680j2344J542j2771k517L3251K6824l32
6465D0099J696j3841l2849j1934j0822p036R305K224J1178j2482L231J8647N554
6452B970P706j1355k1579Q083J9126r805o724o063j2447L103K1777L307O140J49
6438D388m01J5831J9091m004j1468J7615n056j7571l7302j3616p503J0175Q974
6425b0847l380J759O374R617q130m159P153K9623K357n766n605n948j04q200J0620
6410E364N357Q902K1164M227j3930j7205o201R627m402P79r175J1138K5292j9063
6396B1874j7729k701j6128K7680K5247r684p155J0980j5187j8267R974J6001m932
$$ plain form
6491 19805 27344 18365 10695 -6147 -34502 -31217 -32870 -12361 14650 16817 11178 -7554 -14370
6478 -14370 -2825 15608 13338 -2377 -6234 6446 -5898 -4356 -17127 -19644 13607 40431 40099
6465 40099 41795 27954 -4895 -16829 -27651 -34687 -25382 -23158 -11980 -24462 -21231 -2584 2970
6452 2970 10676 -679 -22258 -14175 4951 -4854 -11578 -17641 -30088 -26985 -5208 -1901 4239 4388
6438 4388 3987 19818 38909 34905 23437 41052 35996 18425 -18877 -32493 -39996 -29821 -20847
6425 -20847 -24227 -22468 -16094 -6477 -14607 -18766 -11613 18010 20367 14601 8996 3048 2944 -5256 5364
6410 5364 10721 19623 40787 45014 31084 13879 7678 17305 12903 13682 4507 15645 40937 21874
6396 21874 4145 1444 -14684 12996 38243 28559 21404 32384 17197 -1070 8904 24905 19973
6383A9973k412p31N339m454o040K0757J395j3959p557p714Q492q717j1468J0077
6369B981J8735j723k996J5R879q518K424k404k838j2665R52p251m903L941r522
6354a3893J08J4125o92J3166j1485j9506m714L764P060L987P606J4927K667k0593
6340c473j9175k2585J817J5191J5639K6617j1381J2588J6517k5695l628K650q251
6327c169k965K5061P303J797M200j8082k6885n421j10K4872J479j3949O28R159
6313C918j9060J052K2284r173j0797L925K3393l894p351l289J5487o070O903J5563
6299C2891o742l724q164p664P368j9754j6004l569J3046j3232q334J8185K5104
6286I407q655r230l53K7052P941j3828M598j9101j5646J4717J2083M924k8600
$$ plain form
6383 19973 17561 16830 22169 17715 11675 32432 33827 19868 12311 4597 13089 4372 -7096 2981
6369 2981 21716 19993 16997 17012 26891 18373 20797 18393 15555 2890 3842 -3409 -8312 -4371 -13893
6354 -13893 -13785 340 -352 12814 1329 -18177 -22891 -19127 -12067 -8080 -474 14453 17120 -3473
6340 -3473 -22648 -45233 -43416 -28225 -12586 14031 2650 15238 31755 6060 2432 5082 -3169
6327 -3169 -6134 18927 26230 28027 32227 14145 -12740 -18161 -18271 6601 8080 -5869 -5241 3918
6313 3918 -15142 -14090 8194 -979 -11776 -7851 15542 11648 4297 1008 16495 10425 17328 32891
6299 32891 26149 22425 14261 6597 13965 -5789 -21793 -25362 -12316 -25548 -33882 -15697 9407
6286 9407 752 -8478 -8831 18221 26162 12334 16932 -2169 -17815 -3098 8985 13909 -14691
6273a4691j1600j275J7138K135k0219L170Q033K6560m262r678r181L467j2818
6260b3221j4076K4588R237m969N185J2409k7343j1843K3116K6036l0603k0987
6248c2471q885o144J1820J0013Q060J6267o725j5469L461J2592J109r043j5526
6235c0941k003j6157P857R230O441j834J578Q092K0555K1128j9155K423n343o361
6221d490J1681J480O957J5338O218o399j3599O474J1357m646K181q807r754n911
6207H080j6646k5608J4837J3986P239N42r01M427k120k2017r923J8884O241q28
6193c807J2093l543k524J4230O795J019k2305O005J1691K185k948l389j0722j6004
6179a1224J3927J1885n141J8571Q942j0965j4405p077j421j6708K352K5763Q009
$$ plain form
6273 -14691 -26291 -27566 -10428 -8293 -28512 -25342 -17309 9251 4989 -4689 -13870 -10403 -23221
6260 -23221 -37297 -12709 -3472 -8441 -3256 9153 -18190 -30033 -6917 19119 -11484 -32471
6248 -32471 -41356 -47500 -35680 -25667 -17607 -1340 -8065 -23534 -20073 -7481 -6372 -15415 -30941
6235 -30941 -32944 -49101 -41244 -32014 -25573 -27407 -25829 -17737 2818 23946 4791 7214 1871 -4490
6221 -4490 7191 8671 15628 30966 37184 30785 17186 23660 35017 30371 32552 23745 13991 8080
6207 8080 -8566 -34174 -19337 -5351 1888 2430 1529 5956 3836 -18181 -28104 -9220 -2979 -3807
6193 -3807 8286 4743 2219 16449 23244 24263 1958 7963 19654 21839 18891 15502 4780 -11224
6179 -11224 2703 14588 9447 28018 36960 25995 11590 4513 3092 -13616 -11264 14499 22508
6166B2508k1675p088J5662k624K643Q654J7307j2528k3737r822k2290J7497K5285
6153I792j557O775k535j9539j4806j4239J718K2259J0409J2058J0628r743l717
6140G503J2615j9496k292p020n699J0065k823j4345m383j1316k339J0768K5968
6127b794l392k2391L903J644J5392J0084K7655j1888k4598q002l087j4768o576
6114c8818j2949J0436M1476P845j0941o295l990K6996K6291j0399l866j0193q083
6101G510r395J167J6342j3430m248j0883Q506K14J5315K2717p230k772L897j7688
6087A0022J2910R462m783j8746j3856k0320R617P21J3886J8552N312l0346k6412
6074c3981P530K0053J2363J1334n101R061K8716q571k8667p709J913k3065J0968
$$ plain form
6166 22508 833 -6255 9407 6783 9426 18080 35387 22859 -878 -10700 -32990 -15493 9792
6153 9792 8235 15010 12475 -7064 -21870 -36109 -34391 -12132 -1723 10335 20963 11220 7503
6140 7503 20118 622 -1670 -8690 -14389 -4324 -7147 -21492 -25875 -37191 -39530 -28762 -2794
6127 -2794 -6186 -28577 -24674 -23030 -7638 2446 30101 18213 -6385 -14387 -17474 -32242 -38818
6114 -38818 -51767 -41331 145 7990 -2951 -9246 -13236 13760 40051 29652 25786 15593 7510
6101 7510 -1885 -718 15624 2194 -2054 -12937 -4431 -4217 11098 33815 26585 23813 27710 10022
6087 10022 22932 32394 27611 8865 -4991 -25311 -15694 -14973 -1087 17465 22777 -7569 -33981
6074 -33981 -26451 -6398 5965 17299 12198 21259 49975 41404 12737 5028 6941 -16124 -5156
6061e156J3495j0180j8444r893L447J7198J9108O844o109j1597p946j67r884J176
6047a8108j1005p398k472J0131n56k622p59J8764O810j6257j319Q018P227J5397
6033E851j9881p442J7247J5389J797k9514P152K3306R446j0917Q561n270j1754
6020C971j0532r250K9515m301j9926k3062l309m136K3446K5536j3483q493j5045
6007b9069L379L1210n485j2412j1858K2610J8084N578k1336j5640R60j8359m970
5994c7308J4157P80n25p757n892O81K7873J6378Q323p231k1125j4564k292J3152
5980a5350O208O447q698O601R762Q226J662J011J1615n671J2164J0449k0533l1443
5966g550K966n687l510L751k205K8439J8012q006p028j427k4152K785J8692K770
$$ plain form
6061 -5156 8339 -1841 -20285 -30178 -26731 -9533 9575 16419 10310 -1287 -9233 -9400 -19284 -18108
6047 -18108 -29113 -36511 -38983 -28852 -29408 -32030 -32789 -14025 -7215 -23472 -24791 -16773 -9546 5851
6033 5851 -14030 -21472 -4225 11164 12961 -16553 -9401 13905 23351 12434 20995 15725 3971
6020 3971 -6561 -15811 13704 9403 -10523 -33585 -36894 -41030 -17584 7952 -5531 -14024 -29069
6007 -29069 -25690 5520 35 -12377 -24235 -1625 16459 22037 701 -14939 -13979 -32338 -37308
5994 -37308 -23151 -22371 -22896 -30653 -36545 -35864 -7991 8387 16710 9479 -11646 -26210 -28502 -15350
5980 -15350 -9142 -2695 -11393 -4792 4970 13196 14858 15869 27484 21813 33977 44426 23893 -7550
5966 -7550 -4584 -10271 -13781 -10030 -12235 16204 34216 26210 19182 17755 -6397 -3612 15080 17850
5952A7850j8562p832o797L157J5362j6915j3579L8935K1987R767j5173j7597r52
5939I651j0596J605l057j9655j5583P49J7714L3338Q141o529j6824j4181K811
5926a2416K616M338J2853J2691j3917N622K2851n331j250N050k4034j0886K960
5913A147j2811o968Q718M536P515M373J2062N714q602n227J3290r666j2343L432
5899E170m015o386j0907M4048J6464k656K11N702j0894k7877j4136R39Q748J9705
5885B4116N65k7988j3864N620O005P561J8686J0299p436l6588j8740M062K3744
5872c958J3929l364O72J2505k340j0774j8537k0269J7949P079J1048Q287r174
5859C053J0250J6988N130Q47n653j4081n375k0337K90J0805j4717J9344J29o791
$$ plain form
5952 17850 -712 -8544 -15341 -12184 3178 -13737 -27316 11619 33606 43373 28200 10603 9651
5939 9651 -945 660 -2397 -22052 -37635 -36886 -19172 14166 22307 15778 -1046 -15227 -12416
5926 -12416 -9800 -5462 7391 20082 6165 11787 34638 29307 28057 33107 9073 -1813 1147
5913 1147 -11664 -18632 -9914 -5378 2137 6510 18572 24286 15684 10457 23747 14081 1738 5170
5899 5170 1155 -5231 -16138 27910 44374 41718 41929 47631 36737 8860 -5276 -4337 4411 24116
5885 24116 24681 -3307 -17171 -11551 -5546 2015 20701 31000 23564 -13024 -31764 -27702 -3958
5872 -3958 9971 6607 7279 19784 17444 6670 -11867 -32136 -14187 -7108 3940 12227 3053
5859 3053 13303 30291 35421 36268 30615 16534 11159 -9178 -8888 1917 -12800 6544 6673 -118
5845a18k501M536q282j2294J4112J7481J0160j564q813O939q030k9831Q67k319
5831a9657J5123K7517J1370o525K679J1050N590r642j8394K2903n115j6999j3877
5818F023j3245M074J7624k1K4635J3807j6890r950p026j2805k1801M831P646O48
5804b450j89o922m3L211J2780K171J0869j0886j4152N000l096Q289J473j5656
5790i601k141M24J0791j4262k716r187Q244p636k14J0362J377N762N542J0579
5776G324J816L018j702O38j2425o417L201L786N451L054J298j1323o817J0861
5762A763j1705j2412k0514J1169K9950M40j208j4471l971N906j352N89n844J9030
5748b630L3490R442k4023l2580j8782J0851m788j3212j523j1285J0824Q081N061
$$ plain form
5845 -118 -2619 1917 -6365 -18659 -4547 12934 23094 21530 12717 19656 11626 -18205 -17338 -19657
5831 -19657 -4534 22983 34353 27828 30507 41557 47147 37505 19111 42014 36899 19900 6023
5818 6023 -7222 -3148 14476 14455 39090 52897 36007 26057 19031 6226 -15575 -10744 -3098 -2450
5804 -2450 -2639 -9561 -9604 -6393 6387 8558 19427 8541 -5611 -611 -3707 4582 6055 -9601
5790 -9601 -11742 -11318 -527 -14789 -17505 -26692 -18448 -26084 -26298 -15936 -14559 -8797 -3255 7324
5776 7324 9140 12158 10456 11094 -1331 -7748 -4547 -761 4690 7744 9042 -2281 -9098 1763
5762 1763 -9942 -22354 -42868 -31699 -1749 -1309 -2517 -16988 -20959 -15053 -16405 -15816 -21660 -2630
5748 -2630 30860 40302 16279 -16301 -35083 -24232 -29020 -42232 -43755 -55040 -44216 -36135 -31074
5735c1074J3217j391O136K309J1327P654o682J6422l415l4056J5318J0197J828
5722G790j0265m129q458j0178m821J7394k381J0968K1413J0370j926o555m216
5709A5006r886J2868j7106n221p695P691K946K326J421Q374j4223q547j0929J4890
5695h085M476L53J5535n197k360J108J8414j4767k3128j8299j7036J8453K3170
5682g363K408J4905M206N688k7029o443R913K4419R139j6728j6920j7942l908
5669b5655R512K240j0500j4579j5043J056P613J7610K3620q773n589n775M525
5656a9738P670Q968M056P975R22K4398j6513j8982P264N135J7262J2492k5352
5643A5557j7651O479j3959j877N145l776j1155K875k902p36J5222L157l336P12
$$ plain form
5735 -31074 -17857 -19248 -13112 -10803 524 8178 1496 17918 14503 -19553 -4235 5962 7790
5722 7790 -2475 -6604 -15062 -25240 -30061 -12667 -15048 -4080 17333 27703 25777 19222 15006
5709 15006 5120 17988 882 -4339 -12034 -4343 -1397 929 2350 10724 -3499 -12046 -22975 -8085
5695 -8085 -3609 -3256 12279 7082 4722 5830 24244 9477 -13651 -31950 -48986 -30533 -7363
5682 -7363 -4955 9950 14156 19844 -7185 -13628 -3715 20704 29843 13115 -3805 -21747 -25655
5669 -25655 -16143 -13903 -24403 -38982 -54025 -52969 -45356 -27746 -4126 -12899 -18488 -24263 -19738
5656 -19738 -12068 -3100 956 8931 9853 34251 17738 -1244 6020 11155 28417 40909 15557
5643 15557 -2094 4385 -9574 -11451 -6306 -10082 -21237 -18362 -21264 -22000 -6778 -3621 -6957 -6245
5629f245P334j7213j5423L271m200K2522R24J0782q111r209j4691O242j6354L082
5615c7289K506Q929J0141J6344P982J44k8294j4595K4111N268q935k619j996J3626
5601d677K083j4795j0209n49p327J304Q098O542O467L413J5275p591r220R341
5587a845q488L802J6347o853r542j3789o654o45J9573k947J1388L420o492j605
5573d330K1542N292l1713l167N167P432k2399k231K1723J6144K921j7277j7053
5560a7949K971p657J818K3541K266Q439n83l087k363O842k727p158m392j288j421
5545b748o748o857j3074J0816N482k163J7454k462r107P395O067P055K325j4774
5531a339n209N45K0818Q72r05j761j3970n419N789j528K54m1343j5942K1967L757
$$ plain form
5629 -6245 1089 -16124 -31547 -28276 -32476 -9954 -9030 1752 -6359 -15568 -30259 -24017 -40371 -37289
5615 -37289 -34783 -25854 -15713 631 8613 8757 -19537 -34132 -10021 -4753 -13688 -16307 -18303 -4677
5601 -4677 -2594 -17389 -27598 -28147 -35474 -34170 -26072 -19530 -13063 -9650 5625 -1966 -11186 -1845
5587 -1845 -10333 -6531 9816 2963 -6579 -20368 -27022 -27667 -8094 -11041 347 3767 -2725 -4330
5573 -4330 17212 22504 -9209 -12376 -7209 223 -22176 -24407 -2684 13460 16381 -896 -17949
5560 -17949 -14978 -22635 -20817 2724 4990 13429 12846 9759 7396 14238 11511 4353 -39 -1327 -2748
5545 -2748 -9496 -16353 -29427 -18611 -13129 -15292 2162 -300 -9407 -2012 4055 11110 13435 -1339
5531 -1339 -6548 -6003 14815 15687 14782 13021 -949 -6368 -579 -2107 -1853 -43196 -59138 -37171 -33414
5516c3414K59J6636M258j9699Q494k491P322N003j3556J1355J4626j2993m912
5503a9112J0364J0338J7513Q406R469j8377j9005j3394q308L007J1973M398q169
5490a0897L0219J783l2447k49J4485J8100j8231j1696n659n696p511N558k371
5477b4612Q4m465J8976K5167k548N472j1684L37o273j2208J939Q83k052L508k391
5462i867L287N535j0436K567j9342n599L0731K5257J6475l5815q371q925J81p330
5448b1652j085Q112K3721p54O054r745r535j8048R709O226J8878o742q523j1106
5434a4490j0679m594j0976J7212J2519o733p017j4411m169J4939J2973N191k864
5421a3099k523N455r398j8065N524L11J3800M02l212J361k016j0688Q409n371
$$ plain form
5516 -33414 -33155 -16519 -12261 -31960 -23466 -25957 -18635 -13632 -27188 -15833 -1207 -14200 -19112
5503 -19112 -8748 1590 19103 27509 36978 18601 -404 -13798 -22106 -19099 -7126 -2728 -10897
5490 -10897 19322 21105 -11342 -11591 2894 20994 2763 -8933 -14592 -20288 -27799 -22241 -24612
5477 -24612 -24528 -28993 -10017 15150 12602 18074 6390 6727 454 -11754 -9815 -8932 -10984 -7476 -9867
5462 -9867 -6580 -1045 -11481 -8914 -28256 -33855 -3124 22133 38608 2793 -5578 -14503 -14322 -21652
5448 -21652 -22737 -14625 9096 8342 14396 4651 -4884 -22932 -13223 -6997 11881 5139 -3384 -14490
5434 -14490 -25169 -29763 -40739 -23527 -11008 -17741 -24758 -39169 -43338 -28399 -15426 -10235 -13099
5421 -13099 -15622 -10167 -19565 -37630 -32106 -31795 -17995 -17593 -20805 -19444 -21460 -32148 -23739 -29110
5407b9110q128K002O305j6837K667J9196R729J2090J244J0727J3239l5305l2775
5394d4956J1312J8127L7549J1409j5114J558J0510O628j7688l3437j2621k897
5382b9620J2702R293K23K186J1893J8493K6929J104k2298j5075j362k502o946
5369E020k8489l122J0478J8365m120j1108N867l294l097p536j6157j1174K6317
5356b2050K4194J954j0303R662K314P32j872J4654J1986J9532j7394j5692l103
5343A4614j6054r182p634l991J3691l527k232O493J2974r216j9033r533J5343
5330a7287J9046m256J3446J35k2703j1247P07k0947R893L7230K0817n12j5944
5317H378l5238o159J1278o972l087P343P83j0728J1532L0392K0894Q740k896o235
$$ plain form
5407 -29110 -37238 -35236 -28931 -45768 -43101 -23905 -14176 -2086 -842 9885 23124 -12181 -44956
5394 -44956 -33644 -15517 22032 33441 18327 19885 30395 37023 19335 -14102 -26723 -29620
5382 -29620 -16918 -7625 -7402 -5216 6677 25170 52099 53203 30905 15830 14468 11966 5020
5369 5020 -23469 -26591 -16113 2252 -1868 -12976 -7109 -10403 -13500 -21036 -37193 -48367 -22050
5356 -22050 2144 4098 -6205 3457 5771 6503 4631 19285 31271 50803 33409 17717 14614
5343 14614 -1440 -10622 -18256 -22247 -8556 -12083 -14315 -7822 5152 -4064 -23097 -32630 -17287
5330 -17287 1759 -2497 10949 11084 -11619 -22866 -22159 -43106 -33213 4017 24834 24322 8378
5317 8378 -26860 -33019 -21741 -28713 -31800 -24457 -23674 -34402 -22870 7522 28416 37156 34260 28025
5303B8025k702P522Q031k6896l024J8266L212j4432j0739p709J2285j4638k0931
5290b3730l099J8239J4361J723l516p948m78J540J2168J491j4196J69j6208o362
5276b5846J6821P621m70P719J1441l036k6395j2929K3510q984l653J2674m932
5263f459K115L825m26Q081N484J7759p123j4930J8765k454K673j3917q247l1018
5249b5872r10K0652M804R703M569l925o013r41M765l182j3867q877L972M445j7588
5234b8265k4590K3434J4787R08o559J7878J3269O99l653J9M808k0735k338R45
5220i393Q32L61K7561K2603k9551k9153P074J1881J5222r637j9642j0690O443
5207a6089J5219J970j5226L419P323O538m715j0150m61o447R762J2341J55O624
$$ plain form
5303 28025 25323 32845 40876 13980 10956 29222 32434 18002 7263 -446 11839 -2799 -23730
5290 -23730 -26829 -8590 5771 7494 3978 -3970 -4448 -2908 9260 10751 -3445 -3276 -19484 -25846
5276 -25846 -9025 -1404 -1874 5845 17286 14250 -12145 -25074 -1564 -10548 -14201 -1527 -6459
5263 -6459 -4344 -519 -945 7136 12620 30379 23256 8326 27091 24637 27310 13393 5146 -25872
5249 -25872 -26782 -6130 -1326 8377 12946 9021 3008 2067 6832 3650 -10217 -19094 -15122 -10677 -28265
5234 -28265 -52855 -29421 -14634 -13726 -20285 -2407 10862 11561 7908 7927 12735 -8000 -10338 -9393
5220 -9393 -8561 -8200 19361 41964 12413 -16740 -9666 2215 17437 7800 -11842 -22532 -16089
5207 -16089 -870 1100 -14126 -10707 -3384 3154 -1561 -11711 -12172 -18619 -8857 3484 3639 10263
5193A0263J595J0234J0202L032p159r455J5656L75k0285k2645l900k363L81K472
5179a1597J3949J0578r926j4118n215j3157q717J7135m713q210Q55K915J1857
5166a8364j509J821P204p408P510O115j4964K966K6541O975k0852j3243M658K0512
5152G962J6296j1975K072n196J3176j6751j6K756J1133l384k1358l812J2970P050
5138A0923n150m274r583L061K0590J4170k0446j3840q11N4K679n162M113j0453
5124a4129J259L668J2353J490j496J218n236j6770J2664L339O777l130j282J8790
5110A9515J2129j0669j5990l846k264j1779q274P736o80J3206K9260R928j6178
5097B2094l8939j3476O309J5156J3077j3670J0522J838r326J2989o717j1685o954
$$ plain form
5193 10263 11858 22092 32294 35326 28167 18712 34368 34743 14458 -8187 -12087 -14450 -14069 -11597
5179 -11597 2352 12930 3004 -11114 -16329 -29486 -38203 -21068 -25781 -33991 -33136 -30221 -18364
5166 -18364 -19873 -18052 -10848 -18256 -10746 -4631 -19595 -16629 9912 16887 -3965 -17208 -12550 7962
5152 7962 24258 12283 14355 9159 22335 5584 5568 8324 19457 16073 -5285 -9097 3873 10923
5138 10923 5773 1499 -8084 -5023 15567 29737 9291 -4549 -5360 -5306 -2627 -7789 -3676 -14129
5124 -14129 -12870 -9202 3151 4641 3145 4363 -873 -17643 -4979 -1640 5137 2007 725 19515
5110 19515 31644 20975 4985 1139 -1125 -12904 -21178 -13442 -14122 -916 28344 38272 22094
5097 22094 -16845 -30321 -24012 -8856 4221 -9449 1073 2911 -6415 6574 -143 -11828 -18782
5084a8782l3N464R256n805q004m563r979K92Q285M798O497J1519J5728J0358k934
5069B2097J6K693k4030n184J843J1800o215n768N722r691n929M310J7815l575
5055E904j5657j0901n858m734j271J4855R172N685R810J5696j3386k6081j3836
5042c0602o280J8018J9729m685m217K276J6671K238p5j1294j1753R305J3533Q266
5028B1130o125J283R272l0606q190r824M224j8219o029K4194J9857K1205j3085
5015I087k5877n238K1773J2785j4332J2651J0496p585p936n374k2412N187K9730
5002A2955Q181q342m397n722K1505p453M845N070j5322j2067M183j0120j5402
4989b2086J8282K1200L047L45j353j8800l433m743o331N000O903P76l0040J079
$$ plain form
5084 -18782 -18815 -13351 -4095 -9900 -17904 -22467 -32446 -32154 -23869 -19071 -12574 -1055 14673 25031 22097
5069 22097 22113 24806 776 -4408 -2565 9235 3020 -2748 2974 -6717 -12646 -8336 9479 5904
5055 5904 -9753 -20654 -26512 -31246 -32517 -17662 -8490 -2805 7005 22701 9315 -16766 -30602
5042 -30602 -36882 -18864 865 -3820 -8037 -5761 10910 13148 13073 1779 -9974 -669 12864 21130
5028 21130 15005 16288 25560 -5046 -13236 -23060 -18836 -37055 -43084 -18890 967 22172 9087
5015 9087 -16790 -22028 -255 12530 -1802 10849 21345 13760 5824 450 -21962 -16775 12955
5002 12955 21136 12794 8397 2675 24180 16727 21572 26642 11320 -747 3436 -6684 -22086
4989 -22086 -3804 17396 20443 20788 19435 635 -2798 -7541 -13872 -8872 -1969 -1193 -31233 -30154
4975c0154J9427N518o77J364j3049J925P198J177K9912l086k4711o898J2914R810
4961A0670J2240j1397j1302N640L221n53o943J9868N888j0580j3223J277j4071
4948i265m706o86J7002p59k0699p856K3220J636K272J0593j1489J3256J6254O039
4934C4812m078J2497K738m088n873m5957l150J4886K917n122j0492j1120K601
4921a9429Q81L610J592j736Q10L422j655J2730K7418j980k4961j5309K7030K2204
4907C4627J949k738k2271j1507j594L295k258K202J8066K849j950j4142j4385
4894g857K844J1797j480n340j9447O199L520J648Q405j431O627J5687p169l052
4880A0951p030j042Q265o90r817j5294j36K0923R074K402j2562k7256j2167L629
$$ plain form
4975 -30154 -10727 -5209 -5886 -4522 -17571 -15646 -8448 -7271 22641 19555 -5156 -12054 860 10670
4961 10670 22910 11513 211 5851 9072 8519 1576 21444 27332 16752 3529 4806 -9265
4948 -9265 -13971 -14657 2345 1586 -19113 -26969 -3749 -2113 159 10752 -737 12519 28773 34812
4934 34812 30734 43231 45969 41881 36008 -9949 -13099 1787 4704 -418 -10910 -22030 -19429
4921 -19429 -18548 -14938 -13346 -15082 -14272 -10850 -12505 225 27643 25663 702 -14607 12423 34627
4907 34627 36576 33838 11567 60 -1534 1761 -497 1705 19771 22620 20670 6528 -7857
4894 -7857 -5013 6784 5304 -36 -19483 -13284 -9764 -8116 289 -1142 5485 21172 14003 10951
4880 10951 3921 2879 11144 10454 637 -14657 -14793 6130 15204 17606 5044 -22212 -34379 -30750
4866c0750Q699R84j4681O570P12K5785L802j6677l489j5159L668j263J2289K7203
4852G693R42j4899J568J5302n7l826O65R568J923j4821J4618J7000k9025K537
4838I188n144j3900j4712P285K0277J5187j1041k5290j281L2887Q662j743p65
4825A9610j5460j2573J1516R0K670J862r889j0778l940J1284L901J21R603Q160
4811A6177M789j3995j8749j0365J2570m079R645K257L825K4179r90J9210n009
4798C9465j0449j1955p932j7543j5929p933J3447J7017K798O802Q541P763j020
4785B3072J3434l937k1813k3142o658j6815J0710J0441m503o642k950j5375N78
4772d3600r177L7055K4622K0814J652o265k191j0745K711M59r178j9686l606J381
$$ plain form
4866 -30750 -22051 -21067 -35748 -29178 -28466 -2681 1121 -15556 -19045 -34204 -30536 -31799 -19510 7693
4852 7693 8635 -6264 -4696 10606 10549 6723 7388 16956 18879 4058 18676 35676 6651 9188
4838 9188 4044 -9856 -24568 -17283 2994 18181 7140 -18150 -19431 13456 22118 20375 19610
4825 19610 4150 -8423 3093 3183 5853 7715 -2174 -12952 -16892 -5608 -1707 -1586 8017 16177
4811 16177 20966 6971 -11778 -22143 -9573 -13652 -4007 -1750 2075 26254 25264 44474 39465
4798 39465 29016 17061 9129 -8414 -24343 -32276 -18829 -1812 986 7788 16329 24092 23072
4785 23072 36506 32569 10756 -12386 -19044 -35859 -25149 -14708 -19211 -25853 -28803 -44178 -43600
4772 -43600 -52777 -15722 8900 29714 31366 25101 22910 12165 14876 15335 6157 -13529 -17135 -15754
4758a5754k967o76J1816J5761J3014m605j5292M846J5860J6816K750L412J3203
4745E8184l1256l6926k294J1417J2784m272k375J1748K039r241j7367J0060N550
4732H051L698Q182o754l712j0405M11j5614j6443J4872K7650J9909j8935k3211
4719a2301P713M443j2777L111K794k671o837l708M529Q867n747q366n653o178
4705c2781P437M246L942N690o946n731m359J6119O403m894p586O815K1935l219
4691G071J8132p011k7220j1893l165J2066k074j894J6999J7811L871k281j9347
4678A065j8118J3308J541j243M03L37l307r847j72L53K5051O176q444j0608j4784
4663a8289m234N871K0904n381j8698r539k1657K0188J2983j4893P809L2203J3418
$$ plain form
4758 -15754 -18721 -19397 -7581 8180 21194 16589 1297 6143 22003 38819 41569 44981 58184
4745 58184 26928 -9998 -12292 -875 11909 7637 5262 17010 19049 9808 -7559 2501 8051
4732 8051 11749 19931 13177 9465 -940 -529 -16143 -32586 -17714 9936 29845 10910 -12301
4719 -12301 -4588 -145 -12922 -9811 -7017 -9688 -16525 -20233 -15704 -6837 -12584 -20950 -26603 -32781
4705 -32781 -25344 -21098 -17156 -11466 -18412 -24143 -28502 -12383 -5980 -10874 -18460 -11645 10290 7071
4691 7071 25203 18192 -9028 -20921 -24086 -12020 -14094 -15988 1011 18822 22693 20412 1065
4678 1065 -17053 -3745 -2204 -3447 -3044 -2707 -6014 -15861 -16033 -15680 9371 15547 7103 -3505 -18289
4663 -18289 -22523 -16652 4252 -1129 -19827 -29366 -51023 -30835 -17852 -32745 -24936 7267 20685
4650B0685J0087J6133j9116j5630l190L137q444N137J9321p035k8649N635R522
4637G593p445j0777K2998j1141k3598P40j1728k7075R403L3098J6728J9617Q24
4624A9237m450k4624J1033l106l354L0449J4906j7925j8756j6303r55o369j2338
4611c2555l449Q792j0440j5423J650J1033M952J7551L1004Q795j5668L289J694
4598A1225j9495k733J2223Q262M70l109N506m236J0506j1403j8684J7635K4553
4585C0720k2360j3931j0618J5819K0708N934j2021J1389j606n595J1178p31r322
4572A9564J845j0266j3376o954L894Q883J4649M257O678r748j8293p788Q480K8554
4558C0379o024o983k3431j9853K7814J2360k30j001J0399j1974k0258j3183m729
$$ plain form
4650 20685 30772 46905 27789 12159 8969 12106 3662 8799 28120 21085 -7564 -1929 7593
4637 7593 148 -10629 12369 1228 -22370 -21630 -33358 -60433 -51030 -17932 -1204 18413 19237
4624 19237 14787 -9837 1196 -1910 -5264 25185 40091 22166 3410 -12893 -13848 -20217 -32555
4611 -32555 -36004 -27212 -37652 -53075 -51425 -40392 -35440 -17889 13115 21910 6242 9531 11225
4598 11225 -8270 -11003 1220 9482 9952 6843 12349 8113 18619 7216 -11468 6167 30720
4585 30720 8360 -5571 -16189 -370 20338 26272 14251 25640 24034 18439 29617 28886 19564
4572 19564 21409 11143 -2233 -9187 -5293 3590 18239 22496 29174 19426 1133 -6655 1825 30379
4558 30379 24355 17372 -6059 -25912 1902 14262 14032 13031 23430 11456 -8802 -21985 -26714
4545b6714J4638J0112R649J0546j7574q534L644P851J1639p639M554J5958j1937
4532A6193j2856J4719k772k863j7538k5782p215j684P828J9945l49J9209j1106
4519d271P52k0812j2577P669J0990J7976N549J0732Q036n997n110j6730P33K502
4505e58QK2695J5048j2703j9628k3998p066Q279J503Q108K959l422J5129R429
4491A5783o751n17P918k8630L494L6495O763j3908k285l308n435l729K1483R903
4477C7276j3736k0683r424l945M270J8699o555n047j9061o472K903J467N290J5188
4463A70K1727M625k5731j1773J347J1951M475p790j0172P814K3423k343q538L062
4449A2247J0174J408o653P374J4962r248l2248l7941N059K6433K1244j0036q528
$$ plain form
4545 -26714 -12076 -1964 7685 18231 657 -7877 -4233 3618 15257 7618 12172 28130 16193
4532 16193 3337 18056 15284 12421 -5117 -30899 -38114 -39798 -31970 -12025 -12374 6835 -4271
4519 -4271 -3519 -24331 -36908 -29239 -18249 -273 5276 16008 24044 18047 12937 -3793 -3060 -558
4505 -558 -550 22145 37193 24490 4862 -19136 -26202 -17923 -16420 -8312 -5353 -8775 6354 15783
4491 15783 9032 8515 16433 -12197 -8703 27792 34555 20647 18362 15054 9619 5890 27373 37276
4477 37276 23540 2857 -6567 -10512 -6242 12457 5902 855 -18206 -24678 -21775 -20308 -15018 170
4463 170 21897 26522 791 -10982 -9635 2316 6791 -999 -11171 -3357 20066 17723 9185 12247
4449 12247 22421 23829 17176 24550 39512 30264 -1984 -39925 -34866 -8433 12811 2775 -5753
4436e753J3800L551o297m652M561P896N188Q581k7238r657r928j8132J636J8862
4422a7582J3424R313J1979J7622j6850L947L362k4810J709k688j3392j175R217
4409e924K760O955J7766L909O941j1531l1476j0146J0785L569N35j4917j2795
4396c3569O127r49J1630K3381L707m415j4553o988j267m689P558J0958j1679j0164
4382b4912K5509J4229l949j1683O07n624p208J8865J8618P285p307m894M30r861
4368A0105K643O095q901k893j6981j513M980o964K479P929Q829J4895L75j3734
4354G344r444j4726k5682n43L3744J6673O558o212m215j4843j568L190j5348j51
4340b5223R966q714R301j6410j3575J4095J5289J258q246M171K4529p40J4023
$$ plain form
4436 -5753 8047 11598 5301 649 5210 13106 18294 26875 -363 -10020 -19948 -38080 -36444 -17582
4422 -17582 -4158 5155 17134 34756 17906 21853 25215 405 2114 -574 -13966 -15141 -5924
4409 -5924 -3164 3791 21557 25466 32407 20876 -10600 -20746 -9961 -6392 -5857 -20774 -33569
4396 -33569 -27442 -28391 -16761 6620 10327 5912 -8641 -15629 -16896 -21585 -14027 -3069 -14748 -24912
4382 -24912 597 14826 10877 -806 -199 -5823 -13031 5834 24452 31737 24430 19536 19966 10105
4368 10105 12748 18843 9942 7049 -9932 -11445 -6465 -13429 -10950 -3021 5808 20703 21078 7344
4354 7344 -2100 -16826 -42508 -43051 -9307 7366 13924 7712 3497 -11346 -12914 -9724 -25072 -25223
4340 -25223 -15257 -23971 -14670 -31080 -44655 -30560 -15271 -14013 -22259 -18088 6441 5701 19724
4327A9724K0325l612k1084j6577N021j012q180k6743J2129J4291j459J8708R124
4314B0655Q705j5843j6180l675n276k1986J4610j517q36L937R052o174J2496J163
4300h69j818p12N582Q291j8667j3604J9901J79j1477L835q172o043L6j3367K855
4285c4050J9993J0675R073J0424l309O336K786j7745j7240N174l659K2887J1863
4272B3208j8139q263K826j32O54O850j4015R11L56K631K8560M28q765P634k0454
4257D290j9951j5245J849M640O291J6289j909P600K102q965J8812J2141M14l3262
4243d904l6694q103N746K3121q811r47j124m483K2466K589L805o643j4950J3377
4229a5555J1519k5877j4174N981J3455P412r605J7272J0537j4547o397P703R16
$$ plain form
4327 19724 40049 36437 15353 -1224 3797 2785 -5395 -32138 -20009 -5718 -7177 11531 20655
4314 20655 29360 13517 -2663 -6338 -11614 -33600 -18990 -20507 -21343 -17406 -8354 -14528 -2032 -869
4300 -869 -2687 -3399 2183 10474 -8193 -21797 -1896 -1717 -13194 -9359 -17531 -23574 -23538 -36905 -34050
4285 -34050 -14057 -3382 5691 16115 12806 19142 21928 4183 -13057 -7883 -11542 11345 23208
4272 23208 5069 -3194 -368 -500 154 7004 -7011 -6100 -5744 -3113 25447 25875 17110 24744 4290
4257 4290 -15661 -30906 -29057 -24417 -18126 -1837 -3746 3854 5956 -3009 15803 27944 28358 -4904
4243 -4904 -41598 -49701 -43955 -20834 -29645 -30592 -31716 -36199 -13733 -11144 -7339 -13982 -28932 -15555
4229 -15555 -4036 -29913 -44087 -38106 -24651 -17239 -26844 -9572 965 -13582 -19979 -12276 -11360
4216a1360j317M786J0378J1603j1750j7193m09J3111L5694N249m800m374l7441
4203g823K907J384j9223J5016k408K912R944k4236L774O911q185k942J1510M909
4189e550M406j0484j3287O498O937o641Q199P979R994Q76k8496j2324J4974L0941
4175A4022q16o804j8219J2470K3251j6156k2429j1423m831K6585N849N430l58
4162F571p499l011n94j9853o501J0353J0941m067j9438k115L1866r531J5815J1272
4148A4209l084K083J262r622K948q143L763q733l117K1397K4776n358k0083j1306
4134I92J079R961j0408j020k1578j8381J2238M525j426Q829j084l603M446n158
$$ plain form
4216 -11360 -12677 -7891 2487 14090 2340 -14853 -15262 -2151 33543 38792 33992 29618 -7823
4203 -7823 -4916 -3532 -22755 -7739 -10147 -7235 2709 -21527 -17753 -10842 -19027 -21969 -10459 -5550
4189 -5550 -1144 -11628 -24915 -18417 -11480 -18121 -9922 -1943 8051 8927 -19569 -31893 -16919 14022
4175 14022 13206 6402 -11817 653 23904 7748 -14681 -26104 -30935 -4350 1499 6929 6571
4162 6571 -928 -3939 -4533 -24386 -30887 -20534 -9593 -13660 -33098 -35213 -3347 -12878 2937 14209
4148 14209 11125 13208 14470 4848 7796 -347 3416 -5317 -8434 12963 37739 32381 12298 992
4134 992 2071 12032 1624 604 -20974 -39355 -27117 -22592 -24018 -15189 -16273 -19876 -15430 -20588
$$ [...]
##END NTUPLES=NMR SPECTRUM
##END=
