##TITLE=Analysis number 315500
Compound Code cc 29901
Project Code adrs
Chemist Name endeavour
##JCAMPDX= 6.0         $$ Bruker NMR JCAMP-DX V2.0
##DATA TYPE= NMR SPECTRUM
##DATA CLASS= NTUPLES
##ORIGIN= Bruker BioSpin GmbH
##OWNER= NMR
$$ XWIN-NMR		Version 3.5
$$ Tue Nov 22 09:58:02 2005 GMT Standard Time (UT+0h)  MAYBRIDGE\NMR@NMR_250MHZ
##.OBSERVE FREQUENCY= 250.131544655141
##.OBSERVE NUCLEUS= ^1H
##.ACQUISITION MODE= SIMULTANEOUS (DQD)
##.ACQUISITION SCHEME= undefined
##.AVERAGES= 16
##.DIGITISER RES= 18
##SPECTROMETER/DATA SYSTEM= dpx250
##.PULSE SEQUENCE= zg30
##.SOLVENT NAME= DMSO
##.SHIFT REFERENCE= (INTERNAL, DMSO, 0, 16.522)
##AUDIT TRAIL= $$ (NUMBER, WHEN, WHO, WHERE, WHAT)
$$ ##TITLE= Audit trail, XWIN-NMR		Version 3.5
$$ ##JCAMPDX= 5.01
$$ ##ORIGIN= Bruker BioSpin GmbH
$$ ##OWNER= NMR
$$ C:\u/data/dgb/nmr/ADRS/12790/pdata/1/auditp.txt
$$ ##AUDIT TRAIL=  $$ (NUMBER, WHEN, WHO, WHERE, WHAT)
(   1,<2005-11-22 09:57:14.70 +000>,<MAYBRIDGE\NMR>,<NMR_250MHZ>,
      <created by zg, POWCHK disabled, PULCHK disabled
       configuration hash MD5:
       62 19 C7 07 E1 42 D1 B7 37 6C 3D D0 77 39 F9 E6
       data hash MD5: 64K
       AB FA CF A6 9E E1 21 60 53 EC 41 E4 A6 CE 4B 92>)
(   2,<2005-11-22 09:57:37.57 +000>,<MAYBRIDGE\NMR>,<NMR_250MHZ>,
      <Start of raw data processing
       ef LB = 0.3 FT_mod = 6 PKNL = 1 SI = 32K 
       data hash MD5: 32K
       09 6C A3 0D 71 6C 7D D9 A6 38 D6 FF 16 96 73 55>)
(   3,<2005-11-22 09:57:40.98 +000>,<MAYBRIDGE\NMR>,<NMR_250MHZ>,
      <apk 
       data hash MD5: 32K
       10 B3 EA B7 CE 5A 35 61 AC 92 81 2D 3D F6 C4 43>)
(   4,<2005-11-22 09:57:42.64 +000>,<MAYBRIDGE\NMR>,<NMR_250MHZ>,
      <abs ABSG = 5 
       data hash MD5: 32K
       3B 86 6A 61 F7 38 37 01 94 FE B2 7F BE 4B 18 01>)
$$ ##END=
$$ 
$$ hash MD5
$$ B9 6E A5 C0 FD A0 C3 8F 20 F7 AB 6A 70 A1 62 34
##$RELAX= 
##$RELAX= 
##$RELAX= 
##$RELAX= 
##$RELAX= 
##$RELAX= 
##$RELAX= 
$$ Bruker specific parameters
$$ --------------------------
##$DU= <C:\u>
##$EXPNO= 12790
##$NAME= <ADRS>
##$PROCNO= 1
##$TYPE= <nmr>
##$USER= <dgb>
##$AMP= (0..31)
100 100 100 100 100 100 100 100 100 100 100 100 100 100 100 100 100 100 
100 100 100 100 100 100 100 100 100 100 100 100 100 100 
##$AQSEQ= 0
##$AQ_mod= 3
##$AUNM= <au_zg>
##$AUTOPOS= <8 >
##$BF1= 250.13
##$BF2= 250.13
##$BF3= 250.13
##$BF4= 250.13
##$BF5= 500.13
##$BF6= 500.13
##$BF7= 500.13
##$BF8= 500.13
##$BYTORDA= 1
##$CFDGTYP= 0
##$CFRGTYP= 5
##$CHEMSTR= <none>
##$CNST= (0..31)
1 1 145 1 1 1 1 1 1 1 1 1 1 1 1 1 1 1 1 1 1 1 1 1 1 1 1 1 1 1 1 1 
##$CPDPRG= <>
##$CPDPRG1= <>
##$CPDPRG2= <>
##$CPDPRG3= <>
##$CPDPRG4= <mlev>
##$CPDPRG5= <mlev>
##$CPDPRG6= <mlev>
##$CPDPRG7= <mlev>
##$CPDPRG8= <mlev>
##$CPDPRGB= <>
##$CPDPRGT= <>
##$D= (0..31)
0 1 0 0 0 0 0 0 0 0.06 0 0 0 0 0 0 0.0002 0 0 0 0 0 0 0 0 0 0 0 0 0 0 
0 
##$DATE= 1132653432
##$DBL= (0..7)
120 120 120 120 120 120 120 120 
##$DBP= (0..7)
150 150 150 150 150 150 150 150 
##$DBP07= 0
##$DBPNAM0= <>
##$DBPNAM1= <>
##$DBPNAM2= <>
$$ [...]
##$SUBNAM7= <"">
##$SUBNAM8= <"">
##$SUBNAM9= <"">
##$SW= 20.6930455092707
##$SWIBOX= (0..15)
0 0 3 0 0 0 0 0 0 0 0 0 0 0 0 0 
##$SW_h= 5175.983436853
##$TD= 65536
##$TD0= 1
##$TE= 294.16
##$TE2= 300
##$TE3= 300
##$TEG= 300
##$TL= (0..7)
0 120 120 120 120 120 120 120 
##$TP= (0..7)
150 150 150 150 150 150 150 150 
##$TP07= 0
##$TPNAME0= <>
##$TPNAME1= <>
##$TPNAME2= <>
##$TPNAME3= <>
##$TPNAME4= <>
##$TPNAME5= <>
##$TPNAME6= <>
##$TPNAME7= <>
##$TPOAL= (0..7)
0.5 0.5 0.5 0.5 0.5 0.5 0.5 0.5 
##$TPOFFS= (0..7)
0 0 0 0 0 0 0 0 
##$TUNHIN= 0
##$TUNHOUT= 0
##$TUNXOUT= 0
##$USERA1= <user>
##$USERA2= <user>
##$USERA3= <user>
##$USERA4= <user>
##$USERA5= <user>
##$V9= 5
##$VALIST= <valist>
##$VCLIST= <CCCCCCCCCCCCCCC>
##$VD= 0
##$VDLIST= <DDDDDDDDDDDDDDD>
##$VPLIST= <PPPPPPPPPPPPPPP>
##$VTLIST= <TTTTTTTTTTTTTTT>
##$WBST= 1024
##$WBSW= 4
##$XGAIN= (0..3)
0 0 0 0 
##$XL= 0
##$YL= 0
##$YMAX_a= 584023
##$YMIN_a= -411142
##$ZGOPTNS= <>
##$ZL1= 120
##$ZL2= 120
##$ZL3= 120
##$ZL4= 120
##$ABSF1= 16.522
##$ABSF2= -4.171173
##$ABSG= 5
##$ABSL= 3
##$ALPHA= 0
##$AQORDER= 0
##$ASSFAC= 0
##$ASSFACI= 0
##$ASSFACX= 0
##$ASSWID= 0
##$AUNMP= <proc_1d>
##$AZFE= 0.1
##$AZFW= 0.1
##$BCFW= 0
##$BC_mod= 0
##$BYTORDP= 0
##$COROFFS= 0
##$CY= 12.5
##$DATMOD= 1
##$DC= 0
##$DFILT= <>
##$DTYPP= 0
##$F1P= 14.0000005364418
##$F2P= -0.99999901652339
##$FCOR= 0.5
##$FTSIZE= 32768
##$FT_mod= 6
##$GAMMA= 0
##$GB= 0
##$INTBC= 1
##$INTSCL= 1
##$ISEN= 128
##$LB= 0.3
##$LEV0= 0
##$LPBIN= 0
##$MAXI= 10000
##$MC2= 0
##$MEAN= 0
##$ME_mod= 0
##$MI= 0
##$NCOEF= 0
##$NC_proc= -5
##$NLEV= 6
##$NOISF1= 0
##$NOISF2= 0
##$NSP= 0
##$NTH_PI= 0
##$NZP= 0
##$OFFSET= 16.522
##$PC= 1
##$PHC0= 58.69526
##$PHC1= 23.11829
##$PH_mod= 1
##$PKNL= yes
##$PPARMOD= 0
##$PSCAL= 4
##$PSIGN= 0
##$REVERSE= no
##$SF= 250.13
##$SI= 32768
##$SIGF1= 0
##$SIGF2= 0
##$SINO= 400
##$SIOLD= 32768
##$SREGLST= <1H.DMSO>
##$SSB= 0
##$STSI= 32768
##$STSR= 0
##$SW_p= 5175.98343685301
##$SYMM= 0
##$S_DEV= 0
##$TDeff= 65536
##$TDoff= 0
##$TI= <Analysis number 999999
Compound Code 99
Book Reference 9
Project Code 9>
##$TILT= no
##$TM1= 0
##$TM2= 0
##$TOPLEV= 0
##$USERP1= <user>
##$USERP2= <user>
##$USERP3= <user>
##$USERP4= <user>
##$USERP5= <user>
##$WDW= 1
##$XDIM= 32768
##$YMAX_p= 343896215
##$YMIN_p= -492782
$$ End of Bruker specific parameters
$$ ---------------------------------
##NTUPLES= NMR SPECTRUM
##VAR_NAME=  FREQUENCY,     SPECTRUM/REAL,   SPECTRUM/IMAG
##SYMBOL=    X,             R,               I
##VAR_TYPE=  INDEPENDENT,   DEPENDENT,       DEPENDENT
##VAR_FORM=  AFFN,          ASDF,            ASDF
##VAR_DIM=   32768,         32768,           32768
##UNITS=     HZ,            ARBITRARY UNITS, ARBITRARY UNITS
##FACTOR=    0.157963299565203, 1,           1
##FIRST=     4132.6476996994, 0,             0
##LAST=      -1043.33573715361, 0,           0
##MIN=       -1043.33573715361, -492782,     0
##MAX=       4132.6476996994, 343896215,     0
$$ Real data points
##PAGE= N=1
##DATA TABLE= (X++(R..R)), XYDATA
$$ [...]
$$ plain form
17372 -75726 -75663 -42077 -40740 -55914 -38150 -46515 -24075 -73477 -106352 -98818 -34547 -29655 -37696
17359 -37696 -37034 19770 56377 14791 -3919 24881 29212 3703 -40254 -60628 -51879 -8735
17347 -8735 10313 -10565 40068 15474 32106 23357 32094 -17863 -64577 -116561 -82035 -41896
17335 -41896 -67174 -108622 -62050 -54128 -76915 -6278 -9958 -50733 -66504 -62921 -84660 -75575
17323 -75575 -61664 -61386 -38074 -46071 -41629 -31852 -39807 -15820 18765 4582 -65989 -75007 -42123
17310 -42123 55346 68170 94196 36794 23818 -7029 -44831 -14762 -15097 2743 -21564 3977
17298 3977 -29 23184 46546 32196 34020 47900 -3437 -53440 -47839 -51256 -34196 -14660 -41713
17285 -41713 -50115 -78300 -33550 -1357 26660 17868 -27108 -29284 -50693 -26170 -18939 3066
$$ packed form
17372g5726O3L3586J337j5174J7764q365K2440m9402l2875P534O4271M892q041
17359c7696O62N6804L6607m1586j8710K8800M331k5509m3957k0374Q749M3144
17347h735J9048k0878N0633k4594J6632q749Q737m9957m6714n1984L4526M0139
17335d1896k5278m1448M6572P922k2787P0637l680m0775j5771L583k1739R085
17323g5575J3911K78K3312p997M442R777p955K3987L4585j4183p0571r018L2884
17310d2123R7469J2824K6026n7402j2976l0847l7802L0069l35J7840k4307K5541
17298C977m006K3213K3362j4350J824J3880n1337n0003N601l417J7060J9536k7053
17285d1713q402k8185M4750L2193K8017q792m4976k176k1409K4523P231K2005
$$ plain form
17273 3066 18310 -2448 -14108 708 39227 97224 88548 75757 46456 -36637 -85522 -49263
17261 -49263 -24490 -58828 -71111 -25165 -52307 -65834 -88871 -34172 -13260 -50768 -30908 -8262
17249 -8262 -42923 -20473 -34925 -44341 7976 -5582 -28194 -46602 -76350 -73127 -60685 -38475
17237 -38475 -11537 -28328 -23076 -11729 -67749 -58368 -9400 17694 14878 -2334 -22476 -25733
17225 -25733 -14225 6809 -24589 -63866 -36433 -38809 -88428 -79294 -28230 -42342 -56817 -113425
17213 -113425 -114034 -75027 -81875 -77413 -86895 -61646 -49102 -51448 -42439 -568 15388 -16600 -47143
17200 -47143 -18760 -4670 -17367 32531 64257 86835 61557 1062 13868 35677 60612 47670
17188 47670 57741 82072 116565 109296 66043 21833 -15173 -29156 40973 76789 40959 -9304
$$ packed form
17273C066J5244k0758j1660J4816L8519N7997q676j2791k9301q3093m8885L6259
17261d9263K4773l4338j2283M5946k7142j3527k3037N4699K0912l7508J9860K2646
17249h262l4661K2450j4452r416N2317j3558k2612j8408k9748L223J2442K2210
17237c8475K6938j6791N252J1347n6020R381M8968K7094k816j7212k0142l257
17225b5733J1508K1034l1398l9277K7433k376m9619R134N1064j4112j4475n6608
17213a13425o09L9007o848M462r482K5249J2544k346R009M1871J5956l1988l0543
17200d7143K8383J4090j2697M9898L1726K2578k5278o0495J2806K1809K4935j2942
17188D7670J0071K4331L4493p269m3253m4210l7006j3983P0129L5816l5830n0263
$$ plain form
17176 -9304 -71984 -82965 -80507 -114133 -84549 -102134 -150452 -171542 -95231 7961 34553 -3891
17164 -3891 -894 -26966 -66065 -83398 -41552 22341 38620 32976 -12780 -7550 -61316 -98231
17152 -98231 -65957 -44299 5645 25949 22155 9196 -2098 -31103 -67692 -74203 -93977 -103068
17140 -103068 -97132 -73623 -60545 -6856 13658 9707 26484 22187 -3626 -2582 -26400 -113085
17128 -113085 -127187 -56287 -29857 2303 -5211 -10441 639 -2956 -37039 -55416 -43126 -53740
17116 -53740 4193 -10685 -30238 -60885 -63637 -3543 679 8690 31687 2693 -41632 -34264
17104 -34264 -14570 -37912 -111819 -134718 -89006 -12118 30459 5928 1272 -27060 -35582 15781
17092 15781 110821 116818 68022 60988 71747 72870 63170 -315 -78222 -40949 -39277 -29649 -42701
$$ packed form
17176i304o2680j0981K458l3626K9584j7585m8318k1090P6311J03192K6592l8444
17164c891K997k6072l9099j7333M1846O3893J6279n644m5756N230n3766l6915
17152i8231L2274K1658M9944K0304l794j2959j1294k9005l6589o511j9774r091
17140a03068N936K3509J3078N3689K0514l951J6777m297k5813J044k3818q6685
17128a13085j4102P0900K6430L2160p514n230J1080l595l4083j8377J2290j0614
17116e3740N7933j4878j9553l0647k752O0094M222Q011K2997k8994m4325P368
17104c4264J9694k3342p3907k2899M5712P6888M2577k4531m656k8332q522N1363
17092A5781R5040N997m8796p034J0759J123r700o3485p7907L7273J672R628j3052
$$ plain form
17079 -42701 -55463 16643 68499 -5193 -46818 -97141 -106734 -104881 -128439 -66126 -26991 -54175
17067 -54175 -32292 -19601 -34760 -14570 -17995 -11217 -26557 -64390 -43689 -13027 -56042 -105153
17055 -105153 -149256 -158748 -151924 -173257 -157749 -141615 -74978 -32553 -52560 -59942 -19755 -59156
17043 -59156 -46979 -21922 -59454 -57887 8773 44478 11908 7874 12815 25311 -57093 -40001
17031 -40001 -64728 -104082 -105601 -72602 -68062 -91170 -108938 -134630 -100483 -97120 -82988 -57488
17019 -57488 -20472 7802 -200 -35185 -90742 -49238 -35212 -19520 -25082 -11286 8707 2088
17007 2088 -20278 -35806 -19265 25780 -5721 -33699 -2996 12434 33145 74013 49816 33716
16995 33716 51816 84369 83023 89900 66128 33686 -3482 20132 59400 33392 -18264 -2524
$$ packed form
17079d2701j2762P2106N1856p3692m1625n0323r593J853k3558O2313L9135k7184
17067e4175K1883J2691j5159K0190l425O778j5340l7833K0701L0662m3015m9111
17055a05153m4103r492O824k1333J5508J6134O6637M2425k0007p382M0187l9401
17043e9156J2177K5057l7532J567O6660L5705l2570m034M941J2496q2404J7092
17031d0001k4727l9354j519L2999M540k3108j7768k5692L4147L363J4132K5500
17019e7488L7016K8274q002l4985n5557M1504J4026J5692n562J3796J9993o619
17007B088k2366j5528J6541M5045l1501k7978L0703J5430K0711M0868k4197j6100
16995C3716J8100L2553j346O877k3772l2442l7168K3614L9268k6008n1656J5740
$$ plain form
16983 -2524 -11106 -28264 -39478 -39724 -25244 -50413 -32649 -52559 -30879 -66463 -80299 -118877
16971 -118877 -135220 -152978 -109743 -84041 -59049 -55072 -52238 -89999 -95279 -100931 -144596 -138752
16959 -138752 -152059 -115765 -63222 15966 42689 90418 78983 34389 -74836 -84068 -49954
16948 -49954 -93054 -74212 -44819 -57499 -125266 -136962 -70156 -48031 -62490 1582 105818
16937 105818 110515 68461 -9259 -50922 -78635 -81644 -55195 15624 39180 30162 36928 -18046
16925 -18046 -27566 5679 12596 8751 -30742 1336 -974 -32908 -24263 -54585 -49197 -56835 -44167
16912 -44167 -55914 -100701 -124199 -102566 -72590 -54612 -12413 24503 55533 7781 6944 12707
16900 12707 24644 13898 8281 28890 10803 11652 42793 56468 12436 -71060 -47342 -51377
$$ packed form
16983b524q582j7158j1214k46J4480k5169J7764j9910K1680l5584j3836l8578
16971a18877j6343j7758M3235K5702K4992L977K834l7761n280n652m3665N844
16959a38752j3307L6294N2543P9188K6723M7729j1435m4594j09225r232L4114
16948d9954m3100J8842K9393j2680o7767j1696O6806K2125j4459O4072J04236
16937A05818M697m2054p7720m1663k7713l009K6449P0819K3556r018O766n4974
16925a8046r520L3245O917l845l9493L2078k310l1934Q645l0322N388p638J2668
16912d4167j1747m4787k3498K1633K9976J7978M2199L6916L1030m7752q37N763
16900A2707J1937j0746n617K0609j8087Q49L1141J3675m4032q3496K3718m035
$$ plain form
16888 -51377 -71352 -83417 -96220 -78842 -58622 -85482 -55625 -2801 18826 -6749 -73554 -68345
16876 -68345 -48432 -22773 -61917 -68068 -46544 -49441 -16740 -1731 3921 815 -48118 -89929
16864 -89929 -100658 -39848 1869 39461 37001 -6066 -34945 -79928 -127907 -124287 -58058 -47899
16852 -47899 -58649 -48453 -13621 29881 71933 -7112 -37995 1558 -26290 -93717 -111377 -55079
16840 -55079 -18976 -34919 -14314 25141 5401 -13117 -35250 -33633 -18262 -34163 -51896 -23263
16828 -23263 -51494 -48627 -41799 -12739 55253 35706 -15268 1063 36572 79019 77165 41092
16816 41092 1147 -32729 -18778 41498 101780 81320 22666 27090 8035 -17566 -14798 -34608
16804 -34608 -36116 -72221 -65190 -15498 16697 -19770 -19369 -7916 -17226 -19784 -45735 -46933 -85689
$$ packed form
16888e1377j9975j2065j2803J7378K0220k6860K9857N2824K1627k5575o6805N209
16876f8345J9913K5659l9144o151K1524k897L2701J5009N652l106m8933m1811
16864h9929j0729O0810M1717L7592k460m3067k8879m4983m7979L620O6229J0159
16852d7899j0750J0196L4832M3502M2052p9045l0883L9553k7848o7427j7660N6298
16840e5079L6103j5943K0605L9455j9740j8518k2133J617J5371j5901j7733K8633
16828b3263k8231K867O828K9060O7992j9547n0974J6331L5509M2447j854l6073
16816D1092l9945l3876J3951O0276O0282k0460n8654M424j9055k5601K768j9810
16804c4608j508l6105P031M9692L2195l6467M01J1453r310k558k5951j198l8756
$$ plain form
16791 -85689 -73907 -72991 -31196 -54697 -63328 -77907 -81681 -54109 -61193 -53799 -29863 -9794 -16616
16778 -16616 -4281 12816 26797 19789 -3560 -46823 -60981 -81966 -54358 -83093 -76775 -94747
16766 -94747 -69811 -55314 -73462 -79368 -91365 -76180 -90695 -61208 -45553 -61949 -81146 -112470
16754 -112470 -52240 -36650 -87420 -83086 -69310 -78706 -37539 -14757 16588 28316 80715 107750
16742 107750 48452 2062 -11433 -5357 -2396 33934 44181 46644 49047 11937 19213 50791
16730 50791 18153 3477 -5698 -28290 -42936 -63952 1722 -2748 -30961 -46072 -68039 -80384
16718 -80384 -51624 -52993 -3514 42705 62268 120955 99927 62154 29991 2611 1988 -35025
16706 -35025 -31527 -22185 -4611 -1333 54848 55350 32047 -33526 -10196 7677 -27120 -10664 -56089
$$ packed form
16791h5689J1782R16M1795k3501q631j4579l774K7572p084P394K3936K0069o822
16778a6616J2335J7097J3981p008k3349m3263j4158k0985K7608k8735O318j7972
16766i4747K4936J4497j8148n906j1997J5185j4515K9487J5655j6396j9197l1324
16754a12470O0230J5590n0770M334J3776r396M1167K2782L1345J1728N2399K7035
16742A07750n9298m6390j3495O076K961L6330J0247K463K403l7110P276L1578
16730E0791l2638j4676r175k2592j4646k1016O5674m470k8213j5111k1967j2345
16718h0384K8760j369M9479M6219J9563N8687k1028l7773l2163k7380o23l7013
16706c5025L498R342J7574L278N6181N02k3303o5573K3330J7873l4797J6456m5425
$$ plain form
16693 -56089 -118873 -111797 -91193 -81719 -25194 38393 32203 24910 23600 6425 26195 35377 27516
16680 27516 24160 31369 56431 27100 -20863 -19823 -3484 22219 50485 56367 27813 4465
16668 4465 18714 39304 41818 15722 26726 -1689 -28211 -48707 -83980 -115889 -111829 -77285
16656 -77285 4265 13906 -4899 3820 2073 -53162 -44357 -35410 5274 -12393 -55387 -69972 -73087
16643 -73087 -75494 -41536 -53009 -19220 12678 -36195 -61537 -76137 -84340 -23094 50118 64869
16631 64869 28910 -6412 22898 42951 23416 -7745 -56656 -76678 -49626 -66022 -82072 -53159
16619 -53159 -30615 -51416 -96601 -114196 -61131 -18195 -56709 -107498 -115401 -87908 -22820 7088
16607 7088 7109 32739 70400 37562 45308 1747 -35925 -7921 45147 82250 73449 20673 11567
$$ packed form
16693e6089o2784P076K0604R474N6525O3587o190p293j310j7175J9770R182p861
16680B7516l356P209K5062k9331m7963J040J6339K5703K8266N882k8554k3348
16668D465J4249K0590K514k6096J1004k8415k6522k0496l5273l1909M060L4544
16656g7285Q1550R641j8805Q719j747n5235Q805Q947M0684j7667m2994j4585l115
16643g3087k407L3958j1473L3789L1898m8873k5342j4600q203O1246P3212J4751
16631F4869l5959l5322K9310K0053j9535l1161m8911k0022K7052j6396j6050K8913
16619e3159K2544k0801m5185j7595N3065M2936l8514n0789p903K7493O5088K9908
16607G088K1K5630L7661l2838P746m3561l7672K8004N3068L7103q801n2776r106
$$ plain form
16594 11567 23312 76139 49431 30397 30171 52660 8972 -25035 -17245 -29472 -45889 -57197
16582 -57197 -53240 -52678 3226 64889 19792 -57499 -97387 -117338 -136939 -75647 -63226 -109269
16570 -109269 -100919 -41659 21970 22242 12534 -5750 -60027 -61469 -18157 -23015 -11030 -30325 -19530
16557 -19530 -14362 -43708 24576 8178 -27750 -36037 -34665 -52202 -50420 -37421 -5673 22844
16545 22844 24364 29599 -23662 -10562 32952 76850 81132 55182 51326 53184 53055 65014 29389
16532 29389 2452 -4759 -42797 -68225 -43314 16988 22422 -18431 -86727 -111758 -76745 -39583
16520 -39583 -38662 -37818 -55944 -96886 -62402 -11725 790 14163 266 -49581 -43653 -21978 51021
16507 51021 90206 58057 54703 13147 -20883 15887 21714 -48818 -46688 -42271 -19024 14916
$$ packed form
16594A1567J1745N2827k6708j9034k26K2489m3688l4007P790j2227j6417j1308
16582e7197L957N62N5904O1663m5097p7291l9888j9951j9601O1292J2421m6043
16570a09269Q350N9260O3629K72r708j8284n4277j442M3312m858J1985j9295J0795
16557a9530N168k9346O8284j6398l5928q287J372j7537J782J2999L1748K8517
16545B2844J520N235n3261J3100M3514M3898M282k5950l856J858j29J1959l5625
16532B9389k6937p211l8038k5428K4911O0302N434m0853o8296k5031L5013L7162
16520c9583R21Q44j8126m0942L4484N0677J2515J3373j3897m9847N928K1675P2999
16507E1021L9185l2149l354m1556l4030L6770N827p0532K130M417K3247L3940
$$ plain form
16495 14916 -25332 -30511 2125 -214 -14497 -17539 -69034 -92813 -67331 22203 58442 56256
16483 56256 11216 -41460 -38876 19321 62309 98923 100974 53253 8202 54563 92273 34690
16471 34690 -47433 -44419 -36696 2902 -74186 -82503 -11200 2496 218 -2545 -29256 -10540 37350
16458 37350 31665 -773 -77323 -103401 -66625 -27789 702 -46254 -69835 -58345 -48840 -22282
16446 -22282 7837 34857 42263 54466 79760 59629 -22860 -14837 39365 14854 18931 34503
16434 34503 -70 6749 34392 32385 11156 -36832 -29173 -18199 80873 80651 71856 74120 84992
16421 84992 38544 -5969 -13499 15776 18187 44163 -4619 -48775 -48962 -25208 -911 27612
16409 27612 13519 -11976 -11344 44959 42289 4471 -9636 -4681 -22045 -34311 17969 73955
$$ packed form
16495A4916m0248n179L2636k339j4283l042n1495k3779K5482Q9534L6239k186
16483E6256m5040n2676K584N8197M2988L6614K051m7721m5051M6361L7710n7583
16471C4690q2123L014P723L9598p7088q317P1303J3696k278k763k6711J8716M7890
16458C7350n685l2438p6550k6078L6776L8836K8491m6956k3581J1490R505K6558
16446b2282L0119K7020P406J2203K5294k0131q2489Q023N4202k4511M077J5572
16434C4503l4573O819K7643k007k1229m7988P659J0974R9072k22q795K264J0872
16421H4992m6448m4513p530K9275K411K5976m8782m4156j87K3754K4297K8523
16409B7612j4093k5495O32N6303k670l7818j4107M955j7364j2266N2280N5986
$$ plain form
16397 73955 81528 -1034 -58634 -17968 -15583 -40492 -41388 -16889 6962 7385 -25622 7975 17541
16384 17541 38553 44240 44420 76023 108426 82587 64458 44585 50509 3894 -43822 -62253
16372 -62253 -62610 8622 -16977 -74254 -106786 -47916 25183 56993 -2261 -73611 -83387 -80875
16360 -80875 -84453 -108896 -62965 -3027 -13539 -29723 -23711 280 19697 -17580 -12511 9271
16348 9271 -32086 -7867 -9016 -27115 -47835 -56259 -50116 -2220 -28241 -54583 -54843 10954 99300
16335 99300 66843 19725 -17229 -45320 -29685 -43457 -46420 -37279 -29264 9902 18715 -24331
16323 -24331 -35972 -14019 22383 48632 13675 -5495 -42300 -51660 -19143 14817 -6623 -26785
16311 -26785 -54840 -52584 -62162 -37718 -14909 -19200 -27410 -1425 7385 -6016 17364 37386 42770
$$ packed form
16397G3955P573q2562n7600M0666K385k4909q96K4499K3851M23l3007L3597R566
16384A7541K1012N687J80L1603L2403k5839j8129j9873N924m6615m7716j8431
16372f2253l57P1232k5599n7277l2532N8870P3099L1810n9254p1350r776K512
16360h0875l578k4443M5931N9938j0512j6184O012K3991J9417l7277N069K1782
16348I271m1357K4219j149j8099k0720q424O143M7896k6021k6342k60O5797Q8346
16335I9300l2457m7118l6954k8091J5635j3772k963R141Q015L9166Q813m3046
16323b4331j1641K1953L6402K6249l4957j9170l6805r360L2517L3960k1440k0162
16311b6785k8055K256r578K4444K2809m291q210K5985Q810j3401K3380K0022N384
$$ plain form
16298 42770 71942 119397 116688 63994 7628 -42438 -80485 -56367 -63275 -65285 -82520 -65080
16286 -65080 -52187 -1373 -2678 5404 -4 -16003 -49660 -51615 -34279 -1131 4880 52847 70360
16273 70360 42393 17172 629 45388 70413 85936 62605 12908 -43291 -82109 -87010 -63688
16261 -63688 -33983 10883 5566 -25717 16335 38587 -1489 -10391 -21663 -6213 -5547 22358
16249 22358 -974 49552 106726 60293 49046 62665 39289 22446 -7737 -17476 -6052 2935
16237 2935 18018 8 15131 46048 17904 21132 54773 72927 10351 -6976 -25653 -26923
16225 -26923 -13705 15201 11702 -27605 -15470 45417 41533 38423 37017 40457 64014 91512 102580
16212 102580 49856 -38867 -40547 -16778 -6933 -53916 -101227 -57630 -6096 -12052 -4572 -39980
$$ packed form
16298D2770K9172M7455k709n2694n6366n0066l8047K4118o908k010j7235J7440
16286f5080J2893N0814j305Q082n408j5999l3657j955J7336L3148O011M7967J7513
16273G0360k7967k5221j6543M4759K5025J5523k3331m9697n6199l8818m901K3322
16261f3688K9705M4866n317l1283M2052K2252m0076q902j1272J5450O66K7905
16249B2358k3332N0526N7174m6433j1247J3619k3376j6843l0183r739J1424Q987
16237B935J5083j8010J5123L0917k8144L228L3641J8154o2576j7327j8677j270
16225b6923J3218K8906l499l9307J2135O0887l884l110j406L440K3557K7498J1068
16212A02580n2724q8723j680K3769R845m6983m7311M3597N1534n956P480l5408
$$ plain form
16200 -39980 -85257 -74460 -65990 -8951 59203 89461 80971 16747 -48999 -73197 -61087 -58277
16188 -58277 -35626 -40346 -40595 -9889 -1206 -5337 20297 21235 -31653 2576 42283 12529 -994
16175 -994 18253 7795 17823 -12400 -46520 -34584 15602 32003 6902 9703 34943 -691
16163 -691 -47829 -60969 -119511 -106449 -69848 -81730 -27041 59089 87187 43621 -24161 -60954
16151 -60954 -91185 -33380 2497 -28106 -19080 -3117 -14237 -8420 -45941 -23746 16226 -21879
16139 -21879 -37351 -58112 -856 20020 38394 73823 76927 81927 14696 -43572 -39572 -16712
16127 -16712 -7833 42920 141240 177594 106172 53707 72514 64924 -13583 -24434 2642 18990
16115 18990 16455 -17815 37385 72846 92279 83153 36076 77634 85163 54857 20670 41053
$$ packed form
16200c9980m5277J0797Q470N7039O8154L0258q490o4224o5746k4198J2110K810
16188e8277K2651m720k49L0706Q683m131K5634R38n2888L4229L9707k9754j3523
16175i94J9247j0458J0028l0223l4120J1936N0186J6401k5101K801K5240l5634
16163f91m7138j3140n8542J3062L6601j1882N4689Q6130K8098m3566o7782l6793
16151f0954l0231N7805L5877l0603R026J5963j1120N817l7521K2195L9972l8105
16139b1879j5472k0761N7256K0876J8374L5429L104N000o7231n8268M000K2860
16127a6712Q879N0753R8320L6354p1422n2465J8807p590p8507j0851K7076J6348
16115A8990k535l4270N5200L5461J9433r126m7077M1558P529l0306l4187K0383
$$ plain form
16103 41053 83666 45318 9917 32567 52923 53856 58601 40028 44407 44369 29822 47892 58025
16090 58025 62227 48498 36912 17761 -15304 16787 41602 41870 48321 23076 6401 -684 5405
16077 5405 36149 3599 16412 65213 56827 15764 40860 19030 -5114 -17785 -47668 -31305
16065 -31305 10642 41124 34522 20453 1385 13492 -1172 27961 60760 39665 35041 32411
16053 32411 33390 69282 76549 31598 -26715 -22296 -45967 -66070 1188 30570 52123 58740 5092
16040 5092 -21633 -11131 10919 36329 15542 -11847 -1720 5093 -40020 -101330 -119247 -115046
16028 -115046 -93935 -50575 10051 44021 60879 34929 21990 20015 19710 48777 71896 71870 63909
16015 63909 4165 -1337 17388 -6641 9545 31362 69987 81376 71099 77874 43435 -655
$$ packed form
16103D1053M2613l8348l5401K2650K0356R33M745j8573M379l8j4547J8070J0133
16090E8025M202j3729j1586j9151l3065L2091K4815K68O451k5245j6675p085O089
16077E405L0744l2550J2813M8801q386m1063K5096k1830k4144j2671k9883J6363
16065c1305M1947L0482o602j4069j9068J2107j4664K9133L2799k1095m624k630
16053C2411R79L5892P267m4951n8313M419k3671k0103O7258K9382K1553O617n3648
16040E092k6725J0502K2050K5410k0787k7389J0127O813m5113o1310j7917M201
16028a15046K1111M3360O0626L3970J6858k5950j2939j975l05K9067K3119k6p961
16015F3909n9744n502J8725k4029J6186K1817L8625J1389j0277O775l4439m4090
$$ plain form
16003 -655 -44253 -37788 -34462 -57452 -29272 -14402 1411 13776 -17366 -40386 -16375 -19139 30109
15990 30109 9392 27379 67656 40808 51190 21913 -27449 -12416 40359 36269 62155 77369
15978 77369 71445 43251 75715 104680 24439 -45075 -35077 13489 60910 57975 417 -51428
15966 -51428 -8993 -37295 -36946 -11288 -8969 34667 54344 44154 108034 149108 133802 96082
15954 96082 62796 47911 11630 27758 40961 20876 25239 73479 82590 25602 15587 23178
15942 23178 -5705 28403 46009 38658 -7370 16458 76193 13179 -32716 -36247 -4529 33955
15930 33955 39796 30470 9667 67072 80508 75815 -16775 -40784 6233 -2067 -9632 26822 53231
15917 53231 42454 53447 106716 89700 49208 40188 123551 147013 91977 8296 -21036 21129
$$ packed form
16003f55m3598O465L326k2990K8180J4870J5813J2365l1142k3020K4011k764M9248
15990C0109k0717J7987M0277k6848J0382k9277m9362J5033N2775m090K5886J5214
15978G7369n924k8194L2464K8965q0241o9514R998M8566M7421k935n7558n1845
15966e1428M2435k8302L49K5658K319M3636J9677j0190O3880M1074j5306l7720
15954I6082l3286j4885l6281J6128J3203k0085M363M8240R111n6988j0015P591
15942B3178k8883L4108J7606p351m6028K3828N9735o3014m5895l531L1718L8484
15930C3955N841r326k0803N7405J3436m693r2590k4009M7017q300p565L6454K6409
15917E3231j0777J0993N3269j7016m0492r020Q3363K3462n5036q3681k9332M2165
$$ plain form
15905 21129 13177 -74288 -77902 -21278 36958 21135 17277 71321 73576 2828 -25137 10099
15893 10099 20263 55303 108134 71502 31699 24047 5413 -68689 -103866 -89882 -59953 -27452
15881 -27452 -21385 18647 41150 10257 47578 40193 47070 35232 58242 69206 65658 113425
15869 113425 150088 144093 91401 43446 28024 7177 -13709 -36538 -65903 -108749 -127641 -129075
15857 -129075 -115702 -75757 -15971 -24725 9346 26291 66709 72721 48180 17176 17789 57512
15845 57512 84431 68148 35842 28023 75954 101543 75537 28382 -6629 31476 60668 28928
15833 28928 26589 -19752 -2434 52718 50768 8563 -18413 73368 81339 59477 61719 65529 47706
15820 47706 8699 3718 19354 52928 35061 45211 75197 77350 44555 42513 61360 55115
$$ packed form
15905B1129p952q7465l614N6624N8236j5823l858N4044K255p0748k7965L5236
15893A0099J0164L5040N2831l6632l9803p652j8634p4102l5177J3984K9929L2501
15881b7452O067M0032K2503l0893L7321p385O877j1838K3010J0964l548M7767
15869A13425L6663n995n2692m7955j5422k0847k0886k2829k9365m2846j8892j434
15857a29075J3373L9945N9786q754L4071J6945M0418O012k4541l1004O13L9723
15845E7512K6919j6283l2306p819M7931K5589k6006m7155l5011L8105K9192l1740
15833B8928k339m6341J7318N5152j950m2205k6976R1781P971k1862K242L810j7823
15820D7706l9007m981J5636L3574j7867J0150K9986K153l2795k042J8847o245
$$ plain form
15808 55115 48636 109350 153472 143752 97905 80539 95994 83699 21814 127 28937 49906
15796 49906 33706 92470 150197 134403 102678 76655 55054 16317 57399 54941 26399 42547
15784 42547 40920 7020 -7059 24861 54767 97317 68043 39497 42131 90001 95017 18950
15772 18950 9048 32723 44319 77994 80824 51909 51111 51813 68797 81917 99695 90220 75157
15759 75157 5770 14883 46092 76218 66196 36215 27393 8541 -6459 -33774 -39425 -72200
15747 -72200 -46213 -4038 -13677 35410 102876 86851 63752 796 -17557 5537 44349 73336
15735 73336 84586 19961 -1277 57460 43642 58686 131432 167313 145314 65212 17226 28406
15723 28406 70915 109793 70796 41317 56472 22088 -341 34816 63716 88125 116207 74168
$$ packed form
15808E5115o479O0714M4122r720m5847j7366J5455j2295o1885k1687K8810K0969
15796D9906j6200N8764N7727j5794l1725k6023k1601l8737M1082k458k8542J6148
15784D2547j627l3900j4079L1920K9906M2550k9274k8546K634M7870N016p6067
15772A8950r902K3675J1596L3675K830k8915p98P02J6984J3120J7778r475j5063
15759G5157o9387R113L1209L0126j0022k9981q822j8852j5000k7315n651l2775
15747g2200K5987M2175r639M9087O7466j6025k3099o2956j8353K3094L8812K8987
15735G3336J1250o4625k1238N8737j3818J5044P2746L5881k1999q0102m7986J1180
15723B8406M2509L8878l8997k9479J5155l4384k2429L5157K8900K4409K8082m2039
$$ plain form
15711 74168 87548 46630 49822 -9788 21749 60656 50188 37558 67393 10889 -53798 -3852
15699 -3852 -593 28922 64896 115577 134837 99839 112269 126392 64525 22413 10508 -19728
15687 -19728 13895 33851 43886 13855 -783 40152 62704 32551 215 63679 83608 71810
15675 71810 19027 -10926 -25312 3743 -1584 -5581 -9469 -18424 22619 -5301 -83581 -66729
15663 -66729 263 8976 39156 61286 76214 43994 70758 101436 115048 96420 47985 31810
15651 31810 50100 112819 110743 81500 88000 71841 51540 85128 61735 11068 40 10044
15639 10044 7012 43680 52299 45903 66068 49454 55902 25003 45007 58041 58140 1697 16871
15626 16871 54644 90125 87846 115298 96401 71646 62613 93929 46736 7203 -14320 9455
$$ packed form
15711G4168J3380m0918L192n9610L1537L8907j0468j2630K9835n6504o4687M9946
15699c852L259K9515L5974N0681J9260l4998J2430J4123o1867m2112j1905l0236
15687a9728L3623J9956J0035l0031j4638M0935K2552l0153l2336O3464J9929j1798
15675G1810n2783k9953j4386K9055n327l997l888q955M1043k7920p8280J6852
15663f6729O6992Q713L0180K2130J4928l2220K6764L0678J3612j8628m8435j6175
15651C1810J8290O2719k076k9243O500j6159k0301L3588k3393n0667j1028J0004
15639A0044l032L6668Q619o396K0165j6614O448l0899K0004J3034R9n6443J5174
15626A6871L7773L5481k279K7452j8897k4755r033L1316m7193l9533k1523K3775
$$ plain form
15614 9455 64671 57174 84894 90766 155569 174521 105997 108086 143336 122852 57157 68564
15602 68564 97790 88054 20166 -44250 -61556 54211 105501 109602 118843 109358 130114 135819
15590 135819 152945 91918 61977 71287 22625 -12742 -7009 48422 54647 47512 49263 91259
15578 91259 60854 30190 45975 70515 64335 52527 43347 19987 64074 116114 117270 110311
15566 110311 59735 26074 8917 -5119 10534 -7431 48544 63979 67227 73354 58829 51724
15554 51724 73292 51227 27588 81068 105726 80564 66269 55041 154 -32826 -29152 -29799
15542 -29799 -80729 -46461 -18896 26470 88909 107238 107674 68058 81173 24733 47031 66895
15530 66895 19294 -15277 -37044 -40643 -64126 -42773 -16057 -626 32546 48117 41311 69067
$$ packed form
15614I455N5216p497K7720N872O4803J8952o8524K089L5250k0484o5695J1407
15602F8564K9226r736o7888o4416j7306J15767N1290M101R241r485K0756N705
15590A35819J7126o1027k9941R310m8662l5367N733N5431O225p135J751M1996
15578I1259l0405l0664J5785K4540o180j1808r180k3360M4087N2040J156o959
15566A10311n0576l3661j7157j4036J5653j7965N5975J5435L248O127j4525p105
15554E1724K1568k2065k3639N3480K4658k5162j4295j1228n4887l2980L674o47
15542b9799n0930L4268K7565M5366O2439J8329M36l9616J3115n6440K2298J9864
15530F6895m7601l4571k1767l599k3483K1353K6716J5431L3172J5571o806K7756
$$ plain form
15518 69067 79024 9087 -8230 21052 90442 98875 55711 50350 31854 -16554 -548 64697
15506 64697 70031 51055 30944 56568 74978 77223 61809 72264 98320 82556 118785 156273
15494 156273 201036 188017 172923 139868 90258 62035 78192 60818 32045 89668 168086
15483 168086 192292 117662 92058 78171 74754 116628 119483 116291 117197 122703 77580 56549 66926
15470 66926 78108 75032 86402 100644 137074 96294 50730 33147 46310 42540 73696 99338
15458 99338 64987 46390 68707 86474 113182 99539 95676 82123 82128 96442 110311 87995 1908
15445 1908 -21641 -2882 -12126 -28749 -30784 -50258 -27552 -37080 -55684 1617 23144 19187 -22505
15432 -22505 -73464 -52155 2307 37689 6192 -35473 -45940 10539 40833 76346 57953 35052
$$ packed form
15518F9067R957o9937j7317K9282O9390Q433m3164n361j8496m8408J6006O5245
15506F4697N334j8976k0111K5624J8410K245j5414J0455K6056j5764L6229L7488
15494A56273M4763j3019j5094l3055m9610k8223J6157j7374k8773N7623P8418
15483A68086K4206p4630k5604j3887l417M1874K855l192R06N506m5123k1031J0377
15470F6926J1182l076J1370J4242L6430m0780m5564j7583J3163l770L1156K5642
15458I9338l4351j8597K2317J7767K6708j3643l863j3553NJ4314J3869k2316q6087
15445A908k3549J8759r244j6623k035j9474K2706r528j8604N7301K1527l957m1692
15432b2505n0959K1309N4462L5382l1497m1665j0467N6479L0294L5513j8393k2901
$$ plain form
15420 35052 36058 18555 12192 42193 92259 52561 14628 24329 2200 1559 63928 116173 115349
15407 115349 90518 148083 143763 72478 77025 69748 50082 11009 4699 -47807 -44256 -54461
15395 -54461 -32774 -18155 3425 47256 59736 96690 114132 100754 104012 118307 50810 66515
15383 66515 93778 94907 63523 99755 75775 41268 48367 24620 27426 103528 143921 127275
15371 127275 127929 55070 -14237 -31572 -57754 -47358 4974 44686 60691 81037 120315 174599
15359 174599 141126 92754 98547 103105 101683 112651 125294 172832 159796 126312 112318 132698
15347 132698 91114 24320 49177 59324 -4307 -18383 8659 45646 34275 -24447 3628
15336 3628 32673 134688 146035 83441 81400 75279 49143 12298 -6324 -41612 3668 25838
$$ packed form
15420C5052J006j7503o363L0001N0066l9698l7933R701k2129o41O2369N2245q24
15407A15349k4831N7565m320p1285M547p277j9666l9073o310n2506L551j0205
15395e4461K1687J4619K1580M3831J2480L6954J7442j3378L258J4295o7497J5705
15383F6515K7263J129l1384L6232k3980l4507P099k3747K806P6102M0393j6646
15371A27275O54p2859o9307j7335k6182J0396N2332L9712J6005K0346L9278N4284
15359A74599l3473m8372N793M558j422J0968J2643M7538j3036l3484j3994K0380
15347A32698m1584o6794K4857J0147o3631j4076K7042L6987j1371n8722K8075
15336C628K9045J02015J1347o2594k041o121k6136l6845j8622l5288M5280K2170
$$ plain form
15324 25838 59198 63270 82443 49142 22542 35943 29127 50138 114051 141478 112305 81038
15312 81038 34193 17825 863 -2180 -350 35662 62842 31417 24226 36200 17621 25340
15300 25340 21930 44109 116335 106376 65907 1785 -32216 -534 32549 19504 4344 7523
15288 7523 -4949 32931 72236 93672 60178 -7329 -37863 -19321 32616 45498 50418 64770
15276 64770 39907 -35891 -10964 82100 132968 105878 68107 18659 35589 108996 134968 145885
15264 145885 158169 138043 95681 90936 153517 136444 43414 23539 69853 109526 81509 -4708
15252 -4708 18916 76534 78842 45417 60205 87463 134407 177273 156416 122665 119940 141641
15240 141641 132606 95021 102812 138432 104526 89426 51747 106039 92601 45968 47213 121516
$$ packed form
15324B5838L3360M072J9173l3301k6600J3401o816K1011O3913K7427k9173l1267
15312H1038m6845j6368j6962l043J830L6012K7180l1425p191J1974j8579P719
15300B5340l410K2179P2226r959m0469o4122l4001L1682L3083j3045j5160L179
15288G523j2472L7880L9305K1436l3494o7507l0534J8542N1937J2882M920J4352
15276F4770k4863p5798K4927R3064N0868k7090l7771m9448J6930P3407K5972J0917
15264A45885J2284k0126m2362m745O2581j7073r3030j9875M6314L9673k8017q6217
15252d708K3624N7618K308l3425J4788K7258M6944M2866k0857l3751k725K1701
15240A41641r035l7585P791L5620l3906j5100l7679N4292j3438m6633J245P4303
$$ plain form
15228 121516 174952 172217 161298 167478 178639 177777 154073 130016 124781 145723 152827 123623 103754
15215 103754 140208 164211 168011 196143 228346 153354 98485 82155 105019 102145 54749 23563
15203 23563 48289 97123 100001 94482 106271 126891 108357 108403 112535 59923 38437 90773 98001
15190 98001 88305 33843 46988 56926 35583 30468 38243 4965 -1287 8567 -3991 42917 67409
15177 67409 29294 50045 62059 81910 120529 63817 59480 113330 167693 232092 259472 202249
15165 202249 102460 65657 109652 100790 93135 90538 60844 47053 29834 13678 -3649 24074
15153 24074 18019 65370 94226 76990 81356 51323 61442 91115 -7404 -83648 -105459 -64279
15141 -64279 45227 107127 76332 33175 46137 87440 48888 43404 40296 22281 4046 7793
$$ packed form
15228A21516N3436k735j0919O180J1161q62k3704k4057n235K0942P104k9204j9869
15215A03754L6454K4003L800K8132L2203p4992n4869j6330K2864k874m7396l1186
15203B3563K4726M8834K878n519J1789K0620j8534M6M132n2612k1486N2336P228
15190I8001r696n4462J3145R938k1343n115P775l3278o252R854j2558M6908K4492
15177F7409l8115K0751J2014J9851L8619n6712m337N3850N4363O4399K7380n7223
15165B02249r9789l6803M3995q862p655k597k9694j3791j7219j6156j7327K7723
15153B4074o055M7351K8856j7236M366l0033J0119K9673r8519p6244k1811M1180
15141f4279J09506O1900l0795m3157J2962M1303l8552n484l108j8015j8235L747
$$ plain form
15129 7793 20329 77113 89016 75917 52425 -18956 -11424 88445 117855 129294 151909 118723
15117 118723 109302 116163 101224 104789 117768 70842 110033 114637 86414 85375 124002 88118
15105 88118 15013 -26818 31057 131254 173057 191935 123412 101626 131614 117761 146736
15094 146736 163076 193196 191609 174467 155246 139052 126541 135794 134949 97878 33443 31700
15082 31700 82296 94743 103386 83238 68982 73026 91130 84785 88584 64472 60730 109407 125457
15069 125457 116191 99031 70085 80096 90142 86993 71198 71434 77258 79336 99301 81482 133546
15056 133546 125793 121869 147144 142465 120589 84837 83517 98174 137949 119406 154397 157153
15044 157153 112758 139725 196814 229417 177856 161124 113760 54826 46699 80269 88198 72925
$$ packed form
15129G793J2536N6784J1903j3099k3492p1381P532R9869K9410J1439K2615l3186
15117A18723r421O861j4939L565J2979m6926L9191M604k8223j039L8627l5884
15105H8118p3105m1831N7875J00197M1803J8878o8523k1786K9988j3853K8975
15094A46736J6340L0120j587j7142j9221j6194j2511R253q45l7071o4435j743
15082C1700N0596J2447Q643k0148j4256M044J8104o345L799k4112l742M8677J6050
15069A25457r266j7160k8946J0011J0046l149j5795K36N824K078J9965j7819N2064
15056A33546p753l924K5275m679k1876l5752j320J4657L9775j8543L4991K756
15044A57153m4395K6967N7089L2603n1561j6732m7364n8934q127L3570P929j5273
$$ plain form
15032 72925 68744 83502 76082 79631 77214 69062 84101 138046 182870 249618 186318 146270 142443
15019 142443 139525 144407 146878 134724 105556 60349 73281 88534 98985 71865 60971 58095
15007 58095 94185 97424 76941 106550 139297 121040 124475 121541 115012 106948 90280 72165 78237
14994 78237 150020 146281 159078 157403 118288 99067 122408 144216 149150 124991 82285 141229
14982 141229 150399 114720 84603 96493 127837 137018 99424 129347 146496 115693 123093 131154
14970 131154 102721 86619 30085 16148 63434 93427 59712 61977 103258 92225 27835 -32614
14958 -32614 7802 20491 43657 63879 66084 70471 110232 124143 122823 125790 125595 119056 99909
14945 99909 25541 10729 14316 74913 119813 141958 140411 141549 92123 95134 69491 49105
$$ packed form
15032G2925m181J4758p420L549k417q152J5039N3945M4824O6748o3300m0048l827
15019A42443k918M882K471j2154k9168m5207J2932J5253J0451k7120j0894k876
15007E8095L6090L239k0483K9609L2747j8257L435k934o529q064j6668j8115O072
14994G8237P1783l739J2797j675l9115j9221K3341K1808M934k4159m2706N8944
14982A41229R170l5679l0117J1890L1344R181l7594K9923J7149l0803P400Q061
14970A31154k8433j6102n6534j3937M7286K9993l3715K265M1281j1033o4390o0449
14958c2614M0416J2689K3166K0222K205M387L9761J3911j320K967j95o539j9147
14945I9909p4368j4812L587O0597M4900K2145j547J138m9426L011k5643k0386
$$ plain form
14933 49105 78270 81110 76919 118430 112928 71458 76759 97769 102976 124796 117622 103938 108036
14920 108036 160418 210072 196636 105371 13843 22614 41174 51717 96141 102482 104282 109848
14908 109848 105965 80685 36368 28392 14213 11108 58545 53363 63788 78303 50605 27093
14896 27093 33201 35382 47255 105577 134047 114134 52947 2873 64039 199795 143623 17738
14884 17738 2139 7023 74061 153983 106956 43836 23183 -15367 -49262 15743 65793 83384
14872 83384 64453 94498 140327 172858 130869 82350 88817 109962 125606 192733 157748 140632
14860 140632 110840 79326 104976 143049 80971 45740 79489 124396 103365 88941 113930
14849 113930 115167 136682 66148 -6066 25358 59276 47629 25012 46327 110665 151375 160921
$$ packed form
14933D9105K9165K840m191M1511n502m1470N301K1010N207K1820p174j3684M098
14920A08036N2382M9654j3436r1265r1528Q771J8560J0543M4424O341J800N566
14908A09848l883k5280m4317p976j4179l105M7437n182J0425J4515k7698k3512
14896B7093O108K181J1873N8322K8470j9913o1187n0074O1166J35756n6172j25885
14884A7738j5599M884O7038P9922m7027o3120k0653l8550l3895O5005N0050J7591
14872H3384j8931L0045M5829L2531m1989m8519O467K1145J5644O7127l4985j7116
14860A40632k9792l1514K5650L8073o2078l5231L3749M4907k1031j4424K4989
14849A13930J237K1515p0534p2214L1424L3918j1647k2617K1315O4338M0710R546
$$ plain form
14837 160921 162816 149453 80606 46838 88978 81830 73373 87122 91060 102995 157451 144196
14825 144196 126681 76503 54687 51051 78376 70326 94100 96941 56572 37019 107872 144363
14813 144363 115737 154789 121525 99581 67990 59818 101835 112755 83693 32741 -39894 14572
14801 14572 69096 66726 92405 144605 47173 -74755 -55082 56694 101896 108698 122804 113565
14789 113565 117787 108345 132322 187694 236130 214198 199958 199798 201026 152711 173786 156906
14777 156906 143817 128115 109156 132442 102413 110220 159524 199541 187740 186034 152761 170533
14765 170533 121420 82531 60626 116237 150446 171532 161865 125356 123030 146271 152517 102115
14753 102115 90357 124045 160814 180651 187348 225171 228445 141891 116821 149078 158523 116913
$$ packed form
14837A60921J895j3363o8847l3768M2140p148q457J3749L938J1935N4456j3255
14825A44196j7515n0178k1816l636K7325q050K3774K841m0369j9553P0853L6491
14813A44363k8626L9052l3264k1944l1591q172M2017J0920k9062n0952p2635N4466
14801A4572N4524k370K5679N2200r7432j21928J9673J11776M5202O802J4106r239
14789A13565M222r442K3977N5372M8436k1932j4240j60J228m8315K1075j6880
14777A56906j3089j5702j8959K3286l0029P807M9304M0017j1801j706l3273J7772
14765A70533m9113l8889k1905N5611L4209K1086r667l6509k326K3241O246n0402
14753A02115j1758L3688L6769J9837O697L7823L274q6554k5070L2257R445m1610
$$ plain form
14741 116913 68927 68897 139257 186825 124132 148519 164046 106257 64508 91271 104897 69519
14729 69519 15677 -691 54082 88944 108698 97906 90207 97163 91626 142591 161861 162370 120153
14716 120153 125930 102724 51481 63406 77544 66360 63400 66870 127839 183022 170907 135883
14704 135883 64854 10422 -49 30158 80188 98701 124692 155858 212322 170436 109238
14693 109238 88837 74522 88049 117421 93991 99548 91272 76331 116376 93218 71917 108258
14681 108258 149583 164967 157693 141268 130596 144064 177663 169118 139440 125987 143035 169591
14669 169591 143459 141457 100813 89040 69633 90004 120860 137004 186046 164611 163447 235982
14657 235982 225621 135503 75292 103661 81165 43433 92174 77148 134726 145491 188035
$$ packed form
14741A16913m7986l0P0360M7568o2693K4387J5527n7789m1749K6763J3626l5378
14729F9519n3842j6368N4773L4862J9754j0792p699O956n537N0965J9270N09m2217
14716A20153N777k3206n1243J1925J4138j1184k960L470O0969N5183j2115l5024
14704A35883p1029n4432j0471L0207N0030J8513K5991L1166N6464m1886o1198
14693A09238k0401j4315J3527K9372k3430N557q276j4941M0045k3158k1301L6341
14681A08258M1325J5384p274j6425j0672J3468L3599q545k9678j3453J7048K6556
14669A69591k6132k002m0644j1773j9407K0371L0856J6144M9042k1435j164P2535
14657B35982j0361r0118o0211K8369k2496l7732M8741j5026N7578J0765M2544
$$ plain form
14646 188035 220045 190204 167114 153775 148489 145891 139885 129175 124703 133210 110236 109457 137448
14633 137448 124184 101319 131770 209404 220219 143005 107771 148165 193612 179057 155716
14622 155716 191856 184405 181555 162980 138192 139151 133769 162153 134461 128144 149960 140649 143807
14609 143807 196347 231687 311019 276911 156221 120225 145603 185090 164235 142101 127772
14598 127772 130660 138550 124198 115099 131434 121874 123586 128392 115402 129751 193605 292861 319631
14585 319631 263860 184566 172174 201908 225935 176338 136817 138404 127178 138664 156473 149639
14573 149639 109115 119378 83531 133271 147860 96801 45282 93658 106210 89910 109062
14562 109062 107087 139353 207910 205496 168561 141526 127967 127915 189124 200769 177562 192936
$$ packed form
14646A88035L2010k9841k3090j3339n286k598o006j0710m472Q507k2974p79K7991
14633A37448j3264k2865L0451P7634J0815p7214l5234M0394M5447j4555k3341
14622A55716L6140p451k850j8575k4788R59n382K8384k7692o317K1816r311L158
14609A43807N2540L5340P9332l4108j20690l5996K5378L9487k0855k2134j4329
14598A27772K888P890j4352r099J6335r560J712M806j2990J4349O3854R9256K6770
14585C19631n5771p9294j2392K9734K4027m9597l9521J587j1226J1486J7809o834
14573A49639m0524J0263l5847M9740J4589n1059n1519M8376J2552j6300J9152
14562A09062j975L2266O8557k414l6935k7035j3559n2O1209J1645k3207J5374
$$ plain form
14550 192936 184135 135957 85607 100149 131647 160711 169729 159597 173415 162131 129508 106287
14538 106287 123582 129352 171527 199055 184530 113352 104277 118300 132727 132095 106597 95037
14526 95037 119731 121372 117762 80323 123677 156429 148330 168796 223950 237133 185286 152641
14514 152641 160646 184173 174275 192883 198188 204884 166258 131218 74568 162813 187100 138461
14502 138461 94957 91192 110425 132944 154871 106188 99276 126377 139613 148646 179551 183108
14490 183108 178356 182919 114491 129848 179974 98593 17829 60236 155588 189071 212944 230349
14478 230349 137219 60075 25697 25223 6086 86549 146371 146017 153757 124540 75436 119073
14466 119073 107032 93293 19406 85789 151220 163063 158901 134861 123007 144429 168916 129684
$$ packed form
14550A92936q801m8178n0350J4542L1498K9064R018j0132J3818j1284l2623k3221
14538A06287J7295N770M2175K7528j4525p1178r075J4023J4427o32k5498j1560
14526I5037K4694J641l610l7439M3354L2752q099K0466N5154J3183n1847l2645
14514A52641Q005K3527r898J8608N305O696l8626l5040n6650Q8245K4287m8639
14502A38461m3504l765J9233K2519K1927m8683o912K7101J3236R033L0905L557
14490A83108m752M563o8428J5357N0126q1381q0764M2407R5352L3483K3873J7405
14478B30349r3130p7144l4378m74j9137Q0463N9822l54P740k9217m9104M3637
14466A19073j2041j3739p3887O6383O5431J1843m162k4040j1854K1422K4487l9232
$$ plain form
14454 129684 140052 168126 183199 190601 185215 143183 157270 118007 86337 167581 201229 114503
14442 114503 117705 121008 90707 105205 147097 135791 105014 52443 71156 90427 92500 131897
14430 131897 163396 163410 165792 187925 179899 154146 115180 110858 121285 136291 196931 184929 73453
14417 73453 32356 84747 96035 90239 78749 153714 220061 192959 164487 154871 151383 142842
14405 142842 169152 162945 165737 152094 144021 115834 99784 93075 84081 101051 104931 69691 110880
14392 110880 177479 162853 157832 123311 192410 223742 171109 111110 120731 135207 145377 196390
14380 196390 198709 140638 132433 223453 246230 267912 243627 230635 247461 175926 137610 130079
14368 130079 73658 65240 117242 155650 153145 141960 202901 218665 145969 102292 91135 110886
$$ packed form
14454A29684J0368K8074J5073P402n386m2032J4087l9263l1670Q1244L3648q6726
14442A14503L202L303l0301J4498M1892j1306l0777n2571J8713J9271K073L9397
14430A31897L1499J4K382K2133q026k5753l8966m322J0427J5006O0640j2002j11476
14417G3453m1097N2391J1288n796j1490P4965O6347k7102k8472r616l488q541
14405A42842K6310o207K792j3643q073k8187j6050o709q994J6970L880l5240M1189
14392A10880O6599j4626n021l4521O9099L1332n2633n9999R621J4476J0170N1013
14380A96390K319n8071q205R1020K2777K1682k4285j2992J6826p1535l8316p531
14368A30079n6421q418N2002L8408k505j1185O0941J5764p2696m3677j1157J9751
$$ plain form
14356 110886 92303 61538 104969 164805 143316 119361 99704 176905 185330 183147 151494 81594
14344 81594 62661 71417 124812 146021 149692 153654 140450 126126 141023 180208 290068 232230
14332 232230 180504 164495 111268 172052 223976 179879 124119 153397 187753 192143 191752 238998
14320 238998 225444 179622 166062 177322 183580 179040 177035 167651 164536 139102 162938 191174
14308 191174 166391 184836 168879 104740 129644 93312 92701 104187 155662 173585 192034 241903
14296 241903 199974 170337 206150 225224 189429 150129 152544 156125 241194 288177 283088 218050
14284 218050 160580 147135 159630 143998 126558 154321 163720 203201 180000 173590 182111 143107
14272 143107 153172 172823 173357 180744 177828 153172 219470 210143 142329 155604 221993 245191
$$ packed form
14356A10886j8583l0765M3431N9836k1489k3955j9657P7201Q425k183l1653o9900
14344H1594j8933Q756N3395K1209L671L962j3204j4324J4897L9185J09860n7838
14332B32230n1726j6009n3227O0784N1924m4097n5760K9278L4356M390l91M7246
14320B38998j3554m5822j3560J1260O258m540k005r384l115k5434K3836K8236
14308A91174k4783J8445j5957o4139K4904l6332o11J1486N1475J7923J8449M9869
14296B41903m1929k9637L5813J9074l5795l9300K415L581Q5069M6983n089o5038
14284B18050n7470j3445J2495j5632j7440K7763R399L9481k3201o410Q521l9004
14272A43107J0065J9651N34P387k916k4656O6298r327o7814J3275O6389K3198
$$ plain form
14260 245191 212589 177368 183713 139537 199076 250578 248811 259618 209757 171871 160787 175465
14248 175465 218068 237636 217851 214698 195701 166697 140638 151800 153005 180938 216636 216692
14236 216692 201890 231207 243476 244351 239814 225298 180754 175440 166598 127404 121522 152982 208233
14223 208233 216343 219324 224147 172788 179709 154215 142683 149695 158547 125799 119042 157749 128829
14210 128829 92791 78843 46071 87303 146409 160313 180674 192679 162225 121314 103265
14199 103265 138010 146027 199337 182586 182830 181625 173480 176813 163930 201633 207694 227819 240968
14186 240968 204800 124491 131478 141889 120466 92541 117055 151523 180899 202548 202627 163909
14174 163909 154143 157775 156947 210624 262724 248195 216114 187745 157777 182448 190059 224877
$$ packed form
14260B45191l2602l5221O345m4176N9539N1502j767J0807m9861l7886j1084J4678
14248A75465M2603J9568j9785l153j8997k9004k6059J1162J205K7933L5698N6
14236B16692j4802K9317J2269Q75m537j4516m4544n314q842l9194n882L1460N5251
14223B08233Q110K981M823n1359O921k5494j1532P012Q852l2748o757L8707k8920
14210A28829l6038j3948l2772M1232N9106J3904K0361J2005l0454m0911j8049
14199A03265L4745Q017N3310j6751K44j205q145L333j2883L7703O061K0125J3149
14186B40968l6168q0309O987J0411k1423k7925K4514L4468K9376K1649P9l8718
14174A63909r766L632q28N3677N2100j4529l2081k8369k9968K4671P611L4818
$$ plain form
14162 224877 258162 206348 161241 176234 202269 257101 238507 187123 183563 212466 225148 155803
14150 155803 147775 182098 226546 239159 276890 256914 235281 234462 191266 203681 160690 143943
14138 143943 135372 108365 90958 68858 118551 126124 166155 230614 248489 180900 149496 182491
14126 182491 184361 205087 191820 209251 213141 225166 255162 223460 142892 84291 85926 151422
14114 151422 159658 81989 21800 59397 126707 156156 193454 188526 210779 186084 195961 151840
14102 151840 163747 176149 170605 172504 112882 121732 136719 160086 186785 222836 231435 284555
14090 284555 259062 248649 239865 241435 200559 127982 147740 216997 201768 219919 180422 163664
14078 163664 157794 187735 251273 283987 264876 221239 271138 319268 281196 244147 218747 239889
$$ packed form
14162B24877L3285n1814m5107J4993K6035N4832j8594n1384l560K8903J2682o9345
14150A55803q028L4323M4448J2613L7731j9976k1633q19m3196J2415m2991j6747
14138A43943q571k7007j7407k2100M9693P573M0031O4459J7875o7589l1404L2995
14126A82491J870K0726j3267J7431L890J2025K9996l1702q0568n8601J635O5496
14114A51422Q236p7669o0189L7597O7310K9449L7298m928K2253k4695R877m4121
14102A51840J1907J2402n544J899n9622Q850J4987K3367K6699L6051Q599N3120
14090B84555k5493j0413q784J570m0876p2577J9758O9257j5229J8151l9497j6758
14078A63664n870K9941O3538L2714j9111m3637M9899M8130l8072l7049k5400K1142
$$ plain form
14066 239889 229172 254401 255889 266022 272089 254814 254922 252845 243896 243010 222038 217698 188326
14053 188326 264640 349080 351004 335915 353107 380301 338782 306976 285959 311458 269457 224737
14041 224737 218609 260322 274133 231892 256000 286068 223047 200352 194905 143531 167537 168459
14029 168459 151596 149048 155387 188853 236347 251271 263250 259778 192984 172893 170814 205689
14017 205689 240508 219354 201601 165785 115744 119482 196796 232600 242117 254495 259064 284544
14005 284544 291411 307501 248476 241783 262275 236564 206131 244342 280426 256009 243051 235430
13993 235430 256200 246358 213084 229289 300489 315231 283137 292186 307858 294581 353564 331246
13981 331246 292668 328821 285081 249985 266941 264041 293311 260400 254424 216258 196165 228514
$$ packed form
14066B39889j0717K5229J488J0133O067j7275J08k077q949q86k0972m340k9372
14053A88326P6314Q4440J924j5089J7192K7194m1519l1806k1017K5499m2001m4720
14041B24737o128M1713J3811m2241K4108L0068o3021k2695n447n1374K4006R22
14029A68459j6863k548O339L3466M7494J4924J1979l472o6794k0091k079L4875
14017B05689L4819k1154j7753l5816n0041L738P7314L5804R517J2378M569K5480
14005B84544O867J6090n9025o693K0492k5711l0433L8211L6084k4417j2958p621
13993B35430K0770r842l3274J6205P1200J4742l2094R049J5672j3277N8983k2318
13981C31246l8578L6153m3740l5096J6956k900K9270l2911n976l8166k0093L2349
$$ plain form
13969 228514 250401 269957 278917 299040 306909 293423 265100 220327 174153 190537 163249 173223
13957 173223 216008 248331 284302 254080 246707 225484 204006 192450 197645 204443 231073 239157
13945 239157 230647 206170 208551 231376 287260 315939 295912 263922 281552 253519 205819 183178
13933 183178 165633 196529 224423 193043 193576 200155 213253 200978 194160 241712 252378 220392
13921 220392 218667 139010 127162 191380 209013 186326 218497 270436 300636 264728 180519 179387
13909 179387 189132 156757 186533 225491 215340 174601 196216 239312 268064 263907 265298 238539
13897 238539 201995 217882 173260 206464 215796 180841 198739 217391 175630 106821 102336 160605
13885 160605 250768 267447 285394 290916 260131 264579 272368 278165 287612 311610 329800 330043 316398
$$ packed form
13969B28514K1887J9556Q960K0123P869j3486k8323m4773m6174J6384k7288R974
13957A73223M2785L2323L5971l0222p373k1223k1478j1556N195O798K6630Q084
13945B39157q510k4477K381K2825N5884K8679k0027l1990J7630k8033m7700k2641
13933A83178j7545L0896K7894l1380N33O579J3098j2275o818M7552J0666l1986
13921B20392j725p9657j1848O4218J7633k2687L2171N1939L0200l5908q4209j132
13909A79387R745l2375K9776L8958j0151m0739K1615M3096K8752m157J391k6759
13897B38539l6544J5887m4622L3204R332l4955J7898J8652m1761o8809m485N8269
13885A60605R0163J6679J7947N522l0785M448P789N797R447K3998J8190K43j3645
$$ plain form
13872 316398 315054 277109 201889 198742 207298 256743 273193 257913 252256 229696 256241 253715
13860 253715 195369 209003 215451 195735 218207 205358 235228 231477 223769 210101 192188 210890
13848 210890 190532 179313 201761 243158 219637 235080 282647 238301 257849 275205 290527
13837 290527 290201 239992 226653 276679 286290 246004 262978 334471 310883 341804 319118 269523
13825 269523 268730 261663 259454 290521 312085 274403 260353 265195 207033 188482 210498 236399
13813 236399 318789 242764 200486 217863 286233 285545 281912 253018 298779 303243 255047 256703
13801 256703 342206 300246 241232 227445 197829 191626 196527 214212 158653 172694 209204 241809
13789 241809 215807 255942 279869 300202 276429 274961 253644 206350 183855 231129 300068 286230
$$ packed form
13872C16398j344l7945p5220l147Q556M9445J6450j5280n657k2560K6545k526
13860B53715n8346J3634O448j9716K2472j2849K9870l751p708j3668j7913J8702
13848B10890k0358j1219K2448M1397k3521J5443M7567m4346J9548J7356J5322
13837B90527l26n0209j3339N0026R611m0286J6974P1493k3588L0921k2686m9595
13825B69523p93p067k209L1067K1564l7682j4050M842n8162j8551K2016K5901
13813B36399Q2390p6025m2278J7377O8370o88l633k8894M5761M464m8196J656
13801B56703Q5503m1960n9014j3787k9616o203M901J7685n5559J4041L6510L2605
13789B41809k6002M0135K3927K0333k3773j468k1317m7294k2495M7274O8939j3838
$$ plain form
13777 286230 270013 258898 255398 281757 255692 225249 216314 245865 248808 292413 299304 368124
13765 368124 357347 385504 414803 417324 401365 315919 269851 296994 327448 287228 210551 254267
13753 254267 295306 258735 219034 240771 238826 240227 276123 290550 332890 343729 346896 338090
13741 338090 336274 325633 278798 250961 319399 313189 293747 352222 370974 264990 223098 278251
13729 278251 275026 244356 235943 210093 196288 204243 203410 219775 243350 242157 228897 205217 195597
13716 195597 249721 277434 219476 205112 256694 248486 273677 310740 326929 318355 336195 339860
13704 339860 300990 262978 255300 234666 205152 200147 255675 306872 340879 291127 291850 318189
13692 318189 301997 262927 182598 158989 189633 232166 240181 246341 290685 304902 303530 320614
$$ packed form
13777B86230j6217j1115l500K6359k6065l0443q935K9551K943M3605O891O8820
13765C68124j0777K8157K9299K521j5959q5446m6068K7143L0454m0220p6677M3716
13753B54267M1039l6571l9701K1737j945J401L5896J4427M2340J0839L167q806
13741C38090j816j0641m6835k7837O8438o210j9442N8475J8752j05984m1892N5153
13729B78251l225l0670q413k5850j3805P955q33J6365K3575j193j3260k3680r620
13716A95597N4124K7713n7958j4364N1582q208K5191L7063J6189q574J7840L665
13704C39860l8870l8012p678k0634k9514n005N5528N1197L4007m9752P23K6339
13692C18189j6192l9070q0329k3609L0644M2533Q015O160M4344J4217j372J7084
$$ plain form
13680 320614 271457 251419 223419 207757 272557 352087 355358 352114 271849 193112 169758 211868
13668 211868 245022 286356 299000 308557 330358 347645 313854 256861 278304 299707 372233 406136
13656 406136 343184 289011 300985 377700 328479 308873 290831 317926 296563 286481 259240
13645 259240 259123 296262 281667 286241 315913 338273 348055 317731 268078 244847 284661 308009
13633 308009 297668 343891 365152 355721 320150 263812 265816 278881 256650 223793 225792 234429
13621 234429 339357 412258 392930 327872 316340 375148 355456 303170 303556 301566 299693 295219
13609 295219 328125 278407 236805 282743 307372 272255 260380 293250 268459 263939 243732 266372
13597 266372 317746 347582 326536 319954 299414 279882 277341 325777 350874 355133 367494 348921
$$ packed form
13680C20614m9157k0038k8000j5662O4800P9530L271l244q0265p8737k3354M2110
13668B11868L3154M1334J2644R557K1801J7287l3791n6993K1443K1403P2526L3903
13656D06136o2952n4173J1974P6715m9221j9606j8042K7095k1363j0082k7241
13645B59240j17L7139j4595M574K9672K2360R782l0324m9653k3231L9814K3348
13633C08009j0341M6223K1261r431l5571n6338K004J3065k2231l2857J999Q637
13621B34429J04928P2901j9328o5058j1532N8808j9692n2286L86j990j873m474
13609B95219L2906m9718m1602M5938K4629l5117j1875L2870k4791m520k0207K2640
13597B66372N1374K9836k1046o582k0540j9532k541M8436K5097M259J2361j8573
$$ plain form
13585 348921 320357 367749 353068 310648 286867 236769 233697 305841 344356 332657 286880 281812
13573 281812 308049 268569 272170 312139 321174 229882 184432 261325 290082 309889 300476 282871
13561 282871 291205 312858 336248 302960 291953 328860 274149 230071 208003 164383 174012 252650
13549 252650 352619 416487 418113 410910 372464 341910 346360 352782 425325 461600 446095 407792
13537 407792 362180 356099 332471 272163 268633 313789 332477 323570 357114 390684 347353 342658
13525 342658 369432 373990 440182 442626 391824 345243 302693 306736 262231 292755 315343 342414
13513 342414 368810 404548 345371 288301 284696 262761 269920 355324 381461 353157 368097 383906
13501 383906 379885 388448 356642 329493 344155 367982 377474 343459 336525 364104 372759 322837
$$ packed form
13585C48921k8564M7392j4681m2420k3781n0098l072P2144L8515j1699m5777n068
13573B81812K6237l9480L601L9969R035r1292m5450P6893K8757J9807r413j7605
13561B82871Q334K1653K3390l3288j1007L6907n4711m4078k2068m3620R629P8638
13549B52650R9969O3868J626p203l8446l0554M450O422P2543L6275j5505l8303
13537D07792m5612o081k3628o0308l530M5156J8688q907L3544L3570m3331m695
13525C42658K6774M558O6192K444n0802m6581m2550M043m4505L0524K2588K7071
13513C42414K6396L5738n9177n7070l605k1935P159Q5404K6137k8304J4940J5809
13501C83906m021Q563l1806k7149J4662K3827R492l4015o934K7579Q655m9922
$$ plain form
13489 322837 287270 308426 282111 306568 317284 317115 284720 335207 367138 307172 291631 331010
13477 331010 328590 324218 329450 332334 338209 354282 369960 383709 379992 432489 458465 434064 413704
13464 413704 360863 376109 376235 366757 382169 369565 360097 336689 366614 390336 360591 364506
13452 364506 311522 338112 353136 335300 385461 394803 383504 353844 378038 359248 361716 361828
13440 361828 365898 338595 332306 374998 369462 318723 353924 383323 379553 399460 356871 318129
13428 318129 336065 377709 396553 367428 316936 277879 296836 378908 361316 347888 401422
13417 401422 451401 443103 451404 421056 406166 421851 387201 355993 392843 457823 501460 552133
13405 552133 549453 525512 468554 434201 447510 400708 404212 451766 447648 468884 447824 441334
$$ packed form
13489C22837l5567K1156k6315K4457J0716j69l2395N0487L1931n9966j5541L9379
13477C31010k420m372N232K884N875J6073J5678J3749l717N2497K5976k4401k0360
13464D13704n2841J5246J26r478J5412j2604r468k3408K9925K3722k9745L915
13452C64506n2984K6590J5024j7836N0161R342j1299k9660K4194j8790K468J12
13440C61828M070k7303o289M2692n536n0739L5201K9399l770J9907m2589l8742
13428C18129J7936M1644J8844k9125n0492l9057J8957Q2072j7592j3428N3534
13417D01422M9979q298Q301l0348j4890J5685l4650l1208L6850O4980M3637N0673
13405E52133k680k3941n6958l4353J3309m6802L504M7554m118K1236k1060o490
$$ plain form
13393 441334 437885 468254 464383 478045 496627 454476 419579 405713 399524 457479 497182 513428
13381 513428 471897 465917 436734 437223 486568 484043 494756 441838 404159 352041 346527 381374
13369 381374 393339 341057 319475 288030 334991 420424 439187 432290 438222 450694 466138 428949
13357 428949 434192 442845 459292 480697 457631 428315 497032 509672 504636 448531 464832 500027
13345 500027 488640 442262 397257 381245 367518 313625 411646 468175 407327 384129 334938
13334 334938 358351 371438 370679 381049 430798 431664 401413 412235 416854 444984 479546 456092
13322 456092 462196 459064 443688 478479 514145 518366 504227 536316 488719 415169 467225 474934
13310 474934 452537 458726 477531 509644 499443 395206 354603 399933 380822 407309 448750
$$ packed form
13393D41334l449L0369l871J3662J8582m2151l4897j3866o189N7955L9703J6246
13381E13428m1531n980k9183M89M9345k525J0713n2918l7679n2118n514L4847
13369C81374J1965n2282k1582l1445M6961Q5433J8763o897N932J2472J5444l7189
13357D28949N243Q653J6447K1405k3066k9316O8717J2640n036n6105J6301L5195
13345E00027j1387m6378m5005j6012j3727n3893R8021N6529o0848k3198m9191
13334C34938K3413J3087p59J0370M9749Q66l0251J0822M619K8130L4562k3454
13322D56092O104l132j5376L4791L5666M221j4139L2089m7597p3550N2056P709
13310D74934k2397O189J8805L2113j0201j04237m0603M5330j9111K6487M1441
$$ plain form
13299 448750 447760 423458 410690 407347 442163 486894 517775 526620 528902 546317 524517 534333 504157
13286 504157 460602 417926 419930 459075 452557 470807 465631 524213 547770 541758 494630 505554
13274 505554 536580 601301 592841 502635 460178 481554 466710 427521 430697 424871 459966 468014
13262 468014 473925 461238 500292 524270 501340 461234 417937 432674 488317 476573 495060 504873
13250 504873 542620 558070 555832 527105 510257 467317 474126 514224 560380 520322 480323 464732
13238 464732 412128 422659 444897 480647 459060 492794 558296 583118 569501 604911 622267
13227 622267 616650 583963 566275 532401 495810 446775 449085 462786 490913 534055 561076 601633
13215 601633 554608 438905 408512 456183 535429 532480 549250 571960 569659 497474 494012 539201
$$ packed form
13299D48750r90k4302j2768l343L4816M4731L0881Q845K282J7415k1800R816l0176
13286E04157m3555m2676K004L9145o518J8250n176N8582K3557o012m7128J0924
13274E05554L1026O4721q460r0206m2457K1376j4844l9189L176n826L5095Q048
13262D68014N911j2687L9054K3978k2930m0106m3297J4737N5643j1744J8487R813
13250E04873L7747J5450k238k8727j6848m2940O809M0098M6156m0058l9999j5591
13238D64732n2604J0531K2238L5750k1587L3734O5502K4822j3617L5410J7356
13227F22267n617l2687j7688l3874l6591m9035K310J3701K8127M3142K7021M0557
13215F01633m7025j15703l0393M7671P9246k949J6770K2710k301p2185l462M5189
$$ plain form
13203 539201 526545 552351 558584 552436 522882 516254 473425 460317 478493 522409 496671 530696
13191 530696 567775 545566 547632 548925 534737 564999 559929 560327 542613 522508 494684 509024
13179 509024 574491 544767 507487 574603 635751 642387 659838 668564 685217 671687 591847 618723
13167 618723 709684 819627 848190 797638 762478 740798 761272 771517 800668 861587 959147
13156 959147 1066062 1130811 1221096 1304822 1290228 1261355 1256919 1227529 1184269 1108613 1076150
13145 1076150 1049691 1066600 1133263 1133117 1131526 1153214 1222537 1258131 1292347 1334985 1408403 1453026
13133 1453026 1468786 1452936 1499471 1529692 1545855 1622404 1651681 1651891 1589253 1546903 1472792 1361578
13121 1361578 1310053 1264898 1250311 1224029 1181881 1166911 1151349 1166710 1233999 1232851 1228725 1276406
$$ packed form
13203E39201j2656K5806O233o148k9554o628m2829j3108J8176M3916k5738L4025
13191E30696L7079k2209K066J293j4188L0262n070L98j7714k0105k7824J4340
13179E09024O5467k9724l7280O7116O1148O636J7451Q726J6653j3530p9840K6876
13167F18723R0961J09943K8563n0552l5160k1680K0474J0245K9151O0919R7560
13156I59147J06915O4749R0285Q3726j4594k8873m436k9390m3260p5656l2463
13145A076150k6459J6909O6663j46j591K1688O9323L5594L4216M2638P3418M4623
13133A453026J5760j5850M6535L0221J6163P6549K9277K10o2638m2350p4111j11214
13121A361578n1525m5155j4587k6282m2148j4970j5562J5361O7289j148m126M7681
$$ plain form
13109 1276406 1339761 1350706 1339598 1329309 1297190 1287056 1256972 1241722 1188770 1122414 1036588
13098 1036588 990362 952812 906132 940343 930677 877873 841247 835811 887428 996614 1033938
13087 1033938 1013738 1009950 1114520 1299011 1376552 1373062 1392220 1475327 1473414 1469330 1445838 1385991
13075 1385991 1384289 1334964 1282648 1258377 1211181 1223340 1271468 1341927 1420908 1487647 1538338
13064 1538338 1581566 1579833 1599895 1709533 1744343 1777196 1799370 1794696 1752320 1779999 1800002
13053 1800002 1778920 1762569 1715267 1628781 1623694 1597648 1558105 1518115 1493713 1435545 1383125
13042 1383125 1322841 1341831 1370019 1393707 1443722 1463288 1499978 1502833 1514303 1494401 1452795
13031 1452795 1374488 1313007 1261489 1175256 1126408 1067278 1035282 966572 938979 897132 893354
$$ packed form
13109A276406O3355J0945j1108j0289l2119j0134l0084j5250n2952o6356q5826
13098A036588m6226l7550m6680L4211r666n2804l6626n436N1617J09186L7324
13087A033938k0200l788J04570J84491P7541l490J9158Q3107j913m084k3492n9847
13075A385991j702m9325n2316k4271m7196J2159M8128P0459P8981O6739N0691
13064A538338M3228j733K0062J09638L4810L2853K2174m674m2376K7679K0003
13053A800002k1082j6351m7302q6486n087k6046l9543l9990k4402n8168n2420
13042A383125o0284J8990K8188K3688N0015J9566L6690K855J1470j9902m1606
13031A452795p8307o1481n1518q6233m8848n9130l1996o8710k7593m1847l778
$$ plain form
13020 893354 865522 889124 930397 901737 867235 822411 780543 768876 814890 803151 814990
13009 814990 818446 828500 790969 797324 829730 813917 774414 785322 798391 838950 816139 790115
12997 790115 765199 719848 730852 760916 774123 791485 802035 755704 791570 852949 863487
12986 863487 830662 829438 847721 851505 898033 936735 857457 790327 820709 874245 927756 954649
12974 954649 957827 890228 872833 900791 875879 875686 927987 903186 875525 884433 852576 850895
12962 850895 890265 864059 858849 869750 882008 909727 968538 985009 955955 1027486 1097090 1089253
12950 1089253 1063589 997476 1018654 1060294 1047693 1030985 986952 963607 964611 999505 1040218
12939 1040218 1056718 1062749 1062399 1083452 1097055 1075115 1115383 1117935 1087619 1098924 1090451 1078418
$$ packed form
13020H93354k7832K3602M1273k8660l4502m4824m1868j1667M6014j1739J1839
13009H14990L456J0054l7531O355L2406j5813l9503J0908J3069M0559k2811k6024
12997G90115k4916m5351J1004L0064J3207J7362J0550m6331L5866O1379J0538
12986H63487l2825j224J8283L784M6528L8702p9278o7130L0382N3536N3511K6893
12974I54649L178o7599j7395K7958k4912j93N2301k4801k7661Q908l1857j681
12962H50895L9370k6206n210J0901J2258K7719N8811J6471k9054P1531O9604p837
12950A089253k5664o6113K1178M1640j2601j6708m4033k3345J004L4894M0713
12939A040218J6500O031l50K1053J3603k1940M0268K552l0316J1305q473j2033
$$ plain form
12927 1078418 1104426 1145317 1134575 1165043 1112593 1151236 1173990 1160688 1134046 1117060 1087483
12916 1087483 1064109 1096642 1136965 1122021 1118150 1144559 1146657 1134252 1193250 1232135 1230381 1269527
12904 1269527 1347573 1353293 1320519 1346161 1347773 1343163 1304076 1274890 1292671 1275876 1246505 1236929
12892 1236929 1299646 1339494 1361605 1336971 1334873 1331036 1323837 1332020 1323308 1290376 1306442 1297870
12880 1297870 1298535 1333914 1346068 1365513 1401273 1410331 1414063 1435204 1350169 1356225 1410528 1402797
12868 1402797 1330305 1340206 1394412 1399479 1361022 1429143 1463208 1428142 1415322 1443428 1457651 1473834
12856 1473834 1494326 1491044 1505928 1505163 1563709 1663937 1729869 1743827 1769030 1756759 1746460 1735090
12844 1735090 1705791 1644683 1636616 1653520 1676403 1664467 1661491 1671255 1693728 1734230 1724505 1731294
$$ packed form
12927A078418K6008M0891j0742L0468n2450L8643K2754j3302k6642j6986k9577
12916A087483k3374L2533M0323j4944l871K6409K098j2405N8998L8885j754L9146
12904A269527P8046N720l2774K5642J612m610l9087k9186J7781j6795k9371r576
12892A236929O2717L9848K2111k4634k098l837p199Q183q712l2932J6066q572
12880A297870O65L5379J2154J9445L5760R058L732K1141q5035O056N4303p731
12868A402797p2492R901N4206N067l8457O8121L4065l5066j2820K8106J4223J6183
12856A473834K0492l282J4884p65N8546J00228O5932J3958K5203j2271j0299j1370
12844A735090k9299o1108q067J6904K2883j1936k976R764K2473M0502r725O789
$$ plain form
12832 1731294 1727949 1685778 1740898 1852290 1887264 1948028 1966360 1949144 1960255 1973827 1924676
12821 1924676 1904941 1915196 1935981 1958154 1933945 1954374 1954709 1953994 1940022 1984153 2015593 2136066
12809 2136066 2180604 2156655 2168419 2187571 2163052 2187336 2227519 2259426 2266136 2285538 2270780
12798 2270780 2311560 2357670 2332306 2264786 2168323 2090692 2092986 2128496 2146182 2132808 2144284
12787 2144284 2194890 2201160 2259208 2340285 2384893 2438588 2489000 2511723 2528694 2535353 2536226 2554973
12775 2554973 2552789 2548089 2552143 2552757 2551516 2609734 2627652 2576657 2605828 2680240 2740753 2783956
12763 2783956 2881134 2893743 2917328 2964847 3011338 3120674 3254772 3321681 3417524 3543011 3570487
12752 3570487 3638014 3778699 3853582 3830032 3875849 3937130 4037021 4085569 4167177 4201946 4227444
$$ packed form
12832A731294l345m2171N5120J11392L4974O0764J8332j7216J1111J3572m9151
12821A924676j9735J0255K0785K2173k4209K0429L35p15j3972M4131L1440J20473
12809B136066M4538k3949J1764J9152k4519K4284M0183L1907O710J9402j4758
12798B270780M0780M6110k5364o7520r6463p7631K294L5510J7686j3374J1476
12787B144284N0606O270N8048Q1077M4608N3695N0412K2723J6971O659Q73J8747
12775B554973k184m700M054O14j241N8218J7918n0995K9171P4412O0513M3203
12763B783956R7178J2609K3585M7519M6491J09336J34098O6909R5843J25487K7476
12752C570487O7527J40685P4883k3550M5817O1281R9891M8548Q1608L4769K5498
$$ plain form
12741 4227444 4325488 4417397 4610212 4756749 4857162 5001328 5124978 5290568 5456088 5615538
12731 5615538 5818714 6006829 6165418 6370856 6598112 6899334 7239667 7539762 7966189
12722 7966189 8359287 8810682 9290247 9753549 10233156 10741813 11255078 11845511 12525199
12713 12525199 13394382 14343529 15580264 17140538 19106805 21409114 24332460 28055034
12705 28055034 32826435 39069153 47199094 57443530 69567768 82714817 95536253
12698 95536253 106885210 115835849 121918447 124860600 124739111 121824666 116827365 110661926
12690 110661926 104226543 98482285 94147273 91713864 91540650 93898466 98799130 105934878
12682 105934878 114896863 125458762 137098646 148536454 158000152 164502906 168504833
$$ packed form
12741D227444R8044R1909J92815J46537J00413J44166J23650J65590J65520J59450
12731E615538K03176J88115J58589K05438K27256L01222L40333L00095M26427
12722G966189L93098M51395M79565M63302M79607N08657N13265N90433O79688
12713A2525199Q69183R49147J236735J560274J966267K302309K923346L722574
12705B8055034M771401O242718Q129941J0244436J2124238J3147049J2821436
12698I5536253J1348957Q950639O082598K942153j21489k914445m997301o165439
12690A10661926o435383n744258m335012k433409j73214K357816M900664P135748
12682A05934878Q961985J0561899J1639884J1437808R463698O502754M001927
$$ plain form
12675 168504833 171317318 174326764 178163610 182164940 184594835 184290189 180858728 174681464
12667 174681464 166516166 156852448 145985820 134387623 122932036 112509080 103920214
12660 103920214 97833159 94722474 94694750 97500150 102638185 109283305 116768942 124664016
12652 124664016 132418054 138849829 142094459 140750961 134992819 125680331 114132957 101425600
12644 101425600 88525490 76374585 65767620 57151125 50652484 46020123 43012628
12637 43012628 41357132 41115081 42284867 44798722 48972856 55171868 63700131 74713477
12629 74713477 87692281 102118416 117582573 133257474 147470587 158098636 163686581
12622 163686581 164039245 159792026 152365515 143244247 133452596 124030722 116173984 110773145
$$ packed form
12675A68504833K812485L009446L836846M001330K429895l04646l431461o177264
12667A74681464q165298r663718j0866628j1598197j1455587j0422956q588866
12660A03920214o087055l110685k7724K805400N138035O645120P485637P895074
12652A24664016P754038O431775L244630j343498n758142r312488j1547374j2707357
12644A01425600j2900110j2150905j0606965q616495o498641m632361l007495
12637D3012628j655496k42051J169786K513855M174134O199012Q528263J1013346
12629G4713477J2978804J4426135J5464157J5674901J4213113J0628049N587945
12622A63686581L52664m247219p426511r121268r791651r421874p856738n400839
$$ plain form
12614 110773145 108439396 109626820 114230922 121950014 132286218 144497150 157684715
12607 157684715 171070914 184071501 195927659 205692094 212490958 215844467 216233452 214891210
12599 214891210 213462784 212670617 211518917 208090443 201089952 190329549 177011667 162758438
12591 162758438 148757351 135930283 125239171 117273387 112225618 110130186 110885831 114278061
12583 114278061 119882638 126969898 134528057 141325876 146322784 148844620 148285474 144260341
12575 144260341 136342917 124726398 110327647 94745617 79579298 65848730 54219065
12568 54219065 44772191 37251186 31357427 26724654 23048362 20104748 17642232 15650774
12560 15650774 14072271 12754040 11670703 10682745 9837259 9072038 8340032 7626768 7008150
$$ packed form
12614A10773145k333749J187424M604102P719092J0336204J2210932J3187565
12607A57684715J3386199J3000587J1856158R764435O798864L353509L88985j342242
12599B14891210j428426p92167j151700l428474p000491j0760403j3317882j4253229
12591A62758438j4001087j2827068j0691112p965784n047769k095432P55645L392230
12583A14278061N604577P087260P558159O797819M996908K521836n59146m025133
12575A44260341p917424j1616519j4398751j5582030j5166319j3730568j1629665
12568E4219065r446874p521005n893759m632773l676292k943614k462516j991458
12560A5650774j578503j318231j083337r87958q45486p65221p32006p13264o18618
$$ plain form
12551 7008150 6429367 5883425 5347273 4914932 4507472 4081451 3705398 3356852 3074189
12542 3074189 2792524 2577990 2385634 2218394 2080533 2002830 1870918 1702584 1550613 1455459
12532 1455459 1370254 1281092 1224343 1134585 1069126 1083488 1007593 904631 851365 779102 712556
12521 712556 675246 609279 552311 549743 531129 466598 455829 469488 472311 457762 439062 437749
12509 437749 434638 446895 472247 495838 445934 448760 449666 425267 392728 382439 342424 274140
12497 274140 220330 144300 95349 130847 187948 202728 170672 113333 137183 126629 131603 126488
12485 126488 134141 149656 126395 91521 98706 120266 97265 85809 82085 60603 28105 -12143
12473 -12143 -9996 42517 62586 15188 -57869 -58077 -85905 -87530 -68184 -22494 -18309 -73638 -114228
$$ packed form
12551G008150n78783n45942n36152m32341m07460m26021l76053l48546k82663
12542C074189k81665k14534j92356j67240j37861p7703j31912j68334j51971r5154
12532A455459q5205q9162n6749q9758o5459J4362p5895j02962n3266p2263o6546
12521G12556l7310o5967n6968k568j8614o4531j0769J3659K823j4549j8700j313
12509D37749l111J2257K5352K3591m9904K826R06k4399l2539j0289m0015o8284
12497B74140n3810p6030m8951L5498N7101J4780l2056n7339K3850j0554M974n115
12485A26488P653J5515k3261l4874P185K1560k3001j1456l724k1482l2498m0248
12473a2143K147N2513K0069m7398p3057k08k7828j625J9346M5690M185n5329m0590
$$ plain form
12460 -114228 -125348 -151059 -143925 -96560 -46924 -22589 -81898 -94382 -97033 -102218 -80078 -99154
12448 -99154 -95518 -78694 -122004 -146147 -153158 -181701 -180277 -141875 -116989 -83793 -88143 -84379 -96423
12435 -96423 -100067 -93572 -126928 -143328 -133116 -134951 -96519 -89220 -134189 -146243 -111698 -100113
12423 -100113 -177786 -197413 -168256 -109268 -54755 14453 38663 -4921 -7941 -735 -10200 -13221
12411 -13221 2959 29445 34039 22491 34447 88238 74097 80709 95042 157732 112704 82750
12399 82750 155990 211062 189827 170356 256139 368909 481350 609605 721811 847127 950055
12388 950055 906875 858159 835903 712128 591809 481415 417680 439231 443231 441808 524702
12377 524702 693441 849157 977711 1041505 1017001 997233 876193 776563 639763 445252
$$ packed form
12460a14228j1120k5711P134M7365M9636K4335n9309j2484k651n185K2140j9076
12448i9154L636J6824m3310k4143p011k8543J424L8402K4886L3196m350L764j2044
12435i6423l644O495l3356j6400J0212j835L8432P299m4969j2054L4545J1585
12423a00113p7673j9627K9157N8988N4513O9208K4210m3584l020P206r465l021
12411a3221J6180K6486M594j1548J1956N3791j4141O612J4333O2690m5028k9954
12399H2750P3240N5072k1235j9471Q5783J12770J12441J28255J12206J25316J02928
12388I50055m3180m8716k2256j23775j20319j10394o3735K1551M000j423Q2894
12377E24702J68739J55716J28554O3794k4504j9768j21040r9630j36800j94511
$$ plain form
12367 445252 317048 275156 241829 233217 227989 215553 183813 207175 230277 178759 196573 238285
12355 238285 181342 134204 124760 146483 207894 218555 182135 148171 81623 124858 161992 152344
12343 152344 191254 249238 276625 283640 276929 324542 337447 354307 384797 481647 582247 741778
12331 741778 852120 863431 800329 784757 715865 720420 765911 895817 947449 1036874 1266673
12320 1266673 1514700 1780838 1969813 1974337 1887786 1690105 1482948 1332970 1279990 1239284
12310 1239284 1204907 1146007 1185338 1237600 1349790 1507499 1651296 1879477 2016664 1928843
12300 1928843 1765834 1527143 1279843 1043541 848796 729219 672930 622241 536980 451260
12290 451260 468232 469777 445282 421579 395643 305273 281760 245669 211549 190603 194506 201526
$$ packed form
12367D45252j28204m1892l3327q612n228j2436l1740K3362K3102n1518J7814M1712
12355B38285n6943m7138r444K1723O1411J0661l6420l3964o6548M3235L7134r648
12343A52344L8910N7984K7387P015o711M7613J2905J6860L0490R6850J00600J59531
12331G41778J10342J1311o3102j5572o8892M555M5491J29906N1632Q9425K29799
12320A266673K48027K66138J88975M524q6551j97681k07157j49978n2980m0706
12310A239284l4377n8900L9331N2262J12190J57709J43797K28181J37187q7821
12300A928843j63009k38691k47300k36302j94745j19577n6289n0689q5261q5720
12290D51260J6972J545k4495k3703k5936r0370k3513l6091l4120k0946L903P020
$$ plain form
12278 201526 201240 253602 287641 260736 213154 199770 232295 266812 236373 208234 248203 251638
12266 251638 288639 381224 456112 443327 347234 337058 407472 432329 459241 484293 494162 523377
12254 523377 570357 648288 652929 712211 788809 946449 1085514 1169889 1253198 1293085 1234024
12243 1234024 1206625 1179800 1127817 1087158 1041306 1043749 1120380 1193132 1276383 1388972 1531190
12232 1531190 1593854 1619726 1690153 1618472 1540528 1488559 1408767 1308863 1232714 1179654 1154699
12221 1154699 1167719 1184659 1231663 1260185 1262103 1280942 1290340 1289224 1363074 1446898 1473691 1432442
12209 1432442 1441419 1466331 1450787 1425035 1457143 1413208 1319204 1345423 1327292 1327996 1316478 1363886
12197 1363886 1363978 1332204 1320913 1340847 1361785 1385221 1434378 1419450 1330303 1371964 1344537 1306607
$$ packed form
12278B01526k86N2362L4039k6905m7582j3384L2525L4517l0439k8139L9969L435
12266B51638L7001R2585P4888j2785r6093j0176P0414K4857K6912K5052R869K9215
12254E23377M6980P7931M641N9282P6598J57640J39065Q4375Q3309L9887n9061
12243A234024k7399k6825n1983m0659m5852K443P6631P2752Q3251J12589J42218
12232A531190O2664K5872P0427p1681p7944n1969p9792r9904p6149n3060k4955
12221A154699J3020J6940M7004K8522J918J8839R398j116P3850Q3824K6793m1249
12209A432442Q977K4912j5544k5752L2108m3935r4004K6219j8131P04j1518M7408
12197A363886R2l1774j1291J9934K0938K3436M9157j4928q9147M1661k7427l7930
$$ plain form
12185 1306607 1289028 1271659 1160906 1112417 1081805 1025528 976448 931835 969817 963258 866639
12174 866639 841522 901854 875374 864954 920824 932190 992944 1079419 1118996 1165911 1197150
12163 1197150 1262828 1356750 1398498 1425357 1530905 1587408 1572084 1608083 1703730 1730369 1780580
12152 1780580 1847884 1790648 1769579 1769158 1702757 1666947 1652078 1757215 1851856 1909372 1962712
12141 1962712 1931754 1947515 1987108 2028208 2070786 2112179 2136236 2102230 2007086 1923558 1848882
12130 1848882 1805614 1754556 1705096 1624728 1561747 1534332 1541753 1555881 1613412 1601359 1604658 1678963
12118 1678963 1738893 1736398 1764693 1773942 1814975 1799420 1741661 1687647 1633312 1553084 1531839 1588804
12106 1588804 1620114 1610877 1534285 1445500 1388090 1302163 1231824 1165038 1083449 1025870 1039630
$$ packed form
12185A306607j7579j7369j10753m8489l0612n6277m9080m4613L7982o559r6619
12174H66639k5117O0332k6480j0420N5870J1366O0754Q6475L9577M6915L1239
12163A197150O5678R3922M1748K6859J05548N6503j5324L5999R5647K6639N0211
12152A780580O7304n7236k1069m21o6401l5810j4869J05137R4641N7516N3340
12141A962712l0958J5761L9593M1100M2578M1393K4057l4006r5144q3528p4676
12130A848882m3268n1058m9460q0368o2981k7415P421J4128N7531j2053L299P4305
12118A678963N9930k495K8295R249M1033j5555n7759n4014n4335q0228k1245N6965
12106A588804L1310r237p6592q8785n7410q5927p0339o6786q1589n7579J3760
$$ plain form
12095 1039630 1092083 1090002 1099917 1142968 1144738 1086844 1061469 1117234 1174764 1226444 1254963 1255579
12083 1255579 1359666 1369201 1345996 1356095 1335420 1305586 1267466 1281270 1286459 1221427 1141759
12072 1141759 1150898 1252047 1307628 1382188 1436759 1463320 1494238 1531568 1523065 1516727 1502515 1401643
12060 1401643 1314894 1286903 1232810 1177938 1109327 1103460 1091125 1061118 1114480 1176625 1232970
12049 1232970 1274555 1356855 1403642 1406717 1375206 1319238 1317718 1294283 1351209 1402094 1467855 1509339
12037 1509339 1533679 1524870 1571047 1614295 1629560 1674638 1692171 1733137 1781994 1869890 1909962
12026 1909962 1940270 1965839 1990732 2070892 2153593 2182255 2157484 2192854 2266021 2314461 2384024
12015 2384024 2522132 2768179 2967908 3123678 3260801 3356859 3375243 3309945 3183799 3076147
$$ packed form
12095A039630N2453k081R915M3051J770n7894k5375N5765N7530N1680K8519O16
12083A255579J04087R535k3205J0099k0675k9834l8120J3804N189o5032p9668
12072A141759R139J01149N5581P4560N4571K6561L0918L7330q503o338j4212j00872
12060A401643q6749k7991n4093n4872o8611n867j2335l0007N3362O2145N6345
12049A232970M1585Q2300M6787L075l1511n5968j520k3435N6926N0885O5761M1484
12037A509339K4340q809M6177M3248J5265M5078J7533M0966M8857Q7896M0072
12026A909962L0308K5569K4893Q0160Q2701K8662k4771L5370P3167M8440O9563
12015B384024J38108K46047J99729J55770J37123R6058J8384o5298j26146j07652
$$ plain form
12005 3076147 2970176 2991151 3047417 3081395 3119539 3237539 3347063 3473266 3611996 3802548
11995 3802548 3930343 4081168 4139521 4137431 4133431 4175249 4241706 4349505 4456463 4557269 4706608
11984 4706608 4965406 5304128 5597844 5869251 6165484 6495247 6893621 7312234 7820248
11975 7820248 8399326 8988673 9723374 10548824 11555634 12770423 14159522 15807936 17842618
11966 17842618 20459399 23783969 27840619 32646765 38308633 45102496 53801502 65531185
11958 65531185 81526689 102528666 127343335 151667694 169463281 176873890 173767767
11951 173767767 162908978 147864397 131954987 117777730 106971078 100223936 97900509
11944 97900509 100251360 107512730 119780100 137309029 158999824 180500981 194851972
$$ packed form
12005C076147j05971K0975N6266L3978L8144J18000J09524J26203J38730J90552
11995C802548J27795J50825N8353k090m000M1818O6457J07799J06958J00806J49339
11984D706608K58798L38722K93716K71407K96233L29763L98374M18613N08014
11975G820248N79078N89347P34701Q25450J006810J214789J389099J648414K034682
11966A7842618K616781L324570M056650M806146N661868O793863Q699006J1729683
11958F5531185J5995504K1001977K4814669K4324359J7795587P410609l106123
11951A73767767j0858789j5044581j5909410j4177257j0806652o747142k323427
11944I7900509K350851P261370J2267370J7528929K1690795K1501157J4350991
$$ plain form
11937 194851972 196399250 184654028 163890535 139719811 116262138 95649122 78614295
11930 78614295 65149296 54603005 46465937 40033416 34942802 30862460 27686708 24999701
11922 24999701 22744159 20893838 19347441 17972249 16866154 15994676 15258956 14708633
11914 14708633 14400991 14314268 14314754 14339144 14475955 14711256 14976582 15286414 15690606 16223860
11904 16223860 16864606 17578631 18469183 19572843 20900759 22482163 24566034 27232449
11896 27232449 30670837 35004428 40373475 46913249 54591090 63617966 74703001 89070681
11888 89070681 108365961 134802771 170977005 216896468 266354626 308847270 335849435
11881 335849435 343026217 330388561 302817764 268727151 235621107 207884893 187898072
$$ packed form
11937A94851972J547278j1745222k0763493k4170724k3457673k0613016j7034827
11930G8614295j3464999j0546291q137068o432521n090614m080342l175752k687007
11922B4999701k255542j850321j546397j375192j106095q71478p35720n50323
11914A4708633l07642q6723M86K4390J36811K35301K65326L09832M04192N33254
11904A6223860O40746P14025Q90552J103660J327916J581404K083871K666415
11896B7232449L438388M333591N369047O539774P677841R026876J1085035J4367680
11888H9070681J9295280K6436810L6174234M5919463M9458158M2492644K7002165
11881C35849435P176782j2637656k7570797l4090613l3106044k7736214j9986821
$$ plain form
11874 187898072 176827744 175089401 182552057 198971658 224690598 258788413 296458982
11867 296458982 328053643 343896215 339412262 315743067 278216068 235035335 193737246
11860 193737246 158392176 129864770 107359074 89735552 75685434 64333209 55012862
11853 55012862 47248077 40863941 35726418 31567951 28182744 25359064 23013664 21081642
11845 21081642 19450241 18081846 16904164 15913454 15082123 14449326 13951477 13540568 13146722
11836 13146722 12821480 12578517 12365344 12326040 12321418 12409722 12553956 12751636 13163801 13812111
11826 13812111 14716332 15896746 17308849 19148039 21532821 24518871 28314788 33020482
11818 33020482 38740423 45899959 55358530 68431229 86299935 109175670 135082267
$$ packed form
11874A87898072j1070328j738343P462656J6419601K5718940L4097815L7670569
11867B96458982L1594661J5842572m483953k3669195l7526999m3180733m1298089
11860A93737246l5345070k8527406k2505696j7623522j4050118j1352225r320347
11853E5012862p764785o384136n137523m158467l385207k823680k345400j932022
11845B1081642j631401j368395j177682r90710q31331o32797m97849m10909l93846
11836A3146722l25242k42963k13173l9304m622Q8304J44234J97680M12165O48310
11826A3812111R04221J180414J412103J839190K384782K986050L795917M705694
11818C3020482N719941P159536R458571J3072699J7868706K2875735K5906597
$$ plain form
11811 135082267 158130744 171219103 170895940 159160460 142013551 124344215 108496961
11804 108496961 95868306 87412064 83341242 83491335 87896492 96512097 108764077 123352197
11796 123352197 138488517 150985843 156547922 152019164 137971189 118485285 98177432
11789 98177432 79867154 64751917 52995449 44155153 37457236 32077643 27443797 23422804
11781 23422804 20045295 17175709 14861693 13026655 11493086 10214501 9177465 8259985
11773 8259985 7421452 6629041 5959898 5448716 4955814 4502268 4113930 3860870 3566234
11764 3566234 3385053 3172843 2963692 2805563 2663984 2456249 2258698 2114174 1983752
11755 1983752 1849604 1685542 1547144 1411421 1216017 1113969 1115304 1037313 937546 882255
$$ packed form
11811A35082267K3048477J3088359l23163j1735480j7146909j7669336j5847254
11804A08496961j2628655q456242m070822J50093M405157Q615605J2251980J4588120
11796A23352197J5136320J2497326N562079m528758j4047975j9485904k0307853
11789I8177432j8310278j5115237j1756468q840296o697917n379593m633846m020993
11781B3422804l377509k869586k314016j835038j533569j278585j037036r17480
11773H259985q38533p92411o69143n11182m92902m53546l88338k53060k94636
11764C566234j81181k12210k09151j58129j41579k07735j97551j44524j30422
11755A983752j34148j64062j38398j35723j95404j02048J335p7991r9767n5291
$$ plain form
11745 882255 855996 840011 809101 728015 641797 581903 400839 328748 299950 264680 171638
11734 171638 127390 77847 20892 34430 65945 50679 23029 13876 18107 34957 82471 94889
11722 94889 52966 45503 81230 75244 -16920 -86406 -132333 -166314 -206391 -203636 -235285 -167000
11710 -167000 -106229 -107482 -137915 -110447 -69487 3714 57418 52189 22304 37675 -12491 11725
11698 11725 30498 7254 -2382 -6226 30865 44977 16169 52062 89362 103665 80444 50553
11686 50553 53911 15817 46348 9226 17925 38168 15111 -58283 -142107 -153490 -97284 -70241
11674 -70241 -146271 -209771 -255042 -237877 -225399 -244823 -304534 -357455 -383543 -389376 -364498 -426032
11662 -426032 -424394 -420412 -450576 -443370 -455893 -475706 -479237 -468993 -476494 -492782 -450028 -468019
$$ packed form
11745H82255k6259j5985l0910q1086q6218n9894j81064p2091k8798l5270r3042
11734A71638m4248m9543n6955J3538L1515j5266k7650r153M231J6850M7514J2418
11722I4889m1923p463L5727n986r2164o9486m5927l3981m0077K755l1649O8285
11710a67000O0771j253l0433K7468M0960P3201N3704n229k9885J5371n0166K4216
11698A1725J8773k3244r636l844L7091J4112k8808L5893L7300J4303k3221k9891
11686E0553L358l8094L0531l7122Q699K0243k3057p3394q3824j1383N6206K7043
11674g0241p6030o3500m5271J7165J2478j9424n9711n2921k6088n833K4878o1534
11662d26032J638L982l0164P206j2523j9813l531J0244p501j6288M2754j7991
$$ plain form
11650 -468019 -460112 -486417 -488291 -452368 -455462 -444247 -376118 -368249 -358517 -293261 -340544 -374595
11638 -374595 -354380 -335316 -329742 -257030 -226985 -284601 -331359 -310166 -244433 -238698 -248369 -256309
11626 -256309 -227966 -206226 -188736 -194345 -233564 -205762 -187728 -188274 -164904 -222877 -296246 -351864
11614 -351864 -389467 -372173 -351962 -293283 -315078 -325831 -245228 -206146 -193690 -261408 -295135
11603 -295135 -326988 -311836 -290626 -306214 -346566 -360027 -347047 -375608 -370925 -391732 -434669 -470083
11591 -470083 -451061 -460991 -401859 -360795 -359471 -354187 -366063 -380743 -377152 -385191 -355281 -326483
11579 -326483 -282610 -301571 -353783 -391962 -406122 -380512 -385472 -399673 -378333 -355762 -388063 -353940
11567 -353940 -287826 -261894 -243947 -213279 -259223 -304411 -293188 -290248 -326934 -301503 -273484 -276924
$$ packed form
11650d68019P907k6305j874L5923l094J1215O8129P869R732O5256m7283l4051
11638c74595K0215J9064N574P2712L0045n7616m6758K1193O5733N735r671p940
11626b56309K8343K1740J7490n609l9219K7802J8034n46K3370n7973p3369n5618
11614c51864l7603J7294K0211N8679k1795j0753Q0603L9082J2456o7718l3727
11603b95135l1853J5152K1210j5588m0352j3461J2980k8561M683k0807m2937l5414
11591d70083J9022r930N9132M1064J324N284j1876j4680L591q039K9910K8798
11579c26483M3873j8961n2212l8179j4160K5610m960j4201K1340K2571l2301L4123
11567c53940O6114K5932J7947L0668m5944m5188J1223K940l6686K5431K8019l440
$$ plain form
11555 -276924 -280343 -315554 -280441 -254258 -280202 -333555 -340351 -321513 -289051 -321445 -285850 -248194
11543 -248194 -293684 -286938 -267466 -280174 -226845 -224906 -248021 -271065 -234199 -219405 -237622 -258526
11531 -258526 -274923 -212715 -201997 -240935 -209183 -158531 -129567 -90353 -70132 -78756 -88760 -68763
11519 -68763 -47943 -10571 1298 49425 149754 171921 216484 388635 515400 536214 551795
11508 551795 520299 481313 452393 389444 340575 323409 299589 320785 345471 388317 425934
11497 425934 552798 679230 764322 784849 750844 643261 536462 414460 301936 178842
11487 178842 100537 71556 96335 3082 -106674 -101991 -60470 -64492 -88359 -73077 -90842 -136562
11475 -136562 -117252 -82379 -113142 -141424 -137673 -147281 -177336 -219853 -237143 -215836 -180499 -163813
$$ packed form
11555b76924l419l5211L5113K6183k5944n3353o796J8838L2462l2394L5595L7656
11543b48194m5490O746J9472j2708N3329J939k3115k3044L6866J4794j8217k0904
11531b58526j6397O2208J0718l8938L1752N0652K8964L9214K0221q624j0004J9997
11519f8763K0820L7372J1869M8127J00329K2167M4563J72151J26765K0814J5581
11508E51795l1496l8986k8920o2949m8869j7166k3820K1196K4686M2846L7617
11497D25934J26864J26432Q5092K0527l4005j07583j06799j22002j12524j23094
11487A78842p8305k8981K4779r3253j09756M683M1521m022k3867J5282j7765m5720
11475a36562J9310L4873l0763k8282L751r608l0055m2517j7290K1307L5337J6686
$$ plain form
11463 -163813 -167020 -159272 -123534 -75708 -51104 -51321 -109031 -136256 -88996 -62804 -49530 -46129
11451 -46129 -60529 -52994 -1508 19072 70677 182712 303905 482021 699199 907371 1178172
11440 1178172 1352523 1476920 1544889 1529692 1458793 1306659 1099019 916565 846106 861088
11430 861088 834734 792040 851697 924597 1008272 1166348 1378948 1576533 1610269 1548564 1349728
11419 1349728 1119433 847242 657781 552060 428651 334235 254446 226442 102896 38425
11409 38425 77 -47272 -124027 -180935 -176523 -147530 -193021 -283031 -263898 -252359 -202336 -164750
11397 -164750 -182696 -223976 -218520 -208198 -203421 -252906 -289333 -267643 -260155 -235053 -242564 -261548
11385 -261548 -220133 -204965 -180910 -122346 -83769 -52339 -73764 -81016 -76455 -68491 -41107 27922
$$ packed form
11463a63813l207P748L5738M7826K4604k17n7710k7225M7260K6192J3274L401
11451d6129j4400P535N1486K0580N1605J12035J21193J78116K17178K08172K70801
11440A178172J74351J24397O7969j5197p0899j52134k07640j82454p0459J4982
11430H61088k6354m2694N9657P2900Q3675J58076K12600J97585L3736o1705j98836
11419A349728k30295k72191j89461j05721j23409r4416p9789k8004j23546o4471
11409C8425l8348m7349p6755n6908M412K8993m5491r0010J9133J1539N0023L7586
11397a64750j7946m1280N456J0322M777m9485l6427K1690P488K5102p511j8984
11385b61548M1415J5168K4055N8564L8577L1430k1425p252M561P964K7384O9029
$$ plain form
11373 27922 84955 117803 194307 304958 421165 557073 669419 689529 612505 506672 439381
11362 439381 382048 331166 243517 232638 240856 276985 265917 312910 387738 502277 619911
11351 619911 685796 666583 616873 494830 343213 241432 122208 46668 4348 -37758 -55264
11340 -55264 -34968 -118208 -141405 -107072 -125098 -143709 -166407 -171423 -198028 -310043 -335162 -346110
11328 -346110 -320009 -287635 -250353 -256164 -285469 -282951 -297620 -288754 -224579 -201639 -200655 -174785
11316 -174785 -190491 -220514 -233450 -262735 -281183 -225372 -205443 -178854 -188114 -227698 -221140 -199916
11304 -199916 -219478 -196880 -164058 -230970 -210736 -181161 -189237 -241049 -239304 -193855 -175332 -206834
11292 -206834 -261116 -196693 -69524 -31539 -43977 -58632 -120738 -163484 -155855 -177867 -207724
$$ packed form
11373B7922N7033L2848P6504J10651J16207J35908J12346K0110p7024j05833o7291
11362D39381n7333n0882q7649j0879Q218L6129j1068M6993P4828J14539J17634
11351F19911O5885j9213m9710j22043j51617j01781j19224p5540m2320m2106j7506
11340e5264K0296q3240k3197L4333j8026j8611k2698n016k6605j12015k5119j0948
11328c46110K6101L2374L7282n811k9305K518j4669Q866O4175K2940R84K5870
11316a74785j5706l0023j2936k9285j8448N5811J9929K6589r260l9584O558K1224
11304a99916j9562K2598L2822o6912K0234K9575q076n1812J745M5449J8523l1502
11292b06834n4282O4423J27169L7985j2438j4655o2106m2746P629k2012k9857
$$ plain form
11281 -207724 -183332 -131920 -138658 -153638 -168169 -188672 -194173 -196048 -188951 -184502 -224291 -253209
11269 -253209 -280620 -253190 -263756 -316552 -308309 -266841 -211872 -186742 -204886 -203161 -205877 -252831
11257 -252831 -252211 -238249 -258328 -304067 -335941 -291868 -284050 -301758 -270469 -224970 -181953 -206560
11245 -206560 -214752 -255008 -237574 -174455 -156718 -179157 -212900 -226531 -212071 -219219 -245887 -242854
11233 -242854 -228813 -248032 -139393 -121273 -133979 -128215 -162349 -206377 -203780 -191380 -202797 -195555
11221 -195555 -194850 -207361 -237347 -213576 -178391 -86700 -88397 -140863 -192251 -230735 -221207 -215693
11209 -215693 -233328 -166341 -115442 -120222 -173053 -129433 -152544 -198405 -210023 -192474 -143689 -73843
11197 -73843 -98430 -150500 -169076 -112408 -78949 -95044 -130382 -162743 -158636 -141003 -144027 -157044
$$ packed form
11281b07724K4392N1412o738j4980j4531k0503n501j875P097M449l9789k8918
11269b53209k7411K7430j0566n2796Q243M1468N4969K5130j8144J725k716m6954
11257b52831O20J3962k0079m5739l1874M4073P818j7708L1289M5499M3017k4607
11245b06560q192m0256J7434O3119J7737k2439l3743j3631J4460p148k6668L033
11233b42854J4041j9219J08639J8120j2706N764l4134m4028K597J2400j1417P242
11221a95555P05j2511k9986K3771L5185R1691j697n2466n1388l8484R528N514
11209b15693j7635O6987N0899m780n2831M3620k3111m5861j1618J7549M8785O9846
11197g3843k4587n2070j8576N6668L3459j6095l5338l2361M107J7633l024j3017
$$ plain form
11185 -157044 -165992 -117387 -136540 -147580 -180448 -210715 -173128 -135429 -132409 -154455 -163179 -106617
11173 -106617 -98509 -70878 -58039 -109920 -113573 -93102 -151918 -140392 -167032 -215038 -197493 -168762
11161 -168762 -164139 -143062 -115725 -168552 -247839 -231619 -213365 -214981 -187210 -216210 -204253 -206530
11149 -206530 -207477 -184066 -195115 -150959 -139567 -132176 -107462 -79209 -123814 -173075 -172029 -139603
11137 -139603 -90602 -131983 -170455 -154717 -188374 -215905 -231785 -177043 -147476 -128305 -157263
11126 -157263 -170483 -209201 -179575 -94708 -45146 -19839 -28818 -56713 -133208 -203258 -184986 -210684
11114 -210684 -231221 -200376 -130886 -149267 -159408 -114073 -143709 -217624 -204254 -158287 -111037
11103 -111037 -132869 -74065 -66964 -98158 -114445 -111148 -90927 -94414 -96485 -137105 -199074 -161234
$$ packed form
11185a57044q948M8605j9153j1040l2868l0267L7587L7699L020k2046q724N6562
11173a06617Q108K7631J2839n1881l653K0471n8816J1526k6640m8006J7545K8731
11161a68762M623K1077K7337n2827p9287J6220J8254j616K7771k9000J1957k277
11149b06530r47K3411j1049M4156J1392P391K4714K8253m4605m9261J046L2426
11137a39603M9001m1381l8472J5738l3657k7531j5880N4742K9567J9171k8958
11126a57263j3220l8718K9626Q4867M9562K5307q979k7895p6495p0050J8272k5698
11114b10684k0537L0845O9490j8381j0141M5335k9636p3915J3370M5967M7250
11103a11037k1832N8804P101l1194j6287L297K0221l487k071m0620o1969L7840
$$ plain form
11091 -161234 -162461 -162827 -133144 -129281 -140919 -139756 -155456 -179914 -172608 -151217 -157492 -71341 -15329
11078 -15329 -29976 -60126 -76944 -53032 -25903 -51895 -99411 -159104 -189130 -198013 -202561 -212891
11066 -212891 -210662 -163511 -163960 -135238 -167044 -222784 -227250 -183199 -137608 -126502 -135109 -144644 -118598
11053 -118598 -70220 -82935 -94725 -177500 -140784 -75220 -66062 -83126 -126561 -158880 -96995 -55846
11041 -55846 227 7178 45295 40857 72191 89732 61552 -13812 8605 7452 -6005 14894
11029 14894 72468 107351 185489 266364 306114 328068 237284 173704 189342 169830 98706 62129
11017 62129 68428 120841 233862 322927 346060 343160 365720 334179 241891 143101 144332 152362
11005 152362 108345 86721 110504 208473 250973 264852 249312 217550 195669 179248 130453
$$ packed form
11091a61234j227l66K9683L863j1638J163j5700k4458P306K1391o275Q6151N6012
11078a5329j4647l0150j6818K3912K7129k5992m7516n9693l0026q883m548j0330
11066b12891K229M7151m49K8722l1806n5740m466M4051M5591J1106q607r535K6046
11053a18598M8378j2715j1790q2775L6716O5564R158j7064m3435l2319O1885M1149
11041e5846N6073O951L8117m438L1334J7541k8180p5364K2417j153j3457K0899
11029A4894N7574L4883P8138Q0875L9750K1954r0784o3580J5638j9512p1124l6577
11017F2129O299N2413J13021Q9065K3133k900K2560l1541r2288r8790J231Q030
11005A52362m4017k1624K3783R7969M2500J3879j5540l1762k1881j6421m8795
$$ plain form
10994 130453 73710 83789 126239 98529 202111 217666 179957 167253 167007 125655 162939 148122
10982 148122 126784 124973 112981 116003 86564 48628 40705 16094 36751 80480 60912 67021
10970 67021 84691 52600 34739 53052 91300 101992 133921 132918 146742 218951 221764 204125
10958 204125 247271 284594 277653 299065 275016 250734 188369 129120 73584 36169 32340 -8885
10946 -8885 -7705 8264 103 -15401 -40832 -47350 -73199 -89328 -54060 37154 93258 113876
10934 113876 119762 95147 131559 133019 97453 115715 122320 98529 67811 63280 82349 84152
10922 84152 115539 133785 188378 214234 239639 259667 316231 335229 378133 337808 327364 260604
10910 260604 177886 129354 105082 98883 137201 115072 106862 123715 167649 183965 146752 195530
$$ packed form
10994A30453n6743J0079M2450k7710J03582J5555l7709j2704k46m1352L7284j4817
10982A48122k1338j811j1992L022k9439l7936p923k4611K0657M3729j9568O109
10970F7021J7670l2091j7861J8313L8248J0692L1929j003J3824P2209K813j7639
10958B04125M3146L7323o941K1412k4049k4282o2365n9249n5536l7415l829m1225
10946h885J180J5969q161j5504k5431o518k5849j6129L5268R1214N6104K0618
10934A13876N886k4615L6412J460l5566J8262O605k3791l0718m531J9069J803
10922H4152L1387J8246N4593K5856K5405K0028N6564J8998M2904m0325j0444o6760
10910B60604q2718m8532k4272o199L8318k2129q210J6853M3934J6316l7213M8778
$$ plain form
10898 195530 251391 250141 273800 274662 290669 382766 528570 664008 743805 756862 731391 705757
10886 705757 648878 572405 518198 476730 421766 384104 362640 303210 216954 204898 176974
10875 176974 136773 118845 145977 158009 148972 134902 197042 276887 352226 390293 409111 431580
10863 431580 473371 516457 462543 409956 368601 323538 272066 198731 191756 145042 114130 174115
10851 174115 196254 141143 166254 251583 339020 348397 368366 365735 368497 312415 318943 275714
10839 275714 250551 193916 196838 192055 169512 170442 186206 156014 166253 166305 154420 90907 129121
10826 129121 237939 303271 287371 296507 385115 445363 511543 581850 616000 572741 552925
10815 552925 526109 434511 345554 318171 266711 236251 228779 194803 155735 118830 130878 193908
$$ packed form
10898A95530N5861j250K3659Q62J6007R2097J45804J35438P9797J3057k5471k5634
10886G05757n6879p6473n4207m1468n4964l7662k1464n9430q6256j2056k7924
10875A76974m0201j7928K7132J2032r037j4070O2140P9845P5339L8067J8818K2469
10863D31580M1791M3086n3914n2587m1355m5063n1472p3335o975m6714l0912N9985
10851A74115K2139n5111K5111Q5329Q7437R377J9969k631K762n6082O528m3229
10839B75714k5163n6635K922m783k2543R30J5764l0192J0239N2j1885o3513L8214
10826A29121J08818O5332j5900R136Q8608O0248O6180P0307L4150m3259j9816
10815E52925k6816r1598q8957k7383n1460l0460p472l3976l9068l6905J2048O3030
$$ plain form
10803 193908 209246 183509 147243 145887 162122 210758 226082 261630 261949 276516 332739 369566
10791 369566 374195 366494 363690 337680 277413 222735 225530 213250 196422 210012 142525 107793
10779 107793 106446 122698 96826 99600 143502 201194 181014 158923 162186 134078 173564 250675
10767 250675 310717 251098 242189 260509 252918 260892 302723 266954 204336 165564 167445 184165
10755 184165 201184 232591 236383 261781 300455 304779 255581 293978 298665 261117 261375 293994
10743 293994 260268 306477 356264 377049 353660 375090 417028 385979 382496 369393 354484 304624
10731 304624 301660 359187 343841 349250 359988 380876 375543 372303 379642 413925 469612 468641 429270
10718 429270 461175 471596 484165 523591 513500 580984 637599 655352 639638 619043 522947
$$ packed form
10803A93908J5338k5737l6266j356J6235M8636J5324L5548L19J4567N6223L6827
10791C69566M629p701k804k6010o0267n4678K795j2280j6828J3590o7487l4732
10779A07793j347J6252k5872K774M3902N7692k0180k2091L263k8108L9486P7111
10767B50675O0042n9619q909J8320p591P974M1831l5769o2618l8772J881J6720
10755A84165J7019L1407L792K5398L8674M324m9198L8397M687l7548K58L2619
10743B93994l3726M6209M9787K0785k3389K1430M1938l1049l483j3103j4909m9860
10731C04624k964N7527j5346N409J0738K0888n333l240P339L4283N5687r71l9371
10718D29270L1905J0421J2569L9426j0091O7484N6615J7753j5714k0595r6096
$$ plain form
10707 522947 447283 425523 393349 394598 415067 432502 452058 491922 672451 754274 703873
10696 703873 659776 610514 611370 567130 514027 522674 573492 619353 590225 625882 626943 603033
10684 603033 574198 517514 483508 458760 536386 563997 552945 534357 483237 468792 498953
10673 498953 582265 610949 606777 612299 607818 639728 626560 650036 681511 735096 721488 729646
10661 729646 744459 790421 785353 744577 718068 703462 721280 778672 803708 834631 896671 978466
10649 978466 1030568 1114740 1175585 1206469 1239132 1221675 1215948 1219176 1231866 1219356 1220270 1281548
10637 1281548 1359339 1371821 1343136 1342324 1351492 1458749 1581328 1696734 1844599 1955958 2085661
10626 2085661 2212657 2398773 2638840 2846012 3031839 3247835 3544373 3866660 4245201
$$ packed form
10707E22947p5664k1760l2174J249K0469J7435J9556L9864J80529Q1823n0401
10696G03873m4097m9262Q56m4240n3103Q647N0818M5861k9128L5657J061k3910
10684F03033k8835n6684l4006k4748P7626K7611j1052j8588n1120j4445L0161
10673D98953Q3312K8684m172N522m481L1910j3168K3476L1475N3585j3608Q158
10661G29646J4813M5962n068m0776k6509j4606J7818N7392K5036L0923O2040Q1795
10649I78466N2102Q4172O0845L0884L2663j7457n727L228J2690j2510R14O1278
10637A281548P7791J2482k8685q12R168J07257J22579J15406J47865J11359J29703
10626B085661J26996J86116K40067K07172J85827K15996K96538L22287L78541
$$ plain form
10617 4245201 4649018 5178370 5816869 6622459 7761957 9286125 11362928 14211600 17807495
10608 17807495 21764732 25136873 27098389 27588477 27211923 26597713 26288565 26879668 28886334
10599 28886334 32481680 37947260 45334023 53640981 60342373 63320893 63024128 61423788
10591 61423788 60229401 60710277 63785871 69697937 78052015 88067288 98442264 106887831
10583 106887831 110081735 106039886 96620369 85385994 74750621 66030964 60067505 56998088
10575 56998088 56773677 59211220 63675714 68479764 70934092 69534421 65378045 60700981
10567 60700981 57115339 55670049 57221937 62175051 70514272 81380523 92688859 101166009
10559 101166009 103683975 98998593 88726183 75870416 62869957 51346112 42032830
$$ packed form
10617D245201M03817N29352O38499Q05590J139498J524168K076803K848672L595895
10608A7807495L957237L372141J961516M90088l76554o14210l09148N91103K006666
10599B8886334L595346N465580P386763Q306958O701392K978520k96765j600340
10591F1423788j194387M80876L075594N912066Q354078J0015273J0374976Q445567
10583A06887831L193904m041849r419517j1234375j0635373q719657n963459l069417
10575E6998088k24411K437543M464494M804050K454328j399671m156376m677064
10567F0700981l585642j445290J551888M953114Q339221J0866251J1308336Q477150
10559A01166009K517966m685382j0272410j2855767j3000459j1523845r313282
$$ plain form
10552 42032830 34888993 29618083 25695621 22787430 20728783 19249034 18193441 17471249
10544 17471249 17088381 17173805 17647908 18576346 20147593 22605838 26234980 30959709 36534969
10535 36534969 42084987 46238840 47877898 46584960 42947664 38101770 33269088 29163263
10527 29163263 26145338 24282438 23644413 24061398 25578713 28386011 32864083 39446000
10519 39446000 48509095 59866241 72125402 82567166 87865456 86430532 79508514 69588010
10511 69588010 59171648 49763863 42041656 36084443 31807051 28894823 27180203 26280937
10503 26280937 26115726 26597710 27602862 29286686 31844078 35533600 40794735 48355382
10495 48355382 59148009 74349409 94706654 119483184 145038901 165286787 174186494
$$ packed form
10552D2032830p143837n270910l922462k908191k058647j479749j055593p22192
10544A7471249l82868Q5424M74103R28438J571247K458245L629142M724729N575260
10535C6534969N550018M153853J639058j292938l637296m845894m832682m105825
10527B9163263l017925j862900o38025M16985J517315K807298M478072O581917
10519C9446000R063095J1357146J2259161J0441764N298290j434924o922018r920504
10511F9588010j0416362r407785p722207n957213m277392k912228j714620q99266
10503B6280937j65211M81984J005152J683824K557392L689522N261135P560647
10495D8355382J0792627J5201400K0357245K4776530K5555717K0247886Q899707
$$ plain form
10488 174186494 169276319 153078165 130814164 107671312 87070908 70380004 57672636
10481 57672636 48309408 41484486 36629875 33182770 30839892 29324960 28469669 28210704
10473 28210704 28563560 29665710 31783682 35184849 40183800 47115318 56250136 67268517
10465 67268517 78454367 87166506 90841116 88545261 81428376 71418833 60624397 50707919
10457 50707919 42432974 35923565 31174377 27883597 25960952 25351668 26059722 28323991
10449 28323991 32533632 38719724 46054033 52834816 56892370 56698079 52494111 45804108
10441 45804108 38521968 31998861 26731003 22770602 19874265 17922503 16686393 15968660
10433 15968660 15711351 15732199 16095761 16877037 18059066 19817148 22357027 26082719 31503227
$$ packed form
10488A74186494m910175j6198154k2264001k3142852k0600404j6690904j2707368
10481E7672636r363228o824922m854611l447105k342878j514932q55291k58965
10473B8210704L52856J102150K117972L401167M998951O931518R134818J1018381
10465F7268517J1185850Q712139L674610k295855p116885j0009543j0794436r916478
10457E0707919q274945o509409m749188l290780j922645o09284P08054K264269
10449B8323991M209641O186092P334309O780783M057554j94291m203968o690003
10441D5804108p282140o523107n267858l960401k896337j951762j236110p17733
10433A5968660k57309K0848L63562P81276J182029J758082K539879L725692N420508
$$ plain form
10424 31503227 39222500 49932692 63485891 78274034 90923860 97750656 96713452
10417 96713452 88547720 76167554 62839404 50709591 40739943 33052187 27342366 23226213
10409 23226213 20293943 18192903 16736768 15760350 15218002 15073402 15198065 15646527 16574731
10400 16574731 18125142 20615731 24199643 29022865 34856521 40848497 45604452 47837562
10392 47837562 46915526 43178344 37653340 31595232 25950867 21067145 17073298 13956225
10384 13956225 11625816 9793096 8421847 7348134 6455942 5789580 5224876 4646582 4143810
10375 4143810 3725242 3398986 3095388 2887528 2684563 2544895 2390201 2216466 2077330
10366 2077330 1900041 1736835 1548904 1342542 1250268 1143965 1031650 947709 879912 836424
$$ packed form
10424C1503227P719273J0710192J3553199J4788143J2649826O826796j037204
10417I6713452q165732j2380166j3328150j2129813r969648p687756n709821m116153
10409B3226213k932270k101040j456135r76418n42348j44600J24663M48462R28204
10400A6574731J550411K490589L583912M823222N833656N991976M755955K233110
10392D7837562r22036l737182n525004o058108n644365m883722l993847l117073
10384A3956225k330409j832720j371249j073713q92192o66362n64704n78294n02772
10375D143810m18568l26256l03598k07860k02965j39668j54694j73735j39136
10366B077330j77289j63206j87931k06362r2274j06303j12315q3941o7797m3488
$$ plain form
10356 836424 827165 811734 765933 721706 698995 689873 653894 592946 517826 538055 501806 517341
10344 517341 532799 468943 366800 348912 381682 349926 336751 320652 267460 176562 150927
10333 150927 138781 147815 181679 191923 180300 207557 151310 151109 151033 148549 173030 194517 151231
10320 151231 78135 17199 34088 38204 24989 -14441 -20131 -6020 -2688 -30381 -3088 29993
10308 29993 63365 99193 126307 143906 133684 155645 161333 123406 117258 105744 91620 118398
10296 118398 120592 96275 48811 -513 -63136 -98972 -121106 -202575 -118580 -55469 -25006 -33773
10284 -33773 -46141 -18845 31705 14433 5199 -5890 -437 -50887 -77481 -48309 -3781 -22252
10272 -22252 -91197 -111250 -51577 -34999 -68299 -5857 15259 -10357 -14872 -37010 5336 51291
$$ packed form
10356H36424r259j5431m5801m4227k2711r122l5979o0948p5120K0229l6249J5535
10344E17341J5458o3856j02143j7888L2770l1756j3175j6099n3192r0898k5635
10333A50927j2146R034L3864J0244j1623K7257n6247k01p6k484K4481K1487m3286
10320A51231p3096o0936J6889M116j3215l9430n690J4111L332k7693K7293L3081
10308B9993L3372L5828K7114J7599j0222K1961N688l7927o148j1514j4124K6778
10296A18398K194k4317m7464m9324o2623l5836k2134q1469Q3995O3111L0463q767
10284c3773j2368K7296N0550j7272r234j1089N453n0450k6594K9172M4528j8471
10272b2252o8945k0053N9673J6578l3300O2442K1116k5616m515k2138M2346M5955
$$ plain form
10260 51291 48516 -927 10155 33714 53293 -14090 18098 -46264 -87385 -74779 -38440 -70063
10248 -70063 -104947 -54032 34880 54332 22649 643 -16512 -13110 -7691 27814 46328 91090
10236 91090 65187 68959 62087 33804 27665 37912 -9307 -36585 -19518 14508 11768 23044
10224 23044 13 11648 -16227 -72195 -110337 -126899 -122229 -94910 -77004 -120084 -114749 -141881
10212 -141881 -156323 -174722 -148798 -84831 -98422 -94436 -102580 -99172 -70857 -40573 -14739 -5833
10200 -5833 -26111 -35235 11820 11776 17214 -26297 -46821 -41529 -11908 24240 71843 65195 16559
10187 16559 -17628 1751 30746 45635 95540 86174 79369 82259 121501 162517 115277 109587
10175 109587 100249 66365 71718 73986 66100 110457 157252 181712 139693 94831 108841 169034
$$ packed form
10260E1291k775m9443J1082K3559J9579o7383L2188o4362m1121J2606L6339l1623
10248g0063l4884N0915Q8912J9452l1683k2006j7155L402N419L5505J8514M4762
10236I1090k5903L772o872k8283o139J0247m7219k7278J7067L4026k740J1276
10224B3044k3031J1635k7875n5968l8142j6562M670K7319J7906m3080N335k7132
10212a41881j4442j8399K5924O3967j3591L986q144L408K8315L0284K5834Q906
10200e833k0278r124M7055m4N438m3511k0524N292K9621L6148M7603o648m8636
10187A6559l4187J9379K8995J4889M9905r366o805K890L9242M1016m7240n690
10175A09587r338l3884N353K268p886M4357M6795K4460m2019m4862J4010O0193
$$ plain form
10163 169034 196244 276100 327515 366210 419237 489782 563877 615629 598115 546214 468936
10152 468936 467922 428276 421079 477569 527166 625183 645418 594813 553798 426318 376232 368774
10140 368774 339402 307279 275080 275414 298682 317010 324282 331567 298120 261831 246432 266152
10128 266152 287488 267408 300688 249418 250342 276537 248541 189429 186949 160754 112444 135707
10116 135707 146614 148254 159553 153528 194939 254087 278543 278570 259264 266357 261755 208955 142831
10103 142831 133917 91454 31546 80506 106213 191668 205599 224521 196969 233794 284054 220127
10091 220127 187608 270976 336037 360505 494849 638423 764781 828505 812334 749290 648967
10080 648967 527673 407377 312781 268816 222705 132275 79330 47835 58266 35639 54889
$$ packed form
10163A69034K7210P9856N1415L8695N3027P0545P4095N1752j7514n1901p7278
10152D68936j014l9646p197N6490M9597R8017K0235n0605m1015j27480n0086p458
10140C68774k9372l2123l2199L34K3268J8328P272P285l3447l6289j5399J9720
10128B66152K1336k0080L3280n1270R24K6195k7996n9112k480k6195m8310K3263
10116A35707J0907J640J1299o025M1411N9148K4456K7j9306P093m602n2800o6124
10103A42831q914m2463n9908M8960K5707Q5455J3931J8922k7552L6825N0260o3927
10091B20127l2519Q3368O5061K4468J34344J43574J26358O3724j6171o3044j00323
10080F48967j21294j20296r4596m3965m6111r0430n2945l1495J0431k2627J9250
$$ plain form
10069 54889 46770 28261 55033 54685 80338 139155 198073 196119 201457 263321 327204 292757 277842
10056 277842 320264 344320 264029 180845 141456 130459 174069 104744 1882 33065 90854
10045 90854 76176 47101 72627 105766 151611 143971 122858 152881 142878 48539 54379 67976
10033 67976 44022 -5591 -4753 46360 101742 47155 -13240 11163 8870 29580 191 -37566
10021 -37566 -4393 109910 207247 211728 287085 284913 277328 265550 275790 288291 280419 225652
10009 225652 153989 142497 87634 105730 168280 117569 31453 3359 28188 52052 63286
9998 63286 31874 -1856 -4037 24809 61895 66819 69108 78704 56692 42344 74612 115264 58687
9985 58687 -39479 -75123 -42478 -4301 -26599 -31246 -70016 -115168 -122902 -119704 -147059 -148883 -140588
$$ packed form
10069E4889q119j8509K6772l48K5653N8817N8918j954N338O1864O3883l4447j4915
10056B77842M2422K4056q0291q3184l9389j0997M3610o9325j02862L1183N7789
10045I0854j4678k9075K5526L3139M5845p640k1113L0023j0003r4339N840J3597
10033F7976k3954m9613Q38N1113N5382n4587o0395K4403k293K0710k9389l7757
10021c7566L3173J14303R7337M481P5357k172p585j1778J0240J2501p872n4767
10009B25652p1663j1492n4863J8096O2550n0711q6116k8094K4829K3864J1234
9998F3286l1412l3730k181K8846L7086M924K289R596k2012j4348L2268M0652n6577
9985E8687r8166l5644L2645L8177k2298m647l8770m5152p734L198k7355j824Q295
$$ plain form
9972 -140588 -113084 -82847 -47598 -94924 -119566 -155430 -124873 -64544 1438 24571 13486 -1460
9960 -1460 18794 3566 -54640 -98774 -158222 -158758 -179986 -152928 -111283 -106150 -116943 -118503 -108764
9947 -108764 -90562 -61595 -33697 -16376 -32678 -138006 -155300 -146818 -132134 -128710 -114187 -97969
9935 -97969 -113915 -101993 -65628 -60092 -60809 -78508 -138489 -196532 -107061 -40684 -40193 -37260 -72761
9922 -72761 -54476 -17738 -42899 -34160 -1021 88065 57400 -34965 -44284 -27290 -64059 -31660
9910 -31660 -20835 -60171 -55311 -60624 -13114 -39200 -40305 -40794 -60840 -81865 -113910 -73275 -28436
9897 -28436 -42076 -52302 -63285 -50292 -56850 -66822 -81846 -82217 -112433 -134006 -108568 -77520 -82464
9884 -82464 -58524 -108234 -114870 -61094 -53865 -49583 9933 46131 61012 24487 -7327 -5475 -21663
$$ packed form
9972a40588K7504L0237L5249m7326k4642l5864L0557O0329O5982K3133j1085j4946
9960a460K0254j5228n8206m4134n9448n36k1228K7058M1645N133j0793j560R739
9947a08764J8202K8967K7898J7321j6302j05328j7294Q482J4684L424J4523J6218
9935i7969j5946J1922L6365N536p17j7699n9981n8043Q9471O6377M91K933l5501
9922g2761J8285L6738k5161Q739L3139Q9086l0665r2365r319J6994l6769L2399
9910c1660J0825l9336M860n313M7510k6086j105m89k0046k1025l2045M0635M4839
9897b8436j3640j0226j0983J2993o558r972j5024l71l0216k1573K5438L1048m944
9884h2464K3940m9710o636N3776P229M282N9516L6198J4881l6525l1814J852j6188
$$ plain form
9871 -21663 -11767 33463 50212 26254 56800 52559 92967 80388 -5009 -35026 -26930 -36646 47
9858 47 -3116 -79452 -87395 -89551 -72803 -104469 -86796 -49398 -22401 13912 -194 -24451 24929
9845 24929 26349 -9187 -39671 -17257 -35620 -33159 -110777 -80872 -17892 -20858 -36456 -58557
9833 -58557 -43458 -64814 -32897 3463 28804 9964 82600 130412 132377 121640 131970 132663
9821 132663 132932 139409 131833 166049 163291 158941 200926 217301 201850 221966 278753 276468 262359
9808 262359 303680 399152 437371 406951 359057 336620 393377 475897 495422 508278 562355 574448
9796 574448 565495 549983 591416 617070 610029 590746 546767 531725 559262 574304 604996 522356
9784 522356 480074 495172 539716 525148 545412 580980 651034 642247 611679 567200 532034 541193
$$ packed form
9871b1663R896M5230J6749k3958L0546m241M0408j2579q5397l0017Q096r716L6693
9858D7l163p6336p943k156J6748l1666J7673L7398K6997L6313j4106k4257M9380
9845B4929J420l5536l0484K2414j8363K461p7618K9905O2980k966j5598k2101
9833e8557J5099k1356L1917L6360K5341j8840P2636M7812J965j0737J0330O93
9821A32663K69O477p576L4216k758m350M1985J6375j5451K0116N6787k285j4109
9808B62359M1321R5472L8219l0420m7894k2437N6757Q2520J9525J2856N4077J2093
9796E74448q953j5512M1433K5654p041j9283m3979j5042K7537J5042L0692q2640
9784E22356m2282J5098M4544j4568K0264L5568P0054q787l0568m4479l5166R159
$$ plain form
9772 541193 473885 499684 510253 486125 560943 599733 601405 503889 417943 383139 379041 380840
9760 380840 297475 219922 172786 208766 327976 308166 238349 239377 256345 245784 252211 264510
9748 264510 240974 176156 185211 238381 268971 276021 311847 349871 330728 336398 309299 300440
9736 300440 288604 324470 314855 373779 445760 495765 474566 504163 630058 737797 766889
9725 766889 738559 738813 773609 778896 756723 751350 825312 869534 877749 907716 982687 926437 926522
9712 926522 1022313 1075859 1085432 1114062 1095868 1071404 1092299 1081269 1049655 1096653 1117816 1018404
9700 1018404 968987 1003572 1034757 1037724 1049236 1020546 1054126 1071861 1022468 938962 900588 882826
9688 882826 843684 829834 861795 817283 782475 851644 825788 769689 760414 728563 664814 587453
$$ packed form
9772E41193o7308K5799J0569k4128P4818L8790J672r7516q5946l4804m098J799
9760C80840q3365p7553m7136L5980J19210j9810o9817J028J6968j0561O427J2299
9748B64510k3536o4818R055N3170L0590P050L5826L8024j9143N670k7099q859
9736C00440j1836L5866r615N8924P1981N0005k1199K9597J25895J07739K9092
9725G66889k8330K54L4796N287k2173n373P3962M4222Q215K9967P4971n6250Q5
9712I26522R5791N3546R573K8630j8194k4464K0895j1030l1614M6998K1163r9412
9700A018404m9417L4585L1185K967J1512k8690L3580J7735m9393q3506l8374j7762
9688H82826l9142j3850L1961m4512l4808O9169k5856n6099r275l1851o3749p7361
$$ plain form
9676 587453 547340 534545 530496 410243 393517 418275 455070 495553 429140 342502 341101 356640
9664 356640 336923 283126 202734 159596 183514 276240 302328 269671 302741 298333 247687 245468
9652 245468 223325 204025 179555 190124 166369 163690 190944 193095 220047 214456 200118 182262
9640 182262 175438 175636 214275 221778 229690 266626 305898 334520 358737 358333 366011 442658 483390
9627 483390 437406 432629 379614 374698 288098 280100 344184 347461 403927 386668 292762 227229
9615 227229 232115 270375 312666 325439 304473 264732 288918 311440 276567 242993 194186 198952
9603 198952 267532 275159 282720 351235 361935 360876 354123 339878 357864 352984 300640 280036 298587
9590 298587 315444 307747 346776 357817 306259 261319 264254 297982 394145 430723 388432 368390
$$ packed form
9676E87453m0113j2795m049j20253j6726K4758L6795M0483o6413q6638j401J5539
9664C56640j9717n3797q0392m3138K3918R2726K6088l2657L3070m408n0646k219
9652B45468k2143j9300k4470J0569k3755k679K7254K151K6952n591j4338j7856
9640A82262o824J98L8639P503P912L6936L9272K8622K4217m04P678P6647M0732
9627D83390m5984m777n3015m916q6600p998O4084L277N6466j7259r3906o5533
9615B27229M886L8260M2291J2773k0966l9741K4186K2522l4873l3574m8807M766
9603A98952O8580P627P561O8515J0700j059o753j4245J7986m880n2344k0604J8551
9590B98587J6857p697L9029J1041n1558m4940K935L3728R6163L6578m2291k0042
$$ plain form
9578 368390 329679 309535 344851 424907 500829 516959 483914 478429 479800 531107 583606 572093
9566 572093 635432 703084 739043 744960 755160 792546 878764 983122 1060535 1096112 1120872 1066575
9554 1066575 969635 894866 816586 791988 765191 730826 705535 660137 707499 684041 672933
9543 672933 717136 739140 759474 746534 753231 805388 864895 919578 865871 888547 984400 1105052
9531 1105052 1216178 1325177 1367394 1364234 1282604 1209083 1098489 991873 967853 941374 917764
9520 917764 851549 818303 844831 853786 847310 778050 765882 767082 765298 719337 737793 752422
9508 752422 737244 717216 747643 799187 834844 822356 848419 905299 889822 816600 846345 860626
9496 860626 853502 910606 986267 1029449 1107520 1261368 1410848 1584102 1775351 1944665 1974831
$$ packed form
9578C68390l8711k0144L5316Q0056P5922J6130l3045n485J371N1307N2499j1513
9566E72093O3339O7652L5959N917J0200L7386Q6218J04358P7413L5577K4760n4297
9554A066575r6940p4769p8280k4598k6797l4365k5291m5398M7362k3458j1108
9543F72933M4203K2004K0334j2940O697N2157N9507N4683n3707K2676R5853J20652
9531A105052J11126J08999M2217l160q1630p3521j10594j06616k4020k6479k3610
9520I17764o6215l3246K6528Q955o476o9260j2168J200j784m5961J8456J4629
9508G52422j5178k0028L0427N1544L5657j2488K6063N6880j5477p3222K9745J4281
9496H60626p124N7104P5661M3182P8071J53848J49480J73254J91249J69314L0166
$$ plain form
9485 1974831 1903173 1754781 1586388 1445343 1391311 1340103 1316768 1321186 1342167 1397073 1424190
9474 1424190 1461320 1440926 1478272 1497911 1497400 1510858 1550624 1590352 1635489 1731788 1859789 1980126
9462 1980126 2173419 2401599 2650698 2736777 2727206 2649241 2561072 2489196 2435162 2418834 2376394
9451 2376394 2383594 2427593 2455035 2566480 2665841 2744167 2857557 2950138 2975422 3052895 3110154
9440 3110154 3203734 3329241 3527327 3756784 3935152 4178383 4426646 4677751 4999437 5364076
9430 5364076 5751342 6287465 7054239 7969425 9113210 10557945 12379255 14530588 17006500
9421 17006500 19895429 23181682 26579124 29910521 32928411 35403356 37272078 38771260
9413 38771260 40319420 42158731 44465334 47266020 50415878 53313733 55832308 58344796
$$ packed form
9485A974831p1658j48392j68393j41045n4032n1208k3335M418K0981N4906K7117
9474A424190L7130k0394L7346J9639n11J3458L9766L9728M5137R6299J28001J20337
9462A980126J93293K28180K49099Q6079r571p7965q8169p1876n4034j6328m2440
9451B376394P200M3999K7442J11445R9361P8326J13390R2581K5284P7473N7259
9440C110154R3580J25507J98086K29457J78368K43231K48263K51105L21686L64639
9430E364076L87266N36123P66774R15186J143785J444735J821310K151333K475912
9421A7006500K888929L286253L397442L331397L017890K474945J868722J499182
9413C8771260J548160J839311K306603K800686L149858K897855K518575K512488
$$ plain form
9405 58344796 61492357 65668892 70970979 76895627 82737832 87977870 92078672 94785455
9397 94785455 96590604 98180753 100170183 103139361 107316623 111842216 115359073 116932754
9389 116932754 116720535 115392862 113427728 111496017 110072577 109086146 108302378 107843724 107614594
9380 107614594 107582688 108202387 109967653 112777327 116245841 119998013 123112685 124402916
9372 124402916 123446599 120877728 117034542 112151607 107268951 103423415 100664898 98513390
9364 98513390 96179689 93143718 89558539 85798486 82206034 78716452 75047908 71241807
9356 71241807 67532612 63832935 60057586 56698695 53953720 51854024 50393089 49689626
9348 49689626 49411138 48910091 47988899 46792950 45377115 43634627 41880759 40714958 40937459
$$ packed form
9405E8344796L147561M176535N302087N924648N842205N240038M100802K706783
9397I4785455J805149J590149J989430K969178M177262M525593L516857J573681
9389A16932754k12219j327673j965134j931711j423440r86431p83768m58654k29130
9380A07614594l1906O19699J765266K809674L468514L752172L114672J290231
9372A24402916r56317k568871l843186m882935m882656l845536k758517k151508
9364I8513390k333701l035971l585179l760053l592452l489582l668544l806101
9356G1241807l709195l699677l775349l358891k744975k099696j460935p03463
9348D9689626k78488n01047r21192j195949j415835j742488j753868j165801K22501
$$ plain form
9339 40937459 43131192 47294617 52694823 58158958 62961678 67140941 70421974 72517044
9331 72517044 74035651 75804047 78205290 81414317 85929026 91581694 97693516 103680878
9323 103680878 109753194 116031027 122219336 128405968 134799151 141244917 147438114 152980213
9315 152980213 157439623 161208516 165636568 171925058 180328635 189580345 198260174 205632364
9307 205632364 210479721 211587903 209267244 204652417 198770704 192866518 188236818 185697181
9299 185697181 184818865 184858159 185382970 186459894 188028181 190105159 192870360 196110757 198844337
9290 198844337 199939120 198398906 194121768 188249520 182399235 177640259 174267689 171899390
9282 171899390 170052027 167617860 163223239 156738138 148906551 140319113 131490163 123031267
$$ packed form
9339D0937459K193733M163425N400206N464135M802720M179263L281033K095070
9331G2517044J518607J768396K401243L209027M514709N652668O111822N987362
9323A03680878O072316O277833O188309O186632O393183O445766O193197N542099
9315A52980213M459410L768893M428052O288490Q403577R251710Q679829P372190
9307B05632364M847357J108182k320659m614827n881713n904186m629700k539637
9299A85697181q78316L9294N24811J076924J568287K076978K765201L240397K733580
9290A98844337J094783j540214m277138n872248n850285m758976l372570k368299
9282A71899390j847363k434167m394621o485101p831587q587438q828950q458896
$$ plain form
9274 123031267 115482128 108657190 101993082 95330336 88931199 83166962 78374034 74877412
9266 74877412 72474142 70521572 68198534 64958223 60792440 55891969 50396697 44726109
9258 44726109 39335708 34316424 29778594 25794295 22472728 19629405 17305768 15465565
9250 15465565 13971025 12710120 11720125 10862891 10068385 9375449 8764679 8266544 7764248
9241 7764248 7284850 6798703 6376268 6061443 5779267 5530164 5325675 5090865 4898453 4745982
9231 4745982 4582456 4418422 4241314 4090404 3955149 3847871 3732794 3669738 3597307 3545630
9221 3545630 3453629 3450725 3419257 3361953 3304311 3243616 3249081 3230713 3150164 3155485 3189446 3259719
9209 3259719 3324135 3212775 3119075 3127224 3159289 3221078 3243317 3243391 3273353 3311192 3335511 3331980
$$ packed form
9274A23031267p549139o824938o664108o662746o399137n764237m792928l496622
9266G4877412k403270j952570k323038l240311m165783m900471n495272n670588
9258D4726109n390401n019284m537830l984299l321567k843323k323637j840203
9250A5465565j494540j260905r89995q57234p94506o92936o10770m98135n02296
9241G764248m79398m86147m22435l14825k82176k49103k04489k34810j92412j52471
9231D745982j63526j64034j77108j50910j35255j07278j15077o3056p2431n1677
9221C545630r2001k904l1468n7304n7642o0695N465j8368q0549N321L3961P0273
9209C259719O4416j11360r3700Q149L2065O1789K2239P4K9962L7839K4319l531
$$ plain form
9197 3331980 3333905 3342420 3355748 3304897 3253383 3245771 3252586 3261455 3271580 3313569 3402924 3534015
9185 3534015 3630514 3759675 3874473 3919278 3961438 4036685 4157658 4319585 4536916 4782355
9175 4782355 5088906 5417149 5787301 6269870 6911951 7626312 8381848 9169920 10003125 11042167
9165 11042167 12242602 13772035 15792444 18529344 22145778 27030714 33424491 41559461
9157 41559461 51646048 63828343 77477030 90534145 100029356 103622626 101361151 94638308
9149 94638308 85191263 74885782 65107867 56420131 48933312 42761277 37820918 33801380
9141 33801380 30744100 28525675 27111553 26418170 26520092 27431585 29184961 31977134 36058230
9132 36058230 41595357 48790700 57543321 67752157 79420917 91576225 101166666 104833971
$$ packed form
9197C331980J925Q515J3328n0851n1514p612O815Q869J0125M1989Q9355J31091
9185C534015R6499J29161J14798M4805M2160P5247J20973J61927K17331K45439
9175D782355L06551L28243L70152M82569O42081P14361P55536P88072Q33205J039042
9165A1042167J200435J529433K020409K736900L616434M884936O393777Q134970
9157D1559461J0086587J2182295J3648687J3057115R495211L593270k261475o722843
9149I4638308r447045j0305481r777915q687736p486819o172035m940359m019538
9141C3801380l057280k218425j414122o93383J01922R11493J753376K792173M081096
9132C6058230N537127P195343Q752621J0208836J1668760J2155308R590441L667305
$$ plain form
9124 104833971 101971163 94721953 85578698 76449651 68262639 61111663 54405468 47755070
9116 47755070 41419635 35640426 30754811 26835730 23852539 21635663 20063849 19007300
9108 19007300 18316083 17857618 17545848 17319469 17245084 17303338 17537723 17980822 18629330 19485009
9098 19485009 20528248 21694272 23085816 24927099 27400211 30715922 35249100 41411911
9090 41411911 49716784 60727265 74700861 91711342 111740809 134253550 157241517
9083 157241517 176200276 186005452 185012295 175806917 161990302 146871692 132895241 121090520
9075 121090520 111272766 103076361 96870554 93090454 92077896 93921282 97918101 102447868
9067 102447868 105068213 104323675 101342328 98054761 96162171 96960252 101644225 110759873
$$ packed form
9124A04833971k862808p249210r143255r129047q187012p150976o706195o650398
9116D7755070o335435n779209m885615l919081k983191k216876j571814j056549
9108A9007300o91217m58465l11770k26379p4385N8254K34385M43099O48508Q55679
9098A9485009J043239J166024J391544J841283K473112L315711M533178O162811
9090D1411911Q304873J1010481J3973596J7010481K0029467K2512741K2987967
9083A57241517J8958759R805176r93157r205378j3816615j5118610j3976451j1804721
9075A21090520r817754q196405o205807l780100j012558J843386L996819M529767
9067A02447868K620345p44538k981347l287567j892590P98081M683973R115648
$$ plain form
9059 110759873 124498727 142847464 164667313 185975564 200341739 203142516 195350536
9052 195350536 181109428 164077725 147200790 132177909 119204546 107843853 98057807
9045 98057807 90188038 84582073 81445935 80709616 81313536 81575715 79845366 75767033 70232628
9036 70232628 63897569 57185157 50540178 44499693 39261798 34996338 31675423 29218103
9028 29218103 27461164 26253432 25494278 25145492 25331493 26032966 27379921 29410101 32395403
9019 32395403 36608887 42238926 49310525 57586225 67067121 77388232 87123455 94037410
9011 94037410 96436651 94791516 90921109 86647309 83397356 81818803 81809936 82896569 84678099
9002 84678099 87699014 92894374 100940088 111787750 123758579 133003603 135435685 130514229
$$ packed form
9059A10759873J3738854J8348737K1819849K1308251J4366175K800777p791980
9052A95350536j4241108j7031703j6876935j5022881j2973363j1360693r786046
9045I8057807p869769n605965l136138p36319O03920K62179j730349m078333n534405
9036G0232628o335059o712412o644979o040485n237895m265460l320915k457320
9028B9218103j756939j207732p59154l48786J86001P01473J346955K030180K985302
9019C2395403M213484N630039P071599Q275700R480896J0321111R735223O913955
9011I4037410K399241j645135l870407m273800l249953j578553q867J086633J781530
9002H4678099L020915N195360Q045714J0847662J1970829R245024K432082m921456
$$ plain form
8994 130514229 121154655 110289865 99890422 91427370 86040857 84293930 86439431 92325216
8986 92325216 101079896 110363470 116446669 116918412 112624764 105680729 97940622 91096683
8978 91096683 86161738 83300761 82266215 82952542 85615936 90695860 98204025 107120815
8970 107120815 115355356 119563574 117183365 109039409 97621314 84846846 72126697 60449386
8962 60449386 50452549 42267851 35754009 30636513 26641827 23564453 21175466 19336383
8954 19336383 17873439 16673187 15732050 14868877 14129512 13481364 12863437 12446933 12104197
8945 12104197 11791446 11545017 11446451 11435013 11458156 11622082 12019450 12761769 13922112 15745097
8935 15745097 18333717 21466627 24763156 27989850 31176670 34868053 39498453 45059583
$$ packed form
8994A30514229r359574j0864790j0399443q463052n386513j746927K145501N885785
8986I2325216Q754680R283574O083199M71743m293648o944035p740107o843939
8978I1096683m934945k860977j034546O86327K663394N079924P508165Q916790
8970A07120815Q234541M208218k380209q143956j1418095j2774468j2720149j1677311
8962F0449386r996837q184698o513842n117496l994686l077374k388987j839083
8954A9336383j462944j200252r41137q63173p39365o48148o17927m16504l42736
8945A2104197l12751k46429r8566j1438K3143J63926L97368P42319J160343J822985
8935A5745097K588620L132910L296529L226694L186820L691383M630400N561130
$$ plain form
8927 45059583 51063944 55698188 56770387 54203891 49397270 43479241 37353507 31708590
8919 31708590 26911298 23156330 20246208 18010761 16430090 15320095 14635501 14336421
8911 14336421 14454746 15019357 15895322 17203480 19008976 21438515 24437881 28059620 32534085
8902 32534085 37820509 43602557 49218699 53569327 55246754 53269343 48451305 42351059
8894 42351059 35984921 30013690 24855575 20583052 17192083 14547855 12528452 11044257
8886 11044257 9849291 8887866 8132949 7540538 7046434 6700977 6372325 5967531 5507205
8877 5507205 5069156 4646625 4358374 4117289 3895072 3722407 3585592 3458791 3287069 3127307
8867 3127307 2984843 2852149 2731955 2603293 2503370 2391379 2352255 2248552 2103429 1942526
$$ packed form
8927D5059583O004361M634244J072199k566496m806621n918029o125734n644917
8919C1708590m797292l754968k910122k235447j580671j109995o84594k99080
8911A4336421J18325N64611Q75965J308158J805496K429539K999366L621739M474465
8902C2534085N286424N782048N616142M350628J677427j977411m818038o100246
8894D2351059o366138n971231n158115m272523l390969k644228k019403j484195
8886A1044257j194966r61425p54917n92411m94104l45457l28652m04794m60326
8877E507205m38049m22531k88251k41085k22217j72665j36815j26801j71722j59762
8867C127307j42464j32694j20194j28662r9923j11991l9124j03703j45123j60903
$$ plain form
8857 1942526 1803888 1717645 1662033 1610145 1548591 1473303 1423396 1391282 1311937 1307618 1234444
8846 1234444 1163569 1138576 1089465 994708 943606 898764 835180 852989 898709 885449 830456
8835 830456 777952 763241 792092 758186 766344 824864 824906 742828 670115 702776 702215 702486 688972
8822 688972 624441 611473 674125 680086 656839 615766 688450 731959 713778 680917 723973 736691
8810 736691 707194 641168 648030 643563 626082 597559 624580 599833 596444 635075 600416 570384
8798 570384 557327 576211 551045 597982 587144 593032 570898 612985 627021 630566 558417 512621
8786 512621 479228 462156 455068 466553 458160 417417 379406 390278 399500 361669 397028 398589
8774 398589 415894 447290 384885 338581 318204 366809 410767 398951 419691 447121 456483 450848
$$ packed form
8857A942526j38638q6243n5612n1888o1554p5288m9907l2114p9345m319p3174
8846A234444p0875k4993m9111r4757n1102m4842o3584J7809M5720j3260n4993
8835H30456n2504j4711K8851l3906Q158N8520M2q2078p2713L2661n61K71j3514
8822F88972o4531j2968O2652N961k3247m1073P2684M3509j8181l2861M3056J2718
8810G36691k9497o6026O862m467j7481k8523K7021k4747l389L8631l4659l0032
8798E70384j3057J8884k5166M6937j0838N888k2134M2087J4036L545p2149m5796
8786E12621l3393j7072p088J1485q393m0743l8011J0872R222l7831L5359J561
8774C98589J7305L1396o2405m6304k0377M8605M3958j1816K0740K7430R362n635
$$ plain form
8762 450848 431800 412432 393142 380286 434245 434617 448887 435989 390026 384495 374459 364110
8750 364110 382757 472518 555422 620067 621994 687734 726081 730547 816023 910249 907264 859859
8738 859859 799930 768167 677073 600496 599022 530042 482307 494972 476181 488833 551336 594860
8726 594860 599684 566531 532692 469429 459908 409997 396062 502913 591294 667471 772996 847387
8714 847387 888375 933452 947186 822059 714659 603458 573935 567425 511043 481852 387901
8703 387901 316233 360238 393694 342885 334365 326434 272793 313413 378000 381448 379773 369356
8691 369356 360565 374825 387761 355094 345266 366690 387264 430643 424546 397311 389709 454969
8679 454969 469435 462413 553971 666252 720386 819028 960720 1062837 1151981 1215902 1108793
$$ packed form
8762D50848j9048j9368j9290j2856N3959L72J4270j2898m5963n531j0036j0349
8750C64110J8647Q9761Q2904O4645J927O5740L8347M466Q5476R4226k985m7405
8738H59859n9929l1763r1094p6577j474o8980m7735J2665j8791J2652O2503M3524
8726E94860M824l3153l3839o3263r521m9911j3935J06851Q8381P6177J05525P4391
8714H47387M0988M5077J3734j25127j07400j11201k9523o510n6382k9191r3951
8703C87901p1668M4005L3456n0809q520p931n3641M0620O4587L448j675j0417
8691C69356q791J4260J2936l2667r828K1424K0574M3379o097k7235p602O5260
8679D54969J4466p022R1558J12281N4134R8642J41692J02117Q9144O3921j07109
$$ plain form
8668 1108793 1029820 922383 823716 773723 722780 687013 649185 657196 711516 752751 741057
8657 741057 792172 814697 791211 745595 671844 637958 664168 706720 711853 754693 757432 902500
8645 902500 1127577 1235609 1269863 1265309 1229337 1105896 924744 806920 722865 668784 658804
8634 658804 666257 649046 656427 656629 689715 683744 607237 557851 548765 498616 451884 401150 347717
8621 347717 357420 373883 318140 267260 242060 255694 249441 256232 273499 290596 280723 303190
8609 303190 343136 355787 414221 465277 496246 509143 514300 560440 611573 661142 656152 619780
8597 619780 584337 545596 491592 478648 551410 639152 663069 683953 831468 945012 1012517
8586 1012517 1020075 983495 874398 741058 633767 637878 593828 545883 537526 565971 657521
$$ packed form
8668A108793p8973j07437r8667m9993n0943l5767l7828Q011N4320M1235j1694
8657G41057N1115K2525k3486m5616p3751l3886K6210M2552N133M2840K739J45068
8645I02500K25077J08032L4254m554l5972j23441j81152j17824q4055n4081r980
8634F58804P453j7211P381K02L3086n971p6507m9386r086n0149m6732n0734n3433
8621C47717R703J6463n5743n0880k5200J3634o253O791J7267J7097r873K2467
8609C03190L9946J2651N8434N1056L0969J2897N157M6140N1133M9569m990l6372
8597F19780l5443l8741n4004j2944P2762Q7742K3917K0884J47515J13544O7505
8586A012517P558l6580j09097j33340j07291M111m4050m7945q357K8445R1550
$$ plain form
8575 657521 731627 752637 799151 841546 828490 733458 637937 614093 621280 650047 661150 665172
8563 665172 669440 668222 755045 818152 881740 899486 910879 872309 749885 696440 686154 669432
8551 669432 601452 519099 458060 438209 413148 401625 346871 279992 245836 269402 262914 189463
8539 189463 145454 153271 160421 131583 182639 206479 224476 207098 206272 229420 197875 183694
8527 183694 237617 249641 297784 283296 265616 252286 262752 260741 305412 406690 513907
8516 513907 545978 600377 596378 597414 571615 502747 478675 373635 290573 233663 225436 231317
8504 231317 215481 212354 250535 235585 201424 182155 164068 239034 279739 269440 224940 245117
8492 245117 272679 334644 423137 395371 371403 388489 392013 379838 327090 244364 196359 154730
$$ packed form
8575F57521P4106K1010M6514M2395j3056r5032r5521k3844P187K8767J1103M022
8563F65172M268j218Q6823O3107O3588J7746J1393l8570j22424n3445j0286j6722
8551F69432o7980q2353o1039j9851k5061j1523n4754o6879l4156K3566o488p3451
8539A89463m4009P817P150k8838N1056K3840J7997j7378q26K3148l1545j4181
8527A83694N3923J2024M8143j4488j7680j3330J0466k011M4671J01278J07217
8516E13907L2071N4399l999J036k5799o8868k4072j05040q3062n6910q227N881
8504B31317j5836l127L8181j4950l4161j9269j8087P4966M0705j0299m4500K0177
8492B45117K7562O1965Q8493k7766k3968J7086L524j2175n2748q2726m8005m1629
$$ plain form
8480 154730 125183 128413 148056 153004 149031 131778 93912 50168 60349 61010 9391 177 12755
8467 12755 -35240 -51284 -44568 -18057 -7532 -20045 4415 -13849 -8917 10600 42958 74424
8455 74424 37600 71414 139092 158105 187433 147019 118577 100274 135639 180349 192148 130818
8443 130818 80869 32316 78196 110195 83706 57062 -1003 26145 83671 100463 86705 92420
8431 92420 95321 75052 67687 23391 -5956 7503 25605 55426 88149 96646 38022 26991
8419 26991 64384 47035 7887 18031 13426 10904 63022 91712 97629 138362 173367 148494
8407 148494 91548 57234 7402 43688 83186 103809 99465 102783 72782 66786 107144 115728
8395 115728 98499 79830 65020 31664 -32562 -5469 16246 82683 123489 69987 62055 67113
$$ packed form
8480A54730k9547L230J9643M948l973j7253l7866m3744J0181O61n1619r214J2578
8467A2755m7995j6044O716K6511J0525j2513K4460j8264M932J9517L2358L1466
8455G4424l6824L3814O7678J9013K9328m0414k8442j8303L5365M4710J1799o1330
8443A30818m9949m8553M5880L1999k6489k6644n8065K7148N7526J6792j3758N715
8431I2420K901k0269p365m4296k9347J3459J8102K9821L2723Q497n8624j1031
8419B6991L7393j7349l9148J0144m605k522N2118K8690N917M0733L5005k4873
8407A48494n6946l4314m9832L6286L9498K0623m344L318l0001n996M0358Q584
8395A15728j7229j8669j4810l3356o4226K7093K1715O6437M0806n3502p932N058
$$ plain form
8383 67113 139023 122250 30798 80432 145684 77008 38782 56599 82893 74117 32746 29992
8371 29992 15244 17797 50864 3257 23757 35186 44115 36387 -44744 -75718 -81456 -64981 1332
8358 1332 11181 -37398 -83405 -96618 -24242 44931 53070 -1644 22736 105598 107068 86473 79063
8345 79063 127044 139046 54283 10496 5105 56947 58505 71824 40671 34855 62753 65537 17127
8332 17127 40668 91457 63232 18068 54684 50644 41328 18328 36778 18751 -25309 -70953
8320 -70953 -73708 -82337 -42430 60181 38673 50855 41735 54304 56832 61997 31614 21424 76137
8307 76137 55807 79735 90535 50590 31712 90210 56664 79108 77297 47943 33923 -33212
8295 -33212 -72276 -58937 -37418 23345 95415 67418 27442 15921 31424 41359 3037 -3184
$$ packed form
8383F7113P1910j6773r1452M9634O5252o8676l8226J7817K6294q776m1371k754
8371B9992j4748K553L3067m7607K0500J1429Q929p728q1131l0974n738J6475O6313
8358A332R849m8579m6007j3213P2376O9173Q139n4714K4380Q2862J470k0595p410
8345G9063M7981J2002q4763m3787n391N1842J558J3319l1153n816K7898K784m8410
8332A7127K3541N0789k8225m5164L6616m040r316k3000J8450j8027m4060m5644
8320g0953k755q629L9907J02611k1508J2182r120J2569K528N165l0383j0190N4713
8307G6137k0330K3928J0800l9945j8878N8498l3546K2444j811k9354j4020o7135
8295c3212l9064J3339K1519O0763P2070k7997l9976j1521J5503R935l8322o221
$$ plain form
8283 -3184 124884 152534 87307 29010 28177 -2403 -49432 -43762 2136 30523 82716 19814
8271 19814 10355 6090 -13215 -12543 -71996 -92245 -65956 -26431 -28018 -31926 -44177 -40629 -54946
8258 -54946 -49402 26827 33976 55853 29315 14072 11669 2152 -798 4460 -2988 31763 41896
8245 41896 26693 33929 -3111 -23206 4818 56116 56148 58332 30081 29422 18994 5705 30523
8232 30523 21473 42316 93860 134745 154680 175306 153266 167475 145158 94890 84902 -1328
8220 -1328 -1521 14637 40151 61904 79885 126823 128102 151018 156680 141847 175596 209152 243786
8207 243786 268573 286037 305205 368245 408294 384366 362398 376526 368235 297169 242304 204925
8195 204925 186856 249923 229535 237115 245841 247603 275674 268852 311879 377105 443790 484011
$$ packed form
8283c184J28068K7650o5227n8297q33l0580m7029N670M5898K8387N2193o2902
8271A9814r459m265j9305O72n9453k0249K6289L9525j587l908j2251L548j4317
8258e4946N544P6229P149K1877k6538j5243k403r517k950N258p448L4751J0133
8245D1896j5203P236l7040k0095K8024N1298L2K184k8251o59j0428j3289K4818
8232C0523r050K0843N1544M0885J9935K0626k2040J4209k2317n0268r988q6230
8220a328j93J6158K5514K1753J7981M6938J279K2916N662j4833L3749L3556L4634
8207B43786K4787J7464J9168O3040M0049k3928k1968J4128q291p1066n4865l7379
8195B04925j8069O3067k0388P580Q726J762K8071o822M3027O5226O6685M0221
$$ plain form
8183 484011 506752 487559 436716 385884 362576 315394 222268 123797 74061 13543 10213 15370
8171 15370 -19178 -17673 60491 82965 72951 117971 173626 144614 82071 66163 120192 183861
8159 183861 136386 128747 88104 35202 -9346 -13184 -25754 -38635 22247 54641 76963 61460
8147 61460 -36720 -128140 -109877 -81365 -64374 -8795 -10166 -23816 -29779 -1712 -11368 -38750
8135 -38750 -41829 -3514 -34869 -22308 2440 31097 12065 23537 9174 3770 44693 87122
8123 87122 114733 73614 62417 63995 18467 9188 14598 55091 41211 13292 2368 134 -691
8110 -691 1689 17849 39949 1530 11312 63075 49323 3886 250 -19063 -40811 -77244 -108701
8097 -108701 -140101 -89672 -65012 -37507 984 10698 16873 37948 -14584 -29721 -12574 -10603
$$ packed form
8183D84011K2741j9193n0843n0832k3308m7182r3126r8471m9736o0518l330N157
8171A5370l4548J505P8164K2474j0014M5020N5655k9012o2543j5908N4029O3669
8159A83861m7475p639m0643n2902m4548l838j2570j2881O0882L2394K2322j5503
8147F1460r8180r1420J8263K8512J6991N5579j371j3650n963K8067r656k7382
8135c8750l079L8315l1355J2561K4748K8657j9032J1472j4363n404M0923M2429
8123H7122K7611m1119j1197J578m5528r279N410M0493j3880k7919j0924k234q25
8110f91K380J6160K2100l8419R782N1763j3752m5437l636j9313k1748l6433l1457
8097a08701l1400N0429K4660K7505L8491R714O175K1075n2532j5137J7147J971
$$ plain form
8085 -10603 -48112 -1466 57974 89655 21935 -13094 45973 71950 44934 16686 26462 9703
8073 9703 -6475 -49965 -56332 -26801 -63481 -25291 897 -8904 -10402 -19601 -53670 -55619 -29899
8060 -29899 -51728 -93116 -105323 -107494 -102482 -93694 -19742 61812 40255 -26609 -72249 -33211
8048 -33211 -3433 23015 20206 24417 27490 1943 -10594 14829 -29001 -27590 -38262 -79033 -10657
8035 -10657 29044 14186 -49046 -51418 -39515 -64410 -129887 -144620 -99778 -70823 -38960 -28909
8023 -28909 -32947 -28054 -15155 -53991 -56777 -7608 -23698 -46832 -64706 -67064 -89624 -16444 58410
8010 58410 16820 -49772 -5525 47048 26274 2322 26838 4854 -38782 6322 -4189 -73553
7998 -73553 -90358 -76854 -36568 -1621 -15865 -22522 -38301 -49908 -54940 -59785 -63252 -58404 -3867
$$ packed form
8085a0603l7509M6646N9440L1681o7720l5029N9067K5977k7016k8248R776j6759
8073I703j6178m3490o367K9531l6680L8190K6188r801j498r199l4069j949K5720
8060b9899k1829m1388j2207k171N012Q788P3952Q1554k1557o6864m5640L9038
8048c3211K9778K6448k809M211L073k5547j2537K5423m3830J411j0672m0771O8376
8035a0657L9701j4858o3232k372J1903k4895o5477j4733M4842K8955L1863J0051
8023b8909m038M893J2899l8836k786M9169j6090k3134j7874k358k2560P3180P4854
8010E8410m1590o6592M4247N2573k0774k3952K4516k1984m3636M5104j0511o9364
7998g3553j6805J3504M0286L4947j4244o657j5779j1607n032m845l467M848N4537
$$ plain form
7985 -3867 26345 -16730 -35061 -9299 -33644 -65311 -143935 -127535 -91755 -36865 -40268 -35631
7973 -35631 9224 -3656 5382 -14166 -28807 -6599 -6897 978 31057 22569 45751 65293 52882
7960 52882 4506 -37603 -90648 -132594 -101562 -30424 44407 33606 1800 2191 -7470 -9929 -9826
7947 -9826 -23062 5645 -3394 -50604 -94631 -46093 -33970 -52531 -104626 -127041 -88298 -64005
7935 -64005 -60815 -48723 -31179 -76924 -28560 -37993 -80566 -75894 -108630 -126947 -56744 -9435
7923 -9435 -16066 -19107 5112 16758 -423 10669 42854 41878 -1081 -5619 -2518 44859 24631
7910 24631 -9463 -36079 -125490 -102901 -44719 -10025 -1876 -38689 -44497 -63433 -45295 -12392
7898 -12392 24995 31036 -13422 -38674 5837 44417 19736 16086 7812 -41980 -37083 -42048 -48915
$$ packed form
7985c867L0212m3075j8331K5762k4345l1667p8624J6400L5780N4890l403M637
7973c5631M4855j2880R038j9548j4641K2208k98P875L0079q488K3182J9542j2411
7960E2882m8376m2109n3045m1946L1032P1138P4831j0801l1806L91r661k459J03
7947i826j3236K8707r039m7210m4027M8538J2123j8561n2095k2415L8743K4293
7935f4005L190J2092J7544m5745M8364r433m2573M672l2736j8317P0203M7309
7923i435o631l041K4219J1646j7181J1092L2185r76m2959m538L101M7377k0228
7910B4631l4094k6616q9411K2589N8182L4694Q149l6813n808j8936J8138L2903
7898a2392L7387O041m4458k5252M4511L8580k4681l650q274m9792M897m965o867
$$ plain form
7885 -48915 -85270 -103649 -70129 -29250 -39776 -93874 -108839 -85871 -28676 4400 -47891 -29628
7873 -29628 12681 -3730 -24794 -64164 -56799 -4850 30742 20932 -22116 -68377 -112688 -117942
7861 -117942 -74905 -41158 -78382 -46421 1945 -24386 -83497 -100393 -57867 -1891 -32179 -39271
7849 -39271 -40308 -91933 -58491 -20505 -14798 -39668 -43119 -62888 -32224 -20637 -34665 -28935 -29808
7836 -29808 -16693 3793 13155 -26404 -16666 -13659 -38624 -10780 -27649 -94935 -115523 -68587
7824 -68587 -50607 -78759 -42668 -50439 -55896 -49870 -35293 31092 63477 36197 14057 40948
7812 40948 32873 33960 17060 8484 -5575 -8414 46688 80446 -15160 -112716 -92436 -81161 -47308
7799 -47308 -33376 -15405 20700 -3250 -21124 26517 16239 32353 -27376 -7909 -53794 -75353
$$ packed form
7885d8915l6355j8379L3520M0879j0526n4098j4965K2968N7195L3076n2291J8263
7873b9628M2309j6411k1064l9370P365N1949L5592r810m3048m6261m4311n254
7861a17942M3037L3747l7224L1961M8366k6331n9111j6896M2526N5976l0288p092
7849c9271j037n1625L3442L7986N707k4870l451j9769L0664J1587j4028N730q73
7836b9808J3115K0486R362l9559R738L007k4965K7844j6869o7286k0588M6936
7824f8587J7980k8152L6091p771n457O026J4577O6385L2385k7280k2140K6891
7812D0948q075J087j6900q576j4059k839N5102L3758r5606r7556K0280J1275L3853
7799d7308J3932J7971L6105k3950j7874M7641j0278J6114n9729J9467m5885k1559
$$ plain form
7787 -75353 6881 37455 42545 28695 14958 20436 25802 -15845 -22284 -21226 -20282 -21592 -48617
7774 -48617 -43193 33024 38483 45963 50413 80134 19196 10554 53438 80183 70235 100390 130890
7761 130890 185825 225107 234389 207333 152417 120408 100727 63290 65918 39999 15840 33641
7749 33641 45180 72494 99433 104171 160441 172270 175814 236506 298336 375050 448798 516860
7737 516860 471291 386745 385526 358779 345805 305647 282220 227644 168341 120906 121823 153051
7725 153051 166911 217836 356834 406044 417429 395381 419296 466965 411539 318814 244452
7714 244452 245280 241131 255007 196685 150616 89669 105476 85981 34101 -40456 34687 101241
7702 101241 77809 79223 102755 90827 131887 99744 91553 106775 125027 133259 173259 157948
$$ packed form
7787g5353Q2234L0574N090j3850j3737N478N366m1647o439J058R44j310k7025
7774d8617N424P6217N459P480M450K9721o0938q642M2884K6745r948L0155L0500
7761A30890N4935L9282R282k7056n4916l2009j9681l7437K628k5919k4159J7801
7749C3641J1539K7314K6939M738N6270J1829L544O0692O1830P6714P3748O8062
7737E16860m5569q4546j219k6747j2974m0158k3427n4576n9303m7435R17L1228
7725A53051J3860N0925J38998M9210J1385k2048K3915M7669n5426r2725p4362
7714B44452Q28m149J3876n8322m6069o0947J5807j9495n1880p4557P5143O6554
7702A01241k3432J414K3532j1928M1060l2143q191J5222J8252Q232M0000j5311
$$ plain form
7690 157948 116146 106193 100212 84658 68839 89263 120625 149056 99676 60161 65505 57372
7678 57372 -1611 -8371 7175 18907 49031 97797 103754 46468 -22205 -102931 -89553 -83928
7666 -83928 -59158 -79202 -86268 -84828 -41704 -57214 -53343 -28099 -8573 -52227 -50880 -82414 -118455
7653 -118455 -68531 -2207 22612 42789 -34454 -57759 -56843 -77828 -49206 -28100 -13319 -6424
7641 -6424 -57286 -93478 -54551 -53179 -61884 -29342 -57104 -131856 -159062 -110905 -111093 -106947 -79246
7628 -79246 -94145 -112827 -118840 -73820 -91261 -117811 -79788 -28391 -18218 6189 -14171 -46439
7616 -46439 -53491 -80897 -108634 -89234 -60693 -21086 -38932 -62139 -69411 -81393 -48355 35377
7604 35377 91062 28414 25063 92492 60447 15838 13597 12620 45720 68812 44811 44674 68645
$$ packed form
7690A57948m1802r953n981j5554j5819K0424L1362K8431m9380l9515N344q133
7678E7372n8983o760J5546J1732L0124M8766N957n7286o8673q0726J3378N625
7666h3928K4770k0044p066J440M3124j5510L871K5244J9526m3654J347l1534l6041
7653a18455M9924O6324K4819K0177p7243k3305R16k0985K8622K1106J4781O895
7641f424n0862l6192L8927J372q705L2542k7762p4752k7206M8157j88M146K7701
7628g9246j4899j8682o013M5020j7441k6550L8023N1397J0173K4407k0360l2268
7616d6439p052k7406k7737J9400K8541L9607j7846k3207p272j1982L3038Q3732
7604C5377N5685o2648l351O7429l2045m4609k241r77L3100K3092k4001j37K3971
$$ plain form
7591 68645 50979 8678 -60301 -63698 -58597 -75101 -89628 -52720 -31429 -50605 -50134 -59855 -54357
7578 -54357 -52295 -96123 -113294 -120751 -75587 -38937 -15447 -46429 -76915 -57453 -92604 -128457
7566 -128457 -105176 -59327 -52587 -46773 6899 -5366 -33614 -47375 -62069 -69553 -104196 -102480
7554 -102480 -72220 -63986 -53591 -71141 -70934 -86457 -92708 -40841 5313 1213 -38963 -59020 -66236
7541 -66236 -56844 -48144 -75627 -119671 -144550 -115454 -84229 -20915 41674 44625 -34819 -31162 -22094
7528 -22094 -6297 40535 38900 16639 -45480 -68211 -30717 -13775 -1283 14 19291 32752
7516 32752 3707 -22437 9953 -1693 1341 9269 -71826 -64906 -52450 -35590 -86892 -131684
7504 -131684 -124715 -106195 -98347 -57990 27093 50790 -13734 -76873 -69333 -75031 -104959 -102086 -65930
$$ packed form
7591F8645j7666m2301o8979l397N101j6504j4527L6908K1291j9176M71r721N498
7578e4357K062m3828j7171p457M5164L6650K3490l0982l0486J9462l5151l5853
7566a28457K3281M5849O740N814N3672j2265k8248j3761j4694p484l4643J716
7554a02480L0260Q234J0395j7550K07j5523o251N1867M6154m100m0176k0057p216
7541f6236R392Q700k7483m4044k4879K9096L1225O3314O2589K951p9444L657R068
7528b2094J5797M6832j635k2261o2119k2731L7494J6942J2492J297J9277J3461
7516C2752k9045k6144L2390j1646L034P928q1095O920J2456J6860n1302m4792
7504a31684O969J8520P848M0357Q5083K3697o4524o3139P540n698k9928K873L6156
$$ plain form
7491 -65930 -25361 17842 -217 -31856 -80740 -75051 -99438 -81949 -90021 -132524 -101304 -73583
7479 -73583 -65704 -18824 -11250 -40056 -13772 -36007 -5364 25414 29396 -8077 -17271 -53900 -117616
7466 -117616 -115899 -79885 -84467 -74251 -72062 -56405 -25155 65511 67770 15292 -38179 -20069
7454 -20069 -6047 21201 32039 -43545 -91968 -96089 -103998 -62717 -37598 -44497 -65997 -78202
7442 -78202 -47520 -30820 -20816 -24907 -60872 -61478 -35957 -33916 -5002 19730 5630 -31701 -78107
7429 -78107 -96518 -100348 -136517 -115943 -101349 -86871 -89296 -62793 -50382 -39775 -29094 -8567
7417 -8567 -11523 -80348 -93738 -66800 -67590 -87813 -70755 -5856 10915 -41877 -29931 45253 61913
7404 61913 86593 52299 5225 -14718 -24794 -37166 7427 14647 -23008 -31715 -89209 -86473
$$ packed form
7491f5930M0569M3203j8059l1639m8884N689k4387J7489q072m2503L1220K7721
7479g3583P879M6880P574k8806K6284k2235L0643L0778L982l7473r194l6629o3716
7466a17616J717L6014m582J0216K189J5657L1250R0666K259n2478n3471J8110
7454b0069J4022K7248J0838p5584m8423m121p909M1281K5119o899k1500j2205
7442g8202L0682J6700J0004m091l5965o06K5521K041K8914K4732j4100l7331m6406
7429g8107j8411l830l6169K0574J4594J4478k425K6503J2411J0607J0681K0527
7417h567k956o8825j3390K6938p90k0223J7058O4899J6771n2792J1946P5184J6660
7404F1913K4680l4294m7074j9943j0076j2372M4593P220l7655q707n7494K736
$$ plain form
7392 -86473 -107248 -86413 -30768 16287 5364 -30095 -15932 -30767 -22402 -12989 2065 -41383
7380 -41383 -44312 -44288 -42248 -4144 -5191 -48623 -136704 -136672 -135070 -161170 -131065 -55772 -31584 -25808
7366 -25808 -23650 -47807 -32562 35322 71507 15735 -6322 -26110 -34019 -14197 -9822 -46345
7354 -46345 -89124 -58900 -38041 -79831 -115457 -28316 -14581 -49041 -62639 -73513 -69765 -148909
7342 -148909 -138476 -56798 -6991 -76572 -112959 -112582 -58203 -36837 -63320 -79077 -38559 -28709
7330 -28709 -8619 7377 -9371 -57109 -86097 -72646 -57049 -32684 -86649 -103359 -81720 -50322
7318 -50322 4311 21287 14212 -1277 -20584 -67234 -91301 -23459 22271 37512 20059 -5895
7306 -5895 -76330 -144545 -99426 -77956 -54986 -40392 -64919 -113076 -141871 -111695 -126540 -92904
$$ packed form
7392h6473k0775K0835N5645M7055j0923l5459J4163j4835Q365R413J5054m3448
7380d1383k929K4K040L8104j047m3432q8081L2J602k6100L0105P5293K4188N776
7366b5808K158k4157J5245O7884L6185n5772k2057j9788p909J9822M375l6523
7354d6345m2779L0224K0859m1790l5626Q7141J3735l4460j3598j0874L748p9144
7342a48909J0433Q1678M9807o9581l6387L77N4379K1366k6483j5757M0518R850
7330b8709K0090J5996j6748m7738k8988J3451J5597K4365n3965j6710K1639L1398
7318e0322N4633J6976p075j5489j9307m6650k4067O7842M5730J5241j7453k5954
7306e895p0435o8215M5119K1470K2970J4594k4527m8157k8795L0176j4845L3636
$$ plain form
7294 -92904 -92939 -104050 -42630 25083 -8527 -51162 -68826 -76071 -102616 -53939 -25166 -47734 -17347
7281 -17347 7710 14306 32915 37465 6346 -12653 -46684 -78842 -24674 23357 33486 -3056
7269 -3056 -39492 -38757 -20666 -38611 -89555 -68768 -18322 10288 -8515 -19618 -70699 -64478 3858
7256 3858 621 8452 21040 32479 45599 17595 54591 -5966 -68037 -91672 -18760 -19390 -2789
7243 -2789 30469 20027 -23249 -87637 -95351 -82747 -60896 -40401 -53121 -68387 -51826 -22232
7231 -22232 -34541 -58653 -75609 -67553 -11410 -31559 -136364 -198590 -158106 -136546 -107125 -69625
7219 -69625 -40293 -36015 -18994 28268 43801 22511 -5840 10973 64046 -44 -24429 -5690
7207 -5690 -68303 -176783 -167062 -162599 -191212 -174554 -187429 -189350 -168928 -166072 -103712 -36010 30917
$$ packed form
7294i2904l5j1111O1420O7713l3610m2635j7664p245k6545M8677K8773k2568L0387
7281a7347K5057O596J8609M550l1119j8999l4031l2158N4168M8031J0129l6542
7269c056l6436P35J8091j7945n0944K0787N0446K8610j8803j1103n1081O221O8336
7256C858l237P831J2588J1439J3120k8004L6996o0557o2071k3635P2912o30J6601
7243b789L3258j0442m3276o4388p714J2604K1851K0495j2720j5266J6561K9594
7231b2232j2309k4112j6956Q056N6143k0149j04805o2226M0484K1560K9421L7500
7219f9625K9332M278J7021M7262J5533k1290k8351J6813N3073o4090k4385J8739
7207e690o2613j08480R721M463k8613J6658j2875j921K0422K856O2360O7702O6927
$$ plain form
7194 30917 59762 19204 -55723 -133034 -133466 -129835 -148848 -143485 -101216 -130574 -99422 -80049 -8813
7181 -8813 27380 23823 285 -18205 -3849 4011 -20775 -10882 -8000 47328 43400 56095 104954
7168 104954 125659 43961 7954 17092 -4958 -27077 -30858 -44753 -79520 -87383 -111950 -54007
7156 -54007 -9899 -72436 -105081 -81557 -88960 -95640 -119641 -86562 -20684 -18828 5256 29291
7144 29291 -39072 -111652 -44984 15755 -22696 3817 -16573 -83093 -53436 -71847 -40010 -18787
7132 -18787 31901 32382 -8498 -17642 -43781 -65365 -74256 -71044 -42550 -73442 -85740 -66789 -133535
7119 -133535 -146292 -146619 -103752 -62437 -63872 -93242 -139433 -123794 -99251 -95219 -20307 -32176
7107 -32176 -16163 4871 -13338 35297 48387 11614 -15840 22552 10450 -18012 10889 54265
$$ packed form
7194C0917K8845m0558p4927p7311m32L631j9013N363M2269k9358L1152J9373P1236
7181h813L6193l557k3538j8490J4356P860k4786R893K882N5328l928J2695M8859
7168A04954K0705q1698l6007R138k2050k2119l781j3895l4767p863k4567N7943
7156e4007M4108o2537l2645K3524p403o680k4001L3079O5878J856K4084K4035
7144B9291o8363p2580O6668O0739l8451K6513k0390o6520K9657j8411L1837K1223
7132a8787N0688M81m0880r144k6139k1584q891L212K8494l0892j2298J8951o6746
7119a33535j2757l27M2867M1315j435k9370m6191J5639K4543M032P4912j1869
7107c2176J6013K1034j8209M8635J3090l6773k7454L8392j2102k8462K8901M3376
$$ plain form
7095 54265 31310 19042 -50132 -150050 -162711 -135209 -98860 -87531 -81740 -81911 -66795 -62818 -64103
7082 -64103 -89076 -107380 -90459 -69370 -56105 -108163 -104569 -10468 -20593 -51295 -66938 -82219
7070 -82219 -91067 -76675 -51067 -17088 -9496 -36644 -58406 -55672 -46577 -50551 -26521 -15618 -37244
7057 -37244 -46644 -98210 -76818 -101497 -93179 -66669 -34486 -45623 9271 24351 17972 1545
7045 1545 21718 -12688 -30472 -51362 -71087 -77133 -45019 -27977 -7359 -12865 -23412 -47761
7033 -47761 -68022 -106980 -113058 -73335 -49763 -42005 -31381 -15824 -39752 -21142 -89408 -107824
7021 -107824 -62429 -50646 -43639 -20089 -27166 -32799 -43040 -24631 -59033 -64409 -48021 -17168
7009 -17168 -7206 -37211 -86580 -55595 12020 34218 32225 2593 -37084 -88206 -64919 -15001
$$ packed form
7095E4265k2955j2268o9174r9918j2661K7502L6349J1329N791j71J5116L977j285
7082f4103k4973j8304J6921K1089J3265n2058L594R4101j0125l0702j5643j5281
7070h2219q848J4392K5608L3979P592k7148k1762K734R095l974K4030J0903k1626
7057c7244r400n1566K1392k4679Q318K6510L2183j1137N4894J5080o379j6427
7045A545K0173l4406j7784k0890j9725o046L2114J7042K0618n506j0547k4349
7033d7761k0261l8958o078L9723K3572P758J0624J5557k3928J8610o8266j8416
7021a07824M5395J1783P007K3550p077n633j0241J8409l4402n376J6388L0853
7009a7168R962l0005m9369L0985O7615K2198j993k9632l9677n1122K3287M9918
$$ plain form
6997 -15001 -2846 -14121 -10778 11783 -2546 -25722 -11386 -36254 -58815 -28907 -8471 -66611
6985 -66611 -100723 -71493 -33249 -33877 -43968 -33002 -46845 -71131 -92005 -63794 -44657 -41309
6973 -41309 -32959 24448 47177 30818 -14235 -76737 -121573 -100314 -30095 -51212 -35482 -22710
6961 -22710 -17829 -15966 -8305 -23746 -12220 -27684 -29232 -36578 -72562 -41371 -63586 -115738 -123207
6948 -123207 -82207 -89950 -85635 -20122 -2311 -32485 -26002 -39213 -79287 -82990 -103431 -103729 -16512
6935 -16512 1592 33357 35667 43789 -9166 -49362 -44355 12485 57687 11368 20087 2967 41519
6922 41519 21547 -14801 44426 80061 58474 -10948 -47512 -34471 23604 70183 47818 2662
6910 2662 -20738 -12619 -6894 -60319 -44600 -31217 -16867 -27779 -66048 -63266 -50889 -23102 67233
$$ packed form
6997a5001J2155j1275L343K2561j4329k3176J4336k4868k2561K9908K0436n8140
6985f6611l4112K9230L8244o28j0091J0966j3843k4286k0874K8211J9137L348
6973d1309Q350N7407K2729j6359m5053o2502m4836K1259P0219k1117J5730J2772
6961b2710M881J863P661j5441J1526j5464j548p346l5984L1191k2215n2152p469
6948a23207M1000p743M315O5513J7811l0174O483j3211m0074l703k0441k98Q7217
6935a6512J8104L1765K310Q122n2955m0196N007N6840M5202m6319Q719j7120L8552
6922D1519j9972l6348N9227L5635k1587o9422l6564J3041N8075M6579k2365m5156
6910B662k3400Q119N725n3425J5719J3383J4350j0912l8269K782J2377K7787R0335
$$ plain form
6897 67233 72867 70971 63359 -2765 -45510 -44002 15758 27954 -25400 -9208 -28582 11863 -7607
6884 -7607 20756 7358 41391 61816 25530 -38817 -56084 -74510 -83257 -33120 63672 48452
6872 48452 -7579 -45197 -50884 -19380 -76599 -50980 -11395 -47732 -78860 -121795 -100640 -45752
6860 -45752 -21050 -47909 -45725 -87285 -151371 -124161 -170033 -160577 -127926 -93197 -95666 -59709
6848 -59709 8726 1529 5579 -8248 -69735 -4277 -8836 -37788 -60564 -51289 -21724 -46158 -43681
6835 -43681 -71823 -83830 -67346 -30769 -44249 -127043 -160174 -143832 -108074 -31079 -40674 -12684
6823 -12684 7138 -2968 -45652 -27824 -186 -45087 -80463 -84904 -28962 -18874 -20440 -18610
6811 -18610 -32758 -28143 -21355 -5092 -9533 -20223 -92281 -95702 -66607 -57388 -61059 -80077 -77497
$$ packed form
6897F7233N634j896p612o6124m2745J508N9760J2196n3354J6192j9374M0445j9470
6884g607K8363j3398L4033K0425l6286o4347j7267j8426q747N0137R6792j5220
6872D8452n6031l7618n687L1504n7219K5619L9585l6337l1128m2935K1155N4888
6860d5752K4702k6859K184m1560o4086K7210m5872R456L2651L4729k469L5957
6848e9709O8435p197M050j3827o1487O5458m559k8952k2776R275K9565k4434K477
6835d3681k8142j2007J6484L6577j3480q2794l3131J6342L5758P6995r595K7990
6823a2684J9822j0106m2684J7828K7638m4901l5376m441N5942J0088j566J830
6811a8610j4148M615O788J6263m441j0690p2058l421K9095R219l671j9018K580
$$ plain form
6798 -77497 -57194 -22737 -22491 -14883 -4539 16503 31473 -37157 -84403 -104562 -126258 -110687
6786 -110687 -87048 6480 -19054 -85631 -43900 -68184 -44985 -48722 -41333 -40762 -101559 -97340 -71494
6773 -71494 -89529 -56610 -53555 -49458 -42095 27634 16246 -24516 -6688 36260 2284 -94195
6761 -94195 -74709 -9590 38390 17660 7416 982 -17159 -53327 -24692 -407 -7544 -14856
6749 -14856 -78292 -22908 32397 21956 42536 58674 2513 -38560 -23579 -21479 -951 24442
6737 24442 35167 40308 33666 66207 56740 -17262 -45436 8758 30906 8733 11456 34365 89084
6724 89084 49827 -26438 -31260 -41516 -66785 -110168 -102173 -86699 -97196 -97282 -81019 -83962 -74582
6711 -74582 -28434 -40895 -77544 -88244 -84292 -85706 -120878 -110928 -68118 -26970 8676 17773 -893
$$ packed form
6798g7497K0303L4457K46P608J0344K1042J4970o8630m7246k0159k1696J5571
6786a10687K3639R3528k5534o6577M1731k4284K3199l737P389N71o0797M219K5846
6773g1494j8035L2919L055M097P363O9729j1388m0762J7828M2948l3976r6479
6761i4195J9486O5119M7980k0730j0244o434j8141l6168K8635K4285p137p312
6749a4856o3436N5384N5305j0441K0580J6138n6161m1073J4981K100K0528K5393
6737B4442J0725N141o642L2541r467p4002k8174N4194K2148k2173K723K2909N4719
6724H9084l9257p6265m822j0256k5269m3383P995J5474j0497q6J6263k943R380
6711g4582M6148j2461l6649j0700L952j414l5172R950M2810M1148L5646R097j8666
$$ plain form
6698 -893 -47752 -90829 -109075 -85228 -25001 3805 229 13191 -42825 -58409 -44438 -39364 -8702
6685 -8702 50118 12963 20937 28002 63410 18957 -56598 -72385 -55687 -48427 -70067 -53241 -74112
6672 -74112 -33749 123 47249 78796 46078 -3260 -13088 -45626 -65534 -47832 -40413 -38317
6660 -38317 -26472 -76351 -61391 -44244 -64207 -82428 -70161 -42708 -37804 -47070 -55920 -66148
6648 -66148 -77306 -127905 -154017 -147311 -96510 -53030 -26115 -35109 -73647 -56279 -23846 -15415
6636 -15415 19249 2552 -6405 -4131 12508 -42148 -41319 1551 17734 16068 -26172 -3158 7575
6623 7575 -23359 -52962 -97306 -114820 -88256 -45907 4330 -45273 -65842 -40381 -40981 -25090
6611 -25090 -5535 19859 29864 59469 76553 16604 334 35458 17433 5826 -29983 -362
$$ packed form
6698h93m6859m3077j8246K3847O0227K8806l576J2962n6016j5584J3971N074L0662
6685h702N8820l7155P974P065L5408m4453p5555j5787J6698P260k1640J6826k0871
6672g4112M0363L3872M7126L1547l2718m9338r828l2538j9908J7702P419K096
6660c8317J1845m9879J4960J7147j9963j8221J2267K7453M904r266q850j0228
6648f6148j1158n0599k6112O706N0801M3480K6915q994l8538J7368L2433Q431
6636a5415L4664j6697q957K274J6639n4656Q29M2870J6183j666m2240K3014J0733
6623G575l0934k9603m4344j7514K6564M2349N0237m9603k0569K5461o00J5891
6611b5090J9555K5394J0005K9605J7084n9949j6270L5124j8025j1607l5809K9621
$$ [...]
##END NTUPLES=NMR SPECTRUM
##END=
